##TITLE=Analysis number 307703
Compound Code aw 00938
Book Reference 259/178/7
Project Code adrs
Chemist Name emmab
##JCAMPDX= 6.0         $$ Bruker NMR JCAMP-DX V2.0
##DATA TYPE= NMR SPECTRUM
##DATA CLASS= NTUPLES
##ORIGIN= Bruker BioSpin GmbH
##OWNER= NMR
$$ XWIN-NMR		Version 3.5
$$ Tue May 10 10:31:44 2005 GMT Daylight Time (UT+1h)  MAYBRIDGE\NMR@NMR_250MHZ
##.OBSERVE FREQUENCY= 250.131544655141
##.OBSERVE NUCLEUS= ^1H
##.ACQUISITION MODE= SIMULTANEOUS (DQD)
##.ACQUISITION SCHEME= undefined
##.AVERAGES= 16
##.DIGITISER RES= 18
##SPECTROMETER/DATA SYSTEM= dpx250
##.PULSE SEQUENCE= zg30
##.SOLVENT NAME= CDCl3
##.SHIFT REFERENCE= (INTERNAL, CDCl3, 0, 16.522)
##AUDIT TRAIL= $$ (NUMBER, WHEN, WHO, WHERE, WHAT)
$$ ##TITLE= Audit trail, XWIN-NMR		Version 3.5
$$ ##JCAMPDX= 5.01
$$ ##ORIGIN= Bruker BioSpin GmbH
$$ ##OWNER= NMR
$$ C:\u/data/dgb/nmr/ADRS/2790/pdata/1/auditp.txt
$$ ##AUDIT TRAIL=  $$ (NUMBER, WHEN, WHO, WHERE, WHAT)
(   1,<2005-05-10 10:31:27.60 +100>,<MAYBRIDGE\NMR>,<NMR_250MHZ>,
      <created by zg, POWCHK disabled, PULCHK disabled
       configuration hash MD5:
       62 19 C7 07 E1 42 D1 B7 37 6C 3D D0 77 39 F9 E6
       data hash MD5: 64K
       29 78 A3 4A 0E 0F 9D 20 F6 73 E7 A9 D9 39 00 14>)
(   2,<2005-05-10 10:31:37.82 +100>,<MAYBRIDGE\NMR>,<NMR_250MHZ>,
      <Start of raw data processing
       ef LB = 0.3 FT_mod = 6 PKNL = 1 SI = 32K 
       data hash MD5: 32K
       CD 43 16 A8 36 DD 8F 70 E0 02 94 F9 FE 2A 59 73>)
(   3,<2005-05-10 10:31:39.42 +100>,<MAYBRIDGE\NMR>,<NMR_250MHZ>,
      <apk 
       data hash MD5: 32K
       1F E3 E6 02 C7 1F 53 1B 09 49 A8 0D BB F9 61 A3>)
(   4,<2005-05-10 10:31:40.21 +100>,<MAYBRIDGE\NMR>,<NMR_250MHZ>,
      <abs ABSG = 5 
       data hash MD5: 32K
       55 15 FA 40 B3 21 DD EF C1 68 1B DD 51 14 69 04>)
$$ ##END=
$$ 
$$ hash MD5
$$ F7 16 BD 36 35 DD BB CB C5 A6 1D 5B B2 C4 DE F1
##$RELAX= 
##$RELAX= 
##$RELAX= 
##$RELAX= 
##$RELAX= 
##$RELAX= 
##$RELAX= 
$$ Bruker specific parameters
$$ --------------------------
##$DU= <C:\u>
##$EXPNO= 2790
##$NAME= <ADRS>
##$PROCNO= 1
##$TYPE= <nmr>
##$USER= <dgb>
##$AMP= (0..31)
100 100 100 100 100 100 100 100 100 100 100 100 100 100 100 100 100 100 
100 100 100 100 100 100 100 100 100 100 100 100 100 100 
##$AQSEQ= 0
##$AQ_mod= 3
##$AUNM= <au_zg>
##$AUTOPOS= <9 >
##$BF1= 250.13
##$BF2= 250.13
##$BF3= 250.13
##$BF4= 250.13
##$BF5= 500.13
##$BF6= 500.13
##$BF7= 500.13
##$BF8= 500.13
##$BYTORDA= 1
##$CFDGTYP= 0
##$CFRGTYP= 5
##$CHEMSTR= <none>
##$CNST= (0..31)
1 1 145 1 1 1 1 1 1 1 1 1 1 1 1 1 1 1 1 1 1 1 1 1 1 1 1 1 1 1 1 1 
##$CPDPRG= <>
##$CPDPRG1= <>
##$CPDPRG2= <>
##$CPDPRG3= <>
##$CPDPRG4= <mlev>
##$CPDPRG5= <mlev>
##$CPDPRG6= <mlev>
##$CPDPRG7= <mlev>
##$CPDPRG8= <mlev>
##$CPDPRGB= <>
##$CPDPRGT= <>
##$D= (0..31)
0 1 0 0 0 0 0 0 0 0.06 0 0 0 0 0 0 0.0002 0 0 0 0 0 0 0 0 0 0 0 0 0 0 
0 
##$DATE= 1115717486
##$DBL= (0..7)
120 120 120 120 120 120 120 120 
##$DBP= (0..7)
150 150 150 150 150 150 150 150 
##$DBP07= 0
##$DBPNAM0= <>
##$DBPNAM1= <>
$$ [...]
##$SUBNAM7= <"">
##$SUBNAM8= <"">
##$SUBNAM9= <"">
##$SW= 20.6930455092707
##$SWIBOX= (0..15)
0 0 3 0 0 0 0 0 0 0 0 0 0 0 0 0 
##$SW_h= 5175.983436853
##$TD= 65536
##$TD0= 1
##$TE= 295.16
##$TE2= 300
##$TE3= 300
##$TEG= 300
##$TL= (0..7)
0 120 120 120 120 120 120 120 
##$TP= (0..7)
150 150 150 150 150 150 150 150 
##$TP07= 0
##$TPNAME0= <>
##$TPNAME1= <>
##$TPNAME2= <>
##$TPNAME3= <>
##$TPNAME4= <>
##$TPNAME5= <>
##$TPNAME6= <>
##$TPNAME7= <>
##$TPOAL= (0..7)
0.5 0.5 0.5 0.5 0.5 0.5 0.5 0.5 
##$TPOFFS= (0..7)
0 0 0 0 0 0 0 0 
##$TUNHIN= 0
##$TUNHOUT= 0
##$TUNXOUT= 0
##$USERA1= <user>
##$USERA2= <user>
##$USERA3= <user>
##$USERA4= <user>
##$USERA5= <user>
##$V9= 5
##$VALIST= <valist>
##$VCLIST= <CCCCCCCCCCCCCCC>
##$VD= 0
##$VDLIST= <DDDDDDDDDDDDDDD>
##$VPLIST= <PPPPPPPPPPPPPPP>
##$VTLIST= <TTTTTTTTTTTTTTT>
##$WBST= 1024
##$WBSW= 4
##$XGAIN= (0..3)
0 0 0 0 
##$XL= 0
##$YL= 0
##$YMAX_a= 363381
##$YMIN_a= -352005
##$ZGOPTNS= <>
##$ZL1= 120
##$ZL2= 120
##$ZL3= 120
##$ZL4= 120
##$ABSF1= 16.522
##$ABSF2= -4.171173
##$ABSG= 5
##$ABSL= 3
##$ALPHA= 0
##$AQORDER= 0
##$ASSFAC= 0
##$ASSFACI= 0
##$ASSFACX= 0
##$ASSWID= 0
##$AUNMP= <proc_1d>
##$AZFE= 0.1
##$AZFW= 0.1
##$BCFW= 0
##$BC_mod= 0
##$BYTORDP= 0
##$COROFFS= 0
##$CY= 12.5
##$DATMOD= 1
##$DC= 0
##$DFILT= <>
##$DTYPP= 0
##$F1P= 14.0000005364418
##$F2P= -0.99999901652339
##$FCOR= 0.5
##$FTSIZE= 32768
##$FT_mod= 6
##$GAMMA= 0
##$GB= 0
##$INTBC= 1
##$INTSCL= 1
##$ISEN= 128
##$LB= 0.3
##$LEV0= 0
##$LPBIN= 0
##$MAXI= 10000
##$MC2= 0
##$MEAN= 0
##$ME_mod= 0
##$MI= 0
##$NCOEF= 0
##$NC_proc= -2
##$NLEV= 6
##$NOISF1= 0
##$NOISF2= 0
##$NSP= 0
##$NTH_PI= 0
##$NZP= 0
##$OFFSET= 16.522
##$PC= 1
##$PHC0= -69.88533
##$PHC1= 4.747105
##$PH_mod= 1
##$PKNL= yes
##$PPARMOD= 0
##$PSCAL= 4
##$PSIGN= 0
##$REVERSE= no
##$SF= 250.13
##$SI= 32768
##$SIGF1= 0
##$SIGF2= 0
##$SINO= 400
##$SIOLD= 32768
##$SREGLST= <1H.CDCl3>
##$SSB= 0
##$STSI= 32768
##$STSR= 0
##$SW_p= 5175.98343685301
##$SYMM= 0
##$S_DEV= 0
##$TDeff= 65536
##$TDoff= 0
##$TI= <Analysis number 999999
Compound Code 99
Book Reference 9
Project Code 9>
##$TILT= no
##$TM1= 0
##$TM2= 0
##$TOPLEV= 0
##$USERP1= <user>
##$USERP2= <user>
##$USERP3= <user>
##$USERP4= <user>
##$USERP5= <user>
##$WDW= 1
##$XDIM= 32768
##$YMAX_p= 277583091
##$YMIN_p= -57903
$$ End of Bruker specific parameters
$$ ---------------------------------
##NTUPLES= NMR SPECTRUM
##VAR_NAME=  FREQUENCY,     SPECTRUM/REAL,   SPECTRUM/IMAG
##SYMBOL=    X,             R,               I
##VAR_TYPE=  INDEPENDENT,   DEPENDENT,       DEPENDENT
##VAR_FORM=  AFFN,          ASDF,            ASDF
##VAR_DIM=   32768,         32768,           32768
##UNITS=     HZ,            ARBITRARY UNITS, ARBITRARY UNITS
##FACTOR=    0.157963299565203, 1,           1
##FIRST=     4132.6476996994, 0,             0
##LAST=      -1043.33573715361, 0,           0
##MIN=       -1043.33573715361, -57903,      0
##MAX=       4132.6476996994, 277583091,     0
$$ Real data points
##PAGE= N=1
##DATA TABLE= (X++(R..R)), XYDATA
$$ [...]
17269E5376051p801642q130867p710185p087432n749727l979220k354282r83884
17261A1578812L89089J859124K893228J912701q26404l031034l434583k702662
17253H638271j831325j260196r27706o96779m84274l40983k69293k35113j86029
17244B406573j10182k9462K7285P4466N6192M7231O7181J49438L09670N35968
17234C534360R48535J592192K661356L756874L400844J025345j475800k441794
17226A3001912j935721r05061K40201J577272L291481N086358O073710P037606
17218C3467758Q755119R514848L966535n481851j1513424j1292114q219914n364086
17210A3832871l461057k266572j507083j034018p25743m80191k49060R1537N55138
$$ plain form
17269 55376051 47574409 39443542 31733357 24645925 18896198 14916978 12562696 11578812
17261 11578812 11967901 13827025 16720253 18632954 17806550 14775516 11340933 8638271
17253 8638271 6806946 5546750 4619044 3922265 3437991 3097008 2827715 2592602 2406573
17244 2406573 2296391 2266929 2294214 2368680 2424872 2472103 2539284 2688722 2998392 3534360
17234 3534360 4482895 6075087 8736443 12493317 15894161 16919506 15443706 13001912
17226 13001912 11066191 10161130 10401331 11978603 15270084 20356442 26430152 33467758
17218 33467758 42222877 51737725 55704260 50222409 38708985 27416871 19196957 13832871
17210 13832871 10371814 8105242 6598159 5564141 4838398 4358207 4109147 4200684 4755822
17201D755822R48936P15604j77472r54412j140005r34403o43006m15446k74641
17192A880977k21788j97657j85062j59106j23730r6562p8056p0603p2402o8438
17182F07573l0537k6472j9670j2207k9792l0807l2506j9090j1230j8671r125o014
17170C61452j3395k2178j4432j4986j2944j5192q707R036N140o532n01Q413k699
17157B72475j7870j6947j6232r058N899J4608j172k2467j0249m188q802Q709m924
17144A89782k2877j367N230J2309J8859P457k1825j3802P503Q222k4996L44l172
17131A61667l54m556J1215J741n173j0688q751j3401k3295n342M405j0404n222
17118I1842J9952L391n347J17K563M479j3581n281n701q118p957P218O052K1147
$$ plain form
17201 4755822 5704758 6420362 6242890 5288478 4148473 3214070 2571064 2155618 1880977
17192 1880977 1659189 1461532 1276470 1117364 993634 897072 819016 748413 676011 607573
17182 607573 577036 550564 530894 518687 488895 458088 425582 406492 395262 376591 367466 361452
17170 361452 348057 325879 311447 296461 283517 268325 259618 268654 273794 267262 266761 275174 272475
17157 272475 254605 237658 221426 212368 218267 232875 231703 209236 198987 194799 185997 194706 189782
17144 189782 166905 165538 170768 183077 201936 209393 187568 173766 181269 189491 164495 164839 161667
17131 161667 161313 156757 167972 169713 164540 153852 145101 131700 108405 103063 107468 97064 91842
17118 91842 111794 115185 109838 109955 112518 116997 103416 98135 92434 84316 76359 83577 89629 110776
17104A10776j640m124r535j3401o776o818j85K444L147M436Q571J4175N551o890
17090I9731j2181N702j327J039j0214j0548P798J9380j9628n051K0105J4633k788
17077A06651j7451q478o703Q684M967l06p574j1956p695j464p011L226j724M430
17063E7596J6979l971k056N175M361m857l867O233n659r02J2135j4387r996Q995
17049F5779q589r272P416j1468m371R477J1494P16j559j426n457R342J1401O665
17035H0148J1324k195k0490j1827l505m184N05Q449Q825Q907q261j2945N324Q447
17021F8522J0079r728n178j0987J624J312P508J0427l059j1457q426R173K1657
17008H1467q105n589p723j8365K783J3754o635o286O193J4528k729O408J337k111
$$ plain form
17104 110776 109136 105012 95477 82076 75300 68482 68297 70741 73888 78324 86895 101070 106621 99731
17090 99731 87550 93252 91925 92964 82750 72202 80000 99380 79752 74701 94806 109439 106651
17077 106651 89200 80722 74019 82703 87670 87364 79790 67834 60139 58675 51664 54890 53166 57596
17063 57596 74575 70604 68548 73723 78084 73227 69360 75593 69934 69032 81167 66780 56784 65779
17049 65779 57190 47918 55334 43866 39495 48972 60466 61182 59623 58197 52740 62082 73483 80148
17035 80148 91472 89277 68787 56960 53455 49271 49776 58225 67050 75957 67696 54751 60075 68522
17021 68522 78601 68873 63695 52708 54332 55644 63152 73579 70520 59063 50637 59810 81467
17008 81467 73362 67773 60050 41685 44468 58222 51587 45301 51494 66022 63293 69701 71038 68927
16994F8927n985k3187n650R960O895o543j3246m830J2005n649K700J0299K804
16981D8500R834l709j1760j1559M200R109J1726p775q445N185R893M246r291k2246
16967B7908j1619K652L808k263j4973L466Q588N962P112r694j0396M561O121K422
16953B3655J3265J0382p186K11m199l184J658k705N858k0181k438N766o999N408
16939A9311M597k733L590n822j0654Q228P948J519J152P535P379l192j942j1909
16925B5007j0603p602l947j491O986L201J0632J4515R548k916N027j633l619J758
16911D4863l999M808j0683N210o981k472J3498O949j2253R164O144k2692q441
16898B3115l284m930j2701R003J2601M358n798p572K191j654R57P45k960j1600
$$ plain form
16994 68927 62942 39755 34105 44065 50960 44417 31171 26341 38346 32697 35397 45696 48500
16981 48500 58334 54625 42865 31306 35506 44615 56341 48566 40121 45306 55199 59445 50154 27908
16967 27908 16289 18941 22749 20486 5513 8979 17567 23529 30641 20947 10551 15112 21233 23655
16953 23655 36920 47302 40116 40327 36128 32944 34602 31897 37755 17574 15136 20902 13903 19311
16939 19311 23908 21175 24765 18943 8289 16517 24465 25984 27136 34671 42050 38858 36916 25007
16925 25007 14404 6802 2855 1364 8350 11551 22183 36698 46246 43330 48357 46724 43105 44863
16911 44863 40864 45672 34989 40199 33218 30746 44244 51193 38940 48104 54248 31556 23115
16898 23115 19831 14901 2200 11203 23804 28162 22364 14792 16983 15329 16286 17031 14071 2471
16884B471j80O094n011K341p417M392J0683K612r63l407J5352Q849j4825L284
16870B4275J2673N621q035m698N273K0041Q862j9212j2044q870k266N78K075R48
16856B5221o293j763J755j093R70r709o139J549r710k077K79J6158L55p435L14
16841B382J45Q818N543J0949O40l629m685j1744M069J3332L995j2294l026P566
16827B2061k700P151o608j5238n204J8128M066J0323k584n738J4518P36m588j5430
16813A8893p207j1467M124J1425M531Q187J062P817k031j1480M852j3611l964
16800A1131M676j048j999N754N847L407O348m944n470J4033N441J899J7290J1963
16786G4328P476J61J6516K1202L2501J5776M004k298l575O848j3736j5238j1434
$$ plain form
16884 2471 2291 8385 3374 5715 -1702 2690 13373 15985 15022 11615 26967 35816 20991 24275
16870 24275 36948 42569 34534 29836 35109 55150 64012 44800 32756 23886 21620 22198 24273 25221
16856 25221 18928 17165 18920 17827 18797 9088 2949 4498 -5212 -7289 -7010 9148 9503 2068 2382
16841 2382 2527 11345 16888 27837 28477 24848 20163 8419 12488 25820 29815 17521 14495 22061
16827 22061 19361 26512 19904 4666 -538 17590 21656 31979 29395 23657 38175 38911 34323 18893
16813 18893 11686 219 4343 15768 20299 28486 29548 37365 35334 23854 28706 15095 11131
16800 11131 15807 14759 12760 18514 24361 27768 34116 29172 23702 37735 43176 45075 62365 74328
16786 74328 81804 81965 98481 119683 152184 167960 171964 169666 166091 172939 159203 143965 132531
16773A32531q985j2342k885P060J8739K4332J7079J9167j8663k3629m6242l4522
16761G1640j0676p245k873j357m908k686n863O923l737Q851K6658N056l3034r661
16747C7088L102k257j0437P382j2007j5971J589k949J7746J3283L871Q25J4674
16734E5939J7384K1024K5977J0316r219p098P340J1715K9234N936q086j2323k8910
16721A19229k4941j9509j6787l741j425M867J5679J6392K618O918K9687M1957
16709A70944Q683o136k9425l6933k3904k0900j4861j2239j4548j9201p061L1466
16697B5885P196K786p679j1535j0653K01l49L798K199K741N167J073m25K734j4867
16682H272j0896J2133K0090M121k0533j215K583O858o483o408j171l318j4795
$$ plain form
16773 132531 123546 111204 108319 115379 134118 158450 175529 194696 176033 152404 106162 71640
16761 71640 60964 53719 50846 49489 44581 41895 36032 42955 39218 48069 74727 79783 46749 37088
16747 37088 40190 37933 27496 34878 22871 6900 8489 5540 23286 36569 40440 41265 55939
16734 55939 73323 94347 120324 130640 121421 114323 121663 133378 162612 168548 160462 148139 119229
16721 119229 94288 74779 57992 54251 52826 57693 73372 89764 92382 99300 128987 170944
16709 170944 179627 173491 144066 107133 83229 62329 47468 35229 20681 1480 -5581 25885
16697 25885 33081 35867 28188 16653 6000 6201 5852 9650 11849 14590 19757 20830 20405 23139 8272
16682 8272 -2624 9509 29599 33720 13187 11972 14555 21413 14930 8522 7351 4033 -10762
16669a0762K779K0600K0578M036j8430j6138N817J6018J1159k243o776J685k085
16656B6238N945k440J1875M207m788Q193l149n779k0428j1270j0313l655P973
16643B609p028O720K203M473J1291J0719K605j4929k1320P863J2311J3493Q6n449
16629B5647q629J1643L323n497m566q000Q511P177K423k1642o789P88M213k166
16615F436j753n595J5897j744r211P076J1643j2207o753j0924J912M949P508k858
16601D376p777J0031m79n341J3338K817m554L406p434p116r256J7285J0342k865
16587A6773O255o426k5656m874K364n782N877j324L143J766J1334J0946J7942
16574C2338o173m178j1861l069N571j15k055m722J6389L669j7989l449q761R759
$$ plain form
16669 -10762 -7983 12617 33195 37231 18801 2663 8480 24498 35657 33414 26638 28323 26238
16656 26238 32183 29743 41618 45825 41037 49230 46081 40302 19874 8604 -1709 -5364 2609
16643 2609 -4419 2301 4504 8977 20268 30987 33592 18663 -2657 5206 17517 31010 31096 25647
16629 25647 17018 28661 31984 26487 21921 13921 22432 29609 32032 10390 3601 4389 8602 6436
16615 6436 4683 -912 14985 13241 4030 11106 22749 10542 3789 -7135 -5223 -274 7234 4376
16601 4376 -3401 6630 6151 810 14148 16965 12411 15817 8383 1267 -7989 9296 19638 16773
16587 16773 23028 16602 -9054 -13928 -11564 -17346 -11469 -12793 -9650 -7884 3450 14396 32338
16574 32338 26165 21987 10126 7057 12628 12513 10458 5736 22125 25794 7805 4356 -4405 5354
16560E354j0859O683Q261J2501j3634q891J568l157J2442P364r383R535K59R15
16546A8958o588j6086p878J9563K022q295M218J2129m15p968j2990N813J8117
16533B0600K0388N934r259k0786j5606P492j2389j205k107o044J414L514l877
16520a1931O36j425n201J287M245J0947M853P108N720J0578o231o114l468M658
16506A5662J0201n00j4136n817l190M380j935p377j3078j256J3569m991n921K133
16492a2256J0122Q313J2580P193P57j0006j1486Q122N764k723k686j0263O78J1079
16478A5188M992r779q561l922j008J294N87K74m615M043J3077q115p045l870q934
16463a6394l136P180p38K781j663j417P907k130r909P862J9747J1071J946j3655
$$ plain form
16560 5354 -5505 1178 9439 21940 8306 -585 983 -2174 10268 17632 8249 17784 18043 18958
16546 18958 12370 -3716 -11594 7969 9991 1696 5914 18043 17628 9660 -3330 2483 20600
16533 20600 40988 46922 37663 16877 1271 8763 -3626 -4831 -6938 -12982 -11568 -8054 -11931
16520 -11931 -11295 -12720 -17921 -16634 -12389 -1442 3411 10519 16239 26817 20586 14472 11004 15662
16506 15662 25863 25363 11227 5410 2220 6600 4665 -2712 -15790 -17046 -3477 -8468 -14389 -12256
16492 -12256 -2134 6179 18759 25952 26709 16703 5217 13339 19103 16380 13694 3431 4109 15188
16478 15188 20180 10401 1840 -2082 -3090 -1796 -1209 -935 -5550 -1507 11570 3455 -3590 -7460 -16394
16463 -16394 -19530 -12350 -13088 -10307 -11970 -13387 -5480 -7610 -17519 -9657 10090 21161 23107 9452
16449I452J299m523n126J0365P883J4294n358k4342j2676K195J0662R006j0442
16436B689O87o74k102N20P56L3P980N752j0164j2932J800K248J6332O173k021
16421A7077j1092p203m444p485j0062N509j811k56P787K1064p678L89m900M374
16407A269k128Q793J6197q078j5950l484J0891M840j2116j0554j446K896n45J427
16393g988J0576o784l966k605k364n941O491J8849K475P107o572k2551r702L791
16379a9184J4423k003q99n883K271J3158J4355p096l390Q789k594J442J4003j7135
16365A0257j5474K092M56l010m611j677J1235L75O482L876j1696l014J605K730
16351c74J5328R460l1102j7199K980O321M92l550L462L596J4614J7020J1790p905
$$ plain form
16449 9452 10751 6228 1102 11467 19350 33644 28286 3944 -8732 -6537 4125 13131 2689
16436 2689 3376 2702 600 1120 1876 1909 9889 15641 5477 -7455 -5655 -3407 12925 19098 17077
16421 17077 5985 -1218 -5662 -13147 -23209 -17700 -19511 -19767 -11980 9084 1406 1795 -3105 1269
16407 1269 -859 7934 24131 16053 103 -3381 7510 12350 234 -10320 -11766 -8870 -9415 -7988
16393 -7988 2588 -4196 -8162 -10767 -13131 -19072 -12581 6268 8743 15850 9278 -13273 -22975 -19184
16379 -19184 -4761 -6764 -7663 -13546 -11275 1883 16238 9142 5752 14541 11947 13389 27392 10257
16365 10257 -5217 -3125 -2669 -5679 -10290 -11967 -732 -357 6125 10001 -1695 -4709 -3104 -374
16351 -374 14954 24414 -6688 -23887 -20907 -14586 -14094 -17644 -14182 -10586 4028 21048 32838 24933
16337B4933k4006k1768L651j235K647p96Q934L217R258Q853p787k114k122l972
16323b307k836J0309o593m079L250O14O76m364P921k657j635q464o165J7334M860
16308E864P689P895J1732n700j25K227%j411o045q448j1882r122K517Q288k980
16293D99o442R465J067o899L268J6689m737k332M593J157j5800R484R796R815
16279B9623J4300K211j4991l899N026n915o693M643Q010Q967j1423j7063n562
16266G234J5383R441j416j920K907k2614m861J1143J503j2636M821N542l816o824
16252C887j139k015Q796l587p096J564J7295R46j7197r391N883Q08N560K900j1405
16237d191m436o42J095j850J6011J64O233M074j1663j0392l119O174R248O918
$$ plain form
16337 24933 927 -20841 -17190 -18425 -15778 -16574 -7640 -4423 4835 13688 5901 3787 1665 -2307
16323 -2307 -5143 5166 -1427 -5506 -2256 -1642 -966 -5330 2591 -66 -1701 -10165 -16330 1004 5864
16308 5864 13553 21448 33180 27480 27355 29582 29582 28171 22126 13678 1796 -7326 -4809 3479 499
16293 499 -5943 3522 4589 -2310 958 17647 12910 10578 15171 16328 528 10012 19808 29623
16279 29623 43923 46134 31143 27244 32270 26355 19662 24305 32315 41282 29859 12796 7234
16266 7234 22617 32058 30642 28722 31629 9015 4154 15297 16800 4164 8985 14527 10711 3887
16252 3887 2748 733 9529 5942 -1154 410 17705 18651 1454 -7937 -2054 -1246 4314 7214 -4191
16237 -4191 -8627 -9269 -8174 -10024 5987 6151 12384 16458 4795 -5597 -8716 -2542 6706 13624
16223A3624j227j2739J4701J0919K937j6634j4491p391j0266l263M823O063l517
16210a6461L120O157r012l301J1919Q229K3068P549j3353j4267q47M248m54k30
16196F365R975j4443K840Q589J827j1327o199O595O096J2377P316P138k2227l343
16182A1579p783j4751N285P001n519J0829J7658m832J754P887J1132n179P80n449
16168C0392j640L724l357j0639q397m414M173J8391J2418j1815q438j6931p822
16155d355r299L813R74p300O022M60L54J589o436l699q844O54j590K515K06K2414
16139b522J197l666M410M614m218l687r445n419J622p154J6921Q769j2530l75
16125a1483N644L473q605J813q122j773M231R225j342K425P383M891m2J112j4611
$$ plain form
16223 13624 12397 -342 14359 25278 28215 11581 -2910 -10301 -20567 -23830 -19007 -12944 -16461
16210 -16461 -13341 -7184 -16196 -19497 -7578 651 23719 31268 17915 3648 2801 7049 6595 6365
16196 6365 16340 1897 4737 13326 15153 3826 -2373 4222 10318 22695 30011 37149 14922 11579
16182 11579 3796 -10955 -5670 1331 -4188 6641 24299 19467 21221 29108 40240 35061 35841 30392
16168 30392 28752 32476 29119 18480 10083 5669 9842 28233 40651 28836 20398 3467 -4355
16155 -4355 -13654 -9841 -8867 -16167 -10145 -9685 -9331 -7742 -14178 -17877 -26721 -26067 -27657 -25142 -24936 -2522
16139 -2522 -1325 -4991 -581 4033 -185 -3872 -13317 -18736 -17114 -24268 -7347 1422 -11108 -11483
16125 -11483 -5839 -2366 -10971 -9158 -17280 -19053 -14822 -5597 -6939 -4514 2869 7760 7718 8830 -5781
16110e781L706M466Q100o244j4195L92k216n214L584J0464J755J1010R864k499
16096A7192j383j1886j3666J3401R637l286J1030J228p909j5391j3662j0844p55
16083b6294J4513J4590l398m8L379q508o035L358p635O207L568k946L644L950
16069a655O335q410p124k7665M439L1332P556k753L621q470J624J7539K12p655
16055H926N871J292j8489j798J7968R375M683J71q497o632O797j7678J650O716
16041A0355P336J958k468j3035j5410j501l41P949P029J2699j039j6762m761j2870
16027b0861P629K744P281l490P687K610o160J35q571j1996j01k505J0139P363
16013h096k131J217P541n12Q939L117m232J028P670q026l724q879L517j0138j1707
$$ plain form
16110 -5781 -2075 2391 10491 4247 -9948 -9556 -11772 -16986 -13402 -2938 -1183 9827 19691 17192
16096 17192 15809 3923 -9743 3658 13295 10009 21039 22267 14358 -1033 -14695 -25539 -26294
16083 -26294 -11781 2809 -589 -637 2742 -5766 -11801 -8443 -16078 -9871 -6303 -9249 -5605 -1655
16069 -1655 4680 -3730 -10854 -38519 -34080 -2748 4808 2055 5676 -2794 -1170 16369 16581 8926
16055 8926 14797 16089 -2400 -4198 13770 23145 27828 27999 19502 12870 19667 1989 3639 10355
16041 10355 17691 19649 17181 4146 -11264 -12765 -13106 -5157 1872 14571 13532 -3230 -7991 -20861
16027 -20861 -13232 -10488 -3207 -6697 990 3600 -2560 -2425 -10996 -22992 -23093 -25598 -15459 -8096
16013 -8096 -10227 -9010 -1469 -1981 6958 10075 5843 6871 14541 6515 2791 -6088 -2571 -12709 -24416
15998b4416N853J383m820j624Q767J2513J2264q623j488q216j5385o093J1660
15985a8225L73j06J0910j045Q536L028j1419M620J5754L410o726r44m78k374K191
15970G505J8630k626j2937j653q513J3o115L179M699P387J0389p154l873M198
15956A3129N133q866l106R627j589r78q330p330o901p307k751j010O735L315P649
15941b580O204r35J477J3276L581q172j8131r252Q273J1446M900j0107J193M192
15927E365j0179j0470P08L229m359k057j939J1946R97j244r387j4362q48J4717
15913a7883K787P634N616M08O081N191R355m851o250K675j0637j286M667p894
15899d387j2334q565n427K485M656J2697J4132N5j1865J0405J3536K774J0358
$$ plain form
15998 -24416 -18563 -17180 -22000 -23624 -14857 -2344 9920 1297 -191 -8407 -23792 -29885 -18225
15985 -18225 -17852 -17958 -7048 -8093 443 3471 -7948 -3328 12426 15836 9110 8166 7688 5314 7505
15970 7505 26135 23509 10572 8919 406 419 -5696 -2517 2182 9569 19958 12804 8931 13129
15956 13129 18262 9396 6290 15917 14328 13350 5020 -2310 -9211 -16518 -19269 -20279 -13544 -10229 -2580
15941 -2580 3624 2689 4166 17442 21023 12851 -5280 -14532 -6259 5187 10087 -20 1173 5365
15927 5365 -4814 -15284 -14576 -11347 -15706 -17763 -19702 -7756 -6759 -8003 -17390 -31752 -32600 -17883
15913 -17883 -15096 -7462 -1846 -1438 4643 9834 19189 14338 8088 10763 126 -1160 3507 -4387
15899 -4387 -16721 -25286 -30713 -28228 -23572 -10875 3257 3312 -8553 1852 15388 18162 28520
15886B8520R533P818L85j0691k3670o556j3453q055J1678K231J3755P231j2980
15873E746m035J753k898P2N198Q096M559j192j0541n860R464J084Q04q999J423
15858D674R062N944j6296k0057j6718L832J3325K0629j1403j4485q931J366L443
15845b5615J6287J2853q609j8578p197N397J279J2073J9850r269j0328P803j648
15832e702Q694J852M801l623p05j651l705J0868j416m22l106j1171n957N038j291
15817g496P113K674k923J0832k440o449K39j3346n283J2393K957m200L102M257
15803A430j9033j0574J0607K903J0620M113j293q582m364p067j1174J5500N368
15790a1546m521R359j6165j2880O036J2360N69R051P037N992O537r362k282L750
$$ plain form
15886 28520 38053 45871 46256 35565 11895 5339 -8114 -16169 -4491 -2260 11495 18726 5746
15873 5746 1711 3464 566 638 5836 13932 18491 17299 6758 898 10362 11446 12250 3251 4674
15858 4674 13736 19680 3384 -16673 -33391 -29559 -16234 4395 -7008 -21493 -30424 -29058 -25615
15845 -25615 -9328 3525 -5084 -23662 -30859 -25462 -24183 -12110 7740 -1529 -11857 -4054 -5702
15832 -5702 2992 4844 9645 6022 5317 3666 -39 10829 9413 8991 5885 -5286 -11243 -6205 -7496
15817 -7496 -383 2291 -632 10200 7760 1311 1550 -11796 -17079 -4686 -1729 -5929 -2827 1430
15803 1430 -17603 -28177 -17570 -14667 -4047 66 -1227 -9809 -14173 -21240 -32414 -16914 -11546
15790 -11546 -16067 -6708 -22873 -35753 -29717 -17357 -16788 -7737 -700 5292 11829 2467 185 3935
15776C935J6839P98n997r468r357k1422M093J3991L589M645j1846j1861n136k830
15762c0027K23K4097Q649n904M300k360m557k441R570Q750J1684P151m461r403
15748A5271j5059j0634J13J2878L909K813p801K344M250J2331k367N409j1374
15735A2083o976p853l476Q875M880n83L186p287l783N503J6267P571k264n637
15721B0506o497j453j5691k792K746Q17o132J4087L0l024K985J642Q689J4242
15707C0155o710k3062m162M81J4570j0478j0855n729k108J0992R004Q145j0266
15694b3P49m286j1197n205J6695P134n470J50m409P936R5P724K726j0477q639
15679f497O470k635n771O690L314n115M761O765k905j650m645K935n563m347l069
$$ plain form
15776 3935 20774 21572 15575 6107 -3250 -24672 -20579 -6588 -2999 1646 -10200 -22061 -27197 -30027
15762 -30027 -29804 -5707 2942 -2962 1338 -1022 -5579 -8020 1550 10300 21984 29135 24674 15271
15748 15271 212 -10422 -10309 2569 6478 9291 1490 3834 8084 20415 18048 23457 12083
15735 12083 5107 -2746 -6222 2653 7533 6950 10136 2849 -934 4569 20836 28407 26143 20506
15721 20506 14009 12556 -3135 -5927 -3181 -2364 -8496 5591 5621 2597 5582 7224 15913 30155
15707 30155 23445 383 -3779 -3298 11272 794 -10061 -15790 -17898 -6906 2098 10243 -23
15694 -23 726 -3560 -14757 -19962 -3267 3867 -1603 -1453 -5862 2074 2169 9893 12619 2142 -6497
15679 -6497 -27 -2662 -8433 -1743 1571 -3544 1217 7982 5077 3427 -1218 1717 -3846 -8193 -11262
15664a1262N2O817o380r769J5226M040O000K885P546j871j2578P827J467j591
15650H409Q740r043r078j6290q375Q482N037L397K404n93m994J41P789R453o03
15635D876k134l564j165p424K511J3381o182j1526J1168J1869J776j2304j4231
15622a2949q767p573J2603J2488n143R478M900j1115K035J7816Q82k396j9293
15609g034m772O397m917N466j606j1763M088N048j379o016L029l388K092O083
15595h672j036L888J1998R116r536m509k659n160N695P968k995J374J532Q310
15581A5314M879n834j1717o238l405J0442R292j1897j6659n608J3231Q013l529
15568c716m29O484O534J490l356l368J307l685l165q109L8k230o210J009Q928
$$ plain form
15664 -11262 -11210 -4393 -10773 -20542 -5316 -1276 4724 7609 15155 13284 706 8533 10000 8409
15650 8409 17149 8106 -972 -17262 -25637 -17155 -12118 -8721 -6317 -6910 -11904 -11763 -3974 5479 4876
15635 4876 2742 -822 -1987 -9411 -6900 6481 299 -11227 -59 11810 13586 1282 -12949
15622 -12949 -21716 -29289 -16686 -4198 -9341 137 5037 -6078 -4043 13773 14655 12259 -7034
15609 -7034 -11806 -5409 -10326 -4860 -6466 -18229 -14141 -9093 -10472 -16488 -13459 -16847 -14755 -8672
15595 -8672 -9708 -5820 6178 15294 5758 1249 -1410 -6570 -875 7093 4098 5472 7004 15314
15581 15314 20193 14359 2642 -3596 -7001 3441 12733 836 -15823 -21431 -8200 -187 -3716
15568 -3716 -4145 2339 8873 10363 7007 3639 4946 1261 -1904 -10013 -9975 -12205 -18415 -17406 -8478
15553h478J319K81P731J1691J265r03M073J8296J7435j5259k0350k7450K147K0465
15539A2263J1143k092j3315o04P624j5069j0630P152j5138J2775J1379j1295q015
15526a3822R723m544j2857p481R940J8863J1817l060o733j0480q172o932J1380
15513a2358J2727o70l828j974J5077J6408O046n478j7925n070L815o412l803r032
15499a2477L497J0049O772J209n200q98p382J5405P231k798q335J448K923k577
15485H867P168j944m389L177L139M237O7r55j0365j1051J0630J7065j1154j1325
15471C167q623Q175M532N580j50l213J2350r894j0860n012N830j0092p151O393
15457h968N239J062J4674K518l725R697K859q788p807m833n844J5035K1012o255
$$ plain form
15553 -8478 -7159 -6878 853 12544 13809 12906 16979 35275 52710 37451 17101 -10349 -8202 12263
15539 12263 23406 21314 7999 7395 15019 -50 -10680 -3528 -18666 -5891 5488 -5807 -13822
15526 -13822 -4099 -8643 -21500 -28981 -19041 -178 11639 8579 1846 -8634 -16806 -23738 -12358
15513 -12358 369 -301 -4129 -6103 8974 25382 31428 25950 8025 2955 6770 358 -3445 -12477
15499 -12477 -8980 1069 7841 9050 3850 2952 -4430 10975 18206 15408 7073 8521 11444 8867
15485 8867 16035 14091 9702 12879 16018 20255 20322 19367 9002 -2049 8581 25646 14492 3167
15471 3167 -5456 2719 7251 12831 12681 9468 21818 11924 1064 -3948 1882 -8210 -15361 -8968
15457 -8968 -3729 -2667 12007 14525 10800 20497 23356 14568 6761 1928 -3916 11119 32131 25876
15443B5876p191P643l4j4569j447r841j5974N24J1641K79m514J638N492k379R683
15428F827J1164o484k6121L41k418m654J3757J4599m109j5802m912R594p407m248
15414a9873J0491P958J0850p426j1693R803l887r197J3032R651p638J4720r315
15401G476j1743j3474p67K3690L182q797J0555J323j2401m645J69j46P45L17l376
15386g892n379l959k774L654J6098m003j1709k356k236J1338O525p44M275j7593
15372a6755j0339k578p33l191J0510J1767k329J0990Q176j3636k98K218j1912
15359a8110p407Q23M549o449J0743J0544l360O17p555M008k435N743N255O805
15345C771O861R149J4523m087P72k374q067j8088j0938l462q809l163N794K528
$$ plain form
15443 25876 18685 26328 26294 11725 10278 437 -15537 -15013 -3372 -3093 -7607 -5969 -477 -2856 6827
15428 6827 17991 11507 -14614 -14273 -16691 -21345 -7588 7011 2902 -12900 -17812 -8218 -15625 -19873
15414 -19873 -9382 -1424 9426 2000 -9693 110 -3777 -12974 58 9709 2071 16791 7476
15401 7476 -4267 -17741 -18508 5182 8364 -433 10122 11445 -956 -5601 -5432 -5578 -4833 -4516 -7892
15386 -7892 -13271 -17230 -20004 -16350 -252 -4255 -15964 -18320 -20556 -9218 -2693 -3437 838 -16755
15372 -16755 -27094 -29672 -30405 -33596 -23086 -11319 -13648 -2658 5518 -8118 -8416 -6198 -18110
15359 -18110 -25517 -24694 -20145 -26594 -15851 -5307 -8667 -8050 -15605 -11597 -14032 -8289 -3034 3771
15345 3771 10632 19781 34304 30217 30989 28615 20548 2460 -8478 -11940 -20749 -23912 -18118 -15590
15331a5590J4799Q665q204o023M428K125J903q259N017L079j8125K672p244k175
15317b2932J4680o222n397J0580l76R245l334K405j0536q694K4772J65J2765m318
15303A2803k3371n60q723j524J5755K035l407J2489J4265J1999K207j5238j3224
15290E506q663O943q678L450P776R959R955j539o228L007j6529j4060J8672Q995
15276A8566j6275n533j0955n203R810n893O264L302K100n701J3827N103n919Q891
15262A2384L576R98l659j0450j313P889O788n040r580J566k849l392J569Q612
15248G099o48L890Q305j236K263j3141q922j687J1347m633p911J1657J622q870
15234h65M233m247j1144j869K390P011K543q008j265K965R540j282m164M251Q435
$$ plain form
15331 -15590 -791 7874 -330 -6353 -1925 200 2103 -6156 -1139 1940 -16185 -13513 -20757 -22932
15317 -22932 -8252 -14474 -19871 -9291 -9667 -422 -3756 -1351 -11887 -20581 4191 4356 17121 12803
15303 12803 -10568 -11128 -19851 -21375 -5620 -3585 -6992 5497 19762 31761 33968 18730 5506
15290 5506 -3157 3786 -4892 -1442 6334 16293 26248 24709 18481 21488 4959 -9101 9571 18566
15276 18566 2291 -3242 -14197 -19400 -9590 -15483 -9219 -5917 -3817 -9518 4309 9412 3493 12384
15262 12384 15960 16958 13299 2849 1536 9425 16213 11173 1593 3159 310 -3082 -1513 7099
15248 7099 6451 10341 18646 17410 19673 6532 -2390 -4077 7270 2637 -5274 6383 8005 -865
15234 -865 3368 -879 -12023 -13892 -11502 -4491 -1948 -9956 -11221 -8256 1284 2 -4162 89 8524
15219H524M97N800J010m641j2122p308J1903J264n214J0564J041J253K719m956
15205A0334L866J053j3306J9954r57j6403p434q278J500O207L068J1664j1370
15192a02k037j1127q886o505K663J0298J3994P6j3753k764R548Q847O268o407
15178A13q777J1682J0396o188j4816j0852N299L551P778J2123o584j7716m115
15165a8106R973J0824o84p350N0m53p686R89J4787j1537M01J4176k813K010p286
15150b705N248R320K428o328r465o486J3462R21n470j1313r47P085O762l597l368
15135d453N026r277J427k243o559M110o476L292J1380j749k191l52J360R848m325
15120a182j7173j2264J7556J0079q298o049R37n97N421n23m315l661J7898J3258
$$ plain form
15219 8524 9021 14821 15831 11190 -932 -8240 3663 4927 -287 10277 11318 12571 15290 10334
15205 10334 14200 15253 1947 21901 20944 4541 -2893 -11171 -9671 -3464 -396 11268 -102
15192 -102 -2139 -13266 -22152 -28657 -25994 -15696 -1702 -1626 -15379 -18143 -8595 252 6520 113
15178 113 -8664 3018 13414 7226 -7590 -18442 -13143 -9592 -1814 10309 3725 -13991 -18106
15165 -18106 -8133 2691 2007 -5343 -5293 -5746 -13432 -12443 2344 -9193 -8792 5384 2571 4581 -2705
15150 -2705 2543 11863 14291 7963 -1502 -7988 5474 6395 925 -10388 -11335 -4250 2512 -1085 -4453
15135 -4453 573 -8704 -7277 -9520 -16079 -11969 -18445 -15153 -3773 -5522 -7713 -8065 -6705 3143 -1182
15120 -1182 -18355 -30619 -13063 -2984 -11282 -17331 -16394 -16991 -11570 -12093 -16408 -20069 -2171 11087
15106A1087P463r580J1110j6066k6287Q579J4295K503j0355m08n0R291n76m176
15092c170O709R962L927o716j907m283q592n570j2594j596l653O301Q971J0558
15078a653j874r667j0834l002M696J2488K666J6066O015r497J543k332o259j6993
15064a8637N886M629j954j2513J178J6299J5726J198j1064M261O953R7j4389J790
15050e40j408o847m979P87R115Q904j164M944j489r2J145l796l017K258j1805
15035g984r409J1188M981M0j8259j3205J0842R411J3403O421j0244m481N716P501
15021E921l121m138O536j42N60k8885j5706J0398J5050J6437O169J3388r793j1602
15007A072J699J699j993j0896k922k474J757J0573M218O450l690k887L336L158
$$ plain form
15106 11087 18550 8970 20080 4014 -22273 -13694 601 3104 -7251 -7659 -7709 1582 1006 -3170
15092 -3170 3539 13501 17428 10712 8805 4522 -4070 -9640 -22234 -23830 -27483 -21182 -12211 -1653
15078 -1653 -3527 -13194 -24028 -27030 -22334 -9846 -7180 8886 14901 5404 6947 4615 -1644 -18637
15064 -18637 -12751 -8122 -10076 -22589 -21411 -5112 10614 11812 748 5009 11962 12059 -2330 -540
15050 -540 -1948 -8795 -13774 -12987 -3872 5032 3868 8812 7323 7231 8376 4580 1563 3821 -7984
15035 -7984 -17393 -6205 -1224 -1184 -19443 -32648 -21806 -12395 1008 7429 -2815 -7296 -1580 5921
15021 5921 2800 -1338 5198 5056 5616 -23269 -38975 -28577 -13527 2910 9079 22467 12674 1072
15007 1072 2771 4470 2477 -8419 -11341 -13815 -12058 -1485 2733 9183 5493 2606 5942 9100
14993I100p552q469L759l151q00P475K907k947L467j890p908J1654l740L927o339
14978e07l416J8378m671l010o64L919l156j1026J2525M472j5652r036R605Q020
14964E781m931J2704K1314j6361j2413N509m705r576J258J2332l517j4275n157
14951a2037R626P974p969n865N937N952j3747J725r72J1809J039j783R187P706
14937A8582j1313M625J1042J1178O13j667k906j1082j0623p050J4601M800J5899
14924C6699J88l1940j0475L613N150m145k257k040M115J2100p324j065P806Q005
14910A8430J90q518L250Q61j2082J632O53R380k686j4317K668j368J5895J0804
14896B4792l416j920k727j1306j3078j0579M898n93M248L296K466N907R702l92
$$ plain form
14993 9100 1548 -6921 -3162 -6313 -7113 362 3269 322 3789 1899 -6009 5645 1905 5832 -507
14978 -507 -3923 14455 9784 6774 6110 10029 6873 -4153 8372 12844 -2808 -11844 -2239 5781
14964 5781 850 13554 34868 18507 6094 11603 6898 -2678 -1420 10912 7395 -6880 -12037
14951 -12037 -2411 5563 -2406 -8271 -2334 3618 -10129 -8404 -9376 2433 3472 1689 10876 18582
14937 18582 7269 11894 22936 34114 34727 33060 30154 19072 8449 1399 16000 20800 36699
14924 36699 36887 4947 -5528 -1915 3235 -910 -3167 -5207 -1092 11008 3684 2619 10425 18430
14910 18430 18620 10102 13352 14213 2131 3763 4416 13796 11110 -3207 -539 -1907 13988 24792
14896 24792 21376 19456 16729 5423 -7655 -18234 -13336 -13929 -9681 -6385 -3919 1988 11690 11298
14882A1298j2070J098J3392L54N892O954j2089j6677L875P672O300J132J150j0103
14868H178p774J492L219l046M699m851j0860L359J0626M886P300N959k286m027
14854A6874L154j0332j1509M603l434J0581M557j8288k1781l635j920p26J2607
14841a9249K0063L334q086j1298p287k655J0141J0930O299k68O838L80j1140r622
14827a1620q586j831J6310n658K530q79p635J309J5046J1070l127l494j4839l644
14813a5048P695q322j6239J5727L653l902J2449P723k987O119k949k03L932p045
14799F03K060k121J584p781o214K926Q60J1472o435M318R808M58R278j381j1342
14784H093l501N078j4475o080k11M054Q079k354q603m857o774K904J9914Q468
$$ plain form
14882 11298 -772 326 13718 14072 19964 26918 14829 -1848 2027 9699 15999 17131 18281 8178
14868 8178 404 1896 5115 2069 6768 1917 -8943 -5584 5042 9928 17228 23187 20901 16874
14854 16874 20028 9696 -1813 2790 -644 9937 14494 -3794 -25575 -29210 -31130 -31856 -19249
14841 -19249 814 4148 -3938 -15236 -22523 -25178 -15037 -4107 2192 1924 8762 9142 -1998 -11620
14827 -11620 -20206 -22037 -5727 -11385 -8855 -9734 -17369 -16060 -1014 10056 6929 3435 -11404 -15048
14813 -15048 -7353 -15675 -31914 -16187 -12534 -16436 -3987 3736 749 6868 3919 3716 7648 603
14799 603 2663 542 2126 -5655 -11869 -8943 -8083 3389 -3046 1272 11080 11538 20816 19435 8093
14784 8093 4592 9670 -4805 -10885 -11096 -7042 1037 -1317 -9920 -14777 -21551 -18647 1267 9735
14770I735j1673r881L601R617j2236J985K341j460l493j592O524K1151K360n868
14756A1111q466j3093m604P250J7080J102j3340J0419J9168l934j2369j9448j0770
14743a9894J306n016J4348P833n85m115J723K203l064P598j1488l1331j0460J4405
14729c6537K1631N316R541O661k273j3198n674P301k015J984J0071K416N32M905
14715A0661o882o999j3161L342J7871R993O094m049n431P848j869K690j619r13
14701A7576j0391k0290m60J804J2369P610K108K47j2874Q904k929Q098k100m210
14687E462n565J706J1040j2166q376J738O369L745j6021j8214r34J9299Q970j795
14673d742J0851L348l839n875k73K760P824P15m042J6112r095p927Q18o592J899
$$ plain form
14770 9735 -1938 -11819 -8218 1399 -10837 -8852 -6511 -7971 -11464 -13056 -6532 14619 16979 11111
14756 11111 2645 -10448 -15052 -7802 9278 10380 -2960 7459 26627 22693 10324 -9124 -19894
14743 -19894 -18588 -23604 -9256 -1423 -2008 -6123 -4400 -2197 -5261 2337 -9151 -40482 -50942 -36537
14729 -36537 -14906 -9590 -49 6612 4339 -8859 -14533 -7232 -9247 -7263 2808 5224 5756 10661
14715 10661 3779 -3220 -16381 -13039 4832 14825 20919 16870 11439 19287 17418 20108 18489 17576
14701 17576 7185 -13105 -13565 -11761 608 8218 10326 10573 -2301 6603 3674 11772 9672 5462
14687 5462 -103 1603 12643 477 -7899 -6161 208 3953 -12068 -30282 -31216 -11917 -2947 -4742
14673 -4742 6109 9457 5618 -257 -530 2230 10054 10769 6727 22839 13744 5817 6635 43 1942
14658A942l618Q791j0469p234m24Q287J3955K163j3802Q136L213J3267J5379j4757
14644B4829o556M627j2236m669l02L419L441k0235j8084Q188O72j1237Q248K4620
14630D725r59p348J0742j172J2334p300l336q669j4882o684k048R974K76J4650
14616C03J0492l901j1016m839j0755K45J2725M455K0174L302k1493j0136M367
14603f077p295k250O628L279l070J3845M215M922j1204l002o05P516j1643p015
14589a1756l433j045K782K839O735J581L387r449q605k364l906J094M661J308
14575a6171j2641O028K106j264r357Q903N756Q053j6235r517o49Q127J6565P237
14561c059J7366j0539l778K0840L685j2413L860J2875l625l802o100j07j401j4983
$$ plain form
14658 1942 -1676 7115 -3354 -10588 -11012 -2725 11230 13393 -409 7727 10940 24207 39586 24829
14644 24829 18273 22900 10664 5995 5693 9112 12553 -7682 -25766 -17578 -16906 -28143 -19895 4725
14630 4725 3766 -3582 7160 5988 18322 11022 7686 -983 -15865 -22549 -24597 -14623 -14347 303
14616 303 10795 6894 -4122 -8961 -19716 -19471 -6746 -2291 17883 21185 -308 -10444 -6077
14603 -6077 -13372 -15622 -8994 -5715 -8785 5060 9275 14197 2993 -9 -614 6902 -4741 -11756
14589 -11756 -15189 -16234 -13452 -10613 -3878 -2297 1090 -8359 -16964 -19328 -23234 -22140 -17479 -16171
14575 -16171 -28812 -22784 -20678 -21942 -31299 -22396 -16640 -8587 -24822 -34339 -34988 -26861 -10296 -3059
14561 -3059 14307 3768 -10 20830 24515 12102 15962 28837 25212 21410 15310 15203 13802 -1181
14547a181j8767m696J1763O946J225L798l455Q403O172k1823j5382J3543J3779
14534C25J244l346j1671K640J3615K052l599J482r301j238k827p263L885j3154
14520b7156O523q44j0434R7J2736K4817J2667m267j3465o364J2043J0509r05N297
14506B1254j700k2486q415p465m99K770R826R285n130j3222o22O130R049j491
14492b716n152r061p135K857J3054J3279J2006l525j6001j3542j6126j065J7838
14479a5289J1659J2972m158j2717j1887J0849o476r588K1881J8166J428J559j493
14466A6906K05j474p648p727k54R388J55m261L202l23k587j3335M672O5k648q837
14450a4501q563M333n256o183J9786J5029M428R048r510O854r701j6230j434j0684
$$ plain form
14547 -1181 -19948 -24644 -12881 -5935 -4710 -912 -4367 4036 10208 -11615 -26997 -13454 325
14534 325 1569 -1777 -13448 -10808 2807 4859 1260 2742 -6559 -7797 -10624 -17887 -14002 -27156
14520 -27156 -20633 -21477 -31911 -31814 -19078 5739 18406 14139 674 -5690 6353 16862 15957 21254
14506 21254 19554 -2932 -11347 -18812 -19311 -16541 -6715 2570 -2560 -15782 -16404 -10274 -1225 -2716
14492 -2716 -7868 -16929 -24064 -21207 -8153 5126 17132 13607 -2394 -15936 -32062 -33127 -15289
14479 -15289 -3630 9342 5184 -7533 -19420 -8571 -15047 -24635 -2754 15412 16840 18399 16906
14466 16906 17111 15637 7989 262 8 9396 9551 5290 8492 8169 5582 -7753 -3081 -3016 -5664 -14501
14450 -14501 -23064 -18731 -23987 -30170 -10384 4645 9073 18121 8611 15465 5764 -10466 -11900 -22584
14436b2584J0246K791J0333J9972r912N252m201j3725j546l446O512j0236p898
14423a8442O843J8885M360q918j1966R277J2021k471j5172J7684r940j7313n773
14410b0925r177L874K4683M670Q980o550L900R72j9100r494J3632Q98n367L81
14396h623n586R905l207p649O104n977M885j876j236K0080J7915N546j4202k440
14382A3639j0699P075J2560J0535o637j2964j5846J659m091k484N084j662m80
14369d311K0693L361j5547j4436j0917J7025J9531n432j6525O860L971M13J4928
14356A9614J391k4434j4720J6358J5213m384m059J1731L522J6512m785k1244j0277
14343D38j1937k0820K620N990o324p879j961J0442r026Q786m736M855J1971k364
$$ plain form
14436 -22584 -12338 -9547 786 20758 10846 16098 11897 -1828 -3374 -6820 -308 -10544 -18442
14423 -18442 -11599 7286 11646 2728 -9238 39 12060 9589 -5583 12101 2161 -15152 -20925
14410 -20925 -30102 -26228 -1545 3125 12105 5555 9455 10427 -8673 -18167 -4535 -3637 -9004 -8623
14396 -8623 -14209 -4304 -7511 -15160 -9056 -15033 -10148 -12024 -13260 6820 24735 30281 16079 13639
14382 13639 2940 10015 22575 33110 26473 13509 -2337 -678 -4769 -7253 -2169 -3831 -4311
14369 -4311 16382 19743 4196 -10240 -21157 -4132 15399 9967 -6558 302 4273 4686 19614
14356 19614 21005 -3429 -18149 -1791 13422 9038 4979 16710 20232 36744 31959 10715 438
14343 438 -11499 -32319 -29699 -23709 -30033 -37912 -39873 -29431 -38457 -29671 -34407 -29552 -17581 -19945
14329a9945n386M227J7429R462m971N898N154k339L888M77j0687k632K674M689
14315G938l42L974J653J827P12j2048r297L868j1880J199O149P427j2471r945
14301b1236J1923P389P386K6282m509j4247l515o791o5p178L60n70j5046j0418
14287c0235P798k554J5378J4452j4448J531M82k715q42p266Q080J1130n214K61
14273d162K8966p080k1911l586J0389J810j569j234j299L635j8820j4504J316
14260b8049M557J4060O201r024J95m646P162R859n389p986P688j071J1127J0057
14246A4741K007o123j1577l598n853m770J3588r81r952m181K542J671p08Q172
14232e022J0621Q714Q194O343j4717r109J798M274q549j0706m483O661M864K478
$$ plain form
14329 -19945 -25331 -21104 -3675 5787 816 6714 11868 9529 13417 13894 3207 575 3249 7938
14315 7938 7596 11570 13223 15050 15762 3714 -5583 -1715 -13595 -12396 -6247 1180 -11291 -21236
14301 -21236 -9313 -1924 5462 31744 27235 12988 9473 2682 2617 -4561 -4201 -4771 -19817 -30235
14287 -30235 -22437 -24991 -9613 4839 -9609 -8078 -7596 -10311 -11153 -18419 -10339 791 -4423 -4162
14273 -4162 24804 17724 -4187 -7773 2616 4426 2857 1623 324 3959 -14861 -29365 -28049
14260 -28049 -23492 -9432 -3231 -12255 -12060 -16706 -9544 315 -5074 -13060 -5372 -6443 4684 14741
14246 14741 16748 10625 -952 -4550 -10403 -15173 -1585 -2566 -12518 -16699 -14157 -12486 -13194 -5022
14232 -5022 5599 14313 22507 28850 14133 5024 6822 11096 2547 -8159 -12642 -5981 -1117 1361
14218A361p947r554L583o353k863R852M761J3754P562j6566j0382M513P429O903
14204F053L267J276O047k0709r609j5570L177J8643K213J395K04M887O613N71
14190H458q631m790L120J5569O7j6385j2321J4326Q470n976l671J1025J83k1561
14176a2117j421R432p121Q345J4105k143l217Q137L798p985j430R939o074k024
14162A0224M317l823r031j1196q444K91J0118n61j2282O577J0910O888P625o987
14148D626j2221j7910o414J6099K031j010M382j927n170K610M787J9131J898j0137
14134G75j1490k794P292O767P056M963J39j3206M826M556K038n107n015j1702
14120a0902j0279m211R412P920Q236Q784O22M162L265m058j3406k3465J317M731
$$ plain form
14218 1361 -6586 -16140 -12557 -18910 -21773 -11921 -7160 6594 14156 -2410 -12792 -8279 -850 6053
14204 6053 9320 10596 16643 -4066 -13675 -29245 -26068 -7425 -5212 -3817 -3613 1274 7887 8458
14190 8458 -173 -4963 -1843 13726 13793 -2592 -14913 -587 7883 1907 -1764 9261 9444 -12117
14176 -12117 -13538 -4106 -11227 -2882 11223 9080 5863 14000 17798 9813 8383 18322 12248 10224
14162 10224 14541 10718 1687 -9509 -17953 -17662 -7544 -8105 -20387 -13810 -2900 3988 11613 4626
14148 4626 -7595 -25505 -31919 -15820 -13789 -14799 -10417 -12344 -17514 -14904 -10117 9014 10912 775
14134 775 -10715 -13509 -6217 550 7606 12569 12708 -498 4328 8884 10922 5815 800 -10902
14120 -10902 -21181 -25392 -15980 -8060 176 8960 9582 13744 17009 12951 -455 -23920 -22603 -17872
14106a7872N542J148n253K318k396m160l683m994J2651Q499L209o145p561J1574
14092g123J1431J5981K083p47j1554j8073K080q141J3138n16j3558N528K69j890
14078a1092m312K95R294n894k853P053l081o107J7784K659k498n884o40J6083
14064A0807J5576j5610j2990J1744k418j1177j1296P655K578J891R749j796O451
14051A1164j163k1006j3139k104J0182M890O202K3169J2193j6562j5061m919j7637
14038b3791j012m0j548N522l030p489M228J1149J1384P318N139P078k3236j4322
14024b2650O710Q988J4202N694R80j3631j2082m308j353r54J0061J0060j4571
14011a2854m348O577N283M008J6L787J3788m057j5514o557j891j0658J2141J633
$$ plain form
14106 -17872 -12330 -11182 -16435 -14117 -16513 -20673 -24356 -29350 -16699 -8200 -4991 -11136 -18697 -7123
14092 -7123 4308 20289 22372 21625 10071 -8002 -5922 -14063 -925 -1441 -14999 -9471 -9202 -11092
14078 -11092 -15404 -15109 -5815 -11709 -14562 -7509 -10590 -16697 1087 3746 1248 -4636 -5276 10807
14064 10807 26383 10773 -2217 9527 7109 -4068 -15364 -7709 -5131 -3240 6509 4713 11164
14051 11164 10001 -11005 -24144 -26248 -16066 -11176 -4974 18195 30388 13826 -1235 -6154 -23791
14038 -23791 -24803 -24843 -26391 -20869 -23899 -31388 -27160 -16011 -4627 2691 7830 14908 -8328 -22650
14024 -22650 -15940 -6952 7250 12944 13924 293 -11789 -16097 -17450 -18404 -8343 1717 -12854
14011 -12854 -17202 -10625 -5342 -1334 -1318 2469 16257 12200 -3314 -9871 -11762 -22420 -10279 -8646
13997h646J392o162m393k474Q397J534n420N025R855J3995r530j6034K042l515
13983a3934Q140L754J235J0286l170j802o123p508N339K351j1297p074J0834K2375
13969A3406K435p649r686k234j3596M567m156l386J2175q124n090O866Q108J640
13955d724K768M618P218K739k760j3467j6679Q103P484j856N13j449j3452N339
13941a5605J5843L293r742k738K457pL965M332j5482k6640J091J6522J234O377
13927a5100P867K136J8776O955n890j4734j3138L49N364q58O842q4L831q863j2771
13912a9318L995N104M078K576J042M321J0525O714j3120j3159n889m563j5399
13899c3093r556O808J2603J042J5884J930J0416j7871o541J1298j6064j4180J2830
$$ plain form
13997 -8646 -7254 -13416 -17809 -20283 -11886 -10352 -15772 -10747 -892 13103 3573 -12461 -10419 -13934
13983 -13934 -5794 -2040 -805 9481 6311 4509 -1614 -9122 -3783 -1432 -12729 -19803 -8969 13406
13969 13406 15841 8192 -1494 -3728 -17324 -12757 -16913 -20299 -8124 -16248 -21338 -14472 -6364 -4724
13955 -4724 -1956 2662 9880 12619 9859 -3608 -20287 -12184 -4700 -6556 -6043 -7492 -20944 -15605
13941 -15605 238 3531 -6211 -8949 -6492 -6499 -2534 1798 -13684 -40324 -39233 -22711 -21477 -15100
13927 -15100 -7233 -5097 13679 20634 14744 10 -13128 -12779 -7415 -8273 -1431 -1515 2316 -6547 -19318
13912 -19318 -15323 -10219 -6141 -3565 -2523 1798 12323 19037 5917 -7242 -13131 -17694 -33093
13899 -33093 -42649 -35841 -23238 -22196 -6312 -4382 6034 -11837 -18378 -7080 -23144 -37324 -24494
13886b4494R515j475m323p557J2017Q591J0039L698k158l034l678N270L598m91
13872E518p444O014N941j5012j2750m808n197R267J2020N557K464l135L258K700
13858D393n88l627l960R981k607j878J419m653J776k95m792k703j4287j0067J5944
13843a5944J5287M256j4723p117J6289K3754k418k0453j3041M033N539K698q604
13830a0444P241N278p523L042r710l657p692L248Q279J3872q665j4843K837J3738
13816d999J897m39N113k707L00j768J2593r33r234r072K771j656O03J872P687
13801B028o56n791n563j0185K159M327J1168K1353K312j2786k3870K67K0140m826
13787G7p171p075J0128J9619J3059R915k4907k8278N904J2064j0901p264L38N846
$$ plain form
13886 -24494 -14979 -16454 -20777 -28334 -16317 -7726 2313 6011 3853 819 -2859 2411 6009 5518
13872 5518 -1926 4088 10029 -4983 -17733 -22541 -27738 -18471 -6451 -894 1570 -1565 1693 4393
13858 4393 3805 178 -3782 6199 3592 1714 3133 -1520 256 -39 -4831 -7534 -21821 -31888 -15944
13843 -15944 -657 3599 -11124 -18241 -1952 21802 19384 -1069 -14110 -10077 -4538 -1840 -10444
13830 -10444 -3203 2075 -5448 -2406 -12116 -15773 -23465 -20217 -11938 1934 -6731 -21574 -18737 -4999
13816 -4999 -3102 -3541 1572 -1135 -835 -2603 9990 9057 -177 -9249 -6478 -8134 -7531 -5659 2028
13801 2028 1372 -4419 -9982 -20167 -18008 -13681 -2513 18840 21152 8366 -15504 -15237 4903 77
13787 77 -7094 -14169 -4041 15578 28637 38552 13645 -14633 -8729 3335 -7566 -14830 -14492 -8646
13773h646N717r172K050O728J3801k427j7104n163j5301m405N931J3194M584O25
13759i588j0840J1939K1924m1l645m19K960n4j6351l860l452N553J7286N591j1680
13744E323j3095q348J816J813M661l818K510P963j80o033J0975P661j0248n544
13730d544j2162R26J4574n651r03J4745J0190O643p058j0545k681j0517j5722
13717b2705L092P647M011M491k55j101R300N884L93K553j141q255J383J8488J114
13702B4899j374j3180r494K140n917k50n00n838q490J251K613N382l273j977L304
13687a0704J978Q200m967L575K207M19J502J523M383j6641J952P958N409K805
13673I599N96k994m424j5882n437J2608J7630Q715j2210o707o468N198J0492o07
$$ plain form
13773 -8646 -2929 -12101 -10051 -3323 10478 8051 -9053 -14216 -29517 -33922 -27991 -14797 -10213 -9588
13759 -9588 -20428 -8489 13435 13394 9749 9330 12290 12236 -4115 -7975 -11427 -5874 11412 17003 5323
13744 5323 -7772 -16120 -14304 -12491 -7830 -11648 -9138 -1175 -1355 -7388 3587 11248 1000 -4544
13730 -4544 -16706 -15780 -1206 -6857 -7760 6985 17175 23818 16760 6215 3534 -6983 -22705
13717 -22705 -19613 -11966 -7955 -3464 -3719 -4820 4480 10364 10757 13310 12169 3914 5297 23785 24899
13702 24899 23525 10345 851 2991 -2926 -3176 -3676 -9514 -18004 -16753 -14140 -8758 -12031 -14008 -10704
13687 -10704 -8726 -526 -5493 -1918 289 708 2210 3733 8116 -8525 -6573 1385 6794 9599
13673 9599 10195 7201 2777 -13105 -18542 -5934 11696 20411 8201 1494 -4974 224 10716 10109
13659A0109n543j4787j9060J863n086k772J5623J6115m839K897R501P303J637
13646A2961o069K224k291j0603M46j2994l745P581J2225J1204p96J51J3651r159
13632A4786j2911p826p127Q589J3852L764k603j4072q17J303M798N674R38k8378
13618b0030l981M024P716J6652R301J3307P240j3096j2519N487n846L70m177j6375
13604a1927r997Q938J0440j1355N460J6956q413M10N993Q950N027P525j965r925
13590A6117r067p792j038n106o215k990M927O32l671J12L329J6541Q468j3809
13576D38R041m922j4842N438n195r816L169J4207J22o922Q060J3781o294M74P59
13561G498j2652O176m847j2674m34O748l264K0010J7471j6927k3125j2555Q885
$$ plain form
13659 10109 4566 -10221 -29281 -27418 -32504 -35276 -19653 -3538 -8377 -5480 4021 11324 12961
13646 12961 6892 9116 6825 -3778 -3332 -16326 -20071 -12490 -265 10939 10143 10294 23945 14786
13632 14786 1875 -5951 -13078 -4489 9363 13127 10524 -3548 -4365 -3062 1736 7410 8348 -20030
13618 -20030 -24011 -19987 -12271 4381 13682 26989 34229 21133 8614 14101 8255 8625 4448 -11927
13604 -11927 -21924 -12986 -2546 -13901 -8441 8515 102 512 6505 15455 20482 28007 26042 16117
13590 16117 7050 -742 -1780 -6886 -13101 -16091 -11164 -10532 -14203 -14091 -10762 5779 14247 438
13576 438 9479 4557 -10285 -4847 -10042 -19858 -16689 -2482 -2360 -9282 -1222 12559 6265 6739 7498
13561 7498 -5154 1022 -3825 -16499 -16933 -10185 -13449 6561 24032 7105 -16020 -28575 -19690
13548a9690J299p296l300Q04O141M141R563l677k048M070o674j0535Q764J5096
13534c342N798j0368M157Q734o471j3211j413L816R146p981j1542J4712J6504
13521H539P320J0232j2906j405J0434M424j1187k0380J605J1491R503O27O928
13508B5225J048p389J1615j2558j7454j1283k034O524r84j2502L630J2878l088
13495f372q227k276J912J4382n951k083o93Q82o291L287J0552O376j3978Q61m048
13480a1667L184N679R406J664L914O509M114q347j3102r85N110o641o402J782
13466e782L780J089N547K351j0764j28M148L25q356j0905R697R349J797j812j5342
13451a5006q444R439J1363P854j0775K990O577j1762J3731J7462j145k091r194
$$ plain form
13548 -19690 -18391 -25687 -28987 -28183 -22042 -17901 -8338 -12015 -14063 -9993 -16667 -27202 -18438 -3342
13534 -3342 2456 -7912 -3755 4979 -1492 -14703 -16116 -12300 -3154 -11135 -22677 -7965 8539
13521 8539 15859 26091 13185 11780 22214 26638 15451 -4929 -3324 8167 17670 18297 25225
13508 25225 26273 18884 30499 17941 487 -10796 -12830 -6306 -7290 -19792 -16162 -3284 -6372
13495 -6372 -14599 -16875 -14963 -581 -6532 -8615 -9308 -8426 -14717 -11430 -878 5498 -8480 -7619 -11667
13480 -11667 -8483 -2804 6602 8266 12180 18689 22803 14456 1354 369 5479 -1162 -7564 -5782
13466 -5782 -2002 -913 4634 6985 -3779 -3907 241 566 -7790 -18695 -8998 351 2148 336 -15006
13451 -15006 -23450 -14011 -2648 5206 -5569 -2579 3998 -7764 5967 23429 22284 20193 10999
13438A0999n338l482O742R429K712N446j2345r077o719l379K7717J7863p920j9743
13424A2905q353j3948P941Q039L406N959n783p399J4896P403K628q822j8298j4988
13410a4414J1547J7578J33l816J802j406j0504j5487k138M454k03M387K3213l140
13396A2006k3194j4315Q31K8124K8740M6j4600o240p829P40j876K310q514r101
13382a2872r986J3730J6496l181Q612J555M637M908q416q520j1352Q291R558J353
13368A4813q909j6899R249p28M862k265P9Q764j631K705K803j119n307j947P283
13353A1753o190j2335j3184J9382R377K832m238J931J1279N824q596j489M064
13340B0410r947j6691m39J4098J2638M308p656j3047J3085o421J568n255J135
$$ plain form
13438 10999 5661 2179 8921 18350 21062 26508 14163 5086 -1633 -5012 22705 40568 32648 12905
13424 12905 4552 -9396 -1455 6584 9990 15949 10166 2767 17663 25066 27694 18872 574 -14414
13410 -14414 -2867 14711 14844 11028 12830 11424 920 -14567 -16705 -12251 -12454 -8067 15146 12006
13396 12006 -11188 -25503 -24672 3452 32192 32238 17638 11398 3569 4309 2433 4743 -3771 -12872
13382 -12872 -22858 -9128 7368 4187 12799 14354 18991 23899 15483 6963 -4389 3902 13460 14813
13368 14813 5904 -10995 -1746 -2474 2388 123 202 8966 7335 10040 12843 11724 6417 4470 11753
13353 11753 5563 -6772 -19956 -574 8803 11635 7397 9328 20607 26431 17835 16346 20410
13340 20410 10463 -6228 -6667 7431 20069 24377 16721 3674 16759 10338 11906 6651 7786
13327G786J2049O576j3172J075L587P018J325L048M317l227r888O679l884j6767
13313F522j1638l048L998O562j12Q066J7325Q592p230j0045j5075J4529J6767
13300C5213J914j1652p617p163L96M72l590j078M169O496k873J371O597l623j115
13285A7917L010J5202p014q971r866J3620J4618j6493o319R453n798k659K401
13272A9101P974k148P42j6508r02M373J0740P626k2077k752j06J1279L089q275
13258A2156m5j061O814L568N244m982j4100j1588R273M288p766J275K563O534
13244A2173J345j8527J393M019P203J4862l081j9454j1952J8388J5625O395j24
13231B8265l544M54j1210l062N937J1466Jj9074l299J8084K8j1742O750l798P410
$$ plain form
13327 7786 19835 26411 13239 14314 17901 24919 26244 29292 33609 30382 20494 27173 23289 6522
13313 6522 -5116 -8164 -4166 2396 2284 10350 27675 36267 29037 18992 3917 18446 35213
13300 35213 37127 25475 17858 10695 11091 11563 7973 6895 11064 17560 14687 16058 22655 19032 17917
13285 17917 20927 36129 29115 20144 10278 23898 38516 22023 15704 25157 19359 16700 19101
13272 19101 27075 24927 25669 9161 8259 12632 23372 30998 8921 6169 6063 17342 20431 12156
13258 12156 12111 11050 17864 21432 26676 21694 7594 -3994 5279 9567 1801 3076 5639 12173
13244 12173 13518 -5009 -3616 403 7606 22468 19387 -67 -12019 6369 21994 28389 28265
13231 28265 24721 25175 13965 10903 16840 28306 28307 9233 5934 24018 24046 12304 19054 15256 22666
13216B2666M498r290j4410k094p740J6302J5834K131j495l899K2899M398j1262
13203C8538j2435l073k5184j2788J2051J4100K4006M375m956j0213n96Q59l310
13190B1374r458k429L531k624R629J3422m786P014M773k0707p425l072O227Q67
13176A6336Q984j5392j0578J8257R603j5391k776O019R158J1618R022J3940p296
13163E1504j8439r379N429J3142J744q845n081L243J711L516j2444n128J1219
13150C2192j045o179J542R4J5426k486p243Q186p781j8318K346L390o130q852
13136E142j187J2506O204j125m97j969K139L739k917J594p739K503R862J988q002
13121B2241J3467n774r822j1569j4198P380J9416n018J2130J53n560M277L256
$$ plain form
13216 22666 27164 17874 3464 1370 -6370 9932 25766 27897 26402 22503 45402 49800 38538
13203 38538 26103 23030 -2154 -14942 -2891 11209 35215 39590 34634 24421 23825 24684 21374
13190 21374 11916 9487 13018 10394 20023 33445 28659 35673 40446 19739 12314 9242 15469 16336
13176 16336 25320 9928 -650 17607 27210 11819 9043 15062 24220 35838 44860 58800 51504
13163 51504 33065 23686 29115 42257 44001 35156 30075 33318 35029 38545 26101 20973 32192
13150 32192 31147 24968 26510 26604 42030 39544 32301 40487 32706 14388 16734 20124 13994 5142
13136 5142 3955 16461 22665 21540 21043 19074 21213 24952 22035 23629 15890 18393 28255 30243 22241
13121 22241 35708 29934 20112 8543 -5655 1725 21141 16123 28253 28406 22846 27123 30379
13108C0379n625O674J0036k014k478j7271o293J1648J13r378j9783R158R586J2899
13094B7651Q101o152j0078m060l898K782P098k587J6704J1658m239K378K080J260
13080D8698o070j394p283q491Q426N964o47n179n882n923j927N297n643J6926
13066C6872N741j61l216q879j5174j7154M615K2507J8816J303l678k021J6413
13053E5984P243n20q873K405l483n128k387N280m513J2089O482j1214k0099J3595
13039D6861L11q323N798p732q264j6441N055J1491j6693L918J1940J306j5344
13026A3883j437J2161J4983M922p025J1480O930p732m231j2859J4795J0598j7108
13013C9360j8000r725n761K206K846J4663R773R028J6635M07j5369j0520p55N58
$$ plain form
13108 30379 24754 31428 41464 39450 36972 19701 13408 25056 25169 15791 -3992 5166 14752 27651
13094 27651 35752 29600 19522 15462 11564 14346 21444 18857 35561 47219 42980 45358 47438 48698
13080 48698 42628 41234 33951 25460 33886 39850 39203 34024 28142 22219 20292 25589 19946 36872
13066 36872 42613 42452 39236 30357 15183 -1971 2644 25151 43967 45270 41592 39571 55984
13053 55984 63227 62707 53834 56239 52756 47628 45241 50521 46008 58097 64579 53365 33266 46861
13039 46861 47172 38849 44647 36915 28651 12210 17265 28756 12063 15981 27921 29227 13883
13026 13883 12446 24607 39590 44512 37487 48967 55897 48165 43934 31075 45870 56468 39360
13013 39360 21360 11635 5874 8080 10926 25589 35362 44390 61025 61432 46063 35543 34788 35346
12999C5346m686k607k527L343M590j655L465M490M071J0005r996p418L93R063
12985D5877r06q437K726R671k541j0116r91J1670M805n955N47L909q399O426p740
12970D0546j1148M264L115K75J2096J5931N805o244j5998K731J6753O418j7542
12957E7002j2446J8179J4344K171j4214j4171k2845J1597K4326r50j8290N003
12945D9706J6970J314P553j5184J740m532Q955N238m352N432N835r896q155m823
12931E5801j1005j8249j696K7680J1226j2522p396L775M675K652m151J0180P371
12918F8341N615N641l88J407R836j5518j1034M217K745q315K426N00o818R397
12904F8052J4509n976m52m352j270J0105o807j58J0140J1019N455O326j1991q306
$$ plain form
12999 35346 30660 28053 25526 28869 33459 31804 35269 39759 43830 53835 43839 36421 36814 45877
12985 45877 44971 36534 39260 48931 46390 36274 35283 46953 51758 45803 46350 50259 41860 48286 40546
12970 40546 29398 33662 36777 37052 49148 65079 70884 64640 48642 51373 68126 74544 57002
12957 57002 44556 62735 77079 79250 65036 50865 28020 39617 63943 62993 44703 49706
12945 49706 66676 67990 75543 60359 62099 57567 66522 71760 67408 72840 78675 68779 60624 55801
12931 55801 44796 26547 24851 52531 63757 51235 43839 47614 52289 54941 50790 60970 68341
12918 68341 73956 79597 79209 80616 90452 74934 63900 68117 70862 62547 64973 65473 58655 68052
12904 68052 82561 76585 76133 71781 70511 80616 73809 73651 83791 94810 100265 106591 94600 86294
12890H6294k691o152P50o5m894m432o082K336J6561R622L165j1875n206L078N996
12875H6405L753m7K0161R386m828r794n886r38J0658p808K167r664l847K0547
12861A10265J4198j7283j1835m463J117O640O806O05O17Q052L07J487o617L849
12847A13745N690j1946R024l497n07j6316j2245O719L710L155L531N903q3Q86
12833A07769m68k685j531j051O455J7673Q189J69K927M539N349l141n375L772
12819A42591l271j2980o121N836J0470R285Q272j3887k658J4110J7283N34j4368
12806A55096n610j450n81O025R563k983R187K0938J0661l607P783j4061r6J1883
12792B02748J6333R553r499K687J5001L569n593j3381J6283J5047J308n124j3919
$$ plain form
12890 86294 83603 77451 78201 78136 73242 68810 62728 65064 81625 91247 94412 82537 77331 80409 86405
12875 86405 90158 90111 110272 119658 114830 105036 99150 98212 108870 101062 103229 93565 89718 110265
12861 110265 124463 107180 95345 90882 91999 98639 105445 106050 106667 114719 115026 116513 109896 113745
12847 113745 119435 107489 116513 113016 112509 96193 83948 90667 94377 97532 101063 106966 106883 107769
12833 107769 107301 104616 103085 102034 108489 126162 134351 134520 137447 141986 147335 144194 138819 142591
12819 142591 139320 126340 120219 126055 136525 145810 154082 140195 137537 151647 168930 169464 155096
12806 155096 149486 148036 147455 153480 163043 160060 169247 190185 200846 197239 205022 190961 190865 202748
12792 202748 219081 228634 219135 221822 236823 240392 234799 221418 237701 252748 254056 248932 235013
12779B35013l831p335j160l814J5456L015O469o424j4033m871p840p01O99J467
12765B12110P945J093m86m820l714J145k364O486J4048n052p921J3024K5986M263
12751B61743k2244j6321Q869R154R056M590j3343J0357Q311n014l241O302q227
12738B49992q87O320K7502J2889o690k5460M009J4678J8474J3531j3152k239j9628
12725B79339P535K2181J2299L177p532O933J1418J3659K528k1066J433J5303N844
12712C53051J519K46L820l60R98k889j813n732J9989K0682L864N14P560R627J2174
12697D23250j870K443O234K8003Q900j4338p213k827n89Q956J3244J7854J7669
12684D99716K763j0J7032L540N775n802m052J1069J6295J314J9819K0642J6163
$$ plain form
12779 235013 231182 223847 222687 218873 234329 237344 243813 237389 223356 218485 210645 209944 210643 212110
12765 212110 220055 221148 220662 215842 212128 213273 210909 217395 231443 226391 218470 231494 257480 261743
12751 261743 239499 223178 232047 241201 250257 254847 241504 251861 260172 255158 251917 258219 249992
12738 249992 249105 255425 282927 295816 289126 263666 267675 282353 300827 314358 301206 298967 279339
12725 279339 286874 309055 321354 324531 316999 323932 335350 349009 351537 330471 331904 347207 353051
12712 353051 354570 354816 358636 358276 359274 356385 354572 348840 368829 389511 393375 393889 401449 411076 423250
12697 423250 421380 423823 430057 458060 466960 452622 445409 442582 441993 450949 464193 482047 499716
12684 499716 502479 502469 519501 523041 528816 523014 518962 530031 546326 547640 567459 588101 604264
12671F04264J0925j0323L023J6198J7193K427N780J4050M803K094P607J3910P886
12658F99837R301J8841J8955K1414J3175J2992K4832N946j0320J2729K0359J9270
12646H67331L1661J7038K0225N106J0539K0765J4681K1391K6167K2085J9728J6481
12634A093198J7845J7849K1538L2598L9625J7502Q912K6138L8715M2643J9681
12623A376244L3565L8039L3477L3772L8095L9776L5556N7373M9890L3405L1521
12612A800713L7193M1374N2471M9324M0856O7107N5289N5474O8869O0094O2188
12601B390952O3947P1334O1166R0527Q5080Q9450J00942R5744Q3153R1644Q8083
12590C312022J01767J20023J32976J38777J28361J33708J53291J38819J58749
$$ plain form
12671 604264 615189 604866 607889 624087 641280 643707 649487 663537 668340 670434 678041 691951 699837
12658 699837 709138 727979 746934 768348 781523 794515 819347 825293 814973 827702 848061 867331
12646 867331 898992 916030 936255 941361 951900 972665 987346 1008737 1034904 1056989 1076717 1093198
12634 1093198 1111043 1128892 1150430 1183028 1222653 1240155 1249067 1275205 1313920 1356563 1376244
12623 1376244 1409809 1447848 1481325 1515097 1553192 1592968 1628524 1685897 1735787 1769192 1800713
12612 1800713 1837906 1879280 1931751 1981075 2021931 2089038 2144327 2199801 2268670 2328764 2390952
12601 2390952 2454899 2526233 2587399 2677926 2763006 2852456 2953398 3049142 3132295 3223939 3312022
12590 3312022 3413789 3533812 3666788 3805565 3933926 4067634 4220925 4359744 4518493
12581D518493J61200J72064J71710J85092K08609K18344K24873K05756K41829
12572F307970K67552K67196K76360K81014L00754K94682L23343L36000L68466
12563I023337L80389L79793L89597M08053M19862M40009M28929M46661M47601
12554A2764231M54177M62277M50517M43809M28545M08260L93335L54343L38874
12545A6498368K89692K33915K03042J75559J00933M8371J6357m5400r3840j36536
12535A7290461j71344k47060k75864l15565l53942l70725l99751m32897m16755
12526A4306558m09341m46804m57136m48272m32130m21960m15061m12362m04613
12517A0458879l92407m00633l66921l41570l39829l25552l19610l08629k93232
$$ plain form
12581 4518493 4679693 4851757 5023467 5208559 5417168 5635512 5860385 6066141 6307970
12572 6307970 6575522 6842718 7119078 7400092 7700846 7995528 8318871 8654871 9023337
12563 9023337 9403726 9783519 10173116 10581169 11001031 11441040 11869969 12316630 12764231
12554 12764231 13218408 13680685 14131202 14575011 15003556 15411816 15805151 16159494 16498368
12545 16498368 16788060 17021975 17225017 17400576 17501509 17549880 17566237 17520837 17426997 17290461
12535 17290461 17119117 16872057 16596193 16280628 15926686 15555961 15156210 14723313 14306558
12526 14306558 13897217 13450413 12993277 12545005 12112875 11690915 11275854 10863492 10458879
12517 10458879 10066472 9665839 9298918 8957348 8617519 8291967 7972357 7663728 7370496
12508G370496k84911k69221k38339k42179k39003k17996k08410j93981j94873
12499E281583j86244j76831j55254j63194j52473j52192j43501j34234j26150
12490C891510j10166j11840j23411j22519j22640r9361q0961q8680q5399q4579
12480B861954q4086o0490o2826o6051o9548p1225p8043n7898n0551o7193o3374
12469B130669n5095m1476n0906m9446n0947m7577l1863l5426l5437m1880l5092
12458A655524l2963j4416k9154l8384l7105l8650n3573k9390k5258l4589l5453
12447A286589l5123N35m896l8904k8372k1173k8332j8304l824k6740k0752j2617
12435A048087k0756j7881k3540q793j483k6435k5048j4204R13r909k5594k4153
$$ plain form
12508 7370496 7085585 6816364 6578025 6335846 6096843 5878847 5670437 5476456 5281583
12499 5281583 5095339 4918508 4763254 4600060 4447587 4295395 4151894 4017660 3891510
12490 3891510 3781344 3669504 3546093 3423574 3300934 3201573 3120612 3031932 2946533 2861954
12480 2861954 2777868 2717378 2654552 2588501 2518953 2447728 2369685 2311787 2261236 2194043 2130669
12469 2130669 2075574 2034098 1983192 1933746 1882799 1835222 1803359 1767933 1732496 1690616 1655524
12458 1655524 1622561 1608145 1578991 1540607 1503502 1464852 1411279 1381889 1356631 1322042 1286589
12447 1286589 1251466 1252001 1247105 1208201 1179829 1158656 1130324 1112020 1108196 1081456 1060704 1048087
12435 1048087 1027331 1009450 985910 977117 975634 949199 924151 909947 910860 900951 875357 851204
12423H51204j6727j8449j3971r373j0784q841j8612j1223J608O55m233j3346j9310
12410G08598j1559k1197o003j254j4099l1663j1162J4177J1799k2421j7246r906
12398E88064l636j4556j0535j2263L249K195j4893k1898q682j1719J139n804j2345
12385D78316j6627L6k883n072R640r348r623r075p783l350J0412n654o839J2888
12371D35038j466q787k0721m346o123j576j2417k0537J285L439m542o21P5J337
12357C60038l940k0398M793K813j6578r069R186K926k089p214j976j3257K096
12344C07331P633j2772p481K278J0696l394j0630P969J9571K521j831j7561o041
12331B98289k687J248p295j2549j9424P846N717r744J140K591M682o461o068n479
$$ plain form
12423 851204 834477 816028 802057 792684 781900 773059 754447 743224 744832 745487 741254 727908 708598
12410 708598 697039 675842 669839 668585 654486 622823 611661 625838 637637 615216 597970 588064
12398 588064 584428 569872 559337 547074 550323 552518 537625 515727 507045 495326 496465 490661 478316
12385 478316 461689 461725 458842 453770 463410 454062 444439 435364 427581 424231 434643 428989 422150 435038
12371 435038 433572 424785 404064 399718 393595 392019 379602 359065 360350 363789 359247 358626 358701 360038
12357 360038 356098 335700 340493 343306 326728 317659 326845 329771 327682 320468 318492 305235 307331
12344 307331 314964 302192 294711 296989 307685 304291 293661 301630 321201 323722 321891 304330 298289
12331 298289 295602 296850 289555 277006 257582 265428 271145 261401 262541 265132 269814 263353 257285 251806
12317B51806J567j6412j2133K280J0220K0330K6683N58j2839j1705r396o911q244
12304B35804k203M978M894p81N147P374O585J44j6146L407n757l357J6175K039
12290B58303k719K554N715O455N43M598j4325k7530k3953k4868N392J6133r70
12277B05328j6343p045J2766J0178K637n934j945k100j4905k421j0105P154o839
12264A70426o538j266k063r654q922m403J6329j664P397q286K381R96j2397j041
12250A41295r82P827n239N519J2519j1531j9707j2754J3539l869j520j551J1719
12237A35265p51k769M141n044m55j024m801Q451j7l802j2125o806J2990j082k680
12222A19491r329J092j642R818L762j609j2438l030M011o372r835o75K81M30j0558
$$ plain form
12317 251806 253373 236961 224828 227108 237328 257658 284341 284899 272060 260355 250959 244048 235804
12304 235804 233601 238579 243473 242692 247839 255213 261798 261942 245796 249203 243446 240089 256264 258303
12290 258303 255584 258138 263853 270308 270851 275449 261124 233594 209641 184773 190165 206298 205328
12277 205328 188985 181940 194706 204884 207521 201587 199642 197542 182637 180216 170111 177265 170426
12264 170426 163888 162622 160559 150905 141983 137580 153909 152245 159642 151356 153737 154733 142336 141295
12250 141295 140313 148140 142901 148420 160939 149408 129701 116947 130486 126617 125097 123546 135265
12237 135265 134514 131745 135886 130842 130387 129363 124562 133013 132996 129194 117069 110263 123253 122171 119491
12222 119491 110162 111254 109612 119430 123192 121583 109145 106115 110126 103754 93919 93244 93525 93955 83397
12207H3397m72J3101K892K784Q990Q695l443o694o767k038m025k0142L831K261
12193H2370l33J2634K6877j0708j2282r818o239j887K227K2827l616O251m190
12180A04113j5870K676k361K067r760J922M570J5609J2201p991k947k0749q786
12167G4694O766L63J0182l374l55O724k410k2296l19J2380j245K266J5584l73
12153I8587l709m286o667L523O45l706j5957j1299N522J0400M738j660j3123L505
12139F6513J6075N455n236J272j3205N168k681N155j1396o504p887p606Q84j963
12125D4044m153J5813M301k002J257j141j454J8380O453j3162o263Q32J9523Q511
12111I0939j0066j7904M97j717k380k194p728j1031J2948J2529n202j3898p706
$$ plain form
12207 83397 82925 96026 98918 101702 110692 119387 115944 109250 102483 100445 96420 76278 80109 82370
12193 82370 82037 94671 121548 110840 98558 88740 82501 80614 82841 105668 102052 108303 104113
12180 104113 88243 90919 88558 90625 80865 82787 87357 102966 115167 107176 104229 83480 74694
12167 74694 81460 81823 92005 88631 88276 95000 92590 70294 69975 82355 81110 83376 98960 98587
12153 98587 94878 90592 83925 87448 88093 84387 68430 57131 62653 73053 77791 76131 63008 66513
12139 66513 82588 88043 82807 84079 70874 76042 73361 78516 67120 60616 52729 45123 46007 44044
12125 44044 39891 55704 60005 58003 59260 58119 56665 75045 81498 68336 62073 62905 82428 90939
12111 90939 80873 62969 63466 61749 59369 57175 49447 38416 51364 63893 58691 44793 37087
12098C7087N862J4054M03m238P625P265L279j3811p22N504m844K826j3060N792
12084E3022O960q077J8203J1037J962r386n296j7841k1314j9564j2173O53K0143
12071A8329R491K793J6607O507o106j1244Q874j0016K933J9656N306j0684K337
12058E4783n627R44j2411M738J739j561k58m313kR849K503N077J98j3239j766
12043D0654J427j341n615J4409M556j1967j6263O796J0436K185q071L760J9181
12030F0147J007r48r278J609L532p056l640p651R407l77o627M582j897j1498m360
12015B6952m114Q268k380j41J1802N790j4394j3469m905p659J0159K116l011l902
12001A1112J288k494P940K6049r42O685J3640J0145j1026l5939j0119J6580Q334
$$ plain form
12098 37087 42949 57003 57406 53168 60793 68058 71337 57526 56804 62308 57464 60290 47230 53022
12084 53022 59982 51905 70108 81145 83107 73721 68425 50584 29270 9706 -2467 -1814 18329
12071 18329 27820 30613 47220 53727 47621 36377 45251 35235 38168 57824 63130 52446 54783
12058 54783 49156 50100 37689 42427 44166 42605 42347 38034 38032 47881 50384 55461 55659 42420 40654
12043 40654 42081 40740 35125 49534 54090 42123 25860 32656 43092 45277 37206 40966 60147
12030 60147 61154 60206 50928 52537 56069 49013 45373 37722 47129 46752 40125 44707 42810 31312 26952
12015 26952 22838 31106 28726 28585 40387 46177 31783 18314 13409 5750 15909 18025 15014 11112
12001 11112 12400 9906 17846 43895 42953 49638 63278 73423 62397 26458 16339 32919 41253
11988D1253Q702J2035k384J776j3236j673j5749r744q874o494Q157Q818Q833J8504
11974D9924J9608l765L08j8182j5537q616P818J31J025J2336p952n575R146J4056
11960E4725n01J1117j6762Q36j792N689o701r401j1102N103J0252K965k035j900
11946D0493k161M010L238R352K665j3630N528r874j8970n209O367O495M888j4717
11932A8475j0909J1251M089M097q47P280J1355j1856j3041J0337L308P979J5059
11919E6577K93j4080j4170l326K277l050n198p339j4354K1558K3048r54k723j5375
11905B3184r301j02J713O520o093j2177O128N682R999l051K926J7700k706O009
11891D6431J4699r196r934M144J0832k466k4100l4261R242R293J2279K960Q195
$$ plain form
11988 41253 49955 61990 59606 61382 48146 46473 30724 20980 12106 5612 13769 22587 31420 49924
11974 49924 69532 65767 66075 47893 32356 23740 31558 31689 32714 45050 37098 31523 40669 54725
11960 54725 54224 65341 48579 49415 47623 53312 46611 37210 26108 31211 41463 44428 42393 40493
11946 40493 38332 42342 45580 54932 57597 43967 49495 39621 20651 15442 21809 28304 33192 18475
11932 18475 7566 18817 22906 27003 26156 33436 44791 32935 19894 30231 33539 41518 56577
11919 56577 56870 42790 28620 25294 27571 24521 19323 11984 -2370 19188 42236 41282 38559 23184
11905 23184 13883 13781 15494 22014 15921 3744 9872 15554 25553 22502 25428 43128 40422 46431
11891 46431 61130 51934 42000 46144 56976 54510 30410 -3851 5391 14684 26963 29923 38118
11878C8118j923r536l83J5674J684m50L185K400j6235j2032q457L58k780J857
11864A1480R630J2971J4767K509j3255q027n960M143N147j6376n123R864K205
11851B3975J0807j5091K9k841j4853J02J1984J204m168J0284J009n467P98O822
11837B4594j997K711j1698r084j4473l298m61j7872J2489J5603j426J382J3062
11824I532j259l43j652J5166m107N369j749j3245J3157J2658p152j7070K023n903
11810E425O194P428n010J551Q708O484l385j1265p46J5031J5952j0218q044j3678
11796A4427n290j405r282J1281Q069O234k744O430O255N864k522k7381j6809m667
11782a1540J0969J4677P402J465l234R59o085P896O695l505m610r122N977l610
$$ plain form
11878 38118 36195 26659 26276 41950 43634 43184 46369 48769 32534 20502 12045 12403 9623 11480
11864 11480 21110 34081 48848 51357 38102 30075 24115 28258 33405 17029 11906 21770 23975
11851 23975 34782 19691 19720 16879 2026 2128 14112 15316 11148 21432 22441 16974 17772 24594
11837 24594 22597 25308 13610 4526 -9947 -13245 -13706 -31578 -19089 -3486 -4912 -3530 9532
11824 9532 8273 7930 6278 21444 17337 22706 20957 7712 20869 33527 26375 9305 11328 5425
11810 5425 11619 19047 14037 15588 24296 30780 27395 16130 15384 30415 46367 36149 28105 14427
11796 14427 9137 7732 -1550 9731 17800 24034 21290 27720 33975 39839 37317 9936 -6873 -11540
11782 -11540 -571 14106 21508 22973 19739 20698 14613 22509 29204 25699 21089 11967 17944 14334
11768A4334R265j0694q459m225K846J2280Q796L32j2025O880l944k87l577p102
11754D420j6610J1182P150Q01N194J203k5992k356M029O708J0229q389L740J0055
11740A1364o23j4094M125Q036n816l304M894J3359j940Q326m949J022Q061m060
11726B4401k2116j8382q884O075Q328R152J346j1829M147R979j839J751j910Q044
11712H263L020p065l688k209q975J435L950J2118J2841J2043K685l651L640L1
11698C4438j3517j0372L598J835j4247l641R311J3951L638j1882q546J4673J960
11685B1199K784R921j4955L275N60p751Q27J4874m98j0020J3461k917j5852k776
11671A2132j3054L683J663j841O869J4002l454q64Q427P760m338j2462M426p286
$$ plain form
11768 14334 23599 12905 4446 221 3067 15347 24143 24475 12450 19330 15386 15099 11522 4420
11754 4420 -12190 -1008 6142 6943 12137 13340 -12652 -15008 -10979 -4271 5958 -2431 1309 11364
11740 11364 10741 -3353 772 8808 2992 -312 4582 17941 16001 24327 19378 20400 28461 24401
11726 24401 2285 -16097 -24981 -18906 -10578 -1426 -80 -11909 -7762 2217 378 2129 219 8263
11712 8263 11283 4218 530 -1679 -10654 -9219 -5269 6849 19690 31733 34418 30767 34407 34438
11698 34438 20921 10549 14147 15982 1735 -1906 7405 21356 24994 13112 4566 19239 21199
11685 21199 23983 33904 18949 22224 22784 15033 15860 30734 30236 20216 33677 30760 14908 12132
11671 12132 -922 2761 4424 2583 9452 23454 20000 19136 27563 35323 30985 18523 22949 15663
11657A5663j2556p978N893L134J4302N704p176q682j0309K937J0361q970j1657
11644i334l198M275k320P428J2745q352m32J0267Q187o732j8189K540M6L1J3582
11629A0544J5643o151p021o688R388L122r956q499j715P733J437L850J7501P313
11615C6501j1690l26Q880m157j0613k707m420J912l779K580k463n351j9860O986
11601h507K0861p878j8622J89J7636J8609R305n053m304L284m940p720K261J5017
11587C0138K136N745q187j3532j1343k85O529Q124m059r933M920J6423j0064k0464
11573c852J0545P406j8140j3852l497J8455J0362j312N86L933k360k906j4635
11560i267J6302P417j2827m090K1622K930j1849j9798o486n625N19J4824P563
$$ plain form
11657 15663 3107 -4871 1022 4156 18458 24162 16986 8304 -2005 932 11293 2323 -9334
11644 -9334 -12532 -8257 -10577 -3149 9596 1244 812 11079 19266 12534 -5655 -3115 -3069 -3038 10544
11629 10544 26187 20036 13015 6327 15715 18837 8881 382 -1333 6400 7837 11687 29188 36501
11615 36501 24811 24485 33365 29208 18595 15888 11468 13380 9601 12181 9718 4367 -15493 -8507
11601 -8507 12354 4476 -14146 -13957 3679 22288 31593 26540 22236 25520 20580 12860 15121 30138
11587 30138 32274 38019 29832 16300 4957 4672 11201 19325 15266 5333 10253 26676 16612 -3852
11573 -3852 6693 14099 -4041 -17893 -21390 -2935 7427 6115 6701 10634 8274 5368 -9267
11560 -9267 7035 14452 1625 -2465 19157 22087 10238 -9560 -16046 -21671 -21152 -6328 1235
11547A235O277Q218m374O090N493P10r035p236m159J34J6085J3532k148j9956
11533A0866j3767Q856K768j508r620N293M527L051m183K782q276n977n585o54
11519a1427l870Q732R156J0142r981k018J0853r49j2827o207O427J2322J0221
11506B0574j3358q301k579J236J0265r888k256q546P21Q717M618J6259p125q240
11492B097J3324k022j3340j9745J665L429J613L670J3355n611P32q434n577p594
11478b2438l174P056J7815N242m372j0334j1174L850P611P036N271j3010r32J5545
11464C992Q05o418l495N132J1823p353K41L616j1605q900n223J7091J0501j7988
11450g781K138L653j696p843K168J476J6642J7189Q824l542k245q872j7751K381
$$ plain form
11547 1235 7512 15730 11356 17446 22939 23649 14614 7378 3219 3353 19438 32970 30822 10866
11533 10866 -2901 5955 8723 7215 -2405 2888 7415 10466 6283 9065 789 -5188 -10773 -11427
11519 -11427 -15297 -6565 2591 12733 2752 734 11587 10638 -2189 -8396 -1969 10353 20574
11506 20574 7216 -1085 -3664 -2428 7837 -2051 -4307 -12853 -12132 -3415 1203 17462 10337 2097
11492 2097 15421 13399 59 -19686 -18021 -14592 -12979 -9309 4046 -1565 -833 -9267 -14844 -22438
11478 -22438 -25612 -18556 -741 4501 129 -10205 -21379 -17529 -9918 -2882 2389 -10621 -11553 3992
11464 3992 4797 -1621 -5116 16 11839 4486 4727 8343 -3262 -12162 -17385 -294 10207 -7781
11450 -7781 -5643 -1990 -3686 -11529 -9361 -7885 8757 25946 34770 31228 28983 20111 2360 4741
11436D741j325P020K056j432j2503j7976k019j2017k010K1172J6622L31J8492
11423B1152J3914j6678k8997J285Q248o462O851k498j82J9909k0165j1236l67
11410a5226P358Q867o535p192r892M856Q453o15K604K2467K518p530K934M654
11396A7721k3135j0370J083J5240K5774J2136j5163J938m648p409J3174M149l912
11383B6578l813L282K5180r93R688J6636J9515N5141O5346J14188J85678L29099
11371H45525M23506K22350j31800l45247l23885k10357j33143q2018o4835n1343
11361A48753m0115l1329j7620j2878j5055O402J0780j5144Q66J817O073j793m592
11348C6165o904N936K0245M481r634j0818K626J2122J0838m107j8619j0816j9345
$$ plain form
11436 4741 3416 10436 12492 11060 -1443 -19419 -21438 -33455 -35465 -14293 2329 2660 21152
11423 21152 35066 18388 -10609 -9324 -1076 -7538 -687 -3185 -3367 16542 -3623 -14859 -15226
11410 -15226 -7868 999 -5536 -12728 -22620 -17764 -9311 -9926 -7322 15145 17663 10133 13067 17721
11396 17721 -5414 -15784 -14701 539 26313 38449 23286 25224 20576 13167 26341 30490 26578
11383 26578 22765 26047 51227 50234 59922 76558 96073 151214 216560 330748 516426 845525
11371 845525 1269031 1491381 1359581 1014334 690449 480092 346949 264931 200096 148753
11361 148753 108638 77309 59689 46811 31756 38158 48938 33794 34660 36477 42550 40757 36165
11348 36165 29261 35197 55442 59923 50289 39471 42097 54219 65057 60950 42331 31515 12170
11335A2170L115j731j9175o219k645J143j442Q246l84j641Q093J0033P4q837P551
11320H351k175k395N355J686m302J809Q783l541k178j3468j6200Q199J8341K49
11306H514o578K671L0502L86P412K087q239n792p299P535J1900j1535j2683l917
11292A4964j2816l273J1498M422q826j4481r78Q480Q419O874J195m497n678J013
11278F316j0001N538m303j2857P310K3896L547J481r898l89k2969n420J044j800
11264a8505J1895P644K0912J43k354K249R422o5p567o303J3267p136k1125j7103
11250a4626M09J871N976R633J54J847N071R506j0603l320J2348N753N71j4392
11236A0198m072q795j1977J0775q624l514q393J3708N990N39P251J3381m02j4034
$$ plain form
11335 12170 15285 13554 -5621 -11840 -14485 -13342 -14784 -6538 -6922 -8563 -470 9563 9637 800 8351
11320 8351 6176 3781 9136 10822 6520 8329 17112 13571 11393 -2075 -18275 -10076 8265 8514
11306 8514 1936 4607 35109 35495 42907 44994 36755 30963 23664 31199 43099 31564 18881 14964
11292 14964 2148 -1125 10373 14795 5969 -8512 -9490 -1010 7409 14283 15478 10981 5303 6316
11278 6316 -3685 1853 -2450 -15307 -7997 15899 19446 20927 11029 10640 -12329 -17749 -16705 -18505
11264 -18505 -6610 1034 21946 22089 19735 21984 31406 31341 23774 17471 30738 23602 2477 -14626
11250 -14626 -14217 -12346 -6370 3263 3417 5264 10335 19841 9238 5918 18266 24019 24590 10198
11236 10198 6126 -2669 -14646 -3871 -12495 -16009 -24402 -10694 -4704 -4165 3086 16467 16065 2031
11222B031J3901M333K042J469L4499M0227L7811K7748K6548k9436n2599p200J0582
11209A11956j8480l2032j7170j1766m856M218K526l177j564J911k3481j6827n873
11196a4615L407R786O31q600m871K868m53k852J394O315o740K110J5177n301l791
11181e535q15k8774k040P836J3768R426M129m485M112N073L069J4038j1285j0768
11167b251K764j4123N468N778j5176K348J5210N297K893L019J6058k504m434k3525
11153c178j1467K526J0242K5440J8969O913k863J739o204n854j0613J0187J0992
11140D6829Q637Q653o570j2466j2334n486M209J099J308J918M858M807P862o414
11126D6910r455o791J1586J227j1010p190P854O133l119o425J1379J2903j9075
$$ plain form
11222 2031 15932 20265 22307 23776 58275 98502 136313 164061 190609 161173 108574 101374 111956
11209 111956 93476 61444 44274 32508 27652 31870 34396 31219 29655 31566 8085 -8742 -14615
11196 -14615 -11208 -1422 -791 -9391 -14262 -11394 -11847 -14699 -13305 -6990 -13730 -11620 3557 -1744 -5535
11181 -5535 -6350 -35124 -37164 -29328 -15560 -6134 -2005 -6490 -2378 2695 5764 19802 8517 -2251
11167 -2251 513 -13610 -8142 -2364 -17540 -15192 18 5315 8208 11227 27285 24781 20347 -3178
11153 -3178 -14645 -12119 -1877 23563 42532 49445 46582 48321 42117 36263 25650 35837 46829
11140 46829 55466 64119 57549 45083 32749 27263 31472 32571 33879 35797 40655 45462 53324 46910
11126 46910 37455 30664 42250 43477 32467 25277 33131 39264 36145 29720 41099 54002 34927
11113C4927l028j2171K4936K7027O647j6687j6782k4230j6163k039j632q995l423
11100a1613Q840Q335q101j1821l858K705J2391O804K203j4340K2241L8347n314
11087D6819m1427K0429M6386K4152p223O203J3514K522n335j2107Q287Q834R814
11074A20868j6497j8279j160M505K826j109q829j5421j8901j4290P278J8205K7357
11061H6553J8333j909O702P670j1618j1277p477M702L017L265M7325P5637Q8642
11048C09565N0743k6866n5178l8883M199N1001J00170J01817J05719Q6218J07288
11037G95793K17013M57250O28708L56932j72785n25330n09168l40378k18238j33016
11027E56781q8305o6805n4677l9657k8644k3515j5318k2523j531Q595J6007K5073
$$ plain form
11113 34927 31899 19728 44664 71691 78338 61651 44869 20639 4476 2437 805 -8190 -11613
11100 -11613 -2773 5562 -2539 -14360 -18218 -15513 -3122 3682 5885 -8455 13786 52133 46819
11087 46819 5392 25821 72207 96359 89136 95339 108853 111375 106040 93933 102220 111054 120868
11074 120868 104371 86092 84932 89437 92263 91154 82325 66904 48003 33713 40991 59196 86553
11061 86553 104886 102977 109679 117349 105731 94454 86977 91679 94696 97961 145286 220923 309565
11048 309565 360308 333442 278264 239381 243580 294581 394751 496568 602287 688505 795793
11037 795793 1012806 1470056 2098764 2455696 2282911 1757581 1248413 908035 689797 556781
11027 556781 468476 401671 346994 307337 278693 255178 239860 217337 215806 224401 240408 265481
11015B65481J7376J0118K8424j915n917J2609J4632J1284K1021M6640N0557L4673
11003E04983J5211L2837L1882K0759L3750N3812Q2797M2435K9677J7265K4857
10992H90265Q0887J22196J56279K12649L20477M45574N71962M69854R8188j79580
10982C188751j81986p7911N6543K27490L93008N45401P06460R00066J143508J482673
10972H384003K007595K649359L567805N164425Q057590J3356526K3341790M2043414
10964A08572507P0434122P6536361K2040101m1289559o5238061n4351996l6981186
10957G9722289k3646086j5073119r902875o797831m885809l669322k838010k195145
10949A0714092j689797j275250r57181p57368o59723n44186m42256l72133k37985
$$ plain form
11015 265481 282857 292975 321399 319484 313567 326176 340808 352092 373113 419753 470310 504983
11003 504983 520194 553031 584913 605672 639422 693234 776031 818466 848143 865408 890265
10992 890265 971152 1093348 1249627 1462276 1782753 2228327 2800289 3270143 3368331 3188751
10982 3188751 3006765 2928854 2985397 3212887 3605895 4151296 4857756 5757822 6901330 8384003
10972 8384003 10391598 13040957 16608762 21773187 29830777 43187303 66529093 108572507
10964 108572507 179006629 255542990 277583091 236293532 171055471 116703475 79722289
10957 79722289 56076203 41003084 31100209 24302378 19416569 15747247 12909237 10714092
10949 10714092 9024295 7749045 6791864 6034496 5374773 4830587 4388331 4016198 3778213
10940C778213n4938J15452m1594l23441m78449m36469l04747k15434j73526j55146
10930A709921j51025j49504j16011n8246n8923o5711n4545o4736n4554l7817k7024
10919H71825j7941j4313l1295j0656j7214m2525l6250k5363J396j7971l4077j6316
10907F09300m279k0802o666j5890l4219k5882q903k7717j9188l1989j8546j5279
10895C79940n394m523j2213j6181q627j5193m745j0518m906j6055l449n108o618
10882B66410M084K7375P592m107j4340l546j6094j0373p055q70n476K993n946
10869B40647j3058j3158K012N049j1523j0643K878Q756M531q825k6665k2505k3722
10856A33774k1576n107N752M51m600J7954Q204k1426j4229K860j131r992j2810
$$ plain form
10940 3778213 3723275 3838727 3797133 3473692 2995243 2558774 2254027 2038593 1865067 1709921
10930 1709921 1558896 1409392 1293381 1235135 1176212 1110501 1055956 991220 936666 898849 871825
10919 871825 853884 839571 808276 797620 780406 737881 701631 676268 677664 659693 625616 609300
10907 609300 605021 584219 577553 561663 527444 501562 492659 464942 445754 413765 395219 379940
10895 379940 374546 370023 357810 341629 333002 317809 313064 302546 297640 281585 278136 273028 266410
10882 266410 270494 297869 305461 301354 287014 283468 267374 257001 249946 249076 243600 246593 240647
10869 240647 227589 214431 216443 221492 209969 199326 202204 210960 215491 206666 180001 157496 133774
10856 133774 112198 107091 112843 113294 108694 126648 134852 113426 99197 102057 100926 90934 78124
10843G8124k119J0963N993K3181M5814J5829J2951J7847J5041j7464j2571k0251
10831A73338n424q47j5228L133p954j3490j5540k352lm980K822Q165j3232r334
10817I9074K624j4987j8753j3726l449r559q270j1076j1287M96J4975J3275Q466
10804D7803N465Q58n323J57N97m171J1606J8634N110O898k7836k6864j597J2001
10790D3338P783N679M916n10j6521j8080j0009J0259L010L432J99j915K873P149
10776D1603m151N152J9335J3988J4881j4823k8174L168L812j7452j4136R172J7335
10763D9710J0377Q868O538j1935j2812Q433O131L752L386j786M039j1244k9093
10750C4364n569J2248J1225J6368K0287N089j2321L056N889R027K741k3042K42
$$ plain form
10843 78124 76005 86968 92961 116142 161956 177785 190736 208583 223624 206160 193589 173338
10831 173338 167914 167067 151839 154972 147018 133528 117988 115636 115633 110653 113475 121640 108408 99074
10817 99074 101698 86711 67958 54232 50783 41224 32954 21878 10591 11087 26062 39337 47803
10804 47803 53268 54126 48803 48960 49557 45386 56992 75626 80736 87634 59798 32934 31337 43338
10790 43338 51121 56800 61716 61206 44685 26605 16596 26855 29865 33297 33496 31581 34454 41603
10776 41603 37452 42604 61939 75927 90808 75985 47811 50979 54791 37339 23203 32375 49710
10763 49710 60087 68955 75493 63558 50746 59179 65310 69062 72448 70662 74701 63457 34364
10750 34364 28795 41043 52268 68636 88923 94012 81691 84747 90636 99663 102404 79362 79604
10737G9604k940j4259q336m359p248r541J812O899J3244n619N212O249r311j2214
10723C9193n932O939M916L31M69l164k022J807r415m544m627j937J6964N828Q095
10708E2901j751n676O850N186O824j0287k6576j117K1596J9324n850l312J2906
10695G1018q336r998j4411M346n578l655J2151K287M800p59k177n319r494l699
10681C1176N118O987P14N622N122n525j0498k404J3210J3422n937l218j0575J0992
10667E4206p743J006N90n05p078j8501m595J0877R624K903q161N851k278j6800
10653A9396l931J4440J3565L830j3538J0215O746p994q908j1327j7648N026R715
10640A9587J0035j5959q841O114M382Q833n368l426j683P416k611n834P205n342
$$ plain form
10737 79604 76664 62405 54069 49710 42462 32921 34733 41632 54876 49257 54469 60718 51407 39193
10723 39193 33261 40200 45116 45447 45916 42752 40730 42537 33122 28578 23951 22014 38978 44806 52901
10708 52901 51150 45474 52324 57510 64334 54047 27471 26354 47950 67274 61424 58112 71018
10695 71018 62682 52684 38273 42619 37041 33386 45537 47824 52624 51865 49688 44369 34875 31176
10681 31176 36294 43281 43995 49617 54739 49214 38716 36312 49522 62944 57007 53789 43214 54206
10667 54206 46463 47469 48059 47554 40476 21975 17380 28257 37881 40784 32623 38474 36196 19396
10653 19396 15465 29905 43470 47300 33762 43977 50723 42729 33821 22494 4846 9872 19587
10640 19587 29622 13663 4822 10936 15318 24151 18783 15357 13674 21090 18479 12645 19850 14508
10626A4508K5230K0379k1499k2617n006J1251J8417J0689P665j4393r579o413
10614B8632q594J766J834N964R372l974n705Q307n155p942m377j3759K845N143
10600A4357Q547q751o310M363M882J0135J800l299L324k411n88J0555m67q035
10586B8102l683k134n4Q955j0621j1858N301l13r140k228N642l000J303K377L800
10571A2449J1537L71Q166O162l175P943J4318L102j8181j402J733J2183K9791
10558H4997K5382L534L0997M8982O9517J04362J65828K96501M13168K42071j22474
10547A362865l17923k92242k22894j41779j06760o4104l8525k3621l0832k0854
10537A03331j7470j7078k3390l820K844K900M547o910j6557j7588j1982o47N964
$$ plain form
10626 14508 39738 60117 38618 16001 10995 22246 40663 51352 59017 44624 35045 28632
10614 28632 20038 21804 23638 29602 38974 35000 29295 37602 32447 24505 20128 6369 9214 14357
10600 14357 22904 14153 7843 12206 17088 27223 29023 25724 29048 26637 26049 36604 36137 28102
10586 28102 24419 22285 22231 31186 20565 8707 14008 13695 4555 2327 7969 4969 6272 8649 12449
10571 12449 23986 24357 32523 38685 35510 43453 57771 60873 42692 41290 43023 55206 84997
10558 84997 110379 113913 144910 193892 263409 367771 533599 830100 1243268 1485339 1362865
10547 1362865 1044942 752700 529806 388027 281267 217163 178638 155017 124185 103331
10537 103331 85861 68783 45393 41573 44417 47317 51864 44954 28397 10809 -1173 -1820 4144
10524D144J0676L96N47J2957n032o960n001j686n09L18l706N961o21M789J2893
10509B9166j5236k2093J0395J9330o93K513r06M868k969Q727K261j1244Q88n135
10495A9872N819p187j0123o531q239L319Q521J9578N599j863l965K451K896l585
10481B6562K669L783p301j5360p598m156K0572J511m617J5411k696k0792l048
10468D940j4703q106M071k537J080l647J4585J5676M825j0819q428m000M279L238
10454D54o162L978J3407J2160R080k382q796L851J3897j0992P1j1555j2538J0073
10440A4546K506m769k311o069J0986j0495r936k869O352N090Q144l201L318L05
10426A1597j451K187J3167r845p725M645p276J5636K0174m617j8231p875j0953
$$ plain form
10524 4144 14820 15216 15763 28720 23688 16728 11727 10041 9532 9850 6144 12105 11484 16273 29166
10509 29166 13930 -8163 2232 21562 20869 23382 22476 27344 24375 33102 35363 24119 25007 19872
10495 19872 25691 18504 8381 1850 -6389 -3070 5451 25029 30628 28765 24800 27251 30147 26562
10481 26562 29231 33014 25713 10353 2755 -1401 19171 20682 16065 31476 28780 7988 4940
10468 4940 -9763 -17869 -13798 -16335 -15255 -18902 -4317 11359 16184 5365 -3063 -7063 -2784 454
10454 454 -5708 -1730 11677 23837 32917 30535 21739 25590 39487 28495 28566 17011 4473 14546
10440 14546 17052 12283 9972 3903 14889 4394 -5542 -8411 -2059 3031 11175 7974 11292 11597
10426 11597 10146 12333 25500 15655 7930 12575 5299 20935 41109 36492 18261 10386 -567
10413e67J572J5256J758j3254j3126M937J5748O264J894n761P723Q478j173q376
10399B1373k3047j2641N408J3288j8726J790Q600P06m989J4346N41j1464J1248
10386F433O832k779j72J549N935l744L075q465n510L100n424J042r265L590M618
10371H15R082J0508k399k261M348Q54J2925M984j085p289m308M989L557l803N208
10356C6125J1630P774j010M532J7703K9278M7770Q4073J02133J10836J09417J28730
10344F88991J20618J05243P2730J4651o376n1012p5191j08616j17024j21957j03709
10333D18348r2151q5004n9165m1124k7201k9725m016j90k0420k0157q250p851
10321B3094k4220j602J5988N527N54o953p24J772N811O680K807j4127k5390K84
$$ plain form
10413 -567 1005 16261 18019 4765 -8361 -3424 12324 18588 20482 14721 22444 30922 29749 21373
10399 21373 -1674 -14315 -8907 4381 -14345 -12555 -3955 -3249 -8238 6108 6649 -4815 6433
10386 6433 13265 10486 10314 11863 17798 14054 17129 8664 3154 6254 830 1872 -7393 -3803 815
10371 815 9897 20405 18006 15745 20093 20947 33872 38856 37771 30482 26174 31163 34720 30917 36125
10356 36125 47755 55529 54519 59051 76754 106032 153802 237875 340008 450844 560261 688991
10344 688991 809609 914852 987582 1002233 995857 944845 869654 761038 644014 522057 418348
10333 418348 326197 241193 182028 140904 113703 83978 79962 79772 59352 39195 30945 23094
10321 23094 -1126 -2728 13260 18787 19341 12388 11664 13436 19247 25927 28734 14607 -10783 -10499
10307a0499J4240J1881J0529o267N592P84P712K410r398n24j1801l99M021j7608
10293F73j0110P955P92j1197J3428J1509N805J5530M176O129q206m283p160k0032
10279E009p703l079J32J022M102r52O859O93j9309l325o09M081K851M468O287
10264E27J8304P9J210o515q439N173J0976n208m816q612N96P795m407J508j1495
10249c324o142J1392j30q452K195K6482P530j6248q651k530p587K7552M305j2562
10235A3830P061r611M613J937l180J767n491J904J7055K761j2709k3285J696M465
10221B813k2426j014P917n705J2430J1475l517n509J0656K697K795J0558L613
10208B6783J9m368n520j4739K483k25m130K043K179j25J1528M449n759Q803k418
$$ plain form
10307 -10499 3741 15622 26151 19884 25476 26260 33972 36382 26984 26460 14659 14260 18281 673
10293 673 -9437 -1482 -690 -11887 1541 13050 18855 34385 38561 44690 36484 32201 25041 5009
10279 5009 -2694 -5773 -5641 -4619 -517 -1469 5390 6083 -13226 -16551 -17160 -13079 -10228 -5760 527
10264 527 18831 18910 20120 13605 5166 10339 21315 16107 11291 2679 3275 11070 6663 8171 -3324
10249 -3324 -9466 1926 1796 -6656 -4461 22021 29551 13303 4652 2122 -5465 22087 26392 13830
10235 13830 20891 11280 15893 17830 14650 16417 10926 12830 29885 32646 19937 -3348 -1652 2813
10221 2813 -19613 -20627 -12710 -18415 -5985 5490 1973 -3536 7120 9817 12612 23170 26783
10208 26783 26802 22434 16914 2175 4658 4433 303 2346 4525 4400 15928 20377 14618 23421 21003
10193B1003j454j6882q956O619J0198L526j6575j177J1790N975k323M764j3608
10180B900L641j0619o743J2857Q672J1240r571j2199P518j3105k6100M682K6275
10167e52P570k1238K202J9735J273k655O351J4414j585p428q013j3852M47P711
10153D380P867p335o809l723j0470k991O134N08j742M77O567J3410M840M574r692
10138E995k3682o919k546P001J0404l754m85N399M716j509o071q892l839J5479
10124h703J7914N366L558J42J337j4090P086K166M450k680n215k1569j5190K2181
10110c247J1528m935r173M030o510O036P295M757J240m994q711j107J746J6818
10096A4773r978j2549r544j156J1359O731M927m771L174K0019Q412l401j3717
$$ plain form
10193 21003 19549 2667 -6289 330 10528 14054 -2521 -3698 8092 14067 11744 16508 2900
10180 2900 6541 -4078 -10821 2036 10708 21948 12377 178 7696 -5409 -31509 -26827 -552
10167 -552 7018 -14220 -12018 7717 8990 6335 12686 27100 25515 18087 10074 -3778 -3331 4380
10153 4380 12247 4912 -1897 -5620 -16090 -19081 -12947 -12439 -14181 -13704 -7137 6273 11113 15687 5995
10138 5995 -17687 -24606 -27152 -20151 -9747 -13501 -13986 -8587 -3871 -5380 -11451 -20343 -24182 -8703
10124 -8703 9211 14577 18135 18277 19614 5524 12610 14776 19226 16546 11331 -10238 -25428 -3247
10110 -3247 8281 3346 -5827 -1797 -8307 -2271 5024 9781 11021 6027 -2684 -3791 -2045 14773
10096 14773 4795 -7754 -17298 -18454 -7095 -364 4563 -208 2966 22985 31397 27996 14279
10083A4279j3849l114P420K706J898r32M530L934N60j4381j7495l33J0485k391
10069f683K537J6025R469j8834q574K816m195J5644M777j3125J945j5009o301
10056a9508J7177K3561j1383k707J1955q235R536J2432j610j1364l1401J37J0246
10043a164k659O917J1439J2780Q31M126p065l765j1458J3738k429j2621O54j498
10029G826M195q198p514n7L196L761r48m360j2098M541p284j3287Q71J6337N290
10014g729m73L802L564J577P109j2994m938L909R769l862r672N630J4269o310
10000C651j344J822l717P553j149k317k607N943p41K937l31k763j3244j0787J14
9985a6980k090K073R398J2287k710j2978j8638P354J7442p354q28J1208P386K862
$$ plain form
10083 14279 430 -2684 4736 7442 9340 8408 12938 16872 17432 3051 -14444 -14777 -4292 -6683
10069 -6683 -4146 11879 21348 2514 -6060 -3244 -7439 8205 12982 -143 1802 -13207 -19508
10056 -19508 -2331 21230 9847 7140 19095 10860 20396 32828 31218 19854 -11547 -11410 -1164
10043 -1164 -3823 3094 14533 27313 28144 32270 25205 21440 9982 23720 21291 8670 9324 7826
10029 7826 12021 3823 -3691 -3748 -552 3209 2261 -2099 -14197 -9656 -16940 -30227 -29356 -13019 -7729
10014 -7729 -8202 -4400 -836 741 7850 -5144 -10082 -6173 3596 -266 -9938 -4308 9961 3651
10000 3651 2307 4129 412 7965 6816 4499 1892 7835 7094 10031 9700 6937 -6307 -17094 -16980
9985 -16980 -19070 -16997 -7599 4688 1978 -11000 -29638 -22284 -4842 -12196 -13024 -1816 5570 8432
9971H432j5733j9395l328J2826N354O35O855o677l158O522q838l426j244P71J7090
9956c314J0362n29j2259j937M20R012L307m58l397q384K997J8208R070j0908P51
9941A2941M5m951j2038L522J8552M872O806n545K065j1986j7953l045j953P279
9927a389J4881J607o929j3009j5219P873R846J5002j910J844j0040j9994K653
9914a4784J3632L491R80j874r519R022Q969m930j0444j8251O557J6652M260j908
9900A853k454l280J715K658j4530q515J1175J2247J0591K3866K766j1876j6359
9887I857M130O733o225l92K421o502j1281N773J0007m75m33l884m666m682M255
9872D636P99J237M099n869J161Q355r857j010J3192n149j2895N087K161o005q303
$$ plain form
9971 8432 -7301 -26696 -30024 -17198 -11844 -11209 -4354 -11031 -14189 -7667 -16505 -19931 -21175 -20404 -3314
9956 -3314 7048 6519 -5740 -7677 -7257 1755 5062 4604 1207 -7177 -4180 14028 23098 12190 12941
9941 12941 12986 8035 -4003 -481 18071 22943 29749 24204 26269 14283 -3670 -6715 -8668 -1389
9927 -1389 13492 15099 8170 -4839 -20058 -12185 -2339 12663 10753 12597 2557 -17437 -14784
9914 -14784 -1152 2339 3319 1445 -8074 948 9917 4987 -5457 -23708 -17151 -499 3761 1853
9900 1853 -601 -3881 -2166 492 -14038 -22553 -11378 869 11460 35326 38092 26216 9857
9887 9857 13987 20720 14495 14103 16524 10022 -1259 4514 14521 14046 13613 9729 5063 381 4636
9872 4636 5435 6672 10771 4902 6063 14418 4561 3551 16743 11594 -1301 3786 5947 -58 -8361
9857h361N482L361J7349J8122K516j9346j2285P502L70k181L844K521j087n834
9843A1973j1847P938N567k558m576l036K288k750j2592k169Q566L765J9529N400
9829B5498L069l827q568J355R929j5677j1883k062K112k410n613j369N829J2834
9815I217Q750j469j4536j3024J1876J3393K584J756p867M73N350j998r036N93
9801F062k529j3591o941m22R140P573n342n247J0247J718j0025q780k52J7489
9787i00J4148o031l74m004N414J1807P782l823m795j1135j5535m717M018M670
9773c475j663j3535j7809Q052R314j416o137o973L754J2042J6101J1873j2721
9760b593k4664P29N732n888j4940N209K3828R699k514j852P849J1714K553l180
$$ plain form
9857 -8361 -2879 482 17831 35953 38469 19123 6838 14340 14710 12529 16373 18894 17807 11973
9843 11973 126 8064 13631 11073 6497 3461 5749 2999 -9593 -11762 -3196 569 20098 25498
9829 25498 28567 24740 16172 17527 27456 11779 -104 -2166 -54 -2464 -8077 -9446 -3617 9217
9815 9217 17967 16498 1962 -11062 814 14207 16791 18547 10680 11153 16503 14505 5469 6062
9801 6062 3533 -10058 -16999 -17421 -8281 -708 -6050 -11297 -1050 668 -9357 -18137 -18389 -900
9787 -900 13248 7217 6843 2839 8253 20060 27842 24019 19224 8089 -7446 -12163 -8145 -3475
9773 -3475 -5138 -18673 -36482 -28430 -19116 -20532 -26669 -33642 -29888 -17846 -1745 10128 -2593
9760 -2593 -27257 -26528 -20796 -26684 -41624 -36415 -12587 -2888 -5402 -7254 595 12309 14862 11682
9746A1682j4868Q403R043k887r019j0921j2835Q191P260p790k091J126J2586j962
9732d082j327M456K645L164Q480Q34m545j2109l679Q039P386o208M449k923r489
9717d909O39n336M549J2629l645j4703j5324J910J0426J047J4587O966J0123q44
9703A8115j314m250j1734k928p92J611n308l91j257j2080O118P311N076M861J6
9688C054j4928L855L843l229K86O707J0277o240l8p467j2838J8160n760o231j0561
9673b1110j7954R813J1367L777P556R208Q444q606m084j287k0041m129P597J6366
9659c083J0901N5j1106j444m684L553J2820j531Q183L554o752j3451q460J4283
9645B838l505k501O472p382M998J2680o417j4584q869L197M023o885q61J6225
$$ plain form
9746 11682 -3186 5217 14260 11373 2354 -8567 -21402 -13211 -5951 -13741 -15832 -14706 -2120 -4082
9732 -4082 -5409 -953 1692 4856 13336 14170 9625 -2484 -6163 1876 9262 3054 7503 4580 -4909
9717 -4909 -4270 -9606 -5057 7572 3927 -10776 -26100 -24190 -13764 -12717 1870 8836 18959 18115
9703 18115 16801 12551 817 -2111 -2903 -1292 -6600 -6991 -8248 -20328 -14210 -6899 -1823 3038 3054
9688 3054 -11874 -8019 -4176 -7405 -7119 -412 9865 3625 3587 -3880 -16718 1442 -4318 -10549 -21110
9673 -21110 -39064 -29251 -17884 -14107 -6551 2657 11101 2495 -1589 -2876 -22917 -27046 -19449 -3083
9659 -3083 7818 7873 -3233 -4677 -9361 -5808 7012 5481 13664 17218 10466 -2985 -11445 2838
9645 2838 -667 -3168 3304 -4078 920 13600 7183 -7401 -16270 -13073 -9050 -15935 -16796 -571
9631e71r021l098J3625K341J563R52J9630l88l620Q45q209q180K548l965o30Q309
9615A2131O823R117r552j225m880k331k129l206k977o686q16N5p831K69K438r683
9599b0483J3496J8555k296j9009j778N315M492P780J5039M131j8659M16N673p157
9585E515j5946J0586J6707J2740o284r674J2777p142j25j2301o925j3028K998
9572a0102O910n514j0104m510J3740J345o024R462J1331L128j759m096P466J1359
9558B2632j7514j299l674l890P107n601O73l930O669k948r42K536M236M597L639
9543A2291M4n828j4101o040J2037l587M938M691J9227L168q545p890j0054l057
9529b706n7R75P399m815L951N600N699j041j6255q728Q43n405K898l518q265J9404
$$ plain form
9631 -571 -9592 -12690 935 3276 4839 5791 25421 25033 21413 22258 14049 5869 8417 4452 3822 12131
9615 12131 18954 28071 18519 17294 12414 10083 7954 4748 1771 -4915 -5731 -5676 -13507 -13238 -10800 -20483
9599 -20483 -6987 11568 9272 -9737 -11515 -6200 -1708 6072 21111 25242 6583 6999 12672 5515
9585 5515 -10431 155 16862 29602 23318 13644 26421 19279 19154 6853 -72 -13100 -10102
9572 -10102 -3192 -8706 -18810 -23320 -9580 -8235 -14259 -4797 6534 9662 7903 3807 11273 22632
9558 22632 5118 3819 145 -3745 3362 -2239 -1566 -5496 1173 -1775 -2717 -181 4055 8652 12291
9543 12291 12335 6507 -7594 -13634 -1597 -5184 -246 4445 23672 26840 18295 10405 351 -2706
9529 -2706 -2763 -1788 5611 796 4747 10347 16046 15005 -1250 -9978 -9135 -14540 -11642 -15160 -23425 -4021
9513d021l108j1006j1963Q355J4929J1296l130J2865J5457j4657j2352q688m656
9500a0679m349M615J9901r753l694n934O535M985P502j783r358Q991L467N64q78
9485A0132L058N20r079J603J3536r236j6602j0012J497J3960R255r518m939Q198
9471B373l122J3826J3818l324p308P61j0557j3951N763o335k2677N520J1166R829
9457d218R517N974j5552o098P286J0294N462q292p166m360M059K313n235j825
9443g841k1180j07J2288k83J2862j553n047J1561J7650p43j0981j4784K391p056
9429a2823J1333O373j903P965P100j2531k397L984j905p003o166j0379J0194N155
9415c003O818N097j0882q16K338o235l236J1097l523N343J1973L395M212k748
$$ plain form
9513 -4021 -7129 -18135 -30098 -21743 -6814 4482 1352 14217 29674 15017 2665 -6023 -10679
9500 -10679 -15028 -10413 9488 -265 -3959 -9893 -3358 1627 9129 7346 -2012 6979 10446 11010 10132
9485 10132 13190 13710 4631 6234 19770 10534 -6068 -16080 -14583 -623 8632 -886 -5825 2373
9471 2373 -749 13077 26895 23571 16263 17024 6467 -7484 -1721 -8056 -30733 -25213 -14047 -4218
9457 -4218 5299 11273 -4279 -10377 -3091 7203 12665 4373 -2793 -7153 -3094 -781 -6016 -7841
9443 -7841 -29021 -29128 -16840 -17123 -4261 -5814 -10861 700 18350 17607 6626 -8158 -5767 -12823
9429 -12823 -1490 4883 2980 10945 18045 5514 3117 7101 5196 -1807 -7973 -18352 -8158 -3003
9415 -3003 3815 8912 -1970 -2786 -448 -6683 -9919 1178 -2345 2998 14971 18366 22578 19830
9401A9830o159j0289Q549L411j1484L179K3713n440n956k794M790P57J305R51
9387B4363j7033j2520m35j0111j0648Q355J7376L757J6609J6379q396j5505n847
9374F344j3479p504J3991J6741N491k006k028P474l820J227L635M339j1417j1032
9360G956n996J009J5575M416j8687l729L401o321J0264J7337L467l812O298P74
9346C1952o401k695j759O185R724K062o608N2O867m149K375Q124j0427r143Q383
9331C4542K482Q06l034J5156m435L17P736P89M98k252n7N418P543J1514m367l170
9315F9486m253m502J7892J2109O7Q851N717N116q095n650J4269P767k257J9996
9301A36513K5386N760N610J4294R730L592l608J2409L1925L4281K7669K1652K7173
$$ plain form
9401 19830 13671 3382 11931 15342 3858 7037 30750 25310 19354 16560 21350 22107 23412 24363
9387 24363 7330 -5190 -5625 -15736 -26384 -18029 -653 3104 19713 36092 27696 12191 6344
9374 6344 -7135 -14639 -648 16093 21584 19578 17550 25024 21204 22431 26066 30405 18988 7956
9360 7956 1960 2969 18544 22960 4273 544 3945 -2376 7888 25225 28692 24880 31178 31952
9346 31952 25551 22856 21097 27282 37006 39068 32460 32512 39379 35230 37605 45729 35302 26159 34542
9331 34542 37024 37830 34796 49952 45517 45834 53570 54359 54857 52605 52548 57966 65509 77023 72656 69486
9315 69486 65233 60731 78623 90732 90799 99650 105367 110483 102388 96738 111007 118774 116517 136513
9301 136513 161899 167659 173269 187563 197293 200885 197277 209686 241611 275892 303561 325213 352386
9288C52386L8397L7552K9261N0027L7929K4079L7501N5009O1415N0492M7193N9873
9276H81114N7234N1759J7736J7012K5307N696j1563j5916l1586n8614n0795n0808
9264H36576p0016l8590m3431m3968l7560m1465l5914m6248l7479l0722l8043l9820
9252C33320k5588l3468k4989M202o612k2910j5316k566j2095p933k7883j0768
9240A47394q042j8028r866j1287r257K381r133m529q088R49k352M183J7828O622
9226I8775j3597q01j064j680M35p045n257j912j6827j5081j311R519N949M269
9212E4372l330j0848j2366R869l0o64N04J1012r80r296J1510O986j7935j0567
9198B8237k2528j5585P355K6383O951M821P045Q896J473j6229j1782k032m87N174
$$ plain form
9288 352386 390783 428335 457596 507623 545552 569631 607132 662141 723556 774048 821241 881114
9276 881114 938348 990107 1007843 1024855 1050162 1055858 1044295 1028379 996793 938179 887384 836576
9264 836576 766560 727970 684539 640571 603011 561546 525632 479384 441905 411183 373140 333320
9252 333320 307732 274264 249275 253477 246865 223955 208639 206073 193978 186045 158162 147394
9240 147394 139352 121324 111458 100171 90914 93295 84162 79633 71545 72494 70142 74325 92153 98775
9226 98775 85178 84377 83313 81633 82068 75023 69766 67854 51027 35946 34635 44154 50103 54372
9212 54372 51042 40194 27828 37697 37667 37003 37507 48519 47539 38243 49753 56739 38804 28237
9198 28237 5709 -9876 -2521 23862 30813 35634 42679 51575 53048 36819 25037 23005 22518 27692
9184B7692n937M465L707J0730L379O176n311k9815l391k418j481K506K1893J016
9170C3211j3323o307n3L595J4415J662j4397J0502o63n456R005l324J802N737
9156C6406j1728j5576k2029r975N056J8757m007O714L469K0732j019k1315o083
9143e98l083j871L568J9266Q234Q444R110J37J507M909q807j5970j0838M235m116
9128A4127P50P40l292Q62J7392j2127j4433J1048J0583j821q34M718m001O275
9114B9987k385q779N107q410K974m294P685j336j4274m583P816J0428j779p666
9100A0491j1378k567J0268O020O645j885n826J962n61j4024M366J4494R396r076
9086A8325o797J669K938j970j0511R15R877q26J2978l538m224L826k21K217p877
$$ plain form
9184 27692 21755 26220 29927 40657 44036 50212 44901 15086 11695 9277 7796 10302 32195 33211
9170 33211 19888 13581 13528 17123 31538 33200 18803 29305 28642 23186 32191 28867 30669 36406
9156 36406 24678 9102 -12927 -22902 -17846 911 -3096 3618 7087 27819 26800 5485 -598
9143 -598 -3681 -5552 -1984 17282 25516 33960 43070 43207 44714 49623 40816 24846 14008 18243 14127
9128 14127 14877 15617 12325 13187 30579 18452 4019 15067 25650 23829 22995 27713 23712 29987
9114 29987 27602 18823 23930 15520 18494 14200 21885 20549 6275 1692 9508 19936 18157 10491
9100 10491 -887 -3454 6814 12834 19479 17594 11768 13730 13169 -855 3511 18005 27401 18325
9086 18325 11528 13197 16135 14165 3654 4569 14446 13620 26598 23060 18836 22662 22441 24658 16781
9071A6781j3206n285J6875M179r861N073r919r815O538L335L626j672j8108P418
9057d041P385j783k777q513j865K0433P395P942j813p760q07j587l41o663l039
9042B166J895N516K988l127m766Q224N001k334q717Q384r121q018p664k265K2235
9027A0397M136o970J299J33n048m200J625J3787K293j5390j0087K140N068p987
9013h804k077L021JL811Q626N806K1493L407l1427j2783q736j3502R998R537R854
8998a775K843j1170n455J7304Q714r674k261M795N976K0794n876j4807k1156n524
8984a7272J3361J7277j636O72k794l0316P719J5863K45N565L226j333j8896L385
8970d934o570j1436P462N857N436j653n853O029N550J6530N6j7015j2032n08m9
$$ plain form
9071 16781 3575 -1710 15165 19344 9483 14556 4637 -5178 1360 4695 8321 6649 -11459 -4041
9057 -4041 3344 1561 -1216 -9729 -11594 8839 16234 24176 22363 14603 13796 12209 11868 5205 2166
9042 2166 4061 9577 12565 9438 4672 12896 17897 15563 6846 15230 6109 -1909 -9573 -11838 10397
9027 10397 14533 7563 8862 8995 3947 -253 1372 15159 17452 2062 -8025 -5885 -817 -8804
9013 -8804 -10881 -7860 -7859 -4048 4578 10384 31877 35284 3857 -8926 -17662 -31164 -21166 -11629 -1775
8998 -1775 1068 -10102 -15557 1747 10461 787 -1474 3321 9297 30091 24215 9408 -11748 -17272
8984 -17272 -3911 13366 11730 12402 9608 -20708 -12989 2874 3119 8684 11910 10577 -8319 -4934
8970 -4934 -11504 -22940 -15478 -9621 -4185 -5838 -11691 -5662 -112 16418 16474 -541 -12573 -13081 -13130
8955a3130J6719J2702q121o313p416n88n008J25O429p102r646m017J109Q620l964
8940a9601j171l726K804j917L592K730N259J1570j1448M213L041l862K941J4054
8926H479J10j272R056o501M270N228L998o470j9342M939J5170j539n026r557N951
8911G494m398n74o17j409n126O317R090L415k507j20k233j8011p42N315Q298n037
8895h45p00P211P280p257m343O808j4004P046N661k940R596j864j0647R359R317
8880A9678j0075l095o850j7063p805P630J0817P402P929J5419K144l093j0910
8867A2128M635P827J481P057k672q124r157j1870j3665M760N784R873l278o753
8853a974j590L187P042Q92J1341r826j6624P10m096M002j2539j0684J4397J8517
$$ plain form
8955 -13130 3589 16291 8170 1857 -5559 -6147 -11155 -11030 -4601 -11703 -21349 -25366 -24257 -15637 -19601
8940 -19601 -20772 -24498 -21694 -23611 -20019 -17289 -12030 -460 -11908 -7695 -4654 -8516 -5575 8479
8926 8479 8589 7317 16373 9872 14142 19370 23368 16898 -2444 2495 17665 16126 11100 1543 7494
8911 7494 3096 2522 1905 496 -4630 1687 10777 14192 11685 11565 9332 -8679 -9421 -4106 4192 -845
8895 -845 -1545 5666 12946 5689 1346 8154 -5850 1196 6857 3917 13513 11649 1002 10361 19678
8880 19678 9603 6508 -342 -17405 -25210 -17580 -6763 639 8568 23987 26131 23038 12128
8867 12128 16763 24590 26071 33128 30456 22332 13175 1305 -12360 -7600 -1816 8057 4779 -1974
8853 -1974 -3564 -377 6665 7557 18898 9072 -7552 -6842 -10938 -6936 -19475 -30159 -15762 2755
8839B755n842k272n075k407j6645P854J8917L452J822j0395j0380R118J2564j5306
8825a1840o518L852N548p618K844l738O411l706m007O702q807l885K915J1578
8811a0269q462K4363N394j1368j6305j0123J0321O213j560K4949M131p447q462
8798A375m963N552P060l629r153j1976r217l167N73J4106m022j2571j2491J4892
8784b7631R617J2845J3891L821j083O518k810p497j0707j6538j2108P397R824
8771a4461o476n916o556O788P598K701Q822J6182M817k2590K722N349K186j3413
8757a2247j6569O038J2332K5j374q511J329K134J9574J7749J141L959j1297j1481
8743B802l126k537n566k347Q524O277o930n809K3226R192m757p207q720m280m972
$$ plain form
8839 2755 -3087 -5359 -10434 -12841 -29486 -21632 -2715 737 2559 -7836 -18216 -9098 3466 -11840
8825 -11840 -18358 -14506 -8958 -16576 -13732 -17470 -11059 -14765 -18772 -12070 -20877 -24762 -21847 -10269
8811 -10269 -18731 5632 11026 -342 -16647 -26770 -16449 -10236 -11796 13153 17284 9837 1375
8798 1375 -3588 1964 9024 5395 -3758 -15734 -24951 -28118 -27545 -13439 -17461 -30032 -42523 -27631
8784 -27631 -18014 -5169 8722 12543 11460 17978 15168 7671 -3036 -19574 -31682 -24285 -14461
8771 -14461 -20937 -26853 -33409 -26621 -19023 -16322 -7500 8682 13499 -9091 -6369 -1020 1166 -12247
8757 -12247 -28816 -22778 -10446 -10421 -11795 -20306 -18977 -16843 2731 20480 21621 25580 14283 2802
8743 2802 -324 -2861 -8427 -10774 -2250 4027 -2903 -8712 14514 23706 18949 11742 3022 -1258 -6230
8728f230m961J5397J722l198m221Q206r356J5123J83j1052N269J0587K241k1845
8714b135n214n063P340M304n703O496N323q467R031J5871R420k163j1119r098
8700H823K369q869l801n695K757m467p641J4588K4094l728j2409J613K0834J0805
8686C9273j4288q826p852o93O753O180O799M020k982k69M777o720j2191R825Q218
8671C2024J529k154L631m802k1165j0091m114J8169M049J3203R98J302j6313j0076
8657F190m048O96n89K072J4926j733J776r969p838J1304J1024j1074p63q112n369
8642a507P251J1675n148N426O187K721M614m489o78l168L583O611K1085J7516
8628G1679m336J1113J1564K893j0769q829J246P924j1253k2015K063J3220R430
$$ plain form
8728 -6230 -11191 4206 5928 2730 -1491 6715 -2641 12482 12665 1613 6882 17469 19710 -2135
8714 -2135 -7349 -12412 -5072 -768 -6471 25 5348 -3119 5912 21783 31203 29040 17921 8823
8700 8823 11192 2323 -1478 -7173 -4416 -8883 -16524 -1936 22158 18430 6021 7634 28468 39273
8686 39273 24985 16159 8307 7614 14367 20547 27346 31366 28384 28115 32892 26172 13981 23806 32024
8671 32024 33553 31399 35030 30228 9063 -1028 -5142 13027 17076 30279 31277 32579 16266 6190
8657 6190 2142 2838 2249 4321 19247 17514 19290 9321 1483 12787 23811 12737 11974 3862 -1507
8642 -1507 5744 17419 12271 17697 23884 26605 31219 26730 26052 22884 26467 33078 54163 71679
8628 71679 67343 78456 90020 92913 82144 73315 74561 82485 71232 49217 51280 64500 73930
8615G3930n167m298L854k368p659n172j4877j954J2259O025q12K648P055k352
8601F1112K610k831m973n571l344m027j4427l014n101R844K2462j4420j4472Q735
8587C2583O535J2283p716j7807L334o401M567l692q5J2551q556j6646r714q150
8573f914K61Q56J3652J4099j0801P4o03J1135j0514j2150p208l778p552J4471
8559d972K0563K709p03P451j1073Q82p28p65N603J0219p750j2819J476L298M06
8544A3797j0484l879P120q392m0L090j0569l466j445M776q990n373P165J3088
8530c602r74K223o406j6097P632M521K493J282j0945n07L718k472O770J0818Q160
8515F614N06j2759M834O626P973o4O175N849m599j3386j4487J588K68q885j386
$$ plain form
8615 73930 68763 64465 68319 65951 58292 53120 38243 36289 48548 54573 53761 56409 63464 61112
8601 61112 63722 60891 55918 50347 47003 42976 28549 25535 20434 30278 52740 38320 23848 32583
8587 32583 39118 51401 43685 25878 29212 22811 27378 23686 23601 36152 27596 10950 1236 -6914
8573 -6914 -6653 -5797 7855 21954 11153 11227 10624 21759 11245 -905 -8113 -11891 -19443 -4972
8559 -4972 15591 18300 17597 25048 13975 14857 14129 13364 18967 29186 21436 8617 10093 13391 13797
8544 13797 3313 -566 6554 -1838 -1878 1212 -9357 -12823 -14268 -9492 -18482 -23855 -16690 -3602
8530 -3602 -4576 -2353 -8759 -24856 -17224 -12703 -10210 -8928 -19873 -20380 -16662 -19134 -12364 -1546 6614
8515 6614 7120 -5639 -805 5821 13794 13730 19905 25754 21155 7769 -6718 -5130 -4862 -13747 -15133
8500a5133M282Q07J0060j0180k50k030r613N047J1451J350J308J6242J2088N347
8486C0776M822N532j472j1534n912n535j1538L323q037j0798Q342m845k092m090
8472a3058k863l064J7676J5197j5531p848R795o036m442j329j8562m876J4740
8459b0201N409j275Q829R293q777K235P393J1279j3806k007M026n273k131N671
8445F65O135K191L74j5693j3470N559J2204q088Q805J5791k791r732K092O862
8431A0904M761n342n510J3098k685m647l84J763O500J240J0100J3322j0036k8311
8417D773L249l986L668p916M34L911M371Q79j7885r793L2O402M165O145L175j689
8401f5j386p715q939k79Q894j778J4071J2751J2814j3000j1502r902J3910K0966
$$ plain form
8500 -15133 -10851 -10044 16 -10164 -10414 -12444 -22057 -17010 -5559 -4209 -2901 13341 25429 30776
8486 30776 35598 41130 39658 28124 22212 16677 5139 8462 425 -10373 -2031 -6876 -8968 -13058
8472 -13058 -15921 -18985 -1309 13888 -1643 -9491 304 -5732 -10174 -11503 -30065 -34941 -20201
8459 -20201 -14792 -16067 -7238 2055 -6722 -4487 2906 14185 379 -1628 2398 -2875 -5006 665
8445 665 6800 8991 9365 -6328 -19798 -14239 -2035 -10123 -1318 14473 11682 1950 4042 10904
8431 10904 15665 10323 4813 17911 15226 10579 10195 11958 18458 19698 29798 43120 33084 4773
8417 4773 8022 4036 7704 -212 222 4133 8504 9383 -8502 -18295 -18263 -11861 -7696 -1551 1624 -65
8401 -65 -1451 -9166 -18105 -18384 -9490 -11268 2803 15554 28368 15368 3866 -6036 7874 28840
8387B8840j2514j7295K305N995M949j294n497j8076m912n428n699R764J6915m411
8373f358O44L77m087J651M427Q153N570r713p63j7051n953K3359J5840J10n655
8358A0551l67j0053j0049R657J7785L611P543k292j8083j6889j1405N630K0001
8345E640N415j557j64N256L616n560J750n541k796P427r365l781k3565k082J999
8330b3308k118N612L529J1286n392j0443J622K902J1900J741L646j75n419j1606
8316a6223P233J2839Q940J228p763m948O388J159q2k761j3172P590k108L369P466
8301I155J551q987J0862j2488r347N982j1925J0645Q032j2390j5086J1937l415
8288a5474j0180J1046J6214N384q886l557k200l504L685J2307K243q417J127R520
$$ plain form
8387 28840 16326 -969 1336 7331 12280 10986 5489 -12587 -17499 -22927 -28626 -18862 -1947 -6358
8373 -6358 -5714 -5337 -9424 -7773 -3346 4807 10377 664 -99 -17150 -23103 256 16096 16206 10551
8358 10551 10184 131 -9918 -261 17524 21135 28678 26386 8303 -8586 -19991 -14361 5640
8345 5640 11055 9498 9334 14590 18206 12646 14396 8855 6059 13486 4121 340 -23225 -25307 -23308
8330 -23308 -25426 -19814 -16285 -4999 -10391 -20834 -19212 -16310 -4410 -2669 977 802 -4617 -16223
8316 -16223 -8990 3849 12789 14017 6254 1306 7694 8853 8771 6010 -7162 428 -1680 1689 9155
8301 9155 10706 1719 12581 93 -9254 -3272 -15197 -4552 3480 -8910 -23996 -12059 -15474
8288 -15474 -25654 -14608 1606 6990 -1896 -5453 -7653 -11157 -7472 4835 7078 -1339 -212 9308
8274I308q112j0985J839M172J944K416J669R347R510P941J0402J757j2308p682
8260B1218j4971j6228M402l374O834j626k8285M53J2789J1008o892R17l696J0346
8246g105J853K193N479m561m606K950J4440L867k0408j4585L91P012l918n735
8232b2733p789K353J1807K2134J5951J2210j6423o273r5r461j2925n33Q293l291
8218f775o846J4496O04J287j231K485K410j3948J0364J0268k488j1087q957P021
8204b397K60M570M378P347r871j1737o645q130K3907Q089N866M599q435j382q302
8189B117n295M867L905k0779j2943P566M406N333m579k68j270J692J2049o35m90
8174d324r019N548N587J78J1954R351N673q40R969L70l827J6606l108l0830j1945
$$ plain form
8274 9308 1196 -9789 -7950 -3778 -1834 582 2251 11598 21108 29049 39451 41208 28900 21218
8260 21218 6247 -9981 -5579 -8953 -2119 -3745 -32030 -31577 -18788 -7780 -14672 -13755 -17451 -7105
8246 -7105 -5252 -3059 2420 -2141 -6747 -3797 10643 14510 -5898 -20483 -20092 -13080 -16998 -22733
8232 -22733 -30522 -28169 -16362 5772 21723 33933 17510 11237 11142 1681 -11244 -11777 -3484 -6775
8218 -6775 -13621 875 1479 2766 1535 4020 6430 -7518 2846 13114 10626 -461 -9418 -2397
8204 -2397 -2137 2433 6811 14158 4287 -7450 -14095 -22225 1682 9771 15637 20236 11801 10419 2117
8189 2117 -3178 1689 5594 -15185 -28128 -20562 -16156 -10823 -15402 -15670 -16940 -15248 -3199 -3834 -4324
8174 -4324 -13343 -7795 -2208 -2030 9924 19275 24948 24108 34077 34447 30620 47226 44118 13288 1343
8159A343O052N840J5593j2515j6280n969O44o831L538J4413L536N460n990K320
8145A1154j3990O976J7014K685j6238q594M624o309j6650K971R381Q821K470Q995
8131A3310J080k0643o946M065O022j7084P352J7136m727J589Q142K165N133m427
8117A2167j3495K652k131j4490R104J0570j0413J1599q879j1364J1268j2573p069
8104b3054J3827J7822K20r149o824J908R186P332j3748k2610R239o284P188O255
8090h692n179J871M494J2798j4311j0482R584n241J0773O652j3117L921J4741
8077G812j7673p62Q383M971J308j1901o184J447O36J530Q134m627J648N43J2708
8062G973j783j0095L059m52R52n813J0564K5920J3775N612k204P62q186p541J5024
$$ plain form
8159 1343 7395 13235 28828 16313 33 -5936 -5292 -12123 -8585 5828 9364 14824 8834 11154
8145 11154 -2836 4140 21154 23839 7601 -993 3631 -2678 -19328 -16357 -6976 1845 4315 13310
8131 13310 14390 -6253 -13199 -9134 -3112 -20196 -12844 4292 -435 1154 9296 11461 16594 12167
8117 12167 -1328 1324 -807 -15297 -6193 4377 -6036 5563 -3316 -14680 -3412 -15985 -23054
8104 -23054 -9227 8595 8815 -334 -7158 -5250 3936 11268 -2480 -25090 -15851 -22135 -14947 -8692
8090 -8692 -13871 -12000 -7506 5292 -9019 -19501 -9917 -15158 -4385 2267 -10850 -6929 7812
8077 7812 -9861 -10623 -2240 2731 4039 -7862 -14046 -12599 -11963 -10433 -2299 -6926 -5278 -4735 7973
8062 7973 6190 -3905 -846 -1298 -346 -6159 4405 30325 44100 49712 47508 48270 40084 32543 47567
8047D7567r295r019o371n4J9217J581l255J427M824P012n797p596q648l224l795
8032B4574L59L418m147n228J1928Q050K425Q657J188p705r44j3170j6075O085
8018A9415l561J8892K9397r617O514M2354L8265J3490q133j2642j6737k2436k1323
8005G3878o260j671K264k372j0850K0155J5425R267j0459k7568k9375k2231J983
7992A2186M71l190n056J5922o195q814n531L484J0528J6657p582k710M238m428
7978A9980q025J4338r48n054k845k492K3175J2678M541l132J0108J3975K20L948
7964H0467j3479j0624O09J7414k158j155N758J387L621p398K271j9573j6902j1603
7950B8635j2888n044m024O947o56m050k581l118Q648J1009M128N142o435N245
$$ plain form
8047 47567 38272 29253 22882 22828 42045 43626 40371 41798 46622 53634 47837 40241 31593 28369 24574
8032 24574 24933 28351 24204 18976 30904 38954 41379 50036 51224 43519 42575 29405 13330 19415
8018 19415 15854 34746 64143 54526 61040 103394 141659 155149 147016 134374 117637 95201 73878
8005 73878 67618 65947 68211 65839 54989 75144 90569 99836 89377 61809 32434 10203 12186
7992 12186 12657 9467 4411 20333 14138 5324 -207 3277 13805 30462 22880 20170 24408 19980
7978 19980 11955 26293 25345 20291 17446 14954 38129 50807 55348 52216 62324 76299 76519 80467
7964 80467 66988 56364 56973 74387 72229 71074 76832 78219 81840 74442 76713 57140 40238 28635
7950 28635 15747 10703 6679 13626 12970 8920 6339 3221 11869 22878 27006 32148 25713 30958
7936C0958L021K356r083m131o743m923p831o85K0530L775m118r346K311M865j5862
7921E094j6929Q258J0909n532J4938O750j073l214n46M999J31K010M917Q646j2164
7906B7194k1696k7387N596O796J038Q620L685P974o437j7164o200J2154j0190
7893a6017r372O949J3848K405j1938R14Q932k473J4730L889j110j6757n215K087
7879i128O168K0429n849j6852j8523j7125J0189K2280L890n02O300K908j1073
7866f888m453R518K152R110n611j174K363o273m324j18J2019J237J0998N758j4622
7851I692j1676j601l84Q33l323K087k53r553M569J7400j443k480o517j0467j144
7836a4260O155k105O5K910L40j1276O734p577k207O883L928J77O981Q48j961P103
$$ plain form
7936 30958 33979 36335 27252 23121 16378 11455 3624 2939 23469 27244 23126 13780 16091 20956 5094
7921 5094 -11835 -3577 7332 1800 16738 23488 22415 19201 18655 23654 23785 25795 30712 39358 27194
7906 27194 5498 -21889 -16293 -9497 -8459 161 3846 11820 5383 -11781 -17981 -5827 -16017
7893 -16017 -25389 -18440 -4592 -2187 -14125 -13211 -4279 -6752 7978 11867 10757 -6000 -11215 -9128
7879 -9128 -2960 17469 11620 -5232 -23755 -40880 -30691 -8411 -4521 -5023 1277 4185 -6888
7866 -6888 -11341 -1823 329 9439 3828 2654 5017 -1256 -5580 -5698 6321 7558 18556 24314 9692
7851 9692 -1984 -3585 -3969 -3136 -6459 -4372 -4625 -14178 -9609 7791 6348 3868 -2649 -13116 -14260
7836 -14260 -8105 -10210 -10145 -7235 -6895 -18171 -11437 -19014 -21221 -14338 -10410 -10233 -3252 -2404 -4365 2738
7820B738J635n932j714J0507k224j118k313P689O000L499r641J079l16j587n804
7805B498J4407o695O275L358o168l892k78O026p465q454j4416j2237m873J4050
7791a7864Q681J181J829k292J869j8680j203m67M680j905n814p885n101K657J1666
7776b8648K9382k751p272j962q56K571P982L939j1038M243O397o604o531n165
7762a6313n112P441J663M649K35J2075M543j509o716j540L732K09R931O269j3135
7747F422j4811q641j757j4310J3110K0593L00j218L230j3184M039J3448j0494
7734c273N844j87k055L709L704p111j604O289J3368l794J631j6234l579n957m913
7719a4162J531Q873M290j581m267J816q546n331L137J469j7852p860O570M866
$$ plain form
7820 2738 4373 -1559 -3273 7234 5010 3892 1579 9268 15268 18767 9126 10205 9889 8302 2498
7805 2498 16905 10210 16485 19843 13675 9783 9505 15531 8066 -388 -14804 -27041 -31914 -17864
7791 -17864 -9183 -8002 -6173 -8465 -6596 -25276 -26479 -26946 -22266 -24171 -29985 -37870 -42971 -40314 -28648
7776 -28648 734 -2017 -9289 -11251 -12107 -9536 -1554 2385 -8653 -4410 1987 -4617 -11148 -16313
7762 -16313 -21425 -13984 -12321 -7672 -7437 4638 9181 7672 956 -584 3148 3357 13288 19557 6422
7747 6422 -8389 -17030 -18787 -33097 -19987 606 906 -312 2918 -10266 -6227 7221 -3273
7734 -3273 2571 2384 329 4038 7742 631 -973 5316 18684 14890 16521 287 -3292 -9249 -14162
7719 -14162 -12631 -3758 532 -1049 -5316 -3500 -12046 -17377 -14240 -12771 -30623 -38483 -31913 -27047
7705b7047K0261J8018n277n217l771j1262j5713J9827J1085N74o448M523r756
7692a0203o35M965N277r07%J5463K786k0837m441J0645N201J137o702l590j433
7677c274n666n235n141j1258n939L182L100J0433M219n937Q174N860j0316P412
7663a0386N682o529K784K8336Q695j2821L038L859j5888p353P72K463O85k733
7649F04m077k348K678L874J2585l73k105l505j4864n385M136r764l448m195N648
7634b0539O355k286K706K8221N722j0357k538j3612m478j3523l849J1051J3954
7621c173J910m801n540J4915P376j2570j1543O736j152j2913Q409R989q250j0328
7607b0935N004O750L1o380l34j5793J1391M545M144N224M909J769j2336o857R054
$$ plain form
7705 -27047 -6786 11232 5955 738 -3033 -14295 -30008 -10181 904 1478 -4970 -447 -10203
7692 -10203 -10838 -5873 -596 -1503 -1503 13960 16746 -4091 -8532 2113 7314 8451 1749 -1841 -3274
7677 -3274 -8940 -14175 -19316 -30574 -36513 -33331 -30231 -19798 -15579 -21516 -13342 -7482 -17798 -10386
7663 -10386 -4704 -11233 -8449 19887 28582 15761 18799 22658 6770 -583 189 2652 3337 604
7649 604 -3473 -5821 -3143 731 13316 12943 10838 7333 -7531 -12916 -8780 -18544 -21992 -26187 -20539
7634 -20539 -14184 -16470 -13764 14457 20179 9822 7284 -6328 -10806 -24329 -28178 -17127 -3173
7621 -3173 -1263 -6064 -11604 3311 10687 -1883 -13426 -6690 -7842 -20755 -12346 -2357 -10607 -20935
7607 -20935 -15931 -9181 -9150 -15530 -15864 -31657 -20266 -15721 -11577 -6353 -1444 325 -12011 -18868 -9814
7592i814J0371j1008O921P472k433j5506m604K672J391O063J5264N902k608k522
7578G561m489j8234j0388J2745K1533q201j9153L605R880j932N820K37j0441p116
7564a8573o640j6169O325R424L127J2304k553k55Q992J1763J694l011J513k685
7550E256k149r374K1392K3136o681j9106j7916l667J2407M792q713j5989l509
7537b0121J3512M126M182L251N087J238M266l409n552O239m893l846j263j5610
7523a2793j61M143m316N603j150L044K65j1574n027J0162m916J902K522K259J3029
7508B992O726m290n723n980J1864J5913l593j9041j0611m759R250Q397R28p0q843
7493f840j1591L553K896K32l051O028P571j058k1058j2805j9765M026J1497j72
$$ plain form
7592 -9814 557 -10451 -3530 3942 1509 -13997 -18601 -15929 -14538 -8475 6789 12691 10083 7561
7578 7561 3072 -15162 -25550 -12805 8728 527 -18626 -15021 -5141 -7073 -1253 -1016 -11457 -18573
7564 -18573 -25213 -41382 -35057 -25633 -22506 -10202 -12755 -13010 -4018 7745 9439 6428 7941 5256
7550 5256 3107 -6267 15125 38261 31580 12474 -5442 -9109 3298 8090 -623 -16612 -20121
7537 -20121 -6609 -2483 1699 4950 10037 11275 15541 12132 6580 12819 7926 4080 2817 -12793
7523 -12793 -12954 -8811 -13127 -7524 -8674 -5630 -5365 -16939 -21966 -11804 -16720 -14818 -12296 -10037 2992
7508 2992 9718 5428 -295 -6275 5589 21502 17909 -1132 -11743 -16502 -7252 1145 2073 2003 -6840
7493 -6840 -18431 -14878 -11982 -11750 -14801 -8773 -1202 -2260 -23318 -36123 -55888 -51862 -40365 -40537
7479d0537L548Q183M565l590O308J328O351M526N894j216l541K364K634m374m824
7464a2381O281j067j2625j832L20P908P52N461p606L077r47m95o498m528j9324
7449d3504K892L0015R920K549o006O854J0862l494q590r919Q230J7319j0018j3540
7435f430j676J0198j929p848J533N347j1837r700J1084j563k340M537j133K144
7421i613L134M025L274k0928K0502j958q799m472j3503n597L554l600O130O016
7407b1835J0332J8417P289k018n860q104J536O809R868k245N272O591j3106j4156
7393a210m919L31k991p400j0369o025q193J145n779O118J1115J0422N833j401
7379a3323J0890q329j3648R136R349N817J5148L868j6650J668K611j0011j7902
$$ plain form
7479 -40537 -36989 -28806 -24241 -27831 -21523 -20195 -13844 -9318 -3424 -4640 -8181 -5817 -3183 -7557 -12381
7464 -12381 -6100 -7167 -19792 -21624 -21304 -13396 -12644 -7183 -14789 -11712 -12659 -13154 -19652 -24180 -43504
7449 -43504 -40612 -10597 -677 1872 -4134 2720 13582 10088 1498 -8421 -191 17128 7110 -6430
7435 -6430 -8106 2092 163 -7685 -6152 -805 -12642 -22342 -11258 -12821 -15161 -10624 -11757 -9613
7421 -9613 -6479 -2454 820 -20108 394 -1564 -10363 -14835 -28338 -33935 -30381 -33981 -27851 -21835
7407 -21835 -11503 6914 14203 12185 6325 -1779 -243 6566 16434 14189 19461 26052 12946 -1210
7393 -1210 -6129 -5798 -8789 -16189 -26558 -32583 -40776 -39631 -45410 -39292 -28177 -17755 -11922 -13323
7379 -13323 -2433 -10762 -24410 -15274 -5925 -108 15040 18908 2258 3926 6537 -3474 -21376
7366b1376L305K948r6k168j116j76O337J1690J7965o289j7764j5711L205J557
7352a7689j0619j220k145M578K279k342r02Q020J4793L054r846P104m695k175
7338a1805L586q605O591J8013j090L556j1791j67O671P816L040j9223j0540j386
7324a5334Q701J5633R157o372q905o650M296k440J0791M998m196j1301k789m418
7310h829L246O380J0145j8954m706Q311M472QP76k19n678p709j2544J2166L0776
7295A7641K788j1596q536L786r876K74o332L872q219N743R607K0741r366j858
7281H669j4340j1828q66J024N164L74K678L771L84k2105J0105k520o860J8800
7267g550K707k17m784m272o707L073j80R973O902L202N886J1030j0686p472o158
$$ plain form
7366 -21376 -18071 -15123 -15219 -17387 -18503 -18679 -12342 -652 17313 11024 -6740 -22451 -19246 -17689
7352 -17689 -28308 -29528 -31673 -27095 -24816 -27158 -28060 -20040 -5247 -2193 -12039 -4935 -9630 -11805
7338 -11805 -8219 -16824 -10233 7780 6690 10246 -1545 -1712 4959 12775 15815 -3408 -13948 -15334
7324 -15334 -6633 9000 18157 11785 2880 -3770 526 -1914 8877 13875 9679 -1622 -4411 -8829
7310 -8829 -5583 797 10942 -8012 -12718 -4407 65 73 849 630 -5048 -12757 -25301 -13135 17641
7295 17641 20429 8833 297 4083 -5793 -5519 -11851 -7979 -16198 -10455 -848 19893 10527 8669
7281 8669 -5671 -17499 -18365 -17341 -12177 -11803 -9125 -5354 -4970 -27075 -16970 -19490 -26350 -7550
7267 -7550 -4843 -5060 -9844 -14116 -20823 -17750 -17930 -7957 -1055 2147 8033 19063 8377 905 -5253
7252e253n020o613K532q28Q079k735J4562O448k074J6680j2323k3076j6726m857
7238c1204j1806Q946J0575K15j505K375l52J0759K670K688R223l295L50q138j4997
7223b3496j877N909M098J7243p405l7J2148J761o284p173k139J39J2087j00j3324
7208h450J283J4082k746j0303r204R949J4192N986j7968k365J2177q135m058r298
7194a4858N481Q456k788j3041p71j434j590L789K051q605n452J0361J5511j639
7180d529L936M037q344r92k839m637n133J0214l388Q083J0763K674m005K08q324
7165b276N418P725n562R479o335k6320j0946J1261J2696K243o969P95J213j884
7151i462o645J331O678P021j3904j7436j4440J3559J6833N016o102j4729o70R629
$$ plain form
7252 -5253 -10273 -16886 -14354 -15182 -7103 -9838 4724 11172 9098 25778 13455 -9621 -26347 -31204
7238 -31204 -43010 -34064 -23489 -23274 -24779 -22404 -22756 -11997 -9327 -6639 2584 -711 -361 -8499 -23496
7223 -23496 -25373 -19464 -15366 1877 -5528 -5565 6583 8344 2060 -5113 -7252 -7113 4974 4874 -8450
7208 -8450 -7167 6915 4169 -6134 -15338 -5389 8803 14789 -3179 -5544 6633 -1502 -5560 -14858
7194 -14858 -9377 -921 -3709 -16750 -17521 -18955 -20545 -16756 -14705 -23310 -28762 -18401 -2890 -4529
7180 -4529 -593 3444 -4900 -5892 -8731 -13368 -18501 -8287 -11675 -3592 7171 9845 5840 6048 -2276
7165 -2276 3142 10867 5305 14784 8449 -17871 -28817 -17556 -4860 -2617 -9586 -8791 -7578 -9462
7151 -9462 -16107 -14776 -8098 -1077 -14981 -32417 -46857 -33298 -16465 -11449 -17551 -32280 -32950 -23321
7137b3321N973n689j511M048n657o15J5497K2754L327j0799j8148k912P241r003
7123a8815p84J2046l77N340l667n526j526K402J575N188J4060o427l400j543K76
7108a178m66Q781J2807J988j1772j1152N432O607M511p403M183Q225p712j042
7094A1809r666M33N11p961P016P231l478r648k16R398n949j1715j2367n473j1338
7079d1413J1018J6307J2935k273j4119K363J1921j1500m260J9578Q236o854L477
7066E416J6780l930q109j3863l967J7125N269j4180n804j847N692J60j1369j3794
7052b6421J0549J1943J1031l414Q79n704o002q65P584n399j2935R421R098O51
7038D16m183j612N59p986j206M174K1232j4320j0059N608P082M711K881N721k740
$$ plain form
7137 -23321 -17348 -23037 -24548 -20500 -26157 -26772 -11275 11479 14806 4007 -14141 -17053 -9812 -18815
7123 -18815 -19599 -7553 -7930 -2590 -6257 -11783 -13309 -10907 -9332 -4144 9916 3489 89 -1454 -1178
7108 -1178 -1644 7137 19944 21932 10160 -992 4440 11047 15558 8155 12338 20563 12851 11809
7094 11809 2143 2576 3087 -4874 2142 9373 5895 -3753 -3969 5429 -520 -12235 -24602 -30075 -41413
7079 -41413 -30395 -14088 -1153 -3426 -17545 -15182 -3261 -14761 -19021 557 8793 1939 5416
7066 5416 22196 18266 10157 -3706 -7673 9452 14721 541 -5263 -7110 -1418 -1258 -12627 -26421
7052 -26421 -15872 -3929 7102 3688 4567 -1137 -7139 -8004 -420 -5819 -18754 -9333 -235 416
7038 416 -3767 -5379 -4820 -12806 -14012 -9838 11394 -2926 -12985 -7377 -295 4416 7297 13018 10278
7023A0278L840k47p853o951k566l932k055Q155K0288K712j1036j6368j0600Q657
7009g678l701m857M692L432Q434O986J236l272j3573j051j7673m148K4951K2749
6995A6527J807J256k950m71j2826L353J227p883j0087K966k864J0202m808j06
6981d657J2743Q103j2594n651n085k260n54j0906l354L200L902K567l329J3811
6967d064M30j330N282N381J0155m49k3966L4j308j0422R158O606k431J4098J0250
6952A7424q615j0943j2828L884P735l732J6711q884k0939Q410P655q912K553P819
6938b662n486j7875p195j2494J9747J6855j286R193M971j2704r244r70j268K7653
6924G235J1345M566j3690P213L913p887l78P966p656j0315K683K523j6656o883
$$ plain form
7023 10278 14118 13871 6018 -933 -3499 -7431 -9486 -1331 18957 21669 10633 -5735 -16335 -7678
7009 -7678 -11379 -16236 -11544 -8112 322 7308 8544 5272 -8301 -9352 -27025 -31173 -6222 16527
6995 16527 18334 19590 16640 16169 3343 6696 7923 40 -10047 -7081 -9945 257 -4551 -4657
6981 -4657 8086 16189 3595 -2056 -7141 -9401 -9955 -20861 -24215 -21015 -17113 -14546 -17875 -4064
6967 -4064 -3634 -4964 318 5699 15854 15405 -8561 -8527 -9835 -20257 -11099 -4493 -6924 7174 17424
6952 17424 8809 -2134 -14962 -11078 -3343 -7075 9636 752 -20187 -11777 -4122 -13034 -10481 -2662
6938 -2662 -8148 -26023 -33218 -45712 -25965 -9110 -10396 -1203 3768 -8936 -18180 -19150 -20418 7235
6924 7235 18580 23146 9456 16669 20582 12695 12317 20283 12627 2312 4995 7518 -9138 -16021
6910a6021j413Q221Q103j960k0942j850J4842R643N901K0121N49k2746r180p219
6896a3951K889O964M28J0994L565P955m343j7207q299J975N118J831J798n001
6882e284J1032o86J911n021j450R070q502n163Q947K068k056o482j582L844j1581
6867a0935r692O874J1930O207L713j0419n58J733n048j2946N391l433q0M352M530
6852h381n388l197j647K461q774J2636M903n664J765k63K76N694j873O599J376
6837E23k2879k536J3281L399l360L452o135J688K0163J1450m926j3465q205J9528
6823A1978J1697Q632o645k0461k0077M056m721L127r287Q710Q384p1j3469J3519
6809d628K422K430O964o738L770K625m105J513J388p90J896O744l031j6520r631
$$ plain form
6910 -16021 -17434 -9213 -1110 -3070 -24012 -25862 -11020 -1377 4524 24645 25194 2448 -6732 -13951
6896 -13951 -11062 -4098 -3670 7324 10889 18844 14501 -2706 -11005 -9030 -3912 -2081 -283 -5284
6882 -5284 5748 5062 6973 1952 502 9572 1070 -4093 4854 6922 4866 -1616 -3198 646 -10935
6867 -10935 -20627 -13753 -1823 4384 8097 -2322 -2880 -1147 -6195 -19141 -13750 -17183 -17263 -12911 -8381
6852 -8381 -13769 -16966 -18613 -16152 -24926 -12290 -7387 -13051 -11286 -11549 -11273 -5579 -7452 -853 523
6837 523 -22356 -24892 -11611 -8212 -11572 -8120 -14255 -12567 7596 19046 14120 655 -7550 11978
6823 11978 23675 32307 25662 5201 -14876 -10820 -15541 -12414 -21701 -12991 -4607 -4678 -18147 -4628
6809 -4628 -2206 224 7188 450 4220 6845 2740 4253 5641 4851 6747 13491 10460 -6060 -15691
6794a5691m016R126M962l560L432o827L602J5916p777Q746n333j3219j3518J0891
6780a3266n869J901J2397M355k073j6264K711N973m581J174J476k299L510j800
6766a2655J351k215k474k244K0034J807j603J5982J778j1882p699N102M998L273
6752A3553m503n487m593o421J2434m329j1842j63m730L090J082J2925k503j5079
6738a6566K485Q539Q744Q831L922k86j99o719r513k072J172j7222l918K4484J530
6723C212k035R345n031q447Q127j111l507N331P979J2897M895j1161j8234q308
6709f048N82J2461L141j650n083r027l982M626m111M252O304l574j3333l923N025
6694a4340M601P856k633j5838k466r15O260N392m604Q246K776p056J3905P370
$$ plain form
6794 -15691 -19707 -10581 -5619 -9179 -5747 -12574 -8972 6944 -833 7913 2580 -10639 -24157 -13266
6780 -13266 -19135 -17234 -4837 -482 -2555 -18819 -16108 -10135 -14716 -13542 -12066 -14365 -10855 -12655
6766 -12655 -11304 -13519 -15993 -18237 1797 3604 2001 17983 19761 7879 180 5282 10280 13553
6752 13553 9050 3563 -1030 -7451 4983 654 -11188 -11351 -16081 -12991 -11909 1016 -1487 -16566
6738 -16566 -14081 -5542 3202 12033 15955 15669 15470 8751 -762 -2834 -1662 -18884 -22802 1682 3212
6723 3212 1177 10522 5491 -2956 5171 4060 553 5884 13863 26760 31655 20494 2260 -6048
6709 -6048 -5466 6995 10136 8486 3403 -5624 -9606 -4980 -9091 -4839 1465 -2109 -15442 -19365 -14340
6694 -14340 -9739 -1883 -4516 -20354 -22820 -23735 -17475 -12083 -16687 -8441 -5665 -12721 1184 8554
6680H554m87J653k846p561q867o331N667J2629j288q918q149p240j585J0248K603
6665a1918O345Q298n069N50J3143N240j553k262n821j1805m554m767o732J8270
6651b635J176o831j203m033J5141M210l210k16m932j3477k689k572r916j614J8323
6636a4478J2860J572K115l074q45O732j0383q28P734j5515q003Q258Q808P200
6622B153j2506j0615p845L16K6956M125O671Q807m173n866j0561j5200J7048Q124
6608G434M668j2265q111n3q142j8251M105K2277J2071m258r925l472K642m486
6594a5766M250J550K1848n950K782L762l343n107p210p875O763L190j0357j2183
6580b3646N785J1329K283m979n867N576M990P09n77n000k960L210J1433J719m842
$$ plain form
6680 8554 8067 9720 6874 -687 -9554 -15885 -10218 2411 1123 -7795 -15944 -23184 -24769 -14521 -11918
6665 -11918 -5573 2725 -2344 -1794 11349 16589 15036 12774 6953 -4852 -9406 -14173 -20905 -2635
6651 -2635 -1459 -8290 -9493 -13526 1615 5825 2615 2399 -2533 -16010 -18699 -21271 -31187 -32801 -14478
6636 -14478 -1618 -46 2069 -1005 -1850 4882 -5501 -6329 1405 -14110 -22113 -13855 -5047 2153
6622 2153 -10353 -20968 -28813 -28497 -1541 2584 9255 18062 13889 8023 -2538 -17738 -690 7434
6608 7434 12102 -163 -8274 -8327 -16469 -34720 -30615 -8338 3733 -525 -10450 -13922 -11280 -15766
6594 -15766 -11516 -9966 11882 5932 8714 12476 9133 4026 -3184 -11059 -4296 -1106 -11463 -23646
6580 -23646 -17861 -6532 -4249 -9228 -15095 -9519 -4529 -3820 -4397 -9397 -12357 -9147 2286 4005 -837
6565h37j3586m364R673n622k568J3534Q331L831J1825M53j6161m746J6065K673
6551A8501r78J0141k848m624M647J8700n325j9485q896J2663J0297j0296j439
6538B1058l540j3106k387l657L276J0314j920j311j3557O540J0819k815r452j5151
6524a4889o652l271M759J6743n553q085K199r885J2433J7744l35J2004m173k0305
6510g266k160J1160j069O23p66Q66j593k684M110n236R331J2208m515L193j447
6495A4755p293N560M408n544j2030p195N662K4845j532p616J918j3540n278Q342
6481E462r89q235l091J3355o838j4981P390P578J469j30N787n976l496n197j5152
6466b3044j2668k146R318J9094J3214r027r710o438P152P815J622K862K273j8613
$$ plain form
6565 -837 -14423 -18787 -9114 -14736 -17304 -3770 4561 8392 20217 20670 4509 -237 15828 18501
6551 18501 17523 27664 24816 20192 24839 43539 38214 18729 9833 22496 32793 22497 21058
6538 21058 17518 4412 2025 -1632 1644 11958 10038 8727 -4830 1710 12529 9714 262 -14889
6524 -14889 -21541 -24812 -20053 -3310 -8863 -16948 -14749 -24634 -12201 5543 5208 17212 13039 -7266
6510 -7266 -9426 1734 665 1288 522 1388 -205 -2889 1221 -4015 5316 17524 13009 16202 14755
6495 14755 7462 13022 17430 11886 -144 -7339 -1677 23168 21636 14020 15938 2398 -2880 5462
6481 5462 4473 -3762 -6853 6502 -336 -15317 -7927 -349 1120 990 6777 801 -2695 -7892 -23044
6466 -23044 -35712 -37858 -28540 -9446 3768 -5259 -14969 -21407 -14255 -6440 -4818 -1956 317 -18296
6452a8296L856J2837J491k661l871Q286J9541n262j5824j8659j233l422j218N245
6438a9190J1992K3251m326j4525k712j1469M281q908m56J944j753M98J691N074
6424a4608L418q73K976L192k309J132j7880P563Q41p39J6338J0067J6970R154
6410C5242l471j7925m209k332j2432j5982j5976K2270Q318J7528O884q80o189
6397A0846j7059k0263N512o595k587R996J0733K526J0583K98k451k688j084J824
6383d09K931o928K833N593n772l893M518O604L045j2377j7092k0092j0782o082
6369e7903Q588J6389J4972L591M451J222j210k461R745M015N628K712q385J1071
6355A2425J2608j3293r346o808J499N888m711k776j841O333k1525k0372L835J1842
$$ plain form
6452 -18296 -14440 -1603 -112 -2773 -6644 1642 21183 15921 97 -18562 -19795 -23217 -24435 -19190
6438 -19190 -7198 16053 11727 -2798 -5510 -16979 -12698 -21606 -22062 -20118 -21871 -21373 -19682 -14608
6424 -14608 -11190 -12063 -9087 -5895 -8204 -7072 -24952 -17389 -16548 -17287 -949 9118 26088 35242
6410 35242 31771 13846 9637 7305 -5127 -21109 -37085 -14815 -6497 11031 17915 17035 10846
6397 10846 -6213 -26476 -20964 -27559 -30146 -20150 -9417 -6891 3692 3990 1539 -1149 -2233 -409
6383 -409 2522 -4406 -1573 4020 -1752 -5645 -1127 5477 8522 -3855 -20947 -41039 -51821 -57903
6369 -57903 -49315 -32926 -17954 -14363 -9912 -8690 -9900 -12361 -2616 1399 7027 9739 1354 12425
6355 12425 25033 11740 2394 -4414 -2915 2973 -1738 -4514 -6355 -22 -21547 -41919 -38084 -26242
6341b6242J3824O279j0158Q851K359j9049p691o478J3502J8476j362k061r250
6328a9000r443J2046L962j0734Q975K3848P539j108j1774r218p255j3597p658
6315c3417N539p367K12L901M114Q492q841l31J7082K2396Q89j2962j3012p839
6301b1144J1161O199J708k149j5458m588J1802J9277K01k2662p372J707J0287
6288a1031k738r390o723l487J2365R765K6597N478q263M213j5349l550J2335O820
6274A7042j789n5j973L591k4917Q371J4982l985n094j0463O52r162O761N179L993
6259C133M208J238l821K762R84l866K043n108K853O112o350o050n260q141M246
6244a1017k337k783O266M265K712J01j2371o223R025R940j3760J2935J8866M147
$$ plain form
6341 -26242 -12418 -6139 -16297 -7446 -5087 -24136 -31827 -38305 -24803 -6327 -7689 -9750 -19000
6328 -19000 -28443 -16397 -12435 -23169 -14194 9654 17193 16085 4311 -4907 -12162 -25759 -33417
6315 -33417 -27878 -35245 -35033 -31132 -27018 -18526 -27367 -27698 -10616 11780 12669 -293 -13305 -21144
6301 -21144 -9983 -3784 -2076 -4225 -19683 -24271 -12469 6808 7009 -15653 -23025 -21318 -11031
6288 -11031 -13769 -23159 -29882 -33369 -21004 -11239 15358 20836 12573 16786 1437 -2113 10222 17042
6274 17042 15253 15198 13225 16816 -8101 270 15252 11267 6173 -4290 -3638 -12800 -6039 -860 3133
6259 3133 7341 8579 4758 7520 8504 4638 6681 1573 4426 10538 4188 -1862 -7122 -15263 -11017
6244 -11017 -13354 -16137 -9871 -5606 -2894 -2793 -15164 -21387 -12362 -2422 -16182 -3247 15619 19766
6230A9766j7808l79K626j3383p760m330r802J402P338J2341J5410Q405n888k730
6216E208r02j7921l422N474o734n672k184Q024M305o405p28J575J093K457M925
6201a0907k478k721J951l115J108L672K876n730r528j3414j562n365N722J0195
6187b9296K0501o90m133J1433N011o531L922o838o127J576K778n798J144k268
6173a5316O998j958J220N991n330O996L617L093N401l771n988J945J7049K317
6159B2264q949j3237j3945k920j462J6648Q975q726q062j1149R193J7703J9804
6146B6137r074l1571k320Q374m616O570j326o380j925j408J169J2025j816j2499
6132a8660m707N892M553l316P833j0211j553o372O308K449j1288l496J3707M778
$$ plain form
6230 19766 1958 1579 4205 -9178 -16938 -21268 -31070 -29668 -22330 -9989 5421 13826 7938 5208
6216 5208 4306 -13615 -17037 -11563 -18297 -23969 -26153 -18129 -13824 -20229 -20957 -19382 -18289 -15832 -10907
6201 -10907 -13385 -16106 -14155 -17270 -16162 -12490 -9614 -15344 -24872 -38286 -39848 -45213 -39491 -29296
6187 -29296 -8795 -9485 -13618 -2185 2826 -3705 217 -6621 -12748 -11172 -8394 -14192 -13048 -15316
6173 -15316 -8318 -10276 -9056 -3065 -8395 -1399 2218 5311 10712 6941 953 2898 19947 22264
6159 22264 13315 78 -13867 -16787 -18249 -1601 7374 -1352 -9414 -20563 -11370 6333 26137
6146 26137 17063 -14508 -16828 -8454 -13070 -6500 -7826 -14206 -16131 -17539 -16370 -4345 -6161 -18660
6132 -18660 -23367 -17475 -12922 -16238 -8405 -18616 -20169 -26541 -20233 -17784 -29072 -32568 -18861 -14083
6118a4083k0630L610Q709N688j969N70N575p241n50l053Q406K0102K468j7m065
6103C520o15M817j1554n007J110P928k911M560J0319K246l606J7767r552j4660
6089D362m86Q104O145q560K145J979m156j6351N913j1524P666k409l126L022K2901
6074A5625J1667k924q816j1225N81j5913r302O982m132K513r686j0624m046k283
6060d1583J4963K7030O199n687J043M507Q97j3399N978Q951k169l913o473j965
6046e621P960L178L358J0008K202j6503m367k184L309J197k601J292J8390J576
6032B1194j240j1176o933p409n043M403l012p18J1098J0031r4k140q148j6668
6018a5855J6528J7966r660j4010j96J4111J1537o083q194J0117l226j1812p007
$$ plain form
6118 -14083 -34713 -31103 -22394 -16706 -18675 -18105 -12530 -19771 -20321 -23374 -14968 5134 7602 7585 3520
6103 3520 2905 7722 -3832 -8839 -7729 199 -2712 1848 12167 14413 10807 28574 19022 4362
6089 4362 3876 11980 18125 9565 11710 13689 9533 -6818 -905 -12429 -4763 -7172 -10298 -7276 15625
6074 15625 27292 24368 15552 4327 4908 -11005 -20307 -13325 -17457 -14944 -24630 -35254 -39300 -41583
6060 -41583 -26620 410 6609 922 1965 6472 7369 -6030 -52 8899 6730 2817 -3656 -5621
6046 -5621 2339 5517 8875 18883 21085 4582 215 -1969 1340 2537 -64 1228 19618 21194
6032 21194 19954 8778 1845 -5564 -10607 -6204 -9216 -9934 1164 11195 11101 8961 813 -15855
6018 -15855 673 18639 8979 -5031 -5227 8884 20421 14338 6144 16261 13035 1223 -5784
6005e784q526j2610p88k340M031R114J5611J4456J211q749r70j1293J1619M408
5991I390p539n552n154O884J911j545J571P751k531Q480J5474m896o346m026o279
5976G593j27J4827P641P357k5017j9154p67j241j4814o930J0568K4262P123l913
5962G408m407r628j2254k934L485p104N091J1165J8100J340k776n126j2353K9
5948i964J5097o711l591K690n543j7811O269R44K1034Q797j0059l361J1704J5990
5934B5485j1875J2926M835j6255m211m924p566j1298k542n843o026o585J0351
5921b3528J2423j6083J075K4385J4922N878q63m810m064n008L272j1694j0281
5908a4376Q468q27k584k095j9543p949J5317K0657M907m888k292R439P602J6242
$$ plain form
6005 -5784 -14310 -26920 -27708 -30048 -26017 -16903 -1292 13164 14375 5626 4656 -6637 4982 9390
5991 9390 1851 -3701 -8855 -1971 -60 -1605 -34 7717 5186 13666 29140 24244 17898 13872 7593
5976 7593 7466 22293 29934 37291 12274 -6880 -7647 -8888 -23702 -30632 -20064 4198 11321 7408
5962 7408 3001 -6627 -18881 -21815 -18330 -25434 -20343 -9178 8922 10262 7486 2360 -9993 -9964
5948 -9964 5133 -1578 -5169 -2479 -8022 -25833 -19564 -18620 2414 11211 1152 -2209 9495 25485
5934 25485 13610 26536 31371 15116 10905 5981 -1585 -12883 -15425 -21268 -27294 -33879 -23528
5921 -23528 -11105 -27188 -26113 -1728 13194 19072 18209 13399 9335 4327 7599 -4095 -14376
5908 -14376 -5908 -6735 -9319 -11414 -30957 -38906 -23589 -2932 1975 -2913 -5205 4234 11836 28078
5894B8078j039m859m837j082m304j5705k2572J2884J8013N135L48J5332n119j0665
5880I608j1128j5811N871P452q440N230J8274m792j6271l055p351M447J7346L736
5866E116l170K910L278k7422r973K5042Q465J63p244j4098Q8J6151J0222k781
5852F747k3605j6062J1169J6298K070J6579P338j2131j0777P023O939L009J0878
5839B5475o174j9198J509J975L746J3106j0551j1307K80M877J8389l021M46O257
5825B5809l805j3803q579O255K599j7709o149J5361K0024N225j8163j0847m129
5812g911O38J192k573j4587ON415K0008j192M469M228p952K644O145k198J1430
5797A9762k569k0555r206k61N88J813j916o221J2147J012r486J0529J765j1613
$$ plain form
5894 28078 27039 22180 17343 16261 11957 -3748 -26320 -13436 4577 9712 10060 25392 20273 9608
5880 9608 -1520 -17331 -11460 -4008 -12448 -7218 11056 6264 -10007 -13062 -20413 -15966 1380 5116
5866 5116 1946 4856 8134 -19288 -29261 -4219 4246 4409 -2835 -16933 -16845 -694 9528 6747
5852 6747 -16858 -32920 -21751 -5453 -3383 13196 20534 8403 -2374 4649 11588 14597 25475
5839 25475 19301 103 1612 3587 7333 20439 9888 -1419 -1139 3738 22127 19106 19552 25809
5825 25809 22004 8201 -378 5877 8476 -9233 -15382 -21 20003 25228 7065 -3782 -7911
5812 -7911 -7273 -6081 -8654 -23241 -23235 -17820 2188 996 5465 9693 1741 4385 10530 8332 19762
5797 19762 17193 -3362 -12568 -12829 -12241 -10428 -12344 -18565 -6418 -5406 -14892 -4363 -2598 -14211
5783a4211K161J5969j742J883J5171l36q261j4248L316q209n369J0818j15R40
5769b233L662M084P720m822j9627l083O790J2648L261l666p902m642P811L430
5755C431j123m590J167n794O21l411n336M660r805M121M715J5265N715m308j0235
5740d907j5726N358J1807N932k74J943Q922j343r277j0826J765L397P970O690
5726A1431Q871n110J256q27j0018o697K582N895j507o117J614j95L65Q501M568
5711A4612q597k0861n345k076J493J0042j3142j8522N840J5654J5593L474J0576
5698H741J924j1349r350N337J538K640P164J75j940m093m978L584j955l552R639
5683C525Q53p265j2205p61J1114K523r26o614K455j195R373n62K137K668p552
$$ plain form
5783 -14211 -12050 3919 2177 4060 19231 18895 10634 -3614 -298 -8507 -13876 -3058 -3173 -2233
5769 -2233 1429 5513 13233 8411 -11216 -14299 -7509 5139 8400 4734 -3168 -7810 1 3431
5755 3431 2308 -2282 -1115 -6909 -6288 -9699 -15035 -10375 -20180 -16059 -11344 3921 9636 5328 -4907
5740 -4907 -20633 -15275 -3468 2464 2190 4133 13055 11712 2435 -8391 -6626 -3229 4741 11431
5726 11431 20302 15192 16448 15621 5603 -1094 1488 7383 5876 -241 1373 1178 1543 10044 14612
5711 14612 6015 -14846 -20191 -22267 -20774 -10732 -23874 -42396 -36556 -20902 -5309 -1835 8741
5698 8741 10665 -684 -10034 -4697 -3159 -519 6645 6820 4880 787 -4191 -607 -2562 -6114 3525
5683 3525 4378 -2887 -15092 -15853 -4739 -2216 -3142 -9756 -7301 -8496 877 315 2452 5120 -2432
5668b432R314J8643r058j6291o460K699m694j412J518K2523K292m825J238L018
5654A6073m688m825M786k344k0366o677N916Q772K842N189J4548N207j375p394
5640A5664j1247j557j2348J457q140j0091K607K4723P307j0060q392l178Q890
5627d365q458q364L927P076p041L402P633L096r388q739L395J3143M549q148p196
5612a5478N240k996J3730P052p425j0815j837j048O13Q331k707j242M924J535
5598b123m414j3226j836K295O623o109K69J3849M590J65J7616J497k98l355k4085
5583h542p186J0476J6563L892N497K959j2013n451m742P750P572o428p566j8075
5569a5294k235Q445l674o992k596J7560P049K103k42M780R327k94K43j5083r200
$$ plain form
5668 -2432 6882 25525 16467 176 -6284 -3585 -8279 -9691 -8173 14350 16642 11817 13055 16073
5654 16073 11385 6560 11346 9002 -11364 -18041 -12125 -3353 -511 4678 19226 24433 23058 15664
5640 15664 4417 2860 -9488 -8031 -16171 -26262 -23655 1068 8375 -1685 -10077 -13255 -4365
5627 -4365 -12823 -21187 -17260 -10184 -17225 -13823 -6190 -3094 -12482 -21221 -17826 -4683 -134 -8282 -15478
5612 -15478 -10238 -13234 496 7548 123 -10692 -12529 -13577 -12964 -4633 -7340 -8582 -3658 -2123
5598 -2123 -6537 -19763 -21599 -19304 -12681 -18790 -18521 -4672 -82 83 17699 19196 18898 15543 -8542
5583 -8542 -15728 -5252 11311 15203 20700 23659 11646 6195 1453 9203 16775 10347 2781 -15294
5569 -15294 -17529 -9084 -12758 -19750 -22346 -4786 2263 4366 4124 8904 18231 17937 18180 3097 -6103
5554f103o081L104j2843M491J972j7217m892L0555J6073n875j3686J749J7522
5541H769l783j3558R091k088r393p843J2598n39J2930K235J894j7878m672j021
5527a3258J420L93N831L00M163J2033p797j6125m345M89j2911N991K796L2472
5513A1452K1659j4662k0107J1516J5560M095j8916o361M984k90Q23K587p151J7250
5499B2439J3913k586j4541j3112N099O884q786p031p695Q365q16j5331J1528O687
5485E017o6J4888J9532Q55r479q721j0825j2059n121O389j0188q742R451J0601
5471A532N79m919j311r173l556J1139j77o027m67L843J9516O89j1005n490J0867
5456F040k23q556k537n19q070k363J008J0119L584j319n226j3776N090J4570K1351
$$ plain form
5554 -6103 -12184 -9080 -21923 -17432 -15460 -32677 -37569 -7014 9059 3184 -10502 -8753 8769
5541 8769 4986 -8572 519 -1569 -10962 -18805 -6207 -6746 6184 8419 10313 -7565 -12237 -13258
5527 -13258 -11838 -11445 -5614 -5314 -1151 10882 3085 -13040 -17385 -16896 -29807 -23816 -21020 11452
5513 11452 33111 18449 -1658 9858 25418 29513 10597 4236 9220 8930 9753 12340 5189 22439
5499 22439 36352 33766 19225 6113 11212 18096 9310 2279 -5416 2949 2133 -13198 -1670 5017
5485 5017 4951 19839 39371 40226 30747 22026 11201 -858 -5979 410 -9778 -18520 -9069 1532
5471 1532 2111 -2808 -4119 -13292 -16848 -5709 -5886 -11913 -12380 -8537 10979 11668 663 -4827 6040
5456 6040 5817 -2739 -5276 -5795 -13865 -16228 -15220 -5101 -1517 -2836 -8062 -21838 -16748 -2178 19173
5441A9173J5004r789p466j1450k353k656m294j179m784j350o330q758J2796K2231
5427H795O346r468J993M428N211p5r580j5530k1137L999J0910J0956J0609j1204
5413c747O77K898k516J1134O064j5587j015J353o010o226k022Q126O832o538j9146
5398b5723j80J8875N983L13j7167m757J1067P374R750j07n964j437l265K350O532
5383C644l470L576K265j0956q526o333m513K043R532l426l138J2211n133j2482
5369b4706o213J0386L5257P843j1031j1338j5330J5784L345L707J7630q996k2967
5356f629j0525k68K329p042P414N675l936n72J951P41n082O348J1555l98J1751
5341A3312J0936O321J609k7871j1326K000M214p67j0271K101J1372p595j170m824
$$ plain form
5441 19173 34177 24388 16922 5472 3119 463 -3831 -5010 -9794 -11144 -17474 -26232 -13436 8795
5427 8795 15141 5673 7666 12094 17305 17230 7650 -7880 -29017 -25018 -14108 -3152 7457 -3747
5413 -3747 -3070 -172 -2688 8446 14510 -1077 -2092 -739 -6749 -12975 -14997 -6871 -39 -6577 -25723
5398 -25723 -25903 -7028 -1045 -732 -17899 -22656 -11589 -4215 5535 5428 -536 -1973 -5238 -2888 3644
5383 3644 174 3750 6015 -4941 -13467 -19800 -24313 -22270 -12738 -16164 -19302 -7091 -12224 -24706
5369 -24706 -30919 -20533 14724 22567 11536 198 -15132 652 3997 7704 25334 16338 -6629
5356 -6629 -17154 -17422 -15093 -22135 -14721 -9046 -12982 -13554 -11603 -10862 -15944 -9596 1959 1561 13312
5341 13312 24248 30569 32178 4307 -7019 -5019 -805 -1572 -11843 -9742 1630 -5965 -7135 -11959
5327a1959R684J4888O145j4805o098q169Q284M907o59r303l237q51M61j0268j1666
5312c2646J7326J5577k02m785n001M165J272M902N149j1337l92j3558N030L058
5298a1442O364m083q549m133M99Q215M92J1474R090M502M074k329o652n991j765
5283b34n181O045K924j2489N440j197M407Q004p173q872l318R302j508j847k902
5268h599J873J364K719l599k453Q955K578k419Q584n19j4978j1020k162L233K562
5253a3881j944M622n319j94R301o914j7415l04P290L625J279j843l800q793k217
5238c6507P050J4084Q58N032J6499n069n750L158Q463N184J4823q333j7160q886
5224f554P251R64q722l898q780J9398J5662m942j4222L698j1494j0896J0630N062
$$ plain form
5327 -11959 -2275 12613 18758 3953 -2145 -10314 -2030 2877 2218 -7085 -10322 -11173 -10712 -20980 -32646
5312 -32646 -15320 257 55 -4730 -9731 -5566 -4294 608 5757 -5580 -5972 -19530 -14500 -11442
5298 -11442 -5078 -9161 -17710 -21843 -21344 -13129 -12637 -1163 7927 12429 16503 14174 7522 1531 -234
5283 -234 -5415 630 3554 -8935 -3495 -4692 -285 7719 546 -8326 -11644 -2342 -3850 -5697 -8599
5268 -8599 -6726 -5362 -2643 -6242 -8695 260 2838 419 9003 8484 -6494 -17514 -19676 -16443 -13881
5253 -13881 -15825 -11203 -16522 -16716 -7415 -14329 -31744 -32048 -24758 -21133 -19854 -21697 -25497 -34290 -36507
5238 -36507 -29457 -15373 -14515 -9483 7016 1947 -3803 -645 7818 13002 27825 19492 2332 -6554
5224 -6554 697 1661 -7061 -10959 -19739 -341 15321 10379 -3843 -145 -11639 -22535 -11905 -6843
5210f843J0715l339q063n922J539N742J194Q654j775N452l462n45m997j1843j1222
5195b4715Q64N541J5533J2025q450m40N246R67k71k066n160N384Q038J4853J3581
5180D0930j6595j8455p858m94K770j42p637O864N36o472l187j219j546J6532J1482
5165A5509j0813j0567j0410K89P514L982J484J2717J7031J124l771l284k415j4471
5151C919j8998K145R81K339L666K307K0045j6j3638J395j0973L531K1201J0839
5137B8743N797n901j8698q079k518J4145j4552l605n276j9502m674J1195K5664
5124B739J5657O458j3826k4623J896j447J8545J730j1957K610J2012j7792m969
5111a2967R369J3706J665R087l472K896o992j0091j2068O658Q196j4031p32R918
$$ plain form
5210 -6843 3872 533 -7530 -13452 -11913 -6171 -4977 3677 1902 7354 3892 3347 -1650 -13493 -24715
5195 -24715 -23851 -18310 -2777 9248 798 358 5604 6571 6300 4234 -926 4458 12496 27349 40930
5180 40930 24335 5880 -1978 -2472 298 156 -7481 -617 -81 -6553 -9740 -10959 -12505 4027 15509
5165 15509 4696 -5871 -16281 -15992 -8478 -4496 -3012 9705 26736 27860 24089 20805 18390 3919
5151 3919 -15079 -12934 -11953 -9614 -5948 -3641 16404 16388 2750 4145 -6828 -3297 17904 28743
5137 28743 34540 28639 9941 1862 -656 13489 -1063 -4668 -9944 -29446 -34120 -22925 2739
5124 2739 18396 24854 11028 -13595 -11699 -13146 5399 7129 -4828 -2218 9794 -7998 -12967
5111 -12967 -3598 10108 11773 20860 17388 20284 13292 3201 -8867 -2209 5987 -8044 -8776 1142
5097A142M132j1268j5146n461R232j328r107l177O009K537Q136N856l740J0026
5083b157N902j4832J0322J249P653m383j1411n941Q290J087j0711R746P843J089
5069C746J2693k494k0461R971J8649L325l010M62j2320j3148j7557J1874J3293
5056E023J907p996J1230l541j1319j104R914Q461p466o024Q440K696K343q120
5042D444M781M974Q49j8994k367k5451q775J4493J1984R392k139r773J2827J2285
5028H530r439p313N055Q035M490l07Q937k45j842j279p422l204M885K056k139
5013H798j912j1873O14k853r827n837J1753p669R358N975O20K918k765N525q343
4998e518k3302j1979L747J5772K386K056K038m288L045L454P444O541J1244k592
$$ plain form
5097 1142 5274 -5994 -21140 -26601 -17369 -18697 -27804 -30981 -24972 -22435 -14299 -8443 -12183 -2157
5083 -2157 3745 -11087 -765 484 8137 3754 -7657 -13598 -5308 -4221 -14932 -5186 2657 3746
5069 3746 16439 13945 -6516 3455 22104 25429 22419 22881 10561 -2587 -20144 -8270 5023
5056 5023 6930 -1066 10164 6623 -4696 -5800 4114 12575 5109 -915 7525 10221 12564 4444
5042 4444 9225 14199 15048 -3946 -6313 -31764 -40539 -26046 -14062 -4670 -6809 -16582 -3755 8530
5028 8530 -909 -8222 -3167 4868 9358 9051 17988 17743 15901 14622 7200 3996 8881 10937 8798
5013 8798 6886 -4987 -4373 -7226 -17053 -22890 -11137 -18806 -9448 -3473 -2853 65 -2700 2825 -5518
4998 -5518 -28820 -40799 -37052 -21280 -18894 -16838 -14800 -19088 -16043 -12589 -5145 1396 12640 10048
4984A0048j206m363j8617k193N379j708R82m925N582K424K695M424k43r760o132
4969a7613K288j982J1804J4720N466M842r808j6950Q840J4034L884j6539Q11P496
4955A1293m557m614N300o480M747k182m83J6418J3036L948l423j4495j1801j4782
4941h075Q30j658j7654R052J28J707j756J276J0133J3164n293o445K828J1737
4927I974P385j0118M673n961n020l426N386q336l631J0969J2202Q424j4693j2086
4913d258r102M044K582M937Q230k856K478k519p614k613J970J2201L159m736k43
4898E660j4222K672J6859K3054J105r425K934j5839k4681K135N684n206k273J5710
4884D167P070j1815M988Q474j1580r266l827P194p154p796J2657M721o77k302
$$ plain form
4984 10048 8842 4479 -14138 -16331 -10952 -12660 -11678 -16603 -11021 -8597 -5902 -1478 -1721 -11481 -17613
4969 -17613 -15325 -17307 -5503 9217 14683 19525 9717 -7233 1607 15641 19525 2986 3797 11293
4955 11293 6736 2122 7422 942 5689 3507 3024 19442 32478 36426 33003 18508 6707 -8075
4941 -8075 -7245 -8903 -26557 -17505 -17377 -15670 -17426 -16150 -6017 7147 1854 -4591 -1763 9974
4927 9974 17359 7241 11914 5953 933 -2493 2893 -5443 -9074 1895 14097 22521 7828 -4258
4913 -4258 -13360 -9316 -6734 -1797 6433 3577 6055 3536 -4078 -6691 -4721 7480 10639 5903 5660
4898 5660 -8562 -5890 10969 34023 35128 25703 28637 12798 -11883 -9748 -4064 -9270 -11543 4167
4884 4167 11237 -578 4410 12884 1304 -7962 -11789 -4595 -11749 -19545 -6888 -2167 -2844 -5146
4870e146P667l965L847P608r02m839j4317j993k043P997N693p641O574j1202j3027
4855b5689l37Q424J0096r32j913n023j661L936N35J0103l487R95j4011n833n121
4840b9918K000L006J3577J3964P378J0731q095r172R049J837q714j1433p911n42
4826a4243m382P452J3445P807J118k1655n802m79R831K3780j0941j2408j937P469
4812i45n848k537J267L747l886J2470R795r86K938o321q795M71J1398n381l165
4797D222O074j0369M263n117q454R846k157o685L360l016P37l119N18M007q339
4782a4229l052N129K0982J0691j2168j8494J844M307k151O353R17L302j4198q450
4768a9217L358R494p344j309l756k259p47J314j505O046J1232L471q96M709J0533
$$ plain form
4870 -5146 2521 -1444 2403 10011 9109 4270 -10047 -12040 -14083 -6086 -393 -8034 -1460 -12662 -25689
4855 -25689 -26026 -17602 -7506 -8438 -10351 -15374 -17035 -13099 -12564 -2461 -5948 -4953 -18964 -24797 -29918
4840 -29918 -27918 -24912 -11335 2629 10007 20738 12643 3471 12520 14357 5643 -5790 -13701 -14243
4826 -14243 -18625 -11173 2272 10079 11197 -10458 -16260 -16739 -6908 16872 5931 -6477 -8414 -945
4812 -945 -6793 -9330 -8063 -4316 -8202 4268 14063 13077 16015 9694 899 1370 12768 7387 4222
4797 4222 10296 -73 4190 -927 -9381 465 -1692 -8377 -5017 -8033 -7296 -10415 -9897 -5890 -14229
4782 -14229 -17281 -12152 8830 19521 7353 -11141 -9297 -4990 -7141 -788 129 3431 -10767 -19217
4768 -19217 -15859 -6365 -13709 -15018 -18774 -21033 -21780 -20466 -21971 -15925 -4693 -1222 -2118 2591 13124
4753A3124M540p490k610j1973L497J2500L826q130m882j5920J1734N732M62l500
4739I10J8499P449j7007j4927o926k667M227P500J0295j926M405l340p262p12
4725a482N383j2811j2100J0343P290N636l867l158L29r821p834N450J2634n76
4711d584Q244J0264J2618O979p608L432J1802k048k475k7048k1657p876Q748P670
4697c539O959K078j6046o807J7953N343m833o572P706K078J824l825p179M916
4683E6j5818r547M183K74J0352p08j5968P241J4989J2436j233k7528j7705n34
4669c9510J6018J8888R123l350j291k8029j061J0048N056M524j5272Q466J1675
4656d715K646N738J8298J1735n008k7948k4881O254P335N63O410l682l963J5049
$$ plain form
4753 13124 17664 10174 7564 -4409 -912 11588 15414 7284 2402 -13518 -1784 3948 4410 910
4739 910 19409 26858 9851 -5076 -12002 -14669 -10442 -2942 7353 5427 9832 6492 -770 -1482
4725 -1482 3901 -8910 -21010 -10667 -3377 2259 -1608 -4766 -4437 -14258 -22092 -16642 -4008 -4584
4711 -4584 3660 13924 26542 33521 25913 29345 41147 39099 36624 9576 -12081 -19957 -11209 -3539
4697 -3539 3420 5498 -10548 -17355 598 5941 1108 -5464 2242 4320 6144 2319 -4860 56
4683 56 -15762 -25309 -21126 -20852 -10500 -11208 -27176 -19935 -4946 7490 6257 -21271 -38976 -39510
4669 -39510 -23492 -4604 4519 1169 -122 -28151 -29212 -19164 -14108 -9584 -24856 -16390 -4715
4656 -4715 -2069 3669 21967 33702 28694 746 -24135 -17881 -10546 -9983 -3573 -7255 -11218 3831
4642C831j784J2853j291r552J366j4202J471J0159J2590M123o902j5104P512N179
4628A0249J1749k21j5939L829L082P98J4997l836r396l722m407j1868L430J2295
4614A1040J3118o703P86l450j4566p59j1230L341l915j796j466N974m449j0241
4600b4316n783O003P683R961Q706m166j0739K841N465K659j4696k248N564R079
4586c987j049l281R382j1972j3193J0795J0168j0789J3216k769j0589L355j627
4573a2340o215P522L924j0858K423Q152j1939O427N881Q783L431N3n266j2717
4559a2739k162N83J5494j554r209R471L650o057j0433N934J5615j6145j816P72
4545h596P145M828p215n317l73J5207M835N273l334o933K527L708J848j5728j4385
$$ plain form
4642 3831 2047 14900 13609 4057 5423 -8779 -7308 2851 15441 19564 12662 -2442 5070 10249
4628 10249 21998 21777 5838 9667 12749 13547 28544 24708 15312 11590 7183 -4685 -1255 11040
4614 11040 24158 17455 18241 14791 225 -534 -11764 -8423 -12338 -14134 -15600 -9626 -14075 -24316
4600 -24316 -30099 -24096 -16413 -6452 2254 -1912 -12651 -9810 -4345 -1686 -16382 -18630 -13066 -3987
4586 -3987 -5036 -8317 1065 -10907 -24100 -13305 -3137 -13926 -710 -3479 -14068 -10713 -12340
4573 -12340 -18555 -11033 -7109 -17967 -15544 -7392 -19331 -12904 -7023 1760 5191 5244 -22 -12739
4559 -12739 -14901 -14318 1176 -378 -9587 -116 3534 -2523 -12956 -7022 8593 -7552 -9368 -8596
4545 -8596 -1451 3377 -3838 -9155 -9528 5679 10514 15787 12453 5520 8047 11755 13603 -2125 -16510
4530a6510Q651J3717R020j3401K514M82O97k458k6417N45J1534J4696K090l902
4516A258j6348m981n68P005O486J4943J0547n134j266j0349j1261K408J0789M679
4502H208M604n339j3973k532O313l634J398r668r624k431K259K0018J0356n629
4488C26M85J1315l340p145L623m43J352j488l672j47n770O384J2448J6405k28
4473C0105r848j2141R333Q506k226K192n875j9873P275J3586m980j1607j2600
4460h153J4303j745j5087j1530o015J3170J5158l700j4758l864K9497J8122j0367
4447A5031m720P613o812p450N514K869j4926L159K3552j4976q706j6179p038J3407
4433i662K122j0346r357r051Q340J0318q805r111J4679R364R978K0450l516p644
$$ plain form
4530 -16510 -7859 5858 14878 1477 3991 4473 5170 2712 -23705 -23160 -11626 3070 5160 1258
4516 1258 -15090 -20071 -20639 -13634 -7148 7795 18342 13208 11942 1593 -9668 -7260 3529 8208
4502 8208 12812 7473 -6500 -9032 -2719 -6353 -4955 -14623 -24247 -26678 -24419 -4401 5955 326
4488 326 811 12126 8786 1641 5264 4821 6173 4685 1013 866 -4904 1480 13928 30333 30105
4473 30105 20257 8116 17449 25955 23729 25921 20046 173 7448 21034 16054 4447 -8153
4460 -8153 6150 4405 -10682 -22212 -28227 -15057 101 -3599 -18357 -22221 7276 25398 15031
4447 15031 10311 17924 11112 3662 9176 12045 -2881 278 23830 8854 148 -16031 -23069 -9662
4433 -9662 -7540 -17886 -27243 -36294 -27954 -17636 -26441 -35552 -20873 -11509 -1531 18919 15403 7759
4419G759L556L201m912r831k260J316N590Q01O57K756N89J462j594j2024m843
4404g777J5157K002j0939j034Q247L110K640R789q322j0286O810R82j0596j5737
4390a5954k668O82K1050Q819K68j2028j5817R337M834N950N444k987L593m243
$$ plain form
4419 7759 11315 14516 9604 -227 -2487 -1171 4419 5220 5877 8633 9222 10684 9090 -2934 -7777
4404 -7777 7380 9382 -1557 -2591 5656 8766 11406 21195 12873 2587 9397 10379 -217 -15954
4390 -15954 -18622 -17940 3110 11929 12197 169 -15648 -6311 -1477 4473 9917 6930 10523 6280
$$ [...]
##END NTUPLES=NMR SPECTRUM
##END=
