##TITLE=Analysis number 311889
Compound Code btb 02913
Project Code adrs
Chemist Name stores
##JCAMPDX= 6.0         $$ Bruker NMR JCAMP-DX V2.0
##DATA TYPE= NMR SPECTRUM
##DATA CLASS= NTUPLES
##ORIGIN= Bruker BioSpin GmbH
##OWNER= NMR
$$ XWIN-NMR		Version 3.5
$$ Tue Jul 19 10:18:52 2005 GMT Daylight Time (UT+1h)  MAYBRIDGE\NMR@NMR_250MHZ
##.OBSERVE FREQUENCY= 250.131544655141
##.OBSERVE NUCLEUS= ^1H
##.ACQUISITION MODE= SIMULTANEOUS (DQD)
##.ACQUISITION SCHEME= undefined
##.AVERAGES= 16
##.DIGITISER RES= 18
##SPECTROMETER/DATA SYSTEM= dpx250
##.PULSE SEQUENCE= zg30
##.SOLVENT NAME= CDCl3
##.SHIFT REFERENCE= (INTERNAL, CDCl3, 0, 16.522)
##AUDIT TRAIL= $$ (NUMBER, WHEN, WHO, WHERE, WHAT)
$$ ##TITLE= Audit trail, XWIN-NMR		Version 3.5
$$ ##JCAMPDX= 5.01
$$ ##ORIGIN= Bruker BioSpin GmbH
$$ ##OWNER= NMR
$$ C:\u/data/dgb/nmr/ADRS/6030/pdata/1/auditp.txt
$$ ##AUDIT TRAIL=  $$ (NUMBER, WHEN, WHO, WHERE, WHAT)
(   1,<2005-07-19 10:18:32.88 +100>,<MAYBRIDGE\NMR>,<NMR_250MHZ>,
      <created by zg, POWCHK disabled, PULCHK disabled
       configuration hash MD5:
       62 19 C7 07 E1 42 D1 B7 37 6C 3D D0 77 39 F9 E6
       data hash MD5: 64K
       14 E1 A5 2D 17 C9 28 DB 80 79 F3 C0 0D D4 74 2E>)
(   2,<2005-07-19 10:18:44.14 +100>,<MAYBRIDGE\NMR>,<NMR_250MHZ>,
      <Start of raw data processing
       ef LB = 0.3 FT_mod = 6 PKNL = 1 SI = 32K 
       data hash MD5: 32K
       46 BB CF 12 03 F2 B8 E8 59 59 7F 6D 21 A5 E6 FB>)
(   3,<2005-07-19 10:18:46.02 +100>,<MAYBRIDGE\NMR>,<NMR_250MHZ>,
      <apk 
       data hash MD5: 32K
       F7 C0 26 70 3C 6F 2C B4 EB 47 15 9A B3 F5 75 31>)
(   4,<2005-07-19 10:18:46.79 +100>,<MAYBRIDGE\NMR>,<NMR_250MHZ>,
      <abs ABSG = 5 
       data hash MD5: 32K
       2A E0 01 56 C6 F5 1A 0C F0 7C 8F 8D AC 62 B9 83>)
$$ ##END=
$$ 
$$ hash MD5
$$ 5C C1 93 E4 77 17 14 C8 F9 DC 36 BF CB 6F 9F 16
##$RELAX= 
##$RELAX= 
##$RELAX= 
##$RELAX= 
##$RELAX= 
##$RELAX= 
##$RELAX= 
$$ Bruker specific parameters
$$ --------------------------
##$DU= <C:\u>
##$EXPNO= 6030
##$NAME= <ADRS>
##$PROCNO= 1
##$TYPE= <nmr>
##$USER= <dgb>
##$AMP= (0..31)
100 100 100 100 100 100 100 100 100 100 100 100 100 100 100 100 100 100 
100 100 100 100 100 100 100 100 100 100 100 100 100 100 
##$AQSEQ= 0
##$AQ_mod= 3
##$AUNM= <au_zg>
##$AUTOPOS= <7 >
##$BF1= 250.13
##$BF2= 250.13
##$BF3= 250.13
##$BF4= 250.13
##$BF5= 500.13
##$BF6= 500.13
##$BF7= 500.13
##$BF8= 500.13
##$BYTORDA= 1
##$CFDGTYP= 0
##$CFRGTYP= 5
##$CHEMSTR= <none>
##$CNST= (0..31)
1 1 145 1 1 1 1 1 1 1 1 1 1 1 1 1 1 1 1 1 1 1 1 1 1 1 1 1 1 1 1 1 
##$CPDPRG= <>
##$CPDPRG1= <>
##$CPDPRG2= <>
##$CPDPRG3= <>
##$CPDPRG4= <mlev>
##$CPDPRG5= <mlev>
##$CPDPRG6= <mlev>
##$CPDPRG7= <mlev>
##$CPDPRG8= <mlev>
##$CPDPRGB= <>
##$CPDPRGT= <>
##$D= (0..31)
0 1 0 0 0 0 0 0 0 0.06 0 0 0 0 0 0 0.0002 0 0 0 0 0 0 0 0 0 0 0 0 0 0 
0 
##$DATE= 1121764712
##$DBL= (0..7)
120 120 120 120 120 120 120 120 
##$DBP= (0..7)
150 150 150 150 150 150 150 150 
##$DBP07= 0
##$DBPNAM0= <>
##$DBPNAM1= <>
##$DBPNAM2= <>
$$ [...]
##$SUBNAM7= <"">
##$SUBNAM8= <"">
##$SUBNAM9= <"">
##$SW= 20.6930455092707
##$SWIBOX= (0..15)
0 0 3 0 0 0 0 0 0 0 0 0 0 0 0 0 
##$SW_h= 5175.983436853
##$TD= 65536
##$TD0= 1
##$TE= 295.16
##$TE2= 300
##$TE3= 300
##$TEG= 300
##$TL= (0..7)
0 120 120 120 120 120 120 120 
##$TP= (0..7)
150 150 150 150 150 150 150 150 
##$TP07= 0
##$TPNAME0= <>
##$TPNAME1= <>
##$TPNAME2= <>
##$TPNAME3= <>
##$TPNAME4= <>
##$TPNAME5= <>
##$TPNAME6= <>
##$TPNAME7= <>
##$TPOAL= (0..7)
0.5 0.5 0.5 0.5 0.5 0.5 0.5 0.5 
##$TPOFFS= (0..7)
0 0 0 0 0 0 0 0 
##$TUNHIN= 0
##$TUNHOUT= 0
##$TUNXOUT= 0
##$USERA1= <user>
##$USERA2= <user>
##$USERA3= <user>
##$USERA4= <user>
##$USERA5= <user>
##$V9= 5
##$VALIST= <valist>
##$VCLIST= <CCCCCCCCCCCCCCC>
##$VD= 0
##$VDLIST= <DDDDDDDDDDDDDDD>
##$VPLIST= <PPPPPPPPPPPPPPP>
##$VTLIST= <TTTTTTTTTTTTTTT>
##$WBST= 1024
##$WBSW= 4
##$XGAIN= (0..3)
0 0 0 0 
##$XL= 0
##$YL= 0
##$YMAX_a= 449982
##$YMIN_a= -437187
##$ZGOPTNS= <>
##$ZL1= 120
##$ZL2= 120
##$ZL3= 120
##$ZL4= 120
##$ABSF1= 16.522
##$ABSF2= -4.171173
##$ABSG= 5
##$ABSL= 3
##$ALPHA= 0
##$AQORDER= 0
##$ASSFAC= 0
##$ASSFACI= 0
##$ASSFACX= 0
##$ASSWID= 0
##$AUNMP= <proc_1d>
##$AZFE= 0.1
##$AZFW= 0.1
##$BCFW= 0
##$BC_mod= 0
##$BYTORDP= 0
##$COROFFS= 0
##$CY= 12.5
##$DATMOD= 1
##$DC= 0
##$DFILT= <>
##$DTYPP= 0
##$F1P= 14.0000005364418
##$F2P= -0.99999901652339
##$FCOR= 0.5
##$FTSIZE= 32768
##$FT_mod= 6
##$GAMMA= 0
##$GB= 0
##$INTBC= 1
##$INTSCL= 1
##$ISEN= 128
##$LB= 0.3
##$LEV0= 0
##$LPBIN= 0
##$MAXI= 10000
##$MC2= 0
##$MEAN= 0
##$ME_mod= 0
##$MI= 0
##$NCOEF= 0
##$NC_proc= -2
##$NLEV= 6
##$NOISF1= 0
##$NOISF2= 0
##$NSP= 0
##$NTH_PI= 0
##$NZP= 0
##$OFFSET= 16.522
##$PC= 1
##$PHC0= -77.89024
##$PHC1= 6.33689
##$PH_mod= 1
##$PKNL= yes
##$PPARMOD= 0
##$PSCAL= 4
##$PSIGN= 0
##$REVERSE= no
##$SF= 250.13
##$SI= 32768
##$SIGF1= 0
##$SIGF2= 0
##$SINO= 400
##$SIOLD= 32768
##$SREGLST= <1H.CDCl3>
##$SSB= 0
##$STSI= 32768
##$STSR= 0
##$SW_p= 5175.98343685301
##$SYMM= 0
##$S_DEV= 0
##$TDeff= 65536
##$TDoff= 0
##$TI= <Analysis number 999999
Compound Code 99
Book Reference 9
Project Code 9>
##$TILT= no
##$TM1= 0
##$TM2= 0
##$TOPLEV= 0
##$USERP1= <user>
##$USERP2= <user>
##$USERP3= <user>
##$USERP4= <user>
##$USERP5= <user>
##$WDW= 1
##$XDIM= 32768
##$YMAX_p= 299082838
##$YMIN_p= -36211
$$ End of Bruker specific parameters
$$ ---------------------------------
##NTUPLES= NMR SPECTRUM
##VAR_NAME=  FREQUENCY,     SPECTRUM/REAL,   SPECTRUM/IMAG
##SYMBOL=    X,             R,               I
##VAR_TYPE=  INDEPENDENT,   DEPENDENT,       DEPENDENT
##VAR_FORM=  AFFN,          ASDF,            ASDF
##VAR_DIM=   32768,         32768,           32768
##UNITS=     HZ,            ARBITRARY UNITS, ARBITRARY UNITS
##FACTOR=    0.157963299565203, 1,           1
##FIRST=     4132.6476996994, 0,             0
##LAST=      -1043.33573715361, 0,           0
##MIN=       -1043.33573715361, -36211,      0
##MAX=       4132.6476996994, 299082838,     0
$$ Real data points
##PAGE= N=1
##DATA TABLE= (X++(R..R)), XYDATA
$$ [...]
19901A65534M3095M8313N3486M9116K9137r628m1628m9255m2545l7631k2765j0813
$$ 165534 208629 256942 310428 359544 388681 379053 337425 288170 245625 207994 185229 174416
19889A74416K2515M6033M9577O3403N0549L2772n949m7185o9052p5060n1372k9503
$$ 174416 196931 242964 292541 355944 406493 439265 433316 386131 317079 242019 190647 161144
19877A61144k4328j8517j0174q601m417n080O70O34n078j2386J543o22N040R52
$$ 161144 136816 118299 108125 99524 95107 90027 90697 91331 86253 73867 75410 74788 79828 80780
19863H0780l051q768K829K745o764r284m267k953Q696O24o792l30O074M374M53
$$ 80780 77729 68961 71790 74535 67771 58487 54220 51267 59963 60587 53795 53465 59539 63913 64366
19848F4366j1204j1247J343j923j1691K431J0664J78K920K433o56K578L581p0
$$ 64366 53162 41915 43258 41335 29644 32075 42739 42917 45837 48270 47614 50192 53773 53703
19834E3703j5421q187m007m582k186j643M778N726n158m057M403p43m681J1174
$$ 53703 38282 30095 26088 21506 19320 17677 22455 28181 23023 18966 23369 22626 17945 29119
19820B9119O968o050J582J2215n27o293n863j77p364K151q5n19K107L4P452m84
$$ 29119 36087 30037 31619 43834 43307 37014 31151 30974 23610 25761 25676 25157 27264 27298 34750 34266
19804C4266n321K174n905M440n002l908o682O80K639J389Q655O681L003L880n908
$$ 34266 28945 31119 25214 29654 24652 20744 14062 14742 17381 18770 27425 34106 37109 40989 35081
19789C5081o568j73R373K450j074J218k061j0450k84n380Q72Q018k432J050L899
$$ 35081 28513 28340 37713 40163 39089 40307 38246 27796 27512 22132 23004 31022 28590 29640 33539
19774C3539L606K57n146n882K161Q622Q62j207n270J381P812K839j68l511k566
$$ 33539 37145 37402 32256 26374 28535 37157 38019 36812 31542 32923 40735 43574 43406 39895 37329
19759C7329L0r593l616N408N04q64J064j725l848N220M304j94l202L413q403m832
$$ 37329 37359 27766 24150 29558 30062 29198 30262 28537 24689 29909 34213 34019 30817 34230 25827 20995
19743B0995Q12Q079J586j2625J463J5825L294k462n462P93k73k44M52o33j253
$$ 20995 21807 29886 31472 18847 20310 36135 39429 36967 31505 32298 32025 31781 32233 31600 30347
19728C0347l359o070m3M162P744K715o308N466p14M907J3681K282j2703m853N06
$$ 30347 26988 20918 20875 25037 32781 35496 29188 34654 33940 38847 52528 54810 42107 37254 37760
19713C7760J560M367J522N597M550P62M715o069j2312j1898r944L01J6277L831
$$ 37760 39320 43687 45209 50806 55356 56118 60833 54764 42452 30554 20610 20911 37188 41019
19699D1019N534O984l031j1513j0445Q398l12r385Q056N956j0251p30N040M618
$$ 41019 46553 53537 50506 38993 28548 36946 36634 27249 35305 41261 31010 30280 35320 39938
19685C9938Q928O182j3206j5223J1921J6529m821J310k357j656o952r068l924
$$ 39938 48866 55048 41842 26619 38540 55069 50248 51558 49201 47545 40593 31525 27601
19672B7601Q328N112q752J749m579M22K439J1677R227m799o818q123j1903j747
$$ 27601 35929 41041 32289 34038 29459 29881 32320 43997 53224 48425 41607 33484 21581 19834
19658A9834M276J2543M145O025P305l422P23K599j469J057K138k815N703l215
$$ 19834 24110 36653 40798 46823 54128 50706 51429 54028 52559 53616 55754 52939 58642 55427
19644E5427q694o516n6P492n820p150k065Q650O711P693P012M858n084n746q030
$$ 55427 46733 40217 40161 47653 41833 34683 32618 41268 47979 55672 62684 67542 62458 56712 48682
19629D8682J550J5405J3770K890M062k791Q97j761p64P52K917j755J24j087r516
$$ 48682 50232 65637 79407 82297 86359 83568 84465 82704 81940 82692 85609 83854 83978 82891 73375
19614G3375N852M477J1839P023j183n835l962j1616k683j1769o066M815K601J705
$$ 73375 79227 83704 95543 102566 101383 95548 91586 79970 77287 65518 59452 64267 66868 68573
19600F8573M82o598l876M819Q142q88j020J026N760K115l973m359o700L817O712
$$ 68573 69055 62457 58581 63400 71542 70654 69634 70660 76420 78535 74562 70203 63503 67320 74032
19585G4032n410L820k485M902J0996r96O97m496n425K048K863k457j146k130N097
$$ 74032 68622 72442 69957 74859 85855 84859 85556 81060 75635 77683 80546 78089 76943 74813 79910
19570G9910L309L513j737J57J687J582j898J289J4883O864O125K2651K3303K5498
$$ 79910 83219 86732 84995 85152 86839 88421 86523 87812 102695 109559 115684 138335 161638 187136
19556A87136J9244j413j5073k6422k7763j1874j4698J683J2701Q486K0408K3926
$$ 187136 206380 204967 189894 163472 135709 123835 109137 110820 123521 132007 152415 176341
19544A76341K7642K0705Q862m720j8964k8142l2183k8257j2203K705J216M590
$$ 176341 203983 224688 233550 228830 209866 181724 149541 121284 109081 111786 113002 117592
19532A17592l732j3019l877n599k063J0039J1787L781m255L295J6165K3202R989
$$ 117592 113860 100841 96964 91365 89302 99341 111128 114909 110654 113949 130114 153316 163305
19519A63305J8785J9492J1219J1817K0192J4973j329j6716k4209j4772j514J999
$$ 163305 182090 201582 212801 224618 244810 259783 258454 241738 217529 202757 201243 203242
19507B03242J3265J1375K0300K3662K5963M2574L8812K2074p645k8351k4098j4933
$$ 203242 216507 227882 248182 271844 297807 340381 379193 401267 393622 365271 341173 326240
19495C26240j7618k4839n874q436j0167k2199j6518R82J4224K2112J9637J5241
$$ 326240 308622 283783 277909 269473 259306 237107 220589 221571 235795 257907 277544 292785
19483B92785J4461q552j0899j8831k2111j6913j7357j7848q218l134K194R314
$$ 292785 307246 298694 287795 268964 246853 229940 212583 194735 186517 183383 185577 194891
19471A94891M200J4702J0978J2622J1908J7290K6827J9742J5651L3089K3686K578
$$ 194891 199091 213793 224771 237393 249301 266591 293418 313160 328811 361900 385586 388164
19459C88164j1838m0444j9480J5100J0736P740L3312L0062K8556L1308L7460K7555
$$ 388164 376326 335882 316402 331502 342238 349978 383290 413352 441908 473216 510676 538231
19447E38231m299k5409n1132n0479k4103r383p256k69R417Q723q684p004J1217
$$ 538231 533932 508523 457391 406912 382809 373426 366170 365901 375318 384041 375357 368353 379570
19434C79570O243Q699O27o988P166R182J591M806J2520J5565N915O619O756N226
$$ 379570 385813 394512 395139 388151 395317 404499 406090 410896 423416 438981 444896 451515 458271 463497
19420D63497N986M957P097K1690J5117Q208J3065J0737J9325J4955J2292K1969
$$ 463497 469483 474440 481537 503227 518344 526552 539617 550354 569679 584634 596926 618895
19408F18895K1435J6791J5114J3236K6268L9855M6652M4636O3332Q1209R7565
$$ 618895 640330 657121 672235 685471 711739 751594 798246 842882 906214 987423 1084988
19397A084988J18069J46560J48675J40566J30573R1165O3146M6265M5028Q3473
$$ 1084988 1203057 1349617 1498292 1638858 1769431 1860596 1923742 1970007 2015035 2098508
19387B098508J53148K29920L23226M21348N28017O30257P08428Q09116R77024
$$ 2098508 2251656 2481576 2804802 3226150 3754167 4384424 5092852 5901968 6878992
19378F878992J286336J802394K629771L852125N541954P455008R242127J0955700
$$ 6878992 8165328 9967722 12597493 16449618 21991572 29446580 38688707 49644407
19370D9644407J0945713P231113J435560n765958j0249076j1288913q357102m130334
$$ 49644407 60590120 67821233 69256793 63490835 53241759 41952846 33595744 29465410
19362B9465410m01013K847355N722714Q043710J0136768J0881451P540867J536397
$$ 29465410 29064397 31911752 37634466 45678176 55814944 66696395 74237262 75773659
19354G5773659o120236j1712035j3736161j1838066q017399m952653k955779j812784
$$ 75773659 69653423 57941388 44205227 32367161 24349762 19397109 16441330 14628546
19346A4628546j179341q52676p21112p14142p41681p28643o95073o23715n13755
$$ 14628546 13449205 12596529 11875417 11161275 10419594 9690951 8995878 8372163 7858408
19337G858408l91213k67591j63788q9164q8953j59751k56815l74233m55946m68553
$$ 7858408 7467195 7199604 7035816 6946652 6857699 6697948 6441133 6066900 5610954 5142401
19327E142401m45149m02430l48920l09882k59784k28982k09815k01932j86935
$$ 5142401 4697252 4294822 3945902 3636020 3376236 3147254 2937439 2735507 2548572
19318B548572j68026j56698j36264j32890j30540j09499r8948r3262q5929o6433
$$ 2548572 2380546 2223848 2087584 1954694 1824154 1714655 1615707 1522445 1436516 1370083
19308A370083p3716o4863n0456n0500n9701o5385m5688n3382m5206l9493m8045
$$ 1370083 1296367 1231504 1181048 1130548 1070847 1005462 959774 906392 861186 821693 773648
19297G73648l4364l4445l6896l8784l4322k1409k1521k3408p295j5403k4897k9816
$$ 773648 739284 704839 667943 629159 594837 573428 551907 528499 521204 505801 480904 451088
19285D51088l4130j9249l1666j8820j2367j7681j5185j5929j7902j0520q759j6094
$$ 451088 416958 397709 366043 347223 334856 317175 301990 286061 268159 257639 248880 232786
19273B32786j182k457j8429j6348j0568p42J216J0441j0771r872p092j3072m315
$$ 232786 231604 229147 210718 194370 183802 183060 184276 194717 183946 174074 166982 153910 149595
19260A49595p309N129L198p648q637o892K839J4643J5124Q794P2l564k349Q376
$$ 149595 142286 147415 150613 142965 134328 127436 130275 144918 160042 168836 168908 165344 162995 171371
19246A71371J6526J5412J0724O072l015j0664p112j5197r886L588j822p499L418
$$ 171371 187897 203309 214033 220105 217090 206426 199314 184117 174231 177819 175997 168498 171916
19233A71916J5239J2045J5968J1076p823j7794l2354k7254j3276o645n585k140
$$ 171916 187155 199200 215168 226244 218421 200627 168273 141019 127743 121098 115513 113373
19221A13373Q610O78r433P802R600K7086K0912J5481O486J0383L412j1470j4444
$$ 113373 121983 122661 113228 121030 130630 157716 178628 194109 200595 210978 214390 202920 188476
19208A88476r630M24L564r138L475J3970J0975Q468J4548J0221K699r439j9886
$$ 188476 178846 179270 182834 173696 177171 191141 202116 210584 225132 235353 238052 228613 208727
19195B08727r867j3921n673r495n212j088M953J364J059N542Q547M868l118k910
$$ 208727 198860 184939 179266 169771 164559 163471 168424 169788 170847 176389 184936 189804 186686 183776
19181A83776p78K962J754P515M128m991m449N65m873j689J1094K7198L8196M0920
$$ 183776 182998 185960 187714 195229 199357 194366 189917 190482 185609 183920 195014 222212 260408 301328
19167C01328L7355M8836L6446J0026k729k7929k6633k9586l9796l6976m0064j8346
$$ 301328 338683 387519 423965 433991 431262 403333 376700 347114 307318 270342 230278 211932
19155B11932r064j5701r200k416p52N814J1732J1013J8239O891j3351k0369j7873
$$ 211932 202868 187167 177967 175551 174799 180613 192345 203358 221597 228488 215137 194768 176895
19142A76895j7146j0435j3339j5084K349j991k386l273n545K126N321J5813L400
$$ 176895 159749 149314 135975 120891 123240 121249 118863 115590 110045 112171 117492 133305 136705
19129A36705Q044J3493Q211R293K0107P16J402N53K058R671J6466L3522L6971
$$ 136705 144749 158242 166453 175746 195853 196569 197971 198524 200582 210253 226719 260241 297212
19116B97212N1199O9007P3793P0200N5221L1759k0610n5349o8350p3080o3024
$$ 297212 348411 417418 491211 561411 616632 648391 627781 572432 504082 431002 367978
19105C67978l6133j9061j1988O523K1759K7623K5419L0715M1858M5305J8733p802
$$ 367978 331845 312784 300796 307319 329078 356701 382120 412835 454693 499998 518731 510929
19093E10929j8816l1731l9880n9450l9975j2813M223J902Q00Q506L54M20K62j1471
$$ 510929 492113 460382 420502 361052 321077 308264 312487 314389 315189 323695 324049 324469 324731 313260
19079C13260k0528j3875q358n190k328J2499K6675K4811J3427O756j062q166o042
$$ 313260 292732 278857 270499 265309 262981 275480 302155 326966 340393 347149 346087 337921 331879
19066C31879j0547K891L830J502m234Q435K3163K0150K8215L6198K4210N437r414
$$ 331879 321332 324223 328053 329555 325321 333756 356919 377069 405284 441482 465692 471129 461715
19053D61715j3666O79Q519J0655J9083L5468L6588M7610M3809M6388M5369J9380
$$ 461715 448049 448728 457247 467902 486985 522453 559041 606651 650460 696848 742217 761597
19041G61597j1751k9728m3606l3425l1713j6002J1083J0461J4177L3633N3698
$$ 761597 749846 720118 676512 643087 611374 595372 606455 616916 631093 664726 718424
19030G18424K9708p444l0252j9999j0271l26Q939L5261M8479N9005Q6436R4239
$$ 718424 748132 740688 710436 690437 680166 679840 688779 724040 772519 831524 917960 1012199
19018A012199Q6041O1123K5287n114N383M7991R3797J21779J59555K23736K90458
$$ 1012199 1098240 1159363 1184650 1179536 1184919 1232910 1326707 1448486 1608041 1831777 2122235
19007B122235L65673M44505N57127P34420J013120J418361K035051K926142L970141
$$ 2122235 2487908 2932413 3489540 4223960 5237080 6655441 8690492 11616634 15586775
18998A5586775M757715N348152N616231L357315j458013n683831o592112m693099
$$ 15586775 20344490 25692642 31308873 34666188 33208175 27524344 20932232 16239133
18990A6239133k539371q93446L54184J517768K733168L677304M292176M710134
$$ 16239133 13699762 12806316 13160500 14678268 17411436 21088740 25380916 30091050
18982C0091050L342948q36487n083757o776291n417387l538107k185608j412553
$$ 30091050 33433998 32597511 27513754 20737463 15320076 11781969 9596361 8183808
18974H183808r37308o28470m53470l73301l43079k94172k35903j70188j24008
$$ 8183808 7246500 6618030 6164560 5791259 5448180 5154008 4918105 4747917 4623909
18965D623909o7801m3333n1442m9444j9050J9171L5726J4853L1859P5221J61919
$$ 4623909 4556108 4512775 4461333 4411889 4392839 4412010 4447736 4462589 4494448 4569669 4731588
18954D731588L04576M39483O14682Q64646J213846J743065K538579L677930N025707
$$ 4731588 5036164 5475647 6090329 6954975 8168821 9911886 12450465 16128395 21154102
18945B1154102O059792O805131P229426M728869j385001p104934q808005o514267
$$ 21154102 27213894 34019025 41248451 45977320 44592319 37487385 28679380 22165113
18937B2165113l618496j338075L70130J929483L545087M855710N671259O265473
$$ 22165113 18546617 17208542 17578672 19508155 23053242 27908952 33580211 39845684
18929C9845684M774818o29829o501399r270247p690582n068041l095300j938170
$$ 39845684 44620502 43990673 37489274 28219027 20528445 15460404 12365104 10426934
18921A0426934j275924q68173o50256n61378n12202m71233m25146l80158l04096
$$ 10426934 9151010 8282837 7632581 7071203 6559001 6087768 5662622 5282464 4978368
18912D978368k36398j88284j44821q3542m5043n2267j09529k10876k78581k77435
$$ 4978368 4741970 4553686 4408865 4325323 4280280 4228013 4118484 3907608 3629027 3351592
18902C351592k62202k33753k10154j75147j36639j25187j04384q7287q8372j25836
$$ 3351592 3089390 2855637 2645483 2470336 2333697 2208510 2104126 2016839 1928467 1802631
18892A802631j35381j42163j20341j00163q0939p1352o4582n3383m5630l9837
$$ 1802631 1667250 1525087 1404746 1304583 1223644 1152292 1087710 1034327 988697 948860
18882I48860l8121m4722m7869m7155l9141l9450l2566l6724k6699j9286o266j5190
$$ 948860 910739 866017 818148 770993 731852 692402 659836 623112 596413 577127 570861 555671
18870E55671k8021l9768l3133k4233k2375j4501j2752r450j1661j4323m056m210
$$ 555671 527650 487882 454749 430516 408141 393640 380888 371438 359777 345454 341398 337188
18858C37188R57l393k2842j4402p972k2124j0429j1098j0629k653j1320J001O338
$$ 337188 338145 334752 311910 297508 289536 267412 256983 245885 235256 232603 221283 222284 228622
18845B28622j3555n221M388J8879K3653K4094L7675N6822O8285O0911L9994J1931
$$ 228622 215067 209846 214234 233113 256766 280860 318535 375357 443642 504553 544547 556478
18833E56478j5767m5506n4561m3651l1348j5688N208J0445J0846L4040L6929K7268
$$ 556478 540711 495205 440644 396993 365645 349957 355165 365610 376456 410496 447425 474693
18821D74693Q431j0413k0253l2569o9086m9136k8698l5072j8983r334q363j11
$$ 474693 483124 472711 452458 419889 350803 301667 272969 237897 218914 209580 201217 201106
18809B01106J0301J7258R579N299k744l704k422J80j3076j7665j2789j3091j1053
$$ 201106 211407 228665 238244 243543 240799 237095 234673 234853 221777 204112 191323 178232 167179
18796A67179r546k293L025J037J071P736j892r710l218l764P95j865j1090r444
$$ 167179 157633 155340 158365 159402 160473 168209 166317 156607 153389 149625 150420 148555 137465 128021
18782A28021p12J3874J510J628M508R824j0166j918O60k019Q219J726J910K334
$$ 128021 127309 141183 142693 144321 148829 158653 148487 146569 147229 145210 153429 155155 157065 159399
18768A59399M890J3495J5886J9038N891j0240j1890J681J2859Q062Q269J3044
$$ 159399 164289 177784 193670 212708 218599 208359 196469 198150 211009 219071 227340 240384
18756B40384J0594K0329J2230O15r860j6841k2221k2480j5392j2718n327k096
$$ 240384 250978 271307 283537 284152 274292 257451 235230 212750 197358 184640 179313 177217
18744A77217j5537k1277n859m512O461J8535O490K35j1618n161J758Q11j876l991
$$ 177217 161680 140403 134544 130032 136493 155028 161518 161753 150135 144974 146732 147543 145667 141676
18730A41676j386j637N109P682L066O286n47L279P881o788j0213L153O271M192
$$ 141676 140290 138653 143762 151444 154510 160796 160249 163528 171409 164621 154408 157561 163832 168024
18716A68024O196n76j328Q707J6249J1638M80L840J2113J3812K3530K2522J0388
$$ 168024 174220 173644 172316 181023 197272 208910 209390 213230 225343 239155 262685 285207 295595
18703B95595R714J8971P888K15j462r805k5024k7899q894j0546k644R139J7592
$$ 295595 305309 324280 332168 332383 330921 321116 296092 268193 259299 248753 246109 255248 272840
18690B72840M244o256R442J046Q774Q182J619N709J0690J3160N562J0211J142
$$ 272840 277084 270828 280270 281316 290090 298272 299891 305600 316290 329450 335012 345223 346365
18677C46365N661J1129R469Q268K1035K0235J4031J9072J1439J5757K2262K0163
$$ 346365 352026 363155 372624 380892 401927 422162 436193 455265 466704 482461 504723 524886
18665E24886J9382J2980K6631K7905K7824N9248P4292Q4596J05728J32391J62678
$$ 524886 544268 557248 583879 611784 639608 698856 773148 857744 963472 1095863 1258541
18654A258541J86748J72221J14321M5070k9797m5032k1479K6080P2883R6623J35216
$$ 1258541 1445289 1617510 1731831 1776901 1747104 1702072 1680593 1706673 1779556 1876179 2011395
18643B011395J88603K51168L47554M62800O11111Q14802J112660J471355J964756
$$ 2011395 2199998 2451166 2798720 3261520 3872631 4687433 5800093 7271448 9236204
18634I236204K673965L721279N305312P399727R481913J1440402J2975262J1147397
$$ 9236204 11910169 15631448 20936760 28336487 37818400 49258802 62234064 73381461
18626G3381461N285909k598470j0613967j4538165j4434978j0545530o746309
$$ 73381461 78667370 76068900 65454933 50916768 36481790 25936260 19189951
18619A9189951m138099k576901j692894j177188q80272o96833n84122m90899m01140
$$ 19189951 15051852 12474951 10782057 9604869 8724597 8027764 7443642 6952743 6551603
18610F551603l19579k30055j31399o1121J5158J03818J60896J58505J17380J9234
$$ 6551603 6232024 6001969 5870570 5809449 5824607 5928425 6089321 6247826 6365206 6384440
18600F384440j20149k51963l74127m47260m36128l69968k78888j84464j29355
$$ 6384440 6264291 6012328 5638201 5190941 4754813 4384845 4105957 3921493 3792138
18591C792138q9752l2435K6975J07880K12602L44319N03988P25804R97299J366106
$$ 3792138 3702386 3669951 3696926 3804806 4017408 4361727 4865715 5591519 6588818 7954924
18581G954924J883665K659114L828673N373691O940221Q398890R642961Q584894
$$ 7954924 9838589 12497703 16326376 21700067 28640288 37039178 46682139 55267033
18573E5267033M323104j482363p742424j0919038j1108750q221141n261707l249274
$$ 55267033 59590137 58107774 50365350 39446312 28337562 20116421 14854714 11605440
18565A1605440k023253j307743r31399o96080n53110m66577l96060l36528k63145
$$ 11605440 9582187 8274444 7343045 6646965 6093855 5627278 5231218 4894690 4631545
18556D631545j92301j47421r2054l3167L0203N8137L7560l251q1615j84595k57633
$$ 4631545 4439244 4291823 4199769 4166602 4196805 4254942 4292502 4289251 4207636 4023041 3765408
18545C765408l04012l35798l26488k76760k33091j94862j55388j40780j25649
$$ 3765408 3461396 3125598 2799110 2522350 2289259 2094397 1939009 1798229 1672580
18536A672580j10856j03912r2119q7790r4557p5784o6892o0996n0533m3539m9977
$$ 1672580 1561724 1457812 1365693 1277903 1183346 1107562 1040670 979674 929141 885602 835625
18525H35625l8113k6702k7780m4915m1775l0102k0288k8525j8871k1195k1241
$$ 835625 797512 770810 743030 698115 656340 626238 605950 577425 558554 537359 516118
18514E16118l0717l8583k7603j6041j6651j7815n757p105m852n004n643J7516
$$ 516118 485401 446818 419215 403174 386523 368708 362951 355846 350994 345990 340347 357863
18502C57863J1431l368j2141k4572k9320l4335k7293k4708k3521j6040l159r316
$$ 357863 369294 365926 353785 329213 299893 265558 238265 213557 190036 173996 170837 161521
18490A61521p752m467o475l617l70j584j3912o075j140M963K987m096k519o08
$$ 161521 153769 149302 142827 139210 138840 137256 123344 117269 116129 121092 124079 119983 117464 116856
18476A16856p105l437M695R11J0708J9112K2389K2787L5346L2338K1761K8220
$$ 116856 109751 106314 111009 111920 122628 141740 164129 186916 222262 254600 276361 304581
18464C04581L1012J3508k1610m5983m2944k9782q026J1048J5311J9362K9327M2588
$$ 304581 335593 349101 327491 281508 238564 208782 200756 211804 227115 246477 275804 318392
18452C18392N0471M3464J2599k3290l1107m0284m1275k8250k1320k5678k4635
$$ 318392 368863 412327 424926 401636 370529 330245 288970 260720 239400 213722 189087
18441A89087j8718j6584j653k373j1060j2337p815J236L441o2o008o845n295J0985
$$ 189087 170369 153785 152132 149759 138699 126362 118547 119783 123224 123162 117154 110309 105014 115999
18427A15999M436j4650j6745p040l361J1077J8736k230K671L301O833N652J1160
$$ 115999 120435 105785 89040 82000 78639 89716 108452 106222 108893 112194 119027 124679 135839
18414A35839J5494L576Q856K1637K2766L95k6399l0113l1100j2168O46N478O90
$$ 135839 151333 154909 163765 185402 208168 208563 182164 152051 120951 108783 109429 114907 115597
18401A15597K1645K4134K1196N823J758l135k3020l3870j7122o573P57l559j465
$$ 115597 137242 161376 182572 188395 190153 187018 163998 130128 113006 106433 107190 103631 102166
18388A02166q432j1525M190J1880J444o085M118L870n889l146n059L205o77m508
$$ 102166 93734 82209 86399 98279 99723 93638 97756 101626 95737 92591 87532 90737 90060 85552
18374H5552J110R67o678j1617m071k958K258O261M306j0845j1349j0893m924k729
$$ 85552 86662 87629 80951 69334 65263 62305 64563 70824 75130 64285 52936 42043 37119 34390
18360C4390K1J852j1511q525m188o519l536J210J944p426n236L182N250j1406
$$ 34390 34411 36263 24752 16227 12039 5520 1984 3194 5138 -2288 -7524 -4342 908 -10498
18346a0498r29J5022P173N162K084j742O143J1784m656K837N481m607r30R302
$$ -10498 -11427 3595 10768 15930 18014 16272 22415 34199 29543 32380 37861 33254 32324 41626
18332D1626j836N731j0738r014k209K259L332R731j85p39J0691P846l582j0987
$$ 41626 39790 45521 34783 25769 23560 25819 29151 38882 38697 37958 48649 56495 52913 41926
18318D1926L256R377K721P14m947r010m590o446o208o587J254m069l077O515k612
$$ 41926 45182 54559 57280 57994 53047 44037 39447 33001 26793 20206 21460 17391 14314 20829 18217
18303A8217o290j232m225l966L229R083J560j299M67q892k892Q49p12N309L09
$$ 18217 11927 10695 6470 2504 5733 14816 16376 15077 15544 6652 3760 4609 3897 9206 9515
18288I515K19L614O589L880P362n72p267j3929L835M60P74R014o48l77l171L197
$$ 9515 9734 13348 19937 23817 31179 30607 23340 9411 13246 13706 14480 23494 22846 22469 19298 22495
18272B2495M597k426m14j959p241J646j954J54J408k156l990J3440J3129j437
$$ 22495 27092 24666 24252 22293 15052 16698 14744 14898 16306 14150 10160 23600 36729 35292
18258C5292j1324k879j735j0482l770o050M81M849j873m984l428M242Q610j960
$$ 35292 23968 21089 19354 8872 5102 -948 -467 4382 2509 -2475 -5903 -1661 6949 4989
18244D989N02J322O473NO852J2979j911n450l084Q24r4M820m165m838l079k957
$$ 4989 5491 6813 13286 13291 20143 33122 31211 25761 22677 23501 23407 28227 24062 19224 16145 13188
18228A3188M209j0701n614J1027N857Q156J243N00k37n279r052q611J703J979
$$ 13188 17397 6696 1082 12109 17966 26122 27365 27865 27628 22349 13297 4686 6389 8368
18214H368m029P79l731o661J617M214M963O941J330p17k631R796K969q679r07
$$ 8368 4339 5118 1387 -5274 -3657 557 5520 12461 13791 13074 10443 20239 23208 14529 13622
18199A3622n125K183L391l553L193J1526R70k562o56j2580n798K433L904O384
$$ 13622 8497 10680 14071 10518 13711 25237 26207 23645 22989 10409 4611 7044 10948 17332
18185A7332O080M503j53q28P734M848Q216L366L972N634J1150K1810M746J194
$$ 17332 23412 27915 27762 26934 34668 39516 47732 51098 55070 60704 71854 93664 98410 99604
18171I9604R951O294R179J2348K4001L0214K2811J7739L7166L5160K3197L205
$$ 99604 109555 115849 125028 137376 161377 191591 214402 232141 269307 304467 327664 330869
18159C30869J0606J3983l435j2147k1348k9534k7110k7670j2378j5196m094o526
$$ 330869 341475 355458 352023 339876 318528 288994 261884 234214 221836 206640 202546 196020
18147A96020r365l043o8r235j2749j8218o982J74j307j4840J849Q706J873r42
$$ 196020 186655 183612 183544 174309 161560 143342 136360 136534 135227 120387 122236 130942 132815 131873
18133A31873l02J8720Q035L11J8251K6578K6499J8689K4668L4477M9434N8345
$$ 131873 131571 150291 158326 158637 176888 203466 229965 248654 273322 307799 357233 415578
18121D15578N9987Q4977J06351J36140J82583K59106L50195M84134O77834J010593
$$ 415578 475565 560542 666893 803033 985616 1244722 1594917 2079051 2756885 3767478
18111C767478J452147J830191K044750K333280K002250r561k195678l267944k573699
$$ 3767478 5219625 7049816 9094566 11427846 13430096 13420535 11224857 7956913 5383214
18102E383214j642654r61140n78226l69094k42692j71994j16080q1146m9808j5468
$$ 5383214 3740560 2779420 2201194 1832100 1589408 1417414 1301334 1220188 1170380 1154912
18092A154912K432J4461J7582o35k1512o4033q2901p4604m3934m4536o5944p5239
$$ 1154912 1157344 1171805 1189387 1188752 1167240 1103207 1020306 945702 901768 857232 791288 716049
18080G16049o4305n3278n6054l5313l0381l1455l2430l0017l1246k2423k9995
$$ 716049 651744 598466 542412 507099 476718 445263 412833 382816 351570 329147 299152
18069B99152j9999j8105j3595j5371j0105q275r631j0018j4888p481r326j5340
$$ 299152 279153 261048 247453 232082 221977 213702 204071 194053 179165 171684 162358 147018
18057A47018k538l877l742j0299j3071o576k262J110m465j3328n753J26L220P746
$$ 147018 144480 140603 136861 126562 113491 106915 104653 105763 101298 87970 82217 82343 85563 93309
18043I3309J5215K9703K8850L5575N0982M7458N0703J9924j1262m1247o4554n2491
$$ 93309 108524 138227 167077 202652 253634 301092 351795 371719 360457 319210 254656 202165
18031B02165n5470m3252j7859j6544n079l034j946l923n606q229Q77J913m436
$$ 202165 146695 103443 85584 69040 63961 60927 58981 55058 49452 41223 42100 44013 39577
18018C9577m42O768n182O54M614j444k934n357N986N337o328q401m951K369j94
$$ 39577 39135 45903 40721 41375 45989 44545 41611 36254 42240 47577 41249 32848 27897 30266 30072
18003C0072l091j4226p748k615P343p916j07J618k541l22p34k298J1773J629r69
$$ 30072 26981 12755 5007 2392 9735 1819 1712 3330 789 467 -267 -2565 9208 10837 9868
17988I868K743l136J515N650Q792j257o80J3237K83q559j2381o066o926l718J425
$$ 9868 12611 9475 10990 16640 25432 24175 23495 36732 37015 28456 16075 10009 3083 -635 790
17973G90L303J146r114J81J2212n116k951o927m70k63j6Q987L673q412o988l486
$$ 790 4093 5239 -3875 -3694 8518 3402 451 -6476 -6946 -7209 -7225 1762 5435 -2977 -9965 -13451
17957a3451M229P539O256n259k981K791q779N626J467n42J0494N18L004k629m245
$$ -13451 -9222 -1683 4573 -686 -3667 -876 -9655 -4029 -2562 -3104 7390 7908 10912 8283 4038
17942D038p442j60O495m742k340J05k481m50J796L184J054o607K536M240K350
$$ 4038 -3404 -3564 2931 -1811 -4151 -4046 -6527 -6977 -5181 -1997 -943 -7550 -5014 -774 1576
17927A576j477m05Q92J239L417Q235L843o160m703M138q12m088m41k998L156Q728
$$ 1576 99 -306 586 1825 5242 13477 17320 11160 6457 10595 9783 5695 5254 2256 5412 14140
17911A4140m903n964l671L898L698r14J324Q197j268j1156j1071j45p78m189M112
$$ 14140 9237 3273 -398 3500 7198 6284 7608 15805 14537 3381 -7690 -7835 -8613 -12802 -8690
17896h690L293l154o781M357O453K994q62m045k438p7J84K467M339L099r221r648
$$ -8690 -5397 -8551 -15332 -10975 -4522 -1528 -2390 -6435 -8873 -8950 -8766 -6299 -1960 1139 -8082 -17730
17880a7730m52K284N074l168j553M638l777q291K554N366j032M82j040N71N069
$$ -17730 -18182 -15898 -10824 -13992 -15545 -10907 -14684 -22975 -20421 -15055 -16087 -15605 -16645 -16074 -11005
17865a1005M843J862m755n61J58j661J595K153o176k659N567N126K350k458K448
$$ -11005 -6162 -4300 -9055 -9616 -9458 -11119 -9524 -7371 -13547 -16206 -10639 -5513 -3163 -5621 -3173
17850c173O380K074j261r571j1845M15N897K381L274L722J1918R111j7970n715
$$ -3173 3207 5281 4020 -5551 -17396 -16981 -11084 -8703 -5429 -1707 10211 19322 1352 -4363
17836d363J2944M151j186j265l500n578j140j880P149P544k448l354L318O687
$$ -4363 8581 12732 11546 10281 6781 1203 63 -1817 5332 12876 10428 7074 10392 17079
17822A7079J1218M533J51J6667R928j491j933p398j3491r578j5162n638r378j040
$$ 17079 28297 32830 32981 49648 59576 58085 56152 48754 35263 25685 10523 4885 -4493 -5533
17808e533R238J508N21j760J006m633q518L293N627k047o178L90j840N544J393
$$ -5533 3705 5213 5734 3974 4980 347 -8171 -4878 749 -1298 -7476 -7086 -8926 -3382 -1989
17793a989M58j073L162O987o6j3070k917M783O845R01R28m361o749m486M581O676
$$ -1989 -1531 -2604 558 7545 7479 -5591 -8508 -3725 3120 4021 4949 588 -6161 -10647 -6066 610
17777F10n513j278J26K080K01Q284n27k808j054J877M30o467k129n052n063O7
$$ 610 -4903 -6181 -6055 -3975 -3774 4510 3983 1175 121 1998 2428 -4039 -6168 -11220 -16283 -16216
17761a6216j787Q968Q714p656l101P671N45L580P797m095j562K203j533q237n211
$$ -16216 -18003 -9035 -321 -7977 -11078 -3407 -2862 718 8515 4420 2858 5061 3528 -4709 -9920
17746i920O349Q313j501n420J0231K278k496k734M198n246q77l905o821j434l506
$$ -9920 -3571 4742 3241 -2179 8052 10330 7834 5100 9298 4052 3175 -730 -7551 -8985 -12491
17731a2491N50L132N876P19M859N791M876k056n469o696m751K541O311L809j801
$$ -12491 -11941 -8809 -2933 -2214 2645 8436 13312 11256 5787 -909 -5660 -3119 3192 7001 5200
17716E200K098l952J000K021l892R044l35n311M719N568P97j528N32j942k67n311
$$ 5200 7298 3346 4346 6367 2475 11519 11184 5873 10592 16160 16957 15429 15961 14019 13752 8441
17700H441o950L61m892m580L997M71k859m568k300R874N095O694O651m928k146
$$ 8441 1491 1852 -3040 -7620 -3623 -3152 -6011 -10579 -12879 -3005 2090 8784 15435 10507 8361
17685H361l693j0925j436Q262K406k669M518j157m712q161l647P971K539L753
$$ 8361 4668 -6257 -7693 569 2975 306 4824 3667 -1045 -9206 -12853 -4882 -2343 1410
17671A410P204J129J909k090n614o14L201J402n74j801m747m297L474O534q700
$$ 1410 8614 9743 11652 9562 3948 3334 6535 7937 7363 5562 815 -3482 -8 6526 -2174
17656b174n302k15J123N313O052M327m894n657n135P04L518R612L034k214l623
$$ -2174 -7476 -7691 -6568 -1255 4797 9124 4230 -1427 -6562 -5858 -2340 7272 10306 8092 4469
17641D469j83M461p21p838j310l307J859o65k636R642l08j3257m452k775M816
$$ 4469 4286 8747 8026 188 -1122 -4429 -2570 -3235 -5871 3771 3463 -9794 -14246 -17021 -12205
17626a2205Q876l724J429N148Q269M016Q191L736O696p969n780j1538k761M697
$$ -12205 -3329 -7053 -5624 -476 7793 11809 20000 23736 30432 22463 16683 5145 2384 7081
17612G081K499O295J923p199j657M420o785r77R214k193l605O6N461k205N917
$$ 7081 9580 15875 17798 10599 8942 13362 6577 5600 14814 12621 9016 9082 14543 12338 18255
17597A8255j0337j8304L208J722J56J949L574j416J98O613k811p43l312K477p18
$$ 18255 7918 -10386 -7178 -5456 -5300 -3351 223 -1193 -995 5618 2807 2064 -1248 1229 511
17582E11p979L700P807k09J1049P774K43p154j3206n406k944Q626L72R704O01
$$ 511 -7468 -3768 4039 3830 14879 22653 22896 15742 2536 -2870 -5814 2812 3184 12888 13489
17567A3489N377N719J564L735n21j3414l706N871p5o17k993k689K504j333J205
$$ 13489 18866 24585 26149 29884 29363 15949 12243 18114 18039 17422 14429 11740 14244 12911 14116
17552A4116J099j0148R01K324r8n702L045L168J2076p31j4101N799Q517m839j330
$$ 14116 15215 5067 5968 8292 8194 2492 5537 8705 20781 20050 5949 11748 20265 15426 14096
17537A4096m489r524J90J037k424K668R048J2002m884j6798j1633Q182R191O916
$$ 14096 9607 83 273 1310 -1114 1554 10602 22604 17720 922 -10711 -2529 6662 13578
17523A3578l030r014k334r54O547o169j131J1482P133q291n108L124l115j2715
$$ 13578 10548 1534 -800 -1754 4793 -1376 -2507 8975 16108 7817 2709 5833 2718 -9997
17509i997L031N390J326j870J23O960R751j027O13m891m486k779M74O466l889
$$ -9997 -6966 -1576 -250 -2120 -1997 4963 14714 13687 14300 9409 4923 2144 2618 9084 5195
17494E195k794R372J0755p879k696K713k660l726j281r176K22J0004L223p658
$$ 5195 2401 11773 22528 14649 11953 14666 12006 8280 6999 -2177 -1955 8049 11272 3614
17480C614M02N673Q640K19M106N247r799J421J2850j785p196o509q455j139l926
$$ 3614 4016 9689 18329 18548 22654 27901 18102 19523 32373 30588 23392 16883 8428 7289 3363
17465C363O827J371K201l62J80j514j020Q447J052q804k842J021k728N024m265
$$ 3363 10190 11561 13762 13400 13580 12066 11046 19493 20545 11741 8899 9920 7192 12216 7951
17450G951M178M801q140J797J0496O069Q991J2053J1480J9379Q560j0530j6542
$$ 7951 12129 16930 8790 10587 21083 27152 36143 48196 59676 79055 87615 77085 60543
17437F0543j2530n770j1073j1258j844M484L253l270N481j0460j2198o337Q298
$$ 60543 48013 42243 31170 19912 18068 22552 25805 22535 28016 17556 5358 -979 7319
17424G319M886m410L585J0058R482j875r78o615K406M531k69n817J0443L855j1021
$$ 7319 12205 7795 11380 21438 30920 29045 28067 21452 23858 28389 28120 22303 32746 36601 25580
17409B5580q080j3301n687O764J1949O114L240J79j0348n074P926p370q929O182
$$ 25580 17500 4199 -1488 5276 17225 23339 26579 26758 16410 11336 19262 11892 2963 9145
17395I145K923J148N089m32J144M052p16m869p665M274K701O555L848N17L255
$$ 9145 12068 13216 18305 17873 19017 23069 22353 17484 9819 14093 16794 23349 27197 27714 30969
17380C0969p072m776J0852N816j928l904l18j1284o337ll361J74k548N318L702
$$ 30969 23897 19121 29973 35789 33861 29957 29639 18355 12018 12015 8654 8828 6280 11598 15300
17365A5300P232R493j502j2547o257j0942R704N926Q57K144R98o751q37O741K011
$$ 15300 22532 32025 30523 17976 11719 777 10481 16407 17264 19408 20406 13655 12818 19559 21570
17350B1570N83j3711r200J0233J4423j520k039R13L272m652j1910J725O760O568
$$ 21570 22153 8442 -758 9475 23898 22378 20339 21252 24524 19872 7962 9687 16447 23015
17336B3015L770J987q069l437j84l104k699n88P411k468Q588L050K740O658k109
$$ 23015 26785 28772 20703 17266 17082 13978 11279 10691 18102 15634 24222 27272 30012 36670 34561
17321C4561p823m133n089q458j783M526N658O617j848j912k581K302Q77N215K614
$$ 34561 26738 22605 17516 9058 7275 11801 17459 24076 22228 20316 17735 20037 20914 26129 28743
17306B8743K46k484l270p762r034l713l998K292J0611O418K253p329j314O285
$$ 28743 28989 26505 23235 15473 6439 2726 -1272 1020 11631 18049 20302 12973 11659 17944
17292A7944p50m420k199Q010N59o018Q385L829l683m72j1152J396K977p429M256
$$ 17944 17194 12774 10575 18585 19144 13126 21511 25340 21657 21185 10033 11429 14406 6977 11233
17277A1233J781L70J1644N691J918p432m442R34j963q191n628Q418R34K151O298
$$ 11233 13014 13384 25028 30719 32637 25205 20763 21697 19734 11543 5915 14333 15267 17418 23716
17262B3716p912j2825r00Q262L834j189L101J80N009m858K816P090j647q738L326
$$ 23716 15804 2979 2079 10341 14175 12986 16087 16267 21276 16418 19234 26324 24677 15939 19265
17247A9265P943J886q907m287o402L510l936M374J965K238p610j4485o219J1499
$$ 19265 27208 29094 20187 15900 9498 13008 9072 13446 15411 17649 10039 -4446 -10665 834
17233H34J4122j422R33Q452o805k896j919M895L958j062o580J81k440j142J848
$$ 834 14956 13534 14467 22919 16114 13218 11299 16194 20152 19090 12510 12691 10251 9109 10957
17218A0957K360N739J007l117N478O663l610j1072r38k931o678l232l569p985
$$ 10957 13317 19056 20063 16946 22424 29087 25477 14405 13467 10536 3858 626 -2943 -10928
17204a0928O668K510R915M114p773p62J896O245J1958J375r924M560P233k447
$$ -10928 -4260 -1750 8165 12279 4506 3744 5640 11885 23843 25218 15294 19854 27087 24640
17190B4640k442j02m777L389n968q244O777O724J756r574j802o284p391M785P990
$$ 24640 22198 22096 17319 20708 14740 6496 13273 19997 21753 12179 10377 4093 -3298 1487 9477
17175I477L619n087n478M713l337n919J989o798l971o81R736L614J320N0m058
$$ 9477 13096 8009 2531 7244 3907 -2012 -23 -6821 -10792 -11473 -1737 1877 3197 3247 -811
17160h11j014N513M370P80o959K577m669q083J2177n72k559M807n593l957M659
$$ -811 -1825 3688 8058 8838 1879 4456 -213 -8296 3881 3309 750 5557 -36 -3993 666
17145F66o197m702j71M463N127J649N746O912j545j0552o233M720J469k088n34
$$ 666 -5531 -10233 -10404 -5941 -814 835 6581 13493 11948 1396 -4837 -117 1352 -736 -1270
17130a270k393p769k714Q496N952Q101o823o197m903J0531Q902R81K788K406k536
$$ -1270 -3663 -11432 -14146 -5650 302 8403 1580 -4617 -9520 1011 9913 10894 13682 16088 13552
17115A3552j0829l107M412O649O115N687r076N06K091n860l463j671K080n993
$$ 13552 2723 -384 4028 10677 16792 22479 13403 13909 16000 10140 6677 5006 7086 1093
17101A093p864q638L452R501N663J181l393M132K406o409j63q74J970n330m571
$$ 1093 -6771 -15409 -11957 -2456 3207 4388 995 5127 7533 1124 961 87 2057 -3273 -7844
17086g844p148N375K638M279N661K073J313M217L367M88m070n305n782o270o369
$$ -7844 -14992 -9617 -6979 -2700 2961 5034 6347 10564 13931 14419 10349 5044 -738 -7008 -13377
17071a3377J3609Q303m417j1061n88P04n894l362j169J2973L336l182M764P81
$$ -13377 232 8535 4118 -6943 -7531 -6827 -12721 -16083 -17252 -4279 -943 -4125 639 1420
17057A420m692N363J497m837J800L139m508j787N043O168K838L303R19m916p676
$$ 1420 -3272 2091 3588 -1249 551 3690 -818 -2605 2438 8606 11444 14747 15666 10750 3074
17042C074K301M631m598j262P598n438j960m991o054J818O280Pn103o26m236J770
$$ 3074 5375 10006 5408 4146 11744 6306 4346 -645 -6699 -4881 1399 1406 -3697 -4323 -8559 -6789
17026f789k089l762N821J0521M125j794j1078J45Q924J7509l00r36J6717K1580
$$ -6789 -8878 -12640 -6819 3702 7827 6033 -5045 -4900 4024 21533 21233 20297 37014 58594
17012E8594J6778K4554K5699M7097O8457O0945M0685K259n3998q3235p4567m6477
$$ 58594 75372 99926 125625 172722 241179 302124 342809 345068 291070 207835 133268 86791
17000H6791j8998j5861j6613r065p916n927p023k360R926o270j695Q331j804o116
$$ 86791 67793 51932 35319 26254 18338 12411 5388 3028 12954 6684 4989 13320 11516 5400
16986E400m940J674M346M099J6294j187q458j3805p148l70J953l971j510M101
$$ 5400 460 2134 6480 10579 26873 25686 17228 3423 -3725 -4095 -2142 -6113 -7623 -3522
16972c522J3693Q34n979m139l50Q4L223l050N39k098L489l55j514o20m13O577
$$ -3522 10171 11005 5026 887 537 621 3844 794 1333 -765 2724 2369 855 235 -178 6399
16956F399P493l499m338o168J742Q4k473o65j1829m03P19K280j0366k056P770
$$ 6399 13892 10393 6055 -113 1629 1713 -760 -1425 -13254 -13657 -12938 -10658 -21024 -23080 -15310
16941a5310J2004J294J557o110k642K746P159p165L0N321l892o554n769n32j338
$$ -15310 -3306 -2012 -455 -6565 -9207 -6461 698 -6467 -6437 -1116 -5008 -11562 -17331 -17863 -19201
16926a9201N195q12l206Q801L992P836l832m893l427L61M704j597J342l181J558
$$ -19201 -14006 -14818 -18024 -9223 -5231 2605 -1227 -6120 -9547 -9186 -4482 -6079 -4737 -7918 -6360
16911f360K386k586n679o32L688n821P248j203J179J323R881O385o083n157o412
$$ -6360 -3974 -6560 -12239 -12871 -9183 -15004 -7756 -8959 -7780 -6457 3424 9809 3726 -1431 -7843
16896g843P064J0284q090q801K669m570o411m433n610j746J1640L295m861L701
$$ -7843 -779 9505 1415 -7386 -4717 -9287 -15698 -20131 -25741 -27487 -15847 -12552 -17413 -13712
16882a3712R460N288J2355j355L968M915J203j2871o016o57m210K380l054o218
$$ -13712 -4252 1036 13391 12036 16004 20919 22122 9251 3235 2578 -1632 748 -2306 -8524
16868h524n032k387M357Q585J789p658J09m538j285O983k228O345K611l756j447
$$ -8524 -13556 -15943 -11586 -3001 -1212 -8870 -8761 -13299 -14584 -7601 -9829 -3484 -873 -4629 -6076
16853f076N74N709Q910J683n675j0473l146N079N66J506k198M140R271J084o675
$$ -6076 -5502 207 9117 10800 5125 -5348 -8494 -3415 -2849 -1343 -3541 599 9870 10954 4279
16838D279m198l858j6248k131J6916m436k713n73K092K849j2673q046j32N296
$$ 4279 81 -3777 -20025 -22156 -5240 -9676 -12389 -12962 -10870 -8021 -20694 -28740 -28872 -23576
16824b3576R206N258J264L573j583j997M294p782l180Q045K364k979l495N569
$$ -23576 -14370 -9112 -7848 -4275 -5858 -7855 -3561 -11343 -14523 -6478 -4114 -7093 -10588 -5019
16810e019M887m321P922j626k714p028P53M232P052J531k33o099q151p82p274
$$ -5019 -132 -4453 3469 1843 -871 -7899 -7146 -2914 4138 5669 5436 -663 -8814 -9596 -16870
16795a6870nL709O853L342j386O608m295Q998j811L344j76n487j189k267k9N069
$$ -16870 -16875 -13166 -6313 -2971 -4357 2251 -2044 6954 5143 8487 8311 2824 1635 -632 -661 4408
16779D408r51o26M204M181n491n962j115M975J174K344M284n432n884j2941j274
$$ 4408 3457 2831 7035 11216 5725 -237 -1352 3623 4797 7141 11425 5993 109 -12832 -14106
16764a4106J0525M091q940K239J503q5N459Q787l920J068l273R49M782L10P076
$$ -14106 -3581 510 -8430 -6191 -4688 -4773 686 9473 5553 6621 3348 4297 9079 9389 16465
16749A6465p42l342k905j494m588L033J0453J031j1110q006n987M332j248l495
$$ 16465 15723 12381 9476 7982 3394 6427 16880 17911 6801 -1205 -7192 -2860 -4108 -7603
16735g603N075l937p545M454Q861J1589N586m576P152J021n806m848l148J77j1740
$$ -7603 -2528 -6465 -14010 -9556 -695 10894 16480 11904 19056 20077 14271 9423 6275 6452 -5288
16720e288q508R090N877M595N454l012n234n037k776o457p764N536K204n841j567
$$ -5288 -13796 -4706 1171 5766 11220 8208 2974 -2063 -4839 -11296 -19060 -13524 -11320 -17161 -18728
16705a8728J2164Q256R098l294j0343n614k462l414o39q45J754R851J974L269
$$ -18728 -6564 1692 10790 7496 -2847 -8461 -10923 -14337 -14976 -15821 -14067 -4216 -2242 1027
16691A027J1491L02m149p421k739O901k287M268M660k833n995M49O004l774j1202
$$ 1027 12518 12820 8671 1250 -1489 5412 3125 7393 12053 9220 3225 3674 9678 5904 -5298
16676e298n223O441J962L08o002k208P878j833j356M068M153L709k867r960o032
$$ -5298 -10521 -4080 -2118 -1810 -7812 -10020 -2142 -3975 -5331 -1263 2890 6599 3732 -6228 -12260
16661a2260K714O904P204m184J883n638j980l799k771O887J3668n774k007j361
$$ -12260 -9546 -2642 4562 378 2261 -3377 -5357 -9156 -11927 -5040 8628 2854 847 -514
16647e14J553j242j926j455k809J238k120J566k423p141L780K162J09R75K498
$$ -514 1039 -203 -2129 -3584 -6393 -5155 -7275 -5709 -8132 -15273 -11493 -9331 -9222 -8247 -5749
16632e749N129l81m653R21M275L257k326n029n992m341n788j349J620M281M959
$$ -5749 -620 -1001 -5654 -4733 -458 2799 473 -4556 -10548 -14889 -20677 -22026 -20406 -16125 -11166
16617a1166J663j318R942O420Q429J222o739j4592M9Q074K129n620J116M20o083
$$ -11166 -9503 -10821 -879 5541 13970 15192 8453 -6139 -6090 1984 4113 -1507 -391 29 -6054
16602f054j39L62K05J245P149J8294j494o568r651J278K235l98j142K05l36L35
$$ -6054 -6193 -5831 -5626 -4381 2768 21062 19568 13000 3349 4627 6862 6464 5322 5527 5191 5526
16586E526m871q224M532P689M697j2373l571J553n838J757k862N195J445k498
$$ 5526 655 -7569 -3037 4652 9349 -3024 -6595 -5042 -10880 -9123 -11985 -6790 -5345 -7843
16572g843P44Q827l843q623P501J0492k763q013L660M504N767l028j12J0138n449
$$ -7843 -7099 1728 -2115 -10738 -3237 7255 4492 -3521 139 4643 10410 7382 7270 17408 11959
16557A1959j3828Q94P62p358J99N848n977J25j081n105j271J0156Q934O204o238
$$ 11959 -1869 -975 -213 -7571 -7372 -1524 -7501 -7376 -8457 -13562 -14833 -4677 4257 10461 4223
16542D223l081o672o266L150O607K938m75N759k27N831P24p071j194K219N12J975
$$ 4223 1142 -5530 -11796 -8646 -2039 899 424 6183 5956 11787 12511 5440 4246 6465 6977 8952
16526H952p18k895j955k562j562m458j113k255L514J0583L533m005l482o838M446
$$ 8952 8234 5339 3384 822 -740 -5198 -6311 -8566 -5052 5531 9064 5059 1577 -5261 -815
16511h15o009n623q08M534O175P58j35m594J4918r995o169R043N645J257K158
$$ -815 -6824 -12447 -13255 -8721 -2546 -1788 -1923 -6517 8401 -1594 -7763 1280 6925 8182 10340
16496A0340j125K050k121k967L909j631n438L191m93k858j1804J036J2121O013
$$ 10340 9215 11265 9144 6177 10086 8455 3017 6208 5715 2857 -8947 -7911 4210 10223
16482A0223k676q891m618L987q157j477M040R846L955o319p212N024N799P698
$$ 10223 7547 -1344 -5962 -1975 -10132 -11609 -7569 2277 6232 -87 -7299 -2275 3524 11222
16468A1222O74k157n376o574q581l284O029J373m940M436Q92J837j505K508Q392
$$ 11222 11896 9739 4363 -2211 -10792 -14076 -8047 -6674 -11614 -7178 -6286 -4449 -5954 -3446 4946
16453D946n231m250M591P080o277L254o529j142L870M103J1548j581l807l825
$$ 4946 -285 -4535 56 7136 859 4113 -2416 -3558 312 4415 15963 14382 10575 6750
16439F750o070j5058o658R06O47R852J5326J026M340j517k996k41j2490j415M929
$$ 6750 680 -14378 -21036 -20130 -19483 -9631 5695 6721 11061 9544 6548 6307 -6183 -7598 -2669
16424b669k631j728L982j350R405P257N039K629j0957p538n127M934L650q528
$$ -2669 -5300 -7028 -3046 -4396 5009 12266 17305 19934 8977 1439 -3688 1246 4896 -3632
16410c632p763Q041K179o417J481J870L386l623K857R66j1638N734L595p97r899
$$ -3632 -11395 -3354 -1175 -7592 -6111 -4241 -855 -4478 -1621 -655 -12293 -6559 -2964 -3761 -13660
16395a3660o57J157L92k656l26L482O708O907L013n323n443r928K318J1942J676
$$ -13660 -14317 -13160 -12768 -15424 -15750 -12268 -5560 1347 4360 -963 -6406 -16334 -14016 -2074 -398
16380c98k92L854j332j175J898P483M272p653m727r03k3q953o889j102k407J0721
$$ -398 -690 3164 1832 657 2555 10038 14310 6657 1930 1027 1004 -7949 -14838 -15940 -18347 -7626
16364g626J0084O740q306j0098K866o517J257M248K544M00J011p692N541L109
$$ -7626 2458 9198 892 -9206 -6340 -12857 -11600 -7352 -4808 -4408 -3397 -11089 -5548 -2439
16350b439o999k312J561k387m268P745K681m488l583k114L42j851R557Q491j725
$$ -2439 -9438 -11750 -10189 -12576 -16844 -9099 -6418 -10906 -14489 -16603 -16261 -18112 -8555 -64 -1789
16335a789n824M527n689j2018O663O691M112M813k131N265l138j1543l457P234
$$ -1789 -7613 -3086 -8775 -20793 -14130 -7439 -3327 1486 -645 4620 1482 -10061 -13518 -6284
16321f284P126J3696o673q616o952R33m309N297M52p27J5289l072o711L936J819
$$ -6284 842 14538 7865 -751 -7703 -6770 -11079 -5782 -5330 -6057 9232 6160 -551 3385 5204
16306E204o832J450N50M22J656j203j340k390K000k696J234m43M108K124r180
$$ 5204 -1628 -178 372 794 2450 1247 -93 -2483 -483 -3179 -1945 -2388 1720 3844 -5336
16291e336l369K956M409O924k78j2K354Q57l595l442m886m195k693J368L133M989
$$ -5336 -8705 -5749 -1340 5584 5306 5294 7648 8505 4910 1468 -3418 -7613 -10306 -8938 -5805 -816
16275h16n775L94j940p269O170N886n73L321O201p26R77L532k626p406o646o560
$$ -816 -6591 -6197 -8137 -15406 -9236 -3350 -3923 -602 5599 4873 5850 9382 6756 -650 -7296 -13856
16259a3856o354l842Q209J0718L103K377k225l736l587K421N768R573N642l159
$$ -13856 -20210 -24052 -15843 -5125 -2022 355 -1870 -5606 -9193 -6772 -1004 8569 14211 11052
16245A1052j576k139r445j3736L335J1002R361q084m630p46p737K05L743N974
$$ 11052 9476 7337 -2108 -15844 -12509 -1507 7854 -230 -4860 -5606 -13343 -13138 -9395 -3421
16231c421K201N495N266j781j0943O015j77k029J847m999L167P622j4020o812
$$ -3421 -1220 4275 9541 7760 -3183 2832 2655 626 2473 -2526 641 8263 -5757 -12569
16217a2569N799O546L213m374m472m451L84Q898K016L315q449p721m124K266P686
$$ -12569 -6770 -224 2989 -1385 -5857 -10308 -9924 -1026 990 4305 -4144 -11865 -15989 -13723 -6037
16202f037J538P979O045l227k190L056K708N56m777j3978n208N942M495J721L623
$$ -6037 -4499 3480 9525 6298 4108 7164 9872 10428 5651 -8327 -13535 -7593 -3098 -1377 2246
16187B246j329N355R663N033o545o874q341J429P27J754J275L594p505O55l297
$$ 2246 917 6272 15935 20968 14423 7549 -792 637 1364 3118 4393 7987 482 1137 -2160
16172b160r9L054J085n717l640q43O529k552Q959J477J664l297l885p264p926
$$ -2160 -2259 795 1880 -3837 -7477 -8320 -1791 -4343 4616 6093 7757 4460 575 -6689 -14615
16157a4615O331K763n847q041J87J0612N567l774k896J82l52Q758M711L440Q8
$$ -14615 -8284 -5521 -11368 -19409 -19222 -8610 -3043 -6817 -9713 -9531 -9883 -1125 3586 7026 7114
16142G114L171n333q457L607P397J302l088k507K338l947m417M190j055K854O009
$$ 7114 10285 4952 -3505 102 7499 8801 5713 3206 5544 1597 -2820 1370 315 3169 9178
16127I178K533m232k199K616k024J146j324K274J0315R591p263l736P8k547K95
$$ 9178 11711 7479 5280 7896 5872 7018 5694 7968 18283 27874 20611 16875 16953 14406 14701
16112A4701o85k288l800o569J547j0698p567k526J2009J1232K647k936m110N687
$$ 14701 14016 11728 7928 1359 2906 -7792 -15359 -17885 -5876 5356 8003 5067 957 6644
16098F644L289j318K979n977n967m760K680N245N079M113j711M08j286o843m236
$$ 6644 9933 8615 11594 5617 -350 -5110 -2430 2815 7894 12007 10296 10704 9418 2575 -1661
16083a661k43L918k270j733Q343N43J064j2693j0755M732J0092R976L282k819
$$ -1661 -1904 2014 -256 -1989 6354 6897 7961 -4732 -15487 -10755 -663 9313 12595 9776
16069I776r063R480Q837q743j930m145j38J48K513P409q451m934J1383Q086q466
$$ 9776 713 10193 19030 10287 8357 4212 4074 4222 6735 14144 5693 759 12142 20228 11762
16054A1762o129n07k234l962p933J894N575L539N176p00j920L675J787J71j4232
$$ 11762 5633 5126 2892 -1070 -9003 -7109 -1534 2005 7181 6481 4561 8236 10023 10194 -4038
16039d038m637J5690m024k468q410l410L486K532p680N484J955l945K624Q958
$$ -4038 -8675 7015 2991 523 -7887 -11297 -7811 -5279 -12959 -7475 -5520 -9465 -6841 2117
16025B117j04o007O965P216r00j863m422o222k318L455m46L617m043p601k110
$$ 2117 2013 -3994 2971 10187 9287 7424 3002 -3220 -5538 -2083 -2529 1088 -2955 -10556 -12666
16010a2666P976L155l414P250m484j199M348q514O451L869K78r161L21J4290P950
$$ -12666 -4690 -1535 -4949 2301 -2183 -3382 966 -7548 -1097 2772 3050 -6111 -5790 8500 16450
15995A6450r68m900j2996p415N133O39M393O608m162P731k074n488M218k977L150
$$ 16450 15482 10582 -2414 -9829 -4696 -4057 336 6944 2782 10513 8439 2951 7169 4192 7342
15980G342J4225q965j2124N055O235m473j103j918M746l428J068n156N950l697
$$ 7342 21567 12602 478 5533 11768 7295 6192 4274 9020 5592 6660 1504 7454 3757
15966C757J094p480R254J7594P660q759p890k855m189m850Q49M557n987r826J291
$$ 3757 4851 -2629 6625 24219 31879 23120 15230 12375 8186 3336 4185 8742 2755 -7071 -5780
15951e780j474n0J555j034M824m254j1134P982K1219n21J929j97n632m703k253
$$ -5780 -7254 -7304 -5749 -6783 -1959 -6213 -17347 -9365 11854 11333 13262 13065 7433 2730 477
15936D77K858J1120o44n997o369p627L404J220M078k554j040O634J132k037j2944
$$ 477 3335 14455 13811 7814 1445 -6182 -2778 -1558 2520 -34 -1074 5560 6692 4655 -8289
15921h289j844R160m042j690j562l983N527j649N60O785K172r299o86R43k72L465
$$ -8289 -10133 -973 -5015 -6705 -8267 -12250 -6723 -8372 -7812 -1027 1145 -8154 -8840 -7897 -8169 -4704
15905d704J277L247k608M679O509J816n299L582J561j245P52J96J27m132j0974
$$ -4704 -3427 -180 -2788 1891 8400 10216 4917 8499 10060 8815 9567 9763 9890 5758 -5216
15890e216Q20L557N226N347R45o240O457J667j2873m314L459L988M128q675l150
$$ -5216 -4396 -839 4387 9734 10679 4439 10896 12563 -310 -4624 -1165 2823 6951 -1724 -4874
15875d874J838M270k890L473p504n05L524K527K864m811j1861K575L929M975L730
$$ -4874 -3036 1234 -1656 1817 -5687 -6192 -2668 -141 2723 -2088 -13949 -11374 -7445 -2470 1260
15860A260K492L10L401l888n431k648j740l12j010M239P600N456P35l228k806
$$ 1260 3752 4062 7463 3575 -1856 -4504 -6244 -6556 -7566 -3327 4273 9729 10464 7236 4430
15845D430K098J33o924O406J776j952l815l592l671K317Q475j952L054l907l157
$$ 4430 6528 6661 -263 6143 7919 5967 2152 -1440 -5111 -2794 5681 3729 6783 2876 -281
15830b81L312p498J699M875P230O857k195q67O58l983M887m77m877m530n442N723
$$ -281 3031 -4467 -2768 2107 9337 16194 13999 13132 13790 9807 14694 14217 9340 4810 -632 5091
15814E091K992k612k171J22k057J501J11M524J465J427j4212n539N324J2064P98
$$ 5091 8083 5471 3300 3422 1365 2866 2977 7501 8966 10393 -3819 -9358 -4034 8030 8828
15799H828n392L7M280l472j293J737j3782l194P399J0133N770j290p789K905P188
$$ 8828 3436 3473 7753 4281 2988 4725 -9057 -12251 -4852 5281 11051 9761 1972 4877 12065
15784A2065j678l503q501K348Q877l949K534L012R054Q43n548K24m937n489O461
$$ 12065 10387 6884 -1617 731 9608 5659 8193 11205 20259 21102 15554 15778 10841 5352 11813
15769A1813m52m32Q841q286m212J0O444J1721j36k466L560p17m805j0433q766
$$ 11813 11361 10929 19770 11484 7272 7282 13726 25447 25311 22845 26405 25688 20883 10450 1684
15754A684J550O854n950p549j4890k148R365J1866k29n769j663K520P536J741
$$ 1684 3234 10088 4138 -3411 -18301 -20449 -11084 782 553 -5216 -6879 -4359 3177 4918
15740D918k401Q34K705L730j382r639n09l912Q418J164p822L252J663j92p214
$$ 4918 2517 3351 6056 9786 8404 -1235 -1744 -5656 2762 3926 -3896 -644 1019 827 -6387
15725f387j028l04j370L57N092L880o433o758j954m691P703J1639M63p666l784
$$ -6387 -7415 -7719 -9089 -8732 -3640 240 -6193 -12951 -14905 -19596 -11893 -254 209 -7457 -11241
15710a1241O749K29M407p990j861L395j801o582J26J1352P918p691O31k417J745
$$ -11241 -4492 -4263 144 -7846 -9707 -6312 -8113 -14695 -14569 -3217 4701 -2990 -2359 -4776 -3031
15695c031k472R764N65m625N894J486j1050l837J00N294J3298M287k564N030O199
$$ -3031 -5503 4261 4826 201 6095 7581 -3469 -7306 -7206 -1912 11386 15673 13109 18139 24338
15680B4338R93q213j1444j413k548J90l561P74O524m961K319J556N247J138Qr899
$$ 24338 25331 17118 5674 4261 1713 1903 -1658 -884 5640 679 2998 4554 9801 10939 10947 1048
15664A048j018l24J744J2394O532o153j2083p48K974l19k978m83J442p913m601
$$ 1048 30 -294 1450 13844 20376 14223 2140 1392 4366 4047 1069 586 2028 -5885 -10486
15649a0486K647m28K563L42N333o345n313J402J432o18J556J782m099K81N868
$$ -10486 -7839 -8267 -5704 -5362 -29 -6374 -11687 -10285 -8853 -9471 -7915 -6133 -10232 -9951 -4083
15634d083Q904L809l879J543q724J84O187L961K933n039L63j302p14k544n75j390
$$ -4083 4821 8630 4751 6294 -2430 -2246 3941 7902 10835 5796 6159 4857 4143 1599 1024 -366
15618c66q58o880J2517K388Q010j461o877l203M799M707m536n479j890M619N44
$$ -366 -1224 -8104 4413 6801 14811 13350 6473 3270 8069 12776 8240 2761 871 5490 6034
15603F034k211j506l056k260j064K129K781P305j044q341r54K38J321L038L007
$$ 6034 3823 2317 -739 -2999 -4063 -1934 847 8152 7108 -1233 -2187 -1949 -628 2410 5417
15588E417O473K849n442L1j529q539j0313m938N684P44k222J1279j966k22K087
$$ 5417 11890 14739 9297 9328 7799 -740 -11053 -15991 -10307 -9563 -11785 -506 -2472 -2694 -607
15573f07L786n489o320n470j891N886J1000J0070l911o671K500n61R403N700J204
$$ -607 3179 -2310 -8630 -14100 -15991 -10105 895 10965 7054 383 2883 2322 11725 17425 18629
15558A8629K250K47j3360l065L603l173m504K029J81N181j838J253O70m059M717
$$ 18629 20879 21126 7766 4701 8304 5131 627 2656 2837 8018 6180 7433 8103 4044 8761
15543H761J180p480r291p690J385J2291J6195L337o196k960R50j357j623j948
$$ 8761 9941 2461 -6830 -14520 -13135 -844 15351 18688 12492 9532 10482 9125 7502 5554
15529E554P915q50l588j212l801m044n290k727Q590N668M784k623q964k605n427
$$ 5554 13469 12619 9031 7819 4018 -26 -5316 -8043 547 6215 10999 8376 -588 -3193 -8620
15514h620K362Q788K9l679l198M755M095N100o478r273o538K439J0734Q021J240
$$ -8620 -6258 2530 2559 -1120 -4318 437 4532 9632 3154 -6119 -12657 -10218 516 8537 9777
15499I777p85j0368l456J1719M251o656Q513n075q941K164N160l221j206N481
$$ 9777 8992 -1376 -4832 6887 11138 4482 12995 7920 -1021 1143 6303 3082 1876 7357
15485G357j0462n476Q352O005j447m578m024O74q559M826J0674M661l613q872
$$ 7357 -3105 -8581 -229 5776 4329 -249 -4273 -3599 -12158 -7332 3342 8003 4390 -4482
15471d482n406o953J0305J5617R44j285n085J171n684r13K805L791N903L402q709
$$ -4482 -9888 -16841 -6536 9081 10025 8740 3655 4826 -858 -1771 1034 4825 10728 14130 5421
15456E421k372j863q95N028m284r417L350J748m315j08L411k070l215J763m127
$$ 5421 3049 1186 291 5319 1035 -8382 -5032 -3284 -7599 -7707 -4296 -6366 -9581 -7818 -11945
15441a1945K68J3694J755p984j559N83R106N797L74k606R094J0983p834j1672
$$ -11945 -11677 2017 3772 -4212 -5771 -5188 3918 9715 10089 7483 16577 27560 19726 8054
15427H054J965O71R92O64j0238J435L674r678J732J0577L787n59K827r434l2J229
$$ 8054 10019 10690 11682 12346 2108 3543 7217 -2461 -729 9848 13635 13076 15903 6469 6437 7666
15411G666P697l975m304q621p777J4532O058q603p845q4k554m94J759q296L602
$$ 7666 15363 11388 7084 -1537 -9314 5218 11276 2673 -5172 -5256 -7810 -8304 -6545 -14841 -11239
15396a1239O128j453N083Q100L807j514L109l694m06K854L61m373q865O711J8797
$$ -11239 -5111 -6564 -1481 6619 10426 8912 12021 8327 7921 10775 11136 6763 -2102 4609 23406
15381B3406m209k535j0590K26O796J805j1626j2713l324M247O0m553K661J703
$$ 23406 19197 16662 6072 6298 13094 14899 3273 -9440 -12764 -8517 -8457 -13010 -10349 -8646
15367h646K353M653P984l331q67l872r94L194P046R951l496o629p707n349N991
$$ -8646 -6293 -1640 6344 3013 2146 -1726 -2720 474 7520 17471 13975 7346 -361 -5710 281
15352B81J0312m623q962n708k832M18K423o300R883J2178k470n911j0247O371
$$ 281 10593 5970 -2992 -8700 -11532 -11114 -8691 -14991 -5108 7070 4600 -1311 -11558 -5187
15338e187M383J782n994J265k536l735l992P596R187k28j0376m510l911P118Q099
$$ -5187 -804 978 -5016 -3751 -6287 -10022 -14014 -6418 2769 2541 -7835 -12345 -16256 -9138 -1039
15323a039o328J2976J7393m486j4194p870M85M953k19m637L463l392j3361l964
$$ -1039 -7367 5609 23002 18516 4322 -3548 -3063 1890 1671 -2966 497 -2895 -16256 -20220
15309b0220P795J3343P896L422M1o9j1392k462p7k730K141l90l974J589l944j883
$$ -20220 -12425 918 8814 12236 12277 12208 816 -1646 -1723 -4453 -2312 -2702 -6676 -5087 -9031 -10914
15293a0914l554N85P005M17q86P130m135n103j489k934k74O675M651M317l505
$$ -10914 -14468 -13883 -6878 -6461 -7347 -217 -4352 -9455 -10944 -13878 -14152 -7477 -2826 1491 -2014
15278b014K386l268l4O889J486k189L991j578n318j760m151J06M787q59R69p901
$$ -2014 372 -2896 -2930 3959 5445 3256 7247 5669 351 -1409 -5560 -5454 -667 -1526 -557 -8458
15262h458r67J186M408Q051k499J0412P359r178m495n868J694o227J443N555o077
$$ -8458 -9425 -8239 -3831 4220 1721 12133 19492 10314 5819 -49 1645 -4582 -3139 2416 -3661
15247c661l307m709j433l12Q312L572p104o152n263O605N373M81j090l773q361
$$ -3661 -6968 -11677 -13110 -13422 -5110 -1538 -8642 -14794 -20057 -13452 -8079 -7598 -8688 -12461 -20822
15232b0822P949Q432N116M748O396L676M897j361N41K121q821j4337O484L37m000
$$ -20822 -12873 -4441 675 5423 11819 15495 20392 19031 19572 21693 12872 -1465 5019 5356 1356
15217A356O521o732J089M169M350J99m255o962k761K577M521j708K524o841N592
$$ 1356 7877 1145 2234 6403 10753 10952 6697 -265 -3026 -449 4072 2364 4888 -1953 3639
15202C639Q386J0536j5586n006R070L646L872m291o260n439M76j999l995R174
$$ 3639 12025 22561 6975 1969 11039 14685 18557 14266 8006 2567 3043 1044 -2951 6223
15188F223K069P69o262K302j167m903M471K051J259K13r791m808O241N712K983
$$ 6223 8292 9061 2799 5101 3934 -969 3502 5553 6812 7025 -2766 -7574 -1333 4379 7362
15173G362j543J211J83l514q304o094l166Q952N515K986j0108j982j376l296N955
$$ 7362 5819 7030 7213 3699 -4605 -10699 -13865 -4913 602 3588 -6520 -8502 -9878 -13174 -7219
15158g219o051l807J01J556L445N153k425K933R914Q953Q674k800p301p246k168
$$ -7219 -13270 -17077 -16976 -15420 -11975 -6822 -9247 -6314 3600 12553 21227 18427 11126 3880 1712
15143A712k608J0078k564q088n519j074J18P461L131j0961M182J3194O410N237
$$ 1712 -896 9182 6618 -1470 -6989 -8063 -7945 -484 2647 -8314 -4132 9062 15472 20709
15129B0709n210J299r360N741j531l914j013k295m052o653j693J4279L358N08
$$ 20709 15499 16798 7438 13179 11648 7734 6721 4426 374 -6279 -7972 6307 9665 10173
15115A0173K567L858r211j1524J30K868P682J1396L951o284r336J921K685L575
$$ 10173 12740 16598 7387 -4137 -4007 -1139 6543 17939 21890 15606 6270 8191 10876 14451
15101A4451J307m704l730l492q388J498J147M722R650l286j6352l4l471O219O863
$$ 14451 15758 11054 7324 3832 -4556 -3058 -1911 2811 12461 9175 -7177 -7211 -10682 -4463 2400
15086B400J1373N102K43K838l667m343K914q86r318k210K391L39l654j305l179
$$ 2400 13773 18875 19118 21956 18289 13946 16860 15974 6656 4446 6837 7176 3522 2217 -962
15071i62P316j838r039n063O150L642m104q192O298N139j163l798L913L919j414
$$ -962 6354 4516 -4523 -9586 -3436 206 -3898 -12090 -5792 -653 -1816 -5614 -1701 2218 804
15056H04M118P052L041n495q235Q82N166l812m166r65m381P301L17p778K929K762
$$ 804 4922 11974 15015 9520 1285 2167 7333 3521 -645 -1610 -5991 1310 1627 -6151 -3222 -460
15040d60J0235n249k954p20k584N151P409k675Q882p495j0673p959l435p140L430
$$ -460 9775 4526 1572 852 -1732 3419 10828 8153 17035 9540 -1133 -9092 -12527 -19667 -16237
15025a6237o37N161M932J0822l940O466R036M070j1008o718j735m53q458L481
$$ -16237 -16874 -11713 -6781 4041 101 6567 15603 19673 8665 1947 212 -241 -8699 -5218
15011e218k272N806R838J2620L900q854m988q271n402j25m244n126J590Q314P074
$$ -5218 -7490 -1684 8154 20774 24674 15820 10832 2561 -2841 -2966 -7210 -12336 -10746 -2432 4642
14996D642k003N265L332n361j7J0230o894j3460N635J332l563n110M337P523K47
$$ 4642 2639 7904 11236 5875 5858 16088 9194 -4266 1369 2701 -862 -5972 -1635 5888 6135
14981F135o892o053J618N761L246j355l662N173k173j635J347j08K013M76N620
$$ 6135 -757 -6810 -5192 569 3815 2460 -1202 3971 1798 163 1510 1402 3415 3891 9511
14966I511Q611m569m429l47k047p284k100P103j1098O402Q123M196M757r248n494
$$ 9511 18122 13553 9124 8777 6730 -554 -2654 4449 -6649 -247 7876 12072 16829 7581 2087
14951B087m115K44N026K466L906l134j328L237O093J631k186o550L805j377N398
$$ 2087 -2028 -1784 3242 5708 9614 6480 5152 8389 14482 16113 13927 7377 11182 9805 15203
14936A5203k163j1637Q087L936r684m700K774j680M79M630L085j873l149J1740
$$ 15203 13040 1403 9490 13426 3742 -958 1816 136 615 5245 8330 6457 3308 15048
14922A5048r87j0825m267M03j19p384O486J539n492n424l356N913n069J989j691
$$ 15048 14061 3236 -1031 -628 -747 -8131 -1645 -106 -5598 -11022 -14378 -8465 -13534 -11545 -13236
14907a3236P977N219r203l776Q269J237m865Q312J5384P539m998M586k50q932
$$ -13236 -5259 -40 -9243 -13019 -4750 -3513 -8378 -66 15318 22857 17859 22445 22195 13263
14893A3263l557M250m219o333k139k913J041N945j485m155n473j60N08j291P1
$$ 13263 9706 13956 9737 3404 1265 -1648 -607 5338 3853 -302 -5775 -5935 -5427 -6718 -6647
14878f647k990M927Q729k058k785N013j68l677m493N393P138R545m043l695L841
$$ -6647 -9637 -4710 4019 1961 -824 4189 4021 344 -4149 1244 8382 17927 13884 10189 14030
14863A4030k472O020P945k073j734K800J992j0318k913m408Q3l948L443p311m871
$$ 14030 11558 17578 25523 23450 21716 24516 26508 16190 13277 8869 8952 5004 8447 1136 -3735
14848c735k964M352O250P830P804k004l805q755J920o16k467l338l839k390o79
$$ -3735 -6699 -2347 3903 11733 19537 17533 13728 4973 6893 6277 3810 472 -3367 -5757 -6436
14833f436N917J978J237Q471j109r028N397J0693L378q268K052n255K568P787
$$ -6436 -519 1459 2696 11167 10058 1030 6427 17120 20498 12230 14282 9027 11595 19382
14819A9382r212o592j0613M566M391K15J23L700j2574n736N960J0892M594J642
$$ 19382 10170 3578 -7035 -2469 1922 2137 2260 5960 -6614 -12350 -6390 4502 9096 10738
14805A0738l113j469l811n358K66J521N803K485k018r990O580n179P922j193M571
$$ 10738 7625 6156 2345 -3013 -2747 -1226 4577 7062 5044 -4946 1634 -3545 4377 3184 7755
14790G755J706L729L418L628P92r331J356M433o681r193K15Q203Q188l943n659
$$ 7755 9461 13190 16608 20236 21028 11697 13053 17486 10805 1612 1827 10030 18218 14275 8616
14775H616o634n559M261N812l195R41m253N090P907o108K101o37p7j2049m786
$$ 8616 1982 -3577 684 6496 3301 4242 -11 5079 12986 6878 8979 8342 8265 -3784 -8570
14760h570J3234R318l670L01Q544K732k835p599q934j528j555N836L742o69N177
$$ -8570 4664 13982 10312 10613 19157 21889 19054 11455 2521 993 -562 5274 9016 8347 13524
14745A3524o892K954N72r880q460l860P675J5319R192L17n673n335k750l209O439
$$ 13524 6632 9586 10158 278 -8182 -12042 -4367 10952 20144 20461 14788 9453 6703 3494 9933
14730I933R350J2775l226j7140j6480n081K675M742L491L519K727J922K582k363
$$ 9933 19283 32058 28832 11692 -4788 -9869 -7194 -2452 1039 4558 7285 9207 11789 9426
14716I426R35L701K644K035l102J93j3759L46n206m809J2396J0145L068R509k389
$$ 9426 10361 14062 16706 18741 15639 15832 2073 2419 -2787 -7596 4800 14945 18013 27522 25133
14701B5133j773p361k018Q956j6419k159Q115M099R93l686p907P196Q230M618
$$ 25133 23360 15999 13981 22937 6518 4359 12474 16573 17566 13880 5973 13169 21399 26017
14687B6017m174m855j492q195m422n736O556P953l751m781r321K821M749O235
$$ 26017 21843 16988 15496 7301 2879 -2857 3699 11652 7901 3120 -6201 -3380 1369 7604
14673G604J139m719K754p01J262J304j0081l693N186j643R999K299M320J0293
$$ 7604 8743 4024 6778 6077 7339 8643 -1438 -5131 55 -1588 8411 10710 15030 25323
14659B5323J779r555l295j967P92j984Q23M845p502k465O05R489O280q906k280
$$ 25323 27102 17547 14252 12285 13077 11093 11916 16761 9259 6794 7399 16888 23168 14262 11982
14644A1982M053l358Q764p527l928k200J685R6m409M913J2033Q622j0238r201
$$ 11982 16035 12677 21441 13914 9986 7786 9471 9567 5158 10071 22104 30726 20488 11287
14630A1287K864j2637n204n93N830j0499R9L305j965J657M598J1600Q603j2724
$$ 11287 14151 1514 -3690 -4283 1547 -8952 -8853 -5548 -7513 -5856 -1258 10342 18945 6221
14616F221p433R178J391j0517p797P01N860k15l859P04N22M346J516R290K882
$$ 6221 -1212 7966 9357 -1160 -8957 -8256 -2396 -2611 -6470 -5766 -5244 -898 618 9908 12790
14601A2790K65n976k679J272j025L3P475K704l066l344N322n072o589J0227K146
$$ 12790 13055 7079 4400 5672 4647 4680 12155 14859 11793 8449 13771 8699 2110 12337 14483
14586A4483r512M956j1090K900q94k863k745m140J924j418L658O811M58O723J341
$$ 14483 4971 9927 -1163 1737 843 -2020 -4765 -8905 -6981 -8399 -4741 2070 2528 9251 10592
14571A0592j3294Q85N564Q703O131m850m74P606P005K862m529j56J961m270n803
$$ 10592 -2702 -1817 3747 12450 18581 13731 13257 20863 27868 30730 26201 26045 28006 23736 17933
14556A7933P58K955j0996m004P719O963N177L999O94o395o802j1089q067J236
$$ 17933 18691 21646 10650 6646 14365 21328 26505 30504 31198 24803 18001 6912 -1155 81
14542H1K610R797N405j212j1661n291N862J624N525O132M572o391J007n107n296
$$ 81 2691 12488 17893 16681 5020 -271 5591 7215 12740 18872 23444 17053 18060 12953 7657
14527G657p91K890j272J444j0549k168O887q559p83P253L576L51o4k344k565K217
$$ 7657 6866 9756 8484 9928 -621 -2789 4098 -4461 -5244 2009 5585 5936 5872 3528 963 3180
14511C180n607j1252l587N786P474R210N434r12P287k683O196P799o51k751j1053
$$ 3180 -2427 -13679 -17266 -11480 -4006 5204 10638 9726 17013 14330 20526 28325 27674 24923 13870
14496A3870O55k769n214m46M248N218n83L120l366m435r55O794R262Q36o707K99
$$ 13870 14525 11756 6542 6096 10344 15562 14979 18099 14733 10298 9343 16137 25399 26235 19528 19827
14480A9827j931J582j578m662N021j342p282r841l128J1444O578j4051k830J0549
$$ 19827 17896 19478 17900 13238 18259 16917 9635 -206 -3334 8110 14688 637 -2193 8356
14466H356M425p187J446Q920Q514k270p849N015P19O806j1293j2928n669O45K021
$$ 8356 12781 5594 7040 15960 24474 22204 14355 19370 20089 26895 15602 2674 -2995 -2350 -329
14451c29J829M187J35O90J1074o914m551L590n338Q747J1411K375j7701j1368
$$ -329 1500 5687 5822 6512 17586 10672 6121 9711 4373 13120 24531 26906 9205 -2163
14437b163Q615J0592o830j373Q297M636j2942K915J1668l815m423N309j464q176
$$ -2163 6452 17044 10214 8841 17138 21774 8832 11747 23415 19600 15177 20486 19022 10846
14423A0846j024k366m077k89k061R66m837l790K248J5392Q409l543m516n460J63
$$ 10846 9822 7456 3379 3090 1029 1995 -2842 -6632 -4384 11008 19417 15874 11358 5898 6061
14408F061Q756j890k278J363K728l38l221n23l410J954R088J0752M020L46p179
$$ 6061 14817 12927 10649 12012 14740 14402 11181 10658 7248 9202 18290 29042 33062 33408 26229
14393B6229j1572r00RP35k685N167j677N42N624r415j3096Q690K919r39n569m118
$$ 26229 14657 13757 13766 14501 11816 16983 15306 15848 21472 12057 -1039 7651 10570 9631 4062 -56
14377e6j925Q978N152N377L117j0560k963L074M870J026O292l869o731q996n723
$$ -56 -1981 6997 12149 17526 20643 10083 7120 10194 15064 16090 22382 18513 11782 2786 -2937
14362b937j931O292P414P82Q278M829o632l536J531M155q105l949K59P569l514
$$ -2937 -4868 1424 8838 9620 17898 22727 16095 12559 14090 18245 10140 6191 6450 14019 10505
14347A0505N922R461n007r894M940K041p35q970O055J849m557J1988R289N021
$$ 10505 16427 25888 20881 10987 15927 17968 17233 8263 14318 16167 11610 23598 32887 37908
14333C7908L198p279o808k090n175l889m503M046M391L907O430Q65j1160n164
$$ 37908 41106 33827 27019 24929 19754 15865 11362 15408 19799 23706 30136 31001 19841 14677
14319A4677M958m410Q338o014l171N348k9j2034j185K891M519P801o107l46O991
$$ 14677 19635 15225 23563 17549 14378 19726 19697 7663 6478 9369 13888 21689 15582 15236 22227
14304B2227k296L25n620o778L149N757J06L109O009J849j0527m43j009l338J926
$$ 22227 19931 20256 14636 7858 11007 16764 16870 19979 25988 27837 17310 16867 15858 12520 14446
14289A4446L237M062r537n994N824J2029l082N446N188o873k503J382J517J946
$$ 14446 17683 21745 12208 6214 12038 24067 20985 26431 31619 24746 22243 23625 25142 27088
14275B7088n322j438R489j445q674k607q36n43m580k508O699O653m784O888J253
$$ 27088 21766 20328 29817 28372 19698 17091 16255 15712 11132 8624 15323 21976 17192 24080 25333
14260B5333J007K407M340p060l210m004l015j243J959j24J2681P888m883j1882
$$ 25333 26340 28747 33087 26027 22817 18813 15798 14555 16514 16390 29071 36959 32076 20194
14246B0194J0693J2127J0622P722J1041J9635K0008O589M914O48j587j5356k6347
$$ 20194 30887 43014 53636 61358 72399 92034 112042 118631 123545 124193 122606 107250 80903
14233H0903j4844n933o270j897n851j6445r354L069O932j948P692Q335j4975o659
$$ 80903 66059 60126 53856 51959 46108 29663 20309 23378 30310 28362 36054 44389 29414 22755
14219B2755Q315N045P08k46K189r7j1540R94O432J079P765J812l904o548o02K75
$$ 22755 31070 36115 36823 36577 38766 38669 27129 28123 34555 35634 43399 45211 41307 34759 34157 34432
14203C4432n070m004J1631j612j0037j158n776o464J0228m038l669Q586J328K010
$$ 34432 29362 25358 36989 35377 25340 24182 18406 11942 22170 18132 14463 23049 24377 26387
14189B6387j995k536o131o212K352J2847k821p584o066O907Q493K820m68k317
$$ 26387 24392 21856 15725 9513 11865 24712 21891 14307 8241 15148 23641 26461 25993 23676
14175B3676p76k384j315K708J891m635k817p951K826j07m041L411L008M682N984
$$ 23676 22900 20516 19201 21909 23800 19165 16348 8397 11223 11116 7075 10486 13494 18176 24160
14160B4160r902M481O954O216k001r301L071m729J937L101o160o78R037m513j1023
$$ 24160 14258 18739 25693 31909 29908 20607 23678 18949 20886 23987 17827 17149 26186 21673 10650
14145A0650K293k622J7613L13l181M61P521k566l432j589N353l544k311N963n829
$$ 10650 12943 10321 27934 28247 25066 25527 33048 30482 27050 25461 30814 27270 24959 30922 25093
14130B5093m350k303m186K090k68k088k441k775J0632P114N47j191k152j989r10
$$ 25093 20743 18440 14254 16344 16076 13988 11547 8772 19404 26518 27065 25874 23722 21733 20823
14115B0823K168J1216k192m627m726m469j865N63P177K654J3M753k649o227n511
$$ 20823 22991 34207 32015 27388 22662 18193 16328 16891 24068 26722 26735 31488 28839 22612 17101
14100A7101j153q8M846k285l947N330Q400N35j2689j592R911O31M001J2259L100
$$ 17101 15948 15860 20706 18421 14474 19804 28204 28739 16050 14458 24369 25000 29001 41260 44360
14085D4360P958O13n826k603j774L087l346j824l02q143N601Q325R661L787q369
$$ 44360 52318 52931 47105 44502 42728 45815 42469 40645 40343 32200 37801 46126 55787 59574 51205
14070E1205l756k56j999K34L070L312j033q964l801m84P712R278L94k55q65k282
$$ 51205 47449 47193 45194 45428 48498 51810 50777 41813 38012 37528 45240 54518 54912 54657 53792 51510
14054E1510N399J1207J0368L031N656m787r38j857O031J5682P746M555J7216J7757
$$ 51510 56909 68116 78484 81515 87171 82384 81446 79589 85620 101302 109048 113603 130819 148576
14040A48576K4253L7209M7656N9324R3440J28466J60891K10350K28761K39189
$$ 148576 172829 210038 257694 317018 410458 538924 699815 910165 1138926 1378115
14030A378115J87025P881k07674l16675k85991k12208j32940p8978m6616m1878
$$ 1378115 1565140 1573021 1365347 1048672 762681 550473 417533 338555 291939 250061
14020B50061k7388j8918j9632k2323o914q599n730r946q881M434o68q170j0739
$$ 250061 222673 203755 184123 161800 154886 146287 140557 130611 121730 126164 125496 117326 106587
14007A06587n546n008j3527m950N085O629M8P69K558o393J688M55o069R060O069
$$ 106587 101041 96033 82506 77556 82641 89270 89318 90087 92645 86252 87940 88395 82326 91386 97455
13992I7455m143K314J542p416j3598m645N792J2724M803M052J1509J7558J7774
$$ 97455 93312 95626 97168 89752 76154 71509 77301 90025 94828 98880 110389 127947 145721
13979A45721R292m39r969j2122q580l428q256j4677m233K27m744q046q263M610
$$ 145721 155013 154574 144605 132483 123903 120475 112219 97542 93309 93536 88792 80746 72483 77093
13965G7093J689q580l139P884R18R676L394M434K921n066r525n428r753p291n452
$$ 77093 78782 70202 67063 74947 75865 85541 88935 93369 96290 91224 81699 76271 66518 59227 53775
13950E3775K95O857j611j1013K736O891K298r127j336j261j691M693k999K707
$$ 53775 54070 60927 59316 48303 51039 57930 60228 51101 49765 48504 46813 51506 48507 51214
13936E1214r412M137J6433J4296L675p168k330L433J537j4279j6359j811N733
$$ 51214 41802 45939 62372 76668 80343 73175 70845 74278 75815 61536 45177 43366 49099
13923D9099Q009k027M980n100k580p371J777J0172O428n459j813l311l666n900
$$ 49099 57108 55081 60061 54961 52381 45010 46787 56959 63387 57928 56115 52804 49138 43238
13909D3238k959m244k200k55N052P073J1837O64R456N369j7734o378R34r492m664
$$ 43238 40279 36035 33835 33580 38632 45705 57542 58206 67662 73031 55297 48919 49853 40361 35697
13894C5697J2249J3623J847o437q581q72p808J972P314j938J0265n990n232K833
$$ 35697 47946 61569 63416 56979 48398 47526 39718 41690 49004 47066 57331 51341 46109 48942
13880D8942q1P812n719q656k822P93M69J788o6j604n060J318k297P929O852J7577
$$ 48942 48861 56673 50954 42298 39476 40269 40738 42526 42460 40856 35796 37114 34817 42746 49598 67175
13864F7175J4910L738J633o223n164k125J120l798j2542r263o84n12j3687O780
$$ 67175 82085 85823 87456 81233 76069 73944 75064 71266 58724 49461 48777 48265 34578 41358
13850D1358Q926l231k875n280o334M127L293P260J1833L363N73O761m514m239
$$ 41358 50284 47053 44178 38898 32564 36691 39984 47244 59077 62440 63013 69774 65260 61021
13836F1021J5753O04M034n25M619k833q184r485O267K180n462J582L516M643R717
$$ 61021 76774 77378 81412 80887 85506 82673 74489 65004 71271 73451 67989 69571 73087 77730 87447
13821H7447P812J460K88l200n66J0816K33m412M718K0686L6062M5834L6973J0646
$$ 87447 95259 96719 97007 93807 93241 104057 104290 99878 104596 125282 161344 207178 244151 254797
13807B54797O1k1042k8269l1945k9875k2597p837L061j3551k4007j8364j0199
$$ 254797 254858 233816 205547 173602 143727 121130 113293 116354 102803 78796 60432 50233
13795E0233N782J1477M325j455r73O657R154Q666J2585k095n590L88K768l257
$$ 50233 56015 67492 71817 70362 69389 76046 85200 93866 106451 104356 98766 99154 101922 98665
13781I8665o340P810L811M046N74O480M617q111q147n732n746p188p891n52N175
$$ 98665 92325 100135 103946 107992 108566 115046 119663 111552 103405 97673 91927 84739 76848 76296 81471
13766H1471N113J2777K935L611j101K774L29P770L900j4890p807j3601p923p36
$$ 81471 86584 99361 102296 105907 104806 107580 107909 115679 119579 104689 96882 83281 75358 74622
13752G4622j1635j7309n104K357m690p990o012o431O451J1072P218O670K6n429
$$ 74622 62987 45678 40574 42931 38241 30251 24239 17808 24259 35331 42549 49219 49245 43816
13738D3816k726L161K930K36l015k251O418J3763J2802M551J3678K2420J4450
$$ 43816 41090 44251 47181 47417 44402 42151 48569 62332 75134 79685 93363 115783 130233
13725A30233N649m505m834q923n100n39N699l039K57J1094K184n648o478o912
$$ 130233 135882 131377 126543 117620 112520 111981 117680 114641 114898 125992 128176 122528 116050 109138
13711A09138j3005l843J2691K5305L9702J7473L280n834j0405j119m784j0176
$$ 109138 96133 92290 104981 130286 169988 187461 190741 184907 174502 173383 168599 158423
13699A58423j9253k806O765J6181J9549J7811K3632J4117J5451J6170L1830L4191
$$ 158423 139170 136364 143129 159310 178859 196670 220302 234419 249870 266040 297870 332061
13687C32061L8404L6018N0211R7746J17851O8033K7461J3870k1799j01856j09371
$$ 332061 370465 406483 456694 554440 672291 740324 767785 781655 759856 658000 548629
13676E48629q7489o2630n2776m8486l2581j1963r418p809N70O233J6871J0079
$$ 548629 461140 398510 345734 297248 264667 252704 243286 235477 236047 242280 259151 269230
13664B69230K6404K2629J9307J6702J6948N220j1355O913J2768l849O473J5361
$$ 269230 295634 318263 337570 354272 371220 376440 365085 371998 384766 380917 387390 402751
13652D02751M093O504O620P395K970m59J1642J7582K4793K9764K3434K0512L1297
$$ 402751 406844 413348 419968 427363 430333 429874 441516 459098 483891 513655 537089 557601 588898
13639E88898K8020J4193J6860K6126M2413M6699M1401N2198Q1927J23157J60350
$$ 588898 616918 631111 647971 674097 716510 763209 804610 856808 938735 1061892 1222242
13628A222242J85451K10294K22902J57777k5504k14876k72703k16869j34802p5213
$$ 1222242 1407693 1617987 1840889 1998666 1973162 1758286 1485583 1268714 1133912 1058699
13618A058699l9082k7943p607O173N753o803q090m594R31J5068L0440K8801K8472
$$ 1058699 1019617 991674 984067 990240 995993 989190 981100 976506 977437 992505 1022945 1051746 1080218
13605A080218K1920K2542K8933M0919M6380N9147N3709M1864N1270M4604L7088
$$ 1080218 1102138 1124680 1153613 1194532 1240912 1300059 1353768 1395632 1446902 1491506 1528594
13594A528594K6880K6543L7557L7739M6450N1431M9927N3190O4045P7080Q9307
$$ 1528594 1555474 1582017 1619574 1657313 1703763 1755194 1805121 1858311 1922356 1999436 2088743
13583B088743J01669J19577J49048J62956J91414K43388K78477L24455L78397
$$ 2088743 2190412 2309989 2459037 2621993 2813407 3056795 3335272 3659727 4038124
13574D038124M32192M92852O17085P77150R55007J150695J434137J811959K334056
$$ 4038124 4470316 4963168 5580253 6357403 7312410 8463105 9897242 11709201 14043257
13565A4043257L071261L999513N101536O642363R048958J2741958J8262986K6137314
$$ 14043257 17114518 21114031 26215567 32857930 41906888 54648846 72911832 99049146
13557I9049146L5405068M2088237M5850699M7196007K9493681j1825856n0661371
$$ 99049146 134454214 176542451 222393150 269589157 299082838 287256982 236595611
13550B36595611o4652007n1753002l4224051k1091646j3073534q422935n681127
$$ 236595611 171943604 120190602 85966551 64874905 51801371 43378436 37697309
13543C7697309m030866l006030k370671k059846j905791j673426j361089j064923
$$ 37697309 33666443 30660413 28289742 26229896 24324105 22650679 21289590 20224667
13535B0224667p73670n21122l12891j34018J018q5832n13701r43047j119413j132211
$$ 20224667 19450997 18929875 18616984 18482966 18483984 18398152 17884451 16941404 15821991 14689780
13525A4689780j086140j007446r41106q71778p99684p22264o64282o18261n60105
$$ 14689780 13603640 12596194 11655088 10783310 9983626 9261362 8597080 7978819 7418714
13516G418714n22723m74654m33863l89212l54010l33598l20125k96505k59650
$$ 7418714 6895991 6421337 5987474 5598262 5244252 4910654 4590529 4294024 4034374
13507D034374k10811j91600j85248j79161j62864j58183j67520j56810j40250
$$ 4034374 3823563 3631963 3446715 3267554 3104690 2946507 2778987 2622177 2481927
13498B481927j37816j13596j13870j19143j14303j16198j01073q1035p5676p4275
$$ 2481927 2344111 2230515 2116645 1997502 1883199 1767001 1665928 1584893 1509217 1434942
13488A434942o3303n7245n6319o2583n6517l7223m3528o2465p0820n4579n4682
$$ 1434942 1371639 1314394 1258075 1195492 1138975 1101752 1058224 995759 924939 870360 815678
13477H15678n9389m1305k6407k1578j5463k4159l7047l4858k0935l1184l0665
$$ 815678 756289 714984 688577 666999 651536 627377 590330 555472 534537 503353 472688
13466D72688j4406M537j1795j8444q327j1299j7554l0225k2762k7376j5424j3561
$$ 472688 458282 462819 451024 432580 424253 412954 395400 365175 342413 315037 299613 286052
13454B86052j7976j6968k088K355K10j7776j3793j3830k4172j0869n892L270O048
$$ 286052 268076 251108 249020 251375 251585 233809 220016 206186 182014 171145 165253 168523 174571
13441A74571Q067J1112K582K009K6603L2660J9610K3750K5626L2089N3456P8659
$$ 174571 182638 193750 196332 198341 224944 257604 277214 300964 326590 358679 412135 490794
13429D90794P3085L2367N946k3862j18172j27976o1473m9677l0087p306o593k788
$$ 490794 563879 596246 602192 578330 460158 332182 270709 221032 190945 183639 177046 174258
13417A74258l057n794j3139k0511j7455j549N51p272n266m37O794j564j1625r599
$$ 174258 171201 165407 152268 131757 114302 112753 113304 106032 100766 100329 107123 105559 93934 84335
13403H4335q98Q734R022K3155K4491K0402J5802J9225J6019l667m507q221k934
$$ 84335 83437 92171 101193 124348 148839 169241 185043 204268 220287 216620 212113 203892 200958
13390B00958k305O228N823j857k650j107N096l527o104q091p146j190J1474R192
$$ 200958 198653 204881 210704 208847 206197 205090 210186 206659 200555 192464 185318 184128 195602 204794
13376B04794O988J5550K251m936p970o847o142R174J072k432J28m512Q850L638
$$ 204794 211782 227332 229583 224647 216677 209830 203688 212862 213934 211502 211630 207118 215968 219606
13362B19606k889K074M933p196j9263k2911j0114k512j2370j6002j2552j3551
$$ 219606 216717 218791 223724 216528 197265 174354 164240 161728 149358 133356 120804 107253
13350A07253r703k271j619K027p76o259l74L730m886n890n261o506j099O508M926
$$ 107253 97550 95279 93660 95687 94911 88652 88278 92008 87122 81232 75971 69465 68366 74874 79800
13335G9800j2779j2858k888j0937q073k209j2837j5204L016N546M166l127r906
$$ 79800 67021 54163 51275 40338 32265 30056 17219 2015 5031 10577 14743 11616 1710
13322A710j096j070N87m614m486J711J2450O996Q683Q264N58n4O128m570q059
$$ 1710 614 -456 131 -4483 -8969 -7258 5192 12188 20871 29135 29693 29639 35767 31197 23138
13307B3138j5953j0099P103J3715J5915J4633j893N342k944j1548j6323q561N726
$$ 23138 7185 -2914 4189 17904 33819 48452 46559 51901 48957 37409 21086 12525 18251
13294A8251n207l710k726p995o413k118m356o707J208J0151N583J148j815r755
$$ 18251 13044 9334 6608 -1387 -7800 -9918 -14274 -20981 -19773 -9622 -4039 -2891 -4706 -14461
13280a4461r65l227r73J530J500m372k209m090K113P465O413m214P560N447P458
$$ -14461 -15426 -18653 -19626 -18096 -16596 -20968 -23177 -27267 -25154 -17689 -11276 -15490 -7930 -2483 4975
13265D975P971N031k226N365J465Q85q135j129o93P85N124N723J417Q239M645
$$ 4975 12946 17977 15751 21116 22581 23466 15331 14202 13509 14294 19418 25141 26558 34797 39442
13250C9442j182m814J203r480q492k916n219l618p096M888K1072J7195N47J077
$$ 39442 38260 33446 34649 25169 16677 13761 8542 4924 -2172 2716 23788 40983 41530 42607
13236D2607N44l648o241q303l867l372K257R22q825j198j86O461K915K756K097
$$ 42607 43151 39503 33262 24959 21092 17720 19977 20899 12074 10876 10690 17151 20066 22822 24919
13221B4919l18O643N976M076L365n429q982p895J594K165J06Q24m89p737j977
$$ 24919 24601 31244 37220 41296 44661 39232 30250 22355 23949 26114 26220 27044 26555 18818 16841
13206A6841j010n059j102Q625k468n784k961N66R099O13j2297m789k055l931J3347
$$ 16841 15831 10772 9670 18295 15827 10043 7082 7648 16747 17360 5063 274 -1781 -5712 7635
13191G635o154p972r353j5032J585J5709J2453P134O176N68p656K588J834j4831
$$ 7635 1481 -6491 -15844 -30876 -29291 -13582 -1129 6005 12181 12749 5093 7681 9515 -5316
13177e316j4769j448r86M419J839O877j07N025R807O201Q18o113l015o512P17
$$ -5316 -20085 -21533 -22519 -18100 -16261 -9384 -9491 -4466 5341 11542 12360 6247 3232 -3280 -2563
13162b563Q47L615o191r988j1778J639R365J2487j740p581o762k799N217M925
$$ -2563 -1716 1899 -4292 -14280 -26058 -24419 -15054 -2567 -4307 -11888 -18650 -21449 -16232 -11307
13148a1307j445L351o804L449M47l34l673M690l89r138J44L399K733n198n609
$$ -11307 -12752 -9401 -16205 -12756 -12309 -12643 -16316 -11626 -12015 -21153 -21009 -17610 -14877 -20075 -25684
13133b5684Q963K541J443N387R900L495m58j893L574O093q449j3222o602q71M772
$$ -25684 -16721 -14180 -12737 -7350 2550 6045 5587 3694 7268 13361 4912 -8310 -14912 -15783 -11011
13118a1011l323l250K408O022J6463R094k827n742m383K670j096j046J4966J2062
$$ -11011 -14334 -17584 -15176 -9154 7309 16403 13576 7834 3451 6121 5025 3979 18945 31007
13104C1007J258O183J7019j801l346j0189o14M668j0488L010N675P315J770q05
$$ 31007 32265 38448 55467 53666 50320 40131 39517 44185 33697 36707 42382 49697 51467 50662
13090E0662k994P560J7271j903j23Q171O571M776J6625J6581J3652L1088M0473
$$ 50662 47668 55228 72499 70596 70473 78644 85215 89991 106616 123197 136849 167937 208410
13077B08410N8765Q6019J14959J66247K14201K40397K53392K02164J9070j94068
$$ 208410 267175 353194 468153 634400 848601 1088998 1342390 1544554 1563624 1369556
13067A369556l19602l07802k11830j24146q0637n5185l7224l6003k3824k1655
$$ 1369556 1049954 742152 530322 406176 325539 270354 233130 197127 173303 151648
13057A51648j4615l014j3879j4662o562k061j1019L74J0943J405q050l633m829
$$ 151648 137033 134019 120140 105478 98916 96855 85836 86210 97153 98558 90508 86875 82046
13044H2046R16j77j4767j2260j7447n641l829K247R75j2382o3P431M811q515r528
$$ 82046 82962 82785 68018 55758 38311 32670 28841 31088 32063 19681 19618 27049 31860 23345 13817
13029A3817p913K384R540l14K299K28j1114k632M939k933n012L179j11N33j1258
$$ 13817 5904 8288 17828 17514 19813 20041 8927 6295 11234 8301 3289 6468 6357 6890 -4368
13014d368K492K239l628k882m701k222K991L615J0555m591l940k988k43N404K913
$$ -4368 -1876 363 -3265 -6147 -10848 -13070 -10079 -6464 4091 -500 -4440 -7428 -7671 -2267 646
12999F46M756O22o188J922J787j718j310K124K063j968q699o582m530J156j980
$$ 646 5402 6024 -164 1758 3545 1827 517 2641 4704 2736 -5963 -12545 -17075 -15919 -17899
12984a7899j285L901K447J261K165o787p99N195N106J398n093N410M477l109l544
$$ -17899 -19184 -15283 -12836 -11575 -9410 -16197 -16996 -11801 -6695 -5297 -10390 -4980 -503 -3612 -7156
12969g156n900O795P139O170J486j0725n658q401l289J0424P194L396J909L552
$$ -7156 -13056 -6261 878 7048 8534 -2191 -7849 -16250 -19539 -9115 -1921 1475 3384 6936
12955F936j1358l186P015N663P143M844m635j2510p213L888M150j4798j2403J916
$$ 6936 -4422 -7608 -593 5070 12213 17057 12422 -88 -7301 -3413 737 -14061 -26464 -24548
12941b4548R275L970J401l062p877L096J276k044N220M280n435O834K823O359
$$ -24548 -15273 -11303 -9902 -12964 -20841 -17745 -16469 -18513 -13293 -9013 -14448 -7614 -4791 1568
12927A568o284j5450o374K545N164P325k494q20m591j515J304j469j487O986M509
$$ 1568 -4716 -20166 -26540 -23995 -18831 -11506 -14000 -14820 -19411 -20926 -19622 -21091 -22578 -15592 -11083
12912a1083Q138J3168O717J591j379n293j926q318j945l586p716M586N729R31
$$ -11083 -2945 10223 16940 18531 17152 11859 9933 1615 -330 -3916 -11632 -7046 -1317 -386
12898c86n589j7140m643L189p140O242M393L281K087K242J41o139k748J0984Q466
$$ -386 -5975 -23115 -27758 -24569 -31709 -25467 -21074 -17793 -15706 -13464 -13323 -19462 -22210 -11226 -2760
12883b760l414j3639n525P077J16j361O552J953m318k179J1069k990J694l411
$$ -2760 -6174 -19813 -25338 -18261 -18145 -19506 -12954 -11001 -15319 -17498 -6429 -9419 -7725 -11136
12869a1136m536L691J0108j189p18l937J490J356k803k017m749k700j760Q836
$$ -11136 -15672 -11981 -1873 -3062 -3780 -7717 -6227 -4871 -7674 -9691 -14440 -17140 -18900 -10064
12855a0064J1275j204r08q182l223K985j838q80j019j3654K759J0429J732K848
$$ -10064 1211 7 -901 -9083 -12306 -9321 -11159 -12039 -13058 -26712 -23953 -13524 -11792 -8944
12841h944O341j148l646l836j770J499o902l374Q416K489k527j989P340O517J1897
$$ -8944 -2603 -3751 -7397 -11233 -13003 -11504 -18406 -21780 -13364 -10875 -13402 -15391 -8051 -1534 10363
12826A0363J585j1980j1879K696l766j1479l30O249J290n511l169J3745Q801J0673
$$ 10363 11948 -32 -11911 -9215 -12981 -24460 -24790 -18541 -17251 -22762 -25931 -12186 -3385 7288
12812G288N290l65k829r332K040j0580o405N62k411N461K067k535m985J84n295
$$ 7288 12578 12213 9384 52 2092 -8488 -14893 -14331 -16742 -11281 -9214 -11749 -16734 -16550 -21845
12797b1845k774Q624P861N414o162n258j0066j1972J874R374k233Q892J0849P680
$$ -21845 -24619 -15995 -8134 -2720 -8882 -14140 -24206 -36178 -34304 -24930 -27163 -18271 -7422 258
12783B58P944q433j4677m475K444q71K007m652m665m618M526N062k657m766j579
$$ 258 8202 -231 -14908 -19383 -16939 -17810 -15803 -20455 -25120 -29738 -25212 -20150 -22807 -27573 -29152
12768b9152N440Q369J78O012Q258l795j1588L044Q529J3192K900o409o348J603
$$ -29152 -23712 -15343 -15165 -9153 -895 -4690 -16278 -13234 -4705 8487 11387 4978 -1370 233
12754B33J44q714k16o58l606j155K868L84l695n114L261k486N978N680m689r953
$$ 233 377 -8337 -8553 -9211 -12817 -13972 -11104 -10720 -14415 -19529 -16268 -18754 -12776 -7096 -11785 -21738
12738b1738N315N35m941K675J329M386j876R97J195k963J403p621L509J4567L383
$$ -21738 -16423 -15888 -20829 -18154 -16825 -12439 -14315 -13318 -12123 -15086 -13683 -21304 -17795 -3228 155
12723A55k740j0151j589M125q003N074Q642q950j3110l375N859n597o551K147
$$ 155 -2585 -12736 -14325 -10200 -18203 -13129 -4487 -13437 -26547 -29922 -24063 -29660 -36211 -34064
12709c4064Q42Q239M352k261n35j190O953J1891O87q876M66m47J632P097K223
$$ -34064 -33222 -24983 -20631 -22892 -23427 -24617 -17664 -5773 -5086 -13962 -13496 -13943 -12311 -5214 -2991
12694b991n555k567n317J751M329P789l075L9J021J387l047j685Q800O714m41
$$ -2991 -8546 -11113 -16430 -14679 -10350 -2561 -5636 -5597 -4576 -3189 -6236 -7921 879 7593 7152
12679G152j4978k671M15j0797L5P398L095m14K989m11r839J199L607K74p364J835
$$ 7152 -7826 -10497 -10082 -20879 -20844 -13446 -10351 -10765 -7776 -8187 -18026 -16827 -13220 -12946 -20310 -18475
12663a8475P407P374K652k678l171o487l956n999M53J5975N186j24L42m833m423
$$ -18475 -11068 -3694 -1042 -3720 -6891 -13378 -17334 -23333 -22880 -6905 -1719 -1843 -1501 -6334 -10757
12648a0757m340j856R935J315j2K60j500m953k63P14n657o163M486N868k974J437
$$ -10757 -15097 -16953 -7018 -5703 -5715 -5455 -6955 -11908 -12171 -11457 -17114 -23277 -18791 -12923 -15897 -14460
12632a4460K908L014L636q985n156O790Q458l468P16j47l597M16J03L960J546
$$ -14460 -11552 -8538 -4902 -13887 -19043 -12253 -3795 -7263 -6547 -6694 -10291 -9875 -9772 -5812 -4266
12617d266N079L681k625m803l756m735j1268l389N947J4394o378L237q076P82
$$ -4266 813 4494 1869 -2934 -6690 -11425 -22693 -26082 -20135 -5741 -12119 -8882 -16958 -16176
12603a6176J609p172K45J0826j299r055m430l63P608O044l566l245K854N496K036
$$ -16176 -14567 -21739 -21494 -10668 -11967 -21022 -25452 -25815 -18207 -12163 -15729 -18974 -16120 -10624 -8588
12588h588J477O257j806J813m000o197j161J276l974n570M869O839L802k107K655
$$ -8588 -7111 -854 -2660 -847 -4847 -11044 -12205 -10929 -14903 -20473 -15604 -8765 -4963 -7070 -4415
12573d415N922K723o350j324k610P638O712k924j80Q755p4L003Q702J9935J4039
$$ -4415 1507 4230 -2120 -3444 -6054 1584 8296 5372 5192 13947 13873 16876 25578 45513 59552
12558E9552J5115K4073L4754L3622R515q744l5961l9067k9807j1659p031k418
$$ 59552 74667 98740 133494 167116 176631 167887 131926 92859 63052 51393 44362 41944
12546D1944o215q180k029k905L36k569l205M193K919N61K345k023j87o028m178
$$ 41944 35729 27549 25520 22615 22951 20382 17177 21370 24289 24850 27195 25172 24985 18957 14779
12531A4779l121P712m154J865J251n255k85R85M711P31o27N855K0571K6500K7055
$$ 14779 11658 19370 15216 17081 18332 13077 12792 13777 18488 19219 18592 24447 45018 71518 98573
12516I8573K2360M7543N4193P1079Q1181Q1364O9870Q519p1457j19187j01441
$$ 98573 120933 168476 222669 293748 374929 456293 526163 534682 463225 344038 242597
12505B42597o9509m1609j9588j3653j8929r447o922K572q380L398p567n636j359
$$ 242597 173088 131479 111891 98238 79309 69862 62940 65512 57132 60530 52963 47327 45968
12492D5968k604j0263o338n10m141l312j64J4244O232p275o519O800P095L264
$$ 45968 43364 33101 26763 26253 22112 18800 18636 32880 39112 31837 25318 32118 39213 42477
12478D2477O651j424m472K234J0852K0230K8848N3326N8937O3029P6044Q8539
$$ 42477 49128 47704 43232 45466 56318 76548 105396 158722 217659 280688 356732 445271
12466D45271Q5525L3768m8451j16963j26047r0399n5349l3901k3578p494l824
$$ 445271 530796 564564 516113 399150 273103 182704 127355 93454 69876 62382 58558
12455E8558n763m100J280j302k839m986l633O58j3736n076N76K374K996K066l110
$$ 58558 52795 48695 49975 48673 45834 40848 37215 37873 24137 19061 19637 22011 25007 27073 23963
12440B3963k195Q66l166l185m758n377J1371R780K023J37n490N287J1960J9670
$$ 23963 21768 22634 19468 16283 11525 6148 17519 27299 29322 29459 23969 29256 41216 60886
12426F0886Q777J2054J7055K9140L2381K1896m581l6961m4404l3122j6393J696
$$ 60886 69663 81717 98772 127912 160293 182189 177608 140647 96243 63121 46728 48424
12414D8424l58L94r732j4334J030Q093n762l568j511j006m483O483l55j0718n300
$$ 48424 48066 48460 38728 24394 25424 33517 27755 24187 22676 21670 17187 23670 23315 12597 7297
12399G297k900m704m611J0145M171m553l063J72J1037o102l589o324o890O497
$$ 7297 4397 -307 -4918 5227 9398 4845 1782 1954 12991 6889 3300 -3024 -9914 -3417
12385c417J1918m143k509M010j804q4o565k891O493M316J795K537N839k493n6
$$ -3417 8501 4358 1849 5859 4055 3971 -2594 -5485 1008 5324 7119 9656 15495 13002 12946
12370A2946M492j6858r602N896O395J8921N282K570k104o24q140j0618j315j56
$$ 12946 17438 580 -9022 -3126 3269 22190 27472 30042 27938 27314 19174 8556 7241 7085
12356G085J934L667L353p851j663K247j5009j4856j004P147L169P937J3450p63
$$ 7085 9019 12686 16039 8188 6525 8772 -6237 -21093 -22097 -14950 -11781 -3844 9606 8843
12342H843q632j284r87J612l316L75m93j5280q552M109N469M795L622k218L696
$$ 8843 211 -1073 -2060 -448 -3764 -3389 -3882 -19162 -27714 -23605 -18136 -13341 -9719 -11937 -8241
12327h241J3642L731r10j713o72M015J3214J0673N353j248j6179j6741m935p189
$$ -8241 5401 9132 8222 6509 5837 9852 23066 33739 39092 37844 21665 4924 -11 -7200
12313g200J021R648p828o037m63O756M866K852J524p906j512k567l370J235n47
$$ -7200 -6179 3469 -4359 -10396 -10859 -4103 763 3615 5139 -2767 -4279 -6846 -10216 -8981 -9528
12298i528p640J713J0911q630O131Q662j825o345n176N965P652k252p14R06j0654
$$ -9528 -17168 -15455 -4544 -13174 -7043 1619 -206 -6551 -11727 -5762 1890 -362 -1076 -170 -10824
12283a0824o446J0731k699k096O988J3434K012p617K501n786L250M567q381q374
$$ -10824 -17270 -6539 -9238 -11334 -4346 9088 11100 3483 5984 198 3448 8015 -366 -8740
12269h740K787P320k87n35J174O609j471J02j26m433k038l615j630m67Q360k424
$$ -8740 -5953 1367 1080 545 1719 8328 6857 6959 6833 2400 362 -3253 -4883 -5350 3010 586
12253E86p305k62J1219L359m731o605j488k422m514k553K763M632j570L263L501
$$ 586 -6719 -6981 4238 7597 2866 -3739 -5227 -7649 -12163 -14716 -11953 -7321 -8891 -5628 -2127
12238b127J320o08r61Q370P027P241l214n111k428m995q104k71l329m287Q11K750
$$ -2127 -807 -1415 -2376 5994 13021 20262 17048 11937 9509 4514 -3590 -3861 -7190 -11477 -10666 -7916
12222g916j79L660Q930n274j1768P67l407j354L043M10M13M621N729K778J862
$$ -7916 -8095 -4435 4495 -779 -12547 -11780 -15187 -16541 -13498 -13088 -12675 -8054 -2325 453 2315
12207B315r087k068k721P876q07k647M376j169J125M134l700m771K120M290L15
$$ 2315 -6772 -8840 -11561 -3685 -4492 -7139 -2763 -3932 -2807 1327 -2373 -7144 -5024 -734 -419
12192d19q57o170K432m582m742K165k168J0155M489m772J0118M760m581l547j436
$$ -419 -1276 -7446 -5014 -9596 -14338 -12173 -14341 -4186 303 -4469 5649 10409 5828 2281 845
12177H45j677n268j062R853m279n195K564O608j942J252Q456m378j6975r559L208
$$ 845 -832 -6100 -7162 2691 -1588 -6783 -4219 2389 447 1699 10155 5777 -11198 -20757 -17549
12162a7549N220N071j357J134J349M336m759Q0m278n466O890K208L457J322m09
$$ -17549 -12329 -7258 -8615 -7481 -6132 -1796 -6555 -6475 -10753 -16219 -9329 -7121 -3664 -2342 -2751
12147b751k480M486k394l338Q05K035n88o801k236N000M61n32N339p93L209L48
$$ -2751 -5231 -745 -3139 -6477 -5672 -3637 -4225 -11026 -13262 -8262 -7801 -8333 -2994 -3787 -578 -230
12131b30o60R0L126o084k935j091O309O015J51o711l441o675m733N785P111K404
$$ -230 -890 -800 2326 -3758 -6693 -7784 -1475 4540 4691 -2020 -5461 -12136 -16869 -11084 -3973 -1569
12115a569m771K748O362O68k443j0022R99N79k164p91j194J204R805j060q880
$$ -1569 -6340 -3592 2770 3438 995 -9027 -8028 -7449 -9613 -10404 -11598 -10394 -589 -1649 -10529
12100a0529j957L384P777L24n607m551N020M775J043q681l980M120J486m978J599
$$ -10529 -12486 -9102 -1325 -1001 -6608 -11159 -6139 -1364 -321 -9002 -12982 -8862 -7376 -12354 -10755
12085a0755l181L306J760k395m26k663P087o344r827j0780J019J0739M850J2019
$$ -10755 -13936 -10630 -8870 -11265 -11691 -14354 -7267 -13611 -23438 -34218 -33199 -22460 -17610 -5591
12071e591L193R547r0j385L142o867r5j0831m068n280J4313P867R41m035O256
$$ -5591 -2398 7149 7059 5674 8816 1949 1854 -8977 -13045 -18325 -4012 3855 4796 761 7017
12056G017j350r794k806M231J3026Q667q558m883J138k181k184K414o094q062
$$ 7017 5667 -4127 -6933 -2702 10324 18991 10433 5550 6688 4507 2323 4737 -1357 -9419
12042i419L25j406n309N155J0305l998m580N167N362J313N852L643n88k950j840
$$ -9419 -9094 -10500 -15809 -10654 -349 -4347 -8927 -3760 1602 2915 8767 12410 11822 8872 7032
12027G032j063n860m815l200n389l225J1401j113l518M405M059k214P447J1862
$$ 7032 5969 109 -4706 -7906 -13295 -16520 -5119 -6232 -9750 -5345 -1286 -3500 3947 15809
12013A5809q42m164j149K826j394j0258p016R881J0423K342k758p448O334l406
$$ 15809 14967 10803 9654 12480 11086 828 -6188 3693 14116 16458 13700 6252 12586 9180
11999I180j0308k331j660l191m878O32n649p741j473k071J6802J3039N389r92
$$ 9180 -1128 -3459 -5119 -8310 -13188 -12556 -18205 -25946 -27419 -29490 -12688 351 5740 4748
11985D748q246k705q45J025N901L691k216K252M007K09q506K418j2262p151J804
$$ 4748 -3498 -6203 -7048 -6023 -122 3569 1353 3605 7612 7821 -685 1733 -10529 -17680 -15876
11970a5876J977Q242N217K984l834m242l816n46o334M815N938J3065n610p346
$$ -15876 -13899 -5657 -440 2544 -1290 -5532 -9348 -9894 -16228 -11413 -5475 7590 1980 -5366
11956e366o305O140r401O365j232J70o840j191j766m399L953J268L607R513J704
$$ -5366 -11671 -5531 -14932 -8567 -9799 -9629 -16469 -17660 -19426 -23825 -19872 -18604 -14997 -5484 -3780
11941c780j0924k033J542L431P278J181m179k512K129Q514O521j593K481J991
$$ -3780 -14704 -16737 -15195 -11764 -4486 -3305 -7484 -9996 -7867 647 7168 5575 8056 10047
11927A0047o590n293l789j117l449N255k951L081K099J30j478K804K403J28L587
$$ 10047 3457 -1836 -5625 -6742 -10191 -4936 -7887 -4806 -2707 -2577 -4055 -1251 1152 1280 4867
11912D867j145L12L61K156j2983L171J1634l85m626p155K800n846l524k123P51
$$ 4867 3722 4034 4395 6551 -6432 -3261 8373 7988 3362 -3793 -993 -6839 -10363 -12486 -11735
11897a1735j198k231J1520K363P455j06n737J398J929j0010K211m199j1018J234
$$ -11735 -12933 -15164 -3644 -1281 6174 6068 331 1729 3658 -6352 -4141 -8340 -19358 -18124
11883a8124Q525q19M878K323o489j604M77O742r03l905m552j019l51P030M729
$$ -18124 -9599 -10418 -5540 -3217 -9706 -11310 -10833 -4091 -4994 -8899 -13451 -14470 -14821 -7791 -3062
11868c062k199j314L18R095j762n005p179o204k236J0397J219k030p519P233J281
$$ -3062 -5261 -6575 -6257 2838 1076 -3929 -11108 -17312 -19548 -9151 -7932 -9962 -17481 -10248 -8967
11853h967l211M351R27P739n869K925O368J751n410o165p119l027o25N121k34
$$ -8967 -12178 -7827 -6900 839 -5030 -2105 4263 6014 604 -5561 -12680 -15707 -16332 -11211 -11445
11838a1445l75j353m408N900J1975Q642j067J932o952j094J168p685l029J67M339
$$ -11445 -11820 -13173 -17581 -11681 294 8936 7869 9801 2849 1755 2923 -4762 -7791 -7624 -3285
11823c285O205p45o13J69k353l272K458J0680N40j4737j4356R05P502M348o815
$$ -3285 2920 2175 1562 1731 -622 -3894 -1436 9244 9784 -4953 -19309 -18404 -10902 -6554 -13369
11808a3369k936K136j544J2784P239L681k412j641m216o896r624k160J2454L258
$$ -13369 -16305 -14169 -15713 -2929 4310 7991 5579 3938 -278 -7174 -16798 -18958 -6504 -3246
11794c246Q32J442k086j057j559l700J869O471m22l237M210p618p976k24N723
$$ -3246 -2414 -972 -3058 -4115 -5674 -9374 -7505 -1034 -1456 -4693 -483 -8101 -16077 -16301 -10578
11779a0578J0479R307m985q316p10l491n359O909r137k249q0J6899J2520m769
$$ -10578 -99 9208 4223 -4093 -4803 -8294 -13653 -6744 -15881 -18130 -18210 -1311 11209 6440
11765F440q547j957n213O61l250R93j47j0647J284M922M835K863n917K693M665
$$ 6440 -2107 -4064 -9277 -8616 -11866 -10873 -11020 -21667 -20383 -15461 -10626 -7763 -13680 -10987 -6322
11750f322p951K293L30j161J0778m606n788M241R840J100j289n856o473J423N881
$$ -6322 -14273 -11980 -11650 -12811 -2033 -6639 -12427 -8186 1654 2754 1465 -4391 -10864 -9441 -3560
11735c560l518l915M636N105O92J56l224Q5k757p998L021N730K2P441N840j0897
$$ -3560 -7078 -10993 -6357 -1252 -560 -404 -3628 -3543 -6300 -14298 -11277 -5547 -5525 1916 7756 -3141
11719c141j70m337N742q16K427k114N486k324q010O77M502Q389Q00l883j1642
$$ -3141 -3311 -7648 -1906 -2722 -295 -2409 3077 753 -7257 -6580 -2078 6311 7111 3228 -8414
11704h414j3811m353Q227M727r474Q752J1625K47N53P259n39o575r400k230J328
$$ -8414 -22225 -26578 -18351 -13624 -23098 -14346 -2721 -2474 -1921 5338 4799 -1776 -11176 -13406 -12078
11689a2078L694J518r255K963P073o76k811j1116L958J1381O84q828M267N380
$$ -12078 -8384 -6866 -16121 -13158 -6085 -6761 -9572 -20688 -16730 -5349 -4665 -13493 -9226 -3846
11675c846N424N941L269j0040r950j091Q520M901j1501p051j18M418J0354N586
$$ -3846 1578 7519 10788 748 -9202 -10293 -1773 3128 -8373 -15424 -15542 -11124 -770 4816
11661D816R09r738l553p908J830P906j288m929R88k192m37L497r057O784M336
$$ 4816 5725 -4013 -7566 -15474 -13644 -5738 -7026 -11955 -10967 -13159 -13596 -10099 -19156 -12372 -8036
11646h036o672k817K227P766Q105R556j458j497m15o164o676J389L09n269R678
$$ -8036 -14708 -17525 -15298 -7532 573 10129 8671 7174 6759 595 -6081 -4692 -4383 -9652 26
11631B6N493j0628J0040O182l358j3827j1370L830p87J5837K942N612j1699j2627
$$ 26 5519 -5109 4931 11113 7755 -6072 -17442 -13612 -14399 1438 4380 9992 -1707 -14334
11617a4334k373M375P94K773n300j819Q756m770o398J152Q529N166o675j683o65
$$ -14334 -16707 -12332 -11538 -8765 -14065 -15884 -7128 -11898 -18296 -17144 -8615 -3449 -10124 -11807 -12472
11602a2472L144J538j0132k649O907Q367k504k832L732N670j007M837J52k524
$$ -12472 -9328 -7790 -17922 -20571 -13664 -5297 -7801 -10633 -6901 -1231 -2238 2599 2751 227
11588B27m778p443M247O33k131O7j087j978M664K849L518O529k404l215J171r181
$$ 227 -4551 -11994 -7747 -7114 -9245 -9178 -10265 -12243 -7579 -4730 -1212 5317 2913 -302 869 -8312
11572h312k339L109m68N179O356n866R62k508k027k227o83M461M089l600O190
$$ -8312 -10651 -7542 -8010 -2831 3525 -2341 -1379 -3887 -5914 -8141 -8824 -4363 -274 -3874 2316
11557B316q227j253Q075K957j0977r886k446J3099n259j793o927r44M506O06J0313
$$ 2316 -5911 -7164 911 3868 -7109 -16995 -19441 -6342 -11601 -13394 -20321 -21265 -16759 -16153 -5840
11542e840R228J005m556l920N120O96J856o694R09L375j07O409q473m275J2159
$$ -5840 3388 4393 -163 -4083 1037 1733 3589 -3105 -2196 1179 1072 7481 -992 -5267 6892
11527F892O93p180k148j638m918o910P259L910p91p043j629M202k410J172J1326
$$ 6892 7585 405 -1743 -3381 -8299 -15209 -7950 -4040 -4831 -11874 -13503 -9301 -11711 -10539 787
11512G87l442l358l08M332o411l08N728L193L375L141q67k81n865p447L847P699
$$ 787 -2655 -6013 -6321 -1989 -8400 -8708 -2980 213 3588 6729 5862 5581 -284 -7731 -3884 3815
11496C815j1815n716J838r77M577J2572j643K610N618j858o707n214L33j0859
$$ 3815 -8000 -13716 -11878 -12855 -8278 4294 2651 5261 10879 9021 2314 -2900 -2567 -13426
11482a3426k391N172O860M324k106Q250R390p266j5648j446R966Q60J21K589k57
$$ -13426 -15817 -10645 -3785 539 -1567 6683 16073 8807 -6841 -8287 1679 2539 2660 5249 4992
11467D992j611R78m121k157j680k604n997r241L592N538M335O310m616j051L902
$$ 4992 3381 4359 238 -1919 -3599 -6203 -12200 -21441 -17849 -12311 -7976 -1666 -6282 -7333 -3431
11452c431K89J679K437p15j487p697K426k898n341Q347O175K132m477o816N988
$$ -3431 -3142 -1463 974 259 -1228 -8925 -6499 -9397 -14738 -6391 -216 1916 -2561 -9377 -3389
11437c389K568k992j438O152M480o840r971j41l111M79m143k981M089R967L589
$$ -3389 -821 -3813 -5251 901 5381 -1459 -11430 -11571 -14682 -14203 -18346 -21327 -17238 -7271 -3682
11422c682L364o329n555M923O180P488J061M34p228l46K152o105j1888o596J6129
$$ -3682 -318 -6647 -12202 -7279 -1099 6389 7450 7884 656 310 2462 -3643 -15531 -22127 -5998
11407e998J2805j289M62l472k81j83j069q117o251J443L884j594M835M213n752
$$ -5998 6807 5518 5980 2508 2227 2044 975 -7142 -13393 -11950 -8066 -9660 -4825 -612 -6364
11392f364R291L091l698m012m197m550j11l071k73P640k359m841o832l680P555
$$ -6364 2927 6018 2320 -1692 -5889 -10439 -10550 -13621 -13894 -6254 -8613 -13454 -20286 -23966 -16411
11377a6411J3062N159p416j0427P788M078q758K059K723l280L82J751m00O457
$$ -16411 -3349 1810 -5606 -16033 -8245 -4167 -12925 -10866 -8143 -11423 -11041 -9290 -9690 -3233
11363c233m444k284k153O35L828J386p803R600O822l964n011Q184P136L5o512
$$ -3233 -7677 -9961 -12114 -11479 -7651 -6265 -14068 -4468 2354 -1610 -6621 1563 8699 8734 2222
11348B222m408l390l857j354m355l466j014J153K038k523M842Q934N789p236r405
$$ 2222 -2186 -5576 -9433 -10787 -15142 -18608 -19622 -18469 -16431 -18954 -14112 -5178 611 -6625 -16030
11333a6030l133j067n99O732Q125k972P471J3146K570K515J757j1422r483j770
$$ -16030 -19163 -20230 -20829 -14097 -5972 -8944 -1473 11673 14243 16758 18515 7093 -2390 -4160
11319d160R4m322P197N342N21k254n967p968m898l908m35J0171Q401M979k698
$$ -4160 -4066 -8388 -1191 4151 4672 2418 -3549 -11517 -16415 -20323 -20758 -10587 -2186 2793 95
11304I5o569O41J254N255q27m037M633j343j321k088r961o348j362J526N252N31
$$ 95 -6474 -5833 -4579 676 -151 -4188 445 -898 -2219 -4307 -14268 -20616 -21978 -20452 -15200 -14669
11288a4669r90n49R320Q447J9004J712p154j6538m112K883o223m410J669m159
$$ -14669 -15659 -16208 -6888 1559 20563 22275 15121 -1417 -5529 -2646 -8869 -13279 -11610 -15769
11274a5769L89L484K073N053J279l668l203J290Q84J014J1463J0913j2611o590
$$ -15769 -15380 -11896 -9823 -4770 -3491 -7159 -10362 -9072 -8188 -7174 4289 15202 2591 -3999
11260c999m568l255J194m44l037k99N775Q649L189j086q163j238m526K648N411
$$ -3999 -8567 -11822 -10628 -11072 -14109 -14408 -8633 16 3205 2119 -6044 -7282 -11808 -9160 -3749
11245c749P049M079l433l977j789n219m930O154k243o292L045n055P25M991N075
$$ -3749 3300 7379 3946 -31 -1820 -7039 -11969 -5815 -8058 -14350 -11305 -16360 -15635 -10644 -5569
11230e569N442M140l178r581o387J4004J4183p302n925k293m111L561Q320o86
$$ -5569 -127 4013 835 -8746 -15133 -1129 13054 5752 -173 -2466 -6577 -3016 5304 4618
11216D618j559L06M696O523j405k746m18j3925l42m768M088J2623r15o047R36
$$ 4618 3059 3365 8061 14584 13179 10433 10015 -3910 -4252 -9020 -4932 7691 6776 729 1665
11201A665M777P262o422k123O142o400L1l738q142p087K900P494L641k790k816
$$ 1665 6442 13704 7282 5159 11301 4901 4932 1194 -6948 -14035 -11135 -3641 0 -2790 -5606
11186e606M07J0418K791j2529m61R23j061q986J271L158k214l9n266m875P894
$$ -5606 -5199 5219 8010 -4519 -4980 -4057 -5118 -14104 -12833 -9675 -11889 -11928 -17194 -22069 -14175
11171a4175Q669J81j802p11K634J0399o395j0241M169J1282j908o487M159M158
$$ -14175 -5506 -5325 -7127 -7838 -5204 5195 -1200 -11441 -7272 4010 2102 -4385 -226 3932
11157C932j8k936l556k830k921O04j905K763M01K1o755N687R09m882J43J1328
$$ 3932 3914 978 -2578 -5408 -8329 -7725 -9630 -6867 -6466 -6445 -13200 -7513 -6604 -11486 -11343 -15
11141a5J2786m849o500L9K061k892k830N584k126n255L451K243p59n286q720P414
$$ -15 12771 7922 1422 1461 3522 630 -2200 3384 1258 -3997 -546 1697 938 -4348 -13068 -5654
11125e654K225l10P438N39q314n122l853R031L634m440j551n113o354j0116J667
$$ -5654 -3429 -3739 3699 4238 -4076 -9198 -13051 -4020 -386 -4826 -6377 -11490 -17844 -27960 -26293
11110b6293L521Q996P043n26k906Q005M39K637J135o924l202J611r973j0727K628
$$ -26293 -22772 -13776 -6733 -7259 -10165 -2160 -1721 916 2051 -4873 -8075 -6464 -16437 -27164 -24536
11095b4536Q506m7M991R466P752q712L386l716n55m343m599R541l299l621O369
$$ -24536 -16030 -16077 -11086 -1620 6132 -2580 806 -2910 -3465 -7808 -12407 -2866 -6165 -9786 -3417
11080c417o411k977L707O037O349q933J479L099k843J2984O330p663l203K011
$$ -3417 -9828 -12805 -9098 -3061 3288 -5645 -4166 -1067 -3910 9074 15404 7741 4538 6549
11066F549R15k953o168r016j073M253m858J091J954j044k519j032n00K390O773
$$ 6549 7464 4511 -1657 -10673 -11746 -7493 -12351 -11260 -9306 -10350 -12869 -13901 -14401 -12011 -5238
11051e238K572J351k029M717m729n748N047O229K984l365p551l060J856q271n720
$$ -5238 -2666 -1315 -3344 1373 -3356 -9104 -4057 2172 5156 1791 -5760 -8820 -6964 -15235 -20955
11036b0955n156K458O945O729P188O755M904m605j600R949L027r925q073m444
$$ -20955 -26111 -23653 -16708 -9979 -2791 3964 8868 4263 2663 12612 15639 5714 -2359 -6803
11022f803p219p416j135q86Q361J1227N978L599k263l722l518k944O226K21N914
$$ -6803 -14022 -21438 -22573 -23459 -15098 -3871 2107 5706 3443 -279 -3797 -6741 -515 -294 5620
11007E620n072o603J329p686q32R678J909L720L612K495j2093j84L306j874m132
$$ 5620 548 -6055 -4726 -12412 -13244 -3566 -1657 2063 5675 8170 -3923 -4107 -801 -2675 -6807
10992f807l544L66J883L674m089p104o579J1552M266l291q751j140M283Q699M274
$$ -6807 -10351 -9985 -8102 -4428 -8517 -15621 -22200 -10648 -6382 -9673 -18424 -19564 -15281 -6582 -2308
10977b308N446K473j2129m899n135j938L006N021O527J471P53m269J927L455q841
$$ -2308 3138 5611 -6518 -11417 -16552 -18490 -15484 -10463 -3936 -2465 -1712 -5981 -4054 -599 -9440
10962i440J825N919N017k454J247q453o004j0256l51N461M351N954Q48k098O600
$$ -9440 -7615 -1696 3321 867 2114 -6339 -12343 -22599 -22950 -17489 -13138 -7184 -6336 -8434 -1834
10947a834L520j037j418p942m478J75Q30K799N139Q793L92o768m341m233k658
$$ -1834 1686 649 -769 -8711 -13189 -13014 -12184 -9385 -4246 4547 4939 -1829 -6170 -10403 -13061
10932a3061M431k171j924J2529P261k474k770m215n398j1773K220J1852K461j942
$$ -13061 -8630 -10801 -12725 -196 7065 4591 1821 -2394 -7792 -19565 -17345 -5493 -3032 -4974
10918d974l920l258K314Q26Q82N36J0831L535j732q185p40m286j920q83j356M695
$$ -4974 -8894 -12152 -9838 -9012 -8130 -7594 3237 6772 5040 -3145 -3885 -8171 -10091 -10974 -12330 -7635
10902g635K042o08L638j952M613Q049j369m150k76q35r669n363k081L23M671M462
$$ -7635 -5593 -6201 -2563 -4515 98 8147 6778 2628 2352 1517 -8152 -13515 -15596 -15273 -10602 -6140
10886f140J72J87N162N23j3897q482N433O336k51j816J475J83o541k434Q348N999
$$ -6140 -5968 -5781 -619 -96 -13993 -22475 -17042 -10706 -10957 -12773 -11298 -11115 -17656 -20090 -11742 -5743
10870e743l120o197L332N308O325k778j327K579P225p367n832l492K811m533p14
$$ -5743 -8863 -15060 -11728 -6420 -95 -2873 -4200 -1621 5604 -1763 -7595 -11087 -8276 -12809 -13523
10855a3523M074m564j934L461K889L188O083K743m248K36O559J1467R821p411
$$ -13523 -9449 -14013 -15947 -12486 -9597 -6409 -326 2417 -1831 -1595 4964 16431 26252 18841
10841A8841j6946k292p406P659M64m075O664K401J544J780k200m799L246o663
$$ 18841 1895 -397 -7803 -144 320 -3755 2909 5310 6854 8634 6434 1635 4881 -1782
10827a782l866K896n754N7K753m227N756n523N181O323n575m386m740r40L599
$$ -1782 -5648 -2752 -8506 -8449 -5696 -9923 -4167 -9690 -4509 1814 -3761 -8147 -12887 -13827 -10228
10812a0228L494K991J241K979k45p871j1567J626n222L249Q774N30k04P035k469
$$ -10228 -6734 -3743 -2502 477 232 -7639 -19206 -17580 -22802 -19553 -10779 -10249 -10453 -3418 -5887
10797e887l7o100o172q75N264J761O116j640o068J251Q229L268K603J5234J333
$$ -5887 -5924 -12024 -18196 -19071 -13807 -12046 -5930 -7570 -13638 -12387 -4158 -890 1713 16947 18280
10782A8280L52l725r583o170n648P425J244j0358M341j355R08j787K913O550n091
$$ 18280 18632 14907 5324 -846 -6494 931 2175 -8183 -3842 -5197 -4289 -6076 -3163 3387 -1704
10767a704n023j735m298R052O711J506J039n386r598Q371J4010K195m070O961
$$ -1704 -6727 -8462 -12760 -3708 3003 4509 5548 162 -9436 -1065 12945 15140 11070 18031
10753A8031m160r922K312K242J090n769j1069p92M467L710O97L371m354n824M665
$$ 18031 13871 3949 6261 8503 9593 3824 -7245 -8037 -3570 140 837 4208 -146 -5970 -1305
10738a305j711l165k684R181p5l021N544l501l651J522m67m464j161L085M2p28
$$ -1305 -3016 -6181 -8865 316 241 -2780 2764 -737 -4388 -2866 -3333 -7797 -8958 -5873 -5831 -6559
10722f559K194J0424q781j709K671P19N684K248L426j789N108r09m71P129J3014
$$ -6559 -4365 6059 -2722 -4431 -1760 -1041 4643 6891 10317 8528 13636 12727 12256 19385 32399
10707C2399j372P79J1625J0548L2885M2405L9093L6788K2447n946l0230m5127
$$ 32399 31027 31806 43431 53979 86864 129269 168362 205150 227597 221651 191421 146294
10695A46294m4797m0628k3611p965o513K048K462r5J768R2r20K222n585K244J28
$$ 146294 101497 60869 37258 29293 22780 24828 27290 27195 28963 29055 28135 30357 24772 27016 27144
10680B7144L00Q36q334k824K000p4J154k843J2024J767p284j3586j982l954m768
$$ 27144 27444 28280 19946 17122 19122 19048 20202 17359 29383 31150 23866 10280 8298 4344 -424
10665d24o715N801M543k700j199j671n119J565O606j190j5351j398K652O613J0074
$$ -424 -7139 -1338 3205 505 -694 -2365 -7484 -5919 687 -503 -15854 -17252 -14600 -7987 2087
10650B087N22R6m323r787l028J599O848K634J064J883m804l899j706J616j2614
$$ 2087 2609 2705 -1618 -11405 -14433 -12834 -5986 -3352 -2288 -405 -5209 -9108 -10814 -9198 -21812
10635b1812N769J8799J606K833j062j1887k636K800P49L348K648o121N199Q209
$$ -21812 -16043 2756 4362 7195 6133 -5754 -8390 -5590 -4841 -1493 1155 -4966 233 8442
10621H442j663k029m554n60p2J789K024j0986P21J636o114m357N198J1326K512
$$ 8442 6779 4750 196 -364 -436 1353 3377 -7609 -6888 -5252 -11366 -15723 -10525 801 3313
10606C313o375J476M505Q492R45l842m227K177q604m211P433N926L655l387J453
$$ 3313 -3062 -1586 2919 11411 12356 8514 4287 6464 -2140 -6351 1082 7008 10663 7276 8729
10591H729m476p815P69O48l736k511O148q72p265J0860J2683L328J0012n179j3710
$$ 8729 4253 -3562 -2793 -2145 -5881 -8392 -2244 -3116 -10381 479 13162 16490 26502 21323 7613
10576G613M63o428m561M403K310m885N131P106j0833j390q09p517N482J2924R6
$$ 7613 8076 1648 -2913 1490 3800 -1085 4046 11152 319 -1071 -1880 -9397 -3915 9009 9105
10561I105q876j06j2956q192K181M029J1818m626l474j39m450J643N663j223P951
$$ 9105 229 123 -12833 -21025 -18844 -14815 -2997 -7623 -11097 -11236 -15686 -14043 -8380 -9603 -1652
10546a652j360j79Q077J753j2712p866K299L850K736Q499Q263q463j1673r0L815
$$ -1652 -3012 -3191 4886 6639 -6073 -13939 -11640 -7790 -5054 3445 11708 3245 -8428 -8518 -4703
10531d703p632j975J0631L491k110j1666o910N449J0114J377k940L055J2295N116
$$ -4703 -12335 -14310 -3679 -188 -2298 -13964 -20874 -15425 -5311 -3934 -6874 -3819 8476 13592
10517A3592j273J476O105l851m46J151l644k352k061M056M64J386o724n176J889
$$ 13592 12319 13795 19900 16049 15603 16754 13110 10758 8697 12753 13217 14603 7879 2703 4592
10502D592k032J647k556l725N155J015K081K194J844l999j7514P05J3379J1544
$$ 4592 2560 4207 1651 -2074 3081 4096 6177 8371 10215 6216 -11298 -10593 2786 14330
10488A4330Q004N652l879l870M351m69o79r971m635O109N78m630J47Q88n80m614
$$ 14330 22334 27986 24107 20237 24588 24119 23440 13469 8834 14943 15521 10891 11038 11926 11346 6732
10472F732O148Q520J344l055M4k371l086J3984N657O427O116k367M626P621Q071
$$ 6732 12880 21400 22744 19689 19733 17362 14276 28260 33917 40344 46460 44093 48719 56340 64411
10457F4411L38P35J3854R151J5140K2703L9213N3601N7542P7304J02197J23961
$$ 64411 64749 65484 79338 88489 103629 126332 165545 219146 276688 353992 456189 580150
10445E80150J29800J32514J39666J19513R3369O4024J8966k1143q1517j00341
$$ 580150 709950 842464 982130 1101643 1195012 1259036 1278002 1256859 1175342 1075001
10435A075001j18776j29182j34212j16874j07402q8698o6396n1501l8892k2716
$$ 1075001 956225 827043 692831 575957 468555 379857 313461 261960 223068 200352
10425B00352j6825j425k830o233j0766p650p528o468r112p307l537k992r463j0112
$$ 200352 183527 182102 179272 173039 162273 154623 147095 140627 131515 124208 120671 117679 108216 98104
10411I8104j1936k083o371j2117R34m667n63p348J525j00J000m202o004l093n693
$$ 98104 86168 84085 77714 65597 66531 61864 61301 53953 55478 55378 56378 52176 46172 43079 37386
10396C7386j2086K674K983r477q721r465p843J552J3610N244j165o196J0751P606
$$ 37386 25300 27974 30957 21480 12759 3294 -4549 -2997 10613 15857 14692 8496 19247 26853
10382B6853q881n545J066n056J0594j0489q610l080O616k332j1988N968R648n266
$$ 26853 17972 12427 13493 8437 19031 8542 -68 -3148 3468 1136 -10852 -4884 4764 -502
10368e02r95J1202P693m138M748N869M505r9J038J58o475o035j113o271l333M633
$$ -502 -1497 9705 17398 13260 18008 23877 28382 28283 29321 29479 23004 16969 15856 9585 6252 10885
10352A0885L735Q048o93r734p306N282L191L663k875k723n26q571j2570n262O659
$$ 10885 14620 22668 21975 12241 4935 10217 13408 17071 14196 11473 10947 2376 -10194 -15456 -8797
10337h797J0197n287o526k453L275L694J459o40J626r270m423n22J8923R099k828
$$ -8797 1400 -3887 -10413 -12866 -9591 -5897 -4438 -5078 -3452 -12722 -17145 -17667 1256 10355 7527
10322G527l659P517M053n019l196n33R411M099m054J2215k976r600l89k054m294
$$ 7527 3868 11385 15438 10419 7223 6690 16101 20200 16146 28361 25385 15785 15396 13342 9048
10307I048p155k114R53p409K500J1569M083K97m567q333O729k265j30R134L451
$$ 9048 1893 -221 732 -6677 -4177 7392 11475 11772 7205 -1128 5601 3336 3206 12340 15791
10292A5791N01J288R827l103j4695o484K613j1604k896K466l208K613k96P213
$$ 15791 16292 17580 27407 24304 9609 3125 5738 -5866 -8762 -6296 -9504 -6891 -7187 26
10278B6Q964M877q540P16N45l859K357K56j626n358r306P340J433o179L14l091
$$ 26 8990 13867 5327 6043 6588 2729 5086 5342 3716 -1642 -10948 -3608 -2175 -8354 -8040 -11131
10262a1131j952N981j503l923o648Q765N507j410J99J774N236l567l735k944q45
$$ -11131 -13083 -7102 -8605 -12528 -19176 -10411 -4904 -6314 -6115 -4341 895 -2672 -6407 -9351 -10196
10247a0196L364n888J0331L024l813K984Q547m327j4547J209R227k477K522O030
$$ -10196 -6832 -12720 -2389 635 -3178 -194 8353 4026 -10521 -9312 -85 -2562 -40 5990
10233E990j267l797l755O687M238m8j665o504J828N767k564k826p059N644Q850
$$ 5990 4723 926 -2829 3858 8096 8048 6383 -121 1707 7474 4910 2084 -4975 669 9519
10218I519j504O315J018q703m122m569L096k726k198o577J0L673L042M107l727
$$ 9519 8015 14330 15348 6645 2523 -2046 1050 -1676 -3874 -10451 -10441 -6768 -3726 381 -3346
10203c346q11Q104J376n335o508m351N764M83Q116R264j934j940o678k926R106
$$ -3346 -4157 3947 5323 -12 -6520 -10871 -5107 -4624 3492 12756 10822 8882 2204 -722 8384
10188H384k59n866n003M880L315J1100K396n686o712k941q62k202J659j1341k978
$$ 8384 8125 2259 -2744 2136 5451 16551 18947 13261 6549 3608 2746 544 2203 -9138 -12116
10173a2116R72R637M936Q28j462K924k836k021l198r854m479L787R036M827j99
$$ -12116 -11144 -1507 3429 4257 2795 5719 2883 862 -2336 -12190 -16669 -12882 -3846 981 782
10158G82N62J179k20J008Q62O055R61n863o554Q221O024j626p523J569m923p068
$$ 782 1344 2523 2303 3311 4173 10228 11189 5326 -1228 6993 13017 11391 3868 5437 514 -6554
10142f554R745O188R09o137m633R436K549k082l732J304n035l828j630K566J0157
$$ -6554 3191 9379 10288 4151 -482 8954 11503 9421 5689 6993 1958 -1870 -3500 -934 9223
10127I223K753l480q336l445k501k722M141K82j627m40l612M443m374k301M17
$$ 9223 11976 8496 160 -3285 -5786 -8508 -4367 -4085 -5712 -6152 -9764 -5321 -9695 -11996 -11579
10112a1579K576M037O184k634l757n996K779N177R955P084k864m757k946m813
$$ -11579 -9003 -4966 1218 -1416 -5173 -11169 -8390 -3213 6742 13826 10962 6205 3259 -1554
10098a554n371m607o8k758J320M119k03P977O602r730n706Q061Q435L233J966
$$ -1554 -6925 -11532 -11600 -14358 -13038 -8919 -9122 -1145 5457 -4273 -9979 -1918 6517 9750 11716
10083A1716m092M803m926p723P887M557j1760L9q63p937Q00j970P917L701p739
$$ 11716 7624 12427 7501 -222 7665 12222 462 501 -362 -8299 -7499 -9469 -1552 2149 -5590
10068e590K135j821K786K575R11P730N461m031k645n163K090K62N65k081o13P723
$$ -5590 -3455 -5276 -2490 85 996 8726 14187 10156 7511 2348 4438 4700 5265 3184 2571 10294
10052A0294K461J856m330n037l473M578M73k587J956K861J1237j99j52m718o53
$$ 10294 12755 14611 10281 5244 1771 6349 6822 4235 6191 9052 20289 20090 19938 15220 14567
10037A4567J2091m177r590J694J0656K836m640j5319q126n456K281n476J352L301
$$ 14567 26658 22481 12891 14585 25241 28077 23437 8118 -8 -5464 -3183 -8659 -7307 -4006
10023d006J079Q630N657m425j3138K133L220m287n993O85K250Q195K967k392l679
$$ -4006 -2927 5703 11360 6935 -6203 -4070 -850 -5137 -11130 -10445 -8195 0 2967 575 -3104
10008c104j3061R78N339M110Q785q02k527n88J0579K950J963j099l471o888l595
$$ -3104 -16165 -15187 -9848 -5738 3047 2245 -282 -870 9709 12659 14622 13523 10052 3164 -431
9993d31N78J551j33K110K450m685o323k438l970J744K38o486O588O408j2263L354
$$ -431 147 1698 1565 3675 6125 1440 -4883 -7321 -11291 -9547 -9309 -15795 -9207 -2799 -15062 -11708
9977a1708P253J0980R61O613L682m726m810q589p503J198k929J5169N906j228
$$ -11708 -4455 6525 7486 14099 17781 13055 8245 -344 -7847 -6649 -9578 5591 11497 10269
9963A0269q2m731l086L949J201q271j0197k457K919J8470K948o251n722J677L683
$$ 10269 10187 5456 2370 6319 7520 -751 -10948 -13405 -10486 7984 10932 4681 -1041 636 4319
9948D319M31k894k794j0967n77J4654L06o128l921L151J903J925m513p163R26
$$ 4319 4750 1856 -938 -11905 -12482 2172 2478 -3650 -7571 -4420 -2517 -592 -5105 -12268 -11342
9933a1342J850J6229P242j4648k147Q240p489j0631n156L455J5064Q276K103K096
$$ -11342 -9492 6737 13979 -669 -2816 5424 -2065 -12696 -17852 -14397 667 8943 11046 13142
9919A3142r580J102j142p249J0525n870k855P553M538L23j2928m739O59Q806p788
$$ 13142 3562 4664 3522 -3727 6798 928 -1927 5626 10164 10487 -2441 -7180 -6521 2285 -5503
9904e503k817O430J0597K888l918j5070J236O749j177l409M885n380m453J0181
$$ -5503 -8320 -1890 8707 11595 7677 -7393 -6157 592 -585 -3994 891 -4489 -8942 1239
9890A239q56l871l511K562N494O875P64N71k173p68L100J544m890o038J519m089
$$ 1239 383 -3488 -6999 -4437 1057 7932 8696 9267 7094 6326 9426 10970 6080 42 1561 -2528
9874b528m70N424j023K428R621K808o116o549l119M682K444N362J54o443M302
$$ -2528 -2998 2426 1403 3831 13452 16260 10144 3595 476 5158 7602 12964 13118 6675 10977
9859A0977m947L419L406o41k409j961L36j976n180n453n63l724R410J2449j0646
$$ 10977 6030 9449 12855 12214 9805 7844 8180 6204 1024 -4429 -4992 -8716 694 13143 2497
9844B497q306Q205r15N78L662p423o08O475J0457k109J959o078R7J79K520J300
$$ 2497 -5809 2396 1481 2059 5721 -1702 -2310 4165 14622 12513 14472 8394 8491 8670 11190 12490
9828A2490r970o052Q23O79K806J1487K218q803p272j132l596p117m675J3199O090
$$ 12490 2520 -3532 -2709 -2030 776 12263 14481 5678 -1594 -2726 -6322 -13439 -18114 -4915 1175
9813A175L453Q031M593K207j3304j0683M792l246j044L018N946N08P028q67p535
$$ 1175 4628 12659 17252 19459 6155 -4528 264 -2982 -4026 -1008 4938 5446 12474 11607 4072
9798D072J480n807n435q497O32J2257M358M522L175o028q065n557k114j998K70
$$ 4072 5552 -255 -5690 -14187 -13555 -1298 3060 7582 10757 4729 -3336 -8893 -11007 -13005 -12735
9783a2735l114N450L690n704j2N97R248k907q92M394K216J377l6P95K938K963
$$ -12735 -15849 -10399 -6709 -12413 -12425 -11828 -2580 -5487 -6379 -1985 231 1608 1572 2367 5305 8268
9767H268Q44K603k263n976k947O816J037j3652n891R379J623q126O255j11k294
$$ 8268 9112 11715 9452 3476 529 7345 8382 -5270 -11161 -1782 -159 -8285 -2030 -2141 -4435
9752d435L565KL752J2563K695K013j176l220l90l549m295k352O404l809q851L201
$$ -4435 -870 -868 2884 15447 18142 20155 18979 15759 15369 11820 7525 5173 11577 7768 -1083 2118
9736B118K381n457q21J1654N938j0409j499l775K316P04L170L132M421m987p828
$$ 2118 4499 -958 -1779 9875 15813 5404 3905 130 2446 3150 6320 9452 13873 8886 1058
9721A058q834p40J69L336J149l420R03J275O106N758j147o880J0645k25o354m198
$$ 1058 -7776 -8516 -8347 -5011 -3862 -7282 -6379 -5104 1002 6760 5613 -1267 9378 9153 2799 -1399
9705a399j6234N690J2423Q40q62l581n876R623P347J2077L888r205k812L176o04
$$ -1399 -17633 -11943 480 1320 458 -3123 -8999 624 7971 20048 23936 14731 11919 15095 14491
9690A4491k062q425j3029Q000K482n015l289k81J3759L135p930K16N803l952O455
$$ 14491 12429 4004 -9025 -1025 1457 -3558 -6847 -7128 6631 9766 1836 2052 7855 3903 10358
9675A0358l011m537K411P53M511M643P840q808p867m60r29l98Q37l513m409j1881
$$ 10358 7347 2810 5221 5974 10485 15128 22968 14160 6293 5833 4904 4506 5343 1830 -2579 -14460
9659a4460k183J0386L912M917m391j1180L773J2152j123k357K859o15O814M741
$$ -14460 -16643 -6257 -2345 2572 -1819 -12999 -9226 2926 1803 -554 2305 1690 8504 13245
9645A3245r615p161M396Q84N861l542j31M126p939L423P558K758q052j303N523
$$ 13245 3630 -3531 865 1749 7610 4068 3937 8063 124 3547 11105 13863 5811 4508 10031
9630A0031l449m469J248k184J03N929N157K594p118q23m694j411J301N11M133
$$ 10031 6582 2113 3361 1177 1280 7209 12366 14960 7842 7019 2325 914 2215 2726 6859
9615F859K588k924J603j847N144o982l948K305J0654k750k754J845j791l354N213
$$ 6859 9447 6523 8126 6279 11423 4441 493 2798 13452 10702 7948 9793 8002 4648 9861
9600I861L391p751o1L638l264q768k912O970M393O228p800j745l192J3981N659
$$ 9861 13252 5501 5440 9078 5814 -2954 -5866 1104 5497 11725 3925 2180 -1012 12969 18628
9585A8628o548j1643K593M459%k482j371r001K168l540J1682L874l434j1095o436
$$ 18628 12080 437 3030 7489 7489 5007 3636 -5365 -3197 -6737 4945 8819 5385 -5710 -12146
9570a2146J823N811J0131j067N15o144L134M206J295n201r115M638O880P400K048
$$ -12146 -10323 -4512 5619 4552 5067 -1077 2057 6263 7558 2357 -6758 -2120 4760 12160 14208
9555A4208q537r38K716p335l757Q958q869n283Q890M353J830O432J793p78l518
$$ 14208 5671 4733 7449 114 -3643 5315 -3554 -8837 53 4406 6236 12668 14461 13683 10165
9540A0165k549k746M023n353M695n664L247j741p64O188k870o857J093l74n512
$$ 10165 7616 4870 8893 3540 8235 2571 5818 4077 3313 9501 6631 -226 867 493 -5019
9525e019j0264K005J0961K665m507m120O5l227j607J0899J2131l201r19l107j394
$$ -5019 -15283 -13278 -2317 348 -4159 -8279 -8214 -11441 -13048 -2149 9982 6781 5862 2755 1361
9510A361p751J2814P734k950n566M832P506k566K626n516J595J939M576j318L689
$$ 1361 -6390 6424 14158 11208 5642 10474 17980 15414 18040 12524 14119 16058 20634 19316 23005
9495B3005j1789j3956P869R505N920j604P67P764k223q105j289j488l425m791
$$ 23005 11216 -2740 5129 14634 20554 18950 19717 27481 25258 17153 15864 14376 10951 6160
9481F160m513N962M569K230j015M229j99m519L005K435m596k862O577J319O762
$$ 6160 1647 7609 12178 14408 13393 17622 17423 12904 15909 18344 13748 10886 17463 18782 25544
9466B5544m222o927K525J1994J877r29o994j1919L325P846R380m076N348N258
$$ 25544 21322 14395 16920 28914 30791 29862 22868 10949 14274 22120 31500 27424 32772 38030
9452C8030l751l336m673J418n325n462l113k697K001J963k647m852j899j604l589
$$ 38030 34279 30943 26270 27688 22363 16901 13788 11091 13092 15055 12408 7556 5657 4053 464
9437D64M405J0674Q011M316m51L222K112l339l455l180k265o226l122o801Q139
$$ 464 4869 15543 23554 27870 27419 30641 32753 29414 25959 22779 20514 14288 11166 4365 12504
9422A2504M101L567J368P713k229o639l066J170K366r69j627j101P158n736j911
$$ 12504 16605 20172 21540 29253 27024 20385 17319 18489 20855 19886 18259 17158 24316 18580 16669
9407A6669l641q052q275J1941Q973L383n987o471J043O930M21Q713L492O049j308
$$ 16669 13028 4976 -3299 8642 17615 20998 15011 8540 9583 16513 16934 25647 29139 35188 33880
9392C3880p081l914K687o578l328R031L35n521k452J4535j093o394k934o030J86
$$ 33880 26799 22885 25572 18994 15666 24697 25032 19511 17059 31594 30501 24107 21173 15143 15329
9377A5329J918L34K069M442N565l477o311L806M664j137Q51m64J645o99j80p230
$$ 15329 17247 17581 19650 24092 29657 26180 19869 23675 28339 27202 28053 27589 29234 28535 28355 21125
9361B1125lL834J0084J3725o428m650o026k555l616Q256O89N880J219j636l224
$$ 21125 21122 24956 35040 48765 42337 37687 31661 29106 25490 33746 34435 40315 41534 39898 36674
9346C6674p46R726J0032l680J076O184n632J269J057q245O79J0383J0834L246
$$ 36674 35928 45654 55686 52006 53082 59266 53634 54903 55960 47715 48394 58777 69611 72857
9332G2857Q686J1417M01n326o284k149j231n718j937N147J170R91k000j469N092
$$ 72857 81543 92960 93361 88035 81751 79602 78371 72653 70716 75863 77033 78024 76024 74555 79647
9317G9647j258K306m796l282N367O880j0756j1730j244M508O901N259k204L830
$$ 79647 78389 80695 75899 72617 77984 84864 74108 62378 61134 65642 72543 77802 75598 79428
9303G9428J188N688P127K656j331m290n690K045q45K293J4993O368l464J18R136
$$ 79428 80616 86304 93431 96087 94756 90466 84776 86821 85976 88269 103262 109630 106166 106284 115420
9288A15420M34M720K20P112M0J139j163n07k227K718Q31R03O928M595P847J289
$$ 115420 115854 120574 120794 127906 127946 129085 127922 127415 125188 127906 128737 129640 136568 141163 149010 150299
9272A50299K579K513K501K290M904k940J34R167J0096N381j83O506Q915K663O703
$$ 150299 152878 155391 157892 160182 165086 162146 162280 171447 181543 186924 186741 193247 202162 204825 211528
9257B11528N825J0812R87M062P891J7110P154J267M553J4343J5109J7109J2574
$$ 211528 217353 228165 229152 233214 241105 258215 265369 266636 271189 285532 300641 317750 330324
9244C30324J0830J9339J7670J7616J2644R258R065J2760J6988K4627J6588J8236
$$ 330324 341154 360493 378163 395779 408423 417681 426746 439506 456494 481121 497709 515945
9232E15945K5263K1333J8521L0184M4467M3816M5342M7851N0792P3178R0017R2288
$$ 515945 541208 562541 581062 611246 655713 699529 744871 792722 843514 916692 1006709 1098997
9220A098997R3001J14833J27528J54742J83555K02798K33268K83170L46851M21367
$$ 1098997 1191998 1306831 1434359 1589101 1772656 1975454 2208722 2491892 2838743 3260110
9210C260110N06249O07046P64094R44603J152551J395212J670495J941731K130125
$$ 3260110 3766359 4373405 5137499 6082102 7234653 8629865 10300360 12242091 14372216
9201A4372216K158069J947059J414779N51322m75452j402789j998556k185560
$$ 14372216 16530285 18477344 19892123 20443445 19967993 18565204 16566648 14381088
9193A4381088k085196j821672j507635j201548r66265p84590o35839n09961m26353
$$ 14381088 12295892 10474220 8966585 7765037 6798772 6014182 5378343 4868382 4442029
9184D442029l57711k95898k52824k06076j78918j51195j26918j11738j04384j11619
$$ 4442029 4084318 3788420 3535596 3329520 3150602 2999407 2872489 2760751 2656367 2544748
9174B544748j10242j08002j19103j31352j14417j15342j17569j13974r9852p9096
$$ 2544748 2434506 2326504 2207401 2076049 1961632 1846290 1728721 1614747 1514895 1435799
9164A435799p2430q0625q6692p6657o3097o0695n6967m7195m5118m6408m6092
$$ 1435799 1363369 1282744 1196052 1119395 1056298 995603 938636 891441 846323 799915 753823
9153G53823l7904l5375l7065l1715k3480k6858k3481k2675k9979l4780k0735j9602
$$ 753823 715919 680544 643479 611764 588284 561426 537945 515270 485291 450511 429776 410174
9141D10174j6580q498m731j9597j0874j8123j5926j1210j4461j8306p614q620
$$ 410174 393594 385096 380365 360768 349894 331771 315845 304635 290174 271868 264254 255634
9129B55634j3412p889j801O69q076j7920j9852q566q584p507l228P99j3156n82
$$ 255634 242222 234333 232532 233201 225125 207205 187353 178787 170203 162696 159468 160267 147111 146529
9115A46529J004j1699j6347m537P624M531n695j849l747J223j5329l679N692j1227
$$ 146529 147533 135834 119487 114950 122574 127105 121410 119561 115814 117037 101708 98029 103721 92494
9101I2494j4973j226j095K19J41L687m598j360P357J49n252Q19k825l753j153
$$ 92494 77521 76295 75200 75419 75560 79247 74649 73289 80646 80795 75543 76362 73537 69784 68631
9086F8631j1112j297Q669l173q659r81M054P130R216k12j120M066n845q558L847
$$ 68631 57519 56222 64891 61718 53059 52078 56132 63262 72478 72266 71146 75212 69367 60809 64656
9071F4656K24p099N013J124j1463n441J071K843j665o587n637m72K456j796p884
$$ 64656 64880 57781 62794 63918 52455 47014 48085 50928 49263 42676 37039 36567 39023 37227 29343
9056B9343q668J943l723P1N590J3421L183M309o277j0113M267O966L752J159k245
$$ 29343 20675 22618 18895 18966 24556 37977 41160 45469 39192 29079 33346 40312 44064 45223 42978
9041D2978n700n014K290K394k91Q10k879m584M179K111R052O318K717o909n282
$$ 42978 37278 32264 34554 36948 36657 37467 34588 30004 34183 36294 45346 51664 54381 47472 42190
9026D2190o093M94J7809j2049r655P364j428J111M211j359J724M451l143j1469
$$ 42190 36097 36591 54400 42351 32696 40060 38632 39743 43954 42595 44319 48770 45627 34158
9012C4158m608J2350N634m521J468m016j306K476m88l931m734k62R54K718J117
$$ 34158 29550 41900 47534 43013 44481 40465 39159 41635 41147 37216 32482 32220 33174 35892 37009
8997C7009m271o490r667q237R516J9804O30k711q954l731m456M546J0916M212
$$ 37009 32738 26248 16581 8344 17860 37664 38294 35583 26629 22898 18442 22988 33904 38116
8983C8116q641j3059K325R098l376O14l590m468L686j2423m440Q665O238l69J660
$$ 38116 29475 16416 18741 27839 24463 25077 21487 17019 20705 8282 3842 12507 18745 18376 20036
8968B0036l26p534k212M82j920L942N059o34k833j009m612O31l506k626P145L646
$$ 20036 19710 12176 9964 10446 8526 12468 17527 16893 14060 13051 8439 9070 5564 2938 10083 13729
8952A3729j803K422L204o84l295j958p954r11K155J572J172k741l971J295M657
$$ 13729 11926 14348 17552 16868 13573 11615 3661 2750 4905 6477 7649 4908 937 2232 6889
8937F889L098m650k194m278Q1O021K820j530O597P614m83J760n299o216q543p72
$$ 6889 9987 5337 3143 -1135 -1054 4967 7787 6257 12854 20468 19985 21745 16446 10230 1687 915
8921I15K750M72Q7O750j951q196M340J4692N270k002J478j0651j0445q691n946
$$ 915 3665 4137 4224 10974 9023 827 5167 19859 25129 23127 24605 13954 3509 -5182 -11128
8906a1128Q647J750P862J3565L543p569p087R271k014o502l577M771n952j647
$$ -11128 -2481 -731 7131 20696 24239 16670 9583 18854 16840 10338 6761 11532 5580 3933
8892C933O137J2319m244l269r523k023J291M019O128K098q890K388M488N394K035
$$ 3933 10070 22389 18145 14876 5353 3330 4621 8640 14768 16866 7976 10364 14852 20246 22281
8877B2281j0242j1119M960L471n221J042L330K696n629M57m292P633r81k185J312
$$ 22281 12039 920 5880 9351 4130 5172 8502 11198 5569 6026 1734 9367 8386 6201 7513
8862G513K400P30K774L282K25j801P524M133K430n259J850K744J1280K817j4023
$$ 7513 9913 10643 13417 16699 16924 15123 22647 26780 29210 23951 25801 28545 39825 42642 28619
8847B8619j1282l440j1385j760M944J295K82K939q041J408J417J202o98n981l626
$$ 28619 17337 13897 2512 752 5696 6991 7273 10212 2171 3579 4996 6198 5500 -481 -4107
8832d107P181o358m192j86j91L487K853J585j428l056q318k803N426Q778P92p89
$$ -4107 3074 -3284 -7476 -7662 -7853 -4366 -1513 72 -1356 -4412 -12730 -15533 -10107 -1329 -537 -1326
8816a326N461n606p130M570J668p33L333k422N228l701k902J591l135M368P180
$$ -1326 4135 -1471 -8601 -4031 -2363 -3096 237 -2185 3043 -658 -3560 -1969 -5104 -736 6444
8801F444n736n363k441j951l368Q91J218Q958m1j799l59n215p062P422Q424k357
$$ 6444 708 -4655 -7096 -9047 -12415 -11524 -10306 -1348 -1389 -3188 -3547 -8762 -15824 -8402 22 -2335
8785b335n174l651k507N879J4571M234p579M79m49R907K299K398j231o633l581
$$ -2335 -7509 -11160 -13667 -7788 6783 11017 3438 3917 3468 13375 15674 18072 16841 10208 6627
8770F627k7k944m597m641j114J0790J469m661J119m168k732o13J1259J6508l859
$$ 6627 6600 3656 -941 -5582 -6696 4094 5563 902 2021 -2147 -4879 -5492 5767 22275 18416
8755A8416j0779K643K111k911J0140m839m165j813k410k11J2914l304J0L251L96
$$ 18416 7637 10280 12391 9480 19620 14781 10616 8803 6393 6182 19096 15792 15802 19053 19449
8740A9449q172j0235j0536N284P621l093j868j862L978O1k469K380O925k594m965
$$ 19449 11277 1042 -9494 -4210 3411 318 -1550 -3412 566 627 -1842 538 7463 4869 -96
8725i6l199j2551j695Q828R340J0625J0317K569k711o221Q224N253o315o437j0803
$$ -96 -3295 -15846 -17541 -8713 627 11252 21569 24138 21427 15206 23430 28683 22368 15931 5128
8710E128j2017J0294k966r516K95J6141J3065j648j0648q278q644l842o406O570
$$ 5128 -6889 3405 439 -9077 -8782 7359 20424 18776 8128 -150 -8794 -12636 -19042 -12472
8696a2472J7557K545l582J1330l130l629J2747m595j5362j0857M354L203O954
$$ -12472 5085 7630 4048 15378 12248 8619 21366 16771 1409 -9448 -5094 -1891 5063
8683E063K12L738m256L824l4o334k624N252N105k157O666J526l374M126L820N808
$$ 5063 5275 9013 4757 8581 8547 2213 -411 4841 9946 7789 14455 15981 12607 16733 20553 26361
8667B6361R031J092K661j781n830o16N972K743p543j0095j1392J550P706o001
$$ 26361 35392 36484 39145 37364 31534 30918 36890 39633 32090 21995 10603 12153 19859 13858
8653A3858o802k637P405j084m965M971P974k003p226n146k18n433L068Q349L011
$$ 13858 7056 4419 11824 10740 5775 10746 18720 16717 9491 4345 4127 -1306 1762 10111 13122
8638A3122N84j880q636j568Q546M722j30m178O13P858O347K449R251P221J7338
$$ 13122 13706 11826 3190 1622 10168 14890 14760 10582 11195 19053 25400 27849 37100 44321 61659
8623F1659J5140K1339J2068q295j6881j0394J086K32J481N330J3954K1150K1036
$$ 61659 76799 98138 110206 101911 85030 74636 75722 75954 77435 82765 96719 117869 138905
8610A38905L6580O1949Q7906R6005R9647O9634k858q5273j26247j04128o9405
$$ 138905 175485 237434 325340 421345 520992 590626 587768 502495 376248 272120 202715
8599B02715m5899l1371j2705l923j2853j8067j1370J975K004p799N727k781j042
$$ 202715 156816 125445 112740 108817 95964 77897 66527 68502 70506 62707 68434 65653 64611
8586F4611J819R549o89n249l21j242J2094J5777L828j155M978k487o284Q869J784
$$ 64611 66430 75979 75290 70041 69720 68478 80572 96349 100177 99022 104000 101513 95229 104098 105882
8571A05882Q01O908K1476L8910N8729Q4645J11747J46168J61812J82046J82218
$$ 105882 106683 113591 135067 173977 232706 317351 429098 575266 737078 919124 1101342
8560A101342O0192j13417k42346k37554j61114j06529p4007m4530k2616j0242
$$ 1101342 1161534 1048117 805771 568217 407103 300574 226567 182037 159421 149179
8550A49179l893r587k1090j0680R08n029l088r001j00M048p83m487N933L142J589
$$ 149179 145286 135699 114609 103929 104837 99808 96720 87719 87619 91667 90884 86397 92330 95472 97061
8535I7061m256J3220j792p350r567p333n566J259O933O481N067J6182J7676K6105
$$ 97061 92805 106025 104233 96883 87316 79983 74417 75676 82609 89090 94157 110339 128015 154120
8521A54120M0077O0072O5244Q9665R2632N5031j6355r2840j23235j01818o2944
$$ 154120 194197 254269 319513 409178 501810 556841 540486 447646 324411 222593 159649
8510A59649l2966k5423k0352L320J598l677j0924p886l840l401q967l243J179
$$ 159649 126683 101260 80908 84228 85826 82149 71225 63339 59499 56098 47131 43888 45067
8497D5067N690N249r179j0403L471O925P524o64j0711k3521n531Q950K215r87
$$ 45067 50757 56006 46827 36424 39895 46820 54344 53680 42969 19448 13917 22867 25082 24095
8483B4095Q288K833P609N583r195L523j0682k1627q933j1418O781J2711m243p80
$$ 24095 32383 35216 42825 48408 39213 42736 32054 10427 1494 -9924 -3143 9568 5325 4545
8469D545M255N229j1624j0345K272J3527R164l731j2080r447O178Q977p92K355
$$ 4545 8800 14029 2405 -7940 -5668 7859 17023 13292 1212 -8235 -2057 6920 6128 8483
8455H483j119p809K619m377m486J995J0886M361j4438p482K447J1784n855J1737
$$ 8483 7364 -445 2174 -2203 -6689 -4694 6192 10553 -3885 -11367 -8920 2864 -2991 8746
8441H746k954q91Q05P112J0458k279j2828q249K038Q837r763j0636j0823l500
$$ 8746 5792 4901 5706 12818 23276 20997 8169 -80 1958 10795 1032 -9604 -20427 -23927
8427b3927J0452K645K487N031l074N368M237P492q588j4535l166N675J177l555
$$ -23927 -13475 -10830 -8343 -3312 -6386 -1018 3219 10711 2123 -12412 -15578 -9903 -8726 -12281
8413a2281j532L486m620j2554K252M329M420M673Q905R018J521j763J0225j426
$$ -12281 -13813 -10327 -14947 -27501 -25249 -20920 -16500 -11827 -2922 6096 7617 5854 16079 14653
8399A4653j2044o851m400k924m237N129l272K93M358M893p439L815O168j791K306
$$ 14653 2609 -4242 -8642 -11566 -15803 -10674 -13946 -13653 -9295 -4402 -11841 -8026 -1858 -3649 -1343
8384a343J438o968P50N021n89K224M743l897j0088N986Q418l557m725l755O297
$$ -1343 95 -6873 -6123 -1102 -1691 533 5276 1379 -8709 -2723 5695 2138 -2587 -6342 -45
8369d5O217j1425j772p631j1820N273L170M376Q208R137J2993j0563k361l553
$$ -45 6172 -5253 -7025 -14656 -26476 -21203 -18033 -13657 -5449 3688 16681 6118 3757 204
8355B04M95o433J001k167L707P312J555n142P61l308J634N886M524N275n161j6044
$$ 204 699 -5734 -4733 -6900 -3193 4119 5674 532 1293 -2015 -381 5505 10029 15304 10143 -5901
8339e901n196J0621j121M521n006j341O587q306r662M307M188K285N664m52j1413
$$ -5901 -11097 -476 -1597 2924 -2082 -3423 3164 -5142 -14804 -10497 -6309 -4024 1640 1188 -10225
8324a0225j92K066Q070N02N13J0847Q240j2164o312O355O216k711j2093j444l248
$$ -10225 -10417 -8351 -281 221 734 11581 19821 7657 1345 7700 13916 11205 -888 -2332 -5580
8309e580J793q187l600P227Q198J1541L120o421j0775j378J72K502l222K483N541
$$ -5580 -3787 -11974 -15574 -8347 -149 11392 14512 8091 -2684 -4062 -3890 -1388 -4610 -2127 3414
8294C414L344n463j0599j0317L532R751K802l161o427L107M682N766o48l497l294
$$ 3414 6758 1295 -9304 -19621 -16089 -6338 -3536 -6697 -13124 -10017 -5335 431 -217 -3714 -7008
8279g008J0040O279J115o57O87N763K039r057j0624J12J582o504m531Q852K038
$$ -7008 3032 9311 10426 9769 10456 16219 18258 9201 -1423 -1311 271 -6233 -10764 -1912 126
8264A26N571j275m074L356K305l856L766M287j0964K265K074m412J925M404K603
$$ 126 5697 4422 348 3704 6009 2153 5919 10206 -758 1507 3581 -831 1094 5498 8101
8249H101r727n417J6146N553j1467o619n008M162R338K524n833j1948J857K504
$$ 8101 -1626 -7043 9103 14656 3189 -3430 -8438 -4276 5062 7586 1753 -10195 -8338 -5834
8235e834N505Q003n599l405M10r94o45P81M40o795L61l591L480R901L555k247
$$ -5834 -329 7674 2075 -1330 -920 -1914 -2559 -1778 -1338 -8133 -7772 -11363 -7883 2018 5573 3326
8219C326K014l457K751J07P244l896p049j999j944k465O588Q944N695k408k759
$$ 3326 5340 1883 4634 4741 11985 8089 1040 -959 -2903 -5368 1220 10164 15859 13451 10692
8204A0692l104o469k743o914m946o990o47J207N978O526j1711l433K123R20j108
$$ 10692 7588 1119 -1624 -8538 -13484 -20474 -21121 -19914 -13936 -7410 -19121 -22554 -20431 -19511 -20619
8189b0619N072M840M447K152P288M175p407o691j857q91O530L913k090K447K971
$$ -20619 -15547 -10707 -6260 -4108 3180 7355 -52 -6743 -8600 -9491 -2961 952 -1138 1309 4280
8174D280j2362l798O727P901M44M508o425j0166N367N482R808K470j160j326P928
$$ 4280 -8082 -11880 -5153 2748 3192 7700 1275 -8891 -3524 1958 11766 14236 13076 11750 19678
8159A9678K634j807j443m634K50l314J935n379p63K494p741N76K7j909L785L498
$$ 19678 22312 20505 19062 14428 14678 11364 13299 7920 7157 9651 1910 2486 2513 604 4389 7887
8143G887Q400p020l778k446m394r23M797O371m267l429J214K299m251K256P95
$$ 7887 16287 9267 5489 3043 -1351 -2274 2523 8894 4627 1198 2412 4711 460 2716 3511
8128C511J151M655K818q75j899K468P096o696o868J609J827l749m880k786k788
$$ 3511 4662 9317 12135 11260 9361 11829 18925 12229 5361 6970 8797 5048 168 -2618 -5406
8113e406q53J239N112J0125j345q47o997o589N990k055p566q687P191L31L425
$$ -5406 -6259 -5020 92 10217 8872 8025 1028 -5561 429 -1626 -9192 -17879 -10688 -10357 -6932
8098f932Q798K253j1891p98M097m995j101J241J089N22J2047l514r660r45O457
$$ -6932 1866 4119 -7772 -8570 -4473 -9468 -10569 -9328 -8239 -7717 4330 816 -8844 -9789 -3332
8083c332O015k248n058l515J3536J1361r928o263M998k71n29P020N164j2813p723
$$ -3332 2683 435 -4623 -8138 5398 16759 6831 568 5566 5295 4766 11786 16950 4137 -3586
8068c586o29J75O886r82n538m005M37L239Q076P28n299J552k348Q957L704n320
$$ -3586 -4215 -4040 2846 1864 -3674 -7679 -7242 -4003 4073 4801 -498 1054 -1294 7663 11367 6047
8052F047o713p042N650M187p964q36R28L379J3702o606p249o452O460K231P112
$$ 6047 -666 -7708 -2058 2129 -5835 -6671 -5743 -2364 11338 4732 -2517 -8969 -2509 -278 6834
8037F834m709p509L383J141j882m327j803K428N32O209L233j348O86m625K396
$$ 6834 2125 -5384 -2001 -860 -2742 -7069 -8872 -6444 -5912 297 3530 2182 2868 -1757 639
8022F39K491R91j702J270j907q457p43L355P472J902j0399N55M624K080j148P676
$$ 639 3130 4121 2419 3689 1782 -6675 -7418 -4063 3409 5311 -5088 -4533 91 2171 1023 8699
8006H699j26j2888n013K37l431p62J410N336q822R0k597l02N026P910J1576J956
$$ 8699 8573 -4315 -9328 -9091 -12522 -13284 -11874 -6538 -15360 -15270 -17867 -18169 -13143 -5233 6343 8299
7990H299m565j100m633k743O017k472L072R478k96m851n782l30o706K477J623
$$ 8299 3734 2634 -1999 -4742 1275 -1197 1875 11353 11057 6206 424 94 -6612 -4135 -2512
7975b512R470J1335n789q688P47m903j0940N155O582r60j380O738m396O909J435
$$ -2512 6958 18293 12504 3816 4563 -340 -11280 -6125 457 -503 -1883 4855 459 7368 8803
7960H803K949J0298m928n294j0094l515k440m966L692J556M617O908n10J980j141
$$ 8803 11752 22050 17122 11828 1734 -1781 -4221 -9187 -5495 -3939 678 7586 7076 9056 7915
7945G915K791m734K403k742m118N821j384j3402K21R666k69m723j001K01l69O82
$$ 7915 10706 5972 8375 5633 1515 7336 5952 -7450 -7229 2437 2168 -2555 -3556 -3355 -3724 -3042
7929c042o90l813M346m694L723O501J1762L553m85p076l590n599n335j946O682
$$ -3042 -3732 -7545 -3199 -7893 -4170 2331 14093 17646 17161 10085 6495 896 -4439 -6385 297
7914B97j610K193J3193l355j0781o306k142Q431K637l266N754J586J738M193m589
$$ 297 -1313 880 14073 10718 -63 -6369 -8511 -80 2557 -709 5045 6631 8369 12562 7973
7899G973n349k782J0454M150L630J251r352j0697M255R340O315p022j1149o063
$$ 7973 2624 -158 10296 14446 18076 19327 9975 -722 3533 12873 19188 12166 1017 -5046
7885e046J632j406J488K979k800j425M648J1517R50m625J943r208j2284K494J2652
$$ -5046 -3414 -4820 -3332 -353 -3153 -4578 70 11587 12537 7912 9855 647 -11637 -9143 3509
7870C509L76o587l692L487P500P297J3050L425j3392j0237J56K628o462j398l267
$$ 3509 3885 -2702 -6394 -2907 4593 11890 24940 28365 14973 4736 4892 7520 1058 -340 -3607
7855c607J91M729L445M248O34J478L356k26j4451p220K846o50L517J0230j634
$$ -3607 -3416 1313 4758 9006 9640 11118 14474 14248 -203 -7423 -4577 -5227 -1710 8520 6886
7840F886n271p401j386N642k335n479L263K053L245l879L257o667k095l39L562
$$ 6886 1615 -5786 -7172 -1530 -3865 -9344 -6081 -4028 -783 -4662 -1405 -8072 -10167 -10506 -6944
7825f944O815J0362j625l330K956m569n920K71O928J848k925P05J43o929m36O415
$$ -6944 -129 10233 8608 5278 8234 3665 -2255 -1984 4944 6792 3867 4572 4715 -2214 -2650 3765
7809C765P262P66l367k05M180j775j085M535K539m958j0162n880n270P301R558
$$ 3765 11027 11793 8426 8221 12401 10626 9541 14076 16615 11657 1495 -4385 -9655 -2354 7204
7794G204l164Q31J2773K886r292n098p664k859n718n78j44j702P970N003m050
$$ 7204 4040 4871 17644 20530 11238 6140 -1524 -4383 -10101 -10679 -10823 -12525 -4555 448 -3602
7779c602j4537L682J3823k234n768l905p276n324L160J4502Q087n214l404n626
$$ -3602 -18139 -14457 -634 -2868 -8636 -12541 -19817 -25141 -21981 -7479 608 -4606 -8010 -13636
7765a3636J370O059K254J9251j905q063L635l392o621j580p376n674N929O034
$$ -13636 -12266 -6207 -3953 15298 13393 5330 8965 5573 -1048 -2628 -10004 -15678 -9749 -3715
7751c715P633R923l220j5467r327P952L157r033o842l916R133J9508J5685K793
$$ -3715 3918 13841 10621 -4846 -14173 -6221 -3064 -12097 -18939 -22855 -13722 5786 21471 24264
7737B4264O475k280j1322j5093o478r40Q242m897K01r247r094j64k752N706K2642
$$ 24264 30739 28459 17137 2044 -4434 -5374 2868 -2029 -1828 -11075 -20169 -20333 -23085 -17379 5263
7722E263O885j1230p164o486J879N577j2123r941Q333J4509J0715o16n175k202
$$ 5263 12148 918 -6246 -12732 -10853 -5276 -17399 -27340 -19007 -4498 6217 5601 426 -1776
7708a776m627P511O32p372p600O910P437o335j7088p8M94k136Q640R904R303j1179
$$ -1776 -6403 1108 1740 -5632 -13232 -6322 1115 -5220 -22308 -22386 -21892 -24028 -15388 -5484 3819 -7360
7692g360l585J1744M962m735q698m407O360N805O818o862n55J100o559n59l05
$$ -7360 -10945 799 5761 1026 -7672 -12079 -5719 86 6904 42 -513 587 -5972 -6531 -6836
7677f836j194l567L448R868L735o27q351M16L203j020L35j089m408n897R471P608
$$ -6836 -8030 -11597 -8149 1719 5454 4827 -3524 -3108 95 -925 -590 -1679 -6087 -11984 -2513 5095
7661E095m03n434L075N390j630p088m546k324q18J635L680N116q71j762p846q404
$$ 5095 4692 -742 2333 7723 6093 -995 -5541 -7865 -8683 -7048 -3368 1748 877 -885 -8731 -17135
7645a7135Q024J2699l580j0223O343Q786L955Q794r83p984Q226N908j0378j8712
$$ -17135 -9111 3588 8 -10215 -3872 4914 8869 17663 16680 8696 16922 22830 12452 -6260
7631f260o401N799K100O420P135O987q28o969j0713q206N273M359L216j37L332
$$ -6260 -12661 -6862 -4762 1658 8793 15780 14952 7983 -2730 -10936 -5663 -1304 1912 1775 5107
7616E107q744P70M184O720M74o737m852p658K070o474j682L170L107L363Q413
$$ 5107 -3637 -2867 1317 8037 8511 1774 -3078 -10736 -8666 -15140 -16822 -13652 -10545 -7182 1231
7601A231O508N670l777m551j052N50m026q70k580K876K707l563l182P606K739
$$ 1231 7739 13409 9632 5081 4029 4579 553 -317 -2897 -21 2686 -877 -4059 3547 6286
7586F286n482k160L728o499o203K760p060K702J1388l538o75N056N444N210L572
$$ 6286 804 -1356 2372 -4127 -10330 -7570 -14630 -11928 -540 -4078 -4753 303 5747 10957 14529
7571A4529J031o479j1619O370J941p881K632M790P335l465M219J145j2743j1913
$$ 14529 15560 9081 -2538 3832 5773 -2108 524 5314 12649 9184 13403 14548 1805 -10108
7557a0108j608L870k482O476Q494q046o463L968M351J874L596Q585m015p282Q54
$$ -10108 -11716 -7846 -10328 -3852 4642 -3404 -9867 -5899 -1548 326 3922 12507 8492 1210 2064
7542B064o107r401m951P563J0013P36r41n321q983L439M156L454P972N50K762
$$ 2064 -4043 -13444 -18395 -10832 -819 -83 -1024 -6345 -15328 -11889 -7733 -4279 3693 4243 7005
7527G005Q709o006q683Q09J0848m821K440o926m079p378k052J2547q30n330l842
$$ 7005 15714 9708 1025 1834 12682 7861 10301 3375 -704 -8082 -10134 2413 1583 -3747 -7589
7512g589K777J338k394k101M573J406o396n777n145j726J1770Q867O199l61j182
$$ -7589 -4812 -3474 -5868 -7969 -3396 -1990 -8386 -14163 -19308 -21034 -9264 -397 5802 5441 4259
7497D259L488M387r972p100O813L38J123M317j5691r532L288L871J707k27m39
$$ 4259 7747 12134 2162 -4938 1875 2213 3336 7653 -8038 -17570 -14282 -10411 -8704 -8931 -9370
7482i370k117P207Q948Q04L703L662J489m872m030L975J200J933J613j969p041
$$ -9370 -11487 -4280 4668 5472 9175 12837 14326 9454 5424 9399 10599 12532 14145 12176 5135
7467E135l53J973L809K002L938j1166l357J521r687O764J4177q01m233m500n203
$$ 5135 4782 6755 10564 12566 16504 5338 1981 3502 -6185 579 14756 13955 9722 5222 19
7452A9o602m462K043J0553j504m422O919n068o004L089o32K012N93J310N354Q832
$$ 19 -6583 -11045 -9002 1551 47 -4375 2544 -2524 -8528 -5439 -6071 -4059 -3466 -2156 3198 12030
7436A2030L087p123o589O964L587Q580p076q019k562O670M589j172m798k85q152
$$ 12030 15117 7994 1405 8369 11956 20536 13460 5441 2879 9549 14138 12966 8168 7883 -269
7421b69j3608Q35P024N040l636j447N80l968L244N312J456J291q48m725J725n087
$$ -269 -13877 -13042 -6018 -978 -4614 -6061 -5481 -9449 -6205 -893 563 1854 1006 -3719 -1994 -7081
7405g081Q884P834l41k744o705o962M773K717O510m222m618p794N777m692M964
$$ -7081 1803 9637 9296 6552 -153 -7115 -2342 375 6885 2663 -1955 -9749 -3972 -8664 -3700
7390c700J3485k90k006L701J468k487m767l902k126j2320K905J0635o575r673
$$ -3700 9785 9495 7489 11190 12658 10171 5404 1502 -624 -12944 -10039 596 -5979 -15652
7376a5652K663J3425N437j236L002J581l433o332j207q80p182k793N582l940j381
$$ -15652 -12989 436 5873 4637 7639 9220 5787 -545 -1752 -2632 -9814 -12607 -7025 -10965 -12346
7361a2346L677l741M695N762K528Q03J672o485N084R573N17n870L274L494J000
$$ -12346 -8669 -12410 -7715 -1953 575 1378 3050 -3435 1649 11222 11739 5869 9143 12637 13637
7346A3637m864o858o284j0086j15l48N672M889J360K35J2230Q276M33l945L371
$$ 13637 8773 1915 -4369 -14455 -14570 -14918 -9246 -4357 -2997 -2762 9468 17744 18177 14232 17603
7331A7603p071P02n37n022J806k873q566j069m83j797J43M633k443l401N045O042
$$ 17603 10532 11234 10697 5675 7481 4608 -3958 -5027 -5510 -7307 -7164 -2531 -4974 -8375 -3330 2712
7315B712R011j3886q461R87O552L794k475q299l326J745L717J2583P458n994n963
$$ 2712 11723 -2163 -10624 -9637 -3085 709 -1766 -10065 -13391 -11646 -7929 4654 12112 6118 155
7300A55k687m314J865Q493k150p079m407O133J3101n906n017m579j456M570R526
$$ 155 -2532 -6846 -4981 3512 1362 -5717 -10124 -3991 9110 3204 -1813 -6392 -7848 -3278 6248
7285F248L542N448k692j0621r711n980j424J380Q678j638K088o10L82M222r405
$$ 6248 9790 15238 12546 1925 -7786 -13766 -15190 -13810 -5132 -6770 -4682 -5292 -4910 -688 -10093
7270a0093n962J337O343M789J1219K82n360l108l660n55K50K30L838M541M10n974
$$ -10093 -16055 -14718 -8375 -3586 7633 7915 2555 -553 -4213 -4768 -4518 -4288 -450 4091 4501 -1473
7254a473J031P676k689l623N430j457L72P17j2134J766j54j944L856L244k567
$$ -1473 -442 7234 4545 922 6352 4895 5267 5984 -6150 -4384 -4538 -6482 -2626 618 -1949
7239a949J2262M019p296p504K213l937L307n421l205m922k867K751Q826j049p485
$$ -1949 10313 14332 7036 -468 1745 -2192 1115 -4306 -7511 -12433 -15300 -12549 -3723 -4772 -12257
7224a2257n617R628J2090K274o897J701N558K104l376o290K953K490L723M650
$$ -12257 -17874 -8246 3844 6118 -779 922 6480 8584 5208 -1082 1871 4361 8084 12734
7210A2734o697p559j862P205J352o303P170J476l589o496r65m598K235n419P976
$$ 12734 6037 -1522 -3384 3821 5173 -1130 6040 7516 3927 -2569 -3534 -8132 -5897 -11316 -3340
7195c340J893p710k729q465J385K413N084J335j885j677R564J2107l167O217m767
$$ -3340 -1447 -9157 -11886 -20351 -18966 -16553 -11469 -10134 -12019 -13696 -4132 7975 4808 11025 6258
7180F258q029O643p113m330R06q269R165l826o505K183O09M497o930N12J2623
$$ 6258 -1771 4872 -2241 -6571 -5665 -13934 -4769 -8595 -15100 -12917 -12308 -7811 -14741 -14229 -1606
7165a606q821j1148Q174J3215o204j357q79r75P749J812K881m04j454n733J895
$$ -1606 -10427 -21575 -13401 -186 -6390 -7747 -8626 -9601 -1852 -40 2841 2437 983 -4750 -2855
7150b855l276K873L874L802r714k079o921m225J09O721R086M244M187o632r650
$$ -2855 -6131 -3258 616 4418 -5296 -7375 -14296 -18521 -18412 -11691 -2605 1639 5826 -806 -10456
7135a0456q728J2256O136k663J230o18j562N861K038m309M987Q90l794N065j136
$$ -10456 -19184 -6928 -792 -3455 -2225 -2843 -4405 1456 3494 -815 4172 5062 1268 6333 5197
7120E197N151m109p52p82o917l121L111q314M463P42k828n684M579L08J734O950
$$ 5197 10348 6239 5487 4705 -2212 -5333 -2222 -10536 -6073 -5331 -8159 -13843 -9264 -8956 -7222 -272
7104b72r31N449J178o460L349j3367k376r6P296Q034l62l126r90J769p76L977
$$ -272 -1203 4246 5424 -1036 2313 -11054 -13430 -13526 -6230 1804 1442 -1684 -2674 -905 -1681 2296
7088B296O988m217n478o76j2168m834J3709r94K750Q963j182m752m393P644j0348
$$ 2296 9284 5067 -411 -1087 -13255 -18089 -4380 -5374 -2624 6339 5157 405 -3988 3656 -6692
7073f692n968P494L487l284k99k370N241J430j202N569K599Q39m49j671n92M360
$$ -6692 -12660 -5166 -1679 -4963 -5262 -7632 -2391 -961 -2163 3406 6005 6844 6395 4724 4132 8492
7057H492o193p2l01Q653o172j1161n173L2J1665o952L190J0833N961l730p13j908
$$ 8492 2299 2227 1926 10579 4407 -6754 -11927 -11895 -230 -7182 -3992 6841 12802 9072 8359 6451
7041F451L779l331p826Q908P100m772j693m826l850K580J727j588p30L389L012
$$ 6451 10230 6899 -927 7981 15081 10309 8616 3790 -60 2520 4247 2659 1929 5318 8330
7026H330l550l439O038J936k922j2368n864L353M508n048l420P308J4709l899
$$ 8330 4780 1341 7379 9315 6393 -5975 -11839 -8486 -3978 -9026 -12446 -5138 9571 5672
7012E672l275K03L265q550k015k109J923O117R54j873j0251J207L909K522m578
$$ 5672 2397 2600 5865 -2685 -4700 -6809 -4886 1231 2185 312 -9939 -8732 -4823 -2301 -6879
6997f879p14n929L522M029Q582q546n242o51K605J2185J2359k238j6974m767o81
$$ -6879 -7593 -13522 -10000 -5971 2611 -5935 -11177 -11828 -9223 2962 15321 13083 -3891 -8658 -9339
6982i339M883J0135R645j43m195k959r01j158m373j535m861n896K249K694J6676
$$ -9339 -4456 5679 15324 15181 10986 8027 7126 5968 1595 60 -4801 -10697 -8448 -5754 10922
6967A0922r09l973n137n934R453J150n214j488K297J537O128j2383l121L744M525
$$ 10922 10013 6040 903 -5031 4422 5572 358 -1130 1167 2704 8832 -3551 -6672 -2928 1597
6952A597R180K340p746n307J963r31q656O223M379k99O291K648j0542m663N365
$$ 1597 10777 13117 5371 64 2027 1096 -7560 -1337 3042 2743 9034 11682 1140 -3523 1842
6937A842j863N82N92p423K436l665l501l2m97m751M462L415N221L463K337j806
$$ 1842 -21 561 1153 -6270 -3834 -7499 -11000 -11032 -11529 -16280 -11818 -8403 -3182 281 2618 812
6921H12K704L22m296J1034L075j744j3264j3152M215O599j186O597L597p281n482
$$ 812 3516 3838 -458 10576 13651 11907 -1357 -14509 -10294 -3695 -4881 1716 5313 -1968 -7450
6906g450k232o677N473J0571l881q041M438L706M085N669m886j193j67J9N54j083
$$ -7450 -9682 -16359 -10886 -315 -4196 -12237 -7799 -4093 -8 5661 775 -418 -585 -566 -12 -1095
6890a095R443n34n056m477J586l902p16j404L348R482O419j3267o717M769J759
$$ -1095 8348 7814 2758 -1719 -133 -4035 -4751 -6155 -2807 6675 13094 -173 -6890 -2121 -362
6875c62M367M717l395j374M707j908q912J902R685l647r236M350O593J585J222
$$ -362 4005 8722 5327 3953 8660 6752 -2160 -258 9427 5780 -3456 894 7487 9072 10294
6860A0294P24m607p214o735L81L361k051q654K338R089j722j1395l689K281O849
$$ 10294 11018 6411 -803 -7538 -7157 -3796 -5847 -14501 -12163 -3074 -4796 -16191 -19880 -17599 -10750
6845a0750K597l422m77R08l716O472O702J629R8L411j370K498k67m918J578M883
$$ -10750 -8153 -11575 -12052 -11144 -14860 -8388 -1686 -57 41 3452 2082 4580 4313 -605 973 5856
6829E856N554L547j941j0735n550K788j929J183j473Q650O753M081K961k124n226
$$ 5856 11410 14957 13016 2281 -3269 -481 -2410 -1227 -2700 5950 12703 16784 19745 17621 12395
6814A2395n922m988k638J2927R014L607j6373q025j231M111R203L802l093J639
$$ 12395 6473 1485 -1153 11774 20788 24395 8022 -3 -1234 2877 12080 15882 12789 14428
$$ [...]
##END NTUPLES=NMR SPECTRUM
##END=
