##TITLE=Analysis number 312317
Compound Code btb 05877
Book Reference 1
Project Code adrs
Chemist Name fudan
##JCAMPDX= 6.0         $$ Bruker NMR JCAMP-DX V2.0
##DATA TYPE= NMR SPECTRUM
##DATA CLASS= NTUPLES
##ORIGIN= Bruker BioSpin GmbH
##OWNER= NMR
$$ XWIN-NMR		Version 3.5
$$ Mon Aug  1 12:57:06 2005 GMT Daylight Time (UT+1h)  MAYBRIDGE\NMR@NMR_250MHZ
##.OBSERVE FREQUENCY= 250.131544655141
##.OBSERVE NUCLEUS= ^1H
##.ACQUISITION MODE= SIMULTANEOUS (DQD)
##.ACQUISITION SCHEME= undefined
##.AVERAGES= 16
##.DIGITISER RES= 18
##SPECTROMETER/DATA SYSTEM= dpx250
##.PULSE SEQUENCE= zg30
##.SOLVENT NAME= DMSO
##.SHIFT REFERENCE= (INTERNAL, DMSO, 0, 16.522)
##AUDIT TRAIL= $$ (NUMBER, WHEN, WHO, WHERE, WHAT)
$$ ##TITLE= Audit trail, XWIN-NMR		Version 3.5
$$ ##JCAMPDX= 5.01
$$ ##ORIGIN= Bruker BioSpin GmbH
$$ ##OWNER= NMR
$$ C:\u/data/dgb/nmr/ADRS/6960/pdata/1/auditp.txt
$$ ##AUDIT TRAIL=  $$ (NUMBER, WHEN, WHO, WHERE, WHAT)
(   1,<2005-08-01 12:56:44.90 +100>,<MAYBRIDGE\NMR>,<NMR_250MHZ>,
      <created by zg, POWCHK disabled, PULCHK disabled
       configuration hash MD5:
       62 19 C7 07 E1 42 D1 B7 37 6C 3D D0 77 39 F9 E6
       data hash MD5: 64K
       D4 ED 26 0B 71 DE 57 1C 94 56 DD 10 DB 88 0F 0B>)
(   2,<2005-08-01 12:56:57.98 +100>,<MAYBRIDGE\NMR>,<NMR_250MHZ>,
      <Start of raw data processing
       ef LB = 0.3 FT_mod = 6 PKNL = 1 SI = 32K 
       data hash MD5: 32K
       27 0D 95 2E 5B DB 2C 42 BC 95 8E A2 AD E1 A6 AB>)
(   3,<2005-08-01 12:56:59.76 +100>,<MAYBRIDGE\NMR>,<NMR_250MHZ>,
      <apk 
       data hash MD5: 32K
       4A 46 6F CF 8A 27 66 DF 1C 80 AC 47 CC 27 2F DA>)
(   4,<2005-08-01 12:57:00.45 +100>,<MAYBRIDGE\NMR>,<NMR_250MHZ>,
      <abs ABSG = 5 
       data hash MD5: 32K
       DC 86 BF D0 68 15 BA 15 6F 1C 08 9A AE 66 DD C6>)
$$ ##END=
$$ 
$$ hash MD5
$$ 7B 22 0D E2 56 0C A1 C3 02 D4 6F 89 0B 05 56 5F
##$RELAX= 
##$RELAX= 
##$RELAX= 
##$RELAX= 
##$RELAX= 
##$RELAX= 
##$RELAX= 
$$ Bruker specific parameters
$$ --------------------------
##$DU= <C:\u>
##$EXPNO= 6960
##$NAME= <ADRS>
##$PROCNO= 1
##$TYPE= <nmr>
##$USER= <dgb>
##$AMP= (0..31)
100 100 100 100 100 100 100 100 100 100 100 100 100 100 100 100 100 100 
100 100 100 100 100 100 100 100 100 100 100 100 100 100 
##$AQSEQ= 0
##$AQ_mod= 3
##$AUNM= <au_zg>
##$AUTOPOS= <28 >
##$BF1= 250.13
##$BF2= 250.13
##$BF3= 250.13
##$BF4= 250.13
##$BF5= 500.13
##$BF6= 500.13
##$BF7= 500.13
##$BF8= 500.13
##$BYTORDA= 1
##$CFDGTYP= 0
##$CFRGTYP= 5
##$CHEMSTR= <none>
##$CNST= (0..31)
1 1 145 1 1 1 1 1 1 1 1 1 1 1 1 1 1 1 1 1 1 1 1 1 1 1 1 1 1 1 1 1 
##$CPDPRG= <>
##$CPDPRG1= <>
##$CPDPRG2= <>
##$CPDPRG3= <>
##$CPDPRG4= <mlev>
##$CPDPRG5= <mlev>
##$CPDPRG6= <mlev>
##$CPDPRG7= <mlev>
##$CPDPRG8= <mlev>
##$CPDPRGB= <>
##$CPDPRGT= <>
##$D= (0..31)
0 1 0 0 0 0 0 0 0 0.06 0 0 0 0 0 0 0.0002 0 0 0 0 0 0 0 0 0 0 0 0 0 0 
0 
##$DATE= 1122897404
##$DBL= (0..7)
120 120 120 120 120 120 120 120 
##$DBP= (0..7)
150 150 150 150 150 150 150 150 
##$DBP07= 0
##$DBPNAM0= <>
##$DBPNAM1= <>
$$ [...]
##$SUBNAM7= <"">
##$SUBNAM8= <"">
##$SUBNAM9= <"">
##$SW= 20.6930455092707
##$SWIBOX= (0..15)
0 0 3 0 0 0 0 0 0 0 0 0 0 0 0 0 
##$SW_h= 5175.983436853
##$TD= 65536
##$TD0= 1
##$TE= 295.16
##$TE2= 300
##$TE3= 300
##$TEG= 300
##$TL= (0..7)
0 120 120 120 120 120 120 120 
##$TP= (0..7)
150 150 150 150 150 150 150 150 
##$TP07= 0
##$TPNAME0= <>
##$TPNAME1= <>
##$TPNAME2= <>
##$TPNAME3= <>
##$TPNAME4= <>
##$TPNAME5= <>
##$TPNAME6= <>
##$TPNAME7= <>
##$TPOAL= (0..7)
0.5 0.5 0.5 0.5 0.5 0.5 0.5 0.5 
##$TPOFFS= (0..7)
0 0 0 0 0 0 0 0 
##$TUNHIN= 0
##$TUNHOUT= 0
##$TUNXOUT= 0
##$USERA1= <user>
##$USERA2= <user>
##$USERA3= <user>
##$USERA4= <user>
##$USERA5= <user>
##$V9= 5
##$VALIST= <valist>
##$VCLIST= <CCCCCCCCCCCCCCC>
##$VD= 0
##$VDLIST= <DDDDDDDDDDDDDDD>
##$VPLIST= <PPPPPPPPPPPPPPP>
##$VTLIST= <TTTTTTTTTTTTTTT>
##$WBST= 1024
##$WBSW= 4
##$XGAIN= (0..3)
0 0 0 0 
##$XL= 0
##$YL= 0
##$YMAX_a= 469171
##$YMIN_a= -454335
##$ZGOPTNS= <>
##$ZL1= 120
##$ZL2= 120
##$ZL3= 120
##$ZL4= 120
##$ABSF1= 16.522
##$ABSF2= -4.171173
##$ABSG= 5
##$ABSL= 3
##$ALPHA= 0
##$AQORDER= 0
##$ASSFAC= 0
##$ASSFACI= 0
##$ASSFACX= 0
##$ASSWID= 0
##$AUNMP= <proc_1d>
##$AZFE= 0.1
##$AZFW= 0.1
##$BCFW= 0
##$BC_mod= 0
##$BYTORDP= 0
##$COROFFS= 0
##$CY= 12.5
##$DATMOD= 1
##$DC= 0
##$DFILT= <>
##$DTYPP= 0
##$F1P= 14.0000005364418
##$F2P= -0.99999901652339
##$FCOR= 0.5
##$FTSIZE= 32768
##$FT_mod= 6
##$GAMMA= 0
##$GB= 0
##$INTBC= 1
##$INTSCL= 1
##$ISEN= 128
##$LB= 0.3
##$LEV0= 0
##$LPBIN= 0
##$MAXI= 10000
##$MC2= 0
##$MEAN= 0
##$ME_mod= 0
##$MI= 0
##$NCOEF= 0
##$NC_proc= -4
##$NLEV= 6
##$NOISF1= 0
##$NOISF2= 0
##$NSP= 0
##$NTH_PI= 0
##$NZP= 0
##$OFFSET= 16.522
##$PC= 1
##$PHC0= -89.4138
##$PHC1= 6.115638
##$PH_mod= 1
##$PKNL= yes
##$PPARMOD= 0
##$PSCAL= 4
##$PSIGN= 0
##$REVERSE= no
##$SF= 250.13
##$SI= 32768
##$SIGF1= 0
##$SIGF2= 0
##$SINO= 400
##$SIOLD= 32768
##$SREGLST= <1H.DMSO>
##$SSB= 0
##$STSI= 32768
##$STSR= 0
##$SW_p= 5175.98343685301
##$SYMM= 0
##$S_DEV= 0
##$TDeff= 65536
##$TDoff= 0
##$TI= <Analysis number 999999
Compound Code 99
Book Reference 9
Project Code 9>
##$TILT= no
##$TM1= 0
##$TM2= 0
##$TOPLEV= 0
##$USERP1= <user>
##$USERP2= <user>
##$USERP3= <user>
##$USERP4= <user>
##$USERP5= <user>
##$WDW= 1
##$XDIM= 32768
##$YMAX_p= 388909871
##$YMIN_p= -286371
$$ End of Bruker specific parameters
$$ ---------------------------------
##NTUPLES= NMR SPECTRUM
##VAR_NAME=  FREQUENCY,     SPECTRUM/REAL,   SPECTRUM/IMAG
##SYMBOL=    X,             R,               I
##VAR_TYPE=  INDEPENDENT,   DEPENDENT,       DEPENDENT
##VAR_FORM=  AFFN,          ASDF,            ASDF
##VAR_DIM=   32768,         32768,           32768
##UNITS=     HZ,            ARBITRARY UNITS, ARBITRARY UNITS
##FACTOR=    0.157963299565203, 1,           1
##FIRST=     4132.6476996994, 0,             0
##LAST=      -1043.33573715361, 0,           0
##MIN=       -1043.33573715361, -286371,     0
##MAX=       4132.6476996994, 388909871,     0
$$ Real data points
##PAGE= N=1
##DATA TABLE= (X++(R..R)), XYDATA
$$ [...]
$$ plain form
24024 37444 -28607 -1833 55171 75786 52325 56106 119687 119629 66989 53100 33899 37122 38595
24011 38595 -6985 -3670 56965 16316 -1245 12157 40025 23088 -35539 -66853 -63845 -1293
23999 -1293 39988 7825 -30287 -34810 -16191 -16081 -24393 -36160 -11228 28749 26739 -4949 44183
23986 44183 57258 48383 77189 82911 51139 79 7087 25428 65231 89874 57059 18927
23974 18927 21558 969 4135 -16769 -54533 -53952 -19159 -23508 -31848 -6068 -587 1463 54975
23961 54975 110915 112547 88880 42637 3588 -28511 -68665 -60298 -111 21793 -1930 -48345
23949 -48345 -54998 -25457 30566 59415 41417 60245 102737 99153 22937 -41146 -36392 -50624
23937 -50624 -50251 -22903 10847 -30332 -11487 15879 32460 24225 -9192 -66546 -73567 -32328
$$ packed form
24024C7444o6051K6774N7004K0615k3461L781O3581n8n2640j3889j9201L223J473
24011C8595m5580L315O0635m0649j7561J3402K7868j6937n8627l1314L008O2552
23999a293M1281l2163l8112m523J8619J10q312j1767K4932L9977k010l1688M9132
23986D4183J3075q875K8806N722l1772n1060P008J8341L9803K4643l2815l8132
23974A8927K631k0589L166k0904l7764N81L4793m349q340K5780N481K050N3512
23961E4975N5940J632k3667m6243l9049l2099m0154Q367O0187K1904k3723m6415
23949d8345o653K9541N6023K8849j7998J8828M2492l584p6216o4083M754j4232
23937e0624L73K7348L3750m1179J8845K7366J6581q235l3417n7354p021M1239
$$ plain form
23925 -32328 14997 4181 17636 70760 48588 35378 -12319 -5426 -26382 -32987 -33143 -32861 -12292
23912 -12292 7310 -9252 3485 36639 19074 -21094 -16097 -21855 -36322 -28593 -43497 -12280
23900 -12280 22698 19624 22509 12907 -42792 -50136 -4691 -1015 1703 -54354 -78252 -9027 -11090
23887 -11090 6630 19675 33818 35585 49244 68429 23313 -13216 -39145 -43000 16632 24285
23875 24285 -32815 -65436 -52573 -16091 20251 -40608 -59464 -16797 -19339 -5339 17871 15795
23863 15795 30824 -1273 14150 49025 29140 -19752 -22174 -17752 47397 25205 -40625 -1511
23851 -1511 260 -19272 7946 13379 -19288 -55930 -66567 -65214 -66811 -51983 -66504 -47690 -31634
23838 -31634 -50976 -38087 -44113 -40672 -35184 -40685 -59920 -43482 -18093 -19388 -66620 -65507 -77408
$$ packed form
23925c2328M7325j0816J3455N3124k2172j3210m7697O893k0956o605j56K82K0569
23912a2292J9602j6562J2737L3154j7565m0168M997n758j4467P729j4904L1217
23900a2280L4978l074K885r602n5699p344M5445L676K718n6057k3898O9225k063
23887a1090J7720J3045J4143J767J3659J9185m5116l6529k5929l855N9632P653
23875B4285n7100l2621J2863L6482L6342o0859j8856M2667k542J4000K3210k076
23863A5795J5029l2097J5423L4875j9885m8892k422M422O5149k2192o5830L9114
23851a511J771j9532K7218N433l2667l6642j0637J353j597J4828j4521J8814J6056
23838c1634j9342J2889o026L441N488n501j9235J6438K5389j295m7232J113j1901
$$ plain form
23825 -77408 -91999 -46128 -48292 -54297 -462 50321 53075 17760 -29374 -17322 16810 44907
23813 44907 51847 33788 9503 -63034 -129091 -110664 -120865 -46664 -8102 -17185 9628 45747
23801 45747 16919 46415 22745 -28491 -37695 -68755 -94634 -58440 11477 8553 43934 49329
23789 49329 52870 79316 53886 57608 33228 43706 59998 35921 24503 32824 37840 37552 27124
23776 27124 53860 60432 65557 4945 -66682 -97201 -39232 19001 47168 -11882 -58505 -52347
23764 -52347 -21856 -7459 -33122 -61028 -64369 4656 89802 68174 15172 26025 21861 28707
23752 28707 -24680 -42367 -19823 12376 49799 22039 28855 11070 -3469 16133 6001 -27974
23740 -27974 9995 26490 -15383 5642 10713 2208 -21956 -41646 -22944 725 -13873 -29844
$$ packed form
23825g7408j4591M5871k164o005N3835N0783K754l5315m7134J2052L4132K8097
23813D4907O940j8059k4285p2537o6057J8427j0201P4201L8562r083K6813L6119
23801D5747k8828K9496k3670n1236r204l1060k5879L6194O9917k924L5381N395
23789D9329L541K6446k5430L722k4380J0478J6292k4077j1418Q321N016k88j0428
23776B7124K6736O572N125o0612p1627l0519N7969N8233K8167n9050m6623O158
23764e2347L0491J4397k5663k7906l341O9025Q5146k1628n3002J0853m164O846
23752B8707n3387j7687K2544L2199L7423k7760O816j7785j4539J9602j0132l3975
23740b7974L7969J6495m1873K1025N071q505k4164j9690J8702K3669j4598j5971
$$ plain form
23728 -29844 -27480 -10310 16041 43926 43082 14783 40479 48604 30961 55720 59326 48138 -10928
23715 -10928 -25160 -19214 -16712 -8059 -45622 -70614 -108843 -97566 -51961 -40387 -23656 -10345
23703 -10345 28743 49817 47313 44737 5246 -33898 -11856 16544 6312 -19077 -23677 7247
23691 7247 -358 7419 18778 2202 10595 -1830 -13018 -33775 -2541 3348 -14089 -35217 -15744
23678 -15744 36661 39688 13203 83007 42505 -34967 -63807 -45035 9917 22960 21327 4946
23666 4946 2522 28341 84313 102652 66383 29112 37920 49659 37970 57475 47527 8178
23654 8178 20075 15405 -32718 -32023 18289 39909 24752 -15664 -39058 -42230 -40030 -35508 -13484
23641 -13484 14320 37193 15154 28452 19144 -16414 -779 2292 -5362 31815 72903 72066 23518
$$ packed form
23728b9844K364J7170K6351K7885q44k8299K5696Q125j7643K4759L606j1188n9066
23715a0928j4232N946K502Q653l7563k4992l8229J1277M5605J1574J6731J3311
23703a0345L9088K1074k504k576l9491l9144K2042K8400j0232k5389m600L0924
23691G247p605P777J1359j6576Q393j2425j1188k0757L1234N889j7437k1128J9473
23678a5744N2405L027k6485O9804m0502p7472k8840J8772N4952J3043j633j6381
23666D946k424K5819N5972J8339l6269l7271Q808J1739j1689J9505r948l9349
23654H178J1897m670m8123O95N0312K1620j5157m0416k3394l172K200M522K2024
23641a3484K7804K2873k2039J3298r308l5558J5635L071p654L7177M1088q37m8548
$$ plain form
23628 23518 2215 61308 37572 -82330 -85297 -27749 -16190 9459 19873 66827 39313 33700
23616 33700 4039 49182 20294 -11555 38674 40146 -7281 22869 25722 -12334 18805 -4368
23604 -4368 -21218 -43351 -18243 23389 29459 19206 57512 2182 -60452 -27082 51704 47146
23592 47146 18172 26669 -55509 -76921 -120976 -89784 -57775 -63069 -95663 -111784 -65595 -61960
23580 -61960 -23952 29005 17024 6760 -3938 21504 32184 42730 27938 7280 -38065 -61735
23568 -61735 -84238 -91033 -82211 -48996 -73222 -82525 -93182 -51689 -79595 -114118 -84197 -80838
23556 -80838 -84569 -69399 -57585 -26201 -61288 -42678 6324 37690 55248 83633 43849 37134
23544 37134 46240 48133 31310 -783 -33160 -70790 -89957 -81828 -31348 -69494 -74396 -25140
$$ packed form
23628B3518k1303N9093k3736j19902k967N7548J1559K5649J0414M6954k7514n613
23616C3700k9661M5143k8888l1849N0229J472m7427L0150K853l8056L1139k3173
23604d368j6850k2133K5108M1632O070j0253L8306n5330o2634L3370P8786m558
23592D7146k8974Q497q2178k1412m4055L1192L2009n294l2594j6121M6189L635
23580f1960L8008N2957j1981j0264j0698K5442J0680J0546j4792k0658m5345k3670
23568f1735k2503o795Q822L3215k4226r303j0657M1493k7906l4523K9921L359
23556h0838l731J5170J1814L1384l5087J8610M9002L1366J7558K8385l9784o715
23544C7134R106J893j6823l2093l2377l7630j9167Q129N0480l8146m902M9256
$$ plain form
23532 -25140 -16487 -26259 16853 24573 39300 109504 125446 107687 49138 18477 -33528 20103
23520 20103 31054 83613 68263 91582 77688 71542 56445 7547 4049 30990 17432 22872
23508 22872 -1398 -11095 12358 26376 57066 87983 100380 34440 -1273 6107 33107 30026
23496 30026 -26119 -80632 -60304 -39176 -35201 -44836 -53985 -78407 -67279 -56150 -22889 -13912
23484 -13912 11352 -28692 -50215 -64213 -42830 -53768 -32408 -3085 9773 5647 14712 37454
23472 37454 -7002 -8550 4890 29270 18091 -9492 -18451 -38063 -66389 -26509 -2007 -15994
23460 -15994 -57816 -20288 7100 -3314 -23238 -42639 -65490 -63757 12423 17510 -34496 14773
23448 14773 25893 -3154 653 3104 -17324 -34057 17712 49977 38740 19168 24683 46028
$$ packed form
23532b5140Q653r772M3112P720J4727P0204J5942j7759n8549l0661n2005N3631
23520B0103J0951N2559j5350K3319j3894o146j5097m8898l498K6941j3558N440
23508B2872k4270r697K3453J4018L0690L0917J2397o5940l5713P380K7000l081
23496C0026n6145n4513K0328K1128L975r635r149k4422J1128J1129L3261Q977
23484a3912K5264m0044k1523j3998K1383j0938K1360K9323J2858m126R065K2742
23472C7454m4456j548J3440K4380j1179k7583q959j9612k8326L9880K4502j3987
23460a5994m1822L7528K7388j0414j9924j9401k2851J733P6180N087n2006M9269
23448A4773J1120k9047L807K451k0428j6733N1769L2265j1237j9572N515K1345
$$ plain form
23436 46028 52704 -34585 -47501 -75581 -126162 -100104 -55292 -48398 -22857 -18856 -5434 -16067
23424 -16067 -3165 23226 -15250 -16652 10658 -19401 -67334 22738 71098 25509 23478 11625
23412 11625 -7208 -27358 622 54389 109730 51362 -24498 -41475 -41215 12560 3845 -330
23400 -330 52658 65801 -2882 -27761 19398 33759 10824 -15959 8744 -190 -6258 -5970 -10205
23387 -10205 -35916 -56878 -43320 -63332 -9565 -9712 -87773 -53010 6458 13143 -31112 -84032
23375 -84032 -81729 -14429 2098 3427 -11311 -89548 -80463 -29192 -8792 -9672 -50328 -54260 -86840
23362 -86840 -137244 -131376 -130443 -88203 -33447 -51546 -3468 21225 4522 -2334 15998 4449
23350 4449 -62543 -60989 -42674 -43481 -10715 15504 -12899 -31483 -52512 -18021 -20530 -49365 -102003
$$ packed form
23436D6028O676q7289j2916k8080n0581K6058M4812O894K5541M001J3422j0633
23424a6067J2902K6391l8476j402K7310l0059m7933R0072M8360m5589k031j1853
23412A1625j8833k0150K7980N3767N5341n8368p5860j6977K60N3775q715m175
23400c30N2988J3143o8683k4879M7159J4361k2935k6783K4703q934o068K88m235
23387a0205k5711k0962J3558k0012N3767j47p8061L4763N9468O685m4255n2920
23375h4032K303O7300J6527J329j4738p8237R085N1271K0400q80m0656l932l2580
23362h6840n0404N868R33M2240N4756j8099M8078K4693j6703o856J8332j1549
23350D449o6992J554J8315q07L2766K6219k8403j8584k1029L4491k509k8835n2638
$$ plain form
23337 -102003 -113751 -76230 -64973 -23600 -48043 -58527 -38965 14138 86039 82915 108540 121463
23325 121463 31617 -44548 -47492 -15754 21149 39159 -32517 -48221 -18329 -45155 -19228 40147
23313 40147 34511 2117 676 -6907 -2912 -40002 -42018 3586 -5347 17908 54229 32929 28137
23300 28137 -29934 7454 42844 38465 -1380 -56337 -52389 -69937 -39833 -13959 -30320 -59060
23288 -59060 -39084 -27253 -22358 -14714 -26019 -10696 -18199 8966 50833 36765 46025 62276
23276 62276 -20749 -67759 -67234 -107122 -114114 -113312 -70146 -51522 -42669 -16581 6738 -49620 -36225
23263 -36225 -1021 62211 91662 65423 53148 77031 114511 89336 54934 27292 59162 46594
23251 46594 -1113 -67255 -45790 -33958 -16622 14872 23110 21399 34603 31859 40725 76894
$$ packed form
23337a02003j1748L7521J1257M1373k4443j0484J9562N3103P1901l124K5625J2923
23325A21463q9846p6165k944L1738L6903J8010p1676j5704K9892k6826K5927N9375
23313D0147n636l2394j441p583L995l7090k016M5604q933K3255L6321k1300m792
23300B8137n8071L7388L5390m379l9845n4957L948j7548L0104K5874j6361k8740
23288e9060J9976J1831M895P644j1305J5323p503K7165M1867j4068R260J6251
23276F2276q3025m7010N25l9888o992Q02M3166J8624Q853K6088K3319n6358J3395
23263c6225L5204O3232K9451k6239j2275K3883L7480k5175l4402k7642L1870j2568
23251D6594m7707o6142K1465J1832J7336L1494Q238j711J3204k744Q866L6169
$$ plain form
23239 76894 56379 21208 294 -19908 -54950 -57062 -26827 -28210 -42491 -71125 -107960 -71655
23227 -71655 -26078 -48741 -27184 -4418 15105 -9105 -63583 -57642 -22860 9091 -27844 -51671
23215 -51671 -21295 1921 26895 8364 7323 11409 6955 19390 23537 37025 69439 67758 -10643
23202 -10643 -86836 -69368 -21241 -47327 -81736 -80851 -43217 20323 34415 17382 35048 45136
23190 45136 19184 -15918 -820 53030 71453 73271 52433 31267 48878 54010 47079 8841
23178 8841 7194 45754 45116 28522 -9716 -43171 -14557 -1130 17684 17954 23048 29912 -9880
23165 -9880 -34819 -48488 -51386 -77829 -87236 -69834 -73364 -42293 21450 76440 81946 67944 80721
23152 80721 79955 91979 73022 44696 22213 31313 4798 -8914 -24295 -45544 -59982 -23548
$$ packed form
23239G6894k0515l5171k0914k0202l5042k112L0235j383j4281k8634l6835L6305
23227g1655M5577k2663K1557K2766J9523k4210n4478N941L4782L1951l6935k3827
23215e1671L0376K3216K4974j8531j041M086m454J2435M147J3488L2414j681p8401
23202a0643p6193J7468M8127k6086l4409Q85L7634O3540J4092j7033J7666J0088
23190D5136k5952l5102J5098N3850J8423J818k0838k1166J7611N132o931l8238
23178H841j647L8560o38j6594l8238l3455K8614J3427J8814K70N094O864l9792
23165i880k4939j3669k898k6443r407J7402l530L1071O3743N4990N506j4002J2777
23152H0721p66J2024j8957k8326k2483R100k6515j3712j5381k1249j4438L6434
$$ plain form
23140 -23548 36444 8787 -49313 -52124 -45146 -3355 32512 14997 -4491 34976 44940 -8554
23128 -8554 -5765 -32612 799 -30666 -34150 -25806 -30277 1220 -792 3120 45634 47243 21605
23115 21605 32970 -3057 -52488 -79739 -91140 -71942 -15397 13768 -3259 39281 74163 69316
23103 69316 40513 -11518 -30083 -11758 -30292 -3754 11447 -29401 -59404 -61161 -24271 -872
23091 -872 -4047 -30384 9464 5884 38629 52501 6945 -33009 -34188 -2520 48621 41880 24354
23078 24354 -8929 1439 -3075 11405 -8620 -32587 -28674 9218 25867 15219 -1552 -28647
23066 -28647 -72305 -42296 -12944 -63470 -89323 -88478 -94102 -87698 -19931 23272 33615 4690
23054 4690 -54545 -59638 -70431 -26599 38549 43101 15949 10826 44692 32009 37938 72366 70669
$$ packed form
23140b3548N9992k7657n8100k811O978M1791L5867j7515j9488L9467R964n3494
23128h554K789k6847L3411l1465l484Q344m471L1497k012L912M2514J609k5638
23115B1605J1365l6027m9431k7251j1401J9198N6545K9165j7027M2540L4882m847
23103F9316k8803n2031j8565J8325j8534K6538J5201m0848l0003j757L6890K3399
23091h72l175k6337L9848l580L2745J3872m5556l9954j179L1668N1141o741j7526
23078B4354l3283J0368m514J4480k0025k3967L913L7892J6649j0648j6771k7095
23066b8647m3658L0009K9352n0526k5853Q45n624O404O7767M3203J0343k8925
23054D690n9235n093j0793M3832O5148M552k7152n123L3866j2683N929L4428j697
$$ plain form
23041 70669 56166 71198 48700 63284 108017 176122 112255 32583 14831 48679 119846 92441
23029 92441 86024 111458 55803 30902 70080 98735 68429 39560 11426 11308 36989 50235
23017 50235 29201 36451 11950 19358 50206 33943 -33687 -60018 -56218 -76166 -64266 -58399
23005 -58399 -27322 -46057 -49656 20769 561 -9768 -10775 -26061 -43313 -108734 -13920 1749
22993 1749 -18941 -5897 -35211 -46576 -51747 -4870 15605 6434 -38153 -17919 4898 -1525
22981 -1525 -48375 -98002 -65128 -58735 -45103 -12971 45925 79944 80451 67954 78790 64626
22969 64626 23916 -73673 -89884 -52552 15593 40142 22550 27525 10243 35984 65914 73787
22957 73787 82965 58235 31876 45302 24270 -9432 -29399 -54057 -58461 -50903 43247 79024
$$ packed form
23041G0669j4503J5032k2498J4584M4733O8105o3867p9672j7752L3848P1167k7405
23029I2441o417K5434n5655k4901L9178K8655l0306k8869k8134j18K5681J3246
23017E0235k1034P250k4501P408L0848j6263o7630k6331L800j9948J1900N867
23005e8399L1077j8735l599P0425k0208j0329j007j5286j7252o5421R4814J5669
22993A749k0690J3044k9314j1365n171M6877K0475r171m4587K0234K2817o423
22981a525m6850m9627L2874O393J3632L2132N8896L4019N07j2497J0836j4164
22969F4626m0710r7589j6211L7332O8145K4549j7592M975j7282K5741K9930P873
22957G3787R178k4730k6359J3426k1032l3702j9967k4658m404P558R4150L5777
$$ plain form
22945 79024 58995 23726 41183 84319 120275 109264 80122 107560 66479 20204 -10903 1351
22933 1351 30254 -11125 -22870 -24569 -56618 -44663 25910 73705 28886 -17913 -25570 -38269
22921 -38269 -55097 -52662 -111720 -103877 -52484 -16612 -4199 -1837 40107 3530 -44081 -85602
22909 -85602 -64901 -43515 -59077 -65500 -54781 -29224 -61806 -99445 -88024 -86241 -55526 -29085
22897 -29085 -4750 7007 -14748 -21601 -27626 -24371 -36688 -77625 -26597 -56157 -64911 -23395
22885 -23395 -3993 -4658 9519 28516 -6837 -27218 3519 25417 -19473 -24520 -19821 20944
22873 20944 36178 21432 38470 6565 -67744 -73433 -40107 -112938 -92919 -71539 -80991 -85290
22861 -85290 -48479 -46821 -24340 24854 39509 14128 -21132 -61501 -73998 -73920 -64454 -67938 -63149
$$ packed form
22945G9024k0029l5269J7457M3136L5956j1011k9142K7438m1081m6275l1107J2254
22933A351K8903m1379j1745j699l2049J1955P0573M7795m4819m6799p657j2699
22921c8269j6828K435n9058P843N1393L5872J2413K362M1944l6577m7611m1521
22909h5602K0701K1386j5562o423J0719K5557l2582l7639J1421J783L0715K6441
22897b9085K4335J1757k1755o853o025L255j2317m0937N1028k9560q754M1516
22885b3395J9402o65J4177J8997l5353k0381L0737K1898m4890n047M699M0765
22873B0944J5234j4746J7038l1905p4309n689L3326p2831K0019K1380r452m299
22861h5290L6811J658K2481M9194J4655k5381l5260m0369j2497P8R466l484M789
$$ plain form
22848 -63149 -38949 -28050 -34365 -36946 -57788 -144801 -125099 -23978 -8686 -43835 -42347 -40132
22836 -40132 -23798 26530 -4077 -60184 -52758 -22481 -33854 -66497 -68877 -97533 -29222 19757
22824 19757 25514 4642 -17436 -26740 -19650 -42342 -48265 -19156 -5055 -739 -11295 -50691 -37853
22811 -37853 7650 16360 23344 28019 -41400 -61023 -93798 -118391 -68044 2989 9118 19221
22799 19221 -19232 -33220 -70507 -35688 59297 60485 13991 -14994 -50893 4632 -1006 -31920
22787 -31920 -63069 -12728 3397 8317 54770 49192 39240 56576 38705 56222 39165 35493
22775 35493 45038 64019 62817 8822 -5104 -87991 -112437 -24780 13658 48635 51591 70396
22763 70396 88414 95610 128310 97948 15968 36991 57709 5111 -23121 -38392 -58610 -88071
$$ packed form
22848f3149K4200J0899o315k581k0842q7013J9702J01121J5292l5149J488K215
22836d0132J6334N0328l0607n6107P426L0277j1373l2643k380k8656O8311M8979
22824A9757N757k0872k2078r304P090k2692n923K9109J4101M316j0556l9396J2838
22811c7853M5503Q710O984M675o9419j9623l2775k4593N0347P1033O129J0103
22799A9221l8453j3988l7287L4819R4985J188m6494k8985l5899N5525n638l0914
22787c1920l1149N0341J6125M920M6453n578r952J7336j7871J7517j7057l672
22775C5493R545J8981j202n3995j3926q2887k4446Q7657L8438L4977K956J8805
22763G0396J8018P196L2700l0362q1980K1023K0718n2598k8232j5271k0218k9461
$$ plain form
22751 -88071 -22309 3424 6494 -1451 11136 -31311 -52654 -20084 14620 22476 2653 -22651
22739 -22651 -20966 26295 73575 81201 43340 22127 16625 22007 17548 -17366 -25169 14578 53780
22726 53780 6433 -42645 -55992 -56093 -10394 4296 398 5941 -8441 -14162 -23022 -12552 -7029
22713 -7029 -30842 -39605 6785 -3394 20404 20333 -16558 -11994 -13070 -21147 -42099 -64426 -35022
22700 -35022 -17418 15012 -6038 -42285 -13040 19905 38147 21648 -6657 -15410 10189 26704
22688 26704 37399 -26645 -20498 -16473 55192 55709 -15823 -71389 -17819 -10322 -32407 -70361 -39014
22675 -39014 -26655 -13164 -31748 -37067 42798 76243 23150 -61804 -116912 -124994 -70816 -33668
22663 -33668 -23017 -9330 -18076 -36601 -78206 -123651 -128985 -165952 -121082 -74609 -60715 10088
$$ packed form
22751h8071O5762K5733L070p945J2587m2447k1343L2570L4704P856j9823k5304
22739b2651J685M7261M7280P626l7861k1213n502N382m459l4914p803L9747L9202
22726E3780m7347m9078j3347j01M5699J4690l898N543j4382n721q860J0470N523
22713g029k3813q763M6390j0179K3798p1l6891M564j076q077k0952k2327K9404
22700c5022J7604L2430k1050l6247K9245L2945J8242j6499k8305q753K5599J6515
22688B6704J0695o4044O147M025P1665N17p1532n5566N3570P497k2085l7954L1347
22675c9014J2359J3491j8584n319P9865L3445n3093q4954n5108q082N4178L7148
22663c3668J0651J3687q746j8525m1605m5445n334l6967M4870M6473J3894P0803
$$ plain form
22651 10088 70938 69471 17340 -32171 17450 4575 -15428 -27262 -46386 -30635 35018 66357
22639 66357 26407 5226 -22403 -36695 -70755 -41846 -68967 -77348 -28970 -4606 -1117 -50719
22627 -50719 -81433 -62044 -19770 10608 -34973 -17459 514 -11159 36218 69517 103899 44964
22615 44964 26114 55993 59899 61967 53248 58169 28196 30225 -2663 -23935 -39994 -48110 -37364
22602 -37364 -35008 -52570 42142 77508 60933 -17541 -3701 -11449 -31655 -81716 -104877 -67859
22590 -67859 -25080 -38197 -6803 22392 -24510 -49158 -73620 -117123 -119851 -129868 -91585 -81223
22578 -81223 -102640 -122197 -105801 -80267 -77011 -40724 7233 -21353 -4747 5271 -4511 -35868
22566 -35868 -16444 7299 21292 -896 4707 10507 -23594 -16405 13218 23945 26336 178
$$ packed form
22651A0088O0850j467n2131m9511M9621j2875k0003j1834j9124J5751O5653L1339
22639F6357l9950k1181k7629j4292l4060K8909k7121q381M8378K4364L489m9602
22627e0719l0714J9389M2274L0378m5581J7514J7973j1673M7377L3299L4382n8935
22615D4964j8850K9879L906K068q719M921k9973K029l2888k1272j6059q116J0746
22602c7364K356j7562R4712L5366j6575p8474J3840p748k0206n0061k3161L7018
22590f7859M2779j3117L1394K9195m6902k4648k4462m3503k728j0017L8283J0362
22578h1223k1417j9557J6396K5534L256L6287M7957k8586J6606J0018r782l1357
22566c5868J9424K3743J3993k2188N603N800l4101P189K9623J0727K391k6158
$$ plain form
22554 178 -27235 -30538 -45 14114 38252 14397 -14901 27582 13890 34103 16905 21092
22542 21092 20985 25966 68462 95329 47889 1631 -28947 -69964 -27770 6174 18679 27306
22530 27306 53168 69556 68351 45186 22574 -12344 3794 -15804 8227 42906 76674 74322
22518 74322 100747 93542 103767 61619 20869 13899 -56170 -110348 -65632 -21802 -32139 -12957
22506 -12957 -12389 -33009 -75013 -82245 -78903 -116583 -107696 -71515 2064 -5457 -10250 -23096 -55890
22493 -55890 -77162 -113649 -90203 -64676 -60540 -14111 2026 -17692 -19860 -13112 4484 35722
22481 35722 -12216 -62596 -49415 18320 47488 99699 150664 78414 56384 57792 44055 28506
22469 28506 12356 2618 7054 -8571 -9026 -21706 2201 23510 16399 -49121 -19894 12392 -23761
$$ packed form
22554A78k7413l303L0493J4159K4138k3855k9298M2483j3692K0213j7198M187
22542B1092j07M981M2496K6867m7440m6258l0578m1017M2194L3944J2505Q627
22530B7306K5862J6388j205k3165k2612l4918J6138j9598K4031L4679L3768k352
22518G4322K6425p205J0225m2148m0750o970p0069n4178M4716M3830j0337J9182
22506a2957N68k0620m2004p232L342l7680Q887L6181P3579p521m793j2846l2794
22493e5890k1272l6487K3446K5527M136M6429J6137j9718k168O748J7596L1238
22481C5722m7938n0380J3181O7735K9168N2211N0965p2250k2030J408j3737j5549
22469B8506j6150r738M436j5625m55j2680K3907K1309p111o5520K9227L2286l6153
$$ plain form
22456 -23761 -30271 -60208 -86569 -26849 -29162 -45526 -32147 -38446 19595 -5347 9153 -19328
22444 -19328 -32963 -90472 -96186 -120770 -110668 -110685 -107499 -58161 13505 82947 111015 102122 52460
22431 52460 26624 46600 78963 114896 116604 68791 9803 -31664 -56120 -80930 -62966 -58066
22419 -58066 -43080 -5692 40274 5827 -16180 33513 90485 114085 39728 36605 40761 14748
22407 14748 15165 -33858 -92462 -93524 -37579 8658 -2168 57442 118377 46123 18333 -60270
22395 -60270 -78568 -58376 -18411 -3940 34374 35809 36296 -26330 -49188 -45329 -48786 -73778 -64561
22382 -64561 -62789 -109178 -134219 -121423 -136896 -85305 -77506 -86419 -90245 -70773 -63985 -27360 -35072
22369 -35072 -35995 45783 57161 67795 95269 17951 -32551 -35258 17923 -16948 -32863 9384
$$ packed form
22456b3761o510k9937k6361N9720k313j6364J3379o299N8041k4942J4500k8481
22444a9328j3635n7509n714k4584J0102j7L186M9338P1666O9442K8068q893m9662
22431E2460k5836J9976L2363L5933J708m7813n8988m1467k4456k4810J7964M900
22419e8066J4986L7388M5966l4447k2007M9693N6972K3600p4357l123M156k6013
22407A4748M17m9023n8604j062N5945M6237j0826N9610O0935p2254k7790p8603
22395f0270j8298K0192L9965J4471L8314J435M87o2626k2858L859l457k4992R217
22382f4561J772m6389k5041J2796j5473N1591P799q913l826J9472O788L6625p712
22369c5072r23Q1778J1378J0634K7474p7318n0502k707N3181l4871j5915M2247
$$ plain form
22357 9384 -7272 -16821 -44110 -61120 -33686 -19333 -40579 -28945 -19226 -26066 -6921 20905
22345 20905 43664 7823 42192 64261 45288 47692 30788 -33837 -9792 19698 12370 13250
22333 13250 -59610 -16402 19818 43514 46422 19010 6686 -25119 -12715 -18616 8591 5085
22321 5085 -20762 -8583 7949 -577 22081 6509 9684 35240 61872 97951 100365 51657
22309 51657 39436 38838 59088 -24335 -76174 -35116 -25705 -3649 -27905 -63089 -6290 35100
22297 35100 44579 7660 17647 33011 45279 30085 -10634 -20360 -2887 25955 36619 -119
22285 -119 -31768 -5711 -16285 -41288 -113475 -107146 -25652 -49307 -20937 54608 86022 64320
22273 64320 56989 57165 7656 18017 18781 -26062 -57549 -81417 -49293 -37149 -12151 992 15818
$$ packed form
22357I384j6656r549k7289j7010K7434J4353k1246J1634R719o840J9145K7826
22345B0905K2759l5841L4369K2069j8973K404j6904o4625K4045K9490p328Q80
22333A3250p2860M3208L6220K3696K908k7412j2324l1805J2404n901K7207l506
22321E085k5847J2179J6532q526K2658j5572L175K5556K6632L6079K414m8708
22309E1657j2221n98K0250q3423n1839M1058R411K2056k4256l5184N6799M1390
22297C5100R479l6919R987J5364J2268j5194m0719r726J7473K8842J0664l6738
22285a19l1649K6057j0574k5003p2187O329Q1494k3655K8370P5545L1414k1702
22273F4320p331J76m9509J0361P64m4843l1487k3868L2124J2144K4998J3143J4826
$$ plain form
22260 15818 -6221 40321 45139 63822 60693 17364 32400 20202 55469 49506 36619 44479
22248 44479 16398 -27124 -14629 -43718 -3405 37764 56083 35524 -8889 -57210 -13953 12917
22236 12917 -46867 -89988 -72386 -28778 -4166 -32332 -38326 -2982 50525 58695 78038 79380
22224 79380 38468 54851 72613 56944 -537 -84525 -113963 -93302 -66496 -69132 -59918 -24888
22212 -24888 -12569 -25902 15602 21011 21606 25926 17056 22814 77935 101459 18707 -79970 -73379
22199 -73379 -82804 -61597 -28392 -53603 -47070 -35112 -86674 -39936 -47146 -71565 -36051 28527
22187 28527 10152 -33177 -97000 -84167 -88707 -93844 -61965 -59329 -54777 -77683 -41162 -41686 -86589
22174 -86589 -95578 -55756 -3397 22266 26738 49611 70726 50619 36076 30874 34539 41766 39652
$$ packed form
22260A5818k2039M6542M818J8683l129m3329J5036j2198L5267n963j2887P860
22248D4479k8081m3522J2495k9089M0313M1169J8319k0559m4413m8321M3257K6870
22236A2917n9784m3121J7602M3608K4612k8166n994L5344N3507Q170J9343J342
22224G9380m0912J6383J7762j5669n7481q3988k9438K0661K6806k636R214L5030
22212b4888J2319j3333M1504N409N95M320q870N758N5121K3524q2752r8677O591
22199g3379r425K1207L3205k5211O533J1958n1562M6738p210k4419L5514O4578
22187B8527j8375m3329o3823J2833m540n137L1879K636M552k2906L6521n24m4903
22174h6589q989L9822N2359K5663M472K2873K1115k0107j4543n202L665P227k114
$$ plain form
22161 39652 11605 -40178 -75169 -14794 40146 31018 7908 -7179 -24450 -38858 -61694 -78396
22149 -78396 -129852 -114944 -82106 -70751 -158572 -147670 -138102 -87458 -56302 -47267 -55527 -59706
22137 -59706 -52934 -91143 -134543 -97369 -37546 -23427 -33280 -54771 -54938 -47578 -46276 -69701 -71042
22124 -71042 -42121 -28554 -26408 -19910 -20373 2065 20766 -1211 12883 -23550 -65201 -57194 -34034
22111 -34034 23064 -8736 -29387 -13209 1727 18667 63546 13962 -14589 -9045 -62679 -53738
22099 -53738 -21557 -56252 -35391 -53585 -50863 -37632 -35655 -29461 9207 82714 111107 65589
22087 65589 -41606 -44535 -14657 -7473 -29943 -21414 -37626 -21138 -18251 7357 31789 -28323
22075 -28323 -94499 -79643 -90417 -90244 -124897 -113221 -90342 -40692 -66590 -91462 -72952 876
$$ packed form
22161C9652k8047n1783l4991O0375N4940r128k3110j5087j7271j4408k2836j6702
22149g8396n1456J4908L2838J1355q7821J0902R568N0644L1156R035q260m179
22137e9706O772l8209m3400L7174N9823J4119r853k1491j67P360J302k3425j341
22124g1042K8921J3567K146O498m63K2438J8701k1977J4094l6433m1651Q007K3160
22111c4034N7098l1800k0651J6178J4936J6940M4879m9584k8551N544n3634Q941
22099e3738L2181l4695K0861j8194K722J3231J977O194L8668P3507K8393m5518
22087F5589j07195k929K9878P184k2470Q529j6212J6488K887K5608K4432o0112
22075b8323o6176J4856j0774J73l4653J1676K2879M9650k5898k4872J8510P3828
$$ plain form
22063 876 41101 21399 21075 -2784 -25424 -14025 -6297 16785 36012 47906 -13718 -17565 -44983
22050 -44983 -96735 -83705 -17624 -33616 -67808 -61537 -36053 -21223 15066 7893 3276 -42221
22038 -42221 -38298 -7610 -27100 13899 10680 7682 -32683 -39974 -66634 -95633 -50117 -4669
22026 -4669 -7954 -24823 -47098 -35639 -21633 -18323 -5046 -40344 -47709 -63710 -9753 50027
22014 50027 17022 26655 31687 4429 -47050 -26857 -31991 -40969 -15926 -9536 -4457 -49072 -58607
22001 -58607 -23093 -18590 -15384 15344 31307 28318 9411 14246 34748 46610 12546 11558 -31600
21988 -31600 -55990 29675 7595 12553 19071 41332 -40079 -56776 -23993 -53074 -61948 12942
21976 12942 65714 47131 32554 47727 67612 15954 -23369 -2723 -2149 30472 45593 18754
$$ packed form
22063H76M0225j9702l24k3859k2640J1399P728K3082J9227J1894o1624l847k7418
22050d4983n1752J3030O6081j5992l4192O271K5484J4830L6289p173m617m5497
22038d2221L923L0688j9490M0999l219k998m0365p291k6660k8999M5516M5448
22026d669l285j6869k2275J1459J4006L310J3277l5298p365j6001N3957N9780
22014E0027l3005R633N032k7258n1479K0193n134q978K5043O390N079m4615r535
22001e8607L5514M503L206L0728J5963k989j8907M835K0502J1862l4064r88m3158
21988c1600k4390Q5665k2080M958O518K2261q1411j6697L2783k9081q874P4890
21976A2942N2772j8583j4577J5173J9885n1658l9323K0646N74L2621J5121k6839
$$ plain form
21964 18754 46636 49742 47527 7719 -18591 -653 12251 18748 -7064 -13974 -15611 -24096 -4209
21951 -4209 -43879 -21154 22489 -972 -22856 -23752 -81227 -42603 37953 57401 -7279 4526
21939 4526 -15714 -16396 -66436 -29592 -71570 -96654 -51988 -44092 -57239 -16939 3650 -22938
21927 -22938 14752 26957 -29835 -59257 -52759 -27983 -39399 -10472 -29795 -72176 -100111 -100303
21915 -100303 -84319 -9772 -36232 -68505 -62079 -19555 20888 27291 1296 -1215 -8710 -48855
21903 -48855 -65823 -4156 50866 25451 33470 51447 83526 82316 21834 35932 29868 -13754
21891 -13754 -70269 -82559 -56522 -54249 -8616 -33269 -20503 12634 -53872 -70754 -45891 -16886
21879 -16886 -55134 -64018 -16200 -11770 -24921 -13518 -6524 -23599 -21640 8863 5992 -21941 -19597
$$ packed form
21964A8754K7882L106k215l9808k6310J7938J2904O497k5812o910j637q485J9887
21951d209l9670K2725M3643k3461k1884q96n7475L8624Q0556J9448o4680J1805
21939D526k0240o82n0040L6844m1978k5084M4666P896j3147M0300K0589k6588
21927b2938L7690J2205n6792k9422O498K4776j1416K8927j9323m2381k7935j92
21915a00303J5984P4547k6460l2273O426M2524M0443O403k5995k511p495m0145
21903d8855j6968O1667N5022k5415Q019J7977L2079j210o0482J4098o064m3622
21891a3754n6515j2290K6037K273M5633k4653J2766L3137o6506j6882K4863K9005
21879a6886l8248q884M7818M430j3151J1403O994j7075J959L0503k871k7933K344
$$ plain form
21866 -19597 -41722 -72374 -95578 -117827 -91839 -38495 443 7380 43830 16274 -45394 -89048
21854 -89048 -24519 -9018 -607 12618 -977 -27156 -37022 -19974 -49134 -63064 -65126 -46572
21842 -46572 -64144 -63711 -28600 -33788 -75585 -61779 -5301 -16689 7555 6096 -13210 -46735
21830 -46735 -16988 -15886 -7391 15201 -15689 -30630 -39227 -60950 -16732 17871 61933 12881
21818 12881 -38678 -51686 -49801 -98282 -112729 -106677 -82632 -53070 -45345 -4189 -12148 16071
21806 16071 29173 -14967 -29744 -8915 -27110 -46276 -33494 -23781 -4001 24028 2049 -30177
21794 -30177 -25334 61499 46850 27752 509 -16316 29842 40244 40350 96023 87960 35268
21782 35268 28010 -28423 -57154 -67371 -97392 -108456 -124477 -100925 -59769 -23750 -21592 -12182
$$ packed form
21866a9597k2125l0652k3204k2249K5988N3344L8938O937L6450k7556o1668m3654
21854h9048O4529J5501Q411J3225j3595k6179r866J7048k9160j3930k062J8554
21842d6572j7572M33L5111n188m1797J3806N6478j1388K4244j459j9306l3525
21830d6735K9747J102Q495K2592l0890j4941q597k1723M4218L4603M4062m9052
21818A2881n1559j3008J885m8481j4447O052K4045K9562P725M1156p959K8219
21806A6071J3102m4140j4777K0829j8195j9166J2782R713J9780K8029k1979l2226
21794c0177M843Q6833j4649j9098k7243j6825M6158J0402J06N5673q063n2692
21782C5268p258n6433k8731j0217l0021j1064j6021K3552M1156L6019K158R410
$$ plain form
21770 -12182 -10463 -54704 -68853 -42139 2309 -28441 -11754 4882 15446 -9191 -10330 19640
21758 19640 19735 -12688 26613 17387 10815 24644 5703 -48232 -58378 -75067 -76563 -61536 -67286
21745 -67286 -44502 -41715 -32519 759 -2065 75 -2518 17284 13048 15817 37072 40390 9451
21732 9451 7783 2664 -10215 17037 29465 53436 29634 -6996 -21634 -83236 -62790 -21864
21720 -21864 -31824 -49554 -30225 -12862 8646 19311 26989 24865 14369 34485 48992 50379
21708 50379 33572 -9695 -34093 -41552 -64859 -80881 -43185 -17706 -16937 -38851 -54560 -19033
21696 -19033 -8888 -13798 -44373 -67252 -86515 -123338 -110722 -88108 -76756 18859 47431 15160
21684 15160 3214 -10917 -55604 -36962 21524 66380 72762 59458 64217 25406 -49574 -59860
$$ packed form
21770a2182J719m4241j4149K6714M4448l0750J6687J6636J0564k4637j139K9970
21758A9640R5l2423L9301r226o572J3829j8941n3935j0146j6689j496J5027n750
21745f7286K2784K787R196L3278k824K140k593J9802m236K769K1255L318l0939
21732I451j668n119j2879K7252J2428K3971k3802l6630j4638o1602K0446M0926
21720b1864r960j7730J9329J7363K1508J0665P678k124j0496K0116J4507J387
21708E0379j6807m3267k4398p459k3307j6022L7696K5479P69k1914j5709L5527
21696a9033J0145m910l0575k2879j9263l6823J2616K2614J1352R5615K8572l2271
21684A5160j1946j4131m4687J8642N8486M4856O382j3304M759l8811p4980j0286
$$ plain form
21672 -59860 -28789 -19132 12881 6565 -8613 25097 57532 72549 19510 -26967 -10937 -21437
21660 -21437 -69 -13298 -71041 -76365 -69147 -16822 -4983 -46885 -80278 -128905 -158906 -115214
21648 -115214 -41653 -73384 -78292 -51228 -34632 -13056 6671 -25198 -19297 19590 55473 -11216
21636 -11216 -33913 -16210 13093 36861 74130 63769 21155 -11846 9823 2592 42543 94812
21624 94812 113054 69020 54138 76382 17605 -57472 -50571 2628 -13532 -15385 -8220 -59227
21612 -59227 -78306 -116147 -100628 -83178 -54265 -11739 -27863 -3295 37547 5150 -26641 -57134
21600 -57134 -18203 68267 88734 53625 -8745 -9370 9524 20602 18398 31359 -6109 -12656
21588 -12656 17736 -20050 -9950 -3840 11431 20072 22180 49922 86078 60039 35764 32816
$$ packed form
21672e9860L1071R657L2013o316j5178L3710L2435J5017n3039m6477J6030j0500
21660b1437K1368j3229n7743n324P218N2325J1839m1902l3393m8627l0001M3692
21648a15214P3561l1731m908K7064J6596K1576J9727l1869N901L8887L5883o6689
21636a1216k2697J7703K9303K3768L7269j0361m2614l3001K1669p231L9951N2269
21624I4812J8242m4034j4882K2244n8777p5077O901N3199j6160j853P165n1007
21612e9227j9079l7841J5519J7450K8913M2526j6124K4568M0842l2397l1791l0493
21600e7134L8931Q6470K0467l5109o2370o25J8894J1078k204J2961l7468o547
21588a2656L0392l7786J0100O110J5271Q641K108K7742L6156k6039k4275k948
$$ plain form
21576 32816 1057 -47046 -69293 -43159 -34166 -32473 -13025 -11588 -59506 -12853 -10372 -59063
21564 -59063 -44396 -29880 -36728 -42164 -10483 19537 40246 3375 29326 32030 31212 3654 9946
21551 9946 33304 39224 25475 25301 43934 45423 34694 20923 63448 88685 27401 -15054 -14345
21538 -14345 5871 -8951 -20912 -41860 -66242 -70895 -92402 -82864 -78790 -57667 -56602 -14572
21526 -14572 -39877 -29574 14641 -16555 9153 28659 -2487 -34433 8082 -19489 -24484 25567
21514 25567 33759 -4464 -60766 -61894 -17566 8711 -29870 -55320 -62090 -70250 -66202 -27781 6559
21501 6559 39703 26481 -38591 13111 57118 56061 52067 39132 -4395 17635 -29129 -49245
21489 -49245 25348 38485 -1554 48383 60021 15736 -22177 -42362 -87529 -82566 -37111 -59553
$$ packed form
21576C2816l1759m8103k2247K6134Q993J693J9448J437m7918M6653K481m8691
21564e9063J4667J4516o848n436L1681L0020K0709l6871K5951K704q18k7558O292
21551I946K3358N920j3749j74J8633J489j0729j3771M2525K5237o1284m2455P09
21538a4345K0216j4822j1961k0948k4382m653k1507R538M074K1123J065M2030
21526a4572k5305J0303M4215l1196K5708J9506l1146l1946M2515k7571m995N0051
21514B5567Q192l8223n6302j128M4328K6277l8581k5450o770q160M048L8421L4340
21501F559L3144j3222o5072N1702M4007j057l994j2935m3527K2030m6764k0116
21489d9245P4593J3137m0039M9937J1638m4285l7913k0185m5167M963M5455k2442
$$ plain form
21477 -59553 -34403 38952 28645 -90852 -109696 -96825 -54037 -14500 -47397 -39709 -38621 597
21465 597 5832 16791 -5063 -62375 -89684 -19379 1443 -67057 -46267 -25391 -21006 36734
21453 36734 -4625 -67213 -96871 -93996 -105932 -61213 -49045 -60122 -92762 -98841 -29531 31419
21441 31419 -5121 -43641 -52244 -102367 -84853 -67262 -51005 -76987 -60156 -59886 -100243 -98786
21429 -98786 -34397 -15120 -67312 -84335 -23061 -37235 -85859 -94960 -22790 -22153 7061 46350
21417 46350 -2084 -9203 -41818 -58936 -36288 -45322 -77023 -58585 -50811 -47148 -79774 -38711
21405 -38711 47784 -5489 -32747 -64422 -43513 -17706 -10091 -19642 31362 90046 86153 11538
21393 11538 -10627 -21201 -14540 -43273 -81286 -92853 -40747 12562 20221 40391 47740 93184
$$ packed form
21477e9553K5150P3355j0307j19497j8844J2871M2788L9537l2897P688J088L9218
21465E97N235J0959k1854n7312k7309P0305K0822o8500K0790K0876M385N7740
21453C6734m1359o2588k9658K875j1936M4719J2168j1077l2640o079O9310O0950
21441C1419l6540l8520q603n0123J7514J7591J6257k5982J6831K70m0357J457
21429i8786O4389J9277n2192j7023O1274j4174m8624r101P2170O37K9214L9289
21417D6350m8434p119l2615j7118K2648r034l1701J8438P774L663l2626M1063
21405c8711Q6495n3273k7258l1675K0909K5807P615r551N1004N8684l893p4615
21393A1538k2165j0574O661k8733l8013j1567N2106N3309P659K0170P349M5444
$$ plain form
21381 93184 73771 36554 46948 22328 42858 59019 54214 49546 62633 73895 72260 46307
21369 46307 66043 53924 48023 101175 85792 72301 32522 7387 -6672 -15524 -52838 -111444
21357 -111444 -117538 -86282 -64863 -34652 -1495 -22247 23960 44427 48372 80255 5914 -19622
21345 -19622 -30190 -47241 -56592 -25831 -4399 -1831 20852 23816 24687 9897 -39059 -61813 -99614
21332 -99614 -111921 -78058 -63870 -64597 -49021 -18597 2885 40849 4257 -18745 -19400 -65837
21320 -65837 -88124 -28818 -17201 -46954 -76343 2318 -13840 -74776 -95103 -52886 -10820 31518
21308 31518 7031 -9299 39686 91186 57683 46686 46241 -19100 -31753 -3084 60104 87872
21296 87872 45793 -17967 -38620 12990 38582 120 -5792 24352 24683 43958 858 -56994
$$ packed form
21381I3184j9413l7217J0394k4620K0530J6161m805m668J3087J1262j635k5953
21369D6307J9736j2119n901N3152j5383j3491l9779k5135j4059q852l7314n8606
21357a11444o094L1256K1419L0211L3157k0752M6207K0467L945L1883p4341k5536
21345a9622j0568j7051r351L0761K1432K568K2683K964Q71j4790m8956k2754l7801
21332i9614j2307L3863J4188p27J5576L0424K1482L7964l6592k3002o55m6437
21320f5837k2287N9306J1617k9753k9389P8661j6158o0936k0327M2217M2066M2338
21308C1518k4487j6330M8985N1500l3503j0997m45o5341j2653K8669O3188K7768
21296H7872m2079o3760k0653N1610K5592l8462n912L0144L31J9275m3100n7852
$$ plain form
21284 -56994 -85612 -29744 -29315 -51559 -50937 -34295 4135 -14972 -18846 45810 75519 84107 58190
21271 58190 48009 65181 46601 23821 5738 6835 14714 53855 111053 95772 91715 56042
21259 56042 64059 42519 -2584 -24000 -2026 18933 -31913 -28500 -10319 -25886 -44252 -12477
21247 -12477 1948 27230 6605 -9104 -10620 1444 -7368 57337 79048 19026 -20034 68389
21235 68389 82922 -16513 -55765 -24690 -9139 9237 47161 50608 40474 -3946 -18037 -14515
21223 -14515 -15060 -45178 -50859 -51323 -74428 -88241 -126879 -121424 -117867 -136779 -131316 -97539 -61658
21210 -61658 -43204 -8349 28321 45658 44366 58966 64403 82302 110562 49608 -22619 -50920
21198 -50920 -36691 -10195 7833 -38361 -54188 -30596 916 44779 48601 48046 42787 20241
$$ packed form
21284e6994k8618N5868M29k2244O22J6642L8430j9107l874O4656K9709Q588k5917
21271E8190j0181J7172j8580k2780j8083J097P879L9141N7198j5281m057l5673
21259E6042Q017k1540m5103k1416K1974K0959n0846L413J8181j5567j8366L1775
21247a2477J4425K5282k0625j5709j516J2064q812O4705K1711o0022l9060Q8423
21235F8389J4533r9435l9252L1075J5551J8376L7924L447j0134m4420j4091L522
21223a4515n45l0118n681m64k3105j3813l8638N455L557j8912N463L3777L5881
21210f1658J8454L4855L6670J7337j292J4600N437J7899K8260o0954p2227k8301
21198e0920J4229K6496J8028m6194j5827K3592L1512M3863L822n55n259k2546
$$ plain form
21186 20241 -9780 -39537 -39457 -54629 -82021 -93902 -38178 23542 50531 25021 35956 21542
21174 21542 4693 5048 56140 69365 40244 78529 84005 77676 28364 -20464 -56056 -64595 -47085
21161 -47085 -1338 -11882 -22398 -46666 -49415 -37535 -47972 -48942 -13339 -15961 -21756 24263 6272
21148 6272 -24450 -6034 49339 81047 24236 -15543 -7269 -25645 -55510 -41066 -14307 -19762
21136 -19762 -47255 -35065 31378 48305 -4529 -39351 -17487 -45635 -106627 -61399 -51221 -52012
21124 -52012 -32565 -12264 -2482 -12370 -41276 -79026 -102434 -82666 -80934 -83416 -52863 -25881
21112 -25881 -14273 -15377 12256 88037 76268 -1369 -69666 -56559 -23024 8597 34335 -3110
21100 -3110 -50851 -38007 -16073 -28196 -63135 -47987 21780 18857 53624 79047 41939 71396
$$ packed form
21186B0241l0021k9757Q0j5172k7392j1881N5724O1720K6989k5510J0935j4414
21174B1542j6849L55N1092J3225k9121L8285N476o329m9312m8828l5592q539J7510
21161d7085M5747j0544j0516k4268k749J1880j0437r70L5603k622n795M6019j7991
21148F272l0722J8416N5373L1708n6811l9779Q274j8376k9865J4444K6759n455
21136a9762k7493J2190O6443J6927n2834l4822K1864k8148o0992M5228J0178p91
21124e2012J9447K0301R782r888k8906l7750k3408J9768J732k482L0553K6982
21112b5881J1608j104K7633P5781j1769p7637o8297J3107L3535L1621K5738l7445
21100c110m7741J2844K1934j2123l4939J5148O9767k923L4767K5423l7108K9457
$$ plain form
21088 71396 48977 15360 -2825 -20947 53288 70133 33663 26104 -26726 -60676 -44291 -45913
21076 -45913 -80994 -46783 5092 -12586 3076 -45351 -79124 -10319 -23699 -14768 -37021 -69121
21064 -69121 -76465 -97149 -94126 -57246 -16354 21360 -15561 -50206 -38540 -24391 -61247 -93382
21052 -93382 -83223 -79123 -83991 -54618 -72080 -96267 -48853 32694 26195 -47118 -128579 -178055
21040 -178055 -96224 -44826 -758 18053 -3246 -67695 -121887 -98494 -107903 -155865 -137176 -126594
21028 -126594 -96806 -92579 -23752 46121 39014 -194 -77161 -88825 -11993 -22936 -85840 -78325
21016 -78325 -60472 -51312 -92311 -100362 -119963 -135070 -80775 -51295 -31725 -12374 12025 -15987
21004 -15987 -11975 18182 24454 9780 -1284 -40494 -19562 37053 39722 -21331 -74575 -43914
$$ packed form
21088G1396k2419l3617j8185j8122P4235J6845l6470p559n2830l3950J6385j622
21076d5913l5081L4211N1875j7678J5662m8427l3773O8805j3380Q931k2253l2100
21064f9121p344k0684L023L6880M0892L7714l6921l4645J1666J4149l6856l2135
21052i3382J0159M100m868K9373j7462k4187M7414Q1547o499p3313q1461m9476
21040a78055Q1831N1398M4068J8811k1299o4449n4192K3393r409m7962J8689J0582
21028a26594K9788M227O8827O9873p107l9208p6967j1664P6832j0943o2904P515
21016g8325J7853R160m0999q051j9601j5107N4295K9480J9570J9351K4399k8012
21004a5987M012L0157O272j4674j1064l9210K0932N6615K669o1053n3244L0661
$$ plain form
20992 -43914 -30867 -75383 -91286 -95813 -76296 -46516 -16422 -19126 4322 7839 14654 28786
20980 28786 9546 -9499 8151 8927 -40265 -81946 -35356 -15048 -47625 -89930 -78118 -71526
20968 -71526 -35129 9598 23122 15490 14988 30156 21724 -33650 5980 35518 25009 46814
20956 46814 36251 -19105 -51460 -45047 -33210 -57951 -76146 -79641 -88631 -86044 -104049 -115424
20944 -115424 -63944 -40801 -42648 -75071 -35338 18051 14826 -27908 -21086 -38494 -59623 -54354
20932 -54354 -72569 -24003 -25047 -41560 -100362 -117642 -152117 -138908 -20802 18792 -36574 -62229
20920 -62229 -85095 -122374 -80518 -53974 -18820 -31948 -65070 -22495 26263 -2530 437 -4410
20908 -4410 36007 101514 77015 41095 -5420 -4158 21334 -24268 -46653 -13297 -3381 -45715
$$ packed form
20992d3914J3047m4516j5903m527J9517K9780L0094k704K3448L517O815J4132
20980B8786j9240j9045J7650P76m9192m1681M6590K0308l2577m2305J1812O592
20968g1526L6397M4727J3524p632n02J5168q432n5374L9630K9538j0509K1805
20956D6814j0563n5356l2355O413J1837k4741j8195l495q990K587j8005j1375
20944a15424N1480K3143j847l2423L9733N3389l225m2734O822j7408k1129N269
20932e4354j8215M8566j044j6513n8802j7280l4475J3209J18106L9594n5366k5655
20920f2229k2866l7279M1856K6544L5154j3128l3122M2575M8758k8793K967m847
20908d410M0417O5507k4499l5920m6515J262K5492m5602k2385L3356R916m2334
$$ plain form
20896 -45715 -28033 10900 -6517 -48549 -44022 -51910 -28022 -42922 -61738 -29734 -49381 -26178
20884 -26178 10687 2060 -48222 -65511 -27997 33432 42314 17909 61339 70829 37905 40518
20872 40518 50111 62179 96997 30505 4101 41048 64521 -14828 -59818 2632 45496 75098
20860 75098 80508 36091 9656 27710 17556 2357 -611 -24398 -44724 -62908 -108830 -105006
20848 -105006 -46664 -42413 -76611 -105089 -88421 -49678 -49253 -46507 -33978 -30323 -91051 -136366
20836 -136366 -83928 -34806 60735 103334 64462 45453 5976 -29745 -50529 -24856 -30061 3528
20824 3528 38768 1842 -61571 -74203 -74246 -74578 -55890 -21674 13544 -1393 18897 62558 74826
20811 74826 86305 93265 72136 59089 14913 -13236 -6633 -30552 -61894 10869 55516 13445
$$ packed form
20896d5715J7682L8933j7417m2032M527p888K3888j4900j8816L2004j9647K3203
20884b6178L6865q627n0282j7289L7514O1429Q882k4405M3430R490l2924K613
20872D0518R593J2068L4818o6492k6404L6947K3473p9349m4990O2450M2864K9602
20860G5098N410m4417k6435J8054j0154j5199k968k3787k0326j8184m5922L824
20848a05006N8342M251l4198k8478J6668L8743M25K746J2529L655o0728m5315
20836a36366N2438M9122R5541M2599l8872j9009l9477l5721k0784K5673n205L3589
20824C528L5240l6926o3413j2632m3l32J8688L4216L5218j4937K0290M3661J2268
20811G4826J1479O960k1129j3047m4176k8149O603k3919l1342P2763M4647m2071
$$ plain form
20799 13445 -25547 -79744 -81508 -123950 -130127 -125210 -129307 -113499 -7966 5298 -21438 -40058
20787 -40058 -86866 -93941 -48306 -30557 -43150 -24280 -37233 -80756 -53128 -44110 -63306 -72703
20775 -72703 -69279 -49811 -21130 15799 3876 -36374 -20751 32697 1015 -32914 -37181 -14825
20763 -14825 -9805 -55547 -92420 -91245 -86840 -80436 -32692 -11926 -62755 -103277 -95307 -92888 -52170
20750 -52170 -27308 -34840 -9808 18793 -10935 -35181 -10468 30270 64829 104146 46542 22482
20738 22482 20480 10578 -13333 -23608 -4149 -34439 -40804 -1785 15082 18779 2370 -6562 424
20725 424 -26976 -17561 -7208 21112 18214 -6453 36193 62509 27346 10079 -6724 54638
20713 54638 69366 44705 30127 -41275 -117257 -76749 -68264 -45966 -15379 -25182 -15232 -11972
$$ packed form
20799A3445l8992n4197j764m2442o177M917m097J5808J05533J3264k6736j8620
20787d0058m6808p075M5635J7749j2593J8870j2953m3523K7628R018j9196r397
20775g2703L424J9468K8681L6929j1923m0250J5623N3448l1682l3929m267K2356
20763a4825N020m5742l6873J175M405O404M7744K0766n0829m0522P970K419M0718
20750e2170K4862p532K5032K8601k9728k4246K4713M0738L4559L9317n7604k4060
20738B2482k002r902k3911j0275J9459l0290o365L9019J6867L697j6409q932O986
20725D24k7400R415J0353K8320k898k4667M2646K6316l5163j7267j6803O1362
20713E4638J4728k4661j4578p1402p5982M0508Q485K2298L0587r803R950L260
$$ plain form
20701 -11972 -4520 40431 65568 78115 50765 -9496 -24190 -34743 -66823 -78528 -60303 -11069
20689 -11069 -20647 -67367 -120910 -101771 -63269 -67176 -43492 -59875 -59068 -15603 4991 -19943
20677 -19943 -51982 -60621 -33165 -28958 3261 717 10163 -38449 -69892 -44016 -29832 -98046
20665 -98046 -116121 -113439 -97124 -104613 -83089 -78901 -42226 5054 57286 72705 47779 42077
20653 42077 25063 -9470 21133 37282 28192 44169 26541 49582 39907 24876 -36223 -46647
20641 -46647 -73066 -41603 10787 7566 -10472 -21020 20158 18987 21995 21743 11582 46391 4720
20628 4720 13470 -25661 -17766 1924 -9538 -37712 -29493 -3048 46207 81006 51610 -1119
20616 -1119 10268 -21359 -23597 -8255 8973 -14930 -17987 -7950 -1054 44031 56773 23082
$$ packed form
20701a1972P452M4951K5137J2547k7350o0261j4694j0553l2080j1705J8225M9234
20689a1069r578m6720n3543J9139L8502l907K3684j6383Q07M3465K0594k4934
20677a9943l2039q639K7456M207L2219k544R446m8612l1443K5876J4184o8214
20665i8046j8075K682J6315p489K1524M188L6675M7280N2232J5419k4926n702
20653D2077j7014l4533L0603J6149r090J5977j7628K3041r675j5031o1099j0424
20641d6647k6419L1463N2390l221j8038j0548M1178j171L008k52j0161L4809m1671
20628D720Q750l9131P895J9690j1462k8174Q219K6445M9255L4799k9396n2729
20616a119J1387l1627k238J5342J7228k3903l057J0037O896M5085J2742l3691
$$ plain form
20604 23082 -23457 -3744 -9900 -23963 -86798 -75006 -14760 -9460 -19140 -21481 -24783 44529 66399
20591 66399 70553 85531 84550 72907 51305 17651 -4666 -55350 -37992 -24132 -16852 -18482 34147
20578 34147 32279 -29611 -9640 -73518 -99166 7792 27833 -714 -18033 -56415 -59096 -89054
20566 -89054 -85910 -115808 -71454 -24666 -5913 -21093 -36196 -61462 -23930 3158 59471 76750
20554 76750 35025 9236 -8123 -6281 618 -52920 -124702 -135343 -61259 -65569 -84149 -60347
20542 -60347 -32019 -45739 -58791 -32108 -30788 -66320 -95162 -63995 -45299 -70652 -68431 -42345
20530 -42345 -41314 -31987 -25120 -6740 -51956 -59416 -29731 27849 29722 16619 83300 100204 104452
20517 104452 86021 51071 46201 34853 14229 -29003 -39263 -80836 -73819 -16720 -11219 -30216
$$ packed form
20604B3082m6539J9713o156j4063o2835J1792O0246N300r680k341l302O9312K1870
20591F6399M154J4978r81j1643k1602l3654k2317n0684J7358J3860P280j630N2629
20578C4147j868o1890J9971o3878k5648J06958K0041k8547j7319l8382k681k9958
20566h9054L144k9898M4354M6788J8753j5180j5103k5266L7532K7088N6313J7279
20554G6750m1725k5789j7359J842O899n3538p1782j0641P4084m310j8580K3802
20542f0347K8328j3720j3052K6683J320l5532k8842L1167J8696k5353K221K6086
20530d2345J031R327O867J8380m5216p460K9685N7580J873j3103O6681J6904M248
20517A04452j8431l4950m870j1348k0624m3232j0260m1573P017N7099N501j8997
$$ plain form
20505 -30216 -57856 -17122 12677 74151 110186 94937 82140 47121 2618 -32079 -52995 -22130
20493 -22130 48492 44488 -10774 -57071 -113011 -70597 -23338 -5865 -6525 19110 51991 39198
20481 39198 32666 23837 -7520 21210 36426 37992 55762 20336 42337 11411 -25853 -1751
20469 -1751 30578 62845 36784 -348 -61150 -85416 -93974 -95022 -124114 -135938 -77767 -43813
20457 -43813 -83933 -91540 -46161 -29748 60716 93601 73826 62671 47195 44416 38263 35976
20445 35976 4953 -38710 -53800 -26058 -25368 -39235 -60377 -7693 -28773 -5075 -10334 -61758
20433 -61758 -99928 -72622 -60150 -13961 -26789 -49917 -45277 -42697 -78167 -86511 -75965 -54922
20421 -54922 -81580 -70821 -53532 -32330 -49016 -43675 -25505 -55095 -72924 -62937 -46972 -39208
$$ packed form
20505c0216k7640M0734K9799O1474L6035j5249j2797l5019m4503l4697k0916L0865
20493b2130P0622m004n5262m6297n5940M2414M7259J7473o60K5635L2881j2793
20481C9198o532q829l1357K8730J5216J566J7770l5426K2001l0926l7264K4102
20469a751L2329L2267k6061l7132o0802k4266q558j048k9092j1824N8171L3954
20457d3813m0120p607M5379J6413R0464L2885j9775j1155j5476k779o153k287
20445C5976l1023m3663j5090K7742O90j3867k1142N2684k1080K3698n259n1424
20433f1758l8170K7306J2472M6189j2828k3128M640K580l5470q344J0546K1043
20421e4922k6658J0759J7289K1202j6686N341J8170k9590j7829R987J5965P764
$$ plain form
20409 -39208 1708 2120 -8025 -10353 -14543 22865 -25942 -34720 -9761 -34274 -25892 -15169 -39726
20396 -39726 -40865 -31212 -29199 -25191 -789 -10072 -57600 -59834 -42307 -65841 -98637 -44922 -15942
20383 -15942 9577 41228 75813 24505 31852 -30244 -83089 -107239 -35205 -26265 8666 31922
20371 31922 7908 7644 23777 -14101 -3903 -26934 -75013 -13480 66773 39444 -13579 -19276
20359 -19276 -36407 -14509 -23107 -43465 -41200 -22226 -3714 -23444 -41133 -10048 32435 65197
20347 65197 73379 35713 32070 -15045 -49399 -81798 -86982 -50364 -51793 -100471 -153760 -98559
20335 -98559 -47519 -42184 -50488 -61539 -66945 -81941 -98620 -106218 -73959 -60548 -21212 18578
20323 18578 -15695 -54216 -7338 30058 15567 -1643 -31678 -60444 -75685 -74927 -90429 -100687
$$ packed form
20409c9208M0916M12j0145k328m190L7408m8807q778K4959k4513Q382J0723k4557
20396c9726j139R653K013M008K4402r283m7528k234J7527k3534l2796N3715K8980
20383a5942K5519L1651L4585n1308P347o2096n2845k4150P2034Q940L4931K3256
20371C1922k4014k64J6133l7878J0198k3031m8079O1533Q0253k7329n3023n697
20359a9276j7131K1898q598k0358K265J8974J8512j9730j7689L1085M2483L2762
20347F5197Q182l7666l643m7115l4354l2399n184L6618j429m8678n3289N5201
20335i8559N1040N335q304j1051n406j4996j6679p598L2259J3411L9336L9790
20323A8578l4273l8521M6878L7396j4491j7210l0035k8766j5241P58j5502j0258
$$ plain form
20311 -100687 -121284 -108834 -49326 -22539 3307 17347 -16225 3326 26973 -8205 -66468
20300 -66468 -75145 -32025 12637 7912 -8497 -1486 12530 39190 21618 15339 -4534 38380
20288 38380 94987 69035 18743 2743 59025 62070 103371 83099 38489 11290 -59451 -83425
20276 -83425 -2842 72399 34921 2719 24110 2339 -44498 -55925 -33214 -23386 -34656 -6419
20264 -6419 -3344 -8980 -28201 -65669 -51512 -19590 -9942 -7026 48982 43646 -16319 -9361 -35639
20251 -35639 -75874 -54922 -115441 -159099 -146827 -128732 -68497 -24022 -28643 -422 18282 22838
20239 22838 28662 14598 -23871 -85092 -92094 -41366 -32604 -81406 -49365 12382 73879 70304
20227 70304 42640 8854 -8457 53740 27566 28461 23480 4535 -35313 -79752 -94102 -73368
$$ packed form
20311a00687k0597J2450N9508K6787K5846J4040l3572J9551K3647l5178n8263
20300f6468q677M3120M4662m725j6409P011J4016K6660j7572o279j9873M2914
20288C8380N6607k5952n0292j6000N6282L045M1301k0272m4610k7199p0741k3974
20276h3425Q0583P5241l7478l2202K1391k1771m6837j1427K2711R828j1270K8237
20264f419L075n636j9221l7468J4157L1922R648K916N6008n336n9965O958k6278
20251c5639m0235K0952o0519m3658J2272J8095O0235M4475m621K8221J8704M556
20239B2838N824j4064l8469o1221p002N0728Q762m8802L2041O1747O1497l575
20227G0304k7664l3786j7311O2197k6174Q95m981j8945l9848m4439j4350K0734
$$ plain form
20215 -73368 -104997 -83616 -93926 -109780 -54116 -35678 -84208 -60793 2534 25134 10030 21852
20203 21852 35135 25980 25896 -4238 -39945 -26715 -8600 20023 -9791 -1914 5859 -20932 -26546
20190 -26546 -10309 21475 -42842 -83473 -81206 -7833 -10658 -2919 -31784 -37618 -7883 46231
20178 46231 14026 6973 26292 7009 13338 801 -46278 -16990 19939 21594 -4352 15871
20166 15871 45302 32327 57067 53494 38970 -1062 -8736 -8130 16550 31812 66269 39041
20154 39041 -4563 -10611 27422 60548 10185 36822 63034 40259 69321 -863 -98246 -135136
20142 -135136 -83888 -46636 -40844 -33558 -82016 -56507 -60417 -120382 -131175 -85315 -36819 -57309
20130 -57309 -97597 -99942 -56499 -145 60906 87860 54121 -6876 -70508 -105560 -126435 -86726
$$ packed form
20215g3368l1629K1381j0310j5854N5664J8438m8530K3415O3327K2600j5104J1822
20203B1852J3283r155q4l0134l5707J3230J8115K8623k9814P877P773k6791n614
20190b6546J6237L1784o4317m0631K267P3373k825P739k8865n834K9735N4114
20178D6231l2205p053J9319j9283O329j2537m7079K9288L6929J655k5946K0223
20166A5871K9431j2975K4740l573j4524m0032p674O06K4680J5262L4457k7228
20154C9041m3604o048L8033L3126n0363K6637K6212k2775K9062p0184r7383l6890
20142a35136N1248L7252N792P286m8458K5509l910n9965j0793M5860M8496k0490
20130e7309m0288k345M3443N6354O1051K6954l3739o0997o3632l5052k0875L9709
$$ plain form
20118 -86726 -51643 -64868 -21782 -4886 -57441 -59001 -3565 13986 -3534 -20208 -34763 -54040
20106 -54040 -31920 -17363 -21917 2577 11607 -40484 -51962 -5612 45144 40339 17601 -8287
20094 -8287 -35918 -5412 -4604 13174 -11860 -28040 -49122 -9929 -9661 -29152 -31487 4716 45824
20081 45824 40050 -36681 -47653 -47373 -68388 -108527 -95147 -64260 -50801 -54236 1697 -10007
20069 -10007 -56369 -48536 -8407 -6759 -25499 -50739 -70219 -69339 -72560 -82844 -23620 -7786 -51364
20056 -51364 -94359 -97377 -15899 50355 28518 53863 53463 13714 -1217 -31195 -80667 -31834
20044 -31834 -10387 -44197 -42322 -27369 -22182 -13303 -5746 -5587 -3111 11509 -163 11561 13304
20031 13304 -22696 -42928 -31642 -2016 18187 29265 2114 -13517 -28126 -44827 -67311 -75019
$$ packed form
20118h6726L5083j3225M3086J6896n2555j560N5436J7551j7520j6674j4555j9277
20106e4040K2120J4557m554K4494R030n2091j1478M6350N0756m805k2738k5888
20094h287k7631L0506Q08J7778k5034j6180k1082L9193K68j9491k335L6203M1108
20081D5824n774p6731j0972K80k1015m0139J3380L0887J3459l435N5933j1704
20069a0007m6362P833M0129J648j8740k5240j9480Q80l221j0284N9224J5834m3578
20056e1364m2995l018Q1478O6254k1837K5345m00l9749j4931k9978m9472M8833
20044c1834K1447l3810J875J4953N187Q879P557J59K476J4620j1672J1724J743
20031A3304l6000k0232J1286K9626K0203J1078k7151j5631j4609j6701k2484p708
$$ plain form
20019 -75019 -93242 -109963 -98428 -41118 -42829 -83645 -101716 -87410 -136644 -93124 -101999 -31332
20007 -31332 -12650 -48476 -34343 25978 46411 37337 23173 -11480 -9196 -10909 -33629 -2445
19995 -2445 -24365 -31092 -15470 -20223 -80796 -113991 -104264 -81781 -35325 -21176 -9214 -9816 -29397
19982 -29397 -65458 -39017 -64609 -71108 -59228 -49136 -40805 -45426 -14941 -40210 -23291 -5556
19970 -5556 1840 10433 -22150 -50959 -21662 -15848 -7943 21540 -6671 -17633 53454 42492 17840
19957 17840 -15538 -76118 -83184 -88163 -73746 -48632 -11899 -44225 -51363 -10385 -7967 -20645
19945 -20645 -49900 -30945 -59572 -111247 -65044 18425 -11825 -54527 -31079 -22544 -21912 -15642
19933 -15642 -49623 -34050 10664 1805 -39547 -80373 -47389 13834 -8848 -66280 -69153 -31485
$$ packed form
20019g5019j8223j6721J1535N7310j711m0816j8071J4306m9234M3520q875P0667
20007c1332J8682l5826J4133O0321K0433r074j4164l4653K284j713k2720L1184
19995b445k1920o727J5622m753o0573l3195R727K2483M6456J4149J1962o02j9581
19982b9397l6061K6441k5592o499J1880J0092Q331m621L0485k5269J6919J7735
19970e556P396Q593l2583k8809K9297N814P905K9483k8211j0962P1087j0962k4652
19957A7840l3378o0580p066m979J4417K5114L6733l2326p138M0978K418j2678
19945b0645k9255J8955k8627n1675M6203Q3469l0250m2702K3448Q535O32O270
19933a5642l3981J5573M4714q859m1352m0826L2984O1223k2682n7432k873L7668
$$ plain form
19921 -31485 -22589 -49338 -70629 -99217 -72388 -42299 -55625 -30593 -7000 13868 23993 12738
19909 12738 6729 -2328 -124 -22656 -6345 14178 -9676 -5563 3760 2098 -39219 -58774 5116
19896 5116 40428 31435 -13879 -106384 -118017 -59767 -11952 -21890 -31155 -52492 -40579 -66844
19884 -66844 -87269 -83326 -50402 -12181 -34751 -16230 35713 50100 22891 -21100 -38635 -90447
19872 -90447 -137233 -109346 -41939 -46517 -33793 -59258 -46157 -3688 -17537 -49817 -35869 -1152
19860 -1152 -17337 -55113 -49773 -12276 -32810 -78678 -99585 -71229 -4894 36010 46805 39402
19848 39402 23746 205 -33285 -79775 -120286 -66269 119 25259 -1501 -43630 -77110 -61731
19836 -61731 -12838 78694 58315 -7453 -6586 42806 83429 68687 13244 -27744 -39292 -69395
$$ packed form
19921c1485Q896k6749k1291k8588K6829L0089j3326K5032K3593K0868J0125j1255
19909A2738o009r057K204k2532J6311K0523k3854M113R323j662m1317j9555O3890
19896E116L5312q993m5314r2505j1633N8250M7815r938r265k1337J1913k6265
19884f6844k0425L943L2924L8221k2570J8521N1943J4387k7209m3991j7535n1812
19872i0447m6786K7887O7407m578J2724k5465J3101M2469j3849l2280J3948L4717
19860a152j6185l7776N340L7497k0534m5868k0907K8356O6335M0904J0795p403
19848C9402j5656k3541l3490m6490m0511N4017O6388K5140k6760m2129l3480J5379
19836f1731M8893R1532k0379o5768Q67M9392M0623j4742n5443m0988j1548l0103
$$ plain form
19824 -69395 -62533 -15092 -4800 25142 56430 68353 38766 7485 25675 -1757 3686 19520
19812 19520 19455 1439 38125 63114 85355 90647 65162 17390 6534 -658 -874 -27093 -14456
19799 -14456 5653 -5623 -32662 -58026 -60912 -21860 -52327 -57204 -75364 -89243 -66276 -55593
19787 -55593 -1615 15416 3286 32077 72036 100800 60616 -22055 -64976 -9035 1734 55342
19775 55342 63052 25806 -52966 -54566 6223 23607 -2036 -10854 -16278 5946 24240 -10838
19763 -10838 -1592 13686 29350 50155 9806 -17589 -45436 -60063 -81046 -52781 21833 27786
19751 27786 46940 76308 53510 14448 5384 17128 22251 26252 36256 32576 7133 -20909
19739 -20909 5829 20406 -1781 -36227 -1082 25971 6094 -41408 -43303 -23828 -22093 -11721
$$ packed form
19824f9395O862M7441J0292K9942L1288J1923k9587l1281J8190k7432N443J5834
19812A9520o5j8016L6686K4989K2241N292k5485m7772j0856p192k16k6219J2637
19799a4456K0109j1276k7039k5364k886L9052l0467m877j8160j3879K2967J0683
19787e5593N3978J7031j2130K8791L9959K8764m0184q2671m2921N5941J0769N3608
19775E5342P710l7246p8772j600O0789J7384k5643q818n424K2224J8294l5078
19763a0838R246J5278J5664K0805m0349k7395k7847j4627k0983K8265P4614N953
19751B7786J9154K9368k2798l9062r064J1744N123M001J0004l680k5443k8042
19739b0909K6738J4577k2187l4446L5145K7053j9877m7502j895J9475J735J0372
$$ plain form
19727 -11721 -20490 -99695 -99421 -47166 17207 64639 126588 111993 124805 116239 128586 98245
19715 98245 57281 63999 62065 50902 52134 75787 40621 9726 25546 56946 22132 -15576
19703 -15576 36285 30011 -50046 -60748 -52329 -39173 -47854 -98768 -74989 -61772 -83343 -30000
19691 -30000 -5437 34928 50212 27231 -1359 12461 61790 37177 13816 9824 16059 -5297
19679 -5297 -7952 -17815 -7256 13360 -32224 -33401 -39931 7508 5819 -10709 -8658 28143 15926
19666 15926 7506 5463 43344 34612 -36616 -32198 -61707 -89173 -78403 -11170 -7180 -16075 17454
19653 17454 37445 -6796 39399 54029 72114 157001 127847 86386 90970 52079 14778 12883
19641 12883 18340 33629 8236 21253 9143 16020 59789 23472 -37013 -36862 -11167 27713
$$ packed form
19727a1721q769p9205K74N2255O4373M7432O1949j4595J2812q566J2347l0341
19715I8245m0964O718j934j1163J232K3653l5166l0895J5820L1400l4814l7708
19703a5576N1861o274q0057j0702Q419J3156q681n0914K3779J3217k1571N3343
19691c0000K4563M0365J5284k2981k8590J3820M9329k4613k3361l992O235k1356
19679e297k655r863J0559K0616m5584j177o530M7439j689j6528K051L6801j2217
19666A5926q420k043L7881q732p1228M418k9509k7466J0770O7233L990q895L3529
19653A7454J9991m4241M6195J4630J8085Q4887k9154m1461M584l8891l7301j895
19641A2883N457J5289k5393J3017j2110O877M3769l6317o0485J51K5695L8880
$$ plain form
19629 27713 33041 -12191 -9484 -6894 -8340 18874 55243 20437 -7352 21883 20603 17913 27295
19616 27295 79500 66230 -15393 -56243 -90725 -85274 -57355 -28560 -63129 -73806 -74641 -53676
19604 -53676 -50811 38070 72817 45609 32965 55115 85422 38765 -16415 31567 46873 7788
19592 7788 -4575 23044 -9256 7547 24189 -2222 -66391 -66567 -27445 5307 25511 23330
19580 23330 -21867 -20842 -4221 -17231 -31437 -70590 -91766 -75135 -64740 -14278 -31656 -49375
19568 -49375 -86922 -99768 -59892 -37563 -10236 5651 26831 10168 -9023 -10195 4307 -22940
19556 -22940 -5031 23127 10820 -7104 -20879 -33903 -32054 -36778 -64095 -22795 25431 28969
19544 28969 1187 -16072 -19604 -11546 22779 33352 -2047 -46961 -19707 5354 -56293 -81454
$$ packed form
19629B7713N328m5232K707K590j446K7214L6369l4806k7789K9235j280k690R382
19616B7295N2205j3270q1623m0850l4482N451K7919K8795l4569j0677q35K0965
19604e3676K865Q8881L4747k7208j2644K2150L0307m6657n5180M7982J5306l9085
19592G788j2363K7619l2300J6803J6642k6411o4169j76L9122L2752K0204k181
19580B3330m5197J025J6621j3010j4206l9153k1176J6631J0395N0462j7378j7719
19568d9375l7547j2846L9876K2329K7327J5887K1180j6663j9191j172J4502k7247
19556b2940J7909K8158j2307j7924j3775j3024J849m724k7317M1300M8226L538
19544B8969k7782j7259l532Q058L4325J0573l5399m4914K7254K5061o1647k5161
$$ plain form
19532 -81454 -73294 -67785 -95149 -58880 -24383 6552 38184 49289 58736 62883 13533 34203
19520 34203 74357 70928 44854 33588 -22448 -41392 -27384 -14956 9509 34064 21858 -2238
19508 -2238 -12675 -21830 -7506 5068 -1721 -51127 -57330 -25460 -32007 -92252 -37670 -54245 -54938
19495 -54938 13456 72400 118934 116585 53633 24575 32037 -13869 -30598 -44758 -25401 5735
19483 5735 -2377 -11423 -19895 -58950 -50152 -30356 -34196 -21101 -60594 -58339 -30151 -29086 18106
19470 18106 35554 31439 46570 509 -31250 1430 -15450 9814 73100 69582 67245 35632
19458 35632 55931 84611 74884 9687 12509 8558 -24350 -91110 -90585 -58321 -13133 36367 93708
19445 93708 84109 109947 52589 15334 -3108 15094 30963 43872 5542 -8931 8815 20013
$$ packed form
19532h1454Q160N509k7364L6269L4497L0935L1632J1105R447M147m9350K0670
19520C4203M0154l429k6074j1266n6036j8944J4008J2428K4465K4555j2206k4096
19508b238j0437r155J4324J2574o789m9406o203L1870o547o0245N4582j6575o93
19495e4938O8394N8944M6534k349o2952k9058P462m5906j6729j4160J9357L1136
19483E735q112r046q472l9055Q798J9796l840J3095l9493K255K8188J065M7192
19470A8106J7448m115J5131m6061l1759L2680j6880K5264O3286l518k337l1613
19458C5632K0299K8680r727o5197K822l951l2908o6760N25L2264M5188M9500N7341
19445I3708r599K5838n7358l7255j8442J8202J5869J2909l8330j4473J7746J1198
$$ plain form
19433 20013 18170 14369 38289 87048 104927 146512 198909 124139 65711 34931 -476 68053
19421 68053 108562 113250 76670 44464 11340 6171 21794 16334 14805 1400 -23287 33691
19409 33691 31620 -12383 1793 45260 52667 52214 38608 20454 14333 59692 112110 46681 9340
19396 9340 23602 16988 4205 34820 59738 47023 37517 45373 35451 21540 -21104 -42863 -24387
19383 -24387 -17444 8041 13725 44628 83267 25069 -4275 -48039 -21520 6430 -3289 7724
19371 7724 55792 69515 94035 48955 -13054 -11296 9758 76960 57630 27487 33021 21965
19359 21965 63060 101978 80073 3812 14080 61762 67996 107227 92298 66638 20242 -37285
19347 -37285 -66211 -82799 -50455 -53467 -16988 -4058 7489 34256 37061 61356 37594 -74987
$$ packed form
19433B0013j843l801K3920M8759J7879M1585N2397p4770n8428l0780l5407O8529
19421F8053M0509M688l6580l2206l3124n169J5623n460j529j3405k4687N6978
19409C3691k071m4003J4176M3467P407m53j3606j8154o121M5359N2418o5429l7341
19396I340J4262o614j2783L0615K4918j2715r506P856r922j3911m2644k1759J8476
19383b4387O943K5485N684L0903L8639n8198k9344m3764K6519K7950r719J1013
19371G724M8068J3723K4520m5080o2009J758K1054O7202j9330l0143N534j1056
19359B1965M1095L8918k1905p6261J0268M7682O234L9231j4929k5660m6396n7527
19347c7285k8926j6588L2344l012L6479J2930J1547K6767K805K4295k3762j12581
$$ plain form
19335 -74987 -111289 -111545 -105251 -75193 -33149 -7806 -20483 4435 9595 40656 55630 54757 35546
19322 35546 9600 35396 63063 51042 54308 30667 -16302 -63856 16050 53861 68831 59776
19310 59776 15022 27882 50040 43059 56100 7224 30526 21302 -217 -21325 -28917 -60334
19298 -60334 -60819 -28485 -9640 -57041 -48826 13133 28788 48127 33403 56202 48915 35577
19286 35577 33688 29150 -10995 25877 9953 -7922 8023 48446 49976 20968 29500 72314
19274 72314 131318 112553 103435 94608 54635 28459 34823 50495 62597 87672 33907 27221
19262 27221 59129 82806 46171 4609 23180 27280 2603 11541 8811 12565 40374 16974
19250 16974 36598 18735 -57145 -76419 -16901 40180 78682 61575 55282 12369 -38594 -35143
$$ packed form
19335g4987l6302k56O294L0058M2044K5343j2677K4918N160L1061J4974q73j9211
19322C5546k5946K5796K7667j2021L266k3641m6969m7554P9906L7811J4970r055
19310E9776m4754J2860K2158o981J3041m8876K3302r224k1519k1108p592l1417
19298f0334m85L2334J8845m7401Q215O1959J5655J9339j4724K2799p287j3338
19286C5577j889m538m0145L6872j5924j7875J5945M0423J530k9008Q532M2814
19274G2314N9004j8765r118q827l9973k6176O364J5672J2102K5075n3765o686
19262B7221L1908K3677l6635m1562J8571M100k4677Q938k730L754K7809k3400
19250A6974J9624j7863p5880j9274N9518N7081L8502j7107o293m2913n0963L451
$$ plain form
19238 -35143 8135 -14296 -47650 -26326 24861 43058 6875 -32372 2796 69646 80936 61409
19226 61409 49119 45236 94596 86401 92668 92597 69816 26660 -9298 -1609 25695 45430 446
19213 446 58483 71201 23078 -33530 18878 71888 54417 18150 64097 121979 98725 71649
19201 71649 103983 117870 76163 83421 107474 87065 94926 76821 63751 41309 56528 25642
19189 25642 61282 87634 81577 45208 2908 6300 -3360 -39433 -42578 -17405 48952 123293
19177 123293 131836 154733 98044 35627 47003 48334 30115 -28545 -49234 -17286 -29337 -10605
19165 -10605 19997 42447 34108 29617 -15525 -36033 -236 31629 -10910 -49034 -65307 -54767
19153 -54767 -24201 -4243 21867 5914 3116 21777 43236 78329 79922 116420 136091 144460
$$ packed form
19238c5143M3278k2431l3354K1324N1187J8197l6183l9247L5168O6850J1290j9527
19226F1409j2290l883M9360q195O267p1k2781m3156l5958P689K7304J9735m4984
19213D46N8037J2718m8123n6608N2408N3010j7471l6267M5947N7882k3254k7076
19201G1649L2334J3887m1707P258K4053k0409P861j8105j3070k2442J5219l0886
19189B5642L5640K6352o057l6369m2300L392r660l6073l145K5173O6357P4341
19177A23293Q543K2897n6689o2417J1376J331j8219n8660k0689L1948j2051J8732
19165a0605L0602K2450q339m491m5142k0508L5797L1865m2539l8124j6273J0540
19153e4767L0566J9958K6110j5953k798J8661K1459L5093J593L6498J9671Q369
$$ plain form
19141 144460 121297 91779 92292 46512 -2740 10781 14583 14777 90950 107199 20684 -17906
19129 -17906 -14663 -25904 -24749 16714 51468 25570 90 26551 45449 28699 17859 -3406
19117 -3406 -17107 -454 6098 40081 44231 42387 53235 10911 -66916 -74210 11691 -7198 -59092
19104 -59092 -79567 -37022 -9039 4746 -4237 -7348 -21526 -10334 87 34613 37097 34077
19092 34077 21487 49293 71679 65866 36302 31006 13947 17582 42088 30833 -22299 -67530
19080 -67530 -68584 -31117 -7725 -15021 -11145 2893 82794 128218 143178 95407 87579 95275 83438
19067 83438 88265 71036 48411 20477 36461 77533 51918 28810 49995 38086 25345 25880
19055 25880 33220 96393 164095 179699 215518 175550 146312 121849 110000 83176 54444 53134
$$ packed form
19141A44460k3163k9518N13m5780m9252J3521L802J94P6173J6249q6515l8590
19129a7906L243j1241J155M1463L4754k5898k5480K6461J8898j6750j0840k1265
19117c406j3701J6653O552L3983M150j844J0848m2324p7827p294Q5901j8889n1894
19104e9092k0475M2545K7983J3785q983l111j4178J1192J0421L4526K484l020
19092C4077j2590K7806K2386n813k9564n296j7059L635K4506j1255n3132m5231
19080f7530j054L7467K3392p296L876J4038P9901M5424J4960m7771p828P696j1837
19067H3438M827j7229k2625k7934J5984M1072k5615k3108K1185j1909j2741N35
19055B5880P340O3173O7702J5604L5819l9968k9238k4463j1849k6824k8732j310
$$ plain form
19043 53134 69894 59070 49776 67820 83419 126188 97129 60660 58775 19440 18428 25833
19031 25833 40108 27442 42411 126617 124349 68669 40081 13947 46609 72133 71597 -13737
19019 -13737 -68330 -51330 -16894 28745 84669 100699 108126 68427 60309 30960 -16172 -53061
19007 -53061 -31795 51867 -19454 -33034 20936 50551 -23055 -20300 -29610 -28679 -25538 4908 -1327
18994 -1327 21631 45232 101079 81059 54228 45115 49423 90608 99067 144145 150974 118883 86834
18981 86834 68492 96373 43788 -23715 -38498 8927 66744 59847 26525 7200 -7090 23150
18969 23150 71582 26027 41043 56901 35727 -27514 -26870 30069 150394 134096 110776 67267
18957 67267 59779 86796 93591 94754 88045 44898 61718 89693 27470 -35606 -7186 -36004
$$ packed form
19043E3134J6760j0824r294J8044J5599M2769k9059l6469j885l9335j012P405
19031B5833J4275j2666J4969Q4206k268n5680k8588k6134L2662K5524n36q5334
19019a3737n4593J7000L4436M5639N5924J6030P427l9699q118k9349m7132l6889
19007e3061K1266Q3662p1321j3580N3970K9615p3606K755r310R31L141L0446o235
18994a327K2958K3601N5847k0020k6831r113M308M1185Q459M5078O829l2091l2049
18981H6834j8342K7881n2585o7503j4783M7425N7817o897l3322j9325j4290L0240
18969B3150M8432m5555J5016J5858k1174o3241O44N6939J20325j6298k3320m3509
18957F7267p488K7017O795J163o709m3147J6820K7975o2223o3076K8420k8818
$$ plain form
18945 -36004 -58733 -11571 12426 2771 58783 76268 82044 25195 15700 79169 77273 27173
18933 27173 17114 20262 38418 20978 -38360 -39080 -9761 27574 74922 64628 38553 78189
18921 78189 110042 72126 57596 18019 -15500 -21595 -4839 1732 62666 76469 23679 53777
18909 53777 48201 63433 84150 69518 18235 12496 6674 -2137 -10801 21413 37396 41067 42559
18896 42559 4004 15329 62767 59505 62464 55159 24092 77389 82439 75889 85559 55178 50056
18883 50056 41727 32221 62364 110560 116747 131067 164249 172037 67229 19795 5411 38566
18871 38566 147661 195549 169091 152912 177306 243081 313489 330170 405627 546661 714653
18860 714653 853807 1042792 1237143 1423300 1563395 1569424 1490155 1370604 1241761 1080416
$$ packed form
18945c6004k2729M7162K3997r655N6012J7485N776n6849r495O3469j896n0100
18933B7173j0059L148J8156j7440n9338p20K9319L7335M7348j0294k6075L9636
18921G8189L1853l7916j4530l9577l3519o095J6756O571O0934J3803n2790L0098
18909E3777n576J5232K0717j4632n1283n739n822q811q664L2214J5983L671J492
18896D2559l8555J1325M7438l262K959p305l1067N3297N050o550R670l0381n122
18883E0056q329r506L0143M8196O187J4320L3182P788j04808m7434j4384L3155
18871C8566J09095M7888k6458j6179K4394O5775P0408J6681P5457J41034J67992
18860G14653J39154J88985J94351J86157J40095O029p9269j19551j28843j61345
$$ plain form
18850 1080416 883638 633974 485590 398641 319483 271899 244515 221459 173812 170274 135452
18839 135452 72646 22946 84493 131318 130487 105953 80951 100034 143252 69037 -14453 -12832
18827 -12832 21562 85432 102760 127917 130710 119736 82274 103692 109955 107780 104803 115780
18815 115780 110907 96094 157673 194964 232993 238064 191564 164686 215313 262139 337215 480930
18803 480930 656681 824164 1010230 1189881 1388619 1557635 1661973 1618642 1500532 1309853
18793 1309853 1098276 948469 781622 612927 483190 421411 353228 301641 266895 295423
18783 295423 261007 177900 139097 189708 204223 128488 71536 100300 142389 135220 90796 136499
18771 136499 194222 143007 53414 20162 -9307 -41263 36422 109123 137253 139994 143247 156976
$$ packed form
18850A080416j96778k49664j48384q6949p9158m7584k7384k3056m7647l538l4822
18839A35452o2806m9700O1547M6825q31k4534k5002J9083M3218p4215q3490J621
18827a2832L4394O3870J7328K5157K793j0974l7462K1418O263k175k977J0977
18815A15780m873j4813O1579L7291L8029N071m6500k6878N0627M6826P5076J43715
18803D80930J75751J67483J86066J79651J98738J69016J04338m3331j18110j90679
18793A309853k11577j49807j66847j68695j29737o1779o8183n1587l4746K8528
18783B95423l4416q3107l8803N0611J4515p5735n6952K8764M2089p169m4424M5703
18771A36499N7723n1215q9593l3252k9469l1956P7685P2701K8130K741L253J3729
$$ plain form
18759 156976 130467 107735 113125 82834 64064 68882 71098 118290 182440 148612 114917 123197
18747 123197 139659 117233 95302 71567 117663 151655 113638 101385 88106 80480 41021 60900
18735 60900 102502 119449 109529 95883 123143 163453 143207 87769 53073 81545 136808 106589
18723 106589 76054 86541 151490 150145 143394 133010 137549 197936 205254 232107 238662 195794
18711 195794 154934 156887 113169 132788 126803 84298 128521 161930 144479 106961 82022 98416
18699 98416 140321 160284 144179 80203 51352 99449 58425 -7367 -880 8078 -29672 -41099
18687 -41099 1645 60102 137481 149695 131280 153015 150358 142912 152736 115209 78130 68118
18675 68118 133662 156467 93707 64594 28648 41259 75673 48933 40987 32617 27239 55795
$$ packed form
18759A56976k6509k2732N390l0291j8770M818K216M7192O4150l3828l3695Q280
18747A23197J6462k2426k1931k3735M6096L3992l8017j2253j3279p626l9459J9879
18735F0900M1602J6947r920j3646K7260M0310k0246n5438l4696K8472N5263l0219
18723A06589l0535J0487O4949j345o751j0384M539O0387P318K6853O555m2868
18711A95794m0860J953m3718J9619n985m2505M4223L3409j7451l7518k4939J6394
18699I8416M1905J9963j6105o3976k8851M8097m1024o5792O487Q958l7750j1427
18687d1099M2744N8457P7379J2214j8415K1735k657p446R824l7527l7079j0012
18675F8118O5544K2805o2760k9113l5946J2611L4414k6740p946q370n378K8556
$$ plain form
18663 55795 69997 68582 70205 50713 48372 20696 5290 11648 66197 80698 122352 105956
18651 105956 59710 47780 34120 70936 61455 23719 8543 71587 115251 145660 108643 96059
18639 96059 107236 131594 68423 19537 41057 16952 -15757 5874 45409 69558 97883 102701
18627 102701 73119 47427 67648 29111 24124 38759 20725 10413 5717 52474 81942 97025
18615 97025 136505 124356 119131 136525 131855 109300 91921 78515 95382 172902 199626 156569
18603 156569 140013 96072 73893 74317 38773 68706 127184 142523 137230 131376 139830 155962
18591 155962 119528 75088 58999 103639 141621 106970 74804 45516 65626 130390 111792
18580 111792 43683 21368 26813 47798 83421 90313 44532 74737 132382 169921 201565 198323
$$ packed form
18663E5795J4202j415J623j9492k341k7676j5406O358N4549J4501M1654j6396
18651A05956m6246j1930j3660L6816r481l7736j5176O3044M3664L0409l7017j2584
18639I6059J1177K4358o3171m8886K1520k4105l2709K1631L9535K4149K8325M818
18627A02701k9582k5692K0221l8537m987J4635j8034j0312m696M6757K9468J5083
18615I7025L9480j2149n225J7394m670k2555j7379j3406J6867P7520K6724m3057
18603A56569j6556m3941k2179M24l5544K9933N8478J5339n293n854Q454J6132
18591A55962l6434m4440j6089M4640L7982l4651l2166k9288K0110O4764j8598
18580A11792o8109k2315N445K0985L5623O892m5781L0205N7645L7539L1644l242
$$ plain form
18568 198323 119791 45297 50910 41142 46285 89223 120561 188729 198677 217060 234669 197763
18556 197763 195528 209184 186198 183536 182328 166557 149409 118162 86964 118031 172904 213923
18544 213923 187296 168491 105259 93171 103853 134949 153980 131235 153279 214810 146706
18533 146706 73899 96443 86225 83319 126404 151368 111973 121876 158311 152272 184330 124575
18521 124575 158357 119442 99986 38625 16068 20931 -4611 23319 -25738 -18199 -44858 -41922
18509 -41922 -46352 -71497 -55132 -79995 -63801 20839 133161 290088 419103 574643 664524
18498 664524 698303 738883 711172 658473 593556 496482 452113 455269 396156 393601 414459 371584
18486 371584 359643 366351 308667 328837 277216 281757 274520 238429 245349 252775 198809 194685 185307
$$ packed form
18568A98323p8532p4494N613r768N143M2938L1338O8168R948J8383J7609l6906
18556A97763k235J3656k2986k662j208j5771j7148l1247l1198L1067N4873M1019
18544B13923k6627j8805o3232j2088J0682L1096J9031k2745K2044O1531o8104
18533A46706p2807K2544j0218k906M3085K4964l9395R903L6435o039L2058n9755
18521A24575L3782l8915j9456o1361k2557M863k5542K7930m9057P539k6659K936
18509d1922m430k5145J6365k4863J6194Q4640J12322J56927J29015J55540Q9881
18498F64524L3779M0580k7711n2699o4917r7074m4369L156n9113k555K0858m2875
18486C71584j1941O708n7684K0170n1621M541p237l6091O920P426n3966m124r378
$$ plain form
18473 185307 180585 130397 29481 12554 74004 94487 131767 180667 211996 290577 364398
18462 364398 381048 416987 476794 456507 461343 419179 414949 395075 349703 345044 331635 301118
18450 301118 250361 236691 195629 188487 209137 226463 291349 403266 555179 673231 779582
18439 779582 867325 917482 1031713 1128896 1226380 1333338 1382250 1373790 1273302 1138758 990393
18428 990393 862271 779534 696963 686435 659218 606218 580750 661716 613994 557961 486994
18417 486994 454925 471099 476062 459993 479149 443573 408344 397015 394260 408361 453607 568168
18405 568168 667064 772465 930145 1082766 1136820 1129852 1115015 1046382 1013078 1003769 979519
18394 979519 918357 905513 897074 857099 798038 808920 844620 793424 833227 884834 852868 855397
$$ packed form
18473A85307m722n0188j00916j6927O1450K0483L7280M8900L1329P8581P3821
18462C64398J6650L5939N9807k0287M836m2164m230j9874m5372m659j3409l0517
18450C01118n0757j3670m1062p142K0650J7326O4886J11917J51913J18052J06351
18439G79582Q7743N0157J14231R7183R7484J06958M8912q460j00488j34544j48365
18428I90393j28122q2737q2571j0528k7217n3000k5468Q0966m7722n6033p0967
18417D86994l2069J6174M963j6069J9156l5576l5229j1329k755J4101M5246J14561
18405E68168R8896J05401J57680J52621N4054o968j4837o8633l3304r309k4250
18394I79519o1162j2844q439l9975n9061J0882L5700n1196L9803N1607l1966K529
$$ plain form
18382 855397 871234 902998 905990 953474 1066200 1213974 1399662 1551060 1680635 1707583 1621531
18371 1621531 1532409 1410072 1298316 1296568 1287718 1290732 1324599 1292992 1253306 1287868 1294967 1285014
18359 1285014 1302050 1292544 1300371 1391145 1486967 1517739 1546044 1686228 1755569 1832769 1904710
18348 1904710 1951537 2034740 2157777 2287162 2416816 2556765 2725498 2859624 3022430 3234744
18338 3234744 3434654 3706125 4065978 4513895 5010179 5617068 6238182 6780469 7170538
18329 7170538 7558544 8019864 8492579 9064216 9893658 10984621 12407058 14379134 16950786
18320 16950786 20431569 25200280 31883991 41552810 55747930 76426842 105251831 142321656
18312 142321656 185751412 230736059 266445927 282029830 277612404 257088059 224971923
$$ packed form
18382H55397J5837L1764K992M7484J12726J47774J85688J51398J29575K6948q6052
18371A621531q9122j22337j11756j748q850L014L3867l1607l9686L4562P099r953
18359A285014J7036r506P827R0774R5822L0772K8305J40184O9341P7200P1941
18348A904710M6827Q3203J23037J29385J29654J39949J68733J34126J62806K12314
18338C234744J99910K71471L59853M47917M96284O06889O21114N42287L90069
18329G170538L88006M61320M72715N71637Q29442J090963J422437J972076K571652
18320A6950786L480783M768711O683711R668819J4195120K0678912K8824989L7069825
18312A42321656M3429756M4984647L5709868J5583903m417426k0524345l2116136
$$ plain form
18305 224971923 187178112 149438900 115776491 88116272 66608706 50574792 38950733
18298 38950733 30606482 24599040 20194109 16958568 14593589 12829655 11561013 10640686
18290 10640686 9979504 9470049 9040226 8584370 8142605 7743976 7333399 6944697 6669207
18281 6669207 6521766 6440555 6420743 6553155 6766509 7087061 7519864 8055679 8539856 8969678
18271 8969678 9434206 9863579 10317217 10844983 11494335 12454230 13814652 15657197 18093911
18262 18093911 21278864 25585686 31555049 40003787 52346493 70570456 97234074 133954847
18254 133954847 179971738 231792410 281836017 316133119 325684038 313685553 284888784
18247 284888784 245185987 201178073 158872079 122183824 92571244 69840190 52942609
$$ packed form
18305B24971923l7793811l7739212l3662409k7660219k1507566j6033914j1624059
18298C8950733q344251o007442m404931l235541k364979j763934j268642r20327
18290A0640686o61182n09455m29823m55856m41765l98629m10577l88702k75490
18281F669207j47441q1211j9812J32412K13354L20552M32803N35815M84177M29822
18271H969678M64528M29373M53638N27766O49352R59895J360422J842545K436714
18262A8093911L184953M306822N969363Q448738J2342706J8223963K6663618L6720773
18254A33954847M6016891N1820672N0043607L4297102R550919j1998485k8796769
18247B84888784l9702797m4007914m2305994l6688255k9612580k2731054j6897581
$$ plain form
18240 52942609 40666928 31840706 25438638 20736470 17254002 14653753 12673023 11152422
18232 11152422 10056056 9209393 8479666 7886635 7250451 6616093 5973658 5412488 4859280
18223 4859280 4360310 3955028 3567676 3231490 2947416 2706343 2544864 2359314 2201789
18214 2201789 2033573 1865344 1726474 1655250 1623924 1542158 1460741 1438594 1368722 1311777 1317320
18203 1317320 1277022 1171510 1097765 1001047 918657 883783 957366 989319 934511 898747 889855
18192 889855 857613 842650 788173 765132 777958 729540 616383 573771 605712 641302 656144
18181 656144 698710 707610 682098 648032 603475 527875 476147 441601 421779 392224 345198 346470
18169 346470 352295 274611 226335 184270 98835 101670 101958 100862 74268 5941 -55281 -114654
$$ packed form
18240E2942609j2275681q826222o402068m702168l482468k600249j980730j520601
18232A1152422j096366q46663p29727n93031o36184o34358o42435n61170n53208
18223D859280m98970m05282l87352l36186k84074k41073j61479j85550j57525
18214B201789j68216j68229j38870p1224l1326q1766q1417k2147o9872n6945N543
18203A317320m0298j05512p3745r6718q2390l4874P3583L1953n4808l5764q892
18192H89855l2242j4963n4477k3041J2826m8418j13157m2612L1941L5590J4842
18181F56144M2566Q900k5512l4066m4557p5600n1728l4546j9822k9555m7026J272
18169C46470N825p7684m8276m2065q5435K835K88j096k6594o8327o1222n9373
$$ plain form
18157 -114654 -80160 417 29745 121550 222964 296661 344775 341085 332340 358818 307486 298849
18145 298849 320079 279777 260018 291649 302350 279123 281330 240439 175474 94176 54002 -3640
18133 -3640 -43044 48219 115759 134976 135763 100372 32344 9633 13501 -21796 -43972 -46054 -59480
18120 -59480 -84196 -65766 11944 152344 277961 362997 409230 445231 426263 440416 452960
18109 452960 409844 349531 261721 230324 228824 153405 69418 18839 -46421 -68249 -96407 -46085
18097 -46085 -32983 12813 128864 211837 286779 398469 510185 504599 515653 488249 461013
18086 461013 513175 507926 437906 333000 282499 294733 243013 220552 173642 148092 182942
18075 182942 181979 155000 167549 131251 154347 165914 132195 45364 -15035 -77478 -185773 -249301
$$ packed form
18157a14654L4494Q0577K9328R1805J01414P3697M8114l690q745K6478n1332q637
18145B98849K1230m0302j9759L1631J0701k3227K207m0891o4965q1298m0174n7642
18133c640l9404R1263O7540J9217P87l5391o8028k2711L868l5297k2176k082j3426
18120e9480k4716J8430P7710J40400J25617Q5036M6233L6001j8968J4153J2544
18109D52960m3116o0313q7810l1397j500p5419q3987n0579o5260k1828k8158N0322
18097d6085J3102M5796J16051Q2973P4942J11690J11716n586J1054k7404k7236
18086D61013N2162n249p0020j04906n0501J2234n1720k2461m6910k5550L4850
18075A82942r63k6979J2549l6298K3096J1567l3719q6831o0399o2443j08295o3528
$$ plain form
18063 -249301 -282883 -286371 -284208 -259078 -149799 13749 173595 307166 398910 494013 520688
18052 520688 492435 490080 497098 506020 488560 496474 497173 415258 442948 477616 482047 458005 448059
18039 448059 466061 473161 489671 453250 418269 414406 403855 447337 455818 457675 463215 465820 489946
18026 489946 545266 727107 1006547 1291707 1606919 1941481 2183557 2328881 2304718 2083585
18016 2083585 1793644 1541357 1286451 1072917 857030 702672 621376 552120 473572 403721
18006 403721 389024 412824 423861 374296 334671 343131 373446 353807 368421 426188 446463 461281
17994 461281 438886 384184 357736 356053 330515 308928 280533 276100 265370 298134 356875 355356
17982 355356 303031 310978 328908 346382 300976 269772 229359 299129 375118 394689 373453 382723
$$ packed form
18063b49301l3582l488K163K5130J09279J63548J59846J33571R1744R5103K6675
18052E20688k8253k355P018Q922j7460P914O99q1915K7690L4668M431k4042r946
18039D48059J8002P100J6510l6421l4981l863j0551M3482Q481J857N540K605K4126
18026D89946N5320J81841K79440K85160L15212L34562K42076J45324k4163k21133
18016B083585k89941k52287k54906k13534k15887j54358q1296o9256p8548o9851
18006D03721j4697K3800J1037m9565l9625Q460L0315j9639J4614N7767K0275J4818
17994D61281k2395n4702k6448j683k5538k1587k8395m433j0730L2764N8741j519
17982C55356n2325P947J7930J7474m5406l1204m0413O9770P5989J9571k1236R270
$$ plain form
17970 382723 446603 521764 499992 496390 591399 713031 863213 1125637 1339413 1529374 1603810
17959 1603810 1498864 1312618 1177816 1056650 868735 720180 631693 576399 539329 511497
17949 511497 416024 339700 361810 336573 280707 254518 292437 325775 311107 297513 321470
17938 321470 333222 343301 322386 352027 331735 286210 280270 233845 203946 227015 254993 258021
17926 258021 243466 264992 237238 199312 239845 280893 257420 257402 254316 258063 252705 249198 246229
17913 246229 196504 177575 142926 113085 89609 85665 98325 115982 116447 92102 137659 186910
17901 186910 246654 246350 289717 331991 333848 314005 288452 292387 243378 187629 164171 216478
17889 216478 273245 315253 317542 340823 332698 298709 288562 260817 257925 259018 257850 236844
$$ packed form
17970C82723O3880P5161k1772l602R5009J21632J50182K62424K13776J89961P4436
17959A603810j04946j86246j34802j21166j87915j48555q8487n5294l7070k7832
17949E11497r5473p6324K2110k5237n5866k6189L7919L3338j4668j3594K3957
17938C21470J1752J0079k0915K9641k0292m5525n940m6425k9899K3069K7978L028
17926B58021j4555K1526k7754l7926M0533M1048k3473j8l086L747n358l507k969
17913B46229m9725j8929l4649k9841k3476l944J2660J7657M65k4345M5557M9251
17901A86910N9744l04M3367M2274J857j9843k5553L935m9009n5749k3458N2307
17889B16478N6767M2008K289K3281q125l3989j0147k7745k892J093j168k1006
$$ plain form
17877 236844 244592 236784 266198 322055 333318 330454 301245 326499 284928 283435 255670 196951
17865 196951 208659 204645 180043 218085 227147 239028 222113 193272 173438 159234 183706 214679
17853 214679 206787 205557 207149 177296 152197 168641 218838 245714 193279 201515 180507 171515
17841 171515 218124 250794 288684 280667 252348 201141 194142 239469 257182 259038 234930 197905
17829 197905 200066 200707 208309 173565 104745 115523 150169 174259 179519 228806 232274 217937 260958
17816 260958 346236 331944 281721 322887 316109 297856 246105 250368 264142 294697 242527 239104
17804 239104 272062 306132 313034 237189 248189 328161 360583 332433 249685 248593 254238 257571
17792 257571 268562 264543 271796 274584 305322 344752 315949 305394 284601 286681 300569 308343
$$ packed form
17877B36844P748p808K9414N5857J1263k864k9209K5254m1571j493k7765n8719
17865A96951J1708m014k4602L8042R062J1881j6915k8841j9834j4204K4472L0973
17853B14679p892j230J592k9853k5099J6444N0197K6876n2435Q236k1008q992
17841A71515M6609L2670L7890q017k8319n1207o999M5327J7713J856k4108l7025
17829A97905K161O41P602l4744o8820J0778L4646K4090N260M9287L468j4337M3021
17816B60958Q5278j4292n0223M1166o778j8253n1751M263J3774L0555n2170l423
17804B39104L2958L4070O902p5845J1000P9972L2422k8150q2748j092N645L333
17792B57571J0991m019P253K788L0738L9430k8803j0555k0793K080J3888P774
$$ plain form
17780 308343 313933 279904 270841 288520 301090 288382 363636 374054 278776 296326 358227 402822
17768 402822 416671 394706 384027 417946 505641 616547 785667 954303 1136891 1298819
17758 1298819 1382775 1420930 1432671 1408248 1323559 1221472 1108880 924985 781760 663259
17748 663259 598201 511831 475090 427900 363069 324548 356777 439592 461235 527190 566897
17737 566897 540692 477115 461514 467079 451839 421957 365434 367081 381520 400053 411010 406866
17725 406866 390729 366837 351331 388940 388111 381407 392049 429582 440873 428893 477713 483736
17713 483736 459977 431238 468494 510886 539038 588671 623167 718539 854016 1038929 1201311
17702 1201311 1429994 1670780 1859437 2054209 2186777 2123286 1957931 1819290 1597372 1365612
$$ packed form
17780C08343N590l4029r063J7679J2570j2708P5254J0418r5278J7550O1901M4595
17768D02822J3849k1965j0679L3919Q7695J10906J69120J68636J82588J61928
17758A298819Q3956L8155J1741k4423q4689j02087j12592j83895j43225j18501
17748F63259o5058q6370l6741m7190o4831l8521L2229Q2815K1643O5955L9707
17737E66897k6205o3577j5601N565j5240k9882n6523J647J4439J8533J0957m144
17725D06866j6137k3892j5506L7609q29o704J0642L7533J1291j1980M8820O023
17713D83736k3759k8739L7256M2392K8152M9633L4496R5372J35477J84913J62382
17702A201311K28683K40786J88657J94772J32568o3491j65355j38641k21918k31760
$$ plain form
17692 1365612 1118835 871582 723537 625805 505602 367593 248132 174283 160743 159809
17682 159809 289757 540799 848165 995926 1076800 1112019 1114169 1098978 1025995 924913 841592
17671 841592 797891 771151 735830 668926 648698 665822 632578 577431 539532 558542 558161 541186
17659 541186 513387 478312 479589 489138 478132 430782 452160 438851 414933 384224 340073 265342
17647 265342 281322 324862 455467 621562 781448 893489 960033 1011848 981925 951070 920035
17636 920035 900388 905967 854015 797510 678930 654616 663778 675950 577632 537431 465237 412271
17624 412271 414417 459693 648127 878823 1024286 1117249 1211215 1264057 1346987 1436922 1654055
17613 1654055 1969870 2172054 2081986 1761977 1479873 1331589 1241395 1183226 1142981 1125497
$$ packed form
17692A365612k46777k47253j48045r7732j20203j38009j19461p3849j3540r34
17682A59809J29948K51042L07366J47761Q0874L5219K150j5191p2983j01082q3321
17671H41592m3701k6740l5321o6904k0228J7124l3244n5147l7899J9010l81j6975
17659E41186k7799l5075J277R549j1006m7350K1378j3309k3918l0709m4151p4731
17647B65342J5980M3540J30605J66095J59886J12041O6544N1815k9923l0855l1035
17636I20035j9647N579n1952n6505j18580k4314R162J2172r8318m0201p2194n2966
17624D12271K146M5276J88434K30696J45463R2963R3966N2842Q2930Q9935K17133
17613A654055L15815K02184r0068l20009k82104j48284r0194n8169m0245j7484
$$ plain form
17603 1125497 1081473 1030480 1090757 1084943 1106197 1079055 1003195 920991 870181 868154 823687 808476
17591 808476 790256 766206 721625 725389 826387 945618 1024828 1197375 1316141 1395797 1432729
17580 1432729 1461925 1432523 1439353 1417285 1402090 1415513 1407502 1432722 1373799 1370630 1365541 1351358
17568 1351358 1365571 1335672 1359158 1425041 1420707 1296334 1275166 1327079 1300686 1288096 1325998
17557 1325998 1455735 1545882 1819324 2184884 2385847 2304668 2051185 1852626 1812996 1861378
17547 1861378 1886814 1901772 1867677 1838108 1786254 1741414 1769632 1812242 1906549 2018342 2091445
17536 2091445 2122429 2147766 2180282 2222516 2347763 2474488 2583177 2657113 2752503 2877532
17526 2877532 2985274 3142321 3342390 3533486 3804707 4154091 4731296 5390063 5958649
$$ packed form
17603A125497m4024n0993O0277n814K1254k7142p5860q2204n0810k027m4467j5211
17591H08476j8220k4050m4581L764J00998J19231P9210J72547J18766P9656L6932
17580A432729K9196k9402O830k2068j5195J3423q011K5220n8923l169n089j4183
17568A351358J4213k9899K3486O5883m334j24373k1168N1913k6393j2590L7902
17557A325998J29737R0147K73442L65560K00963q1179k53483j98559l9630M8382
17547A861378K5436J4958l4095k9569n1854m4840K8218M2610R4307J11793P3103
17536B091445L0984K5337L2516M2234J25247J26725J08689P3936R5390J25029
17526B877532J07742J57047K00069J91096K71221L49384N77205O58767N68586
$$ plain form
17517 5958649 6211782 6233350 6224220 6263048 6346131 6510895 6749023 7098314 7448270 7945665
17507 7945665 8579226 9290388 10138475 11179581 12528204 14206662 16244636 18825609 22277698
17498 22277698 26772636 32762764 41158409 53289494 71395639 99417264 143402714
17491 143402714 209980356 295322547 367796879 388909871 366948554 322931415 269791549
17484 269791549 214184069 162821003 120722262 89303866 67102831 51424356 40282192
17477 40282192 32201927 26322925 21967937 18657079 16148646 14204500 12630311 11458020
17469 11458020 10470176 9638200 9028448 8625993 8384615 8344831 8548026 9031700 9752959
17460 9752959 10329161 10479496 10188423 9706632 9238484 8818027 8445548 8237065 8165862 8217881
$$ packed form
17517E958649K53133K1568r130L8828Q3083J64764K38128L49291L49956M97395
17507G945665O33561P11162Q48087J041106J348623J678458K037974K580973L452089
17498B2277698M494938N990128Q395645J2131085J8106145K8021625M3985450
17491A43402714O6577642Q5342191P2474332K1112992k1961317m4017139n3139866
17484B69791549n5607480n1363066m2098741l1418396k2201035j5678475j1142164
17477D0282192q080265n879002m354988l310858k508433j944146j574189j172291
17469A1458020r87844q31976o09752m02455k41378l9784K03195M83674P21259
17460I752959N76202J50335k91073m81791m68148m20457l72479k08483p1203N2019
$$ plain form
17450 8217881 8344688 8572643 9004934 9542822 10232248 11120985 12263105 13634747 15439680
17441 15439680 17826664 20955057 25129404 30714677 38588581 50092496 67440952 94579448
17433 94579448 137378431 200953908 277158182 331683889 337887278 311580162 269446316
17426 269446316 221701407 173245796 130148343 95738129 70761792 53315209 41015760
17419 41015760 32250970 25929910 21355025 17975875 15366347 13405028 11977591 10869669
17411 10869669 10049923 9458465 8946163 8522948 8181664 7815193 7477418 7214615 7109674
17402 7109674 7042573 6814059 6424344 5902456 5379411 4929722 4489793 4108191 3795187 3510822
17392 3510822 3343556 3206802 3100711 2983725 2871801 2881604 2837154 2751449 2676202 2619108
$$ packed form
17450H217881J26807K27955M32291N37888O89426Q88737J142120J371642J804933
17441A5439680K386984L128393M174347N585273P873904J1503915J7348456K7138496
17433I4579448M2798983O3575477P6204274N4525707O203389k6307116m2133846
17426B69446316m7744909m8455611m3097453l4410214k4976337j7446583j2299449
17419D1015760q764790o321060m574885l379150k609528j961319j427437j107922
17411A0869669q19746n91458n12302m23215l41284l66471l37775k62803j04941
17402G109674o7101k28514l89715n21888n23045m49689m39929l81602l13004k84365
17392C510822j67266j36754j06091j16986j11924R803m4450q5705p5247n7094
$$ plain form
17382 2619108 2561639 2521025 2503739 2464792 2419754 2333938 2277233 2270237 2242589 2253773 2279490
17371 2279490 2316125 2300101 2225026 2148496 2087285 1997199 1952128 1977903 2084261 2227695 2236847
17360 2236847 2257861 2258460 2176666 2115208 2114296 2096252 2094493 2079608 2053288 2021507 1998912 1981903
17348 1981903 1896887 1824312 1801959 1776149 1760836 1734536 1678869 1648274 1705520 1751572 1661286
17337 1661286 1565840 1525485 1596397 1714959 1858554 2053730 2260707 2398301 2480020 2553322
17327 2553322 2558497 2534075 2582755 2612728 2642711 2707357 2729354 2700975 2735419 2763356 2755393 2735686
17315 2735686 2764641 2821231 2861539 2881905 2883647 2945223 2968301 2979850 2969270 2944441 2992364
17304 2992364 3116058 3178629 3150097 3097017 3062705 2993765 2933861 3060232 3285885 3523242
$$ packed form
17382B619108n7469m0614j7286l8947m5038q5816n6705o996k7648J1184K5717
17371B279490L6635j6024p5075p6530o1211r0086m5071K5775J06358J43434R152
17360B236847K1014N99q1794o1458r12j8044j759j4885k6320l1781k2595j7009
17348A981903q5016p2575k2353k5810j5313k6300n5667l0595N7246M6052r0286
17337A661286r5446m0355P0912J18562J43595J95176K06977J37594Q1719P3302
17327B553322N175k4422M8680K9973K9983O4646K1997k8379L4444K7937p963j9707
17315B735686K8955N6590M0308K0366J742O1576K3078J1549j0580k4829M7923
17304B992364J23694O2571k8532n3080l4312o8940n9904J26371K25653K37357
$$ plain form
17294 3523242 3690244 3820362 3906527 3908031 3938770 3991169 4011245 4017373 4006291 4083969 4188980
17283 4188980 4274955 4323128 4317470 4312603 4302377 4242431 4258720 4316951 4442703 4654011 4876094
17272 4876094 5015589 5112966 5246368 5340860 5392650 5415875 5485626 5533773 5588574 5651997 5690136
17261 5690136 5731018 5823868 5865561 5960582 6031646 6082247 6188050 6306647 6365674 6378607 6379145
17250 6379145 6415554 6475739 6582057 6611823 6664907 6768655 6828546 6842978 6866808 6901890 6904010
17239 6904010 6960302 7216450 7568340 7849154 8113917 8304286 8490500 8616180 8715596 8813450
17229 8813450 8907493 9058932 9177522 9305640 9483051 9633466 9773571 9984619 10208292 10360860
17219 10360860 10506379 10734903 10872581 11060111 11250704 11461576 11703568 11940405 12173399
$$ packed form
17294C523242J67002J30118Q6165J504L0739N2399K0076O128j1082P7678J05011
17283D188980Q5975M8173n658m867j0226n9946J6289N8231J25752K11308K22083
17272D876094J39495R7377J33402R4492N1790K3225O9751M8147N4801O3423L8139
17261E690136M0882R2850M1693R5021P1064N0601J05803J18597N9027J2933N38
17250F379145L6409O0185J06318K9766N3084J03748N9891J4432K3830L5082K120
17239F904010N6292K56148L51890K80814K64763J90369J86214J25680R9416R7854
17229H813450R4043J51439J18590J28118J77411J50415J40105K11048K23673J52568
17219A0360860J45519K28524J37678J87530J90593K10872K41992K36837K32994
$$ plain form
17210 12173399 12516054 12826711 13159356 13405906 13662492 14007593 14322931 14676447 15038583
17201 15038583 15385679 15714503 16106997 16528793 16962704 17401448 17913531 18441639 18997109
17192 18997109 19527874 20068294 20611245 21241864 21906584 22617138 23330487 24037756 24798177
17183 24798177 25663965 26545228 27442942 28356799 29334905 30373777 31454257 32663736 33932547
17174 33932547 35227680 36614409 38054725 39545931 41090372 42713505 44494974 46453608
17166 46453608 48493296 50594868 52872050 55374325 58024325 60801612 63722575 66828281
17158 66828281 70167691 73757032 77610517 81707161 86149045 90873877 95814806 101193083
17150 101193083 106906713 112995216 119436480 126221378 133446049 141096660 149123763 157482597
$$ packed form
17210A2173399L42655L10657L32645K46550K56586L45101L15338L53516L62136
17201A5038583L47096L28824L92494M21796M33911M38744N12083N28108N55470
17192A8997109N30765N40420N42951O30619O64720P10554P13349P07269P60421
17183B4798177Q65788Q81263Q97714R13857R78106J038872J080480J209479J268811
17174C3932547J295133J386729J440316J491206J544441J623133J781469J958634
17166D6453608K039688K101572K277182K502275K650000K777287K920963L105706
17158F6828281L339410L589341L853485M096644M441884M724832M940929N378277
17150A01193083N713630O088503O441264O784898P224671P650611Q027103Q358834
$$ plain form
17142 157482597 166256669 175356681 184619475 194002133 203399680 212756510 221852045 230498727
17134 230498727 238522382 245805099 252108555 257252163 261046308 263451218 264374301 263790664
17126 263790664 261698165 258134889 253298148 247310163 240273890 232471591 224049938 215130727
17118 215130727 205951679 196638195 187317619 178003604 168922299 160123280 151608849 143513584
17110 143513584 135734236 128388177 121458605 114835170 108623523 102795335 97314059 92174087
17102 92174087 87332286 82846547 78650181 74714331 71062811 67543464 64246230 61197413
17094 61197413 58356436 55707633 53221606 50859124 48687771 46644776 44669864 42814544
17086 42814544 41094331 39432346 37835648 36359307 34959250 33679181 32451755 31299782
$$ packed form
17142A57482597Q774072R100012R262794R382658R397547R356830R095535Q646682
17134B30498727Q023655P282717O303456N143608L794145K404910R23083n83637
17126B63790664k092499l563276m836741n987985p036273p802299q421653q919211
17118B15130727r179048r313484r320576r314015r081305q799019q514431q095265
17110A43513584p779348p346059o929572o623435o211647n828188n481276n139972
17102I2174087m841801m485739m196366l935850l651520l519347l297234l048817
17094F1197413k840977k648803k486027k362482k171353k042995j974912j855320
17086D2814544j720213j661985j596698j476341j400057j280069j227426j151973
$$ plain form
17078 31299782 30213083 29126527 28028874 27060943 26180828 25360778 24511232 23699513 22946156
17069 22946156 22261787 21560815 20883459 20233155 19606892 19058648 18504682 17956054 17439267
17060 17439267 16975703 16553374 16034194 15556048 15150393 14756824 14396269 14033212 13644016
17051 13644016 13210508 12879807 12638390 12403670 12158487 11860751 11527013 11237006 10928877
17042 10928877 10696166 10471658 10250039 10034888 9788149 9596675 9368753 9158395 8952929
17033 8952929 8780923 8609180 8409197 8248493 8112734 7960192 7769739 7601241 7447917
17024 7447917 7275340 7118055 7012499 6917740 6749242 6656062 6531103 6397524 6264749 6178380
17014 6178380 6091401 5970751 5843368 5713710 5611421 5515793 5441906 5381069 5319621 5260138
$$ packed form
17078C1299782j086699j086556j097653r67931q80115q20050q49546q11719p53357
17069B2946156o84369p00972o77356o50304o26263n48244n53966n48628n16787
17060A7439267m63564m22329n19180m78146m05655l93569l60555l63057l89196
17051A3644016m33508l30701k41417k34720k45183k97736l33738k90007l08129
17042A0928877k32711k24508k21619k15151k46739j91474k27922k10358k05466
17033H952929j72006j71743j99983j60704j35759j52542j90453j68498j53324
17024G447917j72577j57285j05556r4759j68498r3180j24959j33579j32775q6369
17014F178380q6979j20650j27383j29658j02289r5628p3887o0837o1448n9483
$$ plain form
17004 5260138 5159002 5066648 5009131 4933915 4837116 4785185 4715620 4652176 4587283 4435168 4347542
16993 4347542 4286644 4227543 4164525 4108270 3993944 3881768 3826736 3791795 3744517 3698496 3657923
16982 3657923 3570390 3528996 3437275 3397138 3355730 3309169 3291949 3265701 3258295 3244226 3135537
16971 3135537 3050471 3025964 3004377 2949704 2902566 2888578 2860726 2844832 2857000 2818064 2828256
16960 2828256 2838346 2812811 2786622 2848053 2903448 2957234 3058184 3213444 3457620 3723715
16950 3723715 4001030 4099175 4030081 3837404 3605639 3341662 3062387 2816318 2608357 2485405
16940 2485405 2398008 2332024 2271500 2176992 2126330 2143331 2170827 2173254 2184270 2208032 2166110
16929 2166110 2139548 2132274 2193870 2184498 2168379 2134043 2094295 2098566 2121112 2180059 2195658 2172866
$$ packed form
17004E260138j01136r2354n7517p5216r6799n1931o9565o3444o4893j52115q7626
16993D347542o0898n9101o3018n6255j14326j12176n5032l4941m7278m6021m0573
16982C657923q7533m1394r1721m0137m1408m6561j7220k6248p406j4069j08689
16971C135537q5066k4507k1587n4673m7138j3988k7852j5894J2168l8936J0192
16960B828256J0090k5535k6189O1431N5395N3786J00950J55260K44176K66095
16950C723715K77315R8145o9094j92677k31765k63977k79275k46069k07961j22952
16940B485405q7397o5984o0524r4508n0662J7001K7496K427J1016K3762m1922
16929B166110k6562p274O1596r372j6119l4336l9748M271K2546N8947J5599k2792
$$ plain form
16917 2172866 2109617 2095605 2142387 2149892 2124222 2091974 2078679 2077368 2018310 2004166 2029041 1973912
16905 1973912 1959247 1957867 1931550 1921345 1963137 2025831 2041211 2123845 2170313 2262441 2368179
16894 2368179 2522893 2781851 3023151 3239197 3329524 3207578 2968068 2747004 2533695 2327521
16884 2327521 2147795 1964185 1866746 1784769 1698340 1661316 1687625 1624494 1571238 1526627 1485201
16873 1485201 1511265 1518100 1520663 1512435 1515222 1506684 1478161 1504924 1580462 1601864 1540442 1510262
16861 1510262 1544875 1557476 1560642 1538811 1610468 1747701 1844807 1985000 2180292 2425727 2779585
16850 2779585 3031179 3131596 3109698 3022029 2869795 2630820 2405004 2212086 2015638 1857478
16840 1857478 1720166 1562937 1504868 1461482 1410584 1325409 1271884 1218866 1143010 1119701 1099098
$$ packed form
16917B172866o3249j4012M6782P505k5670l2248j3295j311n9058j4144K4875n5129
16905A973912j4665j380k6317j0205M1792O2694J5380Q2634M6468R2128J05738
16894B368179J54714K58958K41300K16046R0327j21946k39510k21064k13309k06174
16884B327521j79726j83610r7439q1977q6429l7024K6309o3131n3256m4611m1426
16873A485201K6064O835K563q228K787q538k8523K6763P5538K1402o1422l0180
16861A510262L4613J2601L166k1831P1657J37233R7106J40193J95292K45435L53858
16850B779585K51594J00417k1898q7669j52234k38975k25816j92918j96448j58160
16840A857478j37312j57229n8069m3386n0898q5175n3525n3018p5856k3309k0603
$$ plain form
16829 1099098 1078325 1032816 1014334 1008344 964519 917982 920182 951461 1014967 1042292 1030783 984210
16817 984210 936102 933145 966300 995537 1028881 1009609 959118 954768 987033 1009168 1027814 1015420
16805 1015420 976484 931527 873854 827706 835670 846139 836534 848072 801462 767848 771752 807507
16793 807507 802869 744886 756717 814228 827316 809906 768369 736215 729557 754404 769209 817893
16781 817893 849142 809436 782117 748506 735681 708851 671441 724183 729262 714417 738707 732899
16769 732899 750298 766255 732708 694558 735922 732035 691310 670066 669724 698581 733991 720196
16757 720196 764797 744900 690670 706855 673881 640512 617492 632985 649466 643028 620569 628760
16745 628760 637303 686973 685924 692370 676175 646778 627973 624985 622517 632406 642082 607332 591926
$$ packed form
16829A099098k0773m5509j8482n990m3825m6537K200L1279O3506K7325j1509m6573
16817I84210m8108k957L3155K9237L3344j9272n0491m350L2265K2135J8646j2394
16805A015420l8936m4957n7673m6148P964J0469r605J1538m6610l3614L904L5755
16793H07507m638n7983J1831N7511J3088j7410m1537l2154o658K4847J4805M8684
16781H17893L1249l9706k7319l3611j2825k6830l7410N2742N079j4845K4290n808
16769G32899J7399J5957l3547l8150M1364l887m0725k1244l42K8857L5410j3795
16757G20196M4601j9897n4230J6185l2974l3369k3020J5493J6481o438k2459Q191
16745F28760Q543M9670j049O446j6195k9397j8805k988k468R889R676l4750j5406
$$ plain form
16732 591926 587189 582115 553959 520921 494491 499555 468386 418802 448994 428416 372573 364590
16720 364590 390264 450152 504766 578441 575811 582295 610668 642989 612966 549654 483175 503634
16708 503634 538175 529560 446509 433887 406222 397673 423233 391423 415556 397373 375111 375448
16696 375448 385109 332534 319759 317633 323862 340385 350780 348411 408054 474518 425231 384999
16684 384999 432254 449288 422603 425411 400567 349373 349770 338424 382886 382197 394423 390996 400843
16671 400843 429191 447853 491332 544317 538319 538738 530268 528342 435843 343452 320931 295790
16659 295790 293092 281151 248634 251684 295430 306277 322281 330487 367247 448333 430031 320256
16647 320256 311579 317700 282116 256122 273355 323987 347640 359459 345415 313330 297212 309720
$$ packed form
16732E91926m737n074k8156l3038k6430N064l1169m9584L0192k0578n5843p983
16720C64590K5674N9888N4614P3675k630O484K8373L2321l0023o3312o6479K0459
16708E03634L4541q615q3051j2622k7665q549K5560l1810K4133j8183k2262L37
16696C75448R661n2575j2775k126O229J6523J0395k369N9643O6464m9287m0232
16684C84999M7255J7034k6685K808k4844n1194L97j1346M4462o89J2226l427R847
16671D00843K8348J8662M3479N2985n998M19q470j926r2499r2391k2521k5141
16659B95790k698j1941l2517L050M3746J0847J6004Q206L6760Q1086j8302j09775
16647C20256q677O121l5584k5994J7233N0632K3653J1819j4044l2085j6118J2508
$$ plain form
16635 309720 289158 327698 346610 348859 295336 324458 327561 317310 317551 312592 348378 389593
16623 389593 399383 322220 361004 369437 401431 400853 300972 270334 252723 238552 270260 321305
16611 321305 329380 305208 312311 352644 343775 300132 246994 261419 322310 367426 392111 378766
16599 378766 329619 350940 342020 337151 288418 264309 233172 196968 195716 229522 238154 284225
16587 284225 291642 300201 307987 309570 332114 319056 272479 245306 262319 287759 290755 295790 276279
16574 276279 218532 206656 246654 245071 295601 347031 349313 357377 380664 394416 327947 313881
16562 313881 322857 299493 263263 270669 297190 283538 251160 242887 272552 215226 208246 249361
16550 249361 247971 196844 210365 214697 213455 212694 173350 186044 264534 308571 240412 193089
$$ packed form
16635C09720k0562L8540J8912K249n3523K9122L103j0251K41m959L5786M1215
16623C89593R790p7163L8784Q433L1994n78r9881l0638j7611j4171L1708N1045
16611C21305Q075k4172P103M0333q869m3643n3138J4425O0891M5116K4685j3345
16599C78766m9147K1321q920m869m8733k4109l1137l6204j252L3806Q632M6071
16587B84225P417Q559P786J583K2544j3058m6577k7173J7013K5440K996N035j9511
16574B76279n7747j1876L9998j583N0530N1430K282Q064K3287J3752o6469j4066
16562C13881Q976k3364l6230P406K6521j3652l2378q273K9665n7326o980M1115
16550B49361j390n1127J3521M332j242p61l9344J2694P8490M4037o8159m7323
$$ plain form
16538 193089 248642 291330 274342 233906 218034 216353 219786 223822 262752 327978 330871 252059
16526 252059 165765 187342 186282 189442 163040 189767 260618 252306 264034 291551 253553 236455
16514 236455 268651 216172 131997 123442 151295 166932 170096 177276 186793 241545 271774 272493 272176
16501 272176 230697 207841 176991 157035 153978 230329 255924 216904 239578 234484 268759 229085
16489 229085 186929 171484 156443 174878 173013 185000 184766 214495 241195 192982 174342 138780
16477 138780 137858 176128 218031 207689 140382 91740 45495 73166 100852 99904 129920 170921
16465 170921 195606 195269 180469 174024 199487 201260 204562 223188 211790 152128 105671 136819
16453 136819 166419 158428 145551 188614 205364 204731 175799 114462 130484 99041 126152 148559
$$ packed form
16538A93089N5553M2688j6988m0436j5872j681L433M036L8930O5226K893p8812
16526B52059q6294K1577j060L160k6402K6727P0851q312J1728K7517l7998j7098
16514B36455L2196n2479q4175q555K7853J5637L164P180R517N4752L0229P19l17
16501B72176m1479k2856l0850j9956l057P6351K5595l9020K2674n094L4275l9674
16489B29085m2156j5445j5041J8435j865J1987k34K9729K6700m8213j8640l5562
16477A38780r22L8270M1903j0342o7307m8642m6245K7671K7686r48L0016M1001
16465A70921K4685l37j4800o445K5463J773L302J8626j1398n9662m6457L1148
16453A36819K9600p991j2877M3063J6750o33k8932o1337J6022l1443K7111K2407
$$ plain form
16441 148559 199507 215895 203062 219381 201592 241754 257648 244685 191390 159657 155989 174122
16429 174122 184523 203088 212272 245764 265053 231462 192701 171711 153180 106795 89974 81327
16417 81327 84816 105683 153994 148115 165580 143892 159011 139556 107534 121860 191028 193167
16405 193167 131078 81883 69465 46421 76627 125290 126862 77102 58877 97756 111291 82522
16393 82522 50721 74061 151587 220981 196207 153044 133345 134366 143276 154045 134402 118790
16381 118790 171839 196994 205635 202341 195340 182469 165139 154718 174739 172118 201101 172267
16369 172267 127955 134204 161161 178012 131130 148420 128558 60581 17878 32977 66416 92722
16357 92722 82448 74226 18053 -17414 6792 -9254 17072 24150 28646 74713 67131 78769
$$ packed form
16441A48559N0948J6388j2833J6319j7789M0162J5894j2963n3295l1733l668J8133
16429A74122J0401J8565R184L3492J9289l3591l8761k0990j8531m6385j6821q647
16417H1327L489K0867M8311n879J7465k1688J5119j9455l2022J4326O9168K139
16405A93167o2089m9195j2418k3044L0206M8663J572m9760j8225L8879J3535k8769
16393H2522l1801K3340P7526O9394k4774m3163j9699J021Q910J0769j9643j5612
16381A18790N3049K5155Q641l294p001j2871j7330j0421K0021k621K8983k8834
16369A72267m4312O249K6957J6851m6882J7290j9862o7977m2703J5099L3439K6306
16357I2722j0274q222n6173l5467K4206j6046K6326P078M496M6067p582J1638
$$ plain form
16345 78769 125318 169730 163861 115852 141240 167180 193245 159076 131634 162903 157261 158858
16333 158858 148295 102196 50170 84522 78805 57031 68096 88506 153800 171406 169635 183674
16321 183674 186975 156319 108208 64886 93740 110033 99966 73648 74569 66538 85172 89446
16309 89446 112060 118522 74521 95178 136865 142212 85364 39964 -57069 -53143 11611 44781
16297 44781 39450 61558 33330 50626 87813 131443 120095 117925 45058 -10475 51789 72229
16285 72229 113915 125360 113091 118074 120600 112392 143144 143928 173437 186767 176720 187721 111095
16272 111095 62026 100188 83985 40392 58699 117775 108689 73422 40270 30848 71381 96984
16260 96984 111914 101312 83250 92737 102041 63729 84583 66395 23158 8720 -42929 -31446
$$ packed form
16345G8769M6549M4412n869m8009K5388K5940K6065l4169k7442L1269n642J597
16333A58858j0563m6099n2026L4352n717k1774J1065K0410O5294J7606j771J4039
16321A83674L301l0656m8111m3322K8854J6293j0067k6318R21q031J8634M274
16309H9446K2614O462m4001K0657M1687N347n6848m5400r7033L926O4754L3170
16297D4781n331K2108k8228J7296L7187M3630j1348k170p2867n5533O2264K0440
16285G2229M1686J1445j2269M983K526q208L0752P84K9509J3330j0047J1001p6626
16272A11095m9069L8162j6203m3593J8307N9076r086l5267l3152r422M0533K5603
16260I6984J4930j0602j8062R487R304l8312K0854j8188m3237j4438n1649J1483
$$ plain form
16248 -31446 22767 41030 13080 2206 13954 9274 12053 34907 48364 93065 134021 72710
16236 72710 82439 94326 92932 101635 71846 41395 72607 67318 108221 103373 110733 135904 150747
16223 150747 192571 238440 189852 131411 161199 163159 166712 162368 95400 55546 49363 60924
16211 60924 15974 65247 111358 87553 112766 143583 130500 94025 68107 73156 89476 116355
16199 116355 137183 147444 160281 161075 138158 76143 82298 99133 89666 72074 74896 54733
16187 54733 61723 18832 -17263 23314 34436 9961 3663 14358 16904 36397 54172 87046
16175 87046 150667 127299 108627 96639 77715 107613 113960 126048 96961 128166 80679 89959
16163 89959 80778 67673 104909 104804 84903 86304 85109 102998 117134 149292 90336 -10630
$$ packed form
16248c1446N4213J8263k7950j0874J1748m680K779K2854J3457M4701M0956o1311
16236G2710R729J1887j394Q703k9789l0451L1212n289M0903m848P360K5171J4843
16223A50747M1824M5869m8588n8441K9788J960L553m344o6968l9854o183J1561
16211F0924m4950M9273M6111k3805K5213L0817j3083l6475k5918N049J6320K6879
16199A16355K0828J0261J2837P94k2917o2015O155J6835r467j7592K822k0163
16187E4733O990m2891l6095M0577J1122k4475o298J0695K546J9493J7775L2874
16175H7046O3621k3368j8672j1988j8924K9898O347J2088k9087L1205m7487R280
16163H9959r181j3105L7236j05j9901J401j195J7889J4136L2158n8956j00966
$$ plain form
16151 -10630 -48956 -40654 45026 78969 74529 97377 127014 151297 145082 101769 36739 28342
16139 28342 86080 120566 89897 75328 84542 98369 107398 26076 -13028 -19244 -8288 60339
16127 60339 86493 102279 109923 96436 87288 121215 120392 148176 172522 88360 92248 122996 154046
16114 154046 149584 126872 126221 106567 75388 73030 39013 59488 102064 45603 65280 139794
16102 139794 121133 99690 97243 145189 91081 60774 84271 57154 16480 24561 18885 18850 62074
16089 62074 104759 125475 89678 63453 145933 173980 101601 83768 100309 80616 67153 98810
16077 98810 112106 135765 145286 126106 89698 25109 35783 19050 4904 -18214 19123 37587
16065 37587 7742 31059 19325 17751 29224 -24 6981 87748 130502 115499 48317 49322
$$ packed form
16151a0630l8326Q302Q5680L3943m440K2848K9637K4283o215m3313o5030q397
16139B8342N7738L4486l0669j4569R214J3827R029q1322l9104o216J0956O8627
16127F0339K6154J5786P644j3487r148L3927q23K7784K4346q4162L888L0748L1050
16114A54046m462k2712o51j9654l1179k358l4017K0475M2576n6461J9677P4514
16102A39794j8661k1443k447M7946n4108l0307K3497k7117m0674Q081n676l5M3224
16089F2074M2685K0716l5797k6225Q2480K8047p2379j7833J6541j9693j3463L1657
16077I8810J3296K3659R521j9180l6408o4589J0674j6733j4146k3118L7337J8464
16065C7587k9845K3317j1734j574J1473k9248P005Q0767M2754j5003o7182J005
$$ plain form
16053 49322 23553 33693 15522 34740 63531 32814 1130 2386 -39772 3094 -226 -42273
16041 -42273 -21051 1583 47939 30681 33936 96356 165762 128809 58299 28335 56210 128450
16029 128450 131328 65199 26171 27174 52000 83879 77479 41773 16494 -59 32175 41830
16017 41830 68217 68093 36906 39191 34128 47039 66087 42514 50061 46955 19357 11029 22957
16004 22957 80143 85921 45758 35686 36891 81173 70535 46706 71507 55149 33923 57652
15992 57652 87106 80260 21978 -26421 -26317 -23752 -53337 -35019 -2223 -6441 -1586 501 70694
15979 70694 106095 34517 -6685 6005 22451 25868 35613 64711 5047 -25765 3840 31012
15967 31012 28737 65317 123722 165555 207261 254372 214564 108955 42735 86384 152293 144532
$$ packed form
16053D9322k5769J0140j8171J9218K8791l0717l1684J256m2158M2866l320m2047
16041d2273K1222K2634M6356j7258L255O2420O9406l6953p0510k9964K7875P2240
16029A28450K878o6129l9028J003K4826L1879o400l5706k5279j6553L2234R655
16017D1830K6387j24l1187K285n063J2911J9048k3573P547l106k7598q328J1928
16004B2957N7186N778m0163j0072J205M4282j0638k3829K4801j6358k1226K3729
15992E7652K9454o846n8282m8399J04K565k9585J8318L2796m218M855K087P0193
15979G0694L5401p1578m1202J2690J6446L417R745K9098n9664l0812K9605K7172
15967C1012k275L6580N8405M1833M1706M7111l9808j05609o6220M3649O5909p761
$$ plain form
15955 144532 115755 67190 47314 32955 38521 30738 17311 4653 4614 56773 64243 45574 22528
15942 22528 31059 36145 62373 83136 137198 136030 71531 70539 73864 105979 90824 78988 65348
15929 65348 123244 151264 175771 173313 114147 58041 52152 94095 93231 89201 46695 47189 85795
15916 85795 115206 59303 24365 63861 22288 -33162 -35783 -26628 71134 64102 23778 -29403
15904 -29403 -57779 -12530 -35668 -18783 17519 16022 16366 6082 55280 81298 94676 66795
15892 66795 38078 71798 96209 64670 38200 14394 35729 41968 -6368 -2231 2004 57003
15880 57003 61145 64714 104950 63699 26064 36514 42581 65639 88315 103586 161195 144047
15868 144047 104691 35712 3504 28031 50145 72743 100391 138856 124864 75805 75037 150321
$$ packed form
15955A44532k8777m8565j9876j4359N566p783j3427j2658l9N2159P470j8669k3046
15942B2528Q531N086K6228K0763N4062j168o4499r92L325L2115j5155j1836j3640
15929F5348N7896K8020K4507k458n9166n6106n889M1943q64m030m2506M94L8606
15916H5795K9411n5903l4938L9496m1573n5450k621R155R7762p032m0324n3181
15904b9403k8376M5249k3138J6885L6302j497L44j0284M9198K6018J3378k7881
15892F6795k8717L3720K4411l1539k6470k3806K1335O239m8336M137M235N4999
15880E7003M142L569M0236m1251l7635J0450O067K3058K2676J5271N7609j7148
15868A44047l9356o8979l2208K4527K2114K2598K7648L8465j3992m9059p68P5284
$$ plain form
15856 150321 135253 86386 36571 26533 27479 -67424 -120305 -59647 50329 93535 79159 68182
15844 68182 -10165 -60434 1636 27277 -5971 1326 48126 52806 71974 26305 19784 74397
15832 74397 116469 65042 35077 46521 21229 18433 3807 44711 82015 43426 -17136 -13874
15820 -13874 54442 33606 -49960 -10698 72786 87644 106588 78686 24633 25804 50240 -775
15808 -775 -45633 -54571 -5040 17968 16104 11825 -829 4577 39881 41443 7659 45988 88649
15795 88649 93610 76965 46590 -8716 -32779 -26372 -19026 -39252 -21163 18556 11074 50765
15783 50765 37840 -8501 1634 17149 36821 22337 75722 74627 16661 -31084 -19973 43212
15771 43212 64833 47125 66949 76665 72549 34280 35405 21074 30806 40859 -5749 -3602 85955
$$ packed form
15856A50321j5068m8867m9815j0038R46r4903n2881O0658J09976M3206j4376j0977
15844F8182p8347n0269O2070K5641l3248P297M6800M680J9168m5669o521N4613
15832G4397M2072n1427k9965J1444k5292k796j4626M0904L7304l8589o0562L262
15820a3874O8316k0836q3566L9262Q3484J4858J8944k7902n4053J171K4436n1015
15808g75m4858q938M9531K3008j864m279j2654N406L5304J562l3784L8329M2661
15795H8649M961j6645l0375n5306k4063O407P346k0226J8089L9719p482L9691
15783E0765j2925m6341J0135J5515J9672j4484N3385j095n7966m7745J1111O3185
15771D3212K1621j7708J9824R716m116l8269J125j4331R732J0053m6608K147Q9557
$$ plain form
15758 85955 131983 122883 59606 -10305 -26231 -30585 -79962 -89704 -36355 -19973 5404 -5284
15746 -5284 679 -23865 -33555 -11011 351 31795 29310 30445 -11200 14389 30585 76218 63682
15733 63682 -6502 -41181 -266 26813 27562 999 34 50832 42049 65358 114893 81640 35907
15720 35907 8802 20074 -14121 -37311 -45154 -92755 -41051 -30435 -24054 13849 43892 25959
15708 25959 8692 19469 9319 -14216 32735 36995 70134 50353 19567 -16317 -6409 21709
15696 21709 49667 49455 8338 -23073 17577 44494 15405 37633 100122 56973 109 37091
15684 37091 55535 77345 17680 -16000 3706 -18004 -55551 -48391 -60004 -19742 -688 2462
15672 2462 -25902 380 32469 24475 6372 -10611 -26220 -16105 -24465 -9719 -12933 5335
$$ packed form
15758H5955M6028r100o3277o9911j5926m354m9377r742N3349J6382K5377j0688
15746e284N963k4544r690K2544J1362L1444k485J135m1645K5589J6196M5633j2536
15733F3682p0184l4679M0915K7079P49k6563r65N0798q783K3309M9535l3253m5733
15720C5907k7105J1272l4195k3190p843m7601N1704J0616O381L7903L0043j7933
15708B5959j7267J0777j0150k3535M6951M260L3139j9781l0786l5884R908K8118
15696B1709K7958k12m1117l1411M0650K6917k9089K2228O2489m3149n6864L6982
15684C7091J8444K1810n9665l3680J9706k1710l7547P160j1613M0262J9054L150
15672B462k8364K6282L2089p994j8103j6983j5609J0115q360J4746l214J8268
$$ plain form
15660 5335 77341 27748 -9357 1735 39758 41210 40750 70832 32426 11423 42998 66544
15648 66544 46463 45313 7276 -50855 -63814 -47702 -39077 -14890 807 -43057 -58495 5379
15636 5379 -3608 4169 3096 10672 -34944 -40117 -16512 -12766 756 11613 5522 3689 -56736
15623 -56736 -67831 -49656 -33906 -36072 -30445 -24885 -6138 27482 8275 -46699 -78950 -77466
15611 -77466 -46876 -24528 -25234 -21372 -6176 -29591 -54799 -41518 -50307 -26949 4586 15727
15599 15727 -1557 -25931 6641 20339 11268 -7604 25431 70414 20590 -50769 -46558 -9364
15587 -9364 -1758 32495 88607 79701 58036 30333 -4892 -3294 47828 7520 -16088 51577
15575 51577 42208 85507 61702 39798 50657 54327 100871 112399 58200 21989 4241 -13499
$$ packed form
15660E335P2006m9593l7105J1092L8023J452m60L0082l8406k1003L1575K3546
15648F6544k0081j150l8037n8131j2959J6112Q625K4187J5697m3864j5438O3874
15636E379q987P777j073P576m5616n173K3605L746J3522J0857o091j833o0425
15623e6736j1095J8175J5750k166N627N560J8747L3620j9207n4974l2251J484
15611g7466L0590K2348p06L862J5196k3415k5208J3281q789K3358L1535J1141
15599A5727j7284k4374L2572J3698r071j8872L3035M4983m9824p1359M211L7194
15587i364P606L4253N6112q906k1665k7703l5225J598N1122m0308k3608O7665
15575E1577r369M3299k3805k1904J0859L670M6544J1528n4199l6211j7748j7740
$$ plain form
15563 -13499 -43842 -7079 2993 -35656 -35419 -20940 -7956 22968 64702 43510 21195 20404
15551 20404 22099 13485 33617 12649 1080 -12473 37131 73481 41975 45761 68424 52175
15539 52175 18912 57604 46885 52384 22904 24277 48399 54540 71206 61547 19243 26517 -8902
15526 -8902 -42105 -7168 63493 73313 39385 57750 58815 31252 43168 42230 23387 31355 47066
15513 47066 44689 49947 30444 -2142 9898 35503 5066 -68206 -58758 -109909 -79063 9815
15501 9815 52224 65558 23910 36840 33732 76576 70080 35295 38860 29287 16925 -24533 -102181
15488 -102181 -101008 -30857 -9509 -47006 -32081 -13127 -6479 -58791 -75591 -33594 7372 23343
15476 23343 40184 38720 4386 18356 -8658 -61269 -24845 37764 4201 -10052 22426 71666
$$ packed form
15563a3499l0343L6763J0072l8649K37J4479J2984L0924M1734k1192k2315p91
15551B0404J695q614K0132k0968j1569j3553M9604L6350l1506L786K2663j6249
15539E2175l3263L8692j0719N499k9480J373K4122O141J6666r659m2304P274l5419
15526h902l3203L4937P0661R820l3928J8365J065k7563J1916r38j8843P968J5711
15513D7066k377N258j9503l2586J2040K5605l0437p3272R448n1151L0846Q8878
15501I815M2409J3334m1648J2930l108M2844o496l4785L565r573j2362m1458p7648
15488a02181J173P0151K1348l7497J4925J8954O648n2312j6800M1997M0966J5971
15476B3343J6841j464l4334J3970k7014n2611L6424O2609l3563j4253L2478M9240
$$ plain form
15464 71666 70553 47823 -17602 -43922 -13065 -16161 -23181 -12820 -26984 -35155 667 -30324
15452 -30324 -56953 -36408 -13360 -25022 3918 16556 29357 37112 45619 69708 97865 117744
15440 117744 76302 32282 11479 22901 -16580 104 10045 46610 27823 -817 -40365 -68628
15428 -68628 -90146 -103631 -69853 -92877 -92725 -128819 -119623 -46161 3661 564 -39044 -22738
15416 -22738 -2799 -28509 -41112 -58750 -85203 -51679 6425 12697 11584 31032 3407 -21389
15404 -21389 -363 -60 58382 33362 14765 -43839 -11918 47676 32136 770 -1324 -23885
15392 -23885 -31401 -25580 -4603 13621 33007 47332 -29616 -48558 -23527 -531 -7494 -11353
15380 -11353 8633 16235 23030 1232 12717 -57810 -65887 -5978 -91 -27398 -35172 -29361 -17113
$$ packed form
15464G1666j113k2730o5425k6320L0857l096p020J0361j4164q171L5822l0991
15452c0324k6629K0545K3048j1662K8940J2638J2801P755Q507K4089K8157J9879
15440A17744m1442m4020k0803J1422l9481J6684R941L6565j8787k8640l9548k8263
15428f8628k1518j3485L3778k3024J52l6094R196P3462M9822l097l9608J6306
15416b2738J9939k5710j2603j7638k6453L3524N8104O272j113J9448k7625k4796
15404b1389K1026L03N8442k5020j8597n8604L1921N9594j5540l1366k094k2561
15392b3885p516N821K0977J8224J9386J4325p6948j8942K5031K2996o963l859
15380a1353J9986P602O795k1798J1485p0527q077N9909N887k7307p774N811J2248
$$ plain form
15367 -17113 2397 2560 -9869 -32471 -35850 -33910 30017 59698 15666 38493 37022 45670 25764
15354 25764 7737 22061 13880 -47444 -85364 -87387 -45614 -30681 -29714 7524 -12975 -89629
15342 -89629 -109803 -48275 1516 -17752 -8026 -11422 -15836 10823 -787 -40233 -58017 -77288
15330 -77288 -40436 -2037 -15297 -3171 -11331 -27657 18079 56727 62843 31817 -825 10205
15318 10205 34489 72544 116723 91816 97198 93361 47083 55012 67813 89818 78477 95048
15306 95048 92133 18910 -6232 -16275 32564 21342 50821 61997 60285 70545 65234 37340
15294 37340 17313 49422 112694 111480 120147 123559 112795 108438 63386 34530 1958 -6121 58627
15281 58627 95389 122440 123418 73792 42367 11030 -49233 -53307 27675 72507 54265 67863
$$ packed form
15367a7113J9510J63j2429k2602l379J940O3927K9681m4032K2827j471Q648j9906
15354B5764j8027J4324q181o1324l7920k023M1773J4933R67L7238k0499p6654
15342h9629k0174O1528M9791j9268R726l396m414K6659j1610l9446j7784j9271
15330g7288L6852L8399j3260J2126q160j6326M5736L8648O116l1026l2642J1030
15318A0205K4284L8055M4179k4907N382l837m6278P929J2801K2005j1341J6571
15306I5048k915p3223k5142j0043M8839j1222K9479J1176j712J0260n311k7894
15294C7340k0027L2109O3272j214Q667L412j0764m357m5052k8856l2572q079O4748
15281E8627L6762K7051R78m9626l1425l1337o0263m074Q0982M4832j8242J3598
$$ plain form
15269 67863 98365 120251 72200 45323 6195 -3072 -2368 -22630 -21955 -21655 -21346 30609 25806 -1723
15255 -1723 13097 31698 93943 62864 70461 75813 69365 33350 52835 62447 10722 -25374 -54124
15242 -54124 -3704 -15224 -4348 -45733 -112023 -154513 -161531 -119396 -50747 -41835 -57904 -65070
15230 -65070 -53034 -44904 -14300 12120 -13350 -4075 44767 7764 -32066 -26723 6270 45069
15218 45069 57033 15837 -6903 26639 80100 102700 53533 32974 40306 30681 37964 53136
15206 53136 66937 79582 33761 18639 43391 43943 49156 36757 -2446 14486 36151 34846
15194 34846 82617 70777 -17105 -73893 -65487 -49055 -33781 -23773 4654 19626 74153 97249
15182 97249 43259 41174 69987 83847 66774 20144 -6371 -8908 -7112 -9694 -3387 20540 21539
$$ packed form
15269F7863L0502K1886m8051k6877l9128r267P04k0262O75L00L09N1955m803k7529
15255a723J4820J8601O2245l1079P597N352o448l6015J9485R612n1725l6096k8750
15242e4124N0420j1520J0876m1385o6290m2490p018M2135O8649Q912j6069p166
15230f5070J2036Q130L0604K6420k5470R275M8842l7003l9830N343L2993L8799
15218D5069J1964m1196k2740L3542N3461K2600m9167k0559P332r625P283J5172
15206E3136J3801J2645m5821j5122K4752N52N213j2399l9203J6932K1665j305
15194C4846M7771j1840q7882n6788Q406J6432J5274J0008K8427J4972N4527K3096
15182I7249n3990k085K8813J3860j7073m6630k6515k537J796k582O307K3927R99
$$ plain form
15169 21539 33176 47102 46521 69780 25148 14565 -40671 -21291 71075 85760 54201 27029
15157 27029 -22303 -29772 -1677 22189 25930 21822 30238 16434 29359 43366 47918 74824 62668
15144 62668 19209 7883 7968 -15204 28971 80228 91594 68116 50047 63027 28336 13805
15132 13805 40600 59721 81087 30120 -54447 -35123 -26360 16909 49366 101632 98660 50812
15120 50812 64225 66479 5319 -42635 -45824 -407 20266 55003 29169 -3419 51816 118715
15108 118715 127322 133476 108352 62584 7792 9458 96608 73168 26025 47192 56848 63131
15096 63131 89487 61032 75641 63394 54139 72089 116272 136206 119572 61679 39086 18784
15084 18784 31645 40360 19575 7906 33528 41248 57883 -3962 -18539 -36222 -48767 -22748
$$ packed form
15169B1539J1637J3926n81K3259m4632j0583n5236J9380R2366J4685l1559k7172
15157B7029m9332p469K8095K3866L741m108Q416j3804J2925J4007M552K6906j2156
15144F2668m3459j1326Q5k3172M4175N1257J1366k3478j8069J2980l4691j4531
15132A3805K6795J9121K1366n0967q4567J9324Q763M3269L2457N2266k972m7848
15120E0812J3413K254o1160m7954l189M5417K0673L4737k5834l2588N5235O6899
15108A18715Q607O154k5124m5768n4792J666Q7150k3440m7143K1167R656O283
15096F3131K6356k8455J4609j2247r255J7950M4183J9934j6634n7893k2593k0302
15084A8784J2861Q715k0785j1669K5622P720J6635o1845j4577j7683j2545K6019
$$ plain form
15072 -22748 1135 48544 7916 -39239 -42978 -21032 55879 51928 -28062 -41185 -16590 11556
15060 11556 16387 21099 10948 -72222 -78562 -40186 16684 26093 6320 -15448 -24425 -12109 39660
15047 39660 45563 -23402 -52183 -55617 12824 18602 -11775 -15745 -6285 -28606 -43070 -22223 -14008
15034 -14008 5596 10989 29331 59210 14141 -15420 -8997 -27459 5544 -467 -16754 -55748
15022 -55748 -25535 19831 16440 -28464 -38356 -41546 -51302 -24967 -1489 4653 -14264 -58812 -78726
15009 -78726 -106757 -82542 -90568 -70806 -8935 53782 76722 57077 15840 -13 -19708 5616
14997 5616 8851 -11404 -26088 -38124 -43119 -11008 -485 3777 66113 15749 -13214 29063
14985 29063 40783 52010 19233 -1499 -2022 64119 54928 -5542 -39229 -48527 -20668 13472
$$ packed form
15072b2748K3883M7409m0628m7155l739K1946P6911l951p9990j3123K4595K8146
15060A1556M831M712j0151q3170o340L8376N6870R409j9773k1768q977J2316N1769
15047C9660N903o8965k8781l434O8441N778l0377l970R460k2321j4464K0847Q215
15034a4008J9604N393J8342K9879m5069k9561O423j8462L3003o011j6287l8994
15022e5748L0213M5366l391m4904r892l190r756K6335K3478O142j8917m4548j9914
15009g8726k8031K4215q026J9762O1871O2717K2940j9645m1237j5853j9695K5324
14997E616L235k0255j4684j2036m995L2111J0523M262O2336n0364k8963M2277
14985B9063J1720J1227l2777k0732n23O6141r191o0470l3687r298K7859L4140
$$ plain form
14973 13472 15958 19206 14673 5963 -33673 -22644 16351 52135 -10757 -42478 -85434 -84091 -58604
14960 -58604 -172 -31763 -60870 -42962 -34502 -61750 -77838 -81752 -70610 -82510 -59381 -26550
14948 -26550 -17006 -45340 -76454 -126077 -121233 -68776 -60142 -86045 -41539 -2413 1336 4403 37383
14935 37383 16823 11877 18376 78557 114568 63297 33344 56676 10917 -24742 -12180 -44230
14923 -44230 -83457 -64703 -7303 -11546 21153 63013 37265 2432 29431 55817 30588 37329
14911 37329 77134 51401 -11830 -26732 -31243 -78554 -80604 -27870 43379 114222 88026 52206
14899 52206 16810 -17484 -26190 -8480 -24905 -13063 -26402 -78271 -102857 -143735 -133356 -92626
14887 -92626 -101059 -116396 -136559 -159855 -100539 -77155 -54496 -35416 -48477 -3113 -23520 -60322
$$ packed form
14973A3472K486L248m533q710l9636J1029L8995L5784o2892l1721m2956J343K5487
14960e8604N8432l1591k9107J7908Q460k7248j6088l914J1142j1900K3129L2831
14948b6550R544k8334l1114m9623M844N2457Q634k5903M4506L9126L749L067L2980
14935C7383k0560m946O499O0181L6011n1271k9953K3332m5759l5659J2562l2050
14923d4230l9227J8754N7400m243L2699M1860k5748l4833K6999K6386k5229O741
14911C7329L9805k5733o3231j4902m511m7311k050N2734P1249P0843k6196l5820
14899E2206l5396l4294q706J7710j6425J1842j3339n1869k4586m0878J0379M0730
14887i2626q433j5337k0163k3296N9316K3384K2659J9080j3061M5364k0407l6802
$$ plain form
14875 -60322 -57105 -12767 -2667 6158 55979 56026 -25424 -14363 15125 34700 104287 115393 58589
14862 58589 41758 41217 47188 4472 -4583 9813 44875 36881 -6402 -43457 -71074 -31292 -47369
14849 -47369 -3655 -12819 -22004 -32358 -45694 -47273 172 8646 21033 2365 -38207 -4281
14837 -4281 -17876 -43738 -28139 29544 50433 52349 23414 -31311 -70720 -76039 -33722 884
14825 884 13188 -7112 -49732 -15247 -734 110 -2036 27166 14381 14276 -20280 -75621 -85575
14812 -85575 6135 -29509 -79138 -72206 -82497 -113647 -87745 -31105 58796 88529 69830 44281
14800 44281 53131 35036 -25409 -28406 45433 19823 -10204 -8032 14883 38027 43033 50032 58147
14787 58147 67701 56371 17132 -45206 -31478 -13636 -1159 1692 16800 31456 11682 55190
$$ packed form
14875f0322L217M4338J0100Q825M9821M7q1450J1061K9488J9575O9587J1106n6804
14862E8589j6831n41N971m2716r055J4396L5062p994m3283l7055k7617L9782j6077
14849d7369M3714r164r185j0354j3336j579M7445Q474J2387j8668m0572L3926
14837d281j3595k5862J5599N7683K0889J916k8935n4725l9409n319M2317L4606
14825H84J2304k0300m2620L4485J4513Q44k146K9202j2785j05l4556n5341r954
14812h5575R1710l5644m9629O932j0291l1150K5902N6640Q9901K9733j8699k5549
14800D4281Q850j8095o0445k997P3839k5610l0027K172K2915K3144N006O999Q115
14787E8147R554j1330l9239o2338J3728J7842J2477K851J5108J4656j9774M3508
$$ plain form
14775 55190 42949 -17215 -55286 -56496 -23406 59105 79862 34750 -15971 -75615 -71592 -52043
14763 -52043 -32531 -16156 -8271 -53330 -8646 71656 45000 7105 -52991 -10603 -29135 -66090
14751 -66090 -65226 -53179 -70159 -45120 -26744 -25988 -30577 7883 12655 -9610 14019 47884 34172
14738 34172 -21315 -31073 -32455 -19214 -30476 -65509 -66294 -59685 -6798 1919 -36956 -14765 12784
14725 12784 10546 66269 54655 26706 61414 64089 14784 16147 -9739 -32304 -62532 -6876
14713 -6876 9359 11833 5913 -18158 41800 47273 6996 -35736 -20186 44179 24979 -17847
14701 -17847 -35168 -3939 11706 -37885 1300 60427 50615 25500 -3579 -54728 -93616 -86608
14689 -86608 -56084 -18051 -80666 -88915 -107746 -131543 -126249 -80212 -52371 9816 1126 -20111
$$ packed form
14775E5190j2241o0164l8071j210L3090Q2511K0757m5112n0721n9644M023J9549
14763e2043J9512J6375P885m5059M4684Q0302k6656l7895o0096M2388j8532l6955
14751f6090Q64J2047j6980K5039J8376P56m589L8460M772k2265K3629L3865j3712
14738C4172n5487r758j382J3241j1262l5033p85O609N2887Q717l8875K2191K7549
14725A2784k238N5723j1614k7949L4708K675m9305J363k5886k2565l0228N5656
14713f876J6235K474n920k4071N9958N473m0277m2732J5550O4365j9200m2826
14701a7847j7321L1229J5645m9591L9185N9127r812k5115k9079n1149l8888P008
14689h6608L0524L8033o2615q249j8831k3797N294M6037K7841O2187q690k1237
$$ plain form
14677 -20111 -7231 2955 81723 78924 31199 46318 70878 55576 -939 5189 -8223 11956
14665 11956 58152 35925 621 -24293 -33715 -24577 -40374 -23215 23995 7260 15464 21256
14653 21256 22108 -3543 -30917 -34637 -15260 -22788 -68861 -81135 -30154 -532 10854 -23732
14641 -23732 -43579 -8851 38263 50117 41607 19842 -21916 -21419 -15452 -3254 -9615 -8324 -10419
14628 -10419 -5608 -4294 27040 -37271 -67814 -58326 -52101 -58201 -52412 -54203 -65694 -35752 -293
14615 -293 4810 3300 18337 9079 13846 13593 10408 28644 9783 15612 -5219 -29053 -44580 -58446
14601 -58446 -12228 8057 337 -6475 -17581 -56454 -39974 -73060 -78309 -86012 -90867 -64440 -24221
14588 -24221 -15480 -32576 -28857 451 21725 6712 20278 33298 26844 74166 94437 69719
$$ packed form
14677b0111J2880J0186P8768k799m7725J5119K4560j5302n6515O128j3412K0179
14665A1956M6196k2227l5304k4914r422R138j5797J7159M7210j6735Q204N792
14653B1256Q52k5651k7374l720J9377p528m6073j2274N0981K9622J1386l4586
14641b3732j9847L4728M7114J1854q510k1765m1758M97N967J2198o361J291k095
14628a0419M811J314L1334o4311l0543R488O225o100N789j791j1491K9942L5459
14615b93N103j510J5037r258M767k53l185J8236j8861N829k0831k3834j5527j3866
14601e8446M6218K0285p720o812j1106l8873J6480l3086n249p703m855K6427M0219
14588b4221Q741j7096L719K9308K1274j5013J3566J3020o454M7322K0271k4718
$$ plain form
14576 69719 2752 1384 17380 549 52394 14642 -7404 3650 6719 -36410 -69921 -83818
14564 -83818 -121368 -108973 -5440 13228 -39631 -62755 -24845 13990 35862 65021 19574
14553 19574 11339 -20848 -78139 -46694 -19285 -5336 -60468 -66257 -5062 33794 54763 9811
14541 9811 14393 2663 -27318 -1141 7491 -10938 19119 28504 78656 131545 134861 115507 81077
14528 81077 63576 23100 -7136 -44383 -33270 29869 72568 88510 58742 38685 28610 2606
14516 2606 -55378 -40016 -55448 -38374 -8844 -48096 -22357 4552 -10532 -57234 -81366 -35833
14504 -35833 1882 7089 34686 -21980 -39213 -68155 -77969 -58222 -29293 -26418 -16975 -31979
14492 -31979 -63016 -49807 -52128 -69163 -34303 -1137 71636 45878 19184 -6258 -27487 -80420
$$ packed form
14576F9719o6967j368J5996j6831N1845l7752k2046J1054L069m3129l3511j3897
14564h3818l7550J2395J03533J8668n2859k3124L7910L8835K1872K9159m5447
14553A9574q235l2187n7291L1445K7409J3949n5132n789O1195L8856K0969m4952
14541I811M582j1730k9981K6177Q632j8429L0057R385N0152N2889L316j9354l4430
14528H1077j7501m0476l0236l7247J1113O3139M2699J5942k9768k0057j0075k6004
14516B606n7984J5362j5432J7074K9530l9252K5739K6909j5084m6702k4132M5533
14504c5833L7715N207K7597n6666j7233k8942r814J9747K8929K875R443j5004
14492c1979l1037J3209k321j7035L4860L3166P2773k5758k6694k5442k1229n2933
$$ plain form
14480 -80420 -106895 -72153 -6079 3379 9960 -4641 7787 -10618 11121 14979 15580 -14378 7415
14467 7415 14581 18003 72130 58978 98956 104636 73115 27173 -12994 -13447 -5693 69544 73440
14454 73440 58496 717 -39888 -18094 -2499 14643 37980 30134 4075 -58296 -112707 -93948
14442 -93948 -66519 -80278 -49166 17375 9968 42052 44458 31486 30125 17678 25016 43844
14430 43844 6651 4742 33572 50819 34544 23981 13342 84002 72755 27936 1064 35982
14418 35982 92510 81040 51425 30213 46638 26483 4720 7539 29089 40649 11245 -3335
14406 -3335 15029 -36164 -49181 -94837 -109714 -60356 -80917 -102510 -115987 -90281 -80678 -83135
14394 -83135 -23852 -992 -40257 -41384 -25879 1236 14271 24740 -8456 -18288 -33353 -78534
$$ packed form
14480h0420k6475L4742O6074R458O581j4601J2428j8405K1739L858O01k9958K1793
14467G415P166L422N4127j3152L9978N680l1521m5942m0167m53P754P5237L896
14454G3440j4944n7779m0605K1794J5595J7142K3337p846k6059o2371n4411J8759
14442i3948K7429j3759L1112O6541p407L2084K406j2972j361j2447P338J8828
14430D3844l7193j909K8830J7247j6275j0563j0639P0660j1247m4819k6872L4918
14418C5982N6528j1470k9615k1212J6425k0155k1763K819K1550J1560k9404j4580
14406c335J8364n1193j3017m5656j4877M9358k0561k1593j3477K5706R603k457
14394h3135N9283K2860l9265j127J5505K7115J3035J0469l3196r832j5065m5181
$$ plain form
14382 -78534 -47416 -19913 12775 14999 -2299 -45525 -57420 -80087 -33658 3599 5812 33817
14370 33817 52403 24300 6753 -9801 -29701 -56563 -95017 -71359 -37821 -21172 -87453 -94167
14358 -94167 -37296 -48224 -100728 -94134 -26381 15115 20821 22911 28785 -5046 -15302 885
14346 885 -8283 -31458 -24686 -33060 -48523 -71120 -36313 -36000 -31771 12948 19073 33415 5215
14333 5215 -25696 -66896 -53677 -78036 -112547 -96877 -85438 -57433 -22588 -390 29402 11020
14321 11020 -451 6248 -2031 -13197 -40624 -96126 -90991 -62166 -54265 -31184 -11188 -2295 -1007
14308 -1007 -7172 11215 5671 -36879 -19407 3977 -19252 -27037 4527 25854 53247 47159 11702
14295 11702 12342 36705 92101 112337 126290 60713 -5736 -80695 -94703 -50099 18749 18991
$$ packed form
14382g8534L1118K7503L2688K224j7298m3226j1895k2667M6429L7257K213K8005
14370C3817J8586k8103j7547j6554j9900k6862l8454K3658L3538J6649o6281o714
14358i4167N6871j0928n2504O594O7753M1496N706K090N874l3831j0256J6187
14346H85r168k3175O772q374j5463k2597L4807L13M229M4719O125J4342k8200
14333E215l0911m1200J3219k4359l4511J5670J1439K8005L4845K2198K9792j8382
14321A1020j1471O699q279j1166k7427n5502N135K8825P901K3081J9996Q893J288
14308a007o165J8387n544m2550J7472K3384k3229p785L1564K1327K7393o088l5457
14295A1702O40K4363N5396K0236J3953o5577o6449p4959j4008M4604O8848K42
$$ plain form
14283 18991 705 4912 -34113 -22403 -18169 -5218 -12788 -87943 -93378 -24200 29106 54777
14271 54777 447 -42684 -88141 -109015 -54589 -7860 -12216 -11635 -32177 -5229 16872 -1388
14259 -1388 -1333 -12019 -66759 -45056 5207 23615 48523 37756 21104 18116 -10282 -20263 -32118
14246 -32118 -30410 -2883 28691 -14944 -76332 -92805 -108243 -85458 -19206 10528 -58475 -93807
14234 -93807 -73264 -51552 2335 33287 -9641 6595 36035 -8124 1992 -60432 -59974 -12909
14222 -12909 19093 2701 -15783 36856 30913 -14349 -3722 51475 110486 80768 -6487 6581
14210 6581 110743 115074 86984 30886 -19850 -5004 47348 25996 -6358 -16901 -23616 -29009
14198 -29009 -9071 -6598 -17278 -14708 5673 -24619 -28683 -26779 -11589 -42289 -23655 34222
$$ packed form
14283A8991j8286M207l9025J1710M234J2951p570p5155n435O9178N3306K5671
14271E4777n4330m3131m5457k0874N4426M6729m356N81k0542K6948K2101j8260
14259a388N5j0686n4740K1703N0263J8408K4908j0767j6652k988k8398r981j1855
14246c2118J708K7527L1574m3635o1388j6473j5438K2785O6252K9734o9003l5332
14234i3807K0543K1712N3887L0952m2928J6236K9440m4159J0116o2424M58M7065
14222a2909L2002j6392j8484N2639n943m5262J0627N5197N9011k9718q7255J3068
14210F581J04162M331k8090n6098n0736J4846N2352k1352l2354j0543o715n393
14198b9009J9938K473j0680K570K0381l0292m064J904J5190l0700J8634N7877
$$ plain form
14186 34222 43672 11939 31009 3232 -49613 -31302 -1971 -10241 -47638 -44103 -79444 -92988
14174 -92988 -39719 -27833 22517 97144 97553 83690 57031 53791 20975 -20623 -13107 26728
14162 26728 -6398 -12285 -9475 -25229 -9618 -4872 -62931 -77763 -69022 -104414 -102719 -81267 -23855
14149 -23855 15178 31624 -2033 -51326 -46169 32581 67243 88621 58387 53523 74605 87221
14137 87221 66549 73083 54453 63910 88680 48002 36985 44936 1351 -66592 -81416 -32968
14125 -32968 -105 -39674 -119210 -100989 -36848 -31213 37998 60214 34090 -3824 -18743 28076
14113 28076 10891 6838 -12664 -37253 -67304 -96074 -79608 -31287 -14766 -31147 -20042 -31764
14101 -31764 -37647 -42351 -32672 -16689 3066 -18467 -33025 20295 61273 73956 43711 510
$$ packed form
14186C4222R450l1733J9070k7777n2845J8311K9331q270l7397L535l5341j3544
14174i2988N3269J1886N0350P4627M09j3863k6659l240l2816m1598P516L9835
14162B6728l3126n887K810j5754J5611M746n8059j4832Q741l5392J695K1452N7412
14149b3855L9033J6446l3657m9293N157P8750L4662K1378l0234m864K1082J2616
14137H7221k0672O534j8630R457K4770m0678j1017P951m3585o7943j4824M8448
14125c2968L2863l9569p9536J8221O4141N635O9211K2216k6124l7914j4919M6819
14113B8076j7185m053j9502k4589l0051k8770J6466M8321J6521j6381J1105j1722
14101c1764n883m704R679J5983J9755k1533j4558N3320M0978J2683l0245m3201
$$ plain form
14089 510 40657 77199 57722 69904 88758 32453 850 10380 58651 92527 91439 85491 -9297
14076 -9297 -20767 -37468 -64597 -21210 40377 25877 7662 44482 24830 -20590 -27367 -7146
14064 -7146 38195 92418 92967 73660 60798 17536 -17950 -33407 -62707 -67457 -79582 -92463
14052 -92463 -108433 -134971 -101072 -33896 40923 54692 42315 43359 23755 1222 -27724 -461
14040 -461 -41280 -93226 -102898 -153648 -124222 -88416 -43936 -17857 921 3335 -6064 -5092 -15372
14027 -15372 4815 7101 44432 45163 9979 -4447 2498 -33866 -35189 -51196 -13297 1212 -29994
14014 -29994 -41626 -17747 18906 26618 40492 51805 -4106 -67060 -98262 -98773 -67711 -42295
14002 -42295 -37222 -41022 -37858 -40872 3083 11278 -17636 -25649 -10950 -60404 -60728 -12054 24063
$$ packed form
14089E10M0147L6542j9477J2182J8854n6305l1603R530M8271L3876j088n948r4788
14076i297j1470j6701k7129M3387O1587j4500j8215L6820j9652m5420o777K0221
14064g146M5341N4223N49j9307j2862m3262l5486j5457k9300m750j2125j2881
14052i2463j5970k6538L3899O7176P4819J3769j2377J044j9604k2533k8946K7263
14040d61m0819n1946r672n0750K9426L5806M4480K6079J8778K414r399R72j0280
14027a5372K0187K286L7331P31l5184j4426O945l6364j323j6007L7899J4509l1206
14014b9994j1632K3879L6653P712J3874J1313n5911o2954l1202n11L1062K5416
14002d2295N073l800L164l014M3955Q195k8914q013J4699m9454l24M8674L6117
$$ plain form
13989 24063 11528 4587 16940 -4694 9621 2720 -33850 -18646 -19598 82 44310 80599
13977 80599 85528 87412 41807 16654 22953 -16039 -65161 -62035 -24737 -42601 -55943 1737
13965 1737 60912 12136 -51924 -46462 -35379 -48027 -50103 -48013 -36061 -1848 18810 31314
13953 31314 41225 48918 23717 79761 72442 33388 -23180 -15601 3046 33826 -3934 -30371
13941 -30371 -30740 -43593 -20806 14047 8676 -23921 22395 31547 12294 13176 34946 67919 37282
13928 37282 34650 10816 -18100 -20135 -21271 -64115 -95796 -65021 -7322 64726 35831 1328
13916 1328 -10583 34412 40191 45293 133779 98865 10318 -7873 -34090 -8335 13999 -4160
13904 -4160 -15873 45432 74866 46626 5850 17670 -22312 17321 39525 7953 -46023 -86627
$$ packed form
13989B4063j2535o941J2353k1634J4315o901l6570J5204r52J9680M4228L6289
13977H0599M929J884m5605k5153O299l8992m9122L126L7298j7864j3342N7680
13965A737N9175m8776o4060N462J1083j2648k076K090J1952L4213K0658J2504
13953C1314R911P693k5201N6044p319l9054n6568P579J8647L0780l7760k6437
13941c0371l69j2853K2787L4853n371l2597M6316R152j9253Q82K1770L2973l0637
13928C7282k632k3834k8916k035j136m2844l1681L0775N7699P2048k8895l4503
13916A328j1911M4995N779N102Q8486l4914q8547j8191k6217K5755K2334j8159
13904d160j1713O1305K9434k8240m0776J1820l9982L9633K2204l1572n3976m0604
$$ plain form
13892 -86627 -55124 32262 44204 10450 -40248 -60218 -55087 -85036 -95891 -73846 -66165 -48321
13880 -48321 -15628 25585 28266 -1271 24722 42594 74325 104313 122632 72780 39188 35365
13868 35365 43070 20918 13111 25481 58161 36083 2350 11181 -41277 -71335 -30020 -13862
13856 -13862 -13271 -48416 -52486 -34739 -13575 19141 -26223 -69482 -51017 -20660 -7305 2368
13844 2368 -44265 -94533 -99390 -49123 -45556 -69379 -70045 -67597 29824 83089 42277 -14313 9814
13831 9814 23077 8976 44032 35162 -479 26553 21113 -7736 10752 51741 95284 118143
13819 118143 72194 34016 34166 -2153 -43990 -102473 -100377 -58806 -70870 -37102 7972 22509
13807 22509 21676 -37347 -34830 22811 -13894 -8032 54731 84555 68530 28247 36207 78417 121194
$$ packed form
13892h6627L1503Q7386J1942l3754n0698j9970N131k9949j0855K2045P681J7844
13880d8321L2693M1213K681k9537K5993J7872L1731K9988J8319m9852l3592l823
13868C5365P705k2152p807J2370L2680k2078l3733Q831n2458l0058M1315J6158
13856a3862N91l5145m070J7747K1164L2716m5364m3259J8465L0357J3355R673
13844B368m6633n0268m857N0267L567k3823o66K448R7421N3265m0812n6590K4127
13831I814J3263j4101L5056q870l5641K7032n440k8849J8488M0989M3543K2859
13819A18143m5949l8178J50l6319m1837n8483K096M1571j2064L3768M5074J4537
13807B2509q33n9023K517N7641l6705N862O2763K9824j6025m0283P960M2210M2777
$$ plain form
13794 121194 123223 78057 11773 -9911 -48987 -25339 9017 71946 48506 23258 30902 -7413
13782 -7413 6116 41799 99191 41000 -16515 3346 15785 -2633 -36806 -74124 -110513 -144951
13770 -144951 -136649 -108528 -79523 -37226 11286 -200 7667 17292 -26052 3678 79430 100167
13758 100167 63985 -12078 -80470 -98106 -64658 -28227 -8828 -40003 -58408 -37539 -3675
13747 -3675 31522 24119 37322 16727 18081 33986 1062 1997 4058 14080 11001 -56672 -97617
13734 -97617 -102525 -91786 -35433 17598 5207 -19595 -857 12045 -27830 -51713 -87905 -96046
13722 -96046 -84246 -36725 -27958 -5642 12446 5577 24141 -76550 -108167 -73816 -26652 -16785
13710 -16785 15325 -42663 -45804 -83864 -145828 -86057 -35305 25983 2978 -28286 1470 -9841
$$ packed form
13794A21194K029m5166o6284k1684l9076K3648L4356O2929k3440k5248P644l8315
13782g413J3529L5683N7392n8191n7515J9861J2439j8418l4173l7318l6389l4438
13770a44951Q302K8121K9005M2297M8512j1486P867R625m3344K9730P5752K0737
13758A00167l6182p6063o8392j7636L3448L6431J9399l1175j8405K0869L3864
13747c675L5197p403J3203k0595J354J5905l2924R35K061J0022l079o7673m0945
13734i7617m908J0739N6353N3031j2391k4802J8738J2902l9875k3883l6192q141
13722i6046J1800M7521Q767K2316J8088o869J8564j00691l1617L4351M7164R867
13710a6785L2110n7988l141l8060o1964N9771N0752O1288k3005l1264K9756j1311
$$ plain form
13698 -9841 28439 70733 51207 9297 -8065 -25215 -7018 5188 -4939 3049 38526 42315
13686 42315 -6495 -37453 -15959 22450 11363 -41749 -46034 40288 34102 37957 76039 26366
13674 26366 11809 37993 21000 -2284 -19884 -19368 13695 25159 56056 58778 62227 39799
13662 39799 -23215 -37497 -63307 -91911 -57606 -35537 -20667 30279 -12145 -56201 13589 55284
13650 55284 45975 57832 83430 92428 55834 38307 52567 55271 18754 16485 16381 -3790 613
13637 613 20495 39949 12777 -16990 -24973 -11131 6320 -8184 1542 -14284 -32267 -46105
13625 -46105 -43705 -23760 -16157 4333 35632 23464 -40415 -25802 9412 4065 3879 -1614 -21043
13612 -21043 -26056 -1513 24501 23108 43283 306 -51051 -60732 -43037 247 33589 7661
$$ packed form
13698i841L8280M2294j9526m1910j7362j7150J8197J2206j0127P988L5477L789
13686D2315m8810l0958K1494L8409j1087n3112m285Q6322o186L855L8082m9673
13674B6366j4557K6184j6993k3284j7600N16L3063J1464L0897K722L449k2428
13662C9799o3014j4282k5810k8604L4305K2069J4870N0946m2424m4056O9790M1695
13650E5284r309J1857K5598Q998l6594j7527J4260K704l6517k269j04k0171M403
13637F13J9882J9454k7172k9767p983J3842J7451j4504R726j5826j7983j3838
13625d6105K400J9945P603K0490L1299j2168o3879J4613L5214n347j86n493j9429
13612b1043n013K4543K6014j393K0175m2977n1357r681J7695M3284L3342k5928
$$ plain form
13600 7661 -19987 -39224 -51937 -28747 -21878 -51727 -63242 -26106 42192 1423 -69387 -99372
13588 -99372 -55183 -21021 6208 -3055 -2217 -7130 -56251 -77737 -71436 -81904 -65050 -26081 8282
13575 8282 -14788 -21257 -3291 28998 9219 -838 -21443 -57869 -53296 -13289 7204 26201
13563 26201 7604 -61247 -59287 -64528 -86494 -54181 -42179 -22572 -20521 -2564 54976 44308
13551 44308 -18357 -14483 39064 34804 -27936 -22737 -8269 -17187 -18524 -12052 -10540 -14317 33666
13538 33666 97552 113493 163398 191107 179475 128667 104403 97410 72187 39336 60882 83124
13526 83124 92131 69753 49953 46409 45184 59006 86019 63613 80699 132102 151626 131149
13514 131149 89379 65235 44847 81421 129595 136297 84480 28193 39780 27022 -16408 -14589
$$ packed form
13600G661k7648j9237j2713K3190O869k9849j1515L7136O8298m0769p0810k9985
13588i9372M4189L4162K7229r263Q38m913m9121k1486O301j0468J6854L8969L4363
13575H282k3070o469J7966L2289j9779j0057k0605l6426M573M0007K0493J8997
13563B6201j8597o8851J960n241k1966L2313J2002J9607K051J7957N7540j0668
13551D4308o2665L874N3547m260o2740N199J4468q918j337O472J512l777M7983
13538C3666O3886J5941M9905K7709j1632n0808k4264o993k5223l2851K1546K2242
13526H3124R007k2378j9800l544j225J3822K7013k2406J7086N1403J9524k0477
13514A31149m1770k4144k0388L6574M8174O702n1817n6287J1587j2758m3430J819
$$ plain form
13502 -14589 -6060 -13228 -20040 -6432 25215 6082 -3572 19297 23967 11976 13198 1491 -15517
13489 -15517 -29828 -4767 -42443 -19802 -22357 -23971 11519 23640 -11748 -62850 -80679 -11496
13477 -11496 26292 74620 78499 92374 111153 40064 15812 15193 8676 -22993 -32810 -44387 -53966
13464 -53966 -32016 -5593 45950 79359 50448 9107 51120 28023 29643 46889 12356 10651
13452 10651 40279 62496 -2782 -57559 -25928 -5278 2786 2036 -7876 14348 29504 26789 12766
13439 12766 8546 3165 26433 53367 52619 -12102 -39622 -63635 -62072 -62305 -57025 -29951 3172
13426 3172 19661 -20693 -35455 19430 7234 -2903 34820 30740 39725 4469 -29078 -38472
13414 -38472 -2479 -5548 -64361 -38986 -5498 4962 1998 39620 56552 70370 41078 -13198
$$ packed form
13502a4589Q529p168o812J3608L1647j9133r654K2869M670j1991J222j1707j7008
13489a5517j4311K5061l7676K2641k555j614L5490J2121l5388n1102j7829O9183
13477a1496L7788M8328L879J3875J8779p1089k4252o19o517l1669r817j1577r579
13464e3966K1950K6423N1543L3409k8911m1341M2013k3097J620J7246l4533j705
13452A0651K9628K2217o5278n4777L1631K0650Q064p50r912K2224J5156k715j4023
13439A2766m220n381K3268K6934p48o4721k7520k4013J563k33N280K7074L3123
13426C172J6489m0354j4762N4885j2196j0137L7723m080Q985l5256l3547r394
13414c8472L5993l069n8813K5375L3488J0460k964L7622J6932J3818k9292n4276
$$ plain form
13402 -13198 6867 8341 26202 4898 10984 4090 20822 -9191 -67788 -135739 -110199 13247
13390 13247 37020 11531 41167 54069 119360 143658 139125 119916 102360 40092 24612 5795
13378 5795 -22333 33218 20932 7271 33846 -4 -33276 -47950 -75111 -83602 -75152 -16777
13366 -16777 33797 15975 8139 -16989 -8953 13848 327 -6504 8642 44718 -9343 -45615
13354 -45615 -30041 -58147 -60810 -40353 -25436 -36520 -75062 -50381 -19899 26314 28564 -14719
13342 -14719 -29754 10562 43189 20061 -4088 16650 35940 43297 37805 3888 33522 48737
13330 48737 112462 113704 88179 26547 33611 -12170 -61896 -85127 -62588 -8549 35722 48322
13318 48322 58005 21862 6652 67982 38867 -4343 -8475 14713 -14321 14221 22107 6868
$$ packed form
13402a3198K0065J474J7861k1304O086o894J6732l0013n8597o7951K5540J23446
13390A3247K3773k5489K9636J2902O5291K4298m533j9209j7556o2268j5480j8817
13378E795k8128N5551j2286j3661K6575l3850l3272j4674k7161q491Q450N8375
13366a6777N0574j7822p836k5128Q036K2801j3521o831J5146L6076n4061l6272
13354d5615J5574k8106k663K0457J4917j1084l8542K4681L0482M6213K250m3283
13342a4719j5035M0316L2627k3128k4149K0738J9290P357n492l3917K9634J5215
13330D8737O3725J242k5525o1632P064m5781m9726k3231K2539N4039M4271J2600
13318D8322R683l6143j5210O1330k9115m3210m132K3188k9034K8542P886j5239
$$ plain form
13306 6868 -55561 -9350 56364 67050 46649 44672 1149 -16151 -24060 -31821 -71019 -33315
13294 -33315 1050 20826 86765 80844 71932 51456 27961 33858 107831 124479 73901 1971
13282 1971 -36932 -20639 2530 17359 -13690 -15670 -24059 -57785 -78623 -80073 -72292 -30319 -8190
13269 -8190 -9727 -3615 -41762 -74345 -92845 -80929 -103300 -100651 -56980 -85094 -135753 -106043
13257 -106043 -66623 -51695 -50072 -10898 -39382 -57509 -55135 -6972 53040 59242 83674 52488
13245 52488 23805 13991 181 -14827 -77580 -93987 -84095 -22364 18841 23058 -11765 -33974
13233 -33974 -35453 -52143 -26985 -21452 37520 17163 22071 -17738 -85224 -78931 -9252 8786
13221 8786 4237 -12897 -12070 -18276 -75843 -65861 -54976 -42753 25504 24207 15432 39664 55101
$$ packed form
13306F868o2429M6211O5714J0686k0401j977m3523j7300p909p761l9198L7704
13294c3315L4365J9776O5939n921q912k0476k3495N897P3973J6648n0578p1930
13282A971l8903J6293K3169J4829l1049j980q389l3726k0838j450P781M1973K2129
13269h190j537O112l8147l2583j8500J1916k2371K649M3671k8114n0659K9710
13257a06043L9420J4928J623L9174k8484j8127K374M8163O0012O202K4432l1186
13245E2488k8683r814j3810j5008o2753j6407R892O1731M1205M217l4823k2209
13233c3974j479j6690K5158N533N8972k0357M908l9809o7486O293O9679J8038
13221H786m549j7134Q27o206n7567R982J0885J2223O8257j297q775K4232J5437
$$ plain form
13208 55101 21202 -60579 -66687 -49791 -73465 -30490 11233 -34330 -35712 -64251 -22335 7307
13196 7307 -22501 -56158 -107320 -60864 -7250 -6950 -14843 -11128 -4928 -17315 -587 -21446 -15587
13183 -15587 4808 5076 -32885 -8723 18267 11586 -35360 -19566 22326 17626 -19651 -2286
13171 -2286 -11184 7834 29217 20286 37613 49756 47813 52596 27193 -2949 -17449 -25232 36764
13158 36764 48755 26588 22021 3167 44013 41297 31391 21021 -32777 -80537 -26787 15447
13146 15447 28893 54143 -1297 -43614 -22143 -25983 -19128 27575 38759 40297 36648 55970
13134 55970 34787 -15884 13965 22217 -779 -15841 -41049 -53779 -53863 -25128 -17254 -11873 10044
13121 10044 7858 -15287 -45387 -104774 -116537 -92376 -46715 -36613 -53528 -82702 -70504 -31530
$$ packed form
13208E5101l3899q1781o108J6896k3674M2975M1723m5563j382k8539M1916K9642
13196G307k9808l3657n1162M6456N3614L00p893L715O200j2387J6728k0859N859
13183a5587K0395K68l7961K4162K6990o681m6946J5794M1892m700l7277J7365
13171b286q898J9018K1383q931J7327J2143j943M783k5403l0142j4500p783O1996
13158C6764J1991k2167m567j8854M0846k716r906j0370n3798m7760N3750M2234
13146A5447J3446K5250n5440m2317K1471l840O855M6703J1184J538l649J9322
13134E5970k1183n0671K9849Q252k2996j5062k5208j2730q4K8735P874N381K1917
13121A0044k186k3145l0100n9387j1763K4161M5661J0102j6915k9174J2198L8974
$$ plain form
13109 -31530 -920 -40062 -57044 -55969 -12430 34139 12942 20640 33097 -2747 -20746 -26694
13097 -26694 -38679 -91522 -96993 -26267 -16972 -70585 -6472 76312 79976 46410 8505 15249
13085 15249 57517 39644 51593 18977 -16365 -17491 3580 35724 27256 8346 99 -53963
13073 -53963 -101537 -110088 -69853 -16740 20907 29790 51405 69164 19228 -18160 17762 2068
13061 2068 18180 -17972 -32842 -55457 -44019 -63174 -64512 -64279 -80764 -77793 -10921 37908 52333
13048 52333 36802 50346 21858 48955 66917 25446 6008 -6924 -39371 146 -1867 -1900
13036 -1900 -34021 -12650 61902 75004 20459 -18834 -7191 33933 20312 -45111 -47618 9938
13024 9938 57051 86121 122302 122835 91187 74294 28350 -14750 -21626 6180 -20475 -23022 -12274
$$ packed form
13109c1530L0610l9142j6982J075M3539M6569k1197P698J2457l5844j7999n948
13097b6694j1985n2843n471P0726R295n3613O4113Q2784L664l3566l7905O744
13085A5249M2268j7873J1949l2616l5342j126K1071L2144q468j8910q247n4062
13073e3963m7574q551M0235N3113L7647Q883K1615J7759m9936l7388L5922j5694
13061B068J6112l6152j4870k2615J1438j9155j338K33j6485K971O6872M8829J4425
13048E2333j5531J3544k8488K7097J7962m1471j9438j2932l2447L9517k013l3
13036a900l2121K1371P4552J3102n4545l9293J1643M1124j3621o5423k507N7556
13024I938M7113K9070L6181N33l1648j6893m5944m3100o876K7806k6655k547J0748
$$ plain form
13011 -12274 -18024 -20198 -40697 -20585 3083 609 -6591 -28685 -12678 -20388 8602 -22010 -46895
12998 -46895 -35288 15401 41509 4390 -15935 12861 18521 20711 -867 -42787 -24114 7694
12986 7694 13435 6521 11742 -51101 -82383 -51221 -23249 16759 34414 70556 69566 18063 -35734
12973 -35734 -59186 -45609 -42412 -45118 -54774 -33937 -10040 -36817 -94996 -58636 -30604 -23346
12961 -23346 -5674 -2415 -13538 -61624 -64288 -46560 -60273 -34920 -5352 10755 -9175 -23376
12949 -23376 -28788 -42748 -72367 -75682 -98899 -56907 -1596 42005 70700 71374 64145 61022 86782
12936 86782 28809 41375 23564 1497 -22100 -32753 -6497 -39093 -4073 28745 71257 37233
12924 37233 -3941 -16655 25031 16474 -12220 13697 -16232 -56739 -55216 -32774 -36396 192
$$ packed form
13011a2274n750k174k0499K0112K3668k474p200k2094J6007p710K8990l0612k4885
12998d6895J1607N0689K6108l7119k0325K8796N660K190k1578m1920J8673L1808
12986G694N741o914N221o2843l1282L1162K7972M0008J7655L6142r90n1503n3797
12973c5734k3452J3577L197k706r656K0837K3897k6777n8179L6360K8032P258
12961b3346J7672L259j1123m8086k664J7728j3713K5353K9568J6107j9930j4201
12949b3376n412j3960k9619l315k3217M1992N5311M3601K8695O74p229l123K5760
12936H6782n7973J2566j7811k2067k3597j0653K6256l2596L5020L2818M2512l4024
12924C7233m1174j2714M1686q557k8694K5917k9929m0507J523K2442l622L6588
$$ plain form
12912 192 15262 46506 94657 93385 33469 -4915 2200 27028 55527 71848 97637 56085
12900 56085 92408 95683 48851 56990 57062 -25320 -64803 -8319 11319 13569 48509 77303 84170
12887 84170 31340 -20071 -57598 -68673 -1778 18419 19564 4090 -6337 48327 49510 42928
12875 42928 68009 50275 61195 83176 46248 16127 -26913 -92086 -51417 -27901 2920 -6202
12863 -6202 -31633 -15827 -5173 -19055 -32607 -38993 8172 32557 -9182 -3919 -43314 -97875
12851 -97875 -50658 -5216 20862 31883 12646 13127 -28403 11770 38390 27249 81678 119041
12839 119041 81331 7649 -18506 17289 22485 -51924 -47916 -54006 -51025 -23758 -21399 -15191 -51781
12826 -51781 -2767 39815 -18743 -57189 -37615 4806 1706 -59535 -53073 -39390 -40809 -50750
$$ packed form
12912A92J5070L1244M8151j272n9916l8384P115K4828K8499J6321K5789m1552
12900E6085L6323L275m6832Q139P2q2382l9483N6484J9638K250L4940K8794O867
12887H4170n2830n1411l7527j1075O6895K0197J145j5474j0427N4664J183o582
12875D2928K5081j7734J0920K1981l6928l0121m3040o5173M0669K3516L0821r122
12863f202k5431J5806J0654j3882j3552o386M7165K4385m1739N263l9395n4561
12851i7875M7217M5442K6078J1021j9237M81m1530M0173K6620j1141N4429L7363
12839A19041l7710p3682k6155L5795N196p4409M008o090K981K7267K359O208l6590
12826e1781M9014M2582n8558l8446J9574M2421l100o1241O462J3683j419r941
$$ plain form
12814 -50750 -26724 39353 71093 -22648 -34940 -10017 8134 13521 14893 39584 48015 52813
12802 52813 6792 -27679 -39140 10835 37234 38016 56699 91257 110287 105863 48777 31685
12790 31685 38291 10333 -30612 -39363 -11883 9758 21771 45995 64108 39494 -4999 -59805
12778 -59805 -29961 1544 13780 2960 1651 -10184 -30106 -14655 48 -14842 481 22142
12766 22142 28125 24185 51684 -28560 -88320 -74495 -112119 -117932 -99701 12976 47412 -15588
12754 -15588 -60626 -30585 26034 58315 44669 -5960 -8831 47984 36899 20971 38686 63663
12742 63663 62842 6063 -2143 33048 30168 19902 33803 35917 461 6080 -1347 -42891 -33252
12729 -33252 -30489 -31985 -27966 48211 44126 -1779 5607 20796 -5883 3132 -3791 -16188 -16739
$$ packed form
12814e0750K4026O6077L1740r3741j2292K4923J8151N387J372K4691Q431M798
12802E2813m6021l4471j1461M9975K6399P82J8683L4558J9030m424n7086j7092
12790C1685O606k7958m0945q751K7480K1641J2013K4224J8113k4614m4493n4806
12778e9805K9844L1505J2236j0820j309j1835j9922J5451J4703j4890J5323K1661
12766B2142N983l940K7499q0244n9760J3825l7624n813J8231J12677L4436o3000
12754a5588m5038L0041N6619L2281j3646n0629k871N6815j1085j5928J7715K4977
12742F3663q21n6779q206L5191k880j0266J3901K114l5456N619p427m1544R639
12729c3252K763j496M019P6177m085m5905P386J5189k6679R015o923j2397n51
$$ plain form
12716 -16739 -62697 -57021 2344 53239 60030 50077 23676 52185 49969 8735 -18905 -19527 -44010
12703 -44010 -58249 -94024 -88592 -88786 -83403 -52850 35767 97555 96823 94963 67197 73593 75569
12690 75569 78340 76799 67370 -11368 14099 6912 42172 54678 26460 1812 -17421 28587
12678 28587 22817 9449 -1806 -18252 7476 15808 -31530 4179 -9056 -14390 -39411 -17942
12666 -17942 34529 41981 89808 138095 124510 94991 81411 56783 22057 -38241 -13205 32168
12654 32168 -3435 43295 27730 40849 48986 1146 -56425 -49240 -86955 -90050 -81147 -56769
12642 -56769 -42755 -48283 -35327 -6446 -32089 -49067 -25472 15064 33059 18493 -5304 -12157
12630 -12157 -83887 -73220 -2003 11129 -29548 30395 79903 54204 28670 3787 -5472 17279
$$ packed form
12716a6739m5958N676N9365N0895O791r953k6401K8509k216m1234k7640o22k4483
12703d4010j4239l5775N432j94N383L0553Q8617O1788p32j860k7766O396J976
12690G5569K771j541r429p8738K5467p187L5260J2506k8218k4648j9233M6008
12678B8587n770j3368j1255j6446K5728Q332m7338L5709j3235n334k5021K1469
12666a7942N2471P452M7827M8287j3585k9519j3580k4628l4726o0298K5036M5373
12654C2168l5603M6730j5565J3119Q137m7840n7571P185l7715l095Q903K4378
12642e6769J4014n528J2956K8881k5643j6978K3595M0536J7995j4566k3797o853
12630a2157p1730J0667P1217J3132m0677N9943M9508k5699k5534k4883r259K2751
$$ [...]
##END NTUPLES=NMR SPECTRUM
##END=
