##TITLE=Analysis number 307336
Compound Code btb 07422
Project Code qc-cat
Chemist Name fudan
##JCAMPDX= 6.0         $$ Bruker NMR JCAMP-DX V2.0
##DATA TYPE= NMR SPECTRUM
##DATA CLASS= NTUPLES
##ORIGIN= Bruker BioSpin GmbH
##OWNER= NMR
$$ XWIN-NMR		Version 3.5
$$ Thu Apr 28 10:03:32 2005 GMT Daylight Time (UT+1h)  MAYBRIDGE\NMR@NMR_250MHZ
##.OBSERVE FREQUENCY= 250.131544655141
##.OBSERVE NUCLEUS= ^1H
##.ACQUISITION MODE= SIMULTANEOUS (DQD)
##.ACQUISITION SCHEME= undefined
##.AVERAGES= 16
##.DIGITISER RES= 18
##SPECTROMETER/DATA SYSTEM= dpx250
##.PULSE SEQUENCE= zg30
##.SOLVENT NAME= CDCl3
##.SHIFT REFERENCE= (INTERNAL, CDCl3, 0, 16.522)
##AUDIT TRAIL= $$ (NUMBER, WHEN, WHO, WHERE, WHAT)
$$ ##TITLE= Audit trail, XWIN-NMR		Version 3.5
$$ ##JCAMPDX= 5.01
$$ ##ORIGIN= Bruker BioSpin GmbH
$$ ##OWNER= NMR
$$ C:\u/data/dgb/nmr/ADRS/2380/pdata/1/auditp.txt
$$ ##AUDIT TRAIL=  $$ (NUMBER, WHEN, WHO, WHERE, WHAT)
(   1,<2005-04-28 10:03:12.60 +100>,<MAYBRIDGE\NMR>,<NMR_250MHZ>,
      <created by zg, POWCHK disabled, PULCHK disabled
       configuration hash MD5:
       62 19 C7 07 E1 42 D1 B7 37 6C 3D D0 77 39 F9 E6
       data hash MD5: 64K
       E7 EE 50 E2 B4 16 94 34 C7 B3 98 6B CC B6 90 06>)
(   2,<2005-04-28 10:03:24.46 +100>,<MAYBRIDGE\NMR>,<NMR_250MHZ>,
      <Start of raw data processing
       ef LB = 0.3 FT_mod = 6 PKNL = 1 SI = 32K 
       data hash MD5: 32K
       74 42 CC AC C3 7B 30 D5 46 1D FF B7 E1 78 AF 69>)
(   3,<2005-04-28 10:03:26.32 +100>,<MAYBRIDGE\NMR>,<NMR_250MHZ>,
      <apk 
       data hash MD5: 32K
       9C 29 39 AC 51 33 4B 0A 6B 68 F0 FB 80 2F FD 28>)
(   4,<2005-04-28 10:03:27.04 +100>,<MAYBRIDGE\NMR>,<NMR_250MHZ>,
      <abs ABSG = 5 
       data hash MD5: 32K
       8B ED 80 1D C7 2B 1B B9 B5 58 E6 E8 3D DF CA 05>)
$$ ##END=
$$ 
$$ hash MD5
$$ A0 24 BB 58 64 89 0D 61 C8 5C 60 D6 42 62 01 BC
##$RELAX= 
##$RELAX= 
##$RELAX= 
##$RELAX= 
##$RELAX= 
##$RELAX= 
##$RELAX= 
$$ Bruker specific parameters
$$ --------------------------
##$DU= <C:\u>
##$EXPNO= 2380
##$NAME= <ADRS>
##$PROCNO= 1
##$TYPE= <nmr>
##$USER= <dgb>
##$AMP= (0..31)
100 100 100 100 100 100 100 100 100 100 100 100 100 100 100 100 100 100 
100 100 100 100 100 100 100 100 100 100 100 100 100 100 
##$AQSEQ= 0
##$AQ_mod= 3
##$AUNM= <au_zg>
##$AUTOPOS= <5 >
##$BF1= 250.13
##$BF2= 250.13
##$BF3= 250.13
##$BF4= 250.13
##$BF5= 500.13
##$BF6= 500.13
##$BF7= 500.13
##$BF8= 500.13
##$BYTORDA= 1
##$CFDGTYP= 0
##$CFRGTYP= 5
##$CHEMSTR= <none>
##$CNST= (0..31)
1 1 145 1 1 1 1 1 1 1 1 1 1 1 1 1 1 1 1 1 1 1 1 1 1 1 1 1 1 1 1 1 
##$CPDPRG= <>
##$CPDPRG1= <>
##$CPDPRG2= <>
##$CPDPRG3= <>
##$CPDPRG4= <mlev>
##$CPDPRG5= <mlev>
##$CPDPRG6= <mlev>
##$CPDPRG7= <mlev>
##$CPDPRG8= <mlev>
##$CPDPRGB= <>
##$CPDPRGT= <>
##$D= (0..31)
0 1 0 0 0 0 0 0 0 0.06 0 0 0 0 0 0 0.0002 0 0 0 0 0 0 0 0 0 0 0 0 0 0 
0 
##$DATE= 1114678991
##$DBL= (0..7)
120 120 120 120 120 120 120 120 
##$DBP= (0..7)
150 150 150 150 150 150 150 150 
##$DBP07= 0
##$DBPNAM0= <>
##$DBPNAM1= <>
##$DBPNAM2= <>
$$ [...]
##$SUBNAM7= <"">
##$SUBNAM8= <"">
##$SUBNAM9= <"">
##$SW= 20.6930455092707
##$SWIBOX= (0..15)
0 0 3 0 0 0 0 0 0 0 0 0 0 0 0 0 
##$SW_h= 5175.983436853
##$TD= 65536
##$TD0= 1
##$TE= 295.16
##$TE2= 300
##$TE3= 300
##$TEG= 300
##$TL= (0..7)
0 120 120 120 120 120 120 120 
##$TP= (0..7)
150 150 150 150 150 150 150 150 
##$TP07= 0
##$TPNAME0= <>
##$TPNAME1= <>
##$TPNAME2= <>
##$TPNAME3= <>
##$TPNAME4= <>
##$TPNAME5= <>
##$TPNAME6= <>
##$TPNAME7= <>
##$TPOAL= (0..7)
0.5 0.5 0.5 0.5 0.5 0.5 0.5 0.5 
##$TPOFFS= (0..7)
0 0 0 0 0 0 0 0 
##$TUNHIN= 0
##$TUNHOUT= 0
##$TUNXOUT= 0
##$USERA1= <user>
##$USERA2= <user>
##$USERA3= <user>
##$USERA4= <user>
##$USERA5= <user>
##$V9= 5
##$VALIST= <valist>
##$VCLIST= <CCCCCCCCCCCCCCC>
##$VD= 0
##$VDLIST= <DDDDDDDDDDDDDDD>
##$VPLIST= <PPPPPPPPPPPPPPP>
##$VTLIST= <TTTTTTTTTTTTTTT>
##$WBST= 1024
##$WBSW= 4
##$XGAIN= (0..3)
0 0 0 0 
##$XL= 0
##$YL= 0
##$YMAX_a= 396974
##$YMIN_a= -328604
##$ZGOPTNS= <>
##$ZL1= 120
##$ZL2= 120
##$ZL3= 120
##$ZL4= 120
##$ABSF1= 16.522
##$ABSF2= -4.171173
##$ABSG= 5
##$ABSL= 3
##$ALPHA= 0
##$AQORDER= 0
##$ASSFAC= 0
##$ASSFACI= 0
##$ASSFACX= 0
##$ASSWID= 0
##$AUNMP= <proc_1d>
##$AZFE= 0.1
##$AZFW= 0.1
##$BCFW= 0
##$BC_mod= 0
##$BYTORDP= 0
##$COROFFS= 0
##$CY= 12.5
##$DATMOD= 1
##$DC= 0
##$DFILT= <>
##$DTYPP= 0
##$F1P= 14.0000005364418
##$F2P= -0.99999901652339
##$FCOR= 0.5
##$FTSIZE= 32768
##$FT_mod= 6
##$GAMMA= 0
##$GB= 0
##$INTBC= 1
##$INTSCL= 1
##$ISEN= 128
##$LB= 0.3
##$LEV0= 0
##$LPBIN= 0
##$MAXI= 10000
##$MC2= 0
##$MEAN= 0
##$ME_mod= 0
##$MI= 0
##$NCOEF= 0
##$NC_proc= -5
##$NLEV= 6
##$NOISF1= 0
##$NOISF2= 0
##$NSP= 0
##$NTH_PI= 0
##$NZP= 0
##$OFFSET= 16.522
##$PC= 1
##$PHC0= -67.28207
##$PHC1= 1.772555
##$PH_mod= 1
##$PKNL= yes
##$PPARMOD= 0
##$PSCAL= 4
##$PSIGN= 0
##$REVERSE= no
##$SF= 250.13
##$SI= 32768
##$SIGF1= 0
##$SIGF2= 0
##$SINO= 400
##$SIOLD= 32768
##$SREGLST= <1H.CDCl3>
##$SSB= 0
##$STSI= 32768
##$STSR= 0
##$SW_p= 5175.98343685301
##$SYMM= 0
##$S_DEV= 0
##$TDeff= 65536
##$TDoff= 0
##$TI= <Analysis number 999999
Compound Code 99
Book Reference 9
Project Code 9>
##$TILT= no
##$TM1= 0
##$TM2= 0
##$TOPLEV= 0
##$USERP1= <user>
##$USERP2= <user>
##$USERP3= <user>
##$USERP4= <user>
##$USERP5= <user>
##$WDW= 1
##$XDIM= 32768
##$YMAX_p= 265007862
##$YMIN_p= -657961
$$ End of Bruker specific parameters
$$ ---------------------------------
##NTUPLES= NMR SPECTRUM
##VAR_NAME=  FREQUENCY,     SPECTRUM/REAL,   SPECTRUM/IMAG
##SYMBOL=    X,             R,               I
##VAR_TYPE=  INDEPENDENT,   DEPENDENT,       DEPENDENT
##VAR_FORM=  AFFN,          ASDF,            ASDF
##VAR_DIM=   32768,         32768,           32768
##UNITS=     HZ,            ARBITRARY UNITS, ARBITRARY UNITS
##FACTOR=    0.157963299565203, 1,           1
##FIRST=     4132.6476996994, 0,             0
##LAST=      -1043.33573715361, 0,           0
##MIN=       -1043.33573715361, -657961,     0
##MAX=       4132.6476996994, 265007862,     0
$$ Real data points
##PAGE= N=1
##DATA TABLE= (X++(R..R)), XYDATA
$$ [...]
$$ plain form
22504 -85189 -41847 -45861 -21121 61873 -111505 -162894 -194740 -144689 -118732 -194649 -322525
22493 -322525 -347254 -157148 11056 111344 130870 -19212 -148709 35696 84338 73545
22483 73545 -10249 -131072 -71148 -155935 -91510 8755 200884 173282 28749 -106031 -95945
22472 -95945 -147316 -170719 -184627 -164927 -86565 24803 -169776 -157289 -119420 -128259 -36062
22461 -36062 -80318 -170880 -160724 -86728 -29041 2376 131023 182342 113239 19576 152104
22450 152104 50026 -136418 -151755 -12693 121577 -84734 -140100 -88154 -10727 -47746
22440 -47746 -109796 -815 216737 180187 109759 100087 -141905 -302973 -258784 -340251 -259655
22429 -259655 -175013 -230863 -206241 -223165 -129723 2033 79189 151861 184060 182368 42431
$$ packed form
22504h5189M3342m014K4740Q2994j73378n1389l1846N0051K5957p5917j27876
22493c22525k4729J90106J68204J00288J9526j50082j29497J84405M8642j0793
22483G3545q3794j20823N9924q4787O4425J00265J92129k7602j44533j34780J0086
22472i5945n1371k3403j3908J9700P8362J11368j94579J2487L7869q839R2197
22461c6062m4256r0562J0156P3996N7687L1417J28647N1319o9103r3663J32528
22450A52104j02078j86444j5337J39062J34270k06311n5366N1946P7427l7019
22440d7746o2050J08981K17552l6550p0428r672k41992j61068M4189q1467Q0596
22429b59655Q4642n5850K4622j6924R3442J31756P7156P2672L2199j692j39937
$$ plain form
22418 42431 -36516 -89924 -228028 -188447 -136526 -220723 -203771 -315653 -262496 -259923 -386431
22407 -386431 -172962 -34703 -93553 -82975 -23696 -142523 -174312 -204680 -137839 -75876 -240424
22396 -240424 -426133 -391258 -255458 -45278 76552 -74916 -135359 -99368 -91858 17143
22386 17143 180086 201587 -67743 -204275 -290556 -322398 -270418 -68636 -151062 -242578 -204252
22375 -204252 -274321 -289282 -251741 -226459 -344838 -393985 -179299 -8179 20799 67669 221054
22364 221054 271687 -8571 -104974 -47307 25992 -72908 -203598 -109171 -42286 -98260 -179106
22353 -179106 -170836 -74218 -89068 -250286 -205443 -193836 -85741 138567 196747 207741 55671
22342 55671 -19139 124350 222107 186818 -7990 -68965 -97906 5624 191447 276283 263876
$$ packed form
22418D2431p8947n3408j38104L9581N1921q4197J6952j11882N3157K573j26508
22407c86431K13469J38259n8850J0578N9279j18827l1789l0368O6841O1963j64548
22396b40424j85709L4875J35800K10180J21830j51468o0443L5991P510J09001
22386A7143J62943K1501k69330j36532q6281l1842N1980K01782q2426r1516L8326
22375b04252p0069j4961L7541K5282j18379m9147K14686J71120K8978M6870J53385
22364B21054N0633k80258r6403N7667P3299r8900j30690R4427O6885n5974q0846
22353a79106Q270R6618j4850j61218M4843J1607J08095K24308N8180J0994j52070
22342E5671p4810J43489R7757l5289j94808o0975k8941J03530J85823Q4836j2407
$$ plain form
22331 263876 58894 -70055 32993 -30612 -63681 -49264 -216019 -189915 -47654 43927
22321 43927 209776 137675 15422 -107247 -126050 -112619 -193339 -190113 -124563 -53989 -65241
22310 -65241 -89281 166018 161487 40024 80344 62156 -50998 -118647 -121109 -193919 -204240
22299 -204240 -214987 -233642 -121021 -128049 -105092 -175641 -231696 -189357 -173553 -120916 -12974
22288 -12974 100751 34294 -39615 -47114 -226394 -295632 -211550 -220819 -138645 38319 118926
22277 118926 91061 214783 235841 195740 162070 141023 124424 71152 46812 22652 44533
22266 44533 58678 -156980 -288621 -97576 -130770 30942 88685 60124 3620 -40743 -120502
22255 -120502 -156246 -29264 -24119 -78671 34000 -31924 -139867 -7150 18688 151307 142738
$$ packed form
22331B63876k04982j28949J03048o3605l3069J4417j66755K6104J42261R1581
22321D3927J65849p2101j22253j22669j8803J3431q0720L226O5550P0574j1252
22310f5241k4040K55299m531j21463M0320j8188j13154o7649k462p2810j0321
22299b04240j0747j8655J12621p028K2957p0549n6055M2339J5804N2637J07942
22288a2974J13725o6457p3909p499j79280o9238Q4082r269Q2174J76964Q0607
22277A18926k7865J23722K1058m0101l3670k1047j6599n3272k4340k4160K1881
22266D4533J4145k15658j31641J91045l3194J61712N7743k8561n6504m4363p9759
22255a20502l5744J26982N145n4552J12671o5924j07943J32717K5838J32619q569
$$ plain form
22244 142738 -29819 65748 6510 -9609 67209 10684 -96769 -8616 -35294 -111281 -127991
22233 -127991 -117667 -21181 -225157 -347056 -196688 34199 107086 8758 -208633 -256582
22223 -256582 -191295 -165509 -127232 -173306 -139282 -74823 -97380 -69513 -77897 -102595 -188712 -124997
22211 -124997 24920 32648 -177017 -174241 -285789 -335495 -254065 -160613 -125821 65040 79303
22200 79303 -61632 -147885 -59860 -58325 -49431 9019 39791 120611 55712 -37463 -23396 140654
22188 140654 277362 379599 375963 412147 340683 241984 36185 -83465 3743 -7572 -161164
22177 -161164 -259436 -215161 -71030 -221430 -196512 38096 87932 92364 179393 -65147 -221020
22166 -221020 -142928 -82250 -76471 -74817 -150365 -123442 -144949 -207459 -252062 -364175 -356082 -326564
$$ packed form
22244A42738j72557R5567n9238j6119P6818n6525j07453Q8153k6678p5987j6710
22233a27991J0324R6486k03976j21899J50368K30887P2887r8328k17391m7949
22223b56582O5287K5786L8277m6074L4024O4459k2557K7867q384k4698q6117O3715
22211a24997J49917P728k09665K776j11548m9706Q1430R3452L4792J90861J4263
22200G9303j40935q6253Q8025J535Q894N8450L0772Q0820o4899r3175J4067J64050
22188A40654J36708J02237l636L6184p1464r8699k05799j19650Q7208j1315j53592
22177a61164r8272M4275J44131j50400K4918K34608M9836M432Q7029k44540j55873
22166b21020P8092O0678N779J654p5548K6923k1507o2510m4603j12113Q093K9518
$$ plain form
22154 -326564 -153407 121556 141476 42450 154431 350606 196435 125535 124746 162443 -81081
22143 -81081 -245722 -183073 -104270 -21840 -51692 50716 78753 53255 -20211 -221904 -205060
22132 -205060 -156896 -176509 -203449 -258808 -242310 -180899 -128878 -252844 -292054 -279801 -231731
22121 -231731 -170919 -101106 160364 114528 151204 1991 -90756 -105074 3826 112970 -59934
22110 -59934 -112596 -7940 98061 49442 54418 129947 218607 145148 -67429 2342 -63284
22099 -63284 -4896 1601 -126262 -218329 -179826 84752 173480 -25957 -159311 -239188 -96954
22088 -96954 -62081 -76400 -42036 -213749 -169404 -16384 -56176 -108893 -191181 -340585 -484749
22077 -484749 -418213 -212100 -120473 -131470 -139210 -165093 -306071 -322801 -123351 28455 -24485
$$ packed form
22154c26564J73157K74963J9920r9026J11981J96175j54171p0900p89L7697k43524
22143h1081j64641O2649P8803Q2430k9852J02408K8037k5498p3466k01693J6844
22132b05060M8164j9613k6940n5359J6498O1411N2021j23966l9210J2253M8070
22121b31731O0812O9813K61470m5836L6676j49213r2747j4318J08900J09144j72904
22110e9934n2662J04656J06001m8619M976P5529Q8660p3459k12577O9771o5626
22099f3284N8388O497j27863r2067L8503K64578Q8728j99437j33354p9877J42234
22088i6954L4873j4319L4364j71713M4345J53020l9792n2717q2288j49404j44164
22077d84749O6536K06113R1627j0997p740k5883j40978j6730J99450J51806n2940
$$ plain form
22066 -24485 -48999 -64673 24050 114049 227579 345686 362997 270636 25931 -76637 -214915
22055 -214915 -279118 -271281 -163957 -31389 79709 -8702 -117389 -118007 -40900 -36971 -122147
22044 -122147 -139007 -289412 -265942 -181896 -102730 -151024 -231944 -212784 -144888 -97686 29726
22033 29726 46996 -301 -11584 -44386 -147933 -127287 -72039 38766 94892 42745 -126486
22022 -126486 -181802 -175578 -274201 -401237 -498235 -489387 -231852 -112457 43816 186578 23573
22011 23573 40537 79570 137316 190081 58271 -53864 -76111 -46953 42980 -36502 -39252
22000 -39252 8721 53546 63533 3214 65587 38553 -154432 -235691 -95721 48515 -16122
21989 -16122 -132776 -87819 -110978 -220367 -189418 -71751 -9459 53470 56397 25574 107805
$$ packed form
22066b4485k4514j5674Q8723Q9999J13530J18107J7311r2361k44705j02568j38278
22055b14915o4203P837J07324J32568J11098q8411j08687o18P7107L929q5176
22044a22147j6860j50405K3470Q4046P9166m8294q0920J9160O7896M7202J27412
22033B9726J7270m7297j1283l2802j03547K0646N5248J10805N6126n2147j69231
22022a26486n5316O224r8623j27036r6998Q848K57535J19395J56273J42762j63005
22011B3573J6964L9033N7746N2765j31810j12135k2247K9158Q9933p9482k750
22000c9252M7973M4825R987o0319O2373k7034j92985q1259J39970J44236o4637
21989a6122j16654M4957k3159j09389L0949J17667O2292O2929K927l0823Q2231
$$ plain form
21978 107805 112768 193393 245170 173718 101990 -18366 2846 52134 58095 55227 -56522 -19419
21966 -19419 -19203 -40841 -81269 -76001 -71763 -89251 -21729 144793 80535 83275 209148 214042
21954 214042 120264 76886 38312 121450 203633 188641 37631 -86726 -251875 -430575 -328173
21943 -328173 -195349 -82070 -131150 -87764 -78915 -9943 -104080 58419 274096 228928 114571
21932 114571 54692 64606 31853 71566 31555 65557 33574 -8546 -78802 -136860 -112838 -62217
21920 -62217 -62469 72729 67619 113822 143990 106620 80469 2989 6203 -138178 -282835 -279510
21908 -279510 -239460 -158547 78505 -28818 -130445 24002 7845 12374 -18928 5656 107209
21897 107209 127258 135594 101159 -60599 -57224 -18178 -10438 43901 16760 55582 142314 52170
$$ packed form
21978A07805M963Q0625N1777p1452p1728j20356K1212M9288N961k868j11749L7103
21966a9419K16k1638m0428N268M238j7488O7522J66522o4258K740J25873M894
21954B14042r3778m3378l8574Q3138Q2183j4992j51010j24357j65149j78700J02402
21943c28173J32824J13279m9080M3386Q849O8972r4137J62499K15677m5168j14357
21932A14571n9879R914l2753L9713m0011L4002l1983m2120p0256n8058K4022N0621
21920f2217k52J35198n110M6203L0168l7370k6151p7480L214j44381j44657L325
21908b79510M0050Q0913K37052j07323j01627J54447j6157M529l1302K4584J01553
21897A07209K0049Q336l4435j61758L375L9046P740N4339k7141L8822Q6732r0144
$$ plain form
21885 52170 -86358 -67758 -22485 -120142 -192733 -218431 -225746 -167832 -198683 -233354 -103915
21874 -103915 91237 87925 77068 77304 7076 -88606 -74661 -207827 -141792 -69192 -130934 -156624
21862 -156624 -256692 -258062 48305 -16548 8194 102963 242923 251264 197344 330588 502806
21851 502806 318959 49426 -106781 -205982 -192405 -200738 -158858 -184586 -188494 -337829 -444157
21840 -444157 -323234 -256692 -349035 -543142 -488851 -409170 -403150 -384175 -272149 -92225 -78654
21829 -78654 -139653 77644 194069 143426 21101 -30583 14919 168964 128522 -53885 -62512
21818 -62512 124721 194632 98588 122666 125920 9729 -62084 -7972 -137699 -377738 -336720
21807 -336720 -314528 -310993 -395554 -465207 -380091 -180559 -101327 -116218 -115351 -69064 -125928 -121900
$$ packed form
21885E2170j38528J8600M5273r7657p2591k5698p315N7914l0851l4671J29439
21874a03915J95152l312j0857K36p0228r5682J3945j33166O6035P2600o1742k5690
21862a56624j00068j370L06367o4853K4742R4769J39960Q341n3920J33244J72218
21851E02806j83847k69533j56207r9201J3577q333M1880k5728l908j49335j06328
21840d44157J20923O6542r2343j94107N4291P9681O020J8975J12026J79924J3571
21829g8654o0999K17297J16425n0643j22325n1684M5502J54045m0442j82407q627
21818f2512J87233O9911r6044K4078L254j16191p1813N4112j29727k40039M1018
21807c36720K2192L535q4561o9653Q5116J99532P9232j4891Q67M6287n6864M028
$$ plain form
21795 -121900 -190265 -210992 -187337 -210892 -167315 -97215 -149841 -191364 -145797 -198643 -102678
21784 -102678 17934 57372 8469 152758 167172 109595 39667 -74636 -51356 -25422 -58098
21773 -58098 -971 -10990 -47622 -126655 -74057 137956 168851 -159 -71157 -46532 -80718
21762 -80718 156125 313106 304850 216455 163353 122211 151584 96687 -133170 -275320 -293433
21751 -293433 -76625 -96419 -156956 -91502 -188206 -110231 2592 -31681 -43179 -16984 -49607
21740 -49607 92631 -3052 -188291 -189440 -133512 -152331 -36851 126523 95452 -59205 -117279
21729 -117279 -41441 -97545 -48137 13316 -13136 -7645 43633 -83895 -184644 -248605 -143219
21718 -143219 -46750 24143 -32424 -26883 131175 249068 183336 -183677 -304725 -234317 -224166
$$ packed form
21795a21900o8365k0727K3655k3555M3577P0100n2626m1523M5567n2846R5965
21784a02678J20612L9438m8903J44289J4414n7577o9928j14303K3280K5934l2676
21773e8098N7127j0019l6632p9033N2598K12013L0895j69010p0998K4625l4186
21762h0718K36843J56981q256q8395n3102m1142K9373n4897k29857j42150j8113
21751b93433K16808j9794o0537O5454r6704P7975J12823l4273j1498K6195l2623
21740d9607J42238r5683j85239j149N5928j8819J15480J63374l1071j54657n8074
21729a17279P5838n6104M9408O1453k6452N491N1278j27528j00749o3961J05386
21718a43219R6469P0893n6567N541J58058J17893o5732l67013j21048P0408J0151
$$ plain form
21707 -224166 -178950 -99865 -71462 -9980 60591 -20850 -123756 -37706 -48587 -3849 -25402
21696 -25402 -79713 -74725 4511 23240 -14532 -296011 -382356 -393653 -407616 -266300 -208799
21685 -208799 -99163 -48689 -174320 -212444 -104293 -54865 93296 -2265 -126939 17293
21675 17293 142052 169572 27232 53741 41882 -128026 -102808 -217760 -284593 -288374 -250965
21664 -250965 -152163 -43235 -163499 -289528 -235242 -135063 -236862 -296392 -396247 -319770
21654 -319770 -379556 -373364 -251055 -196262 -203157 -213443 -131815 -92754 -96713 9539 -10486 -34587
21642 -34587 -33879 -208449 -253186 -291506 -259040 -194098 -51256 -98281 -80187 181115 30783
21631 30783 -199567 -24093 89257 36397 -1019 41049 53526 118808 197250 267076 142184
$$ packed form
21707b24166M5216P9085K8403O1482P0571q1441j02906Q6050j0881M4738k1553
21696b5402n4311M988P9236J8729l7772k81479q6345j1297j3963J41316N7501
21685b08799J09636N0474j25631l8124J08151M9428J48161r5561j24674J44232
21675A7293J24759K7520j42340K6509j1859j69908K5218j14952o6833l781L7409
21664b50965R8802J08928j20264j26029N4286J00179j01799n9530r9855P6477
21654c19770n9786O192J22309N4793o895j0286Q1628L9061l959J06252k0025k4101
21642c4587P08j74570m4737l8320L2466O4942J42842m7025J8094K61302j50332
21631C0783k30350J75474J13350n2860l7416M2068J2477O5282P8442O9826j24892
$$ plain form
21620 142184 -14874 -3232 61343 5257 50011 -64438 18474 32394 151540 289442 217738
21609 217738 205587 324146 330686 149069 90888 41210 48851 144548 223339 113227 39949
21598 39949 -142153 -118821 2633 -18651 -135827 -87072 -179777 -208639 -43837 -14256 -73062
21587 -73062 -15454 48885 32158 67994 -1402 -356823 -447718 -110415 126826 134988 113297
21576 113297 75420 140712 224245 182794 132117 198303 316783 274081 -40508 -181693 39157
21565 39157 126840 114728 10388 -40628 -36874 -20074 72785 145056 162894 95923 -57066
21554 -57066 28664 88993 -105712 -192004 -207857 -261744 -190998 -87991 15871 -97375 -158480
21543 -158480 -14699 142021 137567 -46245 32773 124999 88876 -25347 -37893 -98375 -58140
$$ packed form
21620A42184j57058J1642O4575n6086M4754j14449Q2912J3920J19146J37902p1704
21609B17738j2151J18559O540j81617n8181m9678P641R5697P8791j10112p3278
21598C9949j82102K3332J21454k1284j17176M8755r2705k8862J64802K9581n8806
21587g3062N7608O4339j6727L5836o9396l55421r0895L37303K37241Q162k1691
21576A13297l7877O5292Q3533m1451n0677O6186J18480m2702l14589j41185K20850
21565C9157Q7683j2112j04340n1016L754J6800R2859P2271J7838o6971j52989
21554e7066Q5730O0329j94705q6292j5853n3887P0746J03007J03862j13246o1105
21543a58480J43781J56720m454j83812P9018R2226l6123j14223j2546o0482M0235
$$ plain form
21532 -58140 53021 24638 -80097 10078 114441 65857 -26755 -36301 83627 102623 -7062
21521 -7062 -104791 109996 218524 179969 153726 40833 91137 227123 203897 191600 227640
21510 227640 42422 73148 103522 127586 34413 37061 159600 236805 316802 219057 -66304
21499 -66304 -20765 -40577 -75302 105282 221179 200808 61262 -61768 -90189 -71784 24317
21488 24317 61124 86474 227743 426560 241531 130729 -35112 -114275 -52620 -74302 -152809
21477 -152809 -117343 -38320 -6226 -137252 -209794 -132443 -230412 -241483 -127886 -86178 -114763
21466 -114763 -36350 -11827 -32469 -239070 -130943 -135394 -62282 -55378 -90776 -144095 -79238
21455 -79238 35393 104143 124771 120113 502 -39824 17091 -4846 85539 -83955 -221964
$$ packed form
21532e8140J11161k8383j04735R0175J04363m8584r2612r546J19928J8996j09685
21521g062r7729K14787J08528l8555k6243j12893N0304J35986k3226j2297L6040
21510B27640j85218L0726L0374K4064r3173K648J22539P7205P9997r7745k85361
21499f6304M5539j9812l4725J80584J15897k0371j39546j23030k8421J8405R6101
21488B4317L6807K5350J41269J98817j85029j10802j65841p9163O1655k1682p8507
21477a52809L5466P9023L2094j31026p2542P7351r7969j1071J13597M1708k8585
21466a14763P8413K4523k0642k06601J08127m451P3112O904l5398n3319O4857
21455g9238J14631O8750K0628m658j19611m0326N6915k1937R0385j69494j38009
$$ plain form
21444 -221964 -221349 -320250 -308090 -163745 -4640 20847 -120853 -35936 12654 -119494 -213511
21433 -213511 -344137 -221067 -77263 -98187 -8096 -102226 31976 109292 101924 58793 -60604
21422 -60604 -64372 111729 7805 -122353 -47183 -130168 -323828 -336701 -195571 -57110 -65956
21411 -65956 91453 85941 128239 141927 201714 46409 -191297 -219546 -234349 -255046 -61971
21400 -61971 107685 -156928 -326028 -189739 43356 60117 79668 20622 -34413 -233925
21390 -233925 -179917 -102381 -184632 -257873 -271912 -224531 -265803 -149056 141655 142546 -45508
21379 -45508 -42411 48901 -61701 -228158 -234978 -254602 -94052 -116795 -194311 -167599 -146446
21368 -146446 -248873 -286493 -280374 -391099 -136802 -154298 -338528 -309468 -273106 -282519 -164079
$$ packed form
21444b21964O15r8901J2160J44345J59105K5487j41700Q4917M8590j32148r4017
21433b13511j30626J23070J43804k0924R0091r4130J34202P7316p368m3131j19397
21422f0604l768J76101j03924j30158P5170q2985j93660j2873J41130J38461q846
21411f5956J57409n512M2298J3688N9787j55305k37706k8249j4803k0697J93075
21400f1971J69656k64613j69100J36289K33095J6761J9551n9046n5035j99512
21390b33925N4008P7536q2251p3241j4039M7381m1272J16747K90711Q91j88054
21379d5508L097R1312j10602j66457o820j9624J60550k2743p7516K6712K1153
21368a46446j02427l7620O119j10725K54297j7496j84230K9060L6362r413J18440
$$ plain form
21357 -164079 -85736 -118340 -232100 -143643 81920 174127 128496 -111928 40148 31786 -134910
21346 -134910 -48254 -119846 -109609 -29274 39993 78088 -44834 -58736 -88188 -24937 -70578
21335 -70578 -98867 -125767 -259645 -411640 -536053 -366881 -111359 -110118 -109610 63143 113588
21324 113588 80103 46375 54620 49150 49285 64925 96829 23245 13058 -55568 -50092 22993
21312 22993 -22627 -54323 -151726 -197991 -157450 13946 6382 107007 33220 -48937 -125620
21301 -125620 -84526 35607 55149 -695 -161707 -191622 -231443 -216462 -150268 -211474 -163887
21290 -163887 -65449 -127222 -139213 -212787 -222655 -183482 -157325 -250018 -204371 -90155 -190920
21279 -190920 -355178 -277487 -100459 -81105 -44643 106441 18209 -97548 -82760 -109449 -213154
$$ packed form
21357a64079P8343l2604j13760Q8457K25563R2207m5631k40424J52076q362j66696
21346a34910Q6656p1592J0237Q0335O9267L8095j22922j3902k9452O3251m5641
21335g0578k8289k6900j33878j51995j24413J69172K55522J241N08J72753N0445
21324A13588l3485l3728Q245n470J35J5640L1904p3584j0187o8626N476P3085
21312B2993m5620l1696r7403m6265M0541J71396p564J00625p3787q2157p6683
21301a25620M1094J20133J9542n5844j61012k9915l9821J4981O6194o1206M7587
21290a63887R8438o1773j1991p3574r868L9173K6157r2693M5647J14216j00765
21279a90920j64258P7691J77028J9354L6462J51084q8232j15757J4788k6689j03705
$$ plain form
21268 -213154 -267273 -165921 -29768 -25311 59105 137185 15739 -70608 -78180 13582 129404
21257 129404 69782 69727 -21341 -9790 11919 9405 -32049 50959 86383 30787 8374 -39430
21245 -39430 -238596 -329918 -193785 -46219 -67397 -66436 -193483 -283088 -339950 -316771 -233997
21234 -233997 -15866 159630 212212 281708 381006 357567 356328 178943 124678 223504 191134
21223 191134 179155 171262 115950 59991 206062 154847 -32371 -65878 -141165 -149837 -185645
21212 -185645 -115491 -68174 -201828 -234125 -186263 -14979 -4404 22672 -225055 -307247 -269211
21201 -269211 -331560 -324747 -202252 -47389 -10708 -53845 -7648 -3638 51037 203212 338937
21190 338937 253000 178689 191602 190285 22502 -96785 11608 84459 135463 5169 -22985
$$ packed form
21268b13154n4119J01352J36153M457Q4416P8080j21446q6347p572R1762J15822
21257A29404n9622n5r1068J1551K1709k514m1454Q3008L5424n5596k2413m7804
21245c9430j99166r1322J36133J47566k1178R61j27047q9605n6862K3179Q2774
21234b33997K18131J75496N2582O9496R9298k3439j239j77385n4265R8826l2370
21223A91134j1979p893n5312n5959J46071n1215j87218l3507p5287q672l5808
21212a85645P0154M7317j33654l2297M7862J71284J0575K7076k47727q2192L8036
21201b69211o2349O813J22495J54863L6681m3137M6197M010N4675J52175J35725
21190C38937q5937p4311J2913j317j67783j19287J08393P2851N1004j30294k8154
$$ plain form
21179 -22985 28864 -17827 26242 -96785 -144920 -64024 61570 92126 -107669 -267794 -285614
21168 -285614 -264754 -124529 -113671 -144809 1484 24041 -43915 -46275 -9853 -36990 -42185
21157 -42185 -167231 -150125 -5765 38014 -46459 -74982 -118485 -43154 -20712 -161938 -172752
21146 -172752 -68448 16116 -46485 -108066 -164893 -61583 58040 88484 900 -107004 -154454
21135 -154454 -59253 -40342 -51471 -87271 -19695 130296 144628 -63094 -272829 -274988 -122340
21124 -122340 -30468 63811 140814 122697 3975 -96074 -108400 -43822 -43081 -64773 29371
21113 29371 117727 167660 58020 -36172 54593 156452 135978 -24341 134459 144372 193000
21102 193000 181948 85979 151261 30278 -107112 -214096 -148941 -180542 -79260 74837
$$ packed form
21179b2985N1849m6691M4069j23027m8135Q0896J25594L0556j99795j60125j7820
21168b85614K0860J40225J0858l1138J46293K2557o7956k360L6422k7137n195
21157d2185j25046J7106J44360M3779q4473k8523m3503P5331K2442j41226j0814
21146a72752J04304Q4564o2601o1581n6827J03310J19623L0444q7584j07904m7450
21135a54454R5201J8911j1129l5800O7576J49991J4332k07722k09735k159J52648
21124a22340R1872R4279P7003j8117j18722j00049j2326O4578P41k1692R4144
21113B9371Q8356M9933j09640r4192R0765J01859k0474j60319J58800R913M8628
21102A93000j1052r5969O5282j20983j37390j06984O5155l1601J01282J54097
$$ plain form
21092 74837 12795 -40763 -65463 48069 101322 -11349 2388 -7030 -53069 48937 66962
21081 66962 -60578 -84749 32018 -147463 -85978 -51012 17221 92850 91024 84157 -37211
21070 -37211 -94286 -113666 -13288 -35657 -70549 -96023 115214 97926 104667 88807 122972
21059 122972 -23976 -100441 -136789 -335730 -381499 -258650 -216620 -136148 -117293 -39370 77953
21048 77953 162635 26082 -195334 -155743 22184 -106711 -167814 -184495 -85780 -135135 -169465
21037 -169465 -56033 -2561 -60828 -224847 -305769 -69363 -44082 -136717 -56152 -414 -71470
21026 -71470 -30005 -117727 -24255 70937 352298 408854 419622 374972 271881 129154 -130636
21015 -130636 -109246 -34646 -78515 -56129 -88940 -356743 -419925 -342066 -314191 -219357 -120512
$$ packed form
21092G4837o2042n3558k4700J13532N3253j12671J3737r418m6039J02006J8025
21081F6962j27540k4171J16767j79481O1485L4966O8233P5629j826o867j21368
21070c7211n7075j9380J00378k2369l4892k5474K11237j7288O741j5860L4165
21059A22972j46948p6465l6348j98941m5769J22849M2030Q0472J8855P7923J17323
21048G7953Q4682j36553k21416L9591J77927j28895o1103j6681R8715m9355l4330
21037a69465J13432N3472n8267j64019q0922K36406K5281r2635Q0565N5738p1056
21026g1470M1465q7722R3472R5192K81361N6556J0768m4650j03091j42727k59790
21015a30636K1390P4600m3869K2386l2811k67803o3182P7859K7875R4834R8845
$$ plain form
21004 -120512 -134847 -251495 -366502 -246334 -231087 -170197 -110254 -160664 -304866 -304858 -349540
20993 -349540 -341260 -259383 -73403 9067 151232 62565 75951 62823 18363 24814 8601
20982 8601 23508 73019 59333 6485 22598 115347 50550 -165922 -209508 -136116 87861
20971 87861 25715 58573 93700 149394 24832 25072 -81427 -30416 2923 17064 9142 30991
20959 30991 72973 136943 53890 -145549 -196723 -65661 68915 266116 263358 -30209 -205242
20948 -205242 -185437 34375 53856 71758 112811 172793 278843 145100 -40071 -151031
20938 -151031 -125838 -10526 173680 243392 30527 -73155 -14241 -50563 -100216 -132334 -200820
20927 -200820 -185376 -73587 -71432 -46997 -108643 25876 290485 114583 -159336 -189019 15482
$$ packed form
21004a20512j4335j16648j15007J20168J5247O0890N9943n0410j44202Qm4682
20993c49540Q280Q1877J85980Q2470J42165q8667J3386j3128m4460O451j6213
20982H601J4907M9511j3686n2848J6113R2749o4797k16472m3586P3392K23977
20971H7861o2146L2858L5127N5694j24562K40j06499N1011L3339J4141p922K1849
20959C0991M1982O3970q3053j99439n1174J31062J34576J97201k758k93567j75033
20948b05242J9805K19812J9481J7902M1053N9982J06050j33743j85171j10960
20938a51031K5193J15312J84206O9712k12865j03682N8914l6322m9653l2118o8486
20927b00820J5444J11789K155K4435o1646J34519K64609j75902k73919k9683K04501
$$ plain form
20916 15482 73327 -58081 54236 14757 -41061 -126629 -26760 34068 15543 46037 25314
20905 25314 72810 -52146 -38546 37788 -74004 -127830 -181534 -189871 -182765 -139531 -146300 -100397
20893 -100397 -111721 -297986 -164997 -51551 -133455 30804 9106 59391 13258 38751 155134
20882 155134 188464 -10584 -234905 -230704 -131360 -138055 -285604 -317884 -266969 -236806 -234377
20871 -234377 -233917 -235727 9791 126868 171612 4977 38851 -15291 -12739 -168977 -124541
20860 -124541 -151621 -277842 -388555 -277298 -191122 -3471 47369 -38717 -32110 5191 63179
20849 63179 80036 191223 114721 -40321 -80811 -52870 -30338 -141318 -87327 4149 -136004
20838 -136004 -33156 37153 59495 21331 23219 -105129 -228620 -253262 -301411 -238434 -29707
$$ packed form
20916A5482N7845j31408J12317l9479n5818q5568R9869O0828j8525L0494k0723
20905B5314M7496j24956J3600P6334j11792n3826n3704q337P106M3234o769M5903
20893a00397j1324j86265J32989J13446q1904J64259k1698N0285m6133K5493J16383
20882A55134L3330j99048k24321M201R9344o695j47549l2280N0915L0163K429
20871b34377M60j810K45518J17077M4744j66635L3874n4142K552j56238M4436
20860a24541k7080j26221j10713J11257Q6176J87651N0840q6086O607L7301N7988
20849F3179J6857J11187p6502j55042m0490K7941K2532j10980N3991R1476j40153
20838a36004J02848P0309K2342l8164J888j28348j23491k4642m8149O2977K08727
$$ plain form
20827 -29707 -175754 -426584 -350128 -60624 -13909 36436 50288 -112466 -321124 -213707
20817 -213707 -134724 42544 -25773 -99694 -267262 -321565 -240328 15667 84780 213366 148547
20806 148547 111998 37508 43333 192510 199291 157025 69807 109930 42370 52680 58468 -44298
20794 -44298 -172434 -173185 -152610 -291923 -274783 -270315 -100082 -6506 -47693 30037 104625 119444
20782 119444 53510 81870 -42729 -164011 -203284 -197487 -303771 -185223 -86648 -141801 -248828
20771 -248828 -364481 -251391 -254259 -196372 -222594 -129212 -114427 -36528 65610 1925 -22944
20760 -22944 -39081 -93886 87844 30714 -36439 43771 -64671 -45980 -59030 983 23435
20749 23435 15968 -67546 -36161 35071 162287 185735 105836 -67990 -179466 -153405 -132233
$$ packed form
20827b9707j46047k50830P6456K89504M6715N0345J3852j62754k08658J07417
20817b13707P8983J77268o8317p3921j67568n4303Q1237K55995O9113J28586o4819
20806A48547l6549p4490N825J49177O781m2266q7218M0123o7560J0310N788j02766
20794d4298j28136p51K0575j39313J7140M468J70233R3576m1187P7730P4588J4819
20782A19444o5934K8360j24599j21282l9273N797j06284J18548R8575n5153j07027
20771b48828j15653J13090k868N7887k6222R3382J4785P7899J02138o3685k4869
20760b2944j6137n4805J81730n7130o7153Q0210j08442J8691j3050O0013K2452
20749B3435p467q3514L1385P1232J27216K3448p9899j73826j11476K6061K1172
$$ plain form
20738 -132233 -51895 -25682 -198276 -406991 -367723 -235997 -180148 -254067 -254257 -167787 -62032
20727 -62032 -135365 -179718 -26776 -125409 -184120 -105549 -77080 -42316 50054 -9754 31770
20716 31770 -67279 -204023 -169165 -180144 -238967 -64556 -47701 -88287 4354 57817 -79307
20705 -79307 -247595 -262208 -401231 -167690 126128 119028 206055 96733 109287 229548 171025
20694 171025 87544 31141 -40404 -55360 -174405 -226994 -259151 -221005 -209586 9545 181598
20683 181598 290592 352136 257933 254330 286509 231742 207753 7318 -38979 -102070 -54251
20672 -54251 -34371 -108396 84151 117103 10593 87504 203998 183864 136266 20997 -177678
20661 -177678 -339402 -375226 -359921 -212591 -131255 -108409 -106136 23249 -53313 57033 130435
$$ packed form
20738a32233Q0338K6213j72594k08715L9268J31726N5849p3919j90Q6470J05755
20727f2032p3333m4353J52942r8633n8711P8571K8469L4764R2370n9808M1524
20716C1770r9049j36744L4858j0979n8823J74411J6855m0586R2641N3463j37124
20705g9307j68288j4613j39023K33541K93818p100Q7027j09322J2554J20261n8523
20694A71025q3481n6403p1545j4956j19045n2589l2157L8146J1419K19131J72053
20683A81598J08994O1544r4203l603L2179n4767k3989k00435m6297o3091M7819
20672e4251J9880p4025J92547L2952j06510P6911J16494k0134m7598j15269j98675
20661a77678j61724l5824J5305J47330Q1336K2846K273J29385p6562J10346P3402
$$ plain form
20650 130435 167128 154891 275591 432688 234538 -110285 -23792 130772 -20556 -285833
20640 -285833 -172089 35606 -24391 -64148 -137295 -181914 -175170 -127701 -114905 97145 18172
20629 18172 -13509 -75101 -143191 -190404 -123647 12227 -24408 -38846 31791 -60353 -159122
20618 -159122 -5642 68555 2192 -96897 -193438 -255318 -103930 86765 2414 41276 48463
20607 48463 -35382 -162764 -101071 79657 70341 40051 -17457 18723 113727 49011 11506
20596 11506 5278 -77518 -242275 -263715 -315518 -368776 -294264 -183336 -388519 -457065 -337795
20585 -337795 -311883 -277516 -121127 -40648 109275 89744 27257 -88632 -253357 -327480 -161473
20574 -161473 -156444 -55302 -85613 -129420 -115412 -237048 -251602 -336444 -303099 -88034 186975
$$ packed form
20650A30435L6693j2237J20700J57097j98150l44823Q6493J54564j51328k65277
20640b85833J13744K07695n9997l9757p3147m4619O744M7469J2796K12050p8973
20629A8172l1681o1592o8090m7213O6757J35874l6635j4438P0637r2144r8769
20618a59122J53480P4197o6363r9089r6541o1880J51388J90695q4351L8862P187
20607D8463q3845j27382O1693J80728r316l0290n7508L6180R5004o4716l7505
20596A1506o228q2796j64757k1440n1803n3258P4512J10928k05183o8546J19270
20585c37795K5912L4367J56389Q0479J49923j9531o2487j15889j64725p4123J66007
20574a61473N029J01142l0311m3807J4008j21636j4554q4842L3345K15065K75009
$$ plain form
20563 186975 255636 106359 161755 308351 182590 -87461 -91305 25583 -47043 -151043
20553 -151043 -208595 -3635 209195 338951 299269 185965 61958 24339 -116877 -84261
20543 -84261 -18879 72103 128310 136759 215494 191377 197005 145025 10934 -29227 72733 -4941
20531 -4941 26225 -63908 -99431 1919 -5604 -22093 41382 21201 54498 62522 1250 -16790
20519 -16790 26266 71390 -68527 -57027 16141 162198 -82525 -263022 -202988 -225137 -279842
20508 -279842 -320367 -325282 -395821 -259504 -106589 -15845 126824 58690 84427 155209 75519
20497 75519 31258 21064 -1929 19287 178776 217251 135543 -1698 57067 -18482 -103492
20486 -103492 -181353 -247708 -126820 6019 -106102 -265547 -324059 -304766 -157828 -70336
$$ packed form
20563A86975O8661j49277N5396J46596j25761k70051l844J16888p2626j04000
20553a51043n7552K04960K12830J29756l9682j13304j24007l7619j41216L2616
20543h4261O5382R0982N6207Q449P8735k4117N628n1980j34091m0161J01960p7674
20531d941L1166r0133l5523J01350p523j6489O3475k0181L3297Q024o1272j8040
20519a6790M3056M5124j39917J1500P3168J46057k44723j80497O0034k2149n4705
20508b79842m0525m915p0539J36317J52915R0744J42669o8134K5737P0782p9690
20497G5519m4261j0194k2993K1216J59489L8475q1708j37241N8765p5549q5010
20486a03492p7861o6355J20888J32839j12121j59445n8512J9293J46938Q7492
$$ plain form
20476 -70336 -41259 -56115 -42886 53450 -36950 -135369 -233498 -54118 103864 -58711 -139095
20465 -139095 -115348 -38038 -55335 -204789 -246908 -120207 -57950 -42899 -28273 -39361 -113163
20454 -113163 -57997 160818 175657 162570 217163 -17071 -143105 -86827 -150416 -243232 -309996
20443 -309996 -127024 44253 23802 171928 140348 171283 66201 6832 -10327 -47210 -141977
20432 -141977 -69642 100959 174152 93216 84013 26761 -97086 -116008 -34583 -98905 -132246
20421 -132246 -138650 -124757 -117203 -156224 -292178 -295112 -154912 -157371 -298324 -349013 -220317
20410 -220317 -152542 -91263 -145054 -70919 9768 -48649 78274 91333 161012 116529 40357
20399 40357 -48344 58200 -38983 -30893 -149141 -143209 -126188 -333201 -423677 -507415 -401955
$$ packed form
20476g0336K9077j4856J3229R6336r0400r8419r8129J79380J57982j62575q0384
20465a39095K3747P7310j7297j49454m2119J26701O2257J5051J4626j1088p3802
20454a13163N5166K18815J4839j3087N4593k34234j26034N6278o3589r2816o6764
20443c09996J82972J71277k0451J48126l1580L0935j05082n9369j7159l6883r4767
20432a41977P2335J70601P3193q0936r203n7252j23847j8922Q1425o4322l3341
20421a32246o404J3893P554l9021j35954k934J40200k459j40953n0689J28696
20410b20317O7775O1279n3791P4135Q0687n8417J26923J3059O9679m4483p6172
20399D0357q8701J06544r7183Q090j18248N932J7021k07013r0476q3738J05460
$$ plain form
20388 -401955 -429302 -466463 -330116 -251600 -135563 -173654 -149907 146596 198978 65467 -52421
20377 -52421 -218291 -162398 -134231 -221184 -250192 -129583 186877 270002 112852 57160 181294
20366 181294 -15242 -61655 4669 85737 193504 268982 153683 90008 85245 75549 144277
20355 144277 107364 120398 37445 13418 94366 253991 229539 112451 112050 65229 -141879
20344 -141879 -205558 -288267 -273036 -198060 27669 226949 219952 240640 114374 175230 264359
20333 264359 179665 40672 76179 106896 148401 274141 225505 119987 151404 167923 -52881
20322 -52881 -125056 16055 74609 183298 161119 36864 -35150 -92251 -112115 -14283 65666
20311 65666 107089 53588 2527 120454 77520 -5728 -180387 -193282 -108417 -13075 -75826
$$ packed form
20388d01955k7347l7161J36347P8516J16037l8091K3747K96503N2382j33511j17888
20377e2421j65870N5893K8167q6953k9008J20609L16460Q3125j57150n5692J24134
20366A81294j96536m6413O6324Q1068J07767P5478j15299o3675m763r696O8728
20355A44277l6913J3034q2953k4027Q0948J59625k4452j17088m01m6821k07108
20344a41879o3679q2709J5231P4976K25729J99280o997K0688j26266O0856Q9129
20333B64359q4694j38993L5507L0717M1505J25740m8636j05518L1417J6519k20804
20322e2881p2175J41111N8554J08689k2179j24255p2014n7101j9864R7832P9949
20311F5666M1423n3501n1061J17927m2934q3248j74659j2895Q4865R5342o2751
$$ plain form
20300 -75826 -168625 -76785 109297 52968 -97533 -294853 -302789 -134080 -56481 -81977 -264107
20289 -264107 -269516 -176813 -78020 -46073 12059 -40695 -114370 -193310 -242644 -317050 -267222 -313472
20277 -313472 -318103 -75195 -8156 -94550 -253595 -97815 11828 -49950 -151421 -132936 -74365
20266 -74365 50440 185189 162543 -29306 -27191 61158 6393 -26911 -12016 75444 11678
20255 11678 -58116 1220 -24079 96636 127866 -117939 -174459 -74468 -12439 -214137 -205375
20244 -205375 -125902 93254 171722 190869 342848 396772 320017 191325 58749 127220 202951
20233 202951 217640 125224 216496 123693 102025 106946 199611 231551 340520 374038 276082
20222 276082 87801 11326 112380 161079 149186 63973 41598 147827 189731 169551 153002
$$ packed form
20300g5826r2799R1840J86082n6329j50501j97320p936J68709P7599k5496j82130
20289b64107n409R2703R8793L1947N8132n2754p3675p8940m9334p4406M9828m6250
20277c13472m631K42908O7039q6394j59045J55780J09643o1778j01471J8485N8571
20266g4365J24805J34749k2646j91849K115Q8349n4765l3304J4895Q7460o3766
20255A1678o9794N9336k5299J20715L1230k45805n6520R9991O2029k01698Q762
20244b05375P9473K19156P8468J9147J51979N3924p6755j28692j32576O8471P5731
20233B02951J4689r2416R1272r2803k1668M921R2665L1940J08969L3518r7956
20222B76082j88281p6475J01054M8699j1893q5213k2375J06229M1904k0180j6549
$$ plain form
20211 153002 259848 285184 74979 100475 163620 34296 -171784 -172113 37312 306598 320492
20200 320492 130893 -4205 44370 -9790 -13571 14270 52880 -65689 -129799 22952 -33706
20189 -33706 39514 89703 56834 159996 55812 14624 100230 12098 -72295 46530 -15994
20178 -15994 44374 7525 -53298 8901 105817 109138 -14659 -197139 -92954 -8918 29275
20167 29275 49474 -67107 50876 179474 50997 51261 35354 -5565 11434 147047 219962
20156 219962 113865 9683 47491 122254 47395 -32816 -24577 -18394 -199723 -206738 -125865
20145 -125865 -20843 -85022 25079 143619 21154 -156194 -277987 -82292 -200667 -296899
20135 -296899 -465269 -209405 -1466 -50377 -30548 33894 6248 -36366 -158917 -82189 123755
$$ packed form
20211A53002J06846K5336k10205K5496O3145j29324k06080l29K09425K69286J3894
20200C20492j89599j35098M8575n4160l781K7841L8610j18569o4110J52751n6658
20189c3706P3220N0189l2869J03162j04184m1188Q5606q8132q4393J18825o2524
20178a5994O0368l6849o0823O2199R6916L321j23797j82480J04185Q4036L8193
20167B9275K0199j16581J17983J28598j28477K64j5907m0919J6999J35613P2915
20156B19962j06097j04182L7808P4763p4859q0211Q239O183j81329p015Q0873
20145a25865J05022o4179J10101J18540j22465j77348j21793J95695j18375r6232
20135b96899j68370K55864K07939m8911J9829O4442k7646m2614j22551P6728K05944
$$ plain form
20124 123755 260357 243284 5255 -65721 7503 146377 60242 91007 52252 33461 -119657
20113 -119657 -141095 46114 -3813 -135865 -185276 -179970 -172871 77708 39441 -130467 -154580
20102 -154580 -198648 -309887 -329448 -318926 -382132 -240255 -89117 -58514 103498 76802 155401
20091 155401 189116 219 -9584 -17578 59288 181161 301825 258232 319600 278176 135562
20080 135562 -12168 -161982 -134779 20583 195384 73747 -32174 104581 173771 108732
20070 108732 -23308 -76763 -209841 -411555 -203997 -8229 82357 259141 251646 269727
20060 269727 175739 92643 48785 -45405 41822 -111327 -60681 98284 208224 272788 282090
20049 282090 231394 52879 -93840 11900 22947 50777 -16193 -80877 90451 46708 -160983
$$ packed form
20124A23755J36602j7073k38029p0976P3224J38874q6135L0765l8755j8791j53118
20113a19657k1438J87209m9927j32052m9411N306P099K50579l8267j69908k4113
20102a54580m4068j11239j9561J0522o3206J41877J51138L0603J62012k6696P8599
20091A55401L3715j88897r803p994P6866J21873J20664m3593O1368m1424j42614
20080A35562j47730j49814K7203J55362J74801j21637j05921J36755O9190o5039
20070A08732j32040n3455j33078k01714K07558J95768R0586J76784p495J8081
20060B69727r3988q3096m3858r4190Q7227j53149N0646J58965J09940O4564R302
20049B82090n0696j78515j46719J05740J1047K7830o6970o4684J71328m3743k07691
$$ plain form
20038 -160983 -126778 32273 281251 289552 328260 170860 -7689 -66790 -125593 -269837 -190249
20027 -190249 -206758 -178681 -80009 -99786 -52870 131392 113682 129793 91284 25767 108889
20016 108889 157577 -19172 -40812 27757 73946 106554 30688 105873 139789 225980 277240
20005 277240 132315 30602 -10017 86562 64839 188755 230931 221471 131431 3066 29740
19994 29740 864 85470 194126 93109 -65666 -11640 -70229 -148154 86217 203993 7223
19983 7223 -74893 1524 158614 94758 -78645 5766 8747 -33118 50007 99620 123894 18730
19971 18730 -43622 -78479 -113406 -58959 8748 143420 66988 148327 188376 137592 22993
19960 22993 66239 15472 -142523 -172014 -41046 65866 -32752 -110079 -164983 -82871 -39296
$$ packed form
20038a60983L4205J59051K48978Q301L8708j57400j78549n9101n8803j44244P9588
20027a90249j6509K8077R8672j9777M6916J84262j7710J6111l8509o5517Q3122
20016A08889M8688j76749k1640O8569M6189L2608p5866P5185L3916Q6191N1260
20005B77240j44925j01713m0619R6579k1723J23916M2176r460r0040j28365K6674
19994B9740k8876Q4606J08656j01017j58775N4026n8589p7925K34371J17776j96770
19983G223q2116P6417J57090o3856j73403Q4411K981m1865Q3125M9613K4274j05164
19971A8730o2352l4857l4927N4447O7707J34672p6432Q1339M0049n0784j14599
19960B2993M3246n0767j57995k9491J30968J06912r8618p7327n4904Q2112M3575
$$ plain form
19949 -39296 -2126 61712 176746 323785 254673 204909 65876 -124289 -19411 191747
19939 191747 92412 107429 16026 -89596 -88218 -129966 -233615 -48849 146320 292025 351971
19928 351971 348943 252312 87435 -15361 -225195 -213904 -139766 -186015 -95511 -73807 -98114
19917 -98114 10948 105898 146788 109486 57160 -4423 -64553 -20961 94451 75309 -11510
19906 -11510 -15801 -100 55139 19074 -92337 -54010 -32861 -144288 -26873 -15929 151806
19895 151806 194622 277468 265748 24532 -15465 -89968 -119949 24600 159679 109927 6067
19884 6067 -63309 -18119 73770 167122 104003 -36061 -39178 23968 30263 150960 69892 93124
19872 93124 176544 216229 107203 20904 159338 147176 76883 167839 228013 296457 292166
$$ packed form
19949c9296L7170O3838J15034J47039o9112m9764j39033j90165J04878K11158
19939A91747r9335J5017r1403j05622J378m1748j03649J84766J95169J45705N9946
19928C51971l028r6631j64877j02796k09834J1291P4138m6249R0504K1704k4307
19917i8114J09062R4950M0890l7302n2326o1583o0130M3592J15412j9142q6819
19906a1510m291J5701N5239l6065j11411L8327K1149j11427J17415J0944J67735
19895A51806M2816Q2846j1720k41216l9997p4503k9981J44549J35079m9752j03860
19884F067o9376M5190R1889R3352o3119j40064l117O3146O295J20697q1068K3232
19872I3124Q3420L9685j09026q6299J38434j2162p0293R0956O0174O8444m291
$$ plain form
19861 292166 93887 -151501 -157409 -11850 95887 98753 133582 103856 14765 -190504 -210537
19850 -210537 -131502 41244 61029 88483 22423 -26454 -8469 128706 183149 43881 -27332
19839 -27332 88252 174697 121562 219384 139291 107433 173295 150921 235430 78661 -200016
19828 -200016 -157496 -120630 -55267 9020 80894 -232 -11602 -25992 -99134 -47043 -5878
19817 -5878 4400 -29556 -34743 80113 62935 178994 166471 209089 268460 163340 216698
19806 216698 246932 253490 126585 21524 78759 29613 -128774 -213823 -182405 -101799 55498
19795 55498 245852 282590 165675 80899 -33986 47444 159433 228298 237124 189455 172545
19784 172545 67445 -53635 6113 140591 228240 140849 83807 19278 -43251 -77881 -34251
$$ packed form
19861B92166j98279k45388n908J45559J07737K866L4829k9726q9091k05269k0033
19850b10537P9035J72746J9785K7454o6060m8877J7985J37175N4443j39268p1213
19839b7332J15584Q6445n3135R7822q0093l1858O5862k2374Q4509j56769k78677
19828b00016M2520L6866O5363O4287P1874q1126j1370j4390p3142N2091M1165
19817e878J0278l3956n187J14856j7178J16059j2523M2618N9371j05120N3358
19806B16698L0234O558j26905j05061N7235m9146j58387q5049L1418Q0606J57297
19795E5498J90354L6738j16915q4776j14885Q1430J11989O8865Q826m7669j6910
19784A72545j05100j21080N9748J34478Q7649q7391n7042o4529o2529l4630M3630
$$ plain form
19773 -34251 81244 -23621 -170815 -77013 43677 103338 267377 209510 30195 -16175
19763 -16175 59392 139089 75216 -21749 11238 -114498 -132057 -253780 -225003 -192760 -113615
19752 -113615 -43984 -19962 -2495 25790 -2352 -43270 55786 45858 13524 -199419 -293028
19741 -293028 -224563 -140604 -23270 -87310 -161141 -32733 -62143 -189475 9125 -41264 -83843
19730 -83843 -182883 -190681 -129264 -114059 -190667 -161369 -44367 -68403 75753 166955 206635
19719 206635 227800 90777 105959 -26974 -144228 106072 194809 99058 32861 9214 -56433
19708 -56433 -11528 40191 68639 37488 -27023 -81406 -127143 5661 -42246 -72539 -7512
19697 -7512 63972 91021 118633 160361 321670 451913 259617 262797 39436 -126837 -189682
$$ packed form
19773c4251J15495j04865j47194R3802J20690N9661J64039n7867j79315m6370
19763a6175P5567P9697o3873r6965L2987j25736j7559j21723K8777L2243P9145
19752a13615O9631K4022J7467K8285k8142m0918R9056r928l2334k12943r3609
19741b93028O8465Q3959J17334o4040p3831J28408k9410j27332J98600n0389m2579
19730h3843r9040p798O1417J5205p6608K9298J17002k4036J44156R1202L9680
19719B06635K1165j37023J5182j32933j17254K50300Q8737r5751o6197k3647o5647
19708e6433M4905N1719K8448l1151o4511n4383m5737J32804m7907l0293O5027
19697g512P1484K7049K7612M1728J61309J30243j92296L180k23361j66273o2845
$$ plain form
19686 -189682 -135780 -103748 -91864 -3196 33532 6047 6573 -25848 112000 349263 240510
19675 240510 112004 -59774 -99255 -91242 -44879 -17746 59055 -40929 -81253 -8498 -66158
19664 -66158 -46750 -740 19988 177175 141114 111956 221021 379757 381722 277218 143197
19653 143197 105450 -359 -63912 -100594 -234942 -125319 9277 41736 19623 -40240 -34746
19642 -34746 43509 19866 24623 -96062 -98318 20785 54006 30675 98169 -40673 -90214
19631 -90214 74922 81817 109276 145781 147195 7000 155846 154337 152582 127887 70149 141211
19619 141211 158824 -31414 -114754 -34975 -10886 -35735 -125497 -191064 -23487 15034 151250
19608 151250 157085 29563 -16641 -71698 -103942 60703 19108 52798 -112198 -202717 -66552
$$ packed form
19686a89682N3902L2032J1884Q8668L6728k7485N26l2421J37848K37263j08753
19675B40510j28506j71778l9481Q013M6363K7133P6801r9984m0324P2755n7660
19664f6158J9408M6010K0728J57187l6061k9158J09065J58736J965j04504j34021
19653A43197l7747j05809o3553l6682j34348J09623J34596L2459k2113n9863N494
19642c4746P8255k3643M757j20685k256J19103L3221k3331O7494j38842m9541
19631i0214J65136O895K7459L6505J414j40195J48846j509j755k4695n7738P1062
19619A41211J7613j90238q3340P9779K4089k4849q9762o5567J67577L8521J36216
19608A51250N835j27522m6204n5057l2244J64645m1595L3690j64996r0519J36165
$$ plain form
19597 -66552 -37548 93859 69177 -66236 -19180 114199 180569 152694 9264 -81555 26464
19586 26464 -578 -121357 -183967 -61476 -85931 -35394 28020 -55905 -106542 -39909 -24678
19575 -24678 51906 20066 -37519 6671 -48998 -125566 -97871 -162366 -73337 -92166 -82491 -37819
19563 -37819 -71708 -70640 -33648 157981 162455 154540 -19927 98273 88328 183310 181649 177635
19551 177635 203769 232148 303681 61385 -91167 55488 260684 155308 152029 197756 215131
19540 215131 161784 65184 43729 -49342 46944 48375 79264 52189 77883 159685 60875 162889
19528 162889 233059 376714 378072 261157 305289 363501 203085 -77587 -98478 -195610 -139948
19517 -139948 -47101 -56255 -81393 21567 156167 297736 402297 265384 259664 331664 107354
$$ packed form
19597f6552K9004J31407k4682j35413M7056J33379O6370k7875j43430r0819J08019
19586B6464k7042j20779o2610J22491k4455N0537O3414q3925n0637O6633J5231
19575b4678P6584l1840n7585M4190n5669p6568K7695o4495Q9029j8829R675M4672
19563c7819l3889J068L6992J91629M474p915j74467J18200r945R4982j661m014
19551A77635K6134K8379P1533k42296j52552J46655K05196j05376l279M5727J7375
19540B15131n3347r6600k1455r3071R6286J431L0889k7075K5694Q1802r8810J02014
19528A62889P0170J43655J358j16915M4132N8212j60416k80672k0891r7132N5662
19517a39948R2847r154k5138J02960J34600J41569J04561j36913n720P2000k24310
$$ plain form
19506 107354 7411 -7958 -24548 175030 209135 120109 124455 195783 255504 381647 502548
19495 502548 385293 340886 185515 -48692 -20538 -197332 -260004 -354461 -378440 -272572
19485 -272572 -158945 -42369 81493 169484 289184 178954 14757 -44753 1625 -55608
19475 -55608 -182025 42507 224848 142656 39702 167602 133989 108558 123848 52020 57877
19464 57877 16385 112643 108354 193113 167105 78741 65578 -92046 -58415 -44347 36866 -49912
19452 -49912 -82911 -154 121328 154247 197069 147867 65373 14476 120969 299057 299403
19441 299403 120324 -73581 -196767 -73483 55834 140734 97587 -75328 132252 97365
19431 97365 164 29006 63802 133209 189332 142074 135914 53819 18343 9687 30978 229055
$$ packed form
19506A07354r9943j5369j6590J99578L4105q9026M346P1328N9721J26143J20901
19495E02548j17255m4407j55371k34207K8154j76794o2672r4457k3979J05868
19485b72572J13627J16576J23862Q7991J19700j10230j64197n9510M6378n7233
19475e5608j26417K24532J82341q2192j02954J27900l3613k5431J5290p1828N857
19464E7877m1492R6258m289Q4759k6008q8364j3163j57624L3631J4068Q1213q6778
19452d9912l2999Q2757J21482L2919M2822m9202q2494n0897J06493J78088L46
19441B99403j79079j93905j23186J23284J29317Q4900m3147j72915K07580l4887
19431I7365r7201K8842L4796O9407N6123m7258o160q2095l5476q656K1291J98077
$$ plain form
19419 229055 359974 222988 9158 -990 -130607 -142279 -241624 -195520 48227 130807
19409 130807 155695 168449 369334 290105 208839 167223 27205 -16782 84487 112079 -47530
19398 -47530 -130194 -161231 -76968 -73711 -42456 12153 -40095 13814 -782 -13633 11590 -61991
19386 -61991 -21357 73273 113721 127987 -61431 -130825 -121687 -133530 -151987 -8343 64965
19375 64965 83965 76995 140522 114691 175523 210324 189684 264403 253453 235350 225363 175028
19363 175028 177170 181614 188279 121990 -124207 -70720 32541 -53664 -165944 -106041 162537
19352 162537 234713 314840 329517 182543 78220 80942 40451 39018 118606 144495 69450
19341 69450 -56738 -7173 98664 160534 92465 -25102 -147918 -95205 62960 104465 180619
$$ packed form
19419B29055J30919j36986k13830j0148j29617j1672r9345M6104K43747Q2580
19409A30807K4888J2754K00885p9229q1266m1616j40018m3987J01269K7592j59609
19398d7530q2664l1037Q4263L257L1255N4609n2248N3909j4596j2851K5223p3581
19386f1991M0634R4630M0448J4266j89418o9394R138j1843j8457J43644P3308
19375F4965J9000o970O3527k5831O0832L4801k0640P4719j0950j8103r987n0335
19363A75028K142M444O665o6289k46197N3487J03261q6205j12280N9903K68578
19352A62537P2176Q0127J4677j46974j04323K722m0491j433P9588K5889p5045
19341F9450j26188M9565J05837O1870o8069j17567j22816N2713J58165M1505P6154
$$ plain form
19330 180619 283250 222268 -39466 -321708 -332071 -198060 -49303 76809 26594 -127118
19320 -127118 -35523 -55959 -177981 -246514 -290867 -277488 -108261 134526 242248 216664 126113
19309 126113 -32929 -74287 52762 144181 202047 135010 18537 66717 -5232 52743 34097
19298 34097 -215459 -213277 -111276 -110347 13787 18678 -14334 -29025 73196 31973 -137590
19287 -137590 -46085 309435 195538 31227 104816 115212 165982 193216 138876 159058 68159
19276 68159 -25984 -29839 31580 160436 40602 -165614 -139408 -1768 112038 46860 -21761
19265 -21761 -148798 -49965 77485 131489 153210 150253 159280 98803 13634 -382 35613 69881
19253 69881 61613 89630 84573 37744 -45770 -18671 -11028 -18403 23674 93675 144781 301455
$$ packed form
19330A80619J02631o0982k61734k82242j0363J34011J48757J26112n0215j53712
19320a27118R1595k0436j22022o8533m4353J3379J69227K42787J07722k5584r0551
19309A26113j59042m1358J27049R1419N7866o7037j16473M8180p1949N7975j8646
19298C4097k49556K182J02001R29J24134M891l3012j4691J02221m1223j69563
19287a37590R1505L55520j13897j64311P3589J0396N0770K7234n4340K0182r0899
19276F8159r4143l855O1419J28856j19834k06216K6206J37640J13806o5178o8621
19265b1761j27037R8833J27450N4004K1721k957R027o0477q5169j4016L5995L4268
19253F9881q268K8017n057m6829q3514K7099P643p375M2077P0001N1106J56674
$$ plain form
19241 301455 299689 153548 214858 130125 151888 227907 282095 279131 315059 447113 408727
19230 408727 120143 26529 -5452 -75466 130607 222176 102941 4920 124000 247862
19220 247862 366878 280596 -9261 -18757 -30882 -91721 -106889 -193621 -53958 13825 -105116
19209 -105116 -80459 -39161 -111916 -128884 -101028 47126 22394 55478 106751 201995 172740
19198 172740 20999 -122592 23288 118177 105689 -7955 -19996 29980 -26161 -111258 13448
19187 13448 20596 23110 -60163 74031 90208 11889 29224 15126 -30805 -116666 -12255 158004
19175 158004 65322 23995 -68814 -115666 -5482 29585 44952 61345 106452 209634 184814
19164 184814 158226 90254 109721 52011 20005 33202 -22929 59982 17741 -56035 -94809
$$ packed form
19241C01455j766j46141O1310q4733K1763P6019N4188k964L5928J32054l8386
19230D08727k88584r3614l1981p0014K06073R1569j19235r8021J19080J23862
19220B47862J19016q6282k89857r496j2125o0839j5168q6732J39663O7783j18941
19209a05116K4657M1298p2755j6968K7856J48154k4732L3084N1273R5244k9255
19198A72740j51741j43591J45880R4889j2488j13644j2041M9976n6141q5097J24706
19187A3448P148K514q3273J34194J6177p8319J7335j4098m5931q5861J04411J70259
19175A58004r2682m1327r2809m6852J10184L5067J5367J6393M5107J03182k4820
19164A84814k6588o7972J9467n7710l2006J3197n6131Q2911m2241p3776l8774
$$ plain form
19153 -94809 14507 101142 65831 -86091 -93669 -25304 162437 151019 82710 -42405 -38464
19142 -38464 30361 -121312 -79908 62154 154860 174685 136615 1423 20890 49647 155595
19131 155595 414766 445065 376877 -4477 -104607 -204940 -189105 -207056 14042 235958
19121 235958 257014 251355 243236 189975 239480 263844 335190 302515 156720 -11160 -141418
19110 -141418 -104511 37473 97111 -24039 -96133 -195559 -71159 39128 131577 238972
19100 238972 270060 248794 298468 329073 267990 225503 178056 64864 -12602 22961 27685
19089 27685 -35179 30499 220650 401654 475066 398885 204149 137754 24754 135014 190479
19078 190479 142115 108586 52536 60268 102192 16623 -39367 -51574 -108879 35157 176010
$$ packed form
19153i4809J09316Q6635l5311j51922p578O8365J87741j1418o8309j25115L941
19142c8464O8825j51673M1404J42062R2706J9825l8070j35192J9467K8757J05948
19131A55595K59171L0299o8188l81354j00130j00333J5835j7951K21098K21916
19121B35958K1056n659q119n3261M9505K4364P1346l2675j45795j67880j30258
19110a41418L6907J41984N9638j21150p2094r9426J24400J10287R2449J07395
19100B38972L1088k1266M9674L0605o1083m2487m7447j13192p7466L5563M724
19089B7685o2864O5678J90151J81004P3412p6181j94736o6395j13000J10260N5465
19078A90479m8364l3529n6050P732M1924q5569n5990j2207n7305J44036J40853
$$ plain form
19067 176010 193752 112233 84162 89899 -24002 -65911 -22118 20735 104188 94624 113041 207097
19055 207097 117784 13724 -116541 20733 136350 130142 122641 -482 -146568 -156398 -110820
19044 -110820 -73467 -25073 71531 260921 317143 222233 161449 5735 20697 44121 2961
19033 2961 -120963 -105746 -98377 -36841 77225 73231 -20230 -150995 -249182 -233634 -182421 -97520
19021 -97520 -37110 111830 158656 277174 383901 460122 404728 289460 210077 164184 202548
19010 202548 312500 349967 281370 373106 452508 347648 192101 255855 185934 280531 432877
18999 432877 276449 165836 201946 153489 75891 80884 232960 294113 265778 165687 219155
18988 219155 439650 583296 554395 419629 241796 -34766 -171875 -66351 5546 -62637
$$ packed form
19067A76010J7742q1519k8071N737j13901m1909M3793M2853Q3453r564J8417R4056
19055B07097q9313j04060j30265J37274J15617o208p501j23123j46086r830M5578
19044a10820L7353M8394R6604J89390N6222r4910o0784j55714J4962K3424m1160
19033B961j23924J5217P369O1536J14066l994r3461j30765r8187J5548N1213Q4901
19021i7520O0410J48940M6826J18518J06727P6221n5394j15268p9383m5893L8364
19010B02548J09952L7467o8597R1736P9402j04860j55547O3754o9921R4597J52346
18999D32877j56428j10613L6110m8457p7598M993J52076O1153k8335j00091N3468
18988B19155K20495J43646k8901j34766j77833k76562j37109J05524P1897o8183
$$ plain form
18978 -62637 -103116 50465 6933 -219622 -348470 -188516 52879 110 29243 135041
18968 135041 126856 137142 85789 115715 168463 278069 415684 478383 471942 450682 331857
18957 331857 289879 417050 484692 369291 301285 243199 135443 146841 166944 159900 72481
18946 72481 -141508 -174217 -114655 -104426 -64973 40361 28549 4892 96180 109485 -8572
18935 -8572 -8788 207114 268411 305056 269837 141065 -4738 -207145 -85742 68011 51226
18924 51226 -64923 -40974 -108013 -169225 -113048 47298 38597 6649 -20317 108388 104266
18913 104266 132345 126520 222140 144420 72858 68395 16240 34508 114566 57631 81479 100642
18901 100642 141629 217833 214433 34714 272240 290568 112892 -21843 -55087 113773 207320
$$ packed form
18978f2637m0479J53581m3532k26555j28848J59954K41395n2769K9133J05798
18968A35041q185J0286n1353K9926N2748J09606J37615O2699o441k1260j18825
18957C31857m1978J27171O7642j15401o8006n8086j07756J1398K0103p044q7419
18946G2481k13989l2709N9562J0229L9453J05334j1812k3657R1288J3305j18057
18935h572k16K15902O1297L6645l5219j28772j45803k02407J21403J53753j6785
18924E1226j16149K3949o7039o1212N6177J60346q701l1948k6966J28705m122
18913A04266K8079n825R5620p7720p1562m463n2155J8268Q0058n6935K3848J9163
18901A00642M0987P6204l400j79719K37526J8328j77676j34735l3244J68860R3547
$$ plain form
18890 207320 165592 151849 185618 77517 28660 47405 91429 283227 163704 74486 86374
18879 86374 128561 145875 -9801 127371 373484 344392 332163 322713 245978 134391 54642
18868 54642 55236 -12135 3987 114657 198321 370015 374760 410777 379567 323410 243317 161309
18856 161309 104354 140018 124048 85237 158420 177212 120371 158138 208001 107662 66503
18845 66503 145191 118753 -5098 -78971 -159782 -168522 -41237 140741 125034 164792 298304
18834 298304 273424 152706 131922 73034 105287 72878 187145 410075 484140 447825 416682
18823 416682 258419 257194 196401 165201 132723 167667 266133 245982 222428 132629 26986
18812 26986 152891 275948 252770 219696 142436 162088 244090 99576 -17317 -154239 -123789
$$ packed form
18890B07320m1728j3743L3769j08101m8857J8745M4024J91798j19523q9218J1888
18879H6374M2187J7314j55676J37172K46113k9092j2229r450p6735j11587p9749
18868E4642N94o7371J6122J10670Q3664J71694M745L6017l1210n6157q0093q2008
18856A61309n6955L5664j5970l8811P3183J8792n6841L7767M9863j00339m1159
18845F6503P8688k6438j23851p3873q0811q740J27285J81978j5707L9758J33512
18834B98304k4880j20718k0784n8888L2253l2409J14267K22930P4065l6315l1143
18823D16682j58263j225o0793l1200l2478L4944R8466k0151k3554q9799j05643
18812B6986J25905J23057k3178l3074p7260J9652Q2002j44514j16893j36922L0450
$$ plain form
18801 -123789 1028 -85932 -54730 -69920 51336 159526 297300 199094 332485 302287
18791 302287 177832 39192 -65585 26556 175472 163238 262083 344273 381986 537291
18781 537291 495958 373681 196467 -1535 81258 348364 443926 538199 388148 495549
18771 495549 650102 678276 697085 882801 1076613 1225089 1141644 994024 972029 1073659
18761 1073659 921865 820133 678168 676815 573031 437212 375610 393239 379499 448674
18751 448674 474694 489254 438967 341044 348777 343384 291644 446872 534686 599143 604575 419242
18739 419242 330793 284555 353215 320528 127196 94849 160318 213995 337576 465206 448689
18728 448689 376765 151774 -26039 -12442 35559 154835 348029 282317 281178 266221 233588
$$ packed form
18801a23789J24817q6960L1202j5190J21256J08190J37774r8206J33391l0198
18791C02287j24455j38640j04777R2141J48916j2234R8845Q2190L7713J55305
18781E37291m1333j22277j77214j98002Q2793K67106R5562R4273j50051J07401
18771D95549J54553K8174J8809J85716J93812J48476q3445j47620k1995J01630
18761A073659j51794j01732j41965j353j03784j35819o1602J7629j3740O9175
18751D48674K6020J4560n0287r7923P733n393n1740J55228Q7814O4457N432j85333
18739D19242q8449m6238O8660l2687j93332l2347O5469N3677J23581J27630j6517
18728D48689p1924k24991j77813J3597M8001J19276J93194o5712j139j4957l2633
$$ plain form
18717 233588 320705 347539 468987 505049 449806 488050 427870 449179 460317 325135 357584
18706 357584 447544 410495 338396 341544 345355 331683 357072 279097 148819 29650 -19626
18695 -19626 -19230 19214 250484 376782 439077 427702 370625 212559 142095 186892 258041
18684 258041 456712 422297 372149 456721 358223 291947 260095 330821 264571 66958 126784
18673 126784 251443 296858 362030 345605 200581 183992 173292 260672 381545 314587 449817
18662 449817 357123 336655 350836 157982 103646 358730 433619 259857 234224 308275 384872
18651 384872 312638 282937 213885 339139 446078 502633 368859 187681 202928 334872
18641 334872 415702 385308 321993 368277 481666 473787 372817 382906 332191 313659 376688
$$ packed form
18717B33588Q7117K6834J21448L6062n5243L8244o0180K1309J1138j35182L2449
18706C57584Q9960l7049p2099L148L811j3672K5389p7975j30278j19169m9276
18695a9626L96L8444K31270J26298O2295j1375n7077j58066p0464M4797P1149
18684B58041J98671l4415n0148Q4572r8498o6276l1852P0726o6250j97613N9826
18673A26784J24659M5415O5172j6425j45024j6589j0700Q7380J20873o6958J35230
18662D49817r2694k0468J4181j92854n4336K55084P4889j73762k5633P4051P6597
18651C84872p2234k9701o9052J25254J06939N6555j33774j81178J5247J31944
18641C34872Q0830l0394o3315M6284J13389p879j00970J0089n0715j8532O3029
$$ plain form
18630 376688 397598 459229 640291 635925 567809 584068 569486 626528 705106 644399 631339
18619 631339 500329 359095 413046 511685 455115 448305 475789 662665 848074 1175932 1361792
18608 1361792 1332788 1156448 1045745 1046518 1002200 942561 670852 565684 430962 409791 513188
18597 513188 658062 649849 747995 719439 738195 681860 593387 597632 454113 524288 423821
18586 423821 470497 738678 748829 644013 562315 598555 696964 820884 807389 650987 649516
18575 649516 525202 578527 520925 458542 697224 682107 638861 543566 676950 954380 978879
18564 978879 1148342 1402142 1440797 1597642 1776832 1821564 1830790 1786840 1819482 1789594 1753256
18553 1753256 1494541 1275851 1215478 1293460 1313171 1218741 1092089 863129 669372 789990
$$ packed form
18630C76688K0910O1631J81062m366o8116J6259j4582N7042P8578o0707j3060
18619F31339j31010j41234N3951R8639n6570o810K7484J86876J85409L27858J85860
18608A361792k9004j76340j10703P73m4318n9639k71709j05168j34722k1171J03397
18597E13188J44874q213R8146k8556J8756n6335q8473M245j43519P0175j00467
18586D23821M6676K68181J0151j04816q1698L6240R8409J23920j3495j56402j471
18575F49516j24314N3325n7602o2383K38682j5117m3246r5295J33384K77430K4499
18564I78879J69463K53800L8655J56845J79190M4732R226m3950L2642k9888l6338
18553A753256k58715k18690o0373P7982J9711r4430j26652k28960j93757J20618
$$ plain form
18543 789990 889929 854966 772559 666145 576192 719995 787698 756072 519102 506478 616290
18532 616290 750432 917557 898485 826083 768141 756817 725172 698270 579617 668264 717029
18521 717029 622704 565789 620964 624515 438362 257104 366072 442189 390192 455039 643636
18510 643636 714413 880716 1099107 1044618 1085617 1184786 1141114 1150549 1114080 1087709 825135
18499 825135 944763 1015287 877532 789041 563327 481925 730815 865346 809658 669807
18489 669807 462378 475155 663328 738868 570455 679265 650476 635983 574325 442952
18479 442952 540671 624886 559379 600635 531122 427047 484047 483299 483402 477403 457012 488207
18467 488207 430396 431909 389089 400819 297500 303317 396966 337583 253091 337912 366195 299815
$$ packed form
18543G89990R9939l4963q2407j06414q9953J43803O7703l1626k36970j2624J09812
18532F16290J34142J67125j9072p2402n7942j1324l1645k6902j18653Q8647M8765
18521G17029r4325n6915N5175L551j86153j81258J08968P6117n1997O4847J88597
18510F43636P0777J66303K18391n4489M0999R9169m3672R435l6469k6371k62574
18499H25135J19628P0524j37755q8491k25714q1402K48890J34531n5688j39851
18489F69807k07429J2777J88173P5540j68413J08810k8789j4493o1658j31373
18479D42952R7719Q4215o5507M1256o9513j04075N7000p48J03n999k0391L1195
18467D88207n7811J513m2820J1730j03319N817R3649n9383q4492Q4821K8283o6380
$$ plain form
18455 299815 251946 336638 532712 645647 680602 781576 752129 749810 722780 505151 423557
18444 423557 401953 466044 510689 665824 580162 633634 542938 562894 514090 592520 543388
18433 543388 486098 448289 513109 527039 524222 410725 346453 400459 418574 441643 512915
18422 512915 525462 469665 518360 621880 574441 484852 426353 410044 493660 344282 350285
18411 350285 434481 512993 564763 451535 362415 292075 196140 298116 459674 530112 599759
18400 599759 744733 809719 662579 691933 877190 759926 674280 807357 861988 878700
18390 878700 975418 848121 852204 982846 961845 789212 627372 593914 606470 694662 803330
18379 803330 741133 752746 812273 835421 996810 1070373 956033 852620 779109 752743 887566
$$ packed form
18455B99815m7869Q4692J96074J12935L4955J00974k9447k319k7030k17629q1594
18444D23557k1604O4091M4645J55135q5662N3472r0696J9956m8804P8430m9132
18433E43388n7290l7809O4820J3930k817j13497o4272N4006J8115K3069P1272
18422E12915J2547n5797M8695J03520m7439q9589n8499j6309Q3616j49378O003
18411C50285Q4196P8512N1770j13228q9120p0340r5935J01976J61558P0438O9647
18400E99759J44974O4986j47140K9354J85257j17264q5646J33077N4631J6712
18390H78700R6718j27297M083J30642k1001j72633j61840l3458J2556Q8192J08668
18379H03330o2197J1613N9527K3148J61389P3563j14340j03413p3511k6366J34823
$$ plain form
18368 887566 1131440 1217228 1064285 1052103 952248 720148 722187 759068 775086 742412 574423
18357 574423 632888 633348 549755 514039 420934 692844 872117 847834 909205 1063653 939381
18346 939381 1033126 1202110 1090915 1182126 1415499 1391477 1270380 1157795 1009713 1012715
18336 1012715 1137470 1122409 1134471 1209857 1243005 1196053 1121714 973539 957836 922982 1050006
18325 1050006 979601 1023039 1118972 1091830 1049281 1048350 973606 997040 1077382 1248308 1188295
18314 1188295 1139439 1154900 1200463 1291427 1213989 1169740 1135225 1099492 1184553 1015348 1011964
18303 1011964 1064453 1015310 1081541 1129271 1168019 1049275 1253047 1353962 1355942 1386487 1359752
18292 1359752 1207533 1156405 1252325 1389348 1518229 1489397 1446087 1396837 1478504 1722027
$$ packed form
18368H87566K43874Q5788j52943j2182r9855k32100K039L6881J6018l2674j67989
18357E74423N8465M60q3593l5716r3105K71910J79273k4283O1371J54448j24272
18346I39381R3745J68984j11195R1211K33373k4022j21097j12585j48082L002
18336A012715J24755j5061J2062P5386L3148m6952p4339j48175j5703l4854J27024
18325A050006p0405M3438R5933k7142m2549r31p4744K3434Q0342J70926o0013
18314A188295m8856J5461M5563R0964p7438m4249l4515l5733Q5061j69205l384
18303A011964N2489m9143O6231M7730L8748j18744K03772J00915J980L0545k6735
18292A359752j52219n1128R5920J37023J28881k8832m3310m9250Q1667K43523
$$ plain form
18282 1722027 1647882 1463496 1368328 1363405 1336003 1410631 1488170 1592842 1584570 1473183 1495004
18271 1495004 1519874 1605430 1579167 1470113 1456450 1423513 1451452 1412679 1569483 1716630 1685264
18260 1685264 1535594 1545731 1522156 1536233 1604693 1632987 1561573 1723411 1830121 1779048 1799085
18249 1799085 1929124 1958559 1930051 1843084 1836583 1851161 1779466 1713912 1776915 1784232 1892433
18238 1892433 1980571 1885505 1782991 1971675 1972646 1898632 1925770 1924099 1954261 1938113 2092615
18227 2092615 2144680 2261840 2426258 2399987 2430739 2376489 2267611 2279721 2261825 2388376
18217 2388376 2508679 2493295 2422706 2326007 2212452 2256310 2244107 2139580 2279725 2411146
18207 2411146 2373119 2405108 2546761 2663820 2700609 2632034 2623252 2581497 2542844 2630932 2689826
$$ packed form
18282A722027p4145j84386r5168m923k7402P4628P7539J04672q272j11387K1821
18271A495004K4870Q5556k6263j09054j3663l2937K7939l8773J56804J47147l1366
18260A685264j49670J0137k3575J4077O8460K8294p1414J61838J06710n1073K0037
18249A799085J30039K9435k8508q6967o501J4578p1695o5554O3003P317J08201
18238A892433Q8138r5066j02514J88684R71p4014K7138j671L0162j6148J54502
18227B092615N2065J17160J64418k6271L0752n4250j08878J2110j7896J26551
18217B388376J20303j5384p0589r6699j13555M3858j2203j04527J40145J31421
18207B411146l8027L1989J41653J17059L6789o8575q782m1755l8653Q8088N8894
$$ plain form
18196 2689826 2723395 2916717 3063057 3217049 3146836 3149460 3153427 3385655 3416832 3340006 3218047
18185 3218047 3258127 3319472 3375184 3432567 3380537 3330287 3274272 3616255 3966430 3851629 3748868
18174 3748868 3912673 4015474 4128229 4216528 4386170 4570414 4650392 4738507 4656983 4795844
18164 4795844 5011436 5124047 5232434 5170350 5213274 5373625 5543223 5739766 6027757 6145564
18154 6145564 6451367 6571000 6878356 7215635 7418531 7625475 7773488 7933200 8256788
18145 8256788 8497312 8774245 9253651 9564875 10036010 10437277 10769676 11115004 11640045
18136 11640045 12221063 12715991 13162352 13751496 14354559 14934577 15490399 16187170 17180753
18127 17180753 18277837 19470751 20775189 22287587 23806006 25647381 28129100 30815343
$$ packed form
18196B689826L3569J93322J46340J53992p0213K624L967K32228L1177p6826j21959
18185C218047M0080O1345N5712N7383n2030n0250n6015L41983L50175j14801j02761
18174C748868J63805J02801J12755Q8299J69642J84244P9978Q8115q1524J38861
18164D795844K15592J12611J08387o2084M2924J60351J69598J96543K87991J17807
18154F145564L05803J19633L07356L37279K02896K06944J48013J59712L23588
18145H256788K40524K76933M79406L11224M71135M01267L32399L45328N25041
18136A1640045N81018M94928M46361N89144O03063N80018N55822O96771R93583
18127A7180753J097084J192914J304438J512398J518419J841375K481719K686243
$$ plain form
18119 30815343 33939571 37712760 42384626 48076811 55209874 64151465 75529361 90636582
18111 90636582 110192946 134167479 158739720 177807675 187128357 187251408 181809893 176138658
18103 176138658 174291005 176806046 181209694 184242453 182914416 175840193 163823820 149270120
18095 149270120 134229516 120364494 108523817 98409855 89693511 82229910 75796478
18088 75796478 69872729 64489470 59812681 55494459 51646025 48218955 45167552 42416075
18080 42416075 40204162 38359050 36744233 35357239 34140418 33169801 32526931 32387509
18072 32387509 32382936 32334545 32594156 33189134 34091724 35344629 36811632 38675068 40915769
18063 40915769 43615569 46857123 50901391 56004726 62193366 69613335 78708736 90132110
$$ packed form
18119C0815343L124228L773189M671866N692185P133063Q941591J1377896J5107221
18111I0636582J9556364K3974533K4572241J9067955R320682J23051n441515n671235
18103A76138658j847653K515041M403648L032759j328037p074223j2016373j4553700
18095A49270120j5040604j3865022j1840677j0113962q716344p463601o433432
18088G5796478n923749n383259m676789m318222l848434l427070l051403k751477
18080D2416075k211913j845112j614817j386994j216821r70617o42870j39422
18072C2387509m573m8391K59611N94978R02590J252905J467003J863436K240701
18063D0915769K699800L241554M044268N103335O188640P419969R095401J1423374
$$ plain form
18055 90132110 104398533 122380260 144716150 170457623 198173996 224696010 246706901
18048 246706901 260897398 265007862 258963362 244556573 224727766 202838338 181502694
18041 181502694 162292367 146007921 132104715 120275511 109907145 100696135 92250013
18034 92250013 84233603 76738750 69923317 64013088 58684413 53936840 49773294 46041707
18026 46041707 42747767 40110100 37857094 35809114 34117940 32883797 31892274 31061489
18018 31061489 30691194 30541036 30426889 30425026 30803190 31329041 32131072 33140713 34565403
18009 34565403 36393557 38825242 41812682 45664808 50505089 56723196 64681538 74741572
18001 74741572 87518733 103229795 120969887 138763204 153595401 162036557 162128198 154512135
$$ packed form
18055I0132110J4266423J7981727K2335890K5741473K7716373K6522014K2010891
18048B46706901J4190497M110464o044500j4406789j9828807k1889428k1335644
18041A81502694j9210327j6284446j3903206j1829204j0368366r211010q446122
18034I2250013q016410p494853o815433n910229n328675m747573m163546l731587
18026D6041707l293940k637667k253006k047980j691174j234143r91523q30785
18018C1061489l70295j50158j14147j863L78164N25851Q02031J009641J424690
18009C4565403J828154K431685K987440L852126M840281O218107P958342J0060034
18001G4741572J2777161J5711062J7740092J7793317J4832197Q441156R1641p616063
$$ plain form
17993 154512135 141876094 127306291 113181724 100634657 90199068 81781651 74529527
17986 74529527 68050237 62079982 56569312 51519945 46750601 42301252 38140324 34574144
17978 34574144 31442526 28634411 26151705 23882457 21995652 20404963 18911372 17479525
17970 17479525 16182595 15195084 14567335 13595378 12905472 12357047 11752506 11157980 10498355
17961 10498355 9899207 9487891 9175462 8747106 8349748 8185916 7883765 7422270 7031113
17952 7031113 6713589 6570034 6486594 6225948 6087213 6057102 5996539 5795363 5585575 5652569
17942 5652569 5428234 5110469 5030952 4782279 4566523 4614593 4718408 4621738 4367796 4197137
17932 4197137 4043288 3855594 3724847 3622039 3317769 3249655 3237595 3085900 3110992 3090268
$$ packed form
17993A54512135j2636041j4569803j4124567j2547067j0435589q417417p252124
17986G4529527o479290n970255n510670n049367m769344m449349m160928l566180
17978C4574144l131618k808115k482706k269248j886805j590689j493591j431847
17970A7479525j296930r87511o27749r71957o89906n48425o04541n94526o59625
17961A0498355n99148m11316l12429m28356l97358j63832l02151m61495l91157
17952G031113l17524j43555q3440k60646j38735l0111o0563k01176k09788O6994
17942E652569k24335l17765p9517k48673k15756M8070J03815r6670k53942j70659
17932D197137j53849j87694j30747j02808l04270o8114j2060j51695K5092k0724
$$ plain form
17922 3090268 2852101 2691135 2532595 2366516 2338612 2308304 2244038 2447919 2664961 2684931
17912 2684931 2579995 2481346 2427039 2468197 2558492 2595717 2540920 2639185 2812194 2893778 2949290
17901 2949290 3058060 3264257 3333084 3339349 3342944 3313978 3205152 3102101 3018513 2824544 2689464
17890 2689464 2595718 2528272 2582085 2443998 2296794 2248296 2199145 2253251 2328301 2162554 2024219
17879 2024219 1953956 1874850 1802100 1745458 1791710 1822711 1744796 1617834 1603313 1598101 1644172
17868 1644172 1408766 1535107 1760355 1813145 1746653 1727093 1758743 1711288 1720652 1853733 1945888
17857 1945888 1882405 1811652 1838486 1865736 1983989 2190626 2318347 2250734 2185831 2161418 2326393
17846 2326393 2246478 2138192 1950762 2018156 1989671 1939008 2003410 1907329 1772138 1683682 1510222
$$ packed form
17922C090268k38167j60966j58540j66079k7904l0308o4266K03881K17042J9970
17912B684931j04936r8649n4307M1158R0295L7225n4797R8265J73009Q1584N5512
17901B949290J08770K06197O8827O265L595k8966j08826j03051q3588j93969j35080
17890B689464r3746o7446N3813j38087j47204m8498m9151N4106P5050j65747j38335
17879B024219p0263p9106p2750n6642M6252L1001p7915j26962j4521n212M6071
17868A644172k35406J26341K25248N2790o6492j9560L1650m7455R364J33081R2155
17857A945888o3483p0753K6834K7250J18253K06637J27721o7613o4903k4413J64975
17846B326393p9915j08286j87430O7394k8485n0663O4402r6081j35191q8456j73460
$$ plain form
17835 1510222 1326329 1226723 1189823 1191987 1049768 1042340 1205091 1458441 1435894 1279770 1166117
17824 1166117 1080576 1069796 1149553 1131765 1241080 1177742 1180229 1143310 1227396 1055039 943598
17813 943598 880900 854692 877270 901406 1019086 947570 872253 893384 1038292 1182388 1100759
17802 1100759 1043268 1188817 1432172 1394934 1313801 1154653 899466 901091 1075661 1109184
17792 1109184 1226779 1264247 1123931 920563 910091 1009460 1020242 918483 831977 807579
17782 807579 1002558 1043512 1184293 1054584 906488 996484 1104934 883018 654404 817927
17772 817927 651695 558962 722611 871309 903566 929736 936810 927481 822985 689958 638679
17761 638679 544522 565025 577204 565328 685702 583724 554380 625110 604628 833375 1014555
$$ packed form
17835A510222j83893r9606l6900K164j42219p428J62751K53350k2547j56124j13653
17824A166117q5541j0780P9757j7788J09315o3338K487l6919Q4086j72357j11441
17813I43598o2698k6208K2578K4136J17680p1516p5317K1131J44908J44096q1629
17802A100759n7491J45549K43355l7238q1133j59148k55187J625J74570L3523
17792A109184J17595L7468j40316k03368j0472R9369J0782j01759q6506k4398
17782H07579J94979M0954J40781j29709j48096Q9996J08450k21916k28614J63523
17772H17927j66232r2733J63649J48698L2257K6170P074r329j04496j33027n1279
17761F38679r4157K0503J2179j1876J20374j01978k9344P0730k0482K28747J81180
$$ plain form
17750 1014555 947718 772101 680457 718979 662582 630992 633719 742380 811539 823778 829047
17739 829047 775653 900299 1024401 1030038 918175 807071 984715 1067732 996117 913601 716876
17728 716876 586175 709715 738838 639464 833417 1047869 1119755 1000057 779739 642420
17718 642420 584348 593666 624262 640343 636597 783639 943478 909063 744073 819035 823784
17707 823784 850109 914097 948322 992040 1035665 978398 701487 748865 828464 932906 1025725
17696 1025725 1171527 1325359 1402679 1306673 1220289 1186501 1259004 1289270 1272383 1318511 1313845
17685 1313845 1170734 1162649 1088432 1288015 1379360 1317467 1261394 1155401 1133152 1101547 1076669
17674 1076669 1040059 810301 795791 851941 821805 685405 559523 687914 965271 1023974
$$ packed form
17750A014555o6837j75617r1644L8522n6397l1590K727J08661O9159J2239N269
17739H29047n3394J24646J24102N637j11863j11104J77644Q3017p1615q2516j96725
17728G16876j30701J23540K9123r9374J93953K14452P1886j19698k20318j37319
17718F42420n8072R318L0596J6081l746J47042J59839l4415j64990P4962M749
17707H23784K6325O3988L4225M3718M3625n7267k76911M7378P9599J04442R2819
17696A025725J45802J53832P7320r6006q6384l3788P2503L0266j6887M6128m666
17685A313845j43111q085p4217J99583R1345o1893n6073j05993k2249l1605k4878
17674A076669l6610k29758j4510N6150l0136j36400j25882J28391K77357N8703
$$ plain form
17664 1023974 1061315 1157482 1324656 1510365 1568784 1559251 1554424 1448258 1384323 1418845 1672270
17653 1672270 1789641 1879455 2176431 2400875 2369072 2358210 2500690 2546449 2398440 2423981
17643 2423981 2364251 2335364 2288172 2249215 2098946 1998757 1800525 1825293 1806452 1680613
17633 1680613 1686226 1542865 1465549 1506414 1446484 1396700 1329343 1271527 1214052 1314018 1299498
17622 1299498 1203241 1181140 1191099 1138023 1014337 1102544 1227278 1339382 1377787 1319297 1402810
17611 1402810 1645834 1632440 1373994 1416137 1620184 1630502 1663368 1568005 1522691 1670784
17601 1670784 1886959 1964583 2070768 2245201 2191612 2059374 2216694 2259283 2506128 2665960
17591 2665960 2700851 2635944 2582112 2425445 2226906 2073787 1978538 1989732 1886654 1808096
$$ packed form
17664A023974L7341R6167J67174J85709N8419r533m827j06166o3935L4522K53425
17653A672270J17371Q9814K96976K24444l1803j0862J42480M5759j48009K5541
17643B423981n9730k8887m7192l8957j50269j00189j98232K4768j8841j25839
17633A680613N613j43361p7316M0865n9930m9784o7357n7816n7475R9966j4520
17622A299498r6257k2101R959n3076j23686Q8207J24734J12104L8405n8490Q3513
17611A402810K43024j3394k58446M2143K04047J0318L2866r5363m5314J48093
17601A670784K16175P7624J06185J74433n3589j32238J57320M2589K46845J59832
17591B665960L4891o4907n3832j56667j98539j53119r5249J1194j03078p8558
$$ plain form
17581 1808096 1741664 1742075 1666212 1691722 1692808 1839822 1918168 1801939 1722602 1752892 1736733
17570 1736733 1693476 1465788 1352766 1320788 1257280 1164838 1163335 1219901 1327653 1298060 1138543
17559 1138543 1260270 1382401 1468772 1406580 1358247 1233401 1205701 1292166 1360227 1422662 1676230
17548 1676230 1828710 1809334 1821950 1770141 1817164 1733589 1823914 2055264 2227936 2311926 2453926
17537 2453926 2541187 2746717 2829973 2892943 2855519 2814781 2605684 2536959 2539298 2535902 2408106
17526 2408106 2224780 2080462 1979837 1849493 1732742 1875855 1854368 1906695 2050697 2023640
17516 2023640 2125610 2235707 2202096 2017076 1954701 1959885 2102388 2153494 2302090 2153813
17506 2153813 2152117 2110432 2272257 2286298 2265935 2327625 2383084 2322388 2168685 2183360 2317583
$$ packed form
17581A808096o6432M11p5863K5510J086J47014P8346j16229p9337L0290j6159
17570A736733m3257k27688j13022l1978o3508r2442j503N6566J07752k9593j59517
17559A138543J21727J22131Q6371o2192m8333j24846k7700Q6465O8061O2435K53568
17548A676230J52480j9376J2616n1809M7023q3575R0325K31350J72672Q3990J42000
17537B453926Q7261K05530Q3256O2970l7424m0738k09097o8725K339l396j27796
17526B408106j83326j44318j00625j30344j16751J43113k1487N2327J44002k7057
17516B023640J01970J10097l3611j85020o2375N184J42503N1106J48596j48277
17506B153813j696m1685J61825J4041k0363O1690N5459o0696j53703J4675J34223
$$ plain form
17495 2317583 2410098 2501050 2690652 2647455 2578939 2610910 2580608 2660359 2755693 2990446 3109792
17484 3109792 3182705 3261717 3403508 3396533 3239079 3180943 3271306 3370476 3250545 2967615 3004752
17473 3004752 3183065 3100145 3103792 3078139 3039475 3001046 3007999 3021980 3164590 3206036 3117686
17462 3117686 3316658 3403896 3558366 3652114 3598418 3626959 3720929 3673844 3763644 4044787 4278981
17451 4278981 4217610 3949716 3955647 4111548 4202094 4208476 4319798 4405084 4558314 4675983 4638921
17440 4638921 4579816 4524586 4487173 4559548 4608349 4594268 4473087 4448703 4499710 4666079 4674717
17429 4674717 4685430 4950326 5183200 5276203 5384100 5446973 5596415 5627097 5748149 5993155
17419 5993155 6099168 6255862 6665282 6829874 6893844 7119053 7386690 7462450 7673670 7916316
$$ packed form
17495B317583R2515R0952J89602m3197o8516L1971l0302P9751R5334K34753J19346
17484C109792P2913P9012J41791o975j57454n8136R0363R9170j19931k82930L7137
17473C004752J78313q2920L647k5653l8664l8429O953J3981J42610M1446q8350
17462C117686J98972Q7238J54470R3748n3696K8541R3970m7085Q9800K81143K34194
17451D278981o1371k67894N931J55901R0546O382J11322Q5286J53230J17669l7062
17440D638921n9105n5230l7413P2375M8801j4081j21181k4384N1007J66369Q638
17429D674717J0713K64896K32874R3003J07897O2873J49442L0682J21052K45006
17419E993155J06013J56694M09420J64592O3970K25209K67637P5760K11220K42646
$$ plain form
17409 7916316 8320559 8627132 8758384 8898591 9184074 9517480 9877641 10213737 10605797
17400 10605797 11028435 11362852 11833547 12421182 13041618 13670254 14300945 15167352 15919779
17391 15919779 16816863 17980463 19224694 20337190 21562178 22964651 24508642 26123690
17383 26123690 27969494 30074805 32491903 35087447 38236376 41968952 46647867 52308517
17375 52308517 58836305 66877722 77020924 89788048 106056089 126418286 151443984
17368 151443984 179258387 205443972 225955664 239884476 249046610 255433792 259460211
17361 259460211 258207039 248939337 232153208 210433506 187651691 167155995 149853941
17354 149853941 135394386 123022808 112465900 103208255 94890144 87222496 80126773
$$ packed form
17409G916316M04243L06573J31252J40207K85483L33406L60161L36096L92060
17400A0605797M22638L34417M70695N87635O20436O28636O30691Q66407P52427
17391A5919779Q97084J163600J244231J112496J224988J402473J543991J615048
17383B6123690J845804K105311K417098K595544L148929L732576M678915N660650
17375E2308517O527788Q041417J0143202J2767124J6268041K0362197K5025698
17368A51443984K7814403K6185585K0511692J3928812R162134O387182M026419
17361B59460211j253172r267702j6786129k1719702k2781815k0495696j7302054
17354A49853941j4459555j2371578j0556908r257645q318111p667648p095723
$$ plain form
17347 80126773 73735918 67949404 62918802 58799091 55263887 52202473 49435184 47300819
17339 47300819 45504256 43828764 42522648 41410429 40858140 40833038 41008515 41036662 41405219
17330 41405219 42504413 44225417 46412839 49258026 53009546 57835226 63861375 71487288
17322 71487288 81595165 94613944 111223883 131759455 155410387 178705317 197571903
17315 197571903 210089444 217519372 222165050 224990917 224367832 217414978 203828596 185384075
17307 185384075 165211201 146373111 130413098 117071713 105534831 95621001 86755017
17300 86755017 78956849 72003579 65359137 59263570 53939168 49039815 44756215 40821135
17292 40821135 37445128 34372879 31509161 28921289 26928825 24912838 22839016 21070494
$$ packed form
17347H0126773o390855n786514n030602m119711l535204l061414k767289k134365
17339D7300819j796563j675492j306116j112219n52289k5102J75477K8147L68557
17330D1405219J099194J721004K187422K845187L751520M825680O026149P625913
17322G1487288J0107877J3018779J6609939K0535572K3650932K3294930J8866586
17315A97571903J2517541P429928M645678K825867o23085o952854j3586382j8444521
17307A85384075k0172874j8838090j5960013j3341385j1536882r913830q865984
17300H6755017p798168o953270o644442o095567n324402m899353m283600l935080
17292D0821135l376007l072249k863718k587872j992464k015987k073822j768522
$$ plain form
17284 21070494 19492780 18229137 17114460 16044137 15034762 14045144 13255071 12563560
17276 12563560 11860621 11151697 10531381 9993305 9529378 9092912 8821918 8532719 7972106
17267 7972106 7553163 7364041 7212439 6986740 6688459 6624057 6565551 6268058 6027233 5936310
17257 5936310 5700898 5549211 5501652 5363298 5201991 5092933 5241608 5207939 5001914 4937236
17247 4937236 4969481 4949449 4843127 4741209 4569668 4600813 4702877 4549175 4373683 4461834
17237 4461834 4581939 4640427 4718947 4619547 4548117 4536775 4704707 4813491 4813312 4889549 4825209
17226 4825209 4644444 4478094 4489976 4441368 4499780 4518864 4409046 4430927 4465290 4432682 4393387
17215 4393387 4373350 4417575 4576742 4810846 5075045 5297289 5229874 5313229 5410059 5503924
$$ packed form
17284B1070494j577714j263643j114677j070323j009375r89618p90073o91511
17276A2563560p02939p08924o20316n38076m63927m36466k70994k89199n60613
17267G972106m18943j89122j51602k25699k98281o4402n8506k97493k40825r0923
17257E936310k35412j51687m7559j38354j61307j09058J48675l3669k06025o4678
17247D937236L2245k0032j06322j01918j71541L1145J02064j53702j75492Q8151
17237D461834J20105N8488P8520r9400p1430j1342J67932J08784j79P6237o4340
17226D825209j80765j66350J1882m8608N8412J9084j09818K1881L4363l2608l9295
17215D393387k0037M4225J59167K34104K64199K22244o7415Q3355R6830R3865
$$ plain form
17205 5503924 5538806 5597245 5614306 5733511 5940826 5972521 6180081 6366529 6530197 6633747
17195 6633747 6708387 6892481 6830365 6972844 7232234 7292313 7454122 7660911 7826593 8116352
17185 8116352 8385209 8566238 8781890 9216264 9597309 9933584 10190786 10275440 10565594 11050781
17175 11050781 11209436 11719444 12153871 12676675 13458213 14318039 14930838 15509815 16273647
17166 16273647 17221667 18213717 19208880 20470596 21818166 23054110 24438329 26048506
17158 26048506 27647321 29449157 31704413 34119771 36994388 40196319 44093049 48692006
17150 48692006 54249261 61130926 69443636 79821198 92665176 108717755 128447758
17143 128447758 151750202 177315042 201414488 220335354 232919815 240264221 244701697
$$ packed form
17205E503924L4882N8439J7061J19205K07315L1695K07560J86448J63668J03550
17195F633747P4640J84094o2116J42479K59390O0079J61809K06789J65682K89759
17185H116352K68857J81029K15652M34374L81045L36275K57202Q4654K90154M85187
17175A1050781J58655N10008M34427N22804P81538Q59826O12799N78977P63832
17166A6273647R48020R92050R95163J261716J347570J235944J384219J610177
17158B6048506J598815J801836K255256K415358K874617L201931L896730M598957
17150D8692006N557255O881665Q312710J0377562J2843978J6052579J9730003
17143A28447758K3302444K5564840K4099446J8920866J2584461P344406M437476
$$ plain form
17136 244701697 247061719 245887280 238990844 225705002 207509658 187360630 168043116
17129 168043116 151099567 136369282 123788342 112931409 103461516 94927230 87324259
17122 87324259 80421315 74039854 68239628 63056987 58780800 55200952 52020354 48988443
17114 48988443 46425631 44331286 42572240 41148922 40000419 39272455 38819757 38594422
17106 38594422 38499305 38399393 38749395 39461555 40579446 42234413 44230897 46820481 49949166
17097 49949166 53943410 59092740 65773207 74195651 84641120 97698537 114174218 134050160
17089 134050160 156097825 177793239 195630063 207662633 214731117 218647517 220772435
17082 220772435 220110724 214513845 203553303 187748547 169595767 151640277 135414981
$$ packed form
17136B44701697K360022j174439o896436j3285842j8195344k0149028j9317514
17129A68043116j6943549j4730285j2580940j0856933r469893q534286p602971
17122H7324259o902944o381461n800226n182641m276187l579848l180598l031911
17114D8988443k562812k094345j759046j423318j148503p27964m52698k25335
17106C8594422r5117r9912L50002P12160J117891J654967J996484K589584L128685
17097D9949166L994244N149330O680467Q422444J0445469J3057417J6475681J9875942
17089A34050160K2047665K1695414J7836824J2032570P068484L916400K124918
17082B20772435o61711n596879j0960542j5804756j8152780j7955490j6225296
$$ plain form
17075 135414981 121657259 109793706 99421289 90257586 82120191 74688697 67789267
17068 67789267 61560895 56011704 51082663 46565269 42417501 38895739 35650204 32663100
17060 32663100 30102998 27827435 25562785 23673932 21864572 20309648 18969274 17563061
17052 17563061 16337736 15146973 14083875 13182420 12288827 11424877 10616953 9973019 9413120
17043 9413120 8782220 8269631 7896889 7577709 7225516 6742579 6555465 6243395 6010824
17034 6010824 5732229 5337004 5021446 4965947 4885636 4635523 4586836 4421342 4256778 4059920
17024 4059920 3895623 3856655 3595783 3338337 3320045 3232740 3115258 2993381 2818469 2631557
17014 2631557 2647350 2721208 2612636 2603590 2590539 2789228 2890152 2894835 2866721 2871860 2611644
$$ packed form
17075A35414981j3757722j1863553j0372417r163703q137395p431494o899430
17068F7789267o228372n549191m929041m517394m147768l521762l245535k987104
17060C2663100k560102k275563k264650j888853j809360j554924j340374j406213
17052A7563061j225325j190763j063098r01455q93593q63950q07924o43934n59899
17043I413120o30900n12589l72742l19180l52193m82937j87114l12070k32571
17034F010824k78595l95225l15558n5499q0311k50113m8687j65494j64564j96858
17024D059920j64297l8968k60872k57446j8292q7305j17482j21877j74912j86912
17014B631557J5793P3858j08572r046j3051J98689J00924M683k8114N139k60216
$$ plain form
17003 2611644 2422150 2516152 2246176 2267493 2212791 2018504 1995503 1897396 1823169 1730548 1759486
16992 1759486 1523326 1603991 1602335 1514057 1592204 1413298 1333732 1401405 1397984 1262037 1179375
16981 1179375 1248569 1241141 1206358 1124253 1210404 1319158 1291799 1320643 1345223 1271904 1228096
16970 1228096 1223410 1209270 1222400 1116876 933937 1050273 1198955 1105257 1058375 1195445
16960 1195445 1203807 1074994 1228828 1272450 1308514 1186811 1206913 1085661 1041589 1003906 1110577
16949 1110577 1238105 1343773 1143336 912328 701866 654545 788541 965154 874767 731678
16939 731678 643377 523825 460473 533856 703389 674081 649759 614976 624990 652585 732885
16928 732885 834482 848066 821070 687677 728198 585018 721375 731197 647967 668202 699199
$$ packed form
17003B611644j89494R4002k69976K1317n4702j94287k3001r8107p4227r2621K8938
16992A759486k36160Q0665j656q8278P8147j78906p9566O7673l421j35947q2662
16981A179375O9194p428l4783q2105Q6151J08754k7359K8844K4580p3319m3808
16970A228096m686j4140J3130j05524j82939J16336J48682r3698m6882J37070
16960A195445Q362j28813J53834M3622L6064j21703K0102j21252m4072l7683J06671
16949A110577J27528J05668k00437k31008k10462m7321J33996J76613r0387j43089
16939G31678q8301j19552o3352P3383J69533k9308k4322l4783J0014K7595Q0300
16928G32885J01597J3584k6996j33393M0521j43180J36357R822q3230K0235L0997
$$ plain form
16917 699199 638281 690365 779532 700282 660472 702780 770346 883772 837951 518201 435102
16906 435102 482339 374921 265718 326535 297497 383598 327067 326377 291719 378242 343266
16895 343266 450738 439098 487367 443261 519105 522372 375777 329264 464018 491946 364311
16884 364311 204921 220923 191914 187812 152252 55481 -66768 -87178 -69279 -9070 -35294
16873 -35294 48356 200239 197780 384627 382668 327278 247521 315176 287255 328626 393291 218615
16861 218615 264361 323413 297942 290130 462742 512758 340964 190572 210581 344948 343998
16850 343998 228045 149364 149269 111728 296634 500114 766627 896067 771650 659263 581246
16839 581246 507521 446832 357117 407231 477924 599733 609567 668344 777334 1005726 1189791
$$ packed form
16917F99199o0918N2084Q9167p9250l9810M2308O7566J13426m5821l19750q3099
16906D35102M7237j07418j09203O0817k9038Q6101n6531o90l4658Q6523l4976
16895C43266J07472j1640M8269m4106P5844L267j46595m6513J34754K7928j27635
16884C64311j59390J6002k9009m102l5560r6771j22249k0410J7899O0209k6224
16873c5294Q3650J51883k459J86847j959n5390p9757O7655k7921M1371O4665j74676
16861B18615M5746N9052k5471p812J72612N0016j71794j50392K0009J34367r50
16850C43998j15953p8681r5l7541J84906K03480K66513J29440j24417j12387p8017
16839E81246p3725o0689q9715N0114P0693J21809R834N8777J08990K28392J84065
$$ plain form
16828 1189791 1262510 1263277 1073424 1314186 1578643 1757176 1783558 1594155 1513309 1457212 1403537
16817 1403537 1360886 1277019 1184550 1049773 963545 816736 755367 712024 582887 484049 283920
16806 283920 314887 494355 431902 545702 546215 648762 612471 461350 153321 86248 245134
16795 245134 282542 300412 343729 311147 339948 268640 407876 508941 463082 516930 575337
16784 575337 666403 642485 536080 569191 588063 592366 642774 735935 810759 926950 1196016
16773 1196016 1348631 1516732 1683604 1642319 1418643 1548546 1378519 1322119 1263429 1109295
16763 1109295 974818 816146 672453 583712 687487 618262 550749 604221 565200 490873
16753 490873 517250 516836 294514 290813 289575 158817 83287 118725 225611 312978 244871 221353
$$ packed form
16828A189791P2719P67j89853K40762K64457J78533K6382j89403q0846n6097n3675
16817A403537m2651q3867r2469j34777q6228j46809o1369m3343j29137r8838k00129
16806B83920L0967J79468o2453J13800N13J02547l6291j51121l08029o7073J58886
16795B45134L7408J7870M3317l2582K8801p1308J39236J01065m5859N3848N8407
16784E75337R1066k3918j06405L3111J8872M303N0408R3161P4824J16191K69066
16773A196016J52615J68101J66872m1285k23676J29903j70027n6400n8690j54134
16763A109295j34477j58672j43693q8741J03775o9225o7513N3472l9021p4327
16753D90873K6377m14k22322l701j238j30758p5530L5438J06886Q7367o8107k3518
$$ plain form
16741 221353 403234 281794 67725 94457 48636 151101 209023 198415 86392 -32722
16731 -32722 9001 -74633 8177 -79121 -206289 -128146 -160524 -249513 -76576 254124 291621
16720 291621 135633 161893 352229 316890 84484 -40062 -34901 53641 14319 -141139 -65499
16709 -65499 -58525 -192768 -241786 -45554 106967 35001 -78108 -119878 -66285 -4739 156422
16698 156422 64237 -160843 -145523 -24790 -161968 -300758 -256594 -160616 -181243 -107729 -30825
16687 -30825 -13038 57693 150101 142090 75443 -14134 -53535 108677 89839 -35008 53917
16676 53917 116096 151977 28887 -51852 -18651 -57385 19565 -98377 -73833 80864 124883
16665 124883 95058 80896 46716 -19317 -71794 -72820 -68891 -149785 -224151 -213590 -137519 53131
$$ packed form
16741B21353J81881j21440k14069K6732m5821J02465N7922j0608j12023j19114
16731c2722M1723q3634Q2810q7298j27168P8143l2378q8989J72937L30700L7497
16720B91621j55988K6260J90336l5339k32406j24546N161Q8542l9322j55458P5640
16709f5499O974j34243m9018J96232J52521p1966j13109m1770N3593O1546J61161
16698A56422r2185k25080J5320J20733j37178j38790M4164R5978k0627P3514P6904
16687c0825J7787P0731R2408q011o6647q9577l9401J62212j8838j24847Q8925
16676E3917O2179L5881j23090q0739L3201l8734P6950j17942K4544J54697M4019
16665A24883k9825j4162l4180o6033n2477j026L929q0894p4366J0561P6071J90650
$$ plain form
16653 53131 103935 -64671 -119631 -48842 -210804 -365094 -263597 -124375 -54405 23008 -38301
16642 -38301 -45620 -8945 89581 57009 134040 -4239 -32456 120718 174580 376024 478233
16631 478233 454761 514485 624799 654432 871390 1095591 1168283 1217312 1286043 1387402 1353990
16620 1353990 1351254 1324472 1189885 1053011 991207 817695 585841 336758 302138 397980
16610 397980 642662 692335 526263 409028 280876 70300 24534 228916 353022 508438
16600 508438 581247 499735 396885 460256 437562 235014 68575 179873 458029 527948
16590 527948 387605 238597 191172 139449 112403 183203 93461 123061 275004 280844 338535
16579 338535 528946 349478 301005 494461 672221 789877 987284 1130357 1235175 1415983
$$ packed form
16653E3131N0804j68606n4960P0789j61962j54290J01497J39222O9970P7413o1309
16642c8301p319L6675R8526l2572P7031j38279k8217J53174N3862K01444J02209
16631D78233k3472N9724J10314K9633K16958K24201P2692M9029O8731J01359l3412
16620A353990k736k6782j34587j36874o1804j73512k31854k49083l4620R5842
16610C97980K44682M9673j66072j17235j28152k10576m5766K04382J24106J55416
16600E08438P2809q1512j02850O3371k2694k02548j66439J11298K78156O9919
16590E27948j40343j49008m7425n1723k7046P0800q9742K9600J51943N840N7691
16579C38535J90411j79468m8473J93456J77760J17656J97407J43073J04818J80808
$$ plain form
16569 1415983 1399210 1265906 1346730 1415351 1198763 989763 977923 992553 994785 748560 671280
16558 671280 638214 527274 533296 444550 435668 399279 293274 290409 280492 263315 233414 217844
16546 217844 -8860 126961 327389 288345 78362 86627 110525 -22667 -112179 -71064 -140366
16535 -140366 -139232 -119980 -64009 -105135 -166345 -41365 36055 26005 -789 90518 -18683
16524 -18683 -99524 3631 -149721 -74727 169518 289840 264470 131915 85631 96902 8852
16513 8852 97408 210122 49325 -42590 -148411 -191054 -237382 -270361 -389971 -318873 -250928
16502 -250928 -251800 -144983 -149316 -122799 -60680 -56659 -54505 65232 83280 -16436 -33587 95228
16490 95228 222183 97812 -4398 -124049 -238080 -404754 -367426 -281478 -177240 -178464
$$ packed form
16569A415983j6773j33304Q0824O8621k16588k09000j1840J4630K232k46225p7280
16558F71280l3066j10940O022q8746q882l6389j06005k865r917j7177k9901j5570
16546B17844k26704J35821K00428l9044k09983Q265K3898j33192q9512M1115o9302
16535a40366J134J9252N5971m1126o1210J24980P7420j0050k6794R1307j09201
16524a8683q0841J03155j53352P4994K44245J20322k5370j32555m6284J1271q8050
16513H852Q8556J12714j60797r1915j05821m2643m6328l2979j19610P1098O7945
16502b50928q72J06817m333K6517O2119M021K154J19737J8048r9716j7151J28815
16490I5228J26955j24371j02210j19651j14031j66674L7328Q5948J04238j224
$$ plain form
16480 -178464 -95448 -51886 -72039 -117299 55874 97519 60039 -143075 -256776 -212286 -227584
16469 -227584 -325290 -178910 23590 -14551 70582 140107 276583 197049 103420 28383 -107
16458 -107 -9754 81217 37532 53739 89818 105420 -86615 -54797 -33143 132021 289953 227762
16446 227762 170413 21806 -47857 -67769 -139333 -169771 -157207 -55284 95309 140930 113727
16435 113727 36553 -49665 -152580 -169570 -142580 -8407 92922 220832 301020 227684 134486
16424 134486 31445 104209 -35623 -52471 -109817 -141888 -134673 -155874 -205851 -162600 -251614
16413 -251614 -214521 63490 139680 -24935 52657 142303 124968 -33496 -155947 -24585
16403 -24585 64155 10100 -48798 -682 8165 -96232 -228969 -190011 -195100 -190268 -205574 -93900
$$ packed form
16480a78464Q3016M3562k0153m5260J73173M1645l7480k03114j13701M4490j5298
16469b27584r7706J46380K02500l8141Q5133O9525J36476p9534r3629p5037k8490
16458a07r647R0971m3685J6207L6079J5602j92035L1818K1654J65164J57932o2191
16446B27762n7349j48607o9663j9912p1564l0438J2564J01923J50593M5621k7203
16435A13727p7174q6218j02915j6990K6990J34173J01329J27910Q0188p3336r3198
16424A34486j03041P2764j39832j6848n7346l2071P215k1201m9977M3251q9014
16413b51614L7093K78011P6190j64615P7592Q9646j7335j58464j22451J31362
16403b4585Q8740n4055n8898M8116Q847j04397j32737L8958n089M832j5306J11674
$$ plain form
16391 -93900 -102527 -588 71677 58029 -67343 -253833 -149248 -107782 -218943 -252787 -227320
16380 -227320 -155024 -104413 -159825 -229303 -156547 39329 43088 172763 212477 34727 -63689
16369 -63689 -64954 -26620 -14771 82837 48471 28180 61353 227127 255271 280574 244300 173627
16357 173627 196501 76419 33385 115496 146543 121695 104851 -52556 -95496 22370 -29305
16346 -29305 12406 59629 47903 -74982 -6369 79518 282185 355139 198814 147170 201415
16335 201415 114317 111479 117171 139010 107961 -19604 -103650 -209032 -135058 33150 131503
16324 131503 241650 186212 126916 104229 133131 -85650 8375 -79091 -140637 -308597 -383587
16313 -383587 -288094 -339591 -317460 -278339 -347316 -345836 -153596 -158624 -29968 43169 30654
$$ packed form
16391i3900q627J01939P2265j3648j25372j86490J04585M1466j11161l3844K5467
16380b27320P2296N0611n5412o9478P2756J95876L759J29675L9714j77750r8416
16369f3689j265L8334J1849R7608l4366k0291L3173J65774K8144K5303l6274p0673
16357A73627K2874j20082m3034Q2111L1047k4848j6844j57407m2940J17866n1675
16346b9305M1711M7223j1726j22885O8613Q5887K02667P2954j56325n1644N4245
16335B01415q7098k838N692K1839l1049j27565q4046j05382P3974J68208R8353
16324A31503J10147n5438n9296k2687K8902k18781R4025q7466o1546j67960p4990
16313c83587R5493n1497K2131L9121o8977J480J92240n028J28656P3137j2515
$$ plain form
16302 30654 127960 -69343 -183748 -83570 105019 183163 11794 -190779 -304330 -311410
16292 -311410 -83533 -70166 -216573 -103766 -82068 -236702 -286044 -60298 -71079 -126964
16282 -126964 -279538 -270483 -44828 -57437 -234087 -230325 -236931 -156543 -37540 -94474 622
16271 622 75174 109642 161180 -98722 -262498 -214028 -94387 96592 2907 -134591 -59577
16260 -59577 14466 -100254 -131158 -72902 55065 92491 43988 -104099 -202462 -139363 -28643
16249 -28643 96863 62268 75406 164619 86851 86654 194166 90935 -181195 -258590 -40681
16238 -40681 39123 5712 -108686 -223334 -279203 -257355 -130367 -136410 -121420 -93812 -46619
16227 -46619 65801 32740 41858 -3969 -160117 -64286 61129 -92939 -304063 -284762 -198632
$$ packed form
16302C0654R7306j97303j14405J00178J88589P8144j71369k02573j13551p080
16292c11410K27877J3367j46407J12807K1698j54634m9342K25746j0781n5885
16282a26964j52574R055K25655j2609j76650L762o606Q0388J19003n6934R5096
16271F22P4552L4468N1538k59902j63776M8470J19641J90979r3685j37498P5014
16260e9577P4043j14720l0904N8256J27967L7426m8503j48087r8363O3099J10720
16249b8643J25506l4595J3138Q9213p7768j97J07512j03231k72130p7395K17909
16238d0681P9804l3411j14398j14648n5869K1848J26988o043J4990K7608M7193
16227d6619J12420l3061R118m5827j56148R5831J25415j54068k11124J9301Q6130
$$ plain form
16216 -198632 -164799 -205729 -166449 -66410 24157 27931 133641 193750 251781 251333 300497 226693
16204 226693 37233 -211292 -277533 -281955 -217286 -253521 -189344 -183797 -135675 -14800 -2378
16193 -2378 -119729 -96128 -31484 8309 49753 148479 -93774 -111939 -147101 -24256 27195
16182 27195 105523 -65332 110666 44351 -68397 91200 264908 146919 -34051 -309926
16172 -309926 -289480 -103256 327 47607 -76401 -130395 -94528 31989 -297 66373 55673
16161 55673 179062 197091 202114 239156 211689 115341 70802 104316 94787 60866 -27392 14784
16149 14784 -72768 -226513 -117414 -114196 -11044 175561 271500 248186 183973 131434 100022
16138 100022 139138 56190 -89679 129351 371991 450423 492627 311522 137962 -1504
$$ packed form
16216a98632L3833m0930L9280J00039R0567L774J05710O0109N8031m48M9164p3804
16204B26693j89460k48525o6241m422O4669l6235O4177N547M8122J20875J2422
16193b378j17351K3601O4644L9793M1444R8726k42253j8165l5162J22845N1451
16182B7195P8328j70855J75998o6315j12748J59597J73708j17989j80970k75875
16172c09926K0446J86224J03583M7280j24008n3994L5867J26517l2286O6670j0700
16161E5673J23389J8029N023L7042k7467r6348m4539L3514r529l3921q8258M2176
16149A4784q7552j53745J09099L218J03152J86605R5939k3314o4213n2539l1412
16138A00022L9116q2948j45869K19030K42640P8432M2204j81105j73560j39466
$$ plain form
16128 -1504 -45552 67980 144796 195371 203462 172989 146428 165258 293913 240680 -8849
16117 -8849 -108872 34367 164370 219375 139655 156524 141972 119633 -113523 -266171 -221938
16106 -221938 -45869 208310 330965 113865 -68453 -28048 52019 -4896 -45233 14017
16096 14017 123177 214763 181458 -42538 -68869 -43619 10738 23262 -82910 -53081 100979
16085 100979 172619 145152 48429 -32309 -10367 -82538 -259843 -129254 -41646 -54277 -127219
16074 -127219 -78376 -4312 -113222 -63943 -66707 88598 44887 -73031 121247 286211 171080
16063 171080 53187 150770 182956 169061 8814 -131944 -93495 85946 178310 99621 183513
16052 183513 38108 -58270 -82991 -73269 -64807 -150728 -180141 -93370 -152353 -32599 31998
$$ packed form
16128a504m4048J13532P6816N0575Q091l0473k6561J8830J28655n3233k49529
16117h849j00023J43239J30003N5005p9720J6869j4552k2339k33156j52648M4233
16106b21938J76069K54179J22655k17100j82318M0405Q0067n6915m0337N9250
16096A4017J09160R1586l3305k23996k6331K5250N4357J2524j06172K9829J54060
16085A00979P1640k7467r6723q0738K1942p2171j77305J30589Q7608j2631p2942
16074a27219M8843P4064j08910M9279k764J55305m3711j17918J94278J64964j15131
16063A71080j17893R7583L2186j3895j60247j40758L8449J79441R2364p8689Q3892
16052A83513j45405r6378k4721R722Q462q5921k9413Q6771n8983J19754O4597
$$ plain form
16041 31998 144991 96953 226322 270000 158745 11820 -100180 -41517 23015 -79780
16031 -79780 -126488 -42667 -8536 22168 -51308 72911 84959 153467 108190 109990 54317 218995
16019 218995 343849 273670 137839 44322 60126 -32950 44113 86522 257746 216820 25126
16008 25126 23535 -106005 51536 127515 86794 95171 165940 92678 -37726 -163369 -314507
15997 -314507 -275645 -25401 -70934 -98825 85700 210758 69013 123621 215850 177150 159147
15986 159147 53746 -4999 174388 342613 443910 325085 99521 -64415 -182563 -138919
15976 -138919 -179787 -73046 162734 104560 5295 -73285 -87474 -66346 -37042 -37900 -117937
15965 -117937 -206616 -307555 -176863 -10357 72907 68802 -10890 -137808 35411 155276
$$ packed form
16041C1998J12993m8038J29369M3678j11255j46925j12000N8663O4532j02795
16031g9780m6708Q3821L4131L0704p3476J24219J2048O8508m5277J800n5673J64678
16019B18995J24854p0179j35831r3517J5804r3076P7063M2409J71224m0926j91694
16008B5126j591j29540J57541P5979m0721Q377P0769p3262j30404j25643j51138
15997c14507L8862K50244m5533k7891J84525J25058j41745N4608R2229l8700j8003
15986A59147j05401n8745J79387J68225J01297j18825k25564j63936j18148M3644
15976a38919m0868J06741K35780n8174r9265p8580j4189K1128K9304q58q0037
15965a17937q8679j00939J30692J66506Q3264m105p9692j26918J73219J19865
$$ plain form
15955 155276 120385 55434 92113 -6981 95038 65269 -56151 -203135 -298141 -253454 -129298
15944 -129298 -17050 53573 51410 134971 100535 1734 -87177 -156790 -78567 9535 45199
15933 45199 -27076 -58995 -51031 51138 -30289 -134116 -33303 41958 32701 -38856 -39038 84385
15921 84385 99653 15268 -211744 -179241 -86794 -124238 -52181 -36510 -151903 -124427 203201
15910 203201 270132 220349 -6712 -118031 -31572 -139662 -225751 -199893 -282431 -199046 -69726
15899 -69726 -68059 159013 336224 310541 145004 321247 317826 278375 136624 176357 129141
15888 129141 70654 31755 -26198 74210 -156765 -141701 -161487 -246001 -137029 63154 -1904
15877 -1904 -157208 -354883 -417593 -389630 -122186 61701 90101 -17199 -160954 -223950 -7228
$$ packed form
15955A55276l4891o4951L6679r9094J02019k9769j21420j46984r5006M4687J24156
15944a29298J12248P0623k163Q3561l4436r8801q8911o9613P8223Q8102L5664
15933D5199p2275l1919P964J02169q1427j03827J00813P5261r257p1557j82J23423
15921H4385J5268q4385k27012L2503R2447l7444P2057J5671j15393K7476L27628
15910B03201O6931m9783k27061j11319Q6459j08090q6089K5858q2538Q3385J29320
15899f9726J667K27072J77211k5683j65537J76243l421l9451j41751L9733m7216
15888A29141n8487l8899n7953J00408k30975J5064j9786q4514J08972K00183o5058
15877a904j55304j97675o2710K7963K67444J83887K8400j07300j43755o2996K16722
$$ plain form
15866 -7228 145716 109554 -57158 -56712 91981 26786 -37621 4098 60794 222937 244477
15855 244477 121540 80853 -55480 -172564 191752 272422 207709 281285 304418 209896 209238
15844 209238 249977 304075 264458 216508 191993 202625 234207 199304 135951 147919 19785
15833 19785 -124568 23685 8625 -3215 -7252 51452 15258 -23923 -44483 -63497 62143
15822 62143 155493 175357 95523 109608 127692 98347 110780 152193 238745 216791 173133 142395
15810 142395 163093 128725 178717 247640 191417 114762 21802 84422 62730 -89707 -252110
15799 -252110 -202752 -38856 -19051 215470 282209 187012 163496 -2133 -116329 -21450 53179
15788 53179 72637 28282 62977 152483 73767 155646 89875 -69883 -87022 -39778 6579
$$ packed form
15866g228J52944l6162j66712M46J48693o5195o4407M1719N6696J62143K1540
15855B44477j22937m0687j36333j17084L64316Q0670o4713P3576K3133r4522o58
15844B09238M0739N4098l9617m7950k4515J0632L1582l4903o3353J1968j28134
15833A9785j44353J48253j5060j1840m037N8704l6194l9181k0560j9014J25640
15822F2143R3350J9864p9834J4085J8084k9345J2433M1413Q6552k1954m3658l0738
15810A42395K0698l4368M9992O8923n6223p6655r2960O2620k1692j52437j62403
15799b52110M9358J63896J9805K34521O6739r5197k3516j65629j14196R4879P4629
15788E3179J9458m4355L4695Q9506p8716Q1879o5771j59758j7139M7244M6357
$$ plain form
15777 6579 190359 162975 -129734 -208519 -149138 -79908 -156903 -1189 114893 93619 161731
15766 161731 273623 259913 260994 230901 180661 192994 147149 13737 496 -2735 70989
15755 70989 222786 87451 -173582 -351575 -317590 -167831 62209 -21594 -6143 28036
15745 28036 -183590 -70950 81633 209001 217296 191134 209298 112286 295982 325759 194252
15734 194252 151674 -26858 -36489 -145954 -195775 -113668 -20453 -4534 -157625 -169285 -114612
15723 -114612 76623 48205 -73967 -88216 -82831 81932 40456 -29615 46828 17966 -71119
15712 -71119 -44436 -16402 -30263 -719 51404 1990 -55878 67693 19066 -107459 -37266
15701 -37266 -112185 -87492 -61184 -413 31057 166076 408885 420515 301584 176232 69515
$$ packed form
15777F579J83780k7384k92709p8785N9381O9230p6995J55714J16082k1274O8112
15766A61731J11892j3710J081l0093n0240J2333m5845j33412j3241l231P3724
15755G0989J51797j35335k61033j77993L3985J49759K30040q3803J5451L4179
15745B8036k11626J12640J52583J27368Q295k6162J8164r7012J83696K9777j31507
15734A94252m2578j78532r631j09465m9821Q2107R3215J5919j53091j1660N4673
15723a14612J91235k8418j22172j4249N385J64763m1476p0071P6443k8862q9085
15712g1119K6683K8034j3861K9544N2123m9414n7868J23571m8627j26525P0193
15701c7266p4919K4693K6308O0771L1470J35019K42809J1630j18931j25352j06717
$$ plain form
15690 69515 60528 50558 154158 83224 -15071 -74949 8973 -3036 82931 11117 -201050 -295595
15678 -295595 -232961 -249308 -238026 -256213 -333982 -335554 -159260 30662 93637 55817 152158
15667 152158 322263 276392 141400 -5345 -39916 -91233 -16219 95567 158030 134999 94123
15656 94123 5305 -56381 -43776 -54749 -129944 -103065 -20683 68718 111320 177701 230985 227407
15644 227407 217248 63372 -7170 106024 257160 231836 283659 139770 -28007 -183802
15634 -183802 -296845 -358993 -317677 -31311 234260 253814 41339 -54844 -154052 -84602 -88432
15623 -88432 -91231 -6084 32050 -22959 -49459 -126395 -262603 -223535 -198426 -138909 -184092 23068
15611 23068 67394 -53433 -53021 -168679 -103060 -104157 -35439 4750 -107177 -52372 14645 60106
$$ packed form
15690F9515q987r970J03600p0934r8295n9878Q3922j2009Q5967p1814k12167r4545
15678b95595O2634j6347J1282j8187p7769j572J76294J89922O2975l7820R6341
15667A52158J70105m5871j34992j46745l4571n1317P5014J11786O2463k3031m0876
15656I4123q8818o1686J2605j0973p5195K6879Q2382Q9401M2602O6381N3284l578
15644B27407j0159j53876p0542J13194J51136k5324N1823j43889j67777j55795
15634a83802j13043o2148M1316K86366K65571J9554k12475r6183r9208O9450l830
15623h8432k799Q5147L8134n5009k6500p6936j36208L9068K5109N9517m5183K07160
15611B3068M4326j20827M12j15658O5619j097O8718M0189j11927N4805O7017M5461
$$ plain form
15599 60106 151459 181626 126749 29506 9561 125803 118718 103978 36530 -71548 -104183
15588 -104183 32684 -47437 -106915 -61211 -11759 61282 252120 193353 8804 -4886 -119065
15577 -119065 -195501 -94432 69801 38571 59717 137019 222042 209798 198714 112756 200416
15566 200416 160709 221020 324063 252705 165280 66898 -24574 -31656 -58130 637 -72346
15555 -72346 4961 221912 178760 -46720 -47580 101837 322930 374941 219549 98150 -46939
15544 -46939 -213625 -218388 -123056 -7827 -3113 -18300 111487 213221 281901 264779 120761
15533 120761 92120 71364 -36995 -88954 92892 156723 19346 -129125 -72642 -17199 -112828
15522 -112828 -218442 -146188 8474 98207 188718 105846 59023 -63155 -132435 -25237 101584
$$ packed form
15599F0106R1353L0167n4877r7243j9945J16242p085j4740o7448j08078l2635
15588a04183J36867q0121n9478M5704M9452P3041J90838n8767j84549j3690j14179
15577a19065p6436J01069J64233l1230K1146P7302Q5023j2244j1084q5958Q7660
15566B00416l9707O0311J03043p1358q7425r8382r1472p082k6474N8767p2983
15555g2346P7307K16951m3152k25480q60J49417K21093N2011j55392j21399j45089
15544d6939j66686m763R5332J15229M714j5187J29787J01734O8680j7122j44018
15533A20761k8641k0756j08359n1959J81846O3831j37377j48471N6483N5443r5629
15522a12828j05614P2254J54662Q9733R0511q2872m6823j22178o9280J07198J26821
$$ plain form
15511 101584 -24688 33167 87190 114072 121779 185770 224686 214901 176493 63890 -37959
15500 -37959 -167597 -260109 -170564 15596 10553 -46848 188820 292807 265292 177334 12659
15489 12659 -3385 -11197 -32530 25658 -19707 -85120 -90423 -15903 58644 81155 96845 -2012
15477 -2012 -131393 -102470 -94285 -180831 82189 344235 382206 320280 118324 90339 117408
15466 117408 130605 124288 -136549 -130648 -40551 -74675 -79566 -41300 -37017 -57921 32822 182564
15454 182564 139125 -37070 -54482 83347 151844 70424 -76641 -220666 -194911 -216257 -132947
15443 -132947 -108983 19552 47827 -22151 -57944 -49785 79825 215463 208619 199901 225095
15432 225095 145169 94539 39519 -57931 -135243 -61258 -87934 -96858 -35127 121671 155339
$$ packed form
15511A01584j26272N7855N4023K6882P707O3991L8916r785l8408j12603j01849
15500c7959j29638r2512Q9545J86160n043n7401K35668J03987k7515q7958j64675
15489A2659j6044p812k1333N8188m5365o5413n303P4520P4547K2511J5690r8857
15477b012j29381K8923Q185q6546K63020K62046L7971o1926k01956k7985K7069
15466A17408J3197o317k60837N901R0097l4124m891L8266M283k0904R0743J49742
15454A82564m3439j76195j7412J37829O8497q1420j47065j44025K5755k1346Q3310
15443a32947K3964J28535K8275o9978l5793Q159J29610J35638o844q718K5194
15432B25095p9926n0630n5020r7450p7312P3985k6676q924O1731J56798L3668
$$ plain form
15421 155339 7949 -53048 -186487 -208947 -254398 -302561 -147770 5464 157864 72285
15411 72285 46771 12789 74160 2292 -83985 -170896 -134076 -39035 -72087 -123424 -162414 -52469
15399 -52469 118550 197816 211547 205702 157598 120128 220616 67707 -157166 -232091 -201067
15388 -201067 -95877 -75985 -160014 -88206 -32600 119316 79953 -13242 60113 94370 27600
15377 27600 57625 127855 27070 104209 298038 474832 390845 164333 147678 130199 277100
15366 277100 336736 193234 33143 -63220 1221 101581 167881 183084 -158760 -152702 -56134
15355 -56134 31002 -48841 -85994 139342 213170 194257 218799 286649 219574 221384 187059 40489
15343 40489 -72499 10895 39626 129817 -21099 -6171 73367 64532 119845 113445 300817
$$ packed form
15421A55339j47390o0997j33439k2460m5451m8163J54791J53234J52400q5579
15411G2285k5514l3982O1371p1868q6277q6911L6820R5041l3052n1337l8990J09945
15399e2469J71019P9266J3731n845m8104l7470J00488j52909k24873p4925L1024
15388b01067J05190J9892q4029P1808N5606J51916l9363r3195P3355L4257o6770
15377B7600L0025P0230j00785P7139J93829J76794q3987k26512j6655j7479J46901
15366B77100N9636j43502j60091r6363O4441J00360O6300J5203l41844O058R6568
15355e6134Q7136p9843l7153K25336P3828j8913K4542O7850o7075J810l4325j46570
15343D0489j12988Q3394K8731R0191j50916J4928P9538q835N5313o400J87372
$$ plain form
15332 300817 294404 13292 -178592 -224695 -83762 7101 -107939 -58306 -104798 -217737 -83929
15321 -83929 136737 238955 154692 156842 261524 546334 542790 240240 134942 358163 381418
15310 381418 357946 270737 207109 184953 223420 177690 164418 145350 196220 268186 249856
15299 249856 114137 89773 159566 118622 60584 285725 447274 353178 351300 403776 390901
15288 390901 403074 512979 428600 301052 363552 371007 191619 133142 153786 180628 242555
15277 242555 265339 342604 481934 388021 245399 285281 238260 184446 256484 327938 372643
15266 372643 370017 287692 232872 196397 228134 277062 250369 109054 -19352 212190 463854
15255 463854 454584 341682 342686 212459 194295 50228 99999 157726 141665 102908 54939
$$ packed form
15332C00817o413k81112j91884m6103J40933R0863j15040M9633m6492j12939J33808
15321h3929K20666J02218q4263K150J04682K84810l544l02550j05298K23221K3255
15310C81418k3472q7209o3628k2156L8467m5730j3272j9068N0870P1966j8330
15299B49856j35719k4364O9793m0944n8038K25141J61549r4096j878N2476j2875
15288C90901J2173J09905q4379j27548O2500P455j79388n8477K0644K6842O1927
15277B42555K2784P7265J39330r3913j42622L9882m7021n3814P2038P1454M4705
15266C72643k626q2325n4820l6475L1737M8928k6693j41315j28406K31542K51664
15255D63854r270j12902J004j30227j8164j44067M9771N7727j6061l8757m7969
$$ plain form
15244 54939 323370 349797 333283 322062 211211 172910 116864 50651 93367 158796 199506
15233 199506 126940 62651 170560 389755 362208 306614 358304 348578 209686 274384 205372
15222 205372 210019 236666 110230 358061 350463 236833 183448 207082 238766 298596 366779
15211 366779 386531 254206 228599 75745 -13009 73506 -14774 43781 205442 294164 238335
15200 238335 139313 121160 146182 133740 204490 35763 -29644 -40808 11209 124569 180439
15189 180439 273741 267013 253585 233155 381956 224724 40809 149493 180516 164831 212292
15178 212292 275039 312889 264315 260377 224393 156272 198061 296434 252900 377553 487839
15167 487839 303834 205885 222613 56513 41833 213583 163093 62271 -3323 -1619 51032
$$ packed form
15244E4939K68431K6427j6514j1221j10851l8301n6046o6213M2716O5429M0710
15233A99506p2566o4289J07909K19195k7547n5594N1690r726j38892O4698o9012
15222B05372M647K6647j26436K47831p598j13630n3385K3634L1684N9830O8183
15211C66779J9752j32325k5607j52854q8754Q6515q8280N8555J61661Q8722n5829
15200B38335r9022j8153K5022j2442P0750j68727o5407j1164N2017J13360N5870
15189A80439R3302o728j3428k0430J48801j57232j83915J08684L1023j5685M7461
15178B12292O2747L7850m8574l938l5984o8121M1789R8373m3534J24653J10286
15167D87839j84005r7949J6728j66100j4680J71750n0490j00822o5594J704N2651
$$ plain form
15156 51032 139785 166215 206725 384436 412023 409957 406128 276577 289746 483037 655290
15145 655290 577155 635294 640609 422330 300225 310604 248888 230631 164620 203975 319603
15134 319603 229325 290994 327341 332214 458229 431174 298914 341308 299043 200530 259922
15123 259922 195381 194219 284681 196934 145610 152212 144325 289055 462564 475995 373166
15112 373166 141982 74723 134427 238620 334533 362321 452388 497254 456053 464340 392300
15101 392300 437693 339195 350016 444936 359848 311134 448117 452174 333002 227170 200397
15090 200397 371257 487915 495517 416281 340037 289601 236898 263084 423821 409704 189142
15079 189142 235530 411803 485774 628315 562561 408136 380798 471973 508079 540698 687223
$$ packed form
15156E1032Q8753K6430M0510J77711K7587k066l829j29551J3169J93291J72253
15145F55290p8135N8139N315k18279j22105J0379o1716j8257o6011L9355J15628
15134C19603r0278O1669L6347M873J26015k7055j32260M2394m2265r8513N9392
15123B59922o4541j162R0462q7747n1324O602p887J44730J73509J3431j02829
15112C73166k31184o7259N9704J04193R5913K7788R0067M4866m1201Q287p2040
15101C92300M5393r8498J0821R4920q5088m8714J36983M057j19172j05832k6773
15090B00397J70860J16658P602p9236p6244n0436n2703K6186J60737j4117k20562
15079A89142M6388J76273P3971J42541o5754j54425k7338R1175L6106L2619J46525
$$ plain form
15068 687223 681414 354086 63084 154304 307865 342831 275342 205935 238498 249511 182618
15057 182618 196101 316683 309262 270524 328878 298192 207338 157405 199071 345985 507876
15046 507876 490576 528191 410910 252757 218907 314767 361541 294956 384863 524323 564792
15035 564792 598620 515177 548606 638009 402548 230212 200581 289807 381141 496673 524109
15024 524109 450796 388033 349043 347480 194426 199302 85760 209376 381326 383692 226974
15013 226974 277331 443809 465015 421182 346818 335616 371440 343727 294743 223293 301081
15002 301081 265196 272974 281962 311121 457828 622466 512336 367033 366039 463449 523995
14991 523995 508808 459163 308124 191630 185196 275631 291721 198776 142152 310666 438581
$$ packed form
15068F87223n809l27328k91002R1220J53561L4966o7489o9407L2563J1013o6893
15057A82618J3483J20582p421l8738N8354l0686r0854m9933M1666J46914J61891
15046E07876j7300L7615j17281j58153l3850R5860M6774o6585Q9907J39460M0469
15035E64792L3828q3443L3429Q9403k35461j72336k9631Q9226R1334J15532K7436
15024E24109p3313o2763l8990j563j53054M876j13542J23616J71950K366j56718
15013B26974N0357J66478K1206m3833p4364j1202L5824k7713m8984p1450P7788
15002C01081l5885P778Q988K9159J46707J64638j10130j45303r94R7410O0546
14991E23995j5187m9645j51039j16494o434R0435J6090r2945n6624J68514J27915
$$ plain form
14980 438581 454942 525655 503371 388391 409227 493775 644077 758537 709492 512397 408144
14969 408144 254590 337049 615620 662549 717286 810331 702446 549817 360463 443039
14959 443039 555771 611787 607572 449867 485517 357442 245086 306491 321113 292482 315957
14948 315957 162552 217052 222889 277334 465306 487681 456191 476410 384369 407382 490847
14937 490847 418427 408869 451961 319683 219884 211846 337435 355200 450260 319763 334537
14926 334537 229039 406751 599468 565344 379255 360507 474263 588440 528068 370236
14916 370236 311255 407336 433506 384861 326276 462303 430819 446036 309403 346314 529337
14905 529337 492259 420949 553134 583491 502363 520769 527483 538490 561265 560165 591771 755703
$$ packed form
14980D38581J6361P0713k2284j14980K0836Q4548J50302J14460m9045j97095j04253
14969D08144j53554Q2459K78571M6929N4737R3045j07885j52629j89354Q2576
14959D43039J12732N6016m215j57705L5650j28075j12356O1405J4622k8631K3475
14948C15957j53405N4500N837N4445J87972K2375l1490K0219r2041K3013Q3465
14937D90847p2420r558M3092j32278r9799q038J25589J7765R5060j30497J4774
14926C34537j05498J77712J92717l4124j86089j8748J13756J14177o0372j57832
14916C70236n8981R6081K6170m8645n8585J36027l1484J5217j36633L6911J83023
14905E29337l7078p1310J32185L0357q1128J8406O714J1007K2775j100L1606J63932
$$ plain form
14893 755703 721148 527680 535838 553512 576341 607377 388239 149866 343422 498978 585224
14882 585224 604028 587807 510383 713499 831282 590199 512423 532358 755804 704667 495168
14871 495168 477651 430162 378623 325228 436958 629466 713747 604223 668000 499035 285341
14860 285341 270013 343827 452687 484435 494065 530509 564332 558611 404287 400761 478532 519573
14848 519573 359212 425856 538703 351787 230162 228742 412889 380174 480755 606733
14838 606733 545216 504087 579231 669609 755961 763462 768414 803495 738395 771620 482892 93099
14826 93099 37200 203773 322633 323747 390756 473741 541058 509299 681520 809596 655622
14815 655622 530787 427005 520143 410262 331160 266229 193301 194783 246653 328506 418700
$$ packed form
14893G55703l4555j93468Q158J7674K2829L1036k19138k38373J93556J55556Q6246
14882E85224J8804j6221p7424K03116J17783k41083p7776J9935K23446n1137k09499
14871D95168j7517m7489n1539n3395J11730J92508Q4281j09524O3777j68965k13694
14860B85341j5328P3814J08860L1748R630L6444L3823n721j54324l526P7771M1041
14848E19573j60361O6644J12847j86916j21625j420J84147l2715J00581J25978
14838F06733o1517m1129P5144R0378Q6352P501M952L5081o5100L3225k88728l89793
14826I3099n5899J66573J18860J114O7009Q2985O7317l1759J72221J28076j53974
14815F55622j24835j03782R3138j09881p9102o4931p2928J482N1870Q1853R0194
$$ plain form
14804 418700 509723 724777 722037 787598 703460 693679 647576 451568 397542 565862 632356
14793 632356 618672 646726 631601 729935 808162 722017 633844 541551 386823 452131 482226
14782 482226 568008 608217 478242 464848 484915 523655 420466 333758 402849 547614 506004
14771 506004 535575 450731 323588 358349 484035 621290 508585 479284 575030 686693
14761 686693 713482 677289 566097 625658 632487 598156 612120 787098 666127 425241 239139
14750 239139 316211 548597 511141 548108 449145 484978 618101 669245 712034 608574 522263
14739 522263 581409 467552 482167 668216 784373 710074 725868 669419 562289 593524 685883
14728 685883 662049 517303 515173 577402 666300 762961 677491 545536 514298 474396 532276
$$ packed form
14804D18700R1023K15054k740O5561q4138r781m6103j96008n4026J68320O6494
14793F32356j3684K8054j5125R8334P8227q6145q8173r2293j54728O5308L0095
14782D82226Q5782M0209j29975j3394K0067L8740j03189q6708O9091J44765m1610
14771E06004K9571q4844j27143L4761J25686J37255j12705k9301R5746J11663
14761F86693K6789l6193j11192N9561O829l4331J3964J74978j20971k40886j86102
14750B39139P7072K32386l7456L6967r8963L5833J33123N1144M2789j03460q6311
14739E22263N9146j13857J4615J86049J16157p4299J5794n6449j07130L1235R2359
14728F85883k3834j44746k130O2229Q8898R6661q5470j31955l1238l9902N7880
$$ plain form
14717 532276 561699 596494 616206 482760 531126 429982 215013 306099 430992 497093 560832
14706 560832 650706 572642 499770 439434 554285 537481 370327 261871 316637 405430 482649
14695 482649 641711 574714 629037 743772 713861 582820 654111 796358 804368 732639 800258
14684 800258 798678 752775 656892 597269 606302 631269 575448 559392 495174 408860 453576 434406
14672 434406 556993 736758 904311 986136 1013645 845494 790965 801580 726429 720637 586201
14661 586201 506804 565134 659114 735306 767869 702331 777474 754610 750519 725723 720836 724342
14649 724342 685193 625127 640545 743464 906099 784692 676869 722429 656848 789741
14639 789741 943960 860248 883597 913744 966616 984275 1105856 1011416 988931 921400 769488
$$ packed form
14717E32276K9423L4795J9712j33446M8366j01144k14969R1086J24893O6101O3739
14706E60832Q9874p8064p2872o0336J14851j6804j67154j08456N4766Q8793P7219
14695D82649J59062o6997N4323J14735k9911j31041P1291J42247Q010p1729O7619
14684H00258j580m5903r5883n9623R033K4967n5821j6056o4218q6314M4716j9170
14672D34406J22587J79765J67553Q1825K7509j68151n4529J0615p5151n792j34436
14661E86201p9397N8330R3980P6192L2563o5538P5143k2864m091k4796m887L506
14649G24342l9149o0066J5418J02919J62635j21407j07823M5560o5581J32893
14639G89741J54219q3712K3349L0147N2872J7659J21581r4440k2485o7531j51912
$$ plain form
14628 769488 774504 869571 941404 817795 789709 864865 708532 540346 467050 474616 600895
14617 600895 721729 667538 837665 968678 916152 942740 1016291 888097 859660 995233
14607 995233 1018385 902129 829316 757330 901241 949508 908584 814270 692853 728786 798805
14596 798805 913931 779490 764337 824961 755613 805762 791720 840739 811791 790556 748051
14585 748051 747533 870608 832691 741588 691602 526933 626391 707093 731071 844264 1010446
14574 1010446 1089228 810876 706279 737659 842527 966408 999347 1081481 1220018 1476803
14564 1476803 1380069 1084294 1084603 1036521 953509 847688 899126 1065050 916659 912444 914437
14553 914437 866867 943990 1081411 904478 867966 928792 990178 987126 887556 883766 979818
$$ packed form
14628G69488N016R5067P1833j23609k8086P5156j56333j68186p3296P566J26279
14617F00895J20834n4191J70127J31013n2526K6588P3551j28194k8437J35573
14607I95233K3152j16256p2813p1986J43911M8267m0924r4314j21417L5933P0019
14596G98805J15126j34441j5153O0624o9348N0149j4042M9019k8948k1235m2505
14585G48051n18J23075l7917r1103m9986j64669R9458Q0702K3978J13193J66182
14574A010446P8782k78352j04597L1380J04868J23881L2939Q2134J38537K56785
14564A476803r6734k95775L09m8082q3012j05821N1438J65924j48391m215J993
14553I14437m7570P7123J37421j76933l6512O0826O1386l052r9570l790R6052
$$ plain form
14542 979818 1074379 1145545 1037764 908519 859399 990515 925371 954080 1056714 1108269 1050667
14531 1050667 963038 996084 1061704 1045193 1029320 955885 866581 986393 1002829 889132 1037942
14520 1037942 1100690 1279561 1250286 1149463 1113281 1092288 1022356 995262 905851 933391 727322
14509 727322 751148 921685 1060963 1129103 1091757 1099206 1087322 1141199 966045 894066 849095
14498 849095 921193 1029417 1006342 915382 799015 905405 1013838 1029264 1083403 1126250 1203861
14487 1203861 1210365 1201116 1085986 1011059 1028254 1183058 1255975 1326313 1097277 1052933 1184257
14476 1184257 1318599 1279734 1307786 1263030 1233893 1038101 1046086 1178476 1298639 1219215 1204438
14465 1204438 1001505 1016410 1112629 1159998 1192199 1154947 1039190 1091260 1153487 1106804 1133071
$$ packed form
14542I79818R4561P1166j07781j29245m9120J31116o5144K8709J02634N1555n7602
14531A050667q7629L3046O5620j6511j5873p3435q9304J19812J6436j13697J48810
14520A037942O2748J78871k9275j00823l6182k0993o9932k7094q9411K7540k06069
14509G27322K3826J70537J39278O8140l7346P449j1884N3877j75154p1979m4971
14498H49095P2098J08224k3075r0960j16367J06390J08433J5426N4139M2847P7611
14487A203861O504r249j15130p4927J7195J54804P2917P0338k29036m4344J31324
14476A184257J34342l8865K8052m4756k9137j95792P985J32390J20163p9424j4777
14465A204438k02933J4905R6219M7369L2201l7252j15757N2070O2227m6683K6267
$$ plain form
14454 1133071 1136551 1234728 1253745 1387417 1550613 1506256 1398875 1337357 1333919 1316624 1258404
14443 1258404 1321245 1249336 1175272 1102139 1118171 1277199 1383435 1452850 1433987 1424750 1119250
14432 1119250 1015830 1164216 1221170 1265542 1221439 1212097 1205119 1052880 1159021 1305311 1467471
14421 1467471 1479518 1494178 1602931 1589900 1610403 1576959 1345479 1263790 1361073 1569909 1488187
14410 1488187 1582440 1558521 1452615 1567088 1438298 1424191 1466833 1433819 1537603 1699262
14400 1699262 1639280 1490875 1374581 1358566 1301273 1338715 1461335 1430502 1418929 1473084 1546836
14389 1546836 1431227 1522758 1597637 1684083 1729503 1588241 1530157 1501587 1473520 1604156 1502319
14378 1502319 1401181 1379161 1231104 1356276 1359571 1434691 1508782 1661682 1732376 1777721 1689434
$$ packed form
14454A133071L480R8177J9017J33672J63196m4357j07381o1518l438j7295n8220
14443A258404O2841p1909p4064p3133J6032J59028J06236O9415j8863r237l05500
14432A119250j03420J48386N6954M4372m4103r342o978j52239J06141J46290J62160
14421A467471J2047J4660J08753j3031K0503l3444k31480q1689R7283K08836q1722
14410A488187R4253k3919j05906J14473j28790j4107M2642l3014J03784J61659
14400A699262n9982j48405j16294j6015n7293L7442J22620l0833j1573N4155P3752
14389A546836j15609R1531P4879Q6446M5420j41262n8084k8570k8067J30636j01837
14378A502319j01138k2020j48057J25172L295P5120P4091J52900P0694M5345q8287
$$ plain form
14367 1689434 1722132 1858981 1947684 2055088 2037198 1929353 1814565 1601338 1565215 1572217
14357 1572217 1602247 1707503 1599421 1629148 1563902 1435363 1439756 1421384 1466025 1584811 1628195
14346 1628195 1590992 1632091 1752673 1987373 1913067 2020770 1923844 1804220 1774682 1785326
14336 1785326 1677563 1714444 1819048 1929578 1925337 2064056 2104541 2030380 2010774 2094825 2076451
14325 2076451 2060095 2189065 2355301 2408789 2279664 2210239 2178713 2151524 2275402 2306976
14315 2306976 2333165 2420747 2457628 2223660 2268045 2262926 2194559 2115917 1981937 1980442 2140088
14304 2140088 2407902 2323563 2296615 2330115 2355682 2274611 2192499 2141625 2183408 2279276 2234583
14293 2234583 2169012 2290545 2507389 2354412 2200149 2258335 2310306 2394956 2465584 2486344
$$ packed form
14367A689434L2698J36849Q8703J07404j7890j07845j14788k13227l6123P002
14357A572217L0030J05256j08082K9727o5246j28539M393j8372M4641J18786M3384
14346A628195l7203M1099J20582K34700p4306J07703r6926j19624k9538J0644
14336A785326j07763L6881J04604J10530m241J38719M0485p4161j9606Q4051j8374
14325B076451j6356J28970J66236N3488j29125o9425l1526k7189J23878L1574
14315B306976K6189Q7582L6881k33968M4385n119o8367p8642j33980j495J59646
14304B140088K67814q4339k6948L3500K5567q1071q2112n0874M1783R5868m4693
14293B234583o5571J21533K16844j52977j54263N8186N1971Q4650P0628K0760
$$ plain form
14283 2486344 2409459 2239426 2183352 2197396 2317328 2356721 2375307 2402035 2549253 2656434
14273 2656434 2550107 2526692 2623254 2564472 2499168 2483904 2762563 2891998 2770850 2533161
14263 2533161 2570579 2629948 2722384 2712860 2734806 2780305 2743007 2807263 2927182 2883381 2714200
14252 2714200 2673121 2811552 2742410 2784077 2766607 2712627 2780804 2712576 2526566 2694375 2912012
14241 2912012 3078468 2869404 2675085 2911587 3048228 3039165 3066134 3116977 3344474 3454068
14231 3454068 3406243 3317095 3116381 2918504 2836935 2915080 3008465 3055276 3063266 3079577 3118367
14220 3118367 3011479 2986358 3199035 3269588 3320860 3403989 3459509 3331331 3219721 3184719
14210 3184719 3318910 3320422 3300122 3393176 3319953 3372409 3337208 3403136 3384596 3372453 3302080
$$ packed form
14283B486344p6885j70033n6074J4044J19932L9393J8586K6728J47218J07181
14273B656434j06327k3415R6562n8782o5304j5264K78659J29435j21148k37689
14263B533161L7418N9369R2436r524K1946M5499l7298O4256J19919m3801j69181
14252B714200m1079J38431o9142M1667j7470n3980O8177o8228j86010J67809K17637
14241B912012J66456k09064j94319K36502J36641r063K6969N0843K27497J09594
14231C454068m7825q9148k00714j97877q1569P8145R3385M6811P990J6311L8790
14220C118367j06888k5121K12677P0553N1272Q3129N5520j28178j11610l5002
14210C184719J34191J512k0300R3054p3223N2456l5201O5928j8540j2143p0373
$$ plain form
14199 3302080 3230760 3069439 3207159 3331899 3293655 3259070 3145465 3196989 3406204 3471972
14189 3471972 3509274 3480961 3479949 3614569 3781297 3796950 3834068 3846915 3733249 3644878 3618267
14178 3618267 3565042 3695131 3960798 3979142 3921645 3954378 4105341 4343979 4241896 3986793
14168 3986793 3931736 4071353 4148779 4236302 4267914 4307884 4276344 4258589 4212467 4166729 4105742
14157 4105742 4173164 4310609 4258522 4342804 4360877 4400870 4489788 4490906 4441874 4391652 4417500
14146 4417500 4420973 4529637 4508974 4565654 4492024 4519523 4645145 4795394 4909755 4905673 4937806
14135 4937806 4985855 5042757 5044938 5013079 4925461 5035712 5202977 5082436 5075837 5305202 5518683
14124 5518683 5518304 5227828 5122282 5295073 5351564 5486703 5484737 5399017 5459250 5366992 5462339
$$ packed form
14199C302080p1320j61321J37720J24740l8244l4585j13605N1524K09215O5768
14189C471972L7302k8313j012J34620J66728J5653L7118J2847j13666q8371k6611
14178C618267n3225J30089K65667J8344n7497L2733J50963K38638j02083k55103
14168C986793n5057J39617P7426Q7523L1612L9970l1540j7755m6122m5738o0987
14157D105742O7422J37445n2087Q4282J8073L9993Q8918J118m9032n0222K5848
14146D417500L473J08664k0663N6680p3630K7499J25622J50249J14361m082L2133
14135D937806M8049N6902K181l1859q7618J10251J67265j20541o599K29365K13481
14124E518683l79k90476j05546J72791N6491J35139j966q5720O0233r2258R5347
$$ plain form
14113 5462339 5638821 5740698 5603670 5676061 5772626 5920714 5841204 5869104 6092557 6132600
14103 6132600 5836621 5783949 5890132 5980905 6013032 6318602 6493936 6473947 6506399 6693818
14093 6693818 6954036 7235072 7512973 7822100 7970976 8180866 8459924 8514346 8226262 8172678
14083 8172678 8190800 8163204 8034851 7888478 7760583 7706934 7764151 7965680 7964859 7845570 7788050
14072 7788050 7832973 7902273 7766993 7686585 7658131 7544838 7661655 7709252 7762865 7854342 7901883
14061 7901883 8033900 7844191 7898147 7950357 7786247 7706376 7822069 7940656 8065994 8146270
14051 8146270 8390322 8498390 8723909 8661033 8671106 8870627 8913280 8848371 8764355 8795019
14041 8795019 8898157 9058747 9342912 9390351 9221727 9215359 9253640 9304434 9549817 9545599 9522164
$$ packed form
14113E462339J76482J01877j37028P2391R6565J48088p9510K7900K23453M0043
14103F132600k95979n2672J06183R0773L2127L05570J75334j9989L2452J87419
14093F693818K60218K81036K77901L09127J48876K09890K79058N4422k88084n3584
14083H172678J8122k7596j28353j46373j27895n3649N7217K01529q21j19289n7520
14072G788050M4923O9300j35280q0408k8454j13293J16817M7597N3613R1477M7541
14061G901883J32017j89709N3956N2210j64110p9871J15693J18587J25338Q0276
14051H146270K44052J08068K25519o2876J0073J99521M2653o4909q4016L0664
14041H795019J03138J60590K84165M7439j68624o368L8281N0794K45383m218k3435
$$ plain form
14030 9522164 9583791 9679483 9749682 9838369 9739417 9708930 9792512 9946726 10163102 10456032 10520199
14019 10520199 10609964 10738516 10752571 10877752 10963775 11070407 11160505 11291899 11394570 11558638
14009 11558638 11548801 11512538 11767553 12002278 12072083 12127978 12060033 12164761 12460322 12590369
13999 12590369 12699016 12857663 13077929 13078054 13159024 13362189 13549328 13524578 13581256 13764353
13989 13764353 13772646 13863384 13977784 14203727 14463980 14691540 14731629 14700032 14899926 15088154
13979 15088154 15241665 15399970 15626514 15838619 15966987 16057205 16099246 16371498 16606031 16822632
13969 16822632 16948233 17182935 17482334 17612025 17683896 17959054 18189523 18450494 18533132 18526358
13959 18526358 18807114 19056718 19264081 19488149 19655219 19848574 20151454 20391087 20698429
$$ packed form
14030I522164O1627R5692P0199Q8687r8952l0487Q3582J54214K16376K92930O4167
14019A0520199Q9765J28552J4055J25181Q6023J06632R0098J31394J02671J64068
14009A1558638r837l6263K55015K34725O9805N5895o7945J04728K95561J30047
13999A2590369J08647J58647K20266J25Q0970K03165J87139k4750N6678J83097
13989A3764353Q293R0738J14400K25943K60253K27560M0089l1597J99894J88228
13979A5088154J53511J58305K26544K12105J28368R0218M2041K72252K34533K16601
13969A6822632J25601K34702K99399J29691P1871K75158K30469K60971Q2638o774
13959A8526358K80756K49604K07363K24068J67070J93355L02880K39633L07342
$$ plain form
13950 20698429 20977773 21222659 21254237 21601778 21943953 22200660 22531052 22777844 22902623
13941 22902623 23204671 23588210 24032066 24474266 24634499 24815289 25082252 25465602 25772970
13932 25772970 25904060 26368395 26811345 27082881 27498656 27793491 28023116 28581552 29184738
13923 29184738 29520344 29779449 30204908 30809334 31253425 31704631 32174276 32453138 32695518
13914 32695518 33198600 33707012 34209268 34667042 35183072 35725824 36328196 36775761 37114821
13905 37114821 37739538 38452981 39167131 39727320 40176550 40772914 41575684 42331719 42803323
13896 42803323 43297961 43969153 44685590 45527111 46292015 47275401 48114390 48827590 49534762
13887 49534762 50261589 51006942 51942670 53009006 53892816 54655242 55487003 56537660 57362178
$$ packed form
13950B0698429K79344K44886L1578L47541L42175K56707L30392K46792J24779
13941B2902623L02048L83539M43856M42200J60233J80790K66963L83350L07368
13932B5772970J31090M64335M42950K71536M15775K94835K29625N58436O03186
13923B9184738L35606K59105M25459O04426M44091M51206M69645K78862K42380
13914C2695518N03082N08412N02256M57774N16030N42752O02372M47565L39060
13905C7114821O24717P13443P14150N60189M49230N96364Q02770P56035M71604
13896D2803323M94638O71192P16437Q41521P64904R83386Q38989P13200P07172
13887D9534762P26827P45353R35728J066336Q83810P62426Q31761J050657Q24518
$$ plain form
13878 57362178 58303965 59388992 60342574 61458466 62457271 63615681 64688055 65644233 66781469
13869 66781469 67754774 68798199 70007441 71021269 72214119 73479240 74715883 75984484
13861 75984484 77283720 78632965 80040621 81491113 82895636 84280044 85510201 86810422
13853 86810422 88016044 89621646 91189017 92716982 94292197 95720750 97196922 98719951
13845 98719951 100026573 101400037 102819657 104428374 105893082 107196011 108517131 109997806
13837 109997806 111527711 112936826 114347668 115591697 116823364 118154854 119384908 120681931
13829 120681931 121815976 122830235 123884205 124885061 125842710 126624818 127363375 128152003
13821 128152003 129017785 129719032 130224371 130776991 131345411 131848055 132356179 132471857 132664926
$$ packed form
13878E7362178R41787J085027R53582J115892R98805J158410J072374R56178J137236
13869F6781469R73305J043425J209242J013828J192850J265121J236643J268601
13861G5984484J299236J349245J407656J450492J404523J384408J230157J300221
13853H6810422J205622J605602J567371J527965J575215J428553J476172J523029
13845I8719951J306622J373464J419620J608717J464708J302929J321120J480675
13837A09997806J529905J409115J410842J244029J231667J331490J230054J297023
13829A20681931J134045J014259J053970J000856R57649P82108P38557P88628
13821A28152003Q65782P01247N05339N52620N68420N02644N08124J15678J93069
$$ plain form
13812 132664926 132709450 132635006 132490629 132347077 132098999 131757117 131448578 130942122 130313542
13803 130313542 129572059 128832068 128228810 127559096 126744976 125838889 124863914 123731543 122601437
13794 122601437 121242210 120001093 118816221 117563412 116414641 115081245 113657133 112211105
13786 112211105 110842886 109526939 108188435 106723841 105188287 103571182 101999175 100407952
13778 100407952 98872914 97437132 96000095 94658050 93098192 91582831 90184909 88749531
13770 88749531 87368064 86030332 84533485 82903268 81341482 79940645 78629548 77313337
13762 77313337 75899641 74461640 73260278 72127012 70938705 69587988 68202326 67082564
13754 67082564 65892389 64772759 63797897 62635545 61415699 60176256 59202296 58273447
$$ packed form
13812A32664926M4524p4444j44377j43552k48078l41882l08539n06456o28580
13803A30313542p41483p39991o03258o69714q14120r06087r74975j132371j130106
13794A22601437j359227j241117j184872j252809j148771j333396j424112j446028
13786A12211105j368219j315947j338504j464594j535554j617105j572007j591223
13778A00407952j535038j435782j437037j342045j559858j515361j397922j435378
13770H8749531j381467j337732j496847j630217j561786j400837j311097j316211
13762G7313337j413696j438001j201362j133266j188307j350717j385662j119762
13754F7082564j190175j119630r74862j162352j219846j239443r73960r28849
$$ plain form
13746 58273447 57341283 56343050 55365897 54452439 53639185 52836914 51984741 51075062 50189321
13737 50189321 49408223 48509564 47635445 46784674 45949594 45092046 44299329 43614085 43022215
13728 43022215 42185643 41377015 40719016 39857563 39075155 38508116 37893898 37348922 36734574
13719 36734574 36165051 35708649 35231126 34718458 34032105 33252481 32762301 32408463 32054714
13710 32054714 31476294 30862393 30534751 30127447 29582826 29112578 28557908 28157658 27870999
13701 27870999 27655030 27406194 27025563 26644215 26332501 25865974 25240129 24840917 24676358
13692 24676358 24444051 24068055 23727296 23314641 22995822 22719343 22503190 22215291 21783669
13683 21783669 21408121 21109294 20796449 20475543 20204795 19799549 19613813 19513237 19324326
$$ packed form
13746E8273447r32164r98233r77153r13458q13254q02271q52173r09679q85741
13737E0189321p81098q98659q74119q50771q35080q57548p92717o85244n91870
13728D3022215q36572q08628o57999q61453p82408n67039o14218n44976o14348
13719C6734574n69523m56402m77523n12668o86353p79624m90180l53838l53749
13710C2054714n78420o13901l27642m07304n44621m70248n54670m00250k86659
13701B7870999k15969k48836l80631l81348l11714m66527o25845l99212j64559
13692B4676358k32307l75996l40759m12655l18819k76479k16153k87899m31622
13683B1783669l75548k98827l12845l20906k70748m05246j85736j00576j88911
$$ plain form
13674 19324326 19259093 19094159 18787973 18480513 18249206 18060511 17906528 17632962 17181384
13665 17181384 16873874 16696961 16508679 16259178 16170123 16111331 15995759 15754444 15567405 15349299
13655 15349299 15113681 14981125 14847388 14760115 14573692 14246407 14016213 13894054 13725622
13646 13725622 13528338 13424529 13291631 13205762 13003870 12905087 12885904 12882105 12672389 12491245
13636 12491245 12395108 12391925 12144237 11939507 11834554 11679671 11485079 11248914 11254819 11249145
13626 11249145 11088581 10928307 10836959 10832793 10721542 10498772 10423890 10344928 10171059 10040587
13616 10040587 10071874 9951774 9864175 9698685 9348324 9227568 9234137 9243373 9054845 8997836
13606 8997836 9125949 9201748 9039313 9002634 9108154 9139390 8863216 8623619 8662217 8572972
$$ packed form
13674A9324326o5233j64934l06186l07460k31307j88695j53983k73566m51578
13665A7181384l07510j76913j88282k49501q9055n8792j15572k41315j87039k18106
13655A5349299k35618j32556j33737q7273j86423l27285k30194j22159j68432
13646A3725622j97284j03809j32898q5869k01892r8783j9183l799k09716j81144
13636A2491245r6137l183k47688k04730j04953j54883j94592k36165N905n674
13626A1249145j60564j60274r1348m166j11251k22770p4882p8962j73869j30472
13616A0040587L1287j20100q7599j65490l50361j20756O569R236j88528n7009
13606H997836J28113P5799j62435l6679J05520L1236k76174k39597L8598q9245
$$ plain form
13596 8572972 8489453 8453071 8292711 8259804 8156245 8148806 8145181 7951636 7948257 7841141 7849403
13585 7849403 7895775 7623939 7559739 7576663 7510758 7506284 7409426 7292467 7383549 7320957 7208062
13574 7208062 6990846 6742918 6771456 6760489 6675182 6620228 6615532 6593344 6522003 6398649 6295111
13563 6295111 6385368 6385377 6530248 6493126 6362927 6234046 6131581 6244742 6255588 6165993 6125825
13552 6125825 5945060 5908217 5957338 5953677 5891892 5904119 5995744 5940402 5943792 5988832 6082404
13541 6082404 6198367 6482757 6849122 7090827 7045431 6910590 6899682 6748693 6534341 6345229
13531 6345229 6081996 5849808 5558225 5485294 5414863 5393855 5419974 5498422 5332183 5116889
13521 5116889 4963756 4965891 4942787 4834344 4767859 4783975 4700311 4586544 4538697 4548039 4403032
$$ packed form
13596H572972q3519l6382j60360l2907j03559p439l625j93545l379j07116Q262
13585G849403M6372k71836o4200J6924o5905m474r6858j16959R1082o2592j12895
13574G208062k17216k47928K8538j0967q5307n4954m696k2188p1341j23354j03538
13563F295111R0257RJ44871l7122j30199j28881j02465J13161J0846q9595m0168
13552F125825j80765l6843M9121l661o1785J2227R1625n5342L390M5040R3572
13541F082404J15963K84390L66365K41705m5396j34841j0908j50989k14352j89112
13531F345229k63233k32188k91583p2931p0431k1008K6119P8448j66239k15294
13521E116889j53133K135k3104j08443o6485J6116q3664j13767m7847R342j45007
$$ plain form
13510 4403032 4430123 4515045 4511941 4497146 4421658 4220426 4136966 4109536 4132547 4236582 4208261
13499 4208261 4107172 3957414 4021489 3923222 4006817 4056235 3953458 3972789 4055336 4034909 3962758
13488 3962758 4010908 3910868 3880011 3916221 3977500 3891837 3658793 3653129 3635421 3534817 3436170
13477 3436170 3351239 3219783 3183885 3162173 2911059 2842446 2737158 2881691 3001699 3005061
13467 3005061 3043050 3218922 3280190 3348371 3428460 3317480 3340141 3240415 3322229 3358678 3400059
13456 3400059 3242644 3179566 3201867 3246106 3151453 2950384 2928180 2941166 3053324 2931849
13446 2931849 2818288 2806914 2808748 2847783 2896836 2801150 2843271 2939638 3029727 3049056 2873618
13435 2873618 2729242 2599128 2429256 2515954 2475009 2547798 2585877 2538628 2544523 2661816 2658943
$$ packed form
13510D403032K7091Q4922l104j4795p5488k01232q3460k7430K3011J04035k8321
13499D208261j01089j49758O4075r8267Q3595M9418j02777J9331Q2547k0427p2151
13488C962758M8150j00040l0857L6210O1279q5663k33044n664j7708j00604r8647
13477C436170q4931j31456l5898k1712k51114o8613j05288J44533J20008L362
13467C005061L7989J75872O1268O8181Q0089j10980K2661r9726Q1814L6449M1381
13456C400059j57415o3078K2301M4239r4653k01069k2204J2986J12158j21475
13446B931849j13561j1374J834L9035M9053r5686M2121R6367R0089J9329j75438
13435B873618j44376j30114j69872Q6698m0945P2789L8079m7249N895J17293k873
$$ plain form
13424 2658943 2721623 2695564 2463526 2395686 2516335 2482896 2346562 2349210 2402736 2531918 2502795
13413 2502795 2488206 2358817 2160337 2064425 2022713 2188272 2088631 2010227 2153379 2195119
13403 2195119 2218501 2207705 2015405 2078933 2117952 2048603 2046698 2151971 1964841 2123281 2171716
13392 2171716 2144343 2222203 2389413 2460552 2461825 2470056 2325535 2248849 2229003 2083181 1937005
13381 1937005 2000695 2248712 2301071 2257125 2322295 2340682 2210031 2053409 2082898 2119349 1950789
13370 1950789 2038907 2064935 2031354 1978615 2039028 1810913 1806580 1887163 1803663 1826445 1890852
13359 1890852 1755725 1780777 1859922 1802306 1784512 1605856 1514279 1504876 1534103 1454696 1606111
13348 1606111 1789372 1848451 1858259 1918094 1602026 1451067 1485756 1632342 1794530 1832408
$$ packed form
13424B658943O2680k6059k32038o7840J20649l3439j36334K648N3526J29182k9123
13413B502795j4589j29389j98480r5912m1712J65559r9641p8404J43152M1740
13403B195119K3382j0796j92300O3528L9019o9349j905J05273j87130J58440M8435
13392B171716k7373P7860J67210P1139J273Q231j44521p6686j9846j45822j46176
13381A937005O3690K48017N2359m3946O5170J8387j30651j56622K9489L6451j68560
13370A950789Q8118K6028l3581n2739O0413k28115m333Q0583q3500K2782O4407
13359A890852j35127K5052P9145n7616j7794j78656r1577r403K9227p9407J51415
13348A606111J83261N9079R808N9835l16068j50959L4689J46586J62188L7878
$$ plain form
13338 1832408 1855958 1818440 1735669 1745589 1819539 1842244 1832790 1794632 1657360 1484207 1354573
13327 1354573 1350200 1449274 1554549 1457839 1370669 1423051 1495455 1471364 1579394 1479434 1388765
13316 1388765 1569468 1693427 1724240 1485350 1448854 1462326 1620676 1539973 1415168 1507931
13306 1507931 1520361 1491538 1572896 1697944 1756997 1526322 1424553 1435751 1579301 1556194
13296 1556194 1370766 1218751 1296907 1293601 1198639 1221198 1305363 1377101 1365051 1378709 1478376
13285 1478376 1496973 1494686 1465289 1355242 1370278 1496901 1535786 1561425 1501713 1416861 1336557
13274 1336557 1264508 1314788 1253237 1162252 1155134 1390989 1439328 1326437 1272057 1321889 1411242
13263 1411242 1411161 1267870 1314668 1292358 1275731 1161027 1178090 1311839 1257561 1141198 1183716
$$ packed form
13338A832408K3550l7518q2771R920P3950K2705r454l8158j37272j73153j29634
13327A354573m373R9074J05275r6710q7170N2382P2404k4091J08030r9960r0669
13316A388765J80703J23959L0813k38890l6496J3472J58350q0703j24805R2763
13306A507931J2430k8823Q1358J25048N9053k30675j01769J1198J43550k3107
13296A556194j85428j52015P8156l306r4962K2559Q4165P1738j2050J3658R9667
13285A478376J8597k287k9397j10047J5036J26623L8885K5639n9712q4852q0304
13274A336557p2049N0280o1551r0985p118K35855M8339j12891n4380M9832Q9353
13263A411242q1j43291M6798k2310j6627j14704J7063J33749n4278j16363M2518
$$ plain form
13252 1183716 1183694 1294128 1267881 1273451 1274585 1208265 1271581 1281533 1298567 1292906 1321775 1239126
13240 1239126 1410166 1406729 1364938 1186086 984660 1041602 1188553 1161539 1308594 1409700
13230 1409700 1423518 1360911 1339849 1345928 1243235 1120539 1050863 902766 967454 949782 891999
13219 891999 783393 748833 779757 814426 903844 1017376 836127 659645 721863 902289
13209 902289 819681 688824 594310 701205 699813 567501 499186 567298 806392 826539 897048
13198 897048 950766 981718 890145 846458 768681 921683 1050469 961506 911660 850672 865963
13187 865963 845846 734168 669338 678243 742940 776149 785369 778253 743681 901293 937930 917122
13175 917122 896013 750672 663119 670965 697189 639655 834585 822145 888191 905010 783981
$$ packed form
13252A183716k2J10434k6247N570J134o6320O3316R952J7034n661K8869q2649
13240A239126J71040l437m1791j78852k01426N6942J46951k7014J47055J01106
13230A409700J3818o2607k1062O079j02693j22696o9676j48097O4688j7672n7783
13219H91999j08606l4560L0924L4669Q9418J13532j81249j76482O2218J80426
13209I02289q2608j30857r4514J06895j392j32312o8315O8112K39094K0147P0509
13198H97048N3718L0952r1573m3687p7777J53002J28786q8963m9846o0988J5291
13187H65963k0117j11678o4830Q905O4697L3209R220p116l4572J57612L6637k0808
13175I17122k1109j45341q7553P846K6224n7534J94930j2440O6046J6819j21029
$$ plain form
13164 783981 761836 859165 741995 757409 764817 639341 606355 670861 724836 744845 742131
13153 742131 856424 753959 606393 448809 413630 530893 595746 676717 678698 762331 691574
13142 691574 557332 551985 684066 738251 626227 565752 680093 746769 610268 457018
13132 457018 497135 513177 558484 434174 402544 375890 555050 714008 717807 721541 635983
13121 635983 444838 422382 307566 303642 342339 447552 371758 323810 331474 283754 159834
13110 159834 217568 458659 505906 649388 796003 725306 719523 728599 593212 517072 576710
13099 576710 436464 357725 467897 556326 669208 643401 525211 488257 338434 309282
13089 309282 398097 371608 514684 530241 463356 339847 196513 295498 450517 563304
$$ packed form
13164G83981k2145R7329j17170J5414P408j25476l2986O4506N3975K0009k714
13153G42131J14293j02465j47566j57584l5179J17263O4853Q0971J981Q3633p0757
13142F91574j34242n347J32081N4185j12024o0475J14341O6676j36501j53250
13132D57018M0117J6042M5307j24310l1630k6654J79160J58958L799L734q5558
13121F35983j91145k2456j14816l924L8697J05213p5794m7948P664m7720j23920
13110A59834N7734K41091M7247J43482J46615p0697n783R076j35387p6140N9638
13099E76710j40246p8739J10172Q8429J12882k5807j18190l6954j49823k9152
13089C09282Q8815k6489J43076J5557o6885j23509j43334R8985J55019J12787
$$ plain form
13079 563304 674990 598440 418465 419185 367839 365631 339003 369384 402509 367912 475712
13068 475712 470032 385795 426012 320212 415614 517690 605985 586870 557089 444799 518901
13057 518901 421432 249575 189706 272429 393622 450196 376870 506907 468491 437634 443651
13046 443651 504536 532240 465449 433579 635163 750365 584374 567466 594804 485596 484282
13035 484282 476159 367381 355407 439871 508515 435357 342408 236970 364945 500504 445643
13024 445643 310223 317253 354614 392060 418546 534284 477653 552250 496435 352294 260967
13013 260967 242679 113927 372068 619049 599474 541840 645787 627463 545880 453753 423646
13002 423646 400643 483600 539704 467244 325796 263390 305433 300826 270396 224768 327661
$$ packed form
13079E63304J11686p6550j79975P20n1346k208k6628L0381L3125l4597J07800
13068D75712n680q4237M0217j05800R5402J02076Q8295j9115k9781j12290P4102
13057E18901r7469j71857n9869Q2723J21193N6574p3326J30037l8416l0857O017
13046D43651O0885K7704o6791l1870K01584J15202j65991j6908K7338j09208j314
13035D84282q123j08778j1974Q4464O8644p3158r2949j05438J27975J35559n4861
13024D45643j35420P030L7361L7446K6486J15738n6631P4597n5815j44141r1327
13013B60967j8288j28752K58141K46981j9575n7634J03947j8324q1583r2127l0107
13002D23646k3003Q2957N6104p2460j41448o2406M2043m607l0430m5628J02893
$$ plain form
12991 327661 432652 363320 253451 431121 475263 522523 463193 314591 404956 370324 328736
12980 328736 263084 233778 392615 474833 332212 344476 217474 260099 390096 522720
12970 522720 578800 464503 322157 454620 547498 511328 530809 438554 440019 420331 403381
12959 403381 548027 535480 268261 211729 270773 318676 430503 449171 460558 350169 395992
12948 395992 391897 361862 305566 424346 458236 490287 487448 509531 317943 255853 255660 183499
12936 183499 190958 285823 368437 363748 476806 486503 579639 538278 430988 322678 262326
12925 262326 385414 254890 204325 400853 419629 603884 510849 390172 346989 304683
12915 304683 219340 252001 290329 278801 328927 316699 391388 427719 320145 308941 343661
$$ packed form
12991C27661J04991o9332j09869J77670M4142M7260n9330j48602R0365l4632m1588
12980C28736o5652k9306J58837Q2218j42621J2264j27002M2625J29997J32624
12970E22720N6080j14297j42346J32463R2878l6170J9481r2255J465j9688j6950
12959D03381J44646j2547k67219n6532N9044M7903J11827J8668J1387j10389M5823
12948C95992m095l0035n6296J18780L3890L2051k839K2083j91588o2090j93p2161
12936A83499P459R4865Q2614m689J13058R697R3136m1361j07290j08310o0352
12925B62326J23088j30524n0565J96528J8776J84255r3035j20677m3183m2306
12915C04683q5343L2661L8328j1528N0126j2228P4689L6331j07574j1204L4720
$$ plain form
12904 343661 350916 429341 464365 425746 402361 379409 322002 223167 276948 273854 131593 174700
12892 174700 134050 206297 132808 44877 13601 248228 200521 -83696 -69378 37737 110536
12881 110536 201597 131875 165961 157882 49270 168559 338726 260917 160897 13467 -58339
12870 -58339 -73437 -12190 63595 150999 287596 223353 282781 235151 200083 142675 67497
12859 67497 65698 48838 -43288 -32966 27925 82142 154918 195538 203487 196328 105555 129339
12847 129339 194102 287735 276378 257725 131267 291411 230488 188371 280994 445167 434720
12836 434720 283566 351350 233839 52739 17772 228374 242112 328717 306812 145075
12826 145075 113346 65797 113337 266510 273965 213106 198845 122576 110314 179828 168713
$$ packed form
12904C43661P255P8425L5024l8619k3385k2952n7407r8835N3781l094j42261M3107
12892A74700m0650P2247p3489q7931l1276K34627m7707k84217J4318J07115P2799
12881A10536R1061o9722L4086q079j08612J19289J70167p7809j00020j47430p1806
12870e8339j5098O1247P5785Q7404J36597o4243N9428m7630l5068n7408p5178
12859F7497j799j6860r2126J0322O0891N4217P2776M0620P949p159r0773K3784
12847A29339O4763R3633j1357j8653j26458J60144o0923m2117R2623J64173j0447
12836D34720j51154O7784j17511j81100l4967K10602J3738Q6605k1905j61737
12826A45075l1729m7549M7540J53173P455o0859j4261p6269j2262O9514j1115
$$ plain form
12815 168713 231298 228343 154603 92537 -12518 -288 244813 316223 242016 141293 160603
12804 160603 264169 109186 62650 117084 61641 65021 155122 51959 -21169 -61889 83057
12793 83057 218744 128090 -10534 143980 135128 100969 246848 237166 152778 -5264 -107708
12782 -107708 -55426 23167 9980 185923 275697 266276 215574 240525 200663 164102 114534
12771 114534 28256 53083 -16507 106571 197489 304321 201478 258576 302114 308275 223880
12760 223880 169151 159534 196510 189058 103590 63404 136784 209797 171526 191949 229576 127533
12748 127533 -30769 -155725 7916 131685 277971 313576 403072 519523 363557 244834
12738 244834 16293 -43507 -50093 76279 132496 156455 274359 473562 403012 391749 340683
$$ packed form
12815A68713O2585k955p3740o2066j05055J2230K45101P1410p4207j00723J9310
12804A60603J03566j54983m6536N4434n5443L380R0101j03163p3128m0720J44946
12793H3057J35687r0654j38624J54514q852l4159J45879r682q4388j58042j02444
12782a07708N2282P8593j3187J75943Q9774r421n0702K4951l9862l6561m9568
12771A14534q6278K4827o9590J23078R0918J06832j02843N7098M3538O161q4395
12760B23880n4729r617L6976p452q5468m0186P3380P3013l8271K0423L7627j02043
12748A27533j58302j24956J63641J23769J46286L5605Q9496J16451j55966j18723
12738B44834k28541n9800o586J26372N6217K3959J17904J99203p0550j1263n1066
$$ plain form
12727 340683 239932 220376 266653 11307 63268 158314 369552 558969 488446 380667
12717 380667 209465 137954 110139 1252 -103975 -124142 -188872 -43772 99855 294782
12707 294782 419384 373163 292837 110734 -93878 -148229 -132682 -142708 -183068 -167032 -90339
12696 -90339 50347 183693 213638 173415 107812 118499 157972 79942 74894 134928 156649
12685 156649 168832 245981 212193 -35655 -149758 -199123 -322152 -155210 87991 -132613
12675 -132613 -120138 56224 68482 106217 87516 73372 84221 24637 -1758 -34915 -79432
12664 -79432 34471 199802 263515 103867 -10277 -59645 -128011 -220659 -291582 -213030 5677
12653 5677 77570 177377 143114 40081 -25785 -71745 52657 -8656 -117064 -44059 -32196
$$ packed form
12727C40683j00751j9556M6277k55346N1961R5046K11238J89417p0523j07779
12717C80667j71202p1511k7815j08887j05227k0167o4730J45100J43627J94927
12707B94782J24602m6221q0326j82103k04612n4351J5547j0026m0360J6036P6693
12696i0339J40686J33346K9945m0223o5603J0687L9473p8030n048O0034K1721
12685A56649J2183P7149l3788k47848j14103m9365j23029J66942K43201k20604
12675a32613J2475J76362J2258L7735j8701j4144J0849n9584k6395l3157m4517
12664g9432J13903J65331O3713j59648j14144m9368o8366r2648p0923P8552K18707
12653E677P1893R9807l4263j03033o5866m5960J24402o1313j08408P3005J1863
$$ plain form
12642 -32196 60696 184717 146342 105373 37638 -15464 -139264 -294933 -207831 -365847 -232629
12631 -232629 73167 44934 19542 143156 178844 99087 74446 189369 231524 160577 173739
12620 173739 235151 181630 188047 230282 220618 248372 382624 424956 361640 270187 86166
12609 86166 56893 100405 145374 171524 230902 366438 336109 106951 103193 100773 171815 246870
12597 246870 55723 -64307 -3348 -57538 -20976 -43878 -204420 -161680 -3842 47511 -18789
12586 -18789 55967 44804 150454 229045 149730 181540 36661 -70193 -43227 86580 55796
12575 55796 -65758 -10384 152682 110011 216196 292283 392360 472093 317422 237191 171247
12564 171247 114298 47430 -13376 -60671 64735 -64480 -77030 -33128 -108091 -129741 -26481
$$ packed form
12642c2196R2892J24021l8375m0969o7735n3102j23800j55669Q7102j58016J33218
12631b32629L05796k8233k5392J23614L5688p9757k4641J14923M2155p0947J3162
12620A73739O1412n3521O417M2235r664K7754J34252M2332o3316r1453j84021
12609H6166k9273M3512M4969K6150N9378J35536l0329k29158l758k420P1042P5055
12597B46870j91147j20030O0959n4190L6562k2902j60542M2740J57838N1353o6300
12586a8789P4756j1163J05650P8591p9315L1810j44879j06854K6966J29807l0784
12575E5796j21554N5374J63066m2671J06185P6087J00077P9733j54671q0231o5944
12564A71247n6949o6868o0806m7295J25406j29215j2550M3902p4963k1650J03260
$$ plain form
12553 -26481 8996 135436 172376 -65150 -188756 -221765 -236199 -99345 47396 -6920 -49557
12542 -49557 -80597 13771 46070 34775 55318 -135420 -235378 -173218 29192 302294 252093
12531 252093 204330 119093 73295 58999 55614 60821 125876 44334 26875 19679 47053 83148
12519 83148 24791 13607 81897 91629 64588 117436 145033 175083 51344 -9853 -262200
12508 -262200 -295913 -190406 -189097 -63172 74778 170838 213658 67621 62552 59292 99680
12497 99680 118634 3670 -31518 99575 185479 294027 188765 90202 162670 208424 45322
12486 45322 40402 87519 139116 153023 37481 -92629 -33929 -59447 -76126 145838 282825
12475 282825 323118 207918 110406 112597 101884 -23410 -131725 -91255 -72392 -64744 108538
$$ packed form
12553b6481L5477J26440L6940k37526j23606l3009j4434J36854J46741n4316m2637
12542d9557l1040R4368L2299j1295K0543j90738r9958O2160K02410K73102n0201
12531B52093m7763q5237m5798j4296l385N207O5055q1542j7459p196K7374L6095
12519H3148n8357j1184O8290R732k7041N2848K7597L0050j23739o1197k52347
12508b62200l3713J05507J309J25925J37950R6060M2820j46037n069l260M0388
12497I9680J8954j14964l5188J31093Q5904J08548j05262r8563P2468M5754j63102
12486D5322m920M7117N1597J3907j15542j30110N8700k5518j6679K21964J36987
12475B82825M0293j15200r7512K191j0713j25294j08315M0470J8863P648J73282
$$ plain form
12464 108538 164284 124385 88613 125475 50381 -32038 29079 105547 129564 248337 361178
12453 361178 269573 48923 -2872 1337 109003 125555 23260 30802 -76435 -86199 -10225
12442 -10225 208956 203159 181979 110950 42554 -48878 -112999 -156278 -178991 -84298 27401
12431 27401 -9311 -35769 51077 119219 -77174 -72238 -52103 -24586 16193 -27285 39229 -96145
12419 -96145 -82280 -228553 -177459 -37400 -56348 115305 171249 34109 -2997 151872 72945
12408 72945 -165379 -152628 -89641 -184057 -209619 -143731 -132151 -130887 -105770 4386 50161
12397 50161 54516 -71770 -120682 21884 21753 109450 85084 176069 37694 -80071 -28154
12386 -28154 18618 115484 193126 -45029 -65625 61749 135537 148698 143551 110759 7733
$$ packed form
12464A08538N5746l9899l5772L6862p5094q2419O1117P6468K4017J18773J12841
12453C61178r1605k20650n1795M209J07666J6552j02295P542j07237r764P5974
12442a0225K19181n797k1180p1029o8396r1432o4121m3279k2713R4693J11699
12431B7401l6712k6458Q6846O8142j96393M936K0135K7517M0779m3478O6514j35374
12419i6145J3865j46273N1094J40059j8948J71653N5944j37140l7106J54869p8927
12408G2945k38324J2751O2987r4416k5562O5888J1580J264K5117J10156M5775
12397E0161M355j26286m8912J42566j31Q7697k4366R0985j38375j17765N1917
12386b8154M6772R6866P7642k38155k0596J27374P3788J3161n147l2792j03026
$$ plain form
12375 7733 -32383 -61463 -24366 2517 -16298 -115763 -112891 -64384 63167 29398 52994 22493
12363 22493 101593 187655 117775 24725 -74951 -151861 -116863 -62167 -62074 -56514 -149354 -211806
12351 -211806 -155330 -99428 -114378 -130070 -189555 -109699 54293 6997 20569 78740 80680
12340 80680 143274 194759 93265 75986 144533 66048 93615 90257 3940 -190500 -158756
12329 -158756 -73296 40080 42008 -31916 -38545 5696 12094 118747 60582 3433 98916 249725
12317 249725 173424 81639 28392 19193 -73530 -113267 -231580 -83265 10013 11539 27369
$$ packed form
12375G733m0116k9080L7097K6883j8815r9465K872M8507J27551l3769K3596l0501
12363B2493P9100Q6062o9880r3050r9676p6910L4998N4696R3N560r2840o2452
12351b11806N6476N5902j4950j5692n9485P9856J63992m7296J3572N8171J940
12340H0680O2594N1485j01494j7279O8547p8485K7567l358q6317j94440L1744
12329a58756Q5460J13376J928p3924o629M4241O398J06653n8165n7149R5483J50809
12317B49725p6301r1785n3247r199r2723l9737j18313J48315R3278J526J5830
$$ [...]
##END NTUPLES=NMR SPECTRUM
##END=
