##TITLE=Analysis number 313024
Compound Code btb 07827
Project Code adrs
Chemist Name stores
##JCAMPDX= 6.0         $$ Bruker NMR JCAMP-DX V2.0
##DATA TYPE= NMR SPECTRUM
##DATA CLASS= NTUPLES
##ORIGIN= Bruker BioSpin GmbH
##OWNER= NMR
$$ XWIN-NMR		Version 3.5
$$ Tue Aug 23 12:59:39 2005 GMT Daylight Time (UT+1h)  MAYBRIDGE\NMR@NMR_250MHZ
##.OBSERVE FREQUENCY= 250.131544655141
##.OBSERVE NUCLEUS= ^1H
##.ACQUISITION MODE= SIMULTANEOUS (DQD)
##.ACQUISITION SCHEME= undefined
##.AVERAGES= 16
##.DIGITISER RES= 18
##SPECTROMETER/DATA SYSTEM= dpx250
##.PULSE SEQUENCE= zg30
##.SOLVENT NAME= DMSO
##.SHIFT REFERENCE= (INTERNAL, DMSO, 0, 16.522)
##AUDIT TRAIL= $$ (NUMBER, WHEN, WHO, WHERE, WHAT)
$$ ##TITLE= Audit trail, XWIN-NMR		Version 3.5
$$ ##JCAMPDX= 5.01
$$ ##ORIGIN= Bruker BioSpin GmbH
$$ ##OWNER= NMR
$$ C:\u/data/dgb/nmr/ADRS/8410/pdata/1/auditp.txt
$$ ##AUDIT TRAIL=  $$ (NUMBER, WHEN, WHO, WHERE, WHAT)
(   1,<2005-08-23 12:59:17.96 +100>,<MAYBRIDGE\NMR>,<NMR_250MHZ>,
      <created by zg, POWCHK disabled, PULCHK disabled
       configuration hash MD5:
       62 19 C7 07 E1 42 D1 B7 37 6C 3D D0 77 39 F9 E6
       data hash MD5: 64K
       3D 2D B4 42 59 E9 E6 46 55 B6 B3 15 7B E7 3B 47>)
(   2,<2005-08-23 12:59:30.64 +100>,<MAYBRIDGE\NMR>,<NMR_250MHZ>,
      <Start of raw data processing
       ef LB = 0.3 FT_mod = 6 PKNL = 1 SI = 32K 
       data hash MD5: 32K
       BD ED 7F 19 37 64 5A 0B FE D2 2C 1F DD BD 5A 89>)
(   3,<2005-08-23 12:59:32.56 +100>,<MAYBRIDGE\NMR>,<NMR_250MHZ>,
      <apk 
       data hash MD5: 32K
       E6 13 9A 32 93 6C 64 1E C2 B8 24 81 81 B9 75 8F>)
(   4,<2005-08-23 12:59:33.28 +100>,<MAYBRIDGE\NMR>,<NMR_250MHZ>,
      <abs ABSG = 5 
       data hash MD5: 32K
       B8 5E 8B E5 59 AA AE AA 18 48 26 BD 58 B4 0C 8A>)
$$ ##END=
$$ 
$$ hash MD5
$$ 45 5F 03 0B E1 CF CE 36 3F 87 D8 E5 56 3F E3 7A
##$RELAX= 
##$RELAX= 
##$RELAX= 
##$RELAX= 
##$RELAX= 
##$RELAX= 
##$RELAX= 
$$ Bruker specific parameters
$$ --------------------------
##$DU= <C:\u>
##$EXPNO= 8410
##$NAME= <ADRS>
##$PROCNO= 1
##$TYPE= <nmr>
##$USER= <dgb>
##$AMP= (0..31)
100 100 100 100 100 100 100 100 100 100 100 100 100 100 100 100 100 100 
100 100 100 100 100 100 100 100 100 100 100 100 100 100 
##$AQSEQ= 0
##$AQ_mod= 3
##$AUNM= <au_zg>
##$AUTOPOS= <24 >
##$BF1= 250.13
##$BF2= 250.13
##$BF3= 250.13
##$BF4= 250.13
##$BF5= 500.13
##$BF6= 500.13
##$BF7= 500.13
##$BF8= 500.13
##$BYTORDA= 1
##$CFDGTYP= 0
##$CFRGTYP= 5
##$CHEMSTR= <none>
##$CNST= (0..31)
1 1 145 1 1 1 1 1 1 1 1 1 1 1 1 1 1 1 1 1 1 1 1 1 1 1 1 1 1 1 1 1 
##$CPDPRG= <>
##$CPDPRG1= <>
##$CPDPRG2= <>
##$CPDPRG3= <>
##$CPDPRG4= <mlev>
##$CPDPRG5= <mlev>
##$CPDPRG6= <mlev>
##$CPDPRG7= <mlev>
##$CPDPRG8= <mlev>
##$CPDPRGB= <>
##$CPDPRGT= <>
##$D= (0..31)
0 1 0 0 0 0 0 0 0 0.06 0 0 0 0 0 0 0.0002 0 0 0 0 0 0 0 0 0 0 0 0 0 0 
0 
##$DATE= 1124798357
##$DBL= (0..7)
120 120 120 120 120 120 120 120 
##$DBP= (0..7)
150 150 150 150 150 150 150 150 
##$DBP07= 0
##$DBPNAM0= <>
##$DBPNAM1= <>
##$DBPNAM2= <>
$$ [...]
##$SUBNAM7= <"">
##$SUBNAM8= <"">
##$SUBNAM9= <"">
##$SW= 20.6930455092707
##$SWIBOX= (0..15)
0 0 3 0 0 0 0 0 0 0 0 0 0 0 0 0 
##$SW_h= 5175.983436853
##$TD= 65536
##$TD0= 1
##$TE= 295.16
##$TE2= 300
##$TE3= 300
##$TEG= 300
##$TL= (0..7)
0 120 120 120 120 120 120 120 
##$TP= (0..7)
150 150 150 150 150 150 150 150 
##$TP07= 0
##$TPNAME0= <>
##$TPNAME1= <>
##$TPNAME2= <>
##$TPNAME3= <>
##$TPNAME4= <>
##$TPNAME5= <>
##$TPNAME6= <>
##$TPNAME7= <>
##$TPOAL= (0..7)
0.5 0.5 0.5 0.5 0.5 0.5 0.5 0.5 
##$TPOFFS= (0..7)
0 0 0 0 0 0 0 0 
##$TUNHIN= 0
##$TUNHOUT= 0
##$TUNXOUT= 0
##$USERA1= <user>
##$USERA2= <user>
##$USERA3= <user>
##$USERA4= <user>
##$USERA5= <user>
##$V9= 5
##$VALIST= <valist>
##$VCLIST= <CCCCCCCCCCCCCCC>
##$VD= 0
##$VDLIST= <DDDDDDDDDDDDDDD>
##$VPLIST= <PPPPPPPPPPPPPPP>
##$VTLIST= <TTTTTTTTTTTTTTT>
##$WBST= 1024
##$WBSW= 4
##$XGAIN= (0..3)
0 0 0 0 
##$XL= 0
##$YL= 0
##$YMAX_a= 329191
##$YMIN_a= -372788
##$ZGOPTNS= <>
##$ZL1= 120
##$ZL2= 120
##$ZL3= 120
##$ZL4= 120
##$ABSF1= 16.522
##$ABSF2= -4.171173
##$ABSG= 5
##$ABSL= 3
##$ALPHA= 0
##$AQORDER= 0
##$ASSFAC= 0
##$ASSFACI= 0
##$ASSFACX= 0
##$ASSWID= 0
##$AUNMP= <proc_1d>
##$AZFE= 0.1
##$AZFW= 0.1
##$BCFW= 0
##$BC_mod= 0
##$BYTORDP= 0
##$COROFFS= 0
##$CY= 12.5
##$DATMOD= 1
##$DC= 0
##$DFILT= <>
##$DTYPP= 0
##$F1P= 14.0000005364418
##$F2P= -0.99999901652339
##$FCOR= 0.5
##$FTSIZE= 32768
##$FT_mod= 6
##$GAMMA= 0
##$GB= 0
##$INTBC= 1
##$INTSCL= 1
##$ISEN= 128
##$LB= 0.3
##$LEV0= 0
##$LPBIN= 0
##$MAXI= 10000
##$MC2= 0
##$MEAN= 0
##$ME_mod= 0
##$MI= 0
##$NCOEF= 0
##$NC_proc= -3
##$NLEV= 6
##$NOISF1= 0
##$NOISF2= 0
##$NSP= 0
##$NTH_PI= 0
##$NZP= 0
##$OFFSET= 16.522
##$PC= 1
##$PHC0= -88.17043
##$PHC1= 8.43858
##$PH_mod= 1
##$PKNL= yes
##$PPARMOD= 0
##$PSCAL= 4
##$PSIGN= 0
##$REVERSE= no
##$SF= 250.13
##$SI= 32768
##$SIGF1= 0
##$SIGF2= 0
##$SINO= 400
##$SIOLD= 32768
##$SREGLST= <1H.DMSO>
##$SSB= 0
##$STSI= 32768
##$STSR= 0
##$SW_p= 5175.98343685301
##$SYMM= 0
##$S_DEV= 0
##$TDeff= 65536
##$TDoff= 0
##$TI= <Analysis number 999999
Compound Code 99
Book Reference 9
Project Code 9>
##$TILT= no
##$TM1= 0
##$TM2= 0
##$TOPLEV= 0
##$USERP1= <user>
##$USERP2= <user>
##$USERP3= <user>
##$USERP4= <user>
##$USERP5= <user>
##$WDW= 1
##$XDIM= 32768
##$YMAX_p= 301105062
##$YMIN_p= -169717
$$ End of Bruker specific parameters
$$ ---------------------------------
##NTUPLES= NMR SPECTRUM
##VAR_NAME=  FREQUENCY,     SPECTRUM/REAL,   SPECTRUM/IMAG
##SYMBOL=    X,             R,               I
##VAR_TYPE=  INDEPENDENT,   DEPENDENT,       DEPENDENT
##VAR_FORM=  AFFN,          ASDF,            ASDF
##VAR_DIM=   32768,         32768,           32768
##UNITS=     HZ,            ARBITRARY UNITS, ARBITRARY UNITS
##FACTOR=    0.157963299565203, 1,           1
##FIRST=     4132.6476996994, 0,             0
##LAST=      -1043.33573715361, 0,           0
##MIN=       -1043.33573715361, -169717,     0
##MAX=       4132.6476996994, 301105062,     0
$$ Real data points
##PAGE= N=1
##DATA TABLE= (X++(R..R)), XYDATA
$$ [...]
18256A314882J89751J11605J3635n2922o9960p1539m1236J5818P3k9620l3624
18245A346863J0134L85j6105j1117l0307o7522j07268j30721o8665r2717p9741
18234G53219k3845m1219m6482k3181k2423n5705n1491k1060p171k1154r04m306
18222D34278k2309j6851L3989L7511k19j7201J4052L1258N5682P0971L0460k2337
18210F29284l3626j9664o777L7821N6309L8658L3614O9354J56570J69418J29123
18199A260084J12476J1155n4967j38009j80978j58744j37740j16810l9189k9847
18189E27431j7600k1508m9744m517j7397k8674J205J6409n844o58J5809J3579
18177D28491k067j9008m9841j5963M329o141m2576k6738K18l6414n9676j3262
$$ plain form
18256 1314882 1504633 1616238 1629873 1576951 1506991 1435452 1394216 1410034 1410107 1380487 1346863
18245 1346863 1356997 1357382 1341277 1330160 1299853 1232331 1125063 994342 925677 832960 753219
18234 753219 729374 688155 641673 618492 596069 540364 488873 467813 460642 439488 438584 434278
18222 434278 411969 395118 429107 466618 466399 449198 463250 494508 550190 621161 651621 629284
18210 629284 595658 575994 569217 607038 663347 702005 735619 804973 961543 1130961 1260084
18199 1260084 1372560 1383715 1328748 1190739 1009761 851017 713277 596467 557278 527431
18189 527431 509831 488323 438579 434062 416665 387991 389196 405605 399761 399103 414912 428491
18177 428491 426424 407416 357575 341612 345941 339800 297224 270486 270704 234290 174614 161352
18165A61352L4810J6542j9229m03Q267l721k2208k8016m1427j1823L3520O080
18153A33744k3991K974M0602L999J535k6463R969L7303m2964m1617q535L6477
18141A23033N3993k4833j5078k9909j3387k572J5790o227q109k5545j1953J5220
18129G0423j249j298j219k5617J029Q234N01L1289j38j0745k7492P965r757j4990
18115B6936K1367j3365j4801l7601O04j6447k684K675J2221j922j0890M1291L522
18102A0906j1965j2786j4913n966P048K7863l0878j0107M3233J7520O043j7279
18090H719J064j0903j1592J1735J8165j5341J9122k062j3566j3405M7002L3130
18078G2068j8815k988j1933r53N6073o628l292N738L1361K2515k5457l8070J416
$$ plain form
18165 161352 196162 212704 193475 193072 201339 197618 175410 147394 105967 94144 127664 133744
18153 133744 109753 112727 153329 157328 158863 132400 142369 179672 136708 95091 86556 123033
18141 123033 177026 152193 137115 107206 93819 91247 107037 100810 92701 67156 55203 70423
18129 70423 69174 67876 66657 41040 42069 50303 50804 82093 81955 71210 43718 51683 41926 26936
18115 26936 48303 34938 20137 -17464 -16860 -33307 -35991 -33316 -21095 -23017 -33907 7384 10906
18102 10906 -1059 -13845 -28758 -34724 -27676 187 -30691 -40798 2435 19955 25998 8719
18090 8719 9783 -1120 -12712 -977 17188 1847 20969 18907 5341 -8064 38938 72068
18078 72068 53253 50265 38332 37379 93452 86824 83532 89270 120631 143146 117689 79619 81035
18065H1035N101L3414N529j1145k970P307o943K1728K6878N374J8247O50Q771
18052A92976L526j7192k2530k4104l3244p335p026j0209R70J5292p789r248k3971
18039E0116J4145L5122j8048k4344l2271j3937J2099J1124J095j5928j1295J5727
18027B3605P213K4153K5990K4496J2204O730j0327j0242M414K8738m401j9613
18015A12960J8476K5987J0867M023L3628M981K4643k154j2230l939J072M287l6875
18002A85726J1098M0758J4854K2945J0674j6478m7346l1311k3583Q318k5097J8260
17990A68818J8351r387k1410p072j5758j8484K1682R413j1383k7271j157R108
17978A15450k4092k9643j4528J2621j2102q470l1720J5025L4154M6379K2346j3620
$$ plain form
18065 81035 86136 119550 125079 113934 110964 118271 111328 133056 159934 165308 183555 184205 192976
18052 192976 196502 179310 156780 132676 99432 92097 85071 74862 75832 91124 83335 74087 50116
18039 50116 64261 99383 81335 56991 24720 10783 22882 34006 35101 19173 7878 23605
18027 23605 30818 54971 80961 105457 117661 124391 114064 103822 108236 136974 132573 112960
18015 112960 131436 157423 168290 172313 205941 210922 235565 233411 221181 217242 218314 222601 185726
18002 185726 196824 237582 252436 275381 286055 269577 222231 190920 167337 175655 150558 168818
17990 168818 187169 177782 156372 149300 133542 115058 136740 146153 134770 107499 106342 115450
17978 115450 91358 61715 47187 59808 47706 39236 7516 22541 56695 103074 125420 111800
17966A11800l4303O829P634j1271j2931m203K0604L4960J127l9871m542K0917
17954I6750J4879K6531J7084m650J1004K3603J8291k133k3897m2834j5786J9703
17942A38545K8497M1402L4028n10J9151L3854L0479L2065M2256O7151M5917L1886
17930E44721L6862N2284M7149J045P368J8261J7844m19l3162k9838k0894l7049
17918F04172n2537o6722l7481j8452o7109k3190P954q542p921l0033l2110l6946
17906B31083o302l4803j1679M266j684j4515l1039k3881J0288k2293l0983J154
17894F9612J0579P070Q813L3265r216n634j0391J5276J396P659j3574J403J0852
17881A27110L017J3409R118n679j8872n1635m0289R981M3550L8711M309J1698
$$ plain form
17966 111800 77497 84326 91960 80689 67758 63555 84159 119119 120246 80375 75833 96750
17954 96750 111629 138160 155244 150594 161598 185201 203492 201359 177462 134628 118842 138545
17942 138545 167042 208444 242472 241962 261113 294967 325446 357511 399767 466918 512835 544721
17930 544721 581583 633867 681016 682061 689429 707690 725534 725115 691953 662115 641221 604172
17918 604172 551635 484913 447432 428980 361871 338681 346635 338093 330172 300139 268029 231083
17906 231083 224781 189978 178299 182565 180881 166366 135327 111446 121734 99441 68458 69612
17894 69612 80191 87261 96074 129339 120123 114489 104098 119374 120770 128429 114855 116258 127110
17881 127110 130127 143536 152654 146975 128103 76468 36179 46160 89710 128421 132730 144428
17869A44428J5333l0082N2457M7056P853p6486p0216l0850j6400Q410j0169J7354
17857E8688p238K4138j8909j5601K6989j0415j5442j948P074L1395K0212K940
17845A01883k4360k4931k931O125k1282j1129J0099q905L1203J8625Q843l9729
17833D3511l5805M254k726L9845K8348p172K1368K0132M4988P236J9801L1143
17821B14923M5337L2315l8326n647l1258K292L6342K7374J9885N297N8671P3517
17809D40722L5384K7900R034j8160m2715j7567k2065l0188k70k067m94j7140j4513
17796C47861K0616O1972O6741Q5587Q3785Q1865J23089J29418J91762K51279K54460
17785A698435J81635J25841N6841K1355K7017K7542Q2406J74513K60121L10280
$$ plain form
17869 144428 159761 129679 182136 229192 237045 160559 90343 59493 43093 51503 41334 58688
17857 58688 51450 75588 56679 41078 68067 57652 42210 40262 47336 78731 98943 101883
17845 101883 77523 52592 49661 55786 34504 23375 33474 24569 55772 74397 83240 43511
17833 43511 7706 11960 9234 49079 77427 70255 91623 111755 156743 163979 183780 214923
17821 214923 260260 292575 254249 248602 217344 219636 255978 283352 303237 308534 367205 440722
17809 440722 476106 504006 513040 494880 452165 434598 412533 382345 382075 380008 379514 362374 347861
17796 347861 368477 430449 497190 582777 666562 748427 871516 1000934 1192696 1443975 1698435
17785 1698435 1880070 2005911 2062752 2084107 2111124 2138666 2221072 2395585 2655706 2965986
17775B965986L77650L38543K50336O9472q1900j41816r4582j0642P4230J56341
17765C903618K89995N02016P03325R63755J283456J674469K267754K992467L786228
17756A8367083M604718N368268N782795N208267L187229K6169k700822m025219
17748C5818488m671702m775621m099378k985600j880086j009698l03927J86975
17740A6279451N16093O76080N71368J31162o44538j379811j774770j667299j329793
17731A1377943r82529o77932m57596l04304k05981j83107k06122k17133j72431
17722G970808q4685L9492J49455K99814M74192P46212J047646J360883J655108
17713A3658925J956675K121862J962580J428073O19542k85709p18533n00019J72356
$$ plain form
17775 2965986 3343636 3682179 3932515 4001987 3920087 3778271 3683689 3673047 3747277 3903618
17765 3903618 4193613 4695629 5398954 6362709 7646165 9320634 11588388 14580855 18367083
17756 18367083 22971801 28340069 34122864 39331131 42518360 42544529 39843707 35818488
17748 35818488 31146786 26371165 22271787 19286187 17406101 16396403 16092476 16279451
17740 16279451 16795544 17471624 18042992 18174154 17529616 16149805 14375035 12707736 11377943
17731 11377943 10395414 9717482 9259886 8955582 8749601 8566494 8360372 8143239 7970808
17722 7970808 7886123 7925615 8075070 8374884 8849076 9595288 10642934 12003817 13658925
17713 13658925 15615600 17737462 19700042 21128115 21747657 21461948 20743415 20243396 20415752
17704B0415752R74348J914050L091971M454338O000887P520656Q855894R439957
17696F2667853Q594883N656149Q07978m609485r261107j1302939j0373271q136713
17688C4043348n985109m277932l099270k291233j684987j226356q69878o13528
17680A3995055l58739j49747Q0369L11074M68180M15074K15257k05302p19976
17671A4051245j091644j116339r72454q20762p28399o61360o14666n77322n07003
17662F961296m48518l99958l78585l39328l24921k74873k31243k17554j92567
17653D153749k18952j87867j53695j61752j45743j34568j28987j21822j24599
17644B775764j03869j28859j15544j20354r0418o5622r4555o4193o8041m2044
$$ plain form
17704 20415752 21390100 23304150 26396121 30850459 36851346 44372002 53227896 62667853
17696 62667853 71262736 76918885 77726863 73117378 63856271 52553332 42180061 34043348
17688 34043348 28058239 23780307 20681037 18389804 16704817 15478461 14608583 13995055
17680 13995055 13636316 13486569 13566938 13878012 14346192 14761266 14976523 14771221 14051245
17671 14051245 12959601 11843262 10870808 10050046 9321647 8660287 8045621 7468299 6961296
17662 6961296 6512778 6112820 5734235 5394907 5069986 4795113 4563870 4346316 4153749
17653 4153749 3934797 3746930 3593235 3431483 3285740 3151172 3022185 2900363 2775764
17644 2775764 2671895 2543036 2427492 2307138 2216720 2151098 2056543 1992350 1924309 1882265
17634A882265n0526p2924n0445n8477m7091q7184n2959l8447q152J670q818m2143
17622A366769n5394o7854k5089L11k825j3326m4081j9468O744l2003n8829m4329
17610A010626k2219k7207m2655m0583J3214K2910J5657R45k9052l1638j9436K0924
17598H71486L055j1208K1634k803j7072l5305M1560N6246J788L2310J7235K3873
17586A002799O1668N5532R2830J01253J30635J79264J99508K50463L35998L73900
17576B783850M07814N30470O34920P59787Q46305R22958R17391P21828L81720
17567H907043q5753n02730n86368l98279j40820J82427N65452R07002J295618
17558A0143592J740503K333992L047777M050740N362902O967912Q762562J0305329
$$ plain form
17634 1882265 1831739 1758815 1708370 1649893 1602802 1515618 1462659 1424212 1416060 1417730 1408912 1366769
17622 1366769 1311375 1243521 1218432 1218743 1215918 1202592 1158511 1139043 1145787 1113784 1054955 1010626
17610 1010626 988407 961200 918545 877962 891176 914086 929743 930688 901636 869998 850562 871486
17598 871486 874541 863333 884967 882164 865092 829787 871347 927593 929381 961691 978926 1002799
17586 1002799 1064467 1119999 1212829 1314082 1444717 1623981 1823489 2073952 2409950 2783850
17576 2783850 3191664 3722134 4357054 5116841 5963146 6886104 7803495 8525323 8907043
17567 8907043 8821290 8318560 7732192 7333913 7193093 7375520 7940972 8847974 10143592
17558 10143592 11884095 14218087 17265864 21316604 26679506 33647418 42409980 52715309
17550E2715309J0912646R780117O278220M62634n832552j0067424j1361587j0104728
17542D2782635p645463n278247l382360j979388j031581k46922K92447O06209
17534B4117330O38919L43223l53979j282797k126805k463363k270892j825381
17526A4776255j298535q93164o35284n22406m14738l75779l69104l67117k92585
17517I607543k43276j01835M9987J36300L13156N49268P93889J018250J330399
17508A3453681J517059J573999J402532R11736J99708m51194p52849n93376l8389
17499A7222907P04994J542069K416341L366142M274305M934383N045629M423156
17491D3929926K784169K69482k489934n259216p138138p016986n397313l646975
$$ plain form
17550 52715309 63627955 73408072 79686292 80148926 74316374 64248950 52887363 42782635
17542 42782635 35137172 29858925 26476565 24497177 23465596 23218674 23511121 24117330
17534 24117330 24756249 25099472 24745493 23462696 21335891 18872528 16601636 14776255
17526 14776255 13477720 12584556 11949272 11426866 11012128 10636349 10267245 9900128 9607543
17517 9607543 9364267 9262432 9312419 9448719 9761875 10311143 11105032 12123282 13453681
17508 13453681 14970740 16544739 17947271 18859007 19058715 18607521 17854672 17261296 17222907
17499 17222907 17927901 19469970 21886311 25252453 29526758 34461141 39506770 43929926
17491 43929926 46714095 46983577 44493643 39234427 32096289 25079303 19681990 16035015
17483A6035015k430592j705244j224926q90390o46141n06708m09509l19852j95961
17474G705692p5392L131P1288Q4916N8834m5539j77545l25839m55121n12837m71871
17463E859717l95961l80731l64710l53332l08149k46839k20385j67979j59055
17454C262576j36997j43804j44428j18738j02058j25026j07250p4919o3931p4389
17444B171036r8767j00958q2800m8664p7125r9848o5694n1307r8038m4178l908
17433A399749l0214n2492n7323l912l2404m9523n5270o5647m0352o085M5831R585
17421A061943j6385q796j6695R606j7368k5500j9154m5620l5896l0613k3760k7709
17409H04053p5252j4008K726l739L892R929m8057O960k0173k5870L598R921k0692
$$ plain form
17483 16035015 13604423 11899179 10674253 9783863 9137722 8631014 8221505 7901653 7705692
17474 7705692 7630300 7633431 7704719 7789635 7848469 7802930 7625385 7299546 6844425 6331588 5859717
17463 5859717 5463756 5083025 4718315 4364983 4056834 3809995 3589610 3421631 3262576
17454 3262576 3125579 2981775 2837347 2718609 2616551 2491525 2384275 2309356 2245425 2171036
17444 2171036 2072269 1971311 1888511 1839847 1762722 1662874 1597180 1545873 1447835 1403657 1399749
17433 1399749 1369535 1317043 1259720 1255808 1223404 1173881 1118611 1052964 1012612 1006527 1052358 1061943
17421 1061943 1045558 1036762 1020067 1029673 1012305 986805 967651 922031 886135 855522 831762 804053
17409 804053 728801 714793 717519 713780 717672 727601 679544 686504 666331 640461 644059 653980 633288
17396F33288k690l7944j1496M7935L4887j6782o409k7338l526j2520l9149O787
17384E65043k2167m01K9148l311j430J6507k4311J7166N3522m061K999o320l0781
17371E91603l824j7709l0301l685j8863j5281K6060P668j2475M745p221J7810
17359E38527K84k4714l3721j1814o19J1900J5524M806l0183j4687q487L3024k979
17346D76861l6313j7257p37K0914J2469m798q923k0275J9737J7177l0284K3999
17334D52570J9111j4868j228j0185P016J8465o586j8987k899l3331r117j5041
17322C84920J6161J2170J4480J6029k0621m1444N211J3042j9532m956J2915j0008
17310C78367J5471J5417j9170O357l904N260J8114K875j5469l3612j7895J5896
$$ plain form
17396 633288 630598 592654 581158 629093 663980 647198 640789 613451 609925 597405 558256 565043
17384 565043 542876 542475 571623 568312 566882 583389 559078 576244 629766 625705 628704 622384 591603
17371 591603 587779 570070 539769 536084 517221 501940 528000 535668 523193 527938 520717 538527
17359 538527 538811 514097 480376 468562 467943 479843 495367 500173 469990 455303 446816 479840 476861
17346 476861 440548 423291 422554 443468 455937 451139 442216 421941 441678 458855 428571 452570
17334 452570 471681 456813 455585 445400 452416 470881 464295 445308 442409 409078 399961 384920
17322 384920 401081 413251 427731 443760 423139 381695 386906 399948 380416 375460 388375 378367
17310 378367 393838 409255 390085 396442 392538 397798 415912 418787 403318 369706 351811 367707
17298C67707K5722P35O757k2533l7790M803K1347J0718o789l6345m5867l1572
17286B56893N110j0607K9130L4196J1118K1266J7421P127r037k5169M734N051
17274C47233j9081l5025j4853J1314p674r378M7394M2519J3523J0704O3157L0540
17262D80373l4483j3059K0236M2994j2406r417j3944L808K6676J1348P259n050
17250E04335k963j4901p403K444j1823j2915j5424n2367M70N0809L0316J2671
17238D83249k2417J492r725J5526Q507r604j7023j3098L0669L296q626O915K4459
17225D93620M020L3159L9058K8124l7249n3727q1092n7603j2358J4431k459j499
17213C66425Q50j9437R049Q909k4193J2944J6138m203K3183r184L143K1166l3821
$$ plain form
17298 367707 393429 394164 400921 378388 340598 345401 366748 377466 370677 334332 288465 256893
17286 256893 262003 251396 280526 314722 325840 347106 364527 371654 362617 337448 342182 347233
17274 347233 328152 293127 278274 289588 281914 272536 319930 362449 375972 386676 449833 480373
17262 480373 445890 432831 453067 496061 483655 474238 460294 464102 490778 502126 509385 504335
17250 504335 501372 486471 479068 481512 469689 456774 441350 388983 389453 440262 470578 483249
17238 483249 460832 462324 452599 468125 476632 467028 450005 436907 467576 470872 462246 469161 493620
17225 493620 497640 530799 569857 597981 560732 507005 425913 368310 355952 370383 367924 366425
17213 366425 367275 347838 356887 365796 341603 354547 370685 366482 389665 380481 383624 404790 370969
17200C70969Q391j3431l8530J1454m360p964n625l14K798K7562K1622J4924o959
17187C80537k9277J4012j1036L4442L3129M08k048k904j881o381r630l219P387
17174D03539q533k0516L687J441r316o1332r942M4116Q759m6322J0084L71k7158
17161B88878j2082j482J8152J2688k3031J5177J6299n2905l9799L74l479K9510
17149B48300q074m1728r714K3138K9007M7484N578O425l0008j2121j8498r962
17137B29827J6234L037M668l7617r810L2771p329l8208l738O346R096L0578k2586
17124B13269j8818J9323j9140q645n311L4088J3343l6968m3767j5085K8803M2147
17112B03239R179l2763l2004K3307K5956r34l4025j2963K3074Q806m741m7389
$$ plain form
17200 370969 379360 365929 327399 338853 334493 326529 320904 320590 323388 350950 372572 387496 380537
17187 380537 351260 365272 354236 388678 421807 422215 420167 417263 415382 409001 399371 396152 403539
17174 403539 395006 374490 378177 379618 370302 308970 299028 343144 351903 305581 315665 316036 288878
17161 288878 276796 275314 293466 306154 283123 298300 314599 261694 221895 222269 218790 248300
17149 248300 240226 198498 188784 211922 240929 288413 293991 300416 270408 258287 239789 229827
17137 229827 246061 249098 253766 216149 206339 239110 231781 193573 189835 196181 205277 235855 213269
17124 213269 194451 213774 194634 185989 180678 214766 228109 191141 147374 132289 161092 203239
17112 203239 212418 179655 147651 170958 196914 195980 161955 148992 172066 180872 176131 128742
17100A28742l1602K7125K8694N499N4457J0574j1633j9103m1944l633j2100J6840
17088A51916j3103K7272J8177l0188j5765K0360Q119l0734J291Q629l0935R114
17076A24153L0006K172j9513k7722j2112j3795K1757K2968K4562n329j9121j0917
17064A17109K1678K5547K6573j2775j4989K7154J2278k7391j8290J2469L7202
17053B06565M0444N4573K5065m6470j9574L841L0307j145K1539J7745J3501O159
17041C52550j6436k6863j3600J0177J4151k2127j7261j133J5835q297J1324k2966
17029B75354l8935j2676K172L7757j5594j0180N038K5818j447j3305k8334O262
17017B31930p662k1814n815L360K0526m73j7461j3139K1047M0012L2240Q8105
$$ plain form
17100 128742 97140 124265 152959 158458 212915 223489 211856 192753 150809 147176 135076 151916
17088 151916 138813 166085 184262 154074 138309 158669 166788 136054 137345 145974 115039 124153
17076 124153 154159 156331 136818 109096 96984 83189 104946 127914 152476 147147 128026 117109
17064 117109 138787 164334 190907 178132 163143 190297 202575 175184 156894 169363 206565
17053 206565 247009 301582 326647 280177 260603 264444 294751 293606 315145 332890 346391 352550
17041 352550 336114 309251 295651 305828 319979 297852 280591 279458 295293 286996 298320 275354
17029 275354 236419 223743 225915 263672 248078 237898 242936 268754 267307 254002 225668 231930
17017 231930 224268 202454 196639 199999 220525 220052 202591 189452 210499 250511 282751 370856
17005C70856O1156k932m6145k7664m1929k0116k1291k4618q00j4015O892M1387
16993B80781J1171N732j2919k1588l4307K2236J2326j6651n147J7327l5847r875
16981B13239O672k1581K9790L2223J3537J6614o133m0036Q364P922n630J2659
16969B67640K850l4850l3336k8617j1606k1845j4359J8961P509j6425K166J4305
16957A52393j0326k0186j8364K0430K8914k5198n6162m223N80k2999K1996l4868
16945C1987k7104K0353M7382J9712J1760K9948j4533K574p590k6450K121J9639
16933A09799m079N861j5244l0396n43J7079K7151K9743J4610l156k8141l7513
16921H5171K5729J7779j2888n192J6332P355K8809J799l4999j5371J4977L8146
$$ plain form
17005 370856 432012 429080 382935 355271 313342 293226 271935 247317 246517 232502 239394 280781
16993 280781 291952 297684 284765 263177 228870 251106 263432 246781 241634 258961 223114 213239
16981 213239 219911 198330 228120 260343 273880 290494 284361 244325 252689 260611 254981 267640
16969 267640 270490 235640 202304 173687 162081 140236 125877 144838 152347 135922 138088 152393
16957 152393 142067 121881 103517 123947 152861 127663 71501 67278 67858 44859 66855 31987
16945 31987 4883 25236 72618 92330 104090 134038 119505 122079 114489 88039 90160 109799
16933 109799 105720 111581 96337 65941 65398 82477 109628 139371 153981 150825 122684 85171
16921 85171 110900 128679 115791 110599 126931 134286 163095 164894 129895 114524 129501 167647
16909A67647k0083j5237k0926J400M4375m392k4860k4800q033j574k8365k3612
16897D1540j1338J2042M4726m610j7713J6464J6153J8427o377j5255r74k6068
16885F7017m721J4413K1200k066j8507j4120J1956P218k5444l5047j295M9059
16873F9663J8075l2323J5129N269j1224L169p513j4017J763J619k953L2509L0624
16860A09790j2359j9310j6275J3674k4716j6722M1710L088q7J0523k6032N049
16848F8333P619M905K4106J0278l2467p823k9689L198K3837K301l839K5002j6349
16835G9412l185J82J8502P94k1115k7530J4374J1521Q547O448J3531J1799n927
16822A07353j6677J5246J7221j493m2396l5886K6786N93m852J510K1078J0184
$$ plain form
16909 167647 147564 132327 111401 112801 157176 152784 127924 103124 95091 93517 65152 41540
16897 41540 30202 42244 86970 82360 64647 81111 97264 115691 109314 94059 93085 67017
16885 67017 62296 76709 97909 95843 77336 63216 75172 82390 56946 21899 20604 69663
16873 69663 87738 55415 70544 75813 64589 67758 60245 46228 47991 49610 46657 79166 109790
16860 109790 97431 78121 61846 75520 50804 34082 75792 78880 78793 89316 63284 68333
16848 68333 75952 80857 104963 115241 82774 74951 45262 48460 72297 74598 70759 95761 79412
16835 79412 76227 76409 94911 95705 74590 47060 61434 72955 81502 87950 101481 113280 107353
16822 107353 90676 105922 123143 121650 79254 43368 70154 70747 65895 67405 88483 98667
16810I8667J4610n0840m8539j1046J232P111J6145K6872K7992O425O224j5221
16798G9632K473J5770l28P449O229O113p360j6735K436J0194L6891m774n8638
16785G9352l2701q299Q445L9414L6216n601k9171J1789j3968o750j1530L2991
16773A00187J0290m252J6566n518M537k4047j7223K5089L7027J1835J7284M367
16761A76142m5970m4001k4604j2897o189J8600k4808k9722m814K2047J6786k465
16749C8105L9259J5329Q45p794q850j2482j8098j7384k4490K2780L9609K2118
16737H8947l2376l0634p09J8910j3749n371J988r549J7389L8850L4936p182Mj6642
16723H4812r489k3896l4691k0958J9408q037K9782M9807q369l5803K2504n063
$$ plain form
16810 98667 113277 62437 13898 2852 4084 11195 27340 54212 82204 88629 94853 79632
16798 79632 82105 97875 97547 104996 111225 117338 109978 93243 95679 105873 142764 137990 79352
16785 79352 46651 38352 46797 86211 122427 116826 87655 99444 85476 78726 67196 100187
16773 100187 110477 106225 122791 117273 121810 97763 80540 105629 142656 154491 171775 176142
16761 176142 130172 86171 61567 48670 42481 61081 36273 6551 1737 23784 40570 38105
16749 38105 77364 92693 93538 85744 76894 64412 46314 28930 4440 27220 66829 88947
16737 88947 56571 25937 25228 44138 30389 25018 27006 17457 34846 73696 108632 101450 101454 84812
16723 84812 75323 51427 16736 -4222 15186 7149 36931 86738 78369 42566 65070 60007
16711F0007k8845r133l838r842j0737O064K5126k5692p858K0954K3819K0121k7512
16698C2634j8472J8113J5732L442N904k775q63J2396J3385L2775O114q305j1936
16685I8144k9902k9144m209j4845k1152K4656j1304j983K7154K9616m3052j4005
16673I974K9872M1886J4890j0675Q042Q062l5639k1332j8532J3231L218n824K7596
16660F4769L1624Q318m262j0156J2740k6953L349J0575k1797j4471J1667Q467
16648G3870j1910O113K5225N3963j2701n2811l5894J5871k0913K1598O476m3019
16636B5868k6597j3641J1978M435J3384J4912J2807r533J3319K0911P113K1932
16624I6888l74k0235r509k8851L649K5202N382l3465k4055K2268Q746J2249j4328
$$ plain form
16711 60007 31162 22029 18191 8349 -2388 3676 28802 3110 -4748 16206 40025 60146 32634
16698 32634 14162 32275 48007 51449 57353 54578 53715 66111 79496 112271 118385 110080 98144
16685 98144 68242 39098 34889 20044 -1108 23548 12244 10261 37415 67031 23979 9974
16673 9974 39846 81732 96622 85947 93989 102051 66412 45080 26548 39779 42997 37173 64769
16660 64769 96393 104711 100449 90293 103033 76080 79429 90004 68207 53736 65403 73870
16648 73870 61960 68073 93298 147261 134560 81749 45855 61726 40813 62411 68887 25868
16636 25868 -729 -14370 -2392 2043 15427 30339 43146 33613 46932 67843 74956 96888
16624 96888 96514 76279 66770 37919 41568 66770 72152 38687 14632 36900 45646 57895 43567
16611D3567m0894j8826L8645M5135q933p839k011M397l8580k7356J8457K1128
16599B6890J303j2005K2507K1132j8997k9017j974L3084J088l81j4888J3046r65
16586D0823K2210l0053l0692j8919J0378K8661J6988J8605J5049J5397r901k7694
16574E0852J5657r402j3428r102j4706j2729L137L3542L0568J2717J4421j0666
16562I0861k7957m1332J4579J4218k3411M581K262P029j8405l392L5141P012n89
16549F0597n436P872J8106O385P080j0559j2811R148R316l298l2216j3207J3908
16536E4885L9764L161n0275m3447j9825M2714L3742J8960K7204j5780j0749K81
16524H0635j4347Q638N93K902Q575j562o498m207K192j157k0109J2809l5520m6168
$$ plain form
16611 43567 2673 -16153 22492 67627 58694 50855 48844 53241 14661 -12695 5762 26890
16599 26890 28193 16188 38695 59827 40830 11813 9839 42923 44011 43630 28742 41788 40823
16586 40823 63033 32980 2288 -16631 -6253 22408 39396 58001 73050 88447 78546 50852
16574 50852 66509 57107 43679 34577 19871 7142 10279 43821 74389 87106 101527 90861
16562 90861 62904 21572 36151 50369 26958 31539 33801 40830 22425 19033 54174 61186 60597
16549 60597 55161 63033 81139 87524 94604 84045 71234 80382 89698 86400 54184 40977 54885
16536 54885 94649 97810 47535 4088 -15737 26977 60719 79679 106883 91103 80354 80635
16524 80635 66288 74926 75519 78421 86996 85434 78936 74729 76921 75764 55655 68464 32944 -13224
16510a3224L121R331J564l4602L818J0426L2324K1636J0506k9445m664k516k7192
16497a8917M2011N064l1414J148K2141q269n374J2716K7054K648p404r188j6813
16484A5403j1044j3613Q633J8793l4374j5728N423J0967R79l808K6502K9828N974
16471D3935q045j5164M48q859l631j1994j0478j7476K4444N553l674J2210N4901
16458F2170l573m2287o961J0616J6116l706Q657J2875r340J062Q94J3875m2040
16445A8358j7518K0097J4293K5347p931k0489k5429K7043m520k7433l495L233
16433A556M1263J249J909L83J6986J0081l681j1782n387j0027k0804K3708o042
16420C9412K860R183j060j7401k7895q934L902K1254L6248N996k2889r946j2671
$$ plain form
16510 -13224 -10103 -772 792 -33810 -29992 -19566 12758 34394 44900 15455 10791 8275 -18917
16497 -18917 23094 28158 -3256 -2108 20033 11764 6390 19106 46160 48808 41404 32216 15403
16484 15403 4359 -9254 -621 18172 -16202 -31930 -26507 -15540 -14561 -18369 8133 37961 43935
16471 43935 35890 20726 21174 12315 8684 -3310 -13788 -31264 -6820 -1267 -4941 7269 62170
16458 62170 58597 16310 9349 19965 36081 32375 41032 53907 44567 45629 46523 60398 18358
16445 18358 840 20937 35230 60577 52646 32157 6728 33771 29251 1818 -1677 1556
16433 1556 42819 44068 45977 46360 63346 73427 69746 57964 52577 42550 21746 45454 39412
16420 39412 42272 51455 50395 32994 5099 -3835 67 21321 57569 63565 40676 30730 18059
16407A8059P018n410j6719J9492j098L320N2303L850k2509j4811J8873K4265l7235
16394D9398m1475k130N998K444l530K3788J7123L0496J2568M080m8899j3243K3856
16381F0474K098j0906k4104p104M463L0589M670j8717j2279K735k6015j1952J0825
16368D777p66k1978K9577M0526k5414o558J8336J2416J4296j267P030k738Q122
16355G6359k4789j4254N159O935j6084j9798J1605K1414j8633J8002R434k8034
16343B7316R375l9947m0639n594L9601K8917j5066K8778J4754J816p591J3691
16331E5411k9469m8614J2792J8572K1126K0550J0078N122j8711k5632J2783p863
16319B6145k2043K0956J1087J641j4403L1658J0157l9154N587J2981J0349n1190
$$ plain form
16407 18059 25077 19667 2948 22440 21342 24662 76965 80815 58306 43495 62368 86633 49398
16394 49398 7923 5793 11791 14235 10705 34493 51616 82112 94680 98760 49861 36618 60474
16381 60474 62572 51666 27562 20458 24921 55510 60180 41463 29184 31919 5904 -6048 4777
16368 4777 4011 -17967 11610 52136 26722 20164 38500 50916 65212 63945 70975 68237 76359
16355 76359 51570 37316 42475 49410 33326 13528 25133 46547 27914 45916 55350 27316
16343 27316 36691 -3256 -43895 -49489 -9888 19029 3963 32741 47495 49311 41720 55411
16331 55411 25942 -22672 -9880 8692 29818 50368 60446 65568 46857 21225 34008 26145
16319 26145 4102 25058 36145 37786 23383 55041 65198 26044 31631 44612 54961 3771
16307C771j0938L1366J5614J8152K8370J1188J8254k3300m2727m4702P539n483
16295G104k9178l905L8297K5302o338K5834r568j2715M725o454j0491p088j2548
16282B977K9234O327k6062j0704L1069j4717j4163J0585R65J9530J7795J6124
16270F8960j3176j3560n001q983m515j2947J8285L5817O252k3748k684m0419n22
16257C759J4585k4625L0909J5629j0953q108J475l2102k6914K7057L226P244J8847
16244B0029p047j5004J3526k942K2753j4037n881m2975J1996J6166j256Q308n529
16231a893N609q256q502K0659m956k2675N823p764J7587R353k7897q709K8828
16218b793K2295J2173P379K5750p363j342k3164j9797R795L920J4323j4744J3066
$$ plain form
16307 3771 -7167 24199 39813 57965 86335 97523 115777 92477 49750 5048 12587 7104
16295 7104 -22074 -25979 12318 37620 31282 57116 47548 34833 39558 33104 22613 15525 2977
16282 2977 32211 38538 12476 1772 32841 18124 3961 14546 15511 35041 52836 68960
16270 68960 55784 42224 37223 28240 23725 10778 29063 64880 71132 47384 44700 4281 3759
16257 3759 18344 -6281 24628 40257 29304 21196 22671 -9431 -36345 -9288 -6062 1182 20029
16244 20029 12982 -2022 11504 8562 31315 17278 11397 -31578 -19582 -3416 -4672 3636 -1893
16231 -1893 3716 -4540 -13042 7617 2661 -20014 -14191 -21955 -4368 4985 -22912 -31621 -2793
16218 -2793 19502 31675 39054 64804 57441 56099 32935 13138 22933 26853 41176 26432 39498
16205C9498j755K848J0604l0801k7874j1397J0466r859o488K5432r073m5843l9158
16192i3400J0306k1213j1538M1651L8922L6677L9783K5747Q084P491j8781j4765
16180D8964R684M044J3780K564k5947k5054k7520j8406K2080j6450j8981J7378
16168a3864M0209r8j03k1795j9494L1190J9015J1928j705j5474L8575J1l7080
16155C1315k5601k235p151R21M5144J667j4476m159k1011j6738L030M5844Q589
16142D5139p893j2541l8882k780J9997J2434K427q482K0640L3776K972j5780q110
16129D2917j8141k9121K038J0445K9528l6723j5881N834R823J0863K0579J496
16117C3657K451j4390l0316K5363N231q40j0270M278J6118J4291l94m133j3204
$$ plain form
16205 39498 37743 40591 51195 20394 -7480 -18877 -8411 -18270 -24758 674 -8399 -54242 -93400
16192 -93400 -83094 -104307 -115845 -74194 -35272 1405 41188 66935 75019 82510 63729 48964
16180 48964 58648 62692 76472 79036 53089 28035 515 -17891 4189 -12261 -31242 -13864
16168 -13864 26345 26247 26144 4349 -15145 16045 35060 46988 45283 29809 68384 68395 31315
16155 31315 5714 3479 -3672 -2751 42393 44060 29584 25425 4414 -12324 -9294 36550 45139
16142 45139 37246 24705 -14177 -16957 3040 15474 17901 9419 30059 63835 66807 51027 42917
16129 42917 24776 -4345 -2307 8138 37666 943 -14938 -9104 719 11582 32161 33657
16117 33657 36108 21718 -8598 16765 21996 21156 10886 15164 31282 45573 45179 41046 27842
16104B7842L586k059Q666J0649j5538k8075p616k5048j3076K0408M0795j9517
16092A017J3519N2170P613j2075n623K75m1051m5978J4340k2440J2081M6903M6292
16079F7043k2117k9583j0595J3088J1642J6953l0506L2897k4333o268J0328Q062
16067C6611m085k1397j9262j3771J4256J7603j370J6305j6223l6751k7816K8733
16055b7167M3869R52P755O686l3271j1871L887l3M22J3105K1803r93r877n162
16041A0105m638m484L4904j5374m642J3904j8607L19J9979j6949j794P95k3518
16028a0000o16j8051K810j2731L827L4453k0569j020n15P398l397Q734J7569K5053
16014C2945l644j3053q251r159k331N455L1717r447k6008j8959J1511P34m801
$$ plain form
16104 27842 31428 29369 38035 48684 33146 5071 -2545 -27593 -40669 -20261 20534 1017
16092 1017 14536 66706 74319 62244 56621 56896 15845 -30133 -15793 -38233 -26152 20751 67043
16079 67043 44926 15343 4748 17836 29478 46431 15925 48822 24489 18221 28549 36611
16067 36611 32526 11129 -8133 -21904 -7648 9955 8585 24890 8667 -28084 -55900 -27167
16055 -27167 16702 17654 25409 32095 -1176 -13047 -9160 -9193 -8771 4334 26137 25144 15267 10105
16041 10105 5467 983 35887 20513 15871 29775 11168 11487 31466 14517 12723 13518 -10000
16028 -10000 -10616 -28667 -25857 -38588 -34761 -308 -20877 -21897 -22412 -15014 -18411 -9677 7892 32945
16014 32945 29301 16248 7997 -1162 -3493 1962 33679 24232 -1776 -20735 -9224 -8490 -13291
16001a3291L1149j6750k5416R760L3767L647J274K9230P451l0128k0417Q306k4912
15988f330j6858k673L3722N175O852J5206j7923j0935K9228J5964K657j1892k9071
15975A3122J0292k0582m186K0424q475N616J6326J5221o155j7842L0491L7073
15963I1325o962k0655k2127m2397l784r910J8638k7592k393J6526M655J7366P420
15950B0110k6126l0893K4321M5108o483k7534k2863J3421K8732L329m83l289K408
15937A9758p544J3562K7512Q016n2508M522j1646k7619k1335K1880J0439K307
15925a2656L2309J2969L109j0267k0924j0614n713m0605p581K504K6875j3894
15913d4488J9619K8765J7240j957j920O013j270l2346o390K867J0082K3200Q312
$$ plain form
16001 -13291 17858 1108 -24308 -14548 19219 22866 24140 53370 60821 30693 10276 18582 -6330
15988 -6330 -23188 -25861 7861 13036 19888 35094 17171 6236 35464 51428 54085 42193 13122
15975 13122 23414 2832 -1354 19070 10595 16211 32537 47758 41603 23761 54252 91325
15963 91325 84363 63708 41581 -816 -4600 -14510 4128 -23464 -25857 -9331 -4676 12690 20110
15950 20110 -6016 -36909 -12588 32520 26037 -1497 -24360 -10939 17793 21122 20639 17350 19758
15937 19758 12214 25776 53288 61304 8796 13318 1672 -25947 -47282 -25402 -14963 -12656
15925 -12656 19653 32622 35731 25464 4540 -6074 -11787 -52392 -59973 -57469 -30594 -44488
15913 -44488 -24869 3896 21136 19179 17259 23272 22002 -10344 -16734 -13867 -3785 19415 27727
15900B7727N477j0678m1689K819J1942k6433P610j8428j1904J8125j8899n293
15888e9624J8630K7745J6168K223j8203k7872q157L3229K4983n5k3675J695J9331
15875F418o609N424K4421o038o773r700l0658M318K1759N62r956j8308N709J1943
15861g488R215k132k8748K0297m444J1653J7609L640J0631l727l1195p75L0054
15848B4590j7773J5577Q586K5276J706j1975q884j7401l3534K2064J2635k0955
15836h8l7485K4016J3569J3068K0465k3505j9456R009L8983L3886k8937l3410
15824A0115K1829L912r105q854M153j392o166M083k1130j6628J6509R652o989
15811a1J1543L5649p955p586r078N97O172l2944k9850l274K0125K4386K5244J3301
$$ plain form
15900 27727 33204 22526 -19163 -16344 -4402 -30835 -23225 -41653 -53557 -35432 -54331 -59624
15888 -59624 -40994 -13249 2919 5142 -13061 -40933 -49090 -15861 9122 9067 -14608 -12913 6418
15875 6418 -191 5233 29654 23616 16843 7143 -23515 -19197 2562 3124 -6832 -25140 -19431 -7488
15861 -7488 1727 -405 -29153 -8856 -13300 -1647 15962 19602 30233 26506 -4689 -5464 24590
15848 24590 6817 22394 30980 56256 57962 45987 37103 19702 -13832 8232 20867 -88
15836 -88 -37573 -13557 12 13080 33545 10040 -9416 -407 38576 72462 43525 10115
15824 10115 31944 35856 26751 17897 22050 20658 14492 18575 -2555 -19183 -2674 6978 -11
15811 -11 11532 47181 39226 31640 22562 23159 29331 -3613 -33463 -36737 -16612 7774 33018 46319
15797D6319o1224j6191L6468L7089J7910j1304j3221j6492l384K2967R04j1197
15785B8644k0513l2249n971j838R330R271K1169m533l8596p339Q981q2p611M270
15771c7067J2246j3295J4116L2184J5838j2593j949O653n181r789l20o184P794
15758B453J4834k2318j8414L6272J1228o199K1131j3117J5793m575J6268L489
15746E6845p69j1063L4O477m2457K953l220k1001j8982N33N587O188J1598P770
15732D93O939J8441M805r990j4839M314n23k17K7796p455k18P197l8231N740k270
15717A982Q76j5772k5952J7318L1497K2538l0285k2432j9404K0189O180l552K5276
15704H459j2788K697K7577k9405j5625p48P603J1787J2352j335k027j8523l4542
$$ plain form
15797 46319 -14905 -31096 5372 42461 60371 49067 35846 19354 15970 38937 39841 28644
15785 28644 8131 -24118 -30089 -31927 -22597 -13326 7843 3310 -35286 -42625 -33644 -33726 -41337 -37067
15771 -37067 -24821 -38116 -24000 8184 24022 11429 9480 16133 10952 1163 843 -5341 2453
15758 2453 17287 -5031 -23445 12827 24055 17856 38987 25870 41663 37088 53356 56845
15746 56845 56076 45013 45047 51524 9067 12020 8800 -12201 -31183 -30650 -25063 -18875 -7277 493
15732 493 7432 25873 30678 20688 5849 10163 9640 9423 37219 29764 29546 36743 -1488 4252 1982
15717 1982 2858 -12914 -38866 -21548 9949 32487 2202 -20230 -39634 -19445 -13265 -16817 8459
15704 8459 -4329 -1632 25945 -3460 -19085 -19833 -12230 -443 11909 10574 8547 -9976 -44518
15691d4518k0077M375K5427R539J0829Q534J0811K44p007K1840P991k4298j0937
15678g247j3286k5811j6857L9378L6493J623l8578m5552O407O6324J9471j3335
15666I030L023j434l140m558m640K0113O859J6148K2902j9487j8998n207j471
15653A9140p274p242J2278K1614K0240j2893k8640j1067N554j5243J2243j1026
15641b316l7901l2236R824K0414L3792L6114j7378j0850K5869K1397k2305J2370
15629C6794j073j2675j8392n0295j2047J0218k2463k5899K5034L4680J1888j5319
15617c9549l35J0791o295J9556K9618l0704k5953J7970K2254J5066q007J1608
15605A6020J4330R7l7751j0975J6009j3092l77J5307K4613O573j5754k9901K9025
$$ plain form
15691 -44518 -64595 -60220 -34793 -25254 -14425 -5891 4920 5164 -1843 19997 27988 3690 -7247
15678 -7247 -20533 -46344 -63201 -23823 12670 14293 -24285 -69837 -63430 2894 22365 9030
15666 9030 12053 10619 7479 2921 -1719 18394 25253 41401 64303 44816 25818 20611 19140
15653 19140 11866 4624 16902 38516 58756 45863 17223 6156 11710 -3533 8710 -2316
15641 -2316 -40217 -72453 -62629 -42215 -8423 27691 10313 -537 25332 46729 24424 36794
15629 36794 35721 23046 4654 -45641 -57688 -47470 -69933 -95832 -70798 -36118 -24230 -39549
15617 -39549 -39884 -29093 -35388 -15832 13786 -16918 -42871 -24901 -2647 12419 4412 16020
15605 16020 30350 30447 -7304 -18279 -2270 -15362 -15739 -432 24181 30754 15000 -14901 14124
15592A4124J6058j6237M973P941R005o59k0320p303m6345q680M1181L0545q108
15579A6175J5209N496l104k0026l2587J856o248j8911P448J0778k741J3839M076
15566h740J3871J8876R973j8238m523o656p991R382j8927j0935J5676K8084J6220
15553C6072l197n1820j2556p355J7460K4000k913j0503k889J867k1310J5922J436
15540a5786J7197J2220q80k2994K917r541m09J503K672P754l3803r086K8833j3424
15526c2827q475j8473J436J8474Q819m117k8344m23J2825L1788j0054q458q135
15513d5964n716n322Q423K6143L7765K9534q087j1210r059M537m156l394k6292
15500a2798J7298q420j2765K5979n294m4056n223m966K3279k4827J8579J95L0599
$$ plain form
15592 14124 30182 13945 18918 26859 35864 35205 14885 7582 -38763 -47443 -6262 24283 16175
15579 16175 31384 36880 33776 13750 -18837 -16981 -23229 -42140 -34692 -23914 -26655 -12816 -8740
15566 -8740 5131 24007 33980 15742 11219 4563 -3428 5954 -12973 -23908 -8232 19852 36072
15553 36072 32875 -18945 -31501 -38856 -21396 2604 -309 -10812 -13701 -11834 -33144 -17222 -15786
15540 -15786 1411 13631 12751 -10243 -7326 -16867 -17276 -15773 -13101 -5347 -39150 -48236 -19403 -32827
15526 -32827 -41302 -59775 -58339 -39865 -31046 -35163 -63507 -63930 -51105 -19317 -29371 -37829 -45964
15513 -45964 -51680 -57002 -48579 -22436 15329 44863 36776 25566 16507 21044 16888 13494 -12798
15500 -12798 4500 -3920 -16685 9294 4000 -40056 -45279 -50245 -26966 -51793 -33214 -33019 -2420
15487b420M3633j6699m2297n903K7116J2345l0020l6430Q233L3665j0579j1147
15475c0503K6835r527k2498L224L4365l470l4271j4059K7848m276q567j5692P550
15462d3041M423J5776j0530k8080J7247o622J2398J743M2753q90j4365p450M4996
15449B8358K4566J0041j9363m8937k4513K0504k6120Q247J9984k1953m9233j5229
15437i3648N4635m08J6210K7807j7790l9044O744K6083K9350M009k2951j7749
15425b6752k1915N702K3944K0925M9100J2948k1515j3843j0633k3898m628j1112
15413b1677J2982K8263j6155j4385j0020Q305R580J1944R34j7222L416k2841p364
15400c4240K1961M2063k1071k9293L1465M873J0430r342M371l5151l3876j0749
$$ plain form
15487 -2420 41213 24514 -17783 -23686 3430 15775 -14245 -50675 -42442 -8777 -19356 -30503
15475 -30503 -3668 -13195 -35693 -32469 1896 -1574 -35845 -49904 -22056 -26332 -34899 -50591 -43041
15462 -43041 -38618 -22842 -33372 -61452 -44205 -50827 -38429 -36686 6067 5177 -9188 -16638 28358
15449 28358 52924 62965 43602 -5335 -29848 -9344 -35464 -27217 -7233 -29186 -78419 -93648
15437 -93648 -39013 -39421 -23211 4596 -13194 -52238 -45494 -19411 9939 13948 -9003 -26752
15425 -26752 -48667 -42965 -19021 1904 51004 63952 42437 28594 17961 -5937 -10565 -21677
15413 -21677 -8695 19568 3413 -10972 -20992 -12687 -3107 8837 9771 -7451 -4035 -26876 -34240
15400 -34240 -12279 29784 8713 -20580 10885 15758 26188 16846 21217 -13934 -47810 -58559
15388e8559r638K3486N103K033Q951K8757N1p684m827j251L2802J6345R0m0014
15374d355j4605p255k496M4164K1783k5182P194k1100k4699J0078R412O409Qj1447
15360a2091j0120J1469P166j8106o183R354J2906J68J4006l65K7404L3743R90
15347G0341k2717k9771j7401N414m856K0623J196K1100j5994k0878j6797j505
15335a1245M0572j7146l1047j0271j1787k0709K3938P692j0774J5916j3778l681
15323d2320M2923m509k1438j017J4222k6313j2448J3005k0834k4466J4177K0391
15311d8627L1965J5692J032k0417P953L3671L0408k9203l5491j0881M653m492
15299b3737J1865K6213l0282j2529k2194k8903K0724Q752j1611J3427K1246K4354
$$ plain form
15388 -58559 -68197 -44711 -39608 -37575 -28624 133 184 -7500 -12327 -13578 19224 35569 35659 -4355
15374 -4355 -18960 -26215 -28711 15453 37236 12054 19248 -1852 -26551 -16473 -7061 -652 -644 -12091
15360 -12091 -22211 -10742 -3576 -21682 -27865 -18511 -5605 -5437 8569 8204 35608 69351 70341
15347 70341 47624 17853 452 5866 1010 21633 22829 43929 27935 7057 -9740 -11245
15335 -11245 29327 12181 -18866 -29137 -40924 -61633 -37695 -30003 -40777 -24861 -38639 -42320
15323 -42320 603 -3906 -25344 -26361 -12139 -38452 -50900 -37895 -58729 -83195 -69018 -48627
15311 -48627 -16662 -970 62 -20355 -12402 21269 51677 22474 -13017 -23898 -19245 -23737
15299 -23737 -11872 14341 -15941 -28470 -50664 -79567 -58843 -50091 -61702 -48275 -27029 -2675
15287b675P07k521j5682k9948m0934L1112N4700K3565M171j0611j6873J0318K6779
15274C2108N926m927k264j8562j367j1359k3594j2201K6165K0621j9435Q241K8287
15261B7639J552k2242L728K3362m3940l2895O710q190R392M512J3250J0834j5453
15248b1741K739L3460J7885j0462o277l5967j8137r8M44J6769N0777J870j9124
15235A2138J161n906j3425j1517P371K1958j9022j5382r168J830K8548R451l8934
15222c0897p775J3474O502L5546L3177k4158m7534k4678J8077k272R823J4371
15210f344R35J6257J8332K658k0588j3800J6567j0618l1490j0156K4126J9733
15198E612J1631k269q321K2537j3090l728J1855l888q174k2362K9452J7973l158
$$ plain form
15287 -2675 -1968 -4489 -20171 -50119 -91053 -59941 -5241 18324 22495 11884 -4989 5329 32108
15274 32108 38034 33107 30843 12281 10914 -445 -24039 -36240 -10075 10546 -8889 -648 27639
15261 27639 29191 6949 10677 34039 -9901 -42796 -36086 -44276 -34884 -30372 -17122 -6288 -21741
15248 -21741 -19002 14458 32343 21881 15604 -20363 -38500 -38598 -38154 -21385 29392 31262 12138
15235 12138 13299 7393 -6032 -17549 -10178 11780 -7242 -22624 -31792 -29962 -1414 8037 -30897
15222 -30897 -38672 -25198 -18696 16850 50027 25869 -21665 -46343 -28266 -30538 -20715 -6344
15210 -6344 -5409 10848 29180 31838 11250 -2550 14017 3399 -28091 -38247 -14121 5612
15198 5612 17243 14974 6653 29190 16100 12372 24227 20339 12165 -10197 19255 37228 34070
15185C4070k5113M278j6796O44Q105k80L995J7396j351o407o75k1745k5166r006
15171c8051K2553o325j7245l512J8775J3906O786o41j1250J1235K923m2391o808
15158e0045K2316J8356Q037j9768k4328L6777J8995J147j323K1602K7240n279
15146E3727j8922m0534j1309O595k0310P022K6867J8513M821K9099j5446m665
15134C5458J0084l0013l8965j0706K1895l3777o982J7084J9865J5254j6029j8916
15122c5748J5726J741J030j3861J6972n813l4049j9949J1751L1406J1795M945
15110a4054p926P461k2560m3662J8249J0747P304P530J6231J4638j143K244J3520
15097H579j658j820k4255R790j6621j8597p306r122R352O546L3649K275j2226
$$ plain form
15185 34070 8957 13235 -3561 -2917 5188 4908 8903 26299 24948 18541 17866 -3879 -29045 -38051
15171 -38051 -15498 -21823 -39068 -42580 -23805 -9899 -3113 -3754 -15004 -3769 -846 -43237 -50045
15158 -50045 -27729 -9373 -1336 -21104 -45432 -8655 10340 11487 10164 31766 59006 53727
15146 53727 34805 -5729 -17038 -10443 -30753 -23731 3136 21649 26470 55569 40123 35458
15134 35458 45542 15529 -23436 -34142 -12247 -46024 -53006 -35922 -16057 -803 -16832 -35748
15122 -35748 -20022 -18281 -17251 -31112 -14140 -19953 -54002 -73951 -62200 -30794 -18999 -14054
15110 -14054 -21980 -14519 -37079 -80741 -62492 -51745 -44441 -36911 -20680 -6042 -7185 -4941 8579
15097 8579 6921 5101 -19154 -9364 -25985 -44582 -51888 -61010 -51658 -45112 -11463 -9188 -21414
15084b1414l849J3468N251k7875j1789M1186J7279q982R476j4088j1393Q022N606
15071H98K581N816j5203K791l7012k1130K797K6137j440j3127J5798J0414M5469
15058B4789k5564j1667k619J6603N53L4823R465n845J1223j3639j9792L0821O077
15045E5228k0688k8350j8855q5j0871r027K2110N224j3857j8901M202J9007p159
15032b2022p858J0462K9663M859r415K478r592k7973L577K4408P210j1494K6022
15019B0325J3742k3484j6314J968J8478K4765j0264k2321k9025K7626M916j5291
15007d879m065O2411J3381r169m3930k8073J0238N118J0930l2789j7227K679l535
14994c8910R153r789K015q650j4431M205K0737Q540K426k7154L9136J6758O409
$$ plain form
15084 -21414 -25263 -11795 -6544 -34419 -46208 -5022 12257 3275 12751 -1337 -12730 -4708 898
15071 898 3479 9295 -5908 -3117 -40129 -61259 -58462 -32325 -33765 -46892 -31094 -20680 24789
15058 24789 -775 -12442 -15061 1542 2095 36918 46383 40538 51761 38122 18330 49151 55228
15045 55228 34540 6190 -12665 -12750 -23621 -32648 -10538 -5314 -19171 -38072 -33870 -14863 -22022
15032 -22022 -29880 -19418 10245 15104 5689 8167 -1425 -29398 -25821 -1413 5797 -5697 20325
15019 20325 34067 10583 -5731 -3763 14715 39480 29216 6895 -22130 5496 10412 -4879
15007 -4879 -8944 53467 66848 57679 13749 -14324 -4086 1032 11962 -20827 -38054 -35375 -38910
14994 -38910 -29757 -39546 -37531 -46181 -60612 -56407 -35670 -27130 -24704 -51858 -12722 4036 10445
14981A0445m173r487N671J1766l817J7346j5489m0177N907j7121k7165L0012J1553
14968b4729o831K1268j3895j8867K6102N846m286J1349J0523r608j0122Q32j2155
14955b4573Q297m497J4429L758j4679O97m791Q425q085m279O673K0375Q959l6398
14941b5689K7205J5517l082r270o768m340k3524j2068N040K589K5157N0393K6159
14928F7319m5349l2079j482J0376L0797K7953m3696k9147M332j1948j0464l75
14916c3763R103J4660j2389J3998J5669k3265l2304m3525k4356L1557L0909J4499
14904c9207j7845J5674R470J0447m185K4273j3565k9068j1342K0818l278J865
14892c5943M230J2988J9327J6550o773j832l5693j8762R475J6841L2608m971J6905
$$ plain form
14981 10445 6272 -3215 2456 14222 10405 27751 12262 -27915 -22008 -39129 -66294 -36282 -24729
14968 -24729 -31560 -10292 -24187 -43054 -16952 -11106 -15392 -4043 6480 -3128 -13250 -12418 -24573
14955 -24573 -16276 -20773 -6344 -2586 -17265 -16568 -21359 -12934 -21019 -25298 -18625 1750 10709 -25689
14941 -25689 1516 17033 13951 4681 -2087 -6427 -29951 -42019 -36979 -34390 -9233 41160 67319
14928 67319 21970 -10109 -11591 -1215 29582 57535 13839 -15308 -10976 -22924 -33388 -33763
14916 -33763 -24660 -10000 -22389 -8391 7278 -15987 -48291 -91816 -116172 -84615 -53706 -39207
14904 -39207 -57052 -41378 -31908 -21461 -25646 -1373 -14938 -44006 -55348 -34530 -37808 -35943
14892 -35943 -31713 -18725 602 17152 10379 8547 -27146 -45908 -36433 -19592 13016 8045 24950
14879B4950j0141o817k0883j2951M115P923R115Q360N966O890j9788L10N591K3714
14865B6354J5921j3506k1128k0169o829Q472K1647j1166j1459Q518m616o914k0120
14852c4995j7880J3543j8147J5616q739K6016L3907k7737j4400n564J7490M7143
14840B6253J1945k8915o992j1130k9988K246J3626n772M352N121k1070j474L4183
14827g615j6778R396O509l467p059J5470L859J8929R363l678k8363j6474L717
14814a6191J3579j9952k4966O096J7635j4183l261l609r191K4319M459J5165o63
14801a0763m403l1534J4408K6869Q292l842J6587l9428p681K3935r792K72N765
14788a1315j1354j9220p765L1791K4809K0654k959o224l587m596j6516l8057k3797
$$ plain form
14879 24950 14809 7992 -12891 -25842 -21727 -13804 -4689 3671 9637 16527 -3261 -2951 2640 26354
14865 26354 42275 28769 7641 -12528 -19357 -10885 10762 -404 -11863 -3345 -7961 -14875 -34995
14852 -34995 -52875 -39332 -57479 -41863 -50602 -24586 9321 -18416 -32816 -38380 -20890 26253
14840 26253 38198 9283 2291 -8839 -38827 -36581 -22955 -28727 -24375 -19254 -40324 -41798 -7615
14827 -7615 -24393 -14997 -8488 -11955 -19014 -3544 315 19244 28607 24929 -3434 -19908 -16191
14814 -16191 -2612 -22564 -47530 -41434 -23799 -37982 -41243 -44852 -54043 -29724 -25265 -10100 -10763
14801 -10763 -15166 -46700 -32292 -5423 2869 -973 15614 -23814 -31495 -7560 -17352 -17080 -11315
14788 -11315 -22669 -41889 -49654 -17863 6946 27600 24641 18417 14830 10234 -6282 -44339 -68136
14775f8136o407R714L7887r43j2876m0219L262K6867J6725j5112l16L1037J7319
14762a198J073J2849j843l2887j2555K4716P541R267k0771J0584M8763R523l1109
14749B3953l6815J1874Q036p476q25j1967j6542q016K8356K1621K6484k6845k9643
14736a7805N368r495j8007P022L522J1338L4142R121k7834l018J0571r186l7234
14723d1495R876N564J1841J7466J3283j8719r136J0160M594k0015O488P40O753
14710b600k6660l5883j1002N886J2140M9622M5557j5622m3691j5897J3309J7519
14698g322R449k1232j2765j9229r588M237n45J943N4696q441j6981J0161J2202
14685c415j1774p860o661K7670J3995j3391K6465j6369k8380k9903j6592J7067
$$ plain form
14775 -68136 -74543 -64829 -26942 -27885 -40761 -80980 -77718 -50851 -34126 -49238 -49554 -18517 -1198
14762 -1198 -125 12724 10881 -22006 -34561 -9845 -2304 6963 -13808 -3224 45539 55062 23953
14749 23953 -12862 -988 7048 -428 -1253 -13220 -29762 -37778 -9422 12199 38683 11838 -17805
14736 -17805 -12437 -21932 -39939 -32917 -29395 -18057 16085 25206 -2628 -5646 4925 -4261 -41495
14723 -41495 -31619 -26055 -14214 3252 16535 -2184 -11320 -1160 3434 -16581 -10093 -9353 -2600
14710 -2600 -29260 -65143 -76145 -70259 -58119 -8497 37060 21438 -22253 -38150 -24841 -7322
14698 -7322 2127 -19105 -31870 -51099 -60687 -56450 -56995 -55052 -356 -8797 -25778 -15617 -3415
14685 -3415 -15189 -23049 -29710 -2040 11955 -1436 25029 8660 -19720 -49623 -66215 -49148
14673d9148K8733L781j9420l2728L764j4555J3842r114J5843K7546r036j8501
14661e8993l8749j1811K6776J0205n273N6535J3952k613j4706j1942k0998r057
14649f6674j3367m332N2009R980L610j001Q585o347j692l049j3001J874j2413
14636d5818K0304j5616J2178L1004k4156r719J7308J2631p729k2473l6756L134
14624f5708J6762j055k2861j7515N054M704J9883k161K3948J8732j915N289K042
14611a4801r199m4043J4470M0795L649j8568k0971n603k5188l463L7144K7253
14599a8525K3538p191r274p497p043M823N285J3535j0978P872j2451N258J5133
14586B485J6200p392l4221O513Q355J0881J459j9779j4610k0820L7447K9100M856
$$ plain form
14673 -49148 -20415 -16634 -36054 -68782 -65018 -79573 -65731 -74845 -59002 -31456 -40492 -58993
14661 -58993 -97742 -109553 -82777 -72572 -77845 -21310 -7358 -9971 -24677 -36619 -57617 -66674
14649 -66674 -80041 -84373 -32364 -22384 -18774 -19775 -11190 -17537 -19229 -22278 -35279 -33405 -45818
14636 -45818 -25514 -41130 -28952 2052 -22104 -31823 -14515 -1884 -9613 -32086 -68842 -65708
14624 -65708 -48946 -50001 -72862 -90377 -85323 -80619 -60736 -62897 -38949 -20217 -22132 -16843 -14801
14611 -14801 -24000 -68043 -53573 -12778 -9129 -27697 -48668 -54271 -79459 -82922 -45778 -18525
14599 -18525 5013 -2178 -11452 -18949 -25992 -21169 -15884 -2349 -13327 -5455 -17906 -12648 2485
14586 2485 18685 11293 -22928 -16415 -8060 2821 4280 -15499 -30109 -50929 -13482 15618 20474
14573B0474k4990n0668j4621J6110L227J4567J8092L235j2240J8755J6073l5752
14561b7738l1124R584L066K261J1895o55J7312J940K9350R534j3242k8279k2588
14548c8684k617J2160k1048O546K4571K908m778J1629n607j2187J0452k7955J1030
14535c3580K5778L7858k8867M153K3674J5377k0498K0153j5434m1895k551k5224
14523d1056j0716j5806K8024K2421K728m715n720k837j9191K4723N1845j970k4874
14510B856k1984k2650J3803J977O255k0526q851o493J3025L8493j2572Q911J3079
14497E323L9405j6026o7434l898K8292K3353J750j1296k2375l651J2445l0844
14485d4956k1844o894J6077k901j047J1877k8184J7559L5780m467k0947j8362
$$ plain form
14573 20474 -4516 -55184 -69805 -53695 -50468 -35901 -17809 -14574 -26814 -8059 8014 -27738
14561 -27738 -58862 -49278 -46212 -43951 -32056 -32711 -15399 -13459 15891 25425 12183 -16096 -38684
14548 -38684 -41301 -29141 -50189 -43643 -19072 -16164 -20942 -9313 -14920 -27107 -16655 -44610 -33580
14535 -33580 -7802 30056 1189 5342 29016 44393 23895 44048 28614 -13281 -15832 -41056
14523 -41056 -51772 -67578 -39554 -17133 -14405 -19120 -24840 -27677 -46868 -22145 29700 27730 2856
14510 2856 -19128 -41778 -27975 -25998 -19743 -40269 -49120 -55613 -42588 -4095 -16667 -7756 5323
14497 5323 44728 28702 -38732 -42630 -14338 9015 10765 -531 -22906 -26557 -14112 -44956
14485 -44956 -66800 -73694 -57617 -60518 -61565 -49688 -77872 -60313 -24533 -29000 -49947 -68309
14473f8309M4726O229j3492q699l363K9556K5341J782j1042l7954l7430N795J8327
14460d8533K1068K5626n635L847J676o678m995N104j4156k909j3584j2219J8018
14447c3370L5475K4337k5437n194j7476k4218j366J234J1918L3645K0363k7908
14435g997k1550j4341p765L7887J9214K084l1665k5774K7394J0177l0941l38K4647
14422a8968O968J7913J3343k6264k577j5476k5942j739j3579k858M611J3622J433
14409d9513M873J38o556j0744J7381r128M670K9226J178k597M404k3111j3142
14396e2921Q276m36K7359n370j5135K4261l760n76N879l6742j8802Q709L838J7528
14382c7892N390M280J4930K6310L4067Q494p1578l9711L1151K5721K8521j0229
$$ plain form
14473 -68309 -23583 -17354 -30846 -39545 -42908 -13352 11989 13771 2729 -35225 -72655 -66860 -48533
14460 -48533 -27465 -1839 -7474 -3627 -1951 -8629 -13624 -8520 -22676 -25585 -39169 -51388 -33370
14447 -33370 2105 26442 1005 -4189 -21665 -45883 -47249 -46015 -34097 -452 19911 -7997
14435 -7997 -29547 -43888 -51653 -13766 5448 7532 -24133 -49907 -22513 -12336 -43277 -43615 -18968
14422 -18968 -12000 5913 19256 -7008 -9585 -25061 -51003 -52742 -66321 -69179 -64568 -50946 -49513
14409 -49513 -44640 -44502 -51058 -61802 -44421 -53549 -48879 -19653 -18475 -21072 -16668 -39779 -52921
14396 -52921 -44645 -45081 -17722 -23092 -38227 -13966 -17726 -18302 -12423 -49165 -67967 -59258 -55420 -37892
14382 -37892 -32502 -28222 -13292 13018 47085 55579 -15999 -55710 -24559 1162 29683 19454
14370A9454l2198j1958O137N623l1895P863L3673K314r777M021o737j6726L311
14357b6895j3987J3440j9814j3760M636J8285K3356l288m1985j355R015K550J3734
14344c6068k5082L1564J3620k3631j0714J2613p032M943j054J7100J5719j8119
14332b6141r891L865O365l2028m986N863o755J3191M9148l3062k5728K7888J2109
14319b0162k4398J2867R982L0312j0345j1972K768M780p998k9208O53k5146J595
14306f6272J3609q00J0386J1249N604K086l3299M845r269j0875K2267L1546P563
14293a1360q849k7150j6356J8989J106j5973j4592K4388L841m76N599J5162J1147
14280a4524l3635l2241K4553L723k3186j2822K6131J8709l261N188k4044J548
$$ plain form
14370 19454 -12744 -24702 -18565 -12942 -44837 -36974 -3301 -987 -10764 -6743 -13480 -30206 -26895
14357 -26895 -40882 -27442 -47256 -61016 -56380 -38095 -14739 -18027 -60012 -61367 -52352 -49802 -36068
14344 -36068 -61150 -29586 -15966 -39597 -50311 -37698 -44730 -39787 -40841 -23741 -8022 -26141
14332 -26141 -36032 -32167 -25802 -57830 -62816 -56953 -63708 -50517 -1369 -34431 -60159 -32271 -20162
14319 -20162 -44560 -31693 -21711 8601 -1744 -13716 -10948 -6168 -14166 -43374 -42721 -67867 -66272
14306 -66272 -52663 -53463 -43077 -31828 -26224 -24138 -57437 -52592 -61861 -72736 -50469 -18923 -11360
14293 -11360 -20209 -47359 -63715 -44726 -43620 -59593 -74185 -49797 -45956 -46432 -40833 -25671 -14524
14280 -14524 -48159 -80400 -55847 -52124 -75310 -88132 -62001 -43292 -46553 -41365 -65409 -63861
14268f3861K5280P543k5313J927L5858n440Q972k069j410j5899m905J3317N10
14255b5490k6764o948K273N106j0058Q675J6926Q884K655k3780j1129j9077J586
14242g7141K0757L1089J1384L623j4601Q9J9520P355k3148k4664j112K9044M8358
14229C0553K8327m3261n5328j2926J8143q541K3116J7114N732J474n643j0546
14217a1786J5302K1205k939N676K3994o123l8708n5513k5164r864j5753K9186
14205g0487L9186k143O146R092k4259r253K5744J4748o986j368J4675k749J793
14192e861K181j0912k1817j6487n754J6505j5499P098L5358J2814k9175p379K5299
14179a3629j5373m1351o9763k9601K3360M7704M1455Q401k213p491j5308n989
$$ plain form
14268 -63861 -38581 -31038 -56351 -54424 -18566 -24006 -15034 -17103 -18513 -34412 -39317 -26000 -25490
14255 -25490 -52254 -59202 -56929 -51823 -61881 -53206 -36280 -27396 -24741 -48521 -59650 -78727 -77141
14242 -77141 -56384 -25295 -13911 -10288 -24889 -24800 -5280 2075 -21073 -45737 -46849 -17805 30553
14229 30553 58880 15619 -39709 -52635 -34492 -43033 -19917 -2803 2929 4403 -1240 -11786
14217 -11786 3516 24721 21782 27458 51452 45329 6621 -48892 -74056 -83920 -99673 -70487
14205 -70487 -31301 -33444 -27298 -18206 -42465 -51718 -25974 -11226 -18212 -19580 -4905 -7654 -5861
14192 -5861 -3680 -14592 -36409 -52896 -58650 -42145 -57644 -50546 -15188 -2374 -31549 -38928 -13629
14179 -13629 -29002 -70353 -140116 -169717 -146357 -98653 -57198 -48797 -51010 -58501 -73809 -79798
14167g9798P077M8250L268j2336q664K6617Q760l0902J1909M2585k8583k7128
14155c8945p319J6436K901k4187k1222M053K402J2161J8417j495j3199J2584J1894
14142b5519J4123K512k5433J5160j9011J984J7660O376n205J0384q412m727K6686
14129F578L3693k6741k5644M485J5718o326m0564k3438J8323L383n969K2217J3941
14116a0344K4717q347j212j027j253J6940j9880l91M642k9004l7737P936K256
14103e2704J6930N5277M9242R566l3219m4926k7484j272n310K5924Q020k5988
14091b5944o563R766l076R57K7084l2023J2208L3583P589R912p395L646R533k4578
14077A4699k6560r417J8656n72k1810o394L4110J8258k8215j5612j1673K8725
$$ plain form
14167 -79798 -72721 -24471 -21203 -33539 -42203 -15586 -6826 -37728 -25819 16766 -11817 -38945
14155 -38945 -46264 -29828 -26927 -51114 -72336 -68283 -65881 -53720 -35303 -36798 -49997 -37413 -25519
14142 -25519 -11396 -8884 -34317 -19157 -38168 -36184 -18524 -12148 -17353 -6969 -15381 -20108 6578
14129 6578 40271 13530 -12114 -7629 8089 1763 -38801 -62239 -43916 -40533 -46502 -24285 -10344
14116 -10344 14373 6026 4814 3787 2534 19474 -406 -797 3845 -25159 -62896 -54960 -52704
14103 -52704 -35774 19503 68745 78311 45092 166 -27318 -28590 -33900 -7976 44 -25944
14091 -25944 -32507 -22741 -25817 -24860 2224 -29799 -17591 15992 23581 33493 26098 29744 39277 14699
14077 14699 -11861 -21278 -2622 -3194 -25004 -31398 2712 20970 -7245 -22857 -34530 -5805
14065e805k7433k4543L0918j5955m8659K0604P6100J0666m9168j3042L423M421
14053c8473n448L3875J3305L414n1409n687K6830k1743j5562r272J503J1162M3823
14040a3682M210l6886m21R86k8515J2843J5416J8333J1626j3555k7836p141J4501
14027e0121J5031K1083R248j2391J1120J3218L67k950r047j0279K6044J5728j8669
14014H382l0427p612J6144k783r979q037l9633K9314J1549j7894N229J8412J2440
14001a4895K9107M206j2000m708l8569k9386R404K3169J4313o647M5361J9078
13989C8433m3747q052M4823L3370n1740l9528p662l4225J0506N8125J0813j2655
13977a539j8618q317J3755O702J2365K673K643j7472l9512k5843J2189J5780m858
$$ plain form
14065 -5805 -33238 -57781 -26863 -42818 -91477 -70873 5227 15893 -33275 -46317 -42894 -38473
14053 -38473 -43921 -10046 3259 6673 -44736 -50423 -23593 -45336 -60898 -70170 -68667 -57505 -13682
14040 -13682 -9472 -46358 -46779 -45793 -74308 -61465 -46049 -27716 -16090 -29645 -57481 -64622 -50121
14027 -50121 -35090 -14007 -4759 -17150 -6030 7188 7555 4605 -4442 -14721 11323 27051 8382
14014 8382 -22045 -29657 -13513 -16296 -26275 -34312 -73945 -44631 -33082 -50976 -45747 -27335 -14895
14001 -14895 14212 18418 6418 1710 -36859 -66245 -56841 -33672 -19359 -26006 19355 38433
13989 38433 -5314 -13366 31457 64827 13087 -26441 -34103 -68328 -57822 303 11116 -1539
13977 -1539 -20157 -28474 -14719 -8017 4348 7021 9664 -7808 -47320 -73163 -60974 -45194 -50052
13964e0052j5880O627o872m40R528M5651J3484O314q171J9802k0265j3965k655
13951a6894J1412l58J1961k6093M340K6718m4223l6107R325J4451L5193J2820
13939B545l3906l6654l3371K2075M2480K1635k0515k7631k9801j707J7181J1459
13927f6210M1937M0597P358j2381m6248j7122L4770P71k7266r232R770j2153P872
13914d7537k3245J9978J1675j4766J1958J5810k7059r089J5576o990J035J390
13902e1264r393P010J4324q826o23j1654J5622J5677j2872K2157K6151L7744R40
13889D4993m2587k9745o91L2439K0459m291j7007k6689J1602J5600R731K1852
13877C5666J1975k3015m7081j9639J3699O941K0019J8665J1643q197l138J0669
$$ plain form
13964 -50052 -65932 -59305 -66177 -66617 -57089 -11438 2046 8360 189 19991 -274 -14239 -16894
13951 -16894 -5482 -5840 6121 -19972 -15632 11086 -33137 -69244 -59919 -45468 -10275 2545
13939 2545 -31361 -68015 -101386 -79311 -36831 -15196 -35711 -63342 -93143 -94850 -77669 -66210
13927 -66210 -24273 16324 23682 11301 -34947 -52069 -17299 -16528 -43794 -53026 -43256 -55409 -47537
13914 -47537 -70782 -50804 -39129 -53895 -41937 -26127 -53186 -62275 -46699 -53689 -52654 -51264
13902 -51264 -60657 -53647 -39323 -48149 -48772 -60426 -44804 -29127 -41999 -19842 6309 44053 44993
13889 44993 2406 -27339 -28030 4409 24868 20577 3570 -23119 -11517 4083 13814 35666
13877 35666 47641 24626 -22455 -42094 -28395 -21454 -1435 17230 28873 20676 17538 28207
13865B8207m367J0614j540k0959k6156J5762R151j0352j472r074j1452O260j2482
13852b7860Q392Q288j5403P537J0050J3880o532K2731j3032j5995K9248p696m5270
13839c1662m948J5483J6105j5550k4688J6335o404j2221J2114q713j192J033l470
13826d7778N313J9787j7835N787J8682j7622L295m851l0930r100L5277L8027q942
13813a0890k586j1427k3276J1036l98J5583m340j0294K8998L1312p076r501m0075
13800c2934j5103J0412K5247j2498J9597J9778j2631j2950L8244J5720j6483k6389
13788A0k3913J3877N037n726K740J1222j6056j0451M8433K4778l6825N057j7886
13775B97k9077j4368j152L4927K1564j0780K3022j7749J901k5491k2126j1684
$$ plain form
13865 28207 23840 34454 32914 11955 -14201 1561 10712 360 -1112 -10186 -21638 -15378 -27860
13852 -27860 -19468 -11180 -26583 -19046 -8996 4884 -1648 21083 8051 -7944 21304 13608 -31662
13839 -31662 -36610 -21127 -5022 -20572 -45260 -28925 -35329 -47550 -35436 -44149 -45341 -44308 -47778
13826 -47778 -42465 -22678 -40513 -34726 -16044 -33666 -30371 -35222 -66152 -75252 -39975 -1948 -10890
13813 -10890 -13476 -24903 -48179 -37143 -37541 -21958 -26298 -36592 -7594 23718 16642 7141 -32934
13800 -32934 -48037 -37625 -12378 -24876 -5279 14499 1868 -11082 27162 42882 26399 10
13788 10 -23903 -10026 -4989 -10715 -7975 3247 -12809 -23260 25173 49951 13126 18183 297
13775 297 -28780 -43148 -44300 -9373 12191 1411 24433 6684 8585 -16906 -39032 -50716
13763e0716r177O6852J0845l2596l1069K5757L8249k3279j9897o393J07k420J5027
13750a8710J1187j0477j3872p747N847J1241J8129q56k166k3482m487J7690J8583
13737H80j616j196k271J0536o017k314J6820L185N726p267j8803n082k1790J6765
13723a2444n184o110n592p788M4881K2314j0631K2864k0373j0601J6027k003k8021
13710b661j2109m315P236J7948j1092k8337J485J5424J8884k5096L0813J5420
13698B3600k2869j1457j2480l785J6378j0264K8280K2969j0981j626k1639k9904
13686c3778L1694Q712N674L25L1594j3100l8668p384k3537r308m52J690M2785
13673c753K090M241M076k433O874J5707j157j9574j5K4650j5315j1561j3373j5128
$$ plain form
13763 -50716 -59893 6959 17804 -14792 -45861 -20104 18145 -5134 -25031 -31424 -31317 -33737 -18710
13750 -18710 -7523 -18000 -31872 -39619 -33772 -22531 -4402 -5258 -7424 -30906 -35393 -17703 880
13737 880 -736 -1932 -4203 6333 316 -1998 14822 18007 23733 16466 -2337 -7419 -29209 -12444
13723 -12444 -17628 -23738 -29330 -37118 7763 30077 19446 42310 21937 11336 27363 25360 -2661
13710 -2661 -14770 -19085 -11849 6099 -4993 -33330 -31845 -16421 2463 -22633 8180 23600
13698 23600 731 -10726 -23206 -26991 -10613 -20877 7403 30372 19391 17765 -3874 -33778
13686 -33778 -2084 6628 12302 12627 44221 31121 -7547 -14931 -38468 -47776 -48228 -46538 -3753
13673 -3753 -1663 2578 6654 4221 11095 26802 25645 6071 6056 30706 15391 3830 -9543 -24671
13659b4671k745J4023k4926j9748M770K0857Q32N7873K7286k5785n9668k1359
13647e3261M0638J0531k3286n5334J7705O4364K3331l4444j0793j8974K3670L7283
13635B1430j5444j7050m269j5650R594J7809j4301K377J8931j861k7569k8867
13623e4870n628L530K3985K6432K907j983J9051k937K0587L0844j2174P186J2935
13610F9865k1278k2846m1332r941J4603o542j8487O822j990j3108K685K930j6255
13597e4874j3006J3600J5404K3309n323J1950k6505k4669O6570K6484k3425o0106
13585e0591J7028K1943j6001l064K5575r443J5089K9093j9923m9211K583L4893
13573b029j8052k054j9026r71j644l274j1177j1434j2812L3624L9510M1631J9751
$$ plain form
13659 -24671 -27416 -13393 -38319 -58067 -53297 -32440 -31608 26265 53551 27766 -31902 -53261
13647 -53261 -12623 -2092 -25378 -80712 -63007 1357 24688 -9756 -20549 -39523 -15853 21430
13635 21430 5986 -11064 -15333 -30983 -21389 -3580 -17881 -15504 3427 1566 -26003 -54870
13623 -54870 -60498 -56968 -32983 -6551 -3644 -5627 13424 10487 31074 61918 49744 56930 69865
13610 69865 48587 25741 -15591 -25532 -10929 -17471 -35958 -29136 -31126 -44234 -41549 -38619 -54874
13597 -54874 -67880 -54280 -38876 -15567 -20890 -8940 -35445 -60114 6456 32940 9515 -50591
13585 -50591 -33563 -11620 -27621 -30685 -5110 -14553 536 29629 9706 -39505 -36922 -2029
13573 -2029 -20081 -22135 -41161 -42132 -43776 -47050 -58227 -69661 -82473 -48849 -9339 32292 52043
13560E2043N691j1038j0018k5674k5984K167M2506J1045l8219k1531R477J4116
13548D581M794M874q763j214O230j3966J0747R670j2298k0782J8459J2610j8999
13535d057K031J8940k2613k7235j9761j8176j836K4509M725J64K8622O107N600
13522b980m9555J3333J7435k552l8699q747J1919M6394M3159r331j9784k534k731
13509d673J709P346k8579j3438J0896j0680P076M324J8368l0521O228r702Q318
13496c3328K883K310o85J0258J417R787j8381J184l767J3745L9063M011m8572
13483b0075j8423J8008J3652p582n613k1831J7696N7111J3716L368j4435j7716
13471A7876k4095j3837j2292j6272N812J8960N955K150k596P412L926K1698J1260
$$ plain form
13560 52043 57734 46696 36678 11004 -14980 -12813 29693 40738 2519 -19012 -9535 4581
13548 4581 9375 14249 5486 4272 10502 -3464 7283 16953 4655 -16127 2332 14942 -4057
13535 -4057 -2026 16914 -5699 -32934 -52695 -70871 -72707 -48198 -43473 -43309 -14687 -8580 -2980
13522 -2980 -52535 -39202 -21767 -24319 -63018 -71765 -59846 -13452 29707 20376 592 -1942 -4673
13509 -4673 -2964 4382 -24197 -37635 -26739 -37419 -30343 -26019 -7651 -38172 -31944 -41646 -33328
13496 -33328 -30445 -28135 -28820 -18562 -17145 -7358 -25739 -24555 -28322 -14577 24486 28497 -20075
13483 -20075 -38498 -20490 -6838 -14420 -20033 -41864 -24168 32943 46659 50027 35592 17876
13471 17876 -6219 -20056 -32348 -48620 -42808 -23848 -17893 -15743 -18339 -10927 -7001 14697 25957
13458B5957j129k0087k4352P209P712M759P059j1578M066p560k8796j1552J2159
13445c6133J076m0094l270M9828J0185k8561j175R43n332J1031O248j4823J2956
13432c7121J9651l2015J2319m175O147J232Q070O319K1302J992j1653p385j4983
13419c0300j9883M7838J6123j6248l0444P298j1468K5818o781L020j1821j3942
13407d0790K1726j4794J431K9588K5619k6171J0626J0171j4277k8988R980n81
13395a6460m710P320P654n2022j1486L6011L706q873j8903r784L5586R432N138
13382a7391k2717p139j699J2331K7931K3127k5548j0786P390K8360j6206Q577
13370F230J6483o94j2825j4662k5543J703J3570l342l4833j5543J7961l291J5636
$$ plain form
13458 25957 24828 4741 -19611 -12402 -4690 69 7128 -4450 -384 -7944 -36740 -48292 -36133
13445 -36133 -35057 -75151 -78421 -28593 -18408 -46969 -48144 -47201 -52533 -41502 -35254 -50077 -37121
13432 -37121 -17470 -49485 -37166 -41341 -35194 -33962 -25892 -19573 1729 3721 -7932 -15317 -30300
13419 -30300 -50183 -2345 13778 -2470 -32914 -25616 -37084 -11266 -18047 -15027 -26848 -40790
13407 -40790 -19064 -33858 -32427 -2839 22780 -3391 7235 17406 3129 -25859 -15879 -16460
13395 -16460 -21170 -13850 -6196 -58218 -69704 -33693 -29987 -38860 -57763 -67547 -31961 -22529 -17391
13382 -17391 -40108 -47247 -48946 -36615 -8684 14443 -11105 -21891 -14501 13859 -2347 6230
13370 6230 22713 22019 9194 -5468 -31011 -29308 -15738 -19080 -53913 -69456 -51495 -54786 -39150
13357c9150l5624k3328J4436K1459J9621J1531m162k5584k921K2074J294K3297
13345a7057J4344m099M397j5657J2794J2412J8197N58m2314j18L1062p727j8372
13332a1580j122L6320j4719j5874n957J3982K8176L9557k2867l4457p42j5669
13320d952l6004r997J0912O042J3664K6122j0753K2987p583m2146q899L0305J6440
13307F138j2444k5624m4866J9783M4177K2875j0892j7529L219j1667M832k3173
13295d5171j284P632j7424N21L2911J0065K2021J1693l329j2632m0623j6525k7730
13282g9875Q944J6208P641K259m212N099K4378N762j9561o03L795l67O766L253
13268b0513J4379l1340p225J6524k5412m4824L4286M3451j3749k6373J1093J109
$$ plain form
13357 -39150 -74774 -98102 -83666 -62207 -42586 -31055 -35217 -60801 -63722 -41648 -40354 -17057
13345 -17057 -2713 -6812 -2415 -18072 -5278 7134 25331 25889 -16425 -16543 14519 6792 -11580
13332 -11580 -12702 23618 8899 -6975 -12932 1050 29226 68783 45916 11459 10717 -4952
13320 -4952 -40956 -50953 -40041 -33999 -20335 5787 -4966 18021 10438 -31708 -40607 -10302 6138
13307 6138 -6306 -31930 -76796 -57013 -12836 10039 -853 -18382 -15163 -26830 -21998 -45171
13295 -45171 -46455 -38823 -56247 -55726 -22815 -12750 9271 20964 17635 5003 -35620 -52145 -79875
13282 -79875 -70931 -54723 -47082 -44823 -49035 -43936 -19558 -13796 -33357 -33960 -30165 -30532 -23766 -20513
13268 -20513 -6134 -37474 -44699 -28175 -53587 -98411 -64125 -20674 -34423 -60796 -49703 -48594
13256d8594J0054J1633M513k5550j1946Q391k3881l596L6446L2882n387q421j3269
13243c6725q311L3731J0554J2887j9864k2251N12j6065m530J1445K1186J0636
13231f795j9536j2914j2950J0631J2898O575K6570j5117j6097J7846K6151j0699
13219F563j6788K689l6806P336L0861K5520P707M360j1045k58M7367N590m5108
13206B7988k8377L9229J792m6756N245K7571j3592j3324k7652R742m232K381K7202
13193G217N0136P392p717k3557k2520l2909K8173L2344k3022m0958k4994p46K6554
13180b4607o771j3721l763J4639L2084J1328P163J9005k8889k2027l1340j0664
13168e7563K8705K0448k2894j7131j3658K2376p956p142M4528K6206L803k6935
$$ plain form
13256 -48594 -38540 -26907 -22394 -47944 -59890 -51499 -75380 -78976 -42530 -9648 -15035 -23456 -36725
13243 -36725 -45036 -11305 -751 12136 -7728 -29979 -29467 -45532 -50062 -38617 -17431 -6795
13231 -6795 -26331 -39245 -52195 -41564 -28666 -22091 4479 -10638 -26735 -8889 17262 6563
13219 6563 -10225 -7536 -44342 -37006 -6145 19375 27082 31442 20397 20139 67506 73096 27988
13206 27988 -389 38840 40632 -6124 -879 26692 13100 -224 -27876 -18134 -22366 -19985 7217
13193 7217 57353 64745 57028 33471 10951 -21958 6215 38559 15537 -25421 -50415 -51161 -24607
13180 -24607 -31378 -45099 -48862 -34223 -2139 9189 16352 35357 6468 -15559 -46899 -57563
13168 -57563 -28858 -8410 -31304 -48435 -62093 -39717 -47673 -54815 -10287 15919 19722 -7213
13156g213m8869Q160M8528K2788P18l0691j6412J8784O145J261j2359J1147J3017
13143A5004l468n493k0903o093k5857j9777J4772J7642K8169K5314k2748J840
13131a598k0083M47K4065k976J8650K49k6893j5835J2225J1395J7282m4843l4441
13118f2356N456K1625m685M7200M5089k7000m9011N051O984Ln937j5561R6j170
13104c4216J2884J0287m2381L760M4978Q47j5804k2543j671J3585K3513l826j8770
13091b9357k684n221l4902j760M6561P2385J4212k4613n3612j2712J7652J0285
13079c766K6633O771m5126q269K964j5494O898K0063r088O427q347n2779K7481
13066d5632M1361L3220o631j9400j3740j9834q202J0995j3684k4472L381p927
$$ plain form
13156 -7213 -56082 -47922 606 23394 24112 -6579 -22991 -4207 1938 3199 -9160 1987 15004
13143 15004 11536 6043 -14860 -20953 -46810 -66587 -51815 -34173 -6004 19310 -3438 -1598
13131 -1598 -21681 -21234 2831 -145 18505 18754 -8139 -23974 -11749 -354 16928 -27915 -62356
13118 -62356 -56900 -35275 -39960 7240 52329 25329 -23682 -18631 -11647 -11644 -17581 -33142 -33046 -34216
13104 -34216 -21332 -11045 -53426 -49666 -4688 -3841 -19645 -42188 -43859 -30274 -6761 -10587 -29357
13091 -29357 -32041 -37262 -72164 -73924 -27363 45022 59234 34621 -18991 -31703 -14051 -3766
13079 -3766 22867 29638 -15488 -23757 -20793 -36287 -29389 -9326 -18414 -11987 -20334 -73113 -45632
13066 -45632 -4271 28949 22318 2918 -10822 -30656 -38858 -27863 -41547 -66019 -62638 -70565
13054g0565L1281J6826j3623j4932J0951j1047K1383J5639J1713q811J4229K4024
13042B7068o959J1531o407j2461L430j476J8102k58j2208p886R565L7371L296
13029F2708n8508j4195M0519K5017p580l4631j6784k0034k0305L229O997k6442
13017f0009j8711J4753J4741P803J0137K507L4770J8965j1871k6525Q359P658
13005B577q593j2939K8231M2139L754j1589k3162O013l2336j2393j161M0526J483
12992B2550O53l8387j389K1967K8667l590k4k4728J4875k596k8733j3872r63K7551
12978A981K3786J7230Q586l2750l1490j1877K9179K891j0568o525p114M9864M833
12965C8026o290l1090j9643L544J5376J6992O442k0530J8283m426j2835M661m04
$$ plain form
13054 -70565 -39284 -22458 -36081 -51013 -40062 -51109 -29726 -14087 -2374 -11185 3044 27068
13042 27068 20109 31640 25233 12772 16202 14726 32828 32570 20362 12476 22041 59412 62708
13029 62708 4200 -9995 30524 55541 47961 13330 -3454 -23488 -43793 -40564 -33567 -60009
13017 -60009 -78720 -63967 -49226 -41423 -31286 -28779 5991 24956 13085 -13440 -5081 2577
13005 2577 -6016 -18955 9276 51415 55169 43580 20418 26431 -5905 -18298 -19459 21067 22550
12992 22550 23203 -15184 -16573 5394 34061 30471 30447 5719 20594 17998 -10735 -24607 -25570 1981
12978 1981 25767 42997 51583 18833 -12657 -24534 4645 7536 -3032 -9557 -16671 33193 38026
12965 38026 31736 646 -18997 -15453 -77 16915 23357 2827 21110 16684 3849 8510 8106
12952H106K8407L9136J6500p891J8287J1921P721P1534O1699M0252J01107J29132
12940E25911J45667K35312K29343J90901J50173J020j62758k65392k76893k00229
12930E73055j43880p2014o8720l8720m8955l3515K0938L0293J2743l8478m0875
12919A51872L2558j0543l2831j5342j2530J3397J072j8052R975J0738k819j5163
12907A12332l914j877L1368k566j0306m0519l5505k6230J6058N285J4749J6905
12895G5780k7710l0653J1230J769q265J7176O200j0767j2519j0931l0362k588
12883b1640j3400K9582J2626K2942J5887J1114J834k3907P428J0605k144L9060
12871H9987K6346o272J1417k1866J8475j8102k4590j4203Q154l167l2115j2715
$$ plain form
12952 8106 36513 75649 92149 84258 102545 114466 122187 193721 255420 295672 396779 525911
12940 525911 671578 906890 1136233 1327134 1477307 1478327 1315569 1050177 773284 573055
12930 573055 429175 357161 288441 249721 200766 167251 188189 218482 231225 192747 151872
12919 151872 184430 173887 141056 125714 113184 126581 127653 109601 119576 130314 127495 112332
12907 112332 108418 106541 137909 135343 125037 84518 49013 22783 38841 44126 58875 75780
12895 75780 48070 17417 28647 30416 22151 39327 45527 34760 22241 11310 -19052 -21640
12883 -21640 -35040 -5458 7168 30110 45997 57111 58945 35038 42466 53071 50927 89987
12871 89987 116333 110061 121478 99612 118087 99985 75395 61192 69346 66179 34064 21349
12859B1349j493j8507K136Q491k1729M461O314O620N964J7643M4154J3378l7050
12846E1731j9267k7271j0409M4546n390m046l361J0926j3961k1205J8021J480
12834B1794Q061K2935m385l155R841k4137j0479l3244m02N3403L1276o03K0876
12821I1781R959j5432l4484M670M1k0357N393j5287k1978k5893j3903R849M9635
12808B3994K1123J1161R248J535L808n696j7806j192k2545j8944P378L1033J8274
12795F1371k7996j8032p450J6911N749K1151J5338k8133P532K6875K77P800J5516
12782I6909r745M174n955o7137j6540q979j9449J0434L580J876k3642J1029L7361
12769A3916K1197K845R435L408J5203J3425j7186j4371l275l2431k333j6562l6869
$$ plain form
12859 21349 19856 1349 3485 11976 -9753 -5292 1022 7642 13606 31249 75403 88781 51731
12846 51731 32464 5193 -5216 39330 33940 29894 26533 37459 23498 2293 20314 21794
12834 21794 29855 52790 48405 45250 55091 30954 20475 -12769 -13171 40232 71508 70905 91781
12821 91781 101740 86308 51824 56494 56535 36178 41571 26284 4306 -21587 -35490 -25641 23994
12808 23994 45117 56278 65526 67061 70869 65173 47367 46175 23630 4686 12064 43097 61371
12795 61371 33375 15343 7893 24804 30553 51704 67042 38909 46441 73316 73593 81393 96909
12782 96909 87164 91338 85383 18246 1706 -7273 -26722 -16288 -12708 -10832 -34474 -23445 13916
12769 13916 35113 37958 47393 50801 66004 79429 62243 47872 44597 12166 9833 -6729 -43598
12756d3598J5581L8317J7587o975k096K9557N5915N0902K2412Q507o926J0006
12744A89189R462N1473J6094K6360O126m0937M35r891j6135l5281l0225j1026
12732A55644p917k0072m9392k0424p214j0866j9327J1998J0409k9583J5495q148
12720B0603j85J6172n9p145K4858M8891L7282K3341J48Q449J2212J8483Q342L7432
12706B48824N7583R2123J69080J66615J67930J07463n8431j62358k00174j70726
12696D17929j10736o2220k9042j8155k1048k7066j2581Q338R23k9849l527j495
12684A11471l080j4981j4366q33J3467K9618K6691L4284K7143K7369K3642J5257
12672B75682J4373l8919J487P386k3050J3383M6379K7909J6447L775l5338k1022
$$ plain form
12756 -43598 -28017 10300 27887 20912 18816 48373 104288 155190 177602 186109 179183 189189
12744 189189 198651 250124 266218 292578 298704 257767 258202 248311 232176 196895 166670 155644
12732 155644 147727 127655 78263 57839 50625 39759 20432 32430 42839 13256 28751 20603
12720 20603 20418 36590 36531 29386 54244 103135 140417 163758 163906 172355 184567 203050 211392 248824
12706 248824 306407 398530 567610 734225 902155 1009618 951187 788829 588655 417929
12696 417929 307193 244973 215931 197776 176728 149662 137081 145419 146342 116493 112966 111471
12684 111471 108391 93410 79044 78211 91678 121296 147987 182271 209414 236783 260425 275682
12672 275682 290055 251136 252623 260009 236959 250342 296721 324630 341077 344852 309514 288492
12660B88492l4761l2859l6303l8906j4266j8553M9740k9774k1008j4103j0105
12649H7594p265K4995K5555J2819K1611j8028k7608l7418j2060L6362N9558K7534
12637A93649M3404L0103l2426k0000N1493N4208j6047l4870m758J4632K8509K1892
12625C29789k9393o325R239L1957j923P926N493J1228N593j8031M9942O6542J51166
12612F13203J56702J46017J00145o1445j26004r8382p9620k7055k9701j6041J8943
12601E96762L2583n200K0850N5880N1891N4330J20236J75650K52139L53845M63952
12590B172918N91302P17092P76872O07894J87532m36496r64803r69677p16991
12581A965643m18173k60380j70802m8547m7573q3081l6343l2229o125j8116P066
$$ plain form
12660 288492 253731 220872 184569 145663 131397 112844 162584 132810 111802 97699 87594
12649 87594 80329 105324 130879 143698 165309 147281 119673 82255 70195 106557 166115 193649
12637 193649 237053 267156 234730 214730 266223 320431 304384 269514 264756 279388 307897 329789
12625 329789 300396 294071 303310 335267 333344 341270 346763 357991 363584 345553 395495 462037 613203
12612 613203 769905 915922 1016067 954622 828618 730236 650616 623561 593860 577819 596762
12601 596762 629345 624145 644995 700875 752766 807096 927332 1102982 1355121 1708966 2172918
12590 2172918 2764220 3481312 4258184 4866078 5053610 4617114 3652311 2682634 1965643
12581 1965643 1547470 1287090 1116288 1067741 1020168 937087 900744 868515 862390 844274 851340
12570H51340j0626l9191j1539k1268l6255L1194N2720n02l7153J665k3510n002
12558G51873j6584M725L8307L2885M02J3947M7298k4053J6144J8263K561n749
12546H80019m3839m5457l3861j4398J005k4140j7880R294K1089M4070M364n7097
12534G23169k6723L152K0026L9385L2147l2666Q004P0657N7292P116K1003L6925
12522I59487L252J5206K7327R5203R6881Q1169N7181Q1362J03106R4402J28432
12511A743008J62384J74667K06581K44359K80339L42678M19899N64445P33238
12502D871598Q99707J112247J434660J756995K218616K803726L465708M344868
12494B2908125N748419P707330J0543218J4672685K0559317K7967112L6131146
$$ plain form
12570 851340 840714 801523 789984 768716 732461 763655 816375 815873 778720 780385 756875 751873
12558 751873 735289 740014 778321 811206 811608 825555 872853 848800 864944 883207 885768 880019
12546 880019 836180 790723 756862 742464 743469 719329 701449 710743 731832 775902 780266 723169
12534 723169 696446 699598 719624 759009 791156 758490 766494 837151 894443 901559 922562 959487
12522 959487 962739 977945 1005272 1100475 1197356 1278525 1335706 1417068 1520174 1614576 1743008
12511 1743008 1905392 2080059 2286640 2530999 2811338 3154016 3573915 4138360 4871598
12502 4871598 5771305 6883552 8318212 10075207 12293823 15097549 18563257 22908125
12494 22908125 28656544 36363874 46907092 61579777 82139094 110106206 146237352
12487A46237352M4088329M8186636M1820509K0772236j5933466n2752037o2927222
12480A69492337m9038830l1601081j9658595j2709872q628092o081241m374915
12473C7399711l256203k539370k052471j800746j685625j572903j327994j039394
12465B2125005p51674n45666l90984k05696q6306r5414l43309o72326r02808r87267
12455A7143555r56511r53113q87709q02524p25275o77567o54514n90547n79612
12446A0316183n47955m89280m61755l86843l22797l47178l28526k63484k51490
12437F916875k53473k72519k61045k38815k30503k40346k58720k26974j82518
12428D751962j80860j59623j27315j18709j52430j11177j49230j74413j37059
$$ plain form
12487 146237352 190325681 238512317 280332826 301105062 285171596 232419559 169492337
12480 169492337 120453507 88852426 69193831 56483959 47855867 41774626 37399711
12473 37399711 34143508 31604138 29551667 27750921 26065296 24492393 23164399 22125005
12465 22125005 21373331 20827665 20436681 20230985 20144679 20049265 19705956 19033630 18130822 17143555
12455 17143555 16187044 15233931 14346222 13543698 12818423 12140856 11486342 10895795 10316183
12446 10316183 9768228 9278948 8817193 8430350 8107553 7760375 7431849 7168365 6916875
12437 6916875 6663402 6390883 6129838 5891023 5660520 5420174 5161454 4934480 4751962
12428 4751962 4571102 4411479 4284164 4165455 4013025 3901848 3752618 3578205 3441146
12419C441146j08453j03300r1830q7628q9459r8030q8009p5287p0662o2695m9786
12408B516007o9494m8750o3137m9960j6313P463P612m014L9888J0959n838q6219
12396B238204j27377j22948j06261o3943l5038j7919j3078o3334l1787j2714m8267
12385A595538n3492r252P014L229l8132n5218l6666j5621q88Q23j0174j8075j6578
12372A352508L829k947M874m45m3156l0012K4386k8720k0927L866M7926J2038
12360A323220n268j0153J274M6303M7968K000l2836p3235k3034m516j5266k452
12348A254005j0832K1239Q742k3599k026j4488j80J7001N07k1138j248m041m7601
12335A176341Q246L0282J3370m907J8550P0980K2188L720K6846O0124K3483k9103
$$ plain form
12419 3441146 3332693 3229393 3137563 3049935 2960476 2862446 2774437 2699150 2628488 2565793 2516007
12408 2516007 2446513 2397763 2334626 2284666 2268353 2275816 2283428 2279414 2319302 2330261 2324423 2238204
12396 2238204 2110827 1987879 1881618 1817675 1782637 1764718 1751640 1688306 1656519 1643805 1595538
12385 1595538 1542046 1532794 1539808 1543037 1504905 1449687 1413021 1397400 1396512 1397335 1387161 1369086 1352508
12372 1352508 1356337 1353390 1358264 1357819 1314663 1284651 1309037 1280317 1259390 1263256 1311182 1323220
12360 1323220 1317952 1307799 1309073 1355376 1403344 1405344 1372508 1299273 1276239 1271723 1256457 1254005
12348 1254005 1243173 1264412 1273154 1249555 1247529 1233041 1232861 1249862 1250369 1229231 1227983 1223942 1176341
12335 1176341 1184587 1214869 1228239 1223332 1241882 1312862 1335050 1338770 1365616 1425740 1449223 1420120
12323A420120j625k2174l9819q199J7121J6781Q24j9655J0003j8971j6057N239
12311A343588R339k405k4241L656J6762k747L306J7039m4262n8380J3030J4655
12299A289340j0093l5292m4076o649k033J3687M3538N1181J3827J1696j528l8035
12287A285563j3843M3452K5749M929l6555J6899k0266p164K0805o227n28J3466
12275A326280j042m4886J0206J0381k8142k2930K90j1946k528K6714J6454j2222
12263A266629o743k6914j448l90L554r258j4948k4500j5330K6866O045q570K0925
12250A215918L9793K2142K0689n87J0095j0572j7781k2197k0466Q30Q814j0472
12238A236206K9885K2076O861O10R393m112j3964l7187j199K3957j7878l1463
$$ plain form
12323 1420120 1418495 1396321 1356502 1348303 1365424 1382205 1383029 1363374 1373377 1354406 1338349 1343588
12311 1343588 1352927 1350522 1326281 1329937 1346699 1343952 1347258 1364297 1320035 1261655 1274685 1289340
12299 1289340 1279247 1243955 1199879 1193230 1191197 1204884 1248422 1299603 1313430 1325126 1323598 1285563
12287 1285563 1271720 1315172 1340921 1345850 1309295 1326194 1305928 1298764 1319569 1313342 1312814 1326280
12275 1326280 1325238 1280352 1290558 1300939 1272797 1249867 1250157 1238211 1235683 1262397 1278851 1266629
12263 1266629 1259886 1232972 1231524 1231134 1234688 1225430 1210482 1185982 1170652 1197518 1203563 1194993 1215918
12250 1215918 1255711 1277853 1298542 1297955 1308050 1297478 1279697 1257500 1237034 1237864 1246678 1236206
12238 1236206 1266091 1288167 1295028 1295638 1305031 1300919 1286955 1249768 1248569 1272526 1254648 1223185
12226A223185p607Q406q110J9553K3938K2953j9322j8865J801j731k7518J4440
12214A231123J0968k405R412j0460j1107p769K5982K9250l452j0507k684J45J1978
12201A270474k4983J0688L3079Q876J6233p367o686K3817K1748J4265k8846r350
12189A321948o23j4297k5063k5037q286K7615J3063K0482j238Q502J6334j64k7798
12176A305438k2649K6236L2311K5076l2083p186J1927n0886m0480J121L4509k584
12164A280750J2504M5368L9485O764k5813p741L0686L2266k8411l9077q567J2386
12152A350600O554J7720J6895J1354j037k9913k3952n832o479j6753m556J1846
12140A326447J4370j7457m71j1747O650l406K7286L4489J4758N633n0684O481
$$ plain form
12226 1223185 1215578 1223984 1215874 1235427 1259365 1282318 1262996 1244131 1245932 1244201 1216683 1231123
12214 1231123 1242091 1239686 1249098 1238638 1227531 1219762 1245744 1274994 1271542 1261035 1258351 1258496 1270474
12201 1270474 1245491 1256179 1289258 1298134 1314367 1307000 1300314 1324131 1345879 1360144 1331298 1321948
12189 1321948 1321325 1307028 1281965 1256928 1248642 1276257 1289320 1309802 1308564 1317066 1333400 1333236 1305438
12176 1305438 1282789 1309025 1341336 1366412 1334329 1327143 1339070 1288184 1247704 1248825 1283334 1280750
12164 1280750 1293254 1338622 1378107 1384871 1359058 1351317 1382003 1414269 1385858 1346781 1338214 1350600
12152 1350600 1357154 1374874 1391769 1403123 1402086 1372173 1348221 1342389 1335910 1319157 1314601 1326447
12140 1326447 1340817 1323360 1322889 1311142 1317792 1314386 1341672 1376161 1390919 1396552 1345868 1352349
12128A352349J4674R939M82q326k903j0645l4492k2613j1855j8365J6014L7094
12116A321353O74j6636Q954P597o437j33J4349J5524l5366l2505j1273J0868L9617
12103A316586J8800k7690J014r125l607j341J7321J6448L253J9909J5934o479
12091A361023l5304j8553O807q211M42l9528j707j920j2358Q880K4860L776K285
12078A290492k346J3673J5525J8037p962R966k8238K5896J5552j9124l764K6357
12066A354064j4398n0929r724j9921k3871K3903L5325J870k0135j6162K4629K764
12054A287415J2563J3383j5118N999L147r34l511P395j4753k177P667k1653j3690
12041A265733J6617L2138J1163J0687M071N931M1296M6751M9026Q6390J32100
$$ plain form
12128 1352349 1367023 1376962 1377444 1369118 1366215 1355570 1321078 1298465 1286610 1268245 1284259 1321353
12116 1321353 1322027 1305391 1314345 1321942 1315505 1315372 1329721 1345245 1309879 1277374 1266101 1276969 1316586
12103 1316586 1335386 1307696 1308710 1299585 1295978 1294637 1311958 1328406 1331659 1351568 1367502 1361023
12091 1361023 1325719 1307166 1313973 1305762 1306204 1266676 1264969 1263049 1250691 1259571 1284431 1288207 1290492
12078 1290492 1288146 1301819 1317344 1335381 1327419 1337385 1309147 1335043 1350595 1331471 1327707 1354064
12066 1354064 1339666 1288737 1279013 1259092 1235221 1259124 1294449 1296319 1276184 1260022 1284651 1287415
12054 1287415 1299978 1313361 1298243 1304242 1307389 1306455 1302944 1310339 1295586 1293409 1301076 1279423 1265733
12041 1265733 1282350 1314488 1325651 1336338 1340409 1346340 1387636 1434387 1483413 1569803 1701903
12030A701903J40219J45580J70100K69149K30218J21624l8873k16756k75765k68940
12020A978459j96665j25355j15099q2378k0945k7023k0025k7228j824R952M146
12009A376015n3541m2782K4595j2157l221Q673J773J4234N084L6256K720l0296
11997A327353n0507m6571k6112q640R114P343J7881q248m2462l1562k9250J613
11985A119952M738L6571p257k3054O69J2701p695k0957m1885O238K7153q031p212
11972A091931K622J6293J4921k972k7520J4731j4887m3836j1455K945o167J0964
11960A047570m548m715j2918K5682M25j0512j983k3892n688J1254J7877k2735
11948A015817k4654J5490n576o122J9750m344m3263K8379j8345Q604J0653k4898
$$ plain form
12030 1701903 1842122 1987702 2157802 2426951 2657169 2778793 2739920 2523164 2247399 1978459
12020 1978459 1781794 1656439 1541340 1458962 1438017 1410994 1390969 1363741 1361917 1371869 1376015
12009 1376015 1322474 1279692 1304287 1292130 1288909 1297582 1299355 1313589 1318673 1354929 1357649 1327353
11997 1327353 1276846 1230275 1204163 1195523 1204637 1211980 1229861 1221613 1179151 1147589 1118339 1119952
11985 1119952 1124690 1161261 1154004 1130950 1131619 1144320 1136625 1115668 1073783 1080021 1107174 1099143 1091931
11972 1091931 1094553 1110846 1125767 1122795 1095275 1110006 1095119 1051283 1039828 1042773 1036606 1047570
11960 1047570 1043022 1038307 1025389 1051071 1051496 1040984 1039001 1015109 1009421 1020675 1038552 1015817
11948 1015817 991163 1006653 1001077 994955 1014705 1010361 967098 995477 977132 985736 996389 971491
11936I71491K2547j615n3602j7106J9509K9901p119j2634R744J251k2496J5089
11924I54960O983j1663o516R131J6966p328j1560k4696k3851p936K0298j4164
11912I00624j3622J1483K7131k3811j4778K0256O940J2190q627j1537L445j2560
11900H97134m1561l7935J0359K3778j9713R946M203j5571j8270M759L0594J9006
11888H66729P252j3444L998j2247j424K0920K9896K049o0319l6401M280L643J708
11875H16640j8853l5294k0840Q515O234K6863J7856p544k6091l8955o195Q630
11863G30966j876j6588J0847O1113K5072m649o419l8198J1416J4805k1884k035
11851G62570q189k952r704N313j5951l4332n812N619J5621q094k962L0982R349
$$ plain form
11936 971491 994038 992423 938821 921715 941224 971125 964006 951372 961116 962367 939871 954960
11924 954960 961943 950280 943764 952895 969861 962533 950973 926277 902426 894490 914788 900624
11912 900624 887002 898485 925616 901805 887027 907283 914223 926413 917786 906249 909694 897134
11900 897134 855573 817638 827997 851775 832062 842008 846211 830640 812370 817129 847723 866729
11888 866729 873981 860537 864535 852288 850864 871784 901680 903729 843410 807009 811289 814932 816640
11875 816640 797787 762493 741653 750168 756402 783265 801121 793577 767486 728531 722336 730966
11863 730966 729090 712502 723349 784462 809534 804885 798466 760268 771684 786489 764605 762570
11851 762570 754381 751429 741725 747038 731087 696755 690943 696562 712183 704089 701127 732109 741458
11838G41458O552j6518j5593k4286m543l9650K067J7226l8167j8218K5813n481
11826F30660R121N233J3480N739J419p411L582P101m0763j301K6001P118m9265
11813F10714k5006J6043k5183j7849M0807R988q841M264k0751k2035n503r897
11801E46751o047J9822r620N429j720J3085L6744R903K6085k6079k9646k2717
11789E61990J6627l3962k0235M1971K6654q947J8101k7417k4969K6024k239j5338
11777E58260J2923J6575R09j8291J60o586n874l3622l2751k507j550M267J5067
11764E06980j4079o899K6078K8752j0923R1j7602k3302j2074K5532R863k4415
11752D88002P50O36p717L229q864K656K628l0612K6614L8279J0109m061J012k8550
$$ plain form
11838 741458 748010 731492 715899 691613 687070 647420 649487 666713 628546 610328 636141 630660
11826 630660 639781 645014 658494 664233 665652 658241 661823 668924 628161 626860 652861 659979 610714
11813 610714 585708 601751 576568 558719 599526 609514 600673 604937 584186 562151 556648 546751
11801 546751 540704 560526 550906 556335 554615 567700 604444 614347 640432 614353 584707 561990
11789 561990 578617 544655 524420 566391 593045 584098 602199 574782 549813 575837 573598 558260
11777 558260 571183 587758 588667 570376 570536 563950 558076 524454 491703 489196 487646 491913 506980
11764 506980 492901 486002 512080 540832 529909 530000 512398 489096 477022 502554 512417 488002
11752 488002 488752 489388 481671 484900 476036 478692 481320 450708 477322 515601 525710 521649 522661 494111
11738D94111l7072j0627j6697K8615K1393k772k9615j0263r444l2903k4625J718
11726C71819K9011M7937K2778k5947J702l740j9631q706j5900L2874K6940j4759
11714D44378p423J3216j1173j1160j7352k7734L507j3045O252N1430M5918j6575
11702D60239l3706j037k44K2356K6227q111k7142L7806J0961l4747n1176j5835
11690C85591o716k710p91K9842J3682j8668K3134j9579m6742k5259J3919M2822
11678C88525j0713l1343j5576L0405M35K3272M765J328K2299O72j7837m0148O570
11665C62654j2618j3745K627J3497n648l636K6815K5898j4907m8435r07R696m876
11652C36415j5614M198J0259L922k096j9763K5382j704j1974Q957K662k2037J5670
$$ plain form
11738 494111 457039 446412 429715 458330 479723 476951 447336 437073 427629 394726 370101 371819
11726 371819 400830 448767 471545 445598 447300 443560 423929 415223 399323 432197 459137 444378
11714 444378 436955 450171 438998 427838 410486 382752 386259 373214 379466 430896 476814 460239
11702 460239 426533 425496 425252 447608 473835 465724 438582 476388 487349 452602 401426 385591
11690 385591 378875 376165 375374 405216 418898 400230 423364 403785 357043 331784 345703 388525
11678 388525 377812 346469 330893 361298 361733 385005 389770 391098 413397 414069 396232 356084 362654
11665 362654 350036 336291 338918 352415 346767 343131 369946 395844 380937 332502 331595 341291 336415
11652 336415 320801 324999 335258 339180 337084 317321 342703 340999 329025 337982 340644 318607 334277
11639C34277J7477J125p093m092N2737j5401o2053q465K1791N1k3586k6634J7738
11626B97872k1579j4200J5029n206m957m426L6786O300J6474K4647J7462Q723
11614C72925j7440l9590Q479M582l3217j4814J6792J6972o292o325j506J5028
11602C15594r115l995L324j0702j7368P382J0510M244P837o447q084j669R231
11589C00742P312m440q597L125l757K6429k3555r051q009N489K8875l236k996
11576C08331j766J5103j1019n1086J0852J173K554K078J602J9314L1545k4908
11564C03773j5699l7635m642J9273J989o757K623K7220o0j4584L006J2761Q670
11551B99938l6226k4183m345j9475n222n72l4105l5599K8186L8484J0044K1728
$$ plain form
11639 334277 351754 352879 345786 341694 394431 379030 316977 308512 330303 330354 306768 280134 297872
11626 297872 276293 262093 277122 271916 266959 262533 299319 305619 322093 346740 364202 372925
11614 372925 355485 315895 324374 328956 295739 280925 297717 314689 308397 302072 300566 315594
11602 315594 306479 302484 305808 295106 277738 285120 295630 299874 307711 301264 293180 291511 300742
11589 300742 308054 303614 295017 298142 294385 320814 297259 288208 280199 285688 314563 311327 308331
11576 308331 306565 321668 310649 259563 270415 271588 274142 276220 277822 297136 328681 303773
11564 303773 288074 250439 245797 265070 267059 260302 262925 290145 290085 275501 278507 291268 299938
11551 299938 263712 239529 235184 215709 210487 209915 175810 140211 168397 206881 216925 238653
11539B38653J4122K4002J8755k963j6462m7414J6433J3467j4744k139L6911J1767
11527B90388j0110j4110j0435j7750j4761K4586J6993k3854j4981K0136L2184
11516B78286j1417m0596r705j3991L8297O607R231N122r458m2173l9784K0461
11504A90880K1002R880j5915m9238J059N2196p534m575m811k9813j5287L6019
11492A83863R756j6753M1004M3602m260q285k7740n600o858J9496q464N503l228
11479B22036M417o200l314j822J0797p943J2448k3893l1902K1470L6668K0129
11467B52891q197j4884k8886l5411m657J023j627K2707K7658J2472j421k9127
11455A92541l7196m3431j0931K5228L1647k8560j1952M2044M2548j162j7041j2638
$$ plain form
11539 238653 252775 276777 295532 292569 276107 228693 245126 258593 243849 241710 278621 290388
11527 290388 280278 266168 255733 237983 223222 247808 264801 240947 225966 246102 278286
11516 278286 266869 226273 216568 202577 240874 247481 256712 261834 252376 210203 170419 190880
11504 190880 211882 221762 205847 156609 157668 209864 202330 197755 192944 163131 147844 183863
11492 183863 193619 176866 217870 261472 257212 248927 221187 215587 208729 228225 219761 225264 222036
11479 222036 226453 220253 216939 215117 225914 217971 230419 206526 174624 196094 232762 252891
11467 252891 244694 229810 200924 165513 160856 161879 160252 182959 210617 223089 221668 192541
11455 192541 155345 111914 100983 126211 157858 129298 117346 159390 201938 200776 183735 171097
11443A71097L0749L8143j019j9338j6736k3497j2058r73K2259j5194k350n726
11431A65357N130j3366K4031n247k0192m929O911O022J2863k374O563k5808R57
11418A55918K1055j1558O847J0877J0409J5079J1362R8r921j5963l3037l021K0841
11405A78986J1605j4382O336o946j9737r740N970J6660o356l4936r139K3150M3555
11392A85026n415J5361K160k4752k4976q276J2803N959J1864r290l4843j7451
11380A08170L1248L2733K2215K8350n8945k5786k527k9914l0929o3J1463L7087
11368A23102R135j7022M980L470J0912J8773j7732J4780K3528k8705O603j6209
11356A35615n515K0101m896j9122L7122J0414j8690k2021K0803K0165k4389j9459
$$ plain form
11443 171097 201846 239989 238970 219632 202896 179399 167341 166368 188627 173433 171083 165357
11431 165357 170487 157121 181152 175905 155713 150784 157695 163717 176580 174206 180769 154961 155918
11418 155918 176973 165415 172262 183139 193548 208627 219989 220087 210166 194203 161166 158145 178986
11405 178986 190591 176209 182545 175599 155862 146122 152092 168752 162396 127460 118321 141471 185026
11392 185026 179611 194972 197132 172380 147404 139128 151931 157890 169754 160464 125621 108170
11380 108170 139418 172151 194366 222716 163771 137985 135458 105544 74615 74552 86015 123102
11368 123102 132237 115215 120195 123665 134577 153350 135618 150398 173926 145221 151824 135615
11356 135615 130100 150201 145305 126183 163305 173719 155029 133008 153811 173976 149587 130128
11344A30128k376j8158k772m41r840j0889m437j6449K3956j84M456O070Q952J1834
11330A19850O92J1968K7018m583l5142K8342K3496L406J47m3661m0167K3106J4946
11317A29418Q453J0683O020j4232r349o821N20k67J9598m468k1916j2789J555
11304A06405o088L0426J1217P633J258j8383k0235J4321J3249R870N503j3456
11292A41720l1080k6285o267M14Q248K17J5699K0819n280l4814J4730J6999N8
11279A15178k3937k0957J9831K1457j866r968j7347J6885K2234N629j2605K1382
11267A35916j3793k5221p339j074n485j4654L2424Q107j2395m585l644r276L4775
11254A13756L6349l5530k4268j735J9599k5918j426J6039J3150m401j8047k5607
$$ plain form
11344 130128 127752 109594 106822 106381 96541 85652 81215 64766 88722 88538 92994 99064 108016 119850
11330 119850 120542 132510 159528 154945 119803 148145 171641 175047 175194 131533 91366 114472 129418
11317 129418 137871 148554 154574 140342 130993 124172 124692 124425 144023 139555 117639 104850 106405
11304 106405 100317 130743 141960 149593 150851 132468 112233 126554 139803 149673 155176 141720
11292 141720 110640 84355 78088 78502 86750 86967 102666 123485 118205 83391 98121 115120 115178
11279 115178 91241 70284 90115 111572 109706 99738 82391 99276 121510 127139 114534 135916
11267 135916 122123 96902 89563 88489 83004 68350 100774 108881 96486 91901 88257 78981 113756
11254 113756 150105 114575 90307 88572 108171 82253 80827 96866 110016 105615 87568 61961
11242F1961j1104L2369L0386o330J2452J2268k938q562J2869m8356j8381N3827
11230A20461J1476j7743l411J073O839J1927l606K9636L621j6605k1374n331J5770
11217A32733K328j3346k0201q322L906K2674L4748J0114j9457l9175k8335j0847
11205F6820K3225R412j3924K4353N473O594j268M1482J9047r653m0359n0481N482
11192H6203J9716P059K0651j8426m7852l0871K5845P974N927l422J5164j9072
11180F8896J7057L5401l3888J0800J143j8952m88q451k8969L6461L3570l029n332
11167A04219K8955n527l4780m0349O323P154r698J1242n584J8138J935j4158l714
11154F4156J1512p663k5641l391L462j6371J6474j6962J7300R427J1600L2186
$$ plain form
11242 61961 50857 83226 113612 107282 119734 132002 129064 120502 133371 85015 66634 120461
11230 120461 131937 114194 110783 111856 118695 130622 127016 156652 160273 143668 122294 116963 132733
11217 132733 135061 121715 101514 93192 97098 119772 154520 164634 145177 106002 77667 66820
11205 66820 90045 99457 85533 109886 115359 121953 120685 162167 181214 171561 131202 80721 86203
11192 86203 105919 112978 133629 115203 67351 36480 62325 70299 76226 72804 87968 68896
11180 68896 85953 121354 87466 98266 99409 80457 79969 71518 42549 79010 112580 109551 104219
11167 104219 133174 127647 92867 52518 58841 65995 56297 67539 61955 80093 82028 67870 64156
11154 64156 75668 68005 42364 38973 42435 26064 42538 25576 42876 52303 63903 96089
11142I6089K7709J0549j1230j1799j4806m339K4645K0137k0238k0954k8546j4291
11130E2926K2605K169k2607m0155K597M916o000j3937L515M9706m217o909j0359
11117C4250M192P60j4603J3424m370j2538M250j120j6622M4721j738j0980j944
11104C7682l161P942L825N834l682L234K0347J1194j9535r448j8340K0771j8415
11091C8248n958K3041K5406l2440p560N18j3421J0669L2725J5373j0510k5588
11079E0503K5399J1800p913k1353l9648j2318K4163J1905p860r048K5372K8064
11067G9066K2214j5840k0161j3469Q226K4769J4478J1131j3633m6914j7884K0410
11055E2393P324J9214O706P079n971M833o598J6765K4674k8081j3479K4727J6120
$$ plain form
11142 96089 123798 134347 123117 111318 96512 92173 116818 136955 116717 95763 67217 52926
11130 52926 75531 77700 55093 14938 17535 22451 16451 2514 6029 55735 51518 44609 34250
11117 34250 38442 39202 24599 38023 33653 21115 25365 24245 7623 52344 50606 39626 37682
11104 37682 34521 42463 46288 52122 48440 51674 72021 83215 63680 54232 35892 56663 38248
11091 38248 32290 55331 80737 48297 40737 41255 27834 38503 71228 86601 76091 50503
11079 50503 75902 87702 79789 58436 18788 6470 30633 42538 34678 25630 51002 79066
11067 79066 101280 85440 65279 51810 60036 84805 99283 110414 96781 49867 31983 52393
11055 52393 59717 78931 85637 92716 86745 91578 84980 101745 126419 98338 84859 109586 125706
11042A25706m436p692K7159j3161j331L3299J5679J5456J5467k84J2101k8040
11030A89923q170J1834j3255k7642Q27K2933K8173K6983L4887J1382L584j3010
11018B68449Q158l0547k8447j9275l5562J4407J5257O590j664J9207r648K287
11006B09212j3388P495n093k2846l209q886o220q587Q571K9563n918m8066l1166
10993A01462p932O659M999Q746n786k5679r944n258k1968L4158K5116k2331k8350
10980E3892k1493J0065J6998k2959j2596j5004K0513N1289j2526j0181J5120q791
10968F4327j8159n588n0L55K0327J5003j4079J10P66l406m125m798m238l2307
10954A4138J2157K625j554R963p67l33j555p158p113j1299L0982J1488L6j7140
$$ plain form
11042 125706 121270 113578 140737 127576 126245 159544 175223 190679 206146 205862 217963 189923
11030 189923 181753 193587 180332 152690 153517 176450 204623 231606 266493 277875 281459 268449
11018 268449 276607 246060 217613 198338 162776 177183 192440 199030 197366 216573 206925 209212
11006 209212 195824 203319 198226 175380 172171 163285 157065 148478 157049 186612 180694 132628 101462
10993 101462 93530 100189 105188 113934 108148 82469 72525 67267 45299 79457 104573 82242 53892
10980 53892 32399 42464 59462 36503 23907 8903 29416 80705 68179 57998 73118 64327
10968 64327 46168 40580 40530 40885 61212 76215 62136 62246 63012 59606 55481 50683 46445 14138
10954 14138 26295 28920 27366 37329 36562 36229 34674 27516 20403 9104 40086 51574 51610 34470
10940C4470q332n2612k4516J4405K5499q801J2919o239j1011J0563P061J1229
10928D635k0110J306J2546l3446k3606J0448K0372K4590K3660p353j6468L2346
10916B8920j2299K1775J0689l091j9760j041L0083o27j8822k5429k2M433j7511
10903b702p653J0340R58Q275K6424j1152k7003J1437l4022K576Q69K669L3614
10890A4630J9462j2864j5469K4833k7621j5677J5551J2772p569j1007K5311m679
10878A7673j1564J2630p391J230O904j0420j5749R576o5K4448P551m2487j4130
10865b1794L1896J1592k0926l4032R663J3880j9887j3339J482J8803J6124J9857
10853A3319L3798K9245l3239k3765Q478J4686l7104k7301N746K2064j1505o963
$$ plain form
10940 34470 26138 -26474 -50990 -36585 -11086 -19887 -6968 -13207 -24218 -13655 -6594 4635
10928 4635 -15475 -14169 -1623 -35069 -58675 -48227 -27855 -3265 20395 13042 -3426 28920
10916 28920 16621 38396 49085 45994 26234 25193 55276 54649 35827 10398 10376 14809 -2702
10903 -2702 -10355 -15 943 9218 35642 24490 -2513 8924 -25098 -22522 -21653 -18984 14630
10890 14630 34092 21228 5759 30592 2971 -12706 2845 15617 8048 -2959 22352 17673
10878 17673 6109 18739 11348 12578 19482 9062 -6687 2889 2824 27272 34823 -7664 -21794
10865 -21794 10102 21694 768 -33264 -23601 -9721 -29608 -42947 -41465 -22662 -6538 13319
10853 13319 47117 76362 43123 19358 27836 42522 5418 -21883 -16137 5927 -5578 -12541
10841a2541J0150M219m64J6942k95J0288m695m549k713l609l2357l2404Q692K3690
10827a9646p34k6876K2897L631J2280L2724J8575J4023r78k4756m0721k0494J0771
10814a9304j2196k1120j1441K5739J513J9727K6456k6696k694J6545l9665J1582
10802c1554J9571J9468n609j0167r431J4932K6321J9714l3564j926M857l529q421
10789F62n871P835j8642k8828j0465N044P663n711K4394N254N182L327N42k1425
10775c1039j8074K83J8974k376J804N035j3200j4370J9694J8090J0116k5528j2702
10762d3293j2728k8378K1728L831J4544q763k2580j5075K4394K5903J039J1441
10750b7937n569J515m8423l7874J1816K2230J1289J0648J2212J2176k1327J4563
$$ plain form
10841 -12541 -2391 1828 1364 18306 18011 28299 23604 19055 16342 12733 -19624 -52028 -43336 -19646
10827 -19646 -20380 -47256 -24359 -20728 -8448 24276 42851 56874 55896 31140 -9581 -30075 -19304
10814 -19304 -31500 -52620 -64061 -38322 -36809 -17082 9374 -17322 -20016 -3471 -43136 -31554
10802 -31554 -11983 7485 1876 -8291 -17722 -2790 23531 43245 9681 7755 12612 9083 662
10789 662 -5209 2626 -16016 -44844 -55309 -50265 -42602 -48313 -23919 -18665 -13483 -10156 -9614 -31039
10775 -31039 -49113 -48830 -29856 -32232 -30428 -25393 -38593 -52963 -33269 -15179 -5063 -30591 -43293
10762 -43293 -56021 -84399 -62671 -58840 -44296 -53059 -75639 -90714 -66320 -40417 -39378 -27937
10750 -27937 -33506 -31991 -80414 -118288 -106472 -84242 -72953 -62305 -50093 -37917 -59244 -44681
10738d4681M2899J6250k3102l2974j3176M2676Q165r112l1628j7037j1531J60
10726g3091N4005J7697j2525J2497k4484j634K1226L2928Q820q430j257J7773
10714D3525K6020J8868n8114j0629q739q165j0733k3093j0388m408L5127K1365
10702A0636j3811r344J0665q890l3155j46Q494K7961r124l406K5433o29j4941
10689a0257o332R014N746k191j3134l621l1600K2711K9112j7757k3810m397L2156
10676a4360M2739M840k2795j2713J1522l431k7069J811M0144M0440K359k969l4432
10663B6086n1842O696J7265J2535J8972O099J1258q967j2940L141Q265N54r221
10650B7901l2679j5458l379k6052L8990R880j8869P983J5121K2064L7952L0935
$$ plain form
10738 -44681 -1782 14468 -8634 -41608 -54784 -12108 -3943 -13055 -44683 -61720 -73251 -73091
10726 -73091 -19086 -1389 -13914 -1417 -25901 -27535 -6309 26619 35439 27009 25752 43525
10714 43525 69545 88413 30299 19670 10931 2766 -7967 -31060 -41448 -45856 -10729 10636
10702 10636 -3175 -12519 -1854 -10744 -43899 -44045 -35551 -7590 -16714 -20120 5313 4684 -10257
10689 -10257 -16589 -7575 -1829 -4020 -17154 -20775 -52375 -29664 -552 -18309 -42119 -46516 -14360
10676 -14360 28379 33219 10424 -2289 9233 5802 -21267 -19456 20688 61128 63487 60518 26086
10663 26086 -25756 -19060 -1795 10740 29712 35811 47069 38102 25162 28303 36568 37122 27901
10650 27901 -4778 -20236 -23615 -49667 -10677 -797 -19666 -11683 3438 25502 63454 94389
10638I4389J7109l2711k9485J5337M5571M6339O3383P7683Q2916L9081L7966P9530
10626E37108J00428J52612J88889K38287K98936L86270N09809O40855Q49207J074376
10616D976777J240957J374232J358340J125436O91347K35032j14784j67046J75057
10607A0895348O66204J213556J791879K284610K624574K524034J854531O85671
10599B4540407o67245j472530j342286n84507L13342J282314K195068K817365
10591B7081928L125023K775096J584285l24750k303434l288803l102575k189839
10583B3356931j115664j06837O86698J243655J427851J130591K42757j081739
10575B5784243k300641k840575k562627j876439j123083n37901j10275J15674
$$ plain form
10638 94389 111498 78787 49302 64639 110210 156549 219932 297615 380531 419612 457578 537108
10626 537108 637536 790148 979037 1217324 1516260 1902530 2412339 3053194 3902401 4976777
10616 4976777 6217734 7591966 8950306 10075742 10767089 11002121 10887337 10720291 10895348
10607 10895348 11561552 12775108 14566987 16851597 19476171 22000205 23854736 24540407
10599 24540407 23873162 22400632 21058346 20473839 20787181 22069495 24264563 27081928
10591 27081928 30206951 32982047 34566332 34241582 31938148 28649345 25546770 23356931
10583 23356931 22241267 22134430 22821128 24064783 25492634 26623225 26865982 25784243
10575 25784243 23483602 20643027 18080400 16203961 15080878 14542977 14432702 14548376
10567A4548376J69841M4314l90854r38372j415607j586139j464319j178003q78768
10558F910469p08471n52557m34981l12215k77129k61114k30543k38726j87573
10549C707160j66754j52893j70131j68636j61316j43767r9124j10447r7082j15543
10539B321467j18094q9546r4700o6268r6756j02168r3099q3145r7092o1873o1817
10528A356909o6651m1462m4584n5134o7744n1765k0309j6165k2633o2508n8442
10517H49512l0241k3213k4820o123n0189k9420j2666m025J5422l0779p6295n754
10505E71409o676j1037N97J6341l2771j9633j9936j6939j8776n434J6897j6272
10493D57770m6038j8651n792J4702l779K0076m6119m7361m0154R74r841j4957
$$ plain form
10567 14548376 14718217 14762531 14371677 13433305 12017698 10431559 8967240 7789237 6910469
10558 6910469 6201998 5649441 5214460 4902245 4625116 4364002 4133459 3894733 3707160
10549 3707160 3540406 3387513 3217382 3048746 2887430 2743663 2644539 2534092 2437010 2321467
10539 2321467 2203373 2113827 2019127 1952859 1856103 1753935 1660836 1577691 1480599 1418726 1356909
10528 1356909 1290258 1248796 1204212 1149078 1081334 1029569 1009260 993095 970462 907954 849512
10517 849512 819271 796058 771238 765115 714926 685506 672840 668815 684237 653458 577163 571409
10505 571409 564733 553696 554293 570634 537863 518230 498294 481355 462579 457145 474042 457770
10493 457770 411732 393081 387289 401991 398212 418288 372169 324808 284654 285628 275787 260830
10481B60830j2330j2169L8959M4837m2500q231L3689K068m1318K2102J5060J4304
10469C15301j6432l2571R629J8410j2984l7240j1947J619k1915k6147m347K1670
10457B03046J7213K26j1195Q896K9576k1037l8780j221p813K1876r854L692J3772
10444B08397N074n025j5755k0376J1706q605l908J8509K3464J2564j8872n076
10432B02097L0897J3509l3591m0898O617Q816J4784L6764P670l174k7579j602
10420B14310J2646n207j3424r894P60k900R198L5429j0511j7954J0284o62k4380
10407A97695L685J3221J293k5605J2810j0177m0910K924R279O324J4020K2778
10395B07337l962Q730l4131k7452J5644J5070K692j9562l605k1244K5593N7439
$$ plain form
10481 260830 248500 236331 275290 320127 277627 269396 303085 305153 263835 285937 300997 315301
10469 315301 298869 266298 275927 294337 281353 244113 232166 233785 211870 185723 181376 203046
10457 203046 220259 220485 209290 218186 247762 226725 187945 186724 178911 200787 190933 194625 208397
10444 208397 213471 208446 192691 172315 184021 175416 171508 190017 213481 226045 207173 202097
10432 202097 232994 246503 212912 172014 178631 187447 202231 238995 246665 243491 215912 214310
10420 214310 226956 221749 208325 198431 199191 196291 205489 240918 230407 212453 222737 222075 197695
10407 197695 201380 214601 215894 190289 203099 192922 152012 154936 164215 170539 184559 207337
10395 207337 203375 212105 177974 150522 166166 181236 183928 164366 160761 139517 165110 222549
10383B22549j4850l4841J092J8228J2560k0615o710J8082m630O537l067k3695
10371A70640p986o358j7188n2835P866L3688p330J1832k5222m773p743j2703n569
10358G6319k352j5215N422J5193L9183K5350l088k4873K258N523J9733k6351J7883
10345A34985L1736J4387k5945j7768L367k9692n349J4312j152r309j1777r29P361
10332A04227k6429p738L8068k406Q594L1707J0600L1199J1074n4106m1532L3512
10320A36770l278k8787k6168l1798K4865L0918n969K2054J9438j6158r137O763
10308A19513O749J9942J8107j1223j2310j6620o980J9486Q148J2463j7163j3930
10296A26182m0373j4546l694L8923J0837j2982O65J3593p768k4657J2907J5093
$$ plain form
10383 222549 207699 172858 173950 192178 204738 184123 177413 195495 190865 197402 194335 170640
10371 170640 162654 156296 139108 86273 94139 127827 120497 132329 107107 102334 94591 81888 76319
10358 76319 73967 58752 64174 79367 118550 143900 140812 115939 118197 123720 143453 117102 134985
10345 134985 166721 181108 155163 137395 140762 111070 105721 120033 118881 109572 97795 96866 104227
10332 104227 77798 70060 108128 105722 114316 146023 156623 187822 198896 144790 103258 136770
10320 136770 133492 104705 78537 46739 71604 102522 96553 118607 138045 121887 112750 119513
10308 119513 126262 146204 164311 153088 140778 124158 117178 136664 144812 157275 140112 126182
10296 126182 85809 71263 67569 106492 117329 104347 105012 118605 110837 86180 99087 114180
10284A14180L2528L1756j0800k6749J2401j1297j4502j1863p514l0275j5615J962
10272F4212q702J4378o650K6729L5285J1117l5860j8068j319J3056K3334m495
10260A13017N131J1630p371L1138k3862n6259K38J7942K3499j4021P525J3341
10248A21948J3954m0469k9643J9065O397q160K423p614j967O373J1210K5000K9542
10235A48059j1185l1071q462j1410j120Q826q473j222K2769O128m292k5523L662
10222H6686J9071o911j0168J013j5676j9868J2362p76o685j2699j8787M367P863
10209C9792n833j1415j4546K9377K4049L6335J8283j4141k1583j0340q625l3171
10197B8182L389N5332J3982l1599Q93K3342R451k2563j2894m55J8783q980k9815
$$ plain form
10284 114180 146708 178464 167664 140915 153316 142019 127517 115654 108140 77865 62250 64212
10272 64212 55510 69888 63238 89967 125252 136369 100509 82441 81122 94178 117512 113017
10260 113017 118148 129778 122407 153545 129683 73424 73662 91604 115103 101082 108607 121948
10248 121948 135902 95433 65790 84855 91252 83092 85515 77901 75934 82307 93517 118517 148059
10235 148059 136874 105803 97341 85931 84811 93637 85164 83942 106711 112839 108547 83024 86686
10222 86686 105757 98846 88678 89691 74015 54147 66509 65733 59048 46349 27562 31929 39792
10209 39792 33959 22544 7998 37375 61424 97759 116042 101901 80318 69978 61353 28182
10197 28182 31571 86903 100885 69286 70179 93521 102972 80409 67515 67060 85843 76863 47048
10184D7048J8163J7022J4495M346p537j0805J8549J6023L9325m712k1368m6316
10172H4233k3181P667J2089J3052L4181L7266m826j1470L9505J2302j8524J4670
10160A96964P257k3674k6438L7705M2615K1067K2987K6494K221m2979k5589j6784
10148B21846k0172k7281j3860K1947L1865L7080O255l2782k2651k9929j6513k5236
10136A30569l53K8099O614J7234k3515r978L854J5849M0609p212l9972j5293k9334
10123A17171j6970k0618j8897q722K5068K8745K6988O472R357n5944m3965p314
10111D1371j394K2629j423pK0850Q720p228K6316O45l8996k7941j4929L5961r576
10097E4998j9262K0379r127O619n020Q00K8638K0697j1380l1674J9413q621l194
$$ plain form
10184 47048 65211 82233 96728 101074 93537 82732 101281 117304 156629 151917 130549 84233
10172 84233 61052 68719 80808 93860 128041 165307 160481 149011 188516 200818 182294 196964
10160 196964 204221 180547 154109 191814 234429 255496 278483 304977 307198 264219 238630 221846
10148 221846 201674 174393 160533 182480 214345 251425 257680 224898 202247 172318 155805 130569
10136 130569 130216 158315 164929 182163 158648 148670 152524 168373 208982 201770 161798 146505 117171
10123 117171 100201 79583 60686 51964 77032 105777 132765 139237 148594 92650 48685 41371
10111 41371 39977 62606 61183 61176 82026 90746 83518 109834 110479 71483 43542 28613 64574 54998
10097 54998 35736 56115 46988 53607 48587 49387 78025 98722 87342 55668 75081 66460 63266
10084F3266j3545q576p92J4566K367r416j2639J1845j2428k7508M508J4549m190
10071B2007j2302o481J5792L8473J4746J1990K3297l2633J2347K2554j7044j7895
10059G4851l9145j8154J673K865k534j5448J714K9233Q628L0554R077j8264O48
10046F5698P689k7995m802K896K144m5421N105K3056n359j871p720j4641p588
10033h809R68J2045K51L8818j173k1833K318N222p717J7977M533j8268P862j5646
10019A6548m2889L0446J2373P15m594K9209K854r945J4858J5581J6672l542l0395
10006D7891r544J2217P073p234j8752m409j1763m429p646K2046L3293K504M011
9993F5258n257k5978n15J0022L328m10j4351j8857p045l813p008M1172L0339N861
$$ plain form
10084 63266 49721 41145 40353 54919 57286 47870 35231 47076 34648 7140 11648 26197 22007
10071 22007 9705 3224 19016 57489 72235 84225 107522 74889 87236 109790 92746 74851
10059 74851 35706 17552 19225 22090 19556 4108 5822 35055 43683 74237 83314 65050 65698
10046 65698 73387 45392 40590 43486 45630 209 5314 28370 23011 21140 13420 -1221 -8809
10033 -8809 -7841 4204 4455 43273 42100 20267 22585 27807 20090 38067 42600 24332 32194 16548
10019 16548 -26341 4105 16478 17193 12599 41808 44662 34717 49575 65156 81828 78286 47891
10006 47891 38347 50564 57637 50403 31651 27242 15479 11050 3404 25450 58743 61247 65258
9993 65258 60001 34023 33508 43530 46858 46448 32097 13240 6195 2382 -4626 36546 66885 72746
9979G2746k8055j9447k641p165J693J9260P279J1722j3570K0403M9587J948l3227
9966H0533k6191J7198j4454O55R99l3750J7651N928k845R07k2084J7235N951r218
9952C8515L505R247L5001K329p549O692m3616r544J5578l62k580j4246O342K0472
9938E9784O550J0304N435j0138j3798R485j3991P581L2615k0325r960J7716m42
9925H0816q162j138J0610j2668j584J6067o62j5414j9751j8217l1343J4759K9730
9912D3043j2964J6958k9382N753l122P015M934J2733J679q352O898j1959N715
9899C8949l0067j0325L227K3925o012K4210J921J4527L0866m088m289o765J8492
9886I4571l6819l0774O672j7604N42k130j7552J4103M2978J8086l5895r222m922
$$ plain form
9979 72746 44691 25244 22603 15438 17131 36391 43670 55392 41822 62225 111812 113760 80533
9966 80533 54342 71540 57086 57741 58740 24990 42641 48569 45724 46631 24547 41782 47733 38515
9952 38515 42020 51267 86268 88597 81048 87740 44124 34580 50158 49796 47216 32970 39312 59784
9938 59784 66334 76638 82073 71935 58137 67622 53631 61212 93827 73502 63542 81258 80816
9925 80816 72654 71516 82126 69458 67874 83941 83279 67865 48114 29897 -1446 13313 43043
9912 43043 30079 47037 17655 23408 20286 27301 32235 44968 46647 38295 45193 33234 38949
9899 38949 8882 -1443 1784 25709 19697 43907 45828 60355 91221 87133 82844 76079 94571
9886 94571 57752 26978 33650 16046 16588 14458 -3094 11009 53987 72073 36178 26956 22034
9873B2034P861p922j7274k835k2077P586k0278l1724L7812M5262J5397m824J5759
9860D4777J5643o647P160j1934o158j0965k6491j6114K229L5801J0728n604p235
9847B5190k0099M292K0793q22M216J7440j4699L869J4424J0259l273j2802J7189
9834F5977o088o520j032q751j8016j5780L897J2130J2287L1211k2212r895j4387
9821B2821j8955j6302k1510j0223J6940K8690P129M789o90j6228k6875O667J5639
9808h108J1935j3334L582l0662M969J7822J4865L169R148j527m826K2137p614
9795B1556j7093j2779K2042K7601K512r679k4315J2095J4946P891k7967k6084
9783i274K5700J1658j1769R670l654j4851J1448O126K0137l0309J7079J5809r545
$$ plain form
9873 22034 29895 21973 4699 1864 -20213 -12627 -32905 -64629 -26817 18445 33842 29018 44777
9860 44777 60420 53773 60933 48999 42841 31876 5385 -10729 -8500 27301 38029 32425 25190
9847 25190 5091 9383 30176 29354 33570 51010 36311 40180 54604 64863 61590 48788 65977
9834 65977 59889 53369 52337 43586 25570 9790 13687 25817 38104 69315 47103 37208 22821
9821 22821 3866 -12436 -33946 -44169 -27229 1461 8590 13379 12689 -3539 -30414 -23747 -8108
9808 -8108 3827 -9507 -5925 -36587 -31618 -13796 1069 4238 13386 11859 7033 29170 21556
9795 21556 4463 -8316 13726 41327 43839 34160 9845 21940 36886 44777 16810 -9274
9783 -9274 16426 28084 16315 25985 22331 7480 18928 25054 45191 14882 31961 47770 38225
9770C8225K948K0715l6845j9483j8517J4784M7502J4986j8876P240m004k1982
9758B6693J372P843J2890j4329j0030J958K4476L048k4634M758j9926l0531N546
9745a0866J1301K4220k2827j0535k5517O743L1885J2132p058j1760j2506j1012
9733b5800N4299J2061m5280L734K995j2620R927J497p022j3409K5530K1950M217
9720C2079rQ397L378k0131m4872k5098J5065K0941J5903j1081m303K0347o384
9707D232P623M1287R864j8435M407k4539p3r603j3287J4519P335q545j6862j6027
9693a8104k2550P336J3551P566J3496N281L1371j8612r557J761K1806K6388Q8
9680E9821J6561p652r738r552N556k4551k7278O64L7157J635r005j131K1892j1009
$$ plain form
9770 38225 41173 61888 25043 5560 -12957 1827 49329 64315 45439 52679 48675 26693
9758 26693 28065 35908 48798 34469 24439 26397 50873 53921 29287 34045 14119 -16412 -10866
9745 -10866 435 24655 1828 -8707 -34224 -27481 4404 16536 9478 -2282 -14788 -25800
9733 -25800 28499 40560 -4720 -986 2009 -10611 -684 813 -6209 -19618 5912 27862 32079
9720 32079 32070 40467 43845 23714 -21158 -46256 -31191 -10250 5653 -5428 -9731 10616 4232
9707 4232 11855 53142 63006 44571 48978 24439 24366 14763 1476 15995 23330 14785 -2077 -18104
9693 -18104 -40654 -33318 -19767 -12201 1295 6576 37947 19335 9778 11539 33345 59733 59821
9680 59821 76382 68730 58992 49440 54996 30445 3167 3831 40988 42623 33618 32487 54379 43370
9666D3370j6512R535p622k2452j9757m466p26J1203L232J8515M2548k6240N310
9653C5938J565O6322K2538L9246L4818l19p2450o9042l0452K0320K4117N430Q674
9640H6705k9349l2889R053j8335J2976p224K5179p412o420N957j204n111q54K9536
9626F0608Q349j9777l8738m652J9931J4377m058K094J1419o152j1103m6877J0933
9613c646q985P89J7525J4619M0607J0684k9418j3181K3331L898k0831j0556l2657
9600g821p916p973k1310L4348K6691J2873j201O773N983K3240j6163k9221j4250
9587D053Q464K0912j3137q457j1941o531j2507l0864J26K8024J9566K0451K23
9574A8382P161N373k832j6197l870j2850l7004J4157K3507j8465R781J1697j2934
$$ plain form
9666 43370 26858 36393 28771 6319 -13438 -17904 -18630 -7427 -4195 14320 56868 30628 35938
9653 35938 37503 103825 126363 165609 200427 200108 127658 58616 28164 48484 72601 78031 86705
9640 86705 57356 24467 33520 15185 28161 20937 46116 38704 32284 38241 37037 31926 31072 60608
9626 60608 68957 49180 10442 5790 25721 40098 36040 38134 49553 43401 32298 -14579 -3646
9613 -3646 -12631 -11842 5683 20302 60909 71593 42175 28994 52325 56223 35392 24836 -7821
9600 -7821 -15737 -23710 -45020 -10672 16019 28892 27691 34464 40447 63687 47524 18303 4053
9587 4053 12517 33429 20292 11835 -106 -6637 -19144 -50008 -49882 -21858 -2292 18159 18382
9574 18382 25543 30916 28084 11887 8017 -4833 -41837 -27680 -4173 -22638 -12857 -1160 -14094
9561a4094n367K1351J3791m28l2896K2270K0950q431N576j210j3412j2581J9111
9548A4630R966j2717J0493r274J8267M808l323K8670k6657k9609j4091J6943J2990
9535B1096P798o11J2958J4552m3774k0929J7519P078Q764L2841J6799k9509k7189
9522A7393K3697l914k2912R6L992p852K3597J3589j4615M133K752L4980k9494
9509D5442m8738j2133l807J1592n032J9582K879M389j9316j8108J8637J6381k6535
9496a4767k463p025k3421J1960P1499J7674k5123l9298o212k8704R050j2027K2262
9483b6595j2354M427K2385J8772K2531K7913O644m1917j5795k917n953k7157J1043
9470a8973J5196L6926N884k6497j924O593P549n758k2136j5163J1045M2240r75
$$ plain form
9561 -14094 -19461 1890 15681 15253 -17643 4627 25577 17146 22722 21512 8100 -4481 14630
9548 14630 24596 11879 22372 13098 31365 36173 32850 61520 34863 5254 -8837 8106 21096
9535 21096 28894 28283 41241 55793 12019 -8910 8609 15687 24451 57292 74091 44582 17393
9522 17393 41090 37176 14264 14360 18352 10500 34097 47686 33071 37204 39956 74936 45442
9509 45442 -3296 -15429 -19236 -7644 -12676 6906 9785 14174 -5142 -23250 -4613 11768 -14767
9496 -14767 -17230 -24255 -47676 -35716 35783 53457 28334 -10964 -17176 -45880 -36830 -48857 -26595
9483 -26595 -38949 -34522 -12137 6635 29166 57079 63723 21806 6011 3094 -2859 -30016 -18973
9470 -18973 -3777 33149 39033 12536 10612 17205 24754 18996 -3140 -18303 -7258 34982 34007
9457C4007j1027q748J9340j3444j2045K1438J5712j5083k1019l3437J4161N4104
9445D3959l036r946N215k3286o421L4729j5461r571K9002J8026O694l8468K165
9432C3601J9433J6200k3803J754l0418l2357l27O819K3014M8833J8422n124n297
9419G0750j1540l5385j1567j7067r179r409n297K1603J3702q618j9509N819O948
9406h749o047J2428J4934j9695j2172l931J3796m384M998R802K7041N1j6935J0249
9392B1386L4780R613p705j6560J4791K9587o9r821p989k4045m1723j3213J8852
9379G884J1800j0805J8791L08j4474j2289m096L1326q75l2877n031J132n887L713
9365a1380J0800Q703n497K576K6300J1060O56n496L4205o688k0812l318K3571
$$ plain form
9457 34007 22980 14232 33572 20128 8083 29521 45233 30150 9131 -24306 -10145 43959
9445 43959 40923 30977 36192 12906 6485 41214 25753 16182 45184 63210 69904 31436 33601
9432 33601 53034 69234 45431 47185 16767 -15590 -15917 -9098 13916 62749 81171 76047 70750
9419 70750 59210 23825 12258 -4809 -13988 -23397 -28694 -7091 6611 -2007 -21516 -15697 -8749
9406 -8749 -14796 -2368 12566 -7129 -19301 -23232 -9436 -13820 -8822 980 28021 28072 11137 21386
9392 21386 56166 65779 58074 41514 56305 85892 85823 76002 68013 43968 2245 -10968 7884
9379 7884 19684 8879 27670 27978 13504 1215 -2881 28445 27570 -5307 -10338 -9206 -15093 -11380
9365 -11380 -580 8123 2626 5202 31502 42562 43218 37722 71927 65239 44427 41109 64680
9352F4680j5580n7668p289K3612L5558K1575n590k2581k1723L15J2329l824j8906
9339D908l1792K2107k366j2267K1267N0463J4287j774l3410j4129J448j1973M740
9326A1509K4349L1477p475n0409J4103J8991k1523n953N411J2367P485k3629j0278
9313F425j4787L0140J7476J9454Q553k900R742j3714j6016j0144k8563j3796j6307
9300b4437K3501J2446o115l859J3761k938j3987M120K4171J4151j8973n231M270
9287B0880J1011j0371j5450J0816j8135K1866L3767P965K4056l740k0040j5523
9275D7102J1673n492J7489k1444k0287l132j0354P576J9927l4317J1157K6217
9263D6115j9148j117J6067M597r167P379j2367k4350j0908J4119O428R053K9157
$$ plain form
9352 64680 49100 -8568 -15857 7755 43313 64888 59298 36717 14994 15309 27638 23814 4908
9339 4908 -26884 -4777 -7143 -19410 1857 52320 66607 64833 31423 17294 18742 6769 11509
9326 11509 35858 67335 59860 9451 23554 42545 21022 15069 20480 32847 40332 16703 6425
9313 6425 -8362 21778 39254 58708 67261 64361 74103 60389 44373 34229 5666 -8130 -24437
9300 -24437 -936 11510 5395 1536 15297 12359 -1628 2492 26663 40814 21841 16610 20880
9287 20880 31891 21520 6070 16886 -1249 20617 54384 62349 86405 82665 62625 47102
9275 47102 58775 53283 70772 49328 29041 25909 15555 23131 43058 8741 19898 46115
9263 46115 26967 25850 41917 46514 37347 44726 32359 8009 -2899 11220 17648 26701 55858
9250E5858n764k7044j9863j182r856K2354L0532j4129q522K166j2959J1644k8826
9237e591J0477K4111R259N229j164N872J6047j0732j1583j8390J1689J0120J3460
9224E8804L724k650j0892m5593m658k635J3693J9542L2301k905j6428m71J6906
9211E8738m335j8538j2320M281J6257K3348J2299l8164l3798J1639K1998O222
9199D7627Q573j6598J1418M933j1603J322k1386j8635k6164n531J9038R048K877
9186D919j7399j9980q8N5208K5900m205l6477q861k011p244j4395J3218j3459
9173b4874K1305O0636K9576k528l5001j5321l260l5350j6661M782J3923J6093
9161A3320j3185J9503K2991J3724j6958O801J5441Q563l3266J4266j7254l2860
$$ plain form
9250 55858 50094 23050 3187 2005 -7851 14503 45035 30906 22384 24550 11591 23235 -5591
9237 -5591 4886 28997 38256 43485 42321 48193 64240 53508 41925 23535 35224 45344 58804
9224 58804 62528 59878 48986 3393 -1265 -3900 9793 29335 61636 58731 42303 41832 58738
9211 58738 54403 35865 23545 27826 44083 67431 79730 41566 7768 19407 41405 47627
9199 47627 56200 39602 51020 55953 44350 45672 24286 5651 -20513 -26044 -7006 2042 4919
9186 4919 -12480 -32460 -32548 22660 48560 44355 7878 -983 -2994 -10238 -24633 -11415 -24874
9173 -24874 -3569 57067 86643 84115 49114 33793 30533 -4817 -21478 -16696 -2773 13320
9161 13320 135 19638 42629 56353 39395 46196 61637 70200 36934 51200 33946 1086
9149A086r700J1660J5984k1746m1869p970j1219J4531J4565O362P484j82J0525
9136a0489P675K2547j1241j8371k8582j1416J1552L8565J3230N179J1835o382
9124B4102m928m5058j1718L3079J884k2983k0515J0787N2903J8761m485j9167
9112A2662k3453K4084M34j8823R42K9571L9547m6313l7085P481P263J361J8051
9099A5722K5654m9028k4663o244m87J4190L3375J5044N256j0136j5001Q402q682
9086C402L0223L386r266j5909l4325n162K6354Q320J697J0079R263L3179k5823
9073C5418j9808o336j100j502L3684J5198l8957l8424L1524J3797k3316o403j2398
9060a8623j8764M597K173R582J480p106j078M1686l3896m5383o611M396J5919
$$ plain form
9149 1086 -8614 3046 19030 -2716 -44585 -52555 -63774 -49243 -34678 -28316 -20832 -21014 -10489
9136 -10489 -2814 19733 8492 -9879 -38461 -49877 -38325 240 13470 18649 30484 24102
9124 24102 19174 -25884 -37602 -4523 -2639 -25622 -46137 -35350 17553 36314 31829 12662
9112 12662 -10791 13293 13727 -5096 -4154 25417 64964 18651 -18434 -10953 -3690 -2329 15722
9099 15722 41376 -7652 -32315 -38559 -39046 -24856 8519 23563 28819 18683 3682 12084 3402
9086 3402 33625 37011 27745 11836 -22489 -27651 -1297 7023 8720 18799 28062 61241 35418
9073 35418 15610 9274 8174 6672 40356 55554 16597 -21827 9697 23494 178 -6225 -18623
9060 -18623 -37387 -32790 -30617 -21035 -19555 -26661 -27739 13947 -19949 -65332 -71943 -67547 -51628
9047e1628l525j6420J5033K3044p235N942P627k4811j1059o56J8260M057J0127
9034c1244M086Q927j4043j2082K2120R982M545r195o13Q43j4077J7283R250M522
9020C04L304J021n763q152j1636K1364M3882K2077j7292n2526k3811J9955N68
9007f705l3303K8208N992L946M0774j7747k6664j2315J5114R291j7723n507P624
8994i015J8815J1311M811P159M6007o938k0826L461k3107l4451N668J5191j3350
8981D736k6043j3913J6380P932j7567K1752J1765L9539K1954l0645n1462j5434
8969c1006P27J3126J7442J7385k9803j6230j8021L0738J0443Q975k1061Q827K8000
8956A9542j0851K3997L1318j0528m993L3521k8933l4435J4417M225Q608L175o802
$$ plain form
9047 -51628 -55153 -71573 -56540 -33496 -40731 -34789 -27162 -51973 -63032 -63688 -45428 -41371 -31244
9034 -31244 -27158 -18231 -32274 -44356 -22236 -12254 -7709 -16904 -17517 -16674 -30751 -13468 -4218 304
9020 304 3608 4629 -1134 -9286 -20922 442 44324 66401 49109 -3417 -27228 -7273 -6705
9007 -6705 -40008 -11800 -5808 -1862 38912 21165 -5499 -17814 -2700 6591 -11132 -16639 -9015
8994 -9015 9800 21111 25922 33081 79088 72150 51324 54785 31678 -2773 2895 18086 4736
8981 4736 -21307 -35220 -18840 -10908 -28475 -6723 5042 44581 66535 35890 -15572 -31006
8969 -31006 -30279 -17153 289 17674 -12129 -28359 -46380 -15642 -5199 3776 -17285 -8458 19542
8956 19542 8691 32688 64006 53478 48485 82006 53073 18638 33055 37280 45888 49063 42261
8943D2261N313n927j0360l679j6566j6728J3193k0740J9786J4152j081q60n3513
8930c4749j1607J5214J3166p06K416m846J8177J1544J6087J462n506M1931O499
8917F9082j8249m132j0357j8403r467k3730J5428J1471n285j2363k1788j091K9153
8904B69j3850Q559K1415K2107M0164j6817l9230j1438K267L7581j1006O30l3853
8891F798n5359J3125N0472Q519J0572n532o690o045Q99l955j8760N452J6699J51
8877A6346J3225n288k9347O87q03j0940L6113K3309j2988k3582j0087J1921N150
8864A3716l4781r742K027o617J2179K5655k7114m0364J8539R391J7355J1725K5216
8851A7185N594m930j5770k6732k2616K6969K0272J3521K0036K1196N769l4766
$$ plain form
8943 42261 47574 41647 31287 27608 11042 -5686 7507 -13233 6553 20705 19624 18764 -34749
8930 -34749 -46356 -31142 -17976 -18682 -16266 -21112 -2935 8609 24696 26158 20652 62583 69082
8917 69082 50833 46701 36344 17941 8474 -15256 172 11643 6358 -6005 -27793 -28884 269
8904 269 -13581 -5022 16393 38500 78664 61847 22617 11179 13446 51027 40021 40651 6798
8891 6798 -48561 -35436 15036 23555 34127 28595 21905 15860 16759 12804 -5956 -504 16195 16346
8877 16346 29571 24283 -5064 -4377 -5180 -16120 19993 43302 30314 6732 -3355 8566 13716
8864 13716 -21065 -30807 -28780 -35397 -23218 2437 -24677 -65041 -46502 -37111 -19756 -8031 17185
8851 17185 22779 17849 2079 -24653 -47269 -20300 -28 13493 33529 54725 60494 25728
8839B5728j4106j0984R545L1960J1022n585j7598j7185j1601l687l173K295J0469
8826G100L1873P844j4466j3923J2742q255m570J2515K7541N341p249q039m2910
8813E544J3535J1734L000J1461l3992l087P187q548k3276k2240J8910Q300O162
8800e310J3474o097k2707p028K6230R465m828L929J1426L827l7057K1122K9697
8787C6143j2817l7890M765K4912k9458j5241Q846j1614l9885j4970K7045J8661
8775d1503L4932J0402r649o877m7922r006L2077N2471R471j2204j8378Q162K9224
8762C1200l0410k0118K169J6461j1064J4627M688K462k3984j5772j85K910K7786
8749G70N0837j1104j7186m5951k350J5606r60j6620K8763K1417k608l7157k2533
$$ plain form
8839 25728 11622 638 10183 42143 53165 47580 29982 12797 1196 -2491 -5664 -3369 7100
8826 7100 38973 46817 32351 18428 31170 22915 18345 30860 58401 63742 56493 48454 5544
8813 5544 19079 30813 33813 45274 11282 8195 15382 6834 -16442 -38682 -19772 -11472 -5310
8800 -5310 8164 2067 -20640 -27668 -1438 8027 3199 7128 18554 22381 -14676 6446 36143
8787 36143 23326 -14564 -9799 15113 -14345 -29586 -20740 -32354 -72239 -87209 -60164 -41503
8775 -41503 -6571 3831 -5818 -12695 -60617 -69623 -37546 14925 24396 12192 -6186 1976 31200
8762 31200 790 -19328 -17159 -698 -11762 2865 7553 10015 -13969 -29741 -29926 -27016 770
8749 770 51607 40503 23317 -22634 -24984 -9378 -10338 -26958 1805 23222 20614 -16543 -39076
8736c9076J8573J1806j7806r985L263J6160K0145j2316k934K2429j6521J06J2992
8723F836J0965j1030J2649K9617j3449m4185J552J0278L5746j3142J7429R845
8711E3111j5080j0033k2614J5822J6228j8695K518L824O140k9169o302M550J425
8698A725P827L7343k1251K0949K6864l0455J625m002k394r650P306r496J234k387
8684B5238J9896L7298j0326q860k371l801J0089r674J4187J173k9972m045O770
8671D5602K6605K2743k6357m863j3217N81n630l106J9185J1350o618l9021j5658
8658A1596J8348j1124l1424O392N1533J8800j8831o107p425P90J4344q614K05
8645C8483L674j2444j5501j7078K5773L617j7573K690M444j0521J5123J5455j6281
$$ plain form
8736 -39076 -20503 -8697 -26503 -36488 -33225 -17065 3080 -9236 -12170 10259 -6262 -6156 6836
8723 6836 17801 6771 19420 49037 35588 -8597 -7045 3233 38979 25837 43266 53111
8711 53111 38031 27998 5384 21206 37434 18739 21257 25081 31221 2052 -4250 300 1725
8698 1725 9552 46895 25644 46593 73457 43002 44627 40625 38231 28581 35887 26391 27625 25238
8684 25238 45134 82432 72106 63246 60875 57074 67163 57489 71676 72849 42877 38832 45602
8671 45602 72207 94950 68593 63730 50513 51094 45464 42358 61543 72893 66275 27254 11596
8658 11596 29944 18820 -12604 -6212 45321 64121 45290 39183 31758 32548 46892 38278 38483
8645 38483 42157 29713 14212 -2866 22907 26524 8951 11641 16085 5564 20687 36142 19861
8632A9861j4482n075L3050j283k6105p238K7099J582J2780K5475L656l9028k6326
8619C966j0271j8406k0204k0106J6200K3541J1523r760j4940J8062L813k4857
8607d1439L0477M2831j0274q590J3856q45J2898K7550l5769m2491J7881K4622
8595C0707j2117J8320J4100p013j2216J7453k0390k7750m4795K9658L5498j659
8583A9796j9418k7067p741K2299L7930J2696J5087k249j8506j1935K5471k8678
8571A7685j184K1470L45K100M931Q422j4514j3603j548l0380J071K0579j7605
8558b231l2248k3776m89J6901J3414J0565O064K1594K6809k1502l6194M68K5947
8545E322J7898K367o549q905l6877j2745L0760K8407r56O424L1751J9577k3939
$$ plain form
8632 19861 5379 304 33354 32071 5966 -1272 25827 27409 40189 65664 69320 30292 3966
8619 3966 -6305 -24711 -44915 -65021 -48821 -25280 -13757 -23517 -38457 -20395 -16582 -41439
8607 -41439 -10962 31869 21595 13005 26861 26016 38914 66464 30695 -11796 6085 30707
8595 30707 18590 36910 51010 43997 31781 49234 28844 1094 -43701 -14043 21455 19796
8583 19796 378 -26689 -34430 -12131 25799 38495 53582 51333 32827 20892 46363 17685
8571 17685 16501 37971 38316 40416 45347 53769 39255 25652 24104 -6276 -5205 15374 -2231
8558 -2231 -34479 -58255 -58744 -41843 -28429 -17864 -11800 9794 36603 15101 -21093 -20625 5322
8545 5322 23220 25587 19038 10133 -26744 -39489 -8729 19678 18722 25146 56897 76474 52535
8532E2535j5311j4274L372K1020P625l9352l4654L305K9263J285L449m0466l793
8519b5996K7239p215p003K5407j0749M29J8117J9362Q189k5569k545j4479K7834
8506C3021k2777M901j8661j2177L2452J8352k027n0324l098K1829R239K0492p162
8493B4060l1938l868k630j1553J426K1938l556j0967R924M307l614j8108k719
8480b7298K2519L2347q19j2914O120n261R044M3001q26k4313o928j0065m1547
8467a6940j307J4838j5238N888k808n237q151O256L4568O635J1624J5100N453
8454E0681n7806k2376K2515J9795O274J3829L401k8107j1215O302o801q315K0399
8441H576j864p066j5394j126M6646K3248k6808j6035k32k260K870j7879J4276
$$ plain form
8532 52535 37224 22950 26322 47342 54967 15615 -19039 -15734 13529 14814 18263 -22203 -25996
8519 -25996 1243 -5972 -12975 12432 1683 2112 20229 39591 47780 22211 19666 5187 33021
8506 33021 10244 15145 -3516 -15693 16759 35111 33084 -17240 -20338 1491 10730 31222 24060
8493 24060 -7878 -11746 -14376 -25929 -24503 -2565 -6121 -17088 -7164 -2857 -6471 -24579 -27298
8480 -27298 -4779 27568 26749 13835 19955 14694 23738 66739 65913 41600 34672 24607 -16940
8467 -16940 -18247 -3409 -18647 -12759 -15567 -20804 -28955 -22699 11869 18504 30128 45228 50681
8454 50681 -7125 -29501 -6986 12809 19083 32912 36313 8206 -3009 3293 -3508 -11823 8576
8441 8576 6712 -354 -15748 -16874 29772 53020 26212 10177 9945 7685 10555 -7324 6952
8428F952K0871J164J3226k7930j4465k0995l187j044j546J7955L7810L6339q519
8415E6631l0546N188n069k6241p291l6772J3460K7673j4019J8496L0300j9030
8403A2780Q710k2277n7043O400M6497J1183k2871l595J4644L826k090k5591j3449
8390d2876L0294L945J2849K7031n672J3703J6006l1153k037K1255j8167J9860
8378D5038j4851K4682m6224p877K675j724l2562N854K6922L0746K2396l6499j7370
8365A206K5403k9078j9320N639R119j7990k0868j7569j1508J6591K3474J0128
8353b4773N319j6109j3295K9979r879R770K5783L2050k016j1199j4604K459j7819
8340d334k4225j0107j8677K9099j6941k8489P780K2678R523n140k3233J9794R376
$$ plain form
8428 6952 27823 28987 42213 14283 -182 -21177 -24364 -25408 -26954 -8999 28811 65150 56631
8415 56631 26085 31273 26204 -37 -7328 -44100 -30640 -2967 -16986 1510 31810 12780
8403 12780 21490 -787 -57830 -51430 -4933 6250 -16621 -20216 -5572 -1746 -3836 -29427 -42876
8390 -42876 -12582 -8637 4212 31243 25571 39274 55280 24127 22090 43345 25178 45038
8378 45038 30187 54869 8645 768 3443 1719 -30843 -24989 1933 32679 55075 18576 1206
8365 1206 26609 -2469 -21789 -16150 -7031 -25021 -45889 -63458 -74966 -58375 -34901 -24773
8353 -24773 -19454 -35563 -48858 -18879 -28758 -18988 6795 38845 36829 25630 11026 13485 -4334
8340 -4334 -28559 -38666 -57343 -28244 -45185 -73674 -65894 -43216 -33693 -38833 -62066 -42272 -32896
8327c2896J3758j2570J4073J7600K7187o681j2891K7591R481j9391J724j8007
8315H978j764J8759J5232P562k2552n899l9842m5932j1879P072K7569n275J8720
8302b9251r029M832k1870k4951O800J7475O7480K6261q259m5848l4509j6631L2164
8289c5336Q231n961J8661J0606r355j357J9708m2127l298M0423l658n90J1316
8276G263l347r588k2302k309P500j3604k069K7677L576k6871k4280J1662K7374
8263a9318j5343q693m477J899K4067j1236n102J8282K654j0127K0027l2525j3303
8250e3195k416K286K0954K3821J0815K1061K2817k8597r327K4322K9967k95k2914
8237C9299j8213R265P718N809N113k5238j9640N963j4962J0461L0845q950j9466
$$ plain form
8327 -32896 -19138 -31708 -17635 -35 27152 20471 7580 35171 44652 25261 26985 8978
8315 8978 7214 25973 41205 48767 26215 20316 -19526 -65458 -77337 -70265 -42696 -47971 -29251
8302 -29251 -38280 -33448 -55318 -80269 -73469 -55994 11486 37747 29488 -16360 -50869 -67500 -35336
8289 -35336 -27105 -33066 -14405 -3799 -13154 -14511 5197 -36930 -40228 195 -3463 -4053 7263
8276 7263 3916 -5672 -27974 -30283 -22783 -36387 -38456 -10779 -7203 -34074 -58354 -46692 -19318
8263 -19318 -34661 -43354 -47831 -45932 -21865 -33101 -38203 -19921 -17267 -27394 -7367 -39892 -53195
8250 -53195 -55611 -53325 -32371 -8550 2265 23326 46143 17546 8219 32541 62508 62213 39299
8237 39299 21086 30351 38069 43878 48991 23753 4113 10076 -4886 5575 36420 27470 8004
8224H004l043j1520J6886K864l8666k5388J9398K7993m804k8029n604N911J6060
8211a9938p088j7835J9705N48L3228J9238P282K6473J1676n2332m5003m417N2585
8198B4122L3352q892j3993k7140j164L5465K800r024N715l516l6567j0133L0188
8185B1213l9675N202K5477r96N64J1369k855j1880k4615j3572Q250K3663J2190
8172A4335J7465n6702k8805M533L7647M1939J5481j8395j6938K37L67k9500J79
8159a8157N13J6622R391J962k5692Q592J1264j1242l891k596n38J2491j222K5275
8145B2772P393k6485j5391j8226L9K0935K3869J1609n698q11k321l3704o647K455
8131b0211o863l5446J5015L4021J6924K0725J9783l6804m8808l7260k2637N5987
$$ plain form
8224 8004 4961 -6559 10327 13191 -25475 -50863 -31465 -3472 -8276 -36305 -41909 -35998 -19938
8211 -19938 -27026 -44861 -25156 -24608 8620 27858 35140 61613 73289 20957 -24046 -28463 24122
8198 24122 57474 48582 34589 7449 6285 41750 44550 35526 41241 37725 1158 -8975 21213
8185 21213 -18462 -13260 12217 11221 11785 23154 20299 8419 -16196 -29768 -21518 2145 14335
8172 14335 31800 -24902 -53707 -49174 -11527 30412 45893 27498 10560 10797 11164 -18336 -18157
8159 -18157 -17644 -1022 8369 10331 -15361 -6769 4495 -6747 -10638 -13234 -13772 -1281 -2503 22772
8145 22772 30165 3680 -11711 -29937 -29898 -8963 14906 26515 20817 20006 17685 -16019 -22666 -20211
8131 -20211 -27074 -62520 -47505 -13484 3440 24165 43948 7144 -41664 -78924 -101561 -45574
8119d5574M6368j111l3516l5019j457P149K6583L0086K9766J3163j3468j8449
8107D521j0062J5175n05J3517j961k6320J8309K9322m034L064j4145K1016K1611
8094F9508k1307o445j468j7961j3716k4406n974J2540J7810k7890J332k2217K107
8081c8087k029J1492L3971J6532J033j2447j5935o34J654n899N563J7558L2423
8068D5195j3594n726l6884l0902L2886M884J909p88r931j8727J4037j7829k8492
8055f3962J1814j0598M0545K6552j7946O776j6077k3485n759L7846L2334P047
8043B5087r53k0605k0477j7137Q984l0286j4916M0658P915J010K820J1931K1084
8030A5115j6443k36N975k8294Q712J3883j222n44M083j9377j291J333l159j2896
$$ plain form
8119 -45574 794 -317 -33833 -68852 -70309 -63160 -36577 -6491 23275 36438 22970 4521
8107 4521 -5541 9634 9129 22646 20685 -5635 12674 41996 37962 41026 26881 47897 69508
8094 69508 48201 41756 40288 22327 8611 -15795 -21769 -9229 8581 -19309 -17977 -40194 -38087
8081 -38087 -40116 -28624 5347 21879 22912 10465 -5470 -6104 -4450 -10349 -4786 12772 45195
8068 45195 31601 25875 -11009 -41911 -9025 -4141 -2232 -3020 -12951 -31678 -17641 -35470 -63962
8055 -63962 -52148 -62746 -22201 4351 -13595 -6819 -22896 -46381 -52140 -14294 18040 25087
8043 25087 24134 3529 -16948 -34085 -25101 -55387 -70303 -29645 -21730 -20720 -17900 -5969 15115
8030 15115 -1328 -1564 4411 -23883 -15171 -1288 -2510 -3054 1029 -18348 -19639 -18306 -21465 -34361
8016c4361o601J1020O456o28J8645j422l2562L833M9230J6990j6822j2020o287
8003d529q309o360R041k2364L2060n726j1794q697K428o785j1528l0N0239J9711
7989B7357k1762J8942O331l7865n1561J4700L1234J4341j0103k1892P674L9274
7977A6670J7382l2590k2530l2013J6223L7564J426J7140M682l5527j7698M9724
7965B0453K2400l2105k5898m730J196l3423J5890J4460K3658j0686O715J7555
7953A5485j3035J005j1391l9223m976J0040J2039n349k1414N799P172Q764K6448
7940h636K4256j7310j3969R71K989k7750J5495l417p995j9986j321M9784L4068
7927B7179q965k3570q93k3683j7922L8928Q999K3403J0020k560J4091l4555n4391
$$ plain form
8016 -34361 -40962 -29942 -23486 -24114 -5469 -6891 -39453 -35620 13610 30600 13778 1758 -4529
8003 -4529 -12838 -19198 -10157 -32521 -461 -6187 -17981 -26678 -24250 -31035 -42563 -42593 7646 27357
7989 27357 5595 24537 30868 -6997 -58558 -43858 -12624 1717 -8386 -30278 -22604 16670
7977 16670 34052 1462 -21068 -53081 -36858 706 2132 19272 23954 -11573 -29271 20453
7965 20453 42853 10748 -15150 -19880 -18684 -52107 -36217 -21757 1901 -8785 -2070 15485
7953 15485 2450 3455 -7936 -47159 -52135 -42095 -30056 -35405 -56819 -51020 -43848 -35084 -8636
7940 -8636 15620 -1690 -15659 -14688 -11699 -39449 -23954 -27371 -35366 -55352 -56673 -6889 27179
7927 27179 18214 -5356 -6249 -29932 -47854 -8926 73 23476 33496 30936 45027 10472 -43919
7914d3919k069K2514K1902J2645j0846k3572K1368l98k814M8301O514k4583r712
7901A5331l0052M66k1366j3161K3117N0777k0349l1640k419l115k1228L5482K0863
7888B706L6972j675k7137k3520j5590R165K130Q444k5830L0337L1017l7137p391
7875a7509M2822K0515K2107k1632k2703M485j6166k0886j6619J9679r454J5294
7863f7j798j8116l6565j9067J1825K8236J9776j1562j1223q311L5314L8804J1790
7850C9036k0938k1854L800m318j4039R526o514p356J5555K2762R440j5277r298
7837E25N236q527n114J2362K0n526l7055n955J0101J1731l374m16r759q258j5952
7822e9961R963J6935k2982J0437P008R821O888J5562Q011j3292l363M3145N519
$$ plain form
7914 -43919 -45988 -23474 -1572 11073 227 -23345 -1977 -2375 -5189 43112 49626 25043 15331
7901 15331 -14721 -14255 -35621 -48782 -25665 25112 4763 -26877 -29296 -32411 -53639 -18157 2706
7888 2706 39678 38003 10866 -12654 -28244 -19079 -16949 -8505 -34335 -3998 27019 -10118 -17509
7875 -17509 25313 45828 67935 46303 23600 28085 11919 -8967 -25586 -5907 -15361 -67
7863 -67 -1865 -19981 -56546 -75613 -63788 -35552 -15776 -27338 -38561 -46872 -11558 27246 39036
7850 39036 18098 -3756 44 -4274 -18313 -8787 -15301 -22657 -7102 15660 25100 9823 525
7837 525 5761 -2766 -7880 4482 4502 -1024 -38079 -44034 -33933 -22202 -25576 -25992 -35751 -44009 -59961
7822 -59961 -49998 -33063 -56045 -45608 -38600 -28779 -21891 -6329 1682 -11610 -14973 28172 33691
7809C3691l2435j2440K5031l674k0270k0066n123j8957j0203N427K5992j9749
7797e2776L574J1747p973J9524J1051K606J560p313R137J4835K4370L839l6156
7784a975j1376l1470k1788J1831l707p82N41J4064O622J5389Q689K3794Q073j3086
7770D819n104K9483P611Q492L854k2199n4935k3918K753M502j155J0458L0114
7757e225M842K6069M548r514L0777j3186l2184J3870j375q789K7900l0987j6285
7744i539J0024L0264r64l176J0140N211m8390k7867K8557n01J1586R374N477J4255
7730C4451j5350j5965j7676J771k4951L5775K0907j1056J7959K8711o439m6718
7718A419m0256Q904O333J2347r136R022M6150L3710j6013l9674m3399k105J1774
$$ plain form
7809 33691 1256 -11184 13847 10173 -10097 -30163 -35286 -54243 -64446 -59019 -33027 -52776
7797 -52776 -49202 -37455 -45428 -25904 -14853 -12247 -10687 -18000 -8863 5972 30342 34181 -1975
7784 -1975 -13351 -44821 -66609 -54778 -58485 -59267 -58726 -44662 -38040 -22651 -13962 9832 17905 4819
7770 4819 -285 29198 36809 45301 49155 26956 -27979 -51897 -49144 -44642 -45797 -35339 -5225
7757 -5225 -383 25686 30234 20720 51497 38311 6127 19997 18622 9833 37733 6746 -9539
7744 -9539 485 30749 29785 26609 36749 41960 -6430 -34297 -5740 -6241 5345 14719 20196 34451
7730 34451 19101 3136 -14540 -12769 -37720 -1945 18962 7906 25865 54576 48137 1419
7718 1419 -38837 -29933 -23600 -11253 -20389 -11367 34783 68493 52480 12806 -30593 -32698 -20924
7705b0924K0519n924l0820l0865L3151j4242R637K0013K8007p687r07J3682l2231
7692a8591K2704M264M382K7572j1171o533j2547J4499j2104k5352m174j1942j5668
7679d4661K6749k702L6131k155j2949K6003m569m8569k3838K6852J3638L443K3117
7666A6490r513m5679k9728K1838K9012K2336J2944p024l1680k201K0646K5853
7654B3294J9324j9207m3277j356J5853n776N975q089r647r239J2707J4950m296
7641h784n081j3857j7026Q546N2722R048n402K6991l601N98o193l2825k1516k5232
7627d1612P646n166J3053J4337m963l1552k1573J8805M1387N2981j8216r788J3510
7614B8849k2321n0707Q029L5481r598r107J5889m828k0059J3575J2131N606L6978
$$ plain form
7705 -20924 -405 -6329 -37149 -68014 -34863 -49105 -39468 -19455 8552 865 -42 13640 -18591
7692 -18591 4113 8377 12759 40331 29160 22627 10080 24579 12475 -12877 -17051 -28993 -44661
7679 -44661 -17912 -20614 15517 13362 413 26416 21847 -26722 -50560 -23708 -10070 -6627 16490
7666 16490 6977 -38702 -68430 -46592 -17580 4756 17700 10676 -21004 -23205 -2559 23294
7654 23294 42618 23411 -19866 -21222 -5369 -11145 -5170 -13259 -22906 -32145 -19438 -4488 -8784
7641 -8784 -13865 -27722 -44748 -36202 16520 25568 20166 47157 43556 44154 37961 5136 -16380 -41612
7627 -41612 -33966 -39132 -26079 -11742 -16705 -48257 -69830 -51025 -9638 43343 25127 15339 28849
7614 28849 6528 -44179 -36150 -669 -10267 -19374 -3485 -8313 -28372 -14797 -2666 2940 39918
7601C9918K96k4271L1550J0726o014K0116p994J1630P362l2857j5635j8713m1398
7588b5284j803L287Q421mQ516J1256L7219O802k6682j0393l2845j9373M169L4598
7574b116J4661Q754j6846Q002j6643J2183R709l4831j2726J7872p289o466j4943
7561d0679J117K0817L0658P400L255J2000r559k9359k919M363k6448n915L925
7548c1344j7561J296K6941M681K1253J1605l371J4569J5116p83j4059j9964Q308
7535A6687Q37p537n4977k1549m850M1297K8767j7979L0879N725k752l856k7774
7522a7082J9327k8416N317J6163R506j3993o74m943q717M6086R180k7987m2325
7509c8558k0865L7110M9701K9926j7437j4616K058j2420j5116j7296K1025J9681
$$ plain form
7601 39918 40214 15943 47493 58219 52205 72321 64327 75957 83319 50462 34827 16114 -25284
7588 -25284 -27087 -23800 -15379 -15383 -6867 4389 41608 48410 21728 11335 -21510 -40883 -36714 -2116
7574 -2116 12545 21299 4453 12455 -4188 7995 17704 -17127 -29853 -11981 -19270 -25736 -40679
7561 -40679 -39562 -18745 11913 19313 22568 34568 25009 -4350 -7269 -2906 -29354 -35269 -31344
7548 -31344 -48905 -47609 -20668 -15987 5266 16871 13500 28069 43185 42402 28343 8379 16687
7535 16687 17524 9987 -44990 -66539 -71389 -30092 -1325 -19304 11575 17300 14548 10692 -17082
7522 -17082 2245 -26171 -20854 -4691 4815 -9178 -9852 -14795 -23512 22574 31754 3767 -38558
7509 -38558 -59423 -22313 27388 57314 39877 25261 27319 14899 -217 -17513 3512 23193
7497B3193Q91k0069k6540j71k132O448M1747J5513l670J266m3719l9679L1949
7484a4973K2301R591K287M783j3718k0012j0236j3838M134K1109K0307L790l4660
7471a9135k5745J5043J3247J6978K2579p717J704j0849l2899J5828K4338L2592
7459D5964l458l6307j7617R151K1381l133Q501J9228M2532Q098n3232m9087l443
7446a1422J5506K623J0545k0198J8722O552l455n550j9083k4777Q203Q596k1155
7433c4893j2163j4501K0947K7470j0461M863L5871k2773j7129L0922j011N742
7421A2884J7136j3078L2430N879k2395k7104q952J553j8726J2548J5959J385m0333
7408c0814P880L3027k892j3397o227J2300M646M635j1001K891K5334R709j3430
$$ plain form
7497 23193 24084 4015 -22525 -22696 -24828 -18380 23367 38880 35210 36476 -7243 -46922 -14973
7484 -14973 7328 16919 19206 23989 10271 -9741 -19977 -33815 -29681 -8572 11735 15525 -19135
7471 -19135 -44880 -29837 -16590 388 22967 15250 16954 6105 -26794 -10966 13372 45964
7459 45964 42506 6199 -11418 -2267 19114 15981 24482 43710 86242 94340 41108 -7979 -11422
7446 -11422 4084 6707 17252 -2946 15776 22328 18873 13323 -5760 -30537 -22334 -13738 -34893
7433 -34893 -47056 -61557 -40610 -13140 -23601 -18738 17133 -5640 -22769 8153 7142 12884
7421 12884 30020 16942 49372 55251 32856 5752 -3200 -1647 -20373 -7825 8134 9519 -30814
7408 -30814 -22934 10093 7201 -6196 -12423 -123 4523 9158 -1843 1048 26382 36091 22661
7395B2661L8301l8382k9804j9361J2914J6971J3010J297j1811j0992k6135n724
7383c7055M5191L9239J833k2865m0015M778L4565L271k2357R3j8708j1989L038
7370b0981J7915K6834J6735l4189l2107Q475M2638Q466k6588K4266J0548k6133
7358A5879J4660j0697j1595J5906J5322j7422k1867k89m079j9611M640J7882j6934
7345a8205j5228k024K150l146p349J0304R354K2827J1491J4328q023n0746j9724
7332e3991O5114K630j4040j0576J9769J0248J4376r328o482L665k199J753K0869
7319D1808J2036j7793k8635l0632j0893K4086Q70k8807M70L8372L3813k3111l0431
7306a8847J1601N905l8312j3255M2399K8095m916k3958J179K63p689k8735K7457
$$ plain form
7395 22661 60962 22580 -7224 -26585 -13671 3300 16310 17607 5796 -5196 -31331 -37055
7383 -37055 8136 47375 49208 26343 -13672 -8894 25671 28942 6585 6678 -12030 -24019 -20981
7370 -20981 -3066 23768 40503 6314 -25793 -17318 25320 33786 7198 31464 42012 15879
7358 15879 30539 19842 8247 24153 39475 22053 186 -103 -4182 -23793 -19153 -1271 -18205
7345 -18205 -33433 -35457 -33307 -36453 -43802 -33498 -24144 -1317 10174 24502 16479 -34267 -53991
7332 -53991 11123 13753 -287 -10863 8906 19154 33530 24202 17720 21385 19186 20939 41808
7319 41808 53844 36051 7416 -23216 -34109 -10023 -9153 -37960 -37490 882 34695 11584 -18847
7306 -18847 -7246 -1341 -39653 -52908 -10509 17586 12670 -11288 -10109 -9846 -17535 -46270 -18813
7293a8813L1299K4168j1013j8810O363n491K016m4616N113O396k291l3598J1160
7280d8117K0606K1654J3652N334j338P026J4016l2159k0606j9704K6103j652O161
7267i024j6192q290K1123l246l7138r077N304K3705Q668k1584k940p930J7162
7254c9459M3600r20k0890l656J9057J2690j9407J323J5298K0131k6200m2527k0891
7241f1851J6245J7681p493j6325J0171L241J5051M7074J2173j8388k1173Q741
7229E147J7644m190l1685j5525J1884J164M124J8594J3391k5970K8658K7225l1746
7216A8715J064J1350R280l013r298k3042l672k4003J9770L879R379N725j0971
7203E163J1858j0504l4535l851p388k0442m831k674J231L4041L8905R573m336
$$ plain form
7293 -18813 12486 36654 25641 6831 13194 7703 9719 -34897 -29784 -23388 -25679 -59277 -48117
7280 -48117 -27511 -5857 7795 13129 11791 18817 32833 674 -19932 -39636 -13533 -15185 -9024
7267 -9024 -25216 -33506 -12383 -15629 -52767 -61844 -56540 -32835 -24167 -45751 -48691 -56621 -39459
7254 -39459 4141 3221 -17669 -21325 -2268 10422 -8985 -7662 7636 27767 1567 -40960 -61851
7241 -61851 -45606 -27925 -35418 -51743 -41572 -38331 -23280 23794 35967 17579 -3594 5147
7229 5147 22791 18601 -13084 -28609 -16725 -15561 -11437 7157 20548 -5422 23236 50461 18715
7216 18715 19779 31129 40409 37396 28098 5056 1384 -22619 -2849 1030 10409 16134 5163
7203 5163 17021 6517 -28018 -31869 -39257 -59699 -64530 -67204 -65973 -31932 6973 16546 12210
7190A2210j1563j6770j9515o739J622j0661K683k468L6470J2951j3090k5585k0781
7177f1236J1481J6574K6085j4420j0914K7095l495R303l913J7043L035k4796j6995
7164b5153J4179j337R022R855n478j7436k7224M597L750L948L9874k2045N20L0700
7150A7772p707j4867j7126j709n180J4227J4971j0782j5840k3943M969L2909L6982
7137B4676j8992q952j7977M829j2974n996j8770o074L6993N3999R395j9673j8325
7124B159j1596k597K4164L6216j8106j343k6796j592J2925j0285n714N004k0075
7111a7636j0014J0806q212j8107j2944M4808J7560k2389j2687K6291J43j0277
7099a2658j914J23k1595L8837K7014o153M483r76j4761q880k407k281k820K0840
$$ plain form
7190 12210 647 -16123 -35638 -42377 -40755 -51416 -48733 -51201 -14731 -1780 -14870 -40455 -61236
7177 -61236 -49755 -33181 -7096 -21516 -32430 -5335 -8830 473 -3440 13603 16638 -8158 -25153
7164 -25153 -10974 -12311 -3289 6566 1088 -16348 -43572 -38975 -35225 -31277 8597 -13448 -12928 17772
7150 17772 10065 -4802 -21928 -23637 -28817 -14590 381 -10401 -26241 -50184 -45215 -12306 24676
7137 24676 5684 -3268 -21245 -16416 -29390 -35386 -54156 -60230 -23237 30762 40157 20484 2159
7124 2159 -9437 -12034 12130 48346 30240 28897 2101 509 13434 3149 -2565 2439 -17636
7111 -17636 -27650 -16844 -25056 -43163 -56107 -11299 6261 -16128 -28815 -2524 -2381 -12658
7099 -12658 -14572 -14449 -36044 2793 29807 23654 28137 27161 12400 3520 1113 -1168 -3988 16852
7085A6852j1183p427N273J8901m6399j6487K1053L8361J7451m198j9041o975j8410
7072a2229o959J9088J817P793K704j5428L439J8685K4347j3107l2029m9681j8233
7059f9793K85K6794L245j2927j0997Q4L7101k030K6307Q503k2053j0499P194k9248
7045d8034j3792j2029k2523N3811O0108J2042O013j0099O288P845J6790N009j2424
7032D9005N22Q374j8650k9149m74K1209j7703q198R847p36k7823j505J5400k0760
7018b0641J8249R346k0255Q386l809k6108J1274P506o103J1695M080K481j4050
7005a7949K536J0543o862N869L0254j7699r190j2917J6441O741J8539j6429m1444
6992c1567k8395M806K4764Q372R034K0088L8922j2047l6571j7641m1378O959J3963
$$ plain form
7085 16852 5669 -1758 3515 22416 -23983 -40470 -19417 18944 36395 32197 13156 6181 -12229
7072 -12229 -19188 -100 1717 9510 12214 -3214 225 18910 43257 30150 -1879 -51560 -69793
7059 -69793 -69508 -42714 -39469 -52396 -63393 -63309 -26208 -28238 -1931 6572 -15481 -25980 -18786 -48034
7045 -48034 -61826 -73855 -96378 -42567 17541 29583 35596 25497 31785 39630 56420 61429 49005
7032 49005 49527 57901 39251 10102 9628 30837 13134 4936 14783 14047 -13776 -15281 119 -20641
7018 -20641 -2392 6954 -13301 -4915 -8724 -34832 -23558 -16052 -22155 -10460 -6380 -3899 -17949
7005 -17949 -15413 -4870 -11732 -5863 24391 6692 -2498 -15415 1026 7767 26306 9877 -31567
6992 -31567 -59962 -55156 -30392 -22020 -12986 7102 46024 33977 -2594 -20235 -61613 -54654 -40691
6979d0691J5892L216O464J4036J311J0695J9264m126j166k3977k7934l6655O022
6966e7649J8154L5097J4929k6392j5982p333P232L3891M338m0382M731K5985p382
6953a0763K0195J1601K990J6259K9603k0106o1290l8392k6855K1270P980j1657
6941e9165j2503K8826L5450J860j1455J082K2212J418k0398L4296J6245l4696
6929C172l7588N826K3032j9073k399j1384n360J744p841M5466q292r013Q749j6790
6915b9751j945M5703L662k4835r870l666o373J6527K2877j5133j5754j5059j1296
6902d4913J9536O1400n759l7587j4341O879l6953P881L2859l605j0352L2325l431
6889C939j9539j5404p644j3251L740M2382j6894l3578J7058Q039m402M771R846
$$ plain form
6979 -40691 -24799 -21583 -15119 -1083 228 10923 30187 26061 24895 918 -27016 -63671 -57649
6966 -57649 -39495 -4398 10531 -15861 -31843 -39176 -31944 1947 6285 -34097 -29366 -3381 -10763
6953 -10763 9432 21033 24023 40282 69885 49779 -11511 -49903 -76758 -55488 -47508 -59165
6941 -59165 -71668 -42842 -7392 -5532 -16987 -15905 6307 7725 -12673 21623 37868 3172
6929 3172 -34416 -28590 -5558 -24631 -27030 -38414 -43774 -42030 -49871 -4405 -12697 -21710 -12961 -29751
6915 -29751 -31696 14007 17669 -7166 -17036 -20702 -27075 -10548 12329 -2804 -18558 -33617 -44913
6902 -44913 -25377 36023 30264 -7323 -21664 -14785 -51738 -43857 -10998 -14603 -24955 7370 3939
6889 3939 -15600 -31004 -38648 -51899 -48159 -5777 -22671 -56249 -39191 -31152 -35554 -30783 -20937
6876b0937j6800j4383J512K3300M9422k650j0710O23K4028r963j2587k2337o419
6863a7901Q205R24L601J6076Q140K1654K3311p910j1956k1421l129O693l6193
6850i906j456K4492J4964j2061l0839n563L015j239k934r471j3212J8344K1513
6837d353o048J8020J7086j9248P282K5607l05k4304k3553j2715K683M1112J0148
6824C1412k1501k1978J1286K3052j1226m6649P591J9815O710j9381P336J9434
6812E901j3366J2329L0980J1662l70n711K1088k2617n5830J5104K3152P577q457
6799B1442k0246p769k1915N834L128L6209L5297l7475n295R095L186m432j9859
6786b800k3978Q675K4704k3905J7149J9048L1320j7655m4218Q109j5406O852l359
$$ plain form
6876 -20937 -37737 -52120 -50608 -27308 22114 19464 8754 9377 33405 23442 10855 -11482 -17901
6863 -17901 -9696 -8772 -5171 10905 19045 40699 64010 56100 44144 22723 19594 26287 -9906
6850 -9906 -11362 13130 28094 16033 -14806 -20369 -17354 -18593 -21527 -30998 -44210 -25866 -4353
6837 -4353 -10401 7619 24705 5457 12739 38346 38041 13737 -9816 -22531 -19848 21264 31412
6824 31412 9911 -12067 -781 22271 11045 -35604 -28013 -8198 -1488 -20869 -13533 5901
6812 5901 -7465 4864 35844 47506 47136 41425 62513 39896 -15934 -830 22322 29899 21442
6799 21442 1196 -6573 -28488 -22654 -19526 16683 51980 14505 9210 18305 21491 17059 -2800
6786 -2800 -26778 -18103 6601 -17304 -155 18893 50213 32558 -11660 -3551 -18957 -12105 -15464
6773a5464o457n975j1250j548L2644K976k841p69Q273m678r994K0846K4681N180
6759C5624q717Q555J0222n210k7888k085M526l3912q479j2333q154K9353Q749
6746i749N650j2316J331J7242j3402K4456J9935l647j7713j7402j2777q271J4478
6733a2185K797p694L51K0948n092n7307o938K5338Q038J6202J2419K1663K0390
6720C8930l0305k4721J3890k932J4513J4530K683J22l4780Q081o093M1709j820
6707C3807j6151l452J8938k6495l3298K9820Q434j0181j5670j2490M419p783K668
6694b7434K8459j6138j5115P766j0919K0394j1117j5655n477K3304m829k3922
6682e0683P900J0840J7603L981j906p441p032K1383J8476k5111j0872Q719k2725
$$ plain form
6773 -15464 -21921 -27896 -39146 -40694 -8050 -5074 -7915 -8684 -411 -5089 -15083 5763 30444 35624
6759 35624 26907 35462 45684 40474 12586 10501 15027 -18885 -27364 -39697 -47851 -18498 -9749
6746 -9749 -4099 -16415 -15084 2158 -11244 13212 33147 29500 11787 -5615 -18392 -26663 -12185
6733 -12185 -9388 -17082 -16731 4217 -875 -58182 -65120 -39782 -31744 -15542 -3123 18540 38930
6720 38930 8625 -16096 -2206 -5138 9375 23905 26588 26710 -8070 11 -6082 35627 33807
6707 33807 17656 14204 33142 6647 -26651 3169 11603 1422 -14248 -26738 -22319 -30102 -27434
6694 -27434 1025 -15113 -30228 -22462 -33381 -12987 -24104 -39759 -45236 -21932 -26761 -50683
6682 -50683 -42783 -31943 -14340 -10359 -12265 -19706 -26738 -5355 13121 -11990 -22862 -14143 -36868
6669c6868o388N531R450r645Q778o337J1451J0655p227K1980J0475M041M786R918
6655C0600J64P465O327J7606j3011r828n254j0027Q139O479P028l8396k3202L2250
6641A6340P034L65K4749R070p322q212k8318J4126J4663k2559j9594J2058o740
6628E660l3375l569K5632J3502n475K536l811m337Q312j8409K62k5379J3212N4331
6614B9092O674o32P199j7973m9316K0425J8941O53J7434J2593k2960k5279q090
6601a1239K7412J0444o946J0199J4413k303m4939K3451j1895o650J4240j2210
6589C977J2238j2576r052l1551j53l228L6691N0963O645k8654l5918m18J3632
6576B596M1465k7926m1699J3751J5168J2618N721J6773L5293j9296k5530J3056
$$ plain form
6669 -36868 -43256 -37725 -28275 -37920 -29142 -35479 -24028 -13373 -20600 1380 11855 15896 20682 30600
6655 30600 30764 38229 44556 62162 49151 39323 34069 24042 32181 38660 45688 7292 -15910 16340
6641 16340 23374 23739 48488 57558 50236 42024 13706 27832 42495 19936 342 12400 5660
6628 5660 -27715 -31284 -5652 7850 2375 4911 1100 -3237 5075 -13334 -13072 -38451 -25239 29092
6614 29092 35766 35134 42333 24360 -24956 -4531 14410 15063 32497 45090 22130 -3149 -11239
6601 -11239 16173 26617 19671 29870 44283 41980 -2959 20492 8597 1947 16187 3977
6589 3977 16215 3639 -5413 -36964 -37117 -40345 -3654 47309 53954 25300 -10618 -11036 2596
6576 2596 44061 16135 -25564 -11813 3355 15973 21694 38467 73760 54464 28934 41990
6564D1990m1897m0473J9116K8206n709j8297J5119K96J6987Q335p007L4578J3710
6551F4954l0684k1020o26j695Q3Q22l578J437L72j8220R13P301K5789j5392k0472
6536a0016J237r859J1969j3441j8964j2645J0679K9217K4726j7999j6659J2952
6524h803k5972J9483J9076q601j4275J9467K843j0924J325j0454j9465J3412K2203
$$ plain form
6564 41990 93 -40380 -21264 6942 1233 -17064 -1945 -1649 15338 23673 16666 51244 64954
6551 64954 34270 13250 12624 10929 11012 11834 8256 9693 10065 -8155 -7242 59 25848 10456 -10016
6536 -10016 -8779 -18638 -6669 -20110 -39074 -51719 -41040 -11823 12903 -5096 -21755 -8803
6524 -8803 -34775 -15292 3784 -4817 -19092 375 3218 -7706 -6381 -16835 -36300 -22888 -685
$$ [...]
##END NTUPLES=NMR SPECTRUM
##END=
