##TITLE=Analysis number 312239
Compound Code btb 11183
Project Code adrs
Chemist Name mariap
##JCAMPDX= 6.0         $$ Bruker NMR JCAMP-DX V2.0
##DATA TYPE= NMR SPECTRUM
##DATA CLASS= NTUPLES
##ORIGIN= Bruker BioSpin GmbH
##OWNER= NMR
$$ XWIN-NMR		Version 3.5
$$ Fri Jul 29 09:14:46 2005 GMT Daylight Time (UT+1h)  MAYBRIDGE\NMR@NMR_250MHZ
##.OBSERVE FREQUENCY= 250.131544655141
##.OBSERVE NUCLEUS= ^1H
##.ACQUISITION MODE= SIMULTANEOUS (DQD)
##.ACQUISITION SCHEME= undefined
##.AVERAGES= 16
##.DIGITISER RES= 18
##SPECTROMETER/DATA SYSTEM= dpx250
##.PULSE SEQUENCE= zg30
##.SOLVENT NAME= CDCl3
##.SHIFT REFERENCE= (INTERNAL, CDCl3, 0, 16.522)
##AUDIT TRAIL= $$ (NUMBER, WHEN, WHO, WHERE, WHAT)
$$ ##TITLE= Audit trail, XWIN-NMR		Version 3.5
$$ ##JCAMPDX= 5.01
$$ ##ORIGIN= Bruker BioSpin GmbH
$$ ##OWNER= NMR
$$ C:\u/data/dgb/nmr/ADRS/6830/pdata/1/auditp.txt
$$ ##AUDIT TRAIL=  $$ (NUMBER, WHEN, WHO, WHERE, WHAT)
(   1,<2005-07-29 09:14:28.82 +100>,<MAYBRIDGE\NMR>,<NMR_250MHZ>,
      <created by zg, POWCHK disabled, PULCHK disabled
       configuration hash MD5:
       62 19 C7 07 E1 42 D1 B7 37 6C 3D D0 77 39 F9 E6
       data hash MD5: 64K
       D3 97 A6 C2 4E 36 98 A9 C4 C9 3F 12 F1 EE 95 83>)
(   2,<2005-07-29 09:14:39.09 +100>,<MAYBRIDGE\NMR>,<NMR_250MHZ>,
      <Start of raw data processing
       ef LB = 0.3 FT_mod = 6 PKNL = 1 SI = 32K 
       data hash MD5: 32K
       43 E8 1C 9B 54 A0 02 30 3F 06 D7 93 07 E8 0A 82>)
(   3,<2005-07-29 09:14:40.82 +100>,<MAYBRIDGE\NMR>,<NMR_250MHZ>,
      <apk 
       data hash MD5: 32K
       64 F3 CD CD B7 E5 35 BB 3A AB 20 D3 C5 D4 7A 09>)
(   4,<2005-07-29 09:14:41.57 +100>,<MAYBRIDGE\NMR>,<NMR_250MHZ>,
      <abs ABSG = 5 
       data hash MD5: 32K
       F2 06 46 0F 65 20 1D 16 85 38 D8 3B 55 09 F6 7D>)
$$ ##END=
$$ 
$$ hash MD5
$$ F5 71 2C 83 31 B5 BF BD 71 81 C1 03 B8 28 3D F0
##$RELAX= 
##$RELAX= 
##$RELAX= 
##$RELAX= 
##$RELAX= 
##$RELAX= 
##$RELAX= 
$$ Bruker specific parameters
$$ --------------------------
##$DU= <C:\u>
##$EXPNO= 6830
##$NAME= <ADRS>
##$PROCNO= 1
##$TYPE= <nmr>
##$USER= <dgb>
##$AMP= (0..31)
100 100 100 100 100 100 100 100 100 100 100 100 100 100 100 100 100 100 
100 100 100 100 100 100 100 100 100 100 100 100 100 100 
##$AQSEQ= 0
##$AQ_mod= 3
##$AUNM= <au_zg>
##$AUTOPOS= <5 >
##$BF1= 250.13
##$BF2= 250.13
##$BF3= 250.13
##$BF4= 250.13
##$BF5= 500.13
##$BF6= 500.13
##$BF7= 500.13
##$BF8= 500.13
##$BYTORDA= 1
##$CFDGTYP= 0
##$CFRGTYP= 5
##$CHEMSTR= <none>
##$CNST= (0..31)
1 1 145 1 1 1 1 1 1 1 1 1 1 1 1 1 1 1 1 1 1 1 1 1 1 1 1 1 1 1 1 1 
##$CPDPRG= <>
##$CPDPRG1= <>
##$CPDPRG2= <>
##$CPDPRG3= <>
##$CPDPRG4= <mlev>
##$CPDPRG5= <mlev>
##$CPDPRG6= <mlev>
##$CPDPRG7= <mlev>
##$CPDPRG8= <mlev>
##$CPDPRGB= <>
##$CPDPRGT= <>
##$D= (0..31)
0 1 0 0 0 0 0 0 0 0.06 0 0 0 0 0 0 0.0002 0 0 0 0 0 0 0 0 0 0 0 0 0 0 
0 
##$DATE= 1122624867
##$DBL= (0..7)
120 120 120 120 120 120 120 120 
##$DBP= (0..7)
150 150 150 150 150 150 150 150 
##$DBP07= 0
##$DBPNAM0= <>
##$DBPNAM1= <>
##$DBPNAM2= <>
$$ [...]
##$SUBNAM6= <"">
##$SUBNAM7= <"">
##$SUBNAM8= <"">
##$SUBNAM9= <"">
##$SW= 20.6930455092707
##$SWIBOX= (0..15)
0 0 3 0 0 0 0 0 0 0 0 0 0 0 0 0 
##$SW_h= 5175.983436853
##$TD= 65536
##$TD0= 1
##$TE= 295.16
##$TE2= 300
##$TE3= 300
##$TEG= 300
##$TL= (0..7)
0 120 120 120 120 120 120 120 
##$TP= (0..7)
150 150 150 150 150 150 150 150 
##$TP07= 0
##$TPNAME0= <>
##$TPNAME1= <>
##$TPNAME2= <>
##$TPNAME3= <>
##$TPNAME4= <>
##$TPNAME5= <>
##$TPNAME6= <>
##$TPNAME7= <>
##$TPOAL= (0..7)
0.5 0.5 0.5 0.5 0.5 0.5 0.5 0.5 
##$TPOFFS= (0..7)
0 0 0 0 0 0 0 0 
##$TUNHIN= 0
##$TUNHOUT= 0
##$TUNXOUT= 0
##$USERA1= <user>
##$USERA2= <user>
##$USERA3= <user>
##$USERA4= <user>
##$USERA5= <user>
##$V9= 5
##$VALIST= <valist>
##$VCLIST= <CCCCCCCCCCCCCCC>
##$VD= 0
##$VDLIST= <DDDDDDDDDDDDDDD>
##$VPLIST= <PPPPPPPPPPPPPPP>
##$VTLIST= <TTTTTTTTTTTTTTT>
##$WBST= 1024
##$WBSW= 4
##$XGAIN= (0..3)
0 0 0 0 
##$XL= 0
##$YL= 0
##$YMAX_a= 543971
##$YMIN_a= -536914
##$ZGOPTNS= <>
##$ZL1= 120
##$ZL2= 120
##$ZL3= 120
##$ZL4= 120
##$ABSF1= 16.522
##$ABSF2= -4.171173
##$ABSG= 5
##$ABSL= 3
##$ALPHA= 0
##$AQORDER= 0
##$ASSFAC= 0
##$ASSFACI= 0
##$ASSFACX= 0
##$ASSWID= 0
##$AUNMP= <proc_1d>
##$AZFE= 0.1
##$AZFW= 0.1
##$BCFW= 0
##$BC_mod= 0
##$BYTORDP= 0
##$COROFFS= 0
##$CY= 12.5
##$DATMOD= 1
##$DC= 0
##$DFILT= <>
##$DTYPP= 0
##$F1P= 14.0000005364418
##$F2P= -0.99999901652339
##$FCOR= 0.5
##$FTSIZE= 32768
##$FT_mod= 6
##$GAMMA= 0
##$GB= 0
##$INTBC= 1
##$INTSCL= 1
##$ISEN= 128
##$LB= 0.3
##$LEV0= 0
##$LPBIN= 0
##$MAXI= 10000
##$MC2= 0
##$MEAN= 0
##$ME_mod= 0
##$MI= 0
##$NCOEF= 0
##$NC_proc= -3
##$NLEV= 6
##$NOISF1= 0
##$NOISF2= 0
##$NSP= 0
##$NTH_PI= 0
##$NZP= 0
##$OFFSET= 16.522
##$PC= 1
##$PHC0= 127.714
##$PHC1= 7.268132
##$PH_mod= 1
##$PKNL= yes
##$PPARMOD= 0
##$PSCAL= 4
##$PSIGN= 0
##$REVERSE= no
##$SF= 250.13
##$SI= 32768
##$SIGF1= 0
##$SIGF2= 0
##$SINO= 400
##$SIOLD= 32768
##$SREGLST= <1H.CDCl3>
##$SSB= 0
##$STSI= 32768
##$STSR= 0
##$SW_p= 5175.98343685301
##$SYMM= 0
##$S_DEV= 0
##$TDeff= 65536
##$TDoff= 0
##$TI= <Analysis number 999999
Compound Code 99
Book Reference 9
Project Code 9>
##$TILT= no
##$TM1= 0
##$TM2= 0
##$TOPLEV= 0
##$USERP1= <user>
##$USERP2= <user>
##$USERP3= <user>
##$USERP4= <user>
##$USERP5= <user>
##$WDW= 1
##$XDIM= 32768
##$YMAX_p= 414631591
##$YMIN_p= -93041
$$ End of Bruker specific parameters
$$ ---------------------------------
##NTUPLES= NMR SPECTRUM
##VAR_NAME=  FREQUENCY,     SPECTRUM/REAL,   SPECTRUM/IMAG
##SYMBOL=    X,             R,               I
##VAR_TYPE=  INDEPENDENT,   DEPENDENT,       DEPENDENT
##VAR_FORM=  AFFN,          ASDF,            ASDF
##VAR_DIM=   32768,         32768,           32768
##UNITS=     HZ,            ARBITRARY UNITS, ARBITRARY UNITS
##FACTOR=    0.157963299565203, 1,           1
##FIRST=     4132.6476996994, 0,             0
##LAST=      -1043.33573715361, 0,           0
##MIN=       -1043.33573715361, -93041,      0
##MAX=       4132.6476996994, 414631591,     0
$$ Real data points
##PAGE= N=1
##DATA TABLE= (X++(R..R)), XYDATA
$$ [...]
17000I1055J1926R388K0092K7160L0007L1065L0177K7215K2025K4028K0833J3986
16988C58957J0971J2152M899N186O525J871K58M456J310o3L041k205q259j0978
16974C88121j1073j7259k0520k3731k8801l2446k8012l0314k6523k6063k4588
16963A18791k0915r855n745j0219k011j660m719Q31J400J609Q051J2523J2460
16950A00541J6429J9522K0045K4527K6950K7410K8827K2211K1609J8206J4724
16939C41001R950M527O672R968P475L919M056j817j2q78j983m731r373j2186j4831
16924C41757j6323k0769k8238l3618l0973k7548k6539k1792k0037j8651j8600
16913G8669j3763j2390o360l599p98j76j717m970k540j463Q34j583j270k718j153
$$ plain form
17000 91055 102981 112369 132461 159621 189628 220693 250870 278085 300110 324138 344971 358957
16988 358957 369928 382080 386979 392165 398690 400561 400819 405275 406585 406522 409563 407358 399099 388121
16974 388121 377048 359789 339269 315538 286737 254291 226279 195965 169442 143379 118791
16963 118791 97876 88021 82276 72057 70046 68386 63667 64498 65898 67507 75558 88081 100541
16950 100541 116970 136492 156537 181064 208014 235424 264251 286462 308071 326277 341001
16939 341001 350951 355478 362150 372118 379593 383512 387568 385751 385739 384861 382878 378147 368774 356588 341757
16924 341757 325434 304665 276427 242809 211836 184288 157749 135957 115920 97269 78669
16913 78669 64906 52516 46156 42557 41759 41583 39866 34896 32356 30893 31727 30144 28874 26156 25003
16898B5003M78j347j240j46N85J158N68P5j621l277J462Mj023l560J59K572j443
16881A8407l25R33k7P21Q59K09j977j17J929k225m003J67p02J199K797j281k680
16864A3884n93R64j030L469j515J900L192M23r31k186l54P74k524M32J478K419
16848A9802l695l83J566K797j556j314k689J693J238k94l391k968k314J524M829
16833A4845K205K36r27j582P83j400k389j218k332o98k408O74J017L024K049j243
16817A0636r74J641l036J333J38J909J515j375j700J159K691K365R47J146k434
16802A5961N92j296j602L62J368L467j144l702l930J645J187n04l747M39J329
16787A0425J148k127j056o44J63J05O36j135L15k209K494M258J860k54k276K064
$$ plain form
16898 25003 25481 24134 22894 22748 23333 24491 25059 25134 23513 20236 21698 21702 20679 17119 17278 19850 18407
16881 18407 18082 19015 18988 19709 20568 20777 18800 18683 20612 18387 14384 14551 13849 15048 17845 16564 13884
16864 13884 13291 14255 13225 16694 15179 17079 20271 20694 19763 17577 17223 17997 15473 15905 17383 19802
16848 19802 16107 15724 17290 20087 18531 17217 14528 16221 17459 17165 13774 10806 8492 10016 14845
16833 14845 17050 17286 16359 14777 15560 14160 11771 10553 8221 7523 5115 5789 6806 9830 11879 10636
16817 10636 9662 11303 8267 9600 9738 11647 13162 11787 10087 11246 13937 16302 17249 18395 15961
16802 15961 16553 15257 13655 14017 15385 18852 17708 14006 10076 11721 12908 12404 8657 9096 10425
16787 10425 11573 9446 8390 7746 7909 8014 8650 7515 7830 5621 8115 12373 14233 13979 11703 13767
16771A3767O8q45j064R03o16j943j405r51O67k312N82K422P35n43J324k45K201
16754A2745M364l1p89J844k756k003j237K36N43k256l031j692K09k301J215o94
16738D366o12K792j48l44K121j797j089J167J023K006J111n98j79j76J095N15
16722A1253m413j823K728L206j160l33j986K514Q97Q08m262k094J713J064L80
16707H492r57k113k511J442K056R82K574j321J189L587n11l971j354n024J67q01
16691A926L43L292J493R90K429J264j021q57j59l57J111kj967j069k256k607J557
16674D110K524k401j880K716M370J907j693k11R8k576K264k127l556o65J35M322
16658G337L491j9k980o21J88p58k263j670N57M18k650j696J91K117J771M84p33
$$ plain form
16771 13767 13835 12990 11926 12829 12213 10270 8865 7914 8581 6269 6851 9273 10008 9465 10789 10544 12745
16754 12745 17109 17078 16289 18133 15377 13374 12137 12373 12916 10660 7629 5937 6146 3845 5060 4366
16738 4366 3754 6546 6398 6054 8175 6378 5289 6456 7479 9485 10596 9998 9819 9643 10738 11253
16722 11253 6840 5017 7745 10951 9791 9458 7472 9986 10883 11691 7429 5335 7048 8112 8492
16707 8492 7535 5422 2911 4353 6409 7391 9965 8644 9833 13420 12909 8938 7584 2560 2727 1926
16691 1926 2269 5561 7054 8044 10473 11737 10716 9859 9700 9343 10454 10452 8485 7416 5160 2553 4110
16674 4110 6634 4233 2353 5069 9439 11346 9653 9442 9540 6964 9228 7101 3545 2880 3015 7337
16658 7337 10828 10809 7829 7208 7396 6638 4375 2705 3262 3680 1030 -666 -475 1642 3413 3897 3164
16641C164L50j365k843l183J967K839N68n99J075K862p84J393J810K15L070J282
16625A1821j375l094j874J37R46j408j292m04L181l78k158l415n62q21K200L614
16609E118M108O07l111j494J629k85O0k689j450O15P10K047q72J323J628j537
16593F407Q63o1j235k050J696K0k128J074J137j116J115l29K827L207j883k654
16577F890R59p13K545j386l764p70j504Q30j133k456K299L166p36j118j977k25
16561I07O06J455j50J739K157L523j653j505m1k94j120p68L601J919K294r46J832
16544A3556j035k992r50L30k030r70l286p00J615O49r96j232J716j273K561M612
16528I575j057m426j221j891K154J95l64L45J254k829p88J320K480J800k232k116
$$ plain form
16641 3164 3514 2149 -694 -3877 -1910 929 1497 898 1973 4835 4051 5444 7254 7469 10539 11821
16625 11821 10446 7352 5478 5615 6561 5153 3861 3457 6638 6260 4102 687 125 -696 1504 5118
16609 5118 9226 9833 6722 5228 6857 6572 6632 3943 2493 3108 3818 5865 4993 6316 7944 6407
16593 6407 7270 7209 5974 3924 5620 5640 3512 4586 5723 4607 5722 5393 8220 11427 9544 6890
16577 6890 7849 7136 9681 8295 4531 3761 2257 3087 1954 -502 1797 4963 4227 3109 1132 907
16561 907 1513 2968 2818 4557 6714 10237 8584 7079 7038 6744 5624 4856 8457 10376 12670 11724 13556
16544 13556 12521 9529 8579 8909 6879 5909 2623 1923 3538 4187 3191 1959 3675 2402 4963 9575
16528 9575 8518 4092 2871 980 3134 3329 2965 3310 4564 1735 947 2267 4747 6547 4315 2199
16512B199J45J090l76M614L093j842l169j629Q3Q51j217P90K218k87j446j345
16496C772K944O62o27K85p14j712j483j357L9K360j136j644J83P41j611j869K226
16479A059K080J250l82r47L44n35j419k589j844L476k29N19R33Q9K39L08J55j536
16461I71l01k5p86J767j497n063j571L934O445N91j596pM135K659l221m004N63
16444B994K200j195l375k252p61p35m180q08N607K627m86J281M56l21K83j34k87
16427I14l660m249O94K77N808P26J447Q67j115l180p29N7k095L81o56Q51J498
16410b164M681K999k800o872n90N244K995J537j537l480L58M389n02k307j995
16395d4J033K850J60j667K959j48L79K78j513J536L625j50q251k673K926j185
$$ plain form
16512 2199 2344 3434 3058 7672 10765 8923 5754 4125 4208 5059 3842 4632 6850 6563 5117 3772
16496 3772 6716 7378 6751 7036 6322 4610 3127 1770 1809 4169 3033 1389 1572 2313 702 -1167 1059
16479 1059 3139 4389 4007 3060 3404 2869 1450 -1139 -2983 493 264 783 1716 1805 2044 2352 2507 971
16461 971 670 645 -141 1626 129 -4934 -6505 -2571 3874 4465 2869 2862 6997 9656 6435 2431 2994
16444 2994 5194 3999 624 -1628 -2389 -3124 -7304 -8112 -2505 122 -364 917 1373 1052 1335 1201 914
16427 914 -2746 -6995 -6301 -6024 -216 510 1957 2824 1709 -1471 -2200 -2143 -4238 -3857 -4513 -3662 -2164
16410 -2164 2517 5516 2716 -4156 -4746 498 3493 5030 3493 13 371 4760 4258 1951 -44
16395 -44 989 3839 3999 2332 5291 5143 5522 5800 4287 5823 9448 9298 1047 -1626 1300 115
16379A15p77Q96J77q19J856P6m680l531o75l171Q03M224N408Q77j523n2K718K87
16361B209n99K58m77Q05R06j220j904k275K85j793J240o21j284q91r08J207J044
16344d018J706K939M916Q19N23K254N97J659k664J68l281l026J401k266n063j933
16328e269K754K679O74k22J437P59L89q9j518K4q72p75n03K313Q92R64K013J105
16310F755J632j574k298J78k194J59k465o14N095K044R32j469n950m953Q57L070
16294g95J301j139k35K610L558L447J746k320l663m234k945L46K22J570k07J87
16278e51M368m19k52J971k401m559j39N16J559M47N3m6J160k732k577k761r17
16261g280K976J677l64J612K111o0K46K012q01J11R09k80k06J53k265m333j332
$$ plain form
16379 115 -662 234 411 -408 1448 1524 -3156 -6687 -7362 -10533 -9730 -5506 -98 779 -744 -796 1922 2209
16361 2209 1610 1868 1391 2196 3102 1882 -22 -2297 -2012 -3805 -2565 -3186 -4470 -5361 -6269 -5062 -4018
16344 -4018 -2312 627 5543 6362 6885 9139 9736 11395 8731 8899 5618 2592 3993 1727 -3336 -5269
16328 -5269 -2515 164 838 616 2053 2812 3201 3112 1594 1618 746 -29 -532 1781 2673 3637 5650 6755
16310 6755 8387 6813 4515 4693 2499 2658 193 -421 4674 6718 7650 6181 231 -4722 -3865 -795
16294 -795 506 -633 -868 1742 5300 8747 10493 8173 4510 276 -2669 -2323 -2101 -531 -738 -551
16278 -551 3817 3398 3146 5117 2716 -1843 -1982 -1466 93 540 593 547 1707 -1025 -3602 -6363 -7280
16261 -7280 -4304 -2627 -2991 -1379 732 672 918 2930 2129 2240 3149 2869 2663 2816 551 -3782 -5114
16244e114M35K582k238j634j164l010L376L601K329J21K192J002l63l363j523
16229b771K450K811J535j971r71l5L361J345l708j997n831O51p1L987k178N59
16213b834J508J0j074pJ791k801j171L327O21j181k776k287O12P68N09K86j768
16196f467j855j534J960J556J199L4k867k34K362M84j244K616K996J813r73J67
16180A3j315k240J286J407L559J96k947K042q84q07l072j767R38J478K801l82
16164C06r75k824k710j594K538j018K094L404r33j921n22R3J871N858k0m23l34
16147B890J514j414k557j62j598j861J964k099m089O28J883o29m04K842L377j650
16131a365r91k033n30J278J036J769l350k029M576K461j896j62K877M381L158
$$ plain form
16244 -5114 -4679 -2097 -4335 -5969 -7133 -10143 -6767 -3166 -837 -716 1476 2478 2115 -1248 -2771
16229 -2771 -321 2490 4025 2054 1083 1048 4409 5754 2046 49 -5782 -5131 -5202 -1215 -3393 -2834
16213 -2834 -1326 -1316 -2390 -2397 -606 -3407 -4578 -1251 -630 -1811 -4587 -6874 -6262 -5494 -4985 -4699 -6467
16196 -6467 -8322 -9856 -7896 -6340 -5141 -5107 -7974 -8208 -5846 -5362 -6606 -3990 -994 819 -154 13
16180 13 -1302 -3542 -2256 -849 2710 2906 -41 2001 1117 310 -2762 -4529 -3591 -2113 688 306
16164 306 -669 -3493 -6203 -7797 -5259 -6277 -4183 -779 -1712 -3633 -4155 -4062 -2191 3667 3647 3224 2890
16147 2890 4404 2990 433 271 -1327 -3188 -1224 -3323 -7412 -6784 -4901 -5530 -5934 -3092 285 -1365
16131 -1365 -2356 -4389 -4919 -3641 -2605 -836 -4186 -6215 -1639 822 -1074 -1236 1641 6022 9180
16116I180k771J419q45m415k659l402o17J72k83L302R63l567l585L688J777L24
16100a319Q49J209j95q8k168J112j018l100P13L2m759M56K370K902L825M131K330
16083G282J563k945m085N27K924l48K15k191k334M222J307J352j523j694R28j193
16067D007m165M70j667l885q75M63M81q45j711K154J420k136K192P80r98K915
16051a400O518M365Q39k772j673k741l560L779P401L438o30k082L58k687j086
16036H067M08j003L91k277k893j36j77l856k939N19k087M26J763k629J015J95
16020e213q85j352q84K938M182K646j706j192K945K129L314M676m54k666K24j414
16004G288k209l032R99J264j141k360l368K86j386K026j470m279l877O31M65m346
$$ plain form
16116 9180 6409 7828 6983 2568 -91 -3493 -4110 -3938 -4221 -919 44 -3523 -7108 -3420 -1643 -1319
16100 -1319 -470 739 544 456 -1712 -600 -1618 -4718 -4005 -3973 -8732 -8276 -5906 -3004 821 4952 7282
16083 7282 8845 5900 1815 2342 5266 4918 5133 2942 608 4830 6137 7489 5966 4272 5200 4007
16067 4007 -158 312 -1355 -5240 -6115 -5652 -5171 -6016 -7727 -5573 -4153 -6289 -4097 -3317 -4315 -1400
16051 -1400 5118 9483 10322 7550 5877 3136 -424 3355 10756 14194 13564 11482 11840 9153 8067
16036 8067 8475 7472 7863 5586 2693 2557 2380 -1476 -4415 -3896 -5983 -5557 -3794 -6423 -5408 -5213
16020 -5213 -6098 -7450 -8334 -5396 -1214 1432 -274 -1466 1479 3608 6922 11598 11144 8478 8702 7288
16004 7288 5079 2047 3046 4310 3169 809 -2559 -2273 -3659 -1633 -3103 -7382 -11259 -10628 -10163 -14509
15988a4509j844O039M673J614J20k162j766j424L399N247O961M647J064k57j807
15973I995m592m220j77J143n02l236n262k865L16J172L167J099Q35n89o20j191
15957e527K460r5q32K640k354J719K968J281J489J509j638j579l324j720R38K494
15941D29L457o15k263j297j962j033m193P91N511j709m620k048J580K835K552
15926b585j147o463l383L528L526J962R60R07k986m404r23J356K48N77j62M429
15910d560L177m812l623j782M36J171j281n70K127L687J672L03k099q88J613K733
15894b696k417r56K81j423N01K691o55L08O57k035k600l11o4P47K296K247J832
15877a597k094m93k650l324k378p32r36l65L107M254M874J441j220l026J052p13
$$ plain form
15988 -14509 -16353 -10314 -5641 -4027 -3907 -6069 -7835 -9259 -5860 -613 6348 10995 12059 11802 9995
15973 9995 5403 1183 1006 2149 1647 -1589 -6851 -9716 -9400 -8228 -5061 -3962 -3127 -3716 -4336 -5527
15957 -5527 -3067 -3162 -3994 -1354 -3708 -1989 979 2260 3749 5258 3620 2041 -1283 -3003 -2065 429
15941 429 3886 3271 1008 -289 -2251 -3284 -7477 -6686 -1175 -2884 -7504 -9552 -7972 -5137 -2585
15926 -2585 -3732 -10195 -13578 -10050 -6524 -4562 -3602 -2695 -5681 -10085 -11008 -9652 -9404 -8827 -8989 -4560
15910 -4560 -1383 -6195 -9818 -11600 -11164 -9993 -11274 -11844 -9717 -6030 -4358 -4055 -6154 -7042 -5429 -2696
15894 -2696 -5113 -6069 -5788 -7211 -6710 -4019 -4674 -4366 -3709 -5744 -8344 -8655 -8719 -7972 -5676 -3429 -1597
15877 -1597 -3691 -4184 -6834 -10158 -12536 -13268 -14204 -14569 -11462 -7208 -2334 -893 -2113 -5139 -4087 -4800
15861d800j264j074j707j367L836K719L05l104K695J102m744j286J341K018j313
15846f643rM44k5k455l43r24Q59L539k081k229L522M354J446k989J263j672R58
15829b985O5o30m33l890K59K209j397M08L91q39l455l464J735M519m55k235j186
15812a1383K902K205j209L478j1o6K84K600N86j383o00k060R93q2j210P14K89
15795c953q58j078j714k164p35j960m03J712K498J702J720M62j554j714j646K733
15779f952k143J125K460L706L075l307k909L046j921k163O94j165r82J032K284
15764d120k504j630O02M88O9o42P78j586N51k106L43n17L04N457j95n921K766
15747g863N2K350Q55j451r45J300q17J24o35l454j591K283M21O98j232K35o9k487
$$ plain form
15861 -4800 -6064 -7138 -8845 -10212 -6376 -3657 -3352 -6456 -3761 -2659 -7403 -8689 -7348 -5330 -6643
15846 -6643 -6652 -6208 -6233 -8688 -9031 -9955 -9096 -5557 -7638 -9867 -6345 -1991 -545 -3534 -2271 -3943 -2985
15829 -2985 -2920 -3550 -3983 -7873 -7614 -5405 -6802 -6394 -6003 -6842 -10297 -13761 -12026 -7507 -7962 -10197 -11383
15812 -11383 -8481 -6276 -7485 -4007 -4018 -4084 -3800 -1200 -614 -1997 -2597 -4657 -3664 -3746 -4956 -4242 -3953
15795 -3953 -4811 -5889 -7603 -9767 -10502 -12462 -12865 -11153 -8655 -6953 -5233 -4771 -6325 -8039 -9685 -6952
15779 -6952 -9095 -7970 -5510 -1804 1271 -2036 -4945 -1899 -3820 -5983 -5289 -6454 -7436 -6404 -4120
15764 -4120 -6624 -8254 -7652 -7164 -7095 -7737 -6959 -8545 -7994 -10100 -9757 -10274 -9970 -4513 -4708 -10629 -7863
15747 -7863 -7811 -5461 -4606 -6057 -7002 -5702 -6519 -6395 -7030 -10484 -12075 -9792 -9371 -8673 -9905 -9670 -9739 -12226
15729a2226k277k682N2N052M008j141J474J449J08O97l631n52L836L734k189k552
15713f840n525n183L032K651j1j27k08M444M192k529OR49L74j07j439o238J104
15696a1455L047K06R3L61J144J03l581j176K548K720J623j142l927k676j986J158
15680a2940J120Q47j065K672J945p25k09J265l71k504k834pL142r26K22m103n30
15663a5001o22K259J119j533J47K632k342m97k816j200N456K918j689k465K670
15648a0964K80K097K864o94k332j116K023L003j927k368j221k65j46r01N71K841
15632h255r65j171j960j797j071K773J272J001j382j863K248j287j055R18K762
15617i832p67J58L390k613j025n63qL083J132J143j165L7k017J810q72N86J934
$$ plain form
15729 -12226 -14503 -17185 -17133 -12081 -8073 -9214 -7740 -6291 -6183 -5486 -9117 -9669 -5833 -2099 -4288 -6840
15713 -6840 -12365 -17548 -14516 -11865 -11876 -12003 -12211 -7767 -3575 -6104 -6098 -5149 -4775 -4882 -6321 -12559 -11455
15696 -11455 -8408 -8202 -8109 -7748 -6604 -6501 -10082 -11258 -8710 -5990 -4367 -5509 -9436 -12112 -14098 -12940
15680 -12940 -11820 -10973 -12038 -9366 -7421 -8146 -8355 -7090 -7461 -9965 -12799 -12806 -9664 -10590 -10368 -14471 -15001
15663 -15001 -15623 -13364 -12245 -13778 -13631 -10999 -13341 -13838 -16654 -17854 -12398 -9480 -11169 -13634 -10964
15648 -10964 -10684 -8587 -5723 -6417 -8749 -9865 -7842 -4839 -6766 -9134 -10355 -10620 -10766 -11667 -11096 -8255
15632 -8255 -9220 -10391 -12351 -14148 -15219 -12446 -11174 -10173 -11555 -13418 -11170 -12457 -13512 -12594 -9832
15617 -9832 -10599 -10441 -7051 -9664 -10689 -11252 -11260 -8177 -7045 -5902 -7067 -7030 -9047 -7237 -8109 -7523 -5589
15600e589n971k95M944L589j80k954J705L80j380k544j712k105l85N38N13L212
15584h234K668n433p41J98j671m157J616J670K37O34J354l76J269J230O74J664
15568g398k302j173J57l3o348j022M38j436K642J011M196R20k573N158J524j657
15552g896l405j562j546q5J777K633J576j893k32Q64j88Q74J535L180Q82q64l20
15535d670m66L11k159m019M54L661n30J064K0l588l486L514J892K98L51j059j8
15518h430l17j212L543N283k857n016k146j827m680m593J935M023M45K712j57
15503a3294o91j86L513r74j431L886j32m71R89L125J43j091k268L04K399K39o72
15486f612N84o88K956l69k13k980L52K137O1K181K853j804l268N4j321m357k068
$$ plain form
15600 -5589 -11560 -11855 -6911 -3322 -3502 -6456 -4751 -4371 -5751 -8295 -10007 -12112 -12497 -11959 -11446 -8234
15584 -8234 -5566 -10999 -11740 -11542 -13213 -17370 -15754 -14084 -13847 -13213 -11859 -12235 -10966 -9736 -9062 -7398
15568 -7398 -9700 -10873 -10716 -10749 -17097 -18119 -17681 -19117 -16475 -15464 -11268 -10348 -12921 -7763 -6239 -7896
15552 -7896 -11301 -12863 -14409 -14494 -12717 -10084 -8508 -10401 -10633 -9769 -9957 -9083 -7548 -4368 -3486 -4350 -4670
15535 -4670 -5136 -4825 -6984 -11003 -10549 -6888 -7418 -6354 -6334 -9922 -13408 -9894 -8002 -7704 -7353 -8412 -8430
15518 -8430 -8747 -9959 -6416 -1133 -3990 -9006 -11152 -12979 -17659 -22252 -20317 -16294 -15849 -13137 -13294
15503 -13294 -13985 -14171 -10658 -11632 -13063 -9177 -9309 -9780 -8791 -5666 -5523 -6614 -8882 -8578 -6179 -5940 -6612
15486 -6612 -6028 -6716 -3760 -4129 -4342 -7322 -6970 -4833 -4772 -2591 262 -1542 -4810 -4756 -6077 -10434 -12502
15469a2502J26K546J340j661j47J354N07j066l745l027O57m191K555L984J47J225
15453a1898M75N1J12K75K69K451k350L126K146j005k101k623r55j585j008J878
15437a2742J154M164L256J035r25l422k207n14N11r71k149J577O53J218J609k157
15421i910k059J645o73O53L3P56K384k473J265K113m824l39J984M082K401l019
15405e981J225k816q16K138r10l647j483J498l14K777j602k149J050k302p89k891
15389a7012k340p93O94J159L87J181J795K952P58J163j356k004K36O35j656J803
15373a2398q27j20O97Q51J863J017l15j9k498J524O77Q24K642j27K759k001l112
15356h563k068j908k195o88r98K191N418k30mk082j382m91P75M322J409P57k184
$$ plain form
15469 -12502 -12376 -9830 -8490 -10151 -10298 -8944 -8437 -9503 -13248 -16275 -15618 -19809 -17254 -13270 -13123 -11898
15453 -11898 -11423 -11372 -11260 -10985 -10716 -8265 -10615 -7489 -5343 -6348 -8449 -11072 -12027 -13612 -14620 -12742
15437 -12742 -11588 -7424 -4168 -3133 -4058 -7480 -9687 -10201 -9690 -10661 -12810 -11233 -10580 -9362 -7753 -9910
15421 -9910 -11969 -10324 -10997 -10344 -10311 -9555 -7171 -9644 -8379 -6266 -11090 -11429 -9445 -5363 -2962 -5981
15405 -5981 -4756 -7572 -8388 -6250 -7160 -10807 -12290 -10792 -11106 -8329 -9931 -12080 -11030 -13332 -14121 -17012
15389 -17012 -19352 -20145 -19451 -18292 -17905 -16724 -14929 -11977 -11219 -10056 -11412 -13416 -13180 -12545 -14201 -12398
15373 -12398 -13225 -13345 -12648 -11797 -9934 -8917 -9232 -9251 -11749 -10225 -9548 -8724 -6082 -6209 -3450 -5451 -8563
15356 -8563 -10631 -12539 -14734 -15422 -16420 -14229 -8811 -9041 -9045 -11127 -12509 -13000 -12225 -7903 -6494 -5737 -7921
15339g921j000M97J89j375j9j999k228p46j428k296R62M130K096J75j441J268
15323a1136J735j462O79l573M0j15j664J773J485k7J249J543p92j761k677M88
15307a4215Q63J062M732J452l018j848J115k698k338J808N08P21J618L23j207
15292a1122j858Q27m95j461P23o2j384j733k142j055L692j15K91K938j853k464
15276a7273R43K697J078j846j318r83K847L725K83r54j785n618J078M706L322
15261i098K239j633l171o18n0P09n19J254j502r27J402K276p72j995j390J178
15245a2617J646j035k533j674M09J256j63L997K007q54P34Q40k880k428K870K689
15229g736J445m741m726k010k183O32K466j102k51j041L029M420q95K131Q48J831
$$ plain form
15339 -7921 -8921 -8424 -8235 -9610 -9629 -11628 -13856 -14602 -16030 -18326 -17364 -13234 -11138 -10963 -12404 -11136
15323 -11136 -9401 -10863 -10184 -13757 -13717 -13832 -15496 -13723 -12238 -12265 -11016 -9473 -10265 -12026 -14703 -14215
15307 -14215 -13352 -12290 -7558 -6106 -9124 -10972 -9857 -12555 -14893 -13085 -12577 -11856 -10238 -9915 -11122
15292 -11122 -12980 -12153 -12648 -14109 -13386 -13448 -14832 -16565 -18707 -19762 -16070 -16185 -15894 -12956 -14809 -17273
15276 -17273 -16330 -13633 -12555 -14401 -15719 -16702 -13855 -10130 -9847 -10801 -12586 -18204 -17126 -12420 -9098
15261 -9098 -6859 -8492 -11663 -12281 -12331 -11622 -12141 -10887 -12389 -13316 -11914 -9638 -10410 -12405 -13795 -12617
15245 -12617 -10971 -12006 -14539 -16213 -15804 -14548 -14711 -10714 -8707 -9561 -8827 -7987 -10867 -13295 -10425 -7736
15229 -7736 -6291 -11032 -15758 -17768 -19951 -19319 -16853 -17955 -18206 -19247 -16218 -11798 -12693 -10562 -9714 -7883
15213g883j080J405J661j832J200R54J713p43k47Q3l199k400l18j932J1L764n00
15196i343j617k271l403K849L393K384m076j496K588o36k733k782J789J412k337
15181a6279l838l800K474L637J575J572J985J319l47R28J767k526j342K52K043
15166a0580Q80r11j509m10K794L04O67l126k833p13J935j095j442J875M12J654
15150a2098M85J236l726o05K214k856k186Q89M639n16k146j696J564J362O4O82
15134a2694r61J000Q95k485k78o49J4L2j112n08K972K979J551l25l269j947J684
15117a3101N60L348m26J25J029K251k45M26J700J041J014O62k721O55N92O27K358
15100a05M107M766O035J604k950m929m078k478L23j621p09N496P274j322m196
$$ plain form
15213 -7883 -8963 -7558 -5897 -7729 -6529 -5575 -3862 -4605 -4852 -4769 -7968 -10368 -10686 -12618 -12607 -8843 -9343
15196 -9343 -10960 -13231 -16634 -13785 -10392 -8008 -12084 -13580 -10992 -11628 -14361 -17143 -15354 -13942 -16279
15181 -16279 -20117 -23917 -21443 -17806 -16231 -14659 -12674 -11355 -11702 -10774 -9007 -11533 -12875 -12623 -10580
15166 -10580 -9700 -10611 -12120 -12530 -9736 -9432 -8765 -11891 -14724 -15437 -13502 -14597 -16039 -14164 -13752 -12098
15150 -12098 -11613 -10377 -14103 -14708 -12494 -15350 -17536 -16647 -12008 -12524 -14670 -16366 -14802 -13440 -13376 -12694
15134 -12694 -13655 -12655 -11760 -14245 -14523 -15172 -15158 -15126 -16238 -16746 -13774 -10795 -9244 -9569 -12838 -14785 -13101
15117 -13101 -12541 -9193 -9619 -9494 -8465 -6214 -6459 -6033 -4333 -3292 -2278 -1616 -4337 -3682 -3090 -2463 -105
15100 -105 4002 8768 14803 16407 13457 8528 4450 1972 2295 674 -35 5461 12735 11413 7217
15085G217j768m992l190j03L48J064J729J246Q10j388l864k791n63p94K64Q71
15069e904J115O35n25j844J565J221k180K758j067J382k366n761l66O3L19R85
15053i970J397o41p72J588j37j156k193j447L19L254N009j338L13J026q49j796
15037g393m080r30m86q9J314K592N62k859p79p77j104J889J615K52j636J584J471
15020h854j483J287n79l553N57Q47j826L292M097k485j474j861r31J37L188L492
15004f149J084J982K7j811L094L288J374k385n700n79Q0j330J664P44M932M450
14988D765L055J250q01j912m186k352q93O49O976Q289J272l067l203m359n338
14973A45o070k195p8J606J130j250K867J986m31l499k468k926n2R85N03K966l421
$$ plain form
15085 7217 5449 457 -2733 -2836 -2488 -1424 305 1551 2361 973 -2891 -5682 -6245 -7039 -6775 -5904
15069 -5904 -4789 -4154 -4679 -6523 -4958 -3737 -5917 -3159 -4226 -2844 -5210 -10971 -11337 -11274 -10955 -9970
15053 -9970 -8573 -9214 -9986 -8398 -8535 -9691 -11884 -13331 -13012 -9758 -4749 -6087 -5774 -4748 -5597 -7393
15037 -7393 -11473 -12403 -12889 -12978 -11664 -9072 -8510 -11369 -12148 -12925 -14029 -12140 -10525 -10273 -11909 -10325 -8854
15020 -8854 -10337 -9050 -9629 -13182 -12625 -11778 -13604 -10312 -6215 -8700 -10174 -12035 -12966 -12829 -9641 -6149
15004 -6149 -5065 -3083 -3056 -4867 -1773 1515 2889 504 -5196 -5775 -5695 -7025 -5361 -4617 315 4765
14988 4765 7820 9070 8269 6357 2171 -181 -1074 -425 6551 14840 16112 13045 9842 5483 145
14973 145 -5925 -8120 -8198 -6592 -5462 -6712 -3845 -1859 -2290 -5789 -8257 -11183 -11235 -10250 -9747 -6781 -10202
14956a0202n67L94l665n51J605j094L767M361j56l296j175J83L32K154j606n396
14940a4912j374J588M049J876P88j547k690K18J267k564N69k193j110J225k39
14925a5049n89j157P71K024J902k806k300K744p20K370K227k329j569k341j5n03
14909a7340l97K858J880L008o5K487L95l511J797J092j74k075j418j468j847j487
14893a6265L801m90j911k335N56k202j484K484N167M535n39k421J60N51l213l432
14877a7038j553J93K807M81K172O101J412l183l053n55l357L390K791K958O935
14862E01O749M501L845p67l178l350l066k944Q99L382O958N507j781l636n497
14847H123o560m588J551K410j22j702j111j125m714l166k154l342m98Q42j422
$$ plain form
14956 -10202 -10769 -10375 -14040 -14591 -12986 -14080 -10313 -5952 -6108 -9404 -10579 -10396 -10064 -7910 -9516 -14912
14940 -14912 -16286 -14698 -10649 -8773 -7985 -9532 -12222 -12004 -10737 -13301 -12732 -14925 -16035 -14810 -15049
14925 -15049 -15638 -16795 -16024 -14000 -12098 -14904 -17204 -14460 -15180 -12810 -10583 -12912 -14481 -16822 -16837 -17340
14909 -17340 -17737 -14879 -12999 -9991 -10056 -7569 -7174 -10685 -8888 -7796 -7970 -10045 -11463 -12931 -14778 -16265
14893 -16265 -12464 -12954 -14865 -17200 -16644 -18846 -20330 -17846 -12679 -8144 -8683 -11104 -10944 -10393 -13606 -17038
14877 -17038 -18591 -18398 -15591 -15110 -12938 -6837 -5425 -8608 -11661 -12216 -15573 -12183 -9392 -6434 501
14862 501 7250 11751 15596 14829 11651 8301 5235 2291 3190 6572 13530 19037 17256 13620 8123
14847 8123 1563 -3025 -1474 936 814 -888 -1999 -3124 -7838 -11004 -13158 -16500 -16998 -16156 -17578
14832a7578J24K364K018L276m933m864P45L194K433K37Q47j605N41j447P85P80
14816a3083J034j582j02K48N11K781n09J078J559J883m135K083K613K447K878
14801b96l08n03J071K16J017N63O744M218r54o225o515o503l891J870L815M856
14785h25M996K543K9l430k687l442J001J573L376L769l971n818l035M46Q38K72
14769d365j359j278Q08k674k34j621K072O41j483R43k455k885j78L255l70j502
14753a2685N13P82L179K947l234r32L015P25j075j578J133L55Q15k819m459r49
14737a4267j4K873M908o6j125J221L650J186o072k867J403L866l91l360j624O32
14721a0047K572K316j191k764l223k259j571J230j746N15M411J672P4L31o24L14
$$ plain form
14832 -17578 -17454 -15090 -13072 -9796 -14729 -19593 -18848 -15654 -13221 -12984 -12137 -13742 -13201 -14648 -13863 -13083
14816 -13083 -12049 -13631 -13733 -13485 -12974 -10193 -10702 -9624 -8065 -6182 -10317 -8234 -5621 -3174 -296
14801 -296 -604 -1107 -36 180 1197 1760 8504 12722 11768 5543 -972 -7475 -11366 -9496 -5681 -825
14785 -825 4171 6714 6743 3313 626 -2816 -1815 -242 3134 6903 2932 -2886 -5921 -5475 -4637 -4365
14769 -4365 -5724 -7002 -6194 -8868 -9102 -10723 -8651 -8010 -9493 -8550 -11005 -13890 -14068 -10813 -11183 -12685
14753 -12685 -12172 -11390 -8211 -5264 -8498 -9430 -6415 -5690 -6765 -8343 -7210 -6855 -6040 -8859 -13318 -14267
14737 -14267 -14281 -11408 -6500 -6566 -7691 -6470 -2820 -1634 -7706 -10573 -9170 -5304 -5695 -9055 -10679 -10047
14721 -10047 -7475 -5159 -6350 -9114 -12337 -14596 -16167 -14937 -16683 -16168 -11757 -10085 -10011 -9680 -10304 -9990
14705i990R41K059K196j672k232J638N237J252K506L397J390k15j225k744l116
14690e78m015l781k889P05m7o04N73M009K728l814n98k2q17k445k410r69K28N43
14672a4203J649K871k58m18m505j258N206O42J206K823r13l273r70M0K858J837
14656f666J691L789M500K335j450l539l082l646m473n539K141p37J441J664K763
14641h808P83J077l588k513K934K210K16j091m00K377j659k170j408K665P89M95
14625h091J259o7q72k94j770J073J056l4l193r12J51J607m79k318O77J512J262
14608i433N2J020k12j205R81j020j785q76k587n83J962J150K821K214N14r71k417
14591a0375N63J291L060j94l116k147m169j151k18J807M843P4p57J288J475n70
$$ plain form
14705 -9990 -9049 -6990 -4794 -6466 -8698 -7060 -1823 -571 1935 5332 6722 6507 5282 2538 -578
14690 -578 -4593 -8374 -11263 -10558 -10605 -11209 -10636 -6627 -3899 -7713 -8311 -8333 -9150 -11595 -14005 -14974 -14746 -14203
14672 -14203 -12554 -9683 -9941 -10359 -14864 -16122 -10916 -10274 -9068 -6245 -7158 -10431 -11401 -11361 -8503 -6666
14656 -6666 -4975 -1186 3314 5649 4199 660 -2422 -6068 -10541 -16080 -13939 -14676 -13235 -11571 -8808
14641 -8808 -8025 -6948 -10536 -13049 -10115 -7905 -7689 -8780 -9180 -6803 -8462 -10632 -12040 -9375 -8586 -8091
14625 -8091 -6832 -6899 -7771 -8065 -9835 -8762 -7706 -7740 -10933 -11845 -11694 -10087 -10566 -12884 -12207 -10695 -9433
14608 -9433 -9381 -8361 -8573 -9778 -8797 -9817 -11602 -12478 -15065 -15648 -13686 -12536 -9715 -7501 -6987 -7958 -10375
14591 -10375 -9812 -8521 -5461 -5655 -8771 -10918 -15087 -16238 -16456 -14649 -9806 -9732 -10489 -9201 -7726 -8296
14575h296N12j978O55O0j100J106K347K675J288l092k279M9K682n582m448J741
14559a3660K178P26k290N81J799J346J246M41J212K145L292k57k990k479m21l997
14543a1128k087K51j228J315K916p69o06J844L884l367j829p80l00P15j65j016
14527a2350J241L153M647p79j092K83l556k086J219J136L23m42k158K821J036
14512f604n69k124L55N90J534j839k183J459J559J354K252J087L77J385J022J981
14496A636L139l444k481J170J599j99j215j110L50n29j560K940m89k564j314K391
14480a680J795j110j079j926k184J417K183q65J022J241K199k464k865j444k921
14465h681j423Q55j072L416N310Q29j299l660r27p24J956j021r43R40L414l24
$$ plain form
14575 -8296 -7784 -9762 -9107 -9047 -10147 -9041 -6694 -4019 -2731 -5823 -8102 -8053 -5371 -10953 -15401 -13660
14559 -13660 -11482 -10756 -13046 -12465 -10666 -9320 -8074 -7633 -6421 -4276 -984 -1241 -4231 -6710 -7131 -11128
14543 -11128 -13215 -12964 -14192 -12877 -9961 -10730 -11336 -9492 -5608 -8975 -10804 -11584 -11884 -11169 -11334 -12350
14527 -12350 -11109 -7956 -3309 -4088 -5180 -4897 -8453 -10539 -9320 -8184 -7861 -8303 -10461 -7640 -6604
14512 -6604 -7173 -9297 -8942 -8352 -6818 -8657 -10840 -9381 -7822 -6468 -4216 -3129 -2752 -1367 -345 1636
14496 1636 4775 1331 -1150 20 1619 1420 205 -905 -555 -1084 -2644 296 -193 -2757 -4071 -1680
14480 -1680 115 -995 -2074 -4000 -6184 -4767 -2584 -3449 -2427 -1186 1013 -1451 -4316 -5760 -8681
14465 -8681 -10104 -9249 -10321 -6905 -1595 -766 -2065 -5725 -6652 -7376 -5420 -6441 -7384 -6444 -3030 -3354
14449c354k631R31O84O86k088J843L461P50j277j987L81L382J591l144q93K414
14433G49O58l026m577M45L72l938k258J694K068L341L783J615J20Q53J716p5k279
14416A261J885J6j370r37L37J157L527n28J569n99l359n097k313o38k10j876Q13
14399f362L214K047k45J417L040J135j038M341M020m59k659L53J152J640j285
14384A0311q73m84l95l001q66L00P01K954k55l661j451K281m34k5m43K559L294
14367A0512L87J278O54Q30l00j186l252J009L121R50Rn93j884K238l06k059k531
14350H877l343j041L116N091R64J120N277n49k932M65K202Q83j42l012j044J827
14334A7759J500m139j312n37k581r35M993M187k715n663k845N330O460L248L286
$$ plain form
14449 -3354 -5985 -5054 -4370 -3684 -5772 -3929 -468 282 -995 -2982 -2601 781 2372 -772 -1665 749
14433 749 1407 -1619 -6196 -5751 -5379 -9317 -11575 -9881 -7813 -4472 -689 926 1046 1899 3615 3540 1261
14416 1261 3146 3162 1792 855 1192 2349 5876 5348 6917 6318 2959 -2138 -4451 -5089 -5299 -7175 -6362
14399 -6362 -3148 -1101 -1346 71 3111 4246 3208 7549 11569 11110 8451 8804 9956 11596 10311
14384 10311 9438 8954 8559 5558 4692 4992 5693 8647 8392 4731 3280 5561 5127 5102 4659 7218 10512
14367 10512 10899 12177 12831 13661 13361 12175 8923 9932 13053 14003 14012 13419 11535 13773 13467 11408 8877
14350 8877 5534 4493 7609 12700 13664 14784 20061 19512 16580 17045 19247 20130 19988 16976 15932 17759
14334 17759 19259 15120 13808 13271 10690 9755 14748 18935 16220 10557 7712 13042 19502 22750 26036
14319B6036K621j997Qp28k973j361l45q30N6K217J148K013k79Q30K235M65L70
14302B9486O483J789l944l417n95J470J033P69k08l36j381j66M174L354o09O97
14286C8599j236j532R43J061l93j750k952K219M895J492o41K73J941K456J059
14271D6434P87k267o8J209j442M219K997J450j342k249R89L311K606J697Q3J452
14255E9866J327j771j365j873k404q47J309M911M386L816K023l09n41M17k644
14240F6301O53j921N559R51l97M520K941P90O17J628J536M247j577K130N457K566
14224I6001J154J687K408l202l306M002K974N3M265K478P33J622M136J869k653
14209A14221k99q81O05K880K772K737K417K999L17K913M52J174O181O209J734
$$ plain form
14319 26036 28657 26660 26668 25940 22967 21606 21261 20431 20487 22704 23852 25865 25586 26416 28651 29116 29486
14302 29486 35969 37758 33814 30397 29802 31272 32305 33074 32866 32530 31149 30983 35157 38511 37902 38599
14286 38599 37363 35831 36774 37835 37442 35692 32740 34959 39854 41346 40705 40978 42919 45375 46434
14271 46434 47221 44954 44886 46095 44653 48872 51869 53319 51977 49728 50717 54028 56634 58331 58414 59866
14255 59866 61193 59422 58057 56184 53780 52933 54242 59153 63539 67355 69378 69069 68528 68945 66301
14240 66301 66954 65033 70592 71543 71146 75666 78607 79397 80014 81642 83178 87425 85848 87978 93435 96001
14224 96001 97155 98842 101250 98048 94742 98744 101718 101771 106036 108514 109247 110869 115005 116874 114221
14209 114221 113922 113041 113646 116526 119298 122035 124452 127451 127768 130681 131133 132307 138488 144697 146431
14194A46431L159J060K798J799N059O022j789j003K146K586O235J0244P302L621
14180A95670M473K601N712P829L454M108j458r77K528O426O924N774M349N073
14166B52486M430N250J577O280O141R187P399J0106P058Q099P027L911O219Q037
14152C43207M725Q293J1214P788R942Q946L574P108R920Q212R338J0381R275P692
14138D59615J1894J5378J3996J1029R463P757J0000J0896R486J3766J2865R028
14126E95173R778Q080O125R053O944N783L163L57O582N003L642N159k71p340o362
14111F50869o516r980q648m858q403q575j0493r478q276j2787j3936j0177n858
14098E32884j0892j5092j1676r173r991r210j0268o914o826j1417j0843p636q810
$$ plain form
14194 146431 149590 150650 153448 155247 160306 166328 164539 163536 165682 168268 174503 184747 192049 195670
14180 195670 200143 202744 208456 216285 219739 223847 222389 221412 223940 230366 237290 243064 247413 252486
14166 252486 256916 262166 263743 270023 276164 285351 292750 302856 309914 318013 325040 328951 335170 343207
14152 343207 347932 356225 367439 375227 385169 394115 397689 404797 414717 422929 432267 442648 451923 459615
14138 459615 471509 486887 500883 511912 521375 529132 539132 550028 559514 573280 586145 595173
14126 595173 604951 613031 619156 628209 635153 640936 644099 644456 651038 656041 659683 664842 664571 657231 650869
14111 650869 644353 634373 625725 620867 612464 603889 593396 583918 575642 562855 548919 538742 532884
14098 532884 521992 506900 495224 486051 476060 466850 456582 449668 442842 431425 420582 412946 404136
14085D04136r628m027l738p657q278r229j0380m999n670r067j0077n215p269o574
14071C02328m034k691n351o763n468o730l137p996m745n768n014o409l936k714
14057B31572l112m182n050m111l413k276m898k533m157m048o075J897L780j689
14043A91705l189m563m050k942m852m527P36j983j604n02l811l751k654j125o532
14028A46356m369M08l123n283k223m669J142J303l435l173k450j228j086j045
14014A17125j021j773K772k742j403J28j691k440p16j396J432o063o729K10K836
13999I8529j370k607N92J032j382j897k970j462q54k364Q48J159l890n251k737
13984G5376k151p5J222J958l027k008j809k313O26k238j046L73j777J48j701k520
$$ plain form
14085 404136 394508 390481 386743 379086 370808 361579 351199 346200 340530 331463 321386 316171 308902 302328
14071 302328 298294 295603 290252 283489 278021 271291 268154 260158 255413 249645 244631 238222 234286 231572
14057 231572 228460 224278 219228 215117 211704 209428 204530 201997 197840 193792 187717 189614 193394 191705
14043 191705 188516 183953 179903 176961 172109 167582 168318 166335 164731 164229 160418 156667 154013 152888 146356
14028 146356 141987 142395 139272 133989 131766 127097 128239 129542 126107 122934 120484 119256 118170 117125
14014 117125 116104 114331 117103 114361 112958 113086 111395 108955 108239 106843 108275 102212 95483 95693 98529
13999 98529 97159 94552 95144 96176 94794 92897 89927 88465 87611 85247 86095 87254 83364 78113 75376
13984 75376 73225 73150 74372 76330 73303 71295 69486 67173 67799 65561 64515 64888 63111 63259 61558 59038
13968E9038p9k31k186J574M415K478l81p47j061l975J6n51l902k820J756K760
13952E6104j086l041k300o76m50M19k606l494J130K321K358J715m212k981k452
13937D0749k714j480O85j3j29L86N55j132M103O68l843K414j450n476m935L91
13921B8779K064K426R89P36m155l756k374m66M38k87J205L022P24J399j244k323
13905B7177J769K320Q39j8l63j018k803k405l49j174l972l020L2K547R68n78K3
13888A9975j789K915j36m377j692Q59p36j291L904L254k323j294o88K694j505
13873A7770J227k379k330l769m00N34j747Q87K521J617L80m51Q1L07k407J849
13857A3690L532L114o07m445k072j623J646K244q59l271j985J471L165M44J943
$$ plain form
13968 59038 58959 58728 56542 58116 62531 65009 64628 63881 62820 58845 58861 58310 54408 51588 53344 56104
13952 56104 55018 51977 49677 49001 48551 48970 46364 42870 44000 46321 48679 50394 46182 43201 40749
13937 40749 38035 36555 37240 37227 37098 37484 38039 36907 41010 41678 37835 40249 38799 33323 28388 28779
13921 28779 30843 33269 34258 34994 30839 27083 24709 24243 24681 24394 25599 28621 29345 30744 29500 27177
13905 27177 28946 31266 32105 32087 31724 30706 27903 25498 25149 23975 20003 16983 17015 19562 20530 19952 19975
13888 19975 18186 21101 20965 16588 14896 15755 15019 13728 17632 20886 18563 17269 16581 19275 17770
13873 17770 18997 16618 14288 10519 10119 10653 8906 9793 12314 13931 14311 13860 13941 14248 11841 13690
13857 13690 17222 20336 19729 15284 13212 11589 13235 15479 14620 11349 9364 10835 14000 14444 16387
13842A6387m32m693m477j525J180N001J348l184R53Q42j336j872J882j083L003
13827A1994L20l881m21j453o67r32j159k095l701J576K185M574J11m743K3N48
13811B279n19j135K672L019K187j095l123k496p64j058K168n25j748O3L369M72
13795C766l018J051k63L95O05m44K128K314q45k57j157j513m113l529R53m85k49
13778d661j18N602K399J134l30l066J568K941k237l57L052j328j350p75m337j932
13762c795p51K178l250k740J051L094K136k559k823J406L231L34K66k107J169
13747c160Q64K49r53l844m40j159j347k211m87J129j053R1J681K176j044p29o41
13730a0878J248L039K384l583N60K50k486k557K818M25j015L359K010m278k355
$$ plain form
13842 16387 15955 11262 6785 5260 6440 11441 12789 9605 10558 11400 10064 8192 10074 8991 11994
13827 11994 12314 8433 8012 6559 5892 4960 3801 1706 -1995 -419 1766 6340 6451 1708 1731 2279
13811 2279 1760 625 3297 6316 8503 7408 4285 1789 1025 -33 2135 1610 -138 -75 3294 3766
13795 3766 748 1799 1536 1931 2536 2092 4220 6534 5689 5432 4275 2762 -1351 -4880 -3927 -4412 -4661
13778 -4661 -4779 823 3222 4356 4026 960 2528 5469 3232 2875 5927 4599 3249 2474 -1863 -3795
13762 -3795 -4546 -2368 -5618 -8358 -7307 -4213 -2077 -4636 -7459 -6053 -2822 -2488 -2222 -4329 -3160
13747 -3160 -2296 -2047 -3000 -6844 -7284 -8443 -9790 -12001 -12488 -11359 -12412 -12321 -10640 -8464 -9508 -10237 -10878
13730 -10878 -9630 -6591 -4207 -7790 -7230 -6980 -9466 -12023 -9205 -8780 -9795 -6436 -4426 -8704 -11059
13715a1059M762J187n245k711k956j398L678P705K593J436j106J442r69j463o95
13700d799k074m43j573j16K940K001j86k583k34K419q22p27R35j886n795k691
13684a5634N194L19j014J54K72j90J384j757M99N421M94K40K748L073j44J04K262
13667C425N516Q998P851K103J598k235n072l274j088K375P142Q611R202N957L12
13652E1421m798j0134j4645j0938l216N881P096N813P17R28m051q388p461l014
13638E211j002l757n89M358L620k70P744R710J599k387m665j515l371k841J210
13623A3055J1459J4160J0812L259n999o731n876r463o351L90L569J049J16j213
13609B2236n492q826o201l218m741k127J207J091N65M60k952k930j140N010J494
$$ plain form
13715 -11059 -6297 -5110 -10355 -13066 -16022 -17420 -13742 -6037 -3444 -2008 -3114 -1672 -2641 -4104 -4799
13700 -4799 -6873 -7316 -8889 -9005 -6065 -4064 -4250 -6833 -7067 -4648 -5470 -6197 -5262 -7148 -12943 -15634
13684 -15634 -10440 -10121 -11135 -10981 -10709 -10899 -9515 -11272 -10773 -5352 -4858 -4618 -1870 1203 1059 1163 3425
13667 3425 8941 17939 25790 27893 29491 27256 22184 18910 17822 20197 27339 35950 45152 51109 51421
13652 51421 46623 36489 21844 10906 7690 13571 20667 26480 27197 28125 24074 15686 8225 5211
13638 5211 4209 452 -137 4221 7841 7571 15315 25025 26624 24237 19572 18057 14686 11845 13055
13623 13055 24514 38674 49486 52745 46746 40015 34139 24676 18325 18715 22284 23333 23449 22236
13609 22236 16744 7918 1717 -1501 -6242 -8369 -7162 -6071 -5506 -5046 -7998 -10928 -12068 -7058 -5564
13594e564l724j692o61K907J913j395M75K140k353n276K506M140j131l892r51
13579a2558M522j209l644L8L496j898n472p38J031j864N92p08p8J48M050K93l939
13562a7938k825n54k25M123L912L271J041l053J061R85j248k922k235j801M480
13547a3928o01k267j113M164K167J679k191k714K278K091n67m46j915l470j023
13532a7856K249L76R5j407j673p54j280M234L961k777j273k025l02n59M599J345
13516a3047m60j604m43j133K82q00L81o57n38n76k149m92P16J215J774j221k498
13499b1250J010l67K18J210J061L3R5O98P14p59O85K73J760k583J258q29O80M15
13481a5678r32k030l625k927K956q4j849Q79L516L420O49j71l19l811k224J255
$$ plain form
13594 -5564 -9288 -10980 -11641 -8734 -6821 -8216 -7741 -5601 -7954 -13230 -10724 -6584 -7715 -11607 -12558
13579 -12558 -8036 -9245 -12889 -12851 -9355 -11253 -16725 -17463 -16432 -18296 -17704 -18412 -18490 -18342 -14292 -13999 -17938
13562 -17938 -20763 -21317 -21542 -17419 -13507 -10236 -9195 -12248 -11187 -10202 -11450 -14372 -16607 -18408 -13928
13547 -13928 -14529 -16796 -17909 -13745 -11578 -9899 -12090 -14804 -12526 -10435 -11002 -11448 -13363 -16833 -17856
13532 -17856 -15607 -15231 -15136 -16543 -18216 -18970 -20250 -16016 -12055 -14832 -16105 -18130 -18432 -18991 -14392 -13047
13516 -13047 -13507 -15111 -15554 -16687 -16405 -17205 -16824 -17481 -18019 -18595 -20744 -21236 -20520 -19305 -17531 -18752 -21250
13499 -21250 -20240 -20607 -20389 -19179 -18118 -18085 -17990 -17292 -16578 -17337 -16652 -16379 -14619 -17202 -15944 -16773 -16093 -15678
13481 -15678 -16610 -18640 -22265 -25192 -22236 -22320 -24169 -23290 -19774 -16354 -15705 -15876 -16195 -20006 -22230 -20975
13465b0975J971j254J474L356J192k42q91q53k538l641K325k70l793N53P170J219
13449a5197p26j273L34R88J931N82k562J83r49p43O53j100l678l221N35N326K289
13432a6628K466j914m031J437P29j691K386k4J046M56o305p66K342j686k468l31
13416b4982J260K369P34Mk407K412L559Q60j027J592K492L1l162l046p19o07k53
13399b0890K835M593J451o306n316J894j86m077k717N45L781J160j661K361J235
13384b1298J648J474k353k41p26q87k836J128n91K039l96J549J486p66J352P36
13368a8682J03j48j629k85J357q34j793J407j27J827l55n48k307J410J461p0J559
13351a7654J810k348l982k774n64L654K184k322j828k488q25L018K020j400k335
$$ plain form
13465 -20975 -19004 -20258 -18784 -15428 -14236 -14478 -15369 -16222 -18760 -22401 -20076 -20346 -24139 -23586 -16416 -15197
13449 -15197 -15923 -17196 -16862 -15874 -13943 -13361 -15923 -15740 -16689 -17432 -16779 -17879 -21557 -24778 -24243 -18917 -16628
13432 -16628 -14162 -16076 -20107 -18670 -17941 -19632 -17246 -17270 -16224 -15768 -22073 -22839 -20497 -22183 -24651 -24982
13416 -24982 -23722 -21353 -20619 -20615 -23022 -20610 -17051 -16191 -17218 -15626 -13134 -13103 -16265 -19311 -20030 -20637 -20890
13399 -20890 -18055 -13462 -12011 -18317 -23633 -21739 -21925 -26002 -28719 -28174 -24393 -23233 -24894 -22533 -21298
13384 -21298 -19650 -18176 -20529 -20770 -21496 -22383 -25219 -24091 -24682 -22643 -23039 -21490 -20004 -20770 -19418 -18682
13368 -18682 -18579 -18727 -20356 -20641 -19284 -20118 -21911 -20504 -20631 -18804 -19159 -19707 -22014 -20604 -19143 -19213 -17654
13351 -17654 -15844 -18192 -22174 -24948 -25512 -21858 -19674 -21996 -23824 -26312 -27137 -24119 -22099 -23499 -25834
13336b5834J329L837N32j820J38J823O93q42J033j174l695j487R00q26J862j118
13320b4649J413J99L776L196l856j739P41j032J329J061J099P71k812l629n13
13305b4645j133P00M499J833p55r30M15n6j261K943J56l83J309k392J486O59K859
13288a4696j19k211k123l397j181J010j421N32J731k11j680k359k056o36J161
13273b7656L335J093k025K181l392r04p35l74L166L842M888j251l446k498l280
13258b7056K616k823N33N372K043l982m449J092J82J010l314o36J637L660J087
13243b3028l447J473K124P14J733L046p25k899j396k72K484l192k849K229K603
13228b1402l463j553p49Q38J952k702m385j013N86K087K117L695k915n12J641
$$ plain form
13336 -25834 -24505 -20668 -20136 -21956 -21818 -19995 -19302 -20144 -19111 -20285 -23980 -25467 -24567 -25393 -23531 -24649
13320 -24649 -23236 -23037 -19261 -16065 -19921 -21660 -20919 -21951 -20622 -19561 -18462 -17691 -20503 -24132 -24645
13305 -24645 -25778 -25078 -20579 -18746 -19501 -20431 -20016 -20072 -21333 -18390 -18234 -18617 -17308 -19700 -18214 -17555 -14696
13288 -14696 -14815 -17026 -19149 -22546 -23727 -22717 -24138 -23606 -21875 -22086 -23766 -26125 -28181 -28817 -27656
13273 -27656 -24321 -23228 -25253 -23072 -26464 -27368 -28103 -28477 -25311 -21469 -16581 -17832 -21278 -23776 -27056
13258 -27056 -24440 -27263 -26730 -21358 -19315 -23297 -27746 -26654 -26472 -25462 -28776 -29412 -27775 -24115 -23028
13243 -23028 -26475 -25002 -22878 -22164 -20431 -17385 -18110 -21009 -22405 -22677 -20193 -23385 -26234 -24005 -21402
13228 -21402 -24865 -26418 -27167 -26329 -24377 -27079 -31464 -32477 -31891 -29804 -27687 -23992 -26907 -27419 -25778
13213b5778m06n478k097J39J984K070L919J421j878j589L05J435L086N52k29j138
13197b3682J68N01j418k00j243K514j408k162m239n59j586k050Q506N574N77k951
13181b3658k823K58L30k973l879r69L417K098r78J656k748p73R24J701O73M20
13165b7324j557j618K28K902K611L24R1K517j893k206K876j413l942P63L406K118
13149b2117J874l098j549L144J653M3J048j068M28n49O7j246j207j870K314k662
13133b4795k130k01J017L5j790n53R41N77N768K18J98J448L570q66k8j508k522
13116b0621m140J35K323r82j056j849j292N71K089N64J221k355k562o02p11K99
13100b8968L837K096n04l309k723M48K227j289j073k099M18L104k184K43J711
$$ plain form
13213 -25778 -26184 -31662 -33759 -33620 -31636 -29566 -25647 -24226 -26104 -27693 -27388 -25953 -22867 -22315 -22544 -23682
13197 -23682 -23514 -23013 -24431 -24631 -25874 -23360 -24768 -26930 -31169 -31728 -33314 -35364 -26858 -21284 -20707 -23658
13181 -23658 -26481 -26223 -25893 -28866 -32745 -33714 -30297 -28199 -29177 -27521 -30269 -31042 -30118 -28417 -27744 -27324
13165 -27324 -28881 -30499 -30271 -27369 -24758 -24434 -24343 -21826 -23719 -25925 -23049 -24462 -28404 -27641 -24235 -22117
13149 -22117 -20243 -23341 -24890 -21746 -20093 -20050 -19002 -20070 -19642 -20191 -20124 -21370 -22577 -24447 -22133 -24795
13133 -24795 -26925 -27126 -26109 -26074 -27864 -28417 -27476 -26899 -21131 -20913 -20715 -19267 -15697 -16563 -16591 -18099 -20621
13116 -20621 -24761 -24626 -22303 -23285 -24341 -26190 -27482 -26911 -24822 -24258 -23037 -25392 -27954 -28556 -29267 -28968
13100 -28968 -25131 -23035 -23539 -26848 -29571 -29123 -26896 -28185 -29258 -31357 -30939 -27835 -30019 -29776 -28065
13085b8065K460M454L397r64l576J576p40r91n5l54M25N10l158r8K352M31L24
13068b2072p88m83Q91L619L380K122m51O94L781Q99p98L99K076k115n43k60j319
13051a0968j777j551r16m324l694l88j019j98J201m35l768J63K69k811J265J630
13035b7321j337J30p92j196R59J854o93j38k561j120K546K349J072J212l95J357
13019b4074j114l11k035j815p04J564O39j340R48k47o43K485M015j514l276O68
13003b6754J139j142R9M594O773j282q123l084l7j530k078R89j230K426K015J97
12987b7028O49j434n664J877r47pJ435J764L276J839j14K074k543k261K013k314
12971b7385j82j875L89n70j819k750J271M345M838j352n388J832K842j203l463
$$ plain form
13085 -28065 -25605 -21151 -17754 -18718 -22294 -20718 -21458 -22449 -22504 -22858 -22433 -21923 -25081 -25179 -22827 -22396 -22072
13068 -22072 -22860 -23343 -22452 -18833 -15453 -13331 -13782 -13088 -9307 -8408 -9206 -8807 -6731 -8846 -9389 -9649 -10968
13051 -10968 -12745 -14296 -15212 -19536 -23230 -23618 -24637 -24835 -23634 -24069 -27837 -27674 -27405 -30216 -28951 -27321
13035 -27321 -28658 -28528 -29320 -30516 -29557 -27703 -28396 -28534 -31095 -32215 -29669 -27320 -26248 -25036 -25431 -24074
13019 -24074 -25188 -25499 -27534 -29349 -30053 -28489 -27850 -29190 -28242 -28489 -29132 -26647 -22632 -24146 -27422 -26754
13003 -26754 -25615 -26757 -26658 -22064 -15291 -16573 -24696 -27780 -27817 -29347 -31425 -30436 -31666 -29240 -27225 -27028
12987 -27028 -26379 -27813 -33477 -31600 -32547 -32554 -31119 -29355 -26079 -24240 -24354 -22280 -24823 -27084 -25071 -27385
12971 -27385 -27567 -29442 -29053 -29623 -31442 -34192 -32921 -28576 -23738 -25090 -30478 -28646 -25804 -27007 -30470
12956c0470J466J247n2K833J130m45k351J325j907j715j41q21p58L147j049j836
12940c0397j377o72R57N31j55k45k73N397K706o17rK121O13P49k772l68J569k921
12922b5163l215J055K56j204K36R43L8J311l93P85j312J048m34L85j003j603J183
12905b7087k256J607K813j072j132P69n97k987j113J916M433O7l44r22j528k56
12889b7689j05j473j600r08k638k826J033K464K975J246L022N867M113K131M09
12874a3979J228m511k556l977l644l188k779L039K025j987J961J464L572J52r70
12859b4150O4k572j316K839J052J955j402k187q74k727J785j302J154J809n55
12844b6427R77K119l278l590l5J808j450Q75J419k94Q1n22M74N274N737N625P88
$$ plain form
12956 -30470 -29004 -27757 -27809 -24976 -23846 -24291 -26642 -25317 -27224 -28939 -29080 -29901 -30659 -27512 -28561 -30397
12940 -30397 -31774 -32446 -31489 -30958 -31113 -31358 -31631 -26234 -23528 -24145 -24154 -22033 -21420 -20671 -23443 -23811 -22242 -25163
12922 -25163 -28378 -27323 -27067 -28271 -28035 -27092 -27054 -25743 -26136 -25351 -26663 -25615 -26049 -25664 -26667 -28270 -27087
12905 -27087 -29343 -27736 -24923 -25995 -27127 -26358 -26955 -29942 -31055 -29139 -24706 -24639 -24983 -25905 -27433 -27689
12889 -27689 -27794 -29267 -30867 -31775 -34413 -37239 -36206 -33742 -30767 -29521 -26499 -20632 -16519 -14388 -13979
12874 -13979 -12751 -17262 -19818 -23795 -27439 -30627 -33406 -30367 -28342 -30329 -28368 -26904 -23332 -23180 -24150
12859 -24150 -24086 -26658 -27974 -25135 -24083 -22128 -23530 -25717 -26591 -29318 -27533 -28835 -27681 -25872 -26427
12844 -26427 -25450 -23331 -26609 -30199 -30234 -28426 -29876 -29001 -27582 -27876 -27795 -28317 -27843 -22569 -16832 -11207 -10419
12827a0419j04l278l256k195k288m20l170n56l05k943l18j81J48k713l48q03K749
12810c0400L284L01O2J787K10m73M8J432o38J409K439P40p44r65p71j087J039
12793b2327r64m429n80R44J568M93r60O40K948L195p44j823L48p15J19R41q7k982
12775b4415l943j265K013j332j788K816j137m92P67J75K114K499k029m27j447
12760b7891k197m019O77N16K33L44N635Q12J837L169m820q50j921k076K185n82
12744b8948N29J005K3L609K545M30P82L021L419j483j980Q18J415J296M125M639
12728d755j390J32K79j808j476m668m216j770Q20K24n471m341l990j977j809r76
12712c7192K389L115p84j427J653J322P61j287O32P29j776L978J629l722l99j392
$$ plain form
12827 -10419 -10523 -13801 -17057 -19252 -21540 -21960 -25130 -25686 -25991 -28934 -29252 -29433 -29285 -31998 -32346 -33149 -30400
12810 -30400 -27116 -26815 -26753 -24966 -24756 -25229 -25181 -23749 -24387 -22978 -20539 -19799 -20543 -21508 -22279 -23366 -22327
12793 -22327 -23291 -27720 -28300 -27356 -25788 -25295 -26255 -25615 -22667 -19472 -20216 -22039 -21691 -22406 -22287 -21346 -21433 -24415
12775 -24415 -28358 -29623 -27610 -28942 -30730 -27914 -29051 -29543 -28776 -28601 -26487 -23988 -26017 -26444 -27891
12760 -27891 -30088 -34107 -33430 -32914 -32681 -32337 -26702 -25890 -24053 -20884 -25704 -26554 -28475 -30551 -28366 -28948
12744 -28948 -28419 -27414 -27391 -23782 -21237 -20807 -20025 -17004 -13585 -15068 -17048 -16230 -14815 -13519 -9394 -4755
12728 -4755 -6145 -6013 -5734 -7542 -9018 -13686 -17902 -19672 -18852 -18628 -24099 -28440 -32430 -34407 -36216 -37192
12712 -37192 -34803 -31688 -32472 -33899 -32246 -30924 -30163 -31450 -30818 -30089 -31865 -27887 -26258 -29980 -30379 -31771
12696c1771M012O879K966j168k195k456k249K115J685k184j162l79P44J031j467
12681b5599l090k574k108l437k296K893N357J771N208J657k05Q1j359n850n42
12666c0093L337J489j643m361N04K198l084l646l234j307M233M247L513K945J403
12651b3499m321l518L91L606N06k054J702o11j45J602O57k719Q3j336n52K287
12635b7921Q74K0k054J462J108K082K973k074m396k493K183J970m62j714m11M46
12619b8407n14l333P98Q20k204R69M479K754o88r09N37P76j388r80L453J023j586
12602b4400k892j1K661J706l893k153J585K231l88J493M745n24l506j328k955
12587b7629l492j637O63M819N22p24M334M83p11n66n67m897l210k761O39J039
$$ plain form
12696 -31771 -27759 -20880 -17914 -19082 -21277 -23733 -25982 -23867 -22182 -24366 -25528 -25907 -25163 -24132 -25599
12681 -25599 -28689 -31263 -33371 -36808 -39104 -36211 -30854 -29083 -23875 -22218 -22423 -22342 -23701 -29551 -30093
12666 -30093 -26756 -25267 -26910 -31271 -30767 -28569 -31653 -35299 -38533 -39840 -35607 -31360 -27847 -24902 -23499
12651 -23499 -27820 -31338 -30947 -27341 -26835 -28889 -27187 -27798 -27943 -26341 -25684 -28403 -28320 -29656 -30208 -27921
12635 -27921 -27047 -27027 -29081 -27619 -26511 -24429 -21456 -23530 -27926 -30419 -28236 -26266 -26728 -28442 -28853 -28407
12619 -28407 -28921 -32254 -31456 -30636 -32840 -31871 -27392 -24638 -25326 -26235 -25698 -24922 -26310 -27290 -23837 -22814 -24400
12602 -24400 -27292 -27303 -24642 -22936 -26829 -28982 -27397 -25166 -25554 -24061 -19316 -19840 -23346 -24674 -27629
12587 -27629 -31121 -32758 -32095 -27276 -26754 -27478 -23144 -22661 -23372 -23938 -24505 -29402 -32612 -35373 -34734 -33695
12571c3695M507L362K919Q17j240r24o090l823j113j270n84Q05N445j979m418
12556c7281J383J398L810j45l102J588j706K303m39m70p64J455m38J574J522l62
12540b9674J189K359R13o010n384l970k056j17m50K703L117N665Q46K543Q43L34
12524b7149j017J214J912k367m71n91K19K75P38L290N08j948J332O95l267l208
12508b9835o46R95N329N293J096j974k031l452n38j045k626j871M066J054K910
12493b3275K83J251k241l986m537K122o76J120M704O3j887J982J115K13l77l240
12477b7366P83m0k207o80K215R72L672j074k363M022n254m23K358K592J669j591
12461b2715J052L19q23k040l426J346N62J628l8L52Q06O74k828j397l126l598
$$ plain form
12571 -33695 -29188 -25826 -22907 -22090 -23330 -24254 -30344 -34167 -35280 -36550 -37134 -36329 -30884 -32863 -37281
12556 -37281 -35898 -34500 -30690 -30835 -33937 -32349 -34055 -31752 -32191 -32661 -33425 -31970 -32408 -30834 -29312 -29674
12540 -29674 -28485 -26126 -25213 -31223 -36607 -40577 -42633 -42750 -43200 -40497 -37380 -31715 -30869 -28326 -27483 -27149
12524 -27149 -28166 -26952 -25040 -27407 -27878 -28469 -28250 -27975 -27237 -23947 -23439 -25387 -24055 -23360 -26627 -29835
12508 -29835 -30481 -29486 -24157 -18864 -17768 -19742 -21773 -25225 -25763 -26808 -29434 -31305 -27239 -26185 -23275
12493 -23275 -22992 -21741 -23982 -27968 -32505 -30383 -31059 -29939 -25235 -25172 -27059 -25077 -23962 -23749 -24126 -27366
12477 -27366 -26583 -26623 -28830 -29510 -27295 -26323 -22651 -23725 -26088 -22066 -27320 -27743 -25385 -22793 -21124 -22715
12461 -22715 -21663 -21344 -22167 -24207 -27633 -26287 -25725 -24097 -24135 -23783 -22977 -22303 -25131 -26528 -29654 -33252
12445c3252m816K304L862N641O694O122M814M176M021L76M93l668m413m133k451
12430a4230k191l180m351k754l202j206K268J607J12Q27K950J931J907k734k105
12415b4351n4j429m68Q60J089L596P65kL557q34j723p01m563o611L498M383n23
12398b3511J170M790j802J189J482j417l839q41M74O95j234k82n27Q09lJ14k0
12381b2753J044p20R55j697K8J868N10l761K019J804l132n93J054L552L487k661
12365a8996k609M6j485K521k32j244k429k506J401L417J080k77J598q75k88M31
12349b0447J695r70l204j246P73n07k947q93j157o600l182J916L074L114L982
12334b6599K309J452L70J734k511j63P00Q25k266J134N390j451K30k650j286n87
$$ plain form
12445 -33252 -38068 -35764 -31902 -26261 -19567 -13445 -8631 -4455 -434 -58 435 -3233 -7646 -11779 -14230
12430 -14230 -16421 -19601 -23952 -26706 -29908 -31114 -28846 -27239 -27127 -26300 -23350 -21419 -19512 -22246 -24351
12415 -24351 -24405 -25834 -26302 -25442 -24353 -20757 -19992 -19994 -16437 -17271 -18994 -19695 -24258 -30869 -27371 -22988 -23511
12398 -23511 -22341 -17551 -19353 -18164 -16682 -18099 -21938 -22779 -22305 -21610 -22844 -23126 -23653 -22844 -22847 -22733 -22753
12381 -22753 -21709 -22429 -21474 -23171 -23143 -21275 -20765 -24526 -22507 -20703 -23835 -24428 -23374 -19822 -16335 -18996
12365 -18996 -21605 -21559 -23044 -20523 -20755 -21999 -24428 -26934 -25533 -22116 -21036 -21313 -19715 -20590 -20878 -20447
12349 -20447 -18752 -19722 -22926 -24172 -23399 -23906 -26853 -27746 -28903 -35503 -38685 -36769 -33695 -30581 -26599
12334 -26599 -24290 -22838 -22468 -20734 -23245 -23408 -22708 -21883 -24149 -23015 -17625 -19076 -18846 -21496 -22782 -23369
12318b3369J350k642p65j23p30K37J484M087k502k951L902M750J038j499n24j722
12302a9979j182L335P67k227k973k60j898M331L567N99l33L4l479L227J889k472
12286a7054l959N76l203l836j883K790L364K080K111M20K952J38l873m949l761
12271b8087j33K560L501J873R52K337M335K820k416O69q85k298j335j646K689
12256a5064J280l252P2q88K502K705J726m07j181l597j478m4L052J981J428N65
12240a0600j040k703J68q43j864j119n0j277j567J057J475M63J785K90J266l323
12224a7882l773O5M492J635r42M2J343J20K565J5j945m771K182K013r43p76O402
12207a0158j024n169j454J495N54q96l696N62J891R25j607P13K542L114J397p87
$$ plain form
12318 -23369 -22019 -24661 -25426 -25549 -26279 -26042 -24558 -20471 -22973 -25924 -22022 -17272 -16234 -17733 -18257 -19979
12302 -19979 -21161 -17826 -17059 -19286 -22259 -22519 -24417 -20086 -16519 -15920 -16253 -16219 -19698 -16471 -14582 -17054
12286 -17054 -21013 -20437 -23640 -27476 -29359 -26569 -23205 -21125 -19014 -18594 -15642 -15504 -19377 -24326 -28087
12271 -28087 -28220 -25660 -22159 -20286 -19334 -16997 -12662 -9842 -12258 -11589 -12474 -14772 -16107 -17753 -15064
12256 -15064 -13784 -17036 -16964 -17852 -15350 -12645 -10919 -11326 -12507 -16104 -17582 -17626 -14574 -12593 -11165 -10600
12240 -10600 -11640 -14343 -14175 -15018 -16882 -18001 -18051 -19328 -20895 -19838 -18363 -17900 -16115 -15825 -14559 -17882
12224 -17882 -21655 -21590 -17098 -15463 -16405 -16363 -15020 -14900 -12335 -12320 -14265 -19036 -16854 -14841 -15784 -16560 -10158
12207 -10158 -11182 -16351 -17805 -16310 -15756 -16652 -20348 -19786 -17895 -16970 -18577 -17864 -15322 -12208 -10811 -11598
12191a1598P77j087Q75J437J285k026j065j371L012R10J889J726N46j783j107
12176g580O01j041O86M33k534k256l181p5J324N90L321j45J68O431M459l919j817
12159d535j447j302O80m69L722K333M5j767k97K034L122M029j816J79K25j051
12143C685j524k029k354m28R43N01J47k33Q23J091J710k251j442L554j994l308
12127c109K811Q08J03J001P47L74j326R57n01J196R34j086J966K604P10j100k072
12110E017m69k18j241R01L754K551K413K567K988j617k282R87l96j447k291J047
12094A2264K599Q48L646J830L891P29R32o79k274N0no24L70j95J747L56k00l40
12076B4945L438J305j55K125O96J32K68J667L496O41k461j073k217l375j224Q24
$$ plain form
12191 -11598 -10821 -11908 -11033 -9596 -8311 -10337 -11402 -12773 -9761 -8851 -6962 -5236 -4690 -6473 -7580
12176 -7580 -6979 -8020 -7334 -6901 -9435 -11691 -14872 -14947 -13623 -13033 -9712 -9857 -9689 -3258 1201 -2718 -4535
12159 -4535 -5982 -7284 -6604 -7073 -3351 -1018 -973 -2740 -3037 -1003 2119 6148 4332 4511 4736 3685
12143 3685 2161 132 -2222 -2650 -1707 -1206 -1059 -1292 -469 622 2332 81 -1361 2193 199 -3109
12127 -3109 -298 510 613 1614 2361 2735 1409 2366 1865 3061 3995 2909 4875 7479 8189 7089 5017
12110 5017 4548 4330 3089 3990 7744 10295 12708 15275 18263 16646 14364 15351 14955 13508 11217 12264
12094 12264 14863 15711 19357 21187 25078 25807 26739 26060 23786 23836 23831 23207 23577 23382 25129 25485 25285 24945
12076 24945 28383 29688 29533 31658 32354 32486 32754 34421 37917 38558 36097 35024 32807 29432 28208 29032
12060B9032J896L962K852J382J39K473j630k453j216K260J272L666j722o22L292
12045D4583J204j003L283N931P90l36K117L49J514K496J312K56j013L132J547
12030F6162Q50K601k603J065L226M478K255k88k93K745K419k27K247R88o16k108
12014H2901k118l17K66k110k196J12L174K920J709J035j369J09P77O4M65N267
11998I0689M023j877R51P09J501K722K388J339M906K985J701K127K838L324N752
11983A26078K775J810k362K760K555L854K647K906J829O761O829K46L289J878
11969A63855L725J608J245J840l9L387O333Q506N985M863N017K223K990N613Q954
11954B26105O563M569J908L069L177J259p88K342N019K959j927j535l90j119M117
$$ plain form
12060 29032 30928 34890 37742 39124 39263 41736 40106 37653 36437 38697 39969 43635 41913 41291 44583
12045 44583 45787 44784 48067 53998 54788 54452 56569 56918 58432 60928 62240 62496 61483 64615 66162
12030 66162 67012 69613 67010 68075 71301 75779 78034 77746 77453 80198 82617 82390 84637 85625 85009 82901
12014 82901 80783 80466 80732 78622 76426 76538 79712 82632 84341 85376 84007 84116 84893 84957 85422 90689
11998 90689 94712 92835 93786 94495 95996 98718 101106 102445 107351 110336 112037 114164 117002 120326 126078
11983 126078 128853 130663 128301 131061 133616 137470 140117 143023 144852 151613 158442 158688 161977 163855
11969 163855 167580 169188 170433 172273 172234 175621 181954 190460 196445 201308 206325 208548 211538 217151 226105
11954 226105 232668 237237 239145 242214 245391 246650 245862 248204 253223 256182 254255 252720 252330 251211 255328
11939B55328L992M882N197K254L72M402J709O440Q514P325O220M237O028M283
11925C21183R654J0240L922L946O386Q062R126R661R869P713J0719Q658Q722J0985
11911D38846J1809J4370J0283J0965J6481J1738J2024J6561J8002J6387J6782
11900E94248J9818J8359K0343K1932K2825K1321K1577K1056K2822K2389K5148
11889H31838K4874K8875L4879L3419L5467L5496L7180L8872L8929M1531M2806
11878A224166M6437M7856N1562N3657N8324O3834O5414O8850P5791P8160P8796
11867A912847Q5323R3965J03743J07440J14673J21471J35539J45786J53590J70024
11857C144401J85533J93580K05568K25675K47937K71355K95366L19722L47101
$$ plain form
11939 255328 259320 264202 269399 271653 272025 276427 278136 284576 293090 300415 306635 310872 316900 321183
11925 321183 330837 341077 344999 348945 355331 363393 372519 382180 392049 399762 410481 419139 427861 438846
11911 438846 450655 465025 475308 486273 502754 514492 526516 543077 561079 577466 594248
11900 594248 614066 632425 652768 674700 697525 718846 740423 761479 784301 806690 831838
11889 831838 856712 885587 920466 953885 989352 1024848 1062028 1100900 1139829 1181360 1224166
11878 1224166 1270603 1318459 1370021 1423678 1482002 1545836 1611250 1680100 1755891 1834051 1912847
11867 1912847 1998170 2092135 2195878 2303318 2417991 2539462 2675001 2820787 2974377 3144401
11857 3144401 3329934 3523514 3729082 3954757 4202694 4474049 4769415 5089137 5436238
11848E436238L77814M15688M54449M93013N36476N85906O29499O71753P19411
11839A0320247P61806P94580Q20901Q22803Q10519P82026P27538O47780N49790
11830A7037990M40159L13032J78928M5658r1552k28419l55640m74384n77911o63735
11820A5624126p22771p68624p93173p95611p84675p62319p26867o89717o50622
11811H929747o06830n58255n15485m78434m42141m06063l73660l39477l13609
11802D895793k93776k71808k49659k28813k10453j95308j80721j67036j55325
11793B942894j46565j34115j25707j13830j07292j07575j02756r2800q2819q0568
11783A848867p7889p0716o6616o4810n9343n7881n6978m9913m7410m5672l9011
$$ plain form
11848 5436238 5814052 6229740 6684189 7177202 7713678 8299584 8929083 9600836 10320247
11839 10320247 11082053 11876633 12697534 13520337 14330856 15112882 15840420 16488200 17037990
11830 17037990 17478149 17791181 17970109 18015767 17924215 17695796 17340156 16865772 16287861 15624126
11820 15624126 14901355 14132731 13339558 12543947 11759272 10996953 10270086 9580369 8929747
11811 8929747 8322917 7764662 7249177 6770743 6328602 5922539 5548879 5209402 4895793
11802 4895793 4602017 4330209 4080550 3851737 3641284 3445976 3265255 3098219 2942894
11793 2942894 2796329 2662214 2536507 2422677 2315385 2207810 2105054 2012254 1929435 1848867
11783 1848867 1770978 1700262 1633646 1568836 1509493 1451612 1394634 1344721 1297311 1251639 1212628
11772A212628l7763l6561l5455l5499l7020l1900l1782k9484k6012k7851k8210
11761H55091k1565k3330k6952k0609j6649j8724j8504k0941k0468j4615j3842
11750F38892j5382j9007j5020j2398j2406j6781j4403j0238j2463j0414q264j2603
11738D79513j6545j1835j0978r910n004p049q558q342n068p686q321r028r711
11725C61478k912o707o301m539o593p399o697j826j291o583r300n265k672m294
11711B89099n679p808m127m593n362k360k464q938m730j919m373m873l419m154
11697B24300o344n799p807o030m822k349m491o022p290p072l900l835j327l466
11683A53746l824j276o63k046l021m753J592l750m786r65k769k039k359l018l122
$$ plain form
11772 1212628 1174865 1138304 1102849 1067350 1030330 998430 966648 937164 911152 883301 855091
11761 855091 833526 810196 783244 762635 745986 727262 708758 687817 667349 652734 638892
11750 638892 623510 604503 589483 577085 564679 547898 533495 523257 510794 500380 492116 479513
11738 479513 462968 451133 440155 430245 425241 418192 409634 401292 396224 388538 380217 371189 361478
11725 361478 358566 351859 345558 341019 334426 327027 320330 318504 317213 310630 301330 296065 293393 289099
11711 289099 283420 275612 271485 266892 261530 259170 256706 247768 243038 241119 236746 231873 228454 224300
11697 224300 217956 212157 204350 198320 193498 191149 186658 180636 173346 166274 162374 158539 157212 153746
11683 153746 149922 148646 147983 145937 142916 138163 139755 136005 131219 130254 127485 125446 123087 120069 116947
11668A16947k728n15k22j310K53j554n631k365l299j020k747m797m197k732j103
11653H2980m34l501m273l499P28J741l2n564l577m326j719j902J741K303Q21j785
11637E9702p992n803P5j000r0J812O56N18o50n88j763m945j371k51m0j891L612
11620C9991p39k712K799R18j09k367l020J243n21L27M202J448k157n301k438L250
11604C4814K200L043j655k336k674j354J38k37k49J923J420o80k974J117k113
11589C0383n512j033L135J465L25k674k824k856M89K376j292j279j527m0l25j029
11573A7782k429j813J659m29J165K75k05J974J928K42j737o049R03M68j977O01
11557A2358O3J776j634Q37l27O93K5k943r57j075Q91j738j701q16q92j752J465
$$ plain form
11668 116947 114219 113704 113482 112172 112425 110871 105240 102875 99576 98556 95809 91012 86815 84083 82980
11653 82980 82546 79045 74772 71273 72001 73742 73710 68146 64569 60243 58524 56622 58363 60666 61487 59702
11637 59702 51710 45907 45982 44982 44892 46704 47360 47878 47228 46640 44877 39932 38561 38310 38270 36379 39991
11620 39991 39252 36540 39339 40257 40148 37781 34761 36004 35483 35810 40012 41460 39303 34002 31564 34814
11604 34814 37014 40057 38402 36066 33392 32038 32176 31939 31690 33613 35033 34353 31379 32496 30383
11589 30383 24871 23838 26973 28438 28763 26089 23265 20409 20898 23274 21982 20703 19176 19136 18811 17782
11573 17782 15353 13540 15199 14770 15935 16210 16005 17979 19907 20149 18412 12363 13266 13734 11757 12358
11557 12358 12421 14197 12563 13400 13073 13766 13791 10848 9891 8816 9707 7969 6268 5452 4560 2808 4273
11540D273L101k04j394L03j269P12J458K589L198l397j205k500l549k288m77j397
11524b046j116M00J886J934m70q84M289j576M38K321j671K298j13l965j33L079
11508D671k945m561K423l84j914Q30J048j769Q5K71J321j8j142q87j914O53p93
11491e025m263j110K21J393Q30P1J14L615L54l007j915N2N9k226j069l717m092
11474a9715P1P12N23k084k263J138L409m61K771L819K60k783j133L214M359Q86
11458g277P99o71L47K188J583k093M08j158j157k259k194L01N35k823K11K65J828
11441a1167Q86r53j207k64J336j255p25K25o07l785k715M60Q19j155R62J498l182
11424b0829j405N867j391n10K752J864L522P606J0357J4857J3244R836J1311M576
$$ plain form
11540 4273 7374 7170 5776 6079 4810 5522 6980 9569 12767 9370 8165 5665 2116 -172 -649 -2046
11524 -2046 -3162 -2762 -876 1058 588 -296 3993 2417 2855 5176 3505 5803 5690 1725 1592 4671
11508 4671 1726 -2835 -412 -796 -2710 -1880 -832 -2601 -2516 -2245 -924 -942 -2084 -2971 -4885 -4232 -5025
11491 -5025 -9288 -10398 -10177 -8784 -7954 -7883 -7769 -4154 -3800 -6807 -8722 -8670 -8611 -10837 -11906 -15623 -19715
11474 -19715 -19644 -18932 -18409 -20493 -22756 -21618 -18209 -18670 -15899 -12080 -11820 -14603 -15736 -12522 -8163 -7277
11458 -7277 -6478 -7149 -6802 -4614 -3031 -5124 -4716 -5874 -7031 -9290 -11484 -11183 -10648 -13471 -13260 -12995 -11167
11441 -11167 -10281 -11234 -12441 -12705 -11369 -12624 -13349 -13124 -13731 -17516 -20231 -19771 -18952 -20107 -19145 -17647 -20829
11424 -20829 -22234 -16367 -17758 -18268 -15516 -13652 -10130 -2524 7833 22690 35934 45770 57081 61657
11410F1657k168p781r079j0239j0896j0178o828m811l846m513L65K297K07M64
11396e349j342l645k462J199L333M21o27l74j097l113l44L218J34j717L844L716
11380d205L339k27J889P80N412J1986R975J7430K2855K4118L2083L0906K5071
11367A81412J6821J0810J149k43k158j871N591N389k515n948j7807k7778l1031
11354A31821k8646k4135k1284j4930j1944q156l827n492o733m632k958J254K947
11341C285j211j874K942L375J803J526J176M073P227R972J5887K1646J9389K8586
11327A17802L5031L8831L7256K9079J9376L988j5755j8881j4891n113J3147L4579
11315B74449N5526P0082P5315O8900M4103R084k4824n5764p4905q3183p9947o6896
$$ plain form
11410 61657 59489 51708 42629 32390 21494 11316 4488 -323 -4169 -8682 -8317 -6020 -5813 -5349
11396 -5349 -6691 -10336 -12798 -11599 -8266 -7845 -8472 -8846 -9943 -13056 -13400 -10182 -10048 -11765 -7921 -4205
11380 -4205 -866 -1093 796 1576 6988 18974 28949 46379 69234 93352 125435 156341 181412
11367 181412 198233 209043 210192 209949 207791 205920 211511 216900 214385 208437 190630 162852 131821
11354 131821 103175 79040 57756 42826 30882 22726 18899 13407 6674 2042 -916 338 3285
11341 3285 2074 200 3142 6517 8320 9846 11022 15095 22322 32294 48181 69827 89216 117802
11327 117802 152833 191664 228920 257999 277375 281363 265608 246727 231836 226723 239870 274449
11315 274449 329975 400057 475372 544272 588375 597459 572635 516871 441966 358783 278836 211940
11303B11940m9407l6023l1743k4087j3956q781o569n683n098n987l542J380K604
11290B5048P63N64J0706J2675J5024J9491K4326L0900K5560K0469J9515J2558
11278B17599j114j4346k2585k4773k5087j5357k365N168J5225L0238M6811O4386
11266B73800P7996Q6217Q2067N9022K2770j1386m7139p0770q3453q0185p3562
11255B35377n7959m2709l4984k7263j7602j0946p529q710l817j121l382j477K925
11242B0803O602J2030J0100J0962J0593N212L750K335k046o564j0590j1927j1562
11229C9698p307n398p571n674l975n415J910O775R105J4051K4151L0725L1745
11216A22820K9979K4269J4229R9j5701k5882k7061k3501k4227k1209j7243j6474
$$ plain form
11303 211940 162533 126510 94767 70680 56724 47943 41374 35691 30593 24606 21064 22444 25048
11290 25048 25811 26375 37081 49756 64780 84271 108597 139497 165057 185526 205041 217599
11278 217599 216485 202139 179554 154781 129694 114337 111972 117140 132365 162603 209414 273800
11266 273800 351796 438013 520080 579102 601872 590486 543347 472577 389124 308939 235377
11255 235377 177418 134709 99725 72462 54860 43914 36385 27675 23858 22737 19355 17878 20803
11242 20803 27405 39435 49535 60497 71090 76302 80052 82387 80341 73777 63187 51260 39698
11229 39698 32391 26993 19422 13748 9773 4358 6268 13043 22148 36199 60350 91075 122820
11216 122820 152799 177068 191297 191396 175695 149813 122752 99251 75024 53815 36572 20098
11204B0098j3008q585p797k343M28n524m714J61j785K966P723L606K531J969n2
11189d326j981k917l498m427M74j100M61p88l010l367n180j828j159p26k713k56
11173c6341M190M690L666M768J007L774M899M485K230N222Q392L072P512M773
11159B6339K110m60J563L244j791m498o558j1186j2942q294p374n028k914j157
11145b8946l217k357N220K357n69J75J088P86J903k93k252J17L76J283K036N659
11129a6634K830O72J370N070L352L144O262K112m1O522R074Q542J1274J1051Q035
11114F2635P285Q137Q962Q517P138Q500P820M483k140p131j1382j4994j9513k1561
11100D6756j6102j1731j0192l888j331J934J835K418N959O504P890P758J2149
$$ plain form
11204 20098 7090 -1495 -9292 -11635 -11207 -16731 -21445 -21284 -23069 -20103 -12380 -8774 -6243 -4274 -4326
11189 -4326 -6307 -9224 -12722 -17149 -16675 -17775 -17314 -18102 -21112 -24479 -29659 -31487 -32646 -33372 -36085 -36341
11173 -36341 -32151 -27461 -23795 -19027 -18020 -14246 -9347 -4862 -2632 2590 10982 14054 21566 26339
11159 26339 28449 27989 29552 32796 31005 26507 19949 8763 -4179 -12473 -19847 -24875 -27789 -28946
11145 -28946 -32163 -34520 -29300 -26943 -27512 -27337 -26249 -25463 -23560 -23853 -26105 -25988 -25612 -24329 -22293 -16634
11129 -16634 -13804 -13132 -11762 -6692 -3340 -196 6066 8178 8137 14659 23733 32275 43549 54600 62635
11114 62635 69920 78057 87019 95536 102674 111174 118994 123477 121337 114206 102824 87830 68317 46756
11100 46756 30654 18923 8731 4843 3512 5446 7281 9699 15658 22162 30052 37810 49959
11087D9959J0817R225O845M435k251j1267j2363j5002j6607j5918r535n809m374
11074a1845Q76J789K134M303J1484J6473J9789K0354J7179J5160J3134N350N39
11061A16719K231P154M367L090J412k846r276j0227j1299j5589j3970j3471j1682
11048D6613j0595l980M306J5271K4237K2798K6960L1876L1419L5597K9633K3594
11036B77729J1037r79j9820l9353m6472m9049m1545l1149k3423j6355m501j414
11024A4706M862Q786J5721K1580J8690K2575K5271J9108J2475O708M819j475j753
11011A72073P027J0415N494N365N83J678K443L48k521m241m492K703J1784J6000
10997B24659K7356L3280L9445M8763N4572N3785N6482O0748O2277N5404M5532
$$ plain form
11087 49959 60776 70001 76846 81281 79030 67763 55400 40398 23791 7873 -1662 -7471 -11845
11074 -11845 -10969 -9180 -7046 -2743 8741 25214 45003 65357 82536 97696 110830 116180 116719
11061 116719 118950 126104 130471 133561 134973 132127 122851 112624 101325 85736 71766 58295 46613
11048 46613 36018 32038 36344 51615 75852 98650 125610 157486 188905 224502 254135 277729
11036 277729 288766 287787 267967 228614 182142 133093 91548 60399 36976 20621 16120 14706
11024 14706 19568 28354 44075 65655 84345 106920 132191 151299 163774 170482 175301 173826 172073
11011 172073 179100 189515 195009 200374 200957 202635 205078 205426 202905 198664 194172 196875 208659 224659
10997 224659 252015 285295 324740 373503 428075 481860 538342 599090 661367 716771 762303
10986G62303L6085K9157K8905M0120N6384Q0487J11154J35636J57925J84206K04421
10975A826783K34351K71990L21895L94117N04956O76988R51374J394330K064670
10966H641454K963673L964087M803223N194510M886693L774749J967519j68369
10958C6027539k197149l723328m545281m658943m215329l482074k697658k024930
10950H482847j517674j145091q66194o49041m80599l42547k39317j57535j01151
10941B983698o2255l5239j6924R791L5669P9077J35417J97440K65096L29007L89138
10930D309915M48690N10454N80374O66249P80294R35468J142512J449060J931368
10921A2754384K681918L878027N710029Q267393J1305719J4092105J5680156J5315883
$$ plain form
10986 762303 798388 827545 856450 896570 952954 1033441 1144595 1280231 1438156 1622362 1826783
10975 1826783 2061134 2333124 2655019 3049136 3554092 4231080 5182454 6576784 8641454
10966 8641454 11605127 15569214 20372437 25566947 30453640 34228389 36195908 36027539
10958 36027539 33830390 30107062 25561781 20902838 16687509 13205435 10507777 8482847
10950 8482847 6965173 5820082 4953888 4304847 3824248 3481701 3242384 3084849 2983698
10941 2983698 2921443 2886204 2869280 2879071 2914740 2993817 3129234 3326674 3591770 3920777 4309915
10930 4309915 4758605 5269059 5849433 6515682 7295976 8231444 9373956 10823016 12754384
10921 12754384 15436302 19314329 25024358 33291751 44597470 58689575 74369731 89685614
10913H9685614J2583688P661665J416297m942433j0140024j3386457j4514884
10906F8363466j3734978j1680567r200792o942911n193090l926107l010388k316615
10898A2358018j766849j330256r93675p44263n71909m49256l76414l24932k81719
10889E518745k33022j69673r0460O457J02113K01076K94548L78700M67832N69629
10879G045945O99752Q65349J088240J360214J693900K147847K816445L846462
10871B1564154N422880P712664J0625656J3584914J5608570J5843670J3746179
10864A04108687R284507L170022l444635r237834j3201924j4992569j4700672
10857F0985582j2868734j0345135p894794n913162m462886l422738k646664k043734
$$ plain form
10913 89685614 102269302 109930967 111347264 106404831 96264807 82878350 68363466
10906 68363466 54628488 42947921 33747129 26804218 21611128 17685021 14674633 12358018
10898 12358018 10591169 9260913 8267238 7522975 6951066 6501810 6125396 5800464 5518745
10889 5518745 5285723 5116050 5025590 5032047 5134160 5335236 5629784 6008484 6476316 7045945
10879 7045945 7745697 8611046 9699286 11059500 12753400 14901247 17717692 21564154
10871 21564154 26987034 34699698 45325354 58910268 74518838 90362508 104108687
10864 104108687 113393194 116563216 113118581 103880747 90678823 75686254 60985582
10857 60985582 48116848 37771713 29876919 23963757 19500871 16078133 13431469 11387735
10849A1387735j567289j186934r12121p18276n88154n04765m53372m17285l78518
10840D661021l37893k91169k32402j72634j16187n9929p742L7189P6287J20699
10830C677240J65231K16493K78094L71953N10673P21627J062211J599536K396079
10821A0999137L437391M551701N433265N760882N269696L884781J784339o22404
10813D0498788k827071m428826n225759n243058m677741l823417k951535k223722
10805I097659j678535j281843r89302p61719n89857m47133l47927k74771k23047
10796B503525j91691j73459j57733j44838j28641j19229j15595j12725j05832
10787A253782r4958r1137q1838o7155n9731n3339l8030l4484k9768k7028j8793
$$ plain form
10849 11387735 9820446 8633512 7721391 7003115 6414961 5910196 5456824 5039539 4661021
10840 4661021 4323128 4031959 3799557 3626923 3510736 3450807 3443065 3480254 3556541 3677240
10830 3677240 3842471 4058964 4337058 4709011 5219684 5941311 7003522 8603058 10999137
10821 10999137 14436528 18988229 24421494 30182376 35452072 39336853 41121192 40498788
10813 40498788 37671717 33242891 28017132 22774074 18096333 14272916 11321381 9097659
10805 9097659 7419124 6137281 5147979 4386260 3796403 3349270 3001343 2726572 2503525
10796 2503525 2311834 2138375 1980642 1835804 1707163 1587934 1472339 1359614 1253782
10787 1253782 1158824 1067687 985849 918694 858963 805624 767594 733110 703342 676314 657521
10776F57521j3573j2525m245R063L9111Q6699J60782K28615J42221m2399j65233
10765A086037j99853j64981j13538o7607m7539m1630l5428k5997j5144p384K088
10754C69024M583m75N559R29K9K920J401M289O325R085J1338N655N768J888j0586
10739D17732j6680j5995j7326k0996k0820j6815j1437q796m331L790Q443J2919
10727C09688J9065J8801J7945K3686J9996J1075J2167K0786K8745L3508L5997
10716E51459L3509K9060K0224P207m740k4813l9101m4043m3633m5022m4275l9220
10704C56612l8211l0623k1471j5249q426L22j032j690N337Q409K503N24o23Q79
10690B57261j036J01J210K173N485O380L222k077M547Q397J2583J7495J8516J6970
$$ plain form
10776 657521 643948 631423 627178 636241 675352 762051 922833 1151448 1293669 1251270 1086037
10765 1086037 886184 721203 607665 540058 492519 450889 415461 389464 374320 366936 369024
10754 369024 373607 373132 378691 379620 379649 382569 383970 388259 394584 403669 415007 420662 426430 428318 417732
10739 417732 401052 385057 367731 346735 325915 309100 297663 288867 284536 288326 296769 309688
10727 309688 328753 347554 365499 389185 409181 420256 432423 453209 481954 515462 551459
10716 551459 584968 614028 634252 641459 636719 611906 572805 528762 485129 440107 395832 356612
10704 356612 318401 287778 266307 251058 242632 242954 241922 240232 245569 253978 256481 257005 256382 257261
10690 257261 256225 256326 257536 259709 265194 271574 274796 272719 277266 285663 298246 315741 334257 351227
10676C51227J7275K3169L6712O0596J02612J53466J98557K19713K23830K11391
10666A598548J88482J49778Q2779r507r0869j48513j83546k03304k10688k05750
10656I67410j86927j54627j20522q8010o7776m9224l8022k7797k0742j4353r311
10645A90099p507m342m811o532m675k743k957n957m663m10N673J4636K6292M0006
10631B32109M9171N4145N6440N4287N3895N2208N6107P1256R0705J24077J54370
10620A048770J70316J75159J73467J59049J21359M7848l0499r3833j35717j51673
10610A484246j68854j66341j40096r1064l2724K7905Q8060J48620J85645K03105
10600A538502J98352J60692Q8997j149r4788j74094k36366k65253k65138k47490
$$ plain form
10676 351227 368502 391671 428383 488979 591591 745057 943614 1163327 1387157 1598548
10666 1598548 1787030 1936808 2019587 2010080 1919211 1770698 1587152 1383848 1173160 967410
10656 967410 780483 625856 505334 417324 349548 300324 262302 234505 213763 199410 190099
10645 190099 182592 178250 173439 166907 162232 159489 156532 150575 145912 145502 151175 165811 192103 232109
10631 232109 281280 335425 391865 446152 500047 552255 608362 679618 770323 894400 1048770
10620 1048770 1219086 1394245 1567712 1726761 1848120 1895968 1865469 1771636 1635919 1484246
10610 1484246 1315392 1149051 1008955 917891 885167 913072 1001132 1149752 1335397 1538502
10600 1538502 1736854 1897546 1986543 1985394 1890606 1716512 1480146 1214893 949755 702265
10590G02265k12532j61383j10618o8510l8498j6021m772R58J0808R311J1064J5949
10578A38021J9505K5402L4331M7671O5375P3258P9185Q0309P7846P0459N7905
10567G69267L4579K021k5153m9791o1348p0372o9248n8913l8882k2748j4374n910
10555C89128k643l563p560j5415j8033j9138j3112o349N321J7162K8447L4141
10543C88386M2758M6009M6128M4979N1956M4057L6233L7206L2548L5982L0156
10532H36398K8782L8943M3492N4899N8436O0307P2007P4936P5436P3128N9711
10521A476475N1464M7144M9163N7453O3916Q0957J09284J37685J61723J91748
10511B427012K16292K32438K41233K44315K41573K42139K47549K54273K80805
$$ plain form
10590 702265 489733 328350 217732 149222 110724 94703 89931 90889 101697 111008 122072 138021
10578 138021 157526 182928 217259 264930 330305 403563 482748 563057 640903 711362 769267
10567 769267 803846 805867 780714 730923 669575 599203 529955 471042 432160 409412 395038 389128
10555 389128 386485 382922 375362 359947 341914 322776 309664 303315 308636 325798 354245 388386
10543 388386 431144 477153 523281 568260 620216 664273 700506 737712 770260 806242 836398
10532 836398 865180 904123 947615 1002514 1060950 1121257 1193264 1268200 1343636 1416764 1476475
10521 1476475 1527939 1575083 1624246 1681699 1745615 1826572 1935856 2073541 2235264 2427012
10511 2427012 2643304 2875742 3116975 3361290 3602863 3845002 4092551 4346824 4627629
10502D627629L24115L82961M63068N74604P11551Q48108R72482J097203J222552
10493A1224273J345687J487929J674738J934760K290838K749464L342557M111739
10485C0161985N110856O507733Q635926J2046800J7644298K6520431L8537825
10478A45165854M9799449N5047664N4015304M8278744L7531154K1735481L057941
10471D14631591j4917000k8822728l8726900m5926402m9072667m6650016l9858275
10464A50657603l1415774k3787886j7946186j3810847j0897320q676144o846761
10457C7276685n335076m151911l270305k617955k159347j869552j687964j566590
10449A4617985j451595j340902j218067j073322r15673p59686o28049n23537m43932
$$ plain form
10502 4627629 4951744 5334705 5797773 6372377 7083928 7932036 8904518 10001721 11224273
10493 11224273 12569960 14057889 15732627 17667387 19958225 22707689 26050246 30161985
10485 30161985 35272841 41780574 50416500 62463300 80107598 106628029 145165854
10478 145165854 194965303 250012967 304028271 352307015 389838169 411573650 414631591
10471 414631591 399714591 370891863 332164963 286238561 237165894 190515878 150657603
10464 150657603 119241829 95453943 77507757 63696910 52799590 44123446 37276685
10457 37276685 31941609 27789698 24519393 21901438 19742091 17872539 16184575 14617985
10449 14617985 13166390 11825488 10607421 9534099 8618426 7858740 7230691 6707154 6263222
10440F263222l85457l34990k97397k77399k61067k42218k31156k10202j94187
10431C829149j80835j63085j46420j29230j20219j19906j18874j18694j16449
10422B615437j11692j07777r6805p7385n0966l5631l1097k4177j6989j4476j8785
10411B029657l4530n2574o0461o5505n9575n1263m2681l0187j8263j8660j4052
10400A581906j1735j2869j4487k1952k2405k0403k1761k0235k5129l0420k3937
10389A356573j9859j8460k9382l8636m3512m1851m1566l9799l9273l0569k6058
10378I87608k1816j5652q877n590R41K389j474k922m064p672j0337m890l175l129
10364I01340k978k040L80N592P500Q084J4241J7737L1910M1305M2610M2253K8620
$$ plain form
10440 6263222 5877765 5542775 5245378 4967979 4706912 4464694 4233538 4023336 3829149
10431 3829149 3648314 3485229 3338809 3209579 3089360 2969454 2850580 2731886 2615437
10422 2615437 2503745 2395968 2299163 2221778 2170812 2135181 2104084 2079907 2062918 2048442 2029657
10411 2029657 1995127 1942553 1882092 1816587 1757012 1705749 1663068 1632881 1614618 1595958 1581906
10400 1581906 1570171 1557302 1542815 1520863 1498458 1478055 1456294 1436059 1410930 1380510 1356573
10389 1356573 1336714 1318254 1288872 1250236 1206724 1164873 1123307 1083508 1044235 1013666 987608
10378 987608 965792 950140 941263 935673 936614 939003 937529 934607 930543 922871 912534 907644 904469 901340
10364 901340 898362 896322 896702 902294 909794 917878 932119 949856 981766 1023071 1065681 1107934 1136554
10351A136554J6733l656k7593n5620p7852r0012r3519r5183q4969p4092n4222
10340D96569l5819k7052j4741n362L205R341J2609O455J10j273l965k353o484
10327D31240j4093k2036l1658l9155l7804l0027k4080k0813m678J0284J8580K8555
10315B64315L8348L7696L5574K2857J6268J1759M047j354q609r980j2832j2007
10303C86082o289m021j616Q25O94k007J379M001P149J417l867j1341j9908j9586
10289C32912j3735j3412k6099m0309n1613o0721o1104n8796m7694l1460j9169
10278i1200j841J1176K0899L6113L8735L5249K8271K5374K2101J5946R476O447
10266A56746K936L136r19n229J04K857L662L381N564L274J918K892M882M215O278
$$ plain form
10351 1136554 1153287 1149631 1122038 1066418 988566 898554 805035 709852 624883 550791 496569
10340 496569 460750 433698 418957 413595 416800 426141 438750 445205 445315 444042 440077 437724 431240
10327 431240 417147 395111 363453 324298 286494 256467 232387 211574 206896 217180 235760 264315
10315 264315 302663 340359 375933 398790 415058 426817 430864 429510 420901 410921 398089 386082
10303 386082 379793 375772 374156 374981 375675 373668 375047 379048 386197 387614 383747 372406 352498 332912
10289 332912 319177 305765 279666 239357 187744 127023 65919 7123 -40571 -72031 -91200
10278 -91200 -93041 -81865 -60966 -24853 13882 49131 77402 102776 124877 140823 150299 156746
10266 156746 159682 162818 161899 156670 156774 159631 163293 166674 172238 175512 177430 180322 185204 189419 195697
10251A95697N217J602J848L302J529J106O661J1248R989Q738Q427N660R302L303
10237B73629L083N174K305k581q354p518j0060n951l92p92l028m916n438o023
10223B29138o559l002k016j48p48j975l94K592M726L030J258L512J534J817o93
10208B32072m281m248o886m636p834m280l606o942J505L778K46K9l758l691j903
10193A85565j027K423j360p10j709l880m797n966k079K398L601L487K708K03J241
10178A80098J378J015O7l464m542l799l808n46p19M48K792P431R666N389O442
10163A97848M316L483j394p628j0490j1526r174j0127j0140r374r949m30J123
10150A26538L490O234L847Om011m115j911m95O89k43M833n64k021J291K922n10
$$ plain form
10251 195697 200914 202516 204364 207666 209195 210301 216962 228210 238199 246937 255364 261024 270326 273629
10237 273629 276712 281886 284191 281610 273256 265738 255678 249727 249335 248543 245515 240599 235161 229138
10223 229138 222579 219577 217561 217413 216665 214690 214296 216888 221614 224644 225902 229414 230948 232765 232072
10208 232072 227791 223543 216657 212021 204187 199907 196301 189359 190864 194642 194888 194917 191159 187468 185565
10193 185565 184538 186961 185601 184891 183182 179302 174505 168539 166460 168858 172459 175946 178654 178857 180098
10178 180098 181476 182491 182558 179094 174552 170753 166945 166399 165680 166128 168920 176351 186017 191406 197848
10163 197848 202164 205647 204253 196625 186135 174609 165435 155308 145168 135794 125845 125415 126538
10150 126538 130028 136262 140109 140115 136104 131989 130078 129583 130272 130029 134862 134298 132277 133568 136490 135980
10134A35980m008m080n758m401j137n76J488j75Q86P42p48L055j985j118k357
10119A15808m395j645l529j664l325l081L14j644k693j047L037k086k418o36K963
10104I3959O908P014M286L822L465O94M188L720L195J156L128K549N397P180O449
10089A57110O909L951Q429J0929J0816J1147J4285K2622K7634L0596M0816O2736
10077D07980R8520J48325K19262K86237L35268L52298L34377K75979J60881J5628
10067B634755j28030k26939k94663l30820l23697k78597k18553j67362j22840
10058E43254r4492p0978n0643l7625l1839k1958j6030j4495j1381p770p085q084
10046A70874o011m421o832n993n253m080l567Q92j013j744l296m072n978J590
$$ plain form
10134 135980 131972 127892 122134 117733 116596 116020 117508 117333 118219 118961 118213 121268 119283 118165 115808
10119 115808 111413 109768 106239 104575 101250 98169 98483 96839 94146 93099 96136 94050 91632 90996 93959
10104 93959 100867 107881 112167 115989 119454 120148 124336 128056 131251 132407 135535 138084 143481 150661 157110
10089 157110 164019 167970 176399 187328 198144 209291 223576 246198 273832 304428 345244 407980
10077 407980 506500 654825 874087 1160324 1495592 1847890 2182267 2458246 2619127 2634755
10067 2634755 2506725 2279786 1985123 1654303 1330606 1052009 833456 666094 543254
10058 543254 448762 377784 327141 289516 257677 235719 219689 205194 193813 186043 178958 170874
10046 170874 164863 160442 153610 147617 142364 138284 134717 135609 134596 132852 129556 125484 119506 121096
10032A21096K377J867j24K182j410l797m660n835o398l523n222j948p20m193j676
10017H8016l885l050l486k593PJ421M512N19n61p80P09k66K129J055p19J443l108
10000H1363k817l309m90M092r55k627r64R46k100j257j226k597j371L18j713l12
9984F4981k65M9R71M31N45j42o75k746l739j073k984o427k504j283J324L714K691
9967E2868J186j19k293J197O606O966N145K259L30J541J64j718j608l122r92Q82
9951F9292k340l99J372L57k411J684l39r40j563j769k189k201n068o815j997n88
9935D4086O91J235K98j28r15K062J109j162k011J07K510K738P84J99k8n53K6K130
9917E3178o14J188l368k051m48K619L857K046j982j859J91j363r12L74m269j296
$$ plain form
10032 121096 123473 125340 125216 127398 125988 122191 117531 111696 105298 101775 96553 94605 93885 89692 88016
10017 88016 84131 81081 77595 75002 75009 76430 80942 81461 80900 80120 80829 80563 82692 83747 83028 84471 81363
10000 81363 78546 75237 74747 78839 77884 75257 74293 75239 73139 71882 70656 68059 66688 67006 65293 64981
9984 64981 64716 64765 65736 66167 66712 66570 65895 63149 59410 58337 55353 48926 46422 45139 46463 50177 52868
9967 52868 54054 53935 51642 52839 59445 66411 71556 73815 74145 75686 75850 74132 72524 69402 68410 69292
9951 69292 66952 66553 67925 68282 65871 67555 67216 66276 64713 62944 60755 58554 53486 46671 44674 44086
9935 44086 44777 46012 46310 46182 45267 47329 48438 47276 45265 45372 47882 50620 51404 51603 51575 51022 51048 53178
9917 53178 52564 53752 50384 48333 47885 50504 54361 56407 54425 52566 52757 51394 50482 50856 46587 45291
9901D5291r23m64j464j175K483N248M837j675m225K081K212M67K836L422J429
9886F0380K046J1888K0637K4772M3137P6466R0263K7615m0002o9160o0711m0982
9874A46349k3970j3959j1428j2901q876j0701n929j757k76K10l343j914o63k966
9860D7876k283k774l173j149R47r36n1J476J368M36o244k944L871J901k325j767
9844C4229j262n2o19j446P63M507q97m358r26L407M025L49k282Q99p83j436k079
9827C2039l83Q76r81j36J897N5k997j569K657J372R12o47L235J739o10j213o71
9810C5575o39m60q74K46J532J494J791k631r65n62p00K182J620J469R16J608J466
9793D3068j07m463k340N62J087j982J437J085K700L34k407J33O750J2185J7070
$$ plain form
9901 45291 44368 43904 42440 41265 43748 48996 53833 52158 47933 50014 52226 52693 55529 58951 60380
9886 60380 62426 74314 94951 119723 162860 239326 329589 357204 317202 248042 187331 146349
9874 146349 122379 108420 96992 84091 75215 64514 58585 56828 56552 56762 53419 51505 50842 47876
9860 47876 45593 42819 39646 38497 39444 38508 38457 39933 41301 41737 35493 32549 36420 38321 35996 34229
9844 34229 32967 32915 32296 30850 31613 36120 35223 30865 29939 33346 37371 37720 35438 36337 35554 34118 32039
9827 32039 31656 32532 31551 31415 33312 33367 30370 28801 31458 32830 33742 33095 36330 38069 37459 36246 35575
9810 35575 34936 34476 33602 33848 35380 36874 38665 36034 35069 34507 33807 35989 37609 39078 39994 41602 43068
9793 43068 42961 38498 36158 36720 37807 35825 37262 38347 41047 41381 38974 39107 45857 58042 75112
9778G5112J8862J6782J548p727q991j3232j6338q075l904p883k264q26m277q93
9764C7894K826k68Q73l221l760l858J447R30m912j984K260J242k64M311K531j630
9748C4417J342j146m63J553j377k246R50m39l712M62K7L49L266J521k449q75P91
9731C1971m057j843Q08l936n241k738j19j408n01L010M446J406p54Q50L514j472
9715B3936k717N957L065M21r43k848k391r04P15o44k545M703L217O06k405k125
9699B5098o86J136K850J804j053J691K989K33k190k278j066j353P18K872K372
9684C3137j922m466k321q84n72q60j539J153L265m58M52l181Q57J687k739k118
9668A9491j678J852J549M44j758l484j68N26M261L798o05k627j885L41K835J318
$$ plain form
9778 75112 93974 110756 112304 104577 95586 82354 66016 57941 54037 46154 43890 43064 38787 37894
9764 37894 40720 40452 41325 38104 34344 30486 31933 32863 27951 25967 28227 29469 29205 33516 36047 34417
9748 34417 35759 34613 34150 35703 34326 32080 33030 32591 28879 29341 29368 29717 32983 34504 32055 31180 31971
9731 31971 27914 26071 26879 22943 17702 14964 14845 13437 12936 15946 20392 21798 21044 21894 25408 23936
9715 23936 21219 27176 30241 30662 29719 26871 24480 23576 24291 23647 21102 25805 29022 29628 27223 25098
9699 25098 24412 25548 28398 30202 29149 30840 33829 34062 31872 29594 28528 27175 27893 30765 33137
9684 33137 31215 26749 24428 23544 22972 22112 20573 21726 24991 24533 24985 21804 22661 24348 21609 19491
9668 19491 17813 19665 21214 21658 19900 16416 16248 16774 21035 24833 24228 21601 19716 20057 22892 24210
9652B4210m208l030Q73K575k26o03J213m83O77q50Q32j61o47Q50R46k115j469
9635A8384l22o65o98N28R90K632L797N35K071J622j816n21o89m187m992l361K97
9618A3605P40J047J155J62J856M424Q81k724L280p86l912j873k103k779o57P01
9602A3017O309K4j015m17M81k201j111p32K019P11k480j903j518K395O33j780
9586A2432j86k93R22J256M13p58L554o65k062n25L75J148L52K837k007k013K654
9569A7434k107q101m25N32K762L429l55j608J387J91r42K738N52K73p9M02K306
9552A8389l01j130k287k094j179K146M318j177l020l819P31R88n67Q55Q39r1J988
9535A4589pR39o28J860K088n410J163O0k028J741L126j877J981P81j136l986P72
$$ plain form
9652 24210 20002 16972 17845 20420 20194 19591 20804 20321 20998 20148 20980 20819 20172 21022 21968 19853 18384
9635 18384 18062 17397 16699 17227 18217 20849 24646 25181 27252 28874 27058 26537 25848 21661 16669 13308 13605
9618 13605 14345 15392 16547 16709 18565 22989 23870 21146 24426 23640 19728 17855 15752 12973 12316 13017
9602 13017 19326 19350 18335 17918 18399 16198 15087 14355 16374 17085 14605 12702 11184 13579 14212 12432
9586 12432 12246 11953 12875 14131 14544 13786 17340 16675 14613 14088 14463 15611 15963 18800 16793 14780 17434
9569 17434 15327 7226 6801 7333 10095 13524 13169 11561 12948 13139 12197 14935 15487 15760 15681 16083 18389
9552 18389 18088 16958 14671 12577 11398 13544 17862 16685 13665 9846 10577 11565 10998 11853 12692 12601 14589
9535 14589 14582 15521 14893 16753 18841 13431 14594 14654 12626 14367 17493 15616 17597 18378 17242 13256 14028
9518A4028j979J564k91j729l073j953L484m58l731j501k413l143l630l17K532
9503b610M187k011L015J562R35k431J870N78J335K898M912J53k814M88l444j884
9487F739J865M336J68n40J180K025j451R72k987k337j452Q38K015k438j677k064
9471E192k801K222N03j412J240M96j506R70L62l161J228N88l991l081l88J911
9455a628k707j038L940L557L57r02K801k205l208L8Q00Q03Q60n99j008K23n05
9438d21L763K484k66j130o72K038J064R69M90n48k5k605l106r73J214j026k302
9421a052L049K626j966K132N84M366Q29l033m026k252j549o46K057P27L040N93
9405E479P32k271L34K388k793p90L264K122k163M03j977l7R4N47p87j665L464
$$ plain form
9518 14028 12049 13613 13322 11593 8520 6567 10051 9593 5862 4361 1948 -1195 -4825 -5142 -2610
9503 -2610 1577 -434 2581 4143 5078 2647 4517 5095 6430 9328 14240 14393 11579 12067 8623 6739
9487 6739 8604 12940 13108 12568 13748 15773 14322 15294 12307 9970 8518 9356 11371 8933 7256 5192
9471 5192 2391 4613 5116 3704 4944 5440 3934 4904 5266 2105 3333 3921 -70 -3151 -3539 -1628
9455 -1628 -4335 -5373 -1433 2124 2481 1579 4380 2175 -1033 -995 -195 608 1468 869 -139 84 -421
9438 -421 3342 5826 5560 4430 3758 5796 6860 7829 8319 7771 7746 5141 2035 1062 2276 1250 -1052
9421 -1052 1997 4623 2657 4789 5373 9739 10568 7535 3509 1257 -292 -938 1119 1846 4886 5479
9405 5479 6211 3940 4274 6662 3869 3079 6343 8465 6302 6705 4728 4691 4785 5332 4545 2880 6344
9388F344p73k204P70k481k48N45k535J94J284j239j836L059L275j774K416J201
9372E998r77K237k427j783J416j47k126l469j28K554J856O12J071L066j979l562
9356B212n26J208n4k296q4L95K159K759R08p97l978q30m041l64J852m4n97j706
9338c824l229q5m9j08J361K100K975K151k140k754K974M31l723K55N560O70J400
9321C965K934N75J722j018k183l12K184K373j986m7n70l540n69o03O89J884k984
9304B514j155j192j043K043N01m313m082M74l63l60L994j067n03J919k142k145
9288f920K71J034L290j22m9K351J537k060j687N7J852P23K733J374k342j268J72
9271I46J08P00j830n497j882q52R61K510M50o87P18m21m23K219K341k199k032
$$ plain form
9388 6344 5571 3367 4137 1656 1408 1953 -582 -388 896 -343 -2179 880 4155 2381 4797 5998
9372 5998 5021 7258 4831 3048 4464 4317 2191 -1278 -1406 1148 3004 3616 4687 7753 5774 2212
9356 2212 1686 2894 2840 544 460 855 3014 5773 6681 5884 1906 1076 -2965 -3329 -1477 -1521 -2118 -3824
9338 -3824 -7053 -7138 -7187 -7295 -5934 -3834 -859 1292 -848 -3602 -628 -197 -3920 -3665 1895 2565 3965
9321 3965 6899 7474 9196 8178 5995 5683 7867 10240 8254 8207 7637 4097 3528 2925 3614 5498 2514
9304 2514 1359 167 -876 1167 1668 -2645 -6727 -6253 -6616 -6976 -2982 -4049 -4552 -2633 -4775 -6920
9288 -6920 -6649 -5615 -2325 -2447 -2496 -145 1392 -668 -2355 -2298 -446 277 3010 4384 2042 774 946
9271 946 1054 1754 -76 -5573 -7455 -8307 -7346 -4836 -4386 -5073 -4355 -4776 -5199 -2980 -639 -2838 -4870
9254d870k10k838L616K112l769k793K66M489K339J344j796k630j561k463n11J934
9238g341L57L320K30l986l35K027J052j207M47N72J121L097j318O67k359J9N07
9221c130j02K011K174j638j255j525j959R49R46K256r88r0l31o03K12L891n86
9204B32k768l276k867N48l99j979K561K984O78J946K021K886k482m076m528j236
9188i755L559O33K381M205k304p39J321K895N744R16J974K91n00j738j576l93
9172F914k722j238J488k568m869J40L718K539J562l430k260k429j232J133Q05
9157b449n7K503L1L10j562J125l011N178K607o073l311J230M902n20l023k098
9141d218K685M678L266K826m72o83L69J848j629l415p88n00K304m0p1K798o83
$$ plain form
9254 -4870 -5080 -7918 -4302 -2190 -5959 -8752 -8486 -3997 -1658 -314 -2110 -4740 -6301 -8764 -9275 -7341
9238 -7341 -6984 -3664 -3434 -7420 -7755 -5728 -4676 -5883 -5436 -4864 -3743 -646 -1964 -1297 -3656 -3637 -3130
9221 -3130 -3232 -1221 953 -685 -1940 -3465 -5424 -4475 -3529 -1273 -2261 -2351 -2682 -3285 -3073 818 232
9204 232 -2536 -5812 -8679 -8131 -8530 -10509 -7948 -4964 -4286 -2340 -319 2567 85 -3991 -8519 -9755
9188 -9755 -6196 -5563 -3182 1023 -1281 -2020 -699 2196 7940 8856 10830 11121 10621 8883 7307 6914
9172 6914 4192 2954 4442 1874 -2995 -2855 863 3402 4964 1534 -726 -3155 -4387 -3254 -2449
9157 -2449 -2506 -3 28 338 -1224 -99 -3110 2068 4675 -1398 -4709 -3479 1423 903 -2120 -4218
9141 -4218 -1533 3145 6411 9237 8765 8082 8451 10299 8670 5255 4467 3967 6271 6231 6160 8958 8275
9124H275l659m264l274l977j061j098O02J180j234J669O47j524K96J471N39K667
9108b745K122j602l00K961N302j082O08j643k266q45J19j354j583P89L257o54
9092A084p1J755l120L476J859l387l606j643j057Q28j05p54p76J864K608n41l981
9075e567j492n02k275l284L44M665K049J642K805K699m398j446M55Q13M585m77
9059F16k471J314K302k052m527k066M550K198k629j850L38M78j268k439L29L915
9043c262J125p37L220L293m052l766k821L396K886J596j869M3k397l568m279n359
9027a6551k901L357K932j357l649l586k072N851L849L620L175J663N152L408J884
9012D775m09j710l057m035P03L45J421l45l397l037J77j780q1M853M084K561J702
$$ plain form
9124 8275 4616 352 -2922 -6899 -7960 -9058 -8456 -7276 -8510 -6841 -6194 -7718 -7422 -5951 -5412 -2745
9108 -2745 -623 -2225 -2525 436 5738 4656 5264 3621 1355 510 629 -725 -2308 -1519 1738 1084
9092 1084 1013 2768 -352 3124 4983 1596 -2010 -3653 -4710 -3882 -3987 -4741 -5517 -3653 -1045 -1586 -5567
9075 -5567 -7059 -7561 -9836 -13120 -12776 -8111 -6062 -4420 -1615 1084 -3314 -4760 -4305 -3492 1093 616
9059 616 -1855 -541 1761 -291 -4818 -6884 -2334 -136 -2765 -4615 -4277 -3799 -5067 -7506 -7177 -3262
9043 -3262 -2137 -2874 346 3639 -413 -4179 -7000 -3604 -718 878 -991 -948 -3345 -6913 -11192 -16551
9027 -16551 -19452 -16095 -13163 -14520 -18169 -21755 -23827 -17976 -14127 -10507 -7332 -5669 -517 2891 4775
9012 4775 4366 2656 -401 -4436 -3733 -3388 -1967 -2312 -5709 -8746 -8569 -10349 -10430 -5577 -1493 1068 2770
8995B770K944k861l514q36K865K700k652j958k677j747j445p7L83j637J45r49
8979h546M03K736L310L460M298p90K939Q862O373P013P094J1386Q946J2755J6915
8964H7154K4125L7410N2528Q7006J36910J84236J82060R0095m2985j37365j65006
8953E36168j42264j01705o5231m2363l1675k9279k7497k2816j6422j2414m613
8942C9889k461l887m606n690p711m145j253j10P11N822R348N402L402J23j664
8927C3170K797L223N794J0471R405J1680J2215J5359J4816J6104K0301K8870N0237
8914B34442Q5385J39206K31595L64544M19285K51367k4351k50230l37291l01120
8904H12832k13534j41794r5041o8053o0184n2771l9854k7612k0107j1512j0012
$$ plain form
8995 2770 5714 2853 -661 -1497 1368 4068 1416 -542 -3219 -4966 -6411 -6488 -6105 -7742 -7597 -8546
8979 -8546 -8143 -5407 -2097 1363 5661 4871 7810 16672 23045 30058 37152 48538 57484 70239 87154
8964 87154 111279 148689 201217 288223 425133 609369 791429 881524 838539 701174 536168
8953 536168 393904 292199 226968 184605 152930 123651 96154 73338 56916 44502 39889
8942 39889 37428 33541 28935 23245 15534 11389 10136 10026 10737 16559 25907 31309 34711 34834 33170
8927 33170 35967 39190 44984 55455 64860 76540 88755 104114 118930 135034 155335 184205 234442
8914 234442 319827 459033 690628 1055172 1474457 1725824 1701473 1451243 1113952 812832
8904 812832 599298 457504 362463 294410 234226 181455 141601 113989 93882 82370 72358
8893G2358j4897j0325j0087q653j400L065m738p073j751J813O621Q469O178K276
8879D1856j296q23N937M039O307N462j476o705m35L402J0511K7822M2652N6031
8865A93284O6306R5144J33726J62943J36163L2084q3362j47511j48828j22409
8855C17540q4810n1323l4832l2121k9633k2099j5794r139m030l667l849k090l491
8842B0662k431m47Q147J4780J7557J2165M003j801n604n739j837m141o325n504
8828D3485j443M265O811O594j831j5147k0010j7273j0234k535K767J899K700N717
8814E765P794M326L97J155P727J0428O574L583M70l546k730l445k663q564m540
8799B2731m960J101K017O070O348j358o989p341r739k465q11l724J820P69j910
$$ plain form
8893 72358 57461 47136 37049 28396 26996 30061 25323 18250 16499 18312 24933 33402 39580 41856
8879 41856 40560 39737 45674 49713 56020 61482 60006 53301 52866 56268 66779 94601 137253 193284
8865 193284 259590 354734 488460 651403 787566 819650 736288 588777 439949 317540
8855 317540 232730 181407 146575 114454 84821 62722 46928 37789 33759 30092 26243 24153 20662
8842 20662 18231 17784 25931 40711 58268 70433 74436 72635 67031 61292 59455 55314 48989 43485
8828 43485 42042 46307 53118 59712 57881 42734 22724 5451 -4783 -7318 -4551 -2652 48 5765
8814 5765 13559 17885 18282 19437 27164 37592 44166 47749 48219 44673 41943 38498 35835 27271 22731
8799 22731 17771 18872 20889 26959 33307 31949 24960 17619 7880 5415 4604 880 2700 3469 1559
8784A559R86J758K455O72l291m883l270k938j523J605K202k89J438J0928J6456
8769B3865N919M08L281P793L785N721J4253J8222J6712K0131P404L741P031J6273
8755A54539J6342J0704J0406Q242j0259l2827m9092m8258l9088k4293j2033j154
8743a6771J936N22j815m315k318L305P682L131K638M042M038j188k185J889K369
8728B960K296R011R873O074N99M196P017K469p428j1017l783O345J8476L7705
8714H4793M8214L4891J8691N124o498k691O457J8682K3327L2926L7367K0359k9792
8701B91850o1658o0063m7295k7865k0525j3899j0700j2751j2275o7J7130L7397
8689G9279N9863O6389L6389N057J0996M4027P3060O9715J2694o9858j22601j31203
$$ plain form
8784 1559 2545 4303 6758 7430 4139 -744 -4014 -6952 -8475 -6870 -4668 -4957 -3519 7409 23865
8769 23865 29784 30192 33473 41266 45051 50772 65025 83247 99959 120090 127494 131235 138266 154539
8755 154539 170881 181585 191991 200233 189974 157147 108055 59797 20709 -3584 -15617 -16771
8743 -16771 -14835 -14313 -16128 -20443 -22761 -19456 -11774 -8643 -6005 -1963 2075 887 -1298 591 2960
8728 2960 5256 14267 24140 30214 30813 35009 42026 44495 37067 26050 22267 28612 47088 84793
8714 84793 133007 167898 186589 191713 185215 182524 188981 207663 230990 263916 301283 321642 291850
8701 291850 230192 170129 122834 94969 74444 60545 49845 37094 24819 24752 41882 79279
8689 79279 139142 205531 241920 246977 257973 302000 375060 444775 457469 387611 265010 133807
8677A33807q8002m2196j2967J750K515r736j5614j0372l472J8989M1605O5266
8665H1573O4412M7153K1680j1402l4151l8161j9355L341K3575L5574L1223K396
8653B07858k2309k8384j2892l268n279j3047k7137l6905k0266R715L9128P2667
8641A59881J09149J26222Q2772J6941J2260P6282J35692J52611N9166r6346k26134
8630F08496k46468j82328q4966r348J6234J1962N175m790n444N249J4243K0839
8618A48854L4924N3009O2692M3166J3078j9273k2301l500K2139L1321K9622K9340
8606D23071L2106K5157Q580L955N536J5573K2776K0679P006M074K5408N5076P9850
8593G28847J02097J12455J07087Q5468R4544J41867J79874J90845J59118R4075
$$ plain form
8677 133807 45805 3609 -9358 -7608 -5093 -14829 -30443 -40815 -44287 -25298 16307 81573
8665 81573 145985 193138 214818 203416 169265 131104 111749 115090 138665 174239 205462 207858
8653 207858 185549 157165 144273 141005 135726 122679 95542 58637 38371 48086 87214 159881
8641 159881 269030 395252 478024 494965 507225 583507 719199 871810 930976 834630 608496
8630 608496 362028 179700 94734 85386 101620 113582 118757 113967 108523 113772 128015 148854
8618 148854 183778 236787 299479 342645 355723 336450 314149 310649 332788 364109 393731 423071
8606 423071 455177 480334 488914 492869 498405 513978 536754 557433 564439 568513 593921 648997 728847
8593 728847 830944 943399 1050486 1135954 1230498 1372365 1552239 1743084 1902202 1996277
8583A996277M1430L9947J03338J99677K88026L56885M53468N91301P55389Q79647
8573E705385R31580R54796R81639J099378J427211K037480K909243L940693M955347
8564B4942752O524571R926294J6404823K6437567L5868897L3256186J3206466
8557A66567556j1146929k6702445l0420921k5625757j8202123j1981357q205765
8550C4282259o410924n407794m428787l349538k317816j479647r19094o85808
8542I282851o70319o94715o41951n14367l84424k62612j63597q6009j9717N6787
8532E901927J60268K84425M44333O75460J001038J388792J685743J857663K085364
8523A5485013K327176K517963K457023K475242L032017M282899O606379J0537379
$$ plain form
8583 1996277 2037707 2077654 2180992 2380669 2668695 3025580 3479048 4070349 4825738 5705385
8573 5705385 6636965 7591761 8573400 9672778 11099989 13137469 16046712 19987405 24942752
8564 24942752 31467323 41393617 57798440 84236007 120104904 153361090 166567556
8557 166567556 155420627 128718182 98297261 72671504 54469381 42488024 34282259
8550 34282259 27871335 22463541 18034754 14685216 12367400 10887753 9968659 9282851
8542 9282851 8612532 7917817 7275866 6761499 6377075 6114463 5950866 5864857 5845140 5901927
8532 5901927 6062195 6346620 6790953 7466413 8467451 9856243 11541986 13399649 15485013
8523 15485013 17812189 20330152 22787175 25262417 28294434 32577333 39183712 49721091
8515D9721091J7036585K8227268M6671488O8552035P0381165L2150726j3902142
8508B98838216m5595612n6105870m9810069l6731971k4482544j6578964j2842734
8501E6690452j0965681r214395p141942n079548l332328k065822j467433j459635
8493A5963668j613235j625639j454634j171685q74186o23624m02429j68591J15653
8484H145298L78203M02939J28858j68430k48339r7618J42677L08520L97811M52024
8474I841943N00387O29139R09235J350646J961285K862271M375851O987525J1477747
8465D0896029J8957068K9031929L5070218K5577243K939411j7426549k7384057
8458A07661292k6895520k0800528j4130754r310084o736280n523326m667712l731384
$$ plain form
8515 49721091 66757676 94984944 141656432 210208467 280589632 312740358 298838216
8508 298838216 253242604 197136734 147326665 110594694 86112150 69533186 56690452
8501 56690452 45724771 36510376 29368434 24288886 20956558 18890736 17423303 15963668
8493 15963668 14350433 12724794 11270160 10098475 9224289 8600665 8198236 8029645 8145298
8484 8145298 8523501 8926440 9055298 8886868 8638529 8540911 8683588 8992108 9389919 9841943
8474 9841943 10342330 10971469 11880704 13231350 15192635 18054906 22430757 29418282 40896029
8465 40896029 59853097 88885026 123955244 149532487 152471898 135045349 107661292
8458 107661292 80765772 59965244 45834490 36524406 29788126 24264800 19597088 15865704
8450A5865704k744489j863276j190029p97984p04102p67852q03723p48170o01100
8441E644979m17671k25152j9896K50377O62784J145817J155896L42549o21584
8432G918099j165762j185275r43238o74985m72278l59593l01260k62521k09870
8423B343317j53030j18174j09305j14785j11472r0038o2810m9440n0569m5436
8413A438258l7806l7077m5655n0352n6990m5999l6271l1314k8424p496J7781L8790
8401A117445L7256J8620L233p847o106J063J4226K6246M9836R4953J69504K79288
8389A797717M44132O07707O26906L04961j95899n16173n60149m63857l30677k41325
8379A473343j90398j64649j41770j02317n9925k8755j6191j7865k4554l9296m4538
$$ plain form
8450 15865704 13121215 11257939 10067910 9269926 8565824 7797972 6994249 6246079 5644979
8441 5644979 5227308 5002156 4982260 5232637 5895421 7041238 8197134 8539683 7918099
8432 7918099 6752337 5567062 4623824 3948839 3476561 3116968 2815708 2553187 2343317
8423 2343317 2190287 2072113 1962808 1848023 1736551 1646513 1583703 1534263 1483694 1438258
8413 1438258 1400452 1363375 1317720 1267368 1210378 1164379 1128108 1096794 1068370 1060874 1078655 1117445
8401 1117445 1154701 1173321 1176554 1168707 1162601 1163664 1177890 1204136 1253972 1348925 1518429 1797717
8389 1797717 2241849 2849556 3476462 3781423 3585524 3069351 2509202 2045345 1714668 1473343
8379 1473343 1282945 1118296 976526 874209 814284 785529 769338 751473 726919 687623 643085
8368F43085m7275m9208m2518k4703o190R766J5531R647j0688m2034o3957n6920
8356C34536j8713L0802O5392P0204M8078K1349M511n922j0339o156p707p381j161
8343E17493J0645J8514K7229K9411J6866j0564m1698n1933l5655j3371m580j7843
8331D44514k6488l1644k8593j3378l578k119j84K202L537L313j3340n1166q3912
8318A99164p5078m4571M467L2985M1786L3372J7076l208j5021j4274l012J0326
8306A84012K4449L1969L3116J7423o16n565r234r559l22O226N435J052k445o316
8292B69625j422L073K726J695p99J52j85P23J964m113m026j460J858O939P552
8277B84302P217k784n814m857q807j8742l4996l9429k9774j0160N477J1625J6191
$$ plain form
8368 643085 595810 546602 504084 479381 473191 482957 498488 508135 497447 455413 391456 334536
8356 334536 315823 346625 412017 482221 530299 551648 556159 550237 539898 533742 526035 518654 517493
8343 517493 528138 546652 573881 603292 620158 609594 567896 515963 480308 466937 462357 444514
8331 444514 418026 386382 357789 344411 340833 338714 338530 340732 344269 347582 334242 283076 199164
8318 199164 124086 79515 83982 116967 158753 192125 209201 205993 190972 176698 173686 184012
8306 184012 208461 240430 273546 290969 290353 284788 275554 265995 265673 271899 277334 278386 275941 269625
8292 269625 268203 271276 274002 275697 274898 275050 274865 275588 277552 273439 269413 267953 269811 276750 284302
8277 284302 291519 288735 282921 278064 269257 250515 215519 176090 146316 136156 141633 153258 169449
8264A69449J7397J6214J3068L863k40l158o792l113J0187R907M145m641m184k175
8250B19927k662M243Q341M858j930o903m833l637m488o736n327r284m798k112
8236A84659L578Q560P525L924J719J69J032L051N735K337P27l217p842n995o421
8221A99541l104K497L475k150m401M30j82m968M09m81m86J035N892L155O31m958
8205A96335p292m348M571O187J0254J2072M607l219j1958j6000j5680j2566n147
8192A57816K481K382k004j836r22K242K474r3K279L163r67n517j763L370M732
8177A67837J285k10K82r92k715n93K975P221J0119Q350O449M216J738O016Q083
8162B20061J5163J9165K3774L2823N9802R8870J55269K04284J73790M6481q9330
$$ plain form
8264 169449 186846 203060 216128 219991 219751 216593 209801 206688 216875 226782 230927 226286 222102 219927
8250 219927 217265 221508 229849 234707 232777 225874 221041 217404 212916 206180 200853 191569 186771 184659
8236 184659 188237 196797 204322 208246 209965 210134 211166 214217 219952 222289 223016 219799 211957 205962 199541
8221 199541 196437 198934 202409 200259 195858 196288 196106 191138 191547 191066 190580 191615 197507 200662 201293 196335
8205 196335 189043 184695 189266 195453 205707 217779 222386 219167 207209 191209 175529 162963 157816
8192 157816 160297 162679 160675 158839 157917 160159 162633 162540 164819 167982 167015 161498 159735 163105 167837
8177 167837 169122 168912 169194 168202 165487 164894 167869 175090 185209 193559 200008 204224 205962 211978 220061
8162 220061 235224 254389 278163 310986 370788 469658 624927 829211 1003001 1049482 960152
8151I60152j61655j63488j32397r2069n9321m9330m0667k9822k0582j4386j0404
8140A86031q849m128l285Rm63k73J986L255p091n083l590k551J668K565L224P886
8124A71311P213J0179R475J0393J3163J0356R918P701O519P667J0333J9042L5902
8111C29172O0677J01749J71949K88037M21641M06216J47413j51699l25864l43799
8101A105492k67142j84101j23489q2359o5375n3197m3101l4052k5143j5862o374
8090B05297j430n133m439o533o868p717q621p067p799m791M2Q255M640K297J159
8075A61292J643L281J941L894O675L621M549M514N656M722P945J0317K3682M5712
8061B89444P0075J13342J73111J93601J12372k8318j33842j63104j43613j01016
$$ plain form
8151 960152 798497 635009 502612 410543 351222 301892 261225 231403 210821 196435 186031
8140 186031 177182 173054 169769 169778 169315 169042 171028 174283 167192 162109 158519 155968 157636 160201 163425 171311
8124 171311 178524 188703 198178 208571 221734 232090 242008 249709 256228 263895 274228 293270 329172
8111 329172 389849 491598 663547 951584 1373225 1779441 1926854 1775155 1449291 1105492
8101 1105492 838350 654249 530760 448401 383026 329829 286728 252676 227533 211671 205297
8090 205297 203867 198734 194295 187762 180894 173177 164556 157489 149690 144899 144941 153196 157836 160133 161292
8075 161292 162935 166216 168157 172051 178726 182347 186896 191410 197066 201788 209733 220050 243732 289444
8061 289444 359519 472861 645972 839573 951945 923627 789785 626681 483068 382052
8051C82052o0580m2406l1775k2496j8568j6646j4197j5153q725m286p345o932
8039A32943m972o414m436j567j636k685j085M039O225Q421R81n46m488q556n866
8024A10358l741k60Q23L937J299J427o4k542l655n504o627n426k795K065k333
8009H6962n051j244l271j897L130O152L044j457L866M521K52K893L808J406L86
7994A03500l238k562m235o51Q06L016K049p0n041P6K860N358p60o39j992l894
7978I4583j223l289m934j005k09K78K63N08k187j346j065q28j589K723K455K6
7962H3161j252k743l23K170m84L201J852m864j362M57j7N415K607j595k233j849
7946H2141r6j052r71J085k071j720J139p84L421J408K161L434J177k641k773k456
$$ plain form
8051 382052 321472 279066 247291 224795 206227 189581 175384 160231 151506 147220 139875 132943
8039 132943 127971 121557 117121 115554 113918 111233 110148 114187 120412 128833 129814 129268 124780 116224 110358
8024 110358 106617 106357 107180 111117 112416 113843 113779 111237 107582 102078 95451 90025 87230 89295 86962
8009 86962 81911 80667 77396 75499 78629 84781 87825 86368 90234 94755 95007 97900 101708 103114 103500
7994 103500 100262 97700 93465 92814 93620 96636 98685 98615 93574 93650 96510 101868 101108 100469 98477 94583
7978 94583 93360 90071 85137 84132 83923 84201 84464 84972 82785 81439 80374 79546 77957 80680 83135 83161
7962 83161 81909 79166 78843 81013 80529 83730 85582 80718 79356 79813 79796 85211 87818 86223 83990 82141
7946 82141 82045 80993 80022 81107 79036 77316 78455 77671 81092 82500 84661 88095 89272 86631 83858 81402
7930H1402k553P09K045k38M079K174j918k00j879K175P420O767q18L92o40L16
7914I9233l490J88K05K536L711N93j886k787j267k232l233L97L817N333J310l432
7898I8996l767k411K232L849j378J352M342j658j45k53K508L160M548Q113L943
7883A23431J900O34p31J818N94K521M008R338Q521K059L977o6n236j1366n828
7868A35574k242l885k763k235p000n842l138k079n567N28K048l09m649j440L831
7853A00832N001Q44k501q68j231K835L294P87j705K073J465L778J259j121J798
7838A16540J976m47M04P40K599O12Q85M701J526m892k977p54L91k470l854k485
7822A12495o561p317k102j463p32j044k022q25k905j436j345J52K382J695K178
$$ plain form
7930 81402 78849 79558 81603 81365 85444 87618 85700 85500 83621 85796 93216 99983 99165 99557 98917 99233
7914 99233 95743 95931 96136 98672 102383 102976 101090 98303 97036 94804 91571 91968 95785 101118 102428 98996
7898 98996 95229 92818 95050 98899 97521 98873 103215 101557 101412 101159 103667 106827 111375 119488 123431
7883 123431 125331 125965 125234 127052 127646 130167 134175 143513 152034 154093 158070 158004 152768 141402 135574
7868 135574 133332 129447 126684 124449 117449 111607 108469 106390 100823 101351 103399 103090 98441 97001 100832
7853 100832 105833 106677 104176 103308 102077 104912 108206 108993 107288 109361 110826 114604 115863 114742 116540
7838 116540 118516 118069 118473 119213 121812 122424 123309 128010 129536 124644 121667 120913 121304 118834 114980 112495
7822 112495 105934 98617 96515 95052 94320 93276 91254 90429 87524 86088 84743 84895 87277 88972 91150
7807I1150j272J071J798j112l793l241K580J119j593m99k339k514o40j525j437
7792G7753J901J004m214m405N61j902l249P78O77m28l047n33J104J721J086n707
7776F3100q42n02R4L496K123K978M396Q66j129n765o22j949J138k62J068J956
7760G0144N2m228m960K910K270n78K896J457o115n03j200l228M14J427l980p751
7744D9027j641J390J377M65k072k700J525M440L108L59K82J724J404L81K67l554
7728E5782q75Q6K744L394m757m537K89L30j626K073Q33j889M8j661J050J82K625
7711E4091J598J264l406j350l688j116k805j203k850m11M52M85Q27L22J979j832
7695D2357J42K974J241l576j406N552K752n32J733J457k538k575J255J584k885
$$ plain form
7807 91150 89878 90949 92747 91635 87842 84601 87181 88300 86707 86208 83869 81355 80715 79190 77753
7792 77753 79654 80658 76444 72039 72600 70698 67449 68227 68904 68476 65429 64896 66000 67721 68807 63100
7776 63100 62258 61756 61850 65346 67469 70447 74843 75709 74580 68815 68193 66244 67382 67120 68188 70144
7760 70144 70196 65968 61008 63918 66188 65610 68506 69963 63848 63345 62145 58917 59331 60758 56778 49027
7744 49027 47386 48776 50153 50618 48546 45846 47371 51811 54919 55278 55560 57284 58688 59069 59336 55782
7728 55782 54907 54993 57737 61131 56374 51837 52126 52456 50830 52903 53736 51847 51895 50234 51284 51466 54091
7711 54091 55689 56953 53547 52197 48509 47393 44588 43385 40535 40124 40576 41061 41888 42210 44189 42357
7695 42357 42499 45473 46714 43138 41732 47284 50036 49504 51237 52694 50156 47581 48836 50420 47535
7680D7535q34N58L802M301j442l169n94k759k419k849k477j771m15J572J911k60
7664D0690k009K326K959J128n39J377J159j857j063P30J395j683k225p71J537
7649D3154j234n855j138K838J429L44k095k874j308J538J934K634j904j535M006
7634C9934J420R17k564j533K379M729j806l134m17j846O52J871j53j006n139O86
7618C4990k37k861K090O342J15L024J119J915l05j530k628j51p38K083n56j676
7602D0996k690m66o62p86l1J96K053M67j024O41J714K678p60j467L028k192j889
7585C9806J650k399l590J184j47n34K009O787K37p655l632K841N98k105r66J532
7569C5616O47j533k54J761J522L860P09k027j237q09J569l479l098o33K377k205
$$ plain form
7680 47535 46701 47259 51061 55362 53920 50751 50157 47398 44979 42130 39653 37882 37467 39039 40950 40690
7664 40690 38681 41007 43966 45094 44555 45932 47091 45234 44171 44901 46296 44613 42388 41617 43154
7649 43154 41920 36065 34927 37765 39194 39538 37443 34569 33261 34799 36733 39367 37463 35928 39934
7634 39934 41354 42271 39707 38174 40553 45282 43476 40342 39925 38079 38731 40602 40449 39443 34304 34990
7618 34990 34753 31892 33982 40324 40439 43463 44582 46497 46192 44662 42034 41883 41145 43228 42672 40996
7602 40996 38306 37840 37178 36392 36361 36557 38610 39077 38053 38694 40408 43086 42326 40859 43887 41695 39806
7585 39806 41456 39057 35467 36651 36504 35970 37979 44766 45003 37348 33716 36557 37155 35050 34084 35616
7569 35616 36263 34730 34476 36237 37759 41619 42328 40301 39064 38255 39824 36345 33247 32614 34991 32786
7553C2786J0J608r26j86J137j449l99M082J041l082j707k439p29k042j47L109
7537C0667o58O31R19O95J697j116j914r06k057o2J550j22m392J567L516K295J546
7520C3856j024j709l28j096k02J187o4J952N109k9J674k139j691m75r85M82J58
7503C4676m24k644j729J54l949o97M764K774k348l600m455L238K028J831j677
7488B7942J67k225l117j899L466K748O44l56n62j056J087k027k287K808L134P59
7472B9226r22L23j943k240k961L697J564j04L5L175j460K304K203k533R71j365
7456B9970j042j397j722n37J343M42j661K352n03j749j02k408J057j105L156L655
7440B9749m55m698k036L51K450J934q34m56k307o79J283L788K245l382l476J25
$$ plain form
7553 32786 32796 34404 33478 33292 34429 32980 32581 36663 37704 34622 32915 30476 29747 27705 27558 30667
7537 30667 30009 30640 31559 32254 33951 32835 30921 30015 27958 27896 29446 29324 24932 26499 30015 32310 33856
7520 33856 32832 31123 30795 29699 29497 30684 30620 32572 37681 37652 39326 37187 35496 35021 34036 34518 34676
7503 34676 34252 31608 29879 30033 26084 25387 30151 32925 30577 26977 22522 25760 27788 29619 27942
7488 27942 28109 25884 22767 20868 24334 27082 27726 27370 26808 25752 26839 24812 22525 25333 28467 29226
7472 29226 28304 28627 26684 24444 21483 25180 26744 26640 26675 29850 28390 30694 32897 30364 31335 29970
7456 29970 28928 27531 25809 25272 26615 27057 25396 27748 27245 25496 25394 22986 24043 22938 26094 29749
7440 29749 29294 24596 22560 22911 25361 27295 26461 26005 23698 23019 24302 28090 30335 26953 23477 23602
7424B3602K291K524o71p33J828K695j536m064j442j324m050P98l67L16L032J564
7408B4463K854J269j641L034R28j978k411J139q93l223J238J79k573J725j29J493
7392B5474k097J358R61J344K426J87J428J429l303j582l7Q85l05J222k136l446
7376B3808L213J978p92j411K17M074J942n455k679o99m082j495N107J840N382
7361C0948k686m168l284j206M200J651K469K209k99Q67j875n505j080J373j319
7346B2295q9r23m05P7L660R61j38k852m559l542J01L56L040K829K560J470r41
7329B3900L400M77Q94r07j880k097l257J253L42l063J93M719J912j725P27O04
7313B5492n03j072N96j620j241J636j23j682K466J568k232j080j36M119j18m523
$$ plain form
7424 23602 25893 28417 27746 27013 28841 31536 30000 25936 24494 23170 19120 19918 19551 19867 22899 24463
7408 24463 27317 28586 26945 29979 30907 28929 26518 27657 26764 23541 24779 24958 22385 24110 23981 25474
7392 25474 23377 24735 25696 27040 29466 29653 31081 32510 29207 27625 27588 28473 28168 29390 27254 23808
7376 23808 27021 28999 28207 26796 27013 31087 33029 27574 24895 24196 20114 18619 23726 25566 30948
7361 30948 28262 24094 20810 19604 23804 25455 27924 30133 29834 30701 28826 23321 22241 23614 22295
7346 22295 22206 21283 20878 20955 24615 25576 25438 22586 18027 14485 14586 14942 17982 20811 23371 24841 23900
7329 23900 27300 27777 28671 27764 25884 23787 20530 21783 22125 19062 19255 23974 25886 24161 24888 25492
7313 25492 24989 23917 24513 22893 21652 23288 23165 21483 23949 25517 23285 22205 22069 26188 26070 21547
7297B1547n48K955L140j08p36K276J374j250l109l602j132Q92p79j021O21r99
7281A9521k76k743j264l62O45L516K857J722K957j075k677J59k247j130j361q61
7265A7381j161J6k469j078J006M59K830r46J064j56J70P80K158L815q43j961L617
7248B4682Q77J941L058k151k163j780Q45J05j079n224k39M657K250o8m609n79
7232B0523J629j813k366L771R11l17p81M51O82m54p29j249J058M23N59k870l590
7215A5838k48j482M222R42o91j417K175Q07o02K394k83k322L28R59p92O14M60
7198B0902K388m73k757k631k655J393J284o07J918O74J308o50n780N38K047M765
7182B1664K613K619j682m304k196q72m7j304J743P70k38j529N71OO62K225n29
$$ plain form
7297 21547 20999 23954 27094 26986 26250 28526 29900 28650 25541 21939 20807 21699 20920 19899 20520 19521
7281 19521 19245 16502 15238 14876 15521 19037 21894 23616 26573 25498 22821 22980 20733 19603 18242 17381
7265 17381 16220 16236 13767 12689 13695 14154 16984 16038 17102 16946 17116 17896 20054 23869 23026 21065 24682
7248 24682 25559 27500 30558 28407 26244 24464 25309 25414 24335 19111 18872 23529 25779 25711 21102 20523
7232 20523 22152 20339 17973 21744 22655 22338 21557 22008 22690 22236 21507 20258 21316 21739 22298 19428 15838
7215 15838 15590 14108 18330 19272 18581 17164 19339 20146 19544 21938 21655 19333 19661 20620 19828 20442 20902
7198 20902 23290 22817 20060 17429 14774 16167 17451 16844 18762 19436 20744 20094 14314 14852 16899 21664
7182 21664 24277 26896 25214 20910 18714 17842 17795 16491 18234 19004 18766 17237 17808 17814 18476 20701 20172
7165B0172j659M5m76j598O85m52k898J312M596J642j315k944J914j471o88J758
7149A8623j472L26J123m2n031R56j730J703M31Q00j06k65L28L364K26l823l96
7132A5015k981n55J850M260J892r64j171k015n202N02M038N029N323K611k370
7117B5262l714k340j213J645L49k664p75K395J384k028L44J076l096k94J128J249
7101A8708K54O99J673k130k246j509l38n93N237J041O64l603l527j053K022L548
7085A8847N59p80l589l224o96J095m54k683l602L144L807j377O00J387m94r52
7069A1588J333K020p64K367L968l371m053k914j373N32J22N731K443Q0k174J69
7053A5704m94l398k813L271pj173j609M203K339q49k289j73j008K364L553Q32
$$ plain form
7165 20172 18513 18558 18082 16484 17169 16717 13819 15131 19727 21369 20054 17110 19024 17553 16865 18623
7149 18623 17151 17477 18600 18558 13527 14483 12753 14456 14887 15687 15581 15316 15644 19008 19234 15411 15015
7132 15015 12034 11479 13329 17589 19481 18517 17346 15331 10129 10631 14669 19698 25021 27632 25262
7117 25262 21548 19208 17995 19640 19989 17325 16550 18945 20329 18301 18645 19721 16625 16331 17459 18708
7101 18708 18962 19661 21334 19204 16958 15449 15111 14518 19755 20796 21460 17857 14330 13277 15299 18847
7085 18847 19406 18626 15037 11813 11117 12212 11758 9075 5473 8617 12424 11047 11647 13034 12540 11588
7069 11588 12921 14941 14177 16544 20512 17141 13088 10174 8801 9333 9455 15186 17629 17709 15535 15704
7053 15704 15210 11812 8999 12270 12263 11090 9481 13684 16023 15174 12885 12712 11704 14068 17621 18453
7037A8453k013N7l87J393J943j354m092l081k08k38J879J494k610J399O738J385
7021B0758j331K042L06k292n169k414k427J847L171M404K721j428l920j139k260
7006A2869P33K34K52r23J044k744j629J247K730P50j333j90N33k204L41m55j439
6989I816R54m477J500L306J35p6j968J141L236J516m3K629J874J215R1n25k044
6972A8280j609P03j397K337M514K187k404J095j94M85j437j783k584l280j92L281
6956A8002N90l88J3k96q90j459J040j30k696j377J865J621m31M91j485j379l722
6939I369j895o56k04J806K049J28L194M102J416J219r75l402J398k242m055J30
6923A1382K308j372Q86L501M64k884l961l729J10K325P75J551Q57R84L819J571
$$ plain form
7037 18453 16440 16497 16110 17503 19446 18092 14000 10919 10711 10473 12352 13846 11236 12635 19373 20758
7021 20758 19427 21469 21775 19483 14314 11900 9473 11320 14491 18895 21616 20188 16268 15129 12869
7006 12869 13602 13836 14088 13165 14209 11465 9836 11083 13813 14563 13230 13040 13573 11369 11710 11255 9816
6989 9816 10770 6293 7793 11099 11234 11158 9190 10331 13567 15083 15040 17669 19543 20758 20849 20324 18280
6972 18280 16671 17374 15977 18314 22828 25015 22611 23706 23512 23997 22560 20777 18193 14913 14721 18002
6956 18002 18592 18204 18217 17921 17031 15572 16612 16482 13786 12409 14274 15895 15464 15955 14470 13091 9369
6939 9369 7474 6818 6614 8420 10469 10597 13791 17893 19309 20528 19553 16151 17549 15307 11252 11382
6923 11382 13690 12318 13204 16705 17169 14285 10324 6595 6705 9030 9805 11356 12213 13197 17016 18587
6907A8587m06q78J785K32N09m09j380K954R21j575o708m851J787J656j733J452
6891A1943J026j737j043K208l55j17K47P94M519Q56m82j564l350k622K670J553
6875A4546L973J399l827n062J234R13j607L111j846j511l250J94J836K083L55
6860A2541M198Q5l60o189j744M347K525k455l571q11J90L137k137K580K845l39
6844A4842p95j104J190j506K040j112R43l83k818j893J160J777J486r77j679j378
6828I793k125Q8O47J720J65k692r46J188l797K058K347j511P42j868J844J969
6812I622j81l413j197N5J359j229J356K046J00k26j066J371K971K562K141j379
6796A4892n117J915M473L034l273m241l762L77j15J901J260K01q44k438j129K756
$$ plain form
6907 18587 18181 17303 19088 19320 19829 19420 18040 20994 21915 20340 13632 8781 10568 12224 10491 11943
6891 11943 12969 11232 10189 12397 12042 11925 12172 12966 17485 18341 17859 16295 12945 10323 12993 14546
6875 14546 18519 19918 16091 11029 12263 13176 11569 14680 12834 11323 8073 8267 10103 12186 12541
6860 12541 16739 16824 16464 10275 8531 12878 15403 12948 9377 8566 8756 11893 9756 12336 15181 14842
6844 14842 14047 12943 14133 12627 14667 13555 14498 14115 11297 9404 10564 12341 13827 12850 11171 9793
6828 9793 7668 7756 8403 10123 10288 7596 6650 7838 4041 6099 8446 6935 7677 5809 7653 9622
6812 9622 9441 6028 4831 4886 6245 5016 6372 8418 8518 8292 7226 8597 11568 14130 16271 14892
6796 14892 9775 11690 16163 19197 15924 11683 7921 8298 8183 10084 11344 11545 10701 8263 7134 9890
6780I890K532r54J001K599N0J167k36l76j628r43j81O59r24m64o30j889J258Q47
6762A1778o84L48j493j337p26J524L335l97j819J513k091j486K759N284o58p02
6746A5148P53L434j960r347k620L841L688j036j646j502k819o09K570K805j771
6731H929j263Q81L80O88J247k32K169K063p81n857L770k020J23N40Q0J423K146
6714A4286n42l89j649n131j462K675K021M30q95M28L417M030j40j020o14j044
6698A4401m529l287k37R06J082L985k589n483j599K232K546J491J85J109K604
6683A2817M688J291j548j396K218J638k851l806l636k644J0L299L556J70l252
6668A0554j377k34J693j395k546r09M3O274jj668k667J226l061l703K238L999
$$ plain form
6780 9890 12422 11468 12469 15068 15118 16285 16049 15673 14045 13102 12921 13580 12656 12192 11562 9673 10931 11778
6762 11778 11094 11442 9949 8612 7886 9410 12745 12348 10529 12042 9951 8465 11224 16508 15850 15148
6746 15148 15901 19335 17375 8028 5408 9249 12937 11901 10255 8753 5934 5325 7895 10700 8929
6731 8929 7666 8547 8927 9615 10862 10630 12799 14862 14081 8224 11994 9974 10097 10637 10717 12140 14286
6714 14286 13744 13355 11706 6575 5113 7788 9809 10239 9344 9772 13189 17219 17079 16059 15445 14401
6698 14401 9872 6585 6348 7254 8336 12321 9732 4249 2650 4882 7428 8919 9104 10213 12817
6683 12817 17505 18796 17248 15852 18070 19708 16857 13051 9415 6771 6781 10080 13636 13806 10554
6668 10554 9177 8943 10636 9241 6695 5786 5829 12103 12102 10434 7767 8993 5932 2229 4467 8466
6652H466J993K636N329J752k476O05p596p268K772J585l91j255Q505L714k482
6637A5889l37L715J108l280r116n705N51K362k88K288J887J728R09m53k183l616
6621E459K347R58M028j841P46J238J488p05l467l615n775P13N590M098k144k284
6605F834o93J384q52j703j344K629L634K608M140K917M430K901l572o584l453
6590A3276m333p464o64N62L159K849J844K026l08j881r41j133K037J145L539L1
6574A3744j973J449J414o42k298j870k17j253k2j069j920Q9N706J158l857L9l264
6557E214k392l834n544m597J532Q043J2769J0709O789M678K360j046o394m557
6543B3730r683r668n807k804m11M713N055J569J752n05l0p15j207L77L98K204
$$ plain form
6652 8466 10459 13095 18424 20176 17700 18305 10709 3441 6213 7798 7407 6152 14657 18371 15889
6637 15889 15552 19267 20375 17095 7979 2274 2825 5187 4899 7187 9074 10802 11711 11258 9075 5459
6621 5459 7806 8764 12792 10951 11697 12935 14423 13718 10251 6636 861 1574 7164 11262 9118 6834
6605 6834 6141 7525 6673 4970 3626 6255 9889 12497 16637 19554 23984 26885 23313 16729 13276
6590 13276 8943 1479 815 1377 4536 7385 9229 11255 10947 9066 8125 6992 9029 10174 13713 13744
6574 13744 11771 13220 14634 13992 11694 9824 9607 8354 8332 7263 5343 5432 11138 12296 8439 8478 5214
6557 5214 2822 -1012 -6556 -11153 -9621 -1578 11191 21900 28689 33367 35727 34681 28287 23730
6543 23730 14047 4379 -1428 -4232 -4643 70 5125 6694 8446 7941 7911 7196 5989 6366 6764 8968
6527H968n64j168j126l072J481K882P19j082J709Q64K060j291k454o65k57Q79
6511G883q97l206j983J143K904k490P01M709M259J783k071p18M474R5l346j324
6495A1916m299n025k278j735k355j364L538N630J775j989M39K084k76Q45l00O20
6479G226M07M693L478m463k785K288o43j394q38k552K740R99L65k300n877j725
6463c81j300K548O892K641K791l96j161l00k945k137j473r36l306l071j72M638
6447A932K821M299M493m47o27k560k340k784k742k766N37M169Q06j074K396O09
6431F722j28K67R99J022l260K102r1k790j301k113k73J760P59P50J430L845o06
6414I094o00j355J501J50m64o6k868l520k323L583N283J988j993j295l078o5K114
$$ plain form
6527 8968 8404 7236 6110 3038 4519 7401 8120 7038 8747 9611 11671 10380 7926 7261 7004 7883
6511 7883 6986 3780 1797 2940 5844 3354 4055 8764 13023 14806 12735 12017 16491 16586 13240 11916
6495 11916 7617 2592 314 -1421 -3776 -5140 -1602 4028 5803 3814 4253 6337 6061 6906 6606 7226
6479 7226 7633 12326 15804 11341 8556 10844 10201 8807 7969 5417 8157 9156 9521 7221 1344 -381
6463 -381 -1681 867 7759 10400 13191 12795 11634 11334 8389 6252 4779 3843 537 -2534 -2706 1932
6447 1932 4753 9052 13545 13098 12471 9911 7571 4787 2045 -721 -184 3985 4791 3717 6113 6722
6431 6722 6594 6861 7860 8882 5622 7724 7633 4843 3542 1429 1156 2916 3675 4425 5855 9700 9094
6414 9094 8494 7139 8640 8790 8326 8260 5392 1872 -451 3132 8415 10403 8410 7115 4037 3972 6086
6397F086j591J405j54O33j422L2K106J759J5N54o80k473k321K028M821N45l910
6380G433k212l068K642J434k464J944J142k190p61l93J408K234O86J738Q62j984
6364H451J314l248j927K34R90N49l161j706P76L756J984M193j068j982j790k00
6348G165r32j254L53Q21k839L4M205M37j853J881m07k668k768j90j075o47L575
6331C838J596j337J6q41O94M98K528K833q59m07j14K34r7k986l004l68K033J425
6313E682K021K221J686J220J55j138j443j283L368m95K12k532l560k080j697m48
6297A889K637ol325N11O26J275J387K884m99k876j69K186k446L32J351N32L99
6280F688j741j765R67M237J96m470m563K465M659k008J472m75M08K559M42O76
$$ plain form
6397 6086 4495 5900 5746 6379 4957 4989 7095 8854 8869 9423 8743 6270 3949 5977 10798 11343 7433
6380 7433 5221 2153 4795 6229 3765 5709 6851 4661 3900 3507 4915 7149 7835 9573 10435 8451
6364 8451 9765 6517 4590 4824 5814 6363 3202 1496 2272 6028 8012 12205 11137 9155 7365 7165
6348 7165 6233 4979 5332 6153 3314 3348 7553 7990 6137 8018 7611 4943 2175 1985 910 263 3838
6331 3838 5434 4097 4113 3272 3966 4464 6992 9825 8966 8559 8445 8679 8582 5596 2592 2224 4257 5682
6313 5682 7703 9924 11610 12830 12985 11847 10404 9121 12489 11994 12206 9674 6114 4034 2337 1889
6297 1889 4526 4520 1195 1706 2332 3607 4994 7878 7379 4503 4334 6520 4074 4406 5757 6289 6688
6280 6688 4947 3182 4149 8386 8582 4112 -451 2014 6673 4665 6137 5662 6070 8629 9071 9747
6264I747k733k61Q75K622L293Q43n659l955q34l79k412j662K379K643J527l827
6248B207p27j179k289k124L709K706J466Q14m87J73K06J528K2L93k732J000l70
6231D316m66K186k011j739L317L861K34j025j422J369J415j744k000n221j654
6216e84K60K00k146n18K162k24P96n04N038J508k553K4j285R08k36j719r62k6
6198A39k719J908j668o1l61L16K431M89L021l462Q1p22k943L997N315J427j54
6181G034O04J212P51j867m192J507j697j0L180J04p69K28R50L67J746k695m310
6164B143l895l925K69M898J317N700O453N126K283k449o048p629n382L23k024
6149b840j070M077O339p43m389k374K373L424L496n50k775k05j132j953j278J064
$$ plain form
6264 9747 7014 6753 7628 10250 13543 14386 8727 4772 3938 3559 1147 -515 1864 4507 6034 2207
6248 2207 1480 301 -1988 -4112 -403 2303 3769 4583 4096 4269 4475 6003 6025 6418 3686 4686 4316
6231 4316 3850 6036 4025 2286 5603 9464 9698 8673 7251 8620 10035 8291 6291 1070 -584
6216 -584 -324 -124 -2270 -2788 -626 -850 -54 -558 4480 5988 3435 3459 2174 3082 2846 1127 165 139
6198 139 -2580 -672 -2340 -2401 -2762 -2446 -15 474 3495 33 114 -608 -3551 446 5761 7188 7034
6181 7034 7638 8850 9601 7734 3542 5049 3352 3342 6522 6626 5857 6085 7035 7402 9148 6453 2143
6164 2143 -1752 -5677 -5408 -510 807 6507 12960 18086 20369 17920 11872 4243 -1139 -816 -2840
6149 -2840 -3910 167 6506 5763 1374 -1000 1373 4797 8293 7743 4968 4763 3631 1678 400 1464
6133A464N03M84n61J529N11p48R88P12j060j928L247K633O06m045j777k22k0k318
6115bP87J123o45q20K895O619K031J899k45l583n097n676k217J389J918k1J049
6098A404j662K101P69j610k13R92L667J487K136j750k033L108L23k786j245L71
6082E059j810L311M537r84m395m914n50L778K498J243N4j96k937j653N94j429
6066B206K62j851j774J591L068n44K61M895J738k313k517k043n177J249K326J183
6050B560o93R18o30L03L787P86r63j588j999j111k0O68L02K772J687j066k190
6033C523j908L881k503j902J677J067k575k493J931J200k260L666J166k06m68
6018C796Q2K351n95k360j620k595m81n23Q3o69L545M441p09m48L435m300l579
$$ plain form
6133 1464 1967 2451 1890 3419 3930 3182 4170 4882 3822 1894 5141 7774 8380 4335 2558 2336 2316 -2
6115 -2 785 1908 1263 443 3338 9957 11988 13887 13642 10059 4962 -714 -2931 -1542 376 355 1404
6098 1404 -258 1843 2612 1002 789 1781 5448 6935 9071 7321 5288 8396 8719 5933 4688 5059
6082 5059 3249 6560 11097 10113 5718 804 254 4032 6530 7773 7827 7631 4694 3041 3635 2206
6066 2206 2468 617 -1157 434 3502 2958 3219 8114 9852 7539 5022 2979 -2198 -949 1377 2560
6050 2560 1867 2785 2155 2458 6245 7031 6068 4480 2481 1370 1350 2018 2320 5092 6779 5713 3523
6033 3523 1615 5496 2993 1091 2768 3835 1260 -1233 698 1898 -362 3304 4470 4264 3796
6018 3796 3878 6229 5634 3274 1654 -941 -1422 -1945 -1862 -2531 1014 5455 4746 4298 7733 3433 -146
6001a46j62R25k282q32J57L305J456K82r69Q9m36J75K30j86K379j777j874J003
5983A337Q82j722j259l63L38J106P1j493q33K092K883M20K857p87r10k064J143
5966C698j67k955j2J121O03j1K090o23J344J339p9l368j119j018p30k167r43Q40
5948b157K788o98j266j580L491N078pj162J204k29k25j913m510l91L719J103R73
5931D218J792l385j761J239O78p89K162J143P65k622l686q50Q04K063L854k365
5915C260j284l320k818m598m03J249k25N92K567K874J44N48J73n449o34p73K409
5898e688q04L792L176J531j120q42J263M063k683l044n548N25L466K059L078N56
5882C780k929n95J733K474K194n0m023j013j8r2J014k395j811p49m93L63M443
$$ plain form
6001 -146 -308 617 -1665 -2497 -2340 965 2421 2703 1734 1823 1387 1562 1792 1606 3985 2208 334 1337
5983 1337 2219 497 -762 -1125 -787 319 390 -1103 -1936 156 3039 3459 6316 5529 4619 2555 3698
5966 3698 3531 576 564 1685 2288 2277 4367 3744 5088 6427 6348 2980 1861 843 113 -2054 -2997 -2157
5948 -2157 631 -67 -1333 -2913 578 5656 5649 4487 5691 5462 5237 3324 -1186 -1577 2142 3245 4218
5931 4218 6010 2625 864 2103 2781 1992 4154 5297 6062 3440 -246 -1096 -292 1771 5625 3260
5915 3260 1976 -1344 -4162 -8760 -9163 -7914 -8139 -7547 -4980 -2106 -1962 -1414 -1241 -6690 -7324 -8097 -5688
5898 -5688 -6492 -2700 476 2007 887 45 1308 5371 2688 -356 -5904 -5379 -1913 146 3224 3780
5882 3780 851 256 1989 4463 6657 6607 2584 1571 1553 1461 2475 80 -1731 -2480 -2973 -2610 1833
5865A833R73J741j190n23j201J170l235j041J666K121l096j700j286J43j220m41
5849e286K730K999P09l055j982n33L086L116J4J172o27j607k28q98O28J817J475
5832C530k222j076l798J310L933q42J387j594j050J123P44l219j776J191N37M36
5816a386K35J639p16J242o61rj099j608k872k5L997K261L67k771q80q23p18O73
5798c154K590L975j064Q55m25K739k72l096l179L67M69J538K56j032L63L771J533
5781F234j684j642N63n31m68k664j850J372J207m49k085J361j026l939mk596K63
5764g938M065m64K407j23K077L409K956j91m301K37J804m17J984n5j020M26n8
5747D798m944Ok472K318K778m342p97j407l61J325K031q0j12M77K951q76k973
$$ plain form
5865 1833 2806 4547 3357 2834 1633 2803 -432 -1473 193 2314 -782 -2482 -3768 -3625 -4845 -5286
5849 -5286 -2556 443 1152 -1903 -3885 -4418 -1332 1784 1798 2970 2343 736 508 -390 238 2055 3530
5832 3530 1308 232 -3566 -2256 1677 835 2222 628 -422 701 1445 -1774 -3550 -2359 -1822 -1386
5816 -1386 -1151 488 -228 1014 353 344 -755 -2363 -5235 -5260 -1263 998 1365 -1406 -2286 -3109 -3827 -3154
5798 -3154 -564 3411 2347 3202 2777 5516 5244 2148 -1031 -664 -195 1343 1599 567 930 4701 6234
5781 6234 4550 2908 3471 2940 2472 -192 -2042 -670 537 88 -1997 -636 -1662 -5601 -5605 -8201 -7938
5764 -7938 -3873 -4337 -1930 -2053 24 3433 6389 6198 1897 2134 3938 3521 5505 5450 4430 4856 4798
5747 4798 -146 -140 -2612 -294 2484 -1858 -2655 -4062 -4423 -3098 -1067 -1147 -1259 -782 2169 1293 -1680
5730a680K81L518L805J994l297m73K125m530k204j339l80j577J900j645J649K151
5714B98N33J860n52J908K734K665j5M63m490k487j239j046k668L254K321J732
5698E271J034K05m181n505k34K148R31o31J511J182J058N02m78k64J385q09j20
5681C005l413j852M503o29J474l852l629r55J239O27M148J581J293M18j479P10
5665C189J238J199j794j757q34l07j103m7m25Q85L430K110j487k69o23m354l293
5648d242J083J67L57J929j111J524K993N03J349L05k647J792j690j049k584k2
5632a343J35n46N28p56k746j389j770N091M968j29l624J052m79J26J298k2N93
5615I87K333j00k255O52K639J182K065j543J203J114m3m844p437J584K102K258
$$ plain form
5730 -1680 -1399 2119 5924 7918 4621 4148 6273 1743 -461 -1800 -2180 -3757 -1857 -3502 -1853 298
5714 298 831 2691 2139 4047 6781 9446 9431 9894 5404 2917 1678 632 -2036 1218 3539 5271
5698 5271 6305 6510 2329 -3176 -3410 -1262 -331 -962 549 1731 2789 3291 2813 2549 3934 3125 3005
5681 3005 -408 -2260 2243 1614 3088 -764 -4393 -5348 -4109 -3482 666 2247 3540 3958 2479 3189
5665 3189 4427 5626 3832 2075 1241 934 -169 -216 -641 244 3674 5784 4297 4028 3405 -949 -4242
5648 -4242 -3159 -2992 -2635 -706 -1817 -293 2700 3203 4552 4857 2210 4002 2312 1263 -1321 -1343
5632 -1343 -1208 -1754 -1226 -1982 -4728 -6117 -7887 -2796 2172 2043 -1581 -529 -1008 -882 416 394 987
5615 987 3320 3220 965 1617 4256 5438 7503 5960 7163 8277 8234 3390 -4047 -2463 -361 1897
5599A897R65j356k613p20J813R13k258p33M98J255k428l176K67j385K718L707
5583f36l75n568j159M899j05j085K766K172j12l099L830J028L90J600j233k968
5567C45j404J419q35N46k30J597m005n95p19J514K767L6N41k090J242N242M27
5550E798l442j47O44J352o31j013O0O92j018k171j917l078j709k650L70K700L071
5533c089J210k453K23Q30Q5P13K054m55j304k014k086m96Q76J986k133n94J475
5516e172K464M06j215o52L300k574R27L137l047j67K166j51j004j758J266L795
5500A721K672J777K38j041j101M68k718k088m59j366l23L434j126j424J921j267
5484f82K526L247k765k802M70j503K390L692k375n154J146Q66j119M74j522K672
$$ plain form
5599 1897 2862 1506 -1107 -1827 -14 899 -1359 -2092 -1594 -339 -2767 -5943 -5676 -7061 -4343 -636
5583 -636 -1011 -6579 -7738 -2839 -2944 -4029 -1263 909 797 -2302 1528 2556 2946 4546 3313 345
5567 345 -1059 360 -475 71 -159 1438 -2567 -3162 -3881 -2367 400 436 977 -1113 129 5371 5798
5550 5798 2356 2209 2853 4205 3574 2561 2621 3313 2295 124 -1793 -4871 -6580 -9230 -8860 -6160 -3089
5533 -3089 -1879 -4332 -4109 -3279 -3194 -2481 -427 -882 -2186 -4200 -6286 -6782 -5906 -3920 -6053 -6647 -5172
5516 -5172 -2708 -2302 -3517 -4169 -869 -3443 -2516 621 -2426 -2593 -427 -578 -1582 -3340 -2074 1721
5500 1721 4393 6170 6408 5367 4266 4734 2016 -72 -531 -1897 -2220 1214 88 -1336 585 -682
5484 -682 1844 5091 2326 -476 -6 -1509 881 4573 2198 -2956 -1810 -944 -2063 -1589 -3111 -439
5468d39J853l307l358j340k533N93K447n63j379J940j017P90O80j990o939M436
5452a0126N185J508M04k85J581N71J752N84R76K80l500q80o69p98K446L144l40
5435A833k055k033n259M368j090m02O38L745j64j86n30j534q81k30m831J74O335
5418b102K996l020k187j700k573L83K230M499p35j078M78r38k208J280j94j930
5402f799j488L170M095J988j801J816J302j309J116j358k367j3q51l678Q58l1
5386e350Q12Q10l16l97j341N26K001r03J801L585l420m249m37J618L869J918K32
5369G59j692l666J910K472J52K127J018j151J946R3J363J513j408l230k225R08
5353H89J435k97k62l430J346J75l41k540Q66K891N94l16k521k397n65k425R77
$$ plain form
5468 -439 1414 -1893 -5251 -6591 -9124 -8531 -6084 -6647 -8026 -6086 -7103 -6313 -5633 -7623 -14562 -10126
5452 -10126 -4941 -3433 -3029 -3314 -1733 -1162 590 1174 2150 2430 -1070 -1950 -2619 -3417 -971 2173 1833
5435 1833 -222 -2255 -7514 -3146 -4236 -4638 -4000 -255 -419 -605 -1135 -2669 -3550 -3780 -8611 -8437 -2102
5418 -2102 894 -2126 -4313 -6013 -8586 -8203 -5973 -1474 -2209 -3287 -2809 -3747 -5955 -4675 -4869 -6799
5402 -6799 -8287 -5117 -1022 966 -835 981 2283 974 2090 732 -1635 -1648 -2499 -6177 -5319 -5350
5386 -5350 -4538 -3728 -4044 -4441 -5782 -5256 -3255 -4158 -2357 1228 -2192 -6441 -6878 -5260 -1391 527 759
5369 759 -933 -4599 -2689 -217 -65 2062 3080 1929 3875 3968 5331 6844 5436 2206 -19 889
5353 889 2324 2027 1765 -1665 -319 -144 -485 -3025 -2159 732 1326 1010 -1511 -3908 -4473 -6898 -5921
5336e921L48M39l10J184Q83p11K232M88l208m695o047L441N566J600j600K670
5320c641L966J552o6J232j07k763j860r92r5M462K06m12m972j086J799J058j473
5303c192k620K099J211P150R63j540K145m90j925j020j996k426J056r48o11P00
5287a444J752k067J016l60J845R88j385o18n77j300k972j580K05J432l870k009
5271a0944K261L541J870J170L047K04j927l207J192M431l86l433j133M61l432
5256f285j919K025L468n57N75K320K297j887j856l171j562L047K893L19M91Lj143
5239i42j737J413J020j306N94j671J20L28J264j122k387j796J665P27p27L58N11
5222c688Q65l181j198P52j587J55K848J609J689L737o2M19j548j618K011J547
$$ plain form
5336 -5921 -5573 -5134 -5444 -4260 -3377 -4088 -1856 -1368 -4576 -9271 -15318 -11877 -6311 -4711 -6311 -3641
5320 -3641 325 1877 1811 3043 2936 173 -1687 -2679 -2774 1688 1894 1482 -3490 -4576 -2777 -1719 -3192
5303 -3192 -5812 -3713 -2502 4648 5611 4071 6216 5726 3801 2781 785 -1641 -585 -1533 -2144 -1444
5287 -1444 308 -1759 -743 -1103 742 1730 345 -273 -850 -2150 -5122 -6702 -6497 -5065 -8935 -10944
5271 -10944 -8683 -5142 -3272 -2102 945 1149 -778 -3985 -2793 1638 1252 -2181 -3314 -2853 -6285
5256 -6285 -8204 -6179 -2711 -3268 -2693 -373 1924 37 -1819 -4990 -6552 -3505 -612 -293 198 201 -942
5239 -942 -2679 -1266 -246 -1552 -958 -2629 -2509 -2181 -917 -2039 -4426 -6222 -4557 -3830 -4557 -4199 -3688
5222 -3688 -2823 -6004 -7202 -6450 -8037 -7882 -5034 -3425 -1736 2001 1939 2358 810 -808 1203 2750
5206B750J227j052k07M08O51J272N09j519j298j794k887N63l95j610l251j568
5190h201L798L668J416K048l614J993j181o16j622n72K56O61l087m320J099K978
5174e296k504K182K678k262k387j100J502M691r22m679N91L045J335k515o42K965
5158c318J749j615l035j215K169n06J351o1L32P00M82j104j296K226r16L444K056
5141A443l953m384J803L891r02n473K477L562K082k63j288k718J360j70k15K52
5125b496j302P36J311j278o67J39j442r4j07k095J821j427l15R61K692O37r7M501
5107A478n76m60J566p74k825p52K69o80O24Q98r95O5K355J808k134J074j296n179
5089e534j805K481M285j918m8J05n49P04M44n6l863j171J531L199M168j595j952
$$ plain form
5206 2750 3977 2925 2718 3126 3777 5049 5558 4039 2741 947 -1940 -1377 -1772 -3382 -6633 -8201
5190 -8201 -4403 -735 681 2729 -885 1108 -73 -689 -2311 -2883 -2627 -1966 -5053 -9373 -8274 -5296
5174 -5296 -7800 -5618 -2940 -5202 -7589 -8689 -7187 -2496 -3418 -8097 -7506 -4461 -3126 -5641 -6283 -3318
5158 -3318 -1569 -3184 -6219 -7434 -5265 -5771 -4420 -4481 -4149 -3449 -2967 -4071 -5367 -3141 -4057 -613 1443
5141 1443 -2510 -6894 -5091 -1200 -2102 -7575 -5098 -1536 546 283 -1005 -3723 -2363 -2533 -2748 -2496
5125 -2496 -3798 -3062 -1751 -3029 -3696 -3557 -4999 -5093 -5200 -7295 -5474 -6901 -7216 -6255 -3563 -2926 -3023 1478
5107 1478 902 442 2008 1234 -1591 -2343 -2074 -2754 -2130 -1232 -2227 -2162 193 2001 -133 941 -355 -5534
5089 -5534 -7339 -4858 -573 -2491 -2539 -2434 -2983 -2279 -1835 -1891 -5754 -6925 -5394 -2195 1973 378 -1574
5072a574q20K101j082J539M02k050j246j68ML37m709k559M377L361j658m081J424
5055f402L081J373jK58M2l36j055j758J331J32K678m96k180k062K289K93j406
5038d219J159j605k594l079N93P044J21j491J223J849J077L440J92k106m88L52
5022A468J454n18J402l568j396n21J746K436k694j815j531q83J004K485N214j571
5006B712l162k783J870K111L107j082k382l526l387K153R82M88K576p99q74L6
4990a960j097l870j054K165K831k652l187M149L199K447k793M36M487K080j219
4975C962n433J405K508j314Q92l290k375k531J424j6M97K03K6M089J362k528J149
4958C0K68p36l658q54K174J825J160J710n15j868r79k449n59n12r06L016n33k804
$$ plain form
5072 -1574 -2394 -293 -1375 164 566 -1484 -2730 -2898 -2894 -2557 -7266 -9825 -5448 -2087 -3745 -7826 -6402
5055 -6402 -3321 -1948 -1949 -1691 -1649 -1985 -3040 -4798 -3467 -3335 -657 -1153 -3333 -5395 -3106 -2813 -4219
5038 -4219 -3060 -4665 -7259 -10338 -9745 -2701 -2580 -4071 -2848 -999 78 3518 3710 1604 1116 1468
5022 1468 2922 2404 3806 238 -1158 -1679 67 2503 -191 -2006 -3537 -4420 -3416 -931 4283 2712
5006 2712 -450 -3233 -1363 748 3855 2773 391 -3135 -6522 -4369 -3387 -2899 -323 -1122 -1996 -1960
4990 -1960 -3057 -6927 -7981 -5816 -2985 -5637 -8824 -4675 -1476 971 -1822 -1386 3101 5181 3962
4975 3962 -1471 -66 2442 1128 2020 -1270 -3645 -6176 -4752 -4768 -4271 -4068 -4042 47 1409 -1119 30
4958 30 298 -438 -4096 -4950 -2776 -951 209 1919 1404 -464 -1443 -3892 -4451 -4963 -5869 -2853 -3386 -6190
4940f190L792J746p2m494j35K165k462J876L071M099l76r88j635k537j042j73
4924c355K47k541r12l451K588N283J194j14k466k527k600J493k71J626K982Q53
4908a971J408L966J74L23j436Q89o2k911j795l150L136K923k502J087j487L296
4892A888J574k517n71n08k053p97j083J287k86K55p35k352J976K0n80l94l02K712
4874b466J874J935J643k151k893P90J334J228j896m3M94m54K30k559K30J946m767
4857e525m774M216K866J72P85K701K736k72l330q32j575P25L379K270p45o52M01
4840B546q18r00m56K55M58k319j726J487o6J258L175N21l87m852j568n57J500
4823b449j903k98o01j136n67K182L652j50j154n54K557J743J950j970j495J251
$$ plain form
4940 -6190 -2398 -652 -724 -5218 -5353 -3188 -5650 -3774 -703 3396 3020 2032 397 -2140 -3182 -3355
4924 -3355 -3108 -5649 -6561 -10012 -7424 -2141 -947 -1061 -3527 -6054 -8654 -7161 -7432 -5806 -2824 -1971
4908 -1971 -563 3403 3577 3900 2464 3353 3291 380 -1415 -4565 -1429 1494 -1008 79 -1408 1888
4892 1888 3462 945 374 -134 -2187 -2984 -4067 -2780 -3066 -2811 -3546 -5898 -3922 -3902 -4482 -4876 -5178 -2466
4874 -2466 -592 1343 2986 835 -2058 -1268 66 1294 -602 -645 -151 -605 -375 -2934 -2704 -758 -5525
4857 -5525 -10299 -6083 -3217 -3045 -2260 441 3177 2905 -425 -1257 -2832 -2107 1272 3542 2797 2145 2546
4840 2546 1728 828 372 627 1085 -1234 -2960 -1473 -1539 -281 2894 3415 3028 -1824 -3392 -3949 -2449
4823 -2449 -4352 -4650 -5251 -6387 -6954 -4772 -1120 -1270 -2424 -2978 -421 1322 3272 1302 -193 1058
4807A058j297j434p23R51j737j871J81O66L041J81j178K18J955K562l456q35q76
4790b594k457Q96R58Q25J969j514l714M27N31m88K177j072k922j243j514J792
4774g943N259J270n16k587q78j952k936R26l88K049p5L121K339j984k294j380
4758g969Q74J586P18j325l96k998r88K057M305n88j535J981K14K66O26j14N55
4741b731K900j166n87j470J044q42j466K27l195m68M204J964l48J759j550J048
4725f77k733q90K389R26J46k697J907K053j337l194k395J249K970q12L14R93M008
4708B220k69J21J504k742n021p49L900j621k213k020K778K947j203k108j144O91
4692d929o50O58M954J286o38k43j767K147P5k821l712J658L640q5k025k108l971
$$ plain form
4807 1058 -239 -1673 -2396 -1445 -3182 -5053 -4872 -4206 -1165 -984 -2162 -1944 11 2573 -883 -1718 -2594
4790 -2594 -5051 -4155 -3197 -2372 -403 -1917 -5631 -5204 -4673 -5161 -2984 -4056 -6978 -8221 -9735 -7943
4774 -7943 -2684 -1414 -1930 -4517 -5395 -7347 -10283 -9357 -9745 -7696 -7771 -4650 -2311 -4295 -6589 -7969
4758 -7969 -7095 -5509 -4791 -6116 -6512 -9510 -10498 -8441 -4136 -4724 -6259 -4278 -4064 -3798 -3172 -3286 -2731
4741 -2731 169 -997 -1584 -3054 -2010 -2852 -4318 -4091 -7286 -7754 -3550 -1586 -1934 -175 -1725 -677
4725 -677 -3410 -4300 -1911 -985 -839 -3536 -1629 424 -913 -4107 -6502 -5253 -2283 -3095 -2781 -1788 2220
4708 2220 1951 2072 3576 834 -4187 -4936 -1036 -2657 -4870 -6890 -4112 -1165 -2368 -4476 -5620 -4929
4692 -4929 -5579 -4921 33 1319 681 438 -1329 818 893 -1928 -5640 -3982 -342 -427 -2452 -4560 -8531
4675h531j053N09K361K638K333K359k600r6j136j67J077k752k713M81R09K539
4659c842j430K986O499J947k791m867l681j413r3L399P25j706j152M313O002k413
4643B483l200l01o31J417R83l65p33j694K77j422l151j507j932j486M152L201
4627c909K697O1k81p26j023J676j412j230L89O59J346J424j758l146L81k912L87
4610g377O33K16P36K276J505L55k730o01K166p07o5P8K139o93k266L039K506r91
4592B19r83k971j281J317l231k635O43j98k597j860L571M529L172K88L77Q90J389
4575F39j793k037K456P2N09j989J003j345J358J819J525J078l625j776K119lJ6
4558B6l608l087k498k7K482K187o04M06j589l093K123K404q22N42p26n56l434
$$ plain form
4675 -8531 -9584 -9075 -6714 -4076 -1743 616 -1984 -2080 -3216 -3383 -2306 -5058 -7771 -7290 -6381 -3842
4659 -3842 -5272 -2286 4213 6160 3369 -1498 -5179 -6592 -6685 -3286 -2561 -4267 -5419 -1106 4896 2483
4643 2483 -717 -1018 -1649 -232 751 386 -347 -2041 -1764 -3186 -6337 -7844 -9776 -11262 -7110 -3909
4627 -3909 -1212 -1151 -1432 -2158 -3181 -1505 -2917 -4147 -3758 -3099 -1753 -329 -2087 -5233 -4852 -7764 -7377
4610 -7377 -6744 -6528 -5792 -3516 -2011 -1656 -4386 -4987 -2821 -3528 -3593 -3515 -1376 -2069 -4335 -1296 1210 219
4592 219 -764 -3735 -5016 -3699 -6930 -9565 -8922 -9120 -11717 -13577 -10006 -5477 -2305 -2017 -1640 -750 639
4575 639 -1154 -3191 -735 -663 -154 -2143 -1140 -2485 -1127 692 2217 3295 -330 -2106 13 10 26
4558 26 -3582 -6669 -9167 -9194 -6712 -4525 -5129 -4723 -6312 -9405 -7282 -4878 -5700 -5158 -5884 -6440 -9874
4541i874K873L706m33J451p00K31J64K416m74l966j735j833K655L3K001J48j029
4524d366K983p52l46j965l427k548M293L28j153M52k6K229R46L7K661J783k225
4507a096k822P81P36O57k242O7P83K896r70r48P09Q3m290j513m22k90L790M244
4489A53L25o68J50k60P92j24j833k381k546n36R45K010J030j539j894J968M026
4472c82J934k683l230j428K709l841j000JJ628r6j993J50M427L356N10j192r50
4455b080j826L28K295Q06K198l237l123k373J011M037j049P00L144K313l94q52
4439A898l23N98K599j228l822k836Q1J44k73j834n58l19J006N44k790m427J562
4422i978J3P53J839j940k82K028K800J031J594O91k184k186K012L697j253r51
$$ plain form
4541 -9874 -7001 -3295 -3728 -2277 -2977 -2746 -2582 -166 -640 -4606 -6341 -8174 -5519 -5486 -3485 -3337 -4366
4524 -4366 -1383 -2135 -2481 -4446 -7873 -10421 -6128 -5800 -6953 -6501 -6527 -4298 -3352 -3315 -654 1129 -1096
4507 -1096 -3918 -3137 -2401 -1744 -3986 -3919 -3136 -240 -1210 -2158 -1449 -1366 -5656 -7169 -7591 -7881 -4091 153
4489 153 478 -190 -40 -300 492 368 -1465 -3846 -6392 -6928 -5983 -3973 -2943 -4482 -6376 -4408 -382
4472 -382 1552 -1131 -4361 -5789 -3080 -6921 -7921 -7920 -6292 -6388 -8381 -8231 -3804 -448 62 -1130 -2080
4455 -2080 -3906 -3578 -1283 -477 1721 -1516 -4639 -7012 -6001 -1964 -3013 -2313 831 3144 2750 1898
4439 1898 1575 2173 4772 3544 -278 -3114 -3033 -2889 -3162 -4996 -5554 -5873 -4867 -4323 -7113 -11540 -9978
4422 -9978 -9965 -9212 -7373 -9313 -9595 -7567 -4767 -3736 -2142 -1451 -3635 -5821 -3809 -112 -1365 -2316
4406b316j303k72K243L213J929j754n73j076l57j329L418M012k994m022p45K42
4390a684J288k30n41l09o98M027k256k470k403L89K870N9j471J312J60k9J099
4373h87n03l638j867m62K884P46O05M285j08j302J053m26J069j785l556r31J302
4356c521K005J112j442k76k406j615K280k751O76k83Q5j735J373J312M784K816
4340B414k034k543j024q03K10k674R89J807l93r31K047L8k815N00k88J19L939
4323a442K55m011k21M42K409N91l380j515P96K041N71N96l7j905L92j540k281
4306h239K853L973K875k120l679J393J414n51k102l268J917L195M14q78K793j75
4290a85J257J420j439k105k624J99k538P5J699M37J188k355k363J875J685p91
$$ plain form
4406 -2316 -3619 -3891 -1648 1565 3494 1740 1167 91 -266 -1595 1823 5835 2841 -1181 -1926 -1684
4390 -1684 -396 -626 -1167 -1476 -2174 1853 -403 -2873 -5276 -4887 -2017 -1958 -3429 -2117 -1957 -1986 -887
4373 -887 -1390 -5028 -6895 -7357 -4473 -3727 -3122 1163 1055 -247 806 380 1449 -336 -3892 -4823 -3521
4356 -3521 -1516 -404 -1846 -2122 -4528 -6143 -3863 -6614 -5938 -6221 -6136 -7871 -6498 -5186 -402 2414
4340 2414 380 -2163 -3187 -3990 -3780 -6454 -5465 -3658 -4051 -4982 -2935 -2897 -5712 -5212 -5500 -5381 -1442
4323 -1442 -1187 -5198 -5419 -4977 -2568 -1977 -5357 -6872 -6076 -4035 -3464 -2868 -2905 -4810 -4418 -5958 -8239
4306 -8239 -5386 -1413 1462 -658 -4337 -2944 -1530 -2081 -4183 -7451 -5534 -2339 -1925 -2803 -10 -185
4290 -185 1072 2492 1053 -1052 -3676 -3477 -6015 -5940 -4241 -3804 -2616 -4971 -7334 -5459 -3774 -4565
4274d565j725J182J727j339l714p94M131l84j153n80J32j287m09L087J149q65
4258e407k088j389J441k419Q88n8J054O237o67k220l42O26L27l572l45N09J63
4241g262j141M890Q57O51k70n86K670J528M21L70j282k16J377o91n999k480L716
4224c447J992m223r55J350M205K46j334l523l724K147L510J707r26j38J356N29
4208a228j426r82m4N31O1O03j594K057n11j088j683O8r20j437k923j789J483N069
4190e753L940n16J820K091k309j610q45O3k761R35K43j680m37K023J476K99R34
4173b087J060l290l550l44J480J784j613k742j988j344J458K245M118j18k387
4158g318J004L282m23n58N70J941j12P74j542l160m17q16k636P5J660L925K686
$$ plain form
4274 -4565 -6290 -5108 -3381 -4720 -8434 -9228 -5097 -5481 -6634 -7214 -7082 -8369 -8778 -5691 -4542 -5407
4258 -5407 -7495 -8884 -7443 -9862 -8974 -9032 -7978 -1741 -2408 -4628 -4970 -4344 -4017 -7589 -7934 -7425 -7262
4241 -7262 -8403 -3513 -2656 -2005 -2275 -2861 -191 1337 1758 2128 846 630 2007 1316 -4683 -7163 -3447
4224 -3447 -1455 -5678 -6633 -5283 -1078 -832 -2166 -5689 -9413 -7266 -3756 -2049 -2975 -3113 -1757 -1228
4208 -1228 -2654 -3636 -3680 -3149 -3088 -2485 -4079 -2022 -2533 -3621 -5304 -5236 -6156 -7593 -10516 -12305 -10822 -5753
4190 -5753 -1813 -2329 -509 1582 -727 -2337 -3182 -3119 -5880 -4945 -4702 -6382 -6819 -4796 -3320 -3021 -2087
4173 -2087 -1027 -4317 -7867 -8211 -6731 -4947 -6560 -9302 -11290 -12634 -11176 -8931 -4813 -4931 -7318
4158 -7318 -6314 -3032 -3455 -4013 -3443 -1502 -1614 -840 -2382 -5542 -5959 -6775 -9411 -9336 -7676 -3751 -1065
4141a065J130L23J521j861L25n83O44l288m401M82K193j590J526J513L21m031
4125f841j544N139L493J31l478o844P40K433j666J238J041l077J815K235L455
4110a730K120o64j326J62m256j093J099K672n96j117k765k339p07K109K601M55
4094e375L796k342r87j798j004J926p12k314K574K73L71L623n54J667j964l977
4078f797j278K62K913P54j6j01j467k857o74r50K002k47L214O51l18J916J69m73
4060c297K697P0m449j711O89Q32K118P07J95q07J340o45j518k226j249L27L117
4043c810P6L747j001j909m90k210J4M512Q58j231M042k386k529P76l04k130M35
4026c540j025R97J267k890q25j538l762K03K444M852J836p66n52o86J130M04L82
$$ plain form
4141 -1065 65 388 1909 48 373 -210 434 -2854 -7255 -6773 -4580 -6170 -4644 -3131 -2810 -6841
4125 -6841 -8385 -3246 247 378 -3100 -9944 -9204 -6771 -8437 -7199 -6158 -9235 -7420 -5185 -1730
4110 -1730 390 -274 -1600 -1438 -5694 -6787 -5688 -3016 -3612 -4729 -7494 -9833 -10540 -8431 -5830 -5375
4094 -5375 -1579 -3921 -4908 -6706 -7710 -5784 -6496 -8810 -6236 -5963 -5592 -1969 -2523 -856 -2820 -6797
4078 -6797 -8075 -7813 -4900 -4146 -4162 -4263 -5730 -8587 -9261 -10211 -8209 -8456 -5242 -4591 -4909 -2993 -2824 -3297
4060 -3297 -600 -530 -4979 -6690 -6001 -5169 -3051 -2344 -2149 -2956 -1616 -2261 -3779 -6005 -7254 -6927 -3810
4043 -3810 -3734 13 -988 -2897 -3387 -5597 -5583 -1071 -213 -1444 2598 212 -2317 -1541 -1845 -3975 -3540
4026 -3540 -4565 -3568 -2301 -5191 -6016 -7554 -11316 -11113 -8669 -3817 -1981 -2747 -3299 -3985 -2855 -2451 -2069
4009b069J91p26m432j914o34k76J756L336P61K735j63K11M55j181k978m53K926
3992b455K377j057j978l768m382K97M082l95q46K702K822M19L045l120l224K855
3976b626J246R50J370J84j277l659j586K337J819J517k584k676m358K895L333
3961c115M95K745K73M54K412p45o415L61K476J133J569j621k112j084l783j664
3945h621N55N933L755M54k136J976j702k360j282L411l31N44L47j406R3L979R67
3928D176j187j232l999j664M198J525o216p79k016m72J422Q03N86l65r21m99j330
3911g970N3J108m13K450L330N29j751n873J251K789m85O32K978J305l5j855K719
3894G62P88j585j965P89l162R4J191r04K541J019l367q97K413K685k521k926R76
$$ plain form
4009 -2069 -1878 -2604 -7036 -8950 -9584 -9860 -8104 -4768 -4007 -1272 -1435 -1224 -769 -1950 -4928 -5381 -2455
3992 -2455 -78 -1135 -3113 -6881 -11263 -10966 -6884 -7279 -8125 -5423 -2601 -2182 863 -2257 -5481 -2626
3976 -2626 -1380 -430 940 1124 -153 -3812 -5398 -3061 -1242 275 -2309 -4985 -9343 -6448 -3115
3961 -3115 -2620 125 398 852 3264 2519 -3896 -3535 -1059 74 1643 22 -2090 -3174 -6957 -8621
3945 -8621 -8066 -2133 1622 2076 -60 1916 214 -2146 -3428 -17 -348 196 543 -863 -770 3209 4176
3928 4176 2989 1757 -2242 -3906 292 1817 -4399 -5178 -7194 -7666 -6244 -5441 -4855 -5220 -6141 -6640 -7970
3911 -7970 -7917 -6809 -7222 -4772 -1442 -913 -2664 -8537 -7286 -4497 -4982 -4350 -1372 -67 -102 -1957 762
3894 762 1550 -35 -2000 -1211 -4373 -4279 -3088 -3992 -1451 -432 -3799 -4696 -2283 402 -2119 -5045 -4069
3877d069L253K416j780K79q20J324k61k250J660R61k079k145L524l372l044K001
3861d402P24J874Q10L03l179J119K035l03j326M04o77Q30l384j279K575k31L118
3844i89N51P2K800N08k04M35j569l838l167J697L140n44r32l73j395r3J181K285
3826d35k491l197M815J867k032m175L32k527k213K192J962L410k045j811p82O47
3810f483J206J638L794K278j993l107j918N9o79J053L229m65j603m667m001k368
3794a4027M309M147J560j648J471m43j983l94P09m85M161K863J450j408K35J863
3778B380J25j396l595j481j512l580p05N802O438j694q37J253n43j23r64R05M464
3761D937J144l858l722m10k127k962j461J427L771J577j095J968J884k753j851
$$ plain form
3877 -4069 -816 1600 -180 99 -721 603 342 -1908 -248 713 -1366 -3511 13 -3359 -6403 -4402
3861 -4402 -3678 -1804 -994 -691 -3870 -2751 -716 -1019 -2345 -1941 -2618 -1788 -5172 -6451 -3876 -4107 -989
3844 -989 -438 -366 2434 2942 2738 3173 1604 -2234 -5401 -3704 -564 -1108 -2040 -2413 -3808 -3901 -2720 -435
3826 -435 -2926 -6123 -1308 559 -1473 -5648 -5316 -7843 -10056 -7864 -5902 -2492 -4537 -6348 -7130 -6483
3810 -6483 -5277 -3639 155 2433 440 -2667 -4585 -4526 -5205 -4152 -923 -1388 -2991 -7658 -11659 -14027
3794 -14027 -9718 -5571 -4011 -5659 -4188 -4631 -6614 -7008 -6299 -6784 -2623 240 1690 282 517 2380
3778 2380 2505 1109 -2486 -3967 -5479 -9059 -9764 -3962 2476 782 -55 1198 655 532 -432 473 4937
3761 4937 6081 2223 -1499 -1909 -4036 -6998 -8459 -7032 -3261 -1684 -2779 -811 1073 -1680 -3531
3746c531J491k852j171k226J900M52J509K904Q14J65J295j779k422K898k02k624
3730c379j282J99p2J156J32j589n719k012J414K165K690J141m23L346j383q22
$$ plain form
3746 -3531 -2040 -4892 -6063 -8289 -6389 -5937 -4428 -1524 -710 -545 750 -1029 -3451 -553 -755 -3379
3730 -3379 -4661 -4462 -4534 -3378 -3246 -4835 -10554 -12566 -11152 -8987 -6297 -5156 -5579 -2233 -3616 -4438
$$ [...]
##END NTUPLES=NMR SPECTRUM
##END=
