##TITLE=Analysis number 310506
Compound Code btb 12326
Chemist Name new century
##JCAMPDX= 6.0         $$ Bruker NMR JCAMP-DX V2.0
##DATA TYPE= NMR SPECTRUM
##DATA CLASS= NTUPLES
##ORIGIN= Bruker BioSpin GmbH
##OWNER= NMR
$$ XWIN-NMR		Version 3.5
$$ Mon Jun 20 14:47:41 2005 GMT Daylight Time (UT+1h)  MAYBRIDGE\NMR@NMR_250MHZ
##.OBSERVE FREQUENCY= 250.131544655141
##.OBSERVE NUCLEUS= ^1H
##.ACQUISITION MODE= SIMULTANEOUS (DQD)
##.ACQUISITION SCHEME= undefined
##.AVERAGES= 16
##.DIGITISER RES= 18
##SPECTROMETER/DATA SYSTEM= dpx250
##.PULSE SEQUENCE= zg30
##.SOLVENT NAME= DMSO
##.SHIFT REFERENCE= (INTERNAL, DMSO, 0, 16.522)
##AUDIT TRAIL= $$ (NUMBER, WHEN, WHO, WHERE, WHAT)
$$ ##TITLE= Audit trail, XWIN-NMR		Version 3.5
$$ ##JCAMPDX= 5.01
$$ ##ORIGIN= Bruker BioSpin GmbH
$$ ##OWNER= NMR
$$ C:\u/data/dgb/nmr/ADRS/4270/pdata/1/auditp.txt
$$ ##AUDIT TRAIL=  $$ (NUMBER, WHEN, WHO, WHERE, WHAT)
(   1,<2005-06-20 14:46:59.32 +100>,<MAYBRIDGE\NMR>,<NMR_250MHZ>,
      <created by zg, POWCHK disabled, PULCHK disabled
       configuration hash MD5:
       62 19 C7 07 E1 42 D1 B7 37 6C 3D D0 77 39 F9 E6
       data hash MD5: 64K
       30 55 D2 89 B2 92 67 56 52 BE 00 A3 99 83 20 41>)
(   2,<2005-06-20 14:47:17.38 +100>,<MAYBRIDGE\NMR>,<NMR_250MHZ>,
      <Start of raw data processing
       ef LB = 0.3 FT_mod = 6 PKNL = 1 SI = 32K 
       data hash MD5: 32K
       23 EC 4A 98 0E F4 99 9D 3C 49 E8 9E 96 EE C4 65>)
(   3,<2005-06-20 14:47:22.55 +100>,<MAYBRIDGE\NMR>,<NMR_250MHZ>,
      <apk 
       data hash MD5: 32K
       F3 44 6F E6 93 A5 77 D9 DA 9C 0C AE 64 30 B8 A2>)
(   4,<2005-06-20 14:47:24.02 +100>,<MAYBRIDGE\NMR>,<NMR_250MHZ>,
      <abs ABSG = 5 
       data hash MD5: 32K
       A6 2E A3 8B 8D CD 93 DC 66 52 04 55 17 3A 0F 77>)
$$ ##END=
$$ 
$$ hash MD5
$$ F7 ED A1 21 B8 91 A6 EE E1 C8 CA 3C 84 6F A7 0E
##$RELAX= 
##$RELAX= 
##$RELAX= 
##$RELAX= 
##$RELAX= 
##$RELAX= 
##$RELAX= 
$$ Bruker specific parameters
$$ --------------------------
##$DU= <C:\u>
##$EXPNO= 4270
##$NAME= <ADRS>
##$PROCNO= 1
##$TYPE= <nmr>
##$USER= <dgb>
##$AMP= (0..31)
100 100 100 100 100 100 100 100 100 100 100 100 100 100 100 100 100 100 
100 100 100 100 100 100 100 100 100 100 100 100 100 100 
##$AQSEQ= 0
##$AQ_mod= 3
##$AUNM= <au_zg>
##$AUTOPOS= <19 >
##$BF1= 250.13
##$BF2= 250.13
##$BF3= 250.13
##$BF4= 250.13
##$BF5= 500.13
##$BF6= 500.13
##$BF7= 500.13
##$BF8= 500.13
##$BYTORDA= 1
##$CFDGTYP= 0
##$CFRGTYP= 5
##$CHEMSTR= <none>
##$CNST= (0..31)
1 1 145 1 1 1 1 1 1 1 1 1 1 1 1 1 1 1 1 1 1 1 1 1 1 1 1 1 1 1 1 1 
##$CPDPRG= <>
##$CPDPRG1= <>
##$CPDPRG2= <>
##$CPDPRG3= <>
##$CPDPRG4= <mlev>
##$CPDPRG5= <mlev>
##$CPDPRG6= <mlev>
##$CPDPRG7= <mlev>
##$CPDPRG8= <mlev>
##$CPDPRGB= <>
##$CPDPRGT= <>
##$D= (0..31)
0 1 0 0 0 0 0 0 0 0.06 0 0 0 0 0 0 0.0002 0 0 0 0 0 0 0 0 0 0 0 0 0 0 
0 
##$DATE= 1119275217
##$DBL= (0..7)
120 120 120 120 120 120 120 120 
##$DBP= (0..7)
150 150 150 150 150 150 150 150 
##$DBP07= 0
##$DBPNAM0= <>
##$DBPNAM1= <>
##$DBPNAM2= <>
##$DBPNAM3= <>
$$ [...]
##$SUBNAM7= <"">
##$SUBNAM8= <"">
##$SUBNAM9= <"">
##$SW= 20.6930455092707
##$SWIBOX= (0..15)
0 0 3 0 0 0 0 0 0 0 0 0 0 0 0 0 
##$SW_h= 5175.983436853
##$TD= 65536
##$TD0= 1
##$TE= 295.16
##$TE2= 300
##$TE3= 300
##$TEG= 300
##$TL= (0..7)
0 120 120 120 120 120 120 120 
##$TP= (0..7)
150 150 150 150 150 150 150 150 
##$TP07= 0
##$TPNAME0= <>
##$TPNAME1= <>
##$TPNAME2= <>
##$TPNAME3= <>
##$TPNAME4= <>
##$TPNAME5= <>
##$TPNAME6= <>
##$TPNAME7= <>
##$TPOAL= (0..7)
0.5 0.5 0.5 0.5 0.5 0.5 0.5 0.5 
##$TPOFFS= (0..7)
0 0 0 0 0 0 0 0 
##$TUNHIN= 0
##$TUNHOUT= 0
##$TUNXOUT= 0
##$USERA1= <user>
##$USERA2= <user>
##$USERA3= <user>
##$USERA4= <user>
##$USERA5= <user>
##$V9= 5
##$VALIST= <valist>
##$VCLIST= <CCCCCCCCCCCCCCC>
##$VD= 0
##$VDLIST= <DDDDDDDDDDDDDDD>
##$VPLIST= <PPPPPPPPPPPPPPP>
##$VTLIST= <TTTTTTTTTTTTTTT>
##$WBST= 1024
##$WBSW= 4
##$XGAIN= (0..3)
0 0 0 0 
##$XL= 0
##$YL= 0
##$YMAX_a= 356313
##$YMIN_a= -272591
##$ZGOPTNS= <>
##$ZL1= 120
##$ZL2= 120
##$ZL3= 120
##$ZL4= 120
##$ABSF1= 16.522
##$ABSF2= -4.171173
##$ABSG= 5
##$ABSL= 3
##$ALPHA= 0
##$AQORDER= 0
##$ASSFAC= 0
##$ASSFACI= 0
##$ASSFACX= 0
##$ASSWID= 0
##$AUNMP= <proc_1d>
##$AZFE= 0.1
##$AZFW= 0.1
##$BCFW= 0
##$BC_mod= 0
##$BYTORDP= 0
##$COROFFS= 0
##$CY= 12.5
##$DATMOD= 1
##$DC= 0
##$DFILT= <>
##$DTYPP= 0
##$F1P= 14.0000005364418
##$F2P= -0.99999901652339
##$FCOR= 0.5
##$FTSIZE= 32768
##$FT_mod= 6
##$GAMMA= 0
##$GB= 0
##$INTBC= 1
##$INTSCL= 1
##$ISEN= 128
##$LB= 0.3
##$LEV0= 0
##$LPBIN= 0
##$MAXI= 10000
##$MC2= 0
##$MEAN= 0
##$ME_mod= 0
##$MI= 0
##$NCOEF= 0
##$NC_proc= -6
##$NLEV= 6
##$NOISF1= 0
##$NOISF2= 0
##$NSP= 0
##$NTH_PI= 0
##$NZP= 0
##$OFFSET= 16.522
##$PC= 1
##$PHC0= -84.55102
##$PHC1= 8.416237
##$PH_mod= 1
##$PKNL= yes
##$PPARMOD= 0
##$PSCAL= 4
##$PSIGN= 0
##$REVERSE= no
##$SF= 250.13
##$SI= 32768
##$SIGF1= 0
##$SIGF2= 0
##$SINO= 400
##$SIOLD= 32768
##$SREGLST= <1H.DMSO>
##$SSB= 0
##$STSI= 32768
##$STSR= 0
##$SW_p= 5175.98343685301
##$SYMM= 0
##$S_DEV= 0
##$TDeff= 65536
##$TDoff= 0
##$TI= <Analysis number 999999
Compound Code 99
Book Reference 9
Project Code 9>
##$TILT= no
##$TM1= 0
##$TM2= 0
##$TOPLEV= 0
##$USERP1= <user>
##$USERP2= <user>
##$USERP3= <user>
##$USERP4= <user>
##$USERP5= <user>
##$WDW= 1
##$XDIM= 32768
##$YMAX_p= 452060858
##$YMIN_p= -1247000
$$ End of Bruker specific parameters
$$ ---------------------------------
##NTUPLES= NMR SPECTRUM
##VAR_NAME=  FREQUENCY,     SPECTRUM/REAL,   SPECTRUM/IMAG
##SYMBOL=    X,             R,               I
##VAR_TYPE=  INDEPENDENT,   DEPENDENT,       DEPENDENT
##VAR_FORM=  AFFN,          ASDF,            ASDF
##VAR_DIM=   32768,         32768,           32768
##UNITS=     HZ,            ARBITRARY UNITS, ARBITRARY UNITS
##FACTOR=    0.157963299565203, 1,           1
##FIRST=     4132.6476996994, 0,             0
##LAST=      -1043.33573715361, 0,           0
##MIN=       -1043.33573715361, -1247000,    0
##MAX=       4132.6476996994, 452060858,     0
$$ Real data points
##PAGE= N=1
##DATA TABLE= (X++(R..R)), XYDATA
$$ [...]
15529E19011j08689p7790l63112P9392Q218k35865r1144J88085J65045Q463k71847
15518a80233J44729K02620K2002L5038k56933L081K33121R0407j74025J21271
15508B41078L03690r8373J7110k78492k73304j42890J01911K44211O6172j44131
15498C6982o2876j7926K76565K3849J33405k7861j63463k34513k60824l22328
15488f18990J69114Q7195j27683j86328L75974O37067J07920J53861O7308k28759
15478D36679K0150r7608k12237k68586l92902J15603L07008J80253K62575R9875
15468D50810l21281k83426K50888q155n7109j07823R0963J29797j23923k76941
15458b56200o6374r5859j20749j04037J78098M7346K71555J88186j36084m23477
$$ plain form
15529 519011 410322 332532 -30580 48812 57030 -178835 -269979 -81894 83151 91614 -180233
15518 -180233 -35504 167116 189118 224156 -32777 -29696 203425 293832 119807 241078
15508 241078 544768 446395 463505 185013 -88291 -231181 -129270 114941 181113 36982
15498 36982 -25894 -43820 232745 256594 389999 362138 198675 -35838 -296662 -618990
15488 -618990 -449876 -362681 -490364 -676692 -300718 336349 444269 598130 665438 436679
15478 436679 456829 359221 146984 -121602 -514504 -398901 -91893 88360 350935 450810
15468 450810 129529 -153897 96991 88836 31727 -76096 14867 144664 20741 -256200
15458 -256200 -322574 -418433 -539182 -643219 -465121 -417775 -146220 41966 -94118 -517595
15448e17595N01702L59257L29278J96332n92842k01924M2758j8265J03780N7300
15438B59781l8578j5558j40928j11083R6273L02055J08957m7743j23917j12748
15428A76511j51880l9167J22494k62845J7969L55283K00635k95121j11218L60261
15418C72922j45399k08095K8925j93755J59333L11224J29055k65487r6797J57359
15408B49285J73745m1107J29498P9907O3747k72398k24220J67439J15990p4399
15398C67487k64928L3209k64513J95970J80216J33682n5910l80259l25231o8261
15388d48538k8820l23370p6312K80826K24212J59043J50529K51987o1687j27254
15378F16j21369k0021K7302j1436O214L9573J26068M23473L67900o2876k13576
$$ plain form
15448 -517595 -15893 343364 672642 868974 276132 74208 116966 98701 202481 259781
15438 259781 221203 205645 64717 -46366 49907 351962 460919 413176 289259 176511
15428 176511 24631 -14536 107958 -154887 -136918 218365 419000 123879 12661 372922
15418 372922 227523 19428 48353 -145402 13931 325155 454210 188723 91926 249285
15408 249285 423030 381923 511421 591328 655075 382677 158457 325896 441886 367487
15398 367487 102559 135768 -128745 67225 247441 381123 325213 -55046 -380277 -448538
15388 -448538 -477358 -800728 -877040 -596214 -372002 -212959 -62430 189557 127870 616
15378 616 -120753 -140774 -113472 -124908 -118694 -79121 46947 470420 838320 775444 561868
15367E61868o02361j44237j97730J10889M27873L24621K41503k5386j58890r4589
15357D43561k87742k71005J2758l332k69057Q6862L88573K08847r0825J2208Q1403
15346C12251j38153j34255j30806j19142j25205K15954K32633L37392j96556l07734
15336e3621j87947K05577k21993m26759j29798K73885N86271J09658l33928J7477
15326a61178K10587m8936R404j79078k99281j41168O0870L80405J19286l6680
15316h5769L9483J16512J60734K3931q2485o0842m7831J19643j61736j04369J81551
15305I8822r0467Q1199k52278Q209L03062j7452l68804j83304L119J75455R7151
15294a45288j5083R6836J27840J76566K02785J32916J57854j09678k46427p8959
$$ plain form
15367 561868 -40493 -184730 -382460 -271571 156302 480923 722426 697040 538150 443561
15357 443561 155819 -115186 -102428 -105760 -374817 -287955 100618 309465 218640 230848 312251
15346 312251 174098 39843 -90963 -210105 -335310 -119356 113277 450669 254113 -53621
15336 -53621 -241568 -35991 -257984 -684743 -814541 -540656 45615 155273 -178655 -161178
15326 -161178 49409 473 9877 -169201 -468482 -609650 -548780 -168375 -49089 -85769
15316 -85769 -46286 70226 230960 254891 172406 111564 63733 183376 21640 -82729 98822
15305 98822 8355 89554 -162724 -154515 148547 131095 -237709 -421013 -417894 -242439 -145288
15294 -145288 -160371 -63535 64305 240871 443656 576572 734426 624748 378321 299362
15284B99362N9840J93166k26963m17118J11086Q3157J06025k45242N6972K93274
15274C13559O4780n22875j05255J06491R001q8971O2281j35902P4359J48856j60608
15263b34284P1749o6215J27432N7989j53748k2020J85479j01581o2769O4874Q3485
15252d9609k06025j3412L55702M11550j28133j23586j38868p7947j22866O4915
15242b8279K29900O7061j76168m7205K39491M9972k26375Q9512r7872j77921j80596
15231b58480M7836J72667m9634m3911K50181K24298k68756J65094K42825n3464
15221D28656j90790O0568J25956k10992k54558K65580l57294l39740j64517j44188
15211g81319O0691K62947M74152O09058l3229j74087q8030j56490m6571L69878
$$ plain form
15284 299362 359202 552368 325405 -91713 19373 102530 208555 -36687 20285 313559
15274 313559 378339 -144536 -249791 -143300 -134299 -223270 -160989 -296891 -222532 -73676 -234284
15263 -234284 -162535 -228750 -101318 -43329 -197077 -219097 -33618 -135199 -197968 -133094 -49609
15252 -49609 -255634 -269046 86656 498206 370073 246487 107619 29672 -93194 -28279
15242 -28279 201621 268682 92514 45309 284800 334772 108397 197909 100037 -77884 -258480
15231 -258480 -210644 -37977 -87611 -131522 118659 342957 74201 239295 482120 428656
15221 428656 237866 298434 424390 213398 -41160 224420 -132874 -472614 -637131 -781319
15211 -781319 -720628 -457681 16471 625529 592300 418213 330183 173693 127122 497000
15201D97000l03958p2005j08947O6966K32979L57064R9449q8034m02967l66316
15191h8769o70m9865K7891j06289J86004K81001J58896r8737R1796l5689m5870
15180C19699N731k33997j61053K626J12521M7304K58437K81377j88856m66607
15170b2818j02538Q9187o6020M54263j99163j17367p6105P2399p0049K36230l27954
15159a29935l24230M8802J75219L76215R2395l81411j24875l81448j96754K19262
15149f26760K1313j71291l59077J67094M15324L65660M87481J19560l34853l58768
15139b74317Q9189q1293k21574j46841N0669Q0043j053j9595L808j61198p1705
15128g53867M26882L37782P9719K37855J14797l59850l75755M4934M4056J35671
$$ plain form
15201 497000 193042 121037 12090 79056 312035 669099 768548 680514 277547 -88769
15191 -88769 -89439 -139304 -111413 -217702 -31698 249303 408199 309462 401258 365569 319699
15180 319699 325430 91433 -69620 -66994 45527 92831 351268 632645 443789 -22818
15170 -22818 -125356 -36169 -102189 352074 152911 35544 -40561 31838 -38211 198019 -129935
15159 -129935 -454165 -405363 -230144 146071 238466 -142945 -267820 -649268 -846022 -626760
15149 -626760 -605447 -776738 -1135815 -968721 -553397 -187737 299744 419304 84451 -274317
15139 -274317 -185128 -266421 -487995 -634836 -584167 -504124 -505177 -524772 -520964 -682162 -753867
15128 -753867 -326985 10797 90516 328371 443168 83318 -292437 -247503 -203447 -67776
15118f7776j56145k0182J47624K32006R9338p8131j33361n9410J27584J92240
15108B83787J05782r3149j52232O8680m9713k67867j21958l23971K30224K05179
15098a15238J29686L8080k36931o6095K71967K62144l65000j16151M069L9663
15088a53806j03067l8579J59013P2612L7465j23550l36784K01816J10760L5640
15078a38480l32579J0079L86j63744j6990n6432J54013J97940j15661J12156m2076
15067c91388j97785Q227K95458K9262o6984k4252P4429m8655k973J9005j44851
15056d50507j58813L01943K13954n5742q9435K74663M67409o7450J4408j30784
15046C19646K2637j535o1013j05612j58969k02719N7194J47296j68313k97257
$$ plain form
15118 -67776 -223921 -244103 -96479 135527 234865 156734 23373 -36037 91547 283787
15108 283787 389569 296420 144188 212868 163155 -104712 -226670 -550641 -320417 -115238
15098 -115238 14448 52528 -184403 -250498 21469 283613 -81387 -197538 -193469 -153806
15088 -153806 -256873 -295452 -136439 -63827 -26362 -149912 -486696 -284880 -174120 -138480
15078 -138480 -471059 -460980 -460594 -624338 -641328 -697760 -543747 -345807 -461468 -349312 -391388
15067 -391388 -589173 -580946 -285488 -256226 -323210 -347462 -273033 -321688 -324661 -305656 -450507
15056 -450507 -609320 -307377 -93423 -149165 -238600 36063 503472 436022 450430 319646
15046 319646 342283 340748 279735 174123 15154 -187565 -130371 16925 -151388 -448645
15036d48645k53343J19220J26187J56281L94597L02902j40470l24642P1750P2586
15026G6423L6107j34307j13797k12910J94941M7238J6922J00403Q0046K1602m3630
15015F9038R032j98460K03787j92626k65897J55998j06041K60644J00327j45277
15005a09475n2028j05368J75254L19478r0161L9832K42757j77993k08060q8558
14995e4322K14921K28313j19694l787j62224k32758J49988J16014p2468l3402
14985C0581J8759L06001O1465l70367M3160K73351Q1751l95920j91405j80196
14975c22820O09676k210l61782l11388L1126n1329j53604M9485J84470l0664O53166
14964B94126L13379l47699L8482J73346l91095j68839K77368J35918m20770j81363
$$ plain form
15036 -448645 -701988 -582768 -456581 -300300 94297 397199 256729 -67913 3837 76423
15026 76423 112530 -21777 -135574 -348484 -153543 -106305 -89383 11020 91066 112668 69038
15015 69038 78070 -120390 83397 -109229 -375126 -219128 -325169 -64525 35802 -109475
15005 -109475 -161503 -266871 -91617 227861 137700 177532 420289 242296 34236 -54322
14995 -54322 160599 388912 269218 265431 103207 -129551 20437 136451 63983 30581
14985 30581 49340 355341 416806 46439 89599 362950 444701 48781 -142624 -322820
14975 -322820 286856 284646 -77136 -388524 -357398 -408727 -562331 -512846 -328376 -359040 294126
14964 294126 607505 259806 298288 471634 80539 -88300 189068 324986 -95784 -277147
14954b77147K02151J42993J64720J01560M6138l850j58863L7040J74594P0055
14944D99391k63452j20576n3631J70275J30114N0645k76995j14844j04817J34750
14934E0860J1557j22188P5472J6293q3902j15465j34598m1449M2641J54030M44782
14923B98033J85412l81592l61836L78847J70283j27624p3590j47037j71436J50843
14913g9697P0676k05948j62703K12020J92673j7415l90943j50541L16764L56396
14903A41282k4775k40613j55502J77823J05938r5193k41921L9407l06389K8218
14893e71725K38686L68177m9550j01253j60662K2467K45407j24163j0249K2052
14883a20813K06097p6700l8896M8080N04181O0253j59778l08491k31417K46004
$$ plain form
14954 -277147 -74996 67997 232717 334277 380415 376565 217702 254742 429336 499391
14944 499391 235939 115363 61732 232007 362121 412766 135771 20927 -83890 50860
14934 50860 62417 -59771 15701 31994 -51908 -167373 -301971 -343420 -300779 -146749 298033
14923 298033 483445 101853 -259983 118864 289147 161523 87933 -59104 -230540 -79697
14913 -79697 -9021 -214969 -377672 -165652 27021 9606 -381337 -531878 -215114 141282
14903 141282 116507 -124106 -279608 -101785 4153 -91040 -332961 -293554 -599943 -571725
14893 -571725 -333039 35138 -14412 -115665 -276327 -253860 -8453 -132616 -142865 -120813
14883 -120813 85284 8584 -30312 17768 521949 582202 422424 113933 -117484 128520
14873A28520Q4526P9802k60024l17889J81378k22029k11811K00600L76129N1175
14863I0377l16678j72819J67855L07567M9789K38715j10240j94940k9696J60740
14853A90670N823j94176n0458j16J31219j88917o3844K16502J41019m900j56426
14842B6396j7949O3505P5818O7396j98279j68829J13562J55278K46805L3534M8365
14831D45602m19796j48054n504N8883Q931l61914l41603J02703K14989L92986
14821e2777L41549k08947k63750r5431K74292K5518L4352j67770O7554J68658
14811A23248j15074N076K72168N4532k9105j98627j68563o3104Q215k6494K05267
14800F7539O0984R7990l2406j96376J77863J63101j15804j90857j69683K53429
$$ plain form
14873 128520 213046 292848 32824 -285065 -103687 -325716 -537527 -336927 39202 90377
14863 90377 -226301 -399120 -231265 76302 126091 364806 254566 59626 29930 190670
14853 190670 196493 2317 -48141 -48257 82962 -105955 -169799 46703 187722 182822 26396
14842 26396 8447 71952 147770 215166 16887 -151942 -38380 116898 363703 397237 445602
14831 445602 25806 -122248 -127752 -68869 -59938 -421852 -763455 -660752 -445763 -52777
14821 -52777 288772 79825 -183925 -279356 -5064 20454 54806 -112964 -45410 123248
14811 123248 8174 13250 285418 339950 310845 112218 -56345 -119449 -111234 -137728 67539
14800 67539 128523 226513 194107 -2269 175594 338695 222891 32034 -137649 115780
14790A15780j01779l14174K02731m4444r8240K18086J82373J35727K83965J74508
14780G54533j55351j47692J34494j75176k46458j66232J03012k68120J60979K21128
14770B15117N5384J40039l7521j96661q4012L21548J86729j49051m28571k2535
14760D66J08071J85612K4505n9163j58762m01238j09984J24610K42556K56889
14750B13562K38795k46566l18834L634K59168J63028J98096o6954o0352q3887
14740B99690l30433m50402r9870L05030M10659k94050j6786L62229o0895k47746
14730a22574j18045J59798J36202p1603K48568k8713j46785q7700L4987j5039
14720a0904J30280l61689k94130L460p4249P9568K24453J1215Q9507r671K39075
$$ plain form
14790 115780 14001 -300173 -97442 -141886 -240126 -22040 160333 296060 580025 754533
14780 754533 599182 451490 585984 410808 164350 -1882 101130 -166990 -6011 215117
14770 215117 270501 410540 373019 176358 92346 413894 600623 451572 23001 466
14760 466 108537 294149 318654 259491 100729 -300509 -410493 -285883 -43327 213562
14750 213562 452357 205791 -113043 -109409 149759 312787 510883 443929 383577 299690
14740 299690 -30743 -481145 -581015 -275985 134674 -159376 -176162 186067 125172 -122574
14730 -122574 -240619 -80821 55381 -16222 232346 203633 56848 -30852 4135 -10904
14720 -10904 119376 -242313 -536443 -532983 -607232 -527664 -303211 -291996 -202489 -212160 26915
14709B6915J08566R3032l32907p665K7422r4613L37058P5530j42010k88385j96069
14698c93126K8311M60167k45883k86037K1081K63655J60899n5442o3860P7291
14688c2944J44546j50610O0513K45558K29121P9884M2828k26080l27893R722K85230
14677C59875J49101j04146k13952K3224j52592k41696j54825J02286J92888K2577
14667a7260L53498J66881n00377q0433R3847O7235j79654K31783k47966k93657
14657d06103k9294J54697K80341j20455M796J31366J37027l16609l52238L62965
14647a53507K25090k7893j48106N43282K19945l8783o1502j17225k51444j69433
14637B0424n418k64178k18911J50484J85216l7054K84398L38162l3914l79175
$$ plain form
14709 26915 135481 228513 -104394 -112059 -84637 -179250 157808 233338 91328 -197057 -393126
14698 -393126 -364815 95352 -150531 -436568 -415487 -151832 9067 -46375 -110235 -32944
14688 -32944 111602 -39008 21505 267063 496184 576068 618896 392816 64923 74645 359875
14677 359875 508976 404830 190878 214102 61510 -180186 -335011 -232725 -39837 -17260
14667 -17260 336238 503119 2742 -77691 16156 83391 -96263 135520 -112446 -406103
14657 -406103 -435397 -280700 -359 -120814 -116018 15348 152375 -164234 -516472 -153507
14647 -153507 71583 43690 -104416 438866 658811 620028 558526 441301 189857 20424
14637 20424 15006 -249172 -468083 -317599 -132383 -169437 114961 453123 419209 40034
14627D0034j1045J51156R1037j15743q0190O7650N0549l39447k2772J04462Q3809
14616A9500j68365M29760Q3639k21487p6735k03909l526j97361j73767L56303
14606a55948K98062P6301m36816l5163l09194P1347K29511N9269R3360j5464p4985
14595a99720j16729L06127J01290j26541J01634j01755k64645o5772M07728O1003
14585A02620J57630J40605l13994n48055j07576K57780r199J35603o9941j18872
14575c73399J83113o2805K36795N3686m27352j47960m17193P7968L22520O26331
14565G1704K09646j05000j99927j52332j63586j49975K98954m7945n8738M5740
14555b51459J07058k0133K08259K52898K22128J04433k52127m97598P2885L81174
$$ plain form
14627 40034 28989 180145 271182 155439 75249 142899 193448 -145999 -168771 -64309 19500
14616 19500 -148865 280895 364534 143047 66312 -137597 -141123 -338484 -512251 -155948
14606 -155948 142114 218415 -218401 -253564 -562758 -491411 -261900 -202631 -109271 -124735 -199720
14595 -199720 -316449 -10322 90968 -35573 66061 -35694 -300339 -366111 41617 102620
14585 102620 260250 400855 86861 -461194 -568770 -310990 -320189 -184586 -254527 -373399
14575 -373399 -190286 -253091 -16296 37390 -389962 -537922 -955115 -877147 -554627 71704
14565 71704 281350 176350 -23577 -175909 -339495 -489470 -190516 -238461 -297199 -251459
14555 -251459 -144401 -164534 43725 296623 518751 623184 371057 -126541 -53656 327518
14545C27518j02191J08033J62881j07602j80361k58932R1513K82201j62336j3783
14535A46941k5589J45558L7168k00925n95012r5130L76777N6640j27442L46092
14525F5078N24092n45263p23220N9263L20215J96181O1190q8802K64260n5860
14515G7134j79214m67749j35504j37529m3606K65904M14845K39018o0260J3694
14505a3267p0709m1701K84660l6360k58954J10177K42534l8879o9788o950r5524
14494E239l07470L4125n0425j23780J30913r0888j74539r9484p6504K88013J03089
14483c61711j7988L84711K84273q6271l04953r4014P0362N9150K80765J17363
14473C31687j14481q5587l14421k46340M4666k8186J15422K76441l7679q6784
$$ plain form
14545 327518 225327 333360 496241 388639 208278 -50654 40859 323060 160724 146941
14535 146941 121352 266910 304078 103153 -491859 -586989 -210212 -153572 -281014 65078
14525 65078 589170 43907 -679313 -620050 -299835 -103654 -42464 -131266 132994 77134
14515 77134 -102080 -569829 -705333 -842862 -886468 -620564 -205719 33299 -26961 -13267
14505 -13267 -83976 -125677 158983 122623 -136331 -26154 216380 177501 107713 100763 5239
14494 5239 -302231 -268106 -318531 -442311 -311398 -402286 -576825 -676309 -752813 -464800 -361711
14483 -361711 -379699 5012 289285 203014 -101939 -195953 -125591 -66441 214324 331687
14473 331687 217206 131619 -182802 -429142 -384476 -412662 -297240 -20799 -58478 -145262
14463a45262r1397j72581K02884k54607j5396J00017K26770J65890j64303k69181
14453d17166l8303K9716L39571N403k00224J19100j32514O8189m7085q4679K8460
14442c29532O8593J87720K31308L6339R8338j36026O4118P8301k18623j95408
14432a14872K58384p7009k68007j32003K27528L07406j57141J0981o7305o7686
14422g9724K0769l04694L8585l32238q7901K03188M44492j30356m14159R3668
14412e48370M72837Q9979j46113p4393k1387P4370j64856J85758q2632j85323
14402d00130K37880J91890k89714j73332Q4023L34987M8535k87396j9179J15805
14392a56631J29175r5474q6540L19268j63280j33783o7825l96678M1024N21596
$$ plain form
14463 -145262 -236659 -409240 -206356 -460963 -476359 -376342 -149572 16318 -147985 -417166
14453 -417166 -455469 -425753 -86182 -80779 -281003 -161903 -294417 -226228 -273313 -357992 -329532
14442 -329532 -260939 -73219 158089 194428 292766 156740 220858 299159 80536 -114872
14432 -114872 143512 66503 -201504 -333507 -105979 201427 44286 55267 -12038 -79724
14422 -79724 -58955 -363649 -325064 -657302 -745203 -542015 -97523 -227879 -642038 -548370
14412 -548370 -75533 14446 -131667 -206060 -227447 -153077 -317933 -132175 -214807 -400130
14402 -400130 -162250 29640 -260074 -433406 -349383 -14396 34139 -253257 -272436 -156631
14392 -156631 -27456 -122930 -209470 109798 -53482 -187265 -255090 -651768 -610744 -89148
14382h9148J49628j23569r2292k16118J88121J88341o8216O9032J77421J5781
14372A98981j05493l75945J21217M47828l91648q3142K00963J07145j97929O5532
14362a2491J98996K03422J5107J53828J6656J09446j37272L2946k64770l751M8428
14351C60545K9239j72577L70167J95k49437j40889k3095j78119j59776P9922k21233
14340c05058j53265K19839J31718q2932M5348j74331j97373Q7939L86980J6949
14330b4186j8352L57352J46958m07452N6102M8380k97443Q9032k53905k32681
14320e36195L2350j5690J13522Q0457j9080J00710P5070J10758j22755k76419
14310d57272K9974p3162J95936Q4871K27334o8623m68005j70788J45457K24747
$$ plain form
14382 -89148 60480 -63089 -155381 -371499 -183378 4963 -63253 5779 183200 198981
14372 198981 93488 -282457 -161240 286588 -105060 -188202 12761 119906 -78023 -12491
14362 -12491 186505 389927 405034 558862 575518 684964 547692 580638 315868 312117 360545
14351 360545 389784 217207 587374 587569 338132 197243 174148 -3971 -163747 -83825 -305058
14340 -305058 -458323 -238484 -106766 -189698 -144350 -318681 -516054 -428115 -41135 -24186
14330 -24186 -42538 314814 461772 54320 110422 158802 -138641 -49609 -303514 -536195
14320 -536195 -503845 -519535 -406013 -325556 -344636 -243926 -168856 -58098 -180853 -457272
14310 -457272 -427298 -500460 -304524 -219653 7681 -60942 -528947 -699735 -554278 -329531
14300c29531k2622J59891J73498J56700k85849j69084L33589k37930k8295K67882
14290A8249M6276j24327j57746o1892o7755J11190N41906J63048k10195r9669
14280A59085j65663j69946k38840q2698K02781P2663J13571K05082K9201n5760
14270F9476j78275r9275o6708o9282J25488Q0876m439m7163L8497J7235o7962
14259b01532L4714J50479J04051p3575k0409k37964n7550P7831j94207J46506
14249b71656P8059L28466Q3286o8984j41394j18832L9087k3888O4120J85617K35188
14238C89069k1592j97767J78995J42002j7421k81273l11230l94681q6300K04023
14228c96175k06930K23724R2652J25214n4647k8173Q4280Q9068o2784k1932K60872
$$ plain form
14300 -329531 -352153 -192262 -18764 137936 -147913 -316997 16592 -221338 -249633 18249
14290 18249 64525 -59802 -217548 -279440 -347195 -236005 305901 468949 258754 159085
14280 159085 -6578 -176524 -415364 -498062 -295281 -222618 -109047 96035 125236 69476
14270 69476 -108799 -208074 -274782 -344064 -218576 -137700 -142139 -189302 -150805 -133570 -201532
14259 -201532 -166818 -16339 87712 14137 -6272 -244236 -301786 -223955 -418162 -271656
14249 -271656 -193597 134869 218155 149171 7777 -111055 -71968 -95856 -31736 153881 389069
14238 389069 367477 169710 348705 490707 473286 192013 -119217 -513898 -600198 -396175
14228 -396175 -603105 -379381 -286729 -161515 -216162 -244335 -160055 -70987 -133771 -155703 105169
14217A05169J84405j1624k30267k98000O8130J67763k7459J44842n9379K3363
14207F6943j04288J1698n2423m765K28765Q9877j27583Q4819K8335k0519L88954
14196E89813k19293l53835J04369M6760j86625O5090n6644j67927J05452r6237
14186a69077J03974j9285J41789J5207Q3576m8845j85794J1326K91783J09536
14176C34190k93516o6478l24585l07305M19802J28131k66916k03412P4040Q1155
14166d24894L10583N33078j92285l66210l37308K11147K4502o6820l06919M9904
14156e65222K48118k66877j06721K21945J09270R7434J8553L9717k47085l3179
14146d84047J95641j19235n291j48317j6904Q1700J03466n7167L71357L76230
$$ plain form
14217 105169 289574 277950 47683 -250317 -182187 -14424 -41883 102959 43580 66943
14207 66943 -37345 -25647 -78070 -82835 145930 235807 108224 193043 221378 200859 589813
14196 589813 370520 16685 121054 167814 -18811 46279 -10365 -178292 -72840 -169077
14186 -169077 -65103 -84388 57401 72608 156184 107339 -78455 -67129 224654 334190
14176 334190 40674 -25804 -350389 -657694 -237892 -109761 -376677 -580089 -506049 -424894
14166 -424894 -114311 418767 226482 -139728 -477036 -265889 -241387 -308207 -615126 -565222
14156 -565222 -317104 -583981 -690702 -468757 -359487 -262053 -243500 -203783 -450868 -484047
14146 -484047 -288406 -407641 -412932 -561249 -578153 -496453 -392987 -450154 -78797 297433
14136B97433j95221m28165k22334J56782J33294K40409j48193n3590k02885M2414
14126c80056n8302l34046L88044J54727K81870K54830J35428j86937K76504j02340
14116D29722j15931j35890l235P1512J32978J55310k39181l28374q5578J79541
14106F0874q4827L4273j43608j22022J01278j4172j54344Q988m762N3350R2854
14095a72118K23414J1880L99953o6422k67410j20057M3308o34658m95129J02061
14085i75178J77107K69283M18377K07179n8247l3617l64506K02244K53512k03910
14075a07756L7744J77099k7995J20327n2746r4234l6505K13744J87072J64062
14065E80812M5805Q9283j09431l02576j29632k48829J94706R8324j23385l64476
$$ plain form
14136 297433 102212 -325953 -548287 -391505 -258211 -17802 -165995 -219585 -422470 -380056
14126 -380056 -438358 -772404 -384360 -229633 52237 307067 442495 255558 532062 429722
14116 429722 313791 177901 174666 246178 379156 534466 295285 -33089 -118667 60874
14106 60874 -23953 10320 -133288 -255310 -154032 -168204 -322548 -313560 -318322 -264972 -172118
14095 -172118 51296 63176 463129 396707 129297 9240 52548 -582110 -1077239 -975178
14085 -975178 -798071 -528788 -110411 96768 38521 4904 -359602 -157358 96154 -107756
14075 -107756 -70012 107087 79092 199419 146673 52439 15934 229678 416750 580812
14065 580812 626617 715900 606469 303893 174261 -74568 120138 218462 95077 -269399
14055b69399n7986L3639K36810j69940J50143J23287J92168k07500j69372J73847
14045C5697j90551N6232J21938R5385j38022k86789q4887J39089L9522n8050j20884
14034c91320J02001J17343k7648M6580J69368J44852l2249q2768k16669j56480
14024c26990j00386n4898K50502M07453R0587l60507k68528M9117J17859k77786
14014d73577k16765M46246O9967J19564K33900J48466J34492J61295l36254O0016
14004C47350J15j43894j28929J79847k60852K10497J27807q8148k07273l49446
13994c12926O2932R1751l9501N139n4954l13622l0888j81507Q0297L63708L06520
13983b3051J14942P2581m9140N8139J20289M4026k50432J71025L71472r1601r6516
$$ plain form
14055 -269399 -327385 -293746 -56936 -226876 -76733 46554 238722 31222 -138150 35697
14045 35697 -154854 -98622 23316 118701 -19321 -306110 -390997 -251908 -212386 -270436 -391320
14034 -391320 -289319 -171976 -199624 -153044 16324 161176 128927 46159 -170510 -326990
14024 -326990 -427376 -482274 -231772 175681 266268 -94239 -362767 -313650 -195791 -473577
14014 -473577 -690342 -244096 -174129 -54565 179335 327801 462293 623588 287334 347350
14004 347350 347465 203571 74642 254489 -6363 204134 331941 243793 36520 -312926
13994 -312926 -249994 -158243 -197744 -192605 -247559 -561181 -592069 -773576 -693279 -329571 -23051
13983 -23051 91891 164472 115332 173471 293760 337786 87354 258379 629851 538250 441734
13972D41734K0868j95129R6349k0129k91025J65092Q802l46730K2243K18731k4746
13961I6060j54420K12605P2816L128j08742K4118O6634J25845j32014k87629J88581
13950A06982j24876j80791J7692P5322o0682J99401Q9174j02568j65203J78182
13940C2633J84424L4145k00932j46775M8529K7005r0635j09131J2630K26828O9087
13929H7808m14387o3047j16803l58100K14563L34605j26039L4448K86370J3378
13919a07204J66958M8467l5996l32352j85375K07624o2677j81314N9083J08752
13909c14034Q0746K92411J9806m5892k2223J27463q6549n6555r0289J69801j21940
13898d7255l93314J26231J86249J61488K86051K310k10264j26775k53255l65929
$$ plain form
13972 441734 462602 267473 363822 343693 52668 217760 226562 -120168 -97925 120806 96060
13961 96060 -58360 154245 227061 230189 121447 145565 212199 338044 206030 -81599 106982
13950 106982 -17894 -198685 -180993 -105671 -166353 33048 122222 19654 -145549 32633
13940 32633 217057 251202 50270 -96505 -47976 -20971 -111606 -220737 -208107 18721 87808
13929 87808 -326579 -389626 -506429 -864529 -649966 -315361 -441400 -406952 -120582 -107204
13919 -107204 59754 108221 72225 -260127 -445502 -237878 -300555 -481869 -422786 -314034
13909 -314034 -233288 59123 78929 33037 10814 138277 51728 -4827 -95116 74685 -47255
13898 -47255 -440569 -314338 -128089 33399 319450 321760 111496 -15279 -268534 -634463
13888f34463l02172n1282K79927M46577P6848k34486J08487J01659j32806k62339
13878f04050P7077J88181P0635m21738k72387M1455J33710R3899j46786n41K51561
13867e88984K65970N922K1900J99775J14793r6627N0395j29424n2514q8573J20561
13856a76806J77654K68259k37813J40367J45815l0841k69565q886M98317j50308
13846C56193k47421J34228q3632j09308j5297j9779Q2436j2892J11883j48135
13836D8276j27470n1683j72033J97091L45335j90358j0891j89921R0777L12426
13826B51549k34656j88758l6576m3653p4817k60965K37196j5552L5907j45211
13816d75536p3030m997L73324J11155m6937K3920J1848k5045q1884l9062p5336
$$ plain form
13888 -634463 -936635 -987917 -707990 -261413 -184565 -419051 -310564 -208905 -341711 -604050
13878 -604050 -526973 -338792 -268157 -689895 -962282 -920827 -787117 -693218 -840004 -840545 -588984
13867 -588984 -323014 -317092 -295192 -95417 19376 -77251 -26856 -156280 -208794 -297367 -176806
13856 -176806 848 269107 31294 171661 317476 286635 17070 8184 506501 356193
13846 356193 108772 243000 159368 50060 34763 14984 97420 84528 196411 48276
13836 48276 -79194 -130877 -302910 -105819 239516 49158 38267 -151654 -60877 251549
13826 251549 16893 -171865 -208441 -252094 -326911 -587876 -350680 -366232 -330325 -475536
13816 -475536 -548566 -553563 -180239 -69084 -116021 -92101 -80253 -105298 -187182 -226244 -301580
13805c01580J68900K52819r680j60538J2333K12310j74526l7853l11228k90411
13795f39454j36417J77634J42365Q1370L84365K29891P5005j92473q0885m73654
13785d32253j64004J7628K37001L98183J45202R0194J92638K11142l56440k42984
13775I6307L62033Q1744j85324m6607K4159p3509l7872r2649m3261L12980J77914
13764E75915m7102k00427J05613K5935l69690m8795k82391j92016O5646K01722
13754a65590k9490l64487l13856K36546J86648q4860K10141N561P5610L8257j62333
13743c67853M8923K07507P9160L6368j38511l8210j41092M5919q7064J47041K81190
13732G3378l78451O6221J60025q137N0888K26738L62077k1222j89029K05194Q1842
$$ plain form
13805 -301580 -132680 120139 110459 -50079 -37746 174564 38 -37815 -349043 -639454
13795 -639454 -775871 -598237 -455872 -374502 9863 239754 314759 122286 41401 -432253
13785 -432253 -596257 -578629 -341628 56555 201757 291951 484589 695731 339291 96307
13775 96307 458340 540084 354760 308153 332312 258803 220931 128282 85021 398001 575915
13764 575915 528813 328386 433999 459934 90244 41449 -240942 -432958 -367312 -165590
13754 -165590 -195080 -559567 -873423 -636877 -450229 -535089 -324948 -319387 -243777 -205520 -367853
13743 -367853 -318930 -111423 -32263 4105 -134406 -172616 -313708 -267789 -354853 -207812 73378
13732 73378 -305073 -238852 -78827 -86964 -36076 190662 552739 531517 342488 547682 629524
13721F29524m07888n29676K0993L1540q65J84068J13349M4851k43512j03839M2607
13710b18848L46285K915Q7263L32269k34142j69574k3962J9559l44178k76056
13700d78469K02686J96260k86115J40312m0408k4385O5381k66516p320L02609
13690a95965n1452k7717K95469L94713J58661j60585j13322k78092m41891j70050
13680e90231L75312M30843L4459J2400l9022m8062k16284J77005j43426l42099
13670c49105J35044N2171R3244P5056q3919p4666N3693J58761M2990J84587J49183
13659D37039k73697p2937j80422k92288M5145R9077q3462L20655K86147M0991
13649C26248j21406k06259p1864l57022k717O1832K5556m889j59024N3727K7840
$$ plain form
13721 629524 221636 -308040 -287047 -255507 -256372 -72304 41045 85896 -157616 -261455 -218848
13710 -218848 127437 130352 217615 549884 315742 146168 122206 141765 -202413 -478469
13700 -478469 -275783 -79523 -365638 -225326 -265734 -290119 -224738 -491254 -498574 -195965
13690 -195965 -247417 -275134 20335 415048 573709 413124 299802 21710 -420181 -590231
13680 -590231 -214919 215924 250383 262783 223761 175699 -40585 136420 -7006 -349105
13670 -349105 -214061 -161890 -68646 6410 -77509 -152175 -98482 60279 103269 287856 437039
13659 437039 163342 90405 -90017 -382305 -337160 -238083 -321545 -890 285257 326248
13649 326248 204842 -1417 -73281 -430303 -433020 -371188 -345632 -350521 -509545 -455818 -427978
13638d27978R8758K96582j40000Q3206J89274J86376M37990O2066k18195l35819
13628B32260k77473m0006J9521Q0800J29263o9575p8587j23451j84680l3669R1731
13617b53866J31337k26956M37241l1412k56049N5015Q2086m5649J60399J91423
13607B43569j4751l01964l22703J48695O4531j22423K74826K28507j21756k10465
13597a33934J87214R8283J8371p2855l13615J05688k45444K60373k4392M4079
13587g6232J89990l8242m9243J55241J54064Q5559L12748K6691k03105j93891
13577C63580k8344o4411r7516K8944n4694P9666p7584o9759O6861L4584j14901
13566F6426k69752K0175J88184l8425K47920j03896p2916J02690O9877P2412j62154
$$ plain form
13638 -427978 -329220 -32638 -172638 -89432 99842 286218 724208 786274 568079 232260
13628 232260 -45213 -85219 -65698 15102 144365 74790 -3797 -127248 -311928 -345597 -253866
13617 -253866 -122529 -349485 87756 56344 -199705 -144690 -62604 -108253 52146 243569
13607 243569 228818 -73146 -395849 -247154 -182623 -305046 -30220 198287 76531 -133934
13597 -133934 53280 151563 169934 97079 -216536 -110848 -356292 -95919 -120311 -76232
13587 -76232 113758 75516 26273 181514 335578 421137 733885 760576 557471 363580
13577 363580 335236 270825 173309 202253 147559 227225 149641 79882 146743 181327 66426
13566 66426 -203326 -183151 5033 -33392 214528 110632 37716 140406 210283 282695 120541
13555A20541p778l2742Q7104n4764P7638P3175k92276J64077J05621m3467k07752
13544a0623N5521R6959J87844J71456k32012n21275m05912M7232L46882R0102
13534a73826J22205L2574J21231K30013n7151J3492J67094K81993j71920n85932
13524b0227L179K44390J04616Q8497k36515l03284L21254L06565k97428q1689
13514A29358j69809J17114n1241j35272j47870p2707M871K51381j42114J15073
13504a01216m23651l1181Q4032K64686o0287k43541k89853k62895J78209L02811
13494e82886J67655K31784N6255L3048M2759o6596j4475n4134o9757o776k2744
13483b85867J59715j17993k09796J14113K28595j93576J25171K22426n7706m1623
$$ plain form
13555 120541 112763 80021 167125 112361 189999 263174 -29102 134975 240596 197129 -10623
13544 -10623 44898 141857 329701 501157 269145 -252130 -658042 -610810 -263928 -173826
13534 -173826 -51621 -19047 102184 332197 275046 288538 455632 737625 565705 -20227
13524 -20227 -17048 227342 331958 420455 183940 -119344 201910 508475 211047 129358
13514 129358 -40451 76663 25422 -109850 -257720 -330427 -325556 -74175 -216289 -101216
13504 -101216 -524867 -556048 -472016 -207330 -267617 -511158 -801011 -1063906 -885697 -582886
13494 -582886 -415231 -183447 -127192 -94144 -51385 -117981 -132456 -186590 -256347 -263123 -285867
13483 -285867 -126152 -244145 -453941 -339828 -111233 -304809 -179638 42788 -14918 -56541
13473e6541K89939K3370M4124R1558j56130K08522R6041o7754k00658n05843k65359
13462d98731K69422L20303j24894j55477O0813R7094L2297R2845L5767L13693
13452D43132L7250k75468j71028K62647L00934j87078k4648j19834l45174l10771
13442c90038K59621j59015j77002r1888q5299K86970M32446K72657O2304l52729
13432E8027l95979L3279r1486J1501P7112J3097O6123J90997K05502l8538k60646
13421a31011J42455M3239k01350o1215J2012o5665N4189K14843q0506R9935J67581
13410A94507o9309M0246j5480R0155m700J23256Q4952q7507o9325j6429J5142
13399B85508j43817r3908Q7244K92747L0782l97616k95465M0230J46039N8656
$$ plain form
13473 -56541 233398 256768 300892 392450 236320 444842 540883 473129 272471 -233372 -498731
13462 -498731 -229309 90994 -33900 -189377 -128564 -31470 827 93672 129439 443132
13452 443132 480382 204914 33886 296533 597467 410389 385741 265907 -79267 -390038
13442 -390038 -130417 -289432 -466434 -558322 -643621 -356651 75795 348452 410756 58027
13432 58027 -337952 -304673 -396159 -384658 -307546 -294449 -228326 -37329 168173 129635 -131011
13421 -131011 11444 54683 -146667 -207882 -195870 -261535 -207346 7497 -73009 26926 194507
13410 194507 125198 165444 149964 240119 235419 358675 443627 356120 286795 270366 285508
13399 285508 141691 47783 135027 427774 458556 60940 -234525 -194295 -48256 10400
13389A0400o4562Q4936O8083l55383m4529K03322J24777l97536j4010q5689J70897
13378b99294M83697r3223p0185p9038J86384j76187l51131m2464K33174L62813
13368A54546K87447j71169l49918l29712p9594K63595j03197j03501O2928Q4438
13358b84137J54775J09127K2551L27255N2580k39427k46322j533J81147J18676
13348A94692l76484j43865k72737j06723K81353n6842r841J29391p1543L01270
13338a31329R2328K8747K05262J55953k50825k75591j16723L18531r7039k0350
13328i1036J72623O8033k09253j8823J68018J22882j46037J2824K73862P1105
13318D24198k33173l81149P7463R079N817J57589j32237m11861K69841J25666
$$ plain form
13389 10400 -54162 30774 98857 -256526 -301055 -97733 27044 -370492 -384502 -470191 -299294
13378 -299294 184403 91180 20995 -58043 128341 -47846 -398977 -441441 -208267 154546
13368 154546 441993 270824 -79094 -408806 -488400 -224805 -328002 -431503 -368575 -284137
13358 -284137 -129362 -20235 2316 329571 382151 142724 -103598 -105131 76016 194692
13348 194692 -181792 -325657 -598394 -705117 -423764 -480606 -490447 -361056 -432599 -131329
13338 -131329 -39001 -10254 195008 350961 100136 -175455 -292178 26353 -70686 -91036
13328 -91036 81587 149620 -59633 -78456 89562 212444 66407 79231 353093 424198
13318 424198 191025 -190124 -112661 -103582 -97765 59824 -72413 -484274 -214433 -88767
13308h8767l09492Q611J25254k80618j44544L4936O42719L79260j75607j57162
13298C4590J24550j02193p6216Q9038J34535M162J28215L17016n14459m55095
13288c15857K28691L06306L61708q960l89060j53800m2164l77416m2849J34175
13278b99226J0423J04332M3496K61161J51692l4122j27736n6013q3248m47040
13268d76281K68171L50851r0693k16264m961j93385M4259J38909M8362J29232
13258a800m1546l6988m1880k91378K30314R2850P6538N8758K92456n1734j54923
13247A30667k35244Q7407J50488J17506Q9935R0407k8375p4170k83618j41327
13237i6324j40455K9215Q8471j01990l2144J17423J59228l2244J2428j81165k6968
$$ plain form
13308 -88767 -398259 -389648 -264394 -545012 -689556 -654620 -11901 367359 191752 34590
13298 34590 159140 56947 -19269 69769 204304 208466 336681 653697 139238 -315857
13288 -315857 -87166 219140 580848 571888 182828 29028 -13136 -390552 -433401 -299226
13278 -299226 -288803 -184471 -140975 120186 271878 237756 110020 54007 -29241 -476281
13268 -476281 -208110 142741 52048 -164216 -169177 -362562 -318303 -179394 -131032 -1800
13258 -1800 -43346 -80334 -122214 -413592 -183278 -90428 -13890 44868 337324 285590 130667
13247 130667 -104577 -17170 133318 250824 340759 431166 402791 328621 45003 -96324
13237 -96324 -236779 -207564 -119093 -221083 -253227 -135804 23424 -8820 3608 -177557 -204525
13226b04525k32938J92411L8834j59658K11008J37080R3538K12931R9401K9147
13216D17229j49026n7296K0956k8174k94363l55289Q7221L51425J17587M1735
13206A52005K08965j76933J11880j73851k38793l93218M3914K77864k26360j04353
13196e18880M22497K15641j22299R976j40205M542J27792n5403p7067j25409l19111
13185e77926j5034L91458J34832L72761K80857j95011Q1202K91484M0894p14007
13175I1510k81755J39028n6728K42355J536l7807O9827K8863N3872J72342k2626
13164D00417P3307m87466l81521J62612p7854r3684J32400J37417j41010j06145
13154c81527l6584J39971L7767l96859j11631K38689L38442K61924K37045o9523
$$ plain form
13226 -204525 -437463 -245052 -206218 -365876 -154868 -17788 75750 288681 388082 417229
13216 417229 268203 210907 231863 203689 -90674 -445963 -358742 -7317 110270 152005
13206 152005 360970 184037 295917 122066 -116727 -509945 -466031 -188167 -414527 -518880
13196 -518880 -96383 119258 -3041 6935 -133270 -128728 -936 -56339 -133406 -258815 -577926
13185 -577926 -592960 -201502 -66670 306091 586948 391937 473139 764623 805517 91510
13175 91510 -190245 -51217 -107945 134410 135946 98139 167966 196829 250701 423043 400417
13164 400417 473724 -13742 -395263 -232651 -310505 -404189 -271789 -134372 -275382 -381527
13154 -381527 -418111 -278140 -240373 -637232 -748863 -510174 -171732 90192 327237 257714
13144B57714l45567J8956J79421J68226j67222L6185n6184j03608R3051p3579
13134G393j38321l1335K0797q140K61798J4394k19123p311j60859k02903L41834
13123a21776K51310J33342L27173k52516j03183N1417n9945J2933N198k31257
13113A2696j50360j1323m9392N3371L6191k56968K3454N40755K57483j29667m2213
13102B84027j73624k02497K70250n1878j05883J17793O1936O8338j7347j68356
13092H2759J45273j30426k18642R7700J71085j60118j28127l10607L40212J58336
13082D7445P4090J18147p1644J74631j28599l18911k04899K46278K76476j22127
13072I0887j69695m3948J22886k16131n9432l66595k70147Q3432M17911N34116
$$ plain form
13144 257714 -87853 -68897 110524 278750 111528 147713 91529 -12079 80972 7393
13134 7393 -130928 -162263 -141466 -149606 112192 126586 -92537 -99848 -260707 -463610 -121776
13123 -121776 129534 262876 590049 337533 234350 285767 225822 238755 243953 12696
13113 12696 -137664 -148987 -198379 -145008 -108817 -365785 -342331 198424 455907 326240 284027
13102 284027 110403 -92094 178156 126278 20395 138188 200124 268462 251115 82759
13092 82759 228032 97606 -121036 -23336 147749 -12369 -140496 -451103 -110891 47445
13082 47445 121535 239682 168038 342669 214070 -104841 -309740 -63462 213014 90887
13072 90887 -78808 -122756 130 -216001 -275433 -642028 -912175 -828743 -410832 123284
13062A23284P3306J47879J05293J87702l58513j56252K51664l27824N1403j034
13052I6908j43813r2239R8147p7440k37740J60656J00033m1980m388K7690L01228
13041A87062P6034m03138o848L03013P9964N5214j38454K868l1729O3052j20557
13030F6481k4825r42o9576j93211n1123L5056J70945J71492K47538K37199K68576
13019H57610J2498q2393n25535k30855j24008J90199J8344m99097k87040L39428
13009c30849K41070J97323k39118J87491L4127p6932k16959k1646k74054J2948
12999d86599M4160K3837K15898r5456j16066K44739N983o2949m1719J4920R8197
12988a55055K8755J42757L5202p2468L34199J37074o1577k61258j94556J06966
$$ plain form
13062 123284 196590 344469 449762 637464 278951 122699 374363 46539 97942 96908
13052 96908 -46905 -139144 -40997 -118437 -356177 -195521 -95488 -137468 -141856 -114166 187062
13041 187062 263096 -140042 -146890 156123 236087 291301 152847 155715 123986 187038 66481
13030 66481 41656 40714 -28862 -222073 -273196 -238140 -67195 104297 351835 589034 857610
13019 857610 870108 787715 262180 31325 -92683 97516 115860 -383237 -670277 -330849
13009 -330849 -89779 107544 -131574 55917 90044 13112 -203847 -225493 -499547 -486599
12999 -486599 -442439 -418602 -202704 -298160 -414226 -169487 -163504 -226453 -268172 -253252 -155055
12988 -155055 -126300 16457 51659 -20809 313390 450464 388887 127629 -66927 40039
12978D0039P1908k7151L1622j03991l09493J96941J89273J51665l48469P439K23713
12967A23496k8893k26931J41886K40861R922j73892p5240J37159o8323j0431k23581
12956a53967j39482L016L820K12852N8696m24026Q2292J10451J46550K08092J2258
12945A20552Q0450K5236p6581q2638j7714J99694o4071N1031j09714q1749j31821
12934h7325k10525K4306J08715J32614r0415J49676q2204q3987j0234j68097K7153
12923b90323j4652R3385m1070M67089J84432j75232l93777J85705P182q9449n5230
12912a21940J79975L49777j71240j10419p7002Q2903r6657j06815j57325J64607
12902f4136J12918L80927K73938r2946k98537l037j93203j28182J83210j51615
$$ plain form
12978 40039 111947 84796 116418 12427 -297066 -100125 89148 240813 -107656 -100217 123496
12967 123496 94603 -132328 9558 250419 260341 86449 11209 148368 80045 69614 -153967
12956 -153967 -293449 -290433 -286613 -73761 -15065 -439091 -356799 -246348 -99798 108294 120552
12945 120552 201002 226238 149657 67019 49305 248999 184928 235959 126245 44496 -87325
12934 -87325 -297850 -273544 -164829 -32215 -122630 27046 -55158 -139145 -149379 -317476 -290323
12923 -290323 -304975 -211590 -252660 214429 398861 223629 -170148 15557 22739 -66710 -121940
12912 -121940 58035 407812 236572 126153 49151 132054 35397 -71418 -228743 -64136
12902 -64136 48782 429709 703647 610701 312164 309127 115924 -12258 170952 19337
12892A9337k77306L83128K89987J55319j34224r0304m80968j52255R2364J05035
12882h9887p929K4422J12657O2986p5421p8392K00541M06714m5989k04446j31399
12871A73857k5545k81998m55409R3726L18247K38903J11192R9790J1562J05572
12861C89897n3167j81024l9760P7124j04112J32624J1741P100j90685R8371K49969
12850C98078J00516J80494J36291k25915L7348J56500r4853k90039m19515J71099
12840A50004L94910J15455k28341j95852K71157k45598l55049N5923K69303L5821
12830B67733k89471k14068L91053K6596j75181K20283N4465j00276L0256j6071
12820A95319k1418p5627j18507k44742L89099L23922j42236L37p2825P7385j59403
$$ plain form
12892 19337 -257969 125159 415146 570465 436241 345937 -135031 -287286 -194922 -89887
12882 -89887 -97816 -73394 39263 102249 26828 -51564 148977 555691 509702 305256 173857
12871 173857 148312 -133686 -589095 -495369 -177122 61781 172973 272763 284325 389897
12861 389897 336730 155706 115946 193070 88958 221582 233323 240423 49738 148109 398078
12850 398078 498594 679088 815379 589464 626812 783312 688459 398420 -21095 150004
12840 150004 544914 660369 432028 236176 507333 261735 -93314 -37391 231912 267733
12830 267733 -21738 -235806 155247 181843 6662 226945 281410 181134 211390 195319
12820 195319 173901 98274 -20233 -264975 124124 448046 305810 306147 233322 310707 151304
12809A51304m42099j22120J91688J06652L91749M33809l19817k19973j63583O108
12799A3718k39340m07855q6091J62839N35575J30053j01270j0636k19729M1230
12789a81506j94213o8830N60276q2523k59892K70579L02609o5118J61346J2648
12779D55376j91113N7359m3532j28663K53550k2387j47149N170n31406J00747
12769a92048j1839J43694n9224J15008R6191K26144K685k12485k03441l40249
12759d35564p7366J04881J87709J76019K53540K76055r6012j45746j47182n0736
12749D5598j38180l44971J2668K84350J55387N2753j10318K4778j0030M5721J27427
12738A45183N7914q5820n6847K11719j08447k39898N2752J50959n4561n0436j95249
$$ plain form
12809 151304 -290795 -412915 -221227 -114575 277174 710983 391166 171193 7610 13718
12799 13718 -225622 -633477 -719568 -556729 -21154 108899 7629 -3007 -222736 -181506
12789 -181506 -375719 -444549 115727 33204 -226688 43891 346500 281382 442728 455376
12779 455376 264263 321622 278090 149427 402977 380590 233441 238611 -292795 -192048
12769 -192048 -203887 -60193 -119417 -4409 91782 317926 320611 108126 -95315 -435564
12759 -435564 -512930 -408049 -220340 -44321 209219 485274 389262 243516 96334 45598
12749 45598 -92582 -437553 -424885 -140535 14852 67605 -42713 -17935 -27965 17756 145183
12738 145183 203097 117277 60430 272149 163702 -76196 -23444 127515 72954 22518 -172731
12727a72731K6756J31252N7580k5805j01566P5961J36560K13987K9487J04016
12717D75497O6492N645j0184j35447m48951l26469K68334K06617M7237L06874
12707D55645k65259j4065j69148K2551J45406L70188J18296k42487j10819m90359
12697a80051l94956l9444M89721O3055k0079j70114n0724J96881N2334j89053
12687b42430n7280K16544L17047j27856Q9030j5652j23008L7029M02422J02824
12677E98670m24235p5697K88628p4603l52113j92751J77583K48522k1866l89708
12667b17570j86988K19477l7458k5359J9538M46261J2049j93749L95125L15726
12657G47052K2163k05111l35700l72206K6526J15625J97647R231j37868Q5216
$$ plain form
12727 -172731 -145975 -14723 42857 17052 -84514 -8553 128007 341994 371481 475497
12717 475497 541989 547634 537450 402003 -46948 -373417 -105083 101534 148771 455645
12707 455645 190386 176321 7173 29724 175130 545318 663614 421127 310308 -180051
12697 -180051 -575007 -614451 -124730 -61675 -81754 -251868 -302592 -105711 -53377 -242430
12687 -242430 -299710 -83166 233881 106025 195055 179403 56395 93424 495846 598670
12677 598670 174435 98738 387366 312763 -39350 -232101 -54518 194004 172138 -217570
12667 -217570 -404558 -185081 -222539 -247898 -228360 217901 229950 36201 431326 747052
12657 747052 769215 564104 228404 -143802 -117276 -1651 195996 205227 67359 152575
12647A52575j60795l9726M32802j09835k83241k16515O3420K30488J56629M14906
12637F40708J8666j71902j87309k92631L7106L84332m3686l13339r6130r8958
12627a23143K02463K11383p6932j86948k30108l3439K34105K4727j43162K64640
12617A43586L67401k96616n6529K43467L90869Q6339m05755j81401K442k44778
12607D9025k70711J02596J64942m8608n7886R5617L28999M6587j08286n5292q6148
12596A60835j22015m710L63915K98684J7653m55594J24215J14400J40108J72969
12586H10460k13267k80352q7951K01588k28631k94513K52142J63874j54867m53542
12576b85059j49070J01758r9297J31472J13691k05681j46193K07939M26633L10293
$$ plain form
12647 152575 -8220 -47946 384856 275021 -8220 -224735 -161315 69173 225802 640708
12637 640708 659374 487472 300163 7532 44638 428970 385284 71945 -24185 -123143
12627 -123143 79320 290703 213771 26823 -203285 -236724 -2619 22108 -121054 143586
12617 143586 510987 214371 157842 401309 792178 878517 472762 291361 293803 49025
12607 49025 -221686 -119090 45852 -2756 -60642 34975 363974 410561 302275 246983 160835
12596 160835 38820 34110 398025 696709 714362 258768 382983 497383 637491 810460
12586 810460 597193 316841 228890 430478 201847 -92666 159476 323350 168483 -285059
12576 -285059 -434129 -332371 -431668 -300196 -186505 -392186 -538379 -330440 96193 406486
12566D06486p8627l67611j20120K50037J60507L79995P0346k10010l5165j24686
12556C31152k91192o5381j40973j07628J49726J757J86938K26908m6191K27630
12546D72746j1441k04218m6673j80154l21901O651J43992N64546L52988r9907
12536F76629l14114O1492K38479l08178p2718K09289K57842j90188j80542K7849
12526D05840Q8684m81257q6795P4749l55429k82503M55501K35519j7532J47433
12516A84210K53368j6691l52663j71042k05973K575P4331J55182J39955K64669
12506C27921J6629j03657k55987L63696J95127k49580l2025M1612J81184K2223
12496E07143k03929r7685r3949K96002N0034M0421J20845j67996j83866J12350
$$ plain form
12566 406486 327859 -39752 -159872 90165 250672 630667 701013 491003 455838 331152
12556 331152 39960 -25421 -166394 -274022 -124296 -122539 64399 291307 245116 472746
12546 472746 461305 257087 210414 30260 -291641 -284990 -140998 423548 776536 676629
12536 676629 362515 424007 662486 354308 281590 490879 748721 558533 377991 405840
12526 405840 494524 13267 -73528 1221 -354208 -636711 -181210 54309 36777 184210
12516 184210 437578 420887 68224 -102818 -308791 -306216 -231885 -76703 63252 327921
12506 327921 344550 240893 -15094 348602 543729 294149 262124 303736 484920 507143
12496 507143 303214 205529 111580 407582 457616 498037 618882 450886 267020 379370
12486C79370M8534J73865r7832j86538j72459K97042J9021j90256n3595J27388
12476C44540J50256R3775J10197k73166k74340M2492k2324J20092J90881R8345
12466E80748k27302k46558r4540k83920k26446J69777L79533J44816m5029Q3834
12456B34913k741N3927K2627j08115k6177K03880K35515O5377l7874p0418L5483
12445F06397k62323o8953K4109r2914j73204K6043J44440o6464M24138O1582k26026
12434C96825n1034M4035N993J72977O06222P3226m25761p5990P7364o7387o5065
12423F91405p99452J64514R2177k6913M5893J59297L18137L43182j89465k65897
12413E32878L4560L90687K02110k49128l36883O6958k67428k8584K26207j70330
$$ plain form
12486 379370 427904 601769 503937 317399 144940 441982 461003 270747 217152 344540
12476 344540 494796 588571 698768 425602 151262 193754 171430 291522 482403 580748
12466 580748 353446 106888 12348 -271572 -498018 -328241 51292 196108 151079 234913
12456 234913 232172 286099 308726 200611 174434 378314 613829 679206 641332 570914 606397
12445 606397 344074 275121 299230 206316 33112 59155 203595 137131 561269 622851 396825
12434 396825 345791 389826 395819 568796 1175018 1248244 822483 746493 823857 756470 691405
12423 691405 -108047 56467 148644 121731 167624 326921 645058 988240 798775 532878
12413 532878 567438 958125 1160235 911107 574224 641182 373754 345170 571377 401047
12403D01047K5984r8778K59439M7183N6628q0533k56104k06441L81767R6786J66315
12392G93293J00652k4011O4696M925q1553o4701O152J196r8775k09164j41359
12381C51351K29909J16192j83852L6720J2606j01457j09073k79R0291P5374j97231
12370C20551j6007Q6388L84073L7450j93010j0793K55624j12868j41835k01754
12360D07819k8917J44412L4928J65178J88455j10886j7684L9149q3682J90775
12350I29547k9704j42590J52099J66827p4265l38498k03728J31203j82829n3331
12340C54731J72709J27261r8334j17699M5617J59580M31498q8049q2274j31353
12330G73687k66528R6966j01353k07902J61955O9379L90197M26914k2324j18596
$$ plain form
12403 401047 427031 328253 587692 634875 691503 610970 354866 148425 530192 626978 793293
12392 793293 893945 869934 934630 939555 858002 793301 799453 800649 701874 492710 351351
12381 351351 581260 697452 513600 550320 562926 461469 352396 352117 442408 517782 320551
12370 320551 304544 390932 775005 812455 619445 608652 864276 751408 609573 407819
12360 407819 378902 523314 558242 723420 911875 800989 783305 822454 738772 929547
12350 929547 899843 757253 909352 1076179 1001914 663416 459688 590891 408062 354731
12340 354731 527440 654701 556367 438668 484285 643865 1075363 987314 905040 773687
12330 773687 507159 604125 502772 294870 456825 526204 916401 1343315 1320991 1202395
12320A202395L01218M4564j81702k15218J12818R5500J7946J4021k03889l28286
12310H59367K8392J97697l29148L2109L36574J89456n80996K2479O9825k67198
12300E58557L95265J85024j61523j45797N1635l803l61360j63640K43738J40879
12290G38975J53935N9972k6768k37271k32887L65K40203K60374o348K02584N1354
12279A204488j7673j86910j34811l24014l41957K17905K99509m0805J16643L7974
12269H30349j48087J24215K03956m9016J6902r8122K0946K73420k09610o0522
12259I04431K70165R3904k5623o0637J69437O8126l95993j49153L05895L87147
12249A567699j63328k65424m17259l269J38307j78290J0697M72815J67927j90443
$$ plain form
12320 1202395 1503613 1548177 1366475 1151257 1264075 1359575 1377521 1391542 1187653 859367
12310 859367 887759 1085456 756308 788417 1124991 1314447 733451 755930 825755 558557
12300 558557 953822 1138846 977323 831526 883161 879358 517998 354358 598096 738975
12290 738975 892910 952882 926114 688843 455956 456321 696524 956898 950550 1153134 1204488
12279 1204488 1186815 999905 865094 541080 199123 417028 716537 675732 792375 830349
12269 830349 682262 806477 1010433 961417 978319 880197 901143 1174563 964953 904431
12259 904431 1174596 1268500 1242877 1182240 1351677 1419803 1023810 874657 1180552 1567699
12249 1567699 1404371 1138947 721688 718419 856726 678436 689133 1161948 1329875 1139432
12239A139432j39552L14490K22664k41084k02611J13006j12018l4915m74258K57467
12229H42621K43092J41859K2513j30707R8137j19975O7324M20617q5677k52786
12219A247018K91001O476n1778J20724Q093l31014M419K01140P5618J44007Q7013
12208A802717O9957j03742m2855K59037Q9637j20683R0800q8936R5442r1936m980
12197A954458K7039J9360j1268J11596J89581k16007J10929N4164K03504k46542
12187B196814J8930Q8425J10270K33637k12592o13223k91500L29241O39415J39604
12177B639021n8992k55035j56415J31169J57986R0939k85853l92905p5844J3180
12167A807251J72668K10750J09271l8692R7629J85595Q5653r713O2540L81414
$$ plain form
12239 1139432 999880 1314370 1537034 1295950 1093339 1206345 1094327 1059412 585154 842621
12229 842621 1085713 1227572 1250085 1119378 1217515 1097540 1164864 1585481 1499804 1247018
12219 1247018 1538019 1544495 1492717 1613441 1621534 1290520 1294939 1496079 1571697 1715704 1802717
12208 1802717 1872674 1768932 1726077 1985114 2074751 1954068 2044868 1955932 2051374 1959438 1954458
12197 1954458 1981497 2000857 1989589 2101185 2290766 2074759 2185688 2239852 2443356 2196814
12187 2196814 2215744 2304169 2414439 2648076 2435484 1822261 1530761 1860002 2499417 2639021
12177 2639021 2580029 2324994 2168579 2299748 2457734 2548673 2262820 1869915 1794071 1807251
12167 1807251 1979919 2190669 2299940 2261248 2358877 2544472 2630125 2620412 2682952 3064366
12157C064366k85369k65320j66101k8850K35325k281J0719J74487K49406j84899
12147B801483k77911K07057L07108m0580j53795j302l424l4555r0592M77110N18349
12136C708948Q5467J5921l41444k54833Q0139Q0985K6964j96684k4734L0656K02621
12125C414006j82878k81277j05796J49698J13110J99831L52853o4408o2853R2186
12115C624472j1289j35804j55891J07595P5174L29097O23871l281J97698k3494
12105D628148j96641K5860K75532M5975k92790j4113L3094K17325j9082j9297
12095D684011p718j19551j8687L31158L89150m2514J64976o757m31580K7404J75572
12084E145464J70880J29047M2707J21812J93881J16024K38984m6160l98800L8193
$$ plain form
12157 3064366 2778997 2513677 2347576 2318726 2554051 2551770 2562489 2736976 2986382 2801483
12147 2801483 2523572 2730629 3037737 2997157 2843362 2842060 2838636 2804081 2713489 3190599 3708948
12136 3708948 3794415 3810336 3468892 3214059 3294198 3375183 3402147 3205463 3180729 3211385 3414006
12125 3414006 3231128 2949851 2844055 2993753 3106863 3306694 3659547 3595139 3532286 3624472
12115 3624472 3613183 3477379 3321488 3429083 3504257 3833354 4457225 4453944 4651642 4628148
12105 4628148 4431507 4457367 4732899 4778874 4486084 4471971 4505065 4722390 4703308 4684011
12095 4684011 4676293 4556742 4538055 4869213 5258363 5215849 5380825 5374068 4942488 4969892 5145464
12084 5145464 5316344 5445391 5488098 5609910 5803791 5919815 6158799 6112639 5713839 5752032
12074E752032K68207P6496O6571J92473L05807J25939m37156N3386M31027J85930
12064G020712j7611J39454N47974P4570m34965K5741M03487M64847J05355K0536
12054H350100k84061p6664R3169P4706N31988K60011J71789M66222J79241k53185
12044I513316q5905l9370L65695M25868O01811M06807j27132k72653J07050M09704
12034A1305191O0459J09687L52474K36166J90786L71061J97723J22289j2628K48458
12024A3181666O58031M49811K63741N95054L24377J70211M13128J09621l2947
12015A6132693M15460P17698M41628L26034P39187N03478L30506L87222L34971
12006B0328877J93172Q09799N13899N74443L64994K37098M49021J25940O27347
$$ plain form
12074 5752032 6020239 6096735 6163306 6355779 6661586 6787525 6350369 6403755 6834782 7020712
12064 7020712 7003101 7142555 7690529 7765099 7330134 7355875 7759362 8224209 8329564 8350100
12054 8350100 8066039 7989375 8082544 8157250 8689238 8949249 9121038 9587260 9766501 9513316
12044 9513316 9427411 9388041 9753736 10179604 10781415 11188222 11061090 10788437 10895487 11305191
12034 11305191 11365650 11475337 11827811 12063977 12254763 12625824 12823547 12945836 12933208 13181666
12024 13181666 13839697 14289508 14553249 15148303 15472680 15642891 16056019 16165640 16132693
12015 16132693 16548153 17265851 17707479 18033513 18772700 19276178 19606684 19993906 20328877
12006 20328877 20522049 21331848 21845747 22420190 22785184 23022282 23471303 23597243 24224590
11997B4224590O71823O42872Q46533J084093Q44560P44098Q07974N26604O94819
11988C1087966P82525R41060O74610R16834J244025J564555J011263J273374R34525
11979D0430737J083981J325770J413667J693179J930287J504681J702169J573596
11971E2658067J814003K155497K447232K389964J906812K043535K302773K924139
11963G0642022K862246K580475K812914L149444L221223L437579L614743L516828
11955I5837474L671074M476862M539757M072951M568147M425175N141232N270197
11947A32002869N149268N482747N579413N374516N244034N442139N586383N336717
11939A75198086N123404M768465M476297M445242M176734L534313K921275J880589
$$ plain form
11997 24224590 24896413 25539285 26385818 27469911 28314471 29058569 29866543 30393147 31087966
11988 31087966 31870491 32811551 33486161 34402995 35647020 37211575 38222838 39496212 40430737
11979 40430737 41514718 42840488 44254155 45947334 47877621 49382302 51084471 52658067
11971 52658067 54472070 56627567 59074799 61464763 63371575 65415110 67717883 70642022
11963 70642022 73504268 76084743 78897657 82047101 85268324 88705903 92320646 95837474
11955 95837474 99508548 103985410 108525167 112598118 117166265 121591440 126732672 132002869
11947 132002869 137152137 142634884 148214297 153588813 158832847 164274986 169861369 175198086
11939 175198086 180321490 185089955 189566252 194011494 198188228 201722541 204643816 206524405
11931B06524405J768724J076329M46993k13755p69238j144411j618411k291183
11923B03779453k926148l405023l781478m125160m550681m629130m398128m551572
11915A71412133m926615m856970m469728m419190m615809m696454m351581m280575
11907A34795211m104895l997099l675566l960879l898853l642418l393182l393664
11899A04728655l033187k863754k813534k790288k790692k669852k575060k360479
11891H2831809k525848k408445k343692j954648j671375k060040k370840k077821
11883F5419100j805073j927121j903426j429278j623988j960614j572760j334185
11875E1862655j276236r68233j216454j841579j453556j207477j140972p04804
$$ plain form
11931 206524405 208293129 209369458 209816451 209602696 208833458 207689047 206070636 203779453
11923 203779453 200853305 197448282 193666804 189541644 184990963 180361833 175963705 171412133
11915 171412133 166485518 161628548 157158820 152739630 148123821 143427367 139075786 134795211
11907 134795211 130690316 126693217 123017651 119056772 115157919 111515501 108122319 104728655
11899 104728655 101695468 98831714 96018180 93227892 90437200 87767348 85192288 82831809
11891 82831809 80305961 77897516 75553824 73599176 71927801 69867761 67496921 65419100
11883 65419100 63614027 61686906 59783480 58354202 56730214 54769600 53196840 51862655
11875 51862655 50586419 49618186 48401732 46560153 45106597 43899120 42758148 42053344
11867D2053344j134975j021607j214224j108566q79414j362102q44395q83026
11859C3605035j052645p47138o38191o87681o97075p46429p11806n77756p21865
11850B7024449r20818o30153l49695n97516n09219o40428o53934k32911n21655
11841B1968120n68786n37140m79597l06151m38066k33399n80689m78952k93740
11832A8051600n41170n36318k12503j57014k23229l70724k11480l41799m24024
11823A5033339k38046k08515j9552k31374n53425l99857k52598j87877k95246
11814A2646849l44531l05522r2695j70378j69302o5004j18672k73375m17139l35022
11804A0355209j96348K63368n58k22101m23487J45519r285l70224l00706j11257
$$ plain form
11867 42053344 40918369 39896762 38682538 37573972 36694558 35332456 34488061 33605035
11859 33605035 32552390 31805252 31167061 30479380 29782305 29035876 28324070 27746314 27024449
11850 27024449 26103631 25473478 25123783 24526267 24017048 23376620 22722686 22489775 21968120
11841 21968120 21399334 20862194 20382597 20076446 19638380 19404981 18824292 18345340 18051600
11832 18051600 17510430 16974112 16761609 16604595 16381366 16010642 15799162 15457363 15033339
11823 15033339 14795293 14586778 14567226 14335852 13782427 13382570 13129972 12942095 12646849
11814 12646849 12302318 11996796 11904101 11733723 11564421 11499417 11380745 11107370 10690231 10355209
11804 10355209 10158861 10422229 10421671 10199570 9776083 9921602 9912317 9542093 9241387 9130130
11794I130130l47014j35763m31409j56840J61419j89112j22346M5368r5364k69481
11784G589588J77128j42085k02674N1171J76462P3996j62818p50532k35133K97134
11774F872237O5233p6424j7801O6386n62359m58263k38139R9140k18323J37761
11764E669448Q5448J91394r4702J36321K47603l43009l18526M917k0520j9264
11754E539110Q5031M4251k08774P6733L832m65323k31340J12503Q7507J12064
11744E155594J03386k48498p3392j58866j88404K38101k07891l56095n4849J55612
11734D364698j9799M1495k2118k3571n096K4687j53340j79757n5967j45776k74538
11723C550918M1659L49815K53907j18757M5065L0791J70640j24626o5943K02980
$$ plain form
11794 9130130 8783116 8647353 8215944 8059104 8220523 8031411 7909065 7954433 7859069 7589588
11784 7589588 7766716 7624631 7421957 7473128 7649590 7723586 7560768 6810236 6575103 6872237
11774 6872237 6937470 6861046 6843245 6909631 6347272 5889009 5650870 5750010 5531687 5669448
11764 5669448 5754896 5946290 5851588 5987909 6235512 5892503 5573977 5578894 5558374 5539110
11754 5539110 5624141 5668392 5459618 5536351 5540183 5074860 4843520 4956023 5043530 5155594
11744 5155594 5258980 5010482 4937090 4778224 4589820 4827921 4620030 4263935 4209086 4364698
11734 4364698 4344899 4386394 4364276 4340705 4335609 4360296 4206956 4027199 3971232 3825456 3550918
11723 3550918 3592577 3942392 4196299 4077542 4122607 4153398 4324038 4199412 4133469 4336449
11713D336449M6060m68689m20252k04829o2752q8412N1187k35851J65973Q8646
11703C207530L17036j17368n4671k25389K7985N9331J22701j66647j26400m5168
11693B998940J2062N4017J85007k07261k73294J41866N1960l42527j40422Q2758
11683B563106j98676m0535J20295Q0562K36804j09333k06930n5384J96372M47021
11673C033302K46948k47040k57889m58966j96301N88334J73605r623l0637j23057
11663B718676q3576l42499m9613J71418j78782k63353p540J16216j4554J18571
11653B184964R8491j57137J16731J47377k20321p9558K57252p1404k28321K17018
11643B265092o1385P5207p7515J34894J76583Q1236j40512j24382k17251N0004
$$ plain form
11713 4336449 4382509 3913820 3493568 3288739 3225987 3137575 3188762 2952911 3118884 3207530
11703 3207530 3524566 3407198 3352527 3127138 3155123 3214454 3337155 3170508 3044108 2998940
11693 2998940 3011002 3065019 3250026 3042765 2769471 2911337 2963297 2620770 2480348 2563106
11683 2563106 2364430 2323895 2444190 2524752 2761556 2652223 2445293 2389909 2586281 3033302
11673 3033302 3280250 3033210 2775321 2316355 2120054 2708388 2881993 2872370 2841733 2718676
11663 2718676 2635100 2292601 2242988 2414406 2235624 1972271 1964731 2080947 2066393 2184964
11653 2184964 2283455 2126318 2243049 2390426 2170105 2090547 2347799 2276395 2048074 2265092
11643 2265092 2203707 2278914 2201399 2336293 2512876 2594112 2453600 2329218 2111967 2161971
11633B161971m0995j39652j10538J53196j04534j40034j97482J19334L49161J4222
11623B064649J14754P9691r6186p487j82873j62180j3588k50773r9933n3897j57858
11612A234319k77310j207K85040L95695L73163n5227j61101m4049j49313k13596
11602A386414j12466K41010m6974k53312O6469R1334R7588j82209n1217L08432
11592A545069l6628J17071n1158k23016j38704k76150N146L84528M38031P2106
11582A836295j1163l38474k40701j61472M18186j02370k52793q7182M47779j19641
11572A388464k80922L7438k20683M13251j6973j53590r951q0377J25186J43428
11562A345271K36512M1749j43537k92769K6518P9614J7018l6506j4753j18633
$$ plain form
11633 2161971 2120976 1981324 1870786 2023982 1919448 1779414 1581932 1701266 2050427 2064649
11623 2064649 2179403 2259094 2162908 2155421 1972548 1810368 1796780 1546007 1446074 1392177 1234319
11612 1234319 957009 955802 1240842 1636537 2009700 1954473 1793372 1749323 1600010 1386414
11602 1386414 1273948 1514958 1467984 1214672 1281141 1372475 1470063 1287854 1236637 1545069
11592 1545069 1508441 1625512 1574354 1351338 1212634 936484 941630 1326158 1764189 1836295
11582 1836295 1825132 1486658 1245957 1084485 1502671 1400301 1147508 1060326 1508105 1388464
11572 1388464 1107542 1144980 924297 1337548 1320575 1166985 1157034 1076657 1201843 1345271
11562 1345271 1581783 1623532 1479995 1187226 1213744 1293358 1310376 1273870 1259117 1140484
11552A140484k3420R4519K5947n2434o0005j87970j51896M2454O35453n5277l80133
11541A027722k38450Q1378J090k0964j37580j9521J89685p4833o01988L3862K99383
11530E39784J20427r7299J62558N16015O9043k0826k08099k21242L18172j96722
11520I81811j46369K27287J16450M4501o2890k07941j08595R3081k14041m5291
11510F78003M8822p8238J20979N83733j98659k75377L21023J02431r2650j37586
11500A072481k11467J55447N8615r2472j46522m3961P297j22598j72621K72620
11490G76819Q4552L2328k46198k05861L16533K34951k35352j33358j9209J58126
11480G63331K079l5307K3344J5571j9324J99419k23528l02707J56559l6460l38036
$$ plain form
11552 1140484 1117064 1211583 1237530 1185096 1125091 937121 785225 827679 1463132 1407855 1027722
11541 1027722 789272 870650 871740 850776 713196 693675 883360 808527 206539 240401 539784
11530 539784 660211 562912 725470 1241485 1310528 1289702 1081603 860361 1178533 981811
11520 981811 835442 1062729 1179179 1223680 1160790 952849 844254 937335 723294 678003
11510 678003 726825 648587 769566 1353299 1154640 879263 1200286 1302717 1210067 1072481
11500 1072481 861014 1016461 1075076 982604 836082 792121 799418 676820 504199 776819
11490 776819 861371 893699 647501 441640 758173 993124 757772 624414 605205 763331
11480 763331 765410 730103 753447 769018 749694 949113 725585 422878 579437 542977 204941
11469B04941K74080K68087q0162K21500j23O8357r5956j67318J13475j37214k5685
11458F43982O1400j04178K83418J24315j55451J39036j51078j36958J45431o3429
11448G86488O2583j152l6543k38946k67332j17604J14155R6355K20269j03708
11438E14565j84301K58195k06716j56459L47486K39317K25196m8089r6612o2324
11428H30258l07620p3652J55485K1590k17512r6690J84973k25453j8551K84618
11418E37446K72428J09746p3293P806J4196J19145N407J40764J47726k56560m4410
11407I80401l31407j07046l29525J92752N13035J26387k80264J56268j41817l46395
11397D32389J54261L24317R0056n7648k53623n2421k04591j16721k2805j85044
$$ plain form
11469 204941 479021 747108 666946 888446 888323 956680 860724 693406 806881 669667 643982
11458 643982 705382 601204 884622 1008937 853486 992522 841444 704486 849917 786488
11448 786488 849071 847919 811376 572430 305098 187494 301649 398004 618273 514565
11438 514565 330264 588459 381743 225284 572770 812087 1037283 989194 892582 830258
11428 830258 522638 448986 604471 626061 408549 311859 496832 271379 252828 537446
11418 537446 809874 919620 846327 854133 868329 987474 992881 1133645 1281371 1024811 980401
11407 980401 648994 541948 212423 405175 918210 1044597 764333 920601 778784 432389
11397 432389 586650 910967 1001023 943375 689752 637331 432740 316019 293214 108170
11387A08170J85038M00222J30056j86460l67699K9723K35001J89726j72253o3766
11377D87758j54858n4712J04865Q5935J44254j47406k62404J51114K74475k28424
11367D00597R1720K0078m6339o0951k49181L26358N00674Q6135l01587k03271
11357E64233j85362m13051l8558J61183J67360L19937K66210Q462N0842J9249
11347I20505l28436J07813J82436k11109l36122J63965J86255j51931j86817O0651
11337D07210K3103l05039k62977J09419K17949l47117K9126J37471k33855K13599
11327a1111K14917j79619O6256j78747j35318L11068J05730M9560L77088O2984
11317F82808k18930k47603k3938J92627J04052k51379k22013j44462j9089N28930
$$ plain form
11387 108170 293208 693430 823486 637026 269327 299050 534051 723777 551524 487758
11377 487758 332900 278188 383053 468988 613242 465836 203432 354546 629021 400597
11367 400597 492317 512395 466056 405105 155924 482282 982956 1069091 767504 564233
11357 564233 378871 -34180 -72738 88445 255805 575742 841952 850414 901256 920505
11347 920505 592069 699882 882318 671209 335087 499052 685307 533376 346559 407210
11337 407210 430313 125274 -137703 -28284 189665 -157452 -128326 9145 -224710 -11111
11327 -11111 203806 24187 90443 -88304 -223622 87446 193176 242736 619824 682808
11317 682808 463878 216275 192337 384964 489016 237637 15624 -128838 -147927 381003
11307C81003J67604j97232k9981M870R0959M6614j41122k45884j65257j08707
11297a97133J87294J08734Q1010J18470J38702M211l10127K7516J73453m587N937
11286C33480r5525N094M3028j32162K4847J27067J54212j09816M9742K42982J64685
11275H07634j20897k52855o56674J28394L04236K69688K5284L7413m84544j50091
11265i2412K84117Q107O481M2448J70877l9547L1663J99647m05133k4248J50493
11254C32493j61999J03424m3863j41700J47219L40513J28258j86770k43348K09940
11244D84167P3916m3491j93372l09337O945R2052j7853j25387l20690J54886K11926
11233A3762K83747m0121j03844l1769J45380J34611j92546j26501o5737J17121
$$ plain form
11307 381003 548607 351375 321394 326264 417223 463837 322715 76831 -88426 -197133
11297 -197133 -9839 98895 179905 298375 437077 441288 131161 158677 332130 327543 333480
11286 333480 237955 243049 286077 153915 178762 305829 460041 350225 399967 642949 807634
11275 807634 686737 433882 -222792 -94398 209838 479526 504810 542223 57679 -92412
11265 -92412 191705 199812 206293 248741 419618 380071 411734 611381 206248 182000 332493
11254 332493 170494 273918 230055 88355 235574 576087 704345 517575 274227 484167
11244 484167 558083 514592 321220 11883 18828 110880 93027 -32360 -353050 -198164 13762
11233 13762 297509 257388 153544 121775 267155 401766 209220 82719 16982 134103
11223A34103J37748k633j99423l8118K48602p1577p823L32713o4738j38400j07519
11212B22935j0427k5857k50029m20319J72890N31761J73157j71323k75052L724
11202d8540j0453K7863r5099j08184l644j57113k26863K64851J53697K45540R0919
11191A32974j00645j96559j64644J74492K4156j51832m2967J54852J70271N7004
11181E7102l6504l69246j41654P5990K85682K18780p660j70381o596J76315K05252
11170B87080r3258J92155P3225p3900j97707m4147N4040K8063N0775j05606j65812
11159D908K99698K25685j37674q0337J56370j17245Q0918k87675l44344J96224
11149c472K08539k10128l68204J09315M43178j77446k14145Q779K82297r2785
$$ plain form
11223 134103 271851 269218 69795 31677 280279 208702 200879 533592 468854 330454 222935
11212 222935 212508 186651 -63378 -483697 -310807 220954 394111 222788 -52264 -48540
11202 -48540 -58993 -31130 -126229 -234413 -238057 -395170 -622033 -357182 -203485 42055 132974
11191 132974 32329 -164230 -328874 -154382 -130226 -282058 -325025 -170173 98 57102
11181 57102 20598 -348648 -490302 -414312 -128630 90150 82490 -87891 -94487 81828 287080
11170 287080 193822 385977 459202 385302 187595 143448 197488 225551 276326 170720 4908
11159 4908 304606 530291 392617 312280 468650 351405 432323 144648 -199696 -3472
11149 -3472 205067 -5061 -373265 -263950 179228 1782 -212363 -203584 78713 -14072
11139a4072m082K5447l1662J21154L37816O1273K2566m8469r0299o3690j88166
11128A27816J33364O6892j10935k24852k56598j06008J49997K38784j00016k64777
11118c46333P1948Q5416k07105j10944j69394J74579J91805K7851k22454Q1940
11108d22691L23183j92661N017J51979k35442k44539J37651L14647J42049J00936
11098H0129r1903J73029j17229l11055o7981J6070J28581m379L12876L3894j95405
11087d3373n6426j35791J54679j9606k53632J05120L65769j16195O8055K65161
11077C33761J7323o5911K1265L4295L3524N9345j20485k45476m3088P1066L18052
11066D13671j49754l67782k00350j75156O0107R1806K39396J01971J43902J18496
$$ plain form
11139 -14072 -18154 7293 -24369 96785 434601 495874 518440 469971 379672 315982 127816
11128 127816 261180 328072 217137 -7715 -264313 -370321 -220324 18460 -81556 -346333
11118 -346333 -274385 -188969 -396074 -507018 -676412 -501833 -310028 -282177 -504631 -422691
11108 -422691 -99508 -292169 -287152 -135173 -370615 -615154 -477503 -162856 -20807 80129
11098 80129 -11774 161255 44026 -267029 -335010 -318940 -190359 -194738 118138 152032 -43373
11087 -43373 -99799 -235590 -80911 -100517 -354149 -249029 116740 545 68600 333761
11077 333761 351084 285173 306438 340733 374257 433602 313117 67641 24553 95619 413671
11066 413671 263917 -103865 -304215 -479371 -419264 -327458 -88062 13909 157811 276307
11056B76307j56566j92621l22639K50793K15308q4695j22499K47388L36911K42345
11046F90032M11041J10716j25951n830n6233j81504n0385k75132K1689J10069
11036F48512J29376K90055J36464N78947J84950j11544l14091J12292K19154j74120
11026A699995j35351M03895J25345J10878J0963L37100J56375j77486j48446j12600
11016B270668m01061L7347l44494j56024K8461j80809J69323K00289J25156r9097
11006A649759j87174k82705j51264j21054j75283K53674j33334k02735N15002
10997A164886O45730L2715l40596j83838j82868l95190J04520K70591k50317j86606
10987F79027k4990j06446j61925j43164J33546R3443j0357j55079k2700K45826
$$ plain form
11056 276307 119741 -72880 -395519 -144726 70582 -14113 -136612 110776 447687 690032
11046 690032 1101073 1211789 1085838 1080008 1023775 842271 791886 516754 538443 648512
11036 648512 777888 1067943 1204407 1783354 1968304 1856760 1542669 1654961 1874115 1699995
11026 1699995 1564644 1968539 2093884 2204762 2215725 2552825 2709200 2531714 2383268 2270668
11016 2270668 1869607 1906954 1562460 1406436 1434897 1254088 1423411 1623700 1748856 1649759
11006 1649759 1462585 1179880 1028616 907562 732279 985953 852619 649884 1164886
10997 1164886 1810616 1843331 1502735 1318897 1136029 740839 845359 1115950 865633 679027
10987 679027 654037 547591 385666 242502 376048 469491 459134 304055 281355 527181
10977E27181L80409K61118j47874k56007k98724k60040K01893j98316k15540J71483
10967A65583J08279J94201L06468J55288j42522j38819k61023j78277r6818l0549
10957H1811K80888K7295N2757l193r363j35232j12730j32466l0905L36413m347
10946C50928J37508O4430j52895m42702k94697k19268l342J0965J72278J23508
10936b53287J50256J30876l44777j16657K39050j8941J07999j39290n6968k74307
10926e76046k1340L21747M16948q4535k47254j60838n7829j4271k27374O7415
10916e83377K10752M72176k7963q8522o0444j65637J65995j25531k1259j33716
10906c57526M3245L457K13444L69234P3082J43333M21769k72982n03135k7770
$$ plain form
10977 527181 907590 1168708 1020834 764827 466103 206063 407956 209640 -5900 165583
10967 165583 273862 468063 774531 929819 787297 648478 387455 209178 112360 81811
10957 81811 362699 389994 442751 439558 430195 294963 182233 49767 18862 355275 350928
10946 350928 488436 552866 399971 -42731 -337428 -556696 -560038 -549073 -376795 -253287
10936 -253287 -103031 27845 -316932 -433589 -194539 -213480 -105481 -244771 -301739 -576046
10926 -576046 -597386 -275639 141309 56774 -190480 -351318 -409147 -423418 -650792 -583377
10916 -583377 -372625 99551 71588 -16934 -77378 -243015 -77020 -202551 -223810 -357526
10906 -357526 -314281 -310824 -97380 271854 344936 488269 910038 637056 133921 106151
10896A06151L52782j37452r7364r9158k4379L40678J89189O7334k74225k79117
10886A44439M5086q1081k85229j70586m4026J16151K84594J27288R186o618J33840
10875B73044J74213J08745J84850k46163j35073J6958j31410j51621r1116j07719
10865a05292L3482J87126j96539K40429J28356r0892k07273k1967K20582Q5693
10855B73705J75438k52320k12865J63867J91224k9512J61112o4496p200K0005
10845D18958J63954m485J15041p9955r8926J34602M7221l13937R3171k4917j17772
10834C32955j45725K90778n9567l56753r2674L34890L6222j84256K36660J74500
10824E67030j47006j3164j94638j46546J53541J89482R2491J77508j31484l83444
$$ plain form
10896 106151 458933 321481 224117 124959 100580 441258 630447 697781 423556 144439
10886 144439 189525 108444 -176785 -347371 -391397 -275246 9348 136636 145822 139204 273044
10875 273044 447257 556002 740852 494689 359616 376574 245164 93543 2427 -105292
10865 -105292 -71810 115316 -81223 159206 287562 196670 -10603 -32570 188012 273705
10855 273705 449143 196823 -16042 147825 339049 309537 470649 406153 398953 418958
10845 418958 582912 578427 693468 613513 514587 649189 696410 382473 475644 450727 332955
10834 332955 187230 478008 418441 61688 -30986 303904 340126 155870 392530 567030
10824 567030 420024 406860 212222 65676 219217 408699 501190 678698 547214 163770
10814A63770k01011J90092J35453K76897j6382l7115Q164j19241l96516k17219
10804b13108J68435L93826J1015j1473j57394j80690J46679J03921j52951k01027
10794i2767Q0636O3867r6762k16635P948N9114J11138J66764K64218j68016p449
10783A72056R1221l29947J36518Q743k1106J51493K33303k5208K2274l0699l45378
10772F3270J16546j97792J33718L26709J35755p1752m31753J2987J56047j50141
10762I3594q7696K19885L29223k06894k49702N3029J00864K15835j95877k89971
10752a7710K03153O2145K4382J86740K21779J3711J7648O8815k95213J57490O0116
10741G03056n2158j0578N3392K00477J30222J4474j25149k53489O7029j50016
$$ plain form
10814 163770 -37241 152851 288304 565201 548819 511704 519868 400627 4111 -213108
10804 -213108 -44673 349153 360168 348695 191301 10611 157290 261211 108260 -92767
10794 -92767 -12131 51736 -45026 -261661 -253713 -194599 -83461 83303 347521 179505 172056
10783 172056 263277 -66670 69848 78591 57485 208978 442281 417073 439347 408648 63270
10772 63270 179816 -17976 115742 442451 578206 506454 74701 87688 243735 93594
10762 93594 5898 225783 555006 348112 98410 151439 252303 468138 272261 -17710
10752 -17710 185443 247588 271970 458710 680489 694200 711848 780663 485450 642940 703056
10741 703056 650898 640320 693712 894189 1024411 1038885 913736 660247 727276 577260
10731E77260J13825R2372j81865l10545j7799K06567K4508J38140M42791j07777
10721I77477k39472r2052K66263l08720j61134j4871R7106L24472K25969J11198
10711A186236j02751J3300m5124j64876p9066l9102j32191N8853j18528O4114
10701F40865L58409k31283j70997N5055M30712K24815k60158l87473R9852J30524
10691H90321l26427k60212o5122L64879L04807k5406J84316L6110q0832k21270
10681H01164p7624p9834N41057M48096j78540m12566O1980J01022J77167L28235
10671A710157M35365J39879k58000k97479p36M25456Q7515L7328K23809L72175
10661B875469k39675k72559K85520J30057m6952L943L14331L54100L55203K79841
$$ plain form
10731 577260 691085 783457 601592 291047 273248 479815 504323 642463 1085254 977477
10721 977477 738005 645953 912216 603496 442362 427491 524597 849069 1075038 1186236
10711 1186236 1083485 1096785 1051661 886785 807719 768617 636426 695279 576751 640865
10701 640865 999274 767991 596994 652049 1082761 1307576 1047418 659945 759797 890321
10691 890321 563894 303682 238560 603439 908246 882840 1067156 1103266 1022434 801164
10681 801164 723540 643706 1184763 1632859 1454319 1041753 1103733 1204755 1381922 1710157
10671 1710157 2145522 2285401 2027401 1729922 1729186 2154642 2242157 2279485 2503294 2875469
10661 2875469 2635794 2363235 2648755 2778812 2731860 2735803 3050134 3404234 3759437 4039278
10651D039278J1664j2603K01694p7208J97778K58307K02557K82631M89982M53246
10641F047326J95478r6204J86028N83584P62019L97041O14055P08382N55100Q21959
10631A0774768J203824R61118Q36449J014870J419864J317233J788540K473017
10623B1789683K986357M022623N291422O791366R126873J1586661J4752925J8017920
10615I4365830J9544993J8017640J2367205M058867j586651k432245o92568L427611
10607A47070682R464852J7199766K5679051L3983721L8504566L3912651J6435318
10600C22250607n165387j7150634j8813144j3640237m501879O780913J8707957
10593B88468196L1080050M2227150M6603928L6053880P627654k3396607l9303731
$$ plain form
10651 4039278 4050942 4038339 4240033 4162825 4360603 4618910 4821467 5104098 5594080 6047326
10641 6047326 6242804 6146600 6332628 6916212 7678231 8075272 8689327 9397709 9952809 10774768
10631 10774768 11978592 12939710 13776159 14791029 16210893 17528126 19316666 21789683
10623 21789683 24776040 28798663 34090085 40881451 50008324 61594985 76347910 94365830
10615 94365830 113910823 131928463 144295668 148354535 146767884 144335639 143643071 147070682
10607 147070682 156535534 173735300 199414351 233398072 271902638 305815289 322250607
10600 322250607 317085220 299934586 281121442 267481205 262979326 269760239 288468196
10593 288468196 319548246 361775396 408379324 444433204 452060858 428664251 389360520
10586C89360520m0539500l3309175k3005199j1020460J218950J1797844K0023125
10579C14526105K2390544J3238187o891975k6325355l4921421l3613432k7789854
10572B20612799j9886451j2099627n486923j98917L095485L241677q89593q608270
10564A79780180j5968802j9332858j8470781j6039460j2967207j0265024p978346
10557G8757702o681146n116785m098537l370512k808813k333785k674342k845774
10549D8828008k172483k040038j574781j378078j368970j164159j188907j428994
10541C6511598j569482j336512j359076j571706j166723r43408j198070j094564
10533B6272057r45406j004905j040068q15992r79221o33026r91460q54260p34408
$$ plain form
10586 389360520 348821020 315511845 292506646 281486186 282705136 294502980 314526105
10579 314526105 336916649 350154836 343262861 316937506 282016085 248402653 220612799
10572 220612799 200726348 188626721 183139798 182940881 186036366 189278043 188388450 179780180
10564 179780180 163811378 144478520 126007739 109968279 97001072 86736048 78757702
10557 78757702 72076556 66959771 62861234 59490722 56681909 54348124 51673782 48828008
10549 48828008 46655525 44615487 43040706 41662628 40293658 39129499 37940592 36511598
10541 36511598 34942116 33605604 32246528 30674822 29508099 28564691 27366621 26272057
10533 26272057 25326651 24321746 23281678 22465686 21486465 20853439 19861979 19007719 18273311
10524A8273311r33610r32008p46109j120788p81702m76237o88708n66952l84586
10515A1642611m56870l99132m02385o11706Q1819L3496n97460n87069p80701j97867
10505G724736j26854o2536m33511l88622k31354k98281o78081l65342J3031K13461
10495E366647k05205L2767K9501k66494m15932r1556j37874k74031j43537m60982
10485C433304m4631K42867L00175j06562m43067l7142R4308m5590N5690K03094
10475C652446r1748k23514j62952K9510L1344j80897J33879K02819m02143k48266
10465B740478J16756j52611k47018L4185j37792Q8055k59089m59050k47325J76474
10455A653063K20815j52080j98488O2869r4433k02519j84640j5635K8174J14400
$$ plain form
10524 18273311 17339701 16407693 15661584 14540796 13759094 13282857 12594149 12027197 11642611
10515 11642611 11185741 10786609 10384224 9772518 9854337 9887833 9290373 8703304 7922603 7724736
10505 7724736 7597882 7535346 7101835 6713213 6481859 6183578 5505497 5140155 5153186 5366647
10495 5366647 5161442 5194209 5223710 4957216 4541284 4449728 4311854 4037823 3894286 3433304
10485 3433304 3388673 3631540 3931715 3825153 3382086 3344944 3439252 3393662 3449352 3652446
10475 3652446 3560698 3337184 3174232 3203742 3235086 3054189 3188068 3390887 2988744 2740478
10465 2740478 2857234 2704623 2457605 2491790 2353998 2442053 2182964 1723914 1476589 1653063
10455 1653063 1873878 1721798 1523310 1586179 1491746 1289227 1104587 1088952 1117126 1231526
10445A231526j27250k10436k4020K42676R2676J04061K1483j53037l08209J76188
10435A045658M41289p3382j97672j00825m38649j91042J06977L19636O17474J91180
10425A720644k60943k4748j25640j76796k6345j0527k7545J81532k21138M9468
10415A077962M91121l4661j30291j31066K20340j53029l50275j49284M69212J92477
10405A502506n1241J6301l00925l1732K54595k03981J10416L7671j0578J59297
10395A482329L22105P4540j35376m3082J5779j86574r3699M2837K47533j55421
10385A570971k86648J41455L25531j49582l01318M4109J64897K75926j29790o5694
10375A589857r4431m4717k40509K2576l17218m65646L55065J46793Q4710R350
$$ plain form
10445 1231526 1104276 893840 869820 1112496 1205172 1309233 1330716 1177679 869470 1045658
10435 1045658 1486947 1413565 1215893 1115068 676419 485377 592354 911990 1529464 1720644
10425 1720644 1459701 1434953 1309313 1132517 1106172 1095645 1068100 1249632 1028494 1077962
10415 1077962 1569083 1534422 1404131 1273065 1493405 1340376 990101 840817 1310029 1502506
10405 1502506 1451265 1467566 1166641 1134909 1389504 1185523 1295939 1333610 1323032 1482329
10395 1482329 1804434 1878974 1743598 1700516 1716295 1529721 1436022 1478859 1726392 1570971
10385 1570971 1284323 1425778 1751309 1601727 1300409 1344518 1509415 1785341 1655551 1589857
10375 1589857 1495426 1450709 1210200 1232776 915558 449912 804977 951770 1036480 1045830
10365A045830j6683J56039K4615O2467o8356k87946N6657j46861J60348K55205
10355A241315K30792j98408k62637j75357l66446j98392K15636K94202M25387
10346A206092J47878k11253k6687p6009j08363k08174K82404N53136m25557l59099
10336G74368p0647K01033l22362n4296j4856J91435M86737k0274l9417j86351
10326I45370j46857l8088j30397j15772J5240l2359k03489J9923L7737p8044L8044
10315C11308K33158K80712J60902m9010l83822k90458K09309j2993j16869j46065
10305A96172o2390J81251K70815K01157j00183m21348q1934k1870J03882L816
10295B69368r8830K94179n0299m1701K90558P9143J60859k2618q7345P2062L15096
$$ plain form
10365 1045830 1029147 1185186 1209801 1272268 1203912 915966 972623 825762 986110 1241315
10355 1241315 1472107 1273699 1011062 835705 469259 270867 486503 780705 1206092
10346 1206092 1353970 1142717 1116030 1040021 931658 723484 1005888 1559024 1133467 774368
10336 774368 703721 904754 582392 528096 513240 704675 1191412 1171138 1131721 945370
10326 945370 798513 760425 630028 514256 529496 497137 293648 313571 351308 273264 311308
10315 311308 544466 825178 986080 937070 553248 262790 472099 459106 342237 196172
10305 196172 133782 315033 585848 787005 686822 265474 183540 161670 265552 269368
10295 269368 170538 464717 414418 372717 663275 742418 903277 880659 793314 865376 1180472
10284A180472k85922m63401q2822J03662p6718n7728q6515m19993O5073J58408
10274C4516r3008L56897M41226J11741q8824k12602j58026p393J713l1337l74042
10263a9139j08153J67728L84699j63468L5406R0971M7567q9744j18004P6510J79889
10252D84262n4479M09829L37887k19538k46387j02156J11288J21106j19254m02228
10242C20330Q0199k04305l67069K61944q567K89596K91515j26248k89285k09095
10232C9015L155K23546J75757Q0415J80394j99307k45968p1469K99433L27250
10222H12221J17063k72366n18837j25562J39421l10639j92047L45375K14920J14053
10212C23602k5653M2657K51533j05713N7393L06492Q2097j76794o0621p113K54082
$$ plain form
10284 1180472 894550 431149 348327 451989 375271 317543 231028 -188965 -123892 34516
10274 34516 -58492 298405 739631 851372 762548 549946 391920 384527 386240 354903 -19139
10263 -19139 -127292 40436 425135 261667 297073 388044 435611 345867 227863 304373 484262
10252 484262 429783 839612 1177499 957961 711574 609418 720706 841812 722558 320330
10242 320330 400529 196224 -170845 91099 82532 372128 663643 537395 248110 39015
10232 39015 42170 265716 441473 521888 702282 502975 257007 185538 484971 812221
10222 812221 929284 656918 138081 12519 151940 -158699 -350746 -5371 209549 323602
10212 323602 297949 340606 592139 486426 543819 850311 932408 755614 694993 687880 941962
10201I41962p0149j06042k44283k58527j25738L40163M20779M7627j23184l94247
10191D28361j73400M6319j29766K1997J36332J5588r0978J57866n8064K08991
10181E63246J25279k9954J01152l06763J71080M45860J05797J14124r0919j00692
10171A098210M1102K48347p1841j15094n1231O3145J57238M5372j46121J51531
10161A420658K73054l46928l66099Q2964O63638K54609J00670M58099J73621p0657
10151B643629j27055k18265k75762q2355J03497j42935k62047Q9037J436K34725
10141A963905m0184M9035j44839m06250j80290k20156K67383K18460r3489J63748
10131A577323m7829j22405k3317o4656j84292L8204J29977l00936k00387J53566
$$ plain form
10201 941962 871813 765771 521488 262961 137223 477386 898165 945792 822608 428361
10191 428361 254961 301280 171514 193511 329843 345431 254453 412319 354255 563246
10181 563246 688525 658571 759723 452960 624040 1069900 1175697 1289821 1198902 1098210
10171 1098210 1139312 1387659 1315818 1200724 1149493 1212638 1369876 1415248 1269127 1420658
10161 1420658 1693712 1346784 980685 1063649 1727287 1981896 2082566 2540665 2714286 2643629
10151 2643629 2516574 2298309 2022547 1940192 2043689 1900754 1638707 1727744 1729180 1963905
10141 1963905 1923721 1972756 1827917 1421667 1241377 1021221 1288604 1507064 1413575 1577323
10131 1577323 1529494 1407089 1383772 1319116 1134824 1173028 1303005 1002069 801682 955248
10121I55248J92494j66543k19460k14071o948l6922J13782K0495J8580L0388j15277
10110E71766j17390k9450N6079K02927N1301p4988o6911m40230k8885q789k9311
10099H6119N9417k8917j78700j09622J83390O4497J92461L03016J6209K53449
10089H41319J68321o5334j90527j59691m96257l23944J00214P5901k10715k18849
10079d79562M9800J41033M92571j14124L8825K25721k43575o960J91857j11392
10069A84194l28539J6306K05676j43688M0316k54286m5334M53816K67658l5050
10059C61069j00450k45853j06196K19557K08706j25443l71701O3113N40906J61261
10049F04969j80945j7909p492L2481K0108j13556j67281l59988j0725L94647M5936
$$ plain form
10121 955248 1147742 981199 761739 547668 540720 503798 617580 638075 656655 687043 571766
10110 571766 454376 424926 481005 683932 735233 660245 593334 153104 124219 115430 86119
10099 86119 145536 116619 -62081 -171703 11687 76184 268645 571661 587870 841319
10089 841319 1009640 944306 753779 594088 97831 -226113 -125899 -49998 -260713 -479562
10079 -479562 -429762 -288729 203842 89718 128543 354264 110689 103729 295586 184194
10069 184194 -144345 -128039 77637 -66051 -25735 -280021 -325355 128461 396119 361069
10059 361069 260619 14766 -91430 128127 336833 211390 -160311 -97198 443708 604969
10049 604969 424024 406115 398623 431104 451212 337656 170375 -189613 -200338 194309 240245
10038B40245j47553l7262L4568K2897J94520l4013p5885K3036J10041k21999k92579
10027a83984K92070K35849j54937j90808j11185o2405O9585q0357o9336K92440
10017C6932J65023K48309P021l77401j07879o8118k1491M16041K28223p1326N4529
10006E09863l3146k6670K78598L8598N7637o5586j11300j62982l48810k50978
9996a14776j4157k10861K02194P2630K28063J76126l1767l85637J13588J94569
9986B29972L17243N5571J0217j94850n9210j80740l33752m5212K50549J16639
9976A66427q6422j58544k4227M6551L51057J47227j34604J63657q9482Q5449l5859
9965D31230j53331j04218J61108J47404j02583o9540J1054M3469L0181R9799j39706
$$ plain form
10038 240245 92692 55430 89998 112895 307415 273402 197517 220553 330594 108595 -183984
10027 -183984 108086 343935 188998 -1810 -112995 -175400 -105815 -186172 -255508 36932
10017 36932 201955 450264 457285 79884 -27995 -96113 -117604 298437 526660 455334 509863
10006 509863 476717 450047 728645 767243 824880 759294 647994 485012 136202 -114776
9996 -114776 -128933 -339794 -137600 -64970 163093 339219 307452 -78185 35403 229972
9986 229972 547215 602786 613003 418153 358943 178203 -155549 -200761 49788 166427
9976 166427 80005 -78539 -102766 -56215 294842 442069 307465 471122 381640 467089 431230
9965 431230 277899 173681 334789 482193 379610 310070 321124 364593 394774 494573 354867
9954C54867p0256r0126J188j71017j53218Q1284k2949j862J92318M25803L5695
9943E81727j77206r2082m3847M9259n2869n0068P8184J69003K263J04818K12900
9932G82082J03300K88290R11855J839438J449962m08581j524622q19796m27817
9923B194111o61374k63300j41234o71462n9400M5794q5359p411O7074k40251j04655
9912G2533m7059l2388K966j77685r061K10776K43401j8975n18895j76437J78137
9901b72687J67436M996k91056J04521J23987J41650J14055k6641M3414J98102
9891C07777J2090K6075J00419j26402Q1085K27189k65610k26050P355J33683k60031
9880A7580K77419K21422l55911r8421K36639M770R7696J16645p2625K55832M0008
$$ plain form
9954 354867 284611 194485 195673 24656 -128562 -47278 -70227 -72089 120229 546032 581727
9943 581727 404521 312439 268592 317851 264982 214914 293098 462101 464364 569182 782082
9932 782082 885382 1173672 2085527 3924965 5374927 4966346 3441724 2621928 2194111
9923 2194111 1532737 1269437 1128203 456741 397341 443135 357776 350365 417439 177188 72533
9912 72533 25474 -6914 -3948 -181633 -190694 20082 263483 244508 -274387 -450824 -272687
9901 -272687 -105251 -100255 -391311 -286790 -162803 -21153 92902 66261 109675 307777
9891 307777 319867 345942 446361 319959 401044 628233 362623 136573 143928 277611 17580
9880 17580 294999 516421 160510 62089 298728 303498 401194 517839 445214 701046 741054
9869G41054j10744k68737J73385r9586j78928l14574k67913J13434L75416j82881
9859b0074k36070J1830J82096P03922P9903l44215l91972K45301J18690l46273
9849C138L098L1239o9313J69968O1012q2535m5768Q5109K84071O6250n29593k32390
9837b55714K59414J79656M634j16649j00301n1281N5736O1332r227J55089J23413
9826C06102p9777O0785R8192m42837l03939k7698k12629r3115K32128M57249K48488
9815B42949N9487J10025K21069M1121j06623j64118k63920j14951J31083j02554
9805E3568k31638J49207K67608L3894j49768j52865k03537r8301J57840k12765
9795c86757j40892K04146P5959N9852K57295L42533r9524l11738j22302k0231
$$ plain form
9869 741054 630310 361573 534958 435372 256444 -58130 -326043 -212609 162807 -20074
9859 -20074 -256144 -244314 -62218 641704 721607 377392 -14580 230721 349411 3138
9849 3138 6236 37475 -31838 138130 199142 116607 70839 155948 440019 506269 -23324 -255714
9837 -255714 3700 183356 187990 71341 -28960 -80241 -24505 36827 27600 182689 306102
9826 306102 226325 287110 385302 -57535 -361474 -389172 -601801 -694916 -462788 -5539 242949
9815 242949 302436 412461 633530 674651 568028 403910 139990 25039 156122 53568
9805 53568 -178070 -28863 238745 272639 122871 -29994 -233531 -331832 -173992 -386757
9795 -386757 -527649 -323503 -247544 -187692 69603 412136 312612 874 -121428 -141659
9785a41659j48325p6552J75773K18148J62992j31046m7384J54332l1300j31319
9775C660M1271J30016l1319l1318r2637l15904K62558J19001m4090K03220K0052
9764B64510k42263K8865N6117l54448Q2559L93578M6677L299J66591J52237j29799
9753D67923k27119q170K66019N8816l7926l27183m24950R1486J24111J59512J85380
9742C27899j00201K53733m3799n38435l8373L15015K84611J9103k68578o0046
9732A50929J01176l81060r5591m0643J0662J83021J38090j57378J00990m3312
9722c3116k83081j03827p1507L08879L24061L6106n4155o2066L08363J90390k15468
9711C44579k06556N4795o7063j49808L08363q1656k28964j370k32926p3394o5774
$$ plain form
9785 -141659 -289984 -366536 -190763 27385 190377 59331 11947 166279 134979 3660
9775 3660 44931 174947 143628 112310 19673 -296231 -33673 85328 41238 244458 264510
9764 264510 22247 51112 107229 -247219 -164660 228918 275595 278894 445485 597722 467923
9753 467923 240804 232634 498653 557469 519543 192360 -232590 -141104 -16993 142519 327899
9742 327899 227698 481431 437632 -100803 -139176 175839 460450 479553 210975 150929
9732 150929 252105 -128955 -224546 -265189 -254527 -71506 66584 -90794 10196 -33116
9722 -33116 -316197 -420024 -491531 -182652 141409 177515 123360 61294 369657 560047 344579
9711 344579 138023 192818 125755 -24053 284310 202654 -26310 -27680 -260606 -334000 -399774
9700c99774j12387K59773J94292K0963K38541K62675R786K3064n4316j60099j47643
9689A34875k39620j89866k8360Q4156J51275J91564q9852j99607q4339l2714L09891
9678G403j5982m15399r3270J34959K72060j38203j67695j53271J00442J42170
9668c26786Q032j22422N5104K11608K96906J15453K26005K06914p4962k93769
9658C02083K3777k97480j26115L55149K49006M4793O1746L9409l76482n00835
9648b24949K265j02889m89496J3549P1099M04404L83819k42767J37908M10401
9638C63344k70417j80306J81538J81718l81565R4472J98795K22816J59608q8692
9628D81311l4824L5944k24268J85251j65558m35710R1859q663k12671L93850K76173
$$ plain form
9700 -399774 -512161 -252388 -58096 -37133 201408 464083 473869 496933 442617 282518 134875
9689 134875 -104745 -294611 -322971 -238815 -87540 104024 14172 -185435 -269774 -302488 7403
9678 7403 -8579 -423978 -517248 -382289 -110229 -248432 -416127 -569398 -468956 -326786
9668 -326786 -318754 -441176 -386072 -174464 122442 237895 463900 670814 595852 302083
9658 302083 325860 28380 -97735 257414 506420 551213 612959 652368 275886 -224949
9648 -224949 -222684 -325573 -815069 -801520 -730421 -326017 57802 -184965 -47057 363344
9638 363344 92927 -87379 94159 275877 -105688 -11216 187579 410395 570003 481311
9628 481311 446487 482431 258163 443414 277856 -157854 -65995 -74658 -287329 106521 382694
9617C82694N2093Q0188O5761r6268L7654J09555j01658l55610k57906J3120K17052
9606A46675K15419K2208p0104j02532J00725r4396j67642j20205n6986k15222
9596c42060j09504K31130J2686J57118M5108k89612o4641R3808R6891l7007n2632
9585b58715J14122K23116q7250m693R0500j78442k87291R5153N2431O7924K49076
9574G5931P0113k1110j02008k3050O1425k0564l68317p2488K9006Q4874j80495
9563d66683j9845L90555N9021k20746k22021K28208p8429j29892K33333L93377
9553A66878j67471q2537L58152J97424J04275J9906j18322j34067j54540q6879
9543A02819K14932P914j62852p2763k18173k36022k09581j22165J56265K41739
$$ plain form
9617 382694 434787 514975 580736 484468 522122 631677 530019 174409 -83497 -70377 146675
9606 146675 362094 384302 314198 211666 312391 217995 50353 -69852 -126838 -342060
9596 -342060 -451564 -220434 -207748 -50630 -5522 -295134 -359775 -265967 -169076 -206083 -258715
9585 -258715 -144593 78523 -8727 -13420 77080 -101362 -388653 -293500 -241069 -173145 75931
9574 75931 146044 124934 22926 -124 61301 40737 -327580 -400068 -371062 -286188 -466683
9563 -466683 -486528 -95973 -36952 -257698 -479719 -251511 -329940 -459832 -226499 166878
9553 166878 -593 -83130 275022 472446 576721 596627 478305 344238 189698 102819
9543 102819 317751 325665 162813 90050 -128123 -364145 -573726 -695891 -539626 -297887
9533b97887J74447K2749k8796j25083R8399J45071m4656L1388J0646N4100P340
9522D7718J06271K13599j18744k00745l8408K88833J56675m7440l11503k10964
9512a14708k17191P7749l70932L18061M20825k189j03783j21811k73570P399K15618
9501a64532M4562L48270L97916l63289n33966k85983K89914L64441J42337m52163
9491b12493k54351K5253N1220J50482L2705J34433j06650j60478J86167k9910
9481a83622k11690P6370p5812J23138J88023M32873L73502j84158J3490K1988
9471E74102j66232l21603N2838K8252m6741l48058k4611l9666k02395J08619J59143
9460b26352k54954j6769J49908k7589n5876n5476K62214j31292J49696K53656
$$ plain form
9533 -297887 -123440 -100691 -129487 -254570 -156171 -11100 -55756 -24368 -13722 40378 47718
9522 47718 153989 367588 248844 48099 9691 298524 455199 407759 96256 -114708
9512 -114708 -331899 -254150 -625082 -307021 113804 111615 7832 -113979 -387549 -380150 -164532
9501 -164532 -119970 228300 626216 262927 -271039 -557022 -267108 97333 239670 -212493
9491 -212493 -466844 -441591 -390371 -239889 -207184 -72751 -179401 -339879 -153712 -183622
9481 -183622 -395312 -318942 -394754 -271616 -83593 349280 722782 538624 552114 574102
9471 574102 407870 86267 139105 167357 120616 -227442 -252053 -291719 -494114 -385495 -226352
9460 -226352 -481306 -498075 -348167 -375756 -431632 -487108 -224894 -356186 -206490 47166
9450D7166k27518N7049J21694L07880R9803l15157l24352p1179K94210J11288
9440A00884M0847l9488j57437j04183j49600l3538L63735J75329q0046L1422J84198
9429C32123j98093J40117n2468M3142j12760l31849j84860J33259n1766J96128
9419h7027j59988o7651L27970L2263k13809k68999q7437K89929J48575j3372Q6993
9408a2553K57029J85949k29741l30961k84276J870J80026K29436k45764k20211
9398d69196m0800J65945o9559k57609m1125K57092L06901P1916J53907K83050
9388C60522K14580k34676J4827J421P1123j08108k02717j16091K57089J4949k47204
9377B5715L2288M9762j61142l5389m22625J8286N8127O9587k05522M3561N74490
$$ plain form
9450 47166 -180352 -123303 -1609 306271 406074 90917 -233435 -304614 -10404 100884
9440 100884 141731 102243 -55194 -159377 -308977 -342515 21220 196549 116503 147925 332123
9429 332123 134030 274147 221679 264821 152061 -179788 -364648 -231389 -283155 -87027
9419 -87027 -247015 -314666 13304 45567 -168242 -437241 -524678 -234749 -86174 -99546 -12553
9408 -12553 244476 430425 200684 -130277 -414553 -412683 -232657 -3221 -248985 -469196
9398 -469196 -509996 -344051 -413610 -671219 -712344 -455252 -148351 -76435 77472 360522
9388 360522 575102 340426 355253 356674 427797 319689 116972 881 257970 272919 25715
9377 25715 58003 107765 -53377 -88766 -511391 -493105 -434978 -365391 -570913 -527352 47138
9366D7138L56917j88790j44853Q467k88924l7774P191J6201L23214M1030r2573
9355D7244R5728R9060L26238o4281k75319l30662j93059M3730J18245N5002J19568
9344D1494j16282j72808K17204j84303p9045J91302O0694k17699k18497L191N5117
9333d19632j30492k9047N27210J24325q2642j77443q8432J18728K79627k2276
9323I9926k07657k0388J46208L27722m0007n5253M8177j31713l98414j61255l1732
9312d24386K08816j9930k34891j51396L40942L48421R048j76711J17455K40548
9302B57916k20450j78110p6058J09948M8290j52178j50713k7567J91082J50661
9292d7179j51249l5669O7462J05393J98652j42999o4449J00145j25421j37847
$$ plain form
9366 47138 404055 215265 70412 78879 -210045 -247819 -240628 -224427 98787 139817 47244
9355 47244 142972 242032 568270 503989 228670 -101992 -295051 -251321 -133076 -78074 41494
9344 41494 -74788 -247596 -30392 -214695 -293740 -102438 -41744 -259443 -477940 -474749 -419632
9333 -419632 -550124 -579171 -51961 72364 -10278 -187721 -276153 -157425 122202 99926
9323 99926 -107731 -128119 18089 345811 305804 250551 298728 167015 -231399 -392654 -424386
9312 -424386 -215570 -235500 -470391 -621787 -280845 67576 76624 -100087 17368 257916
9302 257916 37466 -140644 -216702 -106754 -58464 -210642 -361355 -388922 -197840 -47179
9292 -47179 -198428 -234097 -166635 -61242 137410 -5589 -70038 30107 -95314 -233161
9282b33161j73579m57746O8584L20887K65868K74355j52787L9027J52523j8831
9272H5140R8720K07373j00933k72364J1676K82144j47362l1940l09189k32611
9262d09346K27952K51437M02625P3991n3293j87092k52290j35009p408K1094j6737
9251h4076k9867J05713L02765J52234L4909n316k63520l11972j25457J03759k64575
9240c85403J4066k9675M1215K60950M74197j34081j42185j26223j8878R455J91607
9229A55045j83615J09283N6698l90368m7061J61209m2941K8225P899r6799q390
9218b50815q1603K03683K07795p0768r4018M43495M01048j2496k49151j67093
9208C30077R7396m8203k34212j75009P5541q223k36887R899J73096k94275j14385
$$ plain form
9282 -233161 -406740 -864486 -795902 -475015 -209147 65208 -87579 -48552 103971 85140
9272 85140 183860 391233 290300 17936 29612 311756 164394 132454 -176735 -409346
9262 -409346 -181394 70043 472668 546659 493366 306274 53984 -81025 -88433 -67339 -84076
9251 -84076 -113943 -8230 294535 446769 481678 476362 212842 -99130 -224587 -120828 -385403
9240 -385403 -371337 -401012 -359797 -98847 375350 241269 99084 -27139 -46017 -36562 155045
9229 155045 -28570 80713 137411 -252957 -300018 -138809 -181750 -153525 -145626 -242425 -250815
9218 -250815 -332418 -128735 79060 8292 -85726 357769 758817 746321 497170 330077
9208 330077 427473 379270 145058 -29951 45590 37367 -199520 -189621 -16525 -310800 -425185
9197d25185J74094K13723M7116n03469k84923K7820L47252L63239K96948O4668
9187C21283r5376m94323j3887O3597L06997J42089J19522r9302n19103l5020j85209
9176d88732j227J92109l0833L32883j02424q3461J90020K64894J02133j03366
9166B71996l01949k26758j72044n5782J29465K1391L58163O1984j30234K61524
9156B17756J04319r0789j59091j24599L860j0787J65753j64807k76030R2963L62501
9145A21049M71403q0987j57268k26097k67070J34857K0263J8590L9037K13729
9135B87506n948n1785k68832k87452L53781N1332k71435k19969L4664j54236r4129
9124f26503O1909N24008K99740J31488l11918k14660K84416j43898j57372M1875
$$ plain form
9197 -425185 -251091 -37368 9748 -493721 -778644 -750824 -403572 -40333 256615 321283
9187 321283 225907 -268416 -282303 -218706 88291 230380 349902 250600 -268503 -303523 -488732
9176 -488732 -489959 -297850 -328683 4200 -98224 -181685 8335 273229 375362 271996
9166 271996 -29953 -256711 -428755 -484537 -355072 -333681 24482 86466 -43768 217756
9156 217756 322075 231286 72195 -52404 -48544 -59331 106422 -58385 -334415 -241452 121049
9145 121049 592452 511465 354197 128100 -138970 -4113 16150 34740 73777 287506
9135 287506 281558 229773 -39059 -326511 27270 78602 -192833 -412802 -378138 -532374 -626503
9124 -626503 -564594 -40586 259154 390642 78724 -135936 148480 4582 -152790 -110915
9114a10915M37709P1857q4157R1875O2272o767M1603J83277k48040l44429m1022
9103E3263O9433R0942p4398j65030k41340J85562K07137J75118j73668l03681
9093a76662k55398j96758K67222O7358J34843K10316L2830J69949k31832M3531
9083F5399l0717K8948K3137L6949k06376N9525j00193k53081r3368M1361K24981
9072b03435J38734J75071K72537k98650k55420j13982L3864N3561J93432L6983
9062C2695j33923J34195j67233J43595R7716J19753J29456K20463K99952r3692
9052G82977n4353j14989o8490l35860j65997J46840k74472j64189m8579Q7302
9042b09810K12023J71593p7662K36256r6680k12916J17041j07975O5616K37146
$$ plain form
9114 -110915 326794 398651 314494 406369 468641 461874 503477 686754 438714 94285 53263
9103 53263 122696 213638 139240 -25790 -267130 -81568 125569 300687 127019 -176662
9093 -176662 -432060 -628818 -361596 -294238 -159395 50921 83751 253700 21868 65399
9083 65399 34682 63630 86767 123716 -82660 -23135 -123328 -376409 -469777 -428416 -203435
9072 -203435 -64701 110370 382907 84257 -171163 -285145 -251281 -197720 -4288 32695
9062 32695 -101228 32967 -134266 9329 107045 226798 356254 576717 876669 782977
9052 782977 728624 613635 545145 209285 43288 190128 -84344 -248533 -297112 -209810
9042 -209810 2213 173806 96144 332400 235720 22804 139845 31870 97486 334632
9032C34632l6167m72836l70495J97625K31181J66240J4196J33285R0105J3791
9022C01557k11881m72125J0576K40982m4354L90294j2200k08043J50802N9561
9012B05169K8563j23641N9674K57774j91604p0849J57396l69121k73615K18996
9002a01258R3557j22482m9836J63947O0822r505p7950j03331M98k16871o5798
8991d28207j24300p6746K90480K33995R5312q8810j16799L1393k29504J59047
8981b54139J67821m48678K5796J60555L41562J23176K5233q8828P1037P9445l09051
8970a06071l9464K25237K12095J41550N3424J3153k88330l82742l3011Q9703N8867
8959e5589K70529J41485j01453J2722k02468j47330Q4235m6759q420j16812j9982
$$ plain form
9032 334632 298465 -174371 -544866 -347241 -116060 50180 64376 197661 287766 301557
9022 301557 89676 -382449 -371873 -130891 -175245 215049 202849 -5194 145608 205169
9012 205169 233732 110091 169765 427539 235935 165086 322482 -46639 -320254 -101258
9002 -101258 -7701 -130183 -180019 -16072 44750 35245 -42705 -146036 -145538 -362409 -428207
8991 -428207 -552507 -629253 -338773 -104778 -9466 -98276 -215075 -183682 -413186 -254139
8981 -254139 -86318 -534996 -509200 -348645 -7083 116093 141326 52498 123535 202980 -106071
8970 -106071 -145535 79702 291797 433347 486771 499924 211594 -171148 -204159 -114456 -55589
8959 -55589 214940 356425 254972 267694 65226 -82104 2131 -44628 -53048 -169860 -189842
8948a89842K69691k7829l9301M2710j16972m3202k3973J921M3388L11909J74391
8937D02891j74650L1199j81967L7260K43120J86057k05501j59776n6126K9349
8927A51856Q6803l05108j6937J14408M8477j70467M3764p4120P0499r276m8709
8916a08810l6117Q6224K20549k6170p1004L4916J9352J42234Q2511N2167j65998
8905B29854k38064J60748j42868P2517m63973j38619J40398L98210K1043j64082
8895a24836K531L56608K54505J77480p8143l93358j66407Q0565j2329k30562o5546
8884a99492m1113k10136k53110J24870J15100J93010L04348n424j79482j15281
8874b66710K91469J14580l78281J50908K94991j11791k58148P1321J92681j50664
$$ plain form
8948 -189842 79849 52020 12719 55429 -61543 -104745 -128718 -126797 -83409 228500 402891
8937 402891 228241 259440 77473 114733 357853 543910 338409 178633 122507 151856
8927 151856 238659 -66449 -83386 31022 79499 -90968 -47204 -121324 -50825 -60101 -108810
8916 -108810 -144927 -58703 161846 135676 64672 99588 118940 261174 343685 395852 229854
8905 229854 -8210 152538 9670 82187 -381786 -520405 -380007 18203 39246 -124836
8895 -124836 -122305 234303 488808 666288 588145 194787 28380 108945 96616 -133946 -199492
8884 -199492 -240605 -450741 -703851 -578981 -463881 -270871 33477 28053 -151429 -266710
8874 -266710 24759 139339 -238942 -88034 206957 95166 -162982 -91661 101020 -49644
8864d9644l47284J87782K47667j54727L32268k6066k29270m15973l81044K3197
8854h13094L21751j4964N3371M90891K24562j32612m0662q388k36969J33500J96660
8843A74046L3544k09406J248K92575J05349j93774N0773K39785k18580k19513
8833E6047J50737l4789k04735J77814J19153j89338m5288j42889J14619M12769
8823D14100l2266q0804J69621K4889k26992o7372k25358j38437O8402j68348Q1453
8812a81112J9979j17836p684K60518J78587l12680j84375o6651J15377K45784
8802e0093K15746j5561L6219k10q1376r5511K5146l13624j05807M41912J92181
8791B49022m2463l10193J15983M00497J16441k82500l38381j53298j60243p1519
$$ plain form
8864 -49644 -396928 -209146 38521 -116206 216062 189996 -39274 -455247 -836291 -813094
8854 -813094 -491343 -506307 -452936 37955 262517 129905 89243 80855 -156114 -22614 174046
8843 174046 207590 -1816 -568 292007 397356 203582 254355 494140 275560 56047
8833 56047 206784 171995 -32740 145074 264227 74889 29601 -113288 1331 414100
8823 414100 381834 301030 470651 495540 268548 201176 -24182 -162619 -94217 -262565 -181112
8812 -181112 -161133 -278969 -286653 -26135 152452 -160228 -344603 -411254 -295877 -50093
8802 -50093 165653 150092 186311 186101 104725 9214 34360 -279264 -385071 56841 249022
8791 249022 206559 -103634 12349 412846 529287 246787 -91594 -244892 -405135 -476654
8781d76654L75409O9882k08031j01811l76503m0484N19551M43297j72890j45012
8771a13246J00406L749n69975R538J01204K33290L0575J16503J10134j26467l29671
8760d33960p3682J03345K11393k03292m1840M4629j8343K17578r8300j06332k46782
8749f45586O4159K98590K1549k39433N6873L89377J63329k03218k84152j01643
8739d80155M25369M1944L9727j3442j15973j36502K95293J83399J70985j73562
8729B37083p3958o7688j6427j62422J05700L02904j07686l41837l40167J83181
8719b81317j8802r4069L96863J66674J366R8456k63199k66675m121J93058J04555
8708C2789k2328j11412j40668L4955P5251J3818R3251p6985Q1201j26707m6365
$$ plain form
8781 -476654 -101245 -31363 -239394 -341205 -717708 -758192 -238641 204656 31766 -113246
8771 -113246 -12840 -9091 -579066 -569528 -468324 -235034 -204459 -87956 22178 -104289 -433960
8760 -433960 -507642 -404297 -192904 -396196 -438036 -393407 -411750 -194172 -292472 -398804 -645586
8749 -645586 -581427 -282837 -261288 -500721 -443848 -54471 108858 -94360 -378512 -480155
8739 -480155 -54786 -12842 26885 13443 -102530 -239032 56261 239660 410645 237083
8729 237083 163125 95437 79010 -83412 22288 325192 217506 -124331 -464498 -281317
8719 -281317 -300119 -394188 2675 169349 170715 269171 5972 -260703 -264824 -71766 32789
8708 32789 10461 -100951 -241619 -206664 -131413 -117595 -24344 -101329 -20128 -146835 -193200
8697a93200P2052r2295P5744J42193N0270k07552l06653k28868J33756K92359
8687b62194J39099k30296K06453L56304q0500k22563J25696L565r0034k89505
8677c43975m2626l1442K57438L8644k50061k8122J23956P6962n0736N6758l0954
8666b24158O120j00766k47653Q9699J35197j3822K7863K70449J86468j07129l98437
8655c76169j9154L43387K41848r9930J36216J6870k64350J42980J48212k91610
8645b1700j1868l5544J32555Q0164j878N8218k12258j58379J45009j3290K20495
8634A81524R348l95524k65444J07834L54952J45280K78208j47878j68086l29854
8624b29640n9236N707J29088L17713R5911R9806k25408j06928L93856j72698k16004
$$ plain form
8697 -193200 -121148 -213443 -137699 4494 54764 -152788 -459441 -688309 -554553 -262194
8687 -262194 -123095 -353391 -146938 209366 128866 -93697 31999 35564 -54470 -343975
8677 -343975 -386601 -418043 -160605 -121961 -372022 -400144 -276188 -199226 -249962 -193204 -224158
8666 -224158 -218038 -318804 -566457 -476758 -341561 -355383 -327520 -57071 129397 22268 -376169
8655 -376169 -395323 -51936 189912 89982 226198 243068 -21282 121698 269910 -21700
8645 -21700 -33568 -69112 63443 143607 141729 199947 -12311 -170690 -25681 -38971 181524
8634 181524 190872 -204652 -470096 -362262 -7310 137970 416178 268300 100214 -229640
8624 -229640 -288876 -283169 -154081 163632 259543 359349 133941 27013 420869 248171 32167
8613C2167j92403n3060k50617J14847L46642J31027L8854K01650J39749j2824
8603D96032j87393K3180k49505l08381J47384J31287J77013J95827K6185L85216
8593H36845r6790l52728k84636o0674L18284K81304n4055j26422q4101l26723
8583E0304l78734K75334J51229k63690J7749M55917K69637k24785k46161L09579
8573D16379M06107j77664l07590j79741j18133J94954p164j14434k37110K30412
8563A06016J83821k32786p9911k01670M6707J5216K9916J32882Q4226K31819p0992
8552B45244j81468j26142K79486n6392p3908j94837j35909L8903p6809J94020
8542h7812K86511j31944P3679N4970N4534J2292o6242Q0527j6122j4K02956J71622
$$ plain form
8613 32167 -160236 -213296 -463913 -349066 -2424 128603 167457 369107 508856 496032
8603 496032 308639 331819 82314 -226067 -78683 52604 229617 425444 451629 836845
8593 836845 740055 387327 102691 42017 360301 641605 587550 461128 377027 50304
8583 50304 -328430 -53096 98133 -165557 -147808 308109 577746 352961 106800 416379
8573 416379 822486 644822 337232 157491 39358 234312 227148 112714 -124396 106016
8563 106016 289837 57051 -22860 -224530 -177823 -162607 -132691 191 84417 316236 245244
8552 245244 63776 -62366 217120 160728 86820 -108017 -243926 -205023 -281832 -87812
8542 -87812 198699 66755 140434 195404 249938 262230 195988 276515 260393 260379 463335 634957
8530F34957J9917j56388l44532l20598M2573K17053K28783m06517Q1614l6660
8520c9798J53936l3367k48291q4172m8077j16439M01504K77862k16907k92397
8510b46146K92655J67115L6337j67679k73666K5943J65309N7581p700K90945j71415
8499A69279j55627l01758K3870K63091j45310J95978j7127M6583m4092L18538
8489C53425L01945n34666j88460q8425J46824J27771p6050P2832J5244n2021Q9003
8478A67422L6257K75106O3249l7941m3285k91041l04589K9036K73484j47203l4165
8467a3670m1744K03383J13610l419K34792l31973J74814M48914L5169L1065l93815
8456D57126p50272l37490J51512J84368J00881j81937n8998O1799K9613J45530
$$ plain form
8530 634957 654874 498486 153954 -166644 -124071 92982 321765 -84752 -3138 -39798
8520 -39798 114138 80771 -167520 -251692 -299769 -416208 -14704 263158 46251 -246146
8510 -246146 46509 213624 249961 82282 -191384 -165441 -132 57449 49749 340694 169279
8499 169279 13652 -288106 -264236 -1145 -146455 49523 32396 78979 34887 353425
8489 353425 655370 120704 -67756 -156181 -9357 118414 42364 115196 130440 78419 167422
8478 167422 203679 478785 542034 504093 460808 169767 -134822 -105786 167698 20495 -13670
8467 -13670 -55414 147969 261579 258160 492952 160979 335793 784707 819876 850941 457126
8456 457126 -293146 -630636 -479124 -294756 -193875 -375812 -434810 -373011 -343398 -197868
8446a97868O2581K1734J76572J77439L42909J43173m43589k45499o5481q1950
8436a09979j55099k70922p1153k13930q523K15864M55250K74769k09250o9867
8426a62840r9240k8023J9897L51274N2976m66481P2122K22140P6238K31421k94345
8415b4861l71458N435L57911L48901O1404m19362K2412m4389N4241K39653k88679
8404e8792R0934K7785L6400n7885Q3467L03211L31314p3843k2746J30452q0198
8393G10099k60426l48775l83682K94765N24940L41959j97867r2998k54181j50746
8383A83088K18000K31312J67554j81350m30113J89560L0557j87682K20931k02801
8373B39056k74711j35646j37015J38421l7529K04818K25316l80948k76352J83265
$$ plain form
8446 -197868 -135287 -113553 63019 240458 583367 726540 282951 37452 -28029 -109979
8436 -109979 -265078 -536000 -607153 -821083 -829606 -613742 -158492 116277 -92973 -162840
8426 -162840 -262080 -290103 -270206 81068 134044 -332437 -260315 -38175 38063 269484 -24861
8415 -24861 -396319 -390884 -32973 315928 377332 -42030 -19618 -64007 -9766 229887 -58792
8404 -58792 32142 59927 96327 38442 121909 425120 756434 682591 659845 790297 710099
8393 710099 449673 100898 -282784 11981 536921 878880 681013 588015 333834 183088
8383 183088 401088 632400 799954 618604 188491 378051 408608 220926 441857 239056
8373 239056 -35655 -171301 -308316 -169895 -207424 -2606 222710 -158238 -434590 -251325
8363b51325J82678k42921j45256k56337L05292J26566L2336k01780j2394m6207
8353e09348k1205K07602J29957J51459j63037j13592M4305j79822J07893J45331
8343b00457j08431j23799l82695K03672N79475P0534N851m8470j0534k0082Q9045
8332E4109J16953k53950j65347j89320M14221K50823j78579k85543n7366J75992
8322a18007J12790N507M8559j21121j04159J7496l5860J64623J4365k932J61378
8311A42639j5950m8021L9571j9110K14474J73957l12757J51090q1809j58254j48635
8300f2805N8189N6364J10097j98257J47772q4539J70589K13711p5669l5585j46569
8289A53298l98937k45957o6794Q125K11526J77310K09181O3856K7282J15180j56599
$$ plain form
8363 -251325 -68647 -311568 -456824 -713161 -407869 -281303 -248967 -450747 -463141 -509348
8353 -509348 -530553 -322951 -192994 -41535 -204572 -318164 -273859 -453681 -345788 -200457
8343 -200457 -308888 -432687 -815382 -611710 -32235 38299 44150 -4320 -14854 -34936 54109
8332 54109 171062 -82888 -248235 -437555 -23334 227489 48910 -236633 -293999 -118007
8322 -118007 -5217 290 48849 -72272 -176431 -158935 -194795 -30172 -15807 -18739 142639
8311 142639 126689 78668 118239 99129 313603 487560 174803 325893 244084 85830 -62805
8300 -62805 -4616 51748 161845 -36412 111360 26821 197410 411121 335452 299867 153298
8289 153298 -245639 -491596 -558390 -550265 -338739 -161429 47752 111608 138890 254070 97471
8278I7471j2374J1394p9034q5956K28661O874j29643r6069r7885L31713j0102
8267A65050J09742j41368o63k83637j73421n0618j40471j6934J50232N3389q6006
8256d14705j60761J95743l03418k54862K49775K83050K19272J26617r0793k26723
8246c76805K30736K12329r2921j27453L6358M7825m6395j1705r1172p9048j94368
8235d92619m417L27109j00375j71095N7162J46062j06115J47194J93177K31423
8225B27506p6579k2835k08277j53083K5952J64337K27050K19452N5368j78681
8215B80210j34415j16892l21532l01350K66480M571k7524O1622P6551L76543K55754
8204D20018r7806k2088k95714o9104R7531j77087j83430J35704K98451j51083
$$ plain form
8278 97471 85097 96491 17457 -68499 160162 167036 37393 -58676 -156561 175152 165050
8267 165050 274792 133424 132761 -150876 -324297 -374915 -515386 -532320 -382088 -328699 -414705
8256 -414705 -575466 -379723 -683141 -938003 -688228 -405178 -185906 -59289 -150082 -376805
8246 -376805 -146069 66260 -26661 -154114 -117756 -69931 -116326 -128031 -219203 -298251 -492619
8235 -492619 -497036 -169927 -270302 -441397 -384235 -238173 -344288 -197094 -3917 227506
8225 227506 150927 128092 -80185 -233268 -207316 -42979 184071 403523 458891 280210
8215 280210 145795 28903 -292629 -593979 -327499 -322928 -350452 -288830 -212279 164264 420018
8204 420018 322212 300124 4410 -64694 32837 -144250 -327680 -191976 106475 -44608
8194d4608j88013j2246P5222K36961J41261J76650Q586j25757j76022N9479p5483
8183G6030l20595l18094j40388P8748J44677L47070K85787j80305j96666J16987
8173a06749L24821O7123N2820j17737m8150l47266J01326L5258K62449O1994l6416
8162B49473j04956q4269Q0112J73234n9854m64921n5363J32645M7586Q0496k12358
8151b18175o0086J08897K15681J38133j66503j73312j69677r5187k13091Q2895
8141e50425L14469K45885j4557j80076K45136J87596K50854l02470m7033j95786
8131d6407k14432j46402M9166j05205J0569K44645r9043K33299J69865J2905K11723
8120C20683J79337k14418j28479k05485J62799q1230k8150J84782J75367j22406
$$ plain form
8194 -44608 -232621 -244867 -169645 67316 208577 385227 393813 268056 92034 151513 76030
8183 76030 -244565 -562659 -703047 -624299 -479622 -132552 153235 -27070 -223736 -106749
8173 -106749 218072 285195 338015 220278 172128 -175138 -73812 -38554 223895 285889 249473
8162 249473 144517 60248 140360 313594 253740 -211181 -266544 -133899 -86313 -5817 -218175
8151 -218175 -278261 -169364 46317 184450 17947 -155365 -325042 -420229 -633320 -550425
8141 -550425 -235956 9929 -4628 -184704 60432 248028 498882 196412 149379 -46407
8131 -46407 -260839 -407241 -358075 -463280 -452711 -208066 -307109 -73810 96055 108960 320683
8120 320683 500020 285602 157123 -48362 114437 33207 5057 189839 365206 242800
8110B42800K2208P1179k1662J8941l75564k20008j48656L24775Q5120J11428J36018
8099B46579j87655q9279O5334l33904j92659K57620J36630L643m03817l3625L38058
8088a93075L92042K47847j5302J40013k03609l81843j84866P674k97927k64006
8078g53052Q6300l6637K18950K78583N0883J56028m127j92741P1833J88381l3355
8067C1046J20157Q2687k51146l41218K98084j16558K12930M9733k61436O3593
8057a12128N8909K64477P1937l04359k41458K83082L30237k27776m172j41995
8047b3246j66170J01941M22661K91611l42327k24165q2872R892J26831m93P1211
8036A84874L45099m7183r9299k01480j18790j94384l210M17493K91159m8828j06491
$$ plain form
8110 242800 265008 336187 314525 333466 -42098 -262106 -410762 -85987 -867 110561 246579
8099 246579 58924 -30355 34979 -298925 -491584 -233964 -97334 -93691 -497508 -531133 -193075
8088 -193075 198967 446814 431512 571525 367916 -13927 -198793 -191119 -489046 -753052
8078 -753052 -666752 -703389 -484439 -205856 -154973 1055 -3072 -195813 -123980 64401 31046
8067 31046 151203 233890 -17256 -358474 -60390 -176948 35982 85715 -175721 -112128
8057 -112128 -53219 211258 283195 -21164 -262622 20460 350697 122921 118749 -23246
8047 -23246 -189416 -87475 335186 626797 284470 60305 -22567 -12675 114156 113663 184874
8036 184874 529973 482790 383491 182011 63221 -131163 -134373 283120 574279 525451 418960
8025D18960l0791K23423j55605o42698j43283J92909J28363M15415j35244k80642
8015i193k86639J96088L35987N8782k62124j84451k7910J73201J69318K49687
8005D12746j73771j58525j49251K24442L11149k81101m00190l35741M20922K83588
7995A54268J49948Q3287J7090j92587k5607l8913j71618j39433J4046j50419K28760
7984g1178J78348l70838j44542L27655K32968p1287k42277k42351O6252J95769
7974a41481Q8351J21136J13809m00826l6572J59552q870J27964P3572j47492M1042
7963i815k5903j46887L65784j14978j44528j69417L05158k64941N9385K14011
7953F7869k78834j1146o4905l8023J66560n9574l8496J83079j69737P2791j73910
$$ plain form
8025 418960 388169 611592 455987 -186711 -329994 -137085 -8722 406693 271449 -9193
8015 -9193 -295832 -99744 236243 295025 32901 -151550 -179460 -6259 163059 412746
8005 412746 238975 80450 -68801 155641 466790 185689 -214501 -550242 -129320 154268
7995 154268 304216 387503 404593 212006 186399 147486 -24132 -163565 -149519 -299938 -71178
7984 -71178 107170 -263668 -408210 -80555 152413 81126 -161151 -403502 -337250 -141481
7974 -141481 -53130 68006 181815 -219011 -255583 -96031 -104901 23063 96635 -50857 -9815
7963 -9815 -35718 -182605 183179 68201 -76327 -245744 59414 -205527 -146142 67869
7953 67869 -210965 -222111 -287016 -325039 -158479 -218053 -256549 -73470 -243207 -170416 -344326
7942c44326M4744K17458L77158K39120l1423l15623Q0355k17923k55951J68479
7932c7932K15474L8729L12069K9046l8952k28055k81062J60876K50576k23073
7922A97696j08511j3592j44676Q5156K27652J64803k72720m38580j61160L48350
7912a15582L37478j09125l0413K7370p9039k02280o7743k96939k08618J4332M24873
7901c05686Q3313q9639M7702K54532j52540j19497J60746J47296l4895l02862
7891c11530k11677K19731m12705J39988M04456L99664K20185j53292k87390l74562
7881c67132J637m8619n3517J05828r3380Q5624k9845K51327N7166k7322l45979
7870d64212o1364K67326L91724L96468j92240N5473O3132k42812j63198J26185
$$ plain form
7942 -344326 -299582 -82124 295034 534154 502731 187108 267463 49540 -206411 -37932
7932 -37932 177542 216271 528340 557386 518434 290379 9317 170193 420769 197696
7922 197696 89185 75593 -69083 16073 243725 408528 135808 -302772 -463932 -115582
7912 -115582 221896 112771 82358 109728 30689 -171591 -239334 -536273 -744891 -730559 -305686
7901 -305686 -222373 -312012 -264310 -9778 -162318 -281815 -121069 26227 -8668 -311530
7891 -311530 -523207 -303476 -716181 -576193 -171737 227927 448112 294820 7430 -367132
7881 -367132 -365495 -414114 -467631 -361803 -455183 -369559 -399404 -148077 -90911 -118233 -464212
7870 -464212 -525576 -258250 133474 529942 337702 393175 456307 213495 50297 176482
7860A76482N5260o0366k03469K63592J00739J26370O1537j13913o9964L1802j22726
7849B45344j16299J7413j05894j59122K23722K09127L98498j94811m16745j70293
7839f9060R4564P8858n621K6194J14951j94625j25609K30908K60211J29052m7138
7828D92685n4861l14297m2992N0324j9100l2935k6028k7006j01263j15454j87160
7817c78087k93711J8984J73124J815J37245J66550N9636L4384j84096k07756J38895
7806c33017j40864N4819J05030J89931K67791K70047l26418k25428M7724o5817
7796a56202j89953r915N46603J52197R1095j55551l97863j25045O1087n8021j51545
7785c93113j19977J71329Q5157J51225l0302J66213N09600j08407k86133r2685
$$ plain form
7860 176482 231742 171376 -32093 231499 332238 458608 520145 406232 336268 368070 245344
7849 245344 129045 146458 40564 -118558 105164 314291 712789 517978 101233 -69060
7839 -69060 25504 104362 98741 124935 239886 45261 -80348 150560 410771 539823 492685
7828 492685 437824 123527 80535 130859 111759 78824 52796 25790 -75473 -190927 -378087
7817 -378087 -671798 -652814 -479690 -477875 -340630 -174080 -114444 -80060 -264156 -471912 -333017
7806 -333017 -473881 -419062 -314032 -124101 143690 413737 87319 -138109 -90385 -156202
7796 -156202 -346155 -356070 190533 342730 433825 278274 -119589 -244634 -183547 -241568 -393113
7785 -393113 -513090 -341761 -256604 -105379 -135681 30532 540132 431725 145592 52907
7775E2907K6430M473j54749J1618J7260q2484J55931j09293l85185o9933l7995
7764e71020K6582K70946k7837j48040N4728j50689K5757K60809l4510l61840j60869
7753h15983J61361L04991J80583K80303L1267j55001O7252q8939k49406J83408
7743a00164L49848l7019k51091O4257j79852K61606L73254j5547m82551o5085
7733h2344j89622r6236j10650j68436N6038K0130J65092N8141J49018J19895J74105
7722I5131K64301P0994n5286q6609M6327k76925j54284p3728n8807K39302M21206
7711D31622J27975k05675l35771j11762R4994J40630j45914P9980o1371n1179
7701c6471K53504R4361j03384r3658P045K5056K8837K2361j20218r4416j1187
$$ plain form
7775 52907 79337 83810 -70939 -59321 -42061 -124545 31386 -77907 -463092 -533025 -571020
7764 -571020 -544438 -273492 -301329 -449369 -394641 -545330 -519573 -258764 -293274 -655114 -815983
7753 -815983 -654622 -349631 -169048 111255 142522 -12479 54773 -34166 -283572 -100164
7743 -100164 249684 212665 -38426 25831 -154021 107585 480839 465292 -17259 -82344
7733 -82344 -271966 -368202 -478852 -647288 -591250 -571120 -406028 -347887 -198869 -78974 95131
7722 95131 359432 430426 375140 288531 334858 57933 -96351 -170079 -228886 10416 431622
7711 431622 559597 353922 18151 -93611 1383 142013 -3901 76079 14708 -36471
7701 -36471 217033 311394 208010 114352 121397 146453 175290 197651 77433 -16983 -28170
7690b8170j11394k53168K7582K44864J61107k7803m6501J20455q0204l23884J49879
7679a67237J487j49563M5634J51871K69969k78501k66381P3370J56660K94431
7669A31740J33674o3606j95827j95807N7389J49561J64308k0594k68741J89393
7659H1490J14036j11638k92789r2701M4514J13413P2461Q6370j63215K1674K82019
7648A55634J96289j83339J40665k12226q3293k70075J22751K15134K30479j02879
7638B09140j02972j2485M8812r7366j76059l2049K71121L55618m4719p5378k21051
7627A22612r8138o9580j24052j30025J08460M1831r6896J614L32707J03106J50189
7616C41828P833j36325J6022M8455k88043l54441J2483j9988L3881j7442K03152
$$ plain form
7690 -28170 -139564 -392732 -365150 -120286 40821 13018 -33483 86972 6768 -317116 -167237
7679 -167237 -165750 -315313 -269679 -117808 152161 -126340 -392721 -319351 -162691 131740
7669 131740 265414 201808 5981 -189826 -132437 17124 181432 160838 -107903 81490
7659 81490 195526 83888 -208901 -301602 -257088 -143675 -71214 15156 -148059 -126385 155634
7648 155634 351923 168584 309249 97023 13730 -256345 -133594 81540 312019 209140
7638 209140 106168 93683 142495 45129 -130930 -162979 108142 463760 419041 343663 122612
7627 122612 24474 -45106 -169158 -299183 -190723 -148892 -245788 -244174 88533 191639 341828
7616 341828 349661 213336 229358 277813 -10230 -364671 -352188 -372176 -338295 -355737 -152585
7605a52585J95327l28570m8797L20588L09034K83388j16572j13211j02632k09139
7595C6831l3852j08267m8520k83644J99811P3187J42502K80930q6969q6957j77335
7584i2283l2053M1119K95996j62286m72964K08253L8772j15327j29177J83623
7574b36327J49295j03681j18809J32488j89113l5581j29522k00242q9051K27777
7564e92766n2877n3482Q7811K86135K46073O600q6304J61922N9349k5697l03134
7553b66370K07587R5367n3333j39699k07769N7170R9817q4893K86927J62306R1785
7542B48895L3203m88308n79827j38703J5438J21919K52805L17064J93698J10044
7532H6228J90739p3854j49142j89529K16747J76692j18320K2081m6179j3451r9330
$$ plain form
7605 -152585 42742 -285828 -334625 -14037 294997 578385 461813 348602 245970 36831
7595 36831 2979 -105288 -153808 -437452 -237641 -164454 -21952 258978 172009 85052 -92283
7584 -92283 -124336 -83217 212779 50493 -422471 -214218 -175446 -290773 -419950 -236327
7574 -236327 -87032 -190713 -309522 -177034 -366147 -401728 -531250 -731492 -820543 -592766
7564 -592766 -645643 -699125 -611314 -325179 -79106 -72506 -158810 3112 62461 36764 -266370
7553 -266370 -58783 36584 -16749 -156448 -364217 -307047 -207230 -292123 -5196 157110 248895
7542 248895 282098 -206210 -786037 -924740 -909302 -787383 -534578 -217514 -23816 86228
7532 86228 276967 203113 53971 -135558 81189 257881 139561 161642 115463 102012 2682
7521B682j29927N5754K09144J16865m4798O7520j77960k41451r6327K4734J71800
7510d1964J77231M6644M7184m5313j74497M0317k03878l9616L19696q8922j21347
7499h4465J98359K93280l34811m10708j36020J65132M1094j50681J56433J65895
7489i6492q2509k8437r3475K2831j15162J23018K66796J44367k631R618q2306
7478F5618j25553K23407j16855k07122j91576l8638N3803j52670k71283J22000
7468f38869L04257L07747K07091j90308k52991N1289L8417Q7603j78031k50977
7458e14772J4408J09349K28443N1403K38310J56190k56574P6469J71589k3971
7448B50844m5904K33699J05470J18877j30698m22485n24778k61062j8819K38129
$$ plain form
7521 2682 -127245 -71491 137653 254518 209720 277240 99280 -142171 -238498 -213764 -41964
7510 -41964 135267 181911 229095 183782 9285 49602 -154276 -193892 125804 36882 -84465
7499 -84465 113894 407174 72363 -338345 -474365 -309233 -268139 -418820 -262387 -96492
7489 -96492 -179001 -207438 -300913 -278082 -393244 -270226 -3430 140937 138306 147924 65618
7478 65618 -59935 163472 46617 -160505 -352081 -390719 -336916 -489586 -760869 -638869
7468 -638869 -334612 -26865 180226 -10082 -263073 -211784 -173367 -85764 -263795 -514772
7458 -514772 -500364 -391015 -162572 -111169 127141 283331 26757 103226 274815 250844
7448 250844 204940 438639 544109 662986 532288 109803 -414975 -676037 -694856 -456727
7438d56727K70895o861L0522J60683P3079N0435k67408n1830k05764l9573M0820
7427d01729J55951P2210J39768M34704J78970j65950l14967j53528j74222M2329
7417a86464L2827j56383j09087J70220P752K44178J56195j58513L2402k83447
7407b50320q9899N1753K08651n1823R928n7285j48449k39345L41558k2459k69410
7396e17100j91485L85609K22859j19848l79424j02750K03795Q1964q0502K01877
7386b95005L76914k7764M2275l30171L0236L68717J78957l92475k64392j64982
7376d77690K99070j54750j80044R6563L70418J11772r4477k63864k05713N3715
7366d45000M0196q188J57288L15615j7771R3328L45834J33962l32310m48761l12138
$$ plain form
7438 -456727 -185832 -192693 -162171 -1488 71591 122026 -145382 -197212 -402976 -442549 -401729
7427 -401729 -245778 -173568 -33800 400904 579874 413924 98957 -54571 -228793 -186464
7417 -186464 -153637 -310020 -419107 -248887 -241135 3043 159238 725 33127 -250320
7407 -250320 -340219 -288466 -79815 -131638 -121710 -178995 -327444 -566789 -225231 -247690 -517100
7396 -517100 -708585 -322976 -100117 -219965 -599389 -702139 -498344 -416380 -496882 -295005
7386 -295005 81909 54145 96420 -233751 -203515 165202 344159 -48316 -312708 -477690
7376 -477690 -178620 -333370 -513414 -416851 -46433 65339 -29138 -293002 -498715 -445000
7366 -445000 -404804 -412992 -255704 59911 42140 135468 481302 615264 282954 -165807 -477945
7355d77945j7928N7498K03396J18388j9229k3385L29476L40641K18050k55019
7345D73943l00177Q3963j58480j47327q5850r6510j74809k42642J16538L37130
7335a94221L29337L59236M4975k06777m2276j15327k55097N1648r2520M1904K12341
7324A33223J22248j92915l15400K38243K95357p2756k60901J58222l3861j8886
7314E2574p5471J90551j14416P3463J50207j31579Q310O7606p460M6995l5715
7303B25065j52367p0218J76905K03583j26121j36370m9203l13307j21586K50767
7293a12852p3150m4722J93682j60372j57440j5879J95694O7732m017J00755r70
7282a1539R7278l01155N3396J07399j3583J1072m959j61924k49454J39844l4329
$$ plain form
7355 -477945 -495873 -438375 -234979 -116591 -135820 -159205 170271 510912 728962 473943
7345 473943 173766 257729 99249 -48078 -133928 -230438 -405247 -647889 -531351 -194221
7335 -194221 135116 494352 539327 332550 290274 174947 -80150 -28502 -121022 -79118 133223
7324 133223 255471 62556 -252844 -14601 280756 208000 -52901 105321 71460 52574
7314 52574 -22897 167654 53238 126701 276908 145329 153639 221245 213785 260780 225065
7303 225065 72698 2480 179385 382968 256847 120477 71274 -242033 -363619 -112852
7293 -112852 -186002 -230724 -37042 -197414 -354854 -370733 -175039 -107307 -111324 -10569 -11539
7282 -11539 85739 -215416 -162020 -54621 -68204 -57132 -62091 -224015 -473469 -333625 -367954
7271c67954J18156r1159m3260M99030m5604m9375O0383K03383Q0592j95189P6791
7260B45794J28159j42268j17311p0488J02655J00204k11023P7357Q8486k68169
7250f6604j05470j65013l6363n4362L6804K2213J46367j92594j7654k73311O0746
7239f45241K48152r059p2715K82938L43117J97715j65671p8250j60620K93820
7229B34186J94420Q8897n9333k75096n8681r2482k67008J63240J80409J76300
7219B84852J27092k46631L8383k49368K08284k11021j64843m1084J80515J88809
7209A14988Q3576n7902j50519j0476P7744K7852k25113J28179J88986j67798P4758
7198H4275K13254l33069K452J63890k67087j98234K4719J19183K65045Q0971r4921
$$ plain form
7271 -367954 -249798 -340957 -384217 114813 69209 19834 80217 283600 364192 169003 245794
7260 245794 373953 231685 114374 43886 146541 246745 35722 113079 201565 -66604
7250 -66604 -172074 -337087 -373450 -427812 -391008 -368795 -222428 -415022 -432676 -705987 -645241
7239 -645241 -397089 -406148 -478863 -195925 147192 344907 179236 100986 -59634 234186
7229 234186 428606 517503 458170 183074 124393 31911 -235097 -71857 108552 284852
7219 284852 411944 165313 203696 -45672 162612 -48409 -213252 -254336 -73821 114988
7209 114988 198564 140662 -9857 -20333 57411 85263 -139850 -11671 177315 9517 84275
7198 84275 297529 -35540 -33088 130802 -136285 -334519 -309800 -190617 74428 155399 60478
7187F0478l502J47521K0679L2007Q9145k27222k58701k95325J49782k7243k77540
7176e89921J09431J78727L25055J5658n5311J3458J17786j31808k56991j61402
7166d35318k30360O5543M67149N936J92669J05096J54892j16458Q586L09729L3532
7155E60996l11446l56944n9000L57708j29070J16202l18437j76634J62117n1991
7145b06499J01740K21573Q4948m4019j15734m0418k70500N2445N0514J00738J36289
7134G1077J05973P0458l58419q3576J30280J16984o502J28932r3598j16154R143
7123b5402J43742j10875j7068j21201r8196K14684J86814m7485j51150J9986p5030
7112h1181l38432j9913l63770j73289N24299O27174M63704n08788m61727K08009
$$ plain form
7187 60478 56976 204497 225176 257183 346328 119106 -139595 -434920 -285138 -312381 -589921
7176 -589921 -480490 -301763 23292 38950 -16361 -2903 114883 -16925 -273916 -435318
7166 -435318 -665678 -600135 -132986 -127050 65619 170715 325607 209149 217735 527464 560996
7155 560996 249550 -107394 -166394 191314 62244 178446 -139991 -316625 -154508 -206499
7145 -206499 -104759 116814 201762 157743 42009 1591 -268909 -216464 -165950 -65212 71077
7134 71077 177050 247508 -110911 -194487 -64207 52777 46275 175207 81609 -34545 -25402
7123 -25402 118340 7465 -9603 -130804 -229000 -14316 172498 125013 -26137 -6151 -81181
7112 -81181 -419613 -439526 -803296 -976585 -452286 174888 638592 129804 -331923 -123914
7102a23914K92036j24078r1412r2460J42641j99238k47293N4243L94835j37886
7092a32526k0002J50450j04673o8807K91895L22287l76939l58965j09814R0114
7082c16980J42401J90405k10632r3211K15714j42763k19284J06219K91122L1272
7072e737N4656m06953k39645L63677L66412o2018k76403n6562L3698m5817Q2162
7061a92530k29115n6226J76608p6046m98290q6173N94106K00940L4604q714l3970
7050a74806l15892P0536M16714J28137l36164J9489M3428j58262Q4655K00299
7040b1866J37258K21600r2641l81789k99236P3021K29733J79877o6966r2976p3690
7029a87675n4009J94597j10763j36245k2187K47858o9609j60177K45799J44638
$$ plain form
7102 -123914 168122 44044 -47368 -139828 2813 -196425 -443718 -389475 5360 -132526
7092 -132526 -152528 -2078 -106751 -175558 116337 438624 61685 -297280 -407094 -316980
7082 -316980 -174579 15826 -194806 -288017 -72303 -215066 -434350 -328131 -37009 -5737
7072 -5737 48919 -358034 -597679 -234002 132410 70392 -206011 -262573 -228875 -274692 -192530
7061 -192530 -421645 -477871 -301263 -377309 -875599 -961772 -367666 -166726 -132122 -140836 -174806
7050 -174806 -490698 -420162 -3448 124689 -211475 -191986 -148558 -306820 -222165 -21866
7040 -21866 115392 336992 244351 -137438 -436674 -363653 -133920 45957 -21009 -113985 -187675
7029 -187675 -241684 -47087 -157850 -294095 -316282 -68424 -138033 -298210 -52411 92227
7019I2227n447l69035k88166J60814R9871o6261q6161P7493j03797R7697l423
7008c94188J27880O9441J63458l33446K19928M5640L3364R9117J06568K7515O9146
6997B34423n2967j15609k30601j41129M74029J46352p9357o9539K43408q6230
6987C22780j28319o5789k9325Q9708j61254J51643o3041j85189K76820q8456J09385
6976B28963j32091j80393K6947O8852m21777l43107N27489N98495J36433m0018
6966D69793j61561k94640k92988k82464M125K76660p8167p8946J16564L4421j30194
6955d17397R0691o1041O9159K282j6122M700k20019J65048j20067J39506J65055
6944a98205k8963k2521j56069J69660O7090p4340j36668J61389J05657j7700L56916
$$ plain form
7019 92227 86780 -282255 -570421 -409607 -309736 -375997 -462158 -384665 -488462 -390765 -394188
7008 -394188 -266308 -196867 -33409 -366855 -146927 -101287 -67923 31194 137762 165277 234423
6997 234423 181456 65847 -164754 -305883 168146 314498 235141 165602 409010 322780
6987 322780 194461 128672 99347 189055 27801 179444 116403 -68786 208034 119578 228963
6976 228963 96872 -83521 -56574 12278 -409499 -752606 -225117 373378 509811 469793
6966 469793 308232 13592 -279396 -561860 -557735 -281075 -359242 -438188 -321624 -287203 -417397
6955 -417397 -326706 -387747 -318588 -316306 -332428 -327728 -547747 -382699 -502766 -363260 -198205
6944 -198205 -227168 -249689 -405758 -236098 -169008 -243348 -380016 -218627 -112970 -130670 226246
6933B26246O7906l18038k54898K4997J31651K06043n7515m05641M1396J73471
6923a64382J40743J07335j51114l25710J83369p1367Q0956j61520K27961J12075
6913b1654J6450j1590R3333k3454J64848k85427k30085M005K1963J39335M71312
6902C39036n493l64341k46219J26508N516m0183J15767L36059J7778k5618L0732
6891B89542k61222j15771P4928l73930k27110J33677M29075K28480k31282k76016
6881c29629K50069O5765J55428J15545j8656j1124J7182p2670j48198L357k81489
6870b54420l37769K32067j8511R0037Q8133J22140K67330m5800J86122m408k462
6859C22459J53187k74524j78832j21592J08767J7248j93585M0198j48137P3898
$$ plain form
6933 226246 294152 -23886 -278784 -253787 -122136 83907 26392 -379249 -337853 -164382
6923 -164382 -23639 83696 -67418 -393128 -209759 -281126 -200170 -361690 -133729 -21654
6913 -21654 -5204 -16794 76539 53085 217933 -67494 -297579 -293574 -271611 -132276 339036
6902 339036 333543 -30798 -277017 -150509 -144993 -185176 -69409 266650 284428 258810 289542
6891 289542 28320 -87451 -12523 -386453 -613563 -479886 -50811 177669 -53613 -329629
6881 -329629 -79560 -13795 141633 257178 238522 227398 244580 171910 23712 27069 -254420
6870 -254420 -592189 -360122 -378633 -288596 -200463 -78323 189007 143207 329329 324921 322459
6859 322459 475646 201122 22290 -99302 9465 26713 -166872 -126674 -274811 -200913
6849b00913J10155k6719n5323O6416J26176K78554K91261j25240k83816j84270
6839c719K0429k8433k53716j94224j4153N62622j3426j60799M5440l603O4546
6828B0964r7452j65856O6849l4915J930J07961k87588p421j05850k27524K17847
6817e11055K58500J2181j96254J10874K55106n7341K1073O9163J10733q5847k81525
6806b94392j98581O8593j2055J26356m2327r2427k65580J43684K4399J99390J02115
6795b40825L5061J6959J03840p8461r8960j69375J17001L0558L63294r8521j06251
6784a25680P9792J18624J35390P2033j90293l2222n0861Q5045j53534k157J27389
6773F3526J12002J01565k53176Q267k46894L4958J37606J32896j16396k0393L80429
$$ plain form
6849 -200913 -90758 -117477 -172800 -106384 19792 298346 589607 464367 180551 -3719
6839 -3719 16710 -11723 -265439 -459663 -473816 88806 75380 -85419 -39979 -43582 20964
6828 20964 -76488 -242344 -175495 -210410 -208480 -100519 -388107 -395528 -501378 -728902 -511055
6817 -511055 -252555 -240374 -436628 -325754 -70648 -127989 -106916 -37753 72980 -12867 -294392
6806 -294392 -492973 -424380 -436435 -310079 -352406 -444833 -710413 -566729 -542330 -342940 -240825
6795 -240825 -205764 -188805 -84965 -163426 -262386 -431761 -314760 -284202 79092 -19429 -125680
6784 -125680 -45888 72736 208126 280159 89866 57644 6783 91828 -61706 -63863 63526
6773 63526 175528 277093 23917 32184 -214710 -179752 -42146 90750 -25646 -46039 334390
6762C34390K99736k39251p0396n1706m14136m06929k41385J34931K70711M78742
6752I4707J19048k26323N3871j50336K25526L04865R0353l12742l29450j09428
6742b39909j61241J58769L88824K37928j55407n0476K30404j8865k39326k39341
6732h8640k47544K3885l8118k09043K97463O740J17326l47561J50360O01356K58818
6721E25042k18901l73716J58448N7636k05870J09895L67395J02541l46975j95402
6711a9907K69253R0260j34013j79993K335l06362j91133N59081J59054r2430j53679
6700B466k67736r3387j5670J7889J59128J02976J21893o636N3363r862j83966
6689a19542p5447L823R3783N0401Q1421q060J15504K74716n2254l22688j89975
$$ plain form
6762 334390 634126 394875 324479 272773 -141363 -548292 -789677 -654746 -384035 94707
6752 94707 213755 -12568 41303 -109033 116493 421358 511711 198969 -130481 -239909
6742 -239909 -401150 -242381 146443 384371 228964 178488 408892 390027 150701 -88640
6732 -88640 -336184 -312299 -350417 -559460 -261997 -255257 -137931 -485492 -335132 266224 525042
6721 525042 306141 -67575 90873 148509 -57361 52534 419929 522470 175495 -19907
6711 -19907 249346 339606 205593 25600 27935 -278427 -469560 89521 248575 156145 2466
6700 2466 -265270 -358657 -374327 -356438 -197310 -94334 27559 20923 74286 64424 -119542
6689 -119542 -194989 -191166 -97383 -46982 34439 26379 141883 416599 364345 41657 -148318
6678a48318J17317J42775K52676Q8077k94923j21188p5433J62802L07519K00748
6668F32052k08333p1396K35086k4719j35316l2647n6779R4382J12178M5915J02893
6657F93316j87166n80503m12809K9282J78421O2308L7704J6769j3631l4849K94532
6646H3374J35409j50685k73968k36431O7101l6046N9318K90892J4722k80250k94409
6635f20973J62288L23618J70070l20674l7067K40349K38186P8890k00764m6645
6625a2722j89724j96312j84206L22871J52853j73363K65245K8342P7565m12282
6615c21733l14007L69012N0365j818M85607J13215k62006k29865m690K1148j69219
6604b63991j65474J43990J20066K28284j07057o3645J10356N7816j72873j27331
$$ plain form
6678 -148318 -31001 111774 364450 452527 157604 36416 -39017 123785 431304 632052
6668 632052 423719 352323 587409 562690 427374 394727 337948 432330 544508 590423 693316
6657 693316 506150 -74353 -487162 -457880 -279459 -217151 -179447 -162678 -176309 -211158 83374
6646 83374 218783 68098 -205870 -442301 -375200 -411246 -351928 -61036 -46314 -326564 -620973
6635 -620973 -458685 -135067 35003 -285671 -322738 -82389 155797 234687 33923 -12722
6625 -12722 -202446 -398758 -582964 -260093 -107240 -280603 -15358 12984 90549 -321733
6615 -321733 -635740 -266728 -216363 -218181 267426 380641 118635 -111230 -115920 -94772 -263991
6604 -263991 -429465 -285475 -165409 62875 -44182 -107827 2529 60345 -112528 -239859
6594b39859j15903q2099Q7117P1277J60410K25864M303k0994K66113j51051l60302
6583a55124l83384K97487N8578j01266K8766J36393Q1883K26619j04291o3121
6573B2540J08951m38866M2784O2307J27495R6668j02987o5085j0411J92340r6362
6562f0626j56984J69529K34793k00876l24504J56719j13243n3553K21033j35753
6552b63465n0501k19509k50533P8052L96162M15994k9920J7712J31644j34642
6542I0994l45294l27523L87738J00437J21758j36361J43423M04611r9130k74282
6532F6371K52847n817Q3114k63775k80357k91406J01493o0003J49406P0446K97366
6521A19685j6145n8732J02063K45398P9154l43515r5528J98001K8116j09659n8010
$$ plain form
6594 -239859 -355762 -437861 -350744 -279467 -119057 106807 111110 90116 356229 205178 -155124
6583 -155124 -538508 -241021 -182443 -283709 -254943 -118550 -36667 189952 85661 22540
6573 22540 131491 -307375 -264591 -202284 -74789 21879 -81108 -146193 -156604 35736 -60626
6562 -60626 -217610 -48081 186712 -14164 -338668 -181949 -295192 -348745 -127712 -263465
6552 -263465 -313966 -533475 -784008 -705956 -309794 106200 76280 93992 225636 90994
6542 90994 -254300 -581823 -194085 -93648 28110 -108251 35172 439783 340653 66371
6532 66371 319218 313401 396515 132740 -147617 -439023 -337530 -397533 -248127 -177681 119685
6521 119685 103540 44808 146871 392269 471423 127908 32380 230381 258497 148838 90828
6510I0828k6255R790K60367j8759n62992o0130L48607M62707L51972j34666k97830
6499D23639k01760n318k73514p526N82659j22235j33949K019N1845o3550l57755
6488a05445l4526J17999J10879O5448J6618K9208l4129j12961k8960J01311k74075
6477a48633m11024j36174M8399M79777M33406Q8494J4439m4464k03049m1382j038
6466G8751l03236n1547k2598j35131J25443K64906M04300K02124J02898r2986
6456E72924j18539k32555n2720J67022K4518k72513L5248O5322k72063L9347m7752
6445i1761j63787J08722J9719J11597L2247N0907J34416p8663k68131R3409K47700
6434A96375k80588Q9030K04555k75427j04212L95772J00777k0283M6831l02428
$$ plain form
6510 90828 64573 74363 334730 315971 -247021 -307151 41456 504163 856135 721469 423639
6499 423639 221879 216561 -56953 -64479 518180 395945 261996 264015 315860 252310 -105445
6488 -105445 -139971 -21972 88907 154355 170973 200181 166052 53091 24131 125442 -148633
6477 -148633 -559657 -695831 -647432 -167655 265751 354245 368684 324220 121171 79789 78751
6466 78751 -224485 -276032 -298630 -433761 -308318 -43412 360888 563012 665910 572924
6456 572924 454385 221830 169110 336132 360650 88137 123385 188707 -83356 -44009 -91761
6445 -91761 -255548 -146826 -127107 -15510 16737 67644 202060 123397 -144734 -51325 196375
6434 196375 -84213 4817 209372 -66055 -170267 225505 326282 305999 352830 50402
6424E0402j1354R3601j00115q0990p966k60071O0342K63126j79509L04498J56940
6413B88904P0782j97176o32613j24056L47225J62341j7014k9153J46011p3002
6403e7751J07020L01603M3026l12839K4751j14849j23138m37325j40203P7229
6393f32476j48982J54938K2960Q2738O2814n6033K37766p3229l0072O2852J09710
6382b07014J074K90396k38731P9539K99012K65550K22072k60427l73965k28098
6372a50592Q7106j24058J15173J0149K42879L55197l67219m1134j83369j18428
6362a74296j61311j04049J92299P3217J66999P8431J84178l82531j18737N78184
6352C32384K19987p2287j18442m8658o2085k05304j9601p2159R867j9268J95377
$$ plain form
6424 50402 39048 132649 32534 -48456 -56422 -316493 -256151 6975 -172534 131964 288904
6413 288904 359686 162510 -470103 -594159 -246934 -84593 -101607 -130760 15251 -57751
6403 -57751 49269 350872 393898 81059 105810 -9039 -132177 -569502 -709705 -632476
6393 -632476 -781458 -626520 -603560 -520822 -458008 -514041 -276275 -349504 -379576 -316724 -207014
6382 -207014 -205940 84456 -154275 -74736 224276 489826 711898 451471 77506 -150592
6372 -150592 -63486 -187544 -72371 -62222 180657 535854 168635 127501 -55868 -174296
6362 -174296 -335607 -439656 -247357 -174140 -7141 71290 255468 -127063 -245800 332384
6352 332384 552371 480084 361642 312984 250899 45595 25994 -46165 -36298 -55566 139811
6341A39811J65783m3091n0865L34093L06533j80655j03323n69975k06856L96112
6331A87567o8779l69537l42659J73046M39087P28j16884l2710o9313k460J32691
6320f9223K68923k37894p573q9155j17329j62671J06002j0032R9598J20805o9204
6309a67753J98290l260j32372Q2367q5834j26244p2041J02605K90349L16820K18072
6298F20999j47420k030p9577k4342m679k87042k64125M0500j0318P9943J10661
6287C2570j6387Q7435J24276j14656o0871N1201j60965P6273j13570R9516M98
6276E320P4475L06659K97339O5868j6523J6809j82287n90773r8340M4613J20598
6265D3758o0050m44782R1527P1963J96317L2147j22016j00207J75155Q219K45906
$$ plain form
6341 139811 305594 262503 211638 545731 852264 671609 568286 -1689 -208545 187567
6331 187567 118788 -250749 -593408 -420362 18725 19453 -97431 -130141 -199454 -201914 -69223
6320 -69223 199700 -38194 -45767 -134922 -252251 -414922 -308920 -318952 -219354 -98549 -167753
6309 -167753 30537 27277 -105095 -22728 -108562 -234806 -306847 -204242 86107 402927 620999
6298 620999 473579 471549 391972 367630 362951 75909 -188216 -147716 -158034 -78091 32570
6287 32570 16183 103618 227894 113238 52367 103568 -57397 18876 -94694 4822 5320
6276 5320 79795 386454 683793 749661 733138 749947 567660 -23113 -121453 -76840 43758
6265 43758 -16292 -461074 -369547 -297584 -101267 -69120 -191136 -291343 -116188 -107969 137937
6254A37937J62932k03978m03888k74340J70719M13507K12297n9196j76849l06502
6244c27361j09337J2273j21203m3536M56149K12338p9380K11931j00215k9822
6234H1837l9212J75614J27965l3703N952j53248o6527J41131m0778k67568L55013
6223B86476K31800l72155j35919J27635n38380k55691J01955Q6725J01080p3589
6213d40063P5715L33143L14873J99274k32331K323p4795m52579m77879o5066m1930
6202h59315M1215J62964J97345q7919N2987L84061K02771k58689l1995p6734j04201
6191c77510L81341Q5164k85250q1984j34052J19807o0174o823J27069K22760L00160
6180B90508L55446N0777n8912l73627l38112j8632k77878j93582J26691L8828
$$ plain form
6254 137937 300869 96891 -306997 -581337 -410618 2889 215186 155990 -20859 -327361
6244 -327361 -436698 -424425 -545628 -589164 -133015 79323 -57 211874 111659 81837
6234 81837 42625 218239 346204 312501 318453 165205 98678 239809 199031 -68537 286476
6223 286476 518276 146121 10202 137837 -400543 -656234 -554279 -467554 -366474 -440063
6213 -440063 -364348 -31205 283668 482942 250611 252934 178139 -274440 -752319 -817385 -859315
6202 -859315 -818100 -655136 -457791 -545710 -492723 -108662 94109 -164580 -196575 -273309 -377510
6191 -377510 3831 88995 -196255 -278239 -412291 -292484 -352658 -359481 -232412 -9652 290508
6180 290508 645954 696731 637819 264192 -73920 -92552 -370430 -564012 -437321 -398493
6170c98493L9830q2485j97613L30366K86100R0951L00515K73752l52849k49065
6160D1009j87863l84348l265N33041L18139l05716k53773J0878j7986J14138J06443
6149b9303q0274K7245K64800K13404k92514k28821p6651k09255l0322J59005q3440
6138c66126Q8365L53847J57324J41971j6805k45365n29291o20243R4113O06295
6128c35915L55307K93447p1298l50745K8399J49563j49512k34476k08625j55970
6118f79825J2042J38322o8752J28127k44287M1167L58150k5401K29296J78257
6108F7096j39191R590K38777l62406K66l7340J01264k27651J55336M32196N7164
6097B95101J95751O8909n10561m04387J05705K60975k6249J47063P7148m0081
$$ plain form
6170 -398493 -358663 -441148 -638761 -308395 -22295 68656 369171 642923 290074 41009
6160 41009 -146854 -531202 -534467 -1426 316713 10997 -242776 -231898 -249884 -135746 -29303
6149 -29303 -109577 -82332 182468 395872 103358 -125463 -202114 -411369 -441691 -282686 -366126
6138 -366126 -277761 76086 233410 375381 358576 113211 -416080 -1036323 -942210 -335915
6128 -335915 19392 312839 241541 -109204 -80805 68758 -80754 -315230 -523855 -679825
6118 -679825 -667783 -529461 -598213 -470086 -714373 -673206 -315056 -340457 -111161 67096
6108 67096 -72095 -62505 176272 -186134 -185868 -223208 -121944 -349595 -194259 237937 295101
6097 295101 490852 559761 49200 -355187 -249482 11493 -14756 132307 209455 169374
6087A69374j30628N6827J0665r0976L25956r8101k92459K2127P5312M399P3320
6076A25816L42571J88912j44793r3628l49999j58454L98768r7330n17108r4727
6066c99972K7609K86587K9161l07841k23049k88242l8153K77488J90458m1827
6056d87781J08796K14483J62280k4285p3971J00587l9350J5502k95375O9530J89964
6045e9620j15675K85075J20400k40399j85905r4369R6750K09651o1862M3954Q3961
6034H1961M9283N4717k54126k21087R3474n8929n5171j01736j02226O4274K03765
6023b45801O6176J46650j08733j07618J10232L56313J40704j75904L2611k39983
6013b5353k03032l3694J57669K44242n4803J62402L62731r8176k85513J24113
$$ plain form
6087 169374 38746 95573 106238 15262 341218 243117 -49342 -27215 48097 52496 125816
6076 125816 468387 657299 512506 418878 68879 -89575 309193 211863 -305245 -399972
6066 -399972 -372363 -85776 -56615 -364456 -587505 -875747 -913900 -636412 -445954 -487781
6056 -487781 -378985 -164502 -2222 -26507 -100478 109 -39241 -23739 -319114 -249584 -59620
6045 -59620 -175295 109780 230180 -10219 -196124 -290493 -193743 15908 -45954 -2000 81961
6034 81961 131244 185961 -68165 -289252 -195778 -254707 -309878 -411614 -513840 -449566 -245801
6023 -245801 -179625 -32975 -141708 -249326 -139094 217219 357923 182019 214630 -25353
6013 -25353 -228385 -262079 -104410 139832 85029 247431 610162 511986 226473 350586
6003C50586l714K38261k38129l24973k53309m8724L28413o3204q2551Q9318K16748
5992B08722k40366N538k69813J60440L67939K40350l9247r7049l94465j90793
5982b48744k26969N6984L39952Q9071K63686O0856J7130k08215p7957j50925k57493
5971c42624K17942J78767k01858j69698J52129L89912l2712P6873N042Q5603N8631
5960D18007m53282j69502L83613J62770M7180j98582j65863j35415L8980K95551
5950B23457k04190J3362j06404j5146J60021J29379J66459o1022k92350j68460
5940a54894J32046k34056l5134J39694Q6445M080J40636M36710J85897k11643
5930D89781n56987J01198j07826l707K68523j11043M2315J9820o4110k46221k0657
$$ plain form
6003 350586 346872 585133 347004 22031 -231278 -280002 48411 -14793 -97344 -8026 208722
5992 208722 -31644 -26106 -295919 -135479 232460 472810 433563 336514 -57951 -248744
5982 -248744 -475713 -418729 -78777 10294 273980 334836 351966 143751 65794 -85131 -342624
5971 -342624 -124682 54085 -147773 -317471 -165342 224570 191858 268731 273773 359376 418007
5960 418007 -35275 -204777 178836 341606 388786 190204 24341 -111074 -72094 223457
5950 223457 19267 32629 -73775 -88921 71100 200479 366938 305916 13566 -154894
5940 -154894 -22848 -256904 -292038 -152344 -65899 -61819 78817 515527 701424 489781
5930 489781 -67206 33992 -73834 -77541 190982 79939 122254 142074 77964 -168257 -188914
5919a88914J9471J43862J19324m58409k75500J93371J81708M40451J98816k70664
5909A03516j53884j37818J11239m0755r4808L6955k20527O9220O5669j53794K336
5898d12651o005K92853n6028J72525J13284n4076J27989L79359k89353k24425
5888D3472j25483o5498k84681n8869K42727K55664m2593l6075j18566k3799j94356
5877d08057K6204K33631K35690j47996J85715P0829r1598k34060j33877J11012
5867a52507K60206M2456J34635k15355l91517M4738J86576M17009j03561m62607
5857b39927j58584L43993j8596p2408l4038q3204P8615J60413J02558j39626p5199
5846a36003l20177j73122N5321P5029m2614k14244o1270J49834J21197k48599
$$ plain form
5919 -188914 -169443 -25581 93743 -364666 -640166 -446795 -265087 175364 374180 103516
5909 103516 -50368 -188186 -76947 -117702 -212510 -175555 -396082 -326862 -261193 -414987 -412651
5898 -412651 -418656 -125803 -181831 -9306 103978 49902 177891 557250 267897 43472
5888 43472 -82011 -147509 -432190 -491059 -248332 7332 -35261 -71336 -189902 -213701 -408057
5877 -408057 -381853 -148222 87468 -60528 125187 196016 104418 -129642 -263519 -152507
5867 -152507 107699 150155 284790 69435 -322082 -277344 -90768 326241 222680 -239927
5857 -239927 -398511 -54518 -73114 -145522 -179560 -262764 -184149 -23736 78822 -60804 -136003
5846 -136003 -456180 -629302 -573981 -498952 -541566 -755810 -817080 -667246 -546049 -794648
5836g94648N75005L32746l1014j42780r0666N2768K99291j51568l17063K9767
5826b38162p7552l5232k67692Q3923K58920O2844L86749J71785K22882J5938l00848
5815B83555q8628K2893p0156k6505p734J02861J19897M5152r172k20995l30156
5804a78988j93473K09946k8864o3223L7606M6307j15425P8332j27926j09364R3033
5793c52039J46594J02069J09411K04572k07416J8245M5154k04198o140M9491O5628
5782b8629L8231k48027J09289K14791L0723K4469N3154l49898O1045K28300j30355
5771C093j43460J39033K29823j3249k03223j98218r6874L11759P7023m3784N4445
5760A16368j01353j40490J26543j56881j15743K40891L23158M3620k87469o7167
$$ plain form
5836 -794648 -219643 113103 82089 -60691 -151357 -98589 200702 49134 -267929 -238162
5826 -238162 -315714 -350946 -618638 -534715 -275795 -212951 173798 345583 568465 584403 283555
5815 283555 194927 217820 147664 121159 113425 216286 336183 381335 372163 151168 -178988
5804 -178988 -372461 -162515 -191379 -254602 -216996 -170689 -286114 -207782 -335708 -445072 -352039
5793 -352039 -205445 -103376 6035 210607 3191 21436 66590 -137608 -143748 -94257 -28629
5782 -28629 9602 -238425 -129136 85655 116378 140847 194001 -155897 -94852 133448 3093
5771 3093 -140367 -1334 228489 215240 12017 -186201 -283075 28684 105707 61923 116368
5760 116368 15015 -125475 1068 -155813 -271556 -30665 292493 336113 48644 -18523
5750a8523J5485J22719J28209j74785P096J41484q5710R914k8499J00613M8543
5739B66546m9391k49348j75304j49764K97853L10174j30152k84727J92378M2592
5729G0857m61680q7780M0727K79063O857k8130p1703L08235M87666K77001o4920
5718G56193K6339k92938m53498k84852K13160J91952k8827p1379q714J22134n3096
5707A16474m8147J20960K62120J43404m46952j45025o7720J50248Q8473q5839
5697H7996J510j95435r7825J15684Q72L15095K21277K07911k05729j57605j60148
5686A33603j88540m0847J54875J20263J9296j56386Q5445J93310p4785Q1768L76902
5675G04904j30928p1895K2345k51463l6923J99633m64873m45526o7149J87403
$$ plain form
5750 -18523 -3038 119681 247890 73105 80201 221685 135975 145889 117390 218003 266546
5739 266546 217155 -32193 -207497 -357261 -59408 250766 120614 -164113 28265 70857
5729 70857 -390823 -478603 -437876 -158813 -151956 -180086 -251789 56446 544112 821113 756193
5718 756193 782532 489594 36096 -248756 -35596 156356 127529 56150 47436 169570 116474
5707 116474 68327 189287 451407 594811 147859 2834 -64886 85362 173835 87996
5697 87996 89506 -105929 -203754 -88070 -87198 227897 449174 657085 451356 293751 133603
5686 133603 -54937 -95784 59091 179354 198650 42264 127709 321019 246234 328002 704904
5675 704904 573976 502081 524426 272963 236040 435673 -29200 -474726 -541875 -354472
5665c54472L83882j99932n40195O5915K09948j33413o4041j70792M76679K79039
5655d7382P210k99755m4641K52639L918J72110J05759N6907j50089j2287k90921
5644b46532k5290L0871R4255k06025j65339J70665J38400Q1546N3950J26383l47147
5633b94263j46260Q6490M12181j15817j18794J81134M03858k20897j2405J50157
5623C25384L3253K32516n7842j78830l8413q4126J05633m48466J4748L38105O1070
5612C03032l51031n2503k6639q4017L378r7117J31002k26269k03916Q8640n2469
5601e67909J44836K62913Q0773j1798o8238J00574l51909J2098K14160J79608
5591d892o2364j37518J55452J75531l9455K44620j29189n4663O5894Q8030K3203
$$ plain form
5665 -354472 29410 -170522 -710717 -644802 -434854 -568267 -632308 -803100 -326421 -47382
5655 -47382 -40172 -339927 -384568 -131929 -128011 44099 149858 206765 56676 44389 -246532
5644 -246532 -271822 -240951 -146696 -352721 -518060 -347395 -208995 -127449 -73499 52884 -294263
5633 -294263 -440523 -354033 58148 -57669 -176463 4671 408529 187632 175227 325384
5623 325384 358637 591153 533311 354481 316068 231942 337575 -110891 -96143 241962 303032
5612 303032 -47999 -100502 -127141 -211158 -207780 -304897 -173895 -400164 -604080 -515440 -567909
5601 -567909 -423073 -160160 -79387 -91185 -159423 -58849 -410758 -398660 -184500 -4892
5591 -4892 -67256 -204774 -49322 126209 86754 331374 202185 147522 213416 301446 324649
5580C24649J5182n8914J9582l8334r8155K96344k14344n48684j31515J95906Q6905
5569a51378M3574k76168m6460k46697l0373J37073k60988j03147J50480N31935
5559b52149K56057L97077j11970l91152l73321k11263M1690K97954L04439L342
5549c9296k06326J07234P9348J95077l10398l2935J18001J67149O5022j60648
5539a7772j1755P0193J25978J45012j03587k67286k89347Q2792J75071J14474
5529B3773L96042M7506m41431m90290j29579M5726J6805j3127J65421J49103L34282
5518A04231j54639k9655J03039r8710j12150j97977r5780K9977K82774J66595
5508b295l31905P9085m1386k80438j86288K09164L10442L85561K83115j57730
$$ plain form
5580 324649 339831 280917 300499 262165 164010 460354 246010 -302674 -434189 -238283 -151378
5569 -151378 -107804 -383972 -430432 -677129 -707502 -570429 -831417 -934564 -784084 -252149
5559 -252149 3908 400985 289015 -102137 -475458 -686721 -645031 -347077 -42638 -39296
5549 -39296 -245622 -138388 -59040 136037 -174361 -207296 -89295 77854 142876 -17772
5539 -17772 -29527 40666 166644 311656 208069 -59217 -348564 -265772 -90701 23773
5529 23773 419815 467321 25890 -464400 -593979 -548253 -531448 -544575 -379154 -230051 104231
5518 104231 -50408 -80063 22976 -75734 -187884 -385861 -481641 -451664 -168890 -2295
5508 -2295 -334200 -255115 -296501 -576939 -763227 -554063 -243621 141940 425055 267325
5498B67325j25570m1202R9709K86285r9383l85712j04175l4700O1083J8812K00067
5487A42539L6595k17505o5371P4564K12274K989j69131j11251J88131k91752k75852
$$ plain form
5498 267325 141755 100553 200262 486547 387164 1452 -102723 -137423 -76340 -57528 142539
5487 142539 179134 -38371 -103742 -29178 183096 186085 16954 -94297 93834 -197918 -473770
$$ [...]
##END NTUPLES=NMR SPECTRUM
##END=
