##TITLE=Analysis number 311553
Compound Code cc 00402
Book Reference 441/101
Project Code qc-cat
Chemist Name colinb
##JCAMPDX= 6.0         $$ Bruker NMR JCAMP-DX V2.0
##DATA TYPE= NMR SPECTRUM
##DATA CLASS= NTUPLES
##ORIGIN= Bruker BioSpin GmbH
##OWNER= NMR
$$ XWIN-NMR		Version 3.5
$$ Tue Jul 12 14:08:30 2005 GMT Daylight Time (UT+1h)  MAYBRIDGE\NMR@NMR_250MHZ
##.OBSERVE FREQUENCY= 250.131544655141
##.OBSERVE NUCLEUS= ^1H
##.ACQUISITION MODE= SIMULTANEOUS (DQD)
##.ACQUISITION SCHEME= undefined
##.AVERAGES= 16
##.DIGITISER RES= 18
##SPECTROMETER/DATA SYSTEM= dpx250
##.PULSE SEQUENCE= zg30
##.SOLVENT NAME= CDCl3
##.SHIFT REFERENCE= (INTERNAL, CDCl3, 0, 16.522)
##AUDIT TRAIL= $$ (NUMBER, WHEN, WHO, WHERE, WHAT)
$$ ##TITLE= Audit trail, XWIN-NMR		Version 3.5
$$ ##JCAMPDX= 5.01
$$ ##ORIGIN= Bruker BioSpin GmbH
$$ ##OWNER= NMR
$$ C:\u/data/dgb/nmr/ADRS/5700/pdata/1/auditp.txt
$$ ##AUDIT TRAIL=  $$ (NUMBER, WHEN, WHO, WHERE, WHAT)
(   1,<2005-07-12 14:08:06.83 +100>,<MAYBRIDGE\NMR>,<NMR_250MHZ>,
      <created by zg, POWCHK disabled, PULCHK disabled
       configuration hash MD5:
       62 19 C7 07 E1 42 D1 B7 37 6C 3D D0 77 39 F9 E6
       data hash MD5: 64K
       E6 07 89 85 2C A4 3D FD 83 8D C5 7E 68 AA 0D 1C>)
(   2,<2005-07-12 14:08:20.24 +100>,<MAYBRIDGE\NMR>,<NMR_250MHZ>,
      <Start of raw data processing
       ef LB = 0.3 FT_mod = 6 PKNL = 1 SI = 32K 
       data hash MD5: 32K
       53 FE 7E 51 DA 0F FF A9 09 D3 AF BC 8C 74 A7 C9>)
(   3,<2005-07-12 14:08:21.97 +100>,<MAYBRIDGE\NMR>,<NMR_250MHZ>,
      <apk 
       data hash MD5: 32K
       3E BA 8B 55 F4 B5 06 B8 B4 48 27 0C 87 6F 78 83>)
(   4,<2005-07-12 14:08:22.69 +100>,<MAYBRIDGE\NMR>,<NMR_250MHZ>,
      <abs ABSG = 5 
       data hash MD5: 32K
       63 5B DC 4C 35 B1 FD 12 D1 B2 A9 66 F7 05 D9 DE>)
$$ ##END=
$$ 
$$ hash MD5
$$ AA 55 62 A6 F4 3E 6D 01 80 E3 78 53 B1 CB 12 4C
##$RELAX= 
##$RELAX= 
##$RELAX= 
##$RELAX= 
##$RELAX= 
##$RELAX= 
##$RELAX= 
$$ Bruker specific parameters
$$ --------------------------
##$DU= <C:\u>
##$EXPNO= 5700
##$NAME= <ADRS>
##$PROCNO= 1
##$TYPE= <nmr>
##$USER= <dgb>
##$AMP= (0..31)
100 100 100 100 100 100 100 100 100 100 100 100 100 100 100 100 100 100 
100 100 100 100 100 100 100 100 100 100 100 100 100 100 
##$AQSEQ= 0
##$AQ_mod= 3
##$AUNM= <au_zg>
##$AUTOPOS= <1 >
##$BF1= 250.13
##$BF2= 250.13
##$BF3= 250.13
##$BF4= 250.13
##$BF5= 500.13
##$BF6= 500.13
##$BF7= 500.13
##$BF8= 500.13
##$BYTORDA= 1
##$CFDGTYP= 0
##$CFRGTYP= 5
##$CHEMSTR= <none>
##$CNST= (0..31)
1 1 145 1 1 1 1 1 1 1 1 1 1 1 1 1 1 1 1 1 1 1 1 1 1 1 1 1 1 1 1 1 
##$CPDPRG= <>
##$CPDPRG1= <>
##$CPDPRG2= <>
##$CPDPRG3= <>
##$CPDPRG4= <mlev>
##$CPDPRG5= <mlev>
##$CPDPRG6= <mlev>
##$CPDPRG7= <mlev>
##$CPDPRG8= <mlev>
##$CPDPRGB= <>
##$CPDPRGT= <>
##$D= (0..31)
0 1 0 0 0 0 0 0 0 0.06 0 0 0 0 0 0 0.0002 0 0 0 0 0 0 0 0 0 0 0 0 0 0 
0 
##$DATE= 1121173685
##$DBL= (0..7)
120 120 120 120 120 120 120 120 
##$DBP= (0..7)
150 150 150 150 150 150 150 150 
##$DBP07= 0
##$DBPNAM0= <>
##$DBPNAM1= <>
$$ [...]
##$SUBNAM7= <"">
##$SUBNAM8= <"">
##$SUBNAM9= <"">
##$SW= 20.6930455092707
##$SWIBOX= (0..15)
0 0 3 0 0 0 0 0 0 0 0 0 0 0 0 0 
##$SW_h= 5175.983436853
##$TD= 65536
##$TD0= 1
##$TE= 296.16
##$TE2= 300
##$TE3= 300
##$TEG= 300
##$TL= (0..7)
0 120 120 120 120 120 120 120 
##$TP= (0..7)
150 150 150 150 150 150 150 150 
##$TP07= 0
##$TPNAME0= <>
##$TPNAME1= <>
##$TPNAME2= <>
##$TPNAME3= <>
##$TPNAME4= <>
##$TPNAME5= <>
##$TPNAME6= <>
##$TPNAME7= <>
##$TPOAL= (0..7)
0.5 0.5 0.5 0.5 0.5 0.5 0.5 0.5 
##$TPOFFS= (0..7)
0 0 0 0 0 0 0 0 
##$TUNHIN= 0
##$TUNHOUT= 0
##$TUNXOUT= 0
##$USERA1= <user>
##$USERA2= <user>
##$USERA3= <user>
##$USERA4= <user>
##$USERA5= <user>
##$V9= 5
##$VALIST= <valist>
##$VCLIST= <CCCCCCCCCCCCCCC>
##$VD= 0
##$VDLIST= <DDDDDDDDDDDDDDD>
##$VPLIST= <PPPPPPPPPPPPPPP>
##$VTLIST= <TTTTTTTTTTTTTTT>
##$WBST= 1024
##$WBSW= 4
##$XGAIN= (0..3)
0 0 0 0 
##$XL= 0
##$YL= 0
##$YMAX_a= 450433
##$YMIN_a= -501007
##$ZGOPTNS= <>
##$ZL1= 120
##$ZL2= 120
##$ZL3= 120
##$ZL4= 120
##$ABSF1= 16.522
##$ABSF2= -4.171173
##$ABSG= 5
##$ABSL= 3
##$ALPHA= 0
##$AQORDER= 0
##$ASSFAC= 0
##$ASSFACI= 0
##$ASSFACX= 0
##$ASSWID= 0
##$AUNMP= <proc_1d>
##$AZFE= 0.1
##$AZFW= 0.1
##$BCFW= 0
##$BC_mod= 0
##$BYTORDP= 0
##$COROFFS= 0
##$CY= 12.5
##$DATMOD= 1
##$DC= 0
##$DFILT= <>
##$DTYPP= 0
##$F1P= 14.0000005364418
##$F2P= -0.99999901652339
##$FCOR= 0.5
##$FTSIZE= 32768
##$FT_mod= 6
##$GAMMA= 0
##$GB= 0
##$INTBC= 1
##$INTSCL= 1
##$ISEN= 128
##$LB= 0.3
##$LEV0= 0
##$LPBIN= 0
##$MAXI= 10000
##$MC2= 0
##$MEAN= 0
##$ME_mod= 0
##$MI= 0
##$NCOEF= 0
##$NC_proc= -5
##$NLEV= 6
##$NOISF1= 0
##$NOISF2= 0
##$NSP= 0
##$NTH_PI= 0
##$NZP= 0
##$OFFSET= 16.522
##$PC= 1
##$PHC0= -80.63114
##$PHC1= 4.438501
##$PH_mod= 1
##$PKNL= yes
##$PPARMOD= 0
##$PSCAL= 4
##$PSIGN= 0
##$REVERSE= no
##$SF= 250.13
##$SI= 32768
##$SIGF1= 0
##$SIGF2= 0
##$SINO= 400
##$SIOLD= 32768
##$SREGLST= <1H.CDCl3>
##$SSB= 0
##$STSI= 32768
##$STSR= 0
##$SW_p= 5175.98343685301
##$SYMM= 0
##$S_DEV= 0
##$TDeff= 65536
##$TDoff= 0
##$TI= <Analysis number 999999
Compound Code 99
Book Reference 9
Project Code 9>
##$TILT= no
##$TM1= 0
##$TM2= 0
##$TOPLEV= 0
##$USERP1= <user>
##$USERP2= <user>
##$USERP3= <user>
##$USERP4= <user>
##$USERP5= <user>
##$WDW= 1
##$XDIM= 32768
##$YMAX_p= 430915026
##$YMIN_p= -309433
$$ End of Bruker specific parameters
$$ ---------------------------------
##NTUPLES= NMR SPECTRUM
##VAR_NAME=  FREQUENCY,     SPECTRUM/REAL,   SPECTRUM/IMAG
##SYMBOL=    X,             R,               I
##VAR_TYPE=  INDEPENDENT,   DEPENDENT,       DEPENDENT
##VAR_FORM=  AFFN,          ASDF,            ASDF
##VAR_DIM=   32768,         32768,           32768
##UNITS=     HZ,            ARBITRARY UNITS, ARBITRARY UNITS
##FACTOR=    0.157963299565203, 1,           1
##FIRST=     4132.6476996994, 0,             0
##LAST=      -1043.33573715361, 0,           0
##MIN=       -1043.33573715361, -309433,     0
##MAX=       4132.6476996994, 430915026,     0
$$ Real data points
##PAGE= N=1
##DATA TABLE= (X++(R..R)), XYDATA
$$ [...]
22846 -93845 -30002 -16083 -63423 5547 35890 88614 61229 67773 102499 128571 130844 147885
22834 147885 192334 197790 165924 149118 92039 38491 19874 26965 26657 -2236 -11709 67137
22822 67137 86692 83551 72690 74915 99170 126675 100727 40633 16568 -21694 -6781 56643
22810 56643 94317 69231 9349 19857 -23166 43023 112732 31777 23794 44842 53346 42136
22798 42136 23404 11667 73163 76046 134224 135815 94919 135510 104238 66004 41902 111356
22786 111356 180944 108856 82434 -12056 -158631 -95793 -58476 4038 69599 79149 20713
22775 20713 38908 86075 43712 -15535 -18377 39701 62691 75745 37690 -27314 -54918 -59112
22763 -59112 -36905 32441 -42500 -144674 -86736 719 11057 -51960 -4413 105899 91116
22752 91116 40491 44273 30547 56482 -33924 -76197 -53005 8521 92436 112211 119858 93817
22740 93817 52399 1060 36096 16168 -21275 12180 28734 -9184 -69505 -78226 -57666 -80857
22728 -80857 -36559 21484 43955 18478 17657 2682 20428 41631 14768 31646 -97408 -104991
22716 -104991 -19565 44679 72819 88325 56977 13923 13241 21684 46130 22295 12711 37024
22704 37024 21579 -43653 -20322 17241 56761 46636 49768 4649 -19197 -43579 -28472 -62146
22692 -62146 -22486 104356 76242 -45910 -108848 -144850 -113245 -123930 -143040 -118033 -47386
22681 -47386 -22928 6780 19802 1249 63902 61454 40183 22448 1875 2777 38909 186
22669 186 -111434 -88357 -80216 -93985 -46340 1571 44546 -7587 207 15644 74731 87518
22657 87518 30913 -32074 -97525 -116537 -61445 -51015 -36776 -45204 -15499 -12876 -47641 -42423
22645 -42423 -3870 -5233 3349 33589 82956 30453 13127 -11943 -746 11715 43310 41392
22633 41392 23785 12207 57557 80997 78533 45672 45640 -29466 -113623 -35227 278 -84980
22621 -84980 -123730 -70151 -131421 -147372 -90883 -99765 -105087 -82621 -41337 -64529 -87876 -129803
22609 -129803 -172612 -125561 -164802 -181022 -123868 -51874 46073 13856 7468 70186 20775 1350
22597 1350 27315 59109 134278 112535 63827 62839 51306 77343 92791 2504 -1865 49163
22585 49163 98037 74951 48533 2943 66531 135302 114585 71718 100114 70071 13703 42692
22573 42692 38980 26430 -55186 -46674 -62597 -101158 -76216 -32304 -15286 -36487 4538 -19020
22561 -19020 -4145 1847 25494 11493 -50813 -59008 -40163 -87872 -123396 -110031 -62245 -41663
22549 -41663 -54008 -112982 -73482 42045 18126 -39899 -104122 -112539 -46550 47626 69634 49645
22537 49645 33061 34677 119666 122536 32856 20905 29089 56522 98739 85118 35462 15853
22525 15853 -12857 -39905 -24238 -73721 -60159 -82780 -4747 8121 -11892 39909 37720 57281
22513 57281 152659 100227 63464 58114 -24730 -70876 -8535 11074 -53411 -76368 -89411 -50498
22501 -50498 -68466 -11845 -43263 -113433 -116801 -88584 -36573 43307 47545 -39074 -67706 -95243
22489 -95243 -67570 -46891 -139 15015 75225 87283 54081 20949 31230 69601 80561 -27055
22477 -27055 -31892 9420 19772 -49485 -84282 -83619 -108222 -48735 -75693 -169115 -173353 -111040
22465 -111040 -55375 -40727 -35766 -36647 -52764 -113499 -90141 -81112 -67996 -67525 -9031 8461 -51103
22452 -51103 -51228 -45684 -113235 -171711 -142227 -6125 44892 -4450 63926 -20337 -63906 -48662
22440 -48662 -27883 -59790 -39263 37642 74171 52472 56639 66506 85904 115278 123588 121286
22428 121286 128518 147767 121193 34065 -16236 1021 53795 45254 21832 -32558 -105871 -83769
22416 -83769 -125012 -121902 -106071 -88789 -144547 -173927 -172149 -80299 -12232 -65981 -102103 -33670
22404 -33670 41707 17096 -51129 -105081 -223888 -163268 -76767 -32222 -6040 5225 27460
22393 27460 46862 36829 37533 81945 46128 -40850 -7953 -13914 24615 -4485 -5365 -24203 -18703
22380 -18703 -27019 -31426 -62584 -67660 -33848 -81750 -5930 11216 13976 -16561 -35325 -17298
22368 -17298 7529 30958 68288 37955 51500 85885 84931 97920 44497 18547 62961 54305
22356 54305 59652 -31506 -39608 24250 24475 4735 -44896 -9904 -31362 -75304 -53701 -48334 5626
22343 5626 70796 94091 44396 80172 99706 73455 -42945 -87762 -87662 -112123 -95850 -18276
22331 -18276 76930 71766 84938 74388 -16028 -48524 -48479 -85778 -57232 -60618 -60869 -25814 -10528
22318 -10528 -39866 -120039 -107236 -69461 -10555 22971 62542 49851 -32826 4874 21224 21974
22306 21974 13006 46906 67906 36267 23545 -28397 -49240 -35572 19435 41828 6027 -8049
22294 -8049 -3172 -21646 -26270 9929 15186 -6608 30420 61255 78167 142922 212865 150435
22282 150435 58362 64189 98797 74458 69197 57454 -33991 38316 82095 68048 25238 37991
22270 37991 52028 38432 17847 63982 93281 22686 -35524 -89151 -173491 -207415 -136175 -117883
22258 -117883 -39567 -54098 -64611 -46914 -66021 -152009 -137047 -77242 -30696 -32673 -73555 -93283
22246 -93283 -88863 -59676 -35574 -48856 18697 40704 -48480 -103444 -151591 -168972 -127894 -69308
22234 -69308 -88543 -70821 -80595 -52104 -38947 -18326 11726 153962 187217 194821 163991 104327
22222 104327 89644 113574 109473 98093 100581 104300 134742 102860 101364 96046 57819 27217
22210 27217 2050 6385 11573 -33900 -70414 -52393 -32690 -23871 -13190 -8601 13362 72042
22198 72042 42880 -47875 -86043 -40686 -48241 -38487 -58277 -5790 -26241 -41657 -52121 -4830
22186 -4830 -103297 -130590 -98264 11670 70117 75964 126022 25547 26542 74298 53653 -17276
22174 -17276 12418 4122 24989 18441 -48991 -80695 -72306 -104240 -132016 -120007 140 -9720
22162 -9720 14291 48905 287 -10748 -25784 20620 94746 88405 64097 62500 28047 5666
22150 5666 -17831 -54635 -80690 -12176 -25756 -87862 -92892 -112153 -149891 -190796 -205933 -157779
22138 -157779 -101057 -110206 -95500 -45859 27728 65372 25816 -48959 -70741 -71826 -12065 11701
22126 11701 -40838 -88119 16106 31322 -51650 -116466 -151543 -100878 -29770 -4798 -24409
22115 -24409 -40204 -85536 -91301 -95977 -61472 -28855 -79116 -85784 -112643 -117039 -97666 -80560
22103 -80560 -101411 -121176 -100227 -128058 -70451 -87567 -38360 -71245 -53680 -35719 -60747 -49868
22091 -49868 -49135 -50490 -102724 -151188 -169760 -178409 -94805 -3384 90146 130946 92720 74127
22079 74127 46810 -44397 -50227 12043 76767 28005 -16620 -6305 -11022 -63883 -92329 8686
22067 8686 6235 -13966 -49811 -42257 -49084 26289 55461 -8281 -18162 2183 -21539 6673 -39916
22054 -39916 -59923 -18686 -19774 56843 100466 86125 -23491 35611 188274 232487 164639
22043 164639 51894 -33878 -56631 -73933 -16040 30397 32226 -6446 -94354 -148780 -97973
22032 -97973 -98363 -124010 -154124 -140813 -53558 15797 -19579 -10440 -3855 56047 86178 114021
22020 114021 112481 83877 104260 17370 29668 60632 34680 -8617 -33429 -14074 35456 42475
22008 42475 23750 -30718 -8827 -23719 -44900 -124108 -159069 -132645 -45774 34238 -3206 -25227
21996 -25227 -15323 5854 -45948 -65346 -43406 -121862 -63916 2156 13391 -17885 -64860 -143516
21984 -143516 -86551 -36116 -58750 -61062 32567 52908 65726 -20564 -108719 -155445 -159302 -123256
21972 -123256 -113761 -60202 -5392 -743 51184 41563 -5752 -34264 -26987 9296 43393 18682
21960 18682 -72407 -61554 10496 52160 18719 5280 -16667 -58966 -17848 -5061 -54796 -76598
21948 -76598 -83105 -37688 14228 68808 116355 104766 68394 -25550 -65624 -30936 6483 -36310
21936 -36310 -46541 -11590 -11529 -66922 -53098 -77615 -81685 12451 43717 45790 13317 -72687 -97269
21923 -97269 -72987 -45849 10244 19196 14043 -75623 -118915 -72007 -16576 78065 42940 2778
21911 2778 -45550 -56001 -65482 -23777 -8020 -55239 -114467 -161095 -255318 -255597 -147669 -189021
21899 -189021 -208776 -131438 -83678 -47825 -30584 -74927 -28739 6739 -23885 -79507 -114393
21888 -114393 -73259 -83337 -78720 -45990 -53204 -38315 32163 96426 51355 3021 -20812 -18389
21876 -18389 -23152 -16124 -15933 -6911 32036 -33978 -95033 -115460 -75934 -47344 -20885 -81462 -147857
21863 -147857 -98734 -51825 -23432 -57554 -48621 56027 44601 63895 72246 15662 -30210 -33291
21851 -33291 40974 32801 -55165 -115442 -69971 30794 42755 34951 58709 36178 58782 38613
21839 38613 -39439 -56453 -57052 -85300 -101000 -110158 -107292 -118416 20038 103085 80932 22075
21827 22075 -81388 -121598 -125685 -87966 -10140 -5841 -44360 -29050 -35225 -12387 -24599 -15558
21815 -15558 12430 -11552 -1539 -27374 20619 22129 8310 -59369 -8674 972 -11202 -38742
21803 -38742 -87134 -116487 -22885 88286 166272 136809 66157 33936 -25057 -83806 -42636
21792 -42636 -7243 6351 -4922 -41186 -24430 -69437 -95629 -20611 7764 -17582 -52457 -9737
21780 -9737 20508 72110 93187 78672 -15589 -34102 -54786 -72255 -74234 -48272 -44242 -56552
21768 -56552 -18289 -26812 -27164 -35 4915 -93442 -86716 29942 61940 73228 24695 -21616
21756 -21616 -12521 -57565 -96224 -126245 -137932 -180895 -216336 -136873 -122435 -153107 -159776 -130381
21744 -130381 -58840 -66758 -178518 -156473 -115848 -115037 -112985 -82591 -43870 -8234 40562 51099
21732 51099 67074 41154 -16869 -39884 -13551 -1818 -49302 -56651 -53508 -91978 -113516 -17072
21720 -17072 7801 -5407 -36481 -34864 -15952 -41505 -45825 -134379 -206222 -174848 -169010 -213052
21708 -213052 -130046 -103856 -76605 -55663 -55827 -73472 -130404 -99106 -68018 -13286 5412 -30873
21696 -30873 -97210 -105726 -55436 -4863 24769 -5195 -18783 4572 48417 65711 60141 37405
21684 37405 36873 41399 51678 85403 214 -47639 -52359 -15347 21736 75594 69278 -28330 4738
21671 4738 58390 51662 86881 77274 -31518 -91227 -64613 -20789 -17043 -90477 -148489 -131322
21659 -131322 -52665 45761 55230 85426 -432 -51175 8612 -117336 -118811 788 10378 -15286
21647 -15286 -36468 -1213 -1274 28768 40266 -2733 2308 66328 21918 -23303 -37929 -24083
21635 -24083 -22127 7994 35147 49975 40638 -43733 -46940 29966 -40099 -82208 -49686 20055
21623 20055 5784 -25455 4322 69879 80356 37278 -38555 31469 101075 59518 20510 -71417
21611 -71417 -66398 -60892 -48897 -94965 -55101 4439 27016 52756 34553 30181 2861 39421
21599 39421 6370 -8972 -10957 -13257 -49590 -100654 -87864 -69281 -59401 -11793 -62950 -50709
21587 -50709 -20273 -35634 -7960 54356 52442 16767 19029 40349 4162 60220 96186 121720
21575 121720 156537 214693 220995 156433 54870 27454 4124 19976 96603 49747 13708
21564 13708 20742 70836 88577 29404 -26532 -35888 -42646 -68867 -107541 -81051 -42124 -30073
21552 -30073 -10771 -57958 -64972 -110376 -135054 -117766 -40004 -20067 -43059 21381 8253 -42510
21540 -42510 -62990 -14338 -19796 -27083 -20408 -58989 -135936 -152806 -73284 -29556 52463 65501
21528 65501 48745 15801 -49672 -78172 -80253 -43559 -66734 -126216 -98277 -68524 -38183 -40656
21516 -40656 -69730 -54188 -91190 -170029 -106832 -62199 -27006 -10758 6740 -13932 -19588 68233
21504 68233 103193 131061 116564 14290 -97638 -99593 -68791 -37473 47611 9836 -66680
21493 -66680 -72636 -94474 -90390 -15302 -43166 -49337 -54852 -97385 -61875 -55778 -37789 23885 36728
21480 36728 13769 9942 -34077 11279 -3074 29031 -29847 -103760 -87031 -72002 -7071 60035
21468 60035 78167 77558 80129 38512 -37531 34837 72151 94424 92568 -16696 -11394 11983
21456 11983 -59880 -71271 -53266 -83392 -14272 -23193 -32395 -26552 -52073 -21701 57213 33299
21444 33299 798 -12811 9769 9019 -9403 -25316 -66905 -35247 9431 -18141 -21949 -48104
21432 -48104 -105532 -142958 -198669 -151340 -41777 -53513 -215374 -215398 -191472 -111641 -35833 -49615
21420 -49615 -141135 -112239 -77545 -23624 -12863 -64115 -98931 -97943 -47790 -38865 1990 26304
21408 26304 -9750 -92607 -115538 -85360 -49376 -53792 -50019 -26517 -110511 -121950 -100971 -28198
21396 -28198 -14700 7887 7224 114806 148222 156222 176096 115791 9266 -19202 -12041 -12150
21384 -12150 -1558 29607 42972 52356 1482 -39223 3980 -4422 -82166 -154064 -179223 -165573
21372 -165573 -143065 -150186 -46312 53809 14297 8350 -5868 -39570 -51813 -7651 -24546
21361 -24546 -102488 -119712 -121708 -170676 -165694 -88076 -47303 -24675 -18919 -48434 -76501 -127382
21349 -127382 -112916 -96317 -114183 -67080 4788 108060 40836 5654 57011 69473 41821
21338 41821 28987 91030 93591 28093 17754 6042 -44392 -82921 -69628 -35010 8786 -67471
21326 -67471 -58532 19471 25127 -75117 -122616 -54344 -44829 -69591 -79253 -92432 -140439 -143939
21314 -143939 -124924 -137153 -91959 -82463 -47560 -4632 -45127 27190 71649 15084 -98783
21303 -98783 -63455 -134137 -181006 -176654 -139489 -106037 -85590 -81722 -33880 35863 82838 109335
21291 109335 67285 38703 1102 33629 -21239 -63775 -92436 -105100 -108146 -91519 -23134 69418
21279 69418 57209 -48002 -147562 -157171 -115393 -43093 -4077 2253 -58871 -47973 -72440 -106193
21267 -106193 -123173 -142852 -156666 -118648 -97003 -33936 -41519 -7968 8536 88425 44265 -9612
21255 -9612 -59199 -42727 -24904 -55476 -100449 -103567 -66699 -122225 -109691 -11305 18875 65003
21243 65003 55632 -40485 -75018 -75267 -46639 -782 -26390 39702 21677 -30842 -26293 -60537
21231 -60537 -73748 -17754 62407 41287 33056 12312 22797 17620 -30977 13503 48318 -38406
21219 -38406 -127641 -88728 -17011 8168 14240 -21618 -107639 -252 61376 53877 56282 11820
21207 11820 -67952 -56187 -22115 28370 70805 22597 -9934 -3307 -57698 -121740 -81203 -74602
21195 -74602 -55890 50697 -3285 -94501 -105973 -106132 -122275 -129477 -170777 -99850 -12946 11167
21183 11167 47340 72776 6953 -20360 -24493 -2014 48619 87351 156056 71187 -32731 -92587
21171 -92587 -25545 -4330 11704 -52387 -85261 -10337 -23994 -70231 -72011 -49735 -71359 -40139
21159 -40139 -32564 -42129 -103057 -46250 8654 17442 -61377 -114121 -29010 -34029 -44693 -30628
21147 -30628 3462 4480 -21444 -23501 4300 17416 -19779 -10013 11585 -13197 32355 96185
21135 96185 73235 47942 92994 79284 20966 -43400 -29767 -73327 -138947 -83215 -101257 -82203
21123 -82203 -15602 2042 -10062 -8361 -18313 -37917 -4074 28397 2864 -13845 31589 99286
21111 99286 101302 39043 49354 22633 -24963 -50297 -88834 -55580 -30351 -16673 -43518 -133833
21099 -133833 -198788 -154770 -56215 35884 40687 6330 -45220 8553 68421 43958 32529 -44468
21087 -44468 -52573 -49189 9841 42927 7341 -76741 -122975 -96294 -52732 -35130 -39870 -19720
21075 -19720 32289 27008 -73914 -126055 -40741 9952 22434 -7261 -51955 -84694 -22751 -137
21063 -137 3937 -12116 -48895 -53443 -23252 17539 -40712 -76062 -115351 -60011 -38149 -6896
21051 -6896 118799 96067 47264 -225 -69116 -67574 13942 79624 64108 -62984 -76574 -32214
21039 -32214 -5762 -26816 -47169 -16991 13219 -18077 17479 42920 56350 8292 6729 8189
21027 8189 46878 42907 30770 46516 62230 42344 30599 -50437 -87420 -140994 -183096 -121497
21015 -121497 -75151 -106072 -146382 -140538 -133898 -128867 -89803 -53325 -42397 -28071 -73087 -63849
21003 -63849 -50851 -44793 4076 -18004 -14806 -37336 -27419 2603 6579 40284 72179 38131
20991 38131 -2622 -68229 -174036 -123931 -122660 -69324 30155 88489 126224 71444 -13334 -2200
20979 -2200 20054 -3986 14074 83893 86233 -8501 -28481 -39110 -18925 -9959 22218 -6369
20967 -6369 -11827 -65629 -59404 -28604 4406 7315 1142 22691 28285 61085 124618 75533 41087
20954 41087 14367 58909 4831 -77764 -62572 -51350 -11416 56628 59049 34300 39902 94485
20942 94485 40403 5439 29308 -11109 4116 13470 -19667 1775 29005 -16698 -41070 -39512
20930 -39512 -28687 -96944 -94319 -41675 -23179 -8281 -89444 -82885 -18831 32349 55899 50901
20918 50901 43262 21029 2043 -25463 4636 60936 130125 94430 46129 19728 9616 -5031
20906 -5031 59491 126897 71943 8646 59473 119290 -21870 -57247 -41557 -23515 -19002 -66291
20894 -66291 -59660 -22008 -95730 -86542 9630 -29019 -90220 -91636 -192283 -169496 -143667 -137364
20882 -137364 -119957 -55700 -123634 -128636 -107206 -56977 -39506 -8098 -28081 -30224 -3318 44696
20870 44696 110031 60849 -45216 -90791 -107491 -88647 -30879 -21352 -59955 -157321 -150081 -114948
20858 -114948 -54703 -46636 35849 37757 18674 10822 23542 75247 149248 83319 32336 -20466
20846 -20466 -24665 -7887 -60886 -60259 61 20462 -19540 -26906 58150 57305 24104 45704 -38665
20833 -38665 -99645 -97524 -97351 -78762 -59640 63617 71982 46305 -2512 -75830 -46140 -6064
20821 -6064 52138 43097 -4551 -91398 -56851 -24369 -16204 -49576 -24072 -79801 -114125 -50958
20809 -50958 -25360 3891 -38525 -8929 67864 15085 -27351 -17388 -50451 -70226 -84558 -188776
20797 -188776 -226670 -195110 -62468 71324 108314 33247 58759 55855 2285 -38273 -42170
20786 -42170 -60357 -81689 -53480 -27762 -7010 -36679 -15411 38836 6279 -25329 65927 155563
20774 155563 148232 89970 14588 -100473 -157277 -99835 -31345 -26447 -8977 21493 -10788 12939
20762 12939 46333 50401 -7757 -60434 -59667 -27132 -6808 36174 46137 64722 72196 96956 97448
20749 97448 19490 -38555 35495 36025 -7025 -55520 -44144 -51720 -35837 -35717 -57437 -41670 -59599
20736 -59599 -67351 -1098 35978 35209 -9215 -4495 47269 71358 17253 -74589 -70985 2587 80570
20723 80570 1116 -9882 14226 -46169 -140861 -207125 -104479 -72075 -7227 5178 -53043
20712 -53043 -104626 -95446 -106910 -144544 -115132 -83112 -61387 -47346 -49144 -105227 -197726 -158973
20700 -158973 -133253 -159993 -136510 -93324 -87584 -52358 -74348 -64896 -77613 -64886 -79009 -101518
20688 -101518 -62599 -102057 -180539 -205641 -159958 -184493 -119427 -77631 -66645 -56666 -28836 -11428
20676 -11428 -54984 -50058 -113838 -115990 -93580 -93166 -28830 55211 -7681 -75275 -50203 -6010
20664 -6010 -17955 6167 18940 -5738 3787 -38824 -75067 -39634 15550 6980 44438 53982
20652 53982 -30307 -62941 -70115 -75877 -98354 -147254 -138616 -115215 -107572 -85789 -44815 -39974 -68521
20639 -68521 -22499 46284 93037 46184 -11094 -23321 -7186 -1104 -66534 -114797 -122546 -107569
20627 -107569 -82105 -45252 34819 26750 21667 -81896 -60905 -11642 30230 19614 -48948 -23822
20615 -23822 40586 113834 77787 6670 28931 22851 12534 39524 -1641 33040 24728 9917
20603 9917 -9360 -55238 -116977 -156643 -109090 -73699 26650 73850 10810 -70359 -74806 -50756
20591 -50756 -62064 -1963 -61819 -102660 36202 -26013 -114970 -103734 -100508 -60471 8262 28088
20579 28088 -55715 -119357 -67310 -1940 98655 75618 -16246 -79926 -134639 -139726 -98110 -60483
20567 -60483 -99185 -55519 -99968 -168713 -154746 -104656 -80542 16065 57775 67752 11516 -70961
20555 -70961 -73946 -71489 -37976 -32109 -32422 -4596 78 17784 55115 32279 19280 45265 40953
20542 40953 64116 18338 -41303 -123089 -104100 -122262 -65203 -53824 -51644 -32591 -36265 -124239
20530 -124239 -77855 -14748 -47581 -22594 -27147 -80270 -71802 -79068 -54598 -115894 -140791 -57045
20518 -57045 -60470 -46537 -119867 -99963 -12426 23730 44573 18157 -32460 18432 62233 -13448
20506 -13448 -17714 10114 64029 69211 42676 25816 70496 94745 98453 77017 -19439 -11952
20494 -11952 41918 33963 66480 44908 13444 18377 -51764 -48494 -33154 -103777 -128916 -88619
20482 -88619 -50032 -48258 -34087 -76633 -50027 28384 31563 -54117 -123457 -145714 -39011 -27838
20470 -27838 9207 3944 37281 29546 -50992 -73995 -76179 -106209 -138377 -107560 -170917 -171313 -201970
20457 -201970 -179770 -129753 -142154 -120996 -32005 -37540 -92235 -56506 -62386 -52715 -8205 -22423
20445 -22423 46619 84323 1515 -33180 44311 42272 -4668 -21447 35105 69160 -22409 -30795
20433 -30795 498 -16093 -30824 -60541 -73187 -41125 -31323 -27353 -18699 -25291 23958 85949
20421 85949 102950 26729 -8356 -90335 -102753 -50976 27649 100090 155527 105429 34669 37509
20409 37509 -5497 -120307 -123010 -112839 -158213 -127137 -46708 -25373 -7465 17658 56324 64679
20397 64679 91228 78868 98543 80426 41678 -22244 -40713 -37639 -59713 -115756 -76899 -16424
20385 -16424 -33648 -105277 -73470 -29139 -23687 -25745 -43126 4350 54674 10691 -25141 -51576
20373 -51576 -73568 -105044 -133646 -46010 80494 121604 44272 35143 -4780 -120118 -145400
20362 -145400 -77262 -100147 -102475 -59813 -35365 -57913 -89388 -43779 31716 -24927 -60114 -29252
20350 -29252 -2367 -30954 -2740 -35891 -62319 -56859 -65665 -57962 2400 18705 6677 55130
20338 55130 49672 -6195 -15157 -41392 -25354 -19788 -95815 -159256 -131654 -108206 -68932 -45229
20326 -45229 -1618 -25508 -9740 7895 28342 38108 13973 -28842 -24918 -96185 -103255 -69171
20314 -69171 -48984 -87578 -53711 -11447 12512 -23872 -18612 27917 -7648 -31769 -121269 -97490
20302 -97490 -51770 -41501 9806 40424 69866 14172 -20515 60611 10109 377 -1357 23584
20290 23584 86598 117714 74709 20085 -56534 -51718 -10296 -35008 -74436 -57706 -79734 -79663
20278 -79663 -95460 -49072 -35577 -48603 -65331 -85429 -44296 27624 63099 -31413 -57697 -66082
20266 -66082 -8091 -20587 -79884 -54137 -45015 -50558 -39751 -29797 -52497 -54991 -23435 -655
20254 -655 -15341 -45427 -55373 -67350 24212 60008 16200 42967 33551 -24096 -55789 87508
20242 87508 124384 67568 75762 16922 16790 24699 41804 99507 103406 97339 72675 -35851 -21200
20229 -21200 10406 -38515 -10865 -18643 -63557 8593 51071 89768 102104 117058 52195 -138917
20217 -138917 -159377 -94234 -66646 -83594 -112589 -5971 79633 53264 47014 46973 27525 62922
20205 62922 39350 22017 79475 52200 15596 39058 21744 -18272 25154 44189 -38333 32033
20193 32033 117963 89083 -14318 -27195 725 -28791 -48607 -18102 -7531 -34462 -8067
20182 -8067 11954 1247 1641 -36643 -103256 -76933 -2714 37875 23074 11002 15471 26467
20170 26467 25526 95824 122471 62165 6181 -19290 21558 36142 17335 -5588 -1492 15998
20158 15998 -7033 19798 -335 -74303 -118740 -202939 -200222 -105079 -40582 -35615 -79265 -43276
20146 -43276 -22278 -36512 20464 31032 -76475 -112652 -48778 -16654 -65577 -88838 -4852
20135 -4852 -25975 -49934 -45157 -57589 -98872 -57371 -40956 -19483 24568 -19085 -46507 -44372
20123 -44372 -48919 -41150 -14663 -33416 -53183 -65687 -57680 -60589 -58308 -87562 -136927 -35925
20111 -35925 37560 6580 -58250 -58201 -35699 -7390 5958 20802 18547 18426 71766 70864 5964
20098 5964 87841 42872 34904 55765 89887 20438 -106107 -62676 7455 61379 30643 -77506
20086 -77506 -75134 -28536 -62559 -83608 -60060 -75299 -65563 -77980 -95959 -117269 -114977 -81975
20074 -81975 -44636 -2453 -67918 -59780 884 55117 50664 2093 -55254 -63195 -49541 -68743
20062 -68743 -36958 -50829 -33279 -63858 -83971 -132694 -102303 -84043 -64786 -70492 -11085 -32862
20050 -32862 -21530 18840 -36443 -69976 34458 101485 51877 29634 -53758 -43329 -63649
20039 -63649 -88429 -31476 -43146 -59311 -79853 -67758 -71463 -65445 -13853 -30743 -95361 -62984
20027 -62984 -35146 -22095 -6864 -36616 -51483 -91397 -117574 -53780 -73912 -65408 -9045 -19249
20015 -19249 17593 62758 57588 5449 -56908 -58918 -58744 -46095 -104657 -142636 -155875 -128178
20003 -128178 -124166 -110870 -42716 57427 106806 97837 -34996 -66385 -28598 -52261 -82524
19992 -82524 -79080 -87216 -24585 41142 30186 51259 49340 48884 40345 27732 -18599 -60560 -35983
19979 -35983 8591 -16965 -44529 -48167 -53345 -93045 -66743 47046 72703 39799 -26105 -64982
19967 -64982 -58422 49293 60024 70121 104335 99917 57464 57839 85836 35415 -25874 -62526
19955 -62526 -90096 -47745 -34448 -87880 -68371 -32103 -44660 -44734 -77815 -105307 -101331 -22222
19943 -22222 -2903 -26949 39874 80738 72262 65677 79235 -20329 -94196 -107036 -164532 -102694
19931 -102694 63291 105679 44838 -25045 6948 11083 6671 66337 -9920 111400 196620
19920 196620 96020 92519 123985 89252 46534 43330 5269 -12049 -67819 -22430 47760 33813
19908 33813 21222 28639 -7763 -34402 -29744 -94214 -132310 -133117 -81473 -136654 -204651 -177226
19896 -177226 -146335 -111018 -79157 -38404 -7413 923 23871 10155 59927 16888 -7957 59859
19884 59859 113887 130773 137010 90022 51187 19654 -13729 -43936 -75700 -81750 -37886 -12190
19872 -12190 -22190 -129101 -182124 -136761 -87408 -62508 -45523 47312 123828 175675 151757
19861 151757 42083 -28930 -40670 3367 46493 47703 44181 34871 131072 123813 114241 108817
19849 108817 103047 49221 21273 -21794 45699 90136 51994 95891 77517 36271 76369 27960
19837 27960 -87081 -48184 22410 45237 61903 14661 -64409 -26319 9873 41534 -17064
19826 -17064 -92684 -97205 -99069 -41742 -51917 -364 22886 39101 24339 18951 -54469 -174550
19814 -174550 -217066 -143413 13185 94639 155545 178581 74537 -4447 -39012 -45187 -62428
19803 -62428 -30467 -43221 -105838 -142171 -34367 53827 -28 -15382 -129962 -146409 -125908
19792 -125908 -54540 -66704 -42355 -46862 -73366 -57398 -6298 14137 -32755 -32174 -21531 25917
19780 25917 37477 14753 82857 56259 -9703 -72147 -9442 68372 140849 57094 -35497 -59566
19768 -59566 -79873 -22046 -23432 -50597 -3397 47580 68126 63061 167626 124528 -3141 7720
19756 7720 -26740 -89409 -59600 -38851 -25153 -39295 1128 -15089 -55122 -22847 -2347 11409
19744 11409 35431 70253 49579 4581 -27154 -396 29551 -17663 -90973 -68991 -21158 -42142
19732 -42142 -37439 -73697 -89090 -49522 -7244 -73672 -42357 5062 -16177 -88996 -103101 -147087
19720 -147087 -89324 54130 104254 58942 -1525 -2716 -16529 34325 93073 145348 99165
19709 99165 82347 17808 21273 46943 2698 -25414 2154 -10779 -77340 -50409 -67742 -70914
19697 -70914 -22285 22322 -65773 -134348 -174269 -230570 -187131 -121875 -58547 37147 6797 -9376
19685 -9376 -33343 -52564 -62765 -80127 -67824 -27518 35580 59073 58726 26749 -13656 -26084
19673 -26084 -6472 16785 -50464 1527 -26545 -73490 -36693 -63099 -45684 -28876 -16128 -53842
19661 -53842 -37729 -19687 -28537 -1186 48234 50539 19601 -30871 24344 95361 70317 83149
19649 83149 126985 72582 98915 119264 104677 101038 62397 30192 -46831 -113997 -140050 -73204
19637 -73204 -54925 -30857 -1370 -45228 -5775 -24431 -47583 -34911 7908 30715 35211 23745
19625 23745 7510 -21272 -71733 -75511 -44956 -112129 -94018 -55642 -5019 -35908 -79190 -7914
19613 -7914 28976 58650 61798 83157 132631 151164 133912 119632 130757 34483 -20497 18018
19601 18018 -39531 -63096 -69689 -48959 16362 37863 -4181 11463 66108 32779 7686 29782
19589 29782 -5027 108713 191450 159622 150374 121102 102442 122593 149971 180775 106855 30764
19577 30764 5164 -13156 1523 -17166 -12840 51293 41457 106932 142526 128728 131230 35674
19565 35674 478 79069 101530 39198 100515 79538 20908 14787 14276 -3803 -100854 -153577
19553 -153577 -128971 -42571 46607 15739 -42766 -98798 -54189 -24246 -15144 -2413 -8425 10234
19541 10234 168 9768 -20945 17056 100448 52820 13025 15644 -1621 9827 63962 -1145
19529 -1145 -42208 -8207 -75682 -47131 -75250 -116160 -141315 -67808 -9679 -3386 -18373 -13290
19517 -13290 -70832 -29462 22562 22998 3642 -14190 -80952 -63837 -37764 11882 33479 29237
19505 29237 11716 1775 -13891 2651 26397 -562 -36759 -53702 -30518 -22 -12137 -79644
19493 -79644 -63244 -35357 -35687 35725 113403 172418 139145 68967 99432 155918 107116 43734
19481 43734 2543 14964 20041 -1332 -36462 881 33781 12446 -11165 -22777 -22000 -41433
19469 -41433 -48758 -1468 30583 -20237 -136472 -91380 -47687 70307 160913 102314 103077 113091
19457 113091 69669 -58142 -144165 -170548 -231274 -210805 -200284 -200988 -209565 -147740 -96539 -61407
19445 -61407 -34576 -4122 -32134 -112441 -162620 -72734 -36012 -36838 21141 32352 -32591 -12362
19433 -12362 62958 42927 -30088 -123950 -156460 -165449 -111348 -79594 -74395 -102602 -35716 -34812
19421 -34812 -62071 17265 13224 13534 67132 -53219 -59498 -57255 -92329 -95256 -119120 -121253 -64379
19408 -64379 37438 152489 130614 66216 55267 81692 91850 9316 -97302 -103467 -78656
19397 -78656 -14672 -24060 -75067 -34142 21926 9365 -42038 -52724 -60332 -104368 -154543 -163310
19385 -163310 -213549 -137537 -75057 -20017 56241 64491 59748 24161 10745 -35082 -26719 62743
19373 62743 101232 129459 64682 24049 74432 128025 55969 -11210 24893 32533 33546 -4391
19361 -4391 -41181 -11351 -37482 -8731 46021 4491 -100149 -136316 -146628 -184853 -135287 -34459
19349 -34459 -12945 -14152 -60207 -66681 -3762 -6739 -75654 -96281 -63466 -11700 -28556 -21105
19337 -21105 41758 93692 106811 118530 71491 30944 -13785 -22025 -2696 -17507 -49967 -95685
19325 -95685 -99377 -57019 23676 135830 174434 145841 149979 168571 141312 84464 105881 97613
19313 97613 37198 -47398 11574 43353 63769 18232 -70892 -87742 -36373 -5283 45631 48263
19301 48263 60053 37664 -80337 -57652 34931 100688 66455 52965 82961 100736 111233
19290 111233 116586 68941 20084 58272 139805 147901 40133 30363 56116 48676 24567 -9588
19278 -9588 11033 23094 103139 125921 88940 44193 2560 5978 -6293 -35364 -47275 53480
19266 53480 62471 121536 142701 174350 150289 115256 35897 46072 105412 56444 22092 92222
19254 92222 51292 56982 45094 30273 42184 -34452 6874 80873 105382 104694 64868 -41290
19242 -41290 -44601 -70174 -71071 -111531 -56933 -540 -25321 -37869 -8213 -42238 -63819 -26841
19230 -26841 -66539 -39578 27285 21500 -6308 -25719 -5434 35066 6482 -15436 23833 40265
19218 40265 37763 14338 -1821 -11723 71239 131026 166716 141032 65067 70873 39869 -61098
19206 -61098 -15139 21426 25765 21348 -32258 -41139 9208 5521 18716 53713 76065 10968
19194 10968 17649 86394 93450 88415 131295 204692 207829 208101 278447 257106 251158 301105 356780
19181 356780 356299 340151 379490 464752 491759 562626 701157 853985 939250 974982 884611
19170 884611 753406 690929 668581 650548 662400 656487 668146 803639 883060 833520 800581
19159 800581 692161 557109 445286 320559 294365 253215 117169 152377 211890 226368
19149 226368 232851 247661 255748 217341 175269 266771 287107 315036 322021 332534 304378 308901
19137 308901 327403 279122 198259 227332 203757 152780 205704 346115 442680 509778 591657
19126 591657 672945 734646 764519 873073 980811 893600 849184 754919 722732 704380 725421
19115 725421 845170 900668 897883 922713 995298 902294 663679 426034 347556 359136 306877
19104 306877 270643 234856 253586 182530 121788 70596 139356 185585 233179 264279 252604
19093 252604 195742 281509 282840 324001 434217 494655 421697 470459 541934 501307 497447 545511
19081 545511 657691 679807 786500 973100 1137295 1303029 1661890 2132152 2621670 3012717
19071 3012717 3261823 3215684 2872940 2385105 1977473 1818579 1758239 1830977 2015478 2400797
19061 2400797 2831627 3237650 3279958 3042875 2505136 1874209 1427698 1086678 868128 809261
19051 809261 740183 620529 656447 666278 644363 647434 635654 638971 587834 568680 635969 616524
19039 616524 555981 600452 604639 599374 643038 698624 797650 914525 983194 1016095 1080063 1170358
19027 1170358 1370947 1725200 2125385 2605139 3208045 3578031 3633207 3400401 2879767 2388970
19017 2388970 2065936 1856927 1787783 1966736 2448878 2905515 3295627 3495455 3427743 3028890
19007 3028890 2440120 1879166 1424243 1131546 895414 674205 542250 522269 513794 510861
18997 510861 529468 548240 534631 539508 508767 509829 443152 406841 418032 406398 345828 374029
18985 374029 434330 470301 491210 464566 435262 400775 373158 376208 339600 336087 333109 242625
18973 242625 260427 282728 266019 286988 248920 211151 291307 352577 353519 344562 275569 241886
18961 241886 190620 225702 228106 316093 319152 297485 293521 205125 166275 124902 130167 102189
18949 102189 113439 110001 143501 188642 182109 87343 35972 56400 58724 70354 89386 111408
18937 111408 95293 87335 113630 117133 102665 38303 38672 71729 88234 111895 106411 92404
18925 92404 45170 93419 140962 182342 137150 107517 130500 106941 146733 256648 247249 222962
18913 222962 247316 341477 372351 383225 302169 271975 256319 377189 409309 413037 390128
18902 390128 353807 311780 265700 298616 296104 345490 393755 335435 266260 233112 138234 158874
18890 158874 146015 145358 128451 153042 109183 137100 160574 135813 119901 181259 201942 162798
18878 162798 99238 102999 139714 182089 201237 253320 207752 181605 168569 203688 193444 192868
18866 192868 207685 184886 205831 206611 225320 287177 302370 278226 374289 384552 358328 414697
18854 414697 340350 322635 292253 275848 335217 278162 257901 309413 350032 351655 391187 396903
18842 396903 416593 404226 414925 353555 247279 292924 277390 179978 128433 159523 208090
18831 208090 208566 234871 169478 153086 145988 214744 278272 243947 173794 129028 71484 81399
18819 81399 144397 226536 218602 207319 186825 180850 203951 251652 332302 356826 467433 486438
18807 486438 450854 333206 231903 251305 269531 294363 273466 239621 303260 369809 388433
18796 388433 355894 236243 184875 232303 317218 351333 378927 365568 306770 315899 351589
18785 351589 474277 465795 409485 292327 264098 310125 388035 425440 401487 266957 247883
18774 247883 322060 372097 408804 488880 569242 682028 742736 761211 777262 747339 776720
18763 776720 759708 677606 585391 506448 434647 363015 423282 434606 485727 495713 461274 423504
18751 423504 392719 381622 454211 515790 537746 571070 595491 610214 583553 576285 608316 592667
18739 592667 622645 636107 640031 723222 740780 756389 799975 760157 823172 926917 962617
18728 962617 914605 873737 874472 907915 919836 924722 896915 930099 1007981 1032176 1064439 1072425
18716 1072425 1084646 1060195 1013630 971284 914020 912833 1015381 1022093 995814 1037241 1043514 1097879
18704 1097879 1146214 1105614 1105084 1136391 1177138 1230205 1278903 1320239 1357916 1423080 1510435 1563521
18692 1563521 1668554 1728632 1867012 2014342 2083167 2212109 2437022 2622223 2789279 3074840
18682 3074840 3429954 3828364 4167784 4378039 4503492 4572561 4774569 5201729 5728283 6483502
18672 6483502 7380686 8365068 9362360 10368104 11383469 12449748 13656501 15101484 17050785
18663 17050785 19588736 22800236 26882396 32271943 39428317 48983566 61963785 78808746
18655 78808746 99572186 123671093 146042119 156437291 153389797 137002971 113763307
18648 113763307 96164630 88821563 91288286 101848016 118603262 139376661 156590848
18641 156590848 159556016 148636265 123234222 92448879 67856598 51571753 41625490
18634 41625490 35592028 31783470 29374871 27686728 26534149 25627874 24915801 24552983
18626 24552983 24411373 24571093 24909173 25263542 25564268 25873728 26298348 26718038 27212671
18617 27212671 27834565 28861806 30417486 32385158 34727815 37486189 41060437 45964934
18609 45964934 52731866 62265459 75553444 93263817 115436477 141600775 166802211
18602 166802211 179662215 177381605 160415070 134329033 113353698 103546332 104787235
18595 104787235 115217563 132699728 154768752 174083498 178708011 167685487 141023948
18588 141023948 106862851 78411877 59057403 47035919 39615384 34686336 31291974
18581 31291974 28866206 27000731 25524597 24459925 23756687 23387571 23178127 22893866 22219071
18572 22219071 21261046 20283213 19376095 18631660 18064761 17612976 17419766 17251757 17147260
18563 17147260 16839484 16080481 15036828 13820709 12692478 11740656 10963467 10392366 9880302
18554 9880302 9446367 9098045 8706421 8288089 7841014 7310175 6854856 6365115 6014818
18545 6014818 5802893 5535336 5226567 4999971 4790013 4543099 4306181 4137116 3973053
18536 3973053 3803146 3636639 3485601 3439705 3343817 3210289 2998082 2861973 2804712 2666585
18526 2666585 2483283 2400537 2289593 2197079 2126786 2123698 2173126 2112606 2110505 2031460 2055259
18515 2055259 2145327 2221445 2333770 2363165 2332102 2239006 2124579 1929384 1763554 1641392
18505 1641392 1597023 1607799 1686760 1756039 1689267 1585698 1445590 1297863 1142646 1023561
18495 1023561 873211 827649 872522 842904 873011 877015 816846 812693 754649 749613 775940 842206
18483 842206 797589 789101 806025 772668 844956 876061 869262 893045 840872 891095 925123 891038
18471 891038 872757 758610 757925 748663 690076 749015 683952 641765 648496 690024 633835 557947
18459 557947 453457 465329 507585 540016 526167 527632 442258 390483 316586 276363 365520
18448 365520 381311 344398 316015 308542 273606 301193 378802 388011 421548 390835 310400 346101
18436 346101 354473 354391 327059 315528 311250 381271 416671 454005 410714 396833 448598 483297
18424 483297 540812 540390 537679 521189 456606 470099 442800 397118 392899 386950 352315 360304 384878
18411 384878 444833 447588 443272 426280 398100 375374 318723 285616 358219 334439 297090 252081
18399 252081 281215 337625 370122 357757 315106 295288 277803 241544 275771 246183 263753
18388 263753 350800 386857 385249 398161 426611 434686 381551 298780 358867 344642 299533 256512
18376 256512 211739 149638 190455 240711 257930 304613 334140 324114 292169 272429 268296 279437
18364 279437 246663 300777 338474 291660 281412 316211 326475 301725 284154 264035 291076
18353 291076 337509 323075 251721 254649 300151 366971 443457 452373 413364 399915 431361 397997
18341 397997 325618 310610 312971 364162 376431 315665 256358 260670 225806 221571 266628 265976
18329 265976 206465 196582 265430 292844 211258 220646 196066 160762 130285 119863 133435 162700
18317 162700 263284 266979 220257 228401 246253 303146 307793 405616 542505 523158 494743 507270
18305 507270 525782 541463 533203 564195 496342 412011 422928 458920 448205 472081 443488 362900
18293 362900 344606 317014 342431 330493 361911 406807 426158 351589 259523 204451 156486
18282 156486 105011 150907 262237 323483 293066 282946 299973 276968 311931 367017 378019
18271 378019 478677 493175 550484 725062 825786 928261 1059975 1166652 1220712 1233121
18261 1233121 1108733 965277 886340 851189 824304 788110 765879 809670 781226 642258 494392
18250 494392 431508 441957 471601 435021 413371 469557 533133 516919 415084 383140 378302
18239 378302 374126 342158 379826 357195 307756 317088 340210 321020 283868 359253 402190 375272
18227 375272 363775 395014 471349 545446 581838 658953 769813 838593 928441 1074829 1229980
18216 1229980 1427957 1658460 1864720 2033425 2058729 1859062 1547680 1182299 1064882 1027453
18206 1027453 919119 829764 791908 754651 754745 743110 710923 754652 771309 683234 654349 644445
18194 644445 667084 678182 606438 521798 493364 482167 548180 552808 632106 687926 657129 662318
18182 662318 663439 603464 571861 626017 686964 687390 642074 626812 605608 622750 704409 844625
18170 844625 918563 992093 1117661 1220638 1350407 1506361 1581354 1682117 1784461 1743676
18160 1743676 1610831 1410713 1292999 1195239 1112814 988716 986801 1054351 1100231 1145568 1211569
18149 1211569 1160551 1141087 1139577 1182176 1228471 1211445 1225760 1208959 1231749 1289565 1408002
18138 1408002 1492869 1591094 1653069 1674368 1698934 1857334 2137615 2382093 2645267 2961051
18128 2961051 3249918 3549243 3999618 4617539 5287831 6020114 6731834 7612162 8466633
18119 8466633 9438280 10612415 12147254 14138373 16562198 19697351 23999569 30311124
18111 30311124 39202140 50901112 65411708 81843872 94086587 95278422 86994967
18104 86994967 68424145 48034316 33071406 23781782 18447542 15413242 13559780 12459517
18096 12459517 11837337 11517344 11246244 10867225 10504655 9934221 9347268 8995230 8801754
18087 8801754 8971972 9264994 9635063 10141972 10714886 11186634 11404772 11591242 11673556 11695550
18077 11695550 11705037 11727647 11867968 12236965 12722446 13390690 14299445 15287987 16508344 18040129
18067 18040129 19993445 22233011 24899543 28112045 32424513 38381875 46681583 58146347
18059 58146347 73267430 91849813 113577185 134572055 145314799 143511128 129631651
18052 129631651 108310190 91346961 83652230 85074190 94096340 108755530 127303064
18045 127303064 143697502 148037486 139664441 118139923 90489232 67409501 51615247
18038 51615247 41916054 36234475 32828877 30731869 29290538 28425801 27748366 27059002
18030 27059002 26293360 25477092 24793982 24326765 24054703 23938103 24106747 24348458 24823221
18021 24823221 25541235 26488816 27719957 29323237 31477618 34024338 36908300 40267745
18013 40267745 44541940 50344323 58494151 70015162 86090487 107141713 133199562
18006 133199562 163590264 191938023 204878376 200351650 178791848 148054893 124156040
17999 124156040 113189675 114401314 125456232 143911464 166797359 185702805 188795463
17992 188795463 175790217 146598206 110982381 81989126 62377593 50070375 42635285
17985 42635285 37941498 34571376 31947191 29781001 27964143 26532475 25449606 24694525
17977 24694525 24093185 23620694 23009900 22165244 21109957 20056314 19050187 18284588 17600144
17968 17600144 17096244 16842088 16710707 16366093 15641179 14739761 13725635 12823803 12036743
17959 12036743 11361943 10715157 10070349 9477114 8983390 8517004 8134840 7699846 7231358
17950 7231358 6838731 6573250 6322732 6084150 5922870 5782584 5542922 5308812 5107620
17941 5107620 4871534 4611001 4334778 4094559 3928178 3759672 3619962 3421333 3243032
17932 3243032 3133004 2969025 2853742 2703871 2587826 2563606 2512322 2385783 2255960 2125004
17922 2125004 2046615 1921766 1720841 1683801 1585830 1488819 1497401 1469823 1341015 1272048 1257052
17911 1257052 1302464 1225762 1187025 1186580 1178394 1132939 1133306 1085526 1068443 1067324 1148404 1173518
17899 1173518 1179421 1240573 1227862 1207064 1308664 1276961 1235532 1220720 1222139 1202849 1141588
17888 1141588 1164519 1189298 1255509 1286455 1317927 1358569 1397471 1599792 1771827 1973405 2182100
17877 2182100 2382712 2800098 3413566 3957238 4419539 4619846 4418169 3879324 3148137
17868 3148137 2489566 2096339 1900735 1731550 1489574 1384377 1317524 1230489 1173575 1056642
17858 1056642 1081429 1055831 1012409 1007554 1027761 1027189 1019188 1082573 1068070 1044093 1026833 957090
17846 957090 988962 1018144 1078444 1089394 1051740 1063513 1100162 1211249 1308904 1309138 1302639 1386762
17834 1386762 1520830 1683510 1835087 2050039 2284127 2533776 2870171 3406436 4132961
17825 4132961 5025154 5916741 6517677 6725735 6443566 5572176 4504027 3627276 3101998
17816 3101998 2648525 2292436 2093067 1963012 1882853 1801350 1672359 1522610 1457845 1507519
17806 1507519 1576393 1577275 1548794 1397166 1324332 1383377 1403571 1449895 1500726 1558570 1556970 1518490
17794 1518490 1512214 1561052 1606610 1664627 1668916 1634422 1651040 1746484 1817311 1782249 1775014 1930805
17782 1930805 2121560 2343953 2499856 2685912 3025647 3348954 3746323 4358889 5158617
17773 5158617 5891678 6307231 6393388 6118811 5469802 4902917 4533961 4348137 4318863 4442653
17763 4442653 4760835 5151735 5858838 6758548 7939007 9291408 10703544 12264908 13887059
17754 13887059 15612173 17829362 20650432 24051424 28211380 33682077 41041186 51006195
17746 51006195 64467505 82434903 105027321 132069851 161031713 181349353 182703284
17739 182703284 166417944 133085960 96865032 69163598 51078124 39948834 32991052
17732 32991052 28396186 25203423 22882292 21071531 19721083 18722754 17900156 17220133
17724 17220133 16811043 16612488 16593442 16583914 16545808 16300728 15933714 15730684 15669552 15980378
17714 15980378 16670337 17583017 18499345 19234235 20025286 20956007 22104277 23547417 25159611
17705 25159611 27007054 29222263 31997506 35598221 40132826 45958200 53642063 63819709
17697 63819709 77588675 96355149 121624758 154322469 194359557 239781959 279982366
17690 279982366 296447342 283249249 241714586 183993206 132079539 95363565 72107787
17683 72107787 57649797 48283717 41866088 37267440 33674273 30841795 28555334 26652501
17675 26652501 24958690 23553180 22500795 21725499 21174818 20761378 20462833 20162592 19986049
17666 19986049 19861149 20067353 20654415 21406920 22060639 22370378 22185360 21767314 21302963
17657 21302963 20802335 20395905 20274316 20405692 20850682 21645238 22782902 24380641 26615376
17648 26615376 29791245 34297471 40421815 48903868 60477781 75171681 92869123 112143016
17640 112143016 125846961 126678443 115736930 93081532 68116654 49032019 36552196
17633 36552196 28773339 23795305 20498226 18132321 16362854 15015253 13861483 12740114
17625 12740114 11787313 10968395 10268927 9815666 9461373 9122781 8909589 8828369 8672412
17616 8672412 8617985 8648431 8707740 8871547 9133549 9247545 9046410 8713972 8141774 7482732
17606 7482732 6921390 6341962 5829825 5496246 5132870 4873289 4578159 4239241 4004064
17597 4004064 3817029 3579242 3387059 3234959 3141468 2948318 2802873 2680564 2610973 2495709
17587 2495709 2300797 2064155 1946781 1940353 1895624 1831598 1798370 1744912 1661315 1626458 1557022
17576 1557022 1481220 1478332 1454424 1442987 1381321 1381430 1426974 1382915 1275922 1292292 1311011 1334345
17564 1334345 1253181 1160213 1129318 1096036 1016157 930641 843404 812744 790137 788500 788178 780705
17552 780705 776811 740327 740226 761329 664292 607895 617570 644693 718350 735548 781083 880261
17540 880261 964538 1078001 1113018 1051260 1162049 1273034 1243362 1093100 996820 910659 917988
17529 917988 974867 1046626 1220247 1404702 1524755 1684689 1780698 1720541 1414826 1205596
17519 1205596 977922 896437 832507 738044 692922 596782 579544 613157 704254 668171 643024
17508 643024 646249 644208 610087 634520 586898 535968 498402 453107 393506 396007 415310 455972
17496 455972 492145 495995 418124 380690 432695 454361 497064 521911 610595 624356 655965 761597
17484 761597 839737 836003 772679 678529 694063 639486 627257 614535 554109 627918 705689 719248
17472 719248 761150 742976 632476 535300 483835 420693 335800 293128 341172 341101 355300 383526
17460 383526 405892 406552 367181 387021 385217 321418 227710 152864 140924 149482 221946 295062
17448 295062 332732 318211 312140 338626 359293 431823 489199 637971 705205 679034 620925
17437 620925 461911 405504 341393 263825 264408 235230 280949 280324 224181 141176 104234 114290
17425 114290 124792 119343 93101 61336 49881 15202 77180 95290 89821 153876 133983 133515
17413 133515 115546 132127 128865 54846 53557 24572 71508 56463 41765 30440 18338 79970
17401 79970 129803 144481 134349 178293 186539 141265 98023 68224 68019 119042 103503 78662
17389 78662 93385 105186 119673 141346 133002 126126 159210 221787 244471 167514 137763 146724
17377 146724 102628 159109 152809 157247 209514 148343 97479 51907 55384 120143 131815 122028
17365 122028 99261 148000 170365 72221 5922 72077 66984 78632 108741 153225 111788 90915
17353 90915 40915 -19430 -55377 34016 61163 -13242 -83866 -79665 -94808 -56125 -38372 -18178
17341 -18178 13180 72019 102123 29105 55657 46002 90565 71935 82459 119008 137503 117857
17329 117857 113805 42674 -18202 -37851 -31533 61065 62735 37110 85746 87296 -6551 -22910
17317 -22910 12699 34247 108710 143389 200875 150730 15974 -96418 -93976 -59049 -71900
17306 -71900 -67766 -22436 -456 28384 98357 44928 1678 19491 7567 -82955 -131933 -93644
17294 -93644 -82049 -65955 -59976 -93714 -146837 -90010 -9012 -6521 -17068 34103 6323 -1096
17282 -1096 62717 87293 82146 92886 -3396 -58189 -44371 -19463 -15562 855 16669 -33058
17270 -33058 6311 5954 -54190 -47880 49165 52545 36044 33083 34598 78745 69269 -49253 -53502
17257 -53502 -13216 -30700 -21027 -7851 -13657 18542 49973 22047 -41255 -110741 -84367 -44929
17245 -44929 24172 87566 28964 -5127 -7298 31109 125323 240102 252787 186901 173149 93296
17233 93296 97093 124729 157353 150680 143410 137333 117418 120070 161871 176193 270641 431819
17221 431819 523199 649506 738448 816347 830914 754211 530144 362470 294890 222400 144999
17210 144999 24663 37390 71681 49038 21588 -27982 650 36319 78764 107135 84159
17199 84159 33460 77404 71760 41561 35823 80883 26446 49037 61610 81715 166457 188253
17187 188253 144469 155683 141019 157101 69103 -1275 56154 52549 102554 177579 249455 242729
17175 242729 281967 399282 426890 599289 828032 994413 1197749 1349841 1443654 1400630
17165 1400630 1258154 1039760 824865 637036 471771 383407 345993 259002 216414 158976
17155 158976 92695 98163 161160 153707 126941 132561 86545 33323 94570 176939 232061 249899
17143 249899 254653 327480 287086 258933 178864 121781 42126 15807 -241 -74215 -40218 -69101
17131 -69101 -26096 -5499 68562 82390 85183 82837 90323 129032 130319 151205 158286 226101 303908
17118 303908 409681 482583 538734 542416 475979 388263 305054 250655 164618 50995 25601
17107 25601 44266 37971 28675 27826 -42437 -25439 55879 98071 83161 84493 143228 147482 -20020
17094 -20020 -103731 -56615 14481 30068 -5402 -17994 -29009 37756 88868 92735 102472 27452
17082 27452 -1162 14729 -6974 -34240 -64772 -28633 29281 37986 -5442 -23745 -87960 -96582
17070 -96582 -118977 -174171 -96870 -15474 -27808 -53622 -33337 -115589 -152091 -153733 -152401 -81528
17058 -81528 -45866 -84642 -13204 29892 -15723 -23633 -60031 -164315 -164229 -65238 7299 48880
17046 48880 11644 -32759 -48157 -73616 -34087 13957 23690 12726 38662 19293 -344 25743
17034 25743 95756 97344 -25263 -61058 -69381 -60126 -42828 -29556 -14340 33582 41535 60323
17022 60323 36024 -35677 -59165 -97188 -101603 -155228 -140010 -147614 -162051 -113502 -28292 5053
17010 5053 54527 -37843 -60461 -12348 15495 37524 -22121 -124714 -126169 -145329 -72460 -22746
16998 -22746 44897 84327 43470 -77211 -72307 17287 -5547 -108784 -119921 -143044 -92409
16987 -92409 -78560 -12357 24763 22976 -30922 -80962 -91385 -42284 -30721 -2141 -26823 -121385
16975 -121385 -172947 -153571 -70129 -38829 -80539 -102246 -48389 -17541 -38817 -39631 -63433 -141898
16963 -141898 -135363 -101735 -124846 -152436 -105705 27014 65536 -33353 -135861 -84160 -51927
16952 -51927 8093 -5322 -47549 -9695 -13110 -18827 -41807 -52671 -42818 -49277 -40820 -36259 -5533
16939 -5533 14881 -81582 -108508 -47670 -41298 -63469 -62061 -75113 -81370 -12226 -16822 -6976 -41328
16926 -41328 -32925 -29386 6137 25792 12757 12178 -1438 -50303 -88124 -33136 -77790 -44855
16914 -44855 -33974 -49002 -89255 -39433 6427 35063 4506 -37950 -87480 -84165 -89761 -87528
16902 -87528 -155925 -76526 3317 4075 -63823 -118281 -59060 -73285 -50884 -37608 6332 74770
16890 74770 23110 -1842 -1449 -15454 -34022 -13294 -34023 -30146 -6117 -4831 -14941 -31214
16878 -31214 -19646 11619 7595 -45160 -65701 -19458 2891 -2484 -86593 -112828 -44987 -117396
16866 -117396 -201731 -207769 -213127 -172347 -110882 -16321 18204 -94528 -154076 -100934 -63905 -93884
16854 -93884 -117384 -107577 -136897 -137233 -114992 -4223 5589 -2267 14999 -30750 7101 59525
16842 59525 3197 -14664 21513 11007 -60457 -77851 -15398 4353 23980 9843 53114 77721
16830 77721 69789 20788 -19360 10666 41569 60148 -40178 -19904 39907 11311 -1294 72922
16818 72922 99282 113800 93266 71370 39453 22588 -26813 -49223 -19542 -59778 -93327 -115454
16806 -115454 -69461 -43465 -48623 -75632 -113509 -94686 -27603 -37803 -89910 -17240 -24899 -68017
16794 -68017 -4727 81630 13592 -43558 -11462 11557 9249 -26157 -29504 -73358 -156378 -199560
16782 -199560 -162954 -143484 -30746 -4685 -10541 -60079 -71554 -8747 48967 192799 223561
16771 223561 113850 24776 -71252 -46249 9281 -22996 -18264 -9150 16343 69853 -3326 -79066
16759 -79066 -95631 -65429 -67359 -100107 -50392 -132730 -112159 -63427 -157593 -147999 -63807 -18000
16747 -18000 -22254 -34235 31251 70777 19835 47749 21157 542 -22482 -54802 -70953 -88872
16735 -88872 -53740 -63856 -94836 -15440 7731 -13262 -33166 -101700 -81888 -57864 2892 -15970
16723 -15970 -85970 -40833 -6332 -55814 29902 53075 18624 39528 104857 128295 150457 189112
16711 189112 73759 2851 27015 44347 17396 -44705 -47420 -102968 -106377 -69632 -13362 24572
16699 24572 33231 11952 38413 62427 -61454 -149720 -86549 -115686 -113642 -85468 -108907 -93010
16687 -93010 -97653 -52953 -46696 -36280 -72133 -68584 -84363 -10438 15568 34568 24276 62901
16675 62901 46340 -3893 -61668 -167074 -136450 -109285 -113681 -103679 -41293 -100650 -152239 -137881
16663 -137881 -117484 -121996 -107092 -95843 -120965 -144423 -176700 -85025 -46979 -78526 -118511 -118424
16651 -118424 16333 88586 64444 36605 41558 3147 21950 -33106 -56327 45409 20159
16640 20159 -118109 -115491 -111486 -110873 -89346 -77609 -41476 -61936 -59596 16596 27449 -563
16628 -563 -21568 -80806 -37273 -39230 -51617 -16355 -27768 -70798 -113012 -19213 48695 12946
16616 12946 -28352 45327 71472 51394 -58406 -90014 -63891 -64136 -94462 -80508 -146830 -18764
16604 -18764 20677 -34376 27794 38672 -16434 -59919 -96579 -179046 -225899 -145189 -60771 -46271
16592 -46271 -112847 -43238 -43906 -36001 17294 -49440 -32176 -36572 -80479 -136917 -153411 -128915
16580 -128915 -112010 -144216 -179246 -139545 -111323 -121731 -30631 12509 3563 -26558 -67074 -131195
16568 -131195 -148004 -177786 -189082 -233818 -179744 -45132 79799 83356 11794 -2378 63356
16557 63356 113403 -18750 -91698 -94785 -133220 -173706 -146222 -65398 -20892 -44077 -9055 -13299
16545 -13299 -34293 -16393 -5870 -49413 -68389 -89390 -100026 -127324 -132999 -106386 -36776 -60358
16533 -60358 7085 55683 20491 -6880 -16319 -1670 19836 -22056 -19322 2605 38710 27462
16521 27462 -59908 -69052 -56846 51392 14890 2642 21423 13877 14622 46583 78692 49792
16509 49792 50151 -8217 -94102 -177944 -135369 -62877 -39930 -41556 -88340 -77138 -46342 31648
16497 31648 75801 69309 -27433 -38756 3199 -8216 -20306 -62539 -37207 -10813 -4318 -54615
16485 -54615 -85268 -47785 -89462 -109738 -28072 28151 29361 -36888 -64897 2168 32142 -55225
16473 -55225 -129913 -129489 -75985 -29364 -106267 -200716 -211400 -84058 11310 -18454 -71812 4752
16461 4752 8205 -2551 38298 -4078 -34935 -63615 -52383 -30910 -40228 -114815 -91729 6228
16449 6228 42884 -31473 -93812 -93367 -73748 -59211 -48418 -71694 -55651 -17515 27058 92828
16437 92828 93214 494 -85947 -110342 -136816 -119124 -109523 -67456 -37582 -47505 -24163 -49776
16425 -49776 -39437 10359 39908 32922 7444 -10502 -24014 -9552 18951 81461 83780 8888
16413 8888 -56658 -39560 -11488 -39040 -59153 -39532 -47306 13380 43314 55849 -10602 -79421
16401 -79421 -47864 -106750 -136763 -145450 -47622 20386 -23271 -36027 -17721 -28221 -92769 -83111
16389 -83111 -10107 -12452 -49918 -13110 -10379 -50493 -110785 -118753 -72074 -28717 -96318 -152832
16377 -152832 -170413 -109271 -86887 -71747 -44568 -12328 2662 -30556 25718 8257 12381 93119
16365 93119 94409 65412 93429 124171 72588 49049 -26591 -94400 -90201 -24392 -64813 -31276
16353 -31276 21248 136683 106442 26203 58426 90274 56147 10619 -16955 7654 40988
16342 40988 63750 22627 -4848 4821 -25734 -82359 -87740 -84013 -61836 -74900 -102678 -75240
16330 -75240 -72475 -37664 -43814 -56900 -120048 -122556 -144115 -170966 -115587 -85657 -119341 -153444
16318 -153444 -159787 -130823 -163086 -132539 -80320 -27509 -14721 -19627 -58075 -105738 -153776 -137872
16306 -137872 -114030 -68823 -102596 -108816 -46949 87300 84538 38355 58819 103467 128424 97821
16294 97821 46141 2575 -103443 -156622 -184299 -163043 -113067 -89023 -95750 -94325 -16579 38526
16282 38526 62540 21855 -31845 -101705 -63989 -124067 -74627 -69074 -82512 -128556 -142930 -106256
16270 -106256 -38492 6677 4793 -18293 -73610 -89327 -98923 -99253 -110383 -33797 1235 -42655
16258 -42655 -66328 -83787 -85465 -86120 -6959 52378 19389 -26457 -54360 -45257 77637 108586
16246 108586 62487 6646 11532 58668 15631 13650 91769 83127 -4312 -6369 20833 -4650
16234 -4650 -3626 107839 114039 99512 63548 34455 -74673 -77431 -67939 -24867 17521 28032
16222 28032 12205 -86175 -103349 -90506 -22006 30853 49739 32823 -23621 -52362 -28080 -67005
16210 -67005 -72555 5595 -57119 -91398 -45949 7425 -69069 -127879 -132724 -117263 -95593 -127165
16198 -127165 -48563 -33751 -40518 -213 -23634 -57321 -39001 -24346 20288 -48202 -43972 28715
16186 28715 68834 56313 73128 52575 6983 -66143 -99042 -56687 -12612 -50721 -96856 -148662
16174 -148662 -173439 -75017 -57010 -27033 -5654 -94495 -124258 -60912 -4187 29517 -12723
16163 -12723 6642 57591 73731 30725 -4333 27157 21355 4225 -36543 -33915 -17961 31568
16151 31568 52203 89499 13409 -59245 -74353 -115110 -47029 13552 42884 3154 -36841 44770
16139 44770 38954 67801 35581 79836 61241 18124 -57065 -95742 -75042 -47525 -62030 -135631
16127 -135631 -124606 -102877 -114419 -104821 -116419 -102416 -84611 -126110 -89615 -23351 6560 4599
16115 4599 -25838 16034 21982 -58906 -61110 -20927 3668 2773 36794 48421 61848 40350 -8991
16102 -8991 8105 25184 -12323 -45834 -15247 -47037 -117877 -72321 -45426 -1027 49806 131322
16090 131322 54918 15586 72331 78263 -15719 -109288 -98758 -65130 -22944 -109079 -132391 -113291
16078 -113291 -115671 -104873 -48709 29944 48178 47795 34548 -9399 7256 -48971 -121738 -171110
16066 -171110 -106345 -42846 -34099 -61365 -35854 -7334 20208 54140 69154 7645 -94043
16055 -94043 -64764 -75118 -69024 -98296 -92952 -49636 -44170 4104 36444 14119 48140 -41895
16043 -41895 -41177 -46060 -38027 -960 31350 -25301 -47256 -103001 -120439 -116073 -177088 -150779 -168827
16030 -168827 -135058 -60119 19637 33904 16604 10199 37324 83858 30664 -6542 -2416 11745
16018 11745 -5371 27 23250 -44775 -67194 -41062 -114132 -28405 -30886 -45208 -46316 -15618
16006 -15618 -10427 13399 -32435 -70195 -21537 -19640 -15098 38173 48215 -15134 -67726 -39831
15994 -39831 -24680 12254 40394 58434 14523 -26873 -28976 -20508 6872 11876 12068 44215 1612
15981 1612 -13063 50212 187529 177956 118703 88740 -4850 -66809 -81743 -121968 -220368 -177354
15969 -177354 -56877 -34965 -10246 4470 19925 116177 191954 53889 -69445 -126804 -119218
15958 -119218 -131120 -161678 -164887 -144621 -91988 -18179 -14605 -41349 -10262 -18395 58302 106401
15946 106401 12424 -63985 -44725 57181 106099 56659 119815 129274 67473 -14998 -34510
15935 -34510 -46522 -26740 -17416 4405 58363 14664 28630 -10491 50030 79298 96714 59831
15923 59831 -18202 -105673 -45127 -22363 -40255 -67952 -26832 19036 49687 127452 114938 88242
15911 88242 80414 23222 -11126 -37293 -14419 -49460 -66990 -33860 9787 15315 12730 -8595
15899 -8595 -5060 15491 -15684 10263 31236 -5707 5565 58910 21944 -3255 29167 107527
15887 107527 111460 68317 82169 48548 -19147 -39596 -86013 -25601 13482 10302 -9162 -22915
15875 -22915 -27553 -2320 4896 4112 -33015 -9080 -39361 19951 13485 -1462 66357 96788 79092
15862 79092 63860 41729 6231 28447 38905 -17352 -40640 -12428 -10302 -7776 -44783 -66045
15850 -66045 -41538 -41215 -24017 86623 92979 77934 45057 22624 20820 82555 108020 66549
15838 66549 82457 25833 -46257 -59936 -85719 -104852 -88622 -59935 -63069 -50298 -21347 35531
15826 35531 86118 105635 69379 27018 60095 37523 -48016 -19564 14460 50691 7089 31502
15814 31502 13330 28401 58092 26231 -53010 -129125 -130871 -97381 -80481 -8918 -2383 -51644
15802 -51644 -33137 -25823 -30198 -43397 -71186 -52992 -57419 -51619 -33006 -37264 -63738 -78002 -81525
15789 -81525 -93096 -77544 -110873 -126775 -121176 -36314 -21029 -70787 -4310 75765 73398 82376
15777 82376 95493 93312 106730 118414 80161 14683 5639 -36089 -44342 -14780 -29243 108257
15765 108257 139229 47792 -812 43185 82765 23362 -125199 -92598 13186 68030 28821
15754 28821 42398 104009 119272 120827 91809 60295 28830 59132 44095 67988 45254 -35539
15742 -35539 -17858 48124 35179 38340 4959 4904 26259 50566 59635 -14651 -12364 9453 30662
15729 30662 26881 -29349 -123747 -111021 -63705 21355 26143 33190 -10681 -82609 -110146 -114423
15717 -114423 -95797 -46462 28534 31948 -9640 -970 25044 53978 16953 -44830 -53860 -30018
15705 -30018 524 57015 79340 37430 29994 7315 6245 -17467 19575 -10147 -34758 -93715
15693 -93715 -144687 -142774 -134244 -87008 -67581 1272 4163 25292 63430 42623 13864 -57294
15681 -57294 -69059 -78941 -40476 -70433 -107742 -133872 -113870 -75477 -118342 -100602 -13485 -6243
15669 -6243 43918 44093 31456 -19840 -26315 -41222 60295 82610 39166 53180 83020 25022
15657 25022 6372 31071 53682 102729 7536 4446 -57313 -42782 -26711 -25931 -62418 -28615
15645 -28615 4760 11311 60589 65056 57721 22785 17456 8867 -6495 72307 70022 98917 149909
15632 149909 100663 17704 58568 -41142 -122112 -141584 -138343 -149574 -131104 -81098 -16966 -19846
15620 -19846 -459 -4614 -44657 -32909 -39500 26592 126972 81140 31021 -29073 -280 -10666
15608 -10666 2658 49731 85840 130940 86491 34527 -87080 -83958 -93605 -93123 -40727 15235
15596 15235 -4453 8638 14782 -23970 -89193 -94269 -57898 32147 84381 64450 61081 23417
15584 23417 -46653 -14420 14237 39228 10066 17270 -11250 -4944 91996 82769 87334 -2580
15572 -2580 -17459 13026 70961 50815 31599 30738 53306 29990 -41755 -37131 12320 21058 73672
15559 73672 80518 104088 72881 83735 117833 154116 149257 80133 85312 16226 -65484 -26897
15547 -26897 -13338 22280 67730 56808 63183 52847 16774 31013 -2361 -71128 -73438 -101870
15535 -101870 -141900 -157667 -111922 -46051 -32437 -12266 -8738 7251 50978 22731 -68260 -99135
15523 -99135 -82750 -101107 -140298 -143919 -58648 -15652 -27920 18870 90741 162147 149188 145355
15511 145355 179109 150659 146263 141928 52358 -42700 -115365 -110780 -32730 84902 94463 17018
15499 17018 47998 3648 11162 33847 37728 23933 14263 -21614 -65735 -32030 -57326 -12496
15487 -12496 -19414 5644 43994 66704 53741 54915 47345 101100 78387 44932 75009 78255
15475 78255 52297 -57836 -92887 13826 -27953 -69874 -63024 -33043 49251 80622 22917
15464 22917 -120504 -144094 -81721 21289 127553 64817 32825 -34151 -64366 -111655 -95429
15453 -95429 -148052 -71206 -4232 13303 25164 41727 -48342 -49987 -43998 -18152 -35221 -60865
15441 -60865 -66154 -57098 -3027 36430 28839 33619 22464 32266 -44994 -47520 -43796 18900 45339
15428 45339 38291 5329 -29275 -27853 40627 8332 27624 79604 53307 2278 41058 93733
15416 93733 80634 36306 79005 1089 -76097 -103674 -112050 -77964 -4693 -13299 383 19335
15404 19335 -51724 -101424 -120029 -68684 26557 104195 50062 -1718 -73368 -35964 -81243 -44956
15392 -44956 -3533 -44184 -49713 23425 42379 -7076 25971 -33982 -134907 -160928 -151772 -99020
15380 -99020 -70901 -34076 -65898 26174 54501 26722 -25208 -25917 -64772 -17126 57565 87664
15368 87664 50495 -26701 -55168 -58426 -49262 -43495 -94912 -34644 24358 20838 -11654 -30031
15356 -30031 -52347 39014 1554 8208 13408 67300 106253 38768 -31594 -55257 -58540 -7952
15344 -7952 36230 41969 25867 39438 37417 48824 113510 142947 110762 96514 32619 -3103
15332 -3103 -12320 16376 -47954 7474 27641 23934 48792 85677 129818 149252 155438 71279
15320 71279 39186 54812 -20420 2129 56581 72443 74494 58428 46649 66059 82218 32414
15308 32414 37100 -4992 -17453 -69894 -53183 17350 -26987 -6224 72825 2532 2392 42791
15296 42791 39145 -73209 -126881 -117715 -99687 -78428 -109946 -52127 -73372 -157823 -146785 -80729
15284 -80729 -73366 -60147 -52532 -58108 -92701 -13545 17603 7435 26709 -10061 -14746 -51102
15272 -51102 -75820 -42282 -25377 -13593 75402 63116 1845 -38400 -42233 -73575 -27954 -34234
15260 -34234 -10495 78887 135623 146582 74944 -54750 -72968 -59431 -42349 -50364 -81099 -32406
15248 -32406 -20627 -35704 -11860 -15856 -10905 34018 35147 -4202 -71867 16366 78709 43177
15236 43177 -32123 -87596 -111200 -112760 -56321 -108601 -158069 -86482 -42080 15453 1835 -23818
15224 -23818 -17436 10509 55752 122295 189025 150558 102272 75098 -23447 -65543 -51781 13092
15212 13092 44845 644 -96345 -120278 -76319 -36833 -104551 -161303 -163257 -107712 -98576 -130736
15200 -130736 -153004 -134890 -105498 -85818 -75461 -146993 -28718 132841 113105 42714 -61108
15189 -61108 -65665 -42203 318 43751 48481 74348 47317 -29194 -92601 -92612 -92421 -95018 -101308
15176 -101308 -79137 -115884 -71907 -40635 -13095 -78011 -58279 -40579 -34530 -34718 -61190 -22310
15164 -22310 28696 37570 23678 14228 78113 99291 187822 70488 47855 96266 139419 178662
15152 178662 46304 26151 30931 7534 49066 56776 44632 14857 -26227 -59242 23235 -4071
15140 -4071 14964 52932 56951 3644 -21009 44260 42835 78873 97680 56800 11943 1652
15128 1652 -12917 -46469 21395 12121 -44736 -25882 -59210 38635 148426 130891 90054 26820
15116 26820 14710 -35091 -76078 -57854 -13614 -20073 -23579 -86809 23364 123525 27369 -57446
15104 -57446 -59612 -38007 11979 32658 -27964 -59183 50067 94568 72903 29505 91278 60251
15092 60251 49171 6063 -66145 -64522 -114013 -57502 32317 21813 52272 69301 37524 27771
15080 27771 117595 136336 71513 55680 38235 3996 13866 19593 68002 44646 6294 20424
15068 20424 33666 47526 52291 117125 105145 76044 39026 39082 8040 14197 85139 87060 110826
15055 110826 87827 43697 37336 47883 -39529 -68965 -3572 -23510 24512 67085 153367 146012
15043 146012 111937 143965 178898 186240 151504 169358 153615 127645 89705 51151 23440 26477
15031 26477 -19652 -4849 6866 -34438 -36899 -59795 456 -59457 -116169 -119871 -49624 -2110
15019 -2110 40529 85644 45469 -18873 -117072 -131089 -30501 22898 -22807 -72483 -30990 -11919
15007 -11919 48613 26147 791 64055 117169 166648 140464 148975 104036 6838 1651 42910
14995 42910 19593 37877 32848 59426 87085 98914 57845 74864 128254 96691 51472 22600
14983 22600 63476 74974 100905 128521 94334 70082 90550 72288 58861 72227 69365 67122
14971 67122 89839 161107 167252 213301 213057 156468 42317 -49714 -115020 -643 114134 73558
14959 73558 100343 133807 131849 106959 117538 125915 92570 90730 62885 47522 47034 55704 81265
14946 81265 144531 156277 146512 100072 124314 112637 37716 62262 60494 39215 108207 31570
14934 31570 -25019 -71314 19812 42279 15894 18401 15812 66465 94098 54582 4454 -80960
14922 -80960 -88678 -9731 65644 62695 15250 -46866 -28319 31095 7823 -101008 -40988 -25955
14910 -25955 -92983 -17675 82521 40354 -25444 -33005 31915 129850 182216 186475 212441 188964
14898 188964 173473 191902 198599 157547 172528 116866 95203 143790 159788 175332 217107 110435
14886 110435 24889 36673 28491 44679 69532 120554 38125 -12428 23301 120510 167854 134087
14874 134087 103056 140380 141310 126209 144820 152562 113204 100846 135133 155276 165472 161231
14862 161231 219947 187890 125544 89264 60676 97078 193422 184234 139362 96130 118346 106434
14850 106434 93324 94091 77524 57389 112038 17390 -5869 -446 27261 7247 12893 57181
14838 57181 112895 117702 107311 87775 49109 5629 -55495 -34380 -1931 18875 52042 45639
14826 45639 65648 115493 110998 21376 -13293 9948 84337 107316 86004 166612 207842 173750
14814 173750 132391 119841 155277 143858 93845 70663 53544 -21142 -61420 -39407 -32566 30033
14802 30033 22630 -54759 44214 146906 160655 154816 93181 55386 2091 62340 93572 117881
14790 117881 93077 74093 119873 196629 231467 211014 156664 155993 177449 180457 138503 85583
14778 85583 66307 76007 118279 137951 133581 138796 181377 85599 58992 35142 66850 61806
14766 61806 21745 -81338 -112566 -47465 -7349 -24836 11056 31251 67314 86605 133575
14755 133575 138921 96804 103178 134022 132727 189235 228019 232830 163849 95966 99136 106726 116720
14742 116720 60605 35705 9379 22962 109541 106735 112973 93956 64427 33866 55669 68358
14730 68358 73496 49759 -36326 -19425 67680 84387 101544 57088 30862 -31143 -109727 -136117
14718 -136117 -18554 43706 36719 29653 63971 133139 126689 74151 19798 87287 123175 99992
14706 99992 48730 55805 53171 167326 231792 217998 219748 180045 120390 43225 32090 8299
14694 8299 -24456 -52244 14939 94072 54521 4623 -15596 -12021 -33316 -35790 24713 85730
14682 85730 74067 12825 60898 87619 164339 187020 141244 57787 -1605 11971 66546 102460
14670 102460 162049 202313 168389 74931 -32797 -92040 -63630 4210 38502 83507 36227
14659 36227 14235 14827 29241 52639 63238 96344 115938 123626 56139 -8637 -51537 -40348
14647 -40348 -16597 53396 55827 35469 70214 73318 6178 -19279 -64760 -21162 -5590 7098
14635 7098 11228 29254 39164 -1464 42015 92613 88953 85579 117262 94933 118404 117191 26131
14622 26131 24740 96821 146566 196713 136094 47709 47155 24458 1192 13634 65122 112795
14610 112795 118273 192403 236401 156568 219131 178262 151689 149575 119174 156093 153210 54957
14598 54957 45364 73895 92459 49503 31758 1148 -54863 -28720 82581 88723 60447 42462
14586 42462 6827 19168 57902 71167 59912 48292 -23747 -40832 28702 56864 79780 41827
14574 41827 45451 34227 65881 108985 59221 74217 30816 85898 89206 108713 132074 154866
14562 154866 104403 148077 72959 38870 63005 70076 53858 21814 -41048 -7073 80454 69300
14550 69300 65627 92749 104122 91138 67158 53764 14228 21460 10508 -58079 -64650 -59088
14538 -59088 -1545 67308 97196 116597 7937 9225 23209 93630 163554 133606 108190 122638
14526 122638 101298 127402 119678 138115 155620 168054 64873 2262 42493 59188 64196 76652
14514 76652 85515 16889 -44294 61673 119678 85205 125834 186912 193597 186403 161719 145509
14502 145509 88000 98416 122562 48771 -54657 -30352 31158 43480 81067 54724 51805
14491 51805 27506 14002 29258 69409 55426 48221 63674 86513 59775 -14676 -22035 37616
14479 37616 6113 -6469 40269 97879 105458 172848 201770 169151 85613 42620 79735 102848
14467 102848 159544 201504 149979 80401 22023 65529 64955 24802 15003 11879 32831 46312
14455 46312 120886 104068 111302 113010 78441 83941 43828 78472 111619 174186 193592 153922
14443 153922 124056 65527 -26109 48712 151671 205280 203662 163802 135169 178530 239053
14432 239053 213915 221865 94639 -14066 751 51155 102814 79719 60670 75136 130941
14421 130941 140722 147710 185316 214497 295173 254570 155193 183068 253559 305349 346814 223521
14409 223521 129307 92881 115939 116854 10984 -3438 62587 122997 201410 208258 207605 154429
14397 154429 131442 197023 252885 250859 145447 128848 144763 80973 -9921 -40907 -13089
14386 -13089 60107 44828 107646 148274 124901 94328 81052 88688 131298 145725 160929 140083
14374 140083 79953 29120 55371 122240 164131 182179 166398 194279 165313 107441 111490 106579
14362 106579 99831 95027 92201 51194 57053 87073 71203 28973 18984 2096 19249 91449
14350 91449 137329 144479 142070 107798 138959 180630 216458 249616 206705 156983 152103 122093
14338 122093 111914 112097 70416 67390 26438 -3466 -23995 40198 95857 62312 44573 99117
14326 99117 160646 165796 133622 59082 70690 140321 137621 160272 218049 225974 273864 215872
14314 215872 149092 160569 179726 153263 139613 90906 95134 169226 146379 65213 54059 113643
14302 113643 127720 100187 137866 175406 173022 168559 154451 181065 160944 154155 179469 134835
14290 134835 170211 169827 62213 -20133 -7327 109643 152475 210631 164238 172866 168583 139575
14278 139575 129384 152828 201851 161757 124111 99208 128894 112275 149585 161122 158217 128639
14266 128639 76228 49656 79935 103219 106528 128716 155337 168296 205871 127439 158327 170070
14254 170070 168771 142299 162694 193777 111471 70558 -7648 -65914 -6153 30408 24240 3765
14242 3765 78859 80997 171873 203222 182811 158854 87069 69504 106346 94452 112724 106092
14230 106092 101082 137267 190300 157734 101809 120085 69679 69395 63075 99396 159681 224460
14218 224460 203809 189803 172006 175236 216784 194332 148172 112319 132996 162794 204300 181625
14206 181625 277149 346169 341966 291441 196563 70244 69723 181722 212891 186262 141662 139233
14194 139233 205092 223719 238488 289909 208078 168682 137551 138907 152947 97478 117125 149204
14182 149204 97638 99533 73342 33614 116722 148114 146233 128573 101711 49072 76609 174743
14170 174743 215738 145792 130755 183887 211377 168835 193192 169393 139251 100808 81820
14159 81820 131228 147546 173223 196260 204425 212426 175496 147844 166095 139341 100300 150779
14147 150779 130895 120808 54834 72405 143020 116799 128868 208940 150494 104825 153739
14136 153739 153347 96211 145651 230965 276241 329366 308253 239154 133535 115857 199345 250583
14124 250583 255475 241968 204058 187390 159571 136848 195299 144675 107419 116859 209977 198004
14112 198004 124923 188331 248231 198921 190899 159215 212312 242060 236270 200155 250194 312025
14100 312025 330090 299748 302572 292808 265547 289207 270697 230638 269351 297471 331334 346788
14088 346788 315347 294325 333174 240377 221721 247574 230003 245596 274587 233324 212076
14077 212076 223573 205472 153579 151876 188643 257786 261877 296263 290885 294973 285298 311418
14065 311418 260866 212025 194466 278369 356168 313573 246284 213245 183857 214635 266126
14054 266126 251649 215809 213854 156494 122919 199200 270037 242462 218643 206817 161595 161863
14042 161863 278933 277220 261940 276364 294104 298439 294397 295189 308189 316291 282421 230014
14030 230014 247826 283738 269669 220404 184239 198051 320692 356104 354132 403793 420251
14019 420251 388899 324830 249374 237209 269027 242278 259329 279550 155841 89436 117363
14008 117363 171336 185507 225633 286985 347418 330170 285353 241091 189942 212306 203537 231729
13996 231729 215975 255875 320645 269080 358384 391714 349010 288859 327397 397742 425259
13985 425259 444499 530582 574606 527140 427505 457110 566104 666354 763210 914092 1053443
13974 1053443 1180528 1319569 1463775 1618127 1713870 1697912 1621949 1443776 1235984 1033108
13964 1033108 862361 779418 741597 668662 624455 579192 579892 702580 716620 694685 686775
13953 686775 662777 689823 704847 737138 757720 866321 906271 912956 924836 1025642 1184935
13942 1184935 1287332 1442209 1589167 1743713 2053171 2240669 2372485 2442698 2552002 2564610
13932 2564610 2475937 2275977 2022251 1835771 1601314 1349743 1194258 989096 887134 884993
13922 884993 820828 743219 719767 765355 845927 836008 790877 745074 792356 845640 860233 899982
13910 899982 862804 848249 924709 850180 758986 802519 958459 1122525 1217013 1388319 1596222
13899 1596222 1825226 1944206 1866931 1816862 1729960 1510554 1246570 1084425 974909 876699
13889 876699 861200 848493 773651 667268 647970 627116 594040 624949 620714 591451 621432
13878 621432 631150 614341 620578 643101 636477 585859 568543 618401 647032 737186 757255 708920
13866 708920 717538 745550 741418 818537 885497 893090 907346 1065279 1247272 1390686 1587443
13855 1587443 1816891 1906417 1899537 1715898 1484026 1314733 1137387 1033682 839448 776601
13845 776601 806280 888076 876785 888524 821588 772697 822453 879487 916995 947415 944014 895604
13833 895604 918549 936991 1035577 1109926 1088610 1203575 1254498 1315461 1417683 1614657 1856903
13822 1856903 2075144 2322277 2532697 2688823 2715233 2663250 2528248 2353719 2170493 1985602
13812 1985602 1660109 1497581 1390752 1370347 1359887 1349280 1320902 1291543 1268459 1300837 1362823
13801 1362823 1524551 1776122 1870848 1991283 2271151 2562676 2936850 3416850 4135646 4925281
13791 4925281 5586961 6066921 6243606 6006675 5452879 4667606 4018018 3614934 3512290
13782 3512290 3351238 3257098 3099302 2900793 2628874 2441579 2262049 2099484 2008438 1944724
13772 1944724 2037385 2091487 2106671 2139530 2255200 2411898 2588524 2731508 2935971 3244347
13762 3244347 3699410 4230693 4775995 5526395 6356416 7254820 8020504 8568938 8811635
13753 8811635 8733562 8432383 7829393 6996895 6104669 5263593 4462869 3716140 3118975 2816088
13743 2816088 2629970 2478707 2350215 2265958 2241467 2173376 2161556 2150308 2213312 2205268 2324464
13732 2324464 2487488 2558528 2586628 2643016 2728517 2832394 2982885 3134989 3281548 3614968
13722 3614968 4138604 4641936 5238122 5879831 6398349 6586424 6261283 5557033 4625504
13713 4625504 3715621 3034215 2564514 2251601 2005652 1876965 1772425 1674536 1538593 1486610
13703 1486610 1424980 1430018 1380650 1291079 1303453 1386956 1395543 1327556 1311482 1333579 1351640 1354102
13691 1354102 1364912 1353899 1304496 1252869 1267267 1322350 1289111 1194025 1125064 1042587 972802
13680 972802 997427 978962 992273 1028562 1082238 1090376 1060774 1097339 1098887 1101080 1095116 1124803
13668 1124803 1145460 1092006 1133539 1116765 1156639 1178158 1140849 1080928 1066666 1093150 1051310
13657 1051310 1035507 1009289 1006614 1063336 1130055 1168754 1176190 1255245 1296757 1290752 1371063 1429222
13645 1429222 1336886 1380387 1441279 1412326 1347780 1303661 1283879 1359942 1387343 1471683 1543563
13634 1543563 1540839 1541854 1559887 1519747 1542065 1568332 1565709 1585645 1555531 1525798 1510865 1545870
13622 1545870 1568250 1596457 1564022 1483367 1487062 1487140 1544674 1637342 1617776 1649179 1679505 1718225
13610 1718225 1659930 1638955 1699430 1680638 1625277 1684203 1794166 1772677 1749229 1777115 1870581
13599 1870581 2038303 2081439 2064953 2136943 2199247 2189206 2242896 2283701 2292610 2275561 2212899
13588 2212899 2098564 2086013 2110928 2156250 2141545 2133263 2103461 2222863 2275539 2227023 2261388
13577 2261388 2364572 2488075 2547619 2560832 2569846 2670806 2715802 2713820 2807301 2931575 2960167
13566 2960167 2955383 2997219 3093984 3244281 3375640 3389069 3427499 3470103 3493337 3563739 3679895
13555 3679895 3832890 3939812 3997993 4068873 4187945 4291413 4381705 4491015 4618446 4754093
13545 4754093 4864069 4986513 5102244 5299248 5588718 5853328 6093396 6311065 6607487
13536 6607487 6933482 7327676 7930510 8626856 9488083 10539335 11865692 13349668 15150313
13527 15150313 17226980 19514752 21967789 24409987 26876127 29611079 32840410 36733755
13519 36733755 41690505 48011342 56093107 66578235 80373174 98838893 122905692
13512 122905692 153069469 188707681 226468616 258025558 272182024 263388726 233141861
13505 233141861 190083523 147712797 114370776 91321313 76457093 67146997 61528217
13498 61528217 58413523 57246429 57625005 59346660 62063875 65280125 68354438 70606006
13490 70606006 72055739 73069670 74340801 76617473 80456765 86345090 94734719 105976031
13482 105976031 120820903 140183869 164809183 194968209 231020546 272752801 317292093
13475 317292093 359484862 394140737 415095849 418139453 404875482 377908385 340215816
13468 340215816 296504875 251689950 209103026 172015220 142669139 120623653 104169328
13461 104169328 92489456 84593574 79653123 77022788 76180065 76848566 78758430 81415232
13453 81415232 84070185 86076940 87196424 87555856 87737226 88638788 90866815 94983728
13445 94983728 101352520 110564209 123281650 140501954 163111112 191586007 225208312
13438 225208312 261247595 291940822 305870549 296224318 264053789 217639234 170567343
13431 170567343 132623525 105741125 87650802 75292209 66492347 60103020 55222177
13424 55222177 51536774 48885583 46814996 45288129 44314784 43771323 43574248 43610304 44013291
13415 44013291 44853793 46096601 47745295 49767687 52126371 54973907 58293302 62152196
13407 62152196 66400513 71275367 77071581 84155579 93464797 105975487 123072790 145931461
13399 145931461 175008087 209384348 245109338 273496215 284103248 272234817 239986914
13392 239986914 196737334 155204523 122774136 100218035 85340416 75794085 69732515
13385 69732515 66159633 64430245 64366250 65632532 67845846 70785072 73850852 76376375
13377 76376375 78194705 79618650 81119300 83564680 87556780 93675269 102148290 113396051
13369 113396051 127958814 146489755 169673997 198164554 232642845 273397095 318513238
13362 318513238 363280012 401308577 425646421 430915026 417808431 389161289 348508951
13355 348508951 301519592 253771651 209175955 171596542 142633221 121188275 105235478
13348 105235478 93746018 85929300 81058700 78457897 77496034 78008981 79763177 82074417
13340 82074417 84375643 85997343 86572305 86369184 86048509 86536636 88286345 91768264 97216558
13331 97216558 105083437 116120317 131606282 152568378 179636584 212381786 248275207
13324 248275207 280597747 298258117 293335992 265518112 221376101 174140336 134514344
13317 134514344 105564057 85783667 72339397 62850907 55934140 50717124 46726387
13310 46726387 43559783 41096249 39049316 37410957 36032007 34696893 33490921 32353467
13302 32353467 31249883 30046495 28900114 27925987 26993313 26241890 25594189 24982306 24182407
13293 24182407 23122010 21945807 20835076 19686306 18622133 17694912 16817205 15857284
13285 15857284 15033192 14334981 13597120 12788987 12075255 11394018 10817373 10367864 9850280
13276 9850280 9439186 9074169 8699096 8380963 8069306 7825618 7562889 7206438 6936400
13267 6936400 6575849 6278876 6070441 5831439 5551475 5210291 4991256 4851909 4700267
13258 4700267 4499728 4249371 4084169 4025533 3938316 3776547 3639896 3527769 3489666 3384715
13248 3384715 3260799 3139587 3067282 3002347 2909379 2817595 2636369 2424408 2361445 2302978
13238 2302978 2261370 2222284 2159104 2214385 2270904 2277883 2249241 2158569 2105679 2125725 2033197
13227 2033197 1964154 1935717 1860556 1742783 1571200 1471032 1444625 1461588 1461827 1442701 1359571
13216 1359571 1327836 1268257 1337258 1338675 1304789 1196018 1088461 1072376 1216969 1224158 1178894
13205 1178894 1160297 1165724 1098826 1061324 1010873 1125694 1194556 1198993 1263877 1231822 1238092 1321172
13193 1321172 1346955 1311192 1293570 1326603 1276399 1271649 1245862 1211884 1179328 1188384 1214116 1167180
13181 1167180 1124613 1035614 998388 1018975 961987 922552 924823 957668 948886 860539 812569 761349
13169 761349 653374 633821 640522 617806 603739 616103 646408 697941 716367 694512 743811
13158 743811 795619 805555 812026 829472 858270 833762 797458 801340 756636 731534 698067 682667
13146 682667 744168 794990 815897 799971 838252 825633 760131 706714 624399 559169 568745 598709
13134 598709 603643 576332 615277 631464 652638 631287 645400 565723 520346 537798 502247 551983
13122 551983 581410 637110 619048 582212 551632 452360 359337 431532 484827 514614 536836
13111 536836 508975 495106 500913 445889 356130 404430 410871 341289 339827 325590 207998 224337
13099 224337 271726 319987 359326 359080 278496 321442 354831 286889 275947 310232 282217 277917
13087 277917 253421 215815 239898 265083 265962 233794 206042 163037 200391 246957 241181 242611
13075 242611 197802 41776 21831 144730 186062 226171 193401 156371 140982 160215 114101
13064 114101 129632 130320 115160 187876 219999 226285 277972 308070 325193 342515 305877 297977
13052 297977 343487 438348 430286 398362 461603 555083 672457 727260 804748 979359 1142602
13041 1142602 1263027 1364302 1488034 1506689 1346952 1184736 1042733 886754 717951 549425
13031 549425 489889 476954 420212 399327 487011 585824 578420 561752 573224 593238 536511 521756
13019 521756 565384 641281 758139 740374 730778 784269 847778 892930 970754 1071453 1227848
13008 1227848 1418836 1564061 1774819 2039313 2187219 2256225 2286658 2203089 2061928 1893194
12998 1893194 1666755 1421619 1183619 1004218 870326 705143 621934 572325 531703 509641
12988 509641 531099 459488 412249 380188 377570 443709 490830 462959 465277 467816 571000 661920
12976 661920 699046 690234 785319 847743 977237 1064183 1150255 1261494 1427054 1564475 1552426
12965 1552426 1521410 1389854 1100122 837265 631040 514886 422424 352476 322094 282159
12955 282159 291875 250354 246033 260228 224320 259566 299559 322418 315285 284295 186053 180690
12943 180690 201143 223862 316843 299246 317220 406217 434329 478946 534090 582019 762034
12932 762034 1008901 1194100 1287456 1347455 1382318 1252166 1016306 736928 521920 364898
12922 364898 361642 384255 391845 375722 344204 346101 272843 324099 329031 360016 349212 359786
12910 359786 420805 465662 556728 533666 543907 572006 655808 727204 881651 919215 999156
12899 999156 1129068 1280173 1528749 1746040 1958023 2133716 2252455 2247760 2063070 1825097
12889 1825097 1629338 1357021 1053448 826431 680229 611507 529318 457879 346848 284010
12879 284010 305937 305531 321026 336925 373025 437244 413236 365516 391201 456723 548584 541801
12867 541801 492788 500512 555483 568550 682550 802392 873996 976962 1189986 1326918 1394855
12856 1394855 1451503 1361576 1077618 855201 686008 536141 522710 484860 360218 291492
12846 291492 318308 328077 221382 197196 216257 207698 239853 203478 180276 136269 116162 177783
12834 177783 114650 -12642 21000 -785 -44123 27614 100220 121150 91329 100394 106870 108977
12822 108977 125942 153010 80336 23079 8927 6919 45557 95126 76389 11617 81514 134837
12810 134837 62027 -19186 -44179 -7702 20696 21037 66775 -7085 -81103 -126799 -145563 -55657
12798 -55657 -29541 -17222 -9098 2926 -12386 -66630 -113579 -105433 -136668 -122706 -117647 -48714
12786 -48714 41090 47887 -1183 -2591 73915 13092 29638 29469 23726 35172 71285 99633 29119
12773 29119 -63507 -114852 -75047 -10103 -11375 -20900 -18056 -26069 -31697 -23575 -14246 30724 83685
12760 83685 46472 -18759 -39076 -29598 16634 38148 53194 -11338 -29550 38726 65597 -35644
12748 -35644 -46469 -86159 -101958 -110239 -168588 -173790 -117637 -106106 -87032 -61040 -81631 -95814
12736 -95814 10411 93758 69323 28946 4139 19169 38944 7530 20668 1398 -20143
12725 -20143 3748 37606 75940 26094 69955 76151 19569 -42989 -6356 25826 -21625 -65286
12713 -65286 -3978 32552 34773 -18538 -32227 -30241 -5007 -29115 -24043 -65588 -93447 -96738
12701 -96738 -51747 -35600 -40990 -111506 -162853 -131566 -132518 -84290 -92010 -225504 -219966 -107509
12689 -107509 -113126 -152696 -155636 -93807 -83365 -129823 -177731 -134753 -131758 -108611 -100090 -74375
12677 -74375 -38536 -42714 -5538 68309 3229 7339 -8261 -236 -45805 -95623 -47461 26919
12665 26919 52879 1027 3524 8067 -39021 -37325 -34014 -53379 -47800 -59262 -116114 -85410 -80540
12652 -80540 -102479 -113768 -113808 -56758 -62476 -101078 -115921 -29963 10345 16420 1010 23390 9649
12639 9649 -35059 -3583 57594 119667 55194 31302 47872 30894 44729 15653 -44381 -48413
12627 -48413 9512 -2351 62311 -875 -79185 -68058 -46988 -25093 -80717 -60208 -45028 -41466
12615 -41466 -51159 -82660 -136725 -130014 -94463 -71052 -120573 -124141 -124208 -162021 -149952 -114860 -150004
12602 -150004 -161007 -94144 -77361 -74126 -79038 -27364 -26784 -22873 -27219 -12990 811 4909 -32414
12589 -32414 -128761 -115738 -48666 -44602 -74665 -67842 -46322 6241 -18538 -56933 -98918 -139037
12577 -139037 -218220 -136037 -2539 59803 52540 34692 43317 -9653 -17576 3220 21198 -60351
12565 -60351 -105645 -46629 5792 -53361 -34538 -35499 -69288 -71682 -31462 7642 -387 -124558
12553 -124558 -154068 -126925 -99155 -70971 -60106 -68950 -107893 -204154 -90030 -114158 -151788
12542 -151788 -176073 -162944 -122806 -98176 4159 32462 -5187 -16469 -71007 -59920 -92220
12531 -92220 -134916 -162102 -160721 -118517 -45252 -34571 -73366 -53854 -79608 -95914 -53130 -30550
12519 -30550 -106302 -130722 -130043 -88363 11174 14933 -5702 -61996 -56587 -8224 53461 20643
12507 20643 27853 71133 14143 -38805 -107775 -59521 -44090 -62191 -58718 -91337 -95279 -109198
12495 -109198 -116621 -133838 -129724 -138625 -159038 -72466 -24769 -77050 -109340 -120450 -20963 17953
12483 17953 -25878 -13330 5083 -67005 -129123 -142709 -157686 -100874 -62639 -117343 -144371 -89363
12471 -89363 -121571 -136981 -57056 -6900 -9593 -91388 -175201 -233815 -216370 -209939 -241797 -216815
12459 -216815 -107194 -20747 -1524 29783 -1380 -32979 -14832 39512 18327 -3876 46890
12448 46890 107250 47070 -2588 1497 19088 -6715 -43940 -64111 -129435 -70367 6718 -32511
12436 -32511 -79362 -81604 -13496 -50720 -151962 -104185 -112506 -53185 -1194 39409 2470 -36316
12424 -36316 -64870 -51527 -70369 -77460 -75268 -48102 -24689 -54232 -75294 -39016 -3689 47224
12412 47224 30454 -43640 -102863 -54528 -27123 -96631 -131743 -156608 -132880 -49453 -15457 -104419
12400 -104419 -195141 -224724 -72227 33498 51570 -19385 -42193 -74057 -85252 -69374 -74795
12389 -74795 -46327 29284 -21590 -83744 -122066 -155408 -149388 -156641 -122564 -44123 19789 34239
12377 34239 17517 -21206 27696 98109 69844 -12491 -58922 -67547 -51554 257 7306 -11037
12365 -11037 89632 117339 60061 7680 25618 7437 -33788 -63332 -70498 -5826 -111755
12354 -111755 -144800 -144393 -133730 -54866 -75068 -80593 5871 67382 71291 6082 -25661 -80652
12342 -80652 -58961 -120160 -116909 -67237 -64451 -85817 -42911 -28275 -36398 -48930 -35589 -18738
12330 -18738 -53393 -66739 -36170 -51450 -51658 48450 103134 83978 -4619 -105572 -157113 -108630
12318 -108630 -86918 -74862 -48389 -90551 -71649 -62730 -69593 -42207 -41802 -27583 -68170 -25099
12306 -25099 23697 -3584 -12803 38041 11972 26352 -28814 -7718 5633 -56571 -70223 -1076
12294 -1076 -1775 -70205 -14438 -13833 28861 27616 68557 16841 -29717 -51645 -100161 -191972 -221476
12281 -221476 -169375 -83016 -21781 -66593 -121850 -108812 -157651 -176233 -184545 -84326 -32369
12270 -32369 -16189 -76688 -125189 -171059 -196586 -183747 -89907 -21666 -71565 -167899 -195071 -205417
12258 -205417 -236222 -122422 -13462 -17273 -27352 -6282 -64783 -101260 -119328 -94473 -99920
12247 -99920 -146120 -118037 -34893 4398 11319 26922 119639 131570 23895 -63410 -90127 -77645
12235 -77645 -20000 -9799 -36425 -86936 -93116 -86311 -92826 -28220 26134 -10971 -33627 -35310
12223 -35310 47012 56868 33499 12557 -4100 -49931 -79797 -44557 -49485 -48777 -14222 12481
12211 12481 28338 -27537 -36347 -31428 -1962 -27962 -94919 -97692 -28329 -64255 -49874 -67296
12199 -67296 -57843 -50224 -65562 -170896 -210200 -124098 -57371 -109494 -123233 -103856 -22416 -9455
12187 -9455 60120 60845 17413 -19683 -47420 -13317 6952 55680 50557 35652 44558 16968 -20323
12174 -20323 -40661 -85545 -6360 41 2193 33341 -51834 -114923 -129836 -58499 -7643 -13719
12162 -13719 -10037 -127549 -131720 -30829 -48991 -41685 -85545 -127530 -129058 -150610 -96904 -12928
12150 -12928 19502 -20624 -46050 -82529 -22984 18510 18245 -42395 21558 34764 -41314 -34586
12138 -34586 -1643 -16601 21057 -36883 -60364 -110052 -130890 -158711 -129446 -69261 -52160 -6916
12126 -6916 -12174 -71523 -86042 -56473 -57050 -61421 -29960 -20549 -31473 -118794 -104004 -27977 45901
12113 45901 32415 11028 -49382 -76055 -34745 -68164 -103710 -110879 -135198 -93301 -109798 -141030
12101 -141030 -113263 -104145 -95704 -7419 29808 -70833 -75981 43161 100314 88868 119767 100743
12089 100743 109030 58365 115573 95564 52054 -51068 -65962 44108 96587 26176 21652
12078 21652 -14602 -96275 -87745 -3471 87231 137852 16593 -103342 -86582 -68464 15628
12067 15628 13912 48728 63078 20752 20964 80788 114160 58076 82021 84102 -36925 -68247
12055 -68247 -119517 -108124 -89253 -94191 -42324 -26159 -36875 -66074 -37575 -68768 -50706 -3299
12043 -3299 -7955 -8938 -8827 -22051 15475 26280 36113 1255 -23872 -56798 -30278 91 1837
12030 1837 -23018 -26353 -25894 -56552 -37944 -84384 -14588 80089 71244 47618 -52359 -70535 -47546
12017 -47546 -45602 13376 21981 213 -77365 -86435 -31649 -13967 7914 16275 -245 25515
12005 25515 3514 -60080 -10283 24312 -9434 -5976 36116 60640 93775 102516 82732 53897
11993 53897 26729 -24031 -55739 -32949 -49841 42035 94049 3107 -94490 -161927 -103161 -64815
11981 -64815 -63175 -37840 10131 -31639 -32812 -51708 -73925 -57903 -41190 -76489 -9120 -94704
11969 -94704 -127176 -102493 -154308 -171931 -135837 -36853 -25095 -56667 -11740 34302 98 -48160
11957 -48160 -77990 -97194 -92711 -59395 -47338 -128136 -157563 -169165 -192036 -224191 -186391 -125720
11945 -125720 -78287 2360 33218 11886 -54228 -79616 -94694 -86912 -83658 -58948 -105848 -68316
11933 -68316 -34554 -61523 -61893 -85519 -102321 -104468 -170131 -121288 -41501 -60693 -81209 -45693
11921 -45693 -30930 13949 -30803 -116576 -71252 -50463 -90493 -132275 -102532 -92894 -78918 -7720
11909 -7720 -15609 -26116 97812 120061 130565 150827 89340 14940 4930 -18791 -25782 -59074
11897 -59074 -62223 -62091 -39692 -17798 2644 77173 86306 -11866 -60537 -62277 12187 99305 54302
11884 54302 30427 25310 77493 103936 125466 73845 38034 47600 36519 110062 130576 79657
11872 79657 40388 -43567 -18791 -12167 -22159 28146 42441 -9033 -3575 -33757 -56420 -108005
11860 -108005 -162304 -124323 -36351 -18010 -46798 -92797 -90295 -112927 -194926 -163340 -94329 -14074
11848 -14074 38641 -14229 -48803 18235 95778 41401 -64051 -64322 -38646 -75793 -70420 -70830
11836 -70830 -136246 -118595 -15168 5413 19787 -8107 -32814 -54346 -19583 -42077 -42116 -14463
11824 -14463 -28375 -6741 32055 75963 59812 93953 73483 29132 -35912 -49405 19540 96658
11812 96658 74764 49397 43969 -4276 722 16304 55200 -13951 46659 11942 -68237 -43207
11800 -43207 -29852 -79699 -18227 69226 32094 -44309 -18985 6471 35010 102453 104623 40838
11788 40838 35587 65992 -14135 -99646 -126088 -109676 -104665 669 -21848 -48103 -119688 -105416
11776 -105416 -98184 -129996 -75416 -102574 -87909 -115708 -155285 -82659 -23786 -87032 -96117 -163035
11764 -163035 -199358 -177538 -84490 -29713 35502 39503 31137 -39933 -102169 -127731 -111556 -67741
11752 -67741 -32530 -6812 41352 9600 -61151 -137509 -193423 -144708 -86096 -47466 -13826 -19905
11740 -19905 -146108 -202036 -107439 -76645 -29873 -13195 -17305 105173 92233 -23662 -81170
11729 -81170 -123597 -92055 -68451 -12311 4691 -13357 -55496 -94299 -94727 -79462 22272 159588
11717 159588 163329 128616 53607 1801 -24109 -45686 -57656 -111010 -128326 -101134 -50295 -45743
11705 -45743 -165735 -171150 -144762 -39402 5265 2341 -4794 70215 35292 -27812 -35685 -59922
11693 -59922 16966 72769 124022 85006 89725 79690 13404 -35103 -35706 -8595 11642 -24024
11681 -24024 -29323 6690 -3975 2123 -138629 -135920 -16256 11760 -28310 -58124 -40422 21869
11669 21869 30357 -45623 -46054 -78587 -65615 -34524 -35725 -69330 -122170 -62908 869 2879 -1537
11656 -1537 38026 20935 56397 100013 47928 -22905 -44680 -31567 -8303 -16732 -37749 -66168
11644 -66168 -121829 -138619 -81898 -92365 -56926 -3062 -97638 -73131 -96078 -57756 -41483 -68985
11632 -68985 -14239 17488 32602 29569 1503 -13330 -12167 -5679 52885 33947 -73235 -167804
11620 -167804 -129262 -84397 -36850 36021 46014 34882 61956 42413 -2324 -55582 -86438 -61915
11608 -61915 -40727 15562 17310 -75431 -91871 -48438 29047 -19247 -67373 -62447 -20915 -74381
11596 -74381 -96346 -48913 14257 22798 10521 -35647 -42114 -56592 -90393 -99407 -112646 -109628
11584 -109628 -47680 -10791 -20506 -17165 28586 -14067 -29760 -33938 -30252 9017 66788 -9741
11572 -9741 6746 55696 11284 -32104 -58236 -45344 3383 23523 74642 179946 161035 175279
11560 175279 160993 131639 104341 28823 13419 12997 -24781 -32782 -32390 -33440 -67312 -68623 -51502
11547 -51502 -61507 -51083 -109323 -50052 1199 68887 -13147 -82440 -72079 -99021 -104077 -68824
11535 -68824 -31690 23945 20964 42289 -35454 23824 24997 115 77878 63119 9586 -46702
11523 -46702 -83716 -101980 -154601 -93146 -33497 -12616 -18098 -39385 -80989 -60256 -70136 -76313
11511 -76313 -47143 -29508 -72395 -93954 -110836 -142586 -100120 -77999 -92120 -123425 -73525 -78042
11499 -78042 -16851 34547 48806 78719 122488 62768 -6012 -40060 -63162 -40770 10653 73866
11487 73866 100442 73297 105618 54454 40992 64828 44461 -20293 45342 128903 67273 38911
11475 38911 -28560 -42715 29675 50479 79885 67224 -22757 -44497 -3618 -50214 -105511 -95008
11463 -95008 -71248 -24102 -37829 -47749 -40073 -61334 -48455 253 43084 -30039 -14482 27040
11451 27040 -31624 -62681 -78357 -36932 -29648 -43846 -61317 34109 97578 106339 137076 123902
11439 123902 63833 17029 6283 -56719 -94726 -82837 -18059 47106 27950 -57742 -73920
11428 -73920 -17661 55189 103371 63491 3369 -49563 -33487 -24741 32667 51942 -56430 -103749
11416 -103749 -33567 -58286 -50440 -65220 -50118 30263 80849 67620 -4809 -30320 -21476 -46456
11404 -46456 -34645 -10173 42269 74509 64695 108731 167323 72505 -18779 -41826 -131512 -121583
11392 -121583 -65495 -27099 -42021 -31639 -26162 -19020 1598 31717 32629 39216 -13968 -15175 47536
11379 47536 -11789 99 58508 121520 118520 104783 65385 17052 35160 21523 8711 -66289
11367 -66289 -60620 -32650 -5559 73613 121982 101578 53646 -11585 -14101 -3740 -43875 -27672
11355 -27672 49153 61406 -30133 -20935 11388 12833 84665 63224 60583 30732 28276 -18211
11343 -18211 -49761 -30269 7103 46240 55892 45603 -9528 25534 12557 -27549 -33560 -88807
11331 -88807 -76237 2159 -7122 -39128 -75292 -24618 22437 100019 81997 36715 27745 59553
11319 59553 72607 20235 70843 141744 175528 172553 133617 64902 84818 74776 68825 98821
11307 98821 116506 95739 103348 38610 -4110 -4751 18271 62462 18101 38627 89866 89782 72447
11294 72447 62630 112552 85222 14994 -24340 13960 10597 22830 23704 30243 708 -34440 1303
11281 1303 35748 -5687 19452 69503 81066 94014 102113 45513 8752 57023 63634 -37705
11269 -37705 17498 100573 80497 -6212 -57027 -31760 -11898 -11423 11640 27818 110986 111855
11257 111855 95704 117475 98390 86283 33008 56296 85850 80173 61188 87376 188972
11246 188972 137652 80910 40256 53154 9483 -83565 -56483 40563 54233 -5053 -4361 46702
11234 46702 38142 -54323 -8900 31859 -35842 -42150 -43504 -39251 -31825 -14931 47284 83874 36033
11221 36033 58029 107767 111404 69871 89724 61142 31835 58985 14922 -16575 -37736 -46434
11209 -46434 -75434 -64256 -39797 -49271 -60800 -32329 -28152 -41038 2963 111172 87469 3562
11197 3562 -37879 -3175 33468 119691 113014 85819 115385 86282 66861 44349 51467 97341
11185 97341 41810 -75123 -45171 91092 165121 167959 193415 201170 185749 53667 14867
11174 14867 24869 65827 117006 117473 24217 -30071 -79537 -54709 -6427 -6931 38721 140517
11162 140517 102007 67776 88676 113963 121519 181960 135260 132228 132745 114164 84267 60381
11150 60381 41727 -25236 -50069 -44456 25245 29887 14643 -16178 3372 -9001 19503 61209
11138 61209 79014 20706 5562 -58029 -4766 123206 138947 8240 -67105 -45436 -1423
11127 -1423 64233 29510 31125 57058 48097 4649 32111 24729 -46008 -38082 62179 82301
11115 82301 17323 47966 35645 16397 58328 4445 -59133 -16498 -9024 632 521 -61744
11103 -61744 -36679 11981 23117 17378 -7498 -44384 -12444 -5621 -18557 63271 83664 53667
11091 53667 67649 51149 22617 43404 48636 77227 122604 173098 121212 46034 -28616 -48312
11079 -48312 -14106 -24303 -11045 -42529 5472 42389 42654 40219 73959 2939 30516 72363
11067 72363 131296 128398 157662 157077 176709 232097 274637 190785 133770 124616 55591 -50405
11055 -50405 -73161 -3615 120493 134393 107756 87886 20043 6230 44513 63562 81002
11044 81002 135850 137219 62978 22329 18866 7228 53888 83649 96319 59832 -17376 -3226
11032 -3226 -7368 27510 72934 157877 218348 238459 227579 194992 133535 73138 127971 166428
11020 166428 151847 109569 119162 49796 64144 129765 37765 -30432 -71248 -58175 13861 140267
11008 140267 145641 100612 106216 121529 106255 79992 72632 121869 157908 164450 56889 43077
10996 43077 60714 86621 82782 42005 80280 129734 119359 106158 8845 19501 14642 21988
10984 21988 25905 60485 53010 47637 53811 32667 -17704 75962 69076 35574 96051 128803 125808
10971 125808 163003 118670 46441 22519 51526 101977 166139 131347 68326 88831 90257 70188
10959 70188 79014 33687 -39703 -8175 -11899 -3548 23939 124947 190046 117860 38804 13761
10947 13761 18633 59890 77798 38380 39355 9661 -22649 -85769 6912 93431 85858 67013
10935 67013 56894 68239 90543 143880 157466 67112 -80447 -84564 -25704 1579 -52147 -20338
10923 -20338 -15074 -21866 -19417 16022 46074 90319 101592 137629 138251 138833 108459 146878 186500
10910 186500 194003 153712 234232 175176 88146 73591 67593 65026 84513 119532 120058 77269
10898 77269 54531 64056 59998 116629 138994 147299 192869 187109 115197 60034 5637 -34714
10886 -34714 -34 6530 60299 70216 148007 103882 31244 30153 -48630 -64449 -61323 -11999
10874 -11999 43179 117527 159381 98280 32766 -20744 -33835 27087 83283 79061 14837 90841
10862 90841 89258 -4927 -5234 65421 151647 230866 172586 52726 53028 128261 225463 142274
10850 142274 76848 57956 43725 20104 3409 18341 42663 71903 -34228 -16780 91453
10839 91453 117887 74447 24411 62915 -9375 -41918 -42054 -4764 8468 53108 64709 90267
10827 90267 42328 15746 -16453 -21764 -113965 -40012 27022 -16686 -24291 1434 110228 167355
10815 167355 192904 170283 119695 83457 100920 157594 194337 224490 225275 184178 195858 215492
10803 215492 218845 160131 115499 65826 -2875 -15593 -4881 4789 9397 11403 18292 25120 -6539
10790 -6539 9460 86698 85880 127061 125193 119191 169680 177603 180432 207480 205071 177296 181550
10777 181550 149482 103005 126248 112563 40449 10760 -22357 51284 -3786 -42484 26559
10766 26559 69337 111492 115871 91339 118402 110987 97424 110854 144753 37933 -21714 26233
10754 26233 57418 125599 148295 113325 59909 42414 167469 170358 128430 78485 81455 72740
10742 72740 52778 71483 103577 49658 977 -17859 30601 94994 84325 70583 128181 127436
10730 127436 100082 60717 100063 159252 248169 253425 185878 143153 147932 115670 75478 172432
10718 172432 325014 325146 246941 212939 198109 169807 112729 165410 273737 242041 162010
10707 162010 144345 186534 166650 164824 134203 109209 111185 182705 215967 196842 190134 206001
10695 206001 231574 273190 227143 186000 151205 206437 232307 176580 106792 63917 123475
10684 123475 114762 149398 235122 311339 296810 266539 283770 223664 210226 230928 292145 284883
10672 284883 284556 247399 265746 213450 144080 137119 232974 267641 276709 374431 503941 511883
10660 511883 497167 514230 500687 556987 621041 614571 602550 586715 555990 518137 394158
10649 394158 283097 323768 331443 311318 330685 316136 275706 374690 351694 295459 352351
10638 352351 356510 370857 427170 398798 419429 364862 338150 360309 394507 428322 448416 545512
10626 545512 618298 737801 922520 1028582 1095302 1150479 1213087 1310755 1330023 1302202 1196294
10615 1196294 1018992 851508 692121 650806 639601 557046 477701 477127 516876 516351 562360
10604 562360 586982 612422 573395 586513 660861 691976 645934 612826 640547 832561 900829
10593 900829 881119 864275 869370 916779 1062589 1186717 1284864 1371599 1529865 1773634 1903113
10582 1903113 1837636 1772434 1630605 1476173 1367079 1246717 1135415 1025934 850434 720219
10572 720219 688154 679711 648252 629347 657967 761812 776902 759883 657501 608628 630426
10561 630426 700659 746802 767830 750818 796662 853325 895841 986785 1113486 1254810 1353818
10550 1353818 1393713 1456922 1557666 1503225 1457487 1446988 1458745 1309266 1083388 953736
10540 953736 729694 609721 565675 516888 533747 529260 517519 507156 560567 562193 574391
10529 574391 571674 490383 458281 450601 433066 456271 509060 517970 519270 557998 576078 510016
10517 510016 523268 556069 566316 649020 706982 730777 786739 735547 668049 580895 512946
10506 512946 539181 477340 445109 513149 478582 387678 438933 441143 403975 395013 342531 393876
10494 393876 366847 350752 356664 365576 342890 354579 378527 409814 417558 456876 483847 486550
10482 486550 591558 669320 739532 784896 706295 632968 570142 592987 523982 543801 556141
10471 556141 576741 660750 633695 543577 532315 535880 532290 541797 517258 503673 472831 445378
10459 445378 417755 327221 359626 439018 473458 465342 471462 410433 437616 500155 543440 521258
10447 521258 474004 520683 535842 544225 626015 710233 736990 680083 619496 626051 665015 671665
10435 671665 693854 665757 641830 651768 598294 544546 500944 476690 434162 430319 421036 431496
10423 431496 429815 417399 497130 539178 542379 509318 437648 422516 469661 588809 703011
10412 703011 667838 621154 593202 632103 659754 643599 689652 725221 718022 783273 795527 876693
10400 876693 887512 854315 833451 755966 781542 801167 828901 873792 914665 1070464 1191026
10389 1191026 1221604 1256302 1333403 1448582 1609619 1837357 2002461 2149016 2251483 2197231
10379 2197231 2041706 1772292 1549408 1462127 1398512 1304276 1218865 1149569 1049208 1047157 1081539
10368 1081539 1251728 1382589 1404984 1407175 1408908 1429613 1442240 1481534 1522452 1564561 1668774
10357 1668774 1793933 1947935 2152820 2422923 2686450 3036641 3441538 3808280 4231156
10348 4231156 4590322 4886365 5181154 5343650 5354889 5128734 4672889 4195588 3710040 3280544
10338 3280544 2955121 2754420 2580337 2490602 2430841 2388566 2437147 2454653 2347769 2326777
10328 2326777 2328002 2315531 2398755 2452989 2575052 2756592 2904977 2983578 3204321 3563707
10318 3563707 3922643 4305763 4768072 5200708 5506862 5895110 6448204 7037244 7521970
10309 7521970 7751545 7686370 7417821 6956579 6425315 5835249 5311463 4910188 4530593 4108506
10299 4108506 3756940 3624069 3610079 3639465 3630813 3584992 3519030 3602869 3671770 3732194 3798343
10288 3798343 3918730 4087545 4249607 4484838 4634508 4860161 5060873 5377401 5752231
10279 5752231 6275271 6915497 7585610 8259951 9015350 9835005 10612819 11294481 11829144
10270 11829144 12278825 12798427 13382679 14195190 15378979 16946920 18963349 21606622 25068201
10261 25068201 29678863 35590917 42953758 51580049 60714716 68463126 72317867 70916470
10253 70916470 64422132 54629134 44579152 36421406 30584160 26803682 24548436 23317140
10245 23317140 22746969 22983944 23864714 25239445 27137268 29452521 31843621 33765390
10237 33765390 35138876 35904588 36415014 37296996 39153763 42105053 46199196 51686018
10229 51686018 58809980 67924593 79539646 94050604 111765591 132193975 153549627
10222 153549627 173681679 191124903 204033902 210560271 209669769 200669606 183626288
10215 183626288 161343962 137640645 115045316 96025467 82083916 72902940 67580321
10208 67580321 65126702 64351283 64390053 64707143 64917109 65079478 65653215 66742404 68095073
10199 68095073 69713065 71616395 74331678 78597362 85276825 94598339 106743771 121641954
10191 121641954 138849366 157031918 174941859 192716909 211619652 233346080 258808217
10184 258808217 284054455 300376807 300666151 283657602 253530206 220171041 191269977
10177 191269977 168153588 148888279 131068171 114102910 99207365 87559932 79350221
10170 79350221 74140640 71265692 69992080 69929946 70371089 71000084 71868602 73119876 74778424
10161 74778424 76655815 78316990 80025818 82284006 85868283 91751217 100440332 111995300
10153 111995300 126505157 143514418 161219351 177554537 191449363 201496422 206693253
10146 206693253 206259470 199334792 185682405 166065853 143428481 120400623 99205306
10139 99205306 81932131 69018355 59922775 53607634 49144137 45991030 43751106 42357076
10131 42357076 41569351 41341077 41522120 41630860 41302106 40317561 38914794 37503031 36597648
10122 36597648 36173711 36239747 36951530 38214373 40025989 42676270 46426144 51384643 57443912
10113 57443912 64120519 70563411 74629592 74461793 69524246 60699761 50236397 40640796
10105 40640796 33167437 27787315 23985605 21322953 19359159 17801912 16553586 15487454
10097 15487454 14441399 13536507 12858339 12204507 11634826 11181266 10683269 10338354 10048034
10088 10048034 9791183 9552705 9262576 8963442 8687630 8398893 8047542 7700055 7284579
10079 7284579 6862679 6545719 6252937 5896840 5591818 5352743 5121581 4842518 4646069
10070 4646069 4416825 4269249 4119658 3918308 3768064 3635333 3432733 3278759 3221054 3106193
10060 3106193 2943295 2896591 2915970 2853185 2745972 2675269 2672755 2654869 2602806 2526037 2396563
10049 2396563 2221508 2048405 1910953 1892522 1918628 1786663 1675891 1601657 1523594 1530320
10039 1530320 1485921 1438077 1415212 1464324 1404761 1356351 1283664 1195981 1151461 1065684 1018233
10028 1018233 1027511 945205 896921 911313 995802 1001064 1007060 1052882 1066765 1005898 1038378 1080906
10016 1080906 1139757 1102501 1019580 1010609 1116172 1101742 1047433 1005619 1051441 1059670 1019391
10005 1019391 956012 934936 918456 895113 802825 801104 824144 858807 816337 772424 726232
9994 726232 624864 613622 598762 565839 525313 506698 514328 478855 510262 614592 631597
9983 631597 591775 574868 567318 638342 664101 679337 700096 757620 756225 682578 654144 634026
9971 634026 567198 578735 486549 412638 459041 482020 459705 440196 438415 438755 476656 409030
9959 409030 419892 484032 434583 323509 234616 183779 249153 310021 317281 329454 277001 259852
9947 259852 196647 206842 312017 326389 416835 427378 440688 373195 371124 434233 452399 401696
9935 401696 364878 352757 305116 314874 261023 183779 194501 214693 204676 204166 231918 257094
9923 257094 251790 265049 262281 263795 251809 249074 244071 236453 139938 125363 190734 226991 239352
9910 239352 272431 324241 317642 340224 369168 341602 362978 310582 253332 208678 162098 139303
9898 139303 149940 272501 306972 198724 141288 133245 145377 181866 250149 224816 154437
9887 154437 140124 143656 88986 121203 226725 215301 249337 260045 250847 188901 227443 214188
9875 214188 209303 195694 142023 129818 139520 220394 172329 198400 237414 237236 167812 208001
9863 208001 158614 110388 128003 129190 163001 234454 269915 271339 284531 318092 395611 398748
9851 398748 388399 494176 539978 427455 392438 406357 375431 311906 250163 223273 199812
9840 199812 229589 278729 319641 222061 203156 178708 160815 223789 308632 349919 380553 448288
9828 448288 442646 371380 333154 370934 492023 536034 584989 586036 621743 725032 871401
9817 871401 984241 1108846 1161688 1083975 1060346 1094025 1023561 934191 896506 846767 779872
9806 779872 658345 583376 572660 484134 367513 304212 274094 279468 324953 339685 333060 426726
9794 426726 488448 504389 491099 429294 389116 410075 437383 533050 656469 828057 992095
9783 992095 999394 1007469 1111093 1218655 1398765 1607560 1675623 1628807 1498253 1297690 1111478
9772 1111478 953512 797102 724997 725967 655011 583669 511127 490612 430965 428901 437078 491902
9760 491902 448635 371182 349515 400133 436640 404535 400950 363424 326248 351384 405004 598277
9748 598277 678917 760145 867770 953279 1009192 1073554 1035510 1098153 1127812 1071930 1025942
9737 1025942 931688 835033 639339 480078 380135 306043 235634 221050 224410 244816 264538
9726 264538 296807 318581 320357 283401 226140 228057 224491 242080 225703 154952 117787 208603
9714 208603 245589 201914 259667 319234 311032 353134 493975 428854 381134 354561 290264 170584
9702 170584 118714 113056 187403 113824 94859 120651 69943 11312 53940 63963 25568 32508
9690 32508 -7221 -36273 -18026 14731 -614 -20572 -43429 -4155 20102 5575 18715 52705
9678 52705 54681 50409 31089 -28320 -9633 15226 -40036 -13867 91396 62991 38547 -35785
9666 -35785 -56037 -13944 -64669 -50517 60509 86585 36872 26776 42547 50639 58783 27942
9654 27942 99623 110448 87355 68618 27450 16415 46449 73876 37706 1536 2457 -26041
9642 -26041 -8616 -73818 -197017 -233974 -125658 -146181 -165288 -100169 -6472 27002 63111
9631 63111 84559 36988 35214 15322 -60461 -76381 -39145 -36023 25064 99292 146324 171343
9619 171343 154827 62967 -6624 -15656 -39976 -78696 -37402 -11783 4893 -63099 -115485 -126711
9607 -126711 -113113 -33477 -5236 27275 102390 133996 86747 20406 136020 176873 66049
9596 66049 60844 93068 83689 72445 83254 118252 122602 142645 68508 46341 28053 12119
9584 12119 118794 163344 140851 141864 170926 113845 1304 65409 131029 106486 71801 32294
9572 32294 31006 58742 111265 113724 67970 87285 100935 82879 39782 -22083 -84412 -85798
9560 -85798 -71095 2945 19664 -7305 -41603 -51527 -42967 33557 42194 1977 122929 149926
9548 149926 83919 24926 -8478 46236 132055 76718 11032 27748 41633 -7721 3438 42109
9536 42109 52965 146541 167119 133266 110568 69022 72850 67833 78741 48395 47405 23094 -2378
9523 -2378 23949 53815 83655 59156 64380 117582 168802 196324 167387 66337 86760 131577
9511 131577 59221 87227 107306 80585 87101 63276 43703 47273 36621 57259 122376 186761
9499 186761 102290 6851 -25466 4669 51844 150812 207166 182538 167547 163584 143872 111723
9487 111723 166889 218906 134945 165254 224451 190997 209865 248540 195071 157447 156158 229011
9475 229011 242141 233549 151609 69885 70465 124124 160625 119697 44071 -4977 35290 46256
9463 46256 113320 133955 110160 122860 126018 117144 56645 46663 50670 145168 181988 185803 182209
9450 182209 181688 186924 215510 126371 21637 38969 114454 110280 145363 173670 177434 176213 191997
9437 191997 174963 57559 36666 38757 116344 182468 212186 186119 63221 22647 9681
9426 9681 74545 83845 19200 4613 113626 119402 127326 149589 188064 254602 272080 207753
9414 207753 166928 152254 152249 216185 222571 199802 184347 185963 143394 127810 162216 149051 105430
9401 105430 111655 110697 106736 165909 239032 155733 124192 142762 164681 108201 96022 146382
9389 146382 229146 304360 216049 160999 145252 232867 245349 236511 203303 160705 107584 147433
9377 147433 210575 308809 286961 262604 216025 127049 60661 108861 162625 224291 199516 208419
9365 208419 215887 247566 192976 234285 246776 236922 200348 218716 221395 245978 197725 130363
9353 130363 76411 169925 197028 80858 105424 186580 144322 163335 142081 151031 167413 143488
9341 143488 174053 236949 204898 211558 272108 247656 244787 257130 213738 285561 328250 277222
9329 277222 271147 295669 308210 290740 305036 296032 248004 164909 187022 299917 293898 237690
9317 237690 315451 345189 325680 333720 351596 334042 315405 321314 336654 278532 214927 256525
9305 256525 253883 236725 226286 183462 225312 307858 312555 314121 336141 362163 314961 305298
9293 305298 278112 304626 392101 446772 443791 452637 482876 507420 468910 364716 384931 374184
9281 374184 330856 331230 382962 388134 377410 427008 422524 425180 403857 448919 422620 369497 365777
9268 365777 295698 321713 385606 395896 387532 306562 270741 234437 296977 282663 319159 360126
9256 360126 402891 351897 324167 320244 381426 377392 417872 405622 375615 371632 476638 558023
9244 558023 453159 406304 350410 242318 287330 409149 399367 381193 391628 374979 347424
9233 347424 416879 428384 439772 513588 534250 491707 439346 398795 383395 369133 364726 344217
9221 344217 404634 455745 452132 458921 471980 378190 353284 412316 334491 299167 338006 399426
9209 399426 440171 481472 497900 430778 389893 397022 491406 506812 489681 520708 538339 507179
9197 507179 466242 497679 544566 485680 439985 409283 415719 465775 494817 493808 516209 489208
9185 489208 446315 405967 480949 545758 553312 480937 435061 534789 635718 635495 634812 647414
9173 647414 621703 561437 584549 629712 597069 547510 536439 607973 628006 627074 645283 651215
9161 651215 702102 653480 641161 633180 683812 620101 610944 628210 610282 583345 524241 525152
9149 525152 509668 564791 592906 562185 576644 619486 613287 589457 563966 526675 422244 479113
9137 479113 551273 509487 561351 601473 605877 554359 555327 570582 581658 556398 510763 529377
9125 529377 536253 566021 622290 669416 620286 521932 504759 575435 632541 637712 616908 598065
9113 598065 660099 609791 598626 568483 566346 597161 615435 637394 649320 637523 617508 624739
9101 624739 578027 600878 611912 524785 532717 616239 647104 581755 538644 575143 618121 534053
9089 534053 508600 536283 502152 444655 448898 543169 581968 606506 620934 647698 703048 680541
9077 680541 595384 483366 476401 540390 538582 553875 552153 507195 509152 534868 527042 469053
9065 469053 374623 357160 410713 472031 479595 454231 497973 492735 483542 517462 513087 573117
9053 573117 634171 651159 545901 461678 500105 547265 535134 575297 608130 557751 472797
9042 472797 458769 428641 420565 382322 419118 418315 415086 402898 364709 324852 283850 197756
9030 197756 165856 219594 271653 363665 407573 453642 416015 463249 445499 452674 427150 470124
9018 470124 501553 464304 417608 351410 327528 334564 360484 412721 457028 442257 373028 388298
9006 388298 359038 335329 337832 365473 418352 483232 503727 473643 455162 445817 408341 422235
8994 422235 411926 376403 386948 347307 317449 347136 371156 394033 370960 396209 390884 418119
8982 418119 405824 379188 322460 354686 397599 394715 364618 408700 402462 359087 387973 341366
8970 341366 345765 380081 344395 334313 301634 299814 326527 363373 387557 367372 387205 389719
8958 389719 288020 224577 305604 317621 340898 396848 353931 335577 316769 309729 294699 233047
8946 233047 158725 172034 188596 212764 154389 130106 201227 260329 306813 305327 238062 267046
8934 267046 289957 256529 214636 162420 137754 114359 147926 91872 63145 56374 102421 133250
8922 133250 160368 157168 148371 192408 274141 307025 271565 192048 135663 146740 197919 244732
8910 244732 170082 221622 317068 312265 328835 289961 289260 284267 280922 267528 238089 228334 220348
8897 220348 230688 269205 260486 311667 352788 277281 201754 191374 220852 203127 178587 134130
8885 134130 119848 171820 181515 132816 33993 43563 77141 130256 116172 102192 125899 93422
8873 93422 149485 206410 212328 176428 163560 220377 237767 229362 255393 308948 275246 257833
8861 257833 306713 304343 241065 167013 137564 180545 202542 239021 215847 213154 183917 204842
8849 204842 188275 174793 167586 133801 118460 128420 68074 125851 176352 162434 187523 145060
8837 145060 212518 241234 210321 228933 274285 316862 299924 200558 204218 236392 251444 213990
8825 213990 250626 321899 316729 285558 294909 209411 96697 64422 140864 129441 181588 208978
8813 208978 191339 256063 250850 187334 81378 142867 209414 213971 189134 222335 225162 165255
8801 165255 178229 142566 84254 47136 81796 43245 35111 45162 56503 140182 198349 224311
8789 224311 206519 228229 205731 241331 217738 210483 197481 137261 111228 135720 128064 112719
8777 112719 169129 244989 299929 305356 409798 436632 447675 440328 346400 232562 225136 206098
8765 206098 208600 188948 140847 121300 81399 80814 170347 171182 121130 86495 145883 216751 210679
8752 210679 168918 134848 159176 201792 219971 224933 196969 186480 174673 160187 177998 262184
8740 262184 278018 234611 234723 224378 212513 275701 358029 381033 390367 347047 301683 271614
8728 271614 294358 274303 252019 167203 135749 178105 209049 145859 95502 79299 115525 63821
8716 63821 2892 -12553 68209 144601 179146 143725 51507 58176 71829 48276 -31091 -43687
8704 -43687 -49693 -46901 52413 128771 134492 73826 -17642 6517 12854 33461 98897 145515 173385
8691 173385 151124 106389 21013 2326 53891 137768 199076 124152 37838 45617 92162 177889
8679 177889 154150 137520 68344 90804 42785 485 -14743 -68222 -48407 14389 44038 9165
8667 9165 20427 96899 113704 73364 52451 88180 47024 46796 -3981 -63300 -75900 -12373
8655 -12373 70260 93566 16939 13228 -17778 -30216 -26954 8435 36965 27753 -43200 -140800
8643 -140800 -80719 10020 31588 62794 132067 143172 120217 123845 139927 88938 29826 15000
8631 15000 -4968 24878 11465 -2372 83253 158469 115790 76785 75656 52224 71630 81230
8619 81230 55448 74345 98815 144841 144902 73751 21039 62439 110136 104508 14606 -48590 -72562
8606 -72562 2571 -16087 -42389 -32384 617 43654 146910 215409 187532 171239 149561 110169
8594 110169 128054 162540 172715 173105 205090 210316 174305 144608 119927 58817 92095 83296
8582 83296 102791 132083 118718 120100 26986 -41030 -29058 3977 64398 109879 93960 76619
8570 76619 83805 50197 1502 68736 93458 62355 49369 21799 20614 -48170 -61774 -5030
8558 -5030 112360 193537 151131 23123 -109255 -74176 -15856 28850 -31517 -42137 89427
8547 89427 183785 138065 26074 -16041 95214 115765 75567 93456 141830 158140 167810 59667
8535 59667 -1217 32381 41107 14705 462 57711 79883 84982 104244 81960 87349 90362 90547
8522 90547 67268 26248 29879 30721 64278 128405 115519 98793 109605 91727 95331 67676 44510
8509 44510 15067 -18342 -36893 62972 64554 35498 48466 433 28103 62631 39466 25873
8497 25873 15244 -15274 11322 44119 79475 84785 42613 -39554 -132330 -91156 -24107 57079
8485 57079 121415 123419 47045 13856 -16594 19404 137448 172747 130098 52730 60000 64364
8473 64364 95540 122276 145213 103334 55843 64655 88253 132732 154378 61197 48388 52566
8461 52566 456 -36760 -24219 -40464 -59439 -27201 -64998 -152168 -131181 -44559 44158 99343
8449 99343 86082 -30148 -30211 -12097 -3111 -38552 -13152 -60419 -65877 36691 45222 29076 37353
8436 37353 45544 -9810 -68263 -112952 -155038 -109850 -87677 -84716 -7879 -17530 -42334 -55772
8424 -55772 -47463 -117812 -172491 -98146 -98921 -153925 -171788 -139843 -42198 -18527 -26609 -82198 -61669
8411 -61669 -5791 16188 29502 -56389 -62476 -11222 -18176 -29609 27971 52720 73071 23073
8399 23073 -11828 44494 -5386 -495 46905 36768 42359 125482 151905 160240 160246 222528 211493
8386 211493 188672 73074 11668 -274 -10391 -108832 -130161 -93460 -32093 -30941 -35963 -124516
8374 -124516 -156088 -144851 -137634 -101077 -14092 38123 61838 38031 -9975 -78407 -78634 -28109
8362 -28109 36920 82555 45917 33978 -48236 -62918 -4316 -43248 -16630 9509 59696 105262
8350 105262 96821 45631 53886 42424 -51200 -10129 86474 126342 66742 62040 -24090 -102408
8338 -102408 -83067 18440 33422 41591 60719 -8584 -55145 -108791 -123654 -105538 -136813 -116301
8326 -116301 -104094 -79875 -95378 -24773 56153 84444 119794 126358 161716 116617 52602 24670
8314 24670 15060 53752 60491 98262 99753 101924 45007 -38984 -46305 -27457 -25493 -112832 -139270
8301 -139270 -87061 -22766 24452 17292 97985 136227 47518 69907 42909 32937 -12167 -99050
8289 -99050 -85858 -44503 -65824 -13543 -13669 23659 124914 111729 105931 128826 64536 -66279
8277 -66279 -101145 -162998 -219916 -116479 -3179 -57731 -33570 139 -20469 -36615 19796
8266 19796 29876 -26586 -28229 7062 5302 58290 67093 73387 17034 -1790 -79413 -90252 -34623
8253 -34623 20585 4349 -45746 -69451 -59648 -86853 -100645 -123602 -51904 75038 121483 104691
8241 104691 81777 102572 92332 13020 -24237 -117840 -123804 -96453 -56025 37579 56413 144300
8229 144300 183882 184913 112774 86630 141109 134233 127812 113629 64791 28398 24705 19736 3123
8216 3123 -24093 7358 59798 25557 -26822 26070 91451 75915 38378 45748 45761 24203 2238
8203 2238 14883 74409 30964 -40170 -77625 -80184 -55794 -45644 -35229 24852 -3109 4619
8191 4619 -43378 -10628 77189 127797 126712 117607 112575 38075 45365 63082 89133 61631 -48113
8178 -48113 -78993 -115231 -135857 -147748 -127241 -115465 -33061 -7073 -43682 -107349 -77134 -62231
8166 -62231 -29281 -19223 -51842 38393 84479 100815 100001 64976 18081 54216 49493 73433
8154 73433 84558 120681 151969 113455 57134 38279 34975 -4161 39339 29618 -40526 -49686
8142 -49686 -34005 -47193 -16179 39802 44465 62834 53905 57270 -199 -40539 -697 17851
8130 17851 74318 36476 5915 11510 7439 25728 55504 17643 17511 51935 59167 39884 39898
8117 39898 84359 74040 126855 149150 108910 72790 62988 12820 -23522 23430 65514 50131
8105 50131 38413 11357 23890 38793 12405 2315 2685 -28868 17118 63941 44424 105485
8093 105485 95584 93647 75072 13981 40618 81968 81873 89060 41765 32367 26175 6603 33205
8080 33205 85721 125301 85157 1711 -43150 -116530 -177982 -107276 -78437 -65952 -25666 6312
8068 6312 18512 29009 -11680 -69638 39288 91496 70152 70898 29498 -34364 296 27948
8056 27948 14002 -47561 -105643 -55757 7281 -49917 -85830 -37267 11982 -17094 38806 32381
8044 32381 106889 112470 59784 84093 114318 54636 80652 128465 44112 -22887 -20414 77855
8032 77855 60318 -29221 -46531 -82866 -60127 26293 20610 -30453 -24846 -60822 -108117 -56238
8020 -56238 15724 37695 -37847 -41698 23320 20897 42669 59353 134055 95993 105338 68371
8008 68371 -5906 23264 43523 -23235 -21209 67682 86818 24332 -66380 -80587 -19936 -686
7996 -686 25642 38825 28642 -46097 -42315 4593 2484 -5616 -2180 50886 85389 78783 98148
7983 98148 152503 208771 143212 54571 -14738 -23445 -3305 39021 28112 55117 52443 -5954
7971 -5954 -21973 -42057 25047 12646 -41829 -44988 -25451 -35046 -6849 -74120 -93000 -62418
7959 -62418 -63439 -116323 -82971 -107304 -42754 -23372 -25881 -18448 -2609 -11981 -38485 15357 70714
7946 70714 132882 188969 190696 144858 43923 -14667 35237 -1424 -74407 -80376 -34692 51166
7934 51166 63460 -6526 -13264 -60076 -9635 80181 101911 85342 8289 -30463 -62750 -53852
7922 -53852 -96515 -124245 -129465 -31518 55661 41499 33661 44581 28155 2427 -39661 -105933
7910 -105933 -95151 -132269 -141858 -64921 -58312 -64257 -18130 45099 96760 59501 -40807 15943
7898 15943 49793 49052 -27435 -44616 -27292 -1082 13032 32454 -60408 -94902 18949 29976
7886 29976 32877 56695 94146 42085 -11907 -49550 -76132 -26401 78240 97409 38006 -13458
7874 -13458 -150359 -132083 -34628 -18285 -34886 13540 36422 21660 -3680 -50966 -61646 -31855
7862 -31855 -8092 44960 65527 68308 49759 55792 68380 36726 -33206 -40453 -22874 8388
7850 8388 -3966 48833 4206 -66472 -32763 -27143 -13458 -13267 605 -7131 -13443 -15327 -79154
7837 -79154 -30627 15999 31777 -62176 -61599 2841 78115 51268 -29726 -76861 -104893 -78851
7825 -78851 -49425 -60215 -44434 -43724 -50250 23121 -11507 -8280 21071 2897 -51586 -54673 -23742
7812 -23742 29267 -47880 -20438 -50012 -69556 7019 78309 91262 40527 2297 -35462 -85489
7800 -85489 -62924 -79072 -83616 -60248 -33845 -103479 -129238 -77802 -6941 45093 52917 108028
7788 108028 143113 41584 -3017 -51260 -111528 -105508 -52368 -30423 -45141 -50821 -77959 -38361
7776 -38361 -8883 -47739 -56413 -45281 8321 5702 29867 11396 -31390 -63733 -33611 -4517
7764 -4517 -22985 -52990 -10523 112022 166979 170618 122271 117319 140542 139429 76837 56389
7752 56389 -15339 -6397 16994 -49574 -96768 -75673 -26389 -31753 -16118 -17263 -4395 -116143
7740 -116143 -120558 -112059 -66306 -80810 -59197 -29793 -73624 25553 116506 102826 60648 18738
7728 18738 -7350 -4888 28693 57415 9045 26994 -12919 -88903 -104177 -58584 2628 -14704
7716 -14704 -45525 -107872 -120695 -46339 -45017 -71026 -4261 64852 -12782 -69355 -58489 -27511
7704 -27511 -35456 -54060 -54888 -66151 -95927 -52018 2973 14441 17804 9593 -49438 -89433 -63669
7691 -63669 -76408 -106559 -111666 -99278 17815 84254 10158 7739 -14105 21986 25208 -58471
7679 -58471 -125190 -80683 38482 54172 -65337 -79946 5810 55368 65071 17902 -41031 10000
7667 10000 15920 -5938 44583 4598 -41177 -12642 -11849 -9499 42114 64292 -10238 -63450 -56375
7654 -56375 -31537 -23879 -30685 -22672 -41842 -27426 15392 19740 -2022 11117 -3848 23354 33031
7641 33031 19899 742 18332 -4095 -37538 -39769 -53791 -11243 -85639 -85057 14299 79374
7629 79374 49162 41862 -16634 -82072 -109921 -102945 -49726 -29317 -34691 -6402 6098 14816 5860
7616 5860 61833 77103 -14134 -35225 -30249 8610 -14171 -28041 -54080 -10 53053 -35730
7604 -35730 -72896 48692 83181 -14425 -54742 -68958 -59890 -45312 -59085 -48248 -4802 51814
7592 51814 89676 43056 377 27913 30925 20210 -29433 -102250 -170751 -110245 -53738 -9547
7580 -9547 48390 69495 17052 -10766 -8857 -101776 -136874 -44515 32313 15760 -44376 -56389
7568 -56389 -71982 -84145 -68669 44585 92763 84730 114427 38545 18994 29510 35859 -30927
7556 -30927 -105088 -96214 -71817 -23948 -9985 -35266 -29011 -57852 -54165 -3236 3986 -12367 24505
7543 24505 -2837 3599 -7263 53671 139480 227048 138772 19184 -36946 99036 122737 69847
7531 69847 57603 10987 -15776 17138 81113 120149 104572 121299 146526 124867 128149 85754
7519 85754 3100 -38263 -116036 -137675 -87907 -65450 27397 -3702 -46064 -80644 -22804 24813
7507 24813 26083 -35295 -28050 25471 84042 38379 -48711 -50665 -39764 -73169 -67214 -25886 24421
7494 24421 -29554 9103 28221 -26713 -41261 -39321 -38547 37394 36311 -4272 -21591 -67551 -64020
7481 -64020 -74273 -89102 2843 17078 -4820 -62057 -105904 -118977 -78704 -40465 -45129 -43621
7469 -43621 -29269 -3597 -10837 -53087 -101827 -58088 26832 44535 56091 7366 -28187 27852
7457 27852 97564 80702 34601 -23996 -57390 -53631 12021 -1811 -55019 -7548 40014 8552
7445 8552 3331 21639 29612 7951 32118 33382 582 4034 -84268 -97770 -33085 6312 1571
7432 1571 16928 654 -74013 -110642 -94788 -65374 -39931 4326 51280 -5173 -41507 -27140
7420 -27140 40633 45505 53785 23818 -41038 -238 36220 10121 31253 24763 10266 37963
7408 37963 -1626 -58962 -105211 -118420 -148282 -141653 -78694 -69380 -98801 -99479 -44444 -41749 -1581
7395 -1581 60959 90690 73207 5657 -57561 -43524 -21074 -20562 38983 20669 -2973 -60338
7383 -60338 -51937 -27539 -54602 -67710 -63700 -136428 -178631 -98071 2108 3114 -73399 -106505
7371 -106505 -73150 -30427 -47712 -66906 -86393 -102956 -93962 -29620 -34137 -75801 -67564 29925
7359 29925 132432 91891 -3711 -58052 -78943 -13162 -20478 8358 37571 -20225 -48240 -76554
7347 -76554 -78632 -62311 -79743 -108423 -138432 -99485 -116636 -140124 -45353 -30461 -11164 -52695
7335 -52695 -55316 -56908 -7077 25673 51928 43540 -56218 -56196 -3808 -83853 -141238 -75209 -44230
7322 -44230 -49549 -43122 -93758 -56305 53939 -3511 -100366 -39005 48018 41046 -17974 -114810
7310 -114810 -100627 17784 63366 18776 -71304 -110658 -65099 -47500 14759 56000 29753
7299 29753 -3543 -17091 -32079 -27343 -48207 -91518 -68164 -16308 40012 8475 -86901 -120346
7287 -120346 -116929 -51213 107928 121425 117559 102080 76751 27789 14679 34064 -33518 -75736
7275 -75736 -46838 20146 -59261 -70492 -32433 1172 -24968 27083 62634 83673 49031 76349
7263 76349 1851 33158 141735 169395 68172 18489 -22175 53522 79840 49806 42233 89133
7251 89133 120641 139686 78828 13788 -20461 -991 -5028 -122042 -219433 -218500 -119438 -8084
7239 -8084 -33545 6846 103541 120719 74370 5770 -69703 -39856 -19244 -76003 -150091 -137125
7227 -137125 -108639 -71710 -81758 -90155 -1695 75482 45687 -14865 -28364 2162 -1375 30658
7215 30658 45218 6131 -74148 -78746 51368 113613 100119 172050 188389 28557 -111794
7204 -111794 -195258 -135709 -99129 -102844 -9847 6538 -21272 -10734 9968 -86129 -92840 -44696
7192 -44696 -17300 -25223 -46512 9834 27866 47218 50534 27698 11691 -48321 -78109 -446
7180 -446 11570 -31645 21630 17752 3101 11059 -9481 -45722 8739 61036 123186 51181 54711
7167 54711 100672 127588 115710 16876 -61916 -62698 -10344 -42563 -87020 -109503 -76618 -34617
7155 -34617 -104382 -136456 -112271 -144834 -143143 -110894 -55152 -34788 -52001 -79631 -39936 -79629
7143 -79629 -75893 5600 -21958 -25949 -33308 -67511 -69263 -67898 -43487 18333 77714 83983 -32622
7130 -32622 -102022 -91957 -45866 -21255 -38385 -89199 -90006 -73309 -36605 -6183 -908 -43613
7118 -43613 -98358 -48986 6804 -77849 -103306 -89328 -50412 15114 90974 143923 88549 50754
7106 50754 30407 27099 62995 38329 90121 54800 -15751 -28004 15083 -30030 -15367 4738
7094 4738 76208 88040 145896 126113 92614 8642 -57753 8627 -9067 -80186 -55211 -37882
7082 -37882 -85768 -61965 -53645 -60964 -59330 -35826 32681 60141 18328 78285 67624 38475
7070 38475 73935 93651 62005 -24356 -99596 -96413 -171039 -181779 -150230 -158042 -109184 -82329
7058 -82329 -129975 -173751 -163344 -136322 -68113 43916 34982 -19819 -56870 8746 -40553 -78265
7046 -78265 -93749 -90333 -128395 -141971 -145739 -147250 -49355 -24156 -43517 -51648 -10008 -26281 -8875
7033 -8875 5309 31921 9496 -15372 -25808 -25602 -19788 14688 81393 75710 15564 3819 11960
7020 11960 19338 1257 -59686 -52149 -76519 -46944 -22851 -9881 14927 69569 6306 -81644
7008 -81644 -55796 17123 35111 56627 23190 12155 68657 132252 155113 187738 133061 62577
6996 62577 6581 98957 131645 59690 33187 14257 102 15429 72957 129001 50926 -12110
6984 -12110 3970 55504 25631 -45265 -54032 -50942 2014 43811 23848 9974 -27478 -15667
6972 -15667 61439 67384 -4036 -2836 -17456 48983 63987 -12748 -93408 -137096 -78611 -23928
6960 -23928 -1842 35273 15095 -4897 10852 -60340 -22573 2241 -86163 -133920 -126786 -102003
6948 -102003 -112696 -104887 -107348 -110395 -121540 -105644 -125019 -117107 -45915 -17781 -33402 -45474
6936 -45474 -9805 1161 -37891 30583 26861 -48706 -64419 -74127 -14895 12204 -16033 17779
6924 17779 49870 -24634 25492 89701 -14094 -109746 -76437 -18876 9374 -29944 -28247 -32888
6912 -32888 -67561 -58684 3753 44406 -73199 -146697 -199865 -166884 -85242 -50307 -115872 -169393
6900 -169393 -166380 -163395 -69766 42078 23397 45948 62011 17940 -59892 -69417 -53979 -71310
6888 -71310 -103757 -161769 -228724 -257678 -210507 -109994 -18874 -53 3698 32249 -31186 -115585
6876 -115585 -127427 -105897 -58598 -70548 -71080 -35776 -41327 -41448 -2132 -14998 -33780 -73537 -43998
6863 -43998 42456 116986 122256 131305 139457 62673 67461 60836 58155 -21970 -53249 -8972 16146
6850 16146 34266 60262 74091 77158 10374 -20448 -88603 -158805 -148416 -84975 -35650 -51173
6838 -51173 -67902 -78269 -81598 -12444 -47488 -60560 -3036 9179 27888 -37399 -78179 -63915
6826 -63915 -69652 -113995 -117316 -64588 -55099 -94816 -145201 -121809 -77883 -74576 -29191 -15015 -43911
6813 -43911 -121566 -130818 -79849 -65375 -61384 -47392 -32663 -48763 -2921 -83474 -129453 -61813
6801 -61813 -34210 -130147 -183021 -125530 -94341 -103187 -7485 14015 -19913 -58453 -83252 -7043
6789 -7043 27528 -49765 -38761 -38728 9005 78171 22669 -145081 -169292 -48056 -24535 -37298
6777 -37298 -6778 128725 125852 27797 76468 109953 59844 41552 79942 77358 47901 97553
6765 97553 -21747 -146041 -49597 23708 -54749 -18954 -2936 -31226 -39010 -83304 -101809 -98200
6753 -98200 -104963 -130582 -184819 -180827 -60609 26395 74256 25187 10101 -52698 -50146 -47650
6741 -47650 -90234 13928 96033 75909 42368 38213 75937 64051 92563 106482 156712 50683
6729 50683 -62566 -52283 -39677 11686 154128 146490 106387 118985 129633 136018 168027 167245
6717 167245 96464 54075 58102 87807 54936 34438 -24130 -21370 -44610 -17812 13563 -65695
6705 -65695 -103351 -45787 6722 -4770 -19483 -7568 -39756 -67194 -67423 -39453 -42164 -1535
6693 -1535 24814 -28196 -60008 -52749 -80089 -92555 -102467 -73535 -117441 -101620 -39266 -40212 16650
6680 16650 11477 -56104 -69048 -70790 -47146 -982 6516 64604 59422 67079 30402 67538 61765
6667 61765 48153 52704 1472 -79644 -74574 -10280 -45368 -70102 -44049 -6193 -46408 -10950
6655 -10950 -8832 62250 123782 136417 150994 144419 133477 96473 61774 30251 -25501 -18487
6643 -18487 8353 36279 79353 -1036 22040 -49214 -84477 -133023 -54923 -9774 -98271 -158359
6631 -158359 -146366 -82189 -89254 -92580 3068 40679 -3956 -26364 -71448 -37400 -60329 -63096
6619 -63096 31135 12864 -24959 31533 18349 -16194 -33047 -108979 -106019 -38067 -249 22746
6607 22746 13864 -12890 -83331 -98376 -36435 49171 83524 2111 -30198 -49010 -20074 14958
6595 14958 21440 4365 -13835 -17178 -40100 -57048 -26103 -29264 -100678 -84469 -6199 -13453 -7257
6582 -7257 -3477 -26219 -46056 -37531 6275 41981 56547 -7051 -48656 -30433 14628 16706 16458
6569 16458 40765 14863 47079 54460 -34999 -3274 40007 11629 6137 420 25277 56085
6557 56085 54980 950 -12437 833 13240 -16943 -18974 55066 -3219 -73240 -88549 -94829
6545 -94829 -82924 -92491 -66105 -50301 -8284 71622 122843 25335 -13555 -15758 32936 13308
6533 13308 -65636 -88310 -47927 -42051 5342 13428 -6262 -48122 -158779 -190484 -126062 -105452
6521 -105452 -115143 -107916 -74742 -55765 -67859 -59640 -77581 -69658 -51040 -39849 -100462 -100157 -147550
6508 -147550 -165407 -63744 -47898 -118614 -180528 -152457 -50581 -53380 -29629 3395 12014 -33975
6496 -33975 34904 18299 -6409 -19342 -33435 -109532 -140864 -129004 -105324 -89023 -84500 -116320
6484 -116320 -162803 -148294 -149020 -91587 -19320 31031 67810 3184 -12766 3707 11704 -32184
6472 -32184 -11754 -54173 -25643 -29002 -65795 -74413 18535 61745 46634 28604 -41871 -19808
6460 -19808 -75852 -122420 -125158 -48704 66992 97661 38035 53878 88601 93967 79244 49082
6448 49082 -525 -51268 -72238 -102618 -55092 -2776 -12120 -4952 -20664 -66878 -82251 -47101
6436 -47101 -69445 -117779 -107228 -89506 36194 95489 90966 37335 -56689 -111001 -88688 -138347
6424 -138347 -95585 -52898 -66889 -161208 -176512 -122968 -88069 -102812 -29580 -1129 -46622 -93929
6412 -93929 -63451 -17655 33563 87448 77786 46187 -10370 -31110 -54730 -9325 -22731 -73723
6400 -73723 -87479 -13147 37997 104705 156513 95688 10865 14191 -13573 -9524 56093 68384
6388 68384 59993 65876 69269 35442 13236 60992 101889 154824 142606 65389 17682 29936
6376 29936 27375 21886 -26258 -66713 -34704 -51987 -68785 -55532 -94496 -101392 -90843 -63043
6364 -63043 20880 32692 3417 -49717 -83136 -233494 -309433 -211472 -155933 -59245 3675 -22870
6352 -22870 -13558 50489 11410 -76328 -190104 -160453 -29475 44957 25372 2569 99290 173358
6340 173358 109819 -38497 -763 24844 -61594 -78821 -90217 -95190 -53640 1883 6398 71236
6328 71236 55836 14749 -38047 -32299 -90477 -65921 11873 19546 34143 -3019 -112121 -94250
6316 -94250 -62226 -48556 -56057 -98845 -95757 -49307 -96409 -48051 33593 54029 -7215 -5415
6304 -5415 11488 -32460 44587 95827 72744 23090 24380 28383 -9012 34085 24181 -37235 3680
6291 3680 23233 -48117 -61917 14698 75736 60149 -22457 -92092 -112780 -36153 23087 62227
6279 62227 92138 105298 101594 34494 -21329 22805 3881 29397 -2767 -98497 -108632 -147191
6267 -147191 -149260 -94170 23110 32327 2404 -18944 -48064 -18971 11019 -43067 -88164 -79943
6255 -79943 -64816 -59039 -69770 -66691 -86859 -55873 -19449 23552 23360 -2284 53946 67835 56349
6242 56349 60318 75347 61235 34853 2137 -16467 -38483 -103706 -13432 40959 28587 -46059
6230 -46059 -23334 -22448 -25862 -4519 -30005 -27697 -27035 -72068 -77116 -54043 -91910 -45630 13351
6217 13351 -7790 -1609 -11972 -34774 33483 661 1444 7538 -38819 -15889 -19636 -120139 -79130
6204 -79130 -52945 -48686 4811 4884 -57030 -27813 -17448 20533 -35 -21344 1773 20896 32257
6191 32257 98575 72709 26695 -28110 -49987 -67099 -40593 -94460 -148069 -104245 -31005 -39073
6179 -39073 -79469 -5851 107498 148708 136234 94703 83237 53653 27377 50665 23755 34288
6167 34288 26576 39270 58184 44774 37288 -18358 4289 -22600 35065 83048 -33610 -113827
6155 -113827 1600 33652 25147 42918 37317 7818 -59950 -19057 -26866 -10967 -60187 -81283
6143 -81283 -89287 30196 123346 137014 106638 32187 35600 43834 11595 47525 52934 34898
6131 34898 19382 7999 -24941 -56799 -77376 -63263 -29294 9543 9602 -24912 21183 13747 10698
6118 10698 50041 -34904 -101337 -110285 -50060 -11690 40752 26272 -4350 -10949 14516 32686
6106 32686 -21087 -97660 -51775 4700 13794 13516 20450 -5310 -5424 16305 -32130 -1595 26054
6093 26054 5130 5704 -45822 -55926 -55111 -34673 -16272 -61047 -109165 -152611 -126533 -105217 -96663
6080 -96663 -73292 -6559 29363 -37857 -85697 -159018 -143492 -118112 -70530 -4117 -16677 5341
6068 5341 28627 60246 74353 69713 -11700 1793 58213 99185 40772 -14729 -11478 9493
6056 9493 6376 29379 27108 -74422 -139561 -172347 -124978 -155892 -101326 10568 5603 20294
6044 20294 -28246 -73512 -97428 -216667 -242881 -145656 -71569 -20909 -46026 -128475 -150423 -56501
6032 -56501 -29862 3633 23445 62482 80585 45591 89549 111906 69460 11822 -1758 21913
6020 21913 43865 47668 24081 24572 24444 -6123 37502 57749 -1832 -35060 25257 -1520 -28726
6007 -28726 -35895 -42760 37754 12946 -10672 11998 -37395 -97595 -74096 -18906 21945 -35639
5995 -35639 -106708 -105296 -60573 -37034 -7174 -52453 -61195 -65264 26937 -1230 -12500 993
5983 993 -53566 -81521 -49540 23289 34504 54950 59282 118141 119860 27673 8473 62758 76827
5970 76827 79565 39157 32813 36927 42773 4808 -32833 22592 33638 13004 -2713 -46158 -65163
5957 -65163 264 55708 33921 -6124 12633 43831 -37861 -71131 17034 107546 81354 47418
5945 47418 16056 65053 61488 99644 26858 -37245 -9938 19578 480 -1445 -14771 -53168
5933 -53168 -58101 -58420 -63629 -45590 -92795 -88946 -102493 -97257 -161544 -215069 -169477 -122798 -33542
5920 -33542 7741 -54720 -83943 -21509 -68707 -43922 -31969 -57817 -78969 -41737 10109 51026
5908 51026 16589 -6472 -20357 -25454 -53938 -70152 -16121 49308 24811 -13667 -12751 -55330
5896 -55330 -72942 -46070 -35809 -28163 64089 65496 19079 -73092 -47507 -3533 -1854 -6711 24955
5883 24955 58846 14334 47775 57727 43595 77489 51605 14437 36128 65828 85861 104757
5871 104757 92785 51412 1569 -46138 -11793 -54421 -96450 -47623 2764 23373 2794 -31814
5859 -31814 -4165 59173 36999 40954 -41418 -98968 -20413 -8875 6014 -1707 -21324 -33847
5847 -33847 -110810 -7069 -10034 -100837 -42080 -9009 4476 12907 -2752 -18893 -28553 -18755
5835 -18755 -19626 -78539 -100883 -72103 27690 20512 -31947 -129294 -146503 -166041 -98417 -45657
5823 -45657 12782 82740 145643 117955 -995 -38531 -118373 -69018 -15278 2039 14239 -654
5811 -654 -17640 -54332 -95533 -79566 -64624 -20613 7561 12404 -58517 12377 2067 -49428
5799 -49428 -34445 -6705 47780 -56084 -79970 -19991 -11881 24108 6594 -39462 -76978 -2370
5787 -2370 46990 84525 68485 40240 -31945 5749 -7124 33364 28721 -7086 11927 14013
5775 14013 -13535 -18492 -12444 -47654 -115627 -139447 -66487 -12450 -25353 748 56480 76018
5763 76018 29427 84440 108773 106292 31620 -36379 -35267 -100092 -100493 -56122 69619 149337
5751 149337 87200 3458 60607 94815 38313 82723 86634 67483 34038 -9517 3440 -11476
5739 -11476 -13980 14027 14390 -41269 -55436 -35664 -73880 -48526 -51364 -7618 -19607 -45524 -7368
5726 -7368 19143 10905 -67912 -105924 -63795 -64696 -72440 -49089 -27992 -42911 -9104 64457 147589
5713 147589 133698 108456 14572 -24403 -42306 -75392 -109084 -100884 -101871 -67255 -27019 -22150
5701 -22150 -6981 -5364 3413 -33921 -18600 -14415 -16231 -31389 -2149 44344 58263 34786 40457
5688 40457 128269 140814 -13198 -87857 -80138 313 29677 -17440 1973 34258 79531 83803
5676 83803 -38174 -47197 37884 46050 14366 21709 -82004 -52770 -4336 32199 8965 -25155
5664 -25155 -39827 615 17955 -17115 -20246 -13764 -48798 -78942 -94078 15176 53370 67234
5652 67234 49263 42838 -17344 -23459 16962 -25684 -58736 -89894 -43773 -37165 59520 114452
5640 114452 102769 71155 59196 46514 18675 9926 -45851 -58064 -33766 -68364 -120439 -107988
5628 -107988 -57889 -36043 2162 30818 83094 5356 -46107 -7838 -52423 -88345 -71296 -72558
5616 -72558 -45535 29653 36424 -54410 -107496 -128121 -89342 -5836 100620 30482 2055 19984
5604 19984 -6056 -119249 -143468 -71433 -43490 -50420 33760 95419 27351 -73852 -122387 -18945
5592 -18945 48695 -36798 -74042 -58784 -56897 -47564 -56779 -82308 -71380 -137627 -118638 -38090
5580 -38090 240 44806 75757 137926 153512 58853 -21517 -6408 -32484 -927 20868 -47236
5568 -47236 -105310 -93611 20281 58511 54155 37649 27274 -18896 -71902 -23887 16218 30142
5556 30142 2198 -12292 -29397 -43923 -61176 -58475 -61363 -37680 -55164 -4392 4244 -3742 19529
5543 19529 37437 11963 20888 26112 36807 4936 87730 173503 124127 45691 6621 23889
5531 23889 19131 85028 111139 50135 -27453 -72436 -131497 -133628 21697 125513 134821 67669
5519 67669 -70499 -11975 14283 62976 54458 39345 23074 53754 41330 -20213 -84387 -142529
5507 -142529 -102137 -108562 -175843 -141210 -84369 37310 61120 25533 -22726 -90182 -48178 -61796
5495 -61796 -57301 -85724 -44830 -11673 22468 136547 121742 13655 -1466 -20780 -5576 -1232
5483 -1232 -67174 -119976 -168467 -98870 -9096 78391 -9172 -71515 -33129 3565 -19441 4181
5471 4181 -34652 -9234 -33341 -61124 42810 102820 90062 149754 93649 30772 -43275 6050
5459 6050 14526 -13058 -26488 -51767 -84942 -60620 -83835 -63347 -48699 -25928 20623 -11484
5447 -11484 3542 12331 43533 58665 29783 306 -9035 -29265 9348 55349 48047 50969 -29885
5434 -29885 -82324 -45249 -34072 -107017 -130344 -104125 29593 80288 -27406 -45362 -75649
5423 -75649 -21009 53138 73579 79573 39991 43005 60292 14133 -72630 -91432 -99259 -31502
5411 -31502 -70040 -136429 -114366 -109703 -134184 -102895 -115346 -7092 54373 41546 -11419 -4639
5399 -4639 16472 19113 -31075 -127506 -130140 -147820 -124839 -98475 8742 69636 -69412 -154298
5387 -154298 -127130 -136823 -40942 -23451 -54662 -47368 -9499 -1830 19611 2886 -12097 24894
5375 24894 45135 -21022 -18721 -43698 -16759 2491 -16078 -31343 -69793 -83154 -109145 -134172
5363 -134172 -127108 -106583 -39553 -27276 -83787 -155361 -106082 -66209 -23228 48856 105846 75313
5351 75313 43114 -2687 -84632 -126000 -131284 -156925 -118017 -92398 -54407 -20379 27416 46911
5339 46911 15313 -63858 -46300 -41229 -10102 24724 -1980 -3242 46422 55283 -19108 -1862
5327 -1862 -2809 24988 12875 -62533 -73110 -38834 9758 49080 80783 156205 113193 8652
5315 8652 -73896 -19706 24032 29487 27302 41071 61036 50069 -17604 -35847 -69875 -58904
5303 -58904 -8889 24876 15059 50324 84384 88621 97035 149975 118037 93650 64609 -11794
5291 -11794 -57435 -54885 -4708 101714 66023 -10698 -47573 -34597 17922 71075 114315 60856
5279 60856 50180 15613 -4590 24449 41042 34591 10890 1020 15171 43359 26442 -21665
5267 -21665 11906 82941 32663 -25898 33131 108246 71032 28989 37284 29010 98136 132515
5255 132515 124109 71273 21385 -16388 44347 77471 64592 36008 16655 8513 19836 19011
5243 19011 -31268 -44810 29095 71595 84119 52010 58050 59987 1710 -10824 27593 7529
5231 7529 -19916 -4371 -39172 -5460 19076 18086 -9624 4527 22040 119122 130503 71393
5219 71393 47978 89391 96416 96387 114133 97062 93493 141455 77338 -12359 42464 53305 -18522
5206 -18522 14295 64870 64171 67564 22275 35059 61499 64288 51487 23872 40062 46892 37448
5193 37448 16916 -37933 -16673 -4455 47189 36801 -37341 -67289 -24767 -29371 -67954 -80036
5181 -80036 -55463 -57568 -47307 -23229 8624 -2880 -49043 -23869 3074 -19963 -118346 -163340
5169 -163340 -154597 -82933 -53373 -69145 -36411 -52074 -153270 -209547 -120140 -44256 -25411 -1724
5157 -1724 -70271 -94023 -13520 28363 -2890 -72532 -53604 18567 77340 57539 11526 6530
5145 6530 33742 38724 50150 -7598 -61633 -95026 -115972 -68764 -31744 -32882 25500 46612
5133 46612 -7073 -9533 115011 116016 18786 -16127 -12739 29767 -6222 -69657 -110712 -105347
5121 -105347 -47186 -38609 -76787 -46794 35747 120744 76211 37400 11010 -5814 63709 88953
5109 88953 68352 -11944 29242 62928 154257 157215 23288 -19783 7596 15486 28989 50240
5097 50240 19662 -108079 -177009 -113797 -41473 -17663 -20937 -57325 -72166 -89155 -131495 -214246
5085 -214246 -119149 -42400 -30083 66464 39522 25110 -431 -9575 -40405 -95792 -51917 14047
5073 14047 9454 116119 110235 12884 -59099 -96951 -81076 -14274 -31465 -53702 -45266 -101960
5061 -101960 -94488 -32684 38175 19384 -30176 -67993 79714 113902 13877 -23166 -94497
5050 -94497 -89243 -46006 -64601 -131598 -101913 14749 34536 4433 13008 4956 21787 92268
5038 92268 70892 97512 24854 -8549 40435 19848 -11091 14973 101155 47150 81000 87267
5026 87267 -9594 -76207 -101785 -132679 -83155 -62741 -107407 -137778 -47591 -37189 6434 68851
5014 68851 58118 56096 11856 58588 86344 62241 46927 37740 38649 36119 40074 37618 -23580
5001 -23580 -902 64678 -24017 -29878 72596 86161 115472 142367 94209 46155 73167 77263
4989 77263 67319 78167 76963 82297 74659 80019 101994 100488 56144 58272 29148 38726 -1392
4976 -1392 3189 81880 81695 91157 73959 28621 1971 64625 36889 99732 62850 -33991 -19064
4963 -19064 12280 -49292 -91294 -138501 -121686 -137319 -89598 48386 101234 21841 35779 50179
4951 50179 67819 54393 16602 -28937 -100989 -116742 -107881 -103756 -46600 56603 102273 76486
4939 76486 27200 27555 2063 2640 3630 27301 17282 -95735 -170411 -133993 -72232 -45412 -10460
4926 -10460 35215 56073 40169 -6470 -79593 -46397 -36599 -33238 -15035 -36820 -14582 107614
4914 107614 110858 57940 -28606 -35526 39282 30377 46292 12099 57790 74647 8683 -50445
4902 -50445 -74708 -78813 -114724 -53042 -42788 -76533 -77363 8890 -47574 -79315 -55177 3359
4890 3359 117610 125164 11423 -11250 3683 -12747 -61297 -28805 -36208 -55358 -52162 -14991
4878 -14991 33821 21755 -10226 -75847 -58536 -86356 -128839 -82872 -13196 19366 58159 97589
4866 97589 83042 -16954 -126921 -116776 -20244 -8660 -84885 -88373 -84322 -117335 -190479 -184414
4854 -184414 -112232 4889 45542 44717 -30841 -70801 -85809 -78710 -102883 -132452 -101179 -174524
4842 -174524 -229045 -193077 -84246 -43753 -29862 47092 48673 -10426 58424 102039 106445 -19774
4830 -19774 -29417 75260 11608 -27492 -20235 -4205 -35740 -70054 -45317 -30087 34160 35584
4818 35584 56746 12433 -7230 -1942 -26499 -35119 33195 73057 47858 -10842 -48365 -31981
4806 -31981 -11916 -47163 17473 115930 58714 -59817 -73746 13510 23154 34559 112678 65934
4794 65934 27699 -25277 -75454 -12536 100901 155687 142150 88353 43111 -16681 -29775 -32960
4782 -32960 -5951 42166 4724 -43617 -43783 50229 19800 11187 -2437 7864 -17565 -102742
4770 -102742 -114908 -97767 -81117 -23666 56401 67219 109258 108846 34402 -4695 33040 47679
4758 47679 40856 -14025 -27625 -36672 -85290 -98295 -29917 -36669 -32483 -48638 -36730 -15785 6722
4745 6722 11830 -33349 -43342 -52969 -63776 -49834 -15314 55217 127366 20433 -59164 -290
4733 -290 35832 3688 -54431 -118119 -54152 11673 -55148 -72558 -135816 -220247 -272770 -255481
4721 -255481 -205700 -149513 -89336 -81221 -59355 -82016 -28938 -38058 -56361 -88789 -148869 -116824
4709 -116824 -109046 -71268 -87895 -118475 -138456 -117661 -75314 -65499 -3215 -28482 -81223 -56816
4697 -56816 32003 24404 -30719 -48831 22356 95570 -10464 -79533 -60426 -37659 9662 21783
4685 21783 -25015 20829 39303 57447 -22889 -43968 -9810 6419 57133 56860 92133 70883
4673 70883 33140 -22928 1100 34606 17205 54465 82943 41619 -12202 59299 103989 99680
4661 99680 76424 54993 67163 41867 36768 25059 67105 140279 116927 5189 692 -3354
4649 -3354 21936 56870 93034 -5209 -69937 -75791 -60132 -6162 61974 77696 -23198 -38049
4637 -38049 -16541 3714 50271 68323 13022 -6764 17857 67952 37812 -14298 -115269 -157683
4625 -157683 -89178 -7255 39050 -35378 -73794 -27948 14737 40080 26267 -4261 -35757 -19118
4613 -19118 94875 144077 95724 63002 -4283 -41466 -13207 -69085 -112042 -124194 -69588 -4781
4601 -4781 17268 81421 54860 2107 -11890 -9226 -25443 -125308 -148647 -45768 -46557 -44780 13592
4588 13592 45260 25792 9738 47605 -47560 -112318 -88743 -16399 33099 33044 7306 -5451
4576 -5451 59361 70175 -85036 -139620 -52689 37349 60473 11682 -23692 -88929 -10009 84498
4564 84498 6410 -73691 -18683 -73272 -115278 -93636 26649 42258 65224 -5309 33293 63917
4552 63917 10409 9819 22578 15655 35271 42764 -9709 -38978 -46243 -24223 17586 71227 54691
4539 54691 -12351 -30055 14408 164 -26780 -31794 -16979 12044 5645 -8833 41560 67189
4527 67189 29335 21632 -28878 -75427 -87645 -85445 -118077 -130518 -90483 -57652 -55453 -62231 -78120
4514 -78120 -21497 3118 23156 -61279 -67588 -50402 -30637 30006 52426 39690 13725 -616
4502 -616 -19665 -51760 -161338 -170216 -151985 -86835 -31583 -37117 -29055 -30403 -55358 -31474 56975
4489 56975 -51058 -83580 -136514 -145184 -160931 -84231 -107091 -174790 -197478 -134873 -103552 -46556
4477 -46556 -46987 -36436 -1705 59986 56065 45639 -12414 -43515 -66903 -127388 -121209 -121398 -111953
4464 -111953 -35784 23049 70162 93019 130144 134096 124295 129071 92340 55192 91934 59674
4452 59674 18843 -9090 -35535 -26591 27637 27613 35583 -11205 -20861 -65826 18766 31647 39100
4439 39100 67627 85800 -17376 -130262 -67186 77891 86309 87072 58906 44765 43249 -7491
4427 -7491 -6334 -6951 -27336 -39134 -546 23529 -5991 -22400 -1734 73462 -4619 -54802 -19398
4414 -19398 -3463 -42592 6867 -8232 -4716 -29030 10814 62312 -12802 -97504 -65979 -44854
4402 -44854 9437 22723 -57295 -24601 49944 30511 39739 -11190 -61180 -130878 -91621 -57878
4390 -57878 -29480 14153 -126 19092 51942 31982 27811 55278 73005 64451 105389 83975
4378 83975 107087 99642 102808 68275 11627 -36748 4356 27206 51737 70042 43677 38376
4366 38376 -28750 -862 59038 -27550 -92664 -67568 -24587 -46209 -34276 -21313 41790 46128
4354 46128 7087 27315 43626 -43447 -62803 44471 103956 39235 9843 81731 57770 -8844
4342 -8844 -68342 -47490 15997 66759 38748 -38181 -51794 -62851 -52124 -53445 -121646 -162249
4330 -162249 -68421 25336 18597 50358 76908 71582 82439 48640 482 2032 -48840 -102303
4318 -102303 -18507 100244 126903 167631 153830 113449 146179 208059 245925 219084 141518
4307 141518 111516 79065 139250 145420 119484 23861 -17560 -8303 19483 2483 45802 2056
4295 2056 -11432 10390 53733 35945 -3215 -41375 -27851 13411 35777 30761 67439 72280
4283 72280 6545 -35885 -25622 43026 -2490 -100743 -53420 18493 34011 15561 -60139 -70934
4271 -70934 -10752 -18308 -30337 -21910 10412 -78983 -125001 -102767 -6850 81727 40491 72069
4259 72069 151284 152698 85124 58643 36137 61443 9370 -32340 -48244 -52746 -69700 -44855
4247 -44855 8686 9740 -43627 -50188 -4109 149677 157334 116887 55278 68453 118269 117713 219974
4234 219974 229546 140363 75078 19827 6494 27967 60265 28927 70709 64949 48328 -10325
4222 -10325 -20455 37532 8764 -15388 12266 11226 -7631 -76387 -100655 -105181 -110937 -125385
4210 -125385 -145844 -50672 -5195 7585 24979 48976 49843 84309 119357 83670 -13481 -46035
4198 -46035 -1133 3948 -15164 -34307 -74545 -20459 -57802 4746 43377 -39196 -82756 -110100
4186 -110100 -98260 -85676 -83138 -26493 42941 -10991 -35140 -11144 4231 106964 101392 71475
4174 71475 78095 119192 104243 60523 31677 48376 50432 22340 -15140 -6734 44554 61604
4162 61604 38873 53817 11827 -4459 17530 -36267 -12637 -36131 -53140 -75659 -22829 42769
4150 42769 15524 -50271 -101309 -126198 -95232 -101146 -99333 -89399 -49798 -7754 -14638 -46023 -106492
4137 -106492 -146890 -209187 -226978 -94608 -40615 65767 137876 128350 31057 -55804 -28704
4126 -28704 -14373 -7717 -43184 -46777 -47566 -2490 52914 22029 6508 -94919 -131464 -88032
4114 -88032 -50892 -66501 -59928 4339 -37631 -26474 16315 17517 6369 34435 35648 16111
4102 16111 -42472 -79419 -137763 -156091 -101995 -42306 -60882 -75159 -87191 -83338 -74998 -93857
4090 -93857 -79446 -52495 -31793 -46377 -42366 -40203 -35020 -55040 -18449 -39295 -75270 -109461
4078 -109461 -119111 -140010 -32216 -4660 -21233 -24843 -45949 -101777 -52986 -47617 -97492 -51386
4066 -51386 34741 -3416 69553 86725 49218 15064 -46176 -43123 -75659 -78973 -24472 61536
4054 61536 60015 31525 16602 18416 11080 27650 -32997 -12990 60478 95226 76266 53852
4042 53852 44595 -17117 -47074 -12244 98847 116369 75122 74918 10208 -76773 -56439 23583
4030 23583 67530 40045 80211 140953 173395 107854 77429 59705 42033 115188 113685 53824
4018 53824 19425 -112209 -133725 -62469 -36310 -30366 7029 -36283 -38149 -46751 -78731 -22402
4006 -22402 -26739 -30834 36921 45682 80307 123308 114283 83919 14914 -30112 -33132 -55164 -84387
3993 -84387 -26085 10451 -36955 -111698 -65166 11559 50281 48467 96974 29407 -38133 -93260
3981 -93260 -133900 -143806 -90093 46255 64535 66640 98660 43156 18233 -47201 -37865 36396
3969 36396 64381 64941 102943 47028 55613 80032 48700 3583 -31793 -8052 -38561 -37254 -30696
3956 -30696 8812 19660 -26295 -14171 51593 79888 38294 56427 36461 5492 -6470 -13664
3944 -13664 -7608 -68518 -77072 -68455 -61895 -51724 -2461 69230 59694 58038 60906 48602 45746
3931 45746 80674 50645 8244 29797 97403 38119 -12130 20121 -21263 -80303 -61338 -20817
3919 -20817 -15456 -42563 -4822 39222 70589 52162 10025 -55771 -114477 -85150 -5846 19387
3907 19387 33129 6737 -53157 -21092 -26895 -31002 -38754 -17041 -18496 -79153 -139067 -133429 -110259
3894 -110259 -116421 -74971 -58094 -21579 -43288 -30890 -13877 -4874 1156 37644 -10719 -24846
3882 -24846 -19649 -21092 -1488 23308 -3673 20668 3529 -71032 -29853 -16196 2919 44956
3870 44956 83095 36005 87395 134249 133618 67873 -14168 -21518 -22763 6359 -9510 -45704 -45718
3857 -45718 -66691 -67367 -83168 -331 27630 -40866 -39953 -136 -25353 -58329 -65844 -47453 -29616
3844 -29616 -11638 7100 54249 22182 65881 63302 47847 15857 -51921 -16380 19240 34246
3832 34246 95121 129069 106243 105046 101900 148044 113806 106614 111469 74267 9477 -48247 -93409
3819 -93409 -96867 -69391 46234 48305 56265 65203 67843 12222 -13594 -4251 -2635 -8651 -32522
3806 -32522 -47111 -45683 -31259 -39284 3271 13361 -34588 -71374 -51806 -24982 -59439 -78436
3794 -78436 -90120 -161026 -166399 -168438 -136384 -71804 -63082 -47272 36259 75666 70803 83497 50312
3781 50312 57427 63310 81541 7929 -108626 -49881 8755 -3773 -24696 -32128 -47561 14648
3769 14648 16933 -6773 -32974 -96029 -69230 -25167 17798 724 -42677 -78126 -52388 -26431
3757 -26431 54285 26359 -3630 40388 25493 21341 33142 30516 -51024 -93647 -90078 -99563 -157766
3744 -157766 -141146 -84235 -3970 71045 68608 12039 333 20850 87295 70261 6696 18105
3732 18105 36961 193 29770 106645 41450 -28129 -110553 -156176 -137986 -57480 -40935 41143
3720 41143 48355 1556 -7821 4785 12588 -69096 -56588 -43394 -39810 -47543 -58456 -58716 -96612
3707 -96612 -62921 -42134 22858 54505 39959 -30889 -38304 -61547 -110658 -130675 -61188 -49838
3695 -49838 -39272 -35022 92724 118208 48307 47354 72712 -3457 4452 12323 -30025 -22187 -11609
3682 -11609 25678 63724 90407 30263 30598 73859 70297 7693 19624 40346 40619 -28842 20653
3669 20653 85335 26451 -3952 -29654 25976 46530 943 -27306 -44731 -87065 -60384 -46172
3657 -46172 35400 96155 55264 312 31049 22672 -21548 -62407 -85797 -93818 -109288 -37988
3645 -37988 80302 35607 -6810 -49567 -48110 -50113 -77280 -75799 -35592 -2196 14197 48908
3633 48908 55361 44023 21468 48036 49091 46307 65439 51604 -18895 -57611 -31084 -34951 17712
3620 17712 51371 89495 17145 60958 89180 118580 114011 199723 193438 121144 53615 76339
3608 76339 99419 26502 -20611 -129772 -180029 -156637 -79523 -77329 -72820 -101242 -85664 -9652
3596 -9652 37552 41549 27629 -46171 -63099 -78585 -22998 24889 -27196 -30180 -40081 -42472 -42495
3583 -42495 -18901 1059 14244 28171 11642 -50718 -52876 -4375 -2336 22423 68023 41195
3571 41195 38127 82832 64729 38698 5600 -16764 -24618 10838 35121 52312 48168 47660 125413
3558 125413 99158 27569 -49544 -60458 -10628 22249 54351 32436 -64520 15937 93267 111103
3546 111103 127475 143071 116801 39441 -41829 -63018 -15957 -21182 15487 -37119 12065 44622
3534 44622 -15229 -54141 -104164 -131604 -69813 42339 27667 -11211 -38225 -84072 -75992 -108425
3522 -108425 -72487 -79923 -67830 -18753 -1740 18209 13988 49706 56175 76341 124226 118117
3510 118117 61768 7739 -21663 30749 -7548 -68111 -49168 3436 34124 24991 -9786 -67577
3498 -67577 -87840 -41319 -61976 -88976 -63648 50601 75823 67783 109097 93608 69692 92350
$$ [...]
##END NTUPLES=NMR SPECTRUM
##END=
