##TITLE=Analysis number 310743
Compound Code cc 00546
Book Reference 397/48/2
Project Code adrs
Chemist Name brucer
##JCAMPDX= 6.0         $$ Bruker NMR JCAMP-DX V2.0
##DATA TYPE= NMR SPECTRUM
##DATA CLASS= NTUPLES
##ORIGIN= Bruker BioSpin GmbH
##OWNER= NMR
$$ XWIN-NMR		Version 3.5
$$ Wed Jun 22 14:06:53 2005 GMT Daylight Time (UT+1h)  MAYBRIDGE\NMR@NMR_250MHZ
##.OBSERVE FREQUENCY= 250.131544655141
##.OBSERVE NUCLEUS= ^1H
##.ACQUISITION MODE= SIMULTANEOUS (DQD)
##.ACQUISITION SCHEME= undefined
##.AVERAGES= 16
##.DIGITISER RES= 18
##SPECTROMETER/DATA SYSTEM= dpx250
##.PULSE SEQUENCE= zg30
##.SOLVENT NAME= CDCl3
##.SHIFT REFERENCE= (INTERNAL, CDCl3, 0, 16.4452)
##AUDIT TRAIL= $$ (NUMBER, WHEN, WHO, WHERE, WHAT)
$$ ##TITLE= Audit trail, XWIN-NMR		Version 3.5
$$ ##JCAMPDX= 5.01
$$ ##ORIGIN= Bruker BioSpin GmbH
$$ ##OWNER= NMR
$$ C:\u/data/dgb/nmr/ADRS/4520/pdata/1/auditp.txt
$$ ##AUDIT TRAIL=  $$ (NUMBER, WHEN, WHO, WHERE, WHAT)
(   1,<2005-06-22 14:06:35.49 +100>,<MAYBRIDGE\NMR>,<NMR_250MHZ>,
      <created by zg, POWCHK disabled, PULCHK disabled
       configuration hash MD5:
       62 19 C7 07 E1 42 D1 B7 37 6C 3D D0 77 39 F9 E6
       data hash MD5: 64K
       88 C5 7F AB E2 86 37 D6 40 91 D9 31 92 76 37 D1>)
(   2,<2005-06-22 14:06:46.29 +100>,<MAYBRIDGE\NMR>,<NMR_250MHZ>,
      <Start of raw data processing
       ef LB = 0.3 FT_mod = 6 PKNL = 1 SI = 32K 
       data hash MD5: 32K
       B4 C2 6D D2 52 73 9F 6C A9 2A FC 27 7E A7 D6 C0>)
(   3,<2005-06-22 14:06:48.02 +100>,<MAYBRIDGE\NMR>,<NMR_250MHZ>,
      <apk 
       data hash MD5: 32K
       2E B4 97 17 07 17 8C BE 19 5D DB 36 E3 0C 16 2D>)
(   4,<2005-06-22 14:06:48.72 +100>,<MAYBRIDGE\NMR>,<NMR_250MHZ>,
      <abs ABSG = 5 
       data hash MD5: 32K
       29 F9 28 2A 77 D7 7D D8 D0 ED 26 B9 15 07 69 A1>)
$$ ##END=
$$ 
$$ hash MD5
$$ CB 12 C7 FA D2 67 BF 4D F5 B3 DE 82 8B 2C D1 74
##$RELAX= 
##$RELAX= 
##$RELAX= 
##$RELAX= 
##$RELAX= 
##$RELAX= 
##$RELAX= 
$$ Bruker specific parameters
$$ --------------------------
##$DU= <C:\u>
##$EXPNO= 4520
##$NAME= <ADRS>
##$PROCNO= 1
##$TYPE= <nmr>
##$USER= <dgb>
##$AMP= (0..31)
100 100 100 100 100 100 100 100 100 100 100 100 100 100 100 100 100 100 
100 100 100 100 100 100 100 100 100 100 100 100 100 100 
##$AQSEQ= 0
##$AQ_mod= 3
##$AUNM= <au_zg>
##$AUTOPOS= <31 >
##$BF1= 250.13
##$BF2= 250.13
##$BF3= 250.13
##$BF4= 250.13
##$BF5= 500.13
##$BF6= 500.13
##$BF7= 500.13
##$BF8= 500.13
##$BYTORDA= 1
##$CFDGTYP= 0
##$CFRGTYP= 5
##$CHEMSTR= <none>
##$CNST= (0..31)
1 1 145 1 1 1 1 1 1 1 1 1 1 1 1 1 1 1 1 1 1 1 1 1 1 1 1 1 1 1 1 1 
##$CPDPRG= <>
##$CPDPRG1= <>
##$CPDPRG2= <>
##$CPDPRG3= <>
##$CPDPRG4= <mlev>
##$CPDPRG5= <mlev>
##$CPDPRG6= <mlev>
##$CPDPRG7= <mlev>
##$CPDPRG8= <mlev>
##$CPDPRGB= <>
##$CPDPRGT= <>
##$D= (0..31)
0 1 0 0 0 0 0 0 0 0.06 0 0 0 0 0 0 0.0002 0 0 0 0 0 0 0 0 0 0 0 0 0 0 
0 
##$DATE= 1119445594
##$DBL= (0..7)
120 120 120 120 120 120 120 120 
##$DBP= (0..7)
150 150 150 150 150 150 150 150 
##$DBP07= 0
##$DBPNAM0= <>
##$DBPNAM1= <>
$$ [...]
##$SUBNAM7= <"">
##$SUBNAM8= <"">
##$SUBNAM9= <"">
##$SW= 20.6930455092707
##$SWIBOX= (0..15)
0 0 3 0 0 0 0 0 0 0 0 0 0 0 0 0 
##$SW_h= 5175.983436853
##$TD= 65536
##$TD0= 1
##$TE= 295.16
##$TE2= 300
##$TE3= 300
##$TEG= 300
##$TL= (0..7)
0 120 120 120 120 120 120 120 
##$TP= (0..7)
150 150 150 150 150 150 150 150 
##$TP07= 0
##$TPNAME0= <>
##$TPNAME1= <>
##$TPNAME2= <>
##$TPNAME3= <>
##$TPNAME4= <>
##$TPNAME5= <>
##$TPNAME6= <>
##$TPNAME7= <>
##$TPOAL= (0..7)
0.5 0.5 0.5 0.5 0.5 0.5 0.5 0.5 
##$TPOFFS= (0..7)
0 0 0 0 0 0 0 0 
##$TUNHIN= 0
##$TUNHOUT= 0
##$TUNXOUT= 0
##$USERA1= <user>
##$USERA2= <user>
##$USERA3= <user>
##$USERA4= <user>
##$USERA5= <user>
##$V9= 5
##$VALIST= <valist>
##$VCLIST= <CCCCCCCCCCCCCCC>
##$VD= 0
##$VDLIST= <DDDDDDDDDDDDDDD>
##$VPLIST= <PPPPPPPPPPPPPPP>
##$VTLIST= <TTTTTTTTTTTTTTT>
##$WBST= 1024
##$WBSW= 4
##$XGAIN= (0..3)
0 0 0 0 
##$XL= 0
##$YL= 0
##$YMAX_a= 316903
##$YMIN_a= -393827
##$ZGOPTNS= <>
##$ZL1= 120
##$ZL2= 120
##$ZL3= 120
##$ZL4= 120
##$ABSF1= 16.44525
##$ABSF2= -4.247923
##$ABSG= 5
##$ABSL= 3
##$ALPHA= 0
##$AQORDER= 0
##$ASSFAC= 0
##$ASSFACI= 0
##$ASSFACX= 0
##$ASSWID= 0
##$AUNMP= <proc_1d>
##$AZFE= 0.1
##$AZFW= 0.1
##$BCFW= 0
##$BC_mod= 0
##$BYTORDP= 0
##$COROFFS= 0
##$CY= 12.5
##$DATMOD= 1
##$DC= 0
##$DFILT= <>
##$DTYPP= 0
##$F1P= 14.0000005364418
##$F2P= -0.99999901652339
##$FCOR= 0.5
##$FTSIZE= 32768
##$FT_mod= 6
##$GAMMA= 0
##$GB= 0
##$INTBC= 1
##$INTSCL= 1
##$ISEN= 128
##$LB= 0.3
##$LEV0= 0
##$LPBIN= 0
##$MAXI= 10000
##$MC2= 0
##$MEAN= 0
##$ME_mod= 0
##$MI= 0
##$NCOEF= 0
##$NC_proc= -4
##$NLEV= 6
##$NOISF1= 0
##$NOISF2= 0
##$NSP= 0
##$NTH_PI= 0
##$NZP= 0
##$OFFSET= 16.44525
##$PC= 1
##$PHC0= 129.3164
##$PHC1= 4.296998
##$PH_mod= 1
##$PKNL= yes
##$PPARMOD= 0
##$PSCAL= 4
##$PSIGN= 0
##$REVERSE= no
##$SF= 250.130019195698
##$SI= 32768
##$SIGF1= 0
##$SIGF2= 0
##$SINO= 400
##$SIOLD= 32768
##$SREGLST= <1H.CDCl3>
##$SSB= 0
##$STSI= 32768
##$STSR= 0
##$SW_p= 5175.98343685301
##$SYMM= 0
##$S_DEV= 0
##$TDeff= 65536
##$TDoff= 0
##$TI= <Analysis number 999999
Compound Code 99
Book Reference 9
Project Code 9>
##$TILT= no
##$TM1= 0
##$TM2= 0
##$TOPLEV= 0
##$USERP1= <user>
##$USERP2= <user>
##$USERP3= <user>
##$USERP4= <user>
##$USERP5= <user>
##$WDW= 1
##$XDIM= 32768
##$YMAX_p= 349295215
##$YMIN_p= -60848
$$ End of Bruker specific parameters
$$ ---------------------------------
##NTUPLES= NMR SPECTRUM
##VAR_NAME=  FREQUENCY,     SPECTRUM/REAL,   SPECTRUM/IMAG
##SYMBOL=    X,             R,               I
##VAR_TYPE=  INDEPENDENT,   DEPENDENT,       DEPENDENT
##VAR_FORM=  AFFN,          ASDF,            ASDF
##VAR_DIM=   32768,         32768,           32768
##UNITS=     HZ,            ARBITRARY UNITS, ARBITRARY UNITS
##FACTOR=    0.157963299565203, 1,           1
##FIRST=     4113.4505874943, 0,             0
##LAST=      -1062.53284935871, 0,           0
##MIN=       -1062.53284935871, -60848,      0
##MAX=       4113.4505874943, 349295215,     0
$$ Real data points
##PAGE= N=1
##DATA TABLE= (X++(R..R)), XYDATA
$$ [...]
16542e231q278J123j0060r017M849J4317N504k598M322k7J804j057L116N715n642
16527a160n491j2906p315j740j1293k289J6223P748j485j4312N755J6922N287
16514f056l517l42P24M46J351r752m009J7438r108m60p246m98R462J3189N886
16499G508J262p234j4392l1l496P472P346J092o164M440l715q814k447q248j1
16484b5432O355J948k16R081J5287l767J0892N50m045j1330j1570J1839N489O21
16470E702j1269J585q712j2018P212K250j967j410j369R300l005o402O090Q064
16456e949L677l140J0775O709p255q496p010k930Q528o792k357k0476q467J1191
16442c1992N257N917J975J69k435l712L339Q614j0369o13L249J1467k524j4655
$$ plain form
16542 -5231 -13509 -12386 -22446 -31463 -26614 -12297 -6793 -9391 -5069 -5096 -3292 -4349 -1233 4482 -1160
16527 -1160 -6651 -19557 -26872 -28612 -39905 -42194 -25971 -18223 -19708 -34020 -28265 -11343 -6056
16514 -6056 -9573 -9915 -9191 -8745 -7394 -17146 -21155 -3717 -12825 -13285 -20531 -21029 -11567 1622 7508
16499 7508 8770 1536 -12856 -12887 -16383 -8911 -1565 -473 -6637 -2197 -5912 -14726 -17173 -25421 -25432
16484 -25432 -19077 -17129 -17345 -8264 7023 3256 14148 14698 10653 -677 -12247 -408 5081 5702
16470 5702 -5567 -3982 -12694 -24712 -17500 -15250 -17217 -18627 -19996 -10696 -13701 -20103 -14013 -5949
16456 -5949 -2272 -5412 5363 12072 4817 -3679 -10689 -13619 -5091 -11883 -14240 -34716 -43183 -31992
16442 -31992 -26735 -20818 -18843 -18674 -21109 -24821 -21482 -12868 -23237 -23850 -20601 -9134 -11658 -26313
16428b6313m988O523q800M474L594l121J4395M067M727L614j844m238O705J2157
16414A0952P592N65k2139m206j910k604j5732K066J127N214J2030Q82j4515K179
16400a8499K676Q947J0611l341j6509m763P039M181j4865p993J4386J7625Q370
16387G865r639j296R803q994j5056M191j8202R761n072P155M61N295q757o501
16373b8986J0960n099r778J922P064O339k455j3438k68J0463J8573J732n647j2353
16359b0971q337j99O624M934J7M358N05M188J143J148Q693J4396j1040r765j1462
16344a5768n606P463N73M684q393q348J1301J2600k650j2172o051j463L563o564
16330b6831m557j489J0429M166O782L733J248l932j397K54K595j3027J651J0817
$$ plain form
16428 -26313 -31301 -24778 -33578 -29104 -25510 -28631 -14236 -10169 -5442 -1828 -3672 -7910 -1205 10952
16414 10952 18544 19109 -3030 -7236 -9146 -11750 -27482 -25416 -24289 -19075 -7045 -6163 -20678 -18499
16400 -18499 -15823 -6876 3735 394 -16115 -20878 -13839 -9658 -24523 -32516 -18130 -505 7865
16387 7865 -1774 -3070 6733 -2261 -17317 -13126 -31328 -21567 -26639 -19484 -19023 -13728 -22485 -28986
16373 -28986 -18026 -23125 -32903 -30981 -23917 -17578 -20033 -33471 -33739 -23276 -4703 -2971 -8618 -20971
16359 -20971 -29308 -29507 -22883 -17949 -17932 -13574 -13069 -8881 -7738 -6590 2103 16499 5459 -4306 -15768
16344 -15768 -21374 -13911 -13338 -8654 -17047 -25395 -14094 -1494 -4144 -16316 -22367 -23830 -20267 -26831
16330 -26831 -31388 -32877 -22448 -18282 -11500 -7767 -6519 -10451 -11848 -11594 -8999 -22026 -20375 -9558
16316i558k221n577q987L66Q575L132M28k572K358K692j2835m308J2958J1326
16302d223j3806k489R98R09o20J656o152q215O889O425l593K259l602Q438J664
16287a3462Q498K196m869o349m858r80k074j128P199j625k5907O03J8138K443
16273b2175L045J1281J0806j2635o063k086P637J0967k754j7866j5000J271Q320
16260b5252J1793K861M811L861R492N964n974j8682j5516M256J3544j3116l789
16247b5747K241J1335N068k218j5353o011J1399m779m058j496O232O285l569P606
16233a3065O000R214j0537l653O613Q695j3380o057o288l342Q59Q590j478M462
16219a3367O46q78N82o780m693N608P147Q275m974J592j174j1128n724J3164J4580
$$ plain form
16316 -9558 -11779 -17356 -26343 -25977 -17402 -14270 -13842 -16414 -14056 -11364 -24199 -28507 -15549 -4223
16302 -4223 -18029 -20518 -19520 -18611 -19231 -17575 -23727 -31942 -25053 -18628 -22221 -19962 -23564 -15126 -13462
16287 -13462 -4964 -2768 -7637 -13986 -18844 -19824 -21898 -23026 -15827 -17452 -43359 -42756 -24618 -22175
16273 -22175 -19130 -7849 2957 -9678 -15741 -17827 -10190 777 -1977 -19843 -34843 -33572 -25252
16260 -25252 -13459 -10598 -5787 -1926 7566 13530 7556 -11126 -26642 -22386 -8842 -21958 -25747
16247 -25747 -23506 -12171 -7103 -9321 -24674 -30685 -19286 -24065 -28123 -29619 -23387 -17102 -20671 -13065
16233 -13065 -7065 2149 -8388 -12041 -5428 3267 -10113 -16170 -22458 -25800 -24941 -16351 -17829 -13367
16219 -13367 -12721 -13599 -13017 -19797 -24490 -18882 -11735 -3460 -8434 -6842 -8016 -19144 -24868 -11704 2876
16204B876J576n057k0051o070J2421J7976J4062K672j4029p745q574o402q650
16191b4995r130J3748J0462J0251m346l159k885K341l898m795O557j039j5593
16178b6481k367P44J4395J8252l176j2717j6421K750R858j238j415J534k171j1992
16164c0445j027l296L959J198O473Q336o003n783j93P565J0939J277p927r74R354
16149f547q242l0701k529Q463L884K92P440J3258P890J900L390l591j06k421N567
16134b053Q758N273q251q285m078n824m25j1366o269J0076P414J0025n107j3727
16120b3839j773n386L880j210o33R763R304R310o088j1908J2o132r121K55J4266
16105a9300J6150J5769l497j6749j5060j0355l90P710J867j5817N343L330N961
$$ plain form
16204 2876 4452 -605 -20656 -26726 -14305 3671 17733 20405 6376 -1369 -9943 -16345 -24995
16191 -24995 -34125 -20377 -9915 336 -4010 -7169 -10054 -7713 -11611 -16406 -9849 -10888 -26481
16178 -26481 -28848 -28104 -13709 4543 1367 -11350 -27771 -25021 -15163 -16401 -17816 -16282 -18453 -30445
16164 -30445 -31472 -34768 -30809 -29611 -23138 -14802 -20805 -26588 -26781 -19216 -8277 -7000 -14927 -15901 -6547
16149 -6547 -14789 -45490 -48019 -39556 -35672 -35380 -27940 -14682 -6792 -4892 -1502 -5093 -5199 -7620 -2053
16134 -2053 6705 11978 3727 -4558 -8636 -14460 -14885 -26251 -32520 -22444 -15030 -5005 -10112 -23839
16120 -23839 -25612 -30998 -27118 -28328 -28961 -19198 -9894 -584 -6672 -18580 -18568 -24700 -33821 -33566 -19300
16105 -19300 -3150 12619 9122 -7627 -22687 -33042 -33432 -25722 -23855 -39672 -34329 -30999 -25038
16092b5038P669l12K842m456L872L608K811L819n224o795M375m690j2527O629
16078b3417J6403J1294q855j8157L55R323M312j751J6407J3496k941m034r969
16065B466k906q865M322j5053k5188J5145J7535p359l800K432J0904R633J2023
16052A1289o187o903r835n751P83J4985J1377r336o734L526m053n615M471k404
16038a0387l498j2151j1656l648M415N888l543l12l807J6079k208m747P219j0513
16024c2869J2778K6574p33k477j5523l134L190m837r926O67K332j715J0394Q801
16010f478L524k294n998j2120p775p244J2243R754q297j0026L742J1237K970m288
15996b1050O504Q934j209R770M157l717l992n155j1411j0243J0677K2231R733
$$ plain form
16092 -25038 -17369 -17681 -14839 -19295 -15423 -11815 -9004 -5185 -10409 -17204 -12829 -17519 -30046 -23417
16078 -23417 -7014 4280 -4575 -22732 -22377 -13054 -8742 -10493 5914 19410 16469 12435 2466
16065 2466 -440 -9305 -4983 -20036 -45224 -30079 -12544 -19903 -23703 -21271 -10367 -734 11289
16052 11289 5102 -1801 -11636 -17387 -16604 -1619 9758 422 -6312 -2786 -6839 -12454 -7983 -10387
16038 -10387 -13885 -26036 -37692 -41340 -36925 -31037 -34580 -34892 -38699 -22620 -24828 -29575 -22356 -32869
16024 -32869 -20091 6483 5750 3273 -12250 -15384 -12194 -17031 -26957 -26290 -23958 -25673 -15279 -6478
16010 -6478 -2954 -5248 -11246 -23366 -31141 -38385 -26142 -16388 -24685 -34711 -30969 -19732 -16762 -21050
15996 -21050 -14546 -5612 -6821 2949 7106 3389 -603 -5758 -17169 -27412 -16735 5496 15229
15983A5229m018K082J423p523r062n144n665P900k438j2240l611J171m04L032
15969a9268o436r286N332L353K351l352m330N495K391n358J0168K782R16J4834
15955d08Q606M153n376m872j4797r495O78q151Q522J4175P240j702m814k518j346
15940a0105j305q19m399l834k492J8977R688j2891q012J665N06n18K175L579L882
15925c903K949R807R352p138j0621k872l968O49m61j3910k994K912P481P798O467
15910A548j755P4j4650p892J2751j996q51L252m864M541n27r283n693L505J0176
15895a1664N292N696L676N91l473J205J023m123J71J4739O793O380p235j6406
15881B665M638q849m726Q463j0059j4245j770M705N223o29J98j944m285J0063
$$ plain form
15983 15229 11211 13293 14716 7193 -1869 -7013 -12678 -4778 -7216 -19456 -23067 -21896 -22300 -19268
15969 -19268 -25704 -34990 -29658 -26305 -23954 -27306 -31636 -26141 -23750 -29108 -18940 -16158 -15242 -408
15955 -408 8198 12351 6975 2103 -12694 -22189 -21511 -29662 -21140 -6965 275 -1427 -6241 -8759 -10105
15940 -10105 -11410 -12229 -16628 -20462 -22954 -3977 5711 -7180 -15192 -13527 -13021 -13539 -11364 -7785 -3903
15925 -3903 -954 8853 18205 11067 446 -2426 -6394 -5745 -6206 -20116 -23110 -20198 -12717 -4919 1548
15910 1548 -207 -133 -14783 -22675 -9924 -11920 -12771 -9519 -14383 -9842 -10369 -19652 -25345 -21840 -11664
15895 -11664 -6372 -676 3000 3591 118 1323 2346 -1777 -1606 13133 19926 26306 19071 2665
15881 2665 7303 -1546 -6272 2191 -7868 -22113 -23883 -19178 -13955 -14584 -14386 -16330 -20615 -10552
15867a0552J4899j0242P835Q790j0221q156l740n28J1329J52j0068q093q273l124
15853b9992N118J5401L935J432q098j2888P438J7394j2870j3971J0321K287m951
15840a9444n857P921J506q925j225J1045J815l478n563J4448M408O669L504k365
15826D459p867q597l158M015O709N222L120r843Q503J5130l353p768j8679l01
15812a2408n044o813K868K201L340o684L460J5142J132o723l160k39L668o908
15798a6168r365P38l325M194Q280j395R592Q560n70j9609m925N851P399K634n080
15783a3189q082j081K515J5909N718k345r830l110j027L887J6517j890j6350j4718
15769b7076K575J5021J4731r927J356L218j5255j2434R01k049L945K527N123r795
$$ plain form
15867 -10552 4347 -5895 1940 10730 509 -7647 -11387 -11915 -586 -434 -10502 -18595 -26868 -29992
15853 -29992 -24874 -9473 -5538 -4106 -12204 -25092 -17654 -260 -13130 -27101 -16780 -14493 -19444
15840 -19444 -25301 -17380 -15874 -24799 -26024 -14979 -13164 -16642 -22205 -7757 -3349 3320 6824 4459
15826 4459 -3408 -12005 -15163 -11148 -4439 783 3903 -5940 2563 17693 14340 6572 -12107 -12408
15812 -12408 -17452 -24265 -21397 -19196 -15856 -22540 -19080 -3938 -2806 -9529 -12689 -12928 -9260 -16168
15798 -16168 -25533 -24795 -28120 -23926 -15646 -17041 -7449 1111 541 -19068 -23993 -18142 -10743 -8109 -13189
15783 -13189 -21271 -22352 -19837 -3928 1790 -555 -10385 -13495 -14522 -10635 5882 3992 -12358 -27076
15769 -27076 -24501 -9480 5251 -4676 -3320 -102 -15357 -27791 -26890 -28939 -24994 -22467 -17344 -27139
15755b7139k731q188p79P564R342K587l578Q757R74m596q028O370o58M139n751
15740b1715N238J013N119M739L245l159L118k636j0554j1891n380N814L683Q716
15726a4650p643k551j523n931n760J7405N079l746L111l388J0760j216j0410K527
15712a7936J9493R035q618m817p35L265j0248m513o223p283K213K363k010n1J9195
15697f870J5359r076r690p341N451J0451p063j1197P230J6455J5173j5323m374
15684h15Q017r063p932O885j1339J2060J1055O106j1144r02N674R785J311l616
15670A6082P178k2980j6058q045p062J4780J596k958M018M819m365Q492Q728m905
15656f80q578L32n282l73o253R81N263P227p359r08J4089m19l084q043q131J0610
$$ plain form
15755 -27139 -29870 -38058 -38837 -31273 -21931 -19344 -22922 -14165 -13191 -17787 -25815 -19445 -20103 -15964 -21715
15740 -21715 -16477 -15464 -10345 -5606 -2361 -5520 -2402 -5038 -15592 -27483 -32863 -27049 -23366 -14650
15726 -14650 -22293 -24844 -26367 -32298 -38058 -20653 -15574 -19320 -16209 -19597 -8837 -10053 -20463 -17936
15712 -17936 1557 10592 1974 -2843 -3578 -313 -10561 -15074 -21297 -28580 -26367 -24004 -26014 -26065 -6870
15697 -6870 8489 -587 -10277 -17618 -12167 -1716 -8779 -19976 -12746 3709 18882 3559 -815
15684 -815 7202 -1861 -9793 -2908 -14247 -2187 8868 14974 3830 2928 8602 18387 19698 16082
15670 16082 23260 280 -15778 -23823 -30885 -16105 -14509 -17467 -13449 -8630 -12995 -4503 4225 -680
15656 -680 -9258 -8926 -14208 -14581 -20834 -19853 -14590 -7363 -14722 -15630 -1541 -1960 -5044 -13087 -21218 -10608
15640a0608j058M287R575J195k086j4751j6321J108R634L804M923J031n89L737
15626f119R689K929l222j5435L231j0017r185J120J749k922J890k399r00J7655
15612a1936m001j7395J1517J3960j4951p048m817K281J2871j694j690N257J0665
15599f981Q657o188p646J5903J1765j828O795k257j9330j5497K601m465J462j5635
15585c2644j3555J2521J0802n431L59J0759J4052o463K105j867K163M062j2974
15572a6111r607L842R591M8O414k155j567J039Q605j2360n154k276Q86O972M749
15557g084j329l76K444J730r797r849J2989J3658j5772k2696n840J3455J3697
15544a4770j885K229k585p83K444Q108L447k553R59k043m175J5161Q256p143j4618
$$ plain form
15640 -10608 -11666 -7379 2196 3391 1305 -13446 -29767 -28659 -19025 -15221 -10298 -9267 -9856 -6119
15626 -6119 3570 6499 3277 -12158 -8927 -18944 -28129 -27009 -25260 -28182 -26292 -28691 -29591 -11936
15612 -11936 -15937 -33332 -21815 -7855 -22806 -29854 -34671 -32390 -19519 -21213 -22903 -17646 -6981
15599 -6981 1676 -4512 -12158 3745 15510 13682 20477 18220 -1110 -16607 -14006 -18471 -17009 -32644
15585 -32644 -46199 -33678 -22876 -28307 -27948 -17189 -3137 -9600 -7495 -9362 -7199 -3137 -16111
15572 -16111 -25718 -21876 -12285 -12237 -5823 -7978 -9545 -8506 99 -12261 -17415 -19691 -18805 -11833 -7084
15557 -7084 -8413 -8789 -6345 -4615 -14412 -24261 -11272 2386 -13386 -36082 -41922 -28467 -14770
15544 -14770 -16655 -14426 -17011 -17794 -15350 -7242 -3795 -6348 -5389 -7432 -11607 3554 11810 4667 -9951
15529i951N844p327j1589P31L470j533Q075Q659j0902L248l51K070K029k933K209
15514h251J4196P673L919o721K883J3418q795r232k781m638o83r882o331N4l330
15499a8501n077l218o44Q771J8374J4353n068o146L756l330p922j4122r190M32
15485b7532m05P355N071L136k88l679j0285m425P771N270K958O209p748K617N726
15470h249k650r032p959L392J458J0288J0928Q035q939r473j450o91J3283k91
15456a350j1715j4590n519R082J2585N116n016m038r13J8496M11j4341o968N178
15442a3582O393m639N811j2640j2158J765O127L779O437M939k594j725l890j976
15428a7953L732K682J862R227j005P724J791p912o013k812k5j1661k503R106L806
$$ plain form
15529 -9951 -4107 -11434 -23023 -22292 -18822 -20355 -12280 -3621 -14523 -11275 -11626 -9556 -7527 -10460 -8251
15514 -8251 5945 13618 17537 10816 13699 27117 18322 9090 6309 1671 988 -8894 -15225 -15171 -18501
15499 -18501 -23578 -26796 -27440 -18669 -295 14058 8990 2844 6600 3270 -4652 -18774 -27964 -27532
15485 -27532 -27937 -20582 -15511 -12375 -12663 -16342 -26627 -31052 -23281 -18011 -15053 -8844 -16592 -13975 -8249
15470 -8249 -10899 -19931 -27890 -24498 -23040 -12752 -1824 6211 -2728 -12201 -13651 -14342 -1059 -1350
15456 -1350 -13065 -27655 -33174 -24092 -11507 -6391 -11407 -15445 -16358 2138 2549 -11792 -18760 -13582
15442 -13582 -7189 -11828 -6017 -18657 -30815 -29050 -22923 -19144 -12707 -7768 -10362 -12087 -15977 -17953
15428 -17953 -14221 -11539 -9677 -450 -1455 6269 8060 148 -5865 -8677 -8702 -20363 -22866 -13760 -9954
15413i954M263j0719j4477k901r928M996J1847J7925R227p892n435P77l01o124
15399a8696N947O489K609k533k061j783q32o96M902J5837P901M537l300j7178
15385A143j0789K362Q21R787J2676k650k898j0383j5803k2544m87O069j163N793
15371b8066P837L09K014J0033P689L141K697j5656k0190o160M843l004R129Q766
15357a6618q29J3191j185m836N697j0444j6386J0492J9294q3p18Q598o91j3844
15343h362q068r332o329R984J3226n758L514j785m333P349n255j944M256m710
15329a7547R012L135n007j9841q577n054J1054R094L219M49J229J456Q234K924
15315f220j2062p090J823L235P852k39l111J987P48K390N972Q251J2847k075o931
$$ plain form
15413 -9954 -5691 -16410 -30887 -33788 -43716 -38720 -26873 -8948 279 -7613 -13048 -12271 -12572 -18696
15399 -18696 -12749 -6260 -3651 -6184 -8245 -10028 -10860 -11556 -6654 9183 17084 21621 18321 1143
15385 1143 -9646 -7284 -6463 3324 16000 13350 10452 69 -15734 -38278 -38765 -32696 -33859 -28066
15371 -28066 -20229 -19920 -17906 -7873 -184 2957 5654 -10002 -30192 -36352 -31509 -34513 -25384 -16618
15357 -16618 -17447 -4256 -5441 -10277 -4580 -15024 -31410 -20918 -1624 -1707 -2425 6173 5482 -8362
15343 -8362 -16430 -25762 -32091 -22107 -8881 -14639 -11125 -12910 -17243 -9894 -15149 -17093 -12837 -17547
15329 -17547 -8535 -5400 -10407 -30248 -38825 -43879 -32825 -23731 -20512 -20063 -18834 -17378 -9144 -6220
15315 -6220 -18282 -25372 -23549 -20314 -12462 -12701 -15812 -13825 -13077 -10687 -4715 3536 16383 14308 7377
15300G377j1908q460q410Q956Q893P23K560m268j1874o579J5576J0320m149j540
15286b783p727p486j87M389p916J656p388O344J6136J5862M574q972n270p366
15272f134k761j0839K998M969J451K26N946J745Q712N928n272L27l265j478p399
15257d846j5453K461L543O027J0228o180j1814m226J3184j290N975k490k8L518
15243a391l12q373l026J3188k173j0299p148J133p360J977R406r298j2197M129
15229c1744J4042J7168K486j83j1585l196l79M741j1343L875J1746o419K913j962
15215i840j2728j0833j1731j1414N927M928K676J4410J2602M940p526J465J5911
15202a213j600k601l585m442M85L590N87j0879N25k013l908R691j119n877N818
$$ plain form
15300 7377 -4531 -12991 -21401 -12445 -3552 -2829 -269 -4537 -16411 -22990 -7414 2906 -1243 -2783
15286 -2783 -10510 -17996 -18183 -13794 -21710 -20054 -27442 -21098 -4962 10900 15474 6502 1232 -6134
15272 -6134 -8895 -19734 -16736 -11767 -10316 -10090 -4144 -2399 6313 12241 6969 7296 4031 2553 -4846
15257 -4846 -20299 -17838 -14295 -8268 1960 -4220 -16034 -20260 -7076 -8366 -2391 -4881 -4909 -1391
15243 -1391 -1703 -10076 -13102 86 -2087 -12386 -19534 -18401 -25761 -23784 -14378 -23676 -35873 -31744
15229 -31744 -17702 -534 1952 1769 -9816 -13012 -13391 -8650 -19993 -16118 -4372 -10791 -7878 -9840
15215 -9840 -22568 -33401 -45132 -56546 -50619 -45691 -43015 -28605 -16003 -11063 -18589 -17124 -1213
15202 -1213 -2813 -5414 -8999 -13441 -12956 -9366 -8779 -19658 -19133 -21146 -25054 -15363 -16482 -22359 -16541
15187a6541o734j6262J272J1840R814P061O067N270p193j369r447k518N452L114
15173a0174k553N347N77L505k608M997P545l140R8J398J213p488j0594l590P340
15158h127k550Q073P090r347j4444K895p031q722m066L307o432K763k093M895
15144c3789J6617O710m16n863j1330m644O004o702K576J332k357J321m696J1104
15130b4133N318J1013J2367q402j7432N360Q037J360O675J3243j1131o879J4852
15117A0248j2439p964r359K00o905j713J4563P34M564R618M104p444M527J950
15103D684p50r982j2295j1389Q834j126Q257P713j2156n025N409J697K648l177
15089a6658r671m510J3979L097K427n289m629J807n361P752M350J0301L385p207
$$ plain form
15187 -16541 -23275 -39537 -38265 -26425 -16611 -9550 -3483 1787 -5406 -6775 -16222 -18740 -13288 -10174
15173 -10174 -12727 -7380 -6803 -3298 -5906 -909 6636 3496 3594 4992 6205 -1283 -11877 -15467 -8127
15158 -8127 -10677 -2604 4486 -4861 -19305 -16410 -23441 -32163 -36229 -32922 -39354 -36591 -38684 -33789
15144 -33789 -17172 -10462 -10878 -16741 -28071 -32715 -26711 -33413 -30837 -29505 -31862 -30541 -35237 -24133
15130 -24133 -18815 -7802 4565 -3837 -21269 -15909 -7872 -6512 163 13406 2275 -4604 10248
15117 10248 -2191 -10155 -19514 -19314 -26219 -27932 -13369 -12635 -8071 1547 5651 -1793 2734 4684
15103 4684 3934 -6048 -18343 -29732 -20898 -22024 -13767 -6054 -18210 -23235 -17826 -16129 -13481 -16658
15089 -16658 -26329 -30839 -16860 -13763 -11336 -16625 -21254 -19447 -24808 -17056 -12706 -2405 980 -6227
15075f227j829R147P56k2154j1204M210J698L893O101j0894Q886P808l962k938
15061a6709O974m972j2689K228q204O371p58L232J2127Q998l250p055n482j907
15047b1096P65N140k064q86P832J8729J0240j1831k969p344m005j5361m759O468
15033b1141M689j3542l825n64J3933R998l950j3892o751k860Q261N804Q305j146
15019a6681l405J1092J2339o079j602q549j282M696L885m873Q204J0054p179p980
15005g360R38o472k183Q68k954j586Q449J3267N711o799j0670l254O929J5540
14991A0424k048o389j3545q471O513k167k783q455K659O645p897Q835Q208J1006
14977B535r68o724J0387K7730K9899L7858M1186O1795O0137l195m1658n1602n0512
$$ plain form
15075 -6227 -8056 1091 1847 -20307 -31511 -27301 -25603 -21710 -15609 -26503 -17617 -9809 -13771 -16709
15061 -16709 -9735 -14707 -27396 -25168 -33372 -27001 -27759 -24527 -12400 -3402 -6652 -13707 -19189 -21096
15047 -21096 -20331 -15191 -17255 -18141 -10309 8420 18660 6829 3860 -3484 -7489 -22850 -27609 -21141
15033 -21141 -16452 -29994 -33819 -34383 -20450 -10452 -14402 -28294 -35045 -37905 -29644 -23840 -15535 -16681
15019 -16681 -20086 -8994 3345 -2734 -4336 -12885 -14167 -9471 -5586 -10459 -2255 7799 620 -7360
15005 -7360 -6422 -12894 -15077 -14209 -17163 -18749 -10300 2967 8678 1879 -8791 -12045 -5116 10424
14991 10424 8376 1987 -11558 -20029 -13516 -15683 -18466 -26921 -24262 -17617 -25514 -16679 -8471 2535
14977 2535 1567 -5157 5230 32960 62859 100717 141903 203698 263835 260640 218982 167380 116868
14964A16868k8487j6565j2128j1272l743m794r72j5992J64R054m502K080r656
14951B0055k437P627K163n872J1747M094q591n889o887K101R501Q42p879j0639
14937I936j7719Q156N580k058J38M414O359O876r108m633j1049m868Q692J56o211
14922e339p794K92J593J28m992Q996N937O82Q494j5550j1121R373J6822J2084
14908A9605K78n403o809j0446j642P542j60j2609L183n628m359J7515N635j4603
14894g901k084o08p643o986p8Q343L976m637J2187M772m931k877j467P302j1101
14879a3733j0791J1J734j124P773P174p266m198L034J2988o74N036m439j0584
14865a5059L299O34R370L400j5055p401l174r208Q119J4513K170J2550n723j3844
$$ plain form
14964 116868 88381 71816 59688 48416 44673 39879 38907 22915 23079 32133 27631 29711 20055
14951 20055 17618 25245 27408 21536 33283 37377 28786 22897 16010 18111 27612 28454 20575 9936
14937 9936 -7783 373 5953 3895 4033 8447 14806 21682 12574 7941 -3108 -7976 716 872 -5339
14922 -5339 -13133 -12841 -11248 -11120 -16112 -7116 -1179 -497 7997 -7553 -18674 -9301 7521 19605
14908 19605 19883 14480 7671 -2775 -4417 3125 2965 -9644 -6461 -12089 -16448 1067 6702 -7901
14894 -7901 -9985 -10593 -18236 -25222 -25300 -16957 -12981 -17618 -5431 -659 -5590 -8467 -9934 -2632 -13733
14879 -13733 -24524 -24513 -22779 -23903 -16130 -8956 -16222 -20420 -17386 -4398 -5072 -36 -4475 -15059
14865 -15059 -11760 -11126 -1756 1644 -13411 -20812 -23986 -33194 -25075 -10562 -8392 4158 -1565 -15409
14851a5409J0080L449q079K487q091l243L921M623J2026O866P110l138j3244M95
14837a47L714k129j0854m674Q24O203M548J1052j0034j303p38J5888L011j1916
14823C445r891m341n03n535r384K801J1365m859j86L27j663J2304p794j1458m536
14808b9908K699J0900M121n105L793P672N369k784j2306J56p866N848J473Q001
14794g937N758M709N035j6421j1600M743J637p938r61J3452L753j941m132K259
14780i584R910J097p194j0511j0065l118J80L449o345Q80M116J4356J0332j570
14766d067k5716J0676J8578n216j453J0290J1996j7247p810P712j485j2205O596
14753i351J1593j0742j2054m354J599M194q509p24R724J4516J0358m674K429j3000
$$ plain form
14851 -15409 -5329 -1880 -9959 -7472 -15563 -18806 -14885 -10262 1764 8630 15740 12602 -642 -147
14837 -147 3567 1438 -9416 -14090 -13266 -7063 -2515 8537 -1497 -2800 -3538 12350 15361 3445
14823 3445 -6446 -10787 -11290 -16825 -26209 -23408 -12043 -16902 -17088 -16761 -18424 -6120 -13914 -25372 -29908
14808 -29908 -27209 -16309 -12188 -17293 -13500 -5828 -459 -3243 -15549 -15393 -23259 -17411 -15938 -7937
14794 -7937 -2179 2530 7565 -8856 -20456 -15713 -14076 -22014 -22975 -9523 -5770 -7711 -11843 -9584
14780 -9584 326 1423 -5771 -16282 -26347 -29465 -29285 -25836 -32181 -31301 -27185 -12829 -2497 -4067
14766 -4067 -29783 -19107 -529 -5745 -7198 3092 15088 -2159 -9969 -2257 -3742 -15947 -9351
14753 -9351 2242 -8500 -20554 -24908 -23309 -19115 -27624 -28348 -18624 -4108 6250 1576 4005 -8995
14739h995q680j477O464J102N096L522M997l689j4887r52Q691l982l868M021j4351
14724b6988K232r634r024J1491M106L693N945M751M429j416j390P001j2997N391
14710a2410N880r876m412L396L874O007M279q017M670j2253J709O333L698K043
14696e079K688l402K850l235j2326o081J2133R706N172l80k213o736r575J4810
14682a668n290j2446Q083J5353j2319j0817o683J4085P492m922j3753R550J2023
14669a312K524l029k013j1523j715O0j5289N614J0413j402p958P035K968J350
14655a4277r96j5022L499M403n696r34K323P879J682J0158K833j2267j8826J964
14641c3277J7358J0785k1335j36r544N811J767J1221R991K41j4164k2658q722
$$ plain form
14739 -8995 -17675 -19152 -12688 -11586 -6490 -2968 2029 -1660 -16547 -17499 -8808 -12790 -16658 -12637 -26988
14724 -26988 -24756 -34390 -43414 -31923 -27817 -24124 -18179 -13428 -8999 -10415 -11805 -4804 -17801 -12410
14710 -12410 -6530 -16406 -20818 -17422 -13548 -7541 -3262 -11279 -6609 -18862 -17153 -10820 -7122 -5079
14696 -5079 -2391 -5793 -2943 -6178 -18504 -24585 -12452 -2746 2426 2046 -167 -6903 -16478 -1668
14682 -1668 -6958 -19404 -11321 4032 -8287 -19104 -25787 -11702 -4210 -9132 -22885 -13335 -1312
14669 -1312 1212 -1817 -3830 -15353 -17068 -17008 -32297 -26683 -16270 -17672 -25630 -18595 -15627 -14277
14655 -14277 -15273 -30295 -26796 -22393 -28089 -29023 -26700 -18821 -17139 -6981 -4148 -16415 -35241 -33277
14641 -33277 -15919 -5134 -26469 -26605 -36149 -30338 -28571 -17350 -7359 -7118 -21282 -43940 -52662
14628e2662J1570J6642J1457j449J1518Q334p195l856k123O124m592n771r537
14615b1540Q360J277k0917N47M636L197K0315J6040n363r005J450j2899J693k892
14601a5101m045K0873R859p935k811J5233J165R3j0633j8750p088R274J1401j7067
14587a5532J061l230n287J2249R822m461j92J0255J3308M607j9464m011Q77J46
14573A48p387J1960J5205K972j045l040q676J3758J3041M096k1615j1537l32p179
14559C69r436p259j867n863P949J8059J4572o546n128O160n237j685j2292l361
14545a1565R818n179O128j897J758Q629J0827O771n808q300j181k420r279J1345
14531I647M44j2008N668m19l198j746J0124J4726k292j6504L727O206K25N808
$$ plain form
14628 -52662 -41092 -24450 -12993 -14442 -2924 5410 -1785 -5641 -7764 -1640 -6232 -12003 -21540
14615 -21540 -13180 -11903 -32820 -32273 -27637 -24440 -4125 11915 6552 -2453 -1003 -13902 -12209 -15101
14601 -15101 -19146 1727 11586 3651 840 16073 17238 17331 6698 -12052 -19140 -9866 1535 -15532
14587 -15532 -14471 -17701 -22988 -10739 -917 -5378 -5570 4685 17993 22600 3136 -875 2 148
14573 148 -7239 4721 19926 22898 21853 18813 10137 23895 36936 41032 19417 7880 7548 369
14559 369 -9067 -16326 -18193 -24056 -16107 1952 16524 9978 4850 11010 5773 4088 -8204 -11565
14545 -11565 -1747 -6926 -798 -2695 -937 7692 18519 25290 19482 11182 10001 7581 -1698 9647
14531 9647 10091 -1917 3751 3332 134 -1612 8512 23238 20946 4442 8169 14375 14600 20408
14517B0408J247N184k90j0321p866l677n88O153J666R20Q507P462O474j6977j3401
14502D901J266M259K300j6646p207J1198J4515K437n83p566R380K0576P732j0354
14488C6208j6254r452O625J5745M817J3095n816j8877r927n458l713R873N841
14475B2707k344K327j957j0644K472N391R02j3017n872M621P176O081q106K226
14461A1963K565M983n874R097J4435j064J1622K943k563K444n551k3134j109R143
14447B9900j416K901Q225k432k823n633j3013p148M288P120Q843j1997L963l73
14433B0405K156p724Q348N56j7533m230J4928l881o380P886J3650l706o370l142
14419A4963Q363O543n905p985L507k001k936p086r60K072q389K686R680P096N916
$$ plain form
14517 20408 21655 26839 26549 16228 8362 4685 4097 10250 11916 12836 21343 28805 35279 18302 4901
14502 4901 6167 10426 12726 -3920 -11127 71 14586 17023 16440 8874 18254 38830 46562 36208
14488 36208 19954 10502 17127 32872 37689 50784 44968 26091 16164 10706 6993 16866 22707
14475 22707 20363 22690 20733 10089 12561 17952 18854 5837 -35 4586 11762 17843 9737 11963
14461 11963 14528 19511 13637 22734 37169 36105 47727 50670 48107 50551 45000 21866 20757 29900
14447 29900 28484 31385 39610 37178 34355 28722 15709 8561 12849 19969 28812 16815 20778 20405
14433 20405 22561 14837 23185 23741 6208 1978 16906 13025 6645 14531 28181 24475 18105 14963
14419 14963 23326 29869 23964 15979 19486 17485 14549 7463 6503 8575 186 2872 12552 19648 25564
14404B5564o039K223j415m660n930j2508k865K0212J2495P437k472j805k858j3604
14390A3775L325O388j8907n770q79j667P307J2620l050r229J447n944l988r66
14376e538p210O011P725j659j813M88m261Q765O697m40k147M438k252N364j2550
14361A618m462N266J894Q23O192J045R21R14j511k2382q113Q418J7730Q752m334
14346A2771l500j340j922K898K75j7472j788L978M825l42J7842n765o075j5040
14332a0655n158J6419R349l466n899M446l775o736p099O775J0377L126j4212l553
14318a0061k063p035l441q99j12Q053J565k195M338p712l163n19o123j614j778
14303c2759L382q910N449J1674J403r43P047J3832J866K950j669Q849l168j1662
$$ plain form
14404 25564 19525 21748 20333 15673 9743 -2765 -5630 14582 27077 34514 32042 30237 27379 13775
14390 13775 17100 23488 4581 -1189 -2068 -3735 3572 16192 13142 3913 5360 -584 -4572 -5538
14376 -5538 -12748 -6737 988 -671 -2484 -1996 -6257 2508 9205 8765 6618 11056 8804 14168 1618
14361 1618 -2844 2422 4316 5139 11331 12376 13297 14211 12700 -9682 -17795 -9377 8353 17105 12771
14346 12771 9271 7931 6009 8907 9182 -8290 -10078 -6100 -1275 -1617 16225 10460 4385 -10655
14332 -10655 -15813 606 9955 6489 590 5036 1261 -5475 -12574 -5799 4578 7704 -6508 -10061
14318 -10061 -12124 -19159 -22600 -23499 -23611 -15558 -13993 -16188 -11850 -19562 -22725 -23244 -29367 -30981 -32759
14303 -32759 -29377 -38287 -32838 -21164 -19761 -20704 -13657 175 2041 4991 3322 12171 9003 -2659
14289b659m519N188k478O032L053j268j1003p317N189Q804k918j0323j4303R419
14275a9103N002J0852m368o6Q007M708m280j7536j6812K360O051R507L423K935
14261i320j1763K26P225k241J2111M486n876N342n94k585l339n405J0389n820
14247g164n074J1915R920o711j1052k890m056m900j326J0338P269k289k311l405
14233a1736o828m467j460M193K33K622Q364L291m407J0200l158o963K396L876
14219c844J2003Q971M351O985k2663r534M424n806p181J413j311R699Q711m158
14205B060m709n550J493p788o505O084j207l402j8833p776J7083J7321P354n885
14191a0260o535P055k582p152k266K55n13o131l547N838n145n221M188P416N50
$$ plain form
14289 -2659 -7178 -1990 -4468 1564 4617 3349 -7654 -14971 -9782 -978 -3896 -14219 -28522 -19103
14275 -19103 -14101 -3249 -7617 -7683 324 5032 752 -16784 -33596 -31236 -25185 -15678 -12255 -9320
14261 -9320 -21083 -20857 -13632 -15873 -3762 724 -5152 190 -404 -2989 -6328 -11733 -1344 -7164
14247 -7164 -12238 -323 9597 2886 -8166 -11056 -15112 -20012 -21338 -11000 -3731 -6020 -8331 -11736
14233 -11736 -18564 -23031 -24491 -20298 -20065 -17443 -9079 -5788 -10195 5 -3153 -10116 -7720 -3844
14219 -3844 8159 17130 21481 28466 5803 -3731 693 -5113 -12294 -10881 -12192 -2493 6218 2060
14205 2060 -2649 -8199 -6706 -14494 -20999 -14915 -16122 -19524 -38357 -46133 -29050 -11729 -4375 -10260
14191 -10260 -16795 -9740 -12322 -19474 -21740 -21485 -21998 -28129 -31676 -25838 -30983 -36204 -32016 -24600 -24050
14176b4050R701j949n653l527N024K137J640L354q528P684l786j398n620M548
14162b0423J2291k172O240L863l335j1355q340K017O400m276L943O154J5091r159
14148c061k501p207q62o575j2323Q146J0988K302N86L419Q538q473J0822l184
14134F15j1285m606j908K428N302N600j3261q815m73J2742P500K549n610j613
14120a0835j118k197J952J18O467L439n554l120Q500N163L808q718j565N236N283
14105F859k044q468j1750J2016P537P97r297Q958J2378j900n295j2024L183J649
14091B599M587R86M712J0027m193r532l22p678M358M521O192J2319O403r231k0551
14076E197n730Q365P81q053l022Q615j805k933n490O346J355j237j5724M3N396
$$ plain form
14176 -24050 -14349 -16298 -21951 -25478 -20454 -18317 -16677 -13323 -21851 -14167 -17953 -19351 -24971 -20423
14162 -20423 -8132 -10304 -4064 -201 -3536 -14891 -23231 -21214 -14814 -19090 -15147 -8993 6098 -3061
14148 -3061 -5562 -12769 -13631 -20206 -32529 -24383 -13395 -11093 -10507 -7088 1450 -7023 3799 615
14134 615 -10670 -15276 -17184 -14756 -9454 -3854 -17115 -25930 -26403 -13661 -6161 -3612 -9222 -10835
14120 -10835 -11953 -14150 -12198 -12080 -5613 -2174 -7728 -10848 -2348 2815 6623 -2095 -3660 1576 6859
14105 6859 4815 -3653 -15403 -3387 4150 4947 -4350 4608 16986 15086 9791 -2233 950 2599
14091 2599 7186 8172 12884 22911 18718 9186 8864 1186 5544 10065 16257 28576 34979 25748 5197
14076 5197 -533 7832 8613 560 -2462 6153 4348 1415 -4075 2271 3626 2389 -13335 -13292 -7896
14061g896N854K065M353K2806n9j7306J965O85k655j53n640N870p494j0525J026
14046g104k058j626M255J2218o38r822N496J3816j465q258n431L340l830k0237
14032b1344r635J7184M172r447l129n47J4717J2138k317k062N305q554j0956j241
14018a5716J3638J2862N553j2031j0424j5349j0451m42L876R900K5920n388j3500
14005a1552L16n462o738O692K621L409K837j8935Q79J2747L199J2969J981o313
13991a350j0866L424R185N339M229p468P030L093q414j7300K936P024p289l719
13977a4146J334r589J198J7440R188O394J3280j235K808r50j207o056j5805J975
13963D629j516K144n373r327J2382J283N458J967k612L678m799J2359j2132m228
$$ plain form
14061 -7896 -2042 23 4376 27182 27123 9817 11782 12467 9812 9659 4019 9889 2395 -8130 -7104
14046 -7104 -9162 -10788 -6533 5685 5047 -4775 721 14537 13072 4814 -617 2723 -1107 -21344
14032 -21344 -30979 -13795 -9623 -19070 -22199 -22746 -8029 4109 1792 -270 5035 -3519 -14475 -15716
14018 -15716 -2078 10784 16337 4306 -6118 -21467 -31918 -32360 -28484 -18584 7336 1948 -11552
14005 -11552 -11236 -16698 -23436 -16744 -14123 -10714 -7877 -26812 -25933 -13186 -9987 2982 4963 -1350
13991 -1350 -12216 -8792 393 5732 9961 2493 9523 12616 4202 -13098 -10162 -3138 -10427 -14146
13977 -14146 -12812 -22401 -21203 -3763 5425 11819 25099 23864 26672 25722 24515 18459 2654 4629
13963 4629 3113 5257 -116 -9443 2939 4222 9680 11647 9035 12713 7914 20273 8141 3913
13949C913l212q022r71M561L218K5745J1045O91j9051r959j9855j3103j750J6525
13935a0225P443J686J700o821J983o508J6859J6311N502j5979p977o376k415K085
13921b732n250r084l316K625J0534J1369O306q71q410q152K327N976j168j043
13907h89k798j627l605N388K746k928p739J030q844j458J2597J0136N176O873
13893A4058k520j135r864n923P674L564j006j655M598l724J1162P856o097r124
13879G864k711M024L859o226j0462N289K703P366L292J2605J8951J652o013o578
13865C5615J005j8236j0153J6240k967r847O029R186L531L339K390J869p157j1006
13851A9838r09J1933m183j3548k264j1260m51N083j05N549j152l578p099l573
$$ plain form
13949 3913 701 -7321 -8292 -3731 -513 25232 36277 36968 17917 7958 -11897 -25000 -26750 -10225
13935 -10225 -2782 -1096 604 -6217 -4234 -10742 6117 22428 27930 11951 3974 -2402 -4817 -2732
13921 -2732 -7982 -17066 -20382 -17757 -7223 4146 10452 9581 1171 -6981 -4654 1322 154 -889
13907 -889 -3687 -5314 -8919 -3531 -785 -3713 -11452 -10422 -19266 -20724 -8127 2009 7185 14058
13893 14058 11538 10403 539 -5384 2290 5854 4848 3193 7791 4067 15229 23085 16988 7864
13879 7864 5153 9177 13036 6810 -3652 1637 4340 11706 14998 27603 46554 48206 42193 35615
13865 35615 36620 18384 8231 24471 21504 11657 17686 26872 30403 33742 36132 38001 30844 19838
13851 19838 18929 30862 26679 13131 10867 -393 -844 4239 4134 9683 8531 4953 -2146 -5719
13837e719j1446O31J8922J206l309P358K053r413L463P952J1543K404k30M009
13823B9424P095L117k495m010p420l939J0760K3207K5240J7748n234L884p166
13810I0211r823o005j3459J144N55j4124L412p556J632M841P708L053L529k1893
13796D3225j4051L169M31K682l554m509K553n6j899K310j1092K205r95J581R002
13781C1002J0362M569j0057r488N591j812k291q278m487n673J211p818K213N311
13767A0355n296k064M001J0943Q52J1891k137K009J5200J3210j1612j04Q609Q303
13753F4160o193k791k659N015M067p140R772J6787R997J9331K5477K9891M4013
13740B09727N0581M1425K4750R53l5052k9488l0990m0831l0584k6049k5486l095
$$ plain form
13837 -5719 -17165 -16534 2388 3594 285 7643 9696 283 3746 11698 23241 25645 25415 29424
13823 29424 36519 39636 37141 33131 25711 21772 32532 55739 80979 98727 93493 97377 90211
13810 90211 80388 74383 60924 62068 62623 48499 51911 44355 45987 50828 58536 61589 65118 43225
13796 43225 29174 32343 32774 35456 31902 27393 29946 29890 27991 30301 19209 21414 20419 22000 31002
13781 31002 41364 45933 35876 26388 31979 30167 27876 19598 15111 9438 10649 2831 5044 10355
13767 10355 5059 2995 6996 17939 18791 30682 28545 30554 45754 58964 47352 47248 55857 64160
13753 64160 57967 55176 52517 57532 61599 54459 64231 81018 91015 110346 135823 165714 209727
13740 209727 260308 301733 326483 327436 292384 262896 231906 191075 160491 134442 108956 105861
13728A05861L79l085j0428j5497J853J1330j4223j3639l445P218K862l701k947
13715F2538l276j3343k768K687l423q747n866j519O337J997J8878J0813q715p43
13701E4850j449K542j917o220P04J5357P952j7034j1437K400K773j0107j0307
13688B8107K271N016P174O635j595o077j4072n780l738j2186J5006l64j7347m449
13674a399J7469J0068q635k718j002j974l284l460J79P967O676l257N407k706
13660A9331R7R418j1843j501q76o789l526l227L632N468j981j402R160l238q522
13645D201J047q495p745J0842L592l43M690j0555k790J6104J4508M767j8720j9534
13631h431o307R0K078k688p40J3730n752P866m98J597Q039L403l431m130o885
$$ plain form
13728 105861 106240 103155 92727 77230 79083 90413 76190 62551 59106 66324 69186 65485 62538
13715 62538 59262 45919 43151 45838 42415 33668 27802 26283 32620 34617 53495 64308 55593 54850
13701 54850 53401 55943 54026 47806 48510 63867 71819 54785 43348 45748 48521 38414 28107
13688 28107 30378 35394 42568 49203 47608 41531 27459 21679 17941 5755 20761 20397 3050 -1399
13674 -1399 16070 26138 17503 14785 13783 11809 8525 5065 5244 13211 19887 16630 22037 19331
13660 19331 19428 28846 17003 15502 14626 7837 4311 1084 4716 10184 8203 6801 15961 12723 4201
13645 4201 5248 -3247 -10992 -150 3442 3099 7789 -2766 -5556 10548 25056 29823 11103 -8431
13631 -8431 -14738 -14648 -12570 -15258 -15998 -2268 -8020 -154 -652 945 8984 12387 8956 4826 -2059
13616b059P223J8195M509r355j6390k945k8M362n158M95L602p586k885R45P338
13601B63K861J7546m021j5325j0468P733O464j629q379l300p091K506N207P270
13587c63P628L053j728p767j0304j0j2227L754J9469j2514k643n452N20O233Q798
13572c553P476j450J682j0138j9m847q632M282M292J4643N632J643q575J747O815
13557A0998N70L350m995J465N50M341m540N14Q111K847K373n363j0611n43J509
13542A0576J928O001r4j2305P40L855n092j2140J0261J5511m988j5806M41j853
13528b965K446k515Q183N184Q593j259q060K837m282P153n252o794J0019K1025
13514C4313r975k0601n550K165J4410r902q496l057J743J3600P725q979J3760
$$ plain form
13616 -2059 5164 23359 27868 18513 2123 -822 -850 3512 -1646 -1151 2451 -5135 -8020 -7075 263
13601 263 3124 20670 16649 1324 -9144 -1411 5053 3424 -4955 -8255 -15346 -12840 -7633 -363
13587 -363 7265 10318 8590 823 -9481 -9491 -21718 -17964 1505 -11009 -13652 -19104 -18584 -12351 -3553
13572 -3553 3923 2473 4155 -5983 -6002 -10849 -19481 -15199 -10907 3736 9368 11011 2436 4183 10998
13557 10998 11568 14918 9923 11388 11938 16279 11739 12253 20364 23211 25584 20221 9610 9067 10576
13542 10576 12504 18505 18411 6106 6846 10701 5609 -6531 3730 19241 14253 -1553 -1112 -2965
13528 -2965 -519 -3034 5149 10333 18926 17667 9607 12444 8162 15315 10063 3269 13288 34313
13514 34313 24338 3737 -1813 352 14762 4860 -3636 -6693 -4950 8650 16375 7396 21156
13501B1156R322K594m748q149n018L169J982k967r986Q390j611l064j845k206
13487G019J4786J401j0449r849j7866o603P888N321N187l729l340q604o35R127
13473a0346J0167Q33k151J5848j500j1931r927J8491o803j1707J6723J3091k999
13460A7789k316J0487J6199Q285p152j076J0782Q101j1106k3671j750j0151J396
13447A5817O131M240k919m385k496M228J283j618j113j3651L324L211k483l362
13433F207J531Q525K991M615j384J618n884J931Q741q096j1925k703J68N50K57
13418G142N138m307j4759Q617R702q813l348K1884J0936k783R35K90L859J082
13404C5575j2128o554N317J0093M0j4217m009Q833J34o616J176M742N311L951
$$ plain form
13501 21156 30478 33072 28324 20175 15157 18326 20308 17341 7355 15745 14134 11070 9225 7019
13487 7019 21805 23206 12757 2908 -14958 -21561 -13673 -8352 -3165 -6894 -10234 -18838 -19473 -10346
13473 -10346 -179 654 -1497 14351 12851 920 -9007 9484 2681 -9026 7697 20788 17789
13460 17789 15473 25960 42159 50444 43292 42216 52998 61099 49993 26322 24572 14421 15817
13447 15817 21948 26188 23269 18884 16388 20616 21899 20281 19168 5517 8841 12052 9569 6207
13433 6207 7738 16263 19254 23869 22485 24103 18219 20150 28891 20795 8870 6167 6335 6885 7142
13418 7142 12280 7973 -6786 1831 11533 2720 -628 21256 32192 29409 30344 30634 34493 35575
13404 35575 23447 16893 22210 32303 32343 18126 14117 22950 23084 16468 17644 22386 27697 31648
13390C1648k001j4963k0546o577N884j6158n586Q027J9613J4705R97n298k1734
13377a1989O568m988L936J5961J1225j3619q72O147J870K329K166m494O561J4465
13363C5266N865p52j2900j1334j1886m960J459R202n12K102R363Q086l085L889
13349B9803J73q567q103k194P085j0492o379L735j794O194J8001J917L020q859
13335B3540j8114m056n714o987N212K208N729R372o7P21j686p494j0590N38O189
13320a199l07j098J0858J1530N576n866j0702r82o478K291M606q311K919j7436
13306a4599p132J2286J1514J5829K408m437j3579p772O528P569J940n179k284
13293C092J1595K0929J545k990n302o380l722m113m446q047j634L295l036j851
$$ plain form
13390 31648 29647 14684 -5862 -12439 -6555 -22713 -28299 -20272 -659 14046 15043 9745 -11989
13377 -11989 -5421 -10409 -6473 9488 20713 7094 6222 12369 14239 16568 18734 14240 20801 35266
13363 35266 41131 40379 27479 16145 4259 -701 758 9960 9448 11550 20913 28999 25914 29803
13349 29803 29976 21409 13306 11112 18197 7705 1326 5061 3267 9461 27462 29379 32399 23540
13335 23540 5426 1370 -4344 -11331 -6119 -3911 1818 11190 11123 11844 10158 2664 -7926 -7388 -1199
13320 -1199 -1506 -2604 8254 19784 25360 19494 8792 7810 1332 3623 8229 -82 2837 -14599
13306 -14599 -21731 -9445 2069 17898 20306 15869 2290 -5482 1046 8615 10555 5376 3092
13293 3092 14687 35616 37161 34171 28869 22489 18767 14654 10208 2161 527 3822 786 -1065
13279a065Q95p388m237P835J233J3006Q464K293J0487r085k635j450M426j4610
13265H169K546j63P230o902q850K197O789o171J3412J0916j308m121q29M155J444
13250B8514M809M819r809r969j942K421K59n145o308O136k220j3984n247J0095
13236B429Q254J768N508j3939K243J2288L769J1953N147n119j0506j028O93j3809
13222I651j128M475Q322M081N786Q00j40l73r201j6355P06K353J413J549N856
13207A7795J4409O851m407k85j62R71j0729r124Q706O902J42J2445Q376M285L474
13192E9649J7074J3582J8177L3677M2568M3905M7630J8462j8549j8936l4929k4170
13180A98140k8515k5400j4922j9782j6542j8472n906j0431M641J0627m478j0133
$$ plain form
13279 -1065 -170 -7558 -11795 -3960 -2727 10279 18743 21036 31523 22438 19803 18353 22779 8169
13265 8169 10715 10552 17782 10880 2030 4227 11016 4845 18257 29173 27865 23744 22915 27070 28514
13250 28514 33323 38142 28333 18364 16422 18843 19102 13957 7649 13785 11565 -2419 -7666 2429
13236 2429 10683 12451 17959 4020 6263 18551 22320 34273 39420 34301 23795 22767 23460 9651
13222 9651 8523 12998 21320 25401 31187 31987 31847 31474 22273 5918 6624 8977 10390 11939 17795
13207 17795 32204 39055 34648 34363 34201 35172 24443 15319 24025 30927 31069 43514 51890 56175 59649
13192 59649 76723 90305 108482 142159 184727 228632 276262 294724 276175 257239 222310 198140
13180 198140 169625 144225 129303 109521 92979 74507 68601 58170 62811 73438 68960 58827
13168E8827n265k37J287J4034J5577L098m649l012l295M399J42O354P452M402
13154I9114J230P706J5881K1890J9010J5222R636L4191M5339N5726R4775J15476
13142E35196J31236J22883R0150P252o6548j13146j10567j04378p4160m3712l4485
13131C39721k4532j4072k0394j5997j1797j4860j5741r611j3772j0799j97J848
13119A89797J2195m186p501j3474o959j569j0216P058j1781j9007l94K3713L0994
13106A88670J1200K3051J6876K0224M3606M5241M9332Q7277J00691J31774J26217
13095H44159J02404K0600n7909r4575j25975j20262q9584p0956n6512m6272m1486
13084B63632j6412m82q507q035j5129j1085r065p592k827r376J264J015n29n244
$$ plain form
13168 58827 53562 53325 54612 68646 84223 87321 82672 79660 76365 80764 80906 87260 94712 99114
13154 99114 100344 108050 123931 145821 164831 180053 189689 223880 269219 324945 419720 535196
13142 535196 666432 789315 879465 886717 820169 707023 596456 492078 417918 374206 339721
13131 339721 315189 301117 280723 264726 252929 238069 222328 212717 198945 188146 187949 189797
13119 189797 201992 197806 190305 176831 169872 168303 158087 165145 153364 134357 133963 157676 188670
13106 188670 199870 222921 239797 260021 303627 348868 398200 485477 586168 717942 844159
13095 844159 946563 967163 909254 814679 688704 568442 478858 407902 351390 305118 263632
13084 263632 247220 246738 238231 230196 215067 203982 194917 187325 184498 175122 176386 177401 176872 171628
13070A71628k281n212K235j4092j0061n68P317k916q987k547J6664K6161k072
13057A75269j6470J0765L2385K7536J2347M3653L7207L1131N290p970k0427m8265
13045B82451l7099k3372j8508k7361j7528j6191j4563j7146j2130M013p272j9656
13033G5638k982J5366J5619j782J501j1269K486K675j1767l492n660k491j6481
13020E7361m220J5670o239q563J0469J5637K489k256M803Q540K543r346J7j2680
13006G4225o898j6986j1106j140K2108q418J793M003j0943j6996o524J280j92
12993B4206O620J0078l713p349o71J0951N414l667m844K616J556j2766k0447n119
12979B865N837R816P434J849j3966j567J688o489O311K914L349L730j2011j2889
$$ plain form
13070 171628 169347 164135 166370 152278 142217 141649 148966 146050 137063 134516 151180 177341 175269
13057 175269 158799 169564 201949 229485 241832 285485 322692 353823 359113 351143 330716 282451
13045 282451 245352 221980 203472 176111 158583 142392 127829 110683 98553 102566 95294 75638
13033 75638 72656 88022 103641 101859 103360 92091 94577 97252 85485 81993 76333 73842 57361
13020 57361 53141 68811 62572 54009 64478 80115 82604 80348 85151 93691 96234 86888 86905 74225
13006 74225 67327 50341 39235 38095 60203 51785 53578 57581 46638 29642 23118 24398 24206
12993 24206 30826 40904 37191 29842 29171 40122 45536 41869 37025 39641 41197 28431 7984 2865
12979 2865 8702 18518 25952 27801 13835 12268 13956 7467 13778 16692 20041 23771 11760 -1129
12965a129q891j56J4517l385L611R326j808L299n877K019J2890Q627J66P572N403
12950D6184j0046K626j832j2561r881r33Q491P703J2853J544P729J5546J0945
12937G8368J4775l219j0109r28n373j3660j2048m484k041L776m63L633P865J098
12923E7190j1682l694o17j510r721j53N116l673N792j1601k506n735N108L120
12909B5434Q953l207L545q33j1483j2606q038J353J0204J5068j901j367M788K215
12895C2125m305J278M001m180n344P057J777j1679j0301J7021M198K657M284j2987
12881B5602o191j319M556J3246l545n16O220J0462M460j2641j2508p278l410l370
12867A3768J0924n870r043P997K219K872q813M143J4085O556m839m921p666K531
$$ plain form
12965 -1129 -10020 -10176 4341 956 4567 13893 12085 15384 9507 11526 24416 33043 33209 40781 46184
12950 46184 36138 38764 36932 24371 14490 13557 22048 29751 42604 44148 51877 67423 78368
12937 78368 93143 89924 79815 78887 73514 59854 47806 43322 41281 45057 44594 48227 56092 57190
12923 57190 45508 41814 41197 39687 29966 29813 34929 31256 37048 25447 22941 17206 22314 25434
12909 25434 34387 31180 34725 33892 22409 9803 1765 3118 13322 28390 26489 25122 29910 32125
12895 32125 27820 29098 33099 28919 23575 30632 32409 20730 10429 27450 31648 34305 38589 25602
12881 25602 19411 18092 22648 35894 32349 31833 38053 48515 52975 40334 27826 20548 17138 13768
12867 13768 24692 18822 9779 17776 19995 22867 14054 18197 32282 38838 33999 29078 21412 23943
12853B3943P49j163j0336J3217Q320r40J7937J4370j7573j7314m254L188L884
12840C4028N093K108q441m905j1166j314J005K061k876l852J1434J1220J259k42
12826C5412m22j2777m589m450J1225O157L409J4776K1497j950q655p397p391n029
12812C9816o501k897o724K322Q010J1440R935j183j021j901J685Q588p471n636
12798D8462p267q994k818j818p668j5580M092L1484J5046o551m130L545K666N900
12784E6369l10M906R920k626p486L418L379q923j0932o961M32P607j143K050j1576
12769C8124j231n114j1089N267Q805K435K548j0812N244J2178J6159k002k430
12756E8082M089J937J602J062m219K1618J7872J957m804P716K3244J7422J3800
$$ plain form
12853 23943 24692 23529 13193 26410 34730 33790 51727 66097 48524 31210 26956 30144 34028
12840 34028 39121 41229 32788 27883 16717 15403 16408 18469 15593 11741 23175 34395 35654 35412
12826 35412 34990 22213 17624 13174 24399 30556 33965 48741 70238 68288 59633 52236 44845 39816
12812 39816 33315 30418 23694 26016 34026 45466 55401 54218 53197 51296 52981 61569 54098 48462
12798 48462 41195 32201 29383 27565 19897 4317 8409 39893 54939 48388 44258 47803 50469 56369
12784 56369 56059 60965 70885 68259 60773 64191 67570 58647 47715 40754 41186 48793 47650 49700 38124
12769 38124 36893 31779 20690 25957 34762 37197 39745 28933 34177 46355 62514 60512 58082
12756 58082 62171 64108 65710 66772 62553 84171 102043 104000 99196 106912 130156 147578 161378
12743A61378K0958K1327K2978K8284L3445O0369O7209Q4171R3197J25899J30410
12732H49625J01182O7238L2226j040n0261p4982o6484p5362m8715q840J0799N3356
12720G88742O9318N3736j7371p6881q2786p9538o6704m5996n3519l8151m0764
12709D10086k9425j9479j0218l027p637n396j5117k2611l849R516R095R32o690
12696C06180o112P184j185n620P445r95k0336j3024J3276n328j2602k018M734
12683B71599O903l145k3065l195N208j2830p301o521O718l443j6573l695o507
12670B04153k0215j3195n623m143j6235N42k808R182Q477n497j1684k411j765
12657A38778N73k065r371J0102J2654Q818j3444K6N481k80K58n751n831j559j1253
$$ plain form
12743 161378 182336 203663 226641 254925 288370 348739 415948 500119 593316 719215 849625
12732 849625 950807 1018045 1050271 1049231 998970 923988 857504 782142 733427 724587 735386 788742
12720 788742 858060 911796 894425 817544 734758 655220 588516 542520 489001 450850 410086
12709 410086 380661 361182 350964 347937 340300 334904 319787 297176 293327 302843 311938 312870 306180
12696 306180 300068 307252 306067 300447 307892 306897 286561 273537 286813 281485 268883 266865 271599
12683 271599 278502 275357 252292 249097 254305 241475 234174 227653 234371 230928 214355 210660 204153
12670 204153 183938 170743 165120 160977 144742 145284 142476 151658 160135 154638 142954 140543 138778
12657 138778 139351 137286 127915 138017 150671 159489 146045 146071 151552 151272 151530 145779 139948 138389 127136
12642A27136p638l02l545J5651m465j1935P777K028o279R816r967J4436J2296
12629A45009N180J2981J898O745Q428M881l479q499j9595j2370o376J378l102
12616A33079L026l110n630j123o067p82Q617N908K869K205j6004r307l09J546
12602A14918O22j967P384P189m464P148o415m376Q18j1642r324l13J816M885J0204
12587A16483Q383q203J1483N85j8440m23P710R187o05j3206O200J0722M350J7227
12573A51453J8987J5664K3306K5503L8726M2578N6634M9979L7254K8784J6185
12562E05053j0748r402j1897k3542m1982l3866l2328l2593k1634k6727k4492k3708
12550B12134o436o308n909j0300l138Q60j4183r068p411j6568l879R36J0785k690
$$ plain form
12642 127136 119498 119196 115651 131302 126837 114902 122679 124707 118428 128244 118277 132713 145009
12629 145009 150189 163170 165068 171813 180241 185122 181643 173144 153549 141179 134803 136181 133079
12616 133079 136105 132995 127365 126242 120175 119393 128010 133918 136787 138992 122988 113681 113372 114918
12602 114918 115540 113573 120957 128146 123682 130830 124415 120039 120857 109215 99891 99578 101394 106279 116483
12587 116483 124866 116663 128146 128731 110291 109868 117578 126765 126160 112954 119154 129876 134226 151453
12573 151453 170440 186104 209410 234913 273639 316217 372851 422830 460084 488868 505053
12562 505053 494305 484903 473006 449464 407482 373616 341288 308695 287061 260334 235842 212134
12550 212134 205698 199390 193481 183181 180043 180903 166720 157652 150241 133673 129794 130730 141515 138825
12536A38825j461J619N945M366q390K404l068j4199o473L164L562n209O292J7121
12522A44498M485l638l817p063n78j0233j2005J480P590m302J099j3556q595J1553
12508A06918K0681J4000L104j8792j0649o194j6097J2461R456j2855L123N578
12496A10734J2190K0454Q287J8878L4060M2303O8575R0743R5076Q0697M2174P08
12484F24879n4139o0785m9019l1386j5356k7863k3127j4309j4043j0923j3166
12473C10763L663R594Q904N46k5273l047K1562J9405K0283J7828J1260N638J3025
12460D14151l852j0183o801J364N694J6147Q523K2459J6535K0545K9728M7817
12448E62127Q4184R9670J43836J76912K16149K63603K28502J04339m2348j07854
$$ plain form
12536 138825 137364 138983 144928 149294 140904 143308 140240 126041 119568 122732 126294 121085 127377 144498
12522 144498 148983 145345 141528 134465 133887 123654 111649 113129 120719 116417 117516 103960 95365 106918
12508 106918 127599 141599 144703 125911 115262 109068 92971 105432 114888 102033 105156 110734
12496 110734 122924 143378 151665 170543 204603 246906 315481 406224 501300 581997 624171 624879
12484 624879 570740 509955 460936 429550 414194 386331 363204 348895 334852 323929 310763
12473 310763 314426 324020 332924 333470 308197 305150 326712 346117 366400 384228 395488 401126 414151
12460 414151 410299 400116 393315 394679 400373 416520 425043 447502 464037 484582 514310 562127
12448 562127 646311 745981 889817 1066729 1282878 1546481 1774983 1879322 1836974 1729120
12438A729120j11921j18084r4786r3427r2757q2749q3188q2459p2770p3124n8026
12427G65829l6469m3091l3959k1211o478j530m682K771N904K2706J1190L1009
12415F91989M5725L9079K9283J5619j771N514J7264K9905L6516M6720N7509P3013
12403A086365R3857J25915J68227K09984K30693K16741J07384l4875j40268j66436
12393A897587j40726j05157p0952m6554m1643j5543K754J1691l89M533J6345K658
12381A514604M270R637K132J5040L7063K6515J1062J382J8271K4392K4910K5322
12369A714600J6314L0544M7087M9694L8974M5216N2716M3049L0074M6197O9129
12358B183594N5101O4535J03752J22001J12161R0837N9748M3687K1295J4955R908
$$ plain form
12438 1729120 1617199 1499115 1404329 1310902 1218145 1135396 1052208 969749 896979 823855 765829
12427 765829 729360 686269 652310 631099 624621 623091 618409 621180 627084 649790 660980 691989
12415 691989 737714 776793 806076 821695 819924 825438 842702 872607 909123 955843 1013352 1086365
12403 1086365 1180222 1306137 1474364 1684348 1915041 2131782 2239166 2204291 2064023 1897587
12393 1897587 1756861 1651704 1580752 1534198 1492555 1477012 1479766 1491457 1491068 1495601 1511946 1514604
12381 1514604 1518874 1528511 1530643 1545683 1582746 1609261 1620323 1621705 1639976 1664368 1689278 1714600
12369 1714600 1730914 1761458 1808545 1858239 1897213 1942429 1995145 2038194 2068268 2114465 2183594
12358 2183594 2238695 2303230 2406982 2528983 2641144 2731981 2791729 2835416 2856711 2871666 2881574
12347B881574J4719N2547N3738P9859Q0628R1607J34948J52143J42379J73727
12337C857869K11750K43817K70915L24046L68779M40503N26339O00531P25179
12328G569728Q66094J040318J199990J379294J544710J718798J937966K276102
12320A9533000K798140L599532M750106O359504Q508629J1296534J4723152J8606748
12312I0175345K2229672K4324466K3419654J8635652J0326157K00975r293119
12305A80018802j6133018j9402796j9441254j7378872j4446754j1496184q908783
12298G2811141o856068n328253m209397l423989k870991k502294k252439k081447
12290D3286263j959072j807878j668846j510101j332051j126844r43675p90685
$$ plain form
12347 2881574 2896293 2948840 3002578 3082437 3163065 3254672 3389620 3541763 3684142 3857869
12337 3857869 4069619 4313436 4584351 4908397 5277176 5717679 6244018 6844549 7569728
12328 7569728 8435822 9476140 10676130 12055424 13600134 15318932 17256898 19533000
12320 19533000 22331140 25930672 30680778 37040282 45548911 56845445 71568597 90175345
12312 90175345 112405017 136729483 160149137 178784789 189110946 189311921 180018802
12305 180018802 163885784 144482988 125041734 107662862 93216108 81719924 72811141
12298 72811141 65955073 60626820 56417423 52993434 50122443 47620149 45367710 43286263
12290 43286263 41327191 39519313 37850467 36340366 35008315 33881471 32937796 32147111
12282C2147111o27665n03915l87158l20313l03437l26672m16824n59764o81253
12273B8020110p35082p56703p51131p33788p19317p22374p56780q09554q85393
12264B1149988r38943r55133r37384r19161q93927q56529p94196p59133p22005
12255A3373577o85000o49402o20301n50924n35948n10562m66014m47656m26564
12246H481206m05801l74205l72054l47183l48914l25359l05181k79445k70546
12237E452518k71907k40441k28254k12584j99801j96668j82370j78252j50014
12228C592227j61721j68143j40448j36337j24511j15679j11538j13092j06091
12219B414667r6602p6785p8310q0779p3357p4946q1578q4119q3124o8674o3745
$$ plain form
12282 32147111 31519446 31015531 30628373 30308060 30004623 29677951 29261127 28701363 28020110
12273 28020110 27285028 26528325 25777194 25043406 24324089 23601715 22844935 22035381 21149988
12264 21149988 20211045 19255912 18318528 17399367 16505440 15648911 14854715 14095582 13373577
12255 13373577 12688577 12039175 11418874 10867950 10332002 9821440 9355426 8907770 8481206
12246 8481206 8075405 7701200 7329146 6981963 6633049 6307690 6002509 5723064 5452518
12237 5452518 5180611 4940170 4711916 4499332 4299531 4102863 3920493 3742241 3592227
12228 3592227 3430506 3262363 3121915 2985578 2861067 2745388 2633850 2520758 2414667
12219 2414667 2318065 2241280 2162970 2082191 2008834 1933888 1852310 1768191 1685067 1616393 1552648
12208A552648p3790p7813p9496n1158m2529m1720k8923n0697l5872k6582k7823
12197A016245j5159k252O101N031K3689M2785M9754N5536N7388N0153Q5093R4131
12185A468495P3807M8364J4670l6452p0872j13351j34533j31359j37390j16486
12175H64893r6714n8805n9717n6273l3253j9184k5314j2279k3479l1770l2865
12164D15240l6685l7957l4913k0510j6997q963j6088k4128m019L55q982j38J5704
12151B21919J0302J4279K6862J4738J0032K2435J9521J0139J4457M054J0489L1820
12139D11047L1675N849j617J7086O903J308O347J4844K2593K6094L579J8351L2324
12126E96383K6084K2895J7767l97L2r023j3722j7324k1626l265p20N907P617J2612
$$ plain form
12208 1552648 1478858 1401045 1321549 1270391 1227862 1186142 1157219 1106522 1070650 1044068 1016245
12197 1016245 1001086 998834 1004935 1009966 1033655 1076440 1126194 1181730 1239118 1289271 1374364 1468495
12185 1468495 1542302 1590666 1605336 1568884 1498012 1384661 1250128 1118769 981379 864893
12175 864893 768179 709374 649657 593384 560131 540947 515633 503354 479875 448105 415240
12164 415240 378555 340598 305685 285175 268178 259215 243127 218999 214980 215335 206353 206215 221919
12151 221919 232221 246500 273362 288100 298132 320567 340088 350227 364684 368738 379227 411047
12139 411047 442722 448571 446954 464040 470943 472251 478598 493442 516035 542129 545708 564059 596383
12126 596383 622467 645362 663129 662732 662764 653741 640019 622695 601069 597804 597084 602991 610608 623220
12112F23220k493K539K038p768q732m655q336K684o457j5553j0881k3632k8265
12099E13709k8868n078n534j0654m282m160j0040m920L020k897j54j5970k3098
12086D01074K637K195L99J8563K9146J6210J5671N062j9757m8691l6342j657j1485
12073C73025r915m789j4784k4909p994J1671J286l551l39j7008J52J0000J1664
12060C24509O340M545j007q177r330j3611j4448j4244O93r346n555k669k1142
12047B36558k4757q830j0654j0648p217k60q017q489j885J3636K5189J1190l274
12034B02542M119n900r444m618p152n386j4461q805m626j962j2243q64J1384r491
12020A33093r68r552k0611j0369q361R592P159R869J4224M249k8O796K395o145
$$ plain form
12112 623220 620727 623266 625304 617536 608804 604149 595813 598497 592040 576487 565606 541974 513709
12099 513709 484841 479763 474229 463575 459293 455133 445093 440173 443193 440296 440142 424172 401074
12086 401074 403711 405906 406305 424868 454014 470224 485895 490957 471200 422509 386167 384510 373025
12073 373025 363110 358321 343537 318628 310634 322305 323591 320040 319701 302693 302845 312845 324509
12060 324509 330849 335394 334387 326210 316880 303269 288821 274577 275270 265924 260369 257700 236558
12047 236558 211801 202971 192317 181669 174452 174192 166175 157686 155801 169437 194626 205816 202542
12034 202542 206661 200761 191317 186699 179547 174161 159700 150895 146269 144307 132064 131200 142584 133093
12020 133093 132125 122573 101962 91593 83232 92824 99983 109852 124076 128325 128297 135093 137488 131343
12006A31343R14j8788o169M427J4532R551j2149j0951k690j740j0675m974j1888
11993H0743J505J4466J53J462k359j2123m041Q954K039J5601Q559l041N927m847
11979A12998o153J5081J8823P569o661M65q862J9015M353n545J317J4646P57k809
11965A64994Q110J3465J2843r122k851q273n776j2045m274r852j0240N904N555
11952A48438N664J979M854m965m689p390n876O597P281J12j3116j1105n62n006
11938A22216k741L469q338p419L664j297k709J9365Q642o962n216J135l615R541
11924A29735M966j4834j4864J388o473L354o532R102Q727j0877p591o223J429
11911I1307M016j6368K131J8449j4400j7350M058m518J3159K348k546R67J9904
$$ plain form
12006 131343 132257 113469 107300 111727 126259 135810 123661 112710 110020 108280 97605 92631 80743
11993 80743 82248 96714 96867 98329 95970 83847 79806 88760 90799 106400 114959 111918 117845 112998
11979 112998 106845 121926 140749 148318 141657 142122 133260 152275 156628 151083 152400 167046 167803 164994
11965 164994 173104 186569 199412 190290 187439 179166 173390 161345 157071 147219 136979 142883 148438
11952 148438 154102 156081 160935 155970 151281 143891 138015 144612 151893 152005 138889 127784 127222 122216
11938 122216 119475 122944 114606 107187 110851 109554 106845 126210 134852 127890 122674 123809 120194 129735
11924 129735 134701 119867 105003 106391 99918 103272 96740 105842 114569 103692 96101 89878 91307
11911 91307 95323 78955 81086 99535 85135 67785 71843 67325 80484 82832 80286 81253 101157
11898A01157K0128M389Q341M13J1117J8221J4131J6082Q898K0592L3419N0256
11886C07144N9973P9235J06470J02052J22081J21612P9558N5245n305m8462p2695
11875I06908q4737q8064q4494o2379l5078m9178m6099k3432j0577r217l130r704
11863D00819j4873J131j0312j7247m251r800J0497R163j4419p311J2273J726j1197
11850C46199n037r139j2017P81N908J4616p708p860J842j1450n816o224j0761
11837B93334p706M181R381m403L037P146L192m138j0091P169m19n553J0697n034
11823C00793Q36K556L270J5548L0273K1169J561K4411K4485K0727K0302N0120
11811E16051N1036M8153O3607N1226P0483R0372J09303J35812J54066J93808K38059
$$ plain form
11898 101157 121285 125674 134015 134428 145545 163766 177897 193979 202877 223469 256888 307144
11886 307144 367117 446352 552822 654874 776955 898567 978125 1033370 1028065 979603 906908
11875 906908 822171 734107 649613 587234 552156 502978 456879 433447 422870 413653 410523 400819
11863 400819 385946 387077 376765 359518 355267 345467 355964 365127 350708 343397 355670 357396 346199
11850 346199 341162 332023 320006 320787 326695 341311 333603 325743 327585 316135 310319 304095 293334
11837 293334 285628 289809 299190 294787 297824 304970 308162 304024 293933 301102 300683 295130 305827 300793
11823 300793 301629 304185 307455 323003 353276 374445 376006 400417 424902 445629 465931 516051
11811 516051 567087 615240 678847 730073 800556 890928 1000231 1136043 1290109 1483917 1721976
11800A721976K96987L88146M88212N85274O97159P92198Q13084P48838N99017
11791G130891L66655P8551k26199m56619n83030o25557o13885n71776m86796m06649
11781C605586l27115k57860k29212j97830j45426j10957j13760j18569r4860p6983
11771A933014q7570r1101o8720m4937m4947l6743m4847n0243k5566q13k811q212
11759A426504k8369l1655k6621l5983k3617l2520l8319m7180m5587k8150l4367
11748A054136l4340l2383l2695m1913k7472m7275m0096k8145l7542m3342l3497
11737F55436k5195k3555k8750k9007k5802k0403j6839j8220l0615k5310j0216
11726D01524j0765k5404k0770j9494j8262k0611q490k25o256l457j4048j4996
$$ plain form
11800 1721976 2018963 2407109 2895321 3480595 4177754 4969952 5783036 6531874 7130891
11791 7130891 7497546 7576097 7349898 6893279 6310249 5684692 5070807 4499031 4012235 3605586
11781 3605586 3278471 3020611 2791399 2593569 2448143 2337186 2223426 2104857 2009997 1933014
11771 1933014 1845444 1754343 1685623 1640686 1595739 1558996 1514149 1463906 1438340 1437527 1434716 1426504
11759 1426504 1398135 1366480 1339859 1303876 1280259 1247739 1209420 1162240 1116653 1088503 1054136
11748 1054136 1019796 987413 954718 912805 885333 838058 797962 769817 732275 688933 655436
11737 655436 630241 606686 577936 548929 523127 502724 485885 467665 437050 411740 401524
11726 401524 390759 365355 344585 325091 306829 286218 277728 277503 271247 267790 253742 238746
11714B38746r317k691r407r183l332j1893r659O121J1301j7609j2645M908Q823
11701A84163K99j06j055l726j3203q737N2N081M983l752k4593j9329m122P323
11687A23278J586j7188m393J0876o815k04L516j3859K440R890p914J3155J6584
11674A30952O208J1966J562p91m303N15K85o257k647K134L804n517O739J4469
11660A59119J6250J2036K8656K0631J3496J9800K419o074m606n342l869k9079
11648B23437j4141k0437k8117m222O317j596j2531J1523M779o414J671o133k0688
11635A33448o857L382R167K508l243L35o755j1294r960j2829N635Q126o911O368
11621A11120J1806J2025o450o936L236O387o531k1880j6928j3671K957J3853M20
$$ plain form
11714 238746 229429 226738 217331 208148 204816 192923 183264 189385 200686 183077 170432 175340 184163
11701 184163 184462 184356 183301 179575 166372 157635 157687 162768 167751 163999 139406 120077 115955 123278
11687 123278 124864 107676 103283 114159 107344 107140 110656 96797 99237 109127 101213 114368 130952
11674 130952 137160 149126 150688 149897 145594 146109 146394 140137 137490 139624 143428 137911 144650 159119
11660 159119 175369 187405 216061 236692 250188 269988 272407 266333 261727 256385 252516 223437
11648 223437 209296 188859 160742 156520 162837 161241 148710 160233 165012 158598 160269 154136 133448
11635 133448 126591 129973 139140 141648 138405 138740 131985 120691 110731 97902 103537 111663 104752 111120
11621 111120 122926 134951 128501 121565 124801 131188 124657 102777 85849 72178 75135 88988 89408
11608H9408P409J3321o406k2012j478J3821J0150j321K214j220K069j771p281
11595I6903N348K6699R992j1342J4475J1031J4972O463j36j4686j0269L43r757
11582A40036j4481K868k163m005j2954l233K857J2741Q65N933k292j4413J031
11569A12790o181p291L990J1165Q860q031r690M060J4937o588k983J1213j0385
11556A15866j9487o591j1466j4561P56J2317J8043j728j4383j5216j288Q338m506
11543F6094K496Q285K869L081m636J3664j3399r624q26j899l0L325l701j4145
11529E1554K47K006o086O547O385K096o443l196q869K516J006j124n137q484P82
11514C3800o729P582Q457q152j2186k34K003N232J295N863J964L199o595n462
$$ plain form
11608 89408 96817 110138 103732 81720 80242 94063 104213 102892 105106 103886 105955 104184 96903
11595 96903 102251 128950 138942 127600 142075 153106 168078 174541 174405 159719 149450 149793 140036
11582 140036 125555 128423 126260 122255 109301 106068 108925 121666 122531 128464 126172 111759 112790
11569 112790 106609 99318 103308 114473 123333 115302 105612 109672 124609 118021 115038 126251 115866
11556 115866 96379 89788 78322 63761 64517 76834 94877 93149 78766 63550 62262 70600 66094
11543 66094 68590 76875 79744 82825 78189 91853 78454 68830 68004 66105 66075 69400 65699 51554
11529 51554 51801 53807 47721 54268 60653 62749 56306 53110 44241 46757 47763 46639 41502 33018 33800
11514 33800 27071 34653 43110 34958 22772 22538 24541 29773 31068 36931 38895 42094 35499 30037
11500C0037J4945M379J323J3516m597j488l080j6059j8237J6481K486o546K018
11487C5178L610J1792N319k127j9197k053L48o242K0701M638j2522j0182J2534
11474D1797J5873L370j2443m773n665K382K170n306m09q14J636j2672o526M8m726
11459A3942P396N917K130L698J3855r119j8012J0654J9210j003r932j5349j6702
11446F685J1633K0958J1044m683J0856J2010l735O113N816l266j0911r368o675
11433D6477l138N023L374j6908L685O562N681n28o21n548k726o457j2435q631
11419A3810q863l372J4841J3559K863R865L310l674j2448Q99J3173N968p517j122
11405D1292P469j119N302P305m826q558j0841R986J1207j153p700j4318j955Q752
$$ plain form
11500 30037 44982 49361 50684 64200 59603 58115 55035 38976 20739 37220 39706 33160 35178
11487 35178 38788 50580 55899 53772 34575 32522 32870 26628 47329 51967 39445 29263 41797
11474 41797 57670 61040 48597 43824 38159 40541 42711 37405 36996 36182 37818 25146 18620 18668 13942
11459 13942 21338 27255 29385 33083 46938 37819 19807 30461 49671 48668 38736 23387 6685
11446 6685 18318 39276 50320 45637 56493 68503 64768 70881 76697 73431 62520 53152 46477
11433 46477 43339 48362 51736 34828 38513 45075 50756 50228 49607 44059 41333 34876 22441 13810
11419 13810 4947 1575 16416 29975 32838 42703 46013 42339 29891 30790 43963 49931 42414 41292
11405 41292 48761 47642 52944 60249 55423 46865 36024 46010 57217 56064 48364 34046 32091 40843
11391D0843J683O922n99P846K284o243l688j2358J739L220N682k845j800N923
11377D8609m944n954P335J0568L150n732q76j137l032K240K2636J4913q757q773
11363G0246o388m230K892m257n954O848J026J927Q090J4895O026j1277k1523l432
11349E4889L364l298n09J8193J297J0226q672L467j3J215j493m757r003m393j460
11334E9053L153J1752l380p357K370k039p72J273o179p900Q32R667p265M063R123
11319F6394o369k72j5969J0025J2439j113k7605O371R687J1575Q392j051q362
11306F4142j460L10o392N6P823p682p577l130m322q965o799P606N959O073Q796
11291E4438J1947m717O383p1j5592N327M022m054p803P372M651J6547K784K634
$$ plain form
11391 40843 42526 49448 48849 56695 58979 52736 49048 36690 38429 41649 47331 44486 42686 48609
11377 48609 43665 37711 45046 55614 58764 53032 52156 51019 47987 50227 72863 87776 79019 70246
11363 70246 63858 59628 62520 58263 52309 59157 60183 62110 70200 85095 91121 79844 58321 54889
11349 54889 58253 54955 54446 72639 73936 84162 75490 78957 78944 80159 78666 73909 64906 60513 59053
11334 59053 62206 73958 70578 63221 65591 63552 62780 64053 57874 49974 50806 60473 53208 57271 66394
11319 66394 60025 59753 43784 53809 66248 65135 37530 43901 53588 65163 73555 72504 64142
11306 64142 62682 62992 56600 56656 64479 56797 49220 46090 41768 32803 26004 33610 39569 45642 54438
11291 54438 66385 61668 68051 67980 52388 57715 61737 57683 49880 57252 61903 78450 81234 83868
11277H3868l745J472n704j9540m710J961O918o467o802l465J3746J543Q487M447
11263G2009p500M566M26j880J1576J0549K491k679k070J2395j775l598J5100M584
11249A14194j486K827k774l491J4488q068j3550m856M632J384n965O591Q578K945
11235A15449o067m878L368J6202Q620p981J713N487k018N409L219l879n314j674
11221A27656J0374l508J1367K9093k166L156R907K0172O047R287N277P978L4965
11208B69605K6172J7613K4034L1618M2789N1078N4838Q1397Q5088J03321J36397
11197I23950J67233K06838K61948L24818M02725M62556M77074M27124K97721J08636
11187D060623r2828k41732l23179l78199l51774k99784k60136k12601j83066j36580
$$ plain form
11277 83868 80123 81595 75891 56351 51641 53602 60520 54053 47251 43786 57532 59075 67562 72009
11263 72009 64509 69075 69501 67621 79197 89746 92237 89558 87488 99883 98108 94510 109610 114194
11249 114194 112708 115535 112761 109270 123758 115690 102140 97284 101916 103300 97335 103926 112504 115449
11235 115449 109382 104504 107872 124074 132694 124713 126426 131913 129895 135304 138523 134644 129330 127656
11221 127656 138030 134522 145889 174982 172816 175972 185879 206051 212098 221385 226662 234640 269605
11208 269605 295777 313390 337424 369042 411831 462909 517747 599144 684232 787553 923950
11197 923950 1091183 1298021 1559969 1884787 2287512 2750068 3227142 3654266 3951987 4060623
11187 4060623 3967795 3726063 3402884 3024685 2672911 2373127 2112991 1900390 1717324 1580744
11177A580744j13640r0174q1869q6745o2115n8961m9991m3758l9184l8891l3757
11166H81659k7271k6244r933q691j1005m222j9264k1586j3380j0997K546k0054
11154G11558j4085j6521j0852j0895j6515q882k4037l1219j1598q09r921k3519
11142E32705l0287k0056j7932k5089l1896k6757j9788j9287j5509m637j3419j2650
11130B95398lj0332o953j2539q767N933L192o862k2246m739j739J8268k392l108
11116B43111k1763j9590l3959j6455J582P28o774J0330r7L267p630p928o970l297
11102A34555j935l670l493j1667O905J9776J909j7803n578N181J3370O718m394
11089A39874j1753k302Q29n29p914M235l264l542j2727q008M77n897P115J4781
$$ plain form
11177 1580744 1467104 1376930 1295061 1208316 1146201 1087240 1037249 993491 954307 915416 881659
11166 881659 854388 828144 818211 809520 798515 794293 775029 753443 740063 729066 731612 711558
11154 711558 697473 680952 670100 659205 642690 633808 609771 578552 566954 566145 556224 532705
11142 532705 502418 482362 464430 439341 407445 380688 360900 341613 326104 321467 308048 295398
11130 295398 295395 285063 278110 265571 256804 262737 265929 259067 236821 232082 230343 248611 246219 243111
11116 243111 221348 201758 167799 151344 152926 153654 146880 157210 157113 160380 152750 144822 137852 134555
11102 134555 132620 128950 125457 113790 120695 140471 142380 124577 118999 124180 137550 144268 139874
11089 139874 128121 125819 126648 126119 118205 122440 119176 115634 102907 94899 95376 89479 96594 111375
11075A11375k29N251l408j2077m546K393O230J0542K590l888L999q664q00q22
11061A07946J3567J644j2631m126O208N856K094o412J834P020j960q641k1037
11048I1362k271R922R341Q480K856p712n454j0073P630P341j0375k408k3N801
11034A04417R507R20N904J1164M636N082J454O466O440Q78k496q923k775k840
11020A39834L739J229l76K0L960m615J138m427L106p406j0465m059L896N69Q001
11005A34144J1016O519l90J1833L97q081n449L230j814m555L61J1175P761j93
10991A65954j1748o038J3477M511K324j493p849K133Q62J0354j671m385j416n414
10977A59601j4487j6196k341J735j214m271O391j0302o376R832j102J4807l810
$$ plain form
11075 111375 111146 116397 112989 100912 96366 98759 104989 115531 118121 114233 118232 109568 108768 107946
11061 107946 121513 123157 110526 106400 112608 118464 120558 114146 115980 123000 121040 112399 91362
11048 91362 89091 99013 108354 116834 119690 111978 106524 96451 104081 111422 101047 98639 98616 104417
11034 104417 113924 114844 120748 131912 136548 141630 143084 149550 155990 156868 154372 145449 142674 139834
11020 139834 143573 144802 144426 144446 148406 143791 144929 140502 143608 136202 125737 121678 125574 126143 134144
11005 134144 145160 151679 151289 163122 163519 155438 149989 153219 151405 146850 147211 158386 166147 165954
10991 165954 154206 148168 161645 166156 168480 166987 159138 161271 162133 172487 170816 166431 165015 159601
10977 159601 145114 128918 126577 128312 127098 122827 129218 118916 112540 122372 121270 136077 132267
10964A32267j2317J0322O659J2628Q394p934N509L839N319K852k0303j0447l922
10951A32866L090J5434N057q472j7222P065Q992M675k368M945J4699k962o365
10938A59434n361j1901k8786r939j266K4109K3963J5896L241N821J7337J2234
10926B04782L534o757q153L680P456L894q427K17J5024L329n517J138K880J9889
10912B36969K1898L7296M1982M0438N7589Q9557J16080J32933J88047K59435L00409
10901A522633K75360J89864N1408j12305k23663k48221k23782j94964j51589j07073
10891G77668o9134m0491k6324l0755m0499j4981q721J402o558J2105K2156j010
10879E74858Q963J4278L880K567J007p473R248q500j0453k095j7080k8339k2629
$$ plain form
10964 132267 119950 130272 136931 149559 157953 150019 155528 159367 164686 167538 147235 136788 132866
10951 132866 135956 151390 156447 147975 130753 137818 146810 151485 149117 154062 168761 165799 159434
10938 159434 154073 142172 113386 103447 102181 126290 150253 166149 169390 175211 192548 204782
10926 204782 208316 201559 193406 197086 204542 208436 200009 200226 215250 218579 213062 214200 217080 236969
10912 236969 258867 296163 338145 378583 436172 525729 641809 774742 962789 1222224 1522633
10901 1522633 1797993 1987857 2039265 1926960 1703297 1455076 1231294 1036330 884741 777668
10891 777668 708534 668043 641719 610964 570465 555484 546763 548165 541607 553712 575868 574858
10879 574858 583821 598099 601979 604546 605553 598080 607328 598828 588375 586280 569200 540861 518232
10866E18232k6758k1378n789j2566r443j6178k7803q995q353j8172j7735n426
10854C39636p01j3790j4206j8889k5254l107l110R295K0661J229q337j0909r18
10841B71600N540K738J871J381J1860J3925K496J5007J7064K0116J697J9584K9183
10828D14062L4074M1230O2955P7194Q7630Q8131J18049J58645K06709K42390K59908
10817A790977K12537Q0017o9255j76021j96325j83753j49220j23536r2314p4247
10807A018860p8098o9785n8649n0441m9425m5388m0920l8903k1147k5213j3502
10796E27389K897O597K388P760j1706k531J6178M995K809M561K6662J7623N72
10783F06194J730O816j4574j6990q416m756j3294k5214k1165o117m84o302Q811
$$ plain form
10866 518232 491474 470096 464307 451741 442298 426120 398317 389322 380969 362797 345062 339636
10854 339636 338935 325145 310939 292050 266796 263689 260579 269874 290535 291764 283427 272518 271600
10841 271600 277140 279878 281749 283130 294990 308915 311411 326418 343482 363598 365295 384879 414062
10828 414062 448136 489366 552321 629515 717145 805276 923325 1081970 1288679 1531069 1790977
10817 1790977 2003514 2083531 2014276 1838255 1641930 1458177 1308957 1185421 1093107 1018860
10807 1018860 940762 870977 812328 761887 712462 667074 626154 587251 566104 540891 527389
10796 527389 530286 536883 539271 547031 535325 532794 548972 553967 556776 561337 587999 605622 606194
10783 606194 607924 614740 600166 583176 574760 570004 556710 531496 510331 504214 503730 497428 506239
10770E06239J900j4364k7121j5575p866r970p635j352L611k522L885k055m06P080
10756D33849K4403L2035M9958N6616N9849P2423Q5965P9411O6798L0820J872k8845
10744I65154n7558o7855o7190p4168n8620m9040m2183l5920l5809m1698l2312
10733D02801j5546j8079K966M683R83m062j1738q960J974m798R03L733J1192R235
10719C75287N981N511J970J0263P634J578K141N229q769k2397k0737p102N103
10706C61692k779m257r551n710j1970j4138j0268J4725J1236j1826O10J4224j0599
10693C21389M948J8895R066j0647n442m776k349r470M045j251o696j5848q116
10680B93748M025R325L749J4414J9810K3563K7129J9448J7462K8718K3511m677
$$ plain form
10770 506239 508139 493775 466654 451079 443213 433243 425608 424256 427867 425345 429230 427175 426769 433849
10756 433849 458252 490287 540245 596861 656710 729133 815098 894509 961307 992127 993999 965154
10744 965154 907596 839741 772551 698383 639763 590723 548540 512620 476811 435113 402801
10733 402801 387255 369176 372142 376825 377808 373746 362008 353048 355022 350224 351127 354860 366052 375287
10719 375287 381268 386779 388749 399012 406646 408224 410365 415594 406825 384428 363691 356589 361692
10706 361692 358913 354656 345105 339395 327425 313287 303019 317744 328980 317154 317764 331988 321389
10693 321389 326337 345232 354298 343651 338209 333433 331084 321614 325659 324408 317712 301864 293748
10680 293748 297773 307098 310847 325261 345071 368634 395763 415211 432673 461391 484902 480225
10668D80225q760J2392k019K4963L3012J9614K5435K2177L9827N5857O0572O6395
10656H29690R2955R5124P5924L7064N084j1897k0603l7665m1330m3010m0089n0188
10644H91059l1730m7489l7054l4687l2056k3941l2176j3766J393J4061K6863K3041
10632G03518L1474L2025K6714N2781Q2321J03070J03173R9700J27107J34624J30505
10621A627012J10271O4483l3093q9856j39264j61617j35607j14357q9212p5164
10611I63596o1381m2342l5721m3069m6839m2007k5901k9681k0142P96J0984K1068
10599F49361J6775N956j631N79L3882M3579O0830N0284O0787N3998M9759N0597
10587A074756M5372K7169J9925L2042L9027K8151K1463L8984N6856O1843P3374
$$ plain form
10668 480225 471465 483857 481838 506801 539813 559427 584862 607039 646866 702723 763295 829690
10656 829690 922645 1017769 1093693 1130757 1135841 1123944 1103341 1065676 1024346 981336 941247 891059
10644 891059 859329 811840 774786 740099 708043 684102 651926 638160 639553 653614 680477 703518
10632 703518 734992 767017 793731 846512 928833 1031903 1135076 1234776 1361883 1496507 1627012
10621 1627012 1737283 1801766 1768673 1678817 1539553 1377936 1242329 1127972 1038760 963596
10611 963596 902215 859873 824152 781083 734244 692237 666336 636655 616513 617309 628293 649361
10599 649361 666136 672092 670461 671040 704922 748501 809331 859615 920402 974400 1024159 1074756
10587 1074756 1120128 1147297 1167222 1199264 1238291 1266442 1287905 1326889 1383745 1445588 1518962
10576A518962O6516O0962N7098N4317M0628K6882L5519K6858J7496K1655M7588
10565A974481M7316M1381L9014M4644M2950K9132K1086K5997L3094M6803M1295
10554B387193M5483N5390O6717P3289P8917P9751N1074K8609L2768J202J6641
10543B917034M4752M7357N8864O9404Q4508J06618J07244J20060J34366J35519
10533C825726J37579J41566J76120K00001K12401K01185J87609J95481J42530
10524E420198R1308O7993R5567J57740K39721L06670L87005M96276O11058O91177
10514H564713P14455O81216O10558N82144O61399Q68649J178200J571643K123047
10505A7556024K872833L903718N292453P120916R495783J2689391J7151999K3495263
$$ plain form
10576 1518962 1585478 1646440 1703538 1757855 1798483 1825365 1860884 1887742 1905238 1926893 1974481
10565 1974481 2021797 2063178 2102192 2146836 2189786 2218918 2240004 2266001 2299095 2345898 2387193
10554 2387193 2432676 2488066 2554783 2628072 2706989 2786740 2837814 2866423 2899191 2900393 2917034
10543 2917034 2961786 3009143 3068007 3137411 3221919 3328537 3435781 3555841 3690207 3825726
10533 3825726 3963305 4104871 4280991 4480992 4693393 4894578 5082187 5277668 5420198
10524 5420198 5511506 5579499 5675066 5832806 6072527 6379197 6766202 7262478 7873536 8564713
10514 8564713 9279168 9960384 10570942 11153086 11814485 12683134 13861334 15432977 17556024
10505 17556024 20428857 24332575 29625028 36745944 46241727 58931118 76083117 99578380
10497I9578380L2166823M2664354N2049567N4933410M5394429K2508252o475418
10490C42819797l0582485m2891438m4335943l8746956l0750302k3117015j7025406
10483A15370252j2642707r700115p732620o314346n265915m395970l691957l093868
10475F2532754k589809k176144j778403j462873j208109j028160r79922r72002
10467E0337332r16337p88943n87208l39744j25491l0888j32114n08197r33569
10458D5974841j226380j331932j287808j144740r92929r04208r11677j076608
10450C7098559j309758j483504j542745j527802j466416j392112j294541j214744
10442B5866937j134603j065123r82917r20989q81872q08429p49005o78642o17094
$$ plain form
10497 99578380 131745203 174409557 226459124 281392534 326786963 349295215 342819797
10490 342819797 312237312 269345874 225009931 186262975 155512673 132395658 115370252
10483 115370252 102727545 93027430 85294810 78980464 73714549 69318579 65626622 62532754
10475 62532754 59942945 57766801 55988398 54525525 53317416 52289256 51309334 50337332
10467 50337332 49420995 48632052 48044844 47705100 47579609 47548721 47416607 46908410 45974841
10458 45974841 44748461 43416529 42128721 40983981 39991052 39086844 38175167 37098559
10450 37098559 35788801 34305297 32762552 31234750 29768334 28376222 27081681 25866937
10442 25866937 24732334 23667211 22684294 21763305 20881433 20073004 19323999 18645357 18028263
10433A8028263n35122m84395m40148m02074l42728k81984k19103j33931o8150
10424A5120628J1706Q9085J89903L08827M42195N62420O78418P72513Q39443R42325
10414A9957463J164868J545408K112168K870660L930906N373062P334106R904610
10406E4193251J3169049J7253542K2421517K9024862L7176522M6032297N1882624
10399B71153664M7532284K8088819j118572k7179500m0734577m2660663l8014398
10392A97067057l0888219k3858184j8069791j3700016j0579497q394161o810580
10385H4766609n604723m654825l873957l249287k751411k387369k131798j978378
10377E8134861j837444j668748j456571j211055r62347p23099m87587k74889q2978
$$ plain form
10433 18028263 17493141 17008746 16568598 16166524 15823796 15541812 15322709 15188778 15120628
10424 15120628 15132334 15221419 15411322 15720149 16162344 16724764 17403182 18175695 19015138 19957463
10414 19957463 21122331 22667739 24779907 27650567 31581473 36954535 44288641 54193251
10406 54193251 67362300 84615842 107037359 136062221 173238743 219271040 271153664
10399 271153664 318685948 346774767 345656195 318476695 277742118 235081455 197067057
10392 197067057 166178838 142320654 124250863 110550847 99971350 91577189 84766609
10385 84766609 79161886 74507061 70633104 67383817 64632406 62245037 60113239 58134861
10377 58134861 56297417 54628669 53172098 51961043 50998696 50275597 49788010 49513121 49430143
10368D9430143K8551r4820n10272j036535j418862j560653j546571j446788j300925
10359D0543268j158616j109200j224749j446821j618357j672053j658157j592079
10351B9063236j525129j451885j365271j298905j213710j158079j089604j041789
10343A8918864r82407r22674q59763p91823p17692o56811n96101n54967n32021
10334A2304605n29442n33933n26866n08459m90677m55692m06279l72120l58629
10325H122508l39820l20714k95080k87179k85166k78520k71957k36700k31159
10316E576213k15849k11404k11951j93696j76347j48371j13288j03993j13062
10307D088252j24295j26677j40473j37456j26757j15475j02090r8825j06611j07140
$$ plain form
10368 49430143 49458694 49363874 48853602 47817067 46398205 44837552 43290981 41844193 40543268
10359 40543268 39384652 38275452 37050703 35603882 33985525 32313472 30655315 29063236
10351 29063236 27538107 26086222 24720951 23422046 22208336 21050257 19960653 18918864
10343 18918864 17936457 17013783 16154020 15362197 14644505 13987694 13391593 12836626 12304605
10334 12304605 11775163 11241230 10714364 10205905 9715228 9259536 8853257 8481137 8122508
10325 8122508 7782688 7461974 7166894 6879715 6594549 6316029 6044072 5807372 5576213
10316 5576213 5360364 5148960 4937009 4743313 4566966 4418595 4305307 4201314 4088252
10307 4088252 3963957 3837280 3696807 3559351 3432594 3317119 3215029 3116204 3009593 2902453
10297B902453j02239r2525o9365o1590n7393n8822n1836m9290o4306o5271m1391
10286B188425k2532k3909q780K2347L0356N9132Q1965J02192J14101J40042J76069
10275B859408J93679J66931P3011o0883j89240k60880k79636k63310k48808k00723
10265A789549j68846j45651j30870j14007q3092o1136n1752n7717n7135l9061
10255H80282l3391l4213k3991p984k1644n3895o1368l1650N218O374r591j014
10243F13133J3433L2253N2570M8177L0506L1598J3198r52p205P495R120J4957
10231H58283P188P504M708J0553J965j2554k226Q333J3495M830j191m437l466
10218H92985q249j3411n526N176K0081K8042J5884N718q7r118p849m271o932p904
$$ plain form
10297 2902453 2800214 2707689 2638324 2576734 2519341 2460519 2408683 2359393 2295087 2229816 2188425
10286 2188425 2165893 2141984 2133204 2155551 2185907 2245039 2327004 2429196 2543297 2683339 2859408
10275 2859408 3053087 3220018 3293029 3232146 3042906 2782026 2502390 2239080 1990272 1789549
10265 1789549 1620703 1475052 1344182 1230175 1147083 1085947 1034195 976478 919343 880282
10255 880282 846891 812678 788687 780703 759059 705164 643796 612146 617364 623738 614147 613133
10243 613133 626566 658819 711389 759566 790072 821670 834868 833916 826711 834206 843326 858283
10231 858283 865471 872975 877683 888236 890201 877647 875421 883754 897249 902079 900888 896451 892985
10218 892985 884736 871325 865799 870975 891056 919098 934982 940700 940613 931495 923646 919375 912443 904539
10204I04539M741J5399J2989K0320N173J1078K584q513j6755o207k0741N482J8296
10191I48385j4823j1990r979j9319j8604j5989j5997l4232k8347j6770j1205j2823
10179G38307l0070l5494k9812k4449J513j1264p111n512j0104o488m188n081j676
10166E68571n744j3885r247Q735m735n00J4507k39p154l611j2910m803K5J4937
10152E43947L919M87K1511K594K57L826O914J4454O070j7156k5407k3664k5187
10139E12565k0682l1085l4855k8225r899j4491p576l832r970j2000q216o07n83
10126C30544o721J2177L5239L6637N4965O5073Q7810R0364R2195Q5422K8538m9914
10114H62329q3310p4579o5916p2353o9863m4677k9094k1624j8356k0213j0017
$$ plain form
10204 904539 909280 924679 937668 957988 963161 974239 976823 968310 951555 945348 924607 930089 948385
10191 948385 933562 921572 911593 892274 873670 857681 841684 807452 779105 762335 751130 738307
10179 738307 708237 672743 642931 618482 619995 608731 601620 596108 586004 579516 575328 570247 568571
10166 568571 562827 548942 539695 548430 543695 543195 557702 557463 550309 546698 533788 528985 529010 543947
10152 543947 547866 548353 569864 572458 572715 576541 583455 597909 603979 586823 561416 537752 512565
10139 512565 491883 460798 425943 397718 387819 373328 365752 361920 351950 339950 331734 331127 330544
10126 330544 323823 336000 371239 407876 462841 527914 615724 706088 798283 883705 912243 862329
10114 862329 779019 704440 638524 566171 496308 451631 422537 400913 382557 362344 352327
10103C52327n52r653O306n743L727j0038K040J0526J5924K6786P786Q429L719
10090D11584J3655K3230M7339N5699P0867J06994J50110K05462K72304K92410
10080A649654K69534J75761J5370j44494k16670k26040k15687j70336j31825r0932
10070I14335n9483n7587o1050m0892k7945l2621l5245j7324j8712j7005j6624
10059E29847j2000o548K477K820j241J3235M693j0J5029m689O012p31j4746j6257
10045E17891j1026q613j5413j1003n719m799q552j1073n580j1215j4137n794r446
10032C95521N724n044o474l128L44L58k0735k8688R32J4601m89k177j313qK619
10017C52043J0276J923L321O279r798k0836N613O151M539n997j4723j6417j4454
$$ plain form
10103 352327 351775 342122 348428 342685 346412 336374 338414 348940 364864 391650 399436 407865 411584
10090 411584 425239 448469 495808 551507 622374 729368 879478 1084940 1357244 1649654
10080 1649654 1919188 2094949 2110319 1965825 1749155 1523115 1307428 1137092 1005267 914335
10070 914335 854852 797265 736215 695323 667378 634757 599512 582188 563476 546471 529847
10059 529847 517847 511299 513776 516596 515355 528590 533283 533273 548302 543613 549625 548894 534148 517891
10045 517891 506865 498252 482839 471836 466117 461318 452766 441693 436113 424898 410761 404967 395521
10032 395521 401245 396201 389727 386599 386943 387301 366566 337878 338810 353411 352922 350745 349432 349424 352043
10017 352043 362319 364242 367563 373842 364044 343208 348821 354972 359511 353514 338791 322374 307920
10004C07920k099N483r0R98l7M048k941n570N604R516O827o666J3079K4135J9833
9989C80040L3192K0183P0K105Q554N690K1548N1064N4836O7668J15153J53415
9977I13518J98485K40237K71492K52794J39965j0513j42334k18425k16959j90104
9967A238156j52339j27108r3966m6965k9260l5135k2824o391R415l834J257M700
9955G35706J030K195Q98j082M613J1234J2933L0161M1617L8520K5415M2523O2536
9942A008299P0328P3843R7870J06259J22461J64010J89114K27704K98665M04157
9932B762710N18211O69896Q39355J047077J282034J470698J551829J401918R87098
9923A2530826L38373l30639q53944j163412j247964j163588j001242q25783o72665
$$ plain form
10004 307920 305821 311304 311214 312212 312175 316223 313282 307712 313316 322832 329659 322993 336072 360207 380040
9989 380040 413232 433415 433485 435590 444144 449834 471382 522446 577282 644950 760103 913518
9977 913518 1112003 1352240 1623732 1876526 2016491 2005978 1863644 1645219 1428260 1238156
9967 1238156 1085817 958709 864743 817778 788518 753383 730559 724168 733583 729749 731006 735706
9955 735706 736736 738931 739829 738747 743360 754594 767527 797688 839305 877825 903240 945763 1008299
9942 1008299 1078627 1152470 1250340 1356599 1479060 1643070 1832184 2059888 2358553 2762710
9932 2762710 3280921 3950817 4790172 5837249 7119283 8589981 10141810 11543728 12530826
9923 12530826 12869199 12538560 11684616 10521204 9273240 8109652 7108410 6282627 5609962
9914E609962n37498m27660l52371k84963k37603k10523j72721j53070j40740j30854
9904B961959j26054j08838q9401n6750n5655p5982p1252m0340l2271l3929k1991
9893B249496k2625k2446l0728n0609o0599o6450p2928n3348l9255k9004l8966
9882A762538n5993o1106o2417o5583o1594o3502o1648n8031n4029o4070n8874
9871A095691n2270n3813n3957m8259k3969k8321l7335l8230l1073l6480k5108
9860F66876l3130k4803j0578k8192l0530j7084m761j6438L275m281q670j9851
9848D71833l2146j1258j784L465q761J4462R497K1052K9174N1049O7070R1386
9836G05039J37374K04573K94948M10040N63910O92565O24705L08468j25006m70895
$$ plain form
9914 5609962 5072464 4644804 4292433 4007470 3769867 3559344 3386623 3233553 3092813 2961959
9904 2961959 2835905 2727067 2637666 2580916 2525261 2449279 2378027 2337687 2305416 2271487 2249496
9893 2249496 2226871 2204425 2173697 2123088 2062489 1996039 1923111 1869763 1830508 1801504 1762538
9882 1762538 1706545 1645439 1583022 1517439 1455845 1392343 1330695 1272664 1218635 1154565 1095691
9871 1095691 1043421 989608 935651 887392 863423 835102 797767 759537 728464 691984 666876
9860 666876 633746 608943 598365 570173 539643 522559 517798 501360 504635 500354 491684 471833
9848 471833 439687 428429 426645 430110 421349 435811 445308 466360 495534 546583 613653 705039
9836 705039 842413 1046986 1341934 1751974 2315884 3008449 3633154 3941622 3816616 3345721
9826C345721n65843n22105m22290l12715k09542j57364j31682q2609p7804n9489
9816H04278l4720l7690l9310k8834k3521p777j1014m503K79j1419p786J266j6026
9803E83223K159N666R248L453Q030q634k5629j2125o487l0347l6160k1966j6405
9790D54026r885K078P072m884k0080j6359q920p666k7901l0575j3391k3851k3304
9777B76360k0339k3133j1652K284M230j2070m157q212r785j2860J369p522p071
9764A67442r905K807j036j1191j393o587J0261j305o221n131N901R467o38j047
9750A51424o489j605j2516j0879K754J0088J173m289j6463m195j1272j0090P315
9737I4956k19J1255L141J3370q181q502K654P240k466j0250o754n962l236q200
$$ plain form
9826 3345721 2779878 2257773 1835483 1522768 1313226 1155862 1024180 941571 863767 804278
9816 804278 769558 731868 692558 663724 640203 632426 621412 616909 617188 605769 597983 599249 583223
9803 583223 585382 591048 600296 603749 611779 603145 577516 565391 558904 528557 492397 470431 454026
9790 454026 444141 446219 453291 448407 428327 411968 403048 395382 367481 336906 323515 299664 276360
9777 276360 256021 232888 221236 223520 227750 215680 211523 203311 193526 180666 182035 174513 167442
9764 167442 157537 160344 159308 148117 146724 140137 150398 149093 142872 137741 143642 153109 152471 151424
9750 151424 144935 143330 130814 119935 122689 132777 133950 129661 113198 109003 97731 87641 94956
9737 94956 94737 105992 109133 122503 114322 105820 108474 115714 113248 102998 96244 90282 87046 78846
9723G8846J582l597l864Q56O006O37l296Q236j927n412n515J0718J8993J3678
9709A15941O67J1988K0826K2583K6376K5142J4800K3769J3499N05O808Q137J731
9696B92772j8849l1919k6295j6512j6881l613j03j06P129q292j9759J839J353
9683A60764m910K725m45j2536K340p161j1909l208q477j4467j127J2570J987r488
9669A06658l366k6990j5067m66P226J0638R359K233R579j933k320M532j000m380
9655I4703l857m342q238j10N114q990j0544n435m120J64Q126L433p913L296l796
9640E7491k4196p270M686L796P624J3651m102j0231p500K470l347R228P205j0093
9626C9412j0007N55R691q875N987M457j0728R923j3645m452J2816J75M271p214
$$ plain form
9723 78846 80428 76831 72967 73823 79829 80466 77170 85406 83479 78067 72552 83270 102263 115941
9709 115941 116608 128596 149422 172005 198381 223523 238323 262092 275591 276096 282904 291041 292772
9696 292772 273923 242004 215709 199197 182316 178703 178600 178494 185623 177331 157572 159411 160764
9683 160764 155854 158579 158134 145598 147938 140777 128868 125660 117183 102716 101589 114159 116146 106658
9669 106658 103292 76302 61235 60769 67995 78633 87992 90225 99804 97871 95551 100083 99083 94703
9655 94703 90846 86504 78266 78156 83270 74280 63736 58301 54181 54345 62471 65904 57991 61287 57491
9640 57491 33295 26025 30711 34507 42131 55782 51680 41449 33949 36419 33072 42300 49505 39412
9626 39412 29405 29960 39651 30776 36763 41220 30492 40415 26770 22318 35134 35309 39580 32366
9612C2366j1843J577l132r884K720k041K005L788l474R487L181N798m942P111
9598C2717J2670m313m54k236j2166j9520r084J9233J5132j250L572k180r835j336
9584B0950P096j4643j602J2896q603M806L351O777J066j5204o337m715O69j918
9570D589O513M370K800j277o600K0219P212K516O562j0543j7936q406K560J0754
9556B3333q257j2565j450P760J0481J0018j2065j185j885k091j516j3738j4067
9543a7227N230M777J7521R572O283P158J0173R509K052j1244j5777M081j735q80
9529B9493n93Q378q664o583l131k247K655O320M124O141P598q377k0082j7244
9515b212P71R948K3275j431j1164Q447J1139J1208l86j2399j939k360K123J7798
$$ plain form
9612 32366 20523 22100 18968 9084 11804 9763 11768 15556 12082 21569 24750 30548 25606 32717
9598 32717 45387 41074 40620 38384 26218 6698 -2386 16847 31979 30729 34301 32121 22286 20950
9584 20950 28046 13403 11801 24697 16094 20900 24251 31028 32094 16890 10553 5838 6507 4589
9570 4589 11102 15472 18272 16995 10395 30614 37826 40342 46904 36361 18425 10019 12579 23333
9556 23333 15076 2511 1061 8821 19302 29320 17255 16070 14185 12094 10578 -3160 -17227
9543 -17227 -11997 -7220 10301 19873 26156 33314 43487 52996 55048 43804 28027 32108 30373 29493
9529 29493 28900 37278 28614 22031 18900 16653 19308 25628 29752 35893 43491 35114 15032 -2212
9515 -2212 -1441 8507 31782 30351 19187 27634 38773 49981 49595 37196 35257 32897 35020 52818
9501E2818J3369J0388J4945K3278j0697k0424j2363r076k981j1230j546M276j083
9488D9674l142M331p78m770m224O7N324K339n471m539j1804j853P947R03o929
9473B7075K605n906k99l11p00L07M481J0485k195L571l814M849k741j1162j6163
9458A0082m170j001P165M156Q763K982O032J9996K995r141l101n510p254o804
9444B5190J7568m439L532j0670j3440J3949N693o592K388o675j212J0636J100
9431C7028j056q218K754M265j0355k227K837M350Q059l354j590r05Q323N197J1851
9416E6959k318j3110L572R67M8q105q784j1960P23l65m718J569K745J0668O241
9401C4132J651j2487K447N552k036l746J127j1441Q024p314J739k114m201n84
$$ plain form
9501 52818 66187 76575 91520 114798 104101 83677 71314 62238 59257 48027 46481 50757 49674
9488 49674 46532 50863 50085 45315 41091 41158 46482 48821 43350 38811 27007 25154 33101 34004 27075
9473 27075 29680 23774 23475 23164 22464 22771 27252 37737 35542 39113 35299 40148 37407 26245 10082
9458 10082 5912 4911 12076 16232 24995 27977 34009 54005 57000 47859 44758 39248 31994 25190
9444 25190 42758 38319 41851 31181 17741 31690 37383 30791 33179 26504 25292 35928 37028
9431 37028 35972 27754 30508 34773 24418 22191 25028 29378 37437 34083 32493 31588 39911 45108 56959
9416 56959 54641 41531 45103 46070 46118 38013 29229 17269 17992 17627 12909 14478 17223 27891 34132
9401 34132 35783 23296 25743 31295 29259 25513 26640 15199 23223 15909 17648 15534 11333 10749
9387A0749J405J3842L353P050J4175M37j0558n839j5934K798J3189N191q019o005
9373B5834r100Q86P035p711O083P089O349L560r878l602k2799n574J8321J6215
9359C2708M267j504m939m10k520M1M5j852J387o012P020J5104p171j3924o286
9344A5954k526N787J1193R239J8118J0028P684R588j3336j935O182K1677m24j5764
9330H1465m670J2416K16r64q444k1054k3927M353J3248J604q245l892J377J7353
9316F0836M535j411J42p398p677o944k902J7277k372m085L434p54j0282j4164
9302B8235n75J4629J3117j7091m546j970K877P899j629N739J0621p264M569N21
9288E5132L576n495K179N178J5849J4256j478o258l778p53J688r31J2889k571
$$ plain form
9387 10749 12154 25996 29349 36399 50574 51011 40453 34614 18680 21478 34667 39858 31839 25834
9373 25834 16734 17620 24655 16944 23027 30116 36465 40025 30147 26545 3746 -1828 16493 32708
9359 32708 36975 35471 30532 30122 27602 27643 27688 25836 27223 21211 28231 43335 36164 22240 15954
9344 15954 13428 19215 30408 39647 57765 67793 75477 85065 71729 69794 75976 97653 97229 81465
9330 81465 76795 89211 89427 88463 80019 58965 35038 39391 52639 54243 45998 42106 43483 60836
9316 60836 65371 63960 64102 56704 49027 42083 39181 56458 54086 50001 53435 52681 42399 28235
9302 28235 27660 42289 55406 38315 33769 31799 34676 42575 40946 46685 57306 50042 54611 55132
9288 55132 58708 53213 55392 60570 76419 90675 89197 82939 79161 78408 80096 79165 92054 89483
9274H9483n544J1934n937J0474K1246P314j1260j353j0387K067Q441O36n725m369
9260A07020j2804p399j638J432R382p358r686J311o435l900J5642m434j2752O941
9246G5322J422k138K062j408j0568J70O538n394J2279Q787q344q451J3912J204
9232H5393J364J1949J1510J044K377n869m679o183j0434j031k505j409j537j3010
9218F6980k583N596Q521R35q504J5906Q281q635n876J1397P877K416q922q086
9204H5303m342J237o181n728J4429O663M119Q21R263N823l135l111P00P025q576
9189A04310K54J7760K545j2472r874K076J5250L45L96p43p766O072M151j066j8887
9174A02351k96k40p432K0594J3012N342o207j2743L47L167O119Q637J3066m73
$$ plain form
9274 89483 83939 95873 89936 100410 121656 128970 117710 116357 105970 108037 116478 117114 111389 107020
9260 107020 94216 86817 85179 86611 95993 88635 78949 80260 73825 69925 85567 81133 68381 75322
9246 75322 76744 74606 76668 75260 64692 64862 71400 66006 78285 87072 78728 70277 84189 85393
9232 85393 86757 98706 110216 111260 113637 107768 103089 96906 86472 85441 82936 81527 79990 66980
9218 66980 64397 69993 78514 79449 70945 86851 95132 86497 80621 92018 99895 102311 93389 85303
9204 85303 80961 82198 76017 70289 84718 91381 95500 96321 105584 111407 108272 105161 105861 112886 104310
9189 104310 104564 122324 124869 112397 102523 104599 119849 120194 120590 119847 112081 118153 122304 121238 102351
9174 102351 102055 101815 94383 114977 127989 133331 127124 114381 114728 117895 124014 132651 145717 145244
9160A45244J3222Q132J0082n78m849K599j433J739J3617k643r302j6511l644L616
9146A59291Q81P345p301o732j124P918P195L824J2673m87k28j2906q715L09l566
9131A58377K479k225p875P00J448N399N363J0973J945J0477J3977J2291J1990
9118B25319m588o163j1845o993O45m400M018M756j4361o273l988k953R067O944
9104A89185J87n837r703o234M002J2361P763Ql453o839J514J2744N741j0695n812
9089A84932m489J2120O689k13R708J2982M036k218K842o244k2203N228L583o506
9075B00247j9527r277Q783N443m319n898P923o762R83q091n912n714j707J2730
9061A68902J838Q445n015k875j32p366m434M469O169p58m016j195N5m317q143
$$ plain form
9160 145244 158466 166598 176680 176102 171253 173852 172419 174158 187775 185132 175830 159319 155675 159291
9146 159291 160172 167517 160216 153484 152360 160278 167473 171297 183970 183483 183255 170349 161634 161943 158377
9131 158377 160856 158631 150756 151456 152904 158303 163666 174639 176584 187061 201038 213329 225319
9118 225319 220731 214568 202723 195730 196375 191975 195993 200749 186388 180115 176127 173174 182241 189185
9104 189185 189372 183535 173832 167598 171600 183961 191724 191732 188279 181440 182954 195698 201439 190744 184932
9089 184932 180443 192563 199252 199039 208747 221729 225765 223547 226389 220145 197942 203170 206753 200247
9075 200247 180720 171443 180226 185669 181350 175452 183375 176613 177596 169505 163593 157879 156172 168902
9061 168902 170740 179185 174170 171295 171163 163797 159363 163832 170001 169243 165227 164032 164087 159770 151627
9046A51627k425r45K033O723J9807O555p665M583R303j0225J2q10j0171j1108
9032A57294j1579Q805K350N716K59n11k903M307r256j2975p432j0243j3146o403
9018A04283M860n73J347P272J3572J2800J1318J0175L039j6682j7474j1065p867
9005A15005r126L373R167j7922o430K762J1299J2124J7040O847j306K50N907O303
8991A55293p582P092p069l163k143j6858J47J1499j058j712j0733o944K027j1153
8977A07643m573M123J277J694jQ478J516l69j198j2785J3091J7934m406j1330
8963A21094n633J3168O042N678j014j1042j0813L519K15K207R749M000p615j7037
8949A12518k3409K483J1898O560J3596M189j0718n851J1617J8961r02L76j4669
$$ plain form
9046 151627 149202 148257 150290 157013 176820 183375 175710 180293 189596 179371 179383 178573 168402 157294
9032 157294 145715 154520 156870 162586 162845 162334 159431 163738 154482 141507 134075 123832 110686 104283
9018 104283 109143 108570 109917 117189 130761 143561 154879 165054 168093 151411 133937 122872 115005
9005 115005 105879 109252 118419 100497 94067 96829 108128 120252 137292 144139 142833 143083 148990 155293
8991 155293 147711 154803 147734 144571 142428 125570 125717 137216 136158 134446 123713 116769 118796 107643
8977 107643 103070 107193 108470 110164 110163 118641 120157 119788 118590 105805 118896 136830 132424 121094
8963 121094 115461 128629 134671 140349 139335 128293 117480 120999 121214 123421 133170 137170 129555 112518
8949 112518 89109 91592 103490 110050 123646 127835 117117 111266 122883 141844 140942 141318 126649
8936A26649k6J1922O966l051P650m168O748K1013K2644O401M334n301j2133j1910
8922A77738n102j0155l029r502k949p336J1667L632M700L872J7957J3669l042
8909A92120q054K038j233m745M544M23K652j3704m414n503n906o640j7488j3851
8895A20239R93O124R720M919J6652m600k3698j5403O789K4239K10j8152k971K3204
8881A48265M197K10R558n487o657K87O083J7020O792J2025J4786J9755K0083L3626
8867B80543M4546L9478L2235Q380j2823j6528l4927l8476l9553k4344j6357p803
8855B14371k837p626K595j1715n651O592r096k2555n401P474Q577j70n533m693
8841A64332P64q469J301n340L918J50n361p541p138k067o43l495l797J4243l099
$$ plain form
8936 126649 126623 138545 145511 142460 150110 145942 152690 173703 196347 202748 207082 201781 189648 177738
8922 177738 172636 162481 159452 149950 147001 139665 151332 154964 159664 163536 181493 195162 192120
8909 192120 184066 186104 184871 180126 184670 185093 187745 174041 169627 164124 158218 151578 134090 120239
8895 120239 121232 127356 137076 141995 158647 154047 130349 114946 121735 145974 146184 128032 125061 148265
8881 148265 152462 152672 162230 156743 150086 150373 156456 173476 180268 192293 207079 226834 246917 280543
8867 280543 325089 364567 396802 405182 392359 375831 340904 302428 262875 238531 222174 214371
8855 214371 211534 203908 206503 194788 189137 195729 186633 164078 158677 166151 174728 174558 169025 164332
8841 164332 165096 156627 157928 152588 156506 156656 151295 143754 136616 134549 133906 130411 126614 140857 137758
8826A37758K927N502j953K178P946j0240q878O489J308m672L220m545K620K4082
8812A63742o025j2606j0787n427q527Q282J1035J161q15l028l530q406J0946P014
8798A43029q031L088L243P862M243R314R961j4024k694m659J0000n473R172K958
8784A67989o537j306K911j3572j741O345k393k0229m641N137R290Q74q36J274
8770A42565L513Q73q767n974N520J8317J8466J1680Q593L866N389k966l554k420
8756A95101j742j6309M620j168J2304J9841K594J0922K0800K032m362o96J745
8743B45682j3660Q242J2353L109j2304l636J9623K7272K6229K0599K6899K5620
8731C86028J21j7093j0864p87p817o031J5479pN939K1473K2808Q626J5l203M520
$$ plain form
8826 137758 140685 146187 144234 146412 154358 144118 135240 141729 143037 138365 141585 137040 139660 163742
8812 163742 157717 145111 134324 128897 120370 128652 139687 140848 140033 137005 133475 125069 136015 143029
8798 143029 134998 138086 141329 149191 153434 162748 172709 158685 155991 151332 161332 155859 165031 167989
8784 167989 161452 160146 163057 149485 147744 154089 151696 131467 126826 131963 141253 142127 141291 142565
8770 142565 146078 146951 138184 132210 137730 156047 174513 186193 194786 198652 204041 201075 197521 195101
8756 195101 193359 177050 181670 180502 192806 212647 215241 226163 246963 248995 244633 243937 245682
8743 245682 232022 240264 252617 255726 243422 239786 259409 286681 312910 333509 360408 386028
8731 386028 386149 369056 358192 357405 349588 343557 359036 359029 364968 386441 409249 417875 417890 414687 419207
8716D19207j0055p509R225n921k1280p820J2540L289r17J8816J6186M553l765
8703D26549o00j9602j079P155P751M184N900j388K461J9313J7730J4061K6240
8690E08675O697p564q433n297k0351j0560j3419p360j3352p093P906L0816J9702
8677D80367j340M140K347p195q951L52K547K688Q177O473K118M109J0378J5461
8663E21671J597M465K8J658p544R340K2664J5477L780k851r085Q145K1884J3152
8649F04381K4872J5649J0468J3576Q505L119L50K3098N0755M4110L8072O0556
8637H97511P3484N3837P3136J05380J48056J82713J54692P9609l5453j28362j35536
8626A469067j13428p3698n9253l3193k3898j381L333j0700q602R264J402J2730
$$ plain form
8716 419207 409152 401643 410868 404947 383667 375847 388387 391676 390759 409575 425761 430314 426549
8703 426549 425949 406347 405268 412423 420174 424358 430258 428870 431331 450644 468374 482435 508675
8690 508675 515372 507808 499375 494078 473727 463167 449748 442388 429036 421943 429849 460665 480367
8677 480367 479027 483167 485514 478319 469368 469720 472267 474955 483132 489605 491723 495832 506210 521671
8663 521671 523268 527733 527761 529419 521875 531215 553879 569356 573136 570285 561200 569345 591229 604381
8649 604381 629253 644902 655370 668946 677451 680570 680920 704018 754773 798883 836955 897511
8637 897511 970995 1024832 1097968 1203348 1351404 1534117 1688809 1768418 1732965 1604603 1469067
8626 1469067 1355639 1281941 1222688 1189495 1165597 1164216 1167549 1156849 1148247 1157511 1158913 1171643
8614A171643J8665K4173K4717K9927L4510L0180L9628M7815N8129N9897P8061
8603A617345Q0086Q7381J12333J10181J28570J49778J60361J70097J76040J83742
8593B975914K02816K05775K06895K28068K39299K75395L15693K77023R5702j64649
8583D857931l81483m40525m14531l42841k71662k15589j84916j53398j34231j03142
8573B215613o8622m9920l9248j7828J3774K8921N2711J07114J81399K30297K17791
8562B872002R3924p4571j86829k05390j85337j50929j07389o6342l2395l9115
8552A917629o3658o5688o7336n3992l1673j9972R296L2738M3936P7571J19032
8541A897883J51909J07138j6176j10276j64228j56521j18381r7083m7973m9945
$$ plain form
8614 1171643 1190308 1214481 1239198 1269125 1303635 1333815 1373443 1421258 1479387 1539284 1617345
8603 1617345 1697431 1784812 1897145 2007326 2135896 2285674 2446035 2616132 2792172 2975914
8593 2975914 3178730 3384505 3591400 3819468 4058767 4334162 4649855 4926878 5022580 4857931
8583 4857931 4476448 4035923 3621392 3278551 3006889 2791300 2606384 2452986 2318755 2215613
8573 2215613 2146991 2097071 2057823 2039995 2053769 2082690 2135401 2242515 2423914 2654211 2872002
8562 2872002 2965926 2891355 2704526 2499136 2313799 2162870 2055481 1989139 1956744 1917629
8552 1917629 1853971 1788283 1720947 1666955 1635282 1615310 1624606 1657344 1701280 1778851 1897883
8541 1897883 2049792 2156930 2140754 2030478 1866250 1709729 1591348 1494265 1446292 1396347
8531A396347m0724k5638k2668j0506J6122M1694O3987J06952J51616K42213L59361
8520B278756M86933N17610L48587N185k96836m03283l77614k80284j99715j31190
8510A948149p5197n5970o4879j00027r9692j07717p4747n7446m9918k2318j5305
8499A224933k7465l5371k3122k6028l0582k5J0201j2440m108J0464l453M558J1034
8486A098596j462m742j0460P791L2459M6517N9193O5202J05895J56724J97195
8475A752908K59858K27115P4052q8238j85847j96810j50029j24122q9208n3287
8465A426392k8961l2763l1614l9021k8702l0932k9325k2585k1650k7275j9663
8454A113901j691Q626J6224R428l487k078r646k1555j0355Q240J8031J6110M723
$$ plain form
8531 1396347 1355623 1329985 1307317 1296811 1312933 1354627 1418614 1525566 1677182 1919395 2278756
8520 2278756 2765689 3283299 3631886 3637071 3340235 2936952 2559338 2279054 2079339 1948149
8510 1948149 1872952 1816982 1752103 1652076 1552384 1444667 1369920 1312474 1262556 1240238 1224933
8499 1224933 1197468 1162097 1138975 1112947 1082365 1082340 1092541 1080101 1075993 1086457 1083004 1087562 1098596
8486 1098596 1097134 1092392 1081932 1089723 1122182 1168699 1227892 1293094 1398989 1555713 1752908
8475 1752908 2012766 2239881 2313933 2225695 2039848 1843038 1693009 1568887 1479679 1426392
8465 1426392 1397431 1364668 1333054 1294033 1265331 1234399 1205074 1182489 1160839 1133564 1113901
8454 1113901 1112210 1120836 1137060 1146488 1143001 1140923 1131277 1109722 1099367 1107607 1125638 1141748 1146471
8441A146471J921Q05o047O100N370J7386J1870j092J0496L207m112j5382p467
8428A169526L707K2172O191J3814P597j0064O605P583K0112P411J5321J916J5276
8415A287167Q792J7319K9425J9775J562J9128J8287J7476L0423J6068K9348M2339
8403A537109L9711J8680J6534K8424L9257K9488K4483L1637M8677L6672M0375
8392A891047L4968K7435L3794M6534N5040M6063M4073N4602O4136N8449L6786
8381B392927M6293O5170O0060N8714O3882P1881O9067O1172O6821P6906Q5680
8370C118573Q4335P6353Q2011J13298J20254J16935R2552J09812J15051J31665
8360D160839J33477J53917J65980J71038J67907J77143J94581K14588K11736K27266
$$ plain form
8441 1146471 1148392 1149197 1143150 1149250 1154620 1172006 1183876 1182784 1193280 1196487 1192375 1176993 1169526
8428 1169526 1173233 1195405 1201596 1215410 1223007 1212943 1219548 1227131 1247243 1254654 1269975 1271891 1287167
8415 1287167 1295959 1313278 1342703 1362478 1364040 1383168 1401455 1418931 1449354 1465422 1494770 1537109
8403 1537109 1576820 1595500 1612034 1640458 1679715 1709203 1733686 1765323 1814000 1850672 1891047
8392 1891047 1926015 1953450 1987244 2033778 2088818 2134881 2178954 2233556 2297692 2356141 2392927
8381 2392927 2439220 2504390 2564450 2623164 2687046 2758927 2827994 2889166 2955987 3032893 3118573
8370 3118573 3202908 3279261 3361272 3474570 3594824 3711759 3804311 3914123 4029174 4160839
8360 4160839 4294316 4448233 4614213 4785251 4953158 5130301 5324882 5539470 5751206 5978472
8350E978472K55511K70524K86444L01594L18271L47214L60924L76674M29863M61740
8340I387231M80614N31397N73344O13628O66764P12387P61283Q04830Q57216R08224
8330A6296918R70035J031658J066328J108407J150907J173489J176955J180040
8322B5154737J148752J105847J055377R84775Q96524Q07511P03086N69586M40208
8313C2866403K95177J64836J9628j36094k54187l70022m99787o01189o68609p36017
8303C0080139p68605p86988q07476q28688q21780p95372p65191p21376p20100
8294B3064563p00938o42034o28009n89718n72955n59266n35783m97441m77552
8285A7860867m58910m37010m28768m29460m09997l97306l83082l64100l69845
$$ plain form
8350 5978472 6233983 6504507 6790951 7092545 7410816 7758030 8118954 8495628 8925491 9387231
8340 9387231 9867845 10399242 10972586 11586214 12252978 12965365 13726648 14531478 15388694 16296918
8330 16296918 17266953 18298611 19364939 20473346 21624253 22797742 23974697 25154737
8322 25154737 26303489 27409336 28464713 29449488 30346012 31153523 31856609 32426195 32866403
8313 32866403 33161580 33326416 33346044 33209950 32955763 32585741 32085954 31484765 30816156 30080139
8303 30080139 29311534 28524546 27717070 26888382 26066602 25271230 24506039 23784663 23064563
8294 23064563 22363625 21721591 21093582 20503864 19930909 19371643 18835860 18338419 17860867
8285 17860867 17401957 16964947 16536179 16106719 15696722 15299416 14916334 14552234 14182389
8276A4182389l61545l38486l36398l41672l46731l33513l24638l29185l21830
8267A1148391l07153l19149l09958k92168k81913k95675k89282k63257k71493
8258H518343k53324k54210k52623k43887k27061k22487k19274k12234j93364j90980
8248F248899j93892j87681j98954k01005j80201j53603j52278j60429j54139j58556
8238D508161j45203j30931j23165j19346j19202j16825j07142j17782r5273q5838
8228C347454p8000q8624q7171q9851q1719r1240p5252o9229p7047n5893n3189
8217B500239n7640o3171m3689m7114m9773o2888m4649l0646l6605k5307n1579
8206A987178m4614m2978n4749m5762m4706k7326j3872k7019l0192l5272k8538
$$ plain form
8276 14182389 13820844 13482358 13145960 12804288 12457557 12124044 11799406 11470221 11148391
8267 11148391 10841238 10522089 10212131 9919963 9638050 9342375 9053093 8789836 8518343
8258 8518343 8265019 8010809 7758186 7514299 7287238 7064751 6845477 6633243 6439879 6248899
8248 6248899 6055007 5867326 5668372 5467367 5287166 5133563 4981285 4820856 4666717 4508161
8238 4508161 4362958 4232027 4108862 3989516 3870314 3753489 3646347 3528565 3433292 3347454
8228 3347454 3269454 3180830 3093659 3003808 2922089 2830849 2755597 2686368 2609321 2553428 2500239
8217 2500239 2442599 2379428 2335739 2288625 2238852 2175964 2131315 2100669 2064064 2038757 1987178
8206 1987178 1942564 1899586 1844837 1799075 1754369 1727043 1713171 1686152 1655960 1620688 1592150
8195A592150k0156j9980l2149l9381l1822j1111k0791k8426j6294k4859k0661
8184A326520j2721j1822k7931l4930j5914l0069l1912l0274k0525j8423l3274
8173A058725k9601k3644l6000j6525M108p689j0171j4298l3271k8531k2722k953
8161H37428o854j8007k976j0959n465N690j0464k0519j6270r685j0530P133J982
8148G40504l650N645n772o004p051k8014j3002j434n959J0226P764m680r944k79
8134F78350p130j0395Q988j2283M786O41j3700j2809J0207j015j5294m632r266
8121F16448n061Q747M809J88j3948r896r579q812N488J6628p618k6900r194j0963
8107E50337l531m402P095m889m205N827j5080j4156l368n661q409l279l183j1918
$$ plain form
8195 1592150 1571994 1552014 1519865 1480484 1448662 1437551 1416760 1388334 1372040 1347181 1326520
8184 1326520 1313799 1301977 1274046 1239116 1223202 1193133 1161221 1130947 1110422 1091999 1058725
8173 1058725 1029124 1005480 969480 952955 957063 949374 939203 924905 891634 863103 840381 837428
8161 837428 830574 812567 809591 798632 793167 798857 788393 767874 751604 741919 731389 738522 740504
8148 740504 736854 742499 736727 730723 723672 695658 682656 681222 675263 685489 693253 688573 678629 678350
8134 678350 671220 660825 669813 657530 662316 662957 649257 636448 646655 645640 630346 625714 616448
8121 616448 611387 620134 624943 625131 611183 601287 591708 582896 588384 605012 597394 570494 561300 550337
8107 550337 546806 542404 549499 544610 540405 546232 531152 516996 513628 507967 499558 496279 493096 481178
8093D81178o827n494J0312N287l425j5084j7245l071J3606o940p674J621q260
8080D37984K213N477j5637J48O254K218K325K246j0766m741p511r332Q393Q241
8066D27512r621p231k383k380J0048L01j4697n134L938J1331L780j8711r506N693
8052C92940m40m919Q729Q386N684J5081J0881n650J026K812Q489l334M552K0749
8038D64986L862J8063J1116M583K66q750m334j0149J474M568n384M358J8837j4
8024E03482q372m862m843p350R624L166n625R62O325P338J037J3359K1701n801
8010E30141J0023K5472J7853M304O913R79J608J2688J7234K2039L1204K7897K4526
7997G32881K4293K9937M5454L2364J0735n408j4007k0620j2950k2654k6463k239
$$ plain form
8093 481178 474351 468857 479169 484456 481031 465947 448702 445631 459237 452297 444623 446244 437984
8080 437984 440197 445674 430037 430185 436439 438657 440982 443228 432462 427721 420210 410878 419271 427512
8066 427512 417891 410660 408277 405897 415945 416246 401549 396415 400353 411684 415464 396753 387247 392940
8052 392940 392500 387581 396310 404696 410380 425461 436342 430692 431718 434530 443019 439685 444237 464986
8038 464986 468848 486911 498027 502610 502876 494126 489792 479643 481117 485685 480301 484659 503496 503482
8024 503482 495110 490248 485405 478055 487679 490845 485220 486182 492507 499845 500882 514241 535942 530141
8010 530141 540164 565636 583489 587793 594706 595685 597293 609981 627215 649254 680458 708355 732881
7997 732881 757174 787111 832565 864929 875664 870256 856249 835629 822679 800025 773562 771323
7985G71323k0841j4605j5600j7760q622p932L215L470j3797r940l119J5368K0914
7972G02074K7873Q647J8650K1777K4311K6575L3936K4474J7000J440J924K3475
7960I32156K2604K9202J9643K0545K4859K4876K1468J8219K0326J2990N463j5514
7948A136837q223j1099j6817j5462j2245k4146l579m403n309j8079j3040j5524
7936I88911j0059m701j3908j0697M171O255N254j645M094K0641L0889J7707J9874
7923A056786K7823J5852O421N196j998P163K457j956K1P570O030J2170Q434j9571
7909A132398k4135j9864k1278k9513j2984k696l678J833n283j4021r447k0320
7897I71012k7915j5260j9802j4036L120k2106j9110j5073j7210k0805l489q525
$$ plain form
7985 771323 750482 735877 720277 702517 693895 685963 689178 692648 678851 668911 665792 681160 702074
7972 702074 729947 738594 757244 779021 803332 829907 863843 888317 905317 906757 908681 932156
7960 932156 954760 983962 1003605 1024150 1049009 1073885 1095353 1113572 1133898 1146888 1152351 1136837
7948 1136837 1128614 1117515 1100698 1085236 1072991 1048845 1045266 1040863 1035554 1017475 1004435 988911
7936 988911 978852 974151 960243 949546 953717 959972 965226 963581 967675 988316 1019205 1036912 1056786
7923 1056786 1084609 1100461 1106882 1112078 1110080 1117243 1119700 1117744 1117765 1125335 1131365 1143535 1151969 1132398
7909 1132398 1108263 1088399 1067121 1037608 1024624 1021928 1018250 1020083 1014800 1000779 991332 971012
7897 971012 943097 927837 908035 893999 897119 875013 855903 840830 823620 802815 799326 790801
7885G90801m679j880q491j3997n239j8084k0341j462n306k0973q894j2191q528
7872F60736k2087p627r698j7896p225l531p189j155n734r877J924l493r226n10
7858E57412j6705k0100p490j0287j4006k4263k3227k2770j378p228j7620j7189
7846C75149j4337m076N304R54q242p538n675n491L52j1236k3237j3944q265j6063
7832B63655r632Q280l769p591l409o472k394j2919j441j4481l362J0577j2264
7819B04778k999k369k1871j8805R651N814j0334N598j371l411n228o353M394R945
7805A67439k706j3604j6825l12j11j44k165m077J6509Q433k746j2410m058M148
7791A37371m999r350r759L04k850r355j6457Q421Q57l59R731j9260k2538k519
$$ plain form
7885 790801 786122 784242 775751 761754 756515 738431 718090 716628 711322 690349 681455 669264 660736
7872 660736 638649 631022 621324 603428 596203 592672 585483 584328 578594 568717 570641 567148 557922 557412
7858 557412 540707 520607 513117 502830 488824 464561 441334 418564 417186 409958 392338 375149
7846 375149 360812 356736 362040 362994 354752 347214 341539 336048 336400 325164 301927 287983 279718 263655
7832 263655 254023 262303 258534 250943 247534 241062 238668 225749 224308 209827 206465 217042 204778
7819 204778 201779 199410 177539 158734 168385 174199 163865 169463 168092 164681 159453 153100 157494 167439
7805 167439 164733 151129 134304 133992 133881 133737 131572 127495 144004 152437 149691 137281 133223 137371
7791 137371 132372 123022 113263 113567 110717 101362 84905 93326 94183 93824 103555 84295 61757 59238
7777E9238P102J4206j6146N689M432Q738M764M048k974k1184j6777J0584L374
7764F5094M623k117j3101M000N899P29k63j0013k013M954l290n928J0395J879
7750F0848p114l953R466J0848r251n399n866j0155J238l88R552N89L552L601N262
7735F2830m578p298l507q596O802P555q42j5709j6887Q239P741R409l502k77J107
7720D2487l615o707n168p404k633J7776J2945o797k0697m334J5253J0132N397
7707D6635J63j714P73j1891q443k831K682J3416Q620L751l144R71m312m771K686
7692D2591n884p69p386q130r771n06K31O73P04R120L397J393j450q30p749N628
7676B1262j0225p659J748K384q444m908P596J018P453J5414Q244j0702K782k719
$$ plain form
7777 59238 66340 80546 64400 70089 74521 83259 88023 92071 89097 67913 51136 61720 65094
7764 65094 69717 67600 54499 58499 64398 65127 64864 54851 52838 57792 54502 48574 58969 60848
7750 60848 53734 49781 59247 70095 60844 55445 49579 39424 40662 40274 49826 50415 53967 57568 62830
7735 62830 58252 50954 47447 38851 45653 53208 52366 36657 19770 28009 35750 45159 41657 41380 42487
7720 42487 38872 32165 26997 19593 16960 34736 47681 40884 20187 15853 31106 41238 46635
7707 46635 46798 45084 45857 33966 25523 22692 25374 38790 47410 51161 48017 48988 44676 39905 42591
7692 42591 36707 35938 28552 20422 10651 10145 10376 11049 11753 20873 24270 25663 24213 23383 15634 21262
7676 21262 11037 3378 5126 7510 -934 -5842 1754 2772 10225 25639 33883 23181 25963 23244
7662B3244q904n947n967J2520J2878O581j9817j1281q701P479J4476N957j1570
7649A0948n632N025J7667q236J532K359m90J647j1396r654Q704J861O283r869
7635A0749L938N866L568p005l201r30O68J850j641m118j432K622J1453K971j0973
7620A4385j3871r840J3689J1456Q652j2395M332K111N377j686j921n082m50L123
7606A7880k274l050P804k670j2529l34m306o860j677j751N331K088o279p41J1001
7591A633L132k650L210k840j0036p528Q756O236R498k178m445l009P274l782j3034
7576i763M146K124Q31J848j438J0730O953k056k259P866N336M270j1309j3173
7562D106j1026J155j9P84P818K520o22k903M544J5132J4114p193Q949o447j4807
$$ plain form
7662 23244 14340 8393 2426 14946 27824 34405 14588 3307 -5394 2085 16561 22518 10948
7649 10948 5316 10341 28008 19772 21304 23663 23173 24820 13424 3770 12474 14335 20618 10749
7635 10749 14687 20553 24121 17116 13915 12985 13653 15503 13862 9744 8312 10934 22387 25358 14385
7620 14385 514 -9326 4363 15819 24471 12076 16408 18519 23896 22210 20289 15207 14757 17880
7606 17880 15606 12556 20360 17690 5161 4827 521 -6339 -8016 -9767 -4436 -2348 -8627 -9368 1633
7591 1633 4765 2115 5325 2485 -7551 -15079 -6323 -87 9411 7233 2788 -221 7053 3271 -9763
7576 -9763 -5617 -3493 -2662 -814 -2252 8478 15431 13375 11116 18982 24318 28588 17279 4106
7562 4106 -6920 -5765 -5784 -5000 2818 5338 4716 1813 6357 21489 35603 28410 37359 30912 16105
7547A6105l693o78N530N838L352m325k594J2264q613j7411j8788M433M955Q187
7533D562j4682k873N629R676j562k499P186l825r812J550J3188J674q855j5359
7519a6002l199R84J1152R086l588j0492k056N600p265O733o516p837K0676J2194
7505I470q32q058K199R51o752j1665j2346R937M04o52m13J3416j513j361P705
7490D90J4196M478j6774j0417l593J96l155l820J1920m960M166J0622k074q610
7476g335r583m180R579O531O962M995J2627Q558q154j1807L951l910j5912n467
7462a3145K856n083K399N325P055L350P29m060r404o974l52j708J6772r692k541
7447a4473P084N490M337R5O331j962j4404n926k342k082J291M980l940Q812N445
$$ plain form
7547 16105 12412 11734 17264 23102 26454 22129 19535 31799 23186 5775 -13013 -8580 -3625 4562
7533 4562 -10120 -12993 -7364 2312 750 -1749 5437 1612 -8200 -6650 6538 8212 -643 -16002
7519 -16002 -19201 -18217 -7065 2021 -1567 -12059 -14115 -8515 -15780 -9047 -15563 -23400 -2724 9470
7505 9470 8638 580 2779 3730 -3022 -14687 -27033 -17096 -16692 -17344 -17757 -4341 -5854 -7215 490
7490 490 14686 19164 2390 -8027 -11620 -11424 -14579 -18399 -6479 -11439 -7273 3349 1275 -7335
7476 -7335 -16918 -21098 -11519 -4988 1974 6969 19596 28154 20000 8193 12144 8234 -7678 -13145
7462 -13145 -10289 -15372 -12973 -7648 -593 2757 3486 -574 -9978 -16952 -17304 -19012 -2240 -11932 -14473
7447 -14473 -7389 -1899 2438 2533 8864 6902 -7502 -13428 -15770 -17852 -16561 -11581 -15521 -6709 -1264
7432a264l536q675J2518L527j4115l707M571R62n87j2520K1523K1310n548j6553
7418b094R66k190m095L358N322P894j3070j1295J335l241R051m8L533j346M642
7403a278k326p299j7025k75K706P304J410O917P020R507o631p072M76q57j471
7388h894j604j0974r621j340R75k738m055J3739K4571O964N711l989O53p981j4512
7373a3095M348O086P800M396j208n760m841o394Q781Q320M228p993n938k76k364
7358c910n049J492K139l256q234R028J7690k498l080L807l412m398j587m977l546
7343i791M155o683J786k728N745j671J1758J152m327l121q729J2465J3939m096
7329I854j1298r65o369L506P900m412l197J68J608j843q145p18O852o314j925
$$ plain form
7432 -1264 -4800 -13475 -957 2570 -11545 -15252 -10681 -9719 -10306 -22826 -1303 20007 14459 -2094
7418 -2094 -1128 -3318 -7413 -4055 1267 9161 -3909 -15204 -13869 -17110 -8059 -8107 -4574 -5920 -1278
7403 -1278 -3604 -10903 -27928 -28203 -25497 -18193 -16783 -9866 -2846 6661 30 -7042 -6566 -7423 -8894
7388 -8894 -10498 -21472 -31093 -32433 -31458 -34196 -38251 -24512 59 7023 12734 8745 9398 1417 -13095
7373 -13095 -8747 -2661 5139 9535 8327 2567 -2274 -8668 113 8433 12661 4668 -1270 -1546 -3910
7358 -3910 -8959 -7467 -5328 -8584 -16818 -7790 9900 7402 4322 8129 4717 319 -1268 -6245 -9791
7343 -9791 -5636 -12319 -10533 -13261 -7516 -9187 2571 3723 -604 -3725 -12454 11 13950 9854
7329 9854 -1444 -2409 -8778 -5272 2628 -1784 -4981 -4813 -3205 -5048 -13193 -13911 -7059 -13373 -15298
7314a5298L442m256J2826O579q72l95k821r103j7628p06J1451J4607O421j8396
7300a4149r49N475r27j0801K427k521Q151L918p418J2414Q234J613P429p808j2546
7285g458r986K0136K1985j7552j6520l651P566J4171M576j5435m344M121o861
7272i252K72j0657Q155n999o869q939n566K1027K1220J625Q1o750J065R03n840
7257e524m759k496j972k7096r38J4986R156P167P30j757j0633j052n90K463K313
7242b0002L694o531R876p43j5213J4735J6074N155l602r48L043q806p4j1767n077
7227b0186k031Q411K659Q230o461k523O2k721K765K045K613J3885J2037m49j7952
7212C84k0017n378M633J2432J7716o32r551o93K431k001p141k353P737J3026J185
$$ plain form
7314 -15298 -11856 -16112 -3286 3293 2421 2026 -795 -9898 -27526 -28232 -16781 -2174 4247 -14149
7300 -14149 -15098 -9623 -10550 -21351 -18924 -21445 -13294 -9376 -16794 -4380 3854 5467 12896 5088 -7458
7285 -7458 -17444 2692 24677 7125 -9395 -13046 -5480 8691 13267 -2168 -6512 -2391 -9252
7272 -9252 -8980 -19637 -11482 -17481 -24350 -33289 -38855 -17828 3392 5017 5098 -1652 -587 316 -5524
7257 -5524 -10283 -12779 -14751 -41847 -42785 -27799 -18643 -11476 -10746 -12503 -23136 -24188 -24778 -22315 -20002
7242 -20002 -16308 -22839 -12963 -13706 -28919 -14184 1890 7045 3443 2495 5538 -3268 -3342 -15109 -20186
7227 -20186 -22217 -13806 -11147 -2917 -9378 -11901 -11839 -14560 -11795 -9750 -7137 6748 18785 18336 384
7212 384 -19633 -25011 -20378 -7946 9770 9138 -413 -1106 1325 -676 -7817 -10170 -2433 10593 11778
7197A1778p063k69m136n782r013P128J0346q729r325r872Q058Q778O807O40j5896
7182a6550o114M87J3686Q502J1949k441o737j9565m024m173p670Q224J0158J265
7168a3003N80J1036P64J1834N299p616j4287J2019K93K768N804l32k0868j0126
7154a5835N36J4409R962m904q556o033L253K364P852Q815M226k631k21q575N956
7139A0618j4645p893L974m514j3073M71M305p919K0386L881P569k747o945K349
7125d183M086k926L468L63L609O851j232m536r913J658O920o456Q99p296m578
7110a3266k192k157o465P757J5132J5559J0918J844N167j2113M795K3355J5141
7097F3475j0982k2445L332P220J641M491p883j4930p16J879j1329j6869J964L492
$$ plain form
7197 11778 4715 4446 310 -5472 -14485 -7357 2989 -5740 -15065 -24937 -16879 -8101 -1294 -654 -16550
7182 -16550 -22664 -22177 -8491 11 11960 9519 2782 -16783 -20807 -24980 -32650 -24426 -14268 -13003
7168 -13003 -12423 -1387 -623 11211 16510 8894 -5393 6626 6919 9687 15491 15159 -5709 -15835
7154 -15835 -15299 -890 9072 4168 -4388 -10421 -7168 -4804 3048 11863 16089 13458 13237 4662 10618
7139 10618 -4027 -11920 -7946 -12460 -25533 -25062 -20757 -28676 -8290 -4409 3160 413 -6532 -4183
7125 -4183 -97 -3023 445 808 4417 11268 10036 5500 -4413 -2755 4165 -2291 -1392 -8688 -13266
7110 -13266 -15458 -17615 -24080 -16323 -1191 14368 25286 27130 32297 20184 24979 48334 63475
7097 63475 52493 30048 33380 40600 42241 46732 38849 23919 23203 25082 13753 -3116 -1152 2340
7083B340O607l165j984j810m196j0069N247O112J0061K062N76K43l494j5274j3623
7068b0367j2290P861L920l977k385N908O233J9043m599R355J379q955j0072k987
7054a1933M777j937O222Q378l607J3900Q684p038n953j3274j7021l932J4830K0761
7040A2857N616j4590n352M502o411n32m2R420n729O182L413o548r613m215J3791
7025B749o8k009M18j4900M992J826r988j263r374J0635J691m197J3923M793r927
7010a0699p013j303q17R205m03J0223m493l858M030L554k476J0097l854o528l3
6995d368Q342R75p353j9873n724J0138J2715J3168l889k763M53J3208J939k164
6981A4804M194P307O813j7447j0695l837k62j663j0840O055J4851m170l292P860
$$ plain form
7083 2340 8947 5782 3798 1988 -2208 -12277 -7030 -918 9143 11205 11781 12024 8530 -6744 -20367
7068 -20367 -32657 -24796 -20876 -24853 -27238 -21330 -15097 3946 -653 8702 10081 1126 -8946 -11933
7054 -11933 -7156 -9093 -2871 5507 1900 15800 24484 17446 11493 -1781 -18802 -22734 -7904 12857
7040 12857 18473 3883 -1469 3033 -3378 -3910 -3952 5468 -261 5921 9334 2786 -6827 -11042 2749
7025 2749 2681 672 1090 -13810 -8818 -6992 -16980 -18243 -27617 -16982 -15291 -19488 -5565 -772 -10699
7010 -10699 -17712 -19015 -19832 -10627 -11030 -807 -5300 -9158 -5128 -1574 -4050 6047 2193 -4335 -4368
6995 -4368 3974 4949 -2404 -22277 -28001 -17863 -5148 8020 4131 1368 1821 15029 16968 14804
6981 14804 18998 26305 33118 15671 4976 1139 877 -786 -11626 -5571 9280 5110 1818 9678
6967I678j558O076M95o988N02L752r209m16j2035L681J3202J860q011m221Q28
6952b364q713p431K999J2839J2651q334m286J930K341K238l600j1178j5162K335
6938b3735J4197m745o769O256Q617q202j1782P734P415J4723J525k1976r255J9642
6924f355J4146j2074j3738P497P698o855n283k460J079J80j923J058J5649M529
6910C148n987O328m583p285n637l405O307O598q303r75k293M005Q843J2993r584
6895A70n846M349r891J0087M47Q465R630r934j0293k415L363O671P517M509L133
6880A9962m254n934q495m016l735L198O310n509j4085J5719J8510j8442r146j833
6866a1750P185J8079K884l618O642j696N814o483J9725k58l021R519o450O542
$$ plain form
6967 9678 8120 14196 14691 7703 8205 11957 2748 2332 -9703 -6022 7180 9040 1029 -3192 -2364
6952 -2364 -11077 -18508 -15509 -2670 9981 1647 -2639 -709 1632 3870 270 -10908 -26070 -23735
6938 -23735 -9538 -14283 -21052 -14796 -6179 -14381 -26163 -18429 -11014 3709 5234 -16742 -25997 -6355
6924 -6355 7791 -4283 -18021 -10524 -2826 -9681 -14964 -17424 -16345 -16165 -18088 -17030 -1381 3148
6910 3148 -2839 3489 -1094 -8379 -14016 -17421 -11114 -4516 -12819 -13794 -16087 -12082 -3239 9754 170
6895 170 -5676 -1327 -11218 -1131 -684 7781 17411 7477 -2816 -5231 -1868 4803 12320 16829 19962
6880 19962 15708 9774 1279 -2737 -6472 -3274 3036 -2473 -16558 -839 17671 -771 -9917 -11750
6866 -11750 -4565 13514 16398 12780 19422 17726 23540 17057 36782 36524 33503 43022 36572 43114
6852D3114K835j3577j6129p429k57O805n405j3229n127k916J3009M901K695J552
6838A0842Q522O855l526m94k29q358l205N87n258M920M686k737O324J3190o29
6823C1490n802J4819M94Q461M653m718k0822m303J0487J2930M819K568R05m074
6809E1907R390P839o771l547K295J3268l39m963J2009m641m664m699r184R935
6795F7835K571n579j4387j946Q000J5497l63q440q501J6956J5392j405K0801M712
6781A11143k723k305l808P842J8733N21p831n502R247J3835N979j3240o398j0076
6767A15417J620N283J0535K4116O448K922K1033J6928K7186K5108K8772L4011
6755C19379L8854N7895R0908J04647R0222O6502J7247l500l3953n2224l9641l982
$$ plain form
6852 43114 45949 32372 16243 8814 8557 15362 9957 -3272 -8399 -11315 1694 6595 9290 10842
6838 10842 19364 26219 22693 22199 21970 13612 10407 10994 5736 10656 15342 12605 18929 32119 31490
6823 31490 25688 40507 41001 49462 54115 49397 28575 24272 34759 47689 52508 55076 55981 51907
6809 51907 61297 69136 62365 58818 61113 74381 74042 69079 81088 76447 71783 67084 57900 67835
6795 67835 70406 64827 50440 48494 56494 71991 71628 63188 54687 71643 87035 85630 106431 111143
6781 111143 108420 106115 102307 110149 128882 129403 121572 116070 125317 139152 145131 131891 125493 115417
6767 115417 117037 122320 132855 156971 163419 166341 187374 204302 231488 256596 285368 319379
6755 319379 358233 416128 507036 611683 701905 768407 785654 782154 748201 695977 656336 652354
6743F52354J8033M6422Q7289Q4671J16853J73298K48399L43433M53078O14162
6733B837992Q19923J126983J539407J986657K342152K258723J297057k39053j532075
6724A2437766k036585j939527j562139j166263q49779o21288m54417l44898k90158
6715C172712k19246j82054j55256j25874j14645q2891o9607l9968l6698k3299
6705B123174R826k071l2190n6241o7189n4423m5554k1990k3537k3462k1395l6753
6693A748195o1486o1225n7853n1729k6007j2179k5566k9541l4510o9445p4227
6682A244427p0565q2381p4512m9132n0870o4693n7381m2938m2138l2210l1320
6671F46287j3869k6967k8412l7162k7303j6787l2358l1703k2630k3963j8240j9425
$$ plain form
6743 652354 670387 716809 804098 888769 1005622 1178920 1427319 1770752 2223830 2837992
6733 2837992 3657915 4784898 6324305 8310962 10653114 12911837 14208894 13969841 12437766
6724 12437766 10401181 8461654 6899515 5733252 4883473 4262185 3807768 3462870 3172712
6715 3172712 2953466 2771412 2616156 2490282 2375637 2292746 2223139 2183171 2146473 2123174
6705 2123174 2133000 2130929 2098739 2042498 1975309 1920886 1875332 1853342 1829805 1806343 1784948 1748195
6693 1748195 1686709 1625484 1567631 1515902 1489895 1477716 1452150 1422609 1388099 1318654 1244427
6682 1244427 1173862 1091481 1016969 967837 916967 852274 794893 751955 709817 677607 646287
6671 646287 632418 605451 577039 539877 512574 495787 463429 431726 409096 385133 366893 347468
6659C47468j6488j7065j5644r395j6020j4997p240r836r14j3488k0642j1218j38
6646A94383k4j611q126K698j4688l2193k4844j0484j3538p901m969P48J1886J149
6632I2486q919j4125O198N524j2692k0907J1630M556P90q831j0713n279j082j355
6618C7281k69L159k269J1039P327L544r457j5842K198J0111M811l473J866J3568
6604F3594R698P880Q808L523k3937j4577j5595q780n267N992m757k0319r395J3459
6590A0327R334j2094j0103l511n363j1430j3087N179J5402K0713K7791J612N095
6577C9865j3451k3229k586k215j017J5171J1981q013j8897o6J0430L073q739k034
6563B73Q365M152q273j5428o73J151J6794Q522P199j0071m283K011M529k814r643
$$ plain form
6659 347468 330980 313915 298271 288876 272856 257859 250619 240783 239869 226381 205739 194521 194383
6646 194383 194359 192748 184622 187320 172632 140439 115595 105111 91573 83672 78703 79451 91337 92486
6632 92486 83567 69442 75640 81164 68472 47565 59195 63751 64541 55710 44997 39718 38636 37281
6618 37281 37012 40171 37902 48941 56268 59812 50355 34513 36711 46822 51633 48160 50026 63594
6604 63594 73292 81172 89980 93503 69566 54989 39394 30614 25347 31339 26582 6263 -3132 10327
6590 10327 19661 7567 -2536 -6047 -11410 -22840 -35927 -30748 -15346 5367 33158 34770 39865
6577 39865 26414 3185 599 -1616 -2633 12538 24519 16506 -2391 -2457 7973 11046 2307 273
6563 273 8638 12790 4517 -10911 -11584 -10433 6361 14883 22082 12011 7728 9739 14268 11454 1811
6548A811m019K122J7963j641n395p84N126M848Q225q343N341L341n451K250p223
6533A8171l276p054k241K489O026J0781m555K169L655L272K529N47j980p649k1349
6518A535N448o081j3472n525N596m408L057J609p38J616l232J0983l651K14J1092
6503D043J493p820q033o790N306R997M655N067m83j510N746k10j2271q15l225
6488d850p925Q209J117l430n377o991n147m479m65N120J0400J3191o909j7218
6474b4754k476J4905L108R199K552p380l312J0328J1134m989o796j1106o382j910
6460a7879m97l908J1153P912q238R14R73j4113j213J1503m562l620J5984J571
6446d020j2615J816k159K365M144J0960k73N21n822j295m423J498J436lL741Q523
$$ plain form
6548 1811 -2208 -86 17877 16236 10841 10057 15183 20031 28256 19913 25254 28595 23144 25394 18171
6533 18171 14895 7841 5600 8089 14115 24896 20341 22510 26165 29437 31966 32513 30533 22884 1535
6518 1535 6983 902 -12570 -18095 -12499 -16907 -13850 -12241 -12979 -11363 -14595 -3612 -7263 -7049 4043
6503 4043 5536 -2284 -10317 -17107 -11801 -1804 2851 7918 7435 5925 11671 11461 -810 -1625 -4850
6488 -4850 -12775 -4566 -3449 -6879 -12256 -19247 -24394 -28873 -29338 -24218 -13818 -627 -7536 -24754
6474 -24754 -27230 -12325 -9217 -18 2534 -4846 -8158 2170 13304 8315 1519 -9587 -15969 -17879
6460 -17879 -18376 -22284 -11131 -3219 -11457 -10543 -9570 -23683 -24896 -13393 -17955 -21575 -5591 -4020
6446 -4020 -16635 -14819 -16978 -14613 -10469 491 218 739 -5083 -6378 -10801 -9303 -7867 -7870 -4129 4394
6430D394p376o563k562p009p476l09P783J1496N076m734R261J4911o267j0819
6416a94k613J440K473j199q299n665M577m057l239Q475q241m189L506J7280J9138
6401A9193p949m805n670k0219k07O892L739j0990L175J4791K803m581Q033L979
6387H184k2922n226J3024O766L057n410j1524L891K432J761N045j0693l91J0075
6373a931J314p575j1021j0511J182n94N549l4M655m97j64n156j657R976J6009
6358d55J1366O625Q500Q032M606J2234Q873K139o68j9766p539M084K015O588p576
6343C9058j7409p0n912r855o465M844M245j2195M539l606q156m904N823o93L888
6328f868P029Q86P752J184q372j1052J2012J5386j881o949j2235n784p499j336
$$ plain form
6430 4394 -2982 -9545 -12107 -19116 -26592 -26901 -19118 -7622 -2546 -7280 1981 16892 10625 -194
6416 -194 -2807 -1367 1106 -93 -8392 -14057 -9480 -13537 -16776 -8301 -16542 -20731 -17225 55 19193
6401 19193 11244 6439 769 -19450 -19657 -12765 -9026 -20016 -16841 -2050 753 -3828 4205 8184
6387 8184 -14738 -19964 -6940 -174 2883 -2527 -14051 -10160 -7728 -5967 -922 -11615 -12006 -1931
6373 -1931 -617 -8192 -19213 -29724 -28542 -29136 -23587 -23621 -18966 -19463 -19627 -24783 -26440 -16464 -455
6358 -455 10911 17536 26036 34068 38674 50908 59781 61920 61252 41486 33947 38031 40046 46634 39058
6343 39058 21649 21579 15667 5812 -653 4191 8436 -3759 780 -2826 -10982 -15886 -10063 -10756 -6868
6328 -6868 161 1047 8799 9983 1611 -9441 2571 17957 16076 9127 -3108 -8892 -16391 -17727
6314a7727Q545o46q199O07r18j2143J1806K0250m179q881m338Q890O723m500M250
6299d60j59l795o628j4145j4262J5961J9155J0134Q32K889l660j2903p350k1204
6285c5595j7051Q715K2697J9441J4598j570r970r712j208Q715m11L348q09j202
6271a4M413m473q088J551n303j479R691N291Q483p71l332l068p813j048J0923
6256D963n500r457J7154o53j1532K84J6806O938j425j8629r604M604k570k774
6242a1395k63N238j0708O38J0590Q406R787m293n870o204m950o68j0122m352J0723
6227a3443k332P37K600l477J0796L489r623P72l01N036M681p183O035j443j3392
6212a7048j23j953j409q380L172O093R040m457K060K013K286M531k458m185K61
$$ plain form
6314 -17727 -9182 -9828 -18027 -17420 -18338 -30481 -18675 1575 -2604 -11485 -15823 -6933 -210 -4710 -460
6299 -460 -619 -4414 -11042 -25187 -39449 -23488 -4333 5801 6633 9522 5862 -7041 -14391 -35595
6285 -35595 -52646 -43931 -21234 -1793 12805 11235 1265 -8447 -9655 -940 -1351 1997 1188 -14
6271 -14 4399 -74 -8162 -6611 -11914 -13393 -3702 1589 10072 9301 5969 2901 -4912 -5960 4963
6256 4963 -537 -9994 7160 6507 -5025 -4741 12065 19003 17578 -1051 -10655 -6051 -8621 -11395
6242 -11395 -11658 -6420 -17128 -16490 -5900 2506 12293 8000 2130 -4074 -9024 -9692 -19814 -24166 -13443
6227 -13443 -15775 -15038 -12438 -15915 -5119 -1630 -11253 -10481 -10782 -5746 -1065 -8248 -2213 -3656 -17048
6212 -17048 -17171 -19124 -20533 -28913 -25741 -19648 -10608 -15065 -13005 -10992 -8706 -4175 -6633 -10818 -10557
6197a0557j033j506m531R611L597l020R612J5134J71j3048q261q956m157q624
6183b5568j0077n432K542J8296P025o115p05L733R824j8867j1117o819J2846J0388
6169b0046l464j1489K231J2564L645n848p68M004m723j999L396r91Q108J7856
6155B476k757o791n795L491J5069p316K036M867j736p759r819k746j273N743n454
6140a7764p06k113j3650n606K8000J7806r761J206o015j311N051k892l718R483
6126a990N636j8260j0913n896m267j133J4376Q339L011m703l026J8406J0886R575
6112B0041M249r977j8549j337M825j7429p979J36K798n330R094J6889J1318o817
6098A932l160m499o834R851j3221m392m52R905J0183j310j4412P931K745K724
$$ plain form
6197 -10557 -11590 -13096 -17627 -8016 -4419 -7439 2173 17307 17478 4430 -3831 -12787 -16944 -25568
6183 -25568 -35645 -41077 -38535 -20239 -13214 -19329 -20034 -16301 -6477 -25344 -36461 -43280 -30434 -20046
6169 -20046 -23510 -34999 -32768 -20204 -16559 -22407 -23175 -19171 -23894 -25893 -22497 -23488 -15380 2476
6155 2476 -281 -7072 -12867 -9376 5693 -1623 413 5280 3544 -4215 -14034 -16780 -18053 -12310 -17764
6140 -17764 -18470 -20583 -34233 -39839 -11839 5967 -3794 -2588 -8603 -9914 -4863 -7755 -11473 -1990
6126 -1990 3646 -14614 -25527 -31423 -35690 -36823 -22447 -14108 -11097 -15800 -18826 -420 10466 20041
6112 20041 24290 14313 -4236 -5573 -748 -18177 -26156 -26020 -23222 -28552 -19458 -2569 8749 1932
6098 1932 -1228 -5727 -12561 -2710 -15931 -20323 -20775 -10870 -687 -1997 -16409 -8478 -5733 -3009
6084c009M531m280k0007q558K280Q952J4004O137j5234j0259k259l462j218N989
6070b6393Q783j183k891j817N491O183L166M160J2132n210p024j166q609j4953
6056b9331l96K0073O289M058j5690L82L191K084o4R34L325r647q001k570k305
6041b7668J0779J7478J531j8863r14J673q118J4253J0572K641o182j0742L236
6028a0324P019L623j4102j0006K173O131P074N316J2372j489p175j2843k184o605
6014b1020n271q979M148O137q032k242O093N352M686N649J765o384O630l36n430
5999a7234l381M009P688N733N934m060M79j393j304o819r858Q403R367j0017j5776
5984b8229J2313J5617P370n498O989M256n372L454m67n613p248l243O456Q65Q178
$$ plain form
6084 -3009 1522 -2758 -22765 -31323 -29043 -20091 -6087 50 -15184 -25443 -27702 -31164 -32382 -26393
6070 -26393 -17610 -18793 -21684 -23501 -18010 -11827 -8661 -4501 7631 2421 -4603 -5769 -14378 -29331
6056 -29331 -29727 -9654 -3365 693 -14997 -14615 -11424 -9340 -9404 -8470 -5145 -14792 -22793 -25363 -27668
6041 -27668 -16889 589 2120 -16743 -17657 -15984 -24102 -9849 723 3364 -2818 -13560 -10324
6028 -10324 -3305 318 -13784 -23790 -21617 -15486 -8412 -3096 9276 7787 612 -12231 -14415 -21020
6014 -21020 -26291 -35270 -31122 -24985 -33017 -35259 -29166 -23814 -19128 -13479 -11714 -18098 -11468 -11804 -17234
5999 -17234 -20615 -16606 -8918 -3185 2749 -1311 -832 -2225 -3529 -10348 -20206 -11803 -2436 -12453 -28229
5984 -28229 -15916 -299 7071 1573 8562 12818 7446 10900 10433 4820 -2428 -5671 785 1650 9828
5969I828n139j2628Q99M510j3122m650K1186K4528n516o829L47j5752O75O328
5955D665l345p871p269P982L326r390J0434r64r46k613L002p322L354Q42k375
5940h490K868L454j5083r706K524j19M857J3296j0536q156m978N554J2315J5200
5926C000P869j0919p392J7068Q042o365K064j028P85k4330m70O204j318q689j5159
5911c0638P361p45K902p19j9339K176J2644n235L061n833k6483Q0K0521K3293
5897a6954O637j2808j2959m631Q535J3599m270R567J3218n106r455L59l389L170
5883a4487j15J876l370M011J2954l861N220J0532Q769l44j5233p339l674J1255
5869F194N523n220r605j8235M39L127K00O698j1087o405Q290J6458J573j1863
$$ plain form
5969 9828 4689 -7939 -7040 -2530 -15652 -20302 884 25412 19896 13067 13414 -2338 -1663 4665
5955 4665 1320 -6551 -13820 -5838 -2512 -11902 -1468 -2432 -3378 -5991 -2989 -10311 -6957 -6115 -8490
5940 -8490 -5622 -2168 -17251 -26957 -24433 -24552 -19695 -6399 -16935 -25091 -30069 -24515 -12200 3000
5926 3000 10869 -50 -7442 9626 17668 11303 13367 12339 13124 -11206 -11676 -5472 -6790 -15479 -30638
5911 -30638 -23277 -24022 -21120 -21839 -41178 -39002 -26358 -31593 -28532 -34365 -60848 -60768 -40247 -16954
5897 -16954 -10317 -23125 -36084 -40715 -32180 -18581 -22851 -13284 -66 -5172 -14627 -14268 -17657 -14487
5883 -14487 -14602 -12726 -16096 -12085 869 -2992 2228 12760 21529 21185 5952 -1387 -5061 6194
5869 6194 11717 6497 -3108 -21343 -20904 -17777 -17577 -10879 -21966 -28371 -20081 -3623 -2050 -13913
5855a3913M198J5083q2j0674j5490m686J0383J481J978Q23j2850N023K060J3259
5841c407l944j89O857J1283M827j0860m904l625O694m086j282J959m841R824m132
5826A74o858k643l146q417k869J0955Q091M351l254N708L28j0750l708J1191o770
5811g617j0640K18N35m719k701M791M659O96l587k541J1342J0805L712k82r045
5796d374j1305k938O145J7348N459j311j140j515o054j8348m887J082M594L246
5782a3998J0613l30j107O867j591j5071j0506J2386o552J2004J5389l888p399
5769c183K16p377l288O978R251P952p781r658N807j547O803M64m712r607J2616
5754B934J5839j1439l617j2225L166J0710o338p318L129j057q448m972M50M31
$$ plain form
5855 -13913 -9715 5368 5286 -5388 -20878 -25564 -15181 -13700 -11722 -10899 -23749 -18726 -16666 -3407
5841 -3407 -7351 -7540 -683 10600 15427 4567 -337 -3962 2732 -1354 -2636 -677 -5518 4306 174
5826 174 -6684 -9327 -12473 -20890 -23759 -12804 -4713 -362 -3616 2092 2420 -8330 -12038 -847 -7617
5811 -7617 -18257 -18039 -17504 -22223 -24924 -20133 -15474 -14778 -18365 -20906 -9564 1241 4953 4671 -4374
5796 -4374 -15679 -18617 -12472 4876 10335 9024 7884 6369 315 -18033 -22920 -21838 -17244 -13998
5782 -13998 -3385 -3715 -4822 2045 454 -14617 -25123 -12737 -19289 -7285 8104 4216 -3183
5769 -3183 -2967 -10344 -13632 -6654 2597 10549 2768 -6890 -1083 -2630 4173 4637 -75 -9682 2934
5754 2934 18773 7334 3717 -8508 -5342 5368 -970 -8288 -5159 -6216 -14664 -19636 -19186 -18755
5740a8755K45J4534P297k1394j5699J0342J9601R58j0057j0474k53M295J1380
5727g980J834q444m551J4089k543p237P060J969Q469m501q285j4789P128J5042
5713b739Q735j510q087j1025R18p709j3942P002L022p805J2623J5824N443k193
5699a443j3653j5019j12J0556n051n329J0814N691J5442m395j3031K705k733J1043
5685d515O775m771j0380n727r357K185l166j700K54J5382o718j425P233L147M378
5670h405J2481j524j1132j3208M309R957j419J1145N159j601m425l214l512l848
5656i237n526j076q599m076j421m658J2054P760N431J018J453k602k277K571j3730
5641b2915q425L224N419R834J4161j177j980j4547k81O849l797k926Q283J6955
$$ plain form
5740 -18755 -18510 -3976 3321 -18073 -33772 -23430 -3829 -2871 -12928 -23402 -23655 -19360 -7980
5727 -7980 -6146 -14590 -19141 -5052 -7595 -14832 -7772 -5803 2666 -1835 -10120 -24909 -17781 -2739
5713 -2739 5996 4486 -3601 -14626 -13708 -21417 -35359 -28357 -25335 -33140 -20517 -4693 750 -1443
5699 -1443 -15096 -30115 -30227 -19671 -24722 -30051 -19237 -13546 1896 -2499 -15530 -12825 -15558 -4515
5685 -4515 2260 -2511 -12891 -18618 -27975 -25790 -28956 -30656 -30402 -15020 -21738 -23163 -15930 -12783 -8405
5670 -8405 4076 2552 -8580 -21788 -17479 -7522 -8941 2204 7363 5762 1337 -1877 -5389 -9237
5656 -9237 -14763 -15839 -24438 -28514 -29935 -34593 -22539 -14779 -9348 -8330 -6877 -9479 -11756 -9185 -22915
5641 -22915 -31340 -28116 -22697 -12863 1298 121 -1859 -16406 -16687 -9838 -13635 -16561 -8278 8677
5627H677M05q06P053n199o081j046r352L542n892M190j498L370M035l421k901
5612d924J163J599P384r506j7614n377P046J563P596J006q559N611P69k728R633
5597e338n41m541N090J0664n047O623n808j7662J0458L050j2995p926J7421R164
5583B612O222L291j0578J058k713N3j0246j420L160L24M974K997O76r56l012L159
5567c99O282j3500j147Q604r742o711q684m719O531j780J474k886j100l874J0529
5552b1122J5733L139j882r19k403j091q075J0130j2142n714l326n253J6492N585
5538a0848k508J0977J0507j1842k1574Q895l099J751M681n748n891J3173J4016
5525B490K602k3037L518J5100j920k108k622q70o553m198Q286q421q959J3970
$$ plain form
5627 8677 9082 8276 15329 10130 4049 3003 -6349 -2807 -8699 -4509 -6007 -2637 1398 -2023 -4924
5612 -4924 -3761 -2162 5222 -4284 -21898 -27275 -20229 -18666 -11070 -10064 -18623 -13012 -12243 -14971 -5338
5597 -5338 -5879 -10420 -5330 5334 287 6910 1102 -16560 -6102 -3052 -16047 -23973 -6552 2612
5583 2612 8834 12125 1547 2605 -108 -55 -10301 -11721 -8561 -8237 -3263 -266 410 -546 -3558 -399
5567 -399 5883 -7617 -8764 -160 -9902 -16613 -25297 -30016 -23485 -25265 -23791 -26677 -27777 -31651 -21122
5552 -21122 -5389 -2250 -4132 -5051 -7454 -8545 -16620 -6490 -18632 -24346 -27672 -32925 -16433 -10848
5538 -10848 -13356 -2379 8128 -3714 -25288 -16393 -19492 -17741 -13060 -18808 -24699 -11526 2490
5525 2490 5092 -17945 -14427 673 -1247 -3355 -5977 -6847 -13400 -17598 -9312 -17733 -26692 -12722
5511a2722J0386m014O247K865J4985J0864l427p263k117j083j5806o221j0452
5498a7758M20R230L414j2576l756K4087J7195l007k0991j1534N035l010P779K286
5484c186Q862k962p25J5143l505m382o398r761j1604L724l971o880o261J2053
5470a9853J5896R011j692L252m820l893K419J1926l325o217l634j2397p908q727
5456b9962J141J4919J3308j1215o556j752j2986R705J3680j3192j1996j486J1922
5443b4470N210L827J0221m751L444R23j276M018j805Q954j565k410o929l547q26
5428a0982p832K591o185N305O431m438q700O871J4418n299j543j927O135M880
5414b75m644n103j989o384o496q819J4360Q856L506p562k478M28P970J646j0573
$$ plain form
5511 -12722 -2336 -6350 -103 2762 17747 28611 25184 17921 15804 14721 -1085 -7306 -17758
5498 -17758 -17338 -8108 -4694 -17270 -21026 3061 20256 17249 -3742 -15276 -10241 -13251 -5472 -3186
5484 -3186 5676 2714 1989 17132 13627 9245 2847 -6914 -18518 -14794 -18765 -25645 -31906 -19853
5470 -19853 -3957 5054 3362 6614 1794 -2099 320 12246 8921 2704 -930 -13327 -21235 -29962
5456 -29962 -28821 -13902 -594 -11809 -18365 -20117 -33103 -23398 -9718 -22910 -34906 -36392 -24470
5443 -24470 -19260 -15433 -5212 -9963 -6519 -5596 -6872 -2854 -4659 4295 2730 320 -6609 -10156 -10982
5428 -10982 -18814 -16223 -22408 -17103 -10672 -15110 -23810 -16939 -2521 -7820 -9363 -11290 -5155 -275
5414 -275 -4919 -10022 -12011 -18395 -24891 -33710 -19350 -10494 -6988 -14550 -17028 -16600 -8630 -6984 -17557
5399a7557k173Q945L82N840j28m168J116m991O032r729j5381R49m439J9620J7860
5384B178j5534n519k492j837J4433J0102N33j814J583k958r356J4087M059r143
5370a678m503n50r028O322K965M409p829l440k015P067R069P275j5009P110J2439
5355A2604N730o454j8257l272r866m755N661n741p748J0040O219q240n845J3245
5341a6679l839J1531O06j0153n505k179N948R96J1801l497j7861k816K0282P406
5327c959j0953p661N986q900j2882r836Q881J0794Q861L559R194J0704O185p585
5313B388l458J283K698N83j2763j2005n475k007K822L854J617q46m25q173k109
5298c2016J6904kl927O360J995P859Q786k093o802P013o456L437j2883j991N819
$$ plain form
5399 -17557 -19730 -10785 -10403 -4563 -4691 -8859 -7743 -12734 -6702 -16431 -31812 -30863 -35302 -15682 2178
5384 2178 -13356 -18875 -21367 -23204 -8771 1331 1864 50 1633 -1325 -10681 3406 7465 -1678
5370 -1678 -6181 -6731 -15759 -9437 -6472 -2063 -9892 -13332 -15347 -8280 789 8064 -6945 165 12604
5355 12604 18334 11880 -6377 -9649 -19515 -24270 -18609 -24350 -32098 -22058 -15839 -24079 -29924 -16679
5341 -16679 -20518 -8987 -8381 -18534 -24039 -26218 -20270 -19274 -7473 -10970 -28831 -31647 -11365 -3959
5327 -3959 -14912 -22573 -16587 -25487 -38369 -48205 -39324 -28530 -19669 -16110 -6916 3788 9973 2388
5313 2388 -1070 213 2911 3494 -9269 -21274 -26749 -28756 -25934 -22080 -20463 -21309 -21734 -29907 -32016
5298 -32016 -15112 -15114 -19041 -12681 -10686 -2827 5959 3866 -2936 4077 -2379 1058 -11825 -13816 -7997
5283g997n917O74R045o990j7386J912J2738K107N900L457l747M635P534n447r01
5268c83j605L480m44m247m517P39m140r172q219K2663J4951j6797n626J6185N138
5253H006k43j6264L689R85O690M597q98p668J389P847O793J263j0489p117o765
5238h185p287K1M331k414j015l005M697J1689j0704M126k473k59N43L016r215
5223a6134J3908K1476Q013o839k2005j2656p198j0753J0818J6195R928k576J36
5210B313R039l148j4596L342k691J0089K966j8552O325N4q449K416o977M495M26
5195a2948K471j463r141K465J128O11L623K798J1234p496k574L993p100o200k411
5180b1010M40J7921q958j5210K368n618J0931J343L391n222K874j386M358Q975
$$ plain form
5283 -7997 -13914 -13240 -4195 -11185 -28571 -26659 -13921 -11814 -5914 -2457 -6204 -1569 5965 518 -383
5268 -383 -1988 1492 1048 -3199 -7716 -6977 -11117 -20289 -28508 -5845 9106 -7691 -13317 2868 8006
5253 8006 7763 -8501 -4812 -3827 2863 7460 6562 -1106 283 8130 14923 16186 5697 -1420 -8185
5238 -8185 -15472 -15451 -11120 -13534 -14549 -17554 -12857 -1168 -11872 -7746 -10219 -10478 -9935 -6919 -16134
5223 -16134 -2226 19250 27263 20424 -1581 -14237 -21435 -32188 -21370 -5175 4753 2177 2313
5210 2313 11352 8204 -6392 -3050 -5741 4348 7314 -11238 -4913 -4859 -13308 -10892 -17869 -13374 -12948
5195 -12948 -10477 -11940 -21081 -18616 -17488 -16877 -13254 -10456 778 -6718 -9292 -5299 -12399 -18599 -21010
5180 -21010 -20570 -2649 -11607 -26817 -24449 -30067 -19136 -17793 -14402 -19624 -16750 -18136 -13778 -4803
5166d803J3710j3074j7268J73N634J0892l039K134J6157J984J22j7710q197R393
5152c892l809N365j4854j5920J4714J2442n65P487Q648n275o516m935n607O715
5138f002L158o751k42L782q544j1398p91J588N912l527J829O723Q35q46P611n452
5122a2115j1373j078J9525O80J490K783J93j0098L891P45M331P502l635o614m880
5107h653O383j705k711j6607P387m943k970M699l715P842K0105Q72j0382p907
5093a2305j1643J12J7850J3793k113j5634p81O9M264n315k488n596J1519N130
5079c138p537m375Q240M816o691p866P111L010J528L39p598l16P165N407o221
5064f126j6904L180k496J143o081k105L133O225P10j792k017N373j3366o149J6514
$$ plain form
5166 -4803 8907 -4167 -21435 -21262 -15628 -4736 -7775 -5641 10516 12500 12622 -5088 -13285 -3892
5152 -3892 -7701 -2336 -17190 -33110 -18396 -5954 -6519 968 9616 4341 -2175 -7110 -12717 -6002
5138 -6002 -2844 -9595 -9837 -6055 -14599 -25997 -26788 -25200 -19288 -22815 -20986 -14263 -13428 -14274 -6663 -12115
5122 -12115 -23488 -24566 -5041 -4361 -2871 -88 105 -9993 -6102 -5357 -1026 6476 2841 -3773 -8653
5107 -8653 -2270 -3975 -6686 -23293 -15906 -20849 -23819 -19120 -22835 -14993 5112 5984 -4398 -12305
5093 -12305 -23948 -23836 -5986 7807 5694 -9940 -10721 -10652 -6388 -11703 -14191 -19787 -8268 -3138
5079 -3138 -10675 -15050 -6810 -1994 -8685 -16551 -9440 -6430 -4902 -4563 -12161 -12477 -5312 95 -6126
5064 -6126 -23030 -19850 -22346 -21203 -27284 -29389 -26256 -20031 -19321 -21113 -23130 -17757 -31123 -37272 -20758
5049b0758J5577R779j465J893j5433p590l599K950J3005J1101q670r182R17Q15
5035a0660O372o018n804Q05m192k5J6686Q560N621j0438o47P55O10Q38m686Q244
5019F021J2785k319k341j1125O073O989n234p134P887o38j3355m414Q795M614
5005F604m248r554l290q289m421l897J6414r010P905M295L751K618r513j2687
4991b3322p673R104J509R847N455n939m847o48K392M921o454K070Q512O004N186
4976F117n732k531K597L87q148j3798j0464M130L867n006J3470K7964J066j5311
4962a392r155j1179N95R195P560j162k0533j1026O55R664J3370j0379J1336J1468
4948i83k504P871o18j582O687q221p6N559J1685m588Q94L153O360j2920L060J2080
$$ plain form
5049 -20758 -5181 4598 3133 5026 -10407 -17997 -21596 -18646 -5641 5460 -3210 -12392 -11475 -10660
5035 -10660 -4288 -10306 -16110 -15305 -19497 -19522 -2836 5724 11345 907 260 1015 1625 2463 -2223 6021
5019 6021 18806 16487 14146 3021 9094 16083 10849 3715 11602 10964 -2391 -6805 1990 6604
5005 6604 2356 -7198 -10488 -18777 -23198 -27095 -10681 -19691 -11786 -7491 -3740 -1122 -10635 -23322
4991 -23322 -30995 -21891 -20382 -10535 -5080 -11019 -15866 -16514 -14122 -9201 -15655 -13585 -5073 931 6117
4976 6117 385 -2146 451 838 -7310 -21108 -31572 -27442 -23575 -28581 -15111 12853 13919 -1392
4962 -1392 -10547 -21726 -21131 -11936 -4376 -5538 -26071 -37097 -36442 -26778 -13408 -23787 -12451 -983
4948 -983 -3487 4384 3766 2184 8871 650 574 6133 17818 13230 14124 17277 23637 10717 13777 25857
4932B5857m392j7828j0636P83J9001Q858j1995l750o40n911q699p546n146J1634
4918a0410P954l002L761J0055P962l034j351J037m94K406n569q773k816p445p079
4903a6798Q131L099K59q177P768k94l483Q50J8047J051k2845K943J2663k901O419
4888F732o527k501j748j1662q197l600L760R427J6133l622M166j251j4335j4640
4874b7865K136q081n245J1309J0624j1622J137J0221K486J82R86O914j734o171
4860a4723N760N060O380q925N460M239J646N845K430j0607j0307P820R192j7607
4846h337o003n913K281J1055O713l922j3746m323P195K1103L749m090P238l184
4832I816j8848p294Q46J069K146P361R764O143O83k126k0336l863q798J271J0730
$$ plain form
4932 25857 21465 3637 -6999 -6216 12785 21643 9648 5898 5258 -653 -9352 -16898 -22044 -10410
4918 -10410 -2456 -5458 -1697 8358 16320 13286 11935 12972 12478 14884 9315 542 -2274 -9719 -16798
4903 -16798 -8667 -5568 -5309 -13486 -5718 -6012 -9495 -8645 9402 10453 -12392 -9449 3214 313 6732
4888 6732 205 -2296 -4044 -15706 -23903 -27503 -23743 -14316 1817 -1805 2361 1110 -13225 -27865
4874 -27865 -25729 -33810 -39055 -27746 -17122 -28744 -27607 -17386 -14900 -14718 -13732 -6818 -8552 -14723
4860 -14723 -8963 -3903 2477 -6448 -988 3251 4897 10742 13172 2565 -7742 78 9270 -8337
4846 -8337 -14340 -20253 -17972 -6917 -204 -4126 -17872 -22195 -15000 6103 9852 5762 13000 9816
4832 9816 -9032 -16326 -15480 -14411 -12265 -4904 4860 11003 11686 9560 -10776 -14639 -23437 -22166 -11436
4817a1436K662J5409K939l019k532N8p322m245q852n941j0744o12J5067P024R608
4802a936N614j2450J1468j870l76j797q536M122J5664L208o087r540n797J016
4788g297Q589m237j3062l713m031J3667M694J7125j1897j3241m606l659J824K5451
4774E607J2495m505j0847q793R39K018J1235R741j7816o395K609N753R629q18
4760A0852r76j4513j631M447l470l501R576j67j1327J174O033J4610K168j1142
4746B133j897M348P430K49l991p016j778l758J9574l129j1770j163J990m568M021
4731F75p705j2379J5703M893l400j2638j471k864M532j043K019K463O846M008
4717c61j4106J133P714m800N840J7830O332k2437j6101m190r10J4153J0857j3204
$$ plain form
4817 -11436 -8774 6635 9574 6555 4023 4081 -3241 -7486 -16338 -22279 -33023 -33635 -18568 -11544 -1936
4802 -1936 3678 -8772 2696 826 450 -1347 -9883 -5761 9903 13111 7024 -2516 -8313 -7297
4788 -7297 1292 -2945 -16007 -19720 -23751 -10084 -5390 11735 -162 -13403 -18009 -21668 -19844 5607
4774 5607 18102 13597 2750 -6043 -5104 -3086 8149 17890 74 -6321 -3712 2041 11670 10852
4760 10852 9876 -4637 -6268 -1821 -5291 -8792 784 617 -10710 -9536 -3503 11107 13275 2133
4746 2133 236 4584 12014 12263 8272 1256 -522 -4280 15294 12165 395 -768 1222 -3346 675
4731 675 -7030 -19409 -3706 1187 -2213 -14851 -16322 -19186 -14654 -15697 -13678 -11215 -4369 -361
4717 -361 -14467 -13334 -5620 -10420 -4580 13250 19582 -2855 -18956 -23146 -24056 -9903 954 -12250
4703a2250j663K000K070J9503P755j1451j3175o112O687q684M507J1785J6158
4690A7130j579r858j0736r448K316K688q803p990o06P866J9926m301P959O050
4676A0614j438m365K1n286j5621o062J334J9219M228o766J1921k43j2859r186
4662a4489m357r485K156L616K008M517L33J2737m013k851J0711J251k339j6343
4648a6548n507M667K763N977L922j3260j143Q714R594o919o605N757P269R105
4634G786J0037q307n523j6227J697J0214n600n564P636J1833o2l836J988k0284
4620a4212Q018K085R62n393p012L355J3748J4395P947n650N248J195j617L53o404
4605A7018K224o323j133l658M745r880j5294J7913j234l2R994o162k5786o926
$$ plain form
4703 -12250 -13913 -11913 -9843 9660 17415 5964 -7211 -13323 -6636 -15320 -10813 972 17130
4690 17130 15551 5693 -5043 -14491 -12175 -9487 -18290 -26280 -26886 -19020 906 -3395 4564 10614
4676 10614 9176 4811 4832 -454 -16075 -22137 -20803 -1584 2644 -4122 7799 7556 -5303 -14489
4662 -14489 -18846 -28331 -26175 -22559 -20551 -16034 -15701 -2964 -6977 -9828 883 2134 -205 -16548
4648 -16548 -22055 -17388 -14625 -8648 -4726 -17986 -19129 -10415 -821 -7740 -14345 -8588 -1319 7786
4634 7786 17823 9516 3993 -12234 -10537 -323 -5923 -11487 -3851 7982 7920 4084 6072 -14212
4620 -14212 -6194 -4109 -3147 -8540 -15552 -12197 1551 15946 23893 18243 23491 24686 23069 23422 17018
4605 17018 19242 12919 11786 8128 12873 2993 -12301 5612 4378 4346 14340 8178 -17608 -24534
4591b4534j0209J5693L363j0367k167O380N298n41J067O711j150M11J7569J360
4577H884j0304j3612K280J4972k081M240J1624o489q314j5208J410J4407K795
4564D604J92j0665K774N268N70p559J1195L6n383Q719N323n170o680l631p802
4549h209j3337m17K732k559L213N342P843j312m168n357M395L161Q801q420j0073
4534a8365M097q554O905R250n52P461L291o230r631J0842Q070p078J41q550k023
4519a0926K817J1630M49q629o411o287J3908J0808j090K942j4248j3216M624j818
4505a5447p005q471l423Q547J0014J9096J154j7691l454O01P302J084J0214P482
4491A0003o027j8426k334K056K268L308j0383O660K704j235J9680k27p70O580
$$ plain form
4591 -24534 -34743 -19050 -15687 -26054 -28221 -21841 -16543 -17084 -16017 -9306 -10456 -10045 7524 8884
4577 8884 -1420 -15032 -12752 2220 139 4379 16003 9514 1200 -14008 -12598 1809 4604
4564 4604 4796 -5869 -3095 2173 2743 -4816 6379 6415 1032 9751 15074 9904 3224 -407 -8209
4549 -8209 -21546 -21963 -19231 -21790 -18577 -13235 -5392 -6704 -10872 -16229 -11834 -8673 128 -8292 -18365
4534 -18365 -14268 -22822 -15917 -6667 -7219 242 3533 -2697 -12328 -1486 6584 -494 -353 -8903 -10926
4519 -10926 -8109 3521 3970 -4659 -11070 -17357 -3449 7359 6269 9211 -5037 -18253 -13629 -15447
4505 -15447 -22452 -30923 -34346 -25799 -15785 3311 4465 -13226 -16680 -16079 -8777 -7693 2521 10003
4491 10003 3976 -14450 -16784 -14728 -12460 -9152 -19535 -12875 -10171 -11406 8274 8047 7277 13857
4477A3857J60l400O066p003j6459P10O64J357M314n312j9497N263O587l632j1735
4462b8060O44J7623J0792n89J084J1061r34j623k832j0302m253M851R04j1166
4448a2800l054o700m826N960J4013K770q021l87J7511K957k230Q344J0827o552
4434A7812j9083n423Q362o448m191P720J1456J2779k2376k0223p605R411K433
$$ plain form
4477 13857 14017 10617 16683 9680 -6779 -6069 -5405 -4048 266 -5046 -24543 -19280 -12693 -16325 -28060
4462 -28060 -27416 -9793 999 410 1494 12555 11621 9998 7166 -3136 -7389 -2538 -1634 -12800
4448 -12800 -15854 -22554 -27380 -21420 -7407 -4637 -12658 -13045 4466 7423 5193 13537 24364 17812
4434 17812 -1271 -6694 1668 -4780 -8971 -1251 10205 22984 608 -19615 -27220 -17809 -15376
$$ [...]
##END NTUPLES=NMR SPECTRUM
##END=
