##TITLE=Analysis number 310853
Compound Code cc 00604
Book Reference 358/139/1
Project Code adrs
Chemist Name mikem
##JCAMPDX= 6.0         $$ Bruker NMR JCAMP-DX V2.0
##DATA TYPE= NMR SPECTRUM
##DATA CLASS= NTUPLES
##ORIGIN= Bruker BioSpin GmbH
##OWNER= NMR
$$ XWIN-NMR		Version 3.5
$$ Fri Jun 24 08:44:28 2005 GMT Daylight Time (UT+1h)  MAYBRIDGE\NMR@NMR_250MHZ
##.OBSERVE FREQUENCY= 250.131544655141
##.OBSERVE NUCLEUS= ^1H
##.ACQUISITION MODE= SIMULTANEOUS (DQD)
##.ACQUISITION SCHEME= undefined
##.AVERAGES= 16
##.DIGITISER RES= 18
##SPECTROMETER/DATA SYSTEM= dpx250
##.PULSE SEQUENCE= zg30
##.SOLVENT NAME= CDCl3
##.SHIFT REFERENCE= (INTERNAL, CDCl3, 0, 16.522)
##AUDIT TRAIL= $$ (NUMBER, WHEN, WHO, WHERE, WHAT)
$$ ##TITLE= Audit trail, XWIN-NMR		Version 3.5
$$ ##JCAMPDX= 5.01
$$ ##ORIGIN= Bruker BioSpin GmbH
$$ ##OWNER= NMR
$$ C:\u/data/dgb/nmr/ADRS/4750/pdata/1/auditp.txt
$$ ##AUDIT TRAIL=  $$ (NUMBER, WHEN, WHO, WHERE, WHAT)
(   1,<2005-06-24 08:43:48.97 +100>,<MAYBRIDGE\NMR>,<NMR_250MHZ>,
      <created by zg, POWCHK disabled, PULCHK disabled
       configuration hash MD5:
       62 19 C7 07 E1 42 D1 B7 37 6C 3D D0 77 39 F9 E6
       data hash MD5: 64K
       65 C0 3B 0E FB 59 4C BC B0 21 47 AD AC C8 A0 C7>)
(   2,<2005-06-24 08:44:08.27 +100>,<MAYBRIDGE\NMR>,<NMR_250MHZ>,
      <Start of raw data processing
       ef LB = 0.3 FT_mod = 6 PKNL = 1 SI = 32K 
       data hash MD5: 32K
       C9 24 89 76 49 7F E2 2D 58 DF 23 81 62 78 66 37>)
(   3,<2005-06-24 08:44:13.71 +100>,<MAYBRIDGE\NMR>,<NMR_250MHZ>,
      <apk 
       data hash MD5: 32K
       FF BD CB 17 67 EE A0 93 DA F8 86 97 D6 B8 15 18>)
(   4,<2005-06-24 08:44:15.49 +100>,<MAYBRIDGE\NMR>,<NMR_250MHZ>,
      <abs ABSG = 5 
       data hash MD5: 32K
       41 7D 08 34 70 22 D4 7E 1E 7B 1E 0C 1F 3A 76 CD>)
$$ ##END=
$$ 
$$ hash MD5
$$ 6D 88 53 FC F6 F8 45 4A 31 DA F6 87 30 7D 26 BD
##$RELAX= 
##$RELAX= 
##$RELAX= 
##$RELAX= 
##$RELAX= 
##$RELAX= 
##$RELAX= 
$$ Bruker specific parameters
$$ --------------------------
##$DU= <C:\u>
##$EXPNO= 4750
##$NAME= <ADRS>
##$PROCNO= 1
##$TYPE= <nmr>
##$USER= <dgb>
##$AMP= (0..31)
100 100 100 100 100 100 100 100 100 100 100 100 100 100 100 100 100 100 
100 100 100 100 100 100 100 100 100 100 100 100 100 100 
##$AQSEQ= 0
##$AQ_mod= 3
##$AUNM= <au_zg>
##$AUTOPOS= <2 >
##$BF1= 250.13
##$BF2= 250.13
##$BF3= 250.13
##$BF4= 250.13
##$BF5= 500.13
##$BF6= 500.13
##$BF7= 500.13
##$BF8= 500.13
##$BYTORDA= 1
##$CFDGTYP= 0
##$CFRGTYP= 5
##$CHEMSTR= <none>
##$CNST= (0..31)
1 1 145 1 1 1 1 1 1 1 1 1 1 1 1 1 1 1 1 1 1 1 1 1 1 1 1 1 1 1 1 1 
##$CPDPRG= <>
##$CPDPRG1= <>
##$CPDPRG2= <>
##$CPDPRG3= <>
##$CPDPRG4= <mlev>
##$CPDPRG5= <mlev>
##$CPDPRG6= <mlev>
##$CPDPRG7= <mlev>
##$CPDPRG8= <mlev>
##$CPDPRGB= <>
##$CPDPRGT= <>
##$D= (0..31)
0 1 0 0 0 0 0 0 0 0.06 0 0 0 0 0 0 0.0002 0 0 0 0 0 0 0 0 0 0 0 0 0 0 
0 
##$DATE= 1119599027
##$DBL= (0..7)
120 120 120 120 120 120 120 120 
##$DBP= (0..7)
150 150 150 150 150 150 150 150 
##$DBP07= 0
##$DBPNAM0= <>
##$DBPNAM1= <>
$$ [...]
##$SUBNAM7= <"">
##$SUBNAM8= <"">
##$SUBNAM9= <"">
##$SW= 20.6930455092707
##$SWIBOX= (0..15)
0 0 3 0 0 0 0 0 0 0 0 0 0 0 0 0 
##$SW_h= 5175.983436853
##$TD= 65536
##$TD0= 1
##$TE= 295.16
##$TE2= 300
##$TE3= 300
##$TEG= 300
##$TL= (0..7)
0 120 120 120 120 120 120 120 
##$TP= (0..7)
150 150 150 150 150 150 150 150 
##$TP07= 0
##$TPNAME0= <>
##$TPNAME1= <>
##$TPNAME2= <>
##$TPNAME3= <>
##$TPNAME4= <>
##$TPNAME5= <>
##$TPNAME6= <>
##$TPNAME7= <>
##$TPOAL= (0..7)
0.5 0.5 0.5 0.5 0.5 0.5 0.5 0.5 
##$TPOFFS= (0..7)
0 0 0 0 0 0 0 0 
##$TUNHIN= 0
##$TUNHOUT= 0
##$TUNXOUT= 0
##$USERA1= <user>
##$USERA2= <user>
##$USERA3= <user>
##$USERA4= <user>
##$USERA5= <user>
##$V9= 5
##$VALIST= <valist>
##$VCLIST= <CCCCCCCCCCCCCCC>
##$VD= 0
##$VDLIST= <DDDDDDDDDDDDDDD>
##$VPLIST= <PPPPPPPPPPPPPPP>
##$VTLIST= <TTTTTTTTTTTTTTT>
##$WBST= 1024
##$WBSW= 4
##$XGAIN= (0..3)
0 0 0 0 
##$XL= 0
##$YL= 0
##$YMAX_a= 410895
##$YMIN_a= -434082
##$ZGOPTNS= <>
##$ZL1= 120
##$ZL2= 120
##$ZL3= 120
##$ZL4= 120
##$ABSF1= 16.522
##$ABSF2= -4.171173
##$ABSG= 5
##$ABSL= 3
##$ALPHA= 0
##$AQORDER= 0
##$ASSFAC= 0
##$ASSFACI= 0
##$ASSFACX= 0
##$ASSWID= 0
##$AUNMP= <proc_1d>
##$AZFE= 0.1
##$AZFW= 0.1
##$BCFW= 0
##$BC_mod= 0
##$BYTORDP= 0
##$COROFFS= 0
##$CY= 12.5
##$DATMOD= 1
##$DC= 0
##$DFILT= <>
##$DTYPP= 0
##$F1P= 14.0000005364418
##$F2P= -0.99999901652339
##$FCOR= 0.5
##$FTSIZE= 32768
##$FT_mod= 6
##$GAMMA= 0
##$GB= 0
##$INTBC= 1
##$INTSCL= 1
##$ISEN= 128
##$LB= 0.3
##$LEV0= 0
##$LPBIN= 0
##$MAXI= 10000
##$MC2= 0
##$MEAN= 0
##$ME_mod= 0
##$MI= 0
##$NCOEF= 0
##$NC_proc= -3
##$NLEV= 6
##$NOISF1= 0
##$NOISF2= 0
##$NSP= 0
##$NTH_PI= 0
##$NZP= 0
##$OFFSET= 16.522
##$PC= 1
##$PHC0= -75.58395
##$PHC1= 4.236182
##$PH_mod= 1
##$PKNL= yes
##$PPARMOD= 0
##$PSCAL= 4
##$PSIGN= 0
##$REVERSE= no
##$SF= 250.13
##$SI= 32768
##$SIGF1= 0
##$SIGF2= 0
##$SINO= 400
##$SIOLD= 32768
##$SREGLST= <1H.CDCl3>
##$SSB= 0
##$STSI= 32768
##$STSR= 0
##$SW_p= 5175.98343685301
##$SYMM= 0
##$S_DEV= 0
##$TDeff= 65536
##$TDoff= 0
##$TI= <Analysis number 999999
Compound Code 99
Book Reference 9
Project Code 9>
##$TILT= no
##$TM1= 0
##$TM2= 0
##$TOPLEV= 0
##$USERP1= <user>
##$USERP2= <user>
##$USERP3= <user>
##$USERP4= <user>
##$USERP5= <user>
##$WDW= 1
##$XDIM= 32768
##$YMAX_p= 370864559
##$YMIN_p= -69223
$$ End of Bruker specific parameters
$$ ---------------------------------
##NTUPLES= NMR SPECTRUM
##VAR_NAME=  FREQUENCY,     SPECTRUM/REAL,   SPECTRUM/IMAG
##SYMBOL=    X,             R,               I
##VAR_TYPE=  INDEPENDENT,   DEPENDENT,       DEPENDENT
##VAR_FORM=  AFFN,          ASDF,            ASDF
##VAR_DIM=   32768,         32768,           32768
##UNITS=     HZ,            ARBITRARY UNITS, ARBITRARY UNITS
##FACTOR=    0.157963299565203, 1,           1
##FIRST=     4132.6476996994, 0,             0
##LAST=      -1043.33573715361, 0,           0
##MIN=       -1043.33573715361, -69223,      0
##MAX=       4132.6476996994, 370864559,     0
$$ Real data points
##PAGE= N=1
##DATA TABLE= (X++(R..R)), XYDATA
$$ [...]
17188f789j7406j925l760L874K2858J7743j0739o218K44n363o270j0042L986R372
17174a0435Q49Mn61j5615q916m550J8213Q896K699j816j2822L363R823m546j3847
17159b9261k09N983q424r20P463R314R177L508m516r5o584j9723j5045L682R274
17144c6376J5800K1343K825j6327n921j0519j0378J0375P111J7031j390K934N492
17131B000L66M014K422M478m331j7356j3706O069J80K052j593j384k705L136J1401
17116d957j447l353K699j3772r932P237K45j9752m762J0785p89M300L98O913K1829
17101d358N745n805L634M608j5598j1096k633K083N88o17M44O081k105P088J1909
17086c2o440l553j2601k871j761m386k218J3444Q816M362m557k2370M262J8462
$$ y = [-6789, -24195, -26120, -29880, -26006, -3148, 14595, 3856, -2362, -2118, -7481, -13751, -23793, -19807, -10435, -9586, -9582, -10143, -25758, -34674, -39224, -21011, -12115, -9416, -11232, -24054, -20691, -10868, -15414, -29261, -29470, -23487, -31911, -32831, -25368, -16054, -6877, -3369, -7885, -7980, -14564, -34287, -49332, -45650, -36376, -20576, 767, 3592, -12735, -18656, -29175, -39553, -29178, -22067, -5036, -6426, -3492, 2000, 2366, 6380, 8802, 13280, 8949, -8407, -22113, -16044, -15864, -13812, -15405, -16789, -19494, -16358, -4957, -6404, -9757, -7058, -20830, -30762, -23525, -23280, -43032, -47794, -37009, -37798, -33498, -33100, -26187, -4358, 1387, -4418, -784, 3824, -11774, -22870, -25503, -23420, -22832, -23449, -23005, -16924, -19029, -11941, -32, -6472, -10025, -22626, -25497, -27258, -31644, -33862, -20418, -11602, -7240, -11797, -34167, -29905, -11443]
17072a1443Q742n741o723J0392m39q52Q023n012O929K63l484O442j0973p487k60
17057a1623j797m86M117k860M717L208j2775m575L674N134J852n198j3476k604
17043c2692O014J974P043P611K736J2055k168p861j870L351J699l36j043j1232
17029a4719j2443j5399j158Q759Q647R380L946o048j0383K200J1313L000r253
17016b2158O319Q606o604J169p466k0N787r297o347N764j2262j1506R081J3146
17002b5788O577Q163L781R245j259k235M290N707L809o823n64L744p262j2294
16988a0909l233J1364l504M069N220k073j2949N69L92l682r33J494p760k061O314
16973a7682N12k434O754j28j2927l783K3732J4580L312P475j9055j1113l980j712
$$ y = [-11443, -2701, -8442, -15165, -4773, -5212, -6064, 1959, -3053, 3876, 4139, 655, 7097, -3876, -11363, -11623, -13420, -13906, -9789, -12649, -7932, -4724, -17499, -22074, -18400, -13266, -11414, -16612, -30088, -32692, -26678, -24704, -17661, -10050, -7314, 4741, 2573, -5288, -7158, -3807, -2108, -2444, -3487, -14719, -27162, -42561, -43719, -34960, -26313, -16933, -12987, -19035, -29418, -27218, -15905, -12905, -22158, -15839, -7233, -13837, -12668, -20134, -20154, -14367, -23664, -30011, -24247, -36509, -48015, -38934, -25788, -19211, -11048, -7267, 1978, 719, -1516, 2774, 8481, 12290, 5467, 4903, 8647, 1385, -10909, -14142, -2778, -6282, -2213, 3007, 934, -12015, -11446, -11054, -14736, -15669, -14175, -21935, -23996, -17682, -17170, -19604, -12850, -12978, -25905, -29688, -5956, 8624, 11936, 19411, 356, -10757, -14737, -16449]
16959a6449J815m997M541M202P126N048L292P057R272K839j8520j4570k982N927
16945f399K371k361j3021q885J450O630K230P209J4428J4447l262j3941j0174
16932i278K451L973q704k422R207R158k361j562j1353j396P019J1171J08o04j55
16917E252o82L20l91L482n275j8444r856J393N076m441R239J9807k404p854K859
16902a919O847j5242m282K032j5952l080J6779N978m272J618q935K846J3824k644
16888f402j3252J0231J8213j0617j7368j0356R992J6869K695k292j4955k266N226
16875a4282O227P95n03l870j650N39o323Q246K766p746m638K604M806O824L506
16860b699j1641m569K0962J4848o955n152j3111l3866m135J0042L323J0210l19
$$ y = [-16449, -14634, -19631, -15090, -10888, -3762, 1286, 4578, 11635, 20907, 23746, 5226, -9344, -12326, -6399, -4028, -6389, -19410, -28295, -26845, -20215, -17985, -10776, 3652, 18099, 14837, 896, -9278, -6827, -2854, -11558, -13980, -4773, 4385, 2024, 462, -10891, -12287, -5268, 5903, 6011, 5407, 5252, 4570, 4890, 4499, 7981, 2706, -15738, -25594, -24201, -19125, -23566, -14327, 5480, 3076, -4778, -1919, 4928, -10314, -14596, -12564, -28516, -31596, -14817, -8839, -13111, -11493, -20428, -17582, -3758, -6402, -19654, -9423, 8790, -1827, -19195, -29551, -19559, -2690, 5, -2287, -17242, -19508, -14282, -8055, -7260, -7763, -11633, -13283, -12744, -19067, -10821, -8055, -15801, -20439, -17835, -13029, -6205, -2699, -14340, -18909, 2053, 16901, 9946, 4794, -8317, -42183, -46318, -36276, -32953, -22743, -23062]
16847b3062l559J284J2149J2394p502j867P783K845j7386j8964P512L413k511
16834b7471M900R362J1670L502Q956m448l888Q996p960p281J792q846j6794m947
16820c2457k534m346K130J3292J6n6q17M594L345q543o687N302Q969L615n553
16805a9730j3065N375P969J884o009K161M291R283r26p966K884J3174J2858l531
16791H652q172N676o692j6348j2722P564J1436M394j579r689K875K1876K465j1323
16777a587L254K413J68J502N359m974j0814R450J8182L43o422m714j965m726k215
16762C254j7141o73O878N162j4768o900J8556J3353o810j734j762M208p789K929
16748c237P114R740o15j1259J0550o777l785j0038o157Q999R21q554R745K632
$$ y = [-23062, -26621, -25337, -13188, -794, -8296, -10163, -2380, 465, -16921, -35885, -28373, -24960, -27471, -22571, -13209, -1539, 1963, 10919, 6471, 2583, 11579, 3619, -3662, -1870, -10716, -27510, -32457, -34991, -39337, -37207, -23915, -23899, -23955, -24772, -20178, -16833, -25376, -32063, -26761, -17792, -14177, -19730, -32795, -27420, -19451, -17567, -23576, -21415, -17124, -7841, -8767, -16733, -13849, -675, 12183, 8652, 480, 6156, -536, -16884, -29606, -22042, -10606, -6212, -7791, -17480, -14605, 7271, 9736, -1587, 1667, 4080, 4248, 5750, 11109, 6135, -4679, 4771, 22953, 23296, 16874, 12160, 10195, 5469, 3254, -13887, -14560, -7682, -2520, -17288, -24188, -5632, 7721, 911, -823, -2585, 1623, -6166, -3237, 3877, 13617, 13002, 1743, 12293, 5516, 1731, -8307, -14464, -5465, -4544, -13098, -3353, -721]
16734g21j10j256M789P894j3115K45k789p592N242j4062K25j49J1031O095J1804
16719G531o397q666j1430J0006p693j4282q154J3409K3753L344j2582Q745o049
16706h465n092j337j3616Q462L216o590R302K633K28J0949j552j0062n952P399
16692a0477m352l450N667J0751q699l553k474q389J2185J2893M468m433L805N62
16678D504L745Q692r138j245k221j1009j738j390j4548K953P468N427o527M004
16664a1023O078r367k336O812J0752r101P367J221o966P386J3986o154j6568j1747
16650a9660r93L897n439p65N136J1490m647l027r418k184n29j932O824j4682J354
16635c4575J0366J65R101J329N035j218l269J1473L986r68m733j1331r562o610
$$ y = [-721, -831, -2087, 2702, 10596, -2519, -2274, -5063, -12655, -7413, -21475, -21250, -21399, -10368, -4273, 7531, 1134, -7532, -18962, -8956, -16649, -30931, -39085, -25676, -1923, 1421, -11161, -2416, -8465, -13557, -14894, -28510, -20048, -16832, -23422, -14120, -11487, -11259, -310, -1862, -11924, -17876, -10477, -14829, -18279, -12612, -1861, -10560, -14113, -16587, -24976, -12791, 102, 4570, 137, 3942, 4504, 8249, 16941, 7803, 6558, 4337, -6672, -8410, -9800, -24348, -21395, -13927, -8500, -15027, -11023, -4945, -14312, -16648, -9836, 916, -8185, -818, 403, -6563, 823, 14809, 8655, -7913, -19660, -20653, -16756, -22195, -22960, -17824, -6334, -10981, -14008, -23426, -25610, -26139, -28071, -21247, -35929, -34575, -24209, -24044, -14943, -13614, -8579, -9797, -13066, -1593, 2393, 1425, -3308, -14639, -24201, -30811]
16621c0811J1622n022m065J0748k522m017J625J752J0306q7k881O831Q744j645
16607E78o255J105J127r61j1918r872N577J704P519J465k730k076M440K321P24
16592g252o562P004O198O259l941q841K615J3439N334l359q229p942k404j6307
16578b3988K363l06k98J1657J0095N583L426n887p991o369l283j198K920p947
16564b1223q642N125J0723k374J2578o53o051R186J2491P617N372o316j2788Q458
16550A3503k894r477r543K196N750P199J824k761m209k078J566L122J01p016q773
16535a1490p839J4126J1368j501j6670n985J57m700K2347J4695q010k332J5833
16522A9999k1339q927R179j4404J1919L588P27j6211j8344Q260J0445n462Q799
$$ y = [-30811, -19189, -24211, -28276, -17528, -20050, -24067, -22442, -20690, -10384, -10471, -13352, -6521, 2223, 578, -5677, -4572, -3445, -4406, -16324, -26196, -20619, -18915, -11396, -9931, -12661, -14737, -10297, -7976, -7252, -13814, -6810, -612, 5647, 1706, -7135, -4520, 8919, 14253, 10894, 2665, -5277, -7681, -23988, -21625, -21931, -22229, -10572, -477, 5106, 8532, 2645, -5346, -11715, -14998, -16196, -13276, -21223, -29865, -24740, -14017, -16391, -3813, -4466, -10517, -1331, 11160, 18777, 24149, 17833, 5045, 13503, 10609, 1132, -8411, -6215, -465, 6734, 8558, 5797, 1588, -490, 1076, 4198, 4299, -2717, -11490, -19329, -5203, 6165, 4664, -12006, -17991, -17834, -22534, -187, 14508, 6498, 4166, 19999, -1340, -10267, -1088, -15492, -3573, 15, 742, -15469, -33813, -25553, -15108, -20570, -11771]
16509a1771o689L827L534l672l21M002q464Q86m981M789l987r932K755J8277P455
16494d292m268L384l640M336j080k0379N935j3092j0556J3556J0547N591N16o475
16480a9917R744M96M051J6258p591j1831M449M063r696m777N726j665n957n899
16466b2546L699J5316P740L239l576J596l644n533m984J0886j852m974j4232m281
16452b3146J6710j895j1200N129p606m247n365j1099J4174K2512n648j4662P372
16439a8971J0394m2l974L311j560O493J96q82r72P792L369n4P762J0842k661k351
16423A8692k580j3426l108J3236J058j8868j0776m046L367K095K45L849J238o629
16409a5653O087K378n048Q309J0263J199o171K447P441o984j1889n910R25J0071
$$ y = [-11771, -18460, -14633, -11099, -14771, -15092, -11090, -19554, -18668, -23649, -18860, -22847, -32779, -30024, -11747, -4292, -8560, -5176, -8816, -4480, -5560, -25939, -20004, -33096, -43652, -30096, -19549, -13958, -13442, -19917, -10173, -9677, -5626, 10632, 3041, -8790, -4341, -278, -9974, -14751, -9025, -10690, -16647, -22546, -18847, -3531, 4209, 7448, 3872, 5468, 1824, -3709, -8693, 2193, 341, -4633, -18865, -23146, -6436, -8331, -19531, -14402, -22008, -26255, -31620, -42719, -28545, -6033, -11681, -26343, -18971, -8577, -8619, -12593, -9282, -10842, -4349, -4153, -5035, -6007, 1785, 5154, 5100, 12862, 23704, 21043, 18692, 16112, 2686, -422, 12814, 13872, -4996, -15772, -19818, -16451, -14356, -14111, -10262, -9024, -15653, -9566, -7188, -12236, -3927, 6336, 7535, 1364, 3811, 11252, 4268, -7621, -13531, -12606, -2535]
16395b535J0165m170q929m650J934P398n110Q036j16n759R74l807j5343O581R801
16380e530J105q469o295J1083Q022J26r304o275J3031K685r101k889K019q707
16366a8499j9731O13O73j2674J3737L3997Q618l536K116J410n54j9589p760K141
16352a9038L594L926M722R491J147j444k718O16J4038r721j0012l215l303N485
16338f432j898j4693p700P294J3852M323m67L124O662j1077J786J73L860L002
16324A809q187K088n723p216L892Q188K543l387R159J1666J8740m478M998r86
16310C3106q679j4346o439j3437k0194n891J8058K167J0665q421K023J997p527
16297a6918j6345L138J8364J5401J1109Q901q01j4720j0407j0071r398N147R397
$$ y = [-2535, 7630, 3460, -5469, -10119, -8185, -787, -5897, 2139, 2023, -3736, -2762, -6569, -21912, -15331, -5530, -4425, -12894, -19189, -8106, -84, 42, -9262, -15537, -2506, 179, -8922, -11811, -9792, -18499, -38230, -37617, -36944, -49618, -35881, -1884, 6734, 3198, 5314, 6724, 6170, -13419, -21179, -19038, -15444, -11518, -6796, 2695, 3842, 2398, -320, 296, 14334, 4613, -5399, -8614, -11917, -6432, -8330, -23023, -30723, -23429, -9577, -5254, -5721, -2597, 4065, -7012, -5226, -5053, -1193, 1809, -6378, -4290, -10013, -17229, -13337, -5149, -2606, -5993, 3166, 14832, 33572, 29094, 34092, 33106, 24427, 10081, 3642, -9795, -29989, -35880, -17822, -15655, -4990, -13411, -11388, -9391, -16918, -33263, -30125, -11761, 3640, 14749, 23650, 22849, 8129, -2278, -12349, -21747, -16600, -7203]
16284g203k391J249N646k385p974k485k83o030r751m063M008J3058J962J348l20
16269a5614L927N166o158l105J511p85P552p651j3941q934M778J1322J2200p842
16255a7574j3782q94p817L839L390J9162K2246M603n828j0833o003r345K406O41
16241a5789J2193J0436r254p311J2485j593L113l791j875p247n859j908j0129
16228b6529n790J046j995N496L123J1215R729K951j104o571p464N452R656M456
16214C671m90o160L888L477P9j215L123q416Q0L105p968J0756l813l806N109o209
16198d789j2605k484L992o980J029m029n429n590o252N587J1087J4926O728J67
16184d642R80p181l724K220K397m044m086J750R033R430O632j5109o294r556n082
$$ y = [-7203, -9594, -8345, -2699, -5084, -13058, -15543, -15826, -21856, -31607, -35670, -31662, -18604, -16642, -15294, -15614, -11687, -6521, -12679, -15784, -14273, -15058, -7506, -15157, -29098, -38032, -33254, -21932, -9732, -17574, -31356, -32250, -40067, -36228, -32838, -13676, 8570, 13173, 7345, -3488, -9491, -18836, -16430, -15789, -3596, 6840, -2414, -9725, 2760, 1167, 4280, 489, -1386, -8633, -14492, -16400, -26529, -32319, -31273, -33268, -27772, -24649, -13434, -3705, -754, -1858, -8429, -15893, -10441, -785, 3671, 3181, -2979, 909, 4386, 4465, 3250, 6373, -2043, -1963, 1142, -6826, 3930, 117, -3689, 1420, -4789, -17394, -19878, -15886, -22866, -21837, -25866, -31295, -36885, -43137, -37550, -26463, -11537, -4809, -4642, -3662, -10843, -14567, -12347, -9950, -13994, -18080, -16330, -7297, 2133, 8765, -6344, -12638, -22194, -27276]
16169b7276j020l349O928q253N829K0409R047N607j855r751j1480N353q61o804
16155a7476N257J0902N511p932J176J2835M26q229o694J1615l27j592J1476n756
16141A1192j4423l283J76o671o926P90R631J0671J2136o704j1430n510n627m071
16127b0049J1533Q087m703M314m460o441o452J0529O19j2362j9526L655J4140
16114b1116L919J28m802O191J643l4J0673L852r422j3946q329j07J6676L662r026
16099b0038J802k863P92j869o489N19m079K78P403Q821R479N654p584N151J313
16084a710n771J0116J3463O645j8073k4600r565J0765J3310O928m688l317m69
16071f966J2194p949K558K1433M590Q81p529o755k084R879K978k206M690R173
$$ y = [-27276, -28296, -31645, -24717, -32970, -27141, -6732, 2315, 7922, 6067, -3684, -15164, -9811, -10672, -17476, -12219, -1317, 4194, -3738, -2562, 10273, 10699, 2470, -4224, 7391, 7064, 5472, 16948, 11192, -3231, -6514, -6338, -13009, -19935, -19145, -9514, 1157, 13293, 6589, -4841, -10351, -15978, -20049, -8516, -429, -5132, -818, -5278, -11719, -18171, -7642, -7023, -19385, -38911, -35256, -21116, -17197, -17069, -21871, -15680, -14037, -14071, -3398, 454, -8968, -22914, -31243, -31350, -14674, -11012, -20038, -18236, -21099, -20307, -22176, -28665, -28146, -32225, -31947, -24544, -15723, -6244, -590, -8174, -3023, -1710, -7481, 2635, 16098, 22743, 4670, -19930, -29495, -18730, -5420, 1508, -3180, -6497, -6966, 5228, -2721, -163, 21270, 25860, 26741, 19212, 12457, 10373, 20252, 23230, 21024, 25714, 34887]
16057C4887m320j1750k611J1203j102j0195j1366L396n059j15J3808j308j0682
16044D786m414p444l05r184O639r37P830Q103p901r835j985J752q830O886J9146
16029D307L183j1917K619J3345K100L313Q816r295l861o130o581p973k012M919
16015e167r47q746k731n380M62P30J0231o762o646O789J3731J3551m465q876N031
16000H05M325j767l468K11j0166o486m019k264P620j1725j242J3121J3724L655
15986B324j3295l91N57J3630r010P419R885R057R182m958j3044n683J689r434
15972b072L357M54l646k542l220M375K193R381P045r430j2382L250K684o177q956
15957a5686Q124n548J564K251m894K476N649J028N562O201q822r767m757n653
$$ y = [34887, 30567, 18817, 16206, 27409, 26307, 16112, 4746, 8142, 3083, 2968, 16776, 15468, 4786, 372, -7072, -7377, -16561, -9922, -10859, -3029, 5074, -2827, -12662, -14647, -12895, -21725, -14839, 4307, 7490, -4427, -1808, 11537, 13637, 16950, 25766, 16471, 12610, 6480, -101, -8074, -10086, -5167, -6114, -14860, -17591, -22971, -22509, -21779, -11548, -18310, -24956, -18167, -4436, 9115, 4650, -4226, 805, 5130, 3363, -105, 106, -10060, -16546, -20565, -22829, -15209, -26934, -28176, -15055, -1331, 2324, -10971, -11362, -10805, 2825, -6185, 1234, 11119, 20176, 29358, 24400, 11356, 5673, 7362, -2072, 1285, 1739, -1907, -4449, -7669, -3294, -1101, 8280, 15325, 5895, -6487, -3237, -553, -6730, -15686, -7562, -13110, -11546, -9295, -14189, -11713, -6064, -5036, 526, 6727, -2095, -11862, -16619, -22272]
15943b2272M714L92R810M37J317M948n229p625M239l297M81R322m485r828n846
15928b2922k590M241P954J653q85p450p989l952l83J5678L735o09N354n683l380
15913a7228n319m027k766j553P438J4585N355j0067k551j0941J963K680J2961
15900i470Q095m001p438O11J6541j1012m267L187n006k003O883L936J054l141
15886f031L355J7184Q804o158k7870j6878N812J8708J3600l121j0619J1542O911
15873A5239j772p238l443Q502K943M908j669k564r243q062L160o811q246j0320
15859b4616J0624J908j3209j490P091K847R901O582R422k445j3999J1497j208
15846B905p500P823Q756N887j0809j3945O594N481o798j5593M773J0143p942M005
$$ y = [-22272, -17558, -17166, -7356, -6919, -5602, -654, -5883, -13508, -9269, -12566, -12085, -2763, -7248, -17076, -22922, -25512, -21271, -13317, -11664, -12549, -19999, -27988, -31940, -32323, -16645, -12910, -13519, -8165, -13848, -17228, -22547, -26574, -29340, -30893, -23455, -8870, -3515, -13582, -16133, -27074, -25111, -22431, -9470, -1375, -5376, -12814, -12203, 4338, -6674, -10941, -7754, -12760, -14763, -7880, -3944, -2890, -6031, -2676, 14508, 23312, 17154, -10716, -27594, -21782, -3074, 10526, 7405, -3214, 8328, 15239, 13467, 6229, 2786, 11288, 14231, 19139, 17470, 14906, 5663, -2399, 761, -6050, -14296, -24616, -13992, -12084, -25293, -26783, -19692, -16845, -6944, -362, 9060, 6615, -7384, 4113, 2905, -4595, 3228, 11984, 17871, 7062, -6883, -289, 5192, -1606, -17199, -12426, -2283, -10225, -6220]
15832f220l262o759L853j577l379J6266J5591j2848j5740L483J2024J8901O590
15819B6923q353l928O408P257O660q000j3176j2406l52J2720k0223n158j0425
15806b2053j4397Q867J4538L007N142K698P715j312L821l521l275o057J280M176
15792F29n475j0159o050J760J3735K181J918o836j2859J3901K3869k549j0045
15779D020l023o864j711K053J058m224L446J2070P055j442j1485j3145R324J0839
15765G971k013j3014j3314N502J702J95o677n25k098p654R568j4348O093K2109
15751f503M901k813k551j1665m80K551L25j194j997n473N712J3085R056j8291
15737a5337k79J2243o129j843Q726o228J2835o100j1600n899k143L132P119O314
$$ y = [-6220, -9482, -16241, -12388, -13965, -17344, -1078, 14513, 1665, -14075, -10592, 1432, 20333, 26923, 18570, 14642, 21050, 28307, 34967, 26967, 13791, 1385, 1033, 13753, -6470, -11628, -22053, -36450, -27583, -13045, -10038, -4896, -2198, 5517, 4205, 8026, 4505, 1230, -4827, -3547, 629, -4846, -15005, -21055, -19295, -5560, -3379, -1461, -8297, -21156, -7255, 16614, 14065, 4020, 997, -5867, -7578, -5525, -4467, -8691, -5245, 6825, 13880, 12438, 953, -12192, -2868, 7971, 5958, -7056, -20370, -14868, -13166, -12971, -19648, -20173, -22271, -29925, -20357, -34705, -28612, -6503, -1602, -4415, -6966, -18631, -19111, -16560, -16235, -17429, -19426, -24899, -19187, -6102, 2954, -15337, -15616, -3373, -9502, -11345, -2619, -8847, 3988, -2112, -13712, -19611, -21754, -18622, -11503, -5189]
15723e189k111j577k72Q813M963J752j6183n811j589J6975K2937k561j9567J110
15709A690j7524O921J059R318J4689j5440j5047q098L183J8328J0812M94p015
15696C370q567r756m811J274J2293J1502k672o234R588O17j9218j0221N774K148
15682a4913m619j3698j1262J4032P673J0390J0612o542L714M902J5147p210j2483
15669d257j4123J3867O160r093r88M406m978k970L153Q971q551m556J3654J0784
15655A1479j1339p056k337J2058N559N265M061r390o827n921k2646K477J2149
15642a2468J1628M982Q265N182o9n771j2055m37M229r583J6307M46q835j450K319
15627B690o992M960R069L341N203r228j1422j2156k489n827M896Q109N502p795
$$ y = [-5189, -7300, -8877, -9149, -336, 4627, 6379, -9804, -15615, -17204, -229, 22708, 20147, 580, 1690, -15834, -8913, -7854, 1464, 16153, 713, -14334, -22432, -19249, -921, 9891, 10385, 3370, -5197, -14953, -19764, -18490, -6197, 5305, 2633, -3601, 5987, 6604, -12614, -22835, -17061, -14913, -19532, -33230, -44492, -30460, -22787, -12397, -1785, -8327, -4613, 289, 15436, 8226, -4257, -18380, -4513, 1647, -7446, -8434, -4028, -9006, -11976, -8823, 148, -8403, -12959, 695, 11479, 140, -6916, -9253, 2805, 8364, 13629, 17690, 8300, 1473, -4448, -27094, -24617, -12468, -840, 4142, 12407, 17589, 17520, 11749, -306, -743, 3486, -6097, 10210, 10656, 1821, 371, 2690, -4302, 658, 9727, 13068, 18271, 9043, -2379, -14535, -17024, -22851, -17955, -9846, -4344, -12139]
15613a2139K513j958l292J356K683j828L390j2946n117M907N227L0814r159q016
15599c565o239K199K229O927j4202j4596m715O269R241R815M118j3976p298J5689
15585h104Q039n660Q857M563n373j0717N237N146L348l031j7717o241R330J5179
15571B856O594k026r982j1458k818K550p74j036J2194j3105k640L837p528m883
15557b8219J8998O038K1888J480l964k888K748p793j9824o197J0876P502o341
15544e696KM122J7987O071r017j3164p510j3800J801N896l12P516J846l575O806
15529a027l483M063K834l732q276K618l34M423N630L058q217j2492J0078J0133
15515E276q959n47m41j1252K004J0838J7099k03o167R76k330M014o809N872R154
$$ y = [-12139, -9626, -11584, -14876, -13520, -10837, -12665, -9275, -22221, -27338, -22431, -17204, 13610, 4451, -3565, -9804, -7605, -5376, 1551, -12651, -27247, -31962, -25693, -16452, -6637, -2519, -16495, -23793, -8104, -65, -5725, 3132, 7695, 2322, -8395, -3158, 1988, 5336, 2305, -15412, -21653, -12323, 2856, 9450, 7424, -2558, -14016, -16834, -14284, -15058, -16094, -3900, -17005, -19645, -15808, -23336, -28219, -9221, -3183, 18705, 20185, 16221, 13333, 16081, 8288, -11536, -17733, -6857, 645, -5696, -5694, -1572, 16415, 22486, 13469, 305, -7205, -21005, -19204, -13308, -13620, -6104, -4258, -7833, -1027, -4510, -447, 2387, -1345, -9621, -7003, -7337, -2914, 2716, 5774, -2443, -14935, -4857, 5276, -3683, -4230, -4671, -15923, -13919, -3081, 14018, 13815, 7648, 8624, 6294, 10308, 3499, 9371, 18525]
15500A8525j671j3224j939r69j1556k398J4743n603N603Q25P187K730k2160o005
15486a5912Q767j886P638P942m90j6564j713n785l916p029L048R015j0216P71
15472b6330J5682R926j1143n595J5936m507o642J0350o238j364M006J3276M29
15459G786j8271M397Q474N104k167K759n616K62K699q744j5786n270L955K1017
15445E99K0392l518k532j6838j9759L970J5010M165p89q460l966M561p158o280
15431b0603p322Q84J0273Q30R623O653j7848p544J0913J1251J4813k076O385L344
15417A9576j0415r938q14J1849K050M74j0034p467Q144J0672K354j7426K61o538
15403g252o368N342R313J2253Q00m860K158Q75k239l328j329O693K903r566r124
$$ y = [18525, 16854, 3630, 1691, 722, -10834, -13232, 1511, -4092, 1511, 2336, 9523, 12253, -9907, -15912, -7145, -9031, -1393, 6549, 6059, -10505, -12218, -18003, -21919, -28948, -25900, -16885, -27101, -26330, -10648, -722, -11865, -17460, -1524, -6031, -12673, -2323, -8561, -9925, -5919, 7357, 7786, -10485, -6088, 2386, 7490, 5323, 8082, 2466, 2728, 5427, -3317, -19103, -24373, -20418, 599, 20991, 17473, 14941, -1897, -21656, -17686, -2676, 1489, 700, -7760, -11726, -7165, -14323, -20603, -27925, -27041, -16768, -15938, -6315, 338, -17510, -25054, -14141, -2890, 11923, 9847, 16232, 19576, 9161, -777, -1591, 10258, 12308, 12782, 2748, -4719, 3425, 14097, 16451, -975, -714, -7252, -13620, -8278, 1035, 13288, 14088, 9228, 11386, 12261, 10022, 6694, 5365, 12058, 14961, 5395, -3729]
15388c729j4295q317J0383Q716J288R374r206r612j846J0467o077J899R951K401
15374A397J3977k928q980J506Q683j6288j196J2900l37j1776m811M419Q246K99
15360E111j1681j1852r976l594p02J2868J3216J386j193J635p199R071L378j508
15346a040p172k363J0262O555O040j377q019q105K382K216J0939P302Q23p851
15332A0592n978L086j474l420k817M89m57M621N5o615M001J788J0178r745L978
15317H282P197l35j4821p677J0578j3706O473R764K66J994J870o404j0719k152
15303i390k838M996M799M323k3062m933N621J6664p434j172n945q078j430L560
15289b4319n056K0040L938J408Q876k203K868J3323m415k607o907l879r599Q490
$$ y = [-3729, -18024, -26341, -15958, -7242, -5954, 3420, -5786, -15398, -17244, -6777, -12854, -10955, -1004, 1397, 15374, 12446, 3466, 4972, 13655, -2633, -3829, 9071, 8734, -3042, -7853, -3434, 4812, 5111, -6570, -18422, -28398, -31992, -32694, -19826, -6610, -5224, -6417, -4782, -11981, -2910, 468, -1040, -8212, -10575, -313, 6242, 12282, 10905, 2886, -5219, -2837, -621, 10318, 17620, 18443, 10592, 4614, 7700, 6226, 2806, -11, 478, 21, 4642, 4697, -1918, 2083, 3871, 14049, 4304, 8282, 15479, 15144, 323, -7354, 3224, -10482, -4009, 5755, 6021, 8015, 9885, 3481, -7238, -9390, -12228, -7232, -2433, 1890, -21172, -26105, -20484, -3820, -11254, -12426, -18371, -26449, -27879, -24319, -29375, -9335, -5397, -3989, 4887, 2684, 5552, 18875, 14460, 11853, 4946, 1067, -8532, -42]
15275d2L914o948o005n210m260j059K5132J3149k0230j633J2372r274k0014J0278
15261i830J9262Q254J401m892N268j7771j7211j3176Q892J1153J9720k33j0740
15248I7O489j556o977n26O024J62j2809j6699j3333L880R754L813O298l19M971
15233a0731J046L28m59Q452J533P50J932Q303n23p262L611j3900j4218J0719J4678
15218D259q140o801L888J0847j936q516R328J7967K455p004j1905r34J535j2913
15204g870o362Q855O793O682J1072o149r945j6229M978Q202j892m708l125j188
15190a0886l984J3298M852j0844L531L027J1577r736O1m347j7884j504O156K615
15176a4068r264M43J6967K942J2220J4839m483N049P668M245k921o700k591p164
$$ y = [-42, 3872, -3076, -9081, -14291, -18551, -19610, 5522, 18671, -1559, -3192, 9180, -94, -20108, -9830, 9432, 17686, 19087, 14195, 19463, 1692, -15519, -28695, -19803, -8650, 11070, 10837, 97, 6586, 5030, -1947, -2473, 3551, 3713, -9096, -25795, -39128, -35248, -25494, -21681, -15383, -15702, -10731, -9685, -9357, -9816, -1364, 169, 919, 2851, 11154, 10631, 3369, 6980, -6920, -21138, -10419, 4259, -3881, -10682, -6794, 4053, 2117, -6399, 2929, 20896, 23351, 16347, 4442, 3508, 5043, -7870, -14232, -5377, 1416, 8098, 19170, 13021, 3076, -13153, -8175, 27, -1865, -6573, -9698, -10886, -14870, -1572, 3280, -7564, -4033, -1006, 10571, 835, 896, -3451, -21335, -22839, -16683, -14068, -23332, -22889, -5922, -2980, 9240, 24079, 19596, 24645, 32313, 36558, 33637, 26937, 24346, 17182]
15162A7182k726k16L645Q44j8230p711j365M977K5918R85j7926o288P587j242
15148E434j6629j3385l145j953n369J677J4494J3735J3351J0542q233p674n031
15135b186m726j0831M374P141J2799P683P0k011o61r235m404m898p329N492J918
15120f804k632P267l512p781J1529q867n580J4000K1070j1298r993j401K1344
15107A7342R724n679m481J4318k881j2057q884j2086m617M904M312J3542J2850
15094B6307l275n537k688m201j992Q85K129M998N783O941j893j4849n177m212
15080C219j5568K120P759K908l577J1332Q573O551K154q98J059j4476J482o960
15066E678n841R90m913J0175J198j0853p546j1267j010R332O630M667p916j1823
$$ y = [17182, 14456, 14240, 17885, 18729, 499, -7212, -8577, -3600, 22318, 23303, 5377, -911, 6676, 5434, -11195, -24580, -27725, -29678, -35047, -33370, -18876, -5141, 8210, 18752, 10519, 2845, -2186, -6912, -17743, -13369, -6228, 6571, 14254, 14324, 12313, 11652, 2417, -1987, -6885, -14214, -8722, -6804, -9436, -2169, -5681, -13462, -1933, -10800, -16380, -2380, 18690, 7392, -2601, -4002, 17342, 27066, 21387, 16906, 31224, 28343, 16286, 7402, -4684, -9301, -4397, -85, 13457, 26307, 23032, 17495, 14807, 10606, 8614, 9499, 11628, 16626, 22409, 29350, 27457, 12608, 7431, 3219, -12349, -10229, -2470, 438, -3139, 8193, 16766, 23317, 25471, 24573, 25632, 11156, 12638, 5678, -163, 827, -4086, 6089, 7287, -3566, -11112, -22379, -23389, -14057, -7427, -2760, -10676, -22499]
15052b2499M095m551K960J1115J5592O400l858k637j1415j858j534r12J4740k693
15038B945j1631j5066O966J3462k272m647l525o728o506J2539L663p717J478n261
15024b2300M56L793J4578j8Q456K841j4889j4728J879R464J4190J1916O892m479
15010A8051j4917k559J1595n08j3976m244M608O594n245k585K567j060R96Q641
14996G958N951R394n723j3706M391J5717j0678J260N056j198r752r130l708O052
14982A884K1361o88r679r314j1691L879r655j0779J4273N919N809q984j975L603
14968f037L443Q897J1280J047R095r448k2417p974k794j1644m357K825Q812J3418
14954e854P664r674j0645q524R196J2100O675K698k754m663P579j3038r07j363
$$ y = [-22499, -18404, -22955, -19995, -8880, 6712, 13112, 9254, 6617, -4798, -6656, -8190, -9102, 5638, 2945, -8686, -23752, -16786, -3324, -5596, -10243, -13768, -20496, -27002, -14463, -10800, -18517, -17039, -22300, -21844, -18051, -3473, -3491, 4965, 7806, -7083, -21811, -19932, -10468, 3722, 15638, 22530, 18051, 3134, 575, 12170, 11662, -2314, -6558, -1950, 4644, -601, -3186, -619, -1679, -683, 7958, 13909, 23303, 17580, 3874, 8265, 23982, 13304, 14564, 19620, 18422, 8670, -460, -4168, 1884, 23245, 22557, 12878, 3564, -8127, -4248, -13903, -24682, -10409, -4490, 1319, -7665, -9640, -6037, -2594, 6303, 17583, 18630, 27725, 18277, -4140, -12114, -14908, -26552, -30909, -28084, -19272, -5854, 1810, -7864, -18509, -27033, -17837, -5737, 938, 3636, 882, -3781, 3798, -9240, -10147, -11510]
14940a1510m29J8270R63n762L089L395j4652q66M148J5623o109r78p804j4736
14926a7358O354J3365P413l000l323k70L631j0522m168n04m044K1545M694j5640
14912a827q156j35n773m128o777N135O595N169J1912Q011J819k328l932L795N144
14897A4524o858O080k540L452m391j2543O987J3681N168K092O820l883k1661m079
14883B849N142j771m075o055L300n474n397J361J0490J5186M457m948j7641P244
14869D668j4115l878j143L200j170O54J1099N984O900m428j0156R113J1870p929
14855A0669m360N913j1554N752O325N940l157k507j0210K65m333k133l86j670
14841e446J189J3058P052N003q646j3206m775m727k18j984K338M044N197Q148
$$ y = [-11510, -11939, 6331, 7294, 1532, 4621, 8016, -6636, -7502, -3354, 12269, 6160, 5182, -2622, -17358, -11004, 2361, 9774, 6774, 3451, 3181, 6812, -3710, -7878, -8382, -12426, 9119, 13813, -1827, -9983, -10118, -15891, -20019, -26796, -21661, -15066, -9897, 2015, 10026, 11845, 9517, 5585, 9380, 14524, 7666, 13746, 11206, 14658, 10267, -2276, 4711, 18392, 23560, 25652, 32472, 28589, 6928, 2849, 7991, 6220, 2145, -3910, -610, -6084, -11481, -10120, 370, 15556, 20013, 15065, -2576, 4668, -9447, -13325, -14468, -11268, -12438, -11784, -685, 5299, 12199, 7771, -2385, 6728, 18598, 10669, 6309, 12222, 668, 6420, 12745, 18685, 15528, 13021, 2811, 3076, -1257, -3390, -3776, -5446, -4257, 8801, 15853, 20856, 12210, -996, -5771, -10498, -10716, -12700, -10362, -6318, -1121, 7027]
14827G027J760k099m294p596J3078M288n35k998j315p774p755l205k892n783K011
14812a8082N371m097l541k811M191R018J129n420Q347N749O360k088P24L313k338
14797E825m142j976n796p859J561M915J3159J92P229J1217j1743j2937n689J1968
14783E924j0930j753j068l981J046l471M613M693k306Q276K9L21M690pJ697j0029
14767b256o336j0221p059J1408J2895J0705N824l818j5376m603O447O263L509
14754G382j8983o062O482J7386k195r410j0075N245K306P83N847J1727j791r715
14740a073j3609Q202P97N660L066P991R40p168K024l736p551M533J1579L536j626
14725A3565r201n233L43k677k048j848J712J0392J1078r860K139K304o880N296
$$ y = [7027, 8787, 6688, 2394, -5202, 7876, 12164, 11629, 8631, 7316, -458, -8213, -11418, -14310, -20093, -18082, -12711, -16808, -20349, -23160, -18969, -9951, -8822, -14242, -5895, -146, 6214, 4126, 4850, 8163, 5825, 1683, -293, -6089, -13948, -12387, -7472, 5687, 5879, 13108, 24325, 12582, -355, -6044, 5924, -5006, -6759, -7827, -11808, -10762, -14233, -9620, -4927, -7233, 1043, 1072, 1393, 6083, 6076, 7773, -2256, -8592, -18813, -25872, -14464, -1569, 9136, 14960, 11142, -4234, -8837, -2390, 3873, 7382, -11601, -17663, -11181, 6205, 4010, -5400, -15475, -10230, -7924, -7141, -1294, 10433, 8642, -1073, -14682, -6480, -5683, -23, 3043, 11034, 11974, 4806, 6830, 3094, -4457, 76, 11655, 15191, 13565, 4364, -869, -526, -3203, -5251, -7099, -5387, 5005, 16083, 6223, 8362, 10666, 3786, 9082]
14711I082J9598p015j7470J1903m554J130J515j886o037k2529l874O736J4463
14698A062o28N31Q586q297m48r044J688L043j055j2495p305J3630L087N827J4024
14683A2206N755o21N843j6989k714K187n950j1459J7660M429n629k458j682O705
14669G283J3167K713r34q884q627k67J2295J34K855n061r819j1757J644J4011
14655H753j9086j2838J1733P472Q723J7190K292j1289J2337J1359j1374o354k208
14642A6710M427L084n044q328k2068r02J5012J856o327l913j1j2003R374K221
14628e912o787Q62J2337N809o789O533N822k493n621K273O37J9164k893j6079
14614F863j1811J3066M428L109J4590J864k320m140p259R220q485j0345j537o219
$$ y = [9082, 28680, 21665, 4195, 16098, 11544, 12674, 14189, 12303, 6266, -16263, -20137, -13401, 1062, 434, 965, 9551, 1254, 806, -8238, -6550, -3507, -4562, -17057, -24362, -10732, -7645, -1818, 12206, 17961, 17340, 23183, 6194, 3480, 5667, -283, -11742, 5918, 10347, 4718, 2260, 578, 7283, 20450, 23163, 22229, 13345, 4718, 4451, 16746, 16880, 19735, 14674, 4855, -6902, -5258, 8753, -10333, -23171, -11438, -3966, 4757, 21947, 24239, 12950, 25287, 36646, 25272, 18918, 16710, 21137, 24221, 19177, 10849, -11219, -12121, 2891, 4747, -1580, -5493, -5504, -17507, -8133, -5912, -12699, -11837, 500, 6309, -480, 6053, 11875, 9382, 3761, 6034, 6671, 25835, 22942, 6863, -4948, 8118, 12546, 15655, 30245, 32109, 29789, 25649, 18390, 27610, 19125, 8780, 7243, 1024]
14600A024k241M576M840r468Q989L715J5655J3123P32k337p270r574j955o784
14586A3025N959K900j8930r373o608o865M929R711L348j345o067m128r70K336
14572a2078j3122J612J8738J3308r534k5890R410J1335J0722n653J7703m206p151
14559E194j950r566R027j395m007j578l792L322K527p29q076J1369L98L330J5938
14544B0012l985O23j661J055p182J74o82l683m136N015o006n161p274r314J4826
14529g379J1054n240J1247j976j6034n453R624J0035R975M056j0191m283J1596
14516A7031J4955m091j3400n184j2055n442N907O089P40N997J7973N491j6809
14503A7202o467O286K557o309j4079k361q624j223J3422J0203j261N756m615M563
$$ y = [1024, -1217, 3359, 8199, -1269, 7720, 11435, 27090, 40213, 40945, 38608, 31338, 21764, 19809, 13025, 18984, 21884, 2954, -6419, -13027, -19892, -14963, -5252, -1904, -3249, -9316, -13444, -14414, -12078, -25200, -23588, -4850, 8458, -1076, -26966, -17556, -6221, 4501, -1152, 16551, 12345, 5194, 3244, -6322, 2705, 1310, -2697, -4275, -8067, -4745, -2218, -2947, -11023, 346, 744, 4074, 20012, 16027, 16650, 14989, 16044, 8862, 9036, 8354, 4671, 535, 5550, -456, -5617, -12891, -22205, -7379, 3675, -1565, 9682, 7706, -8328, -13781, -4157, 5878, 15853, 19909, 9718, 5435, 17031, 31986, 27895, 14495, 9311, -2744, -8186, -2279, 3810, 4550, 10547, 28520, 34011, 17202, 10735, 17021, 19578, 13269, -810, -3171, -11795, -13018, 404, 10607, 9346, 15102, 10487, 15050]
14489A5050N130o017q369r436o213N745K630J1233Q606N339q707j3677K263j261
14475B316r024q534K513J4635J5677K135j3317J602k86M047j115n71J3630R54
14461B4662j0351K257J462M642j7592l744n267m643J389P396K786m451o437J1444
14447C553M127O16R510m109m698J893o933J0227J1138J2056q451p068j1406n242
14433E213j511J160K980P139J1415n273l449k064N112J0430j2246j4157n246p89
14419a286o648q380l737J6259o49j1711J512J1966K688n737K022k878q152j0520
14405b5251m257J5190J2941k12Q252n756o399O121j280j0922r092Q840N110O670
14391d5Q751M282j190r259j642N757P581J964J3037O826j5125l520j1366r690
$$ y = [15050, 20180, 14163, 5794, -3642, -9855, -4110, -1480, 9753, 18359, 23698, 14991, 1314, 3577, 2316, -6708, -15242, -12729, 1906, 17583, 19718, 6401, 8003, 7717, 11764, 10649, 10078, 23708, 24662, 14311, 16568, 18030, 22672, 5080, 1336, -3931, -8574, -7185, 211, 2997, -1454, -7891, 3553, 7680, 8296, 17806, 13697, 8999, 10892, 3959, 14186, 25324, 37380, 28929, 21861, 10455, 5213, 3702, 4862, 7842, 14981, 26396, 21123, 17674, 15610, 20722, 31152, 18906, 4749, -497, -1286, -7934, -16314, -20051, -3792, -4441, -16152, -14640, -2674, 14, -5723, -3701, -6579, -14731, -25251, -29508, -14318, -1377, -1589, 6663, 907, -5492, 629, -651, -11573, -20665, -11825, -6715, -45, 8706, 12988, 11798, 2539, 897, 6654, 14235, 16199, 29236, 36062, 20937, 17417, 6051, -3639]
14377c639K74J3341j207J530M642j438K535j529n47j3146J2012k774K040o554
14363E540P72M019M242o175k4813p473K0398J2420j574j536j185J569P677k0357
14349f476m259M935L643O076N899K756l470L936J104j857J772j2333k972p995
14335i241j6494M139J7906M892P795O756n792j03q354M272J3860k417k6903j3407
14321b3091l458l079m666K0470J1312J1340N83m589l110O18n347k70n043O846
14307a484J6893M665n856R34m384q26k223j4846M815J6289m507q873L869R628
14293A4094q589J701J8377O431q177q764q213k51o680P461k711Q541P008k63m335
14278A5630r601j551Q089M706m884K913J178j872R43M967K273J0484Q809m570
$$ y = [-3639, -3365, 9976, 8769, 10299, 14941, 13503, 16038, 14509, 13962, 816, 12828, 10054, 12094, 5540, 6312, 10331, 14573, 8398, -16415, -23888, -3490, 8930, 7356, 5820, 4635, 6204, 13881, -6476, -10735, -5800, -2157, 3919, 9818, 12574, 9104, 13040, 14144, 12287, 14059, 1726, -1246, -9241, -25735, -21596, -3690, 1202, 8997, 15753, 9961, 9858, 1504, 5776, 19636, 17219, -9684, -23091, -26549, -29628, -34294, -13824, -2512, 8828, 9411, 4822, 1712, 2330, -3017, -3287, -8330, -1484, 15409, 20074, 14218, 15152, 10768, 9942, 7719, -7127, -2312, 13977, 9470, 597, 4466, 14094, 5505, 7206, 25583, 32014, 23837, 15073, 6860, 6609, -71, 7390, 4679, 13220, 20228, 19965, 15630, 6029, 4478, 12567, 17273, 12389, 15302, 16480, 14608, 15551, 20518, 22791, 33275, 42084, 37514]
14264C7514o332j1334o459o815p031j4179J409J5576J726J70l146m760R969l594
14250B714r574M391j005N667L406n71K445N687j4938l731J146N714Q613K258m798
14235G424k3262J639J0780N23J450J1226N098L98j183l448R670J866q760j1413
14221B008m703j2606J7201j171o355l541J3692J1752o105p979Q124J6554p843
14208A9028K75R650j152q053m027P51R687j134j1930j1851l395q04J6751j298
14194A2498N90R87r036o250O008O577L065j2537j1394j3095Q963L902L146L1842
14180B5266o036k352K730p747p197m682J078J680J596j0981k413K0835M980k545
14166A4212r97n003j3084Q877M136J2535O885l930m733j6767j6063N465J2447
$$ y = [37514, 31182, 19848, 13389, 6574, -457, -14636, -13227, 2349, 4075, 4245, 1099, -3661, 6308, 2714, -6860, -2469, -3474, 2193, 5599, 5028, 7473, 13160, -1778, -5509, -4363, 1351, 9964, 12222, 7424, -15838, -14199, -3419, -2896, -1446, 9780, 14878, 15276, 14093, 10645, 20315, 22181, 13421, 2008, -2695, -15301, 1900, 729, -5626, -9167, 4525, 16277, 10172, 2193, 10317, 26871, 19028, 19303, 28953, 27801, 19748, 15721, 16472, 26159, 25025, 13095, 1244, -2151, -2955, 13796, 12498, 13088, 14075, 5039, -1211, 4797, 11374, 14439, 1902, -9492, -22587, -13624, -9722, -6576, 25266, 19230, 16878, 19608, 11861, 4664, -18, 1060, 2740, 4336, -6645, -9058, 11777, 16757, 14212, 13215, 8212, -4872, 4005, 8141, 20676, 27561, 23631, 18898, 2131, -13932, -8467, 3980]
14153C980L483P44J3860J0068n329o701j7860j1524j5736l155J7328J2073l886
14140b655J256J3612N092J481k845j0470q970O455k265J611K683P568Q062o149
14126A4466n965k0035Q832J2339N047N872j4446j0136O170J9571o021j4038n779
14113d123l470k953L926L888J4401J4045M877m154j921j6105O214K213j0137o99
14099F002j2666m649l356M112K5507J2499j3267j5988O80R234l008o376L224Q126
14085A0074j3127k455O236l87k64o592j631j978O480p241q224N879J0094j793
14071d929P853j699J3460K435j6295j0481J7206J3474n668j0049Q101J2398J1128
14058C6934j5133q890Q490K929m6q737q450M924J4230n114M284q49m057j1361
$$ y = [3980, 7463, 8207, 22067, 32135, 26806, 20105, 2245, -9279, -25015, -28170, -10842, 1231, -2655, -1399, 12213, 17305, 18786, 15941, 5471, -3499, 2956, 691, 2302, 4985, 12553, 20615, 14466, 8501, -11534, -2702, 9637, 14684, 20556, 6110, -4026, 2144, 21715, 15694, 1656, -4123, -7593, -10546, -6620, -2732, 11669, 25714, 30591, 26437, 24516, 8411, 14625, 16838, 6701, 6002, -6664, -11313, -14669, -10557, 14950, 27449, 14182, -1806, -1126, 8108, 5100, -1276, 1948, 10074, -3053, -5508, 728, 341, 77, -6515, -8146, -10124, -3644, -10885, -19109, -13230, -3136, -4929, 2924, 1225, 14685, 17120, 825, -9656, 7550, 21024, 15356, 5307, 13408, 25806, 36934, 21801, 12911, 21401, 24330, 24284, 15547, 7097, 12021, 26251, 21137, 25421, 24572, 20515, 9154]
14044I154m803M929Q558q83M844J091r536n899n93P66j0813n37k454l668L421
14029f423N434M035k543R909Q521L663j461o830q775k881L379P371J1682J1071
14015C6152k231r247m305k42N02n162k489k4072M567K4028K597k0899k804J08
14001c497L926j584j171J6022l330p362M725K4876J001q410j5631n777m28Q306
13987A1666J1581Q011J548j2174j1315J5563Q767J982o839j8078N895J1584j2505
13974A5686j431J206j84J548j0208m144k415K070J1600L966Q741L713j4397k762
13960A2989J2655K2311j0198j1728p159K84l687k326J726K565n596j2447o327
13947f938k169j0878J024K6163O840n739q267p255K891q278q743J3467L123l1
$$ y = [9154, 4351, 9280, 17838, 16955, 21799, 22890, 13354, 7455, 6862, 7628, -3185, -3722, -6176, -9844, -6423, -989, 3046, 503, 10412, 18933, 22596, 21135, 14305, 5530, 2649, 6028, 13399, 25081, 36152, 33921, 24674, 20369, 20127, 20629, 15467, 12978, -11094, -6527, 17501, 20098, -801, -3605, -3497, 429, -1155, -2326, 13696, 10366, 3004, 7729, 32605, 33606, 25196, 9565, 3788, 3360, 11666, 23247, 31258, 32806, 20632, 9317, 24880, 33647, 35629, 28790, 10712, 16607, 28191, 15686, 14255, 15461, 15277, 16825, 6617, 2473, 58, 2128, 13728, 17694, 26435, 30148, 15751, 12989, 25644, 47955, 37757, 26029, 18870, 19154, 15467, 13141, 14867, 17432, 11836, -611, -6938, -9107, -19985, -18961, 7202, 14042, 8303, 36, -7219, -4328, -12606, -21349, -7882, -4759, -4790]
13933d790J2535J3178N640k513o404k362o14M839R599L422o045p895P66j0043
13919I313j4689K492J973J4005l435K129j2524P975P294l803L427Q061m69q933
13905A2816j0089J0225m4O351R576l69j2459o215l33J642j0845j0329J5841M128
13891I896R30J64L284J0474n743p23M450j732j520J0691l202r001j9743k121n780
13876i676l615J172J0319J3217J0344J5903R087r398j7261J540o431j2055j4138
13863a0992K211J3688Q186M263r1q678j6620L291k559L330o009L750J3013J2529
13849A9312l76j115l732N987n918n983Q697m525O130L608N60L346j0437j1088
13835D466N244n32l507M5r93k77r489L385K1143M708j795K551N863r423m882q01
$$ y = [-4790, 7745, 20923, 26563, 24050, 17646, 15284, 14670, 19509, 29108, 32530, 26485, 18590, 19356, 9313, -5376, -2884, -911, 13094, 9659, 11788, -736, 7239, 14533, 10730, 14157, 22218, 21749, 12816, 2727, 12952, 12908, 19259, 28835, 28466, 16007, 9792, 9459, 11101, 256, -10073, 5768, 9896, 10826, 10990, 14274, 24748, 19005, 18282, 22732, 21000, 19480, 30171, 26969, 17968, -1775, -3896, -9676, -13291, -12119, -1800, 11417, 21761, 37664, 46751, 37353, 20092, 21632, 15201, 3146, -10992, -8781, 4907, 13093, 17356, 17265, 8587, -8033, -4742, -7301, -3971, -9980, -6230, 6783, 19312, 18936, 17821, 14089, 20076, 14158, 8175, 16872, 12347, 18477, 22085, 22645, 25991, 15554, 4466, 9710, 9178, 5671, 5716, 4723, 4446, -5043, -1658, 19485, 24193, 22398, 24949, 30812, 21389, 16507, 15706]
13819A5706L73J105j447L522P851q02j719j2079r067k335n111K083l711J7892
13805A2261j56j8638n958J2391J132J2806J1775j7100k828p556q090J1905J4974
13792A6918r825l042J2069L903o678J128j0809M530J3727k226o739L405n893j1462
13778i94j044j226K210K424L075R798J2848J455j4250l359m898K043K953M628
13764A5663o977k304m495K046J3555m990k965R188N121j0186j3208p322Q733k747
13750h88n526J1567R634J3745O702p376j5068n208j0886q015M821O292O575O071
13736A2440O072o597P414r37R102m007q481j077j3J7702J0285m771l029k436k155
13721B9512p191N059o573j4941Q973j816r515o749j8J572N691J5126k920L924
$$ y = [15706, 16079, 17184, 15737, 19259, 27110, 26308, 24589, 12510, 3443, 1108, -4003, -1920, -5631, 12261, 12105, -6533, -12491, -100, 1032, 13838, 25613, 8513, 5685, -1871, -9961, 1944, 16918, 7093, 4051, 16120, 20023, 13345, 14473, 3664, 8194, 21921, 19695, 12956, 16361, 10468, -994, -2038, -3264, -1054, 1370, 4445, 14243, 27091, 28546, 14296, 10937, 6039, 8082, 11035, 15663, 8686, 6382, 1887, 3933, 17488, 12498, 9533, 18721, 23842, 13656, 448, -6874, 1859, -888, -6414, 5153, 14787, 28532, 35234, 27858, 12790, 7582, -3304, -11319, -6498, -206, 6369, 12440, 18512, 11915, 19329, 18392, 27494, 23487, 15006, 13929, 13916, 31618, 41903, 37132, 34103, 31667, 29512, 22321, 27380, 20807, 5866, 14839, 13023, 3508, -3241, -3259, -1687, 4004, 19130, 16210, 20134]
13707B0134q093P46J3361l796M261p43r643j7346L934J3839j2968m229m995J2856
13693G318J0319j0181r179J612J644N225J3847m270J0349O746j3165l279J2399
13680B9385M016o919O749L8k1777l657Q530q738M889M803P761l339J969M255M251
13665C2216L75l991o34q319M752N594j0695j2313N730O730l443p680j2608j074
13651e360N661P01q355j56l428M499k564L163J3508P963o546P30k429q387j1344
13636a2344M125J6394M452K54m297k862p726R920Q030j1997q573L319M622L721
13622G038j2347J151n790O227R489L486K381J4271j283m340J0669N56j1363J961
13608B2106m465j0524P668L359J7604q052m898m611o241R785j119j0725M911J6661
$$ y = [20134, 12041, 12787, 26148, 22352, 26613, 25870, 16227, -1119, 2815, 16654, 3686, -543, -5538, 7318, 17637, 7456, -1723, -111, 1533, 6758, 20605, 16335, 26684, 33430, 20265, 16986, 29385, 33401, 26482, 33231, 33269, 11492, 7835, 16365, 7627, 12516, 17319, 25080, 21741, 23710, 27965, 32216, 32591, 28600, 27966, 19647, 24399, 29993, 19298, 6985, 12715, 19445, 16002, 8322, -4286, -5360, 301, 1002, -7353, -7509, -10937, -6438, -9002, -5839, 7669, 15632, 9086, 9816, 7387, -1000, -12344, -8219, 8175, 12627, 12881, 8584, 5722, -2004, 7916, 15946, 3949, -4624, -1305, 3317, 7038, -5309, -4158, -9948, -3721, 5768, 9254, 11635, 25906, 24623, 20283, 30952, 31508, 20145, 22106, 17641, 7117, 14785, 18144, 35748, 27696, 22798, 18187, 11946, 21731, 20612, 9887, 14798, 31459]
13594C1459o77j0839l171J6803M948j0968n805J2212O358j8551j3989N183k719
13581A0244M401K0553J628q423j2602n41J3247j0263q777n619N602J2458J3061
13568C4969m528J703K551n05k0382n548M969q247O172Q964l659M264O939q336
13554A9326l708J2022l32N94K188J124K966L585m383L302P715k581j32O612L224
13539E1522m754Q444K1052K514q065p209N351J7154J4537M054N917N088j0720
13526A04885P21K1292K6214M0964M6630O4395J24894J15453L3770o4049j14849
13515D00320r1120m8471l1504j8640j5497j8730m459j0367j9223o995l0N083r961
13502A30406j1138m39M642J32J2182k645l358M173J3972K7149J0636M888Q429
$$ y = [31459, 30782, 19943, 16772, 33575, 38523, 27555, 21750, 33962, 40320, 21769, 7780, 12963, 10244, 14645, 35198, 36826, 28403, 15801, 15260, 28507, 18244, 9467, 3848, 9450, 21908, 34969, 30441, 32144, 34695, 34190, 13808, 8260, 13229, 4982, 11154, 20118, 16459, 20723, 27662, 19326, 15618, 27640, 27308, 27902, 30090, 31214, 34180, 37765, 33382, 36684, 44399, 41818, 41686, 48298, 51522, 46768, 55212, 76264, 78778, 70713, 63504, 68855, 86009, 100546, 104600, 110517, 115605, 104885, 105606, 126898, 153112, 194076, 240706, 305101, 429995, 545448, 579218, 515169, 400320, 309200, 260729, 229225, 210585, 195088, 176358, 171899, 161532, 142309, 135314, 135284, 140367, 130406, 119268, 118829, 123471, 123603, 135785, 133140, 129782, 133955, 147927, 175076, 185712, 190600, 199029]
13489A99029K0673J9680Q399J7473J5349J9857J0065P783j060J8501N4402Q5116
13477D75267J21192J85504K05048J36306k0650j56568j91485j54854j13349p5385
13467D11026n4901k5436k1980j4993j7999j3129k0165m993m466m068j6044j1436
13455B01416o079o182o78J1239Q202M807o461L744p507j1371M448J4859J5239
13442B25676J8469nN032J2732Q919j016J151Q499M3382O6086P9596J12563Q2575
13429F63659j6957j05459r9094p8190n3419l2063k4563j9322k3620j9335j8109
13418A73528j4491j5481j0625K97M213j3067l865K944p462L484J58l795n962j2611
13404I7265j1798o932M873K0125R465p291l221Q384P646k164j1287n2r966j882
$$ y = [199029, 219702, 239382, 247781, 265254, 280603, 300460, 310525, 318308, 317248, 335749, 390151, 475267, 596459, 781963, 987011, 1123317, 1102667, 946099, 754614, 599760, 486411, 411026, 356125, 330689, 308709, 293716, 275717, 262588, 242423, 237430, 232964, 228896, 212852, 201416, 195337, 189155, 188477, 199716, 207918, 212725, 206264, 210008, 202501, 191130, 195578, 210437, 225676, 244145, 244140, 249172, 261904, 270823, 269807, 270958, 279457, 322839, 388925, 468521, 581084, 663659, 646702, 541243, 442149, 363959, 310540, 278477, 253914, 234592, 210972, 191637, 173528, 159037, 143556, 132931, 133228, 137441, 124374, 120509, 123453, 115991, 119475, 119633, 115838, 109876, 97265, 85467, 78535, 83408, 103533, 112998, 105707, 102486, 110870, 118516, 116352, 105065, 105013, 95047, 93165]
13390I3165k483j887q738o681M055j3847j0659P627p02j347M875k006j1872l982
13376D5518m171K137K756j3023q803M272J5885k979k0006p876n147J3690n656
13363A6597J738k205p478l568J612J7395J2659n319r378j2606J3733J6888l259
13350C6809J2221J1178k251j990j5367r185j0786J1933J1049l847l440L574m383
13337C5515j2627j0728J4302J0255j5363j3760J2970J3623L634q50j7211p281
13325A2479J055J2412M707j4186J406l33N454M087K844n19Q875J4798j5439j8932
13311A8708l931j055k058R003O896K766L521N757K085k443p279n843J0260R141
13297D5528j2260o642M519n773j1103J0169O933M758M530q793p347O68J585p751
$$ y = [93165, 90682, 88795, 80057, 73376, 77431, 63584, 52925, 60552, 59850, 58503, 63378, 61372, 49500, 45518, 41347, 43484, 46240, 33217, 24414, 28686, 44571, 41592, 21586, 13710, 8563, 22253, 16597, 18335, 16130, 8652, 5084, 6696, 24091, 36750, 31431, 22053, 9447, 23180, 40068, 36809, 49030, 60208, 57957, 55967, 40600, 31415, 20629, 32562, 43611, 39764, 36324, 39898, 35515, 22888, 12160, 26462, 36717, 21354, 7594, 20564, 34187, 37821, 36971, 19760, 12479, 13534, 25946, 30653, 16467, 17873, 17540, 22994, 27081, 29925, 29406, 38281, 53079, 37640, 18708, 14777, 13722, 11664, 20667, 27563, 30329, 33850, 39607, 41692, 39249, 31970, 26127, 36387, 45528, 33268, 26626, 31145, 25372, 14269, 24438, 31371, 36129, 40659, 31866, 24519, 25187, 26772, 19021]
13283A9021r541r875M068J0262k579r59K258q320j0180r562p57K6560J2550q253
13269A4693k247L280O053m690M145J792q196j2829N704R859O911n918q365j6372
13255f180l897J1021K3476L824L07n283l025K291J7727j876p740N054O339r579
13241C2459j6218q204J3051m577O099R952j3306R72k375j0035k4J5782R135j2839
13227A9872j4566Q69P939N453N324r793o508J4114K111P788m117L25K63j7526
13213A1548o636k733O148O161l546p930P656J2302o279k166m494p484J085P124
13199A0756J674R650J0048J1888P207o811j3065Q326J5670m336n085j8686n428
13186B1808j0427m65N105J39Q029N65p599P734j0450o087n714r353J343Q032P881
$$ y = [19021, 9480, -395, 3673, 13935, 11356, 10397, 12655, 4335, -5845, -15407, -16164, 10396, 22946, 14693, 12446, 15726, 21779, 17089, 21234, 23026, 14830, 2001, 7705, 17564, 24475, 18557, 10192, -6180, -10077, 944, 24420, 28244, 28551, 23268, 20243, 22534, 40261, 38385, 30645, 35699, 42038, 32459, 16241, 8037, 21088, 16511, 22610, 32562, 19256, 20228, 17853, 7818, 7794, 23576, 32711, 19872, 5306, 6175, 14114, 19567, 24891, 15098, 8590, 22704, 24815, 32603, 28486, 28811, 29074, 11548, 4912, 2179, 8327, 14488, 10942, 3012, 10668, 22970, 16691, 14525, 10031, 2547, 3632, 10756, 12430, 22080, 32128, 44016, 51223, 44412, 31347, 39673, 55343, 51007, 45922, 27236, 21808, 11381, 10916, 16021, 16160, 24189, 24754, 17155, 24889, 14439, 8352, 2638, -6715, -5372, 2660, 10541]
13171A0541J3848J0081j6384j8569j163J4459O504l374J862l193J0794Q443r078
13158B4771m075k885M928q163O127R043m667j578J1068J2188n413J737M754j1649
13144C6186j0056k058l738Q145j2403m316p090O300R6o622L808J5795J9241O198
13130D9486j7257o246K249k892M75K602o444K882J4126k292k267j4100n513n160
13116I649m974P866J620Q43j734J5242N050j716n703j2970p965N911J0291J3489
13102C4899N837q927p285O897M585Q07J52Q634m896j4252o31J306J5263n996J018
13087C7411Q67L353L881n996M243O529o068j705r094p08k53n186N459N735Q353
13072D6821o368q369J672K363r15p1N888Q467l328j2893j3082p717Q274l34K736
$$ y = [10541, 24389, 34470, 18086, -483, -1646, 12813, 19317, 15943, 17805, 14612, 25406, 33849, 24771, 20696, 17811, 22739, 14576, 20703, 29746, 25079, 23501, 34569, 46757, 41344, 43081, 47835, 36186, 26130, 24072, 20334, 28479, 16076, 11760, 4670, 10970, 11066, 4444, 8252, 24047, 43288, 49486, 32229, 25983, 28232, 25340, 25815, 28417, 21973, 24855, 38981, 36689, 34422, 20322, 14809, 9649, 4675, 12541, 14161, 15004, 13270, 28512, 33562, 31846, 26143, 13173, 5208, 11119, 21410, 34899, 40736, 31809, 24524, 31421, 36006, 36813, 36965, 45599, 40703, 26451, 25820, 27126, 42389, 36393, 37411, 38278, 41631, 45512, 39516, 43759, 50288, 44220, 42515, 33421, 32713, 32460, 27274, 32733, 38468, 46821, 40453, 32084, 33756, 36119, 35204, 35133, 41021, 49488, 46160, 33267, 20185, 12468, 20742, 20408, 23144]
13057B3144N140k906j961r66K960n205j0137K917L407J3112k508O782J146n724
13043B9201K844K570J627m985O763N410Q153k773J173K952l007o593k226j1976
13029B9133L969O976r018j7245m627j741J5460M442L829j3691j0530j913m299
13016G45P958P053J2743J2943N450j9943l333j2281k083J4244j3505j0307M397
13003D081J224J3360N03J364K871J6168J5959n098j6684m901N524L164j5771k338
12989A9426K311P484R02j8096J0813M522M08K53L28r162m455J2786N975j1553
12975B1942j4393J301K748m298L42K8381j599j1506J5363O114Q387m792m722j2070
12961C1198j426j879l697n640o70Q856O830N27j0730N008O726L850N19r806j7826
$$ y = [23144, 28284, 25378, 23417, 22451, 25411, 20206, 10069, 12986, 16393, 29505, 26997, 33779, 34925, 29201, 32045, 34615, 36242, 31257, 38020, 43430, 51583, 48810, 49983, 52935, 49928, 43335, 41109, 29133, 33102, 40078, 31060, 13815, 9188, 7447, 22907, 27349, 31178, 17487, 6957, 5044, 745, 8703, 15756, 28499, 41442, 46892, 26949, 23616, 11335, 9252, 23496, 9991, -316, 4081, 5305, 18665, 19168, 20532, 23403, 39571, 55530, 50432, 33748, 28847, 34371, 37535, 21764, 19426, 21737, 29221, 30123, 12027, 22840, 27362, 27770, 28023, 28351, 19189, 14734, 27520, 33495, 21942, 7549, 8850, 11598, 7300, 7642, 36023, 34424, 22918, 38281, 44395, 52782, 47990, 43268, 31198, 29772, 27893, 24196, 18556, 17886, 26742, 33572, 34099, 23369, 28377, 35103, 38953, 39472, 29666, 11840]
12946A1840L472q06k83R106J4789R196l244j2088k886L803K77J513k151J18O624
12931C9280R010N243j510k601j3456m333j0986Q663n794q40P808j4980J352R003
12917B5859l972J762Q673Q554j5265n06K0465n839o57l0747O822K1360m344j201
12903C0964m871l695J4127m669p944O692j2898j3921k852N688O248K60q476o492
12889a839k03P619J4829J3726k013o329K729J3058J1026n02r275P339J034j0090
12875D1109N835M860j705j2643l09K17n325p673O552O167J1385K784r201j0674
12861C1379R939m283j0068m68O272m57o25N055l355O592J5428j6896j5927p212
12847A5374r87j0300M938J1832L775q742j2707O360j148l795n180K997R689J0208
$$ y = [11840, 15312, 14506, 14223, 23329, 38118, 47314, 44070, 31982, 29096, 32899, 33176, 34689, 32538, 32656, 39280, 48290, 53533, 52023, 49422, 35966, 31633, 20647, 29310, 23516, 22676, 30484, 15504, 16856, 25859, 21887, 23649, 32322, 40876, 25611, 25105, 45570, 39731, 39074, 8327, 15149, 36509, 32165, 30964, 26093, 22398, 36525, 31856, 23912, 30604, 17706, 3785, 933, 6621, 12869, 13129, 4653, -1839, -2042, 5577, 20406, 34132, 32119, 25790, 28519, 41577, 52603, 52101, 42826, 50165, 51199, 41109, 46944, 51804, 50099, 37456, 37147, 37364, 32039, 24366, 30918, 37085, 48470, 51254, 42053, 31379, 41318, 37035, 26967, 26499, 32771, 32314, 31689, 36744, 33389, 39981, 55409, 38513, 22586, 15374, 14387, 4087, 9025, 20857, 24632, 15890, 3183, 9543, 8395, 4600, -580, 2417, 12106, 22314]
12833B2314N784J187q458o958K578R138P391k182l290j603J1112M872J582n482
12819C7985N406o426j486j816l923n025n620J609m11J539J009p42J0005L103l392
12804C1815n747k348o156L081J5015J0482n632J804J1770k565l430n490o524K305
12790C8380l727j8589q769J5064J028m391J5644M20q4J0260k191j2359K243J98
12776C3127j84L825L717O313L929K928j4796L599M807k879j3262n704L983N80
12762B9983K404P355K0816M057q543r263q307j2520L055K945L218m635m110J701
12748B8156M901M750n352j422p215j0257P017r04L13N728P810k537o664n763j363
12733A7198J6291N009j0569l977J6175J6093O43j1102p307L800m186m407M960
$$ y = [22314, 28098, 29285, 20827, 13869, 16447, 25585, 32976, 30794, 27504, 25901, 37013, 41885, 43467, 37985, 43391, 36965, 35479, 33663, 29740, 24715, 19095, 20704, 20293, 21832, 22841, 22099, 32104, 35207, 31815, 26068, 23720, 17564, 20645, 35660, 46142, 40510, 42314, 54084, 51519, 48089, 42599, 36075, 38380, 34653, 16064, 7295, 22359, 23387, 18996, 34640, 35060, 34976, 45236, 43045, 30686, 32929, 33127, 32943, 36768, 40485, 46798, 50727, 53655, 38859, 42458, 47265, 44386, 31124, 25420, 29403, 29983, 32387, 39742, 60558, 64615, 56072, 46809, 38502, 25982, 29037, 31982, 35200, 30565, 26455, 28156, 33057, 37807, 32455, 31033, 23818, 13561, 20578, 19674, 19987, 25715, 33525, 30988, 24324, 18561, 17198, 33489, 38498, 27929, 23952, 40127, 56220, 56863, 45761, 38454, 42254, 38068, 33661, 38621]
12720C8621R32j2990O506J4184l52L104j103m047m499p048r362J386J488j611
12706B5209r029N663N536O016j470M382m99L214p741j3021J371O534J2005J2138
12692E0308k219j3086K150o918m82M897q541R785Q4p897k976K786M389j4891J541
12677A8930Q408O944K69M758O363n506j4629M918L723Q450k822j718J75j2853
12663B5410K2453Q843o578j2116n343M389l022J016L12R339P218m760j3324K792
12649C6629Q543K760q514M29p32M759m608n655K988r180j62L271N960k032N54
12634C5010p521j313O376J139K035l856j664l640m265M260Q103P864j4269J553
12620B9812l475N357R30Q153j1151O478K905N212n18q50q867L201J2978J4685
$$ y = [38621, 39553, 26563, 33069, 47253, 46901, 50005, 48902, 44855, 40356, 33308, 23946, 25332, 26820, 25209, 16180, 21843, 27379, 33395, 31925, 36307, 35808, 39022, 31281, 18260, 19631, 26165, 38170, 50308, 48089, 35003, 37153, 30235, 29753, 34650, 26109, 35894, 35978, 28081, 25105, 27891, 32280, 17389, 18930, 27338, 34282, 34551, 39309, 45672, 40166, 25537, 30455, 34178, 42628, 39806, 38088, 38263, 25410, 47863, 56706, 50128, 38012, 32669, 37058, 34036, 35052, 35364, 44703, 51921, 47161, 33837, 36629, 45172, 47932, 39418, 39847, 39115, 43874, 39266, 33611, 36599, 27419, 27257, 30528, 36488, 34456, 35010, 27489, 26176, 32552, 33691, 35726, 31870, 30206, 26566, 22301, 26561, 34664, 42528, 28259, 29812, 26337, 31694, 32624, 40777, 29626, 36104, 39009, 44221, 43703, 42853, 33986, 37187, 50165, 64850]
12606F4850m379j7224j0306J816R533m102r434J1529o77J2003M764l585K462K458
12592E9708P882r56n045m887o735r375j1192K865K626n901j3162O93l398N261
12578A8384l628P536J5836R013K774n101n790n675K422M403n15j4036P551P431
12564D0605l278oL540j612j028r52J2090O401J329j284j3780j5652j273J000j857
12549B4243J4526kl313L761P384J6566R18o884M99p573j2729n024M017M689n86
12534D0492j311J1685K335o424o873j1183k717j251r62l759Q064K0270m035k272
12520D2059j1157K462j347r039J4297J5573p184k4379j3161J2135P439J754M355
12507C3807O340J907J678m4J6162m713j0697K065n432R303l852k18p391n446j265
$$ y = [64850, 60471, 43247, 32941, 34757, 44290, 40188, 30754, 42283, 41606, 53609, 58373, 54788, 57250, 59708, 67590, 66634, 61589, 56702, 49967, 40592, 29400, 32265, 34891, 28990, 15828, 16521, 13123, 18384, 14756, 22292, 38128, 47141, 49915, 44814, 39024, 33349, 35771, 40174, 39659, 25623, 33174, 40605, 37327, 37321, 40861, 39249, 38221, 37269, 49359, 55760, 57089, 55805, 42025, 26373, 25100, 26100, 24243, 38769, 38767, 35454, 39215, 46599, 63165, 64083, 57199, 57698, 50125, 37396, 32372, 36389, 41078, 40492, 39181, 50866, 53201, 46777, 39904, 28721, 26004, 24753, 23791, 20032, 28096, 48366, 44331, 42059, 30902, 33364, 32017, 22978, 37275, 52848, 45664, 21285, 8124, 20259, 27698, 29452, 33807, 40147, 42054, 43732, 43688, 59850, 55137, 44440, 46505, 41073, 50376, 46524, 46306, 38915, 33469, 32204]
12492C2204P875O707J4570k626q848o465p247M652Q749l470k010O411o582p904
12478C6016K40L881j1454O001K730n63j862J476J3296J6423j1461N270j718j2020
12464D6255o92o543k949Q173n88J053r951l620o029o275n86J1474Q993j476j0597
12449B6642M263q553p128j13Q068P068J248m507O992N429k067p179j0206j057
12435A8900J2226J971m200k494J2524J2045L37r387r114R67R818L238N036j0235
12421D1632Q697j698j7442k686J523R68J5126Q327k507p09m649O945o410j3703
12407C3414K341M150l443J6941N486M026k089L003k128j2508j0616L406Q507J4286
12393F4776J0659j5674p339L030o445O404m486j2910P73P78r18k806J150J4397
$$ y = [32204, 40079, 46786, 61356, 58730, 49882, 43417, 36170, 40822, 49571, 46101, 44091, 50502, 43920, 36016, 36256, 40137, 28683, 34684, 37414, 36851, 34989, 36465, 49761, 66184, 54723, 59993, 58275, 46255, 45563, 39020, 36071, 44244, 43656, 44709, 34758, 31138, 25109, 18834, 18248, 29722, 38715, 37239, 26642, 30905, 22352, 15224, 15111, 23179, 30247, 31495, 26988, 33980, 39409, 37342, 30163, 19957, 18900, 31126, 33097, 28897, 26403, 38927, 50972, 51309, 41922, 32808, 33775, 43593, 46831, 51867, 41632, 50329, 48631, 31189, 28503, 30026, 30994, 46120, 54447, 51940, 51231, 46582, 53527, 47117, 33414, 35755, 39905, 36462, 53403, 58889, 62915, 60826, 63829, 61701, 49193, 38577, 41983, 50490, 64776, 75435, 59761, 52422, 55452, 49007, 55411, 50925, 38015, 38788, 39566, 38648, 35842, 36992, 51389]
12379E1389J4762J1471q232j9812p753k868N929O770O242j560k201m734o574q041
12365C4788N754N749K998J0628m683j0403m411q376R384J6645R240j7002m569
12352D5742p4J6194m376J919J607j1786n530m00M6j269O546L753r101L806j4360
12337C2717l639J769L681l830j1745K986Q796P577l533J2310J5221m29m366k615
12323E4900p262j530O707P697j1837l522p160N071P527o425J124j0877j6715K798
12309B0496J0670k499K541P398n540l883L011K0146P950j4641j9162O347J0197
12296D3031P632p614j8738N40K645j1559J5529K3399o55r981q599j760N644P904
12282D7418p90l310L417N336p070j7128j5317q433O341J0664J4522J2931L200
$$ y = [51389, 66151, 77622, 69390, 49578, 41825, 38957, 44886, 51656, 57898, 56338, 54137, 49403, 42829, 34788, 40542, 46291, 49289, 59917, 55234, 44831, 40420, 32044, 41428, 58073, 67313, 50311, 45742, 45668, 61862, 57486, 59405, 61012, 49226, 43696, 43296, 43342, 42073, 48619, 52372, 43271, 47077, 32717, 29078, 30847, 34528, 30698, 18953, 21939, 30735, 38312, 34779, 47089, 62310, 61881, 57515, 54900, 47638, 46108, 52815, 60512, 48675, 45153, 37993, 43064, 50591, 44166, 45290, 34413, 17698, 20496, 31166, 28667, 31208, 38606, 33066, 29183, 32194, 52340, 60290, 45649, 26487, 32834, 43031, 50663, 43049, 24311, 24851, 27496, 15937, 31466, 54865, 54210, 44229, 35630, 33870, 39514, 47418, 46628, 43318, 46735, 52071, 45001, 27873, 12556, 4123, 10464, 21128, 35650, 48581, 51781]
12269E1781j9756J43Q136l489k616R762r064m258l317J4696O872q115L639O231
12255E0645l207m304j1931M709M466Q028j536o838j504K244J0548M098k979o385
12241D6054j2611l477J9531K6736J16j3072L083j701j0149j1246n301q994L69
12228B9338L127J2638O200J170k917j028J879p156p916P47O551j891o702q2J2023
12213D5981N758J753q649k0402p13R909n25J8347Q070p638k507L595R205L128
12199F5312j229k1582j823Q633P249q881j6176N255O040O64L896K205L890M461
12185E7914J0402n382K91K214j537M613o97J55J1253o27j6352j3918n316K804
12171D5817N890L127o951r766J1301J075n36l58n555k972J10L872k543p926N842
$$ y = [51781, 32025, 32168, 40304, 36815, 34199, 43961, 34897, 30639, 27322, 42018, 48890, 40775, 44414, 50645, 47438, 43134, 31203, 35912, 40378, 48406, 46870, 40032, 38528, 40772, 51320, 55418, 52439, 46054, 33443, 29966, 49497, 76233, 76349, 63277, 66360, 64659, 54510, 43264, 37963, 28969, 29338, 32465, 45103, 51303, 52473, 49556, 48528, 50407, 43251, 35335, 36082, 42633, 40742, 34040, 33958, 45981, 51739, 53492, 44843, 24441, 23728, 33637, 33112, 51459, 59529, 51891, 49384, 52979, 62184, 65312, 64083, 42501, 40678, 49311, 56560, 47679, 31503, 36758, 42798, 43462, 47358, 49563, 53453, 57914, 68316, 62934, 63225, 65439, 63902, 68515, 67818, 67973, 79226, 78599, 62247, 48329, 43013, 45817, 51707, 54834, 47883, 38117, 49418, 50493, 49957, 49599, 44044, 41072, 41182, 45054, 42511, 34585, 40427]
12156D0427n337Q853m07J462j2411p451Q508J4619M692P676J023j1665N521R170
12142F4680k401m184p810p437J3419Q669K086M111k056M322R541m357j0381L110
12128G1312O341k339l519L069r260j1400J1720O795n914J358M304Q265N02k0273
12114F0961j6798O047J0202O301K050L151n360n672l372Q16J680k448K2379J3035
12100I2972P65k714q177p503J1p807j0872o828L628M823R279m672j697m335J2999
12085F9872j079n413m379j0594l678M430J7460J2308r579j3820M819Q349n797
12072F2899K018o405r231M637R096l881n293J131r958j730O672P581m666j0223
12058D2647J045J1594Q071P54J144j929N476L04j0783q286O664J1130K082r004
$$ y = [40427, 35090, 43943, 43536, 44998, 32587, 25136, 33644, 48263, 52955, 60631, 61654, 49989, 55510, 64680, 62279, 58095, 50285, 42848, 56267, 64936, 67022, 71133, 69077, 73399, 82940, 78583, 68202, 71312, 77653, 75314, 71795, 74864, 65604, 54204, 65924, 72719, 66805, 68163, 72467, 80732, 81234, 60961, 44163, 50210, 60412, 66713, 68763, 71914, 66554, 60882, 57510, 58326, 60006, 57558, 79937, 92972, 93737, 91023, 82846, 75343, 75354, 67547, 56675, 49847, 53475, 58298, 67577, 62905, 61208, 56873, 69872, 68793, 63380, 59001, 48407, 44729, 49159, 66619, 78927, 69348, 55528, 60347, 68696, 62899, 64917, 58512, 49281, 53918, 63014, 59133, 53840, 54971, 45013, 43283, 49955, 57536, 52870, 42647, 43692, 55286, 63357, 64111, 65255, 63326, 68802, 69106, 58323, 50037, 56701, 67831, 69913, 60909]
12044F0909n703j352l805m722M864k661M975n902o155J1002j218n859P796m494
12030D7675p607N856J1734K616P62L667J784N246J391j3272L730Q850k490r389
12016F0553r277J2419Q763Q406N660j0417o518P08m515j2330r12M405Q035Q993
12002G3973R17p952n417L296M80P52n823p869M438O366J8466j0869J1405L11q20
11987H1654p987j5994l652N868M167K724j2522o958N927J813M169J0578m388k4679
11973D0720L6R007j522P153L54J844n276J4776L700j0523j7193L715J2402r389
11959D9804o771Q529J4549K823j664J735k211n079n336K413J1497l422M906L400
11945G5173R256J3626J555j749J787q814M124n544K391j2144l953M024j6596j9540
$$ y = [60909, 55206, 53854, 50049, 45327, 50191, 47530, 52505, 46603, 40448, 51450, 50232, 44373, 52169, 47675, 40068, 45924, 57658, 60274, 61036, 64703, 66487, 71733, 73124, 59852, 63582, 72432, 69942, 60553, 51276, 63695, 72458, 80864, 86524, 76107, 69589, 70297, 65782, 53452, 52540, 56945, 64980, 73973, 74890, 66938, 61521, 64817, 65297, 66049, 60226, 52357, 56795, 63161, 81627, 70758, 82163, 82474, 81654, 73667, 57673, 54021, 59889, 64056, 66780, 54258, 47300, 53227, 55040, 59209, 69787, 65399, 40720, 40756, 49763, 48241, 55394, 55748, 57592, 52316, 67092, 70792, 60269, 43076, 46791, 59193, 49804, 43033, 51562, 66111, 68934, 67270, 69005, 66794, 61715, 56379, 58792, 70289, 66867, 71773, 75173, 84429, 98055, 99610, 97861, 99648, 90834, 94958, 89414, 91805, 79661, 75708, 79732, 63136, 43596]
11931D3596Q876K2530m531j6271R768q03o260P634M125j0652r304J2061J1223
11918G1992j175j0160R898R283J2563O449k784j4395n202j4428l776M988j1158
11905E2095r237L034R673M295M20J214R984l767j993J4988n721K046L608R593
11891I0232p98r215o828o642J310l239j7329n3l85O985J4952L466O840j165p320
11876G0811j1292K016J0354O159r011Q74R51P379k516k596p127k150J3596O011
11862H3459l228L674M873n666M098P235l853j0014j1492Q423N037J0026n162l146
11848H4264j98O88n483o084j1154n625J4732L714j0326p56J4762j292r199q477
11834E9566J1691M040N538O048l067m284J077P790P483L294p345q370n187p389
$$ y = [43596, 52472, 75002, 70471, 54200, 63968, 63165, 56905, 64539, 68664, 58012, 48708, 60769, 71992, 70817, 60657, 70555, 79838, 92401, 98850, 96066, 81671, 76469, 62041, 58265, 63253, 52095, 42858, 45892, 55565, 59860, 60280, 61494, 71478, 67711, 65718, 80706, 74985, 77031, 80639, 90232, 89434, 80219, 73391, 66749, 68059, 64820, 47491, 47438, 47053, 54038, 68990, 72456, 79296, 78131, 70811, 59519, 61535, 71889, 78048, 69037, 69911, 70862, 78241, 75725, 73129, 66002, 63852, 77448, 83459, 80231, 83905, 88778, 83112, 87210, 94445, 90592, 80578, 69086, 77509, 82546, 92572, 87410, 84264, 84066, 84754, 79271, 73187, 62033, 56408, 71140, 74854, 64528, 63772, 78534, 77242, 68043, 59566, 71257, 75297, 80835, 86883, 83816, 79532, 80609, 88399, 95882, 99176, 91831, 83461, 78274, 70885]
11820G0885J0405l165N121N314J3044j3214K400P305R015l247j8414r586J1340
11807H7203K133j089k072j0143q93N043m355N24l14j126J0111k596p924l236O820
11792G8086M175M108J1942J0071L16j3860k11R155r640j2152M818R2j2383m141
11778G0376k69m631J670Q62P394K281J4438J4361j0974o166j936l436M439O368
11764I4777n716Q9L640j1652k573Q652k176J479r88n136N420N322N01j1356j0851
11749F9432n950M984J5230n780L810M604P102j4505n999J0058m583j867n98j3136
11735F2802J0879J8412k682m592Q9o036Q5M889k946k06J8206P358n014j1598l834
11720H5812j78j118j635J3385N917o197K831J5320m366j4733r734J6326J1462
$$ y = [70885, 81290, 78125, 83246, 88560, 101604, 88390, 90790, 98095, 107110, 103863, 85449, 75863, 87203, 89336, 88247, 86175, 76032, 75139, 80182, 75827, 76351, 76037, 74911, 85022, 82426, 74502, 71266, 78086, 82261, 86369, 98311, 108382, 108698, 94838, 94627, 103782, 94142, 81990, 86808, 86900, 74517, 70376, 70107, 65476, 67146, 68008, 75402, 77683, 92121, 106482, 95508, 89342, 87406, 83970, 88409, 94777, 89061, 89150, 92790, 81138, 78565, 87217, 85041, 86520, 85532, 80396, 85816, 91138, 91639, 80283, 69432, 63482, 68466, 83696, 77916, 81726, 86330, 93432, 78927, 72928, 82986, 78403, 76536, 75938, 62802, 73681, 92093, 89411, 84819, 84908, 78872, 78957, 83846, 80900, 80694, 98900, 106258, 101244, 89646, 85812, 85634, 84516, 82881, 96266, 102183, 95986, 98817, 114137, 109771, 95038, 85304, 101630, 113092]
11707A13092j1478r90J907r91L109o578P632j562j0706l082r48p922q406k455
11693G0622m707q80J4412M778N362L502n015o287j0570O505P53q242P214J4256
11679I1703L538m147Q580p80o640p017m830O484R430K938K438P559j2022r059
11665H8175O76p140o900O609K815L693m810l654J4307J7210o364j1623j6452j521
11651G5021J3414K916l496K637Q539P139R702m067M277r405r881J661m489j0584
11637H3384q850M595J5488N731r85o867L379o405r243L22P839P152N155M481k916
11622A02260R560J1074n55N630j1037p930K602m422N673o780o378M599K721k026
11608A04991L392k505j390l836j110p041J35K188P160K91O173o671k253R126O409
$$ y = [113092, 101614, 100624, 102531, 101540, 104649, 98071, 105703, 104141, 93435, 90353, 89405, 81483, 73077, 70622, 65915, 65035, 79447, 84225, 89587, 93089, 88074, 81787, 71217, 77722, 78475, 70233, 77447, 91703, 95241, 91094, 99674, 98894, 92254, 85237, 80407, 86891, 96321, 99259, 101697, 109256, 97234, 88175, 88851, 81711, 74811, 81420, 84235, 87928, 83118, 79464, 93771, 110981, 104617, 92994, 76542, 75021, 88435, 91351, 87855, 90492, 99031, 106170, 115872, 111805, 116082, 106677, 96796, 98457, 93968, 83384, 74534, 79129, 94617, 100348, 99363, 92496, 95875, 89470, 80227, 80549, 88388, 95540, 100695, 105176, 102260, 111820, 122894, 122339, 127969, 116932, 109002, 111604, 107182, 112855, 106075, 99697, 104296, 107017, 104991, 108383, 105878, 104488, 100652, 99542, 92501, 92636, 94824, 101984, 102275, 108448, 101777, 99524, 108650, 115059]
11593A15059l560L018O420O596K229n589r388m680N263M847Q216j0319j8362J885
11579A01635J2584o935l265n188Q231n171o435P426N527R460p274p058l877k799
11565I6861R263O80K995n413q331J1833P830P546R9m919l200l564L208K3l262
11550A11649m751k222P717Q284j4982L764N508j181J2389k958o537j1736p375
11537I7569J0503P794J5927J0919J376q805j8240j3579K704L381p409N957k186
11524A05911l40l265L763J3294P973l495j4350j3075J713r393l757q69j033J2284
11510I5361J6108N892K1657L835j2869r563j082J02P285R092j1363j0351p586
11497A06518M326J5214k036p200K972m033R737J4834m187k396Q294m81Q16Q021
$$ y = [115059, 111499, 114517, 120937, 127533, 129762, 124173, 114785, 110105, 115368, 120215, 128431, 118112, 99750, 101635, 114219, 107284, 104019, 98831, 107062, 101891, 95456, 102882, 108409, 117869, 110595, 103537, 99660, 96861, 106124, 106804, 109799, 104386, 96055, 107888, 115718, 123264, 123363, 118444, 115244, 111680, 114888, 114911, 111649, 106898, 104676, 112393, 120677, 105695, 109459, 114967, 113786, 126175, 123217, 116680, 104944, 97569, 108072, 115866, 131793, 142712, 144088, 135283, 117043, 103464, 106168, 109549, 102140, 108097, 105911, 105571, 102306, 106069, 119363, 127336, 123841, 109491, 96416, 98129, 88736, 84979, 84110, 83077, 95361, 111469, 117361, 139018, 142853, 129984, 120421, 119339, 119441, 126726, 135818, 124455, 114104, 106518, 110844, 126058, 124022, 116822, 119794, 115761, 125498, 140332, 136145, 133749, 142043, 141562, 142378, 150399]
11483A50399m149l609o037J684p714l469J2137N777J0829l383j739J1309k795
11470A59240o994q894m465k896n946r036j0509j77K445J3102J6732P365O641l217
11456A53391o247j6853j4260L69j3415J4750N003o807R366m040o918M462k847
11443A15954p444J2723R146K434l90P076K836j0741k712j304m342N706o00r307
11429A19035l285n32J9469o218L950O522n337p003P534n693k481N309k337j7018
11415A11915J699J6490j132J0526M942j4382q215P839J6595J436R296J3864j953
11402A68920k6288m354N126L570K136J66l950M70O65L421J741o623n436P84J6279
11387A56627o75J720L222k849p226p537j1225K599J2453N137P243P445J2567N031
$$ y = [150399, 146250, 142641, 136604, 138288, 130574, 127105, 139242, 145019, 155848, 152465, 150726, 162035, 159240, 152246, 143352, 138887, 135991, 130045, 121009, 110500, 110323, 112768, 125870, 142602, 149967, 156608, 153391, 147144, 130291, 116031, 116400, 102985, 117735, 122738, 115931, 125297, 121257, 114339, 118801, 115954, 108510, 121233, 130379, 132813, 132423, 139499, 142335, 131594, 128882, 127578, 123236, 128942, 128342, 119035, 115750, 115218, 134687, 128469, 132419, 138941, 133604, 126601, 134135, 128442, 125961, 131270, 128933, 111915, 113614, 130104, 128972, 139498, 144440, 130058, 121843, 129682, 146277, 147713, 157009, 170873, 168920, 142632, 138278, 143404, 146974, 149110, 149276, 145326, 145796, 146461, 149882, 151623, 145000, 139564, 140348, 156627, 155952, 157672, 160894, 158045, 150819, 143282, 132057, 134656, 147109, 152246, 159489, 166934, 179501, 184532]
11373A84532j5053k5007o030K374O900l677k833k717K125M724K9509J2106k209
11360A84744k4294j5880p373j001J597N706O694k739K719P934j619K536J5163
11347A74187Q196o345j1631M082J094l988J636J510n87O659K4046m51q661j3087
11333A76660l309M371J1384L362p822n110L283j486q92n90k123l451J823K557
11319A78657N556J4093M106j031L133P413k36Q23j5492q827J6320P367j0032j0334
11305A91516n480j505L860L621q403j0752N464m860J337J4719J8411M630j276
11292B11282j3982n775J7140J763R971l629j5401m339M734j936l148J31K65Q602
11278B05678O484J6699J3619k666j2223P71N411J6808K8578K4060N180O153J577
$$ y = [184532, 169479, 144472, 138442, 140816, 147716, 144039, 141206, 138489, 140614, 145338, 174847, 186953, 184744, 160450, 144570, 137197, 136196, 137793, 143499, 150193, 147454, 150173, 158107, 156488, 159024, 174187, 182383, 176038, 164407, 168489, 169583, 165595, 167231, 168741, 168154, 174813, 198859, 198408, 189747, 176660, 173351, 177722, 189106, 192468, 184646, 179536, 182819, 181333, 180441, 179851, 177728, 174277, 176100, 178657, 184213, 198306, 202412, 201381, 204514, 211927, 211691, 212514, 197022, 188195, 204515, 211882, 201850, 191516, 186036, 184531, 188391, 192012, 183609, 172857, 178321, 173461, 174798, 189517, 207928, 212558, 211282, 197300, 191525, 208665, 210428, 220399, 216770, 201369, 197030, 201764, 199828, 196680, 196811, 197076, 205678, 212162, 228861, 242480, 239814, 227591, 228362, 233773, 250581, 279159, 303219, 308399, 314552, 316129]
11265C16129P772K1375J3514K6437L2228K4951L5866L6538K5690J4022K8471N5376
11253F38369Q3543J21339J62762K43517L34383L61552K67761L0316k25714l45892
11243A671936l11007k37274j61413j01531q1239p8811m5889l1820j9599j5270
11233E88083j9569j9411j4103j0978j4115j2753j3883m030K987k117j0710m357
11221D65044n326p636P294R568k102J2476n068n703n662l121j2201k004j2838
11208D32721j9454k1107j4082j4873j6524j0147k649j743k008j0161K936p173
11196C15736j4171r341J854j2030r674N589o704j7174N712P013O52k28o195p997
11182B53042q994k420j755J6533K9865K6771K983J0284o817N38k3028k6853j3372
$$ y = [316129, 323901, 345276, 358790, 385227, 417455, 442406, 478272, 514810, 540500, 554522, 582993, 638369, 721912, 843251, 1006013, 1249530, 1583913, 1945465, 2213226, 2243542, 2017828, 1671936, 1360929, 1123655, 962242, 860711, 779472, 700661, 654772, 622952, 603353, 588083, 568514, 549103, 535000, 524022, 509907, 497154, 483271, 479241, 482228, 480111, 469401, 465044, 459718, 452082, 459376, 468944, 466842, 479318, 474250, 468547, 462885, 459764, 447563, 445559, 432721, 413267, 392160, 378078, 363205, 346681, 336534, 333885, 332142, 330134, 319973, 322909, 315736, 301565, 292224, 294078, 282048, 272374, 277963, 271259, 254085, 259797, 266810, 267462, 267234, 261039, 253042, 244048, 241628, 239873, 256406, 286271, 313042, 316025, 326309, 319492, 320030, 297002, 270149, 256777]
11169B56777j0754Q401J0599K289j4858n604n670K646J63Q761L057o139L306j1525
11155B41449o491L520o280p431N349m937l2174j9665l6708l3750P608K7574J1664
11142A49728J1756K1871P703M035l890Q470R288J1040L1140K6047J3365k881j8031
11129B69641j842K330o9J1911J4167J8892Q542l629l972p999j3044j3644j2491
11116B68793m537L994Q893q615J0163K0264J1005r645M164Q758Q282J6143J4311
11103C51973J0480J2736J6392J3432K5786K8283K5734L6625N7761N5933M8521
11092F83656O1024O5483M7859K7422J0502L322k9461o4397n9106n7500o3057k4238
11080F01509l0761l5817k7493j7481k1571l0860k1599r112J50J556n291j1414
$$ y = [256777, 246023, 254424, 265023, 267312, 252454, 246850, 241180, 243826, 243989, 252750, 255807, 249668, 252974, 241449, 234958, 238478, 232198, 224767, 230116, 225179, 193005, 173340, 136632, 102882, 110490, 138064, 149728, 161484, 183355, 191058, 195093, 191203, 199673, 208961, 220001, 251141, 277188, 290553, 287672, 269641, 267799, 270129, 270060, 281971, 296138, 315030, 323572, 319943, 315971, 307972, 294928, 281284, 268793, 264256, 268250, 277143, 268528, 278691, 298955, 309960, 300315, 304479, 313237, 321519, 337662, 351973, 362453, 375189, 391581, 405013, 430799, 459082, 484816, 521441, 579202, 635135, 683656, 744680, 810163, 858022, 885444, 895946, 899268, 869807, 805410, 746304, 688804, 625747, 601509, 570748, 534931, 507438, 489957, 468386, 437526, 415927, 406815, 406965, 408521, 403230, 391816]
11068C91816k2687n277N859M14j2684m012R721J1654J3970J4184K675R757J7802
11055D33192J4774k2092k9558j4928P783M658l165M70J1397J334l205N937P345
11042D13942o303L198J1118K2850J3526j3166j4543j5401j8318j2347k4761m739
11030C55056J7225K1110L1237M5048L1940L1010R980O311j274l7143l7023q558
11018D64919K938Q058P208L501K0895j5124j3457k3844k2904j2473l035j0049
11006D06633J3849J8992K6244K6264Q299m172j275r286J3249J3140K7444K6786
10994E66167L0362N0447M8424K5780j6846n4149p9334o3710l7560k5058l128Q726
10982D50121K0848J9045J3906L2833J3141O132p098j7305l463j381K147P291R482
$$ y = [391816, 369129, 363852, 369711, 370125, 357441, 353429, 363150, 374804, 388774, 402958, 405633, 415390, 433192, 447966, 425874, 396316, 381388, 389171, 393829, 390664, 391134, 402531, 403865, 400660, 406597, 413942, 407639, 410837, 421955, 444805, 458331, 445165, 430622, 415221, 396903, 384556, 359795, 355056, 372281, 393391, 424628, 469676, 501616, 532626, 542606, 548917, 547643, 510500, 473477, 464919, 467857, 475915, 483123, 486624, 507519, 492395, 478938, 455094, 432190, 419717, 416682, 406633, 420482, 439474, 465718, 491982, 500281, 496109, 494834, 485548, 498797, 511937, 539381, 566167, 596529, 646976, 695400, 721180, 704334, 650185, 570851, 507141, 469581, 444523, 441395, 450121, 470969, 490014, 503920, 536753, 549894, 556026, 548928, 531623, 528160, 526779, 528926, 536217, 545699]
10969E45699J0999J7129K3887R056K0003J4569K2766Q108K634R430J1377j982
10957F93675L385J9711o773r324j1989M84L689k019N649L927Q309L4461K2243
10944G65428Q671J7301R832J0642L0280M3256L1810J4899J7962K3725L1970L9887
10932A045663L4051M8532P7189Q0667Q6496Q2635Q0427P4408O6718O8559O0031
10921A805376O5577R2681P0004Q7220R4394R1130P3222O6032O1677P2105J10312
10910B689730J62013K33490L31856M13677M05157K79229J8547k31980l06446k19554
10900C775719j35826p7708m5441m8873l6360j1776K620J5343K7903O048K3182
10889C494831M6434O3820N8795O8859P9760R0130Q3162J00313J08144J19353J38519
$$ y = [545699, 556698, 573827, 597714, 606770, 626773, 641342, 664108, 672216, 674850, 684280, 695657, 693675, 697060, 716771, 709998, 700674, 688685, 689169, 692858, 690839, 696488, 700415, 708724, 743185, 765428, 774099, 791400, 801232, 811874, 842154, 885410, 917220, 932119, 950081, 973806, 1005776, 1045663, 1079714, 1128246, 1205435, 1286102, 1372598, 1455233, 1535660, 1610068, 1676786, 1745345, 1805376, 1870953, 1963634, 2033638, 2120858, 2215252, 2306382, 2379604, 2445636, 2507313, 2579418, 2689730, 2851743, 3085233, 3417089, 3830766, 4235923, 4515152, 4533699, 4301719, 3995273, 3775719, 3639893, 3562185, 3516744, 3467871, 3431511, 3419735, 3422355, 3437698, 3465601, 3471649, 3494831, 3541265, 3605085, 3663880, 3732739, 3812499, 3902629, 3985791, 4086104, 4194248, 4313601, 4452120]
10878D452120J52497J57504J46209J51387J73095J87098J85015K08700K49545
10869F063170K94632L25761L16300L35797L99051M97381O17157P42259Q67055
10860A0458563J036019J270752J590399J934653K237642K456772K698961L085191
10852B6768952L637900M221033M688530N040509N197398N106420M929645M865740
10844F4456127N156089O043229P915270J1621307J8393995K9607833M5509530
10837A88703380O2090739O7506427M7877730M686283l9451769o1128644n7609024
10830B12675122m2982920k9356090k0128695j4517773j1109657q828514p068803
10823G8682670n634341m496299l651914l058668k664430k395736k146403j857160
$$ y = [4452120, 4604617, 4762121, 4908330, 5059717, 5232812, 5419910, 5604925, 5813625, 6063170, 6357802, 6683563, 6999863, 7335660, 7734711, 8232092, 8849249, 9591508, 10458563, 11494582, 12765334, 14355733, 16290386, 18528028, 20984800, 23683761, 26768952, 30406852, 34627885, 39316415, 44356924, 49554322, 54660742, 59590387, 64456127, 69612216, 75655445, 83570715, 95192022, 113586017, 143193850, 188703380, 250794119, 318300546, 366178276, 370864559, 331412790, 270284146, 212675122, 169692202, 140336112, 120207417, 105689644, 94579987, 85751473, 78682670, 73048329, 68552030, 64900116, 61841448, 59177018, 56781282, 54634879, 52777719]
10815E2777719j521072j198120r73589r63257j049970j105945j013612p64700
10807D4187454m62294j41791J62159M44584M95999K30174k80695q68909j390014
10798D2376667j825989k121891k198140k158523k058988j932580j820088j692233
10790B6568235j569866j481770j373755j270490j170888j095997j039481r74283
10782A6591705q86616q31665p84012p48999p10396o90993o60439o40593o01154
10773A0036838n50280n09847m77512m33013l95791l48431l28900l36463l32337
10764F324264l21470k85557k66416k72237k20159k02696j90159j81526j68836
10755D215208j50593j46064j20106r6885r5993j05654j07438j38103j51163j66580
$$ y = [52777719, 51256647, 50058527, 49084938, 48121681, 47071711, 45965766, 44952154, 44187454, 43725160, 43583369, 43745528, 44190112, 44686111, 44916285, 44635590, 43766681, 42376667, 40550678, 38428787, 36230647, 34072124, 32013136, 30080556, 28260468, 26568235, 24998369, 23516599, 22142844, 20872354, 19701466, 18605469, 17565988, 16591705, 15705089, 14873424, 14089412, 13340413, 12630017, 11939024, 11278585, 10637992, 10036838, 9486558, 8976711, 8499199, 8066186, 7670395, 7321964, 6993064, 6656601, 6324264, 6002794, 5717237, 5450821, 5178584, 4958425, 4755729, 4565570, 4384044, 4215208, 4064615, 3918551, 3798445, 3701560, 3605567, 3499913, 3392475, 3254372, 3103209, 2936629]
10745B936629j79979j75981j63067j47809j18976j14931j13010r7358q8851q1402
10735A655265p4873q0148p1456p8515q0080o8027n8489n3089n9107o7361m6264
10724I17856k9240j8091j6604j5118m396K0618K6229L5990L3048N4616O8053Q4826
10712A157787O9446M7842J2709l4457n6124o2142p7933q6341o8410o6969l6256
10701G99152k2681l3498j2922k0768k7650l5662m1955m0949k9763k0799k255Q246
10689E18496J8671M6046N3625O3244N0297J4597j4338m9021o9409q3358l9617
10678E09233q978N1696Q2352J03632P5692L2472K7765J4498J9780J1449K5171
10667I44762M4873N1650M6046N2733N5741L2836J2644j0047j1499o454j539K164
$$ y = [2936629, 2756650, 2580669, 2417602, 2269793, 2150817, 2035886, 1922876, 1825518, 1736667, 1655265, 1580392, 1500244, 1428788, 1350273, 1270193, 1202166, 1143677, 1090588, 1031481, 964120, 917856, 888616, 870525, 853921, 838803, 834407, 855025, 881254, 917244, 950292, 1004908, 1072961, 1157787, 1227233, 1275075, 1287784, 1253327, 1197203, 1135061, 1057128, 970787, 902377, 835408, 799152, 776471, 742973, 730051, 709283, 681633, 645971, 604016, 563067, 533304, 512505, 510250, 518496, 537167, 583213, 636838, 700082, 750379, 764976, 750638, 701617, 632208, 548850, 509233, 500255, 551951, 634303, 737935, 813627, 846099, 873864, 888362, 908142, 919591, 944762, 989635, 1041285, 1087331, 1140064, 1195805, 1228641, 1241285, 1231238, 1219739, 1213285, 1211746, 1213910]
10655A213910J6907K1851L8907N1904J5197n5314q8222r7812r4615p5492k6527
10644I20694J3190K8985L6875N2959L5462L1120k074k0487j0960l4715l4853l0178
10632I86018l9678k2975p032p904M554L024J3896J0763K2445K2738P380M17l454
10619I90192k5925l2209k1189q280q285l5338l0816j0682r689n510J6812K5368
10607H44449K4125K6286K15k05Q503J0671L35J1197J8909L7419M3660L4706O4809
10594A125079Q5957O9083N7138L5893N2762P7722J01930J14559J12016P1218J0895
10583A914252O061q751J6572K9854L0436K2162K0850J2154J4022K0460K5753L9848
10571B143673N0448N2726L8419L0792L9904L3943L1431K5759M2501N4514O0398
$$ y = [1213910, 1230817, 1252668, 1291575, 1343479, 1358676, 1303362, 1215140, 1117328, 1022713, 947221, 920694, 933884, 962869, 999744, 1052703, 1088165, 1119285, 1117211, 1096724, 1085764, 1051049, 1016196, 986018, 946340, 923365, 916333, 908429, 912983, 916007, 929903, 940666, 963111, 985849, 993229, 993646, 990192, 964267, 932058, 910869, 902589, 894304, 858966, 828150, 817468, 807779, 802269, 819081, 844449, 868574, 894860, 895075, 894870, 903373, 914044, 914379, 925576, 944485, 981904, 1025564, 1060270, 1125079, 1211036, 1280119, 1337257, 1373150, 1425912, 1503634, 1605564, 1720123, 1832139, 1903357, 1914252, 1920313, 1911562, 1928134, 1957988, 1988424, 2010586, 2031436, 2043590, 2057612, 2078072, 2103825, 2143673, 2194121, 2246847, 2285266, 2316058, 2355962, 2389905, 2421336, 2447095, 2489596, 2544110, 2604508]
10560B604508O8355N8597N9705N8984N4611L3495L2846K6888L3342N2738O6279
10549C150348P7423Q7457J15853J31729J48056J51440J40263J40572J31575J56449
10539D431165J97264K17104J78969J67564J51657J54448J71607J91249J83233
10530F044260J95940K40276K98347L51723M00593M53997N37373O45386P51309
10521I919204Q62848J037284J307120J655371J984162K216678K393276K637924
10513B4013867L101490L702924M291508M778906N118801N290948N253092N065805
10505F0617341M946352N189711O032722P929540J1715283J8688101L0216954M6563642
10497A91899646O3420762O8006695M5925733K99426m3573180o2574918n6428052
$$ y = [2604508, 2672863, 2731460, 2791165, 2850149, 2904760, 2938255, 2971101, 2997989, 3031331, 3084069, 3150348, 3227771, 3315228, 3431081, 3562810, 3710866, 3862306, 4002569, 4143141, 4274716, 4431165, 4628429, 4845533, 5024502, 5192066, 5343723, 5498171, 5669778, 5861027, 6044260, 6240200, 6480476, 6778823, 7130546, 7531139, 7985136, 8522509, 9167895, 9919204, 10782052, 11819336, 13126456, 14781827, 16765989, 18982667, 21375943, 24013867, 27115357, 30818281, 35109789, 39888695, 45007496, 50298444, 55551536, 60617341, 65563693, 70753404, 76786126, 84715666, 96430949, 115119050, 145336004, 191899646, 255320408, 323327103, 369252836, 369552262, 325979082, 263404164, 206976112]
10490B06976112m0981849k7709779j9104901j3943427j0735180q500895o838973
10483G9161108n599885m643122l891423l280213k783469k386035k067690j780780
10475E2728491j468853j133437q94034q55780r69858j062484r82922p37643m24358
10466D4199122q3546K39476N09704N61133K57256l17707r74296j538776j962802
10457D0889564k211220k257559k201191k099413j969767j831635j709982j591778
10449B5017019j478929j371852j286350j196869j112796j028551r49472q85732
10441A5706468q47951p83908p38168o89371o59838o57006o25147n71009n28210
10432I605860m77179m43925m17034l86651l54509l36624l12184l04359k59664
$$ y = [206976112, 165994263, 138284484, 119179583, 105236156, 94500976, 86000081, 79161108, 73561223, 68918101, 65026678, 61746465, 58962996, 56576961, 54509271, 52728491, 51259638, 50126201, 49232167, 48376387, 47406529, 46344045, 45361123, 44623480, 44199122, 44115576, 44355052, 44864756, 45425889, 45683145, 45365438, 44391142, 42852366, 40889564, 38678344, 36420785, 34219594, 32120181, 30150414, 28318779, 26608797, 25017019, 23538090, 22166238, 20879888, 19683019, 18570223, 17541672, 16592200, 15706468, 14858517, 14074609, 13336441, 12647070, 11987232, 11330226, 10705079, 10134070, 9605860, 9128681, 8684756, 8267722, 7881071, 7526562, 7189938, 6877754, 6573395, 6313731]
10423F313731k14000j59289o5748M0297J24472J30534k9311k70172m74694n37882
10413D857938m90754l72997k78168k25477k14924k07266j77373j68328j47319
10404B575332j57227j49174j25765j01915q4693q7228p6487p3723p6515q8531
10394A554074q4140p2565n1962o1962n9485n0533n6122l7567l5725m2477l4756
10383I66780k4520k7353k8767k0347p660o171M909R854M4007O8824P4897P5333
10371A129786N6166J8189k2931n7783p9239r4356r8996q4024q1531n7189k2644
10360F05448m2824l4298k6959k1058j9514j3599l5078k2879k2342j4879J12m436
10348C47694m61J6085J4821J1644N250j8838k1956l7784l9893l5311l048K7777
$$ y = [6313731, 6099731, 5940442, 5874694, 5914991, 6039463, 6169997, 6140686, 5870514, 5395820, 4857938, 4367184, 3994187, 3716019, 3490542, 3275618, 3068352, 2890979, 2722651, 2575332, 2418105, 2268931, 2143166, 2041251, 1956558, 1869330, 1792843, 1719120, 1642605, 1554074, 1469934, 1397369, 1345407, 1283445, 1223960, 1173427, 1117305, 1079738, 1044013, 1001536, 966780, 942260, 914907, 886140, 865793, 858133, 851962, 856871, 866725, 910732, 979556, 1054453, 1129786, 1185952, 1204141, 1181210, 1123427, 1044188, 949832, 850836, 766812, 685281, 628092, 605448, 562624, 528326, 501367, 480309, 460795, 447196, 412118, 389239, 366897, 352018, 352130, 347694, 347233, 363318, 378139, 389783, 395033, 376195, 354239, 316455, 276562, 241251, 238203, 265980]
10336B65980P0867P7259O4317N3769N6576M3798N0295L3318M1520K4216J1518
10325G93433K2291J5330K6786K561R365P141p17j7763l7299m0245p844O878Q930
10312G88847N21j0370m183k2272m8341n6743l0998J691J1462J6340L2722K5984
10300G04660K2836O454r78k7273l0408k5010k2514m5132m2316k2663k6275q647
10288D82734R313O06L024M227J0954k58j1324q199j6061l5710k8478k2919k3951
10275C63958o846j678J3711R249l91p511j3744j0908J6512N201j047m329r856
10262C52321k6930k7967k5120k3666o686j710m924L612n354J0522P080J2625J4527
10249B78330K6116K8901J8378K989l110j858j4276p090N486O490J473l716k745
$$ y = [265980, 336847, 414106, 478423, 532192, 588768, 632566, 682861, 716179, 757699, 781915, 793433, 815724, 831054, 857840, 860401, 869766, 876907, 876190, 858427, 821128, 780883, 773039, 779917, 788847, 789368, 778998, 774815, 752543, 704202, 647459, 616461, 618152, 629614, 645954, 678676, 704660, 727496, 733950, 732972, 705699, 675291, 650281, 627767, 582635, 540319, 517656, 491381, 482734, 492047, 492653, 495677, 499904, 510858, 510600, 499276, 491077, 475016, 439306, 410828, 387909, 363958, 357112, 355434, 369145, 378394, 378003, 370492, 356748, 345840, 362352, 367553, 366506, 362177, 352321, 325391, 297424, 272304, 248638, 241952, 240242, 235318, 238930, 233576, 244098, 251178, 263803, 278330, 304446, 333347, 351725, 354714, 351604, 349746, 335470, 328380, 333866, 340356, 341829, 338113, 335368]
10236C35368j4785j1901j1911j3906n989p421n516K8273L6020K9661K3354L5976
10224D17223K7483L347j7740k4160p600o467j6008j5645j344j5584l0943j0921
10212C01641M744J5296J3088J1636N412r91J279K9278L7049M5300L4673N8030
10200E56435R7203R7590J15741J32869J32509J54681J77870J62425J07030N8583
10190A792936M1100M3699J5699m5106r2289r2215o5424q5689j14959j17051r2125
10179A188576o2861k5389l7914m6967l8608k6754l6844l9351l4212j6306j4512
10168H08858j7365l8004l4044j9392j3165j5544k0807l9978k5738l256R959q73
10156E90651j411l196j7971k2261k0985k6841k9048p414n914o025l0440k3266
$$ y = [335368, 320583, 308682, 296771, 282865, 276876, 269455, 263939, 292212, 328232, 357893, 381247, 417223, 444706, 448053, 430313, 406153, 398553, 392086, 376078, 360433, 359089, 343505, 312562, 301641, 306385, 321681, 334769, 346405, 351817, 350826, 352105, 381383, 418432, 463732, 498405, 556435, 653638, 751228, 866969, 999838, 1132347, 1287028, 1464898, 1627323, 1734353, 1792936, 1834036, 1877735, 1893434, 1848328, 1756039, 1663824, 1598400, 1512711, 1397752, 1280701, 1188576, 1125715, 1100326, 1062412, 1015445, 976837, 950083, 913239, 873888, 839676, 823370, 808858, 791493, 753489, 719445, 700053, 686888, 671344, 650537, 610559, 584821, 581565, 591524, 590651, 589240, 586044, 568073, 545812, 524827, 497986, 468938, 461524, 455610, 449585, 419145, 395879]
10144C95879j2959l319q365k0202j2510j4803P418J2651N887k025Q919K987n80
10131C58978J239K162K3178L6682J5693j5118k8723j7990j4068l5425l1395j1759
10119B83454j7578o407P45p534k0212k4337k7976j6764k866o21j2727q163j329
10106A37685k133m393k671l664Q291J2159M543l53J4390L8826L6522K5677J5853
10093B80732J4230J2527J6726L2198L0028K5418K5143M5205O6126J21751J75971
10082H46055K54742L48439L90080K45493k8671k59525l58198l08376j93986j31094
10072H04959j12512p7915n5888n8863m3726l8166l6227k5282o418o802j1742j2926
10060C18492j010j5988q951R936J8375P823O790R454Q985L0072K5596K6571L8868
$$ y = [395879, 382920, 379601, 371236, 351034, 338524, 323721, 331139, 343790, 349677, 347652, 356571, 359558, 358978, 360217, 362379, 385557, 422239, 437932, 422814, 394091, 376101, 362033, 326608, 295213, 283454, 265876, 259469, 260214, 252680, 232468, 208131, 180155, 163391, 160525, 159904, 147177, 139014, 137685, 135552, 131159, 128488, 124824, 133115, 145274, 149817, 149464, 163854, 202680, 239202, 264879, 280732, 294962, 307489, 324215, 356413, 386441, 411859, 437002, 482207, 548333, 670084, 846055, 1100797, 1449236, 1839316, 2084809, 2056138, 1796613, 1438415, 1130039, 936053, 804959, 692447, 614532, 558644, 499781, 456055, 417889, 381662, 356380, 349962, 343160, 331418, 318492, 317482, 301494, 292543, 302479, 320854, 328677, 335467, 344921, 353906, 383978, 409574, 436145, 475013]
10047D75013M5776L5781K2103J3279K0271J9473M3554J7626J5001M2684R0599
10036H41160J50593K32600L35392M16453L81981J91482r3519l13713m07618l56104
10026A378707k62690j85983j13808p6373o4985p0170o6184l1712q859j6392j4101
10015D67450l8631k4248k3804j0654j1774j0007j0115l804j732j4680j9225j9862
10003B78914k80J2861Q344l980l1045j2539p327j3253k598J7038L287j0007j7603
9990B21812k5818k754m739j5884r0j5884j3284j8740j0598k6879j9861j0200K26
9977E7307J0909n095l159J299j6275O758q886j6682N888N037j0456j604J488K918
9963B9447P145K818p120j931O327K0754K2974J7623P578L168l349j8613l6906
$$ y = [475013, 520789, 556570, 578673, 591952, 612223, 631696, 675250, 692876, 707877, 750561, 841160, 991753, 1224353, 1559745, 1976198, 2358179, 2549661, 2456142, 2142429, 1734811, 1378707, 1116017, 930034, 816226, 739853, 674868, 604698, 538514, 506802, 497943, 481551, 467450, 428819, 404571, 380767, 370113, 358339, 348332, 338217, 334413, 332681, 318001, 298776, 278914, 278634, 291495, 299839, 295859, 264814, 252275, 244948, 231695, 229097, 246135, 249422, 239415, 221812, 195994, 193240, 188501, 172617, 172527, 156643, 143359, 124619, 114021, 87142, 67281, 57081, 57307, 68216, 63121, 59962, 61261, 44986, 51744, 42858, 26176, 32064, 37101, 26645, 25041, 26529, 29447, 36592, 39410, 32290, 30359, 36686, 57440, 80414, 98037, 105615, 108783, 105434, 86821, 49915]
9950D9915k5740j6852j6743q502j5312r710R048R130j380p14j400M872r332j10
9936c2830K63J436n617J2948O472L122R456q440K371m079j5002m14l644j84Q516
9921b5626J5010O020l386J207L110P673N261n249J4007k243J097J7102P604k475
9907C9112R035O448O85J1083J8731O291J7841R411L4862L7978O1906J14082J58365
9894E25830J16411q607j30410j45438r4025n9158l4326j8630j9786k7899j0166
9883I3796N866j622l208j4758j893m526m049M072n758l840N23Q794P04Q134J124
9868H3359j5670j7280n717J001P676O645K485j5373j3704j7012k111J3212Q256
9855C5767k58j8284j2805P966m309L48N643j0022r169K639L115M304j1418k63
$$ y = [49915, 24175, 7323, -9420, -17922, -33234, -42944, -33896, -24766, -26146, -26860, -28260, -23388, -32720, -32830, -32567, -31131, -36748, -23800, -17328, -14206, -4750, -13190, -10819, -14898, -29900, -30314, -33958, -34142, -25626, -10616, -4596, -7982, -6775, -3665, 4008, 9269, 4020, 18027, 15784, 16881, 33983, 41587, 39112, 48147, 54595, 55280, 66363, 85094, 91385, 109226, 118637, 153499, 191477, 253383, 367465, 525830, 642241, 633634, 503224, 357786, 263761, 204603, 170277, 151647, 131861, 103962, 93796, 99662, 98040, 94832, 80074, 78181, 73655, 69606, 73678, 67920, 64080, 64603, 73397, 74101, 82235, 83359, 67689, 50409, 44692, 45693, 53369, 60014, 62499, 47126, 33422, 16410, 14299, 27511, 35767, 35509, 17225, 4420, 12386, 8077, 8425, 14068, 4046, -5123, -2484, 631, 4935, -6483, -6746]
9841f746R06q651r398K1763l44N624J0338j8787j9966N958J0878k390r128O744
9827a3199k47K594m1K678k721j9l726p199j190j6676q902r888l864J5146O836
9812d0418J3825P386J7028l278j4453o486j825j3980Q151J6522J8320J895M646
9799G333j354R40M950j4172N58R394M949P546j1852n863L415j688J852J43q24
9784E327p88L711o626j4135j814K392N441N423j0870p298r206M851J0300j147
9770a4439J1471j1769K171M157k236j9426j0898Q400J0503R92k96J3084N47M772
9756b967Q40m707P139o025k376O777K489L48K392O096J0441j2553j2608r822j0859
9741b5395L338m789K573R093J825M372J1842L502M194j7500j4296r979J5004N491
$$ y = [-6746, -5840, -14491, -23889, -2126, -2470, 3154, 13492, -5295, -25261, -19303, -8425, -10815, -19943, -13199, -13446, -10852, -10893, -8215, -10936, -10955, -14681, -21880, -23070, -39746, -48648, -58536, -62400, -47254, -40418, -26593, -19207, -2179, -5457, -19910, -26396, -28221, -42201, -34050, -17528, 792, 2687, 7333, 5979, 6919, 11869, -2303, -1745, 7649, 12598, 20144, 8292, 2429, 5844, 4156, 6008, 6151, 5327, 4539, 8250, 1624, -12511, -14325, -11933, -6492, -1069, -11939, -19237, -28443, -23592, -13292, -14439, -2968, -14737, -12566, -8409, -10645, -30071, -40969, -32569, -22066, -21074, -21370, -8286, -7739, -2967, -2127, -6834, 305, -5720, -8096, -1319, 1170, 1518, 3910, 10006, 20447, 7894, -4714, -14536, -25395, -22057, -26846, -24273, -15180, -13355, -8983, 2859, 6361, 10555, -6945, -21241, -31220, -16216, -10725]
9727a0725q593m21j7382K113J9452j0234M418N501K684m64L736l426P960O993
9713A612K448j4630N531J516J732l716j339R70O319k336m615J7091K463P833m026
9698A6853j7084j4122J163j191Q271k366j5775r915J8527k572l368J2911N764
9685b904P607p175j4574k500J56P669M091r844R411N062R842M899r372n641k620
9670e893p652K135P93q131j0490n080P188O544P934J219j5805k387J0498K5747
9656F620Q767l361j5085j2694J0372M575j0442j337Q300J3537P44p30l617o598
9642i49R444j775j1043N779L304K026M147P40L134J1598K6090K425j0912j3000
9628C1008K972j604P668J246J744O079j7n457n013l771k620j2667m435o740J4524
$$ y = [-10725, -19318, -19739, -37121, -35008, -15556, -25790, -21372, -15871, -13187, -13651, -9915, -13341, -5381, 1612, 4060, -10570, -5039, -3523, -1791, -5507, -6846, -5876, 443, -1893, -6508, 10583, 13046, 20879, 16853, -231, -14353, -13190, -14381, -6110, -8476, -24251, -34166, -15639, -18211, -21579, -8668, -2904, 4703, -2472, -17046, -19546, -19390, -11721, -7630, -17474, -8063, -3001, 6841, 11740, 2368, -3273, -5893, -13545, -11410, -10617, -18748, -29238, -34318, -27130, -20586, -12652, -11433, -27238, -29625, -19127, 6620, 15387, 12026, -3059, -15753, -5381, -806, -11248, -12585, -4285, 9252, 9996, 9266, 5649, -949, 8495, 6720, -4323, 1456, 4760, 6786, 10933, 11673, 14807, 26405, 52495, 54920, 44008, 31008, 33980, 32376, 40044, 41290, 43034, 49113, 49096, 43639, 38626, 34855, 32235, 19568, 15133, 8393, 22917]
9613B2917j874l19L080J1320O632M946n950n011n273j274J4441P710j3445J962
9599C9862Q945N85l254j008O01Q105n868r287r507O779J882J1223J648n814o93
9584D4199N536k755q979j784M046J2385K184r940l834J2314R397O527K971j2957
9570E9310r772K346m227J1707N06j008R610N279M58n559P843P134L188M076L072
9555I3963J9224J6932J1546J770Q674Q708J8025J9011L4535K3360M0230M5695
9543C41673K5797K4085K4578L6736O2296Q4331J14543J15390J34542J18228J50655
9532A232854J87855J57443N0903j6574K67K8658r266j19160j72910j51172q8635
9521A100263j00847j23891j08261r0948o7583l7808l7321k6580j9661j6420j4531
$$ y = [22917, 21043, 20724, 23804, 35124, 41756, 46702, 40752, 35741, 30468, 29194, 43635, 51345, 37900, 39862, 48807, 49392, 46138, 45130, 45731, 53836, 47968, 38681, 29174, 35953, 37835, 49058, 50706, 44892, 44199, 49735, 46980, 38001, 36217, 40263, 52648, 54832, 44892, 41058, 53372, 62769, 69296, 72267, 59310, 49538, 51884, 47657, 59364, 59870, 58862, 68472, 73751, 74209, 68650, 76493, 83627, 86815, 90891, 93963, 113187, 130119, 141665, 143435, 152109, 160817, 178842, 197853, 232388, 255748, 295978, 341673, 367470, 391555, 416133, 452869, 515165, 599496, 714039, 829429, 963971, 1082199, 1232854, 1420709, 1578152, 1629055, 1612481, 1612748, 1641406, 1632140, 1512980, 1340070, 1188898, 1100263, 999416, 875525, 767264, 676316, 608733, 570925, 533604, 507024, 487363, 470943, 456412]
9510D56412j8963r614r387r719p172m154k398N624k166j1801m130l285N573J361
9496C86181j1248j3512q143j730j5203j5325L833L927q910j7423k2685j6479m591
9483B58692j8763n248R652k782O75N340o753k388q544j9497r704J2137p771j4111
9469A90935j5454j827j0936k3625K716J3259L334j1530o141j202P430k78R65m396
9455A43250m536m887R995P650K050j3686m739J0377N125q050j3N498o344m523
9441A37167o012K534m373J027K856K244M390p36K937p277O788p17j2472J2749
9427A41105k675J0548M201k3514l16R813K760o147M268K1124L403r226q920J2617
9413A59041J0905r593j6028N128j0Q035n740N13o765k355k795R398J3258N66p377
$$ y = [456412, 437449, 427835, 418448, 408729, 401557, 397403, 395005, 400629, 398463, 386662, 382532, 379247, 384820, 386181, 374933, 361421, 353278, 351548, 336345, 321020, 324853, 328780, 319870, 302447, 279762, 263283, 258692, 239929, 234681, 244333, 241551, 242226, 247566, 240813, 238425, 229881, 210384, 200680, 212817, 205046, 190935, 175481, 173654, 162718, 139093, 141809, 155068, 158402, 146872, 140731, 139529, 146959, 146681, 147646, 143250, 138714, 133827, 143822, 151472, 153522, 139836, 135097, 145474, 150599, 142549, 142536, 148034, 141690, 137167, 131155, 133689, 129316, 130343, 133199, 135443, 139833, 139097, 142034, 134757, 141545, 140828, 128356, 141105, 138430, 148978, 153179, 129665, 129349, 139162, 141922, 135775, 140043, 161167, 164570, 155344, 146424, 159041, 169946, 160353, 144325, 149453, 149443, 157478, 151738, 152251, 145486, 143131, 140336, 149734, 162992, 163558, 156181]
9398A56181R933O552o362j3027j333K756N716n305j3798P50J1009J409N943l970
9384A56454n781P767L125k614J2333O523M43k979m248j2653l614L990J6644O545
9370A81935O93j4619n848j118j0361n921P572J1890J244Q726Q002J1018J99j456
9356A91956n861j0762j969O876Q388n38l020L390n437r745j726n774j2236m811
9342A48731Q306N059Q817M500o15P703J037l411j877j620J0572J39n776J870J02
9327A83537j7060j5790Q614R56k336l685j040k443q050l254k412R275K844r680
9313A39476k593J5531J809l068J6551O384n461O160q597k0644l607j4523n191
9300A22227J4191M175O415M232j2042j539P875J1547r858j5014K428J343n713
$$ y = [156181, 166114, 172666, 166304, 153277, 151944, 154700, 160416, 155111, 141313, 142063, 153072, 154481, 160424, 156454, 150673, 158440, 161565, 158951, 171284, 177807, 178250, 175271, 171023, 158370, 154756, 158746, 175390, 181935, 182628, 168009, 162161, 161043, 150682, 144761, 152333, 164223, 165467, 174193, 182195, 193213, 193412, 191956, 186095, 175333, 173364, 180240, 188628, 188090, 185070, 188460, 183023, 173278, 171552, 165778, 153542, 148731, 157037, 162096, 170913, 175413, 174798, 182501, 183538, 180127, 178250, 176630, 187202, 187341, 181565, 183435, 183537, 166477, 150687, 159301, 160257, 157921, 154236, 153196, 150753, 142703, 139449, 137037, 146312, 149156, 139476, 136883, 152414, 154223, 151155, 167706, 174090, 168629, 174789, 166192, 145548, 141941, 127418, 122227, 136418, 140593, 147008, 151240, 139198, 137659, 145534, 157081, 147223, 132209, 134637, 135980, 130267]
9287A30267L441j1935j1998P418O977Q025J7990J6661o203j5877j9922L255l081
9274A25018j1642k10n708Q260R259o551m442J266Q239N079M250L148M093P406
9260A47465m855j407m578P019O113m578k0198j7252J2187R266j3745j1601n942
9247I7894k809j583K757O676L462J2862m257r697j5000m898K610q500J2274K333
9233I4124O06k201K216m325m407R485r490J714p477p549o075K393M863M642K1613
9218A00132Q955q75j787K8K068J25L959r827r229m940n84l151P777P298o29j5358
9202H3962K472n95l13q520k757m503p215L973J4921L659l95j2727j9877J199J1215
9187F4499K143P848R70p853l874m871j2018R660n329l404J1087N478l318K666
$$ y = [130267, 133708, 121773, 109775, 117193, 124170, 132195, 150185, 166846, 160643, 144766, 124844, 128099, 125018, 113376, 113166, 107458, 115718, 124977, 118426, 113984, 115250, 123489, 128568, 132818, 135966, 140059, 147465, 142610, 141203, 136625, 143644, 149757, 145179, 124981, 107729, 119916, 129182, 115437, 103836, 97894, 95085, 93502, 96259, 102935, 106397, 119259, 115002, 105305, 90305, 85407, 88017, 79517, 91791, 94124, 94730, 92529, 94745, 90420, 86013, 95498, 86008, 87722, 80245, 72696, 66621, 69014, 73877, 78519, 100132, 109087, 108212, 106425, 106453, 108521, 108646, 112605, 102778, 93549, 88609, 88025, 84874, 92651, 99949, 99320, 83962, 86434, 85839, 85526, 77006, 74249, 69746, 62531, 66504, 81425, 85084, 84689, 71962, 52085, 53284, 64499, 66642, 74490, 75460, 67607, 63733, 58862, 46844, 56504, 51175, 47771, 58858, 64336, 61018, 63684]
9173F3684m720j4881j6226k470J582N969J1370J1869R362J7841m69j4670n582
9160F2659q092L39Q682J3401n704m377l619p259k481O022N731j401M103p325p510
9145E3169N250l75j6510l272p30q025p249o16J904P944R903j580k781L33n392
9130C1973l613j041k64J35m126m592K4287M180N07L063M750j359L394k910m233
9115E0151p556Q63J8350r389j3827n60Q207N689j331m674q953k877m500j0548
9101A9045M533Q456R196L308k868J629j296Q367j259j2686n806J0648r152r393
9087B2722r958r678L913R022J0343p184o906Q596K42j1817J4929N769J739n958
9073B5774O21r37K302m496j0277N546N430P575N704o273m916l92P299R470L273
$$ y = [63684, 58964, 44083, 27857, 25387, 26969, 32938, 44308, 56177, 65539, 83380, 82911, 68241, 62659, 54567, 54906, 63588, 76989, 71285, 66908, 63289, 56030, 53549, 59571, 65302, 63901, 68004, 60679, 53169, 58419, 58044, 41534, 38262, 37532, 29507, 22258, 21642, 23546, 31490, 41393, 39813, 37032, 37365, 31973, 28360, 27319, 27055, 27190, 23064, 18472, 42759, 46939, 47446, 50509, 55259, 53900, 57294, 54384, 50151, 42595, 43458, 61808, 52419, 38592, 38032, 46239, 51928, 50597, 45923, 36970, 34093, 29593, 19045, 23578, 32034, 41230, 44538, 41670, 43299, 42003, 50370, 49111, 36425, 30619, 41267, 32115, 22722, 12764, 3086, 6999, 16021, 26364, 19180, 12274, 20870, 21112, 9295, 24224, 29993, 31732, 25774, 26395, 25458, 27760, 23264, 12987, 18533, 23963, 31538, 37242, 30969, 26053, 25661, 32960, 42430, 45703]
9058D5703J160O04j1193j2633j1565n630Q156Q622j193q408l746l797j630j1634
9044g184l679r47q260p76R256K258P621J5171J0630M716j0202j3917J673N231
9030A1591p916q984J736K876J844M633O927j713m212o630P466P064J2985j393
9016B6274q153n207l866p808n687J0243l09J1858J4781m222j0744j0404M718j9456
9002g982j0630J5800J8291M018j481K754l711l503n976J3850j356q187J651l799
8988I739o673Q18k852p272J086L310q85j3731O283l898j1996m85L265R525J3668
8973i8j651N12J7028K165q100n707j2995K741j387P421k540j218m465K608P04
8958d982J0589M972l89N481N474j763j2408p641Q438j470m717Q250j864n30o645
$$ y = [45703, 46863, 47467, 36274, 23641, 12076, 6446, 14602, 23224, 22031, 13623, 9877, 6080, 4450, -7184, -10863, -11810, -20070, -20846, -11590, -9332, -1711, 13460, 24090, 28806, 18604, 4687, 6360, 11591, 3675, -5309, -3573, -697, 1147, 5780, 12707, 10994, 6782, 152, 7618, 14682, 27667, 26274, 18121, 12914, 9048, 1240, -4447, 5796, 5487, 17345, 32126, 27904, 17160, 6756, 11474, -7982, -18612, -2812, 15479, 19497, 18016, 20770, 17059, 13556, 7580, 21430, 20074, 11887, 13538, 9739, 3066, 3884, 1032, -6240, -5154, -1844, -2729, -16460, -10177, -14075, -26071, -26556, -23291, -13766, -98, -1749, -1237, 15791, 17956, 9856, 4149, -8846, -6105, -7492, -71, -2611, -3829, -8294, -5686, -4982, 5607, 10579, 10190, 15671, 21145, 19382, 6974, -667, 7771, 6301, 1584, 9834, 7970, 7440, 795]
8943G95J862O350J5045O702k0793o143l338j179j118O952n317l468J7244J09q018
8928E685m674J2566n730j4103Q134P254L251n54n210K100L908o870j3290L730
8914c803L047J968O969K290k4182p388J4618J3679o118P87N89o130J0225J4004
8900B0555N83j4437R00n905q915n498K276K438j0026N087m784k462J6055L35j1094
8885a4892j936M109n788O527K466J0878L114J56l988o440Q19R774L033n740q142
8870f050k989J4552q553K436J2048J0179Q608n629K819r975k2784N998J3157m015
8856I802J016N863p78p122P352L401R09Q598O739P788Q661j78M182J3078K2501
8841I1812K4690L8689J4986m430k9988l6688k6888j8205Q856k160O212O139L69
$$ y = [795, 2657, 9007, 24052, 30754, 9961, 3818, 480, -699, -1817, 5135, -182, -3650, 13594, 13703, 5685, 1011, 13577, 7847, -6256, 1878, 9132, 12383, 11829, 6619, 8719, 12627, 5757, -7533, -3803, -756, 1212, 8181, 10471, -13711, -21099, -6481, 7198, 1080, 1867, 2456, -3674, 6551, 20555, 21138, 6701, 7601, 1696, -7219, -12717, -10441, -8003, -18029, -12942, -17726, -20188, -4133, -3798, -14892, -16828, -12719, -18507, -11980, -9514, 1364, 4478, 4634, 646, -5794, -4975, 4799, 7832, 2092, -6050, -9039, 5513, -3040, -604, 11444, 21623, 30231, 24602, 27421, 17446, -5338, 660, 13817, 9802, 10818, 16681, 15903, 8781, 16133, 19534, 20443, 29041, 35780, 43568, 52229, 52051, 56233, 69311, 91812, 116502, 155191, 170177, 165747, 135759, 99071, 72183, 53978, 62834, 60674, 66886, 73025, 73394]
8828G3394j5461j2231q868k598J461m64k93L08r586j7199L708L113m050q550O539
8813I223R015n233P172J619Q56R67J445K571K4495L432j9197J884O041l243J48
8798D1195o001L335R755J3870r830k287O012Q505j0385j3007r586n947M701J193
8784C1523P87M330N760J0003j2106j9396j3993O794j453j5828l53J8137J914j570
8770A4549o604L75O937J5601o85n70J1920o545k837r032L090o79m294j5601m757
8755H68J3061K2319N916j8868r37j310l14J0729P203j3990q622j641P326n366
8741A6374j0917k575J4707J2856P967j71j8172l363O386j2732k0699Q535K3114
8728B1310K572k018n091l047o557M539Q82j8358pR184J1582m66R117Q766J807
$$ y = [73394, 57933, 45702, 36834, 34236, 35697, 35233, 34940, 35248, 25662, 8463, 12171, 15284, 11234, 2684, 9223, 18238, 13005, 20177, 21796, 22652, 23619, 25064, 27635, 52130, 55562, 36365, 38249, 44290, 41047, 41195, 35194, 38529, 48284, 62154, 52324, 50037, 56049, 64554, 54169, 41162, 31576, 25629, 30330, 31523, 32310, 36640, 42400, 52403, 40297, 20901, 6908, 13702, 12249, -3579, -3932, 14205, 16119, 14549, 7945, 8320, 15257, 30858, 30173, 29603, 41523, 34978, 32141, 23109, 26199, 25520, 21226, 5625, 868, 13929, 36248, 42164, 23296, 22359, 21049, 20735, 31464, 38667, 24677, 16055, 14414, 21740, 16374, 5457, 2882, 17589, 30445, 38412, 38241, 20069, 16706, 23092, 10360, -10339, -1804, 21310, 23882, 21864, 16773, 13726, 7169, 11708, 12590, -5768, -5775, 3409, 14991, 14525, 23642, 32408, 34215]
8713C4215j4837j3905k742q902l874J3013J9244P633P452J347o090r180j3525
8700I849m091l904J227J2471l522O066J316o163K795r668k245R780R969J019J127
8685B6026j0125j2579J333J4840K541M784n702p752j3799J1591L547j0883P621
8672A1443J1139J4135P178j4290j6354K0806J3991O702j1661k5126j277J466P070
8659B5222K2132Q488j737j4898j7049K515J2133J2396j617j0516o085j4299j9061
8646b376o727o106J4539J9450O559j515m265n260R395J1435L361L93J161l110
8632C6934j1017p523p207k922J0338J4396j0581j3906k813M150J0113L394O636
8619B9992l675L483R166P723K219j1498n272L572k927M809m312j3462m270L856
$$ y = [34215, 19378, 5473, 2731, -6171, -10045, 2968, 22212, 29845, 37297, 38644, 32554, 23374, 9849, 5758, 1854, 3081, 15552, 12030, 18096, 19412, 13249, 16044, 6376, 4131, 13911, 23880, 24899, 26026, 15901, 3322, 4655, 19495, 22036, 26820, 21118, 13366, -433, 11158, 14705, 3822, 11443, 22582, 36717, 43895, 29605, 13251, 34057, 48048, 54750, 43089, 17963, 16686, 18152, 25222, 47354, 55842, 54105, 39207, 22158, 24673, 36806, 49202, 47585, 37069, 30984, 16685, -2376, -9103, -15209, -670, 18780, 25339, 23824, 19559, 14299, 23694, 35129, 38490, 38883, 40044, 36934, 25917, 18394, 11187, 8265, 18603, 32999, 22418, 8512, 5699, 9849, 19962, 23356, 29992, 26317, 29800, 38966, 46689, 48908, 37410, 32138, 35710, 32783, 37592, 33280, 19818, 15548, 19404]
8605A9404P515R147O783n589k0091K462K430j1842M436J3817m958Q830J0484j185
8591D1643j0970N632J7703j0209k498Q289q344j0192p580j3926J487K3233J5584
8578D9852j1731j4909q723Q818K781J3454M627M57L068p599k932J4131K2678k928
8564G1044j3844r232J0913J151k0789r472l960P458q694N447j016n75P131J7370
8550E2932o398j1986o245L489J113n35N962l365o601J848p837P582M572K885Q719
8535D6135j1252n961m891R881Q066j409j9961q705O824M458J382o02J6779m092
8521C6652n503j10M670M00n079Q398P555j3994r129j917N179L14R690o422j4835
8506A5869J951R778K24n458K027M08q77J4570Q596k431j820j1374j2682q565J3469
$$ y = [19404, 26919, 36066, 42849, 37260, 17169, 19631, 22061, 10219, 14655, 28472, 23514, 32344, 42828, 41643, 30673, 36305, 54008, 43799, 41301, 49590, 41246, 31054, 23474, 9548, 11035, 34268, 49852, 38121, 23212, 14489, 23307, 26088, 39542, 44169, 44626, 47694, 40095, 37163, 51294, 73972, 71044, 57200, 47968, 58881, 60032, 39243, 29771, 25811, 33269, 24575, 30022, 29006, 28431, 35562, 52932, 46534, 34548, 28303, 31792, 32905, 32370, 38332, 34967, 28366, 30214, 22377, 29959, 34531, 37416, 46135, 34883, 28922, 24031, 33912, 41978, 40569, 20608, 11903, 18727, 23185, 24567, 23965, 40744, 36652, 31149, 31039, 35709, 36109, 31030, 39428, 46983, 32989, 23860, 21943, 27122, 27436, 37126, 30704, 15869, 17820, 27598, 27822, 22364, 24391, 24799, 23922, 38492, 47088, 44657, 42837, 31463, 18781, 10216, 23685]
8491B3685L572p663J418K334l993O103M840M969k6521p814O647l98p401j095R017
8476G700K2260K73m351l569N184J0739j0396j1147L211Q006J0007j0463j5894
8463A1560k769J560L184n712q788l273J1718N780j2214N363J5719N586N848J2649
8449D6211p155o751j2732J962J975j385J1777q024j3723o431j994J6182J7061
8436C6973o281p963k394M497J2662J1181Q758K1425j96n925p195M58j3723j5234
8422C7043j0916P94K911O669M817n73j4702r478J5429K473l394m756o293q383
8408A1641L054N16P13o089J46M302R095k923j0223p931Q558K1110L20o860K683
8393B8112J1322J515l465j6445O8R301j0586j2519N32j594p536j458J7784P53
$$ y = [23685, 27257, 19594, 21012, 23346, 19353, 25456, 30296, 35265, 8744, 930, 7577, 7179, -222, -1317, 7700, 29960, 30233, 25882, 22313, 27497, 38236, 27840, 16693, 19904, 27910, 37917, 27454, 11560, 8791, 10351, 13535, 7823, -965, -4238, 7480, 13260, 1046, 6409, 22128, 27714, 33562, 46211, 39056, 32305, 19573, 21535, 23510, 22125, 33902, 25878, 12155, 5724, 3730, 19912, 36973, 30692, 22729, 20335, 24832, 37494, 48675, 57433, 78858, 78662, 72737, 65542, 66000, 52277, 37043, 26127, 26921, 29832, 36501, 41318, 40745, 26043, 16565, 31994, 34467, 31073, 26317, 20024, 11641, 14695, 15211, 15924, 9835, 9981, 14283, 23378, 20455, 10232, 2301, 10859, 31969, 32289, 25429, 28112, 39434, 40949, 37484, 21039, 21107, 30408, 19822, 7303, 7835, 6241, -1295, -2753, 15031, 15784]
8379A5784j6699J178K1775R266k0361k7444J4205J9170K582p929j8545J325J0753
8366E060J4922j3524q893J438O640M436n159L063M92j9055j3992O642J6397J7395
8352A5862k192j2498p561j545J114J6773l388j0789J853m198K471J0412l84k376
8338C554p272j307p432O114Q058J5540K17r941q95Q769K064o765R0j94J305k728
8322I177K2288L512n840p585j1544o631Q429J762j065J0547R670Q108q680k81
8308C1867J1825Q845K695J2408L6473J2351M234l392p941j1804k2545j8340k240
8295E4436j3065j0633j2325P264o626j3122O18J5160j11j2792j4766p889R287
8282d564J0016K078P354R973q231r892J967J0500Q791P290p18K02N150J0150J0023
$$ y = [15784, -915, 263, 22038, 31304, 10943, -16501, -2296, 16874, 19456, 11527, -7018, -5693, 5060, 19982, 6458, -2435, -997, 5643, 10079, 4920, 7983, 8475, -10580, -24572, -17930, -1533, 15862, 13670, 1172, -6389, -7934, -6820, 9953, 6565, -4224, -2371, -6569, -4098, 6314, 5930, 3554, -3718, -5025, -12457, -6343, 1715, 17255, 17472, 7531, 6636, 15405, 17469, 10704, 10794, 10600, 11905, 9177, 31465, 34977, 29137, 21552, 10008, 3377, 11806, 13568, 12503, 23050, 32720, 40828, 32148, 31867, 43692, 52537, 55232, 67640, 104113, 116464, 120698, 117306, 109365, 97561, 75016, 56676, 54436, 41371, 30738, 18413, 25677, 19051, 5929, 6547, 21707, 21596, 8804, -5962, -13851, -4564, 5452, 7530, 14884, 24857, 16626, 6734, 8701, 19201, 27992, 35282, 34564, 34766, 39916, 50066, 60089]
8267F0089M578j2202l436J0649R988k354J7137P572J0710j5735k8118j6955o674
8254C5249o967k634J0114N911L877j1066j4340j966R167Q021l167p87J123L167
8240C5702N2l384m082p887j3702o993M955J4815O673O45j836J388M274J772K49
8225C2641L10o860j1869j2956J3739J0545N278J693j0228n164M029l875L68m714
8211A2937J468p137j4625l664J1238N467m213m411J1178L897L253K703L235J5342
8197C6668K918k8890j7701J3672l477l1K0100l676J969N759j4517r279L397J727
8183H639j1883l760j012n067J3207J0650l194K79K3066Q610j3956q416j93N120
8169B2090j117k52j436l105k4883r387M235M242J1665R747l168m785N408o553
$$ y = [60089, 64667, 52465, 49029, 59678, 69666, 67312, 84449, 92021, 102731, 86996, 58878, 41923, 35249, 28282, 25648, 35762, 41673, 45550, 34484, 20144, 18178, 27345, 35366, 32199, 31412, 32535, 35702, 35754, 32370, 28288, 20401, 6699, -294, 4661, 19476, 26149, 26794, 24958, 26346, 30620, 32392, 32641, 32951, 26091, 14222, 1266, 15005, 25550, 30828, 32521, 22293, 17129, 21158, 17283, 17651, 12937, 14405, 7268, -7357, -11021, 217, 5684, 1471, -2940, 8238, 12135, 15388, 18091, 21326, 36668, 39586, 10696, -7005, 6667, 3190, 3159, 23259, 19583, 21552, 27311, 12794, 3515, 6912, 8639, -3244, -7004, -8016, -13083, 124, 10774, 7580, 7859, 30925, 39535, 25579, 17163, 16970, 22090, 20973, 20721, 19285, 16180, -8703, -18090, -13855, -9613, 2052, 11799, 8631, 3846, 9254, 2701]
8155B701o11l504M600J7197K6150o34k3513k3869o391j774J2698L461k864j2464
8141h817J1071o67j2284O187P957j2578M526J0797K0677Q650J6733N706L853J0346
8127G2157j4073k2072m534o33J1929m906Kl140j0808k272Q728J821L756K665L746
8112D2366j521N302k702r91j8355J377O37l652q93o927m524k004J2542J855l652
8097A8858l87K820m43k542O380m47J2776J0594n724k54L982l129K958m57R918
8082E4903J275q703j972j710P984Q131k910r342q599o36k0754j659K0054P840
8068D3902O89j4728p113j620J1521J442q76r593M627M988K783n437j352l593P117
8053C2757j5M712O996L209j5526K933K515j1131k6L594J576P69K737P248j2842
$$ y = [2701, 2090, -1414, 3186, 20383, 46533, 45899, 22386, -1483, -7874, -9648, 3050, 6511, 3647, -8817, 2254, 1587, -10697, -4510, 3447, -9131, -4605, 6192, 26869, 35519, 52252, 57958, 61811, 72157, 58084, 36012, 31478, 30845, 42774, 37868, 37870, 34730, 23922, 21650, 30378, 32199, 35955, 38620, 42366, 40845, 46147, 43445, 42454, 24099, 25476, 26113, 22461, 21568, 14641, 10117, 8113, 20655, 22510, 18858, 18471, 21291, 20848, 18306, 24686, 24239, 37015, 47609, 41885, 41631, 45613, 42484, 45442, 44985, 54903, 56178, 47475, 45503, 43793, 51777, 59908, 56998, 47656, 39057, 38421, 17667, 16008, 36062, 43902, 44591, 29863, 22750, 21130, 32651, 34093, 33217, 23624, 28251, 33239, 36022, 30585, 29233, 25640, 32757, 32742, 37454, 44450, 47659, 32133, 35066, 37581, 26450, 26424, 30018, 31594, 32363, 35100, 42348, 29506]
8038B9506q439N727m694M017L420R405J6542k900p234J235J0005k196p448L384
8024E0330J3366K5383J3131j6506j6292q541L82l13L66n847l384q045r723R952
8010D4259J3735o587J669J0911M124J469j4860K805J1395M080q48O680O80p939
7996G1573r736m578l847j4840o54R456N370O780N636l394N90L196m669L855j102
7981F3636p759J370J1066J344J3738J4409O806j0889j2787l435j6361q089q215
7968D4834J3876O499o641N502j7960j0138L744J5073J0771O105L830j574n929
7955F7992q994j288n229m377j541L210N432n758Q963J3357n483J919K878j925
7941F9156k064J0442m452j3919j6008r027M012J3269J8750M590M034J1702j205
$$ y = [29506, 21067, 26794, 22100, 26117, 29537, 38942, 55484, 52584, 45350, 46585, 56590, 54394, 46946, 50330, 63696, 89079, 102210, 85704, 69412, 60871, 61253, 60940, 61306, 55459, 52075, 44030, 34307, 44259, 57994, 51407, 53076, 63987, 68111, 69580, 54720, 57525, 68920, 73000, 72152, 78832, 79512, 71573, 61837, 57259, 53412, 38572, 37918, 47374, 52744, 59524, 65160, 61766, 62356, 65552, 60883, 64738, 63636, 55877, 57247, 68313, 69657, 83395, 97804, 104610, 93721, 80934, 77499, 61138, 53049, 44834, 58710, 65209, 58568, 64070, 46110, 35972, 39716, 54789, 65560, 71665, 75495, 73921, 67992, 58998, 57710, 52481, 48104, 46563, 49773, 55205, 49447, 58410, 71767, 66284, 68203, 71081, 69156, 67092, 77534, 73082, 59163, 43155, 34128, 38140, 51409, 70159, 74749, 78783, 90485, 89280]
7928H9280j134o25j403k31j7262m749J3730R460R808L839l431j6944j8186j178
7914F0974m402j5427M275P349O19l524j2765q94M852K685o766q15Q376l495n671
7899C5371k674q495o553J363J2693Q310R52j016M88q887J3005j323n995M165J5305
7884E6709R605j2583j7879L995Q324n000N581K726j7409j3851J39Q125m978m918
7870A8586J5394p524O84n518j8140J597J67J0334k998n703K240J1640j381R58
7856B0336m759N414K048K386r878k835O085L963J4199O324k0353l149j580q202
7842I999j072R228j15J34l106j9369r238J793j406L203k22l289O526K665L204
7827a065k385n548n016o417J2117K0866j861j2313L202p00J529M938N494q087
$$ y = [89280, 88146, 87521, 86118, 85887, 68625, 63876, 77606, 87066, 96874, 100713, 97282, 80338, 62152, 60974, 56572, 41145, 45420, 52769, 53388, 49864, 37099, 36205, 41057, 43742, 36976, 36161, 44537, 41042, 35371, 32697, 24202, 17649, 19012, 31705, 40015, 40967, 39951, 40439, 31552, 44557, 43234, 37239, 41404, 56709, 66314, 53731, 35852, 39847, 48171, 43171, 48752, 51478, 34069, 20218, 20357, 28482, 23504, 18586, 33980, 26456, 27140, 21622, 3482, 5079, 5246, 15580, 12582, 6879, 9119, 20759, 19378, 20336, 15577, 20991, 23039, 25425, 15547, 12712, 18797, 22760, 36959, 43283, 22930, 19781, 18201, 9999, 8927, 18155, 18040, 18174, 15068, -4301, -13539, -11746, -13152, -9949, -10171, -13460, -6934, -4269, -1065, -3450, -8998, -14014, -20431, -8314, 12552, 10691, -1622, 1580, 880, 2409, 7347, 12841, 4754]
7813D754j3939N819m369N341k814j206l723J3262j505j3632r870P175k88n523
7799b0518O774K33J3272R864m371o401j0202j9202Q752J0952l389n178J5748M929
7785A263j496J79n522p625J0045O279o965q221n636N22o278k359K464M105m443
7770b3688M959J765O5j014J0935k985Q85m110q082O518J1890k507j277j8164j505
7755b6315L523m271m507L628J2196Q644k23l629j82l474l329K266m796L31l510
7740b3648J456P251Q6O833Q78J674l221q300n044J206K090J0691M568n783j3190
7725b2453L880J8356q773j2651j402L103J107r74M837J0523R365j1101L545Q339
7711E701N326j1552j0108L276O434o835j818l999j7195k5530r487K2234J2075
$$ y = [4754, -9185, -3366, -7735, -2394, -5208, -6414, -10137, 3125, 1620, -12012, -21882, -14707, -14995, -20518, -13744, -13511, -239, 9625, 5254, -1147, -11349, -30551, -21799, -10847, -14236, -19414, -3666, 1263, -233, -54, -5576, -13201, -3156, 3123, -3842, -12063, -17699, -17177, -23455, -25814, -23350, -19245, -23688, -18729, -16964, -16899, -17913, -6978, -9963, -9078, -13188, -21270, -14752, -2862, -5369, -6646, -24810, -26315, -22792, -27063, -31570, -27942, -15746, -7102, -7325, -10954, -11136, -14610, -17939, -15673, -20469, -20138, -23648, -22192, -14941, -14855, -8022, -7144, -5470, -8691, -16991, -22035, -20829, -18739, -8048, -3480, -9263, -22453, -18573, -217, -8990, -21641, -23043, -19940, -18833, -19807, -14970, -4447, 4918, -6183, -2638, 5701, 11027, -525, -10633, -7357, -923, -7758, -9576, -13575, -30770, -56300, -65787, -43553, -31478]
7698c1478Q776J9233Q816l281k1071k027M609J8040K821m96m489O11m384p164
7684a1484L06R53o933m757q64p161j0137m884N188m404n277j741J6246J2221P323
7669a5405k536l830r105q839q898J862N43Q058R073N970k064j734O759L359K849
7654a3938j1760l903m838K215l137K594n31n283m167r161o293J1418J7289J7434
7640a2061j0066p66N45k115r962k875q892K172J1949M011N797J0503M004l65q597
7625a6718j274O614K254k041p359K079P538L92l612r542J554j361j2419L487J3955
7610a6453o78J405l544P602K007J930m304r954N864O83k354j580m693K916L673
7595a7480j6641m903L078Q62R449M837k318J2675j3809m450m226J11P819O439
$$ y = [-31478, -22702, -3469, 5347, 2066, -19005, -21032, -16423, 1617, 4438, 3942, -547, 64, -4320, -11484, -11178, -10225, -17158, -21915, -22779, -29940, -40077, -44961, -39773, -44177, -49454, -51195, -34949, -22728, -15405, -17941, -21771, -30876, -39715, -48613, -46751, -46208, -38150, -29077, -23107, -25171, -26905, -20146, -16787, -13938, -25698, -29601, -34439, -32224, -35361, -32767, -33298, -38581, -42748, -51909, -58202, -46784, -29495, -12061, -22127, -22893, -22348, -24463, -34425, -37300, -46192, -44020, -32071, -28060, -22263, -11760, -7756, -8121, -16718, -17992, -11378, -9124, -11165, -18524, -16445, -8907, -8515, -12127, -21669, -20115, -21476, -33895, -30408, -16453, -17131, -15726, -19270, -11668, -9661, -7731, -12035, -21989, -16125, -15442, -17796, -19376, -24069, -21153, -17480, -34121, -39024, -35946, -35084, -25635, -20798, -23116, -10441, -24250, -28700, -32926, -32815, -24996, -18557]
7581a8557J0704R132n690l3605q257M602J4811O951p141n996m672P08J1956L195
7567b1859P941j107O130j803j6593J2681J1184k277j1424r194O570P066R328j0042
7553a3399k015j7196n694O824J904L354J2737r360Q866o44j59N453L978j7169
7539b2520j6787Q10j655K0358J2621r970r464k151j051r864L786M784J1545L92
7525a9166P790J794m148r14R231j9559l740k689k139Q382O714J0048o583j3832
7511b8811N067O251J1154J1218N709k3385j3826R73J498l215j519J0366k1397
7498c9917r332k150Q756J1956P511K138J2875O357j881j0512m649K57o722L187
7484b2126o921J4021J1205K291j0147j4374N578J6865K173q75j2788o563N796
$$ y = [-18557, -7853, 1279, -4411, -38016, -46273, -41671, -26860, -19909, -27050, -33046, -37718, -37010, -25054, -21859, -13918, -15025, -8895, -10698, -27291, -14610, -3426, -5703, -17127, -26321, -19751, -12685, -3357, -13399, -15414, -32610, -38304, -31480, -29576, -26222, -13485, -22845, -13979, -14623, -14782, -9329, -5351, -22520, -39307, -38497, -40152, -19794, -7173, -17143, -26607, -28758, -29809, -39673, -35887, -31103, -19558, -19166, -11376, -9582, -13730, -14644, -5413, -24972, -28712, -31401, -33540, -25158, -18444, -8396, -14979, -28811, -23744, -17493, -6339, 4879, 10588, -12797, -26623, -25650, -24152, -27367, -28886, -18520, -39917, -49249, -51399, -42643, -30687, -23176, -21038, -8163, -1806, -3687, -14199, -18848, -18591, -25313, -22126, -29047, -15026, -3821, -1530, -11677, -26051, -20473, -3608, -1435, -2310, -15098, -21661, -15865]
7471a5865M861J4940n707j2306r153n391o110M697k896m201N315P011O416J711
7457a6678r944M485j724O035l561j2751q756k798O945O844O429R745P532o827
7443a5024q655J785O02j018k63p825l572j0882J5055K2214J086j5759k072J2200
7429a2128n2o809j0206M957J5661j329K383K512P233R238j6809k1714p112J2002
7415b2173K256k055J6196N259l096j3437M221M213j8344j0911J4657J9404N848
7402B038j7735j7961K130J2748O393n785j0995M632J3432j832l481m354j3288
7389c4058l393J3650K330N0M13J775p362j0060k370P715J6649n450j0236Q407
7375b1940J667j1156l983P514P907J0595o560n623J1143J2073m004j2893n499
$$ y = [-15865, -11004, 3936, -1771, -14077, -23230, -28621, -34731, -30034, -32930, -37131, -31816, -24805, -18389, -16678, -26622, -22137, -23861, -17826, -21387, -34138, -42894, -45692, -38747, -31903, -25474, -15729, -8197, -15024, -23679, -21894, -21292, -22310, -22573, -30398, -33970, -44852, -29797, -7583, -6497, -22256, -24328, -12128, -12180, -18989, -29195, -24238, -8577, -9906, -7523, -5011, 2222, 11460, -5349, -27063, -34175, -22173, -19917, -21972, -5776, -517, -3613, -17050, -12829, -8616, -26960, -37871, -23214, -3810, 2038, -15697, -33658, -31528, -18780, -12387, -18172, -29167, -24535, -11103, -12935, -16416, -20770, -34058, -37451, -23801, -21471, -21421, -21008, -19233, -26595, -36655, -39025, -31310, -14661, -20111, -30347, -21940, -20273, -31429, -35412, -27898, -19991, -9396, -15956, -21579, -10436, 1637, -2367, -15260, -20759]
7362b0759n803j0563L580Q014J2719J626p786q57m756J43Q364m579j2806R04l934
7347c6493K494J037J6746J5982J24j4824m608j4094K429P705J6836o028o339K752
7333a6281n997R6o513M397J2085P181j26q827k560J142J8915j2891M882N43o186
7318a0140j4677m791o035R298J5899J0395k487q353p555K141O115l624j1151L255
7304b1710j486J2587J4664q362m185O415l844K042J181n106m386j0008k004M992
7290a9210Q238q323q55N782n617K677m541p740M983r073L688Q937R99K590j4191
7275c1656R214Q843K965j263j1411j0445J0941R097p125M991r1m874N431Q912
7261f471R290j188m887j5788k289m618R726M501Q294p486p84K982M427R01p327
$$ y = [-20759, -26562, -37125, -33545, -25531, -12812, -11186, -18972, -19829, -24585, -24442, -16078, -20657, -33463, -32559, -36493, -33999, -32962, -16216, -234, -110, -14934, -19542, -33636, -31207, -23502, -6666, -12694, -19033, -16281, -22278, -22182, -28695, -24298, -12213, -5032, -5158, -13985, -16545, -15403, 3512, -9379, -4497, -3954, -10140, -24817, -29608, -35643, -26345, -10446, -51, -2538, -10891, -18446, -16305, -10190, -13814, -24965, -21710, -23196, -10609, 4055, -4307, -8492, -2077, -5921, -3879, -2698, -7804, -12190, -22198, -24202, -19210, -10972, -19295, -20150, -14368, -19985, -17308, -21849, -29589, -24606, -33679, -29991, -21054, -20055, -17465, -31656, -22442, -13599, -10634, -11897, -23308, -33753, -22812, -13715, -20840, -15849, -15940, -20814, -15383, -6471, 2819, 1631, -3256, -19044, -21333, -25951, -16225, -11724, -3430, -10916, -11700, -8718, -4291, -3390, -10717]
7246a0717n086n499j340N406l258j205J510P946N75q434k31n233o426p595k206
7231d1793L059N748O227k203L527j112L058l661k407Q474r504r022R453N040m923
7216c0039j454N920m398N753P756P769p954l648R14K410R534m942j912m554J4293
7201d552o945j2430k175j725K851K5952j0013n981j0698q341N804P688p08K629
7187a8644j88J4894N766j4883j2749n04o528j2504P133M713l383n167J5871N268
7173b0905n420k608L013J3626R875n004L705m597j2721m891N171m9q781Q939J2152
7158h495K766j0213n99J341r683m827n070M618K891P139L776n227L299Q13l996
7143b1467j750K761P153M130l188j093L273n848j9484k619J5076m999j5183l375
$$ y = [-10717, -15803, -21302, -22642, -17236, -20494, -21699, -20189, -12243, -11668, -20102, -20333, -25566, -31992, -39587, -41793, -38734, -32986, -26759, -28962, -25435, -26547, -23489, -27150, -29557, -21083, -30587, -39609, -30156, -25116, -30039, -31493, -25573, -29971, -24218, -16462, -8693, -16647, -20295, -19381, -16971, -7437, -12379, -14291, -18845, -4552, -11497, -23927, -26102, -27827, -24976, 976, -9037, -15018, -25716, -34057, -28253, -20565, -21273, -18644, -18832, -3938, 1828, -13055, -25804, -26308, -32836, -45340, -38207, -33494, -36877, -42044, -26173, -20905, -26325, -28933, -25920, -12294, -2419, -7423, -3718, -8315, -21036, -25927, -20756, -20805, -29586, -20647, -8495, -5729, -15942, -16541, -15200, -24883, -29710, -34780, -30162, -27271, -20132, -16356, -21583, -18284, -17471, -21467, -23217, -20456, -13303, -9173, -12361, -13454, -10181, -16029, -35513, -38132, -23056, -28055, -43238, -46613]
7129d6613J4648J3728J3735l081Q00n709n975J652O889Q123o82p367j175k375
7115a3402J644j062L765R481R672q099M484J072p591o527q564l146k738J411J0997
7100h603j671j1331j0819j2318J3703J8672J2161n300j5626K258O539l113M939
7087a0509o49j0561R25Q664J1111M220p484M652L590j8079j2985J223N585l739
7073b4036n07M558J6877Q692N085r795j1004n38M328N945k799J6055r105j2711
7059h955l615k390J2171O807j0442j8991k113m754J627Q694J64k595J544k66o219
7044b9333M275n781K447J1982n758j0127L522J1387N542N066j2960K118J5588
7031b032O751L211M354j5393j5174p922J3278J642p642Q326o007k166K54j0473
$$ y = [-46613, -31965, -18237, -4502, -7583, -6783, -12492, -18467, -16815, -9926, -1803, -2485, -9852, -11027, -13402, -11758, -12820, -9055, 426, 10098, 1999, 6483, 7555, -36, -6563, -15127, -18273, -21011, -19600, -8603, -10274, -21605, -32424, -44742, -31039, -12367, -206, -5506, -21132, -18874, -12335, -15448, -10509, -11158, -21719, -20794, -12130, -1019, 3201, -4283, 369, 3959, -14120, -27105, -25882, -20297, -24036, -24543, -19985, -3108, 5584, 10669, 874, -10130, -10668, -6340, -395, -3194, 12861, 3756, -8955, -12570, -14960, -2789, 4018, -6424, -25415, -27528, -32282, -30655, -21961, -21797, -24392, -22848, -23114, -29333, -25058, -30839, -28392, -16410, -22168, -32295, -28773, -17386, -11844, -6778, -19738, -17620, -2032, 4719, 7930, 12284, -3109, -18283, -26205, -12927, -11285, -18927, -10601, -16608, -18774, -18520, -28993]
7017b8993n160k976j516q185M902J2638J1200P786P291o173N867K888n225j4112
7003a9768j0625p224n890Q32J7292O106L704O054O547O405n725K066K806M459
6989G039j4416K502Q179l337j0264k350J119m118J313j6160k2351K578J9853O825
6975b3588L601n308J324L669k757j4083K999K803l181Q139J6345K636j4635p177
6961b9213K011N418q264R252J2870q480l023J341j5887l130J5919oj765P063n846
6946b1740j3583O717R482q248J3589J2328k528j1717K296k332m15P136J2186N577
6932H748l21j1320n474l655r698m187O478J1907q570j936M305J3370J983j6599
6918a4969N269r427k894K277O209J0416k556j7847p549J0403J1983O552j724k0771
$$ y = [-28993, -34153, -37129, -38645, -46830, -41928, -29290, -18090, -10304, -3013, -9186, -3319, -431, -5656, -19768, -30393, -37617, -43507, -42675, -25383, -19277, -15573, -9519, -2972, 3433, -2292, -226, 2580, 7039, -7377, -4875, 3304, -33, -10297, -12647, -11528, -15646, -14333, -30493, -52844, -50266, -30413, -23588, -19987, -25295, -23971, -20302, -23059, -37142, -34143, -31340, -34521, -26382, -10037, -7401, -22036, -29213, -27202, -21784, -30048, -20796, -7926, -16406, -19429, -18088, -33975, -37105, -21186, -21192, -22957, -15894, -21740, -35323, -28606, -19124, -27372, -13783, -1455, -3983, -15700, -13404, -15736, -16151, -9015, 3171, 8748, 8427, -2893, -8367, -12022, -21720, -25907, -19429, -7522, -16092, -18028, -13723, -353, 1630, -14969, -9700, -19127, -22021, -19744, -13535, -3119, -5675, -23522, -31071, -20668, -8685, -2133, -3857, -24628]
6904b4628j308J3006J0031l986j2303r161N766J3437R780j1009m318p469n651
6891b7813R069J4583n775j0995o375m167Q797Q655o368J470O915O224l732j1024
6877b0536N562M608q705j1931o830N518R170p72J2091J1020j2289l284J5788m311
6863d901r600j0552Q585R744l846j3680j128Q289k524J830l903J1357L155N593
6849a581Q015q444o40o677P032L722m608m969l26l569q154j8605R40K884J2876
6834b2104O346j76N898j195r717p046J600P393m387N173J3418j0190r068k919
6820b6974K357L336L210J3232l892J549N514j741q646j096N7j0032k87J3517k928
6805a2824J5286O213j2300r508L359p087O163p635j0064k411P814k241N693k703
$$ y = [-24628, -25936, -12930, -2899, -6885, -19188, -28349, -22583, -9146, 634, -10375, -14693, -22162, -27813, -18744, -4161, -9936, -20931, -27306, -31473, -22676, -14021, -20389, -18919, -12004, -5780, -9512, -20536, -14974, -10366, -19071, -31002, -37832, -32314, -23144, -23916, -11825, -805, -13094, -16378, -590, -4901, -14501, -25053, -16468, -6724, -10570, -24250, -25378, -17089, -19613, -17783, -21686, -10329, -7174, -1581, 6434, -2010, -2650, -9327, -2295, 1427, -3181, -8150, -8476, -12045, -20199, -38804, -37864, -34980, -22104, -15758, -15934, -10036, -11231, -20948, -27994, -26394, -19001, -23388, -18215, -4797, -14987, -24055, -26974, -24617, -21281, -18071, -4839, -8731, -7182, -1668, -3409, -12055, -13151, -13094, -23126, -23413, -9896, -12824, 2462, 8675, -3625, -13133, -9774, -16861, -10698, -18333, -28397, -30808, -22994, -25235, -19542, -22245]
6791b2245L9J3794R492L792O551Q808k467j6122j3566n689j6510n334J2853J3000
6777a3604m45q059J2193M693j1116L377K03o773J3813Q052k971o153m704k877
6763a4371Q295J2842m663m517k099p879j561P651o493m655l748O468J4566p95
6749i59m280l941l18L848p131p421r146q441J4438M788o290J1608M995k947j412
6734a2609j175N131q927r54k61j76M979J0092L492j341m202o266k864j736l041
6719a9858M547j178K133k695l917O143K630j1891p959P761J5372O24j725k569
6705a2582J4526N219j4762q148J0326O010k575o871m877m547L993J7618J2240
6692A5570m07r389j2538J46J0609P726K215j7836j0970P741K274m105o573L897
$$ y = [-22245, -22206, -8412, 1080, 4872, 11423, 20231, 17764, 1642, -11924, -17613, -34123, -39457, -26604, -13604, -14049, -22108, -9915, -5222, -16338, -12961, -12758, -19531, -5718, 2334, -637, -6790, -11494, -14371, -6076, 6766, 2103, -2414, -4513, -12392, -13953, -6302, -12795, -17450, -21198, -14730, -164, -959, -5239, -9180, -9498, -5650, -12781, -20202, -29348, -37789, -23351, -18563, -24853, -13245, -8250, -11197, -12609, -13784, -8653, -17580, -18534, -18795, -18971, -13992, -3900, -408, -1749, -5951, -12217, -15081, -16817, -19858, -15311, -16489, -14356, -17051, -20968, -14825, -12195, -24086, -32045, -24284, -8912, -8288, -10013, -12582, 1944, 7163, -7599, -15747, -5421, 589, -1986, -8857, -13734, -18281, -14288, 3330, 15570, 15163, 5774, -6764, -6618, 3991, 11717, 13932, -3904, -14874, -7133, -4859, -8964, -15537, -11640]
6678a1640K943p955p573j7226O48N199J416J1672K0249Q628j0939R66M63l323
6664f472m495P021p602l208K681J2789R615o784j1381q579J617J1856n795j754
6650a0491M935p591r57N544m114k371N639P175o861o354j0089L924J5803N237
6636e71N986r046m079j2720m013L024J1345m704l343j740l274l771j320M036L12
6621b3878j2411J5344N094r353L547o048R400n915r878O585j699N158J4130n81
6607a0505k069L911m341P612L773n033J243m82l500N007P073O304q22j2662N4
6592d437M524j0788J701o823J00k253P846p429j521m932N656J2759P330m628j336
6577d231m615J2311J2824n078n310L504N128k017k538j3916j2680o289J2195P896
$$ y = [-11640, -8697, -16652, -24225, -41451, -40803, -35604, -34188, -22516, -2267, 6361, -4578, -3612, -3149, -6472, -10967, -3946, -11548, -14756, -12075, 714, 10329, 3545, -7836, -16415, -14798, -2942, -8737, -10491, -5556, -13147, -14104, -8560, -12674, -15045, -9406, -2231, -9092, -15446, -25535, -21611, -5808, -571, 5415, -3631, -7710, -20430, -24443, -21419, -10074, -14778, -18121, -19861, -23135, -26906, -28226, -24190, -23878, -36289, -20945, -15851, -25204, -21657, -27705, -18305, -24220, -34098, -27513, -29212, -24054, -9924, -10505, -12574, -8663, -13004, -5392, -1619, -6652, -5409, -5891, -9391, -4384, 2689, 8993, 8171, -4491, -4437, 87, -10701, -9000, -15823, -15723, -17976, -10130, -17559, -19080, -24012, -18356, -5597, 1733, -2895, -4231, -8846, 3465, 16289, 11211, 5901, 9405, 14533, 12516, 9978, -3938, -16618, -22907, -10712, -2816]
6563b816j30r067j7662q122N952O88l889P568J3218L549J0509O76k450m553j1271
6548a7800R83j428O515n734M99p771M292m470O301j611k208q457M258J1247k458
6533a7842k458P649k997l572m649p447o170j268M109K828J4894R051j853j1810
6519b1535R348K822l431l300J1352N360K325q900q829K737l63j2622k213J1331
6505a5918J8150j2526k3402j2080J6711R451m721M251P181J1824O9j4197n888
6492b1095j0548J4232J0450O395l198J558N040L537j7048l994l342L335j0139
6479b4817j4489J1966J0844R007L898j188K070j105q102J2300R48O016J170l737
6465D781p252l675P285R93k190q003N327o545m475R34q610J4965o934j1905J1270
$$ y = [-2816, -2946, -12013, -29675, -37797, -31845, -31157, -35046, -27478, -14260, -10711, -202, 474, -1976, -6529, -17800, -16817, -18245, -11730, -17464, -16965, -24736, -20444, -24914, -18613, -20224, -22432, -30889, -26631, -15384, -17842, -20300, -12651, -15648, -19220, -23869, -31316, -37486, -38754, -34645, -31817, -16923, -7872, -9725, -21535, -12187, -9365, -12796, -16096, -4744, 616, 2941, -5959, -14788, -12051, -12414, -25036, -27249, -15918, 2232, -10294, -33696, -45776, -29065, -19614, -24335, -20084, -12903, -1079, -1010, -15207, -21095, -31643, -17411, -6961, -566, -3764, -2206, 2834, 6371, -10677, -14671, -18013, -14678, -24817, -39306, -27340, -16496, -7489, -3591, -4779, -2709, -3814, -11916, 384, 1332, 7348, 8518, 4781, -2471, -6146, 1139, 2132, -58, -8061, -2734, -9279, -13754, -12820, -21430, -6465, -13399, -25304, -14034]
6450a4034N533o871o29L392O375j309m676l264J160Q730J2237p498n027J704L297
6435h80J5350k401j3048j1036j811Q763Q169j0887j7530m623j0386l986J8028
6422b6278J2600K70o145O844N753M512M452l555l094r599q657m141j877J1927
6408a6988J6407j491O079q087j3630N408J316L078n333l802N281O659O2j1829
6394a6870J814k779l400p260J444Q740k016L44M53M631J908k858N139n129o378
6379b2217k322k860K1230J518M286J616r498q376j387m437K684L495P921J436
6365f911m338N840J614j423j0366j512Q63j914p234j585O885Q876p871M727J0311
6350d038p569j4551J8673J5728j6046J1024N847j1737j1460r707K757P42k807
$$ y = [-14034, -8501, -15372, -16001, -12609, -6234, -7543, -12219, -15483, -14323, -5593, 6644, -854, -5881, -4177, -880, 14470, 12069, -979, -12015, -13826, -5063, 3106, -7781, -25311, -29934, -40320, -44306, -26278, -13678, -13408, -19553, -12709, -6956, -2444, 2008, -1547, -4641, -14240, -22897, -27038, -28915, -16988, -581, -2072, 4007, -4080, -17710, -12302, -10986, -7908, -13241, -17043, -11762, -5103, -5041, -16870, -15056, -17835, -21235, -28495, -27051, -18311, -20327, -19983, -19530, -14899, -12991, -15849, -10710, -15839, -22217, -24539, -27399, -6169, -4651, -365, 1251, -8247, -16623, -18010, -22447, -19763, -16268, -8347, -6911, -11249, -5409, -3795, -5218, -15584, -17096, -16233, -18147, -25381, -26966, -20081, -11205, -19076, -14349, -4038, -11607, -26158, -7485, 8243, -7803, 3221, 9068, -2669, -14129, -23836, -21079, -20337, -23144]
6337b3144M624j1555k930J4148K326j4547K446R701J3081O354j098j1073J3857
6324B190N743q596r545o614j6749J387J1088M646J8772J0398J3311m348k1393
6311B90k1673j504J8307J358p354q701J783K1884m094k995K417P52k28k321j17
6296b196J2904Q618j3643l57q347m642m932J1862O509j1777r095m421k663l513
6282b5693j479o846k96J7613N353J7141P957p010q726j0807k882M038O150Q402
6268B915K84k444m011r349j5273K590J4255L771l438J620j7604j4307J0373K5607
6254e011O154j6366j9503P185J8772N179o807k499J2278K631j1630l09J9148J1064
6240B0286p605j5310O529K791j571j168k6692j7289m552Q433P370J5166R496o629
$$ y = [-23144, -18520, -30075, -33005, -18857, -16531, -31078, -28632, -18931, -5850, 504, -594, -11667, 2190, 7933, -663, -10208, -16822, -33571, -32184, -21096, -16450, 2322, 12720, 26031, 21683, 290, -21383, -22887, -4580, -3222, -10576, -19277, -17494, 4390, 296, -2699, -282, 470, 242, -2079, -2196, 10708, 19326, 5683, 5326, -3021, -7663, -12595, -733, 5776, -6001, -15096, -19517, -22180, -25693, -27172, -34018, -34314, -16701, -11348, 5793, 13750, 6740, -1986, -12793, -15675, -11637, -5487, 2915, 3199, 755, -3256, -12605, -27878, -25288, -11033, -7262, -10700, -9080, -26684, -40991, -30618, -5011, 1143, -15223, -34726, -27541, -8769, -3590, -10397, -12896, -618, 2013, -9617, -9926, 9222, 20286, 12681, -2629, 3900, 6691, 5120, 3952, -22740, -40029, -44581, -36148, -28778, -13612, -4116, -10745]
6226a0745N538P147m124p127j0874j0684j5929P745J4878J9924M566r247q19J1058
6212A307Q91N440R22O499r781p524K886m923q83o973J9113n132N342L575j3438
6197b679k651j3324r019J654P098K17J583P037J408q406P007K360J774J0576m714
6182g9J466q110j5080k584K0644N125O846l900m207o125n314L569R426p943j83
6167f449l25n247j050k729j3124o007Q402R428o899l102P411J572o983k049J5631
6152a1520J4391r304J432k860j4955k317M688Q562J3271Q287n822j5544m139J3597
6138b233k403K808K701j223j0175j0175m883R772K712q584M280Q716q041o367
6124b3095L968K937m227j4025k46J0350l469j846P884Q363R046N312p241J745
$$ y = [-10745, -5207, 1940, -2184, -9311, -20185, -30869, -46798, -39053, -24175, -4251, 315, -8932, -9751, 1307, 2198, 7638, 8560, 15059, 5278, -2246, 640, -4283, -5166, -12139, 6974, 1842, 7184, 10759, -2679, -5330, -18654, -27673, -26019, -18921, -18704, -17121, -10084, -8676, -17082, -10075, -7715, -5941, 4635, -79, 1387, -6723, -21803, -24387, -3743, 1382, 8228, 4328, 121, -6004, -11318, -7749, 1677, -6266, -6449, -6774, -12021, -13071, -15800, -28924, -34931, -26529, -17101, -24000, -27102, -19691, -18119, -25102, -27151, -11520, 2871, -6433, -5001, -7861, -22816, -25133, -20445, -11883, 1388, 9675, 3853, -11691, -15830, -2233, -4636, -1828, 873, -350, -10525, -20700, -25583, -15811, -13099, -21683, -17403, -8687, -16728, -23095, -19127, -16190, -20417, -34442, -34688, -24338, -27807, -29653, -21769, -13406, -4360, 952, -6289, -4544]
6110d544Q993j2882n343R448j1491j223M233o559q00J5351R116J0512J209p218
6096H802p032j270j5522q782J2332M792l245k139m473N303L633O298m171m717
6082a0191n599N180R500j1277j2632J279Q767L090j868J0905R333M230p213m335
6068h31O344l882r719j1996N478Q370m859k65J634j0156n952n432j784N695J9285
6053h070J021m014L677P980L770p785j813M904l64K003k073o244p821P576K923
6038d330q499M135O214O516q758j0542L224k853n493r51R15j0993Q158K3635J05
6023D83p163q454O139J0161n564l85K843P766J112n325p332j4755J1424J6554
6009G504j124k511M535n664j2585j339J5013n050j7983O244p612m892j432J5677
$$ y = [-4544, 4449, -8433, -13776, -4328, -15819, -17042, -12809, -19368, -20168, -4817, 4299, 14811, 16020, 8802, 1770, 500, -15022, -23804, -11472, -6680, -9925, -12064, -16537, -11234, -7601, -1303, -5474, -10191, -15790, -10610, -1110, -12387, -25019, -23740, -14973, -11883, -13751, -2846, 6487, 10717, 3504, -831, 5513, 1631, -8088, -20084, -14606, -6236, -11095, -11360, -9726, -19882, -25834, -31266, -33050, -27355, -8070, -7049, -11063, -7386, 594, 4364, -3421, -5234, -330, -694, 1309, -764, -7008, -14829, -7253, -4330, -12829, -8694, -2480, 4036, -4722, -15264, -12040, -14893, -20386, -21337, -20422, -31415, -23257, 378, 483, -6680, -15134, -8995, 1166, -4398, -4783, -1940, 5826, 6938, 1613, -5719, -20474, -9050, 7504, 6380, 3869, 8404, 2740, -9845, -11184, 3829, -1221, -19204, -12960, -20572, -25464, -26896, -11219]
5995a1219P437q862o89o7j3513q21J2779K8505J9357j913k6834k2175n774O004
5981a7785r013j1205J9591J3316L538k433q566J64n072p045J936Q794J0004m452
5967h228m38l865p981p440l577M259P249O74l730p715O187q622k465J1614Q024
5952a6054Q17N478J0404J2805p245j1822J733J2472P84j0913j5291j0278J265
5939b5845J0288K900q579j661K2391J084o992q628M306M290R72M550k410q510
5925a1844K853l439j1876q957J1653J1768N003J652N192P479O867N703M604j3929
5911A2729l420M58j0570l181m54r159K368j5243r525O537M950J5216l034P79J0018
5896a531q323l684K133p899k237J2178N270o230N029J756M439o45L579p27m945
$$ y = [-11219, -3782, -12644, -13333, -13400, -26913, -27734, -14955, 13550, 32907, 30994, 4160, -18015, -23789, -17785, -26798, -38003, -18412, -5096, -1558, -3991, -12557, -12393, -17465, -24510, -22574, -13780, -3776, -8228, -8666, -12531, -20512, -27952, -31529, -27270, -20021, -19347, -23077, -30792, -24605, -33227, -35692, -24078, -16054, -15237, -9759, 645, 13450, 6205, -5617, -3884, 8588, 9372, -1541, -16832, -27110, -25845, -15557, -12657, -21236, -22897, -506, 578, -6414, -15042, -10736, -6446, -5474, -924, -3334, -11844, -8991, -12430, -24306, -33263, -21610, -9842, -4839, -3187, 2005, 9484, 16351, 22054, 26658, 12729, 9309, 9767, -803, -3984, -4438, -13597, -11229, -26472, -35997, -29460, -24510, -9294, -12328, -11549, -1531, -9854, -13538, -11405, -19304, -21541, -9363, -4093, -10323, -5294, -3538, 901, 256, 3835, 3108, -1837]
5881a837q439j3173n844o477P05K405L410J0131J9386P675K732p235p805M559
5867A93j019P491k255n30J866J985m482q339j933J2031R807P43j0255j2540r264
5852a6501K288J5223J8065l247j6377m395N813J954K918j993j8093m353O97p187
5838b5188J7893O999O872N93n613j2989L302k917N30%k669n345J929k82m835P463
5822a4257m30L258O444J0664O803k0547j7686J24k756K954N922R162m445J14N423
5807i253K117k973J1555L564k608p253P326J1012Q325p964j6426j2435j217o713
5793b2943l543K231Q002J0963M761j3623L026L684l531m380K986k208k122K70
5779a6427J429m256k681n688J4393J867n129m687N803K54Q98J304O879R264p986
$$ y = [-1837, -10276, -23449, -29293, -35770, -35065, -32660, -29250, -19119, 267, 7942, 10674, 3439, -4366, 193, -826, 6665, 4410, 3880, 5746, 7731, 3249, -5090, -7023, 5008, 14815, 15558, 5303, -7237, -16501, -14213, 1010, 19075, 15828, -549, -4944, 869, 2823, 5741, 3748, -14345, -18698, -18001, -25188, -7295, -296, 6576, 7169, 1556, -11433, -8131, -11048, -10518, -10518, -13187, -18532, -16603, -16885, -21720, -14257, -14687, -11429, -4985, 5679, 12482, -8065, -25751, -25627, -28383, -25429, -19507, -10345, -14790, -14676, -9253, -7136, -10109, 1446, 5010, 2402, -4851, 2475, 13487, 21812, 13848, -2578, -15013, -16230, -22943, -26486, -24255, -16253, -5290, -529, -14152, -11126, -7442, -10973, -15353, -12367, -14575, -16697, -16427, -14998, -19254, -21935, -27623, -13230, -11363, -16492, -21179, -15376, -15122, -14224, -12920, -6041, 3223, -4763]
5764d763j2614Q798P641o607k06o046q25J1721j9039p882R418o499N603O575p288
5749b2013l438J8790N532K68m373j3830r468J5119O227J085n853q483j642o862
5735b8941J2700K031q782q319Q314J0808L060l818l358L945m571k203R974J794
5721g366p298o419l595j936M996O811J7658l69k372n289j5625N959N984P642p708
5706h927j101o854O217J403p854j2195o76R534N971K734J5487o204J1941O68o209
5691C935o523k249J924O564q62k768j660j2434j8868q784L103J5479M849K213
5677a6081m280M464j710J107r11M378M059R21q361r347q887j638J2313N582m399
5662b2790k010J261j026L594p327p180K19R534N548Q491J192l614p539j1685M652
$$ y = [-4763, -17377, -8579, -938, -7545, -7751, -13797, -14622, -2901, -21940, -29822, -20404, -26903, -21300, -14725, -22013, -25451, -6661, -1129, -861, -5234, -19064, -28532, -13413, -7186, -6101, -11954, -20437, -22079, -28941, -16241, -14210, -22992, -31311, -22997, -12189, -9129, -12947, -16305, -12360, -16931, -19134, -9160, -7366, -14664, -21083, -24678, -26614, -21618, -14807, 2851, 2482, 110, -5179, -20804, -14845, -8861, -1219, -8927, -10028, -16882, -10665, -9262, -17116, -29311, -29987, -20453, -14482, -11748, 3739, -2465, 9476, 10144, 3935, -2588, -4837, -2913, 3651, 2789, 21, -1639, -14073, -32941, -41725, -38622, -23143, -18294, -16081, -20361, -15897, -17607, -16500, -17411, -13033, -8974, -8053, -16414, -25761, -34648, -36286, -23973, -18391, -22790, -24800, -23539, -24565, -20971, -28298, -35478, -35259, -25725, -20177, -11686, -10494, -14108, -21647, -33332, -28680]
5647b8680J3130j572j350k008o003J0504K3L854R26J5546l411p431J0994M934
5633I456j3786j0566R9n80l963l656J225O973J3617K871o124J622K693m985j5815
5618b0919k074J5485J3121N275k596K774l187k692k82j0062R363R857K248j3199
5604C112j5836R42K671N320K1524J1294J517r291j4906K249J692K970M021j1395
5590E884J5168j2j8629j0856J4724k947q084j86M715Q317p923n837j739N481M16
5575a508o040J183J0435J272j0347j765O030J0449J082m091P20o568p125J409
5561d864Q022P368j3974n766O056P489K278L550j513j3043p960P714M814r284
5547i113p672M942J7188J3073K383j3813p174m261p59j64L881Q99M008J02N001
$$ y = [-28680, -15550, -17122, -18472, -20480, -26483, -15979, -15956, -12102, -11176, 4370, 959, -6472, 4522, 9456, -4330, -14896, -14797, -15377, -19340, -22996, -21771, -14798, -1181, 1690, -4434, -2812, -119, -5104, -20919, -22993, -7508, 5613, 10888, 8292, 11066, 7879, 5187, 4905, -5157, 4206, 14063, 16311, 3112, -12724, -11782, -9111, -3791, 17733, 29027, 30544, 21253, 6347, 8596, 10288, 13258, 17279, 5884, 21052, 21040, 2411, -8445, 6279, 3332, -4752, -4938, -223, 8094, 171, -5666, -7405, -1924, -1508, -7548, -6365, 4070, 5342, -5005, -6770, -740, 9709, 10791, 6700, 7420, 852, -6273, -4864, 3158, 10526, -3448, -9214, -3158, 4331, 6609, 10159, 8646, -4397, -12357, -4643, 171, -9113, -16785, -11843, 5345, 18418, 20801, 6988, -186, -4447, -5206, -5370, -1489, -590, 3418, 3520, 8521]
5532H521R590j2683p002O100r568J492Q497O909n282j9713j2440J3988K0501J5431
5518B4341k1634k1925k406k586J4374r10J111R329P451q876k1228o38J7595Q17
5504e185m356r540P294R357R58J132l859q121l139L73J163K320K365R868M895
5489E525N98q806l794J240K560J0159J1418M97m897l333p778p008J569k617l561
5474h228J4369P320j4983l669N511Q287j841j8676L781M10r81R912M37K042L859
5459G550r067j4064J2567P880m480j5162Q809Q506J0008o597q373j8613N433o58
5445a6261K046J2944N574l460r051n405Q275J1086K809k872Q382N212j4905n457
5431a083p59p999p616Q938r45P416O123K036o077J4331K511p609q994p567o656
$$ y = [8521, 18111, 5428, -1574, 4526, -5042, -3550, 4947, 11856, 6574, -13139, -25579, -11591, 8910, 24341, 2707, -19218, -21624, -24210, -9836, -10746, -9635, -306, 7145, -1731, -22959, -23597, -6002, -5185, -9541, -19081, -11787, -2430, -1472, -340, -4199, -12320, -15459, -15086, -13923, -11603, -9238, 630, 5525, 6123, -2683, -6477, -5237, -2677, 7482, 18900, 19397, 14500, 11167, 3389, -3619, -2050, -4667, -8228, 6141, 13461, -1522, -5191, 320, 8607, 6766, -11910, -8129, -7719, -8700, 1212, 1649, 3691, 7550, -1517, -15581, -3014, 4866, 386, -14776, -5967, 2539, 12547, 5950, -2423, -21036, -15603, -16261, -14215, -1271, 4303, 843, -8208, -13613, -5338, 5748, 8557, 5685, 14067, 19279, 4374, -1083, -1842, -9841, -17457, -8519, -9464, -2048, 4075, 6111, 34, 14365, 16876, 9267, 273, -7294, -13950]
5416a3950J688J0816qr016p675l547K634p579p704M469J1744n243O723M53n162
5401b1357J7550P083o634j4636P4k183N881J3955K710M956P721o445j2501n972
5387i798R055J0721J2130k365j5484k87J3178j903j5927j1987J032P936l906K902
5373d703M894K70r310k013K848L257m723J1861K94k623m787N783R214j2290j1386
5358a3414n158J139N148l683N575N264r451m201K111P830K0702M868O31k4402
5344g041j789Q495J982N010q937L999L2j3699o537J0784L237l776M479O335r665
5329g091q774j0116l427k827L538M408P451J3896p89j7538k140O447R961j299
5315h300q221P947O853k001n317M368r002O70J2371J4694n162r444o402J0941
$$ y = [-13950, -12262, -1446, -1454, -10470, -18145, -21692, -19058, -26637, -34341, -29872, -18128, -23371, -16648, -16195, -21357, -3807, 3276, -3358, -17994, -17920, -20103, -14222, -267, 2443, 7399, 15120, 8675, -3826, -9798, -743, 9978, 22108, 19743, 4259, 3972, 17150, 15247, -680, -12667, -11635, -3699, -7605, -4703, 191, 461, -8849, -10862, -8014, -4757, -9480, 2381, 2675, 52, -4735, 1048, 10262, -2028, -13414, -18572, -17433, -12285, -15968, -10393, -5129, -14580, -18781, -16670, -8840, 11862, 16730, 17361, -7041, -8830, -335, 1647, 6657, -2280, 1719, 1751, -11948, -18485, -7701, -4464, -8240, -3761, 2574, -7091, -15865, -25981, -29408, -32235, -28697, -24289, -16838, -2942, -3731, -21269, -23409, -16962, -7001, -8300, -16521, -8574, -1721, -3722, -9039, -4671, -13673, -13003, -632, 14062, 8900, -544, -6946, 3995]
5301C995Q814k215K034O54m568L937M986q345p029M216j606m129J6718J1893m274
5286B5081k1195j9346j1498M865M930J9044l946j5502L751L969j826k360R394
5273d639r371j3925M989J0384Q297N484k752o210P482o857J0104m181J1392N136
5259A5333j5630j3038R13J4403L708N243q1j8482q774Q476M992n177p539Q229
5245g424r267L694M608J795J4649J3834o613j1083j0560j593j252j653Q404J556
5231i05N847L602j2332P585l624P52N809M740m866p329p277r504J0746N712K328
5216A284L433o587n510p373m836N963J9131L359N6n219L486r490m760j2670n05
5201b0238J0619K118j8956K120M001J1621J0840k745p7l627q761q455j539k055
$$ y = [3995, 12809, 10594, 12628, 13282, 8714, 12651, 17637, 9292, 2263, 6479, 4873, 744, 17462, 29355, 25081, 3886, -15460, -26958, -22093, -17163, 1881, -2065, -17567, -13816, -9847, -11673, -14033, -4639, -14010, -27935, -22946, -12562, -4265, 1219, -1533, -7743, -261, -7118, 2986, -1195, 10197, 15333, -297, -13335, -12422, 1981, 5689, 10932, 10851, -7631, -16405, -7929, -2937, -8114, -15653, -7424, -16691, -12997, -8389, -6594, 8055, 21889, 15276, 4193, -6367, -7960, -9212, -10865, -2461, -905, 4942, 8544, -3788, 3797, 173, 925, 6734, 11474, 6608, -721, -7998, -17502, -6756, -1044, 1284, 4717, -1870, -7380, -14753, -19589, -13626, 5505, 8864, 8920, 3701, 7187, -2303, -7063, -19733, -20238, -9619, -7501, -26457, -24337, -20336, -8715, 2125, -620, -697, -4324, -13085, -21540, -23079, -25134]
5187b5134J138O637K2855K884r069p215M480Q579r287k813J979J1920K290j86
5173I058L68K928j3159l089J1310M124m371m66j7117n128J6186K2951j1791k6235
5159a4431n135N696Q292M727m957m080Q431m065k629J1821q404n051P321P274
5145D810J5636m737l262o168M049r195n293O433N727N650m089K529M893r24j6056
5130Cp833J9081K6667l010J40j0375j6854p549K725M384R624M526l185J886l47
5115A9883n930k970p973J0858P118m431q841p966q615Q907r621j0858J980R073
5101i386l412j0273J263o341m90N192O650J497L767J0862J8265m560n964n306
5087A764J629j5366j57p335J548o977j1670J771j4724j9706J2095P720Q898J3714
$$ y = [-25134, -23996, -17359, 5496, 8380, -689, -7904, -3424, 5155, -4132, -6945, -4966, 6954, 9244, 9058, 9426, 12354, -805, -3894, 7416, 11540, 7169, 6703, -10414, -15542, 644, 23595, 11804, -14431, -19566, -13870, -5578, -851, -5808, -9888, -1457, -5522, -8151, 3670, -4734, -9785, -2464, 4810, 20446, 15709, 12447, 6279, 10328, 1133, -4160, 2273, 8000, 13650, 9561, 12090, 16983, 16059, 3, -7830, 11251, 37918, 34908, 35048, 24673, 7819, 270, 2995, 7379, 17003, 21529, 18344, 20230, 19883, 13953, 10983, 3010, 13868, 20986, 16555, 7714, -252, -8867, 40, -9581, -20439, -18459, -9386, -12798, -23071, -21808, -28149, -28639, -23447, -16797, -15300, -11533, -671, 17594, 13034, 7070, 1764, 3393, -11973, -12130, -19465, -17917, -24894, -36564, -34793, -49517, -69223, -57128, -49408, -40510, -26796]
5073b6796R989J3794P815q467j2813J898K731M511R242L576j951J473k159k699
5059A44j3050j765J1759K101p268m624J669J924o925o55J3531K100J419P987l59
5044G988p989q523o529q339N848r292q566M395M109k149J2135J4202n36Q713p156
5029a689P42R511p992N050P595l009l655j457j1303O81J2662M302p756m115j2240
5014a2673L499L917n422R844m523j085N357J0952J2652k103j1284j9039q923L565
5000a5266P970N533j0866k206J5335M02R356O343j1382j6726j0693m015J2906
4987a3309J3418L535m646j1734J758p564k214R894L498l155m844j751K300N176
4973i638K296R213r268j001l830N54O920J260n21o578j4510L623J5764J2223m941
$$ y = [-26796, -16807, -3013, 4802, -3665, -16478, -14580, -11849, -7338, 1904, 5480, 3529, 5002, 2843, 144, -12906, -14671, -2912, -811, -8079, -12703, -11034, -9110, -16035, -16690, -3159, -1059, 360, 8347, 7988, -1, -8524, -15053, -23392, -17544, -26836, -35402, -31007, -26898, -29047, -16912, -2710, -3246, 5467, -1689, -947, 8564, 572, 5622, 13217, 10208, 6553, 5096, -6207, -5526, 7136, 11438, 3682, -433, -12673, -9174, -5257, -10679, -835, -5358, -6443, -1086, 9866, 22518, 20415, 9131, -9908, -18831, -15266, -7296, -1763, -12629, -14835, 500, 902, 10258, 16601, 5219, -11507, -22200, -26215, -13309, 109, 3644, -1002, -12736, -10978, -18542, -20756, -10862, -7364, -10519, -15363, -17114, -14814, -9638, -7342, 1871, -7397, -8398, -12228, -11674, -4754, -3494, -4015, -10593, -25103, -21480, -5716, 6507, 1566]
4958A566K92J4495L8k4995r866J3494l171m582J3444R392m96m675o726o283K708
4943e365j1408N108K5047L088j1207j3523K218J751N24K995J0395J44O943R815
4929B6525k548o712l758K95J0761N339j2304j7400l75q72n643J4361Q428k2279
4915f182j7778o497K1216l732r71L712M908K62R474P173j1428o862o286o367l561
4900b2919J7045J811r05p782J0812K0460r358l788j3292r524J3588K5784Q706
4887C0638J820j0440j1056m380M695r69k255J4124K35k972j1130k555L222l744
4873E233m288q599q851M200p25N533j712J5342K0344L949n260J955j4413j0503
4859B205l818r463r481p03J1456J644K477p326j3589R495K6111L60o485m931K493
$$ y = [1566, 1858, 16353, 16391, -8604, -18470, -4976, -8147, -12729, 715, 10107, 9611, 4936, -1790, -8073, -5365, -16773, -11665, 13382, 16470, 5263, -8260, -6042, -4291, -3767, -772, 9623, 9767, 16710, 26525, 23977, 17265, 13507, 13802, 24563, 29902, 17598, 198, -177, -1049, -6692, 7669, 16097, -6182, -23960, -30457, -9241, -12973, -13944, -10232, -5324, -5062, 4412, 11585, 157, -6705, -12991, -19358, -22919, -5874, -4063, -4968, -12750, -1938, 18522, 9164, 5376, -7916, -17440, -3852, 21932, 30638, 32458, 22018, 10962, 6582, 11277, 10308, 8053, 22177, 22412, 19440, 8310, 5755, 8977, 5233, 945, -7654, -16505, -12305, -13030, -7497, -9209, 6133, 26477, 30426, 25166, 27121, 12708, 2205, -1613, -11076, -20557, -21260, -9804, -8160, -5683, -13009, -26598, -17103, 9008, 9368, 2883, -2048, 445]
4844D45m977J443r828L114J2756N87m096Q62j2974r101j899k85M30J431k931J1239
4828a3784K1790J301j0713o942l47J735L183O270R96K772j2982n267P291J2040
4814G343N4J897q467j422l555P63R033K329m955J356j463j529q800J17J609N076
4798f14k558P459j660m685m311K419j44p016N304J1184j633Q647M092j5692Q403
4783I195Q025q152j8000K427J0865N224M32j924r064j750P78L769P563j4528j3238
4768a8378k271N68R425O807N144k959L092Q577J976o205L210O476q181K460j669
4753H072j72m511L526j241k134j5330l618n56q132K483O022J3342J3590o290l298
4738A753P030N930Q800p99n489M156j0821q760m663o019N295J2760j0579p675
$$ y = [445, -4532, -3089, -12917, -9803, 2953, 3540, -556, 306, -12668, -21769, -23668, -23953, -23523, -22092, -25023, -13784, 8006, 9307, -1406, -8348, -8695, -6960, -3777, 2493, 3489, 6261, -6721, -11988, -4697, 7343, 7397, 9294, 827, -595, -4150, -3387, 5646, 7975, 3020, 4376, 2913, 1384, -7416, -7299, -5690, -614, -3172, 4287, 2627, -2058, -6369, -3950, -4094, -11110, -5806, 5378, 3745, 12392, 16484, 792, 9195, 17220, 9068, -8932, -6505, 4360, 9584, 10016, 8092, -972, -2722, -1944, 1825, 9388, -5140, -18378, -20649, -20081, -10656, -3849, 1295, -1664, 1428, 10005, 11981, 5776, 8986, 15462, 7281, 9741, 8072, 7900, 3389, 6915, 5674, 3540, -11790, -15408, -15964, -24096, -21613, -15591, -2249, 11341, 5051, 1753, 8783, 14713, 23513, 22714, 17225, 21381, 10560, 1800, -2863, -8882, -3587, 9173, -1406, -9081]
4724i081Q475J773l253M408J50N038n803l863L725m737j0155k1334J0211J2713
4710a1733Q76N613J1598o257l88P847J1022Q427j2315k129N790k54K495L554j2027
4695A2119q561p206J7401J8263r428j7709j0907k707Q218J3350M69j2630r260
4682h588N15R380Q590K654l1k4123q608K2314J0315j2190M2k728R75R173M902
4667A2592M234n933j3284j079m455P099R544N491N043m393q666o362k143K640
4653C28J4162j209r301o812M569M488j8281k810O094n586J3269J6446j6187J833
4639A003J1290J5860p28j2311k854m123j127m227L644J0226n156j7132M520N427
4625D312K178m707k470K186Q35o777L522L226n389K950J1990r32L95q632m724
$$ y = [-9081, -606, 1167, -2086, 2322, 2472, 7510, 1707, -2156, 1569, -3168, -13323, -34657, -24446, -11733, -10857, -5244, 6354, 97, -291, 7556, 18578, 27005, 14690, 12561, 18351, 18097, 20592, 24146, 12119, 3558, -3648, 13753, 32016, 22588, 4879, -6028, -8735, -517, 12833, 13302, 672, -8588, -8073, 1307, 9897, 12551, 12520, -11603, -20211, 2103, 12418, 228, 270, -2458, -1483, 7690, 12592, 16826, 10893, -2391, -3470, -7925, -826, 8718, 14209, 19252, 14859, 6193, -169, -2312, 328, 14490, 13281, 3980, -2832, 1737, 6225, -12056, -14866, -8772, -14358, -1089, 15357, -830, 1003, 12293, 28153, 27425, 15114, 12260, 8137, 7010, 2783, 6427, 16653, 11497, -5635, -1115, 4312, 6490, 1783, -687, 1499, 2334, -4443, -921, 2305, -3084, -134, 11856, 10924, 11319, 2687, -2037]
4610b037k740M460J0743Q798K21q083r362k408J752m322J08L074R494P114o5r557
4594G190K901n192J7891M998j5579j6439l443K29J369r271P314J3382J6955l011
4580A9294N603j0686o481j560m809l984j1560L92R697p302j9526o96K8307o231
4566i542j1542k686K261J5967J4752q536p364n50Q455l805n649j2657m259Q649
4552a6506k017n670K1381R437L813L024P166J0243q591p289o298N07L85j379p908
$$ y = [-2037, -4777, -317, 10426, 19224, 19445, 11362, 2000, -408, 1344, -2978, -2870, 204, 9698, 16812, 16747, 7190, 10091, 4899, 22790, 27788, 12209, -4230, -7673, -7444, -6075, -15346, -8032, 5350, 22305, 19294, 24897, 14211, 7730, 6170, 1361, -2623, -14183, -13791, -4094, -11396, -30922, -31618, -3311, -9542, -21084, -23770, -21509, -5542, 9210, 674, -6690, -7240, 1215, -2590, -8239, -20896, -25155, -16506, -18523, -24193, -2812, 6625, 10438, 13462, 20628, 30871, 22280, 14991, 8693, 9200, 9585, 8206, 298]
$$ [...]
##END NTUPLES=NMR SPECTRUM
##END=
