##TITLE=Analysis number 311818
Compound Code cc 00606
Project Code qc-cat
Chemist Name synnovation
##JCAMPDX= 6.0         $$ Bruker NMR JCAMP-DX V2.0
##DATA TYPE= NMR SPECTRUM
##DATA CLASS= NTUPLES
##ORIGIN= Bruker BioSpin GmbH
##OWNER= NMR
$$ XWIN-NMR		Version 3.5
$$ Fri Jul 15 13:22:46 2005 GMT Daylight Time (UT+1h)  MAYBRIDGE\NMR@NMR_250MHZ
##.OBSERVE FREQUENCY= 250.131544655141
##.OBSERVE NUCLEUS= ^1H
##.ACQUISITION MODE= SIMULTANEOUS (DQD)
##.ACQUISITION SCHEME= undefined
##.AVERAGES= 16
##.DIGITISER RES= 18
##SPECTROMETER/DATA SYSTEM= dpx250
##.PULSE SEQUENCE= zg30
##.SOLVENT NAME= CDCl3
##.SHIFT REFERENCE= (INTERNAL, CDCl3, 0, 16.522)
##AUDIT TRAIL= $$ (NUMBER, WHEN, WHO, WHERE, WHAT)
$$ ##TITLE= Audit trail, XWIN-NMR		Version 3.5
$$ ##JCAMPDX= 5.01
$$ ##ORIGIN= Bruker BioSpin GmbH
$$ ##OWNER= NMR
$$ C:\u/data/dgb/nmr/ADRS/5920/pdata/1/auditp.txt
$$ ##AUDIT TRAIL=  $$ (NUMBER, WHEN, WHO, WHERE, WHAT)
(   1,<2005-07-15 13:22:26.39 +100>,<MAYBRIDGE\NMR>,<NMR_250MHZ>,
      <created by zg, POWCHK disabled, PULCHK disabled
       configuration hash MD5:
       62 19 C7 07 E1 42 D1 B7 37 6C 3D D0 77 39 F9 E6
       data hash MD5: 64K
       F8 CF 38 18 1B 6A 48 EF CB BA BA 8F 4C 87 85 C0>)
(   2,<2005-07-15 13:22:38.60 +100>,<MAYBRIDGE\NMR>,<NMR_250MHZ>,
      <Start of raw data processing
       ef LB = 0.3 FT_mod = 6 PKNL = 1 SI = 32K 
       data hash MD5: 32K
       4E D7 0E 76 BA 64 4B FF EE 56 57 DE 76 13 50 67>)
(   3,<2005-07-15 13:22:40.47 +100>,<MAYBRIDGE\NMR>,<NMR_250MHZ>,
      <apk 
       data hash MD5: 32K
       12 C0 D1 8A 8F 07 EF FE A8 20 1F E7 53 1F 64 C9>)
(   4,<2005-07-15 13:22:41.14 +100>,<MAYBRIDGE\NMR>,<NMR_250MHZ>,
      <abs ABSG = 5 
       data hash MD5: 32K
       4C F7 8F B9 AA 5B D2 12 FF CF 7E B4 0F F1 24 4A>)
$$ ##END=
$$ 
$$ hash MD5
$$ 99 97 8E 2F 2C 72 12 9A BB 69 12 72 8F 07 DD 0C
##$RELAX= 
##$RELAX= 
##$RELAX= 
##$RELAX= 
##$RELAX= 
##$RELAX= 
##$RELAX= 
$$ Bruker specific parameters
$$ --------------------------
##$DU= <C:\u>
##$EXPNO= 5920
##$NAME= <ADRS>
##$PROCNO= 1
##$TYPE= <nmr>
##$USER= <dgb>
##$AMP= (0..31)
100 100 100 100 100 100 100 100 100 100 100 100 100 100 100 100 100 100 
100 100 100 100 100 100 100 100 100 100 100 100 100 100 
##$AQSEQ= 0
##$AQ_mod= 3
##$AUNM= <au_zg>
##$AUTOPOS= <27 >
##$BF1= 250.13
##$BF2= 250.13
##$BF3= 250.13
##$BF4= 250.13
##$BF5= 500.13
##$BF6= 500.13
##$BF7= 500.13
##$BF8= 500.13
##$BYTORDA= 1
##$CFDGTYP= 0
##$CFRGTYP= 5
##$CHEMSTR= <none>
##$CNST= (0..31)
1 1 145 1 1 1 1 1 1 1 1 1 1 1 1 1 1 1 1 1 1 1 1 1 1 1 1 1 1 1 1 1 
##$CPDPRG= <>
##$CPDPRG1= <>
##$CPDPRG2= <>
##$CPDPRG3= <>
##$CPDPRG4= <mlev>
##$CPDPRG5= <mlev>
##$CPDPRG6= <mlev>
##$CPDPRG7= <mlev>
##$CPDPRG8= <mlev>
##$CPDPRGB= <>
##$CPDPRGT= <>
##$D= (0..31)
0 1 0 0 0 0 0 0 0 0.06 0 0 0 0 0 0 0.0002 0 0 0 0 0 0 0 0 0 0 0 0 0 0 
0 
##$DATE= 1121430145
##$DBL= (0..7)
120 120 120 120 120 120 120 120 
##$DBP= (0..7)
150 150 150 150 150 150 150 150 
##$DBP07= 0
##$DBPNAM0= <>
##$DBPNAM1= <>
##$DBPNAM2= <>
$$ [...]
##$SUBNAM7= <"">
##$SUBNAM8= <"">
##$SUBNAM9= <"">
##$SW= 20.6930455092707
##$SWIBOX= (0..15)
0 0 3 0 0 0 0 0 0 0 0 0 0 0 0 0 
##$SW_h= 5175.983436853
##$TD= 65536
##$TD0= 1
##$TE= 295.16
##$TE2= 300
##$TE3= 300
##$TEG= 300
##$TL= (0..7)
0 120 120 120 120 120 120 120 
##$TP= (0..7)
150 150 150 150 150 150 150 150 
##$TP07= 0
##$TPNAME0= <>
##$TPNAME1= <>
##$TPNAME2= <>
##$TPNAME3= <>
##$TPNAME4= <>
##$TPNAME5= <>
##$TPNAME6= <>
##$TPNAME7= <>
##$TPOAL= (0..7)
0.5 0.5 0.5 0.5 0.5 0.5 0.5 0.5 
##$TPOFFS= (0..7)
0 0 0 0 0 0 0 0 
##$TUNHIN= 0
##$TUNHOUT= 0
##$TUNXOUT= 0
##$USERA1= <user>
##$USERA2= <user>
##$USERA3= <user>
##$USERA4= <user>
##$USERA5= <user>
##$V9= 5
##$VALIST= <valist>
##$VCLIST= <CCCCCCCCCCCCCCC>
##$VD= 0
##$VDLIST= <DDDDDDDDDDDDDDD>
##$VPLIST= <PPPPPPPPPPPPPPP>
##$VTLIST= <TTTTTTTTTTTTTTT>
##$WBST= 1024
##$WBSW= 4
##$XGAIN= (0..3)
0 0 0 0 
##$XL= 0
##$YL= 0
##$YMAX_a= 901661
##$YMIN_a= -925188
##$ZGOPTNS= <>
##$ZL1= 120
##$ZL2= 120
##$ZL3= 120
##$ZL4= 120
##$ABSF1= 16.522
##$ABSF2= -4.171173
##$ABSG= 5
##$ABSL= 3
##$ALPHA= 0
##$AQORDER= 0
##$ASSFAC= 0
##$ASSFACI= 0
##$ASSFACX= 0
##$ASSWID= 0
##$AUNMP= <proc_1d>
##$AZFE= 0.1
##$AZFW= 0.1
##$BCFW= 0
##$BC_mod= 0
##$BYTORDP= 0
##$COROFFS= 0
##$CY= 12.5
##$DATMOD= 1
##$DC= 0
##$DFILT= <>
##$DTYPP= 0
##$F1P= 14.0000005364418
##$F2P= -0.99999901652339
##$FCOR= 0.5
##$FTSIZE= 32768
##$FT_mod= 6
##$GAMMA= 0
##$GB= 0
##$INTBC= 1
##$INTSCL= 1
##$ISEN= 128
##$LB= 0.3
##$LEV0= 0
##$LPBIN= 0
##$MAXI= 10000
##$MC2= 0
##$MEAN= 0
##$ME_mod= 0
##$MI= 0
##$NCOEF= 0
##$NC_proc= -2
##$NLEV= 6
##$NOISF1= 0
##$NOISF2= 0
##$NSP= 0
##$NTH_PI= 0
##$NZP= 0
##$OFFSET= 16.522
##$PC= 1
##$PHC0= -90.21649
##$PHC1= 19.40751
##$PH_mod= 1
##$PKNL= yes
##$PPARMOD= 0
##$PSCAL= 4
##$PSIGN= 0
##$REVERSE= no
##$SF= 250.13
##$SI= 32768
##$SIGF1= 0
##$SIGF2= 0
##$SINO= 400
##$SIOLD= 32768
##$SREGLST= <1H.CDCl3>
##$SSB= 0
##$STSI= 32768
##$STSR= 0
##$SW_p= 5175.98343685301
##$SYMM= 0
##$S_DEV= 0
##$TDeff= 65536
##$TDoff= 0
##$TI= <Analysis number 999999
Compound Code 99
Book Reference 9
Project Code 9>
##$TILT= no
##$TM1= 0
##$TM2= 0
##$TOPLEV= 0
##$USERP1= <user>
##$USERP2= <user>
##$USERP3= <user>
##$USERP4= <user>
##$USERP5= <user>
##$WDW= 1
##$XDIM= 32768
##$YMAX_p= 531230046
##$YMIN_p= -31568
$$ End of Bruker specific parameters
$$ ---------------------------------
##NTUPLES= NMR SPECTRUM
##VAR_NAME=  FREQUENCY,     SPECTRUM/REAL,   SPECTRUM/IMAG
##SYMBOL=    X,             R,               I
##VAR_TYPE=  INDEPENDENT,   DEPENDENT,       DEPENDENT
##VAR_FORM=  AFFN,          ASDF,            ASDF
##VAR_DIM=   32768,         32768,           32768
##UNITS=     HZ,            ARBITRARY UNITS, ARBITRARY UNITS
##FACTOR=    0.157963299565203, 1,           1
##FIRST=     4132.6476996994, 0,             0
##LAST=      -1043.33573715361, 0,           0
##MIN=       -1043.33573715361, -31568,      0
##MAX=       4132.6476996994, 531230046,     0
$$ Real data points
##PAGE= N=1
##DATA TABLE= (X++(R..R)), XYDATA
$$ [...]
17166b827K217m398l90k931k407l257m082o00M119m234p9L590L460J614K367J070
17150f768J191R77k95M987l447j96K845O258K30J499n794l801k628M186J952M928
17134F124j670p427k808K596L499N697L624M8r184m996p81j136m458l992L696
17119a1168O483K24o69K282O22o411o40O166k88K804O052o765j1106n100j613
17104a9127j131M462M324K538k630l545K03Q230O564n077n039R404L940q89M263
17089F490k925r859o030j345J074O553r60l376m025n59R437O876m869L075M873
17074D430m525j1984n784N905Q459P372j734m723j550M150N554m249k997j480
17060c156K529q434R76Q654k824N35N018j585j946m433j663J720M74N39N58m82
$$ y = [-2827, -610, -5008, -5398, -8329, -10736, -13993, -18075, -18675, -14556, -18790, -18869, -15279, -11819, -10205, -7838, -6768, -5577, -4600, -4895, 92, -3355, -3551, -706, 5552, 5782, 7281, 1487, -2314, -4942, -756, 1196, 6124, 4454, -2973, -5781, -3185, 314, 6011, 9635, 9683, 499, -4497, -5278, -6414, -10872, -14864, -11168, -4685, -4461, -5130, -2848, -2226, -8637, -9277, -3111, -3399, -595, 5457, -1308, -12414, -17514, -19127, -20258, -15796, -11472, -8934, -11564, -15109, -14906, -6676, -112, -5189, -10228, -824, 3116, 2227, 6490, 3565, -6294, -12324, -13669, -12595, -6042, -7002, -10378, -14403, -14962, -5525, 1351, -3518, -443, 4430, -95, -12079, -17863, -11958, -3499, 3873, 2139, -2584, -4134, 16, 5570, 1321, -1676, -3156, -627, -9061, -8085, 569, -2255, -1720, 3298, 1713, -233, -4666, -6329, -4609, -4135, -3596, -3038, -3520]
17044c520N67N0p8M464N180J726n591q783m584K044M272j485l706j96M27K251
17028f962q06l108J453K910j991l332k376P79K567Q947m705p41P250k358l868
17013f341j851k539K147J615K1o60J0580O310m888j549j636M297K005k20m257
16998C034k018k033k982p28J925r78p635L587K817l39N807K247J821K267n880
16983I12p286M605R484k938j638j914J42J66k132l046k781k109K513l088j426
16968a0536K662n081L028k23K128M534K095q08j771J358L639o51j356n09j42J0493
16952H860n24o625k963q109K144O140P42L579J543j0756j609l91K248O760m271
16937c232r944o94M843N951k514k826N297q96n807M251M492J054J800k636L186
$$ y = [-3520, -2953, -2903, -2981, 1483, 6663, 8389, 2798, -5985, -10569, -8525, -4253, -5738, -9444, -9640, -9213, -6962, -7768, -10876, -9423, -6513, -8504, -11836, -14212, -13433, -10866, -1919, -6624, -7365, -115, -2473, -6341, -8192, -10731, -8584, -6969, -6948, -7608, 2972, 9282, 4394, 2845, 1209, 5506, 7511, 7291, 3034, 1016, -1017, -3999, -4727, -2802, -3780, -11415, -7828, -5011, -5350, 457, 2704, 4525, 6792, 912, -6374, -1769, 7715, 4777, 3139, 1225, 1367, 1533, -599, -3645, -6426, -8535, -6022, -9110, -10536, -7874, -12955, -9927, -10150, -8022, -3488, -1393, -2201, -3972, -2614, 1025, 374, -982, -1491, -1633, 8860, 8336, 1711, -1252, -9361, -7217, -1077, -335, 3244, 4787, -5969, -7578, -7969, -5721, 1039, -3232, -13176, -13870, -9027, -3076, -5590, -8416, -3119, -4015, -9822, -5571, -1079, -25, 1775, -861, 2325]
16922B325m565R19K856K577n611m799j205q88j249K425J109m399j875l070k96
16907a5746L620K950N72M661O971k435l12n140m299K884n460p57O452l293N332
16892d000L74Q53M542M184m690j0566k798J111p36L744L569o318o306O806J813
16877h418l664K105P560q40l404r58M093N562J91n759k027J792M09L81l217R94
16861e200L441J033l961k230M041k238J390P530k145r28K196n28L339k367M196
16846G569J677o200m107l707K140M309p10L755K371m584l836J223p42N28l437
16831c751j931J039J929N84m128O16j952j253L353o01p386l222L707N851J0597
16816C452L547l073o052m274m000o970j713K58Q500P171k512j659k06M729J396
$$ y = [2325, -2240, -1321, 1535, 4112, -1499, -6298, -7503, -8391, -9640, -7215, -6106, -10505, -12380, -15450, -15746, -12126, -9176, -8604, -3943, 3028, 593, 281, -4859, -9158, -6274, -11734, -12491, -6039, -9332, -4000, -3626, -2773, 1769, 5953, 1263, -9303, -12101, -10990, -11726, -7982, -4413, -10731, -17037, -10231, -8418, -12082, -9977, -2417, -3257, -6661, -7619, -3526, 2036, 2227, -3532, -5559, -3767, -3358, -2977, -6194, -5200, -1759, -726, -4687, -6917, -2876, -5114, -3724, 3806, 1661, 733, 2929, 2401, 5740, 3373, 7569, 9246, 3046, -1061, -4768, -2628, 1681, 971, 4726, 7097, 2513, -1323, -100, -842, -314, -3751, -5682, -4643, -2714, -2130, -6258, -5642, -7594, -8847, -5494, -6095, -13481, -16703, -12996, -7145, 3452, 6999, 3926, -2126, -6400, -10400, -17370, -19083, -18825, -10325, -3154, -5666, -7325, -7531, -2802, -1406]
16801a406k504l663j828P63p682M890O900L498M982L7k962o422K390M595J672
16786C260m616q402M073N283J087l759q971L095Q250j564L274P081O12m933q450
16771d680o113N905M642o723k370N589K341k588o92K834p50J855l633K630p039
16756h792L343P659j294j165J591k463j699K47m804O12J619L831K174L875l038
16741A696m53l733J702k857j753R01j983j730q75N26J661K211p014r617l652P443
16725a7527J2708Q553k167o727J810o65o765K552Q743M13J644k326k763k764J324
16710c957J264k808j411J091L654l756m059N104l147j732N641K168J571L908l796
16695b65j118j388l692L155o41o020l790N541Q3K433K555r41O379L589n774p430
$$ y = [-1406, -3910, -7573, -9401, -8638, -16320, -11430, -4530, -1032, 3950, 3987, 1025, -5397, -3007, 1588, 3260, -1356, -9758, -5685, -402, 685, -3074, -12045, -8950, -700, -2264, 1010, 8091, 8703, 3770, -4680, -10793, -4888, -246, -6969, -9339, -3750, -1409, -3997, -4689, -1855, -2605, -750, -4383, -1753, -8792, -5449, 2210, 916, -249, 1342, -1121, -2820, -2573, -7377, -6765, -5146, -1315, 859, 4734, 1696, 1243, -2490, -788, -3645, -5398, -4497, -6480, -8210, -9085, -8559, -6898, -4687, -11701, -21318, -24970, -17527, -4819, 3734, 1567, -5160, -3350, -4015, -10780, -8228, 515, 928, 2572, 246, -2517, -5281, -3957, -2693, -5501, -6912, -5821, -2167, -5923, -9982, -4878, -8025, -9757, -4116, -1948, -377, 3531, -265, -1383, -2771, -6463, -3308, -3949, -9969, -13759, -8218, -8135, -5702, -3147, -4088, 2291, 5880, 106, -7324]
16679g324k960K880M015L64L442N380l193l018k902m212M866J997J439n230O194
16664A738O315K18Q28n340j2022p518R253Q181M674L806q390p300j338J903K07
16649d785p73j459N014M59j908K000l630n78K856L102q48r485n99P575M91O01
16633a967L136j23o60k461K45N854q664k284o216N282J947N528N785M483m633
16618E252M40L163q411m864k604K459k706J164R40j423j88M375k607J396J0604
16603F990q075k577N937j63J336L472k021l237p36K114K869o00m308m355j379
16588d733k91m445q05L507P692k918o366M45K902k844o65N00j772P480P609k224
16572C072N06L429n480j0451L977N239k92J596K134o426p591j182J345J099P218
$$ y = [-7324, -10284, -7404, -3389, -3025, 417, 5797, 2604, -414, -3316, -7528, -2662, -665, 774, -4456, 1738, 8053, 8271, 9099, 3759, -8263, -15781, -6528, 1653, 6327, 10133, 1743, -5557, -6895, -4992, -4785, -5558, -7017, -2003, -1544, -3452, -1452, -5082, -5660, -2804, 298, -550, -10035, -10634, -3059, -2568, -1967, 1169, 1046, 386, -2075, -1830, 4024, -4640, -6924, -13140, -7858, -5911, -383, 5402, 9885, 5252, 5692, 8855, 444, -4420, -7024, -4565, -7271, -6107, -5167, -6590, -6778, -2403, -5010, -3614, 6990, -1085, -3662, 2275, 2112, 3448, 6920, 4899, 1662, 926, 3040, 5909, 5309, 1001, -3354, -4733, -5024, -9469, -10274, -6767, 925, -1993, -8359, -7914, -5012, -7856, -8521, -8021, -9793, -2313, 5296, 3072, 3578, 7007, 1527, -8924, -4947, 292, 0, 1596, 3730, -2696, -10287, -11469, -10124, -9025, -1807]
16557a807k455o807K621L999O738Q263k71j1618p669o14P592Q30l75J340k310
16542b543o25k423j516N038Q293P36k139m32K140O23p378R15K818K074n335m295
16526d049k639j521k54J079M755k558j98M845N142K978j744p387j884O76l212
16511e971N912L094j308o173M454K981J788J176m413m040m86p3k463l170P324
16496a368j797m778N105j357O54L238j448l663K247K897j145l387l252K405L765
16481a884K066L752j837n242K062j742m033o913O50N722N877j277l345m0L358
16466b826k95j385k38J86k497M525k939J700m406l185l700N960J382l356l137
16451a4211l54L701m676l031M329k045L197N979N364L94j300K248j464N26l895
$$ y = [-1807, -4262, -11069, -8448, -4449, 2289, 10552, 10281, -1337, -9006, -9620, -2028, -1198, -1573, -233, -2543, -3168, -5591, -7107, -2069, 6224, 6960, 4821, 4389, 6529, 7152, -226, 689, 3507, 5581, 246, -4049, -6688, -8209, -8463, -7384, -2629, -5187, -5385, -540, 4602, 7580, 5836, -1551, -3435, -2759, -5971, -59, 3035, 1727, -4446, 8, 2989, 4777, 5953, 1540, -2500, -2986, -3059, -5522, -8692, -1368, -3165, -7943, -2838, -4195, -3541, -303, -1751, -5414, -3167, -270, -1415, -4802, -8054, -5649, -1884, 182, 3934, 2097, -3145, -1083, -2825, -6858, -13771, -13121, -7399, -1522, -2799, -6144, -6184, -2826, -3121, -4506, -4744, -4558, -7055, -2530, -5469, -3769, -8175, -11360, -15060, -9100, -7718, -11074, -14211, -14565, -10864, -15540, -18571, -14242, -16287, -13090, -7111, -1747, -1353, -2653, -405, -1869, -1343, -5238]
16436e238r35j979L204J71n064r25N909K266o315j44K793M502k229n401K611M756
16420b018K678p598j648K847k698k853L37j801J570J811Q074K537M031o288o2
16405a081J112k938j508k338M232k591j443J263j639o208N31K842K019k5K90m870
16389a2352n592K173P751M851l112o22l286M33L973R75J236L454n681j404l09
16374g512k232L89l201P1n7n61M661K478M363l629Q81L456j438p564N068M737
16358i0k11M344J258m991K462M667K59k435K886L0n420n646n562K22o36k506O849
16341d520J060L485N541O980J407j0162L99L619K921j113l270k021l983j693j923
16326c273Q63l312k263p545L258L547O233O333j254p747p46k57j365J255R077
$$ y = [-5238, -6173, -8152, -4948, -4777, -9841, -10766, -4857, -2591, -8906, -9050, -6257, -1755, -3984, -9385, -6774, -2018, 660, -6938, -8586, -5739, -8437, -11290, -10953, -12754, -11184, -9373, -1299, 1238, 5269, -1019, -1081, 31, -2907, -4415, -6753, -2521, -5112, -6555, -5292, -6931, -13139, -12608, -9766, -7747, -7772, -7482, -12352, -17944, -15771, -8020, -3169, -6281, -6903, -10189, -9756, -5783, -4808, -3572, -118, -5799, -7203, -7512, -9744, -9355, -12556, -12485, -12542, -13103, -8442, -5964, -1601, -5230, -4349, -893, -2331, -9895, -4827, -90, -301, 4043, 5301, 310, 2772, 7439, 7698, 5263, 8149, 8179, 2759, -2887, -8449, -8227, -8863, -11369, -4520, -3460, 25, 5566, 12546, 13953, 3791, 4190, 7809, 10730, 9617, 6347, 4326, 343, -1350, -3273, -2410, -5722, -7985, -15530, -12272, -8725, -2492, 3841, 2587, -5160, -5906, -6163, -7528, -6273, 2804]
16311B804J483l927l860j774P354m468l072M058K516r91q349K388J193k416L552
16296c509K027K112P927L138o486p825n246J585Q203J359j729j525l798N503k181
16281d45J369N82j289k364M303L333k606m884m005m777l879N689J0436L884l469
16266A878l205m170l22L669j889l353m527Q910N747L790k86j893n63J024J014
16251E824m797l293n380l398N297J1403L570o239m004L79q92m207k930J3704J0521
16236A5558j984q562l504l94R49n767O178K081J025Q36m413p198O008P612J278
16221I703l243L150o57l350M622l702l93K278l431j628J929J655p240k313J953
16206f67O521k422r1m603J539J118L626o276K507O173M742R57k980l289k934J753
$$ y = [2804, 4287, 360, -3500, -5274, 2080, -2388, -5460, -1402, 1114, 123, -8226, -5838, -4645, -7061, -3509, -1482, 630, 8557, 11695, 5209, -2616, -7862, -6277, 1926, 3285, 1556, 31, -3767, 1736, -445, 924, 1506, 217, -2147, 2156, 5489, 2883, -2001, -6006, -10783, -14662, -8973, 1463, 5347, 1878, -1327, -5497, -5819, -2150, -4039, -7392, -11919, -3009, 2738, 6528, 6242, 4349, 3786, 4810, 5824, 1027, -2266, -7646, -11044, -5747, 5656, 9226, 2987, -1017, -638, -1530, -5737, -8667, 5037, 15558, 13574, 5012, 1508, 1114, 2063, -3704, 2474, 4555, 5580, 6416, 2003, -5195, 813, 8425, 9703, 6460, 9610, 8953, 5603, 10225, 6523, 6130, 8408, 4977, 3349, 5278, 6933, -307, -2620, -667, 5854, 3432, 3341, -1262, 277, 1395, 5021, -1255, 1252, 7425, 12167, 13124, 10144, 6855, 3921, 5674]
16190E674L411Q145J113j94K530J898n430O71l343L264k985m070O896N599N511
16175B8690K99n048l087N53K815M251N650J759j195J3R1l881j569o287n86L597
16159B6065n14J910K802J0551L875o27p554o048J51O16n322L50j405Q26k352O10
16143B3934j188J802n252R474j347o902l654k1K100k935m109R659k125q001p87
16128A0648m493M907L237m384l451J838L884J767j763J303K808K181L280n334
16114A6428R46j603J327m053n263M160k506P038J057j1932p240k70K346q85P020
16099F570K297l102m714Q44M083m901n965Q52N578N91p024l114L083K998l73K162
16083a35k813j394O469j262L831k95n204k401K919j854K921m120n40P091l93M018
$$ y = [5674, 9085, 17230, 18343, 18149, 20679, 22577, 17147, 17818, 14475, 17739, 14754, 10684, 17580, 23179, 28690, 28989, 23941, 20854, 21407, 24222, 28473, 34123, 35882, 34687, 34700, 34791, 30910, 29341, 23054, 22468, 26065, 25551, 27461, 30263, 40814, 44689, 44062, 36508, 30460, 30611, 31227, 25905, 26255, 24850, 25676, 23324, 23934, 22746, 24548, 19296, 28770, 27423, 20521, 16867, 16846, 18946, 16011, 11902, 21561, 19436, 11435, 10648, 6155, 11062, 14299, 9915, 6464, 8302, 12186, 13953, 12190, 13493, 16301, 18482, 21762, 16428, 17374, 15771, 17098, 13045, 7782, 11942, 9436, 16474, 17531, 5599, -1641, -1911, 435, -450, 6570, 8867, 5765, 1051, 1895, 5978, 1077, -4888, -4036, 1542, 2133, -4891, -8005, -4922, -1924, -2297, -135, -2948, -4342, 2127, 865, 4696, 4401, -803, -3204, -285, -2139, 782, -3338, -3878, 3213, 2820, 6838]
16067F838M316L156k258n230L892L156l191k349o653m286J589K481l677k376M445
16052a47m98k643K31Q08O419J567L855M04k516k389o530m240J870M873J682K543
16036E289J258n713m469j097L080M753J839p028j493K307N49P594L451j0744p247
16021g671m224L227R588M635j1227n62P301J453R898J127k886j0935n15M132K985
16006F326j489j1393K475O09R72L554M652K133j823R6j986n383r48k136m412K290
15990f463M382P555M075n627o154l049N273m319J39n60O659M309o135l940O15
15975c240L489l041o022k437o70l373p478M459J2977Q81l116M311l391q371N989
15960i033N470m382j063L455M772k764k893q64r44K989J330K34M033K719l4J099
$$ y = [6838, 11154, 14310, 12052, 6822, 10714, 13870, 10679, 8330, 1677, -2609, -1020, 1461, -2216, -4592, -147, -645, -3288, -3057, -2249, 4170, 5737, 9592, 9996, 7480, 5091, -1439, -5679, -3809, 1064, 2746, 5289, 6547, 834, -3635, -4732, -1652, 3101, 4940, -2088, -3581, -1274, -725, 6869, 10320, -424, -7671, -11895, -8668, 920, 5555, -5672, -6234, 1067, 2520, 12418, 13545, 10659, -276, -791, 3341, 6326, 4837, -6556, -4081, -3472, -2500, 1054, 5706, 7839, 6016, 6112, 4126, -1257, -2205, -4341, -8753, -6463, -2081, 5474, 9549, 3922, -2232, -5281, -8, -4327, -4188, -4748, 1911, 6220, 85, -3855, -3240, 249, -2792, -8814, -11251, -11921, -15294, -22772, -18313, -5336, -4455, -7571, -3260, -6651, -15022, -9033, -3563, -7945, -9008, -5553, -781, -3545, -6438, -7302, -8246, -5257, -3927, -3693, 340, 3059, 3025, 4124]
15944D124k813j979L001L828m612J442N773L02q31o138k40J302J096J353l287
15929B321k681j21m007J774O04m351k267M803J2561k698K92k222k922r87K334
15914B433j755J178N20n54Q80L760J536m113k317L494K348J816L803q7m799n427
15898B716m872k785j106J710j307l650k625N24J256P215K643K145k938J349N411
15883E686J109j687J99k908k217l137m561K919q47j340J597J867n34j287N595
15868D54J650L436J064M181j939k597k072K904m00K28m366j140K029K061l119
15853B374j057J009j85j264k924L02n376R13n65N093O604r45m212n278j553O424
15837f40O292L642n521o784N68K90o46M64q504l622l350L652J418n153R95J1225
$$ y = [4124, 1311, -668, 2333, 6161, 1549, 2991, 8764, 9066, 8235, 2097, 1857, 3159, 4255, 5608, 2321, -360, -481, -4488, -2714, -2110, -6461, -8728, -3925, 8636, 5938, 6230, 4008, 1086, 99, 2433, 678, 1856, 2376, 1822, 2702, 6462, 7998, 3885, 1568, 5062, 7410, 9226, 13029, 12942, 8143, 2716, -2156, -4941, -6047, -4337, -5644, -9294, -11919, -11395, -10139, -2924, -281, 1864, -1074, 275, 5686, 6795, 5108, 5307, 2399, 182, -2955, -7516, -4597, -5444, -6784, -5187, -3320, -3854, -5141, 454, 2104, 5540, 6604, 10785, 8846, 6249, 4177, 7081, 6681, 6909, 2543, 1403, 3432, 5493, 2374, 1317, 2326, 2141, 877, -2047, -1745, -7121, -6208, -6773, -1680, 4924, 3979, -233, -5511, -7064, -640, 5652, 9294, 3773, -3011, -2443, -2153, -2799, -2335, -10839, -14461, -17811, -14159, -12741, -17894, -16899, -5674]
15821e674P599k083R2l452J325J743L914l567m109K382l248O015L64J701L580
15806F582l483l307l96O579l214k59O08l570o86n18J331q18m893p88L202O446
15790B816M10l534q77K694J387K218m912m066O157P34j842j711l743m442K675
15775f036m36j680K198K927n967K777L584J005R48K203p202l204O681J170q59
15760a891l48K518j848j456j916L155r026N87N015n380O269Q866n178q619r021
15745a8273R5J0906O209L844l144k192n354k405j701k58J0995O996n267l576J169
15730a956L412Q124j848j0n644j951j87n804J695M227k884k578J18L226Q952o176
15714G16o837L30R946O278K888m372n017P71k124n965k470J489J228m106J992
$$ y = [-5674, 1925, -158, -66, -3518, -2193, -450, 3464, -103, -4212, -1830, -5078, 937, 1301, 3002, 6582, 3099, -208, -604, 5975, 2761, 2502, 3110, -460, -1146, -1664, -333, -1151, -6044, -6832, -3630, 2816, 3226, -308, -1185, 1509, 2896, 5114, 202, -3864, 2293, 3027, 1185, -526, -4269, -8711, -6036, -6472, -8152, -5954, -3027, -8994, -6217, -2633, -1628, -680, 1523, -5679, -8883, -2202, -1032, -1891, -2239, 279, -1569, -3025, -4941, -1786, -10812, -10225, -5210, -10590, -4321, 4545, -633, -9252, -18273, -18178, -7272, -1063, 2781, -363, -2555, -7909, -10314, -12015, -12273, -1278, 5718, 451, -3125, -1956, 1456, 9580, 7732, 7722, 2078, 127, -60, -5864, -4169, 58, -2826, -5404, -5286, -2060, 6892, 716, -6121, -5791, 4155, 10433, 13321, 8949, 3932, 4703, 2579, -3386, -5856, -4367, -3139, -7245, -5253]
15699e253L749M581n126k9K690j143L523o088k771m34M160P424n152Q98L708m998
15683b61q286N549K635K335o752j1569J321N846M662M994O428M291R34n431q222
15668a526J21l776K672J025m34Q49n933j13N730J047j651J206K907k117o633m449
15652a1075j900Q332J1518l114k229J912o750l871k680O790o74k747K029k047
15638f506j168L01M696L067N31l450j0398R674R972l675q51L284P10l924m714
15623b451m67j033k641L579o40n131p38R5M036L20N622O925o42o193k067K073
15607F47j322m705k65k235l615k406P327K912q409K832N315K297L298k90j491
15592a10m42L337j160r290o358p73K908J2028L005M42k549J786O340P088N633
$$ y = [-5253, -1504, 3077, -2049, -2078, 612, -531, 2992, -3096, -5867, -6301, -2141, 5283, 131, 1029, 4737, -261, -8547, -2998, -363, 1972, -4780, -16349, -15028, -9182, -4520, 474, 6902, 11193, 12127, 6696, -1526, -1405, -5181, -2509, -1484, -1918, -1069, -7002, -7115, -1385, -338, -1989, -783, 2124, 7, -6626, -11075, -12975, -4643, 6875, 3761, 1532, 3444, -3306, -7177, -9857, -3067, -3741, -6488, -4459, -6506, -7674, -7373, -2677, 390, 921, -2529, -12927, -3253, 6719, 3044, 2193, 5477, 6187, 2263, -2451, -2918, -3951, -6592, -3013, -3653, -8784, -9522, -9427, -5391, -5071, 551, 7476, 6834, 641, -1426, 647, -675, -5380, -5645, -7880, -11495, -13901, -6574, -3662, -12071, -9239, -3924, -1627, 1671, 1381, -110, -552, 2785, 1625, -7665, -14023, -14796, -11888, 140, 3145, 3587, 1038, 2824, 9164, 16252, 21885]
15577B1885k691j0831j648o018j590N567j136n76m131k799k546K16O530k017K680
15562H95J046j21N171l381o762j536n742K68L635m686K77J0727K313l715l699
15547e310m462k278N228N471k870q03J970K652J845j467M139M918P50J988j327
15532A0444j783n943o60M174l601N943K624J0m127k439p462r408k485N546J0457
15517A290k249m591M404K333J686M339J141j828j173k103L736K653L135K061p209
15502G625M580J561J679q89Q17l288q771n43j842K687K197m811j148L272L416
15487F542L137J274n085k535j616o363K281o13l518P634N31M682j929m65J788
15472E745N725M379k689m448j420o434n309k450R27J0096l134l378J91K625L98
$$ y = [21885, 19194, 8363, 6715, 697, -893, 4674, 3538, 2962, -1169, -3968, -6514, -6298, 232, -1785, 895, 1941, 1820, 6991, 3610, -3152, -4688, -10430, -10162, -6527, -11213, -10936, -209, 2104, -1611, -5310, -9772, -12050, -6822, -1351, -4221, -5024, -3054, -402, 1443, -24, 4115, 9033, 9783, 11771, 10444, 8661, 2718, 2058, 6232, 2631, 8574, 11198, 11208, 7081, 4642, -2820, -12228, -14713, -9167, 1290, -959, -5550, -1146, 1187, 2873, 7212, 8353, 6525, 5352, 3249, 6985, 9638, 12773, 14834, 7625, 12205, 13766, 15445, 14556, 15373, 12085, 3314, 2771, 929, 3616, 5813, 1002, -146, 3126, 6542, 9679, 10953, 5868, 3333, 1717, -4646, -2365, -2978, -6496, 1138, 1669, 6351, 4422, 3957, 5745, 11470, 15849, 13160, 8712, 7292, 858, -4451, -6901, -5974, 4122, 988, -2390, -2199, 426, 824]
15457H24l625l914J590p07r68L996K829l767k227K478l897j790K814j66k971J757
15441g744M761N529j158l483P285J001m339l815k360K023M053j270j288Q691K066
15426I952k027q588k393P22N740J034j407J843K975N42o118j928p267J292P09
15411d919J450J062r6K852j804m656k197J876O947m189q4j895k927p270L81L050
15395a2419P109M753k596L442M559J740n789j503L274K720j799p214n906L614
15381f015M962p608j636L091M250l333r19O319Q612N98l833r97n91N35M091j409
15365F117Rl738j282J984j623p830K309M457L381p918k461K577k253r07Q941m739
15349b976k389L767k773M92R595K989m308m77n769K139K070n748J159R54N38K980
$$ y = [824, -2801, -6715, -5125, -5832, -6800, -2804, 25, -3742, -5969, -3491, -7388, -9178, -6364, -6530, -9501, -7744, -2983, 2546, 1388, -2095, 5190, 6191, 1852, -1963, -4323, -2300, 1753, 483, -805, 7886, 9952, 7925, -663, -3056, -2334, 3406, 4440, 3033, 4876, 7851, 8393, 2275, 347, -6920, -5628, -4919, -3469, -2407, -2503, 349, -1455, -6111, -8308, -6432, 515, -3674, -3758, -5653, -8580, -15850, -15469, -12419, -5310, -557, -3153, 289, 4848, 6588, 799, -704, 2570, 5290, 3491, -3723, -9629, -6015, -1053, -8661, -10297, -7206, -2956, -6289, -7208, -889, 7723, 8321, 4488, 3491, 2900, 3435, 7526, 6117, 6126, 2388, 1106, 3090, 1467, -6363, -4054, 403, 3784, -4134, -6595, -4018, -6271, -7178, 1763, -2976, -5365, -1598, -4371, -3879, 5716, 8705, 4397, 3920, -1849, 290, 2360, -3388, -2229, -1275, -737, 2243]
15333B243L73K3j85j175n164k814l757Q74N066M417P161L952R03k766j34n935
15317C082K397J00k911r36k011j824p922m482N622n53M430J2602O162m48j082
15302A2226n172j969k517K776k63m579q175M932M849o270l531L212j226O615L963
15287D871P78j647p288q94k353N677K454M318L04j333r588l365M769L137P640
15272G480q12n226K134L002L18L499j7188j1509O901L082L797K964j160J17L69
15257b232k351k451P055L011J863n299m270P978L116K13l001r051L49K074m491
15242g487l9R54j964K671J324K239N404J33K945m9n120J524m264M578O145l544
15226E450j1437p412L876N839n79k537J498M523Q91k72K807J575k192m205m460
$$ y = [2243, 2616, 2639, 2454, 1279, -3885, -6699, -10456, -9582, -4516, -99, 7062, 11014, 11917, 9151, 9017, 3082, 5479, 5579, 2668, 1732, -279, -2103, -10025, -14507, -8885, -9438, -5008, 7594, 13756, 13308, 12226, 7054, 5085, 2568, 5344, 5081, 502, -7673, -2741, 2108, -4162, -7693, -4481, -5707, 908, 4871, 5649, 4002, -3286, -4180, -6533, -856, 1598, 5916, 6220, 4887, -4701, -8066, -3297, -160, 7480, 6668, 1442, 3576, 6578, 6896, 10395, -6793, -18302, -11401, -8319, -4522, -1558, -2718, -2601, -2232, -4583, -7034, 21, 3032, 4895, -404, -4674, 3304, 6420, 6633, 3632, -5419, -5070, -2996, -7487, -7526, -6572, -8536, -5865, -4541, -2302, 3102, 3235, 6180, 6131, 1011, 2535, -1729, 2849, 8994, 5450, -5987, -13399, -9523, -3684, -4263, -6800, -5302, -779, 112, -160, 2647, 4222, 2030, -2175, -6635]
15211f635J54L938K449j238k383N20L29n44K075L198K962j133L778q159n356O905
15195H60J754n563K346O967J055k883o355n506n48L028n81L432L423M088J259
15180F776n557r6l305R85M136j410l388j0348l117P256K128m66r01m112P096J1298
15164F975k403n881j626J906q584r24O651L886O63K903K946p137k524J740J747
15149C38k13K811N663o584n931Q527N80j0193n784m69O298R414M932n951j189
15134B249P252O904o887j053o827m884O483N284J00j59J587m680O611K147k732
15119A1395N80l786L42k978j113L540k107m917k97p58N868q3l359j533L340j200
15103B934k319p04k806k419p82k334K125M229P746J08k839O9n000o670n633J0631
$$ y = [-6635, -6481, -2543, -94, -1332, -3715, -3195, -2866, -3410, -1335, 1863, 4825, 3692, 7470, -689, -6045, 860, 2614, -2949, -603, 6364, 7419, 4536, -1819, -7325, -7873, -4845, -5426, -1994, 1429, 5517, 6776, 1219, 1123, -2182, -1197, 2939, 1529, -1859, -12207, -15324, -8068, -5940, -6406, -7307, -11419, -4323, 6975, 4572, -1309, -2935, -1029, -9613, -10537, -3886, 0, 663, 3566, 6512, -625, -3149, -1409, 338, 125, 2936, 8599, 2015, -3916, 4611, 5191, -5002, -10786, -11255, -4957, 4457, 9389, 3438, 2249, 9501, 16405, 9518, 8465, 1638, -3246, 3237, 8521, 8621, 8462, 10049, 5369, 11980, 14127, 11395, 11975, 8189, 8531, 5553, 4440, 7980, 5873, 956, 659, -99, 5769, 5686, 2327, 794, 4134, 2934, 615, -89, -2895, -5314, -6096, -8430, -6305, -2076, 5670, 5778, 2939, 3008, -1992, -8662, -14295, -3664]
15087c664K846M237k373L940o723p046l11j65J113M037M811K931j649M322P32
15072G038n26M008k085l350L292N91l511Q815n296m826m59j810n0K408J871N18
15056F628k857k487K714M782m688M417N908j888r246o973O69K838P62M22J786
15041B787L709K616j100o24m247q08K080M987P54J871l991m690l580q92Q76M683
15025D431M7l157P711M69L353r635l474J251j449o332j95L48P021l853o238M04
15009i298N199l81Q266J822l898m076l92L056j288K557P323l524j873j113p57
14994A623l214J628m408O92P010J0627k020k621O225l239k713J616O313m017p909
14979E593j905Q027l592l570m166p607P333K365p536R20M209J702m839l057k093
$$ y = [-3664, -818, 3419, 1046, 4986, -1737, -8783, -9094, -9259, -8146, -4109, 702, 3633, 1984, 6306, 7038, 6512, 10520, 8435, 5085, 8377, 8968, 5457, 14272, 8976, 4150, 3691, 1881, 1831, 4239, 6110, 6628, 3771, 1284, 3998, 8780, 4092, 8509, 14417, 12529, 3283, -3690, -3021, -183, 579, 1001, 2787, 6496, 9112, 8012, 7388, 3141, 2333, 4413, 9400, 10154, 12025, 8034, 3344, -236, -1128, -252, 4431, 4478, 1321, 9032, 9501, 12854, 3219, -255, 996, -453, -6785, -6980, -6632, 389, -3464, -9702, -9298, -4099, -4480, 3786, 5608, 1710, -2366, -2758, 298, -990, 1567, 8890, 5366, 3493, 2380, 1623, -1591, 37, -4371, -3679, 3331, 13958, 11938, 9317, 15542, 12303, 9590, 11206, 17519, 13502, 5593, 3688, 11715, 8123, 4553, 387, -7220, 113, 2478, -5058, -4138, 71, 1773, -3066, -6123, -8216]
14964h216m914l248L181P054J0666L684k257l708J993O556L926j989m574J489
14950I643j241l887L005k037r637l445K249L689k714J045M323l867k236j745Q426
14935A571Q615k0n029L606o145o075P26O864p592k440j208m796l984P089O498
14920b320N230p18r2n554l498L184L689K801J90n025k277L068K661n129l781J775
14904e796l36L957n7K582Q933O543l390o075q71p39J360j62J536N044k741q63
14888H925k664m417M674m32l241P312P168p905M93k722o214r44l34l622q38J869
14872b892J387P02K251J09k76O754l673l181n85L233J116k595j056M294M353k037
14856G904M608L778n095p478j172M277J894R8m448m186k580K423L552M120K873
$$ y = [-8216, -13130, -16378, -13197, -6143, 4523, 8207, 5950, 2242, 4235, 10791, 14717, 12728, 8154, 9643, 8402, 4515, 7520, 5483, -4154, -7599, -5350, -1661, -4375, -3330, 993, -2874, -5110, -6855, 1571, 10186, 10166, 5137, 8743, 2598, -3477, -2751, 4113, -3479, -5919, -7127, -11923, -15907, -8818, -2320, 2910, 2192, 2100, -3454, -6952, -3768, -79, 2722, 2912, -2113, -4390, -1322, 1339, -3790, -7571, -5796, -6132, -2175, -2232, 350, 9283, 15826, 12436, 6361, 5490, 4751, 6111, 5949, 7485, 12529, 9788, 8925, 6261, 1844, 6518, 6086, 2845, 10157, 17325, 9420, 9913, 7191, 977, 33, -301, -3923, -4761, -2892, -1505, -803, 1448, 1557, 1281, 8035, 4362, 1181, 596, 3829, 4945, 2350, 1294, 5588, 9941, 7904, 12512, 16290, 11195, 3717, 2545, 6822, 8716, 8814, 4366, 180, -2400, 23, 3575, 7695, 10568]
14841A0568J762J151n563j551O16k793m031m965L176l410J159j180l049j159K854
14826f415P082N360j864J697q38N836L864n860Q32j963n164J82o50J497k082J34
14810A648J776O72O125m761p342M130J646Q36n401k749L54m177j691P388O536
14795D990k642j114L772J048o727k706J827Q78j422j251R023k881J308k42N58
14780D419l445m046L474o94j41j298m377k000L631L364M87q654l805q54Q725l07
14764e521L892L085O02p24J6n666R879L248J393l815l482m097l93j683Q527m008
14748A253k378O645P67r081q203o421M682J707K012L792N813O331j605o249o360
14733g295L105K172L905J179m884m400k98P4L684o43J399K328N765k760j96m94
$$ y = [10568, 12330, 13481, 7918, 6367, 6983, 4190, 159, -4806, -1630, -5040, -3881, -5061, -8110, -9269, -6415, 667, 6027, 4163, 5860, 5022, 10858, 14722, 8862, 9694, 7731, 2567, 2749, 2099, 3596, 1514, 1648, 3424, 4096, 10221, 5460, -1882, 2248, 3894, 4730, -671, -3420, -3066, -7243, -8934, -1546, 4990, 2348, 1234, 5006, 6054, -673, -3379, -1552, -674, -2096, -3347, 5676, 2795, 4103, 3861, 4419, 974, -3072, 402, -292, -433, -1731, -6108, -8108, -4477, -1113, -626, -9280, -13085, -13939, -5214, -5521, -1629, 1456, 2058, 1334, 1350, -4316, 5563, 8811, 10204, 6389, 2907, -1190, -1583, -3266, 5261, 1253, -1125, 5520, 6287, -2794, -10997, -17418, -12736, -11029, -9017, -5225, 588, 6919, 5314, -935, -7295, -4190, -2018, 1887, 3066, -1818, -6218, -6516, -6442, -2758, -3401, -2002, 326, 6091, 3331, 3135, 2641]
14717B641J14K569l201m350Q61K554M093O73r60n465L852P18q042K488M330J076
14701C951o2m684P54J589o305l833K149L05P865k138m392o65R20k078M659j053
14685c018k04N565l118l125P691L842n034k741J232L141J220P55p404m997L00
14670e895J0624O990l821n356l194M591L144J032j202K977K939m164K124L681
14656A4470j86M094n54p664k450r57o610m37m57j115J415Q21P88J802M218L064
14640A0242k275j216j836o57O422l482o604N393K389n482n695j878J013J158q72
14625c380K010k92K533L04J62K071m71j124O757N24l456J626k134o87n668R88
14609b37N778k414k123K318j289K053M384L161j13n48l965q240n76N423N09J898
$$ y = [2641, 2755, 5324, 2123, -2227, -1366, 1188, 5281, 5954, 4994, -471, 3381, 4099, -3943, -1455, 2875, 3951, 3889, -795, -41, 1548, -4757, -8590, -6441, -6136, 1729, -409, -4801, -5466, -4546, -6624, -1965, -3018, -3222, 2343, -775, -3900, 3791, 7633, 2599, -142, 1090, 4231, 5451, 6206, -1198, -6195, -5895, 4729, 11719, 7898, 2542, -652, 3939, 7083, 8115, 6913, 9890, 12829, 8665, 10789, 14470, 14284, 18378, 17824, 10160, 7710, 6753, 143, -294, -751, -1866, -451, 370, 1158, 2960, 7178, 10242, 7967, 6751, 4915, 4258, 10680, 7198, 594, 5987, 8376, 2894, -2801, -4679, -3666, -2508, -3380, -1370, -1662, 871, 1175, 1337, 3408, 2937, 1813, 8570, 9094, 5638, 7264, 5130, 4443, -1225, -237, 5541, 3127, 1004, 3322, 2033, 4086, 8470, 11631, 11518, 10970, 7005, -1235, -1811, 3612, 4121, 6019]
14593F019J401m05L208j868k852L392m83r681j678K040K853n365j210n04O9m183
14577i247n7O191K635p675K180R317l917K29l58K283M081J722L505k403j723k047
14561D716M400k082p803m89j148O22n61j858l07L065M147R674R15p62k443o040
14545D046Q11N789L62l278K797n008J850M594l305m29N98L473k834M37j2955n481
14529h533k426o064R002N149M551L100r0l256l010o252P27R390P818j473o789
14514A844J525m825n09N395L212n060l119J369K922K235P183k419J001j498q869
14499C87k423Q157O758J496k852p278m461j005R36L859l603l076n960M407P020
14484B362K456j398M814K647m083l638m288L407N385N954m196o365o959M066M621
$$ y = [6019, 7420, 7015, 10223, 8355, 5503, 8895, 8412, -1269, -2947, -907, 1946, -3419, -4629, -5133, -5064, -9247, -9304, -3113, -478, -8153, -5973, 3344, -573, -344, -702, 1581, 5662, 7384, 10889, 8486, 6763, 4716, 9116, 7034, -769, -1258, -2406, -1784, -2345, -4203, -4510, -1445, 2702, 12376, 13291, 12529, 10086, 4046, 4857, 10646, 11008, 7730, 10527, 5519, 7369, 11963, 8658, 8229, 8827, 12300, 9466, 9903, -3052, -8533, -10959, -17023, -8021, -2872, 1679, 4779, 4689, 1433, -1577, -7829, -7102, 2288, 10106, 8633, 1844, 3369, -1456, -1965, 3430, 6642, 1582, -1537, -168, 2754, 4989, 12172, 9753, 10754, 9256, 387, -2036, 6121, 12879, 14375, 11523, 4245, -216, -1221, -285, 3574, -29, -3105, -9065, -4658, 2362, 4818, 3420, 8234, 10881, 6798, 3160, -1128, 2279, 7664, 13618, 9422, 3057, -3902, 164, 4785]
14469D785l302p818J463O195j203o026k063N758P651j42K683k569J779l931J81
14454C441l249j433L176K652o514p830j044L863L22K985J829j464L522L738L891
14439G885P7j263n392l567M049N306N164l490q561p1M008K934p215l33N633l35
14423D829k671n493Q86N368J344q451m187L031M640k17j274J962Q55O21k068L93
14407d32J950n772K63M425j70K087M659J231m840n590K95J05l445N29M028N329
14391D652P8M868P504j428l680o434l915Q65J537m796k478O184L835q447K611
14376I56N174m978l702J33R33K48j051J001J630L062n204m147K730J803j779j921
14360e112M161M237L132j730K444N699K921k684j31o799p376M85N222Q79m485
$$ y = [4785, 1483, -6335, -4872, 1323, 120, -5906, -7969, -2211, 5440, 5298, 7981, 5412, 7191, 3260, 3441, 192, -1241, 1935, 4587, -1927, -9757, -10801, -6938, -6616, -3631, -1802, -3266, 256, 3994, 7885, 7962, 6699, 1307, -2260, 1789, 7095, 12259, 8769, 208, 137, 4145, 7079, -136, -469, 5164, 4829, 2158, -3335, -2449, 2919, 4263, -4188, -8375, -5344, -704, -921, -2195, -233, 622, 1243, -825, -432, 1518, -4254, -3991, 434, 264, 2351, 7010, 8241, 3401, -2189, -1894, -1789, -5234, -4705, -677, 4652, 4730, 9598, 17102, 15674, 11994, 5560, 1645, 2510, 4047, -749, -3227, 2957, 6792, -1655, 956, 6130, 1152, -2550, -2417, -1484, -1236, -2287, -1286, 344, 3406, -1798, -5945, -3215, -1412, -3191, -5112, -951, 3286, 6418, 4688, 7132, 12831, 15752, 13068, 12937, 6138, -1238, -753, 4469, 5348, 863]
14345H63j929J161j168R62L865M510m269l627l494M026N728K977K936n921m027
14330B593K28n292m300k464P411L569K083K076O02M534K005j610n913k529j90
14315B803K566n22L158l144n135k348J509L879q54l68K124N389j797l514l069
14300F77M75N384J012l391L520l96K84o72m694o676K384Q568P327R28K119m296
14284A2553k389j897j063j585j205M866m2m43R62m497j692j347m052O745P313
14269A2227P33n7j760p191l121k587N183P612j553m458k679J563K735m854l750
14254a957l80L493N419j828n713K455Q631J540j620O210O686j404r425p997K98
14239D408L316j396j109m231k648J327j446J878N91M157J071k665O319k602m143
$$ y = [863, -1066, 95, -1073, -111, 3754, 8264, 3995, 368, -3126, 900, 6628, 9605, 12541, 6620, 2593, 2821, -2471, -6771, -9235, -1824, 1745, 3828, 5904, 6506, 11040, 13045, 11435, 5522, 2993, 2803, 5369, 4847, 8005, 4861, -274, -2622, -1113, 2766, 1912, 1544, 3668, 9057, 7260, 3746, 677, 1152, 6536, 7548, 4157, 7677, 7281, 7565, 6893, 2199, -4477, -2093, 6475, 13802, 14730, 16849, 12553, 10164, 8267, 7204, 5619, 4414, 9280, 9238, 8795, 9757, 5260, 3568, 2221, -1831, 4914, 12227, 12960, 12903, 11143, 3952, 831, -1756, 3427, 11039, 9486, 5028, 2349, 3912, 6647, 1793, -1957, -2337, 1156, 6575, 4747, -966, 1489, 10120, 11660, 10040, 16250, 22936, 21532, 12107, 4110, 4408, 7724, 6328, 5219, 988, -1660, -333, -1779, 99, 690, 4847, 5918, 3253, 9572, 6970, 2827]
14224B827L28l146L43K642l74k174j22M159k268k170R610O510r530o642L88J428
14208A809O62J208K353J79m845P88P004J34k272j875M008K409j830l683j735l386
14192I28N149J652l530K358O983p069n376N359k58J458j850j7K10k597k931k376
14176a907N559m450m139J791j636l463n565J314Q142J3220K10k778l807J801J012
14161E304m517L327K665j012r20l047R7J613J764J70p534j379j261k428L949L861
14145F52m304L757M056L308M942k357m769n278J18O034P31k622n847J651m431
14130d359K328M253m785l28N24J626k391N477J991n681m91j046Q86K784l099Q10
14114a501k693K472q16L151k402J988O024M538j542J543o648n127J86P282P761
$$ y = [2827, 3155, 9, 352, 2994, 2620, 446, 324, 4483, 2215, 45, 9655, 16165, 6635, -7, 381, 1809, 2471, 3679, 6032, 6211, 1366, 2154, 9158, 9292, 7020, 5145, 9153, 11562, 9732, 6049, 4314, 928, 6077, 7729, 4199, 6557, 13540, 6471, 1095, 6454, 6196, 7654, 5804, 5787, 5997, 3400, 469, -1907, 3652, -798, -4937, -3146, -4782, -8245, -13810, -12496, -4354, 8866, 9076, 6298, 2491, 4292, 5304, 787, 4114, 6779, 5767, 4847, 1800, 1897, 3510, 5274, 5444, -2090, -3469, -4730, -7158, -3209, 652, -3652, 105, 4161, 7469, 12411, 10054, 5285, 7, 125, 6159, 6890, 4268, -1579, 72, -4359, -2031, 2222, -2563, -2891, -2367, -741, -3132, 2345, 4336, -1345, -1836, -2882, -1996, 788, -2311, -1501, -4194, -1722, -2538, 613, -1789, 199, 6223, 10761, 9219, 10762, 4114, -1013, -827, 6455, 14216]
14099A4216m25q596K90P299O115n659R4L698M845M579j0021q745J273m328L100
14084G735L673m820j123L853O19j966m996K690l66j750P344l787J327N238J703
14069A5374o727M477K810j0854q142j636J678O67l41N784L646m898p335l093L444
14054e146N960N189J321K814m013k466N762k932o796k646O427M814K255j081j657
14039G805j465j033n186k794k423J0324L530k711o394m099L344P565K312M175
14025A2950l71r501j232M050m419m435j044Q930M362l862n113j934N934Q100K36
14010A2651m417J809J935j871n055j755K524O189j255n900r673O6L398P214M28
13995F288l07K076K327k094j766N931J037q34l40k059q345Q5L013m576k932L887
$$ y = [14216, 13791, 5195, 5485, 12784, 18899, 13240, 13334, 17032, 21877, 26456, 16435, 7690, 8963, 4635, 7735, 11408, 6588, 5465, 9318, 9937, 7971, 2975, 5665, 5299, 3549, 10893, 7106, 8433, 13671, 15374, 8647, 13124, 15934, 5080, -3062, -4698, -3020, -2353, -2694, 3090, 6736, 1838, -5497, -8590, -5146, 814, 6003, 7324, 10138, 6125, 3659, 9421, 6489, -307, -2953, 3474, 8288, 10543, 9462, 7805, 6340, 5307, 121, -2673, -5096, 5228, 8758, 6047, -347, -4446, -1102, 6463, 8775, 12950, 12579, 3078, 1846, 5896, 1477, -2958, -4002, 4928, 9290, 5428, 315, -1619, 4315, 12415, 12651, 8234, 10043, 11978, 10107, 5052, 3297, 5821, 12010, 10755, 4855, -4818, -4752, -1354, 5860, 6288, 5981, 8057, 10384, 8290, 6524, 12455, 13492, 12658, 12318, 10259, 1914, 1999, 5012, 436, -2496, 1391]
13979A391K79m653K110k349L599L656N984L804l654n671P11n354m346o27L452
13964a668J253J923m30n669M402O912j77j1541m175J647P717j90M074P540p576
13949D042n463k492M606K324K423j130K394n69j926L053N054n31o263j782l259
13934D81k154P9K557m272n305J663P983K606J841K996j663N505m108l949o0M018
13918H218k384J769J896p69n649Q58P01n374k956L94L291j750R04Q467O980j67
13902A4429L470m317o993l430K757j416q315L937N314J890J826J170k288n352
13888B682J502l912J389K41K187M12o000P35Q01k156R49p03L789K122m92J183
13872D729l384L943O235K194k191n460K052o63J489J594o90L758M853n958K219
$$ y = [1391, 1670, -2983, -873, -3222, 377, 4033, 10017, 13821, 10167, 4496, 5207, -147, -4493, -5120, -1668, -415, 1508, 1078, -4591, -189, 6723, 6546, -4995, -9170, -7523, 194, 4, 4078, 11618, 4042, -1421, -3913, 693, 3017, 5440, 4310, 6704, 6135, 4209, 7262, 12316, 11785, 5522, 3740, 481, -1673, -1594, 963, -3309, -8614, -6951, 1032, 3638, 5479, 8475, 6812, 12317, 8209, 4260, 4200, 8218, 5834, 7603, 9499, 8730, 3081, 3939, 4640, -734, -3690, -3296, -5, -1755, -851, 7616, 14596, 14429, 17899, 13582, 6589, 3159, 5916, 4500, -3815, 122, 5436, 7326, 9152, 10322, 8034, 2682, 4184, 272, 1661, 1902, 4089, 4501, -1499, -764, 37, -2119, -1170, -1873, 1916, 4038, 3546, 4729, 1345, 5288, 11523, 13717, 11526, 6066, 8118, 7455, 8944, 10538, 9848, 13606, 18459, 12501, 14720]
13857A4720J440n64l285j794l722N494M256q29L253M670Q35N998O684J2355P370
13842E6881j155K338M713q749r010j0916r794j2331k611O490Q09m020J008n55
13828A3098N62K683k135k403j920k078l311M024j936N172M83m110j526M14J681
13813H698R13q207J46L568J621O97M83P036L703k106l147r268m243K498L598L418
13797I408P887M54l835l994N45M339j883m507p542N253O222k361O088N396L655
13782B5125j162k481n790J54o337p042N15l517N296N96r37P194K640K808p290
13767I772o278m1j196n934O573M113k681p19N427L543k01n550n927q98J509K539
13751D051k531K281O569L509p175p756J664k448N37O585N404n57n404n96k774
$$ y = [14720, 16160, 15596, 12311, 10517, 6795, 12289, 16545, 15716, 18969, 23639, 24474, 30472, 37156, 49511, 56881, 55726, 58064, 62777, 54028, 45018, 34102, 24308, 11977, 9366, 15856, 16665, 12645, 13653, 13098, 13660, 16343, 14208, 11805, 9885, 7807, 4496, 8520, 6584, 11756, 12239, 8129, 6603, 7017, 8698, 9611, 1404, 1550, 5118, 6739, 7436, 7919, 14955, 18658, 16552, 13405, 4137, -106, 2392, 5990, 9408, 17295, 17749, 13914, 9920, 10465, 14804, 12921, 8414, 872, 6125, 12347, 9986, 16074, 21470, 25125, 23963, 21482, 15692, 15846, 9509, 2467, 2982, -535, 4761, 5357, 4420, 11614, 14254, 17062, 9772, 3494, 3453, 2257, -3677, 2896, 7009, 4328, 3609, 9036, 12579, 12378, 6828, 901, 3, 1512, 4051, 1520, 3801, 10370, 13879, 6704, -1052, 612, -1836, -1299, 5286, 10690, 10133, 4729, 4133, 1359]
13736A359n776o732n079O788N448J828M162J577J854L840l2m297o089m175J588
13721c736P48M009j531j812j215L194J691L701M538M177o569j766j829o547k352
13706e299L823j898P940M903j92j1184n809J380L062J1295O03N124N186o447o420
13691F067k16k42M341K074l642o246k592m62M781m129j566P114R019m687q923
13676F91J846L665K09N052k850m217j498M461L950J979m671J082K487j06J667
13661A3747p35n309k290k654l872K96Q777M609Q82o503K099M547o229k045l920
13646A400K651k586k589R53j764J39K165K303M277q53K311M344l686P25K116k616
13630I290o40k637J42M898l793K182l478r63N67J2036k543k437k394q36P897J074
$$ y = [1359, -4417, -11149, -16228, -9440, -3992, -2164, 1998, 3575, 5429, 9269, 9237, 4940, -1149, -5324, -3736, -2988, 1021, -510, -2322, -3537, -343, 1348, 5049, 9587, 13764, 7195, 5429, 3600, -2947, -5299, -1476, -3374, 4566, 9469, 9277, -1907, -7716, -6336, -3274, 8021, 8624, 13748, 18934, 12487, 6067, 5851, 5609, 9950, 12024, 8382, 2136, -456, -918, 3863, -266, -1832, 5282, 14301, 9614, 691, 2537, 6202, 6411, 11463, 8613, 4396, 2898, 7359, 11309, 13288, 8617, 9699, 12186, 12080, 13747, 13012, 7703, 5413, 2759, -1113, -817, 7960, 12569, 13451, 6948, 9047, 13594, 7365, 5320, 1400, 4051, 1465, -1124, -171, -1935, -1796, 369, 2672, 6949, 6096, 8407, 12751, 9065, 9790, 11906, 9290, 8650, 6013, 6155, 11053, 7260, 9442, 5964, 5001, 5568, 17604, 15061, 12624, 10230, 9394, 17291, 18365]
13614A8365k201o924l182M30k127K58K908l772k292J041q00J748N525j105R25
13599H797J327j235q4p72m001J345l70L327m45p047J618k484L621l508l769j687
13583e367k89R337J048p21O33M065J923k675N797P294q761l550k979R73o89l058
13567B981K030L826m961o518O019Q467j52l242J505k264j428k853L148M204m99
13552A0263j218M631L225r00O173J389o460p802K666j75p903k827K377J538l16
13537D661K635m267l018k077K136L000J466k54J242O360o53k54j522m395j56L839
13521H743j646j0826O773O375k094L308O1J969n192n777o59O016Q53J668p322
13506B250m269J339L821O581l199K403k877p179k065Q566L064k736O52J819M366
$$ y = [18365, 16164, 9240, 6058, 6488, 4361, 4619, 7527, 3755, 1463, 2504, 1704, 3452, 8977, 7872, 8797, 10124, 8889, 8805, 8033, 4032, 5377, 5007, 8334, 7889, 842, 2460, -24, 3597, 89, -3680, -5367, -5656, 3681, 4729, 4008, 4641, 8706, 10629, 7954, 13751, 21045, 12284, 8734, 5755, 6728, 6039, 2981, 5011, 8837, 3876, -2642, 3377, 11844, 11692, 8450, 9955, 7691, 6263, 3410, 6558, 10762, 10263, 9045, 13676, 16901, 16001, 22174, 23563, 17103, 9301, 11967, 11792, 3889, 1062, 3439, 4977, 4661, 7296, 3029, 11, -2066, 70, 3070, 4536, 4282, 5524, 11884, 11231, 10977, 9455, 5060, 4904, 8743, 7097, -3729, 3044, 9419, 7325, 10633, 10694, 12663, 7471, 1694, 1035, 7051, 7904, 9572, 2250, -2019, -680, 3141, 9722, 6523, 8926, 6049, -1130, -3195, 5371, 8435, 5699, 6351, 8170, 12536]
13491A2536L967n882j1164j448L565j222o128J70K728P839J972l96k603m917n163
13476f146n758M126M143M383K515n450r290L585P515N912q82j4K187l321Q06j541
13460B770L266P058j893n468L433L666P91J81j846l827o556K89q88K622P192K117
13444A2907n905k799p96O165Q24o137l863Q060J612P7M922K62Q22k402O28p662
13428F715j0261j603R840L928n33N863m121j2896m048R705K222L248J680m317
13414E422k711K709j154K243M242M256K144J315K425o309l768l188K97N600k09
13399A3314J965k468J705K154Q84m937m329M829r90K043o198l489O835k757k024
13384F537l522n600m85M035J614L64K661J284R072j291q746M04O152J974J798
$$ y = [12536, 16503, 10621, -543, -1991, 1574, 352, -5776, -5606, -2878, 4961, 6933, 6537, 3934, -983, -6146, -11904, -7778, -3635, 748, 3263, -2187, -11477, -7892, -377, 5535, 4653, 4639, 6826, 3505, 4311, 2770, 6036, 13094, 11201, 5733, 9166, 12832, 13623, 13804, 11958, 8131, 1575, 1864, 976, 3598, 10790, 12907, 7002, 4203, 3407, 9572, 10396, 4259, 396, 8456, 10068, 10145, 15067, 15329, 16151, 13749, 14377, 6715, -3546, -5149, 4691, 8619, 8086, 13949, 9828, -3068, -7116, 2589, 4811, 8059, 9739, 5422, 2711, 5420, 4266, 6509, 10751, 15007, 17151, 18466, 20891, 14582, 10814, 7626, 7923, 13523, 13314, 15279, 12811, 14516, 16670, 17554, 12617, 8288, 13117, 12127, 14170, 7972, 4483, 11318, 8561, 6537, 3015, -2585, -3070, 965, 2579, 2943, 5604, 6888, 15960, 14669, 5923, 6327, 12479, 14453, 16251]
13369A6251n180o018k72P84K188J165j278M077j564j105o545K338O303L710l660
13354A1194m043J417J707n277j04K610p45m070L246O37O390N116K762N629L15
13339B6784j3268n286P20J038n127L110K872m488K79l495k586M959P901L509l091
13324A3831m116L044N017l234p1M801j034N21K101J944P72m529K010N553p667
13309A8943r042m257O590K657j584N385q25k474q784m363K363N535k281K393O850
13294A7106M855k255k115o556j874J261q22j262j949J058p05J451l68j384j347
13279E094O046L652l114m761j004J93J090l681K879o91q232K788P349Q420l838
13264A2190K059j666l824N526N76k770k698j624L405N938L928k954k759m530j144
$$ y = [16251, 11071, 5053, 4781, 5565, 7753, 8918, 7640, 11717, 10153, 9048, 2503, 4841, 11144, 14854, 11194, 7151, 8568, 10275, 4998, 4894, 7504, 6759, 2689, 5935, 6572, 12962, 18078, 20840, 26469, 26784, 13516, 8230, 8950, 9988, 4861, 7971, 10843, 6355, 6634, 3139, 553, 5512, 13413, 16922, 13831, 9715, 12759, 17776, 14542, 14471, 19272, 18238, 18759, 20860, 22804, 23576, 19047, 21057, 26610, 18943, 9901, 5644, 12234, 14891, 13307, 18692, 17867, 15393, 6609, 2246, 4609, 10144, 7863, 10256, 17106, 21961, 19706, 17591, 11035, 9161, 10422, 9600, 8338, 6389, 7447, 6742, 8193, 7825, 6441, 5094, 11140, 14792, 11678, 6917, 5913, 6106, 7196, 3515, 6394, 5703, -2529, 259, 7608, 16028, 12190, 14249, 12583, 8759, 14285, 14861, 12091, 9393, 7769, 11174, 17112, 21040, 18086, 15327, 10797, 9653]
13249I653L95J743n172j1307M026M504m7j090r580o920Q050L153K168P075q6Q81
13233G446K165k088M64N110m305l509k566M394j079K5P749m407k293L784k778
13218H112l106R335J870k512L172n167j941p95l4O85l235k978J240N535O455L934
13202B0570o845o907P91j757o081j011J111n06j930O275R486K197n268p287P84
13187C622M115K59l781n377m951q79Q029J385j630J946M953O86J29O201K689l769
13171A3627n469l273p60j782K194N524K814R2o129j3886Q184J1520K081N204l222
13156A6719M90L442J071j27j583m898q452k139nJ421P079J0070J365j914m450
13141A8089J968j351o176o077j214l715M585K230j876P23M257R91n768O62N365
$$ y = [9653, 10048, 11791, 6619, -4688, -662, 3842, 3795, 2705, -6875, -13795, -5745, -2592, -424, 6651, 6565, 7446, 9611, 7523, 7987, 13097, 8792, 5283, 2717, 7111, 6032, 6057, 13806, 9399, 7106, 10890, 8112, 5006, 14341, 16211, 13699, 16871, 11704, 9763, 8968, 8934, 9619, 6384, 3406, 4646, 10181, 16636, 20570, 13725, 6818, 7609, 5852, -229, -1240, -129, -635, -2565, 3710, 13196, 15393, 10125, 2838, 3622, 7737, 7996, 4215, -1162, -6113, -6992, 1037, 2422, 792, 2738, 7691, 8377, 8506, 14707, 17396, 13627, 8158, 4885, 4125, 2343, 4537, 10061, 12875, 12967, 6838, -7048, 1136, 12656, 14737, 19941, 16719, 17209, 20651, 21722, 21595, 20012, 15114, 6662, 4523, 4518, 5939, 13018, 23088, 24453, 22539, 18089, 20057, 18706, 12530, 6453, 5239, 1524, 6109, 8339, 6463, 7186, 11443, 12434, 6666, 7328, 12693]
13126A2693r08O391K341o784n938l138J518M218q22R77J275L845N87K878l282
13111A5851o091j200M221l085J01j102J929O716L097o119n427m271l949j594j20
13096a043j371J058K106j365k451K344L2P849M383kj0j580j287k905J0684N727
13080B2169j407o20r53m942n335k395k47K246J85M558J693n219l384M267n61l543
13064F512m569j197L461P590O416M262M596o714k20J040m132L755o86m969k491
13049A2654j540L609j015p178r892L230K919N302M627M054k77K757m481p725p54
13034F290Q814L579J339r205m40J475k995o620K014N774N410M935n979j866r4
13019A2431n314k07n640l536K08o59J588r61J942L081K74m863M250K740J569Q32
$$ y = [12693, 11785, 18176, 20517, 13733, 7795, 4657, 6175, 10393, 9571, 10548, 11823, 15668, 16255, 19133, 15851, 9760, 8560, 12781, 9696, 9797, 8695, 10624, 17340, 20437, 14318, 8891, 4620, 671, -923, -1043, -2414, -1356, 750, -615, -3066, -722, -690, 7159, 11542, 11540, 11530, 9950, 8663, 5758, 16442, 22169, 20762, 20142, 19189, 14247, 8912, 6517, 6270, 8516, 8701, 13259, 14952, 9733, 6349, 10616, 10055, 6512, 1943, 746, 4207, 11797, 18213, 22475, 27071, 20357, 20137, 21177, 17045, 20800, 20114, 15145, 12654, 11114, 14723, 13708, 6530, -3362, -132, 2787, 8089, 12716, 16770, 16493, 19250, 14769, 7044, 6290, 15104, 18683, 20022, 10817, 10377, 11852, 8857, 2237, 4251, 10025, 15435, 20370, 14391, 12525, 12431, 7117, 6910, 1270, -2266, -2058, -2717, -1129, -2090, -148, 2933, 3207, -1656, 2594, 5334, 6903, 7735]
13003G735L658M493o05N709O19q703o059L020o47j953N44n43L33p2j727J705J240
12986H747l43K991M717n094M231N724j600k479J755j39k532j63J665J254n416
12971A3318L993M115k465j0231j640L717L746j953J316q84o079j95J217L15K16
12956H506m546k171j215K961O833L7M597j154k855P034K476k731N50j237j815
12941A5270j72p81K6m195k297j222k723J716M523K799k332l590k644O686k280
12926H784p243J80N007P243Q455j687o769m780J433K86N797K371Lk836J159J455
12910A8858p507m801J676K789K085K647l214k352O188O95n425J151k081q55N574
12895A5428K311K71m648l769r97J910k203J876L568l330j612m719k624N075O551
$$ y = [7735, 11393, 15886, 15281, 20990, 21609, 12906, 6847, 9867, 9220, 7267, 7811, 7268, 7601, 7529, 5802, 7507, 8747, 8404, 11395, 16112, 11018, 15249, 20973, 19373, 16894, 18649, 18510, 15978, 15815, 17480, 18734, 13318, 17311, 21426, 18961, 8730, 7090, 10807, 14553, 12600, 13916, 13032, 6953, 6758, 7975, 8290, 8506, 3960, 1789, 574, 3535, 10368, 10405, 15002, 13848, 10993, 18027, 20503, 17772, 18322, 17085, 15270, 15098, 14317, 14343, 10148, 7851, 6629, 3906, 5622, 10145, 12944, 10612, 7022, 4378, 11064, 8784, 1541, 1721, 6728, 13971, 22426, 20739, 13970, 9190, 10623, 10909, 16706, 19077, 19080, 16244, 17403, 18858, 11351, 6550, 8226, 11015, 13100, 15747, 12533, 10181, 16369, 17064, 11639, 12790, 10709, 9854, 15428, 17739, 18010, 13362, 9593, 8596, 10506, 8303, 10179, 13747, 10417, 8805, 4086, 1462, 6537, 13088]
12880A3088L122O08l88L43K423M38l148N789l344m082k330L107p2n341n213L434
12864H434N850O311j138l47n298m431p85M916J691M77k593j893N644k244p683
12849F911k675O313J033l889j232J676K36n496J882n3M255n6m163J154J369j042
12833F223o043j628R635K128P3o08n806m245L925k22N34P232J456J467K58p19
12817A3660J419L711n23J010J836p361j246j248n86O46L326M700N338n96n046
12802A9040k450q42M719L813N255p579q449l495Q37M433N858k664k869L035k697
12787A5945j009J965M46j852j84l582K537L845j649j787l108n848p915N640N342
12772H786L467Q753J811j347l445k298j569n881q438l756M216M396M065O634L767
$$ y = [13088, 16210, 16818, 16430, 16773, 19196, 19634, 16486, 22275, 18931, 14849, 12519, 15626, 15554, 10213, 5000, 8434, 14284, 20595, 19457, 19110, 13812, 9381, 8596, 13512, 15203, 15680, 13087, 11194, 16838, 14594, 6911, 4236, 10549, 11582, 7693, 6461, 8137, 8373, 2877, 4759, 4706, 8961, 8905, 4742, 5896, 7265, 6223, 180, -1448, 8187, 10315, 10388, 9780, 3974, -271, 3654, 3432, 3966, 11198, 12654, 14121, 14379, 13660, 15079, 18790, 18267, 19277, 21113, 13752, 12506, 11258, 10672, 11318, 14644, 19344, 24682, 24086, 19040, 16590, 15748, 20467, 24280, 29535, 21956, 13507, 10012, 10849, 15282, 21140, 18476, 15607, 18642, 15945, 14936, 16901, 17347, 15495, 15311, 11729, 14266, 18111, 16462, 14675, 11567, 5719, -2196, 3444, 8786, 12253, 21006, 22817, 21470, 18025, 15727, 14158, 8277, -161, -3917, 299, 4695, 8760, 15394, 19161]
12757A9161m70N9O37N494l276k473n514k032N163J689j049k148J394M600M920
12742B6155k235n205o016K229J83j82k779J01k971k336L650k462k809p28O735
12727A1330P04R78k574k478j705J91J616L288J084N111j838M959k54K192k271
12712B0333l633l039k81n289K543L451p52M374n500p830k879L304K032j459K498
12697G873l683n258J445R148J3357K884o635r623j259M530K12Q20N426K914m54
12682B1697n526n566N298K308N081K907M381r524j499O79J38k589L22j467k676
12667A3964l850M086M0r836K675N671L934p471r554k826R943O369n262k008k627
12652C248P555K706n152M148Q168O406k12m121m994m567n396J26j900J513m45
$$ y = [19161, 18691, 18750, 19387, 24881, 21605, 19132, 13618, 11586, 16749, 18438, 17389, 15241, 16635, 21235, 26155, 23920, 18715, 12699, 14928, 15111, 14929, 12150, 12251, 9280, 6944, 10594, 8132, 5323, 4595, 11330, 12034, 13012, 10438, 7960, 6255, 6446, 8062, 11350, 12434, 17545, 15707, 20666, 20412, 22604, 20333, 16700, 13661, 13380, 8091, 10634, 14085, 13333, 17707, 12207, 4377, 1498, 4802, 6834, 5375, 7873, 4190, -1068, 377, 9525, 22882, 25766, 19131, 9508, 8249, 12779, 12991, 13811, 19237, 22151, 21697, 16171, 10605, 15903, 18211, 23292, 26199, 30580, 21056, 19557, 20236, 20374, 17785, 18107, 16640, 13964, 10114, 14200, 14240, 4404, 7079, 12750, 16684, 9213, -341, -3167, 6776, 13145, 7883, 5875, 3248, 10803, 13509, 8357, 12505, 20673, 27079, 26867, 22746, 17752, 13185, 7789, 7915, 6015, 7528, 7083]
12637G083q44J918j569K044N325J0488j522o718N01k095k091O669K438j731J035
12622B0931j043m008k800J953Q57j087J112M6j867l69j346j829J452q44K032r13
12606A2277l543M309K126o401l801L011L021O003N141k141J140j081n56m44j440
12591A7621m670K479N16m876L046m99O544k142l822k677N021m95l121k162j718
12576I045N836O239K55k906J726J739M377k591n452q93m675K125Q109L768K711
12561B9413K052p652o747M358L334k249j434j077m671J534K012N309n310m583
12547A4289M967J421R21K046M004k66j003m584O89N758N072n120n77k553m507
12532B0557m075n49n947k270O540l14K1M195K240p753k329R25K203J88j658j057
$$ y = [7083, 6239, 8157, 6588, 8632, 13957, 24445, 22923, 16205, 16706, 14611, 12520, 19189, 21627, 19896, 20931, 19888, 15880, 13080, 15033, 15890, 14803, 15915, 15961, 14094, 13725, 12379, 10550, 12002, 11158, 13190, 12277, 8734, 13043, 15169, 8768, 4967, 7978, 10999, 17002, 22143, 20002, 21142, 20061, 19505, 19061, 17621, 12951, 15430, 15946, 11070, 14116, 13617, 20161, 18019, 14197, 11520, 16541, 16046, 12925, 10763, 9045, 14881, 21120, 21375, 18469, 20195, 21934, 26311, 23720, 18268, 17375, 12700, 14825, 22934, 26702, 29413, 31465, 23813, 17066, 21424, 24758, 22509, 21075, 19998, 15327, 16861, 18873, 24182, 18872, 14289, 19256, 20677, 21598, 23644, 27648, 27382, 26379, 21795, 22484, 28242, 33314, 28194, 27617, 25064, 20557, 16482, 15933, 9986, 7716, 14256, 13942, 13963, 18158, 20398, 12645, 10316, 11241, 13444, 13632, 11974, 10917]
12516A0917J784K299L112p485J406L342R40K195r51N638M573k693q219n881j243
12501I734L813j963l069J804M683O067M540N95l323m386K153N092P605K395k821
12486C2919l471p407j1107l265J249j865k250k101O84l8j988Q730R327L778N924
12471B9119k997q659k464m780P866M358l627m40N550j437m463n113l759K601P212
12456A8967P510j949n060k363N255J7417m333j3258p603n374j081J964j874m09
12442G809l968R59M12J534j372P03K370L356q91L794k908j309O884N144K924k716
12426B2725l575l960L771o65o053m938P50L801j087j720J134L890J24o160l525
12411D512L265J206k277M183K420j916k615K559k510K306O253N359N40K54j1370
$$ y = [10917, 12701, 15000, 18112, 10627, 12033, 15375, 16315, 18510, 17559, 23197, 27770, 25077, 16858, 10977, 9734, 13547, 11584, 8515, 10319, 15002, 21069, 25609, 26204, 22881, 18495, 20648, 25740, 33345, 35740, 32919, 29448, 22041, 10934, 7669, 8918, 7053, 4803, 2702, 3386, 3348, 1360, 10090, 19417, 23195, 29119, 26122, 17463, 14999, 10219, 18085, 22443, 18816, 18376, 23926, 22489, 18026, 12913, 9154, 11755, 18967, 26477, 24528, 19468, 17105, 22360, 39777, 35444, 22186, 14583, 9209, 8128, 10092, 8218, 7809, 3841, 4800, 5212, 6746, 5374, 6077, 8447, 11803, 10912, 14706, 11798, 10489, 17373, 22517, 25441, 22725, 19150, 15190, 18961, 18296, 12243, 7305, 8055, 11856, 10769, 9049, 10183, 14073, 14197, 8037, 4512, 7777, 8983, 6706, 10889, 13309, 11393, 8778, 11337, 8827, 11133, 17386, 22745, 23285, 23539, 12169]
12396A2169m967l95M335O394K441M845K411k292q205m919J649O901j695J918J370
12381B1960J250Q26L064k729l295m200J177L388l649K628L654q20k346j923k817
12366A6168m207r83N115j9j739k473O47j04k355M646p27J801N271m002J049L568
12350B1656R04q04q093m781J963K63K448J558m83j051k765N05N770J741n203k436
12334A1192L840O595J122p110n735Q300M20n928J752q8L04j844o342M648J0264
12319B1390k381n817l460J265L857Q8l966p612j130K745J434K449J956L86P142
12304A8346m074q632N98P837k558L17N652K619j389l888K089Q580j463l23K412
12289B6123k157j0207k084m10J939R050M577q361n811N423O050J996k430j238
$$ y = [12169, 7202, 6807, 11142, 17536, 19977, 24822, 27233, 24941, 16736, 11817, 13466, 20367, 18672, 20590, 21960, 23210, 24036, 27100, 24371, 21076, 16876, 18053, 21441, 17792, 20420, 24074, 23254, 20908, 18985, 16168, 11961, 10978, 16093, 16074, 14335, 11862, 12509, 12405, 10050, 14696, 13969, 15770, 21041, 17039, 18088, 21656, 22560, 21756, 13663, 8882, 10845, 11108, 13556, 15114, 14631, 13580, 10815, 11320, 17090, 18831, 13628, 11192, 15032, 21627, 22749, 15639, 9904, 18204, 18624, 12696, 14448, 14360, 14664, 12820, 6478, 11126, 21390, 19009, 13192, 9732, 10997, 14854, 14942, 10976, 3364, 2234, 4979, 6413, 8862, 10818, 11204, 18346, 14272, 5640, 6238, 14075, 11517, 11834, 17486, 20105, 18716, 14828, 16917, 25497, 24034, 23711, 26123, 23966, 13759, 11675, 11265, 13204, 22254, 26831, 18470, 12659, 18082, 24132, 26128, 23698, 22460]
12275B2460o879q377J724M135j79m439l205L514O283k612J461K234m895J690M379
12260A7294O345Q61q07n02r75n18k283l987N832J811m846n303R72j932k029M067
12244A4000P314j75q358j60J282j880j271R77r078l561P233O108K069k597L171
12229A5074J494L530k277k347r31K972L266L817O768Q61K434l566l888q2k137
12214B4988q43J727n365n257O508K990K740k648J09l938k099M799Q337k929l598
12199B5521j663m910J771j194L073K481k159J208J025K08m970Q98L310l210O82
12184B2071o093p361M677M077R061m88J264m815O49Q020l298M807l936l806l0
12169B4799n96o496j597L97m934J76l678k073O883N623K679M295M866k332m515
$$ y = [22460, 15581, 7204, 8928, 13063, 12884, 8445, 5240, 8754, 15037, 12425, 13886, 16120, 11225, 12915, 17294, 23639, 24500, 23693, 23191, 22216, 21698, 19415, 15428, 21260, 23071, 18225, 12922, 13894, 11962, 9933, 14000, 21314, 21139, 12781, 12621, 13903, 12023, 10752, 11729, 2651, -910, 6323, 12431, 14500, 11903, 15074, 16568, 20098, 17821, 15474, 14543, 17515, 20781, 24598, 31366, 32227, 34661, 31095, 27207, 27125, 24988, 24145, 25872, 20507, 15250, 21758, 24748, 27488, 24840, 24949, 21011, 18912, 23711, 32048, 29119, 25521, 23858, 18948, 20719, 19525, 22598, 25079, 22920, 24128, 25153, 25361, 20391, 21289, 24599, 21389, 22071, 15978, 8617, 13294, 17371, 26432, 25944, 27208, 22393, 23042, 31062, 27764, 32571, 28635, 24829, 24799, 24203, 17707, 16110, 16507, 11573, 11749, 8071, 5998, 12881, 18504, 21183, 25478, 30344, 28012, 23497]
12154B3497P13o076n546l377O222O566N850k61j263k148K208j407m194l682j243
12139A5859L977j82J485l869N827P032k673L659L827j848n602m717j556Q8o757
12124A4550J251L873J559J490M688o35j662k105k352j489J713j413m590L433L590
12109B1901k969p504M820O65K621n347N700K687k974p679k368K807O44M686k28
12094A7462l763K969R794K038k422n226R12L40n702k901j131M251J294j898k413
12079A3604K206L662k478p104j942J845k301N246J311j397L737O156K400m097
12065B0848p93j297L26J277J250P877O78n016r433k959m278O91J0449K254l947
12050A7927K053O131R98k981p41n66L798m13n035R58J929J645K60n010P89L134
$$ y = [23497, 24210, 18134, 12588, 9211, 15433, 21999, 27849, 27588, 26325, 24177, 26385, 24978, 20784, 17102, 15859, 19836, 19654, 21139, 17270, 23097, 30129, 27456, 31115, 34942, 33094, 27492, 22775, 21219, 21307, 14550, 15801, 19674, 21233, 22723, 27411, 26776, 25114, 23009, 20657, 19168, 20881, 19468, 14878, 18311, 21901, 18932, 11428, 16248, 16913, 19534, 14187, 19887, 22574, 19600, 11921, 9553, 12360, 13004, 17690, 17462, 13699, 16668, 26462, 28500, 26078, 20852, 21764, 22104, 16402, 13501, 12370, 16621, 17915, 16017, 13604, 15810, 19472, 16994, 9890, 7948, 9793, 7492, 12738, 14049, 12652, 16389, 22545, 24945, 20848, 20055, 18758, 19084, 20361, 21611, 29488, 30166, 25150, 15717, 12758, 8480, 9171, 19620, 21874, 17927, 19980, 26111, 27109, 24128, 23387, 22821, 26619, 26206, 21171, 22129, 24058, 25703, 25963, 20953, 21742, 24876]
12034B4876M041j573j440Q86L061N174j202r394Q78Q822J238j535n92m300K710
12019C1650J37R65n914K062Q983n39o434k929l304l071K346J0378N850Q64o413
12004C4631j547n22n541k103j748n944K056N759L542K377L166m355R25n801j911
11989B2984r94K201j200M155O361m194N949k120J016K81m858J040m597k402O582
11974C0204R114p039p663n718l830J826P827L002L103m980K60o00N50K14L562
11959B9832J364n267r565L00L688M920O190pk838L228k022p280m697M046K023
11944B3915J142M83j105m969O229N89L565M290p984n120L488L736k875L63K339
11929B8086L748l419O611M775J096M322k647m723m253n340j13K523l566j147O536
$$ y = [24876, 28917, 27344, 25904, 26790, 29851, 35025, 33823, 24429, 25307, 34129, 35367, 33832, 33240, 28940, 31650, 31787, 32752, 26838, 28900, 37883, 37344, 30910, 27981, 24677, 21606, 23952, 34330, 40180, 41044, 34631, 33084, 32562, 27021, 24918, 23170, 17226, 19282, 25041, 28583, 30960, 34126, 29771, 30696, 24895, 22984, 21990, 24191, 22991, 27146, 33507, 29313, 35262, 33142, 34158, 34439, 29581, 30621, 26024, 23622, 30204, 39318, 32279, 24616, 18898, 15068, 16894, 24721, 27723, 30826, 25846, 26106, 25506, 26056, 26270, 29832, 31196, 25929, 16364, 16664, 20352, 25272, 31462, 31455, 28617, 31845, 29823, 22543, 17846, 21892, 23915, 25057, 25540, 24435, 19466, 25695, 26284, 29849, 34139, 26155, 21035, 24523, 28259, 25384, 25747, 28086, 31834, 28415, 35026, 39801, 40897, 45219, 42572, 37849, 33596, 28256, 28143, 30666, 27100, 25953, 32489]
11914C2489L107j576j309m74J385M606J882j3432j498P185R84o087j273L875L298
11899C3162O70R05L939n649k537k42o618K926N230N158l586q907l358M029J758
11884B6880j152P989O449q144l962J130K140n555l587J0934J572k710q85p54L95
11869C0740k301j357K845J325L210r128j838Q864L631n070K385J706k545Q6N348
11854C7901L177o580n847j0179M399K514o378K995O945L224J501O405n34n536
11840C4007m300p614M884N196M053L491o602o686m499r5K193l764n776q59O283
11825A9912O913N249K797K668o059p283J79p41k655k788J084P357N827J199m358
11810B9301K58o924J510l614j317J050M133R09K426j179K040l877l959j813K507
$$ y = [32489, 35596, 34020, 32711, 32237, 33622, 38228, 40110, 26678, 25180, 32365, 33349, 27262, 25989, 29864, 33162, 33832, 34737, 38676, 33027, 30490, 30248, 23630, 26556, 31786, 36944, 33358, 24451, 21093, 25122, 26880, 25728, 33717, 40166, 32022, 28060, 29190, 31330, 25775, 22188, 33122, 34694, 31984, 31099, 30345, 30740, 28439, 27082, 29927, 31252, 34462, 25334, 23496, 32360, 35991, 30921, 33306, 35012, 32467, 32553, 37901, 41078, 34498, 28651, 18472, 22871, 25385, 19007, 22002, 28947, 32171, 33672, 40077, 39543, 34007, 29707, 22093, 26977, 32173, 36226, 39717, 33115, 26429, 21930, 21835, 24028, 20264, 14488, 13629, 19912, 26825, 32074, 34871, 37539, 31480, 24197, 24376, 23635, 20980, 18192, 19276, 26633, 32460, 33659, 29301, 29559, 22635, 24145, 20531, 19214, 20264, 24397, 25306, 27732, 26553, 28593, 24716, 20757, 18944, 21451]
11795B1451N609M90m491M146K945M718P077l039l708n502P511M226k395q544J893
11780C2387K555o616q57l481o570L313Q896p30O42L156L928p92j897M198O55o379
11764C2408K0m325q65L221Q470O003M192j1181m294j091k982K580Q686m520n678
11749C0644k443O748L130R50L522L565m706p381p218l779J507K364L701O726k412
11734C4918q304K228L238L547O340K937n397p531K37R92l48L007L47J087j633
11719C5665n435J572j143j100J790l313O87j922O659J234M034N643J086O928J654
11704E4039l142m399n700R58J06l447l911O238J0885l505o866k513K467J42O46
11689D1998j037j0622j090J1667M666k782m051k967j709m756M285L259O035k285
$$ y = [21451, 27060, 27550, 23059, 27205, 30150, 34868, 41945, 38906, 35198, 29696, 37207, 41433, 39038, 30494, 32387, 34942, 28326, 27469, 23988, 17418, 20731, 29627, 28897, 29539, 32695, 36623, 35831, 33934, 38132, 38787, 32408, 32428, 28103, 27238, 30459, 38929, 44932, 49124, 37943, 33649, 32558, 29576, 32156, 40842, 36322, 30644, 28201, 34949, 38079, 39029, 42551, 46116, 41410, 34029, 26811, 23032, 24539, 26903, 30604, 37330, 34918, 26614, 28842, 32080, 35627, 41967, 44904, 39507, 31976, 32213, 33205, 32857, 35864, 36211, 37298, 35665, 30230, 31802, 30659, 29559, 31349, 28036, 28723, 26801, 33460, 34694, 38728, 44371, 45457, 52385, 54039, 50897, 46498, 40798, 41756, 41862, 38415, 34504, 40742, 51627, 48122, 41256, 38743, 41210, 41352, 41998, 40961, 30339, 29249, 40916, 45582, 42800, 38749, 35782, 34073, 29317, 33602, 36861, 42896, 40611]
11675D0611k193l674l780n269L62K277L695k49L19J0918j67Q87J299j174M478
11660D8340N32k575n201N466L965j313k035Q32P94l474l831m740Q14K984L352
11645D3910K724o482N906O36K643l08j3k374n657o671K28P472L027N969K088M715
11629E7813P46n622l949L333J263L173j572q348j762K655j14l364l93N175K835
11614E1869l964o41l185L741L253M212N084O025M528K700J72j01M950L962L669
11599H6274J036j08O864J0176J6131N959K066R210P491J8970K2018J6306J2113
11586B14506J1176K2417L0537K6087K0743M0572M5308N0892Q0323R3183J12878
11575G48622J39338J66786K06670K40640K72979K74020K27171R0090j10366k91930
$$ y = [40611, 38418, 34744, 30964, 25695, 26057, 28334, 32029, 31780, 32099, 43017, 42850, 43737, 45036, 43862, 48340, 48872, 46297, 41096, 46562, 50527, 49214, 47179, 48011, 48805, 45331, 41500, 36760, 37574, 40558, 43910, 46634, 40152, 46058, 46694, 49337, 49029, 49016, 46642, 40985, 34314, 34542, 42014, 45041, 51010, 53098, 57813, 58559, 52937, 48988, 52321, 53584, 56757, 55185, 46837, 45075, 47730, 47616, 44252, 43859, 49034, 51869, 47905, 47264, 44079, 47820, 51073, 55285, 60369, 66394, 70922, 73622, 73794, 73693, 78643, 82605, 86274, 87310, 87202, 94066, 104242, 120373, 126332, 128398, 137608, 145099, 164069, 186087, 202393, 214506, 225682, 248099, 278636, 304723, 325466, 366038, 411346, 462238, 542561, 635744, 748622, 887960, 1054746, 1261416, 1502056, 1775035, 2049055, 2276226, 2366316, 2255950, 1964020]
11565A964020l62641l25937k47038j84910j31151q9216o9952n4520l4986k9323
11555D34346l6612l0070k0106j8626j4323j8774q013p85n890m774o280m278j8595
11542B47220j1789p710j8829j3562p907p512j1632k735r059o931k36m315k516
11529A42487o028j0939m253j2719m613j815R00m568q21k610K104K548k645o343
11515I0685l765j60L030L90m464m484K851l970m350n100j641J79k775L251L721
11500G3398j938n5j567M922L523j741n371k323n629l12N162K380j527J601n04
11485G0019q75j799O835j508k428j160p45M139J380j149o085M43N129K268k54
11470G4210L558k7L119J148q460k913j475j719M230O592J184k128p51L04O346
$$ y = [1964020, 1601379, 1275442, 1028404, 843494, 712343, 623127, 553175, 498655, 463669, 434346, 397734, 367664, 347558, 328932, 314609, 295835, 287822, 287037, 281147, 276373, 270093, 265815, 247220, 235431, 227721, 208892, 195330, 187423, 179911, 168279, 165544, 156485, 149554, 149318, 145003, 142487, 136459, 125520, 121267, 108548, 103935, 102120, 103020, 98452, 97631, 95021, 97125, 99673, 97028, 90685, 86920, 86760, 89790, 90180, 85716, 81232, 84083, 80113, 75763, 70663, 69022, 69201, 66426, 69677, 73398, 71460, 71405, 69838, 74760, 78283, 76542, 71171, 68848, 63219, 62907, 68069, 70449, 68922, 70523, 70019, 69144, 67345, 74180, 72672, 70244, 69084, 68339, 72478, 73858, 72709, 66624, 67067, 72196, 74464, 74210, 77768, 77741, 80860, 82008, 73548, 70635, 69160, 67441, 71671, 78263, 79447, 77319, 76568, 76872, 83218]
11455H3218K681O798P412O54N095k168K126P007M276M58K639J0430J0394J6482
11441A57502K6311J5252J0248Q046J4151J9998J9496J6053K4335L1348L3561M5573
11429D21874O0725P1043Q5719R6333J12391J47269J85268K23689K61471K74311
11419A940093K55656J61678q163k18344l54584l65104k92375k10633j55127j11714
11409F41383p7050o1081m8028l0107k9612l2362k5243k1887j6786j2963n061j0435
11397B70768j6076p319k133l512j938p460r033j3726r343j5749j4745j860j561
11384A66313n299j0739j0039n404p723r005n632n758J568O91P14m517j2699r135
11370H3336J79j543j626J440r48n691j058J826J595l022K69m983j52J300J637
$$ y = [83218, 85899, 92697, 100109, 100763, 105858, 103690, 105816, 112823, 117099, 117557, 120196, 130626, 141020, 157502, 183813, 199065, 209313, 217359, 231510, 251508, 271004, 287057, 311392, 342740, 376301, 421874, 482599, 553642, 639361, 735694, 848085, 995354, 1180622, 1404311, 1665782, 1940093, 2195749, 2357427, 2349264, 2130920, 1776336, 1411232, 1118857, 908224, 753097, 641383, 564333, 503252, 455224, 425117, 395505, 363143, 337900, 316013, 299227, 286264, 281203, 270768, 254692, 247373, 245240, 241728, 239790, 232330, 223297, 209571, 200228, 184479, 169734, 167874, 166313, 161014, 150275, 140236, 134832, 127109, 118104, 112472, 106714, 108282, 108973, 109687, 105170, 92471, 83336, 83515, 81972, 80346, 81786, 80838, 75147, 74089, 75915, 77510, 74488, 74757, 69774, 69622, 70922, 72559]
11355G2559j179q689l13J42K648n174K271j494m422l531R789R624k660l871n158
11340F0542p44o4O069M919Q76J095J337o106m222P550l669r663j678k879K474
11325E5837P607N839P593k297r366p740j132j037K269J497l247m763n544L88M035
11310D9939N32K551N723J075o736j998P842N590M057J186o916r44M538j764o80
11295F3995J568l163n244L907P091k640j285K852K857r0J118m776L002N745L99
11280G5336j398J596J1099R113J2968O159M965J1302L1344K4903K2570K9948J6894
11267B56799j077l0263l9727l3279k7125j4739j6420j637j572m927l707o254M76
11254G6548m418j713k994n024j187K862k954L061j849k15Q392M629j092q52l204
$$ y = [72559, 71380, 62691, 62378, 62520, 65168, 59994, 62265, 60771, 56349, 52818, 62607, 72231, 69571, 65700, 60542, 59798, 59734, 65803, 70722, 71598, 72693, 74030, 67924, 63702, 71252, 67583, 57920, 56242, 53363, 55837, 63444, 69283, 76876, 74579, 65213, 57473, 56341, 55304, 57573, 59070, 55823, 51060, 45516, 45904, 49939, 50471, 53022, 58745, 59820, 53084, 51086, 58928, 64518, 68575, 69761, 62845, 61901, 66439, 64675, 63995, 65563, 62400, 57156, 61063, 68154, 65514, 64229, 67081, 69938, 69848, 70966, 66190, 69192, 74937, 75336, 73938, 75534, 86633, 95746, 108714, 114873, 119838, 131140, 162484, 187387, 209957, 239905, 256799, 255722, 225459, 185732, 152453, 125328, 110589, 94169, 92532, 90960, 86033, 82326, 76072, 76548, 72130, 70417, 67423, 62399, 61212, 64074, 61120, 64181, 62332, 62117, 70509, 75138, 74046, 73194, 69990]
11239F9990n417O6O80J487L726L340l498o658k099P176N527l084L09k955K427
11224G1017q725L642P815J17m455o293l572k153l174N764K336Q53R080J793j870
11209G2175L128N888M640M963r20K869K378J0879Q454J0263J4673O663J6228K8732
11195A91013K9939K5574K0439n971l8248m9256l0028k1303j3216n101p633j639
11183I4570k315n985o429J145k687K90n098l413J618j990q939k486O819J0396
11169G5496j229k512K658m129J451O613Q467o750r678k536l528k53J035J62K85
11154F5552L216J486n48K773j285K171K648M8n394o854J551P161M105p333o385
11139F2912J094l99K778L299l155r087k041L910N854R22j474J660L814L657M310
$$ y = [69990, 64573, 64639, 65319, 66806, 70532, 73872, 70374, 63716, 61617, 68793, 74320, 71236, 71545, 68590, 71017, 62292, 65934, 73749, 73866, 69411, 63118, 59546, 57393, 54219, 59983, 62319, 63172, 72252, 74045, 72175, 75303, 81191, 85831, 90794, 89874, 92743, 95121, 106000, 114454, 124717, 139390, 146053, 162281, 191013, 220952, 246526, 266965, 260994, 222746, 173490, 143462, 122159, 108943, 103842, 96209, 94570, 92255, 86270, 79841, 80986, 78299, 78589, 73491, 70078, 71696, 69706, 60767, 58281, 65100, 75496, 74267, 71755, 74413, 70284, 71735, 78348, 86815, 80065, 70387, 67851, 64323, 64070, 65105, 65267, 65552, 68768, 70254, 69706, 72479, 71194, 73365, 76013, 76061, 70667, 63813, 65364, 72525, 76630, 69297, 62912, 64006, 63607, 66385, 69684, 66529, 57442, 55401, 59311, 65165, 66087, 64613, 66273, 70087, 73744, 78054]
11124G8054p84q56R01M75M0M533l021j975l517K330o718q35L626O509m620k944
11108G1198J340j154l492j356J412l812K709N668l95M48K395M495N785R93o339
11093G9895m847p536Q24j257kj109J22n325M190M166l720j383J793l454M2m25
11077F1974j008N568K451J763k476j493p17K120k107L737L601p788n732p431L899
11062E6361L920K627P869K403N293M177N67n118K11l433j405N537j041k887J476
11047G6557K423k44N497j290j434K914J286L951j954j811j854r133r845j214M267
11032F8116N58P56M052n834m439K793Q032j832m268L065L825k849k864L331p75
11017G1667l524O974J466K725P408M364l280j766j0283k126L434M173m261m487
$$ y = [78054, 77270, 76414, 77315, 77790, 77830, 82363, 79342, 77367, 73850, 76180, 69462, 68627, 72253, 78762, 74142, 71198, 72538, 71384, 67892, 66536, 67948, 64136, 66845, 72513, 72118, 72566, 74961, 79456, 85241, 86234, 79895, 75048, 67512, 68336, 67079, 67077, 65968, 66090, 60765, 64955, 69121, 65401, 64018, 65811, 62357, 62399, 61974, 60966, 66534, 68985, 70748, 68272, 66779, 66062, 68182, 66075, 69812, 73413, 65625, 59893, 52462, 56361, 60281, 62908, 70777, 73180, 78473, 82650, 83217, 78099, 78310, 74877, 73472, 79009, 77968, 75081, 76557, 78980, 78736, 84233, 82943, 81509, 84423, 85709, 89660, 87706, 85895, 84041, 74908, 65063, 63849, 68116, 68674, 69430, 73482, 67648, 63209, 66002, 74034, 72202, 67934, 70999, 74824, 71975, 69111, 72442, 71667, 68143, 75117, 76583, 79308, 86716, 91080, 87800, 86034, 75751, 73625, 77059, 81232, 76971, 72484]
11003G2484J803K851L08l76j434m661n975M242O255o496J246M154K375p34j759
10988G4283r03n66J536q40j008J2134N602n72m087l450j243K454N86O660k84n085
10972H5217J562O386O732k866n099q281J506L681M32o22k780M82J831O883J103
10957I6167J602j363j472M126j773K966n15q740j201M463L322m026j0545j770
10943H1241L466o14L704l237K844P931R502l861k280j341m8k554n639R89l855
10928H6248p161J99J735N550K735j59J891K776o461m328O636O258K208j703Q28
10913I7252L747j614m935K823K249q279l324P025L121m526k211k607J723k245
10899H8199j3009n410p225J359J1142L901N727N118N140M621P324j032p763m628
$$ y = [72484, 74287, 77138, 77446, 77070, 75636, 70975, 65000, 69242, 75497, 69001, 70247, 74401, 76776, 76042, 74283, 73380, 72814, 74350, 73510, 72502, 84636, 90238, 89666, 85579, 82129, 80886, 83340, 83926, 90586, 90302, 85217, 86779, 93165, 99897, 97031, 91932, 83651, 85157, 88838, 89270, 88648, 85868, 86350, 88181, 95064, 96167, 97769, 96406, 94934, 99060, 97287, 100253, 99738, 90998, 89797, 94260, 97582, 93556, 83011, 81241, 84707, 84093, 87797, 84560, 87404, 95335, 104837, 100976, 98696, 97355, 97307, 94753, 89114, 90103, 86248, 79087, 79286, 81021, 86571, 89306, 89147, 91038, 93814, 87353, 83025, 89661, 95919, 98127, 96424, 97252, 100999, 99385, 94450, 97273, 99522, 91243, 87919, 94944, 98065, 93539, 91328, 88721, 90444, 88199, 75190, 69780, 62555, 63914, 75056, 78957, 84684, 89802, 94942, 99563, 106887, 105855, 98092, 93464]
10885I3464k925P909K248j3268l296k072K033J0266O593L146n137Q74M992q8m340
10870A00399R6M959n6K721J2m599M759N599K116L606l490N21K655L196o850r694
10854A05950l058q37l735L03M982O379K895k587P40P291o7r387K081n92L18J892
10838A12568O105N426L770L922l993l249J126m067m807q202L558N030J883k205
10824A16865M653p78p084M563L260P157l02l953l823K7K235K733k754R80Q910
10809A32689m697p236M167l9o516M781J117Q257l511l933o900J70Q632k684l01
10794A23996K213O496N4p960q626k143L874J2R07m250o74J57j790o29J0093O368
10778A28098q0J0621J9173J0510m62M137O083j676j2924n988J886k156n990m656
$$ y = [93464, 90539, 98448, 100696, 87428, 84132, 82060, 84093, 94359, 100952, 104098, 98961, 99835, 104827, 104739, 100399, 100495, 105454, 105398, 108119, 108131, 103532, 108291, 113890, 116006, 119612, 116122, 116643, 119298, 122494, 115644, 105950, 102892, 102055, 98320, 98623, 103605, 109984, 112879, 110292, 111032, 118323, 118256, 108869, 110950, 110358, 110676, 112568, 118673, 124099, 127869, 131791, 127798, 124549, 125675, 121608, 116801, 108599, 112157, 117187, 119070, 116865, 121518, 120740, 113656, 118219, 121479, 128636, 128334, 124381, 120558, 120585, 122820, 125553, 122799, 123779, 132689, 127992, 120756, 124923, 124884, 118368, 123149, 124266, 132523, 129012, 125079, 118179, 118349, 126981, 124297, 123996, 126209, 132705, 132759, 124799, 116173, 114030, 117904, 117916, 118823, 114573, 113899, 114056, 112266, 111637, 121730, 128098, 128018, 138639, 157812, 168322, 167860, 171997, 178080, 176404, 163480, 157492, 159378, 157222, 151232, 146576]
10764A46576j90k526K895M423M594L074j227L019K053M14l14P661J5659J0887
10750A96998P988m797J304N390K348q18L637J4827R085J4476J3032R911J0778
10737B84159M408J0234K4876K2254J1531K0413L9812M3573N8407P7240J02344
10726F99251J28823J74679K21856K85485L54596M29090M61126L74619J12773k81001
10716B961297n66650o17462m81489l08074j93543j12284o7834n1668m5897l7025
10706D79371k5500k7078k0460r071n764k186j105p973q375L180q63l566m046k049
10692C64515J21j585o906j3145n459j0867k0511j6346n947m217j0225m373j0091
10679B54964k290j112n592j732N61J043m726j518J156r892o839q584l382O978
$$ y = [146576, 146386, 143860, 146755, 151178, 155772, 158846, 157619, 160638, 162691, 163105, 162791, 170452, 186111, 196998, 204986, 200189, 201493, 206883, 209231, 208413, 212050, 226877, 235962, 250438, 263470, 273381, 284159, 288567, 298801, 323677, 345931, 357462, 377875, 417687, 461260, 519667, 596907, 699251, 828074, 1002753, 1224609, 1510094, 1864690, 2293780, 2754906, 3129525, 3242298, 2961297, 2394647, 1777185, 1295696, 987622, 794079, 681795, 613961, 562293, 516396, 479371, 453871, 426793, 406333, 397262, 391498, 389312, 388207, 380234, 371859, 375039, 374176, 370610, 366564, 364515, 364636, 363051, 356145, 343000, 337541, 326674, 306163, 289817, 283870, 279653, 269428, 265055, 254964, 252674, 251562, 245970, 244238, 244799, 245842, 241116, 239598, 240754, 230862, 224023, 215439, 212057, 219035]
10665B19035p5l755M062J004k167m601J439j794J994j637l783q288j4011m618
10651A82805K000l432n895n929Q471L891R311M86J168K87M178N035L279O494J2346
10636B24495Q237k717J372R010L230P836Q465J0108J3191L995l146p476n520l241
10622B67839p473l491j438o426j1560l425N890m604j871L343L53p285K035MN716
10607B37607J4909K429q582j1514p825q171J0474K4074K3850J8619J1961O967
10595C14798K333N249R914K7499K7462J8736J7884Q033J1314K0400K2616K7713
10583E13951L1507L6732N6986O9412Q4827J08089J46509J83529K26220K86387
10573A744149L67162M45065M45437L02854j7649l84373n95242n67399l98275k33753
$$ y = [219035, 218960, 215205, 219267, 220271, 218104, 213503, 214942, 213148, 215142, 213505, 209722, 201434, 187423, 182805, 184805, 181373, 175478, 169549, 178020, 181911, 191222, 191708, 192876, 193163, 197341, 202376, 205655, 212149, 224495, 232732, 230015, 231387, 240397, 243627, 251463, 259928, 270036, 283227, 287222, 284076, 276600, 271080, 267839, 260366, 256875, 255437, 249011, 237451, 234026, 239916, 235312, 233441, 236784, 237137, 229852, 231887, 231891, 237607, 252516, 254945, 246363, 234849, 227024, 218853, 229327, 253401, 277251, 295870, 307831, 314798, 317131, 322380, 332294, 359793, 387255, 405991, 423875, 431908, 443222, 463622, 486238, 513951, 545458, 582190, 639176, 708588, 793415, 901504, 1048013, 1231542, 1457762, 1744149, 2111311, 2556376, 3001813, 3304667, 3287018, 2902645, 2307403, 1740004, 1341729, 1107976]
10563A107976j21743p1635n9662o4092o2079m7912k5617j8136k4051l8979l9520
10552E34550l2229j3763j0425m754K819K211Q280k118j1444l909o641j2814j1939
10539D37824j0720j0620l080p794j067J3213J2908P054K3m483j774j253j4200
10526D16031j7002j3623n805l02M311M901J178n22j2115j4320o101j1225k4567
10513C20839j1190O253J1715J9882K8697K9635K6546J6106J265j2724j3653k0002
10501D03369j9734P85J1622J9132J7027J0328Q128J0848Q262L942N634J1741K0699
10488E11783J6163m167m700n057j1217p273K808Q292k855m065J313J662j500N572
10474E06759J1950J1951J3033P313N49r983j1824k274m668j0725j1500n354J033
$$ y = [1107976, 986233, 914598, 854936, 790844, 728765, 680853, 655236, 637100, 613049, 574070, 534550, 502321, 488558, 478133, 473379, 476198, 478409, 486689, 484571, 473127, 469218, 462577, 449763, 437824, 427104, 416484, 413404, 405610, 404543, 417756, 430664, 437718, 437741, 433258, 431484, 430231, 416031, 399029, 385406, 379601, 379299, 383610, 388511, 389689, 389167, 377052, 362732, 356631, 345406, 320839, 309649, 315902, 327617, 347499, 376196, 405831, 432377, 448483, 449748, 437024, 423371, 403369, 383635, 384420, 396042, 415174, 432201, 442529, 450657, 461505, 469767, 473709, 479343, 491084, 511783, 527946, 523779, 519079, 514022, 502805, 495532, 498340, 506632, 503777, 499712, 501025, 502687, 501187, 506759, 518709, 530660, 543693, 551006, 551555, 541572, 529748, 527474, 522806, 512081, 500581, 495227, 496260]
10461D96260O269J8018K8804M7033N6891M8676M0920K9280J1064j470N068L2988
10449H19801N7208O1626P6714P5362P6859Q1117Q7135R9373R9907Q7610O1761
10438A684473K7086J3137J5525L1163L3022j7680r8903j56234j70473j43337j04240
10427A113539p1373m5987l7359k9768j9658j0753n833L892J8678K9963L4517L4592
10415A014450J8940Q188K482P03J3245K5790K6195O499p319N859K0231L2787M5684
10402A213734L4717K4469J0186J1624M034M257J735J42N422k516k919L776k139
10389A306522J4797M1387N0409N8194N6103N1682L4937L5768L4282L9482M8288
10378A771851N1996M9724M5607M4110M2959L8782L5768L1926J7174J2884J3772
$$ y = [496260, 502529, 520547, 549351, 596384, 653275, 701951, 742871, 772151, 783215, 781745, 786813, 819801, 877009, 938635, 1015349, 1090711, 1167570, 1248687, 1335822, 1435195, 1535102, 1622712, 1684473, 1711559, 1724696, 1740221, 1771384, 1804406, 1786726, 1687823, 1531589, 1361116, 1217779, 1113539, 1042166, 996179, 958820, 929052, 909394, 898641, 892808, 896700, 915378, 945341, 979858, 1014450, 1033390, 1041578, 1044060, 1044763, 1058008, 1083798, 1109993, 1116492, 1109173, 1115032, 1135263, 1168050, 1213734, 1248451, 1272920, 1283106, 1294730, 1298764, 1303021, 1304756, 1304898, 1310320, 1307804, 1304885, 1308661, 1306522, 1321319, 1362706, 1413115, 1471309, 1527412, 1579094, 1614031, 1649799, 1684081, 1723563, 1771851, 1823847, 1873571, 1919178, 1963288, 2006247, 2045029, 2080797, 2112723, 2129897, 2142781, 2156553]
10367B156553K4395L4882M9868O8749Q1927Q7954R7789P4340N3970L0174K4124
10356B784725M1828O7967R4841J07835J22470J23170J28589J18339J20977J63856
10346C874597K12475K72727L37532L97333M53305N04767N65198O44069P44249
10337H006252Q92509J098037J400251J812997K330034K839518L141501L037859
10329B4558958K553567J987506J699351J878998K457097L276225M264533N460498
10321D8136733O921449Q722063J1022538J4008992J7982478K3334802L0207007
10314A60336062L8458698M8070548N9181345O9976555P3938529O0093770K1174539
10307E31230046l6064079q4027940j03410527q7561469n9081583l6194073k2548297
$$ y = [2156553, 2180948, 2215830, 2265698, 2334447, 2416374, 2504328, 2602117, 2676457, 2730427, 2760601, 2784725, 2826553, 2894520, 2989361, 3097196, 3219666, 3342836, 3471425, 3589764, 3710741, 3874597, 4087072, 4359799, 4697331, 5094664, 5547969, 6052736, 6617934, 7262003, 8006252, 8898761, 9996798, 11397049, 13210046, 15540080, 18379598, 21521099, 24558958, 27112525, 29100031, 30799382, 32678380, 35135477, 38411702, 42676235, 48136733, 55058182, 63780245, 74802783, 88811775, 106794253, 130129055, 160336062, 198794760, 246865308, 306046653, 376023208, 449961737, 510055507, 531230046, 495165967, 411138027, 307727500, 220166031, 161084448, 124890375, 102342078]
10300A02342078j4721919j0128195p405529n807859m785532l980951l262500k628063
10292D9621530k101995j643960j227583q04092m04833o7900K8505l14391j131804
10283D1953477k163924k910332l148511k967457k609002k244652j922105j664533
10275B2322961j463891j300469j176928j076285j001754r49624r26105q99407
10267A3528498q57675p95226p17118o47984n88856n31889m91798m64221m29598
10258H004133m03745l80154l54062l18191k91268k72808k64879k59228k53365
10249E206433k39117k21331j98614j84543j82678j84950j64894j36724r9716o7919
10239C525947o3859n2529m8387l9859l9768m0645l8015l6563k6474k0428k3080
$$ y = [102342078, 87620159, 77491964, 70086435, 64278576, 59493044, 55512093, 52249593, 49621530, 47519535, 45875575, 44647992, 43843900, 43439067, 43371167, 43399672, 43085281, 41953477, 39789553, 36879221, 33730710, 30763253, 28154251, 25909599, 23987494, 22322961, 20859070, 19558601, 18381673, 17305388, 16303634, 15354010, 14427905, 13528498, 12670823, 11875597, 11158479, 10510495, 9921639, 9389750, 8897952, 8433731, 8004133, 7600388, 7220234, 6866172, 6547981, 6256713, 5983905, 5719026, 5459798, 5206433, 4967316, 4745985, 4547371, 4362828, 4180150, 3995200, 3830306, 3693582, 3593866, 3525947, 3462088, 3409559, 3361172, 3321313, 3281545, 3240900, 3202885, 3166322, 3139848, 3119420, 3096340]
10228C096340k9490m2093n4694o6025o7630n4161m2222l3956k7842k7420j9487
10217B631320l009R849K3229K0703K0204K8326K7224K6114L2905N1389P8358R2225
10205C038837R2392R4888Q0778O3728Q5249J32288J99580K72149L46005M06202
10195D812096M64458N32433N90091O69138P76181R24829J144743J476294J930340
10186A3320603K463487K937697L185146L077529K638095K065417J720801J824781
10178C3233556K436702L387108M533291N868268P466689R443473J1910938J5089066
10170I3369091J9348297K5110319L2416560M1161729N1464297O3059216P2693052
10163C98622561P1501494M8996512J609320n4955011r3978140r9285946p6709367
$$ y = [3096340, 3066850, 3024757, 2970063, 2904038, 2836408, 2782247, 2740025, 2706069, 2678227, 2650807, 2631320, 2628311, 2638160, 2661389, 2682092, 2702296, 2730622, 2757846, 2783960, 2816865, 2868254, 2946612, 3038837, 3131229, 3226117, 3306895, 3370623, 3455872, 3588160, 3787740, 4059889, 4405894, 4812096, 5276554, 5808987, 6399078, 7068216, 7844397, 8769226, 9913969, 11390263, 13320603, 15784090, 18721787, 21906933, 24984462, 27622557, 29687974, 31408775, 33233556, 35670258, 39057366, 43590657, 49458925, 56925614, 66369087, 78280025, 93369091, 112717388, 137827707, 170244267, 211405996, 262870293, 325929509, 398622561, 470124055, 519120567, 520729887, 465774876, 371796736, 272510790, 195801423]
10156A95801423m9329666l0118657j9039292j2731665r102176p064774n921545
10149F2493648n106009m331384l526136k810905k177513j586705j041311n50113
10141D1363572j12462J84443J15473n25391j469050k305443k684989k677075k481812
10132B9407266k238387j995324j769828j574743j418237j298044j184553j091497
10124A6836653j022905r75282r31924q86462q31782p54532o76926o01210n56141
10115I599489n26584n02501m82748m65538m40758m08808l59739l00419k57013
10106E855381k33576k28757k39653k36336k18883j97473j76168j55920j35690
10097D032925j20283j20326j31455j47528j65406j76706j63079j42331j25031
$$ y = [195801423, 146471757, 116353100, 97313808, 84582143, 75479967, 68415193, 62493648, 57387639, 53056255, 49530119, 46719214, 44541701, 42954996, 41913685, 41363572, 41251110, 41435553, 41551026, 41025635, 39556585, 37251142, 34566153, 31889078, 29407266, 27168879, 25173555, 23403727, 21828984, 20410747, 19112703, 17928150, 16836653, 15813748, 14838466, 13906542, 13020080, 12188298, 11433766, 10756840, 10155630, 9599489, 9072905, 8570404, 8087656, 7622118, 7181360, 6772552, 6412813, 6112394, 5855381, 5621805, 5393048, 5153395, 4917059, 4698176, 4500703, 4324535, 4168615, 4032925, 3912642, 3792316, 3660861, 3513333, 3347927, 3171221, 3008142, 2865811, 2740780]
10088B740780j07237j07598j11446j00256q7760p1585n7252o3084p8082q3510
10078A872970q9837q2032p0877n6367n2113m6709l4907k2053j7387n273j4327
10067A381088l5034n5157p3749p1463o2201n3315m8155l3654j6112j3048j2211
10056I06989k4584l1111k8483l2832j5727Q30P749K3314K0042K1740J6641J5637
10044H80205K7439K8510J8543K0750K2052J2983p526l6708n3222m3826l0818m8581
10032G89801n8359o3792o0010m8098l3617l9742l7311k7522k3396j7680j0670
10021C69604j2842j5920j1988K711K0055J8506J4009R087K494J944L416J7959
10009D19035M3244M9733K3041P780n98l021k5543l7526k6707j0792p84Q340O066
$$ y = [2740780, 2633543, 2525945, 2414499, 2314243, 2226483, 2154898, 2097646, 2034562, 1956480, 1872970, 1783133, 1701101, 1630224, 1573857, 1521744, 1475035, 1440128, 1418075, 1400688, 1395415, 1381088, 1346054, 1290897, 1217148, 1145685, 1083484, 1030169, 982014, 948360, 932248, 919200, 906989, 882405, 851294, 822811, 789979, 774252, 775082, 782831, 806145, 826187, 847927, 864568, 880205, 907644, 936154, 954697, 975447, 997499, 1010482, 1002956, 966248, 913026, 869200, 838382, 789801, 731442, 667650, 607640, 559542, 525925, 486183, 448872, 421350, 397954, 380274, 369604, 356762, 340842, 328854, 331565, 351620, 370126, 384135, 393222, 395716, 397660, 401076, 419035, 462279, 512012, 535053, 542833, 542235, 539214, 513671, 476145, 449438, 438646, 437862, 446202, 452268]
9996D52268J0312J0571Q965L074n541j1815p579n011o620k051n292j6284l830
9983D21167j6911j7577M199J1401P190O659k346l042q634j2325J682P322M881
9970D03666M674q562j0384k5591l0335j8064r853k801J1169K1380J5480J7621
9958C68400O484m209j5539k1648l0936k7615k0524j6804J872l24j0902n103q052
9945B15100j3517j7733j6262q697n611l011n9m251j23J1255J8681P801l219n280
9931A75074R1k116p421j3581l682l812l944M043N549M746J141M808P498O069J889
9916A76352J2372K3258J4288J0456J2195J4808K2091J9768J0389J0405K4934L5363
9904C86679L4665N0544P0258R8574J28787J61401K20107K80870L52262M21834
$$ y = [452268, 462580, 473151, 482116, 485190, 479649, 467834, 460255, 455244, 448624, 446573, 441281, 424997, 421167, 404256, 386679, 390878, 402279, 409469, 416128, 413782, 410740, 402106, 389781, 391463, 398785, 403666, 408340, 399778, 389394, 363803, 333468, 315404, 305551, 302750, 313919, 335299, 350779, 368400, 374884, 370675, 355136, 333488, 302552, 274937, 254413, 237609, 239481, 239157, 228255, 223152, 215100, 201583, 183850, 167588, 158891, 153280, 150269, 150210, 145959, 145836, 157091, 175772, 183573, 180354, 175074, 175165, 173049, 165628, 152047, 148365, 144553, 140609, 144652, 150201, 154947, 156088, 160896, 168394, 174463, 176352, 188724, 211982, 226270, 236726, 248921, 263729, 285820, 305588, 315977, 326382, 351316, 386679, 421344, 471888, 542146, 640720, 769507, 930908, 1151015, 1431885, 1784147, 2205981]
9894B205981M61197L85924J25314k58156n49075o21093m93462l22916j98110j25428
9884F10176q5975o3700m7390k9562k2365k0806p684j0793r752n245o506p283r772
9871B83343o883p815M032K076O96p098o194m861j4757j9415k3426q221M9n698
9857A85828r015q033q392n274k163o895r916j1785j0237j949n299p620k676k695
9843I3879m880J0471J4223l284j559Q003q102j1784o690n350o65N206O975M909
9829A01352L122P866N321m308j739J895q78l541k034n109j422r880m567q15l566
9814H1697l016n99q437m418k751k624k242o956j414k000L218J257p450j0078l203
9799C0984J138l799l379L625n89m954p719L5J0630J1000k44r787q31q77j446J133
$$ y = [2205981, 2667178, 3053102, 3178416, 2920260, 2371185, 1750092, 1256630, 933714, 735604, 610176, 524201, 460501, 413111, 383549, 361184, 340378, 332694, 321901, 312149, 306904, 300398, 293115, 283343, 276460, 268645, 272677, 274753, 275449, 268351, 262157, 257296, 242539, 223124, 199698, 191477, 191526, 185828, 176813, 168780, 160388, 155114, 152951, 146056, 136140, 124355, 114118, 112169, 106870, 99250, 96574, 93879, 88999, 99470, 113693, 110409, 108850, 116853, 108751, 96967, 90277, 84927, 84262, 89468, 96443, 101352, 104474, 112340, 117661, 113353, 111614, 113509, 112631, 109090, 107056, 101947, 100525, 90645, 86078, 85263, 81697, 78681, 78082, 69645, 65227, 62476, 59852, 57610, 50654, 49240, 47240, 50458, 51715, 44265, 34187, 30984, 32122, 28323, 24944, 28569, 27980, 23026, 15307, 15342, 25972, 36972, 36728, 26941, 26110, 25233, 23787, 24920]
9783B4920m457N358P150M419O870K789J1027Q357M332J0301J0061J4700J4194
9770A20021J6685J8120J2359N414P506J0461K0550J8572J5823K6800M0273M3833
9758C56417N8059Q6992J17621J48654J84533K35003L09822L85712M43590M30941
9748B757344K85149k5243l88150o00815n68574m04842k58426j59020r6650o7071
9738D73702n2433m3228l2358k3909k0562k2768j1144p119j042r776n241l599N447
9725B45970R327J676m417r469j5188j9923k3084k1578j2938q212j3232m9L90r102
9711A20171n735o264o318m144l397j3715p099n174j0698l587l939k379r045o977
9697C1700L326j445K993J5699J3955J0329P055n624m845o775p144p267j735k181
$$ y = [24920, 20463, 25821, 32971, 37390, 44260, 47049, 58076, 66433, 70765, 81066, 91127, 105827, 120021, 136706, 154826, 167185, 172599, 180105, 190566, 211116, 229688, 245511, 272311, 312584, 356417, 414476, 501468, 619089, 767743, 952276, 1187279, 1497101, 1882813, 2326403, 2757344, 3042493, 3017250, 2629100, 2028285, 1459711, 1054869, 796443, 637423, 540773, 473702, 421269, 378041, 345683, 321774, 301212, 278444, 267300, 260181, 259139, 249363, 244122, 240523, 245970, 255297, 256973, 252556, 243087, 227899, 207976, 184892, 163314, 150376, 142164, 128932, 128883, 129273, 120171, 114436, 108172, 101854, 97710, 94313, 80598, 73499, 68325, 57627, 54040, 50101, 47722, 38677, 31700, 35026, 33581, 36574, 52273, 66228, 76557, 83612, 77988, 73143, 66368, 59224, 51957, 50222, 48041]
9683D8041j941K824M486N861r473n762o04K148o547p930M70j460k72j616J614
9668B9839k328o011j864m540N88J42o739k992k31p24m321n158L056N34k968J684
9652b033K938o17R68J784J494m241J871L941j603n877n679k653n679n33O533P083
9636b303K395o64m308l84K259J683K599L516k09n017J907P021L298J452j120j0668
9620A457j445l222R58O383L277m321r167l463J071j387J028o078M448K194j998
9605a0265N951J1536O362n34l770K223j75k08M699k00l852n991j454M493J207
9590A0022J901J978j503k305J829m534l743n51P716M143J989K067l911k557r05
9575A1636k72O961M198R306L291M563n325k760K855n921m044k980l146M85j690
$$ y = [48041, 46100, 48924, 53410, 59271, 49798, 44036, 43432, 45580, 39033, 31103, 31573, 30113, 29841, 28225, 29839, 27511, 21500, 19636, 15096, 15684, 15826, 9087, 6095, 5864, 5140, 819, -4339, -1283, -749, -3717, -2033, 905, 288, 1256, 3040, 4534, 293, 2164, 6105, 4502, -1375, -7054, -9707, -15386, -15919, -9386, -2303, 92, -572, -4880, -5264, -3005, -1322, 1277, 4793, 4584, -433, 1474, 8495, 11793, 13245, 12125, 1457, 12, -3210, -2252, 4131, 7408, 3087, -6080, -9543, -8472, -9859, -8831, -14909, -10461, -8267, -10265, -4314, 7222, 13584, 13050, 9280, 11503, 11328, 11120, 15819, 15619, 11767, 5776, 4322, 8815, 10022, 11923, 13901, 12398, 10093, 11922, 7388, 3645, 3094, 10810, 14953, 16942, 19009, 15098, 12541, 11636, 11364, 18325, 22523, 31829, 35120, 39683, 34358, 31598, 34453, 28532, 24488, 21508, 18362, 18847, 17157]
9560A7157L343l033n29j012k130L862N522K612r587j656j953n973M54L725n83
9545A0219m114l913L057L335K20r436q59K2n246K915M400K983O531K108j1946
9530B76k321N056J300n377l031O761J781l691l016k005L980O888N154M80j354
9515A0881O86K77K053O528K641r59k267l306K32j180J132Q379J79J837L516J110
9499C1739r067K17O30P28M479R617J448k791j547j957N997M279P9K360P045m15
9483E2841L137K371N210R926Q867J0362P181L59Q485O542J6574J0642J0394K3277
9469A76168K1016J2553K6859K8922K8812K9523L3494L6692L8124N7194O1327O0993
9457F11677Q1134J01920J19057J42243J77543K13542K58475K99185L31501L59942
$$ y = [17157, 20500, 17467, 16938, 15926, 13796, 17658, 23180, 25792, 16205, 14549, 12596, 6623, 7077, 10802, 10219, 6105, 2192, 5249, 8584, 8804, -632, -1491, -1469, -6715, -3800, 600, 3583, 10114, 12222, 276, -2045, 3011, 4311, -1066, -4097, 2664, 4445, 754, -2262, -4267, -287, 6601, 11755, 12235, 10881, 11567, 11844, 13897, 20425, 23066, 22107, 19840, 16534, 16766, 15586, 16718, 25097, 25276, 27113, 30629, 31739, 22672, 22889, 23519, 24247, 28726, 38343, 39791, 37000, 35453, 33496, 39493, 43772, 43851, 46211, 53256, 52841, 55978, 58349, 63559, 73485, 82352, 92714, 99895, 100254, 108739, 115281, 131855, 142497, 152891, 176168, 197184, 209737, 236596, 265518, 294330, 323853, 357347, 394039, 432163, 489357, 550684, 611677, 692811, 794731, 913788, 1056031, 1233574, 1447116, 1705591, 2004776, 2336277, 2696219]
9447B696219L78987L29111K07567J4490k05338l81147m49383m23616l63874k84238
9437A518778k17270j71185j43871j13844p8537o3512n2277m4165m3962l3353k6188
9426E30614k7287k7378k3896j4573j2609j6400j5949k1678j8685k1952j8126j5308
9414B96773j9001k0161j2984j5803j8847j7737q266o040j4111j4009p221r473
9402A33120j0447o103l807P09m430o468q805q175o644o987r461j7983N46R343
9388E4408l95j0027o936K850j68j196m114K201m936j658O36k496l941M84k195
9373B2517J504J890n980O992L120j42J672m394q324j004l451k163K769o497l410
9358E099N188q93m68m473J888N345p172j827J037m43J893J930O190l513j003k012
$$ y = [2696219, 3075206, 3404317, 3611884, 3626374, 3421036, 3039889, 2590506, 2166890, 1803016, 1518778, 1301508, 1130323, 986452, 872608, 794071, 730559, 678282, 634117, 590155, 556802, 530614, 503327, 475949, 452053, 437480, 424871, 408471, 392522, 370844, 352159, 330207, 312081, 296773, 277772, 257611, 244627, 228824, 209977, 192240, 183974, 177934, 163823, 149814, 142593, 133120, 122673, 116570, 112763, 113472, 109042, 102574, 93769, 85594, 78950, 71963, 62502, 44519, 45065, 54408, 54013, 43986, 37050, 39900, 39732, 38536, 34422, 36623, 31687, 30029, 30665, 28169, 24228, 24712, 22517, 24021, 25911, 19931, 26923, 30043, 29901, 31573, 27179, 18855, 17851, 14400, 12237, 15006, 8509, 5099, 10287, 9394, 8926, 4453, 6341, 11686, 4514, 2687, 3724, 3281, 5174, 7104, 13294, 9781, 8778, 6766]
9342F766J520J02J140J794j746l715l023l679o294l126j724J49L046j120L459
9327f451J244j028m118k86N44Q984r15p269j225K748N919O28p206L281L353l09
9311b106J521k498L82L854K8l039j869k893L218j914L782K077l897K110k810n532
9295i586k832J036N80M149m553K190J1403l11p274p824k773l778n829L524k461
9280b4339Q191O786P3L277n41P215L024N10j213o703p959k867r06l575J890N880
9264a1257K610L565n771k829k320P044O452l021m726m197N355L879K446l995R712
9249B947M043r773n349J475k881l187j205m799o782M536P34P352M57K943k78m335
9233a4102m601k569K882J585j572J0143Q603m669l981K299R57P06j548q05k47
$$ y = [6766, 8286, 8388, 9528, 11322, 9576, 5861, 2838, -841, -7135, -10261, -11985, -11836, -8790, -9910, -6451, -5207, -6235, -10353, -10639, -10095, -1111, -2026, -9295, -10520, -7772, -1853, -1225, -8431, -5150, -1797, -2106, -585, -3083, -2701, 1153, 1181, -1858, -3727, -6620, -3402, -5316, -1534, 543, -3354, -1244, -4054, -9586, -12418, -11382, -10802, -6653, -11206, -9016, 2387, 2076, -5198, -13022, -15795, -19573, -25402, -21878, -24339, -16148, -9362, -9289, -6012, -6553, 662, 3686, 4196, 2983, -3720, -11679, -14546, -15452, -19027, -17137, -11257, -8647, -5082, -10853, -13682, -16002, -8958, -2506, -5527, -10253, -14450, -9095, -5216, -2770, -6765, 2947, 6990, -2783, -8132, -6657, -9538, -12725, -13930, -18729, -25511, -20975, -20241, -12889, -12432, -9489, -9767, -14102, -18703, -21272, -18390, -16805, -18377, -8234, 369, -4300, -8281, -5982, -5025, -4319, -5867, -6672, -6919]
9218f919k823j496N337m739k596m08P473o858k666l839j698L201K763l92M483
9203a1177M770J495p995l054N511M284M118l901o410L096O471O189K608p432p72
9188b199l059l491l131k624m618k249N396L648l266l103q190M337Q691k559l477
9173a9894l68K158Q73l502L309L499j287J732M548N198j896L87m3j079j381M216
9157c530N080l502l376k930K56O65N47n545k999N329k114J472N19m315m594J599
9141a7438N989K225J0590j796R65R784j169r208j754L423n129o343q730m528J1362
9126a1757N717l214j0557L05R234p287l860P192M984k73k874j450l370J494k925
9111a8641j609K381L006l831l349J812L44L385K888l211N64K25L863P05l22K21
$$ y = [-6919, -9742, -11238, -5901, -10640, -13236, -13644, -6171, -13029, -15695, -19534, -21232, -18031, -15268, -15660, -11177, -6407, -4912, -12907, -15961, -10450, -6166, -2048, -5949, -12359, -9263, -2792, 3397, 6005, -1427, -2199, -5258, -8749, -11880, -14504, -19122, -21371, -15975, -12327, -15593, -18696, -26886, -22549, -13858, -16417, -19894, -20262, -18104, -17231, -20733, -17424, -13925, -15212, -13480, -8932, -3734, -5630, -5243, -5286, -6365, -7746, -3530, 1550, -1952, -5328, -8258, -8002, -7337, -6790, -12335, -15334, -10005, -12119, -10647, -10128, -14443, -19037, -17438, -11449, -9224, 1366, -430, 535, 10319, 9150, -58, -1812, 1611, -3518, -9861, -18591, -23119, -11757, -6040, -9254, -19811, -19506, -10272, -17559, -21419, -14227, -9243, -9516, -12390, -13840, -17210, -15716, -18641, -20250, -17869, -14863, -18694, -22043, -20231, -19887, -16502, -13614, -16825, -16261, -16036, -12173, -11468, -11790, -11569]
9095a1569m640P67M351j317J675k268j219M435J031K938o787o336N303P037o486
9080a3085l998j773M376L984j653k686N409N354N39K635m84n362k177l54K029
9065g246j219K757O07m870M52k436J069j985p726N775M999n433j1459N557O216
9050a4942l638K004J3K316J0176j572q596N237j877N458O833J98J058K254m501
9035D21k261m708p975K988L161j500r37J116j574o509j87P50m004R76M375O923
9019h945J823m893j764J1K615m8N06M140p284j0O766N875l156M56K514p15o987
9002i096m465K485O548l059n301n859k134M323l018q232n57J040O961K9Q70o18
8986b0083L310L855l850k326K861l752L101l753k460Q588J449l475j972M576K590
$$ y = [-11569, -16209, -15442, -11091, -12408, -10733, -13001, -14220, -9785, -8754, -5816, -12603, -18939, -13636, -6599, -13085, -17083, -18856, -14480, -10496, -12149, -14835, -9426, -4072, -3533, -898, -1382, -6744, -8921, -9275, -7246, -8465, -5708, -5101, -9971, -9519, -11955, -10886, -12871, -20597, -14822, -9823, -15256, -26715, -21158, -14942, -18580, -16576, -16563, -14247, -4071, -5643, -14239, -9002, -10879, -5421, 1412, 1610, 2668, 4922, 421, -1840, -6548, -14523, -11535, -8374, -9874, -10811, -9695, -11269, -17778, -17965, -17215, -21219, -20243, -15868, -8945, -7122, -12015, -13779, -13768, -11153, -11201, -10695, -6555, -13839, -13849, -7083, -1208, -4364, -3908, -1394, -2109, -9096, -13561, -11076, -4528, -7587, -12888, -18747, -20881, -16558, -19576, -27808, -28365, -27325, -20364, -20335, -19465, -20083, -16773, -12918, -16768, -19094, -16233, -19985, -16884, -20637, -23097, -14509, -13060, -16535, -18507, -13931, -11341]
8971a1341q75K504k675p457j759j276Q531P744j131M334J583j456r889L30K372
8956a0461N048j355j007O02n008O761K188j572l558n544N516O831n797q907l830
8941b0093K327R92k10m452M262R225k939j016m449k701Q188K063l470R85K715
8926h573O77m31j843k793N198j30m85L980K944p638k553j062l96j647J683m31
8910a3500l776K308J0481J317M451j709j1704k962j108j683Q62L785k328j62N360
8895a0368Q976j119k073m122R27J321M64l462k665l881M270N176k109o97J103
8880h259N839p65m714M221j691j371P384R35l470j743J280J197n742l9K539p49
8864e148j031o19N703m172k907k111o563O250K472k156J113K198M14n324p434
$$ y = [-11341, -12216, -9712, -12387, -19844, -21603, -22879, -14348, -6604, -7735, -3401, -1818, -3274, -13163, -12833, -10461, -5413, -6768, -7775, -7173, -12181, -5420, -3232, -4804, -8362, -13906, -8390, -1559, -7356, -16263, -20093, -17766, -16774, -16984, -21436, -17174, -7949, -10888, -11904, -16353, -19054, -10866, -8803, -12273, -11288, -8573, -7896, -8327, -10170, -12963, -7765, -7895, -8380, -4400, -1456, -9094, -11647, -12709, -13105, -14752, -13069, -13500, -17276, -14968, -4487, -3170, 1281, -428, -12132, -15094, -16202, -17885, -17023, -13238, -15566, -15728, -10368, -1392, -2511, -4584, -8706, -7779, -6458, -5994, -9456, -12121, -16002, -11732, -6556, -8665, -9362, -8259, -2420, -3185, -7899, -3678, -5369, -6740, 644, 1579, -1891, -3634, -2354, -1157, -6899, -6938, -4399, -5148, -6179, -6798, -1095, -5267, -8174, -10285, -16848, -10598, -8126, -10282, -9169, -6971, -6557, -11881, -19315]
8849a9315p004k134N987Q528O858L706J733N001L761j3607o908L827P342M276
8835B051n412n982l484M117Q633j270j1161k882J078M758m111l257P476K836o738
8820a3348r692N507Q330K745P613J922k067n876o787k006r5J160j456n5L864l034
8804a3275N99J941M971k40n069p577k83k702L112N874M511J05K000n754m632l417
8788a9836L469J881P294J659n6n306K229j63J832j349m198l53n170q06O543M198
8772h132j326l080m638j784m350N528J426J837J192L1L37K836M079K359k645r52
8756g282l158r97k69N842k509p88n676j304L947l526J211M547N33J782M136J147
8740b364k716n565M496K368l313M173K996Q193K499k590m762o418l261K29P33
$$ y = [-19315, -26319, -28453, -22466, -13938, -7080, -3374, -1641, 3360, 7121, -6486, -13394, -9567, -2225, 2051, -3361, -9343, -12827, -8710, -77, -1347, -12508, -15390, -14312, -9554, -13665, -16922, -9446, -6610, -13348, -23040, -17533, -9203, -6458, 1155, 3077, 1010, -4866, -11653, -13659, -13754, -12594, -14050, -14105, -10241, -13275, -12676, -10735, -5764, -6004, -11073, -18650, -18933, -21635, -18523, -12649, -8138, -8033, -6033, -11787, -16419, -19836, -16367, -14486, -7192, -5533, -5589, -10895, -8666, -8829, -6997, -8346, -12544, -12897, -18067, -18873, -12330, -8132, -9458, -12538, -17176, -18960, -23310, -17782, -16356, -14519, -13327, -13296, -12959, -10123, -6044, -3685, -6330, -7282, -10440, -11437, -11706, -5864, -8373, -9161, -14837, -16141, -12194, -15720, -14509, -9962, -9429, -7647, -3511, -2364, -5080, -10645, -6149, -3781, -7094, -2921, 75, 8268, 10767, 8177, 3415, -3003, -6264, -6035, -5302]
8725e302r90l932L001O912L38j502k647r497K437P70M078m607j4114o513N433
8710b6135L792k754N535P621M323k858J019J573k730K529k792n199J90L498M023
8695h365J608k769N235L702o50o930k810P31P809l775o32j411j0005j336M194
8680a5404J0764L670p583l516k780P99N24l047k92L486m300k277N740K062j120
8665a3274M772O71k784P30K881o14N257N780l497M328J1798l69j3922n184L248
8650a79j914L57J228j001r27o299o670r75M030J735J768K471l508n679J195L852
8634a0516M047k543K56L415L514l623J37m404j944P870P685j138q496n024J80
8619a0584m375K22L812L538J037n757M38M702J471m612o212O147K334N359P23
$$ y = [-5302, -6292, -10224, -7223, -311, 27, -1475, -4122, -13619, -11182, -10412, -6334, -10941, -25055, -31568, -26135, -22343, -25097, -19562, -11941, -7618, -10476, -9457, -7884, -10614, -8085, -10877, -16076, -15886, -12388, -8365, -6757, -9526, -4291, -589, -1239, -8169, -10979, -10248, -2439, -6214, -6846, -8257, -18262, -19598, -15404, -4640, -970, -8553, -12069, -14849, -14050, -13526, -16573, -16865, -13379, -17679, -19956, -14216, -12154, -13274, -8502, -7831, -10615, -9885, -7004, -7618, -2361, 3419, -78, 4250, 16048, 15679, 1757, -3427, -179, -2093, -1736, -508, -1509, -2436, -8735, -15405, -16380, -12350, -10615, -8847, -6376, -9884, -15563, -14368, -10516, -6469, -9012, -8756, -5341, -1827, -5450, -5313, -9717, -11661, -3791, 3894, 2756, -5740, -10764, -10584, -14959, -14737, -10925, -7387, -6350, -12107, -11669, -6967, -5496, -10108, -16320, -10173, -7839, -2480, -1757]
8604a757l734m934K002N151O295n28l12n573o037m69l50l34J783M784K333j48
8588a828k928M211Q301M83k95m043l990m006n181j713m649k90k607l642L647J279
8572a7251k341L344Q425K301j974J597L157l986J306l084K653m875J947R022K853
8557C094j824l205K243O987M931j099k314l437j2528p487P393M448J686q74L346
8542A360m982m553P45l021K031J207J108j356K414J642j627m111L867k267j895
8527i438n063l122N897N591l76K636m55q211K65N840O765k550l793o66o75J349
8511f006J559J94r07l37J111l149L336l942R33P37r591p703L609N033l114j93
8495a8430O962P709R03l677k756K704o69k467K028j129K795N237n543j080j351
$$ y = [-1757, -5491, -10425, -8423, -3272, 3023, 2495, 2183, -3390, -9427, -9896, -10246, -10580, -8797, -4013, -1680, -1828, -4756, -545, 7756, 8239, 7944, 3901, -89, -4095, -9276, -10989, -15638, -15928, -18535, -22177, -18530, -17251, -19592, -16248, -7823, -5522, -7496, -5899, -2742, -6728, -5422, -8506, -5853, -10728, -8781, 241, 3094, 1270, -1935, 308, 7295, 12226, 11127, 8813, 5376, -7152, -14639, -7246, -2798, -1112, -1986, 1360, -3622, -8175, -7430, -10451, -8420, -7213, -6105, -7461, -5047, -3405, -5032, -9143, -5276, -7543, -9438, -14501, -17623, -11726, -6135, -6511, -3875, -4330, -12541, -12276, -6436, 329, -2221, -6014, -6680, -7355, -6006, -4447, -4253, -5160, -5497, -4386, -7535, -4199, -8141, -7208, -6471, -16062, -23765, -20156, -15123, -18237, -18430, -11468, -3759, -2856, -6533, -9289, -6585, -7254, -9721, -7693, -8822, -6027, -790, -6333, -7413, -8764]
8480h764K95q14O209J613L329P7m42L81q900m872n06j220k313N617O676j816n761
8463a1211K803P410M758K844J870p082o206k189k075M305q32O075Q216J203m063
8448E826l579m369k671n537M772l513Q95R343P03k508K974k856l036K708J930
8433A082l812R11k600j010M409N579l404j1418n075m723j575R90O455J4872N561
8418F242K038k466o579q522J803j377L705K772K976m738l595J78j873l730L655
8403i511M198j380J834m933L312J394m835J655Q331N108l406j2478k143K935K363
8388g556L090J423m19N122K391j117l126j0508J422J183K304K564k993J822j971
8373f369p694l582O488N427N186J823K051m703L100m561n612O57J274J542k207
$$ y = [-8764, -8469, -9283, -3074, -1461, 1868, 1945, 1503, 1884, -7016, -11888, -12394, -13614, -15927, -10310, -3634, -5450, -11211, -8408, -998, 3760, 6604, 8474, 1392, -4814, -7003, -9078, -4773, -5605, 470, 8686, 9889, 5826, 2247, -2122, -4793, -10330, -5558, -9071, -8176, 1167, 1870, -638, 2336, -520, -3556, -848, 1082, -2730, -1819, -4419, -5429, -1020, 4559, 1155, -10263, -15338, -20061, -21636, -20646, -14191, 681, 6242, 8280, 5814, -765, -9287, -7484, -8861, -5156, -2384, 592, -4146, -7741, -7563, -9436, -13166, -9511, -5313, -6693, -4859, -9792, -6480, -5086, -9921, -8266, 65, 5173, 1767, -10711, -12854, -9919, -7556, -4466, -3043, -3462, 1660, 4051, 2934, -192, -10700, -9278, -8095, -5791, -3227, -6220, -4398, -6369, -14063, -17645, -11157, -5730, -544, 1279, 3330, -1373, 1727, -2834, -8446, -7789, -6515, -4973, -7180]
8358g180N746l143J00K551n331j411j520J64j26N76J635K06m897o56N958O177
8342a151j114l821J469K453j440M19J253k550l171o146j611J309O997P853J998
8327B747o503j713l645l581K982j520L96L735k971Q231p99j786J070K219j546
8312b684O231P95n422n636J381O892k434n598r783o323O228J048n92k809k627
8297b1333m003K959L715J723J928M334K543l288K671O565M61P78j469k017j537
8282e970J870p6K515j245l243p47j238l059L407K293K227J601o064J433O88M264
8266a344R09o03rJ544J57j395k403L491J698j0030j623M08L835M917N733k945
8250B340p385j415L283K689o8o575J872L493J037k011n363R75L756L435j419L77
$$ y = [-7180, -1434, -4577, -4477, -1926, -7257, -8668, -10188, -10024, -10150, -9574, -7939, -7733, -12630, -13286, -7328, -1151, -2265, -6086, -4617, -2164, -3604, -3185, -1932, -4482, -7653, -13799, -15410, -14101, -7104, 749, 2747, -3756, -5469, -9114, -12695, -9713, -11233, -10837, -7102, -10073, -1842, -2641, -4427, -3357, -1138, -2684, 3547, 4342, -1080, -6716, -5335, 1557, -877, -6475, -16258, -22581, -16353, -15305, -15897, -18706, -21333, -25336, -22377, -18662, -16939, -15011, -10677, -8134, -11422, -8751, -2186, -1725, -947, -2416, -4433, -5970, -4100, -4176, -1661, -2906, -6149, -6896, -8134, -11193, -7786, -5493, -3266, -1665, -7729, -6296, -5608, -1344, -435, -1038, -1047, 497, 654, -741, -3144, 347, 2045, -7985, -9608, -9200, -5365, -448, 5285, 2340, -5045, -6460, -3177, -488, -556, -7131, -5259, -1766, -729, -2740, -8103, -7128, -3372, 63, -1356, -979]
8234i79m274J824n09L51r93N004M885K329q783n640n471J079Q201L521J677q256
8218f034o679Q94L870n480M757M182J823L578l098J584k41J204l938l319k497
8203i394J229k35O020l607P98J70k593nR73N529K872K446J324n355L262o029o090
8186h685k80j263K362j422Q05O736j420k338M544L777J158m818n883k266N489
8171c504K395J394j995k162K169k74J51j01K019m368o365L796J5447N976l587
8156A0991Q47n119j2745l530J846N059o390l07J025j075k7K745P19L540N501M069
8140G149P371p00l302j345k721j927k540L108J746l419N223k504r034k221k005
8125g121j008L682j166K212j44k957O24J730M260j514J75K762q06o205l978Q21
$$ y = [-979, -5253, -3429, -3938, -3587, -4580, 424, 5309, 7638, -1145, -6785, -12256, -11177, -2976, 545, 2222, -6034, -12713, -11819, -7949, -13429, -8672, -4490, -2667, 911, -2187, -603, -844, 360, -3578, -6897, -9394, -8165, -8400, -2380, -5987, -5189, -5019, -7612, -7617, -6644, -1115, 1757, 4203, 5527, 172, 3434, -2595, -8685, -8965, -10228, -7866, -9288, -8483, -1747, -3167, -5505, -961, 2816, 3974, -844, -6727, -8993, -3504, -1109, 285, -1710, -3872, -1703, -1977, -1826, -1927, 92, -4276, -10641, -6845, 8602, 14578, 10991, 11838, 6719, -6026, -9556, -7710, -2651, -9041, -9348, -8323, -9398, -9425, -6680, -5961, -2421, 3080, 7149, 14520, 13820, 10518, 9173, 6452, 4525, 1985, 5093, 6839, 3420, 8643, 6139, -2895, -5116, -7121, -8129, -4447, -5613, -3401, -3545, -6502, -5878, -4148, 112, -1402, -1227, 1535, 729, -5476, -9454, -8633]
8109h633J067M602l801J328j410J359P151q451o959P499P77p926J945j90K105
8094i537J381K112l220j018J0982k026KL45J485l790J250L730k925J403J810k709
8078g25j711o137M317O132M292m485q46k342k615K96M47K27L401q61L04n859n500
8061a1665L849M184m087l410j723p69o50N336O668N338k350n405n488n699K085
8046a3786J948P253j957O151M074j487k57l236k522K603N821O212l710K079k01
8031H985n61M45j639k744l124p463p854m381O463Q747M69K255K744p113q215L335
8015i651Q749j247m922M546L210m991L594O640j380j927j047k425m56j006J451
8000h62L194L421n550m121k82M636L129K21p044r144k348N881O767P856L094q690
$$ y = [-8633, -7566, -2964, -6765, -5437, -6847, -5488, 1663, -6788, -13747, -6248, -5471, -13397, -11452, -11642, -9537, -8156, -6044, -9264, -10282, 700, -1326, -1324, -979, 506, -3284, -2034, 1696, -1229, 174, 1984, -725, -2436, -8573, -4256, 1876, 6168, 1683, 837, -1505, -4120, -3824, -3377, -3150, 251, -610, -306, -6165, -11665, -7816, -3632, -7719, -11129, -12852, -13621, -14271, -8935, -2267, 3071, 721, -4684, -10172, -15871, -13786, -11838, -4585, -6542, -391, 3683, 2196, 1939, -1297, -3819, -1216, 4605, 10817, 7107, 9186, 8985, 8424, 8869, 7230, 4486, 1362, -6101, -13955, -18336, -11873, -3126, -2657, -402, 2342, -4771, -12986, -9651, -902, -2149, -7071, -2525, 685, -4306, -712, 5928, 4548, 2621, 1574, -851, -1307, -2313, -862, 2332, 5753, 203, -3918, -4200, 436, 3565, 3786, -3258, -12402, -14750, -8869, -2102, 5754, 8848, 158]
7984A58N466K863m320o516n303j0435J050p83N384O715L052p92k155p40j092O369
7968a079K035k760J406P450p1l599j030j569n748O98K349j967L006R318J722k178
7952G983k147P43N17j262K95j810j550K145n00L040L664m361l245l440m127P38
7936c317R638r01M75R64p25o227o120L139j656o961M689J0848k269o148Q388M424
7920H241k435L585K962n145n15k208J159j924n282n289L614K090K545J62K02N258
7904G020l348j984L967N53J504o310M88L156k963l031j045J244O31j116J386N051
7888E203L159j86j634k474l922m206L451M527J412k089l396N20K190m659j084
7873c188M52k763k556K448J315k485K138L777M487K947M45K926L72m994n741P97
$$ y = [158, 5624, 8487, 4167, -2349, -7652, -18087, -17037, -17820, -12436, -5721, -2669, -3461, -5616, -6356, -7448, -1079, 956, -1804, -398, 7052, 6981, 3382, 2352, 783, -4965, -4267, -1918, -3885, -879, 8439, 10161, 7983, 5836, 6579, 7096, 5834, 6129, 4319, 2769, 4914, 4414, 7454, 11118, 6757, 3512, 72, -4055, -3317, 6321, 5420, 5895, 6859, 6134, -93, -6213, -3074, -4730, -11691, -7002, 3846, 1577, -4571, 3817, 8241, 5806, 9391, 12353, 7208, 6693, 4485, 5644, 3720, -1562, -6851, -3237, -1147, 1398, 1560, 1762, 7020, 3672, 1688, 5655, 6208, 7712, 1402, 1890, 5046, 2083, -948, -1993, -749, -118, -1234, 152, 5203, 8362, 8176, 6542, 4068, 146, -4060, -609, 3918, 5330, 3241, -155, 365, 2555, -2104, -3188, -2736, -5499, -8055, -5607, -4292, -6777, -4639, -862, 3625, 6572, 7017, 9943, 10315, 5321, -420, 377]
7857C77O431L42q269l299Q054N302n103q183K384N633n703N560o516n489k151
7842a0630M413J3099o74n493L615L670k5p982J177m117j1250j144Q859J0333K80
7827D131j460K134L881p2j252n690q63o492o168J47K530Q2K478J82k046K536j882
7810g824L673k839M287J742K903J563L080k454L157J196m083o368N316q66M03
7795B886L476J349K206L34m596n681K37K035J354L953k33O455J727R09k416r996
7779C999n142k107J169J657k162r434m349K434L760O191L620O734k378J689k722
7764B959J129j050j3677p970K232K983P489Q417q218m412P476J093k712m19k957
7749g637m485L18K591M421M01O98Q90l798N10M115p112l687M209M409O346L287
$$ y = [377, 6808, 7150, -1119, -4418, 3636, 8938, 3835, -4348, -1964, 3669, -2034, 3526, -2990, -8479, -10630, -6217, 6882, 6208, 715, 4330, 8000, 7975, -7, 1170, -2947, -14197, -15341, -6482, 3851, 4131, 2671, 4805, 8686, 8614, 7362, 1672, 809, -5683, -11851, -11704, -9174, -9092, -6614, -6432, -8478, -5942, -7824, -4151, -6990, -2703, -961, 1942, 3505, 6585, 4131, 7288, 8484, 4401, -1967, 3349, 2483, 2886, 6362, 7711, 9917, 10251, 5655, -26, 211, 2246, 3600, 7553, 7320, 13775, 15502, 16411, 13995, 3999, -1143, -3250, -2081, -424, -2586, -12020, -16369, -13935, -10175, -3984, -364, 6370, 3992, 5681, 2959, 4088, 3038, -10639, -18609, -16377, -13394, -5905, 2512, -5706, -10118, -2642, -1549, -4261, -4680, -7637, -12122, -11804, -9213, -4792, -4391, -3693, -2803, -6601, -6091, -1976, -9088, -12775, -8566, -4157, 2189, 5476]
7733E476n51k496j575M177l531p939k865j530J379k763l63R64k135p08N825K984
7717e651J260l15K68l79j831K792J33M241l323p53m140l753L657L671N932L83
7701B192p393J381J05M78M984l669k274K338q355l11l013M578P596k491j00L290
7685f64J801l898K184M828M633o98j730l847l182j339L52J0537L191k464K295
7670A1999M33J851j266o650m47l132p281K646J30n82J118l013j194Q251M239l020
7654D082l996m411j768k056P391J177M509m58J816M174n460P42p449K639K866
7639C798k414j379p60r99j350k216n48K002l997N798M179p32L49n86j568j09M835
7622D303p435p303N488m098j605p95J186N78p315L036L839l892J74P445L940k050
$$ y = [5476, 4925, 2429, 854, 5031, 1500, -6439, -9304, -10834, -9455, -12218, -12581, -11617, -13752, -14460, -8635, -5651, -4391, -4706, -4438, -4817, -6648, -3856, -3723, 518, -2805, -3558, -7698, -11451, -7794, -4123, 1809, 2192, -5201, -3820, -3715, -3237, 1747, -1922, -4196, -1858, -10213, -10524, -13537, -8959, -1363, -3854, -3954, -664, 1137, -2761, -577, 4251, 8884, 8186, 6456, 2609, -573, -1912, -1560, 8977, 12168, 9704, 11999, 12432, 14283, 13017, 6367, 5920, 2788, -4493, -1847, -1717, -2299, -1181, -4194, -5388, 2863, 7102, 4082, 86, -4325, -6093, -8149, -758, 419, 4928, 4470, 6286, 10460, 5000, 5742, -1707, 932, 3798, 1384, 5, -755, -1754, -3104, -5320, -5868, -3866, -7863, -2065, 2114, 1382, 1731, 1145, -423, -532, 4303, -3132, -10435, -4947, -9045, -10650, -11445, -10259, -9681, -16996, -13960, -10121, -14013, -13839, -6394, -2454, -4504]
7606d504l677N599O393J751N619k585l349n267N616l483n318M694K053j151k317
7591G4l855l299K956J874M929k044o943j069O386Q503k623q131J071N624K453
7576E906o36Q373k213o947n605q062m477J443R657Q508o68j781K14l311l967n156
7560h722M332K834j763n095M010O947K858j145o721o272L740l935n698K867K127
7545i636K919j22J248N15L869L221o38k402m570j725k980K906L149l768j731p62
7529a0507N072m363k843O112K45j54O216m879n659N004L508K29j611O433J407
7514D210l473P97k330m7N476l153q408J798M854L150R85m18K896l067j1174J52
7498g752L804k368k969J995j224N528K739m41J085J328n876o168K617O602J61
$$ y = [-4504, -8181, -2582, 3811, 5562, 11181, 8596, 5247, -20, 5596, 2113, -3205, 1489, 3542, 2391, 74, -3781, -7080, -4124, -2250, 2679, 635, -6308, -7377, -991, 7512, 4889, -3242, -2171, 3453, 5906, 5270, 13643, 11430, 4483, -1122, -9184, -13661, -12218, -2561, 5947, 5279, 3498, 3712, 401, -3566, -8722, -4390, -1556, -3319, -8414, -4404, 2543, 5401, 4256, -2465, -8737, -4997, -8932, -14630, -11763, -9636, -6717, -6839, -5591, -5076, -1207, 2014, 1376, -1026, -5596, -7321, -10301, -7395, -4246, -8014, -9745, -10507, -5435, -9798, -12641, -6529, -6284, -6438, -222, -5101, -10760, -5756, -2248, -2019, -3630, 2803, 4210, 737, 1534, -796, -843, 4633, 1480, -6928, -5130, -276, 2874, 3859, 3441, 6337, 3270, -7904, -7752, -3948, -6316, -9285, -7290, -8514, -2986, -247, -688, 397, 1725, -4151, -10319, -7702, -1100, -939]
7483i39M05k604k398O59p4L92k28L622M09l113L72o036K657J0526M689l866k110
7466B363L02j160R29l703m101O63j194O100O123j192k543L852l909o643m058j860
7450a0031P451m871m287l273K571q94m390M177J0173O370j041q195m225M802J181
7435d482J356K172l691J435l617k621K595K116O472R144L680P737m936q923m254
7420D183n207n215n481Q104j795j521J1217J56k700k457m696K596L319R37l697
7405b257J878K769K414n705p41l398K239O240L764m685p217l390r6L816L102P642
7389F375Q093k966o968l737k236l705O411L675J854p699m809K419k318J958P53
7374b900J215Q889M912J72p508n904P85J127n22L353J440k337J94Q06K3r592J557
$$ y = [-939, -534, -3138, -5536, -4877, -4951, -4559, -4787, -1165, -756, -3869, -3497, -9533, -6876, 3650, 8339, 4473, 2363, 2665, 1505, 2434, -1269, -5370, -4707, -5901, 199, 6322, 5130, 2587, 6439, 2530, -4113, -8171, -10031, -2580, -7451, -11738, -15011, -12440, -13334, -17724, -13547, -3374, 2996, 1955, -6240, -10465, -5663, -4482, -3126, -954, -4645, -3210, -6827, -9448, -6853, -4737, 1735, 10879, 14559, 22296, 17360, 8437, 4183, -1024, -6239, -11720, -3616, -5411, -6932, 4285, 4441, 1741, -716, -5412, -2816, 503, 1440, -2257, -379, 2390, 4804, -901, -1642, -5040, -2801, 3439, 7203, 2518, -4699, -8089, -8185, -4369, -1267, 6375, 14468, 11502, 4534, 797, -1439, -5144, 1267, 4942, 6796, -903, -5712, -3293, -5611, -3653, -2900, -1685, 7204, 12116, 12288, 4780, -1124, -339, 788, 266, 3619, 5059, 2722, 2916, 3722, 3745, -5847, -4290]
7357d290N534L491j447j597P26j461J058j73j142l42l426o55J734O68k078l079
7341f479O06P578l08m276r125J906n21n37P670O210k471r871o849L727N920J3
7325f807k654l62K334R27K715o611j993L018K395M39L715K958j228j595L095k651
7309b305o027J01L944N027K142l301n482j196K570J325k099m857M668k333J473
7294f350O932j72J691k173m34K569L962K09J735k171o972o552O770J1437l844
7279F637n312j448P262N263K756N015n233m570m543Q22N415Q20k135K660K364
7264A5773q72j349n863k478k759J684k670m959j229J961j660N268M710K197n111
7249B643l297l936q02P27J041k226p928J835M676L344k359l535K084O469L391
$$ y = [-4290, 1244, 4735, 3288, 1691, 2417, 956, 2014, 1841, 699, 357, -3069, -3724, -1990, -1322, -3400, -6479, -5873, 1705, 1397, -2879, -12004, -10098, -10619, -11156, -3486, 2724, 253, -9618, -16467, -12740, -6820, -6807, -9461, -9823, -7489, -6562, -3847, -10458, -12451, -9433, -7038, -6599, -2884, 74, -1154, -2749, 346, -2305, -8332, -8231, -4287, 740, 2882, -419, -5901, -7097, -4527, -3202, -5301, -10158, -5490, -7823, -6350, 582, 410, 2101, -72, -506, 2063, 6025, 6234, 7969, 5798, -1174, -7726, -956, 10481, 6637, 1325, -123, 7139, 12402, 15158, 20173, 14940, 10370, 5827, 6649, 12064, 12884, 10749, 13409, 15773, 14901, 13552, 7689, 5211, 2452, 4136, 1466, -3493, -4722, -2761, -4421, 847, 5557, 7754, 2643, -654, -4590, -5392, -4665, -3624, -5850, -13778, -11943, -7267, -3923, -6282, -9817, -7733, -1264, 2127]
7234B127j0034K442O580j25n85j379J881j543m209K76l571m495M35M604j128K192
7218f532m56k812O774J831j200l061L997K96k712m602J815k642L188K767L369
7203B0j369N619r54m960j470O09O064j642l599j034R51k658j224K770L173N355
7187E651L428p486j108K027m679m198L81J715k367L673P310J772k871p29o078
7172c559r0j633m54K88l147K413J036K614K360j614l392l515M690O775n846m254
7156g328L147L579k548k243P78O919M825j311j452k123o521m4m763j253L753O93
7140e892N7k364Q203L246k565P05l313o279N6J071k56q27K622N729J94o164p89
7123f566J956P50l132q30O233J548o10M572j976N69M428k488l03k917l780K561
$$ y = [2127, -7907, -5465, 1115, 990, 405, -974, 907, -636, -4845, -4569, -8140, -12635, -12200, -7596, -8724, -6532, -6988, -9800, -3026, -1195, -2395, -5456, -1459, -1163, -3875, -8477, -6662, -9304, -6116, -3349, 20, -1349, 4270, 3316, -1644, -3114, -2505, 3559, 1917, -1682, -2716, -1765, -4423, -5647, -2877, 296, 5651, 9079, 1593, 485, 2512, -2167, -6365, -5984, -4269, -6636, -2963, 4347, 6119, 3248, 2519, -3559, -3649, -5282, -5736, -5448, -8595, -6182, -5146, -2532, -172, -1786, -5178, -8693, -4003, 2772, -3074, -7328, -4181, -602, -3150, -5393, -4615, 2304, 7129, 5818, 4366, 2243, -4278, -4322, -9085, -10338, -6585, -5892, -5835, -8199, 4, 3250, 685, 1390, -1923, -8202, -8146, -7075, -7331, -8158, -5536, 193, 387, -5777, -6566, -4610, -3860, -6992, -7822, -1589, -41, -651, 3921, 1945, 2514, 6942, 4454, 4151, 1234, -2546, 15]
7107A5k71l854k639P833k995m383J495O938L640q002n083j154o33O72k481L068
7091g834j353K834J409o01K84k182J717L722K718M689P33o58J56l21n84p056L094
7074G67N017n296k29M553K427Q25j089m673J35J731j34J623K008L55k201o157
7058c38l582J848J872n63j256N634K088l599j191k504q218K33O693K959J435L212
7042D723o37o735p186P38n701J742m6k501Q298M786n368j449M157L208p32l821
7026f524K058L316j8J311j250j782k040m415K30N063k616n41l28P563L900k103
7010A824l694J618l240k683L944j144k223J812N652O88p63K089o46O96M49j272
6994C107j732k708o35k699L370P97j882l578l277l932N81L957p14L243J870K445
$$ y = [15, -256, -4110, -6749, 1084, -1911, -6294, -4799, 2139, 5779, -2223, -7306, -8460, -9093, -8421, -10902, -7834, -9187, -6353, -4944, -5545, -5261, -7443, -5726, -2004, 714, 5403, 6136, 5478, 5634, 5313, 4729, -2327, 767, 5784, 488, 259, 4812, 7239, 8064, 6975, 2302, 2437, 4168, 4034, 5657, 7665, 8020, 5819, -338, -3920, -2072, -200, -763, -2019, 3615, 5703, 2104, 913, -1591, -9809, -9576, -2883, 76, 1511, 4723, 4086, -2649, -9835, -9097, -14798, -13056, -13102, -15603, -7305, -2519, -7887, -9336, -5179, -1971, -2703, -6524, -4466, -1150, -1168, 143, -1107, -2889, -4929, -9344, -9114, -4051, -6667, -7208, -7536, 27, 3927, 1824, -1870, -252, -3492, -6175, -2231, -3375, -5598, -3786, 1866, 2554, 1791, 3880, 3234, 3930, 4379, 3107, 1375, -1333, -1968, -4667, -1297, -500, -2382, -5960, -9237, -13169, -12588, -8631, -9345, -6102, -4232, -1787]
6978a787K297J842l450j141n092l527N657K360r38k672M401J334k128k813j448
6963g105J423J452j912K861n82Q05J84J080L490m462J173l62j0873q268O950Q038
6947f108j633k980P6L887J0668K791n950m887J869M295n067o87j130L74L807j166
6931a841N51J37L035l688K897N431l226m803k638N153L805p006m310P977J432
6916B906K074r19K70K598j139l191k666m487m348l964j237N115M038O637Q285
6901I972r62r039k603L038o060j823n45r76O8N323K985l528J473k877N075O806
6885F327N91o267M279j979J483N071N627p604k163J959M041M463j709m139n050
6870D930m035l770j309J262R0K750L875R208J581n881k947J185k047m151k53n860
$$ y = [-1787, 510, 2352, -1098, -2239, -7331, -10858, -5201, -2841, -3779, -6451, -2050, -716, -2844, -5657, -7105, -5682, -4230, -6142, -3281, -3863, -3058, -2874, -1794, 1696, -2766, -1593, -1955, -12828, -21096, -14146, -6108, -7741, -10721, -10645, -6758, 3910, 6701, 751, -4136, -2267, 2028, -3039, -3726, -4856, -4482, -675, -1841, -1290, -1153, 1882, -1806, 1091, 6522, 3296, -1507, -4145, 1008, 4813, -2193, -6503, 1474, 2906, 4980, 4061, 4331, 6929, 5790, 2599, -67, -4554, -8902, -12866, -14103, -8988, -4950, 1687, 9972, 9010, -29, -2632, 406, -5654, -7477, -8022, -8998, -8930, -3607, -622, -4150, -2677, -5554, -479, 6327, 6918, 651, 4930, 2951, 4434, 9505, 15132, 7528, 5365, 7324, 11365, 15828, 14119, 9980, 4930, 895, -2875, -4184, -2922, -2832, -82, 3793, 13001, 14582, 8701, 5754, 6939, 4892, 741, 488, -5372]
6854e372n153k20M808N101l13O00M585j224r197l545R308J218M48L334l805j836
6838a263K290q603l026K943J899m774L80J0079m9n028m965J553O472P234N65l715
6822A992l189k771l527K336j218q901J520K091j178K759P955R057p4j994J315
6807F173N3j465q537Q99P14K797L398j846k944K967j292j132J973O912K195k904
6791G961q935k157N745L118p49j540J519m729r26l330K217M246N15l678N412r83
6775C706p021q07M010N860j861L266o162k062k525l593k905O086J664l934m718
6760a0996K087M217P80N286k096J123m214k180Q91j944L45N28l144M039M292j646
6744b632j638K391N938J42o091L274R259K007m009r084j0302J692L135M883P541
$$ y = [-5372, -10525, -10745, -5937, -836, -1149, -549, 4036, 2812, -6385, -9930, -622, 596, 1044, 4378, 573, -1263, 1027, -7576, -10602, -7659, -5760, -10534, -10154, -75, -124, -5152, -10117, -8564, -2092, 5142, 5707, 1992, -1197, -3968, -7495, -5159, -6377, -15278, -13758, -11667, -12845, -10086, -2131, 6926, 6852, 4858, 6173, 6226, 4761, -3776, -2877, -2163, 634, 4032, 2186, -758, 2209, 917, -215, 1758, 8670, 10865, 7961, -974, -3131, 2614, 5732, 4983, 3443, 4962, 233, -693, -4023, -1806, 2440, 2955, -723, 4689, 3706, -3315, -4122, -112, 5748, 3887, 7153, 991, -1071, -3596, -7189, -10094, -4008, -2344, -6278, -10996, -8909, -4692, -3912, 1374, -722, 401, -3813, -5993, -5102, -7046, -6701, -6173, -9317, -5278, -986, -2632, -4270, -1879, 4059, 4201, -1890, 1384, 10643, 12650, 8641, -443, -10745, -9053, -5918, -1035, 6506]
6729F506N76k574n967K087Q001M274o480n843O649J774j733J940l150K036m677
6714C419n312M388j006r77N53P17j604l048K166k475M615J1110L515o43n157M588
6698A4849M500k665p107r621l175K927L192O039R443J649l156K556m777r86p10
6683A2958Q23L35k158o447j0387j088k370J255O653J0943p08o752R6k15M030K785
6667I753m89m773p452r26J0287N655k701q14n667k394k153n548K66P362l069J06
6651b557J112K499j01K337j658O357O554l745j0204j093L058j929m315N05m325
6636g505J271J2796K411M305m253j1501K66N559N166j794j275j290o234J57P48
6621a173q9o53L811J909p94k263L226l451m557m662N179P887r47o642J843L599
$$ y = [6506, 7082, 4508, -1459, 628, 8629, 12903, 6423, 580, 7229, 9003, 7270, 9210, 6060, 8096, 3419, -1893, 2495, 1489, 512, 1065, 1782, 178, -2870, -704, -3179, 1436, 12546, 16061, 15418, 10261, 14849, 19349, 16684, 9577, -44, -3219, -292, 2900, 8939, 18382, 20031, 16875, 19431, 14654, 13668, 12958, 13781, 14116, 11958, 5511, -4876, -5964, -8334, -7079, -426, 10517, 9809, 3057, 3153, 2938, 6968, 9753, 9264, 4491, -2961, -3887, 6400, 12055, 9354, 8540, 2873, 479, -1674, -7222, -6956, 406, -2663, -2557, -1445, 1054, 953, 3290, 1632, 7989, 14543, 10798, 594, -499, 2559, 630, -3685, -3180, -7505, -6234, 6562, 8973, 13278, 9025, -2476, -2210, 3349, 8515, 6721, 5446, 4156, -2078, -1921, -1173, -1262, -1915, 1896, 3805, 3011, 748, 3974, 523, -4034, -8696, -3517, 4370, 3423, -3219, -1376, 2223]
6605B223m380J923J024L357m388p633L418j59p88%R21R29K362j559l619k409j935
6588a0713J851Q099J689k40K493N342l608k502j384K221J580j324r55K923k604
6573B868L976L61L868J865j088l741n939l778j008m186j016M252K264o996n005
6558a3303k880L152L661J913O043J621L70p13J0334j795k352K317M469k938m686
6543E213q919m279J816N134O67J613J495l950k467K153J59k635O617o03n677J726
6527a937M84J059p513r550M233N863N594M274p895m262p51L589P365J262m784
6512b969P61l84O938N182m302k820O360M14m820J100q79k844m90j021k67k258
6496b299N11M144P319r86o510j858J561M773r7j992k030j612J777K116k609k268
$$ y = [2223, -2157, -234, 790, 4147, -241, -7874, -4456, -4615, -5403, -5403, -4482, -3553, -1191, -2750, -6369, -8778, -10713, -8862, -763, 926, 686, 3179, 8521, 4913, 2411, 1027, 3248, 4828, 3504, 2549, 5472, 2868, 6844, 7205, 11073, 12938, 11850, 8109, 2170, -1608, -2616, -6802, -7818, -3566, -1302, -8298, -13303, -16183, -13031, -9370, -7457, -1414, 207, 577, -136, 10198, 8403, 6051, 8368, 12837, 9899, 5213, -3706, -7985, -6169, -1035, -368, 1245, 2740, -1210, -3677, -1524, -1365, -4000, 2617, 2014, -3663, -1937, -1453, -394, -7907, -17457, -13224, -7361, -1767, 2507, -5388, -9650, -10401, -6812, 553, 1815, -2969, -2208, -2592, 4346, 9528, 5226, 2406, 8766, 9180, 4360, 5460, 4581, 1737, 1247, 226, -41, -2299, -1788, 2356, 9675, 8689, 2179, 321, 1882, 6655, 6558, 4566, 2536, 924, 2701, 4817, 2208, -60]
6480f0J473N613l142P35N444l24m632M064j086m304O35j779J68J120M318n469
6464B774m762M358J660j138P83j094n333L804l128o566R568M409k983k222J916
6449B046o772r372j147R741N788M932l49M21j675m420m773M097O848k355q91J08
6433B227m463L87L190R339k647j765n83j931j60O82l97j16J443J654j774o260
6417a174n714k408P918K597K813Q27n584j400K042P03N680l398q69l18k056J575
6401A234K062M147m207k134n106P06L131M626N59q05l218K819K247rN929K711
6385A4692J272m771N68q70J23j768n511J16J86K071Q76n234M837M664M031O55
6369A5937m010m362j39l659n063L84N674N589O84k409K019o166o208J733J075
$$ y = [-60, 1413, 7026, 3884, 4619, 10063, 9739, 5107, 9171, 8085, 3781, 4416, 2637, 2805, 3925, 8243, 2774, -1988, 2370, 4030, 2892, 3675, 2581, -2752, 1052, -2076, -8642, 926, 5335, 2352, 130, 2046, -4726, -14098, -15245, -5504, 284, 5216, 4867, 5288, 3613, -807, -5580, -1483, 5365, 3010, 2119, 2227, -2236, -1849, 1341, 10680, 8033, 6268, 5685, 3754, 3594, 4276, 3879, 3763, 5206, 6860, 5086, -1174, -6888, -9296, -1378, 1219, 4032, 4859, -725, -2125, -83, 620, 6300, 2902, 2033, 1715, -341, 1234, 3296, 7443, 3236, 1102, -4004, -3298, -167, 4459, 5018, 4213, 995, 3814, 6061, 6052, 11981, 14692, 15964, 11193, 11761, 10891, 11014, 9246, 3735, 3851, 4037, 6108, 6984, 1750, 6587, 11251, 15282, 15937, 11927, 7565, 7426, 3767, -1296, -912, 4762, 10351, 11035, 8626, 10645, 4479, -1729, 4, 1079]
6354A079l019J506M381K910n172K280P02j989J18N871l218k794j36n230k921J337
6338d295M055O437M307o213m582L6J473R57R08k997l142L552M98p45L556M33m133
6321A05l525L389K599o209j837O63K332P898n81K378L435l57p191o022p605K40
6305a0288O429O335L383j3L562J45l68l704l666l390j00K753K465P237m019J568
6289H329l069m480l090o41O302K283l977L596J702o972L003O789k683p33j255
6274E104m229N194M109r296L335O706L773o096n890o937l117K337l660L554M828
6259b85L739J315j320l74R97L217q126m561mJ175n87K163J356l992M394L310L643
6242F060L11o912k530M245M53q010l030P54N593j0879k168O913M259M502L477
$$ y = [1079, -1940, -434, 3947, 6857, 1685, 3965, 4667, 2678, 2796, 8667, 5449, 2655, 2519, -2711, -5632, -4295, -240, 6197, 10504, 4291, -291, -255, 1218, 2175, 3083, 86, -3056, 496, 994, 249, 3805, 4238, 105, -3420, -31, 2568, -3641, -5478, -4815, -2483, 5415, 4834, 7212, 10647, 10290, 3099, -2923, -10528, -10288, -3859, 2476, 5859, 5846, 9408, 9553, 9185, 5481, 1815, -1575, -1675, 1078, 3543, 10780, 6761, 8329, 5260, 780, -2310, -2951, 3351, 5634, 1657, 5253, 6955, -17, 2986, 9775, 7092, 6359, 5104, 875, 6069, 10178, 882, 4217, 10923, 14696, 8600, 2710, -4227, -7344, -5007, -8667, -5113, -285, 3454, 4769, 3449, 3075, 4072, 7289, -837, -5398, -5402, -4227, -4814, -2651, -1295, -5287, -893, 2417, 6060, 6371, -541, -3071, 1174, 1627, -6383, -9413, -8659, -3066, -13945, -16113, -9200, -4941, -439, 3038]
6227C038J056m051L633P151K683q514k568L634K817p460j426R320m890k117k966
6212f60K25L831o209J132M263j948o111m091J039J656J649l806J329O17Q183Q143
6196I242P83N066O71n634m337q14j420K886L855j097L860j925k697j468M119o487
6180D603l54K289j626m514M474K876N561p543j0606j808P742J184k483n243L9
6165e409K758m121m88L402J505j666N790P557L88k469J13n09P3K98l809l016k717
6148b320n777N415R125K745l643k719L431o391K860R137K400n262l126j834M499
6133H540P00j909J39M523M035k493o044k135j06Q46K308j236o027j012R00M762
6117E791J811N94L12l486n44j518l932J584j960P73j088J479J615j115J878J924
$$ y = [3038, 4094, 43, 3676, 10827, 13510, 4996, 2428, 6062, 8879, 1419, -7, 9313, 4423, 2306, -660, -435, 3396, -2813, -1681, 2582, 634, -5477, -9568, -8529, -6873, -5224, -9030, -7701, -7084, 1099, 9242, 10025, 15091, 15762, 10128, 5791, 4977, 3557, 6443, 10298, 9201, 13061, 11136, 8439, 6971, 11090, 4603, 4249, 6538, 4912, 398, 4872, 7748, 13309, 5766, -4840, -6648, 1094, 2278, -205, -5448, -5409, -2651, -6772, -7260, -3858, -2353, -4019, 1771, 9328, 9716, 7247, 7360, 6851, 6924, 7222, 3413, 397, -2320, -8097, -2682, 6443, 9188, 5545, 2826, 6257, -134, 2726, 11863, 14263, 9001, 5875, 4041, 8540, 9240, 7331, 7470, 11993, 16028, 13535, 7491, 5356, 5250, 6096, 8404, 7168, 1141, 129, 1029, 5791, 7602, 8196, 8508, 5022, 4478, 2960, -972, 612, -1348, -575, -1663, -184, 1431, 316, 2194, 4118]
6101D118L242j039j963k730j115o050l581K205P159P489R14J858K745j16l425
6086I711l08n028o699Q02n430Q284K109M611m136j106O732L847l525p198l859
6071a193N217J366j81j061l464O8K894n262l709L913k153L687N904k432m880k717
6055d003K369L613Q25J284K441M737n254k440J217Q29m429K410J1792R000j375
6040B3016n110m744o171K135J893j035q072k597O95J163m355p25K090K35K765
6025A183K663L948J975j34q08k168o17L726k465j771p008k889j863M063L97o223
6009g991N45K346k82N155J398k36l789K294k999l576O5j229pO131l274k984L98
5992h035K382K976k669o113L51J1164M759K236O99q976j0189l246Q552q2j819
$$ y = [4118, 7360, 6321, 4358, 1628, 513, -5537, -9118, -6913, 246, 7735, 8649, 10507, 13252, 13136, 9711, 9403, 4375, -2324, -1522, -6952, 1332, 3441, 8052, 3916, 2810, 9542, 13389, 9864, 2666, -1193, 4024, 5390, 5209, 4148, 684, 752, 3646, -1616, -5325, -1412, -3565, 122, 6026, 3594, -1286, -4003, -1634, 1979, 2804, 4088, 6529, 11266, 6012, 3572, 4789, 5618, 1189, 3599, 15391, 24391, 23016, 17906, 13162, 6991, 9126, 11019, 9984, 1912, -685, 10, 1173, -3182, -3907, -1817, -1582, 1183, 3846, 7794, 9769, 9635, 8827, 6659, 6042, 9768, 7303, 5532, -1476, -4365, -6228, -2165, -1768, -7991, -7446, -5100, -5382, -227, 1171, 935, -2854, -560, -3559, -7135, -7070, -8299, -8306, -2175, -5449, -8433, -8035, -5653, -2677, -5346, -11459, -11108, 56, 4815, 7051, 7750, -1226, -11415, -14661, -6109, -6191, -8010]
5977h010L299N851L42l154p693K48J725L932j122k609L776r80L958N20o85K866
5961B264l538k211P179j53k511J12k037k686J0511L909m165J353J305k334r162
5946b164j0650J957P964N914J598O059J496o310m886J256k705j210o567o245R136
5931e357O095L903J54j184m487k306O43K301O8j852l363K221j65P350K963O925
5915A3909K634j899J735j059n031k775l064l789L543l25J480j351M290J957o29
5900I626l867j182n979n405N783J420m360l631O301L89j569L543K220M792p12
5885G369L491l58q338o97L539N736L62K316J772K151n209j131j328K190j696p02
5869I467j557O74K091l65j809J558j28l954k973O854m003j322j914o333n549j349
$$ y = [-8010, -4711, 1140, 1482, -1672, -9365, -9117, -7392, -3460, -4582, -7191, -3415, -4395, -437, 83, -602, 2264, -1274, -3485, 3694, 3541, 1030, 1142, -895, -3581, 6930, 10839, 6674, 8027, 9332, 6998, -2164, -12814, -10857, -2893, 3021, 4619, 10678, 12174, 5864, 978, 2234, -471, -1681, -8248, -14493, -5357, 738, 4641, 4795, 3611, -876, -3182, -2539, -238, -170, -2022, -5385, -3164, -3329, 4021, 6984, 13909, 16543, 14644, 16379, 15320, 10289, 7514, 4450, 661, 4204, 3879, 5359, 4008, 8298, 10255, 9626, 5759, 4577, -1402, -6807, -1024, 396, -3964, -7595, -1294, -905, -2474, 1069, 3289, 8081, 7369, 10860, 10502, 2164, 1467, 5006, 10742, 11104, 13420, 15192, 17343, 12134, 11003, 9675, 11865, 10169, 9467, 7910, 8584, 10675, 10310, 8501, 10059, 9931, 5977, 3004, 9858, 5855, 4533, 2619, -3714, -9263, -10612]
5853a0612j295N436Q931M777n931j0700L12J358K471M865M080j823j76L683p82
5838D594K816K866J42n335j064L962J295K848K109j37j025l036j80o563j137L339
5822E494k33Q16j1531p200K277P92J0517J496p774n066Q70O205K269J375k734
5807b427p12n15l232l380M05L6K809M168L193L157K597J973l493m741k647k541
5791e350j128j695Q070L907P70j318M112K65n041L819M53m361k725j262m097m386
5775i967L326M900N010N864j272k871J879J62j60o330l379O047J443n652o647
5760g647j256K690k3J50n31M604K545J571l796n627k393N168J000M527L445p023
5744b596n03M995N703j755n985m165m948L026O72M642R84p143m196L013M256j630
$$ y = [-10612, -11907, -6471, 2460, 7237, 1306, -9394, -9082, -7724, -5253, -388, 3692, 1869, 1693, 5376, 4594, 7410, 10276, 10418, 5083, 4019, 7981, 9276, 12124, 14233, 14096, 13071, 10035, 9855, 3292, 2155, 5494, 5261, 6077, -5454, -12654, -10377, -9585, 932, 2428, -5346, -10412, -9542, -3337, -1068, 307, -2427, -3139, -3654, -6886, -10266, -9861, -9825, -7016, -2848, 345, 3502, 6099, 8072, 4579, -162, -2809, -5350, -6478, -8173, -103, 3804, 4574, 3256, 7368, 7633, 2592, 6411, 6864, 2503, -222, -1484, -5581, -9967, -6641, -1741, 3269, 9133, 7861, 4990, 6869, 7031, 6871, 541, -2838, 3209, 4652, -1000, -7647, -8903, -6213, -6236, -6086, -6617, -2013, 532, 2103, -1693, -7320, -9713, -4545, -3545, 982, 4427, -2596, -3099, 1896, 7599, 5844, -141, -4306, -9254, -6228, -5556, -914, 70, -7073, -11269, -8256, -4000, -5630]
5728e630L045j575o71P85P065l94l965r942N891J3226K107q75l992p76n88L838
5712G549k582n46N15o53m01K897N60k221m715l632P01n85Q060K215p898m36k91
5695a463j904K468L675l165k687q33K797k087j101m611n602M912Q959K408J229
5680B995J612k641l92K233J293k767J266M42K910N620o491o107K528J773j726
5665B548l371K470J738k07K351m233l041K005M894p016M669O244j0630o828m330
5650a2737K250N208L662N580L400l923r178L335M634N637J553J314j973K924q25
5635A0861l272J810R16m066K115M787n446R45M352K452K854j0277m753J282L442
5620H002l811m205l909J43O532r86L000J291K466m747p572o48j115k441M241K779
$$ y = [-5630, -2585, -4160, -4831, -4046, 3019, 2625, -1340, -11282, -5391, 7835, 9942, 9067, 5075, 4299, 3711, 7549, 4967, 4421, 4936, 4283, 3882, 6779, 7339, 5118, 403, -3229, -2528, -3113, 4947, 7162, -736, -1172, -1463, -3367, -899, 2776, -389, -3076, -3909, -1112, -3199, -4300, -8911, -14513, -9601, -642, 1766, 2995, 4607, 1966, 1574, 3807, 5100, 2333, 3599, 4041, 6951, 12571, 6080, -27, 2501, 4274, 2548, -823, 1647, 3385, 3178, 5529, 1296, -1745, 260, 5154, -1862, 2807, 9051, -1579, -8407, -12737, -10487, -5279, -1617, 3963, 7363, 3440, -5738, -2403, 2231, 7868, 9421, 10735, 8762, 11686, 10861, 7589, 9399, 10315, 6249, 8364, 13151, 7705, 8650, 13002, 15454, 18308, 8031, 3278, 4560, 8002, 4191, -14, -3923, -3780, 2752, 1766, 4766, 6057, 8523, 3776, -3796, -4444, -5559, -8000, -3759, -980]
5604i80K510j401q30J894Q54L730L926o190q69J787m604l501N59K173J300j239
5588h81K832j939P90J449m24J753l732L054n524n553k835J551Q01m541J532O677
5572d990N448K763p884J95q39K561K346M232o09k978j954P775j518k680k674J143
5556C37j287N155M670k521m239k084k326m521M56l676j554M696K814K269R43K561
5540A693J398Q724L524p360n294j173k788J611k984j915j390j834j046j02M730
5525d206O208J1882J0761p258l743m518l349L243k015k089j222J188J270l042
5511C110l0m15k866J486R11m360q138J690L755k032m794L780Q760K850R93q858
5495d158l356K531O114m116Q49N949j788n936J925O475K371j761o56m184n991
$$ y = [-980, 1530, 129, -701, 1193, 2047, 5777, 9703, 3513, 2644, 4431, -173, -3674, -3115, -942, 358, -881, 1951, 12, 802, 2251, 1827, 3580, -152, 2902, -2622, -8175, -11010, -9459, -8658, -13199, -11667, -4990, 458, 3221, -4663, -4468, -5307, -2746, -400, 3832, 3223, 245, -1709, 6066, 4548, 1868, -806, 337, -950, 4205, 8875, 6354, 2115, 31, -2295, -6816, -6360, -10036, -11590, -6894, -4080, -1811, -868, 1693, 3091, 11815, 15339, 7979, 2685, 1512, -1276, 335, -2649, -4564, -5954, -7788, -8834, -8936, -4206, 2002, 13884, 24645, 17387, 13644, 9126, 5777, 9020, 7005, 4916, 3694, 4882, 6152, 3110, 3080, 2665, -201, 1285, 2196, -2164, -10302, -8612, -4857, -6889, -11683, -7903, 857, 3707, 4700, -4158, -7514, -4983, 1131, -2985, -2136, 3813, 2025, -3911, -1986, 4489, 6860, 5099, 4443, 259, -5732]
5480e732K344o623L325O882k658K915k405n19M438K551n636J785L159m731m787
5465e692o189n547L611R503K474Q493m30m766q27R566K811p13L01n214j286L882
5449I977m173n60Q78J384m60k668o288p960K191J388n256o418j869N789O192M636
5433c217M277J185J309l984K287K581j0131n227M743P079M49J206k06n470P7l961
5417g003n431M577j923L997M174L403K880J542m159l88O038J49L320M295k25K373
5401A7619j0807m409o17J513k525k767m105N842L041L210k941K125P366l046o8
5386I431P337j686p733j111j343l738q883j26m120M624k51K983k57L404j5o179
5370g663J196J014J629O250N244L352l707j860L63k057m202L614K913M184j543
$$ y = [-5732, -3388, -10011, -6686, 196, -2462, 453, -1952, -2471, 1967, 4518, -1118, 667, 3826, -905, -5692, -11881, -17428, -13817, -4314, -1840, 6653, 6223, 1457, 630, 10196, 13007, 12294, 12595, 7381, 6095, 9977, 5804, 5244, 6122, 7506, 7046, 4378, -1910, -9870, -7679, -6291, -11547, -17965, -19834, -14045, -7853, -3217, 1060, 2245, 3554, -430, 1857, 4438, -5693, -10920, -6177, 902, 1351, 2557, 2351, -3119, -3042, -7003, -12434, -7857, -9780, -5783, -1609, 1794, 4674, 6216, 2057, 1669, 7707, 7856, 11176, 15471, 15246, 17619, 6812, 2403, 1786, 3299, 774, -1993, -6098, -256, 2785, 5995, 3054, 5179, 12545, 9499, 9431, 16768, 15082, 7349, 6238, 4895, 1157, -7726, -7852, -11972, -7348, -7599, -4616, -4873, -1469, -1484, -7663, -6467, -5453, -3824, 2426, 7670, 11022, 7315, 5455, 5818, 3761, -441, 3173, 6086, 10270, 8727]
5355H727O17n0O82l222p061N615K279l357L847l174o648k319j89J787L376j682
5339g72m2j398m143j153l308M015P772k45M21l11M850J254o588k292O42r29J234
5322i93L029m83M053j107N401O30p052l67m125n320O344L198J629J190j538p58
5306C731j60j904l788J017K454K612L399J524m353r483l695M973J30n85j879M33
5290e574R929j869K066o69j092r2l915J405O31k559J080J917J253o02p733O28
5274e196K730O879q77j78J815K261K831j446m647k054N380N664p08n186m505k972
5258b09J574p45M37J334J87K527n950j495N599Q05j142l737k807q34p57l185j48
5241h546L774J534L00L830O65J757m212J659K978L839o75L76j678l328l536q16
$$ y = [8727, 9344, 9294, 9976, 6754, -307, 5308, 7587, 4230, 8077, 4903, -1745, -4064, -4253, -2466, 910, -772, -814, -2212, -6355, -7508, -10816, -6801, 971, 726, 1147, 836, 5686, 6940, 352, -1940, -1298, -2227, -993, 2036, 1553, 5606, 4499, 9900, 10530, 3478, 3111, -1014, -6334, 10, 3208, 4837, 6027, 4489, 3731, 3571, 1667, -2121, -1104, 1350, 3962, 7361, 8885, 4532, -4951, -8646, -3673, -3543, -4128, -6007, -5574, 4355, 2486, 4552, 3883, 2791, 2699, -1216, 189, 820, -1739, -659, 1258, 2511, 1909, -5824, -5196, -2466, 4413, 3536, 3358, 5173, 7434, 10265, 8819, 4172, 2118, 7498, 13162, 12454, 7268, 2763, -209, 1365, 620, 1057, 2391, 2578, 5105, -845, -2340, 3259, 4064, 2922, -815, -3622, -4456, -5213, -8398, -8546, -4772, -3238, -2938, 892, 1557, 3314, -898, 761, 3739, 7578, 6903, 7279, 5601, 2273, -1263, -2079]
5225b079Q85P238J258o180k776K46l520K893M68P6M373k383M817K409J52n614
5209B263m913L87M032k940q6J222l022l21l968K545M865K074m210l8K593J572
5193B055k057K152j53K365O157m252l302n706R577K242J612j97n326m33p250k274
5177d790M790K247J522q36o891j65p70J365N246j349J191J713j530l953N045J351
5161D186j034n227k983L522K56r92k578P642O123L088L286p283l823j240m932
5146a989j30L181M203J262M28l74k025m92j228l927n050J023k20j924M793N818
5130C349j379n461p465L982K724m198K41K006J519K065N853j577K339Q252K319
5115A4569m261j2401l658q60J525M737N622N96p001j6N780O744m072j903Q105
$$ y = [-2079, -1194, 6044, 7302, 1122, -1654, -1408, -4928, -2035, -1567, -1491, 2882, 499, 5316, 7725, 7877, 2263, -2650, -2263, 1769, -1171, -1257, -35, -3057, -3378, -7346, -4801, 64, 2138, -2072, -2110, 483, 2055, -2, 2150, 1997, 4362, 10519, 6267, 2965, -2741, 6836, 9078, 10690, 10493, 5167, 4734, -2516, -4790, 0, 2247, 3769, 2933, -3958, -4123, -4893, -3528, 1718, 369, 1560, 3273, 1743, -2210, 2835, 4186, 3152, -2075, -5058, -1536, -1280, -2272, -4850, 2792, 8915, 12003, 15289, 8006, 4183, 2943, -1989, -2119, 1062, 5265, 6527, 6955, 6581, 4556, 4064, 2836, -1091, -6141, -5118, -5338, -7262, -2469, 3349, 1970, -3491, -10956, -6974, -4250, -8448, -8207, -6201, -4682, -2617, 3236, 1659, 3998, 12250, 14569, 10308, -2093, -5751, -6611, -5086, -349, 5273, 5869, -1132, -1148, 4632, 11376, 7304, 5401, 13506]
5100A3506K439l036n027m575K454K461l903j25J711r8O21n37j650j155Q76N846
5084I808J088M750P40p670l958J963P79n524m979j896J461j75j782R394N310o534
5068B775p72M190n71J664L41m999l169J975j682J371j339j459l488M497P338O791
5052A3463l58l699N51o291k546l475m97P100l908l126n987p71M215P327L668k824
5036B842l346N672M667J653j0495k101M241L906K048k664n54J487J056l930J381
5021E863p501L565P827L417k062m425Q76J246j088j245j314r109m570J711J526
5006e283J890j809L330L352O123j089K657l34J101p734p932P84J84P643k340L689
4990D232J819m383n535J503k826M368J451l491L499j391J550J226l147K418j025
$$ y = [13506, 15945, 12909, 7882, 3307, 5761, 8222, 4319, 4194, 5905, 5807, 6428, 5891, 4241, 3086, 3962, 9808, 10896, 15646, 16386, 8716, 4758, 6721, 7500, 1976, -3003, -4899, -3438, -3613, -5395, 3999, 9309, 2775, 2003, 6193, 5622, 7286, 7627, 2628, -541, 1434, -248, 1123, -216, -1675, -5163, -666, 6672, 13463, 13105, 9406, 9957, 3666, 1120, -2355, -2852, 4248, 340, -2786, -8773, -9544, -5329, 1998, 5666, 2842, -504, 5168, 9835, 11488, 993, -1108, 3133, 7039, 9087, 6423, 5869, 7356, 8412, 4482, 5863, -1638, 1927, 9754, 13171, 11109, 6684, 7560, 8806, 7718, 6473, 5159, -3950, -8520, -6809, -5283, -3393, -5202, -1872, 1480, 7603, 6514, 9171, 8837, 9938, 2204, -5728, -4944, -4760, 2883, 543, 4232, 6051, 1668, -3867, -2364, -5190, -822, 629, -2862, 637, -754, 796, 2022, -1125, 1293, 268]
4975B68L243k581o655o27M688K264l285P8l583p94k217M211M472M643J872k094
4959C903k213K650M051k496j0450n709k088L726l146j323J440R345N958j945r48
4944G55N358n55l289O365O552k051j099m32o153k284Q28M276K314k280l555m869
4928a19m835m505M969N191M832k09l874K68K377J322K318o40K26L31l185j229
4912C238j890n739L613R003R98l450q37q019o200L065J263O644N158m082r379
4897f614q551k348Q483M832j69j770l192Q695M144R68l674l130m45L00M374J572
4881C475m668P57J126N142R883l429l45o91L42J690J265m772L717m515p927q90
4865A60J36R95j72j979j547j889J179J940k841q832P82N528J576J0147l163o435
$$ y = [268, 3511, 930, -5725, -6352, -1664, 600, -2685, -2607, -6190, -6984, -9201, -4990, -518, 4125, 5997, 3903, 1690, 4340, 8391, 5895, -4555, -10264, -12352, -8626, -11772, -13095, -11655, -2310, 3648, 1703, 755, 6113, 5558, 2269, 8634, 15186, 13135, 12036, 11604, 5451, 3167, 3995, 8271, 10585, 8305, 4750, -119, -4954, -9459, -4490, 701, 5533, 5324, 1450, 1718, 4095, 5417, 7735, 7095, 7321, 7652, 4467, 3238, 1348, -4391, -778, 8225, 9223, 5773, 4936, -3083, -9283, -6218, -4955, 1689, 6847, 2765, -6614, -15165, -17513, -9030, -4198, -4367, -6137, -9329, -634, 3510, 4478, 804, -2326, -2771, -2471, 1903, 3475, -1193, -436, 690, 5832, 15715, 12286, 11941, 11250, 11592, 13282, 14547, 9775, 13492, 8977, 1050, 160, 296, 1291, 1119, -860, -2407, -4296, -3117, -1177, -4018, -12850, -12068, -6540, -4964, 5183, 2020, -4415]
4849d415k670J161n21n193n413j87J0728M884l312%N264M9P18M707k795n383M290
4832A912P18N311K968k920p562k31K325M595J253R09l085k811L839L900m537k496
4816D088L46J664q377n233K27J012Q877n718K086J0018j44k135k373m150n924
4801e736l865K058j388j463l753J684P26N954O636j237l694M273K410n989n981
4786i365N502P36L752o281k933P463j44l37J791M229N415M353N134o518j2108
4771F89n777m153J75M022l05k054J625M068n089Q21O026P809n99l620l79j865
4755A394j058r53K311L965q12m150L948Q949p72k317k151k412j045j22l621l272
4739b118J622j594j917r91J004P540K660J052m927j980L295m285n820m105K301
$$ y = [-4415, -7085, -5924, -6445, -11638, -17051, -17238, -6510, -1626, -4938, -4938, 326, 375, 1093, 5800, 3005, -2378, 1912, 2630, 7941, 10909, 7989, 427, 196, 2521, 7116, 8369, 9278, 6193, 3382, 7221, 11121, 6584, 4088, 4434, 6098, -2279, -7512, -7285, -6273, 2604, -3114, -1028, 8990, 8846, 6711, 4338, 188, -5736, -9601, -7543, -8931, -10394, -14147, -12463, -11737, -5783, 853, -384, -4078, 195, 2605, -3384, -9365, -3863, -3127, 625, -5656, -8589, -1126, -1270, -1607, 184, 4413, 9828, 14181, 19315, 12797, 689, -5088, -9241, -9066, -5044, -5349, -7403, -5778, -1710, -6799, -5978, 48, 7857, 7258, 3638, 3259, 1394, 336, -617, 1694, 5659, 4847, 697, 4645, 13594, 12822, 10505, 8354, 5942, 4897, 4775, 1154, -2118, -496, -2090, -4007, -4998, -3994, 3546, 6206, 7258, 2331, 351, 3646, -639, -6459, -10564, -8263]
4724h263l211Q832M364K860P017m060m06k399j182M469O1o048L46R22j121M570
4708F751Q68M18O47k946n514l275k044J949R281k311l408O460q11j693n62N070
4692H880L56l547l426K953R495L476m235n299n440l526N026L597o037j463L3m93
4676C50j149q001K949J0791j019n381J489R03L3j1K290J363L609n41k382K85n94
4659D984K04K120j355j765o763J260j5K036n083N471J7k111O493L310j874K673
4643I602J63m027k397M735N703o743l732j155j206k743j926J968k582m49k91P87
4627d293N825N05L98l746M56n567L314P117q50k915K487K513J773k495k292O418
4611H648P246r160n307J796j910m489j405O423j4k909j266p83p604n364k454N036
$$ y = [-8263, -11474, -2642, 1722, 4582, 11599, 7539, 7133, 4734, 3552, 8021, 8082, 2034, 2380, 3302, 2181, 6751, 7619, 8037, 8684, 5738, 224, -3051, -5095, -3146, 6135, 3824, 416, 6876, 6065, 4372, 3810, 8880, 9236, 5689, 2263, 5216, 14711, 18187, 13952, 8653, 3213, -313, 4713, 8310, 2273, 810, 843, 350, -799, -8800, -5851, 4940, 3921, -1460, 29, 932, 965, 954, 3244, 4607, 8216, 7675, 5293, 5578, 4984, 5188, 7308, 5953, 4188, -2575, -1315, -1330, 706, -4377, 1094, 1111, -1000, 5493, 8803, 6929, 9602, 9765, 5738, 3341, 8076, 13779, 7036, 3304, 2149, 943, -1800, -3726, -1758, -4340, -4789, -5080, -4293, 1532, 2037, 2435, -1311, -855, -6422, -3108, 4009, 3159, 244, 2731, 5244, 7017, 4522, 2230, 8648, 15894, 6734, 1427, 3223, 1313, -3176, -4581, 1842, 1828, -1081, -2347, -3130, -10734, -16098, -18552, -13516]
4595a3516R390M210n102k501J544K003J238n87O315L749K592K298m221m985p48
4580A679L683j256M74k130p842n14L561N089K855l045l886L524K861m74N357O275
4564A6211j813q504k34K607j294n789Q42J180j147L113L44l69J993j629m098l927
4548b514J34n152n36K834K087Q06M916k020l681O492O383q988m206k217J978O880
4532C196N398K129j87n095o539l462J611L623r029k816P51M509m98M592N556l218
4516E21J116K724N548m695k878K582K325J826j888o823J606r03j735p71K46n15
4500a714K986m116K18J1927L127R16J819j660k693n207n686M458L821l459n255
4485e18R3L036m244j277j565k14Q273L230k204m531L352O504M177q512o990l177
$$ y = [-13516, -4126, 84, -5018, -7519, -5975, -3972, -2734, -3321, 2994, 6743, 9335, 11633, 7412, 2427, 1679, 5362, 4106, 4580, 2450, -5392, -5906, -2345, 2744, 5599, 2554, -1332, 2192, 5053, 4579, 9936, 16211, 14398, 5894, 5660, 8267, 6973, 1184, 2026, 3206, 2059, 5172, 5516, 5147, 7140, 5511, 1413, -2514, -2380, -7532, -8068, -5234, -3147, -2341, 2575, 555, -3126, 3366, 9749, 761, -3445, -5662, -3684, 3196, 8594, 10723, 10536, 5441, -1098, -4560, -2949, 674, -8355, -11171, -10420, -5911, -6409, -1817, 3739, 521, 1637, 4361, 9909, 5214, 2336, 4918, 7243, 9069, 7181, 358, 1964, 1061, -674, -1445, -1199, -1714, 1272, -2844, -2626, 9301, 12428, 13344, 15163, 13503, 10810, 5603, -83, 4375, 8196, 4737, -518, -425, 2611, -1633, -2910, -4475, -4689, 3584, 6814, 4610, 79, 3431, 9935, 14112, 5600, -1390, -4567]
4469d567J512J590o41l876k084j366L288r12N659J724l45j967N992O039o166k676
4453A204p63P25L847l189n910k220K682j628m441J829J152k507j635M994L968
4438a892J355L830o815j3063M1Q186K627K449k072j480l243K807K934O238L865
4423E767k803N721k441n402K329K318k061n327j972n76L019P033j524J089P329
4408A2499O564J119p30o456k400N148p367J17L207j589j3558l119Q511M034L035
4393I015N455M821m664m295O156l304r012Q02N913L500m536J057m712m352N76
4378B420k390K214K397J360k332o19J986Q80q726r197M071O158K166K338K300
4363E026K565N18r44m979n085p02m290Q562L125l660J673j083j243J405M96m403
$$ y = [-4567, -3055, -1465, -2106, -5982, -8066, -9432, -6144, -7056, -1397, 327, -18, -1985, 4007, 10046, 3880, 1204, 441, 1166, 5013, 1824, -4086, -6306, -3624, -5252, -9693, -7864, -6712, -9219, -10854, -5860, -1892, -537, 3293, -3522, -16585, -16544, -8358, -5731, -3282, -5354, -6834, -10077, -7270, -4336, 1902, 5767, 2964, 8685, 6244, 842, 3171, 5489, 3428, -1899, -3871, -4447, -1428, 5605, 4081, 5170, 12499, 19063, 20182, 19452, 12996, 10596, 15744, 8377, 8494, 11701, 10112, -3446, -6565, 1946, 5980, 9015, 14470, 19291, 14627, 10332, 16488, 13184, 4172, 4974, 10887, 14387, 9851, 10908, 6196, 1844, 2420, 30, 2244, 4641, 6001, 3669, 3050, 5036, 5916, -2810, -12007, -7936, -1778, 388, 2726, 5026, 7591, 8109, 7165, 2186, -2899, -3601, -7891, 671, 3796, 136, 1809, 726, -517, 888, 1384, -3019]
4347c019J228M525N257P34K341J145k737k727l554m058n045l228M057K587K501
4332GN74L602j51j409N571K844n935j1102M551M764m074K884K14n179p257O590
4316c506J0592M68l674J267J136o81J281k060l306m57j178M282K090o122n498
4301e366R24Q31M809L70j626K572l735o027O504Q389l78k532j1408P62O130J0904
4285A1123m91m995J686o768k122K764J109J165l55j990N924J099M02l74k016K629
4269H790j837m488P916R422J799l469m240p950l77n105p020K956L836K141N752
4254H126k99k741k920K871n51m805O64L093p453k355K221L239P82m604o319K843
4238h208J3127N059m210J217M930l280l661K602k084k851o327n534K1J1303O196
$$ y = [-3019, -1791, 2734, 7991, 8725, 11066, 12211, 9474, 6747, 3193, -865, -5910, -9138, -5081, -2494, 7, 581, 4183, 4032, 2623, 8194, 11038, 5103, -5999, -1448, 3316, -758, 2126, 2340, -2839, -10096, -3506, 7086, 7554, 3880, 5147, 6283, 5602, 6883, 4823, 1517, 1060, -118, 4164, 6254, 132, -5366, -4442, -3611, 1198, 1568, -58, 2514, -1221, -7248, -744, 7645, 7267, 4735, -6673, -5911, 219, 11123, 10632, 5637, 7323, 555, -1567, 1197, 2306, 3471, 3116, 1126, 7050, 8149, 8551, 8177, 6161, 8790, 6953, 2465, 10381, 19803, 21602, 18133, 13893, 5943, 5566, 461, -6559, -3603, 233, 2374, 8126, 7827, 5086, 2166, 5037, 4486, -319, 345, 3438, -4015, -6370, -4149, -910, -128, -4732, -11051, -8208, 4919, 9978, 5768, 6985, 11915, 8635, 4974, 7576, 5492, 2641, -3686, -9220, -9199, 2104, 8300]
4223H300k558j033M978O12m781O75J010M175l285K705m044o411k879l50K264k222
4207b844n798K255j757L189P950N455m794o600k221L619K912J880o75K533j14
4192D990k249l844K119L289J085l888J914m60M729K433n46j006o445L177l105
4177B193j452O803J022k115J5m319K068O142l097J289j579o902N617k558j51J428
4161D404O11l408l91n304L641M074O474l65m046q52K195J556k98J914O62J570
4145A2437j0426k19l224J95k250k426N153P291k075k041k267J794J859n042q38
4130b079N924n225j2147M615N181r81L241k321M846L129o528l464O82J232J0113
4115F218R818k851q965j511J458M724j957m528j656N838l61K293l652Q83m690
$$ y = [8300, 5742, 4709, 9687, 10299, 5518, 6193, 7203, 11378, 8093, 10798, 6754, 343, -2536, -2886, -622, -2844, -8642, -6387, -8144, -4955, 2995, 8450, 3656, -2944, -5165, -1546, 1366, 3246, 2571, 5104, 4990, 2741, -1103, 1016, 4305, 5390, 1502, 3416, 2956, 7685, 10118, 9572, 8566, 2121, 5298, 2193, 741, 7544, 8566, 6451, 6466, 2147, 4215, 10357, 7260, 8549, 6970, 68, 5685, 3127, 2976, 4404, 5015, 1607, 1216, -4088, -447, 3627, 10101, 9736, 5690, 4838, 7033, 8589, 8291, 10205, 10867, 12437, 2011, 1792, -1432, -1237, -3487, -5913, -760, 6531, 4456, 2415, 148, 1942, 3801, -1241, -2079, 3845, -1380, -13527, -8912, -3731, -4712, -1471, -3792, 1054, 4183, -2345, -5809, -5127, -3895, 6218, 16036, 13185, 4220, 2709, 4167, 8891, 6934, 2406, 750, 6588, 6227, 8520, 4868, 5751, 1061]
4100A061l366n183K117K524M521L011O093m530j14l090o49j408J628m185k103
4085c673J957M924J47m882O65K22K134J517p43N394K671J50m585l344n00m270
4069b216J368K842J541r05J542O575l021m819k965k141j664q333P17R081K186
4054b12m818k003O1R83k265J968j402j851k2Q918O829j648j764n70J062j903k170
4037h07N812k153R46l488K155O050l308p531n089M750L870l296N827j299M238
4022F677K225J906L099m798n003k750J762p31m824l105P599L495K29K192K932
4007A0905n927n871l530n050J259K226L095k742r49K287K822Q636K985l654k383
3992D109l501k529k827R083M160o872j717j976m392l686N754j296m143L401K19
$$ y = [1061, -2305, -7488, -5371, -2847, 1674, 4685, 10778, 6248, 6134, 3044, 2395, 987, 2615, -1570, -3673, -1716, 3208, 3355, -1527, -862, -640, 1494, 3011, 2268, 7662, 10333, 10483, 5898, 2554, 2054, -2216, -848, 1994, 3535, 2630, 4172, 10747, 7726, 2907, -58, -2199, -3863, -12196, -11479, -2398, -212, -5030, -7033, -6972, -5989, -8254, -6286, -7688, -9539, -9561, -643, 6186, 4538, 2774, 2204, 3266, 1363, -807, 5005, 2852, 3798, 310, 2465, 8515, 5207, -2324, -7413, -2663, 1207, -2089, 3738, 2439, 6677, 8902, 10808, 13907, 9109, 4106, 1356, 3118, 2387, -2437, -5542, 2057, 5552, 5781, 7973, 10905, 4978, -893, -4423, -9473, -8214, -5988, -2893, -5635, -6584, -4297, -1475, 7161, 10146, 6492, 4109, 608, -1921, -4748, 4335, 8495, 1623, -94, -2070, -6462, -10148, -4394, -5690, -9833, -6432, -6213]
3977f213k57m374j335O647M694J300M12k798l236K362R451K456k071p494o403
3962f859L505P338J947J152j971l76l10J621l930q71l591l348O568O115J489n91
3946G888K80j630q0o960j997R19M292O272J184m019J14m229L604O706J593J291
3930A5228j256m958p524k765K925j925L435m474M046n61M35J4r95m167k096O895
3914B257M378l931p644J207N521o123n64K706l646K036M398m210j39M802K369
3899C417j553j923L025k123M180M474p912l691n284J834k742j236O057r17K882
3884a512j000O059K27j664L815J381l914k778m349n704P99q44M797K9N554N462
3868F358n683m56O90j724k723J216r1l91J26N758n88q94J48m088l961L472l861
$$ y = [-6213, -6470, -10844, -12179, -5532, -838, 462, 874, -1924, -5160, -2798, 6653, 9109, 7038, -456, -6859, -3354, 3984, 5931, 7083, 5112, 4736, 4426, 6047, 2117, 1246, -2345, -5693, 875, 6990, 8479, 7888, 8168, 6538, 6458, -502, -2499, -1580, 2712, 8984, 10168, 6149, 6263, 2034, 5638, 12344, 13937, 15228, 13972, 9014, 1490, -1275, 1650, -275, 3160, -1314, 2732, 2171, 2606, 2620, 1625, -2542, -4638, 2257, 6635, 2704, -4940, -3733, 1788, -4335, -4899, -2193, -5839, -3803, 595, -3615, -3754, 1048, 3417, 1864, -59, 2966, 843, 5023, 9497, 1585, -2106, -7390, -5556, -8298, -9534, -3477, -4394, -1512, -2512, 3547, 3774, 2110, 5925, 7306, 3392, 614, -3735, -9439, -8640, -9484, -4687, -4658, 896, 6358, 675, 219, 909, -815, -3538, -2322, -2413, -2804, -2678, 3080, 2492, 1598, 1746, -2342, -6303, -2831, -6692]
3851f692n077q07l032Q517J1680J55k381K572j90m477r66N106l19M56k252J058
3835C351j062j809j729m812J526J0394k042o554L901o12l905j248K794j447M02
3820b852K431O218P99n128m946R10L349j741j427L044M535j082k162K421P690
3805A2059L36j109m051K146r19j0274p519M342P952j285j503l07P2M80L481m90
3789C411L199N973l415m465P23l938j107j765Q60K433J107J781M221R43R06K281
3773A3148j055p402n737o527k877O465P812m345k857l417k694J1539J702j807
3759A948q88N396J899q359j920n12j877Q57K775M082o627P98O240L196k049l167
3743A792m581k742N729L163M131L384J760j541l587k681J05J839N666k232Q71
$$ y = [-6692, -11769, -12576, -15608, -7091, 4589, 4744, 2363, 4935, 4745, 268, -698, 4408, 4089, 4545, 2293, 3351, 2289, 480, -1249, -6061, -4535, 5859, 3817, -2737, 1164, 552, -3353, -4601, -1807, -3254, -2852, -421, 5797, 6596, 1468, -3478, -2568, 781, -960, -2387, 657, 5192, 4110, 1948, 4369, 12059, 12395, 11286, 7235, 9381, 8462, -1812, -9331, -4989, 2963, 1678, 175, -132, -60, 420, 3901, 3411, 6610, 12583, 9168, 4703, 5426, 1488, 381, -1384, -524, 1909, 3016, 4797, 9018, 9961, 10867, 13148, 12093, 4691, -1046, -7573, -10450, -3985, 3827, -518, -3375, -6792, -9486, 2053, 3755, 1948, 1060, 6456, 8355, -4, -1924, -2436, -4313, -3456, -681, 3401, -3226, -2428, 3812, 7008, 4959, 1792, -2789, -5531, 198, 3361, 7492, 10876, 12636, 11095, 7508, 4827, 4932, 6771, 12437, 10205, 11076]
3728A1076J777m211r71k185J87j124o873M487M538o624p566L734Q121j138l320
3713i2J980J164k900L148J359L205k491J019j600O02q16l777j143k42L947K741
3697F104K474J056J071q80l059l19Q39k521p77k975L460N6J423K124M970l63p293
3680E390l558n612J855J816j6J153p629N84j561K848j826R95O736j48N187Q46
3664G060M84L113j880j707K289k988P27o257r429O75M582N867L297J563o940L649
3648D105k404l258k179n396n241k196O329K718J760K708p71k076M134L332k599
3633a034k304J7J673K559j657Q64J465j070n685o207l299P208M74n2j70N597K104
3616D83n430k369M754K837J713l708l928q501K288L063q60m01K95n114K820K690
$$ y = [11076, 12853, 8642, 7671, 5486, 5673, 4549, -2324, 2163, 6701, 77, -7489, -3755, 4366, 3228, -92, 1888, 3052, 152, 3300, 4659, 7864, 5373, 6392, 4792, 5394, 4578, 801, -342, -584, 3363, 6104, 8578, 9634, 10705, 9825, 6766, 6447, 7286, 4765, 3988, 1013, 4473, 4529, 5952, 8076, 13046, 12683, 5390, 1832, -3780, -1925, -109, -125, 1028, -6601, -6017, -7578, -4730, -6556, -5561, 1175, 1027, 6214, 7060, 7544, 10657, 8777, 7070, 9359, 6371, 7098, 841, -8588, -7913, -3331, 2536, 5833, 7396, 456, 4105, 1701, -1557, -3736, -9132, -14373, -16569, -10240, -7522, -5762, -3054, -3825, -5901, -1767, 1565, -1034, -3338, -3321, -1648, 911, -746, 118, 1583, 513, -5172, -11379, -14678, -7470, -6996, -7048, -7218, -1621, 483, -4947, -7316, -2562, 275, 1988, -1720, -5648, -14149, -11861, -8798, -9658, -10059, -9764, -14878, -12058, -9368]
3600i368K821J539N303n187j0036l311M368L351l726k112K488K165m284M847J3581
3585B439J575L039R31j788j901M934J00m017k420k599J541Q77M293r16L188m378
3569D898m623n32j231Q6J078p797p604N289K437P66O61K971J69Q747P02k403m13
3552C201m066l944k784K357o13J706N550m77n650O75K311M657l986l958J109N912
3536B000k843n810K157J538K696J859j990j237j967L391M474k244J26K431k639
3521A942m38l553k42q8N09k846r19J198N18m38K122P698L977n281J262j38j947
3504C336o282k708L745M138m162j178K110K758Q11l124l920L675K049l052Q62
3489i42m338l08O436M336J127l327j164L019n64p159p955L373k659J187j473j257
$$ y = [-9368, -6547, -5008, 295, -4892, -14928, -18239, -13871, -10520, -14246, -16358, -13870, -11705, -15989, -11142, 2439, 4014, 7053, 7984, 6196, 4295, 9229, 9329, 5312, 2892, 293, 1834, 2711, 7004, 6088, 9276, 4898, 275, -257, -1488, -1402, -324, -8121, -15725, -10436, -7999, -7233, -6572, -3601, -3432, 5315, 6017, 3614, 3201, -865, -4809, -7593, -5236, -5849, -4143, 1407, 930, -4720, -4045, -1734, 2923, -1063, -5021, -3912, 2000, -843, -6653, -4496, -2958, -262, 1597, -393, -1630, -3597, -206, 4268, 2024, 2150, 4581, 1942, 1504, -2049, -2291, -2379, -1870, -4716, -5635, -4437, -3919, -4357, -2235, 5463, 9440, 4159, 5421, 5283, 3336, -2946, -5654, -1909, 2229, -1933, -3111, -1001, 1757, 2568, -556, -4476, -801, 1248, -1804, -942, -5280, -5588, 848, 5184, 6311, 2984, 1820, 4839, 4275, -2884, -10839, -7466, -10125, -8938, -10411, -11668]
3473a1668K591J0022J706K809o79L309O22k888r763m073j491L941L180J745j072
3458a709L748L901k874o06P938j139l573P045j292J92L088q97k735n492j550P058
3442A1103p54q018M454K675n846m90l521O38L812L32K219q132l110p64k461J815
3426f048M136L956r10L020j782j634O014N513m766n252p025J615P519M677j43
3411H890m088l785L707L626J222k652n875j0068l864M607M218N647m234j28l003
3396e780nj697L662j204l919L412Q211O241l379k738k919o99j138O93n912j370
3380h541M383K423j968j575J633L114K816M419n160m367k455P441K760K299N184
$$ y = [-11668, -9077, 945, 2651, 5460, 4781, 8090, 8712, 5824, -3939, -8012, -9503, -5562, -2382, -637, -1709, 2039, 5940, 3066, 2460, 10398, 9259, 5686, 12731, 11439, 11631, 14719, 13822, 11087, 5595, 4045, 11103, 10349, 2331, 6785, 9460, 3614, 3124, -397, 241, 4053, 4385, 6604, -1528, -4638, -5402, -7863, -6048, -1912, 2044, 1134, 4154, 2372, 738, 6752, 12265, 7499, 2247, -4778, -3163, 4356, 9033, 8890, 4802, 1017, 4724, 8350, 9572, 6920, 1045, -9023, -12887, -8280, -4062, 1585, -2649, -2777, -5780, -5785, -7482, -3820, -5024, -8943, -5531, 2680, 8921, 5542, 2804, -115, -814, -1952, -1259, -7171, -8541, -4158, -1735, -3703, -5278, -3645, -531, 2285, 6704, 1544, -2823, -5278, 2163, 4923, 7222, 12406]
$$ [...]
##END NTUPLES=NMR SPECTRUM
##END=
