##TITLE=Analysis number 313132
Compound Code cc 01102
Book Reference 378/94
Project Code adrs
Chemist Name benw
##JCAMPDX= 6.0         $$ Bruker NMR JCAMP-DX V2.0
##DATA TYPE= NMR SPECTRUM
##DATA CLASS= NTUPLES
##ORIGIN= Bruker BioSpin GmbH
##OWNER= NMR
$$ XWIN-NMR		Version 3.5
$$ Thu Aug 25 11:28:05 2005 GMT Daylight Time (UT+1h)  MAYBRIDGE\NMR@NMR_250MHZ
##.OBSERVE FREQUENCY= 250.131544655141
##.OBSERVE NUCLEUS= ^1H
##.ACQUISITION MODE= SIMULTANEOUS (DQD)
##.ACQUISITION SCHEME= undefined
##.AVERAGES= 16
##.DIGITISER RES= 18
##SPECTROMETER/DATA SYSTEM= dpx250
##.PULSE SEQUENCE= zg30
##.SOLVENT NAME= CDCl3
##.SHIFT REFERENCE= (INTERNAL, CDCl3, 0, 16.522)
##AUDIT TRAIL= $$ (NUMBER, WHEN, WHO, WHERE, WHAT)
$$ ##TITLE= Audit trail, XWIN-NMR		Version 3.5
$$ ##JCAMPDX= 5.01
$$ ##ORIGIN= Bruker BioSpin GmbH
$$ ##OWNER= NMR
$$ C:\u/data/dgb/nmr/ADRS/8620/pdata/1/auditp.txt
$$ ##AUDIT TRAIL=  $$ (NUMBER, WHEN, WHO, WHERE, WHAT)
(   1,<2005-08-25 11:27:42.83 +100>,<MAYBRIDGE\NMR>,<NMR_250MHZ>,
      <created by zg, POWCHK disabled, PULCHK disabled
       configuration hash MD5:
       62 19 C7 07 E1 42 D1 B7 37 6C 3D D0 77 39 F9 E6
       data hash MD5: 64K
       63 EF A8 14 3C 02 3F 9C F6 65 D7 53 4B 28 38 74>)
(   2,<2005-08-25 11:27:55.30 +100>,<MAYBRIDGE\NMR>,<NMR_250MHZ>,
      <Start of raw data processing
       ef LB = 0.3 FT_mod = 6 PKNL = 1 SI = 32K 
       data hash MD5: 32K
       DC 13 96 01 89 13 A8 08 65 DA ED DF 06 48 88 E3>)
(   3,<2005-08-25 11:27:57.33 +100>,<MAYBRIDGE\NMR>,<NMR_250MHZ>,
      <apk 
       data hash MD5: 32K
       81 A6 56 E7 C3 24 E9 F6 25 9F 21 23 85 70 EB C2>)
(   4,<2005-08-25 11:27:58.30 +100>,<MAYBRIDGE\NMR>,<NMR_250MHZ>,
      <abs ABSG = 5 
       data hash MD5: 32K
       6F 6C 84 F9 05 28 EA 0B F1 B4 CE 9A 5E 20 C2 F9>)
$$ ##END=
$$ 
$$ hash MD5
$$ DE 62 23 4B 16 B5 FD 7F FD 01 24 B2 39 7E 21 83
##$RELAX= 
##$RELAX= 
##$RELAX= 
##$RELAX= 
##$RELAX= 
##$RELAX= 
##$RELAX= 
$$ Bruker specific parameters
$$ --------------------------
##$DU= <C:\u>
##$EXPNO= 8620
##$NAME= <ADRS>
##$PROCNO= 1
##$TYPE= <nmr>
##$USER= <dgb>
##$AMP= (0..31)
100 100 100 100 100 100 100 100 100 100 100 100 100 100 100 100 100 100 
100 100 100 100 100 100 100 100 100 100 100 100 100 100 
##$AQSEQ= 0
##$AQ_mod= 3
##$AUNM= <au_zg>
##$AUTOPOS= <14 >
##$BF1= 250.13
##$BF2= 250.13
##$BF3= 250.13
##$BF4= 250.13
##$BF5= 500.13
##$BF6= 500.13
##$BF7= 500.13
##$BF8= 500.13
##$BYTORDA= 1
##$CFDGTYP= 0
##$CFRGTYP= 5
##$CHEMSTR= <none>
##$CNST= (0..31)
1 1 145 1 1 1 1 1 1 1 1 1 1 1 1 1 1 1 1 1 1 1 1 1 1 1 1 1 1 1 1 1 
##$CPDPRG= <>
##$CPDPRG1= <>
##$CPDPRG2= <>
##$CPDPRG3= <>
##$CPDPRG4= <mlev>
##$CPDPRG5= <mlev>
##$CPDPRG6= <mlev>
##$CPDPRG7= <mlev>
##$CPDPRG8= <mlev>
##$CPDPRGB= <>
##$CPDPRGT= <>
##$D= (0..31)
0 1 0 0 0 0 0 0 0 0.06 0 0 0 0 0 0 0.0002 0 0 0 0 0 0 0 0 0 0 0 0 0 0 
0 
##$DATE= 1124965661
##$DBL= (0..7)
120 120 120 120 120 120 120 120 
##$DBP= (0..7)
150 150 150 150 150 150 150 150 
##$DBP07= 0
##$DBPNAM0= <>
##$DBPNAM1= <>
$$ [...]
##$SUBNAM7= <"">
##$SUBNAM8= <"">
##$SUBNAM9= <"">
##$SW= 20.6930455092707
##$SWIBOX= (0..15)
0 0 3 0 0 0 0 0 0 0 0 0 0 0 0 0 
##$SW_h= 5175.983436853
##$TD= 65536
##$TD0= 1
##$TE= 294.16
##$TE2= 300
##$TE3= 300
##$TEG= 300
##$TL= (0..7)
0 120 120 120 120 120 120 120 
##$TP= (0..7)
150 150 150 150 150 150 150 150 
##$TP07= 0
##$TPNAME0= <>
##$TPNAME1= <>
##$TPNAME2= <>
##$TPNAME3= <>
##$TPNAME4= <>
##$TPNAME5= <>
##$TPNAME6= <>
##$TPNAME7= <>
##$TPOAL= (0..7)
0.5 0.5 0.5 0.5 0.5 0.5 0.5 0.5 
##$TPOFFS= (0..7)
0 0 0 0 0 0 0 0 
##$TUNHIN= 0
##$TUNHOUT= 0
##$TUNXOUT= 0
##$USERA1= <user>
##$USERA2= <user>
##$USERA3= <user>
##$USERA4= <user>
##$USERA5= <user>
##$V9= 5
##$VALIST= <valist>
##$VCLIST= <CCCCCCCCCCCCCCC>
##$VD= 0
##$VDLIST= <DDDDDDDDDDDDDDD>
##$VPLIST= <PPPPPPPPPPPPPPP>
##$VTLIST= <TTTTTTTTTTTTTTT>
##$WBST= 1024
##$WBSW= 4
##$XGAIN= (0..3)
0 0 0 0 
##$XL= 0
##$YL= 0
##$YMAX_a= 775871
##$YMIN_a= -798056
##$ZGOPTNS= <>
##$ZL1= 120
##$ZL2= 120
##$ZL3= 120
##$ZL4= 120
##$ABSF1= 16.522
##$ABSF2= -4.171173
##$ABSG= 5
##$ABSL= 3
##$ALPHA= 0
##$AQORDER= 0
##$ASSFAC= 0
##$ASSFACI= 0
##$ASSFACX= 0
##$ASSWID= 0
##$AUNMP= <proc_1d>
##$AZFE= 0.1
##$AZFW= 0.1
##$BCFW= 0
##$BC_mod= 0
##$BYTORDP= 0
##$COROFFS= 0
##$CY= 12.5
##$DATMOD= 1
##$DC= 0
##$DFILT= <>
##$DTYPP= 0
##$F1P= 14.0000005364418
##$F2P= -0.99999901652339
##$FCOR= 0.5
##$FTSIZE= 32768
##$FT_mod= 6
##$GAMMA= 0
##$GB= 0
##$INTBC= 1
##$INTSCL= 1
##$ISEN= 128
##$LB= 0.3
##$LEV0= 0
##$LPBIN= 0
##$MAXI= 10000
##$MC2= 0
##$MEAN= 0
##$ME_mod= 0
##$MI= 0
##$NCOEF= 0
##$NC_proc= -2
##$NLEV= 6
##$NOISF1= 0
##$NOISF2= 0
##$NSP= 0
##$NTH_PI= 0
##$NZP= 0
##$OFFSET= 16.522
##$PC= 1
##$PHC0= -78.2021
##$PHC1= 5.698224
##$PH_mod= 1
##$PKNL= yes
##$PPARMOD= 0
##$PSCAL= 4
##$PSIGN= 0
##$REVERSE= no
##$SF= 250.13
##$SI= 32768
##$SIGF1= 0
##$SIGF2= 0
##$SINO= 400
##$SIOLD= 32768
##$SREGLST= <1H.CDCl3>
##$SSB= 0
##$STSI= 32768
##$STSR= 0
##$SW_p= 5175.98343685301
##$SYMM= 0
##$S_DEV= 0
##$TDeff= 65536
##$TDoff= 0
##$TI= <Analysis number 999999
Compound Code 99
Book Reference 9
Project Code 9>
##$TILT= no
##$TM1= 0
##$TM2= 0
##$TOPLEV= 0
##$USERP1= <user>
##$USERP2= <user>
##$USERP3= <user>
##$USERP4= <user>
##$USERP5= <user>
##$WDW= 1
##$XDIM= 32768
##$YMAX_p= 422328176
##$YMIN_p= -132217
$$ End of Bruker specific parameters
$$ ---------------------------------
##NTUPLES= NMR SPECTRUM
##VAR_NAME=  FREQUENCY,     SPECTRUM/REAL,   SPECTRUM/IMAG
##SYMBOL=    X,             R,               I
##VAR_TYPE=  INDEPENDENT,   DEPENDENT,       DEPENDENT
##VAR_FORM=  AFFN,          ASDF,            ASDF
##VAR_DIM=   32768,         32768,           32768
##UNITS=     HZ,            ARBITRARY UNITS, ARBITRARY UNITS
##FACTOR=    0.157963299565203, 1,           1
##FIRST=     4132.6476996994, 0,             0
##LAST=      -1043.33573715361, 0,           0
##MIN=       -1043.33573715361, -132217,     0
##MAX=       4132.6476996994, 422328176,     0
$$ Real data points
##PAGE= N=1
##DATA TABLE= (X++(R..R)), XYDATA
$$ [...]
17219A7051M01j98J193o730j316j457r9j170L982M490k105m464N064k089k914
17204I639Q61K56J737R834K661O58J034k362j768L934J1009J596K042q05K415
17189D2741J625l764M98J0849P579O884J0537K1020K1940J9045K2125L1883K5854
17176B18816J5374J6454K9851M2787N4088M4378J8162n295k0471j7519j1046J5600
17164D01179K7509L183k9032m2206n7853m5812l5645k3933j8565j1728j4238k6257
17152A26602l2728k3090j5784o048m624m150p009o846p23n136J131k199o6K570
17138B1900L823L862m184p412r371j019N910M593q24l642L719j219O70K315K307
17123B1428n91l17m575K347K874m838l229k018M322l257M757J16L956L717j345
$$ plain form
17219 17051 17452 17254 18447 11717 10401 8944 8845 7675 11657 16147 14042 9578 14642 12553 9639
17204 9639 10500 10756 12493 22327 24988 25646 26680 24318 22550 26484 37493 39089 41131 40326 42741
17189 42741 44366 40602 41100 51949 59528 66412 76949 97969 119909 138954 161079 192962 218816
17176 218816 234190 250644 280495 323282 377370 421748 439910 434615 414144 396625 385579 401179
17164 401179 428688 431871 402839 360633 302780 256968 221323 197390 178825 167097 152859 126602
17152 126602 93874 70784 55000 48952 44328 40178 33169 26323 25600 20464 21595 19396 19330 21900
17138 21900 25723 29585 25401 17989 8618 7599 13509 18102 17278 13636 17355 16136 16806 19121 21428
17123 21428 20837 20520 15945 18292 21166 16328 13099 11081 15403 12146 16903 17019 20975 24692 23347
17108B3347L838L75k817l153o010n29J147j07L603L751l7m449j972j037q84J193
17092A6259L100m586m381R88K93R899r8j698O11K41j327j050O571K532l297l07
17076B3750l630n975l748n685p23M11N047N299p62J974J748L683M218o640p522
17061A1445n444j090o28R8m526L582O380L429J626q12J714M476p33J018n516K002
17045A7021k269L709P446P084L641o778K68k806j0337n556j623l206P602J4053
17031B8249O400J518k405m723p214J298j106j903L408J113k489j588n62l956l15
17016A5725n50M690J462J236k605l493q545j21J883J051J0878Q308n232r235l698
17001A1754J719M346J710k81k220n645k521J924K173P004M343M405L142m322n569
$$ plain form
17108 23347 27185 27560 24743 21590 15580 15051 16198 16091 19694 23445 23408 18959 16987 15950 15066 16259
17092 16259 19359 14773 10392 11380 11673 21572 21474 19776 20387 20628 19301 18251 24822 27354 24057 23750
17076 23750 20120 14145 10397 4712 3989 4400 9447 14746 13984 15958 17706 21389 25607 18967 11445
17061 11445 6001 4911 4283 4381 -145 3437 9817 13246 14872 14060 15774 20250 19517 20535 15019 17021
17045 17021 14752 18461 25907 32991 36632 29854 30122 27316 16979 11423 9800 6594 14196 28249
17031 28249 34649 36167 33762 29039 21825 23123 22017 20114 23522 24635 22146 20558 19996 16040 15725
17016 15725 15175 19865 21327 22563 19958 16465 7920 7799 9682 10733 21611 29919 24687 15452 11754
17001 11754 13473 17819 19529 19248 17028 11383 8862 10786 12959 19963 24306 28711 31853 27531 21962
16986B1962K534L607k47R79j65j179J860j837r73j900L439N809J061n573q84O159
16970C4652R42k174j580k498m263k763k952j921P194R95K423K538K665n077Q44
16955B9025L023k650r463m443M721l68m89q7l033N352J0246O906k726n071r435
16940B1508J492l296L52L070l186j927j658K734N443n547J599R564q86n369m681
16925A9212Q7J009m22L099n042R9L052M051N564M11r993n64J457K089L98n933
16909A8574o489J0857Q49K02O243R05j449p115M658K705l609M68L141L51R34L280
16893C4505j67O567M383L592k204L210J474L245j95j790L66K346l981K25K065
16878E3641J136O049k394n079r984n821L395P445L482J037M905Q830k292K074
$$ plain form
16986 21962 24496 28103 27856 28835 28670 27491 29351 27514 26541 24641 28080 33889 34950 29377 28493 34652
16970 34652 35594 33420 31840 29342 25079 22316 19364 17443 24637 25632 28055 30593 33258 28181 29025
16955 29025 32048 29398 19935 15492 20213 19845 19356 19269 16236 21588 31834 38740 36014 30943 21508
16940 21508 23000 19704 20056 23126 19940 18013 16355 19089 24532 18985 20584 30148 29262 23893 19212
16925 19212 19299 20308 19886 22985 17943 18042 21094 25145 30709 31120 21127 20563 22020 24109 24507 18574
16909 18574 12085 22942 23791 23993 30236 31141 29692 22577 27235 29940 26331 26799 29940 30291 31225 34505
16893 34505 34338 40905 45288 48880 46676 49886 51360 54605 54410 52620 52986 55332 51351 51576 53641
16878 53641 54777 60826 58432 53353 43369 37548 40943 48388 51870 52907 57812 66642 64350 66424
16864F6424R987J3937J2184J657O97p990l74J540K96J969m677j050j646j137K808
16849I4625n666l355J774l83l666j150J665o330q970o657R95K470j471L859N99
16834F8339l358L649n781j333R26k841k455m902k438k126k090L003L085k943K422
16819E1157P281O601j084o145l035m443n82Q17m72p263p330N910J0674O595L904
16804F2585j306l375M065Q005P714L753K504o02j511K155N347M873P947K945l958
16789A01141L860O850Q56q251P16O690M701m62L572O353J0635K627J276r290q581
16774A22693P91Q485M848N578R92j1322p530p023n641L425M632j954P49k675j0374
16759A05674p706k41J978K810N367L46l43o131L002J913O500N784K759J2869J2796
$$ plain form
16864 66424 76411 90348 102532 104189 104886 96896 96522 98062 98358 100327 95650 94600 92954 91817 94625
16849 94625 88959 85604 87378 86995 83329 82179 83844 77514 68544 61887 62882 65352 63881 67740 68339
16834 68339 64981 68630 62849 61516 62442 59601 57146 52244 49806 47680 45590 48593 51678 48735 51157
16819 51157 58438 65039 63955 57810 54775 50332 49750 50567 50095 42832 35502 41412 52086 58681 62585
16804 62585 61279 57904 61969 69974 77688 81441 83945 83343 81832 83987 89334 94207 102154 105099 101141
16789 101141 105001 111851 112707 104456 105172 111862 116563 116101 119673 126026 136661 139288 140564 131274 122693
16774 122693 123484 131969 136817 142395 143387 132065 124535 117512 111871 115296 119928 117974 118723 116048 105674
16759 105674 97968 97727 99705 102515 107882 108228 107885 101754 104756 106669 113169 118953 121712 134581 147377
16744A47377M057J112N077J1487J4122J5899Q395P553Q268J763N64J2857Q658
16731B47189Q89k762q369K000L978m938q127j2360j6713j0085o269j3004j0907
16718A60522o948j0167j1854l892O851J069k225o136K164K410k712n87N343M271
16704A38109P657N889M138Q874P065K051K458p92O213k082k772M075O320M122
16690A91325o221P143J3360R723J158L680j079k475K054P938K747L868J2909L993
16676B50123L653j421Q241P967P618J2404Q331J2408N918N115J3687J5251P442
16663C56737J2433J6025J4416J5126J8161J5366K1768J9845K8347L1128K8653
16652E78005K4461K8914L1658L5605M3254M1703N6243P1772P4086P6137Q5738
$$ plain form
16744 147377 151434 152546 157623 169110 183232 199131 207526 215079 223347 225110 225674 238531 247189
16731 247189 248078 245316 236947 238947 242925 237987 229860 217500 200787 190702 184433 171429 160522
16718 160522 153574 143407 131553 127661 134512 135581 133356 127220 129384 131794 129082 128495 133838 138109
16704 138109 145766 151655 155793 164667 171732 173783 176241 175449 181662 179580 176808 180883 187203 191325
16690 191325 185104 192247 205607 215330 216488 220168 219089 216614 218668 226606 229353 233221 246130 250123
16676 250123 253776 252355 260596 268563 276181 288585 296916 309324 315242 320357 334044 349295 356737
16663 356737 369170 385195 399611 414737 432898 448264 470032 489877 518224 549352 578005
16652 578005 602466 631380 663038 698643 741897 783600 839843 911615 985701 1061838 1147576
16641A147576R2686J04802J08588J32284J61697J95566K15824K26365K15110K10769
16631B811267K49872L05260L61156M25898M94153N49753O11040O92379Q22156
16622G322934J000953J278733J714698K361785L236879M228296M977423M976556
16614C1098257M311176L260562L024061M107334O529044Q943786Q907218O468049
16606G6649487J400840k536936m310591k363566J277994L249149K370291j829334
16598G3907334o287544r323829r371606p148446m706561l273390l311803m102213
16590B6381942m762438m807601m132059l165024k225630j502566j024828p27433
16582D034363n56453m56181l94442l26172k41901j62643j14315r7630j20703j37938
$$ plain form
16641 1147576 1240262 1345064 1453652 1585936 1747633 1943199 2159023 2385388 2600498 2811267
16631 2811267 3061139 3366399 3727555 4153453 4647606 5197359 5808399 6500778 7322934
16622 7322934 8323887 9602620 11317318 13679103 16915982 21144278 26121701 31098257
16614 31098257 35409433 38669995 41694056 45801390 52330434 61274220 70181438 76649487
16606 76649487 78050327 75513391 71202800 68839234 70117228 73366377 75736668 73907334
16598 73907334 67619790 58295961 48924355 41775909 37069348 33795958 30484155 26381942
16590 26381942 21619504 16811903 12679844 9514820 7289190 5786624 4761796 4034363
16582 4034363 3477910 3021729 2627287 2301115 2059214 1896571 1782256 1684626 1563923 1425985
16572A425985j35858j10347p1296n0111m3934n4584p3496q3318q1818o9248n8594
16561E93381l5382l6756n1622m9344m5394l5580l3141k2280j3045q753j3401r336
16549B39347j0357j1204j7476j0785o521n963j2211p427r0r660p399r967r844
16536A20443j1695r324K970L76m697k30o708r958K501N542m497n573r240k915
16522F6995q341r230M192N369k268J985M824j364o58P897M695r303n992O229N981
16507G1011J93k298J744P064O325k174J694O130L614K586P635M183R004J1690
16493A28401J1539P262k43J0302J7155J5746J9033K2880K8555L4404L6623N5655
16481C87312O9219O9577N2496M9518O6438P5273J05925J24404R8376M8856n208
$$ plain form
16572 1425985 1290127 1179780 1108484 1058373 1014439 959855 886359 803041 721223 651975 593381
16561 593381 557999 521243 469621 420277 374883 339303 306162 283882 270837 262084 248683 239347
16549 239347 228990 217786 200310 189525 183004 177041 164830 157403 157313 147653 140254 130287 120443
16536 120443 108748 99424 102394 102770 98073 97843 91135 81177 83678 89220 84723 79150 69910 66995
16522 66995 58654 49424 53616 58985 56717 58702 63526 62162 61504 69401 74096 64793 58801 65030 71011
16507 71011 71204 68906 70650 77714 84039 81865 83559 89689 93303 95889 103524 107707 116711 128401
16493 128401 139940 147202 146959 157261 174416 190162 209195 232075 260630 295034 331657 387312
16481 387312 456531 526108 578604 628122 694560 769833 875758 1000162 1098538 1147394 1142186
16470A142186l9636m5920p308K7047K8132J573n9463r7834j30894j23129r3033
16459F01721o6601n2211o3452p0450o5330n6332n1728m8251k9381j7484j1201
16448F9300j7300j5416n410o650o941j3411l812K441n28P48q008m914m658m753
16434a9312o104N565K505j026R45k013K049M772j809k868j682L60J415J479n069
16419b0793j2203m116l248j444m385k410O731K475Q641J742l144J077P559Q119
16405a5399R920j495m165M726m15L786j085l407l932P63Q133L774k966j318j1869
16390a4949n028N0M416l00N049p88j836N737O81o561k523k57n237l6M160M680
16374a2742M301l293m336o343k486p92N386j551m195r79K783k289j361K021R432
$$ plain form
16470 1142186 1102550 1056630 1049322 1076369 1104501 1106074 1046611 948777 817883 694754 601721
16459 601721 535120 482909 419457 349007 283677 227345 175617 127366 97985 80501 69300
16448 69300 52000 36584 31174 24524 17583 4172 360 2801 2273 3021 -4987 -9901 -14559 -19312
16434 -19312 -25416 -19851 -17346 -18372 -17427 -19440 -17391 -12619 -14428 -17296 -18978 -18618 -17203 -15724 -20793
16419 -20793 -32996 -37112 -40360 -41804 -46189 -48599 -41868 -39393 -30752 -29010 -32154 -31077 -23518 -15399
16405 -15399 -5479 -6974 -11139 -6413 -6828 -3042 -4127 -7534 -11466 -10703 -2570 1204 -1762 -3080 -14949
16390 -14949 -19977 -19927 -15511 -15811 -10762 -11550 -13386 -7649 -6968 -13529 -16052 -16309 -21546 -21582 -17422 -12742
16374 -12742 -8441 -11734 -16070 -22413 -24899 -25691 -20305 -21856 -26051 -27030 -24247 -26536 -27897 -25876 -16444
16359a6444n159n362M286Q190J270o956r393j224J067L786P558O986J752J493
16345h150l890m770P512N545q261p818M869J821m084Pk132l164k091L880l130
16330b3856K601Q66k464L746K650m610l776k482k017j474M801L897N98m431n275
16315c1226K708O9L179J315k009J380L960K185p104M857K522k420J425J729J355
16300a6075o354p09N225K046p584J125L529K804L371k530L280k388l474P186O640
16285c908P57j092m880j676L341K393o118j0196M514L679L046K887j677J705J143
16270f082J900M99j0557q819Q176L728L220p361l846K736O070j0091k035M757
16256a7705K009j884O502k317J390J044J341L211n493l547j890O211Q443L071
$$ plain form
16359 -16444 -21603 -26965 -22679 -14489 -13219 -20175 -29568 -30792 -29725 -25939 -18381 -11395 -9643 -8150
16345 -8150 -12040 -16810 -9298 -3753 -12014 -19832 -14963 -13142 -17226 -17219 -19351 -22515 -24606 -20726 -23856
16330 -23856 -21255 -20389 -22853 -19107 -16457 -21067 -24843 -27325 -29342 -30816 -26015 -22118 -21520 -25951 -31226
16315 -31226 -28518 -28449 -25270 -23955 -25964 -24584 -20624 -18439 -25543 -20686 -18164 -20584 -19159 -17430 -16075
16300 -16075 -22429 -23138 -17913 -15867 -23451 -22326 -18797 -15993 -12622 -15152 -11872 -14260 -17734 -10548 -3908
16285 -3908 -3151 -4243 -9123 -10799 -7458 -5065 -11183 -21379 -16865 -13186 -10140 -7253 -8930 -7225 -6082
16270 -6082 -4182 -3683 -14240 -23059 -14883 -11155 -7935 -15296 -19142 -16406 -10336 -20427 -22462 -17705
16256 -17705 -15696 -17580 -11078 -13395 -12005 -10961 -9620 -6409 -11902 -15449 -17339 -11128 -2685 386
16242C86j420o138J840Q26l706l618l328J380P096k991q352o906O602L97j270
16227a9202J484P74k29l44L546K783l324K713K647l864k479N22n066L173j99M434
16211a2631M16K238j791j122o308O623K146j4271k212Q124O16K525J569m55r426
16196b3959k812N933M864m282j0165K686J2384N54j627R081r17m284M354L302
16182d888m686p652l527K020K665L249O595N068o669l763j998J603R16k445O429
16167g083J4562p011r958J354M972O93j557l737n14j835n350l715N479L976N785
16152c939k003J71L889l760Q6m565j407m125L505L101N464p639n415k668J76L404
16136a5725O046o77j246N607Q439m204L070j0710j730o19L35L243k545J012J652
$$ plain form
16242 386 -1034 -7172 -5332 -4506 -8212 -11830 -15158 -13778 -6682 -9673 -18025 -24931 -18329 -17932 -19202
16227 -19202 -17718 -16944 -17173 -17517 -13971 -11188 -14512 -11799 -9152 -13016 -15495 -14973 -20039 -16866 -17065 -12631
16211 -12631 -12215 -9977 -11768 -12890 -19198 -12575 -10429 -24700 -26912 -18788 -18172 -15647 -14078 -14533 -23959
16196 -23959 -26771 -20838 -15974 -20256 -30421 -27735 -15351 -14797 -16424 -7343 -8260 -12544 -8190 -4888
16182 -4888 -9574 -17226 -20753 -18733 -16068 -12819 -6224 -1156 -7825 -11588 -13586 -11983 -11067 -13512 -7083
16167 -7083 7479 468 -9490 -8136 -3164 -2471 -4028 -7765 -8279 -10114 -15464 -19179 -13700 -9724 -3939
16152 -3939 -5942 -5771 -1882 -5642 -5556 -10121 -11528 -15653 -12148 -9047 -3583 -11222 -16637 -19305 -19129 -15725
16136 -15725 -9679 -10356 -11602 -5995 2444 -1760 1310 -9400 -11130 -11749 -11414 -8171 -10716 -9704 -8052
16121h052m80J221J913Q97J189p750o145q141J795N817R73k008M721N523q40K7
16105i340N42m472l796J730P042N168m728m889n055O09K268L177J625J449l503
16090a2173M032R346j310p147o582k416K329M534K932l602M137M654K286l60n002
16075d342n62J135J950O252Q82k901k876o167P71M613L912M608j51m624j754O644
16059G390N437m985q119J098J3889J4102J280R513O052P027J9011J8011K4041
16046A13747L3266K5694K7691K5969K2083L0817L5180M6543M7918M0304J3013
16035D62225j0590k6630k5238l224J8075J2883r891l0888m1505o1475n2656l0087
16023B00999j1828k0477k6679k6627k6517k5022j9318j7270n452M25m819j4234
$$ plain form
16121 -8052 -8532 -7311 -5398 -4501 -3312 -11062 -17207 -25348 -23553 -17736 -16763 -18771 -14050 -8527 -9367 -9340
16105 -9340 -8798 -13270 -17066 -15336 -8294 -3126 -7854 -12743 -17798 -17189 -14921 -11744 -10119 -8670 -12173
16090 -12173 -8141 1205 -105 -7252 -13834 -16250 -13921 -9387 -6455 -10057 -5920 -1266 1020 660 -4342
16075 -4342 -4904 -3769 -1819 4433 5315 2414 -462 -6629 -5858 -1245 2667 7275 7124 2500 746 7390
16059 7390 12827 7842 -277 821 14710 28812 30092 39605 45657 52684 71695 89706 113747
16046 113747 147013 172707 200398 226367 248450 279267 314447 360990 408908 449212 462225
16035 462225 451635 425005 399767 396543 414618 427501 417610 386722 345217 283742 231086 200999
16023 200999 189171 168694 142015 115388 88871 63849 44531 27261 21809 22234 17415 3181
16011C181j0501k120Q56O401M178M028k718n362p760j446l556K612J0924N647
15997D364m344l778l002K97K699L79O647o436p014p374K560Q725P990R17l497
15982h67K674L3o333k833l150j561N769l974l15k327M0K348L782O206l436j894
15966e838j663o927j281p8K082O044K334n186l227j395P257L336n868K410J312
15951f688o075r896q727J846J818L372M678j97J091M18J672k682J631K178m67
15936a6028r30R85m791M510J0470J950l686l467K88O238J009k200n821o070L778
15921a3765Q376J28m966o53J065K076L687J717k406p319o184o854j958J0783J0809
15906e464L720L021m881L89K975K543M20J254p99m261J080K635k054N787j044
$$ plain form
16011 3181 -7320 -9440 -8584 -2183 1995 6023 3305 -2057 -9817 -11263 -14819 -12207 -1283 4364
15997 4364 20 -3758 -6760 -6463 -3764 -3385 3262 -3174 -10188 -17562 -15002 -6277 1713 2630 -867
15982 -867 1807 1840 -4493 -7326 -10476 -12037 -6268 -10242 -10557 -12884 -12844 -10496 -6714 -508 -3944 -5838
15966 -5838 -7501 -14428 -15709 -15787 -13705 -7661 -5327 -10513 -13740 -15135 -7878 -4542 -10410 -8000 -6688
15951 -6688 -12763 -22659 -31386 -29540 -27722 -24350 -19672 -19869 -18778 -18360 -16688 -19370 -17739 -15561 -16028
15936 -16028 -16958 -15973 -20764 -16254 -5784 -3834 -7520 -10987 -10699 -4461 -3452 -5652 -11473 -17543 -13765
15921 -13765 -5389 -5261 -10227 -10880 -9815 -7739 -4052 -2335 -4741 -12060 -18244 -25098 -27056 -16273 -5464
15906 -5464 -1744 1277 -3604 -3215 -240 2303 2723 3977 3178 -1083 -3 2632 578 6365 5321
15891E321n448j584L55J381L064J428m316k658M061L459k380l016j779j69j339
15876c620L140k421j1077m556J770J42K98M634R29%O703L833j0959m788j875M310
15860a3537O323m635j364N430k978K105M764o224r931m83P071O588N209K143l635
15845c154n400P246J296k417n722L788J731l622p845m405Q713L705n676p947o053
15830b5762K079N269M652k212k462n241j839L601Q281K400j145o77l924K27N516
15815a1237J472P19O318l947k029l982m864l00M264M608L37o26l103J853J477
15800i040p036Q08L541P919n65l539m948m163j552j631m45K207J069l962p83J0498
15784a1622R379m279p587l834j636O869m353k287J574L51J298R97K0k868J7j735
$$ plain form
15891 5321 -127 -1711 -1356 25 3089 4517 201 -2457 1604 5063 2683 -333 -2112 -2281 -3620
15876 -3620 -480 -2901 -13978 -18534 -16764 -16622 -16324 -11690 -10761 -10761 -4058 -225 -11184 -15972 -17847 -13537
15860 -13537 -7214 -11849 -13213 -7783 -10761 -8656 -3892 -10116 -20047 -20530 -13459 -6871 -1662 481 -3154
15845 -3154 -8554 -1308 -12 -2429 -8151 -4363 -2632 -6254 -14099 -18504 -9791 -6086 -11762 -19709 -25762
15830 -25762 -23683 -18414 -13762 -15974 -18436 -23677 -25516 -21915 -13634 -11234 -12379 -13056 -16980 -16753 -11237
15815 -11237 -9765 -9046 -2728 -6675 -8704 -12686 -17550 -17850 -13586 -8978 -8641 -9267 -12370 -10517 -9040
15800 -9040 -16076 -15268 -11727 -3808 -4373 -7912 -12860 -17023 -18575 -20206 -20651 -18444 -17375 -21337 -22120 -11622
15784 -11622 -2243 -6522 -14109 -17943 -19579 -12710 -17063 -19350 -17776 -17425 -16127 -15130 -15110 -17978 -17961 -19696
15768a9696J143K09L056P909L300Q21k141n839j3951n686K409K181K689K866N80
15753b0150M388L200p970p517K878R49k975M211M066L578J981j766m692N158L721
15738a0940L864j266j818n71q660j958M060J0715M27j926K751N357k988L65o980
15723i568o688k405k444L776Q462L60J560P3o069l924j098Q080P787L35n720p424
15707a4907J187K204m41J68j527p7M993j751L821m14k756p97J432l793L464N021
15691d173l822j391l470j992M113n44L843Q353m143k138l793l662M720Q07k845
15676a0137k548M911j1k269o93o09j0948p835Q89Q203J885L196R41j546J430K366
15660a2775P677L438j284K704m416q66k666j410O33J022m9L526j180L062r58n042
$$ plain form
15768 -19696 -18553 -18344 -15288 -7379 -4079 -3258 -5399 -11238 -25189 -30875 -28466 -26285 -23596 -20730 -20150
15753 -20150 -15762 -12562 -20532 -28049 -25171 -24222 -27197 -22986 -18920 -15342 -13361 -15127 -19819 -14661 -10940
15738 -10940 -7076 -8342 -10160 -10731 -19391 -21349 -17289 -6574 -6147 -8073 -5322 35 -2953 -2588 -9568
15723 -9568 -16256 -18661 -21105 -17329 -8867 -8507 -6947 -6874 -12943 -16867 -17965 -9885 -2098 -1763 -7483 -14907
15707 -14907 -13720 -11516 -11957 -11789 -13316 -13393 -8400 -10151 -6330 -6744 -9500 -10297 -8865 -12658 -9194 -4173
15691 -4173 -7995 -9386 -12856 -14848 -10735 -11279 -7436 917 -3226 -5364 -9157 -12819 -8099 -7292 -10137
15676 -10137 -12685 -7774 -7785 -10054 -10747 -11356 -22304 -30139 -29250 -21047 -19162 -15966 -15025 -16571 -15141 -12775
15660 -12775 -5098 -1660 -2944 -240 -4656 -5522 -8188 -9598 -8965 -7943 -7992 -4466 -5646 -2584 -3542 -8584
15644h584j948o983J710J5184J384j0826j2501j097K101n21J3031M411p521J986
15630a0174M463o76o04m416p17Q99K192m403j025O09r09J573J0126M125n670k597
15614g204L219l01j331k85j676l113r25M402M31J12j081K419R969J606o040n004
15598d802r07k71M100m729m367q989o145N73L111N422M639J16o527N988Q61k790
15582a4717k537j852M103N84L7K482J920M805p404k917J201P746k730R66K951
15567e362l700k337K376o80l257m456N907O819K551J301m004j368P081k915j1376
15552a3420M006K55o412N366O675J601o881k489l618N19N564J386k747J308o0
15537h947O583L650j414n888q37j038L432N581q77m959l84N413L065K82k975n461
$$ plain form
15644 -8584 -10532 -17515 -15805 -621 763 -10063 -22564 -23661 -21560 -22081 -9050 -4639 -12160 -10174
15630 -10174 -5711 -6387 -6991 -11407 -12124 -11225 -9033 -13436 -14461 -13852 -14761 -13188 -3062 1063 -4607 -7204
15614 -7204 -3985 -4286 -5617 -5902 -7578 -10691 -11616 -7214 -6783 -6671 -7752 -5333 4636 6242 202 -4802
15598 -4802 -5709 -5980 -1880 -6609 -10976 -19965 -26110 -25537 -22426 -17004 -12365 -12249 -18776 -12788 -11927 -14717
15582 -14717 -17254 -19106 -15003 -14419 -14382 -11900 -9980 -5175 -12579 -15496 -14295 -6549 -9279 -8313 -5362
15567 -5362 -9062 -11399 -9023 -9703 -12960 -17416 -11509 -4690 -2139 -838 -4842 -6210 871 -2044 -13420
15552 -13420 -9414 -9159 -15571 -10205 -3530 -1929 -8810 -11299 -14917 -14398 -8834 -7448 -10195 -8887 -8947
15537 -8947 -2364 1286 -128 -6016 -6853 -7891 -4459 1122 245 -4714 -5098 315 3380 3662 687 -4774
15521d774l255J35r39j082q46r95k438k138M636Q638J399m255J374n521j722O350
15505e433j550J30o165p719Q00Q005J297k606K988R12r100k55O811J475m277K832
15489a1855M597K921k118r58L656m087q221j39Q34J608N790Q411j280n435J417
15474d859K258J08P73k138k820k197q558J626M499J548J318j23j0118j0015N803
15459b2895N972j409l689L254J241K085K384k237P449M909m357j303O35q8L052
15444d997N001J258m926p558j633L816k613n87N364P890n923k526m77k215J258
15429h868k90k296L083L02M2K857o62m304K92J526L407n131J244K484L189K352
15413g73L095q48p963M786l533m278M189m042k964J0239N780m201p703L737N416
$$ plain form
15521 -4774 -8029 -7894 -8833 -9915 -10761 -11756 -14194 -16332 -11696 -3058 -1659 -5914 -4540 -10061 -11783 -5433
15505 -5433 -6983 -6853 -13018 -20737 -19937 -11932 -10635 -13241 -10253 -9341 -18441 -18696 -11885 -10410 -14687 -11855
15489 -11855 -7258 -4337 -6455 -7413 -3757 -7844 -16065 -16204 -15370 -13762 -7972 439 -841 -6276 -4859
15474 -4859 -2601 -2493 -1720 -3858 -6678 -8875 -17433 -15807 -11308 -9760 -8442 -8565 -18683 -28698 -22895
15459 -22895 -16923 -18332 -22021 -18767 -17526 -15441 -13057 -15294 -7845 -2936 -7293 -8596 -7961 -8049 -4997
15444 -4997 4 1262 -3664 -11222 -12855 -9039 -11652 -12239 -6875 1015 -4908 -7434 -7911 -10126 -8868
15429 -8868 -9158 -11454 -8371 -8069 -8027 -5170 -5832 -10136 -9844 -8318 -4911 -10042 -8798 -6314 -3125 -773
15413 -773 2322 1474 -6489 -1703 -5236 -9514 -5325 -9367 -12331 -2092 3688 -513 -8216 -4479 937
15398I37K492j844p91N417n171q724j712N187K775p91o723k939L453N479k075
15383e030l887K535J074m037J98P821l62j67J372p955l451P55m625m193O263O557
15367g132m362j968L593l757M673J678k157J687K143p330j698N379P969l223K832
15352a673K269q029q33K341R60M077M883k447l129l676j495m570l470J744Q562
15337d486P483K62K213j844j665o608l239p36L248K488J169P026m698m803k451
15322f641j075p0J279p060l434N482j743l364l901j725P155L304m006K897N773
15307g129L474m545j684P08R695J279k324o859Q90L281L113j784p23p348q518
15292a8474K864Q985L328l304m350N874N414m572l227k688K444N150m331j086
$$ plain form
15398 937 3429 1585 794 6211 1040 -7684 -9396 -4209 -1434 -2225 -8948 -11887 -8434 -2955 -5030
15383 -5030 -8917 -6382 -5308 -9345 -9147 -1326 -1688 -1855 -483 -8438 -11889 -11134 -15759 -19952 -13689 -7132
15367 -7132 -11494 -13462 -9869 -13626 -8953 -7275 -9432 -7745 -5602 -12932 -14630 -9251 -1282 -4505 -1673
15352 -1673 596 -7433 -8266 -5925 -4965 -888 3995 1548 -1581 -5257 -6752 -11322 -14792 -13048 -4486
15337 -4486 2997 3259 5472 3628 1963 -4645 -7884 -8620 -5372 -2884 -1715 5311 613 -4190 -6641
15322 -6641 -7716 -7786 -6507 -13567 -17001 -11519 -13262 -16626 -20527 -22252 -15097 -11793 -15799 -12902 -7129
15307 -7129 -3655 -8200 -9884 -9176 519 1798 -526 -7385 -6495 -3214 -101 -1885 -2608 -9956 -18474
15292 -18474 -15610 -6625 -3297 -6601 -10951 -5077 337 -4235 -7462 -10150 -7706 -2556 -6887 -7973
15278g973P908j113l75k89j174m258m835n106k994J917N683M399j637o997L44
15263a6500k30P024R101K169k386m36l545k182K586k46o420O76n646m586N397
15248a5224O741O36K53j075m196k175K457R672M200q645p642L77M993J377M323
15233c928k384j811M774L07r331K54J760j212M195N777l714K204K293l13m44q266
15217i839n044o23m356M809P123L388j023N508j44j637J303L865J655o185j263
15202b463L159l282m895O342K398m818n950M479J694q042L571N755m601j178K863
15187d968n94j626m259l969n181o853M098J967J747K124J0414J805m001O5J800
15172g431K971k988o374j028M808L604j254p160O87Q472N422L997J113q089o79
$$ plain form
15278 -7973 -65 -1178 -1553 -1842 -3016 -7274 -12109 -17215 -20209 -18292 -12609 -8210 -9847 -16844 -16500
15263 -16500 -16730 -9706 -605 1564 -822 -1258 -4803 -6985 -4399 -4645 -11065 -10389 -16035 -20621 -15224
15248 -15224 -8483 -7847 -7594 -8669 -12865 -15040 -12583 -2911 1289 -7356 -14998 -14621 -9628 -8251 -3928
15233 -3928 -6312 -8123 -3349 -3042 -12373 -12119 -10359 -11571 -7376 -1599 -5313 -3109 -816 -1129 -1573 -9839
15217 -9839 -14883 -15506 -19862 -15053 -7930 -4542 -5565 -57 -201 -1838 -535 3330 4985 -1200 -2463
15202 -2463 696 -2586 -7481 -1139 1259 -3559 -9509 -5030 -3336 -11378 -7807 -2052 -6653 -7831 -4968
15187 -4968 -5562 -7188 -11447 -15416 -20597 -27450 -23352 -21385 -19638 -17514 -7100 -5295 -9296 -9231 -7431
15172 -7431 -4460 -7448 -13822 -14850 -10042 -6438 -7692 -14852 -14165 -5693 -271 3726 4839 -3250 -3929
15157c929L54j043J537J832n25l484L664N713j81L756L942N158M49J202N825m82
15141B3788n887J296L888N03l732O0o906k963k838p18m642k408p446k219o049
15126a6273L195j181j81N123O955m029J085o31M857L659m640o389j945K685N10
15111g200n801J209N301O064l51j970N05p125K366N947l039q560L631k816k08
15096a2047l12K11N09j255M347N214m33k903l36q22L383M324Q397O677Q9o285
15080H758K82k496m424l594Q0O57j850r3k2J987K490r214n322o139L447O429K862
15063f162N34m022O64L270M75P73k437J608l270j643n310n060N078R211Q80P034
15047A623Q04J161J48n399j001j630l144j946k990J630J1151N814m660l910j41
$$ plain form
15157 -3929 -3575 -4618 -3081 -1249 -1774 -5258 -1594 4119 3938 7694 11636 16794 17243 18445 24270 23788
15141 23788 17901 19197 23085 23588 19856 19916 13010 10047 7209 6491 1849 -559 -8005 -10224 -16273
15126 -16273 -13078 -14259 -14440 -9317 -2362 -6391 -5306 -5937 -1080 2579 -2061 -8450 -10395 -7710 -7200
15111 -7200 -13001 -11792 -6491 -427 -778 -2748 -2243 -9368 -7002 -1055 -4094 -12654 -9023 -11839 -12047
15096 -12047 -12359 -12148 -11639 -12894 -8547 -3333 -3766 -6669 -7005 -7827 -4444 -120 8277 14954 15043 8758
15080 8758 9040 6544 2120 -1474 -1394 -737 -2587 -2680 -2702 -715 1775 -7439 -12761 -18900 -15453 -9024 -6162
15063 -6162 -5628 -9650 -8986 -5716 -5241 -4468 -6905 -5297 -8567 -10210 -15520 -20580 -15502 -6291 -5411 1623
15047 1623 2427 3588 3736 -1663 -2664 -4294 -7438 -9384 -12374 -10744 407 6221 1561 -2349 -2490
15032b490j777K897N127N766j663K530j368J99m566m234N70N747P90m535o777
15017c784j221L451l168j090m964p584J04J1286N367l157m885M001M158l125K586
15002b025l848j036K773k108k123m900q330j192K888P419j8K36J498R47K563k77
14986g533r08M645L56O257P316o217J238j315o617L956M570j200k912k93j22m742
14970c521O083J906n401j2631R57N258L798J261o02j064K342n395K670J63L089
14955a087O98M46o9j0492K510N942J342j439J237k712K948P0p153J719k519k025
14939a0584k388N056M901L27M37j71j974m68k200q759K957J929k573j04K386M752
14923f476J859o35k60L420l498j2193j37R078M258K174J236o930R01L372k026
$$ plain form
15032 -2490 -4267 -1370 3757 9523 7860 10390 9022 9221 4655 421 991 6738 7528 2993 -3784
15017 -3784 -5005 -1554 -4722 -5812 -10776 -18360 -18256 -6970 -1603 -4760 -9645 -5644 -1486 -4611 -2025
15002 -2025 -5873 -6909 -4136 -6244 -8367 -13267 -21597 -22789 -19901 -12482 -12500 -12264 -10766 -9819 -7256 -7533
14986 -7533 -8441 -3796 -3440 2817 10133 3916 5154 3839 -2778 1178 5748 4548 1636 1343 1221 -3521
14970 -3521 2562 4468 -933 -13564 -12607 -7349 -3551 -2290 -2892 -3956 -1614 -7009 -4339 -4176 -1087
14955 -1087 -389 57 -12 -10504 -7994 -2052 -710 -2149 -912 -3624 -676 -606 -7759 -6040 -8559 -10584
14939 -10584 -12972 -7916 -3015 -2688 -2251 -2422 -4396 -4864 -7064 -15823 -12866 -10937 -13510 -13614 -11228 -6476
14923 -6476 -4617 -5252 -5512 -2092 -5590 -17783 -17920 -8842 -4584 -2410 -1174 -8104 -7203 -3831 -5857
14908e857o080J2781P719o40m304j02K550M513P76l825K199m837j901K240m865
14893C67n573K051n114o158M387k447m264j659O267R191M899o022k530l74O612
14878c67M575o113L308K33K38l881j960N591J101j268k4P58L96n627J087K281
14862C28n507J344N005K722k157j096M747M660m283l490m929n602o585K240N631
14847f972J754k519k907P14n794j664P277L283L712J660p120O96N284j078p4M812
14831A064O029J566m045n376J538N039k782l915o001K880R21k333L175J711k109
14816b638m843m911J607L82J879J296j381K223O91k29Q31j591J859j197m746O963
14800c805K432o030K453k111m26J564l144j614N861K534m096j293m101R87K795
$$ plain form
14908 -5857 -11937 844 8563 7923 3619 3517 6067 10580 11356 7531 9730 4893 2992 5232 367
14893 367 -5206 -3155 -8269 -14427 -10040 -12487 -16751 -18410 -12143 -2952 1947 -4075 -6605 -6979 -367
14878 -367 4208 -1905 1403 1636 1874 -2007 -3967 1624 2725 1457 1433 2191 2587 -3040 -1953 328
14862 328 -5179 -3835 1170 3892 1735 639 5386 10046 5763 2273 -2656 -8258 -14843 -12603 -6972
14847 -6972 -5218 -7737 -10644 -9930 -15724 -17388 -10111 -6828 -3116 -1456 -8576 -7880 -2596 -3674 -3748 1064
14831 1064 7093 8659 4614 -762 776 5815 3033 -882 -6883 -4003 -3082 -5415 -2240 -529 -2638
14816 -2638 -7481 -12392 -10785 -10403 -8524 -7228 -8609 -6386 -5695 -5924 -5093 -6684 -4825 -6022 -10768 -3805
14800 -3805 -1373 -7403 -4950 -7061 -7487 -5923 -9067 -10681 -4820 -2286 -6382 -7675 -11776 -10789 -7994
14785g994j634L243K680l089M422l26o29j524l710q080R48j351L614M455N064
14770c911J204j2422J890L889K711L614O068n221p656J287R00J789l88q24N191
14755a879j254o885l852K60J053J005K862m558k674M987N157M50j821m944R460
14740b633N704o442j504L495K797m315k152k904J070J125k194n605m786k16Q261
14725a0299L034N782j243p831m743k48P214L930J716j741N09Q514M3p726L925
14710H36J0332n208r9o114l804M135m387m613o258J094K968Q3K981R138m400q557
14694a1873j592J667O558m92p63N85m939j19L867n077k762L950M851k035q27J184
14678g817M820Q740Q32p493r09n215l513q92q528M104Q489N215J36k445p048L204
$$ plain form
14785 -7994 -9628 -6385 -3705 -6794 -2372 -2698 -3327 -4851 -8561 -16641 -15693 -17044 -13430 -8975 -3911
14770 -3911 -2707 -15129 -13239 -9350 -6639 -3025 3043 -2178 -9834 -8547 -7647 -5858 -6246 -7070 -1879
14755 -1879 -3133 -10018 -13870 -13610 -12557 -11552 -8690 -13248 -15922 -10935 -5778 -5328 -7149 -12093 -2633
14740 -2633 3071 -3371 -4875 -1380 1417 -2898 -5050 -7954 -6884 -5759 -7953 -13558 -18344 -18560 -10299
14725 -10299 -7265 -1483 -2726 -10557 -15300 -15548 -8334 -4404 -2688 -4429 -3920 4594 4637 -3089 836
14710 836 11168 5960 5861 -253 -4057 78 -4309 -8922 -15180 -14086 -11118 -11035 -8054 1084 -3316 -11873
14694 -11873 -13465 -11798 -5240 -5732 -6495 -5910 -10849 -10968 -7101 -12178 -14940 -10990 -6139 -8174 -9001 -7817
14678 -7817 -2997 5743 6575 -918 -1827 -7042 -10555 -11447 -19975 -15871 -7382 -2167 -2031 -4476 -11524 -8320
14662h320j405M605L193J911L593K22l966l456M285L33q94P608j27q764k052r59
14646d193l579K664N061k018J1L978n330m143O80k144K943P443J1583J796l912
14631A0840K240j1687p489l512k256N210P470N766o487p617p380M962k241P465
14617d716L677j950P82N078J074q377m520l509K888j099k866J109R904Q119O22
14602F216o294m17m871m835J420K292o10l836n983k358J1061J675m055R20K302
14587g373K909k605r78Q993K360n575o745O074J888L862o059K161J0026N072q206
14572E804r05k139m730K989M191l843K229n816n496O083N56N7J129l643l056k170
14556h760r0O026L170p85m391l125J108K844J805q69M10J937p19r84m63L127O59
$$ plain form
14662 -8320 -9725 -5120 -1927 -16 3577 3799 -167 -3623 662 995 101 7709 7582 -1182 -3234 -4193
14646 -4193 -7772 -5108 -47 -2065 -2054 1924 -3406 -7549 -6869 -9013 -6070 1373 12956 14752 10840
14631 10840 13080 1393 -6096 -9608 -11864 -6654 816 6582 95 -7522 -14902 -9940 -12181 -4716
14617 -4716 -1039 -2989 -2207 2871 3945 -4432 -8952 -12461 -9573 -10672 -13538 -12429 -2525 5594 6216
14602 6216 -78 -495 -5366 -10201 -8781 -6489 -7099 -10935 -16918 -19276 -8215 -6540 -10595 -9675 -7373
14587 -7373 -4464 -7069 -8047 946 3306 -2269 -9014 -2940 -1052 2810 -3249 -1088 8938 14010 5804
14572 5804 4899 2760 -1970 1019 5210 1367 3596 -2220 -7716 -1633 -1077 -1020 109 -3534 -6590 -8760
14556 -8760 -8850 -2824 346 -439 -4830 -7955 -6847 -4003 -2198 -3067 -2657 -720 -1439 -2423 -2886 241 900
14539I00k406m407JR251J850j3488m334J246L29n408l37J3659K631L696N248l147
14523E284o031l387O157L774p509p529Q00N880L104K14L903j802J010M446n108
14508C206n965k787L532N883j629r31k698j150L128N54k523m20m458m627M4J435
14492i406M167M96J654p14m357J323K227n841J945M981N78L233m839j0743K166
14477a3130M626M812N554J795n266L092o134l246p65O134J843L955o319o387K474
14462f962L408j196M83P306l781k866J659K319j477M08l431m328l662M902O119
14447a099J451j227l831J306L781K123k391J048j525M137k007J42J558J375q24
14432D017J7k886m621M357k473n837L760J848k990K773l94m850J540j392M106
$$ plain form
14539 900 -1506 -5913 -5912 3339 5189 -8299 -12633 -11387 -11058 -16466 -16803 -3144 -513 3183 8431 5284
14523 5284 -747 -4134 2023 5797 -1712 -9241 -8441 -2561 543 757 4660 2858 3868 8314 3206
14508 3206 -2759 -5546 -2014 3869 2240 1309 -1389 -2539 589 1143 -1380 -1800 -6258 -10885 -10841 -9406
14492 -9406 -5239 -4743 -3089 -3803 -8160 -6837 -4610 -10451 -8506 -3525 -2947 286 -4553 -15296 -13130
14477 -13130 -8504 -3692 1862 3657 -1609 1483 -4651 -7897 -8662 -2528 -685 3270 -3049 -9436 -6962
14462 -6962 -3554 -4750 -4267 3039 -742 -3608 -1949 370 -1107 -699 -4130 -8458 -12120 -7218 -1099
14447 -1099 352 -875 -4706 -3400 381 2504 113 1161 -364 3773 1766 1908 3466 4841 4017
14432 4017 4034 1148 -3473 884 -1589 -7426 -3666 -1818 -4808 -2035 -2429 -7279 -5739 -7131 -3025
14417c025J609R38k12J891o45M132j8n711k039L262k258J260K846O809R158J803
14401A9800n637p703j100Q15n199m236J690m626M499m691K527L921K550L589k20
14386E979L52K393r11l508k098o001K411M302J863P87l131m570k190L767P821
14371G266K704r006o818J0579K510m05L361j003p401k750P50P590M026j660k336
14356G407q878J720N16j407j284K586k221l630l618K912j434p214P23O636L913
14341c273j598O91r37j827M394K598L401j14k103L995L576m97Q63R309N90o778
14325A2290o935K608R445J547l574m816l243l693l579j628N934J480J887r253
14311a530n840l272J186j361j774Q815O456m271l118J893N767J494K428p203j088
$$ plain form
14417 -3025 -1416 -478 -690 1201 556 4688 4670 -1041 -3080 182 -2076 -816 2030 8839 17997 19800
14401 19800 14163 6460 5360 6175 976 -3260 -1570 -6196 -1697 -6388 -3861 60 2610 6199 5979
14386 5979 6331 8724 7813 4305 2207 -3794 -1383 2919 4782 5569 2438 -2132 -4322 -555 7266
14371 7266 9970 964 -5854 4725 7235 6830 10191 9188 1787 -963 -213 7377 11403 9743 7407
14356 7407 -1471 249 765 -642 -1926 660 -1561 -5191 -8809 -5897 -7331 -14545 -13822 -7186 -3273
14341 -3273 -4871 -4180 -5117 -6944 -2550 48 3449 3335 1232 5227 8803 8306 9169 18478 19068 12290
14325 12290 5355 7963 17408 18955 15381 10565 7322 3629 50 -1578 4356 5836 7723 -1530
14311 -1530 -7370 -10642 -9456 -10817 -12591 -3776 2680 -1591 -4709 -2816 2951 4445 6873 -330 -1418
14296a418P41M785M33q46l670Q68j240j6m24p20Q76k010k033J016p1n063L196
14279e596N341j328J603m668J546K853K312o36L504m781j426j863j160L9o233
14264a0493l527Q2j009P752K148L401L510n681n028o015J599N859L733n03N295
14249A123M713J30J142n055k734j279k856j640J962L434K652r64l028m311J739
14234d972L096L84j896O76N475k750j1589K433J1369J381n677n938P095L578o90
14219A975K007l939m101k197m132Q480K901n385J604J185O30L012m141J321N001
14204D221K245m121n413q02P366O872J240K117j407J518j2023o671K696M589j1738
14189i311p3K947M550P779l17M761J041L779K1332J8529J2781J9327K5374L7194
$$ plain form
14296 -1418 -677 4108 4541 3695 25 893 -347 -363 -787 -1507 -631 -2641 -4674 -3658 -3729 -8792 -5596
14279 -5596 -255 -1583 20 -4648 -3102 -249 2063 1427 4931 150 -1276 -3139 -4299 -4260 -10493
14264 -10493 -14020 -13938 -14947 -7195 -5047 -1646 1864 -3817 -8845 -14860 -13261 -7402 -3669 -4172 1123
14249 1123 5836 5966 7108 2053 -681 -1960 -4816 -6456 -4494 -1060 1592 628 -2400 -6711 -4972
14234 -4972 -1876 -1492 -3388 -2712 2763 13 -11576 -9143 2226 3607 -2070 -8008 -913 2665 1975
14219 1975 3982 43 -4058 -6255 -10387 -1907 994 -4391 -2787 -1602 -972 2040 -2101 -780 4221
14204 4221 6466 2345 -3068 -3870 3496 10368 11608 13725 12318 13836 1813 -4858 -2162 2427 -9311
14189 -9311 -9384 -6437 -1887 5892 5575 10336 11377 15156 36488 55017 67798 87125 112499 149693
14175A49693M0240L4880J5016k0445m1741m7160l9311k7512k0213j5403j1369
14164A6675q460j204q79k608o105k082K954k879m462J936M340K548k047j840l154
14149g267j208o003N23J844N313N69M284M727n315k15O33J88J629k14R84J331
14133A803J90m480k075M202o069o303j23P130J506L986L939L545m759j89L278
14118E581k701L422O922m975n929k387n483P81K198m09J777n719O816L539L166
14103F599q1k916n876K452L691l790k975k116J816K556P14O616J804j111J907
14088I290j110n627M67k919k778j549m842l69N616J470k794j194p4p55Q646l380
14072a902o621L198j762o259J17O013N809K452k337q74M438M043o49J173K820
$$ plain form
14175 149693 189933 224813 239829 219384 177643 130483 91172 63660 43447 28044 16675
14164 16675 8215 7011 6132 3524 -2581 -4663 -1709 -4588 -9050 -7114 -2774 -226 -2273 -4113 -7267
14149 -7267 -8475 -14478 -13955 -12111 -6798 -6229 -1945 2782 -2533 -2748 -2115 -1927 -298 -512 472 1803
14133 1803 1993 -2487 -4562 -360 -6429 -12732 -12855 -5725 -4219 -233 3706 7251 2492 2303 5581
14118 5581 2880 6302 13224 8249 2320 -67 -5550 -4769 -2571 -2980 -1203 -6922 -106 3433 6599
14103 6599 6518 3602 -2274 178 3869 79 -2896 -5012 -3196 -640 74 6690 8494 7383 9290
14088 9290 8180 2553 3020 101 -2677 -4226 -9068 -9437 -3821 -2351 -5145 -6339 -6413 -7168 1478 -1902
14072 -1902 -8523 -5325 -7087 -13346 -13229 -7216 -1407 1045 -1292 -2166 2272 6315 5666 6839 9659
14057I659j765k376K085k035p694l897K971K758K76k194r75J261p90N098J148
14042C530M920K668r304j4715O08o70L834M931K794r84J407K912k03j790K018
14027A956k424k473M03J561m545L034m42O428Kn341P84k334K18K408L446n07j349
14010H25L33L757R97L140l139l002l719l131N480M725l479j010O445L670m757
13995G135k062J955K803r32M20l329l978l669K354l153l78n865k855K323J510
13980g721L701L854L476K417l476k012P349N348Q152k498j2841n884O113K032
13966H010J592J604J212n225p206K166O050L955m454o796N073m979J349j94k667
13951e10k473l635k765j516P528N567j904k34m6k489J855M793L612j982k545J448
$$ plain form
14057 9659 7894 5518 7603 5568 -2126 -6023 -3052 -294 -18 -2212 -3187 -1926 -2716 2382 3530
14042 3530 8450 11118 1814 -12901 -12293 -12963 -9129 -4198 -1404 -2388 -981 1931 1728 -62 1956
14027 1956 -468 -2941 -2538 -977 -5522 -2488 -2930 3498 3500 -1841 -1057 -3391 -3173 -765 2681 2174 825
14010 825 1158 4915 5912 9052 5913 2911 -808 -3939 1541 6266 2787 1777 8222 11892 7135
13995 7135 5073 7028 9831 8899 9319 5990 2012 -1657 697 -2456 -2834 -8699 -11554 -9231 -7721
13980 -7721 -4020 -166 3310 5727 2251 239 7588 12936 21088 18590 5749 -135 5978 8010
13966 8010 9602 11206 12418 7193 -13 2153 8203 12158 7704 908 5981 1002 2351 2157 -510
13951 -510 -2983 -6618 -9383 -10899 -3371 2196 292 58 12 -2477 -622 4171 7783 5801 3256 4704
13935D704k490j0639m25J535P275O623k136N823r82q29J08P25k889P99m384j849
13919I69K795j639j506j190L093m40k722j984r254M110N757K290q24j846M118
13904A727k0j2074r48R973L994k996m075l599k116K076M255K735L400k343k156
13889b167L39N167O043M911J346l768J892m43l89K351N113J0139R104O545Q56
13874D7039M748l238r867j2922j5909p164K267M147l448j08k39n821m414L311
13860a618k819r05J5977K036k553K24m282k808q700k757K723M754r35j749M391
13845I79K536n593n63j792k078L230L610J234k901l085J241K125L429J908o131
13830a851j684Q568K808M190m46l775n486K821M715M425l478k997O79o271m813
$$ plain form
13935 4704 2214 -8425 -8850 -7315 -40 6583 4447 10270 9288 8459 8567 9292 6403 7202 2818 969
13919 969 3764 2125 619 -571 2522 2082 -640 -2624 -11878 -7768 -2011 279 -545 -2391 1727
13904 1727 1707 -10367 -11315 -1342 2652 -344 -4419 -8018 -10134 -8058 -3803 -1068 2332 -11 -2167
13889 -2167 -1828 3339 9382 14293 15639 11871 13763 13320 12931 15282 20395 30534 39638 46183 47039
13874 47039 51787 48549 38682 25760 9851 2687 4954 9101 5653 5545 5306 -515 -4929 -1618
13860 -1618 -4437 -5342 10635 12671 10118 10342 6060 3252 -5448 -8205 -5482 -728 -1663 -3412 979
13845 979 3515 -2078 -2641 -4433 -6511 -3281 329 1563 -1338 -4423 -3182 -1057 2372 4280 -1851
13830 -1851 -3535 5033 7841 12031 11585 7810 2324 5145 9860 14285 10807 7810 8489 2218 -2595
13815b595j319p79M584J774k227j202K272l597Q406N631l963n810Q29l691K424
13800G37K997l105m119N022J1376Q28p42l900m119k451m140L652L488m329j898
13785g03k198O451j607j695L22P86K078O735O142j097p366J2702Q049L030K328
13770C3957K620J6188J8524J8103J1815J1018O271m224j2640j5530j7065k2727
13758D6310j9058m004p865j1420j229J42M040K475M584O668k942j5224n553K927
13744a49P532l568o96n59j188n041j49O419K685K21j864r229l019q2N874O822
13728D009r20j596l958J099K036J02l909l05K695l12J494l088o010K11L476M855
13712a21n870l9M259k168k090J0601L462k574o080J553M9m38p29M06L787k274
$$ plain form
13815 -2595 -3914 -4693 -109 1665 -562 -1764 508 -3089 5317 10948 6985 1175 2004 -1687 737
13800 737 3734 629 -3490 1532 12908 13736 12994 9094 4975 2524 -1616 2036 5524 1195 -703
13785 -703 -2901 3550 1943 248 570 1356 3434 10169 16311 15214 7848 20550 28599 31629 33957
13770 33957 36577 52765 71289 89392 101207 112225 118496 114272 101632 86102 69037 46310
13758 46310 27252 23248 15383 3963 2734 2876 6916 9391 13975 20643 17701 2477 -3076 -149
13744 -149 7383 3815 3119 2560 1372 -3669 -3818 2601 5286 5507 3643 -5586 -8605 -8687 -2813 4009
13728 4009 3089 1493 -2465 -1366 670 772 -3137 -3442 -747 -1059 435 -2653 -8663 -8452 -4976 -121
13712 -121 -5991 -6030 -1771 -3939 -6029 4572 8034 5460 -620 933 982 544 -185 221 4008 1734
13696A734j015K683k413l100j7J395q682l976J0839M269n00k316K098J933p259
13681d327m25M523L387l550k704j07J173j349m383r38Q555Q086L441M958k648
13666A3692m998p771L299K785n077m083L150p94m017O004L912k948n355K417N441
13651E657L726j123n419q288l883R057K548k715J227k221l547J178k803j435O923
13636a118L354M369J993M359o594j730J726p363q704m402L210J0803M683K254
13622F840l47N733O51m465j820k041K6K636l349j673P379k438l68l45q92J467
13606F994n038j7655j93R558L532j904J0552K577m647l098O609J154k181O29J53
13591G042Q92k729l804J1l981k95L105K106L501N11o071o46m104q142L743O386
$$ plain form
13696 1734 719 3402 989 -2111 -2128 -733 -9415 -13391 -2552 1717 1217 -1099 999 2932 -4327
13681 -4327 -4752 -229 3158 -392 -3096 -3203 -2030 -3379 -7762 -8700 -145 7941 11382 16340 13692
13666 13692 8694 923 4222 7007 1930 -2153 997 203 -3814 2190 6102 3154 -2201 216 5657
13651 5657 9383 8260 2841 -5447 -9330 -273 2275 -440 787 -1434 -4981 -3803 -6606 -8041 -1118
13636 -1118 2236 6605 8598 12957 6363 4633 6359 -1004 -9708 -14110 -10900 -97 4586 6840
13622 6840 6493 12226 12877 8412 6592 4551 4577 7213 3864 2191 9570 7132 6764 6419 5527 6994
13606 6994 1956 -15699 -15892 -6334 -2802 -4706 5846 8423 3776 678 7287 8441 6260 6889 7042
13591 7042 7934 5205 1401 1412 -2569 -2864 241 2347 5848 6359 288 -358 -4462 -12604 -8861 -2475
13575b475K698M514K269m177l182m566k656L776L677J598P20N970j626l938N497
13560H099J004J908J416l114P54n076k931N349j247l614J820N2p371K406M913
13545D368o644j0910N634O975K334k554P84J193O271m527n475r42L363N069M504
13530I443k288k475J257k113M951L26l184l76N414P721J351j679n025j646j511
13515A0166j829m016O663L040k215l162p877l810K266k341M967N478j11R16Q401
13500A6536K936m009p63o368j254l303j34K413j487j929k024l66Q42m013K070
13485h53P106O383j797q464l445L616j25o171p26R070L074j678n331n258j008
13470e607J135J1243Q699m712n043Q79l228m559K037L08N031j902k900K508P285
$$ plain form
13575 -2475 223 4737 7006 2829 -353 -4919 -7575 -3799 -122 1476 2196 8166 6540 2602 8099
13560 8099 9103 11011 12427 9313 10067 4991 2060 7409 6162 2548 4368 4420 -2951 -545 4368
13545 4368 -2276 -13186 -7552 -577 1757 -797 -13 1180 7451 2924 -2551 -3493 -130 4939 9443
13530 9443 7155 4680 5937 3824 8775 9101 5917 5541 10955 18676 20027 18348 13323 11677 10166
13515 10166 8337 4321 10984 14024 11809 8647 770 -3040 -774 -3115 1852 7330 7219 8135 16536
13500 16536 19472 15463 14700 8332 7078 3775 3641 6054 4567 2638 614 248 1090 -2923 -853
13485 -853 6253 12636 10839 2375 -1070 2546 2421 -3750 -4476 4594 7668 5990 659 -4599 -5607
13470 -5607 -4472 6771 15470 10758 5715 6594 3366 -1193 844 1152 6183 4281 1381 3889 11174
13455A1174m858k899Q089o743o183k145J0283L110r948o516P258J543J718J180
13441E063L700N959l557q301j636r231K288P561N585J421m173N673j402l867R90
13426F073n744P0N179p53O2k766N512p24j074p506k450L161L923J492j251M47
13410C651J567K956M39n073l728K672k868j504K778j103j425M045O91J805j892
13395C011k724o979R22N933N1N647J603J676k09j01R15L45p596m630N394J327
13379D585o385m74M825J022M31o9M190k786n230M563N955j661K845j887p20q45
13363H359J1q268O8J056q17l760k821J4J111O51j23N170N286j10m016j076N400
13346F135M515L451j179L051o140q875Q309K700k612l76m213L035N805o49q496
$$ plain form
13455 11174 6316 3417 11506 4763 -1420 -3565 6718 9828 -120 -6636 622 2165 3883 5063
13441 5063 8763 14722 11165 2864 1228 -8003 -5715 1846 7431 8852 4679 10352 8950 5083 6073
13426 6073 329 399 5578 4825 4887 2121 7633 6909 5835 -1671 -4121 -960 2963 4455 3204 3651
13410 3651 5218 8174 8613 3540 -188 2484 -384 -1888 890 -213 -1638 2407 3098 4903 3011
13395 3011 287 -6692 -5770 163 214 5861 7464 9140 8931 8830 9745 10090 2494 -2136 3258 4585
13379 4585 -1800 -2274 2551 3573 4004 3935 8125 5339 109 4672 10627 8966 11811 9924 9204 8359
13363 8359 8370 102 170 1226 409 -3351 -6172 -6158 -5047 -4396 -4519 651 5937 5827 1811 735 6135
13346 6135 10650 14101 12922 15973 9833 958 9267 11967 9355 8979 4766 7801 13606 12957 4461
13331D461j546r54j135j409j35N883J686J699J140l597q29M303k491m714L244
13316E606P009L077n772J157J265J565q146l568n053K227K130J859M5K275J325
13301G001p932n143J1192o983J452l789O345K893r78K434J805M213l245l328k773
13286C164K22L713J51L201J193o636n121K087L952P90J3347R192l010j2205p029
13271G011m128j763Q54N106j952j220K813M424k516Pm182j993k878Q94o20L099
13255B956J691k846K275L095L83m443m779o45L211l670k300Q71K130J171J178
13240B78m55N139N138n65m22j750m607k51J654J333M346m507J658N434j893R40
13224A1470K972N311j1262o403k34l735M317N168K313o11m61m848j661L408N981
$$ plain form
13331 4461 2915 1961 826 -583 -718 5165 6851 8550 9690 6093 5264 9567 7076 2362 5606
13316 5606 12615 15692 9920 11077 12342 13907 5761 2193 -2860 -633 1497 3356 3401 5676 7001
13301 7001 -931 -6074 5118 -1865 -413 -4202 2143 5036 4058 6492 8297 12510 9265 5937 3164
13286 3164 3386 7099 7250 10451 11644 5008 -113 1974 5926 6716 20063 29255 26245 14040 7011
13271 7011 2883 1120 1974 7080 5128 3908 6721 11145 8629 8636 4454 2461 -417 477 -143 2956
13255 2956 4647 1801 4076 7171 7554 3111 -1668 -2313 898 -2772 -5072 -4201 -2071 -900 278
13240 278 -177 4962 10100 9535 9113 7363 2756 2505 4159 5492 9838 5331 6989 12423 10530 11470
13224 11470 14442 19753 8491 2088 1854 -1881 2436 7604 9917 9306 8845 3997 2336 5744 11725
13209A1725J112j997M3K816P43j1370o302O20K962l835n2L371P115j01j186j83
13193E481p185K287O881J539K191p506n234L428J0074K892n197k022q374j386
13179b131m40q964N054K279R24q637m196J838K713O047J1778M769L109j367m839
13164G937L11N064M366l099m111p10J01k274p022l917N548L998N418K622m937
13149I295J273l937n964q40L131L513K73K181p498J729l242q75J682j386M19M482
13133D236J698J795j204j70M792L877p838j1218m92Q518O088J345j751N92P38
13118A1006q870j542J926O888N473J179l90m369n236o903k49M511m144O045M257
13103I582n454J390j049J323Q70o64P60R7l662o068k163r13R371K728J988K381
$$ plain form
13209 11725 12837 10840 10883 13699 14442 3072 -3230 -2610 352 -3483 -3535 -164 6951 6850 5664 5481
13193 5481 -1704 583 7464 9003 11194 3688 -1546 1882 11956 14848 9651 7629 -745 -2131
13179 -2131 -2571 -11535 -6481 -4202 -3278 -11915 -16111 -14273 -11560 -5513 6265 11034 14143 12776 7937
13164 7937 8248 13312 17678 14579 10468 9758 9859 7585 563 -3354 2194 6192 11610 14232 9295
13149 9295 10568 6631 667 -173 2958 6471 6744 8925 1427 3156 -86 -961 721 -665 -246 4236
13133 4236 5934 7729 6525 6355 11147 15024 7186 -4032 -4524 3994 10082 11427 9676 10268 11006
13118 11006 2136 594 2520 9408 14881 16060 15670 11301 6065 -838 -1087 3424 -720 5325 9582
13103 9582 4128 5518 4469 5792 6662 5998 6758 6855 3193 -2875 -5038 -5951 3420 6148 8136 10517
13087A0517R32o27j427o61R81k071o647K433Q824L577o23k340p394k527N312n6
13071H203j075K648k384m965K420P214m729k809L184R88J570j150o227l531N345
13056D702N23k362l408j5j540N015M677Q537J346n340o385N42O463L88j0982K023
13040D184k247n403N26l365j922p112k651J2789Q066J010l488K555k240J800Q930
13025A1432j514j039j851k344N734l3J740R503n662r578m143k506m411R793L922
13010I043n639k63Q376j684m844l097O071N009j295m341J815P81m514K081J513
12995I012Q31N092J029J508L57K595l216m647l334l031R43l31P149M323r814r06
12979G560N784o4j288O25j960J76N172J032k431n66l302J334r9j570k474l549
$$ plain form
13087 10517 11449 10822 9395 8734 9715 7644 997 3430 12254 15831 15208 12868 5474 2947 8259 8203
13071 8203 7128 9776 7392 2427 4847 12061 7332 4523 7707 8695 10265 9115 2888 -643 4702
13056 4702 5225 2863 -545 -560 -2100 2915 7592 16129 17475 12135 5750 6292 12755 13143 2161 4184
13040 4184 1937 -3466 -2940 -6305 -8227 -15339 -17990 -5201 2865 3875 387 2942 702 2502 11432
13025 11432 9918 8879 7028 4684 10418 10385 12125 21628 15966 6388 2245 -261 -4672 5121 9043
13010 9043 3404 3141 11517 9833 4989 1892 7963 12972 11677 7336 9151 9932 5418 7499 9012
12995 9012 9843 14935 15964 17472 17829 20424 17208 12561 9227 6196 7139 6808 13957 18280 8466 7560
12979 7560 13344 13280 11992 12617 10657 10833 16005 17037 14606 14040 10738 12072 11973 10403 7929 4380
12963D380K143N851J387J777j443k284k527L320K554K170p423m25J162l384p736
12948d78j831P260J167K282r56J381O142M319L005n457j654k65j0552n531L973
12933B805M386P78K532p66j0178o11J0765J0287m456p170m624k629k547J501O089
12918F162L834m064j235Q93L350J591j989k897M803j702j1317J084J1255L874
12904A3642J420N525k348j65l302N42J004o757l231o488K225J2046L780k128o36
12889A5129j296n637r19l897l831k602M497j211j812R384M069j4n26M895k286
12874A3943l144K439K866M925k326K270m802o57K437N428m36j0701l313J620L745
12859A4294m656m581J663j359N66Q084j259m374L647J13j587j1797L213N178l763
$$ plain form
12963 4380 6523 12374 13761 15538 14095 11811 9284 12604 15158 17328 9905 9480 10642 7258 -478
12948 -478 -2309 4951 6118 8400 7444 8825 14967 19286 22291 16834 15180 14915 4363 -1168 2805
12933 2805 7191 7969 10501 9735 -443 -1054 9711 19998 15542 8372 3748 1119 -1428 73 6162
12918 6162 9996 5932 4697 5590 8940 10531 8542 5645 10448 8746 -2571 -1487 9768 13642
12904 13642 15062 20587 18239 18074 14772 15314 16318 9561 6330 -158 2067 14113 17893 15765 15129
12889 15129 13833 8196 7277 3380 -451 -3053 1444 233 -1579 7805 11874 11860 11334 16229 13943
12874 13943 10799 13238 16104 21029 18703 20973 16171 15514 17951 23379 22943 12242 8929 10549 14294
12859 14294 9638 5057 6720 5361 5927 14011 12752 8378 12025 12138 10551 -1246 1967 7145 3382
12844C382n84P8M758L710J73M02j742j385k547k015j159K588J298k035o03m368
12828d9L722R294M004n437l223j16J367o37m64j117j611n962L214M012K411n674
12812C734l726N681P171n051n630l117P139R925N442P99m935o148l736K78m128
12797C698N48R127k870j950P42K047k350j506L409N770r1k377l29O66K757j600
12781A5691k412O04j242l550k488k67P207n2Q12L22L525k008k977R14R09k629
12765A2359k709l974P50N91L087J860K378N680J176j1051o791R26O874J0747N286
12750B7189j7M48m757n245p762l520K308L026O189K286o831j214L441j774m358
12735I409K59J4J68J971k113k498N61k775L081k630M953J089J684n62o63j818
$$ plain form
12844 3382 2798 2876 7634 11344 11517 11919 10177 8792 6245 4230 3071 5659 6957 4922 4319 -49
12828 -49 3673 12967 16971 11534 8311 8195 9562 8925 8461 7344 5733 -229 2985 6997 9408 3734
12812 3734 8 5689 12860 7809 2179 -938 6201 16126 21568 22367 17432 11284 7548 7826 3698
12797 3698 4246 13373 10503 8553 9295 11342 8992 7486 10895 16665 16574 14197 13868 14534 17291 15691
12781 15691 13279 13883 12641 9091 6603 6336 13543 13491 14303 14625 18150 16142 13165 14079 14988 12359
12765 12359 9650 5676 6426 7017 10104 11964 14342 20022 21198 10147 3356 4282 11156 21903 27189
12750 27189 27172 27620 22863 17618 9856 6336 8644 11670 17859 20145 13314 12100 15541 13767 9409
12735 9409 9668 9682 9850 11821 9708 7210 7771 4996 8077 5447 10400 11489 13173 12611 11948 10130
12719A0130K609K628J625j1799m502K141M571l06j229N769K802p012l938L73N896
12704I758L935j330M439m301j914L989M146j727p27K87j213l831n454J157k506
12689D708k844J42l332n30L661R804P843k397p368l417K579N437j926j777q677
12674A906K21Q347K48l249P135N040j608m8k20J528J900j413m643P96L512n205
12658A4247j488l669j424RO194N619n382p017J474N09l193p4K957N392j399l734
12642I021r16M023K188p846k196k91k831m685J936J2467O398L92M535Q33m583
12627A8445J987l256q994k448Q743K030J701J451l293m833L57L756R024L797k325
12612B6142n351m64M427l190j405k66J614L518O751n751r06l905M616m653n561
$$ plain form
12719 10130 12739 15367 16992 5193 691 2832 7403 7097 5868 11637 14439 7427 3489 3862 9758
12704 9758 13693 12363 16802 12501 10587 14576 18722 16995 16268 16555 15342 11511 6057 7214 4708
12689 4708 1864 2006 -1326 -1856 1805 11609 19452 17055 9687 6270 8849 14286 12360 10583 1906
12674 1906 2127 10474 10722 7473 14608 19648 18040 17992 17772 19300 21200 19787 15144 15940 19452 14247
12658 14247 12759 9090 7666 7675 13869 19488 14106 7089 8563 9072 5879 5805 8762 14154 12755 9021
12642 9021 8105 12128 14316 6470 4274 3983 1152 -3533 -1597 10870 17268 17660 22195 23028 18445
12627 18445 20432 17176 8182 5734 14477 16507 18208 19659 16366 11533 11890 15646 24670 28467 26142
12612 26142 20791 20327 24754 21564 20159 19893 21507 25025 31776 26025 25119 21214 25830 21177 15616
12597A5616N563J571m565n461M418L27o056k588j334J153N119P689m413l807L461
12582A6693m219q87q87l032j949O480j896k149k881M574L362N288L318L012M435
12567B9262o351p873m963P51J801O348J078k055N1O454K33j1259k678L247l00
12552A3746L539M124o668k089k496k031O518J0849j871l621q450l088J564N444
12538A5470N644O04j827o593q182j77O508M869m544m275O158J525k07k237j26
12523A2610r03L267n57N505K847j263m808l039j635K858K289M125K815J240m970
12508B0381p30J224j808l918N632J0506r15q161r478M41N582p045L409K953K32
12493A8305P935l57l855k462n74L871J558m684r144J096N792M681o134m735M72
$$ plain form
12597 15616 21179 22750 18185 12724 17142 17469 11413 8825 7491 8644 13763 21452 17039 13232 16693
12582 16693 12474 11587 10700 7668 5719 12199 10303 8154 5273 9847 13209 18497 21815 24827 29262
12567 29262 22911 15038 10075 10826 12627 18975 20053 17998 18049 24503 24736 13477 10799 14046 13746
12552 13746 17285 21409 14741 12652 10156 8125 14643 25492 23621 20000 11550 8462 10026 15470
12538 15470 21114 21718 19891 13298 5116 4939 11447 16316 11772 7497 13655 15180 14973 12736 12610
12523 12610 11707 14974 14417 19922 22769 21506 16698 13659 12024 14882 17171 21296 24111 25351 20381
12508 20381 19651 20875 19067 15149 20781 31287 30372 22211 12733 13174 18756 11711 15120 18073 18305
12493 18305 26240 25883 22028 19566 18992 22863 24421 19737 10593 11689 17481 22162 16028 11293 11765
12478A1765M801O817j884j3241p54m06l976k241J255P812J0930k81m271m814k433
12463I079O916P54j684k481l984j72n466m989N912K007j385M435J580J928m056
12448H394j393Q313J931J256o298J23L675N523o45m642m336j677R080J0816n557
12433B4563o453K150j622k955n5q892k997j901R393K554n307j651L90O87k445
12418E459J395M860J991L521P93m03q907o577K674K981P941L755P81L357J840
12403B5461j192p49r255q701J81j302L815J3045L878q088p147p842K108j524k626
12388F2M624Q779M071J936m114k056P973P54K89J844m178o74k975L600K295n52
12372B1678J459P9J36L191o677j755K382l001Q74m841o704N214M428O445r09o2
$$ plain form
12478 11765 16566 23383 21499 8258 7504 7098 3122 881 2136 9948 20878 20597 16326 11512 9079
12463 9079 15995 16749 15065 12584 8600 8428 2962 -2027 3885 5892 4507 8942 10522 12450 8394
12448 8394 7001 15314 17245 18501 12203 12326 16001 21524 20879 16237 11901 10224 19304 30120 24563
12433 24563 18110 20260 18638 15683 15628 6736 3739 1838 11231 13785 8478 6827 7217 7904 5459
12418 5459 6854 11714 13705 17226 18019 17616 8709 2132 4806 7787 15728 19483 20264 23621 25461
12403 25461 24269 23520 14265 5564 5745 4443 8258 21303 25181 17093 9946 2104 4212 2688 62
12388 62 4686 13465 17536 19472 15358 13302 21275 22029 22318 24162 19984 19310 16335 19935 22230 21678
12372 21678 23137 23216 23352 26543 19866 18111 20493 17492 18366 13525 6821 12035 16463 22908 21999 21937
12356B1937N593L54k379m320k243k726N955M150n798k504Q55N044r72l339J476
12341B1083M707K254M734j55l609q429q162J276M753n89j958j579n862k047j102
12326E315q80O738L989l873k008k869N085K340K518M008J443o98j332l623r68
12311A5185K743m249k927N186n8K96K287p779K675K117R63l018L340n45Q43L393
12295B0452K823o389m874R909n14kj632k861k448J906K739k974K44r2m253r651
12279B383K082J0130N788J831K791K082j557m950j202q16o02J601K276M149L894
12264B9880k513J393K591M113M64J231m556M71J039k372r781p569K434j881L684
12249A8628N957K720m421J345m11k717j586k024l483K055L776j85P278L727o968
$$ plain form
12356 21937 27530 27884 25505 21185 18942 16216 22171 26321 20523 18019 18874 23918 22946 19607 21083
12341 21083 25790 28044 32778 32623 29014 20585 12423 13699 18452 17863 15905 14326 8464 6417 5315
12326 5315 4435 11173 15162 11289 9281 6412 11497 13837 16355 20363 21806 21108 19776 16153 15185
12311 15185 17928 13679 10752 15938 15880 16176 18463 10684 13359 15476 16439 13421 16761 16216 17059 20452
12295 20452 23275 16886 12012 21921 21407 21405 19773 16912 14464 16370 19109 16135 16379 16287 12034 2383
12279 2383 4465 14595 20383 22214 25005 27087 25530 20580 19378 18562 17960 19561 21837 25986 29880
12264 29880 27367 28760 31351 35464 35928 37159 32603 33074 34113 31741 21960 14391 16825 14944 18628
12249 18628 24585 27305 22884 24229 23818 21101 19515 17491 14008 16063 19839 19654 26932 30659 23691
12234B3691j0175l550p26N531M039j449n130l109J575J599O267L698l244M831
12220B3848L389N215r907l904o738J898M042N09M170k003n400n740O591N904q54
12205B1020n383l961n57L269L234J1213N247O9J47P00o58q815n211m55j09L077
12189B2827P647K791L445o757o927O57l571j261l293j093n11J472J0226Q22l249
12174B3225n419k863p58j534k313Q80N501M496L162j544J345M994k635o924k091
12159A7522M455M759K480k976k282m442J720l259p933J110J0674O310k77k082
12145B5779J114J040m061k676k858l46J447p9O64k174M660K233m108N331k546
12130B3420k441K04J1416R45j283J88J16l350O287q66K613j741o330j1733q20
$$ plain form
12234 23691 13516 9966 9240 14771 18810 17361 12231 9122 10697 12296 18563 22261 19017 23848
12220 23848 27237 32452 22545 18641 11903 13801 17843 18352 22522 20519 15119 9379 15970 21874 21020
12205 21020 15637 11676 11119 14388 17622 28835 34082 34151 34298 34998 34340 25525 20314 19859 19750 22827
12189 22827 30474 33265 36710 29953 23026 23683 20112 18851 15558 14465 13954 15426 25652 26474 23225
12174 23225 17806 14943 14185 12651 10338 11218 16719 21215 24377 22833 24178 29172 26537 19613 17522
12159 17522 21977 26736 29216 26240 23958 19516 21236 17977 10044 11154 21828 28138 27861 25779
12145 25779 26893 27933 23872 21196 18338 17992 19439 19360 20024 17850 22510 24743 20635 25966 23420
12130 23420 20979 21183 32599 33544 32261 32449 32565 29215 35502 34636 37249 35508 29178 17445 16625
12115A6625O017Q980L127m499q77n566j541k276j561N428J0402N703n247p612
12101B7103n738p55N110l345m069L460Q24L044J729m432k388o96j95J967O767
12086B8386O702l742m228k676j391k375j347K447P58J260M511k386j248k658K577
12071B4590l371p021n907L664R753P260J679m11K200l059K304o02p289L877K387
12056C0054k139n324n044l284M518L953Q1OK156K23M82L033O966M322k668l608
12040C3727K429N47k981R07j993r762K218J781l633m341K942K780l236O68K028
12025B4081j070K768K812R29J348N062j793k864l791J443K827l374q194J823l767
12010A8240M618N924l157K296j97n255l441K187N042K340L630M893l712J23m054
$$ plain form
12115 16625 22642 31622 34749 30250 29373 23807 22266 19990 18429 23857 34259 39962 34715 27103
12101 27103 21365 20610 25720 22375 18306 21766 22590 25634 27363 22931 20543 19847 19652 21619 28386
12086 28386 35088 31346 27118 24442 23051 20676 19329 21776 22534 23794 28305 25919 24671 22013 24590
12071 24590 21219 14198 8291 11955 21708 28968 30647 30236 32436 29377 31681 31079 23790 27667 30054
12056 30054 27915 22591 17547 14263 18781 22734 22815 22821 24977 25200 25682 28715 35681 40003 37335 33727
12040 33727 36156 36703 33722 34629 32636 22874 25092 26873 23240 18899 21841 24621 21385 22053 24081
12025 24081 23011 25779 28591 29520 30868 35930 34137 31273 27482 28925 31752 28378 20184 22007 18240
12010 18240 22858 28782 25625 27921 27724 22469 19028 21215 26257 28597 32227 37120 33408 33531 29477
11995B9477J901M407k656K46o301m318j889o841L980M354J987R8L873m929j368
11980B2021K247j78k349K169l593o030l177N959M860K931k932O524m822j706Q183
11965C0107Q806j603J696l98l189n974j924q49O929k883K779R83l131o88l086
11950B7575L958N347J029K690j67m183o936m735o51M924r2p563J788O302L516
11935C2802j85l038Q06J860r77P15M918J184l750J903m182K074N643K527l954
11920C8346k088q86m370k484m907K731Q771n12l735M05r95q28k792R96J293j114
11904B7831M810K329p67K016L145P063O013J241m287p358k470N591j674j493l703
11889C8287k244k073J926j477K026L243J114k237m652j0885n9L069L518k595j871
$$ plain form
11995 29477 31378 35785 33129 33375 27074 22756 20867 14026 18006 22360 24347 24445 28318 23389 22021
11980 22021 24268 24090 21741 23910 20317 14287 11110 17069 21929 24860 21928 28452 23630 21924 30107
11965 30107 38913 37310 39006 38608 35419 29445 27521 26672 33601 30718 33497 34480 31349 30661 27575
11950 27575 31533 36880 37909 40599 40432 36249 29313 24578 23927 28851 28759 21196 22984 29286 32802
11935 32802 32617 29579 30385 32245 31268 31983 36901 38085 34335 36238 32056 34130 39773 42300 38346
11920 38346 36258 35372 31002 28518 23611 26342 35113 34601 30866 31271 30276 29448 26656 27652 28945 27831
11904 27831 32641 34970 34203 36219 39364 46427 52440 53681 49394 42036 39566 45157 43483 41990 38287
11889 38287 36043 33970 35896 34419 36445 39688 40802 38565 33913 23028 22969 26038 29556 26961 25090
11874B5090k006L58m47L595O136N274j556p88L664k050m934J897M976J49K734
11859D2092k555l197O26L214K464m200j362Q61l849K264L855l606m638K489k36
11844C4222m637L832N770q04n993P81k725m225N908K86k190j850O162k11J890
11829C6216r47J998k335K522O228Q16k306m646p856l482P873K449n555J035L294
11814C5304J84l673R18K840N351M302K057R53j004K33l66k301m92m54j657n055
11798C7140J504M451n720n423m614r7L808M075N70m159r79R58J378M923L440N498
11782D6753k420o140o59q31J132j158n545L507M076l867J99r70M737R87q47j909
11766C7045J650N262L969K817m882j782n94p226L219N936k142K260L205l436n52
$$ plain form
11874 25090 23084 23442 22995 26590 32726 38000 36444 35656 39320 37270 32336 34233 39209 39358 42092
11859 42092 39537 36340 36966 40180 42644 38444 37082 37943 34094 36358 40213 36607 31969 34458 34222
11844 34222 29585 33417 39187 38383 32390 33171 30446 26221 32129 32415 30225 28375 34537 34326 36216
11829 36216 35269 37267 34932 37454 43682 44498 42192 37546 29690 26208 34081 36530 30975 32010 35304
11814 35304 35488 31815 32733 35573 40924 45226 47283 48236 47232 47465 47099 44798 44306 43852 42195 37140
11798 37140 38644 43095 37375 31952 27338 27241 31049 35124 35694 31535 30556 31514 32892 37815 41255 46753
11782 46753 44333 38193 37534 36703 37835 36677 31132 34639 38715 34848 35047 34077 38814 39801 38954 37045
11766 37045 38695 43957 47926 50743 45861 44079 43485 36259 39478 45414 43272 45532 48737 45301 44749
11751D4749r06k767k840j136n0j101L150k656O27Q532O163k19m891o605l918k129
11735C4003N559k134J372m9k462J158O660j346l385j528k391k299J141O227L206
11720D3732k219M303R7o62o672o453K81O55l915k818R53K487K300k965q96N803
11704C4011P231K061J372l937q252k639M521N257P88p89j848J0188q93n949o67
11689D0455M552N599k403r604k484n904N507Q724K269m938q340j345L768P56J590
11674C8202j849p60L148L580P305j086n057L67l80r55k781l259N033N234M67k954
11658D4255k558K81N779O915O948J71k292k232m874L79M204p168K246K777J265
11643E6096m104n285J902J2718J947K338K283k370k842k904O079J3465P132K322
$$ plain form
11751 44749 43843 41076 38236 37100 37050 35949 39099 36443 37070 45602 51765 51546 46655 40050 36132 34003
11735 34003 39562 37428 38800 38751 36289 37447 44107 42761 39376 37848 35457 33158 34299 40526 43732
11720 43732 41513 45816 45913 45251 38579 32126 32407 33062 29147 26329 27282 29769 32069 29104 28208 34011
11704 34011 41242 43303 44675 40738 32486 29847 34368 39625 40413 39624 37776 47964 47071 41122 40455
11689 40455 45007 50606 48203 38599 36115 30211 35718 44442 46711 41773 33433 32088 35856 36612 38202
11674 38202 36353 35593 38741 42321 49626 48540 43483 43850 43470 42515 39734 36475 41508 46742 47209 44255
11658 44255 41697 41978 47757 54672 61620 61791 59499 57267 52393 52772 56976 49808 52054 54831 56096
11643 56096 51992 46707 48609 61327 63274 65612 67895 65525 62683 59779 65858 79323 86455 88777
11629H8777K562L451M742N794N32L896R75Q592J5678J5561K355Q452J5439J9025
11615A95831K5176K5659K1324K8469L8600N1631O5813P9013J05125J52518K12399
11604A001558K77208L07616K49204P4715j47094k92531l15245k62071k05652j52510
11594E35198j00688p2272n8901l5760k6249k8615k5580j9079j4403q426n856r170
11582A30199j5302q876K867j457q318Q26n544p285p299o717j123p071n43J3762
11568G8119k477r794j324p586R89K758M23j30K34k371L67j601O5L407j924j147
11552E8008r67J176k668m36m520L26M413P039r894k69L020J688K281O160K435
11537F7792k739m464j886k467J468K25J840j644L952J485j0138l492j154P365
$$ plain form
11629 88777 91339 94790 99532 105326 105858 109754 110729 119321 134999 150560 152915 161367 176806 195831
11615 195831 221007 246666 267990 296459 335059 386690 452503 531516 636641 789159 1001558
11604 1001558 1278766 1586382 1835586 1910301 1763207 1470676 1155431 893360 687708 535198
11594 535198 434510 362238 303337 267577 241328 212713 187133 168054 153651 145225 139369 130199
11582 130199 114897 106021 108888 107431 99113 99939 94395 87110 79811 73094 71971 64900 64357 78119
11568 78119 75642 65848 64524 56938 57927 60685 61108 60978 61212 58841 59208 57607 57672 61079 59155 58008
11552 58008 57041 58217 55549 55113 50593 50919 55332 62371 52477 52208 55228 56916 59197 65357 67792
11537 67792 65053 60589 58703 56236 57704 57929 59769 58125 62077 63562 53424 49932 48778 56143
11523E6143N940R1j980J659n55J926L128m023j792M520K150K66l632q00L123L41
11507F6505N283L49l12k973m53n603j887L229K832L804k195M42K548M834J686
11492G8089O292Q403l457k97j915M461R780M323n035l562J606P55M61O169M264
11477A10337O064M714Q396R424K951r45P144J6412K0144K1518K0820L0487L9700
11464B97166L4194M1226M9035O7557Q9699J06446J49567K02312K75938L09642
11454A622782K48642P3484j51205k94661l22302k72154k07919j54845j01575p2746
11444C67501n4290m1047k1229j9825k3625j3260j2138q087O634p26l697M400J2088
11431A92699K9893L8283O3828J18629J60308J15452J4834j07678j57669j28943
$$ plain form
11523 56143 62083 62174 60194 61853 61298 63224 66352 62329 60537 65057 67207 67473 63841 63041 66164 66505
11507 66505 71788 72137 71825 68852 68399 62796 60909 64138 66970 70774 68579 69021 71569 76403 78089
11492 78089 84381 92784 89327 89030 87115 91576 101356 105679 100644 97082 98688 99443 99904 106073 110337
11477 110337 116401 121115 129511 138935 141886 140941 148085 164497 184641 206159 226979 257466 297166
11464 297166 331360 372586 421621 489178 578877 685323 834890 1037202 1313140 1622782
11454 1622782 1871424 1944908 1793703 1499042 1176740 904586 696667 541822 440247 367501
11444 367501 313211 272164 250935 231110 207485 194225 182087 174000 180634 179908 176211 180611 192699
11431 192699 222592 260875 324703 443332 603640 719092 733926 626248 468579 339636
11421C39636q8313n8932k7916k0875j4233j6369r908m861q004k467l501o850j888
11408G5519q845m699k142L958K669M778R237P117l7p513k20p501o428m072j2J058
11392F2867L70N20R47K5K942N39L94K766k285j080m121J048o917m559o58J409
11376E4207O125L404q062n247R844M207k749m101R15N354J525j263M338J689p233
11361F2953o115M485L940p27M548J416k79j040p12q21J620o557j874M064K792
11346F7693J690N414L836j979l754L819p61m763n75m115J390L157l603k068K82
11331F5663o25r95j353k215P655k178m40p92J021K260P438N450p024o892R30O945
11315G4848J334O087o280j65m82k504K404K558l71J086j135n335L543K221l852
$$ plain form
11421 339636 251323 192391 164475 143600 129367 112998 103090 98229 90225 87758 84257 77407 75519
11408 75519 66674 61975 59833 63791 66460 71238 80475 87592 87555 80042 79822 72321 65893 61821 61809 62867
11392 62867 63237 63757 64704 64729 67671 68210 68604 71370 69085 68005 63884 64932 58015 53456 52798 54207
11376 54207 60332 63736 55674 50427 60271 64478 61729 57628 58543 63897 65422 64159 68497 70186 62953
11361 62953 56838 61323 65263 64536 69084 70500 70221 69181 68469 67648 69268 62711 60837 64901 67693
11346 67693 69383 74797 78633 76654 72900 76719 75958 71195 70620 66505 67895 71052 67449 65381 65663
11331 65663 65038 64043 62690 60475 68130 65952 65512 64720 65741 68001 75439 80889 73865 66973 67903 74848
11315 74848 76182 82269 75989 75824 75342 72838 75242 77800 77429 78515 77380 72045 75588 77809 73957
11300G3957K226J2221J8734J8483J9023K2976J9602J3758j891j5107j7203k6358
11288A40421k4732j5395o109k577J271m295l320N34l873j648l56P158p20o524
11274G9835m926p922K508O630J676L537L576M576M325R6n038k909J113p176r749
11259G0152m522N844j13K230J7Q36L593j556L627J574O931j502j203n15L418l395
11243H5416m213p536K2P90n140l228K815J378j35L406L83J209l767j769N684L658
11227G8973K01M28l100L851j074M040M270O120K615l33q251j553M818K355m017
11212H9343j092k918r25m428n727m08L433r30J357M007J138J954j671l661J933
11197H1405O222J645m823M50P65k742K813L920k52n365K168N60n65N941O132k058
$$ plain form
11300 73957 76183 88404 107138 125621 144644 167620 187222 200980 199089 183982 166779 140421
11288 140421 115689 100294 94185 91608 92879 88584 85264 85798 81925 80277 79921 87079 86359 79835
11274 79835 74909 66987 69495 76125 77801 81338 84914 89490 93815 93911 88873 85964 87077 79901 70152
11259 70152 65630 71474 71361 73591 73608 74444 78037 76481 80108 81682 88613 87111 85908 85393 88811 85416
11243 85416 81203 73667 73689 74479 69339 66111 68926 70304 70169 73575 73958 75167 71400 69631 75315 78973
11227 78973 79174 79602 76502 80353 79279 83319 87589 93709 96324 95991 87740 86187 91005 93360 89343
11212 89343 88251 85333 84408 79980 74253 73845 77278 76348 77705 81712 82850 84804 83133 79472 81405
11197 81405 87627 89272 84449 84899 85664 82922 85735 89655 89403 84038 86206 86766 86201 92142 98274 96216
11181I6216m35j738l604L766J0465K1223K4752K0905P653J091P800P389m685j9285
11167A71513j9717j5382j2667j5055o755J165kk64l643O161K046O591R94l921
11153A11064n902l804O080O847N09l766l648p130q573k451N609M683n737o571
11139H7210o377o495L814m43m067l857j4J733O214P370O320O231M068j066J072
11124A01713J150J445Q61M687J135j249M319j982r449l321J921l619k992o91j227
11109I2701P369N779M02n701R00k321M664L796l155l131n8O299J93K770N088N730
11093A21325j958M630K002N010J0129N730n378m170J252M353l414j0356j4619
11080A14536j2006r452L331L163q659j02R229L871M851L449K47J923P266P863
$$ plain form
11181 96216 95781 94043 90439 94205 104670 125893 150645 171550 179203 180294 188094 195483 190798 171513
11167 171513 151796 136414 123747 108692 101937 103102 103100 102836 99193 105354 107400 113991 114985 111064
11153 111064 105162 101358 107438 114285 114794 111028 107380 100250 91677 89226 94835 99518 93781 87210
11139 87210 80833 74338 78152 77709 73642 69785 69771 71504 77718 85088 91408 97639 101707 100641 101713
11124 101713 102863 104308 105169 109856 110991 109742 114061 112079 102630 99309 101230 97611 94619 93928 92701
11109 92701 100070 105849 106251 100550 101450 99129 103793 107589 104434 101303 101245 107544 107737 110507 115595 121325
11093 121325 119367 123997 125999 131009 141138 146868 141490 137320 138572 142925 139511 129155 114536
11080 114536 102530 93078 96409 99572 90913 90811 100040 103911 108762 112211 112458 114381 121647 129510
11066A29510m70m453n398L669J967L280q87m512j4654J234K089K928P248p981
11052A13570o103M525O634J4787K4182J5117J4875J2445R54J029K606j414L791
11039B06998J0991K1983K2253J9811K3004L1649M3988M9091M9985P6622J14150
11028F70525J75006K36141L08645L50760L40948K73478J36315j8215j93266l07770
11018A972567l78113l64987l04063k37691j65781j11393p6845n1651l8238k0975
11008B22830j4579j2254j4521j1479j4104n582K451P80j724n979n448N34k684
10995A38241L859M592j883j754R7n856K018N542q22m987j872k586n72K571J637
10980A38225Q031j907m846K38k024J218o497k063j725n107n2J547Q191J0495m844
$$ plain form
11066 129510 129040 124587 119189 122858 124825 128105 127218 122706 108052 109286 111375 114303 121551 113570
11052 113570 107467 111992 118626 133413 157595 172712 187587 200032 200986 202015 204621 203207 206998
11039 206998 217989 239972 262225 282036 305040 336689 380677 429768 479753 556375 670525
11028 670525 845531 1081672 1390317 1741077 2082025 2355503 2491818 2473603 2280337 1972567
11018 1972567 1594454 1229467 925404 687713 521932 410539 333694 282043 243805 222830
11008 222830 208251 195997 181476 169997 155893 150311 152762 153542 151818 145839 140391 140925 138241
10995 138241 142100 146692 144809 143055 143152 137296 139314 144856 144034 139047 137175 134589 134017 136588 138225
10980 138225 146256 144349 139503 139741 137717 138935 132438 130375 128650 123543 123491 125038 133229 143724 138880
10965A38880o197l54K938n27j46M455K115k384n626j999Q505J4294K744l865o16
10950A52217q194m238o653k333o62k88J502M77o171l125J0536l10J457m11M076
10935A37880L123M40q39J226o052J8M141l591m596O115O963J0300N296K48J568
10920A62240j296n439o801O641J191k230N526J3765Q590j998p121l250p141l611
10906A59066M456J78O459R109P575Q994K972MO424J37k435m871J1642R714K753
10891B22177l198j247K452K20m692m939J433m438j426r65o421O14N895Q034L516
10876B17015J0308P601Q141Q275J6569K7074L9959L8174L5449L4631K1997J5567
10864D80760r295j7096j3405k3453j8498k3734j5354j6213j3739j7276r924j1817
$$ plain form
10965 138880 132683 132329 135267 134740 134594 139049 141164 138780 133154 131155 139660 153954 156698 152833 152217
10950 152217 144023 139785 133132 130799 130137 129849 131351 131828 125657 122532 133068 132758 134215 133804 137880
10935 137880 141003 141443 140604 141830 135778 135796 139937 136346 131750 137865 144828 155128 160424 160672 162240
10920 162240 160944 155505 148704 155345 156536 154306 159832 173597 182187 180189 173068 169818 162677 159066
10906 159066 163522 163700 170159 179268 186843 195837 198809 198813 205237 205374 202939 198068 209710 219424 222177
10891 222177 218979 217732 220184 220404 215712 210773 212206 207768 206342 205377 198956 199570 205465 213499 217015
10876 217015 227323 234924 243065 251340 267909 294983 334942 373116 408565 443196 465193 480760
10864 480760 471465 454369 440964 417511 399013 375279 359925 343712 329973 312697 302773 290956
10852B90956p274n082n340n198k661j707n72n482L905L989N028M528J00N23J258
10837B76971q339o405m095q70L450j703k12K808R148M80N09N001r03j2471m703
10822B58666n098j3107j3116k649J806M938M277J292k733o842L124J2185J2457
10809B55200J7457L0743M0879M2496L8954L9480J0247O191q404r071j367j8558
10797D44247j9815j4602j5884r966q602j7337j7180j4387k253p71L838O183P659
10784C41130J6943R310L495R659J4703J3035J2877J0204J0358n244m439J1825
10772D43856J8340J0803M180j3593j1380k0093k0446j2341j3067o783J1475J1818
10760D02769J7365J7783J7907P980R801J0742K1374K2526K0763K5350K1551L6175
$$ plain form
10852 290956 283682 278600 273260 268062 265401 263694 263122 257640 261545 265534 270562 275090 275190 275713 276971
10837 276971 268632 262227 258132 257262 260712 259009 258797 261605 270753 271233 271742 276743 275840 263369 258666
10822 258666 253568 240461 227345 224696 226502 231440 235717 237009 234276 227434 230558 242743 255200
10809 255200 272657 303400 344279 386775 425729 465209 475456 481647 473243 464172 462805 444247
10797 444247 424432 409830 393946 383980 375378 358041 340861 326474 324221 323450 327288 333471 341130
10784 341130 358073 367383 370878 380537 395240 408275 421152 431356 441714 436470 432031 443856
10772 443856 462196 472999 477179 463586 452206 432113 411667 399326 386259 379476 390951 402769
10760 402769 420134 437917 455824 463804 473605 484347 505721 528247 549010 574360 595911 632086
10748F32086N2880N4923O2574P2817P2927P9661P0743P5701O2735L6870J2120
10737A286037l2757p4641q7571r4903q5366m1982k8221j6186l4469m4907n4498
10726F90536n2745l3883k7099j2497o871k183J581M897J2262J3181J7364P312
10714F11855K6236J7663J6750J4544K5884K2096J5085K5833K9476K8474L6690
10703H70586L9131L9564L7130K9215K8779K7837L9838N4901N3950N8673O3441
10692A343045Q0103R3568J07457J22034J53443J83125K42943L27365M50449N96470
10682C700002P62894Q88252Q85056P82934N76458L27702j15929o26336j035844
10673F145189j141903r55623p20186n07681l28269k01353j17119n7233j3262R845
$$ plain form
10748 632086 684966 739889 802463 875280 948207 1027868 1098611 1174312 1237047 1273917 1286037
10737 1286037 1253280 1178639 1091068 996165 910799 868817 840596 824410 789941 745034 690536
10726 690536 637791 603908 576809 564312 557441 555258 556839 561736 573998 587179 604543 611855
10714 611855 638091 655754 672504 687048 712932 735028 750113 775946 805422 833896 870586
10703 870586 909717 949281 986411 1015626 1044405 1072242 1112080 1166981 1220931 1279604 1343045
10692 1343045 1423148 1516716 1624173 1746207 1899650 2082775 2325718 2653083 3103532 3700002
10682 3700002 4462896 5351148 6236204 7019138 7595596 7923298 7807369 7181033 6145189
10673 6145189 5003286 4047663 3327477 2819796 2491527 2290174 2173055 2115822 2102560 2112405
10663B112405K7437L3681N1622N4588O7895P6301Q3672Q7894R9511J09114J08354
10652B912474J31577J55941J64201J97879K36417K77539L26435L77779M37540
10643E217782N00247N80857O89331Q08295R62243J111733J230956J307465J320454
10634A3729363J335300J325457J396179J561938J817937K208422K721259L332170
10626B9428025M114665N050029O212739P708428R669151J2484352J7008505K4298639
10618A15974533L4266798M5524130N6745466O0396203N5107892L9436954J4876200
10611D22328176r769787l6744307n3009347o2868587o1788966n2043256m0641933
10604A05461993k8829060j9425411j3161013r192877o616411m929733l700811
$$ plain form
10663 2112405 2139842 2173523 2225145 2279733 2347628 2423929 2507601 2595495 2695006 2804120 2912474
10652 2912474 3044051 3199992 3364193 3562072 3798489 4076028 4402463 4780242 5217782
10643 5217782 5718029 6298886 6988217 7796512 8758755 9870488 11101444 12408909 13729363
10634 13729363 15064663 16390120 17786299 19348237 21166174 23374596 26095855 29428025
10626 29428025 33542690 38592719 44805458 52513886 62183037 74667389 91675894 115974533
10618 115974533 150241331 195765461 252510927 312907130 368015022 407451976 422328176
10611 422328176 412558389 375814082 322804735 259936148 198147182 146103926 105461993
10604 105461993 76632933 57207522 44046509 34853632 28237221 23307488 19606677
10597A9606677k768615k103321j593039j232575r80924p56711n43307m07716k97936
10588H922533k98125l89586n49885p17529q03253q36085p76026o45245n04180
10579C402619l88561k91787k25899j83461j65094j51233j36995j16136j15217
10570A628236j13187r1427q3779q6752p5610o9343o6278n3709m3268l7351k3267
10559H84265j8459j8137q429k0169k4332k2903k7025k9029l6584l4999k8116k3448
10547E92635j9431j6308j6977j6468k3147k6120k6765k4206j9626k0094j5156
10536C68337j3841j5297j5085j8363r67N771P120J551r590j3224p846o574j941
10523B80051p826j1507m802n182m405l208J330K328R820L298j068J1729J3580
$$ plain form
10597 19606677 16838062 14734741 13141702 11909127 10928203 10171492 9628185 9220469 8922533
10588 8922533 8624408 8234822 7684937 6967408 6164155 5328070 4552044 3906799 3402619
10579 3402619 3014058 2722271 2496372 2312911 2147817 1996584 1859589 1743453 1628236
10570 1628236 1515049 1423622 1339843 1253091 1177481 1108138 1041860 988151 944883 907532 884265
10559 884265 865806 847669 839240 819071 794739 771836 744811 715782 679198 644199 616083 592635
10547 592635 573204 556896 539919 523451 500304 474184 447419 423213 403587 383493 368337
10536 368337 354496 339199 324114 305751 304784 310555 317675 319226 309636 296412 288566 281992 280051
10523 280051 272225 260718 255916 250734 246329 243121 244451 246779 256599 259897 258829 270558 284138
10510B84138J3661J0873L472N496P162p16N718P784J696l084N248N290K359J197
10496C50294m62L95Q851K0183J5739J9422J3879M382j0509l6068k9138m8287l2280
10483B76401l0244k7957r865m933p56m075r214k346j767j0166o785K868O099q25
10469A76435j3132r445j595L199N541L663Q779O356l735j3209j6269j5178k2804
10456A08606k7850j7229j7550O50Q855J1036Q292O934J2225J9541K2117K8803
10444A64430L2307K7823K6830K2528J2312J8443J21N447K2858Q681M494q801j8021
10431C19452k8555l5846l5808l4843k7754k7907k7497j5905k1347j7352j219R966
10419E5385L1430K9376K6243K7936K1790J2200R274Q897O970J606k696j124p359
$$ plain form
10510 284138 297799 308672 312144 317640 324802 324086 329804 337588 339284 336200 341448 346738 349097 350294
10496 350294 349832 350227 359078 379261 395000 414422 428301 432683 422174 386106 356968 308681 276401
10483 276401 246157 218200 208335 203402 202646 198571 189357 187011 185244 175078 168293 171161 177260 176435
10469 176435 163303 153858 152263 155462 161003 164666 173445 179801 176066 162857 146588 131410 108606
10456 108606 80756 63527 45977 46627 55482 66518 74810 81744 93969 113510 135627 164430
10444 164430 196737 224560 251390 273918 286230 304673 304794 310241 333099 341780 346274 337473 319452
10431 319452 290897 255051 219243 184400 156646 128739 101242 85337 63990 46638 45419 55385
10419 55385 86815 116191 142434 170370 192160 204360 213634 222531 229501 231107 228411 227287 219928
10406B19928J43k764j0414j1850j0187j1910r332p250q73O35q389r986p468k048
10392A28235m933m79l493o75o492k802j04P060J6556J8829K6649L2187J4302J8558
10378B43398K0571P344R113R232Q015J5731O546L238k406P030m449j0528N854
10365C18689J6444L1363L7799J3788j0221j1711N435K8431K2704M463k2427k0318
10353D14439j3076q283K519J3940J5785J5939J6947K3294J8702J5168J0618J5003
10341E40995K1476J9492K2309L3250L5208L5860N3878Q0511J05189J42360K19097
10330A309625L07952L68607M14463M44562M55672M14000L14154J72117M9140n7710
10320D192582j53931k65577l41973l40250l14117k83054k93170k84125k19472
$$ plain form
10406 219928 220071 217307 206893 195043 184856 172946 163614 156364 155491 156126 147737 137751 130283 128235
10392 128235 123302 122823 119330 118655 112163 109361 109257 116317 132873 151702 178351 210538 224840 243398
10378 243398 263969 271313 280426 289658 297673 313404 319950 323188 320782 327812 323363 312835 318689
10365 318689 335133 366496 404295 418083 407862 396151 401586 430017 452721 457184 434757 414439
10353 414439 401363 393080 395599 409539 425324 441263 458210 481504 500206 515374 525992 540995
10341 540995 562471 581963 604272 637522 672730 708590 762468 842979 948168 1090528 1309625
10330 1309625 1617577 1986184 2400647 2845209 3300881 3714881 4029035 4201152 4250292 4192582
10320 4192582 4038651 3773074 3431101 3090851 2776734 2493680 2200510 1916385 1696913
10311A696913j44070q7675n5437m9778o7236j02107j02924r7272j00249q7914
10301H02251o5106m8559k6187o161l59N785K482j3376j8921j5184j5811k0100
10289E80754k1515j2202l988P59J261P156O010J3831N868L549R160J4836R070
10276F14549P318J1219J1953R42L088J1731J9868J2016J9476K3394L1944K5934
10264G93432J5212K1580J8576J4726R913R577R787J3644J6502K3670J7170K2140
10252I85929K2341K2516J9494K3961K2364L0503L4425M1605M8743M9313M9314
10241A350508M9751N3794N9491O1182P2619Q0410P5589Q0352Q5118R1383J04341
10230B164538J02358J07426J21180J21355J32100J50035J77274K06170K17777
$$ plain form
10311 1696913 1552843 1465168 1409731 1359953 1292717 1190610 1087686 990414 890165 802251
10301 802251 737145 688586 662399 656238 655879 661664 664146 650770 631849 616665 600854 580754
10289 580754 559239 547037 543049 543808 545069 552225 558235 572066 577934 581483 590643 605479 614549
10276 614549 621867 633086 645039 645981 649069 660800 680668 692684 712160 735554 767498 793432
10264 793432 808644 830224 848800 863526 873439 883016 892803 906447 922949 946619 963789 985929
10252 985929 1008270 1030786 1050280 1074241 1096605 1127108 1161533 1203138 1251881 1301194 1350508
10241 1350508 1400259 1454053 1513544 1574726 1647345 1727755 1803344 1883696 1968814 2060197 2164538
10230 2164538 2266896 2374322 2495502 2616857 2748957 2898992 3076266 3282436 3500213
10221C500213K48761K81582L13040L55247M08913M81676N69336O76485P93037
10212G628290R15225J017514J077813J151160J227906J337285J511732J779071
10204A7645996K105070K461681K872727L345998L880993M488106N343669O543989
10196D8688229Q256716J0976273J5557604K2212764K9095843L5242717L8871462
10189B08901608L4022887K5284608J3542001M659900j675864n422898o55168k20483
10181B78436591l494118j0507901k0143909k9096447l8116875l8228581l4022537
10174A04826223k7872374k0209605j3795527r336885o448768m600147l401739
10167A9161178k576046k020445j685725j416499j220895j055862r11247p78084
$$ plain form
10221 3500213 3748974 4030556 4343596 4698843 5107756 5589432 6158768 6835253 7628290
10212 7628290 8543515 9561029 10638842 11790002 13017908 14355193 15866925 17645996
10204 17645996 19751066 22212747 25085474 28431472 32312465 36800571 42144240 48688229
10196 48688229 56944945 67921218 83478822 105691586 134787429 170030146 208901608
10189 208901608 242924495 268209103 281751104 286411004 284735140 279312242 278657074 278436591
10181 278436591 274942473 264434572 244290663 215194216 177077341 138848760 104826223
10174 104826223 76953849 56744244 42948717 33611832 27163064 22562917 19161178
10167 19161178 16585132 14564687 12878962 11462463 10241568 9185706 8274459 7496375
10159G496375o25805n25465m71954m44306m48498m69131m80030m28617l65357
10150C237212l03107k30124j80661j45001j19226j16797j11860r4435j00527r8368
10140A737106r7729q8774r0189q6305p8220q1419o1521o6262o3383n6622n6022
10129I10660m6024m6772m2728l0576l0374j9318k2721l2049l2299k6254k3134
10118E58411k6243k2263k1954k7237j7628j2028j8551j8442j7850j6204j3658
10107C46353j4619o556q158j9038j2876j2844o564o420j0970r673q264l155n246
10094B21970k452n426o627J78J870p135k646Q698J4513J0937q72K248R94M846
10080B41096N772J422J2577N732J404Q72m926L251P133O778M770Q111k485J291
$$ plain form
10159 7496375 6870570 6345105 5873151 5428845 4980347 4511216 4031186 3602569 3237212
10150 3237212 2934105 2703981 2523320 2378319 2259093 2142296 2030436 1936001 1835474 1737106
10140 1737106 1639377 1550603 1460414 1374109 1295889 1214470 1152949 1086687 1023304 966682 910660
10129 910660 864636 817864 775136 744560 714186 694868 672147 640098 607799 581545 558411
10118 558411 532168 509905 487951 460714 443086 431058 412507 394065 376215 360011 346353
10107 346353 331734 325178 317020 297982 285106 272262 265698 259278 248308 238635 230371 227216 221970
10094 221970 219518 214092 207465 207643 209513 202378 199732 208430 222943 233880 233008 235256 236250 241096
10080 241096 246868 248290 260867 266599 268003 268875 263949 267200 274333 281111 285881 293992 291507 292798
10066B92798l117J332o369j477m106j1801m11r201l671j3461n886n912k0244j4748
10052A93726j5900m139Q974L1487M4747L6693M918l8563o6336n8105l9468l0055
10040F7979j9183p356n263J003q522j0155j0280j5461j2723j6258j1881n711k856
10027e6667n796j4259m598p251m938m79R651N114J72J495J130O606J1013O364
10013e2443Q967R601J0574L779N14J07o958j2485q370o918q700q562j6381k1082
9999a08357j1868l338q475j79K909J789J3046J0963J8520N928j340J4613P692
9986e8097J0346J4039K2094J2373K543K724m378r154q79k822r76K167J481O35
9972g904j04k778k436p842q760j3763n747p574n484j857m921P0K212K400J08Q987
$$ plain form
10066 292798 289681 291013 284644 283167 279061 267260 266849 257648 253977 240516 234630 228718 208474 193726
10052 193726 177826 173687 182661 214148 258895 295588 300506 261943 195607 137502 98034 67979
10040 67979 48796 41440 36177 37180 28658 18503 8223 -7238 -19961 -36219 -48100 -53811 -56667
10027 -56667 -62463 -76722 -81320 -88571 -93509 -93988 -84337 -79223 -79051 -77556 -76426 -69820 -58807 -52443
10013 -52443 -43476 -33875 -23301 -19522 -19008 -18901 -25859 -38344 -46714 -53632 -62332 -70894 -87275 -108357
9999 -108357 -120225 -123563 -132038 -132217 -129308 -127519 -114473 -103510 -84990 -79062 -80402 -65789 -58097
9986 -58097 -47751 -33712 -11618 755 3298 6022 1644 -7510 -8389 -11211 -12187 -10020 -8539 -7904
9972 -7904 -8008 -10786 -13222 -21064 -29824 -43587 -49334 -56908 -62392 -64249 -69170 -69100 -66888 -64488 -64380 -55393
9956e5393K42q07p055k217N725k351o359m781O766O9M405K325J567O573o321r55
9940e8567J679N646N637J0202J1951M687L698L98L196J3126J306O281N724R82
9926A5946k018M597R934o916r719n273L776N873K352j287k169Q496J4181J3888
9912E1661K7570L3850L0167O272k2700k9625k4788j5092n231K616J0740J0259
9900G5699J6369K0151L1043M3131Q0027J35555K15868K01712O1221j12586k11171
9889E57019j82963j24925q6732n6780l0066j9191j2172j0412j6343r670p862m746
9877d843N92k374M669k573O34n41j655j0739o661J329R18j44l351J575J357J072
9861b0735K4k752L37O244j629l447k739L157j962n998m431M53O32J772J01k852
$$ plain form
9956 -55393 -55151 -55958 -63013 -65230 -59505 -61856 -68215 -72996 -66230 -66161 -61756 -59431 -57864 -51291 -57612 -58567
9940 -58567 -56888 -51242 -45605 -35403 -23452 -18765 -15067 -14669 -11473 1653 2959 9240 14964 15946
9926 15946 13928 18525 28459 21543 11824 6551 10327 16200 18552 17265 15096 23592 37773 51661
9912 51661 79231 113081 143248 149520 126820 97195 72407 57315 52084 54700 65440 75699
9900 75699 92068 112219 143262 186393 266420 401975 617843 819555 880776 768190 557019
9889 557019 374056 249131 162399 105619 75553 56362 44190 33778 17435 7765 -97 -4843
9877 -4843 -4251 -6625 -1956 -4529 -3895 -4436 -6091 -16830 -23491 -22162 -21244 -21388 -24739 -23164 -21807 -20735
9861 -20735 -20711 -23463 -23126 -16882 -18511 -21958 -24697 -21540 -23502 -29500 -33931 -33478 -32846 -31074 -30973 -33825
9845c3825l629k493k962n730J885L182K83j89j948l40M495M713M003O321o394
9830c2628r367L022Q7L764N035J635L426K249p290p057L07j548l552K41J169k50
9814d0757k07Q95M761L780M737l724o52O389K939M928l626R84R965J0275K322
9799C009M931N163J6859J0961O864K0553J8582R349J1223J4579J6591J9353J6568
9786A74585L2147M6461N6349Q1055J09323J43183J83340K15232J99253J58437
9776A399365J01197N4324J3975l0429j5445q663j8246n4756j03407j54827k14292
9765I68796k21484j87351j59966j29933q5934n0339l3297k1981j8412o576j1659
9754D1864j2265j2613j1479q024j312j0J078M210k451m688p354m88M35k846N959
$$ plain form
9845 -33825 -37454 -39947 -42909 -48639 -46754 -43572 -43289 -43478 -45426 -45766 -41271 -36558 -32555 -26234 -32628
9830 -32628 -41995 -38973 -38886 -35122 -30087 -28452 -25026 -22777 -30067 -37124 -36817 -38365 -41917 -41676 -40507 -40757
9814 -40757 -40964 -40069 -35308 -31528 -26791 -30515 -31167 -24778 -21839 -16911 -20537 -19553 -9588 687 3009
9799 3009 7940 13103 29962 40923 47787 68340 86922 96271 107494 122073 138664 158017 174585
9786 174585 206732 253193 309542 390597 499920 643103 826443 1041675 1240928 1399365
9776 1399365 1500562 1554886 1568861 1538432 1522987 1514324 1496078 1441322 1337915 1183088 968796
9765 968796 747312 559961 399995 270062 184128 133789 100492 78511 60099 53523 41864
9754 41864 29599 16986 5507 -2517 -3829 -3839 -2761 1449 -1002 -5690 -13044 -13532 -13097 -15943 -9984
9739i984j0052m929Q96J181M50o879o217j094l309k912q4K076k119j613K425K648
9723c9516p05O614Q64N227q45k437K91k501K310O01P2n506o16K367N231O09j0818
9706c8758l594K505l177l35r69j160j954k362l105M088K212J332n925l768L312
9691e1658P08Q801R002l498j322R57k341n867j397M616K575k011Q242O923J651
9676b4619n197K030k020k493p229K782M487J943n025m954L74J997r44O171M862
9661b7835j072j550k700l739j930J912l600m380k860J689K900N006l208K864j846
9646d0349J067N849l088j485j310J752M111N871l297P49P857L931k615r838L507
9631b7288P281R06j147J301R148O717q49m820k366k48N119o02n637j0286j651
$$ plain form
9739 -9984 -20036 -24965 -24069 -22888 -22438 -29317 -35534 -36628 -39937 -42849 -42933 -40857 -42976 -44589 -42164 -39516
9723 -39516 -40221 -33607 -32743 -27516 -28361 -30798 -30507 -33008 -30698 -30097 -30025 -35531 -36147 -33780 -28549 -27940 -38758
9706 -38758 -42352 -39847 -43024 -43359 -44328 -45488 -47442 -49804 -52909 -48821 -46609 -45277 -51202 -54970 -51658
9691 -51658 -50950 -42149 -33147 -36645 -37967 -37010 -39351 -45218 -46615 -41999 -39424 -41435 -33193 -26270 -24619
9676 -24619 -29816 -27786 -29806 -32299 -39528 -36746 -32259 -30316 -35341 -40295 -39921 -37924 -38868 -32697 -27835
9661 -27835 -28907 -30457 -33157 -36896 -38826 -36914 -40514 -44894 -47754 -46065 -43165 -38159 -41367 -38503 -40349
9646 -40349 -39282 -33433 -36521 -38006 -39316 -37564 -33453 -27582 -30879 -30130 -22273 -18342 -20957 -30795 -27288
9631 -27288 -20007 -19101 -20248 -18947 -9799 -3082 -3931 -8751 -11117 -11365 -6246 -6848 -12485 -22771 -24422
9616b4422N953k092j049L06n6J461K270M072K499p090n678j218l110n252j265
9601c4671m015j021K917R217P620K75k432K493M140o920L918L816k757r20P8J516
9585a6746K601j111K737L013l44M72j917l321J287k349l095p366K095M547M9J727
9569a7721J732L987l756j566N010K803l639k081o91N78q96j895n705k920j220
9554b7980K677O543K547l67k049k317J0142N478j174K063P403m668K756K801K723
9539F578L834L503l132o59l794q415j761J0802P292j196m917l562j358r114r859
9524a5758o68L880m039m739j266P437m143p39j948n115k220N559L890M028L659
9509a2182Q08M2J0542M854k560l225m092l59j582J2766N737l862j554M524q55
$$ plain form
9616 -24422 -18469 -20561 -21610 -21304 -21360 -19899 -17629 -13557 -11058 -18148 -23826 -25044 -28154 -33406 -34671
9601 -34671 -38686 -39707 -36790 -27573 -19953 -19678 -22110 -19617 -15477 -22397 -18479 -14663 -17420 -18340 -18262 -16746
9585 -16746 -14145 -15256 -12519 -9506 -9850 -9378 -11295 -14616 -13329 -15678 -18773 -26139 -24044 -19497 -19448 -17721
9569 -17721 -15989 -12002 -15758 -17324 -12314 -9511 -13150 -15231 -15922 -15344 -16240 -18135 -23840 -26760 -27980
9554 -27980 -25303 -18760 -16213 -16580 -18629 -20946 -10804 -5326 -6500 -4437 2966 -1702 1054 3855 6578
9539 6578 10412 13915 10783 10124 6330 -2085 -3846 6956 14248 13052 8135 4573 3215 -5899 -15758
9524 -15758 -16426 -12546 -16585 -21324 -22590 -15153 -19296 -20035 -21983 -27098 -29318 -23759 -19869 -15841 -12182
9509 -12182 -11374 -11332 -790 4064 1504 -1721 -5813 -6172 -7754 5012 10749 6887 5333 9857 9002
9494I002k117j588l863n55J452O57j171J377p18l467k66k790M162n607o290J580
9478a0202k394j870m334M916O009J0846j547l634p35L848K273k187m523l011o38
9463g183J1411O473l58q64j738p661k93q53l538k327O608Q768N600J163J389J398
9447A7995n27k003j569K016m904M40Q65K726k368m408j562J208Q205O962J307
9432B4383n385m068K967P931M671l523k861n051J884J604J226M242P271k595k534
9417C0162k528l708l240J854R783J4027Q005N952L416N955N055o011m020o259
9403E8443p806J115L156m858p637K057M698P211N53L23P714M800O93k258O659
9388G4863M012L780K959M084k658P005K524K754p58k182k412M030J77j659P62
$$ plain form
9494 9002 6885 5297 1434 879 2331 2988 1817 3194 2476 -991 -1257 -4047 115 -5492 -11782 -10202
9478 -10202 -12596 -14466 -18800 -13884 -7875 2971 1424 -2210 -2945 903 3176 989 -3534 -6545 -7183
9463 -7183 4228 10701 10343 9479 7741 80 -213 -1066 -4604 -6931 -323 8445 14045 15208 16597 17995
9447 17995 17468 15465 13896 15912 11008 11448 12313 15039 12671 8263 6701 7909 16114 23076 24383
9432 24383 18998 14930 17897 25828 30499 26976 24115 19064 20948 22552 23778 28020 35291 32696 30162
9417 30162 27634 23926 20686 22540 32323 46350 54355 60307 63723 69678 74733 68722 64702 58443
9403 58443 50637 51752 54908 50050 42413 44470 49168 56379 56932 57255 64969 69769 70462 68204 74863
9388 74863 78875 82655 85614 89698 87040 94045 96569 99323 98565 96383 93971 98001 98178 96519 97281
9373I7281n62J749K798L081M539J1419O115J321K117J201m398p812m13J4927N444
9358A38807n702J143P599K780R90J0045O497K336J03J220j296j619L106M177J121
9343A71307P553P34P727M003j856l305N02P58K89k156L133K851O425q68j426N265
9327B00936K1L308K072k575M767J1365M708q019K707J0276M627l814l91K535o655
9312B25868j7J866j693Q2j84L364P466O191j112r804N659J485K726p614l478l478
9296B27327p923j490k64J393L462k795q886p287l645n605q801l908R73q854q076
9281A65621m139k900K486J831O046J527k380Rj190j1002q272j369N067j245j1104
9266A38986o732n204j563P494j780m099j066M31J748J258m83k702K445N980m677
$$ plain form
9373 97281 96719 98468 101266 104347 108886 120305 126420 127741 129858 131059 126661 118849 118436 133363 138807
9358 138807 133105 134248 141847 144627 145617 155662 162159 164495 164598 165818 164522 162903 166009 170186 171307
9343 171307 178860 179594 187321 191324 189468 186163 186665 187423 187712 185556 188689 191540 197965 197097 195671 200936
9327 200936 200957 204265 206337 203762 208529 219894 224602 216583 219290 229566 234193 230379 229988 232523 225868
9312 225868 225851 227717 226024 226106 225922 229286 236752 242943 241831 232027 237686 239171 241897 234283 230805 227327
9296 227327 219404 217914 217650 219043 222505 219710 210824 203537 199892 194287 185486 181578 182551 173697 165621
9281 165621 161482 158582 161068 162899 168945 170472 168092 168101 166911 155909 147637 146268 151335 150090 138986
9266 138986 132254 127050 125487 132981 131201 127102 126036 126467 128215 129473 128990 126288 128733 134713 130036
9251A30036m127j0988o316l911r398m769M022k271N43l900l574k27j153p138j131
9236G5698L11j429k389p27N249L292k032j5461r610M410J0080J301P56k35q623
9221F0591n686O26r71n064j008j321Q586Q041l0j961k077k58m255k640L775P609
9205F3957l442o733l02N543k999n187p903j939P366M595q6j150n78l398R88P477
9189E6209R15J139J166L222l53P47m468n531m667N504j195n758p691l730M080
9174C9589L969M220l32K042n407q337L683M548k502J09k616l858K758P622j416
9159D4072j1106k499L836K981J617j77Q62M45M549Q154O886J466l393p970m947
9144D4776m874n452N98J165j584q22l113M096o934k832j36n683k931K293N962
$$ plain form
9251 130036 125909 114921 108605 104694 95296 90527 94549 92278 92821 88921 85347 85120 83967 76829 75698
9236 75698 76009 74580 72191 71464 76713 80005 77973 62512 52902 57312 67392 68693 69449 69214 60591
9221 60591 54905 55531 54560 49496 48488 47167 55753 63794 63764 61803 59726 59468 55213 52573 56348 63957
9205 63957 60515 53782 53480 59023 56024 50837 42934 40995 48361 52956 52870 51720 51142 47744 48732 56209
9189 56209 57124 58263 59429 62651 62298 63045 58577 53046 48379 53883 52688 46930 39239 35509 39589
9174 39589 43558 47778 47446 49488 44081 35744 39427 43975 41473 41582 38966 35108 37866 45488 44072
9159 44072 32966 30467 34303 37284 38901 38724 39586 40031 44580 52734 59620 61086 57693 49723 44776
9144 44776 39902 34450 35048 36213 34629 33807 30694 34790 27856 25024 24888 19205 16274 18567 24529
9129B4529O218L714k978J46P413M148j320l501L573M81K037n296M81L783M75p710
9113C6193n88L577m528o418K363N103J889L561M330K31o9o161j4479m58P652p285
9097B4913R57l689L09K474l618J205J3007P864O76n119K068M035o610m169q743
9082B5560l199J271K379j290M019J2843J487l427M666M180m110j055K180q652
9068C6852O13Q77L13l013J1K384M14l953n759m410m107K906P992R355o237m427
9052B9811l848q57L834l263n376p63r757l182J1370J3743M22m881o281j488P075
9037B6559J1224R641O919K736o543k205k81l606l445k761ON173M947N648o494
9022D7518l117r412n955K286Q22l9L494q577q756p770j633N307L942o098O85O418
$$ plain form
9129 24529 30747 34461 31483 31629 39042 43190 41870 38369 41942 42423 44460 39164 39645 43428 43903 36193
9113 36193 35605 39182 34654 28236 30599 35702 37591 41152 45482 45713 45644 39483 25004 24546 32198 24913
9097 24913 25870 22181 22490 24964 21346 22551 35558 43422 44098 38979 41047 45082 38472 34303 25560
9082 25560 22361 23632 26011 24721 28740 41583 43070 39643 44309 48489 44379 43324 45504 36852
9068 36852 37465 38342 38655 35642 35653 38037 38451 34498 28739 24329 20222 23128 31120 40475 34238 29811
9052 29811 25963 25106 28940 25677 20301 19538 9781 6599 17969 31712 32134 27253 20972 19484 26559
9037 26559 37783 47424 54343 57079 50536 48331 48050 44444 40999 38238 38244 43417 48364 54012 47518
9022 47518 44401 34989 29034 31320 32142 32103 35597 27020 18264 10494 8861 14168 18110 12012 12697 19115
9006A9115l234K03L049R078O789J537N9M338o249p808L097O655L734m559r124
8991B6680n810l523k586N427N242r77k361O56J1993J639j0820l078O268P342L059
8976C9151m372k109m394j189N203J050J703J643o749l485n543j017M81p126K11
8961A3458J817m617l160N529R259O734n765k276l631J827N927j315n772K15l730
8946A4500j637K028j420n207k52M86q3j476k976j513J093m78M888M875J064O001
8930A9893m52l754j224J533p335q163n446J410J966j712k162J0955R584J30n244
8915I979n438k799m270k889q526j379L097M465N874K679L463N18o767L267k180
8900i06L498j879P438k506r137K296J193p90N957L819K402N14l567J156K571J348
$$ plain form
9006 19115 15881 16084 19133 28211 35000 36537 36596 40934 34685 26877 29974 36629 40363 35804 26680
8991 26680 20870 17347 14761 20188 25430 24453 22092 22748 34741 36380 25560 22482 28750 36092 39151
8976 39151 34779 32670 28276 27087 32290 33340 35043 36686 29937 26452 20909 19892 20373 13247 13458
8961 13458 15275 10658 7498 13027 22286 29020 23255 20979 17348 19175 25102 23787 18015 18230 14500
8946 14500 12863 14891 13471 8264 8012 8498 8415 6939 3963 2450 3543 3065 7953 12828 13892 19893
8930 19893 19441 15687 14463 15996 8661 498 -4948 -3538 -1572 -3284 -5446 5509 15093 15223 9979
8915 9979 4541 1742 -2528 -5417 -13943 -15322 -12225 -7760 -1886 793 4256 4774 -1993 1274 -906
8900 -906 2592 713 8151 5645 -3492 -1196 -3 -793 5164 8983 11385 11899 8332 9488 12059 13407
8884A3407m180J081K698L818q70J963M716J108M011P144j2j569P218R153J0652
8869F0338P539P653Q107R406J0034J6005K4392K0077L2011L3747L4109N3756Q3382
8856D00556R8639J39516K25642L28932L79488K32534o5232l26605l80219l01036
8846G32215k11021j45429r0753o6942m7326l7886k8389j5604j1209j1609p266
8835E8781r315p696j1779n590k486j519m451q095l231l018p23K367M737J339q45
8820H476m11l552J483K729p06J398q271r950p578J170M513j186K195J3363M405
8805H078l751K278n989k287L720J660O54k06M648j621n738L221j400J707r255
8790d281q480M184J2207L428n611n519p12J835m88k850L380j752l498l330o40
$$ plain form
8884 13407 9227 10308 13006 16824 15954 17917 22633 23741 27752 34896 34884 33315 40533 49686 60338
8869 60338 67877 75530 83637 93043 103077 119082 143474 163551 195562 229309 263418 317174 400556
8856 400556 499195 638711 864353 1193285 1572773 1805307 1740075 1413470 1033251 732215
8846 732215 521194 375765 285012 218070 170744 132858 104469 88865 77656 66047 58781
8835 58781 49466 41770 29991 24401 21915 20396 15945 7850 4619 1601 878 3245 7982 9321 8476
8820 8476 8065 4513 5996 8725 8019 9417 1146 -8804 -16382 -15212 -10699 -11885 -9690 3673 8078
8805 8078 4327 6605 616 -1671 2049 3709 4363 4157 8805 7184 1446 4667 3267 4974 -4281
8790 -4281 -12761 -8577 3630 7058 1447 -4072 -4784 -2949 -3437 -6287 -2907 -4659 -8157 -11487 -12127
8775a2127N839R29Q901L115n165K673N148J385l446l808n522O156P143k58L696
8760A4659N682L814p664r178l488O54N190N00J561l27j297O417J731l52j760L543
8744A9685K162P2k412J044j280k177j091L528L181L270P420O405O312k385j231
8729D2503j424Q69R04j158o132l911L052Q251O603P736N827M33j938Q140N707
8714G5462p63M66M910K230K295n282p332N259P60P75K150n395r615r771J647Q389
8698F6185j327n782M223J338J067L903L258O426M241J829N010j418N655N142N285
8683A05035K698O000J313K62K437P760R433R006J0356N825L290j275m291j154
8669A56695O709K253N633J1025Q035M184p402j3103l386n569Q33m424L405J329
$$ plain form
8775 -12127 -6288 -5359 3542 6657 1492 4165 9313 10698 7252 3444 -2078 4078 11221 10963 14659
8760 14659 20341 24155 16491 7313 3825 4479 9669 10169 11730 11403 10106 16523 18254 17902 16142 19685
8744 19685 21847 21919 19507 20551 19271 17094 16003 19531 22712 25982 33402 39807 46119 43734 42503
8729 42503 41079 41948 42852 41694 35562 31651 34703 42954 49557 57293 63120 63553 61615 69755 75462
8714 75462 74699 75165 80075 82305 84600 79318 71986 77245 78005 78780 80930 75535 65920 56149 57796 66185
8698 66185 64858 59076 63299 64637 65704 69607 72865 79291 83532 85361 90371 88953 94608 99750 105035
8683 105035 107733 113733 115046 115308 117745 125505 134938 143944 154300 160125 163415 162140 157849 156695
8669 156695 163404 165657 171290 182315 190350 194534 187132 174029 170643 165074 165907 161483 164888 166217
8655A66217J782M898K472m56j980o58J705O659O000J3264L827R267J0036J1217
8641B34250J1784J5110J4162J2226L996N264J0153R068L830j422O401P760M076
8628C36658K414O281k627O004Q721J3581J6784J2029J7071J5913K3129K1872K6583
8615E04413L8109M5496M7420N1625M8189L9183L7287M8032N7091M3780K7839K0116
8603A008580J2250J0538K9k778j8032k1095j9278k7800l0475l2618l4907m0962
8591H03452m0819k4859l1475j9624p987j1781r948m546k599r836j7775k4247l7391
8578E60565l5850l6082m5704m4633l8646m1099k5023k4021j9689k1753j8270j5423
8566A94372q695K19o972q322j1112q641M07L784j4515j0545j1229j3362o894n496
$$ plain form
8655 166217 167999 172897 175369 174913 172933 172275 173980 180639 186639 199903 203730 212997 223033 234250
8641 234250 246034 261144 275306 287532 291528 296792 306945 316013 319843 318421 324822 332582 336658
8628 336658 339072 345353 342726 348730 357451 371032 387816 399845 416916 432829 455958 477830 504413
8615 504413 542522 588018 635438 687063 735252 774435 811722 859754 916845 960625 988464 1008580
8603 1008580 1020830 1031368 1031397 1028619 1010587 989492 970214 942414 911939 879321 844414 803452
8591 803452 762633 737774 706299 686675 678688 666907 656959 652413 649814 639978 622203 597956 560565
8578 560565 524715 488633 442929 398296 359650 318551 293528 269507 249818 228065 209795 194372
8566 194372 185677 185896 178924 170602 159490 150849 151256 155040 140525 129980 118751 105389 98495 92999
8552I2999m048P585P103o177r848m990m61j391m446m146j1366m359j232j068j322
8537E2833j0125k426m964j515Q22q5k358q803j183Q08L637P443N063J854k669
8522C8332K831n113m229n619o397k683O266R133K227J661r639j578l027m275q194
8507I696n588m073M505Q743J286p184K811K125J272j137N21k300l405O335J106
8492A4713l094m623j514P00j017l651M380N966J662J33k953J749k40j472K47j688
8476I298l922l007L91O915k569N172K502N396k644j1651o09n05N825K875N26J416
8460A5409M38M074O759n201q060j946O997j368j258K928J933L616K620L115O730
8445C6786k640j811m354n967J352k901n073K495j580k914K490j620o643o547j55
$$ plain form
8552 92999 88951 96536 103639 97462 87614 82624 82163 80772 76326 72180 60814 56455 55223 54155 52833
8537 52833 42708 40282 35318 33803 34625 34540 32182 23379 22196 23004 26641 34084 39147 41001 38332
8522 38332 41163 36050 31821 26202 19805 17122 23388 32521 34748 36409 26770 25192 22165 17890 9696
8507 9696 4108 35 4540 13283 14569 7385 10196 12321 13593 12456 12977 10677 7272 13607 14713
8492 14713 11619 6996 5482 6182 5165 1514 5894 11860 13522 13655 10702 12451 12211 10739 10986 9298
8476 9298 5376 2369 2760 9675 7106 12278 14780 20176 17532 5881 5272 4767 10592 13467 13993 15409
8460 15409 15847 19921 26680 21479 13419 11473 18470 17102 15844 18772 20705 24321 26941 30056 36786
8445 36786 34146 32335 27981 22014 23366 20465 15392 17887 16307 13393 15883 14263 7620 1073 918
8430I18N606K883J688O595O52J386K510M389K04L267R964l798n226J407n578j0717
8414A6150o437N947J771l875R110k504l746J764J0958K459l827j899k138O625
8400C0358P307J129M731n256m190j0317l094n078r801l139n06N611k689l850k312
8385a096O542j735o864K614L275M29M904n50J0560Q533J549m642l161j247J479
8370B0590P173P625J4894N428p808n162p479m305m379k231k842Q01O801o80o918
8355B1508o168k488J587J0333j968q489j624J435K37r38m015n980K781J047J93
8340G451l292O37O705N810n4K807J359J154j971k003k906m890Q58K386P487J0968
8324C2506l763M298M819K108p71l659o27o20m062k549k077O251J661J612l127
$$ plain form
8430 918 6524 9407 11095 17690 18342 19728 22238 26627 26831 30098 40062 36264 31038 32445 26867 16150
8414 16150 9713 15660 17431 13556 22666 20162 16416 18180 29138 31597 27770 25871 23733 30358
8400 30358 37665 38794 43525 38269 34079 23762 20668 15590 5789 2650 2144 7755 5066 1216 -1096
8385 -1096 5446 3711 -3153 -539 2736 3165 8069 7519 18079 26612 28161 23519 20358 19111 20590
8370 20590 27763 35388 50282 55710 47902 42740 35261 30956 26577 24346 21504 22305 29106 28426 21508
8355 21508 15340 12852 14439 24772 22804 14315 12691 14126 14363 13425 9410 3430 6211 7258 7451
8340 7451 4159 4796 11501 17311 17257 20064 21423 22577 20606 18603 15697 10807 11665 14051 21538 32506
8324 32506 28743 33041 37860 39968 39197 35538 34911 34291 30229 27680 25603 31854 33515 35127 32000
8309C2000J400m645j1042k404K894K88o442q37J067M206q74Q426K218n460q434
8294A2361p438o54K283K937P299M564l346q30O796P107m840O933M141L005K993
8279D3311K482K105l676p288n930j600k09k446L356L680L371j313m093q360q645
8264A4745n480k830L241k182M210m112Q88M02j203M060Q260l04l76l799m264Q52
8248A2108M638J423M905N443M033q492K156L114o981p282Q06J944O10l850m375
8233A0200k788N143Q411O62r045R62R68k7M681P100k042P40r59j721k467l198
8217A6620k614q08K999l822r87N444L462j579o022J980P825L520l004J377J871
8202B6262n682l207K989n174k140J71L24J732K571Q08K859n386m563m555J912
$$ plain form
8309 32000 33400 28755 17713 15309 18203 18491 12049 11212 12279 16485 15611 24037 26255 20795 12361
8294 12361 4923 4269 6552 9489 16788 21352 18006 17176 23972 31079 26239 33172 37313 40318 43311
8279 43311 45793 47898 44222 36934 31004 29404 29195 26749 30105 33785 37156 35843 31750 23390 14745
8264 14745 9265 6435 9676 7494 11704 7592 8480 8882 7679 11739 19999 19695 19319 15520 11256 12108
8248 12108 16746 18169 23074 28517 32550 24058 26214 29328 22347 15065 15871 17815 18425 14575 10200
8233 10200 7412 12555 20966 21628 12583 13545 14513 14486 19167 26267 24225 24965 24006 22285 19818 16620
8217 16620 14006 13198 16197 12375 11388 16832 20294 18715 12693 14673 22498 26018 23014 24391 26262
8202 26262 20580 17373 20362 15188 13048 13219 13543 15275 17846 18654 21513 16127 11564 7009 8921
8187H921L66Q167k551j3203j1598K541L520m67l736O019M864K804J903r106J801
8172B45O145O389k46q14M27K070R16J344o574J23P334M005J095j959K447O756
8156B9703Q340K653K22N725K927P485J1548J9277K2469K1112M4502Q7954J21827
8143C85744Q5053k0959j07042j08730q1486n1473l0900j8988q000l393p17K137
8131D1246k325q466j0342q573k615j117N19O183J704o98p76K022L968M175j939
8116B2966k017K546J13K259Q890M197N018J2158J7254K5343L0848N6130P2416
8103B58121P9131N7160l999o2703q4710o9702n8538m1147k4427j8058j754N87
8091B9961l217j149Q71m580j514l345l270j283M467P670M058L235o045n867j614
$$ plain form
8187 8921 9287 17454 14903 1700 -9898 -7357 -3837 -4304 -8040 -2021 2843 5647 7550 -1556 245
8172 245 6390 12779 12533 11719 12146 14216 15132 16476 9902 10025 17359 21364 22459 20500 22947 29703
8156 29703 38043 40696 40918 46643 49570 57055 68603 87880 110349 131461 175963 263917 385744
8143 385744 470797 449838 342796 234066 152580 101107 70207 51219 43219 39826 39109 41246
8131 41246 38921 30455 20113 11540 8925 7808 8327 14510 16214 15516 14740 16762 20730 24905 22966
8116 22966 20949 23495 23608 25867 34757 38954 43972 56130 73384 98727 129575 185705 258121
8103 258121 337252 394412 390413 327710 243000 173298 114760 73613 49186 31128 29374 29961
8091 29961 26744 25595 26466 21886 20372 17027 13757 12474 16941 24611 28669 31904 25859 19992 18378
8076A8378L816L55m757j347P343M907k723k654N464J05m963j783P828N57K3R49
8060C1498M474M056J0103L382J15K034J900J822R300J1552O916J2259M149L171
8046A06731J3396K2829J2771J1573J4266J6730J4613J6939K4922L1447L6189L4344
8034C56750K4389J8852R03k859k021n321n965n588J79k479L607N2q431j0894j4354
8019C46820j6080r478o112q059j1619O271J0991L539L667k973O141J027M414Q076
8005C36625Q355J3667J8612K3292L6879M5682N1760O9703Q5565J11592J55144
7994I56876K12251K25831J36952k8203j74759k19178j92574j40414j05320p0566
7984F00896l5746j1063L1688O4253P3575K2882n4401j09782j12950q7496o2004
$$ plain form
8076 18378 22194 22549 17792 16445 23788 28695 25972 23318 28782 28887 23924 22141 29969 30526 30549 31498
8060 31498 35972 40028 50131 53513 53628 55662 57562 59384 68684 80236 87152 99411 103560 106731
8046 106731 120127 142956 155727 167300 181566 198296 212909 229848 254770 286217 322406 356750
8034 356750 381139 399991 400894 398035 396014 390693 384728 379140 379319 376840 380447 380499 372068 361174 346820
8019 346820 330740 321262 315150 307091 295472 301743 312734 316273 319940 316967 323108 324135 328549 336625
8005 336625 344980 358647 377259 400551 437430 483112 534872 604575 690140 801732 956876
7994 956876 1169127 1394958 1531910 1503707 1328948 1109770 917196 776782 671462 600896
7984 600896 565150 554087 585775 650028 723603 746485 692084 582302 469352 381856 319852
7973C19852l9128k9654j4966L554M82M749q38l117p010J2221J8237K2695L3811
7960C20888K8604J2357Q713R28P759K0483L4485M4915P7753R2874R0943Q3727
7948H24429N2808J2761k7642o5035q1568p8747p5136l5263J943K7972K9215p747
7936E77990o3518r2774p8884o1257m1780l3706j8310j8955j8119j7955j9792n747
7924A07193m046r976J554N725R666K443N292k093j673n144n818L075J1353J6244
7910A33795K0279L0878L6746L3343J5686j420k0930k9391k5878k5524k2925j6704
7898A27955j1061j4831j2991j5284j3539j3068j6146j2265K799n37k171k999k128
7885A3734N356n794p164l098M245p83m69k776m902m329k255M244K058k988J770
$$ plain form
7973 319852 280724 251070 236104 239658 240140 244889 244051 240934 233924 246145 264382 287077 320888
7960 320888 349492 361849 370562 371490 379249 399732 434217 479132 556885 649759 740702 824429
7948 824429 877237 889998 862356 797321 715753 637006 561870 526607 528550 556522 585737 577990
7936 577990 514472 421698 342814 281557 239777 206071 187761 168806 150687 132732 112940 107193
7924 107193 103147 93171 94725 100450 110116 112559 117851 115758 114085 108941 103123 106198 117551 133795
7910 133795 154074 184952 221698 255041 270727 269307 248377 218986 193108 167584 144659 127955
7898 127955 116894 102063 89072 73788 60249 47181 31035 18770 21569 21032 18861 15862 13734
7885 13734 19090 13296 6132 3034 7279 6496 6027 3251 -1651 -5980 -8235 -3991 -1933 -4921 -3151
7870c151J579L298k44r362l221O422l291n974K107O24M932L838N045j776l266
7855b440p38J879q037k176K356l532N009L720k160k18K558o212p070L811L738
7840i512l435q13J980m556N783K943m56n49j625N198L152l438q709J573M645M879
7824b940n758p660l179K495j44l735l01N538J840J810P30P68R94n991j192m38
7808a7163l977M16M80K385L539Q73M480o582j900j518K363P104j479j946o282
7793a9207O970M695k4O0l520k065o05m856n748O017P732N47o99k098k578l097
7777a8476k974K565M749K805O122k211O499K729r168j1656m174L680k780k848
7763b5138M869K57j38N90K600m824k541k966L199R358L512j132k173j958p08j268
$$ plain form
7870 -3151 -1572 1726 1482 -7880 -11101 -4679 -7970 -13944 -11837 -11213 -6281 -2443 2602 826 -2440
7855 -2440 -3178 -1299 -9336 -11512 -9156 -12688 -7679 -3959 -6119 -6337 -3779 -9991 -17061 -13250 -9512
7840 -9512 -12947 -13760 -11780 -16336 -10553 -7610 -8066 -8615 -10240 -5042 -1890 -5328 -14037 -12464 -7819 -2940
7824 -2940 -8698 -16358 -19537 -17042 -17186 -20921 -21222 -15684 -13844 -12034 -11304 -10536 -9542 -15533 -16725 -17163
7808 -17163 -21140 -20724 -20244 -17859 -14320 -13447 -8967 -15549 -17449 -18967 -16604 -9500 -10979 -12925 -19207
7793 -19207 -12237 -7542 -7566 -7506 -11026 -13091 -13696 -18552 -24300 -18283 -10551 -10004 -10703 -12801 -15379 -18476
7777 -18476 -21450 -18885 -14136 -11331 -5209 -7420 -921 1808 -7360 -19016 -23190 -19510 -22290 -25138
7763 -25138 -20269 -20012 -20150 -19560 -16960 -21784 -24325 -27291 -24092 -14734 -11222 -12354 -14527 -16485 -17193 -18461
7747a8461O341m66m139K114n659k477J630M758O476n223j42j610J931m8j970P19
7731a6226l470J499K569k199M250k715m033J298K392J938j730k321k833R88N595
7716a4998L670J538l126j315nK400L553L035J236k433n398l625j682K327L571
7701a1252K320l481q02l254k242o77K421L17k680J451J165O834K521P78j607k526
7685a0714p56n694N580M504k138k503j944n291k572J760J063j590l117l785p07
7670b7904M289N119N840M83j634K838k336K383k30m694k465l21P23j181Q053N958
7654e079P173k945n188r39N308j537j0834p622K302J0937P085J590n18Qj2762
7639a3021o439m39L247P603M703n521l715m11K925l220j743K536K164o95j796
$$ plain form
7747 -18461 -12120 -12586 -16725 -14611 -20270 -22747 -21117 -16359 -9883 -15106 -15248 -16858 -14927 -14975 -16945 -16226
7731 -16226 -19696 -18197 -15628 -17827 -13577 -16292 -20325 -19027 -16635 -14697 -16427 -18748 -21581 -20593 -14998
7716 -14998 -11328 -9790 -12916 -14231 -14236 -11836 -8283 -5248 -4012 -6445 -11843 -15468 -17150 -14823 -11252
7701 -11252 -8932 -12413 -13215 -16469 -18711 -19388 -16967 -16650 -19330 -17879 -16714 -9880 -7359 -6581 -8188 -10714
7685 -10714 -11470 -17164 -11584 -7080 -9218 -11721 -13665 -18956 -21528 -19768 -18705 -20295 -23412 -27197 -27904
7670 -27904 -23615 -18496 -12656 -12173 -13807 -10969 -13305 -10922 -11152 -15846 -18311 -18632 -17909 -19090 -11037 -5079
7654 -5079 2094 -851 -6039 -6978 -1670 -3207 -14041 -21663 -19361 -8424 -1339 251 -267 -259 -13021
7639 -13021 -19460 -19899 -16652 -9049 -4346 -9867 -13582 -13993 -11068 -14288 -16031 -13495 -11331 -12026 -13822
7624a3822J78O867L245m740p501k911q73M183O07j317n163N67Q539M014R15o860
7608a4072m269J331M874K338J842L68o17M519K99k090K646m720o889k709L930
7593a3219J592j651k404l842R08J0360l375j0813N41M950M827l3N310L568l140
7578f421N242K187l639l499j083J688m989j589k366M109J710p060o34J520J249
7563a3575N301J453m677k012Q78K678J916o575l496k687K68K650p39m539K494
7548b0662K869N363L868K662N926p84m059o352J230N920L797j552k948m06M215
7533i13J742j093M91O137M201m39k620J350J837n394k707n218j506n042o546J409
7517a4311L685J333q367J621M483K920k299l943K518k299n693J959r77P68P79
$$ plain form
7624 -13822 -13644 -6777 -3532 -8272 -15773 -18684 -19557 -15374 -14767 -16084 -21247 -20680 -12141 -8127 -7212 -14072
7608 -14072 -18341 -17010 -12136 -9798 -7956 -7588 -8205 -3686 -3387 -5477 -2831 -7551 -14440 -17149 -13219
7593 -13219 -11627 -13278 -15682 -19524 -18616 -8256 -11631 -22444 -21903 -16953 -12126 -12159 -6849 -3281 -6421
7578 -6421 -1179 1008 -2631 -6130 -7213 -5525 -10514 -12103 -14469 -10360 -8650 -15710 -16344 -14824 -13575
7563 -13575 -8274 -6821 -11498 -13510 -12632 -9954 -8038 -14613 -18109 -20796 -20528 -17878 -18617 -23156 -20662
7548 -20662 -17793 -12430 -8562 -5900 26 -758 -4817 -11169 -9939 -4019 -222 -1774 -4722 -5128 -913
7533 -913 829 -264 227 6364 10565 10126 7506 8856 10693 5299 2592 -2626 -4132 -9174 -15720 -14311
7517 -14311 -10626 -9293 -17660 -16039 -11556 -8636 -10935 -14878 -12360 -14659 -20352 -18393 -19370 -18602 -17823
7502a7823K513L272j408n16k608K586M82O691M04p016P24J568J60k936l87N291
7486i003M46j128Q14j456o48j90J14J73l146N492N325l942k847N268J695m69j945
7469e447Q60j485O14K938L380k069j2379o975M001J210R523KJ803K971K882j552
7453B77j293j0232j451J913K636j102o357o793O965P566j777r336l3M884N552
7438h581K08q609j0138J864P602J719J484l473k096l26l130j228K245n627m83
7423b8569j77Q012R418N601k237L467L049m254k077j459n707R51l44M017L826
7408f483r213j608J479M02R136P751J40l202J922m454L323j489j781J563m382
7393f896n520l821L079j6n584l796M488j411m252J048P000o482l987K225M835
$$ plain form
7502 -17823 -15310 -12038 -13446 -13962 -16570 -13984 -13502 -6811 -6407 -13423 -12699 -11131 -10971 -13907 -14294 -9003
7486 -9003 -8557 -9685 -8871 -10327 -10975 -11165 -11051 -10878 -14024 -8532 -3207 -7149 -9996 -4728 -3033 -3502 -5447
7469 -5447 -4587 -6072 -5458 -2520 860 -1209 -13588 -20563 -16562 -15352 -5829 -5827 -4024 -1053 1829 277
7453 277 -1016 -11248 -12699 -10786 -8150 -9252 -15609 -22402 -15437 -7871 -9648 -18984 -19017 -14133 -8581
7438 -8581 -8373 -16982 -27120 -25256 -17654 -15935 -14451 -17924 -20020 -20346 -23476 -24704 -22459 -28086 -28569
7423 -28569 -28746 -20734 -11316 -5715 -7952 -4485 -1436 -5690 -7767 -9226 -14933 -13982 -14326 -10309 -6483
7408 -6483 -15696 -17304 -15825 -15423 -6287 1464 1604 -1598 324 -4130 -807 -2296 -4077 -2514 -6896
7393 -6896 -12416 -16237 -13158 -13174 -18758 -22554 -18066 -19477 -23729 -22681 -15681 -22163 -26150 -23925 -19090
7378a9090M220P340J598m601l668J711Q18L999J990k094n747k611K748m940J371
7363a6956L748J27M064L740q574L431J642q118P93N018m660n101Q006L669k349
7348a1520L067N687L417j160k840k564n95j600j179l932k899L232M301J608n580
7333a2557m450K553P04k06K924J366Q299q02n095q334m369L247O721J251k885
7318a1633k550o39J745L865O42l444n745m530K124j83K366L669j358k682Q68K61
7302a7224K015L50o086P65K564K399k21j377p53O465K382O592j689p725Q356Q981
7286E794Q3n971k689Q6k726O100J138k980k224o83j529j573k894m354o80J720
7270a3382K034M044J081k923J462k742l342l740p30P335k941L95J068k034L534
$$ plain form
7378 -19090 -14870 -7530 -5932 -10533 -14201 -12490 -11672 -7673 -5683 -7777 -13524 -16135 -13387 -18327 -16956
7363 -16956 -13208 -13081 -9017 -5277 -13851 -10420 -8778 -16896 -16103 -11085 -15745 -20846 -12840 -9171 -11520
7348 -11520 -8453 -2766 651 -509 -3349 -5913 -6508 -8108 -9287 -13219 -16118 -12886 -8585 -6977 -12557
7333 -12557 -17007 -14454 -13750 -13956 -11032 -9666 -1367 -2169 -7264 -15598 -19967 -16720 -9999 -8748 -11633
7318 -11633 -14183 -14822 -13077 -9212 -8570 -12014 -17759 -22289 -20165 -20348 -17982 -14313 -15671 -18353 -17485 -17224
7302 -17224 -15209 -14859 -20945 -20180 -17616 -15217 -15438 -16815 -17568 -11103 -8721 -2129 -3818 -11543 -3187 5794
7286 5794 5877 -94 -2783 -2697 -5423 677 1815 -1165 -3389 -4072 -5601 -7174 -10068 -14422 -15102 -13382
7270 -13382 -11348 -7304 -6223 -9146 -7684 -10426 -13768 -17508 -18238 -10903 -13844 -13449 -12381 -14415 -10881
7255a0881M749m387j803Q85J35L870R283K545m748p890l779N994N960K041m72
7240A502o600n503j399O190O017l860q861k761m11r88k698N365O057M970o6M04
7224b642K495o008j1008l18P313K082J735o468j351J838J46J232J815L151m455
7209a0443r09n020p76j33K219O053M154J458l438j0437m250O63K576L169J1527
7194c587N099n681l884m13J486J500K091r108j2212p152Q906P446p30P380N789
7179c070K278k855p255n329K038M165J768o00n48k438l980M23oQ624M6r864o055
7162b2658L592R61K281k466k337N058J0831K011o618K245K242k033o091j582q15
7147a5379M539L018K644J23l703l700l41q7k993K186k609L899R631K098l501k603
$$ plain form
7255 -10881 -6132 -10519 -12322 -11437 -11302 -7432 1851 4396 -352 -8242 -12021 -6027 -67 1974 1502
7240 1502 -5098 -10601 -12000 -5810 207 -3653 -12514 -15275 -15686 -16674 -19372 -14007 -7950 -2980 -3046 -2642
7224 -2642 -147 -6155 -17163 -17481 -10168 -8086 -6351 -12819 -14170 -12332 -12186 -10954 -9139 -5988 -10443
7209 -10443 -11352 -16372 -17148 -17281 -15062 -9009 -4855 -3397 -6835 -17272 -21522 -20859 -18283 -15114 -3587
7194 -3587 1512 -4169 -8053 -8466 -6980 -5480 -3389 -12497 -24709 -31861 -22955 -15509 -16239 -8859 -3070
7179 -3070 -792 -3647 -10902 -16231 -14193 -10028 -8260 -8860 -9408 -11846 -15826 -15403 -15409 -6785 -6739 -16603 -22658
7162 -22658 -19066 -18105 -15824 -18290 -20627 -15569 -4738 -2727 -9345 -7100 -4858 -6891 -12982 -14564 -15379
7147 -15379 -10840 -7822 -5178 -5055 -8758 -12458 -12799 -12886 -15879 -13693 -16302 -12403 -2772 -674 -4175 -6778
7131f778M779k891j509K643O87m352N894L016k361J968K32J907l530l890J122
7116c063M50o894J246j74k653J842K149O129l401o918J530L478P87o538J668N14
7100i848N764l018P189l310k99K224M206l500l737j378L353j734k553j250n846
7085a3737J777j653l763j613N658O362j990O66k369l289M592K325J446J972o445
7070a0061j734N012j864R52L385l885n397J08L358M495M784o981j0003l811K279
7055a9363M225l47k746q82o16K703P23J371Q85L78n703m816J1317O570j230o913
7039a4444N84L093R547K126m678o16M197r64j0254o362k711K754Q614k676L2P417
7023d341r01k613l378k850j949P388l8j281j168J313o971n76J3921L716k616k086
$$ plain form
7131 -6778 -1999 -4890 -6399 -3756 -3069 -7421 -1527 1489 -872 1096 1328 3235 -295 -4185 -3063
7116 -3063 -2613 -9507 -8261 -8435 -11088 -9246 -7097 -968 -4369 -11287 -9757 -6279 -5492 -12030 -10362 -9848
7100 -9848 -4084 -7102 87 -3223 -3522 -1298 2908 -592 -4329 -5707 -2354 -4088 -6641 -7891 -13737
7085 -13737 -11960 -13613 -17376 -18989 -13331 -6969 -8959 -8293 -10662 -13951 -9359 -7034 -5588 -3616 -10061
7070 -10061 -11795 -6783 -8647 -7695 -4310 -8195 -13592 -13484 -10126 -5631 -847 -7828 -17831 -21642 -19363
7055 -19363 -15138 -15485 -18231 -19113 -19729 -17026 -16303 -14932 -14047 -13669 -19372 -24188 -12871 -6301 -7531 -14444
7039 -14444 -13860 -10767 -1220 906 -3772 -4388 -191 -1155 -11409 -17771 -20482 -17728 -9114 -11790 -11758 -4341
7023 -4341 -5242 -7855 -11233 -14083 -16032 -8644 -8682 -9963 -11131 -9818 -16789 -17365 -3444 272 -2344 -4430
7007d430n822l793N819K869N329K666P78R46o11n188l122k426r71K717L750k362
6991c851m669l549m73l412o622J465O88O968M286K451k94k440p8J7n7j500j127
6974a2197J842m42L69N264R19k162p36K787n394J559K590n625n938K012O015k550
6958a1687n636J508J716m374q35n495k273J0337K389J063l963p24K918J034m164
6943a8186j941N651N092o016k530L874P35m062l721j924N463O697M459J796o342
6928a0955j646O301J189j370m450L18K993q89L454K638L406k189k502R611Q96
6913F805l831n674R50k757m187N839K069k262n197o484r60P437L530k091o045
6898a2858J561P24J824k534j770J522K915J552N87J206O80r24N92r574J410N367
$$ plain form
7007 -4430 -10252 -14045 -8226 -5357 -28 2638 3416 4362 3751 -1437 -4559 -6985 -7956 -5239 -1489 -3851
6991 -3851 -8520 -12069 -12542 -15954 -22576 -21111 -20423 -13455 -9169 -6718 -7012 -9452 -9530 -9513 -9570 -11070 -12197
6974 -12197 -10355 -10797 -10428 -5164 -4245 -6407 -7143 -4356 -9750 -8191 -5601 -11226 -17164 -15152 -9137 -11687
6958 -11687 -17323 -15815 -14099 -18473 -19308 -24803 -27076 -16739 -14350 -13287 -17250 -17974 -15056 -14022 -18186
6943 -18186 -20127 -14476 -9384 -15400 -17930 -14056 -13321 -17383 -21104 -23028 -17565 -10868 -6409 -4613 -10955
6928 -10955 -12601 -6300 -5111 -6481 -10931 -10613 -7620 -8509 -5055 -2417 989 -1200 -3702 5909 6805
6913 6805 2974 -2700 -1750 -4507 -8694 -2855 -786 -3048 -8245 -14729 -15689 -8252 -4722 -6813 -12858
6898 -12858 -11297 -10573 -8749 -11283 -13053 -11531 -8616 -7064 -6477 -5271 -4591 -5515 -4923 -14497 -13087 -7720
6882g720L648p0J390j703k005o72K099L878o65J645P750R965L576J046q329j0938
6866B895q259j067k913l253j3L634L618m56n040m143O70Q244l423m827J002k193
6850a5524M284L061J92M451N978l778l019l797O544J772o30n558l468N80Q730
6835a82K529J444m367J469n891J51m998r44J706K392J3L033O452k679K214k122
6819B20k292l976n713o80L103j017K883M581L748K29m304n347L119k177k188n076
6803a4887l854K332m236J019J0111M255J499j392M900n466K082L906p877m25M384
6788c649n797l010P52L535N398j889k850L000R39J829o290k224K633j085j808
6773a0516Q54K300j07j783n922k951L428K44l304J252o7R58J2831M969q32m195
$$ plain form
6882 -7720 -4072 -4142 -2752 -4455 -6460 -7132 -5033 -1155 -1820 -175 7575 17540 21116 22162 13833 2895
6866 2895 -5364 -6431 -9344 -12597 -12610 -8976 -5358 -5814 -10854 -14997 -14327 -6083 -9506 -14333 -13331 -15524
6850 -15524 -11240 -8179 -7987 -3536 2442 -1336 -4355 -8152 -1608 164 -466 -6024 -9492 -8912 -182
6835 -182 2347 3791 -576 893 -4998 -4847 -9845 -10789 -9083 -6691 -6678 -3645 2807 128 2342 220
6819 220 -2072 -6048 -11761 -12441 -9338 -10355 -7472 -2891 857 1086 -3218 -8565 -5446 -7623 -9811 -14887
6803 -14887 -18741 -16409 -20645 -19626 -9515 -5260 -3761 -5153 -253 -5719 -3637 269 -7608 -8033 -3649
6788 -3649 -9446 -12456 -11704 -8169 -2771 -4660 -7510 -4510 -3571 -1742 -8032 -10256 -7623 -8708 -10516
6773 -10516 -9662 -7362 -7469 -9252 -15174 -18125 -14697 -14453 -17757 -16505 -16572 -15614 -2783 2186 1354 -2841
6757b841o28n440L216N082K200O960J1914J3298R597p975j5658r919j3269L94
6743c069O613q47k443J021k359m754k211j268j489O053L033M349N50O92P1Q074
6727A2016J317l803k667J023k552k981N017Q173J1322L025J119n134j0128j2114
6713C633o684J480K062m538k288M348M512j913j58l811o518j329L874J0302L542
6698F514m031p235M001K653M824J819m270r987n985m00M294k25l849K473J150
6683h254k39j298k637M370N784k081J007R103l128q135r70L087j658m227j574
6668a0850l512j030O838J2107K342l844p850n596l666M517R00k163J621K941M263
6653b982n835n155O63J049l078P771O088j0627o807m456M224j842j023J402m900
$$ plain form
6757 -2841 -3469 -8909 -5693 -611 1589 8549 20463 33761 43358 35383 19725 9806 -3463 -3069
6743 -3069 3544 2697 254 1275 -1084 -5838 -8049 -9317 -10806 -4753 -1720 2629 3179 3871 3942 12016
6727 12016 13333 9530 6863 7886 5334 2353 7370 15543 26865 29890 31009 25875 15747 3633
6713 3633 -3051 -1571 491 -4047 -6335 -1987 2525 612 454 -3357 -9875 -11204 -7330 2972 6514
6698 6514 2483 -4752 -751 1902 6726 8545 4275 -5712 -11697 -12097 -7803 -8028 -11877 -9404 -8254
6683 -8254 -8493 -9791 -12428 -8058 -2274 -4355 -3348 5755 2627 -5508 -6478 -3391 -5049 -9276 -10850
6668 -10850 -14362 -15392 -8554 3553 5895 2051 -5799 -11395 -15061 -10544 -9644 -11807 -10186 -7245 -2982
6653 -2982 -8817 -13972 -13309 -12260 -15338 -7567 -1479 -12106 -18913 -23369 -19145 -20987 -22010 -20608 -25508
6638b5508m67K61L006K875J215N869L908K789k146K644r3J714p287K93O715L91
6622c821J343L643m776l538o39l927l981P57L689o31j011m690L821J1007N789
6607C035j674j797o184n998J75L816J786K701k825m387N185L702n477o196k853
6592a6991l70J045J13Q108P80M787m057m762M690j284o12N45l880j693j12n508
6576a9201l89j371L661L510J491J237j345L838j274n977k028N971Q623K214l890
6561d930n275j709m140n58M625P86P894k755J194K636k090l297l440k254Q076
6546e237J2722K514k209l249N35k73o673n435r43K433k497K752N180mq868o060
6530a5312j148j437J276O088l357p896L15R663P010Q51j98O773J041l126m06l241
$$ plain form
6638 -25508 -25975 -25714 -22708 -19833 -18618 -12749 -8841 -6052 -8198 -5554 -5647 -3933 -11220 -10927 -4212 -3821
6622 -3821 -2478 1165 -3611 -7149 -7788 -11715 -15696 -14939 -11250 -11881 -12892 -17582 -13761 -2754 3035
6607 3035 1361 -436 -6620 -12618 -12443 -8627 -6841 -4140 -6965 -11352 -6167 -2465 -7942 -14138 -16991
6592 -16991 -17361 -16316 -16203 -8095 -7315 -2528 -6585 -11347 -6657 -7941 -8553 -8008 -11888 -13581 -13693 -19201
6576 -19201 -19590 -20961 -17300 -13790 -12299 -11062 -12407 -8569 -9843 -15820 -17848 -11877 -3254 -1040 -4930
6561 -4930 -10205 -11914 -16054 -16612 -11987 -11201 -3307 -6062 -4868 -2232 -4322 -7619 -11059 -13313 -5237
6546 -5237 7485 9999 7790 4541 5076 4803 -1870 -7305 -8248 -5815 -8312 -5560 -380 -384 -9252 -15312
6530 -15312 -16460 -17897 -16621 -10533 -13890 -21786 -21471 -11808 -4798 -3947 -4145 2628 3669 543 137 -3104
6514c104l003P983K520j145J400p48m255j1586L280N680n253L603K729O963K081
6499G145o376l965L826N501J870p954j2037j0582O567P77J704j672l464j863j92
6484b0715P572P938j020j065J658P99J720P956L182r79m957m706J052N864N02
6469D801m706J862j362p661k41N70p481j777L590M160L770J799M557P674K145
6454A1700l092K187k186J270k945l266n524o059j892L535l675k44L383m0K149
6439d699j340N433K892Q19o090l107L93M066M151M707j198O72j639r547l425o27
6423h539K288p375K522M954l201K47M695P82l661j15j727m169M403P663N763o688
6407b158k955j395n567K769J626k2o85j157N89J694M201k154n566j501l44N16
$$ plain form
6514 -3104 -6107 1876 4396 3251 4651 3903 -352 -11938 -8658 -2978 -8231 -4628 -1899 5064 7145
6499 7145 769 -3196 630 6131 8001 47 -11990 -22572 -16005 -15228 -13524 -15196 -18660 -20523 -20715
6484 -20715 -13143 -5205 -6225 -7290 -5632 -4833 -3113 4843 8025 7046 2089 -2617 -1565 4299 4801
6469 4801 95 1957 595 -7066 -7307 -6737 -14218 -15995 -12405 -8245 -4475 -2676 1881 9555 11700
6454 11700 8608 10795 8609 9879 6934 3668 -1856 -7915 -9807 -6272 -9947 -10191 -6808 -6848 -4699
6439 -4699 -6039 -606 2286 3105 -2985 -6092 -5699 -1633 2518 7225 6027 6699 5060 -4487 -7912 -8539
6423 -8539 -6251 -13626 -11104 -6150 -9351 -9104 -4409 -3627 -7288 -7403 -9130 -13299 -8896 -1233 4530 -2158
6407 -2158 -5113 -6508 -12075 -9306 -7680 -7702 -8387 -9544 -8955 -7261 -3060 -5214 -10780 -12281 -12625 -12109
6391a2109M328Q038q89K399N642J459l997m363R56k77k79j301L84p80J769J0460
6375A1440N321m036p435m485J431m824q752L438P64k904p702R92L353M187L925
6360e287k311m454R52P940p90L735k814R02n494l806K318K101P135j645n776n111
6344a2405K054K60P630L302l548M261Q76l728j0709k421o45M495k147l037M229
6329a1533L063k444M029j407l634m90K799J276J537Q010K173n538m600q96L310
6314d345L926J639j259P118j46o745j214M48j533m083m712J46J584k712k801M35
6298a4254N553k271Q20j841M662M360k290j110j687J135n954J507J0866M282m518
6283g40l084J757J357K833L406q187n095j592J804k642l396m141O476P289j286
$$ plain form
6391 -12109 -7781 257 -632 1767 7409 8868 4871 508 1464 1187 908 -393 -9 -789 980 11440
6375 11440 16761 12725 5290 805 2236 -2588 -11340 -7902 -7138 -10042 -17744 -16752 -13399 -9212 -5287
6360 -5287 -7598 -12052 -11100 -3160 -3950 -215 -3029 -2127 -7621 -11427 -9109 -7008 127 -1518 -7294 -12405
6344 -12405 -10351 -10091 -2461 841 -2707 1554 2430 -1298 -12007 -14428 -15073 -10578 -12725 -15762 -11533
6329 -11533 -8470 -10914 -6885 -8292 -11926 -12416 -9617 -8341 -6804 1206 3379 -2159 -6759 -7655 -4345
6314 -4345 -419 1220 -39 7079 6933 188 -1026 -578 -2111 -6194 -10906 -10760 -9176 -11888 -14689 -14254
6298 -14254 -8701 -10972 -10152 -11993 -7331 -2971 -5261 -6371 -8058 -6923 -12877 -11370 -504 3778 -740
6283 -740 -3824 -2067 -710 2123 5529 -2658 -7753 -9345 -7541 -10183 -13579 -17720 -11244 -3955 -5241
6268e241J933k831n779l631M271K613q805j320Q19J845J2105J667j179j908k553
6253g994p75M280P37k031n340j854Q24M33O633M294n04N39J644k492Q8j605K671
6236d52J487M64L511l545k409q076l516P740L951o001M624M072N96o494M049L874
6220C875K919k056m942k406K120p03J690o45m276L538l439M338j6k320N06j66
6204a983J100k050Q35Q19m038o888n123l98K631l458k406O972L678M727L020L748
6188A186o182n311l5P83k59j15N886N509M15p326L10K308n571J741j177K794M138
6171i06J063l706l482O867M391n328q812n48n17K608M887O06K925l844j606P04
6155d698K050n09J520m024j097j443K02K375K246k706m030L143L231k969O44M417
$$ plain form
6268 -5241 -3308 -6139 -11918 -15549 -11278 -8665 -17470 -18790 -17971 -16126 -4021 -2354 -3533 -5441 -7994
6253 -7994 -8769 -4489 -3752 -5783 -11123 -12977 -12153 -11720 -5087 -793 -1297 -758 886 -1606 -1518 -3123 -452
6236 -452 1035 1499 5010 1465 -944 -9020 -12536 -4796 -845 -6846 -2222 1850 2446 -4048 1 3875
6220 3875 6794 4738 -204 -2610 -490 -1193 497 -148 -4424 -886 -4325 13 -3 -2323 -1817 -1983
6204 -1983 -883 -2933 -2098 -1279 -5317 -12205 -17328 -17726 -15095 -18553 -20959 -13987 -10309 -5582 -2562 1186
6188 1186 -4996 -10307 -10342 -9559 -9818 -9933 -4047 1462 1877 -5449 -5139 -2831 -8402 -6661 -7838 -5044 -906
6171 -906 157 -3549 -7031 -164 4227 -1101 -9913 -10461 -10978 -8370 -3483 -2877 48 -3796 -5402 -4698
6155 -4698 -2648 -3157 -1637 -5661 -6758 -8201 -7999 -5624 -3378 -6084 -10114 -6971 -3740 -6709 -6065 -1648
6139a648k918p22J781j403m47N685k930K289P372l877p41J801L184j709l101p820
6123e204k704o8M68L38J496J661M845l337n629L69L626j336q62O612j022k510
6107c257O58N03L223O418J995p602l791k078K365J0408M133p725j371k475K737
6092D141m028J750N83l340K071n9N887j728p385j288O58K547P71J283k366N01
6076bL502M62j957k003l333j232L477k198j226L69j051M667j14Q36l782J769J589
6059b27M808l173n751k478J765M106q32K289N420m126q460l849j716M472M104
6044c648k762M17l011N587J144M53k142k48L402K710M775m404k412N92K36m814
6028d125n735k36K390P309J301J239M95o074m844k606L031O78o788M827K807J485
$$ plain form
6139 -1648 -4566 -5288 -3507 -4910 -5357 328 -2602 -313 7059 3182 2441 4242 7426 5717 2616 -5204
6123 -5204 -7908 -7976 -7508 -7170 -5674 -4013 832 -2505 -8134 -7765 -4139 -5475 -6337 275 -747 -3257
6107 -3257 -2599 -2096 1127 7545 9540 1938 -1853 -3931 -1566 8842 12975 5250 3879 1404 4141
6092 4141 113 1863 2446 -894 1177 1118 7005 5277 -2108 -3396 -2738 -191 580 1863 -503 -2
6076 -2 3500 3962 2005 2 -3331 -4563 -1086 -3284 -4510 -4141 -5192 -525 -639 197 -3585 -1816 -227
6059 -227 4581 1408 -4343 -6821 -5056 -950 -1782 507 5927 1801 -6659 -10508 -12224 -7752 -3648
6044 -3648 -6410 -5993 -9004 -3417 -2273 -1820 -3962 -4210 -808 1902 6677 2273 -139 453 689 -4125
6028 -4125 -9860 -10096 -7706 -397 904 2143 2638 -3436 -8280 -10886 -7855 -7177 -13965 -9138 -6331 -4846
6012d846L460m329M621J366j414m225m309L884j587L68Q67l550m825M447L228
5997f844J771O856Q51k820l332l807N49N843L204L11o835j381L501J055k696j182
5981d956J179K995r067m016L207M543P137J015o22k322J573K582j20l386k835
5966c093J400k187K177j301J961J821k406p644k331J975m415P39K774k692K214
5951a1008M550Q277O191k3o751j521p94m027K141l213k60j108j623O901m78m184
5935f930q280k534Q685L122M263L334Q14K590j32o29o904n021p422K466M197j693
5919a0074r42O395q27r859P81O853K101o285J886J1886K266m840n81k074N663
5904B349M699q94r254M13N101j138n243M748K12m422k64M698j333n66L776j501
$$ plain form
6012 -4846 -1386 -5715 -1094 272 -1142 -5367 -9676 -5792 -7379 -7011 -6144 -9694 -14519 -10072 -6844
5997 -6844 -5073 1783 2634 -186 -3518 -7325 -6776 -933 2271 2582 -4253 -5634 -2133 -1078 -3774 -4956
5981 -4956 -3777 -782 -9849 -13865 -10658 -6115 1022 2037 1415 -907 666 3248 3128 -258 -3093
5966 -3093 -1693 -3880 -1703 -3004 -1043 778 -1628 -9272 -11603 -9628 -14043 -13304 -10530 -13222 -11008
5951 -11008 -6458 1819 8010 7987 1236 -285 -1079 -5106 -2965 -6178 -6438 -7546 -9169 -2268 -2746 -6930
5935 -6930 -15210 -17744 -9059 -5937 -1674 1660 2474 5064 4932 4303 -2601 -7622 -15044 -12578 -8381 -10074
5919 -10074 -11016 -4621 -5448 -15307 -14526 -7673 -5572 -11857 -9971 1915 4181 -659 -1240 -3314 2349
5904 2349 7048 6154 -3100 -2687 2414 1276 -3967 781 993 -3429 -3693 1005 -328 -894 2882 1381
5888A381K841j603J256J76m821m154l073J478l118k124k571j523O689J4N403J031
5872b718k34r869n226O026M502L670N023l315k615O10P93J064J389l1m574m13
5856e918J440l196q356L003P064N862P437L652p013L680M638n894o223J407l284
5841a701n11P786Q67J109j937p466o50l689L065M630l020l605j098o30Q31n81
5825f600j4O730q60Q98N107K252p59m951j941J35O018j793m457l258j792j718
5809g003k105o5L570l453m338M690L418o080j087L056P269M744K483k111j962
5794A026k677q501P094K582O110L440m094p880k071J044O370K031j384j385k135
5779d30L396k123J866L66K012n099J213j144K441k63N62l7m509l594m690J750
$$ plain form
5888 1381 4222 2619 3875 4051 -770 -4924 -7997 -6519 -9637 -11761 -14332 -15855 -9166 -9152 -3749 -2718
5872 -2718 -2952 -12821 -18047 -12021 -7519 -3849 1174 -2141 -4756 -4146 -3353 -2289 -900 -931 -5505 -5918
5856 -5918 -4478 -7674 -16030 -13027 -5963 -101 7336 10988 3975 7655 12293 6399 176 1583 -1701
5841 -1701 -2212 5574 6441 7550 5613 -1853 -2503 -6192 -3127 1503 -1517 -5122 -6220 -6850 -6019 -6600
5825 -6600 -6614 116 -744 154 5261 7513 6754 1803 -138 -3 6015 4222 -235 -3493 -5285 -7003
5809 -7003 -9108 -9173 -5603 -9056 -13394 -8704 -5286 -11366 -12453 -9397 -2128 2616 5099 2988 1026
5794 1026 -1651 -10152 -3058 -476 5634 9074 4980 -2900 -4971 -3927 2443 4474 3090 1705 -430
5779 -430 2966 843 2709 3075 5087 -12 1201 57 2498 2235 2797 2760 -1749 -5343 -10033 -8283
5763h283P87M471L843p320r66N080N837k670M12j074K97p745K411K975m714n521
5747a2180J923P563Q87N493L40n347p21n968j95K698N896J890l569O489j059q729
5731d589o647N000N836o41J627K473j079l359o512k319M826N119l999J233p97
5716c828n616M220N688j180m853J748N826O55j571o590m621N48K024N5l433M355
5700f573Q1J256P90k890N511k184k089K51K349K128L46p367K247K502Q91l444
5684f195R44Q74L682Q38J187k337K329j934K043J305n630o29J959K467M526M67
5668E896n086m75Ln48j530j92N81k679N118o18o571k270o05n649J522Q655M596
5651A48n053k392l917Q19K565N217o38J004l493m069L528L841L474Q47m72j896
$$ plain form
5763 -8283 -7496 -3025 818 -6502 -7468 -2388 3449 779 1191 117 414 -7331 -4920 -1945 -6659 -12180
5747 -12180 -10257 -2694 -1807 3686 4026 -1321 -2042 -8010 -8205 -5507 389 2279 -1290 5199 4140 -4589
5731 -4589 -11236 -6236 -400 -1041 586 3059 1980 -1379 -7891 -10210 -5384 -265 -4264 -3031 -3828
5716 -3828 -9444 -5224 464 -716 -5569 -3821 2005 2660 1089 -5501 -10122 -9574 -7550 -7495 -10928 -6573
5700 -6573 -6492 -5236 -4446 -7336 -1825 -4009 -6098 -5847 -3498 -1370 -1024 -8391 -6144 -3642 -2751 -6195
5684 -6195 -5251 -4377 -695 143 1330 -1007 1322 -612 1431 2736 -2894 -3523 -1564 903 5429 5896
5668 5896 810 335 338 -210 -1740 -1932 -1351 -4030 1088 470 -6101 -8371 -8976 -14625 -13103 -4448 148
5651 148 -4905 -7297 -11214 -10395 -7830 -2613 -3251 -2247 -5740 -9809 -6281 -2440 1034 1881 1409 -487
5635d87m715j696M748R44J562N91M7M01n214j60M138o384m620j768o69M677N651
5618b954j90p25M97m9m951K635K026j170L387k226M098k883p102J519J1550O029
5602I491N45J402k88k375n475k486k723k851K548l516q207j811P556J939j166
5587g417M685O917j558j230j813k570l296N017O65j945l096J50K207O067j496
5572A287J195K373n70q269o847p55K834M398M795K982M88N550K162k658n61n826
5556B578m385l507r66L348J82J203L42M26n249r22N29L810N297K652K012n910
5540A440l622P918l421m935L450J572k245o922J662M123N728o36l775o343j769
5525g775M488J289q39J994m042M781K490L470M182q047L870Q348J793k174p48
$$ plain form
5635 -487 -5202 -6898 -2150 -1206 356 947 994 1395 -3819 -3979 159 -6225 -10845 -12613 -13282 -8605 -2954
5618 -2954 -3144 -3869 -3372 -3421 -8372 -5737 -3711 -4881 -1494 -3720 378 -2505 -9607 -8088 3462 9491
5602 9491 10036 11438 11150 8775 3300 814 -1909 -4760 -2212 -5728 -13935 -15746 -8190 -6251 -7417
5587 -7417 -2732 4185 2627 1397 -416 -2986 -6282 -1265 -600 -2545 -5641 -5491 -3284 2783 1287
5572 1287 2482 4855 4285 -3984 -10831 -11586 -8752 -4354 441 3423 3911 9461 11623 8965 8404 2578
5556 2578 -1807 -5314 -6280 -2932 -2750 -1547 -1205 -779 -6028 -6950 -6421 -2611 2686 5338 7350 1440
5540 1440 -2182 5736 2315 -2620 830 2402 157 -6765 -5103 -980 4748 4112 337 -6006 -7775
5525 -7775 -3287 -1998 -2837 -843 -4885 -104 2386 5856 10038 1991 5861 14209 16002 13828 13080
5510A3080m054J744K859o318j334m195o033P89j095R86J3r221J772L529n22K078
5494e922M025M904j539m144n004j127M321Q126K416K396m064q611N90J39J284
5479b210k39M897j770j552n734m289N04K193M993N931j175m606j186j667O608
5464F98L929o88o685k626k708J0347P207m473j0410n53L982m21O879J668j632
5449D514j497j121q23N73K948Q7j33p798j070N030J862O376q06o339k751n511
5433f459k561J173m044K487M673L970L05j240K662m582Nk459k376J197l133j184
5417a1566k17M126O901J523n414n53L631L368m201r05L367N36k542M23n132j233
5401g888m686n31k649k762l096M015n58J1173Q036m360n18M343R90N41k241k257
$$ plain form
5510 13080 9026 10770 13629 7311 5977 1782 -4251 -3462 -4557 -3571 -3558 -12779 -11007 -7478 -8000 -5922
5494 -5922 -1897 3007 1468 -2676 -7680 -8807 -4486 3640 6056 8452 4388 -4223 -3633 -3494 -2210
5479 -2210 -2449 2448 678 -874 -6608 -10897 -10393 -8200 -3207 2724 1549 -3057 -4243 -5910 698
5464 698 4627 3939 -2746 -5372 -8080 2267 9474 5001 -5409 -5962 -1980 -2401 4478 6146 4514
5449 4514 3017 1896 1073 1646 4594 4681 4548 -3250 -4320 710 2572 8948 8142 1803 -948 -6459
5433 -6459 -9020 -7847 -11891 -9404 -4731 -761 -456 -1696 966 -3616 -3611 -6070 -8446 -7249 -10382 -11566
5417 -11566 -11783 -7657 -756 767 -4647 -5200 -1569 1799 -2402 -3307 60 596 -1946 -1523 -6655 -7888
5401 -7888 -12574 -13105 -15754 -18516 -21612 -17597 -18155 -6982 1054 -3306 -3824 519 1509 2050 -191 -2448
5385b448l248L982j670R47K254N607N027Q77l536j096J402j412o761L57M375P41
5369E398K957J295n905k205K780l374p722j695l67J528M540J323l758L646K071
5354E12N978K820j31p241J293j990p601J443j045O430j26N26o547j50M992k07
5338a044n491J1144Q360j1862p123O250J670J808J067j727L489m154j1096r433
5324a8142P413N207K159K756K594K601L315l714q558j483K041p79m3j804Q02J826
5308c809q79N869N299L568l018k32M771o220q814o124O755P278J270J63n166j961
5292a250K280j959r598l014J0477Q254k3J437m16m299j048p09J014j121l957j181
5276e113P41R57n215J233n70J252k444O049N601M802n181J110J729l515m489k540
$$ plain form
5385 -2448 -5696 -1714 -3384 -2437 -183 5424 10451 11328 7792 6696 8098 6686 -75 282 4657 5398
5369 5398 8355 9650 3745 1540 4320 946 -6776 -8471 -8838 -7310 -2770 -1447 -5205 -1559 512
5354 512 6490 9310 9179 1938 3231 1241 -6360 -4917 -5962 468 342 868 -5679 -5829 -837 -1044
5338 -1044 -6535 4609 12969 1107 -6016 234 1904 3712 4779 3052 6541 2387 -8709 -18142
5324 -18142 -10729 -5522 -3363 -607 1987 4588 7903 4189 -4369 -5852 -3811 -4590 -4633 -6437 -5635 -3809
5308 -3809 -4688 1181 6480 10048 7030 6798 11569 5349 -3465 -9589 -2834 4444 5714 5877 711 -1250
5292 -1250 1030 -929 -10527 -13541 -3064 5190 5167 6604 6188 1889 841 132 1146 25 -3932 -5113
5276 -5113 -4372 -3415 -8630 -7397 -7967 -6715 -9159 -3110 2491 7293 2112 3222 4951 1436 -3053 -5593
5260e593l0L811M965l802J61J365l384m124R62J631k334R93M564J1101o22p173
5244B491k415o688l031O396P1j943N527k596k646lK999L463K437L608p856o60
5228h46J184r66j833m126j840J1063m84q447r496J742K226K93R534L862L26m741
5212b549q192L333Q275N687m332l850M07R4n30M101j129K772l05j640k962m67
5196a287l208l19K304L372P86J942L554j75m043k856j221R29K973L192n752k176
5180a985j359p598O908P618K940m112l093O455J457j336n240l325L549J378j087
5165A170l014L715P377n962o916Q538j255j864O071J751m31r488k906L045j543
5150a712l70r087n75K948p50l184M325M081l141k57K097q91k94P105m660j980
$$ plain form
5260 -5593 -5623 -1812 3153 -649 -488 877 -2507 -6631 -5669 -4038 -6372 -5379 -815 10286 9664 2491
5244 2491 76 -6612 -9643 -3247 -3176 -5119 408 -2188 -4834 -4837 -1838 1625 4062 7670 -186 -846
5228 -846 338 -628 -2461 -6587 -8427 2636 2152 -6295 -15791 -14049 -11823 -11530 -1996 1866 2192 -2549
5212 -2549 -10741 -7408 867 6554 2222 -1628 -1221 -1127 -1657 2444 1315 4087 3782 2142 -820 -1287
5196 -1287 -4495 -4814 -2510 862 1648 3590 7144 6969 2926 70 -1151 -222 2751 5943 191 -1985
5180 -1985 -3344 -10942 -4034 3584 6524 2412 -681 5774 7231 5895 655 -2670 879 2257 1170
5165 1170 -1844 1871 9248 3286 -3630 4908 3653 1789 7860 9611 9180 -308 -3214 -169 -1712
5150 -1712 -2082 -11169 -11744 -8796 -9546 -12730 -8405 -4324 -7465 -7722 -5625 -6516 -6810 295 -4365 -6345
5134f345L464R91L556k270m303M352l483J656L057N609m547m411j859O359p834
5119f008k798Q168Nm178L071k097l632N66r197L1l337K529R855J495k069L925
5103c671N147j884J920M751q590m454L834K503M794K254k724K606l3r162m655
5088g364N655J189j962k680N403j44k565m949k762O21L373j376M270j189k987
5073g467L542K33n16l78M757k27p85m235M607q32n00N810k006p163p68J609M355
5056C6J0504p164j403n273p769m58M046O256P035L505n168L675J177J443M880
5041A5322l349r774l042P59o258m707L067l04q68R89L772j149k077O540p776l907
5025a2762K347R216O150k981r556q304j35P358P313j980o640o05l249k131P417
$$ plain form
5134 -6345 -2881 -1890 1666 -604 -4907 -555 -4038 -2382 675 6284 1737 -2674 -4533 1826 -6008
5119 -6008 -8806 -638 -633 -4811 -1740 -3837 -7469 -6903 -16100 -16069 -19406 -16877 -7022 -5527 -7596 -3671
5103 -3671 1476 -408 1512 6263 -2327 -6781 -2947 -444 4350 6604 3880 6486 6453 -2709 -7364
5088 -7364 -1709 -520 -2482 -5162 241 97 -2468 -7417 -10179 -9558 -6185 -7561 -3291 -4480 -7467
5073 -7467 -3925 -3692 -4208 -4586 171 -56 -841 -5076 -469 -1301 -1801 4009 2003 -5160 -5928 -4319 36
5056 36 10540 3376 1973 -3300 -11069 -11527 -7481 -1225 5810 9315 4147 7822 8999 10442 15322
5041 15322 11973 2199 -843 -84 -6342 -11049 -7982 -8286 -9154 -8165 -4393 -5542 -7619 -1079 -8855 -12762
5025 -12762 -10415 -1199 4951 1970 -7586 -15890 -16025 -8667 -1354 -3334 -9974 -10579 -13828 -15959 -8542
5010h542M794L735N018l135q688J788J0939L893j980P61k130r994l179M575j724
4995c869m048M705N491k640J792J452p314j356K562rl661j746J0335N46k763p445
4979g968O34L183J768M940k766Q22M265l47m174p563M256Q754N95l992n45j313
4963E49l186R84M106j720q51L148R17L468r546q483j277N95L59O011R386L901
4947H361O865l516n389j14k058n859J505N14L646m20n120j788j356L888M63K335
4931A957J010l988q079P251l726n552J620O817P718K810j279p149l659L952j647
4916a944K903M252j683m389M503j483o981k232l43k72K223J996q18L562J927L987
4900E208K460j94L488k962o830K44K40J688L988k923l921k232K635J2239O84p120
$$ plain form
5010 -8542 -3748 -13 5005 1870 -6818 -5030 5909 9802 7822 8583 6453 -3541 -6720 -2145 -3869
4995 -3869 -7917 -3212 2279 -361 1431 2883 -4431 -5787 -3225 -3234 -6895 -8641 1694 2240 -523 -7968
4979 -7968 -7334 -4151 -2383 2557 -209 613 4878 4531 357 -7206 -2950 5804 6399 2407 1862 549
4963 549 -2637 -1653 2453 733 -118 3030 3947 7415 -2131 -10614 -11891 -11296 -10937 -4926 4460 8361
4947 8361 15226 11710 6321 6207 4149 -1710 -205 309 3955 3535 -1585 -3373 -4729 -841 -378 1957
4931 1957 2967 -1021 -9100 -1849 -5575 -11127 -9507 -2690 5028 7838 6559 -590 -4249 -297 -1944
4916 -1944 959 5211 3528 -861 3642 2159 -4822 -7054 -7397 -7669 -5446 -3450 -4268 -706 1221 5208
4900 5208 7668 7474 10962 8000 1170 1414 1654 3342 7330 4407 486 -1746 889 13128 13812 6692
4884F692m427n022r37M307K62j387J319l849l419M51J647P558J2110k8r186o565
4868d74k695Q866Q46J764L065o405L113k262n797l111p308j148N465m8M761m86
4852a854k67j379K168O558k822o59J462J258o927P11P794L668q161j82o285q967
4836a3884M630P460J841k729l060l991O593L440l444n505p653L247L780N408M087
4821B20pL41m80P16k946q04j86l640l402m221L520M494M73M913J945K009l352
4804d07M335J511j0515n062J120J695O625L012k973m784L615j225L880P6m934
4789d031q1N319l88o269L81r15q501L30M731J021J18J429J295P796N751j407j539
4772E040R58n540k898L614o38J059P24j953J600P651m992m935o62j956L55m537
$$ plain form
4884 6692 2265 -2757 -3694 613 875 -512 807 -3042 -6461 -6010 -4363 3195 15305 15277 6091 -474
4868 -474 -3169 5697 6543 8307 11372 4967 8080 5818 21 -3090 -10398 -11546 -6081 -6129 -1368 -1854
4852 -1854 -2121 -3500 -1332 5226 2404 1745 3207 4465 -2462 -1751 6043 9711 1550 1368 -4917 -13884
4836 -13884 -9254 -1794 47 -2682 -5742 -9733 -3140 300 -3144 -8649 -16302 -13055 -9275 -3867 220
4821 220 213 554 74 790 -2156 -2960 -3146 -6786 -10188 -14409 -10889 -6395 -5922 -1009 936 2945 -407
4804 -407 3928 5439 -5076 -10138 -9018 -7323 -698 2314 -659 -5443 -1828 -3053 827 903 -4031
4789 -4031 -4112 1207 819 -5450 -5069 -5984 -14485 -14155 -9424 -8403 -8285 -6856 -5561 2235 7986 6579 5040
4772 5040 5998 458 -2440 1174 536 1595 2319 366 1966 9617 4625 -310 -972 -2928 -2573 -7110
4756g110K752O021J812N835M152p38P17k757n457P11m599P28p276m823J1085M045
4740E098J12o16j032J633K661q84r71M007p23j31k130K757K406l030l005j146
4724E006m133n527L20K832Q205L444n980m301k504k339O501L992P6n619k669N514
4708B818M295k728l804p030m925M59Q086K186M572p893k998P059P81k956j177
4693c255m677J742M480r58J599O037J306m276q531j558O170J905r92j168l465
4678e641j435j7M356M392K336J591n858r26M849l362p925N337N891L225K891J878
4662A1582m877p130k837k540K837J680L91P97n02m188L343R039M612j294q447
4647B466j372j75k11K746K313J049N27J061l926n497m11p01L639J646p643j826
$$ plain form
4756 -7110 -4358 1663 3475 9310 13462 12724 13441 10684 5227 5938 1339 2067 -5209 -10032 1053 5098
4740 5098 5210 4594 3562 5195 7856 6972 6001 10008 9285 9154 7024 9781 12187 9157 6152 5006
4724 5006 873 -4654 -4334 -1502 6703 10147 4167 -134 -2638 -4977 1524 5516 5592 -27 -2696 2818
4708 2818 7113 4385 581 -6449 -11374 -10915 -2829 -643 3929 -3964 -6962 97 878 -2078 -3255
4693 -3255 -7932 -6190 -1710 -2668 -1069 4968 6274 1998 -6533 -8091 -1921 -16 -1008 -2176 -5641
4678 -5641 -7076 -7093 -2737 1655 3991 5582 -276 -1202 3647 285 -7640 -2303 3588 6813 9704 11582
4662 11582 6705 -425 -3262 -5802 -2965 -1285 -894 -97 -599 -4787 -1444 7595 12207 10913 2466
4647 2466 1094 919 708 3454 5767 6816 7343 8404 4478 -1019 -1430 -2131 1508 3154 -4489 -6315
4631f315m94J871K679l34M125M221j480L14l7l777l112p334j658L419L017K770
4615b125K206p662j554J339l88M022J259o374K441N628Q22q92K995l479p177P8
4599h861M878K242K508M948J246L546O29L592j514q29l483k827j0646M94P312
4584C235j43j877K578J75k13J241k31K529o669n616n282K655K794K179N087O698
4568I140m365l000k712O473R097J105k367l468o046L908l706l001j56j367L406
4553B941P75J654K915n839k458M676K356N24J209N489j0637j4097n278QK903J904
4537a0955Q124O693o63k821k916k867R631K068m770n893k272j818l718k419L409
4522a1187j785K515O330L604l300R63o692l004L04o06M302L328K876j887l153
$$ plain form
4631 -6315 -6809 -4938 -2259 -2593 1532 5753 4273 4587 4550 773 -2339 -9673 -11331 -7912 -4895 -2125
4615 -2125 81 -7581 -9135 -7796 -8184 -4162 -2903 -9277 -6836 -1208 -386 -1278 1717 -1762 -8939 -8861
4599 -8861 -3983 -1741 767 5715 6961 10507 11136 14728 13214 12385 8902 6075 -4571 -4077 3235
4584 3235 3092 1215 3793 3968 3755 4996 4765 7294 625 -4991 -10273 -7618 -4824 -2645 2442 9140
4568 9140 4775 1775 -937 5536 14633 15738 13371 9903 3857 7765 4059 1058 902 -465 2941
4553 2941 3716 5370 8285 2446 -12 4664 7020 7544 8753 14242 3605 -10492 -15770 -15762 -12859 -10955
4537 -10955 -2831 3862 3199 378 -2538 -5405 4226 6294 1524 -4369 -6641 -8459 -12177 -14596 -11187
4522 -11187 -12972 -10457 -4127 -523 -3823 -2860 -9552 -12556 -12252 -12858 -8556 -5228 -2352 -4239 -7392
4507g392o35M762O260M814l075Q94P280k144n616j991L08J7p74j541L365N929
4491A0461j781o609N495k136o144j228j032J779M73l796Q019k720r240n420q32
4476a4711R35J62L896R022J534k647o64K965j625j828J790N439o06J559M974M023
4460A4218k638l155m696l271r59l441P020J0401J416j0720m670o483Q59N063J508
4445D52k413j925J113m309Q763J826p11M930K414l869N684N040o320o454N061
4430I282J345r27j492o795l619J212k110j10L039M303j510k291l534m076K95m428
4414a1416L488O303J169m020j989J132n87J189p03N479L399n291k785L174N550
4399D092M303o255K1M630M768p249q830m007n19j295J762K355J881L591K116K900
$$ plain form
4507 -7392 -8027 -3265 2995 7809 4734 5628 12908 10764 5148 3157 3465 3482 2708 1167 4532 10461
4491 10461 8680 2071 7566 5430 -714 -1942 -2974 -1195 -722 -4518 3501 781 -8459 -13879 -14711
4476 -14711 -13776 -13614 -9718 -696 838 -1809 -2473 492 -1133 -2961 -1171 4268 3662 5221 10195 14218
4460 14218 11580 8425 3729 458 -501 -3942 3078 13479 14895 4175 -495 -6978 -6119 -1056 452
4445 452 -1961 -3886 -2773 -7082 1681 3507 2796 7726 10140 6271 11955 16995 10675 4221 9282
4430 9282 10627 9700 8208 1413 -2206 -994 -3104 -3214 -175 4128 2618 327 -3207 -7283 -6988 -11416
4414 -11416 -7928 -1625 -456 -4476 -6465 -5333 -5920 -4731 -5434 45 3444 -1847 -4632 -1458 4092
4399 4092 8395 2140 2161 6791 11559 4310 -4520 -8527 -9046 -10341 -8579 -6224 -4343 -752 1364 4264
4383D264K98m281k968K364M227N986k124n432l207m735m585J814K679l96j214
4368g310K726Q81J483k866o62l100q23N02J46Q403O714O557k819n567l558j824
4352a117N552m611o762j205O312q11o607Q084N385j840o939m893M373L04l847
4337h622M785L480l573k790K713K184L049K306j717o629J523L122J303j435j089
4322a390l896n230n088k394k239L592k64j420J807R846N669J230K919Q57m835
4307h36j2862k100L602M440n321o356k865P799Q614l53K844l441k406J542k479
4292a0178M644R54o928o90K431L422J939m653P63O889J900%J228l959M81l558
4276e315J570j45J03K641K115m286K00J0530P110J772l021j1019q466K566k63
$$ plain form
4383 4264 4562 281 -2687 -323 3904 9890 7766 2334 -873 -5608 -10193 -8379 -5700 -6096 -7310
4368 -7310 -4584 -3703 -2220 -5086 -5748 -8848 -9671 -9169 -9023 -620 6094 12651 9832 4265 707 -1117
4352 -1117 4435 -176 -6938 -8143 -1831 -2642 -9249 -1165 4220 2380 -4559 -9452 -5079 -4775 -8622
4337 -8622 -3837 -357 -3930 -6720 -4007 -1823 1226 3532 1815 -4814 -3291 -169 1134 -301 -1390
4322 -1390 -5286 -10516 -15604 -17998 -20237 -16645 -16909 -18329 -16522 -6676 -1007 223 3142 3999 -836
4307 -836 -13698 -15798 -12196 -7756 -13077 -19433 -22298 -14499 -5885 -6238 -3394 -6835 -9241 -7699 -10178
4292 -10178 -5534 -4580 -11508 -12198 -9767 -6345 -4406 -9059 -8296 -1407 493 493 1721 -2238 -1757 -5315
4276 -5315 -3745 -3890 -3787 -1146 969 -3317 -3117 7413 14523 16295 13274 2255 -6211 -3645 -3908
4261c908j33L670m23K198l680p74k037q52l31j84J54J133M64K720L890K867k551
4244B223j410J336M116K390M258k61o428j522M33m662L675Q2n086K757L367m049
4228A219k40L22P584K954j4548n590K742M138N719j629l533o234p481N368M705
4213d504O736M067O267n470J248K774j563M302M153L815p591L09n029o845l329
4198f60l280q01j17K673J4731J3608J292r001m267p489l724k5j9J8k319j633M76
4181e37j094q011m350O395N571M481K661j839k742M54m384o084O334L802L470
4166D127L859o728P61j621k187J327l697J503R559j854j0192p66n37N157Q802
4151G513K399J913m46l361p9O975K428J040l552l649q83q06M132L276l490m273
$$ plain form
4261 -3908 -4041 -371 -794 1404 -2276 -3050 -5087 -5939 -6270 -6454 -6300 -5167 -4703 -1983 1907 4774 2223
4244 2223 813 2149 6265 8655 12913 12652 6224 4702 5135 473 4148 4230 -856 1901 5268 1219
4228 1219 979 1301 8885 11839 -2709 -8299 -5557 -1419 4300 2671 -862 -7096 -14577 -9209 -4504
4213 -4504 2232 6299 12566 7096 8344 11118 9555 13857 18010 21825 14234 14543 9514 2669 -660
4198 -660 -3940 -4741 -4858 -2185 12546 26154 27446 18445 14178 6689 2965 2940 2921 2939 620 -1013 -537
4181 -537 -1631 -9642 -13992 -7597 -2026 2455 5116 3277 535 989 -3395 -9479 -3145 657 4127
4166 4127 7986 1258 2019 398 -1789 -462 -4159 -2656 6903 5049 -5143 -5909 -6446 -1289 7513
4151 7513 9912 11825 11379 8018 7939 14914 17342 18382 14830 11181 10298 9492 13624 16900 13410 9137
4135I137l593n88J464o935l660n855J1232N252J704n315R07J478l731l678J935
4120b46M85R22l700J0860K400o101n803o753k90L849p049K622Q531N323J337P2
4104F459P2k072J007M301o15j370K092M83l169J49J446m210j1534K32L013O658
4088B942l16J237k044N164k877K092r24m584K671L312n692q400m518N855M244
4073a838K106m934K036O432m038m769M225J290p31j103P45J1621M641o622m929
4058D132m53L42j892N547Q311K810m838o913o368J918n67q078j317N506M026j108
4042A058M664J13n810N434m93J518k50L671n047o28k885k567j701P11m610O726
4026i6R85K998l322k553J623n67q100K389K397J571l727o615L376Q371J719L293
$$ plain form
4135 9137 5544 4956 6420 -515 -4175 -10030 1202 6454 8158 2843 3750 5228 1497 -2181 -246
4120 -246 239 1161 -2539 8321 10721 4620 -1183 -7936 -8226 -4377 -11426 -8804 -273 5050 6387 6459
4104 6459 6531 4459 5466 9767 9152 7782 9874 10357 7188 7337 8783 4573 -6961 -6729 -3716 2942
4088 2942 2626 3863 1819 6983 4106 6198 5274 690 3361 6673 981 -7419 -11937 -6082 -1838
4073 -1838 268 -4666 -2630 3802 -236 -5005 -780 510 -221 -1324 -579 11042 15683 9061 4132
4058 4132 3679 4021 2129 7676 15987 18797 13959 7046 678 2596 2029 -6049 -7366 -1860 2166 1058
4042 1058 5722 5835 25 5459 4966 6484 6234 9905 4858 4230 1345 -1222 -2923 -2212 -6822 -96
4026 -96 889 3887 565 -1988 -365 -932 -9032 -6643 -4246 -2675 -6402 -13017 -9641 -1270 449 3742
4010C742R17j184Q49L06O63K527l689o888N039K807L119l800p744J698L343j508
3994A97J830j082K422J471r98l20L573K693m384k593J398k429k566j522j127n13
3978c950j878J744N57O08N000N170k708p471m518l939M893J5822j584o322K056
3963C480o79J867J496q60j818J081k785m846K862K040L925J999m09j942N27o273
3947c35o495N442M783M907n546k92k290m435N675R508K550j173j426m297n966
$$ plain form
4010 3742 4659 3475 4324 4630 5293 7820 4131 -2757 2282 5089 8208 4408 -3336 -1638 1705 197
3994 197 2027 945 3367 4838 3840 3520 7093 9786 5402 2809 4207 1778 -788 -2310 -3437 -3950
3978 -3950 -5828 -4084 -3527 -2919 2081 7251 4543 -2928 -7446 -11385 -6492 9330 7746 1424 3480
3963 3480 2801 4668 6164 5304 3486 4567 1782 -3064 -202 1838 5763 7762 7353 5411 5938 -335
3947 -335 -6830 -1388 3395 8302 2756 2464 174 -4261 1414 10922 13472 12299 10873 6576 610
$$ [...]
##END NTUPLES=NMR SPECTRUM
##END=
