##TITLE=Analysis number 308381
Compound Code cc 01303
Project Code adrs
Chemist Name ugmt
##JCAMPDX= 6.0         $$ Bruker NMR JCAMP-DX V2.0
##DATA TYPE= NMR SPECTRUM
##DATA CLASS= NTUPLES
##ORIGIN= Bruker BioSpin GmbH
##OWNER= NMR
$$ XWIN-NMR		Version 3.5
$$ Tue May 24 12:10:14 2005 GMT Daylight Time (UT+1h)  MAYBRIDGE\NMR@NMR_250MHZ
##.OBSERVE FREQUENCY= 250.131544655141
##.OBSERVE NUCLEUS= ^1H
##.ACQUISITION MODE= SIMULTANEOUS (DQD)
##.ACQUISITION SCHEME= undefined
##.AVERAGES= 16
##.DIGITISER RES= 18
##SPECTROMETER/DATA SYSTEM= dpx250
##.PULSE SEQUENCE= zg30
##.SOLVENT NAME= CDCl3
##.SHIFT REFERENCE= (INTERNAL, CDCl3, 0, 16.522)
##AUDIT TRAIL= $$ (NUMBER, WHEN, WHO, WHERE, WHAT)
$$ ##TITLE= Audit trail, XWIN-NMR		Version 3.5
$$ ##JCAMPDX= 5.01
$$ ##ORIGIN= Bruker BioSpin GmbH
$$ ##OWNER= NMR
$$ C:\u/data/dgb/nmr/ADRS/3380/pdata/1/auditp.txt
$$ ##AUDIT TRAIL=  $$ (NUMBER, WHEN, WHO, WHERE, WHAT)
(   1,<2005-05-24 12:09:50.34 +100>,<MAYBRIDGE\NMR>,<NMR_250MHZ>,
      <created by zg, POWCHK disabled, PULCHK disabled
       configuration hash MD5:
       62 19 C7 07 E1 42 D1 B7 37 6C 3D D0 77 39 F9 E6
       data hash MD5: 64K
       8C 2F FD 9F 47 7A F9 24 19 2A 78 A7 54 BA CA 0F>)
(   2,<2005-05-24 12:10:04.17 +100>,<MAYBRIDGE\NMR>,<NMR_250MHZ>,
      <Start of raw data processing
       ef LB = 0.3 FT_mod = 6 PKNL = 1 SI = 32K 
       data hash MD5: 32K
       41 91 DE 62 CB EC FF ED 1D E1 BE 8C 94 2C 32 12>)
(   3,<2005-05-24 12:10:06.12 +100>,<MAYBRIDGE\NMR>,<NMR_250MHZ>,
      <apk 
       data hash MD5: 32K
       CE 36 34 B6 1D 80 2F 2B A1 DD A4 42 C2 EE 15 6E>)
(   4,<2005-05-24 12:10:06.79 +100>,<MAYBRIDGE\NMR>,<NMR_250MHZ>,
      <abs ABSG = 5 
       data hash MD5: 32K
       A5 6F 77 FB 96 D7 22 F4 68 92 47 CA 5E EA 99 2F>)
$$ ##END=
$$ 
$$ hash MD5
$$ 23 E9 47 DB 42 8C 40 37 6C 9A 8B 11 C8 99 CF A1
##$RELAX= 
##$RELAX= 
##$RELAX= 
##$RELAX= 
##$RELAX= 
##$RELAX= 
##$RELAX= 
$$ Bruker specific parameters
$$ --------------------------
##$DU= <C:\u>
##$EXPNO= 3380
##$NAME= <ADRS>
##$PROCNO= 1
##$TYPE= <nmr>
##$USER= <dgb>
##$AMP= (0..31)
100 100 100 100 100 100 100 100 100 100 100 100 100 100 100 100 100 100 
100 100 100 100 100 100 100 100 100 100 100 100 100 100 
##$AQSEQ= 0
##$AQ_mod= 3
##$AUNM= <au_zg>
##$AUTOPOS= <23 >
##$BF1= 250.13
##$BF2= 250.13
##$BF3= 250.13
##$BF4= 250.13
##$BF5= 500.13
##$BF6= 500.13
##$BF7= 500.13
##$BF8= 500.13
##$BYTORDA= 1
##$CFDGTYP= 0
##$CFRGTYP= 5
##$CHEMSTR= <none>
##$CNST= (0..31)
1 1 145 1 1 1 1 1 1 1 1 1 1 1 1 1 1 1 1 1 1 1 1 1 1 1 1 1 1 1 1 1 
##$CPDPRG= <>
##$CPDPRG1= <>
##$CPDPRG2= <>
##$CPDPRG3= <>
##$CPDPRG4= <mlev>
##$CPDPRG5= <mlev>
##$CPDPRG6= <mlev>
##$CPDPRG7= <mlev>
##$CPDPRG8= <mlev>
##$CPDPRGB= <>
##$CPDPRGT= <>
##$D= (0..31)
0 1 0 0 0 0 0 0 0 0.06 0 0 0 0 0 0 0.0002 0 0 0 0 0 0 0 0 0 0 0 0 0 0 
0 
##$DATE= 1116932989
##$DBL= (0..7)
120 120 120 120 120 120 120 120 
##$DBP= (0..7)
150 150 150 150 150 150 150 150 
##$DBP07= 0
##$DBPNAM0= <>
##$DBPNAM1= <>
##$DBPNAM2= <>
##$DBPNAM3= <>
$$ [...]
##$SUBNAM7= <"">
##$SUBNAM8= <"">
##$SUBNAM9= <"">
##$SW= 20.6930455092707
##$SWIBOX= (0..15)
0 0 3 0 0 0 0 0 0 0 0 0 0 0 0 0 
##$SW_h= 5175.983436853
##$TD= 65536
##$TD0= 1
##$TE= 295.16
##$TE2= 300
##$TE3= 300
##$TEG= 300
##$TL= (0..7)
0 120 120 120 120 120 120 120 
##$TP= (0..7)
150 150 150 150 150 150 150 150 
##$TP07= 0
##$TPNAME0= <>
##$TPNAME1= <>
##$TPNAME2= <>
##$TPNAME3= <>
##$TPNAME4= <>
##$TPNAME5= <>
##$TPNAME6= <>
##$TPNAME7= <>
##$TPOAL= (0..7)
0.5 0.5 0.5 0.5 0.5 0.5 0.5 0.5 
##$TPOFFS= (0..7)
0 0 0 0 0 0 0 0 
##$TUNHIN= 0
##$TUNHOUT= 0
##$TUNXOUT= 0
##$USERA1= <user>
##$USERA2= <user>
##$USERA3= <user>
##$USERA4= <user>
##$USERA5= <user>
##$V9= 5
##$VALIST= <valist>
##$VCLIST= <CCCCCCCCCCCCCCC>
##$VD= 0
##$VDLIST= <DDDDDDDDDDDDDDD>
##$VPLIST= <PPPPPPPPPPPPPPP>
##$VTLIST= <TTTTTTTTTTTTTTT>
##$WBST= 1024
##$WBSW= 4
##$XGAIN= (0..3)
0 0 0 0 
##$XL= 0
##$YL= 0
##$YMAX_a= 501179
##$YMIN_a= -481281
##$ZGOPTNS= <>
##$ZL1= 120
##$ZL2= 120
##$ZL3= 120
##$ZL4= 120
##$ABSF1= 16.522
##$ABSF2= -4.171173
##$ABSG= 5
##$ABSL= 3
##$ALPHA= 0
##$AQORDER= 0
##$ASSFAC= 0
##$ASSFACI= 0
##$ASSFACX= 0
##$ASSWID= 0
##$AUNMP= <proc_1d>
##$AZFE= 0.1
##$AZFW= 0.1
##$BCFW= 0
##$BC_mod= 0
##$BYTORDP= 0
##$COROFFS= 0
##$CY= 12.5
##$DATMOD= 1
##$DC= 0
##$DFILT= <>
##$DTYPP= 0
##$F1P= 14.0000005364418
##$F2P= -0.99999901652339
##$FCOR= 0.5
##$FTSIZE= 32768
##$FT_mod= 6
##$GAMMA= 0
##$GB= 0
##$INTBC= 1
##$INTSCL= 1
##$ISEN= 128
##$LB= 0.3
##$LEV0= 0
##$LPBIN= 0
##$MAXI= 10000
##$MC2= 0
##$MEAN= 0
##$ME_mod= 0
##$MI= 0
##$NCOEF= 0
##$NC_proc= -3
##$NLEV= 6
##$NOISF1= 0
##$NOISF2= 0
##$NSP= 0
##$NTH_PI= 0
##$NZP= 0
##$OFFSET= 16.522
##$PC= 1
##$PHC0= -76.58687
##$PHC1= 6.408498
##$PH_mod= 1
##$PKNL= yes
##$PPARMOD= 0
##$PSCAL= 4
##$PSIGN= 0
##$REVERSE= no
##$SF= 250.13
##$SI= 32768
##$SIGF1= 0
##$SIGF2= 0
##$SINO= 400
##$SIOLD= 32768
##$SREGLST= <1H.CDCl3>
##$SSB= 0
##$STSI= 32768
##$STSR= 0
##$SW_p= 5175.98343685301
##$SYMM= 0
##$S_DEV= 0
##$TDeff= 65536
##$TDoff= 0
##$TI= <Analysis number 999999
Compound Code 99
Book Reference 9
Project Code 9>
##$TILT= no
##$TM1= 0
##$TM2= 0
##$TOPLEV= 0
##$USERP1= <user>
##$USERP2= <user>
##$USERP3= <user>
##$USERP4= <user>
##$USERP5= <user>
##$WDW= 1
##$XDIM= 32768
##$YMAX_p= 304960802
##$YMIN_p= -50857
$$ End of Bruker specific parameters
$$ ---------------------------------
##NTUPLES= NMR SPECTRUM
##VAR_NAME=  FREQUENCY,     SPECTRUM/REAL,   SPECTRUM/IMAG
##SYMBOL=    X,             R,               I
##VAR_TYPE=  INDEPENDENT,   DEPENDENT,       DEPENDENT
##VAR_FORM=  AFFN,          ASDF,            ASDF
##VAR_DIM=   32768,         32768,           32768
##UNITS=     HZ,            ARBITRARY UNITS, ARBITRARY UNITS
##FACTOR=    0.157963299565203, 1,           1
##FIRST=     4132.6476996994, 0,             0
##LAST=      -1043.33573715361, 0,           0
##MIN=       -1043.33573715361, -50857,      0
##MAX=       4132.6476996994, 304960802,     0
$$ Real data points
##PAGE= N=1
##DATA TABLE= (X++(R..R)), XYDATA
$$ [...]
$$ plain form
25065 9672 5117 3396 5148 1934 -6948 -7986 -6887 -5333 -8229 -5735 -12862 -13781 -9167 -13829 -7995
25050 -7995 -1946 -1499 8535 7132 11984 4897 -193 2803 457 -14631 -17248 6661 11623 12963
25036 12963 18170 17139 13016 13451 -3623 -16803 2687 6990 6012 -480 2795 5262 4684 2207
25022 2207 3927 10751 23699 31465 27596 16994 -2252 1518 12335 21248 26400 21743 22539 16625
25008 16625 11308 4814 3804 11789 10469 7532 2815 1263 4399 4964 6436 8867 10835 12344 12490
24993 12490 9241 5063 -4433 -9662 -11372 -4255 -8122 -10085 -12137 -3335 11598 9268 132 6037
24979 6037 2040 -9870 -10859 -7333 -11522 -12426 -8393 -14656 -9533 1739 15980 21220 10697 13133
24965 13133 11883 13465 17088 6063 977 4097 7640 4453 9201 19941 8662 -6068 -1583
$$ packed form
25065I672m555j721J752l214q882j038J099J554k896K494p127r19M614m662N834
25050g995O049M47J0034j403M852p087n090K996k346j5088k617K3909M962J340
25036A2963N207j031m123M35j7074j3180J9490M303r78o492L275K467n78k477
25022B207J720O824J2948P766l869j0602j9246L770J0817Q913N152m657P96n914
25008A6625n317o494j010P985j320k937m717j552L136N65J472K431J968J509J46
24993A2490l249m178r496n229j710P117l867j963k052Q802J4933k330r136N905
24979F037l997j1910r89L526m189r04M033o263N123J1272J4241N240j0523K436
24965A3133j250J582L623j1025n086L120L543l187M748J0740j1279j4730M485
$$ plain form
24952 -1583 -8330 -7356 -531 -240 11521 10584 13023 24776 15006 -2071 -13666 -8042 957 9524
24938 9524 -24 385 -1279 -8767 -14159 -8549 -1214 7186 -1237 -714 255 4992 1137 3299 -2512
24923 -2512 3273 3400 -3483 -3867 8727 8933 7540 15612 15445 6806 -3210 -4461 16203 34138 19440
24908 19440 11013 16432 23046 5075 -4397 -9991 863 623 8862 6201 2860 -2896 -766 6194
24894 6194 -86 -4856 -12226 -17273 -10135 -5653 -3001 3104 9453 -2558 -15600 -11739 -9447 -12740
24880 -12740 -8419 -25648 -24089 -10929 -14415 -17877 -18387 2485 7487 225 -3482 -2545 9888 12733
24866 12733 266 -10134 -17172 -11382 -1493 9458 15165 -873 3707 2722 -11587 -23588 -22732
24853 -22732 -1464 12647 12862 1122 -6171 5885 21767 17193 22881 27965 19341 1989 -3628
$$ packed form
24952a583o747R74O825K91J1761r37K439J1753r770j7077j1595N624Q999Q567
24938I524r548M09j664p488n392N610P335Q400q423N23R69M737l855K162n811
24923b512N785J27o883l84J2594K06j393Q072j67q639j0016j251K0664J7935j4698
24908A9440q427N419O614j7971r472n594J0854k40Q239k661l341n756K130O960
24894F194o280m770p370n047P138M482K652O105O349j2011j3042L861K292l293
24880a2740M321j7229J559J3160l486l462n10K0872N002p262l707R37J2433K845
24866A2733j2467j0400p038N790R889J0951N707j6038M580r85j4309j2001Q56
24853b2732K1268J4111K15j1740p293J2056J5882m574N688N084q624j7352n617
$$ plain form
24840 -3628 277 -5854 -5803 -2171 10979 16854 6373 11915 8287 3936 -8416 -4292 -1442 -8432
24826 -8432 -4502 2840 3457 15967 8014 4304 5398 551 -3039 -2782 8876 9144 5770 1048 345
24811 345 6590 13900 7125 -15944 -9734 -4508 -4873 -5249 -1521 648 631 -6190 -11418 -17072 -21926 -12845
24795 -12845 -4943 751 1311 3689 -9203 -6465 -8818 -21824 -23755 -2433 6768 -11648 -11114 -19313
24781 -19313 -24231 -24420 -15555 -8809 91 -589 5529 8129 1233 -10388 -317 1787 -5643 -7873
24767 -7873 -15993 -21981 -18306 -4331 6867 -3941 -13841 -7742 9658 16524 1381 2282 13914
24754 13914 -2242 1973 20270 11726 5870 15529 16616 12122 6325 14132 18568 19961 11009 -283
24740 -283 -15682 -15079 -3949 3396 -3378 4504 -2476 786 -984 3867 -655 -13334 -15996 -15292 -19332
$$ packed form
24840c628L905o131N1L632J3150N875j0481N542l628m351j2352M124K850o990
24826h432L930P342O17J2510p953l710J094m847l590K57J1658K68l374m722p03
24811C45O245P310o775k3069O210N226l65l76L728K169j7o821n228n654m854R081
24795a2845P902N694N60K378j2892K738k353j3006j931K1322R201j8416N34q199
24781a9313m918j89Q865O746Q900o80O118K600o896j1621J0071K104p430k230
24767g873q120n988L675J3975J1198j0808r900O099J7400O866j5143R01J1632
24754A3914j6156M215J8297q544n856R659J087m494n797P807M436J393q952j1292
24740b83j5399O03J1130P345o774P882o980L262j770M851m522j2679k662P04m040
$$ plain form
24725 -19332 -10476 1503 8900 5915 7618 14827 11777 -5301 -16275 -18881 -19827 -23259 -4041 9056
24711 9056 -1421 4350 9572 7349 10014 22101 11901 6629 -6786 -13642 -12349 -10215 -11296 -16593
24697 -16593 -13690 -13173 -6044 4193 -237 3030 7084 9922 14026 -1777 -10313 -1758 8788 16524
24683 16524 10781 2096 -435 -1393 2569 4095 9708 12830 7329 -2761 -5601 -7119 -1896 3579
24669 3579 -1000 -9491 -14076 -8313 -5811 -820 -1380 -6752 5835 8765 -3479 -8942 1705 14745
24655 14745 25374 31723 31251 24420 12165 7478 131 -11097 -19922 -14795 -7670 -2276 -8150 -15100
24641 -15100 -1350 14661 2159 -6130 -3045 -1647 -10206 -25500 -23634 -17540 -18348 -10698 -18676 -14090
24627 -14090 -10171 -14539 -13544 4379 12212 -2346 -14745 -18030 -26493 -24439 -19383 -15176 -13437 4664
$$ packed form
24725a9332Q856J1979P397k985J703P209l050j7078j0974k606r46l432J9218J3097
24711I056j0477N771N222k223K665J2087j0200n272j3415o856J293K134j081n297
24697a6593K903N17P129J0237m430L267M054K838M104j5803q536Q555J0546P736
24683A6524n743q685k531r58L962J526N613L122n501j0090k840j518N223N475
24669C579m579q491m585N763K502M991n60n372J2587K930j2244n463J0647J3040
24655A4745J0629O349m72o831j2255m687p347j1228q825N127P125N394n874o950
24641a5100J3750J6011j2502q289L085J398q559j5294J866O094q08P650p978M586
24627a4090L919m368R95J7923P833j4558j2399l285q463K054N056M207J739J8101
$$ plain form
24613 4664 16645 269 -16478 -18151 -14330 -17575 -17697 -12965 -87 4360 17272 14245 13056 15042
24599 15042 7212 -7726 -16809 -17307 -8693 -3006 -9926 -6717 -2485 11742 3634 5883 15323 19067
24585 19067 9714 4206 -9292 -10494 -4304 -4128 -16060 -17524 -16679 -15902 -18100 -23603 -20381 -21279 -1218
24570 -1218 9375 19665 21121 14920 10711 381 -2716 4752 -6619 -5801 -9665 -16320 -15650 -26050
24556 -26050 -19142 -3917 -6436 -5601 -13385 -14513 -9246 -5151 2152 8085 8751 13236 12286 11828 10399
24541 10399 5607 -1225 -8249 -8063 -11684 -19599 -24760 -16028 -13359 -9762 -8879 1263 7324 744 -5622
24526 -5622 -11036 -7147 384 2952 -4725 -3403 -3149 -1510 12114 15955 11134 19453 13234 10764 1109
24511 1109 -574 3157 5060 12598 10740 15090 17250 4871 -9169 -12537 294 1470 -1244 -1479
$$ packed form
24613D664J1981j6376j6747j673L821l245j22M732J2878M447J2912l027j189J986
24599A5042p830j4938r083m98Q614N687o920L209M232J4227q108K249R440L744
24585A9067r353n508j3498j202O190J76j1932j464Q45P77k198n503L222q98K0061
24570a218J0593J0290J456o201m209j0330l097P468j1371Q18l864o655O70j0400
24556b6050O908J5225k519Q35p784j128N267M095P303N933O66M485r50m58j429
24541A0399m792o832p024J86l621p915n161Q732K669L597Q83J0142O061o580o366
24526e622n414L889P531K568p677J322K54J639J3624L841m821Q319o219k470r655
24511A109j683L731J903P538j858M350K160j2379j4040l368J2831J176k714k35
$$ plain form
24497 -1479 -3054 -10779 -22413 -20447 -5493 4147 14550 9599 9407 -3622 -15084 -16756 -8905 -11406
24483 -11406 -14721 -18903 -14477 -2176 -9506 -15107 -1198 2162 3980 -227 -3137 -8498 2813 1145
24469 1145 1669 7116 6317 691 6322 12310 18799 18506 9590 7515 8940 17465 28521 24723 14646
24454 14646 6113 3472 -10344 -18347 -10900 -13178 -13815 -12108 -16862 -25520 -27767 -27866 -25401 -17409 -24368
24439 -24368 -20716 -12122 -2061 -4359 -2759 -4345 -5502 1629 -7480 -17690 -17533 -18428 -11772 11328
24425 11328 30940 27772 20324 9089 2337 14053 14891 3435 138 3034 16486 34032 32695
24412 32695 29460 15562 -1701 -23802 -36994 -37289 -26744 -11297 -348 -5314 -10787 -189 4013
24399 4013 -210 -4779 -5515 5024 23914 19760 2199 -4903 -8080 -12801 -7858 -11625 -6765 -6222
$$ packed form
24497a479j575p725j1634J966J4954R640J0403m951j92j3029j1462j672P851k501
24483a1406l315m182M426J2301p330n601J3909L360J818m207k910n361J1311j668
24469A145N24N447p99n626N631N988O489k93q916k075J425Q525J1056l798j0077
24454A4646q533k641j3816q003P447k278o37J707m754q658k247r9K465P992o959
24439b4368L652Q594J0061k298J600j586j157P131r109j0210J57q95O656K3100
24425A1328J9612l168p448j1235o752J1716Q38j1456l297K896J3452J7546j337
24412C2695l235j3898j7263k2101j3192k95J0545J5447J0949m966n473J0598M202
24399D013m223m569p36J0539J8890m154j7561p102l177m721M943l767M860N43
$$ plain form
24385 -6222 -5199 -5558 -1115 -8777 -859 4685 -7769 -8036 5675 556 -6572 4372 9352 2196
24371 2196 2739 8220 20578 17498 27989 32958 36164 34615 18304 3753 -1627 -4292 -7563 -14534
24357 -14534 -33753 -44439 -14866 -80 -3035 -6026 -16314 -6181 12025 28969 22398 6227
24345 6227 2582 -1786 -2499 -6142 -17105 -8823 19064 13774 10293 7347 -6989 -9276 -19715 -26503
24331 -26503 -7696 -9562 -21003 -9238 -3543 -11192 -9196 34 2187 -4276 -10005 -10690 -2839 -1845
24317 -1845 -17289 -11756 -6657 -7249 1019 14660 27040 20068 9616 13669 15752 16559 10069 1160
24303 1160 -7873 -8292 -4120 4673 -3141 -5568 -10469 -15652 -7718 -6187 -1786 -4251 -7566 -7029 2503
24288 2503 1351 5266 -522 1201 -6994 -10644 -11618 -6674 12411 10953 -91 -21108 -28155 -21118
$$ packed form
24385f222J023l59M443p662P918N544j2454k67J3711n119p128J0944M980p156
24371B196N43N481J2358l080J0491M969L206j549j6311j4551n380k665l271o971
24357a4534j9219j0686K9573J4786k955k991j0288J0133J8206J6944o571j6171
24345F227l645m368p13l643j0963Q282K7887n290l481k946j4336k287j0439o788
24331b6503J8807j866j1441J1765N695p649J996R230K153o463n729o85P851R94
24317a845j5444N533N099n92Q268J3641J2380o972j0452M053K083Q07o490q909
24303A160r033m19M172Q793p814k427m901n183P934J531M401k465l315N37R532
24288B503j152L915n788J723q195l650r74M944J9085j458j1044k1017p047P037
$$ plain form
24274 -21118 -6123 9896 13008 5734 6243 13058 17248 13328 -3769 -14682 -23573 -19603 -19449 -19681
24260 -19681 -26767 -26515 -12585 -8227 2147 7807 -1645 -8707 -478 -4583 -6638 -4678 -12195 -8180
24246 -8180 7346 6300 5780 20892 12404 -1336 -14055 -7255 -3573 -6912 -9865 8064 24367
24233 24367 24867 24880 37692 47635 37596 20936 18871 6194 -1661 777 74 4596 7382 -12284
24219 -12284 -14109 7018 9725 19894 24133 11453 1963 -2208 -5241 1065 15814 6185 416
24206 416 5307 4589 8243 -3615 -6363 -14935 -22283 -14339 -3651 -1449 154 -4448 -15921 65
24192 65 19067 6151 -6719 -2527 10239 14497 17424 20495 18376 22892 16806 10435 13708 12089
24178 12089 2737 -7925 -3783 7537 -8839 -10309 -2277 -1004 -5262 -6426 -16367 -13373 -11691 584
$$ packed form
24274b1118J4995J6019L112p274N09O815M190l920j7097j0913q891L970J54k32
24260a9681p086K52J3930M358J0374N660r452p062Q229m105k055J960p517M015
24246h180J5526j046n20J5112q488j3740j2719O800L682l339k953J7929J6303
24233B4367N00J3J2812R943j0039j6660k065j2677p855K438p03M522K786j9666
24219a2284j825K1127K707J0169M239j2680r490m171l033O306J4749r629n769
24206D16M891p18L654j1858k748q572p348P944J0688K202J603m602j1473J5986
24192F5J9002j2916j2870M192J2766M258K927L071k119M516o086o371L273j619
24178A2089r352j0662M142J1320j6376j470Q032J273m258j164r941K994J682J2275
$$ plain form
24164 584 -692 3759 11476 13948 7015 5254 -9168 -7669 -4293 5027 -674 -6325 12401 17726
24150 17726 10154 -4860 -7908 -9763 -16089 -13533 -3491 1665 -2484 6529 15965 18541 19509 8850
24136 8850 -12402 -15351 -11917 -6083 -2474 -7663 -15938 -14201 -16929 -13237 -16939 -9074 -3157 1113
24122 1113 6956 -7023 -2484 -5392 -3082 1355 2511 1953 6983 9503 18932 22217 10166 6715
24108 6715 7659 2920 11254 14379 11855 2820 3384 9039 9045 3127 8586 17030 18388 7098 -1931 -626
24092 -626 -2056 1837 -5926 2784 14461 5613 -11372 -9251 -9728 -7350 945 345 -5527 -1664 -5518
24077 -5518 -9132 -5501 2615 4870 -5321 4738 16834 11371 -4240 -9734 -4860 1687 -2461 -2052
24063 -2052 5140 7617 3496 5548 2903 -3832 1972 6783 3965 9405 7063 -610 -10369 -7859 2634
$$ packed form
24164E84j276M451P717K472o933j761j4422J499L376R320n701n651J8726N325
24150A7726p572j5014l048j855o326K556J0042N156m149R013R436K576R68j0659
24136H850k1252k949L434N834L609n189q275J737k728L692l702P865N917M270
24122A113N843j3979M539k908K310M437J156n58N030K520R429L285j2051l451
24108F715R44m739Q334L125k524r035N64N655On918N459Q444J358j1290r029J305
24092f26j430L893p763Q710J1677q848j6985K121m77K378Q295o00n872L863l854
24077e518l614L631Q116K255j0191J0059J2096n463j5611n494M874O547m148M09
24063b052P192K477m121K052k645o735N804M811k818N440k342p673r759K510J0493
$$ plain form
24048 2634 3819 -1619 -13312 -3386 8509 14354 5649 9552 12653 17553 10378 4385 4673 413
24034 413 -9403 -5956 -11860 -7774 7135 16558 17829 14086 3024 -5629 -3497 -3534 -4221 -329 7221
24019 7221 15485 5433 -9279 -13853 -12564 -4441 -312 4698 -5264 -17278 -17881 -14456 -10689 -4953
24005 -4953 -1358 4374 11263 6961 -5074 -585 -6222 1299 9696 11017 -2025 2954 2717 3316 5015
23990 5015 2061 -5231 -3016 -665 4330 2485 -843 -3801 -6287 -11627 -21076 -12702 4029 2062
23976 2062 1187 2453 8109 14978 19476 3064 -2307 -254 12104 11269 8135 2812 5662 2591 -3802
23961 -3802 -23524 -17965 7447 14586 8852 2569 12789 22358 17368 8794 1475 2690 7073 -10148
23947 -10148 -9538 -9248 -8391 3979 14390 2838 -12666 -13475 -8260 3772 -2375 -4367 -5189 -4598 -7320
$$ packed form
24048B634J185n438j1693R926J1895N845q705L903L101M900p175n993K88m260
24034D13r816L447n904M086J4909R423J271l743j1062q653K132l7o87L892P550
24019G221Q264j0052j4712m574J289Q123M129N010r962j2014o03L425L767N736
24005d953L595N732O889m302j2035M489n637P521Q397J321j3042M979k37N99J699
23990E015k954p292K215K351M995j845l328k958k486n340r449Q374J6731j967
23976B062q75J266N656O869M498j6412n371K053J2358q35l134n323K850l071o393
23961c802j9722N559K5412P139n734o283J0220R569m990q574p319J215M383j7221
23947a0148O10K90Q57J2370J0411j1552j5504q09N215J2032o147j992q22N91k722
$$ plain form
23932 -7320 2813 18281 14043 9342 11921 13332 13213 9489 -3412 -6259 2919 19998 11556 1025
23918 1025 -12206 -13899 -15110 -15866 -24635 -20283 -8917 7988 10908 -209 -6421 4833 6261 11972
23904 11972 15776 16625 20355 2737 -8910 6746 -776 -4537 -16019 -17337 -22710 -14032 -1188
23891 -1188 6525 17462 20660 2163 -4183 -21165 -10063 4446 18892 11914 -9969 -3193 1900
23878 1900 -5003 -7639 -5188 5572 10359 7677 -8183 -1138 1867 -32 2916 -8682 -8851 -1790
23864 -1790 -3774 -15703 -18616 -1130 12553 17698 15649 13337 7375 5562 1981 3561 10893 -694
23850 -694 -7197 -1870 7477 9598 18005 23182 29978 15407 4266 -7322 -5445 -3493 -481 -8458
23836 -8458 -12792 -3793 2652 13687 4490 9542 9140 -3082 -15565 -18130 -14331 2945 15718 10007
$$ packed form
23932g320J0133J5468m238m701K579J411j19l724j2901k847R178J7079q442j0531
23918A025j3231j693j211p56q769M352J1366J6905K920j1117o212J1254J428N711
23904A1972L804Q49L730j7618j1647J5656p522l761j1482j318n373Q678J2844
23891a188P713J0937L198j8497o346j6982J1102J4509J4446o978k1883O776N093
23878A900o903k636K451J0760M787k682j5860P045L005j899K948j1598j69P061
23864a790j984j1929k913J7486J3683N145k049k312n962j813l581J580P332j1587
23850f94o503N327R347K121Q407N177O796j4571j1141j1588J877J952L012p977
23836h458m334Q999O445J1035r197N052m02j2222j2483k565L799J7276J2773n711
$$ plain form
23822 10007 2583 1265 4661 14555 17833 30498 35663 38509 37900 28382 16834 -3324 -1300 1878
23808 1878 -15579 -20209 -15939 -6662 1467 2536 1705 10896 12132 14686 9118 5904 -1076 -9310 -5641
23793 -5641 3084 13777 -3008 3350 12458 -260 3114 13448 11010 7794 -5303 -9688 -15918
23780 -15918 -15522 -12824 -14581 -9276 -19070 -17951 -10332 -5426 -1313 -5640 -13589 -20412 -14793 -5612 2825
23765 2825 13200 15960 7721 -467 1174 7879 15788 10979 8583 -3863 3667 11949 14306 20648
23751 20648 6643 -821 -10698 -10888 -4766 -12366 -7104 185 300 -11319 -6163 -7048 -4914 5936
23737 5936 5232 -6540 -4867 1980 -10717 -8379 -6419 6060 3480 -8855 2070 6005 -6650
23724 -6650 -12136 -10746 -8280 -21365 -18623 -9622 12433 36334 45809 31040 11807 -1820 -640
$$ packed form
23822A0007p424j318L396R894L278J2665N165K846o09r518j1548k0158K024L178
23808A878j7457m630M270R277Q129J069q31R191J236K554n568l214o980q234L669
23793e641Q725J0693j6785O358R108j2718L374J0334k438l216j3097m385o230
23780a5918L96K698j757N305r794J119P619M906M113m327p949o823N619R181Q437
23765B825J0375K760q239q188J641O705P909m809k396j2446P530Q282K357O342
23751B0648j4005p464r877j90O122p600N262P289J15j1619N156q85K134J0850
23737E936p04j1772J673O847j2697K338J960J2479k580j2335J0925L935j2655
23724f650n486J390K466j3085K742R001K2055K3901R475j4769j9233j3627J180
$$ plain form
23711 -640 9014 17544 23333 21112 -693 -13183 -18622 -14698 -6388 -3331 5722 3916 -3225 -13296
23697 -13296 3839 9118 5945 -969 -968 2881 7291 4244 -12252 304 8878 9630 7888 9193 -3080
23682 -3080 -12335 -12938 -6272 145 4292 6565 3402 -10306 -17506 -16191 -18910 -15507 2183 12419
23668 12419 17938 5412 -4302 -8280 -8870 -13374 3421 7519 10589 5291 -4900 -15361 -6175 -1471
23654 -1471 -447 14104 5678 1174 -2614 272 18130 18502 1204 -11775 -14904 -11162 -374 13221
23640 13221 19148 10362 -11210 -18599 -22642 -24060 -14371 7586 10672 10560 5615 -5667 -2028 13740
23626 13740 17355 7231 3853 17225 20595 21507 6923 -18959 -30453 -28691 -24360 -22161 -25532
23613 -25532 -19661 -10529 -7229 -2833 -1595 -504 3238 11752 2742 -6043 -11869 4037 21170 15035
$$ packed form
23711f40R654Q530N789k221k1805j2490n439L924Q310L057R053j806p141j0071
23697a3296J7135N279l173o914JL849M410l047j6496J2556Q574P52j742J305j2273
23682c080r255o03O666O417M147K273l163j3708p200J315k719L403J7690J0236
23668A2419N519j2526r714l978n90m504J6795M098L070n298j0191j0461R186M704
23654a471J024J4551q426m504l788K886J7858L72j7298j2979l129L742J0788J3595
23640A3221N927q786k1572p389m043j418R689K1957L086j12m945j1282L639J5768
23626A3740L615j0124l378J3372L370R12j4584k5882j1494J762M331K199l371
23613b5532N871R132L300M396J238J091L742Q514r010q785n826J5906J7133o135
$$ plain form
23599 15035 -6981 -21711 -28549 -11295 9758 24796 27907 13238 7774 8076 5387 2187 -5973
23586 -5973 -2450 10523 26760 29622 15925 16004 16365 14904 20667 20714 14707 9227 12878 19674 2031
23571 2031 -10949 -12729 -3291 -6857 -9789 673 -1344 -25781 -31923 -20560 -14290 -18529 -8880 5476
23557 5476 11473 2243 381 2223 11398 15563 9075 -10802 -16538 -25177 -45221 -47366 -39863 -18355
23543 -18355 -1042 12480 13333 3920 1979 4888 14343 6696 -340 -3905 5191 6191 -370 -8000
23529 -8000 -16051 -16174 -14891 -13556 -6634 1222 -6057 737 11615 14109 5742 -16420 -18159 -7270
23515 -7270 5559 3954 6493 5565 -14724 -12491 -3419 3348 1698 6756 8084 5092 -10125 -11344
23501 -11344 -17408 -16059 -12147 -16229 -22569 -28450 -39839 -31328 -16450 -10705 -1670 2547 15712 18799
$$ packed form
23599A5035k2016j4730o838J7254K1053J5038L111j4669n464L02k689l200q160
23586e973L523J2973J6237K862j3697P9L61j461N763M7o007n480L651O796j7643
23571B031j2980j780R438l566k932J0462k017k4437o142J1363O270m239R649J4356
23557E476N997r230j862J842R175M165o488j9877n736q639k0044k145P503K1508
23543a8355J7313J3522Q53r413j941K909R455p647p036l565R096J000o561p630
23529h000q051j23J283J335O922P856p279O794J0878K494q367k2162j739J0889
23515g270J2829j605K539r28k0289K233R072O767j650N058J328k992j5217j219
23501a1344o064J349L912m082o340n881j1389Q511J4878N745R035M217J3165L087
$$ plain form
23487 18799 18152 10369 6255 3759 1949 -5043 -16418 -14094 -4848 -8900 -14397 -15292 -6714 -3745 -10230
23472 -10230 -3192 5405 -10861 -19139 -14456 -9913 -19108 -22469 -20174 -12554 -18432 -13371 -10269 -10327 -10520
23457 -10520 -7960 -4855 -4800 -10479 -10876 -2597 -5429 -18304 -10151 -16413 -17209 -14620 -7042 -5119 -12013
23442 -12013 -12161 -18440 -14568 -6897 -1078 86 -3313 -10621 -8703 -6947 -7459 -11827 -11856 -414 4417
23427 4417 6227 -3112 -3806 2052 16 -1662 -5981 -6865 -4784 -3422 -2579 -14384 -15476 -8488 -9089
23412 -9089 -2843 8839 15819 15234 12831 14187 14019 26299 16053 7824 1548 2107 13002 12119 7714
23397 7714 6218 10843 8243 14920 8921 3071 4112 -4599 -11043 -4961 -966 -2315 -5090 3097 -1231
23382 -1231 7586 15684 21038 11605 2356 2326 6993 4709 7980 2928 6258 10876 9498 9034 12336
$$ packed form
23487A8799o47p783m114k496j810o992j1375K324R246m052n497q95Q578K969o485
23472a0230P038Q597j6266q278M683M543r195l361K295P620n878N061L102n8j93
23457a0520K560L105N5n679l97Q279k832j2875Q153o262p96K589P578J923o894
23442a2013j48o279L872P671N819J164l399p308J918J756n12m368k9J1442M831
23427D417J810r339o94N858k036j678m319q84K081J362Q43j1805j092O988o01
23412i089O246J1682O980n85k403J356j68J2280j0246q229o276N59J0895q83m405
23397G714j496M625k600O677n999n850J041q711o444O082L995j349k775Q187m328
23382a231Q817Q098N354r433r249l0M667k284L271n052L330M618j378m64L302
$$ plain form
23367 12336 13217 -6783 -8733 -14180 -24428 -13583 -15054 -14357 -8415 -2964 3203 25498 17009 -9165
23353 -9165 9274 21490 8144 10122 3102 -7188 -5789 -7254 -16327 -7739 2967 -5059 -16489
23340 -16489 -15565 157 6634 12515 13086 18693 8853 6149 2262 5492 13233 9852 7300 12026 10209
23325 10209 626 -9894 -6920 -7423 -5887 -266 -923 -13843 -10897 -11918 -7152 -8511 -16521 -10163
23311 -10163 -14046 -11267 -8967 -24719 -24786 -5691 8761 1748 -7153 -7389 -6303 179 9752 11928
23297 11928 15811 9130 6951 5856 12559 -4349 -9301 -6248 -7630 -18467 -15974 -10422 -17978 -18217
23283 -18217 -8203 -4793 -3461 3060 -2569 -6692 2162 -7615 -12997 -10479 -3850 -8435 -1266 12087
23269 12087 10189 9081 20091 19512 13937 -1295 -6417 13151 14170 518 3144 9177 3671 1218
$$ packed form
23367A2336Q81k0000j950n447j0248J0845j471O97N942N451O167K2295q489k6174
23353i165J8439J2216j3346J978p020j0290J399j465r073Q588J0706q026j1430
23340a6489R24J5722O477N881N71N607r840k704l887L230P741l381k552M726j817
23325A0209r583j0520K974n03J536N621o57j2920K946j021M766j359q010O358
23311a0163l883K779K300j5752o7J9095J4452p013q901k36J086O482R573K176
23297A1928L883o681k179j095O703j6908m952L053j382j0837K493N552p556k39
23283a8217J0014L410J332O521n629m123Q854r777n382K518O629m585P169J3353
23269A2087j898j108J1010n79n575j5232n122J9568J019j3652K626O033n506k453
$$ plain form
23255 1218 1219 -3902 -6047 -8090 -6121 1503 4303 3861 7326 -6791 -10330 -7462 -20379 -22056 -16888
23240 -16888 -20203 -23927 -21853 -24470 -5497 8217 7571 7486 12077 10484 2167 1921 12252 4011 -7234
23225 -7234 -2222 -9059 -21332 -15654 -8900 -6850 -14934 -11417 -8184 -4783 -6801 -1978 4399 13519
23211 13519 11208 1658 -7680 -2941 10796 9912 7091 -1609 2431 4820 3924 -5544 -22108 -15783
23197 -15783 3856 -223 -6703 1946 16853 25388 33353 21403 -10744 -29285 -39019 -33520 -32417
23184 -32417 -28212 -29638 -28403 -20115 -999 9368 24120 27471 16667 12410 4039 8714 6524
23171 6524 4420 4110 6591 -3492 78 -2494 -14312 -3424 -9131 -13592 -7257 -295 4301 3724
23157 3724 9376 3530 3799 -4095 317 -3447 -10856 -21277 -22754 -22165 -2638 4830 1079 6423 -3902
$$ packed form
23255A218Jn121k145k043J969P624K800m42L465j4117l539K868j2917j677N168
23240a6888l315l724K074k617J8973J3714o46q5M591j593q317k46J0331q241j1245
23225g234N012o837j2273N678O754K050q084L517L233L401k018M823O377R120
23211A3519k311r550r338M739J3737q84k821q700M040K389q96r468j6564O325
23197a5783J9639m079o480Q649J4907Q535P965j1950l2147j8541r734N499J103
23184c2417M205j426J235Q288J9116J0367J4752L351j0804m257q371M675k190
23171F524k104l10K481j0083L570k572j1818J0888n707m461O335O962M596n77
23157C724N652n846K69p894M412l764p409j0421j477N89J9527P468l751N344j0325
$$ plain form
23142 -3902 -4931 -3438 4660 -1502 -7004 -7118 6082 15384 11664 22159 22659 18115 22360 19368 7789
23127 7789 2864 7119 7870 10377 16398 13037 6846 2821 6144 8280 9881 18131 8806 -2810 -1000
23112 -1000 -10536 -25695 -31061 -21581 -14086 1212 942 -14651 -14965 -17178 -26364 -25247 -9164 -391
23098 -391 14621 11536 -13344 -18554 -18652 -17519 -18018 -8304 1134 4597 -2667 931 -5370 -19044 -27613
23083 -27613 -19420 -1377 -151 6040 -3076 -10299 -12531 371 17469 9163 2812 6708 8611 18314
23069 18314 12737 14575 4509 6902 11016 1382 2892 11778 11821 8204 -4986 -4976 -8022 -5552 -12223
23054 -12223 -23143 -9245 709 9202 7790 5173 12053 923 -5265 1524 7152 -925 -10036 -19063
23040 -19063 -16336 -13653 -16474 -3374 470 6649 10755 17098 14835 8816 -5307 -18100 -12108 3512
$$ packed form
23142c902j029J493Q098o162n502j14J3200R302l720J0495N00m544M245k992j1579
23127G789m925M255P51K507O021l361o191m025L323K136J601Q250r325j1616J810
23112a000r536j5159n366R480P495J5298k70j5593l14k213r186J117J6083Q773
23098c91J5012l085k4880n210r8J133m99R714R438L463p264L598o301j3674q569
23083b7613Q193J8043J226O191r116p223k232J2902J7098q306o351L896J903R703
23069A8314n577J838j0066K393M114r634J510Q886M3l617j3190J0l046K470o671
23054a2223j0920J3898R954Q493j412k617O880j1130o188O789N628q077r111r027
23040a9063K727K683k821J3100L844O179M106O343k263o019j4123j2793N992J5620
$$ plain form
23026 3512 56 -4710 -5628 -9941 -12211 -21280 -21932 -20676 -26814 -12668 -16773 -26318 -21221 -5903 4216
23011 4216 -57 -722 -4933 -23036 -30248 -37931 -26363 -8522 -8065 -4603 -11124 -8055 -10383 -18427
22997 -18427 -20011 -15252 -14794 -4145 6418 2459 -12406 -13555 -9667 -8351 -6059 -19974 -24801 -23575
22983 -23575 -21055 -16614 -17978 -20132 -17399 -1259 14600 15187 11770 -2200 -10483 -12031 -15407 -11233
22969 -11233 -5233 10221 5761 -9852 -14626 -15744 -9627 -5261 -21944 -24019 -20816 -20695 -13296 -13634
22955 -13634 -14565 -10829 -11776 -15406 -14333 -10189 -6699 -8845 2974 12500 11866 -13731 -28110 -23271
22941 -23271 -10706 4074 2750 -3359 -7696 -9873 -4308 -13308 -14985 -17295 -17077 -11853 3256 1163
22927 1163 -2156 -6078 -5681 -1731 4031 -12683 -25247 -21332 -17895 -20330 -19998 -26754 -16418 -4751
$$ packed form
23026C512l456m766r18m313k270r069o52J256o138J4146m105r545N097J5318J0119
23011D216m273o65m211j8103p212p683J1568J7841M57L462o521L069k328q044
22997a8427j584M759M58J0649J0563l959j4865j149L888J316K292j3915m827J226
22983b3575K520M441j364k154K733J6140J5859N87l417j3970q283j548l376M174
22969a1233O000J5454m460j5613m774j118O117M366j6683k075L203J21P399l38
22955a3634r31L736r47l630J073M144L490k146J1819R526o34k5597j4379M839
22941b3271J2565J4780j324o109m337k177N565r000j677k310K18N224J5109k093
22927A163l319l922L97L950N762j6714j2564L915L437k435L32o756J0336J1667
$$ plain form
22913 -4751 1272 11330 17050 19205 19636 10944 8226 1687 -8280 -3368 -3320 -4900 -6130 -4461 -9709
22898 -9709 -4622 7880 11661 5888 -3459 -13755 -10915 3448 9992 11413 4166 10724 9484 -319
22884 -319 -15275 -5978 10718 25360 36692 20611 1462 -854 -8069 -20248 -9851 12193 28349
22871 28349 18020 -1911 -5386 1774 3277 -6434 -7138 -12374 2502 6974 8706 -15695 -26432
22858 -26432 -26379 -28072 -23764 -24460 -10348 15497 10713 -14427 -13603 -15457 -18389 -16776 -25653 -23077 -5192
22843 -5192 -3659 -1113 17228 14599 -8212 -10185 -7574 -974 9872 3855 4929 7648 14017 7204
22829 7204 -5384 -3682 787 -501 -2550 -20031 -30487 -16441 -10257 -7806 -2625 11913 -3802
22816 -3802 -9685 -5905 2500 12234 -9583 -11791 -9067 -11538 -2528 6051 9596 6266 14314 17112
$$ packed form
22913d751O023J0058N720K155M31q692k718o539r967M912M8j580j230J669n248
22898i709N087J2502L781n773r347j0296K840J4363O544J421p247O558j240r803
22884c19j4956R297J6696J4642J1332j6081j9149k316p215j2179J0397K2044J6156
22871B8349j0329j9931l475P160J503r711p04n236J4876M472J732k4401j0737
22858b6432N3j693M308o96J4112K5845m784k5140Q24j854k932J613q877K576J7885
22843e192J533K546J8341k629k2811j973K611O600J0846o017J074K719O369o813
22829G204j2588J702M469j288k049j7481j0456J4046O184K451N181J4538j5715
22816c802n883L780Q405R734k1817k208K724k471R010Q579L545l330Q048K798
$$ plain form
22802 17112 13325 17241 11728 4721 -335 758 613 -2871 -5123 -11172 -16782 -16997 -19926 -28330 -12436
22787 -12436 -8330 170 12886 21192 8714 -4952 -10201 -11275 -2669 12861 16133 11636 8860
22774 8860 8797 4418 18552 20066 25188 22951 8730 5923 488 -8747 -21470 -9114 -13699 -23612
22760 -23612 -26169 -23966 -18788 -20531 -16745 718 -8379 -3796 5514 18237 26227 27259 18475 13629
22746 13629 16208 -1862 -6791 -7601 -5484 -13427 -22175 -28361 -28859 -25854 -13517 -11766 -16452 -12982
22732 -12982 -9051 -12748 1300 11335 820 -10367 -3590 -3501 -14039 -11786 -11038 -13602 -12730 -8501
22718 -8501 -6694 4600 13420 6129 -8081 -9674 -14101 -9181 -15853 -17058 -22007 -22315 -3360 14768
22704 14768 24572 23695 19961 20260 3037 -1199 -3482 10727 2596 8069 9761 -3028 -14705 -12113
$$ packed form
22802A7112l787L916n513p007n056J093j45l484k252o049n610k15k929q404J5894
22787a2436M106Q500J2716Q306j2478j3666n249j074Q606J5530L272m497k776
22774H860o3m379J4134J514N122k237j4221k807n435r235j2723J2356m585r913
22760b3612k557K203N178j743L786J7463r097M583R310J2723P990J032q784m846
22746A3629K579j8070m929q10K117p943q748o186m98L005J2337J751m686L470
22732a2982L931l697J4048J0035j0515j1187O777Q9j0538K253P48k564Q72M229
22718h501J807J1294Q820p291j4210j593m427M920o672j205m949l08J8955J8128
22704A4768R804q77l734K99j7223m236k283J4209q131N473J692j2789j1677K592
$$ plain form
22690 -12113 -18170 -22779 -15119 -2645 -18643 -25833 -17015 -31537 -29789 -6754 -5052 -18954 -18383
22677 -18383 -17693 -19091 -27595 -31523 -17166 -12141 -13888 -7294 13819 5983 -13464 -14167 -7544 -2540
22663 -2540 -8517 -12024 -9609 -7084 -6526 -642 11780 4225 7010 4584 7405 7191 -5839 -10604 -10656
22648 -10656 -18340 -8750 -10087 -5028 410 -2945 -2473 -995 -11058 -7548 -727 -389 -15912 -16564 -28450
22633 -28450 -24223 -16818 -17726 -6244 -13118 -13116 2103 12667 9114 4139 -5120 -10119 -3894 4661 5627
22618 5627 82 496 10138 5972 4100 603 -10559 -18636 -15382 -3793 4675 11357 12197 14198 8463
22603 8463 -1480 -11288 -7653 -2278 12354 28104 20551 5978 -8543 -8358 4973 12604 13145 1844
22589 1844 -10669 -11924 -2875 -4252 -7353 -947 4920 -937 -8718 3843 4683 590 -1199 2685
$$ packed form
22690a2113o057m609P660J2474j5998p190Q818j4522J748K3035J702j3902N71
22677a8383O90j398q504l928J4357N025j747O594K1113p836j9447p03O623N004
22663b540n977l507K415K525N58N884J2422p555K785k426K821k14j3030m765n2
22648a0656p684R590j337N059N438l355M72J478j0063L510O821L38j5523o52j1886
22633b8450M227P405r08J1482o874KJ5219J0564l553m975r259m999O225Q555R66
22618E627n545M14R642m166j872l497j1162q077L254J1589Q468O682Q40K001n735
22603H463r943r808L635N375J4632J5750p553j4573j4521J85J3331P631N41j1301
22589A844j2513j255R049j377l101O406N867n857p781J2561Q40m093j789L884
$$ plain form
22575 2685 8087 14726 20067 7906 1877 -3390 -6448 -1379 -12105 -15293 -11952 -20350 -23156 -21901
22561 -21901 -13479 -2459 -1834 4754 9366 4136 802 4679 -4315 -139 10168 5955 -5389 -1890
22547 -1890 -1797 -2812 4283 14058 11526 6799 14810 19791 12773 6210 -318 -8712 -14444 -7703 4218
22532 4218 6252 4437 11835 15153 50 1530 6959 -2047 2756 -853 1403 15528 19092 16777
22518 16777 22706 27867 18630 -16 -5740 6184 8488 6087 -4891 -3756 -9594 -7399 -6134 -9767
22504 -9767 -15646 -17291 -4044 799 -8368 -10527 -15897 -17433 -7886 -8282 -9364 -13412 -9748 -7369 -13720
22489 -13720 -15886 -1672 -2448 -2419 2198 320 -5181 -2811 11690 4067 -3424 7745 18356 23461
22475 23461 10459 496 -4558 -15277 -22651 -14198 -20012 -26794 -22996 -7083 5276 9681 -6082
$$ packed form
22575B685N402O639N341j2161o029n267l058N069j0726l188L341q398k806J255
22561b1901Q422J1020O25O588M612n230l334L877q994M176J0307m213j1344L499
22547a890R3j015P095R775k532m727Q011M981p018o563o528q394n732O741J1921
22532D218K034j815P398L318j5103J480N429r006M803l609K256J4125L564k315
22518A6777N929N161r237j8646n724J1924K304k401j0978J135n838K195J265l633
22504i767n879j645J3247M843r167k159n370j536R547l96j082m048L664K379o351
22489a3720k166J4214p76K9M617j878n501K370J4501p623p491J1169J0611N105
22475B3461j3002r963n054j0719p374Q453n814o782L798J5913J2359M405j5763
$$ plain form
22462 -6082 -13082 -18098 -19926 -8720 -11723 -13860 -20838 -7305 -4982 -15901 -26582 -17129 -10282 -2438
22448 -2438 9598 3548 6000 5135 8785 5511 3539 6509 5847 -1606 -9 1246 9811 520 -25235
22433 -25235 -31812 -25048 -14933 -15242 -20105 -3492 9148 4343 -643 8116 11430 19786 36238 24871
22419 24871 6824 5659 21007 21162 1471 -2638 4300 -2655 -10188 -8526 -10993 -13876 -1602 10041
22405 10041 6126 14304 8984 -7 -5242 -6969 86 -1845 -4407 -4064 896 4081 -872 -5492 -4527
22390 -4527 -3081 -7658 4013 8327 11832 -3392 -3618 4051 727 -1211 -9983 -18287 -2052 11551
22376 11551 9821 9194 6632 3333 -1323 -12677 -3199 7858 13157 13564 7581 -3309 -6686 1172
22362 1172 4890 -13030 -19358 -30036 -43241 -38433 -30085 -10679 -5385 -911 1322 1870 1057 -2957
$$ packed form
22462f082p000n016j828J1206l003k137o978J3533K323j0919j0681R453O847P844
22448b438J2036o050K452q65L650l274j972K970o62p453J597J255Q565r291k5755
22433b5235o577O764J0115l09m863J6613J2640m805m986Q759L314Q356J6452j1367
22419B4871j8047j165J5348J55j9691m109O938o955p533J662k467k883J2274J1643
22405A0041l915Q178n320q991n235j727P055j931k562L43M960L185m953m620R65
22390d527J446m577J1671M314L505j5224k26P669l324j938q772q304J6235J3603
22376A1551j730o27k562l299m656j1354R478J1057N299M07n983j0890l377P858
22362A172L718j7920o328j0678j3205M808Q348J9406N294M474K233N48q13m014
$$ plain form
22348 -2957 -8732 -10299 -7995 -7475 -2161 -7222 -10451 -6117 -3965 -5283 -2833 -1460 6037 3292 3766
22333 3766 12236 20827 6234 -1510 7675 7888 14138 19836 7334 8914 16660 17742 14170 7205
22319 7205 9352 11325 -2858 -8109 -8423 -7082 62 3724 -604 -12597 -20 -312 -23817 -23796 -19692
22304 -19692 -16923 -9687 -1606 3039 -4609 -1760 3059 -444 467 -1450 -15155 -13756 -11946 -2861
22290 -2861 8556 2730 -1529 2219 -196 2988 12497 16586 14760 10044 -1689 -4658 -1823 10721
22276 10721 2210 -5150 9566 21811 14065 7752 16035 16496 5154 8856 6320 -344 5208 11110
22262 11110 10687 -669 -11786 -17888 -13324 2288 5368 4314 7017 13183 17742 17728 14626 12288
22248 12288 437 -7782 -6669 -5170 -10448 -2837 15685 22904 18503 7344 -5670 -3521 9020
$$ packed form
22348b957n775j567K304N20N314n061l229M334K152j318K450J373P497k745M74
22333C766Q470Q591j4593p744R185K13O250N698j2502J580P746J082l572o965
22319G205K147J973j4183n251l14J341P144L662m328j1993J2577k92k3505K1M104
22304a9692K769P236Q081M645p648K849M819l503R11j917j3705J399J810R085
22290b861J1417n826m259L748k415L184R509M089j826m716j1733k969K835J2544
22276A0721q511p360J4716J2245p746o313Q283M61j1342L702k536o664N552N902
22262A1110m23j1356j1117o102M564J5612L080j054K703O166M559j4l102k338
22248A2288j1851q219J113J499n278P611J8522P219m401j1159j3014K149J2541
$$ plain form
22235 9020 1438 2813 -500 -22040 -38382 -34930 -9545 -4095 -14406 -24968 -25947 -21792 -29027 -28453
22221 -28453 -29988 -28288 -18142 -22960 -25685 -14844 -9595 -13083 2189 11413 6976 -9274 -23771
22208 -23771 -36188 -29533 -3078 -1574 -1773 -1562 10101 6212 -1576 -5910 1148 6116 -4807 -7966
22194 -7966 -12753 -11123 -21478 -12367 -10872 -14533 -19064 -30257 -24108 -12412 1955 4703 -660 -14438
22180 -14438 -13524 -13328 -20005 -17527 -22913 -19224 -14879 -12449 -8833 -4963 -9011 -15573 -9107 1192 5015
22165 5015 -5023 -3268 -8085 -9101 -10317 -14005 -5684 6695 5721 11248 1183 376 5049 12983
22151 12983 11188 10986 -2592 -1781 5601 5400 -1451 -13123 -12665 -1957 -10385 -749 9589 17811
22137 17811 28430 27087 26015 5604 -935 -2296 3981 -267 -8766 3636 8382 8014 5685 9361
$$ packed form
22235I020p582J375l313k1540j6342L452K5385N450j0311j0562r79M155p235N74
22221b8453j535J700J0146m818k725J0841N249l488J5272R224m437j6250j4497
22208b3771j2417O655K6455J504j99K11J1663l889p788m334P058M968j0923l159
22194g966m787J630j0355R111J495l661m531j1193O149J1696J4367K748n363j3778
22180a4438R14J96o677K478n386L689M345K430L616L870m048o562O466J0299L823
22165E015j0038J755m817j016j216l688Q321J2379r74N527j0065q07M673P934
22151A2983j795k02j3578Q11P382k01o851j1672M58J0708q428R636J0338Q222
22137A7811J0619j343j072k0411o539j361O277m248q499J2402M746l68k329L676
$$ plain form
22123 9361 2298 -3476 1975 2665 -6944 -25126 -36228 -19425 -776 10721 10295 3224 -2219 -2640
22109 -2640 251 411 -9246 -15664 -6407 10660 14495 -1167 -17610 -12283 -12249 -4163 -1830 -10273 -11641
22094 -11641 -2736 6500 15123 14271 9351 8241 2545 -5262 -4540 -13759 -13141 -5589 -175 7752 12658
22079 12658 -7790 -14719 -8337 5227 11494 8850 6120 -15115 -25980 -10662 877 2170 399
22066 399 -8427 -10665 1407 10748 16550 24288 31925 24626 26482 16982 2843 -10973 -3821 -7074
22052 -7074 -4763 -7929 -16028 -18112 -8945 4570 14771 2738 484 -1566 9246 23332 6241
22039 6241 -12639 -6637 -2008 -10542 -19560 -32918 -28758 -15229 -7846 2005 13338 11264 6148 17892
22025 17892 21908 23460 3393 962 630 -6959 -9948 -4781 -9663 -516 4891 5998 -1948 5318
$$ packed form
22123I361p063n774N451O90r609j8182j1102J6803J8649J1497m26p071n443m21
22109b640K891J60r657o418R257J7067L835j5662j6443N327L4Q086K333q443j368
22094a1641Q905R236Q623q52m920j110n696p807P22r219O18P552N414P927M906
22079A2658k0448o929O382J3564O267k644k730k1235j0865J5318J1539J293j771
22066C99q826k238J2072R341N802P738P637p299J856r500j4139j3816P152l253
22052g074K311l166q099k084R167J3515J0201j2033k254k050J0812J4086j7091
22039F241j8880O002M629q534r018j3358M160J3529P383R851J1333k074n116J1744
22025A7892M016J552k0067k431l32p589k989N167m882R147N407J107p946P266
$$ plain form
22011 5318 10471 5784 -5348 -9143 -13560 -23473 -27660 -20736 -27808 -23915 -15932 -9780 -12062 -21288
21997 -21288 -17762 -15821 -17807 -31646 -23719 -4151 -1774 -7758 -4042 -5877 -7885 -17355 -25160 -26052
21983 -26052 -36555 -17431 -8522 -6840 -6431 -3318 271 -1823 6099 11914 7204 5586 3621 58
21969 58 8680 12300 12656 11190 19788 9364 1433 1688 -6093 -4269 4220 9414 11559 5491 6710
21954 6710 9637 7557 -2704 -740 -7343 -18876 -15716 -14202 -12735 -21607 -22737 -19407 -16474 -22132
21940 -22132 -25878 -21522 -6095 4902 11434 9358 8680 6050 -12419 -3814 4455 2092 -470 3805
21926 3805 4170 -5854 314 4153 3918 -4697 -3579 2778 15712 17821 7867 6896 3507 10441 26090
21911 26090 27156 15625 25367 19309 17628 23614 16531 -563 -12031 -4576 -5144 -10689 -4877 6441
$$ packed form
22011E318N153m687j1132l795m417r913m187O924p072L893P983O152k282r226
21997b1288L526J941j986j3839P927J9568K377n984L716j835k008r470p805q92
21983b6052j0503J9124Q909J682M09L113L589k094P922N815m710j618j965l563
21969E8Q622L620L56j466Q598j0424p931K55p781J824Q489N194K145o068J219
21954F710K927k080j0261J964o603j1533L160J514J467q872j130L330K933n658
21940b2132l746M356J5427J0997O532k076o78k630j8469Q605Q269k363k562M275
21926C805L65j0024O168L839k35q615J118O357J2934K109r954r71l389O934J5649
21911B6090J066j1531R742o058j681N986p083j7094j1468P455n68n545N812J1318
$$ plain form
21897 6441 11881 9064 -76 -10904 -1208 -8246 -29 5119 -1258 6896 14968 4438 82 5170
21883 5170 -5085 -7437 -8709 -9796 -12569 -3158 -8676 -10612 -5211 -7765 -8502 -4173 -8621 -15523 -18525
21868 -18525 -21277 -23488 -22528 -16100 -15766 -12982 -6875 3132 5161 8509 12992 10296 2345 -1653 -5478
21853 -5478 -4266 -9047 -4298 -4183 -6850 -7346 -5262 7556 6385 4590 6033 -8599 -17453 -26520 -22889
21838 -22889 -9496 -11509 -19654 -21671 -16495 -18111 -12339 -7137 -6647 -8874 7886 6539 3380 -14189
21824 -14189 -15922 -5793 4804 10251 827 -13169 -15891 -7880 121 -8311 -12897 -17804 -3619
21811 -3619 -4379 -6180 -1692 15720 11984 2358 -4366 -11892 -5637 -6512 -13602 -10883 18087 21002 18833
21796 18833 17641 11169 15340 4666 1104 -10555 -17357 -10154 -834 13185 16390 -1619 -6085
$$ packed form
21897F441N440k817r140j0828R696p038Q217N148o377Q154Q072j0530m356N088
21883E170j0255k352j272j087k773R411n518j936N401k554p37M329m448o902l002
21868a8525k752k211R60O428L34K784O107J0007K029L348M483k696p951l998l825
21853e478J212m781M749J15k667m96K084J2818j171j795J443j4632q854r067L631
21838b2889J3393k013q145k017N176j616N772N202M90k227J6760j347l159j7569
21824a4189j733J0129J0597N447r424j3996k722Q011Q001q432m586m907J4185
21811c619p60j801M488J7412l736r626o724p526O255q75p090K719K8970K915k169
21796A8833j192o472M171j0674l562j1659o802P203R320J4019L205j8009m466
$$ plain form
21783 -6085 -10999 -14306 -8944 -458 -580 -4020 3233 4542 2304 1687 -3811 -3251 -1297 1102 9927
21768 9927 11634 10525 10549 7359 17682 12961 18134 12968 5492 -9497 -6962 -17893 -20291 -18174
21754 -18174 -25963 -29855 -13506 -8173 -6279 1337 -4871 -15562 -4826 6958 3066 -6193 3962
21741 3962 8215 1747 -17619 -18561 -5252 3630 3173 -540 -3211 6557 4930 -5750 -680 7079
21727 7079 -4027 -9936 -17499 -21995 -17292 -15186 -13284 -15910 -8739 -904 -3721 -13363 -1696 7491
21713 7491 -1759 -5610 -23225 -16558 -7571 -2135 107 7004 5479 2626 -3585 -7893 -1606 7508
21699 7508 16911 10184 -2248 -6983 9870 16897 8123 204 10024 -2873 28 7856 1485 3262
21685 3262 637 15871 24728 15971 5198 7669 14002 10481 6294 -2320 -7643 -160 11192 10257
$$ packed form
21783f085m914l307N362Q486j22l440P253J309k238o17n498N60J954K399Q825
21768I927J707j109K4l190J0323m721N173n166p476j4989K535j0931k398K117
21754a8174p789l892J6349N333J894P616o208j0691J0736J1784l892r259J0155
21741C962M253o468j9366r42J3309Q882m57l713k671R768j627j0680N070P759
21727G079j1106n909p563m496M703K106J902k626P171P835k817r642J1667R187
21713G491r250l851j7615O667Q987N436K242O897j525k853o211m308O287R114
21699G508R403o727j2432m735J6853P027q774p919R820j2897K901P828o371J777
21685C262k625J5234Q857q757j0773K471O333l521m187q614n323P483J1352r35
$$ plain form
21671 10257 6312 13128 12017 13132 15236 1877 3422 8566 17374 16016 9848 3677 6756 16540
21657 16540 19110 16157 17904 8680 9632 11475 3076 -12583 -26218 -39376 -30201 -22709 -7383 812
21643 812 7853 9764 -449 -9400 -16484 -12042 -6205 -9344 -3744 -6444 -6521 7920 10014 14466 4854
21628 4854 -13976 -13198 -1195 13757 19248 23149 13296 6078 2341 -5857 -25544 -18391 3302 216
21614 216 3704 3561 12947 750 3617 -8257 -9983 -6386 -8966 -1761 905 6402 4855 -4156 1607
21599 1607 2079 -1769 7486 7059 3816 7002 -5231 -7531 -776 10910 13559 690 -8898 -1380
21585 -1380 -765 -2627 4861 13343 27711 27634 23664 3599 -20966 -15402 -2238 -891 -8397 -9771
21571 -9771 -10175 -9263 -5922 -4238 9363 17587 24587 25264 6938 -12884 -5384 -11453 -12406 -1340 2304
$$ packed form
21671A0257l945O816j111J115K104j3359J545N144Q808j358o168o171L079R784
21657A6540K570k953J747r224R52J843q399j5659j3635j3158R175P492J5326Q195
21643H12P041J911j0213q951p084M442N837l139N600k700p7J4441K094M452r612
21628D854j8830P78J2003J4952N491L901r853p218l737q198j9687P153K1693l086
21614B16L488j43R386j2197K867j1874j726L597k580P205K666N497j547r011N763
21599A607M72l848R255m27l243L186j2233k300O755J1686K649j2869r588P518
21585a380O15j862P488Q482J4368p7l970k0065k4565N564J3164J347p506j374
21571i771m04R12L341J684J3601Q224P000O77j8326j9822P500o069r53J1066L644
$$ plain form
21556 2304 9132 7934 13542 20359 12246 8352 25927 28559 13278 821 12798 14436 14926 28959
21542 28959 23344 6664 12599 11581 20506 15627 5383 -3571 -1408 2050 -15743 -25826 -20347
21529 -20347 -2420 -7558 -6366 -17556 -9031 -6877 4650 10295 -3818 -6551 14399 12408 -1581
21516 -1581 1363 -3325 -15247 -18939 -17649 -10698 -5136 -10976 -1533 3054 6589 11147 -1274 -7516
21502 -7516 -12020 -15669 -16400 -10829 5654 10628 11084 -738 -6909 -6614 362 -3544 -10360 -13887 -25312
21487 -25312 -27606 -17799 -12364 -7705 6307 10610 3251 -7308 3875 -5754 -11316 -10872 -16828 -4404
21473 -4404 12800 14941 15173 19783 10406 -671 78 9420 6508 -3548 -3387 -6720 -11505 -1529 1715
21458 1715 -357 -12524 -4490 9593 3270 -8490 -8666 -783 -12093 -5077 4147 -2818 -7822 -6156
$$ packed form
21556B304O828j198N608O817q113l894J7575K632j5281j2457J1977J638M90J4033
21542B8959n615j6680N935j018Q925m879j0244q954K163L458j7793j0083N479
21529b0347J7927n138J192j1190Q525K154J1527N645j4113k733K0950j991j3989
21516a581K944m688j1922l692J290O951N562n840R443M587L535M558j2421o242
21502g516m504l649p31N571J6483M974M56j1822o171K95O976l906o816l527j1425
21487b5312k294R807N435M659J4012M303p359j0559J1183r629n562M44n956J2424
21473d404J7204K141K32M610r377j1077P49R342k912j0056J61l333m785R976L244
21458A715k072j2167Q034J4083o323j1760j76P883j1310P016R224o965n004J666
$$ plain form
21444 -6156 -360 -4791 -19905 -15466 -1585 6984 -2883 -11147 -8993 -3855 -928 -4920 -6421 -9132
21430 -9132 -5815 -2423 -5782 -16517 -17852 -21431 -24904 -18812 -4974 602 6441 1584 8100 -3682
21416 -3682 -8803 -2752 -5969 -1116 -4024 -19737 -16894 -19946 -16818 -11127 -16465 -19343 -27099 -22346
21402 -22346 -11212 -13612 -8568 -6338 -1488 6591 10759 12567 8804 4673 9495 2467 1362 4598
21388 4598 -733 -7871 -14268 -18919 -20056 -6967 -9053 10355 16813 22356 15003 9356 8522 -4338
21374 -4338 -580 -7004 -15303 -4865 10115 -1184 -3262 -4999 -11733 -18262 -20360 1578 7646 470
21360 470 2981 6052 6518 2675 12019 27891 23124 16460 15111 2633 -4853 -18572 -14619 -16967
21346 -16967 -10367 1205 19424 13850 12834 9191 2357 5489 15899 21065 36661 17067 18304
$$ packed form
21444f156N796m431j5114M439J3881Q569r867q264K154N138K927l992j501k711
21430i132L317L392l359j0735j335l579l473O092J3838N576N839m857O516j1782
21416c682n121O051l217M853k908j5713K843l052L128N691n338k878p756M753
21402b2346J1134k400N044K230M850Q079M168J808l763m131M822p028j105L236
21388D598n331p138o397m651j137J3089k086J9408O458N543p353n647q34j2860
21374d338L758o424q299J0438J4980j1299k078j737o734o529k098K1938O068p176
21360D70K511L071M66l843R344J5872m767o664j349j2478p486j3719L953k348
21346a6967O600J1572J8219n574j016l643o834L132J0410N166J5596j9594J237
$$ plain form
21333 18304 21798 4947 -12152 -7599 -600 -2349 -7662 1689 7985 21078 25564 19025 16323 10401
21319 10401 2471 -4320 -4007 -7608 -13702 -6689 -8452 8979 13915 15336 11888 1591 7542 7790
21305 7790 7934 8347 4292 -4606 -1802 -7235 -17417 -34592 -41348 -29835 -21402 -11100 -12768 -18515
21291 -18515 -18767 -16474 -7618 -327 921 7666 9104 5239 -11639 -25008 -35127 -21668 -9272
21278 -9272 -9419 -11592 -9440 -15264 -23806 -16016 -11643 -15516 -14775 -16812 -22107 -14435 -8292 4621 -2682
21263 -2682 -3387 -3916 -5369 56 6840 13199 17785 7481 -10250 -10949 -7673 -2049 -15805 -26424
21249 -26424 -17550 -12653 -15716 -18795 -14047 3632 16970 3747 132 -7722 -3402 -2666 465 6526
21235 6526 4154 -13613 -17280 1671 -1192 -3190 -4856 -4723 -3973 -8942 -755 -4648 302 -6164 -16344
$$ packed form
21333A8304L494j6851j7099M553O999j749n313R351O296J3093M486o539k702n922
21319A0401p930o791L13l601o094P013j763J7431M936J421l448j0297N951K48
21305G790J44M13m055q898K804n433j0182j7175o756J1513Q433J0302j668n747
21291a8515k52K293Q856P291J248O745J438l865j6878j3369j0119J3459J2396
21278i272j47k173K152n824q542P790M373l873P41k037n295P672O143J2913p303
21263b682p05n29j453N425O784O359M586j0304j7731o99L276N624j3756j0619
21249b6424Q874M897l063l079M748J7679J3338j3223l615p854M320P36L131O061
21235F526k372j7767l667J8951k863j998j666J33P50m969Q187l893M950o466j0180
$$ plain form
21220 -16344 -26245 -23247 -18567 -12305 -14078 -13554 -20378 -24296 -15894 -11020 -8188 -5931 -2188 -11641 -20350
21205 -20350 -2325 17006 17734 12767 -11689 -16741 -9244 -7284 -16307 -26427 -20814 -15710 -11215 -11645
21191 -11645 -3963 -6493 -10715 -16424 -5283 133 4801 7305 9806 21088 13603 19441 10208 -5491
21177 -5491 -6421 -12533 -5237 6090 -2642 9576 13714 10161 8294 -4254 -842 8701 9649 16131
21163 16131 5197 -5232 -12223 -12590 -12749 1681 3972 -3263 3808 -807 -14883 -7980 3518 2272
21149 2272 -56 4827 12242 9377 11845 8930 -7558 -5416 13358 19178 4607 5542 17617 13814
21135 13814 3469 2797 17856 29377 26451 19342 8167 2631 8610 6425 -986 7830 3311 -3333
21121 -3333 7456 8100 -2255 -2274 1891 4353 14817 17263 16809 10968 9528 10715 -3211 5401 19083
$$ packed form
21220a6344r901K998M680O262j773N24o824l918Q402M874K832K257L743r453q709
21205b0350J8025J9331P28m967k4456n052P497J960r023j0120N613N104M495m30
21191a1645P682k530m222n709J1141N416M668K504K501J1282p485N838r233j5699
21177e491r30o112P296J1327q732J2218M138l553j867j2548L412R543R48O482
21163A6131j0934j0429o991l67j59J4430K291p235P071m615j4076O903J1498j246
21149B272k328M883P415k865K468k915j6488K142J8774N820j4571R35J2075l803
21135A3814j0345o72J5059J1521k926p109j1175n536N979k185p411Q816m519o644
21121c333J0789O44j0355j9M165K462J0464K446m54n841j440J187j3926Q612J3682
$$ plain form
21106 19083 3148 1163 3553 -9122 -24867 -30473 -29370 -20221 -12967 -13344 -19379 -18890 -31484 -27061
21092 -27061 -21049 -16226 -7627 4803 2051 -2453 -2769 1084 15670 18588 14514 7149 4576 -7823
21078 -7823 -16698 -8933 -2434 -1754 -3129 -5492 -26162 -34185 -22492 -24710 -21817 -5647 1018 13651
21064 13651 7496 -20873 -31190 -18999 -7573 -1803 -2546 -3244 1831 720 -9716 -7170 -15990 -19467
21050 -19467 -22910 -14972 1591 -1365 -3683 3784 -643 -563 5998 6287 2776 -463 9880 11036 6800
21035 6800 11300 17906 5828 195 -5242 -16246 -26462 -20383 -7736 -5984 -5903 -390 4871 10418
21021 10418 9142 11063 4992 1825 5872 12397 5725 -9115 -13064 3652 11931 2101 -12424 -23349
21007 -23349 -22539 -15498 -2582 -5807 -15726 -11323 -1557 2577 4799 -7 6724 15411 3528 -15764
$$ packed form
21106A9083j5935j985K390j2675j5745n606J103R149P254l77o035M89j2594M423
21092b7061O012M823Q599J2430k752m504l16L853J4586K918m074p365k573j2399
21078g823q875P765O499O80j375k363k0670q023J1693k218K893J6170O665J2633
21064A3651o155k8369j0317J2191J1426N770p43o98N075j111j0436K546q820l477
21050a9467l443P938J6563k956k318P467m427Q0O561K89l511l239J0343J156m236
21035F800M500O606j2078n633n437j1004j0216O079J2647J752Q1N513N261N547
21021A0418j276J921o071l167M047O525o672j4840l949J6716Q279r830j4525j0925
21007b3349Q10P041J2916l225r919M403R766M134K222m806O731Q687j1883j9292
$$ plain form
20993 -15764 -34378 -30751 -12982 -10050 -14197 -13746 -27782 -16251 -9211 -7210 -349 -2317 -3767 12649
20979 12649 25405 13869 14063 19372 11448 5299 17587 19974 10449 -4135 -12805 -26162 -21903
20966 -21903 -2382 -2391 4092 -7092 -635 14989 14621 13876 6229 -5954 1442 8336 11403 4953 -3735
20951 -3735 612 -10508 -17119 -9310 3518 11002 1218 -7967 -3343 -2152 -13583 -16585 -12401 -7142
20937 -7142 -4454 -6571 -6503 -9686 -11649 1936 3303 -1787 7122 21493 17375 8510 3548 7620 8774
20922 8774 4552 22502 48315 38240 12892 -2972 -166 6155 1706 3853 -4377 -8581 -12780
20909 -12780 -21327 -11768 -14000 -12236 -3618 1118 4572 -840 -4696 -7225 -16301 -13423 -516 -210
20895 -210 -9439 -5232 -9141 -455 13436 10728 17062 22258 3504 -16951 591 11869 9001 7303
$$ packed form
20993a5764j8614L627J7769K932m147M51j4036J1531P040K001O861j968j450J6416
20979A2649J2756j1536J94N309p924o149J2288K387r525j4584q670j3357M259
20966b1903J9521rO483j1184O457J5624l68p45p647j2183P396O894L067o450q688
20951c735M347j1120o611P809J2828P484r784r185M624J191j1431l002M184N259
20937g142K688k117O8l183j963J3585J367n090Q909J4371m118q865m962M072J154
20922H774m222J7950K5813j0075k5348j5864K806O321m449K147q230m204m199
20909a2780q547R559k232J764Q618M736L454n412l856k529r076K878J2907L06
20895b10r229M207l909Q686J3891k708O334N196j8754k0455J7542J1278k868j698
$$ plain form
20881 7303 6316 -2563 -9966 -3128 9441 10179 9533 -7162 -14803 -8546 -1114 6422 7681 14379 21430
20866 21430 20198 12372 4627 7293 4605 -314 77 3677 4706 -8878 -13579 -14998 -22672 -29035
20852 -29035 -3917 16707 8038 1055 1197 4113 7340 -5169 -623 8349 15493 13296 25704 22431
20838 22431 7116 14147 245 -11315 -11540 -1765 -6228 -15129 -15426 -12067 -2644 2085 776 -4161
20824 -4161 1405 -9408 -11192 -16210 -27830 -18013 -14103 -4708 6334 2979 -7132 -1281 -2187 -5705
20810 -5705 10447 15174 5034 1952 9640 14721 13765 4877 8457 15333 11291 -1068 -5900 -13726
20796 -13726 -22317 -23180 -26974 -20466 -17021 -12092 967 -1866 5570 5271 2260 -2685 -6024 2278 -3040
20781 -3040 -9184 -9086 -15413 -15123 -15739 -10056 -4853 -12322 -4749 10667 14631 28572 22431 18762 15591
$$ packed form
20881G303r87q879p403O838J2569P38o46j6695p641O257P432P536J259O698P051
20866B1430j232p826p745K666k688m919L91L600J029j3584m701j419p674o363
20852b9035K5118K0624q669o983J42K916L227j2509M546Q972P144k197J2408l273
20838B2431j5315P031j3902j1560k25R775m463q901k97L359R423M729j309m937
20824d161N566j0813j784n018j1620R817L910R395J1042l355j0111N851r06l518
20810e705J6152M727j0140l082P688N081r56q888L580O876m042j2359m832p826
20796a3726q591q63l794O508L445M929J3059k833P436k99l011m945l339Q302n318
20781c040o144R8o327K90o16N683N203p469P573J5416L964J3941o141l669l171
$$ plain form
20766 15591 10491 -4307 -14756 -25162 -22159 -14968 -18149 -6049 7247 3301 2879 8899 7662
20753 7662 7182 10582 6820 9665 -2348 -9900 -9702 -11787 -5455 13107 -3887 -12567 2607 12256
20739 12256 7992 7484 10835 12842 4753 3887 20895 29148 36195 28867 16242 8255 4456 15681
20725 15681 11983 -11107 -17016 -15828 -13425 1784 16878 18986 21105 17107 21652 9251 -9072
20712 -9072 -4907 -1682 -10165 -25303 -27824 -14718 -2751 -7136 -11395 1032 12982 9878 -2680
20699 -2680 -19129 -26518 -12840 -11985 -2713 -12010 -11504 -14148 -3048 -2546 -624 -2615 -725 -6836 -5579
20684 -5579 -3283 -5152 -5087 -7214 -9654 417 3611 5184 -39 -10588 -19051 -18872 -8908 -2473 -10278
20669 -10278 -9990 -1249 -4160 -2282 4125 -6264 -7046 1236 3216 2520 5714 -281 -12841 -9573 -9723
$$ packed form
20766A5591n100j4798j0449j0406L003P191l181J2100J3296l946m22O020j237
20753G662m80L400l762K845j2013p552J98k085O332J8562j6994q680J5174R649
20739A2256m264n08L351K007q089q66J7008Q253P047p328j2625p987l799J1225
20725A5681l698k3090n909J188K403J5209J5094K108K119l998M545j2401j8323
20712i072M165L225q483j5138k521J3106J1967m385m259J2427J1950l104j2558
20699b680j6449p389J3678Q55R272r297N06k644J1100N02J922j991J890o111J257
20684e579K296j869O5k127k440J0071L194J573n223j0549q463J79R964O435p805
20669a0278K88Q741k911J878O407j0389p82Q282J980o96L194n995j2560L268j50
$$ plain form
20654 -9723 -4077 -9660 -9239 -5450 1969 -9008 -21715 -23075 2373 23945 21053 16992 11224 -2002
20640 -2002 -2092 -260 -3744 453 -2448 -782 -1887 4138 -369 -5123 -9973 -10933 -4424 -5940 275
20625 275 278 4723 2845 1090 9892 5173 -11256 -16414 -11871 -2342 -3610 -10166 -13046 -15858 -12522
20610 -12522 -8688 3779 4095 -15969 -25046 -19611 -24366 -19700 1672 16237 8152 -16449 -19849
20597 -19849 -3905 13094 8039 10402 5091 -4544 3162 6070 7030 11595 26414 27254 20428 17748
20583 17748 18787 16680 21942 8179 771 -3257 -12290 -10013 -8246 2679 12646 6068 10955 14312
20569 14312 9658 15140 12414 7172 4912 -12068 -22264 -13912 -8896 -12621 -4656 5041 -7383 -11646
20555 -11646 -5145 -9454 -21444 -18504 -13250 -23247 -21036 -1186 -5439 -7763 963 -4549 -21601 -25188
$$ packed form
20654i723N646n583M21L789P419j0977j2707j360K5448K1572k892m061n768j3226
20640b002r0J832l484M197k901J666j105O025m507m754m850r60O509j516O215
20625B75LM445j878j755Q802m719j6429n158M543R529j268o556k880k812L336
20610a2522L834J2467L16k0064r077N435m755M666K1372J4565q085k4601l400
20597a9849J5944J6999n055K363n311r635P706K908R60M565J4819Q40o826k680
20583A7748J039k107N262j3763p408m028r033K277J767J0925R967o578M887L357
20569A4312m654N482k726n242k260j6980j0196Q352N016l725P965R697j2424m263
20555a1646O501m309j1990K940N254r997K211J9850m253k324Q726n512j7052l587
$$ plain form
20541 -25188 -22413 -15301 -13716 -15424 2984 3103 -3813 -14875 -15227 -15275 -2907 -8320 -9544 -3100 5193
20526 5193 4150 13385 6801 -4555 -4768 3496 -2696 -7263 -479 8209 5800 -8286 -14398 -8887
20512 -8887 2405 -7910 -2060 -8631 -18707 -8335 -9514 -11824 -19763 2675 10988 -9048 -640
20499 -640 8831 12354 245 3914 10629 10019 2004 1190 10523 10612 9582 4245 -5108 -11951 -19379 -20940
20483 -20940 -25795 -28865 -20163 -5481 2476 6924 3826 10335 17604 3797 -13021 -24002 -22841
20470 -22841 -13750 -16295 -16610 -8741 -12853 -7628 8665 18655 26157 27211 17063 16416 8622 -1399
20456 -1399 -4128 -10653 -24645 -27683 -41220 -35093 -20718 -5823 2430 12905 15391 17628 20641
20443 20641 26331 25870 21175 10351 9642 -6034 -16994 -17969 -16608 -5670 -12579 -19307 -14219 11540
$$ packed form
20541b5188K775P112J585j708J8408J19o916j1062l52m8J2368n413j224O444Q293
20526E193j043R235o584j1356k13Q264o192m567O784Q688k409j4086o112N511
20512h887J1292j0315N850o571j0076J0372j179k310p939K2438Q313k0036Q408
20499f40R471L523j2109L669O715o10q015q14R333Q9j030n337r353o843p428j561
20483b0940m855l070Q702J4682P957M448l098O509P269j3807j6818j0981J161
20470b2841R091k545l15P869m112N225J6293R990P502J054j0148o47p794j0021
20456a399k729o525j3992l038j3537O127J4375J4895Q253J0475K486K237L013
20443B0641N690m61m695j0824p09j5676j0960r75J361J0938o909o728N088K5759
$$ plain form
20429 11540 28256 26569 17403 8504 -464 -604 12373 -2648 -14926 -16485 -13029 -19023 -19712 -12300
20415 -12300 -9610 -12308 -13732 -15824 -18795 -14767 -3813 5721 7747 -8903 -10746 -6965 -2818 16400
20401 16400 12205 7794 10682 10704 10988 5244 489 -9634 -8738 -5556 -15724 -12944 -16004 -12511 -9215
20386 -9215 -3064 2731 1011 -943 -17913 -24552 -14059 4915 10170 -323 27 7042 9264 11646
20372 11646 15518 6454 -8787 -18898 -5150 -2607 -8143 106 -2589 1266 -3008 -2892 -13356 -15155
20358 -15155 -3790 5465 6611 2273 10124 6826 13484 14645 3769 12952 11942 138 -6021 -6457
20344 -6457 -4873 -360 -1197 -4071 8874 5247 -2297 -7593 -363 -5165 -2424 6046 11034 16276 -1612
20329 -1612 -2145 14582 16279 12755 7842 5890 12123 19363 20752 28265 29732 14589 7527 9520
$$ packed form
20429A1540J6716j687r166q899q968j40J2977j5021j2278j559L456n994o89P412
20415a2300K690k698j424k092k971M028J0954R534K026j6650j843L781M147J9218
20401A6400m195m411K888K2K84n744m755j0123Q96L182j0168K780l060L493L296
20386i215O151N795j720j954j6970o639J0493J8974N255j0493L50P015K222K382
20372A1646L872r064j5241j0111J3748K543n536Q249k695L855m274J16j0464j799
20358a5155J1365R255J146m338P851l298O658J161j0876R183j010j1804o159m36
20344f457J584M513q37k874J2945l627p544n296P230m802K741Q470M988N242j7888
20329a612n33J6727J697l524m913j952O233P240J389P513J467j5143p062J993
$$ plain form
20315 9520 -3004 -1867 3334 -919 4711 14278 10281 -94 -5619 5232 5912 -164 -6148 -12826
20301 -12826 -12359 8867 4999 -3015 -114 -2139 975 -9801 -17514 -16369 -13008 -18465 -31599 -27651
20287 -27651 -13740 -5268 -20717 -28418 -25741 -13688 8771 4789 -9165 -6217 -2351 8225 5449
20274 5449 -3331 4271 11541 14001 10395 14344 7415 -20164 -21667 -12239 -1455 6293 2955 7376
20260 7376 13234 5515 6618 1940 -1106 -1915 11529 13836 1529 -8920 -13265 -9409 -11832 -12647
20246 -12647 3044 15923 10146 14429 24824 23313 17242 19008 15193 -2421 7671 10569 4701
20233 4701 -3648 -5020 -9007 -5016 9723 4528 4079 12679 14399 7266 4342 -1545 9243 2208
20219 2208 -24311 -18489 -12936 -17555 -17097 -21664 -21386 -22341 -14778 56 9040 6335 3073 3331 7358
$$ packed form
20315I520j2524J137N201m253N630R567l997j0375n525J0851O80o076n984o678
20301a2826M67K1226l868q014K901k025L114j0776p713J145L361n457j3134L948
20287b7651J3911Q472j5449p701K677J2053K2459l982j3954K948L866J0576k776
20274E449q780P602P270K460l606L949o929k7579j503R428J0784P748l338M421
20260G376N858p719J103m678l046q09J3444K307j2307j0449m345L856k423q15
20246a2647J5691J2879n777M283J0395j511o071J766l815j7614J0092K898n868
20233D701q349j372l987L991J4739n195m49Q600J720p133k924n887J0788p035
20219B208k6519N822N553m619M58m567K78r55P563J4834Q984k705l262K58M027
$$ plain form
20204 7358 6198 8305 7068 5708 -3960 3092 633 -4178 -2472 -5365 4842 1123 -262 -2930
20190 -2930 -14451 -19923 -21038 -17032 7170 2483 -6457 1691 -10067 -17733 -19565 -12160 -11674 -1081
20176 -1081 8427 -9675 -14342 -15631 -22472 -24797 -23822 -9188 2895 1101 13040 22167 12506 6191
20162 6191 -2304 -14465 -14177 -4960 3242 -7042 -28086 -34430 -24570 -25869 -24973 -20912 -15254 -5286
20148 -5286 -2423 -4236 -2034 4848 14116 5845 -5968 2946 10503 17074 16931 16277 17165 -1447 14026
20133 14026 29754 25947 18398 9007 16001 13071 22517 27040 26404 19319 14952 18845 12348 13385
20119 13385 25093 25598 27000 19902 6520 12494 13937 7033 742 5277 9828 -7436 -14893 -15298
20105 -15298 5459 6405 767 -447 -2598 1233 -8202 -2509 -9850 -12821 -4348 -138 1137 -1360
$$ packed form
20204G358j160K107j237j360r668P052k459m811J706k893J0207l719j385k668
20190b930j1521n472j115M006K4202m687q940Q148j1758p666j832P405M86J0593
20176a081R508j8102m667j289o841k325R75J4634J2083j794J1939R127r661o315
20162F191q495j2161K88R217Q202j0284k1044o344R860j299Q96M061N658R968
20148e286K863j813K202O882R268q271j1813Q914P557O571j43o54Q88j8612J5473
20133A4026J5728l807p549r391O994k930R446M523o36p085m367L893o497J037
20119A3385J1708N05J402p098j3382N974J443o904o291M535M551j7264p457m05
20105a5298K0757R46n638j214k151L831r435N693p341k971Q473M210J275k497
$$ plain form
20091 -1360 14349 26995 4155 14042 31267 20334 -4984 -5940 9737 16116 12212 7659 20723
20078 20723 18055 21510 16964 2596 16346 4132 -3810 -1596 11155 8175 -3820 -5121 -21635
20065 -21635 -21123 -10974 10785 14849 8265 7839 675 1508 16718 26209 24059 16725 17572 16916 15721
20050 15721 17779 26567 21454 18470 18961 10695 4242 2736 -1790 -1881 -4719 2139 13095 3115 -9275
20035 -9275 -28836 -31364 -17768 3769 6736 9416 18535 26720 15015 -9256 -7794 -8918 -13657
20022 -13657 1963 19054 20460 21523 29136 32293 14472 7080 15415 14549 13942 14958 13760 -4692
20008 -4692 -10616 -16167 -4988 -2942 -9714 -14539 -14436 -1611 -6799 -11114 -5467 4254 6461 7144 11904
19993 11904 -3683 -4217 789 8597 1034 -9530 -5263 7381 5927 -6336 -14743 -14160 -5183 3243
$$ packed form
20091a360J5709J2646k2840R887J7225j0933k5318r56J5677O379l904m553J3064
20078B0723k668L455m546j4368J3750j2214p942K214J2751k980j1995j301j6514
20065b1635N12J0149K1759M064o584m26p164Q33J5210R491k150p334Q47o56j195
20050A5721K058Q788n113k984M91q266o453j506m526r1k838O858J0956r980j2390
20035i275j9561k528J3596K1537K967K680R119Q185j1705k4271J462j124m739
20022a3657J5620J7091J406J063P613L157j7821p392Q335q66o07J016j198j8452
20008d692n924n551J1179K046o772m825J03J2825n188m315N647R721K207O83M760
19993A1904j5587n34N006P808p563j0564M267J2644j454j2263q407N83Q977Q426
$$ plain form
19979 3243 14958 15225 10737 3058 -4500 -13691 -12288 -5338 3320 8327 -4658 -15285 6281 8172
19965 8172 -2108 -1356 -13623 -6536 13211 5702 -16126 -17467 -3650 -8949 -8437 -8744 -7029 2495
19951 2495 239 -7164 -10730 8567 -4244 -4365 -446 799 -3575 -11309 -18025 -18693 -29180 -21793
19937 -21793 -29805 -26678 -10214 -3806 -6713 3307 4360 -10629 -7144 -14579 -11084 -152 1485
19924 1485 -8713 -7936 -7155 7168 6776 -2442 661 -1472 5171 7270 10827 19086 17302 17823 21435
19909 21435 23402 34197 33731 25274 14889 7742 5774 2722 -2229 7543 12570 25093 28994 868
19895 868 -21748 -10635 -7345 -13871 -2320 7929 18579 16624 12527 12084 240 6438 18733
19882 18733 32648 28925 24458 27119 21672 10000 6695 14566 13882 15608 21889 19964 21974 3642
$$ packed form
19979C243J1715K67m488p679p558r191J403O950Q658N007j2985j0627K1566J891
19965H172j0280P52j2267P087J9747p509k1828j341J3817n299N12l07J715R524
19951B495k256p403l566J9297j2811j21L919J245m374p734o716o68j0487P387
19937b1793q012L127J6464O408k907J0020J053j4989L485p435L495J0932J637
19924A485j0198P77P81J4323l92r218L103k133O643K099L557Q259j784N21L612
19909B1435J967J0795m66q457j0385p147j968l052m951R772N027J2523L901k8126
19895H68k2616J1113L290o526J1551J0249J0650j955m097m43j1844O198J2295
19882A8733J3915l723m467K661n447j1672l305P871o84J726O281j925K010j8332
$$ plain form
19868 3642 -6384 -6762 -605 -5078 -4322 5258 4305 3709 -2920 -13716 -14628 -5091 -2161 -11996 -18132
19853 -18132 -14146 -2008 -1458 1853 16401 24944 25240 12965 -8608 -13864 -9892 -5523 6922 12269
19839 12269 9871 1430 -5138 -1339 -3831 -10086 -5634 -3732 -13369 -14184 -19963 -23030 -15397 -12810 -21304
19824 -21304 -21793 -9692 -11615 -7708 -16042 -22561 -19897 -12856 -17556 -3312 3192 5385 -7019 -13158
19810 -13158 -3927 23117 23047 11608 -5568 -6813 -4860 740 11105 3944 10579 8252 14768 21183
19796 21183 23004 19801 8591 -2601 -3589 10993 21395 20300 11533 -435 -3868 -6778 -7779
19783 -7779 -15004 -17586 -13595 -11211 -8923 -4953 -10555 -17394 -22328 -9865 -246 26188 24219 10991
19769 10991 7938 20309 25001 17329 1210 -7469 4864 7677 8950 3211 869 -376 -9234 480
$$ packed form
19868C642j0026l78O157m473P56R580r53n96o629j0796r12R537K930r835o136
19853a8132L986J2138N50L311J4548Q543K96j2275k1573n256L972M369J2445N347
19839A2269k398q441o568L799k492o255M452J902r637q15n779l067P633K587q494
19824b1304m89J2101j923L907q334o519K664P041m700J4244O504K193j2404o139
19810a3158R231K7044p0j1439j7176j245J953N600J0365p161O635k327O516O415
19796B1183J821l203j1210j1192r88J4582J0402j095q767j1968l433k910j001
19783g779p225k582L991K384K288L970n602o839m934J2463R619K6434j969j3228
19769A0991l053J2371M692p672j6119q679J2333K813J273n739k342j245q858R714
$$ plain form
19755 480 1386 1768 9923 9320 16091 10012 3288 -5101 -20670 -4586 4879 2824 -2529 -403 6382
19740 6382 12387 15740 6752 11197 15459 19628 17154 14908 19891 11694 13849 25195 23831 18182
19726 18182 18879 12836 13242 4223 -3103 -1310 -479 9679 18787 11500 17631 8284 -2204 7 5243
19711 5243 14526 15556 5046 -1854 5843 16049 7858 -6990 -13180 -6441 3300 8723 11761 11567
19697 11567 3090 10242 5012 1176 -2177 3170 8295 -4060 -7449 -1864 -1732 14430 23035 43958
19683 43958 37607 25486 25187 25829 15896 6707 7637 8445 11250 16766 19823 12744 7063 -2714 -8453
19668 -8453 -14196 -6920 -14587 -10419 -445 -3083 -5885 -6539 946 5970 7002 4173 8442 6452 8042
19653 8042 11954 15915 18812 10875 -1333 -8594 711 8668 15080 8307 12313 4585 -9489 -5513
$$ packed form
19755D80R06L82Q155o03O771o079o724q389j5569J6084R465k055n353K126O785
19740F382O005L353q988M445M262M169k474k246M983q197K155J1346j364n649
19726A8182O97o043M06r019p326J793Q31J0158R108p287O131r347j0488K211N236
19711E243R283J030j0510o900P697J0206q191j4848o190O739R741N423L038j94
19697A1567q477P152n230l836l353N347N125j2355l389N585J32J6162Q605K0923
19683D3958o351j2121k99O42r933r189R30Q08K805N516L057p079n681r777n739
19668h453n743P276p667M168R974k638k802o54P485N024J032k829M269j990J590
19653H042L912L961K897p937j2208p261R305P957O412o773M006p728j4074L976
$$ plain form
19639 -5513 12741 30489 28024 19973 8193 3677 9921 8938 13879 12737 7681 17113 13500 143
19625 143 -7407 12297 24762 12078 -7802 -6275 -21176 -11225 8560 16013 15769 25121 36302
19612 36302 29985 26826 34437 27557 9707 586 -782 9871 19808 8151 150 5200 15039 10726
19598 10726 24199 28391 5829 8325 8509 5665 11334 15340 3245 760 -1419 -5909 -1914 -7302
19584 -7302 -6282 -10589 3295 11908 12430 37 -1548 -4044 -7917 4685 17854 23332 25617 18394
19570 18394 17262 21816 14387 17889 8408 5326 22889 36751 32279 14949 3051 -5425 -1569
19557 -1569 8531 16382 20619 13196 4811 -784 6651 26465 32005 18270 16867 15161 18425 15761
19543 15761 7326 8279 13789 16197 10221 5266 3086 7209 -1924 -1163 11774 8542 12850 5506 7450
$$ packed form
19639e513J8254J7748k465q051j1780m516O244r83M941j142n056R432l613j3357
19625A43p550J9704J2465j2684j9880J527j4901R951J9785P453k44R352J1181
19612C6302o317l159P611o880j7850r121j368J0653R937j1657q001N050R839m313
19598A0726J3473M192k2562K496J84k844N669M006j2095k485k179m490L995n388
19584g302J020m307J3884Q613N22j2393j585k496l873J2602J3169N478K285p223
19570A8394j132M554p429L502r481l082J7563J3862m472j7330j1898q476L856
19557a569J0100P851M237p423q385n595P435J9814N540j3735j403j706L264k664
19543A5761q435R53N510K408n976m955k180M123r133P61J2937l232M308p344J944
$$ plain form
19528 7450 12387 27171 31801 19285 8779 5132 77 10648 21454 17340 15533 16993 22144
19515 22144 28403 21321 24847 22407 15313 12444 21712 22841 32402 38491 30899 26320 22743 30485
19501 30485 22434 9499 14204 8954 4087 19620 18338 14748 12743 -3036 103 -374 -8482 -16673
19487 -16673 -13428 -1319 6965 6305 8273 10723 12182 18399 13027 21024 29075 30491 31243 20709
19473 20709 19012 16893 17927 19299 14995 5248 11508 20077 32622 30339 24217 39047 43167 36061
19459 36061 30949 18539 16575 24391 19736 19850 24129 25279 27233 22810 27722 32488 19165 10142
19445 10142 9809 17254 34328 24098 6055 -12810 -3481 10826 22003 21605 16496 18517 19098 21871
19431 21871 19879 18624 2524 5679 21993 19737 13989 20592 21720 15251 7680 6894 11903 31526
$$ packed form
19528G450M937J4784M630j2516j0506l647n055J0571J0806m114j807J460N151
19515B2144O259p082L526k440p094k869R268J129R561O089p592m579l577P742
19501C0485q051j2935M705n250m867J5533j282l590k005j5779L139m77q108q191
19487a6673L245J2109Q284o60J968K450J459O217n372P997Q051J416P52j0534
19473B0709j697k119J034J372m304r747O260Q569J2545k283o122J4830M120p106
19459C6061n112j2410j964P816m655J14M279J150J954m423M912M766j3323r023
19445A0142l33P445J7074j0230j8043j8865R329J4307J1177l98n109K021N81K773
19431B1871j992j255j6100L155J6314k256n748O603J128o469p571p86N009J9623
$$ plain form
19417 31526 37628 31951 25730 26512 28879 36039 35363 26627 27796 29874 33296 27240 14082 7140 12453
19402 12453 7557 16379 19657 13616 2693 10907 21499 12622 14969 30084 24463 20190 9653
19389 9653 9335 7247 2964 18763 37291 30803 18328 21033 25528 32413 31839 18408 12660 21649
19375 21649 43365 47205 48214 46499 38653 38678 27930 23436 27001 35739 40070 39106 24399 4493
19361 4493 6856 18037 33416 44826 45348 50506 43045 27138 18962 32913 56076 50878 33739
19348 33739 17815 11543 24847 39985 38720 23928 7430 13150 9604 -800 3796 11701 14609
19335 14609 8899 13991 7206 9990 22108 23066 14018 11240 16383 15963 18121 19927 16982 2663
19321 2663 -2401 12343 24337 22659 5774 10902 12955 19596 20419 21007 20286 30686 35067 51848
$$ packed form
19417C1526O102n677o221P82K367P160o76q736J169K078L422o056j3158o942N313
19402A2453m896Q822L278o041j0923Q214J0592q877K347J5115n621m273j0537
19389I653l18k088m283J5799J8528o488j2475K705M495O885n74j3431n748Q989
19375B1649K1716L840J009j715p846K5j0748m494L565Q738M331r64j4707j9906
19361D493K363J1181J5379J1410N22N158p461j5907q176J3951K3163n198j7139
19348C3739j5924o272J3304J5138j265j4792j6498N720l546j0404M596P905K908
19335A4609n710N092o785K784J2118R58r048k778N143m20K158J806k945j4319
19321B663n064J4744J1994j678j6885N128K053O641Q23N88p21J0400M381J6781
$$ plain form
19307 51848 48331 41511 22791 10732 10078 14701 21847 34816 35214 23128 16437 11568 4509 11219
19293 11219 14336 3986 -868 -4966 -8194 6914 3849 6109 9849 1691 -6279 11649 27159
19280 27159 26971 22102 22869 18746 14419 19149 26916 30360 22556 16323 12522 19629 22162 13336 13636
19265 13636 14813 12022 17340 12392 5291 5274 -1527 3704 12822 21485 9573 5814 22726 37001
19251 37001 32801 30437 40373 31603 17664 16176 25052 32306 31638 14313 20572 21355 3140 7694
19237 7694 10071 -2567 3307 14333 28604 19032 7349 8387 9198 11030 9503 20879 24380 21466
19223 21466 24509 28258 20339 19657 11456 -969 4125 5065 6880 27752 17159 9350 18440 16261
19209 16261 24105 29271 26478 26650 30208 34065 38967 42021 38102 42221 43958 48463 28944 13164
$$ packed form
19307E1848l517o820j8720j2059o54M623P146J2969L98j2086o691m869p059O710
19293A1219L117j0350m854m098l228J5108l065K260L740q158p970J7928J5510
19280B7159j88m869P67m123m327M730P767L444p804o233l801P107K533q826L00
19265A3636J177k791N318m948p101j7o801N231R118Q663j1912l759J6912J4275
19251C7001m200k364R936q770j3939j488Q876P254o68j7325O259P83j8215M554
19237G694K377j2638N874J1026J4271r572j1683J038Q11J832j527J1376L501k914
19223B1466L043L749p919o82q201j2425N094R40J815K0872j0593p809R090k179
19209A6261P844N166k793J72L558L857M902L054l919M119J737M505j9519j5780
$$ plain form
19195 13164 14713 11761 20522 20291 34876 38872 26423 24203 32351 32561 22673 17183 22596 29517
19181 29517 26969 28717 36969 37858 25543 27314 17359 16567 17052 22281 10745 1112 2868 8576 10332
19166 10332 15687 40008 44906 37971 33477 29236 45190 49280 49956 66041 73578 65392 53819 38638
19152 38638 23030 22836 30185 33466 48983 46436 27351 32837 42926 32591 27088 31538 27460
19139 27460 25177 34465 35430 38272 36247 39321 35294 41509 41035 29317 23646 27207 46907 34950
19125 34950 22319 36488 38493 44729 34558 32240 39527 53598 69598 81613 93413 88689 78103
19112 78103 78400 77368 71727 77673 83393 83469 104556 135521 168328 211357 281798 367609 462419
19099 462419 550813 588883 624836 700005 784027 857189 857786 749873 590224 463466 387582
$$ packed form
19195A3164J549k952Q761k31J4585L996j2449k220Q148K10r888n490N413O921
19181B9517k548J748Q252Q89j2315J771r955p92M85N229j1536r633J756N708J756
19166A0332N355K4321M898o935m494m241J5954M090O76J6085P537q186j1573j5181
19152C8638j5608j94P349L281J5517k547j9085N486J0089j0335n503M450m078
19139B7460k283R288R65K842k025L074m027O215m74j1718n671L561J9700j1957
19125C4950j2631J4169K005O236j0171k318P287J4071J6000J2015J1800m724j0586
19112G8103K97j032n641N946N720P6K1087L0965L2807M3029P0441Q5811R4810
19099D62419Q8394L8070L5953P5169Q4022P3162N97j07913j59649j26758p5884
$$ plain form
19088 387582 358906 371351 448768 547783 614853 664304 704565 759864 852568 938484 917588
19077 917588 796825 611292 434907 314837 236810 189524 161499 141096 123920 118195 120801
19066 120801 104774 101279 100437 94142 92836 89112 99760 94226 83620 60723 60781 58629 55993 59730
19052 59730 75417 100752 113967 127283 157455 216692 294303 376902 422500 397131 328909 253232
19040 253232 186250 152868 127780 116732 127354 127965 142742 170064 213167 282504 372780 438160
19028 438160 441558 380676 293787 209798 156066 129940 116253 101594 93955 83688 74328 81065
19016 81065 88116 83174 69003 67740 68093 64834 56216 60442 54060 38681 31696 32755 49743 44300
19002 44300 35251 39996 38065 44419 48064 32171 38682 49971 56737 71091 55282 64576 62670
$$ packed form
19088C87582k8676J2445P7417R9015O7070M9451M0261N5299R2704Q5916k0896
19077I17588j20763j85533j76385j20070p8027m7286k8025k0403j7176n725K606
19066A20801j6027l495q42o295j306l724J0648n534j0606k2897N8k152k636L737
19052E9730J5687K5335J3215J3316L0172N9237P7611Q2599M5598k5369o8222p5677
19040B53232o6982l3382k5088j1048J0622O11J4777K7322M3103O9337R0276O5380
19028D38160L398o0882q6889q3989n3732k6126j3687j4659p639j0267r360O737
19016H1065P051m942j4171j263L53l259q618M226o382j5379o985J059J6988n443
19002D4300r049M745j931O354L645j5893O511J1289O766J4354j5809R294j906
$$ plain form
18989 62670 53784 50802 48615 54414 59243 59806 66045 69167 68897 62272 53067 54575 66895 66056 56987
18974 56987 46412 55109 57717 37779 44471 36884 29141 36241 50645 61244 55474 37421 37141
18961 37141 38361 31110 23074 34083 38194 43173 43589 48199 45211 34926 20608 24686 29049 37365
18947 37365 37717 29059 23876 19137 24290 33977 26243 16988 15028 4790 -2601 6574 10090 14824
18933 14824 29186 43607 36331 27429 26227 28827 33434 29138 24779 20930 28419 41451 53835
18920 53835 44268 31299 27483 19336 21368 13541 6075 10572 22601 18338 8576 9225 13669 22644
18906 22644 16499 15102 23963 54085 78948 105486 121314 117265 101422 109946 111039 111827 115897
18893 115897 118436 111104 115347 119199 112666 114619 109257 100207 95897 86863 82156 82348 79626 69074
$$ packed form
18989F2670q886k982k187N799M829N63O239L122k70o625r205J508J2320q39r069
18974E6987j0575Q697K608j9938O692p587p743P100J4404J0599n770j8053k80
18961C7141J220p251q036J1009M111M979M16M610k988j0285j4318M078M363Q316
18947C7365L52q658n183m739N153R687p734r255j960j0238p391R175L516M734
18933A4824J4362J4421p276q902j202K600M607m296m359l849P489J3032J2384
18920E3835r567j2969l816q147K032p827p466M497J2029m263r762O49M444Q975
18906B2644o145j397Q861L0122K4863K6538J5828m049j5843Q524J093P88M070
18893A15897K539p332M243L852o533J953n362r050m310r034m707J92k722j0552
$$ plain form
18879 69074 76540 84568 81064 77572 69714 75300 80036 79427 79565 81170 81281 78880 61906 57220 63503
18864 63503 67984 80816 86333 84106 82382 76363 69404 76529 81849 76749 72347 78856 79135 95123
18850 95123 109563 119830 113423 117098 119175 111356 105936 119162 120355 112112 97586 103729 114968
18837 114968 118668 115150 122943 127781 126851 109714 99813 105466 114722 115845 117073 128603 137108 140521
18823 140521 147080 129493 128048 156230 174325 201709 222110 221952 212829 208739 224836 233708 232702
18810 232702 234239 256565 263294 257522 250041 240570 214650 198388 194055 186923 181630 170481 157948
18797 157948 152864 143690 138116 130191 138555 167632 193628 203491 208435 194047 179804 175527 155398
18784 155398 142327 152210 155310 156846 164917 184109 182087 179632 187328 173633 151938 153756 160834
$$ packed form
18879F9074P466Q028l504l492p858N586M736o09J38J605J11k401j6974m686O283
18864F3503M481J2832N517k227j724o019o959P125N320n100m402O509K79J5988
18850I5123J4440J0267o407L675K077p819n420J3226J193q243j4526O143J1239
18837A14968L700l518P793M838r30j7137r901N653R256J123J228J1530Q505L413
18823A40521O559j7587j445K8182J8095K7384K0401j58r123m090J6097Q872j006
18810B32702J537K2326O729n772p481r471k5920j6262m333p132n293j1149j2533
18797A57948n084r174n574p925Q364K9077K5996R863M944j4388j4243m277k0129
18784A55398j3071R883L100J536Q071J9192k022k455P696j3695k1695J818P078
$$ plain form
18771 160834 175835 195722 218936 229859 258396 277729 270326 232157 195095 171183 165846 168241
18759 168241 193466 211367 218993 226185 244832 268985 290797 304146 281134 247118 216969 214676
18747 214676 223279 239083 255132 267251 260524 224470 192224 178569 172030 165303 163315 155633 136991
18734 136991 136589 135899 145838 166302 177634 181479 183508 171505 171496 177918 186443 190739 167179 166694 159016
18719 159016 147883 146050 141498 144654 132653 111841 111024 123768 151272 174569 176005 166878 179032
18706 179032 210119 242079 264247 262424 259459 255261 225038 199155 214709 238651 280698 311666
18694 311666 320376 329012 317009 307877 322602 377844 472168 561928 622333 623303 570007 524176
18682 524176 521682 536369 549644 550571 539306 502149 468392 444286 414293 413135 442230 453499
$$ packed form
18771A60834J5001J9887K3214J0923K8537J9333p403l8169l7062k3912n337K395
18759A68241K5225J7901P626P192J8647K4153K1812J3349k3012l4016l0149k293
18747B14676Q603J5804J6049J2119o727l6054l2246j3655o539o727j988p682j8642
18734A36991m02o90R939K0464J1332L845K029j2003rO422Q525M296k3560m85p678
18719A59016j1133j833m552L156j2001k0812q17J2744K7504K3297J436r127J2154
18706A79032L1087L1960K2168j823k965m198l0223k5883J5554K3942M2047L0968
18694C11666Q710Q636j2003r132J4725N5242R4324Q9760O0405R70n3296m5831
18682E24176k494J4687J3275R27j1265l7157l3757k4106k9993j158K9095J1269
$$ plain form
18670 453499 453199 464282 513336 583172 632362 658333 661449 630191 568843 511455 457784 431544
18658 431544 411968 417556 411782 401889 415646 448555 474268 495480 512924 508760 493966 484190
18646 484190 488146 490285 488788 509601 532847 559474 598544 664114 725773 787283 871569 961455
18634 961455 1088442 1334697 1714570 2163872 2545780 2759685 2744942 2514636 2152697 1793723
18624 1793723 1503674 1298589 1172367 1096698 1054993 1037818 1043786 1045188 1037613 1045564 1054798 1077487
18612 1077487 1144819 1256845 1393876 1496458 1553860 1582080 1561820 1521808 1474786 1453995 1456146
18601 1456146 1479345 1538544 1620199 1679797 1739727 1832221 1947916 2076709 2258606 2484476
18591 2484476 2753749 3093086 3529298 4108563 4777933 5399454 5900807 6191343 6246143 6157001
$$ packed form
18670D53499l00J1083M9054O9836M9190K5971L116l1258o1348n7388n3671k6240
18658D31544j9576N588n774r893J3757L2909K5713K1212J7444m164j4794r776
18646D84190L956K139j497K0813K3246K6627L9070O5570O1659O1510Q4286Q9886
18634I61455J26987K46255L79873M49302L81908K13905j4743k30306l61939l58974
18624A793723k90049k05085j26222p5669m1705j7175N968J402p575P951R234K2689
18612A077487O7332J12026J37031J02582N7402K8220k0260m0012m7022k0791K151
18601A456146K3199N9199Q1655N9598N9930R2494J15695J28793J81897K25870
18591B484476K69273L39337M36212N79265O69370O21521N01353K90536N4800q9142
$$ plain form
18581 6157001 6138958 6328383 6738063 7357684 8262573 9596237 11408890 13593114 16144048
18572 16144048 19374420 24148751 31973170 44369392 60049675 73700768 79450295 76063735
18564 76063735 71705755 76098264 96196361 138750940 204459095 271023472 304960802
18557 304960802 281203601 218210011 160142398 132803561 129478713 132523399 126838238
18550 126838238 105532246 77513830 54471017 39749321 30543308 24485800 20304046
18543 20304046 17210685 14756395 12746495 11124987 9947489 9135613 8559177 8098638
18535 8098638 7664732 7264398 7005102 6929818 6935518 6798811 6417263 5906022 5431895 5100047
18525 5100047 4933551 4879854 4889000 4982405 5196567 5537205 6074450 6839386 7964979 9645870
$$ packed form
18581F157001j8043J89425M09680O19621R04889J333664J812653K184224K550934
18572A6144048L230372M774331P824419J2396222J5680283J3651093N749527l386560
18564G6063735m357980M392509K0098097M2554579O5708155O6564377L3937330
18557C04960802k3757201o2993590n8067613k7338837l324848L044686n685161
18550A26838238k1305992k8018416k3042813j4721696r206013o057508m181754
18543B0304046l093361k454290k009900j621508j177498q11876n76436m60539
18535H098638m33906m00334k59296p5284N700j36707l81548n11241m74127l31848
18525E100047j66496n3697R146R3405K14162L40638N37245P64936J125593J680891
$$ plain form
18515 9645870 12081463 15695577 21286808 30443035 45715528 67707444 89822919 101093052
18507 101093052 93116917 71067987 48627658 33677887 25075162 20032573 17098477
18500 17098477 15690465 15696720 17353670 21411199 29228361 41476100 54801195 62579881
18492 62579881 59004166 45807852 31325352 21162424 15072972 11267439 8725211 6921973
18484 6921973 5613961 4664380 3961715 3462805 3162764 3019918 2928104 2830984 2671454 2445680
18474 2445680 2179104 1908430 1665612 1463562 1309820 1195455 1100942 1020144 980101 976700
18464 976700 1009942 1046019 1048249 997273 899864 819171 752272 699993 649538 602156 579771 557298
18452 557298 537115 538846 529371 507480 473770 443078 427029 407657 387514 373031 357816 330937
$$ packed form
18515I645870K435593L614114N591231R156227J5272493K1991916K2115475J1270133
18507A01093052p976135k2048930k2440329j4949771q602725n042589k934096
18500A7098477j408012O255J656950M057529P817162J2247739J3325095P778686
18492F2579881l575715j3196314j4482500j0162928o089452l805533k542228j803238
18484F921973j308012r49581p02665m98910l00041j42846r1814r7120j59530k25774
18474B445680k66576k70674k42818k02050j53742j14365r4513q0798m0043l401
18464I76700L3242L6077K230n0976r7409q0693o6899n2279n0455m7382k2385k2473
18452E57298k0183J731r475k1891l3710l0692j6049j9372k0143j4483j5215k6879
$$ plain form
18440 330937 290337 245572 218523 213774 209453 209325 213518 224619 210815 180674 158091 118092
18428 118092 76332 107472 163229 196405 195186 177726 161404 134546 133237 145679 162119 168699
18416 168699 173248 160999 165851 160626 155898 158033 153414 139890 136991 147154 159716 176866 194301
18403 194301 210804 208809 195379 166033 156262 162161 164036 171491 171619 149576 133812 134190 137269
18390 137269 130426 118578 110455 110971 116470 141792 160752 182038 176871 152664 130654 113666 112902
18377 112902 112620 112284 108630 96684 72201 62031 71714 96968 134114 133715 103956 66731 36241
18364 36241 16558 22394 48551 64333 76553 84099 106992 132403 154392 162446 175148 183168
18352 183168 186055 190784 190024 183084 179184 184552 209232 222191 245255 279804 315043 345778 368616
$$ packed form
18440C30937m0600m4765k7049m749m321j28M193J1101j3804l0141k2583l9999
18428A18092m1760L1140N5757L3176j219j7460j6322k6858j309J2442J6440O580
18416A68699M549j2249M852n225m728K135m619j3524k899J0163J2562J7150J7435
18403A94301J6503j995j3430k9346r771N899J875P455J28k2043j5764L78L079
18390A37269o843j1848q123N16N499K5322J8960K1286n167k4207k2010j6988p64
18377A12902k82l36l654j1946k4483j0170R683K5254L7146l99k9759l7225l0490
18364C6241j9683N836K6157J5782J2220P546K2893K5411K1989Q054J2702Q020
18352A83168K887M729p60o940l900N368K4680J2959K3064L4549L5239L0735K2838
$$ plain form
18339 368616 390644 398223 414644 448038 484295 551595 619629 672737 670906 610362 515041 443877
18327 443877 395344 364666 286012 198990 154983 134050 106244 111435 137103 149309 140967 112584
18315 112584 93483 72743 74731 77075 81389 70012 62205 67424 91909 101194 116504 134009 146758
18302 146758 135427 129552 106648 94093 87878 79514 74043 83065 108982 119088 112448 122603 138611
18289 138611 152446 167932 200140 262967 321315 374831 422268 469206 527724 606109 672819
18278 672819 679896 634495 532475 411075 336147 313445 309860 342798 381902 411798 392205
18267 392205 350723 302188 243971 189889 143191 122381 105177 97235 97161 102126 104235 89605 67438
18254 67438 76562 77575 78873 74003 61926 56182 55661 60376 53962 49256 50834 55361 42466 35215
$$ packed form
18339C68616K2028P579J6421L3394L6257O7300O8034N3108j831o0544r5321p1164
18327D43877m8533l0678p8654q7022m4007k0933k7806N191K5668J2206q342k8383
18315A12584j9101k0740J988K344M314j1377p807N219K4485R285J5310J7505J2749
18302A46758j1331n875k2904j2555o215q364n471R022K5917J0106o640J0155J6008
18289A38611J3835J5486L2208O2827N8348N3516M7437M6938N8518P8385O6710
18278F72819P077m5401j02020j21400p4928k2702l585L2938L9104K9896j9593
18267C92205m1482m8535n8217n4082m6698k0810j7204p942p4M965K109j4630k2167
18254F7438R124J013J298m870j2077n744n21M715o414m706J578M527j2895p251
$$ plain form
18240 35215 42903 55167 73272 95616 110087 119595 130185 149492 179993 213557 235067 238117
18228 238117 202087 166298 149456 148113 188677 261996 327716 354855 327668 253097 173433 139680
18216 139680 132835 143948 163696 178573 175921 168010 147809 136102 127665 138284 149922 156899
18204 156899 151381 142405 133743 141275 144534 130860 116095 92896 85757 92778 88191 89956 98227
18191 98227 93969 90737 88685 103576 111128 110920 82750 70661 66031 65021 62810 69487 77366 79864
18177 79864 91249 88475 91610 99187 102366 108487 121472 116569 90153 68442 47737 55479 74212
18164 74212 89716 94013 118425 123109 124968 139531 168815 198857 221332 240314 212845 183412
18152 183412 163187 144606 132316 132169 135230 137437 148459 165878 183954 203550 223682 260716
$$ packed form
18240C5215P688J2264J8105K2344J4471R508J0590J9307L0501L3564K1510L050
18228B38117l6030l5789j6842j343M0564P3319O5720K7139k7187p4571p9664l3753
18216A39680o845J1113J9748J4877k652p911k0201j1707q437J0619J1638O977
18204A56899n518q976q662P532L259j3674j4765k3199p139P021m587J765Q271
18191I8227m258l232k052J4891P552k08k8170j2089m630j010k211O677P879K498
18177G9864J1385k774L135P577L179O121J2985m903k6416k1711k0705P742J8733
18164G4212J5504M297K4412M684J859J4563K9284L0042K2475J8982k7469k9433
18152A83412k0225j8581j2290j47L061K207J1022J7419J8076J9596K0132L7034
$$ plain form
18140 260716 273023 256150 229785 206259 211206 226379 233323 237514 250924 267286 278834 298820
18128 298820 335092 349513 376334 414016 451066 481941 529332 615802 726327 849602 969253
18117 969253 1135185 1364924 1676699 2143176 2856346 4018607 6030242 9635705 15525997
18108 15525997 22467478 27052480 26028244 19865714 12887025 8156170 5498979 3942523
18100 3942523 2968142 2306238 1837825 1509235 1238874 1022611 872627 776092 689585 600530
18090 600530 510190 453702 415980 372746 335492 307827 278551 263072 252721 239844 223681
18079 223681 206214 197750 190651 182728 173014 157886 153553 149026 140389 121930 111654 113435 104850
18066 104850 88415 86054 82972 86230 86679 86331 93971 92069 88562 82614 77194 65500 64689 72318
$$ packed form
18140B60716J2307j6873k6365k3526M947J5173O944M191J3410J6362J1548J9986
18128B98820L6272J4421K6821L7682L7050L0875M7391Q6470J10525J23275J19651
18117I69253J65932K29739L11775M66477P13170J162261K011635L605463N890292
18108A5525997O941481M585002j024236o162530o978689m730855k657191j556456
18100C942523r74381o61904m68413l28590k70361k16263j49984r6535q6507q9055
18090F00530r0340n6488l7722m3234l7254k7665k9276j5479j0351j2877j6163
18079B23681j7467q464p099p923r714j5128m333m527q637j8459j0276J781q585
18066A04850j6435k361l082L258M49l48P640j902l507n948n420j1694q11P629
$$ plain form
18052 72318 77659 90520 104001 102901 115344 129424 133911 160454 187393 179508 170412 190520 223154
18039 223154 266474 330231 433903 583500 753712 873212 888008 797617 646173 519146
18029 519146 458233 457123 505394 551039 585448 575593 561103 597135 703317 821649 928344
18018 928344 944331 833059 667793 539489 464584 434123 446048 476102 496046 478226 414019
18007 414019 356678 290107 244579 211779 185287 162169 146760 135681 136533 133134 134323 108444
17995 108444 99715 104870 100716 113309 123516 113235 109174 106119 101313 94528 92073 93885 96574
17982 96574 97071 89519 99753 113153 120133 139012 151466 176256 237695 317308 418323 524157
17970 524157 580758 570576 493679 396044 319688 262472 223667 206854 208763 218231 241814 283232
$$ packed form
18052G2318N341J2861J3481j100J2443J4080M487K6543K6939p885r096K0108L2634
18039B23154M3320O3757J03672J49597J70212J19500J4796r0391j51444j27027
18029E19146o0913j110M8271M5645L4409r855j4490L6032J06182J18332J06695
18018I28344J5987j11272j65266j28304p4905l0461J1925L0054J9944j7820o4207
18007D14019n7341o6571m5528l2800k6492k3118j5409j1079Q52l399J189k5879
17995A08444q729N155m154J2593J0207j0281m061l055m806o785k455J812K689
17982I6574M97p552J0234J3400O980J8879J2454K4790O1439P9613J01015J05834
17970E24157N6601j0182p6897r7635p6356n7216l8805j6813J909R468K3583M1418
$$ plain form
17958 283232 352223 447395 542853 613387 610376 543185 441961 355292 287635 233876 205203
17947 205203 175653 150341 126420 112101 100444 98405 84307 86131 102139 95968 81432 70461
17935 70461 71479 61065 55937 58202 51911 48770 52656 72080 84118 100206 103005 92683 92999
17922 92999 90013 83014 84889 86129 79520 70014 63405 46851 38813 37655 40695 40795 45687 49400
17908 49400 53827 61466 71373 90574 99512 106059 123562 122576 116447 107270 116838 128822 119426 128114
17894 128114 133081 121645 109718 101633 106877 140140 192244 216974 216051 190702 176764 167812 186821
17881 186821 219465 218752 204121 186740 172107 173694 167750 166161 160907 151863 151563 134213 124613
17868 124613 119135 127915 136189 133852 115261 110374 108844 127150 137876 144061 128962 132802 147861
$$ packed form
17958B83232O8991R5172R5458P0534l011o7191j01224q6669o7657n3759k8673
17947B05203k9550k5312k3921j4319j1657k039j4098J824J6008o171j4536j0971
17935G0461J018j0414n128K265o291l141L886J9424J2038J6088K799j0322L16
17922I2999k986o999J875J240o609r506o609j6554q038j158L040J00M892L713
17908D9400M427P639R907J9201Q938O547J7503r86o129r177R568J1984r396Q688
17894A28114M967j1436j1927q085N244L3263N2104K4730r23k5349j3938q952J9009
17881A86821L2644p13j4631j7381j4633J587n944j589n254r044l00j7350r600
17868A24613n478Q780Q274k337j8591m887j530J8306J0726O185j5099L840J5059
$$ plain form
17855 147861 167685 176928 180272 187285 185337 179179 178089 179536 184803 186302 177591 188540 202085
17842 202085 194269 198467 215451 229330 229993 246142 243076 250217 250523 273061 311542 341459 341319
17829 341319 340550 338988 332269 327153 330885 347732 347944 339239 343037 347396 352672 361012 362326 361961 352666
17814 352666 339711 353178 369490 390107 400944 423066 447638 464892 486057 523883 556463
17803 556463 597821 664148 746669 811664 851460 861475 897986 997023 1126454 1242820 1306173
17792 1306173 1296473 1249199 1241243 1296837 1414292 1587749 1809008 2011202 2119500 2161606 2248067
17781 2248067 2401802 2562756 2696266 2851531 3111233 3506511 4055574 4832454 6035558
17772 6035558 7953312 11123016 16117157 22504654 28075266 30287060 28506701 25683984
$$ packed form
17855A47861J9824R243L344P013j948o158j090J447N267J499q711J0949J3545
17842B02085p816M198J6984J3879O63J6149l066P141L06K2538L8481K9917j40
17829C41319p69j562o719n116L732J6847K12q705L798M359N276Q340J314l65r295
17814C52666j2955J3467J6312K0617J0837K2122K4572J7254K1165L7826L2580
17803E56463M1358O6327Q2521O4995L9796J0015L6511R9037J29431J16366O3353
17792A306173r700m7274p956N5594J17455J73457K21259K02194J08298M2106Q6461
17781B248067J53735J60954J33510J55265K59702L95278N49063P76880J203104
17772F035558J917754L169704M994141O387497N570612K211794j780359k822717
$$ plain form
17764 25683984 25379002 29600355 39825790 56910631 76376915 88919058 86518290 71824272
17756 71824272 57457259 52882680 57992083 65975376 68619192 60437068 44997662 30546648
17748 30546648 21150723 15554763 12003615 9590227 7848951 6542397 5581776 4934912
17740 4934912 4573282 4417902 4378130 4305552 4111063 3844990 3565101 3316638 3102141 2926608
17730 2926608 2811331 2768460 2783855 2897114 3111158 3380116 3613877 3777663 3936797 4198363
17720 4198363 4600056 5088312 5690723 6503760 7699213 9518200 12377366 17143256 25086314
17711 25086314 36826498 49577869 57988248 57829915 51543559 47137611 50896612 62634853
17703 62634853 75243474 79576201 69999767 52258901 36479155 27186845 23088412 22704256
$$ packed form
17764B5683984l04982M221353J0225435J7084841J9466284J2542143k400768j4694018
17756G1824272j4367013m574579N109403P983293K643816q182124j5439406j4451014
17748C0546648r395925n595960l551148k413388j741276j306554r60621o46864
17740D934912l61630j55380l9772p2578j94489k66073k79889k48463k14497j75533
17730B926608j15277m2871J5395J13259K14044K68958K33761J63786J59134K61566
17720D198363M01693M88256O02411Q13037J195453J818987K859166M765890P943058
17711B5086314J1740184J2751371Q410379j58333o286356m405948L759001J1738241
17703F2634853J2608621M332727r576434j7740866j5779746r292310m098433l84156
$$ plain form
17695 22704256 24481136 25944999 24717446 20261011 14844374 10627490 7981611 6323033
17687 6323033 5227799 4442571 3821294 3304759 2895378 2606385 2360469 2122467 1860059
17678 1860059 1618212 1450300 1343074 1309893 1319555 1316592 1266553 1178998 1122560 1130776 1142678
17667 1142678 1086020 969096 838401 723560 629816 555343 508620 506914 515519 513639 494561
17656 494561 479886 440920 406979 383582 349490 331309 324706 313536 294649 295916 298866 283687
17644 283687 263365 249170 225218 201500 183617 159613 144860 143819 143677 150944 152096 129905
17632 129905 131452 127992 112924 122480 138226 156970 181880 195628 190294 159283 126973 126798 138921
17619 138921 123528 117555 118146 107757 105578 123593 123316 116224 101601 92215 93722 110969 120627
$$ packed form
17695B2704256J776880J463863j227553m456435n416637m216884k645879j658578
17687F323033j095234p85228o21277n16535m09381k88993k45916k38002k62408
17678A860059k41847j67912j07226l3181R662k963n0039q7555n6438Q216J1902
17667A142678n6658j16924j30695j14841r3744p4473m6723j706Q605j880j9078
17656D94561j4675l8966l3941k3397l4092j8181o603j1170j8887J267K950j5179
17644B83687k0322j4195k3952k3718j7883k4004j4753j041j42P267J152k2191
17632A29905J547l460j5068R556J5746J8744K4910J3748n334l1011l2310j75J2123
17619A38921j5393n973N91j0389k179J8015k77p092j4623r386J507J7247R658
$$ plain form
17606 120627 110727 117000 124563 119535 116021 114843 116395 117395 129701 135573 138642 137840 139238 134923
17592 134923 139529 147125 148258 145999 135801 128153 126581 144788 174208 207857 216217 200328 168901
17579 168901 147378 165611 200028 197832 173952 137748 97155 74663 73533 85176 102945 90369
17567 90369 65138 36391 34222 39350 35717 47680 74723 92544 101783 122694 147436 147286 138128
17554 138128 125486 104929 79450 77079 99573 120176 130897 136805 138740 115174 92591 66671
17542 66671 60441 46247 39094 38149 48012 63788 84012 100439 119271 153054 169944 176959 175807
17529 175807 185771 199193 208871 215187 186058 141476 101665 68453 45179 49070 46358 39072 9151
17516 9151 -8676 -13007 -4134 5427 6104 966 6261 -4542 -3342 13458 22711 61771 95697 98305
$$ packed form
17606A20627r900O273P563n028l514j178J552J000J2306N872L069q02J398m315
17592A34923M606P596J133k259j0198p648j572J8207K9420L3649Q360j5889l1427
17579A68901k1523J8233L4417k196k3880l6204m0593k2492j130J1643J7769j2576
17567I0369k5231k8747k169N128l633J1963K7043J7821R239K0911K4742j50r158
17554A38128j2642k0557k5479k371K2494K0603J0721N908J935k3566k2583k5920
17542F6671o230j4194p153r45R863J5776K0224J6427J8832L3783J6890P015j152
17529A75807R964J3422R678O316k9129m4582l9811l3212k3274L891k712p286k9921
17516I151j7827m331Q873R561O77n138N295j0803J200J6800R253L9060L3926K608
$$ plain form
17502 98305 108196 99669 72307 61510 51688 49907 47533 27542 26812 24130 20552 17362 11440 18822
17488 18822 24022 37348 56451 71398 96434 124803 158535 218888 263915 285662 300925 316074
17476 316074 313640 285430 258385 230113 196212 150539 115897 101508 89354 91829 81048 90829
17464 90829 95364 94473 102329 106903 110803 131569 165269 196467 259138 358541 467468 560659 683560
17451 683560 834950 991556 1140211 1210295 1234086 1250739 1276273 1271412 1204849 1076931 932398
17440 932398 816723 712778 575734 431089 313605 242909 190358 145212 104669 90024
17430 90024 90800 94712 105446 120151 134816 152900 190118 241644 280954 294322 277184 254519
17418 254519 242106 211924 175842 145617 118775 92835 84308 69345 49338 46566 41497 31290
$$ packed form
17502I8305R891q527k7362j0797r822j781k374j9991p30k682l578l190n922P382
17488A8822N200J3326J9103J4947K5036K8369L3732O0353M5027K1747J5263J5149
17476C16074k434k8210k7045k8272l3901m5673l4642j4389j2154K475j0781R781
17464I0829M535q91P856M574L900K0766L3700L1198O2671R9403J08927R3191J22901
17451F83560J51390J56606J48655P0084K3791J6653K5534m861o6563j27918j44533
17440I32398j15675j03945j37044j44645j17484p0696n2551m5146m0543j4645
17430I0024P76L912J0734J4705J4665J8084L7218N1526L9310J3368j7138k2665
17418B54519j2413l0182l6082l0225k6842k5940q527j4963k0007k772n069j0207
$$ plain form
17406 31290 27378 20651 8978 7947 13170 9338 14393 23552 28415 27680 17452 11051 14459 25024
17392 25024 29227 34571 33866 16142 5732 11683 30402 29017 26535 25633 12677 11811 14552 19475
17378 19475 23154 21799 9728 10317 3321 4772 -1417 -449 -2529 -4675 -9675 -19494 -22710 -19226 -16744
17363 -16744 -4275 -3078 2713 3838 -12410 -15106 2073 7314 -12609 -16717 -21079 -7783 -1349
17350 -1349 12075 28679 37067 27755 22768 23586 32021 42945 36413 33383 36077 34164 25491 21623
17336 21623 28508 29554 20711 823 -4515 -2751 -10903 -12966 -11427 -24114 -23788 -10013 439 -79
17322 -79 2882 3716 -3650 5817 9881 601 -11395 -16955 -12149 -3233 -6218 3924 7582 8883 10569
17307 10569 13340 2469 -3145 1631 13786 17290 12584 14427 8671 -353 15763 31614 21388
$$ packed form
17406C1290l912o727j1673j031N223l832N055R159M863p35j0228o401L408J0565
17392B5024M203N344p05j7724j0410N951J8719j385k482r02j2956q66K741M923
17378A9475L679j355j2071N89o996J451o189R68k080k146n000r819l216L484K482
17363a6744J2469J197N791J125j6248k696J7179N241j9923m108m362J3296O434
17350a349J3424J6604Q388r312m987Q18Q435J0924o532l030K694j913q673l868
17336B1623O885J046q843j9888n338J764q152k063J539j2687L26J3775J0452n18
17322g9K961Q34p366R467M064r280j1996n560M806Q916k985J0142L658J301J686
17307A0569K771j0871n614M776J2155L504m706J843n756r024J6116J5851j0226
$$ plain form
17294 21388 12053 4448 3908 11146 9252 13305 394 -2988 -1315 -16966 -20003 -6417 2675 18866
17280 18866 15653 24444 30688 18084 -7277 -30600 -27095 -21473 -26528 -18992 2163 7111 8177
17267 8177 8651 2802 5822 -3691 -5430 150 11407 29216 26735 25131 25565 30970 27345 18738 18170
17252 18170 14409 14413 17565 21251 48986 82059 90505 96853 94448 84970 76141 77636 72945 77464 104134
17237 104134 148350 218551 305264 417649 503906 512178 475597 454077 468398 455404 403617
17226 403617 308663 217442 156568 125408 84471 43132 16035 20478 13335 15623 21810 9548
17214 9548 6877 13138 15148 2182 17837 38648 27196 15207 10844 16359 9540 10903 15982
17201 15982 6699 -2069 1918 9567 10104 265 -5824 -3309 1823 14256 27260 33790 40757 44724
$$ packed form
17294B1388r335p605n40P238j894M053j2911l382J673j5651l037J3586R092J6191
17280A8866l213Q791O244j2604k5361k3323L505N622n055P536K1155M948J066
17267H177M74n849L020r513j739N580J1257J7809k481j604M34N405l625q607n68
17252A8170l761ML152L686K7735L3073Q446O348k405r478q829J495m691M519K6670
17237A04134M4216P0201Q6713J12385Q6257Q272l6581k1520J4321j2994n1787
17226D03617r4954r1221o0874l1160m0937m1339k7097M443p143K288O187j2262
17214I548k671O261K010j2966J5655K0811j1452j1989m363N515o819J363N079
17201A5982r283q768L987P649N37r839o089K515N132J2433J3004O530O967L967
$$ plain form
17187 44724 80997 123353 166547 202961 280715 357878 419812 422196 421734 443672 463891 468950
17175 468950 411211 314228 218900 145004 101784 67375 53418 45956 52459 64819 65252 58696
17163 58696 57119 55997 42293 24608 7763 -2127 -15689 -7549 15002 17426 11981 1475 -5900
17150 -5900 -22526 -22579 -9116 -1355 6941 13223 5353 -10463 -17622 469 2098 -9082 -9665 672
17136 672 5360 -3384 -2306 7737 7705 108 -9770 -9253 -11837 -24375 -12841 -3723 -11534 -4429 9371
17121 9371 4073 -16646 -24537 -18282 -22943 -20083 -15702 -13510 -10282 -13002 -15821 -18502 -38291 -39395
17107 -39395 -40403 -28947 -29359 -20104 -11685 -7348 -4221 4454 -5011 -14123 -10558 -10561 -722 -5107 -28387
17092 -28387 -20566 -19480 -16005 -2901 4379 1298 -4681 -295 -8498 -9242 -4172 -11536 -15215 -9497
$$ packed form
17187D4724L6273M2356M3194L6414P7754P7163O1934K384m62K1938K0219N059
17175D68950n7739r6983r5328p3896m3220l4409j3957p462O503J2360M33o556
17163E8696j577j122j3704j7685j6845r890j3562Q140K2551K424n445j0506p375
17150e900j6626n3J3463P761Q296O282p870j5816p159J8091J629j1180n83J0337
17136F72M688q744J078J0043l2p597r878N17k584j2538J1534R118p811P105J3800
17121I371n298k0719p891O255m661K860M381K192L228k720k819k681j9789j104
17107c9395j008J1456m12R255Q419M337L127Q675r465r112L565lR839m385k3280
17092b8387P821J086L475J3104P280l081n979M386q203p44N070p364l679N718
$$ plain form
17078 -9497 -18373 -11922 249 6574 29 -2611 -3872 -12647 -26249 -16561 -11459 -35462 -38793 -23987
17064 -23987 -8803 -11057 -11424 -11263 -19987 -21211 -30415 -30898 -17188 -13783 1923 5908 -3425 -2243
17050 -2243 6855 -1641 -9032 -7651 7734 1349 -10369 -13531 -3996 -5444 -18774 -36651 -32966 -29518
17036 -29518 -32189 -28484 -25535 -27044 -25058 -31315 -27955 -18144 -11822 2240 4666 -11036 -17634 -23211
17022 -23211 -38114 -41601 -35878 -17127 -13390 -19433 -15603 -24254 -20378 -8339 -8913 -25101 -27082 -22816
17008 -22816 -26090 -18837 -8984 -16949 -19031 -12539 -5517 -1685 10376 13043 2678 -2303 -17358 -26447
16994 -26447 -25826 -24492 -16571 -6589 -8476 -20853 -35160 -40313 -41796 -27623 -18596 -27096 -25243 -14214
16980 -14214 -7177 -13811 -13168 -13867 -6107 -11619 -12327 -13427 -27908 -36701 -28132 -22060 -13490 -22648 -25065
$$ packed form
17078i497q876O451J2171O325o545k640j261q775j3602R688N102k4003l331J4806
17064b3987J5184k254l67J61q724j224r204m83J3710L405J5706L985r333J182
17050b243R098q496p391J381J5385o385j1718l162R535j448j3330j7877L685L448
17036b9518k671L705K949j509J986o257L360R811O322J4062K426j5702o598n577
17022b3211j4903l487N723J8751L737o043L830q651L876J2039n74j6188j981M266
17008b2816l274P253R853p965k082O492P022L832J2061K667j0365m981j5055r089
16994b6447O21J334P921R982j887j2377j4307n153j483J4173R027q500J853J1029
16980a4214P037o634O43o99P760n512p08j100j4481q793Q569O072Q570r158k417
$$ plain form
16965 -25065 -18962 -18248 -26368 -30450 -12482 -13090 -21943 -19047 -17706 -23388 -9516 -2494 -2507 -11493 -29318
16950 -29318 -26055 -13390 -16452 -10743 -4400 -5931 -11101 -4636 2757 -2137 -7128 -7883 -4181 -15912
16936 -15912 -23373 -28750 -32948 -32762 -29857 -17845 -9652 -3181 5351 4959 -10799 -23377 -4981 11895
16922 11895 8954 4994 2322 -14119 -27012 -26917 -17657 -8766 -11011 -18714 -8738 10565 14632 565
16908 565 1343 -2272 -2290 -7481 -7494 -1750 7174 -1538 -9610 -20556 -31566 -22324 -18778 -19742 -14971 -8685
16892 -8685 -13135 -20397 -20477 -16451 -14002 -10687 -11091 7394 10041 5247 -2948 -10590 -13886 -22760 -28842
16877 -28842 -22071 -12919 -3537 -12174 -15352 -4416 -8171 -24619 -35992 -29228 -15513 -22190 -30013
16864 -30013 -23640 -9011 1618 5493 4309 9682 1240 -4925 -7461 -3987 -14688 -8332 -7210 -7213
$$ packed form
16965b5065O103P14q120m082J7968o08q853K896J341n682J3872P022j3q986j7825
16950b9318L263J2665l062N709O343j531n170O465P393m894m991p55L702j1731
16936a5912p461n377m198J86K905J2012Q193O471Q532l92j5758j2578J8396J6876
16922A1895k941l960k672j6441j2893R5R260Q891k245p703R976J9303M067j4067
16908E65P78l615j8n191j3N744Q924q712q072j0946j1010R242L546r64M771O286
16892h685m450p262q0M026K449L315m04J8485K647m794q195p642l296q874o082
16877b8842O771R152R382q637l178J0936l755j6448j1373O764J3715o677p823
16864c0013O373J4629J0629L875j184N373q442o165k536L474j0701O356J122l
$$ plain form
16850 -7213 -9838 -8884 -7848 -9959 -17355 -13715 -9218 -3059 -6601 -14229 -20780 -27749 -32977 -40369 -21656
16835 -21656 -14772 -8355 4031 8641 7623 -14541 -18404 -6867 4537 3825 1068 -11270 -292
16822 -292 -16723 -23052 -23642 -28763 -18618 -6681 -21555 -28121 -11481 439 280 -11034 -20516 -8106
16808 -8106 -9625 -9406 -19616 -33582 -18612 -6113 -10268 -18415 -19558 -20378 -15977 -18483 -16068 -10298
16794 -10298 -8832 -14515 -11051 -10213 -4403 -17049 -10854 8923 19565 17718 7593 -376 5763 -2241
16780 -2241 -16940 -19771 -23421 -25142 -29333 -27092 -20274 -22402 -33369 -36914 -27208 -10094 -7996 -20620
16766 -20620 -20474 -7045 -7009 -11513 -13631 -15005 -24583 -23365 -29888 -33580 -25197 -18526 183 -11934
16752 -11934 -22333 -14287 -2023 -4327 -9032 -11633 -4990 -5043 -12913 -10481 -3697 -10587 -16478 -14157
$$ packed form
16850g213k625R54J036k111p396L640M497O159l542p628o551o969n228p392J8713
16835b1656O884O417J2386M610j018k2164l863J1537J1404p12k757j2338J0978
16822b92j6431o329n90n121J0145J1937j4874o566J6640J1920j59j1314r482J2410
16808h106j519K19j0210j3966J4970J2499m155q147j143q20M401k506K415N770
16794a0298J466n683L464Q38N810j2646O195J9777J0642j847j0125p969O139q004
16780b241j4699k831l650j721m191K241O818k128j0967l545R706J7114K098j2624
16766b0620J46J3429L6m504k118j374r578J218o523l692Q383O671J8709j2117
16752a1934j0399Q046J2264k304m705k601O643n3p870K432O784o890n891K321
$$ plain form
16738 -14157 -3392 -2271 -7922 -19431 -13115 -6606 -7022 -21429 -28342 -27883 -17383 811 10993
16725 10993 -183 -22697 -28424 -15979 -3585 -13961 -11290 -9864 -14323 -12742 -5963 -9475 -8695
16712 -8695 -12959 -22393 -17073 -26411 -24674 -12464 -8361 -14455 -1032 -2389 2293 -1568 -19444 -23655
16698 -23655 -19371 -8103 -11495 -9666 1087 12476 -2391 -16285 1235 6190 -14190 -17125 -19348
16685 -19348 -26942 -25787 -19683 -14546 -17772 -10673 2894 -3126 -12951 -8631 5978 1451 -12655 -9390
16671 -9390 -9442 -20103 -32738 -35021 -40592 -27714 -12888 1086 -2096 -7798 -10711 -16520 -20856 -13108
16657 -13108 -6527 7496 822 -4904 -5423 -9719 -18562 -27919 -25284 -17542 -17060 -9027 -9355 -384 471
16642 471 -219 1939 84 866 5824 -4936 -11502 -17847 -15716 -7996 -20945 -16386 -10565 -4794 3374
$$ packed form
16738a4157J0765J121n651j1509O316O509m16j4407o913M59J0500J8194J0182
16725A0993j1176k2514n727J2445J2394j0376K671J426m459J581O779l512P80
16712h695m264r434N320r338J737J2210M103o094J3423j357M682l861j7876m211
16698b3655M284J1268l392J829J0753J1389j4867j3894J7520M955k0380k935k223
16685a9348p594J155O104N137l226P099J3567o020r825M320J4609m527j4106L265
16671i390n2j0661j2635k283n571J2878J4826J3974l182n702k913n809m336P748
16657a3108O581J4023o674n726n19m296q843r357K635P742M82Q033l28Q971Q55
16642D71o90K158j855P82M958j0760o566o345K131P720j2949M559N821N771Q168
$$ plain form
16627 3374 -24672 -42248 -46640 -40693 -27379 -32464 -33703 -37152 -31837 -21607 -28692 -33413 -22200
16614 -22200 -2865 -14844 -22403 -31349 -22273 -19444 -25473 -23207 -29505 -21693 -4529 -5940 -16442
16601 -16442 -11407 -11003 -22896 -23008 -19859 -9808 -7922 -18924 -25247 -32666 -21080 -2742 -2525 6379
16587 6379 -5832 -8405 -16092 -9914 -438 -333 -12819 -10404 -9032 -13128 -11522 -6998 -5977 -12894
16573 -12894 -11432 -14288 -17764 -23555 -33084 -33673 -34367 -33092 -33911 -40849 -34843 -19032 -3099 -19436
16559 -19436 -17703 -16960 -16226 -18544 -16622 -14714 -25186 -14901 -11738 -19516 -27582 -43466 -32756 -13186
16545 -13186 -6488 -16643 -15899 -10212 4184 3681 -15277 -14699 -18610 -16586 3276 14900 21691 18382
16531 18382 3241 -4248 -12441 -13226 -17541 -15422 -17807 -17889 -17049 -20737 -30506 -24132 -22037 -18271 -18832
$$ packed form
16627C374k8046j7576m392N947J3314n085j239l449N315J0230p085m721J1213
16614b2200J9335j1979p559q946R076K829o029K266o298P812J7164j411j0502
16601a6442N035M04j1893j12L149J0051J886j1002o323p419J1586J8338K17Q904
16587F379j2211k573p687O178R476J05j2486K415J372m096J606M524J021o917
16573a2894J462k856l476n791r529n89o94J275q19o938O006J5811J5933j6337
16559a9436J733P43P34k318J922J908j0472J0285L163p778q066j5884J0710J9570
16545a3186O698j0155P44N687J4396n03j8958N78l911K024J9862J1624O791l309
16531A8382j5141p489q193p85m315K119k385q2Q40l688r769O374K095L766n61
$$ plain form
16516 -18832 -27313 -25585 -18934 -19114 -18836 -24676 -20107 -11406 -1225 -444 -2023 -1780 10851 6980 -3803
16501 -3803 -13884 -23817 -29133 -37657 -40121 -25673 -18501 -16952 -15327 -17940 -36463 -29170 -16600 -12153
16487 -12153 -3694 684 1201 17836 20635 11675 2165 6635 14521 1555 -4622 -19438 -31435 -22482
16473 -22482 -17411 -20310 -19909 -20532 -10314 -4358 4053 -6888 -25068 -34175 -32892 -30457 -26173 -10128
16459 -10128 -7560 -10275 -14132 -14197 -6418 -3417 -9432 -15943 -8896 -4195 -6926 -16087 -24285 -28331 -22481
16444 -22481 -8244 4494 499 -15420 -26239 -28855 -8124 451 -1244 -1521 3865 -91 -11688
16431 -11688 -13869 -9450 -4306 -6456 -5975 -7303 -7202 -5200 -4441 -2221 -23258 -27028 -22642 -18742 -14828
16416 -14828 -17078 -12854 -24585 -13970 -17356 2172 4531 -734 5747 8048 8581 6691 761 -4527
$$ packed form
16516a8832q481J728O651j80K78n840M569Q701J0181P81j579K43J2631l871j0783
16501c803j0081r933n316q524k464J4448P172J549J625k613j8523P293J2570M447
16487a2153Q459M378N17J6635K799q960r510M470P886j2966o177j4816j1997Q953
16473b2482N071k899M01o23J0218N956Q411j0941j8180r107J283K435M284J6045
16459a0128K568k715l857o5P779L001o015o511P047M701k731r161q198m046N850
16444b2481J4237J2738l995j5919j0819k616K0731Q575j695k77N386l956j1597
16431a1688k181M419N144k150M81j328J01K002P59K220k1037l770M386L900L914
16416a4828k250M224j1731J0615l386J9528K359n265O481K301N33j890n930n288
$$ plain form
16402 -4527 7711 15550 15200 8143 73 -2034 2265 11545 -6862 -7279 -6423 -6861 -4363 -1125 -4407
16387 -4407 -7257 -14614 -29459 -28876 -21481 -20194 -20155 -9106 -5931 -8050 -209 -1006 -6612 5928 1512
16372 1512 -10390 -2163 8633 1651 -358 919 -1600 -14041 -12259 -26 9341 -826 -9256
16359 -9256 -5874 -2531 -19111 -19437 -11031 -13173 -2820 6524 14078 17169 -10821 -23555 -26950 -19258
16345 -19258 -19141 -9872 2177 4681 3521 -6307 -341 -10082 -20419 -24584 -15679 2536 4897 73
16331 73 -9238 -14379 -18124 -923 8891 1672 -7369 -11372 -3438 -7611 -24114 -28690 -26277 -19942 -6118
16316 -6118 -3107 -9248 -8282 -9374 -2378 -2430 -6256 -10449 -13665 -25438 -11877 -3208 -5142 1283 4522
16301 4522 2419 4689 1047 -9724 -14012 -12445 -1415 3536 59 -13891 -18297 -21235 -19741 -13114
$$ packed form
16402d527J2238P839l50p057q070k107M299R280j8407m17Q56m38K498L238l282
16387d407k850p357j4845N83P395J287L9J1049L175k119P841p97n606J2540m416
16372A512j1902Q227J0796o982k009J277k519j2441J782J2233R367j0167q430
16359i256L382L343j6580l26Q406k142J0353R344P554L091k7990j2734l395P692
16345a9258J17R269J2049K504j160r828N966r741j0337m165Q905J8215K361m824
16331G3r311n141l745J7201R814p219r041m003P934m173j6503m576K413O335J3824
16316f118L011o141R66j092O996n2l826m193l216j1773J3561Q669j934O425L239
16301D522k103K270l642j0771m288J567J1030M951l477j3950m406k938J494O627
$$ plain form
16287 -13114 -15301 -20620 -21406 -25933 -20113 -18620 -16515 -17079 -26323 -32406 -28908 -19184 -6943 -11474 -15114
16272 -15114 -8343 1703 2448 -10828 -14336 -10371 -4647 -2333 -9585 -9515 -21349 -14997 -32567 -42002
16258 -42002 -30651 -13903 -7539 -8931 -14601 -28007 -25150 -18278 -14363 -9325 -691 5225 3530 -4259
16244 -4259 -9992 -956 684 -6678 -12195 -6627 1447 9420 11354 12823 5012 1818 14381 17779
16230 17779 3705 -4738 -7920 -17370 -19919 -20300 -20090 -33827 -35338 -28414 -17981 -11105 -4445 3374
16216 3374 -1904 9544 3518 -866 -8315 -14154 -5313 20177 15655 -1113 -4609 2853 -7347 -13408
16202 -13408 -16280 -13541 -13721 -25136 -24890 -16065 -7229 -19016 -16991 -17543 -6754 2848 6917 2798
16188 2798 9198 14325 -3228 -15314 -4724 9663 10230 8806 3758 6599 3098 -5136 -10925 -6439
$$ packed form
16287a3114k187n319p86m527N820J493K105n64r244o083L498R724J2241m531l640
16272a5114O771J0046P45j3276l508L965N724K314p252P0j1834O352j7570r435
16258d2002J1351J6748O364j392n670j3406K857O872L915N038Q634N916j695p789
16244d259n733R036J640p362n517N568Q074P973J934J469p811l194J2563L398
16230A7779j4074q443l182r450k549l81K10j3737j511O924J0433O876O660P819
16216C374n278J1448o026m384p449n839Q841K5490m522j6768l496P462j0200o061
16202a3408k872K739j80j1415K46Q825Q836j1787K025n52J0789R602M069m119
16188B798O400N127j7553j2086J0590J4387N67j424n048K841l501q234n789M486
$$ plain form
16174 -6439 7228 193 -3477 -7907 -19891 -24091 -15748 -9234 -4315 15072 17498 11195 3873 15188
16160 15188 13643 907 -3611 -5414 -11251 4670 8460 -7795 -5039 3716 -4854 805 -13141
16147 -13141 -12065 -9218 -15814 -3545 -1323 -9151 -19388 -19831 -22113 -24200 -25562 -9880 -1225 1535
16133 1535 7256 8983 -5043 -9752 -13665 -16622 -9684 3880 12558 10938 11953 10012 720 -6753
16119 -6753 -9146 -4103 2121 -9720 -20564 -12876 -2598 5729 1490 -3420 -462 5948 11788 9930
16105 9930 6564 -6503 -26776 -23370 -25863 -25567 -25774 -22205 -10238 -1936 4575 -1634 -29304 -23840
16091 -23840 -12498 -8332 772 9465 6304 4481 -7687 -21715 -28863 -33273 -17773 -2422 5968
16078 5968 -359 517 10159 10943 -3337 -13357 -9242 -4186 -9047 -24809 -39061 -28510 -17226 -18191
$$ packed form
16174f439J3667p035l670m430j1984m200Q343O514M919J9387K426o303p322J1315
16160A5188j545j2736m518j803n837J5921L790j6255K756Q755q570N659j3946
16147a3141J076K847o596J2269K222p828j0237m43k282k087j362J5682Q655K760
16133A535N721J727j4026m709l913k957O938J3564Q678j620J015j941r292p473
16119f753k393N043O224j1841j0844P688J0278Q327m239m910K958O410N840j858
16105I930l366j3067k0273L406k493K96k07L569J1967Q302O511o209k7670N464
16091b3840J1342M166R104Q693l161j823j2168j4028p148m410J5500J5351Q390
16078E968o327Q76R642P84j4280j0020M115N056m861j5762j4252J0551J1284r65
$$ plain form
16064 -18191 -15690 -13852 -15874 -16294 -16713 -20388 -14049 3355 -3402 -5626 4781 26275 25293 13026
16050 13026 12305 9626 1163 -7221 -8156 -1974 2108 9061 -5850 -12988 -24551 -18200 -5741 9407
16036 9407 6064 -5656 -20275 -22914 -24075 -21179 -20831 -19587 -11616 -12227 -11550 -11061 -11678 -8438 715
16021 715 7322 10146 10004 3473 -9385 -11854 -16586 -24915 -7258 894 -11589 -20310 -21684 -13905
16007 -13905 -24517 -27871 -22303 -19477 -19842 -2840 -4038 -6367 -7834 -17121 -10654 -1423 4019 6480
15993 6480 -17251 -23931 -13657 9050 521 -11000 -19035 -20788 -22262 -21640 -9508 -1156 3269 -3035
15979 -3035 -18537 -37884 -45583 -28401 -32585 -33168 -28012 -18754 -18235 -21684 -15157 -13522 -2826 14182
15965 14182 9658 10165 5553 11756 6918 18237 11228 -2283 3985 1153 -7229 -18979 -29105 -24074
$$ packed form
16064a8191K501J838k022m20m19l675O339J7404o757k224J0407K1494r82j2267
16050A3026p21k679q463q384r35O182M082O953j4911p138j1563O351J2459J5148
16036I407l343j1720j4619k639j161K896L48J244P971o11O77M89o17L240R153
16021G15O607K824j42o531j2858k469m732q329J7657Q152j2483q721j374P779
16007a3905j0612l354N568K826l65J7002j198k329j467r287O467R231N442K461
15993F480k3731o680J0274K2707q529j1521q035j753j474O22J2132Q352M425o304
15979c035j5502j9347p699J7182m184n83N156R258N19l449O527J635J0696J7008
15965A4182m524N07m612O203m838J1319p009j3511O268k832q382j1750j0126N031
$$ plain form
15951 -24074 -5351 316 2135 5035 -2445 65 -11503 -27589 -21012 -22310 -30378 -20629 -14024 -12322
15937 -12322 -21154 -29848 -25588 -16499 -30090 -32606 -30353 -15802 -794 -11337 -28034 -17199 -16164
15924 -16164 -17249 -3378 3540 -303 -1880 -4287 62 3921 8058 -7160 -16260 -12772 -3460 -7761
15910 -7761 -8563 -6624 2469 5943 3308 -6416 -9880 504 12399 14587 2567 -11000 -13440 179
15896 179 15710 9104 398 -6425 -7544 1620 -8361 -10385 -16643 -17898 -11464 -8434 -24354 -40913
15882 -40913 -35676 -28968 -27240 -31233 -29539 -35904 -22365 -13794 -11510 -13348 -11633 -8450 -14433 -13835
15868 -13835 -3053 5300 15017 26588 21323 -10387 -15758 -584 6158 16266 18329 4637 676
15855 676 -12856 -7210 -18965 -16218 -1401 7655 3472 -3985 -10789 -11353 -5832 5355 4934 -11339
$$ packed form
15951b4074J8723N667J819K900p480K510j1568j6086O577j298q068R749O605J702
15937a2322q832q694M260R089j3591k516K253J4551J5008j0543j6697J0835J035
15924a6164j085J3871O918l843j577k407M349L859M137j5218r100L488R312m301
15910g761q02J939R093L474k635r724l464J0384J1895K188j2020j3567k440J3619
15896A79J5531o606q706o823j119R164r981k024o258j255O434L030j5920j6559
15882d0913N237O708J728l993J694o365J3539Q571K284j838J715L183n983N98
15868a3835J0782Q353R717J1571n265l1710n371J5174O742J0108K063j3692l961
15855F76j3532N646j1755K747J4817R056m183p457o804n64N521J1187m21j6273
$$ plain form
15841 -11339 -23543 -22559 -1802 -1940 -16720 -16781 -14033 -7581 -11275 -13492 -11118 -419 4831 -558
15827 -558 -7369 -12422 -8046 135 5177 -2217 -11191 -10195 -15293 -15957 -20584 -18781 -28887 -20334 -6434
15812 -6434 -3019 -7440 -25320 -36776 -27001 -24287 -27497 -21637 -13755 -1620 -10965 -12133 -17416 -23924
15798 -23924 -22429 -14626 -7894 -14777 -7684 830 4120 -4882 -20580 -16085 -12138 -11662 -18487 -11339
15784 -11339 -12435 -21357 -12003 190 -6234 -15814 -9452 3441 12386 8433 3582 -1014 -444 -1430
15770 -1430 -1036 -850 8978 7240 11846 5084 1310 -9827 -26401 -35742 -33114 -31668 -17528 -6859
15756 -6859 -11077 13588 28858 20457 3467 1128 9328 3192 -9140 -14661 -12634 -14446 -16305 -5239
15742 -5239 -10822 -15099 -27750 -22736 1385 9917 2279 -5043 -16230 -16733 -18166 -4138 -11416 -18752
$$ packed form
15841a1339j2204R84K0757j38j4780o1K748O452l694k217K374J0699N250n389
15827e58o811n053M376Q181N042p394q974R96n098o64m627J803j0106Q553J3900
15812f434L415m421j7880j1456R775K714l210N860P882J2135r345j168n283o508
15798b3924J495P803O732o883P093Q514L290r002j5698M495L947M76o825P148
15784a1339j096q922R354J2193o424r580O362J2893Q945l953m851m596N70r86
15770a430L94J86R828j738M606o762l774j1137j6574r341K628J446J4140J0669
15756f859m218K4665J5270q401j6990k339Q200o136j2332n521K027j812j859J1066
15742e239n583m277j2651N014K4121Q532p638p322j1187n03j433J4028p278p336
$$ plain form
15728 -18752 -17977 -22162 -38080 -39058 -28393 -23476 -17273 -4297 -1179 -13569 -25508 -31463 -15412
15715 -15412 -8172 -21638 -36406 -28689 -10905 1692 5335 777 11804 14428 -5020 -3103 -2654
15702 -2654 -5564 -587 2266 1313 8971 10847 -4636 -22714 -15088 -227 2486 -12034 -11462 -5188
15688 -5188 -13961 -21085 -18982 -9021 -12129 -8861 -11836 -19807 -24078 -24249 -30925 -35984 -14078 4686
15674 4686 13355 7104 -7789 -13250 3517 9384 8345 13976 12675 2256 -4486 -322 4856 39
15660 39 3269 4683 11499 12953 8679 -1791 -12981 -12596 5655 13839 5872 9129 15224 6292 -6833
15645 -6833 -192 9128 11215 15790 22956 19872 9399 3165 4663 718 -14325 -13007 -23419 -21228
15631 -21228 -12031 -12337 -4214 -11476 -2549 9221 10064 7538 -1215 -4552 4613 -8872 -25645 -19185
$$ packed form
15728a8752P75m185j5918r78J0665M917O203J2976L118j2390j1939n955J6051
15715a5412P240j3466j4768P717J7784J2597L643m558J1027K624j9448J917M49
15702b654k910M977K853r53P658J876j5483j8078P626J4861K713j4520N72O274
15688e188q773p124K103R961l108L268k975p971m271j71o676n059K1906J8764
15674D686Q669o251j4893n461J6767N867j039N631j301j0419o742M164N178m817
15660C9L230J414O816J454m274j0470j1190L85J8251Q184p967L257O095q932j3125
15645f833O641R320K087M575P166l084j0473o234J498l945j5043J318j0412K191
15631b1228R197l06Q123p262Q927J1770Q43k526q753l337R165j3485j6773O460
$$ plain form
15617 -19185 -11378 -5693 -1445 -515 445 -3038 2052 8466 17399 21409 21886 7165 3118 23919 31439
15602 31439 17633 18415 2779 -11743 -15517 -5627 -12683 -19229 -18410 -30017 -27337 -12236 -4187 9338
15588 9338 25933 17769 -1798 -15496 -11291 -5018 -5553 3849 -1553 -1934 3059 2927 -4850 -9589 -24894
15573 -24894 -24105 -12784 -427 12205 15764 13148 12810 15721 11800 5331 -383 2445 8923 10915
15559 10915 3298 3935 -11158 -10652 12372 9426 602 -2003 -3955 -3891 -15326 -24811 -32558 -32260 -14390
15544 -14390 -7542 -3678 449 -3630 -2234 7223 9158 6759 1146 -811 4625 7569 2462 -4062
15530 -4062 -6912 2874 15648 7651 -7643 -9449 -16593 -21609 -26476 -27742 -23225 -10682 -1336 1367
15516 1367 1073 -1948 7312 26191 19431 20185 6923 -1882 8603 10558 11204 13811 1781 -9500
$$ packed form
15617a9185P807N685M248R30R60l483N090O414Q933M010M77j4721m047K0801P520
15602C1439j3806P82j5636j4522l774R890p056o546Q19j1607K680J5101Q049J3525
15588I338J6595q164j9567j3698M205O273n35R402n402l81M993j32p777m739j5305
15573b4894P89J1321J2357J2632L559k616l38K911l921o469n714K828O478J992
15559A0915p617O37j5093N06K3024k946q824k605j952O4j1435r485p747K98J7870
15544a4390O848L864M127m079J396R457J935k399n613j957N436K944n107o524
15530d062k850R786J2774p997j5294j806p144n016m867j266M517J2543R346K703
15516A367k94l021R260J8879o760P54j3262q805J0485J955O46K607j2030j1281
$$ plain form
15502 -9500 -20602 -17034 -15214 -9763 -9161 -6264 -4916 -19764 -15085 -9131 -5745 350 -4471 -8871
15488 -8871 -19837 -20477 -14309 -1653 944 -7062 284 6010 11940 679 8432 10656 12559 6778
15474 6778 8622 20234 16212 625 -6778 -4885 -4487 -4625 -10607 -3200 -5386 -10124 -10914 -16322 -20029
15459 -20029 -5913 -418 -3201 -5312 -2909 9645 12514 5147 -4116 -6770 -4825 -11419 -14933 -8562
15445 -8562 5729 12285 5603 -2692 7039 18121 12263 4341 -929 187 1278 -2578 -5264 -4932
15431 -4932 -11531 -4005 -4840 -6259 4123 6732 10708 18560 23582 17725 7121 10399 5663 2419
15417 2419 -4163 3442 5388 2596 -9529 -12964 -13423 -19414 -16054 -20239 -11974 -6050 6102 3118
15403 3118 -10138 -16534 -23100 -20451 -1252 13680 13732 6125 5452 2876 7297 6229 6739 7720 594
$$ packed form
15502i500j1102L568J820N451O02K897J348j4848M679N954L386O095m821m400
15488h871j0966o40O168J2656K597q006P346N726N930j1261P753K224J903n781
15474F778J844J1612m022j5587p403J893L98j38n982P407k186m738p90n408l707
15459b0029J4116N495k783k111K403J2554K869p367r263k654J945o594l514O371
15445h562J4291O556o682q295R731J1082n858p922n270J116J091l856k686L32
15431d932o599P526q35j419J0382K609L976P852N022n857j0604L278m736l244
15417B419o582P605J946k792j2125l435m59n991L360m185Q265N924J2152k984
15403C118j3256o396o566K649J9199J4932N2p607o73k576M421j068N10R81p126
$$ plain form
15388 594 -4785 -1978 -1311 -3679 -1992 -9081 -15864 -10683 -15618 -10275 2977 10516 -352 -3247 5297
15373 5297 8219 1888 4954 2120 -3906 1205 5203 10025 11075 8888 1076 -6700 -1423 11341
15359 11341 5182 -5763 -9453 -4899 -3116 7174 15670 4633 645 10473 13909 15461 2617
15346 2617 7266 11105 20809 31553 27872 19814 14579 -2375 -6397 -980 4425 209 -14609 -18927
15332 -18927 -23971 -13038 -21456 -23767 -14219 -21486 -20591 -7507 -6999 -4534 -11698 -27044 -3124 12777
15318 12777 13667 12420 11002 4164 -3510 -6707 2769 -1222 -7166 -11792 -28276 -34425 -38425 -29833
15304 -29833 -2275 1810 1215 2821 -6609 -18782 -16406 -4690 10741 5106 -3210 -1848 -13853
15291 -13853 -14314 -8613 5983 4565 -2252 -6284 -7042 -3538 12435 17798 4938 447 5068 8372
$$ packed form
15388E94n379K807O67k368J687p089o783N181m935N343J3252P539j0868k895Q544
15373E297K922o331L066k834o026N111L998M822J050k187p812p776N277J2764
15359A1341o159j0945l690M554J783J0290Q496j1037l988R828L436J552j2844
15346B617M649L839R704J0744l681q058n235j6954m022N417N405m216j4818m318
15332a8927n044J0933q418k311R548p267Q95J3084N08K465p164j5346K3920J5901
15318A2777Q90j247j418o838p674l197R476l991n944m626j6484o149m000Q592
15304b9833K7558M085n95J606r430j2173K376J1716J5431n635q316J362j2005
15291a3853m61N701J4596j418o817m032p58L504J5973N363j2860m491M621L304
$$ plain form
15277 8372 2019 1179 3362 10366 4279 189 -3037 -1089 -10322 -12035 -11331 -18786 -7746 -3973 -3527
15262 -3527 -2019 -2573 -6059 -1461 -266 -7157 -11395 3496 21384 28653 28811 33264 25129 19396 22907
15247 22907 4967 1810 -6170 -21488 -12615 -874 11596 24222 20276 305 -24070 -20589 -1987
15234 -1987 648 -3569 9537 14348 6091 11524 14599 12075 16802 13334 15458 17042 18537 14628
15220 14628 12633 14927 8820 3894 1010 -4179 749 5803 5746 864 -18950 -20048 -13649 -14165 -4366
15205 -4366 13421 5318 -4333 -8773 -6262 -5736 -2818 -3583 -8180 -3640 -4871 -5678 10288 5483 -11384
15190 -11384 -13555 -13694 -13950 4655 6926 7477 4929 9971 9427 14340 9942 13620 31806 30540 26909
15175 26909 20813 4875 -3204 -9989 -14672 -6390 -6959 -4642 14121 8654 5586 211 -5525 -7341
$$ packed form
15277H372o353q40K183P004o087m090l226J948r233j713P04p455J1040L773M46
15262c527J508n54l486M598J195o891m238J4891J7888P269J58M453q135n733L511
15247B2907j7940l157p980j5318Q873J1741J2470J2626l946j9971k4375L481J8602
15234a987K635m217J3106M811q257N433L075k524M727l468K124J584J495l909
15220A4628j995K294o107m926k884n189M928N054n7m882j9814j098O399n16R799
15205d366J7787q103r651m440K511N26K918p65m597M540j231q07J5966m805j6867
15190a1384k171j39k56J8605K271N51k548N042n44M913m398L678J8186j266l631
15175B6909o096j5938q079o785m683Q282n69K317J8763n467l068n375n736j816
$$ plain form
15161 -7341 -17002 -24685 -14484 -7194 1622 10740 11561 2806 -675 9742 15626 15679 19764 19252 7917
15146 7917 4033 3407 1007 9194 -4861 -21241 -34739 -37087 -37547 -25167 1094 7016 -6549 -6743
15132 -6743 -12879 -21997 -19482 -18248 -24581 -5093 5005 7697 5971 4678 4121 8220 7999 310 -10671
15117 -10671 -4535 -3679 16468 24204 16433 18183 10157 8995 6619 -3842 -15146 -8724 -264 7756
15103 7756 19025 2100 -3897 4725 10418 11669 4988 -1057 14527 14959 15388 20325 17533 17364 5716
15088 5716 -209 569 9023 8369 -2587 -19090 -14060 -15636 -18771 -6745 6940 7898 7285 17892
15074 17892 14661 24509 30260 35815 29688 20494 25090 33993 33757 34951 25062 16223 13128 7885 524
15059 524 3507 5792 9037 15344 12770 17965 7855 -6582 -489 20239 29453 22970 22020 17598
$$ packed form
15161g341r661p683J0201P290Q816R118Q21q755l481J0417N884N3M085n12j1335
15146G917l884o26k400Q187j4055j6380j3498k348m60J2380K6261N922j3565j94
15132f743o136r118K515J234o333J9488J0098K692j726j293n57M099k21p689j0981
15117a0671O136Q56K0147P736p771J750q026j162k376j0461j1304O422Q460Q020
15103G756J1269j6925n997Q622N693J251o681o045J5584M32M29M937k792j69j1648
15088E716n925P78Q454o54j0956j6503N030j576l135J2026J3685R58o13J0607
15074A7892l231R848N751N555o127r194M596Q903k36J194r889q839l095n243p361
15059E24K983K285L245O307k574N195j0110j4437O093K0728R214o483r50m422
$$ plain form
15045 17598 4309 14466 22331 23888 7365 -5001 -803 -3219 -2079 -6984 -688 8472 9387 9567
15031 9567 8832 17391 39467 55834 56147 47565 34354 26579 19453 8716 7979 21713 33667 39771
15017 39771 39719 32574 20345 13187 14185 15640 35085 49879 54103 59882 62678 62508 69928 101852
15003 101852 129763 181818 273075 450101 744214 1054769 1231591 1148094 841402 545678
14993 545678 349630 230653 162487 116039 88115 77784 57529 49367 47093 37857 33344 34824
14981 34824 29533 17066 4476 5092 13542 22740 34639 34606 25087 12249 15146 19640 27247 24900
14967 24900 32457 27972 33649 42458 34420 26572 14575 13383 13799 24514 29497 15453 4214 -5055
14953 -5055 2191 16056 28344 32089 32888 31010 21928 14191 20988 24339 15689 1870 12749 18438
$$ packed form
15045A7598j3289J0157P865J557j6523j2366M198k416J140m905O296R160R15J80
15031I567p35Q559K2076J6367L13q582j3211p775p126j0737p37J3734J1954O104
15017C9771n2p145j2229p158R98J455J9445J4794M224N779K796j70P420L1924
15003A01852K7911N2055R1257J77026K94113L10555J76822q3497l06692k95724
14993E45678j96048j18977o8166m6448k7924j0331k0255q162k274r236m513J480
14981C4824n291j2467j2590O16Q450R198J1899l3r519j2838K897M494P607k347
14967B4900P557m485N677Q809q038p848j1997j192M16J0715M983j4044j1239r269
14953e055P246J3865J2288L745P99j878r082p737O797L351q650j3819J0879N689
$$ plain form
14939 18438 13133 5353 13966 146 -7049 -3167 -8403 -8531 1713 1278 -13749 -8840 714 7956
14925 7956 -321 -7204 3484 7587 -5178 -9167 17060 25080 24089 20367 13500 9065 24153 28520
14911 28520 26883 27506 31095 34980 29050 17792 8050 2662 4954 20190 22114 15783 11308 12866
14897 12866 11541 4237 -1580 -15476 -24462 -25981 -15508 -5459 6871 12147 4990 -8412 8351
14884 8351 18169 10633 9121 16314 19315 20073 12018 17499 19858 23611 19483 5307 1754 6197 19701
14869 19701 19964 25582 19195 1329 1315 13625 12137 4496 17630 25898 24778 17598 14585 5430
14855 5430 -992 4341 942 -1102 1490 -1166 -12401 -4742 1517 -8847 -8342 205 -516 5689 -3275
14840 -3275 -4864 -6031 1458 -2121 -2032 -1639 -4925 -6485 1195 7683 13231 7113 -774 528 -6301
$$ packed form
14939A8438n305p780Q613j3820p195L882n236j28J0244m35j5027M909R554P242
14925G956q277o883J0688M103j2765l989K6227Q020r91l722o867m435J5088M367
14911B8520j637O23L589L885n930j1258r742n388K292J5236J924o331m475J558
14897A2866j325p304n817j3896q986j519J0473J0049J2330N276p157j3402J6763
14884H351R818p536j512P193L001P58q055N481K359L753m128j4176l553M443J3504
14869A9701K63N618o387j7866j4J2310j488p641J3134Q268j120p180l013r155
14855E430o422N333l399k044K592k656j1235P659O259j0364N05Q547p21O205q964
14840c275j589j167P489l579Q9L93l286j560P680O488N548o118p887J302o829
$$ plain form
14825 -6301 -13056 -13522 -3147 15177 27213 31316 25142 8445 -5926 1730 15735 26095 20487
14812 20487 14365 7709 4808 4434 12838 12717 15631 19561 9122 -2660 -2086 7656 15327 25083 19322
14797 19322 3068 503 -4878 -2549 -2803 -5676 -12609 -11841 -6786 -2687 6956 13437 26404 18090
14783 18090 -5868 -11901 -10969 -3972 -5617 -13134 -8424 -1261 -4686 4194 10617 8975 10690 -5646
14769 -5646 -7815 -2162 13347 1553 -15836 -28231 -15947 3520 2697 10155 6340 9551 18076
14756 18076 8498 7010 -3610 -11862 6650 5931 -12930 -4278 772 8876 10857 5905 22558 26662
14742 26662 13037 15071 21103 11512 4746 10293 13385 23605 19779 10144 8892 28727 21668 24839
14728 24839 27741 28828 21206 16131 17401 15456 4828 8628 17982 15698 13168 6636 -14596 -16585
$$ packed form
14825f301o755m66J0375J8324J2036M103o174j6697j4371P656J4005J0360n608
14812B0487o122o656k901l74Q404j21K914L930j0439j1782N74R742P671R756n761
14797A9322j6254k565n381K329k54k873o933P68N055M099R643O481J2967q314
14783A8090k3958o033R32O997j645p517M710P163l425Q880O423j642J715j6336
14769e646k169N653J5509j1794j7389j2395J2284J9467q23P458l815L211Q525
14756A8076r578j488j0620q252J8512p19j8861Q652N050Q104J981m952J6653M104
14742B6662j3625K034O032r591o766N547L092J0220l826r635j252J9835p059L171
14728B4839K902J087p622n075J270j945j0628L800R354k284k530o532k1232j989
$$ plain form
14714 -16585 -15455 -21289 -11683 7788 12770 16155 24572 25427 19831 17972 15831 13264 13487 9792 1704
14699 1704 -27 7236 13834 1176 6727 12023 16032 22095 11349 4819 6596 12060 16331 16358 18316
14684 18316 11023 4354 4806 11623 12226 4653 10721 3062 4491 2324 8855 5182 9400 17385 12267
14669 12267 17869 15239 17811 26710 25064 19674 11369 6757 14387 23619 22278 27417 25141 18752
14655 18752 8536 10069 27957 32644 8257 2179 6313 -2959 10421 20436 10615 9457 4456
14642 4456 1535 -2464 1654 7948 13412 6907 7261 -3802 -13403 -8836 12129 13961 13237 20977 4518
14627 4518 -191 12117 13978 22721 15721 12177 17414 20444 21762 12269 8492 3311 -5366 -5096 -4032
14612 -4032 -4452 13080 30092 31419 39734 32892 21940 36896 33538 38038 22233 20161 24096 29491
$$ packed form
14714a6585J130n834R606J9471M982L385Q417Q55n596j859k141k567K23l695q088
14699A704j731P263O598j2658N551N296M009O063j0746o530J777N464M271K7J958
14684A8316p293o669M52O817O03p573O068p659J429k167O531l673M218P985n118
14669A2267N602k630K572Q899j646n390q305m612P630R232j341N139k276o389
14655A8752j0216J533J7888M687k4387o078M134r272J3380J0015r821j158n001
14642D456k921l999M118O294N464o505L54j1063r601M567K0965J832p24P740j6459
14627D518m709J2308J861Q743p000l544N237L030J318r493l777n181q677K70J064
14612d032m20J7532J7012J327Q315o842j0952J4956l358M500j5805k072L935N395
$$ plain form
14598 29491 25451 12116 -4856 5698 16872 9519 5206 5255 13358 19147 20097 20488 8814 -1495
14584 -1495 3382 21681 31414 28263 20198 17499 14035 -1062 -6545 -3189 -991 11851 10135 3978
14570 3978 -9645 -6360 8714 25696 41629 39239 25805 23432 18860 -2306 -9133 3254 5267
14557 5267 19622 16833 11110 3512 -9194 -8782 -2432 11504 29176 27423 30512 23178 12141 8072
14543 8072 4902 12052 20741 16719 21753 19591 22929 22058 24245 29527 48527 55475 32608 26301
14529 26301 26348 19641 6436 -2298 13208 17294 6699 13948 13791 8247 5197 17008 4978 4065
14515 4065 5982 5667 18450 19915 13708 11473 16118 29999 30554 24468 22587 15588 14421 23936 27662
14500 27662 17002 10210 12292 9576 -2521 -1149 12197 11767 -3925 2932 17116 20888 29136
$$ packed form
14598B9491m040j3335j6972J0554J1174p353m313M9Q103N789R50L91j1674j0309
14584a495M877J8299R733l151q065k699l464j5097n483L356K198J2842j716o157
14570C978j3623L285J5074J6982J5933k390j3434k373m572k1166o827J2387K013
14557E267J4355k789n723p598j2706M12O350J3936J7672j753L089p334j1037m069
14543H072l170P150Q689m022N034k162L338q71K187N282J9000O948k2867o307
14529B6301M7o707j3205q734J5506M086j0595P249j57n544l050J1811j2030r13
14515D065J917l15J2783J465o207k235M645J3881N55o086j881o999j167R515L726
14500B7662j0660o792K082k716j2097J372J3346m30j5692O857J4184L772Q248
$$ plain form
14487 29136 38440 29029 19921 19279 34313 48305 61149 50104 28176 11600 13729 18824 14494
14474 14494 20348 9237 1373 5217 12046 5309 -734 4175 19543 11593 9759 13406 12321 20001
14460 20001 23023 26656 26028 22139 24480 26429 22605 35336 48560 49506 47484 41633 39282 32214
14446 32214 31870 40942 40235 27576 13123 11834 13953 22547 24953 32926 32604 33705 36207 36711 22597
14431 22597 16736 20887 22930 35885 26490 12945 20247 19549 23925 24346 21834 12545 12944 23013
14417 23013 35375 34674 24203 27981 31568 21336 20664 18366 10333 17591 15108 27202 33321 33570
14403 33570 39056 34941 25544 24852 29913 26325 12671 20529 27297 30189 19908 15367 20184 22239
14389 22239 16970 8720 10543 6550 12601 22067 35325 38483 28035 17678 19860 12356 19271 31793
$$ packed form
14487B9136R304r411r108o42J5034J3992J2844j1045k1928j6576K129N095m330
14474A4494N854j1111p864L844O829o737o043M909J5368p950j834L647j085P680
14460B0001L022L633o28l889K341J949l824J2731J3224R46k022n851k351p068
14446C2214l44R072p07j2659j4453j289K119Q594K406P973l22J101K502N04j4114
14431B2597n861M151K043J2955r395j3545P302o98M376M21k512r289L99J0069
14417B3013J2362p01j0471L778L587j0232o72k298q033P258k483J2094O119K49
14403C3570N486m115r397o92N061l588j3654P858O768K892j0281m541M817K055
14389B2239n269q250J823l993O051R466J3258L158j0448j0357K182p504O915J2522
$$ plain form
14375 31793 43786 49943 40491 22975 16177 16481 15081 12685 14269 20302 18717 32191 33236 35444
14361 35444 29318 20626 14886 14242 20303 26642 28970 35038 45680 45928 39720 36268 37695 28080 22983
14346 22983 30168 34358 33512 35879 20616 31911 45882 35958 27490 21422 35143 49925 47309
14333 47309 43074 50544 46186 27255 16734 8872 17524 25163 24927 15556 19797 16339 14941 17982
14319 17982 19482 12124 29649 46014 52398 59007 48318 47126 40512 46961 29936 17056 31424
14306 31424 39770 25138 18223 9740 -1416 9263 22078 29935 35822 35681 40120 37282 36730 46271
14292 46271 41678 44287 47266 58945 56617 50683 44941 41183 37445 34952 34977 33824 29625 27632 30411
14277 30411 37028 34604 30941 26483 31556 30834 18730 6850 13780 28789 37186 27419 16746 8435
$$ packed form
14375C1793J1993O157r452j7516o798L04j400k396J584O033j585J3474J045K208
14361C5444o126q692n740o44O061O339K328O068J0642K48o208l452J427r615n097
14346B2983P185M190q46K367j5263J1295J3971r924q468o068J3721J4782k616
14333D7309m235P470m358j8931j0521p862Q652P639k36r371M241l458j398L041
14319A7982J500p358J7525J6365O384O609j0689j192o614O449j7025j2880J4368
14306C1424Q346j4632o915q483j1156J0679J2815P857N887j41M439k838n52R541
14292D6271m593K609K979J1679k328n934n742l758l738k493K5j153m199j993K779
14277C0411O617k424l663m458N073p22j2104j1880O930J5009Q397r767j0673q311
$$ plain form
14263 8435 17552 28494 33178 50681 45770 37165 28367 39166 43122 30146 25193 29579 30053 37702
14249 37702 46120 51855 44461 38256 39151 33297 23562 10257 5965 17844 40184 55277 50074 50664
14235 50664 40032 36208 49217 64985 55937 56258 42483 20861 27388 38641 40533 51578 54382
14222 54382 35255 42052 45830 56314 69118 65589 45004 39578 51146 56778 51623 41740 28667
14209 28667 20231 27127 37776 48176 44485 34057 28997 33162 41036 38228 43300 46628 43111 48585
14195 48585 50060 41069 45460 50171 45654 39724 22617 8778 21693 23424 20492 17091 15959 10575
14181 10575 10224 19246 27916 21783 36416 37457 35798 42700 62597 74653 66779 72697 68572 44830
14167 44830 46088 43035 36970 26535 36620 38125 47898 56569 57330 49265 42419 51583 50271 49316
$$ packed form
14263H435R117J0942M684J7503m911q605q798J0799L956j2976m953M386M74P649
14249C7702Q418N735p394o205Q95n854r735j3305m292J1879K2340J5093n203N90
14235E0664j0632l824J3009J5768r048L21j3775k1622O527J1253J892J1045K804
14222E4382j9127O797L778J0484J2804l529k0585n426J1568N632n155r883j3073
14209B8667q436O896J0649J0400l691j0428n060M165P874k808N072L328l517N474
14195D8585J475q991M391M711m517n930j7107j3839J2915J731k932l401j132n384
14181A0575l51R022Q670o133J4633J041j659O902J9897J2056p874N918m125k3742
14167D4830J258l053o065j0435J0085J505R773Q671P61q065o846R164j312r55
$$ plain form
14153 49316 47176 49552 53360 48331 48085 42724 34792 32194 36263 39398 41247 58564 66667 65518
14139 65518 60550 67920 75627 59285 48596 49227 51126 55281 60476 63273 61856 59572 57879 47035
14125 47035 41956 39812 42224 44220 52631 52159 57512 62035 51864 40211 29659 41454 43613 40129
14111 40129 35322 31807 28701 20297 24105 25253 33840 47235 53215 47357 46083 39782 34560 39912
14097 39912 51395 56460 58960 60456 52028 41887 41749 54991 78157 77113 73138 61919 51422
14084 51422 61656 62975 50616 36948 40839 56985 56680 56006 61899 59808 58198 58399 58336 62748 69577
14069 69577 56939 48477 56798 64025 66694 58917 64919 65382 62476 63214 67213 61208 49422 53995
14055 53995 66982 91464 93765 80660 77055 79844 74445 75358 72777 82346 95195 81066 76366
$$ packed form
14153D9316k140K376L808n029k46n361p932k598M069L135J849J7317Q103j149
14139F5518m968P370P707j6342j0689O31J899M155N195K797j417k284j693j0844
14125D7035n079k144K412J996Q411m72N353M523j0171j1653j0552J1795K159l484
14111D0129m807l515l106q404L808J148Q587J3395N980n858j274o301n222N352
14097C9912J1483N065K500J496q428j0141j38J3242K3166j044l975j1219j0497
14084E1422J0234J319j2359j3668L891J6146l05o74N893k091j610K01o3M412O829
14069F9577j2638q462Q321P227K669p777O002M63k906P38L999o005j1786M573
14055E3995J2987K4482K301j3105l605K789n399R13k581R569J2849j4129m700
$$ plain form
14042 76366 100755 112361 124583 136381 148621 165412 203695 234942 283885 363763 460660 550494
14030 550494 630469 631558 561004 444794 341488 285614 249740 228910 228788 212487 212253 230160
14018 230160 273333 323664 390218 448529 482548 482780 428815 372060 350133 363361 406061 485334
14006 485334 578697 658015 696123 684854 610128 511032 415046 344865 313638 315354 331747 368446
13994 368446 420104 472522 498831 479991 422669 355299 296568 269143 259514 259278 269183 313938
13982 313938 370546 463300 576056 702428 795675 830930 759119 627925 493380 397798 356426
13971 356426 321237 309425 329572 382586 459294 568502 660915 692740 647881 546972 431665
13960 431665 354077 297888 263953 236375 222505 220851 241775 271093 313739 365656 437848 505608
$$ packed form
14042G6366K4389J1606J2222J1798J2240J6791L8283L1247M8943P9878R6897Q9834
14030E50494P9975J089p0554j16210j03306n5874l5874k0830j22j6301k34J7907
14018B30160M3173N0331O6554N8311L4019K32n3965n6755k1927J3228M2700P9273
14006D85334R3363P9318L8108j1269p4726r9096r5986p0181l1227J716J6393L6699
13994C68446N1658N2418K6309j8840n7322o7370n8731k7425r629k36R905M4755
13982C13938N6608R2754J12756J26372R3247L5255p1811j31194j34545r5582m1372
13971C56426l5189j1812K0147N3014P6708J09208R2413L1825m4859j00909j15307
13960D31665p7588n6189l3935k7578j3870j654K0924K9318M2646N1917P2192O7760
$$ plain form
13948 505608 519412 478343 429283 393721 391536 432343 495811 586746 673173 722509 718581 649153
13936 649153 541508 435259 372067 333129 306023 301654 337296 398262 463312 507900 512299
13925 512299 457857 385192 317635 268810 249892 249212 252202 288937 358359 424448 534633 668165
13913 668165 773236 815983 762571 637421 497605 393189 317732 249972 196746 168857 159471
13902 159471 136911 132959 136926 127140 108627 101519 103254 87490 86396 100897 106517 107511 101006
13889 101006 92736 91364 101146 112354 103736 86940 85927 83609 83469 74171 75125 82333 90187 83448
13875 83448 65969 59393 63962 74592 68659 71175 80842 99131 102605 94807 88641 82673 76314 83187
13861 83187 92077 105685 111902 128376 152122 183909 198044 205166 205820 196396 189563 179564 175217
$$ packed form
13948E05608J3804m1069m9060l5562k185M0807O3468R0935Q6427M9336l928o9428
13936F49153j07645j06249o3192l8938k7106m369L5642O0966O5050M4588M399
13925E12299n4442p2665o7557m8825j8918o80K990L6735O9422O6089J10185J33532
13913F68165J05071M2747n3412j25150j39816j04416p5457o7760n3226k7889r386
13902A59471k2560l952L967r786j8513p108J735j5764j094J4501N620R94o505
13889A01006q270j372R782J1208q618j6796j013k318j40r298R54P208P854o739
13875H3448j7479o576M569J0630n933K516R667J8289L474p798o166n968o359O873
13861H3187Q890J3608O217J6474K3746L1787J4135P122O54r424o833r999m347
$$ plain form
13848 175217 168743 148748 141113 136185 137691 135420 132355 126971 108272 91068 91818 86421 98199
13835 98199 96954 100351 127105 153990 177824 192743 195354 197157 198559 200092 195421 193742 184669
13822 184669 194021 199341 209387 232496 244238 232398 227468 226880 227397 225093 224149 214207 228673 230900
13808 230900 229210 226467 221847 226655 220416 217881 212074 207306 205418 208569 208961 206529 212190 224938
13794 224938 240606 242563 239890 214673 210945 218032 236219 237682 242242 247593 253031 259806 273030
13781 273030 271751 275200 264468 265070 285002 296549 309523 325432 331986 336016 343002 343398 326310
13768 326310 314613 315583 317127 315884 306367 295739 298962 292577 288447 287552 289736 273376 251877 253346
13754 253346 270869 275896 281769 283235 281358 279933 295856 323369 348967 371457 382696 387041 377654
$$ packed form
13848A75217o474j9995p635m928J506k271l065n384j8699j7204P50n397J1778
13835I8199j245L397K6754K6885K3834J4919K611J803J402J533m671j679r073
13822A84669R352N320J0046K3109J1742j1840m930n88N17k304r44r942J4466K227
13808B30900j690k743m620M808o239k535n807m768j888L151L92k432N661J2748
13794B24938J5668J957k673k5217l728P087J8187J463M560N351N438O775J3224
13781B73030j279L449j0732O02J9932J1547J2974J5909O554M030O986L96j7088
13768C26310j1697R70J544j243r517j0628L223o385m130q95K184j6360k1499J469
13754B53346J7523N027N873J466j877j425J5923K7513K5598K2490J1239M345r387
$$ plain form
13741 377654 370381 377465 384862 385346 391159 391645 380233 370234 360953 361842 359804 349781 350218 349565 342269
13726 342269 333562 334635 335398 332678 317819 296577 288040 273311 268817 278367 298024 311475 329204
13713 329204 350201 389283 409333 414975 425786 425650 419014 417613 411258 412714 404227 389299 381307
13700 381307 403381 416948 417026 419535 424891 407487 393326 379030 355943 338085 336802 361175 399989
13687 399989 431421 457728 462408 461544 460370 449598 443339 437738 449048 457954 466141 493644 508401
13674 508401 513474 509193 493021 470503 445783 436642 428615 432164 444393 468742 495249 527411
13662 527411 553089 540849 509798 499316 496970 494440 508589 538443 581197 622116 657843 673451
13650 673451 665976 635694 618376 632050 647335 684336 749094 808706 851633 888247 909962 918548
$$ packed form
13741C77654p273P084P397M84N813M86j1412r999r281Q89k038j0023M37o53p296
13726C42269q707J073P63k720j4859k1242q537j4729m494R550J9657J3451J7729
13713C29204K0997L9082K0050N642J0811j36o636j401o355J456q487j4928p992
13700C81307K2074J3567P8K509N356j7404j4161j4296k3087j7858j283K4373L8814
13687C99989L1432K6307M680q64j174j0772o259n601J1310Q906Q187K7503J4757
13674E08401N073m281j6172k2518k4720r141q027L549J2229K4349K6507L2162
13662E27411K5678j2240l1051j0482k346k530J4149K9854M2754M0919L5727J5608
13650F73451p475l0282j7318J3674J5285L7001O4758N9612M2927L6614K1715Q586
$$ plain form
13638 918548 910608 865057 826933 795791 777842 760024 752727 760557 776791 787126 797931 807192
13626 807192 806714 806684 799931 816905 841685 887791 942768 1016110 1079339 1127601 1172045 1202439 1223730
13613 1223730 1240542 1253420 1265684 1267200 1288828 1321702 1367370 1391627 1411127 1428116 1444273
13602 1444273 1456905 1481224 1524924 1587203 1677056 1813147 1964895 2101678 2184003 2187141 2150422
13591 2150422 2115309 2101709 2134469 2209830 2301600 2419087 2572045 2757377 2973703 3206345
13581 3206345 3467474 3757428 4088461 4500030 5001437 5655099 6549113 7839812 9811733
13572 9811733 12879577 17418562 23076513 28164187 30439997 28878697 25000560 21344375
13564 21344375 19394694 19344155 21245806 25399561 31845310 39136270 44334340 44888794
$$ packed form
13638I18548p940m5551l8124l1142j7949j7818p297P830J6234J0335J0805R261
13626H07192m78l0o753J6974K4780M6106N4977P3342O3229M8262M4444L0394K1291
13613A223730J6812J2878J2264J516K1628L2874M5668K4257J9500J6989J6157
13602A444273J2632K4319M3700O2279Q9853J36091J51748J36783Q2325L138l6719
13591B150422l5113j3600L2760P5361R1770J17487J52958J85332K16326K32642
13581C206345K61129K89954L31033M11569N01407O53662Q94014J290699J971921
13572I811733L067844M538985N657951N087674K275810j561300l878137l656185
13564B1344375j949681n0539J901651M153755O445749P290960N198070N54454
$$ plain form
13556 44888794 41116138 36370122 33996070 35338738 40048523 46557432 52666946 57175470
13548 57175470 61290491 66593447 71006717 69912376 61121677 48848728 38835718 33274414
13540 33274414 31480244 32800879 37323634 45368232 56109552 66123968 70712216 67318579
13532 67318579 58435706 49510269 44268742 43687298 48111490 58725345 76673022 99282754
13524 99282754 117975462 123464896 113857284 99106865 91327438 96058899 112903748 137336857
13516 137336857 161075019 176689616 183660288 187362141 188664808 181020244 159229119
13509 159229119 128097992 97908501 74898215 59169042 48671135 41714747 37235906
13502 37235906 34536301 33110808 32699560 33292107 34982835 38077282 43145027 51091349
$$ packed form
13556D4888794l772656m746016k374052J342668M709785O508909O109514M508524
13548E7175470M115021N302956M413270j094341q790699j2272949j0013010n561304
13540C3274414j794170J320635M522755Q044598J0741320J0014416M588248l393637
13532F7318579q882873q925437n241527n81444M424192J0613855J7947677K2609732
13524I9282754J8692708N489434r607612j4750419p779427M731461J6844849K4433109
13516A37336857K3738162J5614597O970672L701853J302667p644564k1791125
13509A59229119l1131127l0189491k3010286j5729173j0497907o956388m478841
13502C7235906k699605j425493m11248N92547J690728L094447N067745P946322
$$ plain form
13494 51091349 63444700 82378914 109294703 141372975 170241553 187116295 190412941
13487 190412941 187094502 182284356 172855402 153799758 128236652 105877862 94347457
13480 94347457 95829362 107678260 121193588 125181872 113156811 90821242 69576746
13473 69576746 55514300 48059304 45688571 47975882 54676933 63761012 70713128 70925470
13465 70925470 63445870 52344708 42580876 36223377 33121631 32986696 36186809 43532241
13457 43532241 54619199 65768035 71814600 70131335 64287809 59203228 55449961 50606805
13449 50606805 44124166 38158890 35010267 35518102 39150213 43719902 45903086 43255432
13441 43255432 36528618 29074956 23510808 20439261 19525265 20561192 23425278 27329491
$$ packed form
13494E1091349J2353351J8934214K6915789L2078272K8868578J6874742L296646
13487A90412941l318439m810146r428954j9055644k5563106k2358790j1530405
13480I4347457J481905J1848898J3515328L988284j2025061k2335569k1244496
13473F9576746j4062446p454996k370733K287311O701051R084079O952116K12342
13465G0925470p479600j1101162r763832o357499l101746j34935L200113P345432
13457D3532241J1086958J1148836O046565j683265n843526n084581l753267m843156
13449E0606805o482639n965276l148623N07835L632111M569689K183184k647654
13441D3255432o726814p453662n564148l071547r13996J035927K864086L904213
$$ plain form
13433 27329491 30324370 30297996 26603595 20979301 15781034 12050281 9598873 8012049
13425 8012049 6987855 6349099 5960190 5665591 5358753 4997152 4643393 4365910 4117528
13416 4117528 3840527 3518843 3229590 3017177 2898597 2876655 2953217 3076019 3181333 3167601
13406 3167601 2983689 2692884 2385389 2152694 2008840 1925584 1866000 1836248 1853720 1870278
13396 1870278 1857023 1793123 1677642 1572648 1509868 1494384 1489748 1507555 1578372 1693852 1796878
13385 1796878 1829808 1748716 1586044 1431282 1325571 1263839 1234972 1228874 1233997 1252820 1304179
13374 1304179 1372077 1425925 1448240 1428181 1391214 1366252 1354649 1350550 1341942 1345294 1312656 1252606
13362 1252606 1175356 1106152 1058523 1015783 980749 939109 882672 818314 779828 769836 759167
$$ packed form
13433B7329491K994879k6374l694401n624294n198267l730753k451408j586824
13425H012049j024194o38756l88909k94599l06838l61601l53759k77483k48382
13416D117528k77001l21684k89253k12413j18580k1942P6562J22802J05314j3732
13406C167601j83912k90805l07495k32695j43854q3256n9584k9752J7472J6558
13396A870278j3255o3900j15481j04994o2780j5484m636J7807P0817J15480J03026
13385A796878L2930q1092j62672j54762j05711o1732k8867o098N123J8823N1359
13374A304179O7898N3848K2315k0059l6967k4962j1603m099q608L352l2638o0050
13362A252606p7250o9204m7629m2740l5034m1640n6437o4358l8486r992j0669
$$ plain form
13351 759167 718796 645331 586890 546370 519085 515140 521182 523256 516751 487385 475613 457488
13339 457488 435976 419373 419716 429576 448669 447063 428391 405037 382460 364408 330155 295556
13327 295556 276303 249437 217469 213106 223056 244429 251102 229030 218489 206905 209303 213008
13315 213008 214593 204640 212613 246355 276987 301180 309533 306119 279420 257313 223338 195394
13303 195394 178053 150249 149058 146926 117989 101825 106336 102307 85586 86215 81122 78441 61262
13290 61262 55515 77287 106628 117512 114815 102416 99343 111877 120007 119231 119079 130383 132894
13277 132894 114559 105808 109942 114374 103708 87195 81970 71529 73366 70049 71563 71252 53931
13264 53931 34548 24258 20729 31170 41339 45061 56873 52643 48065 57291 62268 75515 69868
$$ packed form
13351G59167m0371p3465n8441m0520k7285l945O042K074o505k9366j1772j8125
13339D57488k1512j6603L43R860J9093j606j8672k3354k2577j8052l4253l4599
13327B95556j9253k6866l1968m363R950K1373O673k2072j0541j1584K398L705
13315B13008J585r953P973L3742L0632K4193Q353l414k6699k2107l3975k7944
13303A95394j7341k7804j191k132k8937j6164M511m029j6721O29n093k681j7179
13290F1262n747K1772K9341J0884k697j2399l073J2534Q130p76j52J1304K511
13277A32894j8335q751M134M432j0666j6513n225j0441J837l317J514l11j7321
13264E3931j9383j0290l529J0441J0169L722J1812m230m578R226M977J3247n647
$$ plain form
13251 69868 79753 83031 71018 61887 60913 62457 52059 53368 55246 49983 57760 51977 46117 43320
13237 43320 28577 14209 13252 18764 21614 39765 44692 37673 22726 27032 34127 31612 35389 23824
13223 23824 29265 23539 13745 17981 15342 14111 14711 12624 8518 23294 43939 57025 38752 44199
13209 44199 51840 50557 34546 18007 16037 21664 15290 3496 9913 22600 37446 33405 26307
13196 26307 26251 27818 15987 -590 -13324 -18151 -10129 -3327 3570 15054 18675 19362 14073 -5189
13182 -5189 -16078 -18033 -3546 4729 9324 10378 7450 20470 18805 3650 -14275 -23899 -26838
13169 -26838 -15554 1283 14574 21774 40299 47491 44206 21597 13173 27778 32730 31245 33562
13156 33562 38690 33213 22585 4413 -3539 9852 18062 -1573 -14905 -1138 1226 -13020 -11518
$$ packed form
13251F9868R885L278j2013r131r74J544j0398J309J878n263P777n783n860k797
13237D3320j4743j4368r57N512K850J8151M927p019j4947M306P095k515L777j1565
13223B3824N441n726r794M236k639j231O00k087m106J4776K0645J3086j8273N447
13209D4199P641j283j6011j6539j970N627o374j1794O417J2687J4846m041p098
13196B6307n6J567j1831j6577j2734m827Q022O802O897J1484L621O87n289j9262
13182e189j0889j955J4487Q275M595J054k928J3020j665j5155j7925r624k939
13169b6838J1284J6837J3291P200J8525P192l285k2609q424J4605M952j485K317
13156C3562N128n477j0628j8172p952J3391Q210j9635j3332J3767K364j4246J502
$$ plain form
13143 -11518 5662 35692 63600 72884 77469 89210 87070 65792 58072 58278 65189 81350 80146
13130 80146 83642 91206 87796 90987 81225 64565 61595 58493 58606 58813 49587 41173 47183 56970 60706
13115 60706 70860 69391 65271 51210 51025 42343 52045 59577 81329 94108 85655 79759 72410 74302
13101 74302 87503 90759 87577 96347 103234 94661 102775 125918 127358 115301 112635 123405 141070
13088 141070 175856 193193 234965 292234 389965 515433 662103 765211 791762 725717 602162
13077 602162 467464 372454 314424 274036 251006 239751 242938 272909 320342 373759 434395
13066 434395 481467 481698 411906 338034 302703 286483 272560 286268 338256 412155 485768 584242
13054 584242 648282 658183 619154 547791 454239 398785 372352 381240 415642 447876 458341 436405
$$ packed form
13143a1518J7180L0030K7908R284M585J1741k140k1278p720K06O911J6161j204
13130H0146L496P564l410L191r762j6660k970l102J13K07r226q414O010R787L736
13115F0706J0154j469m120j4061j85q682R702P532K1752J2779q453n896p349J892
13101G4302J3201L256l182Q770O887q573Q114K3143J440j2057k666J0770J7665
13088A41070L4786J7337M1772N7269R7731J25468J46670J03108K6551o6045j23555
13077F02162j34698r5010n8030m0388k3030j1255L187K9971M7433N3417O0636
13066D34395M7072K31o9792p3872l5331j6220j3923J3708N1988P3899P3613R8474
13054E84242O4040R901l9029p1363r3552n5454k6433Q888L4402L2234J0465k1936
$$ plain form
13042 436405 372555 307499 250889 221148 198515 184104 181497 204523 240026 278587 338373 416030
13030 416030 508471 601095 644553 620334 548797 467642 406896 389542 384032 414023 507230 631675
13018 631675 751574 827126 785179 658719 518126 399393 312600 246490 207391 202967 213805
13007 213805 235164 277348 338721 409444 452521 459464 421202 365153 308449 267088 257344 280662
12995 280662 327505 392914 487282 595769 663412 690421 642966 540023 445440 385398 343085
12984 343085 336172 364020 406523 450024 453283 400044 326661 268634 218666 184857 151925 146500
12972 146500 167197 194516 238792 299989 368960 461386 550443 603858 580913 510201 417382
12961 417382 308192 222155 155447 121672 105741 88321 76231 68982 59573 59426 57984 42241
$$ packed form
13042D36405o3850o5056n6610k9741k2633j4411k607K3026L5503L8561N9786P7657
13030D16030R2441R2624M3458k4219p1537q1155o0746j7354n510K9991R3207J24445
13018F31675J19899P5552m1947j26460j40593j18733q6793o6110l9099m424J0838
13007B13805K1359M2184O1373P0723M3077O943l8262n6049n6704m1361r744K3318
12995B80662M6843O5409R4368J08487O7643K7009m7455j02943r4583o0042m2313
12984C43085o913K7848M2503M3501L259n3239p3383n8027m9968l3809l2932n425
12972A46500K0697K7319M4276O1197O8971R2426Q9057N3415k2945p0712r2819
12961D17382j09190q6037o6708l3775j5931j7420j2090p249r409j47j442j5743
$$ plain form
12949 42241 28483 26448 30829 36442 35450 29173 21700 21025 39887 44182 32445 19349 1888 7895
12935 7895 15827 21155 14873 -1717 4688 13114 -2901 -10137 1255 17414 20025 16693 15515 26293
12921 26293 14852 -1618 4203 18282 17299 11997 16208 8637 8326 30482 25555 10656 11450 17531
12907 17531 19179 22551 10248 -959 -5802 -14603 -15445 -2702 -3452 -15931 -12471 6022 11943 12498
12893 12498 6158 15470 21638 6878 -10012 -8537 -215 6744 5143 21939 18251 18425 17458 7688
12879 7688 5579 3206 8621 5922 5950 6473 9507 16088 16327 5010 5933 8504 6952 16123 3041
12864 3041 -4823 -9821 -2750 2633 873 3215 10835 7113 4124 -2869 -5219 2003 16737 35442
12850 35442 32436 24963 23226 10636 5462 14912 12299 -543 -2843 -9280 -2294 -7848 -6453 5052
$$ packed form
12949D2241j3758k035M381N613r92o277p473o75J8862M295j1737j3096j7461O007
12935G895P932N328o282j6590O405Q426j6015p236J1392J6159K611l332j178J0778
12921B6293j1441j6470N821J4079r83n302M211p571l11K2156m927j4899P94O081
12907A7531J648L372j2303j1207m843q801q42J2743p50j2479L460J8493N921N55
12893A2498o340R312O168j4760j6890J475Q322O959j601J6796l688J74r67r770
12879G688k109k373N415k699K8N23L034O581K39j1317R23K571j552R171j3082
12864C041p864m998P071N383j760K342P620l722k989o993k350P222J4734J8705
12850C5442l006p473j737j2590n174R450k613j2842k300o437O986n554J395J1505
$$ plain form
12836 5052 10938 19154 19178 20474 23268 23144 24899 6741 -14576 -21976 -12249 -7107 -2668 76 -13751
12821 -13751 -20833 -20415 -5113 907 4270 18913 13911 5158 5449 7065 2888 2751 8195 11633 8384
12806 8384 1924 -3872 -716 -744 -7390 -16096 -29712 -28208 -17418 -14890 -12895 -26873 -19623 490
12792 490 -5583 -10147 -10019 -7959 -13629 -3136 8558 11070 8758 -8610 -12034 -10402 5826 8565
12778 8565 3888 11595 247 -5511 -10636 -24077 -30337 -17964 -18588 -12329 -5946 -5304 -9091 -17638
12764 -17638 -18520 -13421 -10613 -18854 -4291 497 -11700 -10000 -3906 -12427 -13441 1784 14671 4616
12750 4616 -2240 796 -9889 -25814 -30779 -19142 -28093 -24588 -22825 -27786 -26981 -26262 -32885 -21863
12736 -21863 -14709 -4263 -5366 -22915 -24043 -25244 -20116 -9277 -9176 -13452 -11396 629 -1291 -25374
$$ packed form
12836E052N886Q216K4J296K794j24J755j8158k1317p400R727N142M439K744j3827
12821a3751p082M18J5302O020L363J4643n002q753K91J616m177j37N444L438l249
12806H384o460n796L156k8o646q706j3616J504J0790K528J995j3978P250K0113
12792D90o073m564J28K060n670J0493J1694K512k312j7368l424J632J6228K739
12778H565m677P707j1348n758n125j3441o260J2373o24O259O383O42l787q547
12764a7638q82N099K808q241J4563M788j2197J700O094q521j014J5225J2887j0055
12750D616o856L036j0685j5925m965J1637q951L505J763m961Q05P19o623J1022
12736b1863P154J0446j103j7549j128j201N128J0839J01m276K056J2025j920k4083
$$ plain form
12722 -25374 -30428 -26617 -14514 -665 17162 18881 17784 24361 26428 27625 21618 17109 4412
12709 4412 -14025 -18344 -14956 -23693 -24316 -24828 -23225 -28243 -25817 -26688 -38051 -22591 -114 13703
12695 13703 11556 -4569 1013 14610 14837 19330 21384 15116 3430 12717 13519 7977 -10741 -23791
12681 -23791 -29068 -26500 -11989 -16761 -27980 -19565 -17966 -31693 -39933 -35954 -25579 -20980 -9425
12668 -9425 -18243 -9246 -7918 -10709 -15310 -9958 16998 23430 3764 -9342 -23548 -28529 -11692
12655 -11692 -9467 -24160 -30475 -31643 -27166 -8415 -14448 -22030 -22225 -14066 -17153 -23176 -26578 -19427
12641 -19427 2098 19806 6052 -4771 -11664 -10226 -2665 -8098 -8678 6583 10828 14144 13428 13059
12627 13059 7384 -3780 -22253 -29904 -27516 -19296 -15236 -23318 -17610 -15293 -25143 -23228 -20192 -12267
$$ packed form
12722b5374n054L811J2103J3849J7827J719j097O577K067J197o007m509j2697
12709D412j8437m319L388q737o23n12J603n018K426q71j1363J5460K2477J3817
12695A3703k147j6125N582J3597K27M493K054o268j1686R287Q02n542j8718j3050
12681b3791n277K568J4511m772j1219Q415J599j3727q240L979J0375M599J1555
12668i425q818Q997J328k791m601N352K6956O432j9666j3106j4206m981J6837
12655a1692K225j4693o315j168M477J8751o033p582j95Q159l087o023l402P151
12641a9427K1525J7708j3754j0823o893J438P561n433n80J5261M245L316p16l69
12627A3059n675j1164j8473p651K388Q220M060q082N708K317r850J915L036P925
$$ plain form
12613 -12267 -827 -5191 -6922 -819 7700 2188 3031 11871 6871 -3363 -7142 -1074 -2547 -10217
12599 -10217 4431 8841 -3883 -13430 -5371 -9973 -20292 -31623 -24791 -13364 -2606 -5221 -9491
12586 -9491 -20046 -19916 -25959 -23393 -22591 -21881 -19658 -22889 -18471 -22188 -24336 -12811 -6479 -7829 5835
12571 5835 5657 -2205 1879 -2110 -8290 -6762 -7072 -17044 -16259 -5266 5829 11738 7087 1466 413
12556 413 -8672 -3601 -6003 -14325 -19751 -20163 -12922 -6285 3266 -17697 -25855 -20839 -9477 -3815 4118
12541 4118 -1227 -4319 -17865 -27153 -24627 -15896 -388 9437 24 -15417 -22531 -29166 -27516 -18143
12527 -18143 -12069 -18997 -19263 -13757 -10900 -7473 -10691 1279 13945 17749 16761 14300 10554 -5524
12513 -5524 -10814 -21260 -20346 -13306 -20037 -21587 -29258 -40065 -32415 -27219 -22561 -28734 -22150 -6951
$$ packed form
12613a2267J1440m364j731O103Q519n512Q43Q840n000j0234l779O068j473p670
12599a0217J4648M410j2724r547Q059m602j0319j1331O832J1427J0758k615m270
12586i491j0555J30o043K566Q02P10K223l231M418l717k148J1525O332j350J3664
12571E835j78p862M084l989o180J528l10r972P85J0993J1095N909m651n621j053
12556D13r085N071k402q322n426m12P241O637R551k0963q158N016J1362N662P933
12541D118n345l092j3546r288K526Q731J5508R825r413j5441p114o635J650R373
12527a8143O074o928k66N506K857L427l218J1970J2666L804r88k461l746j6078
12513e524n290j0446R14P040o731j550p671j0807P650N196M658o173O584J5199
$$ [...]
##END NTUPLES=NMR SPECTRUM
##END=
