##TITLE=Analysis number 311693
Compound Code cc 01603
Book Reference 361/195/2
Project Code qc-cat
Chemist Name paulaf
##JCAMPDX= 6.0         $$ Bruker NMR JCAMP-DX V2.0
##DATA TYPE= NMR SPECTRUM
##DATA CLASS= NTUPLES
##ORIGIN= Bruker BioSpin GmbH
##OWNER= NMR
$$ XWIN-NMR		Version 3.5
$$ Fri Jul 15 11:39:19 2005 GMT Daylight Time (UT+1h)  MAYBRIDGE\NMR@NMR_250MHZ
##.OBSERVE FREQUENCY= 250.131544655141
##.OBSERVE NUCLEUS= ^1H
##.ACQUISITION MODE= SIMULTANEOUS (DQD)
##.ACQUISITION SCHEME= undefined
##.AVERAGES= 16
##.DIGITISER RES= 18
##SPECTROMETER/DATA SYSTEM= dpx250
##.PULSE SEQUENCE= zg30
##.SOLVENT NAME= CDCl3
##.SHIFT REFERENCE= (INTERNAL, CDCl3, 0, 16.522)
##AUDIT TRAIL= $$ (NUMBER, WHEN, WHO, WHERE, WHAT)
$$ ##TITLE= Audit trail, XWIN-NMR		Version 3.5
$$ ##JCAMPDX= 5.01
$$ ##ORIGIN= Bruker BioSpin GmbH
$$ ##OWNER= NMR
$$ C:\u/data/dgb/nmr/ADRS/5880/pdata/1/auditp.txt
$$ ##AUDIT TRAIL=  $$ (NUMBER, WHEN, WHO, WHERE, WHAT)
(   1,<2005-07-15 11:38:46.39 +100>,<MAYBRIDGE\NMR>,<NMR_250MHZ>,
      <created by zg, POWCHK disabled, PULCHK disabled
       configuration hash MD5:
       62 19 C7 07 E1 42 D1 B7 37 6C 3D D0 77 39 F9 E6
       data hash MD5: 64K
       F0 1C B3 99 EC 0B 1D DD 29 D9 38 DC 1F F8 13 5F>)
(   2,<2005-07-15 11:39:03.02 +100>,<MAYBRIDGE\NMR>,<NMR_250MHZ>,
      <Start of raw data processing
       ef LB = 0.3 FT_mod = 6 PKNL = 1 SI = 32K 
       data hash MD5: 32K
       D7 57 BE 91 DC 25 C6 1B C0 25 7E 89 2A 53 63 25>)
(   3,<2005-07-15 11:39:06.35 +100>,<MAYBRIDGE\NMR>,<NMR_250MHZ>,
      <apk 
       data hash MD5: 32K
       9B A2 F3 C6 48 C3 35 80 E6 05 96 6E 99 E6 33 BD>)
(   4,<2005-07-15 11:39:07.83 +100>,<MAYBRIDGE\NMR>,<NMR_250MHZ>,
      <abs ABSG = 5 
       data hash MD5: 32K
       25 C4 22 FF 29 90 DB A3 F4 AA 13 64 6E 4A 17 33>)
$$ ##END=
$$ 
$$ hash MD5
$$ 1A 52 26 AB 21 29 04 A1 A8 C2 05 AA 59 E7 83 1B
##$RELAX= 
##$RELAX= 
##$RELAX= 
##$RELAX= 
##$RELAX= 
##$RELAX= 
##$RELAX= 
$$ Bruker specific parameters
$$ --------------------------
##$DU= <C:\u>
##$EXPNO= 5880
##$NAME= <ADRS>
##$PROCNO= 1
##$TYPE= <nmr>
##$USER= <dgb>
##$AMP= (0..31)
100 100 100 100 100 100 100 100 100 100 100 100 100 100 100 100 100 100 
100 100 100 100 100 100 100 100 100 100 100 100 100 100 
##$AQSEQ= 0
##$AQ_mod= 3
##$AUNM= <au_zg>
##$AUTOPOS= <15 >
##$BF1= 250.13
##$BF2= 250.13
##$BF3= 250.13
##$BF4= 250.13
##$BF5= 500.13
##$BF6= 500.13
##$BF7= 500.13
##$BF8= 500.13
##$BYTORDA= 1
##$CFDGTYP= 0
##$CFRGTYP= 5
##$CHEMSTR= <none>
##$CNST= (0..31)
1 1 145 1 1 1 1 1 1 1 1 1 1 1 1 1 1 1 1 1 1 1 1 1 1 1 1 1 1 1 1 1 
##$CPDPRG= <>
##$CPDPRG1= <>
##$CPDPRG2= <>
##$CPDPRG3= <>
##$CPDPRG4= <mlev>
##$CPDPRG5= <mlev>
##$CPDPRG6= <mlev>
##$CPDPRG7= <mlev>
##$CPDPRG8= <mlev>
##$CPDPRGB= <>
##$CPDPRGT= <>
##$D= (0..31)
0 1 0 0 0 0 0 0 0 0.06 0 0 0 0 0 0 0.0002 0 0 0 0 0 0 0 0 0 0 0 0 0 0 
0 
##$DATE= 1121423925
##$DBL= (0..7)
120 120 120 120 120 120 120 120 
##$DBP= (0..7)
150 150 150 150 150 150 150 150 
##$DBP07= 0
##$DBPNAM0= <>
##$DBPNAM1= <>
$$ [...]
##$SUBNAM7= <"">
##$SUBNAM8= <"">
##$SUBNAM9= <"">
##$SW= 20.6930455092707
##$SWIBOX= (0..15)
0 0 3 0 0 0 0 0 0 0 0 0 0 0 0 0 
##$SW_h= 5175.983436853
##$TD= 65536
##$TD0= 1
##$TE= 295.16
##$TE2= 300
##$TE3= 300
##$TEG= 300
##$TL= (0..7)
0 120 120 120 120 120 120 120 
##$TP= (0..7)
150 150 150 150 150 150 150 150 
##$TP07= 0
##$TPNAME0= <>
##$TPNAME1= <>
##$TPNAME2= <>
##$TPNAME3= <>
##$TPNAME4= <>
##$TPNAME5= <>
##$TPNAME6= <>
##$TPNAME7= <>
##$TPOAL= (0..7)
0.5 0.5 0.5 0.5 0.5 0.5 0.5 0.5 
##$TPOFFS= (0..7)
0 0 0 0 0 0 0 0 
##$TUNHIN= 0
##$TUNHOUT= 0
##$TUNXOUT= 0
##$USERA1= <user>
##$USERA2= <user>
##$USERA3= <user>
##$USERA4= <user>
##$USERA5= <user>
##$V9= 5
##$VALIST= <valist>
##$VCLIST= <CCCCCCCCCCCCCCC>
##$VD= 0
##$VDLIST= <DDDDDDDDDDDDDDD>
##$VPLIST= <PPPPPPPPPPPPPPP>
##$VTLIST= <TTTTTTTTTTTTTTT>
##$WBST= 1024
##$WBSW= 4
##$XGAIN= (0..3)
0 0 0 0 
##$XL= 0
##$YL= 0
##$YMAX_a= 446926
##$YMIN_a= -395572
##$ZGOPTNS= <>
##$ZL1= 120
##$ZL2= 120
##$ZL3= 120
##$ZL4= 120
##$ABSF1= 16.522
##$ABSF2= -4.171173
##$ABSG= 5
##$ABSL= 3
##$ALPHA= 0
##$AQORDER= 0
##$ASSFAC= 0
##$ASSFACI= 0
##$ASSFACX= 0
##$ASSWID= 0
##$AUNMP= <proc_1d>
##$AZFE= 0.1
##$AZFW= 0.1
##$BCFW= 0
##$BC_mod= 0
##$BYTORDP= 0
##$COROFFS= 0
##$CY= 12.5
##$DATMOD= 1
##$DC= 0
##$DFILT= <>
##$DTYPP= 0
##$F1P= 14.0000005364418
##$F2P= -0.99999901652339
##$FCOR= 0.5
##$FTSIZE= 32768
##$FT_mod= 6
##$GAMMA= 0
##$GB= 0
##$INTBC= 1
##$INTSCL= 1
##$ISEN= 128
##$LB= 0.3
##$LEV0= 0
##$LPBIN= 0
##$MAXI= 10000
##$MC2= 0
##$MEAN= 0
##$ME_mod= 0
##$MI= 0
##$NCOEF= 0
##$NC_proc= -3
##$NLEV= 6
##$NOISF1= 0
##$NOISF2= 0
##$NSP= 0
##$NTH_PI= 0
##$NZP= 0
##$OFFSET= 16.522
##$PC= 1
##$PHC0= -76.70387
##$PHC1= -2.60915
##$PH_mod= 1
##$PKNL= yes
##$PPARMOD= 0
##$PSCAL= 4
##$PSIGN= 0
##$REVERSE= no
##$SF= 250.13
##$SI= 32768
##$SIGF1= 0
##$SIGF2= 0
##$SINO= 400
##$SIOLD= 32768
##$SREGLST= <1H.CDCl3>
##$SSB= 0
##$STSI= 32768
##$STSR= 0
##$SW_p= 5175.98343685301
##$SYMM= 0
##$S_DEV= 0
##$TDeff= 65536
##$TDoff= 0
##$TI= <Analysis number 999999
Compound Code 99
Book Reference 9
Project Code 9>
##$TILT= no
##$TM1= 0
##$TM2= 0
##$TOPLEV= 0
##$USERP1= <user>
##$USERP2= <user>
##$USERP3= <user>
##$USERP4= <user>
##$USERP5= <user>
##$WDW= 1
##$XDIM= 32768
##$YMAX_p= 405571137
##$YMIN_p= -113128
$$ End of Bruker specific parameters
$$ ---------------------------------
##NTUPLES= NMR SPECTRUM
##VAR_NAME=  FREQUENCY,     SPECTRUM/REAL,   SPECTRUM/IMAG
##SYMBOL=    X,             R,               I
##VAR_TYPE=  INDEPENDENT,   DEPENDENT,       DEPENDENT
##VAR_FORM=  AFFN,          ASDF,            ASDF
##VAR_DIM=   32768,         32768,           32768
##UNITS=     HZ,            ARBITRARY UNITS, ARBITRARY UNITS
##FACTOR=    0.157963299565203, 1,           1
##FIRST=     4132.6476996994, 0,             0
##LAST=      -1043.33573715361, 0,           0
##MIN=       -1043.33573715361, -113128,     0
##MAX=       4132.6476996994, 405571137,     0
$$ Real data points
##PAGE= N=1
##DATA TABLE= (X++(R..R)), XYDATA
$$ [...]
26589 -19763 -13497 -9387 -14166 20130 7798 -24208 -26344 -18754 -3789 22147 -2268 1843 -2432
26576 -2432 -17811 -21464 -16916 -17875 -15750 -2687 8020 -20927 -10442 4869 13400 20287 28030
26563 28030 13926 4075 13443 6886 1608 1848 5440 -22177 -11142 -54 34322 45849 54773
26550 54773 38189 33221 41823 50392 51552 69245 49631 20021 26312 6228 -9778 -15320 -23466
26537 -23466 -11680 -19115 8306 55154 57556 -2367 -33263 -41505 -28250 -3789 3737 -8395
26525 -8395 -28218 -47170 -43401 -36448 -31157 -14377 -11886 -13823 -4445 -15591 -10059 -22140 -9443
26512 -9443 21817 23476 -8712 -33215 -51361 -30841 -19617 -6105 4556 8348 8427 12940 -1556
26499 -1556 -23049 -8676 2620 -2512 -2666 38903 49419 61516 54684 49892 51413 24193 16149
26486 16149 20645 33042 24267 6732 -2241 -13139 -25817 -22918 -16147 -17302 -11366 13950 23680
26473 23680 20642 12599 25344 47462 34685 -5523 -26563 7443 27760 30401 20794 18950 34660
26460 34660 53229 50634 42063 19073 5678 6351 -9249 -17134 8156 33378 12754 -12779 -7784
26447 -7784 13306 -23353 -52602 -28754 -19472 -2153 23601 25893 26679 22228 23894 -5790 -4578
26434 -4578 -9275 -19785 -20202 -18452 -9190 -5118 -27288 -17866 14380 25863 50556 43005 39350 46473
26420 46473 69995 59409 26355 19995 23227 13475 34545 29441 3758 21250 21009 12883 -361
26407 -361 -3665 -12637 3523 4622 6203 19667 12374 24668 12642 -26360 -41638 -59575 -86886
26394 -86886 -76011 -43889 -16289 12167 15359 12651 22544 10709 -1879 24252 55764 49125
26382 49125 54052 31744 11555 -36944 -56880 -35499 -9079 18299 12985 22326 33285 36099
26370 36099 37971 30586 50143 22957 6223 -26214 -35492 5548 45594 50957 25432 12981
26358 12981 29612 13125 -11057 673 17739 31172 23358 14442 1578 4139 21489 34276
26346 34276 11931 20711 44557 45442 23702 47519 67892 28183 23793 16452 18932 -3724 -13184
26333 -13184 2508 -4063 -3865 -5720 -6911 -2866 627 26842 53274 25195 13752 10243 18722
26320 18722 4474 -7952 -3765 1372 2545 9286 8848 5873 -1295 9136 -15224 -38330 -49046
26307 -49046 -54315 -45345 -45890 -36015 -43312 -42736 -50205 -29402 -32396 -13404 27040 37723 11206 10977
26293 10977 12754 10239 9584 11781 34190 77229 63679 39889 2097 -4743 11622 28632 23063
26280 23063 5810 31705 28592 4620 -27804 -32863 -51628 -53772 -27919 -1668 23818 42456
26268 42456 35171 48103 34203 20627 -1554 -29325 -15576 7836 22439 30103 40404 15418
26256 15418 19678 47571 36910 21283 13990 -8055 -30384 -34020 -22187 -1533 -27472 -28690
26244 -28690 -27925 -30322 -17534 -15664 -5619 367 -4524 -4439 11293 31449 65139 75012 49798 18763
26230 18763 15512 17092 17287 25754 23378 43354 66808 45328 -23246 -47391 -33361 4600 8803
26217 8803 9116 18878 4010 -15686 -15011 6085 -5910 -19300 -3933 11615 17722 22822 53957
26204 53957 18442 -25842 -39292 -25534 -2230 -9445 -28264 -19672 3871 9133 16441 -457
26192 -457 8536 16305 21316 2649 -16718 -18593 -17697 6301 4801 4268 -11504 -15359 -8903 14014
26178 14014 27222 19777 -641 -24777 -24779 -22500 -11056 -24043 -246 6052 465 -15756 1871
26165 1871 13565 9606 6099 -13242 -42553 -48590 -16462 15924 14894 -7335 -1246 -19083 -45106
26152 -45106 -29568 -3961 27255 31484 24077 10694 15083 -10144 3655 14398 8631 5323 5711
26139 5711 -6005 -745 -14569 -32066 -5015 3049 -12465 -5279 2695 17846 35074 40930 33458
26126 33458 14482 13920 14825 33072 7798 -40671 -55816 -54991 -43562 -17718 -23642 -32190 -20287
26113 -20287 -10002 -765 29151 14118 -8246 9702 8258 6210 10199 13414 -4486 12222 29078
26100 29078 23783 7153 24016 42027 41658 46206 47524 45750 49015 12931 -20401 -26288 -30093
26087 -30093 -24448 -16016 24175 36115 38208 38683 12840 -14743 -24630 5358 26127 17713 33734
26074 33734 22897 -10509 -16815 -4424 4195 3816 -7508 22542 30716 9683 -8882 -8266 11087
26061 11087 -479 10386 2448 -8908 -8709 2814 2702 20111 11299 3939 2932 2680 2718 -991
26047 -991 21090 25406 -7026 13469 42441 28456 5522 -32000 -27530 -6817 466 -14608 -28662
26034 -28662 -6236 -3233 -19948 -5382 7034 18505 8317 6058 3325 28334 36385 19201
26022 19201 -2336 8345 30360 13694 4059 32839 17718 -4820 -31743 -63442 -46333 -83234
26010 -83234 -90513 -75565 -73391 -41357 -4090 -6107 -1966 -15384 -16563 9960 36750 45925 34367
25997 34367 -1642 -23533 -23989 -38171 -37558 -8666 2643 -1684 4623 -486 7235 19372 -8015
25984 -8015 -31747 -50594 13848 20823 -13934 -29573 -21818 -13150 -230 7360 -10421 -18957 -7122
25971 -7122 -3110 4485 2169 14210 -6982 -33370 -18384 2998 20427 28300 30205 -6021 -18660
25958 -18660 -20298 -13517 18003 64920 83781 28346 20710 -13932 -12639 23107 22373 17996 -16951
25945 -16951 -44423 -23561 -15992 -7161 -9184 6508 -5228 -7373 -5692 17767 9264 -17147 -10039
25932 -10039 22538 22128 4 -2546 8136 14207 18389 40548 51812 38302 29893 27459 31328
25919 31328 44314 37715 25394 27862 44006 47790 36636 32200 37712 18223 6323 18102 20252
25906 20252 936 -13010 -2899 -10883 -26042 -47641 -57180 -69277 -23328 -7340 -13926 -6088
25894 -6088 -273 11168 226 21129 15191 32126 49021 43645 12899 -4394 -8663 -9017 -19874
25881 -19874 -29328 -36001 -56269 -32271 -191 206 875 109 -2869 -25160 -36403 -8487 -4935 -6470
25867 -6470 -23439 -51628 -62851 -61680 -54904 -55236 -43053 -28393 -6922 10378 2195 -23687 254
25854 254 12990 8897 18373 32534 39544 35006 15646 11655 8195 -8711 -15119 7917 8007 1877
25840 1877 -12224 -29768 -28274 -13172 -5380 -37406 -57095 -35080 18081 15398 1357 3878 40571
25827 40571 60241 53356 28633 24785 28357 -13172 -3782 17723 10619 17724 11904 33400 18824
25814 18824 1625 -16181 -32105 -22686 -10923 957 25543 7411 13359 -1218 -21868 -23414
25802 -23414 -14018 -809 17762 6874 15820 10736 21869 29093 19079 8324 -2467 7909
25790 7909 22173 18342 4868 -729 7187 14924 36177 59518 58651 33500 30319 30643 48587 33454
25776 33454 26177 27975 26220 20074 23637 13101 -150 2293 18195 27663 21354 -24739 -25825
25763 -25825 7228 22840 14871 14103 32685 46003 64261 74592 49720 30036 29023 20863 -1797
25750 -1797 8698 30006 -12188 -43449 -42240 -11451 -6206 -15668 -22277 -11844 -1774 -30714 -35499
25737 -35499 -23672 -7581 1316 -20473 -10873 35945 -4509 -5686 10949 20872 -9084 -2568 14923
25724 14923 -5138 -26451 -26133 6278 16872 15523 39575 32250 34125 27127 18388 634 9094
25711 9094 -18246 -16128 11647 3183 -2122 -17832 -18200 -38755 2133 33151 34628 21311 9119
25698 9119 -15122 -31154 -46974 -54124 -21895 -13287 -31032 -33824 -43643 -38801 -32670 -16638 38511
25685 38511 37766 35163 20115 29280 32098 6319 -899 -3292 2879 -2785 -10561 -8152 -15518 24369
25671 24369 22240 32596 39660 10237 -10234 10169 -985 -21120 -29976 -21872 -9899 -39757
25659 -39757 -21252 8997 -11141 1732 36425 16827 -3869 -17549 -30646 -12382 -9680 -617
25647 -617 -4698 5186 10499 -3859 -20645 -26416 -45783 -69178 -35427 -14349 -19766 -16580 -14357
25634 -14357 17437 42851 40676 24355 46722 57256 36291 -3584 -20505 -60698 -46418 -24384
25622 -24384 -10781 -4698 12332 5611 -26094 -8935 1318 8328 -10017 -32841 -31694 -66752
25610 -66752 -77591 -57649 -23694 -5637 -1645 14690 -1925 -31411 -38557 -35715 -33451 -13847
25598 -13847 10291 14946 27579 40541 32392 23401 2201 -16026 -62949 -56297 -16725 885
25586 885 7087 19055 18452 -12650 -15805 6843 8033 5909 16799 10979 -4051 -7998 -4574 3125
25572 3125 -12461 -18503 -18422 -27337 -13254 9350 1415 -5092 -33395 -43616 -57081 -54796 -47779 -23151
25558 -23151 -7703 -4912 -9539 5327 -23481 -46496 -41451 -10841 14716 13667 -17314 -12041 913
25545 913 -11079 -12340 18297 30408 -15324 -20900 -44581 684 40493 24477 5206 -2454 237
25532 237 2216 26783 34255 10745 -25137 -26178 2297 -14958 -13902 2562 39259 45693 38094
25519 38094 14538 -8522 17947 33783 30388 23607 19426 4740 9943 18997 16894 30672 38658
25506 38658 33304 52597 37924 47856 55688 58961 19142 -11432 -21984 15034 33403 41266 53279
25493 53279 23715 -13231 -15145 -14269 -18431 -36194 -47859 -25784 -10782 9233 -6064 -3775 4916
25480 4916 -3526 -30410 -35955 -25853 -28085 -15243 12291 16490 2442 1175 13308 10728 10022
25467 10022 5792 21476 43126 48466 11407 -10153 20485 60667 33469 -2408 -34557 -31173
25455 -31173 -3237 34320 21441 -26977 -18912 -10377 -16934 -16096 2706 5539 4098 21591 24488
25442 24488 7444 21873 23947 -14357 -9229 2565 -11841 -8828 47736 54481 2712 -64136
25430 -64136 -48152 -22771 -15018 -6163 12161 -9341 -14908 -10394 -5094 -10185 16072 16399 -5631
25417 -5631 -27861 -28010 1218 11857 10429 11048 11406 17756 28618 52086 25342 18232 55981 82800
25403 82800 49648 38773 12940 21333 12461 10421 12334 15149 31720 14112 9173 6592 -13163
25390 -13163 -34790 -28899 -24923 -25088 -20217 -9713 7371 11553 15399 -12812 -30446 -11800 -17971
25377 -17971 -10684 -2384 12557 3040 -425 -15914 4689 13406 10846 6431 -10684 21980 17211
25364 17211 30794 12620 4614 -9403 -10028 6614 11968 -2889 934 2505 15168 21764 -13972
25351 -13972 -16314 -1498 -33704 -17228 -38628 -31934 -3713 -253 -5919 28159 53659 20306
25339 20306 -11358 6968 15006 -4559 -36558 -46398 -32154 2201 20415 24433 22760 -12387
25327 -12387 -17686 705 28641 41603 3047 -8971 16477 -5729 11452 21084 3082 -760
25315 -760 8303 -12704 -40700 -33577 -26644 -43631 -34663 -24388 -17732 -10936 12026 5214 1278 -12637
25301 -12637 -29972 -24213 -25630 -20910 3595 25574 43791 23265 -5446 21172 43471 29155
25289 29155 14073 13781 26154 8082 -10571 -28049 -27700 -8624 -3080 -6688 -7286 29995 62145
25276 62145 28225 -9279 -1282 -3094 -38930 -38318 -28177 -17140 -16464 -23580 -23584 -14234 -8056 -20781
25262 -20781 1234 12676 31853 20820 8731 20060 14163 10252 6334 14920 10138 -10806 -13138
25249 -13138 -29698 -51196 -26477 -14184 -2214 16802 3973 -7199 -9567 -13088 -11755 -1001
25237 -1001 -18257 -28282 -26941 -33871 -17898 8807 22827 7232 -27163 -27420 -39813 -40714 -25358
25224 -25358 -16228 7157 15850 30553 23153 20383 -1851 -47247 -51396 -44485 -39635 -14878 -1772
25211 -1772 -815 16561 32368 18005 10809 -19719 -28463 -25267 207 23622 27299 -422 -40359
25198 -40359 -63910 -49853 -36257 -14367 -5993 5290 34637 27125 1151 5970 7939 5686 -7249
25185 -7249 -22743 7517 25739 13881 -16245 -32925 -22274 -8806 -12294 -4750 -20857 -24017
25173 -24017 -35679 -38237 -20562 -11821 -29414 -36805 -17793 5457 26857 6633 16764 25692
25161 25692 14631 9843 12474 16221 20773 31250 -1400 -16142 -31761 -50592 -33633 -23588
25149 -23588 -20097 -40681 -17169 4730 19861 16043 30633 27766 -5900 -7107 10017 -4820
25137 -4820 3405 -1132 -6711 -18738 -27462 -22391 -40219 -54261 -17209 24879 27304 23720 40121
25124 40121 36937 22518 10238 12394 11957 12363 -11198 -29070 -47404 -30484 -10272 7061 17529
25111 17529 17321 31107 41638 30502 17868 15133 -6815 -27493 -20319 -22918 -15189 3606 11671
25098 11671 50219 50162 31406 18327 6103 -20125 -23826 -14083 20515 31756 35131 34057 10421
25085 10421 13708 17773 6997 -15940 -8375 23250 32049 41797 48839 13084 -1964 -10026 2106
25072 2106 23465 26474 10689 -14976 -5911 -2176 -29413 -32891 -8681 6903 -14754 -8444 -10984
25059 -10984 -14677 -5642 -30467 -43552 -34751 -24242 10949 6326 -9647 6025 -6089 -15345 10590
25046 10590 11660 -1517 -11909 -49266 -57472 -25704 -813 25032 25696 21554 11205 -3887 14214
25033 14214 32669 59983 58167 38773 35511 11290 3899 11417 35785 29243 33520 71972 52576
25020 52576 1036 -28807 -13375 23788 29190 12016 -23184 -29123 -12386 -7297 -5930 -14756 12241
25007 12241 35671 48804 37444 33561 53125 66517 79156 70481 34498 11365 22605 17735
24995 17735 -5390 5287 3594 -18898 -47541 -53107 -10213 -6943 8428 2691 -6204 6607 -24858
24982 -24858 -10049 -5069 -5611 17069 23558 33495 56832 50520 38522 -1829 -32745 -27971 -13444
24969 -13444 6960 -30363 -39835 -13655 -32033 -43159 -55844 -47086 -25652 4103 39434 40608
24957 40608 21297 17158 8650 33938 27862 33610 44953 56113 42402 41918 47062 43880 13311
24944 13311 -6527 -2143 -6139 24820 47321 28522 26108 4202 4106 -10688 -2656 -11305 -12148 -20440
24930 -20440 -38076 -45592 -30396 -9354 -14353 -19087 -18608 -24092 -10018 -2572 -10671 -24581 -24398 -42876
24916 -42876 -66050 -62328 -53851 -38121 -35874 -41343 -36034 -22423 -35082 -43087 -26787 -24800 -20421
24903 -20421 289 -4467 27142 22937 -14645 -24427 -28005 2964 23558 -4281 -14976 -22775 -13878
24890 -13878 -8857 -21448 -11378 -2120 8464 -19218 -22879 -21006 -16750 17335 22246 -23264 -39061
24877 -39061 -3742 31375 28753 -5706 20161 52065 53393 51168 56702 32305 10586 -652
24865 -652 33207 33823 22274 45120 46465 38820 401 -18894 -3196 13551 39371 41124 38638
24852 38638 41408 28874 -6194 -48314 -49836 -41456 -4335 -4517 -5004 -33487 -18151 -4734 -10822
24839 -10822 -16187 -10669 -1453 4447 -8787 6423 16025 9144 -28272 -55890 -42702 -25372 -23383
24826 -23383 -29054 -8715 22536 31048 35548 12272 -21045 -15480 -11918 3354 6136 -9105 -2446
24813 -2446 26704 -5281 -52242 -57445 -90189 -67966 -34925 4302 1301 14322 25596 22081
24801 22081 20014 32468 13202 -15340 -48661 -63269 -59990 -35804 7015 8704 73 -1317 -3560
24788 -3560 1594 -2349 -40258 -30806 -27182 -22719 -25901 5862 2062 20378 21070 14913 -16833 -12994
24774 -12994 -11450 4140 -9580 -7222 -4687 16 6159 -18246 -33086 -29802 -22501 1330 8605
24761 8605 22243 42611 28189 18512 18264 8796 235 -29197 -13937 -29344 -2668 28822 26610
24748 26610 -11381 -16816 -5781 30318 24265 6763 -27134 -51702 -43475 -23815 -31646 -32353 -16184
24735 -16184 -32897 -42422 -29513 -15965 -12496 -29872 -2698 17325 -19950 -16032 12955 27846
24723 27846 43756 33819 28799 17574 35197 2451 -18251 7349 -4944 -11335 -17168 -36172
24711 -36172 -56582 -30553 184 21598 49765 69039 70853 40895 36043 36041 32786 22150 31872
24698 31872 16921 5683 1343 -20304 -31717 -26200 -14143 6386 -7742 -24175 -26277 9713
24686 9713 21319 18053 -8456 -14868 16581 -27721 -48080 -39380 -19973 643 28983 40067
24674 40067 48079 63258 58018 16708 -10508 -19815 -15984 -14413 33112 45045 18914 10645 -2064
24661 -2064 14106 38163 8712 -25030 -6229 -8817 -15044 4999 10259 1103 19431 36337 37256
24648 37256 14462 -20095 -39659 -50062 -18934 -18996 -37744 14256 38057 15311 21987 29519 18394
24635 18394 21433 -8624 -22879 -14500 -17748 -28483 -17198 -6071 9951 1345 -25167 -45341
24623 -45341 -31116 -42283 -36733 -17830 -15777 2459 23208 24756 10738 24687 8335 -8814
24611 -8814 -2619 -41383 -55809 -40584 -34604 -18946 -32687 -37139 -34027 -58054 -33065 -13832 -7704
24598 -7704 5876 44315 76956 86126 94990 88654 62959 32873 46530 24601 -12625 -31629
24586 -31629 -31780 -14503 33472 35695 19531 19064 12409 -10839 -2169 -1264 22267 28639 13540 2195
24572 2195 1702 -1451 2884 10312 13698 35336 47558 39004 32084 19217 -14016 14402 21229 20482
24558 20482 3159 17115 36850 46360 23182 198 -18625 -20115 -1411 6470 12211 17908 27244
24545 27244 25947 24942 43700 26667 11590 -14239 -39697 -24527 -38341 -43496 -33588 -11076
24533 -11076 2049 -10910 12202 10311 -463 18844 30824 26459 9149 -11000 -22064 -36694
24521 -36694 -15636 -2801 -3893 -13600 -8730 -13830 11572 9244 -2967 -28723 -46029 -55390 -50775
24508 -50775 -26960 11040 49522 59685 74700 47339 16263 26782 -2180 -37160 -16476 -10298
24496 -10298 -12081 -12481 -16571 7680 -6911 -2232 -17061 -26322 -10687 -10186 -19296 -11710 24580 36548
24482 36548 7548 -13579 1956 15540 32155 15096 -3587 -12583 -5603 2884 23194 40622
24470 40622 12820 -5963 1537 1527 -4700 14935 -1488 -6195 -15187 -20227 -33905 -28475 17202
24457 17202 18844 15934 16579 836 -23018 10558 36176 -10809 -44925 -40921 -34780 -43493 -33270
24444 -33270 -22525 9035 24769 -330 -31031 -38126 -32476 -25375 -7421 4329 3319 -23630
24432 -23630 -19678 -2035 9553 -22168 -18518 -7006 -32986 -59071 -51202 -19457 -7081 -14631
24420 -14631 -7063 8614 8695 5899 -19823 8455 27494 25685 41532 65882 51610 19030 242
24407 242 -5263 -3673 1899 1101 -34628 -29988 -12657 12006 7280 -1048 4440 7730 -11116 14238
24393 14238 9192 -37056 -41682 810 18415 13318 -25018 -34697 -23157 -21658 -23299 -26014 -28195
24380 -28195 -39295 -49730 -29282 -6255 -4757 -33030 -20189 -23247 -42778 -39923 -34226 -42140 -40513
24367 -40513 -48388 -50087 -42533 -37656 -31018 -31709 -22778 3909 -16192 -55880 -34395 -11913 6424
24354 6424 36255 47147 15430 -3106 17237 8047 -19409 -30546 -2453 44530 32833 16009
24342 16009 19094 24431 35546 38520 7149 11476 45468 63151 22079 -6137 33665 50972
24330 50972 35468 5647 3462 20459 12911 32623 26815 10229 -1700 16916 20034 -5002
24318 -5002 -21920 -20551 -9071 -15178 3570 -11564 -31424 -10415 13756 21311 41528 53223
24306 53223 81731 78868 48653 42861 10314 15148 28676 14551 2140 -15199 2504 -2827
24294 -2827 -7248 -7558 -12454 -4374 7193 9497 7662 14191 35798 46918 34677 6589 -7916
24281 -7916 -18866 -23529 -20227 -11160 -26985 -42263 -20222 1019 -12210 -7757 19155 13919 18987
24268 18987 -2871 -14950 -11560 -10590 -7293 -7055 -2149 -17568 -36449 -21899 -9562 21660 36910
24255 36910 17615 2133 7608 -1863 7023 6303 20619 31664 23840 18236 -417 -27632 -64497
24242 -64497 -65591 -47423 -58533 -52914 -356 32568 15463 -23118 -24637 -21139 -2032 -8749 15656
24229 15656 599 -11278 10537 15203 -4027 -19610 -28895 -8010 12863 8189 6424 20740
24217 20740 30343 30089 50352 25593 23378 6376 -1420 -661 -29255 -39987 -21397 9012 17670
24204 17670 -4125 -14941 -7474 9129 13838 29234 32791 39516 14967 -19229 -17720 -5340 -24980
24191 -24980 -2494 4255 16896 33382 40885 52601 48395 30458 17525 -2625 -1560 4901 5261
24178 5261 4794 -17504 -39613 -32450 7817 -4658 -7624 16978 -4286 -21733 -11945 702 -34033
24165 -34033 -32553 -8791 6895 9919 1380 -19211 -21904 -1427 49174 54852 38970 19540 18712
24152 18712 42850 16761 -6576 15894 28578 5653 13233 4773 -186 -34901 -47943 -68878
24140 -68878 -42596 -32329 -29324 -14105 -19164 -3354 8854 16373 24917 9717 -136 -4111 13189
24127 13189 26601 28929 28349 18145 25686 -2716 -13621 -600 -18430 4379 -5439 -11851 -9487
24114 -9487 1387 -1952 -30146 -14977 25098 37886 2587 -24141 -30790 -14219 8160 2335
24102 2335 -23895 -35009 -2268 8112 11408 25607 23368 34090 31800 8386 9760 16257 -5265
24089 -5265 -36935 -25533 -11545 -8662 -28269 -24450 7480 8911 -749 10137 -4469 -20246 17732
24076 17732 61019 49730 20486 9695 5909 -504 6763 1464 -28159 -42993 -49047 -30503 -28514
24063 -28514 -19107 -4876 -11487 2500 12198 -14541 962 5041 -23553 -13790 32467 48544 13229
24050 13229 2043 16884 14311 10278 -17292 -25024 -21447 -6217 -8940 -31816 -23882 1058 -23706
24037 -23706 -36626 -21754 -22540 7810 40339 49139 49211 32466 52601 82476 68821 46771 11204
24024 11204 -8713 -12903 12591 32022 38198 20233 -8856 1205 11576 20315 -14744 -55216
24012 -55216 -58350 -38860 -34591 -31827 -43376 -18282 9926 24395 17402 -21336 -29283 -24722 -9438
23999 -9438 -9723 9074 48299 44957 12043 -720 19389 10111 5751 -1859 -2406 10756 5841 -29202
23985 -29202 -55144 -26586 9172 -2591 -8051 1071 12845 22375 18479 24142 28399 -6015 -33279
23972 -33279 -51100 -80381 -66739 -21891 6191 -16070 -18611 -6369 12444 47484 55718 8854
23960 8854 -8732 24273 31902 22801 18243 38319 30166 3667 -1281 6333 23986 44272 44931
23947 44931 33573 39769 24370 13116 5832 4519 22516 13814 -8958 -7623 5450 19475 -10289
23934 -10289 -13803 -15356 12676 24156 21024 6511 5618 34251 42944 8958 -7688 -2341 -5162
23921 -5162 -16998 -7174 -103 11918 32945 60121 58484 37415 1651 -18560 2209 -21371
23909 -21371 -16891 -6146 -7436 -25115 -34100 -21265 -22151 -55617 -74586 -50392 -21835 17474 27197
23896 27197 35319 19293 6638 15494 4206 10155 -19820 -26992 -25514 -44395 -50030 -66648 -82139
23883 -82139 -88889 -52801 -25683 -15808 8424 1589 14129 6961 9038 8451 2684 27809 19982
23870 19982 -34865 -30057 -42666 -32610 -25011 -47334 -40740 -34059 -21833 -18858 -9156 6188 -25376
23857 -25376 -51089 -39593 -21589 7262 -16420 -56945 -55033 -33641 -17403 8793 -1673 13413
23845 13413 28660 25053 4025 -15551 -1827 29061 37391 24133 34804 27266 -185 -1159 8797
23832 8797 -16487 -30590 -43952 -38586 -20460 -36028 -33144 -34091 -27023 -17700 -7765 39172 58329
23819 58329 25565 -3490 -2628 -1581 16430 -18598 -41325 -25362 -10611 13774 37251 36143
23807 36143 19045 7964 8304 1824 5373 -16509 -23317 -11238 22062 26541 14094 5667 -4772
23794 -4772 -6047 -15460 -36194 -48623 -21788 -57130 -48166 -8498 -14283 -24570 22980 38063 11966
23781 11966 -4205 -20361 -19779 -2698 2780 -33627 -31762 -18513 -12299 -19578 -30045 -17767 -15498
23768 -15498 -12802 -22173 -26185 -16085 19924 32597 24990 -13923 -7649 9103 4565 -9019 1056
23755 1056 1870 4352 -5028 -6160 -13268 -4528 17839 3462 100 -7758 -23654 -69987 -59606 -9110
23741 -9110 5049 -18578 -54812 -59363 -45330 -17450 -6993 -17478 -51595 -43301 -33858 -56656
23729 -56656 -57903 -67228 -91870 -85369 -25957 9790 -5476 -15063 4162 22650 3979 -1823 13344
23716 13344 33464 47362 28675 4558 287 -11009 -21870 -13003 -6598 -2996 -4075 -35474 -26943
23703 -26943 -28109 -46635 -34566 -22688 -17786 -16825 -2443 30965 40543 22942 -21581 9579 17203
23690 17203 13361 27974 5130 3742 -5160 10022 4270 -15800 -12192 -6178 -26082 -12516 1784
23677 1784 8179 20895 21870 -6999 -37886 -25525 -15036 12225 9344 -19881 -12881 -10845 -8083
23664 -8083 -20669 -26200 4451 9517 15421 31202 37477 40894 31309 11366 12161 2524 18864 -16638
23650 -16638 -64871 -54501 9235 15235 14229 855 6712 13319 -445 2532 -3391 -25101 -33681
23637 -33681 -15653 4495 23411 4117 -24183 -29879 -17009 -21980 -19501 -25920 -20307 -27111 -21577
23624 -21577 -15053 2545 23882 30388 49553 23223 -18661 -9640 12990 16725 28647 30339 -10038
23611 -10038 -6740 539 -15189 -17255 -10625 -25265 -56124 -30495 17222 8192 -26166 -47274 -40458
23598 -40458 -40172 -25897 -15295 1910 -7776 -11624 5046 20127 -5536 -41313 -22577 2843
23586 2843 931 4415 18118 -6660 -26319 -13524 21148 14780 12446 -1565 -9666 5012 44586
23573 44586 49979 50631 19604 16904 115 8086 -10790 -17237 -10446 6504 24053 -4783 -3331
23560 -3331 15263 15072 -28 22474 46774 54413 41748 9513 2102 -6619 -7246 -21445 -51265
23547 -51265 -28915 -29472 -14897 12220 -8332 -1928 4659 18014 26129 25931 26924 15026 -12506
23534 -12506 -28354 -18409 -4831 6971 -26170 -24111 -3464 -23142 -39187 -66491 -61204 -31504
23522 -31504 -12374 2654 -3366 -9537 5802 14230 -2496 -4994 19633 38813 -4855 -43267
23510 -43267 -46857 -53919 -60894 -88119 -86477 -62133 -31960 -25431 -28974 -35266 -32409 -23972 -1542
23497 -1542 -4988 -8716 -16103 -42309 -35682 -37945 -27740 -25297 -25393 1653 -10565 9908 5997 2412
23483 2412 -23856 -12695 13950 19328 23070 11520 13264 -4671 -9061 -14560 -22071 -28748 -40583
23470 -40583 -20129 11321 4100 -4641 20457 30452 25025 14225 -5826 -1943 -8712 -13409 285
23457 285 -13291 -651 11287 24784 40490 36580 16873 8173 -6329 3836 -1191 1290 18871
23444 18871 23868 13059 13139 -9625 -19748 -34014 -67488 -74221 -33030 13512 16721 6527 40532
23431 40532 30316 -5976 -23976 -38310 -25935 -14036 2047 -2479 -29115 -55763 -77927 -30009
23419 -30009 -20703 -14379 -14751 -48489 -42785 -30427 -39224 -59956 -41829 -28814 -16685 -2658 7325
23406 7325 -6225 -4082 -3861 -5487 6450 25668 21640 22455 1437 -33196 -51568 -64873 -35984
23393 -35984 -6580 34673 41973 31390 26495 292 -27248 -14392 4014 30779 30820 11288 6345
23380 6345 18863 -6423 -10743 17644 43747 28873 29625 14640 -14697 -7803 13622 13898 38426
23367 38426 30565 26580 31100 22781 8352 -19720 -19221 -23576 -10838 -12985 -14326 -21001 -11706 9034
23353 9034 -27 -10422 -11963 -4979 13164 13017 1825 -19585 -7038 7541 -5816 13496 18024
23340 18024 -2605 -14500 -5945 -16381 -26971 -26099 -32071 -46031 -60075 -31671 -1708 -8867 -35336
23327 -35336 -37073 -51262 -28750 -17313 -35473 -16039 23038 64325 60507 49612 36898 9117
23315 9117 -1868 -6017 -12170 -11989 -17913 -16501 -15218 1427 -7250 -15331 -13123 1378 16279 2175
23301 2175 -17298 -20903 -28213 -46309 -12193 -3303 -11577 -6011 1756 -16756 -4151 -15190 -41610
23288 -41610 -26806 -22791 -10168 -5644 5504 -9529 -15749 -15904 22399 46382 34300 16088 4297
23275 4297 18369 27187 22131 22048 19701 5738 -19124 -12116 28646 59156 59254 36862 16588 16175
23261 16175 12850 8303 3392 1814 -333 -21927 -38051 -28639 18272 29219 -25841 -22912 -27956
23248 -27956 -20128 -2666 -2606 -909 594 17510 31356 38402 17803 49588 65722 44031 4142
23235 4142 -1303 -9102 -11081 1709 -3532 -24831 -39044 -35820 -9952 5298 2234 -3193 -13135
23222 -13135 -6649 6266 -28143 -26047 -5155 -8514 -30207 -40681 -36150 -46952 -54020 -72210 -71983
23209 -71983 -37966 -9639 15578 37928 8574 -7588 -17859 -37623 -49586 -17338 -10028 -17703
23197 -17703 6302 2882 -4864 4954 23574 3018 7512 33371 47368 20826 -25885 -43049
23185 -43049 -31665 -28194 -24522 -20184 -10800 -10427 9508 39347 32599 16377 24746 30612 6432
23172 6432 3875 36341 26029 24236 22434 514 827 13504 31415 44680 62590 58016 57981 67305
23158 67305 32935 -5955 -1099 35149 74270 36455 5775 -26358 -29291 -16675 -4630 634
23146 634 -17859 -25302 -37845 -21799 5969 -1923 -6782 -11212 -11403 -22038 -22524 2279 18694 -14676
23132 -14676 -31133 -14279 20014 284 -17201 -26873 -7011 -6125 2851 6372 24849 -1389 -37971
23119 -37971 -53335 -60732 -40274 9872 11836 17839 812 -14281 -8397 12126 26214 24970 26059
23106 26059 12985 9397 2020 -6324 -37295 -49990 -35064 -16283 -16011 -1515 14977 11015 20534
23093 20534 -15642 -28507 -25046 -9285 -33100 -52202 -32806 -23863 -35049 -45078 4671 24456
23081 24456 -2295 12935 -4893 -32779 -38690 -14692 7547 -10388 -15939 -7008 -5562 -6567 -11683
23068 -11683 -6116 -5014 -17630 -53011 -61261 -51536 -38936 -27982 -35394 -45435 -37475 -39400 -25307
23055 -25307 -20931 -28114 -18330 24714 50869 38663 13280 23068 42428 18854 -4296 -51711
23043 -51711 -63458 -43861 -23339 -5458 -20435 -8783 17952 -6389 -22270 17026 48164 55805
23031 55805 44081 56145 69964 62030 41622 12009 -14538 25620 43856 54107 63131 39388
23019 39388 5387 -14158 -45118 8839 41429 38374 13310 8913 -2402 2982 1500 10929 13968
23006 13968 2692 -10124 -14055 -4312 20262 30435 25336 -2640 -5928 -6646 -8882 -10203 -15976
22993 -15976 -21131 -25532 -19139 -12748 -37759 -33122 -4589 29675 42589 16917 14845 12251 6680
22980 6680 4659 11414 -295 -11768 -14779 -38319 -59442 -38035 6440 -3848 -1185 -4437 28533
22967 28533 35093 3474 7958 22134 7877 -17746 -21670 -19732 -11735 -1115 -23410 -40933 -13882
22954 -13882 -4985 2405 23698 51219 49885 25741 22984 54890 64659 20551 -34327 -57578 -54867
22941 -54867 -27770 -29480 -17443 -10799 -8974 -10906 -3689 3335 15277 -12844 9778 45724 22339
22928 22339 2092 -14009 -38789 -27457 -19592 -18027 -24232 -43756 -51549 -25797 4542 4 -13307
22915 -13307 -4629 -23865 -38455 -5753 -1512 -17687 -18363 -22065 -18439 -12299 -6936 4183 -123
22902 -123 -10368 4148 17409 -583 -9592 -18383 -13307 8202 21674 1674 -26729 -24558 5504
22889 5504 18751 13953 7423 13188 -23299 -38147 -46196 -61763 -58278 -69641 -66252 -17125 17757
22876 17757 33905 13834 636 263 7898 -14859 -19538 -17226 -12973 -2260 -4078 -10835 11297
22863 11297 29151 -2404 1589 6808 -1825 5532 9005 -4658 -14143 -26631 -20248 -6178 -12594
22850 -12594 -20262 12147 21314 35734 26802 35891 44279 52758 56345 44236 14523 14370 -11692
22837 -11692 -17652 -19366 -5591 -7632 -16004 -35184 -21499 -6836 6107 17091 12971 -4956 9736
22824 9736 -23772 -24943 -8871 15493 8026 -24225 -57537 -40247 -12969 -18721 -20839 -7802 -28370
22811 -28370 -44259 -26731 -17862 -13489 -5307 -9432 -10719 -8105 9246 6576 -11014 -6121 -322
22798 -322 10000 28888 10309 -7714 -9311 -260 5604 2880 -18792 -47652 -42981 -28363 -27219
22785 -27219 -33388 -5408 23707 17693 23504 34437 33086 24437 -10455 -28437 -46808 -62150 -70461
22772 -70461 -34639 11260 29123 -131 -2680 -4584 -8009 -5645 -15972 -19827 -16293 5303 24048
22759 24048 22581 14018 5135 -22601 -36273 -40573 -34382 -11005 -15030 -2191 16336 15807 -4631
22746 -4631 3190 11832 14585 45485 62411 11666 -34511 -17512 -14749 8575 8357 9372 8989 5490
22732 5490 197 1180 -18739 3699 11508 5548 11093 -9953 -14652 24919 25913 25656 2978 -43803
22718 -43803 -39655 -9290 24466 26711 -7429 -16155 8064 34734 40279 13563 7520 13266 7275
22705 7275 -125 -11158 -11766 -138 -2203 11548 37971 19746 -4917 -20097 -28524 -50145 -41960
22692 -41960 -12607 -4212 -28516 -4653 -15074 -22578 -11359 -9995 10134 -11327 -11249 3130 22045
22679 22045 28597 5870 4646 26466 34722 -7097 -29060 -27625 -18802 -16170 -7878 -32317 -33427
22666 -33427 -15580 -4760 -13880 -19457 -21279 -21614 1212 -7318 -10057 -19201 -14583 5235 12030 -9535
22652 -9535 -19782 5628 30714 67508 73134 56556 16943 6269 -1969 27517 27725 -11984 17793
22639 17793 13375 -660 -940 1255 -10708 -10488 -6700 -21256 -22253 -9307 -15268 1055 -11504 -14409
22625 -14409 9791 -4319 -9216 -28457 -26611 -19200 -4294 -3678 -12861 -3811 -3381 -10971 -8852 -5831
22611 -5831 605 -5881 -12100 -3771 -5740 -19164 -28829 834 20409 2470 -18117 -8486 22129
22598 22129 10492 -13144 -10195 -15979 -18307 315 8725 -17639 -58399 -32397 -11070 -6438 -4421
22585 -4421 -8133 -29191 -41672 -39426 -9934 15755 3875 2245 9310 641 15340 5320 11848
22572 11848 7956 -30099 -24058 -14904 -27146 -53606 -38823 -61789 -66178 -30324 -30933 -50739 -31721
22559 -31721 -65052 -52179 -21956 -52041 -53150 -22573 -16918 -23189 -43052 -28701 -40641 -37170
22547 -37170 -51840 -46447 -6689 3854 7561 27982 39907 3923 -6010 -3617 34692 17971
22535 17971 22685 32908 4251 -23566 -36186 -27111 -14883 -3521 -37344 -63351 -44031 -37219
22523 -37219 -41021 -27768 -18436 -40053 -16361 -25851 -40614 -27918 -25668 -32446 -28393 -20499 9442
22510 9442 49321 49183 24419 7656 -7310 -5111 -3111 9909 19035 11521 -1059 -24599 -20841
22497 -20841 -13586 -24340 -9268 11400 16637 -11109 -11988 -17650 -4350 10947 13040 -4751 -19377
22484 -19377 -24814 -41737 -66729 -86713 -78347 -65915 -31178 -41945 -50301 -57587 -44167 -54196
22472 -54196 -39211 -25625 104 33520 34212 55460 57001 37436 21695 21700 30148 17116 -12065
22459 -12065 6101 36449 45861 57169 34145 2665 -1158 8813 -6600 -13430 1898 8192 14745
22446 14745 15058 -5929 -1052 13720 16913 -3139 -3983 10659 -9550 -61137 -33181 -16050 1149
22433 1149 -24291 -41964 -11693 5574 -14664 -35698 -59537 -77144 -83941 -75197 -40728 -18977
22421 -18977 -21337 -32221 -6220 6813 13717 7980 1881 -14860 -45178 -44503 -44171 -27449 -8842
22408 -8842 -9005 2114 -1943 -19948 -39351 -21917 -10014 -5238 6565 12321 18654 19143 -9205
22395 -9205 -26220 -32305 -39262 -59253 -72451 -79369 -50991 -41638 -41471 -25183 -13788 1274 13020
22382 13020 31275 19759 3756 5136 26351 6106 8536 11553 -8393 -16124 -23923 -44545 -42643
22369 -42643 -36494 -25183 -19731 -21833 -31553 -26637 -56144 -54356 -21965 1334 3849 38468 53245
22356 53245 -6136 -28575 -4756 -20395 -12721 -3820 -3147 -9387 -2384 2436 11187 -1305 -29285
22343 -29285 -40554 -20025 -31905 -44446 -31949 -20242 -23917 -40771 -26048 -9695 -9213 8194
22331 8194 -814 -5124 -3308 -16336 -61017 -82610 -65240 -64200 -57674 -17755 -7249 1767 4953
22318 4953 19003 48303 12779 2268 20653 31666 8072 -27380 -41028 -35753 -14750 12383
22306 12383 48313 37162 -14176 -50126 -22715 7015 -1098 -16910 -3435 2745 922 -5799
22294 -5799 -17181 -17704 -14227 -24180 4698 18267 11846 -10695 -4351 17513 -23027 -24894 -18384
22281 -18384 -22158 -21402 -6405 4724 3127 -4216 -17019 -39308 -14393 -7298 5850 -23100 -29366
22268 -29366 -20036 -4377 -16279 -16187 -22849 -23118 -27619 -11164 -34520 -44345 -38637 -14862 5648 -6055
22254 -6055 5323 6982 3388 -38089 -63879 -68017 -49697 -16656 -308 -10134 9445 13560 11617
22241 11617 30165 34700 20679 10460 -8726 -15550 -17030 -1741 1931 -4539 -14038 -24894 -46280
22228 -46280 -55435 -35201 -36593 -30231 -47688 -63581 -54185 -50204 -32237 -34566 -63434 -53693 -60021
22215 -60021 -38534 -41922 -56717 -48725 -34537 -22653 -7190 26592 -3287 -52993 -37036 -31999
22203 -31999 -31211 -12065 -20078 -25084 -47585 -55280 -27546 -17620 -1246 -17530 -25817 -23921 -41519
22190 -41519 -38755 -23170 -2450 7946 -8415 -33130 -49506 -47259 -35935 -21538 -13616 10900
22178 10900 17153 9718 -517 25426 26275 7147 24954 48658 20481 27868 48722 35053 -3992
22165 -3992 -21782 -21981 -2308 -9180 -17872 -12381 -26132 -29644 -11576 -20467 -6621 924 26362
22152 26362 12007 -24135 -9845 -29604 -7855 9058 -7491 -2334 6447 -8055 -13342 -25540
22140 -25540 -22738 -17416 -16556 -17538 -4936 23847 8652 -10860 -32660 -30713 -8506 14062 27664
22127 27664 38940 54100 69251 63252 67815 53884 13811 -1999 -18359 -10948 8390 -9173
22115 -9173 -20962 -6040 -13516 -7245 2010 30168 30359 32908 32215 34402 34491 11916 4209 -11161
22101 -11161 -13607 -705 10143 15751 9453 9027 9801 18633 16187 32525 55333 44656 37576 42058
22087 42058 59547 82129 59085 39999 13514 10792 -5937 6841 16418 30324 22649 -4717
22075 -4717 -17555 -43091 -56289 -34382 -20663 4494 27529 10884 1471 -26170 -22974 -26389
22063 -26389 -25134 -27698 -14957 -12852 18815 7620 -7532 -27725 -51796 -70706 -94590 -65561
22051 -65561 -50580 -72536 -41571 -21514 -5154 -11433 -5773 21394 27253 5694 24117 12029
22039 12029 -12632 -10926 6787 12060 42711 57767 21704 -16140 -6938 -27768 -62062 -40034
22027 -40034 -5292 11018 24026 18498 5424 18556 13458 13006 7166 6584 -19881 2589 18515
22014 18515 18224 -11695 -8410 -16787 -20074 -21750 -35778 -43840 -9086 -20860 -33742 -19947 4343
22001 4343 6084 6116 -635 -16910 -4686 6291 1859 -15493 -30555 -9242 9045 877 -19261
21988 -19261 -33087 -37547 -13243 2275 3913 -13633 -17349 -38246 -48365 -75983 -80001 -44268
21976 -44268 -11543 18489 15656 11893 -11173 -33105 -31902 -26768 -15244 -10687 -11779 34462 65122
21963 65122 53134 42180 19649 -13816 -11776 -3461 -20774 -20225 -16888 -11069 -15058 -4515 7352
21950 7352 9710 44339 47074 14656 5314 538 -5920 2321 8443 -18334 -42487 -32904 -20387
21937 -20387 457 22315 34 -20276 -20882 -14263 868 -8577 16286 -3358 -17750 22911
21925 22911 25379 18019 19755 12745 51354 44573 -7571 -36579 -23523 -17245 -1827 8521 -4415
21912 -4415 -6005 -14229 11242 35205 34704 30505 17629 9540 -6125 -4738 22587 15232 -20480
21899 -20480 -24270 -7317 4673 -9133 -30396 -32059 -10933 -19228 -5707 2400 5754 2217 8045
21886 8045 8905 -6321 -28549 -62990 -73961 -70042 -72944 -33632 -33594 -44236 -37327 -26391 -24620 -31961
21872 -31961 -35465 -38019 -29796 -32090 -20288 -22000 -25236 -32831 -392 8933 -11007 -34711 -47476
21859 -47476 -34042 -2493 9356 2230 -28637 -47878 -25533 30 11534 24323 16487 -6201
21847 -6201 -1390 -11066 16251 17323 12850 11778 7903 -6330 22107 8727 -22070 -23431 -18753
21834 -18753 -10226 8090 50089 63627 69842 41692 18673 10774 -10548 -9490 7257 -2438 -4549
21821 -4549 29405 46067 36512 20478 695 -12986 -15597 -19118 -2052 1024 -20133 -9481 -31486
21808 -31486 -38997 -19343 20869 64553 68746 30945 -700 -3219 -3473 -12603 -35985 -24428 -12216
21795 -12216 -3091 -5914 -7847 -12963 2764 13176 20958 25560 49899 58443 54266 27645 7452
21782 7452 -20259 -13164 3369 27525 37111 31225 13139 -37363 -62094 -37232 -19961 18816
21770 18816 29040 15918 7301 10783 15061 30585 12857 -28675 -35116 -19630 -45509 -27000
21758 -27000 -15682 -8431 -3306 2590 12260 8551 -6756 8806 16086 17551 16903 21331 -10007 -22838
21744 -22838 -1665 9739 24703 14192 -1477 11957 15409 7943 -5773 17324 7284 3892
21732 3892 17018 11663 9470 -7295 -41814 -49184 -33424 -26793 -21162 -8139 -4284 7674 6635
21719 6635 5245 19898 29627 25838 14629 40269 30241 37101 47349 45345 21531 -11643 -19520
21706 -19520 -32058 -6455 880 -2793 -5817 5000 -12059 -440 14747 33544 37606 38545 25580
21693 25580 266 5899 -23518 -46318 -51670 -55501 -21020 2723 -18429 -27625 -36622 -41480 -22813
21680 -22813 12493 44518 35483 39571 22082 -3938 2211 -4305 -22039 -35959 -19755 5318
21668 5318 -1531 14549 14566 22653 24151 23111 -11480 -64033 -62388 -30341 -27928 -13674 17020 -9615
21654 -9615 -10835 -9486 -29317 -47877 -54627 -52017 -21359 -28290 -17968 -33425 -17346 -13054 -8633
21641 -8633 -40237 -50106 -29355 -35287 -633 22538 14480 9231 24474 25640 7995 561 2245
21628 2245 -10703 -13390 3779 17981 2419 1245 2747 5164 11033 2015 -2132 18976 39161
21615 39161 26026 12799 14319 -9363 -27161 -7510 14383 27329 45153 32283 19409 10486
21603 10486 10215 24199 16754 24611 -2589 -19790 -9869 5871 -15435 -49215 -56909 -64612 -79169
21590 -79169 -73999 -48771 -36633 -23649 -11794 -13716 -23162 -3571 -488 13073 18059 44578 36105
21577 36105 -1886 -27373 -45677 -31968 -2478 -16841 -682 -14348 -38270 -54113 -70872 -50821
21565 -50821 -19727 32444 37271 14262 25330 10458 23447 39902 22837 7262 -7570 -28471
21553 -28471 -34413 -39349 -60848 -62746 -35399 -4215 -14658 11954 19472 28638 35059 51033 61209
21540 61209 56660 56990 53145 33348 15180 -10893 -23659 -11390 -2486 -372 -12433 -20686 -10221
21527 -10221 15431 18371 30864 29170 14647 -1938 -9976 -17272 -31839 -29336 -24616 -20905 -16276
21514 -16276 -9129 5600 30899 17102 -32301 -71762 -70589 -51209 -39138 -20097 -38453 -39253
21502 -39253 -23054 -17249 -34617 -29410 -26633 -808 18386 17000 26649 25590 30074 26715 13459
21489 13459 9662 1090 10608 32560 7391 16962 33875 46636 49339 36271 56330 60632 58161
21476 58161 51005 40053 15924 -3904 -7073 -7477 24595 32771 16741 -8420 -19847 -2868 33701
21463 33701 48916 35614 28792 41297 27623 -11106 -6044 -2846 8722 13265 -2 -25529
21451 -25529 -15251 12432 44503 39635 52553 61127 40228 29637 -11292 -19792 -31700 -41463
21439 -41463 -26884 7023 35938 36127 23641 -12658 -27973 -7369 -7482 32820 51561 53855 30460
21426 30460 -2477 -23983 -35852 -21894 5491 825 -7733 -26535 -42645 -33317 -14148 -21077
21414 -21077 -9824 3531 1669 13823 5896 1721 -5724 -38110 -41917 494 11532 -40711 -42916
21401 -42916 -38581 -10397 -7450 -33413 -43822 -44280 -10387 4938 -6192 -15357 17411 48813 36578
21388 36578 26921 4602 9366 12246 16289 22052 13636 23366 19640 29027 16560 18774 7410 9774
21374 9774 42809 71276 58225 20552 -6256 -10697 -24786 -30259 -15308 19523 26045 38374
21362 38374 33614 32418 60036 43317 4102 13876 10501 -6093 230 18549 6113 -28677 -36299
21349 -36299 -22084 -1567 -2318 17296 33046 35807 29435 8849 -27544 -31050 -12931 11280 7881
21336 7881 -2812 -15777 -1062 -18821 -31686 -13125 -17587 -11143 9687 25837 48370 52797
21324 52797 25051 -9296 12254 56919 55058 33692 -299 -29565 -57626 -43620 -17985 923
21312 923 -26073 -42853 -47078 -23672 -23834 -11629 216 13083 22405 17386 -13310 -52257 -36397
21299 -36397 -3498 2356 -17997 -16420 -1494 16954 1469 10837 -12435 -31923 -31594 -18335 -9308
21286 -9308 -23928 -4437 30737 32371 11494 -21493 -16100 -5166 21007 16213 8010 25027 48450
21273 48450 37788 14529 23161 50413 45084 9978 16421 38364 38909 14118 -8552 -13627 -15845
21260 -15845 -23608 -47152 -40457 -49694 -47165 -39533 -39297 -33832 -22967 -22333 -31909 -48727 -48339 -48246 -38276
21245 -38276 -2841 16196 28281 23994 -2706 -17518 -39304 -46288 -16045 -16300 -13362 -18503 -48497
21232 -48497 -62418 -41577 -12275 -33878 -38645 -12752 2561 -15390 -22742 -15144 -32533 -43635
21220 -43635 -29152 -9657 -3005 -13165 -30054 -34427 -45138 -38319 -15799 -5653 3755 6551 -10716
21207 -10716 -21526 -36118 -23777 -4273 -17579 -13131 -4356 -40254 -25223 -8181 -34818 -34482
21195 -34482 -28669 -1454 18840 9587 2303 -6761 12139 23172 10650 10455 3161 -1969 -5025
21182 -5025 -10000 5012 6266 15268 5280 -35231 -43002 -38569 -25021 6005 10669 11844 7329 -16543
21168 -16543 -29297 -27623 -27372 -15420 -15201 2192 -10009 -36886 -57254 -61231 -52329 -49165 -19013
21155 -19013 -4990 -15736 -27301 7027 -2657 -14546 -12476 -19384 7083 12210 -13805 -25043
21143 -25043 -2666 -10795 -7152 22312 36022 34109 19932 7965 15479 17194 27733 35594 24747
21130 24747 17432 14326 30088 26105 8397 16138 16668 5818 15100 3793 -23759 827 19182
21117 19182 12072 11079 361 -13406 -11721 -3900 -15632 -64118 -67538 -56884 -41023 -59592 -61069
21104 -61069 -33739 -575 -7612 -22161 -23826 -32537 -24050 -35796 -41468 -35045 -33548 -26446 -31605
21091 -31605 -47991 -26808 4261 3569 6667 -24936 -36675 -34702 -24684 -18515 -20497 -31932 -35874
21078 -35874 -29585 -5604 -11559 -4911 -9665 -10137 -12724 -18187 -21041 -20199 -16127 8718 23750 43964
21064 43964 46569 64275 43586 27766 36234 19910 15792 20844 6625 -7032 -11886 -1601 15045
21051 15045 8165 19820 33077 34331 18295 2877 -10664 -9510 -11623 3801 16177 19531 1184
21038 1184 -14084 1642 12831 7039 -9739 -35516 -29763 -7393 -22801 -33268 -27318 -5234
21026 -5234 -4681 -17801 -16874 11871 -5596 -11576 -17682 -11604 -9673 9017 1931 24781 36274 49329
21012 49329 69940 69881 52588 36034 3823 1810 10458 50810 20438 -13088 -10486 -10921 -12741
20999 -12741 -22146 -36913 -12749 3677 20143 23476 31462 22957 -8043 10627 12309 -5789 -5169
20986 -5169 -1637 -6651 -18854 -9996 18795 -4921 -26804 -5729 13179 9109 18687 -11322 -21257
20973 -21257 22492 47585 43486 59394 56947 31715 3025 -16452 -32060 -27988 -19296 -44440
20961 -44440 -49524 -42384 -42454 -21500 -23289 -11240 17997 19294 -14644 -3987 33978 47336 20753
20948 20753 -11054 -16109 -7805 -8763 -13665 -16061 -25343 -30080 -701 5440 3954 -491 -20083 -24198
20934 -24198 -25434 6147 24018 25834 41639 45578 25377 -5964 -18687 -4822 7633 3992
20922 3992 -491 10868 -2247 -21968 2071 24031 29177 2039 30153 22719 5875 -2707 -14291
20909 -14291 -10698 -8538 -4287 -5203 -10688 8234 23927 27596 23156 16790 941 -16867 -24031 -26324
20895 -26324 -2333 -4656 -25294 -44754 -45790 -46691 -37206 -32929 -18978 -6771 -511 12220 5400
20882 5400 -678 30233 52534 53323 23158 24668 44206 57959 51240 7147 -8502 -10094 -40600
20869 -40600 -60888 -37402 322 -3350 -19347 -48998 -43946 -31199 -19618 -12000 3440 4759
20857 4759 10252 18689 13812 6767 -3931 -20353 -15271 6039 12675 26852 26928 654 -26222 -29769
20843 -29769 -24898 -10499 -6083 -3463 -34199 -52210 -53102 -31127 -19201 -38638 -46143 -32493 -4342
20830 -4342 8661 16636 16552 -14168 -2450 13072 11436 3128 23177 13932 11558 22784 14004 -16278
20816 -16278 -20170 14465 45131 40819 23809 26779 22415 4981 5237 -6366 21022 13907 -15879
20803 -15879 -19370 13337 34626 27744 -7101 -31130 -36714 -46423 -48772 -24165 -7243 -5599 6209
20790 6209 3178 -74259 -87649 -59617 -37203 -3986 23107 48468 14005 -16050 -23316 -23541 -7655
20777 -7655 12461 13224 -31719 -50175 -53013 -32117 -15699 -26757 -34892 -36040 -12334 -9650 9345
20764 9345 25168 12288 -8205 -8294 -12838 -22671 -7408 11360 -19705 -50473 -32460 -19617 -11060
20751 -11060 4860 -17526 -16100 27814 44814 22162 3500 11033 25232 30915 14494 -6796
20739 -6796 -7065 -14326 -6936 31630 41212 30748 -7350 -18450 -9513 -20471 -4112 27547 4876
20726 4876 -11087 -22648 -20572 -5574 -6841 3420 34537 37008 14990 -1805 -22561 -36165
20714 -36165 -14589 -11015 -514 -7014 -22300 -30105 -33674 -38894 -38999 -44876 -47733 -20112 -6038
20701 -6038 -16094 -28018 -21971 -41355 -37884 20776 16006 29073 13184 -23152 -6349 -15265 -23209
20688 -23209 -27053 -13653 -2730 7044 20281 45559 52700 49408 44136 33766 42984 51259 35426
20675 35426 15442 9101 20328 -6161 -26274 -3188 23920 12403 -14574 -22884 -28901 -42152
20663 -42152 -42305 -55456 -29053 -25855 -29975 -42659 -36768 -59948 -86533 -73158 -45850 -12038 2498
20650 2498 -7630 -15307 -3116 8073 -21591 -21263 -29734 -41250 -16505 -15976 -14470 -17252 -14730 -27248
20636 -27248 -42941 -27853 -2621 12935 5258 -12377 -2848 -4464 26326 62497 56408 34114
20624 34114 30261 35870 30680 19468 6367 -7198 227 20618 21850 -4032 2018 1490 -5238
20611 -5238 -11991 -21501 -7286 4202 13358 15980 1382 -3811 -1542 -6572 -12569 6595 -5813
20598 -5813 19401 45082 38411 19853 9900 10863 27437 24300 24833 30171 29912 20417 22514 40624
20584 40624 24154 2265 -47317 -64146 -22427 -18247 -11256 -2907 17682 723 6149 1752 -13911
20571 -13911 -14009 -26162 -48008 -53143 -63003 -58152 -41695 -21962 -16317 3798 12715 33176 26050
20558 26050 -597 6385 25627 47725 65877 33793 14806 -2869 4801 25215 50541 41676
20546 41676 19057 40173 20209 24481 3835 14079 20647 5645 -8014 -8697 -12444 -13744 -3905
20533 -3905 -18602 -34063 -43418 -35685 -11307 3077 -7864 -9125 649 -10781 -9167 -17429 -11032
20520 -11032 13096 6409 7239 12673 13697 3300 -9468 -30227 -33150 -17829 -1941 -15670 -17780
20507 -17780 13727 7589 -19033 -23134 -9451 -14622 -32616 -1022 18502 17343 15959 -8805 1182
20494 1182 -3828 10988 23330 32711 21399 1855 -17283 -31475 -35382 -36114 -36132 -15901 -3285
20481 -3285 -4955 -29210 -29242 -9114 9749 19904 33936 20997 22086 10387 25367 20476 12524
20468 12524 27214 22842 26078 19528 410 -4848 5518 14136 29979 23935 -8569 -8671 -19629
20455 -19629 -36114 -20233 -10866 -6375 1659 -12453 -5778 17348 159 7065 -5884 -19383 -9528
20442 -9528 -35424 -9308 2239 -11824 -14459 -17929 -31184 -22105 -37943 -33207 2665 25216 26855
20429 26855 16520 9284 10936 2426 -11807 4945 3994 6489 6786 9479 7132 -6351 -520 8597
20415 8597 -16054 -9705 16501 2721 -3864 -28774 -5886 22520 5009 9220 8991 -21061 -11321
20402 -11321 18113 14684 19460 32996 9030 -10606 1617 -7633 -30842 -47637 -4940 14431
20390 14431 6026 -9851 -17514 -26779 -23792 538 29267 8513 9646 19525 5183 -17407 -16596
20377 -16596 -23864 -10532 17256 4497 -27851 -43455 -21941 16118 36884 29219 17354 2939
20365 2939 10060 6740 -5089 -274 10833 16511 34127 15467 7271 15353 6992 23249 27832
20352 27832 6255 8423 19052 19649 -2608 -4711 -9922 606 -10305 184 11124 24775 27688
20339 27688 12104 3775 13877 16349 22907 29386 52843 45979 3712 -3544 6855 17134 17718
20326 17718 556 3490 26340 36586 48721 33174 -7769 -21219 -5273 -5641 -1557 31867
20314 31867 49372 27446 14376 -14712 -36785 -26347 -34225 -25431 -11158 -10911 -8692 -10111 5588
20301 5588 -3210 -8226 -4690 -11565 -3960 7758 21907 17351 28276 16812 9921 -16761 -20744
20288 -20744 -39984 -33965 -22209 -33904 -13455 3381 25262 43362 32201 23583 25868 22898
20276 22898 20534 15888 23832 8 -26280 12308 8155 -29290 -43567 -31353 -35725 -34948 -10402
20263 -10402 -4243 4477 -14209 -33130 -38029 -19877 40633 75878 83082 57003 24573 40671
20251 40671 29247 23803 32224 65668 60656 30007 2045 -10708 -13103 14878 33300 8993
20239 8993 -5044 42063 92284 69898 30457 28293 24275 26151 29708 43859 6479 11750 30940
20226 30940 9406 -7250 -15073 -6115 19547 32612 12541 -14117 -27679 -27739 7606 24195 32454
20213 32454 29746 22307 19304 -3583 -24121 -40939 -37126 -38580 -17727 21677 48450 28724 11743
20200 11743 -14087 -11720 3627 16404 19875 27641 10617 -16941 -17390 10422 11490 -1491 4033
20187 4033 -14303 -13235 -14260 -32460 -33253 -35178 -13299 -7649 -9148 -12120 22522 18829 -2246 -3902
20173 -3902 8849 8260 24734 42172 38937 25188 19710 28298 22266 9480 -21158 -30514 -21690
20160 -21690 -1272 1693 28276 45623 70404 60416 39701 16041 4133 -13441 -15744 -3310
20148 -3310 22438 39990 58111 58112 49342 30307 6703 -4419 -1677 -4478 -22543 -2130 28297
20135 28297 28127 35247 28199 16140 23419 29762 9834 -9666 -30742 -31799 11605 24428 18226
20122 18226 41062 15454 -9895 -49031 -54176 -40645 -28001 -22633 11891 8266 22616 38840
20110 38840 28357 13843 13051 -7392 6078 4783 -3388 32252 10239 20804 50765 34464
20098 34464 11079 30815 34766 23747 33265 41944 27602 26213 36533 22183 39880 34583 11425
20085 11425 969 -19520 -31798 -22280 -16943 -13788 -11622 -18200 13901 28387 233 1012 -6190
20072 -6190 3748 14132 20713 10267 10792 25377 51931 58832 36427 30377 12021 -8448 10239
20059 10239 47735 27665 9828 20392 45624 71659 58413 45255 51393 57191 30685 -1357
20047 -1357 -20054 -13420 19979 24412 9493 31321 59360 70421 35406 37249 20345 20726 44462
20034 44462 35232 -4571 -15278 -8593 6409 -28925 -25777 -20287 -24903 -523 9044 17457 28530
20021 28530 21993 4383 22788 22309 -33654 -29593 -11700 25060 43547 35552 26069 9134 3752
20008 3752 14522 31188 52412 49406 32423 432 -22651 -33917 -8108 6347 9333 25631
19996 25631 14685 -13864 -15513 -4385 5154 7420 28559 37002 29042 43616 61799 39571 -9248
19983 -9248 -34157 -26630 -839 24628 36222 38228 5467 -24095 -31773 -28993 -37649 -31006 -35968
19970 -35968 -29747 1132 -10625 -9207 -39102 -30466 -32844 -32695 -26143 -12330 13373 1760 -9497
19957 -9497 -961 -3023 -10927 5697 747 -2130 10374 35842 51725 42069 9521 -13122 -37282
19944 -37282 -50519 2814 31020 18137 -6674 -2114 23796 49160 46283 49377 45548 52368 58600
19931 58600 30591 2072 -1806 43856 65798 57428 41095 47772 23117 -274 3360 -11822
19919 -11822 -22561 -16867 -7401 13441 -9093 -34754 -31628 -2504 16035 -11007 -26517 -3293
19907 -3293 5943 -14275 -24871 -44931 -40156 -40079 -35286 -16222 11587 9944 -15263 26684 41499
19894 41499 9800 -2382 -24507 -37711 -30219 2947 9649 22858 36610 43406 38869 24930
19882 24930 58606 65488 45046 44187 38698 24867 17638 44668 54915 21935 -12854 -49414 -29361
19869 -29361 -406 24416 21353 19394 23941 24646 12736 28462 54755 40396 -1620 -31189 -25484
19856 -25484 -32139 -32753 -24494 -22301 -19223 -16780 -21025 18321 40675 64330 79322 48680 16209
19843 16209 11493 2241 10798 30568 18942 6815 8320 7630 24770 44946 64444 69734 46880
19830 46880 19011 33760 22282 21936 42208 21113 -375 -9744 -7539 4248 -3376 8454 22162
19817 22162 41319 39737 19189 20251 18501 8566 13575 27796 45414 36607 10268 -16722 -20973
19804 -20973 -2246 12422 1345 -4975 -16148 -14257 52 6147 18811 12035 -6074 5111
19792 5111 5592 17411 20759 19086 28579 18800 11382 9894 -3709 19805 29240 32321 22446 -4329
19778 -4329 -32056 -16824 -8102 -257 12788 4073 -14970 -26535 -38598 -49127 -43533 -22744 -124
19765 -124 17441 -7084 -1594 7983 24384 56948 42181 34723 39728 40435 49637 25524 9706
19752 9706 8945 27489 37284 46156 26324 1468 14133 20541 16851 35986 45740 50228 47899 26896
19738 26896 25764 18221 13267 -17269 24119 10023 -3036 9639 25315 30145 40251 38801 50017
19725 50017 63335 30288 7185 -16808 -25182 -7331 11646 41065 60227 69010 70980 53980
19713 53980 52941 47516 -5239 -28429 -10301 10000 23491 28974 33492 27668 -21627 -38276 -14868
19700 -14868 18899 22751 32933 40390 25469 27440 -859 -18183 -35165 -4840 29651 44600
19688 44600 53940 14634 -22074 4418 40722 50255 15414 27530 14521 -8687 -22853 13180
19676 13180 41187 29543 -14915 -18598 2801 3026 24380 17203 3215 -385 12664 36209 37798
19663 37798 34786 45543 59271 68410 50195 47192 43024 35481 52302 56268 34480 7670 -14622
19650 -14622 -11788 12264 40479 66867 66164 28511 22432 44415 54221 36755 41333 61046 92054
19637 92054 58721 30578 22921 32924 16932 -11159 -9488 -16622 9158 22139 40452 48281
19625 48281 60902 60762 42285 55946 48543 30817 -2263 -12952 -5400 -5179 -13500 -10991 -17836
19612 -17836 -44648 -23951 9861 39346 31605 -2832 -12994 -33315 -33107 -37686 -17256 14773
19600 14773 11378 16904 53563 49122 21382 14008 26649 -10398 -23114 -722 20555 18627 12120
19587 12120 -3490 3441 22908 33414 57665 57071 40909 20609 21311 22162 41606 37540 17364
19574 17364 44763 55682 21980 6661 9786 20889 2336 12766 23480 28638 18471 15861
19562 15861 27861 -9629 -18937 -19180 -26583 9100 31636 31061 43930 53241 39586 26324 24448
19549 24448 20802 20783 6180 1240 29914 48407 43688 58868 60984 65830 42303 7127 7699 46164
19535 46164 43772 34192 28432 36904 22523 10110 12077 -21628 -21855 -1838 9339 31043 29221
19522 29221 1237 -22974 -9467 35501 60469 60690 31207 14196 27559 38755 37250 25421
19510 25421 13275 20138 37769 37198 38927 32012 -16098 -17049 1966 -13737 9365 39721 55869
19497 55869 36273 18663 13958 15026 21474 34332 39421 22995 7294 4568 33189 35210 16011
19484 16011 -8171 1763 -975 26503 49578 48489 48114 38520 52851 47491 47204 67234 78850
19471 78850 52184 34885 45693 68024 65843 52505 45864 33068 31306 23717 31283 67170 114123
19458 114123 107539 97206 85912 77740 30395 59382 79619 96934 70612 31814 35169 47561
19446 47561 55308 50830 75126 127243 165562 160716 152456 159105 162211 144854 144836 117617 81232
19433 81232 87435 92782 104631 122965 159292 195366 195247 164885 136075 125005 97314 108299
19421 108299 157534 221797 275833 303242 334530 368517 409815 478589 520080 492080 488109 475253
19409 475253 468226 524487 582361 637984 658900 662815 649181 636150 610455 549875 500049 452313
19397 452313 412079 355860 284256 265548 262866 216501 195851 211630 221977 202956 173329 178839
19385 178839 183143 158529 168001 175476 169372 170176 158881 167266 187536 218548 237248 243138 254284
19372 254284 254682 253517 268604 256862 264603 264563 285577 335744 378950 431575 500842 533796 572335
19359 572335 618822 650348 684688 696395 710281 739739 732602 695719 672406 653201 609044 537615
19347 537615 463950 408536 372262 335497 302767 269122 223514 207694 218971 224599 201991 220126
19335 220126 203011 162787 138076 143694 152651 147941 161530 193412 209600 192553 170257 152167
19323 152167 152919 149646 110827 112302 127743 143979 139641 127875 116551 132330 121597 103021
19311 103021 79883 72243 82555 102726 108106 92478 111877 108941 77276 61921 91057 97115
19299 97115 91150 76256 85098 104850 90742 77588 80020 102539 100459 106458 99355 64451 68070
19286 68070 48974 58073 69331 39824 40992 69170 101237 84613 61070 72773 79354 73944
19274 73944 98314 118714 114006 85554 78182 119428 144128 176220 218930 245703 262340 307560
19262 307560 359065 355095 357854 373113 346719 328348 293303 247975 241468 266165 275324 308463
19250 308463 340340 355905 368516 376720 367220 319780 285354 241321 210734 200778 192761 193227 181655
19237 181655 185688 156343 162673 177499 202820 197264 215538 213290 207949 185038 137599 136003 167199
19224 167199 170217 182788 187479 192152 176642 191812 219027 241861 219224 230661 267858 301098
19212 301098 360900 412808 459141 480548 514041 552289 561653 560717 574338 600324 644108 709007
19200 709007 816234 956070 1136363 1283808 1385906 1432496 1450076 1480245 1561549 1667455
19190 1667455 1812673 2139843 2627542 3280541 4135012 5069508 5906163 6559644 6974732
19181 6974732 7094283 6916986 6548578 6051226 5507497 5009175 4629991 4349510 4180950
19172 4180950 4043366 3932277 3825051 3654230 3416784 3162175 2860836 2565042 2356493
19163 2356493 2169763 2029451 1894240 1808895 1749524 1660838 1608218 1553653 1499454 1478734 1422266
19152 1422266 1391621 1369043 1372946 1421100 1455448 1539963 1674646 1890412 2155054 2435837 2727497
19141 2727497 2984614 3142649 3239352 3341161 3450479 3665854 4018453 4503901 5146432 5913642
19131 5913642 6788461 7604783 8181145 8459766 8344048 7885682 7205829 6437093 5655343
19122 5655343 4916703 4288141 3791626 3449644 3209307 3042775 2933405 2865309 2754534 2602859
19112 2602859 2439253 2279288 2142984 2005195 1893007 1781426 1694097 1607407 1512051 1464390
19102 1464390 1402980 1338910 1272727 1185625 1112452 1033108 972247 914301 866505 826708 804853
19091 804853 808370 775103 711197 645322 626127 605574 577584 523819 493890 480113 466606 444502
19079 444502 381434 358180 373146 364508 337678 310536 309150 312722 307312 296715 283630 277628
19067 277628 254730 259323 259476 227763 214178 216378 249309 272229 298521 313467 304149 288738
19055 288738 295829 292738 292132 285775 314255 326262 302482 294874 311420 303570 321299 339028 372729
19042 372729 390888 404770 421313 447914 456498 432830 410815 393025 366063 359325 385039 401958
19030 401958 388273 390430 371622 362040 370657 339844 348329 356974 335198 318621 337539 390389
19018 390389 411308 400498 362397 317737 312222 288521 262745 260614 289804 327441 322502 289348
19006 289348 292022 287914 277575 267209 247170 228571 199662 202429 208372 196286 171519 186550
18994 186550 203290 205671 200053 200855 181210 183147 206142 206597 195489 187032 175435 211948 217472
18981 217472 227036 224583 221652 212442 188030 161641 158759 154105 158635 143308 149139 176841 170505
18968 170505 133580 111493 115658 141284 113371 128834 116020 124131 148708 112479 92128 129743
18956 129743 139499 134726 153043 151009 111927 104310 125701 126590 111353 89870 103454 103024 111738
18943 111738 139989 134159 96801 75183 64028 43206 40979 85253 99201 110700 121267 119124
18931 119124 121958 116380 165596 194765 193345 212048 195167 182124 168327 153563 164107 191569
18919 191569 211778 204036 192826 219379 242229 277502 286928 281221 267848 285784 325029 402155
18907 402155 480626 549975 604433 636294 626132 608615 601932 570252 541077 518379 499282 508545
18895 508545 590473 676823 765575 825015 815714 758208 688966 620687 560839 496950 464166 426935
18883 426935 402859 397502 375346 353250 356061 356795 352098 334857 334849 319953 286937 256066 258006
18870 258006 255774 239475 246547 261251 255251 226069 242503 236802 237777 236209 203454 175959 216257
18857 216257 234727 217782 217417 247314 282551 282710 276616 285279 288770 299680 293996 285474 255593
18844 255593 262149 266987 297757 318161 326246 333092 318969 314184 283710 273720 263433 236186 252329
18831 252329 233613 243980 266805 278494 243055 219899 223579 260209 256904 254070 268609 291331
18819 291331 313653 304709 305710 293491 279131 274873 272693 274886 285930 295037 303727 323005 342638
18806 342638 343421 356783 378983 422520 464828 476728 488723 533945 574611 614323 631327 624597
18794 624597 619551 608748 589665 585869 582406 536309 521223 569392 607705 610809 596360 568474
18782 568474 544431 543554 542211 500683 482856 522202 562542 616503 669423 669713 636746 636856 677431
18769 677431 765687 828057 853715 914875 980611 1032717 1093255 1150897 1145167 1163358 1137374 1129270
18757 1129270 1141143 1161187 1187748 1245074 1331169 1458549 1619909 1789775 1941768 2046474
18747 2046474 2127847 2205254 2310231 2435940 2594672 2792296 3061617 3438545 3901174 4483115
18737 4483115 5256221 6280656 7765616 9807476 12692966 16958598 23559510 32959313
18729 32959313 42777006 47535789 47475562 46635471 44541761 40123899 34986330 31225327
18721 31225327 29496158 29863147 32664492 38667102 47688569 56102897 58363874 56524880
18713 56524880 54237494 50132830 43579123 36528340 30771347 26534916 23410927 21007554
18705 21007554 19186255 17786353 16654995 15691811 14823994 14050937 13387273 12853588 12412577
18696 12412577 12048411 11702893 11336659 10989689 10722114 10533093 10390285 10320721 10263529 10235131
18686 10235131 10374129 10690198 11276830 12225130 13668989 15736476 18781818 23473443 30874945
18677 30874945 41204047 51382386 55500993 54923387 53795868 51045096 45839862 40199280
18669 40199280 36211206 34514341 35119437 38486928 45442848 55487836 64039179 65498058
18661 65498058 63159134 60387785 55279860 47598455 39722663 33491368 28941125 25550790
18653 25550790 22961566 20958402 19376351 18066364 16918347 15861190 14855013 13962201
18645 13962201 13183259 12524000 11983904 11489792 11012066 10547361 10136481 9801296 9498892
18636 9498892 9141825 8677593 8165414 7710671 7302302 6964412 6658240 6365832 6037830
18627 6037830 5704581 5410732 5131157 4829562 4567869 4322230 4124088 3947609 3766831
18618 3766831 3565804 3347772 3141886 3012025 2861098 2701616 2601045 2505086 2373702 2273966
18608 2273966 2198853 2087202 1998883 1886145 1768168 1750638 1769654 1714328 1647742 1596370 1544668
18597 1544668 1489915 1433415 1360817 1311092 1252464 1178892 1164524 1168626 1177485 1164684 1118533 1072922
18585 1072922 996653 947173 906505 902056 896767 868886 821115 760868 753610 731592 739750 736660
18573 736660 732516 710836 683006 666732 638797 635405 654656 659691 659530 643657 626970 633606 673327
18560 673327 694759 685193 699912 713768 732535 762157 783857 757603 726175 721293 774047 834020
18548 834020 876342 858198 822032 790805 764663 749642 740576 744996 757988 759668 769260 789638
18536 789638 828276 840259 842067 827402 802542 780351 739029 695599 652030 612980 571996 545232
18524 545232 502191 475563 486956 503960 504525 483465 464009 477248 487959 483851 455019 443582
18512 443582 426323 461057 495898 475873 456939 452713 450754 450891 447921 448738 445813 462190 467964
18499 467964 476281 493807 499378 483874 483090 505152 503979 497130 535265 565413 595698 662697 725503
18486 725503 771930 802646 812354 798675 771535 768953 769584 756566 774471 852039 965904 1083966
18474 1083966 1235543 1345969 1383747 1418703 1445017 1357193 1203868 1097849 983612 899074
18464 899074 864307 818398 797351 763964 735559 723504 716861 723264 724574 702415 726630 747370
18452 747370 764312 745917 718508 721605 729879 739067 790898 845105 878644 897283 897741 905097 907071
18439 907071 934482 921488 905406 901992 890753 878021 880993 893136 893201 904747 918444 935325
18427 935325 907561 875934 834709 859305 863158 853648 867346 872552 878779 898887 915511 931925
18415 931925 961722 988475 998704 1026068 1048461 1115510 1176268 1235599 1308438 1432488 1602788
18404 1602788 1714640 1816972 1948116 2108419 2236447 2355494 2451314 2513154 2612426 2692927
18394 2692927 2769662 2867130 2981800 3137636 3340875 3500085 3712869 3977922 4283801 4642574
18384 4642574 5021793 5401290 5901029 6507346 7174603 7963523 8970061 10213274 11639188
18375 11639188 13145970 14874504 17086479 19794050 22997674 27161461 33234756 42454289
18367 42454289 56064148 73534887 90413015 102498482 108263501 106837728 101129314
18360 101129314 92955060 83031954 73692425 67602504 66165902 70035646 79534776 92900042
18352 92900042 104809227 112030901 113390174 108629701 100297338 89476399 77205432 65550668
18344 65550668 56134909 49136081 43927275 39996409 37031538 34736243 32814171 31113890
18336 31113890 29515532 28008807 26623066 25375002 24222316 23175350 22296135 21547149
18328 21547149 20863620 20382037 20064847 19767348 19347815 18891147 18464684 18003919 17418265
18319 17418265 16780294 16219816 15671982 14991593 14137804 13331819 12577231 11779912 10989881
18310 10989881 10255495 9618810 9036509 8477260 7921985 7468740 7101960 6777548 6447637
18301 6447637 6127899 5832270 5529142 5242623 4970923 4716989 4471248 4247862 4035994
18292 4035994 3845487 3623047 3453755 3302236 3162450 3030800 2881310 2729717 2588544
18283 2588544 2457078 2344378 2254508 2136983 2077622 1970821 1882589 1815952 1729174 1644508
18273 1644508 1610735 1584429 1541713 1489243 1457585 1454366 1530212 1597079 1584971 1529399 1496354
18262 1496354 1468809 1472267 1464322 1444486 1416887 1338210 1279712 1241178 1175678 1100447 1033275 958126
18250 958126 901575 870746 862103 861632 837994 815801 793137 758119 757643 768848 792956 794476 771906
18237 771906 764006 790091 785242 776598 792007 783932 753962 745784 725461 699748 698607 689305 715824
18224 715824 745625 776529 812676 841350 854439 906968 965491 1053554 1171334 1294706 1457522
18213 1457522 1589563 1596332 1582118 1594972 1539771 1517693 1514589 1526611 1491225 1415549 1343141
18202 1343141 1273855 1200941 1100427 1036154 1012270 980758 952882 943911 921700 887963 889188
18191 889188 932510 993938 1031410 1030816 1004306 1001749 988691 993563 987949 1011196 1053238 1151482
18179 1151482 1253582 1338532 1372318 1360381 1302010 1238294 1149175 1071975 977635 893061 831853
18168 831853 760896 713425 673799 627724 609414 593719 586243 600312 590813 565197 585972 619518
18156 619518 620930 591752 584579 587068 575267 548532 540788 551110 558350 570691 586770 594216 591110
18143 591110 629370 659952 687665 696574 742008 804670 892350 970811 1013764 1035659 1069264 1075444
18131 1075444 1092602 1134430 1194827 1283683 1430833 1605884 1775363 1918289 2070141 2203430
18121 2203430 2318568 2465235 2674581 3009158 3516581 4243438 5275626 6779866 9159246
18112 9159246 12983950 18768764 25575090 29598016 29448075 28491196 27010462 23687220
18104 23687220 19252277 15296991 12426240 10396021 8969198 7927215 7133954 6485923
18096 6485923 5962345 5532460 5196300 4856199 4584071 4366663 4185642 4036274 3879489
18087 3879489 3734593 3588766 3488787 3457312 3422333 3339503 3164439 2951896 2742227 2569961
18077 2569961 2403461 2237792 2086645 1948462 1804009 1693775 1619657 1534570 1462905 1389858
18067 1389858 1347564 1294904 1223156 1185789 1129104 1058458 956766 905914 882801 829699 783479
18056 783479 737556 718966 671498 628652 620509 591921 571225 572107 567544 530828 518892 513655
18044 513655 463571 425077 398176 365846 365502 402608 404799 401192 404239 422302 446992 462895
18032 462895 435118 404337 393145 385595 373766 354215 334453 327111 325285 290788 302557 324148
18020 324148 323119 303356 307392 287718 244586 251654 271900 253700 254446 233932 188522 187939 208747
18007 208747 206758 203985 197831 208314 210191 182662 177763 181025 201518 223612 213496 208616 197361
17994 197361 169439 159496 198920 210492 186702 174715 213116 227900 254418 254628 221219 201304
17982 201304 193470 211492 210910 187082 210770 200140 188349 162127 157774 136559 133061 99367
17970 99367 62379 88698 102676 119688 139094 154991 165102 171157 181979 180825 196785 211529
17958 211529 214622 201375 178296 164428 164137 153000 176368 204355 208419 198072 165549 147019
17946 147019 169439 206997 224065 215117 204466 199578 230196 208937 147053 152714 182117 186915
17934 186915 191668 215724 206402 202467 193110 186759 211657 212722 198115 228065 263349 300666 328219
17921 328219 368543 431039 472472 490694 533456 569520 599353 617095 634777 681800 674457 632770
17909 632770 590906 545161 484963 469152 452234 429993 390669 372899 381466 375293 356432 349615
17897 349615 337157 329775 298612 315307 335332 335820 302541 272911 270457 266094 274752 252947 243033
17884 243033 271491 277013 291621 285513 273260 255868 268154 261192 244829 275643 328726 415397
17872 415397 527099 645213 750184 795923 788846 780449 783272 777420 800386 865265 890370 858467
17860 858467 805340 754763 719479 661894 580160 506926 475950 451556 458992 430400 406373 391569
17848 391569 399744 396325 363685 346340 355539 372477 371404 352258 365357 322520 309897 308372
17836 308372 321231 331215 304911 289555 306536 323992 332629 336479 363049 362816 397507 448158
17824 448158 468453 489571 557261 636698 705034 760364 808783 827798 808186 781907 760313
17813 760313 703026 622427 602235 631262 631642 634886 689793 787407 839236 859265 815682 763508
17801 763508 706366 612081 572302 542331 472195 447956 429719 400042 378096 367809 352192
17790 352192 345987 348405 345426 316904 304060 288319 278147 279371 305773 343082 380216 377860
17778 377860 381128 390790 364458 383289 392437 372884 363036 384574 403051 422205 449183 464146
17766 464146 440421 413851 388018 360480 330556 323364 321360 300861 267909 287478 308210 291130
17754 291130 263307 253465 244724 218763 218498 239609 264656 274288 286213 274054 280284 277988 284009
17741 284009 283456 290087 299625 325392 374227 382280 400603 428348 441944 471509 526276 622746
17729 622746 747147 877746 943637 974760 970355 955721 901261 841531 769372 723932 694880
17718 694880 691915 710626 723239 732048 735205 739364 732184 701464 661325 634249 606097 564171
17706 564171 555452 561300 565977 548626 563179 586998 597132 582373 601358 624062 640711 671296
17694 671296 703888 708754 732229 746963 746484 752472 777009 794596 816452 846428 896249 982985
17682 982985 1075540 1162597 1270789 1446932 1666777 1853877 2070169 2285514 2415807 2443152
17672 2443152 2462237 2457012 2421071 2406881 2454640 2557606 2669827 2761982 2833776 2939542 3054408
17661 3054408 3199327 3413713 3730439 4157424 4751825 5505520 6501104 7785447 9436788
17652 9436788 11661939 14724752 18989172 25163658 34565166 48606772 66752285 84109007
17644 84109007 96143063 101752607 99758010 92915345 83043540 70736009 58168075 47690192
17636 47690192 39914607 34257760 30077557 26900430 24360276 22259188 20546175 19143904
17628 19143904 17998694 17063022 16316659 15725672 15245603 14825890 14510477 14236000 13985956
17619 13985956 13792462 13570720 13277501 12871695 12358820 11783963 11202064 10682529 10192698
17610 10192698 9716530 9325265 8982603 8749876 8630557 8677159 8941490 9368976 10019804
17601 10019804 10977409 12326530 14224664 16893352 20720927 26413476 35201641 48285131
17593 48285131 64831938 79995903 90176380 94293198 91563558 84781840 75327838 63866451
17585 63866451 52498594 43197490 36318745 31310588 27561956 24657173 22352400 20446886
17577 20446886 18830855 17439774 16301244 15367127 14571448 13946599 13404725 12926163 12491647
17568 12491647 12099015 11801123 11557498 11314784 10988200 10535894 9952155 9326891 8713016
17559 8713016 8095205 7514556 6998874 6521659 6048939 5651635 5280488 4948897 4639731
17550 4639731 4353499 4160286 3944010 3737771 3520720 3330782 3158758 2945632 2761030
17541 2761030 2625501 2493923 2372905 2289350 2187739 2075441 2000424 1933582 1848376 1757365
17531 1757365 1679137 1585909 1552533 1492371 1431609 1382363 1351728 1320868 1322812 1293577 1254425
17520 1254425 1275947 1322951 1328221 1289887 1217760 1150497 1077911 996164 937983 897286 865653
17509 865653 826198 809377 769369 725082 707078 689107 685354 663727 652364 642252 637138 595013
17497 595013 567512 537686 570139 577363 529796 511565 498282 496106 480753 448672 470647 479671
17485 479671 478148 481276 444555 447958 466711 461193 462774 447400 419821 407000 398289 393513 377478
17472 377478 403178 392887 374222 376054 384428 416545 456063 475513 501477 483356 475130 449171
17460 449171 406076 348067 343224 346610 331972 339168 331997 303740 286928 265601 248882 297292
17448 297292 323659 340955 357431 359839 388797 406135 419119 449958 445934 408342 389168 388920
17436 388920 395570 356788 315785 295492 262284 247594 236087 221147 263134 303618 289559 277525
17424 277525 260617 215630 202147 232930 245744 256939 272255 269766 299426 310048 300407 286233
17412 286233 303042 308457 297438 292117 303120 296584 286509 294135 318659 355619 402290 491739
17400 491739 589807 663624 744631 823627 896765 952500 1014542 1056754 1054155 1027147 967611 884634
17388 884634 817243 738170 680870 604872 528263 481215 444248 427447 411272 406884 403587 401085
17376 401085 402959 405807 406117 427330 458283 474045 440650 411863 368611 346799 320626 290357
17364 290357 249665 259017 264620 255416 254684 187982 144615 168591 194676 213308 188741 198488 200464
17351 200464 179477 158874 155634 196318 209902 202074 235497 266118 284184 292214 267899 239533
17339 239533 246641 217709 209351 189241 163827 111987 142214 177954 185353 148926 140910 165786
17327 165786 182256 174850 153158 170618 228320 242210 248326 260144 264332 301895 325101 306119
17315 306119 267275 263608 257179 240754 217810 203749 194961 181595 175217 170529 162656 149847 166243
17302 166243 137873 90044 95399 113589 100366 85983 84807 82800 58540 68350 82970 100121
17290 100121 79344 50231 26580 40510 55047 52159 35704 53995 71623 79887 102256 100600
17278 100600 96068 102199 92030 94981 90982 103075 125944 152548 189318 197495 163761 126897
17266 126897 113311 136384 165751 206093 227503 206974 204701 173085 158200 138872 100597 85992
17254 85992 86995 88320 73894 59651 52803 51262 63965 46025 42088 47584 13457 25883 55507
17241 55507 68106 82125 102012 98297 94246 105116 88952 80705 59018 34256 16273 18120
17229 18120 56572 80058 61948 56136 51256 47493 27471 21473 57327 70909 85566 107998
17217 107998 107243 129326 145269 161474 145812 147015 133489 138019 135497 133716 115163 111497 73840
17204 73840 29797 30613 50382 65418 51165 48106 37911 75932 83886 47456 36340 14626
17192 14626 32411 49828 73493 80852 82639 63736 39299 28322 28994 29022 59626 27805 29987
17179 29987 39556 24982 -8934 -30299 -24711 -15738 2234 11971 21730 62713 98194 116327 101013
17166 101013 77703 81233 72679 57937 42628 42608 59861 48230 44200 49706 40778 26045 23248
17153 23248 48551 47541 23217 38007 61004 97632 114344 84759 51436 41366 52394 71031
17141 71031 90035 101265 72144 60756 37433 38230 47853 63146 58486 55158 92103 101548 83491
17128 83491 63824 66650 68448 69110 59935 68689 58553 21688 21585 69263 81620 76653 98617
17115 98617 108641 105654 119892 133571 136695 167166 214486 265573 307671 351753 431957 554665
17103 554665 651111 645693 567128 476672 405121 340442 321414 306280 286951 254112 226182 204692
17091 204692 208716 193854 173508 132937 110621 137060 159027 170695 125483 100190 86153 104699
17079 104699 105318 109689 131677 125086 125648 149495 157169 113765 101778 91605 101886 109360 106090
17066 106090 93230 70174 49967 62461 96239 137408 150455 152177 164825 202279 204246 244606
17054 244606 307935 393129 462070 524622 546018 536841 504210 466384 426780 386956 315908 258306
17042 258306 211870 188671 194891 197936 175932 129294 118899 132896 122148 117939 136812 151921
17030 151921 138529 127412 113173 140174 168828 142778 95578 98085 111163 116625 110201 96628
17018 96628 90121 103618 88626 77873 54321 23138 30342 48708 55551 87990 98425 55746
17006 55746 33161 49950 74031 86565 75069 93559 114677 118004 106250 98469 58887 36312
16994 36312 49731 63014 66101 67297 66331 53228 24202 62267 61519 34999 48216 62512 59078
16981 59078 62734 52063 77080 94418 122179 132736 122097 105449 108562 103215 97592 101917 87153
16968 87153 56427 59033 34686 3059 20915 45607 51960 64868 57434 33300 25655 48585
16956 48585 42634 36580 46663 54097 78823 83948 89381 110055 103543 96102 97954 119997 144249
16943 144249 127194 116385 110127 106956 88288 104359 117921 109904 134434 151994 182951 217688
16931 217688 243861 306654 404277 496342 632871 850031 1152319 1569093 1984180 2191456
16921 2191456 2190446 2108611 1956522 1712565 1413549 1177537 977928 837170 728170 639261
16911 639261 537564 495536 472239 441300 383480 354095 357955 359062 319307 302871 323302 327835
16899 327835 352147 350210 307106 300505 286917 282862 277892 229592 214973 217792 198346 184869
16887 184869 193886 198286 190406 198355 205872 185441 161285 148513 161213 176445 186400 185457 170949
16874 170949 171064 180007 218489 259653 302184 371551 416298 445183 433530 402366 373615 345645
16862 345645 301980 253964 255526 247630 235141 233844 216101 193880 184085 137378 124914 86643
16850 86643 76215 125890 153732 133882 108833 97467 101514 110179 128681 137300 130752 134951 111639
16837 111639 105305 86024 134576 176625 124635 106550 124161 146106 141287 99154 74195 70532
16825 70532 79787 85969 82930 95389 98545 99964 102230 108069 112595 111381 123897 98609 83945
16812 83945 75782 106808 118731 119315 117518 90777 51204 55960 86119 102179 100918 96926 122244
16799 122244 128468 79714 73920 107676 122733 108897 84350 75562 92498 69529 48766 51356
16787 51356 73779 78374 84477 78059 55839 86116 82485 56622 73087 110231 87557 83744 83286
16774 83286 94935 138006 148478 158860 153007 133248 125708 131837 126798 135599 127002 113355 99726
16761 99726 103624 101964 97890 95623 98743 101849 110720 98444 70162 66173 84573 101900 109075
16748 109075 118995 102898 102035 103174 88637 87098 77614 66079 74209 108929 138100 153172 124080
16735 124080 93110 84642 71636 38884 46868 60033 59071 67643 91831 112938 127190 134135 104850
16722 104850 90858 95943 118124 172484 204013 176282 151641 129314 125929 130907 100377 75674
16710 75674 67630 69526 99295 114576 84232 45857 33134 29575 20928 -11398 -33998 -34517 -59843
16697 -59843 -74996 -72082 -63861 -50832 -17212 42827 104076 121546 103458 88192 113965 110436
16685 110436 115003 122460 144261 176506 209248 200359 185180 181687 190152 213134 197125 183080
16673 183080 169986 174183 189148 170101 162901 174370 174211 158301 151950 132467 116596 111899 120221
16660 120221 155243 150644 145672 155527 163087 148183 141944 157515 174453 165197 169399 162472 140391
16647 140391 148343 173131 185025 178493 188815 191585 178274 168930 186647 189821 158649 161468 190067
16634 190067 185195 195390 212641 213998 235357 246017 269751 285567 244050 235163 247146 275687
16622 275687 318963 307113 294727 311092 327851 302523 257471 272605 291134 265094 240849
16611 240849 201941 221532 222974 188484 180775 170614 161773 159829 168961 167127 158564 175133 178816
16598 178816 191417 208039 212821 214515 198737 209061 228394 230155 210255 207653 216592 230843
16586 230843 237408 247749 247103 267073 307114 295887 276937 249387 224450 254714 257933 240073
16574 240073 242577 264261 283544 291592 295003 288211 275630 250756 256353 262612 285708 317736 345974
16561 345974 357468 358183 407919 408502 400524 400437 396129 398415 400721 393028 384153 429674 417300 374517
16547 374517 333469 328123 313167 289749 297648 309923 323376 353396 362999 404733 428795 447565
16535 447565 403485 358161 370977 365436 379391 402624 423299 458117 477752 469234 454606 468095
16523 468095 529820 583306 682306 864038 1069190 1378248 1847677 2509210 3241423 3694854
16513 3694854 3758091 3677724 3509193 3185537 2721045 2288620 1944184 1672653 1503650 1369199
16503 1369199 1284352 1270067 1246647 1238831 1238335 1206858 1272033 1342770 1433511 1620824 1746795
16492 1746795 1748027 1710855 1568488 1386534 1280263 1237756 1189217 1096524 1030651 998860 951808
16481 951808 903061 876272 825183 803209 833974 832201 775020 768473 816780 837857 881978 894647
16469 894647 919313 946501 968464 961213 993632 1012112 1030540 1031149 1034496 1031967 1035710 1039362 1030979
16456 1030979 1067523 1106363 1126770 1183894 1229238 1249188 1241540 1242670 1289807 1362919 1405232 1401614
16444 1401614 1397839 1385853 1414542 1428495 1449204 1442406 1422647 1420807 1408453 1405999 1446929 1448767
16432 1448767 1426466 1400229 1432373 1483905 1507966 1535005 1577497 1599472 1652179 1711099 1772325
16421 1772325 1850553 1912956 1984312 2003719 2024264 2090737 2140214 2194908 2241229 2299320 2439051
16410 2439051 2573524 2665895 2774351 2888792 2994629 3133550 3300758 3424120 3559864 3732437
16400 3732437 3880830 3985174 4142708 4350811 4614101 4887625 5198755 5561581 5983375
16391 5983375 6432245 6966124 7633002 8389039 9282653 10416728 11853930 13624392 15811837
16382 15811837 18535078 22091213 26669274 32610442 40596232 51434093 65955233 85442655
16374 85442655 113371915 156272593 221559651 306952929 381933173 405571137 395465737
16367 395465737 379903999 349239850 298486839 242745784 196613301 162883622 138531805
16360 138531805 120279229 106216485 95110213 86135135 78770108 72654707 67513191
16353 67513191 63062300 59255337 56111952 53458065 51106398 49008156 47211010 45865664
16345 45865664 45062756 44543924 43678556 41944269 39513345 36913157 34447169 32200758
16337 32200758 30131493 28187790 26417500 24841955 23432918 22060462 20664109 19389888
16329 19389888 18230218 17077495 15948643 14929277 14007591 13166001 12351650 11606746 10948013
16320 10948013 10328991 9733998 9223429 8781603 8328850 7893279 7486545 7143909 6796684
16311 6796684 6472317 6168767 5872615 5645761 5397394 5186771 4986972 4750367 4518846
16302 4518846 4292592 4091940 3878981 3667662 3465028 3299670 3116667 2961227 2830291
16293 2830291 2718528 2604582 2481317 2372033 2277053 2198383 2124619 2058116 2016859 2002539
16283 2002539 2009582 2024624 2011858 2041303 2167203 2383675 2678432 3067115 3322120 3299620
16273 3299620 3165733 2999428 2744969 2399816 2087724 1879836 1704420 1584786 1480576
16264 1480576 1376528 1272142 1185201 1109178 1074275 1048060 1013458 976250 964158 957619 952810
16253 952810 945951 936725 923609 889485 887407 863286 791476 771130 852075 1052709 1169463 1221477
16241 1221477 1182818 1020771 937520 904385 900880 877741 846509 799261 737101 639391 596898
16230 596898 566138 543676 544370 539145 506967 543343 595940 604901 597102 562163 561465 592090 610251
16217 610251 604583 633151 674638 677744 641743 649612 643763 607399 601963 604364 610521 608108 618400
16204 618400 649820 662400 634782 602566 618875 644902 635712 624532 601076 596042 573143 534269
16192 534269 500032 469972 426443 389651 362746 354566 336478 310397 304269 287510 246393 219036
16180 219036 214500 193019 234390 244839 244914 248571 256171 252645 258571 265589 253042 257030 238829
16167 238829 244767 242740 226861 223235 225128 195367 166625 172834 183000 192829 172741 167438 159977
16154 159977 152558 137620 123184 126063 111485 118890 130181 102774 88672 97071 87167 79766 82482
16141 82482 93903 104296 102130 81311 79109 82146 58877 70758 90397 57737 41669 23196
16129 23196 16833 10055 30136 25420 39900 31205 27029 37249 28713 38403 49841 63173 106182
16116 106182 140935 174339 226340 235434 230197 249035 241746 217211 200342 190478 165580 112213
16104 112213 81574 76792 60149 69176 51989 28191 31580 43207 29954 16921 -21585 -46303
16092 -46303 -60234 -38745 -34756 -26552 -32406 -22489 33202 37676 28621 48617 56871 77994 111458
16079 111458 87770 69307 81748 115718 126391 121619 152032 151613 183661 257071 313988 379648
16067 379648 437952 444541 422386 397589 357167 283281 236898 155296 97522 90290 88696 73942
16055 73942 82431 106090 101624 88418 107778 121015 101496 63357 39650 48980 75081 146764
16043 146764 222901 250356 238940 236956 224196 190613 165221 166508 155396 135860 125423 108464
16031 108464 105623 80584 59171 32749 34501 32334 18580 20476 13434 -3459 -15711 1984
16019 1984 4161 19225 76800 113260 121101 114394 122394 70744 98207 127075 121550 107300 118423
16006 118423 106529 77604 39447 31875 27767 28083 12461 39264 67913 61481 49350 60026
15994 60026 13237 -4891 33559 53975 77775 61386 28262 22343 18 -12311 12109 21699
15982 21699 24432 39420 31330 10133 -3650 -32549 -31339 -20172 -21497 -7718 17127 -11078
15970 -11078 -18191 6542 16268 12573 4175 5825 -2938 23063 28184 14562 4840 3597 24903
15957 24903 21781 27241 27695 10446 -8624 8047 6225 -2889 -6131 17306 19474 4147 -2295
15944 -2295 6744 22259 12907 17573 8563 10176 11342 25686 14652 28792 44669 45300 17682
15931 17682 -1866 12610 29264 30544 21638 6813 2405 7683 10293 -26228 -12647 2667 12616
15918 12616 27221 20917 8510 11745 40101 34438 15961 19631 19472 47452 48590 35749 20368
15905 20368 24225 34059 26765 43462 19665 7195 12153 18358 -3433 -19131 -6011 3392 -18023
15892 -18023 -29805 12093 64551 63307 53855 30241 -9580 -21164 -6872 -12182 -12330 4670 9366
15879 9366 15593 1506 6315 -29595 -22996 -1863 -2179 -25477 -12876 10309 -22164 -15745 6319
15866 6319 -4042 -55709 -48661 -16168 -34782 -37456 -18628 -10434 -4957 -46188 -63394 -46499 -28608
15853 -28608 -22396 -20498 -30946 -15075 -12703 -30299 -55749 -66438 -43691 -45189 -21041 -1221
15841 -1221 9191 20503 29384 26172 47660 28987 25539 43808 31457 36362 44103 53486 31046
15828 31046 20193 24951 18007 24524 10212 12808 51901 61535 86665 109204 113335 159144 226049
15815 226049 284841 364935 493493 716790 979715 1398176 1831675 2079581 2106359 2002091
15805 2002091 1905157 1706241 1434914 1171635 961936 805697 697327 614671 542531 486053
15795 486053 434605 393334 352416 311239 281371 270209 286536 296004 278060 244857 228769 218858
15783 218858 217301 238751 228354 199980 171480 184156 172802 153257 138715 116974 106427 103660
15771 103660 125545 128258 134091 104368 86491 89601 81846 57294 65613 62744 54542 63469 70621
15758 70621 61366 80131 71124 47501 59134 59603 29157 23032 39946 45096 37140 16414 13551
15745 13551 15345 -22952 -30848 -20524 -31908 -11605 24169 33834 48121 60713 33052 45007
15733 45007 29827 38260 34252 -2191 -20443 -31487 -49085 -35041 -17994 -14605 -28491 -37709
15721 -37709 -56854 -62141 -68940 -34872 -33446 -46324 -18274 -20522 -24076 -11607 -8254 -28136 -34899
15708 -34899 -67139 -66362 -27848 -16466 -5517 -21762 -44677 -71136 -32059 2637 1967 23486
15696 23486 -5545 -13226 -22657 -29778 -21041 -29729 -57432 -69713 -47897 -39545 -36297 -19552 2889
15683 2889 6791 15253 20503 15836 -24139 -37963 -64929 -62195 -49526 -48525 -27941 -32656 -3625
15670 -3625 19145 15957 -10888 -32831 -13205 21955 8181 -29444 -41462 -46950 7741 16746
15658 16746 6961 -8372 -5223 11813 14089 22272 26383 8559 -7892 5059 3786 -2662 2926
15645 2926 -11054 -25488 -19125 -20214 -14536 -18634 -5975 -3426 1084 2475 10521 -1505 -17844
15632 -17844 -32082 -20051 -37841 -51165 -38957 -9806 3325 15409 31647 11537 -1 2265
15620 2265 -18248 -20005 -22241 -17409 1053 12274 -5088 -24701 -2541 16777 8668 -4445 -7212
15607 -7212 -3572 -5981 11039 -759 -22527 -16392 -33678 -47615 -19781 20116 14419 -5138 -14625
15594 -14625 -21535 -37740 -5366 5063 -27268 -51451 -44396 -30662 -7696 -610 -1212 6815 7860
15581 7860 19165 44480 -3692 -51650 -54052 -55357 -71147 -47822 -35612 -34842 -24364 -39005 -70938
15568 -70938 -71394 -77043 -73922 -55993 -14303 -19540 -35089 -41535 -66965 -75112 -80003 -66677 -58003
15555 -58003 -56863 -55814 -35948 -11741 -5818 -8783 -14829 -18453 -12748 -17040 -4673 79 -11919
15542 -11919 -30179 -65083 -69812 -50352 -51463 -43052 -37499 -28023 -44007 -20461 -19239 -13257 -16043
15529 -16043 -29220 -28979 -47609 -36564 -2857 22044 -8401 -26410 -34420 -34040 -49577 -43557 -14364
15516 -14364 -7282 -8873 18181 11109 6374 10466 -9085 -16813 -6287 -6134 17248 2577 -18059
15503 -18059 -26699 -32823 -21060 -39368 -19512 21669 8548 -1822 9848 5024 -17273 -12255
15491 -12255 -27861 -51065 -62109 -35631 -30244 -42933 -41372 -55562 -20310 -14733 -56135 -94940
15479 -94940 -90733 -58444 -62734 -48629 -37809 -39265 -60878 -28745 3761 21644 14961 16399 -15099
15466 -15099 -25109 -16280 -17226 -344 1026 -20187 -28356 -19660 3382 -11028 -3679 7658 463
15453 463 -25093 -31964 -42788 -40588 -22178 -26441 -51594 -65111 -70492 -20489 -7694 11730 16089
15440 16089 -9889 -11409 236 20526 16535 -1881 -16674 -37155 -24088 -29247 -41487 -30694
15428 -30694 -27784 -38603 -70113 -72644 -50094 -44697 -52886 -37951 -35814 -14192 -34341 -28447 -29812
15415 -29812 -42104 -66182 -77641 -61374 -58732 -37574 -36137 -24502 -12372 -11294 -40157 -29799
15403 -29799 4099 24962 26055 -18144 -49038 -49741 -37598 -27495 -30741 -8464 -19880 -33910
15391 -33910 -42295 -27596 -9143 -1656 -877 -2760 -1634 10244 12188 9282 5445 18515 32157
15378 32157 26378 -6005 -26466 -30421 -36534 -45749 -27010 -19861 16378 46402 53538 5882 -38056
15365 -38056 -45193 -70432 -55422 -52541 -11931 11532 17256 6698 36996 17245 -31563 -32116 -48463
15352 -48463 -51174 -39442 -27414 -9581 -4424 -32997 -59155 -65632 -69371 -59354 -15842 -8316 6054
15339 6054 -8157 -22201 -45509 -59390 -61227 -66791 -45462 -38306 -33082 -27949 -15188 -21075 -36328
15326 -36328 -54213 -47438 -20157 -22595 -35697 -14888 -29653 -27975 -21815 -35245 -33507 -2012 25341
15313 25341 47568 50560 15411 5379 -8936 -6761 18249 13667 -14535 -36039 -11302 -26523
15301 -26523 -45880 -25050 -6173 -21110 5814 11296 -34337 -81429 -59835 -32522 1515 -3689
15289 -3689 -16708 -2254 10246 20259 -11703 -12516 18919 26072 20028 30165 14070 -24170 -41081
15276 -41081 -23864 -15922 -14773 -18942 -45554 -70722 -47847 -23564 -53176 -60395 -48162 -39828 -37922
15263 -37922 -23120 -16825 -23780 -38616 -10518 -31287 -62217 -66531 -59366 -44324 -36240 -12291 -9637
15250 -9637 -20669 -11871 -21498 -9476 14581 24060 7592 3945 -22741 -24648 -25258 -11561 -16696
15237 -16696 730 8466 -3369 -24258 -14623 -18987 -38275 -40307 -52014 -60831 -46851 -61053 -65870
15224 -65870 -53661 -48592 -25108 -11375 -7371 -27577 -20250 -757 -15091 -35525 -54107 -44727
15212 -44727 -18211 6404 2090 -8128 -35183 -23969 -30299 -29816 -29059 -6820 -890 -6724 20281
15199 20281 6848 -9635 -25112 -51568 -44184 -65881 -66665 -39975 -15896 -15249 -3853 15442 12399
15186 12399 -2633 -21572 -10642 5941 15230 18382 26069 46308 39764 24224 -2957 -17498
15174 -17498 -22924 -48669 -64537 -40975 -22022 4281 -5748 -20865 -17692 -3711 -25546 -48061
15162 -48061 -27753 247 15198 -5917 -16409 -34271 -45515 -67192 -65879 -47450 -26791 -4515
15150 -4515 15327 15820 5502 21317 15543 -14129 -16033 -13620 -13322 -19468 -24716 -27518 -58129 -72529
15136 -72529 -83585 -90784 -59242 -34711 -20869 319 7029 -113 -1831 14927 4627 18478
15124 18478 26965 20731 34823 18699 -7733 -16410 -11676 -3579 -3188 -4904 1185 3404 -11142 -23117
15110 -23117 -25457 -18119 -8275 -30380 -38810 -24867 -23137 -17036 -30886 -43469 -13329 22540 14264
15097 14264 -4095 26363 35024 45025 57873 58272 23042 -12207 -30517 -35415 -40792 -26394 -25165
15084 -25165 -17080 -39024 -46966 -43870 -17068 7555 20280 6206 -27280 238 15848 34650
15072 34650 44736 31941 -10912 -13265 -13137 -30131 -49510 -46638 -23026 -45621 -31166 -12195
15060 -12195 -14325 5626 -1223 2810 -9425 1525 -5740 -25137 -28742 -9505 4654 4636 675
15047 675 9956 27131 26939 -3804 5688 1842 -10 -13368 -33243 -42013 -39123 -13675 9905 12397
15033 12397 7750 10099 -4168 17543 -5656 -18627 -9289 -33305 -42171 -28502 -46721 -74582
15021 -74582 -55225 -22157 -594 -327 -10447 -13625 -18443 -25408 -53858 -63359 -37631 -26894 -19093
15008 -19093 5243 32431 22418 7156 -7401 -14808 -4749 -3361 4863 16460 1114 -31554
14996 -31554 -70197 -62817 -60974 -57973 -73283 -58406 -63160 -68136 -63735 -40545 -53522 -59130 -50107
14983 -50107 -40787 -20461 -9165 7317 -32024 -32984 -14113 -1246 -16078 -32047 -27624 -32136 -52214
14970 -52214 -21372 -7140 -17214 -7843 -4598 4522 -599 7082 115 -12557 6800 10773 -8080
14957 -8080 7682 9697 -12139 -21425 -20846 -40220 -74229 -67093 -37873 -14792 -10860 -13395 231
14944 231 32772 30198 12861 8893 17442 20370 17274 -2711 -24687 -3479 640 123 8632 -1036
14930 -1036 -29620 -25469 -57431 -44649 -34137 -21688 -17688 -26397 -29142 -45393 -55137 -49367 -17513
14917 -17513 9321 41293 49533 24754 2148 -13615 -33533 -13217 10366 -6255 -23478 -16698
14905 -16698 -5729 -4868 2689 -16642 -16663 -13031 -28810 -11657 -22138 -29338 -3967 26792 7392
14892 7392 -35163 -36964 -21557 -171 -18928 -39709 -43500 -48057 -34754 -31212 -32243 -22966 -24170
14879 -24170 -27339 -20727 -39779 -26923 -5576 5753 54 -16393 -23425 -27092 -19181 20543 36783
14866 36783 35596 -9860 -2251 7447 -16885 -7064 8305 9696 -17975 -38351 -34161 -37097 -58296
14853 -58296 -51687 -41888 -46374 -23132 -19141 -21026 8736 15167 36715 58077 43629 39222 19971
14840 19971 22716 44832 51162 70115 15185 -34915 -47218 -48568 -23172 3894 5306 17238
14828 17238 17070 1822 -10022 -834 32401 22664 2828 13044 -2973 -22354 -24592 -8748 -9380
14815 -9380 -12934 -4093 -15284 -19206 -7327 -9350 -37583 -39142 -43720 6124 -35351 -56856 -41816
14802 -41816 -19755 3646 20960 7155 19882 36153 35790 47515 33001 -694 -3016 -1404
14790 -1404 -524 23597 53178 42203 15125 -1655 6995 1491 5844 19144 36785 56390 27799
14777 27799 -9538 -55655 -72770 -49836 -37252 -27003 -50676 -75310 -44946 -3888 -6202 -2527
14765 -2527 22013 41114 35052 7951 -6560 -19015 -5795 5125 27034 36855 30346 40739
14753 40739 8799 2713 4576 -22592 -41839 -32625 -20340 376 -539 4336 4213 -13411 -31310
14740 -31310 -49268 -52627 -50922 -59083 -51149 -51306 -57936 -35431 -6882 -7273 -19586 -12782 -15608 -6133
14726 -6133 -12250 -30916 -36845 -27995 -26481 -32290 -44411 -32742 -26510 -28895 -8886 -33477 -81532
14713 -81532 -57754 -9484 12448 -22815 -22476 560 7618 30682 7145 -16041 -40748 -53931
14701 -53931 -46983 -19657 4022 10520 6104 3255 20237 9947 -19710 -21641 -12344 -9992 -4388
14688 -4388 4078 -10564 -9001 -20663 -5081 18910 29461 16290 -1442 2688 19013 -11663
14676 -11663 -17165 -5312 2828 5488 -8977 34820 58975 43463 47773 30127 10714 4020 -13875
14663 -13875 -37799 -23037 10977 9975 -9876 -28060 -44521 -57802 -73516 -77002 -70132 -48372
14651 -48372 -30203 -46914 -45579 -34299 -18136 -43431 -43512 -32399 -29936 -22816 -13786 -550 -18387
14638 -18387 -44630 -13381 20822 22414 15652 16712 10222 30405 15164 12027 28963 34175 36789
14625 36789 23157 16744 8530 -7757 -18978 -37486 -59818 -73531 -49223 -51613 -15158 -20274
14613 -20274 -43600 -36600 -53272 -50735 -31011 -21888 295 26632 20274 4278 -24925 -42802
14601 -42802 -39777 -44151 -37646 -14128 18416 16017 6875 3181 4175 -6779 -15484 24201 14985 -891
14587 -891 -17687 -12401 -29731 -60359 -43070 1571 40007 29598 29651 25657 20570 25363 29241 21337
14573 21337 5078 6222 2869 24067 13605 -5742 -21472 -37086 -24926 -26016 -9092 -7736
14561 -7736 -11675 7044 17179 7422 4782 29808 32443 34487 23658 3600 10174 24332 1745
14548 1745 2733 2628 -6854 -43266 -57564 -44636 -46349 -28914 5581 18922 -10961 -60382 -56736
14535 -56736 -22884 -14131 -27909 -36224 -22354 -10 3081 -12909 4471 -13072 -49551 -35957
14523 -35957 -36587 -75615 -59988 -41447 -23027 366 16582 5609 4474 9714 -17251 -19378 -1283
14510 -1283 -14773 -21650 -25360 -37637 -27139 -645 4998 -8749 -26986 -29089 -27089 -11692 -10265
14497 -10265 -32195 -26996 18927 28353 -6875 -22727 -16196 7958 23341 8451 10534 -4322
14485 -4322 -29625 -35838 -28629 13083 -7443 -21482 -10523 2052 -2226 -12343 -10212 -22605 -25314
14472 -25314 -9914 7519 25070 19073 19841 17413 -876 24682 42601 28404 28440 13084 20229
14459 20229 36375 20634 19943 -8221 -25339 -7209 -15403 -44897 -16616 -7528 -20534 -14198 -3342
14446 -3342 -7106 -17839 -18019 -13694 -33537 -13998 8079 18221 13027 -19284 -48548 -46178 -33615
14433 -33615 -29950 -27748 -37895 -30656 -35148 -35891 -40793 -48713 -38073 -23058 -24008 -14695 -16339 -31007
14419 -31007 -9345 2533 833 3782 4089 8826 -13895 -38939 -35790 1340 12392 -8453 -7609
14406 -7609 -22710 -28063 -11276 -252 15925 821 -15521 -4539 9790 13150 5360 -4098 -15752
14393 -15752 -1058 3768 6871 13016 33840 2412 -17300 -7379 31259 23173 -26159 -49618 -44135
14380 -44135 -8604 9723 28782 27092 70700 91634 61236 9921 1560 9840 -7968 19242
14368 19242 15269 -19522 -25169 -11951 -32900 -39813 -29921 8524 25476 28124 11173 -12336 -38155
14355 -38155 -44151 -25509 -8613 -5766 14831 18950 58 -13449 -26467 -12924 -4741 -99 4930
14342 4930 -2122 29756 43449 55671 25132 -3421 -26508 -11993 -8490 -21022 8987 20030
14330 20030 8044 -11307 -40649 -37404 -17406 -2942 52806 28851 -13243 -45045 -54883 -5068
14318 -5068 24473 25160 12757 -15800 -26325 -7147 -4241 -3570 -11876 -48794 -61003 -65849 -26963
14305 -26963 -27911 -48851 -35179 -8654 -17830 -25824 -23952 -8651 2717 11040 8662 2572 -2621
14292 -2621 -5132 2900 -17539 -5041 30630 24101 4059 352 -15312 -9732 -858 -1535 -18117
14279 -18117 -23415 7614 25681 35818 53342 71409 37900 -16997 -58971 -52791 -46998 -47985 -49483
14266 -49483 -41379 -20895 15333 14817 14101 -21005 -43219 -55903 -63565 -40029 1974 2669 -17307
14253 -17307 -30566 -35668 -47897 -23923 2356 1144 -45051 -52320 -69751 -63703 -75737 -66287 -15498
14240 -15498 19178 13457 18457 9169 5413 1823 -11501 -32970 -23545 -6162 5647 11125 9229
14227 9229 -14969 -49235 -39321 -23082 -29945 -3521 25750 22113 -9738 -12254 -14788 -9714 -1897
14214 -1897 90 -3062 -17097 -11166 32454 28510 10610 16407 -4802 -3423 3154 -5635 -33482
14201 -33482 -36674 -45306 -34802 -28627 -14473 -26689 -34710 -56890 -50951 -22882 -27371 -24260 -3062
14188 -3062 15526 20852 1572 -6956 -6342 6084 40567 41393 7230 -8685 11600 31749 31558
14175 31558 36150 9802 1643 7683 41138 40125 1131 -23985 -21219 -49066 -70829 -89419 -64053
14162 -64053 -34707 -48473 -43782 -23888 -9276 -20888 -15617 24877 22650 -3104 -4795 11861
14150 11861 -14028 -19094 -4854 -4891 -6946 12842 22653 5346 -27597 -49413 -54704 -38612 -33679
14137 -33679 -41155 -24931 16159 26616 -14334 -32754 -10693 3080 14035 17688 10241 19667
14125 19667 47590 50781 51114 16462 -2279 -6213 -12014 -9035 1545 4920 865 18195 24435
14112 24435 16704 12797 16699 36057 2006 22066 3094 -20587 -26962 -36829 -27182 -18760 -33264
14099 -33264 -27437 -28231 -28753 10040 42591 45836 15535 -42100 -37428 -33562 -40532 -44645 -45170 -59181
14085 -59181 -38971 -5675 10005 -11941 -20274 -13743 23965 53945 54433 59799 59411 41520 31941
14072 31941 9880 7010 14961 18596 14997 15548 -11040 -26842 -16778 -19221 -35848 -17750 -9387
14059 -9387 -25163 -30646 -23696 -408 9156 19489 7455 -26224 -19501 9670 11995 -6549 -8560
14046 -8560 -14746 -19351 -14298 12520 30280 44930 40820 53346 52334 28861 10589 15415 16873
14033 16873 19936 -2394 -28743 -34880 -7938 -10666 -28692 -14233 19000 33898 21519 -25912
14021 -25912 -32105 -18329 10666 1446 10841 -3605 -8243 -13847 -1713 -8392 -10963 -8917 19540
14008 19540 31541 35438 44766 32491 7851 -22289 -10620 14190 9884 14278 -7914 -6242 7123
13995 7123 14319 18108 22126 21935 31116 51988 53820 37226 19644 26672 39719 26868 882
13982 882 -31842 -19867 -7177 -8670 -25967 -10881 -4545 -19129 -34263 -46575 -33018 -28714 -1579
13969 -1579 -1403 3982 21542 35997 30165 9274 6409 -13434 7942 14305 6372 13947 20667 35832
13955 35832 23660 -2206 440 26069 45444 25595 268 -14352 -22655 23356 24900 34580
13943 34580 11845 -12159 -7483 -16821 -11333 -434 2461 -34409 -22650 -25036 -16256 -5628 -8324
13930 -8324 -2778 9869 3147 -16397 -20617 -20247 -13798 5971 19289 28475 18649 33121 30330 39540
13916 39540 27978 42910 36244 32698 30203 24046 12892 27759 31570 8115 11095 9393 -16429
13903 -16429 -36430 -19767 5212 -3370 -15228 -24730 -20417 10111 39359 22661 18569 3523
13891 3523 -437 14207 17637 -2179 -15917 -8745 -51524 -63391 -50898 -11259 32161 48983
13879 48983 28807 -21621 -72835 -65588 -31910 -10500 -9369 -29832 -15945 -15383 -22805 -30123 -18080
13866 -18080 -37776 -51513 -20760 1235 16443 36419 19193 2968 2225 -10757 -18184 -15117
13854 -15117 2114 35980 42815 24888 16237 -13990 -45376 -30405 791 -10588 -2037 31663
13842 31663 36473 -17087 -14177 4604 13928 24163 17982 22438 4616 40372 68680 38516 7740
13829 7740 10848 -7496 -3708 16680 24868 13917 13859 40068 46847 39995 15251 -9363 -51422
13816 -51422 -61492 -41663 -18374 -12869 -16746 -2555 -2559 -8557 -21942 -32185 -19337 24012 40059
13803 40059 31383 24215 -833 -32498 -15156 12347 -3701 -11774 -19450 -18447 -6971 -14059 -37331
13790 -37331 -27580 -6285 -24797 -54590 -71588 -73725 -54076 -37668 -32708 -48006 -45740 -44885 -34231
13777 -34231 -29580 -30730 -2683 -3403 -14409 -13224 -544 28701 20982 -12690 -29727 -17953 -15084
13764 -15084 -6590 -21800 -7258 -9182 -22523 -23700 -32754 -18029 -28510 -32792 364 3602 -7384
13751 -7384 -11835 -26755 -35809 -9582 788 -4890 -13474 -10552 -10815 -41731 -42592 -38798 -44929 -39831
13737 -39831 -55019 -48323 -47718 -58379 -68446 -53068 -51227 -64217 -44369 -39315 -17473 -9619 783
13724 783 -4276 1751 13141 7602 -2030 -10996 -28710 -16924 -3411 24278 5311 -17445 -17676
13711 -17676 -33 17175 37442 55851 29263 3336 4222 -3580 -29743 -33903 -17030 15852
13699 15852 20423 20612 17984 -18436 7535 15929 10337 11837 15648 756 -1463 12994 -12127
13686 -12127 -33362 -9071 963 -4067 -28786 -37343 -24054 22115 35759 35189 22790 7027
13674 7027 3205 -30072 -17286 -12322 1503 29673 3405 -6838 6872 4210 -876 -7519 -5105
13661 -5105 5351 14357 -15195 -12692 -4725 -12209 -50038 -15928 37573 22245 -3478 -4875 16353
13648 16353 20972 -9725 -25119 -21762 -11358 -7121 -19833 -24007 -10377 -12323 -21280 -12234 13205
13635 13205 20801 57442 70921 57761 52297 60829 37125 14385 -3616 4955 19485 23087 19917
13622 19917 20918 4445 -21859 -25927 -3453 10526 -635 15494 42016 15629 -9606 -17993
13610 -17993 -23990 11219 15193 -6143 -11089 -19978 -14439 -15683 -23431 -6766 -20973 -31235 -27133
13597 -27133 -37157 -24937 -5303 1697 19167 40414 38674 36643 58913 61172 442 -22187
13585 -22187 -5479 -14841 -3149 -12522 -13321 7138 21916 15216 741 -29374 -35255 -44995 -45381
13572 -45381 -42536 -16206 -19083 -19226 -1246 -10957 -27445 -44200 -46811 -32712 -10817 7152 6473
13559 6473 -632 -8615 16776 36136 2147 -36589 -51920 -38758 -28326 -10524 2990 11476
13547 11476 13084 1312 -24189 -12234 6508 6990 -7359 7821 9622 2898 3383 13630 30948
13534 30948 17176 -5632 661 5796 -10297 17017 19011 6922 31950 33152 1930 14376
13522 14376 25208 51747 18763 4569 4186 3997 1537 601 1794 3027 -14608 -50892 -50497 -45156
13508 -45156 -19521 -14048 10688 19899 24164 20865 20078 31049 7275 -19669 -4374 17421 6345
13495 6345 5661 26922 40700 -7 -180 395 4374 5302 16952 35498 3550 -39180 -56805 -46384
13481 -46384 -16529 -14679 -4674 6699 4505 14856 14729 14816 21312 22876 6661 17970 8859 -1829
13467 -1829 1446 19595 33822 21346 13343 19355 1922 267 -17568 -24437 -2203 -194 -7120
13454 -7120 -30483 -45830 -33286 -21457 -4216 23930 10878 3775 -612 12509 15384 -13331
13442 -13331 -24862 -29517 -31235 -12832 -4752 -3301 -4349 9318 43473 30511 27539 46897 19897
13429 19897 -791 556 12936 40645 24091 17029 44934 30862 50026 72312 84777 31175
13417 31175 591 14365 10701 4439 19188 34287 13310 -15185 -6160 28418 72496 68382
13405 68382 71433 68411 33644 4712 -8981 3634 23520 -49 -13603 5745 16150 -6620
13393 -6620 -33298 -25018 -25662 -41248 -39305 -31872 -27062 7063 8197 -6040 -8895 9937 31617
13380 31617 15809 -3509 18772 6499 -12445 -20275 -35640 -40182 -56502 -59377 -57503 -34382
13368 -34382 -28191 -34500 -12251 10945 347 -22460 -26301 -4217 12865 18 2069 13316
13356 13316 19835 -5252 -7718 -1699 10600 43078 26921 -1267 10071 24655 29948 16483
13344 16483 -2583 -4398 -10806 10231 51115 58587 16721 -22270 -12344 -8104 -4148 -3418 9852
13331 9852 19204 26875 41491 12965 1628 14914 15339 12920 24379 24058 23576 16409 -23060 -35348
13317 -35348 3908 13322 -31218 -54124 -30878 -20329 -26272 -41243 -17568 -1891 -20034 121
13305 121 3479 -25813 -25432 -20565 -3471 -6139 -24673 -55616 -74911 -59934 -40951 22938 42230
13292 42230 66434 59335 55065 15656 -22306 -17833 -2372 8458 615 -7819 -31364 -26007 -22280
13279 -22280 -11782 2737 4819 10329 4627 6953 -26179 -36117 -41037 -39749 -41356 -45634 -39608 -54207
13265 -54207 -38583 -37672 -54002 -46808 -33410 -24080 -68675 -75648 -54814 -38898 14172 28151 -2666
13252 -2666 13883 30728 50256 54809 33669 27305 57772 46466 42223 32336 10328 6078 5169
13239 5169 10982 8236 -560 12507 23530 3876 -3308 -27021 -65337 -48679 -3354 -7774 4360
13226 4360 19542 37246 33920 39089 6567 10060 10157 3448 -10361 25582 43638 44218 16737 2645
13212 2645 -7927 5161 -21422 -25277 -28049 -5506 2374 12278 14196 -30011 -10444 3774 15666
13199 15666 -5764 -26285 -27234 -29856 -7759 -14877 -18478 -28881 -45494 -31294 -15059 -16656 -17492
13186 -17492 -37349 -51752 -34437 -29300 -22031 -20548 -6713 8660 -8278 -14232 -39118 -61341
13174 -61341 -15381 4406 -7178 15014 20096 -9702 3336 1746 -1750 -11192 2626 48009
13162 48009 63302 27361 -1154 11493 290 -10950 -15418 -12189 -4609 -34482 -55510 -47208
13150 -47208 -41527 -28227 -36141 -16478 13150 8800 11633 9999 -1008 8120 -5197 -21811 -27449
13137 -27449 -40074 -15930 20437 16747 -2227 -10927 19997 34493 30641 5028 -14097 -27347
13125 -27347 8881 26404 27351 10104 1472 -8854 -35163 -24845 -26988 2281 2397 13408 2428
13112 2428 -25821 -37703 -32225 -43189 -24065 -23051 -2476 44599 3632 -37884 -21392 10514
13100 10514 36362 15105 -12276 -35014 -40501 -31499 -12694 -33971 -39150 -25011 18221 8198
13088 8198 -39143 -56792 -31743 -18934 -6970 7627 -10473 -43760 -55443 -61989 -83458 -78529
13076 -78529 -50208 -15734 763 -5532 -35134 -13123 11111 22474 24490 7123 6493 23711
13064 23711 10144 19325 16706 18095 -466 -25582 -24805 -12257 -8255 -35024 -79515 -85614 -38384
13051 -38384 -13376 -84 -3307 -9012 -14759 3040 37953 60856 59769 51437 33727 7953 -1158
13038 -1158 -23894 -29996 -23633 -13455 15494 6540 21750 -995 -1471 14146 16538 18304 -24175
13025 -24175 -26332 -14295 -19082 -7379 27181 34636 -9718 -31640 -30002 -12398 -29594 -34295 -34807
13012 -34807 -37360 -34270 -24684 -5628 -7108 -791 -17482 -17739 -16447 -542 12860 -3266 -13450
12999 -13450 -38057 -37272 -50251 -50827 -66665 -67484 -45559 -44436 -42489 -53923 -76211 -69680 -51791
12986 -51791 -53607 -36809 -46572 -23725 -20426 -8087 -14876 -23256 -26083 -19560 -16641 -7211 25469
12973 25469 461 -11155 -4574 -30260 -21018 1799 -9960 -7679 -5486 -13134 -20068 -8646 10983
12960 10983 6233 78 -11575 -5734 -18389 -4096 15796 23611 33283 8356 -18268 15121 10633
12947 10633 -6855 -7145 23848 22063 -7123 -19470 10536 43456 7553 6398 23042 40527
12935 40527 36717 29215 8597 28870 51876 26734 5340 8417 628 15350 22333 29005 24808
12922 24808 16132 12635 40693 37528 12400 20819 25340 17350 41088 57088 34243 1437 5662
12909 5662 -3854 -2135 9588 55490 110425 146837 142007 127877 124995 114427 111379 112936 95286
12896 95286 66146 38756 40442 48430 59898 61153 41393 27479 29390 15899 22841 38524 70792
12883 70792 92870 62845 31317 -4775 -4788 2285 24485 -14878 -35943 -17136 10076 39221
12871 39221 20991 20901 -3451 2653 21811 17040 -21773 -6051 32720 -4341 5157 4959 13700
12858 13700 28256 53603 52092 24473 20666 27115 27193 17182 16744 10759 13547 52050 81992 93979
12844 93979 99844 108671 127048 97179 56240 29670 30512 48578 40481 19274 34192 41679 6231
12831 6231 3332 40165 62430 29284 24709 6717 3249 -13207 -549 17889 43411 37284 32464
12818 32464 32409 28398 40702 9373 -12850 -13929 -9708 -3412 11576 24686 8942 20188 9609
12805 9609 23412 45740 69201 72986 60610 45247 23550 9609 12370 33126 50058 34974
12793 34974 -6053 -26871 3076 10153 26692 16013 9633 17125 43329 56576 52682 35548
12781 35548 45693 43665 15011 2697 -13958 -44634 -60847 -34526 12152 19054 37114 38163
12769 38163 30821 19536 -3631 13832 6913 -7602 -1155 15075 12000 17067 -1677 -9842 8214
12756 8214 20266 20021 -4543 -51246 -25594 -18932 -40952 -37874 -21769 6747 25364 47887 40620
12743 40620 10173 5329 -19376 -41637 -29762 -8111 -5182 -16417 2384 1534 -2429 -2459 13752
12730 13752 4382 -18872 -57204 -45115 -10531 1798 -3048 17497 13310 18288 19193 13372 -5818
12717 -5818 -18878 -40703 -28260 -16311 -22167 -26032 -5818 33734 53669 16927 -1343 -4668
12705 -4668 6818 8132 2153 -14279 64 28774 41881 56815 36901 6540 512 -3104 -24340
12692 -24340 -23928 3779 11892 -6754 -24048 -5589 2671 -191 9658 17496 22015 23343 11528
12679 11528 -34036 -43276 -45255 -5181 19880 7307 -4512 -35161 -14400 985 -1280 33275
12667 33275 63980 44291 19200 23362 19509 11024 4897 -24459 -32209 -7377 5086 -14564 -18301
12654 -18301 2200 13819 -459 -18344 -32637 -34107 -21838 12762 -5060 -21696 -12167 -18821
12642 -18821 -71524 -51624 -12481 -7502 -27493 -30858 -17539 46026 31709 16772 -7678 -19157
12630 -19157 -7753 -6790 2373 2725 23646 44176 40702 41628 35825 26946 -9157 -22869 -13912 -13658
12616 -13658 -18090 -688 32219 21297 11264 15241 39045 50699 25142 13158 16385 32117
12604 32117 11839 -4784 -5837 -12875 -3721 -2002 5741 6112 -13642 8959 46412 66958 47277
12591 47277 12493 -10179 -15232 -1611 -7813 -28131 15249 1438 27007 13901 13140 3284 4714
12578 4714 -7544 13523 4246 -25009 -30684 -17773 11573 19739 12072 -10459 -1801 -6517 503
12565 503 -30564 -49941 -24767 28501 9693 21785 33089 37438 42519 51553 38154 19413 -4820
12552 -4820 -14442 -47849 -39316 8240 14550 8372 8420 6085 24496 10651 9672 723 11176 -9852
12538 -9852 -8652 9259 10190 10322 5211 20283 18192 -16424 -42948 -39993 -21173 -17775 -15357 10100
12524 10100 -668 -2617 -7049 -16270 7911 12521 -29187 -38331 -64269 -46679 -15029 2148 22330
12511 22330 27638 33886 36902 22213 17895 19019 11462 7326 -7065 15844 11397 -22512 -25866
12498 -25866 -27683 -27576 -32785 -28098 -33675 -38452 -25308 10631 24576 7481 -30785 -25689 870
12485 870 13004 9111 -5017 10799 23629 -2076 -19394 -37184 -13540 -182 -15733 -18952
12473 -18952 -5239 -19029 -43683 -51484 -49370 -56324 -74644 -90006 -78526 -72277 -23830 -6849
12461 -6849 -53257 -56272 -18134 -16428 -17948 -15798 8932 17328 -2771 -22587 -10582 13864 9268
12448 9268 26884 55435 57074 43124 48736 47905 -414 -37316 -34405 -10894 -27025 -42347 -10851
12435 -10851 -12910 -35661 -18264 9671 4725 -2691 17246 18168 37647 31175 -10217 -18071 -1520
12422 -1520 13102 30885 37283 27369 1532 11591 28776 27182 9803 5036 9361 6972 17249
12409 17249 11639 3536 27449 36226 21220 25065 22991 13839 23768 14929 -6279 -20400 -21191 2542
12395 2542 11291 20049 35042 6484 -6950 8922 4833 20429 20147 204 3047 1414 -20459
12382 -20459 -26461 -30196 -30378 -20027 -6560 11371 25982 -6727 -34474 -16471 -11966 -1148 -23146
12369 -23146 -33083 -10243 22647 3760 -31975 -24276 -11223 -9985 12809 34269 24279 -12104
12357 -12104 -9639 21281 14272 8168 284 15168 16031 -5568 -19871 -20524 -25558 -20491 -4090 -14210
12343 -14210 -15415 8090 7783 -4818 2496 5865 -4294 -26750 -45612 -66141 -49195 -37486 -28005
12330 -28005 -31161 -46748 -27422 -5863 22271 16212 -650 -18150 2540 -2106 -15453 29531
12318 29531 47826 44710 54511 52569 66193 32639 3746 -6833 -24386 -31871 -4687 -14043 -18494
12305 -18494 -4739 -32492 -75765 -50217 -50904 -33961 13062 14493 -1812 -20501 -28523 -11172
12293 -11172 -25872 -35909 -23307 -15977 -18247 -11089 -4730 23667 61413 45862 57530 56108 40961
12280 40961 -3182 -14123 2454 6664 -4268 22871 21987 13018 15588 29314 26581 21617 8692
12267 8692 -22638 -36489 -1382 -7746 679 12020 -1666 -5847 -17573 16418 5116 -1709 14260
12254 14260 -2091 -14673 -18112 -2626 16960 38289 55851 61222 76873 50150 40588 15743
12242 15743 -14425 -4612 -3028 -8279 27549 28186 4720 2838 4836 9248 -16118 -38682 -50819
12229 -50819 -54401 -49642 -46899 -25652 -19809 -21530 -33787 -34766 -9861 912 -19326 -20318 -39416
12216 -39416 -50547 -72266 -61136 -1530 25435 13202 -13942 -32887 -13898 -10800 -10992 12232
12204 12232 9825 17263 6788 4746 22435 45627 66306 52076 20054 8349 30028 44075
12192 44075 37728 717 -7502 -29964 -35972 5481 27913 30955 22747 23039 30963 21606 14055 31499
12178 31499 16399 -28924 -8208 3385 -13244 10911 -1403 -21505 -11041 148 -15820 -4274
12166 -4274 2928 -10240 -16428 -34888 -25097 12212 23029 17191 26145 3815 -31369 -52894 -35624
12153 -35624 -7161 20086 24794 12490 -31430 -65037 -53849 -32873 -35273 -31926 -29545 -24401 -32445
12140 -32445 -23681 22561 47898 25501 9000 11081 15876 1182 -18898 -27722 -21870 15810 48322
12127 48322 38960 -3762 6453 19592 33642 14802 -14895 -33948 -44261 -50726 -59361 -53879
12115 -53879 -48462 -46548 -30185 -31891 -14576 7475 -21913 -40819 -59598 -56721 -20566 4463
12103 4463 -30344 -26164 623 13781 -13424 -33622 -32717 -43633 -23549 24108 43150 43917 48429
12090 48429 17612 -5382 -10625 -12467 -16352 4952 8931 -6693 -1123 -8025 -3721 20307 15984
12077 15984 19704 23188 36164 28396 2814 19494 89 -12396 3932 -8925 -37302 -31144
12065 -31144 -15947 23591 25356 19676 35527 38866 23369 -10329 8285 17853 -4934 -25080
12053 -25080 -28959 -12969 -16319 4530 17267 10013 5229 1604 -12759 -33399 -24462 21940 39430
12040 39430 13605 -6564 -6854 16320 41867 28115 55134 57057 25352 -7968 -27269 -4387
12028 -4387 8464 3892 -5226 14163 -12658 -6153 22836 39383 12755 -17916 -16246 -32664 -52939
12015 -52939 -30046 -18270 -25226 -15676 9532 -17859 -44262 -54142 -74182 -70379 -53042 -10321
12003 -10321 -5239 -962 11295 27713 43230 58002 43353 34429 47019 64975 10784 -13338
11991 -13338 222 -187 -8155 -28745 -19830 15562 34672 22245 28584 9210 -31435 -34764 -16407
11978 -16407 -22616 -17207 8806 23178 8737 -6332 1091 4335 -33779 -36181 -17610 -10723 -11968
11965 -11968 -4930 -10312 -40093 -35735 -15155 5898 2183 -4173 -36304 -35827 -21720 -13238 -17640
11952 -17640 -14448 23948 46200 2985 4953 27706 8436 11746 51416 57451 60347 13827 -24101
11939 -24101 -20566 -1216 9999 11596 -15985 -31305 10314 14573 815 21108 27766 21178 10770
11926 10770 14334 2845 -1449 -19503 18080 35587 9669 -4809 -9298 -8463 15661 -2954 14745
11913 14745 12890 4083 -11653 -9852 13151 27685 7683 4877 -2623 8499 27040 22848 32169
11900 32169 29606 25544 18465 15401 21141 7821 -7104 25733 38251 39563 56660 47040 25448
11887 25448 522 -12954 -35289 -23715 -31059 -20299 14175 28938 -293 16698 18476 26709
11875 26709 28377 24578 46039 43425 27700 17703 33397 24497 10200 15996 12363 -10060 -1567
11862 -1567 -13369 -25010 -3042 19142 3108 -6356 2027 -1669 -27292 -26041 -11860 -25446 -35284
11849 -35284 -16370 -17533 -23133 -6817 33400 52168 67404 43376 -9731 -18084 -3661 7943
11837 7943 14223 19836 25518 2618 22511 49893 51577 24733 -7038 -14003 -2458 20691 18464
11824 18464 14646 14330 48681 34811 24050 17952 3372 -1759 -7218 18036 26858 32330 32139 34787
11810 34787 40320 28508 23657 -14030 8093 7542 -10373 -34162 -28393 -447 -26264 -46413 -15027
11797 -15027 4861 -3733 20755 32342 15744 5445 -1895 6625 -1979 22308 22792 -12331 -30541
11784 -30541 -31872 -24217 -13005 -22730 -7960 -33340 -55889 -21940 3067 3027 -27052 -55606 -27939
11771 -27939 15767 5141 -21514 -2671 1852 -8089 -20342 -243 21418 17592 23164 19065 17066
11758 17066 13573 17038 16662 13444 41969 35636 5636 3119 4580 14360 16562 -9287 -16784 117
11744 117 17190 37711 39688 29777 -8145 -35696 -23479 -25316 -27718 -9131 -14864 -50295 -47213
11731 -47213 -31793 16654 25801 -16346 -39284 -33610 -27803 -38928 -31012 -2359 -9335 -35966 -42242
11718 -42242 -26176 -30170 -26827 4197 26935 5793 11826 -3400 -21215 -6949 2899 -1088 -15006
11705 -15006 6339 9667 -9903 -34489 -18472 -5963 -20384 -13071 -9452 813 1625 -6638 -25147
11692 -25147 -14463 -10265 -19142 -22902 -19064 -15242 -14527 -11054 -811 -11781 -8869 9539 -4382
11679 -4382 -31107 -34058 -3689 -5490 -31527 -11965 11233 5960 -7053 -18606 -9302 -21204 29783
11666 29783 59345 11734 12655 1270 -23961 -14782 20260 27621 8501 2733 7908 3375 -8181
11653 -8181 1378 33662 44225 56099 57638 61311 34099 6745 -8550 -15873 -56141 -64075 -24962
11640 -24962 21530 32492 16862 -4139 -11618 1849 1247 -18665 -23441 -47451 -90567 -97675 -24330
11627 -24330 -1096 -4991 -15236 -14191 -5978 -14614 600 -3669 37612 24568 33337 62732 42611
11614 42611 18581 40278 44422 51353 30332 21814 10296 -14222 -14395 -33107 -32539 -35852 -24988
11601 -24988 18631 22282 13008 -8680 5334 -1634 13827 40451 42895 60289 26327 -25627
11589 -25627 -54320 -55472 -47433 -20219 -35943 -20520 13172 44060 30257 -325 17483 5698
11577 5698 -26881 -27040 -9914 -6434 4156 620 -5195 -34371 -14669 30259 44333 37566 37431
11564 37431 26260 -11448 395 15575 2107 27413 24384 7250 -9398 7281 27066 5810
11552 5810 -1114 14003 11212 26085 24548 33651 40018 26233 16274 20274 12625 -12811 -11544 -19515
11538 -19515 -1309 19092 17299 7937 -7194 -9234 -16796 13659 30398 35078 26058 37312 49137
11525 49137 37878 13916 12104 39756 41718 32789 25803 27335 24432 19257 5422 5863 12322 13635
11511 13635 34196 40537 45353 22254 26485 21446 4185 -3759 -3488 -3700 -20747 -36897 3162
11498 3162 48418 57021 50663 19366 23437 -8793 -30575 1689 1801 22756 12306 -881 -1196
11485 -1196 -35775 -49291 -37370 -1121 15789 24383 -5058 -21958 -28127 -15857 22218 39162
11473 39162 8751 18325 49388 40467 33092 30298 -392 -32848 -39123 20402 38698 25665 25251
11460 25251 40630 47327 31645 30974 32707 48996 63896 66044 85547 74741 34359 -18737 -17191
11447 -17191 5031 2900 19185 51341 68022 67768 45225 38353 38804 37916 53626 49519 36325
11434 36325 5117 10873 27072 56108 54785 25622 4723 105 1272 7478 5798 26635 26129
11421 26129 6471 -5003 -430 4671 -9532 -13425 -5906 6099 -25536 -6357 -4583 -14749 -10636
11408 -10636 -5491 22029 49101 41246 57628 54841 36336 20514 21014 2452 8407 26917 19624
11395 19624 -2751 -37467 -35560 -10105 19383 41605 63624 43391 20887 29703 51720 56949
11383 56949 29144 10631 38619 59510 42651 39605 47418 50894 6655 -32550 -14246 -1838
11371 -1838 7405 19885 41749 42776 48490 30508 3226 -12264 -9538 -13044 -21236 -9112 -2757
11358 -2757 -194 9886 35896 22794 -3708 -43454 -42978 -15953 4453 -16205 -20437 -14266 -19538
11345 -19538 6526 10194 6843 -25680 -31313 -5487 24135 63092 70111 12678 -18627 -26425 -47
11332 -47 3556 13433 6923 -8777 1287 4867 -15143 9627 61581 60211 53224 56927 81213 77714
11318 77714 55650 51634 40546 16868 28466 31600 45001 23820 27918 -11214 -43478 -25332
11306 -25332 -4567 -30819 -40760 -41712 -18538 -7241 10726 1329 11722 14974 7237 -141 -2967
11293 -2967 -23979 -27945 -14394 23927 33623 31259 37062 32332 965 -26288 -12829 20350 12165
11280 12165 7321 16590 6820 12415 32547 50192 62448 34603 4004 -5911 -23159 -24988 -3866
11267 -3866 39171 37204 34425 21226 25825 29032 50518 54279 71938 68237 46490 62995 79341
11254 79341 73046 43243 23846 25937 19278 22478 4422 -4811 -13207 -1640 11454 5869 16074
11241 16074 40175 44643 46850 43837 13736 5504 20290 12091 12963 20805 42737 36998 13948
11228 13948 17149 55951 66143 36686 10438 -12316 -30016 6232 10963 -6933 24850 63031
11216 63031 79473 81848 46394 44870 38808 10710 10481 -11369 -2185 16219 32946 37710 55662
11203 55662 69210 46551 22366 24013 39559 44705 27483 17270 26548 9798 5593 23017
11191 23017 25098 8002 7683 -9891 -8626 1469 3476 16736 33963 39356 31824 24336 29067
11178 29067 21970 -206 -2577 -2780 10685 10355 14928 8395 23728 44728 26692 1590 -15470
11165 -15470 -26650 -50888 -34452 -34419 -28762 -9208 3683 -6952 -2230 10911 27901 22695 39979
11152 39979 35340 19436 9943 45165 75872 83849 77009 53653 53074 44563 32699 60196 91432
11139 91432 75482 68348 47727 27030 48161 70593 49137 38674 13066 -9488 2210 15145
11127 15145 26055 58804 60103 66488 59746 70566 52931 49313 34223 26830 10470 11569 19815
11114 19815 23953 38481 47878 22800 8249 30614 -206 830 17865 38455 50984 45816
11102 45816 61742 68514 39615 15491 5275 27601 32791 53263 64673 56196 55068 41495
11090 41495 35313 31733 2758 -3775 3684 14974 23047 27235 29879 7593 34028 36399 31541
11077 31541 41935 38128 84454 81121 69490 70178 63094 46701 55886 80072 66460 72654 73732
11064 73732 91669 104877 120450 102791 111617 120953 146537 163909 172643 179067 214282 210998 186021
11051 186021 181672 231996 296248 307470 290235 334321 374871 425416 514788 590342 707315
11040 707315 856320 1080929 1345127 1720724 2171629 2702574 3237872 3754761 4177195 4529427
11030 4529427 4750784 4823042 4757056 4538974 4204813 3783402 3349537 2926782 2565478 2221615
11020 2221615 1882880 1626898 1442921 1306409 1193737 1091063 1028409 980233 927140 886660
11010 886660 868536 832290 820752 784651 727161 699141 679360 628109 593411 526381 506019
10999 506019 498293 499116 469853 436285 387714 359241 340307 335948 341171 305501 270397 247328
10987 247328 202399 187334 181923 146524 139111 151702 163212 176810 142241 88526 83715 115178
10975 115178 180462 189117 176593 159770 154147 143621 127297 146935 165286 152762 173904 211576
10963 211576 228905 219764 227917 229070 230949 232063 218392 200345 178013 183003 164695 151652 175014
10950 175014 174035 147949 140930 142299 158575 150276 129367 88509 58228 54915 65036 82831 92643
10937 92643 77317 92702 59424 61371 75396 94545 114668 104312 91852 97578 73571 74894
10925 74894 87221 94163 103979 80860 75868 95846 112697 97765 81019 69192 43856 24401
10913 24401 21168 18744 55136 73349 46562 55252 88536 96513 110894 96906 55420 29324
10901 29324 25740 28431 48168 85160 111321 120798 144258 164775 155743 201144 209345 207646 237403
10888 237403 271542 337138 423623 534442 686236 943905 1283174 1643390 1951395 2196716
10878 2196716 2454222 2643720 2674325 2515470 2269712 2010648 1759548 1501157 1286838 1098579
10868 1098579 925194 791180 697050 653827 604707 584212 567920 529266 488450 460234 469708
10857 469708 469069 465094 450727 425259 373163 342062 354483 323442 306557 286848 249509 212388
10845 212388 234038 224301 200552 199168 197865 206260 179093 121266 117017 120465 108939 91336 99984
10832 99984 101617 106317 90773 102939 108466 127981 160013 155634 138597 122295 97291 102679 108396
10819 108396 98529 78302 113356 120796 66602 26786 30525 21087 17444 42782 65979 76733
10807 76733 105508 111029 102620 91342 95303 117681 110889 104740 73451 76626 71329 42110 35093
10794 35093 37610 -559 23030 53900 50679 62247 56208 34249 39049 37108 52152 79855 69044
10781 69044 75362 86297 52513 43131 58547 44478 26607 35749 43203 59201 92398 91773 66391
10768 66391 46659 58941 59607 36293 41691 64922 63672 40493 16623 18028 39610 64289 62541
10755 62541 38242 64160 108608 99947 82237 88157 78541 80965 77406 59741 70564 93287 97794
10742 97794 93665 103973 109216 104801 120204 117129 107374 92466 85878 121486 132740 122229 128904
10729 128904 140621 155520 164134 219648 288809 387761 435092 547285 736636 901227 1050358
10718 1050358 1160746 1205389 1205185 1164781 1046242 891180 753303 629823 495139 393865
10708 393865 375511 396394 371805 308120 286678 294419 275084 259722 251851 228185 195120 200088
10696 200088 180541 178695 196380 217659 204715 204460 205610 187967 185129 178808 163732 141780 148024
10683 148024 179683 186548 186633 175240 163245 148767 157669 148338 169089 177342 164065 160971 148728
10670 148728 150209 150083 137344 130158 161774 156014 131015 114304 108065 107409 106510 74674 104689
10657 104689 115474 133313 147867 159856 182449 207429 228602 224747 195573 211512 226539 215927
10645 215927 212433 222046 209459 219749 221134 208965 182548 166715 166381 187917 180434 198117 228898
10632 228898 200924 196604 177894 185974 201554 208700 198640 162280 148937 186666 231482 244584
10620 244584 220255 215320 206823 212781 200291 197598 191848 212736 228408 217735 222846 213005 254529
10607 254529 256735 281830 359225 375047 334250 332086 305066 319996 336967 317444 301067 298616
10595 298616 348950 388434 439734 476924 494454 558164 590273 565701 575563 617678 667569 743867
10583 743867 811823 855493 950821 1042740 1143562 1254313 1370380 1531908 1691149 1886677
10573 1886677 2118662 2386484 2745197 3244733 3939787 4918472 6293413 8037496 10140302
10564 10140302 12558832 15180931 17886182 20564545 22953853 24821685 25962976 26373289
10556 26373289 26057515 25103718 23570100 21597281 19372014 17048608 14847939 12919738
10548 12919738 11241390 9843842 8718241 7817594 7133632 6596513 6135856 5745705 5395084
10539 5395084 5113462 4904585 4690472 4490199 4269096 4069464 3919597 3762646 3579083
10530 3579083 3413294 3230630 3030318 2845567 2648168 2460487 2286519 2136823 1999158
10521 1999158 1848601 1702633 1572881 1464908 1386346 1317233 1242302 1165804 1110187 1054572
10511 1054572 973487 906917 848944 786101 717381 670645 664858 637517 602102 566383 534840
10500 534840 514955 490123 453673 408841 375989 356948 339650 348311 338685 336822 344287 345240 320038
10487 320038 266257 212001 197146 183982 201417 185879 184577 173424 179904 166661 139651 125221
10475 125221 122985 122517 132055 109064 81995 90150 107405 88272 76407 84557 87443 80192 81199
10462 81199 59376 55521 46846 24656 16197 41425 76380 74266 44335 41323 40373 15754 -1429
10449 -1429 -15805 -33393 -4527 17838 12366 667 34076 64027 44378 26838 9964 25937
10437 25937 42699 25910 31053 35186 41281 44008 47519 63643 51750 38451 45702 61914 62200
10424 62200 14862 -13880 -18613 3741 33910 35384 50989 46560 60731 67652 85549 64762
10412 64762 40851 56562 67206 90490 103570 99011 84999 74673 50293 19125 19940 346
10400 346 -15380 -15450 1233 25998 34241 48152 23346 16074 28278 52081 9259 -13387 6337
10387 6337 15525 22523 16991 2426 -238 17685 40241 59602 74460 63828 19551 -8287 3165
10374 3165 -5656 -12899 -12449 12502 32865 36703 25139 33065 38240 40820 20524 -1471 -15466
10361 -15466 -3837 6842 -15967 -4743 3599 24278 48090 20885 -21256 -49535 -42030 -45514
10349 -45514 -28062 -15118 -16456 -8830 -35198 -67264 -63063 -53062 -25133 -23532 -5161 3199 -5798
10336 -5798 -21440 -18608 -21313 -32069 -46270 -50331 -33254 -36267 -58116 -63255 -40024 -22535 2793
10323 2793 44642 32353 -1129 -1055 4008 -4246 -8941 -32092 -24241 -12344 -3039 19626 -12342
10310 -12342 -35701 -46407 -36075 -15261 -1441 -20181 -46262 -57412 -46997 -11715 16782 17777
10298 17777 20339 19789 23257 11289 -37434 -39466 2438 30881 18611 2251 13446 -7090 -15131
10285 -15131 -4468 -4616 4120 12406 50843 41757 40746 52507 45864 49623 55316 55062 57034 77351
10271 77351 70450 101444 149724 223055 262599 314436 396793 467307 576502 671780 750377 858800
10259 858800 913868 934207 918671 863166 809727 714257 633252 580321 478536 404574 387053
10248 387053 351427 291222 262681 232713 206583 181407 184534 174084 137190 120747 134029 155005
10236 155005 121787 105111 86477 97381 137776 149532 136427 143659 136595 138986 145046 134436
10224 134436 109435 108549 81046 68899 76003 68071 29225 20271 29212 23407 10484 7919 26546
10211 26546 22627 29212 22037 -8025 -36235 -39687 -27841 3057 9706 30221 33591 60683 58896
10198 58896 24944 -10383 -24113 -26117 -19150 -8344 -14255 12739 28166 -8688 428 15492
10186 15492 -12749 -26908 -7539 5090 141 -12755 7194 37523 47521 42510 49887 44416 9144
10173 9144 20763 44843 60532 73700 56661 72367 85059 84401 78001 43991 51902 53014 57718
10160 57718 88927 110444 152236 222468 267861 266642 267707 299905 286478 276704 259883 246468
10148 246468 200390 179767 164833 157934 123659 92649 85868 88516 90011 67782 49516 53318
10136 53318 45742 21251 29210 56232 50534 44052 60028 50223 31845 37866 45677 42088 44582
10123 44582 14092 -9115 -13684 -30854 -54371 -28634 17730 28046 -522 -5872 21838 25492
10111 25492 13700 17581 32215 33680 15028 256 3786 -25108 -36893 -25713 -58191 -55433
10099 -55433 -37340 -41521 -43245 -25511 -30164 -24806 -37577 -68392 -44771 -13148 -2832 -3106 -6337
10086 -6337 -12971 -53174 -40474 -17668 -12433 18912 23744 23443 50442 34230 39443 25379 32173
10073 32173 41780 21565 30455 25078 22508 9553 15400 14464 29676 32297 -18938 -55082 -55012 -45672
10059 -45672 -6131 4090 -6055 -18786 -13675 -31940 -5989 6544 20839 11203 -10626 -9426
10047 -9426 1148 -958 19230 21560 30102 13982 393 -2088 9881 4251 -33121 -28239 -3129
10034 -3129 2003 -7278 -4188 21178 13659 -17982 -30960 -31711 -31681 -30937 -10288 -28880 -46527 -33879
10020 -33879 -55225 -46090 -38263 -1899 1008 -24958 -26711 2370 -11351 -31787 -33616 4251 25733
10007 25733 -6127 -16872 39223 48838 15074 3235 -15138 -23907 -27084 -36188 -26413 -17924 -10539
9994 -10539 -21040 -13802 -17351 -36190 -49861 -28639 -12413 -8601 16811 27114 7224 15997 24275
9981 24275 30733 34359 -4194 -41990 -63041 -67988 -53654 -31465 -28391 -22264 -37955 -47177 -42623
9968 -42623 -25702 -12339 -5838 -25336 -11319 5729 -678 -21418 -8670 14260 8944 6188 -14398
9955 -14398 -11462 -22720 -20511 -14844 -23865 -35928 -26061 -17980 -35277 -25577 -22969 -27775 -53325 -39257
9941 -39257 -15724 24135 38102 40338 38142 43692 26685 -13421 -9448 423 1963 -885 -26258
9928 -26258 3421 24765 26058 15595 -8262 -7036 -4906 -79 603 -11789 13137 9360 -11545
9915 -11545 9743 26026 -4196 15257 31589 2549 -28234 -1619 16222 5249 -26852 -13790
9903 -13790 -19963 3843 5783 -31579 -53583 -45331 -40682 -51822 -49697 -1217 4523 31936 46577
9890 46577 35874 28236 -169 5854 6080 -2725 11808 -1231 -29433 -17348 -4747 -30914 -40130
9877 -40130 -33114 -34843 -69301 -40157 -8792 3176 -7050 -2616 5902 14499 -1986 12199 20742
9864 20742 32382 31590 7850 -14467 -15985 -21688 -27776 -1302 15993 14812 13949 17752 855 18653
9850 18653 23639 -26874 -39168 -27127 -21496 4375 6438 22162 31210 3013 18311 36387 17023
9837 17023 24499 12945 11951 21114 8341 -7550 -20943 -8883 -5490 8630 15975 21228 8902
9824 8902 -10395 -10715 -17620 -30685 -42573 -40311 -18209 -4147 -16832 -44115 -55644 -20411 11388
9811 11388 10774 -6045 -11149 -23865 -19056 -17843 -5055 7204 -8234 -16892 -29031 -25968 -8740
9798 -8740 -6636 -30219 -33704 -11252 5536 -3194 -7617 -10936 7990 25576 27863 6437 1464
9785 1464 9315 -9803 -35827 -27751 14633 19720 25507 34438 56953 36027 25876 19453 11880
9772 11880 -23030 -33320 -18301 9864 -6811 -32965 -25361 -22819 -17499 -36082 -47186 -29626
9760 -29626 -28176 -3290 -2331 -13449 -6273 -7232 3433 -6084 -62676 -40465 -23607 -23339 -23471 -17349
9746 -17349 -14831 -5794 -5680 -14303 -16099 -6589 22653 29809 -5312 1620 27574 33071 23242 -2483
9732 -2483 -10519 -4387 8296 2271 -8681 -12992 -219 -36612 -39941 -39361 -62415 -52144 -44614 -38663
9718 -38663 -32194 -16205 -31156 -50185 -14682 25507 36689 24093 5514 -12942 -30939 -40789
9706 -40789 -45905 -40663 -35398 -32446 -18045 -29282 -13078 4120 42239 50644 15962 -11934 -13732
9693 -13732 -14875 -37815 -36184 16270 48654 40072 36466 29463 9052 15202 6996 -39597 -45871
9680 -45871 -56176 -51198 -57347 -54766 -40187 -11594 -3252 -3079 21600 16410 11440 31883 34818 24094
9666 24094 17440 21690 19864 12665 21293 4920 10240 36203 45365 50916 43734 23496 23690 28142
9652 28142 51392 46334 8394 13260 18637 19423 40820 50887 36744 -9696 -8377 -4936 -6391
9639 -6391 -28127 -55541 -63161 -34889 -12424 14554 6363 32673 85582 76191 36307 44165 50780
9626 50780 43834 44203 26830 34388 18697 5629 21653 27225 4627 -891 1533 -15287 -35894
9613 -35894 -42734 -28446 -37055 -46241 -63887 -49555 -40900 -43190 -12938 36993 25947 7919 12072
9600 12072 -12398 -13933 -7843 -9261 -7574 1507 1604 -3403 9697 17103 3273 32923 20645 40208
9586 40208 54137 35560 55320 57309 38926 39443 17936 0 20134 11449 -5605 -17665 -39155
9573 -39155 -33271 -57357 -42745 -50628 -39615 -34382 -47571 -68923 -37345 1356 60034 79722
9561 79722 36780 -9388 -26013 -32224 -25977 -4528 5494 21927 10687 10708 28348 16353 22807
9548 22807 44980 76469 47014 14103 27094 43283 20896 12728 32352 64145 76165 74740
9536 74740 63106 43372 52337 35492 27442 9385 504 1491 7171 -6862 -21764 -36669 -17985
9523 -17985 6784 -1674 5045 1027 3712 471 -1857 21659 28889 10981 15173 32674 47588
9510 47588 28035 15648 4390 -24667 -10984 20754 70516 73847 42507 51481 42513 51108 58251
9497 58251 40288 -9057 -23647 -48102 -39060 -12649 -1486 22866 20606 -8021 -5917 -209 15004
9484 15004 34600 35460 32917 57700 63931 46036 8343 3876 30486 38242 29777 33770 9126
9471 9126 -8723 3734 20087 24014 15545 21743 25821 31104 26772 22228 8824 21286 -6362
9458 -6362 10525 51959 73246 70642 42282 27817 40112 43834 35047 2181 -8933 -20499 -16075
9445 -16075 16867 10509 9315 18176 38029 37800 26907 17550 18288 53900 47216 4071 767 22846
9431 22846 26715 28366 39643 40736 18940 -13221 -22139 -19802 -25466 -25782 -3895 -8650 -5905 17178
9417 17178 30213 26950 24963 23978 31538 6579 6723 27304 23334 19731 20729 27157 16934 13173
9403 13173 28450 25191 11633 8948 15039 37871 58767 50287 22952 12568 15019 57946 78590
9390 78590 44275 30255 20381 5707 -5695 7995 24690 30734 27065 40220 52112 32173
9378 32173 11596 10841 40033 41844 57864 44119 58646 58876 80765 63469 61313 67399 92601
9365 92601 86773 85960 98612 84919 47294 54128 69879 93274 84235 63777 47050 70570 79647
9352 79647 64276 32766 34478 16721 19630 63936 82161 80961 88375 70567 54565 81967 112813
9339 112813 89205 88976 53940 -7497 4487 17863 4864 7986 36693 44021 49041 50773 44384
9326 44384 34153 35369 30445 20673 40034 45834 13409 19766 13551 29849 79925 87302 66841
9313 66841 85720 98777 126800 114144 79441 78885 83597 89111 52161 55788 56883 47781 25816
9300 25816 34591 39751 49412 65857 56145 43313 37208 30895 32566 38136 44391 79798 108258 111078
9286 111078 145487 156540 144245 91883 45226 50104 63881 63361 73384 83210 50052 52327 63673
9273 63673 57884 65648 89383 137196 145392 126154 135795 135624 145157 146528 163593 149260 125819
9260 125819 134526 140822 140969 142777 149775 147847 157411 156053 129681 119286 119144 129853 164168 179382
9246 179382 170431 175878 190702 177884 161095 188844 184261 169220 156605 156436 166917 178084 211815
9233 211815 209363 210715 203765 228723 233253 205424 181962 175503 181143 162577 159558 175040 168763
9220 168763 167028 141805 140808 171231 209751 225478 224613 206155 217928 213241 222741 223807 234774
9207 234774 254126 244004 218176 235423 241650 238525 265390 275135 277934 287304 282308 307933 290091
9194 290091 283271 284801 268046 270627 309288 323906 340826 354534 395511 392097 364771 367617 365439
9181 365439 390507 398353 394392 384089 389306 392789 409779 433965 452806 423311 433391 438431 450670
9168 450670 447298 469009 508756 537852 530596 507593 490250 497590 519554 540552 554114 576849
9156 576849 607603 608136 590792 607115 632010 673133 667784 660361 671744 684972 672920 659658
9144 659658 706167 767733 835734 850820 879698 919369 925435 914508 895775 896509 920028 953266
9132 953266 984178 1001020 1013078 1043003 1073153 1095602 1100912 1130833 1134887 1134335 1118493 1103007
9120 1103007 1114126 1146805 1170029 1164224 1167470 1194705 1210494 1184955 1177887 1173584 1162775 1151247
9108 1151247 1154987 1168518 1201043 1168851 1173037 1205453 1220265 1197102 1156220 1134155 1102719 1086121
9096 1086121 1090676 1087302 1080765 1049089 1034081 998787 969698 954681 920905 900467 923526 911987
9084 911987 916903 920799 895541 860269 806634 769576 776132 764483 762889 755581 741450 733281 703671
9071 703671 679952 623373 613553 618276 623490 600211 581614 566435 557920 542720 538901 542781 555326
9058 555326 545900 536046 524493 506984 484320 471285 482361 489347 457115 405321 397729 398866 402561
9045 402561 409982 382537 346573 354527 337027 320204 326994 320988 294388 304658 290759 308561
9033 308561 333289 348780 327605 309017 306659 319576 311948 293150 294044 300576 270409 213721 224825
9020 224825 255090 257173 263989 245186 215999 195347 205272 203618 199077 168248 157522 194198 213264
9007 213264 217396 207298 177141 138601 126187 109748 117389 114454 82567 80012 77390 110459 82186
8994 82186 54884 84631 117120 140432 145028 158870 178736 162640 130099 127609 146469 143516
8982 143516 159550 154550 125540 72683 84326 98965 92811 103421 95940 82735 68666 63876
8970 63876 95294 135929 113203 99280 92332 99547 117958 120261 122903 101561 80403 89014 79965
8957 79965 97049 118565 128057 121300 89077 103214 106803 109070 91931 88865 67303 76186 87064
8944 87064 95888 79783 93848 113323 91337 72225 81600 74985 86903 89594 93181 73120 74560
8931 74560 59837 51204 70270 85803 79724 59708 61910 69599 94314 98198 109790 116197 88618
8918 88618 90466 90822 84182 90218 64084 56837 56149 49936 44855 23969 23408 33085 62447 70709 63333
8903 63333 53682 26236 19977 20045 28744 15360 28361 47371 76276 63368 57195 64626 56132 66522
8889 66522 57245 39199 23330 24121 3906 12710 43633 37058 39563 76281 108211 115328 87244
8876 87244 86092 77993 80670 114869 132997 130214 135342 118427 115177 95332 55915 10815 -2666
8863 -2666 18001 10612 11395 -5919 -6208 830 8313 20056 28246 25018 12309 -3370 -1504 34813
8849 34813 53211 34400 22436 62427 88607 87346 79695 72220 53469 30126 -4408 -13454 21904
8836 21904 66109 91055 74866 45648 34858 40643 4567 15474 65426 84359 92787 66101
8824 66101 8030 -20613 -22124 -11813 -33372 -9295 -25072 -38001 -16762 -32123 -35110 -17653
8812 -17653 -10876 8399 -7488 -16149 -2068 13359 25454 15394 26166 18788 -118 -41921
8800 -41921 -35778 -13453 31192 41707 50842 48723 55918 42027 33295 39665 37207 28597 23884 12791
8786 12791 -749 -20780 -19845 4773 13003 23144 33022 50426 23796 1485 21124 10403 6326
8773 6326 3433 -194 21850 30055 7103 -25285 -33504 -3986 16419 -8802 -25392 -38061 -53197
8760 -53197 -52216 -22819 -19414 -28672 -15993 21437 44559 35563 3868 -5697 -31139 -21870 -15287
8747 -15287 -23269 -59306 -68673 -32209 25332 47792 57710 61644 69729 66391 64996 53424 82868
8734 82868 101767 87684 52333 29999 48594 49099 44413 50255 53119 39918 33179 32499 77553
8721 77553 84865 110401 124632 143540 119946 118972 118039 117904 79144 47672 73781 105184 76663
8708 76663 46380 32320 10715 8431 7375 47677 39723 10259 -4984 -5576 17433 11041 6497
8695 6497 15079 -2000 -24080 8085 26302 42648 56011 45092 70125 78559 44344 39610 31326
8682 31326 39170 27747 30176 14518 25454 64473 89750 80048 56542 57842 76398 77199 91148
8669 91148 74916 51095 46958 35150 37958 40330 13790 8094 28031 56637 62864 80262 72324
8656 72324 68709 88627 77041 43402 -1637 4889 11003 31499 39082 49066 54282 39148 51679
8643 51679 55128 100718 129818 105266 99630 108947 107531 104832 120931 124316 103458 82870 96371
8630 96371 126935 112077 95180 76731 56520 49224 91945 109344 132912 132736 117463 122459 117620
8617 117620 100872 109114 104071 86209 94341 95161 95712 115355 112536 90540 87183 95704 106913 106893
8603 106893 80673 48007 46335 94323 127035 158578 182305 206425 208153 192331 214088 229361
8591 229361 244196 231180 202545 195303 193204 193496 169549 147488 144622 116500 83829 100207 98185
8578 98185 100501 93826 97761 101080 93655 120451 124202 128582 111570 102270 79057 82739 60265 55425
8564 55425 68385 74298 58028 60003 50261 50129 63819 65670 88506 92375 76556 62256 46918
8551 46918 42123 26439 31109 33124 39786 54707 59417 25974 15880 22996 38731 56111 26498
8538 26498 -5504 -11583 12823 52818 48067 37057 26874 48730 57870 64966 57885 28146 21954
8525 21954 44166 45797 25515 12439 23971 48461 40985 40461 24161 10834 44759 37991 11975
8512 11975 31403 34564 3855 4228 30545 38015 19810 1596 -1931 -3464 -3171 23734 51162
8499 51162 38539 24191 31021 21826 27756 19908 -4338 -10853 13303 39071 25766 -14607 -2310
8486 -2310 -17876 -27763 -29981 -37905 -24556 23710 40740 40647 39887 29950 32347 34746 52923 30100
8472 30100 8746 17267 24021 18426 -7935 -39546 -13635 8436 3160 11000 52907 36502 16289
8459 16289 21458 21137 28913 63448 57200 27270 5348 13016 11532 18912 9773 4224 9526 -3571
8445 -3571 -17943 -6988 6611 9682 -1406 23879 53897 48942 33758 17718 32913 36867 22778
8432 22778 12424 1118 -11098 -8123 -9155 4672 -989 -10276 -6661 -287 -205 3044 -12159 -5864
8418 -5864 -4381 -10268 9170 12849 -18555 -24891 -2309 27961 24707 44027 44362 8478 10606 6856
8404 6856 -28064 -47777 -27019 -29044 -22848 -16717 -29698 7019 21373 13917 18299 14264 -16019
8391 -16019 -21360 -9801 803 3155 -4407 -6094 -32025 -49948 -28510 -64163 -47883 -39818 -20716
8378 -20716 -3227 3971 3798 -10507 -35602 -28772 -21683 -29602 -66453 -70405 -25264 -13146 1514
8365 1514 1857 -23555 -24162 -13060 -5071 6500 18635 13864 2556 -252 -14598 -20088 4613 -248
8351 -248 -1723 -4859 -43381 -44296 -3837 -1203 -9497 -28003 -30697 -9726 -15486 -38235 -15542 -10802
8337 -10802 -42483 -49403 -41330 -33261 -45259 -21828 -1433 16928 22124 33915 2235 -9520 -2698
8324 -2698 8785 20135 15023 -1899 -31728 -20868 -9926 -1449 3240 -10905 -25346 -14086 -4147
8311 -4147 -31543 -45126 -40145 -31026 -21792 -16560 -26556 -33915 -34551 -27011 -6804 -20773 -53699 -38747
8297 -38747 -27107 -1305 -167 3286 14837 6427 16857 828 -12155 2340 -7871 -29675
8285 -29675 -42761 -48720 -23016 -9768 18122 8728 -15161 -47216 -32399 -28567 6708 13564 5372
8272 5372 -12257 -23597 -6668 -8321 26795 21329 2260 -6681 -1996 -8737 -13158 -42501 -63865
8259 -63865 -79201 -69751 -18116 -11046 -26699 -33254 -17079 -5965 20827 46622 73230 67729 32726
8246 32726 21160 16523 14657 42167 54017 20986 231 20788 7667 -2626 6846 24639
8234 24639 11037 24816 22038 50495 24169 38143 37806 34464 17190 17262 -14396 -966 -11082
8221 -11082 -12949 -28624 -23166 -21567 -3057 -16938 -66089 -76871 -49806 -12034 -13520 -24795 -45888
8208 -45888 -52824 -17056 4348 -8983 -13461 16846 24074 15436 -10687 -30145 -28688 -16028 -5198
8195 -5198 -24164 -28096 -5130 31608 34006 44041 78785 58410 34360 10615 556 -20043
8183 -20043 -52835 -80991 -51959 -16560 17591 22672 7310 3660 7403 1659 2107 -23768 -11370
8170 -11370 -8551 -56633 -53862 -41995 -58590 -76359 -27804 -34264 -41577 -44186 -46760 -34842 -505
8157 -505 -7872 4564 11594 28018 42413 25973 6772 -934 4793 12386 36858 42253 21965
8144 21965 8995 2867 34549 33745 23744 2191 -22860 -15438 -13697 -11640 -6202 -6288 -25089 -40496
8130 -40496 -34924 -36793 -17165 22124 29586 7194 14532 34634 33339 8877 -16566 -28029 -33449
8117 -33449 -45748 -51382 -43751 -35315 -8489 5075 10881 17315 43919 36283 28389 26751 29808 24614
8103 24614 -5239 -1601 16847 12047 12185 16414 7212 -9006 16918 23441 36301 -5534 -24818
8090 -24818 -39681 -8750 17126 21577 3959 -18841 -4567 15194 -12471 -2664 9347 -6030
8078 -6030 -7020 -6889 -9121 -12624 14778 22456 30329 52943 35081 -19547 -54799 -36463 -21993 -30934
8064 -30934 -31256 -3257 26709 -1559 -7411 -5005 -20486 1104 46612 67789 33905 17959 20520
8051 20520 38718 35852 38441 10092 -22315 -10119 14062 32345 29072 24596 16932 8445 -2880
8038 -2880 23344 51501 46370 39582 54969 76719 82467 77229 65006 16699 3144 5633 -10020
8025 -10020 -7889 9545 24768 25960 6685 6372 29826 35588 41699 32968 27595 47466 35655
8012 35655 12527 31029 32270 32074 39039 26540 673 -6185 13875 33864 29489 9690 39117
7999 39117 57780 47612 34104 52944 57682 53991 65258 60294 9213 -15373 23683 33156 24584
7986 24584 26710 6761 -2632 -2941 19816 36902 53946 60337 65621 62701 47945 46087 19417
7973 19417 7857 24701 55133 66145 60503 51199 43283 45151 55222 40118 14282 26759 31120
7960 31120 28136 63424 53768 64502 67962 49855 31687 54964 70315 61234 48768 44062 49645
7947 49645 51247 74324 85908 91276 83091 82599 75869 52919 58263 71764 46083 11166 12484
7934 12484 35379 31739 6684 23923 54510 55056 47363 29745 37899 42055 28840 17009 20275
7921 20275 40921 49850 29854 -13101 -2364 25764 57019 55754 65532 89406 77104 37280
7909 37280 11474 16882 36747 34532 33764 7053 6668 -77 -4409 -3402 15410 43974 41428 42283
7895 42283 44756 79747 80555 69390 56753 26322 13436 45602 66671 47878 46446 57716 36114
7882 36114 17025 -998 -10396 -10330 -2711 -20346 -27435 204 -1269 -37127 -16919 142 10456
7869 10456 26118 40909 30758 8797 10626 8590 -8815 -17620 -29193 4080 -4976 -31528 -49247
7856 -49247 -25934 8431 16348 3010 9012 9567 22081 26664 27567 25594 47263 49736 26631 5772
7842 5772 19627 10689 -6320 -15990 -25774 -36738 -19631 -11556 3858 15812 -3030 -18404 -9293
7829 -9293 -5835 8629 -3002 -45212 -43585 986 45538 48504 22519 1459 -3650 -1748 -27687
7816 -27687 -31654 -7357 -2535 14664 20211 17760 21483 6828 -27521 -46002 -27895 -19477 -17960
7803 -17960 -38533 -41300 -11644 27824 52240 2426 -3010 30886 66941 43393 739 -5207
7791 -5207 -380 6265 14124 36060 33207 10055 654 9713 37005 36917 35227 13767 -14144 -7464
7777 -7464 1135 20546 13393 10703 5593 -18057 -47432 -36317 -9813 -4038 -23091 -44754 -28593
7764 -28593 15073 3170 -13718 -15995 -23919 -38888 -36570 -40808 -17639 -13129 -46411 -53482 -40567
7751 -40567 -24343 -9706 -45970 -67624 -65711 -48708 -27730 -7205 -16327 -13453 -28953 -21295 -19821
7738 -19821 -51399 -46109 -52224 -77915 -72079 -45296 -49687 -47082 -63072 -61922 -43173 -28615 -31489
7725 -31489 -28745 -16906 -26555 -61368 -48033 -33649 -12751 -28167 -56232 -51634 -61142 -51160 -62398
7712 -62398 -64881 -38477 -38056 -50971 -43048 -31482 -10200 25591 28816 4585 8710 -7430 -19884
7699 -19884 -17428 -40985 -63610 -54493 -37938 -19699 597 7945 984 5213 25580 1057 4654
7686 4654 25794 25890 12937 3465 11387 -3338 469 1535 -9304 14416 26243 -7211 -24370
7673 -24370 3118 482 11687 18873 7897 21806 25452 -1359 -31673 -23112 -226 -1953 -2901
7660 -2901 -26301 -36271 -51363 -36808 -25268 -35072 -31503 -9571 -4809 -12717 -23196 -10223 -14616
7647 -14616 -35839 -51355 -39739 -24202 -37278 -29369 -29749 -35893 -17835 -5285 1362 -656 -2691
7634 -2691 2818 -1408 5361 4864 26993 11173 7885 11854 -12365 -24361 -22203 -8676 -9689 -38942
7620 -38942 -74453 -89995 -93813 -86259 -58282 -18696 10306 -5389 -22863 -2495 1426 14949
7608 14949 11753 -4230 -20477 -28645 -28159 -15840 1347 12828 -1236 -38775 -62487 -64525 -53774
7595 -53774 -44237 -43612 -16500 19314 33834 23639 23696 23486 18973 6442 -22317 -23627 -32567 -17750
7581 -17750 -12231 -18027 -2843 4328 31011 14015 -266 14451 14178 -4803 -7679 15080 -17031
7568 -17031 -41961 -24125 -20253 2482 4146 7374 -4808 -11355 -18603 -12660 -28784 -42873 -18842
7555 -18842 -25337 -47687 -35247 -36155 -39855 -23932 -30950 -28756 -26133 -22727 -40058 -47737 -33148 -562
7541 -562 11258 -6077 -1717 -19029 -10872 -16942 -24725 -13106 -5783 5979 17764 20875 6057
7528 6057 -20465 -24497 -20901 476 5093 1765 -8606 -18413 -18308 -30492 -31189 -12363 -4660 -22048
7514 -22048 1100 -5407 -5197 16309 15512 15067 36368 51725 31508 29455 42304 37162 14003 -4887
7500 -4887 -8953 -36708 -55377 -33101 -42964 -48401 -38369 -4790 23592 14785 -8397 14741 4678
7487 4678 -1104 -17134 -32642 -46384 -43211 -38617 -49658 -64341 -49889 -21064 -14729 -37659 -62165
7474 -62165 -53243 -61479 -57205 -42703 -33194 -26204 -17454 -37816 -51627 -25442 -36793 -47911 -36829
7461 -36829 -21019 -6586 -20788 -50268 -38800 -30135 9955 -2383 -18568 -32995 -29802 -33452
7449 -33452 -52282 -61002 -68885 -44952 -41172 -20814 -4854 -8341 17151 11128 -11538 -16399 -13502
7436 -13502 -422 -3902 -15826 -15234 -33730 -37937 -11130 -19037 -14754 -940 -19248 -9731 28021
7423 28021 39294 49385 63917 77125 42497 27330 42706 40450 32586 -13098 -44579 -11050
7411 -11050 -15614 -15468 -26283 -41800 -37820 -52443 -62192 -43816 -49208 -50447 -21781 -20713 -13933 -878
7397 -878 17008 20381 21387 23172 17709 -25264 -39151 -12138 -2421 -7406 -7697 -3517 7463 645
7383 645 35381 35907 38064 25761 7516 8692 -9268 -19960 -22090 10703 42451 54794 57247
7370 57247 38896 8027 -12261 -22116 -20904 -21059 -30505 -17241 -9432 -13302 -4740 4160 14629 12969
7356 12969 672 -20631 -5560 13658 -3226 -26113 -22290 996 -6106 -17223 -24342 -26406 -15537
7343 -15537 -21267 -4994 -7027 -21188 -28564 -40558 -59959 -57292 -43408 -28800 -45227 -62000 -46488
7330 -46488 -30836 -33157 -26830 6990 24943 6841 25006 39660 34644 4324 5947 3867 21737
7317 21737 -286 -47243 -67974 -39517 -77 18575 33372 40958 23922 4524 -271 -17072
7305 -17072 -23494 -7490 -2720 -29963 -35502 -7032 -28800 -22781 -18752 -2535 17382 9046 -4832
7292 -4832 17277 31101 22763 -11493 -21923 -23293 -26793 359 -876 18853 39629 27733 3392
7279 3392 -11821 -23773 -20891 -20081 -2955 14407 5029 478 3959 7611 9625 -8727 -11700 -10878
7265 -10878 -19138 -15034 -25836 -50989 -49822 -48717 -62906 -58583 -23318 -20104 -14147 -4831 5472
7252 5472 -8384 -23139 -58261 -46377 -38374 -48261 -59254 -54069 -23151 -14972 -9232 -28304 -63594
7239 -63594 -59470 -59188 -47457 -51809 -53084 -56354 -66310 -33263 -9990 -24974 -53443 -34511 -19016
7226 -19016 -43424 -55827 -35874 -22843 -17933 -25631 -55586 -25120 5161 26538 18819 4666
7214 4666 -23480 -14516 -4925 11034 35031 28120 -975 -16039 -7563 2525 -13472 -23955 -19858
7201 -19858 -1538 10435 5964 -14969 -28903 11076 14171 -33604 -41249 -3517 -2167 -4329 -1496
7188 -1496 -14147 -7798 -18403 -22390 -29919 -31163 -33291 -31627 -21898 -31808 -24079 -22711 -33303 -29427
7174 -29427 -36121 -37436 -24786 -11587 17713 14445 -13138 -14367 -8814 3989 -15081 -26316 -16021
7161 -16021 -17541 -8033 4822 2277 -22530 -25528 -54870 -29920 -23938 -32402 -5041 -23648 -30920
7148 -30920 -45875 -39865 -39727 -53970 -60957 -37876 -2335 6894 13801 165 707 27435 64950
7135 64950 57216 28246 -5631 -5315 -14347 -19937 -32844 -23982 15388 28154 17661 -11428 -25291
7122 -25291 -13862 -29661 -55356 -40555 -28436 -11622 11042 32028 24242 10111 13716 17639
7110 17639 8983 3058 8290 13101 -4394 -20880 -8941 -11760 -3039 1719 4469 5555 12731 37286
7096 37286 -6339 -28272 -10368 -24970 -27274 -24326 -31149 -31787 -11464 3590 -14757 -13050 -13929
7083 -13929 -26463 -37295 -55821 -44514 -9923 15805 29735 27018 39418 41624 13527 11297
7071 11297 7509 13535 22033 17137 4932 16898 2019 -14416 -37077 -40506 -43398 -31736 -16184
7058 -16184 -5490 25559 27271 35688 24388 33597 36252 28476 36858 30179 22929 7370 8275 23709
7044 23709 16556 28374 16919 -7854 -22223 -37406 -19381 -2097 -20328 -41309 -29021 -31253
7032 -31253 -43577 -37971 -63959 -72697 -69588 -48603 -18936 5406 20066 51785 32421 -29785
7020 -29785 -80389 -58747 -39265 -46241 -26397 -21749 -9104 6585 4252 4193 -24016 -20164 -9984
7007 -9984 1481 -1864 -13504 -36253 -13952 8147 5461 25672 24813 9253 -9152 -426 1874
6994 1874 -2171 -1756 -17072 -25147 -13559 -33533 -50975 -39849 -36734 -20717 -7333 -38322 -67977
6981 -67977 -70504 -35899 -34308 -57668 -58865 -40957 -16459 -35710 -22392 -8551 -8170 11222 5967
6968 5967 -2471 -23822 -29905 -44339 -31188 -19012 7750 4915 -2072 -12779 -42943 -57833 -37776
6955 -37776 12337 2195 -10577 -12344 -17534 -6396 24972 31063 7489 -27542 -82006 -89149 -74199
6942 -74199 -54519 -26648 2920 33063 18756 8586 -29259 -20388 12183 18711 17915 10626 4707
6929 4707 -9054 -11780 9247 27784 17650 -19828 -33546 -38222 -26086 -11682 16243 12744 -2368
6916 -2368 -11791 13861 3580 -32552 -12506 20174 27304 36613 35852 2087 17243 39480 31456
6903 31456 7348 -5800 -4868 16538 46398 61366 22980 4641 3550 1787 8821 41731 33847
6890 33847 33146 24414 367 -15403 2332 20946 26371 31260 26124 2052 -622 1420 11889
6877 11889 6526 11607 35848 26627 21523 -2626 -14229 -32892 -45233 -50162 -46671 -34858 -30296
6864 -30296 -39185 -34904 -27036 -26230 -28023 -105 13915 27038 53756 49804 35603 15904 12546
6851 12546 -27089 -34241 -30694 -24950 -18492 -22781 -6839 14096 -12727 -11108 12238 -2410 -19053
6838 -19053 -36037 -20525 -11391 -4094 10539 4647 15402 20851 3920 -54309 -34265 -25931 -9656
6825 -9656 31207 31868 26337 28162 25275 32691 15542 20235 9391 9730 31691 34272 30959 8110
6811 8110 -50424 -87199 -92700 -34383 -1981 -23342 -38214 -70789 -76550 -75423 -78653 -72804 -64702
6798 -64702 -38698 -13987 -18715 -47876 -50790 -27685 -8076 21988 52510 53610 50191 49418 39787
6785 39787 30044 17161 24217 48265 54520 55783 20531 7754 -28476 -46167 -34487 -17949 -37137
6772 -37137 -36863 -51668 -44392 -40960 -39538 -31124 -9654 -12614 -9241 -12013 10387 30115 53854 23183
6758 23183 21100 42579 52328 47417 24893 -11431 -27835 3785 19247 21565 32898 37750 41126
6745 41126 27117 21944 3998 -20316 -4783 14858 30182 46216 70801 97369 119553 111968
6733 111968 105041 120757 136204 141912 121085 129949 124160 118852 143761 129567 143546 165395 140198
6720 140198 131107 158143 154074 131573 84919 60499 66333 54503 35877 50049 77128 64871
6708 64871 47912 39660 45046 36407 39279 38569 50504 68251 77483 77369 70068 56421 57582 34710
6694 34710 40200 32669 11527 7873 -4490 3298 20142 32908 -7049 22349 4804 -14857 -50935
6681 -50935 -64873 -52229 -37928 -8758 2170 10926 29111 43088 4619 -13237 -7721 -25348
6669 -25348 -51952 -18043 15214 30139 24274 17621 30335 33009 42422 21543 8995 8527 19066
6656 19066 17867 16364 3980 29074 42391 32742 16471 33190 28729 12586 27566 24493 26182
6643 26182 -5860 -17830 -34753 -18708 12530 9737 25168 31839 34938 39824 34020 11162 11093
6630 11093 16508 18379 -25601 -42812 -36698 -51826 -48470 -32847 -19376 -15374 -27754 -20154 -45758
6617 -45758 -37875 -37997 -57818 -58429 -45864 -31837 -54302 -42660 -15865 1951 -3278 -4625 24694
6604 24694 50750 54122 12189 -21155 -27404 -25896 -52486 -55948 -27183 -20020 -39456 -24598 26299
6591 26299 47528 56838 72253 36135 7652 -3243 -7234 1548 -2737 -18330 -31510 -33142 -17572
6578 -17572 -12783 -17346 -14982 3260 16308 -13239 -22273 -47383 -56565 -39328 -16004 -4272 -3772
6565 -3772 5001 6731 17448 -315 -24 6632 10678 5261 -3621 -9600 -12659 -23112 -55796 -63098
6551 -63098 -76998 -62857 -43228 -1082 24735 21130 11733 26525 16407 3375 9085 17956 12046
6538 12046 -8013 -33707 -17739 17835 34658 14241 -10721 -15794 -11420 -998 -10073 -37116
6526 -37116 -29062 13939 15533 7986 13234 16932 22564 23486 8641 10374 13559 -19834 -12990 -14431
6512 -14431 -28759 -25858 -12269 -8717 -17097 1128 26487 20480 41763 10832 -21586 -23232 -3851
6499 -3851 20918 1257 -15127 539 21259 13470 16210 2316 -31528 -37766 -39758 -43341 -43652
6486 -43652 -40175 -18554 -14290 -16442 -23280 -35388 -28882 -802 4 6508 19847 10406 14206 -4907
6472 -4907 -13468 25205 24827 12262 5123 -14136 -34095 -40693 -30710 -5526 13702 -8744 -35831
6459 -35831 -33133 -10538 -6443 -16761 -26485 -19862 -11311 -8265 -9545 -7325 -3641 -11999 -18382 1132
6445 1132 -13794 -30150 6174 14144 16746 -18286 -33270 -27053 -59034 -74508 -84031 -75106 -32010
6432 -32010 -39131 -9434 8628 31857 34273 7447 -12027 -16660 -7791 18004 15122 -9651 -36383
6419 -36383 -10282 26721 34175 34915 -3106 -32759 -35530 -15285 -29393 -42598 -15619 9091 6680
6406 6680 4608 24121 54392 53811 46366 24967 29705 61526 46409 35703 8734 -12675 15155
6393 15155 29179 17200 -14762 -27327 -60622 -80829 -67247 -32757 -15646 -41499 -36213 -23824
6381 -23824 2334 -10822 -19634 -60191 -45994 -18853 -11051 21087 23712 24559 15544 6162 -2812
6368 -2812 4622 -13294 826 -12820 6508 -13064 -27678 -35990 -24834 -45586 -37844 -26690 -5873
6355 -5873 -22300 -25957 -128 -9106 -21398 -30858 3867 14072 31949 34378 43109 26517 11296
6342 11296 8622 12829 31179 37375 26444 -18531 -37788 -25881 -17281 -2676 2804 -10619 608
6329 608 7824 27951 15399 5919 21062 38483 40134 33032 15607 -40337 -53306 -10954 12869
6316 12869 3676 31204 41149 15628 -4079 -5361 -13574 -21361 -32422 -21261 -25884 -39755 -45145
6303 -45145 -31372 -8515 -28849 -52329 -32280 5459 4703 -31462 -43584 -31525 -24542 -25766 -19685
6290 -19685 -20192 -14677 -15260 -5232 7431 -12851 -8912 13520 36106 29136 35659 3609 -827 19952
6276 19952 35347 30079 41059 19510 6133 -9036 -31787 -51083 -37371 -23436 8137 1426
6264 1426 -15828 -51807 -25395 18426 33864 6271 8560 -7082 -17167 -22128 -10241 -15194 -18376
6251 -18376 -29183 -27591 -25882 -45058 -26122 -22298 -18441 3020 7277 -21770 -20541 -18557 -3100
6238 -3100 1273 25961 50765 29134 -10229 -14643 -8110 10289 -3804 -39989 -56489 -33654 -12544
6225 -12544 19309 7353 5860 29851 61578 56938 17633 117 -3392 4500 -8582 -18959 -3592
6212 -3592 6109 376 -22375 -20745 -5825 5120 7930 -3617 -12323 -23398 -19182 -22121 3590
6199 3590 14464 -1206 -13255 -1236 -43520 -33791 -36153 -50659 -41738 -46436 -74501 -76147 -85194
6186 -85194 -48558 -23598 -6837 1532 20754 21048 14583 19956 39005 44203 10585 -4375 -38865
6173 -38865 -20943 11108 12231 -10480 -36924 -41455 -26072 -23047 -2980 14621 -13267 -52849
6161 -52849 -26732 9604 -10829 -13909 -10738 -1514 -8518 -59335 -80630 -62145 -54788 -15106 7092
6148 7092 5310 -15482 -32800 -2285 -1702 -9513 20184 38122 26645 -18021 -31124 -22466 -24160
6135 -24160 -11957 -7214 -13575 -25592 -47691 -49142 -23660 -5462 2920 294 8204 1114 817 24801
6121 24801 34000 25463 -855 -17062 -34920 -27910 -7162 -34914 -46670 -75178 -51836 -46101 -63065
6108 -63065 -73365 -68610 -60928 -41847 -51664 -49932 -36898 -30363 -24827 -1722 2134 -19374 -27988
6095 -27988 -6591 36855 26920 17406 9115 1620 -25537 -46324 -42496 -64923 -36690 -2222 26476
6082 26476 36431 17040 4702 -19865 -25663 4098 24390 21499 6913 31319 35088 29510 24231
6069 24231 24884 11766 -18344 -25164 -31384 -21116 -40422 -45240 -30961 -24602 -103 19640 32110
6056 32110 26400 10566 -6431 6119 -1277 -17465 -17795 -32422 -38605 -27781 11188 28359 18277
6043 18277 20798 26554 -3193 -754 6029 -1436 -11569 -41085 -55899 -50598 -41878 -54955 -51453
6030 -51453 -31707 -28492 -31079 -18501 -19398 7763 45496 54395 26828 10589 10693 -2055 1374
6017 1374 24905 47523 24155 23021 22346 25374 9226 2111 -23505 -58779 -54307 -24870 -1525
6004 -1525 33048 38797 28004 15356 19482 10483 -220 22032 29568 -5059 -35367 -39680 -36395
5991 -36395 -35709 -56749 -28354 23152 46298 14850 -23315 -42134 -10970 8491 -5589 25403
5979 25403 18002 12495 20685 -28601 -42140 -17877 7521 22178 34379 12762 22303 23606 10192
5966 10192 -4452 10591 31170 57688 57349 49409 28775 25083 17774 25981 27549 3845 -5420
5953 -5420 -7000 -22554 -24225 -23039 -16987 -18950 -9392 -12378 -22164 12013 44872 26332 -17371 -26246
5939 -26246 15116 30866 30009 11350 3248 7123 18688 10517 31242 26551 19390 -9278 -30223
5926 -30223 -35671 -44216 -10713 14746 7673 6249 23103 27382 1377 -212 2455 18750 15436
5913 15436 16940 10373 17078 32195 31053 356 -9479 7677 1712 8069 24263 27850 31668 -3856
5899 -3856 -26295 -51688 -65168 -47366 -25064 -33223 -24060 -916 9292 -10326 -19954 -19105 8861
5886 8861 24678 1997 -14142 -25845 -53068 -27300 -13767 -5455 20930 19302 -4332 -22543
5874 -22543 -33104 -27330 -32919 -26085 -35506 -31744 -12412 15942 11348 7544 -7394 7166 17697
5861 17697 9785 11694 25198 15776 -5223 -16402 -12146 -21444 -39779 -44226 -20792 6361 -2760
5848 -2760 -2635 21337 41155 43935 11243 15000 15028 -5777 -20638 -13301 -3617 28192 45193 44963
5834 44963 3700 -32029 -29439 -27236 -24649 -26359 -3713 -24259 -33889 -18569 -10284 -6872 14983
5821 14983 11048 8726 28899 29744 20500 7828 -1049 15940 24719 12931 -4987 -23021 -36045
$$ [...]
##END NTUPLES=NMR SPECTRUM
##END=
