##TITLE=Analysis number 311510
Compound Code cc 01963
Book Reference 350/23
Project Code qc-cat
Chemist Name chrisr
##JCAMPDX= 6.0         $$ Bruker NMR JCAMP-DX V2.0
##DATA TYPE= NMR SPECTRUM
##DATA CLASS= NTUPLES
##ORIGIN= Bruker BioSpin GmbH
##OWNER= NMR
$$ XWIN-NMR		Version 3.5
$$ Mon Jul 11 09:31:50 2005 GMT Daylight Time (UT+1h)  MAYBRIDGE\NMR@NMR_250MHZ
##.OBSERVE FREQUENCY= 250.131544655141
##.OBSERVE NUCLEUS= ^1H
##.ACQUISITION MODE= SIMULTANEOUS (DQD)
##.ACQUISITION SCHEME= undefined
##.AVERAGES= 16
##.DIGITISER RES= 18
##SPECTROMETER/DATA SYSTEM= dpx250
##.PULSE SEQUENCE= zg30
##.SOLVENT NAME= DMSO
##.SHIFT REFERENCE= (INTERNAL, DMSO, 0, 16.522)
##AUDIT TRAIL= $$ (NUMBER, WHEN, WHO, WHERE, WHAT)
$$ ##TITLE= Audit trail, XWIN-NMR		Version 3.5
$$ ##JCAMPDX= 5.01
$$ ##ORIGIN= Bruker BioSpin GmbH
$$ ##OWNER= NMR
$$ C:\u/data/dgb/nmr/ADRS/5570/pdata/1/auditp.txt
$$ ##AUDIT TRAIL=  $$ (NUMBER, WHEN, WHO, WHERE, WHAT)
(   1,<2005-07-11 09:31:20.10 +100>,<MAYBRIDGE\NMR>,<NMR_250MHZ>,
      <created by zg, POWCHK disabled, PULCHK disabled
       configuration hash MD5:
       62 19 C7 07 E1 42 D1 B7 37 6C 3D D0 77 39 F9 E6
       data hash MD5: 64K
       11 62 FE 5F 39 D5 7D 87 83 EB 8B 32 42 13 B7 36>)
(   2,<2005-07-11 09:31:32.08 +100>,<MAYBRIDGE\NMR>,<NMR_250MHZ>,
      <Start of raw data processing
       ef LB = 0.3 FT_mod = 6 PKNL = 1 SI = 32K 
       data hash MD5: 32K
       5A 33 C3 2A 0A A5 4C 60 28 8C C6 BE D0 80 85 62>)
(   3,<2005-07-11 09:31:33.79 +100>,<MAYBRIDGE\NMR>,<NMR_250MHZ>,
      <apk 
       data hash MD5: 32K
       55 80 32 4B 2D B3 D1 59 85 81 C3 07 EB 40 FE EB>)
(   4,<2005-07-11 09:31:34.47 +100>,<MAYBRIDGE\NMR>,<NMR_250MHZ>,
      <abs ABSG = 5 
       data hash MD5: 32K
       3E 26 B5 31 31 42 88 8F 29 F4 52 0A 11 31 56 8E>)
$$ ##END=
$$ 
$$ hash MD5
$$ 48 79 03 89 67 FC 15 3B 13 B8 A0 68 51 DF AA A7
##$RELAX= 
##$RELAX= 
##$RELAX= 
##$RELAX= 
##$RELAX= 
##$RELAX= 
##$RELAX= 
$$ Bruker specific parameters
$$ --------------------------
##$DU= <C:\u>
##$EXPNO= 5570
##$NAME= <ADRS>
##$PROCNO= 1
##$TYPE= <nmr>
##$USER= <dgb>
##$AMP= (0..31)
100 100 100 100 100 100 100 100 100 100 100 100 100 100 100 100 100 100 
100 100 100 100 100 100 100 100 100 100 100 100 100 100 
##$AQSEQ= 0
##$AQ_mod= 3
##$AUNM= <au_zg>
##$AUTOPOS= <6 >
##$BF1= 250.13
##$BF2= 250.13
##$BF3= 250.13
##$BF4= 250.13
##$BF5= 500.13
##$BF6= 500.13
##$BF7= 500.13
##$BF8= 500.13
##$BYTORDA= 1
##$CFDGTYP= 0
##$CFRGTYP= 5
##$CHEMSTR= <none>
##$CNST= (0..31)
1 1 145 1 1 1 1 1 1 1 1 1 1 1 1 1 1 1 1 1 1 1 1 1 1 1 1 1 1 1 1 1 
##$CPDPRG= <>
##$CPDPRG1= <>
##$CPDPRG2= <>
##$CPDPRG3= <>
##$CPDPRG4= <mlev>
##$CPDPRG5= <mlev>
##$CPDPRG6= <mlev>
##$CPDPRG7= <mlev>
##$CPDPRG8= <mlev>
##$CPDPRGB= <>
##$CPDPRGT= <>
##$D= (0..31)
0 1 0 0 0 0 0 0 0 0.06 0 0 0 0 0 0 0.0002 0 0 0 0 0 0 0 0 0 0 0 0 0 0 
0 
##$DATE= 1121070679
##$DBL= (0..7)
120 120 120 120 120 120 120 120 
##$DBP= (0..7)
150 150 150 150 150 150 150 150 
##$DBP07= 0
##$DBPNAM0= <>
##$DBPNAM1= <>
$$ [...]
##$SUBNAM7= <"">
##$SUBNAM8= <"">
##$SUBNAM9= <"">
##$SW= 20.6930455092707
##$SWIBOX= (0..15)
0 0 3 0 0 0 0 0 0 0 0 0 0 0 0 0 
##$SW_h= 5175.983436853
##$TD= 65536
##$TD0= 1
##$TE= 295.16
##$TE2= 300
##$TE3= 300
##$TEG= 300
##$TL= (0..7)
0 120 120 120 120 120 120 120 
##$TP= (0..7)
150 150 150 150 150 150 150 150 
##$TP07= 0
##$TPNAME0= <>
##$TPNAME1= <>
##$TPNAME2= <>
##$TPNAME3= <>
##$TPNAME4= <>
##$TPNAME5= <>
##$TPNAME6= <>
##$TPNAME7= <>
##$TPOAL= (0..7)
0.5 0.5 0.5 0.5 0.5 0.5 0.5 0.5 
##$TPOFFS= (0..7)
0 0 0 0 0 0 0 0 
##$TUNHIN= 0
##$TUNHOUT= 0
##$TUNXOUT= 0
##$USERA1= <user>
##$USERA2= <user>
##$USERA3= <user>
##$USERA4= <user>
##$USERA5= <user>
##$V9= 5
##$VALIST= <valist>
##$VCLIST= <CCCCCCCCCCCCCCC>
##$VD= 0
##$VDLIST= <DDDDDDDDDDDDDDD>
##$VPLIST= <PPPPPPPPPPPPPPP>
##$VTLIST= <TTTTTTTTTTTTTTT>
##$WBST= 1024
##$WBSW= 4
##$XGAIN= (0..3)
0 0 0 0 
##$XL= 0
##$YL= 0
##$YMAX_a= 409533
##$YMIN_a= -568515
##$ZGOPTNS= <>
##$ZL1= 120
##$ZL2= 120
##$ZL3= 120
##$ZL4= 120
##$ABSF1= 16.522
##$ABSF2= -4.171173
##$ABSG= 5
##$ABSL= 3
##$ALPHA= 0
##$AQORDER= 0
##$ASSFAC= 0
##$ASSFACI= 0
##$ASSFACX= 0
##$ASSWID= 0
##$AUNMP= <proc_1d>
##$AZFE= 0.1
##$AZFW= 0.1
##$BCFW= 0
##$BC_mod= 0
##$BYTORDP= 0
##$COROFFS= 0
##$CY= 12.5
##$DATMOD= 1
##$DC= 0
##$DFILT= <>
##$DTYPP= 0
##$F1P= 14.0000005364418
##$F2P= -0.99999901652339
##$FCOR= 0.5
##$FTSIZE= 32768
##$FT_mod= 6
##$GAMMA= 0
##$GB= 0
##$INTBC= 1
##$INTSCL= 1
##$ISEN= 128
##$LB= 0.3
##$LEV0= 0
##$LPBIN= 0
##$MAXI= 10000
##$MC2= 0
##$MEAN= 0
##$ME_mod= 0
##$MI= 0
##$NCOEF= 0
##$NC_proc= -4
##$NLEV= 6
##$NOISF1= 0
##$NOISF2= 0
##$NSP= 0
##$NTH_PI= 0
##$NZP= 0
##$OFFSET= 16.522
##$PC= 1
##$PHC0= -94.74458
##$PHC1= 10.62228
##$PH_mod= 1
##$PKNL= yes
##$PPARMOD= 0
##$PSCAL= 4
##$PSIGN= 0
##$REVERSE= no
##$SF= 250.13
##$SI= 32768
##$SIGF1= 0
##$SIGF2= 0
##$SINO= 400
##$SIOLD= 32768
##$SREGLST= <1H.DMSO>
##$SSB= 0
##$STSI= 32768
##$STSR= 0
##$SW_p= 5175.98343685301
##$SYMM= 0
##$S_DEV= 0
##$TDeff= 65536
##$TDoff= 0
##$TI= <Analysis number 999999
Compound Code 99
Book Reference 9
Project Code 9>
##$TILT= no
##$TM1= 0
##$TM2= 0
##$TOPLEV= 0
##$USERP1= <user>
##$USERP2= <user>
##$USERP3= <user>
##$USERP4= <user>
##$USERP5= <user>
##$WDW= 1
##$XDIM= 32768
##$YMAX_p= 385338350
##$YMIN_p= -216341
$$ End of Bruker specific parameters
$$ ---------------------------------
##NTUPLES= NMR SPECTRUM
##VAR_NAME=  FREQUENCY,     SPECTRUM/REAL,   SPECTRUM/IMAG
##SYMBOL=    X,             R,               I
##VAR_TYPE=  INDEPENDENT,   DEPENDENT,       DEPENDENT
##VAR_FORM=  AFFN,          ASDF,            ASDF
##VAR_DIM=   32768,         32768,           32768
##UNITS=     HZ,            ARBITRARY UNITS, ARBITRARY UNITS
##FACTOR=    0.157963299565203, 1,           1
##FIRST=     4132.6476996994, 0,             0
##LAST=      -1043.33573715361, 0,           0
##MIN=       -1043.33573715361, -216341,     0
##MAX=       4132.6476996994, 385338350,     0
$$ Real data points
##PAGE= N=1
##DATA TABLE= (X++(R..R)), XYDATA
$$ [...]
24699 -96079 -74807 -29034 -28339 -1911 33113 15465 -5674 -38469 -41309 -91242 -89010 -91671 -68931
24686 -68931 -8660 28780 43637 30827 -1912 -23798 -34701 -34253 -51866 -54064 -44110 -42650 -54489
24673 -54489 -52661 -16123 32538 53278 54535 43779 23155 2312 -42566 -88475 -104534 -61738
24661 -61738 -20364 2417 -12361 -14409 -23856 -46322 -25435 -36188 -33228 -25172 -19745 11598 5575
24648 5575 -21510 -16340 -28109 -55016 -55363 -38877 13256 -11538 -7654 14709 31460 32098 20909
24635 20909 -63177 -105375 -93670 -21328 18658 26523 3449 -54476 -97979 -95579 -48362 2866
24623 2866 15906 -35804 -65107 -106685 -81419 -96325 -77314 -42198 -19785 18284 16588 -22124
24611 -22124 -47057 -19684 20355 147 -11572 -34669 -69039 -111605 -78250 -55231 -33396 -40260
24599 -40260 -18189 16204 -10213 -59262 -95665 -73709 -59788 -4370 65942 73755 23902 -30165
24587 -30165 -10093 9423 7311 29827 28818 47199 64619 55667 66472 44430 -45289 -99389
24575 -99389 -88669 -44413 -45312 -53065 -19234 25281 40722 4002 -18996 -35888 -44766 -46640 -41229
24562 -41229 -64224 -80912 -71528 -56603 -69797 -41246 -40700 -59826 -77741 -119149 -100246 -106073
24550 -106073 -94471 -79630 -58518 -13875 -16044 -20082 -40042 -48341 -27003 -30659 -19350 -6151
24538 -6151 8083 -15177 -47514 -64172 -74988 -89395 -79687 -32563 7008 6796 15327 31298 65247
24525 65247 71808 51246 -1927 -445 -19792 -39956 -46704 -57240 -32861 -2855 5028 -28759
24513 -28759 -44593 -5630 31074 43726 44306 18182 -37881 3642 47824 13693 31653 53828
24501 53828 51400 5995 -17985 -59515 -58071 -20995 -56347 -52051 -13443 18365 264 -62358
24489 -62358 -117510 -86295 -63846 -55958 -57663 -43805 -51245 -43254 -11052 -7395 -32187 -47753 -60970
24476 -60970 -64944 -19521 -28769 -48682 -53206 -21499 23305 27355 -8756 -18292 -11096 -23650 -15923
24463 -15923 13629 -8676 -6823 34069 5412 -22323 15157 48166 56284 34689 24913 -5482
24451 -5482 -48682 -62876 -51235 -67839 -67851 -20043 -36037 -13186 -21048 9194 45202 34568 -1940
24438 -1940 -37596 -48616 -64916 -78099 -54844 -57712 -58598 97 66688 23884 26461 36196 19175
24425 19175 6819 -44374 -69045 -2932 53607 49758 54000 29179 -38780 -67486 -12335 -20543
24413 -20543 -38101 -31349 -36419 -51698 -65446 -42301 -12806 415 7867 -34843 1292 14774
24401 14774 -7337 -4805 -22273 -40576 762 44361 48506 -23338 -23703 -2818 -41236 -43721 -16591
24388 -16591 41355 27284 12956 -52215 -53928 -71482 -71860 -41710 -31852 -52619 -33663 -44741
24376 -44741 -45972 -77473 -71329 -82020 -48743 -7661 23444 53222 2854 -81051 -83537 -38360
24364 -38360 -13819 -23394 -23533 -1516 49926 40420 -7633 -38490 -33310 1906 -17244 -14151 23001
24351 23001 10309 -27626 -25907 -14779 3423 -45054 -35705 -33014 -6967 22947 75315 60093
24339 60093 52631 40072 32703 21680 -23804 -23837 -23833 -8688 -34081 -31837 27644 44502 91073 114482
24325 114482 95195 69569 73597 82878 52474 47831 -27171 -78530 -100343 -31384 -18454 -37309
24313 -37309 -55295 -55689 -10804 24366 -15314 -73876 -39691 -63227 -75797 -61638 -48853 -10613
24301 -10613 68 -9904 -22960 -31135 -4884 -34091 -60998 -72973 7440 25647 -26155 -18441
24289 -18441 3775 -21363 -32966 -45268 -29534 -66301 -71174 -94975 -60231 -38938 -20937 -11414
24277 -11414 -6579 -10805 -16819 -44527 -57237 -83255 -116709 -67895 -34927 -51758 -32946 21883
24265 21883 -13473 8691 -22982 -1417 12018 13687 64121 73797 84908 57915 24234 -42489
24253 -42489 -33879 -31467 -34984 -41204 -31447 -22406 -2198 48792 29702 -27276 -22154 -11665 -64479
24240 -64479 -106295 -106736 -45383 -17935 5229 14920 -8629 -19615 -4314 -2420 -41279 -12717
24228 -12717 7108 11206 7271 14013 -2624 -32755 -27109 -46164 -57857 -11741 48402 39234 27430
24215 27430 -20530 -72642 -52898 29001 17075 12581 -8428 -17862 -24218 4114 37985 32584
24203 32584 -2166 -34480 -74585 -115058 -101658 -51532 -2297 -131 -66141 -85072 -93193 -79063
24191 -79063 -107314 -107393 -51411 3849 41005 7488 -23538 -19223 -4910 -4878 -2367 -34202 -35971
24178 -35971 -951 20011 9171 -13099 -44056 -50397 -52323 -29394 -18535 -49030 -49580 -31488
24166 -31488 -35408 -47225 -51810 -40253 -35478 -18461 -26816 -50741 -127634 -139046 -71665 25818
24154 25818 53657 18413 -10566 5753 -13214 -23848 -37714 14230 -34931 -38238 18760 -5210
24142 -5210 -13049 17516 17996 4805 13539 57813 61448 47092 35809 44491 53699 61718 27422
24129 27422 13574 7213 -33652 -45276 -25001 -80872 -60308 -20708 -42537 -41277 -49121 -33765
24117 -33765 19798 6649 48194 57180 74939 73375 7068 -2637 -2105 -30240 -53411 -22119 -13514
24104 -13514 14758 12597 20903 9229 475 -63822 -85015 -130850 -104242 -47409 1091 -5503
24092 -5503 11865 29787 1726 -15965 -47092 -36773 23651 52970 56495 52435 16993 -28415
24080 -28415 -52079 -45110 -29230 -10471 -28926 -21396 -33952 -59227 -76488 -36119 -23258 -61774
24068 -61774 -63655 -49815 -56941 -90971 -72997 -56386 -2378 8749 -11266 5535 -4565 -40897
24056 -40897 -39979 -53153 -31612 -30591 -43024 -18718 -29685 -34468 -57432 -93069 -73943 -10376
24044 -10376 10077 14303 38631 -1133 -2610 21065 41471 60674 -1932 -10807 -1493 1526 18546
24031 18546 39215 49572 65644 50467 13495 -32825 -60544 -31127 -15581 -17982 -43694 -34237
24019 -34237 -45958 -99475 -89447 -65939 -46398 25807 52398 30387 -48046 -23760 41194 45232
24007 45232 7167 -10670 -23120 -67419 -56121 -70562 -118506 -154331 -111475 5241 29679
23996 29679 -26588 -26545 -33591 -13161 -40931 -62057 -65848 -47381 -68833 -69947 -55822 -44129 -65477
23983 -65477 -72114 -50582 -22945 -27140 -14499 17246 27801 17557 16723 43795 -2011 8814
23971 8814 26618 -15138 -2599 51959 53988 14634 1481 -37060 -69550 -90514 -106392 -104234
23959 -104234 -90025 -65394 -36070 -31948 -86636 -105181 -61128 -14793 26643 25428 35933 36957
23947 36957 36366 3047 -73891 -88176 -110109 -52932 -38706 -4316 14245 28855 -23286 -60635
23935 -60635 -62558 -83951 -53982 -10042 -33507 -23852 -12620 -546 -19965 -53518 -35187 372
23923 372 2038 4198 1945 8943 -23457 -54098 -73118 -28908 -7746 13661 33360 24253 556
23910 556 9677 17535 -35982 -74155 -84862 -110949 -77248 -14288 12558 32788 44762 45031 23438
23897 23438 -881 -15053 -2717 1672 -48747 -58253 -13502 4969 -29340 -10700 26754 29544
23885 29544 32463 38092 -48873 -45942 -64289 -74741 -98764 -65500 -21457 -20785 -44252 -24164 -55230
23872 -55230 -103108 -93910 -29500 27251 37104 18547 -11551 -13129 25297 -2051 -43666 -51647
23860 -51647 -65603 -80614 -64725 -24516 -4059 -24782 -49796 -38773 -26242 -6353 -3343 -53860
23848 -53860 -44462 257 16381 -16219 -26682 6559 16390 37585 33355 21273 2921 -35649
23836 -35649 -3270 35946 45695 29985 -38525 -51974 -86596 -54645 -34007 -22517 -32200 -73264
23824 -73264 -66502 -63001 -29437 -3862 -19585 -21145 -24826 1772 3128 14108 -6076 -73630 -87699
23811 -87699 -57089 -1816 -42078 -93702 -72810 -35198 -29960 -33589 -79672 -98613 -56765 -7247
23799 -7247 37762 29641 22484 19675 -16588 -17401 -36990 -46804 -44977 -18820 -48382 -36756 -76480
23786 -76480 -93708 -124542 -137510 -102486 -35172 -92182 -115352 -108687 -60324 -13232 -17625 -20623
23774 -20623 -12692 -50710 -30637 23268 46434 50082 380 30082 80922 39586 16871 6886
23762 6886 -1510 -16370 -9157 4907 54589 38149 -26124 -28129 21634 22924 -66532 -79392 -23131
23749 -23131 -3832 16431 10147 40807 24641 8367 -14682 15927 53456 35567 27450 18614
23737 18614 -40038 -40260 -25463 -14521 -8861 -27690 -50912 -40341 -85899 -71254 -41452 -11129
23725 -11129 -12442 -42773 -58348 -56432 -22236 -7355 -3617 -3455 19739 2181 -54435 -71465 -57945
23712 -57945 -53101 -60606 -23860 8723 -18433 19205 16203 32630 32569 -11815 -32995 3511 37422
23699 37422 -17323 -47711 -49357 -38586 -9587 -16162 -15475 28055 52151 11821 11010 -8218 18926
23686 18926 57254 46308 6031 -9101 -13544 -25202 -26137 -69930 -61113 -45670 -7586 58558
23674 58558 64165 44544 27102 36133 102927 154883 113662 41018 14163 19887 28000 15401
23662 15401 9707 -66418 -105268 -129149 -88650 -38880 13189 13104 87 -11562 -8555 -28677 -45224
23649 -45224 -50424 -33715 -32657 -57885 -60412 -9666 -23243 -71491 -94331 -66522 -26993 -44239
23637 -44239 -14526 16376 3379 13564 17185 20691 13736 53830 65285 49327 -6815 666
23625 666 21941 2290 -5938 17911 19000 -22788 -15106 23478 15224 -2643 -7190 13073 26810
23612 26810 34643 18184 31914 57216 35724 4091 -17841 -24230 -25037 -2968 -1496 9331 47813
23599 47813 52672 317 -35883 -71281 -49281 -7120 11956 14394 2990 -41447 -29609 31160
23587 31160 -200 11795 19071 -24510 -61221 -96243 -58735 -52706 -63346 -83157 -80500 -58202
23575 -58202 -57805 -35122 -24577 -37732 -62362 -84304 -63864 -59963 -47468 -8921 -9490 -18126 -9272
23562 -9272 -50276 -76297 -19234 10442 -3804 49168 47660 47966 57423 27690 -10526 -44741 -39688
23549 -39688 7842 32024 38158 41628 51265 21858 4064 8091 10467 50127 69273 46889 12811
23536 12811 4185 13182 42809 46086 44557 12423 -40508 -53953 -68742 -101341 -81868 -20125
23524 -20125 -27704 -650 18517 30270 17945 -22444 -49569 -78483 -100167 -62718 -14876 32731
23512 32731 99814 77677 66984 39386 31617 12037 17977 -6819 -16035 -22057 -40487 -4777
23500 -4777 -6042 -7757 17127 21852 32847 -2389 -4753 1436 31530 42438 13963 31993 55853
23487 55853 59146 66689 69698 63144 77530 44645 24504 32695 18712 1944 -31567 -102642 -90350
23474 -90350 -42672 -60629 -106258 -57194 -8197 -5301 2779 35501 29279 4232 16168 22220
23462 22220 31314 8583 11006 19455 33153 47304 27711 29822 -12278 -46634 -72582 -70857 -64493
23449 -64493 -2648 9637 -2867 -36913 -41906 -24133 -6412 -11865 -15875 -4358 -10111 -24565
23437 -24565 -9768 14930 28942 40838 -7033 -26907 14503 11406 -31200 -62672 -20646 651
23425 651 -14900 -12263 4946 -12331 -40129 -48555 -56509 -46034 14795 8350 -16424 -34522 -23292
23412 -23292 -22917 22589 13153 -3410 -46009 -44337 -24659 -15446 -939 26207 29779 -3141 9356
23399 9356 31169 27366 17569 38789 51005 18886 10539 46038 32852 -9100 -46060 -40107 -54234
23386 -54234 -33996 -30566 -38528 -63488 -83361 -73605 -25211 11546 -2658 6222 48213 68865
23374 68865 35839 -20744 -29227 -68754 -53270 -40764 -16499 22979 21167 -43189 -32220 23116
23362 23116 14872 1553 -21157 -37418 -35415 -42131 -48570 -88588 -100849 -83725 -64863 -81326
23350 -81326 -49263 -15956 -31022 -76983 -35630 -52930 -83394 -81068 -101977 -85475 -55366 -35206
23338 -35206 -30994 -24271 -28379 -31489 -51905 -64035 -68479 -68004 -65325 -23325 -4892 -273 -25380
23325 -25380 -43410 -15213 8159 23663 28107 21293 14380 -13940 -39828 -67333 -43081 -26592
23313 -26592 -12561 7056 2195 -42463 -37048 -9823 -6196 -59743 -63314 -36389 -45529 -63699 -85610
23300 -85610 -58937 -21564 26060 -506 -22025 -37836 -40903 -90571 -88115 -12188 23103 39033
23288 39033 -208 -22179 6460 3517 9286 12259 -25901 -72331 -88858 -96860 -75016 -41338
23276 -41338 -48107 -23909 26715 65829 829 -51328 -47516 -42373 -39761 -72400 -66763 -47742 -57477
23263 -57477 -83253 -37128 -25995 -26952 16886 -4191 -13393 -15275 -9563 -28225 -46634 -34534 -20146
23250 -20146 6075 -14919 -30030 -60602 -25842 -35938 -41131 28439 67303 35397 -17587 -36611
23238 -36611 -38293 -46347 -16199 11259 -5558 -25845 -32057 -57814 -88690 -125978 -132019 -94606
23226 -94606 -17915 15480 41284 49697 5512 -72269 -81374 -102440 -90251 -62055 -43214 -27618
23214 -27618 -18366 15595 13637 -16141 -2861 33260 29274 2448 30520 48803 85512 95669
23202 95669 102506 18153 -62308 -61872 2231 4926 -19167 10184 26995 15805 17508 -4783 -31397
23189 -31397 -51850 -48486 -41829 -40243 -23100 -30636 -21938 -18367 -58088 -69256 -28610 -19319 -11813
23176 -11813 -54982 -69529 -61313 -60238 -64199 -43600 -62561 -46962 -5001 -7303 -7984 -19351 -43690
23163 -43690 -43693 43983 69224 23507 -9216 -21216 4890 -14435 2407 4754 -21536 -48833 -57241
23150 -57241 -30861 -42986 -49256 -21008 -15541 36290 90275 63829 29475 -5292 -4407 8321
23138 8321 -6839 -25566 -39318 -21012 -42683 -66076 -64244 -50560 -15907 31341 5230 -21594
23126 -21594 13965 16682 -1519 7816 9061 -19093 -77005 -86826 -78433 -93246 -83867 -45964 -52752
23113 -52752 -46194 -24030 3877 147 5270 22337 28095 -9866 -45323 -38659 -45428 -76707 -68194
23100 -68194 -65405 -53671 -63538 -103106 -125178 -117301 -76571 11230 59806 38682 -18956 -60508
23088 -60508 -34117 -11621 -33813 -78995 -83742 -78752 -39169 -76668 -80768 -50038 -22456 36515
23076 36515 46567 12135 -23783 -54480 -50208 -44656 -60151 -21140 32548 25975 2696 -325
23064 -325 -40417 -37995 4544 17177 -8858 3915 25653 12101 2354 30464 57474 43206
23052 43206 36016 68732 64153 -13743 -44767 -7427 54375 95088 97977 46896 19720 -48579
23040 -48579 -76176 15847 43060 3349 3079 23203 24286 7722 -5858 -26899 -41132 -15487
23028 -15487 19137 31389 34338 27312 34794 80990 55183 16316 5671 20220 -13530 -43076
23016 -43076 -79392 -59088 -56547 -71400 -59392 -78074 -29975 37659 -5395 -32096 13067 22920
23004 22920 -30855 -47267 -41601 -31739 23333 37241 34674 84639 63815 49049 28788 30413
22992 30413 3571 12043 28767 -13794 -11643 13977 1233 -1875 -13195 15602 -3809 -26595
22980 -26595 -11728 12620 5511 -24800 -99586 -97865 -65089 -14074 -12443 22066 39061 34998
22968 34998 42964 29707 23870 15663 20012 -1153 -21687 -34508 -853 -3847 -64825 -91556 -56809
22955 -56809 -38458 -15595 -7895 14120 66135 33208 -1462 -2664 4746 -39416 -81779 -49444
22943 -49444 -16568 -24629 -10957 18097 28459 2272 -22022 -12467 14332 11533 -58915 -61148
22931 -61148 -24462 7747 1581 20314 -12041 8465 17527 -7896 -24405 -42877 -87202 -91457
22919 -91457 -88277 -86484 -98543 -100519 -68404 -46274 -15786 27486 39849 43335 -7162 -5923 27461
22906 27461 -856 -11212 -13374 -11231 14544 3542 -21829 -13811 41335 53358 60807 23517
22894 23517 -26284 -48923 -73780 -71119 -73861 -42403 -30267 -36507 -7127 20580 47703 73819
22882 73819 71921 63204 42518 43011 37506 -11149 -36836 -54105 -26665 27547 101434 91673 46303
22869 46303 35075 10628 26342 48328 107806 111331 106704 94110 88944 97789 119594 156638
22857 156638 179822 246477 320318 404752 434083 438699 408355 322055 189030 104088 57933
22846 57933 22563 7030 75529 122217 106666 76227 64744 85532 140947 179757 264166 369627
22834 369627 396996 415481 450405 343462 234274 170262 118308 114688 93100 83675 124067
22823 124067 137956 129071 110150 115731 120044 77859 45088 37998 61082 95736 98890 60270
22811 60270 18292 50048 64137 37490 -24020 -48492 -47292 -19583 19330 98056 106717 70384
22799 70384 8551 8275 61063 64363 7302 25845 48472 33934 -17487 -60099 -48913 8283
22787 8283 65323 68785 53116 65564 95524 104569 84922 46213 17600 76042 124468 127389
22775 127389 107564 72880 89103 69285 24907 14411 38771 94303 96256 77603 94264 85841
22763 85841 75124 45165 33496 50129 60409 55972 45610 68988 55234 47990 39522 21507
22751 21507 -11039 21091 41900 27660 32967 45046 9764 -4584 9890 7042 -30467 -9972
22739 -9972 -555 -20822 10163 25771 37079 17339 14593 -7211 -36498 -19806 25226 49228
22727 49228 65875 82870 102211 62568 31697 33722 21894 -23817 -43751 -17222 -743 66142
22715 66142 28174 41205 41902 41145 -5809 -7799 38509 79291 70265 55719 18214 -2558 31075
22702 31075 54442 43037 10586 -8246 27834 48007 68454 33985 13595 69438 112479 40971
22690 40971 -28304 -40620 20768 52075 46402 101664 104378 90998 74141 38266 39380 21338
22678 21338 26706 37634 -21088 -20857 18231 42986 13186 4663 22240 -5079 -28369 19750
22666 19750 61686 42734 33631 35540 79090 122136 138965 111940 123972 141869 112019 99879
22654 99879 141779 158139 141944 89384 40669 -1999 -8158 -21096 16147 52967 71210 57408
22642 57408 71312 95112 96257 87704 101493 130800 86074 40390 48165 86014 81633 60200
22630 60200 47294 78827 71708 36143 36297 58739 66560 61099 67722 49201 63609 61045 67173
22617 67173 74407 37093 51782 26656 20592 8057 42152 70599 25411 53337 77105 75938
22605 75938 40102 1155 -7748 23698 54023 45508 14326 44732 48273 43182 50968 55148 35193
22592 35193 68801 59921 75811 111155 101711 80134 80685 73808 88968 62359 93948 132873 120971
22579 120971 90387 82325 86266 80092 95059 115813 167400 128315 101152 103326 132751 120503
22567 120503 102782 130125 102079 115936 107626 124130 164417 131956 150621 144901 95840 59899
22555 59899 55513 75416 136991 174901 200733 101455 39056 84159 95587 134261 174605 182216
22543 182216 171976 152098 175379 217406 208096 254073 288556 249119 212787 165893 200744 209195
22531 209195 214714 217351 167665 147336 174061 174522 173585 147719 147910 158515 133749 156039 176814
22518 176814 142718 141823 196856 210432 274175 335149 295049 259642 272792 249918 294612 329927
22506 329927 312545 303012 296297 327498 296966 272665 265945 224819 226461 249385 284724 270085
22494 270085 242024 263796 297917 265547 242920 246733 263926 281729 314191 278342 273125 280667
22482 280667 271783 316479 304391 324882 367138 347918 367283 370568 331163 307742 338302 358614
22470 358614 360040 323827 290158 315732 333759 377363 356264 299406 309374 353383 360109 343911
22458 343911 303531 318979 326127 291390 248278 296488 297443 326206 265286 234344 241158 226740
22446 226740 228399 216942 237051 260829 254427 242533 234976 247680 263314 250660 180838 174117
22434 174117 216088 221650 178313 140592 146144 183894 193280 190102 181907 146338 105803 153539
22422 153539 173639 125470 139600 154858 118612 112085 126303 156399 154468 115686 96193 91021
22410 91021 63034 70476 114033 126969 122808 135015 140023 134321 151341 177949 199532 188259
22398 188259 159400 127555 157942 150801 165891 172428 151013 141019 124932 117290 91934 88661
22386 88661 70386 55329 69882 48619 42535 142328 185555 201552 160262 123524 119811 142947
22374 142947 156957 102582 87981 78294 83551 93437 103727 92753 95474 66774 38946 42839
22362 42839 48740 67795 47193 40403 74884 137174 150632 156144 110923 63148 98413 55713
22350 55713 2425 -2189 45071 68082 71890 72591 63394 25143 -26513 -52655 -40264 -47321 -14608
22337 -14608 9878 2404 43850 32869 39474 99519 68555 -5727 -36357 -58256 -40823 -16376
22325 -16376 44678 98840 53729 26273 19625 29026 100392 85956 29934 20918 27090 29318 10219
22312 10219 26070 55899 44937 45358 45361 -1832 -29411 -9761 47960 76892 59009 78082 124076
22299 124076 111405 55020 31844 27957 78245 90095 51889 15553 -7357 33164 37248 22732
22287 22732 32090 57411 92436 95726 73244 73099 53916 37906 51802 81732 74312 36027 19339
22274 19339 -9974 -4602 -28245 -80616 -67076 -18328 14266 35111 44544 49485 72284 87365
22262 87365 122551 95083 8481 82395 182761 187120 145658 140066 117568 72510 23976 25712
22250 25712 2050 16962 46361 21626 19982 516 -18080 -2108 40973 49213 -11632 -9393
22238 -9393 -17692 2044 20952 101809 117345 71755 55752 57134 65540 44567 19790 27088 57910
22225 57910 103883 62963 35714 25555 37651 45286 20498 12796 21307 44487 35555 25316
22213 25316 15777 14683 8921 18587 9516 -7540 26775 30892 44027 28697 -6255 -24780 15968
22200 15968 -16665 -32986 -39827 -8479 29208 45881 69730 58451 49929 2743 16009 25162
22188 25162 31316 33411 42333 17267 23980 43931 55098 17173 2173 24611 -27446 -42138
22176 -42138 -66903 -39114 5252 15362 55332 54802 23624 10659 -8331 -19970 7528 49349
22164 49349 47753 15529 1834 32619 63889 72785 28994 28661 8832 -17645 -15050 16630 38861
22151 38861 15412 9706 2605 35920 55518 55500 7005 -2095 -13125 1401 62106 102179 103953
22138 103953 106189 115241 35716 42041 46693 28109 24712 15273 18485 -15674 -47603 -31614 -6310
22125 -6310 -23914 -49215 -25710 -14250 19178 15529 -9633 -12169 4636 40237 83604 58956
22113 58956 12651 -18536 -25029 -770 3673 -28784 -52454 -36547 7302 21784 61367 90421
22101 90421 82076 43528 51136 73974 68739 53929 30031 22665 48637 89285 176415 187165
22089 187165 139327 115194 73196 10849 -27729 -26116 -41426 -45942 -38866 2154 18545 -9540
22077 -9540 588 14900 12182 23560 3037 4110 29839 48201 47844 19258 29346 24844 54106
22064 54106 23975 33719 112237 118604 116712 82183 67263 59606 65497 33321 11998 6048 -29246
22051 -29246 -37783 -783 26733 5622 -7367 17842 68028 92485 49139 54711 53133 39941
22039 39941 52740 116731 160183 140642 103955 85463 67115 28412 32679 29194 4637 -5568
22027 -5568 25512 77763 63177 76598 104470 52957 23692 17293 44047 38000 28689 51504
22015 51504 37304 38233 67070 77340 71460 86169 74697 69522 72838 21366 -18489 -29604 -22250
22002 -22250 -3957 -13835 12692 39312 63377 40076 7656 46403 38534 -20434 -21363 4901
21990 4901 36259 35612 58949 61448 30255 2084 -19311 -24031 -7345 -24463 -8643 23723 16716
21977 16716 17532 886 50623 83269 40002 50637 72972 66295 56004 38423 44277 20213
21965 20213 -8568 46446 49739 5273 -3455 6374 30090 13502 24439 24074 36062 69296 100703
21952 100703 124476 91347 61286 61510 85448 87508 123494 104207 39847 27580 47845 99472
21940 99472 91953 87351 65028 20275 34364 21722 35435 73397 88948 72382 34354 10662
21928 10662 -40099 -63116 -58525 -47294 -42795 -31538 -319 37833 76360 97020 85368 73471
21916 73471 95568 106600 86734 37133 56807 106376 116224 92461 77570 88567 104004 95123
21904 95123 65643 57322 74770 54940 48369 54054 38577 40875 87646 117995 110255 103225 36696
21891 36696 20593 45192 20844 2888 2077 20625 19269 13935 18203 23603 17587 -956 -10404
21878 -10404 -40081 -74245 -46748 29203 60267 90031 63999 31367 -6491 5007 71168 67122
21866 67122 95549 127220 83928 63493 66647 58289 54627 60882 58391 13682 26874 76290 128584
21853 128584 123247 45695 6022 17799 31738 48193 29707 -13949 -21847 -59566 -45852 52824
21841 52824 88859 120216 134297 67920 44103 110506 111527 96606 53924 25401 83375 99058
21829 99058 94653 34422 4619 34930 67042 75566 99981 108592 54600 24514 2869 13776
21817 13776 55998 77212 75923 56326 15157 55246 47676 62576 112865 110122 108536 84681
21805 84681 79872 77728 80362 75717 99730 118198 152563 170118 172306 163984 133903 167415 137142
21792 137142 143386 155413 97581 68214 107385 69817 47216 27297 6734 15571 23408 40200
21780 40200 56446 66732 38634 61193 52793 -12052 -26238 -24661 -16170 32225 22026 1274
21768 1274 34414 55827 81218 108827 99204 34268 -2719 25419 76546 108122 103617 95712
21756 95712 83662 58963 54917 40371 40984 81866 99396 68836 39829 42165 41827 39779 34717
21743 34717 31626 5825 21440 84478 115943 121271 123226 59464 50288 83417 118102 137807
21731 137807 119536 117761 92129 96659 117940 92523 94659 109806 133256 124434 119912 66311
21719 66311 99489 122801 88099 48798 65600 88559 51924 57758 23735 33373 66946 59483
21707 59483 48929 38867 37669 74177 83538 72511 57398 57385 77258 67209 46519 62323 63474
21694 63474 37195 75711 81845 53785 78644 55567 71287 85580 89686 62511 22241 4865
21682 4865 25939 48054 59009 102016 104988 64641 98994 128876 111986 74342 14937 12833
21670 12833 54245 28145 10647 5446 31391 54711 51275 44666 -1325 31114 92503 153147
21658 153147 155123 170392 133215 103389 50469 10760 33590 51951 66351 78931 68474 55256
21646 55256 71891 69313 90333 73966 56610 44982 14289 53583 76307 110721 90338 115159
21634 115159 136501 102058 142233 185207 145209 72287 121188 139874 149845 100756 79060 119915
21622 119915 164978 162183 127090 111707 108835 102563 68040 109129 107346 87969 109161 96654
21610 96654 123821 165924 179572 150582 122498 130264 138581 133578 134782 156130 147057 134997 116815
21597 116815 101240 95146 121112 163734 167060 135911 160552 162736 170771 167370 151322 96447
21585 96447 70891 52343 54727 57065 71407 53303 41821 24963 27250 58946 75546 110323
21573 110323 146770 191926 177451 120735 117747 160863 174639 145286 160708 199623 220614 218450
21561 218450 224879 209313 167989 146682 118852 87537 106169 157131 186851 220891 236506 229780
21549 229780 201131 173314 236523 236589 206485 185988 177933 141816 94922 158243 199830 181313
21537 181313 179652 201595 191699 142958 118645 109323 126911 117521 148853 166697 197637 233338
21525 233338 236179 203057 162387 149270 200690 159289 90436 104914 122433 129249 133353 159719
21513 159719 164314 148184 117146 105385 92808 76141 74279 59743 76113 72183 55825 93959
21501 93959 120026 135775 139629 150786 147441 127004 80827 59894 57674 26956 55016 90261
21489 90261 94368 105736 82125 29351 62859 63679 81787 129094 130084 134209 112571 141888 173955
21476 173955 141215 127738 109765 89264 91244 72065 66264 84212 57223 18193 46152 81100
21464 81100 114432 155804 145406 143214 141682 78093 83580 103275 110414 125406 149153 116568
21452 116568 118461 154915 154563 144552 129780 110769 127551 160173 176875 200541 172654 145814
21440 145814 107864 102616 84631 76788 98363 102330 77237 83802 100969 130502 97284 71585
21428 71585 93660 108016 119769 99552 133838 140258 149125 138348 108496 79716 137529 224554
21416 224554 217162 149557 129605 116647 141705 170553 138714 150107 162176 173658 157081 143418
21404 143418 114934 118891 120823 122900 117468 81722 91503 83147 104339 110519 83319 104775 94251
21391 94251 74018 93151 107346 107270 151790 149698 84490 71119 97447 118367 87656 62157
21379 62157 92854 118016 127401 145301 95367 60436 79744 90418 96175 124425 155481 118892
21367 118892 85373 94133 119082 142515 142346 108472 108357 85985 36348 53529 59039 65995 72203
21354 72203 64052 93584 100620 117704 97465 74402 63249 61567 86197 112375 43916 39798
21342 39798 59328 38907 72624 103663 106063 72803 57885 90198 124535 136202 101055 120669
21330 120669 149122 126140 132308 109948 118547 148272 180192 217708 219987 184687 208778 185123
21318 185123 145341 146836 177190 182044 160252 104859 84396 98468 93162 85819 45080 80609
21306 80609 103179 112112 113344 149140 209672 224750 180024 148837 149221 151443 184844 226791 226171
21293 226171 221467 245728 268603 239737 188602 171163 153294 131265 114509 118879 162839 178940
21281 178940 184133 190771 202178 216873 224088 210238 198756 221050 215987 162965 133016 117565
21269 117565 121504 174273 192127 210631 195664 221163 256693 247124 199443 189410 172039 134755
21257 134755 115719 145672 153851 146337 175571 177574 208461 211352 181609 164403 178196 193040
21245 193040 217958 228093 226464 205886 208937 255679 250417 190463 169040 170582 191097 214977
21233 214977 244461 231217 269231 260711 253618 255358 264702 267230 243427 192992 189131 206208 196841
21220 196841 207801 205515 206665 166682 151433 169310 162012 152480 163015 206302 213672 215720 242883
21207 242883 283540 227633 193020 233789 243997 244618 230288 203655 151130 161462 178598 171817
21195 171817 144514 141673 170883 193106 175637 167571 144771 163146 212068 206321 203263 222206
21183 222206 206267 179746 220487 235814 253392 221240 198957 137956 119197 135548 145950
21172 145950 187966 182361 201740 219816 200021 187910 210804 247597 260497 260992 167051 156944
21160 156944 138553 77921 85572 100007 137122 153688 192777 245937 229841 201530 158202 153777
21148 153777 186271 175332 213286 230019 197459 183449 136201 154932 142633 110979 115535 116137
21136 116137 128195 94499 100732 141776 188062 208552 228477 196830 128962 107612 191015 263367
21124 263367 271734 231316 215466 204497 204004 190692 186585 155990 175778 152910 170538 192210
21112 192210 173860 156593 174851 183310 220345 261708 243728 216312 245109 224521 189684 140557
21100 140557 153395 126879 119632 135539 140208 143539 182850 211513 199239 187543 179212 159395
21088 159395 139895 166808 194481 175445 173040 154442 156256 195280 176160 173798 178279 150899
21076 150899 100795 136803 167038 164072 204821 185542 122268 123832 110950 177565 213948 193231
21064 193231 198328 174443 158795 173813 241616 271594 279902 224181 182308 136170 156042 168776
21052 168776 184415 205295 179900 187386 226182 235520 244377 234737 225415 209001 202734 209862 226115
21039 226115 214394 208257 238270 276283 298824 275153 264879 216297 212690 188665 176282 148497
21027 148497 166120 212983 221895 212632 198737 180340 190622 178718 173317 180478 212954 228570
21015 228570 257719 270645 285192 277183 277584 245394 239883 267129 259675 282575 319911 315001 298967
21002 298967 252293 211840 210486 207826 197189 196979 230368 281609 292907 270548 275941 268562 276827
20989 276827 262886 270522 273012 255366 260891 256985 247406 248774 254884 232724 233935 237857 240000
20976 240000 231983 231857 221680 236418 274603 329478 315621 227170 202444 232954 234162 246721
20964 246721 283921 251028 229711 260501 305099 321005 262925 231648 220049 274813 335529
20953 335529 326112 295581 295009 264845 263924 259051 253283 256770 253739 222248 240167 236440 196905
20940 196905 210020 211345 234172 282679 270949 227963 251306 265981 268055 242523 218430 164659
20928 164659 174137 226122 224569 178903 201816 228986 205711 196730 223419 270995 285981 288057
20916 288057 314548 344294 361000 341657 307621 289924 297589 279675 279015 230690 224366 256947
20904 256947 261985 236931 234689 241382 281317 302979 368815 340186 284460 248506 237717 220051
20892 220051 258149 279967 310656 344464 320067 295139 271359 314269 325720 303535 321876
20881 321876 331104 335283 348018 339381 352154 407775 397795 409755 438413 411587 359435 312254
20869 312254 273081 261198 249243 235112 287827 345333 343237 327690 288797 313351 304442 342393
20857 342393 398749 377664 369086 397577 405857 379355 368414 349792 376083 389127 369628 393836
20845 393836 438225 421597 400044 375601 386084 396098 378702 398089 366860 362459 378519 403112
20833 403112 476377 513555 497595 479139 455224 440458 433500 447870 434352 403579 411719 442223
20821 442223 422784 377292 382732 377003 357368 356769 365273 338158 333512 384560 383918 408408 434283
20808 434283 453433 456765 434814 434284 452476 430609 420535 414845 418341 418521 427580 395388 354192
20795 354192 355960 369371 358537 331270 293918 308585 319936 340418 341597 362105 367879 369377
20783 369377 374294 370535 362004 410380 425254 391435 349788 378691 413598 404972 399954 404797 418610
20770 418610 412718 417403 422407 415141 446693 450999 442408 449371 459217 467775 435112 428474 429288 390243
20756 390243 381840 423674 444830 497460 483428 413490 443853 502782 506659 472248 421734 439266
20744 439266 482054 472531 500830 523238 508958 529373 566178 564843 547076 502432 503037 503899 504346
20731 504346 440905 453126 497287 511259 498419 482473 523090 554065 516701 477212 499865
20720 499865 494247 511639 516002 504271 512362 471964 461929 493729 507969 504362 472329 457505
20708 457505 452301 472007 494411 498329 530041 583319 586604 568939 538668 538834 567543 578192
20696 578192 606487 600098 571178 622384 641688 609226 561990 568231 614830 600482 607080 621669
20684 621669 655459 712759 680447 621104 635136 635061 633316 651658 602918 644746 652562 635985
20672 635985 634594 625599 628744 637549 656073 670484 674278 659273 671881 705306 760575 761883 717276
20659 717276 708007 702606 706802 697561 698273 735238 735279 680579 622709 632770 723105 731867 722811 685668
20645 685668 654383 696219 733835 712400 709016 718856 688842 660839 648001 688944 708565 735882
20633 735882 753770 758478 738442 704964 727107 783481 790200 778640 718780 707690 793069 773878
20621 773878 792555 806830 825029 829795 843448 872454 881461 841757 835085 809158 781771 786839
20609 786839 842861 858761 860553 837997 823731 835572 846452 819625 821357 784669 787923 841814
20597 841814 858283 839092 838722 843912 799696 782146 812160 844108 851188 861104 873423 890479
20585 890479 908358 893273 869589 897803 936513 952061 921369 889004 879269 894353 928846 899110
20573 899110 901424 942393 945062 955896 960364 949480 970189 951664 967811 1062272 1046096 1025207
20561 1025207 1063051 1038566 1034856 1062348 1077038 1080065 1073851 1092163 1088808 1074539 1076674 1111844
20549 1111844 1101245 1129038 1134791 1143095 1183167 1178753 1160327 1165630 1166105 1172344 1181306 1198221 1217563
20536 1217563 1197197 1188103 1220999 1244943 1256292 1262218 1236071 1192279 1150890 1201024 1261239 1257579
20524 1257579 1279027 1250495 1218821 1274453 1270524 1245244 1299598 1321374 1332200 1329223 1354401 1406902
20512 1406902 1404359 1396415 1431807 1464720 1406402 1396543 1427354 1407044 1397265 1389981 1419028 1443727
20500 1443727 1486117 1504070 1519580 1524178 1554391 1571992 1546353 1551259 1538440 1545920 1565546 1595405
20488 1595405 1599588 1614053 1618189 1611252 1602936 1647529 1687175 1642266 1598868 1623409 1693245 1744189
20476 1744189 1778235 1777984 1771279 1777599 1777637 1808564 1822098 1851661 1843831 1833032 1845202 1868226 1937750
20463 1937750 1963326 1926224 1947073 1981666 2020710 1997203 2023521 2084204 2096607 2110011 2149565
20452 2149565 2218382 2233018 2177445 2180635 2198730 2252434 2259858 2244804 2244281 2247983 2282309 2326549
20440 2326549 2303032 2309377 2353236 2393025 2439585 2471143 2467407 2450750 2468063 2451018 2485292 2533432
20428 2533432 2635478 2662928 2662605 2652017 2696241 2700990 2697230 2778883 2845906 2887526 2876992 2847410
20416 2847410 2870655 2884839 2892756 2919265 2963951 2985399 2993887 3002656 3053488 3115610 3109259 3075846
20404 3075846 3086850 3150169 3214388 3303999 3320130 3283774 3249213 3278533 3337670 3402350 3435407
20393 3435407 3435824 3448072 3486388 3476145 3505240 3563417 3596062 3610119 3656466 3689013 3760448 3825574
20381 3825574 3864713 3908836 3935508 3993944 3980802 4013737 4090970 4105522 4117145 4138302 4142185
20370 4142185 4162318 4173637 4234908 4319470 4350728 4381425 4427988 4452910 4506606 4545012 4568225
20359 4568225 4642216 4697908 4735531 4750811 4768874 4866119 4927268 4966647 5020382 5044637 5150919
20348 5150919 5202903 5212382 5284181 5336801 5380208 5479317 5589620 5650660 5725187 5760339 5792265
20337 5792265 5923650 6002703 6042910 6090938 6177246 6251604 6298245 6359440 6453497 6551314 6616535
20326 6616535 6736649 6845546 6944379 7062354 7219719 7279561 7323801 7414739 7499294 7563483
20316 7563483 7690419 7831861 7963896 8073095 8230958 8363776 8470378 8562623 8657137 8767253
20306 8767253 8905416 9039274 9203282 9325964 9453912 9613552 9709965 9812376 9967740 10162321
20296 10162321 10344533 10500116 10635524 10826157 11031934 11228623 11356622 11563046 11749225
20287 11749225 11944846 12169087 12328652 12501858 12699682 12911957 13185946 13384992 13635552
20278 13635552 13878475 14103986 14345148 14622145 14928944 15253041 15523535 15769862 16052468
20269 16052468 16316360 16605177 16945637 17279421 17625776 17973273 18332694 18674524 18996017
20260 18996017 19329958 19730863 20158276 20548386 20932849 21322640 21762531 22192742 22635968
20251 22635968 23063850 23535652 24025283 24502794 24942979 25423635 25930100 26455226 26987424
20242 26987424 27515709 28072051 28620455 29203249 29778016 30373240 30936941 31497681 32082607
20233 32082607 32688179 33271173 33872054 34427191 35009912 35576480 36178055 36836601 37458174
20224 37458174 38076675 38689103 39273510 39876515 40516698 41106763 41703209 42343001 42968639
20215 42968639 43577842 44187447 44798225 45382816 45935447 46494907 47051684 47642340 48229930
20206 48229930 48820352 49347101 49867937 50360901 50895469 51433674 51908129 52361982 52816650
20197 52816650 53250949 53705995 54136093 54503000 54875502 55235111 55609487 55942848 56215904
20188 56215904 56422903 56611331 56857406 57055553 57242108 57337623 57438609 57574621 57703542
20179 57703542 57765398 57725219 57617365 57540722 57504602 57354362 57186581 57055885 56880627 56666729
20169 56666729 56429783 56119613 55806810 55526457 55227088 54877914 54531020 54169770 53791793
20160 53791793 53436724 53026003 52510983 52018319 51530457 51087991 50627594 50135381 49680501
20151 49680501 49197659 48661238 48074344 47516601 47001152 46481855 45885392 45279194 44675472
20142 44675472 44065438 43452691 42847152 42262402 41655675 41034462 40440939 39832378 39198156
20133 39198156 38558394 37942216 37332522 36707645 36110347 35487547 34882356 34282830 33627354
20124 33627354 33045277 32485767 31921514 31341375 30782858 30236012 29688462 29125023 28558215
20115 28558215 28039576 27495494 26968099 26452491 25936911 25438444 24931237 24413997 23937016
20106 23937016 23471636 23029908 22582665 22157523 21733747 21313545 20868758 20445064 20041690
20097 20041690 19652816 19279271 18908249 18578885 18227165 17776055 17425530 17128074 16796327
20088 16796327 16442302 16131772 15836987 15541643 15274361 14991427 14698284 14381674 14086047
20079 14086047 13834259 13565470 13339460 13132038 12906575 12654603 12408920 12189068 12006365
20070 12006365 11816821 11601580 11414708 11171239 10927345 10700038 10547181 10360359 10172965
20061 10172965 10031096 9874021 9749726 9634551 9469596 9285496 9112763 8952113 8765921
20052 8765921 8646493 8484903 8337150 8204304 8071562 7927849 7833571 7757653 7665507 7568861
20042 7568861 7419516 7276930 7185870 7083407 6964012 6864526 6791832 6656475 6548584 6442469
20032 6442469 6361659 6266023 6156209 6076389 6056509 5993443 5863142 5747413 5652779 5588627 5501541
20021 5501541 5471445 5402099 5362714 5284462 5211391 5147900 5077512 5019591 4972605 4931510 4872808
20010 4872808 4794973 4748519 4708848 4681464 4661388 4609809 4497919 4415125 4342377 4309486 4290317
19999 4290317 4216526 4157186 4110838 4092394 4078367 3986642 3926158 3915222 3866958 3808443 3789325
19988 3789325 3765298 3715727 3667256 3632122 3607951 3600479 3588437 3571421 3493037 3408795 3385583
19977 3385583 3348323 3323365 3281564 3219514 3190424 3166999 3101407 3072686 3082492 3083276 3079469 3071065
19965 3071065 3005184 2989078 3028405 2993364 2954544 2934974 2955984 2956886 2922380 2897682 2857779 2853714
19953 2853714 2863841 2852823 2804129 2763237 2735723 2714405 2736050 2751411 2675011 2629316 2584274
19942 2584274 2507471 2444809 2373509 2344368 2362871 2375541 2397481 2411989 2338302 2275135 2217652
19931 2217652 2228950 2227452 2149761 2136608 2162929 2157170 2113070 2098833 2128470 2119784 2082008 2060521
19919 2060521 2026912 1997059 2009942 1981242 1966318 1982360 1990943 2022521 2014204 1953960 1870700 1805111
19907 1805111 1779972 1758494 1770315 1756620 1749753 1729051 1660666 1632817 1624585 1623152 1633542 1641943
19895 1641943 1623169 1636889 1643684 1610156 1593783 1546882 1468318 1397417 1403643 1466888 1453708 1436408
19883 1436408 1434744 1468337 1482831 1463528 1448650 1457737 1492982 1490202 1412115 1384069 1352546 1360770
19871 1360770 1344130 1302098 1306168 1294797 1274147 1287151 1272779 1242707 1260658 1245534 1221324
19860 1221324 1193350 1170907 1213647 1266383 1230769 1214276 1227265 1195865 1160548 1177140 1175827
19849 1175827 1153666 1160421 1152222 1126166 1101333 1063393 1101632 1112304 1098244 1071666 1069161 1071878
19837 1071878 1087153 1052440 997633 963842 965307 978863 1006386 999221 964768 987775 1034817 992866
19825 992866 984192 974672 976526 936003 927027 904873 881072 891424 857299 868851 847727 819002
19813 819002 836356 871311 926905 921266 873213 811358 797346 803995 779149 756073 726600 736256
19801 736256 724532 722048 722957 750246 762368 743041 694695 710196 721428 748315 732326 706860
19789 706860 689753 693083 674360 674523 735335 758841 649635 583721 581911 593804 642890 690061
19777 690061 650550 634563 576866 535385 531102 585625 557315 594084 630687 596630 577435 551957
19765 551957 536053 537837 610428 640887 641353 668823 698209 671529 620277 600194 582914 540998
19753 540998 555031 570368 604457 596396 589748 645952 662256 646007 600778 605360 570599 566364
19741 566364 580247 612272 597477 549625 533479 550925 572260 565348 586200 599365 571868 525160
19729 525160 498152 476090 491123 490653 489604 493585 485066 431413 423072 408215 418295 429469 462634
19716 462634 453432 441797 444795 428663 436642 431147 401253 391814 427195 463363 449083 455363 461874
19703 461874 463210 449382 439339 408143 425172 450114 448409 425794 393285 359888 354626 380644
19691 380644 370266 353061 320448 313529 340785 330078 295284 323427 346124 308061 319035 359965
19679 359965 348025 354897 373131 362560 339581 335303 337655 347248 362618 388876 369787 326388
19667 326388 284951 266003 293438 303227 297185 291572 275776 315178 343456 338132 295352 248377
19655 248377 248263 269950 282287 294251 305605 297399 283783 305638 322752 314331 290547 295598
19643 295598 335114 344160 329188 274478 273721 331395 319098 285724 267915 288441 383946 400220
19631 400220 354806 340165 337315 324420 354635 349089 342084 379157 378402 342447 262847 237684
19619 237684 266258 302423 316116 254420 197456 191962 206630 217629 249153 263061 272838 250765
19607 250765 267335 242072 204002 217735 251752 260669 298959 320798 303399 258044 217628 220797
19595 220797 219116 252741 255728 227699 230998 219187 251696 272197 265501 233610 247263 240116
19583 240116 219027 236720 280102 297486 284655 305417 331669 329453 312989 245898 235501 274993
19571 274993 286429 261651 321524 344044 369836 308377 259000 246209 253158 248276 200011 202504
19559 202504 170602 163050 174142 190322 211947 212196 166469 100833 79650 121216 174867 200293
19547 200293 193964 216399 221357 220462 271052 301409 258671 252168 254937 234123 221818 266539 279249
19534 279249 299741 265504 235549 221283 250324 273835 282625 250779 212035 193281 164605 144995
19522 144995 168666 214685 240179 241029 227820 207098 180435 232979 341869 402983 417304 376716
19510 376716 345148 425851 522536 541171 532819 495227 470928 450193 421222 433755 450278 514206
19498 514206 552895 520376 456949 443292 419488 341078 297009 282504 279594 241974 218655 237042
19486 237042 254052 231322 239976 288290 289621 308070 300841 269167 221209 156157 144216 140181
19474 140181 119383 142376 168068 170383 173488 177616 157240 188881 180141 153456 152466 172536 207072
19461 207072 228374 219227 234125 197271 124244 98677 92949 146193 111281 53750 36458 57216
19449 57216 109681 165619 144413 137691 76735 83969 103129 79992 81248 105892 136260 145548
19437 145548 84102 61568 102524 127063 122175 105547 123779 140816 127286 101367 104081 140173
19425 140173 108966 48087 23502 121191 181458 182507 132538 83156 88896 154097 147813 126420
19413 126420 127143 81052 61049 117777 119162 94257 68883 45196 73960 135688 184604 201386
19401 201386 158273 159076 191066 199744 176850 161753 149557 151461 148482 157305 143320 152195 106180
19388 106180 83971 130725 120600 156748 138292 116379 82959 44604 66914 82210 87646 74440
19376 74440 83902 125478 99626 75348 61706 62866 60761 92526 104553 97783 75161 39465
19364 39465 4292 15034 81056 108595 171971 165117 136164 132596 126629 106199 88120 124429
19352 124429 148022 161283 144586 134052 153402 170090 142888 112656 103818 96350 55868 9081
19340 9081 10463 -21972 9711 62251 57646 47063 80501 51113 32394 51757 106150 134418
19328 134418 126693 103799 128080 132385 134909 102144 73155 84266 37007 22997 40678 70069
19316 70069 62975 29669 -17535 -26005 2503 36020 29415 66674 44057 40528 64308 82716
19304 82716 107453 91637 44409 37912 26130 36968 24614 44084 62973 65373 39650 13598
19292 13598 16071 18581 62581 56369 77421 60744 42530 46318 76928 63107 86299 107941
19280 107941 120569 165091 108784 77592 36465 57962 132366 107196 61429 16484 19890 46347
19268 46347 -3790 -27127 23103 103414 103727 98788 49199 9095 19799 43310 43385 72457 43752
19255 43752 9260 66313 82690 67903 60406 25948 -10743 -4544 -14522 2517 29237 31618
19243 31618 34998 4264 2778 54247 64494 71140 42711 -1036 -29043 -12262 22468 57909
19231 57909 37221 -14031 -23759 21507 32382 50522 83110 105998 145290 121086 87531 91278
19219 91278 92320 115666 70991 36262 61250 26964 56127 78494 81350 78726 41766 -8343
19207 -8343 -32063 -1696 30641 34709 -26325 -13961 -8810 5638 27191 56767 55464 43078
19195 43078 77757 90466 117526 73775 6416 25068 56338 58586 82371 71348 85864 43008
19183 43008 1765 -20778 -16954 -6515 -8856 44401 85460 48747 34497 27581 27650 24590 29348
19170 29348 46617 30769 -11903 50658 71071 52277 45724 31546 -6759 -27552 8606 7229
19158 7229 18622 18160 10044 30426 3300 -6869 15240 18718 25456 36926 1162 -10581 26977
19145 26977 45755 112745 123176 115732 88818 52572 33975 22295 21749 29715 39137 56891 58764
19132 58764 78345 105152 123888 96772 75015 96055 94247 72898 30551 740 -2954 5588
19120 5588 -14347 20456 35085 -25144 -33016 11997 49254 4103 -38052 -75975 -90213 -48527
19108 -48527 -11977 -41483 -29408 4187 51390 91049 61072 16679 33799 57626 21764 11976
19096 11976 -15216 -4491 51438 68618 44888 63145 36685 46186 8397 29500 78729 69363
19084 69363 15701 -55704 -55402 -45662 19530 67599 76911 97977 118263 74827 64300 3597
19072 3597 6235 22427 34701 57913 27851 -3584 8732 38568 50993 -10470 530 -11579
19060 -11579 -15209 -5282 9483 17155 23456 63504 55589 -10369 -9048 -7198 3557 10926 39062
19047 39062 17671 -16902 42634 28576 -42647 -25602 10683 -21575 -27902 19219 8023 -3962
19035 -3962 7445 35978 43758 38944 29353 43092 32819 -4061 -40609 -25462 10051 47476
19023 47476 14640 -5488 -8560 23081 62268 34029 50137 58526 40127 26562 -2718 -12481
19011 -12481 -34 -864 -18313 6368 76957 78405 58060 48535 39407 68435 101004 113702 115913
18998 115913 85966 86453 89523 74082 45695 34849 61781 29466 13839 4367 22695 -4801
18986 -4801 -35571 -56376 -55644 -71709 -80636 -55839 -28057 -43451 -67406 -100113 -110559 -46579
18974 -46579 757 13618 53467 63989 10363 -22362 -8541 10850 27917 11009 14 -5573
18962 -5573 -47598 -21858 30539 42551 17717 51563 47178 42027 42553 24065 3704 57688 30141
18949 30141 -17069 -12558 -5472 -13970 35943 59001 37718 1187 -11782 -12524 9164 27176 51041
18936 51041 35573 3196 -26210 -22638 -5886 13088 32499 35553 21576 -6273 -17189 -40586
18924 -40586 -40861 -61970 -43646 -13292 -23868 21391 64096 75352 135966 117047 42931 50462
18912 50462 61709 46198 22582 26807 -6967 -14122 10776 14978 28620 31647 17133 -9392
18900 -9392 31321 23853 -11704 -19954 -45372 -9340 23177 72095 93479 93302 77968 50118 13288
18887 13288 38970 -15263 2584 25919 53233 70957 95338 57535 75864 83668 93803 69110
18875 69110 106117 99089 88563 101796 22825 -13501 54946 63794 23193 62005 120524 131868
18863 131868 122491 53763 22467 48307 20661 21098 60915 91866 80353 39572 -9908 -47028
18851 -47028 -18533 13325 -5179 28531 4512 -35106 -45527 -44119 1157 -19288 -13651 18909
18839 18909 69691 99240 92925 61625 27757 28989 95323 101858 137817 150701 169126 124052
18827 124052 69866 33021 -32643 -24366 40652 70371 83180 24296 -6282 4385 6571 51014
18815 51014 57783 -4186 -5547 93897 105675 61935 2794 31015 20239 -13097 5634 9885
18803 9885 61398 70018 61753 24314 19381 25296 27776 31207 9785 -24952 -56892 -18857 31584
18790 31584 -2515 -3305 39713 21241 8221 317 25942 9256 11506 40141 12197 -17208
18778 -17208 -4401 19317 -176 24015 19517 -15078 9612 45825 58068 34632 47516 49616
18766 49616 -6912 -12761 -36563 -27788 24760 9882 12084 3095 -1487 -4400 34280 60063 55037
18753 55037 76512 92327 48672 68688 93057 69039 99212 112154 100498 75124 31945 -6937
18741 -6937 -9310 25691 85565 112445 86099 9189 5317 18870 19136 31873 16812 53415 79455
18728 79455 96784 142634 172804 156719 175295 191235 160472 116089 91617 110837 115634 128009
18716 128009 167032 184261 182353 128129 112523 138292 197659 222764 231328 239145 229331 170309
18704 170309 151738 201446 284156 306318 294353 263036 308237 320310 310640 278454 239272 238094
18692 238094 295754 326905 283775 250660 243978 278144 288747 330589 374368 404711 337896 259286
18680 259286 246449 267856 283313 319309 306628 324411 350331 320520 331130 320768 328340 319344
18668 319344 348046 383258 400534 382008 376572 394161 363133 324092 315138 331830 347678 320030
18656 320030 342270 379214 327103 309031 319958 324509 316109 344119 400151 434005 482936 483080
18644 483080 448081 418528 386914 340595 301971 298350 296959 298213 303035 294968 268987 280509
18632 280509 294661 244416 250783 323042 353855 394620 381917 367317 347731 347777 326213 301637
18620 301637 289455 247492 216592 240280 281563 213373 129315 148251 206417 189793 158070
18609 158070 205728 265948 183316 103230 124162 205182 205904 176655 140660 146844 154842 178385
18597 178385 197143 196402 196404 221090 241940 195718 159209 189064 199548 192776 166300 159830 161058
18584 161058 180571 161609 115078 111280 131362 163963 185418 186348 162233 157319 189370 181783
18572 181783 171945 183401 215404 248725 228961 195932 191246 193923 170936 135486 120946 118315
18560 118315 136783 116079 75908 33860 -1559 30010 78906 86336 53602 11941 40376 83117
18548 83117 93737 127942 141314 130551 116912 90879 134975 118709 113375 145430 198913 150189
18536 150189 93024 110234 119221 104264 78790 95631 104739 86500 76044 73592 100860 101193
18524 101193 72197 75472 123846 127708 113818 121472 135517 135791 98632 75314 77770 82502 46970
18511 46970 122189 150822 141286 121921 78325 69682 95738 111996 139851 153227 121772 120532
18499 120532 73702 104495 144204 137250 127922 135573 163571 187927 190508 122450 100715 149209
18487 149209 154099 203376 181904 133094 153175 181845 137440 116230 102839 134002 150425 162501
18475 162501 165124 162191 185244 185796 205735 201474 168657 185186 186821 198062 200643 189975 157256
18462 157256 153563 162890 170996 177982 135515 141591 155506 182466 203763 193689 189748 142961 155319
18449 155319 143671 107234 136308 147384 120001 148508 173390 189285 215175 234529 242589 254543
18437 254543 212156 222032 235532 226153 212140 273326 245636 128392 76186 91304 132645 180596
18425 180596 189541 202934 209836 261059 294906 238923 220542 216660 223076 196209 160733 185076
18413 185076 185951 176997 177197 159941 205221 263177 235798 187505 180046 183903 175639 188962 161233
18400 161233 163937 193241 198699 252793 264151 248023 239233 215088 238935 298482 302578 302547 299388
18387 299388 269017 292022 293204 310701 310790 366539 373809 370792 368730 373912 353271 374017 375279
18374 375279 348485 349432 328320 321218 372802 406271 390791 390787 420090 424644 433368 423339 351395
18361 351395 331333 359232 361943 366604 425339 408335 383492 400188 435487 481924 497982 540668
18349 540668 549402 591932 595522 608025 643788 688929 705205 649559 575540 553713 525682 518342
18337 518342 521300 535923 545802 559814 546795 549642 589076 543146 524652 597485 616695 600214
18325 600214 594798 575675 578796 577441 601680 647104 633678 632423 661011 675643 709290 726064
18313 726064 725063 705180 663508 643822 671608 663299 689399 698648 674350 707602 745852 737037
18301 737037 734671 755748 757425 788142 818253 818121 860930 909296 933757 935145 909833 881589
18289 881589 893955 873162 875570 841854 818708 754757 737957 763565 800334 764185 742417 823677
18277 823677 847118 841938 813716 803598 819751 873853 886246 917809 947521 941683 901669 854252
18265 854252 855516 869951 861843 851788 849826 923982 1011573 1071842 1080144 1086253 1082717 1069148 1099462
18252 1099462 1127160 1103244 1095219 1078759 1082217 1112372 1124482 1137242 1157463 1148430 1153937 1170634
18240 1170634 1193002 1172440 1181320 1240202 1281167 1280978 1267706 1297906 1298415 1300066 1318932 1290700
18228 1290700 1281552 1352856 1419202 1448113 1503876 1523370 1557353 1620215 1724478 1847845 1925312
18217 1925312 1988569 2095839 2191474 2243871 2330415 2441498 2578015 2724764 2922023 3211855
18207 3211855 3547685 3853063 4244387 4749533 5440125 6261629 7261298 8540238 10062459
18198 10062459 11963517 14308030 17065716 20120104 23479255 26998467 30498680 33722990
18190 33722990 36394851 38344052 39407050 39448253 38446361 36621833 34380428 32085819
18182 32085819 29944194 28164300 26859163 26213385 26336931 27209803 28837407 31043678
18174 31043678 33760021 36722248 39643351 42354908 44382759 45526317 45665592 44578023
18166 44578023 42335191 39261731 35789500 32238647 28708510 25337476 22243495 19617434
18158 19617434 17415576 15613080 14153352 12964088 12030246 11349370 10866287 10491142 10231039
18149 10231039 10062991 9980455 9980226 10130005 10410411 10804571 11401210 12196866 13259253 14608378
18139 14608378 16270042 18285968 20712830 23551419 26675011 29967583 33304459 36491378
18131 36491378 39220783 41293615 42489390 42626033 41654448 39787963 37385345 34861400
18123 34861400 32456541 30289627 28649611 27636304 27345538 27884526 29188760 31132250
18115 31132250 33570095 36305405 39050970 41609689 43679319 44933998 45176779 44301635
18107 44301635 42285152 39348342 35891251 32254778 28591692 25098261 21896372 19081789
18099 19081789 16658350 14656291 13044838 11714715 10620549 9794999 9110948 8514533
18091 8514533 8001816 7556676 7164458 6832898 6564434 6320242 6026457 5843200 5683816
18082 5683816 5505997 5281993 5032790 4787794 4598665 4440871 4250244 4041446 3813567
18073 3813567 3588197 3410329 3246872 3102475 2936020 2736895 2588525 2461153 2299408
18064 2299408 2147477 2014767 1909178 1816893 1719552 1653455 1559566 1470762 1437920 1433800 1408258
18053 1408258 1346903 1274278 1201592 1162097 1107069 1039885 1009748 1020499 973199 901312 849368
18042 849368 810200 766336 765489 750315 695836 666187 664920 673644 682335 671908 668905 638209 663804
18029 663804 689080 665646 668474 637476 565504 533403 582964 565991 559044 590717 591043 552351
18017 552351 527605 491924 462712 476166 455844 417863 465594 461036 412586 363256 374724 388105
18005 388105 393369 404073 393703 347625 347548 346109 339427 297285 266935 309127 376350 383489 380596
17992 380596 326212 300146 304767 321869 338223 339342 319254 283966 277533 307252 333726 274583
17980 274583 282323 309682 334252 353043 357270 315753 340253 385495 404726 356298 331720 327407
17968 327407 326353 327949 306764 292345 295693 348270 340375 343661 332182 316797 341690 312230
17956 312230 315439 298031 342050 338860 351764 298545 277309 312202 289242 259441 294135 330865
17944 330865 345236 363171 358674 317089 322711 339952 324024 293626 261146 288457 304180 302236
17932 302236 302207 316745 334387 329342 363812 342896 300935 302391 323051 369776 410156 467518
17920 467518 531589 569390 580909 599148 580457 524975 510726 536146 564165 553332 492272
17909 492272 459181 474795 433288 378212 407724 427723 452553 487492 524637 517664 493835 484768
17897 484768 476776 503855 542413 558329 524151 522540 593899 623883 595443 560104 564243 570517
17885 570517 563383 526989 489544 469019 512765 570373 551043 526463 527693 538075 552810 558732
17873 558732 556064 606329 607805 632582 651910 650003 682074 736698 797513 830830 825180 823859
17861 823859 808805 811632 872704 907048 933579 955465 980052 998568 1005153 975122 909477 894439
17849 894439 976982 1008833 999858 986690 1011780 1036382 1055010 1078420 1114147 1099348 1092428 1141393
17837 1141393 1173944 1183325 1211468 1266978 1276000 1262900 1274574 1292545 1344346 1350611 1416518 1461793
17825 1461793 1497308 1567268 1648391 1699810 1763148 1869112 1930361 1981392 2108452 2240887 2356788
17814 2356788 2514657 2728241 2964249 3216725 3497162 3859245 4304700 4870234 5558018
17805 5558018 6402786 7427293 8703402 10323391 12333425 14711279 17523690 20724829
17797 20724829 24123838 27648265 31272025 34876553 38215410 40973638 42910883 43630440
17789 43630440 42888357 40912232 38293474 35579157 33116608 31062865 29426698 28276820
17781 28276820 27684823 27786400 28583147 29938423 31765760 33975247 36365071 38702224
17773 38702224 40723064 42185428 42764482 42247421 40474736 37640810 34436908 31252989
17765 31252989 28218241 25402188 22794094 20368261 18167565 16305993 14814687 13670190
17757 13670190 12843416 12229062 11900967 11682284 11631466 11712979 11980721 12497967 13272298 14326126
17747 14326126 15721509 17491480 19686592 22309046 25292053 28557875 31937697 35395943
17739 35395943 38852249 42069849 44839864 46714108 47290606 46371545 44099003 41162946
17731 41162946 38173555 35553003 33288464 31341534 29832296 28915942 28744746 29288355
17723 29288355 30437192 32114547 34085714 36254707 38430652 40374742 41754116 42250433
17715 42250433 41620604 39780575 36945643 33709944 30415760 27265636 24332595 21596165
17707 21596165 18958280 16554984 14526865 12833447 11482057 10403610 9519661 8793041
17699 8793041 8228184 7787029 7396023 6998012 6651590 6315678 6029303 5828847 5630192
17690 5630192 5464078 5265887 5042139 4803765 4640528 4452725 4251214 4020318 3816738
17681 3816738 3619082 3442935 3220544 3067138 2940716 2806624 2657401 2549494 2433206
17672 2433206 2285759 2173243 2071675 1998303 1925758 1876533 1778386 1722351 1685158 1628781 1553087
17661 1553087 1493544 1465479 1441202 1341380 1234793 1113802 1105226 1081584 1037996 1018649 945010
17650 945010 930355 911522 908910 889254 847219 800709 758784 721330 694599 655958 630172 598277
17638 598277 593309 554913 475188 480283 458293 468299 478507 491201 436458 406852 407590 399894
17626 399894 400349 402954 383674 415629 427027 388460 413775 436696 429052 431836 413942 405182 389327
17613 389327 387371 414807 423426 477228 477364 461596 468508 483711 480988 477704 465568 478158 477794
17600 477794 483168 438202 417887 451735 432908 385631 396867 398536 388858 382459 378294 399994
17588 399994 404436 396156 398369 414299 404857 405189 447934 438109 470709 483177 474149 416361 366506
17575 366506 332934 343399 402751 382454 375744 378539 386104 389069 391271 417403 416718 462639 481504
17562 481504 469260 471652 473290 468275 465417 478225 491763 476906 405889 392337 421126 463168
17550 463168 443745 432226 440101 460449 461017 507685 528071 512093 487663 468133 458083 504012
17538 504012 478316 412463 407668 384432 336018 342150 335528 316566 306457 338655 326479 380958
17526 380958 399641 413109 394498 384743 318714 322728 344566 350400 354866 337227 360704 362600
17514 362600 331013 341126 366433 351312 334886 369995 415760 419070 412818 386210 373137 398233
17502 398233 422521 436082 456346 396743 382275 433671 442134 427011 395285 431019 416005 401160
17490 401160 426878 396676 380916 398996 348517 322875 314957 320805 295216 272801 239690 247465
17478 247465 264548 256870 190968 147565 161656 205236 220394 209908 225022 223605 265454 279317
17466 279317 260893 251148 223272 185170 167744 174752 169994 142920 150690 162504 158562 150505 97833
17453 97833 93790 108874 133585 148965 118950 95198 140812 160648 129492 81669 85620 67766
17441 67766 50835 51057 86978 83505 82486 86368 107013 110038 110382 104335 91274 104014 118982
17428 118982 171272 142564 91851 64377 37166 13319 7193 26196 81611 96001 82386 105315
17416 105315 120532 82820 27673 25826 29776 39331 14656 4972 17237 41418 54286 25786
17404 25786 -14639 -629 30989 -17663 -30049 -28297 -11767 -16313 -39986 -12343 29439 13109
17392 13109 23445 33478 -4144 -5712 8963 43537 17884 484 18945 17022 37761 41299
17380 41299 -4394 -57947 -25828 2784 -26244 -59969 -27430 -34725 -33088 -20942 -37476 -10873
17368 -10873 17944 7841 15328 47796 37320 -5289 -35059 -50864 -60282 -63111 -41250 -39993
17356 -39993 -7266 1388 1740 39254 41079 22850 -13092 -13676 -44166 -75656 -90183 -63719 -45737
17343 -45737 13591 3650 -82141 -65871 22780 33532 17908 -6859 -10763 -36373 -71769 -57970
17331 -57970 -58249 -64795 -45944 -26620 -48726 -64471 -81000 -77136 -79498 -90753 -58782 -15776 -7518
17318 -7518 5864 -16610 -30967 -6651 7986 -37125 -54630 -57734 -85615 -111786 -92498 -38084
17306 -38084 -15074 -21175 -30939 -7849 -29120 -81514 -91057 -75403 -46726 -37270 -65091 -35481
17294 -35481 -3330 -8724 -24665 -45216 -4103 19515 66949 40796 -20109 -22315 -10732 -21483
17282 -21483 -24080 -4978 53363 78233 81882 31792 22649 81710 67181 63473 104420 128971
17270 128971 133443 131571 141383 139086 130776 102902 57017 71901 80439 57327 89791 117353 100936
17257 100936 149704 186969 191739 203676 177939 174492 139668 131392 123342 97637 80704 103259
17245 103259 83844 76823 58462 7829 908 27292 33697 23300 23711 -1001 -41402 -67420
17233 -67420 -60947 -22291 -19801 -9677 -1652 23641 71305 62749 45470 23592 22699 31853 67694
17220 67694 146826 149845 102265 67675 79808 148576 190550 177061 164169 167193 173243 156485
17208 156485 130637 154444 115272 61493 25251 11310 22750 28358 77860 110899 111795 141288
17196 141288 146614 128028 100771 52971 33560 49853 56491 26259 -941 -27481 -18971 5770
17184 5770 -28070 -56195 -76674 -96593 -94460 -92850 -83990 -74985 -94831 -98213 -85164 -89001 -106401
17171 -106401 -125419 -77203 -15862 -18566 -15631 -15812 -23588 -16180 18023 -56888 -73071 -73367 -129904
17158 -129904 -174116 -121086 -106088 -138128 -127150 -69209 -31020 -56417 -48007 -56725 -66059 -90865
17146 -90865 -105049 -106484 -91726 -60377 -71321 -55418 -40267 -33378 -42582 -44345 -66648 -125160
17134 -125160 -108406 -89886 -44916 -58058 -63404 -54093 -89187 -86532 -58245 -78262 -125623 -151099
17122 -151099 -124551 -102026 -110899 -120942 -110636 -55004 -19759 -60932 -110503 -126900 -126888 -110646
17110 -110646 -114219 -139611 -116462 -97103 -102254 -101822 -97531 -67899 -54441 -112092 -123806 -81929
17098 -81929 -61642 -41596 -47537 -60258 -61569 -89955 -111426 -110800 -96083 -87173 -53632 -55961 -43240
17085 -43240 -71932 -83503 -113840 -94995 -10422 14192 -4800 -17991 -34921 -40022 53416 84021
17073 84021 2078 -33399 -49274 -80853 -101992 -137659 -138865 -81288 -34194 -56392 -45817 -5933
17061 -5933 37407 13447 -33878 -68152 -110076 -129175 -119590 -93982 -94904 -76672 -63653 -82386
17049 -82386 -108710 -66354 -69831 -85269 -99637 -94385 -70753 -64378 -56434 -62665 -54546 -58315 -47674
17036 -47674 -58120 -54257 -41217 -13827 -13471 -15481 -44298 -73674 -88849 -79766 -80882 -50008 -52207
17023 -52207 -87432 -82426 -99169 -119723 -133283 -116116 -56142 -56349 -60778 -98626 -73722 -86175
17011 -86175 -92524 -77216 -52457 -51724 -56535 -72236 -52068 -55735 -77645 -108312 -100699 -79362 -78770
16998 -78770 -86992 -87615 -42412 -42235 -81372 -105597 -116007 -74774 -93090 -79992 -49372 -70909 -94806
16985 -94806 -77098 -99045 -100431 -94720 -17418 25982 -53950 -103950 -126944 -125643 -92773 -79071
16973 -79071 -85332 -74274 -62513 -62332 -90912 -70529 -45962 -54598 -75841 -56870 -64784 -68475 -58769
16960 -58769 -72108 -94954 -59200 -74371 -59319 -74945 -64212 -80021 -125679 -167419 -146534 -138745
16948 -138745 -115454 -87353 -79092 -70387 -70760 -76109 -102640 -122785 -121093 -140548 -147752 -144121 -92202
16935 -92202 -55246 -53961 -59025 -39570 -43770 -48569 -74003 -60573 -77490 -122054 -156501 -149620 -142593
16922 -142593 -107995 -41871 -24117 -63149 -84692 -82158 -100676 -124812 -143463 -134303 -102808 -61443
16910 -61443 -58971 -87125 -119597 -117136 -108542 -89627 -55953 -29682 -47147 -67399 -51867 -75782
16898 -75782 -101634 -106963 -87558 -109227 -120487 -134769 -120758 -86688 -70670 -71515 -47069 -64339
16886 -64339 -74635 -78173 -89751 -59243 -15310 -20166 -48090 -79051 -73651 -111695 -170075 -143582
16874 -143582 -93048 -103360 -141656 -144766 -140336 -154677 -103735 -45726 -13344 -32970 -88934 -143764
16862 -143764 -152328 -111433 -67190 -81924 -137182 -101940 -86228 -83236 -54596 -22456 -53863 -80564
16850 -80564 -61253 -37221 -2953 -736 -1832 -6684 -32269 -65849 -99030 -70818 -80857 -61021
16838 -61021 -73749 -114609 -105609 -87683 -106835 -118659 -97047 -74132 -105495 -121819 -150551 -193963
16826 -193963 -163046 -133539 -137048 -158946 -178074 -187515 -178820 -167699 -135729 -115087 -126898 -127209
16814 -127209 -119258 -145101 -211871 -147842 -114558 -126033 -145976 -145069 -118719 -92839 -72074 -113805
16802 -113805 -163591 -170330 -172341 -158179 -120653 -61150 -60555 -75819 -83896 -81938 -84707 -78989 -74398
16789 -74398 -56044 -23891 -20247 -15914 -50522 -49861 -53526 -77499 -101421 -130462 -123436 -137385 -108317
16776 -108317 -119066 -150796 -139242 -104017 -149946 -136619 -113429 -106313 -95563 -71243 -77439 -48014
16764 -48014 -70528 -94499 -73959 -59698 -72351 -103285 -126287 -118989 -84567 -60348 -44866 -48750
16752 -48750 -61890 -66067 -82694 -148413 -188152 -161952 -70731 -53062 -64985 -45087 -27308 -71223
16740 -71223 -127241 -127771 -131906 -94235 -66409 -93665 -154572 -148616 -154046 -170284 -121380 -115021 -124856
16727 -124856 -104383 -84661 -101647 -93765 -104811 -139782 -136566 -93663 -109932 -118592 -138264 -118156
16715 -118156 -76486 -65817 -50884 -39774 -64563 -62980 -65050 -67861 -72848 -69776 -76903 -96987 -122583
16702 -122583 -112836 -97778 -125740 -178735 -169451 -153153 -162069 -183052 -202056 -158661 -143235 -105298
16690 -105298 -76155 -85740 -132547 -160045 -129187 -84522 -68632 -79994 -69453 -63706 -60525 -40239
16678 -40239 -105008 -120285 -124304 -99723 -152233 -149297 -97076 -94091 -106509 -98047 -161214 -216341
16666 -216341 -193919 -153989 -143708 -137297 -127691 -102097 -78072 -91719 -131529 -115847 -87027 -112535
16654 -112535 -143836 -124278 -107208 -112361 -127167 -109128 -141473 -127108 -91647 -65898 -56552 -83857
16642 -83857 -104512 -70654 -88287 -67474 -64305 -71410 -60603 -77737 -86105 -62344 -64175 -61181 -88850
16629 -88850 -103970 -81286 -99064 -130425 -110282 -59023 -43097 -111618 -127458 -106600 -87819 -102621
16617 -102621 -100535 -108611 -90856 -66982 -75099 -114772 -154058 -131831 -72720 -51575 -92316 -91727
16605 -91727 -145291 -150710 -122874 -57566 -17929 -63313 -88902 -95425 -113446 -144888 -159954 -180725
16593 -180725 -183405 -164201 -180309 -161528 -124301 -118174 -167846 -211447 -184807 -115709 -130610 -121805
16581 -121805 -95590 -98567 -155293 -138594 -115456 -137199 -95407 -65379 -57179 -66577 -64581 -78858
16569 -78858 -84452 -68495 -61445 -23393 -44168 -92484 -102684 -123429 -132421 -101235 -93814 -105041
16557 -105041 -86539 -47753 -86604 -124638 -106253 -103282 -92026 -54204 -29815 -73622 -84947 -107017
16545 -107017 -103391 -113184 -134319 -134353 -115249 -106632 -100468 -74115 -61873 -75941 -56820 -41868 -62085
16532 -62085 -79499 -109029 -100031 -77386 -78859 -92984 -55953 -70783 -68733 -85895 -108271 -132617
16520 -132617 -91987 -43249 -92788 -132033 -136308 -146799 -103761 -132394 -162624 -177023 -142310 -141814
16508 -141814 -157118 -130330 -82736 -67533 -103078 -115991 -107663 -103210 -63601 -55092 -65058 -79827
16496 -79827 -52263 -66384 -54345 -45220 -29634 -17083 -26840 -54887 -89209 -84029 -54593 -65487
16484 -65487 -43943 -76150 -66673 -34165 -53055 -91427 -77215 -70674 -74705 -74836 -62678 -71741 -90475
16471 -90475 -78820 -108318 -161117 -145624 -131063 -122677 -85402 -63911 -112871 -88840 -80583 -57930
16459 -57930 -44286 -27549 -51653 -69566 -49670 -30830 -36945 -78484 -179000 -165210 -114332 -74238
16447 -74238 -60579 -70875 -104173 -117940 -87120 -98302 -109621 -106143 -88379 -92160 -128660 -149422
16435 -149422 -120448 -108452 -79178 -47640 -68324 -69136 -74428 -80322 -137722 -144544 -84263 -61702
16423 -61702 -87036 -97386 -49643 -77434 -99704 -83300 -100750 -143116 -157266 -169611 -182811 -165986
16411 -165986 -145771 -105629 -104802 -102723 -56859 -44719 -66599 -69143 -105872 -126877 -134571 -121291
16399 -121291 -97373 -57418 -52614 -65178 -76556 -92069 -90909 -89542 -104148 -138216 -149880 -130881
16387 -130881 -95337 -101993 -80928 -72961 -62046 -59382 -59839 -114497 -109929 -96596 -101485 -118726 -138967
16374 -138967 -109179 -135017 -165912 -152099 -165009 -166445 -180990 -136635 -83651 -50767 -92111 -142057
16362 -142057 -156870 -142436 -134080 -96444 -41212 -16070 -43268 -42823 -36604 -89541 -79895 -82138 -112859
16349 -112859 -135515 -92996 -51306 -30308 -47575 -94691 -72311 -89704 -112904 -150627 -159298 -118607
16337 -118607 -95393 -84462 -55028 -45816 -75518 -80713 -57534 -95123 -113037 -91107 -41595 -43957
16325 -43957 -36703 -60783 -75271 -68516 -49561 -62565 -86124 -81283 -45834 -47752 -64954 -32726
16313 -32726 -42320 -51707 -63250 -45900 -95643 -111780 -99466 -87981 -108534 -109705 -108169 -92777
16301 -92777 -63465 -76494 -133698 -179654 -150634 -119955 -90612 -56423 -95950 -94938 -107967 -181011
16289 -181011 -167967 -129297 -109839 -43850 -40475 -32723 -69308 -119840 -133650 -147466 -110915 -120987
16277 -120987 -123682 -84015 -118056 -115979 -109624 -94072 -71214 -90179 -142654 -86712 -32178 -73040
16265 -73040 -98099 -52513 -67749 -114611 -142580 -136666 -128829 -112975 -111565 -100543 -89331 -90539
16253 -90539 -114302 -133682 -100519 -97732 -85659 -105104 -125210 -96115 -105272 -88827 -89155 -40985
16241 -40985 -66927 -145597 -212355 -178437 -137915 -109635 -96307 -104544 -85684 -88699 -98592 -118655
16229 -118655 -96538 -83355 -60216 -40371 -15264 8388 -11996 -61510 -122681 -86604 -62227
16218 -62227 -31311 -25369 -39675 -33360 -54241 -78192 -68289 -59651 -52400 -78332 -108922 -114987 -189881
16205 -189881 -198259 -128422 -117019 -102365 -104577 -100466 -94999 -130675 -157156 -127938 -63541 -67854
16193 -67854 -68430 -69419 -81785 -38790 -22575 -6316 -44853 -97018 -95116 -118815 -124148 -101427 -75033
16180 -75033 -49646 -81087 -126859 -134875 -80614 -53447 -104574 -83564 -14616 7558 -13944 -50878
16168 -50878 -93679 -91632 -87702 -64960 -27711 -50320 -79088 -107624 -112218 -114725 -105415 -78103 -75540
16155 -75540 -58790 -18738 -2525 -11431 -11320 -13858 -46759 -60404 -65001 -99134 -75303 -71169 -98271
16142 -98271 -111116 -60073 -15678 -38181 -54026 -77535 -97321 -93003 -87897 -91105 -48349 -55450
16130 -55450 -74325 -72379 -62958 -86989 -117262 -90661 -117733 -102753 -71633 -70181 -91599 -124014
16118 -124014 -107163 -65359 7863 25145 -10374 -27558 -58177 -79475 -76743 -103523 -134671 -111782
16106 -111782 -95056 -140120 -157932 -160170 -141398 -80820 -106371 -142871 -118577 -96388 -101794 -112581
16094 -112581 -126192 -119335 -154036 -116751 -101792 -105365 -93263 -74591 -85773 -79645 -79933 -89985
16082 -89985 -96272 -116690 -106645 -126544 -158457 -99560 -77372 -108894 -67226 -63707 -50660 -95152
16070 -95152 -99615 -83597 -84988 -103249 -111168 -116531 -107344 -74334 -43311 -47703 -88721 -117527 -129401
16057 -129401 -90178 -108505 -89982 -42613 -39757 -44189 -70452 -85865 -120583 -102667 -79292 -78259
16045 -78259 -81111 -52034 -56057 -69002 -69289 -134192 -167175 -170711 -143596 -172179 -159979 -152579 -123079
16032 -123079 -118199 -114360 -75600 -45218 -8936 -49890 -47330 -31703 -63837 -41724 -45537 -52640
16020 -52640 -64129 -68118 -108464 -122121 -72955 -82229 -77478 -64569 -22512 -10404 16636 25581
16008 25581 42084 18746 -21548 -5466 17813 5714 -46791 -84345 -121858 -125136 -73210 -55809
15996 -55809 -67453 -65547 -123763 -143222 -83105 -12656 -10971 -4947 -1118 -20684 -40017 -41019 -82655
15983 -82655 -117302 -120180 -132829 -111457 -81542 -101219 -85229 -46867 -12708 28038 23730 2985
15971 2985 11338 24269 -12399 -45798 -73152 -79240 -65742 -47393 -62483 -64800 -34071 -14059
15959 -14059 -1450 -14311 -31621 -30398 -67910 -52972 -56082 -56034 -65824 -56999 -72317 -45784 -37325
15946 -37325 -80377 -102474 -67832 -52110 -35772 -27305 -55680 -58388 -45832 -80446 -96249 -76403
15934 -76403 -96719 -79162 -68545 -58853 -74374 -98116 -104037 -102014 -83756 -96512 -85124 -104499
15922 -104499 -101456 -78902 -35860 -46927 -56251 -34186 -29492 -42615 -23848 5247 -16955 -50499
15910 -50499 -30597 -35166 -51852 -69027 -85017 -105847 -106150 -55847 -73325 -62108 -5426 67729
15898 67729 48106 -25160 -50019 -63356 -5057 -67388 -126342 -95793 -120689 -96747 -65803 -6470
15886 -6470 -16040 -56810 -49960 -38860 -47253 -63509 -80924 -11582 2758 -21311 -26011 -26270 -19771
15873 -19771 -36086 -50131 -27050 -17757 3570 -7182 368 -54003 -97004 -23759 -9558 -30614
15861 -30614 -59837 -32789 -35737 -22497 -8630 1176 -24047 -84596 -74015 -68070 -49933 -21368
15849 -21368 -17235 -38296 -33956 15080 26997 20251 -207 -3771 -26136 -25106 -39406 -89556 -102430
15836 -102430 -65414 -63414 -72307 -76379 -75610 -34599 -32846 24815 92958 40517 3301 -14792 -29737
15823 -29737 -84678 -104560 -122890 -74052 -79006 -141427 -156799 -80211 -48934 -84395 -74120 -46668
15811 -46668 -10607 -17912 -7249 -7700 -57423 -30223 -12215 -13516 -39193 -27198 15037 43515
15799 43515 12365 -35355 -48029 -24977 -22185 -32523 -18335 -23452 -39304 -85081 -71240 -58839
15787 -58839 -10988 43723 77294 81318 46405 20311 12530 40422 70665 90376 52903 43014
15775 43014 -20327 -20632 37560 32901 28634 81916 143726 232847 303555 331664 377176 520165
15763 520165 712852 975618 1328300 1862813 2718199 3932846 5420217 6857132 7991158
15754 7991158 8435837 8031909 6283753 4176194 2682670 1885473 1425227 1128948 959467
15745 959467 802180 675671 599621 526108 470713 484249 509701 458011 390804 337445 307415
15734 307415 333884 370200 348415 285781 282370 302272 322137 331877 384103 364296 330032 316524
15722 316524 282135 248774 252923 266326 242199 226306 167417 146396 106827 97590 74463 59112
15710 59112 59928 68090 50964 26105 65605 93905 86831 85487 91133 86282 86037 84774 79363 19832
15696 19832 -7868 13877 -32919 -54828 -41580 -38581 -47974 4414 25037 37644 53794 49211
15684 49211 2400 -23009 2764 14036 -22620 3458 28345 -6558 11072 7436 -30909 -20126
15672 -20126 15553 29340 15622 13069 22081 12060 18678 -23912 -32944 9574 8862 43963 30056
15659 30056 36712 87813 92357 87048 89459 81989 90745 77415 26908 2970 38476 70266 52954
15646 52954 50886 38792 40782 35012 -1256 26466 45711 -17822 -71484 -70086 -76867 -55905 -3219
15633 -3219 27969 46720 42980 34932 10117 13369 -762 -18151 -21976 -17552 -11025 -15448 12100
15620 12100 9821 38502 4270 10122 10592 19167 27805 10064 -46300 -45036 -52686 -46732 -34790
15607 -34790 3361 -5635 10856 13413 -32404 -25263 -16224 -9539 7284 5314 -12079 16552 23199
15594 23199 19703 -23334 1530 18898 28816 27972 25311 13740 9290 3898 -38060 -29576 -22499
15581 -22499 1361 14956 74137 76658 43734 124981 116197 84804 79340 109343 128775 169304
15569 169304 176778 141542 128779 168149 199311 236069 273346 333996 360598 344765 443674 541117
15557 541117 653311 719228 864241 977745 1062219 1196733 1344935 1485789 1565428 1580736
15547 1580736 1494057 1355812 1199630 1070788 980305 803750 654293 584235 497974 480810
15537 480810 407000 364818 348492 285414 283545 275730 311706 310836 312644 274936 241813 296336
15525 296336 316136 218432 144176 130333 155023 158926 164907 170584 165102 150834 136847 100337
15513 100337 69848 80117 58790 48245 27922 -12815 34960 70736 55484 75189 98958
15502 98958 141497 156015 171739 156398 78010 61316 102533 87771 5038 -40949 -51246 2514
15490 2514 51425 55249 58105 33879 17416 25566 32929 19386 61432 119830 122399 95106 109902
15477 109902 141498 92080 50642 29992 -6798 -7454 -2832 -6022 -15630 -12638 -10525 12065 28916
15464 28916 45705 62008 73964 87796 29335 -9468 31083 16117 8194 68994 101490 115139
15452 115139 38836 -28980 -63432 -55943 -22046 -8524 39573 36432 34115 32765 11538 11986 968
15439 968 2924 25698 51407 116154 91533 30771 40085 69252 58042 14783 -3705 -23813
15427 -23813 -5574 -310 12043 33435 25552 36400 23777 -8206 -36527 -25259 5411 36359
15415 36359 46756 44097 57680 66453 67382 36482 46323 39897 40802 69589 69963 55110 29608 30149
15401 30149 71520 77301 81387 117061 86920 31485 -15340 -8402 25445 20207 46394 44499 41286
15388 41286 51823 65522 49534 60998 85085 26708 12481 49582 53607 80266 98153 87132
15376 87132 90399 57731 31921 48293 84407 98145 158168 137234 70869 43156 54318 52483
15364 52483 102355 133531 133803 113134 83353 61219 38978 73051 110055 109668 114020 99867 89409
15351 89409 51284 28002 21638 51676 64312 63359 81803 89142 87957 59585 70982 99090 165239
15338 165239 196591 162580 128686 93190 76771 111526 84693 67417 128881 129366 87406 43507
15326 43507 36861 19100 25689 67815 59355 72142 81224 60472 42029 45563 96738 91721 147085
15313 147085 139848 66066 38762 77640 116433 121020 92070 91517 85307 7821 5162 12294 42708
15300 42708 53884 68749 127747 174408 175813 158669 142144 151352 168954 148962 176831 145086
15288 145086 139303 153624 136698 159556 194112 207456 188086 176470 166764 183956 291934 351163
15276 351163 388675 407229 437630 473462 456869 428334 449187 449404 422848 407184 367910 359548
15264 359548 339111 322151 292024 289892 248587 193748 205016 244800 255335 230087 190496 170333
15252 170333 131343 122317 103324 98273 118964 75032 87744 111036 117003 133051 98983 98093
15240 98093 113709 152718 179933 168682 188742 175501 151970 126647 163277 146330 145565 164085
15228 164085 204323 208139 169012 168989 179584 171922 238233 267816 230724 211773 243401 293149
15216 293149 323156 334902 317397 318930 356809 402490 433122 443083 450038 459933 499134 550432
15204 550432 601785 662303 729194 867048 1077391 1259650 1459025 1670684 1842937 1891400
15194 1891400 1802623 1533379 1210855 946975 821144 732203 619823 594017 607724 563773
15184 563773 506410 500155 501715 523630 493654 491981 521321 537620 581931 586349 570719 562975
15172 562975 590657 581689 555370 574447 569255 598445 679257 727307 735332 709845 721356 711469
15160 711469 675441 673234 735437 775369 804882 823298 842279 865067 840697 854467 948573 1040492
15148 1040492 1145713 1283783 1455146 1666736 1834554 1948161 2046419 2025579 1924587 1721298
15138 1721298 1463889 1327598 1222211 1163898 1077577 1070708 1122758 1041337 992762 986177 989838
15127 989838 1005787 1039164 1024070 1047671 1068401 1052822 1089138 1136120 1195958 1263713 1289479
15116 1289479 1319701 1317823 1360283 1428179 1486451 1524915 1561377 1580906 1558832 1579409 1579070 1634507
15104 1634507 1680954 1700907 1650781 1671795 1740056 1763326 1794446 1823156 1813324 1864287 1970960
15093 1970960 2045740 2063808 2085979 2093314 2108653 2178451 2265386 2296954 2319223 2335266 2385437
15082 2385437 2408347 2518870 2639917 2743086 2778110 2837912 2902606 2933850 3014585 3119260
15072 3119260 3158939 3249460 3302937 3323351 3436007 3531321 3654912 3826391 3952048 4068296
15062 4068296 4189165 4288112 4441086 4609264 4703064 4869867 5063899 5243002 5464503 5764027
15052 5764027 6027812 6285069 6620907 7005661 7406967 7882121 8377598 8943605 9549655
15043 9549655 10237670 11024811 11887448 12862904 13956730 15253231 16766327 18505615 20518146
15034 20518146 22782616 25425293 28533555 32358032 37012793 42752114 49749633 58367697
15026 58367697 69159382 82687326 100043281 122564745 151620343 188375177 232738193
15019 232738193 281566627 328605873 365934053 385338350 380645799 350161985 300507688
15012 300507688 245423053 196481686 158086645 129510650 108506422 92952413 81283755
15005 81283755 72308928 65255279 59574965 54862915 50900847 47581863 44813930 42549294
14997 42549294 40589783 38885200 37417237 36139992 34995220 34017572 33254745 32693880
14989 32693880 32276409 31823652 31239316 30448444 29318048 28033656 26595690 25062204 23607278
14980 23607278 22303108 21074736 19971097 18853287 17812583 16832647 15927892 15104129
14972 15104129 14309221 13520355 12799992 12198918 11637782 11069007 10578545 10106016 9647429
14963 9647429 9220863 8810285 8426495 8022234 7655283 7405806 7137449 6855108 6566181
14954 6566181 6317487 6074503 5840326 5632746 5424505 5215836 5018301 4801764 4588285
14945 4588285 4403747 4210802 4044417 3943236 3812572 3650229 3526836 3448978 3378739 3265409
14935 3265409 3172874 3089502 2995368 2880488 2764604 2672618 2560927 2487488 2422732 2371694 2310410
14924 2310410 2230326 2185518 2112612 2064262 1998161 1916528 1881766 1841401 1737188 1676236 1600785
14913 1600785 1562720 1511371 1480375 1486192 1493143 1494201 1488613 1468456 1409132 1359161 1344373 1288174
14901 1288174 1272692 1216686 1164596 1144827 1195494 1212502 1159863 1075325 1008770 879297 785743
14890 785743 739713 731428 666660 673775 742480 814793 866178 826160 701160 697177 691855 688114
14878 688114 695294 669520 659149 669287 682886 678558 709771 703322 714115 726520 701823 712514
14866 712514 752100 823944 809916 787040 843252 906783 942528 983948 1067470 1162902 1268652
14855 1268652 1338181 1382446 1484467 1594470 1634994 1616572 1687001 1730051 1790734 1830115 1851341
14844 1851341 1883093 1829439 1774507 1727668 1647464 1575049 1497432 1433840 1368945 1268571 1189635
14833 1189635 1101561 1024220 991433 931850 878079 852039 837710 843320 890273 887716 850929 784589
14821 784589 823789 872285 864749 836396 810761 834264 837329 790686 709740 717845 715165 723488
14809 723488 701747 711599 717696 666934 650183 686986 715084 713866 697672 671698 644037 585260
14797 585260 537940 572730 608387 610550 610758 604246 615410 571051 507407 516888 510274 521149 497105
14784 497105 470955 442126 426734 378718 334272 375823 404967 405154 377242 355827 375835 423396
14772 423396 478845 515597 535334 539425 542264 499280 458612 453849 452343 418936 377255 385188
14760 385188 405363 376386 384581 387538 378835 360463 360460 345569 366083 361254 331167 287628 332971
14747 332971 354028 338343 277579 232786 230450 214420 236090 252214 243904 248637 247856 243108 236312
14734 236312 232827 202482 234424 244114 261182 259482 253321 248527 285611 331598 287138 257290
14722 257290 257471 264154 313966 322474 297939 259139 212720 184412 235966 283155 259604 174215
14710 174215 182924 224970 221932 236192 237834 207568 218939 245345 263623 303391 293232 315296
14698 315296 299280 295071 294789 325326 322963 297104 308796 279819 247648 265965 264023 277140
14686 277140 244221 232147 310208 341712 352617 307761 238768 196635 211449 207664 236454 303548
14674 303548 286522 243585 260330 227472 210191 217644 204352 202411 212209 194408 195451 198063
14662 198063 249711 238478 210643 220026 252867 249382 249252 245646 228548 252919 243229 274733 284483
14649 284483 318407 342768 352339 414557 433964 406614 397256 411588 394409 441855 427109 417037
14637 417037 424213 465139 500986 472313 458112 492781 467108 473213 436840 385305 387119 382674
14625 382674 337090 357212 398067 402844 369785 378385 346332 296740 265244 248975 239585 216096
14613 216096 248527 265985 252513 226495 169436 186466 223922 233793 197334 205346 194020 241171
14601 241171 243030 248508 237149 240973 252054 259098 250292 236287 227152 209903 209529 199362 200747
14588 200747 256089 277911 287836 286698 311935 351062 347482 319958 296052 283049 310209 293165
14576 293165 288347 320299 339234 377196 413726 429714 419488 439153 464881 458324 453974 495446
14564 495446 536196 546753 487518 491285 493484 428055 354895 367673 451337 480901 497671 460096
14552 460096 393810 384888 442186 455560 440645 394464 401240 396735 392668 403235 411639 423933
14540 423933 420890 378553 434549 500738 482439 466782 493279 537494 577055 618226 628362 650404
14528 650404 640696 629905 630482 606255 590822 585472 594184 591396 594610 663084 750017 780735 781865
14515 781865 822594 942419 1026877 1146253 1192230 1254628 1331076 1390669 1473056 1525883 1520041
14504 1520041 1543131 1595394 1615772 1664936 1724654 1774473 1819538 1816318 1811225 1844697 1941313 2006423
14492 2006423 2028578 2070283 2109245 2120905 2175464 2232287 2271384 2318182 2298408 2357670 2401016
14481 2401016 2458329 2535131 2620532 2754091 2888625 2967957 3048581 3065572 3041879 2973383 2827135
14470 2827135 2667230 2525260 2427280 2386578 2349555 2287392 2229407 2192810 2197651 2228727 2266943
14459 2266943 2236714 2218430 2249593 2307337 2340106 2303078 2291619 2310344 2380537 2440205 2454090
14448 2454090 2492245 2528132 2586157 2624818 2674381 2740987 2819165 2923715 2994992 3039312 3076600
14437 3076600 3162864 3243081 3325363 3394529 3441527 3481564 3555036 3678339 3772121 3873199 4027422
14426 4027422 4145983 4277222 4362140 4511515 4638469 4760738 4953572 5163361 5389754 5642605
14416 5642605 5917111 6243954 6549132 6902779 7313893 7719133 8126552 8604111 9215050
14407 9215050 9870386 10633805 11495487 12455455 13576847 14914328 16530096 18387204 20577084
14398 20577084 23239677 26338478 30068872 34622080 40071564 46701084 54678503 64303714
14390 64303714 75781410 89098251 104180296 120826994 138757952 157475833 176331366
14383 176331366 194659527 211589519 226227511 237558243 244785625 247656378 246479785
14376 246479785 241740920 233611888 221963134 206998434 189749178 171735226 154248372
14369 154248372 137719760 122263135 107897003 94877614 83531770 74074043 66287313
14362 66287313 59928784 54772466 50611619 47110902 44186220 41699016 39592339 37771283
14354 37771283 36186687 34814916 33563537 32376423 31256921 30245845 29264833 28311564
14346 28311564 27375049 26440690 25501720 24556083 23565614 22624888 21752199 20881491 19974361
14337 19974361 19060817 18238603 17410891 16540076 15707643 14950934 14251021 13561939 12889789
14328 12889789 12238746 11606838 11015797 10469774 10026831 9575383 9142372 8764443 8395928
14319 8395928 8021923 7726568 7441324 7118172 6758728 6425176 6130192 5877486 5652418
14310 5652418 5425711 5224321 5066910 4897723 4696859 4516519 4279848 4119415 3975739
14301 3975739 3822005 3732292 3568740 3407826 3251196 3096555 2967725 2867102 2777949 2687889
14291 2687889 2600061 2534652 2453738 2322331 2236548 2148251 2083952 2000282 1951846 1883075 1809198
14280 1809198 1814223 1767177 1717931 1667191 1608625 1570465 1550982 1512152 1444423 1399259 1385944
14269 1385944 1365625 1316263 1309744 1354766 1328969 1343324 1342372 1263054 1239280 1220784 1188364 1123256
14257 1123256 1107175 1039157 1032979 982352 913887 839347 794471 745762 690439 668563 676145 706818
14245 706818 715208 674721 650618 658669 609917 582415 527930 507491 561446 589581 571789 549547
14233 549547 554519 548940 535971 542113 602274 613442 640834 624525 630318 637541 612950 636487
14221 636487 675959 682278 669925 657697 670753 661189 646872 661884 669448 655257 654109 640432
14209 640432 633300 640845 655484 645537 577393 549583 565536 598358 608579 627676 606059 589698
14197 589698 587433 576065 597811 588319 593637 609419 610563 582537 558339 557437 545329 573652 604939
14184 604939 567923 525127 540145 534618 613026 624781 613180 568805 515328 514867 542402 519242
14172 519242 474990 500245 534514 524353 506105 508197 540800 491096 435576 428408 451683 459278
14160 459278 431945 383937 390656 397675 388281 411523 409592 385217 350927 359786 393398 384529 378763
14147 378763 396379 383678 352479 338023 354813 383564 399401 397130 385902 403365 424646 440977
14135 440977 444024 444403 416182 455832 446460 410075 415888 385771 343808 353538 412287 438440 380282
14122 380282 343104 316791 325680 349057 321472 325143 283379 271459 256460 211419 220746 236531
14110 236531 246224 228673 242962 215957 206410 194404 194625 208050 220568 239552 264179 235857
14098 235857 211765 196330 205877 211118 204809 228988 175216 224485 245213 227985 218790 229087
14086 229087 237679 206145 165418 163436 156984 148697 148339 167254 216723 225860 226576 230699 204079
14073 204079 191640 177603 214393 252437 228365 226949 244249 247171 232165 192579 189624 127537
14061 127537 101447 105269 116632 186839 239165 244449 271852 278387 256078 253746 236444 213486
14049 213486 200758 185798 206338 211379 175323 194526 182456 187085 180826 141166 108425 126794
14037 126794 136164 111792 127032 154433 205019 218963 250283 253296 231751 187284 133929 111788
14025 111788 95594 102319 97840 96658 128602 127861 95335 72394 78332 86547 112630 87808 122219
14012 122219 143985 141754 103102 88579 96195 57080 4603 43725 109820 135858 177107 166975
14000 166975 134037 99903 92027 99712 80998 87609 95760 91279 63531 64961 59174 99486 163229
13987 163229 177192 185351 186637 152306 143241 82507 15532 36005 27538 70003 102006 92302
13975 92302 154550 182773 127555 106826 96772 60440 72812 99503 103591 84448 76245 46965
13963 46965 97932 144910 177332 119462 92150 82537 56849 59738 95943 59561 37210 88828
13951 88828 116305 141523 145074 185647 169012 133187 61142 44335 64325 66286 65958 64463 82776
13938 82776 151106 141201 146397 165242 180729 222216 239044 219330 247029 253556 209103 220374
13926 220374 217078 233760 255667 282594 294882 300277 361500 409693 465074 472872 556042 639510
13914 639510 716084 791968 809193 841290 933125 1061153 1098355 1165300 1225084 1218272 1156958
13903 1156958 1158340 1159083 1104108 1000582 931264 891335 870472 841030 754937 676162 626870 591360
13891 591360 529978 466508 451708 441025 441189 402439 361002 357503 376582 365048 329345 325452
13879 325452 284569 239061 202517 209724 260390 290957 267819 232853 230000 220083 197113 133792
13867 133792 100517 111764 131096 140360 144401 153454 181363 164934 151794 164185 159734 144187
13855 144187 139697 145866 185543 149147 127275 152760 148849 217840 237765 232979 194256 174881
13843 174881 201634 247693 306660 344851 351017 327436 291503 272705 288460 282556 298768 310716
13831 310716 345548 314306 232843 246137 310258 337916 362713 294596 239421 201515 199023 241124
13819 241124 292945 278639 260638 224061 186628 140624 139110 137228 107524 163424 185125 194472
13807 194472 229314 212865 190025 179308 150513 143857 117314 90938 75355 94454 102782 138628
13795 138628 155580 122869 99430 142476 168816 183657 173342 207447 203251 157686 117760 136195
13783 136195 136305 171256 188023 165627 130509 129176 160600 173058 174503 151582 138298 155395
13771 155395 108467 71980 99397 114942 148763 144890 142689 152945 159634 172941 142915 179230
13759 179230 167551 126420 134736 117416 75230 112472 175640 184717 150011 156008 133686 151265
13747 151265 161689 147893 134038 98727 112993 180795 194493 221523 204878 170644 175931 154486
13735 154486 117319 119313 151622 170931 176668 144268 106171 68356 60027 73068 71749 70688
13723 70688 111911 120690 128226 147820 108931 80810 69917 111740 165655 179415 144246 105298
13711 105298 73808 79241 107824 137137 144015 92596 99178 139477 133679 126402 75357 42543
13699 42543 29249 59175 88799 128601 174373 145448 101205 96707 100363 148528 187079 127831
13687 127831 114244 105650 116320 125479 104346 90890 107554 125167 118947 147121 150171 121095
13675 121095 98336 92614 91211 114017 130018 103822 78178 35725 72823 104773 144173 190283
13663 190283 168741 125609 127181 173584 171491 128414 109903 83830 100883 147699 140028 78878
13651 78878 66785 95590 160507 173305 150616 121981 122646 147209 168587 155945 158660 152399
13639 152399 137759 118596 78040 58883 69508 93585 102448 121008 136458 112853 150373 115363
13627 115363 43083 10795 20988 58732 71159 79710 53626 68879 49438 5755 19841 9997
13615 9997 687 -6980 -13656 -8291 38537 46845 69231 109618 91031 93709 71960 72166 84414
13602 84414 39594 -19409 -14500 76831 105832 83774 87733 117775 114857 108025 95905 102843 134487
13589 134487 131218 123682 150590 94079 76022 110824 116443 82085 84979 63451 61508 79574
13577 79574 129490 105734 34361 93195 139837 94269 89635 63077 59410 88423 87490 88111 102384
13564 102384 100642 92670 68857 49490 72866 72264 92536 108497 85229 52420 76530 116882
13552 116882 177193 203220 178393 158273 171737 188247 158284 118315 115371 119707 129539 144363
13540 144363 86788 58319 47027 59062 57628 64088 77604 118040 144300 143783 137691 124759
13528 124759 88899 63975 75836 128051 144306 104526 91841 115750 131691 114136 93004
13517 93004 80614 111991 144172 146338 134935 173568 136436 113331 115106 87102 110529 110560 128619
13504 128619 104359 44315 -10007 -3826 17680 34666 56472 67908 71471 98340 62536 33572
13492 33572 20035 30921 57275 24615 -26083 -28648 4910 48519 55018 70098 70101 41491 30017
13479 30017 68515 100548 143085 176371 160951 101369 51777 25363 31133 2244 -1213 11103
13467 11103 27030 15239 67029 159309 138613 151606 127816 82150 75123 55105 82439 69729
13455 69729 49893 57905 43135 30209 1640 13835 14031 39471 101603 129010 115535 113338
13443 113338 128000 168865 182571 149337 117414 124430 129390 167841 147484 109965 98806 79766
13431 79766 36006 25074 50520 76705 72151 38220 3890 -10113 66835 130385 109099 36795
13419 36795 42633 50514 73645 80056 59554 52979 76035 94415 104159 101911 112862 125669 133254
13406 133254 154021 144794 136256 146986 133564 149379 142260 142744 136732 157772 173625 155529 125287
13393 125287 107532 78501 85613 89228 101776 87226 102293 179514 190680 151988 173043 171398
13381 171398 143476 129103 114369 144151 150159 134590 160072 207521 286061 276438 232802 235098
13369 235098 228417 213062 264539 300490 311670 286544 241569 253711 303454 296932 321618 329783
13357 329783 301467 294838 301774 337306 401077 409880 421538 364660 380505 406118 450974 459011
13345 459011 473171 502322 534790 565181 560965 601225 650247 700403 715877 733460 772800 814449
13333 814449 863908 894748 900539 923408 868539 836704 796941 761353 738017 734531 676064 621193
13321 621193 591052 599274 647535 639620 585956 565193 550690 576269 598489 639506 650939 658752
13309 658752 610497 590690 593838 650916 700727 705996 727417 755335 768424 836676 900223 979246
13297 979246 992484 994000 1007849 989352 956849 905109 881585 846654 850122 817737 744409 705439
13285 705439 672966 614380 617986 628429 583397 540438 481114 467244 481973 469654 471586 480757
13273 480757 491643 498528 469760 426581 393004 357489 363815 391428 371079 392490 374380 341412
13261 341412 350755 385611 396363 349148 344498 351546 408318 446432 430358 422057 443354 432664
13249 432664 336640 277027 299908 316372 312049 279699 272160 249236 206957 222723 214966 185211
13237 185211 209513 243367 216082 223115 207127 199137 175034 143809 132404 128373 175954 219026
13225 219026 270460 257592 195529 233445 225415 234594 225392 242969 259198 264430 261715 222902
13213 222902 246367 251212 215062 230458 262601 271345 240263 230522 275385 254045 262793 287870
13201 287870 285243 315522 314922 298771 299376 279951 246173 235499 285351 355263 349266 279724 204299
13188 204299 167233 190023 224296 253337 266732 193098 186389 194257 212068 203676 200124 231678
13176 231678 212459 192442 142134 93047 115571 224366 239173 258567 236390 202495 237328
13165 237328 272956 300644 282195 293608 296438 323520 288375 230147 240414 251724 267103 256832
13153 256832 280246 311063 313971 312470 313495 333695 342517 304272 293679 299957 287035 283153 289454
13140 289454 277483 309286 358848 372335 380647 380929 405682 382782 352495 333655 339437 362563
13128 362563 340738 326163 365294 355327 343427 362299 354081 418032 452522 431407 412082 383461
13116 383461 365338 351161 353192 346939 334994 355412 339746 356577 348326 347406 342057 367573 339162
13103 339162 332436 306998 290755 305263 342801 359758 379619 394161 407241 413082 433496 434851
13091 434851 404229 377013 387308 415452 443748 456385 463435 482669 479070 493863 508634 517618
13079 517618 501485 485035 490403 518508 456865 477028 480369 498485 569396 554363 544444 567828
13067 567828 553558 542698 545370 540961 505947 476095 464567 492642 504628 551262 604609 576051
13055 576051 517523 547137 545871 569455 602445 640426 608641 610319 625098 630362 630569 665706
13043 665706 660664 669326 651352 611308 640677 610730 640179 683753 681031 686914 719502 703542
13031 703542 671258 681022 745848 813771 789668 758552 739243 753370 784163 797607 795002 813951
13019 813951 804397 845254 876169 879947 905528 932628 948913 916150 921716 1027672 1044819 992366
13007 992366 1008239 1035407 1007647 1031166 1080562 1108364 1120944 1112997 1093953 1097136 1124285 1145717
12995 1145717 1166184 1127154 1114331 1143777 1179616 1195116 1228329 1257212 1314029 1337070 1357179
12984 1357179 1367346 1393344 1416972 1415835 1436057 1488819 1528398 1604616 1641771 1639116 1670424 1703490
12972 1703490 1715513 1703100 1723464 1749173 1800977 1834943 1891825 1891272 1943377 2013715 2014934 2026983
12960 2026983 2097330 2201684 2279270 2328371 2373977 2430633 2540599 2593300 2637262 2707346 2825310
12949 2825310 2936579 3055895 3260213 3415156 3521841 3621663 3740957 3897022 4058925 4239966
12939 4239966 4436227 4708002 4970722 5242327 5521879 5833029 6208185 6587007 7014750
12930 7014750 7452542 7889947 8388084 8926591 9529566 10151308 10787315 11484837 12195077
12921 12195077 12926467 13712022 14531416 15325547 16102588 16871171 17711885 18555785 19362097
12912 19362097 20071865 20783126 21492210 22196156 22838010 23428114 24018661 24693413 25363011
12903 25363011 25958902 26573593 27268939 27987394 28740519 29577204 30486609 31491240 32562097
12894 32562097 33756415 35062565 36475953 37987876 39668208 41466576 43307450 45262580
12886 45262580 47363019 49499317 51681816 53838080 55988859 58159420 60143535 61984210
12878 61984210 63671603 65161370 66389748 67251749 67882574 68310748 68378263 68245805 67996692
12869 67996692 67531704 66989121 66424778 65805189 65128135 64567124 64134245 63717537 63347851
12860 63347851 63074878 62961399 63018487 63181144 63515901 63958041 64535817 65195863 65992676
12851 65992676 66842011 67665804 68499219 69387143 70206052 70966610 71602826 72031025 72256122
12842 72256122 72226342 71928680 71358676 70544241 69449219 68035845 66383081 64553262 62652127
12833 62652127 60639973 58546907 56473696 54419434 52375521 50430418 48607442 46909906
12825 46909906 45281041 43705724 42316266 41026287 39849338 38759217 37723921 36791796
12817 36791796 35930654 35171956 34453542 33735251 33034816 32342649 31703877 31112905 30466851
12808 30466851 29755608 29066925 28375351 27573575 26751695 25911755 25064108 24177537 23233832
12799 23233832 22337210 21453724 20533489 19584174 18666059 17778048 16879689 16029963 15193211
12790 15193211 14423782 13708068 13044090 12396914 11797574 11220173 10671067 10133938 9670581
12781 9670581 9215815 8764427 8338148 7997263 7675776 7304634 6946258 6635583 6362507
12772 6362507 6043514 5789587 5598842 5397111 5165708 4964408 4794556 4544862 4343705
12763 4343705 4129057 3984929 3862288 3687894 3537209 3370465 3227865 3122954 2990640
12754 2990640 2848344 2740960 2642929 2533416 2466060 2345320 2224936 2137650 2071896 2024788
12744 2024788 1949747 1900169 1864273 1752828 1645421 1586796 1532834 1537239 1500605 1434789 1319114
12733 1319114 1236002 1217853 1199370 1175853 1195347 1208200 1188876 1155260 1098918 1046496 1014852
12722 1014852 938513 928478 951362 919402 906460 926375 928261 882589 833441 816496 821439 787199
12710 787199 747708 758253 756328 748552 744320 739978 688931 690877 695587 678871 675014 621215 607959
12697 607959 648362 638035 640206 635212 594198 604216 602653 583403 598480 581051 574608 593477
12685 593477 631926 602697 555691 538059 539657 616846 653449 644852 582564 522990 540209 519891
12673 519891 530925 563712 591416 571626 548552 525078 515648 526229 534702 571480 603606 605841
12661 605841 570981 505104 462145 443138 458429 448348 453717 447376 452725 426955 461701 546032
12649 546032 527227 459173 448120 441694 464679 510043 473200 419102 418837 449986 436273 452001
12637 452001 474940 441149 426697 482545 495521 479476 451398 365361 337401 347559 387173
12626 387173 394007 408332 421199 426402 392323 328441 346811 399240 404678 404197 408876 389299 385290
12613 385290 375876 361564 320438 310543 312765 341493 320840 335953 354583 304874 318990 329605
12601 329605 338797 372342 339196 293184 306610 347826 389112 328545 307906 291515 294435 345465
12589 345465 343949 307362 289432 281917 279035 279182 298704 330310 331459 294801 287835 261373 309471
12576 309471 340157 325848 285864 297258 301572 317594 303942 311865 305438 336731 347184 329872
12564 329872 271008 256193 264753 270425 264169 255231 272795 299217 329308 312037 271241 270963 287903
12551 287903 338844 369107 343021 292664 306407 338114 309433 281597 242087 226097 254594
12540 254594 251026 269635 242954 255118 253960 206645 209201 160802 146746 211691 238910 213698
12528 213698 183932 174259 150779 177757 234270 258270 251899 225348 204911 174909 188238 198953
12516 198953 194567 206170 159465 190458 267363 291019 270481 204612 168031 184305 186270 220150
12504 220150 236089 232125 202741 236634 265095 258486 266489 310351 275148 260121 260680 204645
12492 204645 152279 212027 228076 209254 183686 152765 120957 146350 161831 174364 207937
12481 207937 229419 259100 254746 207520 212756 263898 265293 245321 236498 239557 213409 259296
12469 259296 289500 262400 191939 186590 208309 179591 197499 225378 232906 244636 248269 234059
12457 234059 227563 218343 234915 295716 317180 332804 378462 394791 374749 330229 331682 287657
12445 287657 278104 293327 302036 326689 348905 334665 305663 290757 286730 285944 369149 343909
12433 343909 307149 313855 308874 308606 338808 392031 429307 419171 405255 416487 437509 500739
12421 500739 533159 568964 574187 572004 528222 516313 546424 556668 599494 611174 566335 543875
12409 543875 553985 526485 508231 492491 501572 540116 505320 457605 462554 533449 576569 571480
12397 571480 539824 509512 551814 561009 546834 547381 561224 529323 546361 598396 645117 609367
12385 609367 588493 527615 496981 505591 524038 489668 499820 534947 551752 550314 520593 461021
12373 461021 479685 485235 490012 509348 521780 467163 449792 467768 457739 423607 416437 383074
12361 383074 385795 365855 385052 388837 366422 402754 448772 440434 468039 446438 422765 469281
12349 469281 504356 493559 390664 361530 352113 336115 349981 371377 401881 431240 416689
12338 416689 393186 386405 351914 292174 329656 332331 372127 398076 416729 430800 354199 313097
12326 313097 334553 334209 345072 363076 389643 422133 398439 341030 246729 252120 305286 338944
12314 338944 364336 391972 368745 331016 345643 327069 297899 249218 236885 248960 308549
12303 308549 380894 342014 309518 318359 318411 284516 266187 257542 247761 277996 294109 289227 320110
12290 320110 314997 316625 310915 334751 394715 422492 381563 311265 330958 315380 305887 336757
12278 336757 377726 378291 379398 396149 344854 295790 274945 311417 389715 408586 392422 362474
12266 362474 376539 449564 489373 509066 497104 514148 534548 477238 400219 419212 397842
12255 397842 342429 395735 438766 464172 518501 504227 495968 556256 609788 575545 553020 539606
12243 539606 508234 461748 474427 450805 488241 464940 427488 443309 473440 503616 540925
12232 540925 541433 538864 483267 487916 534716 569899 596760 587674 584127 568522 507283 485690 518068
12219 518068 518497 526324 549988 594505 618866 610190 638420 682816 701976 735842 774813 732246
12207 732246 689422 714106 756562 767389 776752 787434 799454 793126 829555 857967 851489 910262
12195 910262 954877 970504 984840 945417 918542 882640 920046 903159 919881 964650 989987
12184 989987 975559 1014092 1033609 1058355 1131311 1150843 1137409 1114343 1123904 1133248 1127485 1125954
12172 1125954 1151733 1215493 1253723 1237241 1236821 1249169 1294002 1335989 1320410 1392274 1460827 1467417
12160 1467417 1428106 1449232 1493479 1517557 1512407 1540329 1601345 1651617 1685321 1732330 1737111 1758337
12148 1758337 1799773 1841684 1853400 1901744 1967895 1997104 2019099 2040188 2099592 2127819 2168617
12137 2168617 2225813 2302003 2367549 2481967 2581239 2584167 2629093 2712716 2797501 2832472 2915593
12126 2915593 3038898 3120610 3183294 3270356 3355242 3447326 3589181 3720207 3836234 3889273
12116 3889273 3963435 4131205 4251948 4422949 4565921 4704344 4804304 4928142 5139397 5393028
12106 5393028 5592630 5836588 6097825 6302565 6539896 6830530 7157519 7453334 7719406
12097 7719406 8066594 8436590 8825258 9259258 9739451 10193714 10664251 11176551 11744440
12088 11744440 12359585 12968654 13605612 14330870 15091897 15905053 16755940 17666924 18615261
12079 18615261 19567031 20604673 21699034 22812397 23938337 25080998 26185411 27246785
12071 27246785 28344726 29401344 30381174 31252536 32008204 32620441 33076789 33425941 33560984
12062 33560984 33552311 33427353 33144210 32706479 32142150 31430417 30628612 29823196 28944073 28035323
12052 28035323 27089956 26112215 25129655 24149229 23188558 22250492 21439927 20631021 19811862
12043 19811862 18973847 18227885 17517013 16815516 16209776 15630211 15090584 14538455 14007361
12034 14007361 13479622 13008554 12568884 12136797 11738714 11321325 10934222 10510506 10138521
12025 10138521 9790855 9471686 9174902 8890372 8566450 8252727 7958288 7743770 7457123
12016 7457123 7224504 7004086 6759148 6510282 6321031 6098255 5901968 5755054 5571217
12007 5571217 5377692 5239036 5079094 4915117 4775902 4631215 4517183 4354685 4214919
11998 4214919 4119386 4009638 3974327 3852901 3698049 3601571 3510248 3374224 3262841 3165923
11988 3165923 3030802 2930615 2880777 2818759 2769749 2713616 2670994 2583775 2500740 2459658 2412672
11977 2412672 2369917 2310948 2258877 2200270 2145544 2112673 2042300 1990965 1924934 1897818 1869373
11966 1869373 1801173 1726212 1681258 1645773 1664483 1661247 1694905 1675654 1599589 1547487 1486989
11955 1486989 1484349 1506914 1504275 1476854 1432002 1402742 1376594 1355935 1336178 1366144 1442167 1477713
11943 1477713 1448629 1449996 1435640 1434487 1411003 1358687 1326885 1351789 1367180 1400457 1435072 1463192
11931 1463192 1510789 1559448 1630605 1704997 1711684 1712636 1741420 1792651 1876530 1925934 1962624 2024013
11919 2024013 2098682 2228304 2269135 2283326 2357725 2463571 2524640 2564168 2621449 2695884 2796259
11908 2796259 2878539 2925068 2932823 2946253 2941508 2892559 2852031 2779089 2716954 2675167 2579586 2504419
11896 2504419 2476009 2427864 2313694 2201237 2093998 2045429 2030407 2005007 1884692 1760700
11886 1760700 1711572 1640090 1562443 1540745 1495693 1441906 1370395 1329154 1276056 1219968 1176792
11875 1176792 1163109 1161401 1113503 1072585 1031087 1006099 977869 925276 927248 937638 906209 891279
11863 891279 878856 862209 856333 814777 813103 758097 722777 714453 675291 684708 679532 642015
11851 642015 641401 602694 556890 534409 548429 594594 601548 590922 534097 518629 506352 454067
11839 454067 491076 508883 509470 480725 482914 472070 444658 437156 442379 455979 423898 401227
11827 401227 429871 459956 459215 438724 435385 412701 391134 386204 352249 309338 293248 316046
11815 316046 291233 260781 249816 289785 328024 350605 279554 289605 319400 315960 312195 333756
11803 333756 374162 346771 323785 308119 270783 239857 244548 303535 313261 286892 251826 255801
11791 255801 257612 267995 273908 226781 185353 199852 196884 203266 215358 218445 228687 217820
11779 217820 235157 215459 225954 217701 213832 221996 208421 210127 230153 230590 272713 260303 231359
11766 231359 225199 220867 216709 219548 253606 255572 248777 228972 224855 248001 211510 204129 218726
11753 218726 217540 201554 191527 229334 234536 223785 191625 214970 280646 302960 263225 258650
11741 258650 247515 264314 287080 258937 207251 163576 145108 152669 179737 204035 201139 180903
11729 180903 176675 145084 93395 74705 85347 132203 195301 197890 159040 145792 134669 146863
11717 146863 155331 126483 94047 150680 147042 116528 102428 95285 117181 120175 155231 173972
11705 173972 171432 198728 200796 158319 113017 74053 95407 117006 133928 130844 122845 139798
11693 139798 104717 101045 148357 149346 107235 118037 147218 155554 155595 171295 196736 177843 138441
11680 138441 98092 107693 155876 167228 143117 84778 61051 122025 147750 140909 106780 128866
11668 128866 147377 90183 75653 125160 110917 76353 74951 59389 76836 104653 102447 93410
11656 93410 63095 85935 105832 97769 91084 99891 81863 60221 61306 98520 78255 86445 54249
11643 54249 32089 58998 70338 62482 87689 84952 102318 145907 131269 144393 122272 130733
11631 130733 160604 162968 120251 67831 74458 96416 83866 58798 78763 128535 147538 155924
11619 155924 157191 177428 125522 59926 36287 -157 -6062 59067 101031 64136 17332 32233
11607 32233 19573 40294 64938 99460 124222 89978 80023 79640 53966 -13364 -46936 -23757
11595 -23757 15953 66727 86704 88385 88200 82924 32447 40020 69693 96540 135899 146884 146074
11582 146074 178603 141303 106103 89551 79412 81618 59807 71106 57437 67058 133530 127498
11570 127498 164498 182637 147014 148887 161515 131058 95869 77028 70068 78295 94099 78801
11558 78801 85763 79799 60712 59119 82125 87111 78076 94993 141047 60916 -1662 -30074 1125
11545 1125 67013 82976 88643 91018 60128 55775 41517 22626 48369 74623 105768 130065
11533 130065 100098 63948 69067 58053 67029 46147 43107 40802 20901 26013 48882 18033
11521 18033 22403 8312 12891 32050 39818 48821 43648 64348 91722 111649 124615 120700 116597
11508 116597 122057 134810 126652 137678 154947 125337 109214 126645 134313 87883 122595 141572
11496 141572 148720 120233 85616 52392 41076 76789 98863 129537 134957 109996 91840 81137
11484 81137 111723 81648 52881 64937 75259 79217 102140 101426 80628 78116 85474 135923 120356
11471 120356 72116 83844 48842 19109 66104 88077 36238 12414 29903 84582 74005
11460 74005 84287 69231 84348 83391 64332 24435 40275 53581 31648 18190 15946 -1593
11448 -1593 26836 47724 90872 115685 90848 114267 73163 32579 43227 24946 -28641 -48426
11436 -48426 -30036 54648 95977 121971 190255 237520 257202 213291 162134 97841 76110 135378
11424 135378 158376 153062 151507 142470 134392 89381 74225 98965 99711 101107 73381 66535 87685
11411 87685 97000 141973 142323 110527 70462 22561 18588 68143 94972 104827 82950 55596 25928
11398 25928 22692 49788 61931 59387 25344 -9896 20327 36744 64480 69055 35753 71814
11386 71814 103744 86950 98296 99699 136214 144281 131320 92603 62270 103108 191978 156293
11374 156293 134517 145363 136887 112584 76431 53133 81071 95096 42215 58237 123667 130133
11362 130133 86432 56104 107926 107559 74281 33311 20217 33905 81251 141166 107921 46798
11350 46798 41354 28028 55571 73673 50831 79213 67961 94249 122792 114704 115299 85085
11338 85085 50077 40697 6656 32558 59296 48409 30227 15362 27778 32776 36639 46474
11326 46474 67886 36570 7175 -12333 -3432 -5028 -10512 -13096 -30604 -34723 -17469 13410 39291
11313 39291 33607 15034 -28121 -10658 12949 -19079 -12477 -24857 -5855 28052 26491 8112
11301 8112 42655 63784 12249 -19667 -33539 5916 26606 7488 -18114 2012 38829 40251
11289 40251 10041 15779 78436 34200 -22220 -23708 -20425 -36900 -65440 -80293 -69990 -39549
11277 -39549 -101813 -83491 -28943 -5284 3188 -11494 -41409 -57963 -29245 -2129 55113 60210
11265 60210 19515 -4328 -18854 -45558 15432 64869 57259 49172 21349 22969 52097 56980
11253 56980 96945 56870 5566 3966 -3023 -1142 -6609 11542 6119 12876 47543 86686 138024
11240 138024 121848 111294 105579 113764 94852 107500 111270 84577 71574 51305 57853 42438
11228 42438 57991 80311 61956 70432 80960 105494 122561 109120 104021 128019 113576 115847
11216 115847 147191 157299 153017 128058 101207 123931 139841 112517 93141 82571 13288 48959
11204 48959 80510 76466 99517 99696 96288 123848 139616 104844 61439 42914 64563 36983
11192 36983 -24447 -97789 -53846 -9177 60139 84191 34519 9760 -14031 -21121 -18563 -41291
11180 -41291 -37035 -31822 -26698 15305 16879 28216 29408 55096 21620 -29790 -31054 4662 -36321
11167 -36321 -28600 5433 5262 -9147 -47480 5481 -11392 -35504 -80163 -47879 -29295 -47323
11155 -47323 -38409 -72639 -60775 -48400 -15841 4309 692 -7510 -24045 -28657 -38518 -44758 -43093
11142 -43093 -54875 -59113 -9890 -19570 -28457 -14488 -1086 37727 14887 -1292 24807 49395
11130 49395 80294 65641 67750 29103 11612 24816 1827 9727 46967 72511 57300 50675
11118 50675 58856 35932 15015 17703 48744 59458 63669 25748 4344 30247 -1935 -88650
11106 -88650 -54324 21338 46400 50790 54599 25520 -8783 -2831 39199 95274 100122 92919 81559
11093 81559 78920 77715 53489 65505 67866 48385 18710 42914 75641 48374 37400 20474
11081 20474 22088 75729 94834 20126 -49485 591 48876 47142 24709 -22940 -67618 -30697
11069 -30697 -13748 -25140 -23153 -27286 14059 11401 29927 25683 -8976 1214 -17361 -7032
11057 -7032 6083 -10815 -25805 -4616 3915 -18243 -73914 -79364 -33137 12769 58011 118003
11045 118003 163701 122157 87729 122144 148919 137779 83886 108473 146564 188257 270348
11034 270348 263655 253927 262512 222614 205031 201855 168322 159412 154861 187084 197485 238648 251117
11021 251117 264485 277239 285321 300628 300749 279834 234312 238985 226047 226841 217690 215396 268340
11008 268340 282114 213448 191017 179913 195926 213500 174677 158028 141666 140933 139214 136641
10996 136641 128822 133127 131050 108864 99700 153103 171914 177059 159000 145810 140734 113033 101217
10983 101217 97204 118895 132014 135991 144609 123482 147563 151109 101059 120133 88305 62438
10971 62438 30777 58257 74520 72676 50347 17781 50441 87349 67698 115690 126462 127164
10959 127164 124537 95712 100063 134228 110230 76703 53547 83742 155734 184561 140042 119087
10947 119087 135209 130226 145114 160782 164180 183220 167036 112220 83186 77198 84782 81714
10935 81714 118083 129299 103726 76732 54031 87066 128652 123172 92002 20663 17770 51746
10923 51746 30660 16018 27369 67851 100531 69109 27386 9262 46189 64885 83924 68880
10911 68880 23630 39266 37633 53497 83495 112738 102247 87751 116716 128544 118779 99537
10899 99537 133576 189699 137290 138187 126151 89877 98231 59847 52515 33848 44500 38578 60385
10886 60385 83145 28421 -7697 15490 20829 47080 157483 181898 123741 106113 139326 155668
10874 155668 151724 162086 177960 145668 139762 133526 144276 140530 164242 176229 191118 147697
10862 147697 139346 119742 170328 221665 190026 143863 138868 137719 150029 158040 187046 191855
10850 191855 206937 201386 130409 83401 83529 97600 96524 97256 123856 96722 64059 70660 105558
10837 105558 111810 109653 101050 104661 113585 59662 16384 17426 40982 66497 55310 80064 118137
10824 118137 98263 83065 70072 20580 35465 94254 94961 71901 49854 75449 85202 51859
10812 51859 49990 31381 52870 54462 53222 76826 50644 33388 43106 55288 46675 55571 88851
10799 88851 95790 134614 110582 107985 87732 49308 25844 90868 87123 55135 53814 30289
10787 30289 12695 63101 134468 150410 115171 57634 53182 37305 31770 66822 71555 90543
10775 90543 78917 102523 143036 156403 168347 131071 111079 75533 38851 69761 79211 56368
10763 56368 45768 88901 49788 44421 61203 90085 108143 90870 68857 51547 23191 53215
10751 53215 80524 61867 55137 105811 136431 141485 142956 137477 121886 113896 162867 157085 85070
10738 85070 65442 81570 128187 139746 125830 65902 72629 89811 137192 189101 156656 156590
10726 156590 178641 160578 137663 159435 194386 187002 143547 108141 147519 243323 272421 229584
10714 229584 190730 177593 161226 175109 171031 149995 156790 206189 225068 198921 159507 141152
10702 141152 126271 123168 143684 178126 213036 207684 220992 220096 181850 212091 260163 264110
10690 264110 216833 170829 155504 137146 136360 146267 190255 261784 227566 202977 215457 217612
10678 217612 241650 264173 253524 224727 272655 298655 307202 244291 221335 216128 230203 222378
10666 222378 274827 330525 311308 254941 234494 259531 319725 325293 346350 375041 373509 368518
10654 368518 398123 455184 437682 438695 425286 393677 420289 508422 573763 566074 587042 556953
10642 556953 520296 538158 571636 601943 655432 709428 748312 808598 891015 907573 960285
10631 960285 1098756 1237276 1344166 1487893 1670869 1869691 2113855 2447482 2801285 3346500
10621 3346500 4084118 5005200 6180315 7620931 9359672 11314623 13361859 15204162
10613 15204162 16625590 17499586 17786295 17819635 17964108 18570484 19955765 22232097 25276407
10604 25276407 28841071 32438101 35439026 37333548 37740502 36831748 35192141 33771066
10596 33771066 33383624 34380835 36754929 40310668 44423821 48303592 51144524 52155888
10588 52155888 50885433 47536650 43172837 39234194 36570073 35373113 35509916 36652349
10580 36652349 38285686 39815194 40545177 40017856 37988054 34729515 30949668 27566666
10572 27566666 25065964 23518709 22827325 22668631 22686565 22587108 22209118 21269388 19734061
10563 19734061 17695235 15535070 13529665 11799237 10464432 9415844 8617359 7977652
10555 7977652 7435332 6968251 6586467 6258182 5978126 5711128 5423418 5149354 4927907
10546 4927907 4714984 4525348 4304500 4124104 3949023 3771735 3650037 3541873 3442569 3341221
10536 3341221 3182424 3029772 2898988 2708162 2559272 2447451 2353273 2246585 2094762 1966023
10526 1966023 1851533 1763667 1673705 1601962 1577486 1505313 1389845 1260199 1235736 1159385 1076656
10515 1076656 1040036 1032135 968912 895602 872167 785571 754496 708341 689596 699368 682226 648904
10503 648904 641612 640172 610654 589843 536018 444631 433067 442748 382779 347240 343997 333580
10491 333580 341371 364066 363885 328639 291475 304020 279670 272165 258361 260724 263587 278767 252774
10478 252774 233924 220807 201905 194981 237695 210950 177484 141665 154203 142472 146843 139349
10466 139349 89792 30106 12534 17735 38003 42900 39747 83873 97244 92222 77917 49039
10454 49039 91986 169073 175435 131174 62093 -13980 -924 3981 11553 9260 20323 72777
10442 72777 89206 78602 88692 103391 62713 55162 45443 60656 75128 89450 118382 144372
10430 144372 91232 98587 97122 44448 12362 6524 21116 27215 45904 86216 72460 86794
10418 86794 94171 98393 165350 171363 148073 109516 81590 75544 31828 41759 106385 142724 123189
10405 123189 128345 128417 101861 96331 103313 65979 72916 110443 94205 96126 95710 82024 83912 143552
10391 143552 203068 201720 198535 158474 89611 95618 96820 95426 151522 155684 118973 153457 152502
10378 152502 164285 156145 141361 116552 96578 157659 166995 134600 95380 73308 60531 67634
10366 67634 65598 81663 81430 45953 27313 53981 78243 36094 23871 30353 58062 59183 99502
10353 99502 125272 115554 110225 101616 84903 54729 69896 99893 95423 131499 125818 140824 92108
10340 92108 69277 82793 72972 99674 107809 70621 68153 35170 32398 52814 75127 89041
10328 89041 77311 108627 134295 111724 104920 85054 100546 89545 71250 59328 33409 73678
10316 73678 95856 125271 97152 54133 46196 54514 46303 20465 -28591 -42911 -46385 -2919
10304 -2919 62620 84133 74478 82226 73109 59152 23369 23260 15515 15631 25688 27165 29344 5542
10290 5542 40452 86206 117443 80135 -17317 -18550 6060 22127 28899 14444 3859 53869
10278 53869 92054 53601 20899 33367 10026 14381 3511 -22328 27676 32551 24942 62176
10266 62176 73714 81991 99481 93448 95891 109382 156668 173826 162747 143396 148950 85094
10254 85094 53005 57656 80833 136805 84735 30570 13300 5336 13956 14496 -1 -49262 -76435
10241 -76435 -61343 -30226 -20290 -43103 -47330 -32043 16911 22910 -11595 -11675 -23863 -3708 5534
10228 5534 37452 67921 36007 -20130 -40735 -45315 -76271 -85234 -84819 -62480 -46552 -16799 13903
10215 13903 34851 7427 3044 -1052 -20589 -5780 19070 30412 27273 3737 4161 23463 54329
10202 54329 -1383 1608 -11780 -6735 -10530 1273 -38129 -43865 -36213 -15934 17989 40016 31956
10189 31956 34297 6387 -691 4841 44724 57418 44033 79245 83405 95800 43354 14006
10177 14006 60847 105105 102997 92548 87000 118050 82405 63400 78760 153281 154848 150952
10165 150952 152897 132829 98824 101945 128504 85346 117041 196698 238058 272206 312614 356299
10153 356299 360808 412954 420866 369532 334150 298135 275829 298851 329979 313235 313790 362039
10141 362039 473151 579836 576125 578094 623308 647589 653872 615542 562356 495142 447108 375781
10129 375781 368481 366920 298708 206991 157005 154614 125177 148811 179074 162549 130742 103938
10117 103938 150904 136060 87972 84092 87367 101559 82438 80719 73086 27621 51716 38285
10105 38285 21875 41489 62964 54371 45071 52933 53367 18042 5105 34229 62496 98735 100034
10092 100034 135973 136764 113750 104792 87993 39273 67343 90638 123349 148757 82199 7939
10080 7939 -21036 5217 -3446 -42765 -4173 45642 -2086 14066 59475 76715 73490 50789
10068 50789 38824 19183 -35117 -80847 -120314 -134059 -81903 -37662 -6980 7349 23219 23667
10056 23667 -15050 -10865 17590 36785 57948 56654 45828 30601 68567 78324 101531 86259
10044 86259 113575 107339 106231 128273 140517 95569 79745 84766 116801 62167 32926 9739
10032 9739 6079 13561 9336 2556 -21133 -28919 -16545 562 25882 33952 87114 112893 63414
10019 63414 66054 77528 36221 7799 37834 72766 121344 120174 79462 71141 71663 90119 62190
10006 62190 75719 98186 142694 172921 163600 132380 59576 75177 78775 46063 30841 27704
9994 27704 13130 9131 -39290 -16557 67206 90396 62623 13571 1552 -29627 -44275 10031
9982 10031 35018 75902 68664 79712 71181 70156 69124 42221 13869 -8139 -27245 -13199 -13367
9969 -13367 2246 -1168 -5926 28221 11054 -253 7191 -6679 20519 62293 100749 72896
9957 72896 69430 24285 -5616 -13185 14571 26650 32709 27105 46352 73304 109248 125682 106190
9944 106190 72980 40030 39234 102732 177734 189964 202639 222685 191393 137061 117291 127978
9932 127978 146057 113386 86696 92166 139689 145915 128806 115024 150052 138320 89301 88994
9920 88994 62020 -10783 -29455 -14047 -4599 2728 -32544 -18668 -5351 -24068 -65314 -67440
9908 -67440 -44378 -63658 -14361 7141 26813 5018 -1963 -14681 29086 61093 38086 50854
9896 50854 38794 62578 89786 88031 46290 38452 6144 16904 -9455 -29173 -60414 -64263
9884 -64263 -74764 -78650 -74329 -31460 -32570 -35330 -17199 3727 8599 6835 61490 56712 24748
9871 24748 31107 15743 -14586 -34277 7009 55896 18299 250 4709 46249 67883 65811
9859 65811 74403 44940 25224 61981 60308 25804 4716 -43654 -17915 4579 -13557 -16883
9847 -16883 10629 4223 -22243 -15275 4299 23127 30660 1258 21828 42382 97706 74022
9835 74022 23420 -5707 -34496 -25860 29 -42865 -81682 -43056 -45022 -18427 -25852 -16497 -2655
9822 -2655 31160 10127 -33119 -28106 -4614 -1702 -9240 16428 -5431 33990 58999 55257 18881
9809 18881 -2743 -6012 -27496 27484 53381 41483 36993 8499 3609 -13929 -43106 -71375
9797 -71375 -50343 -2950 -2128 22726 45442 92222 92939 24701 3499 27674 -11957 -58699 -60564
9784 -60564 -27212 -28279 -31571 -9432 37576 112490 113562 106468 63579 37400 34962 18783 -1128
9771 -1128 -11865 -30783 -62634 -55284 -17727 -19161 14510 29421 -9645 -57911 -43097 -37586 -33148
9758 -33148 -26949 -35602 -37543 -20350 2186 -6915 -26590 -38076 -51782 -103845 -127391 -93599 -45803
9745 -45803 -36415 -27396 -12603 2255 -44907 -57168 -89746 -54485 -28781 28591 40848 4907
9733 4907 -12262 -21614 -15029 -2731 -13747 -36740 -54684 -62378 -98150 -76834 -58570 -9255 2767
9720 2767 2191 -42017 -77208 -152540 -127858 -85819 -64969 -86639 -43115 -65628 -66347 44014 73086
9707 73086 61435 29522 26585 17479 12964 31329 66766 70874 20446 -2040 -20093 -3232 17035
9694 17035 4797 -44921 -63754 -67701 -91076 -64085 -14770 -24520 -38648 -21737 -2575 24847
9682 24847 -25907 -73289 -54855 -56898 -55344 -43998 -87249 -122925 -89249 -31052 -26034 -16810 14224
9669 14224 43487 29705 18783 28529 9212 14207 6256 -3969 -40062 -44699 -5720 3104 -14544
9656 -14544 12077 10618 -25493 -5567 31223 80091 115062 135213 167554 163948 151778 123263
9644 123263 78526 39935 65569 106702 71346 40851 20509 26203 50921 64071 80307 100776
9632 100776 50573 26883 25700 -590 33393 40701 44120 81319 133420 166412 183882 227612
9620 227612 204829 170500 182007 143661 100984 72509 17554 -552 -16007 -32436 -1985 10722
9608 10722 8352 -21565 -44901 -5147 -12821 -42392 -66464 -52651 -13580 -4136 -15422 -19582 12408
9595 12408 24620 15117 -2129 18295 33624 9931 -15652 -25097 -42105 -49700 -2887 21449
9583 21449 33758 37278 35651 1766 -14502 -33611 -38727 26871 79138 43379 22911 -33067
9571 -33067 -55328 -54091 -20483 15359 53537 58170 66214 27904 -8058 18210 -2465 1326 11782
9558 11782 -2459 13946 -26954 -60049 -66668 -67304 -93876 -62495 -11560 47767 36242 15795
9546 15795 -6395 251 -6514 -6122 9400 13717 -26179 -57187 1845 2076 -51482 -66503 -40286
9533 -40286 -13177 -74993 -105916 -107861 -86395 -55248 -59140 -58431 -65720 -103153 -133558 -133593 -96676
9520 -96676 -62512 -19181 7362 -2625 -23704 -24249 -28292 -59751 -69000 -15377 -26175 -34504 -37278
9507 -37278 -3818 31 8389 39248 47399 29652 68065 60765 22162 14522 56878 77248 22498
9494 22498 -11482 -41601 -59334 -22289 -3656 1006 10087 -5588 -67519 -63133 -71931 -77737 -84467
9481 -84467 -78432 -85794 -99845 -59829 -24478 1326 7268 -35800 -20139 11242 20098 2428 -5719
9468 -5719 10192 35845 24087 17840 -2974 -38861 -7906 21247 -22774 -44372 -61667 -85066
9456 -85066 -84077 -58693 -70141 -69075 -96864 -123167 -104304 -48539 -3404 -10502 -20942 14917 8649
9443 8649 -4127 -15379 32226 40858 26472 -11130 -16962 11247 29749 15276 -10466 -41650
9431 -41650 -55957 -49359 -45310 -46840 -47381 -22244 -10772 -38859 -63066 -48931 -32006 -24397 -35022
9418 -35022 -7189 42083 2207 -9698 -25993 -15303 -25080 -28146 -27405 -15138 28235 13850 10193
9405 10193 -3201 -37866 -18424 3340 -14272 -27482 7829 30561 3934 -4139 -25842 -18442
9393 -18442 3020 19162 19352 -35450 -37006 -1867 -30418 -67100 -63765 -20915 1639 1044 -2255
9380 -2255 -1770 10189 -5139 -15069 15844 34583 5577 -38856 -89051 -106438 -75693 -53377 -37628
9367 -37628 -7053 -3755 -19378 7871 7287 -22727 1531 -1877 17410 -26823 -11949 -10370 -25553
9354 -25553 21806 48343 9222 -8229 -26165 -36633 -2962 16179 -37439 -81740 -31827 8134
9342 8134 26021 16009 37823 25482 10560 7669 -19940 -26749 19163 20387 44896 56601 36774
9329 36774 53309 58651 83336 103867 61324 44910 -17878 -1878 16929 -2101 -28311 -93972
9317 -93972 -159905 -89611 -26743 -53267 -77015 -109843 -85783 -23410 33852 99648 91288 37055
9305 37055 16128 179 10224 36310 60703 27976 17527 23506 43737 34247 -12532 -43685
9293 -43685 -28489 2878 23225 4079 -8946 -325 11493 32403 13780 -18592 13801 -21635
9281 -21635 -23609 19341 40376 50263 48509 25500 27983 61848 91554 136658 99503 78720 75610
9268 75610 73566 83616 78162 59095 55445 71028 59145 79586 80479 55342 8916 12342 15333
9255 15333 -699 -23905 6320 65526 69636 47699 25267 -2487 -52281 -26622 17280 72064
9243 72064 87394 71848 66268 56545 -31232 -76094 -28912 30292 -3167 -57835 -31544 12426
9231 12426 38457 22628 8591 33243 42890 31010 21345 38605 32824 40257 68763 68361 46985
9218 46985 61732 32306 44389 45913 57328 81284 132189 153580 118132 125220 86730 64351
9206 64351 114225 186645 176954 133047 156054 143983 140412 177699 145385 152771 105122 94482
9194 94482 99502 119907 142346 184066 194457 185697 201337 190238 151904 192329 200304 138053
9182 138053 108642 102137 123635 156980 170941 172421 174104 205209 208330 214906 185098 131655 151858
9169 151858 149851 167528 187599 204843 213196 206000 210527 201590 142856 116303 100163 64136 73833
9156 73833 136101 124764 151722 131663 92982 91130 112767 115689 131184 59215 57540 91360
9144 91360 88888 89047 128876 157413 160238 119852 83866 90880 79479 50426 100588 113912 115647
9131 115647 156689 159553 104527 83901 78949 80730 100587 157899 150113 129825 141210 83891
9119 83891 30654 18882 30376 31499 11716 52326 112710 129430 92308 75256 80474 75970
9107 75970 66856 92191 108308 120800 159180 139431 113710 112167 116765 154209 110444 53679
9095 53679 57167 67906 125903 165712 138487 77276 77318 82228 85043 64258 58865 79629 86193
9082 86193 90676 59483 84147 69539 62026 93519 107172 122801 62248 18308 8171 37781
9070 37781 93825 80745 75694 106922 55154 -13767 -19697 30666 41289 16384 -13670 25437
9058 25437 60858 72252 57465 27261 -7204 -16359 -907 50597 92535 72688 45764 21927
9046 21927 26127 47422 51346 27141 17088 64051 88202 64304 63665 35972 31432 69272 90467
9033 90467 100251 103138 132152 122326 104034 50769 72934 79034 73597 47613 14553 9861 9911 16634
9019 16634 8576 -22042 -68719 -95835 -77235 -59451 -22836 6360 15168 14337 9804 57934 96649
9006 96649 71323 6747 -13232 13251 28021 8309 23202 66099 35924 2044 -2422 -11287
8994 -11287 -11106 10541 64703 32748 11848 44335 55877 87500 67273 24121 -1157 54888
8982 54888 138394 159162 118936 89896 158739 192911 192110 169949 94686 32174 19582 35086
8970 35086 52839 52118 32951 52880 34977 -241 -21472 -10464 14914 36002 64100 59942
8958 59942 28861 20580 64893 55998 72864 80145 82631 61169 38442 49279 50379 24711 -1807
8945 -1807 -8172 -9 12640 48983 73033 55109 52987 14924 45402 52919 36512 39778 19920
8932 19920 60979 72308 65458 83899 87610 63424 38083 74449 145835 196534 194315 137443
8920 137443 80431 57119 79646 69464 60296 42445 43884 48040 82538 98002 143636 142553
8908 142553 108548 94810 76248 48520 12076 -18693 11062 76648 85352 46997 51179 60148
8896 60148 53959 68846 91442 100723 104859 139932 164707 160585 147518 162173 148808 194966 194981
8883 194981 129785 140606 155795 95326 30843 48704 98209 114879 137229 144130 164663 174674
8871 174674 176219 139460 122850 104523 92418 88953 77112 48152 108335 140133 165226 187217
8859 187217 155016 138997 148736 137785 138046 175500 233239 266228 257397 217019 181945 168769
8847 168769 234733 272681 249543 243868 275500 344345 377158 414666 546150 629393 732522
8836 732522 941818 1202398 1471963 1815316 2226204 2621449 2941564 3082283 3049230 2830980
8826 2830980 2449408 2013668 1699867 1552876 1413537 1297457 1169758 1039001 992724 902529
8816 902529 771250 710101 663241 623456 570614 529786 514339 469880 436209 424430 400919
8805 400919 352852 344047 354777 338588 354049 323621 315976 243333 186649 162713 183218 203171
8793 203171 180573 170765 137961 112566 141975 145559 179902 189140 232971 231980 202624 218836 261303
8780 261303 271793 263897 232908 188417 90999 59700 71383 50027 61104 75770 64577 93097
8768 93097 79815 77948 95006 62109 36182 46757 18451 35084 38290 -14434 4636 81814
8756 81814 117636 63897 48076 49429 66610 21233 28100 35286 33506 25550 40424 91207 101663
8743 101663 126457 149936 137492 114641 106852 77925 35439 16511 64382 107081 76807 39337
8731 39337 38319 39549 6630 1647 809 -36698 -41014 -16849 19597 38075 67620 50874 20346
8718 20346 56942 38155 12954 2720 -898 -6553 1813 41270 31886 23383 65667 42425 10806
8705 10806 -28306 -16886 2527 28361 40638 8428 18955 15150 43013 86528 81874 31248
8693 31248 44663 30363 23373 13715 53365 122724 116032 75485 37176 55793 67959 92705
8681 92705 93948 65891 28199 39072 35388 33830 24947 29932 17207 -25792 -18616 -9789 -55366
8668 -55366 -44840 -64200 -70330 -80282 -35034 -7420 -2642 -27618 -27416 -14276 17139 4449 -6470
8655 -6470 7835 54545 62832 31840 -19568 -24882 -12511 -10341 -3794 -35058 -19025 48499 43251
8642 43251 24390 19474 5068 18066 34149 33161 59385 56200 43523 29282 48792 72060 96516
8629 96516 98883 60756 19637 28197 43294 19304 6475 6300 47305 20039 -65536 -65654 -46401
8616 -46401 -23980 213 28765 74575 78708 28745 -17521 -11310 18127 23834 8278 23437
8604 23437 26479 20640 2243 -23981 -10413 -7231 -32350 -21500 34482 42817 -31806 -54921 -12929
8591 -12929 25052 104997 83113 41355 50008 50870 64227 64561 8800 -50471 -5531 52293 80458
8578 80458 61962 72919 119260 127422 85424 55082 49452 101315 100206 80906 77455 110961 81651
8565 81651 76575 95890 77215 59584 50952 22737 1714 -17071 12773 -3993 544 -26495
8553 -26495 -23249 6392 39637 30342 -13513 -42122 -14254 -11752 -3238 22340 14810 -7262 -29495
8540 -29495 -396 -13343 -19608 -7872 9565 33253 25568 52637 52289 31453 45597 21999 -24974
8527 -24974 -50183 -47019 16087 106271 98516 64388 18009 8810 -3514 -38425 -15540 7709
8515 7709 50262 64346 20123 -5297 26257 52007 46311 58225 31559 14222 37060 61258
8503 61258 49200 88167 79125 -3292 -54786 -44054 -21006 1599 20663 27604 13118 13872 10982
8490 10982 -5600 -14562 4738 -38383 -34609 4743 18114 4392 -23260 -35479 -31369 19332
8478 19332 45943 25949 39276 14395 59070 39330 8708 20567 13715 21232 11281 19634 36876
8465 36876 -19926 -79140 -86994 -50119 -23615 16007 17507 -7325 -19237 30792 47929 85458
8453 85458 88178 34281 3172 -26547 -3310 -3719 -6397 -24984 -6134 7561 39262 12698 11462
8440 11462 -326 -15654 24770 99632 99357 61003 77220 52859 35896 -21539 -28924 33672
8428 33672 78376 95673 33352 18026 19079 16533 15741 -732 16474 47073 61838 43922 12022
8415 12022 19626 10822 5073 -14807 -44532 -44766 12157 31203 27102 10572 -6005 -19634 -37884
8402 -37884 -23737 -68501 -65676 -41161 -13285 1029 5753 43681 39115 -8356 4865 -9554
8390 -9554 -24550 -16837 -53093 -52587 -5709 -1498 -18234 -58026 -65316 -27338 -2389 26406 73429
8377 73429 51676 26408 -50062 -54760 -31503 -58797 -55254 -41857 -42527 -65420 -34982 -14792 -17772
8364 -17772 -31346 -78253 -68550 -82599 -96588 -92176 -90696 -55505 -58544 -98998 -104345 -73385 -104112
8351 -104112 -80628 -56617 -5900 34516 21606 -4323 -35434 -48004 -59440 -88023 -43761 -31772
8339 -31772 -18386 -44430 -76175 -79024 -91156 -94197 -79612 -66712 -66420 -74297 -46577 -18505 -10371
8326 -10371 -39740 -40347 -40569 -52496 -39706 -61471 -44013 15306 -11453 -21019 -18662 -4527 11749
8313 11749 30081 -14577 -58448 -65049 -40597 -44602 -13458 14229 22876 30825 46443 71787 61418
8300 61418 32300 13567 5328 -37674 -45195 -52992 -41352 -23058 -6540 8403 37889 59331
8288 59331 27934 -67691 -67007 16950 -4731 10371 38486 2219 -38193 -20998 -2518 11512
8276 11512 36391 14529 -18709 -28076 21591 26638 -14002 -61124 -33659 12817 12185 -33771 -60288
8263 -60288 -59069 -26176 3320 52858 59134 55327 30111 26114 2647 -17952 -36706 -53970 -38111
8250 -38111 10887 30704 3871 -15196 -45689 -25380 -18721 -11721 -1684 14990 -16974 -13834
8238 -13834 21017 38751 15807 11349 15093 28264 -9354 -7851 35584 66847 68581 48207 26916
8225 26916 -19086 -34928 -6110 70867 86783 69380 28725 5160 2864 34306 36167 17035
8213 17035 -12477 -47897 -61533 -41255 -11384 10201 -36104 -110744 -132426 -100527 -62348 -39407
8201 -39407 -14859 -6094 21357 16011 14522 13740 -21733 -32488 -2459 9436 20709 -16245 -67246
8188 -67246 -58649 -28042 -58341 -38502 10388 12494 384 -38365 -45665 -45488 6302 40967 72488
8175 72488 51017 36902 4178 24021 21877 35911 44485 25547 62693 67087 31121 12002
8163 12002 2457 -55451 -72918 -31593 -43484 -50300 -14463 19136 1042 -48666 -16391 11760
8151 11760 -29572 -81852 -49432 6183 35320 -26918 -49649 -47262 -51420 -44583 -13509 -30968
8139 -30968 -45425 -35733 -38393 -35155 -29317 -17479 -27554 -55110 -42010 -45001 -27062 -50956 -45387
8126 -45387 -31549 -60327 -25421 12540 -12984 -98457 -134221 -110111 -94014 -26303 -47460 -92230
8114 -92230 -118159 -104766 -30947 -8857 -14856 -40844 -58864 -61635 -38143 -14822 -27721 -51568
8102 -51568 -40478 -11380 -8408 -56142 -39407 -33425 -57529 -84954 -52021 -58476 -44506 -1971
8090 -1971 22204 40883 26107 -14445 -16038 -30064 -38192 -44538 -24538 19098 12350 20455 -11880
8077 -11880 -69876 -75625 -79092 -54553 -33326 -79598 -87724 -32546 6282 31020 31365 -10620 -22887
8064 -22887 -39310 -71168 -80351 -86888 -124110 -127904 -116145 -61000 -64764 -78089 -59896 10918 29941
8051 29941 -3277 11153 -1683 14257 57482 42736 32230 12770 15953 59040 42146 27263
8039 27263 30813 36262 19800 9363 -19000 -19949 -8435 -27051 13317 50239 29061 -15095 19937
8026 19937 19643 -45654 -42260 -26563 46482 77775 17010 -8636 -22214 -70994 -54896 -35879
8014 -35879 -20643 27060 56049 72421 41775 3829 16561 26376 37256 52568 72074 84231
8002 84231 59247 61261 83146 37226 741 -50560 -42358 -22626 -10856 -3329 -5831 -6316 2755
7989 2755 11337 -4411 -37196 -33994 42813 75932 52296 -6068 -31323 -33757 -22165 2554 19272
7976 19272 -12791 -11551 -7087 -10497 -51540 -32357 11402 1525 -640 -18389 -10067 17119 3698
7963 3698 5064 10182 -47563 -87124 -133906 -122081 -97120 -41954 22030 25271 14738 7843 -4990
7950 -4990 543 -3941 -29877 3578 54247 70743 72493 38536 -9296 -21328 -17218 -6155 18068
7937 18068 76908 75699 18024 -47440 -52833 -14624 45926 33583 24292 21569 8748 -4445 -27888
7924 -27888 -19627 -7429 5459 18355 9249 -28367 -47191 -18679 -14053 -5497 -5695 -5913 -33052
7911 -33052 -53040 -31302 -38888 10534 72487 57003 40681 20648 -33262 -80328 -63036 9291
7899 9291 35202 9199 -34619 -49047 -34375 -53982 -74263 -51920 -48984 -9398 -21354 -57648
7887 -57648 -88326 -67717 -21224 -13106 20268 44083 34918 -10881 -26770 -42581 -22810 -83703
7875 -83703 -37812 14565 22616 -15965 -13207 -37092 -39731 -42492 -58197 -2097 -3254 -43562 -79238
7862 -79238 -70635 -25940 2604 -10138 -45113 -87453 -48097 -36917 -44843 -50794 -89246 -117105
7850 -117105 -91093 -93834 -78044 -61012 -74267 -108366 -92883 -111868 -79237 -67524 -52457 -12351
7838 -12351 2967 -13859 -5210 -10868 -10529 9650 14035 -4072 22795 49731 16169 -4685 6002
7825 6002 25950 -8223 -32289 -14893 17944 38056 48475 53080 -673 -28555 -47880 -71481
7813 -71481 -114339 -109517 -41700 -1577 8925 -433 -37085 -24177 -24630 -28040 -70187 -61017 -47882
7800 -47882 -48598 -29332 -16128 -44746 -48103 2110 903 27051 21174 -10982 -9513 -30760 -55588
7787 -55588 -30023 -4692 -54144 -32669 28488 14734 4574 9701 -48428 -53889 -41027 -27782
7775 -27782 -5462 -32462 -63080 -34318 -39555 -71765 -105189 -104241 -14775 35130 -3610 -26236
7763 -26236 -38051 -35003 -71052 -109688 -82382 -61018 -55595 -26499 -16281 6708 2074 31886
7751 31886 12736 3428 18114 18945 -6505 -29686 -52031 -64620 -47100 -21807 11834 16541 296
7738 296 -15180 -18128 -39119 -66201 -98170 -105607 -64403 -33741 -54246 -84012 -61349 -57702 -131188
7725 -131188 -146586 -112880 -94553 -38511 8848 5687 10479 6347 22441 -26634 -56420 -31222
7713 -31222 -276 31014 38248 44920 24567 -14962 -6454 -8479 1260 -15239 -45028 -52809 -43954
7700 -43954 -20479 -35057 -39907 -45764 -44821 -23044 17871 35661 26032 -10594 4386 -493 -29445
7687 -29445 21169 25189 -33334 -29413 -24519 -68364 -76319 -56600 -17702 45567 51454 29377 8379
7674 8379 -15943 -42028 -60668 -13749 6512 -33568 -6800 -12384 -40359 -44174 -43119 -14955 2299
7661 2299 -43901 -52527 -38549 -13421 2285 25948 10312 6345 -21749 -75782 -70350 -62007 -36697
7648 -36697 -3048 19022 2162 -21812 -63991 -52784 35990 88042 90258 32904 -18584 -7440
7636 -7440 20731 25170 -11639 -2045 -20963 -60115 -51993 -12111 33506 2066 1084 46123 -5285
7623 -5285 7329 -24037 -48396 -81200 -109462 -89707 -58996 -31774 -34747 -20900 -4989 -26900
7611 -26900 -6860 -5492 -41899 -99367 -90473 -32549 21375 9677 -12425 9893 -17845 21466
7599 21466 74061 57537 53222 31851 62765 106938 105318 74629 78240 71586 47981 27587 -26537
7586 -26537 -13541 23092 4325 -15002 -4525 14638 23655 21191 -34746 -55644 -39194 -25431
7574 -25431 18929 -9202 -43107 -28267 264 -45066 -78338 -54451 -40096 -26657 -21834 18747
7562 18747 28663 -52090 -72636 -68986 -46377 -25189 -69440 -97674 -79353 -49369 14177 33235
7550 33235 9744 -29270 -43715 -18597 -9740 -6876 -17553 -15941 -23274 7689 -15891 -12316 9006
7537 9006 24051 1143 -13208 -6701 -38905 -86791 -65511 -8642 -1652 -21178 -45055 -61639
7525 -61639 -96113 -70486 -31309 -51552 -100062 -35353 -5416 -4834 -16370 -11086 -19078 -33339 -69357
7512 -69357 -78965 -39460 -52519 -70049 -73887 -71327 13945 25499 15543 22828 -35766 -41318 -23812
7499 -23812 -28174 -28583 -40763 -56292 -30921 -16112 -10883 22917 29052 65486 14403 -34369 -47781
7486 -47781 -80422 -107363 -81508 -46503 11250 -3636 6085 2312 -38256 -34844 7764 10749 7877
7473 7877 -20334 12854 66496 108583 84761 368 -36563 -29924 -34133 -35840 -33051 8099 -10455
7460 -10455 -14553 -9791 -60413 -90238 -43851 18101 37847 29084 7512 -19359 -10681 28395 -18280
7447 -18280 -32461 -13317 -11278 -43849 -66311 -53598 -12590 21074 12149 -15190 -58828 -65284
7435 -65284 -13769 -3163 33421 50040 62318 33805 45426 -6506 -44661 -85812 -22833 42434
7423 42434 53845 87539 51071 34509 -13615 -34835 -18868 -13774 20222 8972 8857 47540
7411 47540 67058 66115 30909 44457 22474 -24043 -11782 -22659 -17293 9293 37550 55288
7399 55288 7114 1782 -7662 -25958 -34145 -25256 -8868 -26636 -17357 4422 -12508 -7360 3494
7386 3494 -1345 11065 -2645 11310 -16868 -16245 31326 23882 18948 -19342 -57493 -46726 -15133
7373 -15133 13380 -19003 -53265 -54100 -52953 -33861 -14185 -25915 -32417 -1403 8952 -21908 -49767
7360 -49767 -63090 -55746 -46109 -84005 -85220 -71573 -53021 -8726 10677 -20613 10710 -30119
7348 -30119 -58538 -18414 -22260 -45030 -38123 -911 38300 46000 41609 21095 -44260 -73717 -76062
7335 -76062 -117723 -112623 -95336 -47509 -14543 -6189 10763 -18772 -20631 -4742 -24678 -69317
7323 -69317 -75043 -34737 -32370 -20381 2577 17042 22913 -17982 3515 39657 44263 68675 50881
7310 50881 2405 -6624 -27747 -26798 -43969 -95256 -68271 27221 34794 -12873 -38959 -47763 -78358
7297 -78358 -17471 40474 73419 37013 37802 50006 17347 -24658 -49167 -33433 11857 61888
7285 61888 63945 4489 -23695 -3332 -34006 -66856 -56001 -38122 -57769 -72516 -79931 -53832
7273 -53832 -50458 -45976 12283 10375 -10963 -18642 -614 -29041 -16961 -5987 -31723 -44840 -3175
7260 -3175 5325 -25206 -6372 -10918 -32756 -41975 -6700 16112 17638 16129 -1294 -20300 -18927
7247 -18927 7166 60340 68670 58140 40647 -29037 -64660 -110784 -106780 -86238 -78160 -56811
7235 -56811 -49715 -23577 -43451 -69630 -26739 -64273 -32903 -38703 -64597 -40012 -6034 -43010
7223 -43010 -86632 -114486 -142933 -133520 -95183 -74016 -60699 -60857 -94324 -95974 -34146 -22073 -51683
7210 -51683 -114636 -106962 -50656 6036 24667 -7221 -91710 -108007 -55515 3676 -625 -28150
7198 -28150 -57296 -61747 -71899 -50739 -39014 -15665 -151 -28855 -73048 -75013 -85659 -93853
7186 -93853 -64599 -68858 -36442 -23914 -25172 -33456 -28445 37772 26055 -616 -95673 -95275 -77765
7173 -77765 -63582 -81917 -99688 -127299 -108905 -96736 -46135 2800 -36988 -53570 -33311 -63257
7161 -63257 -59814 -44340 -52572 -68812 -65201 -89403 -84896 -80026 -64409 -26206 -35926 -43943 -65549
7148 -65549 -60903 -41882 -36469 -19278 -10916 -41278 -28173 -38979 -13186 -33517 -52639 -37916
7136 -37916 -25475 -42707 -49866 -94264 -92402 -77307 -41529 -14605 9178 -10316 -39682 -34554
7124 -34554 -5654 16276 10709 16824 3755 -5473 -21475 -37092 -56972 -43871 -81435 -84349 -26740
7111 -26740 33604 49949 52740 34028 32802 39603 45034 40512 22720 14835 -10506 -3434 -153
7098 -153 19476 17240 27146 21815 23074 36423 26229 -29670 -32493 -69335 -79898 -47776 -3983
7085 -3983 -9851 -52035 -35207 -15564 -27293 -35445 -10373 -24582 -33064 -12901 -21112 7236 1934
7072 1934 -9358 -44606 -30174 12635 1958 -5787 -42287 -3472 10442 26291 -712 -43076
7060 -43076 -90281 -51660 -20873 -46432 -47638 14015 20285 -588 -39310 -49985 -19982 -27881
7048 -27881 -51762 -59663 -42872 -62714 -58807 -30992 -21481 -30106 -56167 -115818 -144219 -146133 -120588
7035 -120588 -94466 -114727 -107663 -90164 -98278 -111232 -147197 -112534 -23262 60539 62217 -29024
7023 -29024 -71228 -73651 -57932 -62939 -64415 -28309 -74325 -109548 -57226 3359 -6359 -24702 -12549
7010 -12549 14094 -5718 -20430 -29908 -69753 -89081 -56423 -20616 -3372 41750 16512 -28648
6998 -28648 -2268 7191 7876 -7003 -35128 -43798 -4277 16938 60395 38827 -1567 2438 8495
6985 8495 34202 -5703 -29964 -30475 -24078 -21787 -18132 -55452 -82771 -50625 18280 28097 -10965
6972 -10965 -28560 7298 4552 -29162 -1626 13453 35007 -1920 8323 51443 39900 24318
6960 24318 13421 7509 17112 48671 29440 -25982 666 3088 -26389 -57394 -54323 -23599 -64638
6947 -64638 -50207 -32979 -14431 18329 39501 25859 4181 -20023 -50173 -69079 -92287 -81527
6935 -81527 -16954 30304 8459 -24758 -60615 -88649 -71004 -61855 -73473 -21115 11479 11606
6923 11606 -9654 -12037 2952 -7568 -68878 -63816 -18150 -39426 -43412 -39414 -41380 -21149 16476
6910 16476 14459 -14154 -76939 -60296 -18127 1754 12853 -2678 -67118 -47799 -48521 -31500
6898 -31500 -19034 -46263 -66230 -19141 -20004 -4431 -16691 -41871 -24453 -4464 -16702 28407
6886 28407 61362 40293 14522 -10417 -93778 -86379 -42881 -23483 -27796 -22105 -16364 -21655 3680
6873 3680 37163 -12107 -82909 -154562 -127401 -110704 -103346 -72168 -67097 -64665 -51259 -30388 -11584
6860 -11584 7080 3395 47663 40520 -4343 -13145 -35891 -38396 -28412 -33909 -20825 -8399 -30257
6847 -30257 -32353 1887 -10619 -37507 -38304 5521 30426 42189 59747 54014 38968 54369 85056
6834 85056 40628 2110 -18472 -13117 -51253 -28348 -45416 -57098 -48667 -25723 -23256 44335
6822 44335 25851 -11774 -41033 -83246 -88762 -81883 -30371 17027 -4265 -47168 -70684 -72855
6810 -72855 -56852 -32239 19934 74916 32945 -35686 -1932 29648 62073 27226 -27518 621
6798 621 24350 -2591 -45825 -38190 -13715 36285 36406 22669 18720 -2089 -41507 -18939 16469
6785 16469 73572 75579 41767 -5383 -49071 -38022 -46102 -48444 -35708 18420 10172 -28497 -62995
6772 -62995 -55825 -64870 -43837 -33450 -77439 -99736 -94428 -59705 -56077 -57378 -24157 -27422 -47648
6759 -47648 -71885 -121014 -76325 -36634 -41976 -69490 -50140 -37001 -20694 -3773 -40651 -26596
6747 -26596 -11070 -38355 -80491 -77887 -18568 -8806 3831 13298 22435 39760 -451 -14722 9626
6734 9626 42887 39858 -7369 -88698 -117510 -116203 -98063 -43141 2325 -18815 -23928 7528 32637
6721 32637 42024 9258 -42793 -21120 -18614 -32983 -25875 -50845 -72918 -44448 -30369 -91964
6709 -91964 -132458 -115467 -87157 -86445 -116218 -128982 -102421 -82322 -63281 -67122 -70186 -65747 -30066
6696 -30066 14187 34497 56471 26775 635 46953 53735 26782 24421 -28049 -94266 -78155
6684 -78155 -31683 15709 19160 23847 14998 11187 7708 -33647 -51934 -80497 -25970 7647 7038
6671 7038 -1817 30928 92352 69786 50524 36599 6793 2451 22388 41404 31586 35133 60513
6658 60513 24455 52874 86618 93957 99970 101881 63696 -4956 -59949 -84382 -88018 -68884 -8504
6645 -8504 -29341 -16049 -9249 -27011 -6512 -40271 -64424 -47825 -13996 11574 -29090 -52745
6633 -52745 -67741 -64677 -53119 -5558 -34648 -56173 -85408 -63828 -12471 10261 8737 -25896
6621 -25896 -46739 -90422 -110974 -90470 -65182 -69986 -18863 4513 -18896 -28936 -16266 1077
6609 1077 -31374 -70828 -84635 -84914 -39855 22250 21423 21159 45161 37702 30777 55366 48890 50582
6595 50582 61619 5678 1788 25085 -15169 -69226 -66469 -29222 12609 -12609 -56206 -34298
6583 -34298 -17894 -16473 -38505 -39021 -37610 -80170 -55462 -38869 -73493 -68872 -45071 169 11477
6570 11477 -33818 -18863 12523 16076 -6774 -12352 -57681 -94637 -67182 -75644 -70478 -64831 -74911
6557 -74911 -57858 -21862 -28048 -9484 5084 4748 5217 7681 15355 17358 -19147 -61657 -39084
6544 -39084 26178 31905 70565 66199 22840 63260 44398 40986 9981 -41463 -46764 -16462 34478
6531 34478 47587 18119 18699 2369 -15357 -31029 -8044 38745 79895 57057 25149 -9927
6519 -9927 -23481 21763 17192 -30030 -70568 -80072 -22991 -9267 9104 31727 -16 -27547
6507 -27547 -35960 5469 1953 -12448 -9245 -13397 -91 53378 29402 -48340 -59525 -32270 10812
6494 10812 23189 9015 -18332 -54553 -60748 -83009 -113787 -87556 -51059 -57805 -9156 -41542
6482 -41542 -47423 -47108 -54964 -46078 -43655 -40434 -60454 -52887 5119 10538 6077 -9278 29234 20644
6468 20644 -7227 2845 -7496 10584 -45850 -51226 -17029 35334 22754 50884 46391 -18831
6456 -18831 -45073 -63951 -73830 -61820 -71581 -112830 -101179 -95681 -58505 -9840 -28732 -34156 -64436
6443 -64436 -80414 -29651 10256 25647 -18384 -94854 -125387 -60493 -28067 -31826 -33221 -32748 -60749
6430 -60749 -71428 -58989 -17632 -7371 -40296 -90136 -79758 -58742 -57102 -106891 -111827 -72458
6418 -72458 -29996 -28035 -68453 -60580 -61776 -54891 -94676 -76238 -33931 -23029 10349 16507 64221
6405 64221 43392 -9242 -30210 -46233 -22870 35453 55338 41252 10892 16124 8318 2443
6393 2443 6965 19939 14349 9583 -25588 -20675 26201 28198 17365 -28071 -89772 -111527 -87804
6380 -87804 -85989 -87067 -41629 -18028 -41119 -62703 -53863 -18967 -10360 -63853 -82608 -47422 -43745
6367 -43745 -34113 -54017 -67627 -38480 -46561 -24123 -67904 -87259 -28182 -1021 -19932 -36278
6355 -36278 -64491 -102758 -119275 -76470 -21069 -28020 -95921 -92517 -34869 -5369 7548 27087
6343 27087 32064 13489 -11602 -3452 4830 13150 33167 55862 19265 2005 -17061 -28180 -38416
6330 -38416 -67370 -38390 -47860 -19550 -16111 -12647 -24885 -28185 -26913 -56484 -55137 -25545 -31954
6317 -31954 -47202 -57075 -91395 -95503 -99202 -83337 -76574 -38708 -58093 -92413 -53950 -5263 19599
6304 19599 62640 79442 28595 -22222 -55452 -34135 -20855 -17603 9300 -40730 -44911 22
6292 22 33772 22520 5770 9611 2009 -12461 13203 42574 47401 8232 4119 -10132 -16283
6279 -16283 -38358 -41137 -65423 -64206 -64436 -61796 -16679 9518 7715 28297 39219 14038 -14696
6266 -14696 -12577 -33038 -40103 -30157 -33282 -59803 -47217 -45223 -60929 -68506 -30457 -34710 -40045
6253 -40045 -59049 -51706 -60418 -43297 -60567 -34706 -24009 -65775 -42049 -18857 7364 18696
6241 18696 5378 -15374 -51297 -43565 -49634 -28284 -18963 -32088 -20536 -21263 -45716 -39146 -33486
6228 -33486 -56771 -62536 -56913 -56280 -93950 -92647 -76041 -11317 -19511 -42657 -52370 -70722 -23294
6215 -23294 34709 -16402 -45919 -57636 -51889 -76032 -30033 -27452 -53917 -12687 -52590 -90460
6203 -90460 -93046 -62606 -86774 -90186 -69963 -2127 22935 47026 30848 47076 63038 44536
6191 44536 -21390 -48502 -75243 -61840 -31899 -21721 26256 5713 -15294 -28383 -15672 -56408
6179 -56408 -89123 -58177 -7659 -5073 15540 52536 14074 -9840 -48919 -52870 -36678 -22896
6167 -22896 -37133 -49775 -91786 -96616 -55319 -31265 21360 33301 14866 9084 18432 33010
6155 33010 35965 -15204 -9320 29130 43161 22743 24696 37967 41289 11728 16624 38461 -12484
6142 -12484 -45329 -18069 25373 30424 42510 60620 80452 99221 80674 55399 39625 15505
6130 15505 -12677 -29762 -3079 17772 645 -4825 -29736 -56173 -47023 25477 -19248 -14145
6118 -14145 -5244 -15749 -18334 2442 -6284 -20847 36327 74337 43316 -9883 35712 2927
6106 2927 697 -34754 -39332 6404 3325 -54238 -54386 -56332 -83873 -67576 -62816 -52870 -10602 28793
6092 28793 21175 6662 1930 -35690 -69584 -66008 -54955 -10018 9973 -6818 -25118 -48115
6080 -48115 -42079 -69955 -58050 -52953 -56224 -49189 -63688 -53618 14398 16915 -3846 -44921 -24843
6067 -24843 7128 8940 -1724 -31423 -67837 -50946 -3573 6311 22834 46211 53922 24590
6055 24590 -9962 -49003 -51595 -13225 14580 -36877 -43425 -50682 -38017 33906 3081 -20584
6043 -20584 3840 -9687 -63233 -46430 16776 38218 64031 79594 53223 -4304 -24048 1807
6031 1807 -6172 -30986 14693 26538 -10623 -7893 -18101 -14888 332 39698 27245 -17635 -33062
6018 -33062 -84135 -146757 -130837 -110690 -82685 -55898 -21472 -10328 33049 -1225 -19503 -66252
6006 -66252 -76637 -25892 -67301 -107681 -67069 -45380 -33707 -38901 -44890 -57416 -115371 -101557
5994 -101557 -60326 -36538 -14830 -49334 -58725 -41739 -19620 -24297 -51140 -43577 -17477 -20687
5982 -20687 -26222 -18478 12859 41820 38340 -10945 -56836 -30880 -36324 -48155 -22098 -10301 -31272
5969 -31272 -91684 -130371 -129543 -80232 -70989 -83198 -65167 -21829 -16830 -5047 6817 -32072 -93261
5956 -93261 -91226 -53388 -46896 -59276 -55464 -67277 -74559 -50787 -14123 15590 -3071 -21891 3981
5943 3981 4518 -6966 -9702 -7746 -31883 -59392 -24559 -9122 21143 72972 81463 76788 44678
5930 44678 37538 13884 45628 48724 -7571 -1256 -15686 -18515 -3540 23752 -5012 -42762 -99388
5917 -99388 -71207 -45862 -17138 21521 64980 80927 45362 61636 74183 54803 42278 25555
5905 25555 50797 75220 66288 -16599 -28360 -1683 -12073 -70046 -33498 36873 57333 54345
5893 54345 70181 36349 55072 63626 38787 30492 67299 46692 44538 21401 23726 18021 35424
5880 35424 98657 46009 -46031 -37590 -36052 -894 26653 16072 -2158 -53359 -19953 -25584
5868 -25584 -3473 5131 12554 1682 52012 73334 43575 30959 -5672 1984 21509 26619 21446
5855 21446 32277 54231 48046 47573 25862 -47285 -78300 -59167 -8750 -1390 6633 17081 -12458
5842 -12458 -29347 -89622 -100884 -45801 2924 25738 7604 -13032 -40843 -58270 -11705 18330
5830 18330 -7151 -37837 -19280 36482 12208 16863 -8811 -27555 -21349 -54769 -7975 6017
5818 6017 -16541 -13941 -492 -10820 -31801 -37778 -84358 -84583 -68384 -15757 7223 -7023 4402
5805 4402 -21462 -19758 18426 7503 -2839 -37989 -59957 -89870 -72186 10286 39648 44122
5793 44122 33183 493 -43004 -23968 -8326 -18026 -15275 80405 89940 43580 38397 17 -66013
5780 -66013 -84051 -76387 -96676 -70204 -35823 -58810 -53023 -44053 -42926 -38900 -33459 -21166 -47642
5767 -47642 -65946 -100270 -83315 -61303 -49503 -10939 -12594 -15397 -492 -38324 -101718 -82954
5755 -82954 -70466 -44937 -18021 -879 -12121 -40363 -2668 38429 34500 44680 19570 -18104
5743 -18104 -1192 5437 7048 9111 -11724 1150 -27542 -26854 -16309 39690 22441 -1143 -30506
5730 -30506 -7426 16882 23124 6888 -5775 -39938 -58839 -65507 -71440 -15461 -1810 10013
5718 10013 -15325 -9017 22862 51660 37147 -4642 -10537 -10641 -26571 3542 -4343 -14121 16188
5705 16188 5955 24428 -3865 -21889 -21431 -24160 815 -38015 -88178 -61650 -89804 -91924 -34456
5692 -34456 28169 9346 -56537 -104781 -101272 -41979 -50121 -55722 -53848 -56068 -20798 -10727 -26279
5679 -26279 -7030 -5227 -24964 -11992 46112 24531 67433 64976 30419 17589 -8453 -1230
5667 -1230 16544 25987 -20952 -14405 -1703 -46179 -77885 -54440 -38057 -13749 12092 23753
5655 23753 18513 -740 1785 12654 7336 7440 44458 24310 -37689 -21314 26103 54148 56236
5642 56236 506 -27217 -34593 -39947 -53931 -44986 -9924 -45445 -33920 -6632 40041 26975
5630 26975 -9118 2698 20277 21942 -1819 -62890 -56158 -46599 -47887 -39054 19056 -3893 -19535
5617 -19535 -52135 -82710 -88057 -84559 -59715 -91714 -75709 -28139 -4864 -19489 -29450 -11661
5605 -11661 -34530 -43601 13806 3301 -8806 -45299 -32275 -8320 7707 41838 49810 20749
5593 20749 -8554 -21440 -7180 64682 84085 35126 9456 35093 40508 33873 3846 -20161
5581 -20161 -63864 -49486 -2129 23741 26003 48922 72945 23272 -15921 -27261 -37019 -23141
5569 -23141 -15402 -26353 -9544 -13794 11939 6583 13141 91220 85611 29678 -11573 -36189 -63120
5556 -63120 -102328 -127723 -87649 -40983 -12877 -13188 -5722 23102 27093 -8456 -20921 -23017 -271
5543 -271 -6098 -24379 -792 8479 17891 -14620 -43000 -33592 -11865 -11858 10685 -14964 -23286 18414
5529 18414 20615 49618 68822 45771 -26120 -7052 29175 67532 45605 55140 94878 43805
5517 43805 28689 -1499 -33128 -40925 -47623 19986 45250 25356 21391 4240 -31895 -32431 -24720
5504 -24720 -9993 7581 16249 -9570 -18234 -11552 19379 -2260 -43559 2112 30475 8132
5492 8132 -48961 -29509 15139 -1621 -12405 -3087 30351 37652 32032 28818 43628 16475 34665
5479 34665 51133 39075 25565 14902 22313 31876 26032 -12685 -29879 -62952 -34138 38295
5467 38295 32471 11783 59021 68158 35261 76384 44619 50092 27645 -51681 -41653 -30341
5455 -30341 -54570 -35488 -20800 851 6476 11382 60281 75559 25085 29593 32986 -11030 -54270
5442 -54270 -49682 -10254 22516 11123 30665 34126 -4348 -31478 -45751 -26966 -31932 -21657
5430 -21657 -53272 -1897 22682 25045 32314 36935 4747 -6528 -5693 6612 14644 -421 20283
5417 20283 156 -20367 -6051 -9850 -12850 -14153 -30934 -13653 -19208 -36577 -61058 -70179 -89541
5404 -89541 -85658 -72197 -27408 3008 -7083 6113 3381 1524 43125 -21224 -92718 -62636
5392 -62636 -27110 12973 -34758 -28057 7100 -21303 -51850 -17485 55952 82121 46179 5923
5380 5923 -1145 -1339 -17998 -6764 -14695 -22368 -12449 20945 47116 54499 30625 15088 -8304
5367 -8304 -17807 -41854 -39073 -58184 -64398 -59706 -102338 -86602 -37475 4174 21629 25273 -11759
5354 -11759 -43908 -52274 -43697 -26858 4448 76639 85736 23941 36389 28999 32497 29158 -25217
5341 -25217 -73631 -83282 -54762 -23473 -12053 -34038 -15021 -4765 -32635 -13368 -12070 -39545
5329 -39545 -66180 -39061 -35237 -57846 -48989 -60785 -83058 -110036 -89269 -48035 6774 51629
5317 51629 73836 24320 -40251 -13503 -1133 43302 99077 77201 68070 32700 27707 10072
5305 10072 -4071 14138 23717 36795 33112 40311 14985 1382 -18174 -7406 52813 52631 28745
5292 28745 17865 62086 63376 10583 -38973 -31902 -28918 -31112 -30890 -825 35705 8685 -10985
5279 -10985 -51745 -74331 -61733 -11765 9730 -845 7456 11095 66598 85165 81507 69664
5267 69664 30620 -2143 -8210 -25427 -9996 17965 34241 82285 70656 51572 5911 -16104
5255 -16104 -27359 -8585 29890 74447 39296 -21993 -47851 -27587 -29900 -30275 -26181 13507 50411
5242 50411 23403 22573 64945 88116 35864 -25658 -25300 20428 12335 -7456 -25580 -16266 -4474
$$ [...]
##END NTUPLES=NMR SPECTRUM
##END=
