##TITLE=Analysis number 311522
Compound Code cc 02104
Project Code qc-cat
Chemist Name weighroom
##JCAMPDX= 6.0         $$ Bruker NMR JCAMP-DX V2.0
##DATA TYPE= NMR SPECTRUM
##DATA CLASS= NTUPLES
##ORIGIN= Bruker BioSpin GmbH
##OWNER= NMR
$$ XWIN-NMR		Version 3.5
$$ Tue Jul 12 09:52:04 2005 GMT Daylight Time (UT+1h)  MAYBRIDGE\NMR@NMR_250MHZ
##.OBSERVE FREQUENCY= 250.131544655141
##.OBSERVE NUCLEUS= ^1H
##.ACQUISITION MODE= SIMULTANEOUS (DQD)
##.ACQUISITION SCHEME= undefined
##.AVERAGES= 16
##.DIGITISER RES= 18
##SPECTROMETER/DATA SYSTEM= dpx250
##.PULSE SEQUENCE= zg30
##.SOLVENT NAME= CDCl3
##.SHIFT REFERENCE= (INTERNAL, CDCl3, 0, 16.522)
##AUDIT TRAIL= $$ (NUMBER, WHEN, WHO, WHERE, WHAT)
$$ ##TITLE= Audit trail, XWIN-NMR		Version 3.5
$$ ##JCAMPDX= 5.01
$$ ##ORIGIN= Bruker BioSpin GmbH
$$ ##OWNER= NMR
$$ C:\u/data/dgb/nmr/ADRS/5620/pdata/1/auditp.txt
$$ ##AUDIT TRAIL=  $$ (NUMBER, WHEN, WHO, WHERE, WHAT)
(   1,<2005-07-12 09:51:42.83 +100>,<MAYBRIDGE\NMR>,<NMR_250MHZ>,
      <created by zg, POWCHK disabled, PULCHK disabled
       configuration hash MD5:
       62 19 C7 07 E1 42 D1 B7 37 6C 3D D0 77 39 F9 E6
       data hash MD5: 64K
       CA C1 C8 53 D8 25 E8 20 FF 7C 37 D4 A6 26 19 80>)
(   2,<2005-07-12 09:51:55.79 +100>,<MAYBRIDGE\NMR>,<NMR_250MHZ>,
      <Start of raw data processing
       ef LB = 0.3 FT_mod = 6 PKNL = 1 SI = 32K 
       data hash MD5: 32K
       1B FA 0E 9F 16 F8 DB 45 1D 3C F6 DF DC 9D FE AF>)
(   3,<2005-07-12 09:51:57.66 +100>,<MAYBRIDGE\NMR>,<NMR_250MHZ>,
      <apk 
       data hash MD5: 32K
       DB 65 52 AF 09 49 EA 03 8C D4 CC 5C 3E DA EF 11>)
(   4,<2005-07-12 09:51:58.30 +100>,<MAYBRIDGE\NMR>,<NMR_250MHZ>,
      <abs ABSG = 5 
       data hash MD5: 32K
       8A 33 2D 4E DB 9C 85 B7 06 A7 B2 47 3C 31 09 64>)
$$ ##END=
$$ 
$$ hash MD5
$$ C8 25 F2 09 1A 66 10 64 3A F1 CC B6 63 A2 39 E2
##$RELAX= 
##$RELAX= 
##$RELAX= 
##$RELAX= 
##$RELAX= 
##$RELAX= 
##$RELAX= 
$$ Bruker specific parameters
$$ --------------------------
##$DU= <C:\u>
##$EXPNO= 5620
##$NAME= <ADRS>
##$PROCNO= 1
##$TYPE= <nmr>
##$USER= <dgb>
##$AMP= (0..31)
100 100 100 100 100 100 100 100 100 100 100 100 100 100 100 100 100 100 
100 100 100 100 100 100 100 100 100 100 100 100 100 100 
##$AQSEQ= 0
##$AQ_mod= 3
##$AUNM= <au_zg>
##$AUTOPOS= <7 >
##$BF1= 250.13
##$BF2= 250.13
##$BF3= 250.13
##$BF4= 250.13
##$BF5= 500.13
##$BF6= 500.13
##$BF7= 500.13
##$BF8= 500.13
##$BYTORDA= 1
##$CFDGTYP= 0
##$CFRGTYP= 5
##$CHEMSTR= <none>
##$CNST= (0..31)
1 1 145 1 1 1 1 1 1 1 1 1 1 1 1 1 1 1 1 1 1 1 1 1 1 1 1 1 1 1 1 1 
##$CPDPRG= <>
##$CPDPRG1= <>
##$CPDPRG2= <>
##$CPDPRG3= <>
##$CPDPRG4= <mlev>
##$CPDPRG5= <mlev>
##$CPDPRG6= <mlev>
##$CPDPRG7= <mlev>
##$CPDPRG8= <mlev>
##$CPDPRGB= <>
##$CPDPRGT= <>
##$D= (0..31)
0 1 0 0 0 0 0 0 0 0.06 0 0 0 0 0 0 0.0002 0 0 0 0 0 0 0 0 0 0 0 0 0 0 
0 
##$DATE= 1121158301
##$DBL= (0..7)
120 120 120 120 120 120 120 120 
##$DBP= (0..7)
150 150 150 150 150 150 150 150 
##$DBP07= 0
##$DBPNAM0= <>
##$DBPNAM1= <>
##$DBPNAM2= <>
$$ [...]
##$SUBNAM7= <"">
##$SUBNAM8= <"">
##$SUBNAM9= <"">
##$SW= 20.6930455092707
##$SWIBOX= (0..15)
0 0 3 0 0 0 0 0 0 0 0 0 0 0 0 0 
##$SW_h= 5175.983436853
##$TD= 65536
##$TD0= 1
##$TE= 296.16
##$TE2= 300
##$TE3= 300
##$TEG= 300
##$TL= (0..7)
0 120 120 120 120 120 120 120 
##$TP= (0..7)
150 150 150 150 150 150 150 150 
##$TP07= 0
##$TPNAME0= <>
##$TPNAME1= <>
##$TPNAME2= <>
##$TPNAME3= <>
##$TPNAME4= <>
##$TPNAME5= <>
##$TPNAME6= <>
##$TPNAME7= <>
##$TPOAL= (0..7)
0.5 0.5 0.5 0.5 0.5 0.5 0.5 0.5 
##$TPOFFS= (0..7)
0 0 0 0 0 0 0 0 
##$TUNHIN= 0
##$TUNHOUT= 0
##$TUNXOUT= 0
##$USERA1= <user>
##$USERA2= <user>
##$USERA3= <user>
##$USERA4= <user>
##$USERA5= <user>
##$V9= 5
##$VALIST= <valist>
##$VCLIST= <CCCCCCCCCCCCCCC>
##$VD= 0
##$VDLIST= <DDDDDDDDDDDDDDD>
##$VPLIST= <PPPPPPPPPPPPPPP>
##$VTLIST= <TTTTTTTTTTTTTTT>
##$WBST= 1024
##$WBSW= 4
##$XGAIN= (0..3)
0 0 0 0 
##$XL= 0
##$YL= 0
##$YMAX_a= 536271
##$YMIN_a= -459387
##$ZGOPTNS= <>
##$ZL1= 120
##$ZL2= 120
##$ZL3= 120
##$ZL4= 120
##$ABSF1= 16.522
##$ABSF2= -4.171173
##$ABSG= 5
##$ABSL= 3
##$ALPHA= 0
##$AQORDER= 0
##$ASSFAC= 0
##$ASSFACI= 0
##$ASSFACX= 0
##$ASSWID= 0
##$AUNMP= <proc_1d>
##$AZFE= 0.1
##$AZFW= 0.1
##$BCFW= 0
##$BC_mod= 0
##$BYTORDP= 0
##$COROFFS= 0
##$CY= 12.5
##$DATMOD= 1
##$DC= 0
##$DFILT= <>
##$DTYPP= 0
##$F1P= 14.0000005364418
##$F2P= -0.99999901652339
##$FCOR= 0.5
##$FTSIZE= 32768
##$FT_mod= 6
##$GAMMA= 0
##$GB= 0
##$INTBC= 1
##$INTSCL= 1
##$ISEN= 128
##$LB= 0.3
##$LEV0= 0
##$LPBIN= 0
##$MAXI= 10000
##$MC2= 0
##$MEAN= 0
##$ME_mod= 0
##$MI= 0
##$NCOEF= 0
##$NC_proc= -4
##$NLEV= 6
##$NOISF1= 0
##$NOISF2= 0
##$NSP= 0
##$NTH_PI= 0
##$NZP= 0
##$OFFSET= 16.522
##$PC= 1
##$PHC0= -88.54524
##$PHC1= 21.02561
##$PH_mod= 1
##$PKNL= yes
##$PPARMOD= 0
##$PSCAL= 4
##$PSIGN= 0
##$REVERSE= no
##$SF= 250.13
##$SI= 32768
##$SIGF1= 0
##$SIGF2= 0
##$SINO= 400
##$SIOLD= 32768
##$SREGLST= <1H.CDCl3>
##$SSB= 0
##$STSI= 32768
##$STSR= 0
##$SW_p= 5175.98343685301
##$SYMM= 0
##$S_DEV= 0
##$TDeff= 65536
##$TDoff= 0
##$TI= <Analysis number 999999
Compound Code 99
Book Reference 9
Project Code 9>
##$TILT= no
##$TM1= 0
##$TM2= 0
##$TOPLEV= 0
##$USERP1= <user>
##$USERP2= <user>
##$USERP3= <user>
##$USERP4= <user>
##$USERP5= <user>
##$WDW= 1
##$XDIM= 32768
##$YMAX_p= 462331869
##$YMIN_p= -269113
$$ End of Bruker specific parameters
$$ ---------------------------------
##NTUPLES= NMR SPECTRUM
##VAR_NAME=  FREQUENCY,     SPECTRUM/REAL,   SPECTRUM/IMAG
##SYMBOL=    X,             R,               I
##VAR_TYPE=  INDEPENDENT,   DEPENDENT,       DEPENDENT
##VAR_FORM=  AFFN,          ASDF,            ASDF
##VAR_DIM=   32768,         32768,           32768
##UNITS=     HZ,            ARBITRARY UNITS, ARBITRARY UNITS
##FACTOR=    0.157963299565203, 1,           1
##FIRST=     4132.6476996994, 0,             0
##LAST=      -1043.33573715361, 0,           0
##MIN=       -1043.33573715361, -269113,     0
##MAX=       4132.6476996994, 462331869,     0
$$ Real data points
##PAGE= N=1
##DATA TABLE= (X++(R..R)), XYDATA
$$ [...]
28124A5418k2062m5617n123J7340J9983K3569j5579L0005J1905n298k5061j767
28112b287k34k6919n363K0109j8634j8578K27k9647l8170L1672J02519j0733K5200
28099B9162L5033o488p00l2685l8957n1625j2241L8601L9615O5085K5374K0005
28087A10179k542l1605n9942l4613j3588j7157K12k6333K3861J3080J8519N633
28075a4296l7366o049N3585P319l9460l4836M280K2302K8172j2605j1927L0597
28063a0284k460n1431k7549J6666J6113L1561M85j8507M5450J0965m5071o7144
28051a01206k3446R420n395M6057P641l3187j902M8852O1792J3539j430N133J0841
28038C6709j3105n9967O81j125m1037j787N607n276j6588N4307O1459l1690O816
$$ plain form
28124 15418 -6644 -52261 -57384 -40044 -20061 3508 -12071 17934 29839 24541 -520 -2287
28112 -2287 -2521 -29440 -34803 -14694 -33328 -51906 -51679 -81326 -119496 -87824 14695 3962 29162
28099 29162 64195 57707 57007 24322 -14635 -66260 -78501 -39900 -285 64800 90174 110179
28087 110179 107637 76032 16090 -18523 -32111 -49268 -49056 -75389 -51528 -38448 -19929 -14296
28075 -14296 -51662 -57711 -4126 3193 -36267 -71103 -66823 -44521 -16349 -28954 -40881 -10284
28063 -10284 -12744 -64175 -91724 -75058 -58945 -27384 -26899 -45406 44 11009 -34062 -101206
28051 -101206 -124652 -115232 -120627 -74570 -66929 -100116 -102018 -53166 8626 22165 20735 25868 36709
28038 36709 23604 -36363 -35682 -36807 -77844 -79631 -74024 -79300 -95888 -41581 19878 -11812 -4996
28025d996L2702K2395L7502N181k8422k9276m2749J0089j2409k0355m632k3036
28013e8006K2426L4420p396m4029L1433J4894j2671K173Q519R246J9476m610N3714
28000F9589m8329l2149o811K0540K9711J1596r517j8913q589L2293L0529K7414
27988I7364o2117m7193R958R035j6032l4236m2818K9137j1916K3142P1792l5020
27976h904q917P432j1475k6812j2988l4402j4192P5819L3766K6962j0136p164
27964H989J3335l4081J11j7817j6206q205m578L906O4956L0598k7869k3959K1129
27951A0309O1132k8736n2763k1238M4298M7422k1739n0800K0247j3839o1767k9200
27939i6674L7063L7328j1738L117j3540o419K8531K7289j7549k6471J4808r697
$$ plain form
28025 -4996 27706 50101 87603 92784 64362 35086 -7663 2426 -9983 -30338 -34970 -58006
28013 -58006 -35580 -1160 -8556 -52585 -21152 -6258 -18929 -16756 -8237 1009 20485 15875 69589
28000 69589 21260 -10889 -17700 2840 32551 44147 34630 15717 7128 39421 69950 97364
27988 97364 35247 -11946 -1988 7047 -8985 -43221 -86039 -56902 -68818 -45676 26116 -8904
27976 -8904 -17821 -10389 -21864 -48676 -61664 -96066 -110258 -34439 -673 26289 16153 8989
27964 8989 22324 -11757 -11646 -29463 -45669 -53874 -58452 -54546 10410 41008 13139 -10820 10309
27951 10309 71441 42705 -10058 -31296 13002 60424 38685 -12115 8132 -5707 -67474 -96674
27939 -96674 -59611 -22283 -34021 -30904 -44444 -50863 -22332 4957 -12592 -39063 -24255 -33952
27927c3952q894L681n265j4630m4620K3266J9730K3660K356J5400J8396M875M7244
27914E1247K8002k7973o576r178l427P719n6038m2556J3605j969k0680J8102K5389
27901b4333N388k9497J3140L1220J7035N25L2283m918l5796O510j5361j1274l4957
27888e0035M2203K0664l5763n2958j3952K6327J2623k5848K6849L0214J2228K4966
27876A7518J6167r613K7332J7271m9160m5970j8513M383M3095K9210j8398L0651
27864D3973l740o360M3755J851n7933j6814P95n6436J649N8281L6891k1253m5510
27851b0851l6497J9788L353j3004M8878J4396j7026k6893k4206K1598m434j9365
27839e4263J9572J4797L2417L2211r446k5257k428k6275o372M3277J5365l5470
$$ plain form
27927 -33952 -42846 -39165 -44430 -59060 -103680 -80414 -60684 -37024 -34668 -19268 -872 4003 51247
27914 51247 79249 51276 44700 35522 32095 39814 -16224 -58780 -45175 -47144 -67824 -49722 -24333
27901 -24333 -18945 -48442 -35302 -4082 12953 13478 45761 40843 5047 11557 -3804 -15078 -50035
27888 -50035 -7832 12832 -22931 -75889 -89841 -63514 -50891 -76739 -49890 -19676 -7448 17518
27876 17518 33685 24072 51404 68675 19515 -26455 -44968 -40585 2510 31720 13322 43973
27864 43973 40233 33873 77628 79479 21546 4732 5527 -50909 -49260 9021 45912 24659 -20851
27851 -20851 -57348 -37560 -34207 -47211 1667 16063 -963 -27856 -52062 -30464 -34898 -54263
27839 -54263 -34691 -19894 12523 44734 35288 10031 7603 -18672 -25044 18233 33598 -1872
27827a872J4322j8749n1458j1353L7134K0166J1927J1383j0492m2589o9818J9648
27815i1751R199k2008L8690P3515q789m2201L353o769r324O9276J2478q038n489
27802A2142J7322j914l5398o678K8593P728J6281k8978K3835N264J4119j3852
27790C8464o1588l054O0097m523j9753j18l1856m0499r393J2283o044l2469M5795
27777e2658M9m729N0358K6337j8338k040k8959l0365K8440L6966q115q475p08
27764a2237L6543J2746k0380J0439L7700L000p441K1364k0142j7009k982m0562
27752A039j2897J6888L6278j825j1074j2760k228j3706o306j2823M765r096k5752
27739d9497k6785j0573K2975O5374L1270J836l615J565j7553o124k0227J7010
$$ plain form
27827 -1872 12450 -6299 -57757 -69110 -31976 -11810 117 11500 1008 -41581 -111399 -91751
27815 -91751 -82552 -104560 -65870 7645 -1144 -43345 -39992 -46761 -56085 13191 25669 17631 12142
27802 12142 29464 27550 -7848 -14526 14067 21795 38076 9098 32933 38197 52316 38464
27790 38464 -23124 -26178 33919 29396 9643 9525 -22331 -62830 -72223 -59940 -65984 -98453 -52658
27777 -52658 -52609 -57338 -6980 19357 1019 -1021 -29980 -60345 -31905 5061 -3054 -11529 -12237
27764 -12237 24306 37052 16672 27111 64811 67811 60370 81734 61592 44583 41601 1039
27752 1039 -11858 5030 41308 39483 28409 15649 13421 -285 -6591 -19414 -14649 -23745 -49497
27739 -49497 -76282 -86855 -63880 1494 32764 34600 30985 32550 14997 8873 -11354 5656
27727E656J6404j9528l6476L8458j6355l2440l2609J3382O0444L6402J3344J5541
27715F2223O665k0041j05186m9635J3731J7363k1947j3454O7401J6398p287k2462
27703e6231q333j624K6456L2981j3184K9534K4235k2346n5804J2148l9855J5819
27691e6204K0967R570k2940L2902O0803P168L916k0442n7617n690l0185J8684
27679c9068K6357J0350N083j1104k0137M4941N7149L2999j4836k8982m9029m4912
27667c1189M3714k4123o6802M274O5440J4382j5578m2816m2839K3894J7803M5020
27655h820M944K2374K1000J5306R429o5866m6169J9619J7166N3681j650j3150
27643B7864l8382K1923k241j7802O2953j3124n7848m7169K968Q6808j7922l1027
$$ plain form
27727 5656 22060 2532 -33944 4514 -11841 -44281 -76890 -63508 -3064 33338 46682 62223
27715 62223 68888 48847 -56339 -105974 -92243 -74880 -96827 -110281 -42880 -26482 -33769 -56231
27703 -56231 -64564 -66188 -39732 -6751 -19935 9599 33834 11488 -44316 -32168 -72023 -56204
27691 -56204 -35237 -25667 -48607 -15705 45098 52266 56182 35740 -21877 -27567 -57752 -39068
27679 -39068 -12711 -2361 2722 -8382 -28519 16422 73571 106570 91734 62752 13723 -31189
27667 -31189 12525 -11598 -78400 -74126 -8686 5696 -9882 -52698 -95537 -71643 -53840 -8820
27655 -8820 -3876 18498 39498 54804 64233 -1633 -47802 -28183 -11017 42664 41014 27864
27643 27864 -10518 11405 9164 -8638 54315 41191 -16657 -63826 -60858 25950 8028 -22999
27631b2999K9133l8029J4265P14J4003M0626K4353J1611j3865l0209J4420r216
27619C4807m5619k8414J4742K9499K6064o720j6758l047J4482p547j521J0934
27607B0902m5723J9972M0061p492n6379l7478J7182M0281R016K7324M2077L542
27595G3285l6276n4197m1867M506N7428J6068j1021j9064k244J3145K7044M6693
27583G3500j7963m6347o5127k8356P086M2701L78l976l5472J8424O0712L6906
27571D2466K9844K830m5303p223k3841k2261p606M1239m136l7621P982M2250L0780
27558D9400J8283l1776n5849J5226L8251R401Q81k3991m646k7245O851N778n7709
27545e7145j306R2943Q692J3147n4918m7670J7097J699r515K5845O8759J5456
$$ plain form
27631 -22999 6134 -31895 -17630 -16916 -2913 37713 62066 73677 59812 29603 44023 34807
27619 34807 -10812 -39226 -24484 5015 31079 24359 7601 4554 19036 11489 9968 20902
27607 20902 -24821 -4849 35212 27720 -28659 -66137 -48955 -8674 342 27666 69743 73285
27595 73285 37009 -17188 -59055 -54549 2879 18947 7926 -11138 -13382 -237 26807 73500
27583 73500 55537 9190 -55937 -84293 -77207 -34506 -34128 -38104 -73576 -55152 5560 42466
27571 42466 72310 75140 29837 22614 -1227 -23488 -31094 10145 6009 -31612 -23630 18620 49400
27558 49400 67683 35907 -19942 -4716 33535 42936 43817 19826 15180 -12065 -5214 564 -57145
27545 -57145 -58451 34492 43184 56331 1413 -46257 -29160 -27461 -36976 -11131 57628 73084
27533G3084k2046m3840N317K2278k0500Q359J3875K8810J8218J555j609L01K174
27520H5976o7516j2707k648k1028k8004M2564K0508M504l4209m5452K7331O0461
27508B9780N091k5292o603K2243K9691j8865j6636l0293j3098J3385L1287j196
27496A9494O000j0370J554m15o418k025M0653O079J512j6207l8125k5715R437
27483a4546L3681N6239j0123m6509J9667J4564l9957J6660K5281Q209l8080K866
27471B7952J1115J5280J2518n7991n3732l5553K3158p010J5390M3807L6124K7335
27459E8393M147n326J6133l8283l7140L613j3843J6048R301M626l7549J2366M4249
27446C6735k8838k2117m4506m4468M4128L6573o069M414m864r994L1964K067P716
$$ plain form
27533 73084 51038 7198 12515 34793 14293 22652 36527 65337 83555 85110 83501 83802 85976
27520 85976 18460 5753 3105 -17923 -45927 -3363 17145 21649 -12560 -58012 -30681 29780
27508 29780 34871 9579 2976 25219 54910 36045 19409 -10884 -23982 -10597 20690 19494
27496 19494 25494 15124 16678 16263 9845 7820 48473 54552 56064 39857 1732 -23983 -14546
27483 -14546 19135 75374 65251 18742 38409 52973 13016 29676 54957 63166 25086 27952
27471 27952 39067 54347 66865 8874 -44858 -80411 -57253 -64263 -48873 -5066 31058 58393
27459 58393 62540 57214 73347 35064 -2076 1537 -12306 3742 13043 17669 -19880 -7514 36735
27446 36735 7897 -14220 -58726 -103194 -59066 -22493 -28562 -24148 -29012 -39006 -7042 -4975 2741
27433B741m8785l3610M5364K6308N564J4977J4097J5736j3419n4427l5194l911
27421f4559J2387P3281K3534M7047k002k4406J9564o171n9019L4735K5056l9847
27409C9600j7167J7896j9175K822N118o225o3791r596K0952l6636K6994N7154
27397A7946j0891j0251k4141M086K5072l099m8613R419k0817Q591r867K0926M4080
27384B441J9784J3115R257m0849m4456j1614L2053K8478k4379o1869J7481q250
27372f8808J903M2149L3654K4397m1835L777M083l1901k4048K3700M6401j2038
27360A434k4351J896l714j1942l4319j2301M1703L667M555L7373J7706p740Q83
27347A4850j2252k3177j0362j679j310j6891p819n037N7828j4596J6303k5739
$$ plain form
27433 2741 -46044 -79654 -34290 -7982 -2418 12559 26656 42392 28973 -25454 -60648 -64559
27421 -64559 -52172 21109 44643 91690 89688 65282 84846 78675 19656 54391 79447 39600
27409 39600 22433 40329 21154 23976 29094 22869 -40922 -50518 -29566 -66202 -39208 17946
27397 17946 7055 -3196 -27337 -23251 1821 -1278 -49891 -40472 -61289 -52698 -62565 -41639 2441
27384 2441 22225 35340 44597 3748 -40708 -52322 -20269 8209 -16170 -78039 -60558 -68808
27372 -68808 -66905 -24756 8898 33295 -8540 -4763 -680 -32581 -56629 -32929 13472 1434
27360 1434 -22917 -21021 -24735 -36677 -70996 -83297 -41594 -37927 -33372 4001 21707 13967 14850
27347 14850 2598 -20579 -30941 -32620 -33930 -50821 -58640 -63677 -5849 -20445 -4142 -29881
27335b9881O696J0725K2792j51K5076J9894j8990p014q5881l6813M0764L6397
27323a6386K5066k0883L8791J4535l2834K0748L8675o678p3747k4435n313l0752
27311g3213l2753K7943K0868k86K5924K3928j51P700k7120l2092l3928M4743M2019
27298f418N683k4075J2296J0694Q602K8088L5365l7856j8568M8449Q75n1976k2468
27285a1309N0746k7088J8672L0176N3870M0865k1042o1324j6282j3996n5630k5914
27273c8256L5944o5279j7108M1192K2873m817J7841K0677k65j8064O652O4764
27261F6154J8779j9471o491p0883q815J9051k5053j9643l0150J3084N1119J2816
27249D97j5035m8122j0599M0992o56k0167q786L2329r770k396J9716J3559P22
$$ plain form
27335 -29881 -23185 -12460 10332 10181 35257 55151 36161 29147 -56734 -93547 -52783 -16386
27323 -16386 8680 -12203 26588 41123 8289 29037 67712 61034 -12713 -37148 -42461 -73213
27311 -73213 -105966 -78023 -57155 -57441 -31517 -7589 -7740 -40 -27160 -59252 -93180 -48437 -6418
27298 -6418 -735 -24810 -12514 -1820 6782 34870 70235 32379 13811 62260 63135 11159 -11309
27285 -11309 39437 12349 31021 61197 115067 155932 134890 73566 57284 43288 -12342 -38256
27273 -38256 -2312 -67591 -84699 -43507 -20634 -25451 -7610 13067 12802 -5262 1390 66154
27261 66154 84933 65462 58971 -11912 -20727 -1676 -26729 -46372 -76522 -63438 -12319 497
27249 497 -14538 -62660 -73259 -32267 -32923 -53090 -61876 -29547 -39317 -41713 -21997 -8438 -7716
27236g716l815k0899l1610J880P450K3403J6297J2659J2226K8136j0641l2010
27224d640P5012K3835k8701n1793Q870L6104J0384k6118j1847Q846j2313k8413
27212g74j3767J2255L7402k8192K55N80l50L2365n6277j1381J3322K0295k4952
27199a9219j6989Q5892N0142m1604p4166n407r708m12l5270l0642J9855M4140
27187c3388k4831J7450J8985K0883q661j030j0245M029J4266j4160m0768j7126
27175g4596K0798L7852N585j2488j8484o419K3830L4538J4157q556l1016k7134
27163d1933J1901l890J384P541J9916k3581o4443l115K7527L0328L7000L5186
27151C3821P726k5350k7025O712O7940L6313n7001j8814k283O498l1470j0583
$$ plain form
27236 -7716 -11531 -32430 -64040 -62160 -54710 -31307 -15010 -2351 9875 38011 27370 -4640
27224 -4640 70372 94207 65506 13713 22583 58687 69071 42953 31106 39952 27639 -774
27212 -774 -14541 -2286 35116 6924 7179 7759 7409 39774 -16503 -27884 -14562 5733 -19219
27199 -19219 -36208 49684 99826 58222 -15944 -21351 -31059 -31471 -66741 -97383 -77528 -33388
27187 -33388 -58219 -40769 -21784 -901 -9562 -10592 -20837 -16808 -2542 -16702 -57470 -74596
27175 -74596 -53798 -15946 -10361 -22849 -41333 -47752 -23922 10616 24773 16217 -14799 -41933
27163 -41933 -30032 -33922 -32538 -24997 -5081 -28662 -93105 -96220 -68693 -38365 -1365 33821
27151 33821 41547 16197 -10828 -4116 63824 100137 43136 24322 22039 28537 -2933 -13516
27139a3516j3549j1967K900J5408K3077K3035o080p1301n5795M5827K7236J805
27127c2920J2903N4344j5097o4334p3072J4333L7844n192l3966K4745P5170N160
27115h2l1396n466J489M7507Q333n8300o022K9806N8797n631O947k3767O74j9206
27101C683l9192n307M1420L9159m5039j6146J6355J6024k7917m5163K2492M1019
27089A388J9595j0142r560K1313k74q378n0161m9843J7172N1432K8607J2067M0330
27076F3546O052l1952L5477K4754Q186k9757J3975k4812k6795N539j4215p173
27064B2825j4312m0011K3139J6406K3140k7820j162J728J5017K335m3847j7886
27052d0448J5164K8765j9674q145r995k8428J644J2289l8466M767M6830N0821
$$ plain form
27139 -13516 -27065 -39032 -36132 -20724 2353 25388 19308 -51993 -107788 -61961 -34725 -32920
27127 -32920 -20017 34327 19230 -45104 -118176 -103843 -65999 -71191 -105157 -80412 -5242 -82
27115 -82 -31478 -36944 -35455 12052 20385 -37915 -43937 -14131 44666 39035 45982 22215 22889 3683
27101 3683 -35509 -40816 604 39763 -5276 -21422 -5067 10957 -16960 -62123 -39631 1388
27089 1388 20983 10841 1281 22594 22320 13942 -36219 -86062 -68890 -17458 11149 23216 63546
27076 63546 69598 37646 73123 97877 106063 76306 90281 65469 38674 44213 29998 22825
27064 22825 8513 -31498 -8359 8047 31187 3367 2205 3933 18950 21285 -22562 -40448
27052 -40448 -25284 3481 -16193 -24338 -34333 -62761 -61117 -48828 -87294 -82527 -35697 15124
27040A5124M2667m1936o3026m017N1139J528k5137j0682q532O827L0229K7677
27028B1861o907r744l586k735J379q679M0200L8838N085J1082p3320n2895M7681
27015H260J5925j0789p9097k7632k6715N4239L7969P476L2943J9484N696k0750
27003A7009k1811o127m7729m632K4105K1711J5706J5057J9699k5926j6636j7352
26991b6926L1690N2255n0562m4717K4717K8614k222k7643j2572J1415L444r396
26979b1903L0261J1425j8048k7962M2283J2872r642q46k3330P374K1769k8740
26967d487N141J8458R120p729p722J2431m7326K5159K1233n8514j8816J9787M2854
26954I589L2694j2529j3077l2692j7719K1606k7084k4614O654O4121k5903L053
$$ plain form
27040 15124 57791 15855 -47171 -51188 -49 1479 -23658 -34340 -42872 -36045 -5816 21861
27028 21861 14954 5210 1624 -1111 268 -8411 31789 70627 75712 86794 13474 -39421 8260
27015 8260 24185 13396 -65701 -93333 -120048 -65809 -27840 -20364 12579 32063 37759 17009
27003 17009 -4802 -10929 -58658 -63290 -39185 -17474 -1768 13289 32988 7062 -9574 -26926
26991 -26926 4764 57019 6457 -38260 -13543 15071 12849 -14794 -27366 -15951 -12507 -21903
26979 -21903 8358 19783 1735 -26227 16056 28928 19286 18440 -4890 2484 24253 -4487
26967 -4487 654 19112 28232 20503 12781 25212 -22114 3045 24278 -34236 -53052 -33265 9589
26954 9589 42283 29754 16677 -16015 -33734 -12128 -39212 -63826 -57172 6949 -18954 -15901
26942a5901M7490k009Q30R40j7735p597j7064l447J9196M336L615j5151k3772
26929b6269N294L2068m939N642J1273j1461j586n524j1219l2127l140L1061M9010
26916C8083J3989o7045k6314K0325R561J629m2728k2170J0328J1609m7963O071
26904i4625L8054O770J5799K8519j379o3797k8469l304O3600Q2061j4088l8823
26892i682j5317N989l7343m755j1069J0034l405M9871q119M1Q612j0708j3347
26879c9198k0297J1737m533j9726l5850J6643M7327j0336Q347L9704J0697K1054
26867B5569k1324l1253J361J9692r128j9104L8050J3453J1141k3893L2806K8074
26855F5444m5059n4795k1468J1348O7250J5464k5182m3747l63L6286J4837l98
$$ plain form
26942 -15901 31589 29580 30410 31350 13615 6018 -11046 -14493 4703 9039 12654 -2497 -26269
26929 -26269 -20975 11093 6154 11796 23069 11608 10022 4498 -6721 -38848 -41988 -10927 38083
26916 38083 52072 -14973 -41287 -20962 -11401 -9772 -52500 -74670 -64342 -52733 -100696 -94625
26904 -94625 -56571 -49801 -34002 -5483 -6862 -70659 -99128 -102432 -38832 43229 29141 -9682
26892 -9682 -24999 -19010 -56353 -61108 -72177 -62143 -65548 -15677 -23796 -23755 -15143 -25851 -39198
26879 -39198 -59495 -47758 -52291 -72017 -107867 -91224 -43897 -54233 -45886 -6182 4515 25569
26867 25569 4245 -27008 -25647 -5955 -15083 -34187 3863 17316 28457 4564 37370 65444
26855 65444 20385 -34410 -55878 -44530 22720 38184 13002 -30745 -31108 5178 20015 19617
26843A9617j5825k0451m045j2913j4250J4071k2258N4437r382p2215j4218K5302
26831g2130K9582J8219q275N524N0829N202j7722M282L983m6354p249j3423o741
26818e4273K3813N343l0255K4826J3696J485n5895O53J6286K4620l929J3875J822
26805a7933m357j0479M3567K7129J2576n158m2292m0154J2122L9033N6639K9824
26793A00517M789n3546j5902k709k0410k7950j860J4052O45O894L47n290k8798
26780b9221p683K5597j7064p253M7878O0000l4635j2397k8878r455N995J6492
26768I376L6010m3306l0851l6224Q332N214K6974j4392j9084q604K0271j3317
26756e9601j5231N8978J9149K119n6391j6785P782j7329J5256m675j3198L4669
$$ plain form
26843 19617 3792 -16659 -20704 -33617 -47867 -33796 -56054 -1617 -10999 -83214 -97432 -72130
26831 -72130 -42548 -24329 -32604 -27080 23749 28951 11229 15511 19494 -26860 -34109 -47532 -54273
26818 -54273 -30460 -25117 -55372 -30546 -16850 -15365 -71260 -70607 -54321 -29701 -33630 -19755 -17933
26805 -17933 -22290 -32769 10798 37927 50503 45345 3053 -37101 -24979 14054 70693 100517
26793 100517 105306 51760 35858 33149 12739 -15211 -17071 -3019 -2374 4520 4867 -423 -29221
26780 -29221 -36904 -11307 -28371 -35624 12254 72254 37619 25222 -3656 -13111 -7116 9376
26768 9376 45386 2080 -28771 -64995 -56663 -51449 -24475 -38867 -57951 -66555 -46284 -59601
26756 -59601 -74832 -15854 3295 5414 -50977 -67762 -59980 -77309 -62053 -66728 -79926 -45257
26744d5257K2582J0685N315O346L2163k0289j596J4700k2005M507O473n3359Q96
26731c8839k634L669N3469L809n5339J8383l292L2125P532l7004L3142J1972l3307
26718f314k4750J5162O3647K4401M308K549m0296m8566j0789L1222k0691l2675
26706d2792L3492k1989n6203q250J2129J2371Q261k4479j3878M4349K0077k9134
26694f6046k5578K8472L7646m577j8695K3388M3146r241l0288j0225j7045l225
26682e2268m626R428K1765K0365N0426j9044n7325l1028J5765J4448R083R125
26670a3886K1751l6527m3815J8733N4507K695k6250P724j3027k308k1166P7663
26658B6094J5730l9603j1707k9461K8594J7025j5913o758j1351J1142J7889R655
$$ plain form
26744 -45257 -22675 -11990 -6675 -329 31834 11545 9949 24649 2644 7151 13624 -39735 -38839
26731 -38839 -41473 -37804 15665 19474 -35865 -17482 -20774 11351 18883 -18121 15021 26993 -6314
26718 -6314 -31064 -15902 47745 72146 76454 79003 38707 -9859 -20648 10574 -10117 -42792
26706 -42792 -9300 -31289 -87492 -95742 -83613 -71242 -62981 -87460 -101338 -56989 -36912 -66046
26694 -66046 -91624 -63152 -25506 -30083 -48778 -25390 17756 8515 -21773 -31998 -49043 -52268
26682 -52268 -56894 -47466 -25701 -5336 45090 26046 -31279 -62307 -46542 -32094 -23011 -13886
26670 -13886 7865 -28662 -72477 -53744 763 3458 -22792 -15068 -28095 -30403 -51569 26094
26658 26094 41824 2221 -9486 -38947 -10353 6672 -9241 -15999 -27350 -16208 1681 11336
26646A1336L7186m6215k0424k158m531J5126Q234M8915j187K9606n967r21N883
26633G4883n9334m505K7989L9517j8999j9647j1196n2920m856J5203J2281p148
26621h732j773L2167J2095J7794K8030N2560r467l8466l4441j7901O328J335m1520
26608a991j4565J4103J5412m255k2418n2k9351K5538K7687r363O150J8860r803
26595A5952K94M9m131L256k6811l1595M1698L4176j8421m2424l172Q354L1485
26582H710j3631J6343k6251l9332R71L3727j1281k3205K0843L027o978J5102J5621
26569f334J7246k5414J57m3248j5187L0422m4590m079N696R287M0207O4317k7521
26556I59o1118O103M5991J2055k0659k3842J6661J4405L9237J9137J1362j2274
$$ plain form
26646 11336 48522 2307 -18117 -20275 -24806 -9680 -1446 47469 46282 75888 69921 69000 74883
26633 74883 15549 11044 39033 78550 59551 39904 28708 -24212 -29068 -13865 -1584 -8732
26621 -8732 -10505 21662 33757 51551 79581 132141 122674 84208 49767 31866 38194 39529 -1991
26608 -1991 -16556 -2453 12959 8704 -13714 -13766 -43117 -17579 10108 745 6895 25755 15952
26595 15952 16246 16295 12164 15420 -11391 -42986 -1288 32888 14467 -27957 -31129 -22775 8710
26582 8710 -4921 11422 -14829 -54161 -53190 -19463 -30744 -53949 -33106 -30079 -37057 -21955 -6334
26569 -6334 10912 -14502 -14345 -57593 -72780 -42358 -86948 -91027 -85331 -76044 -35837 28480 959
26556 959 -60159 -54056 -8065 3990 -16669 -40511 -23850 -9445 29792 48929 60291 48017
26544D8017l0283m7784q4069O921K6725M7333N827n2121j3822L4980j7400K7475
26532d8201K9338p318l6428l8254j9182R2188N611K4945K0621m1309p765L0940
26520E186k777l4740J3242L2239j7833r738J2440P931J7481j7183m222m3134J3608
26507b7500J586m3526m7471J751J4515N2096L9947L2840J4434j3276m129k3261
26495a994j4226k7479M060L6328J6207j9656m5653K9816l0344n6135k0609L7261
26483i2424P6476L4961p434R7K064K184N200M6154k970l3592k484m4923m452n555
26469b6698r734J0648k8435J202N3894j8032N410P836m03L2592R078M708l9236
26456B830j6045K1625J7960j9994l5972J0436L6221M1715l0546J0311Q482L577
$$ plain form
26544 48017 17734 -30050 -114119 -107198 -80473 -33140 -27313 -79434 -93256 -58276 -75676 -48201
26532 -48201 -18863 -26181 -62609 -100863 -120045 -27857 -22246 2699 23320 -17989 -25754 5186
26520 5186 2409 -32331 -19089 13150 -4683 -14421 -1981 5950 23431 6248 2026 -41108 -27500
26507 -27500 -25914 -69440 -116911 -115160 -100645 -48549 -8602 24238 38672 25396 21267 -1994
26495 -1994 -16220 -43699 -39639 -3311 12896 -6760 -52413 -22597 -52941 -109076 -129685 -92424
26483 -92424 -15948 19013 11579 11676 13740 15924 21124 67278 64308 30716 28232 -16691 -21143 -26698
26469 -26698 -36432 -25784 -54219 -53017 877 -17155 -11745 -3909 -4312 28280 37358 42066 2830
26456 2830 -13215 8410 26370 6376 -29596 -19160 17061 58776 28230 38541 47023 50600
26444E0600o190j8781r648Q244k4507n6938k5216N144M5884P0699m5361K6809
26432B0739K8975L17l8818l1390l1090k2772N951k0680J5641J9490L0112J5287
26420h238K1123n231K8446l2040r775M5731j0358O400j3983j5824L1127J8448
26408E5826l478m372l269R19n5208K210N2799K9371q1356m2415P4294j50k9376
26395d205Q084O774m1955j3054N685K4347P408j4589J8047j2444K1469K5181K0225
26382E0973P151P024p327n920m2746m1798O2653L2072m1033l7576l9954L1855
26370b4626J9576K0325j9910j4409K4523P0815N1485k1546j4706n8379l5449k6867
26358b9168K1932N986m5628m3970K9577O9716M8232L0215L232p6972J0504K8629
$$ plain form
26444 50600 44410 25629 15981 24225 -282 -57220 -82436 -77292 -31408 39291 -6070 20739
26432 20739 49714 50031 11213 -20177 -51267 -74039 -68088 -88768 -73127 -53637 -23525 -8238
26420 -8238 12885 7654 36100 4060 -5715 40016 29658 36058 22075 6251 37378 55826
26408 55826 52348 47976 44707 45626 -9582 -7372 45427 74798 -6558 -48973 25321 25171 -4205
26395 -4205 3879 10653 -31302 -44356 -38671 -14324 -6916 -21505 -3458 -15902 5567 30748 50973
26382 50973 58124 65148 57821 51901 9155 -32643 30010 62082 21049 -16527 -56481 -24626
26370 -24626 -5050 15275 -4635 -19044 5479 76294 127779 106233 91527 33148 -2301 -29168
26358 -29168 -7236 -1250 -46878 -90848 -61271 8445 56677 86892 90124 13152 23656 52285
26346E2285j1532o2225k1055L3292L1742L8209L6023k6369k9145j323K3882k911
26334F0873l0437o930j7264o5132l41M0793O7597K752n4812L1022N9402j2566
26322G4957p892l3577k6013O987k0602l0763o217k0892j495K4052J1825o6132
26310i5762l2125P8114N6645L8268l1345j0183L3342R586j6033m4488m3723k7079
26298h4783m6114R453M179k2471K8620L3498j1312j5738O6372K7879q116N1310
26286C2777K0770l1467l177k4706O11j5230j6711r1258K4932N0468P051R630K6208
26273a0102J4396K4783k7434n7169k7639n964J6799N4308N0381m96n1870j854
26261b1861j1354L5501L3245R403n98K2741J2322n6140k5189j0106J4845o430
$$ plain form
26346 52285 40753 -21472 -42527 -9235 22507 60716 96739 70370 41225 39902 63784 60873
26334 60873 30436 23506 6242 -58890 -59231 -18438 49159 51911 -2901 28121 87523 74957
26322 74957 67065 33488 7475 14462 -6140 -36903 -43120 -64012 -65507 -41455 -29630 -95762
26310 -95762 -127887 -49773 6872 45140 13795 3612 36954 46540 30507 -13981 -57704 -84783
26298 -84783 -130897 -121444 -117265 -139736 -111116 -77618 -88930 -104668 -38296 -10417 -18533 32777
26286 32777 53547 22080 18903 -5803 -5192 -20422 -37133 -128391 -103459 -52991 -45940 -36310 -10102
26273 -10102 4294 29077 1643 -55526 -83165 -89129 -72330 -18022 32359 31863 -20007 -21861
26261 -21861 -33215 2286 35531 44934 44336 67077 79399 23259 -1930 -12036 2809 -3621
26249c621M1953L6486j7874l8586k1131J8903J931O51l7208j0311j5063k5226
26237f9096O790P02K5990O4786R633m138j2558k4059j4118j1785n036k5405o105
26224f4399K5464j8975j0705J2448J6733K1850K6684P2664L6808j7882l5251m8731
26212A6708j3511o601J2115j4681l0342J5901L0571J7302J1217k8580k6062q825
26200b4788O83K9575j270j3776R627L5368k4554K5925J4112k1256q629J2215n2796
26187a9564l6237p032N1924K8217K3287j3181k3684l0244J0489J2112o2337k8185
26175i4435j584N3198O5706j8187J736q435l1052J3282L9427K5630J8027N792
26163F9105n1809m3246K2141m3057l2379N0913K2694P509j910n4476M7157J9168
$$ plain form
26249 -3621 38332 74818 56944 18358 -2773 16130 18061 18712 -18496 -28807 -43870 -69096
26237 -69096 -62306 -61604 -35614 29172 38805 34667 22109 -1950 -16068 -27853 -32889 -58294 -64399
26224 -64399 -38935 -57910 -68615 -56167 -39434 -17584 9100 81764 118572 100690 65439 16708
26212 16708 3197 -3404 8711 -5970 -36312 -20411 10160 27462 38679 10099 -15963 -24788
26200 -24788 -24105 5470 4200 -9576 51 35419 10865 36790 50902 29646 21017 33232 -19564
26187 -19564 -55801 -62833 -10909 17308 40595 27414 3730 -26514 -16025 -3913 -66250 -94435
26175 -94435 -96019 -42821 22885 4698 6434 -2001 -33053 -19771 19656 45286 63313 69105
26163 69105 17296 -25950 -3809 -46866 -79245 -28332 -5638 1871 -39 -54515 -7358 11810
26151A1810l7199j0015K3977N3346j6943m9474j8821r005K5339K4420M6710o259
26139C7886m9502j8767L5208N491L0800J1715J7207j950m5861p2550K7049N6744
26127C3470k8088o6393J8993n112l0884m090N2587R084n3182Q012j3594K8345
26115e0852L5548K4863M1l1459k539J9612J333L1169L1557k1097O831J6251M017
26102F5275l2456l7446k8230o2682J8021O566k8259L830J8338K6380j0657K0717
26090d0603K0603N6816L236k0640n849k842K3188L2538o009l8670l8067m3682
26078e9981j0776N3123J4459l2067J4966L841k2044j8268J5507J1979J6589L2282
26066A9610J9201l4113k1931M4471K1871k9822k6945o690k6861l6383L5300J528
$$ plain form
26151 11810 -25389 -35404 -11427 41919 24976 -24498 -43319 -52324 -26985 -2565 44145 37886
26139 37886 -11616 -30383 4825 10316 41116 52831 70038 68088 22227 -50323 -23274 33470
26127 33470 5382 -61011 -42018 -47130 -78014 -82104 -29517 -20433 -73615 -65603 -79197 -50852
26115 -50852 -15304 9559 9600 -21859 -24398 -4786 -3453 27716 59273 38176 45007 61258 65275
26102 65275 32819 -4627 -32857 -95539 -77518 -70952 -99211 -95381 -77043 -50663 -61320 -40603
26090 -40603 -20000 36816 40052 19412 13563 10721 33909 66447 60438 21768 -16299 -59981
26078 -59981 -70757 -17634 -3175 -35242 -20276 -16435 -38479 -56747 -41240 -29261 -12672 19610
26066 19610 38811 4698 -17233 27238 49109 19287 -7658 -14348 -41209 -77592 -42292 -40764
26054d0764K7336m9467J5609O0366L6435l8773l6653n9153k2163L7507N395J0261
26042e4064N3636N0940L647p6727m7505K3588L0734J3879p802l487M503k688K6412
26029A5066k9201n3963J0880O1243j3612K0042J2835J6982m8710l7921M5454J3179
26017A2274n3275k926J8234M721P8689Q715l0458m090j2956J3048k1026j6687
26005e737m8264m7631N0595J2820K4162j2873o3766J0183M0521J6359j708K2226
25993c113j3859j187J6551q550L2910k574p1097m2043L206K8569M5202M3476M781
25980C2272o63j1754j2085j3895j2853K6388k5354m3294R78K6085K9319k4718
25968b9574k2068M250j4362M6406K7931l7658j4073k0275K1684J2754M1454m851
$$ plain form
26054 -40764 -13428 -62895 -47286 13080 49515 10742 -25911 -85064 -107227 -69720 -64325 -54064
26042 -54064 -428 50512 54159 -22568 -70073 -46485 -15751 -1872 -9674 -13161 -8658 -11346 15066
26029 15066 -14135 -68098 -57218 4025 -9587 10455 23290 40272 -8438 -46359 -905 12274
26017 12274 -41001 -43927 -25693 -20972 57717 66432 35974 31884 18928 31976 10950 -5737
26005 -5737 -54001 -101632 -51037 -38217 -14055 -26928 -90694 -80511 -39990 -23631 -25339 -3113
25993 -3113 -16972 -18159 -1608 -10158 22752 20178 -50919 -92962 -89756 -61187 -15985 27491 32272
25980 32272 31609 19855 7770 -6125 -18978 7410 -17944 -61238 -60260 -34175 -4856 -29574
25968 -29574 -51642 -47392 -61754 -15348 12583 -25075 -39148 -59423 -37739 -24985 16469 11618
25956A1618o723j8705k5925l7393N3894K3627P183j7056M0984J5887j7137J5637
25944D5891j6249L3507k5032l1958l1586k672Q217l0617m932m7285j758K9362
25932g5112L1579M8944m152k6328J2830M0972K4587j0933j2837m2144L5527L285
25920B6218k6025k2513L3138K764J0247J9200o5511l0222K8514N705L3214J1420
25908B6149l4550l229k965Q141j8003p516k687J4564K0179j1604l802K3519o576
25895A620k663n261q277J1431m648m1636L163J1912Q3342L2209K7132m892m4201
25882E9231k2107r076j6141K8477M3637L5799r699K9313m9911q7539l4100J0458
25870b1658K3389M6197P76j5984J9027L4327Q172k7331r2179k8585R2341L6866
$$ plain form
25956 11618 4895 -13810 -39735 -77128 -23234 393 7576 -9480 31504 47391 30254 45891
25944 45891 29642 63149 38117 6159 -25427 -28099 -19882 -50499 -55431 -102716 -104474 -75112
25932 -75112 -43533 5411 1259 -25069 -12239 28733 53320 42387 29550 -12594 22933 26218
25920 26218 193 -22320 10818 13582 23829 43029 -22482 -52704 -24190 -18485 14729 26149
25908 26149 -8401 -11630 -14595 -6454 -24457 -31973 -34660 -20096 83 -11521 -15323 8196 1620
25895 1620 -1043 -6304 -14581 -3150 -7798 -49434 -46271 -34359 48983 81192 108324 103432 59231
25882 59231 37124 28048 11907 40384 84021 119820 110121 139434 89523 1984 -32116 -21658
25870 -21658 1731 47928 48704 32720 51747 86074 94246 66915 -25264 -53849 38492 75358
25858G5358k7992k8392j3726J1052K3012J4865K2320m608n6873J0586J9687j663
25846D3626K7340o600n2567o5594l7650J1386J5437M6427O858j0526r881l653
25834c5397k0092K7484l1954P045J2237k5136j4891K9689j7021M65K5141L9675
25822b755P991j6129j1869P047J6527K1468j5301K3487R2843N5589o7654o8403
25810D2841k8111O092Q733N969k386k4888n276l9919o137k0659J1912M1799L4929
25797B4899J9792m3462n2640j3033J8999K0737M7500j2203k4732o603p802r865
25785c8413m0026l322P0617K6620J225M3263L4542O385k9640l1010R762k560o0014
25772a2571k0939L4225O090k9899Q312J5376p815j3650K7517J241j4556q188K6787
$$ plain form
25858 75358 47366 18974 5248 16300 39312 54177 76497 71889 15016 25602 45289 43626
25846 43626 70966 64366 11799 -53795 -91445 -80059 -64622 -18195 -11337 -21863 -31744 -35397
25834 -35397 -55489 -28005 -59959 -52914 -40677 -65813 -80704 -51015 -68036 -67571 -42430 -2755
25822 -2755 5236 -10893 -22762 -15715 812 22280 6979 30466 123309 178898 111244 42841
25810 42841 14730 20822 29555 35524 33138 8250 2974 -36945 -43082 -63741 -51829 -10030 24899
25797 24899 44691 1229 -51411 -64444 -45445 -24708 22792 10589 -14143 -20746 -28548 -38413
25785 -38413 -78439 -81761 -11144 15476 16701 59964 94506 100891 71251 40241 50003 47443 -12571
25772 -12571 -33510 715 6805 -23094 -14782 594 -7221 -20871 6646 7887 -6669 -14857 11930
25759A1930O3201Q395p2056k9293L6589k95k0432j0108j7937o4675l6204K4541
25747a06344M4108K8709L2308j6908P324J9367N758j8512j9721k9813J611J6857
25735c5256L4037O4168J6648j7104l2879N5264N156m8321l7477J698j697K438
25723F675M0975K194J6336K8116q987j2302k7709o7678j1678K966L0600J3179
25711A2687O422M2786j4778k7132j9646K2644J7051j3231j0557O780q589K2659
25699C7096O792j4242k3731j4564m7221k7805j0184N1181j8531M5474N6960m168
25687C7057j2500J7654r337K2863M4261j4013n5750m0636J0859o400J1153j9434
25675a4223q2712r586K9830L5066N1383K1738p283R738j2267j827l4376J7618
$$ plain form
25759 11930 75131 83526 11470 -17823 18766 18471 -1961 -12069 -30006 -94681 -130885 -106344
25747 -106344 -62236 -33527 -1219 -18127 -10803 8564 14322 -4190 -23911 -53724 -52113 -35256
25735 -35256 -1219 62949 79597 62493 29614 84878 90034 41713 4236 5934 4237 6675
25723 6675 47650 49844 66180 94296 85309 73007 45298 -22380 -34058 -31092 -492 12687
25711 12687 19109 61895 47117 19985 339 22983 40034 26803 16246 23026 14437 37096
25699 37096 43888 29646 5915 -8649 -55870 -83675 -93859 -42678 -61209 -15735 41225 37057
25687 37057 24557 42211 32874 55737 99998 85985 30235 -10401 458 -5942 5211 -14223
25675 -14223 -96935 -106521 -76691 -41625 9758 31496 24213 33951 21684 19857 -14519 3099
25663C099J4338J263r409p239k6004j2004j8341j2621J4878J3299l4994K1765
25651e1970L9711Q522K9324K7838k6903l0654K4565O9741k3517p3672m3494R36
25639d9573J1068K9089o668l8449N0051K3714L1148J5238l1348K8574M3406K5326
25627A31576m3087o6983k5771J2954P4749J7015l9918m1444k0145M3771L6334
25616G9051K0105j7946l5779m7997m9030J1737O0673O574j1497m841K3425J4998
25604D9473j7659J5297j488K6821j9149p469J3657L384m4589m064k6365J7899
25592E748l3358m9189P574O4230L8538j4732J284J1550m6221k1781n759k134K3767
25579b0483K2326r71k4215j6356p910N5143K3433N06j5961q824k091k1272l5996
$$ plain form
25663 3099 17437 18700 9291 2052 -23952 -35956 -54297 -66918 -52040 -38741 -73735 -51970
25651 -51970 -12259 -3737 25587 53425 26522 -4132 20433 90174 66657 -7015 -50509 -49573
25639 -49573 -38505 -9416 -16084 -54533 -4482 19232 50380 65618 34270 62844 106250 131576
25627 131576 88489 21506 -4265 8689 83438 100453 60535 19091 -1054 42717 79051
25616 79051 99156 81210 45431 -2566 -51596 -39859 20814 27388 15891 11050 34475 49473
25604 49473 31814 47111 45623 72444 53295 45826 59483 62867 18278 14214 -12151 5748
25592 5748 -27610 -76799 -69225 -4995 33543 18811 20095 31645 -14576 -36357 -42116 -44250 -20483
25579 -20483 1843 872 -23343 -39699 -47609 7534 30967 31473 15512 6688 4597 -16675 -52671
25566e2671L0074K3304M7545J0156n97j7747j7674n831k9899J5659j8906L1887
25554A5300L3277Q678q761J3623N470j9935n9503l6498k200l9875q23O3818K9121
25541A692k778m9584M68L8980M4121k509l4914k6422L3552L2596j0947K885J3108
25528D0248k6863k4724l9796k3673K7605j155p31K4612J2948K9968K0390J1822
25516E0651j3824K312J3904r545j6416l3951k8597J4567N101P527P621j7148q610
25503b6408J324K106K461j2378m810r590k831O305M2532l6267k5490N6061M0862
25490C3877M49J8829J3368Q82N190l9510L256n092o820m862l840L9549K4788j5171
25476F4893J494M4380J827j8054o9384m1449l5278j1517J3989K7901L1105J0003
$$ plain form
25566 -52671 -22597 707 48252 58408 57811 40064 22390 16559 -13340 2319 -16587 15300
25554 15300 48577 57255 48494 62117 67587 47652 -11851 -48349 -50549 -90424 -91247 -27429 1692
25541 1692 -1086 -50670 -50202 -11222 32899 30390 -4524 -30946 2606 35202 24255 27140 40248
25528 40248 13385 -11339 -51135 -74808 -47203 -48358 -49089 -24477 -11529 18439 38829 50651
25516 50651 36827 39139 53043 43498 27082 -6869 -35466 -20899 -15798 -8271 -650 -17798 -26408
25503 -26408 -25084 -22978 -20517 -32895 -37705 -47295 -50126 -43821 -1289 -37556 -63046 -6985 33877
25490 33877 34326 53155 66523 67405 72595 33085 36341 31249 24429 19567 15727 55276 80064 64893
25476 64893 66387 110767 112594 94540 25156 -16293 -51571 -63088 -49099 -21198 9907 19910
25464A9910k7628O219J1075l0474J5221K7384K1812j4507p583M9916l3920O019
25452D3444L3632k241N283m0019L5864j3826j9192j0472J3351J7272J2098l8825
25440C6369m7613j672j653k311L7155J0316k4885j254m344j3755r118K9760N4783
25427F1778J4172Q80k8470l8312J3670M478j1941k7510j6783k3103J2924J2356
25415b5861L782j4549k5017n291L4296j6042R116l8867R310L8327L1639L159q824
25402d822J6262J3407L4434m0380j8357J2277P201L9896l38K1767M0575l4248
25390H7674o6198n3397l1901K7251M9456l217R123j2795m102k2392k9188K3314
25378b6372J3896Q316q745J1490N7055O7146k4824p3336n4721j1452J7818j1260
$$ plain form
25464 19910 -7718 -1499 9576 -20898 -5677 21707 43519 29012 21429 71345 37425 43444
25452 43444 77076 74835 80118 40099 75963 62137 42945 32473 45824 63096 75194 36369
25440 36369 -11244 -12916 -14569 -16880 20275 30591 5706 4452 108 -13647 -22765 6995 61778
25427 61778 75950 76830 48360 10048 23718 28196 16255 -11255 -28038 -51141 -38217 -25861
25415 -25861 -22079 -36628 -61645 -66936 -32640 -48682 -39566 -78433 -69123 -30796 843 4002 -4822
25402 -4822 11440 24847 59281 18901 544 12821 20022 59918 59580 81347 121922 87674
25390 87674 21476 -31921 -63822 -36571 12885 9668 18791 5996 1894 -20498 -49686 -26372
25378 -26372 -12476 -4160 -12905 -1415 55640 122786 97962 24626 -30095 -41547 -23729 -34989
25366c4989p784M6040j2013k3208J2241J1575K5834l3781j1119M2687j0344l2544
25354b7405J3082J5355K9181O39L9482J4683j659L433k2841p0833m4376K2304
25342b8955m313K6712J9744j7298J4163K0098j8729P942m5140k6205j0291K9843
25330c2429L9236N913j2524L3937K9566k1873J0154j4510o4153l5200J2887J6664
25318c2332n7329J6845K8333j8073j6205N6102O8657l560Q96J3587j2050j655
25306D3216j6848Q400J2854P430n995l3390l399O067j0326J4754j6681k6443k9634
25293d9995j1843j0839L3832l990J109O0852j8794j413K6224L8524l1334k3780
25281H553j3984L171K2761K6204J4814j2748j5046J3602j5117J0542M4983j2999
$$ plain form
25366 -34989 -42773 3267 -8746 -31954 -19713 -8138 17696 -16085 -27204 15483 5139 -27405
25354 -27405 -14323 1032 30213 30852 70334 85017 83358 86791 63950 -6883 -51259 -28955
25342 -28955 -33268 -6556 13188 -4110 10053 30151 11422 19364 -25776 -51981 -62272 -32429
25330 -32429 6807 12720 196 34133 63699 41826 51980 37470 -26683 -61883 -48996 -32332
25318 -32332 -89661 -72816 -44483 -62556 -78761 -22659 45998 42438 43334 56921 44871 43216
25306 43216 26368 34768 47622 55052 49057 15667 12268 18335 8009 22763 6082 -20361 -49995
25293 -49995 -61838 -72677 -38845 -42835 -41726 19126 332 -1081 25143 63667 32333 8553
25281 8553 -5431 -2260 20501 46705 61519 48771 33725 47327 32210 42752 87735 74736
25269G4736q3584k5699K5251j2340l5332J1631J7384O1364M0215m6330K9276K3995
25257H0567k3428n2036j0220J7626M292j2191J1107l4905K6268L2459k6209K8006
25245D1336L3676k8262k4987k3546l1647m181Q9000M4336k1338l1178j1333M893
25233C6769l6950m5039K7080p34o297j7553j4831J902r038K8466J9228o275k821
25220b6093J3346O130l0058K2092K2470j5291k4433J6182K7104j6526J4333l6288
25208b7032J0651K1988J7574j8882k4916k833K1649Q985J4904n254k7998N4167
25196D3003M2654L7725m6326o7600J2157m4541m5393L7453M5928J4406l73n0822
25184b1729m028M8880J0578l8381J6389K3826k7127k6770J7886k2839O6474L9243
$$ plain form
25269 74736 -8848 -34547 -9296 -21636 -56968 -45337 -27953 33411 73626 27296 56572 80567
25257 80567 57139 5103 -5117 12509 16801 4610 15717 -19188 7080 39539 13330 41336
25245 41336 75012 46750 21763 -1783 -33430 -37611 51389 95725 74387 43209 31876 36769
25233 36769 -181 -45220 -18140 -18874 -25171 -42724 -57555 -55653 -64691 -36225 -16997 -23272 -26093
25220 -26093 -12747 -6617 -36675 -14583 7887 -7404 -31837 -15655 11449 -5077 9256 -27032
25208 -27032 -16381 5607 23181 4299 -20617 -23450 -1801 7184 22088 16834 -11164 43003
25196 43003 85657 123382 77056 9456 21613 -22928 -68321 -30868 15060 29466 29093 -21729
25184 -21729 -25757 23123 33701 -4680 11709 35535 8408 -18362 -476 -23315 43159 82402
25172H2402J6112o464n9214m1807K9751k7571Q089j1982j8772J4050l8098K2080
25160c1424R0598L6866M2980m7457n4635N005P98k296l592j1325J1883k0924l2911
25147a6434J9496K9635L3114l8248l6024L7017L5870j6532r917l6813n7431r866
25135f6133K276q798K2830P2012M1383j7390l6682Q550j9297J3815K0746M6220
25123G9532K2270j3112k3628L849n079m0403K7460k5921n3146K2547M3085L7978
25111G5432l0069o3124l9235r507j7384k8455L0477K6206k2673O385N6687k7838
25099d3098j728N5951l950l173O32J7009L8392l5263n0248J3523O1627K5324m180
25086G0818k5275k1648J8091J4408P73m3103m2106m0098k845O002K0729N2028
$$ plain form
25172 82402 98514 92050 32836 -8971 20780 -6791 1298 -10684 -29456 -15406 -53504 -31424
25160 -31424 59174 96040 139020 91563 36928 41933 42731 40435 36843 25518 37401 16477 -16434
25147 -16434 3062 32697 65811 27563 -8461 28556 64426 47894 37977 1164 -56267 -66133
25135 -66133 -63857 -72655 -49825 22187 63570 46180 9498 18048 -1249 12566 33312 79532
25123 79532 101802 88690 65062 68911 63832 23429 50889 24968 -28178 -5631 37454 75432
25111 75432 45363 -17761 -56996 -66503 -83887 -112342 -81865 -55659 -78332 -71947 -15260 -43098
25099 -43098 -44826 11125 7175 4002 4634 21643 60035 24772 -25476 -11953 49674 74998 70818
25086 70818 45543 23895 41986 56394 57167 14064 -28042 -68140 -70985 -64983 -44254 7774
25074G774l2985M15K0661p21j9402K8174p403n8828K5860P5268J2807k2525l5899
25061f804k306J09N254K0819N244J1477k4296j1503j6307J8888j6724J1263L8002
25048C3116M408o864k0783p838n3252j8890J3169j0143M9801K9947p629K2094
25036B7136j4045j5196n284J1582j0007m841O732K0457l0107m7879O908O4458
25024I914P894l8320l0224k7139Q997N1453n901q123N7564K3006n0196p8325K9680
25011d9720N3260K2260J2846k1498k3153N829n503j7901k316L9624O893n4411
24999c3790K274M9898K6693J5626k077n229J0400k0982n788N951m3858r632k2406
24986c2920J4645P2691J6073j4516J1611k1334k0536k9446o308N1910l384n8316
$$ plain form
25074 7774 -25211 -24796 -4135 -4856 -24258 3916 -3487 -62315 -36455 38813 51620 29095 -6804
25061 -6804 -9110 -9001 -3747 17072 22316 33793 9497 -2006 -18313 575 -16149 -4886 33116
25048 33116 37524 30660 9877 2039 -51213 -70103 -56934 -67077 -17276 12671 5042 27136
25036 27136 13091 -2105 -7389 4193 -5814 -10655 -3923 16534 -13573 -61452 -54544 9914
25024 9914 17808 -20512 -50736 -77875 -68878 -17425 -23326 -31449 26115 49121 -1075 -79400 -49720
25011 -49720 3540 25800 38646 17148 -6005 -176 -5679 -23580 -25896 13728 20621 -33790
24999 -33790 -31516 18382 45075 60701 58624 53395 63795 42813 37025 42976 -882 -10514 -32920
24986 -32920 -18275 54416 70489 55973 67584 46250 25714 -3732 -10040 41870 38486 -19830
24974a9830p87L9913K7106m4952j5797j939L7015K3045k9543l3309K0946M5399
24962D7267k4402l2319l5570j4115L7429K6690M5593J9605k7295k4492P139O557
24950C2087j0445J8838J9272K8246N3509l2742k7483k74k4131N378N3615l048
24938A12822l3531M485m8249j8875j1494O762K3149J8627M7531K6507n4437J815
24926G5112J6729j2114l0116J0805n526m569o3567l4429K0737N0964J0864J4205
24914D9095J9108k6915m9725l6244L7424O1323j0764L1052J5056j5659Q430k6767
24902E5414J3679J01k9064m3711l2315R575K5619L9706j8974n96J2396M3179j9633
24889E5376o8447J1097j4028o3K8192J6616Q362P662j3106j9043k8312l3561N160
$$ plain form
24974 -19830 -20617 19296 46402 1450 -14347 -16286 20729 43774 14231 -19078 1868 47267
24962 47267 22865 -9454 -45024 -59139 -21710 4980 50573 70178 42883 18391 25530 32087
24950 32087 21642 40480 59752 87998 141507 108765 81282 81008 56877 62255 115870 112822
24938 112822 79291 83776 35527 16652 5158 11920 35069 53696 101227 127734 73297 75112
24926 75112 91841 79727 49611 60416 54890 50321 -13246 -47675 -26938 24026 34890 49095
24914 49095 68203 41288 -8437 -44681 -7257 54066 43302 74354 89410 73751 82181 55414
24902 55414 69093 69194 40130 -3581 -35896 -26321 -702 39004 20030 19434 31830 75009 55376
24889 55376 -13071 -1974 -16002 -16065 12127 28743 37105 44767 31661 12618 -15694 -49255 -44095
24876d4095M4064q148k786q924K0815o1552k480L9304J5388J251K0635J6891j9916
24863A0447j3807J2314j3733O534L0984p997J6545O082N807j7269k700p3304j236
24850d1333j3231M2776K1348J1728K1479j8466k3669K8305k580j8207l07J1327
24838A9170J5317m2701m4374J4088l0731m2636J7568M8278O4630m931r273J6306
24826B0711J9735n2290L30K6721Q272l6537m024p811M0546L9630n4282k941K1204
24813A9264K8791r157m9773k756K2856k045j9630j1425o0418j7183j4183J9061
24801i6598M9090l3531j178M8301L666K8371J7634k003J0598M118m631j0683j4644
24788a490k913r94K6360j9858m3351L6494L9373L9187j9210j3888k3495j2749
$$ plain form
24876 -44095 -31 -8179 -10965 -19889 926 -60626 -63106 -23802 -8414 -7163 13472 30363 10447
24863 10447 -3360 8954 -4779 1755 32739 24742 41287 47369 53176 35907 33207 -40097 -41333
24850 -41333 -54564 -11788 9560 21288 42767 24301 632 28937 26357 8150 7843 19170
24838 19170 34487 -8214 -52588 -38500 -69231 -111867 -94299 -46021 18609 13678 4405 20711
24826 20711 40446 -11844 -11514 15207 23479 -13058 -17082 -24893 15653 55283 1001 -1940 19264
24813 19264 48055 38898 -10875 -13631 9225 7180 -12450 -23875 -84293 -101476 -115659 -96598
24801 -96598 -47508 -81039 -82217 -33916 -30250 -1879 15755 13752 24350 28468 23837 13154 -1490
24788 -1490 -4403 -5397 20963 1105 -42246 -5752 33621 72808 53598 39710 16215 3466
24776C466l5298r06Q703K6925K6091r489K547l203j9680o436l7608J600M1579
24763a709K0038J2822L1479j6340m2033r225M2800j2912K3798j275l2406n681
24751I356J2800k829J8197Q312L307l172L3484k4027n930O3831K775n7223n6270
24738B611n6906O360J5622K0876k4616K287M5118p158j4266J9796n7431k2116
24726f9823J8370L4487K9772K744L6014J9746p474l25N74K0385J8587O23l6428
24713F7252j9800l6133N552K9576j6557r781l161j9750j19j8093J2595J9744m029
24700G296J3192J8260j2510j7537j0217n7954j6677L8807K4851K050K6112J6790
24688C2463J4647J9435o255P329l8820k8890M506J3490m6633N171M454n893M7584
$$ plain form
24776 3466 -31832 -32738 -24035 2890 28981 19492 22039 18836 -844 -7280 -44888 -43288 -1709
24763 -1709 18329 31151 62630 46290 4257 -4968 37832 24920 48718 47443 15037 9356
24751 9356 22156 19327 37524 45836 49143 45971 79455 55428 49498 113329 116104 58881 2611
24738 2611 -54295 -47935 -32313 -11437 -36053 -33766 11352 4194 -10072 9724 -47707 -69823
24726 -69823 -51453 -16966 12806 15550 51564 71310 63836 63511 64085 84470 103057 103680 67252
24713 67252 47452 11319 16871 46447 29890 20109 16948 -2802 -2921 -21014 -8419 11325 7296
24700 7296 20488 38748 26238 8701 -1516 -59470 -76147 -37340 -12489 -10439 15673 32463
24688 32463 47110 66545 60290 67619 28799 -91 4415 17905 -28728 -23557 -19103 -24996 22588
24675B2588j182q02o962j3626K527j2751J1893r146j8605M393o717k4003P331
24662d5062K9785K1263R4k27P540K3349j1426L3817K4118l3118o045n9345l4869
24649e0126J1576R099L6349L5334K8707j900j0505M329n312j4957k7149o167J0001
24636A9279K1657l5847j6854l646K9963J5510l05j383m5642J5642O2788K5101
24624H6263n3569o5896j7494Q080R886J1301O8749l0576j2138m005L4545K0862
24612E6008l5855m0424K8852L0346K119O643j4648l5154K8819K0744m1035J444
24600G859k8337l2154N4473m040k6150J7674M8770j7585k7803J5898J9849o78
24588B7776N324K4445p218j5758J5805r713j7292l4622l0022j5286m113P076j2494
$$ plain form
24675 22588 21406 20604 13642 16 2543 -10208 1685 -7461 -26066 -21673 -28390 -52393 -45062
24662 -45062 -15277 5986 6080 5853 13393 36742 25316 59133 83251 50133 44088 -15257 -50126
24649 -50126 -38550 -29451 6898 42232 70939 69039 58534 62863 57551 42594 15445 9278 19279
24636 19279 40936 5089 -11765 -15411 14552 30062 29757 28374 -17268 -1626 61162 86263
24624 86263 32694 -33202 -50696 -42616 -32730 -21429 47320 16744 4606 601 35146 56008
24612 56008 20153 -20271 8581 38927 41046 47689 33041 -2113 26706 47450 6415 7859
24600 7859 -20478 -52632 1841 -2199 -28349 -10675 38095 20510 -7293 8605 28454 27776
24588 27776 33100 57545 50327 34569 50374 40661 23369 -11253 -41275 -56561 -60674 -53598 -66092
24575f6092r532J3235M3470N0192j3361m0977j4640L2910K4646M181L0608K602
24563E7242j4803o1889k4474L0881N0293N18j0857k4046q716J1875j9155J2624
24551e07L1104K5941k0176n9559l0334l497M1603M569J4911M892k0238N4560J5956
24538E9225p400J357o9322j7344k702M5961J1310k395M2643j201m0537l5376m379
24525b0160j8831o788J8836J1230J2784k1356j1042R550J5990N1164J9731P710
24513F8818o458l6673l8426J8892n497J8494q274M8927n320o6227N51r701k0837
24500d1731o14K5888M1567J2902n0456k8801L929J897L6988N487L5213M7561M016
24487I3846J3169k0287n5728k6019K434k8900R887J2654L11n4676k1753K2272
$$ plain form
24575 -66092 -75624 -62389 -18919 31273 17912 -23065 -37705 -4795 19851 24032 54640 57242
24563 57242 42439 -19450 -43924 -13043 37250 37768 26911 2865 -5851 6024 -13131 -507
24551 -507 30597 56538 36362 -23197 -53531 -57028 -15425 -10856 4055 8947 -11291 43269 59225
24538 59225 51825 53182 -16140 -33484 -36186 9775 21085 18690 61333 60132 19595 -15781 -20160
24525 -20160 -38991 -45779 -26943 -15713 -2929 -24285 -35327 -25777 -9787 41377 61108 68818
24513 68818 62360 25687 -12739 6153 656 19150 10876 59803 54483 -11744 -11193 -20894 -41731
24500 -41731 -42345 -16457 25110 38012 -12444 -41245 -37316 -35419 1569 7056 42269 89830 93846
24487 93846 107015 86728 31000 4981 7415 -21485 -11598 1056 1367 -53309 -75062 -52790
24475e2790L3177N2519L5910k5716l9626k9214K0274R804r477j9205k7145N187
24463d6302O1576R087o597M8792K4387j9566m022k1734K4805l342k3345l0333
24451A3406o223k4624l1564j4715L6712M0461J6772L999N5388K5916j6427k7580
24439G1521J9534O239o8342j9705n430N0489L0905j2424l0704l3436J1157j0160
24427I644j5577n5715j2417p755M0363K7823K6982m4734l1996N702K3209R306
24415b5165k808J8510L892N148J399l0775K9038l263l137M0447N4212K043M586
24402I4127j2271j0703K5193k7176r2944l6762K8305K3967J6180O744m518M5845
24390E5987J9234J1833j1420q991L3099k7923l4422L2793n748K5472Q792n3006
$$ plain form
24475 -52790 -19613 32906 68816 43100 3474 -25740 -5466 4338 -5139 -24344 -51489 -46302
24463 -46302 15274 24361 17764 66556 90943 71377 67355 45621 70426 67084 43739 13406
24451 13406 7183 -17441 -49005 -63720 -27008 13453 30225 34224 89612 115528 99101 71521
24439 71521 91055 97294 28952 9247 3817 54306 85211 72787 42083 8647 19804 9644
24427 9644 -5933 -61648 -74065 -81820 -41457 -13634 13348 -31386 -63382 -57680 -34471 -25165
24415 -25165 -27973 -9463 -5571 -423 976 -29799 -761 -4024 -7161 33286 87498 89541 94127
24402 94127 81856 71153 96346 69170 -23774 -60536 -32231 -8264 7916 14660 10142 55987
24390 55987 75221 87054 75634 66643 99742 71819 37397 70190 64442 89914 98706 45700
24378D5700n378k9405K2880K1501J9806O896j174k0667J351J5782j1447j3661
24366E2184j4369l929j8823Q568n1735J2895J6089J9546j7541k4565R296K5583
24354A3199Q251k6911j9208K7151L6121j78k2520j7338o974J5615J504j6269J7880
24341A0323L4935l0498m0547K2149O61K4591J8949N6877L0604j3753l8580m3782
24329C1929k9702J8105o912J7090L595l6121k1781m074J6109k080N8191M6137
24317I0486K8309n4628p750L4338J0737m1029j9078k4698m0819q519J9635j2191
24305b5207k2447J8831J0869K6335J8321K6103J363k908J4429M2610O230j2678
24293A01851q3802K9168N3603l3051j1553J0561J8195m6275m8658n451N0633q163
$$ plain form
24378 45700 40322 10917 33797 55298 75104 82000 80826 60159 61510 77292 65845 52184
24366 52184 37815 33886 15063 23631 -28104 -15209 880 20426 2885 -21680 -12384 13199
24354 13199 21450 -5461 -24669 2482 38603 38425 15905 -1433 -8407 7208 8712 -7557 10323
24341 10323 45258 14760 -25787 -3638 -2977 21614 40563 97440 128044 114291 75711 31929
24329 31929 2227 20332 13420 30510 34105 -2016 -23797 -27871 -11762 -13842 44349 90486
24317 90486 118795 64167 56417 90755 101492 60463 41385 16687 -24132 -32651 -13016 -25207
24305 -25207 -47654 -28823 -17954 8381 26702 52805 54168 51260 65689 108299 114529 101851
24293 101851 18049 47217 100820 67769 56216 66777 84972 38697 -9961 -15412 35221 27058
24281B7058o6747k8793L4823L1396J4616q844L5977K30J7758K2337j5496r295
24269E5020K6081k528j0378k3345k1635J1101K9890J5006K2588j1517J6221k1122
24257H5382k8925o1751J3597n202L9768J8243p217L0618k0410J9802J2227J088
24245I7220p598l1714j4687l1631L9518J7957p299j5933l8636K4301L1708m3632
24233A9574K831K0935l0864l9748Q642L6398L0792L6032J8045o937M168K45K827
24220A02940Q232l2116k2805l7413m4110k1426L0176k0179L6276J1718k0280j2783
24208b1770K6448M9225J810j9592R574J9804j513n5279p090L0910L9295m9483
24196B2339n1029J6784J9029p274K8253l6652n6813N23L1477J6588K6159L1291
$$ plain form
24281 27058 -39689 -68482 -33659 -2263 12353 3509 39486 39716 57474 79811 64315 55020
24269 55020 81101 78573 68195 44850 23215 34316 64206 79212 101800 90283 106504 85382
24257 85382 56457 -5294 8303 3101 42869 61112 53895 84513 64103 83905 96132 97220
24245 97220 89622 57908 43221 11590 51108 69065 61766 45833 7197 31498 63206 19574
24233 19574 22405 43340 12476 -27272 -18630 17768 48560 84592 102637 95700 99868 100113 102940
24220 102940 111172 79056 56251 18838 -25272 -46698 -16522 -36701 -425 11293 -8987 -21770
24208 -21770 4678 53903 55713 36121 45695 65499 63986 8707 1617 32527 71822 22339
24196 22339 -28690 -11906 7123 -151 28102 -8550 -65363 -64840 -33363 -16775 9384 40675
24184D0675L8785J1350l3746N372J527j1901j6634L641j7083L9916l3654m5737
24172a7489N181k0116j948n335J5723L1315n106k0100O697n107m0686m2974L2731
24159f7214L4386R058M319K9337J3066K0461q131j9807j6566N7130r538N699K1620
24146G3820l7743K777q635o183K6011j4880k4520J3718j0212K2287L0454K2418
24134H9312N3617J2361J981j1308j9784j4704j4588k9827m2445l633k4326k8821
24122c2165m962K4466P700M9156N1075k8337j4679N06j4191l4517M9117O384q18
24109E8735L359j274j5183j8882m7859j4124L354M6888j6342k5068J8678J7384
24097I666R506J4377M3664l8123q1772K7598N79K253K2304J0696J3133J5308L4409
$$ plain form
24184 40675 79460 90810 57064 62436 63963 52062 35428 39069 21986 61902 28248 -17489
24172 -17489 -12308 -32424 -34372 -39707 -23984 7331 2225 -17875 -11178 -16285 -56971 -99945 -67214
24159 -67214 -32828 -23770 -19451 9886 22952 43413 35282 15475 -1091 56039 46501 52200 73820
24146 73820 36077 38854 30219 24036 50047 35167 10647 24365 14153 36440 66894 89312
24134 89312 142929 155290 157271 145963 126179 111475 96887 67060 24615 20982 -3344 -32165
24122 -32165 -37127 -12661 -4961 44195 95270 66933 52254 52760 38569 4052 53169 59553 58735
24109 58735 62094 60820 45637 26755 -21104 -35228 -31874 15014 -1328 -26396 -7718 9666
24097 9666 19172 33549 77213 39090 -42682 -15084 -14505 -12252 10052 20748 33881 49189 83598
24084H3598k5717k9264j6467j3282L2683K4578j3542j3609Q742M974L108j7583
24072B8219p978n577j8985L3203K3187k7126k3639K0356K9767k0597l1663J1648
24060A0815K7605L3845o501p844O275j1518q463p562n7653j0766K6846L0263K0282
24047D5624J4957L059r385l418L3606j1559K9339K7994j5717j0271l0863l3039
24035D0327k2640L2508J728K3761P287j817J8584k0741k5958o340j2398L5460
24023F9761J1873K9576M063M132K0719K9286j9258m6051m3120j7599k4869m369
24011A4144k258k7776L3836L4201M1892K6786J4039L479k9705m7714j5639j9714
23999B5571K90J4549K8581L9714J0904m5349k8306j8381q551K2147m5452J7190
$$ plain form
24084 83598 57881 28617 12150 -1132 31551 56129 42587 28978 37720 42694 45802 28219
24072 28219 20241 14664 -4321 28882 52069 24943 1304 21660 51427 30830 -833 10815
24060 10815 38420 72265 65764 57920 64195 52677 44214 36652 -21001 -31767 -4921 25342 45624
24047 45624 60581 63640 54255 50837 84443 72884 102223 130217 114500 104229 73366 40327
24035 40327 17687 50195 51923 75684 82971 81154 99738 78997 53039 46699 34301 69761
24023 69761 81634 111210 115273 119405 140124 169410 150152 104101 60981 43382 18513 14144
24011 14144 11886 -15890 17946 52147 94039 120825 134864 138343 108638 60924 45285 25571
23999 25571 25861 40410 68991 108705 119609 74260 45954 27573 19022 41169 -4283 12907
23987A2907L3178Q059L8198M097j5773J25L611k3627l0296m346o243M7463j0784
23974E6569j9133l0949j7382L3578M6575J5578l5596p696j8336J2622j5424k0931
23962e25j2603k905O854L5187m1967m512P1891O156k7695m824k7270J2373L7526
23949D7686L055l6846l4656Q358K1114q702j1140L2220R133r395K6343M0352m060
23936H3462j839j3261O030k9660J3485j1136l3772j1089N9410J2130k2628J9368
23924G0500M4557J0827k3206j3698k8185l5319j36K8163p832L2346k0200O352
23912F4169K7104Q212l1235j4686m6347p191N1775L3427J7538L4363j8485O996
23900A25640K1895o2235m0343P863j6673l0111K3035p723K0367O343J5054j4772
$$ plain form
23987 12907 46085 54144 92342 96439 80666 80791 84402 60775 30479 26133 19890 67353 56569
23974 56569 37436 6487 -10895 22683 69258 84836 49240 41544 23208 35830 20406 -525
23962 -525 -13128 -16033 -9179 26008 -15959 -20471 51420 57576 29881 25057 -2213 10160 47686
23949 47686 50741 13895 -20761 -12403 8711 9 -11131 21089 30222 20827 47170 87522 83462
23936 83462 81623 68362 74392 44732 58217 47081 13309 2220 61630 73760 51132 70500
23924 70500 115057 125884 102678 88980 60795 25476 25340 53503 45671 78017 57817 64169
23912 64169 91273 99485 68250 53564 7217 26 51801 85228 102766 137129 118644 125640
23900 125640 147535 85300 44957 52820 36147 6036 29071 21348 41715 48058 63112 48340
23888D8340m115J1444J2641J2575R305p585O10N4690j099m1463j5650k0841J9174
23875G8026J3612j9755k5840p988n6823j6328N0694k2031j2437J5299L6876n0288
23863a6983p541K6440p885J595J6007j2857K1903L4745k7059N219O063m0568j4771
23850a5692L9014M3218J4442j7791j6147J6334l575j1522k7908Q722K6827J636
23838E7558n1616j1498K6764L9125M9883M0525j4557j7221q638k8790l3347m6310
23826A878o864K8635L9872l5246j4168P656M7129j6743P342J8247m0777K1394
23814E8355J3138J9566l12k137k7113o484N274J0984J5234K7232J8053l6551j8638
23801G6601n157r710L9414l775m6394J7190Q254k6913N215p390r78J9871M2727
$$ plain form
23888 48340 44225 55669 68310 80885 90190 82605 83215 137905 136806 95343 79693 58852 78026
23875 78026 91638 71883 46043 38055 -18768 -35096 15598 -6433 -18870 -3571 33305 -16983
23863 -16983 -24524 1916 -5969 -4374 11633 -1224 20679 55424 28365 33584 39647 -921 -15692
23850 -15692 23322 66540 80982 63191 47044 63378 59803 48281 20373 29095 55922 57558
23838 57558 5942 -5556 21208 60333 110216 150741 136184 118963 110325 81535 48188 1878
23826 1878 -4986 23649 63521 28275 14107 21763 68892 52149 59491 77738 36961 58355
23814 58355 71493 91059 90747 88610 61497 55013 60287 71271 86505 113737 131790 95239 76601
23801 76601 71444 61734 101148 97373 50979 68169 76423 49510 54725 47335 46357 66228 108955
23788A08955M0532l1195k1332j3905l3839j7521K3790n609J1720Q739K2118k7693
23776F4760M1804O036L360p563l738K2191J354q213j7717j1061M417j143k2380
23763G2107k0491J5185l0388j7778J238l7618K6832L6712j580J989K754r46o2244
23750a4228J7335L9525N7505J7250k825l7031K2260l0545n722k3999m376P245
23738D2394J5687q146j3111N6897Q180j4145o149R276j4631l0823n599q575k5448
23725E807j9999J9071J8157J071L6045J3560L1147J2251M87m733p947j8934j4825
23712G1158n0593J5242j7846K9527N037l0651M1994J4276k2599L710M2706k0456
23700H1505j8541J4612L2836M0741l2192p473n9398k4488p696l6334j5096O9409
$$ plain form
23788 108955 149487 118292 96960 83055 49216 31695 55485 49876 61596 70335 92453 64760
23776 64760 106564 112600 115960 108397 104659 126850 128204 119991 102274 91213 95630 94487 72107
23763 72107 51616 66801 36413 18635 19873 -17745 9087 45799 44219 46208 48962 48016 -14228
23750 -14228 3107 42632 100137 117387 114562 77531 99791 69246 63524 39525 35149 42394
23738 42394 58081 49935 36824 93721 101901 87756 81607 90883 76252 45429 39830 31255 5807
23725 5807 -14192 4879 23036 24107 60152 73712 104859 117110 117597 112864 104917 85983 71158
23712 71158 20565 35807 17961 47488 52525 21874 63868 78144 55545 59255 101961 81505
23700 81505 62964 77576 110412 151153 118961 111488 52090 27602 19906 -16428 -31524 37885
23688C7885L1809J5756m4842n101K0305J5577J9552L434l2056n582K8903K1899
23676A07539o5580l5697K5058N0415J430L1516n6006m0422j6658K0571K6993J0471
23664E9630k6311N286M4080q415J1077n114k4054M4326k560l9042N2730M1418
23652A53051l3584l5208N395L419m0688j1019N6414L5341m0553K386k2514m2578
23640B9862J5755L4364o037l1901K6671O2434J1048j2671l0980o2089Q974K4029
23628F9459K7213q458l4530J4542L7364l044K921l0016p176K3157l557k3281k6156
23615C8438o4486Q689M2919l310j2964L2784L3599j5887j0315j5347O084J9528
23603E9732m8947p707O2175M3936M226j1221j7105o329R161K1952L3350k235l7328
$$ plain form
23688 37885 69694 85450 40608 35507 55812 71389 90941 94375 62319 56737 85640 107539
23676 107539 41959 6262 31320 81735 83165 114681 58675 18253 1595 22166 49159 59630
23664 59630 33319 38605 82685 74270 85347 80233 56179 100505 97945 58903 111633 153051
23652 153051 119467 84259 89654 93073 52385 41366 97780 133121 92568 94954 72440 29862
23640 29862 45617 79981 73944 42043 68714 131148 142196 129525 98545 36456 45430 69459
23628 69459 96672 88214 53684 68226 105590 102546 105467 75451 68275 91432 87875 64594 38438
23615 38438 -26048 -17359 25560 22250 9286 42070 75669 59782 49467 34120 40204 59732
23603 59732 10785 3078 65253 109189 113415 102194 85089 78760 87921 109873 143223 140988 103660
23590A03660J2287J4812l9359p8899P219J4963L4074n271n6497P692N1416K934
23578F9031m3162m5179Q743K6407j1266j8537L4350M7912q507r751n523Q756K826
23565E6100P74J4417J1937Q601m2685p0886l3518P8554K4522m6681p11J2843K0626
23552C3893r620p730R989k9043L4531L1120O151O311N4594M8919k9881q386L23
23539A41171m4357k1477L3153o651j4847j1686j7013k5706J2837P4995j3327M179
23527A11271J5019r364J2975j9787l7636r875J0096J5320J5332J7708L0483L0686
23515A82228l9320l7845l5409J2983L4630l163K3517j8198J4711l2643J1236n0015
23503F2712L1767J781j0808L604l1472p654j0532j3138n46O0911M5571o669j2388
$$ plain form
23590 103660 115947 130759 91400 12501 19720 34683 68757 63486 6989 14681 66097 69031
23578 69031 25869 -19310 -10567 15840 4574 -13963 20387 68299 59792 50041 44518 53274 56100
23565 56100 56874 71291 83228 91829 49144 -21742 -55260 23294 47816 1135 424 13267 33893
23552 33893 24273 16543 26532 -2511 32020 63140 69291 75602 130196 179115 149234 140848 141171
23539 141171 96814 75337 108490 101839 86992 75306 58293 32587 45424 120419 107092 111271
23527 111271 126290 116926 129901 110114 72478 62603 72699 88019 103351 121059 151542 182228
23515 182228 142908 105063 69654 82637 117267 114104 137621 119423 134134 101491 112727 62712
23503 62712 94479 96260 85452 89056 57584 49930 39398 26260 25714 86625 132196 125527 113139
23490A13139l3540j0554J0583L3096K9043q505l5317m0034k5281L681N0184P3734
23478A60229o074j8292L4186o1056n8458L6639k1320K838J2477J2203N3615O7608
23466B14595j5713n0880m1231l7915K2342J7587M9022m8498r986K0851J8215L5334
23454A73723K4764o850o6731k1445K8928R569m0916J8754r5j7806M5866o851o4712
23441G6198J745J7022r827l088l4947l7284Q491L2583L6807N1562J4997n5904
23429I8355l0054L2163L2594k4575j5360K8531J8180K872n7240k0033k379K6377
23417H9431M207k1988n5090K6518J1984p754M5232K2818j2360J2530N854l2834
23405H8548J3946J2290J7729Q837k8703m0707L0128M9392K1044M5366J9437r2135
$$ plain form
23490 113139 79599 69045 79628 112724 141767 133262 97945 57911 32630 36311 86495 160229
23478 160229 154155 135863 170049 108993 50535 87174 65854 68692 81169 93372 146987 214595
23466 214595 198882 148002 106771 68856 91198 108785 157807 109309 99323 120174 138389 173723
23454 173723 198487 191637 124906 103461 132389 141958 101042 119796 119701 101895 147761 140910 76198
23441 76198 77943 94965 85138 82050 47103 9819 18310 50893 87700 139262 154259 98355
23429 98355 68301 100464 133058 108483 93123 121654 139834 142706 85466 65433 63054 89431
23417 89431 93638 71650 16560 43078 55062 47308 92540 115358 102998 115528 121382 88548
23405 88548 102494 114784 132513 141350 112647 71940 102068 151460 172504 217870 237307 145172
23393A45172o8616L1712Q132k572L4402J0434P138n378J0669l7444l0915N0841
23381A53575n255L1446K0145m5310l7496j072n227o382j354R004J4358J0066J3006
23368A49504K259j8455j5840K0920J5186K5741l0692k0924l3178L6206m48N011
23356A35290m721L4835j5229l5792m9697K4076K5030j4070K3273K1807N214n7174
23344I2842l8636M7985M289k9578L9266K2195k1814j2729K1595K288k7100P205
23332A07808J2221K3863P540N0139K4117p0086j5810K1375K1157J3836P340k0593
23320A82907k1625k1512J6262O297k9105j013r077o630K3339Q011n5814k5821
23308F6219M0695K5394N691j3962J9360K70j6723l5914j7402j8800L2042J3343
$$ plain form
23393 145172 76556 108268 116400 113828 148230 158664 165802 160424 171093 133649 102734 153575
23381 153575 148320 179766 199911 154601 117105 116033 110806 104424 103070 112074 126432 136498 149504
23368 149504 151763 133308 117468 138388 153574 179315 148623 127699 94521 130727 130279 135290
23356 135290 130569 165404 150175 114383 64686 88762 113792 99722 122995 144802 150016 92842
23344 92842 54206 102191 106480 76902 116168 138363 116549 103820 125415 127703 100603 107808
23332 107808 120029 143892 151432 201571 225688 155602 139792 161167 182324 196160 203500 182907
23320 182907 161282 139770 156032 162329 133224 132211 123134 116504 139843 147854 92040 66219
23308 66219 106914 132308 137999 124037 143397 143667 126944 91030 73628 54828 86870 100213
23296A00213J8641j5026K6806O6770P1416M720k8763l7337m3666j8804L3933L725
23284A82628l0378K641K9300j1488n0622N715j8567j4869N7441J120m594N249
23272A53576L265J9225K3814J9770l8139l9946M303L266j4251j016j3202J616
23260A22281P551Q344j4462k9771n479N3802J5607k4795l157J9097J1273j4532
23248A45759l3442L4811O3403K7555p41l4879k6014n5236J3750O8694J9689l7032
23236A86317J3751r28r655k9538p9244l337J2379M328K7085M203j8297j6359r237
23223H1468j7544L2757q038J8826p711l2130M902N6619L9436j2256r256j0351
23211A36722m4369k358l426m861L6357M3593J4671j2498m4350L828J3849j0477
$$ plain form
23296 100213 118854 103828 130634 197404 268820 273540 244777 207440 163774 144970 178903 182628
23284 182628 152250 154891 184191 172703 122081 127796 109229 94360 151801 152921 148327 153576
23272 153576 156841 176066 199880 219650 181511 141565 145868 149134 134883 133867 120665 122281
23260 122281 129832 138176 123714 93943 88464 142266 157873 133078 129921 149018 160291 145759
23248 145759 112317 147128 210531 238086 237345 202466 176452 121216 134966 203660 223349 186317
23236 186317 200068 199140 189485 159947 80703 77366 89745 94073 121158 125361 107064 90705 81468
23223 81468 63924 96681 88643 107469 99758 67628 72530 129149 168585 156329 147073 136722
23211 136722 92353 89995 86569 81708 118065 161658 176329 163831 119481 123309 137158 126681
23199A26681m712K1133L4641J0378k680j8756l6894k1580J3208m635L6238M3730
23187A96752J996K609j2604l5218j9048R863m44j3019l8143J7397K8601k8304
23175A10438k8284J107P346j9555L0321J2402N116J4834L5010J0325q456j6393
23163A54211j7030N174L2606k6671K4552J383Q662J7083Q227l1119j2446k6601
23151A38031J4758J2593O148K347J095m1631J4018Q413r058j2824J1407j4065
23139A31232j2600l7290M746L974M6694O8474l967k223j8756l2195J398J3819
23127A63306j3662R207L0433K5955o668N847k5265L336j7167l7489J0404o175
23115A42062J4843O5708j7780m614j339J2990l4256M390l343l365j8160m1534
$$ plain form
23199 126681 121969 143102 177743 188121 185441 166685 129791 108211 121419 116784 153022 196752
23187 196752 198748 201357 188753 153535 134487 144350 143906 130887 92744 110141 138742 110438
23175 110438 82154 83261 90607 71052 101373 113775 118891 133725 168735 179060 170604 154211
23163 154211 137181 142355 174961 148290 172842 174225 182887 199970 208197 177078 164632 138031
23151 138031 152789 165382 171530 173877 174972 133341 147359 155772 146714 133890 145297 131232
23139 131232 118632 81342 86088 90062 136756 205230 201263 199040 180284 148089 149487 163306
23127 163306 149644 158851 189284 215239 208571 214418 189153 192489 175322 137833 148237 142062
23115 142062 156905 222613 204833 200219 198880 211870 177614 182004 178661 175296 157136 115602
23103A15602K4167j6638k6147M3536L1182l3046J2375J5551r360K1399N4494J6449
23091B49564l364n2135o4871M378L6449O879L0466n995n6611J0913R821j0272
23079A55222K9305l0095j4773O0646N0944J0898o4601k8480j4302J9699M5072
23068B19535l3105k4012j3108J5959l5690k3783m7016L4511P544r276J8651K7365
23056A37575M4374L3353L9504l3464k4115j2026P981J5751m8818M56J0605k7322
23044A43854p0915J131M3086P822r471p057j0765K4946J17l0000l700R1551N8132
23031B38731k3963J5227K2078k6102j8161K758m662j951J3330K4568l8884Q412
23019B11381L5567K767J1910K3921l4398j8425K4561K8954j6939n3324m209k49
$$ plain form
23103 115602 139769 123131 96984 140520 171702 138656 151031 166582 157222 178621 233115 249564
23091 249564 246200 194065 129194 133572 170021 176900 207366 201371 144760 155673 165494 155222
23079 155222 184527 154432 139659 200305 251249 262147 197546 169066 154764 174463 219535
23068 219535 186430 162418 149310 165269 129579 105796 58780 93291 100835 91559 110210 137575
23056 137575 181949 215302 254806 221342 197227 185201 193182 208933 160115 160571 171176 143854
23044 143854 72939 74070 117156 124978 115507 108450 97685 122631 122748 92748 89048 180599 238731
23031 238731 214768 229995 252073 225971 207810 210568 205906 203955 217285 241853 202969 211381
23019 211381 246948 249715 261625 285546 251148 232723 257284 286238 269299 215975 211766 211517
23007B11517J6573J8812J2690L2794j7301l9315J0470J866m0772m208k7809j5963
22995A59354K9403J2225M5931P6167o1064l6740L9130k45N154q390O753j3826
22983B53852k1637O484j0730k1794j2092L2378M037K3557m5251K6987k6670J3947
22971B23068N7707L0280j9942k4174k6544P269J125j059N0023M0479J4319K8879
22959C81430K888O18n9441m3321K352J6354J7192o1108m2345N765L0138k6291
22947B24231j8588J291L144M4071J4109L8924j865j9364j1633k9761L690J3958
22935B62207L551R334l5993K4934J4297L7341K1076l3460L389J2527M3223L7484
22923C99910o310R923r213M5613M2264K4573j8730k4J2916K3316N192P3558M8353
$$ plain form
23007 211517 228090 246902 259592 292386 275085 235770 246240 248106 207334 203126 175317 159354
22995 159354 188757 200982 246913 323080 262016 225276 264406 264161 269315 260925 267678 253852
22983 253852 232215 238699 227969 206175 194083 226461 230498 254055 208804 235791 209121 223068
22971 223068 280775 311055 291113 266939 240395 247664 248789 247730 297753 338232 352551 381430
22959 381430 384318 384936 325495 282174 284526 300880 318072 256964 214619 220384 250522 224231
22947 224231 205643 206934 210078 254149 268258 307182 305317 285953 274320 244559 248249 262207
22935 262207 265758 275092 239099 264033 278330 315671 336747 303287 306676 319203 362426 399910
22923 399910 393600 403523 394310 439923 482187 506760 488030 488006 500922 524238 529430 602988 651341
22910F51341O1989M8166O8559Q8948J40852J94105J96330K00789K92759L14820
22900B258658K61236J50635Q7843O7368m4404j80551k32895k32610k54913l73910
22890A506457l16060j94327j53168j33646p488l9541l3725k3952k2548o0858n8254
22879D62890j505r855n08j8718J5136N5960o161j4826K3110j4092K8737M6828
22867E66996k0977n7868m6986N492n2746m9914J1965N6385j8261k6105O5996o464
22855D27513O828n159J810o098l873J757K046k9942p688k0839l8726l777k4455
22842B99397J6531L2045j5047l2044L2710M902j7389K4495r169J8030j8607M286
22830C40140N441k2207K191M3906L5793n647n39j5817k7627J9651J5853K4327
$$ plain form
22910 651341 713330 761496 830055 919003 1059855 1253960 1450290 1651079 1943838 2258658
22900 2258658 2519894 2670529 2758372 2825740 2781336 2600785 2367890 2135280 1880367 1506457
22890 1506457 1190397 996070 842902 709256 701768 662227 628502 604550 582002 521144 462890
22879 462890 461385 451530 451022 432304 447440 503400 497239 482413 505523 491431 520168 566996
22867 566996 546019 488151 441165 446657 393911 343997 355962 412347 394086 367981 433977 427513
22855 427513 434341 429182 430992 424894 421021 422778 424824 394882 387194 366355 327629 323852 299397
22842 299397 315928 347973 332926 300882 333592 338494 321105 345600 336431 354461 335854 340140
22830 340140 345581 323374 325565 369471 405264 399617 399078 383261 355634 375285 391138 415465
22818D15465J2133K0319P031l3175R843M885o5597m4617k0483K7227R802l688
22806C39145j341k6023K3847R221n701q711k0420l5492J0011q536J5413J0385
22794C01798K526J2481j4660R228M7059N237n3830M8779Q316k4640o2558l1724
22782B48012L8956O4872l358m549r891k2235j3866R268O0933J9932j8737m5649
22770C23688K7858J3871l2035r919J9948L6664N4788N114N4063O754n7104m5190
22758C98500k6727n8632J1438K6592J814o149k975L135M5084J0001j4779N1417
22746D38719N601p5065L1772K6899j7578L9030p254j468J8183l836m4847J9411
22734D29567J6092j8890J9222O4234O485k1023j496m8527l2420J4968J3615K7731
$$ plain form
22818 415465 427598 447917 454948 421773 431616 436501 370904 326287 305804 333031 342833 339145
22806 339145 337804 311781 335628 344849 339148 330437 310017 274525 284536 276000 291413 301798
22794 301798 304324 316805 302145 311373 358432 363669 309839 358618 366934 342294 279736 248012
22782 248012 286968 351840 348482 343933 334042 311807 297941 307209 368142 388074 369337 323688
22770 323688 351546 365417 333382 323463 343411 380075 434863 439977 494040 500794 443690 398500
22758 398500 371773 313141 324579 351171 352985 346836 343861 346996 392080 402081 387302 438719
22746 438719 444320 369255 401027 427926 410348 449378 442124 440656 458839 455003 410156 429567
22734 429567 445659 426769 445991 510225 516710 495687 494191 445664 413244 428212 441827 469558
22722D69558J9356J5356K9958k0554k8201k6247J8207M140J6817j8817k2380k1645
22710D35548N122P4507N0749J9758p8k711K0003J3740q874r524o6142l6417L0553
22697E26234J5876l2064k089j1439J6921K0464m104j7553j263J6233M538J6406
22685E48160j3236j2098m793m268J0420k0693k1562M137N2543n330n536l0949
22673D96795k1008K7826M8854J8324m3034l0007K3885j2535J0758M8206j3177
22662E54887J0483j655k5777L3783P8004M8143j6844K8484L1414O678q194n8244
22650F81162n9163p195K2590K1852K7534l1642k3802o8187k5879N9999R606L825
22638F10700p278J1071P00L382K126J5970j5586L8742J5575N995J3023O573K3256
$$ plain form
22722 469558 488914 504270 534228 513674 485473 459226 477433 481573 498390 479573 457193 435548
22710 435548 440670 515177 565926 585684 585606 582895 602898 616638 607764 598240 532098 495681 526234
22697 526234 542110 510046 507957 496518 513439 533903 529799 512246 510983 527216 531754 548160
22685 548160 534924 522826 518033 513765 524185 503492 481930 486067 538610 533280 527744 496795
22673 496795 475787 503613 552467 570791 527757 497750 521635 509100 519858 568064 554887
22662 554887 565370 563715 537938 571721 649725 697868 681024 709508 740922 747600 739406 681162
22650 681162 621999 614804 637394 659246 686780 655138 631336 563149 537270 597269 606875 610700
22638 610700 603422 614493 615193 618575 620701 636671 621085 659827 675402 681397 694420 700993 724249
22625G24249l0995J6603K360o2784l7842r242J0764J1938K6167O238K6240r213
22613F74483L7031Q1846L5168j3765M0888J10633M0505L9504M4989j921k597J7870
22601A104634L0399k8408k7227n1117l9122k6477n1879K6631j1095n5210o0942
22590H10187n463J0541L907j7902k3634l2209n1463O60O5844K8944M8346J5576
22578H53334j9289o0931m8902P705L9204M3971j8724m21q640L1631q093n2903
22566G57942K0853k217p309J8579N614K22k0540k6747M5595O179M8341K4930o858
22553H64584M9481P088k9259j5948K8674J2139k7913J2526O5810M3190J3669J9705
22541A043746o202J4133j2150o1617n7105Q570l9748n9657J3229n2975m481N331
$$ plain form
22625 724249 693254 709857 712217 649433 611591 602349 613113 625051 651218 657456 683696 674483
22613 674483 711514 793360 828528 814763 855651 966284 1006789 1046293 1091282 1089361 1086764 1104634
22601 1104634 1135033 1106625 1079398 1028281 989159 962682 910803 937434 926339 871129 810187
22590 810187 804724 815265 819172 801270 777636 745427 693964 694624 760468 789412 837758 853334
22578 853334 834045 773114 724212 731917 771121 815092 796368 795947 787307 818938 810845 757942
22566 757942 778795 776578 769269 787848 793462 793684 773144 746397 791992 798171 846512 871442 864584
22553 864584 914065 921153 891894 875946 904620 916759 888846 901372 967182 1010372 1024041 1043746
22541 1043746 1037544 1051677 1039527 977910 920805 929375 889627 829970 843199 790224 785743 791074
22529G91074N8664Q4567L2441k6910K7521K5278L6133P4704M4567J4712r333k9641
22517A123777J3903M0979J1966M4155k3635j6999K3143n963n2656l1053L3025
22506A160642J6703M4584P236K740O758j1932K9520j0461J2275Q298J3425K1499
22494A301287O5939J7486k6364J1510J5545j8391m651K8868J8102N3395O0101
22483A522827K5539o853J5142k226K6147M0925L3517N3710Q1807L2261J0059L5757
22471A868612L4553L008K0817l054j2059n1250j2080K8819p97J2929K7059J0939
22459A927496K1946K9131J6521L8749L669N6416Q7238O7550M4510k5153j726P7362
22447B343709P3841P3594P6912N0431J16672R3447J24886J46387J30980J33203
$$ plain form
22529 791074 849738 934305 966746 939836 967357 992635 1028768 1103472 1148039 1162751 1153418 1123777
22517 1123777 1137680 1178659 1190625 1234780 1211145 1194146 1217289 1211326 1158670 1127617 1160642
22506 1160642 1177345 1221929 1229165 1231905 1238663 1226731 1256251 1245790 1258065 1266363 1279788 1301287
22494 1301287 1367226 1384712 1358348 1369858 1385403 1367012 1362361 1391229 1409331 1462726 1522827
22483 1522827 1548366 1541513 1556655 1554429 1580576 1621501 1655018 1708728 1790535 1822796 1832855 1868612
22471 1868612 1903165 1906173 1926990 1923936 1911877 1860627 1848547 1877366 1876569 1889498 1916557 1927496
22459 1927496 1949442 1978573 1995094 2033843 2037512 2093928 2181166 2248716 2293226 2268073 2266347 2343709
22447 2343709 2417550 2491144 2568056 2618487 2735159 2828606 2953492 3099879 3230859 3364062
22437C364062J90579L06855K98464L22907L14803L35397K87130J52287J14640
22428E687124L5876j8050j71547k36653j83031k08686k71294j70665p5820j7447
22418D369807m4138l2181K5913J01152P7407Q4397J04665M4918J02943J27660
22408D962543J03430O4585J26884J39106J44475J08339M5661P8309J22358J40272
22398F035962R6834J04186J64065J69191J88939J64713J82999K20987J98878J93226
22388G719980K42502K72360L28707L53455M14778M29322N22499O25143O79810
22379A1588556Q42209J037916J266620J467595J582710J714104J935061K084707
22371B3519478K219829K416449K520612K659780K813260L056620L442015L950562
$$ plain form
22437 3364062 3554641 3861496 4159960 4482867 4797670 5133067 5420197 5572484 5687124
22428 5687124 5723000 5704950 5533403 5296750 5113719 4905033 4633739 4463074 4387254 4369807
22418 4369807 4325669 4293488 4319401 4420553 4497960 4582357 4687022 4731940 4834883 4962543
22408 4962543 5065973 5130558 5257442 5396548 5541023 5649362 5695023 5773332 5895690 6035962
22398 6035962 6132796 6236982 6401047 6570238 6759177 6923890 7106889 7327876 7526754 7719980
22388 7719980 7962482 8234842 8563549 8917004 9331782 9761104 10283603 10908746 11588556
22379 11588556 12430765 13468681 14735301 16202896 17785606 19499710 21434771 23519478
22371 23519478 25739307 28155756 30676368 33336148 36149408 39206028 42648043 46598605
22363D6598605M561045N329861O192016P430071R174305J1543706J4583650J8524253
22355A23937512K3942590L1359027M0464648M9575949N5833315N6602947M5627795
22348D27343783K3320955J0733739R33392j7448920l1642904m5334004m9932354
22341C17973687n4069105o1948391n2791359l4885296k1729900j4071360r727267
22334F8751009p059710n358155m254913l511489k910117k471861k095922j765460
22326C9323382j366071j107960q52520n34239l12759k93195l28895m27333n21241
22317C3579169o98867q94584j167501j285729j421680j657310j748076j634213
22309B3071209j537762j408070j293803j219889j130482j029539j025343r14421
$$ plain form
22363 46598605 51159650 56489511 62681527 70111598 79285903 90829609 105413259 123937512
22355 123937512 147880102 179239129 219703777 269279726 325113041 381715988 427343783
22348 427343783 450664738 461398477 462331869 444882949 413240045 367906041 317973687
22341 317973687 263904582 201956191 149164832 114279536 92549636 78478276 68751009
22334 68751009 61691299 56333144 52078231 48566742 45656625 43184764 41088842 39323382
22326 39323382 37957311 36849351 35996831 35462592 35149833 34856638 34527743 34100410 33579169
22317 33579169 32880302 31985718 30818217 29532488 28110808 26453498 24705422 23071209
22309 23071209 21533447 20125377 18831574 17611685 16481203 15451664 14426321 13511900
22301A3511900q55465p82464p17092o09787n90351n45379n59644n13848n26149
22292G811721m98988n03556m16927m06872l99746l51849k57855k43066k87235
22283D445627k40174k00248j85942j89259k06545j57483j38416j24180p7486r2496
22273B833398o8114k0155n2914j4229O3721J78135J49440K24373K10945O5915
22263C570515J3424K0854j63981k63689k92886l29514l68796l59593l42864k61900
22253A221570j78208j34394j61914o6349n1095k6003j7104m8702l7957k1242m3808
22242D34794J623n6747n4467l2735p2848l7417j1440k6894l3868m5454m808K5084
22230H4823N6534K9151l114K7492n5292o123K6146K2776L8604J7358N3567J6329
$$ plain form
22301 13511900 12656435 11873971 11156879 10547092 9956741 9411362 8851718 8337870 7811721
22292 7811721 7312733 6809177 6392250 5985378 5585632 5233783 4975928 4732862 4445627
22283 4445627 4205453 4005205 3819263 3630004 3423459 3265976 3127560 3003380 2925894 2833398
22273 2833398 2765284 2745129 2692215 2677986 2741707 2919842 3069282 3293655 3504600 3570515
22263 3570515 3583939 3604793 3440812 3177123 2884237 2554723 2185927 1826334 1483470 1221570
22253 1221570 1043362 908968 747054 680705 629610 603607 586503 537801 499844 478602 434794
22242 434794 436417 379670 325203 292468 219620 182203 170763 143869 110001 64547 59739 84823
22230 84823 141357 170508 167394 194886 139594 133471 159617 182393 220997 238355 291922 308251
22218C08251n8615k5199n917K04k7786p8450n3625l6976n1806j7417P808k2711
22206f2239j8179k0000p4001n2062j7850N4957K9593l7151Q951K5811K5276l6391
22194a73285n6413j3171K2215J6952L3811M1468N2360J9829k0465m7735J5401
22183a09033P8538J1910k7312K8536L8898k1152o3597O7314J5182L308O163J0298
22171C9053L9443j3215N3099K2582K3036N2323L2924l658m0871j6637j2722K9943
22159B05300r270n682n3377l7341j07098l5359O810k563j0993j0834j2018J1267
22147f1158O6652M1884k5582k7834K0731L679l044J5847J8545q22L5365L0946
22135A15209p720j5275K3221j1957m1337l5317q377L7767J089k9019l6948l8949
$$ plain form
22218 308251 249636 224437 218520 218724 190938 112488 58863 21887 -29919 -47336 -39528 -62239
22206 -62239 -80418 -100418 -174419 -226481 -244331 -189374 -159781 -196932 -187981 -162170 -136894 -173285
22194 -173285 -229698 -242869 -220654 -203702 -169891 -128423 -76063 -56234 -76699 -124434 -109033
22183 -109033 -30495 -18585 -45897 -17361 21537 385 -63212 4102 19284 22592 28755 39053
22171 39053 78496 65281 118380 140962 163998 216321 249245 245587 204716 188079 175357 205300
22159 205300 196030 190348 136971 99630 -7468 -42827 -36017 -38580 -49573 -60407 -72425 -61158
22147 -61158 5494 47378 21796 -6038 14693 18372 15328 31175 49720 48898 84263 115209
22135 115209 107489 92214 115435 103478 62141 26824 18447 56214 57303 28284 -8664 -47613
22123d7613n6261m0308n165K997j7203J1686M4144k137Q173k3013N0465Q421l0342
22110i6156k6468m9309l8063p365L4407N2751K7151M6961j3113p488K8997K6926
22098b0769Q593k9322k9728r258m0086k3600j1357L4290J8448k8703j5750l7421
22086a84663j8193j6533n632N0449J990k5776l8463L925M523J6684P0668J7136
22074a23885L276O750o601J7277J1861N530j6733k5208J6491Q147l7484m2902
22062a83481k0715q362K5950j4572k1938l5701j0294L8068L6199K1321o619L1573
22050a48571J03738O9756L5423Q2546N7476M6269N9021L82N8541L8701m0693k0102
22038C42487r443l2769n0869l1409m9624K758j2705K1981J1327k1747j637j2425
$$ plain form
22123 -47613 -103874 -144182 -149347 -146350 -163553 -151867 -107723 -109860 -101687 -124700 -74235 -65814 -96156
22110 -96156 -122624 -171933 -209996 -217361 -182954 -130203 -103052 -56091 -69204 -76692 -47695 -20769
22098 -20769 -12176 -41498 -71226 -80484 -120570 -144170 -155527 -121237 -102789 -131492 -147242 -184663
22086 -184663 -202856 -219389 -225021 -174572 -172582 -198358 -236821 -232896 -228373 -211689 -141021 -123885
22074 -123885 -120609 -113859 -120460 -103183 -91322 -85792 -102525 -127733 -111242 -103095 -140579 -183481
22062 -183481 -204196 -212558 -186608 -201180 -223118 -258819 -269113 -231045 -194846 -173525 -180144 -148571
22050 -148571 -44833 24923 60346 142892 200368 246637 305658 306040 364581 403282 362589 342487
22038 342487 333044 300275 249406 217997 168373 171131 158426 180407 191734 169987 168350 155925
22026A55925l3371k6798L8696k3065K5194l904J5414L6404K0665K0443K7566Q9842
22014C43011O2L6149P5461J27190J61902J34815J85583J89555J62634N6646J84
22003A473192r8050j63438j90572k41394j86329j07646m8224n0861m4251K7333
21993C69760j670o6575n2902M1880N3823K8849k4504k4149l8972j440j26L5391
21981C19365k9633p3846m5965n2239n830L169K7157N128m6935o146k7277n2155
21969A4793q5709N308K6516J1669J9455j2494M9799L4650l9136l222L5664m9793
21957G500k6954j0109k4262J8486M3978J3083l1476k3718M3606m654K9663K2003
21945E7146K7721j1512J8671q535l5037N815r721j5113r828o368L146m8185m6352
$$ plain form
22026 155925 122554 95756 134452 111387 136581 132677 148091 184495 205160 225603 253169 343011
22014 343011 343073 379222 454683 581873 743775 878590 1064173 1253728 1416362 1473008 1473192
22003 1473192 1375142 1211704 1021132 779738 593409 485763 437539 386678 342427 369760
21993 369760 368090 301515 248613 290493 344316 373165 348661 324512 285540 284100 283974 319365
21981 319365 289732 215886 169921 117682 111852 115021 142178 147306 100371 94225 66948 14793
21969 14793 -70916 -65608 -39092 -27423 -7968 -20462 29337 63987 24851 21629 57293 7500
21957 7500 -19454 -29563 -53825 -35339 8639 21722 -9754 -33472 10134 5480 35143 57146
21945 57146 84867 73355 92026 83491 48454 54269 44548 29435 19607 13239 16385 -31800 -78152
21932g8152j3528L4747p550j5692K7922o1069m6707N602J4581J4880M4532M0181
21920d0253k8687l9426M982O4273R5339J3666o201J8340J5106l1823j8706j2687
21908C3923m4996k2012j3048K3646K8513M2898M8774p961j5358O4581L9581J0114
21896A88655k871j9931j0478L6652L9496p975l6116o0990l9512k0712K3573J9253
21884A09044l0682n4832n1276j9249k44j2593K4051o220Q113m223k5762j7603
21872h1476K3830N283K8303j4264k1629M9971J2308j1636j8357n102k8739J7786
21860d3722J2817j5103l0600L9118M458k8636l0873k2992K8198q844J2257J4613
21848f9309J90L4068M1377Q203J5921J0458m61M2121O2441M8930l707m1567L0439
$$ plain form
21932 -78152 -91680 -56933 -64483 -80175 -52253 -113322 -160029 -154427 -139846 -124966 -80434 -40253
21920 -40253 -68940 -108366 -103384 -39111 56228 69894 63693 82033 97139 65316 46610 33923
21908 33923 -11073 -33085 -46133 -22487 6026 48924 97698 89737 74379 138960 178541 188655
21896 188655 185784 165853 155375 192027 231523 223548 187432 126442 86930 66218 89791 109044
21884 109044 78362 23530 -27746 -46995 -47239 -59832 -35781 -42001 -33888 -38111 -63873 -81476
21872 -81476 -57646 -52363 -24060 -38324 -59953 -9982 2326 -9310 -27667 -32769 -61508 -43722
21860 -43722 -30905 -46008 -76608 -37490 -33032 -61668 -92541 -115533 -87335 -96179 -83922 -69309
21848 -69309 -69119 -35051 6326 14529 30450 40908 40447 82568 145009 193939 190232 148665 179104
21835A79104J2939J7938J9199L205j9971m4651o8276o5575P333o4301j9513K2162
21823b0407K0057M441Q694K0884K8741j9435M1421Q9141N5994r949J0037L555
21811B33174k564l3508j087j4202m1343l5913n586M9977R3990J18M2900L0409
21799C16365j094O3168J26622J37063J25403J42582J81740K72468K88317K78783
21789A931417K43510J38827R8398R863j02127j70299j73933k31335l09546l39211
21779A095564k69488j82828j24044r9829n9101j16273q8749K9951L7116J0749
21769B33068l2069J2012l2531k8391j7088m1098J9101K2107O4261K3523o827L2272
21757B48340j8118p2512o7562j4461m4083J4409k5695l0773N2207L2031n296j2152
$$ plain form
21835 179104 192043 209981 229180 232385 212414 167763 99487 33912 41245 -23056 -42569 -20407
21823 -20407 -350 4091 12785 33669 62410 42975 84396 173537 229531 219582 229619 233174
21811 233174 230610 197102 196015 181813 140470 104557 98971 148948 242938 243056 285956 316365
21799 316365 315271 378439 505061 642124 767527 910109 1091849 1364317 1652634 1931417
21789 1931417 2174927 2313754 2412152 2422015 2319888 2149589 1975656 1744321 1434775 1095564
21779 1095564 826076 643248 519204 419375 360274 244001 155252 185203 222319 233068
21769 233068 200999 213011 180480 152089 135001 93903 113004 135111 199372 222895 216068 248340
21757 248340 230222 157710 90148 75687 31604 46013 20318 -10455 41752 73783 68487 56335
21745E6335l6951m461l4761M5432k2267p4072j2131K4222J027k9717J259M8886
21733c7199K1811l0344k5548j917K9816l91j3675j3431J813K591n815J6511p122
21720f2900k1453p86j6250J9170L6766j8030l380K1395K8784O732j6410q825J4061
21707b1126j0806J1298k7991l510J0123K2142K3729L6753l962k071M744L7158
21695G6481l611l3299M5349K3737k657K1024Q9214N4039P3144P2842R4035R2979
21683F03277J15590J59104J97573J74540J78730J44663p8576k61177l46962k80005
21673F06757j78833j49969o1150l932k5643n7078l1431p188N459j1679r032m322
21661G1959Q8k0882l6693l2760M3477M4676j3457q448K2726o260k8964l1209j3365
$$ plain form
21745 56335 19384 14923 -19838 25594 3327 -70745 -82876 -58654 -57627 -87344 -86085 -37199
21733 -37199 -15388 -45732 -71280 -73197 -43381 -43772 -57447 -70878 -69065 -66474 -72289 -55778 -62900
21720 -62900 -84353 -85139 -101389 -82219 -45453 -63483 -66863 -45468 -16684 -9952 -26362 -35187 -21126
21707 -21126 -31932 -20634 -48625 -52135 -42012 -19870 3859 40612 36650 34579 39323 76481
21695 76481 72870 39571 84920 108657 106000 127024 216238 270277 343421 416263 510298 603277
21683 603277 718867 877971 1075544 1250084 1428814 1573477 1494901 1233724 886762 606757
21673 606757 427924 277955 216805 212873 187230 130152 98721 91533 96992 85313 76281 71959
21661 71959 72047 51165 14472 -18288 25189 69865 56408 47960 70686 64426 35462 4253 -9112
21648i112O173P918K821M4031N107l1652K063J3883k1694n0938K3231l9896l8765
21635h6830M5094J0680J6992L8999J491L119R447j7407r774k4234K1950K7637
21623C7164j2026j4662j6226r814J0568n1176l1711Q565M9586N2317m1265n2991
21611g1671M3954Q587k8986K7799j8492j9171L5672J6797q694J4748j1607k1461
21599c2525K576n234j9451j9283P861Q760N228J2527k257K2785O829m2332R287
21586d5229K7786m0509p7565j2895N7686M237M5250N0371Q132k2335l0438K291
21574c3218j0296R859M35o2669j0599k7094k8807k6820L350P223M3139L5641J1531
21561h8325J3596r15R413J988m2217R221P116j2595J0357O950N219J9150M322
$$ plain form
21648 -9112 -2939 4979 7800 51831 56938 25286 27349 41232 19538 -31400 -8169 -48065 -86830
21635 -86830 -41736 -31056 -14064 24935 26426 29545 38992 21585 11811 -12423 9527 37164
21623 37164 25138 10476 -5750 -15564 -4996 -56172 -87883 -79318 -29732 22585 -18680 -71671
21611 -71671 -27717 -19130 -48116 -20317 -38809 -57980 -22308 -5511 -14205 543 -11064 -32525
21599 -32525 -29949 -35183 -54634 -73917 -66056 -57296 -52068 -39541 -41798 -19013 -12184 -54516 -45229
21586 -45229 -17443 -57952 -135517 -148412 -90726 -86489 -41239 9132 17264 -5071 -35509 -33218
21574 -33218 -43514 -33655 -33220 -95889 -106488 -133582 -162389 -189209 -185859 -178636 -135497 -99856 -88325
21561 -88325 -74729 -75644 -66231 -64243 -106460 -97239 -90123 -102718 -92361 -85411 -80192 -61042 -56720
21548e6720j3033o340K6652m607r774K1065l841J9487L0161r517L323J6329j0334
21535B851k1106l9473N0909R4465N8346J3372j687K9575O9509O7379O6659J34938
21523E25737J54675J80659J34618J40062J27842J4560q9626j18981j21159j83392
21513G64995j81547j78385j49538k4396k2363k0713j3792n4448m6049O789K3742
21502A04295J5989n521J4630j9110m8526k6485n5297k0949O577M2617Q859n054
21490A2025L6319J2647l5919m6161j3320J1029j4006J157M4206R660r273K2929
21478C1293J7114k8958j1721j4415j3636l395j9722R553p20J2058m012l1403r390
21465f7354K1577J7732O1276j5829m3644n1029K594K2876J1539O3722N3482N4139
$$ plain form
21548 -56720 -69753 -76093 -49441 -54048 -63822 -42757 -46598 -27111 3050 -6467 -3144 13185 2851
21535 2851 -18255 -57728 -6819 87646 145992 159364 157677 187252 256761 324140 390799 525737
21523 525737 680412 861071 995689 1135751 1263593 1278153 1188527 1069546 948387 764995
21513 764995 583448 405063 255525 231129 208766 188053 174261 119813 73764 80553 104295
21502 104295 120284 114763 129393 110283 61757 35272 -20025 -40974 -34397 8220 17079 12025
21490 12025 48344 60991 25072 -21089 -34409 -23380 -37386 -36229 7977 17637 8364 31293
21478 31293 48407 19449 7728 -6687 -20323 -23718 -43440 -33887 -34607 -22549 -26561 -57964 -67354
21465 -67354 -45777 -28045 33231 17402 -26242 -77271 -74677 -51801 -40262 23460 76942 131081
21453A31081M7442n272j3119J7337N0575P7097O8422K2517m701k5106o6565j20950
21441A78758q7355l9135L2457j6318k1582m3161j5442k2232j7313k6681k4666
21430a02670M460J7693N8337L2944J0447K5422k0992K383n546k6832k3738J1194
21418a6898l619K568O721K706j4403l2863j2343o167K7529L0290L5651J6487j9336
21405A6323j7542m6879k867K5629l6456K2536M7041M2098J4563n9344j621K94
21393C775k1165m7404p850j5225j9440J391j2886r055J4651L5691j4911l9130
21381a31558Q51M1523j0294k5489n863j2349j1662K3605J2903K03L2522l197J3073
21368g5732j02j8700K9070K490k5313m2904M031N2950K1523Q012j3857N436l1343
$$ plain form
21453 131081 178523 173251 160132 177469 228044 305141 373563 396080 391379 366273 299708 178758
21441 178758 91403 52268 84725 68407 46825 3664 -11778 -34010 -51323 -78004 -102670
21430 -102670 -98210 -80517 -22180 10764 21211 46633 25641 28024 22478 -4354 -28092 -16898
21418 -16898 -20517 -17949 -11228 -8522 -22925 -55788 -68131 -74298 -46769 -16479 19172 35659 16323
21405 16323 -1219 -48098 -50965 -25336 -61792 -39256 7785 49883 64446 5102 3481 3775
21393 3775 -17390 -64794 -72644 -87869 -107309 -105918 -118804 -127859 -113208 -77517 -92428 -131558
21381 -131558 -130707 -89184 -99478 -124967 -130830 -143179 -154841 -131236 -118333 -118130 -85608 -88805 -75732
21368 -75732 -75834 -94534 -65464 -62974 -88287 -131191 -127160 -74210 -52687 -44675 -58532 -53096 -84439
21355h4439K11J2637J119j4537l0695j0494J9149L298j4479M1374p760J1980O4304
21342h332K8457o6347l9471J0241J6454k0874n3185l1777J5093J8893L6590j6945
21330a11203k5543L05j9271k9512M2088L1853R799K760n398N860L1593J422O18
21317f4629l8988k9000O392L8600j7910J257k9604K4970J6336n439N4941K8234
21305a4840j4480k5451j8072p007l890j0556J8712K81J4771K6050k5212O727J3344
21292c9623l5064l1847M4068L9223K9575M5446N797k1049P43K978K0803j9111
21280D1939o5064k3797K314K8886l7956O527k9502M094L9039L2962K9292J8229
21268D6963j9970j0941q91O810p979m4033K8232M7386o9171k5291K5237O36j6013
$$ plain form
21355 -84439 -84228 -71591 -70472 -85009 -115704 -126198 -107049 -103751 -118230 -76856 -84616 -72636 -8332
21342 -8332 20125 -46222 -85693 -75452 -58998 -79872 -133057 -164834 -149741 -130848 -94258 -111203
21330 -111203 -136746 -136441 -155712 -185224 -143136 -111283 -101484 -98724 -104122 -98262 -66669 -65247 -64629
21317 -64629 -103617 -132617 -126225 -87625 -105535 -104278 -133882 -108912 -92576 -98015 -43074 -14840
21305 -14840 -29320 -54771 -72843 -79850 -83740 -94296 -75584 -75303 -60532 -34482 -59694 -52967 -39623
21292 -39623 -74687 -106534 -62466 -23243 6332 51778 57575 36526 37269 40247 61050 41939
21280 41939 -23125 -46922 -44608 -15722 -53678 -47151 -76653 -72559 -33520 -558 28734 46963
21268 46963 26993 16052 15161 21971 13992 -30041 -1809 45577 -23594 -48885 -23648 -23012 -39025
21255c9025m226J505O265M2633l6414k2558Q202p239Q367O335j6670L8358L7676
21242B3209O064m8985J6647n991m935j6435J478j6972l2867m0313J2182L8637
21230f8281K3596J875P117K673j0394n1204n2619N4807O959K1058K306j4056J669
21217g4494k9212J7734j4788J5913J9918p237L9836N1406j6091o3118n111o233
21205g1477l4701m519N2003O5414J7151n372N671j8847J6901k6309k5998j6364
21193d6447j157J915l4963j3614r190k2486O834K4568P2065j6308n8309r871J6761
21180i0202l943q118n8691m158J2992l2716l9110K7039M3989M0416K9846K8256
21168e4400j0201l5885o464J6181m989J076j1013J5908j0052J1431L1539j4340
$$ plain form
21255 -39025 -43251 -41746 -35481 7152 -29262 -51820 -43618 -50857 -42490 -36155 -52825 -14467 23209
21242 23209 29273 -19712 -3065 -9056 -13991 -30426 -28948 -45920 -78787 -119100 -106918 -68281
21230 -68281 -44685 -42810 -35693 -33020 -43414 -94618 -147237 -92430 -85471 -64413 -62107 -76163 -74494
21217 -74494 -103706 -85972 -100760 -84847 -64929 -72166 -32330 19076 2985 -60133 -65244 -71477
21205 -71477 -106178 -110697 -58694 6720 23871 18499 24170 5323 22224 -4085 -30083 -46447
21193 -46447 -47604 -45689 -80652 -94266 -103456 -125942 -119108 -94540 -22475 -38783 -97092 -106963 -90202
21180 -90202 -94145 -102263 -160954 -165112 -152120 -184836 -223946 -196907 -152918 -112502 -82656 -54400
21168 -54400 -64601 -100486 -106950 -90769 -95758 -94682 -105695 -89787 -99839 -88408 -56869 -71209
21156g1209j2993N923r703J6212J589Q214l6314o010l0095k3021K2966J8262j4538
21143a30717m7177J4324m2294L0957P1668J2319K4565Q537l5446k3652k7361m853
21131a49130L8673m947K955j1224J5968O421J3476P697K1144j1903j2580J7757
21119f5693m7534n2125J4262P121k634J5655J2325M4699L0922j4398P552N814
21107d4034n1546J6468l9611m4449K5163N1748n483k7276L2231J4248j3325m6118
21095a31984o532J0797K1979N1366O1875J0005m3784q974K5044l6008k2222j0231
21083g8669j2787r075j1859M3378j4574J3305k4831o6130l1101L6306P4294J9965
21071f1778j0452j71M623J1891j5538n494J3719J3734J051k2632J3009n280L0605
$$ plain form
21156 -71209 -84202 -78279 -87982 -71770 -70181 -61967 -98281 -104291 -134386 -157407 -134441 -116179 -130717
21143 -130717 -177894 -163570 -205864 -174907 -103239 -90920 -66355 -57818 -93264 -116916 -144277 -149130
21131 -149130 -110457 -115404 -112449 -123673 -107705 -101284 -87808 -80111 -58967 -70870 -83450 -65693
21119 -65693 -113227 -165352 -151090 -143969 -146603 -130948 -118623 -73924 -43002 -57400 -49848 -44034
21107 -44034 -95580 -79112 -118723 -163172 -138009 -86261 -91744 -119020 -86789 -72541 -85866 -131984
21095 -131984 -138516 -127719 -105740 -54374 7501 17506 -26278 -35252 -10208 -46216 -68438 -78669
21083 -78669 -91456 -100531 -112390 -69012 -83586 -70281 -95112 -161242 -192343 -156037 -81743 -61778
21071 -61778 -72230 -72401 -67778 -55887 -71425 -76919 -63200 -49466 -48415 -71047 -58038 -63318 -32713
21058c2713L6758J0716k6721q104j4015n3880l2704j9567L2746J5735m1404J2233
21046a20920J7496O7651m313n5792J9175K176L4130K4092o9307Q51J7794P528
21034e9439K314M358L1276j6829j3313j540j1160n7266j4432k57k1688J1421k971
21021a49526j4033M881K0665J9961R1521O4036k6960j1977j5531o3183j8483j1496
21009a10125k3874k3300L482r509l362M4140k5490P782J7095J4249l0024J8796
20997a20140k7524p426q568M076K1117N7543L824l3854j8177K7387r643k2857
20985a34242K6415L750L020K5377j99l3382j5462j6650J0154l7779k6237L0921
20973a64314Q7049O2993M671N033k8547r787K304j7970O873j8218l2229K3250
$$ plain form
21058 -32713 4045 14761 -11960 -20064 -34079 -87959 -120663 -140230 -107484 -91749 -133153 -120920
21046 -120920 -103424 -35773 -40086 -95878 -76703 -74527 -40397 -16305 -85612 -84761 -66967 -59439
21034 -59439 -57125 -52767 -21491 -38320 -51633 -53173 -64333 -121599 -136031 -136288 -157976 -146555 -149526
21021 -149526 -163559 -158678 -138013 -118052 -26531 37505 10545 -1432 -16963 -80146 -98629 -110125
21009 -110125 -133999 -157299 -153817 -163326 -166688 -122548 -148038 -140256 -123161 -108912 -138936 -120140
20997 -120140 -147664 -155090 -163658 -159582 -138465 -80922 -77098 -110952 -129129 -101742 -111385 -134242
20985 -134242 -107827 -104077 -101057 -75680 -75879 -109261 -124723 -141373 -131219 -168998 -195235 -164314
20973 -164314 -77265 -14272 -9601 -4568 -33115 -42902 -40598 -58568 -51695 -69913 -102142 -78892
20961g8892M7645j1131j9771m1782N653J8911k0766M9062j5156j1075K1786M5635
20949i881J2069n9740m9712l6448J3390J1975k264L584J5174K3862J5397k8327
20937i0921n94J0382j7125p963J4499P707J9490K5137l8633N363j4775k6757L9587
20924g4603O437k5132m4647J2636P1444R94N3254k556k0964j9375l790m247l5449
20911h5998l8771J7449m826K6213J9015k1557p619j5853J1685Q052K5703J8648
20899d7859l7711p7304k993L561J2951P95M7028O9818J8737j9329k8446n1949
20887a12701m7264J0293k1283M885K3619K6476K2245J8460N799M3579l2642o30
20875e9164O5236j390l5310l5503r2029l954J5443L6784M1528P036k3198n6426
$$ plain form
20961 -78892 -31247 -42378 -62149 -103931 -98278 -79367 -100133 -51071 -66227 -77302 -55516 -9881
20949 -9881 2188 -57552 -107264 -143712 -130322 -118347 -120611 -117027 -101853 -77991 -62594 -90921
20937 -90921 -91515 -81133 -98258 -106221 -91722 -84015 -64525 -39388 -78021 -72658 -87433 -114190 -74603
20924 -74603 -68166 -93298 -137945 -125309 -53865 -52871 383 -2173 -23137 -42512 -46302 -50549 -85998
20911 -85998 -124769 -107320 -112146 -85933 -66918 -88475 -96094 -111947 -100262 -92210 -66507 -47859
20899 -47859 -85570 -162874 -165867 -162306 -149355 -148560 -101532 -31714 -12977 -32306 -60752 -112701
20887 -112701 -159965 -149672 -170955 -166070 -142451 -115975 -93730 -75270 -69471 -25892 -58534 -59164
20875 -59164 6072 4682 -30628 -66131 -158160 -162114 -146671 -109887 -68359 -61323 -84521 -140947
20863a40947J4760M9444M108j8448l9799k9836k7258N9912R5236p437J9770K6498
20851F003l6603J5264r825l4617L337r725n728k2294J4371k3489j7124j9012P379
20838a32063q817L9735M4627Q48K996J539J3419K9284n857P279l954l0150l691
20825d4805K6711J6840k1098n4703o837R72p407J5163q706n89q030R143L3187
20812e0159l2989J8072L3116P670O89j0545q118N3143K8570l844m4831j2614k7864
20799d9704l6578M753J6012m7863k6335m4518L7611M4665K1470K8665M8210q50
20787d462j5028j4072J8128n9525o0220J7211K1576l110K4970L465k4599N996
20775h9670J7250j4407m331q132K6798K6666O770O820j5002j5320l8954o497L5328
$$ plain form
20863 -140947 -126187 -76743 -72635 -91083 -130882 -160718 -187976 -128064 -32828 -40265 -20495 6003
20851 6003 -30600 -15336 -25161 -59778 -56441 -66166 -71894 -94188 -79817 -103306 -120430 -139442 -132063
20838 -132063 -140880 -101145 -56518 -55670 -52674 -51135 -37716 -8432 -14289 -7010 -10964 -41114 -44805
20825 -44805 -18094 -1254 -22352 -77055 -83892 -82920 -90327 -75164 -83870 -84459 -92489 -83346 -50159
20812 -50159 -83148 -65076 -31960 -24290 -23601 -34146 -42264 10879 39449 35605 -9226 -21840 -49704
20799 -49704 -86282 -81529 -65517 -113380 -139715 -184233 -146622 -101957 -80487 -51822 -3612 -4462
20787 -4462 -19490 -33562 -15434 -74959 -135179 -117968 -96392 -99502 -74532 -71067 -95666 -89670
20775 -89670 -72420 -86827 -91158 -99290 -72492 -45826 -39056 -32236 -47238 -62558 -101512 -108009 -72681
20762g2681J3315K3780j6134J2214J2195K8540j9909m7807m397K3573k7603k1919
20750i6833K2467L7174n6123k2467K064j7687n9K7775K4807M3249K9383l768m4290
20737e4308p5563j0626L8308K0413K7302k4972m519k1375K774L9555n84k7961
20725i1556L158J9379l2603K0422L0868j0463L1663J156m0781k4677k74J3396
20713h0312k2788K2609O786N415q264L7065K1553J3307J2311j633n4542k2931
20701g1424k5795j6611L0520M6283J0874J0549M3341l7245o754k7106l0087L1153
20689d2302K4003r697j2518k7539k1865K8594k5070N0j0166M346K4504r458o09
20676g7727J6683L230l4068R743O2004R723r141j2917L2504K0843l3413P575k44
$$ plain form
20762 -72681 -59366 -35586 -51720 -39506 -27311 1229 -18680 -66487 -70884 -47311 -74914 -96833
20750 -96833 -74366 -37192 -93315 -115782 -113718 -131405 -131464 -103689 -78882 -35633 -6250 -10018 -54308
20737 -54308 -129871 -140497 -102189 -81776 -54474 -79446 -83965 -105340 -102566 -63011 -63595 -91556
20725 -91556 -88398 -69019 -101622 -81200 -50332 -60795 -29132 -27976 -68757 -93434 -93708 -80312
20713 -80312 -103100 -80491 -73705 -68290 -76554 -39489 -17936 -4629 7682 6049 -48493 -71424
20701 -71424 -97219 -113830 -83310 -37027 -26153 -15604 27737 -9508 -16262 -43368 -73455 -42302
20689 -42302 -18299 -27996 -40514 -68053 -89918 -61324 -86394 -86344 -96510 -92164 -67660 -77118 -77727
20676 -77727 -61044 -57814 -91882 -82139 -20135 -10412 -19553 -32470 34 20877 -12536 -4961 -5205
20663e205m279k6323l191n3176n0623K4352N7703K492m7587m6923L7510M1495
20651g3755k4680L3346K9680N397l9184l2362J0425L9998j3913l9959l920M0526
20639f8401j3855k9520K1386L9017J7498k679m8784m9793K0931O6096N2541l8081
20627c3644m8094M3168j6752j5093R870p906N1016M8519L3151k9016m4314p245
20615a6340N2207J2891l8297k723l2300k0265J1287K5098l5442o0706K9188K1938
20603e3464M4692L568n3905l5583J9420O6407O6695j0812o0889k7478J9551j8040
20591c9838j1833K4543N1326p62n8720L760r807l8292m4978p732N940J9219M9759
20578e7415k034n329L1308L2347j5051l2674K5093M626K7234J260m3573j3579
$$ plain form
20663 -5205 -9484 -35807 -38998 -92174 -142797 -118445 -60742 -58250 -105837 -152760 -115250 -73755
20651 -73755 -98435 -65089 -35409 -30012 -69196 -101558 -91133 -51135 -65048 -105007 -108927 -68401
20639 -68401 -82256 -111776 -90390 -51373 -33875 -36554 -85338 -135131 -114200 -48104 4437 -33644
20627 -33644 -81738 -38570 -55322 -70415 -60545 -68451 -17435 31084 64235 35219 -9095 -16340
20615 -16340 35867 48758 10461 7738 -24562 -44827 -33540 -8442 -43884 -104590 -75402 -53464
20603 -53464 -8772 -5204 -59109 -94692 -75272 -8865 57830 47018 -13871 -41349 -21798 -39838
20591 -39838 -51671 -27128 24198 23436 -35284 -31524 -41331 -79623 -124601 -132333 -126393 -107174 -57415
20578 -57415 -59449 -64778 -33470 -1123 -16174 -48848 -23755 -19129 8105 9365 -34208 -47787
20566d7787p901n5181l7106K8210m640P2785M5664j0724l6033L463J5630r989
20554d3609m7364m0645K0213K3057L2573J9616k9520j4315M230n44l7312N359
20542a08261L9096O2331k4470l086J7761L3030K0971k7726l5078n7037K8302K0405
20530c3762k3089L0278N6237n0557l687L1010l3146j4756R813j8475j9013N974
20518f3173j596k2936j0414K8825N8224K2864k5306l9089M9486j436j8421J0764
20506a2208L880L04M3163j1804j2252N2186m3874n2948J145N8539j1230m9067
20494c4166l8185l0453J0864K1242L1797K6142J6179J0766j2998O951N422k9042
20482a5481n0211k8940k041L2198L4458l058n396K710J2196j816J1034j959l3540
$$ plain form
20566 -47787 -55688 -110869 -147975 -119765 -124405 -51620 -5956 -16680 -52713 -49250 -33620 -43609
20554 -43609 -90973 -131618 -111405 -88348 -55775 -36159 -65679 -79994 -75764 -76308 -113620 -108261
20542 -108261 -69165 -6834 -31304 -34390 -16629 16401 37372 9646 -25432 -82469 -54167 -33762
20530 -33762 -56851 -26573 29664 -20893 -24580 6430 -26716 -41472 -31659 -50134 -69147 -63173
20518 -63173 -64769 -87705 -98119 -69294 -11070 11794 -13512 -52601 -3115 -4551 -22972 -12208
20506 -12208 -8328 -8024 35139 23335 11083 63269 19395 -33553 -32408 26131 14901 -34166
20494 -34166 -72351 -102804 -91940 -70698 -38901 -12759 3420 14186 1188 8139 13561 -15481
20482 -15481 -65692 -94632 -96673 -64475 -30017 -33075 -38471 -35761 -23565 -25381 -14347 -16306 -49846
20469d9846l3200J6527R072l2199o403k151k982L3831J3512K2293L260l6679l5077
20456a00042N717L6443M478M905j2805r300L6263J5893J3092r380j8748k5441
20444e8925k491O2871k448J0145K3910L293j0305o053P713j1224l6675q262l992
20431c2443J405k7704k8559n063L0420J2478L2651J6775n714M116k0775m5084
20419f7497J5359M9733l8962K5595K8044n587k4533l5595L0997k8611j2454K8780
20407c4731K779j1750K7583j4209l7885q759R575O1365l9474p4312l7324M2355
20395a14787O3550J7350r041k9846j3159k6544L3950J1538O21Q506j1053j5621
20383h4536q330J2472M1182L231j981J4213K0391j6196N792l9744m139J1122p68
$$ plain form
20469 -49846 -83046 -66519 -57447 -89646 -96049 -98200 -101182 -67351 -53839 -31546 -28286 -64965 -100042
20456 -100042 -94325 -57882 -53404 -48499 -61304 -70604 -34341 -18448 -5356 -14736 -33484 -58925
20444 -58925 -61416 1455 -993 9152 33062 36355 26050 19997 27710 16486 -20189 -28451 -32443
20431 -32443 -31038 -58742 -87301 -92364 -61944 -49466 -16815 -40 -5754 -1638 -22413 -67497
20419 -67497 -52138 -2405 -41367 -15772 12272 6685 -17848 -53443 -22446 -51057 -63511 -34731
20407 -34731 -31952 -43702 -16119 -30328 -68213 -76972 -67397 -6032 -45506 -119818 -157142 -114787
20395 -114787 -51237 -33887 -42928 -72774 -85933 -112477 -78527 -66989 -66368 -57862 -68915 -84536
20383 -84536 -92866 -80394 -39212 -35981 -37962 -23749 -3358 -19554 -13762 -53506 -57645 -46523 -47291
20370d7291n7674R370N0716J1854n518j5276L0335L9557n4554o7193Q405r6P864
20357h9501L0236J8779M8462K3923o1163l833J6015m6056M920l507j2733L1413
20345d3045L2594M918k4434N0628j4351j1629j2820l9330J374M48R795J7133j1006
20332c9725J6798k195l4926J0638L8147Q409J1409l217M25J2721j3687k7114n6219
20319g8536l0230Q1222K7152l1850k7107O3158P1747K6614n3900k8403o4j8269
20307A534o9459L0588O8530j6587j7387m9069n375J8261M3091m9701k9754M4811
20295c0517L3129J2292l6923o4585k7923J9920J2804J6896j1608Q144N0374o1469
20283g9466m474K9241K7287J0101J710k4192K9523J2870O8905J2751l3589k8638
$$ plain form
20370 -47291 -104965 -95595 -44879 -33025 -38543 -53819 -23484 16073 -38481 -105674 -97269 -97365 -89501
20357 -89501 -59265 -40486 7976 31899 -29264 -33097 -17082 -63138 -58218 -61725 -74458 -43045
20345 -43045 -10451 -5533 -29967 20661 6310 -5319 -18139 -57469 -56095 -55647 -45852 -28719 -39725
20332 -39725 -22927 -25122 -60048 -49410 -11263 -2854 8555 5338 5763 18484 4797 -22317 -78536
20319 -78536 -108766 -27544 -392 -32242 -59349 3809 75556 102170 48270 19867 19803 1534
20307 1534 -67925 -37337 31193 14606 -2781 -51850 -57225 -38964 4127 -45574 -75328 -30517
20295 -30517 2612 14904 -22019 -86604 -114527 -94607 -81803 -64907 -76515 -68371 -17997 -79466
20283 -79466 -83940 -54699 -27412 -17311 -15601 -39793 -10270 2600 71505 84256 50667 22029
20271B2029j5154k0519M2106O5080j3674o4196l5955J0355J5748K7331j0939j4112
20259H100j7182K0972N0995K8340J365l1917m8536l501J0824J3411l9028J9516
20247A3359J4696l8355J6809O1265j1840K0005k6653l3123k1576L3789O576n409
20235B9543O449o10L647Q917j2206j3240J2809K1215j1256R092k986m0302j182
20222I890L0448J6985l0233k8829j5365L6351J3176R403n934j3471q280o229j8593
20209a0681j4787K6790L8403M171k1502j1915K5530L8594M5106M6257p8622j00858
20197a3514j6057M7447M5581L700n9916N918K6032m506k3222j0748P297M0923
20185D8935l0445o7243P3205N3032k1774M33L9245j4948l3823r72K7645j6136
$$ plain form
20271 22029 6875 -13644 28462 93542 79868 15672 -20283 -9928 5820 33151 22212 8100
20259 8100 -9082 11890 62885 91225 92590 60673 12137 8636 19460 32871 -6157 13359
20247 13359 28055 -10300 6509 67774 55934 75939 49286 16163 -5413 28376 34952 29543
20235 29543 35992 35382 39029 47946 35740 22500 35309 56524 45268 54360 51374 11072 9890
20222 9890 40338 57323 27090 -1739 -17104 19247 32423 41826 35892 22421 14141 7912 -10681
20209 -10681 -25468 1322 39725 43896 22394 10479 36009 74603 119709 165966 87344 -13514
20197 -13514 -29571 17876 63457 67157 7241 13159 39191 34685 11463 715 8012 48935
20185 48935 18490 -48753 24452 77484 55710 56143 95388 80440 46617 45645 73290 57154
20173E7154k9641l394j3192R816N566J4434N679j8120k600r105L6483K0124k5957
20160D7247m1511j1240P452L0874j7443M9805m1913L2390K8497J2665k3592o9022
20148D209l8743j6603K2924N45k1433J47M7685L2276N073J8144l7968K547k629
20135A6174J5041N7893K3803m2532J883L446o2477r321L1231j0211k3540p222
20123e832M9297N8108L242p636k0653n808k1859J2910k3973N1796Q304M882J4517
20110A17295n0855l9924K2567K3016J9161Q46J7421J8692m7146k3344J301q294
20098E0736N267l7578l7394M6502N8255j515K9951l4978j5107k8977M1493j0543
20086F6112l6879O426R551q159l0989P085O2396J4074j7311R180j0218q625m292
$$ plain form
20173 57154 27513 24119 10927 20743 26309 40743 46422 28302 25702 16597 53080 73204 47247
20160 47247 5736 -5504 1948 32822 15379 65184 23271 55661 84158 96823 73231 4209
20148 4209 -34534 -51137 -28213 -27668 -49101 -48954 -1269 31007 36080 54224 16256 18803 16174
20135 16174 31215 89108 112911 70379 72262 75708 13231 3910 35141 24930 1390 -5832
20123 -5832 43465 101573 104815 97179 76526 70718 48859 61769 37796 89592 97896 102778 117295
20110 117295 66440 26516 49083 72099 91260 92106 109527 128219 81073 57729 59030 50736
20098 50736 56003 18425 -18969 27533 85788 84273 114224 79246 64139 35162 76655 66112
20086 66112 29233 35659 45210 37051 6062 13147 75543 89617 72306 81486 71268 62643 58351
20073E8351m9323j807K7535L2030K6546J7627l5502K0570J6591q442J6684L5869
20061A56729J8884P855K1959j3723R353L7393j5542J8476j7602j2848L8915K7857
20049B77706M0001K4208l246J4409J9483M6947O0987Q8957R7881J69949J39066
20038I76348J51966J18713K04095J21493N3278K4822N9826N5373K5508M5067o4116
20027A772373j3004R506j22092j28996q6742o7179m0045j61534k67534j88387
20017G06366q7035r7299n6164Q242m4837n6282n8566M865J4388l5374k9025J0304
20005B79583L8732k3122K4798M466L198K6365j4361n4785N330j126l1583Q866
19993B66361l5438l9090L2515R16K292L3255O628k6078k4758j9491J746m183J9168
$$ plain form
20073 58351 9028 7221 34756 66786 93332 110959 75457 96027 112618 104176 120860 156729
20061 156729 175613 183468 205427 191704 201057 238450 222908 241384 223782 210934 249849 277706
20049 277706 317707 341915 338669 353078 372561 419508 480495 569452 667333 837282 976348
20038 976348 1128314 1247027 1451122 1572615 1625893 1650715 1710541 1765914 1791422 1836489 1772373
20027 1772373 1759369 1768875 1646783 1517787 1431045 1363866 1323821 1162287 894753 706366
20017 706366 619331 522032 465868 474110 429273 372991 314425 319290 333678 298304 269279 279583
20005 279583 318315 295193 319991 324457 327655 354020 339659 284874 290204 289078 257495 266361
19993 266361 230923 191833 224348 225264 227556 260811 267439 241361 216603 197112 198858 194675 213843
19980B13843L7099l8046k5083k7475L7554m6047K5K1961L0186j589R715j8972
19968A93171m9235o0564K8748J5575l1665J9869K3100N373M5282m654J764l7697
19956A49067O753K9905P457J0695k3260l31J0716P553o791N131o756L6469K602
19943B29210m4207l1482J441j965M5172J7335k6178l0515n6685M1168M1081j5799
19931A68576j3081K173L3271j6145k4485j0270M1820M5381O589j3246K766r476
19919B13873m2100j6489N135J5528o870k4149l462M461K4557K2149o753n219N117
19906A85778Q026m8800K1221j9176M3850K9721l5807r176l6574m6966N8714N6611
19894B07422J9576k9543j1961J2182q251q012q543j3426K9495j67J0849J5422
$$ plain form
19980 213843 250942 212896 187813 160338 197892 151845 151870 173831 204017 202428 212143 193171
19968 193171 143936 83372 112120 127695 96030 115899 138999 144372 189654 185000 186764 149067
19956 149067 155820 185725 193182 203877 180617 180286 191002 198555 191764 196895 190139 226608 229210
19943 229210 185003 153521 154962 152997 198169 215504 189326 158811 102126 143294 184375 168576
19931 168576 155495 157668 190939 174794 150309 140039 181859 227240 233829 220583 223349 213873
19919 213873 171773 155284 160419 175947 169077 144928 141466 145927 170484 192633 185880 180661 185778
19906 185778 193804 145004 166225 147049 190899 220620 184813 175637 139063 92097 150811 207422
19894 207422 226998 197455 185494 197676 189425 181413 172870 159444 188939 188772 199621 215043
19882B15043j3545Q100p676K3551Q090l429N9646J0896m2344l3122l6589j427
19870A87194K7753p042m2106m299K3552K141r534K7781L5799j7233j2576j2316
19858A99114k9445L8114L2523J1324k4294l7358j7377m5213k784L1791n506J5887
19846A66776k9819j529l068n004N597l676j4307o607k620o249K4095L7326K5830
19833A86745J4767k754k2785j1240J2388N446K590K4134K2720N908J0736j0442
19821B38213j1117N4173M6701J1637m7398m0322K638k3644Q145J3097K8301N162
19809B85586J3022m2470o857n504N1176P845k1198K6148k3423m0101o813L873
19797B41284n6674o5150j1982J9218J5231K0974K1568j9041K6211O3852O695k3863
$$ plain form
19882 215043 201498 209598 201922 225473 233563 230134 289780 300676 258332 225210 188621 187194
19870 187194 214947 207905 165799 161500 185052 187193 177659 205440 241239 224006 211430 199114
19858 199114 169669 207783 240306 251630 227336 189978 172601 127388 124604 156395 150889 166776
19846 166776 136957 135428 132360 127356 132953 129277 114970 108363 105743 99494 123589 160915 186745
19833 186745 201512 198758 175973 164733 177121 182567 185157 209291 232011 237919 248655 238213
19821 238213 227096 281269 327970 339607 292209 251887 254525 230881 239026 252123 280424 285586
19809 285586 298608 256138 249281 243777 294953 302798 281600 307748 284325 244224 237411 241284
19797 241284 184610 119460 107478 126696 141927 162901 184469 165428 191639 255491 262186 238323
19785B38323J9915m248p343P050J801J7811j0668j9940j5806J8891j7772k5605
19773B02409L0803K1868m0761R586M6525l0991n854j5599k6926O859o02N791L1038
19760B34146j1172k2475J8773j2294j3255N0775J2647n1742l9067L0364J3991
19749B10691j5243K8321N8595M2642m1911j6001K7058J5502j931r070K4038L7999
19737C60690M2406N7434M9320N0508p1857M01Q6483n0261l9161N473J5615k556
19725E04495l3249n2293R648r43L4928L931m2146l2580K2637j6368k937j3408
19713C81715o2996l0554M6242R548j8765l878k1582m1718N1998M6523J2122n7577
19701C11078k22K1707j5570J2420P908k5386M0553l8548l1009n419n397J9145
$$ plain form
19785 238323 258238 253990 246647 253697 255498 273309 262641 242701 226895 245786 228014 202409
19773 202409 233212 255080 214319 223905 270430 239439 233585 217986 191060 197919 197317 203108 234146
19760 234146 222974 200499 219272 206978 193723 244498 257145 205403 166336 196700 210691
19749 210691 195448 223769 282364 325006 283095 267094 294152 309654 307723 298653 322691 360690
19737 360690 403096 460530 509850 560358 488501 488902 575385 525124 485963 491436 507051 504495
19725 504495 471246 418953 428601 427658 462586 466517 424371 391791 414428 398060 395123 381715
19713 381715 318719 288165 334407 343955 325190 321312 299730 258012 310010 356533 368655 311078
19701 311078 310856 332563 316993 329413 337321 311935 352488 313940 282931 277512 272115 291260
19689B91260q453j1865J8345O437N02K2028J2359k5125N3754J8190M21l8959M065
19676C42959J6165k0645l8916m5994m0553n7177L4553O8744K3042J9100L024N7828
19664C62130j336J2853Q592M9185o023k5698K1406L9865N2537M2845N1933M3950
19652F52239m07L281N8935K2039K5407N537K4462n5072l6083l2337p0968N833
19640F02866J0463J6613l9267k3258n8460l7394Q665P611l6673o8626k1590J3782
19628C74732M0749K2114l9458j7066j1047R480K8348K5794k0319m504l936O436
19616D11323P758L0473K7197N095k8172L6666o509l6285m1023L2465L2654k7369
19604D44273l6529J8930N785j4O2887R0937l0581k8737l250o589J9815j2949n450
$$ plain form
19689 291260 282807 270942 289287 295724 296226 318254 330613 305488 359242 377432 377853 338894 342959
19676 342959 359124 338479 299563 253569 213016 155839 190392 259136 282178 301278 304302 362130
19664 362130 360794 373647 382239 431424 425401 399703 421109 460974 513511 556356 608289 652239
19652 652239 651832 655113 714048 736087 761494 767031 791493 736421 700338 668001 597033 602866
19640 602866 613329 629942 590675 567417 508957 471563 480228 487839 451166 382540 360950 374732
19628 374732 415481 437595 398137 381071 370024 379504 407852 433646 413327 408823 404887 411323
19616 411323 419081 449554 476751 481846 453674 490340 483831 447546 406523 438988 471642 444273
19604 444273 407744 426674 432459 432445 495332 586269 555688 526951 523701 517112 536927 523978 518528
19591E18528J0782P2071L0882k7613o0494k3108L9357P5697K3557l2271o8891
19580E58497k7864J7958K9519n101j0711k6388m14j94k6528L4820J9534K3831
19568E86959L7907K1309Q492L5161r870k4237K2667M0854O2514m4588R635J7534
19556G64337k267K8350j3773L792l1063J0390j1169M668J6935L3732M525j2817
19544G95640L7756L3252j7112K1788J6979p029R853J8448K0074n0N7696L2561
19532A019856m013R014l8525j2372N4006M1695K3341K1455R8869L7515j0877n3386
19520A186578l9703L7927N1008L0361j1317L3539O5621j6471r8662j7086N0191
19509A271986K8378k7945k3596N8858K3097K2931L1667q054L713p653K9052N7871
$$ plain form
19591 518528 529310 601381 632263 604650 544156 521048 560405 636102 659659 627388 558497
19580 558497 530633 548591 578110 573009 562298 535910 535496 535302 508774 543594 563128 586959
19568 586959 624866 646175 654667 689828 679958 655721 678388 719242 781756 737168 746803 764337
19556 764337 762070 790420 776647 780439 749376 759766 748597 753265 770200 803932 808457 795640
19544 795640 833396 866648 849536 871324 888303 881274 891127 909575 929649 929599 987295 1019856
19532 1019856 1015843 1024857 986332 973960 1027966 1069661 1093002 1114457 1213326 1250841 1239964 1186578
19520 1186578 1146875 1184802 1235810 1266171 1254854 1288393 1354014 1337543 1238881 1221795 1271986
19509 1271986 1300364 1272419 1248823 1307681 1330778 1353709 1385376 1377322 1381035 1373382 1402434 1460305
19497A460305K0028J2571K8201J2775L1220K1104P549J4847M871O9024N9275J4993
19485A756763N0880Q6596R3029O0765O1494N3280n067j1602K1881J12143R4817
19474B374979k874K8731Q3228M5279P0598R8703N9922N0530K6001Q5220N5142
19463B975459O6902O2919J02397Q2384N2606J14134P5127N3695Q8784R0495P5830
19452C840732J63465J20308O9104O0571J46379J84039J70236J11791R3963J32757
19442E093345J79588J94708K48762K21907K46226L04305L64743M15288M49012
19433G717884M39441K94071L26757M59924M90668N01765N45811P13704Q93314
19424A2383339J044649J065582J074012J215745J434785J526013J445909J486119
$$ plain form
19497 1460305 1480333 1492904 1521105 1533880 1565100 1586204 1593753 1608600 1613471 1682495 1741770 1756763
19485 1756763 1807643 1894239 1987268 2048033 2109527 2162807 2157740 2146138 2168019 2280162 2374979
19474 2374979 2372105 2400836 2484064 2529343 2599941 2698644 2758566 2809096 2835097 2920317 2975459
19463 2975459 3042361 3105280 3207677 3290061 3342667 3456801 3531928 3585623 3674407 3764902 3840732
19452 3840732 4004197 4124505 4193609 4254180 4400559 4584598 4754834 4866625 4960588 5093345
19442 5093345 5272933 5467641 5716403 5938310 6184536 6488841 6853584 7268872 7717884
19433 7717884 8157325 8451396 8778153 9238077 9728745 10230510 10776321 11490025 12383339
19424 12383339 13427988 14493570 15567582 16783327 18218112 19744125 21190034 22676153
19416B2676153J753487K064590K249389K454850K769354L118886L465984M014948
19408D4567641M708370N637865O818804Q570627J0839591J3737285J7509857K2915767
19400A35305807K9567782L5109011L6399105L1777144J7825777q29495r41828
19393B84213303J1773265J9372190J4480179k553138j0184819m597371p080663
19386C05422946k1228967k3015398j1150676n151053j2957034l4116472m5901533
19379A51901813l6267319k3176720j4545681r563363o582619m823993l561753
19372E3380365k789183k351242j948091j466738j154359j137961j245427j304446
19364C9982918j065541q51811r56542j060754r01876q29027r87227j279455j417516
$$ plain form
19416 22676153 24429640 26494230 28743619 31198469 33967823 37086709 40552693 44567641
19408 44567641 49276011 54913876 61732680 70303307 81142898 94880183 112390040 135305807
19400 135305807 164873589 199982600 236381705 268158849 285984626 285155131 284213303
19393 284213303 295986568 315358758 329838937 327285799 317100980 312503609 305422946
19386 305422946 284193979 261178581 250027905 244876852 231919818 197803346 151901813
19379 151901813 115634494 92457774 77912093 68348730 61766111 56942118 53380365
19372 53380365 50591182 48239940 46291849 44825111 43670752 42532791 41287364 39982918
19364 39982918 38917377 38065566 37109024 36048270 35146394 34317367 33330140 32050685 30633169
19355C0633169j311625j087397j133740j305828j438109j470371j268438j137528
19347B0480133j123966j047402r00432p47930p08487q50023r93303j048166j092914
19338A1967510r83257p86494o15860n66882n75297n01437m40420m07242l28659
19329F761962l07183l48405l07328k82727k36715k18544k62157k58836k03641
19320D336426k38797k51975j76869j19194j02689j89990j27456j34693j51489
19311B843274j67499j55569j34669j50715j28780q4495j27320j20891m9765o9734
19301A653837o7885o4865j22627p8719l9258k2844K7070k2956o0578o1881p4892
19290A064402l8511n3394o870O31m9748k3772j0736q766Q694M0645K7282p0760
$$ plain form
19355 30633169 29321544 28234147 27100407 25794579 24356470 22886099 21617661 20480133
19347 20480133 19356167 18308765 17408333 16660403 15951916 15101893 14108590 13060424 11967510
19338 11967510 10984253 10197759 9581899 9015017 8439720 7938283 7497863 7090621 6761962
19329 6761962 6454779 6106374 5799046 5516319 5279604 5061060 4798903 4540067 4336426
19320 4336426 4097629 3845654 3668785 3549591 3446902 3256912 3129456 2994763 2843274
19311 2843274 2675775 2520206 2385537 2234822 2106042 2021547 1894227 1773336 1723571 1653837
19301 1653837 1585952 1521087 1398460 1319741 1280483 1257639 1284709 1261753 1201175 1139294 1064402
19290 1064402 1025891 972497 965627 966258 916510 892738 882002 873236 881930 922575 949857 879097
19278H79097q9576J9648j6052k6474K737K1498j4919K8466R804Q42l7360o7559
19266G10152k7944j6332n2406m4667j8725O916R685l4117o2963l3435k0750K3022
19254D38436n286j3632k4776J8230k6184l6080o3032o2031J8928N818j1101J628
19242B40918L8462j2733m677n168j2436j9855L5655K6645o826Q694j461k701M4813
19229C29330L4163N1184k775m3078R941J5766j8300M0935K488l4971L6323L3412
19217D54418R1216m8872j182L552j2260J9249j0024q3189j902j2968Q430r860
19205C96608j6582J6737J3697L3905p9952r3543j8171p284K648r850l1920J2308
19193B18601J3506j4637k2415j7624J6578K3016O034J50l1502K9098J6022k4977
$$ plain form
19278 879097 789521 809169 793117 766643 769380 790878 775959 804425 814229 815071 777711 710152
19266 710152 682208 665876 613470 568803 550078 556994 566679 532562 469599 436164 415414 438436
19254 438436 433150 419518 394742 412972 386788 350708 287676 225645 244573 250391 239290 240918
19242 240918 279380 266647 261970 256802 244366 224511 260166 286811 279985 288679 287218 284517 329330
19229 329330 363493 414677 411902 368824 378765 394531 376231 417166 419654 384683 421006 454418
19217 454418 545634 496762 495580 499132 486872 506121 496097 412908 411006 398038 406468 396608
19205 396608 380026 396763 410460 444365 364413 270870 252699 245415 248063 238213 206293 218601
19193 218601 232107 217470 195055 177431 194009 217025 223059 223209 191707 220805 236827 211850
19181B11850k9443K4K5084Q770j3690m1057k2187O0084p233j6732q983k5286l825
19168A37376M9087K0590j2408j1564k2363j8759M527M519p1663l7075l294p540
19156C1433M167M5476J402m846N943j4777j810J2954j5319N8789M9917k3358N3062
19143B03033J160l281M8451O773o904m4389j4387Q214j2377R205l1218p643k2838
19130A33799l2966Q228j838J1494J3314r686L3916l80K8440N7669J5451Q0567
19118C38008K0020q431N998O9868J60287J21117N5907O8412L0012L2126P8801
19107I72125R2465P232J0146M7115P0757N1480L2853M0516M5552k3385p2299r8046
19095A176511p3289o0584p0184l9744l4536p205p50l1802o5907n4449j4224n7351
$$ plain form
19181 211850 182407 182431 207515 216285 202595 161538 139351 199435 192202 175470 166487 141201 137376
19168 137376 186463 207053 194645 183081 160718 141959 146486 151005 79342 42267 38973 31433
19156 31433 35600 81076 82478 77632 83575 68798 66988 79942 64623 123412 173329 149971 203033
19143 203033 204193 200912 249363 256136 249232 204843 190456 198670 186293 195498 164280 156637 133799
19130 133799 100833 109061 107223 118717 132031 122345 156261 155881 184321 241990 257441 338008
19118 338008 358028 349597 355595 425463 585750 706867 762774 831186 861198 893324 972125
19107 972125 1064590 1071822 1081968 1129083 1199840 1251320 1284173 1324689 1370241 1346856 1274557 1176511
19095 1176511 1103222 1042638 972454 932710 898174 890969 890219 858417 792510 738061 723837 666486
19083F66486j18409n0963l0221k4541m4075l9466j1223k3899P527j324P421n0848
19071B86465p7625l7781l260M002p424l5834o6020M0046M7343j7229m066k9906
19059I8711L2284J3797p9942j6049J9000J2214m1928K9935N933Q912P070J0384
19047A00321j0393j7805m1177m2473Q146K555l0523j3744m04J6006M2291N8119
19035G0919R76l6973o1341j716n203k4713P620M3522l5957m2852N3110N8126m534
19022B0984K7419M793j0040Q463j2277j498q951m1010J1752k4668L15K9454N489
19009A0225j3442l598J0397j4164n253r994j1988k8657k22j6924P728j2264M8789
18996c9367N0001k1820m0053k4595L0835J3532p396M142j207l4299m005K8809
$$ plain form
19083 666486 548077 497114 466893 442352 398277 358811 347588 323689 331216 329892 337313 286465
19071 286465 208840 171059 167799 171801 164377 128543 62523 102569 149912 132683 128617 98711
19059 98711 130995 144792 64850 48801 67801 80015 38087 68022 73955 82867 89937 100321
19047 100321 89928 72123 30946 -11527 -3381 -826 -31349 -45093 -45497 -29491 12800 70919
19035 70919 71895 34922 -26419 -28135 -33338 -58051 -50431 -6909 -42866 -85718 -32608 25518 20984
19022 20984 48403 53196 43156 51619 39342 37844 28893 -12117 -365 -25033 -24718 4736 10225
19009 10225 -3217 -6815 3582 -10582 -15835 -25829 -37817 -66474 -66696 -83620 -75892 -88156 -39367
18996 -39367 10634 -11186 -51239 -75834 -44999 -31467 -38863 -34721 -35928 -70227 -74232 -45423
18984d5423K5175J1837j1717k885J6239O7828M9025m3293k6063P567j4835k7657
18972E798J3121J9155n6263j0493l2077j3664J3548K0931k5302j5565L34M5942
18960c4535K6608K2075k1478q390K3009K7011j8964m956L3942o195J1967j8640
18948C1454M8554k2027j7049p898P16L2331J1454o8271q837k9541m2886j9607
18936i1607N0044K1602K8979M424k483L8464k9653m2573L320K9628k7453m4336
18924f1644k6607N123O2738K4206j3188J8128J6358j5242m6499L7656p066j6338
18912b2375K2499K3299j2138q279j0873J5387j7485m7606j7417k3630K4795L7296
18900c6527J0044L4356l2063N237j0398L26J3371k6076j9263M233J7680M597J7805
$$ plain form
18984 -45423 -20248 -8411 -20128 -23013 -6774 61054 110079 66786 40723 48290 33455 5798
18972 5798 18919 38074 -18189 -28682 -60759 -74423 -60875 -39944 -65246 -80811 -80477 -34535
18960 -34535 -7927 14148 -7330 -15720 7289 34300 15336 10380 44322 38127 50094 31454
18948 31454 80008 57981 40932 33034 33750 66081 77535 9264 427 -29114 -72000 -91607
18936 -91607 -41563 -19961 9018 13442 10959 49423 19770 -22803 -19483 10145 -17308 -61644
18924 -61644 -88251 -83128 -20390 3816 -9372 8756 25114 9872 -36627 1029 -6037 -22375
18912 -22375 124 23423 11285 3006 -7867 7520 -9965 -57571 -74988 -98618 -73823 -36527
18900 -36527 -26483 7873 -24190 -18953 -29351 -29025 -15654 -41730 -60993 -56760 -39080 -34483 -16678
18887a6678l418J0506k1248o2280K2212L414j9926K4981n402J833j1048l4570
18875a11624M626N3982K8006n7259M792j812L17j6962l799J6413L79N081J0702
18862f7158R680L0312M8751m595l4215K7520K2356m855j3134n575j5894j9110
18850b5917L5993N0721J8109k3858N876K888n6403J6311P013M2844J1752R194
18838I4523k6361k2617M624j328l5984L6722J5927j754J5748K2516j9347K476
18826H5145M2432o00N87L325k3088m062K9570j5229m630k5003L5647J2619m6715
18813H9998N294j09j9864m1460K6389p10p619M9822O9431k4065l3015j5721K9066
18800A27437L603J200J7020k1588j1804j7337J8008J6308O04J7466J681N8273
$$ plain form
18887 -16678 -20096 -9590 -30838 -93118 -70906 -67492 -87418 -62437 -67839 -66006 -77054 -111624
18875 -111624 -106998 -53016 -25010 -82269 -77477 -79289 -78972 -95934 -99733 -83320 -82941 -77860 -67158
18862 -67158 -57478 -27166 21585 16990 -17225 10295 32651 27796 14662 9087 -6807 -25917
18850 -25917 10076 60797 78906 55048 60924 63812 7409 23720 30733 73577 85329 94523
18838 94523 68162 45545 50169 48841 12857 49579 65506 63752 79500 102016 82669 85145
18826 85145 127577 126977 127564 130889 107801 103739 133309 118080 113450 88447 124094 136713 89998
18813 89998 95292 95183 75319 33859 60248 59538 51919 101741 171172 147107 114092 98371 127437
18800 127437 131040 132240 149260 127672 115868 98531 116539 132847 133451 150917 152598 210871
18788B10871P433k1101N13j4325l8758m4801K0392J3416p499K6289j5005L6038
18776A73463M3748M7810L7251l0712L083P565L5167L6588L8404M8138M5493L5593
18764E21591O1949J8986j6923k6298M22p722j2473N921Q3203J42711J12920J45901
18752A030188J44410J82743K14357J06388L3732k0240K1937O6130J25958J2138
18742A917741l7242L1109M010j12893j57708o5819k9346n7146j77160k46607j92722
18731H76217q1482p3285j08396n2905K2233j3958l3372Q551k4846J8353J9747
18720E56857J2300L887O3552k8539O240N2379K8405j0000L076J5489l8701l1355
18708F33590J9040o81q656j13k6673n6330K1172P311J5331j1418r1540n7607L588
$$ plain form
18788 210871 218304 197203 197716 183391 144633 99832 120224 133640 126141 152430 137425 173463
18776 173463 217211 265021 302272 271560 274643 282208 317375 353963 392367 440505 485998 521591
18764 521591 583540 602526 585603 559305 559727 552005 539532 545453 628656 771367 884287 1030188
18752 1030188 1174598 1357341 1571698 1678086 1711818 1691578 1713515 1779645 1905603 1917741
18742 1917741 1880499 1911608 1915618 1802725 1645017 1579198 1549852 1492706 1315546 1068939 876217
18731 876217 794735 721450 613054 560149 582382 568424 535052 543603 518757 537110 556857
18720 556857 569157 573044 636596 608057 614297 666676 695081 685081 688157 703646 664945 633590
18708 633590 652630 651949 643293 643180 616507 560177 581349 588660 603991 592573 501033 443426 447014
18695D47014m683J9662M515m8687k3697l8589k1347k7805L008J666l0519L5695
18683C16233J5528n158J8106j8924J7786J9098o58j8733K8902N5290J6295k108
18671D41657j6100K8940K5847K2413r210m239J5295K5304K54M154K4166K7679
18659E86160O3621O989L2359L640k1616k2089L1439K2030j057k4867n7609L0308
18647F49308L3845O2669m2009o0979n5136k9043K3705k4852N2594M2399j1442
18636F41059K2985N5445L0896K2012M2233M7398M1812P9352L9207J2423J7477
18625A052299N0725N2862J9677L2730L8777N6380L3946k74k3259l9849k7149m6413
18613A200452m1092J0868l1909l6444n4616l8829M8128J1238j1033j7382L5950
$$ plain form
18695 447014 442331 461993 466508 417821 394124 355535 334188 306383 309391 311057 280538 316233
18683 316233 331761 326603 344709 325785 343571 362669 362011 343278 372180 427470 443765 441657
18671 441657 425557 454497 480344 502757 493547 489308 504603 529907 530161 534315 558481 586160
18659 586160 649781 656770 689129 692769 671153 649064 680503 702533 701476 676609 619000 649308
18647 649308 683153 745822 703813 642834 587698 558655 582360 557508 610102 652501 641059
18636 641059 664044 719489 750385 772397 814630 862028 903840 983192 1022399 1034822 1052299
18625 1052299 1103024 1155886 1175563 1208293 1247070 1303450 1337396 1337122 1313863 1274014 1246865 1200452
18613 1200452 1159360 1170228 1138319 1101875 1047259 1008430 1056558 1067796 1056763 1039381 1075331
18602A075331N514j1573K3134k1807L2550R4865L5797k919J5121k845K7766O544
18590A277478j57l1242j5883J9809O7447P9450L7013L844J26177J61623Q8676
18579A814235J07386J40377J57507J90401J65375J48810J25916J00428Q5706Q0266
18569C116407Q8229K3925o31m9856o6146j33919j40046j04514q0912j60184j49643
18558B342710o9235j26172j49475n0046p698n7783j8135K4426Q1339N0206l2261
18547A987876K2883L4978K8352M3959K0483J9086O1462R3524P0779j1298J8414
18536B390498N6371R7444O8314M5403K251M0590N1407N5706Q7718Q5986K0379
18525C002067O6121K4148M8582J01402P5477O3116R5806O2818Q9502J53966J62870
$$ plain form
18602 1075331 1080845 1069272 1092406 1070599 1103149 1198014 1233811 1230892 1246013 1243168 1270934 1277478
18590 1277478 1277321 1246079 1230196 1250005 1317452 1396902 1433915 1437759 1563936 1725559 1814235
18579 1814235 1921621 2061998 2219505 2409906 2575281 2724091 2850007 2950435 3036141 3116407
18569 3116407 3204636 3228561 3227930 3178074 3111928 2978009 2837963 2733449 2652537 2492353 2342710
18558 2342710 2273475 2147303 1997828 1947782 1940084 1882301 1864166 1888592 1969931 2020137 1987876
18547 1987876 2010759 2045737 2074089 2118048 2138531 2157617 2219079 2312603 2383382 2372084 2390498
18536 2390498 2446869 2544313 2612627 2658030 2660281 2700871 2752278 2807984 2895702 2981688 3002067
18525 3002067 3068188 3092336 3140918 3242320 3317797 3380913 3476719 3539537 3629039 3783005 3945875
18514C945875J12756R5846P3676J12034J65431K42683K48208K16001J80574J64303
18504E557387J07293J54952K34624K33787K36370K15896K72031L51325L36838
18495G700503L17558M23782M70180M97572N66747N54626O51135P87984Q97076
18486A2867163R84982J097740J132888J173413J219392J403133J676682J939213
18478B3494606K119727K315018K636447L171531L775859M566325N610785O904270
18470E4594568Q512552J0723963J3813978J7295732J9759782J9966881J7052765
18463A61720221R331883K232402M849553J0635320J2612363Q247844L874245Q251561
18455B21755392J4320361J3816057Q401763P539556N584898l743809j2846477
$$ plain form
18514 3945875 4058631 4154477 4228153 4340187 4505618 4748301 4996509 5212510 5393084 5557387
18504 5557387 5664680 5819632 6054256 6288043 6524413 6740309 7012340 7363665 7700503
18495 7700503 8018061 8441843 8912023 9409595 9976342 10530968 11182103 11970087 12867163
18486 12867163 13852145 14949885 16082773 17256186 18475578 19878711 21555393 23494606
18478 23494606 25614333 27929351 30565798 33737329 37513188 42079513 47690298 54594568
18470 54594568 63107120 73831083 87645061 104940793 124700575 144667456 161720221
18463 161720221 171052104 173284506 178134059 188769379 201381742 209629586 213503831 221755392
18455 221755392 236075753 249891810 258293573 265833129 271418027 267674218 254827741
18448B54827741j6409234j2464054r496279j2136797j0519093n121201m659384
18441A84021699j0678210j2762948q075001n607322r866099j9368034k2712423
18434I4951662j7326759j1280449p343366n031917l694558k964022k426612j977300
18426D2906679j707840j482410j241613j062674j068648j165709j180548j210369
18418C2786868j235796j265400j227691j133617j067762j153738j154066r96852
18410B3551946q26011q92568r94470j008083j061058j034165r65455q82660q63058
18401A5024418p54923p04200o79790o09221o12672o05755o08119n55447n68063
18392I326228n21607m87749m48619l62680k88876k21198k30573k27886k52215
$$ plain form
18448 254827741 238418507 225954453 216458174 204321377 193802284 188681083 184021699
18441 184021699 173343489 160580541 152505540 146898218 137032119 117664085 94951662
18434 94951662 77624903 66344454 59001088 53969171 50274613 47310591 44883979 42906679
18426 42906679 41198839 39716429 38474816 37412142 36343494 35177785 33997237 32786868
18418 32786868 31551072 30285672 29057981 27924364 26856602 25702864 24548798 23551946
18410 23551946 22725935 21833367 20838897 19830814 18769756 17735591 16770136 15887476 15024418
18401 15024418 14269495 13565295 12885505 12276284 11663612 11057857 10449738 9894291 9326228
18392 9326228 8804621 8316872 7868253 7505573 7216697 6995499 6764926 6537040 6284825
18383F284825l18106l57054l58548k75118k49991k50113j96584j37086j30156
18374D012069j54999j59290k05146j92362j50192j46987j42089j12003m5279m1514
18364B662208p3279p2402l9584r1758r7049k5075l0181j18250q7547m2201m0906
18353A943976p4404r1063j166p0912o4616m3564n8021p8105k3857n2219o2639
18342A323410k3162m3028l183n0332o8718j7419k0695n6101N612j621M695j2781
18330A036677l7313l1234j6404M5132M6765m3740q6645m8799J490M0454l1497
18319H74886m0385j2764j8104N301L6116k8638j4491k4436m5437l9220n2495k1486
18307F18847j868l4699l0542J484j7167o7652l26L8569O784k0652K4082j442K5129
$$ plain form
18383 6284825 5966719 5609665 5251117 4975999 4726008 4475895 4279311 4142225 4012069
18374 4012069 3857070 3697780 3492634 3300272 3150080 3003093 2861004 2749001 2703722 2662208
18364 2662208 2588929 2516527 2476943 2385185 2288136 2263061 2232880 2114630 2027083 1984882 1943976
18353 1943976 1869572 1778509 1777343 1706431 1641815 1598251 1540230 1462125 1438268 1386049 1323410
18342 1323410 1300248 1257220 1254037 1203705 1134987 1117568 1096873 1040772 1046384 1044763 1049458 1036677
18330 1036677 999364 968130 951726 996858 1043623 999883 913238 864439 865929 906383 874886
18319 874886 834501 821737 803633 808934 845050 816412 801921 777485 732048 692828 640333 618847
18307 618847 616979 582280 551738 553222 536055 468403 468077 506646 513430 492778 516860 515418 540547
18294E40547j8761m3695k5800J7768K1754j2329J5825N0976L9142J2990Q671j3894
18282E93194j8770J2584M7965j6870m2136R929M6015j078p73n1135L1680P5862
18270F86467p503l4535l5402J0344l4616l3362R872K324o6263l7300j0322m5613
18258D04091j5170J7362n919Q877J4500j5985l3814J0233R953l6428K1394L7517
18246D16611L4524J0569m0689m6708M2492K0205o4222k5018l9297L4706k6202
18235C16971l8350R188m373N9332J3532k553K5279q927n431k4155j5902K712O14
18222C27937J7631l5246J006j8276m1991l3009L2433q488l2960R094J2706k5704
18210B05133J5044K7358K1911L1503M1809L0085J1274J7036l5415l7497L6369
$$ plain form
18294 540547 521786 478091 452291 470059 491813 479484 495309 546285 585427 598417 607088 593194
18282 593194 574424 587008 634973 618103 575967 585896 631911 630833 630060 578925 610605 686467
18270 686467 678964 644429 609027 619371 584755 551393 561265 563589 497326 460026 449704 404091
18258 404091 388921 406283 400364 409241 423741 407756 373942 384175 394128 357700 379094 416611
18246 416611 451135 461704 421015 374307 416799 437004 372782 347764 308467 343173 316971
18235 316971 278621 287809 283436 342768 356300 353747 379026 370099 364668 340513 324611 327323 327937
18222 327937 345568 310322 311328 293052 251061 218052 250485 241997 209037 218131 230837 205133
18210 205133 220177 247535 269446 300949 342758 372843 384117 401153 365738 328241 364610
18199C64610K8686N710j2402k7359N489m3032n1059M6058N9361k726K4176l0871
18187C66641K7681K4518K708m6612Q123m240k9234l8726j4061l8997J9563o185
18175B71179L2756l535k0585N477J1774n4166n9073L4425N325K9130P445m534
18163B55618R465l2755K8304J6937N6409N1590J0982N44j9954l4397N9552N6816
18151D59111P989p411J6834K6766l9801J8613O3931L1621J9902M0804O0712N4462
18139G53533J9981O9919J04686J05859J10588J54630J64603J38824J00504J33573
18129A856700J32062J44605J91135J73328J69172K10829K49705L00943M01889
18120C830368M83531N61260O54506Q16895R79494J239022J644536K218813K914702
$$ plain form
18199 364610 393296 399006 386604 359245 364734 321702 270643 316701 376062 373336 397512 366641
18187 366641 394322 418840 421548 374936 383059 378819 349585 310859 296798 257801 277364 271179
18175 271179 303935 300400 279815 285292 297066 242900 183827 218252 223577 252707 260152 255618
18163 255618 265083 232328 260632 277569 333978 385568 396550 397094 377140 342743 402295 459111
18151 459111 467100 459689 476523 503289 463488 482101 546032 577653 597555 638359 699071 753533
18139 753533 773514 843433 948119 1053978 1164566 1319196 1483799 1622623 1723127 1856700
18129 1856700 1988762 2133367 2324502 2497830 2667002 2877831 3127536 3428479 3830368
18120 3830368 4313899 4875159 5529665 6346560 7326054 8565076 10209612 12428425 15343127
18111A5343127L796441N203816P170104Q806255Q721971O361816O77758r653679
18103D6427609j4527704j0606387o193543l583837k198856j477805j080211q33174
18095E926092o44629m58960l46796k87154k29017j99258j38005j09355j41794
18086C371124j98931q6905m4236O785j4841q2806j7437N067N8155P8276o5886
18075C008365j64585j46093k27567k23250j07966j49807j78577j22087n2224j24220
18065A511989j31343p7833j01097n7984m9538r9299m2285l2073n3949p2442o796
18054G87350n706q4404q3595M709k3735n8736m3091k8957l4905L621j3346j0954
18042D08251K4171m1637n8641l7086k9657j0636J3500J4473l3242J5331k4170
$$ plain form
18111 15343127 19139568 24343384 31513488 40319743 49041714 55403530 56081288 46427609
18103 46427609 31899905 21293518 15099975 11516138 9317282 7839477 6759266 5926092
18095 5926092 5281463 4822503 4475707 4188553 3959536 3760278 3622273 3512918 3371124
18086 3371124 3172193 3085288 3041052 3047837 3032996 2950190 2932753 2937820 2995975 3074251 3008365
18075 3008365 2843780 2697687 2470120 2246870 2138904 1989097 1810520 1688433 1636209 1511989
18065 1511989 1380646 1302813 1201716 1143732 1094194 994895 952610 920537 866588 794146 787350
18054 787350 781644 697240 613645 618354 594619 535883 492792 463835 428930 432551 419205 408251
18042 408251 432422 390785 332144 295058 265401 254765 268265 282738 249496 264827 240657
18031B40657q828m0072p3289m444L7350J8899O912J3420l5099l1551l8177j8731
18019F7047R330J2513L8610K0727l1135m1977l0983k0664j1386N1398J8579K4242
18007A06301J4110J6870m612l4029o844J680n0786l968J0559N99O492k7598J0302
17994C9076J631k4439J6793J9445l4578j2160J8846k0426k1973K1204j7205l6987
17982e0773j2344O1615R588M100k3131N470J9762M5755M3382j7542m2572j0190
17970C3120k0511L618j2877q929j8297o835j353m3117l031K2349K7918p853j7545
17957e3343J4629K2380L1847l188J5371J296j8254J8049M437k6665j4927K745
17945e623K9141M1779K2382K3520M894K7731N4301J3764q547K9525O5220J31671
$$ plain form
18031 240657 231829 191757 118468 114024 151374 170273 177185 190605 155506 123955 85778 67047
18019 67047 76377 88890 127500 148227 117092 75115 44132 23468 12082 63480 82059 106301
18007 106301 120411 137281 132669 98640 91796 93476 42690 38722 49281 49880 56372 28774 39076
17994 39076 40707 16268 33061 52506 17928 5768 24614 4188 -17785 3419 -13786 -50773
17982 -50773 -63117 -1502 8086 12186 -10945 -5475 14287 60042 103424 85882 43310 33120
17970 33120 12609 16227 3350 -5579 -23876 -30711 -32064 -75181 -78212 -55863 -27945 -35798 -53343
17957 -53343 -38714 -16334 15513 12325 27696 28992 10738 28787 33224 6559 -8368 -5623
17945 -5623 23518 65297 87679 111199 116093 143824 198125 211889 203342 232867 298087 429758
17933D29758R0755J02739J59146J55522J73854J49015J04925P0782Q1968m650
17923A513814L159l9662n0544l5052l6309n0191Q537N2170M1997l0993m2106M516
17911A339336j4524q5646j13437j42171j70517j73189j08277j02646k5568O490
17901D09851k9551m4963j7209k3199j0349j4360k5566J1986N4613k0956m8625
17890B41672k5947N860M3385J1257q0651j4398O19j6970l0260n3762p497p196
17878F6112p053L1109L3933L5271N53j2450k0298M0889M4814n247m1292N58N782
17865A72681k2572J7221L7688J3367l5491k4410K4088k8399J9566L6631L521j5355
17853A98536n2254K4968M6035k3485n6807r146m4850J0590R936r874L0611k308
$$ plain form
17933 429758 520513 623252 782398 937920 1111774 1260789 1365714 1436496 1518464 1513814
17923 1513814 1516973 1477311 1426767 1391715 1355406 1305215 1313752 1365922 1407919 1376926 1334820 1339336
17911 1339336 1324812 1239166 1125729 983558 813041 639852 531575 428929 403361 409851
17901 409851 380300 335337 318128 294929 284580 270220 244654 256640 311253 290297 241672
17890 241672 215725 221585 264970 276227 195576 181178 181797 164827 134567 80805 73308 66112
17878 66112 59059 90168 124101 159372 159925 147475 127177 168066 212880 207633 166341 166899 172681
17865 172681 150109 167330 205018 218385 182894 158484 182572 154173 173739 210370 213891 198536
17853 198536 146282 171250 217285 193800 136993 127847 82997 93587 103523 93649 124260 121952
17841A21952m9809k7749r613M3470M2202k061r204Q829J6348p2485K2052M1104
17829A25036K4224r914j7390p402j1987m7409J2425L6864N2165K77R717L0024
17817A96630j7605l4835N1849J08987M9942N0151O2480J10743J04074J31195M0072
17806H53683K5172L3382L4672N0673M1315M0700O6202Q1088O5361N7657L6769
17795A386674O1837L055m0451o0063m1849m3228j00109o7783l1554k7435k8561
17784A010533q4616m2417n7047p3287k9836r0247j05408j07504m5930j4355m9368
17773C10518p8457l2872M729L3788O467K4716j4665K453m8287M13k0055j9968
17761A68780K7039K0833M1940K3576j7634k1944m4657Q464L0968J9491m1926k336
$$ plain form
17841 121952 72143 44394 34781 78251 120453 118392 109188 118017 134365 61880 83932 125036
17829 125036 149260 139346 121956 114554 102567 55158 67583 104447 156612 156889 166606 196630
17817 196630 179025 144190 196039 305026 354968 405119 467599 578342 682416 813611 853683
17806 853683 878855 912237 946909 997582 1038897 1079597 1145799 1226887 1292248 1349905 1386674
17795 1386674 1448511 1451566 1411115 1351052 1309203 1265975 1165866 1098083 1066529 1039094 1010533
17784 1010533 925917 883500 826453 753166 723330 633083 527675 420171 374241 359886 310518
17773 310518 232061 199189 203918 237706 244173 268889 254224 256677 208390 208803 188748 168780
17761 168780 195819 216652 258592 282168 264534 242590 197933 206397 237365 256856 214930 212594
17749B12594K8889l0398l3383J9768L3929L0616J2625R657Q944p031M2520M4706
17737C73436m3070o9109m8105J3342L2114K9423j6033l881K6191L8545q673j6319
17725C07861m3461K2080O177k3330q862p743l9243J1255k6295k4633J2440n673
17713A80573k4853L288J1912m237J2660l654J7341K3137J7023P248K8180j1487
17701B57131j5485j6018n0073N914L7494L4488M158n5254o596o034l4327n986
17689A49412N0724Q318k8913q500L9802K4216Q754j790M400m4878l0814k8869
17677A41862j1381j4322P488K8489L0598k9770J842K5401K4331k271j8659M82
17665A84090K256K1180Q022j1807l8922O681l3932k9996J6577N077j2609K6414
$$ plain form
17749 212594 241483 211085 177702 197470 231399 262015 274640 284297 293241 286210 328730 373436
17737 373436 330366 261257 213152 226494 258608 288031 271998 268117 294308 332853 324180 307861
17725 307861 264400 286480 292657 269327 260465 252722 213479 224734 198439 173806 186246 180573
17713 180573 155720 159008 170920 166683 179343 175689 193030 216167 233190 240438 268618 257131
17701 257131 241646 225628 175555 181469 218963 253451 257609 202355 195759 189725 155398 149412
17689 149412 200136 208454 179541 171041 210843 235059 243813 242023 246423 201545 170731 141862
17677 141862 130481 116159 123647 152136 182734 152964 154806 180207 204538 202267 183608 184090
17665 184090 186346 207526 215548 203741 164819 171500 137568 107572 124149 129226 116617 143031
17653A43031K3034k3739M5478L0742k9841m106j1419k3461R243K1066K4691J1824
17641B16543K5643j1313m2557O283J2873j6140Q826j2376k1811J126O363k219
17629A71241J9631j3646j667K0299P079L3704M6864J6256K4351N2466O1928M6237
17617D84743k9459o833O5183Q1362N163n3599n1538M4472K1404K8519J4782j8340
17605E85859L229m2406J21j8301l0424m1478j7985m3529o2811m8767m8540l5598
17593A99370L0373j7215l4277m2800j8715K680K0993L9531n1363m729K2363N6903
17581B03114L7033m5500k0789k7429J5601M2694J2513j5280J4029N405k9560J9601
17569B11432M150R035Q338L3089j4768l0344P693K1776K6404K0279M225k5874
$$ plain form
17653 143031 166065 142326 187804 218546 188705 184599 173180 149719 158962 180028 204719 216543
17641 216543 242186 230873 188316 194599 207472 191332 200158 187782 165971 167097 173460 171241
17629 171241 190872 177226 175559 195858 202937 236641 283505 299761 324112 376578 438506 484743
17617 484743 455284 448451 513634 594996 600159 546560 495022 539494 560898 589417 604199 585859
17605 585859 589088 546682 546803 528502 498078 456600 438615 395086 332275 283508 234968 199370
17593 199370 229743 212528 178251 135451 116736 119416 140409 179940 128577 123848 146211 203114
17581 203114 240147 194647 173858 146429 162030 204724 217237 201957 215986 221391 191831 211432
17569 211432 215582 224617 232955 266044 251276 220932 228625 250401 276805 297084 301309 275435
17557B75435M22M9525K7683m8038k6714k898J1320K4389L356K2520k7771k3435
17545B85794K5666l3691j3634o382k5463K0380K6212r130K5417R645K7387L4969
17533C67170l4249l3925L2901m431m0376n047J8513k3470J1958J4749L8590O5749
17521D08132M4163N9863j204k1016l0062l7029J2348J8218M3132J9321o202k3500
17509D86164j3895N0569n247K477n6162J6339N6437k0414P598J9755L5212j3746
17497E65087K759M7331J8584P249P901O361L6719L1069J6159J4105K9144O0200
17485H42668r735J1077k9548L7359P5968k3520l4372j07656n687P6021N0445N4428
17473I37448J235M6795J4817l975n1457j9171j4042K3837N0044O4200K6080m0108
$$ plain form
17557 275435 275857 325382 353065 305027 278313 275415 286735 311124 314480 337000 309229 285794
17545 285794 311460 277769 264135 257753 232290 252670 278882 269752 295169 304814 332201 367170
17533 367170 332921 298996 331897 327466 287090 282043 300556 277086 289044 303793 342383 408132
17521 408132 452295 512158 510954 489938 459876 422847 435195 453413 496545 515866 509664 486164
17509 486164 472269 522838 517591 520068 463906 480245 536682 516268 523866 543621 578833 565087
17497 565087 567846 615177 633761 641010 648911 655272 691991 723060 739219 753324 782468 842668
17485 842668 832933 844010 814462 851821 927789 904269 869897 762241 756554 832575 883020 937448
17473 937448 938683 985478 1000295 996320 944863 925692 911650 935487 985531 1049731 1075811 1035703
17461A035703o555L9664P6959L5457J3935M0921K1365R637J0922Q321N0895L5516
17449A372740l469N1752M4099P0717L3639P7679J16814P1107Q5615J34453J40736
17438B195882P8242k5253j9751J1326P941Q595L1287M1272N3246L8082O6989J10996
17426B598854R7328Q1666P1267J6061N1018J03439P4248O5475O1313M5328N2841
17415C318838J25780J56474R8413J18815Q3102M9317J21064J13041J20004R9632
17405D404480J29221J60410J72474J47339J92588K31231K59654L03502L07328
17396F308227L57134M48621M71922M47437N05240N60404O37648O50999P64201
17387A1151833Q56094R80742J139785J292655J423633J500975J655154J631263
$$ plain form
17461 1035703 1029148 1068812 1145771 1181228 1195163 1236084 1257449 1267086 1278008 1286329 1337224 1372740
17449 1372740 1369271 1421023 1465122 1535839 1569478 1647157 1763971 1835078 1920693 2055146 2195882
17438 2195882 2274124 2248871 2229120 2240446 2248387 2256982 2288269 2329541 2382787 2420869 2487858 2598854
17426 2598854 2696182 2777848 2849115 2865176 2916194 3019633 3093881 3159356 3220669 3265997 3318838
17415 3318838 3444618 3601092 3699505 3818320 3901422 3950739 4071803 4184844 4304848 4404480
17405 4404480 4533701 4694111 4866585 5013924 5206512 5437743 5697397 6000899 6308227
17396 6308227 6665361 7113982 7585904 8033341 8538581 9098985 9736633 10387632 11151833
17387 11151833 12007927 12988669 14128454 15421109 16844742 18345717 20000871 21632134
17379B1632134J742948J874944K083725K473636K879695L343815L922974M699205
17371D4653076N846450P258723R064546J1431762J4567582J8704773K3380394
17364A34907306K7570847K9979099K8548449K0550977J1684296Q705160L526895
17357B65473029j862647m697904q628609p570642o670334n726970K415531J0482726
17349B43214180J0545142L631888K01406k849912r554273j3824965j9609625k3631480
17341A88122361k5402623k9576389k7481208j9393012j2586869q394607n856727
17334E9430926m243422l278617k648986k140504j832203j684871j495233j314429
17326D0792661j247401j247419j258191j203777j077161r94623j051496j023038
$$ plain form
17379 21632134 23375082 25250026 27333751 29807387 32687082 36030897 39953871 44653076
17371 44653076 50499526 57758249 66822795 78254557 92822139 111526912 134907306
17364 134907306 162478153 192457252 221005701 241556678 253240974 261946134 265473029
17357 265473029 263610382 258912478 250283869 242713227 236042893 230315923 232731454 243214180
17349 243214180 253759322 257391210 257592616 254742704 245188431 231363466 211753841 188122361
17341 188122361 162719738 133143349 105662141 86269129 73682260 65287653 59430926
17334 59430926 55187504 51908887 49259901 47119397 45287194 43602323 42107090 40792661
17326 40792661 39545260 38297841 37039650 35835873 34758712 33764089 32712593 31689555
17318C1689555j012496j068160j132366j160147j103758j094460j241114j292307
17310B2584747j227722j116839j055448j005966r75399j029661j004569r54512
17302A4214631q92455p99987p62031p15302o63933n43605m76589m64578m69882
17293H426269m97841l55632l01026l51911l76370l41816k83030k19282k17183
17284E482178k66255k59227k18367j77089j59452j68509k02003k17542j64619
17275C649115j20600j70708j80142j36821p3597q3615o72q1344j37787j49834
17265B513995j42518j13763p0796j26427p5601K2795o326n6476m6041o7788q9972
17254A741082o2258p2212o1496n5979o4983q9721j08763m5465n0437m2167o7555
$$ plain form
17318 31689555 30677059 29608899 28476533 27316386 26212628 25118168 23877054 22584747
17310 22584747 21357025 20240186 19184738 18178772 17203373 16173712 15169143 14214631
17302 14214631 13322176 12522189 11760158 11044856 10380923 9837318 9360729 8896151 8426269
17293 8426269 7928428 7572796 7271770 6919859 6543489 6201673 5918643 5699361 5482178
17284 5482178 5215923 4956696 4738329 4561240 4401788 4233279 4031276 3813734 3649115
17275 3649115 3528515 3357807 3177665 3040844 2967247 2883632 2882960 2801616 2663829 2513995
17265 2513995 2371477 2257714 2186918 2060491 1984890 2007685 2001359 1944883 1898842 1831054 1741082
17254 1741082 1678824 1606612 1545116 1489137 1424154 1334433 1225670 1180205 1129768 1087601 1020046
17243A020046l0386o784K0877N571J5784j4336p592k2027R870j2971j9932j1370
17231I46750J9206k4976k9649j2147K8666m4221p2022p812L680L9177K0939r8744
17219G68847j38825j2173j5651k3845j3442l6058m4069o959k2506k6795J1539
17208D40063K2612o189l1698m564R790L671l754K6167M283j395J9375l388l774
17195D71199k8638L149K5692J2988q360l6542k1712J8192K1493J9826j2126L1066
17183D96227K7938K7540Q2909l989q1895k6732J0444M1620M8673k578r281m445
17171F06431q1674k7480o352j619k6396m452k3437LJ4100M389M018q087j9004
17158D30440P413K8259J9759l1642j4518j5599p732l701O664j8536N267K5483
$$ plain form
17243 1020046 989660 982876 1003753 1009324 1025108 1010772 1003180 981153 991023 978052 958120 946750
17231 946750 965956 940980 911331 899184 927850 883629 811607 803795 807475 846652 867591 768847
17219 768847 630022 617849 602198 578353 564911 528853 484784 477825 455319 428524 440063
17208 440063 462675 456486 424788 420224 430014 433685 429931 456098 460381 458986 478361 474973 471199
17195 471199 442561 445710 471402 484390 476030 439488 417776 435968 457461 477287 465161 496227
17183 496227 524165 551705 634614 630625 548730 521998 532442 574062 622735 620157 610876 606431
17171 606431 524757 497277 490925 489306 462910 458458 435021 435024 449124 453513 457531 449444 430440
17158 430440 437853 466112 485871 454229 439711 424112 416380 412679 419343 400807 406074 431557
17146D31557j2657o8168n8938n627M2685N823M3044k4456k8079j8752J9714K6772
17134C52918k844j8747J010m809j4948J5856o5821m1936N2291j0541m2413j0022
17122B09994k0987N1120L5909j6826j1141m5720k8131L738o576M4335M2767K5553
17110B84035J6973m425k9302j0157K562o8333n7504j7311J0499J3641j0467l948
17098A26263L3006J0939l5895r158n188l2085j9631n9415j728L3550l458K4544
17086F1744L8906k4317R222Q162n5090m2865j1050j3970M3128N2644O4758l551
17074A27721k9860n477r53j5436J4437L5800l7659k4394K7910J3138K2841N954
17062A34022K403J8956l265p9038k0893J2221l827l3996L5556Q6500J8005k1146
$$ plain form
17146 431557 418900 350732 291794 286167 328852 334675 377719 353263 325184 306432 326146 352918
17134 352918 350074 331327 332337 327528 312580 328436 262615 220679 272970 262429 220016 209994
17122 209994 189007 240127 276036 259210 248069 202349 174218 177956 171380 215715 258482 284035
17110 284035 301008 296583 267281 257124 259686 191353 133849 116538 127037 140678 130211 126263
17098 126263 159269 170208 134313 125155 119967 87882 68251 8836 7108 40658 37200 61744
17086 61744 100650 76333 85555 93717 38627 -4238 -15288 -29258 13870 66514 131272 127721
17074 127721 97861 92384 91431 75995 90432 126232 88573 64179 92089 105227 128068 134022
17062 134022 136425 155381 152116 73078 52185 64406 60579 26583 62139 148639 166644 145498
17050A45498m059L7024o132q40j4477P278K6002P454J5800m2485m9934l4835Q187
17037I4481K1244k067M1128N2996j880k4953k0763r246j1003k784R447K5530l125
17024A69005l8969l5809L3717L8126N0486l6158n1040k2409L5241j7860j0457
17013A13873k2163k5634m402M4477j5300O790K6083l5086n0959M5949J5231J0724
17001A09583j2624r750k8180K8699M048K6724J8006l6174J5076q034k1147j6426
16989F9801m1614j7688j1119M6225K1731J2457l3743J4912K3523J3797j4542k3881
16977E9859m6980L26K3031J2469k3039k0999l2895K5727Q4337O215L7058K6993
16965A52102K867j5896n2762l4349N7269R1570K1138k12p216L662l007k7139n0863
$$ plain form
17050 145498 141439 178463 172331 171491 157014 164292 190294 197748 213548 171063 121129 86294 94481
17037 94481 115725 113658 154786 207782 205902 180949 160186 150940 139937 137153 146600 172130 169005
17024 169005 130036 94227 127944 166070 216556 180398 129358 106949 142190 124330 113873
17013 113873 91710 66076 61674 106151 90851 97641 123724 88638 37679 83628 98859 109583
17001 109583 96959 87209 59029 87728 91776 118500 136506 100332 115408 107374 86227 69801
16989 69801 28187 10499 -620 45605 67336 79793 46050 60962 84485 98282 83740 59859
16977 59859 12879 13205 36236 48705 25666 4667 -28228 -2501 81836 88051 125109 152102
16965 152102 154969 139073 86311 51962 109231 200801 221939 221727 214511 218173 215166 188027 137164
16952A37164L1448O2076K4371j4184k3521r59o411k3849L0198K8116K2788M7301
16940C14538j562L1495m3759j5775j7308K4179j1142j1010p933l9595J2889k5316
16928B09701p0371j5979L6496p827J5480j652l3422r431k1017L0660P98N1303
16916A84739J8988J8059J4193j8152j1749M651j776m3026k8678J4706L8539K33
16904A90727j6463k1358o530J8776R252L644m0009J5511N7564K9253J2755l2469
16892B20653q330l9258m0306j3340L426M407l6691J0348J5367l7961l489K6538
$$ plain form
16952 137164 168612 230688 255059 240875 217354 216395 209984 186135 216333 244449 267237 314538
16940 314538 312976 344471 300712 284937 267629 291808 280666 269656 261723 222128 235017 209701
16928 209701 139330 123351 159847 152020 167500 165848 132426 122995 101978 132638 133436 184739
16916 184739 203727 221786 235979 217827 206078 210729 208953 165927 137249 151955 190494 190727
16904 190727 174264 152906 146376 165152 174404 178048 138039 153550 211114 240367 253122 220653
16892 220653 212323 173065 132759 119419 122845 127252 90561 100909 116276 78315 74826 101364
$$ [...]
##END NTUPLES=NMR SPECTRUM
##END=
