##TITLE=Analysis number 311234
Compound Code cc 03409
Book Reference 422/77
Project Code adrs
Chemist Name robb
##JCAMPDX= 6.0         $$ Bruker NMR JCAMP-DX V2.0
##DATA TYPE= NMR SPECTRUM
##DATA CLASS= NTUPLES
##ORIGIN= Bruker BioSpin GmbH
##OWNER= NMR
$$ XWIN-NMR		Version 3.5
$$ Mon Jul  4 15:05:12 2005 GMT Daylight Time (UT+1h)  MAYBRIDGE\NMR@NMR_250MHZ
##.OBSERVE FREQUENCY= 250.131544655141
##.OBSERVE NUCLEUS= ^1H
##.ACQUISITION MODE= SIMULTANEOUS (DQD)
##.ACQUISITION SCHEME= undefined
##.AVERAGES= 16
##.DIGITISER RES= 18
##SPECTROMETER/DATA SYSTEM= dpx250
##.PULSE SEQUENCE= zg30
##.SOLVENT NAME= CDCl3
##.SHIFT REFERENCE= (INTERNAL, CDCl3, 0, 16.522)
##AUDIT TRAIL= $$ (NUMBER, WHEN, WHO, WHERE, WHAT)
$$ ##TITLE= Audit trail, XWIN-NMR		Version 3.5
$$ ##JCAMPDX= 5.01
$$ ##ORIGIN= Bruker BioSpin GmbH
$$ ##OWNER= NMR
$$ C:\u/data/dgb/nmr/ADRS/5330/pdata/1/auditp.txt
$$ ##AUDIT TRAIL=  $$ (NUMBER, WHEN, WHO, WHERE, WHAT)
(   1,<2005-07-04 15:04:52.50 +100>,<MAYBRIDGE\NMR>,<NMR_250MHZ>,
      <created by zg, POWCHK disabled, PULCHK disabled
       configuration hash MD5:
       62 19 C7 07 E1 42 D1 B7 37 6C 3D D0 77 39 F9 E6
       data hash MD5: 64K
       07 25 C6 7A E3 44 B6 77 A3 D8 F6 46 EE 76 34 58>)
(   2,<2005-07-04 15:05:03.66 +100>,<MAYBRIDGE\NMR>,<NMR_250MHZ>,
      <Start of raw data processing
       ef LB = 0.3 FT_mod = 6 PKNL = 1 SI = 32K 
       data hash MD5: 32K
       A3 75 19 79 61 AF D4 85 87 07 F3 A2 5E B4 9A 37>)
(   3,<2005-07-04 15:05:05.69 +100>,<MAYBRIDGE\NMR>,<NMR_250MHZ>,
      <apk 
       data hash MD5: 32K
       31 63 8F 8A 1F CC 84 8E F2 0E 56 1C BF 46 C6 83>)
(   4,<2005-07-04 15:05:06.38 +100>,<MAYBRIDGE\NMR>,<NMR_250MHZ>,
      <abs ABSG = 5 
       data hash MD5: 32K
       02 91 1E 2F 2C 55 8A 20 B3 77 93 A2 C6 8F 88 FE>)
$$ ##END=
$$ 
$$ hash MD5
$$ 98 1A 6A 5B 6A C9 39 48 DB 96 EE C9 1B 75 FF 52
##$RELAX= 
##$RELAX= 
##$RELAX= 
##$RELAX= 
##$RELAX= 
##$RELAX= 
##$RELAX= 
$$ Bruker specific parameters
$$ --------------------------
##$DU= <C:\u>
##$EXPNO= 5330
##$NAME= <ADRS>
##$PROCNO= 1
##$TYPE= <nmr>
##$USER= <dgb>
##$AMP= (0..31)
100 100 100 100 100 100 100 100 100 100 100 100 100 100 100 100 100 100 
100 100 100 100 100 100 100 100 100 100 100 100 100 100 
##$AQSEQ= 0
##$AQ_mod= 3
##$AUNM= <au_zg>
##$AUTOPOS= <51 >
##$BF1= 250.13
##$BF2= 250.13
##$BF3= 250.13
##$BF4= 250.13
##$BF5= 500.13
##$BF6= 500.13
##$BF7= 500.13
##$BF8= 500.13
##$BYTORDA= 1
##$CFDGTYP= 0
##$CFRGTYP= 5
##$CHEMSTR= <none>
##$CNST= (0..31)
1 1 145 1 1 1 1 1 1 1 1 1 1 1 1 1 1 1 1 1 1 1 1 1 1 1 1 1 1 1 1 1 
##$CPDPRG= <>
##$CPDPRG1= <>
##$CPDPRG2= <>
##$CPDPRG3= <>
##$CPDPRG4= <mlev>
##$CPDPRG5= <mlev>
##$CPDPRG6= <mlev>
##$CPDPRG7= <mlev>
##$CPDPRG8= <mlev>
##$CPDPRGB= <>
##$CPDPRGT= <>
##$D= (0..31)
0 1 0 0 0 0 0 0 0 0.06 0 0 0 0 0 0 0.0002 0 0 0 0 0 0 0 0 0 0 0 0 0 0 
0 
##$DATE= 1120485891
##$DBL= (0..7)
120 120 120 120 120 120 120 120 
##$DBP= (0..7)
150 150 150 150 150 150 150 150 
##$DBP07= 0
##$DBPNAM0= <>
##$DBPNAM1= <>
$$ [...]
##$SUBNAM7= <"">
##$SUBNAM8= <"">
##$SUBNAM9= <"">
##$SW= 20.6930455092707
##$SWIBOX= (0..15)
0 0 3 0 0 0 0 0 0 0 0 0 0 0 0 0 
##$SW_h= 5175.983436853
##$TD= 65536
##$TD0= 1
##$TE= 295.16
##$TE2= 300
##$TE3= 300
##$TEG= 300
##$TL= (0..7)
0 120 120 120 120 120 120 120 
##$TP= (0..7)
150 150 150 150 150 150 150 150 
##$TP07= 0
##$TPNAME0= <>
##$TPNAME1= <>
##$TPNAME2= <>
##$TPNAME3= <>
##$TPNAME4= <>
##$TPNAME5= <>
##$TPNAME6= <>
##$TPNAME7= <>
##$TPOAL= (0..7)
0.5 0.5 0.5 0.5 0.5 0.5 0.5 0.5 
##$TPOFFS= (0..7)
0 0 0 0 0 0 0 0 
##$TUNHIN= 0
##$TUNHOUT= 0
##$TUNXOUT= 0
##$USERA1= <user>
##$USERA2= <user>
##$USERA3= <user>
##$USERA4= <user>
##$USERA5= <user>
##$V9= 5
##$VALIST= <valist>
##$VCLIST= <CCCCCCCCCCCCCCC>
##$VD= 0
##$VDLIST= <DDDDDDDDDDDDDDD>
##$VPLIST= <PPPPPPPPPPPPPPP>
##$VTLIST= <TTTTTTTTTTTTTTT>
##$WBST= 1024
##$WBSW= 4
##$XGAIN= (0..3)
0 0 0 0 
##$XL= 0
##$YL= 0
##$YMAX_a= 352889
##$YMIN_a= -396134
##$ZGOPTNS= <>
##$ZL1= 120
##$ZL2= 120
##$ZL3= 120
##$ZL4= 120
##$ABSF1= 16.522
##$ABSF2= -4.171173
##$ABSG= 5
##$ABSL= 3
##$ALPHA= 0
##$AQORDER= 0
##$ASSFAC= 0
##$ASSFACI= 0
##$ASSFACX= 0
##$ASSWID= 0
##$AUNMP= <proc_1d>
##$AZFE= 0.1
##$AZFW= 0.1
##$BCFW= 0
##$BC_mod= 0
##$BYTORDP= 0
##$COROFFS= 0
##$CY= 12.5
##$DATMOD= 1
##$DC= 0
##$DFILT= <>
##$DTYPP= 0
##$F1P= 14.0000005364418
##$F2P= -0.99999901652339
##$FCOR= 0.5
##$FTSIZE= 32768
##$FT_mod= 6
##$GAMMA= 0
##$GB= 0
##$INTBC= 1
##$INTSCL= 1
##$ISEN= 128
##$LB= 0.3
##$LEV0= 0
##$LPBIN= 0
##$MAXI= 10000
##$MC2= 0
##$MEAN= 0
##$ME_mod= 0
##$MI= 0
##$NCOEF= 0
##$NC_proc= -4
##$NLEV= 6
##$NOISF1= 0
##$NOISF2= 0
##$NSP= 0
##$NTH_PI= 0
##$NZP= 0
##$OFFSET= 16.522
##$PC= 1
##$PHC0= -73.45181
##$PHC1= -0.2883105
##$PH_mod= 1
##$PKNL= yes
##$PPARMOD= 0
##$PSCAL= 4
##$PSIGN= 0
##$REVERSE= no
##$SF= 250.13
##$SI= 32768
##$SIGF1= 0
##$SIGF2= 0
##$SINO= 400
##$SIOLD= 32768
##$SREGLST= <1H.CDCl3>
##$SSB= 0
##$STSI= 32768
##$STSR= 0
##$SW_p= 5175.98343685301
##$SYMM= 0
##$S_DEV= 0
##$TDeff= 65536
##$TDoff= 0
##$TI= <Analysis number 999999
Compound Code 99
Book Reference 9
Project Code 9>
##$TILT= no
##$TM1= 0
##$TM2= 0
##$TOPLEV= 0
##$USERP1= <user>
##$USERP2= <user>
##$USERP3= <user>
##$USERP4= <user>
##$USERP5= <user>
##$WDW= 1
##$XDIM= 32768
##$YMAX_p= 374962436
##$YMIN_p= -196680
$$ End of Bruker specific parameters
$$ ---------------------------------
##NTUPLES= NMR SPECTRUM
##VAR_NAME=  FREQUENCY,     SPECTRUM/REAL,   SPECTRUM/IMAG
##SYMBOL=    X,             R,               I
##VAR_TYPE=  INDEPENDENT,   DEPENDENT,       DEPENDENT
##VAR_FORM=  AFFN,          ASDF,            ASDF
##VAR_DIM=   32768,         32768,           32768
##UNITS=     HZ,            ARBITRARY UNITS, ARBITRARY UNITS
##FACTOR=    0.157963299565203, 1,           1
##FIRST=     4132.6476996994, 0,             0
##LAST=      -1043.33573715361, 0,           0
##MIN=       -1043.33573715361, -196680,     0
##MAX=       4132.6476996994, 374962436,     0
$$ Real data points
##PAGE= N=1
##DATA TABLE= (X++(R..R)), XYDATA
$$ [...]
19943A025672k3342l1794j1013K2281j0975l525k1693P248O544L0327n655l8456
19931I45619J3344K1688l2405q4026m0795k9912j8003j6364K6799M3053r321j9384
19919H00293N461P773j0340j2330j3477P080O1789l458m2869n9053N684K167l713
19906G45007m3416M031M854P827L0417K9937j7847j9773K2345L5957N372L3680
19894H38391Q165k4029p896P595L9429m028o910k5669j494l203K6567J6789R862
19881H73569j3726J8237K7026n685l3490l6986j1915L7022J4393r191o01P856
19869H66509o753o3003j6435J2790j5185K078k9511r712j93L549j8986J5616J3184
19856G53948m0333n0871k6973K4286J5211k6747k9709L1972K2654j6450l2164
$$ y = [1025672, 1002330, 970536, 959523, 981804, 970829, 967304, 945611, 952859, 959403, 989730, 984075, 945619, 958963, 980651, 948246, 864220, 823425, 793513, 775510, 759146, 785945, 828998, 819677, 800293, 805754, 813527, 803187, 790857, 777380, 784460, 846249, 842791, 799922, 740869, 746553, 748720, 745007, 701591, 705622, 710476, 718303, 748720, 778657, 760810, 741037, 763382, 799339, 804711, 838391, 846556, 822527, 814631, 822226, 861655, 857627, 850717, 825048, 823554, 820351, 846918, 863707, 873569, 859843, 878080, 905106, 899421, 865931, 828945, 817030, 854052, 868445, 859254, 858653, 866509, 859756, 796753, 780318, 793108, 777923, 780001, 750490, 740778, 740585, 744134, 725148, 740764, 753948, 713615, 662744, 635771, 660057, 675268, 648521, 618812, 650784, 673438, 656988, 624824]
19845F24824O446L1955m5741m3309m4162l7093j0148K7709k6805j8681j4264J1664
19833D62395K5412l4429j2855p173j5883o6807p0334P67K7910L3750K653o143
19821C39263J3670k7622k7371j2169k3879j8597j0352k9000m8196K5257K4455
19810B05459l282l8286l1745K839K2922R660M8333l1840l0781q880k7386L2340
19798A49353K6697l5101o3710j6637N2919N1029l0847k8612k869j2568j1504K0885
19786I9035J8998J8767J5166o308j7639O668J9549k2193j1665q795l5252l1991
19774D4340J7791K619o792L3148M1295k187j0850N195K1899N726J1824j0271N146
19761A58883K3685J473J6355L5246L0852M7565P540R0326Q3551K9700j5738l0170
$$ y = [624824, 631270, 663225, 617484, 574175, 530013, 492920, 482772, 510481, 483676, 464995, 450731, 462395, 487807, 453378, 440523, 433350, 417467, 350660, 280326, 281093, 309003, 342753, 345406, 339263, 352933, 325311, 297940, 285771, 261892, 243295, 232943, 203943, 155747, 181004, 205459, 202177, 163891, 132146, 134985, 157907, 167567, 215900, 184060, 153279, 144399, 117013, 149353, 176050, 140949, 77239, 60602, 113521, 164550, 133703, 105091, 102222, 89654, 78150, 99035, 118033, 136800, 151966, 145658, 128019, 134687, 154236, 132043, 120378, 111583, 76331, 44340, 62131, 64750, 57958, 91106, 132401, 130214, 119364, 124559, 146458, 152184, 164008, 153737, 158883, 182568, 184041, 200396, 235642, 266494, 314059, 321599, 411925, 495476, 525176, 509438, 479268]
19749D79268r9697Pm397n903L1161N1749L3620M0223Q2974J47023J44060J01809
19737A001897o623o3838q3931q3695r0288j0016m0687l1763O774L7294O5449O6009
19725G66582R3911Q8572O4118J8658j5257K6843L8505r754n1537l2571k3462j340
19713I63268q826p841k1460O930j5881L650k6787n8343q5496p1612n6077j4973
19701F06552l3290o3120l4862K049j0400k1400p693j5699m2931k0463j5861m5829
19689B97053p526J3433k2019j5959l4148K1172K3179R312k4172l9167k301k9631
19677A89226j1405R913J3926K2934k7286j3392l429Q970j6223k5697m6900k6671
19665G3966j3251K6677K557j8726K0371l9145l3187l7846j043M0045L4413J7595
$$ y = [479268, 379571, 379578, 375181, 369278, 400439, 452188, 485808, 526031, 609005, 756028, 900088, 1001897, 995274, 931436, 847505, 763810, 673522, 663506, 622819, 591056, 597830, 635124, 700573, 766582, 860493, 949065, 1013183, 1031841, 1016584, 1043427, 1081932, 1072178, 1020641, 988070, 964608, 963268, 954442, 946601, 925141, 932071, 916190, 919840, 893053, 834710, 749214, 677602, 621525, 606552, 573262, 510142, 475280, 477329, 466929, 445529, 437836, 422137, 379206, 358743, 342882, 297053, 289527, 302960, 280941, 264982, 230834, 252006, 275185, 284497, 260325, 221158, 218857, 189226, 177821, 187734, 201660, 224594, 197308, 183916, 180487, 189457, 173234, 147537, 100637, 73966, 60715, 87392, 89949, 71223, 91594, 52449, 19262, -18584, -19627, 20418, 54831, 72426]
19653G2426j0464k2834l5878J1633P581r711l935J7817J6398l2079m1595N857
19641b4784p624j566J3349O946J9578j5601q16j9604l8086k5318J7136K30l591
19628g9751n127J7460K660Q676l115L4373l230K6867K4962J2697j7548l7788j576
19615b0440J6541Q868K034J2586L7931j661k4572k5214k0182r418p493L1357J2679
19602A3016j4623R211J3247J953l7139j61P527J5213J4119L743K950K9193J7170
19589G5419r097k250k5636Q613j8677J3345n020m217Q060L0683J0962j4864k2854
19576D4467J116J660m53N1093J3403j5653k6698j6248q108j2130J5985K2206j2271
19563E8369K3065J274J0326M425q907k9370p652M1261Q654l115J6961k0591M9454
$$ y = [72426, 61962, 39128, 3250, 14883, 22464, 12753, 8818, 26635, 43033, 10954, -30641, -24784, -32408, -33974, -20625, -13679, 5899, -9702, -10518, -30122, -68208, -93526, -76390, -76160, -79751, -84878, -67418, -64758, -56082, -59197, -24824, -28054, -1187, 23775, 36472, 18924, -18864, -20440, -3899, 4969, 7003, 19589, 57520, 55859, 31287, 6073, -14109, -23527, -31020, 337, 13016, -1607, 7604, 20851, 22804, -14335, -14496, -6969, 8244, 22363, 26106, 29056, 58249, 75419, 66322, 64072, 38436, 47049, 28372, 41717, 36697, 32480, 40540, 71223, 82185, 67321, 44467, 45583, 47243, 46790, 97883, 111286, 95633, 68935, 52687, 44579, 32449, 48434, 70640, 58369, 81434, 82708, 93034, 97459, 88552, 59182, 51530, 92791, 101445, 98330, 115291, 94700, 144154]
19550A44154K3775M1155J0825N092j3712J9606J8396o039l1414J3065K1507O779
19538B53189O209j2945k4715J5964R750J9866m66J023N8700M4885K3832M5592
19526D40884N4046K8034J785j5278n6236l0193j0765j4392Q423L9614N5266K8591
19514E29779L2295j1788Q311L3326K4037J9892O857l0331m8781p1470l6444M5103
19502E00786K5684J0013J7711L0535l738l6627j3808l2899j8246k5745l9060o414
19490D08192j5312j5819l2171l224K210M347J9151j672J8644O4097O8278K8332
19478E45053M0870M8105P1981K4956K96k4201k7404m9583j3934l6465o0011l6957
19466D82706J3497Q421R236J6154M8905n594J5886J4603J5286j1436n665k5434
$$ y = [144154, 167929, 209084, 219909, 225001, 211289, 230895, 249291, 243252, 211838, 224903, 246410, 253189, 259398, 246453, 221738, 237702, 247452, 267318, 266852, 267875, 326575, 371460, 395292, 440884, 494930, 522964, 524749, 509471, 453235, 423042, 412277, 397885, 406308, 445922, 501188, 529779, 562074, 550286, 558597, 591923, 615960, 635852, 642709, 612378, 563597, 492127, 455683, 500786, 526470, 536483, 554194, 584729, 580991, 544364, 530556, 497657, 479411, 453666, 414606, 408192, 392880, 377061, 344890, 341666, 343876, 348223, 367374, 365702, 384346, 448443, 516721, 545053, 585923, 634028, 706009, 730965, 731261, 707060, 679656, 630073, 616139, 579674, 519663, 482706, 496203, 504624, 513860, 530014, 578919, 573325, 589211, 603814, 619100, 607664, 601999, 576565]
19454E76565o9801o6069l7468o5134l0736j7574m0125n0712M853M128m6941j1756
19442A49230R42l399K8636q249M724l532l8002j5265j2371l5776j0888J8204L140
19429G7394q808J7977r163j0049J7721K6583J0294j5486l443O335l9733k2837
19417D6785P434J776K1452L473j3711J2919k5802l8199k1524m0773J5882K5038
19405e250k0338K333m014m4549K979n675k9807J3476K9085k153m0957N7n326K2685
19391h7454K8244N0161J0660O421m9920K3599Q183l8116k4767Q316K2005M884
19379c7784j3375P09N52r621j0094J997O710k805k3485j1840Q626L3465J1585
19366d5360j4956k4936K1869k334j1569M94r770L407j9213K404Q735O7016K3021
$$ y = [576565, 506764, 440695, 403227, 338093, 307357, 289783, 249658, 198946, 203799, 207927, 160986, 149230, 150172, 146773, 175409, 167160, 171884, 168352, 130350, 115085, 102714, 66938, 56050, 74254, 77394, 68586, 86563, 77400, 67351, 85072, 111655, 121949, 106463, 103020, 109355, 69622, 46785, 54219, 55995, 77447, 80920, 67209, 80128, 54326, 16127, -5397, -46170, -30288, -5250, -25588, -23255, -27269, -71818, -68839, -74514, -104321, -90845, -61760, -63913, -104870, -104813, -110139, -87454, -59210, -9049, 1611, 8032, -41888, -18289, -10106, -48222, -72989, -64673, -42668, -37784, -51159, -50450, -49898, -59519, -69613, -67616, -60906, -63711, -87196, -99036, -90410, -56945, -45360, -60316, -85252, -63383, -65717, -77286, -76792, -86562, -83155, -102368, -99964, -91229, -24213, -1192]
19353a192j9466q593J279r090k9110J3888L2258j7199J3863m3355K374q12j4432
19340g9587J9027Q861J4792J3172j7957k2161j4504j3664K0533j2682M0182K4552
19328a9436k30J3389J8802l6987j4710P59k7780j4736R510L2695L187J8416M0093
19315B2972j5387j6267l4777J263j1975r830R969j8891k9696l798J8324j2995
19303a01088j5227K5419K4977J5495R013k0489k6931l474J3904n91k70J3517K8230
19290c7515j3794j4816j529j5605q699K8173M3896j0732l6384J7043R988j3054
19278e3028j8156N126K4443J0021P330J5520K191k6212o452K3596r927l3366l9868
19265i8782j24J1541J6328k7842k4033K7012r084k7688L2543K2415J2418M4854
$$ y = [-1192, -20658, -29251, -27972, -37062, -66172, -52284, -20026, -37225, -23362, -66717, -64343, -65155, -79587, -60560, -51699, -36907, -23735, -41692, -63853, -78357, -92021, -71488, -84170, -43988, -19436, -19666, -6277, 12525, -24462, -39172, -38413, -66193, -80929, -71419, -38724, -35537, -17121, 22972, 7585, -8682, -43459, -42196, -54171, -64001, -54032, -72923, -102619, -106417, -88093, -101088, -116315, -90896, -65919, -50424, -41411, -61900, -88831, -92305, -78401, -78992, -79262, -65745, -37515, -51309, -66125, -67654, -83259, -91958, -63785, -19889, -30621, -67005, -49962, -39974, -53028, -71184, -66058, -41615, -31594, -24264, -8744, -6553, -32765, -39217, -15621, -25548, -58914, -98782, -98906, -87365, -71037, -98879, -122912, -95900, -104984, -132672, -100129, -77714, -65296, -20442]
19253b0442J7039k8898j6249p444O375J2115j3134r009k6013m0298J3778K6691
19241h5489J1526N144J0821J9720K5341j6021k268n710m438J4916K2239k1427
19229b5646k9723J5655P637L67N911J0720j5234R633J529j4752O648K1299j3265
19216a9221o858j350j9529J4271K2670k4646L76J8716n860j2900J5851J0186l3040
19203d1334n77M2084r520n4004l9987j2268L2521K7687O288K2631K1919l5773
19191d0333l7423j2765K2238N699l2981j3206K9255l401l858K3272K2681K4569
19179a6253M420j8057o0375j7979N5354K7211r995k3405j1806K2802n841k3469
19167g7393m159J5722L7204O775l2887L5151R411k1117l2318l2835M398j2687
$$ y = [-20442, -3403, -32301, -48550, -55994, -49619, -37504, -50638, -59647, -85660, -125958, -112180, -85489, -73963, -68819, -57998, -38278, -12937, -28958, -31226, -36936, -41374, -26458, -4219, -25646, -55369, -39714, -32077, -31710, -25799, -15079, -30313, -20680, -19151, -33903, -27255, -5956, -19221, -26079, -27429, -46958, -32687, -10017, -34663, -34287, -15571, -21431, -34331, -18480, -8294, -41334, -41911, 173, -9347, -63351, -103338, -115606, -83085, -55398, -49110, -26479, -4560, -40333, -77756, -90521, -68283, -62584, -95565, -108771, -79516, -82917, -86775, -63503, -40822, -16253, -11833, -29890, -90265, -108244, -52890, -25679, -35674, -59079, -70885, -48083, -53924, -77393, -81552, -65830, -28626, -21851, -54738, -19587, -10176, -31293, -63611, -96446, -92048, -104735]
19155a04735J86l1671J0173J1056L4787K9151k5836k9582j826j0422J2901j0115
19143a15933j2125L3181O8114K1462k4997l2872j6857M7346k4063j7368N2707
19132b1405O499j2981J89j8761k4017q575j0130j1479J7927J6733j2489J2546
19120f5943j198J7228l7870P437N513K923j4049K0369j4189J3684n672k9939L2108
19107f9598j2975k8485J8989M3359J7526j6926p338J6097j4106l9669J9409k095
19095g5812K7559J4596O824l571J1476R175l4990l4014J4691L7015n289j1353
19083d3693j1522m3481J332J1503M5179N1574J8349o1517k1922L847M8704j1019
19071a2666m6077r490k2919l1600j0n7J7451N0782J7496k0765k3601r244k7896
$$ y = [-104735, -104549, -136220, -126047, -114991, -80204, -51053, -76889, -106471, -108297, -118719, -105818, -115933, -128058, -94877, -26763, -5301, -30298, -63170, -80027, -32681, -56744, -74112, -21405, -14906, -27887, -27698, -46459, -70476, -79051, -89181, -100660, -82733, -66000, -78489, -65943, -67141, -49913, -87783, -80346, -74833, -71910, -85959, -65590, -79779, -66095, -71767, -101706, -69598, -82573, -111058, -92069, -48710, -31184, -48110, -55448, -39351, -53457, -93126, -73717, -75812, -48253, -33657, -26833, -30404, -18928, -9753, -44743, -78757, -64066, -27051, -32340, -43693, -55215, -98696, -97364, -85861, -40682, 10892, 29241, -32276, -54198, -50351, -1647, -12666, -58743, -68233, -91152, -122752, -122762, -122819, -105368, -54586, -37090, -57855, -81456, -90700, -118596]
19058a18596J4060j5136J1211m630l387J0616M0875K5033J0468Q822j0437M895
19046b6206j584K4335r850k1459P942k041j9279j5046Q959j6965K5952N5879J6230
19033B6867q738j9481l1635j3722j076K4589M495M210k4925k4658j5918K836K6586
19020e0570O463j6586j3037M932k1063j3581l1736N2163M1961j488p922J3014
19008c7450J4642N18q9j2863k1467K7480m633n1802m0173K5788K2150L0945K0518
18995b6436l0050J4527k753L104j6087L979k4880L9678M0516n8031K382L10O051
18982d7690K0650j8381k9435L5148K3305j7349k5054l1701N929K8074L0733K2663
18970c108n495m3138k4739L3512O153M338J4042R696M052j5937j3026m646j021
$$ y = [-118596, -104536, -119672, -108461, -113091, -116478, -105862, -64987, -39954, -29486, -20664, -31101, -26206, -27790, -3455, -13305, -34764, -26822, -28863, -48142, -63188, -54229, -71194, -45242, 10637, 26867, 18129, -1352, -32987, -46709, -47785, -23196, -18701, -14491, -39416, -64074, -79992, -77156, -50570, -44107, -60693, -73730, -68798, -89861, -103442, -135178, -83015, -41054, -42542, -50464, -37450, -22808, -22290, -22379, -35242, -56709, -29229, -33862, -85664, -125837, -100049, -77899, -46954, -26436, -56486, -41959, -44712, -41608, -57695, -53716, -78596, -38918, 1598, -56433, -54051, -53741, -47690, -27040, -45421, -74856, -39708, -16403, -33752, -58806, -90507, -84578, -56504, -25771, -3108, -8603, -51741, -76480, -42968, -36815, -32477, -18435, -8739, -4687, -20624, -33650, -38296, -39317]
18957c9317K863N546l873J3055O410J4990m0694l4990L828J0755j2423J9941L7538
18944a6371j651j9029j3673J2432K246j287L4786o081k5473j6556n2337j1305
18932a14299J8395M1070J1227j4707k2053k3856r142J0071N8887p112O861P095
18920c7563j7817m0354J5391j9226j151M782R955L498K8257K7814J0268L139k9698
18907d2705k7526J7794L8056J3476R236L85j5745n667K761k7791k766J8980M3611
18894B2099K248k1520j0282n3568k0464J9181r887r365L0147L3255K2109J0937
18882A4890l0313k9291j9758k1985J6321l6702R130q045J9679l1189R746l006
18870a10523J2871M650Q335M8462j7990k131Q699K4517K3276k5056j2147R432
$$ y = [-39317, -36454, -30908, -34781, -21726, -15316, -326, -41020, -76010, -72182, -61427, -73850, -53909, -16371, -18022, -37051, -50724, -38292, -36046, -37333, -2547, -8628, -34101, -50657, -102994, -114299, -95904, -54834, -43607, -58314, -80367, -104223, -113365, -103294, -44407, -51519, -44658, -37563, -55380, -95734, -80343, -99569, -100720, -95938, -85983, -82485, -54228, -26414, -16146, -13007, -42705, -70231, -52437, -14381, -905, 8331, 8716, -7029, -12696, -9935, -37726, -40492, -21512, 22099, 24347, 2827, -7455, -61023, -81487, -62306, -72193, -81558, -51411, -18156, 3953, 14890, -15423, -44714, -64472, -86457, -70136, -106838, -97708, -105753, -86074, -117263, -107517, -110523, -97652, -93002, -84667, -36205, -54195, -56326, -47627, -23110, 166, -24890, -37037, -27605]
18858b7605j9306P5p182n3890k775J0051J2111J6276J0761k1748J1912L4572l2856
18845f9604k497K6146O478o182j5137J323j0006K1766K8225K2043k4874l3666
18833e5985J1196J8498O988k3898Q878j2784j7556q66r204R452J8293n079k405
18820e4472J383r115m271k6520k6600M238O29J3654j8066J9150M1867j8543n733
18807h2399L4922n475j0200n296N2400P810m0295k8138m0564N243K7713M3480
18795d0799L3970p272k7592J0762J7365o838m0405r277O6774M2354J7167N042
18783F1251l1361j5506j2941j7119j6015J0540L6272j5336j9190R417j8089L3272
18771E195K3251N3761L2740K3077L2127m749p6510n1392M351K8607n254m226k8390
$$ y = [-27605, -46911, -46836, -54018, -107908, -110683, -100632, -88521, -72245, -61484, -83232, -71320, -36748, -69604, -72101, -45955, -39477, -45659, -60796, -59473, -69479, -47713, -19488, 2555, -22319, -55985, -44789, -26291, -19303, -43201, -34323, -47107, -64663, -65529, -74733, -65281, -46988, -52067, -54472, -53089, -62204, -66475, -92995, -119595, -115357, -114728, -101074, -119140, -99990, -58123, -76666, -82399, -47477, -52952, -63152, -68448, -16048, -8238, -48533, -76671, -117235, -111992, -84279, -40799, -6829, -14101, -41693, -30931, -13566, -20404, -60809, -70086, -3312, 39042, 56209, 61251, 29890, 14384, 1443, -15676, -31691, -21151, 15121, -215, -19405, -9988, -28077, 5195, 28446, 82207, 114947, 138024, 170151, 165402, 88892, 37500, 41851, 70458, 65204, 60978, 32588]
18758C2588m3468m237r890k925o145j697l839m5957j0908Q639J1331N1766L0995
18745F253j6536O393K1061m6012j7037P347k9845j9212J3311M2425q826M991o868
18732d2555k6862q133L6626j0674K5694l1762j8455j161j2899J9819N6500j5766
18720b9628P745R366j2706j4199N514K9975m629k2435k3674K5140L3932P247l9770
18707b8122m8026k3777q163N668n30M3969K5597k0582O90K5719k3348k149M3174
18694i880j2011n0358J3397M3686L4355j0819m863n3609n713l953k528J2171L6055
18681a4070k0331j2247O343R970K4009K4540M907J109k7577n9643k3869q833R027
18668h6665M6037K2541j8656j6994l3757j6510k328K9883L3726K840j1956J268
$$ y = [32588, -10880, -15117, -25007, -27932, -34077, -35774, -39613, -85570, -96478, -87839, -76508, -24742, 6253, -10283, -3890, 17171, -28841, -45878, -38531, -68376, -87588, -74277, -31852, -40678, -35687, -42555, -69417, -77550, -40924, -51598, -25904, -57666, -76121, -77282, -90181, -70362, -13862, -29628, -21883, -12517, -25223, -39422, -33908, -3933, -8562, -30997, -54671, -29531, 4401, 11648, -28122, -76148, -99925, -108088, -102420, -102950, -58981, -33384, -53966, -53276, -27557, -50905, -53054, -9880, -21891, -72249, -58852, -15166, 19189, 8370, 3507, -50102, -55815, -59768, -62296, -50125, -14070, -34401, -46648, -40305, -30335, -6326, 18214, 23121, 24230, -3347, -62990, -86859, -95692, -86665, -40628, -18087, -36743, -53737, -87494, -104004, -106332, -76449, -42723, -39883, -51839, -50571]
18656e0571Q410k3686m0584p233k5400J4251L6241O211M8063j1562l3061m808
18644h3729L4047J5479j2102r703k0635J203j2795p400J9734K4014Q947N124J7093
18631b0723J4842j1320K0432k6003o7951k1162O747J1063L3036j1306K7256J8685
18619b6404R724J4144l5185j5271R551j9509j94M8898K3720k9781n2163l6729
18607a09199K3274J9161j0440J2799p834j3442P448J5757R132j613l791R772K4700
18594b4276n490j3392q663l070M751J2098K2463r974j2094q773Q365K008J7108
18581a8939q28L41j6403j4968P170J2715k639K2180k532m1990n535j5883J6926
18568f0385M6527J8557k8764J9141J2145K7675J5649n0627R374p385k9806J1109
$$ y = [-50571, -42161, -65847, -106431, -113664, -139064, -124813, -88572, -82361, -34298, -45860, -78921, -83729, -49682, -34203, -46305, -56008, -76643, -75440, -88235, -95635, -75901, -51887, -42940, -37816, -20723, -5881, -17201, 3231, -22772, -90723, -111885, -105138, -94075, -61039, -72345, -45089, -26404, -16680, -2536, -37721, -52992, -43441, -62950, -63144, -14246, 9474, -20307, -72470, -109199, -85925, -66764, -77204, -64405, -72239, -85681, -78233, -62476, -53344, -54957, -58748, -48976, -24276, -29766, -43158, -51821, -54891, -50140, -38042, -15579, -25553, -37647, -46420, -38055, -36047, -18939, -19767, -19426, -35829, -50797, -43627, -30912, -33551, -11371, -13903, -55893, -61428, -77311, -60385, -13858, 4699, -24065, -4924, 7221, 34896, 50545, -82, 9292, 1907, -27899, -16790]
18556a6790j7674l7120O366k6941J8812L118M6013j0891k6897M167L2457J0139
18544a5241P81n376o180k1283J1114m8920n259M0621N215N504J0089k0047K9526
18531a9456R200j4486j9029j5987M649k0900k8163j6120Q463K6332K1408O7051
18519B962J3311j7250m4144K2640J0379m0541k5283K8714J103j0959J7978K1306
18507a9784k85O846J7458j3099N523L3894J1631K4956k5451o0628k2630m0880
18495h2449J4118K3733k75m451J070j2888J339J3853K9183J923j3179o552r3K3944
18481a0724p924m6640l287K9826m634k9756j4152M020K5304Q118o845j3742K325
18468f8111J230K9737j3372j4393l7606j6860L9084J3925J5793k7797j477j7260
$$ y = [-16790, -34464, -71584, -65218, -92159, -73347, -70229, -24216, -35107, -62004, -57837, -25380, -15241, -14460, -19836, -26016, -47299, -36185, -85105, -90364, -49743, -44528, -39024, -28935, -48982, -19456, -10256, -24742, -43771, -59758, -55109, -76009, -104172, -120292, -111829, -85497, -64089, 2962, 16273, -977, -45121, -22481, -12102, -52643, -77926, -49212, -48109, -59068, -41090, -19784, -20069, -13223, 4235, -8864, -3341, 30553, 42184, 67140, 41689, -18939, -41569, -82449, -68331, -44598, -44873, -49324, -48254, -61142, -59803, -45950, -16767, -14844, -28023, -34575, -34668, -10724, -18648, -65288, -68575, -38749, -43383, -73139, -87291, -83271, -57967, -49849, -56694, -70436, -68111, -66881, -37144, -50516, -64909, -102515, -119375, -80291, -66366, -50573, -78370, -79847, -97107]
18456i7107r284n585K5184N875J435J6737N8113j7479m6757o819k4836l2778L0276
18443a03025L4146L5738l7011L4495N928j9246L4417L616l5624P57m344m769j4274
18430f9196o34k8021n370K9921L2780J4188N131N623j0935n171q882Q944K4302
18417g320L1543j2349j1954p264j4044l247k2624o60j437J1710Q445K2446K1074
18404A4319l1322q704j0269l0417j3235O441L0858J2883O513k7759l6920N960
18392h1652K4442p763N6639L1877q728j9880k1432J1475J1757R968k4697q807
18380b6801M1926m0595l0274L1402Q992L71k7728o724K8694J5406j531K0572Q520
18367B2230k2263k46k2636k9583j1651M8631O3110K4800j4584l8475Mk1392j7474
$$ y = [-97107, -106391, -111976, -86792, -80917, -79482, -62745, -4632, -22111, -68868, -75687, -100523, -133301, -103025, -68879, -33141, -70152, -35657, -29729, -48975, -14558, -10942, -46566, -45809, -50153, -54922, -69196, -69830, -97851, -103221, -73300, -40520, -26332, -21201, -15578, -26513, -31684, -40566, -31622, -7320, 24223, 11874, -80, -7344, -21388, -24635, -47259, -47919, -49356, -37646, -29201, -6755, 14319, -17003, -25707, -35976, -66393, -79628, -73187, -42329, -29446, -22933, -50692, -87612, -81652, -57210, -64973, -8334, 23543, 14815, -5065, -26497, -15022, -3265, 6703, -17994, -26801, 15125, -25470, -55744, -24342, -15350, -14979, -42707, -49431, -20737, -5331, -6862, 13710, 22230, -33, -279, -22915, -52498, -64149, -15518, 47592, 72392, 57808, 19333, 19337, -2055, -19529]
18354a9529L6384l0363n5413j7268M8317n691k9884j9785P025N4681J6106j7931
18342c3351j5601K0012r946R08j423O730k0356J736P539M0965N0201p391j8236
18329B1787O101R084j7489k4390l4399k4367K2146k048n967L3969R848n824l9685
18316e1234J4101M5105O454l0359p241K2477k3478j1517k6433L628M3281K5278
18304A0062m362m525l3311M5971r913K0933R078j2242J305J1386o761P770k396
18291C2995m473J9611j0480k9433n7359q004L5334J4105q952p954j6902k5975
18279f7487k1829P662p172K911J3119M5571J9083k1711L0434j0243k0935n0831
18267h1428N044J5816J4735n116N208O407M8387k795j9921q705K7336J4821j058
$$ y = [-19529, 16855, -13508, -68921, -86189, -37872, -43563, -73447, -93232, -86207, -31526, -15420, -33351, -48952, -28940, -38886, -37978, -39401, -32671, -53027, -51291, -43752, -2787, 47414, 40023, 21787, 27888, 36972, 19483, -4907, -39306, -63673, -41527, -43575, -49542, -15573, -5725, -11549, -51234, -37133, 7972, 14426, -15933, -23174, -697, -24175, -35692, -62125, -58497, -15216, 10062, 5700, 1175, -32136, 13835, 3922, 24855, 33933, 21691, 22996, 34382, 27621, 35391, 32995, 28522, 48133, 37653, 8220, -49139, -57143, -21809, -7704, -16656, -24610, -41512, -67487, -89316, -81654, -88826, -85915, -72796, -27225, -8142, -29853, 581, -9662, -30597, -81428, -76384, -60568, -45833, -50949, -45741, -39334, 9053, 6258, -13663, -22368, 4968, 19789, 18731]
18254A8731J1608k1301m7726P395n13L8305L8868J8915k192k3934j8970q818j3602
18241c234k3900J6622R444m750n98J1891K640J1579n427m0723q694N2132J8771
18228C5753N677k6882l3741k7608K2141K4696K6446L1074K2436K0688j3031l7877
18216D9772J2913p556k3165l443k252P202L1696m911p588p684l93m767P9905J3031
18202A32760k6652m4871k1069K6510M9900K602R405r607K4553O0810Q757L4397
18190B47495j5171n3527k9852K6072L8924m217k7506j7051m738j3325k425N1992
18178A96671L0813L7084P47l8638j6903J2304O039J7196L4986k2212M409M075
18166B66571j3783K320l3171l7646K1249Q9960K6733J5493k7857K0540N4058m0682
$$ y = [18731, 30339, 9038, -38688, -31293, -31806, 6499, 45367, 64282, 62090, 38156, 19186, 10368, -3234, -27134, -10512, -1068, -5818, -6416, 5475, 8115, 19694, 14267, -26456, -35150, 16982, 35753, 41430, 14548, -19193, -46801, -24660, 36, 26482, 57556, 79992, 100680, 87649, 49772, 62685, 55129, 31964, 28521, 26269, 33471, 65167, 60256, 52668, 44984, 44591, 39824, 119729, 132760, 106108, 61237, 40168, 66678, 116578, 119180, 128585, 118978, 143531, 204341, 213098, 247495, 232324, 178797, 148945, 175017, 213941, 209724, 182218, 165167, 160429, 147104, 144679, 196671, 227484, 264568, 265315, 226677, 209774, 222078, 228117, 245313, 280299, 258087, 262496, 266571, 252788, 255108, 221937, 184291, 205540, 295500, 322233, 337726, 309869, 330409, 384467, 343785]
18154C43785p4490O975L6010N7479J9291J6520L2758L0431J8663L2444N3149N4684
18142F27699L2883J9364J8986O9678N9870P7718R5282P8588Q2311J31544J38817
18131A432740J60988J94577K55933K82083K99847L62766L06295K70213L02292
18122C867734K86010J50008P7486O1111J16945K13859M09608O88477J052276J683278
18112H606792K724193M410648O802293Q562435N764044k733970q023927p041769
18104A9070739m551196k862367j905124j303087r74048p41483n76609m90432l66337
18095E300056k69971k49853k32627j67949k08773k21587j41631j19607q2788r0027
18085C515243m8456m9950o8877r2903j5335K6761L6084K7143Q5810J34717Q8052
$$ y = [343785, 269295, 276270, 312280, 369759, 389050, 405570, 438328, 468759, 487422, 519866, 573015, 627699, 660582, 679946, 698932, 768610, 828480, 906198, 1001480, 1080068, 1162379, 1293923, 1432740, 1593728, 1788305, 2044238, 2326321, 2626168, 2988934, 3295229, 3565442, 3867734, 4153744, 4303752, 4381238, 4442349, 4559294, 4773153, 5182761, 5871238, 6923514, 8606792, 11330985, 15741633, 22543926, 31106361, 36870405, 34136435, 26112508, 19070739, 14519543, 11657176, 9752052, 8448965, 7474917, 6733434, 6156825, 5666393, 5300056, 5030085, 4780232, 4547605, 4379656, 4170883, 3949296, 3807665, 3688058, 3605270, 3515243, 3466787, 3416837, 3347960, 3255057, 3239722, 3266483, 3302567, 3329710, 3415520, 3550237, 3638289]
18074C638289n1830j09952j49818j85455k24245j74904j93398j70342j67026j31843
18064B079476j07583j34782j23575r3364q9215j19167o9925q1213q0000l2803
18054A147849o9668o5624n1494n9800p7328o6818j1210m7417j0040o9653k5809
18043E92988k3778j6597p4734k5717j1761l8496m8176n0689m0261l644r767K0210
18031B69578J4129k1737o977m6911j2670k4121o607j4503j6559m4938K3843L8202
18019A50729J0702k668j0947l8675J6448M69K5963M621m0267j9492K09k8012j145
18006F7935J7486k1351L9k4972o0562J8789Q972m351l9978n889J1279M729J122
17993b6752k7690k8936N0088N1847J2412k1707K3598j1922k2269l659M344J9382
$$ y = [3638289, 3586459, 3476507, 3326689, 3141234, 2916989, 2742085, 2548687, 2378345, 2211319, 2079476, 1971893, 1837111, 1713536, 1620172, 1530957, 1411790, 1341865, 1260652, 1180652, 1147849, 1078181, 1012557, 961063, 901263, 823935, 757117, 745907, 698490, 688450, 618797, 592988, 569210, 552613, 477879, 452162, 440401, 401905, 353729, 303040, 262779, 259135, 249368, 269578, 283707, 261970, 254993, 208082, 195412, 171291, 164684, 150181, 133622, 88684, 112527, 150729, 161431, 158763, 147816, 109141, 125589, 126058, 152021, 156642, 116375, 96883, 97092, 69080, 67935, 85421, 64070, 64109, 39137, -21425, -2636, 6336, 1985, -37993, -43882, -32603, -27874, -26752, -54442, -83378, -33290, 18557, 30969, 9262, 32860, 20938, -1331, -4990, -646, 18736]
17981A8736P542l1899o4232K3134L6545K2566k7435p289l1750j4311m935K5484
17969d7844j107M695J8866J6160O617K0316k0m2285P236L1099J0533q4247r5273
17956a55254j6224M2414Q895L6285N6664p155L491J1942L111K5897L8480Q41n2604
17943c217m704k9439M3596N7808K3515l0411k479l6489Q07j753R01K2277K9649
17930G0061n475j8873l0888J8699M9237q624P817r821k1868j1821L41J3962j5871
17917C6876k8264N0528k096l2540O43K2874l8140j3712J6245n219j1579K2282
17905A7898J7498j954N916J6839L8176m2450m8900L609J9114j8469J072j771j033
17892E545j7766N921L0662K7992r348l5624l0417j6392j9101L9525J6078j6915
$$ y = [18736, 26278, -5621, -69853, -46719, -10174, 12392, -15043, -22332, -54082, -68393, -73328, -47844, -48951, -44256, -25390, -9230, -2613, 17703, 17683, -24602, -17366, 13733, 24266, -59981, -155254, -171478, -129064, -120169, -83884, -27220, -34375, -30884, -18942, -15831, 10066, 48546, 49387, -3217, -7921, -37360, 6236, 64044, 87559, 57148, 54669, 18180, 18987, 17234, 18135, 40412, 70061, 64586, 45713, 14825, 33524, 82761, 74137, 81954, 72133, 50265, 38444, 38785, 52747, 36876, 8612, 59140, 57044, 24504, 25147, 48021, 9881, -3831, 12414, 7195, -4384, 17898, 35396, 33442, 39358, 56197, 94373, 51923, 3023, 6632, 25746, 7277, 8349, 6578, 5545, -12221, -6300, 24362, 52354, 43006, 7382, -23035, -39427, -58528, -19003, -2925, -19840]
17880a9840J5436j1256j4746j718K077L117J9057m082j5723o966n894P10l897
17867d3725J7555N915L7339K4845k1409m3487J1510j2744j1200o936Q673K1850
17855a1814M1974J0391L1423r427k3541n2186k9188k1050K1300j4673J8116M6289
17843G614j6522O830r509k1036m8227n606J4024K3919L4582p925j1105k4903L3824
17830b4040K8882O895J804k0819j7138J6986L289K9523J0277L1926j5759l2509
17818A9317o1256L6722J0592k3171r196N0673K0956J6219l0839m0516j9129J301
17806b8327j1080q211j5735k1192L1061O821r448M9573J7061j9212r150K148J6172
17793D81m0505k3857j6447L1124M5174Q998n513m562j6547M957r218k5653J8416
$$ y = [-19840, -4404, -15660, -30406, -32124, -30047, -26930, -7873, -11955, -27678, -34644, -40538, -39828, -43725, -26170, -20255, 17084, 41929, 20520, -22967, -11457, -24201, -35401, -42337, -33664, -11814, 30160, 40551, 71974, 62547, 39006, -13180, -42368, -63418, -42118, -56791, -38675, 7614, -8908, -2078, -11587, -32623, -80850, -86456, -72432, -48513, -13931, -21856, -32961, -57864, -24040, 4842, 11737, 13541, -7278, -24416, -7430, -4141, 25382, 35659, 67585, 51826, 19317, -41939, -5217, 5375, -17796, -26992, 23681, 44637, 60856, 30017, -10499, -29628, -28327, -39407, -47618, -63353, -84545, -53484, -46663, -56111, -6538, 10523, -8689, -17839, -15691, 481, -40024, -63881, -80328, -49204, -4030, 4968, -545, -5107, -21654, -16697, -25915, -51568, -33152]
17780c3152L1756K8268n629m5047k6362J1582j0371K6401L3490Q066o6225m9154
17768i6377l614L5766J6276N2828Q067k7737j4579N588J1701k6463m2559K4402
17756e6701L4419K9819L806k7579p165k523j1887o260L334r53m1991m759k0000
17743a08440K8773n741O835p166N647K5461j2711L1221J4018k5040J2262j2278
17731d7159O091q267j7081r731M943K0956K0582q107p06j2236L7411K1337l9669
17718c1636j9541J6911R299k1305K922m0232l4511j1274M2830L4595J7521K9488
17706d933L901k771p57j553l5953m5965P469P948j0579j8768J7784k0555J1084
17693i3648K7990J0421J431J7117j684m17R750n391j7720m6644M1701L9396J9076
$$ y = [-33152, -1396, 26872, 21243, -23804, -50166, -38584, -48955, -22554, 10936, 19002, -47223, -96377, -99991, -64225, -47949, 4879, 12946, -14791, -29370, -23782, -12081, -38544, -81103, -56701, -22282, 7537, 11343, -16236, -23401, -25924, -37811, -44071, -40737, -41690, -83681, -88440, -108440, -79667, -85408, -78573, -85739, -80092, -54631, -67342, -36121, -22103, -47143, -34881, -47159, -41068, -49335, -66416, -76147, -71204, -50248, -29666, -37773, -38479, -50715, -13304, 8033, -31636, -51177, -34266, -24967, -46272, -43350, -83582, -118093, -129367, -86537, -51942, -34421, -4933, -1032, -3803, -4560, -6113, -42066, -88031, -80562, -72614, -83193, -101961, -84177, -104732, -93648, -65658, -55237, -53806, -36689, -38373, -38790, -29040, -34431, -52151, -98795, -57094, -17698, 1378]
17680A378q018j8603j6937J9863K5345j2859j9987k820l5009k8776j8797r32K3731
17667i2421K0685N523K1168j4438L6615j4120q291K3533J266K1684p119k910m301
17654a3126k1032k0875K759J2185k2199k4010k3023Q771j3797j2082L0023L550
17642i2856J729P1063K7088l0116K0752J4150N022l908k5150k7835J7347Q870
17630a3844k3313L2362Q798L073j4628j2311j305P718k578O740j5360j2683j1989
17617d9320j6779J8406j0164L101M2780L6557j6168J9150j68p156j3082m058M3062
17604D6161J4827p7870p8266N0262K1697K4859M4425L6155k6904j6343l2461J188
17592G730J4760J4972J4354J103j6304Nk392l333l5587k7690M401J7055j9670
$$ y = [1378, -6640, -25243, -42180, -22317, 3028, -9831, -29818, -32638, -67647, -96423, -115220, -116152, -92421, -71736, -66213, -45045, -59483, -22868, -36988, -45279, -21746, -20480, 1204, -5915, -8825, -13126, -34158, -55033, -52274, -40089, -62288, -86298, -109321, -100550, -114347, -126429, -96406, -92856, -91127, -20064, 7024, -23092, -2340, 11810, 16832, 12924, -12226, -40061, -22714, -13844, -37157, -4795, 4003, 7076, -7552, -19863, -21168, -13450, -16028, -9288, -24648, -37331, -49320, -66099, -47693, -57857, -54756, -11976, 24581, 8413, 27563, 27395, 20239, 7157, 3099, 46161, 60988, -16882, -95148, -44886, -23189, 1670, 46095, 82250, 55346, 39003, 6542, 7730, 22490, 37462, 51816, 52919, 36615, 36620, 34228, 30895, -4692, -32382, -27981, -10926, -30596]
17579c0596k935N354R272j9864j604K1917L1931o487q864O636M6249k2757l5893
17566g641N401M1961J9336j5768l2282j0246m335m952M2243J3190K1853j7534
17554E1226K2926K7821j2147P972k3880J848k2369l564l3629j6993O077K9175
17542C4463J7312O443j7624p733J4354K0080K5563L1869K4664L2999m636j3087
17530A64667k7308K4265N2251L9518P1760O2202Q768k2310l1725P443K856k9854
17518C22533k5289n047K703J7731J4144l2631l5486p553J7052K8950L7141M595
17506C38843k1392p390k768K5082L367j5379K215k163k1015L6341O3945j8294
17494C81392l1835j4997J1107j0363j2727n633J0216k3560l1538P971L490J5709
$$ y = [-30596, -33531, -28177, -18905, -38769, -40373, -18456, 13475, 6988, -1876, 4760, 51009, 28252, -7641, -2240, 39721, 59057, 43289, 11007, 761, -3574, -8526, 33717, 46907, 68760, 51226, 74152, 101973, 89826, 97798, 73918, 75766, 53397, 49833, 16204, -789, 5288, 34463, 51775, 58218, 40594, 32861, 47215, 67295, 92858, 124727, 149391, 182390, 177754, 164667, 137359, 161624, 213875, 253393, 325153, 387355, 396123, 373813, 342088, 349531, 352387, 322533, 297244, 292197, 294900, 312631, 326775, 294144, 258658, 251105, 268157, 297107, 334248, 338843, 317451, 310061, 307293, 332375, 335742, 320363, 322578, 320415, 299400, 335741, 399686, 381392, 349557, 334560, 345667, 335304, 322577, 316944, 327160, 303600, 272062, 280033, 283523, 299232]
17482B99232P678l7251n0110l6728j7722j4826K8271J8051k2379l093K9775l4838
17470A66060n1160j6735k8669j9104J5991J3104J4932J1972j8696L778O152J532
17458I9157k3583o454M9488L196M552j5097r520j8331j2253J9884L0568j5684
17446A05923j9679j3847J7704P3517L7651L3709l1540m5271l8273k2888R004k4318
17434H1692p80l9993k8232K2287j8782l3764j5836R870J3687J2222R739k2798
17422a0688j0567q799J3588J7045j5598n372K447k4199o42J4912L9483L0566j2312
17409B9864N85k8381j5512K1137k562J2245l39q572j0831N662J803p23r797J2043
17395F622J0800j1176M6430K0863L83j4273m9402k0510N745p302j1468p972P555
$$ y = [299232, 306910, 269659, 219549, 182821, 165099, 150273, 178544, 196595, 174216, 171123, 200898, 166060, 114900, 98165, 69496, 50392, 66383, 79487, 94419, 106391, 87695, 91473, 97625, 99157, 75574, 69120, 118608, 121804, 126356, 111259, 101739, 83408, 71155, 91039, 121607, 105923, 86244, 72397, 90101, 163618, 201269, 234978, 203438, 158167, 119894, 97006, 106010, 81692, 80912, 40919, 12687, 34974, 16192, -17572, -33408, -23538, -9851, 2371, 12110, -10688, -21255, -30054, -16466, 579, -15019, -20391, -17944, -42143, -42785, -27873, 11610, 42176, 29864, 30449, 2068, -13444, 7693, 5131, 17376, 17037, 8465, -2366, 3296, 5099, 4376, -5421, 6622, 17422, 6246, 52676, 73539, 73922, 59649, 10247, -10263, -4518, -11820, -23288, -31260, -23705]
17382b3705L961p908M006k4582m3387J1957L2741J8661N2746L025k9781k5740
17370b8006K5336J5791k6251K342k011K3352L7690j8925j2631r635k7481j9278
17358c9707j8020N914K6723J0877m252K4408K2141j5735l2657m4431l7670M6664
17346e5745K6520J4854j905J9605l0136l3300K2238R107L318j9988j4646N63o15
17333f0130J7589M6979M784k9625j9968k1171J822P542N1154J8910l9328r199
17321c0641J4546L751j5584k134r268K0482K6318Q877k0875L1006J0214l2379
17309D313k4493K3264o25l8284l537K1016J6970L336K344p508N271m3317K057
17296c9193K9290j9958Q894m457K0220J1635j20M4311J2813j9449K4865J8326
$$ y = [-23705, -19744, -27652, -23646, -48228, -91615, -79658, -46917, -28256, 24490, 27515, -2266, -28006, -2670, 13121, -13130, -10788, -12799, 10553, 48243, 29318, 16687, 7052, -20429, -39707, -57727, -51813, -25090, -14213, -18465, 5943, 28084, 12349, -20308, -64739, -102409, -55745, -29225, -14371, -16276, 3329, -26807, -60107, -37869, -28762, -25444, -45432, -60078, -59515, -60130, -42541, 4438, 9222, -20403, -40371, -61542, -59720, -52178, -1024, 17886, -21442, -30641, -16095, -12344, -27928, -30062, -39330, -18848, 7470, 16347, -4528, 26478, 36692, 4313, -20180, 3084, 2459, -35825, -39362, -18346, -1376, 1960, 4304, -3204, 2067, -41250, -39193, -9903, -29861, -20967, -25424, -5204, 6431, 6311, 50622, 63435, 43986, 68851, 87177]
17284H7177l3076l6603l366R751r895j0306O622K7143P675N658k5397m3087M163
17271a3541K2609j7620j4438J7619K3506K26J2630O770L9867m19j8735o019j0448
17258D2007N396n3343o9464k690N4188L2683j0393k4517K0153K0495J6915J4508
17246D5938k3808m1760n0349L2638N6249J4067k2397j9464N152K0452J2270j1814
17234A7174K2845k7248l5145K5053k5148j2623L7616j4464l2653k070K0565J7783
17222h315m0202p333Q527K4306p213q299J7362J8300p08p564m1846k1528K9351
17209d5162J8054K5909L6197K5458r953l3188k0354k793Q153o396k432K8226m215
17196A7504M044p751j2967j6922k267k5808n439L4751K671L4164j6778m9079j4534
$$ y = [87177, 54101, 17498, 14132, 23883, 13988, 3682, 10304, 37447, 45122, 50780, 25383, -17704, -13541, 9068, -8552, -22990, -5371, 18135, 18361, 30991, 37761, 77628, 77209, 58474, 52455, 42007, 47403, -5940, -75404, -78094, -23906, 8777, -1616, -26133, -5980, 14515, 31430, 45938, 22130, -19630, -69979, -37341, 18908, 32975, 10578, -8886, -3734, 16718, 28988, 17174, 40019, 12771, -22374, 2679, -22469, -35092, 2524, -11940, -44593, -46663, -26098, -8315, -48517, -55850, -47323, -23017, -30230, -38529, -21167, -2867, -3575, -11139, -52985, -74513, -45162, -27108, -1199, 34998, 60456, 50503, 17315, -3039, -5832, 2321, -4075, -6507, 21719, 17504, 21548, 13797, 830, -16092, -18359, -44167, -49606, -14855, -12184, 21980, 5202, -43877, -58411]
17183e8411P643M8447L6900k2208j3183j1350M5460O615j8342l916J5734q953
17171B4436L43K6296K965j6026m0297k2687J3674J6469o923n789j8038l8884J5435
17158d9026K4897k785L8973n211Q092k4640l2917k1956k687Q212J4177L737n618
17145d6752J3421j4619j5755J2611K2506q403J0688J2749k8858q506o156J5296
17133d1778P241Q423M7137j5517o942P623O996J5721r816l6824p151n232J0505
17120a9614K5640L4691k332N936j1495r664j5287m560n3890k7152L411L1912L7760
17107d644L1898O196m7411k9147K198L4115N2605j2327n47m4018j7702Q978J9262
17094e44L2213J818k0235j6372o94j7222K3763J1005l3830k8023J5701L1940R257
$$ y = [-58411, -50768, -2321, 34579, 12371, -812, -12162, 33298, 39913, 21571, 17655, 33389, 24436, 24779, 51075, 54040, 38014, -2283, -24970, -11296, 5173, -1750, -7539, -25577, -64461, -49026, -24129, -26914, 12059, 6848, 14940, -9700, -42617, -64573, -67260, -59048, -44871, -41134, -46752, -33331, -47950, -63705, -51094, -28588, -36991, -26303, -13554, -42412, -50918, -57074, -41778, -34537, -26114, 21023, 5506, -1436, 6187, 13183, 28904, 19088, -17736, -24887, -30119, -19614, 6026, 40717, 38385, 44321, 32826, 23162, 7875, 3315, -50575, -77727, -74316, -42404, -4644, 27254, 33450, -13961, -43108, -40910, -6795, 45810, 33483, 32936, -11082, -28784, -19806, -544, 31669, 33487, 13252, -3120, -3814, -21036, 2727, 13732, -20098, -48121, -32420, -480, 8777]
17081H777J5589n309k8575j3183l1054k5864J7186K8343l4965N674L1487m881
17069c6775J4923O290J2716M7559r541m2280l2638K5435J5589L6355k6711j8894
17057g972J2876m991J6098r015r135m1989M046J267l3232J084M5803K7856K992
17044E688o948O031k4732m3011l3705o473L2730J6070O659L2403J0520p532j2039
17031b4339l735j9886R4j5796R173J2246J7085J5932J6601k6293m3841j2410K0085
17018e5084J4270J9263K7442M0006L9166l7079q3577j2118L687J2992p006K7424
17006a0614J182K698J0604J2854l4767k1024L7956L5627j4450k0685l2871j4678
16994d8168J4218j0016J2418J8238J363J6099R041k0891j2137l1227K6192P1670
$$ y = [8777, 24366, 19057, -9518, -22701, -53755, -79619, -62433, -34090, -69055, -63381, -31894, -36775, -21852, -15562, -2846, 44713, 35172, -7108, -39746, -14311, 1278, 37633, 10922, -7972, 4904, -87, 16011, 6996, -2139, -44128, -40082, -38815, -72047, -70963, -25160, 2696, 5688, -1260, 4771, -19961, -62972, -96677, -103150, -70420, -54350, -47691, -15288, -4768, -12300, -24339, -28074, -47960, -47866, -63662, -54489, -42243, -25158, -9226, 7375, -18918, -62759, -75169, -55084, -40814, -21551, 5891, 45897, 85063, 47984, -35593, -47711, -44024, -31032, -38038, -10614, -9432, -6734, 3870, 16724, -18043, -39067, -1111, 34516, 20066, -619, -33490, -48168, -33950, -43966, -31548, -13310, -11947, 4152, 13193, -7698, -19835, -51062, -24870, 46800]
16982D6800j0533j5863l2680k3137Q885K609o577L7772K7133k7888M801J3076
16970B4398K8748L4655k9327m6996j4824l545n070q149Q36k4956r815O391J9351
16957b8303r283j7790K6121J7200o576m0873j4301R421O495j136J2428J9345L1304
16944D052O304N439l8255K7440j0045R052L949J6550l0974l6691P595K7999L5001
16931B7416q364o7840j4966K1129J5516m919k1544j710M4044K1117m4122M829
16919b9414K497j154K1936J9266L8399j3330k0315k5591J357n624J103L571j8803
16906b6102J4170M327m913J8262K9108j8199k9586j3472l8654K547K2630J1723
16894b8159J2590k3747o553N7071K9385m4723l7457J7235n766J5075Q406j8579
$$ y = [46800, 36267, 20404, -12276, -35413, -26528, -23919, -30496, 7276, 34409, 6521, 11322, 24398, 53146, 87801, 58474, 11478, -3346, -6891, -11961, -20110, -19274, -44230, -54045, -47654, -28303, -37586, -55376, -29255, -12055, -18631, -59504, -73805, -64384, -57889, -59025, -46597, -27252, 4052, 10356, 15795, -22460, 4980, -5065, 3987, 7936, 24486, -6488, -43179, -35584, -7585, 27416, 19052, -48788, -63754, -42625, -27109, -32028, -53572, -55282, -11238, 9879, -34243, -29414, -26917, -28071, -6135, 13131, 51530, 38200, 17885, -7706, -6349, -11973, -10870, -7299, -26102, -11932, -7605, -12518, 5744, 34852, 16653, -12933, -26405, -65059, -62512, -39882, -28159, -15569, -39316, -45869, 11202, 40587, -4136, -41593, -24358, -30124, -15049, -6643, -25222]
16882b5222j6578K0969K7504p080k679N1072J6947j4596j7709j8488k1327l3391
16870d0578M5264L2363J9693Q790k0420q315J3102J3084k1046j4020M324k733
16858B9508j8184R814k3991K8592M527k1729J1489P815k6248l5905J9433L5925
16846B1046m897r243R889k380l3818r322k2711J047N961r610k8465K2942L1726
16833b7835L7221K3266N608L0154m9644j0168K7420k5050l3231k7035L0554K7619
16821H879K020k864J0113J532m208j5613J0026K2660k5411K7929J6320j6074k1559
16808A3750j6105J6747M3307J4597j2814m0591l639J3526L3744j7929J911l4217
16796A2287o4483k7015J1415L62k3149K6828N7863J2088K3212j7661k7096j5R76
$$ y = [-25222, -41800, -20831, 6673, -407, -3086, 47986, 64933, 50337, 32628, 14140, -7187, -40578, 4686, 37049, 56742, 65532, 45112, 36797, 49899, 62983, 41937, 27917, 32241, 29508, 11324, 21138, -2853, 25739, 30266, 8537, 20026, 27841, 1593, -34312, -14879, 21046, 16149, 6906, 16795, 14415, -19403, -28725, -51436, -50389, -44428, -54038, -82503, -59561, -27835, 9386, 32652, 38260, 68414, 18770, 8602, 36022, 10972, -22259, -49294, -18740, 8879, 10899, 8035, 18148, 19680, 15472, -141, 9885, 32545, 7134, 35063, 51383, 35309, 13750, -2355, 14392, 57699, 72296, 59482, 18891, 15252, 28778, 62522, 44593, 46504, 12287, -52196, -79211, -67796, -67434, -90583, -63755, -5892, 6196, 29408, 11747, -15349, -15364, -14388]
16783a4388J8282L4332M037l98j8949r597l0160O565K0531j6915L040K3476j4641
16770E215j020j6218L0088M4479M745J1420k071o219n0097l1485J1110q687r991
16757a8731K5016K585J676j1359j8402j6925P369K8865M5451j6638m0786j5302
16745b7181M16N2376J3465j5134j0528j3390m946L71L2023j7844n935R366R145
16732B2204N753l5597J5084K8370K3007o363l393J6672k0536j0997O540l5282
16720E462n502k3466j4985J8523L5732q67j9173R532m225m635O46j8660j5559
16707c7177N9643K5486K5K3995M197k6004j2372J1690J5567N211m2693j205K5280
16694E1643M4848m4810o9083m913j5395K9777J0293J9383M9684R977m070j8496
$$ y = [-14388, 3894, 38226, 42263, 41865, 22916, 13319, -16841, -10276, 10255, -6660, -3620, 19856, 5215, 4195, -12023, 18065, 62544, 67289, 78709, 76638, 70419, 20322, -11163, -53, -8740, -18731, 6285, 8870, 10546, -813, -19215, -36140, -28771, 94, 45545, 28907, -11879, -27181, -26765, 25611, 39076, 23942, 13414, 24, -4922, -4551, 27472, 9628, 3693, 13059, 22204, 27957, -7640, 7444, 35814, 58821, 52458, 49065, 65737, 45201, 34204, 40744, 5462, -40, -23506, -38491, -19968, 15764, 14897, -4276, 5256, 1031, -3604, -2958, -21618, -37177, 22466, 47952, 47977, 71972, 76169, 50165, 37793, 49483, 65050, 70261, 27568, 26363, 51643, 96491, 51681, -17402, -22315, -37710, -7933, 2360, 21743, 71427, 81404, 77334, 58838]
16682E8838m591J6143m296M075L7308j9553m3684j5936k0856J2350L0298J2723
16670F2819k2402k6557l254K2445j016J4707N551j3086n709P511J0347L5496J1045
16657I7897Q353o933l5008l6151k0769J9884K5888J4772Q393j1302j3664Q812
16645F0172L641n590o729m457J9333m809O203K5732j2731o3238k1212j0849j4564
16632b9098K7816K9930j9693k4656q605K2057L2935L9842j6218o138N841j0589
16620D3424j3137o288J3480k075Q29L005K1203J1739j8220N968j9014K9108j4899
16607E5123l6834J5186L6207K2512j9168j3710J3484j9548K32L3075j2445j7246
16595E6868j7954j5945P106J8939P123j9318O880o992k151J2493P069J0428J8523
$$ y = [58838, 54247, 70390, 66094, 70169, 107477, 87924, 44240, 28304, 7448, 19798, 50096, 62819, 40417, 13860, 10606, 33051, 32035, 46742, 52293, 39207, 33498, 41009, 51356, 86852, 97897, 106250, 99317, 64309, 28158, 7389, 27273, 53161, 67933, 76326, 65024, 51360, 60172, 63813, 58223, 51494, 47037, 66370, 61561, 67764, 93496, 80765, 17527, -3685, -14534, -29098, -1282, 28648, 8955, -15701, -24306, -2249, 30686, 70528, 54310, 48172, 54013, 43424, 30287, 23999, 37479, 35404, 36233, 39238, 60441, 72180, 53960, 59928, 40914, 70022, 55123, 18289, 33475, 69682, 92194, 73026, 59316, 72800, 53252, 53484, 86559, 74114, 56868, 38914, 22969, 30075, 49014, 56137, 36819, 43699, 36707, 34556, 47049, 54118, 64546, 83069]
16582H3069o81l0044k4244R956K9434j6436m0818n9094l6460J1507N0272L9164
16570A5625M442N374L1660k3629o2775k1395L109K5455K3411p414J4872J7651
16558B6386k9331N209j3130J7643q87J5575j5672n291J1281J8120L8806j7576
16546E1133o294m198P864m1799k6824N0283J3036l2820j7677j948k8944j0443
16534d8631o795K139q681J0540L0364J5512J9043j7705k1420K0176M8138K2029
16522F4709k2285j1039k2631K2299N668n857M698m1194P252J3849n8903l2532
16510g5966K101N2533J1639k0607j1264l523K5409k1216L5361M0650J1599L524
16498E0240k4615j9230k1490K3751J169K8143j6903l453k5187k1140k7732J8715
$$ y = [83069, 82388, 52344, 28100, 38056, 67490, 51054, 10236, -48858, -85318, -73811, -23539, 15625, 20067, 25441, 57101, 33472, -29303, -50698, -47589, -22134, 1277, -6137, 8735, 26386, -2945, 2264, -10866, 6777, 5890, 21465, 5793, 502, 11783, 29903, 68709, 51133, 44839, 40641, 48505, 6706, -20118, 30165, 43201, 10381, -7296, -9244, -38188, -48631, -55426, -53287, -61968, -51428, -21064, -5552, 13491, -4214, -25634, -5458, 42680, 64709, 42424, 31385, 8754, 31053, 36721, 30864, 35562, -5632, 1620, 15469, -43434, -75966, -73865, -21332, -9693, -30300, -41564, -45087, -19678, -40894, -5533, 35117, 46716, 50240, 25625, 6395, -15095, 8656, 9825, 37968, 21065, 17612, -7575, -28715, -56447, -37732]
16486c7732O8284K2926j8858j6162j1431l6639k4373K1959N0150O992l0231O950
16474A835k3038L4673J9325j2296R498j9866j0532K2169R860K88J4081j3133q32
16461C2032R162j3219k9569j1950J0638K4434K4323l3380j1666J8287J4368O495
16449C9955L212J903j8425o188l2561k6834L0582K3698K4524j8477j8029L5342
16437C8702l226k4600J2032m101k2854k5234l6572K3838N8419K4193k6228N080
16425A9449q629n752P165K1500l846L876j3527k2762J1998k7495J265Q781j0810
16412a8787L1309O2527J5179k4749o3612o4404k6756J250K2884M2051L1223K0590
16400B8705J8242q790l4924J1292J1595l4200l2366L713K0133L772J178n998J6404
$$ y = [-37732, 30552, 53478, 34620, 18458, 7027, -29612, -53985, -32026, 18124, 25116, -5115, 1835, -21203, 13470, 32795, 20499, 29997, 10131, -401, 21768, 31628, 31916, 45997, 32864, 32032, 41194, 27975, -1594, -13544, -2906, 21528, 45851, 12471, 805, 19092, 33460, 39955, 43167, 45070, 26645, 20457, -12104, -38938, -8356, 15342, 39866, 21389, 3360, 38702, 35476, 10876, 22908, 18807, -4047, -29281, -65853, -42015, 16404, 40597, 14369, 19449, 10820, 5068, 12233, 33733, 29887, 33763, 20236, -2526, 9472, -18023, -16758, -7977, -18787, 12522, 75049, 90228, 65479, 1867, -62537, -89293, -88043, -65159, -23108, 8115, 28705, 46947, 38157, 3233, 14525, 26120, -8080, -40446, -36733, -16600, -12828, -11650, -17648, -1244]
16387a244j4016M812L546j1838k0740J3814J4298j1999k61O668J077L486l629
16374a6026q599L2052j3763m7516k3688K0463L7133K327j8264j6837K7962M3965
16362A9209l037p044j3498N451K6620Q32m974k3762k8134j3606r430M962r325
16349e5736J4496j1805k1204J9897K0635L7066J6188k778K5447j7129K3418L0058
16337G8553p798m49o772l2205j1743k9385J4673L6527k5383o714k3696n232L5946
16324A6322L1343k8278j1760K1991M2390k7445l6572j2253j3700j510r05j0637
16312c1014Q230L7539R21m2534l2089k3009L3152O8060N6717n605l0705j6558
16300B3105n0145M262k5322j6498M1950K6939j3289l394L3539P860J8427Q344
$$ y = [-1244, -15260, -10448, -6902, -18740, -39480, -25666, -11368, -23367, -23628, -16960, -15883, -12397, -16026, -24625, 7427, -6336, -53852, -77540, -57077, -19944, -17617, -35881, -52718, -24756, 19209, 16172, 9128, -4370, 1081, 27701, 28533, 23559, -203, -28337, -41943, -51373, -46411, -55736, -41240, -53045, -74249, -54352, -33717, 3349, 19537, 16759, 42206, 25077, 48495, 78553, 70755, 70306, 63534, 31329, 19586, -9799, 4874, 41401, 16018, 9304, -14392, -19624, 16322, 47665, 19387, 7627, 29618, 72008, 44563, 7991, -4262, -17962, -19472, -20377, -31014, -22784, 14755, 15676, -26858, -58947, -81956, -48804, 19256, 75973, 70368, 39663, 23105, -27040, -22778, -48100, -64598, -22648, 4291, -8998, -12392, 21147, 29007, 47434, 55778]
16288E5778j7274J6253J0021O23k5217m7480n3845M4309L7184K5051K1968k1778
16276D5593l8879j5516M4910j213n421j527j0015L758J6830L2627l2568j3506
16264B5073m7800k232p618J7141M2657J5332q072o074L355L8504N6024k3882m7421
16251E4987L755K4296K6197j4257k0061j8862j0328J9106K5998j1328j2631R636
16239G6508j3548P36o399r075K891j293l6850j9516M4808j303m4094j4968L6442
16226A4339k210l0786m144N095P423J9740J2870N355K0598k3276l0207j0138o982
16213b2323M1856K7344J9066Q939k4246K2977l9671k4588J5190K51j344k6245
16201b794l6051J3442L9703L3411Q692j5440k875k7728K8331M1896j2676l3579
$$ y = [55778, 38504, 54757, 64778, 65401, 40184, -7296, -61141, -16832, 20352, 45403, 67371, 45593, 6714, -8802, 36108, 34895, 29474, 27947, 17932, 21690, 38520, 71147, 38579, 25073, -22727, -24959, -32577, -15436, 27221, 42553, 34481, 28407, 31762, 70266, 126290, 102408, 54987, 58742, 83038, 109235, 94978, 74917, 56055, 45727, 64833, 90831, 79503, 66872, 76508, 62960, 63696, 57297, 48222, 51113, 49820, 12970, -6546, 38262, 36959, -7135, -22103, 14339, 12129, -18657, -22801, -17706, -10283, 9457, 22327, 27682, 48280, 25004, -5203, -15341, -22323, 19533, 46877, 65943, 74882, 50636, 73613, 33942, 9354, 24544, 24795, 23451, -2794, -38845, -25403, 14300, 47711, 56403, 40963, 38088, 10360, 38691, 80587, 67911, 34332]
16189C4332j0138J1709j0929m4393j3310K6339J7653K4375J6350k9523j7072j5832
16177a0439q101J1989O6655J5561p305M711k0703o6371l5954J9562K7335L0108
16165B7048o79q904K0694r357J5422M6209J6774o525k0737j2245q677k3454m9290
16152a3721l3395j6884L1751L4050r185N630q982j1277r097K2963N4660k026m1977
16139B510k0849n263J0303N256l69m93J4889j3216M9333J8435o5229j0730K5562
16126A0139k755k2155j304P256L6570O360k7557J5666o198K1821j0159j8836j5581
16113f733P547p057K1603l201J682J0780n108k6596M2907l670k8978J0157o634
16100F699M897J7941k0592K5634k4040M120N3716J0134J667j5992j3194n712k9454
$$ y = [34332, 24194, 35903, 24974, -19419, -32729, -6390, 11263, 35638, 51988, 22465, 5393, -10439, -18540, -6551, 60104, 75665, 68360, 73071, 52368, -14003, -49957, -30395, -3060, 27048, 26369, 17465, 38159, 28802, 44224, 90433, 107207, 100682, 79945, 67700, 59023, 35569, -13721, -47116, -64000, -32249, 1801, -7384, -1754, -10736, -22013, -31110, -8147, 46513, 44487, 2510, -18339, -23602, -13299, -8043, -8412, -8905, 5984, -7232, 42101, 60536, -4693, -15423, 10139, 7384, -14771, -16075, -8819, 27751, 34111, 6554, 22220, 16022, 37843, 27684, 8848, -6733, 814, -6243, 15360, 12159, 13841, 24621, 19513, -7083, 35824, 32154, 3176, 13333, 6699, 11596, 29537, 8945, 34579, 10539, 14659, 68375, 78509, 80176, 64184, 50990, 45278, 15824]
16087A5824m139K844R888J7978K3825R812p938q588N522j5839l8805O212J0405
16074B7001r038q215K9381J8900J314l5889K5056L4191r159k5014l0405P240o050
16061A9313j6857J1767r658p424K4229K8670q027k4521O299r71Q699J3326K268
16048D7113J3922j1351j2270k0424J7540J3271o940j1832J8227k1580n07J0250
16036C5419q753P337k2015j0753K4636p360M3146m2705o989J0492O09J4547k7448
16023A0163k2658J2368K391J7328Q174L527k774j7805j4711k971J9973K4877Q632
16010D6514j322m4705K211l248j0301K2979K0870l843j2773K0538K4490j7058
15998D4352k218J4267l718k6582j7557J7844J9359k4599j0922j4015J1655N6859
$$ y = [15824, 11685, 14529, 24417, 42395, 66220, 76032, 68094, 59506, 65028, 49189, 10384, 16596, 27001, 17963, 9748, 39129, 58029, 59343, 23454, 48510, 82701, 73542, 48528, 18123, 25363, 19313, 2456, 14223, 4565, -2859, 21370, 50040, 42013, 17492, 23791, 22820, 31519, 44845, 47113, 61035, 49684, 37414, 16990, 34530, 47801, 40861, 29029, 47256, 25676, 25169, 35419, 26666, 34003, 11988, 1235, 25871, 18511, 61657, 18952, 11963, 22455, 23064, 37611, 10163, -12495, -127, 2264, 19592, 27766, 31293, 28519, 10714, -3997, -6968, 13005, 37882, 46514, 45192, 487, 2698, -550, -10851, 12128, 32998, 29155, 16382, 36920, 61410, 44352, 42134, 56401, 52683, 26101, 8544, 26388, 45747, 21148, 10226, -3789, 7866, 64725]
15986F4725M1104O174j4036k407j0570q597L995M956k6104k7485j1533L1981l1337
15973B0866j1666o14j6752j8921m549K1496l0884j731N2679K3071k812l5j8632
15960A1516l8742Q102J701K870j917J3680J4373j3999o656n446k0782J2614N099
15947a7587N0844J3061J9875M4323m48j770k6792m350j1923j5435k2988Q440M3091
15934G8341j1513k9279L8384R440K364L3139l3691j1092N0030j5028m9543m756
15922E6796j270k4436L75K1371K0075J5855L0676n0280k1562n902M7741K6103
15910A15542p3126k4133j097j5437J3901R665r046K1294k980J416J506k0283J5720
15897C2942L7307j0130k4213K6984J4529k5070j1973j0697J16k8139j1464J6588
$$ y = [64725, 105829, 112003, 97967, 95560, 84990, 76393, 80388, 85344, 59240, 31755, 20222, 52203, 20866, 9200, 8586, -8166, -27087, -31636, -10140, -41024, -42755, 9924, 32995, 30183, 30148, 11516, -27226, -19124, -17423, -14553, -16470, -2790, 11583, -2416, -9072, -14518, -35300, -22686, -17587, 33257, 46318, 66193, 110516, 110068, 108298, 81506, 77156, 65233, 49798, 26810, 35250, 78341, 66828, 37549, 75933, 85373, 87737, 120876, 87185, 76093, 126123, 111095, 61552, 56796, 55526, 31090, 31465, 52836, 72911, 88766, 119442, 69162, 47600, 41698, 89439, 115542, 42416, 18283, 17186, 1749, 15650, 25315, 16269, 37563, 34583, 35999, 37505, 17222, 32942, 70249, 60119, 35906, 62890, 77419, 52349, 40376, 29679, 29795, 1656, -9808, 6780]
15885F780M8048K3807k2839l6285J8649q540n8020R114R270N296j6406q670J2806
15872a6990j465L3944K8159O689p339L61n895k2645J345j1717J6671J5497K8768
15859F5383k0667j3611J1711J7836j9074P464J4900k241p022j3479J3169L9600
15847I3969J6539M403k2397j2110n1368l2049m5302J3770J6469J8867P182R984
15835A7957L2042K1285k4141j8224l664j5252J9548M2680J7303k6147p3666N394
15823d885M1000J1907k0515l1264K0723K9421j7457l526l04J5278k0488J4724
15811C4614o111J4941R70o2818j4186M7598j941k2160K9470M6430M981j3209r184
15798D9395Q943K4674l4158j3067J8524m720J3532J0188R33L098N987j8686n797
$$ y = [6780, 54828, 78635, 55796, 19511, 38160, 29620, -28400, -19286, -10016, -4720, -21126, -29796, -16990, -18455, 15489, 43648, 50337, 42998, 43359, 37464, 14819, 16164, 4447, 21118, 36615, 65383, 44716, 31105, 42816, 60652, 41578, 49042, 63942, 61701, 54679, 41200, 54369, 93969, 110508, 114911, 92514, 80404, 29036, -3013, -48315, -34545, -18076, 791, 7973, 17957, 49999, 71284, 47143, 28919, 25255, 10003, 29551, 72231, 89534, 63387, -10279, -4885, 36115, 48022, 27507, -3757, 16966, 46387, 28930, 25404, 25100, 40378, 19890, 34614, 28503, 43444, 44414, -18404, -32590, 15008, 13067, -9093, 20377, 66807, 71788, 58579, 49395, 58338, 83012, 48854, 35787, 54311, 49591, 63123, 73311, 74244, 77342, 83329, 64643, 58846]
15785E8846J1074J3721k4015O538j9747K1532Q726Q673k84k3776J1349j2730j1915
15772D7992P026m491k676K4044k418k0939j8511p7J8858J339K8312J1612j9743
15759G0328k3478j1471N119N0002j7586j5800r201J5779L0989j7887n4810J5137
15747C7121K6214j2478j9195Q505l4079q008P522M1090J7186J3159L4779O619
15735A18435k2543n3621q4808j314N9609M0320l915j1909j2375L0148K65k9926
15723B8366q613L121J1594o435j5597K7682K5275L0556k4518p833R075J0126j56
15710H2643J7321k1292k1461j037J665k3738k4024j2416p683L8270R598l8373
15698e27J2568K820K2201R801L012J0586k996J7154k1813n672k1548j2256M4754
$$ y = [58846, 69920, 83641, 59626, 66164, 46417, 67949, 76675, 85348, 85064, 61288, 72637, 59907, 47992, 55018, 50527, 47851, 71895, 69477, 48538, 30027, 29950, 48808, 50147, 78459, 90071, 70328, 46850, 35379, 40498, 90500, 72914, 57114, 47913, 63692, 94681, 76794, 21984, 37121, 63335, 50857, 31662, 40167, 6088, -1920, 5602, 46692, 63878, 77037, 111816, 118435, 95892, 42271, -42537, -43851, 15758, 56078, 52163, 40254, 27879, 58027, 58292, 28366, 19753, 22874, 34468, 28033, 12436, 40118, 65393, 95949, 71431, 63598, 72673, 82799, 82643, 99964, 78672, 57211, 56174, 57839, 34101, 10077, -2339, -10022, 28248, 37846, -527, 12041, 14861, 37062, 46863, 49875, 60461, 57465, 74619, 52806, 47134, 25586, 13330, 58084]
15685E8084K7148k9545k8270k3329L7682L2262k2235k0439k7605j4544j08K6962
15673A6063L1811L790L655j332l912j7155n2778j0318j5875O931M8944Q797K9283
15660D7904l7208p276K9877L798j0284J8547J2865L6617q703j389Q883k7217j6081
15647E0333l3633k6024n353m649M6017J9773l2731R321J7375j6903P226K525K4895
15634E8172k3091l2192K7362N8541j695n836k4483P265J7226j1167J0287L932
15622H4321J6739R116j8930p018j5944p764j9913K916j5967J7877J7559K2099
15610H5091N708k3519L372j9498J861J165o0452n368L9299J8785j2444L202M5982
15597H3184J7837k0585L6705M1851p2069l6092k9864J5505L9409K4215j1105J9748
$$ y = [58084, 85232, 55687, 27417, 4088, 41770, 74032, 51797, 31358, 3753, -10791, -10899, 16063, 47874, 51664, 55319, 53987, 50075, 32920, -19858, -30176, -46051, -39120, 9824, 18621, 47904, 10696, 3420, 33297, 37095, 26811, 45358, 58223, 94840, 86137, 84748, 93631, 66414, 50333, 16700, -9324, -14677, -19326, 26691, 46464, 13733, 23054, 40429, 23526, 30752, 33277, 58172, 35081, 2889, 30251, 88792, 87097, 81261, 56778, 64043, 81269, 70102, 80389, 84321, 101060, 110176, 91246, 84228, 68284, 60520, 40607, 43523, 27556, 45433, 62992, 85091, 90799, 67280, 70652, 51154, 53015, 54180, -6272, -11640, 27659, 46444, 34000, 37202, 83184, 101021, 80436, 117141, 158992, 86923, 50831, 20967, 36472, 75881, 100096, 88991, 108739]
15585A08739o474k5008J0526K3891n0000n9170j1596J4704L8016q409q949k2503
15573C767L3197P994m913J4558k2237P718L8542j9533m3047L842j0394j0395J9929
15560A9028M0638J2417l8333j0728O625k3199L242J1996j2426P070N615r7m7379
15547b5531o749L647J8165L4017L7472J1419k8062J5474R467j2244m0791J8667
15535C4951M1375k112k4103K9049K5312m739n0770l2026j6937n463L8010Q995
15523D1542k335k9874J1647J8092p979l1108k447J7042J7031Q629L7K058J4565
15510E6900R349J4474n166O749l1055p784L9225L5374j0955K0363J377k8984l1359
15497F8508j5614k9522R453M9769k6785o959K3164L3351o752l3487k6190l007
$$ y = [108739, 102265, 77257, 87783, 111674, 61674, 2504, -9092, 5612, 43628, 35219, 26270, 3767, 36964, 44958, 40045, 54603, 32366, 40084, 78626, 59093, 16046, 19888, 9494, -901, 19028, 59666, 72083, 33750, 23022, 29647, 6448, 9690, 21686, 9260, 16330, 21945, 21848, -25531, -32280, -28633, -10468, 23549, 61021, 72440, 44378, 59852, 69319, 57075, 16284, 34951, 76326, 74214, 50111, 79160, 104472, 99733, 48963, 16937, 0, -5463, 32547, 41542, 39207, 9333, 20980, 39072, 31093, -15, -2462, 14580, 31611, 40240, 40277, 42335, 56900, 66249, 80723, 75557, 82306, 51251, 43467, 82692, 118066, 107111, 127474, 128851, 99867, 68508, 52894, 23372, 32825, 82594, 55809, 48850, 72014, 105365, 98613, 65126, 38936, 35929]
15485C5929k6665Q008K0789L0574q688K8916m779k0484K6431r68P197K574Q857
15472A07691M0012M4258K6759j4218n0736m1291l4455j0829J8342K549M852r456
15460H3478j4246M332M4414R510L502j5610j6309Q67J1647l1514j3984L7303J6652
15447A20042K5034P120j2573k0042o312j8624l4474l2994M3599M1661J990o638
15435A07789n770k5583m7259L066L2855Q058n422J4445K008j4475J0385K0844
15423A00941M8234M570l6968M364q855k4256K0543R925K6615n4176l986L1048
15411A17999n1482j293M3451M134k0057q03j1341K1188N141N96j3351j0603k3105
15398F0474R95J3149J4806r027M229L0417Q849K1410L701J6543L0775J7694J7694
$$ y = [35929, 9264, 17272, 38061, 68635, 59947, 88863, 84084, 63600, 90031, 89063, 96260, 98834, 107691, 147703, 191961, 218720, 204502, 153766, 112475, 78020, 67191, 85533, 88082, 92934, 83478, 69232, 73564, 117978, 127488, 130990, 115380, 99071, 99938, 111585, 80071, 66087, 103390, 120042, 145076, 152196, 139623, 119581, 113269, 94645, 60171, 27177, 70776, 112437, 114427, 107789, 102019, 76436, 29177, 32243, 65098, 73156, 67734, 82179, 84187, 69712, 80097, 100941, 149175, 153745, 116777, 121141, 112286, 88030, 108573, 118498, 145113, 90937, 86951, 117999, 66517, 65224, 108675, 112809, 92752, 91949, 80608, 101796, 106937, 107533, 94182, 83579, 60474, 61469, 74618, 89424, 80397, 84626, 115043, 123892, 145302, 149003, 165546, 196321, 214015, 231709]
15385B31709k3529m1705n371O1657K1099l3079k9572j9015j8872j6474J1419p620
15373A30647j7879r935P79R264J3341L739n384k3595M047P84m672j8253R788L8992
15359A31663j1909j1444Q306L4143o566k5332M3862r940m458p781j3387K7577
15347A54734m0341j4337j4850K5098K8889R50J43m1824j5570J1517j8911J5369
15335I0867o399q439L238J4471J0889J4769Q638k5801O8l7339o822j3168J3806
15322E8778M5790J8516J1665K0434j7953j2957j7090j1965N351j0737k940j9173
15310F7719K7445M676l577J3191p854k417j794O510L0234M14p185J6303k358k3995
15296A17312l8954l4351J956O291l577j341L3827J6297l4172k41M4562L0959k1131
$$ y = [231709, 208180, 166475, 161104, 222761, 243860, 210781, 181209, 162194, 143322, 126848, 138267, 130647, 112768, 102833, 103612, 112876, 126217, 129956, 124572, 100977, 105024, 105808, 101136, 82883, 92671, 131663, 119754, 108310, 116616, 150759, 144193, 118861, 162723, 152783, 148325, 140544, 127157, 154734, 114393, 100056, 85206, 110304, 139193, 140143, 140286, 98462, 82892, 94409, 75498, 90867, 84468, 76029, 79267, 93738, 104627, 119396, 128034, 102233, 102301, 64962, 58140, 44972, 58778, 104568, 123084, 134749, 155183, 137230, 124273, 107183, 95218, 100569, 89832, 86892, 67719, 95164, 99840, 96263, 109454, 101600, 99183, 97389, 103899, 134133, 134547, 127362, 143665, 141307, 117312, 78358, 44007, 45963, 52254, 48677, 47336, 81163, 97460, 63288, 63047, 107609, 138568, 117437]
15283A17437j5759L2057M7525J0971k6686r84k2056j1587k5343q602J9353J1076
15271A27402k6990q562J1465M408J1706o855r131J5591K8991M071l1510K4893
15259A45479R415l4050q757o79j8817o55l003M118Q39J0198R691j0291L760K5119
15245A32367P939Q442j4973k6664k2778j2479L6916J9909R670K6949r086M486
15233A60698n238j3483n142P137K6909l4651k7591J6010L5772K6703L868j4438
15221A76554m7121j4266o659J2757j2289j0329J3950J4306J8038j9699k6929K3917
15209A22230J9280l3205k5824J5041Q813k6748l3145K8937J6967k5l8195o014
15197D8112J3550L6363J6271K636r499k7352K5333J4811J107k0216K7242K7225
$$ y = [117437, 101678, 133735, 181260, 192231, 165545, 164561, 142505, 130918, 105575, 96973, 116326, 127402, 100412, 91850, 103315, 107723, 119429, 112574, 103443, 119034, 148025, 152096, 120586, 145479, 154894, 120844, 112087, 111408, 92591, 91936, 88933, 93051, 93890, 104088, 113779, 103488, 107248, 132367, 140306, 148748, 133775, 107111, 84333, 71854, 108770, 128679, 138349, 165298, 156212, 160698, 155460, 141977, 136835, 143972, 170881, 136230, 108639, 124649, 160421, 187124, 190992, 176554, 129433, 115167, 108508, 121265, 108976, 98647, 112597, 126903, 144941, 125242, 98313, 122230, 141510, 108305, 82481, 97522, 106335, 79587, 46442, 75379, 92346, 92321, 54126, 48112, 61662, 98025, 114296, 116932, 107433, 80081, 105414, 120225, 121332, 101116, 128358, 155583]
15185A55583r107J5060k1742k2576p734J687N9120K0253Q200k1417n299J3034
15173A85062p460N399J9839J6244j0540j8956Q158M4480p044n5105k992R992k7708
15160A59369j2864K8289l2456m9039j1430l603j4329j1674K7819L3425j8426O89
15148I5770K7665K6505J3306j0206q275j3278j5269M608p024m447J9414L2401
15136A61170K574j2114k2201J5019N093j4675K1053K1281R945m386l4308j7495
15124A30956O206K9145j2646K271j6090N0760J7845k3469l4746l925J4979k6094
15112A35192k4790k7778l205N2899k505k0860K3634L0108K2849j4052j5289k1647
15100A34556k5900Q170K2565Q893k2477k5946P721N4090M4463J231m3609j9516
$$ y = [155583, 146476, 161536, 139794, 117218, 109484, 111171, 170291, 190544, 198744, 177327, 172028, 185062, 177602, 183001, 202840, 219084, 208544, 189588, 197746, 242226, 235182, 180077, 177085, 187077, 159369, 146505, 174794, 142338, 93299, 81869, 78266, 63937, 52263, 80082, 113507, 95081, 95770, 123435, 149940, 163246, 153040, 144765, 131487, 116218, 120826, 113802, 109355, 128769, 161170, 163744, 151630, 129429, 144448, 149541, 134866, 155919, 177200, 187145, 182759, 148451, 130956, 137162, 166307, 153661, 155932, 139842, 190602, 208447, 184978, 150232, 146307, 161286, 135192, 110402, 82624, 79419, 132318, 129813, 108953, 132587, 162695, 185544, 171492, 156203, 134556, 108656, 116826, 139391, 148284, 125807, 99861, 107582, 161672, 206135, 207366, 163757, 144241]
15088A44241K199j0833j1568M20p084R655J4779l814K5006K808j0973k8264n786
15075A20786J0775J5346M8145J9175J5410k8259j6338k3395o750K9417k6705J5399
15063A73006L4572l5303j9789J6540J8526j0144l6571k6705J9365K4931J1780
15052A70208K0211m3965J8779M2809M164n4704l6621O2183L1102K1734M1590J7276
15040B94766m0181l6454j1131l5462l63J725k5734O975q536m406J0100K129m26
15027A53002o009P732L3657J0047J580J5131L1708J0338l4872l1465k7364k0505
15015A42980J7151J5030M486k0084l111R679n30K339K6155K1648K9757J7911o748
15002B56663K7063k3290j6587J126J6144k423j8529R743J813J8732L2499J4512
$$ y = [144241, 146440, 135607, 124039, 124459, 117375, 127030, 141809, 137995, 163001, 165809, 154836, 126572, 120786, 131561, 146907, 195052, 214227, 229637, 201378, 185040, 161645, 154895, 184312, 157607, 173006, 207578, 172275, 152486, 169026, 187552, 177408, 140837, 114132, 133497, 158428, 170208, 190419, 146454, 165233, 208042, 212206, 157502, 120881, 183064, 214166, 235900, 277490, 294766, 254585, 218131, 207000, 171538, 171175, 172900, 147166, 154141, 145605, 141199, 151299, 153428, 153002, 146993, 154725, 188382, 198429, 200009, 215140, 246848, 257186, 222314, 190849, 163485, 142980, 160131, 175161, 179647, 159563, 156452, 166131, 165601, 167940, 194095, 215743, 245500, 263411, 256663, 283726, 260436, 243849, 244975, 261119, 258696, 240167, 249910, 251723, 270455, 302954, 317466]
14990C17466j9217k1672p638K1285R988k1689J4785l288N7607J1145l4462M754
14978C29064K7042k0606l0710n25K2245l2044j4771L7939J0010R886o909J8528
14966C49149n093L0838J3519m497r407l238j195J6986o46J6969l968J575J2877
14953D13869J3737l261L7132K636K9765Q1992K0540n870K3747O1076K5711M1816
14941G42890R5590O4136J02461R4332R9220J31198J74956J46217J14454J13988
14931A879442J32118J47177J44370J56280J39693J66014K51139L23235N47909
14922C887377Q35151J103143J262866J236957J153385R55956O04753N2720m71465
14913A0620843q63814j065202j130149j094593r99567p59647o23645m54362l15087
$$ y = [317466, 298249, 276577, 268939, 290224, 300212, 278523, 293308, 290020, 347627, 358772, 324310, 329064, 356106, 335500, 304790, 304265, 326510, 294466, 279695, 317634, 327644, 337530, 330621, 349149, 344056, 374894, 388413, 383916, 374509, 371271, 370076, 387062, 386416, 403385, 399417, 400992, 413869, 427606, 424345, 461477, 464113, 493878, 575870, 596410, 590540, 614287, 675363, 701074, 742890, 838480, 902616, 1005077, 1099409, 1198629, 1329827, 1504783, 1651000, 1765454, 1879442, 2011560, 2158737, 2303107, 2459387, 2599080, 2765094, 3016233, 3339468, 3887377, 4722528, 5825671, 7088537, 8325494, 9478879, 10434835, 11039588, 11092308, 10620843, 9757029, 8691827, 7561678, 6467085, 5467518, 4707871, 4084226, 3629864, 3314777]
14904C314777k60063j92662j41694j42561j27871j14525o9704p4908n6908r2614
14894B041267j20410l1426q697l6408O375P628l5430l1671k668n438L7592J6169
14882A836883J5544m0630j00071p3514l8147j9955q8990m4628k0434o1287r3868
14871A270903j10499q3114l8587n4883o0409k4361l050p007m5281k2465m2412
14860G78835m0851j0041n4139o7347l3901J192J5765J3372m9758m8215R304j2346
14848E01870K0302K1884o0337n1573l5383l0737o223l036K8468m060l9547r0M368
14835C45906O159K4415n122K502q532m3351j9325J932K0502k4883J3374Q690K6859
14822C49126j1914o2085k9653J7M5115K4273k663o122K0849M706p284n3340k6701
$$ y = [3314777, 3054714, 2862052, 2720358, 2577797, 2449926, 2335401, 2265697, 2190789, 2133881, 2041267, 1920857, 1889431, 1880734, 1844326, 1850701, 1858329, 1822899, 1791228, 1788560, 1783122, 1820714, 1836883, 1852427, 1811797, 1711726, 1638212, 1600065, 1580110, 1491120, 1446492, 1426058, 1364771, 1270903, 1160404, 1077290, 1038703, 983820, 923411, 899050, 896000, 888993, 843712, 821247, 778835, 737984, 727943, 673804, 606457, 572556, 573748, 589513, 602885, 553127, 504912, 514216, 501870, 522172, 544056, 483719, 432146, 396763, 366026, 359803, 356767, 385235, 381175, 341628, 341538, 345906, 352065, 376480, 371358, 373860, 365328, 321977, 302652, 304584, 325086, 300203, 313577, 322267, 349126, 337212, 275127, 245474, 245491, 290606, 314879, 312216, 306094, 326943, 331649, 324365, 271025, 244324]
14809B44324j8882p730J050j073J9443Q23J7101J0821R663r31K2601J4679K568
14796C14457K994k2166n1429k1647O6088L5014K9753K9609o695m0176J0670K2915
14784C69387m8517n3069j0570P79j951J9648J6828j5097k5900R875J4256N081
14772B80750M0323o60k6938K8346N735m5131j593P5953P492J026N742j1400j7483
14759C42162j4505p0961j9325M3775j4979J1117J219K9108K0941k2337m1581J7716
14747B82350O4715J4031Q899J5680N553k2608j8598m0711Q477M0330K6664J0268
14735C95050J0620K4032J4950K8908M5637P4155L4919J9506P683K4393M7453O8034
14723G95340L6443P7551R5335J17434J65411J91649K13618J79457K00689J38554
$$ y = [244324, 225442, 217712, 218762, 217689, 237132, 237955, 255056, 265877, 275540, 274609, 297210, 311889, 314457, 317451, 295285, 243856, 222209, 288297, 323311, 353064, 382673, 375978, 335802, 346472, 369387, 320870, 267801, 257231, 258010, 256059, 275707, 292535, 277438, 251538, 261413, 275669, 280750, 321073, 320413, 293475, 321821, 327556, 282425, 280832, 356785, 364277, 365303, 371045, 359645, 342162, 327657, 256696, 237371, 281146, 266167, 277284, 278503, 307611, 328552, 306215, 264634, 282350, 347065, 361096, 369995, 385675, 391228, 368620, 350022, 309311, 317788, 358118, 384782, 395050, 405670, 429702, 444652, 473560, 519197, 593352, 628271, 647777, 655460, 679853, 727306, 795340, 831783, 909334, 1004669, 1122103, 1287514, 1479163, 1692781, 1872238, 2072927, 2211481]
14713B211481R8940M3429l7265j27866j32789j33753j73041j75217j63619j77636
14703A232664j33150q6025o2266n0361l7854r785j6237j3277l6721K4880l2311
14692G79557k3337Q848m4798J117K4725k1587j6667j8947l1702J9974j2097j271
14680F63815J0767N639L6162n480l9580l074L981n2465n0502l0451j7480r790
14668E11542J0251L0479K4627j1253k7795j6739j8410j2464J8283J9095J1372
14657E38988k5591L172j5482l1247m005J1014k0056m588J5918O694K4475P375
14645E06667R767M380k9952k2350k3372l6000K1326L2876Q957l8351m5040l5724
14633C53184k9387J5259J7168K3141M0758N807l5201J2435J8321l0678k7898J2108
$$ y = [2211481, 2310421, 2353850, 2316585, 2188719, 2055930, 1922177, 1749136, 1573919, 1410300, 1232664, 1099514, 1013489, 951223, 900862, 863008, 853223, 836986, 823709, 786988, 811868, 779557, 756220, 765068, 720270, 721387, 746112, 724525, 707858, 688911, 657209, 677183, 665086, 663815, 674582, 680221, 716383, 710903, 671323, 668249, 672230, 619765, 569263, 538812, 521332, 511542, 521793, 552272, 576899, 565646, 537851, 521112, 502702, 490238, 508521, 527616, 538988, 513397, 516569, 501087, 469840, 465835, 476849, 456793, 452205, 468123, 474817, 499292, 506667, 516434, 520814, 490862, 468512, 445140, 409140, 430466, 463342, 472299, 433948, 388908, 353184, 323797, 339056, 356224, 379365, 420123, 425930, 390729, 403164, 421485, 390807, 362909, 375017]
14621C75017l3466r874K5206j187j1382m710K0106K0472j1339k566Q947K0513
14609C95737k904j8098j647L1991L2903k1744J5652j2116m4950j2660J6925J01
14597C79190J1564J9596J8441Q754J0564m044k5216o596L6018j9147n2760l2594
14585C43770Q1N017P768O5451r676J7265L7935K874N383j1292j6825n6315k5780
14572C65656J6718M7951K7964J033N368o090J5208K3726K4362j4427n28l2894
14560D74047l4984Q740J6718j0074r515L2677J5458N3317L3251k005j2267L1j5206
14547E50188r24K441K1691K5892Q654j5058L1077J8060P943J623k2956M7772K1998
14534F98401P312L4611O0330K6853L0522M0719J3599K9927L5763L1812O7702Q3006
$$ y = [375017, 341551, 331677, 356883, 355696, 344314, 339604, 359710, 380182, 368843, 366277, 375224, 395737, 392833, 374735, 373088, 405079, 437982, 416238, 431890, 419774, 374824, 362164, 379089, 379190, 390754, 410350, 428791, 437545, 448109, 444065, 418849, 412253, 448271, 429124, 376364, 343770, 343851, 348868, 356636, 422087, 412411, 429676, 467611, 470485, 475868, 464576, 447751, 391436, 365656, 382374, 430325, 458289, 459322, 464690, 458600, 473808, 497534, 521896, 507469, 506941, 474047, 439063, 447803, 464521, 454447, 444932, 477609, 493067, 546384, 579635, 577630, 565363, 565394, 550188, 549264, 551705, 573396, 599288, 607942, 592884, 623961, 642021, 649964, 651587, 628631, 676403, 698401, 705713, 740324, 800654, 827507, 858029, 898748, 912347, 942274, 978037, 1009849, 1077551, 1160557]
14522A160557L9325K1698N4403M5053O613l2945O662j4541m1212J718J2882j2671
14510A247542m0559o8457q4189r7915m7888m7555j3562J5221k0450m4969n3384
14499G43835k0598J8679o590j457J6283J4369L558J5957m635J8640j6716k1114
14487G60211l3807n3412O266O318M27j1824m0362j928J4481R849k0615N241k9740
14474F11105L3462K9946L1872n200p228l4486k3307L2745N6582N4890J1318j3213
14462G78486j6033j6430k6053P289O090K2038J0019k1829q828l236K2508L5393
14450G89414L3029K878j2304J9861j0801j9928N5104J2008L393J7475l9612j8805
14438H31712K8549Q997K2880j0828Q245j577M2958J0817l0390k5446Q807J1627
$$ y = [1160557, 1199882, 1221580, 1275983, 1321036, 1327649, 1294704, 1301366, 1286825, 1245613, 1247331, 1260213, 1247542, 1206983, 1138526, 1054337, 956422, 908534, 860979, 847417, 862638, 842188, 797219, 743835, 723237, 741916, 735326, 733869, 750152, 764521, 768079, 784036, 779401, 798041, 781325, 760211, 726404, 672992, 679258, 685576, 686003, 674179, 633817, 631889, 646370, 656219, 635604, 640845, 611105, 644567, 674513, 706385, 701185, 693957, 659471, 636164, 668909, 725491, 780381, 791699, 778486, 762453, 746023, 719970, 727259, 733349, 755387, 765406, 743577, 734749, 731513, 754021, 789414, 822443, 825321, 813017, 832878, 822077, 802149, 857253, 869261, 872654, 890129, 850517, 831712, 860261, 869258, 892138, 881310, 889555, 887978, 930936, 941753, 911363, 885917, 894724, 906351]
14426I06351M7721L0900k660K8471L3218L4223J2313N0275K8077K9850P148k44
14414A205643J5555j5701K1836N8449J1048m5068m9303J5626R176r848K0884K4211
14402A262508k13M5460L5885J9840L8437O2449K1497K8313M9077L7658K7154K347
14390A630412K2754K7086n142k3047m3221l0306n668k4912R325o156J9636K9444
14378A600205L29l4723K658M2785N6642O2644K7987M0583K1835K8982K5342r128
14366A866141J4069N7433K181K0579P6741Q8066N4299K6595M5941O8554J00493
14355B421092J01654J17402J13522R8316J30225J45173Q3253R2529O8269O4392
14345C435827R7603J53996J11493O5633N4126Q3876Q6832J18470J09759J01350
$$ y = [906351, 954072, 984972, 982312, 1010783, 1044001, 1078224, 1090537, 1140812, 1168889, 1198739, 1205887, 1205643, 1221198, 1205497, 1227333, 1285782, 1296830, 1251762, 1202459, 1218085, 1227261, 1217413, 1238297, 1262508, 1262295, 1307755, 1343640, 1363480, 1401917, 1464366, 1485863, 1514176, 1563253, 1600911, 1628065, 1630412, 1653166, 1680252, 1675110, 1652063, 1608842, 1578536, 1572868, 1547956, 1557281, 1551125, 1570761, 1600205, 1600534, 1565811, 1568469, 1611254, 1667896, 1730540, 1758527, 1799110, 1820945, 1849927, 1875269, 1866141, 1880210, 1937643, 1939824, 1960403, 2037144, 2125210, 2179509, 2206104, 2252045, 2320599, 2421092, 2522746, 2640148, 2753670, 2851986, 2982211, 3127384, 3210637, 3303166, 3371435, 3435827, 3533430, 3687426, 3798919, 3864552, 3918678, 4002554, 4089386, 4207856, 4317615, 4418965]
14335D418965Q3335J11721Q8469L4801N4424P1513O7959J00788M9810P6175J03670
14324E261630Q9988O8472J11969J27478J30316J42750J09148J06053J47736J65754
14314F461294K20951K24273J60976J62388J67093K20142J88230J74303K15685
14305H195335K68319L36235L28154L35717M29108M50603N16285N45269N88317
14296A1993342O34953P06279P89407Q91705R82208J092966J258955J411220J646242
14287B1407277J868359K147151K467387K853641L199576L633162M051023M426294
14279D6053870M749885M947745N069125N104126N089745N129450N336644N920642
14271H7401232P089511R136438J2410615J7416802K4351674L2054391L7197421
$$ y = [4418965, 4502300, 4614021, 4702490, 4737291, 4791715, 4863228, 4931187, 5031975, 5081785, 5157960, 5261630, 5351618, 5420090, 5532059, 5659537, 5789853, 5932603, 6041751, 6147804, 6295540, 6461294, 6682245, 6906518, 7067494, 7229882, 7396975, 7617117, 7805347, 7979650, 8195335, 8463654, 8799889, 9128043, 9463760, 9892868, 10343471, 10859756, 11405025, 11993342, 12628295, 13334574, 14123981, 15015686, 15997894, 17090860, 18349815, 19761035, 21407277, 23275636, 25422787, 27890174, 30743815, 33943391, 37576553, 41627576, 46053870, 50803755, 55751500, 60820625, 65924751, 71014496, 76143946, 81480590, 87401232, 94490743, 103627181, 116037796, 133454598, 157806272, 189860663, 227058084]
14264B27058084L6988789L3677394L0528464K7226142J7834427J649136j4716691
14257C60245745k3909535k6225331k8301563l1966794l4417533l1697636k5285322
14250A58442031j8881578j4188082j0949400q655915p049211n890167n010281
14243H7817397m296940l715559l227344k818425k449784k084978j788247j458493
14235F5977627j132395q49880o08069l45542j68745j75837k57025k70923n09237
14226F1659974q69527j309839j670770j911882k202380k408775k571976k623735
14218D6091090k557094k458163k342627k238548k137587k028203j816397j719959
14210B8792512j649821j543658j441398j361578j259336j198099j139256j056763
$$ y = [227058084, 264046873, 297724267, 328252731, 355478873, 373313300, 374962436, 360245745, 336336210, 310110879, 281809316, 249842522, 215424989, 183727353, 158442031, 139560453, 125372371, 114422971, 105767056, 98717845, 92827678, 87817397, 83520457, 79804898, 76577554, 73759129, 71309345, 69224367, 67436120, 65977627, 64845232, 63995352, 63387283, 63041741, 62872996, 62697159, 62440134, 62169211, 61659974, 60790447, 59480608, 57809838, 55897956, 53695576, 51286801, 48714825, 46091090, 43533996, 41075833, 38733206, 36494658, 34357071, 32328868, 30512471, 28792512, 27142691, 25599033, 24157635, 22796057, 21536721, 20338622, 19199366, 18142603]
14202A8142603r70483r11510q67848q33678p74163p42178p23907o54613o36271
14193A1027952o01939n39854n08598m88903n09063m40865m17429m16686m03754
14184F700861l51806l96619l32104k83910k96048k66569k32915k33769k28430
14175D078691k24051k39346j97476j77022j95573j46159j50602j54585j54750
14166B439127j26769q4181j16307q6186r9770j14147j07101o0303o2922j17333
14156A464108j24060j03751q0275o2827q7127p6327p1177j10764r9993q2445n6768
14145E08594J1344M8988J2031J1350q368J3577k2295j4662k2657K5624K5747l4453
14133E54820k1447j7203m3700q7955n9154p6711r4851q4539j13106r1272k2961
$$ y = [18142603, 17172120, 16260610, 15392762, 14559084, 13784921, 13042743, 12318836, 11664223, 11027952, 10426013, 9886159, 9377561, 8888658, 8379595, 7938730, 7521301, 7104615, 6700861, 6349055, 5952436, 5620332, 5336422, 5040374, 4773805, 4540890, 4307121, 4078691, 3854640, 3615294, 3417818, 3240796, 3045223, 2899064, 2748462, 2593877, 2439127, 2312358, 2228177, 2111870, 2025684, 1925914, 1811767, 1704666, 1644363, 1581441, 1464108, 1340048, 1236297, 1156022, 1093195, 1006068, 929741, 858564, 747800, 647807, 565362, 508594, 519938, 568926, 580957, 592307, 583939, 597516, 575221, 560559, 537902, 563526, 589273, 554820, 533373, 516170, 472470, 384515, 325361, 248650, 153799, 69260, -43846, -135118, -158079]
14122a58079l147r88J1201J3655p340o425K4695k0012k4581K844J7726K6150L3721
14109i0580K1910p732o815J5586P6079N6940M0928P0516M8772N6509Q3028P3043
14097D38184J3384L0097M3259N8815L7423J1540O0632O8042N3504K5710L4306
14086H74896O508j453j1418N316r716J7092J8388J7142M4127j4565m2319j0856
14074H93142K7169j6095k6849K2634L2833j7193j586P624j3637l1474l1730L841
14062H48679j1403m5899n8891j4837r577Q031j6136l7176j5263L8139N572J821
14050F93060J8559j8669l3153K6289Q954n2235j0221q176l8346j7187j6648n0905
14038E01322j3103l0710l6626l7023j2809l9167m2232l9542j1297M3193K557k2535
$$ y = [-158079, -161226, -162214, -151013, -137358, -144698, -151123, -126428, -146440, -171021, -168177, -150451, -124301, -90580, -68670, -76402, -83217, -67631, 8448, 65388, 106316, 176832, 225604, 282113, 365141, 438184, 451568, 481665, 524924, 583739, 621162, 632702, 693334, 761376, 814880, 840590, 874896, 881404, 879951, 868533, 873849, 864133, 881225, 899613, 916755, 960882, 946317, 903998, 893142, 920311, 904216, 877367, 900001, 932834, 915641, 914055, 921679, 908042, 876568, 844838, 848679, 837276, 791377, 732486, 717649, 708072, 716103, 699967, 662791, 647528, 685667, 691239, 693060, 711619, 692950, 659797, 686086, 695040, 642805, 632584, 624408, 586062, 568875, 552227, 501322, 488219, 457509, 420883, 383860, 371051, 331884, 289652, 250110, 238813, 282006, 284563, 262028]
14026B62028j4494n3752N501k866K6008k5604m7170j2359K4492k8805K0200K5886
14014A79065O525j4669O598l555n82K172k1599M488m0831M669N865k9499j3659
14001H4988K2456l735k1830l5247p3232l6534n5597m4392J620J0194L1939n038
13989a24408k2677j9266O67q969R371N01P665R54K2649k4831l8336J3913L6356
13976a46411J9410j4837J169L5765q325j1004m035K1804j5938j2213O7808j0656
13964g7463k7110p120m319M247o577J9332K2882J0856K1255L3016J9239J1371
13952A9609R555r415L2110L8132J6601N0817K2545k2635l2843l3384k5816Q554
13940G3830J9009j2272k5263J521l0494L772K8410J9678K8339J2020J4494j569
$$ y = [262028, 247534, 193782, 199283, 196417, 222425, 196821, 149651, 137292, 161784, 132979, 153179, 179065, 185590, 170921, 177519, 173964, 173382, 175554, 153955, 158443, 117612, 122281, 128146, 98647, 84988, 107444, 103709, 81879, 46632, -26600, -63134, -118731, -163123, -161503, -151309, -119370, -124408, -147085, -166351, -165684, -174653, -165282, -164781, -157116, -156162, -133513, -158344, -196680, -182767, -146411, -127001, -141838, -140669, -104904, -113229, -124233, -128268, -106464, -122402, -134615, -66807, -77463, -104573, -111693, -116012, -111765, -118342, -99010, -76128, -65272, -44017, -11001, 8238, 19609, 29164, 19749, 51859, 89991, 106592, 157409, 179954, 157319, 124476, 91092, 65276, 73830, 92839, 80567, 55304, 56825, 26331, 30103, 58513, 78191, 106530, 118550, 133044, 131475]
13928A31475j8518p527L4765j3538K428l9097j9997m893k8020K0107O7672K0767
13916A45624k821l9192j3011J2165q408l0449L2529j4568M0312N5340l1583k0893
13904A25045j5245k0806L598J0771j0111P407j3699m2713j8055J6411N140J9788
13892F7531L2188m4579j6238j1924q337J7671J6322l5831j0902j0146L2546q026
13880B0275l3771m633L9293J4230J1129L879n3288n5913Q997M216L923k165J1822
13867c2006J4275j7236k3173q995P324r113k4080J9215L9799R1l0602k8629K8017
13854f5113J9548n20K7409P521k2859k4887N656O423J9367K6765k1004o5521k147
13841h9362L499N105m862J7386L1565M2787M121K105J1655L1978m0015j0626j1357
$$ y = [131475, 112957, 105430, 140195, 126657, 129085, 89988, 69991, 65098, 37078, 57185, 124857, 145624, 142803, 103611, 90600, 102765, 94357, 63908, 96437, 81869, 122181, 177521, 145938, 125045, 109800, 88994, 92592, 103363, 93252, 100659, 86960, 44247, 26192, 42603, 47743, 67531, 99719, 55140, 38902, 26978, 18641, 36312, 52634, 16803, 5901, -4245, 28301, 20275, -13496, -18129, 21164, 35394, 46523, 50402, -2886, -58799, -49802, -45586, -41663, -43828, -32006, -17731, -34967, -58140, -67135, -59811, -68924, -93004, -73789, -33990, -33899, -64501, -93130, -65113, -45565, -46085, -18676, -11155, -34014, -58901, -53245, -46822, -27455, -690, -21694, -87215, -89362, -85863, -80758, -85620, -68234, -36669, 6118, 10239, 12344, 23999, 55977, 15962, 5336, -6021]
13828f021K521L0292Q519j516K7140L5722O1281O6109M7313L9642R030q213K2586
13815C34405K5664K2578O0346P6687P3234Q1108J11371R1011J82051K17112K18940
13804A494507J91840K09817J72712Q9560L2188n3668j62964j35267j62637j80414
13794A495674j50769j54721j62222q6536p1978o7173n5564m5886k2838m8280k2751
13783F06956j3397J9252j6707l185j8520l2785m0208k4594L780J6803K7647J9809
13771E44851j6538q535R656O037m6532l9573J5612J1298o838J7616L8123O5200
13759E90377P7119J06119J9763m8987r3366j27598p8507l3599m5500l3596k6503
13748C05722j3970m3522m2381J2023j8618k0752j5141J0979k9064j6333K4357
$$ y = [-6021, -3500, 26792, 35311, 33795, 60935, 96657, 157938, 224047, 271360, 311002, 320032, 311819, 334405, 360069, 382647, 442993, 519680, 592914, 674022, 785393, 876404, 1058455, 1275567, 1494507, 1686347, 1896164, 2068876, 2158436, 2190624, 2136956, 1973992, 1838725, 1676088, 1495674, 1344905, 1190184, 1027962, 941426, 869448, 802275, 746711, 700825, 677987, 629707, 606956, 593559, 612811, 596104, 592919, 574399, 541614, 501406, 476812, 480592, 497395, 525042, 544851, 528313, 519778, 529434, 535471, 488939, 449366, 464978, 476276, 469438, 487054, 525177, 590377, 667496, 773615, 793378, 744391, 651025, 523427, 444920, 411321, 365821, 332225, 305722, 291752, 248230, 205849, 217872, 199254, 178502, 163361, 174340, 145276, 128943, 153300]
13737A53300j0048k2714p526K870j0025j0028L1254R070k1947J536L4603M088
13725A54433K9353R217l0884m5143j656L5779m368j2907P288J9792P2103P5793
13713C08800J24016R2576L107o9655j40249n3820k6505m4157p1175K8308q27q785
13701A41634j0963j8782J206K2143J3693J2974l6703l6772l4096L117L817o236
13689E5032J1486J7745R512K9360m2706m4146j305M1097L6761L074M104k836k0146
13676I7032J8153k448r295K9120L148l675k0104J529J1442O3306O1343j4418o5540
13663A69593n0589J096j7181l0890k7418j3653K1563r470l5961J3325N1207O155
13651G7777K0879J7451L7912J7143j8426n4769m6075k5369n17J4270N647L4984
$$ y = [153300, 143252, 120538, 113012, 115882, 105857, 95829, 127083, 136153, 114206, 115742, 150345, 154433, 183786, 193003, 162119, 116976, 115320, 151099, 146731, 133824, 141112, 160904, 233007, 308800, 432816, 525392, 528499, 458844, 318595, 264775, 238270, 194113, 122938, 151246, 150419, 141634, 130671, 111889, 113095, 135238, 148931, 161905, 125202, 88430, 54334, 57451, 61268, 55032, 66518, 84263, 93775, 123135, 80429, 36283, 34978, 76075, 112836, 115910, 120014, 117178, 97032, 115185, 112737, 103442, 132562, 135710, 132035, 111931, 113460, 124902, 188208, 249551, 235133, 169593, 119004, 120100, 102919, 72029, 44611, 30958, 52521, 43051, 7090, 20415, 71622, 77777, 98656, 116107, 154019, 171162, 152736, 97967, 51892, 26523, 26006, 40276, 45923, 80907]
13639H0907J3156n77j4184K432p180J2373j2559R331L0314k569k2851j38J5053
13626A03508J2399m0406m713k362r470q778k948K8987J7502k396m7841J5568k1044
13613C8006o723j5744J2169J3120J4513N7474L0028j1140q213q651j7010j3473
13601H4356j4841L8356o378o2757q580Q65J1725L7141q581P688K799k2081J780
13588F1492o398m8625n8739J406M6150L2341q110K4232J7184Q770Q004K011Q958
13575H8676R490J2609k3141K6652j2352k9919M8670K8464J0355O994j8075J1108
13563A59531L0340n2312K0914M4310j2376l8396n3633m8071K4894l858p8J2994
13551H4259R996j2577Q386r389l7529k1809K0748Q953L1129O2940J0768l4153
$$ y = [80907, 94063, 93486, 79302, 81734, 74554, 86927, 74368, 83699, 114013, 111444, 88593, 88455, 103508, 115907, 75501, 70788, 68426, 58956, 50178, 47230, 76217, 93719, 91323, 43482, 59050, 38006, 31283, 15539, 27708, 40828, 55341, 112815, 142843, 131703, 123490, 114839, 97829, 84356, 69515, 107871, 101493, 38736, 30156, 31021, 42746, 79887, 71306, 78994, 81793, 59712, 61492, 55094, 6469, -52270, -50864, -4714, 27627, 19517, 43749, 60933, 69703, 77707, 79718, 88676, 98166, 110775, 87634, 114286, 101934, 72015, 120685, 149149, 159504, 166498, 148423, 159531, 189871, 137559, 158473, 202783, 190407, 152011, 98378, 50307, 75201, 71343, 71265, 84259, 94255, 81678, 90064, 80675, 43146, 21337, 42085, 51038, 82167, 145107, 155875, 121722]
13539A21722j06j3111k6761J4121N912J4142K2258K4782p652R21j8345k1524k186
13526A14173J0274J8472P0578N863k5420j3440l740L7698L6379J6216J4029n1997
13514B29085l4213j0603R602j190l1018k932J1617J3045j6648l2749l0895M859
13502A07960K9825K9195L0806q073l8131m127r869j1990k0310J5916K1967j9678
13490A23491j0122K3345k779J3913K3760J3639J6255j2678j345k6987k8679j6876
13478A14937K5605J1153o889j4377j1740L8517N8301M1945o702o7010l9581L901
13466A48060L332J8769l448k1114p910J2535K5501J1917K5148P374k9934o4425
13454A25805j1716k971O688n4469j4961L4407N217l906K9044K3279K5465J0314
$$ y = [121722, 121616, 108505, 81744, 95865, 101777, 115919, 138177, 162959, 155307, 156228, 137883, 116359, 114173, 124447, 142919, 213497, 219360, 193940, 180500, 176760, 214458, 250837, 267053, 281082, 229085, 194872, 184269, 193871, 192681, 161663, 158731, 170348, 183393, 166745, 133996, 103101, 107960, 137785, 166980, 197786, 189713, 151582, 147455, 137586, 125596, 105286, 121202, 143169, 123491, 113369, 136714, 133935, 147848, 171608, 185247, 201502, 188824, 187479, 160492, 131813, 114937, 140542, 151695, 144806, 130429, 118689, 157206, 215507, 257452, 250750, 183740, 144159, 148060, 151392, 170161, 166713, 145599, 137689, 150224, 175725, 187642, 212790, 220164, 190230, 125805, 114089, 111118, 117806, 63337, 48376, 82783, 88000, 84094, 113138, 136417, 161882, 172196]
13442A72196j6901Q115J9781O533l1845M0881j7088l5766l0192J830K3638J9500
13430A60682K6160k0282k8157j2850l8693K3154L1864J2042L5844J4890m2507
13419A62147p322J1218Q063l7514R632L231n0435K821l676r471M121L8795j913
13406A29697k682K783L3072m777N129Q369K86J148n237J4643N851l2740O310K6908
13392A88760K503M797p57j4459L947K0162j2623l8782R107L0629l456k053K6116
13379B13891J2530K4382N2637R791j6422n9706l8066l4684k1392K5412M6182j9044
13367A95511k9674j5139K2035m758q482K8159J3578M463j8016k2532N201M5526
13355B15872K1244k6838l5742M1175M7252k1816l0204k4134j102j5947K7969J4705
$$ y = [172196, 155295, 163410, 183191, 189724, 157879, 198760, 181672, 145906, 115714, 117544, 141182, 160682, 186842, 166560, 138403, 125553, 86860, 110014, 141878, 153920, 189764, 204654, 162147, 154825, 166043, 174106, 136592, 146224, 149455, 99020, 101841, 98165, 88694, 92815, 131610, 129697, 127015, 129798, 162870, 158093, 163222, 171591, 171877, 173025, 167788, 182431, 188282, 155542, 161852, 188760, 191263, 196060, 195303, 180844, 184791, 204953, 192330, 153548, 162655, 193284, 189828, 187775, 213891, 226421, 250803, 303440, 313231, 296809, 237103, 199037, 164353, 142961, 168373, 214555, 195511, 165837, 150698, 172733, 167975, 159493, 187652, 201230, 205693, 187677, 165145, 170346, 215872, 237116, 210278, 174536, 215711, 262963, 241147, 210943, 186809, 185707, 169760, 197729, 212434]
13343B12434j5610j5558m55J9194J6137n849l2483J3912r703j5672p445Q489j4243
13330A53148J1249J6039K7280J0513n4492m3631J0929M180K6877M3430J4748r059
13318B11211J6452J796j8165l812k6278j7061k751K5930K3362J3391n775k2721
13306A95579K8052J1493j2258L0242l832j3232j7325k3955L234J3350J4497J549
13294B27394K4542k5997l350L6133j1532l2504k5827l465M7099K2282k1665j4046
13282B19064L2866K4741m4780m6971K9927J7934K9094K8058J3305P67k3378k774
13270B77853J575K5677R727k445K46n9210j2279O002j0550M0521R401L2039J447
13257C20004l0446k4050n401O314O3302K563j4254J5208j2114m1852K5935K465
$$ y = [212434, 196824, 181266, 180811, 200005, 216142, 210293, 177810, 191722, 182019, 166347, 158902, 167391, 153148, 164397, 180436, 207716, 218229, 163737, 120106, 131035, 135215, 162092, 205522, 220270, 211211, 227663, 229459, 211294, 207482, 181204, 164143, 161392, 187322, 210684, 224075, 218300, 195579, 223631, 235124, 222866, 253108, 249276, 236044, 218719, 194764, 197998, 211348, 225845, 227394, 251936, 225939, 222589, 258722, 247190, 214686, 188859, 185394, 232493, 254775, 233110, 219064, 251930, 276671, 231891, 184920, 214847, 232781, 261875, 289933, 303238, 304005, 280627, 277853, 279428, 305105, 314832, 312387, 312633, 253423, 241144, 247146, 236596, 277117, 286518, 318557, 320004, 289558, 265508, 260107, 266421, 329723, 332286, 318032, 333240, 321126, 279274, 305209, 307674]
13245C07674j2756l3652J944P172J6802J6279k3710O707O644r731J4245K47O749
13232C04614J4313k9340j1052J3105j6825j6093K6009J8766N1627N3741k5215
13221C83650k9404q07M4431j200K675m428J6972l430p4480l9088j2396K2875K9321
13208C34691p375k9375N789M1186J3465Q283J8982P319k5517m3831K2003L2816
13196C78436K1213k3590l9398J0449K6400k4255L9204K8441J0771O53k8782j132
13184C98410K1155k1616j6254k1253K84J6537J5818K9795K47K5037N5047k702
13172E00505l1299m3513l1585k169j4259j0833j621J5555K2462J2944K4647K535
13160D43369J431k6151k4733l910K2798k2310L21J6931J0804J2001Q174M54j8301
$$ y = [307674, 294918, 261266, 263210, 270382, 287184, 303463, 279753, 286460, 293104, 283373, 297618, 297865, 304614, 318927, 289587, 278535, 291640, 274815, 258722, 284731, 303497, 355124, 408865, 383650, 354246, 353439, 397870, 396670, 399345, 394917, 411889, 408459, 333979, 294891, 282495, 305370, 334691, 327316, 297941, 303730, 344916, 358381, 366664, 385646, 392965, 367448, 323617, 345620, 378436, 399649, 376059, 336661, 347110, 373510, 349255, 388459, 416900, 427671, 428324, 399542, 398410, 419565, 397949, 381695, 360442, 360726, 377263, 393081, 422876, 423123, 448160, 503207, 500505, 469206, 425693, 394108, 391939, 377680, 366847, 365226, 380781, 403243, 416187, 440834, 443369, 444800, 418649, 393916, 390006, 412804, 390494, 390815, 407746, 418550, 430551, 438725, 439179, 420878]
13147D20878M130J1066R646J626M4989k89K597r180n644j5643l377L2091p152
13134D85738n934K94J601Q063K1645J8781J4355m5099k3546k0888J7813K115k3956
13121D50982O251J4406l6956r122K8081M5l0254r036K5829K1261j0138l5502J3380
13108D29227K9951k6653M934N5159J8237k3872k8062j7047r774L1465M1006J1532
13096E16103K7241J7665m2761m5189K6423P7137P802l6550o8308j4938M980J6587
13084D86192J5047J5413K2525n003k7804K3032K8909j617j4763k9725J8256L1427
13072E61889r352k9957k5662k857K3047K5571J7393J3117q63J0023j4912k4559
13060E42878q45j7474j6374q454k891R97N9537K0386j0176R396j9994J2894K2727
$$ y = [420878, 425008, 436074, 445720, 447346, 492335, 492046, 494643, 485463, 479819, 464176, 460799, 492890, 485738, 479804, 480098, 481699, 489762, 511407, 530188, 544543, 499444, 475898, 455010, 472823, 474938, 450982, 457233, 471639, 434683, 425561, 453642, 453687, 423433, 414397, 440226, 461487, 451349, 415847, 429227, 459178, 432525, 437459, 492618, 510855, 486983, 458921, 441874, 432100, 463565, 504571, 516103, 543344, 561009, 518248, 473059, 499482, 576619, 584421, 547871, 479563, 464625, 469605, 486192, 501239, 516652, 539177, 534174, 506370, 529402, 558311, 556694, 541931, 512206, 530462, 561889, 552537, 522580, 496918, 494061, 517108, 542679, 560072, 573189, 572326, 582349, 567437, 542878, 542033, 524559, 508185, 499731, 496840, 497837, 557374, 577760, 567584, 576980, 556986, 569880, 592607]
13047E92607K4075R41j6118L870j1906L8235K1331o862j5338l5784l8032l913
13035E53106k363L9014K1668l1293N915L2869l135k4620k5800K6811M3009k5716
13023F09465j7787k463L4652k349q576j2192O139N340j556J2691q32q155K5610
13010F39987Q91J4486K511k5550j7438M2825k0937k7587m3769K1594N5611O5211
12998G07835M2609K9647L4316M3381J4143l6590K2033n6195n6015m7285j0628
12987F87251k186l7846M0444K8851J4283L3044M251n5927J4489O0928j6160p729
12975G63693M0998l0519m1311l0699K0139L5929J8231M661k4627O896K9123M681
12963G97195K7910J9899l7917k5393L7774K9348M507m0949l6061K2910k02J9950
$$ y = [592607, 616682, 617623, 601505, 605375, 593469, 631704, 653035, 646173, 630835, 595051, 557019, 553106, 550743, 589757, 611425, 580132, 586047, 618916, 615781, 591161, 565361, 592172, 635181, 609465, 591678, 589215, 623867, 621518, 612942, 600750, 606889, 612229, 610673, 623364, 622532, 614377, 639987, 640878, 655364, 657875, 632325, 614887, 657712, 636775, 609188, 565419, 587013, 642624, 707835, 750444, 780091, 814407, 857788, 871931, 835341, 857374, 801179, 745164, 697879, 687251, 685065, 647219, 687663, 716514, 730797, 763841, 768092, 712165, 726654, 787582, 771422, 763693, 804691, 774172, 732861, 702162, 722301, 758230, 776461, 781122, 756495, 763391, 792514, 797195, 825105, 845004, 807087, 781694, 819468, 848816, 853323, 812374, 776313, 799223, 799021, 818971]
12951H18971K1188J689k4946p990J952J8814N1986K7745N348k868k9082K2749
12939I05556K2444m928J0884R622K7268j7553k8960K1950j4923J0248K4354L4139
12927A000101j1397J3495N3701j3360l5093l0122O491k0502J7228m002Q727j154
12915I84113o409k6239J6578L439J7509J6240k2816K917L8582K5366O926j4847
12903A041359n952j9214m4889j6944N2165L0971N5496N514J6530N572m4071m8186
12891A028351K8922J0136J7739K1631p665J9598L5862m5484j5654J896j3689J6970
12879A098613K4365J351K3921J2217j0915Q854J9126j8810J3023K9072L085k5182
12867A178720p733j7900o971L0826N7500N559O073l0823k9556K636N2072Q6073
$$ y = [818971, 840159, 841848, 816902, 808912, 810864, 829678, 881664, 909409, 914757, 911889, 882807, 905556, 928000, 923072, 933956, 943578, 970846, 953293, 924333, 946283, 931360, 941608, 965962, 1000101, 988704, 1002199, 1055900, 1042540, 1007447, 977325, 983816, 963314, 980542, 976540, 985267, 984113, 977704, 951465, 968043, 971482, 988991, 1005231, 982415, 985332, 1023914, 1049280, 1056206, 1041359, 1035407, 1016193, 971304, 954360, 1006525, 1037496, 1092992, 1098506, 1115036, 1120608, 1076537, 1028351, 1057273, 1067409, 1085148, 1106779, 1099114, 1118712, 1154574, 1109090, 1093436, 1095332, 1081643, 1098613, 1122978, 1124329, 1148250, 1160467, 1149552, 1158406, 1177532, 1158722, 1171745, 1200817, 1203902, 1178720, 1170987, 1153087, 1146116, 1176942, 1234442, 1240001, 1246074, 1215251, 1185695, 1188331, 1240403, 1326476]
12855A326476K9770n4404l1426M397M403k1332m673n493J7146L5166L4749K3092
12843A357871N7476k1304n3890k284O0521M8312L0011K7824l2023k1967R129M6891
12831A506567M3962N8858K3524L7863J27114N8224k359J5230l2478m797J2129
12820A843837O0747K9457p9K959L4195J17981Q2176J11207K48666L58894N36627
12809C426667P12063P83571M26024l19018p20476p19815m78968k85984j90732
12800B633332j56443r3908m0594o0066k3423n5311o8896k5154k2811l9670J1382
12789B058438K9568J4613j3063K8211M960k0667k035J2053k5991L268k6960J5864
12777B078259L3829J1385K1630O757K7830L0351O013J1053m306l1694k6706m4529
$$ y = [1326476, 1356246, 1301842, 1270416, 1274813, 1279216, 1257884, 1253211, 1247718, 1264864, 1300030, 1334779, 1357871, 1415347, 1394043, 1340153, 1337869, 1398390, 1446702, 1476713, 1504537, 1472514, 1450547, 1459676, 1506567, 1550529, 1609387, 1632911, 1670774, 1797888, 1856112, 1853753, 1868983, 1836505, 1831708, 1843837, 1904584, 1934041, 1933962, 1936921, 1971116, 2089097, 2171273, 2282480, 2531146, 2890040, 3426667, 4138730, 4922301, 5348325, 5029307, 4308831, 3589016, 3110048, 2824064, 2633332, 2476889, 2382981, 2342387, 2282321, 2258898, 2203587, 2134691, 2109537, 2086726, 2047056, 2058438, 2088006, 2102619, 2089556, 2117767, 2122727, 2102060, 2100025, 2112078, 2086087, 2089355, 2062395, 2078259, 2112088, 2123473, 2145103, 2151860, 2179690, 2210041, 2216054, 2227107, 2222801, 2191107, 2164401, 2119872]
12765B119872k2809P778L5428K1539K944J5020J3836L465L2619P2856K5671k4799
12753B303420K2501J03715J00851J67587K42707K66157J02712j16819k27229j45624
12743B819978j17838r1300l3706j1962o0862n8394k4120J1849N667j6646l6165
12732B386501J0447l175m115J4247j7501J9305J6855j1124k215K2844J6064K9211
12720B477344M5081Q278O551O990N9808K5093K2048j2380k6190K6406M1443l905
12708B676567j5499j1257Q4827R144j4789l3318J2452M6208K8068K995m1189K7386
12696B771595J0348N81r88M020Q425l4282p496M311j4352O9936M3060K783K0235
12683B878176L1271L0595K0802k5885o597M9695L5812L9720K9819M630o675p675
$$ y = [2119872, 2097063, 2104841, 2140269, 2161808, 2164752, 2179772, 2193608, 2197073, 2229692, 2302548, 2328219, 2303420, 2325921, 2429636, 2530487, 2698074, 2940781, 3206938, 3309650, 3192831, 2965602, 2819978, 2702140, 2610840, 2577134, 2565172, 2504310, 2445916, 2421796, 2433645, 2439312, 2422666, 2386501, 2396948, 2393773, 2389658, 2403905, 2386404, 2405709, 2422564, 2411440, 2409225, 2432069, 2448133, 2477344, 2522425, 2530703, 2537254, 2544244, 2604052, 2629145, 2651193, 2638813, 2612623, 2639029, 2680472, 2676567, 2661068, 2649811, 2734638, 2743782, 2728993, 2695675, 2708127, 2754335, 2782403, 2785398, 2744209, 2771595, 2781943, 2782524, 2781536, 2785556, 2793981, 2759699, 2752203, 2756514, 2742162, 2812098, 2855158, 2857941, 2878176, 2909447, 2940042, 2960844, 2934959, 2928362, 2978057, 3013869, 3053589, 3083408, 3088038, 3081363, 3073688]
12671C073688j0562L1476K8819J630K873Q695M3847L4456K948J0721J0795J0860
12659C250246r901L015Q728J1630N4607N8161l508j4881k5936P609N6811J4232
12647C410813L9155P3010J1132L2879K2406L9353N8384J7621l3459m209K8665
12636C695750K9909K6640j7568K7721Q3431M332N9808M6893K8744J7728J9529
12625D022917K0727N2889K7657K3227P7398M1648M1500N4059K7018N1946L6893
12614D477879L0485J5026M68L8511J7570N978L0798O1219O6383N5992O9910K3832
12602D894051m83k9460l0148L2639K2410M7215M5994o938L7610K0712k764M0482
12590E071320R2959M0247M5669L8779M3727L3117L5725J9510K0707N9441K9163
$$ y = [3073688, 3063126, 3094602, 3123421, 3125051, 3127924, 3136619, 3180466, 3214922, 3217870, 3228591, 3239386, 3250246, 3240345, 3243360, 3252088, 3263718, 3318325, 3376486, 3372978, 3358097, 3332161, 3339770, 3396581, 3410813, 3449968, 3522978, 3534110, 3566989, 3589395, 3628748, 3687132, 3704753, 3671294, 3667085, 3695750, 3725659, 3752299, 3734731, 3762452, 3845883, 3850215, 3910023, 3956916, 3985660, 4003388, 4022917, 4043644, 4096533, 4124190, 4147417, 4224815, 4266463, 4307963, 4362022, 4389040, 4440986, 4477879, 4508364, 4523390, 4523858, 4562369, 4579939, 4585917, 4616715, 4677934, 4744317, 4800309, 4870219, 4894051, 4893568, 4864108, 4833960, 4866599, 4889009, 4936224, 4982218, 4975280, 5012890, 5033602, 5030838, 5071320, 5164279, 5204526, 5250195, 5288974, 5332701, 5365818, 5401543, 5421053, 5441760, 5501201, 5530364]
12579E530364K9742O3483O6789R2875O6677J9787N0920M8678P0990J38415J60026
12568F338746J55541J60198J17572N2061j1558J1808J1437M492m858Q649Q9065
12557F933153Q5790K9984o595k0529P154O412K171J8578R570L7412L5292P7091
12545G215483O3864N9096Q3563Q5295K2668k5951K6569N5671P1816n17J4402N7698
12533G729657O2335Q438Q915N5613N2909L9750O5543N9842K7721N767L5614O2358
12521H214462R2202L2263m564N5220L7246M5082O4681O7815M4355M0660Q4799
12510H774221J31072O9160N5668J12980J52517J45643O7339K2735M5259R2605
12500I669199N0154J3532J5951k6948l002J4031J667N1411L7653K1227M5001J8763
$$ y = [5530364, 5560106, 5623589, 5690378, 5783253, 5849930, 5869717, 5920637, 5969315, 6040305, 6178720, 6338746, 6494287, 6654485, 6772057, 6824118, 6812560, 6824368, 6835805, 6840297, 6835439, 6844088, 6933153, 7018943, 7048927, 7042332, 7021803, 7028957, 7035369, 7037540, 7056118, 7065688, 7103100, 7138392, 7215483, 7279347, 7338443, 7422006, 7507301, 7529969, 7504018, 7530587, 7586258, 7658074, 7657557, 7671959, 7729657, 7791992, 7800430, 7809345, 7864958, 7917867, 7957617, 8023160, 8083002, 8110723, 8116490, 8152104, 8214462, 8306664, 8338927, 8334363, 8389583, 8426829, 8471911, 8536592, 8604407, 8648762, 8689422, 8774221, 8905293, 8974453, 9030121, 9143101, 9295618, 9441261, 9508600, 9531335, 9576594, 9669199, 9719353, 9732885, 9748836, 9721888, 9718886, 9732917, 9734584, 9785995, 9823648, 9844875, 9889876, 9908639]
12488I908639K3231N3574J02619O6664R4669P4279N8287j488O246j282L0995K5961
12476A0442394K3375P47L142M2545L4805O9093P2620P0801J7292m869J192R6644
12464A0869781P2691Q074L6008M7908P8995N6077O8303Q1910L8440j3400k8256
12453A1316531k7649K5325M0355O6179O1385K3770R344K5581K0522l315J5419
12442A1573447R4218J19788R0089M7210L9086J2811p486j0694L4090J0306N5828
12431A2058693O2787J1679P0150O2512M9054J6161P649J4428K4600N3576P5567
12420A2506856J23309J92731K74607L98881O66714Q45760P31665J4058o67109
12411A5087472q07708n90932l88463k32755j78782j15627p8719r7265p8635m3992
$$ y = [9908639, 9931870, 9985444, 10088063, 10154727, 10249396, 10323675, 10381962, 10380474, 10386720, 10385438, 10416433, 10442394, 10465769, 10466516, 10469658, 10512203, 10547008, 10616101, 10688721, 10759522, 10776814, 10771945, 10773137, 10869781, 10942472, 10950546, 10986554, 11034462, 11113457, 11169534, 11237837, 11319747, 11358187, 11344787, 11316531, 11288882, 11314207, 11354562, 11420741, 11482126, 11505896, 11515240, 11540821, 11561343, 11558028, 11573447, 11667665, 11787453, 11877542, 11924752, 11963838, 11976649, 11969163, 11958469, 11992559, 12002865, 12058693, 12121480, 12133159, 12203309, 12265821, 12314875, 12331036, 12338685, 12353113, 12377713, 12431289, 12506856, 12630165, 12822896, 13097503, 13496384, 14163098, 15008858, 15740523, 15754581, 15087472, 14279764, 13688832, 13300369, 13067614, 12888832, 12773205, 12694486, 12597221, 12518586, 12474594]
12401A2474594o2014r8353n7402m5969n9175o5728P98K7201k8413n9700o8395
12390A1957444m923l0182o7725p4837j9602m3414p6296j3122k5085k8201q369
12379A1565688l6664p1243l1211l9160n9227m0468l2914o3137m8622k9518n7590
12368A1055934p0674k2581o7009n6463m3237n7512n0138p6819o8589l3899m0761
12357A0468252k5781n6049m7646q5250l2073l9819p1038m7659l0394o5549o9191
12346I897803o1599o8326l7680k3085p1209n0690p1837n5059n6763m2484m3492
12335I315579m2175o6140m8675l2506k9192p1194m2482m5241l0127o9995k8514
12324H809338l820j30q5123n9065p7782l7577l9508o2894p2790p6074j5009m7199
$$ y = [12474594, 12412580, 12314227, 12256825, 12210856, 12151681, 12085953, 12086751, 12113952, 12085539, 12025839, 11957444, 11952521, 11922339, 11854614, 11779777, 11760175, 11716761, 11640465, 11627343, 11602258, 11574057, 11565688, 11529024, 11457781, 11426570, 11387410, 11328183, 11287715, 11254801, 11191664, 11143042, 11113524, 11055934, 10985260, 10962679, 10895670, 10839207, 10795970, 10738458, 10688320, 10611501, 10542912, 10509013, 10468252, 10442471, 10386422, 10338776, 10253526, 10221453, 10181634, 10110596, 10062937, 10032543, 9966994, 9897803, 9836204, 9767878, 9730198, 9707113, 9635904, 9585214, 9513377, 9458318, 9401555, 9359071, 9315579, 9273404, 9207264, 9158589, 9126083, 9096891, 9025697, 8983215, 8937974, 8907847, 8837852, 8809338, 8805518, 8805388, 8720265, 8661200, 8583418, 8545841, 8506333, 8443439, 8370649, 8294575, 8279566, 8232367]
12312H232367k1038q3624q5342m6577l5611j8197P187k4514n6625m4462j9003
12301G804561j9543P688M969p765J1586J2027m4202o5129m5351j9241n6186r3731
12289G489683j03362k0744j6513l3039l7805l99k965k7368l6308o1516p6815r2777
12277F980072o2538o5853m4878o4267k8059m5256q8846p2761l9699l5414o2605
12266F369896m4245J5869N983m8670m7933J0860j5885n5717o3649q959j5184q9210
12254F013156n4588J0963o762l3553m0779m0263P464m6258n7437j5449M6406J797
12242E784697k5416L336k9522o9308r3287n3265j0977k4774j5548k2182o620k474
12230E434660l1060l7417k8510k6765l3081k3804k2409k6764L1916k8182o1448
$$ y = [8232367, 8211329, 8127705, 8042363, 7995786, 7960175, 7941978, 7949165, 7924651, 7868026, 7823564, 7804561, 7785018, 7792706, 7797675, 7789910, 7801496, 7813523, 7769321, 7704192, 7658841, 7639600, 7583414, 7489683, 7386321, 7365577, 7349064, 7316025, 7278220, 7277821, 7274856, 7247488, 7211180, 7149664, 7072849, 6980072, 6917534, 6851681, 6806803, 6742536, 6714477, 6669221, 6580375, 6507614, 6467915, 6432501, 6369896, 6325651, 6341520, 6347503, 6298833, 6250900, 6261760, 6245875, 6190158, 6126509, 6117550, 6102366, 6013156, 5958568, 5969531, 5962769, 5929216, 5888437, 5848174, 5855638, 5809380, 5751943, 5736494, 5782900, 5784697, 5759281, 5762617, 5733095, 5663787, 5570500, 5517235, 5506258, 5481484, 5465936, 5443754, 5437134, 5434660, 5403600, 5366183, 5337673, 5310908, 5277827, 5254023, 5231614, 5204850, 5236766, 5208584, 5147136]
12219E147136m9188p2632p7165j6503q5412n4284l2273k1804l3745l3554P506
12208D678082r227o8932n5989m8147n0209k1827m5335k4613j2279n0592J904P539
12196D300375p715k8982k3184J4031L3389n6083m9162K8053k5540m0839j9236
12185D125107K871J1140j3127j4131j1866j7264M497j2174o2871n7555l5267n104
12173C914256j8612J2363j2433j0878L9437O149R935o998l1982p542m792n6320
12161C832583p0399j9840k1157J8243K3814j6281j5686j8882k1722J1372m0597
12150C661448j7913K4749p475m2463p0279j6851n8805l0831p809k3241j5841M656
12138C399345j3981m3604o0058J515M8217k4692j7151q945k3217j1530j9273m3331
$$ y = [5147136, 5097948, 5025316, 4948151, 4931648, 4846236, 4791952, 4759679, 4737875, 4704130, 4670576, 4678082, 4668855, 4599923, 4543934, 4495787, 4445578, 4423751, 4378416, 4353803, 4341524, 4290932, 4292836, 4300375, 4292660, 4263678, 4240494, 4254525, 4287914, 4231831, 4182669, 4210722, 4185182, 4144343, 4125107, 4127978, 4139118, 4125991, 4111860, 4099994, 4082730, 4087227, 4075053, 4012182, 3954627, 3919360, 3914256, 3895644, 3908007, 3895574, 3884696, 3924133, 3930282, 3940217, 3933219, 3901237, 3893695, 3888903, 3832583, 3762184, 3742344, 3721187, 3739430, 3763244, 3746963, 3731277, 3712395, 3690673, 3702045, 3661448, 3643535, 3668284, 3660809, 3618346, 3548067, 3531216, 3472411, 3441580, 3433771, 3410530, 3394689, 3399345, 3385364, 3341760, 3281702, 3283217, 3331434, 3306742, 3289591, 3280646, 3257429, 3245899, 3226626, 3183295]
12126C183295k2522o0768j3613J317l1020r227o963m2289k8714j3475j5844k5659
12114B914518k5938J4225J4808l0477k2704o1712l9208L3182j0069l2300m4685
12103B709640j6518q026N4387k8226o2412J737J6631M929n2000k9104j1862n1983
12091B527193j281K9326k77n120J9376K7228J7467M7650P6766L8325j4126p6989
12079B685538q8166q3480o5919l9197n9994k5017K6682k6942l3729P911K9695
12068B327382k2496o4145k8088k5884L4285J383p5268j540L077m2435l8108P571
12056B075734k8783L3498J6658J0833j9654l144k7705k8781m531p649l4546p106
12044A974824k2973p25j9011j0010K8659k9684n1733j5747j3205p995J9144j3752
$$ y = [3183295, 3160773, 3100005, 3086392, 3087709, 3056689, 3047462, 3040499, 2998210, 2969496, 2956021, 2940177, 2914518, 2888580, 2902805, 2917613, 2887136, 2864432, 2802720, 2763512, 2796694, 2786625, 2754325, 2709640, 2693122, 2685096, 2739483, 2711257, 2648845, 2650582, 2667213, 2672142, 2620142, 2591038, 2579176, 2527193, 2525912, 2555238, 2554961, 2549841, 2569217, 2596445, 2613912, 2661562, 2738328, 2776653, 2762527, 2685538, 2597372, 2513892, 2447973, 2408776, 2348782, 2323765, 2350447, 2323505, 2289776, 2297687, 2327382, 2304886, 2240741, 2212653, 2186769, 2221054, 2222437, 2147169, 2145629, 2148706, 2106271, 2068163, 2075734, 2046951, 2080449, 2097107, 2107940, 2088286, 2085142, 2057437, 2028656, 2024125, 2016476, 1981930, 1974824, 1951851, 1951126, 1932115, 1922105, 1950764, 1921080, 1869347, 1853600, 1840395, 1832400, 1851544, 1837792]
12032A837792k7937k2358k872K5372K3578m1845m5665k3369j1146l188j88J200
12020A709374j1259r538K9047L3880O507m7484m4414J2479J4066J3135j73M067
12008A709687m355k6742m0522l2636K5074l025j1827R316n501K2789m3092j1086
11996A588080J5084p504J6507k8935m1540k7004m861k1039j8993K2552P064L4361
11984A533772M0828j2539k5764n979k6589J0741L3628l342k2659j288J9006q73
11972A538942m0009L915l4614j3417l0309j1338l4219N369K2895J8027J9972q397
11960A436817o143J9139j587j9302p2897l511L0816j2799k6725O595K1698l571
11948A368530J3200J7988J2347j6437j9703N527O9994M8317K4212q359p398J9710
$$ y = [1837792, 1809855, 1787497, 1784625, 1809997, 1833575, 1791730, 1746065, 1722696, 1711550, 1708362, 1708174, 1709374, 1698115, 1688577, 1717624, 1751504, 1758011, 1710527, 1666113, 1678592, 1692658, 1705793, 1705620, 1709687, 1705332, 1678590, 1638068, 1605432, 1630506, 1627481, 1615654, 1624970, 1619469, 1642258, 1599166, 1588080, 1603164, 1595660, 1612167, 1583232, 1541692, 1514688, 1509827, 1488788, 1469795, 1492347, 1499411, 1533772, 1574600, 1562061, 1536297, 1530318, 1503729, 1514470, 1548098, 1544756, 1522097, 1520809, 1539815, 1538942, 1498933, 1502848, 1468234, 1454817, 1424508, 1413170, 1378951, 1384320, 1407215, 1425242, 1445214, 1436817, 1430674, 1449813, 1448226, 1428924, 1356027, 1352516, 1383332, 1370533, 1343808, 1350403, 1372101, 1368530, 1381730, 1399718, 1412065, 1395628, 1375925, 1381452, 1451446, 1499763, 1523975, 1515616, 1508218, 1527928]
11936A527928K4005k1945qJ3479l7563k2936M1567K8514J5884j6403J352J35p782
11923A546227J46M2724k4843K1521j6699j3600K4633k963j8961J2692O3514O83
11911A635074J225L8079M456j0624J8812J1122r893K8472K161j1152j898L3926
11899A739760K6355o345j4663J2561J1503K8886k04p1262m6664k9003O404j6831
11887A640497L7872N543l5945m3254O479j9043J7668j6813J388o939j6557j035
11875A569861M995o825l1432l1319K1413n690J2575m9916P079K01m144J4354N214
11862A506366l7941k1904n6364m4685m2032k8124j5610l331R931k8768k3877m3041
11850A170620k6441j0093j8663J4370o797j707k5868l3867J737r315j4929l2882
$$ y = [1527928, 1551933, 1529988, 1529980, 1543459, 1505896, 1482960, 1524527, 1553041, 1568925, 1552522, 1553874, 1554009, 1546227, 1546373, 1589097, 1564254, 1585775, 1569076, 1555476, 1580109, 1577146, 1558185, 1570877, 1634391, 1635074, 1636299, 1674378, 1678834, 1668210, 1687022, 1698144, 1688251, 1716723, 1718884, 1707732, 1705834, 1739760, 1766115, 1759770, 1745107, 1757668, 1769171, 1798057, 1797853, 1726591, 1679927, 1650924, 1657328, 1640497, 1678369, 1683912, 1647967, 1604713, 1611192, 1592149, 1609817, 1593004, 1594392, 1587453, 1570896, 1569861, 1574856, 1568031, 1536599, 1505280, 1526693, 1521003, 1533578, 1483662, 1490741, 1490942, 1486798, 1501152, 1506366, 1468425, 1446521, 1390157, 1345472, 1303440, 1275316, 1259706, 1256375, 1266306, 1237538, 1213661, 1170620, 1144179, 1134086, 1115423, 1129793, 1122996, 1121289, 1095421, 1061554, 1063291, 1053976, 1039047, 1006165]
11838A006165m0281n576q913j174K0215N3800M1173k1405m4890l8397l3855N456
11826I32318K168R474N309J7115L895K1352r458m272q472o5611o128J4167k7134
11813H84723m94J2328l8826n4154M0631O1250n016k7756P851J588j6689J8438
11801H83874k0857l2534L885j0818J0739K4827n685l7331j1422n1640j6868N0269
11789G86439K3500J1252L866j0391K552m5295L5299K4651J0300j1110l9536m9059
11777G42468l4241l5519J1118K9017l691L655K6700L3238l4071m3146o817K5683
11765G14394L3926Q487j9975l9723m8799J7547M470m691m366k5564J7136K8108
11753F80950L9112J0539J4075j0555L7457O541m6295m2990n000K2491j0620k5095
$$ y = [1006165, 965884, 960308, 951395, 950221, 970436, 1024236, 1065409, 1044004, 999114, 960717, 926862, 932318, 934486, 943960, 949269, 966384, 970279, 991631, 982173, 977901, 969429, 903818, 897690, 911857, 884723, 884229, 896557, 857731, 803577, 844208, 905458, 900442, 872686, 880537, 882125, 865436, 883874, 863017, 830483, 834368, 823550, 834289, 859116, 853431, 816100, 804678, 753038, 736170, 786439, 809939, 821191, 825057, 814666, 817218, 771923, 807222, 831873, 842173, 831063, 791527, 742468, 708227, 672708, 683826, 712843, 709152, 712807, 739507, 772745, 738674, 695528, 688711, 714394, 748320, 756807, 736832, 697109, 648310, 665857, 670327, 665636, 661270, 635706, 652842, 680950, 720062, 730601, 744676, 734121, 771578, 778119, 731824, 688834, 683834, 706325, 695705, 670610]
11741F70610j1507k22j0822J6561K021j27n327j2221j0027m764q170K4324K6136
11728F76465j2529j1372R311L0979K780j5223o020k8627J2276M2785J2436k8690
11716F84571o2277k7945O3892Q6502R053k9557m6405K0858k607l461M033j4597
11704F82060k662m899J6677J3972j1595k2704k3290K8301K0807J681k6202p580
11692F64566K6730R781l1301k4742l663j1167k9342j459M632J509K3823P778R168
11679F46313J2693J8151J6884L7781L061n1484l5016J812J6999J330k3271J3084
11667F58337M2571L5435N577K6078K3380J441m549r698j2917N1556l001m2430
11655G71780j9843L3569K312N1051O7767M0145L8055O1103N7258Q6658R8795J02452
$$ y = [670610, 659103, 658881, 648059, 664620, 666641, 666514, 661187, 648966, 638939, 634175, 626005, 650329, 676465, 663936, 652564, 661875, 692854, 695634, 680411, 674391, 645764, 658040, 700825, 713261, 684571, 622294, 594349, 658241, 744743, 753796, 724239, 677834, 698692, 696085, 692624, 696657, 682060, 679398, 674499, 691176, 705148, 693553, 670849, 647559, 675860, 696667, 698348, 672146, 664566, 691296, 701077, 669776, 645034, 641371, 630204, 600862, 599403, 604035, 605544, 629367, 637145, 646313, 659006, 677157, 694041, 731822, 734883, 683399, 648383, 650195, 667194, 668524, 645253, 658337, 700908, 736343, 741920, 767998, 791378, 792819, 788270, 778572, 765655, 817211, 814210, 771780, 751937, 785506, 787818, 838869, 906636, 946781, 984836, 1045939, 1103197, 1189855, 1288650, 1391102]
11643A391102K1269n8369j19388q0176p5458m2641j6145n940k6268l6424m9701
11632I01861O964P4112N1064L5677J8L0600M8017M5120K2487J0636l0298j9485
11620A176773j7952J4079M9984J5486Q6888N5423J1030j7431R313J6863l8629
11609A361827n7960m9518n8991m7527m7667o8729l5908j3710n1060k3806j3169
11598H93782P228J1310J6331N46L2327J5315r06K9065L2657J7221L6204K7480
11586A118560l6229k7699o1637q4215j9464M348l3539o9833o1629q775R385j3802
11574G15471k8336J5471J8928l7201r275n137K180p623l9905j1600l0679j1780
11562E70514J6850L125n776j417J362O81o9675k6351N151Q324K0548j8962Q766
$$ y = [1391102, 1412371, 1354002, 1234614, 1154438, 1078980, 1036339, 1020194, 1014254, 987986, 951562, 901861, 908825, 982937, 1034001, 1069678, 1069696, 1100296, 1148313, 1193433, 1215920, 1226556, 1196258, 1176773, 1158821, 1172900, 1222884, 1238370, 1325258, 1380681, 1391711, 1374280, 1383593, 1400456, 1361827, 1303867, 1254349, 1195358, 1147831, 1100164, 1031435, 995527, 981817, 930757, 906951, 893782, 901010, 912320, 928651, 929197, 961524, 976839, 975933, 1004998, 1037655, 1054876, 1091080, 1118560, 1082331, 1054632, 992995, 908780, 889316, 893664, 860125, 790292, 728663, 719888, 729273, 715471, 687135, 702606, 721534, 684333, 675058, 669921, 672101, 664478, 624573, 612973, 582294, 570514, 587364, 590489, 584713, 583296, 584658, 585339, 515664, 489313, 494464, 502788, 523336, 504374, 513140]
11549E13140j6625j104j3036l4338J4577J1808J6651O342m9947l4385J2808M1396
11537D67287J2771j3676k8072L863K7363J8418J904k3732q922J0467M993k1719
11525D50945m4591n532L7695O2361J5845j8842n2149j0136k816J2608J1228L430
11513D60046k8539k3349j2408L7862K9821j7384l5512L65j7860Q422O560M456
11501D12480M404k6183P67K6283m031k8935j5826N1415L2605J4759j6075k6369
11489D25294l1412M262K0219O73l0165l4846k5479m25K5842L0087L7562J9928
11477D41540J6847k6468r306L567k0996q403m658o1570J0886j8926r755K6325
11465C39083L5813N443j5843k0382M1863M0720j3166k9675k6640K1144N4503l865
$$ y = [513140, 496515, 495411, 482375, 448037, 462614, 474422, 491073, 497415, 447468, 413083, 425891, 467287, 480058, 466382, 438310, 442173, 469536, 487954, 489858, 466126, 457204, 467671, 472664, 450945, 406354, 400822, 438517, 500878, 516723, 497881, 445732, 435596, 432780, 445388, 456616, 460046, 431507, 408158, 395750, 433612, 463433, 446049, 410537, 410902, 393042, 401464, 408024, 412480, 416884, 390701, 391468, 417751, 413720, 384785, 368959, 420374, 452979, 467738, 451663, 425294, 393882, 398144, 418363, 419036, 388871, 354025, 328546, 328121, 353963, 384050, 421612, 441540, 458387, 431919, 422613, 426180, 405184, 396781, 392123, 330553, 341439, 322513, 312758, 339083, 374896, 380339, 364496, 344114, 385977, 426697, 413531, 383856, 357216, 378360, 432863, 428998]
11453D28998k82q845m6602n942J0361k0620l612J1076O855r106R561k32J1621
11440C83231M3696k949K20j864J6974l0867k3218j5576N724K008K2061q795m2220
11427C48425K7895N2186K766J9941J8567j0661l3450k0208K4981L5504j969L835
11415D67812J8368J6522J0001n113j1923k0250m7628m4198J2907N5081j132M5770
11403D96217l0682l4070k158J6494K3492j5228k1954K8989J7435K1966K1339j2912
11391E08928k6007k429L5594k473j5493l6074j9735K0650R746j1418m958L7754
11379D94085K5315k0869r180j30J9061k7895n293k6098j3034k3004j1382J0562
11367D12138P545l1995l007L4242K3743J4970l681m701m1990j1260M0384K5436
$$ y = [428998, 428716, 419871, 373269, 367327, 377688, 357068, 353456, 364532, 371387, 362281, 371842, 371610, 383231, 426927, 423978, 424198, 422334, 439308, 408441, 385223, 369647, 375371, 377379, 399440, 390645, 348425, 376320, 428506, 431272, 451213, 469780, 459119, 425669, 405461, 430442, 465946, 463977, 467812, 486180, 502702, 512703, 507590, 495667, 475417, 427789, 383591, 396498, 451579, 450447, 496217, 465535, 431465, 429307, 445801, 469293, 454065, 432111, 461100, 478535, 500501, 521840, 508928, 482921, 480492, 516086, 513613, 498120, 462046, 442311, 462961, 472707, 461289, 456331, 494085, 519400, 498531, 489351, 489221, 508282, 480387, 475094, 448996, 435962, 412958, 401576, 412138, 419683, 387688, 384681, 418923, 442666, 457636, 453955, 449254, 407264, 396004, 436388, 461824]
11355D61824k9864j0535K0229J5418j445J7735L2489J1269l733K081j9677k0613
11343D75178J924j264N763k899j749o063J7589O489l811J4664J2866L8120K4810
11330E81617o539l8468m572J6814K1297k530k7223K8992J9541k5815k0723o302
11318E36089q661J4803J9835J5763k0363O337l3097o12L4254k3470L0564n875
11306E65567j8675j4246k8874q415l73L0395J5803j013l9196k6826L8999L2229
11294E45375r061J7387M324q786j2753k0901R215J1565M11l9646m605J6365J5551
11281E24441l942m5051j8966J7380L2832q722p632L7198l033k0982K0382L838
11269E27743J1226j2434j0356J5028M1024J1298L4778L2615K1119Q306j6712j3553
$$ y = [461824, 431960, 421425, 441654, 457072, 455627, 473362, 505851, 517120, 513387, 515468, 495791, 475178, 477102, 475838, 481601, 478702, 476953, 470890, 488479, 494968, 491157, 505821, 518687, 556807, 581617, 575078, 536610, 532038, 548852, 570149, 567619, 540396, 569388, 588929, 563114, 542391, 536089, 527428, 542231, 562066, 577829, 557466, 563803, 530706, 530094, 564348, 540878, 571442, 565567, 546892, 532646, 503772, 495357, 494984, 525379, 541182, 540169, 500973, 474147, 513146, 545375, 536314, 553701, 558025, 549239, 536486, 515585, 524800, 536365, 536776, 497130, 492525, 508890, 524441, 520499, 475448, 456482, 473862, 506694, 497972, 490340, 527538, 524505, 503523, 523905, 527743, 538969, 526535, 516179, 531207, 572231, 583529, 618307, 650922, 672041, 680347, 663635, 650082]
11257F50082J9393j292j5315k3272l4353L8576n183p081K1090L0066R232J0117
11245F92060O6067o305q419k0635O871K8424J6189q837j2269l7619l706n769n7592
11232F48460l1533k1642J3186M0280K7637J8207J1318k807K505K7499K0996L365
11220G57471Q749j9937m7174j9082n7532j3003Q057k3627m911j9283j3021j878
11208E54829J0906L5406M062J1247K8101k1306k1639J715o77q741j6145k5116
11196E52642O640J4327j5475o659M7060P635k4854j4355K4729J6460l5494N914
11184E78570o25j476J8922L4124J7448K5663J0290N100J2726J6452j5345l1386
11172F70463Q40K8742P355n786O038p561q160j051j2801K3369j1770O424m397
$$ y = [650082, 669475, 668183, 652868, 629596, 595243, 633819, 628636, 621555, 642645, 672711, 681943, 692060, 758127, 751822, 743403, 722768, 729639, 758063, 774252, 765415, 753146, 715527, 711821, 706052, 648460, 616927, 595285, 608471, 648751, 676388, 694595, 705913, 703106, 705611, 733110, 754106, 757471, 766220, 746283, 699109, 680027, 622495, 609492, 617549, 593922, 589011, 569728, 556707, 554829, 565735, 601141, 605203, 616450, 644551, 623245, 601606, 603321, 602644, 593903, 577758, 552642, 559282, 573609, 558134, 551475, 598535, 606170, 581316, 566961, 591690, 608150, 572656, 578570, 577945, 576469, 595391, 629515, 646963, 672626, 682916, 688016, 700742, 717194, 701849, 670463, 671303, 700045, 707400, 701614, 707652, 700091, 691931, 690880, 678079, 701448, 689678, 696102, 691705]
11159F91705J5481L3087j8884j2181j9623l0974J5512M0655J3582J1049j2153
11148G27256r991k2265j594j1172M5541j4083m1919L3307N9172K5960L5630J207
11136H27049l5953o86M1058Q386j9945M947M210L804j3143l6243n5828l1334K8936
11123G25258K9947K7830j7283j7106m5489P709O987m2771j2289l0489J5756j0872
11111F37188J8208L034J9577k4292K53O551K977J3819N615j9650L9527O7849Q186
11098G78842o4063k4547K5652j5227l9511k9815k9795j2722p380k0200k1624k2464
11086E17146K6348K3123M549J5024K6248j1587J3059m543l3239k2512q9K4838
11074E78365O850j3027K6230j7337K7097K7105K5963J7839J8857J8596n448m4301
$$ y = [691705, 707186, 740273, 721389, 709208, 689585, 658611, 674123, 714778, 728360, 739409, 727256, 717265, 695000, 693406, 682234, 727775, 713692, 671773, 705080, 764252, 790212, 825842, 827049, 791096, 790410, 831468, 839854, 819909, 824856, 829066, 832870, 819727, 783484, 727656, 696322, 725258, 755205, 783035, 765752, 748646, 703157, 710866, 717853, 675082, 662793, 632304, 648060, 637188, 655396, 658430, 678007, 653715, 653968, 660519, 663496, 677315, 682930, 663280, 702807, 770656, 778842, 714779, 690232, 715884, 700657, 661146, 631331, 601536, 588814, 581434, 561234, 539610, 517146, 543494, 566617, 571166, 586190, 612438, 600851, 613910, 609367, 576128, 553616, 553527, 578365, 585215, 572188, 598418, 581081, 608178, 635283, 661246, 679085, 697942, 716538, 711090, 666789]
11062F66789J7357L8294Q032j488k0875k2527j8986j8074k9226k3453l3004j9606
11050E43233J7845R279j4885q498k7011j0710p94N1826k0700j4578O620p957J4000
11037E37670k569n4758k4956l134l5262M1055j3499q872J8701m302N278J0204
11025D65556k8822J2694j7139k8710J756K6541J3137Q41l2645O648J3911O466
11013D40234j2463p024J807N966K4601J5597j3024l7251o3349M027R3851L3685
11001D86657j3252l3411R167J3509J7052J8291K7280j2372j3437k264L228Q333
10989E08781K7437J0851k0054j3477M568k0267k463P036r687n572K9150J4635
10977E30938r685m4525l0534M0113m238M323J1432n44j370P037L457l0730J6417
$$ y = [666789, 684146, 722440, 730472, 728984, 708109, 685582, 666596, 648522, 619296, 595843, 562839, 543233, 561078, 570357, 555472, 546974, 519963, 509253, 508459, 560285, 539585, 525007, 531627, 523670, 537670, 535101, 480343, 455387, 452253, 416991, 458046, 444547, 435675, 454376, 450074, 455352, 465556, 436734, 449428, 432289, 403579, 405335, 431876, 445013, 445854, 413209, 419857, 433768, 440234, 427771, 420747, 422554, 428520, 453121, 468718, 455694, 418443, 355094, 359121, 452972, 486657, 473405, 439994, 449161, 462670, 479722, 498013, 525293, 512921, 499484, 497220, 500448, 508781, 536218, 547069, 527015, 513538, 518106, 497839, 495376, 502412, 492725, 487153, 516303, 530938, 521253, 476728, 446194, 486307, 482069, 486392, 497824, 497280, 495910, 502947, 506404, 475674, 492091]
10964D92091J0440j4648j6589j394n856j4309K2796l172k6868K8465N949k5155
10952D51750M612k4394l6182J2602N2120K15m6707n1198q744K4408K7558k88L136
10939D08888L266j7085k1462J5341K0362J5503l378j9031j9417N6596K5286j8070
10927D46799k3621l0735L3031N021K6457p984l230L6527K1442r292m96k754l1357
10914D59808j3754R223L5881J8063j2307m527q240K7688j157k4279M552J3213
10902E04164k5549k5211L4011J4739j6778q196j1298k500o152k2322j5459p326
10890D12123k9603j3172l1045p746L862J5749k4284o1356K2990L6174K4150l2210
10878C15632m1105k1684J6965M3173l980P301M5847m509J1875K9203k827l8779
$$ y = [492091, 502531, 487883, 471294, 469900, 464044, 449735, 472531, 469359, 442491, 470956, 476905, 451750, 456362, 431968, 395786, 408388, 460508, 460723, 414016, 362818, 354074, 378482, 406040, 405752, 408888, 412154, 395069, 373607, 388948, 409310, 424813, 421435, 402404, 382987, 439583, 464869, 446799, 423178, 392443, 425474, 430495, 456952, 448968, 445738, 482265, 503707, 494415, 493919, 491165, 459808, 446054, 455277, 491158, 509221, 496914, 492387, 484147, 511835, 510678, 486399, 490951, 504164, 478615, 453404, 487415, 502154, 485376, 477180, 465882, 463382, 457230, 434908, 419449, 412123, 382520, 369348, 338303, 330557, 334419, 350168, 325884, 264528, 287518, 323692, 347842, 315632, 274527, 252843, 269808, 312981, 309001, 316302, 362149, 357640, 369515, 398718, 395891, 357112]
10866C57112K8631R454j3638l5216l8423o182k6982L4882N7486P619K6896r191
10854C92448J6582L39p845l2738K5201K2016J5202l6966k2981J6515N497K2800
10842D16070k106j1952k734J3848L1970m1128m3224m9453O279L4318M227j9004
10830C37111J3339L4373j1845l1208o0025m621L9401J9730J1261J1274L2942l9412
10818C52320k2696j3450n0265O637J3799j3716J5181n014K9848j8453l5986K5468
10806B83673k406l1104K2272M388J746j5892j1556j3353l8903k0035J3352M0030
10794B32212K6758K4612J7978j7209o105j5605K1105L192m0860j9279l3312J2545
10782B06032L3458N8905n6171n1961k9678j0247N1820K3532n474j6628j6569L4023
$$ y = [357112, 385743, 395197, 381559, 346343, 307920, 301738, 274756, 309638, 367124, 374743, 401639, 392448, 409030, 409369, 401524, 368786, 393987, 416003, 431205, 394239, 371258, 387773, 393270, 416070, 413964, 402012, 399278, 413126, 445096, 403968, 360744, 311291, 317570, 351888, 356115, 337111, 350450, 384823, 372978, 341770, 281745, 277124, 316525, 336255, 347516, 358790, 391732, 352320, 329624, 316174, 265909, 272546, 286345, 272629, 287810, 282796, 312644, 294191, 258205, 283673, 281267, 250163, 272435, 276823, 278569, 262677, 251121, 237768, 198865, 178830, 192182, 232212, 258970, 283582, 301560, 284351, 278246, 262641, 283746, 286938, 246078, 226799, 193487, 206032, 239490, 298395, 242224, 190263, 160585, 150338, 202158, 225690, 220216, 203588, 187019, 221042]
10770B21042j1346J273k0139J6172J5033J7152M5522r709o2546j7311K1767j9227
10758A97683m451J5200m856M1855J3739J2535M719m2467l150j2704J6892o777
10746B28218M454R996R457P245m0331l7449J7921O345k5150P874K2120M8774k5540
10733B33934j4206K6778k439p93Q557k1226n533M75l3650j6108o812j2802J5680
10720A71855O4444j7416m8357j0329j4189K4082K6070P635J7368N3568k5474l6155
10708B13102m640M0171Q554l6915J1230n187K805q403n1036J1057j4782l2969
10696A32987k055o370p622K324j3963L7667Q655q133P249K1223K5151J514k0093
10683A78534l8093J0373L5823K0581J5358J3678M002j556l3645N3Q4O21o623J0487
$$ y = [221042, 209696, 210969, 190830, 207002, 222035, 239187, 284709, 275000, 212454, 195143, 216910, 197683, 193232, 208432, 203576, 245431, 259170, 271705, 276424, 233957, 230807, 218103, 234995, 228218, 232672, 242668, 252125, 259370, 219039, 181590, 199511, 205856, 180706, 188580, 210700, 259474, 233934, 219728, 246506, 244067, 243274, 251831, 230605, 225072, 225547, 191897, 175789, 168977, 156175, 171855, 236299, 218883, 170526, 160197, 146008, 170090, 196160, 203795, 221163, 274731, 249257, 213102, 208462, 248633, 257187, 220272, 231502, 226315, 229120, 220717, 169681, 180738, 165956, 132987, 130932, 124562, 116940, 119264, 105301, 142968, 151623, 143490, 150739, 171962, 197113, 198627, 178534, 140441, 150814, 186637, 207218, 222576, 236254, 240256, 238700, 205055, 205108, 205192, 205813, 199190, 209677]
10669B09677k1946l2854Q508M3042K4644l3529j8164L0420K4113k2353l7408p67
10657A73383L3943L5455J9241q452m376m081j219o299j883r693k9764q922M959
10644A92292J6665L7904O268L076l5682o770P648l257k5927k8474j5000M0281
10632A89024J4799Q515o6598q3770r200L9699R880M0909L3875J9196l5333j1397
10620A49599L9714K93K0233r860p212K9581L9809r172p496m359k2256q796j948
10607B08130P347O0240N886k0752j5978L81p580j0694k4870J0026J7865R989j3978
10594B26012k1725j4203j7933K667K3104q377n1791J6138J8374K1226Q764k945
10582A99311l651J0752q762k5357K0266P364J0296l5805K2743N9926N622l0226
$$ y = [209677, 187731, 154877, 163385, 206427, 231071, 197542, 179378, 209798, 233911, 211558, 174150, 173383, 207326, 242781, 262022, 253570, 249194, 245113, 243894, 237595, 235712, 226019, 196255, 187333, 192292, 208957, 246861, 253129, 256205, 220523, 213753, 221401, 218144, 192217, 163743, 148743, 189024, 203823, 212338, 145740, 61970, 52770, 92469, 102349, 143258, 177133, 196329, 160996, 149599, 189313, 189606, 209839, 199979, 192767, 222348, 262157, 252985, 245489, 241130, 218874, 210078, 208130, 215477, 275717, 281603, 260851, 244873, 245254, 237674, 226980, 202110, 212136, 230001, 239990, 226012, 204287, 190084, 172151, 174818, 197922, 189545, 137754, 153892, 172266, 193492, 202256, 199311, 195660, 206412, 197650, 172293, 192559, 199923, 210219, 174414, 197157, 257083, 262705, 232479]
10570B32479O056r536j0505L222L3436R272R43l0199j9789J2443l942K4651M9097
10557B97628R96N972j1278K0M770j0815l0498j8765p07j6391p799P759J9938j8908
10543B21922j5416j8352k2257n446L0124K5012l05j5724k1178J6877k6167j2583
10531A56507r366n042k6684J6411n169Q759L530J8436N24j503J7319j4470p580
10518A51672Q493J9748r850j8562q665K1725k3775m969j7863L2220k799k3630
10506A23745O413K8617J334j5495m1434j6371j2476N1760L3556M5443J4280l49
10494B19023R460n287k4496n4989r397K9462l8778n974m32N065j7504j7717J0716
10481I9152N689J6853J009m4922l380N953P686k9467M1855J9138J9274J2855j0102
$$ y = [232479, 238535, 228999, 218494, 221716, 255152, 264424, 265367, 235168, 215379, 227822, 223880, 248531, 297628, 298624, 304596, 293318, 293338, 298108, 287293, 256795, 238030, 237323, 220932, 213133, 220892, 240830, 221922, 206506, 188154, 165897, 160451, 190575, 215587, 215282, 199558, 178380, 195257, 169090, 156507, 147141, 142099, 115415, 131826, 126657, 135416, 138946, 157382, 157906, 156403, 173722, 159252, 151672, 160165, 179913, 170063, 151501, 142836, 164561, 140786, 135817, 117954, 150174, 147375, 123745, 130158, 158775, 160109, 144614, 103180, 86809, 74333, 126093, 159649, 205092, 219372, 219023, 228483, 223196, 198700, 143711, 134314, 163776, 124998, 119024, 118592, 123657, 106153, 88436, 99152, 104841, 121694, 122703, 77781, 74401, 80354, 88040, 58573, 100428, 119566, 138840, 151695, 141593]
10468A41593L7265j3823K971j5615J472P017j0207j8813K9295K0011o226l8673
10456A36267k1527m101n44J4836K419j7424N195K8675j5653o007k5219j042p930
10443H7945r66O1559J9154j3442K0298K1156L7117K2213j2725L2432M6751o625
10431C14867j9279k7521m5971p850j5107m8222L465K6098j0733k5046L824L6979
10419A85504k07k6537K5375J3114j5316k9120k7057l735K9009K2280M667j3027
10407A64950j4428r571k8575K1454J9485Q315J7966m59l9213l7983L4301N7196
10395A93438l085j1144r271K1410R016o892r389l66Q411K5095K4970Q126j0558
10382B39761L3801K3392j338j6070n1595q569R106m3200n0540j74m748J4731K0018
$$ y = [141593, 178858, 165035, 168006, 152391, 153863, 160880, 150673, 131860, 161155, 181166, 174940, 136267, 114740, 110639, 110095, 124931, 127350, 109926, 115121, 143796, 128143, 122136, 96917, 95875, 87945, 86979, 148538, 167692, 154250, 174548, 195704, 232821, 255034, 242309, 274741, 321492, 314867, 295588, 268067, 222096, 214246, 199139, 150917, 154382, 180480, 169747, 144701, 148525, 185504, 185297, 158760, 184135, 197249, 181933, 152813, 125756, 122021, 151030, 173310, 177977, 164950, 150522, 140951, 112376, 133830, 153315, 161630, 179596, 179137, 139924, 101941, 136242, 193438, 190353, 179209, 169938, 191348, 200364, 193472, 184083, 183717, 192128, 217223, 242193, 250319, 239761, 273562, 296954, 295616, 279546, 227951, 219382, 228488, 185288, 134748, 134574, 129826, 144557, 164575]
10369A64575L3412P441L322m2183l8525K5094J9763p576k0998l03m721q565P3561
10356B04297K5838L8382j3559j4223m2215J326p398j448J955k5428p070L2600
10344A93057j389J8138J2502j7339l5640L16r515l1989j31J8698L8174J9918J4134
10331B18934j2711l132J7274L8341M0705J7564K6248K4614J1131n6713n8274r419
10319B54562j1301j4092K4460O2547K7364k4734l3009j1477n2508j5814L0843
10308B36841R810J7382K9088k6059l4624N365m658k0314K359L2013j2763J6620
10296B51060M0777j5558k1850K7249j2045l1011l9477K2759K5559m951N566K0799
10284B68877j7976k0847K9287K1195r289k16k7768k8564n449L929l615L1643L0261
$$ y = [164575, 197987, 205428, 208750, 166567, 128042, 153136, 172899, 165323, 144325, 144022, 139301, 130736, 204297, 230135, 268517, 254958, 240735, 198520, 199846, 192448, 191000, 192955, 167527, 160457, 193057, 191668, 209806, 222308, 204969, 169329, 169645, 160130, 128141, 128010, 146708, 184882, 204800, 218934, 206223, 203091, 220365, 258706, 299411, 316975, 343223, 367837, 378968, 322255, 263981, 254562, 243261, 229169, 253629, 316176, 343540, 318806, 285797, 274320, 221812, 205998, 236841, 246651, 264033, 293121, 267062, 232438, 237803, 233145, 212831, 215190, 247203, 234440, 251060, 291837, 276279, 254429, 281678, 269633, 238622, 199145, 221904, 247463, 242512, 248078, 268877, 250901, 230054, 259341, 280536, 271247, 271031, 243263, 214699, 209250, 213179, 209564, 241207, 271468]
10271B71468L492j2551k7692M611l7011j4068J2796Q173j0929k3743j4420N6331
10259B16457M2891o104j918n6678K692N0378J6952J0678Q3271M1154l873j907
10247C93993l4430j1455J5602p559j8438o6532j2279j6472l0046J9663j0454J0848
10235B32441j5030J5765J0133j3221k63K4751M4367k2469m1508k8782l4023k4438
10223A47723N0706L619j5547M576K9406j7163J3011J3919Q044L9618o216j7472
10211B54224n5688p539P94J331L3726K3832j477N4084k782m4351k7847j4423j3756
10198B00128Q419L410l0797k740Q766K0620J5027K930L9950l186j7138K5770L3391
10185C04550L2126J983l4632K625J555l984L1207N3424J5665O724J4551K5441
$$ y = [271468, 274960, 262409, 234717, 239328, 202317, 188249, 201045, 209218, 198289, 174546, 160126, 216457, 259348, 253244, 251326, 194648, 197340, 247718, 264670, 275348, 358619, 399773, 395900, 393993, 359563, 348108, 363710, 356151, 337713, 271181, 258902, 242430, 212384, 232047, 221593, 232441, 217411, 233176, 243309, 230088, 229825, 254576, 298943, 276474, 234966, 206184, 172161, 147723, 198429, 202048, 186501, 191077, 220483, 203320, 216331, 230250, 238294, 277912, 271696, 254224, 198536, 190997, 191791, 193122, 226848, 250680, 249203, 303287, 300505, 256154, 228307, 213884, 200128, 208547, 211957, 181160, 178420, 187186, 207806, 222833, 225763, 265713, 262527, 245389, 271159, 304550, 336676, 338659, 304027, 306652, 308207, 304223, 335430, 388854, 404519, 411243, 425794, 451235]
10173D51235l0411P885N4248L9597P6175L7289N5568R0466J60496J46098O2537
10162A151183m2364o1224m3747r5448j22795r4186p4718p8791l4790K2155j9593
10151E05682l7172o235K341k3378k529j1483R619j08j259j1522l0632j1043L8669
10138D20950J8467l988m772M611J6274j0611K9185l211m2400j4371j0215j4823
10126C85096J4652p868O169N381j1734J170p568j7449j9695L1232L5786k4876
10114C90296m2766J8398J5738j1613r310r581J2890M209o26n5J9466J929K22k466
10100C86731O038j1926m6741L999L0304L0640P162j8210o984j2678j6362M2075
10088C94048j7538k997K3132K8319q721J3938m1883J0427K681M6697L933M6117
$$ y = [451235, 420824, 428709, 482957, 522554, 598729, 636018, 691586, 782052, 942548, 1088646, 1151183, 1108819, 1047595, 1003848, 908400, 785605, 691419, 616701, 537910, 503120, 525275, 505682, 468510, 462275, 464616, 441238, 438709, 427226, 436845, 436737, 435478, 423956, 393324, 382281, 420950, 439417, 435429, 430657, 435268, 451542, 440931, 470116, 466905, 424505, 410134, 399919, 385096, 399748, 391880, 398049, 403430, 391696, 392866, 385298, 367849, 348154, 379386, 415172, 390296, 347530, 365928, 381666, 370053, 360743, 351162, 364052, 368261, 367635, 367580, 387046, 388975, 389197, 386731, 392769, 380843, 334102, 338101, 368405, 399045, 406207, 387997, 381013, 368335, 351973, 394048, 376510, 373513, 396645, 424964, 416243, 430181, 388298, 398725, 401406, 448103, 452036, 498153]
10076D98153j5792m5498J0168J4029J9073K0850J5074o430K1278O5085J1883k2168
10064E85705O158N9500J6764p928Q066J390M3398N9690Q3727R5423N8156L2953
10052A043002L6426P7951J25372J39552J68948J79035K35235K30472K05488K21319
10042B662800K29125J68637J48382J56477J46019J06145J46972J92532L30393
10033D287482N28038P79006J230850J854622K921626M225620M864965L316487
10025B4008696m74302l848374m542347l455555k191333j348558p22530k75087
10017G150610L5547K68585q9338p87464r35477p32367n26324l30224k85502j99609
10007C568437j39533j11685j02144o2239k8379m1376q7297r7497p5223L1577M315
$$ y = [498153, 482361, 436863, 447031, 461060, 480133, 500983, 516057, 509627, 530905, 595990, 607873, 585705, 591863, 651363, 668127, 660199, 668265, 669655, 713053, 772743, 856470, 951893, 1010049, 1043002, 1079428, 1157379, 1282751, 1422303, 1591251, 1770286, 2005521, 2235993, 2441481, 2662800, 2891925, 3060562, 3208944, 3365421, 3511440, 3617585, 3764557, 3957089, 4287482, 4815520, 5594526, 6825376, 8679998, 11601624, 15827244, 20692209, 24008696, 23534394, 19686020, 15143673, 11688118, 9496785, 8148227, 7425697, 7150610, 7186157, 7454742, 7365404, 6577940, 5642463, 4910096, 4383772, 4053548, 3768046, 3568437, 3428904, 3317219, 3215075, 3152836, 3124457, 3083081, 2995784, 2898287, 2823064, 2854641, 2858956]
9996B858956p210K1531K6680J8879k6877r3985j22430j21932j52095j41274r3424
9985B166819j00977j12947r7431o3961o3486j18032j08549l5283p1046j01432
9975A293675j08518r7937k4665p6546o6491l374p030j6641j5679m0729p7625n8315
9963G00125l9081j3158l3861j8685k6979k6495p185n2650m0474j5779j4175j9342
9951C92261k3992k8306R788m484O7m0146k2407l685J1J3008q508m7426j8654J5484
9937B33011L3824j593k2652k1839j4420R588n772R737J3737l6843m1408K5872
9925A81242L9527K8849j5826l3784P449N069P564L0731q459k4947l4729l6870
9913A45816j0157N852R484J6663l6726J303j606p067L3263n156k3542k715K018
$$ y = [2858956, 2851746, 2873277, 2899957, 2918836, 2891959, 2797974, 2675544, 2553612, 2401517, 2260243, 2166819, 2065842, 1952895, 1855464, 1791503, 1728017, 1609985, 1501436, 1466153, 1395107, 1293675, 1185157, 1087220, 1062555, 986009, 919518, 916144, 909114, 892473, 876794, 836065, 758440, 700125, 661044, 647886, 614025, 595340, 568361, 541866, 534681, 482031, 441557, 425778, 411603, 392261, 368269, 339963, 349751, 345267, 345334, 305188, 282781, 279096, 279107, 292115, 283607, 236181, 217527, 233011, 266835, 265242, 242590, 220751, 206331, 215919, 210147, 219884, 233621, 196778, 155370, 181242, 220769, 249618, 233792, 200008, 207457, 212526, 220090, 250821, 242362, 217415, 182686, 145816, 135659, 141511, 150995, 167658, 130932, 132235, 130629, 123562, 156825, 151669, 128127, 125412, 127430]
9900A27430J3693J3j7809M0216M8437L147l6290J2297L1308J5161l4578n3153
9888A49872l6567J1237L6978L3304M735J7528K5294M543l627j7786k3607O14k240
9875B00278L618j2295L619K4985K6385R487j2491m519K2583j2423m2129m0463
9863A66635K6399L1757k3486j6191k0086j8945k356N3225L6374m9393j3875J4514
9851A84572K199K0596k6880m467N0435L8k6640O832k3676K523J9943M2996L3120
9838B81591j353p682N050P242k6233n439K558j4644j6361j1434k2829L6436J8742
9825B45644L4193J06832O1771O8158Q9603J07935K4846n8541q1171r5096o8529
9814D35645m1184l9039m0723l0856m5898l6323K1763j5837m013R748o770o5619
$$ y = [127430, 141123, 141136, 123327, 163543, 211980, 215127, 178837, 191134, 222442, 237603, 203025, 149872, 113305, 124542, 161520, 194824, 199559, 217087, 242381, 246924, 243297, 225511, 201904, 202518, 200278, 203896, 191601, 195220, 220205, 246590, 256077, 243586, 239067, 261650, 249227, 207098, 166635, 193034, 224791, 201305, 185114, 165028, 146083, 143727, 196952, 233326, 183933, 170058, 184572, 186771, 207367, 180487, 176020, 226455, 226493, 199853, 206685, 183009, 185532, 205475, 248471, 281591, 280238, 272556, 277606, 284848, 258615, 253176, 255734, 241090, 224729, 213295, 190466, 226902, 245644, 279837, 386669, 448440, 516598, 606201, 714136, 738982, 680441, 599270, 504174, 435645, 394461, 355422, 314699, 283843, 237945, 201622, 223385, 207548, 203535, 213283, 206513, 140894]
9802A40894k6481K4543O2292k7385j9234L672L6821q696k3910j6949J7792J8109
9790A81468k7482L0527L5268K3405K728j2385J3705K0896p171k8263j5267K7476
9778B44905k2271k3604J2149r433l129K9532K6239p391j0006j1783q0327j3538
9766A31343L9835j0655o112L691K5225J1303k7024l5867J49j7753q492j1616J8166
9753A12193J4601L4433n103J91L610k2721K5692k778l8643j0259l0260l8273J048
9740D3731N640K4608K2971o0076K5020L1466l6062O520M4760J0374k005J6470
9728A33417N0550N3445j7563j6620L3832O516N093j3410K5759K6952M6435L9904
9716C74310M9326L8596m0059o0342k7189R132j2920j4159K6090J2805k2055n7500
$$ y = [140894, 114413, 138956, 201248, 173863, 154629, 158301, 195122, 186426, 162516, 145567, 163359, 181468, 153986, 184513, 219781, 243186, 245914, 233529, 247234, 268130, 260959, 232696, 217429, 244905, 222634, 199030, 211179, 201746, 198617, 228149, 254388, 246997, 236991, 225208, 144881, 131343, 171178, 160523, 154411, 158102, 183327, 194630, 167606, 131739, 131888, 114135, 105643, 94027, 112193, 126794, 161227, 156124, 156315, 159925, 137204, 162896, 160118, 121475, 111216, 80956, 42683, 43731, 49371, 73979, 96950, 36874, 61894, 93360, 57298, 63818, 108578, 118952, 116947, 133417, 183967, 237412, 219849, 203229, 237061, 243577, 248670, 235260, 261019, 287971, 334406, 374310, 423636, 462232, 422173, 361831, 334642, 343774, 330854, 316695, 342785, 355590, 333535, 276035]
9704B76035o2444r539P838J805k591j2849l8502J1072P791K151q782N071K031
9691A79087J4855J4676j4013k6911j3054k184J850N836L2998K1253m8954o1762
9679A03677j5107K5713K9317J6423p576j0576l0370m1962L807M516k2091n738
9667E0033J4860P277J2377O221k307j6544K8922K7905l2554j508j6360l3194l911
9654D1217K633p559j8207J2389j022R077J8188r247j6474Q085J2723j5769l2898
9641C136J5222J8700J0850N308J6858k4906l3841l0387j364L6387J1422p425J261
9628B1221L2728p81P968j5713K9022J091L776R550k3934j5356O373L218J1020
9615G0183L1580N8389K7897K2476K1325m2769o1476k9250m2144j1119p870J8433
$$ y = [276035, 213591, 204052, 211890, 213695, 211104, 198255, 159753, 170825, 178616, 180767, 171985, 177056, 179087, 193942, 208618, 194605, 167694, 154640, 152456, 154306, 160142, 193140, 214393, 165439, 103677, 88570, 114283, 143600, 160023, 152447, 141871, 111501, 69539, 73346, 77862, 55771, 50033, 64893, 72170, 84547, 90768, 88461, 71917, 100839, 128744, 96190, 94682, 78322, 45128, 41217, 43850, 36291, 18084, 30473, 29451, 38528, 56716, 47469, 30995, 39080, 51803, 36034, 3136, 18358, 37058, 47908, 53216, 70074, 45168, 11327, -19060, -20424, 15963, 27385, 19960, 21221, 53949, 53168, 61136, 45423, 74445, 75536, 79312, 88862, 64928, 49572, 55945, 59163, 70183, 101763, 160152, 188049, 210525, 231850, 189081, 127605, 98355, 56211, 45092, 37222, 55655]
9603E5655n647o442J1625J9363J2908j6997k2502J9126L8273Q020k0270J3592
9591A06704O25k8752n018J9183l3712l2373K134K496Q843K6912k2017q441R841
9578D6425r5n371K2067N24n452j0031K9686k5220m918N992j4175L2362j8715m4749
9564H330m434M1166J2808L868J547q499J6090r424n500K0598L1968K0612l5402
9551I3728m3723j3280K5344J6691L3985M582j1706o909j9495j3012m6057O6170
9539H6318N1291l2470m1047P367k66j7103m7347p420K5901K0068m864N719k9437
9526A6710l1188J8102K8185O781K5309P6257J2405l2075R503Q418j9046k7903
9514I1458J4588k6556k8952k4727j9522K355J1478o877l5261q831j4060k774K1913
$$ y = [55655, 50008, 43566, 55191, 74554, 87462, 70465, 47963, 67089, 105362, 113382, 93112, 106704, 107329, 78577, 73559, 92742, 59030, 26657, 28791, 31287, 40130, 67042, 45025, 36584, 46425, 46330, 40959, 63026, 63550, 58098, 48067, 77753, 52533, 47615, 53607, 39432, 71794, 53079, 8330, 3896, 45062, 57870, 61738, 63285, 54786, 70876, 61452, 55952, 76550, 108518, 129130, 93728, 50005, 36725, 62069, 78760, 112745, 117327, 105621, 98712, 79217, 66205, 20148, 86318, 137609, 105139, 64092, 71459, 71193, 54090, 6743, -677, 25224, 45292, 40428, 46147, 16710, -14478, 3624, 31809, 38590, 63899, 140156, 152561, 120486, 129989, 138407, 119361, 91458, 106046, 79490, 50538, 25811, 6289, 8644, 20122, 13245, -22016, -30847, -44907, -47681, -25768]
9501b5768L6830R594L8152n049N468J1916r350J1167Q362k9057j7498J5096L5369
9488H5232M378k6418l2853j8515q393K6706L4065J4167l2231P797n608L368K8578
9475H0273l4617j4319m829J5010p526k0902m745L1117N514l0893k2249K1406K0801
9462C4041j3461q727J81k026N5471n803k2013j8248j1944k1491j139J9018K6897
9449C0756J7837j3116j8495K1470J6782j1777Q352K5858k3122l0401O08l1185
9437f433J9018m078l750O766O473k3385P802K2968m897q350K3295p382j0039n5807
9423c7799M383J3641K0302O59q443l088k800J1474P377m9359n852J5566O914L4141
9409G116j9175K1096j4091J0382P433j4861k4134k2757K4555K5930J0801O8l3645
$$ y = [-25768, 11062, 20656, 58808, 53759, 59227, 71143, 61793, 72960, 81322, 52265, 34767, 49863, 85232, 89610, 63192, 30339, 11824, 3431, 30137, 64202, 78369, 46138, 53935, 48327, 51695, 80273, 45656, 31337, 26508, 41518, 33992, 13090, 8345, 39462, 44976, 14083, -8166, 13240, 34041, 20580, 11853, 12034, 10008, 65479, 59676, 37663, 19415, 7471, -14020, -15159, 3859, 30756, 48593, 35477, 16982, 38452, 55234, 43457, 51809, 77667, 54545, 24144, 24752, -6433, 12585, 8507, 4757, 11523, 17996, -5389, 2413, 25381, 20484, 12134, 35429, 28047, 18008, -37799, -33416, -19775, 527, 1186, -7257, -10345, -13145, -1671, 5706, -43653, -49505, -33939, -27025, 7116, -12059, 9037, -5054, 5328, 12761, -2100, -26234, -48991, -24436, 1494, 12295, 12363, -21282]
9396b1282p342j4061K3183J1064L0360k7814N337J2737l64p753R04k8573J3807
9383i797L9085L2589k4704m9349p778L0033q921O914j4147J96M6726k2827m3008
9370b4988j9446O6899M8482o194p4617l0451k679n552L2224N1746J2921j1372
9358C6973K3562J2300l7775n281J5826J2460k356k4827r583k5400O903J3043K3777
9345C9622R142k033J1975l9734j8812M672K9474q991J7681L527j5394l191q330
9332A9608K7846k7185l4183K896K4482Q826K2679J2103l0881J4637J2057R668
9320F2553K2647k6162o0225j9831R893k8604K0543K9761j6236l3357j5599O0079
9308E462J3185K1753L694k1118j6299o01K3548K3308J4655M3844K2677K602l3560
$$ y = [-21282, -28624, -42685, -19502, -8438, 21922, -5892, -555, 12182, 11818, 4065, 4969, -23604, -9797, 29288, 61877, 37173, -12176, -19954, 10079, 1158, 8072, -6075, -5879, 40847, 18020, -24988, -44434, 22465, 70947, 64753, -9864, -40315, -42994, -48546, -16322, 35424, 48345, 36973, 60535, 72835, 35060, 29779, 45605, 58065, 55709, 30882, 21299, -4101, 2802, 15845, 39622, 48764, 46731, 58706, 18972, 160, 4832, 34306, 25315, 42996, 46523, 31129, 27938, 19608, 47454, 20269, -13914, -11018, 13464, 22290, 44969, 57072, 26191, 40828, 52885, 62553, 85200, 59038, -1187, -21018, -11125, -39729, -19186, 10575, -5661, -39018, -54617, 5462, 18647, 40400, 44094, 22976, 6677, 6076, 29624, 52932, 67587, 111431, 134108, 136710, 103150]
9295A03150l7109j9137J4540j2545l5811m454J2629K8669J41l8091j7797p379
9283a3194J3916L4334j0172k4333J8785j231j651J5129j4692J8604k1189o165
9271H141p154o731l0456j9419L0227K2201j1162j2853L2376N4058k0505n1926
9259a3203j3233P9638R995j6102j4149l082j7798m5648p641J4539L9477J5423
9247B8216k2961k9834J831j432j0394L2501K6111O291l8879k8944j0327K7543
9235b0278L2693R464n484J4277K1096M2470o396k1969j2296j4144j440K034l3890
9222F137r629j2488r075Q40J5062K1776J7583j7921K8468j4558k1105P102j2237
9209d5K306K1953j2110K7157K3525k0254R805j2186j4195l7676j4514j3266K3633
$$ y = [103150, 66041, 46904, 61444, 48899, 13088, 8634, 21263, 49932, 50073, 11982, -5815, -13194, 722, 35056, 24884, 551, 19336, 18105, 16454, 31583, 16891, 35495, 14306, 8141, 987, -5744, -36200, -55619, -25392, -3191, -14353, -27206, 5170, 59228, 38723, -13203, -26436, 53202, 63197, 47095, 32946, 29864, 12066, -33582, -41223, -26684, 12793, 28216, 5255, -24579, -22748, -24180, -34574, -2073, 24038, 30329, -8550, -37494, -47821, -20278, 12415, 21879, 16395, 30672, 51768, 94238, 87842, 65873, 53577, 39433, 37993, 40027, 6137, -3492, -15980, -25055, -24215, -9153, 12623, 30206, 12285, 40753, 26195, 5090, 12192, -45, 2261, 24214, 12104, 39261, 62786, 42532, 52337, 40151, 25956, -11720, -26234, -39500, -15867]
9196a5867N595P785l93j0235m445j3536L4214M0441n842j8399P75L571p729q156
9182G779k2068o451J8741M0059K1664l5989M400K0439j4678p749K1919j9598p9993
9169e1525k6715N5752P882N698M627k1490j8825k5303Q258J8440K8573J1787j8969
9156b1810J6319M0234Q443n107L9113K7726k8307n2822J2052J0999q017J1860
9144E0683j6168m226l2715M540J6481j112j6115j8829L6300q281j3945K909J9115
9131A8637j8384k3832J3133L0412L05k3447j476l2000l1364M3601N880J0866L6728
9118B9059m6740k0197k5682K0193J3512R175R945k103r0j5390J0694J3090J4066
9105I532J7078j0215j53M487n6373M058L8987K2521N891j1662o535k141L727K5970
$$ y = [-15867, -10272, -2487, -2880, -13115, -17560, -31096, 3118, 43559, 37717, 19318, 20093, 23664, 15935, 7779, -14289, -20740, -1999, 38060, 59724, 23735, 28135, 48574, 33896, 26147, 48066, 28468, -51525, -78240, -22488, -14606, -8908, -4281, -25771, -44596, -69899, -61641, -43201, -14628, -2841, -21810, -5491, 34743, 43186, 38079, 77192, 104918, 76611, 23789, 35841, 46840, 38823, 50683, 34515, 30289, -2426, 2114, 18595, 17483, 1368, -17461, 18839, 10558, -3387, -478, 18637, 253, -23579, -10446, 19966, 20271, -3176, -4652, -36652, -68016, -24415, -18535, -7669, 29059, -17681, -37878, -63560, -43367, -29855, -20680, -10735, -12838, -12928, -28318, -17624, -4534, 9532, 26610, 16395, 16242, 20729, -35644, -31586, 7401, 29922, 35813, 24151, 17616, 15475, 19202, 45172]
9091D5172J032k3073j679l0235k6687K1167K5457J9681L802K238J3663q584R507
9078E1461J3785J1530M369m6340j1913p347j2742J3295N771j6277J4514r50j641
9065A7515J028P198j5840K476r741j971l330K95K4155j322k1197r18R515K8422
9051C6285k4477m4798j4457P056K2139L9516j93p090K0112K1441J634l6864j031
9038A9273k8841q031k5791l772K3657j9695L6593J7959p631J2466O940q183J6043
9025C0987p97p457P236J1210k1410l0092J0918K4438J6730q236j3109k5123J3898
9012I193j4256r844q1o657K9214k975j5807K2160J384j0383l295O084M4116J0272
8998E9125j7962K8527K8596k0655r869j6933l374j0054M866o473J4665K0023k0706
$$ y = [45172, 46204, 23131, 21452, -8783, -35470, -14303, 11154, 30835, 34637, 36875, 50538, 41954, 51461, 65246, 76776, 81145, 34805, 22892, 15545, 2803, 16098, 21869, 5592, 20106, 19156, 17515, 18543, 25741, 9901, 12377, 2636, 665, -2665, -2370, 21785, 20463, -734, -1652, 7863, 36285, 11808, -32990, -47447, -40391, -18252, 21264, 21071, 13981, 34093, 55534, 57168, 20304, 19273, -9568, -17599, -43390, -47162, -23505, -43200, -6607, 11352, 3721, 16187, 23127, 14944, 30987, 30190, 22733, 29969, 41179, 19769, -10323, 595, 25033, 41763, 33527, 20418, -4705, 9193, -5063, -14907, -14988, -21645, 7569, 4594, -11213, 10947, 12331, 1948, -1347, 4737, 48853, 59125, 41163, 69690, 98286, 77631, 67762, 50829, 47455, 37401, 42267, 35794, 50459, 70482, 49776]
8985D9776j6976L277J919K0539k4119m2987n776J6638K1370M0112q278L8205j8022
8972G5678m902K7443k7468J13O392J9198J8822j5991l8399M870k069L6200L7580
8959A37467r961j5815k1448l473P309j1131N182p4k2968j6827r300o192M4622
8946G7391M6003M7371M7428J04043J19231Q5376J9790n5280j32575p3528n5990
8935B29260l0706l6901k5491J4526k4724O969j6151j9345l571M5944j4946j331
8923A23533r117J8756L845l8521k724L1437q4r434K5422J8373P449N4547M8404
8910B71886m713j0583l1133n28J3098K2167L7468M0270N168K3657J12092Q1994
8898E60843J40522K02463J73227J1758j65024k14350j31429o2339p3487p1138
$$ y = [49776, 32800, 36077, 37996, 58535, 34416, -8571, -14347, 2291, 23661, 63773, 55495, 93700, 75678, 70776, 98219, 70751, 70864, 77256, 96454, 115276, 99285, 60886, 65756, 63687, 99887, 137467, 127506, 111691, 90243, 86770, 94079, 82948, 88130, 88056, 65088, 48261, 38961, 32769, 77391, 123394, 170765, 218193, 322236, 441467, 526843, 546633, 491353, 358778, 285250, 229260, 198554, 161653, 136162, 150688, 125964, 132933, 116782, 97437, 93866, 139810, 124864, 123533, 114416, 133172, 137017, 98496, 95772, 127209, 127125, 117691, 143113, 161486, 168935, 223482, 271886, 267173, 256590, 225457, 224929, 238027, 260194, 297662, 337932, 343100, 366757, 478849, 560843, 701365, 903828, 1077055, 1088813, 923789, 709439, 578010, 515671, 442184, 371046]
8888C71046o0070o520k262n0491n88l2346l4576k6338n584J6941n652K0864K3536
8875B07960K7045L344l2489j4382j5422j6679R469K4360J3898O3666m92m4545
8863B25733j3503K4234j5245l3011J2430J1343k6642J0752K3356N5913Q4183J36583
8851D96126J16202K6124q3235j04708m6911k7984m9117l3851p665K1164M1010
8840C47155k253J462K1553k7801o9889n6002k8259l3288r175m257O358J3982J3412
8827A72998k2755l4699m001j3508j6877J5945k9798k1338o974J1659M5058J3201
8815A08911o727K5454J4669J3144L0567O0144J650j0029k7057N639J7638k0596
8803B13407m5337j5210J3262L3117j7064j2483M2212N5525Q6342P3995M0314l4569
$$ y = [371046, 310976, 304456, 302194, 251703, 251115, 218769, 184193, 157855, 152271, 169212, 163560, 184424, 207960, 235005, 238349, 205860, 191478, 176056, 159377, 168846, 193206, 207104, 270770, 270278, 225733, 212230, 236464, 221219, 188208, 200638, 211981, 185339, 196091, 219447, 275360, 359543, 496126, 612328, 638452, 555217, 450509, 403598, 375614, 326497, 292646, 284981, 306145, 347155, 344902, 346364, 367917, 340116, 270227, 214225, 185966, 152678, 143503, 139246, 145604, 159586, 172998, 150243, 115544, 111543, 98035, 81158, 97103, 67305, 45967, 38993, 50652, 95710, 108911, 102184, 127638, 142307, 155451, 186018, 246162, 247812, 237783, 210726, 216365, 234003, 213407, 168070, 152860, 166122, 199239, 182175, 169692, 211904, 267429, 353771, 427766, 468080, 433511]
8791D33511n5286n8548j5174o9288o5779J2147O436j4911j8744m2086r297m723
8779I8258J2812J7949M844m3960K6888q785m6330L509M427M3677k709J2208J9885
8766A42673K5269q783N9047L8962k1336l721q967n441K31J524k4219n4027l8300
8753A02912r642K8491O066L3978O6133M7898N414J3885j6508r0141n1883o327
8741A30276q12n450m861L0261r371l9790n0717J3734N841K2696J7763q38N113
8728A13845n236N4429N575k7146k1706n392J5655j9037m3214J0134K5132J467
8716A04506K2516O105J2381J3006k2625k3446N929n235O142J8830j4317n784O050
8703A24058J0448j9585n764k146k4451r635k0473q873M8326K1467R191O701j826
$$ y = [433511, 378225, 319677, 304503, 235215, 169436, 181583, 188019, 173108, 154364, 112278, 102981, 98258, 111070, 129019, 133863, 89903, 116791, 108006, 61676, 65185, 69612, 113289, 110580, 122788, 142673, 167942, 159159, 218206, 257168, 235832, 232111, 223144, 217703, 217934, 219458, 195239, 141212, 102912, 93270, 121761, 127827, 161805, 227938, 275836, 281250, 295135, 278627, 188486, 136603, 130276, 129464, 124014, 119153, 149414, 140043, 100253, 49536, 63270, 69111, 91807, 109570, 108732, 113845, 108609, 163038, 168613, 141467, 119761, 114369, 130024, 110987, 67773, 77907, 103039, 104506, 127022, 133127, 145508, 158514, 135889, 112443, 118372, 113137, 119279, 138109, 123792, 118008, 124058, 134506, 114921, 109157, 107011, 82560, 72925, 52452, 43579, 91905, 113372, 122563, 129264, 127438]
8690A27438N66R902j559j0501j2984J5772j149Q932J3541j4705o887l1457k9512
8677F7397k7723k672K728J9571J8686Q592J7059J0245J415m586K1792K86j0544
8664A22246k7636l581M466J2070L8701L4024j2155J7119N035k6459m5423k786
8652A15621k8925J6525K6169J6996K4161K2415M1179L5281M3157J802L950J1942
$$ y = [127438, 128004, 137906, 136347, 125846, 112862, 128634, 127485, 136417, 149958, 135253, 128366, 96909, 67397, 39674, 37002, 39730, 59301, 77987, 86579, 103638, 113883, 115298, 110712, 132504, 132790, 122246, 94610, 91029, 95495, 107565, 146266, 180290, 168135, 185254, 190289, 163830, 118407, 115621, 86696, 103221, 129390, 146386, 170547, 192962, 234141, 269422, 312579, 314381, 318331, 330273]
$$ [...]
##END NTUPLES=NMR SPECTRUM
##END=
