##TITLE=Analysis number 312892
Compound Code cc 03601
Book Reference 451/21
Project Code adrs
Chemist Name evam
##JCAMPDX= 6.0         $$ Bruker NMR JCAMP-DX V2.0
##DATA TYPE= NMR SPECTRUM
##DATA CLASS= NTUPLES
##ORIGIN= Bruker BioSpin GmbH
##OWNER= NMR
$$ XWIN-NMR		Version 3.5
$$ Wed Aug 17 12:59:00 2005 GMT Daylight Time (UT+1h)  MAYBRIDGE\NMR@NMR_250MHZ
##.OBSERVE FREQUENCY= 250.131544655141
##.OBSERVE NUCLEUS= ^1H
##.ACQUISITION MODE= SIMULTANEOUS (DQD)
##.ACQUISITION SCHEME= undefined
##.AVERAGES= 16
##.DIGITISER RES= 18
##SPECTROMETER/DATA SYSTEM= dpx250
##.PULSE SEQUENCE= zg30
##.SOLVENT NAME= DMSO
##.SHIFT REFERENCE= (INTERNAL, DMSO, 0, 16.522)
##AUDIT TRAIL= $$ (NUMBER, WHEN, WHO, WHERE, WHAT)
$$ ##TITLE= Audit trail, XWIN-NMR		Version 3.5
$$ ##JCAMPDX= 5.01
$$ ##ORIGIN= Bruker BioSpin GmbH
$$ ##OWNER= NMR
$$ C:\u/data/dgb/nmr/ADRS/8090/pdata/1/auditp.txt
$$ ##AUDIT TRAIL=  $$ (NUMBER, WHEN, WHO, WHERE, WHAT)
(   1,<2005-08-17 12:58:39.48 +100>,<MAYBRIDGE\NMR>,<NMR_250MHZ>,
      <created by zg, POWCHK disabled, PULCHK disabled
       configuration hash MD5:
       62 19 C7 07 E1 42 D1 B7 37 6C 3D D0 77 39 F9 E6
       data hash MD5: 64K
       F9 1F 90 05 D7 16 A3 E7 43 33 76 37 37 0A 63 BF>)
(   2,<2005-08-17 12:58:50.81 +100>,<MAYBRIDGE\NMR>,<NMR_250MHZ>,
      <Start of raw data processing
       ef LB = 0.3 FT_mod = 6 PKNL = 1 SI = 32K 
       data hash MD5: 32K
       67 25 14 EB 82 C7 FD E4 95 3D AD D8 EA E7 A8 25>)
(   3,<2005-08-17 12:58:52.85 +100>,<MAYBRIDGE\NMR>,<NMR_250MHZ>,
      <apk 
       data hash MD5: 32K
       30 DC 20 94 E5 B4 58 34 C3 33 F8 ED A2 12 54 82>)
(   4,<2005-08-17 12:58:54.01 +100>,<MAYBRIDGE\NMR>,<NMR_250MHZ>,
      <abs ABSG = 5 
       data hash MD5: 32K
       8E CB 16 E2 55 4D 03 95 F5 97 64 5B B1 74 82 9B>)
$$ ##END=
$$ 
$$ hash MD5
$$ DC 73 DA 41 17 AD 0F C1 C2 41 04 2F 2C 1A 62 01
##$RELAX= 
##$RELAX= 
##$RELAX= 
##$RELAX= 
##$RELAX= 
##$RELAX= 
##$RELAX= 
$$ Bruker specific parameters
$$ --------------------------
##$DU= <C:\u>
##$EXPNO= 8090
##$NAME= <ADRS>
##$PROCNO= 1
##$TYPE= <nmr>
##$USER= <dgb>
##$AMP= (0..31)
100 100 100 100 100 100 100 100 100 100 100 100 100 100 100 100 100 100 
100 100 100 100 100 100 100 100 100 100 100 100 100 100 
##$AQSEQ= 0
##$AQ_mod= 3
##$AUNM= <au_zg>
##$AUTOPOS= <25 >
##$BF1= 250.13
##$BF2= 250.13
##$BF3= 250.13
##$BF4= 250.13
##$BF5= 500.13
##$BF6= 500.13
##$BF7= 500.13
##$BF8= 500.13
##$BYTORDA= 1
##$CFDGTYP= 0
##$CFRGTYP= 5
##$CHEMSTR= <none>
##$CNST= (0..31)
1 1 145 1 1 1 1 1 1 1 1 1 1 1 1 1 1 1 1 1 1 1 1 1 1 1 1 1 1 1 1 1 
##$CPDPRG= <>
##$CPDPRG1= <>
##$CPDPRG2= <>
##$CPDPRG3= <>
##$CPDPRG4= <mlev>
##$CPDPRG5= <mlev>
##$CPDPRG6= <mlev>
##$CPDPRG7= <mlev>
##$CPDPRG8= <mlev>
##$CPDPRGB= <>
##$CPDPRGT= <>
##$D= (0..31)
0 1 0 0 0 0 0 0 0 0.06 0 0 0 0 0 0 0.0002 0 0 0 0 0 0 0 0 0 0 0 0 0 0 
0 
##$DATE= 1124279918
##$DBL= (0..7)
120 120 120 120 120 120 120 120 
##$DBP= (0..7)
150 150 150 150 150 150 150 150 
##$DBP07= 0
##$DBPNAM0= <>
##$DBPNAM1= <>
$$ [...]
##$SUBNAM7= <"">
##$SUBNAM8= <"">
##$SUBNAM9= <"">
##$SW= 20.6930455092707
##$SWIBOX= (0..15)
0 0 3 0 0 0 0 0 0 0 0 0 0 0 0 0 
##$SW_h= 5175.983436853
##$TD= 65536
##$TD0= 1
##$TE= 295.16
##$TE2= 300
##$TE3= 300
##$TEG= 300
##$TL= (0..7)
0 120 120 120 120 120 120 120 
##$TP= (0..7)
150 150 150 150 150 150 150 150 
##$TP07= 0
##$TPNAME0= <>
##$TPNAME1= <>
##$TPNAME2= <>
##$TPNAME3= <>
##$TPNAME4= <>
##$TPNAME5= <>
##$TPNAME6= <>
##$TPNAME7= <>
##$TPOAL= (0..7)
0.5 0.5 0.5 0.5 0.5 0.5 0.5 0.5 
##$TPOFFS= (0..7)
0 0 0 0 0 0 0 0 
##$TUNHIN= 0
##$TUNHOUT= 0
##$TUNXOUT= 0
##$USERA1= <user>
##$USERA2= <user>
##$USERA3= <user>
##$USERA4= <user>
##$USERA5= <user>
##$V9= 5
##$VALIST= <valist>
##$VCLIST= <CCCCCCCCCCCCCCC>
##$VD= 0
##$VDLIST= <DDDDDDDDDDDDDDD>
##$VPLIST= <PPPPPPPPPPPPPPP>
##$VTLIST= <TTTTTTTTTTTTTTT>
##$WBST= 1024
##$WBSW= 4
##$XGAIN= (0..3)
0 0 0 0 
##$XL= 0
##$YL= 0
##$YMAX_a= 279476
##$YMIN_a= -317240
##$ZGOPTNS= <>
##$ZL1= 120
##$ZL2= 120
##$ZL3= 120
##$ZL4= 120
##$ABSF1= 16.522
##$ABSF2= -4.171173
##$ABSG= 5
##$ABSL= 3
##$ALPHA= 0
##$AQORDER= 0
##$ASSFAC= 0
##$ASSFACI= 0
##$ASSFACX= 0
##$ASSWID= 0
##$AUNMP= <proc_1d>
##$AZFE= 0.1
##$AZFW= 0.1
##$BCFW= 0
##$BC_mod= 0
##$BYTORDP= 0
##$COROFFS= 0
##$CY= 12.5
##$DATMOD= 1
##$DC= 0
##$DFILT= <>
##$DTYPP= 0
##$F1P= 14.0000005364418
##$F2P= -0.99999901652339
##$FCOR= 0.5
##$FTSIZE= 32768
##$FT_mod= 6
##$GAMMA= 0
##$GB= 0
##$INTBC= 1
##$INTSCL= 1
##$ISEN= 128
##$LB= 0.3
##$LEV0= 0
##$LPBIN= 0
##$MAXI= 10000
##$MC2= 0
##$MEAN= 0
##$ME_mod= 0
##$MI= 0
##$NCOEF= 0
##$NC_proc= -3
##$NLEV= 6
##$NOISF1= 0
##$NOISF2= 0
##$NSP= 0
##$NTH_PI= 0
##$NZP= 0
##$OFFSET= 16.522
##$PC= 1
##$PHC0= -87.65248
##$PHC1= 11.33216
##$PH_mod= 1
##$PKNL= yes
##$PPARMOD= 0
##$PSCAL= 4
##$PSIGN= 0
##$REVERSE= no
##$SF= 250.13
##$SI= 32768
##$SIGF1= 0
##$SIGF2= 0
##$SINO= 400
##$SIOLD= 32768
##$SREGLST= <1H.DMSO>
##$SSB= 0
##$STSI= 32768
##$STSR= 0
##$SW_p= 5175.98343685301
##$SYMM= 0
##$S_DEV= 0
##$TDeff= 65536
##$TDoff= 0
##$TI= <Analysis number 999999
Compound Code 99
Book Reference 9
Project Code 9>
##$TILT= no
##$TM1= 0
##$TM2= 0
##$TOPLEV= 0
##$USERP1= <user>
##$USERP2= <user>
##$USERP3= <user>
##$USERP4= <user>
##$USERP5= <user>
##$WDW= 1
##$XDIM= 32768
##$YMAX_p= 386319172
##$YMIN_p= -310860
$$ End of Bruker specific parameters
$$ ---------------------------------
##NTUPLES= NMR SPECTRUM
##VAR_NAME=  FREQUENCY,     SPECTRUM/REAL,   SPECTRUM/IMAG
##SYMBOL=    X,             R,               I
##VAR_TYPE=  INDEPENDENT,   DEPENDENT,       DEPENDENT
##VAR_FORM=  AFFN,          ASDF,            ASDF
##VAR_DIM=   32768,         32768,           32768
##UNITS=     HZ,            ARBITRARY UNITS, ARBITRARY UNITS
##FACTOR=    0.157963299565203, 1,           1
##FIRST=     4132.6476996994, 0,             0
##LAST=      -1043.33573715361, 0,           0
##MIN=       -1043.33573715361, -310860,     0
##MAX=       4132.6476996994, 386319172,     0
$$ Real data points
##PAGE= N=1
##DATA TABLE= (X++(R..R)), XYDATA
$$ [...]
18367e8785L965N917l693j4960J9961N683O819J0223K497J1352m3231m37K8852
18354b5837j7952l02K8869n585J2438Q968r129l0836M908N386m3737l0236L077
18341i9968l662K7007L2851l4484j6916J0527J0089J195K2549N2285P2612N6438
18329A30523R5460R1964L5090n456Q49l945m572j5955k4398N6238O1572K3814
18317D41184l523k2084o8735o7952r1661j1700o514k7499o8186m5210l0224j5575
18305a7679j0414k94Q442j1990j8503j6041j3238k3635m697K4145K1212J2935
18293d9757O367k0881m447M3706L5929K632J169l8195j4742J0284l7733m2524
18281a08192R742L4839O9044k264p6167j1387l27K015j448J7077N2395N717k9899
$$ y = [-58785, -54820, -48903, -52596, -67556, -47595, -41912, -35093, -24870, -22373, -11021, -54252, -54689, -25837, -43789, -44091, -15222, -20807, -8369, 599, -8530, -39366, -34458, -29072, -72809, -103045, -99968, -103630, -76623, -43772, -78256, -95172, -84645, -74556, -73361, -50812, 1473, 74085, 130523, 225983, 317947, 353037, 347581, 348430, 344485, 339913, 323958, 299560, 355798, 417370, 441184, 437661, 415577, 346842, 278890, 187229, 175529, 169015, 141516, 73330, 28120, -2104, -17679, -28093, -28387, -19945, -31935, -50438, -66479, -79717, -103352, -108049, -83904, -62692, -49757, -43390, -64271, -68718, -25012, 10917, 13549, 14718, -23477, -38219, -27935, -65668, -108192, -98450, -63611, 5433, 3169, -72998, -84385, -84712, -82697, -84145, -67068, -14673, -8956, -38855]
18268c8855j037p931j6788k8031L383N9935L1319n7342n5662M0245L7350k311
18256c5725j1987J9492J075j3509r274j0278n833K0310m771K0648K224j6235o70
18243d4533K7281q808j2471k2643k1021j9790k7210J8593K5086j5741J3914Q660
18231g8683l0169J0182n841J3742L2295j047m9138q69N7310j2210n55L9321M4659
18218A8997Q18K5282J8708n2775l2519j3016j82J9491L465m1672K6169o846k1525
18205e5605k4839j6740M9284M9974K4135j199l1712o1830j9367J9196K3771K2727
18193b2205p679j1861j4508L559m388J0521J3261P238K8830k6558k1032J4545
18181c0277J4388m0824m510J10j6494k0777j1J6930K2118R673P037J9433j382
$$ y = [-38855, -39892, -47823, -64611, -92642, -89259, -29324, 1995, -55347, -111009, -70764, -33414, -35725, -47712, -28220, -27145, -40654, -49928, -60206, -66039, -45729, -50500, -29852, -27628, -43863, -44533, -17252, -26060, -38531, -61174, -82195, -101985, -129195, -110602, -85516, -101257, -87343, -78683, -108852, -98670, -104511, -90769, -58474, -59521, -108659, -109528, -52218, -64428, -64983, -25662, 18997, 19815, 45097, 63805, 11030, -21489, -34505, -34687, -15196, -11731, -53403, -27234, -34080, -55605, -80444, -97184, -47900, 2074, 26209, 25010, -6702, -68532, -87899, -68703, -44932, -22205, -29884, -41745, -56253, -52694, -57082, -46561, -33300, -26062, 2768, -23790, -44822, -30277, -15889, -56713, -61223, -61113, -77607, -98384, -98395, -81465, -59347, -49674, -42637, -23204, -24586]
18168b4586N714O419k2526j4133l588J2054j0366K9176J7632J963j2106k1337
18156c5684k0615M7300o279k3470k139l5890K2847k524J8090L3612R030j4052
18144i774m9237m9077k8791N1639q003l4151J3857M0454J8564j3323K1352m247
18132e0737Q811j363j2471L7033J7373k5562K3630j2160J0113M109N728J7938
18120B2442K0996N023n7037m0086K5318N577K5586O114J223l2814J6445L8362
18108C7149N0826O2805P6223Q5019K5865o536l7282J2817P075N269m3865n317
18096B70048J1339N87M420k2790l4951j5612m3706k1469j1221o6563o1523M335
18084A2894J7654K9534k2807m0434k0202L830k7310K7342l03L0704J2925k2842
$$ y = [-24586, -18872, -12453, -34979, -49112, -52700, -40646, -51012, -21836, -4204, -2241, -14347, -35684, -56299, -8999, -15278, -38748, -40887, -76777, -53930, -56454, -38364, -4752, 4278, -9774, -59011, -108088, -136879, -85240, -93243, -127394, -113537, -73083, -54519, -67842, -46490, -50737, -41926, -43289, -55760, -18727, -1354, -26916, -3286, -15446, -5333, -1224, 4504, 22442, 43438, 48461, -8576, -48662, -23344, -17767, 7819, 13933, 15156, -17658, -1213, 37149, 87975, 150780, 227003, 312022, 337887, 331351, 294069, 306886, 313961, 319230, 275365, 270048, 281387, 281974, 286394, 263604, 228653, 213041, 169335, 147866, 136645, 70082, 8559, 12894, 30548, 60082, 37275, -3159, -23361, -19531, -46841, -19499, -19802, 10902, 23827, 985]
18072I85k4320j5007j7916J3552L8832j8909o3433l881R333P176L6885j1036p551
18059e5290N0397K3833K289r5176j3912K6567J6785P735J003l1350K8549K2425
18047a6145j6160k9461L1584K9941N17k4384j8665R843R188P896M446J3744k9992
18034b7648l2507k6854K3786k299K3328J2044L636k6565k4128P844M9844K2427
18022B908m1628J572r816J1279n686k3215q893K1830J7480j6656L4667J7567j3472
18009a2063j5393q334K3455J7161J6022j2073p2178j9885K3459J2297j4839k5351
17997h7722J0929J1245J037K9781J2319l152N977J764J2357p36j997K308j062
17984f952J3879M144o4874j3920J2686M0118K4108j7775O92k266J0316K2852M970
$$ y = [985, -23335, -38342, -56258, -42706, -3874, -22783, -86216, -90097, -80764, -73588, -36703, -47739, -55290, -4893, 18940, 21229, -73947, -87859, -61292, -44507, -36772, -35769, -67119, -38570, -16145, -32305, -61766, -30182, -241, 276, -24108, -42773, -32930, -23742, -15846, -11400, 2344, -27648, -60155, -87009, -63223, -65522, -42194, -30150, -26514, -53079, -77207, -69363, -19519, 2908, -38720, -37148, -46964, -35685, -41371, -64586, -73479, -51649, -34169, -50825, -16158, 1409, -12063, -27456, -35790, -12335, 4826, 20848, 8775, -63403, -83288, -59829, -47532, -62371, -87722, -76793, -65548, -64511, -34730, -22411, -25563, -19586, -17822, -5465, -6201, -8198, -5890, -6952, 6927, 11071, -53803, -67723, -55037, -14919, 9189, -8586, -7894, -10160, 156, 23008, 27978]
17971B7978j0491l4401j2427K95J3757l7973k4641K5134K3349Q985k3635j2234
17959e6304L6863L3843m554L334k3905k9265l0108j0903N975M8552J4205l5493
17947d7760l6430l9500K3255M5881J0052j3619r478L4936K1316L7125r122l6774
17935b0118j6010J33O186l4995K997K7285q626o3094L743K5119K9827L0054j5456
17922c2955L787K3079q541k2804j8539p889J2747J9040R899K6708m6122M835K3410
17909a3345n853j3940K2119J8120j1274k5902J6830K023l7985O817L8085M1823
17897C7518k4944m5722K5392L6155k6514j5780l405J4196q187j0440L2182l451
17885G000j7664l4898o942j3909k5493J1606J8491K0150j4672P525l72K7034K4054
$$ y = [27978, 17487, -16914, -29341, -29046, -15289, -53262, -77903, -52769, -29420, -20435, -44070, -56304, -19441, 14402, 9848, 13182, -10723, -39988, -70096, -80999, -75024, -26472, -12267, -47760, -84190, -123690, -100435, -54554, -44502, -58121, -67599, -32663, -11347, 25778, 16656, -20118, -36128, -35995, -29809, -64804, -61807, -34522, -43148, -106242, -102499, -77380, -47553, -17499, -32955, -29168, -6089, -14630, -37434, -55973, -63862, -51115, -32075, -22176, 4532, -41590, -36755, -13345, -19198, -33138, -11019, 7101, -4173, -30075, -13245, -11222, -49207, -42390, -4305, 37518, 12574, -33148, -7756, 28399, 1885, -13895, -17300, -3104, -11291, -21731, 10451, 7000, -10664, -45562, -52504, -66413, -91906, -80300, -61809, -41659, -56331, -48806, -49178, -22144, 1910]
17872A910J1590n9152k1645j3049k0382L5538K5702o275k2617j6538k3505L6619
17860g1804k2709k488M5807J2979k1462k0339k169L9330M7557m230l8188m7043
17848h4759p53l5916J8623L8237J7025o34l5303J7774j6195k942l558K6112j596
17835f3885P179R698k0146j6779j7320M8107L0431j5835K1773K1004j0616l2773
17823c9162L252q520l2438J198K9611l256k325j1282k919l2147R191J9195J6807
17810e2795j254k072J5996k3152K5948N3055l4594o6620j4116N2617K0847l995
17798c0135N816j643L2389K2821k3704K1802j5039l0654l3476j7191l7749K8447
17786g8316J7596p698J9339J3086j0918j9423j0505J9139j0504k5909j3497j4410
$$ y = [1910, 13500, -45652, -67297, -80346, -100728, -65190, -39488, -45763, -68380, -84918, -108423, -71804, -94513, -97001, -51194, -38215, -59677, -80016, -82185, -42855, 4702, 472, -37716, -84759, -85512, -121428, -102805, -64568, -47543, -48177, -83480, -65706, -81901, -84843, -88401, -62289, -63885, -56706, -47008, -67154, -83933, -101253, -53146, -22715, -38550, -16777, 4227, -6389, -39162, -35910, -44430, -76868, -75670, -46059, -49315, -51640, -62922, -65841, -97988, -88797, -69602, -52795, -54049, -56121, -40125, -63277, -37329, 15726, -18868, -85488, -99604, -46987, -26140, -30135, -24319, -25962, 6427, 29248, 5544, 27346, 12307, -18347, -51823, -69014, -106763, -78316, -60720, -68418, -49079, -35993, -46911, -66334, -76839, -57700, -68204, -94113, -107610, -122020]
17774a22020K1400J309j8378j1945P007J8694K1133J9377N933M8007j4806k8968
17762e3257O416J8176J2427j3425l2485R632N7042k3043j0182R540k7870l252
17750e0281j743j906R055L2019p000n282N613j5842J4138J3691o2465m7919o084
17737a24006Q110K9318L3692j1814k7406J7541J2238L6158o277l4290k6950r308
17725a02994M4532L0203M7575K2303p2666q2935l6834M7949K0935J2752M2138
17714b7042J5595K934m2875K144J7141n477l578M0334j6169k8814l8093N215J5622
17701f3063J783j5809j70J0890n603L7270K1101N5116J5637l8862m1046n3004
17689g5760l471J5183J0825K4716j6130k2431l6968L158J8598J7835j4681J4072
$$ y = [-122020, -100620, -99311, -117689, -129634, -122627, -103933, -82800, -63423, -57490, -9483, -24289, -53257, -46841, -28665, -16238, -29663, -62148, -52516, 4526, -18517, -28699, -19159, -47029, -50281, -52024, -53930, -44875, -12856, -19856, -25138, -19525, -35367, -21229, -7538, -70003, -117922, -124006, -115896, -86578, -52886, -64700, -92106, -74565, -62327, -26169, -32446, -66736, -93686, -102994, -58462, -28259, 19316, 41619, -31047, -113982, -150816, -102867, -81932, -69180, -27042, -11447, -8513, -51388, -49244, -32103, -37580, -41158, -824, -16993, -45807, -83900, -78685, -63063, -61280, -77089, -77259, -66369, -71972, -34702, -13601, 41515, 57152, 18290, -22756, -75760, -79231, -64048, -53223, -28507, -44637, -67068, -104036, -100878, -82280, -64445, -79126, -65054]
17677f5054J5816k552j8100m3281J0496J3970j099p880J1550J4556N1286j6509
17665c6801o323J935J8390k189l3466J3571j5934k1519p044J0943M8516J0089
17653a9832j6888o7068m4489J4370J2508l728R742L0595L5022P591L3174L8314
17641B9311k4133k386L8234l9477m2260J2131n793k5139n923q104L374J041L4414
17628c4710j6069j0202j1443j834J0452L0582L4377M395m1654r69J5847p822P586
17615b1464K0386O283l6809P799J2953k0073N462P271j4866L8496K6043l9805
17603h324l5959k1057J2211K024m7080k276m010k0147L1971M9382J1757j3494
17591d5002l7420j4786p407L5514J1626l6644J9170M0941K6732P813m6088n1596
$$ y = [-65054, -49238, -51790, -69890, -113171, -102675, -88705, -89804, -97684, -86134, -71578, -20292, -36801, -43124, -41189, -22799, -24988, -58454, -44883, -60817, -82336, -89380, -78437, -29921, -19832, -36720, -103788, -148277, -133907, -121399, -125127, -115385, -84790, -49768, -42177, -9003, 29311, 5178, 2792, 41026, 1549, -40711, -28580, -34373, -59512, -65435, -73539, -70165, -69124, -34710, -50779, -60981, -72424, -74258, -63806, -33224, 1153, 5548, -36106, -37075, -21228, -29050, -21464, -1078, 5205, -31604, -23805, -10852, -30925, -25463, -18192, -33058, 5438, 31481, -8324, -44283, -65340, -53129, -51105, -98185, -100461, -104471, -124618, -92647, -43265, -31508, -45002, -82422, -97208, -104615, -69101, -57475, -94119, -74949, -34008, -7276, 537, -45551, -97147]
17579i7147l7027p654P050K9691K0144j0104N4737O6725J6485J63k467J6555M843
17566F1994o7425j165K8993k487n2652j4064J6018O5412L6596q490m1357k2517
17554a144p428k5762l1056K523J741J6875P307O504J7223m0401k5848J7192K1173
17541d1101N0612l98l2801k2511m7336n6782L30N4251L3157Q874O5882J9547l9319
17528g595j8170M131j4357k7153m1393K8569K1587R280K3970m6486j8643j6077
17516a02337N228L363M1126K0218j7159k3695M1726r029j56Q5k755m82j813j1455
17502e7135N124J8778J5354m4798k8604L7937J2053p641j8364j4593L8703L3596
17490i590m919j9576P318K7199k2180N444p0811J922K3510j0835J8093J3805P240
$$ y = [-97147, -134174, -141828, -134778, -105087, -84943, -95047, -40310, 26415, 42900, 43063, 40596, 57151, 61994, -5431, -6596, 22397, 19910, -32742, -46806, -30788, 34624, 71220, 62730, 21373, -1144, -8572, -34334, -65390, -62867, -61126, -44251, -36944, -30440, -13217, -53618, -79466, -62274, -41101, 9511, 9113, -23688, -46199, -93535, -150317, -149987, -95736, -62579, -53705, 12177, 31724, -7595, -25765, -21634, -35991, -63144, -104537, -75968, -54381, -45101, -21131, -67617, -86260, -102337, -97109, -93746, -52620, -32402, -49561, -73256, -31530, -40559, -40715, -40630, -43385, -43867, -45680, -57135, -52011, -33233, -17879, -62677, -91281, -53344, -41291, -48932, -67296, -81889, -43186, -9590, -14509, -34085, -26767, 432, -21748, -16304, -87115, -85193, -61683, -72518, -54425, -40620, -33380]
17477c3380l0646K2429L4869j0132J8277J912P931m2056l2413j165N0665K8293
17465A4584j706o865k1933n532q047m6168m1764o671M2022J2292L2804j1814m9915
17452i8713J5211L979j4597K093K1444K3180Q291k30p315J5119j2055k1832J5921
17439d9504j3876j3644L17K1888P319P240M3291J5508r16k6055l8855k1815J2387
17426e6715K725q586o896K5505L7564J4649l8523k860L9745j8813o701L0626n415
17413F305j3296r830o833J7064L4170j0548l6337l6449J7138k2469j5696k278
17401g9059j0505J3100L8368N1107j6966n0503l4011n224M6203J135R110J2384
17389b4861l2612o742p817L901j6610L2482O0446m100j9740Q03j8774m0331q745
$$ y = [-33380, -64026, -41597, -6728, -16860, 1417, 3329, 11260, -30796, -63209, -64374, -13709, 14584, 12878, 6013, -15920, -21452, -29499, -75667, -117431, -124102, -82080, -69788, -36984, -48798, -98713, -83502, -79523, -94120, -92027, -70583, -47403, -39112, -39342, -46657, -31538, -43593, -65425, -49504, -63380, -77024, -76707, -54819, -47500, -40260, 3031, 18539, 17623, -8432, -47287, -69102, -56715, -53990, -62576, -69472, -43967, -6403, 8246, -30277, -33137, 6608, -12205, -18906, 11720, 6305, -6991, -16821, -23654, -6590, 27580, 17032, -19305, -55754, -38616, -61085, -76781, -79059, -89564, -76464, -38096, 13011, -3955, -54458, -88469, -93693, -47490, -46355, -37245, -24861, -57473, -64215, -72032, -68131, -84741, -52259, 8187, 4087, -15653, -14850, -33624, -73955, -82700]
17376h2700K80N5469K0411m349J3088J8709k0298l0550P512J0902L446l4864K6520
17363a6424R407j8040r47j0584k362k8691k5987J8345M8471M5913K4032L933l7141
17350I925l5294n4440R723N0303j1296J1600L1700j4809n7546k4255K0062K7441
17338c6886M482K7616J2629k1673k3980R277k777P005m0550O173K2178P125M088
17325b5293j9931j3904M6864L9086j0681k1414j793k1860p877j7212Q328L907
17313d1780K0390J244l7988R760L7982J1242o4019l5430j1052J481M6044O0305
17301a821K7049J0334j046n529k6263k1191J0233L6005L584k59k3136k5029J5545
17288a524j9431r316l0518o991M3936L1448k9295q879l6230l901M8903J5166j0620
$$ y = [-82700, -82420, -26951, -6540, -10889, 2199, 20908, 610, -29940, -22428, -11526, -8080, -42944, -16424, -7017, -25057, -26004, -36588, -38950, -67641, -93628, -75283, -26812, 19101, 43133, 47066, 9925, -25369, -79809, -70086, -19783, -31079, -19479, 12221, -2588, -60134, -84389, -64327, -36886, -32404, -4788, 7841, -13832, -37812, -28535, -31312, -24307, -64857, -58684, -36506, -29381, -25293, -45224, -59128, -12264, 26822, 16141, -5273, -7066, -28926, -36803, -54015, -45687, -41780, -21390, -20146, -58134, -48374, -10392, 850, -63169, -98599, -109651, -108170, -62126, -1821, 25228, 35562, 34516, 28987, 2724, -18467, -8234, 27771, 31355, 31096, 7960, -17069, -1524, -20955, -30271, -60789, -67780, -23844, 7604, -21691, -30570, -66800, -70701, -21798, -6632, -17252]
17275a7252p697m991k299n775K2323o389j5937k6028J365L2550K0462j0876j1732
17262c2276J2990j6501J0667l407Q767j1985k3850j7783O033K2058K1714k2770
17250d6343L2664K931p66J9468l7001r1266l0167O7825L8943L5182k7184j3149
17238d8863K7126J1141M279m3540k3675P026j6152o298l245P919m739M633k184
17225h6572L7925o132n49m063Q913J1288k7857l7589K290M4571J2535J6899K3958
17212d383m989j5291j4843j418j5321k1124M5794J2145M750Q944L5860j5015m0154
17199b5045k8581l3008N4021N2676J2438n5626J6025M746K0342L2233l9323l9787
17187b8889j2428j984K5177K3952j1776k5902M392m59p869j0415l1871q393K3427
$$ y = [-17252, -24949, -29940, -32239, -38014, -15691, -22080, -38017, -64045, -62680, -30130, -9668, -20544, -32276, -19286, -35787, -25120, -28527, -19760, -31745, -55595, -73378, -67345, -45287, -23573, -46343, -13679, -10748, -11514, 7954, -29047, -120313, -150480, -82655, -43712, -8530, -35714, -48863, -21737, -10596, -6317, -49857, -73532, -66506, -82658, -88956, -92201, -84282, -89021, -84388, -86572, -48647, -54779, -55328, -59391, -50478, -39190, -67047, -104636, -102346, -57775, -45240, -28341, -4383, -9372, -24663, -39506, -40924, -56245, -77369, -31575, -19430, -14680, -5736, 30124, 15109, -25045, -53626, -86634, -32613, 20063, 32501, -23125, -7100, -2354, 17988, 50221, 10898, -28889, -41317, -43301, -18124, 5828, -5948, -31850, -27458, -27917, -35786, -46201, -78072, -86465, -63038]
17174f3038l766L7852K9605J3257j3964J8713j4232l6496M0456K001k9791j4541
17162c3944J2454K0227N081r83k5879j6955J4245L3432O860k315n2109m4492M251
17149h0127j435M486M997r774K3067K5083K612L077j6911o658K5209J753K4154
17136d67O607R80J3741J7930k2518l1616N582L8423l1926q5454K1738Q058L506
17123e5416M6160J2176K6433K067m6034o5279J628K0020L1080N4103k757k8914
17111d733J2418K7330r20P439n7243k6824K1569J5914k1698M18j3656L1655J944
17098f387l5931k5464L4147r227K0316K8617n586j8458j6323J3633L0039M901
17086A4277l218L0865q65j6496j9608M1468M909m8777n3804k6108p550m750p081
$$ y = [-63038, -66804, -28952, 653, 13910, -54, 18659, 4427, -32069, 8387, 10388, -19403, -33944, -21490, -1263, 3818, 2835, -23044, -39999, -25754, 7678, 14538, 12223, -39886, -84378, -80127, -81562, -77076, -72079, -81853, -58786, -33703, -31091, -28014, -44925, -51583, -26374, -24621, -467, 6140, 7120, 20861, 38791, 16273, -15343, -9761, 28662, -3264, -88718, -66980, -58922, -55416, -9256, 2920, 29353, 31420, -14614, -79893, -78265, -58245, -27165, 26938, 24181, -4733, 7685, 35015, 34095, 41534, -15709, -42533, -20964, -5050, -26748, -26330, -39986, -8331, -6387, -42318, -67782, -33635, -42862, -22546, 6071, 485, -17973, -34296, -20663, 9376, 14277, 11059, 41924, 41059, 24563, 4955, 46423, 51332, 2555, -51249, -77357, -84907, -89657, -96738]
17073i6738M7608L6883J4931L8606l3000k6072k9276k3605O952J2318O080M0782
17061d531M559l1615k235N9502j6015l8559l0660J2158N14L0177M545N455k1916
17048b8621q314l3326l5824j9758N1002M5672K037L4343j9154k2670r349K740
17036d1222L2411L4906l2862K283j1792k7990R402k7545l007m857j6432K4649
17024f2056K7134K2329J2852k1798j0519j5159J637o097J6336M7185L2516k8571
17012A5789k8320q557L9817R912k8606R345K3249k4346l3025k5089j9512q824
17000g8167q664P835K2008K3493J8340j6298m941J030m8051j7840K1575M9829
16988b9851J8435l818m1292J230O8684o027m1902O790P951j7329M492J527L9668
$$ y = [-96738, -49130, -12247, 2684, 41290, 8290, -17782, -47058, -70663, -63711, -51393, -45313, -4531, 28, -31587, -33822, 25680, 9665, -28894, -59554, -47396, -46882, -16705, -12160, -6705, -28621, -36935, -70261, -106085, -125843, -74841, -29169, -27132, 7211, -11943, -34613, -43962, -41222, -8811, 26095, -6767, -4484, -16276, -44266, -34864, -62409, -65416, -70273, -86705, -62056, -34922, -12593, 259, -21539, -32058, -47217, -45580, -51677, -35341, 11844, 44360, 15789, -12531, -21088, 18729, 28641, 35, 9380, 32629, 8283, -24742, -49831, -69343, -78167, -86831, -78996, -56988, -33495, -15155, -31453, -36394, -35364, -83415, -101255, -79680, -29851, -11416, -15234, -56526, -55296, 13388, 7361, -34541, -27751, -19800, -37129, -32637, -31110, 8558]
16975H558j1548m110J0955J6560j7700o2675O448l909k2128k0833K0040J0591
16963f9751K7560j9799M710O96l713J8789K8095k2897N0462K8389k7589q6104
16951g1152k1991L1576K7372k991n3176L5243J4818l7483k7688j6870J9752P0215
16939c2375k9231n3313M3464L1168J9952L6116l4569k5134R995k0622k931Q147
16927d9333K1793J3469j4592n919L6353K9403l3525l3583l3549L0068J7047j2302
16915c4670j2944m5283J4288M5238M2544j0453j420L2815K8634n8346n6370L988
16903e1979J5631j2849m949P63J3254L0303p56k9021j5178K0641J1752l9557j9668
16890h1613N0173P755k1121k9046o014K8223K4824J7846k0354j7392o29k0258
$$ y = [8558, -2990, -7100, 3855, 20415, 2715, -59960, -53512, -57421, -79549, -100382, -80342, -69751, -42191, -61990, -57280, -56584, -60297, -41508, -13413, -36310, 14152, 42541, 14952, -71152, -93143, -61567, -34195, -37186, -90362, -55119, -40301, -77784, -105472, -122342, -102590, -32375, -61606, -114919, -71455, -40287, -20335, 15781, -18788, -43922, -33927, -54549, -57480, -49333, -27540, -14071, -28663, -34582, 1771, 31174, -2351, -35934, -69483, -39415, -22368, -34670, -47614, -92897, -78609, -33371, 9173, -1280, -2700, 30115, 58749, 403, -55967, -51979, -36348, -49197, -54146, -53383, -40129, -9826, -10582, -39603, -54781, -34140, -22388, -61945, -81613, -31440, -23685, -44806, -73852, -79866, -51643, -26819, -8973, -29327, -46719, -47348, -67606]
16878f7606k4341L472L6250j0249m005L3920j6035O520P8770k2359j0220l4327
16866c0210j6443L0821K6165j745k1614m2403k0917O7690N5636j2368m4028K241
16854g175J5745n077k9954q63L0325r754r321J2870J298k4506l0588K6237j7979
16841d8742m0119l888q881M1408K7119Q627M148J6566J6085k141j0023k853p703
16828a0397l8594j2159k8889P523M176j318k2980K6694K7887J0645q839J5548
16816c0703L3593L1537K961l1012j6052k66l8929m1487o538R023J7137M2094M344
16803b4298m1619N100J8431K48J217K0536m5111l2775M1544N3705p203j2343K3941
16790A373J0129O150o756k0736l9040k2769k081L1459l5164j8757J6739k9006
$$ y = [-67606, -91947, -88475, -52225, -62474, -66479, -32559, -48594, -42074, 36696, 14337, 4117, -30210, -46653, -15832, 10333, 8588, -13026, -55429, -76346, -8656, 46980, 34612, -9416, -7175, 8570, 3493, -26461, -27324, 3001, -6753, -16074, -3204, -1906, -26412, -57000, -30763, -48742, -88861, -92749, -101630, -60222, -33103, -24476, -20328, -3762, 12323, 10182, 159, -2694, -10397, -48991, -61150, -90039, -82516, -78340, -79658, -102638, -75944, -48057, -37412, -46251, -30703, 2890, 34427, 37388, 6376, -9676, -9942, -48871, -90358, -96896, -87873, -70736, -28642, -24298, -65917, -60817, -42386, -42138, -40921, -20385, -65496, -98271, -56727, -3022, -10225, -22568, 1373, 11502, 17652, 10896, -9840, -48880, -71649, -73730, -42271, -77435, -96192, -79453, -108459]
16778a08459N188K2332P438K1953J0545n704R701J9362j8312Q717k3749q97j0906
16765f2791q061J8333k7164R010K8825K3770k1495J7078L7378j2087l7728j5806
16753e0738k48J6732O511k664k972Q806M0370j7875j4649N941l5164j2975J5403
16740d3522k312L833k1705l789O785K8343O674L0605j4734J784m953L5683K982
16727B5674J3113k2855J3971J9863m0402j0139l3331k4418L7892j5656L2394j3789
16715a7683m412j2469J1484j273o742j2146m67l585l9746j1754J5584L7756J9224
16702b6229k4584m0539J158j5096P890M5804J8935K1385J1883l0716j3852j3475
16690e7436M292k3188l2335K3671K1178O0970K2896n5523O306J4033n197k8169
$$ y = [-108459, -103271, -80939, -73501, -51548, -41003, -46707, -37006, -17644, -35956, -27239, -50988, -51885, -62791, -70852, -52519, -79683, -70673, -41848, -18078, -39573, -22495, 14883, 2796, -34932, -50738, -50986, -34254, -27743, -30407, -33379, -24573, 15797, -2078, -16727, -10786, -45950, -58925, -43522, -45834, -42001, -63706, -67495, -60710, -32367, -25693, 4912, -9822, -8038, -12991, 22692, 25674, 38787, 15932, 29903, 49766, 9364, -775, -34106, -58524, -20632, -36288, -3894, -17683, -22095, -34564, -23080, -24353, -31095, -43241, -43708, -47293, -87039, -98793, -83209, -45453, -26229, -50813, -91352, -90194, -105290, -97400, -51596, -32661, -11276, 607, -30109, -43961, -57436, -53144, -76332, -108667, -84996, -63818, -2848, 20048, -35475, -29169, -15136, -20333, -48502]
16678d8502p240j4712j0927m746K7497L2610l3130k8479m72o753M9275L8987k911
16665i503L794l357p049m4543J2121K9531k4554M289J8759K2169J018L712n1348
16652d4961O979P444k039n4507M968N1983L2633j1441k156L9142J312l6685j5058
16639b2386j1455K3996j7821r942o05o735n640q774L0757K5882k0165L167k5850
16626d5571j8304L3368K52k8942o729J6022J0076J682k4794L1921M0551j963q970
16613a401R910j2725j0453r33L1186R149m3792m3599J9685K9725m737n5311J0736
16600f2560O2289L3657j5555l8556m2907N1896L3474n788j9765k4998j9065M045
16588d3833L3913j5644j7200J5914j632q854l225j4639M7130N0680q931o498m4931
$$ y = [-48502, -55742, -70454, -81381, -86127, -58630, -26020, -59150, -87629, -88101, -94854, -45579, -6592, -9503, -5709, -9066, -16115, -60658, -48537, -19006, -43560, -39271, -20512, 1657, 2675, 6387, -44961, -37982, -30538, -32577, -87084, -82116, -30133, 2500, -8941, -11097, 28045, 29357, -7328, -22386, -33841, -9845, -27666, -37608, -38213, -44948, -50588, -59362, -28605, -2723, -22888, -19721, -45571, -63875, -30507, -30255, -59197, -65926, -49904, -39828, -38146, -62940, -31019, 9532, 7569, -1401, 8509, -4216, -14669, -15602, 15584, 24733, -19059, -62658, -42973, -13248, -17985, -73296, -62560, -271, 33386, 17831, -20725, -63632, -11736, 21738, 15950, -3815, -28813, -47878, -43833, -9920, -25564, -42764, -26850, -28482, -37336, -40561, -55200, -8070, 42610, 33679, 27181, -17750]
16575a7750j7179M2455K5021j2560j6628j0019k2594k7970j706K0606j613l8826
16563g8763K6657N1409L8563j7984j9304k0666L036n26L4255J4150K8326j5393
16551D3760m2636j2657J5144k10k25j9886L229J8108k953n4224j7977J4134l8299
16538i4692k5067l0237L7503M2147K0697j2391K6358n288K0517m0482l4277r281
16526a04493K3915R430Q804K8509J6666o167K8253k8191l4570M3070J6742j4018
16514a2050l2813n281k7516J1048K7045q91K8479J9562k5114j6070m943J089r960
16501d7415j6017M4589L0619l4308m1252K6518k707l7745l1580J839J8907M8349
16489d0203K2342n5854o6298K8030L7219o50J4283J8850J675k2688q58j00k5093
$$ y = [-17750, -34929, 7526, 32547, 19987, 3359, -6660, -29254, -57224, -58930, -38324, -39937, -78763, -52106, -697, 37866, 19882, 578, -20088, -17052, -17578, 16677, 30827, 59153, 43760, 1124, -11533, 3611, 3401, 3176, -16710, -13481, 4627, 1674, -52550, -70527, -56393, -94692, -119759, -149996, -112493, -70346, -49649, -62040, -35682, -40970, -20453, -60935, -95212, -104493, -80578, -71148, -62344, -33835, -17169, -23336, 4917, -23274, -57844, -14774, 1968, -12050, -44863, -50144, -77660, -66612, -39567, -40458, -11979, 7583, -17531, -33601, -38544, -37455, -47415, -63432, -18843, 11776, -22532, -63784, -37266, -39973, -77718, -109298, -107459, -88552, -40203, -17861, -73715, -140013, -111983, -74764, -75414, -61131, -42281, -40606, -63294, -64152, -64252, -89345]
16476h9345l4881K9498M892Q442J1665q863O4631j2863o36K9741k6876K1082O40
16463b873l0039j4359k494l1443R100K2468K5294K6926K6635m912M720k3985k6578
16450b1540l5209K5842N075m3059q54L0120R033L4864L0661m9830m0243Q130j0091
16437e7101N1220l918l0121j5535Q862K4586J0515j979j3180k0080j0014l817
16425f0562q052N2571K3699k7224j4315j8995K9458O618j7639j2638Q738J4989
16413b3352M416j6225m7332k2008M8222K0263R837L121k4747L4001j1743q038
16401c3585n62M3017L845j9725K536m572l5304j8318L511q465K6206K7647K7395
16388A3626j5092j851K1330J6434p998L3412n7603n2680k671J277R061M191J1035
$$ y = [-89345, -124226, -94728, -89836, -81394, -69729, -78592, -13961, -26824, -27460, 2281, -24595, -3513, -2873, -32912, -47271, -49765, -81208, -72108, -49640, -24346, 2580, 29215, 24303, 29023, 5038, -21540, -56749, -30907, -25832, -68891, -69745, -39625, -30592, 4272, 34933, -14897, -55140, -47010, -57101, -5881, -9799, -39920, -55455, -46593, -22007, -11492, -13471, -26651, -46731, -56745, -60562, -68614, -16043, 7656, -19568, -33883, -52878, -23420, -16802, -34441, -47079, -38341, -23352, -18936, -35161, -82493, -104501, -56279, -36016, -26179, -23058, -47805, -13804, -25547, -33585, -34147, 8870, 12715, -7010, -4474, -9046, -44350, -62668, -59157, -67622, -41416, -13769, 13626, -1466, -3317, 18013, 34447, 26449, 59861, 2258, -50422, -53093, -51816, -42755, -38564, -27529]
16375b7529J4668L1036l5985n7401Q563K980N191j8256K0593L4104j3111j335
16363c6482n144L962L9413m660m1788L340O885N653J3313j513n8893m39L9248
16350c7105N3414J4512K0802L776q269Q79j8349k8161j7834p574J4065j3371K6452
16337C237K554K00l8483j6826M5045n383l252m553J8218l4496k7420K104J5503
16324d3552l207j0147j6589Q720L0126M140J9279k0438j7002N149J685j8263R980
16311e0119j0884K7916M321K837J4319m3850L1146k2108j5627J3095K9601J3208
16299f145j5285l6930p473k1547J3902M0540q47J2122M3935K2080l6987o0762
16287e3397j1667R953j985o330j9899j4824K3132O2529N3842J4409j2644l9589
$$ y = [-27529, -12861, 18175, -17810, -75211, -66648, -63668, -58477, -76733, -56140, -22036, -35147, -36482, -41626, -37664, 1749, -2911, -44699, -41359, -34474, -28821, -15508, -17021, -75914, -76353, -37105, 16309, 30821, 51623, 55399, 47130, 48009, 29660, 1499, -16335, -23909, -9844, -23215, 3237, 5791, 5991, -32492, -49318, -4273, -9656, -12908, -17461, 757, -33739, -61159, -59055, -43552, -46759, -56906, -73495, -64775, -34649, -30509, -11230, -31668, -48670, -43521, -41836, -60099, -50119, -61003, -33087, -28766, -25929, -11610, -55460, -24314, -46422, -62049, -48954, -19353, -6145, -21430, -58360, -65833, -87380, -73478, -32938, -33785, -21663, 22272, 44352, 7365, -53397, -65064, -55111, -57096, -63426, -83325, -98149, -75017, -12488, 41354, 55763, 43119, 3530]
16275C530j3781M553l9340j9879J6603L2877L5765L709l7809m0750N334L4218
16263a4970L6813l6800k7877J6261J9705j1384j4973j6658L2179M4885j3212m9843
16251c5874j7479L49K0685k3985k9660K5320M1318J5653q316M267K1001O517k7843
16238h047o2904j0804j2570J0169K4197J3245P566J9449M2662j324l680o1490
16226d3531m45N0832j4096k5611Q720k8954k4552j4626J3098M2450P7497R064
16214D9846l7246j149q325r953k843J0344K5564J3642k162P39j1695p005m1403
16201b1646J5067O310k34L6403j550m2022k7167j4930j6916k7035M9882N335K2420
16188a6083M0089p767l8224J6861P143j4307P676j1343k3265j705J1711K6959
$$ y = [3530, -10251, -5698, -45038, -64917, -48314, -15437, 20328, 24037, -13772, -54522, -49188, -14970, 21843, -14957, -42834, -26573, -6868, -18252, -33225, -49883, -17704, 27181, 13969, -35874, -53353, -53004, -32319, -56304, -85964, -60644, -19326, -3673, -11989, -7722, 13279, 19796, -8047, -70951, -81755, -94325, -84156, -59959, -46714, -39148, -19699, 22963, 21639, 17959, -43531, -43976, 6856, -7240, -32851, -24131, -53085, -77637, -92263, -79165, -36715, 40782, 49846, 12600, 11451, 3126, -6827, -9670, 674, 26238, 39880, 37718, 38457, 26762, 19757, -21646, -6579, -269, -503, 35900, 34350, -7672, -34839, -49769, -66685, -93720, -43838, -38503, -16083, 24006, 16239, -21985, -5124, 2019, -12288, -4612, -15955, -39220, -40925, -29214, -2255]
16176b255J2276k3542K9275j4179m3009o779M2002J5488K4037k6732m3376k2871
16164e9665j8751P838L0634L1623m441J279J1447J4138j1344k3340N248o726j0921
16151c2981n699J2822o071J5903m770K2952L900j0200j0018j7654Q871j4860j1526
16138d9331M392k1039j7680L903M1449l552m7487P276L0546L6651o358n3991j8364
16125i3585N6232N1778J8865j5655P257K9955L0530r895l7846k4737L590N758
16113B2247J2617l5475l4322O122J7034j4k7119j755M685K3416N601J5544k5789
16100a7208m789k0007L5926J7417k0018J9681q867n122l3526j7684r407L3119
16088c0485K899j6625K6824j2937J5148j6309O109r445L0240n669p414j0732p000
$$ y = [-2255, 10021, -13521, 15754, 1575, -41434, -48213, -6211, 9277, 33314, 6582, -36794, -59665, -78416, -70578, -39944, -8321, -12762, -11483, -36, 14102, 2758, -20582, -15334, -22060, -32981, -38680, -25858, -31929, -16026, -20796, 2156, 6056, -4144, -14162, -31816, -22945, -37805, -49331, -44939, -65978, -83658, -79755, -38306, -41858, -89345, -82069, -51523, -14872, -21230, -75221, -93585, -37353, 14425, 33290, 17635, 24892, 54847, 85377, 75482, 37636, 12899, 16489, 22247, 34864, -611, -34933, -28811, -11777, -11791, -38910, -40665, -35980, -12564, -6963, 8581, -17208, -21997, -42004, -6078, 11339, -8679, 11002, 2135, -2987, -36513, -54197, -63604, -30485, -27586, -44211, -17387, -30324, -15176, -31485, -25376, -34821, -4581, -10250, -17664, -28396, -35396]
16075c5396J3589j7599k8017L8736M4891j6457p71j2184q152l3607k901n611l2904
16062i6383k7247L3064N9818J7999j4646m556r558m355j5374J2764L2045N722
16050a0707O958J6367L5118j5941K2343J5683k0414m1654k1029Q87j9046j4132
16038d5567O8569J0399j9083J097O113J104l9498K1821J855k8449J8129j8578
16026b2088m1583j154k07R720L5289l6666r079J8103J4790L43L2823O011k5504
16013a9202k6423k0838o809n253M7555q003l1512K8766L4638l7969k6923K2509
16001d9464K9842j7172K2237j5897k3993J2235j5002j6088L1171l388J4683J4599
15989a6237M534J915J9766j6690k3402l7156K3648R241P709J9903j338O280L881
$$ y = [-35396, -21807, -39406, -67423, -28687, 16204, -253, -1024, -13208, -21360, -54967, -57868, -63479, -96383, -123630, -90566, -30748, -12749, -27395, -31951, -41509, -45864, -61238, -48474, -16429, -10707, -3749, 12618, 47736, 31795, 54138, 69821, 49407, 7753, -13276, -12389, -31435, -45567, 23002, 33401, 14318, 15415, 21528, 22632, -16866, 4955, 6810, -21639, -3510, -22088, -63671, -64825, -65032, -55312, -20023, -56689, -65768, -47665, -32875, -32532, 291, 6302, -19202, -45625, -66463, -73272, -78525, -30970, -38973, -70485, -41719, -7081, -45050, -71973, -49464, -19622, -36794, -14557, -30454, -54447, -42212, -57214, -73302, -42131, -45519, -30836, -16237, -11703, -9788, 9978, -6712, -30114, -67270, -43622, -34381, -26672, -6769, -8107, -1827, 2054]
15976B054p440k201K770R954k8544M87O989m3161m403k2284O780k677L3226L9430
15962i020J640l1318p55L1694K8929J1108l6640K58J4501L3062n547k7781j2093
15949a962k1783j3534m953L5911m037k7303L3042L6916R89m9548j9177O578J4012
15936a4849J7291K34J7815K2629K9472k8273k5161l7736j6469K227l3891j4882
15924h1593L7287L8403j3093l0812o583j6755L063N3852l164l1748K6556j6740
15912d1327k7610J1905M8890L4390Q601k1705m7455M677K5864l6405j9628M333
15900e5470L6332m784j860j2596O147J6726J8894r934k6825M013Q911q068Q74
15887b7640K2271m8999L4701J927l263j0038j4070J7103j636l1500J594j2535
$$ y = [2054, -5386, -7587, -4817, 5137, -23407, -22920, -15931, -59092, -63495, -85779, -78999, -81676, -48450, -9020, -7380, -38698, -39453, -7759, 21170, 32278, -4362, -4104, 10397, 43459, 37912, 10131, -1962, -23745, -37279, -42232, -6321, -10358, -37661, -4619, 32297, 33286, -16262, -35439, -28861, -14849, 2442, 2676, 20491, 43120, 72592, 44319, 19158, -18578, -35047, -32820, -66711, -81593, -44306, -5903, -18996, -49808, -56391, -73146, -70083, -16231, -19395, -51143, -24587, -41327, -68937, -57032, -8142, 26248, 34849, 13144, -34311, -29634, -3770, -40175, -59803, -55470, -19138, -23922, -25782, -38378, -32231, -15505, 3389, -6545, -33370, -29357, -20446, -28514, -27640, -5369, -54368, -19667, -17740, -21003, -31041, -45111, -28008, -29644, -61144, -59550, -72085]
15875g2085K6295j2508P877L1323L2926o516k783L078k0447j4380l0204k8723
15863h6147K6122J0685j7249Q362k958m027m8521j2425M7909M5867o650k0976
15851f0008N1174K4537N799j8907m5273q61L2824q626n394j6878L2150L7052M007
15838C1596n886k3011j0589n454m6712J450J592m793l518K1246k3822K4216M5352
15825A667m4569l5061j128q338K0170R079K0145L4014L2842K133J1529j3254n7199
15812b7970Q373M4143Q623k0250L0418l6132k0638P807M4104L5226j1242j2046
15800E0416k8425j9322j6567p48L0489j956p985l2494m3196L2079M1323o503j6078
15787a8967L725P14j943L5777K006j1764J9832J3021l1488j2095J2426j696k8546
$$ y = [-72085, -45790, -58298, -50421, -19098, 13828, 7312, 4529, 7607, -12840, -27220, -57424, -86147, -60025, -49340, -66589, -58227, -61185, -65212, -113733, -126158, -78249, -32382, -39032, -60008, -8834, 15703, 21502, 2595, -42678, -43539, -10715, -19341, -24735, -41613, -9463, 27589, 31596, 25710, 2699, -7890, -13344, -60056, -58606, -57014, -61807, -65325, -44079, -67901, -43685, 1667, -42902, -77963, -79091, -87429, -67259, -58180, -38035, -4021, 28821, 30954, 42483, 29229, -27970, -19597, 24546, 33169, 12919, 43337, 7205, -13433, -5626, 38478, 73704, 62462, 50416, 21991, 2669, -13898, -14646, 15843, 13887, 5902, -26592, -69788, -37709, 3614, -2889, -18967, -15242, -14528, -16471, 19306, 21312, 9548, 29380, 42401, 10913, -1182, 11244, 9548, -18998]
15774a8998m241L0465K3678o507k3633r719l140J6707J2936K0487J5277po175
15761D7130o350j2882k9544Q032K5465m048l5583L475k0066J5452J2266n161j2899
15748a4713J4953K4969K2383N839j7724n085L3584K2452j5334J3086k1038l3345
15736C0027j5356j1378j7698j0615k2648O633K0371N599J4903M319j7557J369
15724a2031J8055j7446m0969M552Q630J5734M2084q130j8729k63P532k437J0901
15711G483O847k7594J8045N542j4144n769j8471n476k0479L4198J8338j6002J0684
15698f798L009j6700r837L65L5471l74J9695j2549j6424O441r840k5668m0853
15685g4062N161K1232j4471O712k322J2851M7306K0156j8178O837j8767K5107
$$ y = [-18998, -23239, 7226, 30904, 24397, 764, -8955, -12095, 4612, 17548, 38035, 53312, 53305, 47130, 40780, 27898, -1646, 6386, 31851, 27803, -7780, -4305, -24371, -8919, 3347, -1814, -14713, 240, 25209, 47592, 53431, 35707, 30622, 64206, 86658, 71324, 84410, 63372, 30027, 14671, 3293, -14405, -25020, -47668, -41035, -20664, -15065, -162, 4157, -13400, -12031, 6024, -11422, -52391, -47839, -39209, -23475, 18609, 10479, -8250, -8513, -981, -3418, 7483, 14330, -13264, 4781, 10323, -3821, -9590, -28061, -33537, -54016, -19818, -1480, -17482, -6798, -3789, -20489, -30326, -29961, 5510, 5136, 24831, 12282, -4142, 2299, -7541, -33209, -74062, -68901, -47669, -62140, -55428, -57750, -44899, 2407, 22563, 4385, 11222, -7545, 17562]
15673A7562k2054l161K8950J4701j6065l0427J1484N192o377j6685k1761M530
15661c4111k4527L082j5586J962j5566M360L2784J8263L4399L2754J5160n832
15649D7142j135l8475j3763p799l858K4211K1650p143m6341J3831K4729O21j2612
15636A058n9964j1408N0272j5827l2633j4697L5987L4684J9868q839k5701q914
15624c6114L421j0273j6712j3213K3180P400j2388n391M9339L1139K2893j5532
15612B7749k1020n663l0790N712j4132K734K2630k8943k6916M8808K4357J3871
15600A8397m3562M024K2679J2770N161k7830k2838k0369k4488K7949l1881k1335
15588a01323J9201L7327p186J4084K5440j9638r456R931L1461L1331j1634K0368
$$ y = [17562, -4492, -7653, 21297, 35998, 19933, -10494, 990, 6182, -195, -16880, -38641, -34111, -58638, -55556, -71142, -69180, -84746, -80386, -47602, -29339, 5060, 37814, 52974, 47142, 46007, 7532, -6231, -14030, -17888, 6323, 27973, 20830, -25511, -11680, 13049, 13670, 1058, -58906, -70314, -20042, -35869, -68502, -83199, -47212, -12528, 7340, -1499, -27200, -36114, -32693, -42966, -59678, -72891, -49711, -42311, -54699, -60090, -10751, 20388, 43281, 27749, 6729, 1066, -29724, -24012, -38144, -35410, -12780, -41723, -68639, -19831, 4526, 18397, -25165, -21141, 1538, 14308, 19469, -8361, -31199, -51568, -76056, -48107, -79988, -101323, -82122, -44795, -51981, -37897, -12457, -32095, -41551, -31620, -159, 31172, 19538, 39906]
15576C9906P820l7808k9962k7286m8975N363P6775O3542K2634k5291n8342o845
15564a8469K6817l4496M916k2126J9483K4871K7847j0410j141J1575k7438K643
15552D072L249l1294J0748K0726k7043R393J3634L0013j1577o973j6992l151j4045
15539a9240q592m2255l811J1125Q292N574J2635N9134k215k7218J4664J2270k3978
15526c615K571J2653L012j4779j7533o967O469J796O408j9339m4846j0947J7839
15513f7278L8624M2250j2157m3302J9174N791j4601M4794k2462p6843k859L0637
15501e8232l030M709K4262R68K872k3919q614M5547J5570j9592K0482R56k2935
15488b0956k902j6178l305K778L722J6343J3051j1948m903K5705n189j3100k2518
$$ y = [39906, 47726, 9918, -20044, -47330, -96305, -90942, -14167, 49375, 72009, 46718, -11624, -18469, 8348, -26148, -21232, -43358, -23875, 996, 28843, 18433, 17292, 28867, 1429, 4072, 7321, -23973, -13225, 7501, -19542, -10149, 3485, 33498, 21921, 14948, -2044, -5195, -19240, -27832, -70087, -73898, -62773, -54481, -48907, -36272, 22862, 20647, -6571, 8093, 20363, -3615, -1044, 11609, 14621, -158, -17691, -24658, -18189, -16393, -9985, -29324, -74170, -85117, -67278, -28654, 13596, 1439, -41863, -22689, -16898, -31499, 13295, -9167, -86010, -88869, -58232, -61262, -56553, -32291, -31323, -28451, -52370, -60984, -15437, 133, -19459, 1023, 1979, -20956, -23858, -40036, -43341, -40563, -36841, -20498, -7447, -19395, -24298, 1407, -3782, -16882, -39400]
15475c9400k9760J8088M7564j902j2388N2166K7214m139m5282n3021o464K3061
15463b4263M470k5827k6851K3155N2766Q2473j4161m6651n6061N854n777j7181
15451d8054L473J2002L3485M2224K3578m7650j5246N082j9339K5739K7987m3329
15439d8J1842L7646J1625J3480j8688j8067p513J6511J101J6220j5396j8835q958
15426B0920j789O980L6N645j1477j6247Q053m589m656j9900M1537M567j9962j3535
15412d417K5078K4203l6520J2992M6901L0681j9836k1956M789J4406j3022j4301
15400D8998l0285k659J6676k928K977J4970l5691j3924l8256N756K6601k6507
15388c4272p086O050j6782K9769j6410k6056m823K4251M823J6618J7247r218l0443
$$ y = [-39400, -69160, -51072, -3508, -5410, -17798, 34368, 61582, 57443, 12161, -40860, -47324, -24263, -19793, -45620, -72471, -49316, 3450, 85923, 71762, 25111, -30950, -25096, -30873, -48054, -44581, -32579, 906, 43130, 66708, 19058, 3812, 8894, -10445, 15294, 43281, -48, 11794, 49440, 61065, 74545, 55857, 37790, 30277, 46788, 47889, 64109, 48713, 29878, 20920, 19131, 26111, 26147, 31792, 20315, 4068, 12121, 7532, 2876, -17024, 24513, 29080, 9118, -4417, 20661, 44864, 8344, 21336, 68237, 98918, 79082, 57126, 61915, 76321, 63299, 48998, 18713, 16054, 32730, 29802, 32779, 47749, 12058, -1866, -40122, -34366, -7765, -34272, -41358, -35308, -52090, -22321, -38731, -64787, -69610, -45359, -40536, -23918, -6671, -15889, -46332]
15375d6332J007M5814K1663m2653j3094N901r834K1053R554J1435j0160k9845
15363c5491Q002j9210k903L0891q533J3276O7363L1941j0253j3457l9179l9826
15351a7379Q938o281k0128K4602K6230m405j346j2614J503J4219L946l0147K1460
15338H598N1328p901k2530j7818k9147J4948J7259J1920j8601j8508k0466r966
15326d0884J8038M4041J4026k2807k652O6577L1689k5320k1122q908l7651l6649
15314b1622J2722K3590J9481J6784m23j0657K7299K8167J8879j5790m9571l3315
15302A5544j1288L311J9261O0178j5814l2611N464J3480k9732l1707K8981j2792
15290A2275q307J3790K22J0206k1249q0614j7108L4558K7772p569J8933K8227
$$ y = [-46332, -45325, 489, 22152, -20501, -33595, -27694, -37528, -16475, -6921, 4514, -5646, -35491, -27489, -46699, -49602, -18711, -27244, -13968, 53395, 85336, 75083, 61626, 22447, -17379, -8441, -14722, -34850, -10248, 15982, 11577, 10231, -2383, -880, 13339, 17285, -12862, 8598, 59926, 52025, 29495, 11677, -17470, -2522, 14737, 26657, 8056, -10452, -30918, -40884, -22846, 21195, 35221, 12414, 9762, 76339, 108028, 82708, 61586, 52678, 15027, -21622, -8900, 14690, 34171, 50955, 50532, 39875, 67174, 95341, 114220, 98430, 48859, 15544, 4256, 7567, 26828, 87006, 71192, 38581, 44045, 57525, 27793, -3914, 25067, 12275, 3968, 17758, 17980, 28186, 6937, -73677, -90785, -56227, -28455, -36024, -17091, 11136]
15278A1136j8758l9932l4983N7101O0477k3135k100j1476k3011n855K6687L5592
15266C1743L0601L5798m1528r4767m8251J1803m792L7410M6372J9299j5395k0716
15254a2423J0854q619l0916J7668K8672o83k3834j7991N4102k7817L943N4472
15242D7428J1475J9644J3379j9080R964k9360j0415K1809l095j7084j3640J4553
15230D5578r634o268k0818j8304k9591K4575Q468l0627P690N2934J0866q318j100
15217B5451o2502K3999K3857L498j0930m940p286m974O222l3507M040L298J1262
15204b2512K1564J901R906j3959L1800j8274l7040P892j3880M2611N5259Q168
15192G3436J8114M483r344k8883k4245r48k3449k1626J5779J0129P377o4474J0677
$$ y = [11136, -7622, -47554, -82537, -25436, 35041, 11906, 9806, -1670, -24681, -30536, -3849, 31743, 62344, 98142, 56614, -38153, -86404, -74601, -79393, -41983, 4389, 23688, 8293, -12423, -1569, -10188, -41104, -23436, 5236, 4553, -19281, -37272, 16830, -10987, -7044, 47428, 58903, 78547, 91926, 72846, 82810, 53450, 43035, 64844, 61749, 44665, 31025, 45578, 35944, 29676, 8858, -9446, -39037, -14462, -5994, -36621, -28931, 24003, 34869, 26551, 25451, -37051, -13052, 10805, 14303, 3373, -1567, -8853, -13827, -7605, -41112, -37072, -33774, -22512, -948, 953, 10859, -3100, 28700, 10426, -26614, -18722, -32602, 10009, 65268, 73436, 91550, 96033, 86689, 57806, 33561, 32613, 9164, -12462, 3317, 13446, 20823, -43651, -32974]
15179c2974J8484m3359L0331J0778p558J4084M4053k0752q806K9725k6040l0547
15167b2581K4611J3180L2527L2723l2413m5466J1206L5579L2647k4721m5373j6998
15155e079j0905J9614L724j9682M796l2708k4614L0838K4387J5822J6218k3899
15143a488j4567M4148j6891j9426J1198L2744k4095o702Q93L603k2026o222K7558
15130H727J3628j2039n763L8425O678k002m1485m4297k0148R430o073J807L211
15117d9901K7222L0649k5034n550K1828O114n080N56j4012j6429J4144K6739n9154
15104d7908R680L0551M4101m4960m0618j020J9306j0060n3369L4056M3442K1395
15092D596l249j5896J4148j4934r785J4441J7178K2416J0515M524q970J077L5797
$$ y = [-32974, -14490, -57849, -27518, -16740, -24298, -10214, 33839, 13087, 4281, 34006, 7966, -22581, 2030, 15210, 47737, 80460, 48047, 2581, 13787, 49366, 82013, 57292, 11919, -5079, -15984, 3630, 7354, -12328, -7532, -40240, -64854, -34016, -9629, 6193, 22411, -1488, -16055, 28093, 11202, -8224, 2974, 35718, 11623, 4921, 5814, 9417, -12609, -18831, 8727, 22355, 10316, 4553, 42978, 49656, 47654, 6169, -38128, -58276, -48846, -54919, -53112, -49901, -22679, 7970, -17064, -22614, -786, 5328, 248, 804, -13208, -29637, -15493, 11246, -47908, -38228, -7677, 36424, -8536, -49154, -50174, -30868, -40928, -94297, -60241, -16799, 4596, 1347, -14549, -401, -15335, -25120, -10679, 6499, 28915, 39430, 43954, 34984, 36061, 71858]
15079G1858j4992K5000k5453n8622m9977J1110L9084Q464j6461m5765J4704N1135
15067A0085J8293J0488j0461K250L96l3150J1558k7668p655K5118K890q564J0346
15054C926L830q444n656J8879n678j2839j7284n7178j0507L1377Q742J4257L2380
15041d195J0119j0069M0297j1856k068k1746k9022K0303j7211j3788J1107K89
15029b7840K7819K658j8831K7032n93k1182J7104R344K0401l0539j6027N1698
15017D1044r523j1310p372k2728j9381J062M7125L6738j3677m2896j2704j3073
15005b6695M5993j0557J011j7978R617j927k3004R399J1505j2668K3966K4538
14993C3200J1025r770l5454k4873M5358P1244j9693m1272l396j0087l3558k3073
$$ y = [71858, 56866, 81866, 56413, -2209, -52186, -41076, -1992, 6472, -9989, -55754, -41050, 10085, 28378, 38866, 28405, 30655, 31051, -2099, 9459, -18209, -25864, -746, 2144, -6420, 3926, 7756, -688, -6344, 12535, 6857, -5982, -23266, -80444, -90951, -59574, -50832, -36575, -4195, 5924, -4145, 36152, 24296, 22228, 482, -28540, -8237, -25448, -39236, -28129, -27840, -21, 2637, -16194, 10838, 10245, -10937, 6167, 15511, 35912, 5373, -10654, 41044, 31521, 20211, 12839, -9889, -29270, -28208, 18917, 55655, 41978, -918, -13622, -26695, 19298, 8741, 9752, -8226, 1391, -536, -23540, -14141, -2636, -15304, 8662, 33200, 44225, 34455, -999, -25872, 19486, 90730, 71037, 29765, 26369, 16282, -17276, -40349]
14981d0349J1749J2078J2895l0058l0545M1070J7335K4286K5718J0658q028k4317
14969B2492j8546l9014l3195K9896j1479n206K078M2989O5867J1980l0741j1775
14957B5346l0225K5878K2492j9566j9726j5118k0909j3868L640M287N721k0362
14945e2410L5288J7968M1112k7252K7128L297j8110q72j308k6129j3334P577J7565
14932A0520L3077j6768k3366J3306J4557k8792j5159j1463J0761m247L4662L1493
14920D8581k9358M2288N3342Q319l4606k4723p921m7321L0133L9188k3713l5191
14908A9018j4553O79K465L702m7531P913j3405J9117K3429l7832j1041J8429M1757
14895A2147q357M275K5381M2131M816p904k1266q845j3119n75q198K5707J2785
$$ y = [-40349, -28600, -16522, -3627, -33685, -64230, -23160, -5825, 18461, 44179, 54837, 46809, 22492, 3946, -35068, -68263, -38367, -49846, -55052, -52974, -9985, 55882, 67862, 37121, 25346, -4879, 20999, 43491, 23925, 4199, -10919, -31828, -45696, -42056, -37769, -32048, -52410, -17122, 846, 41958, 14706, 41834, 45131, 27021, 26149, 24841, -1288, -14622, -7045, 10520, 43597, 26829, 3463, 16769, 31326, 2534, -12625, -24088, -13327, -17574, 17088, 48581, 19223, 61511, 114853, 123172, 88566, 63843, 55922, 8601, 38734, 77922, 54209, 19018, 4465, 5144, 7609, 11311, -36220, -28307, -41712, -22595, 834, -36998, -48039, -29610, 12147, 3790, 8065, 33446, 75577, 80393, 72489, 51223, 42378, 29259, 28684, 20486, 46193, 58978]
14882E8978l1394l9335j1253m6142j3632O4323K4490j54j3549K3364L3806j2090
14870C7412m1151j0908j6579l3287M3398L3997J0424o12j797O023l6395j3661
14858b3136j8279J947K0098J2074l1786K327l6096n385L1542L4683L757K479R924
14845D149l127K766J8557L0645m0650m6064J296J1504L7720L8802P91J9137q162
14832F7364K369j1728j9556m4901j3834K2498J2156J9514L8081J2883k0504l8668
14820B5674n7434j0086K1582J2287K5103K9593n460l2001J480J3737K1554J7324
14808F3353J2747J6874j5821K7625K2976k432p0528j9516o455m074R488Q807J6039
14795E9083j2101j964p028l3710j3783j9470K7106L470l095j7713Q126M1085M0590
$$ y = [58978, 27584, -11751, -23004, -69146, -82778, -18455, 6035, 5881, -7668, 15696, 49502, 37412, -3739, -14647, -31226, -64513, -21115, 12882, 23306, 22694, 20897, 26920, -9475, -23136, -41415, -39468, -19370, -7296, -39082, -36755, -72851, -78236, -46694, -12011, -8254, -5775, 4149, 1022, 3788, 22345, 52990, 12340, -33724, -32428, -20924, 16796, 55598, 56389, 75526, 67364, 69733, 58005, 38449, -6452, -20286, 2212, 14368, 33882, 71963, 84846, 64342, 25674, -31760, -41846, -20264, -7977, 17126, 46719, 41259, 9258, 10738, 24475, 46029, 63353, 76100, 92974, 77153, 104778, 127754, 125322, 54794, 35278, 28823, 24749, 34237, 43044, 59083, 46982, 45018, 37990, 4280, -9503, -28973, -1867, 1603, -1492, -19205, -11079, 30006, 70596]
14782G0596j6133k6728j3604L5941J2819j7265q211K4772k9775j792j2456K719
14770B0883K8823j8948N804J2392n957k5836j8562l575K4732K9277J2960j3103
14758D8890n0645k4276L9178J2012m0973M2826L8525k2370l2426P673J4340J1270
14746D4024J8983j2071m1455j1697p137j5366J3400J733K9198P594m5552k1012
14734c9358P838P7957K6657l7414p579J2304r52m78J4650n668J994M321J7462
14721G1734l895n3614k1273k5693P167K9062K7078K871j0357l2051J0806L0540
14709C2375J1227m317q574k803J6228l232k600J4902k4967m5668l7317r659K7300
14696c7105K1261L8725N1658M6464R065m7657m3420q444r925J5752L8985P763
$$ y = [70596, 54463, 27735, 14131, 50072, 62891, 45626, 37415, 62187, 32412, 30620, 18164, 20883, 49706, 30758, 36562, 48954, 42997, 17161, -1401, -4976, 19756, 49033, 61993, 48890, -1755, -26031, 13147, 25159, -15814, 27012, 65537, 43167, 10741, 18414, 32754, 44024, 63007, 50936, 9481, -2216, -9353, -24719, -11319, -9586, 19612, 27206, -18346, -39358, -31520, 46437, 73094, 35680, 28101, 40405, 39453, 38975, 53625, 47957, 49951, 54272, 71734, 67839, 14225, -7048, -32741, -25574, 3488, 30566, 33437, 23080, -8971, 1835, 32375, 43602, 39285, 30711, 27908, 44136, 40904, 38304, 53206, 28239, -17429, -54746, -64405, -37105, -15844, 22881, 74539, 121003, 130068, 82411, 38991, 30547, 20622, 36374, 75359, 83122]
14684H3122j771p2337l6287q084J2892K6519q100j4842r999K2380J7417R128K6933
14671D6971K1037k1079J6024j0928j0479j1614j4401K2844p332J097K1462M246
14659E7848p482l4876O657J668n767K7847J5129J0442K1239K7528m0444k7771
14647E2018j3533m0531m1218N036K5574J6740j1635P689j9762k606K5738J3271
14635A6781j0766J6246n668m9131j1024K6067K0582R583J7637N992J5192k5127
14623B6364o068R320k1814K1701q829R627J1810j6398n2499J5209J6995R851j1456
14610C813K9242J2948q953M974k1222l334K3849L78j941o302k9281K2148J6360
14597D2679M981n8623j052L0537J3548k684k178K3547L2973l1909l5258j4834
$$ y = [83122, 81351, 9014, -27273, -35357, -22465, 4054, -4046, -18888, -28887, -6507, 10910, 20038, 46971, 68008, 46929, 62953, 52025, 41546, 29932, 15531, 38375, 31043, 32140, 53602, 57848, 50366, 15490, 22147, 23815, 18048, 45895, 61024, 71466, 92705, 120233, 79789, 52018, 38485, -2046, -43264, -38228, -12654, 4086, -7549, 140, -19622, -22228, 3510, 16781, 6015, 22261, 16593, -32538, -43562, -17495, 3087, 12670, 30307, 36299, 51491, 26364, 20296, 29616, 7802, 29503, 20674, 30301, 42111, 25713, -26786, -11577, 5418, 15269, 3813, 33055, 46003, 37050, 42024, 20802, 17468, 41317, 41695, 39754, 33452, 4171, 26319, 42679, 47660, -10963, -12015, 18522, 32070, 29386, 27208, 50755, 83728, 51819, 16561, 1727]
14585A727l970K9215J8756p680j3034j9148k0470o809P51l0609j5740L5558L2480
14572A027j4796l7806L3084M4622Q07m4734j3850J0926Q25J0539J5137j8016O064
14559f171L1612M8070l572M782L38l4821l1516R832R359k790Q214j6892J1416
14546B7861j0074l2893O35q68L6467l0364j9740R766K8960L1564J1407K499k5097
14533C0123j479J9205j7587k064p937M2881J1645k2148K0382M701p853k7138m3622
14520h91P780P67j3584J0299l4866k9700J8431J1580J3198K6036k568k0926L425
14507a1019j7457K2940L592j6277N80J9876L4985L688j6818j0556p55K4109q498
14494B8390N005K0307K3745L4243l7266j6266J2825l3820n9265k3300K369J9853
$$ y = [1727, -2243, 26972, 45728, 38048, 25014, 5866, -14604, -21413, -20662, -51271, -67011, -31453, 1027, -13769, -51575, -18491, 26131, 26938, -17796, -31646, -20720, -19895, -9356, 5781, -12235, -6171, 25441, 73511, 69939, 74721, 75059, 40238, 8722, 18554, 27913, 25123, 33337, 16445, 27861, 17787, -15106, -14471, -15339, 21128, -9236, -28976, -19210, 9750, 41314, 52721, 55220, 30123, 28644, 47849, 30262, 28198, 20261, 63142, 74787, 52639, 73021, 77722, 69869, 42731, -891, 6889, 7656, -5928, 4371, -30495, -60195, -41764, -30184, -16986, 9050, 6482, -14444, -11019, -28476, -5536, -1944, -18221, -17641, 2235, 37220, 40908, 24090, 13534, 12779, 36888, 28390, 33395, 53702, 77447, 111690, 74424, 58158, 70983, 37163, -22102, -45402, -43033, -23180]
14482b3180J0571N9774J036n8544o872j1743J8190o781Q390O445j9631J4608M7420
14469C9683M8069k1445l7655l8726N1836N3398m8742m0131J5751M9674q135p961
14457E5616J693O133j645L1715k5189K602n82k0336J0197q096o0226k3803K5448
14444f473N9073M256L029m485m9580m3462J4140J9146K3027J2185q676m624K1127
14431C8683K0730q975j5258J3386K0389k2534m9828K693L248J3511M058j5521
14419D582O152p0j8512O034M6113m0709k9410J9133M2726K3091n6722l5231O034
14406b6789k8297j60K8677N7739O131m0176l6950K9517j9345K9358M7423L2558
14394G9686j0850Q084k6927k2936J0125L7860K1555R999L3565j5007o294k4909
$$ y = [-23180, -12609, 47165, 48201, -10343, -17215, -28958, -10768, -17549, -9159, -2714, -22345, -7737, 39683, 87752, 66307, 28652, -10074, 41762, 95160, 46418, 6287, 22038, 71712, 63577, 55616, 57309, 63442, 61797, 93512, 68323, 70925, 70343, 50007, 60204, 52108, -8118, -31921, -6473, 52600, 56856, 59885, 55400, 5820, -37642, -23502, -4356, 18671, 30856, 22180, 17556, 38683, 59413, 50438, 35180, 48566, 68955, 46421, -3407, -714, 2534, 16045, 20103, 4582, 10734, 10664, -7848, -1814, 44299, 3590, -25820, -6687, 36039, 59130, 2408, -32823, -26789, -55086, -55246, -26569, 31170, 37301, -2875, -39825, -10308, -29653, -295, 47128, 79686, 68836, 76920, 49993, 27057, 37182, 75042, 96597, 106596, 140161, 125154, 118860, 93951]
14382I3951J60K0884O954J878j3339o0946l5215K2754L974m240K5221j4750j9135
14369B8151j769J7444P979L148N3166J9877k9059k256J5716M711l4406K9728K671
14356A15101l9864k0011O297K7964L4773J9563M990k4129k8839n8533l1368p754
14344a810K5996k801M5992L5753l3411m9461K205P78j0224j8693m954K7273K7327
14331D3970M5169j770K7680K86m563l1367l5102j7617m080m122l5126j5063P599
14318b4106L2973l144r962K3055O7513P251n6979k3670q909J2802j589r438K1154
14305B6951K0544j4284k7842J7301l301K4328J3891o288L277J3555P246J472k3708
14292E3142p281O893R449k1968Q321K0380K4103j613J7924l914k2655m7843j1190
$$ y = [93951, 94111, 114995, 121949, 123827, 110488, 49542, 14327, 37081, 41055, 36815, 62036, 47286, 28151, 26382, 43826, 51805, 54953, 108119, 127996, 98937, 96681, 112397, 117108, 82702, 112430, 115101, 75237, 55226, 61523, 89487, 124260, 143823, 148813, 124684, 95845, 37312, 5944, -1810, 24186, 21385, 67377, 103130, 69719, 20258, 22463, 23241, 13017, -5676, -10630, 16643, 43970, 89139, 87369, 115049, 115335, 110772, 79405, 44303, 26686, 22606, 18484, -16642, -31705, -24106, 8867, 5723, -4239, 18816, 86329, 93580, 36601, 12931, 4022, 16824, 15235, 5797, 26951, 47495, 33211, 5369, 22670, 19369, 43697, 57588, 51300, 54577, 68132, 75378, 76850, 53142, 45861, 52754, 62203, 40235, 48556, 68936, 93039, 91426, 109350, 105436, 82781, 34938, 23748]
14279B3748N0912J9563k3045Q470k163L815L52j6905L4363J3067n198o4316j5635
14266B7028Q762O040M054L9098j9476l4605K1786J4285l3983O960M8057Q57n2826
14253C6037J8581J6999p533o506j8435j8295j9895l285K3646J7527P1896k8801
14241H1936p9025j3087K1859M6385K4965k4020j2696J5662k9500j9802j6886j4429
14229a8638M283L0238P480J6880n3917l4005N2065N0350j0667q952P601j9628
14217B3090J3301O409r280J4828K8567l7932j3730r503J5523j3145L78L9213l5840
14204B1879l7177K1042L0641p963K1926k002k6215J730l4405j4158k4828Q050
14192d1480K9583P0954r155n075l328K2080k6331k1955P4197J696O337n498J2316
$$ y = [23748, 74660, 94223, 71178, 79648, 77485, 81300, 81652, 64747, 99110, 112177, 106979, 42663, 27028, 35790, 41830, 45884, 84982, 65506, 30901, 52687, 66972, 32989, 39949, 88006, 88863, 36037, 54618, 71617, 64084, 57578, 39143, 20848, 953, -2332, 21314, 38841, 110737, 81936, 2911, -10176, 11683, 58068, 83033, 59013, 46317, 61979, 32479, 12677, -4209, -18638, -14355, 15883, 23363, 40243, -13674, -47679, 4386, 54736, 44069, 35117, 42718, 23090, 36391, 42800, 33520, 48348, 76915, 38983, 25253, 15750, 31273, 18128, 18506, 57719, 21879, -15298, 5744, 36385, 28422, 50348, 48346, 22131, 23861, -10544, -24702, -49530, -41480, -11897, 59057, 49902, 44827, 41499, 63579, 37248, 15293, 89490, 91186, 97523, 92025, 104341]
14179A04341j6478j1778k5625j4695p729m378J0637R646k4429K2888M166j8541
14167B8025K1446j8863K30J1639n0919k4956K4278M7892M0758R244l595M063j6191
14154G3051j0590l4487l8679J5717K5027K6831K7792p037M038k5448l16l0186
14142B5713k2144j07J9313mK5974J8988L269j3689J4090K8550M425m9884j0979
14129D3515J8974j5172m0125l7250N6408O3583R223j158l0128j5988J5929J8171
14117H5982j9956j670L1186l2117k1756J852p966m048l2326O394M1322l6005P505
14104A8397J7151R214J2339Q232N7600O237n3616J622J3189l1375Q293J1957J6285
14091I5525j6683j4549r201k995k6699k1790N593j4936K7245M165N210J6788J9290
$$ y = [104341, 87863, 76085, 50460, 35765, 28036, 23658, 34295, 43941, 19512, 42400, 46566, 28025, 49471, 30608, 30838, 42477, -8442, -33398, -9120, 38772, 79530, 88774, 85179, 89242, 73051, 62461, 27974, -10705, 5012, 30039, 56870, 84662, 77625, 81663, 56215, 55899, 25713, 3569, 3462, 22775, 22771, 48745, 67733, 71002, 57313, 71403, 99953, 104378, 54494, 43515, 62489, 47317, 7192, -30058, 26350, 89933, 99156, 97998, 67870, 51882, 67811, 85982, 66026, 64356, 95542, 63425, 41669, 43521, 35555, 31507, -819, 5575, 46897, 10892, 18397, 35548, 44762, 57101, 65333, 122933, 129170, 75554, 77176, 90365, 58990, 67283, 79240, 95525, 78842, 64293, 55092, 52097, 25398, 3608, 9201, -5735, 21510, 25675, 30885, 47673, 66963]
14078F6963L282P862l7908k6841l3012J9666K1388n844l127J0656J5519q388J3323
14065D3539M770l2322q819l1065L0465O3188N149k4253J150k4392L7080L7336
14053A01826k3035p545k6692k6955l1976k4321L5028N6847q42K3835k8699j7543
14041B9928K2026O3996K2236M108l3203m3537k3475J1169M0852P289r47l809k5916
14028G0717K3507K1311p571k8595k8276m3481K5997m7803k8416J1666J0124L2215
14016A1395J5835m888J6314L9112p928n802M317O2j674R368l6948q313N2679j0057
14002G3472L528J5688J0980Q394M482l3563m0875j9701q732o862j4349L6924M6574
13989G5960M939k1116n099j471K2226j0743k2932j4554r005K7976j755k061J5976
$$ y = [66963, 70245, 78107, 40199, 13358, -19654, 12, 21400, 15556, 12429, 23085, 38604, 30216, 43539, 48309, 15987, 7168, -23897, 6568, 69756, 74905, 50652, 51802, 27410, 64490, 101826, 78791, 71246, 44554, 17599, -14377, -38698, -3670, 53177, 52335, 76170, 47471, 29928, 51954, 115950, 138186, 142294, 109091, 65554, 42079, 53248, 94100, 101389, 100442, 96633, 70717, 94224, 115535, 107964, 79369, 51093, 7612, 33609, -14194, -42610, -30944, -20820, 11395, 27230, 22342, 38656, 77768, 69840, 64038, 68355, 68417, 66743, 76111, 39163, 30850, 83529, 73472, 77000, 92688, 103668, 112062, 116544, 82981, 42106, 22405, 13673, 6811, -7538, 29386, 75960, 80899, 59783, 54684, 53213, 75439, 64696, 41764, 27210, 18205, 46181, 44426, 42365, 58341]
13976E8341k3444J9793O923K0894j5884P723J5166k2511p4066j1844L0917J8926
13964C0934L9212j6139m3111q020n694n441L1393J0445k0361l5604L0801L9447
13952D7862k449j0171M791M653N1456J4419k3099n9222r756k6023P322N5820k4265
13939C1338l6110L5507N2413l790j8794j3694J0839m026L4494k7321Q48L633k863
13926F2474Q082L1302J6953m980n3632j6653P2855K0688P857j0358j0464p774
13914A16350M573n1043l7564r137j5578p03L2375o874k8921k4562m656K1346L5582
13901C1188j136n882J3625j9316p1033o386M5737J8508J9227M5922n3326l8319
13889b1191o618N7183P5468k4800l1221l4988j3497K611O005L385n085J0387J0304
$$ y = [58341, 34897, 54690, 61613, 82507, 66623, 74346, 89512, 67001, -7065, -18909, 12008, 30934, 70146, 54007, 10896, 2876, -2818, -8259, 23134, 33579, 13218, -22386, 8415, 47862, 45413, 35242, 40033, 44686, 96142, 110561, 87462, 28240, 18484, -7539, -217, 55603, 31338, -4772, 30735, 83148, 79358, 60564, 46870, 57709, 53683, 88177, 60856, 61704, 65337, 62474, 70556, 101858, 118811, 113831, 60199, 43546, 116401, 137089, 144946, 134588, 124124, 116350, 120923, 69880, 32316, 23179, 7601, 6898, 39273, 32399, 3478, -21084, -25740, -4394, 31188, 30052, 24170, 37795, 18479, -52554, -58940, -13203, 5305, 24532, 70454, 17128, -21191, -27809, 29374, 104842, 80042, 48821, 13833, 336, 2947, 8952, 12337, 7252, 17639, 27943]
13876B7943J5359k21l9267k5517J2574L5895J2453J4892Q44J2310J8598J1146
13864I7009J252l057q141J0152k0691j9767j1086J7454M007J994n741k8437J5551
13851E0499M4166k7002m4384j4862L9260O476M637J7652K8556l3273l5211J2160
13839D8674j4267m6524N616n498j7042K1879J3566R020m0940j9679L3001L4751
13827B2557J1086R392k4422L0054L9899K949j4656k8860m826j9076K9690K9604
13815H3391k1284j0877l7647n165N730r769L0971L5409j536O650J7670m135k0736
13802F8672k9551k2173K3563K2858j5680J5729n846K4172m0665m5041L922P29
13790F89n22J2042j2027j4374L7590L0055j8483J6634p458K7061J4443N205j2094
$$ y = [27943, 43302, 43081, 3814, -21703, -9129, 26766, 39219, 54111, 54955, 67265, 85863, 97009, 98261, 95204, 87063, 97215, 76524, 56757, 45671, 63125, 67132, 69126, 63385, 34948, 50499, 94665, 67663, 23279, 8417, 47677, 54153, 58790, 76442, 104998, 71725, 36514, 48674, 34407, -12117, -6501, -11999, -29041, -7162, 6404, 15424, -25516, -45195, -12194, 22557, 33643, 43035, 18613, 48667, 88566, 91515, 76859, 47999, 43173, 24097, 53787, 83391, 62107, 51230, 13583, 8418, 14148, 4379, 35350, 70759, 69223, 75873, 93543, 89408, 68672, 39121, 16948, 40511, 63369, 47689, 63418, 57572, 81744, 41079, -3962, -40, 689, 167, 12209, 182, -14192, 23398, 53453, 34970, 51604, 44146, 71207, 85650, 90855, 78761]
13777G8761o133j0147N8457K5334n1346j3972k8751J764k624K1196j8894j1221
13765D2424k0526J2559J2488O745l0670k1030p322j2818K0079J6195J446K1621
13753D1191l8022j6373K7078M1582j167K5871P401p068o029j029j7958o15M583
13740E9445N300k3125k9368l384L9421Q800L8967j4454j6264L7887K2642J2618
13728A38485j1886k7493k2390K498l2692j8881p785J2871M1401l3611k5032J380
13716A6865K6865j8925m638O0136O184j5486j2520j2632J2660n953r992N519K1078
13703F9161L9441j783j380K8829k3125k8785M402n7020o827K983P300K8540J943
13690F3679k3847j4221L5096K4217K8997Q675J2203K4428Q076o5617m1642M4287
$$ y = [78761, 72628, 62481, 120938, 146272, 94926, 80954, 52203, 53967, 51343, 72539, 53645, 42424, 21898, 34457, 46945, 53690, 23020, 1990, -5332, -18150, 1929, 18124, 19570, 41191, 3169, -13204, 13874, 55456, 54289, 80160, 87561, 80493, 74464, 73435, 55477, 54862, 59445, 64745, 41620, 12252, 8868, 48289, 57089, 96056, 81602, 65338, 103225, 125867, 138485, 126599, 99106, 76716, 79214, 46522, 27641, 19856, 32727, 74128, 40517, 15485, 16865, 43730, 24805, 20167, 80303, 86487, 71001, 58481, 45849, 58509, 52556, 42564, 48083, 69161, 108602, 106819, 105439, 134268, 111143, 82358, 86760, 29740, 22913, 25896, 33196, 61736, 63679, 39832, 25611, 60707, 84924, 113921, 122596, 134799, 159227, 167303, 101686, 60044, 104331]
13678A04331K129n2681K415l7868m3385K7217P8841J2475k7498l0096j9689L5096
13666E1287K6920k2342l7751J9980O2565K5303j2338n5329k5930L3648Q313M091
13654G8417R332J4978n2649l8000j6659k8349l2086L5040M2973l071k1424K3825
13642A2327N380Q17K4563j0784K7533j4207k2034J469L2794J4998K5889J4187
13630A12932J4865O470j7445l6982j3034R162j7578j5405J0843k7278Q22J2672
13618D0044J2790P172k9397q076k0565K6328O344l4924q092K903j5363J2510M1344
13605C3018N288K0272L841J5753k1741K749L0737K7003M5625l799k9544j7933
13593A11269k5584K0279r82m3892j4296j1044P195m056r656m263K300K0595J8857
$$ y = [104331, 106460, 53779, 56194, 18326, -25059, 2158, 80999, 93474, 65976, 35880, 16191, 51287, 78207, 55865, 18114, 38094, 100659, 125962, 113624, 58295, 32365, 66013, 74326, 78417, 87749, 102727, 50078, 12078, -4581, -32930, -65016, -29976, 12997, 9926, -11498, 12327, 17707, 18524, 43087, 32303, 59836, 45629, 23595, 25064, 57858, 72856, 98745, 112932, 127797, 134267, 116822, 79840, 66806, 75968, 58390, 42985, 53828, 26550, 27372, 40044, 52834, 60006, 30609, 22533, 1968, 28296, 34640, -284, -8376, -5473, -20836, -8326, 33018, 38306, 58578, 62419, 78172, 56431, 59180, 89917, 116920, 162545, 158746, 129202, 111269, 85685, 105964, 104982, 61090, 46794, 35750, 42945, 38889, 29233, 24970, 27270, 47865, 66722]
13580F6722J3625J3124K4372j5342j2798j8405k3746k8897J6736q509K3228J2535
13568F2645Q650j549k0736l6156J181K3807n99J012M3307p162j9812r275M4951
13555I0264K7384j7854n3376j5169l4718m303J0270O960L9876N1033L8120j2219
13543A26268n8118j624J9250n096L7881K6314k1570l9752l1080j1773r947k1968
13531H785K1666L3230K9535q313l5231j1612M8029M5399J5697p686j9003j4445
13519A06051O791K9922L1676l8931n5425m4457l416j3100J9457K8379k1358j9321
13507B6268J5059K6905o933j8756N217P396L0946L0174O074j2058L40l8184K3001
13494I5449k9731o8059J5504K5341o802m065J2721M167J7607k3648K700L411J7549
$$ y = [66722, 80347, 93471, 117843, 102501, 89703, 71298, 47552, 18655, 35391, 26882, 50110, 62645, 71295, 69746, 49010, 12854, 14035, 37842, 37243, 38255, 81562, 74400, 54588, 45313, 90264, 117648, 99794, 46418, 31249, -3469, -7772, 2498, 9458, 49334, 100367, 138487, 126268, 68150, 66526, 85776, 80680, 118561, 144875, 123305, 83553, 52473, 40700, 30753, 8785, 30451, 63681, 93216, 84903, 49672, 38060, 86089, 131488, 147185, 139499, 120496, 106051, 112842, 142764, 174440, 135509, 80084, 35627, 32211, 19111, 38568, 66947, 45589, 26268, 41327, 68232, 61299, 42543, 47760, 55156, 86102, 116276, 122350, 110292, 110632, 72448, 95449, 65718, -2341, 13163, 38504, 31702, 27637, 40358, 44525, 62132, 38484, 41184, 44595, 62144]
13481F2144Q25k4959l538m389J0400j8959L7391L4906j0871Q449J4765p479L7756
13468A36441q712m2343m3337l1427o94R502K3885J9332j3036j9943l962J8166
13456D3872k6926M677M2913M0088K2675R631j1268K1630j5417l9227k9832K2389
13444H5205l49o243j3053k4356J447p422N20J4917L2513N9021L1906m2269m4061
13431H7776o715k6183k7489j4981M871K8057K3933l1133n224N2604J6012o7748
13419C3780r655J2809K9882L8556M372l2076Q586K3284K0955j691n7556k3337
13407D7909k4678r95L2483O3597L6968k3523k5655j0535m2909J2618j898l5945
13395B7437k389K4870K64J1287n1336L998M7134K3234k9972l1132L848Q114R146
$$ y = [62144, 62969, 38010, 34472, 30083, 40483, 21524, 58915, 93821, 82950, 91399, 106164, 98685, 136441, 127729, 85386, 42049, 10622, 9928, 19430, 43315, 62647, 49611, 29668, 25706, 43872, 16946, 21623, 64536, 104624, 127299, 136930, 125662, 147292, 131875, 92648, 62816, 85205, 84856, 78613, 65560, 41204, 42651, 35229, 35749, 50666, 83179, 142200, 174106, 131837, 87776, 81061, 54878, 27389, 12408, 17279, 45336, 69269, 38136, 32912, 85516, 101528, 33780, 24125, 36934, 66816, 105372, 109744, 77668, 86254, 109538, 130493, 128802, 71246, 47909, 23231, 22236, 54719, 118316, 155284, 131761, 106106, 95571, 52662, 65280, 63382, 27437, 25048, 49918, 50182, 61469, 10133, 14131, 61265, 84499, 54527, 23395, 27243, 35357, 44503]
13382D4503k4671K756J2538L9521M6028k6109j6166J6837K2298J875l8946m3614
13370C6850m750r545N220L608K759l9869l020K1294L830R272K195k2204P896J3179
13356B6715L630m106N3552M9371J0407l686o848J8892J3465k8711m4423q182r65
13343G9111K4167k378n5400k484k265n024K747K7477p728J7417K619J735J7004
13330I6998J8603K188l9789k9377j4942k540l3121J2368L2200j541J0768K5307
13318G7122M2206L3160o258j4966n5021j5154r496r144l501J5445L4924R776k3566
13305G5527j960J3302K5265q617k6441M876K4382J8503l9302k8912j7685M6713
13293H5651O126m2260l1381q29L908L8298J9439K3842K7881l7408k2511k3222
$$ y = [44503, 19832, 22588, 35126, 74647, 120675, 94566, 78400, 95237, 117535, 119410, 80464, 36850, 32100, 22555, 27775, 31383, 34142, -5727, -8747, 12547, 16377, 25649, 27844, 5640, 13536, 26715, 30345, 26239, 79791, 129162, 139569, 135883, 129035, 147927, 161392, 132681, 88258, 80076, 79111, 103278, 100900, 45500, 43016, 40751, 35727, 38474, 65951, 58223, 75640, 78259, 79994, 96998, 115601, 117789, 78000, 48623, 33681, 31141, -1980, 10388, 42588, 41047, 51815, 77122, 119328, 152488, 146230, 131264, 76243, 61089, 51593, 42449, 38948, 54393, 89317, 99093, 75527, 73567, 86869, 112134, 103517, 77076, 81952, 106334, 124837, 85535, 56623, 38938, 85651, 91777, 49517, 18136, 17307, 21215, 59513, 78952, 102794, 130675, 93267, 70756, 47534]
13281D7534j3751N0440j362j3137m733K0439K1363j890l2125l2360J3697J6534
13269G0649j2525n8110K7036M6820J2861k0986l8013J2266M148K9774l994l9238
13257C0688Q320J1040p543K7065j1335j1153K8645j0117j9781j0387K1859J3614
13245G0915j5128J2493N370p048n022j9824Q770K5534M4689k3199n2579j6709
13233B8262k701j8303J1659k234L6048L0687K1472N231O327j3184r668J6994O62
13220A11252J0427L2991k5151o2452n243r074n0710k915N1708K1023j3473L0944
13208H9327k638q117m1663j2181P020K9099K7879K9635K2782m1952l1227k1125
13196D6839j805K1319o4755j2380p229K7049J8584p727j3703L0352L8626K2139
$$ y = [47534, 33783, 84223, 82861, 69724, 64991, 85430, 106793, 104903, 72778, 40418, 54115, 70649, 58124, 14, 27050, 73870, 86731, 65745, 27732, 39998, 44146, 73920, 69926, 30688, 39008, 50048, 42505, 69570, 58235, 47082, 75727, 65610, 45829, 35442, 57301, 70915, 55787, 68280, 73650, 66602, 61580, 41756, 50526, 76060, 120749, 97550, 44971, 28262, 25561, 7258, 18917, 16683, 52731, 83418, 104890, 110121, 116448, 103264, 93596, 110590, 111252, 121679, 154670, 129519, 67067, 61824, 52750, 2040, -875, 50833, 71856, 58383, 89327, 86689, 78572, 36909, 24728, 31748, 60847, 88726, 118361, 141143, 99191, 67964, 46839, 45034, 66353, 1598, -10782, -18011, 9038, 27622, 19895, 6192, 36544, 75170, 97309]
13184I7309J1512j2158m6126k7286K0409J5616J0400m1998k4184J8128J5719j50
13172C7191j928J2207J3689J7172K2553P766r149m488j7508q090K2849K979m0760
13159E4483J6659j9259k5694K2347l476o911P590L526n224j4766o425K201o044
13146A9007N917J5927K3366j2477K9332k0403k5084j0992r163L774k2368K2356
13134A9192K0133j7063p270n4121J4425J1350J111M9863J9585L6989Q63j4419
13122H0638l2659j8828P966K7057K658k6036j4671J643L7268J2359k5767k554
13110D9074K4958J5330m1065o4971k8563L2748j052J6762K2876J9165k964R511
13098E1809K9521q441p2427m3903J1248L2485K3955O884j6242K9784L0731j9782
$$ y = [97309, 108821, 96663, 50537, 23251, 43660, 59276, 69676, 27678, 3494, 21622, 37341, 37191, 35263, 47470, 61159, 78331, 100884, 108650, 99501, 95013, 77505, 69415, 92264, 95243, 54483, 71142, 51883, 26189, 48536, 45060, 38149, 45739, 49265, 44041, 29275, 22850, 25051, 19007, 24924, 40851, 64217, 51740, 81072, 60669, 35585, 24593, 15430, 19204, -3164, 19192, 39325, 22262, 14992, -39129, -24704, -13354, -12243, 37620, 57205, 94194, 95057, 80638, 47979, 29151, 37117, 64174, 66832, 40796, 26125, 27768, 65036, 77395, 51628, 49074, 74032, 89362, 48297, -16674, -45237, -12489, -13541, 3221, 26097, 45262, 42298, 51809, 81330, 72889, 462, -43441, -32193, 292, 24247, 31131, 14889, 44673, 75404, 55622]
13086E5622Q736K4181l6807n677L7645K0437j6610o441r624j5273j8116k0192
13074A7881p640Q404j5852k956J8947K0507J8973J7834j1081l542L5291o272k7056
13061F3438j7372j3720N440N0019O750l3393j6813k0163J9371K9704K5136j7270
13049H1127J567L7721m6703m8475J684J7767J9380N362K2755k8242k5603J081
13037C9421J3626K1557J0837m7742j6648J2024K8480j6682k586K049l379L313
13025D4270r206Q19J0392O908M6479K2713J3531L0293k7785k1378J2539L2122
13013A61697M968K4019M43l8008m4791j7208o517J4776J3281n1752k9119L2471
13001F4260N3998K7436J0938K8251m9481k6652j5106j411l399J000R73J6320m448
$$ y = [55622, 64358, 88539, 51732, 46055, 83700, 104137, 87527, 81086, 71462, 56189, 38073, 17881, 10241, 18645, 2793, -163, 18784, 39291, 58264, 76098, 65017, 61475, 96766, 90494, 63438, 46066, 32346, 37786, 87805, 94555, 61162, 44349, 24186, 43557, 73261, 98397, 81127, 82694, 120415, 73712, 25237, 26921, 44688, 64068, 69430, 92185, 63943, 38340, 39421, 53047, 74604, 85441, 37699, 21051, 33075, 61555, 44873, 42287, 44336, 40957, 44270, 35064, 35883, 46275, 53183, 99662, 122375, 135906, 166199, 138414, 117036, 129575, 161697, 166665, 190684, 191127, 153119, 108328, 91120, 84603, 99379, 112660, 60908, 31789, 64260, 118258, 145694, 156632, 184883, 135402, 108750, 93644, 92233, 88834, 89834, 90807, 107127, 102679]
12988A02679m681j5342k5875j6785L4718J0224R78j3361J6938j2670J888k4185
12976E4526m4343M1648N9163J2381K3199j106J4875N271k461k2627r192N826O462
12963A43622r757j3945r480J2273J5093m407k2643l5981r595K203k1869J5378
12951F0892k486j1382j359r326P73P511j1104j931L549J2913j6382K0977K4126
12938G6771K3264j3522j989J644J3612J1372L3054R044k3957l1736j5847K0201
12926A01911R122n592j8021l094K5173J1715j9219J3872j1292K7413p830m4842
12914G9316K5395J4473J0729L2892K7137J2874l771L259N301K9421N6791M8166
12902C41983O1869Q4790J15471J68346K58307L00201L05698K03432P0896k2956
$$ y = [102679, 97998, 82656, 56781, 39996, 74714, 84938, 85916, 72555, 89493, 76823, 78711, 54526, 10183, 51831, 110994, 123375, 146574, 145468, 160343, 165614, 163153, 140526, 131334, 137160, 143622, 133865, 119920, 110440, 122713, 137806, 133399, 110756, 74775, 65180, 67383, 45514, 60892, 58406, 47024, 45665, 36339, 37112, 44623, 33519, 31588, 35137, 48050, 31668, 52645, 76771, 100035, 86513, 84524, 86168, 99780, 111152, 144206, 153250, 129293, 97557, 81710, 101911, 111033, 105441, 87420, 84326, 109499, 121214, 101995, 115867, 104575, 131988, 124158, 79316, 104711, 119184, 129913, 162805, 189942, 202816, 199045, 202304, 207605, 237026, 293817, 341983, 403852, 488642, 604113, 772459, 1030766, 1330967, 1636665, 1840097, 1910993, 1888037]
12892A888037j61615k57902k78376k46946k22192j67371j07246n7053k5852l4574
12882C28910n7930o0001q037m8433l2071J8390j4793j2676l5734j4180K039K2284
12870H7768K4893J2776k3864l047m0651j2125K2178K03J7473k2348l6641l1809
12858e194L8103l325J6425l38k1121L2579K8088n902j8188j9632p581J8313K87
12845E2514M669K845k9289J4914L3065J0858l9929r184Q682K4045O681k5781M913
12832E9003k7391l280J8443J7897j140n382q284J3476J0557l269K3564q409P82
12819H6567k9904M7307L8546L98k668m97l4021l4784q93J3128L1093L5459k0863
12806A28868k4480o87j0890m481J1849k010j6678K059r651M210k8302l4907j2379
$$ y = [1888037, 1726422, 1468520, 1190144, 943198, 721006, 553635, 446389, 389336, 363484, 328910, 270980, 210979, 202942, 154509, 122438, 140828, 126035, 113359, 77625, 63445, 65484, 87768, 112661, 125437, 101573, 98526, 57875, 45750, 67928, 68131, 85604, 63256, 26615, -5194, 32909, 29584, 46009, 45671, 24550, 57129, 85217, 79315, 61127, 41495, 33914, 52227, 52514, 57183, 60028, 30739, 45653, 78718, 89576, 49647, 40463, 49145, 73190, 79871, 54090, 59003, 31612, 28332, 46775, 64672, 63532, 58150, 49866, 63342, 73899, 70630, 94194, 85785, 86567, 56663, 103970, 142516, 142914, 140246, 139749, 105728, 70944, 70051, 83179, 114272, 149731, 128868, 104388, 103701, 92811, 88330, 100179, 98169, 81491, 83550, 73899, 78109, 49807, 14900, 2521]
12793B521K1192m26L2064M3434n034k8995n4524P126l945o699J1502K8971K0750
12780F7937L780j6541M8374J4577O135l3641l7757p238J0837k5804r488K7906
12768D9077n1369j9996L8847P8858m845k3233k32k880J9646J7139k0727l3559
12756D6726k4051L5607J8987J1468j6219q796p568L584L4068J54l505p323k0085
12743F3047l5116R763N1372O20j4666J7062J3546J0324n307j3772j7714l1839
12731D7320k1748k0362k293k7361k5773L9059M6006j202p100N7347P2523M4479
12719B00895K5490k0525q464J2389l35M4127P3k5962j6174m1478j0287M248J7372
12706A81369l0826k2104k6357j6201j8838m462P903k955k6705m3789l514P0739
$$ y = [2521, 23713, 23287, 55351, 98785, 93751, 64756, 10232, 17358, 13413, 6714, 18216, 47187, 67937, 71717, 55176, 103550, 118127, 124262, 90621, 52864, 45626, 56463, 30659, 21171, 49077, -2292, -22288, 16559, 95417, 90572, 67339, 67107, 64227, 83873, 101012, 80285, 46726, 22675, 58282, 77269, 88737, 72518, 63722, 56154, 59738, 93806, 93960, 90455, 83132, 63047, 27931, 37694, 89066, 89686, 75020, 92082, 105628, 115952, 110645, 96873, 79159, 47320, 25572, 5210, 2917, -24444, -50217, -11158, 34848, 33646, 26546, 83893, 156416, 200895, 226385, 205860, 197396, 209785, 209450, 253577, 253650, 227688, 211514, 170036, 159749, 163997, 181369, 150543, 128439, 102082, 85881, 67043, 62581, 70484, 67529, 40824, -2965, -6479, 64260]
12694F4260J6977m109N2819K8100K0093L2121J9703J2216N2060k9188n9705n6446
12682A48901j6122k7492j2903k9536o0596l0600o017L3588N5069J0086J6383k6960
12670E3801N297J7978K520J5257N001K3538j9320j2136k6186n0004k5588J2094
12658B252N260K224l6357L9933L4540N7176K8825J9255M715o647L676j2522l3033
12645A09297l2474Q776M377p084J4104L5627O620J1670Q436k0259n7600o2206
12633A9284k6270l8445j7079j2554R529K1085J8587L6521N7988Q010P910K3423
12621A07989n790k7942j1353j7437J7165L2366M719k3408l559j291J5844M9018
12609A36321L7209Q5744J13680J12558R1824M272k6824l0336q545m01J1513j1529
$$ y = [64260, 81237, 77128, 129947, 158047, 178140, 210261, 229964, 242180, 294240, 265052, 205347, 148901, 132779, 105287, 92384, 62848, 2252, -28348, -34365, -777, 54292, 64378, 80761, 53801, 59098, 77076, 79596, 94853, 99854, 123392, 104072, 91936, 65750, 15746, -9842, 2252, 7512, 9736, -26621, 13312, 47852, 105028, 133853, 153108, 157823, 151176, 154852, 142330, 109297, 76823, 85599, 89976, 82892, 96996, 132623, 139243, 150913, 159349, 139090, 81490, 19284, -6986, -45431, -62510, -75064, -65535, -44450, -25863, 10658, 68646, 76656, 84566, 107989, 102199, 74257, 62904, 45467, 62632, 94998, 99717, 76309, 72750, 71459, 87303, 136321, 173530, 259274, 372954, 485512, 577336, 581608, 554784, 524448, 515903, 515502, 527015, 515486]
12597E15486j1995l2319k6736J9527M909j9235n7731j01471j49570j48827j33287
12586a41249j16348n3263J0004O3689R5726J51731J57451J99300J46597J21161
12576F34799M9283J1105k325l9757n4763k6469q411k2325m4499j3074o269m2507
12564D34788o5430o3475j0842L4555k967q273k1899j178J8373M2874P740m0215
12552C24051m601j4574o380K2261Q305m356N203J3896K0750M1387L4959R896K7595
12539D78392Q2773l5422n0079k8085q677J7432M71n81N392J6982N0357J0923j7657
12526E22221q23J1956j8447L5778M0187N7286N1788M0346q368l0625L6591O1922
12514G99812K3387L882K6528L2814M8930M1053L9773L2402R5056Q6880M5944N0788
$$ y = [515486, 503491, 471172, 444436, 463963, 468872, 449637, 391906, 290435, 140865, -7962, -141249, -257597, -310860, -300856, -237167, -141441, 10290, 167741, 367041, 513638, 634799, 684082, 695187, 692862, 653105, 598342, 571873, 563462, 541137, 496638, 483564, 477295, 434788, 369358, 305883, 295041, 329596, 326629, 318356, 296457, 295279, 313652, 356526, 364266, 324051, 319450, 304876, 298496, 320757, 329062, 324706, 329909, 343805, 364555, 405942, 440901, 450797, 478392, 561165, 525743, 475664, 447579, 438902, 456334, 456805, 456224, 461616, 478598, 528955, 539878, 522221, 521398, 533354, 514907, 550685, 590872, 648158, 699946, 740292, 731924, 701299, 737890, 799812, 823199, 827081, 853609, 886423, 935353, 976406, 1016179, 1048581, 1143637, 1230517, 1276461, 1327249]
12502A327249L7723O4227Q1985O1040L3384P0375P3819Q3178R0973M2351P5086
12491B041390J08100J62794J69187J60220J73121K18024K37572K54621K44419
12482C769448K80438L00392L37704L67547M13170M83551N55503O12585O88151
12473G808489Q64152R57970J113949J312455J599173J977329K439600L106479
12465B1179596L824090M668511N707343P134555R144436J2251855J7044450K4669572
12457A05624408L5689276M9155495N8861022O0089944N1125333K5773694k350973
12450C83968199l0720189n2009457n8297709n5265951m5052851l3151088k3502748
12443H5968206j6711528j2215288r312809p301722n930718m908198m051492l376503
$$ y = [1327249, 1364972, 1429199, 1511184, 1572224, 1605608, 1675983, 1749802, 1832980, 1923953, 1966304, 2041390, 2149490, 2312284, 2481471, 2641691, 2814812, 3032836, 3270408, 3525029, 3769448, 4049886, 4350278, 4687982, 5055529, 5468699, 5952250, 6507753, 7120338, 7808489, 8672641, 9630611, 10744560, 12057015, 13656188, 15633517, 18073117, 21179596, 25003686, 29672197, 35379540, 42514095, 51658531, 63910386, 80954836, 105624408, 141313684, 190469179, 249330201, 309420145, 360545478, 386319172, 383968199, 353248010, 301238553, 242940844, 187674893, 142622042, 109470954, 85968206, 69256678, 57041390, 47728581, 40426859, 34496141, 29587943, 25536451, 22159948]
12435B2159948k771829k203491j814369j555273j307721j070917r20022q05726
12427I710600p42976o31642n55025n14820m82437m31321m11467l34208k37889
12418E368815k36562k62719k57793j99432j33573k09488k13918j43538j35062
12409C576730j93063j31821j40073r0231j11754j35035j37561o9488p1525j16343
12399B379836p9385q9739m1579p1596r3879p3801l0465j5180m7196l7603n2565
12388A746848q3226j02524q5362j1693J0072j392k0380p2652q5389m6647K0883
12377A268538o886K1604k8329j4449k4557m4134j3132k4923j2440m9099q5525
12366I86668j4078k5697k4347j3991p769l440R422n583R021k1718o7514q9177
$$ y = [22159948, 19388119, 17184628, 15370259, 13814986, 12507265, 11436348, 10516326, 9710600, 8967624, 8335982, 7780957, 7266137, 6783700, 6352379, 5940912, 5606704, 5368815, 5132253, 4869534, 4611741, 4412309, 4278736, 4069248, 3855330, 3711792, 3576730, 3383667, 3251846, 3111773, 3021542, 2909788, 2774753, 2637192, 2567704, 2496179, 2379836, 2300451, 2210712, 2169133, 2097537, 2003658, 1929857, 1899392, 1884212, 1837016, 1799413, 1746848, 1663622, 1561098, 1475736, 1464043, 1474115, 1472723, 1452343, 1379691, 1294302, 1247655, 1268538, 1261652, 1283256, 1254927, 1240478, 1215921, 1171787, 1158655, 1133732, 1121292, 1072193, 986668, 972590, 946893, 922546, 908555, 900786, 897346, 906768, 901185, 910206, 888488, 820974, 731797]
12354G31797M661L6888J1317m0375l0788l7336q201j154L6880p29l9613j0959
12342F52388k3508j4279j0363m6259k4495j4819m9440j4776j6249l0180n5117
12331C52903k2302k8094o3280m8671k5488l6135K2703J15004J50965J45986J83887
12320G47478K19548J70565J07892L5900K2280l0807j17036j50189j56283j45178
12310G04170m2385l1401o7170o1298j01030p3522m5499l1170n6386o8611o8903
12299E6795l4638k8071L2349N8642Q0983R0805P8842M5161J9116P72j0143o317
12287C84296M349J1631P763k1528o415M811o282K83R760L8571J9049k5950K2359
12274D42697J4454j4119J3374l28l8817k4741l2871m0393l1983k041L186l387
$$ y = [731797, 736458, 773346, 784663, 744288, 713500, 676164, 667963, 666809, 703689, 702960, 663347, 652388, 628880, 614601, 604238, 557979, 533484, 518665, 469225, 454449, 438200, 408020, 352903, 330601, 302507, 239227, 190556, 165068, 128933, 151636, 266640, 417605, 563591, 747478, 967026, 1137591, 1245483, 1281383, 1303663, 1272856, 1155820, 1005631, 849348, 704170, 661785, 630384, 563214, 501916, 400886, 327364, 281865, 250695, 194309, 125698, 56795, 22157, -5914, 26435, 85077, 166060, 256865, 335707, 380868, 399984, 400756, 390613, 384296, 388645, 400276, 408039, 386511, 380096, 384907, 378625, 378908, 388668, 427239, 446288, 420338, 442697, 457151, 443032, 456406, 456078, 417261, 392520, 359649, 319256, 287273, 285232, 288418, 285031]
12262B85031j6909J1993J2113N1828M8198L6984J5427Q227j4786l0035j9623O156
12250C94604K3736l996l7162k4815j0261K8929p459L960K2043Q603j0087k2288
12238C65807j155n857k0919m4397K2996K5796o604l54m9512j9197n598L1553N029
12225B97588j8043k2238L1691M0306q94r154l6403K015L5103K5841j8873k9481
12213B97458j4901L290J6278k0166k594L6892J5863R169l7049j0559M709m1877
12201B56513j8036j1134L6808J9737p140M0558J029r282q080l4024J950k971p906
12188B58022j0327M985J7111j4883L4204K1610k8652j8978K9748K4245l6767R395
12176B89713Q057l766q697k5257K2448K0691R009j8076j0368O351j6808m6827
$$ y = [285031, 268122, 280115, 292228, 344056, 392254, 429238, 444665, 452892, 438106, 408071, 388448, 394604, 418340, 414344, 377182, 352367, 342106, 371035, 363576, 367536, 389579, 398182, 388095, 365807, 364652, 358795, 337876, 293479, 316475, 342271, 335667, 335313, 285801, 266604, 261006, 292559, 297588, 279545, 257307, 288998, 329304, 328410, 319256, 282853, 284868, 319971, 345812, 326939, 297458, 282557, 285847, 302125, 281959, 279365, 316257, 332120, 341289, 304240, 293681, 298390, 256513, 238477, 227343, 264151, 283888, 276748, 317306, 318335, 309053, 300973, 266949, 268899, 265928, 258022, 247695, 252680, 269791, 254908, 289112, 310722, 282070, 263092, 292840, 317085, 280318, 289713, 297770, 294004, 285307, 260050, 282498, 303189, 312198, 294122, 283754, 290105, 273297, 226470]
12164B26470K2495K070j8596M5140P960J4358L2593l9075p265O633k9342k8268
12152B35173m295N539L1173K1999J4432j4801j7213m4768m2385J2056N3985K9718
12140B80613L5148K3579l645k1525k5501o468n2135k7604K1482L1547l9879r262
12128B06350J3656k502j7096J6777M078l629j992m4602J2678J9228J4215K041
12116B19202n497L9472j145q490p721j7014k3022L2223L8155l2885j3622k7793
12104A91863L1890J7406k3891j8916q490N4968Q7596R1582J01819O2335N791k6112
12092E67841p6629n9348m9152q5080n1816l775K4259O574l0035n594j0256k3699
12080B03290K2277m798n6254J1221M2771J4822J1068N7637P635n3951o5564l3490
$$ y = [226470, 248965, 251035, 232439, 277579, 285539, 299897, 332490, 293415, 286150, 292783, 263441, 235173, 230878, 236417, 267590, 289589, 304021, 289220, 272007, 227239, 184854, 196910, 250895, 280613, 315761, 339340, 335695, 314170, 288669, 282201, 230066, 202462, 223944, 255491, 215612, 206350, 220006, 217504, 200408, 217185, 221263, 217634, 215642, 171040, 183718, 202946, 217161, 219202, 213705, 253177, 252032, 243542, 235821, 218807, 195785, 228008, 266163, 233278, 219656, 191863, 223753, 241159, 217268, 198352, 189862, 244830, 332426, 424008, 525827, 588162, 593953, 567841, 491212, 431864, 382712, 297632, 245816, 242041, 266300, 272874, 242839, 237245, 226989, 203290, 225567, 220769, 164515, 175736, 218507, 233329, 244397, 302034, 309669, 255718, 190154, 156664]
12068A56664p215j8607J2332k0003J6191K1656J5253K3133j931M0238L0195j2413
12056B55493O958k202J3202P5927J50194J05935J1190m5651n3542r8175q9488
12045C29841l4752L48k8003j0656j5231k5106q331K9669J3228J4888P194L495
12033B76584o862J210l9135m5748l5534K686P0506M2737L725j4293K5841M57j7757
12020B64417l2300n393M789P956N3944L9552Q9249M6612O5434P8103Q8458J22519
12008H23340K04894K53216K78088K61260K17078J16287P374j39094k63384k93522
11998A465537k58062k26458k21136j21497n6948m1358n2417p1263o1809n8793
11988B95796k8188k1097O501O079j0561o996L1666k8562J0123L4154m7427l7036
$$ y = [156664, 149449, 130842, 143174, 123171, 139362, 161018, 176271, 199404, 197473, 237711, 267906, 255493, 262451, 260249, 273451, 349378, 499572, 605507, 616697, 571046, 517504, 419329, 329841, 295089, 295437, 267434, 256778, 241547, 216441, 208110, 237779, 251007, 265895, 273089, 276584, 269722, 270932, 231797, 186049, 150515, 153201, 223707, 266444, 270169, 255876, 281717, 282174, 264417, 232117, 226724, 231513, 239469, 293413, 332965, 422214, 468826, 534260, 612363, 700821, 823340, 1028234, 1281450, 1559538, 1820798, 2037876, 2154163, 2161537, 2022443, 1759059, 1465537, 1207475, 981017, 759881, 638384, 581436, 540078, 487661, 416398, 354589, 295796, 267608, 246511, 253012, 259091, 248530, 241534, 273200, 244638, 254761, 288915, 241488, 204452]
11976B04452J0137j3363o289O768l679J5360J9967K294k8753j7229Q377o595j2263
11963A79184k1578N472m7800P192L2485R767k6245j0721k532L5440J9601J486
11951A81751l5064k7762l6316J6057M5231j3805m0485r851l804L5268K6073K0468
11939A57761n390k699r104j5076q951r012N287J715j9849L1652n242j713o521
11926A12858L984j862q344j8253L1553M2097n523k0637p054k406r037K5332J261
11913A43969j1246M2834J866k3594q800j1156K926r103m4413K198M5282J8500
11901A49263L608J4025j1173l0078l8571m4870Q521P232J8647P370j5311L70j5205
11888E3828J2396J5425J0475L0229k0007N074K3580K1181j0345n698k0220P807
$$ y = [204452, 214589, 201226, 194937, 201705, 198026, 213386, 233353, 235647, 206894, 189665, 198042, 191447, 179184, 157606, 163078, 115278, 122470, 154955, 164722, 138477, 127756, 125224, 160664, 180265, 181751, 146687, 118925, 82609, 98666, 143897, 130092, 89607, 79756, 75952, 111220, 137293, 157761, 152371, 149672, 140568, 125492, 116541, 107529, 112816, 114531, 94682, 126334, 121092, 119379, 112858, 116842, 114980, 106636, 88383, 119936, 162033, 156510, 135873, 128819, 126413, 117376, 142708, 143969, 132723, 175557, 177423, 153829, 145029, 133873, 136799, 127696, 83283, 85481, 130763, 149263, 152871, 166896, 155723, 125645, 87074, 42204, 50725, 57957, 76604, 83974, 68663, 69033, 53828, 66224, 81649, 92124, 122353, 102346, 107420, 131000, 152181, 141836, 136138, 115918, 123725]
11876A23725k828k4306N674j4718j7393J0441J7897J4622J1839K0131L2656k2787
11864A54953m1340n40L2485j1827l3534o763k0353M6520J3735l5523k908M1113
11852A36018L1054J234k7501j3797n8M452K6426k356K2242K0373n7651l6601j5650
11839H8185j6429K1822K1517O4702q913k9926P981q251m4886k038K8830P031O398
11826A36023m5825K34N6923K7160o513k7769L792K514p484j5270k974K7237J4969
11813A63017l6801J2247L0683J267J5446K9528J2656r781k8380k2234j8919l1229
11801A17500J23N458k073m488L562L4501j0215j7638L366J2013r344k6756j3477
11788I2532o5l293K1842M1092K5438n419m2613k0649L119N2488J0798n329l7315
$$ y = [123725, 120897, 96591, 102265, 87547, 70154, 80595, 98492, 113114, 124953, 145084, 177740, 154953, 113613, 113073, 145558, 133731, 100197, 93434, 73081, 119601, 133336, 97813, 94905, 136018, 167072, 168306, 140805, 127008, 126950, 131402, 157828, 155472, 177714, 198087, 140436, 103835, 88185, 71756, 93578, 115095, 179797, 170884, 140958, 148939, 140688, 95802, 93764, 122594, 129625, 136023, 90198, 90432, 147355, 174515, 168002, 140233, 144025, 146539, 139055, 123785, 120811, 148048, 163017, 126216, 138463, 169146, 170413, 185859, 215387, 228043, 218262, 189882, 167648, 148729, 117500, 117623, 123081, 121008, 116520, 120082, 154583, 144368, 126730, 130096, 142109, 132765, 106009, 92532, 92467, 89174, 111016, 152108, 177546, 172127, 129514, 108865, 111984, 164472, 175270, 169941, 132626]
11775A32626l8350P564J8495J54l901J8754l6001j2838j5000Q76J2393j4340L6097
11762A06529J1167L7573j7309j9503m4533j8676n1940j1449M8467K8474N1039
11751A19839L6592k5033o8805q904J1430Q493p512k6561M3804j4900N377L8330
11739A12150j1773n265J8701N144k1896j3621K7127O2949K3483j4691k1145K7653
11727A88816J287j9098l3338m5021n4000M0262J6950J5517L582k6199J7799l3487
11715G3070k5651j3025L7298N71J0986J5671J4029j7251k3130k5735j6214K1884
11703E2503L1410K0331j3330l5101k5069L1427J5076P041l1274j4124K721l6168
11691E443K8574L9470J029J638L1013P986j3836J066j1066k9611j8380K2854R540
$$ y = [132626, 94276, 101840, 120335, 120489, 116588, 135342, 99341, 86503, 71503, 72379, 84772, 70432, 106529, 117696, 155269, 137960, 118457, 73924, 55248, 3308, -8141, 40326, 68800, 119839, 156431, 131398, 62593, 53689, 65119, 73612, 66100, 39539, 83343, 68443, 73820, 112150, 100377, 95112, 113813, 118957, 97061, 83440, 110567, 173516, 196999, 182308, 161163, 188816, 190103, 171005, 137667, 92646, 38646, 78908, 95858, 111375, 114957, 88758, 106557, 73070, 47419, 34394, 71692, 72263, 83249, 98920, 112949, 95698, 72568, 46833, 30619, 52503, 83913, 104244, 90914, 55813, 30744, 62171, 77247, 84288, 53014, 38890, 41611, 5443, 34017, 73487, 74516, 76154, 107167, 115153, 101317, 102383, 91317, 61706, 43326, 66180, 75720]
11678G5720J7840O523k4954K7628j1257m375K8378r874K990L3679m1731l0082
11666G0485k2363J5231J5455l1860K6116J6408J3857J1754n277k6718l976K3480
11654A02592K3740K4538L0086k6135m6257j4754O599Q672o560k914M2941O3818
11642B06366J1324j3328k0235l7528j1202O90j6736k7641k3749K2417K2738l156
11630A09960l1631l2743J4376p574k5076m5487J8293K9758j5328m166M775M1031
11618E6188L5793j7815l7357k0386N0443L9549j5310m1569K8496L6367j3270L884
11606A05013p405J804j6982L224L7068j049l0783j7337L057p50n199k0317K033
11593E2377J48m948j3826K0008j733j2380j1696j2733J7205j9928J2100K109l069
$$ y = [75720, 93560, 100083, 75129, 102757, 91500, 87125, 115503, 105629, 108619, 142298, 100567, 70485, 48122, 63353, 78808, 46948, 73064, 89472, 103329, 115083, 109806, 83088, 79112, 102592, 126332, 150870, 180956, 154821, 108564, 93810, 100409, 109081, 102521, 99607, 142548, 206366, 217690, 204362, 184127, 146599, 135397, 136087, 119351, 91710, 67961, 90378, 113116, 109960, 78329, 45586, 59962, 52388, 27312, -18175, 118, 29876, 14548, 10382, 15157, 56188, 91981, 74166, 36809, 16423, 66866, 106415, 91105, 49536, 78032, 114399, 101129, 105013, 97608, 99412, 82430, 85654, 122722, 121673, 90890, 73553, 76610, 75860, 70661, 50344, 52377, 52525, 47577, 33751, 53759, 52026, 39646, 27950, 15217, 32422, 12494, 24594, 26703, 23634]
11580B3634L4757Q80J7143J3728j3962N315J9362N3869m4018k9082J9600n134
11568I6092L8956j5342j7569j2600J0004J6350O838K9453o881k2487r913K8570
11556A41471J508p646n4500k6631L0798Q877J0763j237O523k6468l2208k1721
11544B9529K9812L6592M9523J9108j0358k9015l5249n8998l0864J2696j4768k6056
11532b8048O2385N0287J9976p176n4403J9495J3828M0509k4643l8654J7932J3685
11520H5173J7312L8135L6543k4222l1432j7887J0475L126j7923k2514l5609K2971
11508F4148K0910k3349l545Q188K266l0031n0439J6891M0004O869m561K6305K2549
11495I6205J9588M3940j5074j2932l1420j9575L0554j1794K8370K1714n4205l6636
$$ y = [23634, 58391, 59271, 76414, 90142, 76180, 81495, 100857, 154726, 110708, 81626, 101226, 96092, 135048, 119706, 102137, 89537, 99541, 115891, 122729, 152182, 145301, 122814, 112901, 141471, 142979, 135333, 80833, 54202, 85000, 93877, 104640, 103403, 109926, 83458, 51250, 29529, 59341, 95933, 145456, 164564, 154206, 125191, 89942, 30944, 80, 12776, -1992, -28048, 34337, 84624, 104600, 97424, 43021, 62516, 76344, 116853, 92210, 53556, 71488, 85173, 102485, 140620, 177163, 152941, 121509, 103622, 114097, 117223, 99300, 76786, 41177, 64148, 85058, 61709, 58164, 66352, 68618, 38587, -11852, 5039, 45043, 51912, 47351, 73656, 96205, 115793, 159733, 144659, 131727, 100307, 80732, 111286, 99492, 127862, 149576, 95371, 58735]
11483E8735R675L4854J8587j6238k7646l0490Q0552J6089o0523k3818L839J0895
11471G4511K4535j2897k8614J2255m5555k7556K1627J8823j9923J9301m519j2259
11459A9729O645L8633J4449k80K4314J6460k9570l5906K4294M8417k4393o2436
11447D0356r58L8165l189r435P364M380j2700k405J4805K705l2420k4233k7392
11434d957K5042M783K1169j8879J5972M097J7322J7213k4477j2543J6927M4189
11422A05858m476l119J977n889m0032k0977J9561K5547q773L0548m2826J3910
11410G1309L7539J231L8939r419r2930m6203K3384J4445J3714M3680L2173l4802
11398I3060j9813l1975q592k1579P809J6296J0245K5236j2523q124j3119K786
$$ y = [58735, 68410, 103264, 121851, 105613, 77967, 47477, 128029, 144118, 83595, 59777, 63616, 74511, 99046, 86149, 57535, 69790, 24235, -3321, 18306, 37129, 17206, 36507, 31988, 19729, 26374, 65007, 79456, 79176, 103490, 119950, 90380, 54474, 78768, 127185, 102792, 40356, 39398, 77563, 74374, 64939, 72303, 76683, 63983, 61578, 76383, 79088, 46668, 22435, -4957, 20085, 24868, 46037, 27158, 43130, 47227, 64549, 81762, 57285, 44742, 61669, 105858, 101382, 98263, 100240, 94351, 54319, 33342, 52903, 78450, 69677, 100225, 57399, 71309, 108848, 110079, 149018, 139599, 46669, 466, 23850, 38295, 52009, 95689, 127862, 93060, 73247, 41272, 32680, 11101, 18910, 35206, 45451, 70687, 58164, 50040, 36921, 39707]
11386C9707L1309n419k2706J7414L9487n496j9272l3594l3537M100L6208Q317
11374E6518K217m0010J7405j1258j8696M1227K4755K3691m52K1498r173m9208
11362E8514k2776K4298J3083K8663J8350J2783J6498j2598J8518K7327l4016k2349
11350A26295j4783l4563l6972l2057q57K520J4509M053l7437J4954J3275K3633
11338D2570L5809R822j0634J4280K6148j842j3603J2464p962m1584o633j3660
11326D5175P362j450l3037k8626rJ1480K9069J0479J7125J728J1871M786J5624
11313I1577K0035j7559l1550j5581J6183P430j7539o152J4496N889Q887Q929K7934
11300A12979q742O560l110k5340j7090K830J9841M7168Q3508N5422N9450M9348
$$ y = [39707, 71016, 65597, 42891, 60305, 99792, 94296, 75024, 41430, 7893, 11993, 48201, 56518, 58735, 18725, 36130, 24872, 6176, 47403, 72158, 95849, 95397, 116895, 107722, 58514, 35738, 60036, 73119, 101782, 120132, 132915, 149413, 136815, 155333, 182660, 148644, 126295, 111512, 76949, 39977, 7920, 7063, 9583, 24092, 28145, -9292, 5662, 18937, 42570, 78379, 88201, 77567, 91847, 117995, 116153, 102550, 115014, 107052, 65468, 58835, 45175, 52537, 51087, 18050, -10576, -10585, 895, 29964, 40443, 57568, 59296, 71167, 75953, 91577, 111612, 94053, 62503, 46922, 63105, 70535, 52996, 46844, 61340, 67229, 76116, 85045, 112979, 104237, 110797, 107687, 82347, 65257, 68087, 87928, 135096, 218604, 274026, 333476, 382824]
11288C82824J13678J71981K12596J34107K6951j28049j87368j82515j62157q3781
11278B98267o0008p1586k9021l706m632J4725j5927J1019M3853M84p0429k8157
11266H4882k3272n105L3068J4205O526k9965R881j636k4432j8914q569j942k7576
11253G151K472N5307M0780n8936j9316M8866k9678l1035N8593O7444r884m8423
11241H3341P439j0884k3686L7810L882n2032p200K416l1511j9006J2966L1601
11229C5136K4497q487l5822J2957L0690l08J7077N683k7513m018J6410j6960m3893
11216E449r329J5222J5856N2996J4937l3226o1090k2066K4992K6593N3868L3472
11204A17674k2088J7927L2190j7236j7234K042j043k0083n065L6243l1730m9805
$$ y = [382824, 496502, 668483, 881079, 1015186, 1042137, 914088, 726720, 544205, 382048, 298267, 238259, 166673, 137652, 133946, 129314, 144039, 128112, 139131, 182984, 183468, 113039, 84882, 61610, 56505, 89573, 103778, 110304, 80339, 90220, 88584, 64152, 45238, 36669, 34727, 7151, 9623, 64930, 105710, 46774, 27458, 76324, 46646, 15611, 74204, 141648, 131764, 83341, 90780, 79896, 56210, 94020, 97902, 45870, 38670, 41086, 9575, -9431, 3535, 35136, 59633, 51146, 15324, 28281, 58971, 58663, 75740, 81423, 53910, 49892, 66302, 49342, 5449, -3880, 11342, 27198, 80194, 95131, 61905, 815, -21251, 3741, 30334, 84202, 117674, 95586, 113513, 145703, 128467, 111233, 113275, 112232, 92149, 87084, 123327, 91597, 41792]
11192D1792l5585k6074L5244L4478J304o27j7500R888k3888k2732J8432j4613
11180A19j9614j6441N5179M1462J7427N230j914r571m988J2687j4062j8131J3047
11167F0430Q626k860K4769k7929j6542j9319N5146k760j1395r259m3643k5686
11155a0422K6492j144M955O246K9150R665L673m5682K0664N7361R709m3048l272
11142F4347K6514P51K264m2048O504l8286J2631N834l5971n5183J0979M4162N8017
11129F0515J0054M046L605m3914j8226M4106J1552P256l3845K4825j597J58k4288
11116D4247j0471L1650N8933R549r678J9461k1239j6597j0973j3013j3332j4075
11104E4462k9526k7226J4360M0414J2072l4447o147n555l498p212k6732K8040
$$ y = [41792, 6207, -19867, 15377, 49855, 51159, 50532, 33032, 42920, 19032, -3700, 14732, 119, -19495, -35936, 19243, 60705, 78132, 83362, 81448, 71877, 66889, 79576, 65514, 47383, 60430, 69056, 66196, 90965, 63036, 46494, 27175, 82321, 79561, 68166, 58907, 15264, -10422, 16070, 14926, 19881, 26127, 55277, 64942, 68615, 22933, 43597, 100958, 110667, 67619, 64347, 90861, 91612, 93876, 51828, 58332, 20046, 32677, 38511, 2540, -52643, -41664, 2498, 60515, 70569, 74615, 78220, 34306, 16080, 60186, 71738, 78994, 45149, 69974, 68377, 68535, 44247, 33776, 65426, 124359, 133908, 124230, 143691, 122452, 105855, 94882, 81869, 68537, 54462, 24936, -2290, 12070, 52484, 64556, 30109, 23962, 18407, 14909, 7697, -19035, 9005]
11092I005j942K9790J6057j6012l797j2156J2237J3192j0232K632O478M6917M5859
11079A38028p982j9472k0000j3172J0382j9789m5363j7975l1667q672K007J4849
11067a8826M4591P350j4536q562J8027J1650J6206q843K492M015M9867L536k0426
11054H6541m2780n0846J7825J8035J1480N0132o239k8387o333K8638N1274L6863
11042A66203L8170L9096R440J6282Q7325J09698J35355J09866L8670Q6931Q4482
11031I21518L3020l9957j17730j29695j41179r2408l2181n2050o1612Q414O4125
11020C60265L0105J3587j9735m5123l6073o535j502l7383l9136j1332M184O0901
11008B72223J8185J0328m0696l7219l0132j711j2194L506m376K560k4412l3005
$$ y = [9005, 7063, 36853, 52910, 36898, 33101, 20945, 33182, 46374, 36142, 38774, 45252, 92169, 138028, 130046, 110574, 90574, 77402, 87784, 67995, 22632, 4657, -27010, -35682, -33675, -18826, 25765, 33115, 18579, 10017, 28044, 39694, 55900, 47057, 49549, 53564, 103431, 106967, 86541, 43761, -7085, 10740, 28775, 40255, 90387, 84148, 55761, 49428, 78066, 129340, 166203, 204373, 243469, 252909, 269191, 356516, 466214, 601569, 711435, 750105, 837036, 921518, 954538, 914581, 796851, 667156, 525977, 433569, 401388, 349338, 287726, 296140, 360265, 390370, 403957, 384222, 339099, 303026, 296491, 294989, 257606, 218470, 207138, 211322, 272223, 290408, 300736, 260040, 222821, 192689, 190978, 178784, 182290, 177914, 180474, 156062, 123057]
10996A23057k5065P59J5881R27j1816l2749k4696j5723L1060K5582j8884p258
10984F1075K1370m6688Q448N8784K2005n0118r871k1229m230j0302k2756M1609
10972D8097N674O619L2984l1650j2405R154m0244l671J576l696j745J5767K1633
10959D8093J3625K6872M4051l084J1129m1825o3421L4032K7658l1043K4920n202
10947H5805m7218j8040J2555J4763k0156n2045m9700o361M1596L4866M8258J7506
10935F1829J608L4831J5057l6902k3952l9830l5269K76M4438K5950l5785K670
10923A4921K898k535J3049q962N305J9560k1045O833K5566l2617k1875K4213L4228
10910E9539q949m100J570j3409P26N8043J1646J5568l0349m5494J4778J6915l550
$$ y = [123057, 97992, 98751, 114632, 115559, 103743, 70994, 46298, 30575, 61635, 87217, 68333, 61075, 82445, 35757, 44205, 102989, 124994, 74876, 65005, 43776, 39546, 29244, 6488, 48097, 53771, 60390, 93374, 61724, 49319, 58473, 18229, 14558, 16134, 12438, 10693, 26460, 48093, 61718, 88590, 132641, 129557, 140686, 98861, 35440, 69472, 97130, 66087, 91007, 85805, 38587, 20547, 33102, 47865, 27709, -24336, -74036, -80397, -38801, -3935, 44323, 61829, 63437, 98268, 113325, 76423, 52471, 12641, -22628, -22352, 22086, 48036, 12251, 14921, 17819, 15284, 28333, 19371, 24676, 44236, 23191, 30024, 55590, 22973, 1098, 25311, 59539, 50590, 46490, 48060, 34651, 35377, 93420, 105066, 120634, 90285, 44791, 59569, 76484, 72934]
10897G2934j3497k4958J1555j9583j1651J359q230L6459k706N537k566k2523k5735
10884c605K3322l021J0091q946J5409Q828L4868N5582m1283q1078l5533N761J4232
10871e373m639k767o180j1305M1139J0230m0520K0945L1852P816k3538J8400M4334
10858H0394K4580j4321l4496j8172J1955J6428Q02j7038K8118J8028j7605j7377
10846F1296o495k9209l8072O57J7718j4537J482K1231M2104J669k1240n075j0014
10833B1515l2834K0866K9921l841J2078j3786j7262l9924o451k2854K7475J3696
10821a1401K7346m038q26J8049k8408l864M1100K3244n334K362l1889j5533j9212
10808h404j5491n9914m845L384L9758J2169J5097q274J0735l285O729J956N50
$$ y = [72934, 59437, 34479, 46034, 26451, 14800, 16159, 7929, 44388, 41682, 47219, 44653, 22130, -3605, 19717, 16696, 26787, 17841, 33250, 42078, 76946, 132528, 91245, 10167, -25366, -19605, -5373, -10012, -12779, -18959, -30264, 10875, 21105, -19415, 1530, 33382, 41198, 17660, 36060, 80394, 104974, 90653, 56157, 37985, 49940, 66368, 67170, 50132, 78250, 96278, 78673, 61296, 54801, 25592, -12480, -11823, 5895, -8642, -7160, 14071, 56175, 57844, 36604, 31529, 21515, -11319, 9547, 39468, 35627, 47705, 33919, 16657, -23267, -29718, -52572, -25097, -11401, 15945, 11907, 11081, 29130, 722, -3142, 37958, 61202, 55868, 58230, 26341, 10808, -8404, -23895, -83809, -88654, -85270, -45512, -33343, -18246, -26520, -15785, -19070, -12341, -10385, -9835]
10795i835j5509j021J0451L9558k0125j6007M2066q916l6102k1337k0690j3085
10783g0552p95J4374K6547J4391o047K421K4662k9685M8250K7524k5204k2603
10771C283j3321l3772n570L910n514M1982J9835k8897L494l216k3944k6572K3494
10758d4808N5698J7534k007k3979L6715L4149l5514j1969Q852L298j1869P450
10746C3550k8686l6511k6454K880L6167N4349L0983K1037k2056k2909m8369O293
10734B74O789l0472P366M1517K0580M04N784m8277J1136J2232o540P042J0643
10721C8478O536N6472L1923j7044n0825J6229R136J846l4570p607L023J9141K8099
10708A00837L7497j9120n6858p352J1373M0372J2049Q013m3251o1067j418O49
$$ y = [-9835, -25344, -26365, -15914, 23644, 3519, -12488, 29578, 20662, -15440, -36777, -57467, -70552, -71347, -56973, -30426, -16035, -22082, -19661, 5001, -24684, 23566, 51090, 25886, 3283, -10038, -43810, -49380, -45470, -50984, -9002, 10833, -18064, -14570, -17786, -41730, -68302, -44808, 10890, 28424, 26417, 2438, 39153, 73302, 37788, 25819, 34671, 37969, 26100, 33550, 4864, -31647, -58101, -55221, -19054, 35295, 66278, 87315, 65259, 42350, -6019, 274, 7063, -23409, -16043, 25474, 46054, 46458, 52242, 3965, 15101, 27333, 20793, 27835, 38478, 45014, 101486, 133409, 116365, 65540, 81769, 90905, 92751, 58181, 50574, 53597, 72738, 100837, 138334, 119214, 62356, 55004, 66377, 106749, 118798, 126811, 83560, 22493, 21075, 21724]
10696B1724m768K059m4531n738M1016O1009J9750j8397l1104J5769J5834n176
10684F7447l911j9010o841M2494K7837k188R711j8097m0045l485r802L1447j3852
10671F1705J1558J4188K5641j9711j8838L6226q799L367K6177L441j152k1840
10659A11963J0993O0643J1642j7908j8987j185k3374N383L0769K9029J3423J5629
10647B28020L1622L5924N4536N6396j0708j5969N3110J2898J1494M364J2915M1583
10635E16185N277L0921R7055J17187Q9204J18796Q3251P7215J75597J71068J88274
10624A670030K73029K87994L82243N43718O84925R44414J238371J629377K083227
10615I737328K475813K605667K126210J312141M21389k77395m79744j90762M67877
$$ y = [21724, 16956, 19015, -25516, -31254, 9762, 70771, 90521, 72124, 41020, 56789, 72623, 67447, 63536, 44526, 37685, 80179, 108016, 105828, 115539, 97442, 57397, 53912, 44110, 75557, 61705, 73263, 87451, 113092, 93381, 74543, 110769, 101970, 105337, 131514, 134955, 133803, 111963, 122956, 183599, 195241, 177333, 158346, 157161, 133787, 139170, 169939, 198968, 212391, 228020, 259642, 295566, 350102, 406498, 395790, 379821, 432931, 445829, 457323, 461687, 474602, 516185, 521462, 552383, 649438, 766625, 855829, 974625, 1057876, 1135091, 1310688, 1481756, 1670030, 1943059, 2231053, 2613296, 3157014, 3841939, 4786353, 6024724, 7654101, 9737328, 12213141, 14818808, 16945018, 18257159, 18678548, 18401153, 17921409, 17730647, 18198524]
10606A8198524J327338K433580L681719M659320M819035L681399J517424p35529
10598C9582810k316002k611612j920059n80234R88800K755314M576894N831691
10590D6307602N660786L543366J46325l153148n234896n556734m593995l012716
10582C4106590j286339M08233J853262K764805K491080R12732j377189l418539
10574C6454635m571511m513126l689265k605507j537818n98022J19677M41071
10566A9500134K80707l43029j282769k050291k469490k422545k108828j693565
10558G410324j288141r93413p65178o01560m40036l44674k88457k65117j82725
10549B241023j73929j80634j33845j11677j12338r4131p9159j16374o8146n4450
$$ y = [18198524, 19525862, 21959442, 25641161, 30300481, 35119516, 38800915, 40318339, 39582810, 37266808, 34655196, 32735137, 32154903, 33143703, 35899017, 40475911, 46307602, 51968388, 55511754, 55658079, 52504931, 47270035, 41713301, 37119306, 34106590, 32820251, 33228484, 35081746, 37846551, 40337631, 41250363, 39873174, 36454635, 31883124, 27369998, 23680733, 21075226, 19537408, 18939386, 19059063, 19500134, 19780841, 19437812, 18155043, 16104752, 13635262, 11212717, 9103889, 7410324, 6122183, 5128770, 4363592, 3762032, 3321996, 2977322, 2688865, 2423748, 2241023, 2067094, 1886460, 1752615, 1640938, 1528600, 1434469, 1355310, 1238936, 1170790, 1116340]
10539A116340n017n5620n9812n8954n7527m8562j9465j1432J1573m8882o2362
10528G00280o887k6578l7995l4138k210l290K2455j7850l3100j1906l0437l2795
10516D85549Q114m673l6223j7019l6278l7667J8055j3344m540M4431j477k8428
10504C76500k624K168q919j3690m5260j0708k1078J4891k499L2807K943K0867
10492C45398K5953l9720o4823l9734n0875p502P0965L3980k5595j6856k6908m3211
10480A61072J2962J2636L2154J0166p560K1450K827L5K7870l1789m0795J7880
10468B18908L5800M2580K2609n4270k2758j8078r813K5598K2699j6469l5948r952
10456B00906k6296l0422j086l1389K5482N7289N481p824K0021M929m1043j5233
$$ y = [1116340, 1111323, 1055703, 995891, 936937, 879410, 830848, 811383, 799951, 811524, 762642, 700280, 693393, 666815, 628820, 594682, 592472, 589182, 611637, 593787, 560687, 548781, 518344, 485549, 493663, 488990, 452767, 435748, 399470, 361803, 379858, 366514, 361974, 406405, 404928, 376500, 373876, 376044, 367125, 353435, 308175, 297467, 276389, 291280, 288781, 321588, 324531, 345398, 371351, 331631, 266808, 227074, 176199, 168697, 239662, 273642, 248047, 231191, 204283, 161072, 174034, 186670, 218824, 228990, 221430, 242880, 245707, 245742, 273612, 241823, 201028, 218908, 254708, 297288, 319897, 265627, 242869, 224791, 214978, 240576, 263275, 246806, 210858, 200906, 174610, 144188, 143102, 111713, 137195, 194484, 199965, 192141, 212162, 217091, 176048, 160815]
10444A60815R7L9014K6494n032J6299l6911k6936K3813K3729k7908l7452J0238
10432A66260K4048m7269j4388M1970J9284j1295k5681l1845k7934J5294J528l0308
10420G9664n212q347K7815K2418l1347P264J4111K4671K10L791L179m4711J7940
10407A11446M3800M3522k9898o1874J6519R805O108K5904J4679j9178j0083j2401
10395A38349l881K3271O549K859J2993n2507J032M7361J7026p4266l8650K5740
10383A05876L7576j0826n066J6849j3771Q186L1747Q283j4456j9623p146j1158
10371A26471p430k0313l7815K842j2048n593L2098J1360M835N0070K1369q892
10359A56954K904j6653k1391l5058P661Q713p859L1727j390J6125J7732l8267
$$ y = [160815, 160912, 199926, 226420, 221388, 237687, 200776, 173840, 197653, 221382, 193474, 156022, 166260, 190308, 143039, 128651, 170621, 189905, 178610, 152929, 121084, 93150, 108444, 109972, 79664, 74452, 66105, 93920, 116338, 84991, 92255, 106366, 131037, 131247, 135038, 138217, 93506, 111446, 155246, 198768, 168870, 106996, 123515, 133320, 139428, 165332, 180011, 160833, 150750, 138349, 134468, 157739, 164288, 167147, 180140, 127633, 128665, 176026, 193052, 118786, 80136, 105876, 143452, 132626, 127560, 144409, 130638, 138824, 170571, 178854, 164398, 144775, 137629, 126471, 119041, 98728, 60913, 63755, 51707, 46114, 78212, 89572, 94407, 144477, 165846, 156954, 159858, 143205, 121814, 86756, 94417, 103130, 95271, 126998, 125608, 141733, 159465, 121198]
10347A21198j7971r285L0569Q986n7479J109j8420q885J3078K6124j3467j1621
10335F3936O673K7303q352j130p63K6594K6479J5093l7777O030p688J929K0329
10322A38656l1077R96q988Q250l4167k2230o833J9139M1652K2116P423j9869M160
10309A19228j7306j7445K0045J9238k9177l0006P413J0366J220K0619l6610q022
10297E9563j0250k3928J1260N6696n820n3496k0865M0797N5305k4386Q747M7679
10285A41302k965k1179r124L081j4777n885j8936j867q052k6095L3084L7399m248
10272A01738j5796Q539L0050k7675k6010o377J9324L2570J7953j9698k8J6267
10260A30857n940k6019M363M543n803K0138L3827K4029l42k8343j2067l063j0874
$$ y = [121198, 103227, 93942, 124511, 133497, 76018, 77127, 58707, 49822, 62900, 89024, 75557, 63936, 70609, 97912, 89560, 88430, 87667, 114261, 140740, 155833, 118056, 124086, 116398, 118327, 138656, 107579, 108575, 99587, 107837, 73670, 51440, 44607, 63746, 105398, 127514, 134937, 115068, 119228, 101922, 84477, 104522, 123760, 94583, 64577, 71990, 82356, 83576, 104195, 67585, 59563, 49313, 25385, 36645, 93341, 87521, 34025, 13160, 53957, 109262, 84876, 93623, 141302, 138337, 117158, 108034, 111115, 96338, 90453, 71517, 69650, 61598, 35503, 68587, 105986, 101738, 85942, 94481, 124531, 96856, 70846, 64469, 83793, 116363, 134316, 114618, 114590, 130857, 124917, 98898, 103261, 107804, 102001, 122139, 155966, 179995, 179653, 151310, 139243, 136180, 125306]
10247A25306J0723L2973l587m3469m1367j1485J554j3626j101n817J7415K5442
10235I2961l200k9168j0698p969R133J3788K3775O641j6597k5456l0063j6188
10223F959K4137L5826n4467J931L0051O346r951k2781M1365J7332l9035o3769
10211b6056J1441K0538L1961M6458J8929N563l6368l439l3862J7541m579k9443
10199A8684M550K2878p292K0847L0691J2210J4115m3809k6840j6076k2426M5456
10187E2988p561n6970L5028R766N28N1637p578M713L5239K6099j6540j3161K0164
10174A34352J7595j5667l344j7706K6640J3412J7266N0094J2041J5598K6263K3467
10162C00011m236L3223j1246l8874k9647M179K5484K2170J9678K404J0716K8325
$$ y = [125306, 136029, 169002, 165415, 121946, 80579, 69094, 70648, 57022, 55921, 50104, 67519, 92961, 89761, 60593, 49895, 41926, 51059, 64847, 88622, 95263, 78666, 53210, 23147, 6959, 31096, 66922, 12455, 14386, 44437, 50783, 40832, 18051, 59416, 76748, 37713, -26056, -14615, 5923, 37884, 84342, 103271, 108834, 72466, 69027, 35165, 52706, 48127, 18684, 23234, 46112, 38820, 59667, 90358, 102568, 116683, 72874, 46034, 29958, 7532, 52988, 45427, -11543, 23485, 33251, 33779, 85416, 77838, 82551, 117790, 143889, 127349, 114188, 134352, 151947, 136280, 132936, 115230, 141870, 155282, 172548, 222642, 234683, 250281, 276544, 300011, 295775, 328998, 317752, 278878, 249231, 253410, 278894, 301064, 320742, 323146, 333862, 362187]
10150C62187k3579o1944k1785M463J1566j5584j3797N1675K3006j3753l3780O445
10138B75120j4334j6435j9428J1716j246o123l9464j10M247n5088n1526k4585
10126F2744Q693J5887M2381j2537n6448k6119J4328K1211r609O032k785k3204
10114D0574m3760o058K5658j2045K3865L3888J5632Q241l3717n189j7435r442
10102B0212K8888L412r514J1915Q404m860l026J1244k2381j7821j3548n477j2158
10089d710L3907Q050P093P850k1150j3815j8645o10K2262N20j1795M6666p14n0888
10075D021J2936j2150j523K6709j7923j2338M8864J249n1570k2086K2465K0653
10063A9307K0785M496j8246j494N306J6145l7378K700N61K8428K2143j1058L366
$$ y = [362187, 338608, 276664, 254879, 259342, 270908, 255324, 241527, 293202, 316208, 302455, 268675, 275120, 260786, 244351, 224923, 236639, 235393, 229270, 189806, 189696, 193943, 138855, 87329, 62744, 71437, 87324, 129705, 117168, 60720, 34601, 48929, 70140, 60531, 66563, 63778, 40574, -3186, -9244, 16414, 4369, 28234, 62122, 77754, 85995, 52278, 47089, 29654, 20212, 49100, 52512, 42998, 54913, 63317, 58457, 55431, 66675, 44294, 26473, 12925, 7448, -4710, 29197, 37247, 44340, 52190, 31040, 17225, -1420, -2030, 20232, 20752, 8957, 55623, 54909, 4021, 16957, 4807, 3284, 29993, 12070, -268, 48596, 49845, -1725, -23811, -1346, 19307, 40092, 44588, 26342, 24848, 30154, 46299, 8921, 11621, 12182, 40610, 62753, 51695, 55061]
10050E5061J4436Q774k6224m1337J1875r754l81J3071K1835R111m262q134j2852
10037C1219o434J8846j1583L3690L4882k553n8147k4822k9245N2684N3290k420
10025H9407j1530R294K0971L0226j6413k0960j1918l8937j9309j2981J2235J9440
10013D9525O015j172j9046J0452K9218J8721K588m4089m2409j1155j5765O607
10001a0510O6546M2577j2492j8785R141l8645m0623k7439r478K441r694K9700
9989a7261K6474K5647l836j2606M5104J1090n7134j1805J3950l813L144L2149
9977E1103m66m4972l2798J3027L8934L3241p178k6538o719P051K5339K505j9758
9964C2771K1693K3577m2330j2897m7732q404O0594J3749l95J4633k9971o527L0168
$$ y = [55061, 69497, 78271, 52047, 10710, 22585, 12831, 12450, 25521, 47356, 56467, 52205, 44071, 31219, 24785, 43631, 32048, 65738, 100620, 98067, 39920, 15098, -14147, 38537, 91827, 89407, 77877, 87171, 108142, 138368, 121955, 100995, 89077, 50140, 30831, 17850, 30085, 49525, 55540, 54368, 35322, 45774, 74992, 93713, 96301, 52212, 9803, -1352, -17117, -10510, 56036, 98613, 86121, 67336, 76477, 37832, -2791, -30230, -39708, -37267, -46961, -17261, 9213, 34860, 31024, 18418, 63522, 74612, 17478, 5673, 19623, 15810, 18954, 51103, 50637, 5665, -27133, -14106, 24828, 58069, 50891, 24353, 17634, 24685, 50024, 52529, 32771, 54464, 78041, 35711, 22814, -24918, -33322, 27272, 41021, 40626, 55259, 25288, 18761, 48929]
9951D8929J0144l3640r48R917l8911j8529q307j4734K9387N2953l032j9715j0271
9938C243L3992P489o580k045J7531j8925l3420j3179J6619k054M2955M7269j3778
9925G9117k2947k2475R678K4545J4086l0154J4849J4571l8052m6832J7843K2727
9913C6956k4765j823K2796Q636K0063o812m2646J6977K2979J8298m5053J1492
9901C7098k9860n9443K3101J8254M6759K9093j560j3081q3256o384M6196n584
9889A333J0534J1879j0609j1424L0908M159J9702K9416k9419J7027K8889l7181
9877F5214m7357R672K4395K9641J7374k0439l186J3684k7868k2477l5550p081
9865c978R367j3646k468J3737j092L736j7756q999J6683L6689M2582j5901J8399
$$ y = [48929, 59073, 25433, 24485, 34402, -4509, -23038, -31345, -46079, -16692, 36261, 33229, 13514, 3243, 37235, 44724, 38144, 36099, 53630, 34705, 1285, -11894, 4725, 2671, 45626, 92895, 79117, 56170, 33695, 43373, 67918, 82004, 51850, 66699, 81270, 43218, -3614, 14229, 36956, 12191, 10368, 33164, 41800, 61863, 55051, 12405, 29382, 52361, 70659, 25606, 37098, 7238, -52205, -29104, -10850, 35909, 65002, 63442, 50361, -32895, -39279, 6917, 1333, 11867, 23746, 13137, 1713, 32621, 36780, 56482, 85898, 56479, 73506, 102395, 65214, 17857, 27529, 51924, 81565, 98939, 78500, 75314, 88998, 61130, 38653, 3103, -3978, 5389, -8257, -10725, 3012, 1920, 5656, -12100, -21099, -4416, 32273, 74855, 58954, 77353]
9852G7353k4010k7103j9525j9144q940Q871J8824n321K0370j5771k966o428J2253
9839H463k7527m6944L0504K3139l845M8932L4157j5985L229k5346m2019j0101
9827b3343L17j5418J6425O1560p364j8914P185K6233K5649q4394l6218J3121N2381
9814A7220L4101J0197R251M279M474k5919m3805l1704O212O1465j2087k7062J1820
9801A8442j1062J3114K1586k7872L4669J6758P890j9003k8920j2716L636Q721
9789B5243M917j7537k0715L7130J4687L5365j5319o7615l6857Q262L6778n635
9777a296K98J8542r644j190m554m914K8741Q522l6253j7018o629L8753K1676L5842
9763G0876n6423p4394J4739M3463R875l52K5032j782k51n1127l4883M1447L079
$$ y = [77353, 53343, 26240, 6715, -12429, -21369, -12498, 6326, 1005, 21375, 5604, 2638, -3790, 8463, -19064, -66008, -35504, -12365, -16210, 32722, 66879, 50894, 54123, 28777, -13242, -23343, -23026, -38444, -22019, 39541, 32177, 13263, 20448, 46681, 72330, -12064, -48282, -35161, 17220, 51321, 61518, 70769, 75048, 79522, 53603, 9798, -21906, -15694, 45771, 33684, 6622, 18442, 7380, 20494, 42080, 14208, 48877, 65635, 73525, 54522, 25602, 12886, 16522, 25243, 30160, 12623, -8092, 29038, 43725, 79090, 63771, -3844, -40701, -32439, 4339, -1296, -998, 17544, 7900, 6710, 2156, -2758, 25983, 34505, -1748, -18766, -25395, 13358, 35034, 70876, 14453, -59941, -45202, -1739, 8136, 7784, 32816, 31034, 30783, -20344, -55227, -13780, -10701]
9750a0701O432P969J6634k2602m93N8658j881j7236l2037q191J1169M9929Q631
9737F6281P321K5122Q037J1485J9237K2224L4333R3145J21178J08199P0534M4854
9725F31950R6278L6008l7464p2755r5293p6993n8127p1585j05158o9862n0828
9714A26171p208l8391l9983n2602j1337m325J1073M1583L3086J2325m1609n5801
9702b7018j7859O9617M7568R050j8885o2931m466K8903J8518J4601K630k6292
9690C3436j0391j2276j6576J362L6289k3238m2454k4175N135L1763K8753P00J7278
9677B5606K8523K700k4926l2112J1674o038m8980k986K3003m169K8114J2064K5911
9664C8384j3767k6465k4699L0807L8716J6267j4280K3795Q445r553M481M555Q370
$$ y = [-10701, -4269, 3700, 20334, -2268, -2761, 55897, 54016, 36780, 4743, -3448, 7721, 57650, 66281, 73602, 98724, 106761, 118246, 137483, 159707, 194040, 287185, 408363, 516562, 587096, 631950, 728228, 764236, 726772, 654017, 558724, 481731, 423604, 352019, 246861, 176999, 126171, 118963, 80572, 40589, -12013, -23350, -27675, -16602, 24981, 58067, 70392, 28783, -27018, -44877, 24740, 72308, 81358, 62473, -458, -4924, 23979, 42497, 57098, 59728, 33436, 23045, 10769, -5807, -4445, 31844, 8606, -33848, -58023, -52888, -21125, 7628, 8328, 25606, 54129, 56829, 31903, -209, 11465, 5427, -43553, -46539, -23536, -27705, 409, 12473, 38384, 24617, -1848, -26547, 4260, 42976, 59243, 44963, 68758, 77203, 67650, 72131, 76686, 85056]
9651H5056P6352M2517k662M000k9748k2872m0956k4053j1982q455j6324k9065
9639B1808j3307j034j5472l8804j1773K4811L5270m871M6968L1539l6931j8343
9627A9861k4243J082M0480j6262n1598j0436j4517L0993j3354P698M1309j7504
9615f491M511J7432J2782l1262k8769J4652Q368k6528j495L3899L5870Q008L833
9602D4810J5461J1302k9692L56L6112m0856l5896P177L6235O049k2639m3340J427
9589a3494K9313J1787l7851m034j3331O865J6496K1047J3448o838L1449J5959
9577G0816q532J5688N875k5757n6133j5823Q331K6775O995j594j6664j818K0530
9564B8689J8535m4326m2627j2054J6433M4068J7003L3215m374l1428J3241P053
$$ y = [85056, 161408, 203925, 201263, 205263, 175515, 152643, 111687, 87634, 75652, 67197, 50873, 21808, 8501, 7467, -8005, -46809, -58582, -33771, 1499, -3372, 43596, 75135, 38204, 19861, -4382, -3300, 37180, 20918, -30680, -41116, -55633, -24640, -37994, -30296, 11013, -6491, -1980, 15452, 28234, -3028, -31797, -17145, -8777, -35305, -36800, -2901, 32969, 40977, 44810, 60271, 71573, 41881, 42237, 78349, 37493, 1597, 8774, 45009, 51058, 28419, -14921, -13494, 15819, 27606, -10245, -14279, -27610, -20745, -4249, 16798, 30246, 23408, 54857, 70816, 62284, 77972, 83847, 58090, 1957, -13866, -5535, 21240, 28235, 26641, 9977, 8159, 28689, 47224, 2898, -39729, -51783, -35350, 8718, 25721, 58936, 54562, 23134, 36375, 43428]
9552D3428j6869l6314J2959n186J39J9916O541K9713J8042k5642l8039J5606j7447
9539F847m9855L1125J3090k8141j8635N5791j5359j7463K1925M466k8234l1387
9527e5830N7474J5750r723J030R750K7524J2755K6627J3994k8714l0345p331j7691
9514A5270k1266j446L2193j8385r995J5585J5110J3957N760k8139K375K4540K4882
9501G0441K252m0344l3974j4219M0121j8315m1789L3920r383J3636R446o840L0610
9488C5562L5558M266n0664k7461J1439K6711j9035k3598j0216p251J8788m01P376
9475A074L011l0526R626l1796k2658J8361K0153J9382K1114n247m0238Q836K1833
9462g075K996l764q708M5645J4616k493J1377o3025m4378L6117K6232n83m810
$$ y = [43428, 26559, -9755, 3204, -1982, -1843, 18073, 24614, 54327, 72369, 46727, 8688, 24294, 6847, -43008, -11883, 1207, -26934, -45569, 10222, -5137, -22600, -675, 3791, -24443, -55830, 1644, 17394, 7671, 8701, 18451, 45975, 58730, 85357, 99351, 70637, 40292, 32961, 15270, -5996, -7442, 24751, 6366, -3629, 11956, 27066, 41023, 46783, 18644, 21019, 45559, 70441, 72693, 32349, -1625, -15844, 24277, 5962, -35827, -1907, -11290, 2346, 11792, 4952, 35562, 71120, 75386, 24722, -2739, 8700, 35411, 16376, -7222, -17438, -24689, -5901, -6302, 1074, 4085, -26441, -16815, -48611, -71269, -52908, -32755, -13373, 7741, 2494, -37744, -28908, -7075, -4079, -7843, -16551, 29094, 43710, 41217, 52594, -10431, -54809, -18692, 7540, 6957, 2147]
9449B147K5737N311j0652k9685m3700l1937O828l5377k743J0435k997J9643O8480
9436a8510N1549j2762l6157K0677o645j3851L177J9361L1029P913K1590J5420
9424H2791n7427k9468J0181k8235K3122K0022j955k6420k6115P715P774o208R828
9411a4395L4602K9613p480r478r49m3298J1484N3245L964m3914o709Q498j4154
9398A029K5811k0873l3586N271M1537k2859m7180l1312J0650J6018K1336J7662
9386a6496M3189J5692l9058o195j9649r082M4011K751l4824L5944L0667K511l423
9373D6038k8998k0512j714Q183O689Q521j9792N446J0948J1610M376m363o6906
9360d0474j2314K8105K3308o456j0284j1657j5162R815J3731Q800l2883l4523
$$ y = [2147, 27884, 33195, 22543, -7142, -50842, -82779, -75951, -111328, -114071, -103636, -106633, -86990, -18510, 33039, 20277, -15880, 4797, -1848, -15699, -12522, 6839, 37868, 45781, 67371, 82791, 25364, -4104, 6077, -22158, 964, 20986, 19031, -7389, -33504, -25789, -18015, -24223, -14395, 20207, 49820, 42340, 32862, 31913, -11385, 99, 53344, 57308, 13394, 6685, 15183, 1029, 26840, 5967, -27619, -22348, 19189, -3670, -50850, -82162, -71512, -55494, -34158, -16496, 26693, 42385, 3327, -2868, -22517, -31599, 12412, 15163, -19661, 16283, 46950, 49461, 46038, 17040, -3472, -5186, 2997, 9686, 18207, -1585, 3861, 14809, 26419, 30795, 26432, -40474, -52788, -24683, -1375, -7831, -18115, -29772, -44934, -35119, -21388, -12588, -45471, -79994]
9348g9994n971J510M6518L8233J6497J4920q116j7931J2347o212j2872m2634j4461
9335e8166K1737J3862J5981l5370l3911L689M9216L1737j9408j3323P511J0445
9323f000J0545k0514J3096k8972K519O0044P716P916P277l7951L6011K9764m7266
9310C4185j2387O082m0263k75N565l1874L0452J5360K5200L4336J7593j3673j0834
9297E9467K2249K147m9929l6989J3267j3957j1786J4884M348P248L0485N486M534
9284E1454k7043k9532j3220M729K4693n850j2153p556J4006n14J0144P320j0483
9271E995l1713k4988k6610J4995M4189L7380l41j6262r410P741J6630r29O022
9258B2699M0914J5111l138l6863r743j5740N685J02j4884P280M042J0080q770
$$ y = [-79994, -85965, -84455, -37937, 296, 16793, 31713, 23597, 5666, 18013, 11801, -1071, -43705, -58166, -36429, -22567, -6586, -41956, -75867, -72178, -22962, 8775, -10633, -23956, -16445, -6000, 4545, -15969, -2873, -31845, -29326, 30718, 38434, 46350, 53627, 15676, 51687, 81451, 34185, 21798, 27880, -12383, -12658, -7093, -38967, -8515, 6845, 32045, 66381, 83974, 70301, 59467, 81716, 83863, 33934, -3055, 10212, -3745, -15531, -647, 3701, 10949, 41434, 46920, 51454, 24411, -5121, -18341, -13612, 11081, 5231, -6922, -14478, -472, -986, 9158, 16478, 5995, -25718, -50706, -77316, -62321, -18132, 19248, 18907, 2645, -6765, 976, 17606, 16677, 22699, 63613, 78724, 75586, 38723, 28980, 13240, 18925, 19027, 4143, 11423, 15465, 25545, 16775]
9245A6775p793j9081l246k7189j2248J8989K9198L3780J5811K8462L6611k6075
9233H3994q1557l5905K3767Q19k1290N6121J0105k3908j8580j4904K5100L9690
9221D3452j515r340j3114l3168r361K0313K7179K1836n4024l1083K0173L5526
9209A6874M819m7769O999K4374o168l7048J3686J0077j6563J4930J0755j739j1904
9196a8677J1309l961o299M1260M1996J8644m5414k1059K1966o951k1238j5194
9184c618m4898m2730N3599O7524J0633j7495j2961P214K9483m847k3691l35L9351
9171E7229M5087k201n8420m1947j3346n854p321p165j5853l6358j8673L1055N4530
9158a9237R500k8713n498M915J4329p357q371o036K2719o274j7356m504j5777
$$ y = [16775, 8982, -10099, -13345, -40534, -52782, -33793, -4595, 29185, 44996, 73458, 110069, 83994, 2437, -33468, -9701, -8882, -30172, 25949, 36054, 12146, -6434, -21338, 3762, 43452, 41937, 32597, 19483, -13685, -23046, -2733, 24446, 46282, -7742, -38825, -18652, 16874, 21693, -26076, -19077, 5297, -871, -37919, -24233, -14156, -30719, -15789, -5034, -6773, -18677, -7368, -11329, -17628, 23632, 65628, 84272, 38858, 17799, 39765, 32814, 11576, -3618, -48516, -91246, -37647, 29877, 40510, 23015, 10054, 17268, 46751, 41904, 18213, 17878, 57229, 102316, 100115, 41695, -252, -13598, -19452, -26773, -33938, -49791, -86149, -104822, -73767, -19237, -9737, -38450, -43948, -39033, -24704, -32061, -40432, -46468, -23749, -30023, -47379, -51883, -67660]
9145f7660j9313l498K6073J5377P286M1440K0468p713l3594r052J432J4039P388
9132g327L6070o759K2016N468l1209n6033j4174J4141J246R277r581k745K3793
9119a5817K5949m3028j443n255l6398L9226M5319j9906j1951J6914j0561l1458
9107d8409q958J9247J8862J2862k357k3442j71k035J3587L6961P220l8537k3081
9094c8251J0717k0842J0095m801m422r998r207P903M4674m148P129K9105N89k698
9080A5845m9276R496j8705j9323J5612j2763Q800M4803k4164l4103r535K4307
9068d9006K782k8732J4829M5212K5445k2679n0849j2870K1177K4554J2404k3692
9056d1425o882k5372J9412M4686J6159p481k1924m551n204R005L5383L3199j8289
$$ y = [-67660, -86973, -90471, -64398, -49021, -41735, -295, 20173, 12460, -21134, -30186, -28754, -14715, -7327, 28743, 21984, 44000, 49468, 18259, -37774, -51948, -37807, -36561, -27284, -36865, -39610, -15817, 10132, -32896, -34339, -39594, -75992, -36766, 8553, -11353, -23304, -6390, -16951, -48409, -57367, -38120, -19258, -6396, -8753, -32195, -32366, -34401, -20814, 16147, 23367, -15170, -38251, -27534, -48376, -38281, -43082, -47504, -57502, -66709, -58806, -14132, -18280, -11151, 17954, 18543, 15845, -33431, -23935, -42640, -61963, -46351, -59114, -50314, -5511, -29675, -63778, -73313, -49006, -46224, -74956, -60127, -14915, 10530, -12149, -62998, -75868, -54691, -30137, -17733, -41425, -48307, -73679, -54267, -9581, 6578, -903, -22827, -27378, -32582, -23577, 11806, 45005, 26716]
9043B6716j4705j4043J3589l1137l9115N731K1239R758q520p429L4727K5760K1498
9030D4069n987k6573l4753Q741O96p937J3199L2104q80L585L4613M0184J4600
9017A15661k6662k3219o503n3119j6551j8348M270L5279J7600L5461O907l0641
9005D0135K36l2806k0749N437q250l1867l3758N1232J1889j3140p445J6437K0691
8992a958J436q320l6928r752o055K3554o46M229J2963R842J2037j2869R821J7618
8978A4972O602p646j0323j6410k8557l3369j7883R318M3K0102R256K5318k7600
8965e6177k1913L4819M8632l5220m0767j2035K0512R109J4770O5751k321l7837
8953a2677m4118M047p196M6427L6181P533J8482k1111k4084o631l1189r420J7942
$$ y = [26716, 12011, -2032, 11557, -19580, -58695, -52964, -31725, -21967, -30487, -37916, -3189, 22571, 44069, 38082, 11509, -23244, -14503, -13807, -21744, -8545, 23559, 22679, 26264, 60877, 101061, 115661, 88999, 65780, 59277, 6158, -10393, -28741, -24471, 10808, 28408, 63869, 70776, 40135, 40371, 7565, -13184, -7747, -15997, -47864, -81622, -30390, -18501, -31641, -39086, -22649, -1958, -522, -8842, -45770, -55522, -61577, -38023, -38669, -34440, -21477, -11635, 402, -12467, -2646, 14972, 21574, 13928, 3605, -12805, -41362, -74731, -92614, -83296, -83253, -63151, -53895, -28577, -56177, -78090, -43271, 5361, -29859, -70626, -82661, -62149, -53040, -38270, 27481, 25160, -12677, -56795, -52748, -59944, -13517, 22664, 30197, 48679, 27568, 3484, -3147, -34336, -43756, -25814]
8940b5814K5833L1283O097J3757K0597K3946n225k3734l107j1431k3158j0492
8928A8552O735J8772k6598m6129k9344K2474N1655K5108o457k78k3529K1234J1526
8915D3721k3415l2512K3816j6445k435q884j5201K5246K2038j3273j8674j4731
8903c0749j6387q776P938K3172M0152M7923q594j4127N816J2551j7970j4315K2
8890B6656p816j3831j6350J72J9970J0411M1117K7761n230p3541m8157J653K540
8877c4645K4584N2742K1533k5972l1322m6258q828J1352J4657K0858M261n8857
8865e5895m2188N1693O7252r410j9841k0856k0985m2816l7615L462K1455n013
8853a10757J8916P0195n585j9307J1383j6379K0274l384j1986L2665P798r601
$$ y = [-25814, 19, 31302, 37399, 51156, 71753, 95699, 90474, 66740, 63633, 52202, 29044, 18552, 25287, 44059, 17461, -28668, -58012, -35538, 16117, 41225, 34768, 34490, 10961, 32195, 43721, 20306, -12206, 11610, -4835, -7270, -16154, -31355, -6109, 15929, 2656, -16018, -30749, -47136, -55912, -47974, -24802, 15350, 63273, 54679, 40552, 46368, 58919, 40949, 26634, 26656, 18840, 5009, -11341, -11169, 8801, 19212, 60329, 88090, 82860, 9319, -38838, -37185, -34645, -10061, 42681, 64214, 38242, 6920, -39338, -48166, -36814, -22157, -1299, 2962, -55895, -98083, -46390, 20862, 11452, -8389, -29245, -50230, -93046, -130661, -127199, -105744, -110757, -91841, -21646, -27231, -46538, -35155, -51534, -31260, -34644, -46630, -13965, -6167, -15768]
8841a5768M92K1520M0678k0966k4111j3977k6171j2289p786q049m929J2882J7474
8828d1000L5124O640J0658K3131j736k8962p995j2221o88j7446K2176j7937j5130
8815d5386N6462J1286l1158j6360K5140K1467J3935m9951m9486j2652O9835N3022
8803D6154p764l255K0559N8535L9806k8349o4000l3084J3537m788J6696K3364
8791G7411k3081l9710k7112l1585j4722P434K2483K4847J6276r050k2896J82J5910
8778c613M91r224j24K8593O765m9338l7043L914K8430M8972L8773k3196m711K238
8764C0927O272K0958K5662k5920k4082k0786O1330J04473N6532M1345J0026p5185
8752B11552q3713j1216p204P10l1293m4453m0276j8288K4737L2789j097p448P413
$$ y = [-15768, -15276, 6244, 46922, 25956, 1845, -12132, -38303, -50592, -58378, -66427, -71356, -58474, -41000, -5876, 764, 11422, 34553, 32817, 3855, -4140, -16361, -17049, -34495, -12319, -30256, -45386, 11076, 22362, -8796, -25156, -16, 21451, 35386, -14565, -64051, -76703, -6868, 46154, 38390, 35135, 55694, 114229, 154035, 125686, 61686, 28602, 42139, 37351, 54047, 77411, 54330, 14620, -12492, -44077, -58799, -51365, -28882, -4035, 12241, 3191, -19705, -19523, -3613, -3122, -12346, -12470, 16123, 22888, -26450, -63493, -59579, -31149, 17823, 56596, 33400, 28689, 30927, 37199, 58157, 83819, 57899, 33817, 13031, 74361, 178834, 235366, 276711, 286737, 211552, 127839, 116623, 109419, 110129, 78836, 34383, -5893, -24181, 556, 33345, 32248, 24800, 32213]
8739C2213J2143J5962j7546l4497k4392J0074J2362j4299J6463j0159j3964K387
8727a3253k4149l0753k2593J1137N5337L6740j1031Q850J8112q132j1498o402
8715B365L5007q04j0198m058J2278J2524J2830P823j2495k9634l1813m077O239
8702d013L6365N1210l1797l2238j2329L836k7539k9793N4422K5244j8540k3536
8690h708r499J1860J5493q972j574n154J3684K6708r881k3975m004J9068j5853
8677h07N023j7653k2535K4210k3100l2190k1785j4539k383J0663M1465M9693r715
8664a3653K8009m7580J0852L6042K0562j759k7413k1977K8826J4360m526P435
8652B9178R171R83R914j8540l0479l1586M3812K0582l1222K5656P444J8613R148
$$ y = [32213, 44356, 60318, 42772, 8275, -16117, -6043, 6319, -7980, 8483, -1676, -15640, -13253, -37402, -68155, -90748, -79611, -24274, 12466, 1435, 10285, 28397, 20265, 8767, 2365, 37372, 36568, 26370, 22312, 34590, 47114, 59944, 67767, 55272, 25638, -6175, -10252, -4013, 32352, 83562, 51765, 19527, 7198, 11034, -16505, -46298, 8124, 33368, 14828, -8708, -18207, -6347, 9146, 174, -1400, -6554, 7130, 33838, 23957, -18, -4022, 15046, -807, 4216, -13437, -35972, -11762, -34862, -67052, -88837, -103376, -105759, -95096, -53631, -3938, -13653, 14356, -33224, -22372, 13670, 34232, 32473, 5060, -16917, 11909, 26269, 21743, 29178, 38349, 39332, 49246, 30706, 227, -31359, 12453, 33035, 1813, 27469, 34913, 53526, 62674]
8639F2674K337j3003K3608K6719m500n2172m6198J0779l1656m997L7882p447r404
8626e378l5370N91Q469O336J6576K601N713K4375N4181J4641o717m4381m8006
8613f369k9025J2868j9455J3319K7161K1036L5759P847j2413j1509o2920j0407
8601c4108J516p592M7898j9092j4103N68m0733L3198j9524k9109M7070L4634J5937
8588A6560l6444m963J5577q068J9118J6262J9951k7428j5930J4954J2477J7564
8576C9630J9732L108J0752k2358k1224j3007k3005K323j6319J3669J6238p581
8564A958k3062k998j4450n371j1886l6253P33M1730P298K094k9623n262K5927
8551d9165J6450l1707k4120Q139K5720J7191M752l1793J873M6867N3710j6011
$$ y = [62674, 65011, 52008, 75616, 102335, 97835, 45663, -535, 10244, -21412, -26409, 11473, 4026, -5378, -40748, -40157, -31688, -25352, -8776, -6175, -462, 23913, 78094, 92735, 86018, 41637, -6369, -35394, -22526, -41981, -28662, -1501, 19535, 55294, 63141, 50728, 39219, -23701, -34108, -32592, -40184, 7714, -11378, -25481, -24913, -65646, -32448, -51972, -81081, -34011, 623, 16560, -19884, -24847, -9270, -17338, 1780, 18042, 37993, 10565, -5365, 9589, 22066, 39630, 59362, 62470, 73222, 50864, 29640, 16633, -6372, -4049, -20368, -6699, 9539, 1958, -21104, -24102, -38552, -43923, -55809, -92062, -91329, -49599, -42301, -40207, -69830, -75092, -49165, -32715, -64422, -88542, -80403, -54683, -37492, -32740, -64533, -62660, -15793, 37917, 21906]
8539B1906J8904k14m2930j6513m980O589L2136J5791k528j1925Q604L7861k1776
8526D0925n0605L4510j103J4483K2298l7766j7072O706O535l2859n058N6087l0017
8513G064k038o887k4503L1319L1626J5094O948k3678k4327j5284K6779Q320J7308
8500D7741k5185k3335K9745j2850m562l9300k3730L0580R005L7565p123n7251
8488c8700j5176M2939K8845l3121j3898n2420l0311k1368J2850N6577K8164j3503
8476d9122o941o797k9777O855K9847K6668O788J044n685k5688P701K0810k4336
8463d8633j2434J1760j7944L5208L5013j6020r793J8624J1069q224m1280q371
8451e1025k0470J8345L3738L046R537J9421L082M9964p456k1710K7955k559l1002
$$ y = [21906, 40810, 40596, -2334, -18847, -23827, -17238, 14898, 30689, 28161, 16236, 24840, 62701, 40925, -9680, 24830, 23727, 38210, 60508, 22742, 5670, 12376, 18911, -13948, -19006, 37081, 7064, 5026, -1861, -26364, 4955, 36581, 51675, 58623, 34945, 10618, -4666, 22113, 30433, 47741, 22556, -779, 28966, 16116, 11554, -27746, -51476, -20896, -11891, 25674, 18551, -38700, -53876, -10937, 17908, -15213, -29111, -81531, -111842, -133210, -120360, -63783, -35619, -49122, -56063, -62860, -92637, -85782, -55935, -29267, -22479, -21435, -27120, -52808, -45107, -24297, -48633, -61067, -49307, -67251, -32043, 2970, -13050, -22843, -4219, 6850, -1374, -42654, -51025, -71495, -53150, -19412, -16366, -6829, 12592, 15674, 65638, 58182, 36472, 64427, 61868, 30866]
8438C0866j0543K8150K9734K4475j4519J2366R33j4549k1425N878P0k7105j3660
8425C0671k9214n411J2204o469r421o609R082j3267m2595L4590L6449n352k5511
8412b0853j6318K6170N937J1541p062k635j1021M188o070L6737q796K727K4867
8399C9412J346M0683m1954m4217k7353r301k2628Q662L3094L8527k5021l8218
8387d6968k49o070J2523R236j735j2018l163J3637J4298k8128J885K6781K9530
8374I559l762p509Q611q752j3126j0151N4084L7476k4584k3483m7289J0414M9404
8361C0892l534k469j2655k4964K7154J0628K3768R140J1045k7535j1359L808L4790
8348F8709J1071j1064p530N406K8122J5198P6588J25050P6946K7525o7818o7698
$$ y = [30866, 20323, 48473, 78207, 102682, 88163, 100529, 101462, 86913, 65488, 71366, 71436, 44331, 30671, 1457, -3954, 8250, 1781, -7640, -14249, -5167, -18434, -61029, -26439, 10010, 4658, -20853, -37171, -11001, -5064, 6477, -585, -3220, -14241, -10053, -16123, 20614, 11818, 14545, 39412, 40758, 81441, 39487, -4730, -32083, -41384, -64012, -55350, -22256, 16271, -8750, -46968, -47217, -53287, -40764, -31528, -33263, -45281, -48444, -34807, -20509, -48637, -46752, -19971, 9559, 5797, -1712, 6899, -1853, -14979, -25130, 28954, 66430, 41846, 18363, -28926, -18512, 30892, 27358, 24889, 12234, -12730, 14424, 25052, 48820, 57960, 69005, 41470, 30111, 33919, 68709, 79780, 68716, 61186, 66592, 94714, 109912, 186500, 311550, 388496, 416021, 348203, 280505]
8336B80505m2768j7685n1535q5765j8352k92j2209k1674m0745K9516o066k3256
8324a0326j8472l4913j4867M5369K3241j0230r661J5220J8475K0779M693j1009
8312A8299n231j846L3767O1k424j7568j560j2700l218K8536M3236N3873J7107
8299A50332M7414J50084J83205K07785J02303m215j05982j34722j98315j41611
8289B56278n5204o3327m1947j3953J5010l0241m662n0864n0405M1962M4584p528
8277C9703q120j4737k9291l219K1396k904o442J9796n489j3609m831L6295o701
8264B1847l7420P057R848k0275K2147L1771O840J7500K2156L5404M9025Q6636
8252B52536R2532P1838N956o5073o4252q1673p6971p0830K3375p855o280j1764
$$ y = [280505, 237737, 220052, 168517, 82752, 64400, 64108, 51899, 30225, -10520, 18996, 12930, -10326, -28798, -63711, -78578, -33209, -9968, -20198, -29859, -14639, 3836, 24615, 29308, 18299, 13068, 11222, 44989, 45050, 42626, 25058, 23498, 10798, 7580, 36116, 79352, 133225, 150332, 197746, 347830, 531035, 738820, 841123, 836908, 730926, 596204, 397889, 256278, 201074, 137747, 95800, 81847, 96857, 66616, 61954, 11090, -39315, 2647, 47231, 39703, 31583, 16846, -12445, -15664, 5732, 2828, -3614, 16182, 10693, -2916, -7747, 28548, 21847, -15573, -8516, 1332, -18943, 3204, 34975, 41815, 59315, 81471, 116875, 165900, 252536, 345068, 416906, 422862, 357789, 293537, 211864, 134893, 64063, 87438, 79583, 73303, 61539]
8240F1539k3478P618M0842K693k5716j9054l6580l8477j6081L5247K0016k5208
8228a6639k2135j5068k3046j8452q590L4749K3661j8241K7016L7196J0854r835
8216A470l0930J3753n294N819k3738K6855J5432j000j1161K4194j882j9508R731
8203C741q429K705M970J8169j0154j7990j97K1645n542L6851j7528r971q056R64
8189A1178N61m4155N428j3913J496q817K4592L2515P091q38j7143j1335l261m855
8175b1456N975R717j9217n26R877j5134K0113M812M746j2985j2520L096M0440
8162A6938l1122k0622K07J833k4925n72N2580L3761k1527P766k0590m5475k7574
8149g9322k3762j9477K8901M7275j5051m864k1957J4010O1685M5090j8817r071
$$ y = [61539, 38061, 45679, 86521, 89214, 63498, 44444, 7864, -30613, -46694, -11447, 8569, -16639, -38774, -53842, -76888, -95340, -103930, -69181, -45520, -63761, -36745, 451, 11305, 1470, -29460, -15707, -21001, -15182, -38920, -12065, 3367, 2367, -8794, 15400, 13518, -5990, 3741, -4688, -1983, 2987, 21156, 11002, -6988, -7185, 14460, 8918, 45769, 28241, 18270, 10214, 11178, 11739, -32416, -26988, -40901, -39405, -48222, -23630, 8885, 15976, 15138, -2005, -13340, -16601, -21456, -15481, -5764, -24981, -25507, -15630, -30764, -10651, -5839, -1093, -14078, -26598, -23502, 16938, -14184, -34806, -34599, -32766, -57691, -58263, -5683, 28078, 6551, 14317, -6273, -51748, -79322, -103084, -122561, -93660, -46385, -61436, -66300, -88257, -74247, -12562, 32528, 13711, 4640]
8137D640k8125j6301j4115K2160J780j7793j3747k0520o543L3582L1517l1938
8125e5403L511L954j4696K087J4100Q016j1391k7729k333N8613J6426m4194k2256
8112g1295j917K8034P953l0155k0599K5202N9014L7940L158j9211l5204l8422
8100e5502K1765M4524P066n480k9365k4453L3042l995k5190K871l231K6530k5258
8087c6676J1016j2403J885j0142K1191L6235K3925k477l5228J1367m3724l5599
8075g0630J8783N4205L1038j77l6086j4899k4702j9148K0375j537K9780L6675
8063B3677r571l0788j5629k5296p118J7439J1028J4667j464L000J9909J72k0576
8050b0550K4413L5203k2497j1266L8646o623l1453l406l6138k8236n9566K857
$$ y = [4640, -23485, -39786, -53901, -31741, -29961, -47754, -61501, -82021, -88564, -54982, -23465, -55403, -51892, -47938, -62634, -60547, -46447, -38431, -49822, -77551, -79884, -21271, -4845, -49039, -71295, -73212, -45178, -37225, -67380, -87979, -62777, -3763, 34177, 37335, 18124, -17080, -55502, -33737, 10787, 17853, 12373, -16992, -41445, -8403, -12398, -37588, -34717, -37948, -11418, -36676, -25660, -38063, -36178, -46320, -25129, 11106, 35031, 32554, -2674, 8693, -35031, -70630, -51847, 2358, 33396, 33219, -2867, -17766, -42468, -61616, -41241, -42778, -12998, 23677, 14106, -16682, -32311, -57607, -64725, -47286, -36258, -21591, -23055, -20055, -146, 26, -20550, 3863, 39066, 16569, 5303, 43949, 37326, 5873, 2467, -33671, -61907, -121473, -118616]
8038a18616O2438M4628N47M7929J7191K570n29k0415m3054j6732K9154J496k719
8025C888k4412k7181n974P005P991N907P371m182j3628J154j5823K3753L4168
8012C7K8224m502m9385l4601k8746K1932L331J3001J8774M1492n976l0816J2424
7999a4811j7999r697J3173M219Q538J096j8577L965j4414K0041j8206P610L2328
7986b734K7352j560j1463l0919O810K2536o015m988j1617p778R924l2162j3676
7973e6290J6686j3915j015Q311k5719k1300M2488L7485J2316j5250J329J6998
7961B124J9890m5791o914p921K290L163K4696j4315J8292j2544J2001l3210l649
7948d1888J8338j038J1443M417K7773J0069m3631j6349L4035J1449k3920j667
$$ y = [-118616, -56178, -11550, -11003, 36926, 54117, 56687, 56158, 35743, -7311, -24043, 5111, 6607, 3888, -20524, -47705, -53679, -46674, -38683, -32776, -25405, -29587, -43215, -42061, -57884, -34131, 37, 28261, 23759, -25626, -60227, -88973, -67041, -63710, -50709, -31935, 9557, 3581, -27235, -14811, -32810, -42507, -29334, -25115, -16577, -15481, -34058, -30093, -44507, -24466, -42672, -35062, -2734, 24618, 23058, 11595, -19324, -12514, 10022, 4007, -981, -12598, -20376, -10452, -42614, -56290, -39604, -53519, -54534, -46223, -71942, -93242, -50754, -13269, -953, -16203, -14874, 2124, 22014, -23777, -30691, -38612, -36322, -33159, -8463, -22778, -4486, -17030, -5029, -38239, -41888, -23550, -24588, -13145, -8728, 19045, 29114, -14517, -30866, 3169, 14618, -9302, -10969]
7936a0969J3560O985J2166L5590K47l4703n3432q133K0671k5680j5166K0830J3710
7923b4324k0051J046K6232j3564J4255J9865J614L535P366K7309Q318l2549k5257
7910f205o0053j7913M1301k266o4193K0569J5569K8728J8280J4436J128k1946
7898c2565r79J1642j3267K3771K2948J2747k2399R733K2979j40l4319n5754J7313
7885c8290n515m0341r236K5376j6117j3417J5836K8431L0088k9480r026K4401
7873c7290M85J951J2199J2325J3878j4517r119q197l1670R76q160R564L073n518
7859f0020P292n927J087L41j844J1612K5466j601J0529N218J8974k0117k631j1341
7845b2962j1090j1475J4481J2838L883k2324J6002k3818l2525M1183M0654J87
$$ y = [-10969, 2591, 9576, 21742, 57332, 57579, 22876, -30556, -38689, -18018, -43698, -58864, -38034, -24324, -44375, -43329, -17097, -30661, -16406, 3459, 5073, 8608, 15974, 43283, 51601, 19052, -6205, -66258, -84171, -42870, -45136, -109329, -88760, -73191, -44463, -26183, -11747, -10619, -32565, -33544, -21902, -35169, -11398, 11550, 24297, 1898, 11631, 34610, 34470, 151, -55603, -38290, -43805, -84146, -93382, -68006, -84123, -97540, -81704, -53273, -23185, -52665, -61691, -37290, -36805, -34854, -22655, -10330, 3548, -10969, -20088, -28285, -59955, -58979, -67139, -57575, -54502, -60020, -52728, -58655, -57568, -57227, -59071, -47459, -21993, -23594, -13065, -7847, 11127, -8990, -11621, -22962, -34052, -45527, -31046, -18208, -14325, -36649, -20647, -44465, -76990, -35807, 4847, 5034]
7833E034m4813k2822K2880L3718k2162K1452O146k4189L2178k574L8691M2270
7821H5809J5964j8532k5393k4913k7651q601J8751J0055l4606j2138L2054M4649
7809E5448J4008k3498l5535j1750N26R210O899L583k6452N308j6194j4092K5040
7796g499L434l7508P450M0828j821J5763o0496j4415K2497K5372k991j1972m1423
7783f2781K4267L0504K5108R098P996k0935j5286J8212n303l3286p904M9968k6219
7770f561k0254l3140k696j0045L9790o95J8205n784J3008K5357j7509l0382k7222
7757e7928l9700L360k2828R390M3937M131l1657O326q908J1165k795J1189k4012
7744i8330J5659M4679K7628K2777l47k1521j1846m0375K4845j2935k3648N4143
$$ y = [5034, -39779, -62601, -39721, -6003, -28165, -6713, -567, -24756, 7422, 4848, 43539, 85809, 101773, 83241, 57848, 32935, 5284, -3317, 15434, 25489, -9117, -21255, 10799, 55448, 69456, 45958, 10423, -1327, -801, 8409, 15308, 18891, -7561, -2253, -18447, -32539, -7499, -4065, -41573, -34123, 6705, 4884, 20647, -39849, -54264, -31767, -6395, -9386, -21358, -62781, -38514, -8010, 17098, 26196, 34192, 13257, -2029, 16183, 10880, -22406, -30310, 19658, -6561, -26815, -59955, -62651, -72696, -32906, -33601, -15396, -21180, -8172, 17185, -324, -30706, -57928, -97628, -94268, -117096, -107706, -63769, -59638, -91295, -84969, -93877, -82712, -85507, -74318, -98330, -82671, -37992, -10364, 12413, 12066, -9455, -21301, -61676, -36831, -49766, -73414, -19271]
7732a9271M925k3148J7383J7287j0647k6270j1667L1726J2017J947K441J3487
7720A0210l1503m6242j4350L4591K1851P824M2662r417l6906L7311R648j4560
7708A1119n5588l3123J6102k2318L9965M3859R398Q222n59K5172L4183m6649l7509
7695g726M484K4345k7023M919k1415p886l4077J700p134j3012Q556J5475m060
7682f2854K3021M9806j3118l2267j8645R79J0096K7697O80j0131l9509l492J0031
7669e7706M5314K783K671l664J8701K6368j9910n1315k6076J0563M665L8680L0244
7656B1318l8574j6125J083K2648J0092K186L985l19k1912Q239J1152l490m130
7643c847R64L0152N7599k7097l6335p788l415O605k9039j795L1407K5549l3036
$$ y = [-19271, -14346, -37494, -20111, -2824, -13471, -39741, -51408, -19682, -7665, -5718, -3277, 10210, -21293, -67535, -81885, -47294, -25443, -17619, 25043, 15626, -21280, 16031, 25679, 11119, -44469, -77592, -61490, -83808, -43843, 16, 9414, 17636, 17077, 42249, 76432, 29783, -7726, -3242, 21103, -5920, -1001, -22416, -30302, -64379, -62679, -69813, -82825, -74269, -58794, -62854, -39833, 9973, -3145, -35412, -54057, -53078, -42982, -15285, -14605, -24736, -64245, -67737, -57706, -12392, -9609, -6938, -10602, 8099, 34467, 14557, -36758, -62834, -52271, -47606, -8926, 21318, -17256, -33381, -32298, -9650, 442, 2628, 6613, 6294, -15618, -7379, 3773, 283, -3847, -2883, 27269, 84868, 57771, 21436, 13648, 10233, 16838, -12201, -13996, 17411, 42960, 9924]
7630I924J5628L356k6113k7215l787N766M726L8771j0590m8896l5695m5105K0893
7617i8337L8189L3982L632l125j029k869J3139K89j527K1512J0740j2618l2012
7604c0034m058l937J563O177k4551j3399K3802J8285K6035j9028j0581P097o541
7591b9170O673l0494j4213M3824J3388l4932N036L6125K1050k9268m3923j7808
7579g3712J4599R872K1481k614j6526L4342N3045k0739j4241n2878l7034P731
7567g6674j0611m797K1751j370N0037J5936j9529K2976K5897l352j5589l0499
7555b5824M27k3980m4383J02O9581K6715K7489R117k8421k5298j9878L6703O0946
7542F3296K9484R133J5535l5575l4914o0002m1029j876M6651r159k1514M2980
$$ y = [9924, 25552, 28908, 2795, -24420, -28207, -22441, -17715, 21056, 10466, -38430, -74125, -119230, -98337, -60148, -26166, -22534, -25659, -26688, -29557, -16418, -16129, -17656, 3856, 14596, 1978, -30034, -34092, -38029, -36466, -30289, -54840, -68239, -44437, -26152, -117, -19145, -29726, -22629, -29170, -22497, -52991, -67204, -23380, -9992, -44924, -39888, -3763, 17287, -11981, -55904, -73712, -59113, -49241, -27760, -30374, -46900, -12558, 40487, 19748, 5507, -47371, -84405, -76674, -87285, -92082, -70331, -71701, -21664, -5728, -25257, -2281, 23616, 20264, 4675, -25824, -25397, -49377, -93760, -93658, -24077, 2638, 30127, 39244, 10823, -14475, -34353, 2350, 63296, 92780, 101913, 117448, 81873, 46959, -13043, -54072, -55948, -9297, -18456, -39970, 3010]
7530C010K705l1622j346N1767K4650n9115j0510J4056L0618q687l6594M18K4901
7517D251Q750l3367k2195N3859J8356j1289k1872K8068j3425k1069l0648o395
7505d6976K2861O959m1520R135N1803O0649j2901m1849j2847j3679K3471j738
7493C368l1533o3145l228J9399O616O1029J0571Q572n256j6661j1921k6813r965
7480e8967M9694J5200k8142K9608J512L126j128k7656j7649k6910J5156p427n0995
7467a04578n295N4337J7980J9729K0673R693K8622l5109l9891k2252p597k1563
7455h5251p439K2334L6929l289q090L4935L0534j2264m681K8799j0654n0513n16
7442b9166L3552R420J858N901l176o981k0269k299n618L7800j523J1538M2939
$$ y = [3010, 5715, -25907, -27253, 24514, 49164, -9951, -20461, -6405, 24213, 15526, -21068, -20650, 4251, 13001, -20366, -42561, 11298, 29654, 18365, -3507, 24561, 11136, -9933, -40581, -46976, -24115, -17156, -58676, -49541, 2262, 62911, 50010, 8161, -4686, -18365, 5106, 3368, -28165, -91310, -94538, -75139, -68523, -7494, 3077, 11649, 6393, -10268, -22189, -49002, -58967, -9273, 5927, -22215, 7393, 8905, 12031, 10903, -16753, -34402, -61312, -46156, -53583, -104578, -109873, -55536, -37556, -17827, 2846, 12539, 41161, 6052, -33839, -56091, -63688, -85251, -92690, -70356, -33427, -36716, -44806, -9871, 20663, 8399, 3718, 32517, 21863, -28650, -29166, 4386, 13806, 15664, 21565, 18389, 11408, -8861, -11160, -16778, 21022, 19499, 31037, 73976]
7429G3976k9484q388j127l7685l1001K7244M4749K0761n8487J9618j0986k6568
7417a7378K5165K063j0474j6962J1105k5664j9696l653k7084K9599K1174K0389
7405a1416K7348p399j4608j3013j5444r845O334K0674J348j257J6126k686Q125
7392D287J0349J5404j4332J8016J6559K0132q938n6596j4183L7361k5975m8338
7380d6254j431l0390P461L3440K780J9313o216k8132M5700N781k1340j1278j5388
7367d5954L8j0373O297N0190l7426n4077j0996M9222O000J6883K5497l3156J7644
7354b0211K5524J70K294l530j6905j1387J0496J8456l5217k7921L0354j3675k9143
7341g0695J7729K7708M3112K8407n7398j9748J9452j5427k6978j7676k2563J9948
$$ y = [73976, 44492, 36104, 34977, -2708, -33709, -6465, 38284, 59045, 558, 20176, 9190, -17378, 7787, 9850, -624, -17586, -6481, -32145, -51841, -55494, -82578, -52979, -31805, -11416, 15932, 8533, -6075, -19088, -34532, -44377, -38043, -17369, -16021, -17278, -1152, -3838, 4287, 14636, 30040, 15708, 33724, 50283, 70415, 61477, 4881, -9302, 28059, 2084, -46254, -47685, -78075, -70614, -37174, -34394, -15081, -21297, -49429, -3729, 2052, -19288, -30566, -45954, -45916, -56289, -49992, 198, -37228, -91305, -102301, -53079, -47079, -30196, -4699, -37855, -20211, 5313, 5483, 7777, 4247, -12658, -24045, -13549, 4907, -30310, -58231, -27877, -41552, -70695, -52966, -25258, 17854, 46261, -11137, -30885, -11433, -26860, -53838, -71514, -94077, -74129]
7329g4129J5639M6371j139j4591J7589j0760l0862l7379j841N5879p99Q816j5190
7316d2396j0540J5814P691J4008n012j5751k4931J6496j9965l6841n957L6524
7304g0860L6489r043r391l2975k626J7954j9911J9886K8340K614J9391J4259j5059
7291b0932m57P160j3919K5616o411J5197k8742j0045O0754M2728j0570l5835n1526
7278b6982P024K391n529J9492K8206m91n3453p554L0199K7073o263K958K555K4953
7264D4579O97m24j5080k1018j0927q690k3933K4212K3123M803l4502k8861l3815
7251g9836k5830l2066L6696P2030L5964K2384O585l1016l0765m3374N0660K2818
7239D250o165k0064j2825k1884K5266M5620K888n863m4036p805L0945j0932k871
$$ y = [-74129, -58490, -12119, -13258, -27849, -10260, -21020, -51882, -89261, -91102, -35223, -36022, -27206, -42396, -52936, -37122, -29431, -15423, -20435, -36186, -61117, -44621, -64586, -101427, -107384, -70860, -34371, -43414, -52805, -85780, -88406, -70452, -90363, -70477, -42137, -39523, -20132, -5873, -20932, -21389, -14229, -28148, -2532, -8943, 6254, -22488, -32533, 28221, 70949, 60379, 24544, -26982, -19958, -17567, -23096, -3604, 24602, 24111, -29342, -36896, -6697, 20376, 14113, 17071, 19626, 44579, 45276, 44852, 29772, 8754, -2173, -10863, -34796, -10584, 12539, 17342, -17160, -46021, -79836, -105666, -137732, -101036, -29006, 6958, 29342, 35927, 4911, -25854, -69228, -18568, 4250, -1915, -21979, -34804, -56688, -31422, 14198, 17086, 11223, -32813, -40618, -9673, -20605, -23476]
7226b3476l9910M6340J0641l3951k7298l0855j1898J8711L1945K2548K2153L4085
7214A9035J8902l0776j9490k4693q746M7059j3034m0339l1835m762O4166K5288
7202G75K168l8473m5395K6301l347N573j579k86L6516n988J2502k5367J4788J108
7188b0704o100L79j2414k1690q319K1917K2880K0488l5531j0946q992k6513K264
7175h3281O1768N861J061k0046P65N403L1537k5295L510P2911L8719k8478j4724
7162D9711L416m1496l4294k2602n873K216P268M2840k454J7230P1980k9000o3002
7149d060l3791L595J1468j0840K992M3252k0088l6715p683J6716J3390K1986l2341
7136c2119l6910L922N1010K1770M3344O521k1447Q876l1184k2749k8183k939k7481
$$ y = [-23476, -63386, -17046, -6405, -40356, -67654, -98509, -110407, -91696, -59751, -37203, -15050, 19035, 37937, 7161, -12329, -37022, -45768, 1291, -11743, -52082, -83917, -88679, -24513, 775, 2943, -35530, -80925, -54624, -57971, -52398, -53977, -54263, -17747, -23735, -11233, -36600, -21812, -20704, -26804, -26425, -38839, -60529, -68848, -46931, -24051, -3563, -39094, -50040, -59032, -85545, -83281, -21513, -15652, -14591, -34637, -33872, -28469, 3068, -22227, -18717, 54194, 92913, 64435, 49711, 53127, 11631, -22663, -45265, -51138, -48922, -41654, 1186, -1268, 15962, 87942, 58942, -4060, -37851, -34256, -22788, -33628, -30636, 12616, -7472, -44187, -51870, -35154, -21764, 222, -32119, -69029, -65107, -14097, 7673, 51017, 57538, 36091, 44967, 13783, -8966, -37149, -40088, -67569]
7123f7569r459M9828L9406K1970L356L295K770k3532m2198p751K2177R718m2358
7110d0347m3748k2173l76N2088K7796m56K8239R238k697R053l5341l772k0399
7097d2895K2574q29k6081j2046k2390L884j9125j1450M3741K9911K0149J055l164
7084a6666K960j5441o24j527N798L6253K1841o339O656n4112Q079K7311m908l3784
7070b4503p474K5390j3367Q037K4895l7039p4114L5444O8572K889l8129j20j37
7057b9656K9229N1286j7134j9957k4601O626J4334l3485O565K914k3262m1627
7045g8768K0866k1686N011j2922j1313Q668K6144L3931J8931m276K3635L0152
7033C8373k7421j8778n3418l650r0j78j2836j4845K1797J6976L4620L5255k7358
$$ y = [-67569, -77028, -27200, 12206, 34176, 37532, 40827, 43597, 20065, -22133, -29884, -7707, 2011, -40347, -84095, -106268, -106644, -54556, -26760, -27216, 1023, 10261, 7564, 16617, -18724, -22496, -42895, -20321, -21150, -47231, -59277, -81667, -77783, -96908, -108358, -64617, -34706, -14557, -13502, -16666, -13706, -29147, -29771, -31298, -25500, 10753, 32594, 26255, 32911, -21201, -13122, 14189, 9281, -24503, -31977, -6587, -19954, -11917, 12978, -24061, -98175, -62731, 5841, 8730, -29399, -29519, -29656, -427, 50859, 33725, 13768, -10833, -4207, 10127, -23358, -16793, -13879, -37141, -78768, -57902, -79588, -74577, -87499, -98812, -90144, -64000, -30069, -11138, -15414, 8221, 38373, 10952, -7826, -61244, -64894, -64984, -65162, -77998, -92843, -71046, -54070, -19450, 15805, -11553]
7020a1553j0583k4046P95j2795K6313J9039l195k7530n7002k5853k9931K5507
7008a30834L0317K4841j2525K7683q861K8973O900O68J1603K2448j3966o3209
6996g5962L0511K6910J862K401r787N318Q442m1972N411K557K8135P41j3297k6309
6982e5039M3801L1373M603m4809k6839l749L6428K0567K7552j0893K4059k6992
6970B0062n1885J2562K2238Q433M002l796j3167k0710R324M1669M1553k5010J6133
6957F1408Q057n7785l2019J6923k2184k066L3801J5511M9699k0996j2978o208
6945C1163l8415q607J2727j1591k0507L1507L1258j4093Q668n276j8849o2450
6933f4465l3107J3718j197L9353O3371j1163J0903J0122J3517o020j3366l1853
$$ y = [-11553, -22136, -46182, -45387, -58182, -31869, -12830, -16025, -43555, -100557, -126410, -156341, -130834, -100517, -75676, -88201, -60518, -69379, -40406, -33506, -32838, -21235, 1213, -12753, -75962, -45451, -18541, -16679, -14278, -24065, -18747, -10305, -52277, -46866, -44309, -16174, -15433, -28730, -55039, -11238, 20135, 24738, -20071, -46910, -50659, -14231, 6336, 33888, 22995, 47054, 20062, -31823, -19261, 2977, 11410, 15412, 11616, -1551, -22261, -12937, 28732, 70285, 45275, 61408, 69465, 11680, -20339, -3416, -25600, -27666, 6135, 21646, 71345, 50349, 37371, 31163, -7252, -15859, -3132, -14723, -35230, -3723, 27535, 13442, 22110, 16834, -2015, -64465, -97572, -83854, -85051, -45698, 17673, 6510, 17413, 27535, 41052, 35032, 21666, -10187]
6921a0187N613j9777O395j6114l5633q406K6213L3636P446k2654J9832K8251m990
6908I625P011P256n665j9232k0125J2852l762j8128J2834j433K7754k1503m4517
6895e7033K8425L6726q454j5109O90L3675r65k0350K9570j221k3607j1097n1065
6882e9815n6518Q286L8997L7130j9193j5494M3794M4808m617J1386L624j5351
6870A7037j6890J8569q539J1440P099J4764n1075l0329j3917L3389K4466L2730
6858C8744J3030k5052J934l0783k6868P378j7977j9077r701l603o706K1721P1450
6845A4490J1052n3142l2075M6568N0984m5100k2874J0710j1503M5320M8902J0505
6833G3837m4789n4506j9468Q934K6590K2529q967j6055j4234R188J7160K6711
$$ y = [-10187, -4574, -24351, -17956, -34070, -69703, -78109, -51896, -18260, -10814, -33468, -13636, 14615, 9625, 16636, 23892, 18227, -1005, -21130, -8278, -12040, -30168, -17334, -18767, 8987, -12516, -57033, -28608, 8118, -336, -15445, -14755, 18920, 17955, -2395, 27175, 25954, 2347, -8750, -59815, -116333, -108047, -69050, -31920, -51113, -66607, -22813, 21995, 17378, 28764, 32388, 17037, 147, 18716, 10177, 21617, 28716, 43480, -7595, -37924, -51841, -18452, 6014, 38744, 51774, 26722, 28656, -2127, -28995, -21617, -39594, -58671, -68372, -71975, -78681, -56960, 14490, 25542, -27600, -59675, -13107, 37877, -7223, -30097, -19387, -30890, 14430, 63332, 73837, 29048, -25458, -44926, -35992, -9402, 13127, 4160, -11895, -26129, -16941, 219, 26930]
6821B6930m8653m3247J6449K7354J3830j8523j5834q769K416K6495R188k6313
6809c8677k7556P88M3452K9821J5586j6920j9377m6653J6055M3014R954j2165
6797b678J9305Q049K0801m5686j8634j0373J3878j8309K649N740Q772K1971l5050
6784b9565k9152L8340J9247m6875R452J4247J2388j7009M7826l1139k9147R633
6772c1754P314J5606K6316p293k435l4452l2949n986J8261K2456k4967K9417L6017
6759A5551L818n6159k8150J2483P191J4848j002k4533l0838m508M6905L2981k3382
6746c4795K6050j6988j0347l0426J2829J8830J3882J4153j2427J258p210R278
6734a5913p634k3487Q913l298k653J5222J7455l3410k3040J2451j4156j5818L9771
$$ y = [26930, -21723, -64970, -48521, -21167, -7337, -25860, -41694, -50463, -48047, -21552, -12364, -38677, -66233, -65445, -21993, 7828, 23414, 6494, -12883, -59536, -43481, -467, 9487, -2678, 16627, 24676, 45477, -209, -18843, -29216, -15338, -33647, -30998, -25258, -16486, 5485, -29565, -58717, -20377, -1130, -48005, -38553, -24306, -11918, -28927, 18899, -12240, -41387, -31754, -24440, -8834, 17482, 10189, 7754, -26698, -59647, -65633, -47372, -24916, -49883, -20466, 15551, 19369, -36790, -64940, -52457, -45266, -30418, -31420, -55953, -86791, -91299, -44394, -11413, -34795, -8745, -25733, -36080, -66506, -53677, -34847, -20965, -6812, -19239, -17981, -25191, -15913, -23547, -47034, -38121, -41419, -44072, -28850, -11395, -44805, -67845, -55394, -69550, -85368, -45597]
6721d5597J9402j3262J6785K9079k3206J7338O864k0537k1517M1687K6264K2948
6709E6248m651j2140K3083M912j0909L008j1070j5267N043j591o980j7106Q07
6696A3387K8567j718r852p934K3879k7318Q877l101j3460j1588j6110j8000k9754
6683f4125O4947K9994l5412N568j2344r358K2386N300j39J7123l0880k0294M140
6670b3094j1111L2979K7510O131J8241L2971j1231k1432m2169M189n682l8012
6658c0710l1078M125L3982l2703k3423P929K2894Q494J7676q741N579K9376L1900
6645C5300m260k6105k0258m5686K2293J1339m0129M956j0170L5376J5432L2515
6633A0603K5648j0321k4650j4970k7444l89K6127L3621L3167j8236oj5397r714
$$ y = [-45597, -26195, -39457, -22672, 6407, -16799, 539, 7403, -13134, -34651, 7036, 33300, 56248, 51597, 39457, 62540, 67452, 56543, 59551, 48481, 33214, 38257, 36666, 29686, 12580, 13387, 41954, 40236, 30384, 22450, 46329, 19011, 27888, 24787, 11327, -261, -16371, -34371, -64125, 822, 30816, -4596, 972, -11372, -20730, 1656, 6956, 6817, 23940, -6940, -27234, -23094, -34205, -1226, 26284, 32415, 50656, 83627, 72396, 50964, 8795, 12984, 7302, -30710, -61788, -57663, -23681, -56384, -79807, -71878, -48984, -40490, -22814, -31555, -25976, 3400, 35300, 31040, 4935, -15323, -61009, -38716, -27377, -67506, -62550, -72720, -37344, -21912, 10603, 36251, 25930, 1280, -13690, -41134, -41523, -15396, 18225, 51392, 33156, 33150, 17753, 8039]
6620H039r645J9887l641l1531q559J3326j3729K183L6311J0096k1233Q569J8727
6607B8800j6673k4223k4038r658l112M3011K7447k489p047j7177K1608l1043n856
6594b0450k1917l313j984K0247k7016n932N237k9281M7842p867k2806k0809L501
6581h4548O0025M0448m4639m5907o459K2601J0392K0703k6054k2832r909L0637
6569e5542L8193j0812M190K605r889K5844K3984k0665J7956J3870K2438j4618
$$ y = [8039, -1606, 18281, 14640, -16891, -25450, -12124, -25853, -23670, 12641, 22737, 1504, 10073, 28800, 12127, -12096, -36134, -45792, -48904, -5893, 21554, 19065, 12018, -5159, 16449, -14594, -20450, -42367, -45680, -47664, -27417, -54433, -60365, -55128, -84409, -36567, -44434, -67240, -88049, -84548, -24523, 15925, -28714, -74621, -81080, -58479, -48087, -27384, -53438, -76270, -86179, -55542, -17349, -28161, -23971, -21366, -31255, -5411, 18573, -2092, 15864, 29734, 52172, 37554]
$$ [...]
##END NTUPLES=NMR SPECTRUM
##END=
