##TITLE=Analysis number 307205
Compound Code cc 03604
Book Reference 399/145
Project Code adrs
Chemist Name evam
##JCAMPDX= 6.0         $$ Bruker NMR JCAMP-DX V2.0
##DATA TYPE= NMR SPECTRUM
##DATA CLASS= NTUPLES
##ORIGIN= Bruker BioSpin GmbH
##OWNER= NMR
$$ XWIN-NMR		Version 3.5
$$ Mon Apr 25 08:40:14 2005 GMT Daylight Time (UT+1h)  MAYBRIDGE\NMR@NMR_250MHZ
##.OBSERVE FREQUENCY= 250.131544655141
##.OBSERVE NUCLEUS= ^1H
##.ACQUISITION MODE= SIMULTANEOUS (DQD)
##.ACQUISITION SCHEME= undefined
##.AVERAGES= 16
##.DIGITISER RES= 18
##SPECTROMETER/DATA SYSTEM= dpx250
##.PULSE SEQUENCE= zg30
##.SOLVENT NAME= CDCl3
##.SHIFT REFERENCE= (INTERNAL, CDCl3, 0, 16.4714)
##AUDIT TRAIL= $$ (NUMBER, WHEN, WHO, WHERE, WHAT)
$$ ##TITLE= Audit trail, XWIN-NMR		Version 3.5
$$ ##JCAMPDX= 5.01
$$ ##ORIGIN= Bruker BioSpin GmbH
$$ ##OWNER= NMR
$$ C:\u/data/dgb/nmr/ADRS/2080/pdata/1/auditp.txt
$$ ##AUDIT TRAIL=  $$ (NUMBER, WHEN, WHO, WHERE, WHAT)
(   1,<2005-04-25 08:39:38.07 +100>,<MAYBRIDGE\NMR>,<NMR_250MHZ>,
      <created by zg, POWCHK disabled, PULCHK disabled
       configuration hash MD5:
       62 19 C7 07 E1 42 D1 B7 37 6C 3D D0 77 39 F9 E6
       data hash MD5: 64K
       BF 52 90 83 0E BC 30 D8 C4 2E A9 5A B2 6E DD 41>)
(   2,<2005-04-25 08:39:55.85 +100>,<MAYBRIDGE\NMR>,<NMR_250MHZ>,
      <Start of raw data processing
       ef LB = 0.3 FT_mod = 6 PKNL = 1 SI = 32K 
       data hash MD5: 32K
       6F 0A 88 EB 73 CA 1A 85 60 87 F4 7F 45 1A E9 29>)
(   3,<2005-04-25 08:39:59.58 +100>,<MAYBRIDGE\NMR>,<NMR_250MHZ>,
      <apk 
       data hash MD5: 32K
       2C F0 9C 67 EC E4 10 45 41 CC 57 67 29 90 17 09>)
(   4,<2005-04-25 08:40:00.74 +100>,<MAYBRIDGE\NMR>,<NMR_250MHZ>,
      <abs ABSG = 5 
       data hash MD5: 32K
       15 84 61 0F 5B 57 CF B4 32 D0 AD 7A BB 88 7D 04>)
$$ ##END=
$$ 
$$ hash MD5
$$ 84 FB 69 A1 AA F2 5C 3B E6 FD 3B 37 2E CE 22 11
##$RELAX= 
##$RELAX= 
##$RELAX= 
##$RELAX= 
##$RELAX= 
##$RELAX= 
##$RELAX= 
$$ Bruker specific parameters
$$ --------------------------
##$DU= <C:\u>
##$EXPNO= 2080
##$NAME= <ADRS>
##$PROCNO= 1
##$TYPE= <nmr>
##$USER= <dgb>
##$AMP= (0..31)
100 100 100 100 100 100 100 100 100 100 100 100 100 100 100 100 100 100 
100 100 100 100 100 100 100 100 100 100 100 100 100 100 
##$AQSEQ= 0
##$AQ_mod= 3
##$AUNM= <au_zg>
##$AUTOPOS= <2 >
##$BF1= 250.13
##$BF2= 250.13
##$BF3= 250.13
##$BF4= 250.13
##$BF5= 500.13
##$BF6= 500.13
##$BF7= 500.13
##$BF8= 500.13
##$BYTORDA= 1
##$CFDGTYP= 0
##$CFRGTYP= 5
##$CHEMSTR= <none>
##$CNST= (0..31)
1 1 145 1 1 1 1 1 1 1 1 1 1 1 1 1 1 1 1 1 1 1 1 1 1 1 1 1 1 1 1 1 
##$CPDPRG= <>
##$CPDPRG1= <>
##$CPDPRG2= <>
##$CPDPRG3= <>
##$CPDPRG4= <mlev>
##$CPDPRG5= <mlev>
##$CPDPRG6= <mlev>
##$CPDPRG7= <mlev>
##$CPDPRG8= <mlev>
##$CPDPRGB= <>
##$CPDPRGT= <>
##$D= (0..31)
0 1 0 0 0 0 0 0 0 0.06 0 0 0 0 0 0 0.0002 0 0 0 0 0 0 0 0 0 0 0 0 0 0 
0 
##$DATE= 1114414776
##$DBL= (0..7)
120 120 120 120 120 120 120 120 
##$DBP= (0..7)
150 150 150 150 150 150 150 150 
##$DBP07= 0
##$DBPNAM0= <>
##$DBPNAM1= <>
$$ [...]
##$SUBNAM7= <"">
##$SUBNAM8= <"">
##$SUBNAM9= <"">
##$SW= 20.6930455092707
##$SWIBOX= (0..15)
0 0 3 0 0 0 0 0 0 0 0 0 0 0 0 0 
##$SW_h= 5175.983436853
##$TD= 65536
##$TD0= 1
##$TE= 295.16
##$TE2= 300
##$TE3= 300
##$TEG= 300
##$TL= (0..7)
0 120 120 120 120 120 120 120 
##$TP= (0..7)
150 150 150 150 150 150 150 150 
##$TP07= 0
##$TPNAME0= <>
##$TPNAME1= <>
##$TPNAME2= <>
##$TPNAME3= <>
##$TPNAME4= <>
##$TPNAME5= <>
##$TPNAME6= <>
##$TPNAME7= <>
##$TPOAL= (0..7)
0.5 0.5 0.5 0.5 0.5 0.5 0.5 0.5 
##$TPOFFS= (0..7)
0 0 0 0 0 0 0 0 
##$TUNHIN= 0
##$TUNHOUT= 0
##$TUNXOUT= 0
##$USERA1= <user>
##$USERA2= <user>
##$USERA3= <user>
##$USERA4= <user>
##$USERA5= <user>
##$V9= 5
##$VALIST= <valist>
##$VCLIST= <CCCCCCCCCCCCCCC>
##$VD= 0
##$VDLIST= <DDDDDDDDDDDDDDD>
##$VPLIST= <PPPPPPPPPPPPPPP>
##$VTLIST= <TTTTTTTTTTTTTTT>
##$WBST= 1024
##$WBSW= 4
##$XGAIN= (0..3)
0 0 0 0 
##$XL= 0
##$YL= 0
##$YMAX_a= 434443
##$YMIN_a= -431069
##$ZGOPTNS= <>
##$ZL1= 120
##$ZL2= 120
##$ZL3= 120
##$ZL4= 120
##$ABSF1= 16.47136
##$ABSF2= -4.221813
##$ABSG= 5
##$ABSL= 3
##$ALPHA= 0
##$AQORDER= 0
##$ASSFAC= 0
##$ASSFACI= 0
##$ASSFACX= 0
##$ASSWID= 0
##$AUNMP= <proc_1d>
##$AZFE= 0.1
##$AZFW= 0.1
##$BCFW= 0
##$BC_mod= 0
##$BYTORDP= 0
##$COROFFS= 0
##$CY= 12.5
##$DATMOD= 1
##$DC= 0
##$DFILT= <>
##$DTYPP= 0
##$F1P= 14.0000005364418
##$F2P= -0.99999901652339
##$FCOR= 0.5
##$FTSIZE= 32768
##$FT_mod= 6
##$GAMMA= 0
##$GB= 0
##$INTBC= 1
##$INTSCL= 1
##$ISEN= 128
##$LB= 0.3
##$LEV0= 0
##$LPBIN= 0
##$MAXI= 10000
##$MC2= 0
##$MEAN= 0
##$ME_mod= 0
##$MI= 0
##$NCOEF= 0
##$NC_proc= -2
##$NLEV= 6
##$NOISF1= 0
##$NOISF2= 0
##$NSP= 0
##$NTH_PI= 0
##$NZP= 0
##$OFFSET= 16.47136
##$PC= 1
##$PHC0= -74.03476
##$PHC1= 5.465242
##$PH_mod= 1
##$PKNL= yes
##$PPARMOD= 0
##$PSCAL= 4
##$PSIGN= 0
##$REVERSE= no
##$SF= 250.130012664177
##$SI= 32768
##$SIGF1= 0
##$SIGF2= 0
##$SINO= 400
##$SIOLD= 32768
##$SREGLST= <1H.CDCl3>
##$SSB= 0
##$STSI= 32768
##$STSR= 0
##$SW_p= 5175.98343685301
##$SYMM= 0
##$S_DEV= 0
##$TDeff= 65536
##$TDoff= 0
##$TI= <Analysis number 999999
Compound Code 99
Book Reference 9
Project Code 9>
##$TILT= no
##$TM1= 0
##$TM2= 0
##$TOPLEV= 0
##$USERP1= <user>
##$USERP2= <user>
##$USERP3= <user>
##$USERP4= <user>
##$USERP5= <user>
##$WDW= 1
##$XDIM= 32768
##$YMAX_p= 317165579
##$YMIN_p= -93882
$$ End of Bruker specific parameters
$$ ---------------------------------
##NTUPLES= NMR SPECTRUM
##VAR_NAME=  FREQUENCY,     SPECTRUM/REAL,   SPECTRUM/IMAG
##SYMBOL=    X,             R,               I
##VAR_TYPE=  INDEPENDENT,   DEPENDENT,       DEPENDENT
##VAR_FORM=  AFFN,          ASDF,            ASDF
##VAR_DIM=   32768,         32768,           32768
##UNITS=     HZ,            ARBITRARY UNITS, ARBITRARY UNITS
##FACTOR=    0.157963299565203, 1,           1
##FIRST=     4119.98129853151, 0,            0
##LAST=      -1056.0021383215, 0,            0
##MIN=       -1056.0021383215, -93882,       0
##MAX=       4119.98129853151, 317165579,    0
$$ Real data points
##PAGE= N=1
##DATA TABLE= (X++(R..R)), XYDATA
$$ [...]
18880F9937j1023n33J3168J3565j217j0834n429j5212n026n257l932O657J484
18867D6348n332j0193M137J1174m604l323R53J063r449n956o406K0054J981j3444
18853B7003j8709r601L269l560p97J4503M487J3204O162Q232L97J071j3439j3433
18839A8789L308J0010k205k1983r68J1326p742O020O238j500L969O78J449O311
18825C3700O889Q79m288j195K0199J8034q697k375j1389k0024L691k223j2321
18812B0880L483J3248Q065r523j7180p03J8939Q491J313r531k930j560K611O119
18798D1722o808J0161j717l028Q174O32J065p930j888J6860L257j1247J482M948
18784E5683J0526j4193j119n782O7j1687k447J0536N205P061J4632J8375M775
$$ plain form
18880 69937 58914 58381 71549 85114 83897 73063 67634 52422 47396 42139 38207 44864 46348
18867 46348 41016 30823 34960 46134 41530 38207 39160 40223 30774 24818 18412 38466 40447 27003
18853 27003 8294 -1307 1962 -1598 -2395 12108 16595 29799 35961 44193 44590 45661 32222 18789
18839 18789 22097 32107 29902 7919 6951 18277 10535 16555 22793 21293 25262 25940 27389 33700
18825 33700 40589 41468 37180 35985 56184 74218 65521 63146 51757 31733 35424 33201 20880
18812 20880 24363 37611 45676 36153 18973 18270 37209 45700 47013 37482 34552 32992 35603 41722
18798 41722 34914 45075 43358 40330 48504 49136 50201 42271 40383 57243 60500 49253 50735 55683
18784 55683 66209 52016 50897 45115 45182 33495 31048 41584 46789 53850 68482 86857 91632
18771I1632K495K8437K1145J5533K892J1636j9177k0597n229k599q458n136J871
18758A14445J6472P091J5629J7801R985N773K298O552k4954p775J7158L071O605
18745A90151K701n67J2539l954q979k9837j8503n09K3557J3066Q68q150l052j989
18731A67342n269L192Q867j597n273P728K2206n048j1828r395j0204J0847P249
18718A78817J7456J0576R12N768J2582P940L780J469J504K487J2796J6304L766
18705B76157j7995K862R908k4j1388j0023q842j6497r11L452M46L997L500J2526
18691B47168N294N375J0877l821J1759J9824P591j1497j0579n171J738J9644Q432
18678C06634J2550J6416K8044J1740k543L1410K0681J1851K7982K3395K2831J5388
$$ plain form
18771 91632 94127 122564 143709 159242 162134 173770 154593 133996 128767 126168 117710 112574 114445
18758 114445 130917 138008 153637 171438 181423 187196 189494 196046 171092 163317 180475 183546 190151
18745 190151 192852 192285 204824 200870 191891 162054 143551 143042 166599 179665 180533 172383 169331 167342
18731 167342 162073 165265 174132 172535 167262 174990 197196 192148 180320 170925 160721 171568 178817
18718 178817 196273 206849 207761 213529 226111 234051 237831 239300 240804 243291 256087 272391 276157
18705 276157 258162 261024 270932 270908 259520 249497 240655 224158 223247 226699 227145 231142 234642 247168
18691 247168 252462 257837 268714 264893 276652 296476 304067 292570 281991 276820 278558 298202 306634
18678 306634 319184 335600 363644 375384 372841 404251 424932 436783 464765 488160 510991 526379
18666E26379J6335K7743L0802L8196M6579M5695O3010P9726J13834J18298J19703
18655A226300J25346J16506J07807J08525J16438J13208J31746J51827J87832
18646B385535K20483K44495K54292K78593L35821M37257N96732Q22086J107962
18637F683256J525346K144611K995485M053801N249888O361028O961073O761732
18629D2736220N723786L931519K113869Q51340M98693J065646J910835K357583
18621F1189491J809473N6011k405123m835165o644555p255543o978483n989483
18613B8946623m743605l649494k843212k300638j930331j672300j448901j237744
18605I120398j055163r00936p78602o54993n79025m90556m10484l42044l12130
$$ plain form
18666 526379 542714 570457 601259 639455 686034 731729 794739 874465 988299 1106597 1226300
18655 1226300 1351646 1468152 1575959 1684484 1800922 1914130 2045876 2197703 2385535
18646 2385535 2606018 2850513 3104805 3383398 3719219 4156476 4753208 5575294 6683256
18637 6683256 8208602 10353213 13348698 17402499 22652387 29013415 35974488 42736220
18629 42736220 48460006 52391525 54505394 55356734 55855427 56921073 58831908 61189491
18621 61189491 62998964 63054975 60649852 55814687 49170132 41914589 34936106 28946623
18613 28946623 24203018 20553524 17710312 15409674 13479343 11807043 10358142 9120398
18605 9120398 8065235 7164299 6385697 5730704 5151679 4661123 4250639 3908595 3596465
18596C596465k54743k25023k12552k11947j96280j73528j76605j64324j50127
18587A831336j40847j12380j04113q8806o0003p3135n5270m5533n9631l7503j6464
18576A037651l2822l2073k0029p807j8215n661j5137j5892l259R937M119M034
18564I04846l3K1935J4414J3711K8448J9988Q686K6699K7819J2313K9181K2357
18552A130364M3885O0081M9435M9515Q3193P2699Q5095P7588R1875Q6002R1834
18541A921566R7359R8563J05365J21262J28614J45911J42745J50240J46195J76889
18531C234709K07908K22967K65944L04348L55029M25169N20856N90740P09557
18522F837227Q50076J031507J270690J545952J861612K251264K669204L095951
$$ plain form
18596 3596465 3341722 3116699 2904147 2692200 2495920 2322392 2145787 1981463 1831336
18587 1831336 1690489 1578109 1473996 1385190 1325187 1252052 1196782 1151249 1091618 1054115 1037651
18576 1037651 1004829 972756 952727 944920 926705 921044 905907 890015 886756 896693 900812 904846
18564 904846 904813 926748 941162 954873 983321 1003309 1011995 1038694 1066513 1078826 1108007 1130364
18552 1130364 1174249 1234330 1283765 1333280 1416473 1489172 1574267 1651855 1743730 1829732 1921566
18541 1921566 2018925 2117488 2222853 2344115 2472729 2618640 2761385 2911625 3057820 3234709
18531 3234709 3442617 3665584 3931528 4235876 4590905 5016074 5536930 6127670 6837227
18522 6837227 7687303 8718810 9989500 11535452 13397064 15648328 18317532 21413483
18514B1413483L497128L770053L850113L679864L310730K772869K109975J466300
18506D5870515R02058M46801J19241k08026o28983j122495j668054k275488k822449
18497C8613120l185130l354367l311322l126084k843154k544912k233789j949760
18489A6064602j701167j510370j327745j181880j019505r01509p90694o97745
18481F933987o04278n26253m62220m02506l66798l22576k77369k52351k31499
18472C488137k22454k18714j90470j51080j54463j56460j38928j29837j31226
18463A994505j39576j22578j12731j09204r1233o2517p2693p7383o1274m4014
18453A101302m8013m8956l5396n2250m2325k2542k1665k9499k8481k0778j6470
$$ plain form
18514 21413483 24910611 28680664 32530777 36210641 39521371 42294240 44404215 45870515
18506 45870515 46772573 47219374 47338615 47130589 46501606 45379111 43711057 41435569 38613120
18497 38613120 35427990 32073623 28762301 25636217 22793063 20248151 18014362 16064602
18489 16064602 14363435 12853065 11525320 10343440 9323935 8422426 7631732 6933987
18481 6933987 6329709 5803456 5341236 4938730 4571932 4249356 3971987 3719636 3488137
18472 3488137 3265683 3046969 2856499 2705419 2550956 2394496 2255568 2125731 1994505
18463 1994505 1854929 1732351 1619620 1510416 1419183 1356666 1283973 1206590 1145316 1101302
18453 1101302 1053289 1004333 968937 916687 874362 851820 830155 800656 772175 751397 734927
18442G34927k5252j4742l0703l2491m1923r301q32j5820k5695k6767j8785k912
18430D89704j534j2823j0111j7276j6437m859j1513j726n876k6017j7169k1053
18418C43310j3908J541p040k7050j3320N586L126q751l781p531r491R93q301J1990
18404B67373O847J215j5593j1685j5409j7192q239p56K2575N805k533j4832j7055
18391B00521j2055R424P291R48l203r260P519N970N835O139j201j296j0991r811
18377A95830j2160p491Q642J3219l396o800N547N751N560R327j0763J2354M990
18364B20610m926n845j0787j7904M036r51m371R581m872o9m526p489j2305M046
18350A64228Q180j1244j633p474n387K709J094L878J3954J053j3018k8195j8406
$$ plain form
18442 734927 709675 694933 664230 631739 589816 580515 579683 563863 538168 511401 492616 489704
18430 489704 488170 475347 465236 447960 431523 426664 415151 413425 407549 381532 364363 343310
18418 343310 329402 330943 323903 296853 283533 289119 292245 283494 279713 272182 262691 263684 255383 267373
18404 267373 274220 275435 259842 248157 232748 215556 207317 206561 229136 234941 232408 217576 200521
18391 200521 188466 197890 205181 206129 202926 193666 201185 207155 212990 219129 217928 216632 205641 195830
18377 195830 183670 176179 184821 198040 194644 187844 193391 199142 204702 214029 203266 215620 220610
18364 220610 215684 209839 199052 181148 185184 184233 179862 189443 184571 184502 179976 172487 160182 164228
18350 164228 172408 161164 159531 152057 146670 149379 150473 154351 168305 169358 156340 128145 109739
18337A09739J3012j3052q573j365J9319p94o371L076j0826j9264o463J2878Q809
18324A00125L373j567n83j725p896n014j2038P011q30J007P283L156N19P951p44
18309A00028j3159l153L000p998p864p028j797M193P875J1819m855o994q248K760
18295F8579J4271J230N797j1556j1934L904M279N45J5325M780J591o160J769M741
18281I7161n876p696j0962j3511p397J830N236P490L757J2064q47l006r125O079
18267G5197K807r579j3839m610o77J2300J6646J863N605J0285R001m148j5486
18254H5365n175J662M945J2831M622q551q40m824n842k604L321k2149L615N033
18240G1409O118L264k793q18j6365L256K427r385o097n518j0180J4373O641Q390
$$ plain form
18337 109739 122751 109699 101126 99761 119080 118286 111915 114991 104165 84901 78438 91316 100125
18324 100125 103498 101931 101348 99623 91727 86713 74675 81686 80856 81863 89146 92302 92821 100772 100028
18309 100028 86869 83716 86716 78718 70854 63826 62029 66222 74097 85916 81061 74067 65819 68579
18295 68579 82850 84080 89877 78321 66387 70291 74570 75115 90440 95220 96811 90651 92420 97161
18281 97161 91285 83589 72627 59116 51719 53549 58785 66275 70032 82096 81249 78243 69118 75197
18267 75197 78004 68425 54586 49976 49299 61599 78245 80108 85713 95998 104999 100851 85365
18254 85365 80190 81852 86797 99628 104250 95699 94859 90035 84193 81589 84910 62761 66376 71409
18240 71409 77527 80791 77998 77180 60815 64071 66498 57113 51016 45498 35318 49691 56332 64722
18226F4722J2457J2534N416j6044j4624o447j043o905j387O70M188M653N125o309
18212E7006o033P046O671n322j214o65j1896q231k32p131K01J0300M629j818l197
18197D0114N759Q256k811n373J976l582O758N347K838K214J952l680j4482k508
18183D2778k807j8464k852J659L228P063R846L801K865L630m396J865M283L183
18169E5682L213l069N666m316L607J7453J680K9K447M157r332J1377P475j3566
18155H2503O468k030l766j438J2819N454J1290M411l763p721q987L901J7159J7102
18141A33402J1367l459l278J388J868Q035J7596R35K6443L5711J3273J3115J8714
18128B75110J6001L9068N9373N8343N7794P4116Q3106J05337J37809J95755K96800
$$ plain form
18226 64722 77179 89713 95129 79085 64461 58014 56971 50066 48679 49349 53537 58190 63315 57006
18212 57006 50973 58019 64690 59368 58154 57489 45593 37362 37130 29999 30200 40500 45129 43311 40114
18197 40114 45873 54129 51318 45945 47921 44339 51097 56444 59282 61496 63448 59768 45286 42778
18183 42778 39971 21507 18655 20314 23542 30605 40451 44252 47117 50747 46351 48216 52499 55682
18169 55682 58895 55826 61492 57176 60783 78236 79916 79945 82392 86549 77217 88594 96069 82503
18155 82503 88971 86941 83175 81737 94556 100010 111300 115711 111948 104227 95240 99141 116300 133402
18141 133402 144769 141310 138032 139420 141288 149323 166919 167854 194297 230008 243281 256396 275110
18128 275110 291111 330179 389552 447895 505689 579805 662911 768248 906057 1101812 1398612
18117A398612M42219O48473R49276J424465K213151L412267M749486M653528J799464
18108B1690941o85498k112751m487617m209019k575731j529254r19694n57659
18100D613718m39635n37859n23805m58280m07722l41694k94583k27482j73166
18091A209492j64012j26949j19643j02946p5161o1549o4063n6512m8997n3756
18081C35904m3194l9359k8474j4211q662P068j5098j6920j8893k0340k1423N089
18069A21487J872n857p571M584o258p731k439L59j6819r630n6Q275l98q289m944
18054F6585l237k899L344J1411p83K434Q463r144k8227O19J1383Q920J0929q876
18040G0922j5077j3283R962P388k064J1962Q176j545k5818j1539m42J9336K4053
$$ plain form
18117 1398612 1840831 2489304 3438580 4863045 7076196 10488463 15237949 19891477 21690941
18108 21690941 21005443 18892692 14405075 10196056 7620325 6091071 5171377 4613718
18100 4613718 4174083 3636224 3112419 2654139 2246417 1904723 1610140 1382658 1209492
18091 1209492 1045480 918531 798888 695942 620781 559232 495169 438657 389660 335904
18081 335904 292710 253351 224877 210666 202004 209072 193974 177054 158161 137821 116398 121487
18069 121487 123359 117502 109931 114515 108257 100526 98087 98446 81627 71997 71941 80216 79818 71529 66585
18054 66585 63348 60449 63793 75204 74421 76855 85318 76174 47947 48566 59949 68869 79798 70922
18040 70922 55845 42562 52524 59912 57848 69810 77986 76441 50623 39084 38642 57978 82031
18027H2031J9263J4016P525K491L0141L7738L7096L9713L7092K1782J1445J0122
18015C50455j0961j144N346J819O662j4541q230p013l8614l8345n4886l3930l1276
18002A25342k4480j4437M922R65j4397k5949j051O704K738p80p656j2746j626
17989C7549K735K985q901j0665j0427Q652J2591k180n159r788p23j0026Q86N034
17975A2563M037O458O73l741q368q006L607k679o020N877j30Q892K1762K096k2350
17960A4671j6664J3981L334q162K2197K0868k873r541j2981l252j2719L749R996
17947B2604m904o942j1702j6117R455P873J2037q745r969K890L886p215O526L377
17933C054L463J1990J640r529q822J2439l924q1P592O295L229M221j4212l856
$$ plain form
18027 82031 101294 115310 122835 125326 155467 193205 230301 270014 307106 328888 340333 350455
18015 350455 339494 338350 343696 345515 352177 337636 329406 322393 283779 245434 190548 156618 125342
18002 125342 100862 86425 91347 92312 77915 51966 50915 57619 60357 59577 51921 39175 37549
17989 37549 40284 43269 34368 23703 13276 21928 34519 32339 27180 17392 16669 6643 7529 12563
17975 12563 16600 23058 23731 19990 11622 3616 7223 4544 -1476 4401 4271 13163 34925 37021 14671
17960 14671 -1993 11988 15322 7160 29357 50225 47352 37811 24830 21578 8859 12608 22604
17947 22604 17700 10758 -944 -17061 -7606 267 12304 3559 -6410 -3520 366 -6849 -323 3054
17933 3054 6517 18507 20147 10618 1796 14235 10311 10230 17822 24117 27346 31567 17355 13499
17919A3499o935L728J7424m432n701K167K533J90j407j1350J741m088q239m254
17905e124L631Q665o120j1543J787L489J3520K487J3993n6k950N78j7104p998
17891b745j3954L509N63N690R472O294K554j102k818K355m330Q360j919n662N622
17876A1889P161r756N470J8397M61j069j974p355p703o507P94K919j0823r036
17862g132J3498K2537J6126K794K195L61q645J025N694M784K386J0363J6749J8681
17848A01416L848J6730J6531L2652L5670K0351K0800J8820O92j3474R509R693
17836B73238o117m094M934k5782l4236j3625j3890j5457j1163j4359k696K24k0233
17823A16744j4350j7851q439j2998o568j20n256k255R380l927j8078j0198o493
$$ plain form
17919 13499 6564 10292 27716 23284 17583 19750 22283 22473 21066 9716 11457 7369 -870 -5124
17905 -5124 -1493 7172 1052 -10491 -8704 -5215 8305 10792 24785 24729 21779 22357 5253 -2745
17891 -2745 -16699 -13190 -12627 -6937 2535 8829 11383 10281 7463 9818 5488 13848 11929 6267 11889
17876 11889 19050 9294 14764 33161 33622 32553 30579 23224 15521 9014 9808 12727 1904 -7132
17862 -7132 6366 28903 45029 47823 50018 50379 41734 42759 48453 53237 55623 65986 82735 101416
17848 101416 105264 121994 138525 171177 206847 227198 247998 266818 267510 254036 263545 273238
17836 273238 267121 263027 267961 242179 207943 194318 180428 164971 153808 139449 136753 136977 116744
17823 116744 102394 84543 76104 63106 56538 56418 51162 48907 58287 54360 36282 26084 19591
17810A9591n764m884k221N206K6636o89p136m228L837q958j760N645K881J935
17796C0091l811L499m078o544j4396J9917O142o502j4458n601j4202k0684O085
17783b4542J3684P538P375P144m989J533L179n170J4522K1994Q465j5249j0299
17770B5185p3j2519r156Q53J875N135K721j0620o050J2354J1303j2156p997J0539
17756A1394K096p765q92o446n829P608q9j1103l332J0115J0506O574j3192j0395
17742a0750J1163m742k758j2196J4852K6628R436j8004k0794q107J0442j661J400
17729e091k765K381k955k360J7497J7589l960k2059m783K2539Q614O10n304j2551
17715G402J2686P640L03o740K703K845j9579j3331J1602M18n274M469J5683Q786
$$ plain form
17810 19591 13827 8943 6722 11928 38564 37875 30739 26511 30348 21390 19630 25275 28156 30091
17796 30091 26280 29779 25701 19157 4761 24678 30820 24318 9860 4259 -9943 -30627 -24542
17783 -24542 -10858 -3320 4055 11199 6210 7743 10922 5752 20274 42268 50733 35484 25185
17770 25185 25112 12593 3437 4290 6165 11300 14021 3401 -2649 9705 21008 8852 855 11394
17756 11394 13490 5725 4833 -1613 -7442 166 77 -11026 -14358 -4243 6263 12837 -355 -10750
17742 -10750 413 -4329 -7087 -19283 -4431 22197 31633 13629 -7165 -15272 -4830 -6491 -5091
17729 -5091 -7856 -5475 -8430 -10790 6707 24296 20336 -1723 -6506 16033 24647 25257 19953 7402
17715 7402 20088 27728 28031 21291 23994 26839 7260 -6071 5531 5949 675 5144 20827 29613
17701B9613M948r836N335r3N885J848O076k481l185k0468j64M438L370J1349M669
17686D1304j5961j7148O205J3994K28J4278j619j1557p326J491O241j989q631
17673A9510n01k293n7M028N691p13L98M537k815l701k409L043Q129j1799p701
17658A3347p007k431R910l91j1654m122K017N110K6446p658j3363p426j1989N64
17644h647K570K424O875k138R348k943p212j6073q739K0561J1481j7682q082J1100
17630g157K840J520k534k429L46l608j622j637J682J3228M551O593j47O882O784
17615B5292l240j8854j4213m436n152M487N273k262J886J8198J0241L883r020
17602A2083j0334j192j757q287r52P166R245J0985M044j997j5854j0630K0789
$$ plain form
17701 29613 34561 24725 30060 29967 35852 37700 43776 41295 38110 17642 17478 21916 25286 36635 41304
17686 41304 25343 8195 14400 28394 28622 42900 41281 29724 22398 23889 30130 28141 19510
17673 19510 19009 16716 16659 20687 26378 25665 26063 30600 27785 24084 21675 24718 32847 21048 13347
17658 13347 6340 3909 13819 13428 1774 -2348 -331 4779 31225 23567 10204 2778 -9211 -8647
17644 -8647 -6077 -3653 3222 1084 10432 7489 277 -15796 -24535 -3974 7507 -10175 -18257 -7157
17630 -7157 -4317 -2797 -5331 -7760 -7414 -11022 -12644 -14281 -12599 629 5180 11773 11626 18508 25292
17615 25292 22052 3198 -11015 -15451 -20603 -16116 -10843 -13105 -11219 6979 17220 21103 12083
17602 12083 1749 557 -1200 -9487 -10439 -3273 5972 16957 21001 19004 3150 -7480 13309
17589A3309p468p029m29P644J0263l000q187j0158q15O634q350p59N637J0349
17575G641J631r45N61N510L754n93M165n465O597j128j9665k990J722N901K848
17560I544j0679p062N930O96j1409p267R024J0355K192J2533O355r029l604l396
17546D183J9805J7396k828r063j8164J9O796J967j3666j5600j1864O870J9487
17533E338J0174O280L508l777j1558J728q919q297q331J5799R30k016J391K379
17519D629m47J2216O217k915j1999j0577J746m220P059n976n507n478J087P119
17505g046R987j48p521j3152l201R877K0307K44m041j593N147N589L671p397N142
17490A5865J033p154J159n650r916p213K800n082m68o974j5330J5177J9476J2857
$$ plain form
17589 13309 5841 -1188 -1617 6027 16290 13290 5103 -5055 -5870 764 -7586 -8345 -2708 7641
17575 7641 9272 8327 8888 14398 18152 17559 21724 16259 22856 21728 2063 -927 795 6696 9544
17560 9544 -1135 -8197 -2267 -1571 -12980 -20247 -11223 -868 1324 13857 20212 11183 7579 4183
17546 4183 23988 41384 38556 29493 11329 11348 18144 20111 6445 -9155 -21019 -14149 5338
17533 5338 15512 21792 25300 21523 9965 11693 2774 -5523 -13854 1945 2875 859 2250 4629
17519 4629 4182 16398 22615 19700 7701 -2876 -1130 -5350 1709 -4267 -9774 -15252 -14165 -7046
17505 -7046 2941 2793 -4728 -17880 -21081 -11204 9103 9347 5306 3713 8860 14449 18120 10723 15865
17490 15865 16898 9744 10903 5253 -4663 -11876 -9076 -14158 -14626 -21600 -36930 -21753 -2277 10580
17476A0580o777j6787l905J2039K0137J3520l405r902j937O534j1729j6984L267
17463e349j984j4774p497J0613K114J6084K986n46m078k423K909R045P793l553
17449A1340m170k200J8879K1860K0979K0174J3031L100p111j4044j3278j4652
17437E3908j2271r779o096p579p251j0100o64n430J0382R464j3482K581k130O761
17423H314m575j2018r036N510O815k055o800J8119J1837K32j20o237O456K04j515
17408A5131j183r021j6961j7351Q324J2248L34q527j6694n226J901K2105O173
17395h747P202N306q444P102R952q128j8013n358r34p250K178O698M159j2623
17381b6900Q880m0j119J3939o40j548P490j569K3468N225J766j2883P699j8924
$$ plain form
17476 10580 3803 -12984 -16889 -4850 15287 28807 25402 15500 13563 20097 8368 -8616 -5349
17463 -5349 -7333 -22107 -29604 -18991 -16877 -793 2193 1647 -2431 -4854 -1945 7100 14893 11340
17449 11340 7170 4970 23849 45709 66688 86862 99893 102993 95882 81838 68560 53908
17437 53908 41637 31858 25762 18183 10932 832 168 -5262 5120 14584 1102 3683 1553 8314
17423 8314 3739 -8279 -17315 -11805 -4990 -7045 -13845 4274 16111 16343 16223 9986 16442 16646 15131
17408 15131 13948 4927 -12034 -29385 -21061 -8813 -8479 -17006 -33700 -38926 -37025 -14920 -8747
17395 -8747 -1545 3761 -4683 2419 12371 4243 -13770 -19128 -20062 -27312 -25134 -18436 -14277 -26900
17381 -26900 -18020 -18060 -19179 -5240 -5880 -7428 62 -1507 21961 27186 28952 16069 23768 4844
17367D844j8700J0372R454J1660Q181m707l1368r297m538R526K205o894J0060
17354i202J2596J6852j2866j7241P366K861j8564J546L311L588j114J5488j123
17341C498q540o839r255j1048Q57J6680L025m113K715j57N774J7102N145l481
17327A1363o80r604N479j0423j1233L113P604j3558l677J623m044q621L434M615
17313b4609l454M31J0J0601J0286J7219J7446p100r075o023k822j692n78Q37o423
17298d946j3030j1403K488K6597K2327j139j9997j0510J920N535m551J633l245
17285h321o988k1543q378n375K217J2784O553K401J678K0968J6615k1792r19K848
17271g252n085m168j1069O229j071L288o85Q575K221J656J0015R636R7N295L477
$$ plain form
17367 4844 -13856 -3484 5970 17630 25811 21104 -10264 -19561 -24099 -14573 -12368 -19262 -9202
17354 -9202 3394 20246 7380 -9861 -2495 366 -18198 -16652 -13341 -9753 -10867 4621 3498
17341 3498 -5042 -11881 -21136 -32184 -31327 -14647 -11622 -15735 -13020 -13177 -7403 9699 14844 11363
17327 11363 10683 1079 6558 -3865 -15098 -11985 -4381 -17939 -21616 -19993 -24037 -32658 -29224 -24609
17313 -24609 -28063 -27632 -27622 -17021 -6735 10484 27930 20830 11755 5732 2910 1218 640 1477 -4946
17298 -4946 -17976 -29379 -26891 -294 22033 20894 897 -9613 -7693 -2158 -6709 -5076 -8321
17285 -8321 -15309 -36852 -45230 -50605 -48388 -35604 -29051 -26650 -24972 -4004 12611 -9181 -10100 -7252
17271 -7252 -12337 -16505 -27574 -21345 -22416 -19128 -19813 -11238 -9017 -7361 2654 12290 12387 17682 21159
17256B1159N779p799j6128j3649M832J0721j3772M83O636l828o275l748P816m08
17242h181J894Q795o880j0617K863R566J507j9849J0470K36k289M162J5962J2005
17228A9644m563q311l709j020J727J0243O319p581j760j2468p275p833J2675q44
17214d756l722q071l634O497Q278J2675M448j928j7576j4705p728j140R407J3741
17200h214J8389K835m146O32K93M786L205n313p797k608J364J2539n666l064k249
17185D986k41k1645q531k967M527L754K4222J527k690q302R039R612k980j3163
17171b852j1925o81n138M451J5163j965r865P181J852M435J8287o009j0857j3389
17157a1312J716M544o801N46l52j993l71j7814l875n893K473Q424K0743J4184
$$ plain form
17256 21159 26938 19139 3011 -10638 -5806 4915 -8857 -8374 -1738 -5566 -11841 -15589 -7773 -8181
17242 -8181 -6287 2508 -4372 -14989 -12126 -2560 -1053 -20902 -10432 -10196 -12485 -8323 7639 19644
17228 19644 15081 6770 3061 2041 3768 14011 20330 12749 10989 -1479 -8754 -16587 -3912 -4756
17214 -4756 -8478 -16549 -20183 -13686 -5408 7267 11715 9787 -7789 -22494 -30222 -31362 -21955 -8214
17200 -8214 10175 13010 8864 9496 9789 14575 17780 12467 4670 2062 3426 15965 10299 7235 4986
17185 4986 4745 -16900 -25431 -28398 -23871 -20117 4105 5632 2942 -5360 3679 13291 10311 -2852
17171 -2852 -14777 -15458 -20596 -16145 -982 -2947 -12812 -5631 -3779 656 18943 12934 2077 -11312
17157 -11312 -9596 -5052 -11853 -11307 -11659 -13652 -14023 -31837 -35712 -41605 -39132 -30708 -9965 4219
17143D219k696m919k8j14J512p896L11J5151j3140j710Q995q668m960j6572j3194
17128d3709J1947J3233R591J4961j1144q80O090P83K625L179o977o757j500J3328
17114D770k039j2346P353J9605J604j5287M797r020J529L752P40n894n001R689
17100D252O668q389K727Q949J1030j8931q150R338q05N595j1895m668K883J8597
17086A7201M356n986m682l88o67P876p186j4162k803J9118k317j1681J839j6076
17072a5558l870q555j28j682K856J0995Q744J194M0j1840m699J8146J0795m9n083
17057A306p779m932K873K340K54p498J7525m52j2052J128P14O370k022l058L019
17042b264J372q634m956N963K403R009O718o149l082K527J122K030J4383q897
$$ plain form
17143 4219 1523 -3396 -3424 -3538 -2026 -9922 -9611 5540 -7600 -9310 -315 -8983 -13943 -30515 -43709
17128 -43709 -31762 -18529 -8938 6023 -5121 -6001 89 872 3497 6676 -301 -7058 -8558 4770
17114 4770 2731 -9615 -2262 17343 18947 3660 8457 -563 966 4718 5458 -436 -5437 4252
17100 4252 10920 2531 5258 14207 25237 6306 -1844 7494 6689 12284 389 -4279 -1396 17201
17086 17201 21557 15571 10889 10501 9834 17710 10524 -3638 -6441 12677 10360 -1321 518 -15558
17072 -15558 -19428 -27983 -28111 -29793 -26937 -15942 -7198 -6004 -5964 -17804 -22503 -4357 6438 6389 1306
17057 1306 -6473 -11405 -8532 -6192 -5938 -13436 4089 3637 -8415 -7287 -6573 -203 -2225 -5283 -2264
17042 -2264 -892 -9526 -14482 -8519 -6116 2893 9611 3462 380 2907 4029 6059 20442 11545
17028A1545k8722J0046r426o208Q614L814j2770J5514J6430J3303m256p615P061
17015A7330Q481r82j7291m521n257j2768O760J0097J475K1371K90k4608m897j2584
17001a7104J5659J4909r349l530J995j0654K469J108O270J6070j3016j5816k502
16988a3491J2022q03j1422l750o380j2930K255P023R467K38n497J035J6375R325
16974C467Q120j4745j420J1557O415J3384j206k0704m185j202j53j8005j5435
16961c4112o898K1556N969q660L269m095M082R290j0978k297J1721J4751M461
16948H059k662o421n862P414q023q149J586K341o201R409J072L492O281P15o77
16933B374M362p69j983p249m47j321J3842k848r843q454K772P958L405k987j0696
$$ plain form
17028 11545 -17177 -7131 -16557 -22765 -14151 -10337 -23107 -7593 8837 22140 17884 10269 17330
17015 17330 25811 24829 7538 3017 -2240 -15008 -8248 1849 3324 24695 24985 377 -4520 -17104
17001 -17104 -1445 13464 4115 585 2580 -8074 -5605 -4497 1773 17843 4827 -10989 -13491
16988 -13491 -1469 -2272 -13694 -17444 -23824 -36754 -34499 -27476 -18009 -17771 -23268 -22233 -5858 3467
16974 3467 11587 -3158 -4578 6979 13394 26778 25572 4868 683 -519 -672 -18677 -34112
16961 -34112 -41010 -19454 -13485 -22145 -18876 -22971 -18889 -9599 -20577 -22874 -11153 3598 8059
16948 8059 5397 -1024 -6886 528 -7495 -15644 -14058 -11717 -17918 -8509 -7437 -3945 2336 3051 2374
16933 2374 6736 5967 3984 -3265 -3712 -5033 8809 5961 -3882 -12336 -9564 -1606 1799 -1188 -11884
16918a1884n14O970p668O93J3590R076O426K696o338j0595j6530k5631J70J6456
16904b3083Q799M614N746K2919K177j802j2437o575l871r703N479k244j001k574
16890a3556m530k584J786M653J7591J3525k718k32k238j6921m916R477k241Q017
16876E113r71j7056O12K302J0089J0343q512L880K816q968O084k522j3944R877
16862h57M107j384M135k036j2343j0570m506m045R221r775p601J912J05P638J0558
16847a5441N853J332m591k751R022j2091p286P538R95L48J8958M05j341k402j7147
16832a8599O307K259j7197n581J3841J6315M998p465k581k085N550J2452r496
16819a282j1138r060K6817O203k4740l534L572L962n287N009Q027J510L875K893
$$ plain form
16918 -11884 -12398 -5428 -13096 -12403 1187 10263 16689 19385 13047 2452 -14078 -39709 -39539 -23083
16904 -23083 -14284 -9670 -3924 18995 21172 19370 6933 358 -3513 -13216 -7737 -9981 -10982 -13556
16890 -13556 -18086 -20670 -18884 -14231 3360 16885 14167 13935 11697 -5224 -10140 -663 -2904 5113
16876 5113 4142 -12914 -12302 -10000 89 10432 1920 5800 8616 -352 5732 3210 -10734 -857
16862 -857 3250 1866 6001 3965 -8378 -18948 -23454 -27499 -18278 -28053 -35654 -33742 -33637 -25999 -15441
16847 -15441 -9588 -8256 -12847 -15598 -6576 -18667 -25953 -18415 -17420 -17072 1886 2291 950 -1452 -18599
16832 -18599 -12292 -10033 -27230 -32811 -18970 -2655 2343 -5122 -7703 -9788 -4238 8214 -1282
16819 -1282 -12420 -21480 5337 11540 -13200 -16734 -13162 -9200 -14487 -9478 -1451 59 3934 6827
16805F827j3002k114J112N37N129J5436O018j4246o083N800j076l00R132o019
16791G151j477j645k03n335O311R989p388k8114j084Q071k0158l583J812M949
16777c0704R878Q905P10q946Q378J7550j0718j4344R797N768j8042j0568O417
16764b5919K733J4799q33k651J1659J118m618K285n757K125R380j369n616P074
16750D410M998m971o519j2892j368M317j3940r895m121J0159n29K222J4033m635
16736a8731N050J681M483m392n641O238k650J749J4455k880k849j3267r182J1541
16722a4395Q177n453J690R399N837M899m909J092p709J046M770k353p62j2014
16708a0685o601k208J7980K2126j0974j2644J967j1505q360N925N352J261m508
$$ plain form
16805 6827 -6175 -8289 -7177 -6640 -1511 13925 19943 5697 -386 5414 4338 4038 13170 7151
16791 7151 5674 4029 3826 -1509 4802 14791 7403 -20711 -21795 -13724 -33882 -37465 -35653 -30704
16777 -30704 -20826 -11921 -11211 -20157 -11779 5771 -4947 -19291 -9494 -3726 -21768 -32336 -25919
16764 -25919 -23186 -8387 -9220 -11871 -212 906 -3712 -1427 -7184 -5059 4321 2952 -2664 4410
16750 4410 9408 4437 -2082 -14974 -16342 -12025 -25965 -35860 -39981 -29822 -30351 -28129 -14096 -18731
16736 -18731 -13681 -12000 -7517 -11909 -17550 -11312 -13962 -12213 2242 -638 -3487 -16754 -25936 -14395
16722 -14395 -6218 -11671 -9981 -582 5255 10154 5245 6337 -1372 -326 4444 2091 1329 -10685
16708 -10685 -17286 -19494 -1514 20612 9638 -3006 -1039 -12544 -20904 -14979 -9627 -8366 -12874
16695a2874o60L916K002J084K020l565O968J1881o439k367l469n741l837J834
16681i247R56J1808l838o667J2045M243n929N614O921k682k679j4944k1007R840
16667a5566J8739N688k071j3421j0658Q752q574q299Q538p271q77J7582J580J0392
16653D534j1349M096P954q003o884l0p340N315J6761M415j2801j1057J2459P10
16639a220n824j7218N380R173P424Q695j2301M318O178o0j1406r14Q094K521K1208
16624B4048M233P088N443k5514p142o182p976k75j243k615p008J0934R408J1300
16610A4499k806k055R890k1798j2032j3520J202K2247j618j1623J383k060J837
16597a6454l060m807K421R95j843M539J1606N042q78J1761Q194O598J091l532
$$ plain form
16695 -12874 -13534 -9618 -7616 -6532 -4512 -8077 -1109 10772 4333 1966 -1503 -7244 -11081 -9247
16681 -9247 -8291 3517 -321 -6988 5057 9300 3371 8985 15906 13224 10545 -4399 -25406 -15566
16667 -15566 3173 8861 6790 -6631 -17289 -8537 -17111 -25410 -16872 -24143 -25020 -7438 -5858 4534
16653 4534 -6815 -2719 5235 -2768 -9652 -9682 -17022 -11707 5054 9469 -3332 -14389 -1930 -1220
16639 -1220 -7044 -24262 -18882 -9709 -2285 6410 -5891 -1573 4605 4545 -6861 -7775 319 2840 24048
16624 24048 28281 35369 40812 15298 8156 1974 -6002 -6277 -7520 -10135 -17143 -6209 3199 14499
16610 14499 11693 9638 19528 -2270 -14302 -27822 -26620 -4373 -5991 -17614 -16231 -18291 -16454
16597 -16454 -19514 -24321 -21900 -20905 -22748 -18209 -6603 -1561 -2439 9322 17516 24114 25205 21673
16583B1673j6942j4871r950R49P208N621K086P72M477O565k005J812L121l649
16569F867o11m489L79J901p651M387J1723J4781L459k2636q183J1833Q681p027
16555A3414k1149p059q86K217Q563R222m83J926R882j9430q706l073j435Q532
16541h465J8414M400Q563p152j6443m569m595p303M136K723J2943R626j3218q118
16527i058l582k747N173k038j040J5494M416o598k208K690N436r136p357O239
16513d316o546q551r84P485J4803j624k685K467m731J403Q02J829K850K148j906
16498B444j2781r253R890Q728R621q284Q097o186j0398M936j4068M221K9945R960
16484B6872j0488j0385J640M260J2468Q139L02j1511j3272j6834J343J903j289
$$ plain form
16583 21673 4731 -10140 -20090 -19141 -11933 -6312 -4226 -3454 1023 7588 5583 7395 10516 6867
16569 6867 6256 1767 2146 4047 -3604 783 12506 27287 30746 8110 -73 11760 20441 13414
16555 13414 -7735 -14794 -15680 -13463 -4900 4322 3839 5765 15647 -3783 -12489 -15562 -16997 -8465
16541 -8465 9949 14349 22912 15760 -683 -5252 -9847 -17150 -13014 -10291 2652 12278 -940 -9058
16527 -9058 -12640 -15387 -10214 -12252 -13292 2202 6618 20 -2188 502 5938 -3198 -10555 -4316
16513 -4316 -10862 -19413 -20397 -12912 1891 267 -2418 49 -4682 -3279 -2477 -648 2202 4350 2444
16498 2444 -10337 -19590 -9700 -972 8649 365 8462 2276 -8122 -3186 -17254 -13033 16912 26872
16484 26872 16384 5999 7639 11899 24367 32506 32808 21297 8025 -8809 -7466 -5563 -6852
16471f852l100J4973R523j7206P506P573L682p787j052O585J231M758r63q539
16457A0332j3271k006L84N670J255J377J1127Q435l774O560j1124L966L570r246
16443A3255j2313j0773N73N225p39j992p872O914k517o990M147o427K057J1651
16429e801J0104J4040p041k3852l633R335J6935Q67n307r114n906n546R639n764
16415a1044l274j7738r573J2979J5546O828n311l941J847J4627L993l547m02J286
16401B276r491o832P764J5528K486J7797L95j4404j5248j1309j600L128M866Q98
16387c746N910N293j0725j3684K7611J4139o001j0171p527J296R393n090m621
16374B077p862L706k457q870n220o397M11J2673P882J945o760J911O934n735k303
$$ plain form
16471 -6852 -9952 5021 14544 -2662 4844 12417 16099 8312 7260 13845 15076 19834 18871 10332
16457 10332 -2939 -4945 -4561 1109 2364 3741 14868 23303 19529 26089 14965 18931 22501 13255
16443 13255 942 -9831 -9258 -4033 -4772 -6764 -14636 -7722 -10239 -17229 -13082 -19509 -17452 -5801
16429 -5801 4303 18343 11302 -12550 -16183 -6848 10087 10954 5647 -3467 -9373 -14919 -5280 -11044
16415 -11044 -14318 -32056 -41629 -28650 -13104 -6276 -11587 -15528 -13681 946 4939 1392 990 2276
16401 2276 -7215 -14047 -6283 9245 11731 29528 29923 15519 271 -11038 -12638 -9510 -4644 -3746
16387 -3746 2164 7457 -3268 -16952 10659 24798 18797 8626 1099 2395 11788 6698 2077
16374 2077 -5785 -2079 -4536 -13406 -18626 -25023 -24612 -11939 -4057 -2112 -8872 -6961 -27 -5762 -8065
16359h065l2j2792L593J4231m918l269n17N900J2113J4494K80n678j3992M553
16345E901L995j5998J778L810K510K905m752l43K0472j0471j3692n964J0487K4274
16331B4912j1251Q73J2988J2328j5242p253M559k144p180j4259j2576l112k633
16318a9990l007J0638J0952j3827R314Q078j1058q950n281Q208J1957J3979N088
16305A6101m063k638r272J0536j5052j8914J278P514K0608J4819j2806j2723L298
16292a314j1841o122J7727m5n833p832J548J9294j3624k2713R808J0058J0470
16279d19J1783k675j0143n569RJ4812j122j6840L970K361K88m261j5388N614J6266
16264a314o552M582N936j2126l362j7634R34J2152o89N208J2063k996P854L662
$$ plain form
16359 -8065 -8097 -20889 -17296 -3065 -7983 -11252 -11769 -5869 6244 20738 21018 15340 1348 5901
16345 5901 9896 -6102 -4324 -514 1996 4901 149 -194 20278 9807 -3885 -9849 638 24912
16331 24912 13661 14534 27522 39850 24608 17355 21914 19770 12590 -1669 -14245 -17357 -19990
16318 -19990 -22997 -12359 -1407 -15234 -5920 2158 -8900 -17850 -23131 -14923 -2966 11013 16101
16305 16101 12038 9400 128 10664 -4388 -23302 -22024 -14510 6098 20917 8111 -4612 -1314
16292 -1314 -13155 -19277 -1550 -1595 -7428 -15260 -13712 5582 -8042 -30755 -20947 -10889 -419
16279 -419 11364 8689 -1454 -7023 -7014 7798 6676 -10164 -6194 -3833 -3545 -7806 -23194 -17580 -1314
16264 -1314 -7866 -3284 2652 -9474 -12836 -30470 -29536 -17384 -18073 -12865 -802 -3798 4056 7718
16250G718l057j3523M55J463o555o449J4923R640R043j1205p228l894p062j6968
16236c2699q179J3770K0443L442j678r130j7212j228K0350O867m007J417K754
16223e090l884j1291K802m966j326M378r961j9670o63J7095J3277J732q276l575
16209b9418M242O483N316k096J1167K905J4181o281j1971j0999r941l354J2384
16196a7382Q391J2374m928k227k630n18k62M641Q908r926L829J4848L897l292
16182A5723m454N960p679K676O103L651n642n538J904J086R112N56j5687l896
16168C875k501l945n375r370L674M399l62m718o392p917J6419N89j6544J589J3511
16153a3068P216N34m469J6182J3672j7035o061J326O130k461Q085k132j4916j6827
$$ plain form
16250 7718 4661 -8862 -8407 -6944 -13499 -19948 -5025 4615 13658 2453 -4775 -8669 -15731 -32699
16236 -32699 -40878 -27108 -6665 -3223 -4901 -14031 -31243 -32471 -12121 -5254 -9261 -7844 -5090
16223 -5090 -8974 -20265 -17463 -22429 -23755 -19377 -29338 -49008 -49671 -32576 -19299 -17567 -25843 -29418
16209 -29418 -25176 -18693 -13377 -15473 -4306 -1401 12780 6499 -5472 -16471 -26412 -29766 -17382
16196 -17382 -8991 3383 -1545 -3772 -6402 -6920 -7182 -2541 6367 -3559 270 15118 19015 15723
16182 15723 11269 17229 9550 12226 18329 21980 16338 10800 12704 13790 22902 23458 7771 3875
16168 3875 1374 -2571 -7946 -17316 -13642 -9243 -9605 -14323 -20715 -28632 -12213 -11624 -28168 -26579 -13068
16153 -13068 -5852 -5318 -9787 6395 20067 3032 -3029 -1703 4427 1966 10051 7919 -6997 -23824
16139b3824j0923r714J0278O839J0110k944k897L912J4820Q778n309q978K056
16126g796j3918k282O186M600J6310Q180o881j361R225P65j4080j924m51j2239
16112a5666J389K229K205k278N381R914j667m9N751j1458K458K7817j614j8271
16098F141j5592Q864J7746r465M032p798q817m923l5N549K510q968J0049K895
16084B188N324l644k2017l685L96j111o394J2643K2148K0643p924O215j4946k5861
16070a6025q078J6200N582r318n125l73J5846L317k550m043O659j0722N907p408
16056a0131o666K148j5275N584J536K358n579P67J3308J983R560j5108p79K925
16042a3369K012K411R049j3084j592m165k599M598P885J8265k290l885R973j538
$$ plain form
16139 -23824 -34747 -44461 -34183 -27344 -17234 -20178 -23075 -19163 -4343 4435 -874 -9852 -7796
16126 -7796 -21714 -23996 -17810 -13210 3100 11280 4399 3038 12263 13028 -1052 -2976 -3427 -15666
16112 -15666 -14277 -12048 -9843 -12121 -6740 3174 1507 1458 7209 -4249 -1791 26026 24412 6141
16098 6141 -9451 -587 17159 7694 11726 3928 -4889 -9812 -9847 -4298 -1788 -10756 -707 2188
16084 2188 7512 3868 -18149 -21834 -21438 -22549 -28943 -16300 5848 26491 18567 24782 9836 -16025
16070 -16025 -24103 -7903 -2321 -11639 -16764 -17137 -1291 2026 -524 -4567 2092 -8630 -2723 -10131
16056 -10131 -16797 -14649 -29924 -24340 -22804 -20446 -26025 -25258 -11950 -9967 -407 -15515 -16294 -13369
16042 -13369 -11357 -8946 103 -12981 -14573 -18738 -21337 -16739 -8854 9411 7121 3236 13209 11671
16028A1671p13k338j2711j0859R573J2930p345L48L533O70M932Q289j6668J533
16014B845N191l402N631q655q272N23R448K071j0390o757L622j114R103J4228
16000A4072P006m717O40n127l043J187n713o967m33m449k955O619R800l777K78
15985B421O027J595l388j2800N29J4820M365p627R535r442o843q96R551k534m059
15970A254j462J259p076l559o723K061n31O566l10p631k469J299J4374R833r549
15955b664k706J0507m548j2933J3701J3055j2840p848l942M332p199R769J6552
15942A3236R647k500j2632r457l988p278L97N372k773P932J0538j0118j140l868
15928f632L713k383J906j877P694m559L263N258m097p967O713j6625j2017J3037
$$ plain form
16028 11671 10958 8620 -4091 -14950 -5377 7553 208 556 4089 4759 9691 17980 1312 2845
16014 2845 8036 4634 10265 1610 -6662 -6139 3309 5380 -5010 -11767 -8145 -9259 -156 14072
16000 14072 21078 16361 17001 11874 8831 10018 4305 -2662 -3095 -7544 -10499 -3880 5920 2143 2421
15985 2421 8448 10043 6655 -6145 -5616 9204 13569 5942 15477 6035 -808 -1704 7847 5313 1254
15970 1254 -208 1051 -6025 -9584 -16307 -14246 -14777 -8211 -8521 -16152 -18621 -17322 -2948 6885 -2664
15955 -2664 -5370 5137 589 -12344 1357 14412 1572 -6276 -10218 -5886 -13085 -3316 13236
15942 13236 22883 20383 7751 -1706 -5694 -12972 -12575 -7203 -9976 -2044 8494 -1624 -2764 -6632
15928 -6632 -2919 -5302 -3396 -5273 2421 -2138 1125 6383 2286 -5681 1032 -15593 -27610 -14573
15914a4573M512J3856R920o991N041j2799q512R938O508q455k7850N716Q533L994
15900a1162M453k802m032J898J1884J0236o765L554j1347J61j6247j2776J3603
15887a9342K528P371J294p53O952M875p903j667J4880l589j1028k270r084l32
15873a8068K3407k565j3678n090O842p050J362n734K720J1058J3750L784j3453
15860b715l663L169J0057J602j0070j1301j441K52r653K545M458R566K272j0077
15846a4999J0829R87r19q70p797M130L100j89k932k478j3256o164k996J5341J6768
15831a445J1903L707o948l055j1036J179k154R718J1403j005K904j2528M496k4274
15817a7135m556Q741K659n339N843N643j3635O941k843K423P665n69p424J1538
$$ plain form
15914 -14573 -10061 3795 13715 6724 11765 -1034 -9546 392 6900 -1555 -29405 -23689 -15156 -11162
15900 -11162 -6709 -9511 -13543 -11645 239 10475 3710 7264 -4083 -3922 -20169 -32945 -19342
15887 -19342 -16814 -9443 -8149 -8902 -1950 2925 -4978 -6645 8235 4646 -6382 -8652 -17736 -18068
15873 -18068 5339 2774 -10904 -15994 -9152 -16202 -14840 -20574 -17854 -6796 6954 10738 -2715
15860 -2715 -6378 -3209 6848 8450 -1620 -12921 -14362 -14110 -23763 -21218 -16760 -7194 -4922 -14999
15846 -14999 -4170 -3183 -4102 -4972 -12769 -8639 -5539 -5728 -8660 -11138 -24394 -30558 -33554 -18213 -1445
15831 -1445 10458 14165 7217 4162 -6874 -5695 -7849 1869 13272 12267 15171 2643 7139 -17135
15817 -17135 -21691 -12950 -10291 -15630 -9787 -4144 -17779 -10838 -13681 -11258 -3593 -4162 -11586 -48
15803d8N031p273n796J963J3198J4978m172m040j6620p35J232r175o827Q214J1931
15788A861r044J567J0500j375P431J38q563o154L406Q053r791p463J1619K597
15774D782n449k695L478j626n82j0778j3085M6L506J4489l05p067q329J283j3711
15759c6043O20J9664J5238j734N020J0260j3650Q278k620o763n601k449R373o610
15745g017j1692m191L207K881L717k469j4920K396J5504J8073N480j1105j0394
15732a0530r011o313R038O610J1112j021n752q320J4943N340j7049j4799J6510
15719i242J2029J3722k111j1929p994J132j7336m391l809l648R07L679m317q864
15705d2172J2407J6473k312J0477R129Q509j1603j7433Q474k35o790O513q935
$$ plain form
15803 -48 4983 -2290 -8086 -6123 7075 22053 17881 13841 -2779 -3514 -2282 -11457 -18284 -10070 1861
15788 1861 -7183 -5616 4884 3509 10940 11078 2515 -3639 -233 7820 -1971 -9434 2185 4782
15774 4782 -667 -3362 116 -1510 -2092 -12870 -25955 -25909 -22403 -7914 -8219 -15286 -23615 -22332 -36043
15759 -36043 -35423 -15759 -521 -2255 2765 13025 -625 7653 5033 -1730 -7331 -9780 -407 -7017
15745 -7017 -18709 -22900 -19693 -16812 -13095 -15564 -30484 -28088 -12584 5489 10969 -136 -10530
15732 -10530 -19541 -25854 -16816 -10206 906 -115 -5867 -14187 756 6096 -10953 -25752 -9242
15719 -9242 2787 16509 14398 2469 -5525 -4393 -21729 -26120 -29929 -33577 -32670 -28991 -33308 -42172
15705 -42172 -29765 -13292 -15604 -5127 4002 12511 908 -16525 -8051 -8286 -15076 -8563 -17498
15692a7498P758K2493p96N198p037p65J044j3745j3610M325J8926L501J5448K249
15678B7491L660l309k5002j7172k519j1174J2378J692j5541m030J7437R574l478
15665i993j199R667k499j002j484O797J0140q258q328m372m105J163J3425m494
15651d542m772l813l218L37P226P469j39l620r409j7920q669J4804L437J1461
15637a1368K2258J8741R251p231j6234m152j0531n694J7662j019j5537r518j6323
15624b9695m593N118Q223o825m91J0289J0561J8183J433j4493q498K242J413J0920
15610C787Q174k012m236j1807k431l840n300O989J3413m792j7639k68L843j473
15596a7592J2979N240L145l532j4623Q045J4172N367j0642m616J3986o548n494
$$ plain form
15692 -17498 -9740 12753 11957 17155 10118 9353 10397 -3348 -16958 -12633 6293 9794 25242 27491
15678 27491 31151 27842 2840 -14332 -16851 -28025 -15647 -13955 -29496 -33526 -16089 -6515 -9993
15665 -9993 -11192 -1525 -4024 -5026 -6510 287 10427 2169 -6159 -10531 -14636 -13473 -48 -4542
15651 -4542 -9314 -13127 -16345 -16008 -8782 -1313 -1452 -5072 -14481 -32401 -41070 -26266 -22829 -11368
15637 -11368 10890 29631 38882 31651 15417 11265 734 -4960 12702 11683 -3854 -13372 -29695
15624 -29695 -34288 -29170 -20947 -27772 -28263 -17974 -7413 10770 12203 -2290 -10788 -8546 -7133 3787
15610 3787 11961 9949 5713 -6094 -8525 -12365 -17665 -10676 2737 -2055 -19694 -19962 -16119 -17592
15596 -17592 -4613 627 3772 240 -14383 -6338 7834 13201 2559 -2057 11929 5381 -113
15583a13r55N789L636j3320p759O039J0726J699k303j2312J4201J4465R841q802
15569B0832o215j7753j2449J4828J0358n824n132J036j512j0885L349q469n720
15556b3556j457J0951P598L643J4609k702R824P48k748j3992j1237l02j584J1535
15542A330l339l80p857k246l668p166K932M047k641L157J5096J1365q818j2477
15528a0665j769O089M662o27j340k167j554o557k969j1777P022J1271O475K84
15514c622j0768j1239J1274K456j4711l758l47J257J975K2981O935l007Q309R501
15500A7236J5961k376j1913k779r022r554j255K2055j414K076O22q600k1562j0514
15486b1039Q110K2905M802j0245j7130q665R164J3332Q263o785j6620j4184j801
$$ plain form
15583 -113 -1068 4721 8357 -4963 -12722 -6683 4043 5742 3439 -8873 5328 19793 29634 20832
15569 20832 14617 -3136 -15585 -757 9601 3777 -1355 -319 -1831 -12716 -9367 -17836 -23556
15556 -23556 -25013 -14062 -6464 -2821 11788 9086 18910 19658 16910 2918 -8319 -8621 -10205 1330
15542 1330 -2009 -2389 -10246 -12492 -16160 -23326 -20394 -16347 -18988 -15831 -735 10630 1812 -10665
15528 -10665 -12434 -6345 -1683 -2310 -3650 -5817 -7371 -13928 -16897 -28674 -21652 -10381 -3906 -3622
15514 -3622 -14390 -25629 -14355 -11899 -26610 -30368 -30715 -29458 -27483 -4502 2433 -574 7735 17236
15500 17236 33197 30821 18908 16129 7107 -2447 -3702 18353 16939 19015 19637 11037 -10525 -21039
15486 -21039 -12929 9976 14778 4533 -12597 -21262 -12098 1234 9497 2712 -13908 -28092 -29893
15473b9893J318J1254N857n012M36k434P022P645L215m853J5171q717j1116j1364
15459b1471J62M326J6525k16J1796N126m447p443q177p677j5487P560o389n14
15445b6326J3022K314n973J4374J3007m334j2530l567N929M453j9218J142J2282
15432e425q737J519K2616q819j1464r453r366J0603m371n44k54N049J1360r881
15418a7167J1520Q952p258p515j3698N159J7756n371J053Q615m633r065N035r822
15404a6439j0654J1552R388M167M247k748p563J255K173k438j048p18Q115J4816
15390A4105R11j065L948J1372J3094p651j0180j227j8082k389J124o882M740J4850
15376A6668L623o696m63j1020j3267m215J3293N680n050p197q232j633N418K825
$$ plain form
15473 -29893 -28575 -17321 -11464 -16476 -16040 -18474 -11452 -3807 -592 -5445 9726 1009 -10107 -21471
15459 -21471 -21309 -16983 -458 -674 11122 16248 11801 4358 -3819 -11496 -26983 -19423 -25812 -26326
15445 -26326 -13304 -10990 -16963 -2589 10418 6084 -6446 -10013 -4084 369 -18849 -17707 -5425
15432 -5425 -14162 -12643 9973 1154 -10310 -19763 -29129 -18526 -22897 -23441 -23695 -18646 -7286 -17167
15418 -17167 -5647 3305 -3953 -11468 -25166 -20007 -2251 -7622 -6569 2046 -2587 -11652 -6617 -16439
15404 -16439 -27093 -15541 -6153 -1986 2261 -487 -8050 -6795 -4622 -7060 -8108 -8826 -711 14105
15390 14105 15016 13951 17899 29271 42365 34714 24534 23307 5225 2836 3960 -2922 1818 16668
15376 16668 20291 13595 13132 2112 -11155 -15370 -2077 3603 -1447 -8644 -16876 -18509 -13091 -10266
15362a0266Q322M588j4593n254q801J772J0801J428P686L379m627m709J254k431
15348a1451j0269L126K452k833O425J642K144L458J053P878j4964k0057O39J2386
15334a8371R27N590J1780J5872N889p7N288K330j6625k657l693J35j161N364m306
15319F285p117o613k554J2084J4511K055j1107n311j0312j335J0042l326k368
15306e066m967j4716q458Q928J0443o569m840N098J8017M837k049L532n491j2331
15292a3632L566J5031k119l845k0373n394J3559l737K775m059l014K604R801J6004
15278G167p767Q353J0993j0610j7956m855K524J6788J2884k947N509j4692j7173
15265a1782m697K510K1189J4584r76k952m320J100J1298M035p112l602M096o743
$$ plain form
15362 -10266 -1944 2644 -11949 -17203 -26004 -24232 -13431 -12003 -4317 -938 -5565 -10274 -9020 -11451
15348 -11451 -21720 -18594 -16142 -18975 -12550 -10908 -8764 -5306 -4253 3625 -11339 -31396 -30757 -18371
15334 -18371 -17444 -11854 -74 15798 21687 21610 26898 29228 12603 9946 6253 6388 5227 10591 6285
15319 6285 -832 -7445 -9999 2085 16596 18651 7544 2233 -8079 -9414 628 -2698 -5066
15306 -5066 -10033 -24749 -33207 -24279 -13836 -20405 -25245 -20147 -2130 2707 658 4190 -1301 -13632
15292 -13632 -10066 4965 2846 -999 -21372 -26766 -13207 -16944 -14169 -18228 -21242 -18638 -8837 7167
15278 7167 -600 7753 18746 8136 -9820 -14675 -12151 4637 17521 14574 20083 5391 -11782
15265 -11782 -16479 -13969 7220 21804 20828 17876 13556 14656 25954 29989 22877 19275 23371 16628
15251A6628j3287k4034J5941O136j297o949j1731L7K4428j045q592j7796p859
15238b9420L236J1201O328P623k320K667M13M832p206q346L776J0896o483j6527
15224a9330m367J1830J8245M208j7520r043K105P053P786o125j1251j481R067
15211h823o131j49o01L558J772j7009j0696L759j912K1989K3560J260p428R54
15197D103n383n984N108p558j9811q422N025M725J1507J7127Q832r427n072j246
15183f476q78p459j546J9656J1985K502n887J574O806m353j5480m151l392M928
15169b171M665N465K56N48K005o836n478j0138p678L922N656J9144J8180m561
15155B2979j1623k43n711o057l679N93J3100J8471l491j5481Q183O176L015j3723
$$ plain form
15251 16628 3341 -20693 -4752 1384 87 -6862 -18593 -18556 5872 4827 -3765 -21561 -29420
15238 -29420 -26184 -14983 -8655 -1032 -3352 -685 -272 4560 -2646 -10992 -7216 3680 -2803 -19330
15224 -19330 -23697 -11867 6378 10586 -6934 -15977 -13872 -6819 967 -5158 -16409 -17890 -8823
15211 -8823 -14954 -15103 -15704 -12146 -10374 -27383 -38079 -34320 -36232 -14243 9317 10577 3149 4103
15197 4103 -1280 -7264 -2156 -9714 -29525 -37947 -32922 -28197 -16690 437 9269 -158 -5230 -6476
15183 -6476 -7354 -14813 -16359 3297 15282 17784 11897 13471 20277 15924 444 -3707 -7099 -2171
15169 -2171 2494 7959 8215 8763 10768 3932 -1546 -11684 -19362 -15440 -9784 9360 27540 22979
15155 22979 11356 11113 5402 -655 -4334 -3741 9359 27830 24339 8858 17041 23217 26232 12509
15141A2509q620m151j0866N207K2164M917r876p859j2249L427j2172j9671K6122
15128a1118J9553j1387j3449r406M711P314Q069J4183J053q100j0095m562K0358
15115G124O372K656l88o085q922n253j881j154j891J1790O802K293j1811j4581
15101a4929N128o338K039n13N280K296J514j0540j0390L525L430r90J216J3134
15087f138J5046j2769j5210J892n409M110J8594J4131o23j1398j3436m952l14
15074a6476r826o957J6719J0610L449q651k160J2268M234o45j3295o162J989N108
15060i795N030n777m330k764m97j0134J7484J6463J348L576m827p037O988n180
15046E48n098R87R543P746m881n490k645J364O300Q756O654l372m717J567j4293
$$ plain form
15141 12509 3889 -262 -11128 -5921 16243 21160 11284 3425 -8824 -5397 -17569 -37240 -11118
15128 -11118 8435 -2952 -16401 -25807 -21096 -13782 -5713 8470 9523 1423 -8672 -13234 7124
15115 7124 13496 16152 15764 9679 757 -4496 -6377 -7531 -9422 2368 9170 11463 -348 -14929
15101 -14929 -9801 -16139 -14100 -14613 -9333 -7037 -5523 -16063 -26453 -22928 -19498 -20488 -19272 -6138
15087 -6138 8908 -3861 -19071 -17179 -22588 -18478 116 14247 13624 2226 -11210 -16162 -16476
15074 -16476 -26302 -33259 -16540 -5930 -2481 -11132 -13292 -1024 3210 2565 -10730 -16892 -14903 -9795
15060 -9795 -4765 -10542 -14872 -17636 -18133 -28267 -10783 5680 7028 10604 5777 -1260 5728 548
15046 548 -4550 -3563 5980 13726 8845 3355 710 2074 8374 17130 23784 20412 15695 17262 2969
15031B969p929P22q811J0597J8213P869r433q727l281J73L865p71q092r038N396
15016f278J8041J2272N557o641j2118L034J0037p357q691o214M083J3250j1751
15003G224o197J407J543m338p532K17M151L155j0727P133J2006K631P868o304
14989A2237j3005j2308r73J243L883K968J5121J2732k803j3083P321O57l599j3255
14975b864N240J374n961K483j2031j5673j6278K487K0658Q860M675r110J691n732
14961b0181j4879Q428J5382R713j0977p967K512l820N925R024j473L032N138k701
14947b844o69N880J3530K809r721M962n165j5383Q28J0244r824k405J1742m001
14933a7j3632K5664L945l280M738L090K223r42k944q469j1670P65R25K1911R180
$$ plain form
15031 2969 -4960 -4238 -13049 -2452 15761 23630 14197 5470 2189 2362 6227 5456 -2636 -11674 -6278
15016 -6278 11763 24035 29592 22951 10833 13867 23904 16547 7856 1642 5725 18975 7224
15003 7224 1027 2434 3977 -361 -7893 -7676 -3525 -370 -11097 -3964 8042 10673 18541 12237
14989 12237 -768 -13076 -14049 -12806 -8923 -5955 9166 21898 19095 6012 13333 13990 10391 -2864
14975 -2864 2376 3750 -2211 272 -11759 -27432 -43710 -41223 -20565 -11705 -7030 -16140 -14449 -20181
14961 -20181 -35060 -26632 -11250 -1537 -12514 -20481 -17969 -21789 -15864 -6840 -8313 -5281 -143 -2844
14947 -2844 -3513 2367 15897 18706 8985 13947 8782 -6601 -5773 4471 -5353 -7758 3984 -17
14933 -17 -13649 12015 15960 12680 17418 20508 22731 21789 18845 10376 -1294 -529 396 22307 31487
14918C1487J8690J7681M395K367N384m598n906m860n740J1645N120j6255j7209
14905D2201k0441J111j93j4483J2723R737J333M858j1224j9067j1709k029J41
14892g042J2198L80m297J0185r85j1238k04m288m040R286J3544r1r918k0175N359
14877a1326J1050N292j1605k927N266M830Q020l921k216m480j448N642K120P936
14863A2233q636k2024l853K45J1248j4739r760R394Q998l966j0111N75J8382M904
14849g110R208P537K957N038L16l428r572j1116L659L586J4426j0281J1473j100
14835A5593k0753j1527P586p952j4595K051J3492j368k876r617J0632K4885n871
14822c20j5083l809O586K1954K0472K00j3481n314R707n601j5705k3410k993J0752
$$ plain form
14918 31487 50177 67858 72253 74620 80004 75406 69500 64640 58900 70545 75665 59410 42201
14905 42201 21760 22871 22678 8195 20918 30655 31988 36846 25622 6555 -5154 -7183 -7042
14892 -7042 5156 5536 1239 11424 10439 -799 -1003 -5291 -9331 -45 13499 13408 3490 -16685 -11326
14877 -11326 -276 5016 -6589 -9516 -4250 580 8600 4679 2463 -2017 -3465 2177 4297 12233
14863 12233 3597 -18427 -22280 -22035 -10787 -25526 -35286 -25892 -16894 -20860 -30971 -30396 -12014 -7110
14849 -7110 2098 9635 12592 17630 17946 14518 4946 -6170 -2511 1075 15501 5220 16693 15593
14835 15593 -5160 -16687 -9101 -17053 -31648 -29597 -16105 -17473 -20349 -29966 -19334 5551 -320
14822 -320 -15403 -19212 -12626 9328 29800 30000 16519 11205 20912 15311 -394 -23804 -26797 -16045
14808a6045p135o100L684J7878o038k351J4028n191o78J5748p315l317O733n314
14794a413j07o100j0679L192k885J4674j7287j6596Q885J9484R370m31M60l222
14780b655j2757k705Q759J5018o524m719N615J410k740R743Q007j4750j602j1102
14766a1002J980J0569o63j6330l929n628q34R21J0487J019J0881N507m835K108
14752B51j492j006J725J630M068j7752j0279K4934k614j0055J682N284o14J302
14738b936p015p593p217K177P276j2332q805J2772J5272J2173M948k374j739j533
14724C074j8911r725P770J6809j1507r654R703R175k366j1475P523R091o139J395
14710e237Q001J1029P464o615j4394l514P316P545p584j2241n209R88l547j500
$$ plain form
14808 -16045 -23180 -29280 -25596 -7718 -13756 -16107 -2079 -7270 -7948 7800 485 -2832 3901 -1413
14794 -1413 -1520 -7620 -18299 -15107 -17992 -3318 -20605 -37201 -28316 -8832 538 107 567 -2655
14780 -2655 -15412 -18117 -9358 5660 -864 -5583 32 1442 -1298 8445 16452 1702 100 -11002
14766 -11002 -9022 1547 884 -15446 -19375 -25003 -25837 -24916 -14429 -13410 -2529 2978 -1857 251
14752 251 -1241 -2247 -522 1108 5176 -12576 -22855 2079 -535 -10590 -8908 -3624 -4238 -2936
14738 -2936 -9951 -17544 -24761 -22584 -15308 -27640 -36445 -23673 -8401 3772 8720 6346 4607 3074
14724 3074 -15837 -25562 -17792 -983 -12490 -22144 -12441 -3266 -5632 -17107 -9584 -493 -6632 -5237
14710 -5237 2764 13793 21257 14642 248 -3266 4050 11595 4011 -8230 -13439 -12451 -15998 -17498
14696a7498R35P661l581N757K97K564J163j4094j1003l51P597P972m128N322k6
14681a1413j540l363J1108J3875r892j7904L83R414N753p187N935J0293j690k692
14667A080j057q437j2695Q561o318j8744N133J4451J046n692M920J2351J0784
14654E383O968k403n118r606P80k509q571R760L179j1402L704J1263n042j189
14640d803J1068R350K384k242o378l627j383K572j3758Q167J1049k244J823r69
14626A1009q849j4805K468J1781j563j127O964j6179r229O413J0411J1066p897
14613D63L62k867j1128J5823r288q915R623J9562J566j0470j8444n458Q326m342
14599a5187n596J0628j277o360r69J3718J1140p998n349J7636j755o433L538l163
$$ plain form
14696 -17498 -16563 -8902 -12483 -6726 -6429 -3865 -2702 -16796 -27799 -28150 -20553 -12581 -16709 -11387 -11413
14681 -11413 -12953 -16316 -5208 8667 -1225 -19129 -18746 -9332 -3579 -10766 -4831 5462 3772 1080
14667 1080 23 -8414 -21109 -12548 -18866 -37610 -32477 -18026 -16980 -22672 -17752 -5401 5383
14654 5383 12351 9948 4830 -4776 -3996 -6505 -15076 -5316 -2137 -13539 -9835 1428 -3614 -4803
14640 -4803 6265 15615 17999 15757 9379 5752 4369 6941 -6817 1350 12399 10155 11978 11009
14626 11009 2160 -12645 -10177 1604 41 -1086 5878 -10301 -19530 -13117 -2706 8360 463
14613 463 825 -2042 -13170 2653 -6635 -15550 -5927 13635 15201 4731 -13713 -19171 -10845 -15187
14599 -15187 -20783 -10155 -11432 -17792 -18761 -5043 6097 -1901 -7250 10386 8631 2198 5736 2573
14585B573m15r429m644r95l213r60m789q861R78N589R850K1404J5813N908j6602
14570A2207j792O260j3846l000k891l640o913Q85k933P544k784L018J2414K4237
14556B8766q373j4842L442L612M994N628j565m078P102o957k918j847p34K670
14542A4900o605o65j2817J974P981J2556j2335j8009J3062q990r328p130P49J5126
14528i531Q316j954j1920L939L98j1785O715R363R255j3421j4241J6663J0235
14515B032o275j0235J2314q61j5183O693Q435J814R77J3702j236j3341r266n889
14501a6319o454M943l359j065K3093J5061l543r080R026M573j7766M845P300J749
14487A3004k747Q224j866j2656J4736m310j1821j2909Q853O360l863k248l883
$$ plain form
14585 2573 2158 -7271 -11915 -12910 -16123 -17083 -21872 -30733 -29755 -24166 -14316 7088 22901 28809 12207
14570 12207 10415 16675 2829 -171 -3062 -6702 -13615 -12730 -15663 -8119 -10903 -7885 4529 28766
14556 28766 20393 5551 8993 12605 17599 23227 21662 17584 24686 17729 14811 12964 12230 14900
14542 14900 8295 7630 -5187 -3213 4768 17324 4989 -13020 42 -8948 -18276 -25406 -24657 -9531
14528 -9531 -1215 -3169 -15089 -11150 -10752 -22537 -15822 -6459 2796 -10625 -24866 -8203 2032
14515 2032 -4243 -14478 -2164 -3025 -18208 -11515 -3080 -1266 -289 13413 12177 -1164 -10430 -16319
14501 -16319 -22773 -17830 -21189 -22254 839 15900 12357 3277 12303 16876 -890 3955 11255 13004
14487 13004 10257 18481 16615 3959 18695 14385 2564 -10345 -1492 4868 1005 -1243 -5126
14474e126J187j875m9q131j1038J1749Q806J179j3017L832J0726k37k568m761
14460i323K152M197P503m349j9203J911O608M200P119M593j2029l752J4361J707
14446E695j4603j9687K891J0350J224J2920J183j256J38P100l003l525O667L649
14432I743j1150L292Q838q988m769k48p105n019O651Q399O245m697o494p694q790
14417b1786K532K92R102N961j6997k20n887j4038K776N072J5875O651L21q066
14403a8412q269K1490O385j8713J3148R234j7276l507J1589J881K816N018p916
14390b532o31l681N727j876p262k654M286N905k383n337R837K1496j574n584j2448
14375A289K233M369j305K957N08k7414j7847J5316J5100P03N703p044j0378Q95
$$ plain form
14474 -5126 -3939 -5814 -5863 -13994 -25032 -13283 -4477 -3298 -16315 -12483 -1757 -1994 -4562 -9323
14460 -9323 -7171 -2974 4529 180 -19023 -17112 -10504 -6304 815 5408 -6621 -10373 3988 5695
14446 5695 -8908 -28595 -25704 -15354 -14130 -1210 -27 -1283 -1145 5955 2952 -573 6094 9743
14432 9743 -1407 1885 10723 1735 -3034 -3282 -10387 -15406 -8755 -356 5889 1192 -5302 -12996 -21786
14417 -21786 -19254 -18962 -9860 -3899 -20896 -21116 -27003 -41041 -38265 -33193 -17318 -10667 -10346 -18412
14403 -18412 -26681 -5191 1194 -17519 -4371 4863 -12413 -15920 -4331 -2450 366 5384 -2532
14390 -2532 -3163 -6844 -1117 -2993 -10255 -12909 -8623 -2718 -5101 -10438 -601 20895 19321 13737 1289
14375 1289 3522 7891 6586 9543 10051 -17363 -35210 -19894 -4794 -4091 1612 -5432 -15810 -14915
14361a4915J5078N974L828N440j8257N612L05l67m908N870J344J3675Q212j0113
14347A6778R835n282j3549o704P260o218l801o439L826l950m062l60j0770j15
14333b3551J5087M844j1662O594M29Q198N037n192M021J1289k45m692p959j3827
14319a1629r056L91N204L173l971j1620P160J9459j986k331o506O827N852m125
14305c158O066n649Q459l465j4867J3525K3612L560n445N296j7550q593r271m180
14291a1660r301L262L949J6733n035j281o787J3882r456m936l239j166L905J676
14277i454n237K690Q341L713o128n437K422O167r523p707K728N454m245l1L274
14262a2973j494R891r617q15R125M262m370j7096L415M167l26N811O60n411r480
$$ plain form
14361 -14915 163 6137 9965 15405 -2852 2760 3065 2698 -2210 3660 5004 18679 26891 16778
14347 16778 26613 21331 7782 1078 8338 2120 -1681 -8120 -4294 -8244 -12306 -12666 -23436 -23551
14333 -23551 -8464 -3620 -15282 -8688 -8259 -61 4976 -216 3805 15094 14849 10157 2198 -11629
14319 -11629 -20685 -20294 -15090 -11917 -15888 -27508 -20348 -889 -2875 -5206 -11712 -4885 967 -3158
14305 -3158 2908 -2741 5718 2253 -12614 911 24523 28083 22638 27934 10384 1791 -7480 -11660
14291 -11660 -20961 -17699 -13750 2983 -2052 -3333 -10120 3762 -5694 -10630 -13869 -15035 -11130 -9454
14277 -9454 -14691 -12001 -3660 53 -6075 -11512 -9090 -2923 -12446 -20153 -17425 -11971 -16216 -16247 -12973
14262 -12973 -14467 -4576 -14193 -15008 -5883 -1621 -5991 -23087 -19672 -15505 -15831 -10020 -9360 -14771 -24251
14247b4251N665K752k201J6584J7341R867j0146j9417O40O41o674o762N02O020
14233i439L410k700J1227N497q490N292k31k730J043P564q883k3655o288R509
14219a8874J3653R048r225J5003Q970P582l606j815k0583j3496J1543p602o556
14206a5958L656R501N966R576n968j4216J520O221l597j7032o311N148Q86K429
14192a8179L597P696P681J1103p239J2748J684j1044o228L932l78q772k978K730
14178c647l061O643R221J1072k92p002j2278L267k857K614P14Q09l493m796k020
14163e106q664n122r775O680O306K94K007N505Q5j2238J7559J5541L45P869k309
14148A8977m778K750J2338j3655j0524k095j3938j2366n418K2752J4940M011K52
$$ plain form
14247 -24251 -18586 -15834 -18035 -1451 15890 25757 15611 -3806 -3166 -2525 -9199 -15961 -15459 -9439
14233 -9439 -6029 -8729 2498 7995 -495 4797 4566 1836 2879 10443 1560 -22095 -28383 -18874
14219 -18874 -5221 3827 -5398 9605 18575 26157 22551 20736 153 -13343 -1800 -9402 -15958
14206 -15958 -12302 -2801 3165 12741 6773 -7443 -5923 298 -3299 -20331 -26642 -21494 -20608 -18179
14192 -18179 -14582 -6886 795 11898 4659 17407 19091 8047 1819 5751 5373 -3399 -6377 -3647
14178 -3647 -6708 -65 9156 20228 19936 12934 656 3923 1066 3680 4394 5203 1710 -3086 -5106
14163 -5106 -13770 -18892 -28667 -21987 -15681 -15387 -13380 -7875 -7790 -20028 -2469 13072 13417 21286 18977
14148 18977 14199 16949 29287 15632 5108 3013 -10925 -23291 -28709 -5957 8983 12994 13246
14135A3246P557n783N47n714j1470j9212R23Q632p3R933l18O381K0094p279j5122
14120B342M15L214j6089r481K075Q887K103j2295j8997Q312O929P06O65m258n840
14105c1312J561J2803p88j0007J8544Q42J819j018N541J0076N980j073M162j354
14091A5776J1241n458j2111j3614P166k506m488l319p121J5850O668j1660R6O818
14077C338J0234n926n300l710J183r039m093k270N050l995o958J5913o782n154
14063a7509K734J543R518J2272O281n201P057j0033l595o453n954J9619Q549Q594
14049B7422J2154j5800j1603Q792k673L762r67j3542j5560p443M352N757K624
14036b725M953M66n960m920P001Q617J2315K630j3754J1775j798j8252n330o695
$$ plain form
14135 13246 20803 15020 15567 9853 -1617 -20829 -19906 -11274 -11347 -1414 -1732 4649 24743 17464 2342
14120 2342 2757 5971 -10118 -19599 -17524 -8637 -6534 -18829 -37826 -29514 -22585 -21879 -21214 -25472 -31312
14105 -31312 -29751 -16948 -17736 -27743 -9199 -8357 -6538 -7556 -2015 8061 14041 12968 17130 15776
14091 15776 27017 21559 9448 -4166 3000 494 -3994 -7313 -14434 1416 8084 -3576 -3480 3338
14077 3338 13572 7646 2346 -1364 -181 -9220 -13313 -15583 -10533 -14528 -21486 -5573 -12355 -17509
14063 -17509 -14775 -13232 -3714 8558 14839 9638 16695 6662 3067 -3386 -9340 10279 18828 27422
14049 27422 39576 23776 12173 20965 18292 22054 21087 7545 -8015 -15458 -11106 -5349 -2725
14036 -2725 2228 2694 -3266 -8186 -1185 7432 19747 22377 8623 20398 18600 348 -4982 -11677
14022a1677R354k35P425N072j1640k576J0826R281o406R934O021q708j2665j7887
14008a3881J700P600J013m706j585R004R009j4608k659q647j5102J5405J2885
13995d572q388m565K922J5436l364q036l038N39K948J6397k740M141R603P66j1274
13980F775j3289p17P528J0641m920K990q481L712m841k432j2l582J4416P416o668
13965H536R703K117j6195j884n55O052O322q31q592n17K00j968J909M22L13J2206
13949A7238L892l884P47Q888p922j3423r33N331m664j6121L029N379M930l856
13935a369J0695N943M472m298k3085j2391J2331J9285o462l900K458j9818O706
13922i433K2096J2643q083j3309k565r772j5163K743k319O831J4363J0280q044
$$ plain form
14022 -11677 -2323 -2558 4867 9939 -1701 -4277 6549 15830 9424 19358 25379 16671 4006 -13881
14008 -13881 -12181 -4581 -3568 -8274 -9859 -855 8154 -6454 -9113 -17760 -32862 -17457 -4572
13995 -4572 -12960 -17525 -14603 833 -2531 -10567 -13605 -13066 -10118 6279 3539 7680 17283 18049 6775
13980 6775 -6514 -7231 297 10938 6018 9008 527 4239 -602 -3034 -3046 -6628 7788 15204 8536
13965 8536 18239 20356 4161 2277 1722 7774 14096 13265 4673 4156 4356 2388 4297 4719 5032 17238
13949 17238 21130 17246 17993 26881 18959 5536 4603 9934 5270 -10851 -7822 -2443 2487 -1369
13935 -1369 9326 15269 19741 15443 -7642 -20033 -7702 11583 5121 1221 3679 -16139 -9433
13922 -9433 12663 25306 17223 3914 1349 -8423 -23586 -20843 -23162 -16331 -1968 8312 268
13909B68J1765r486r712p518J2311N45p386K574J8077R378j5320N296J4623O603
13895C2018l181j1555K766O2r760l022O047M872L691J0066o41j3354j2447o498
13881i36q838K223J8886l694O648J3365o171p162L405J176m474o444J2060j9204
13867H40j099P638R036M851L992J4932K38j4001r180j1078j3082J3728P536Q869
13853B3220P605J232j1979n276j0155o554L723j5898O649K3008K2523j2789j2741
13840A2568l667m180j039l094J2692O567j3223J3319N349k771o258R854J761M767
13826C2645j1730j3624o946J1917M207J668j121m330l798O232J180M958l339j6384
13812A535K391P560J3619L19l289n418L337q801l226R565J550p072p299k0093
$$ plain form
13909 268 12033 2547 -7165 -14683 -2372 -1827 -9213 -6639 11438 20816 5496 10792 25415 32018
13895 32018 28837 17282 20048 20110 10350 7328 13375 18247 21938 32004 31363 18009 5562 -936
13881 -936 -9774 -7551 11335 7641 14289 27654 21483 14321 17726 18902 14428 7984 20044 840
13867 840 -259 7379 16415 21266 25258 40190 40428 26427 17247 6169 -6913 6815 14351 23220
13853 23220 30825 32057 20078 14802 4647 -1907 1816 -14082 -7433 15575 38098 25309 12568
13840 12568 8901 4721 3682 588 13280 19847 6624 19943 25292 22521 16263 26117 27878 32645
13826 32645 20915 7291 345 12262 16469 18137 17016 12686 8888 15120 16300 21258 17919 1535
13812 1535 3926 11486 25105 25424 22135 16717 20054 11253 8027 17592 19142 12070 4771 -15322
13798a5322M020R681J2236J6339J6629j1318j0162j629j2065j7330m019K2283
13786I343J1140l340m251M540j209R258l570o321R752O194j0183j1208N081L414
13772A8640L82p589n701R130J3361L810q024l317m442r301j2331j091O377J7454
13758A7358N763Q061p613K107J4211r852j8618K337M540K647K299O278j3560r838
13744F120n051j599N888J233N369K744o079m789L052J5635r791j5292o529R122
13730C3K4804J1152m526P037p067j3661j2617o066J032N253L533K396j352j277
13716H674j393q38P962P990O866o672j3596l148j8325r399J2786P500O091k094
13702B404P28j4839Q1N836l783J0262J4020J2653N472m625o605j5261N582j332
$$ plain form
13798 -15322 -11302 -1621 10615 26954 43583 32265 22103 20474 8409 -8921 -12940 9343
13786 9343 20483 17143 12892 17432 16223 25481 21911 15590 25342 31536 21353 10145 15226 18640
13772 18640 19022 11433 5732 14862 28223 32033 24009 20692 16250 6949 -5382 -6473 -96 17358
13758 17358 23121 31182 23569 25676 39887 30035 11417 13754 18294 20941 23240 29518 15958 6120
13744 6120 1069 -530 5358 6591 11960 14704 8625 3836 6888 22523 12732 -2560 -9089 33
13730 33 24837 35989 31463 38500 31433 17772 5155 -911 121 5374 8907 11303 9951 8674
13716 8674 7281 6443 14405 22395 29261 22589 8993 5845 -12480 -21879 -9093 -1593 4498 2404
13702 2404 3132 -11707 -11626 -5790 -9573 689 14709 27362 32834 28209 21604 6343 11925 10593
13688A0593o050j0168q676l157J9080J0428R637J5981K941L190j6454j0384O027
13675B2988O527n86M078j4928r778k683J1180K1646J320n323j310O658J852m864
13661C6777k102O274k810j442j4501n104R851J398K545m291O38q157j2993J959
13647H042J6189O532j1235k727O620J6765O229p550j1807j7643R33j57K516N92
13633A3299q747K0130K069n15N097L663M557j2917l022o252k3821K1550P322k823
13619A9590j21O762M346k483j0042N520Q385o063r595j980m011l545R511p71p496
13604H007J2117p074r310j0095J6142J4672J0495j4172j903r720n109r02J6695
13591A9843M868l846o192p292N949M481l510Q321p39r020m501l3P384P322K214
$$ plain form
13688 10593 4543 -5625 -14301 -17458 1622 12050 21687 37668 40609 43799 27345 16961 22988
13675 22988 29515 28929 33007 18079 8301 5618 16798 38444 39764 34441 33131 39789 41641 36777
13661 36777 34675 40949 38139 36697 22196 17092 26943 28341 30886 26595 27233 19076 6083 8042
13647 8042 24231 30763 19528 16801 23421 40186 46415 38865 27058 9415 10348 10191 12707 13299
13633 13299 4552 24682 26751 26236 31333 34996 39553 26636 23614 17362 -6459 15091 22413 19590
13619 19590 19469 26231 30577 28094 18052 23572 31957 25894 16299 14319 10308 6763 16274 15503 8007
13604 8007 20124 13050 3740 -6355 9787 24459 34954 20782 18879 9159 4050 3148 19843
13591 19843 24711 20865 14673 7381 13330 17811 14301 22622 21883 12863 8362 8329 15713 23035 25249
13576B5249N6O63l113R08j3664j2415O478J2764j287l675J7487k214q115m446
13562A4676J3594j7634j1748N485O579L689L717r236j1204K63J3833K965M434
13549A9413O245j2851P515M86K837P631J43K321n063k0918j0594Q689J5987K332
13535B4173k3472k181J5756l878q959j1423k728J913J1822P633j0278R73q535
13522i184o098k685Q215R805M646J405l471J3089O67l435M26j0898m16N235p185
13507A16l014N936P983q26J342p680J6383J0243Q731p549j5910n292n797Q021
13493A2687N550o341j0681l047l470k961N082J4805l251R710J4702q887q498j1974
13479C426M66J2009o716k430M093k022J2240l573r531L071k586j3520J0012J835
$$ plain form
13576 25249 25305 25968 22855 23763 10099 -2316 4162 16926 15639 11964 29451 27237 19122 14676
13562 14676 28270 10636 -1112 4373 10952 14641 18358 9122 -2082 -1819 12014 14979 19413
13549 19413 25658 12807 20322 20808 23645 31276 31419 33740 28677 7759 -2835 5854 21841 24173
13535 24173 701 -1480 14276 10398 1439 -9984 -12712 -10799 1023 8656 -1622 -649 -9184
13522 -9184 -15282 -17967 -9752 53 4699 6104 2633 15722 16389 12954 13380 2482 2066 7301 116
13507 116 -2898 3038 11021 10195 11537 3857 20240 30483 39214 31665 15755 10463 4666 12687
13493 12687 18237 11896 1215 -1832 -5302 -8263 -3181 11624 8373 18083 32785 23898 15400 3426
13479 3426 3892 15901 9185 6755 10848 8826 21066 17493 7962 11033 8447 -5073 4939 6774
13465F774J201J722j4980j2348J2986R311K798K72J0844j391j6597l049r16L90
13451b983K0716Q890n878r89K251j299j0388p784L498k400J3328J406j4418j7790
13437a3840n001N957J4114J521o454m115K067J1338J0301k257L583m954n702j2630
13423f072k632J6288q96N891J3773J551p774p503j0855o143p327n124J7793M620
13409E590q900J7776J1793l809q871L560j0261j2955n386J5537P037r223J382
13396C270k022j0150P942K1582j733m990o398j0772j5792p892J3076Q279K641
13383b959j1922N379N249p331j1540J9228J1767l376q943L197J0253L249K980
13370A5231j716n656m835k2927q147r40R586J0971Q388K481r574O387N013N211
$$ plain form
13465 6774 7975 9697 -5283 -17631 -4645 4666 7464 7736 18580 17189 592 -2457 -3373 -2983
13451 -2983 17733 26623 20745 19756 22007 20708 10320 2536 6034 3634 16962 18368 3950 -13840
13437 -13840 -18841 -12884 1230 2751 -3703 -7818 -5751 5587 15888 13631 17214 12260 6558 -6072
13423 -6072 -8704 7584 6688 12579 26352 27903 20129 12626 1771 -4372 -11699 -16823 970 5590
13409 5590 -3310 14466 26259 22450 13579 17139 6878 -6077 -11463 4074 11111 1888 3270
13396 3270 1248 -8902 -960 20622 18889 13899 7501 -3271 -19063 -26955 -13879 -5600 -2959
13383 -2959 -14881 -9502 -4253 -11584 -23124 -3896 7871 4495 -4448 -1251 9002 12251 15231
13370 15231 13515 7859 3024 -19903 -28050 -28990 -19404 -8433 -45 2436 -7138 -751 4262 9473
13356I473M292K441q135j3312j424J1862L072j4516m54K801n63O738k477p715
13342g917Q76J0383M617P360K314q518k760j929O029L914N410j2387p853N927
13328E466J0277k023L452o556q646p716L930K5625M345j1503m78J4360J9026J0811
13314F0370j2018j6602j1351o879J083l784p429Q859r111n644m349o087K0542
13301G600O031j3145p178P007n88P856k051Q469N65m160N546J913k572o89J0732
13286B5336J589M712P040l903l247l22j118p550j2489L441J0548P153J857N937
13272C8984k584j2352j8605j2341J2633Q978r377j2202P49J444O317J5826m08
13259A7062o847J0195j69k019P001r68j6364o877J8818l115n423j250M603j710
$$ plain form
13356 9473 13765 16206 8071 -5241 -6665 5197 8269 -6247 -6701 -3900 -4463 2275 -202 -7917
13342 -7917 -7041 3342 7959 15319 17633 9115 6355 4426 10455 14369 19779 7392 -461 5466
13328 5466 15743 13720 17172 10616 1970 -5746 -1816 23809 28154 16651 16173 30533 49559 60370
13314 60370 48352 31750 20399 13520 14603 10819 3390 12249 3138 -2506 -6855 -12942 7600
13301 7600 13631 486 -6692 315 -273 7583 5532 14001 14566 10406 15952 17865 15293 14604 25336
13286 25336 26925 31637 38677 34774 31527 31205 30087 22537 10048 13489 24037 31190 33047 38984
13272 38984 36400 24048 5443 -6898 5735 14713 5336 -6866 -6117 -4673 1644 17470 17062
13259 17062 10215 20410 20241 18222 25223 24255 7891 1014 19832 16717 11294 10044 14647 12937
13245A2937k763l80r317L5P263j1471M776L962m831O379R841N796J2488m002o913
13230B3800j0488k1419j0325J2220j924J3602Q906j8965K558O505J864m900n576
13217d142R123J155O578m276j0911K436Q187J3759Q61k462o634k18k093o810q555
13202d002K75m646K700m160p238Q275j762R40l988l918L638J5793P059k162M916
13187A1720J6634j849l5224k2448J8860J5484O703J2818L101l438O514K193l837
13174B7231o355p078L514j6415j5408Q995J8789N653k538L159Q205r112q63L31
13160A8108K998j553r372N058l223k608K744L428K117Q90m997j1205k3202J0674
13146a0143J1949J4318M219j0385n122J2408J4953O06q322r083j0254Q988J414
$$ plain form
13245 12937 10174 9794 477 512 7775 -3696 1080 5042 211 6590 16431 22227 34715 30713 23800
13230 23800 13312 -8107 -18432 -6212 -8136 5466 14372 -4593 -2035 4470 6334 1434 -4142
13217 -4142 4981 6136 12714 8438 -2473 -37 8150 21909 22770 20308 13674 13456 11363 4553 -4002
13202 -4002 -3727 -8373 -5673 -9833 -17071 -8796 -10558 -9618 -13606 -17524 -13886 1907 8966 6804 11720
13187 11720 28354 26505 -8719 -31167 -12307 3177 9880 22698 25799 22361 28875 31068 27231
13174 27231 20876 13798 17312 897 -14511 -5516 13273 18926 16388 19547 27752 18640 17777 18108
13160 18108 21106 19553 10181 15239 12016 9408 12152 15580 17697 18587 13590 2385 -20817 -10143
13146 -10143 1806 16124 20343 9958 4836 17244 32197 32803 24481 15398 5144 14132 15546
13133A5546k0164O98J3384J7970L018J2387j722j8385j2946o589P050R287l871
13120A5663j8154j0625L492J6646J3087L001j429K695k803L956L26O90J553k951
13106B5147L387J9424N743l247K992j1179L494r162J5m728r082K0231k362j7709
13092B2964n501n937o396j0105Q955J3087j438k295r53o103n583K021J1095k396
13078A1415j088j6173J9720J6947J458P434J7762j3819m170k401k132q948L036
13065B9041j3865K931R477J4201O054J0908J8736J9794J4110M735M190M129k5070
13052I9371j7239k1290O404k993j2244j2034P270J3764q494j2965q266m436J2557
13039C9405N453r736N90J4026K0523M248O612O08J0115K1492J3248J4482K7001
$$ plain form
13133 15546 -4618 -3920 9464 27434 30452 42839 41117 22732 9786 3197 10247 19534 15663
13120 15663 -2491 -13116 -9624 7022 20109 23110 21681 24376 21573 25529 25855 26545 28098 25147
13106 25147 28534 47958 53701 50454 53446 42267 45761 36599 36614 31886 22804 43035 40673 22964
13092 22964 17463 11526 5130 -4975 3980 17067 15629 13334 12381 6278 695 2716 13811 11415
13078 11415 10327 -5846 13874 30821 32279 39713 57475 43656 39486 37085 34953 26005 29041
13065 29041 15176 18107 27584 41785 47839 58747 77483 97277 111387 116122 120312 124441 99371
13052 99371 82132 60842 67246 64253 52009 39975 47245 61009 52515 39550 31284 26848 39405
13039 39405 44858 35122 35712 49738 70261 74509 81121 81729 91844 113336 126584 141066 168067
13026A68067L8328N0049P6803J13390J51459J99481K52445K61964K30885J22456
13016A665327Q329r7529j98708k17506j97743j61568r7722p4195p1801o8810p3507
13005D14567o1910m5942l8966l1384m2117k7886k2823k0l765j7358k2796j7334
12993H2266j0650j199p312r374j6713j2804J280k617p26K415L17J9548K053j111
12979D5373k052q172p133R746P018n895n015o517K748k055P614K984J3931Q288
12965F0863O754m580J175M7J6746k192l771j7472n552k493j2086o279j81j7828
12951A3151k662L452o162m286Q779Q871N44q623J019m981j1522J7413k827J968
12937A4134K0041j540j6946n521n585j53q198n247O74l692P463R732k43j7323
$$ plain form
13026 168067 206395 256444 333247 446637 598096 797577 1050022 1311986 1542871 1665327
13016 1665327 1673656 1576127 1377419 1159913 962170 800602 702880 628685 556884 488074 414567
13005 414567 352657 306715 267749 236365 194248 166362 143539 143519 139754 122396 99600 82266
12993 82266 71616 70417 63105 53731 37018 24214 25494 22877 22151 24566 24883 44431 46484 45373
12979 45373 43321 35149 28016 37762 44780 38885 33870 27353 30101 28046 35660 38644 52575 60863
12965 60863 67617 63037 64212 64259 81005 78813 75042 57570 52018 49525 37439 31160 30979 13151
12951 13151 10489 13941 7779 3493 12272 21143 21687 13064 14083 9102 -2420 14993 12166 14134
12937 14134 34175 32635 15689 10168 4583 4430 -3768 -9015 -8341 -12033 -4570 5162 4919 -12404
12923a2404j7473L53q063j076R049K626r773r803p954j156j8000j8162k046J3723
12909h0159O346L208L0368L8064J8789J6296R709j4397j076J5108p20J922m197
12896C9261N821P431J4641K864p849j9343p40N756J0643j6869k8106j3511M749
12883D748J2242P545R190k065N493m3o452J2080J610r765j1658o275J5494J3767
12869D5911J558o16J010Q469J3117q06j1495j0400k960O101P064O196k271o017
12855E4861n800m197L374J3821q471L603J2901J7224R98j4712R191O426L506k340
12841I0385J002K408j2169j2797K2867Q844J2208K7717K8253J7704K2984K2757
12829B32163N840J3175R019q028j8765l1763l2146j7647k5295k8806j9315m378
$$ plain form
12923 -12404 -29877 -29524 -37587 -38663 -29614 -26988 -36761 -46564 -54518 -55674 -73674 -91836 -93882 -80159
12909 -80159 -73813 -70605 -40237 -2173 16616 32912 42621 28224 27148 42256 41536 43458 39261
12896 39261 45082 52513 67154 70018 62169 42826 42086 47842 58485 41616 13510 -1 4748
12883 4748 16990 24535 33725 31660 37153 37110 30658 42738 44348 34583 22925 16650 32144 45911
12869 45911 47469 46853 47863 56332 69449 68643 57148 46748 43788 49889 56953 63149 60878 54861
12855 54861 49061 44864 48238 62059 53588 57191 70092 87316 88314 73602 82793 89219 92725 90385
12841 90385 91387 93795 81626 68829 91696 100540 112748 140465 168718 186422 209406 232163
12829 232163 238003 251178 260197 252169 233404 201641 169495 151848 126553 97747 78432 74054
12817G4054l268Q683J6951K349j6244Q736J5386r10m72n647p819M482K408j2034
12803H6655j4729j1104p228Q645Q028Q66p253N974O218m444p220Q475P332q495
12789G1720k277R942l597o588m025j547J2290N796Q660J242P060R983j8261j994
12775H8404J3818M986J287j465j3191k1298j9884p9Q156L819k523J5335J1690
12762H9055k0417j7069q059n832j1624j0192k2174j2258J6991m687j7255J039
12750b2482J5729K0912O028P296J8714P439o383r777K3665K007j0587Q537J0115
12737G1213m514k530j4885j2983m894M72j1943k0059j8388r572r5L815K085J3689
12723h589N770Q822M276J0701M012J167J923O584R599L654Q096P037J114J3802
$$ plain form
12817 74054 70786 79469 96420 98769 82525 91261 106647 105737 105265 99618 91799 96281 98689 86655
12803 86655 71926 60822 53594 62239 70267 71133 63880 69854 76072 71628 64408 72883 80215 71720
12789 71720 69443 79385 75788 69200 65175 63628 75918 81714 90374 91616 98676 108659 90398 88404
12775 88404 102222 107208 108495 107030 93839 72541 52657 52578 60734 64553 62030 77365 89055
12762 89055 68638 51569 43510 37678 26054 15862 -6312 -18570 -1579 -6266 -23521 -22482
12750 -22482 -6753 14159 20187 27483 46197 53636 47253 37476 61141 63148 52561 61098 71213
12737 71213 66699 64169 49284 36301 31407 31879 19936 -123 -18511 -28083 -28178 -24363 -22278 -8589
12723 -8589 -2819 6003 10279 20980 24992 26159 28082 34666 44265 47919 56015 63052 64166 77968
12709G7968J9373J5449K8061M5194N1241P9344R0429J02659P4348L9472k957m8452
12697E72129o1653p6911m2201m2115k3600N948P254J1553K2005J1064J0999j725
12685C92747j4892k663L418Q387J036j072r302j1507Q850j4172k0663K45K237
12672C42649O773M503K717l308k0780j7091j6446j2685N674J1920j435M037K882
12659C09410l649M529K2985J8473k513J8059L2881J0229M673O741M857J6752O295
12646D49722J3019J5243M2124J9358O697J8887J3827q876J9874J1442n484Q656
12634F04489J174P764J9110K2553L2856J1811M8639O0795L7930M2303M6729M2249
12622I78402K6345L5539M3766N2997N4342O6526O8705P7611N4503N3123M4867
$$ plain form
12709 77968 97341 112790 140851 186045 237286 316630 407059 509718 584066 623538 620581 572129
12697 572129 510476 433565 391364 349249 325649 331597 338851 350404 372409 383473 394472 392747
12685 392747 377855 375192 378610 386997 388033 386961 377659 366152 375002 360830 340167 340412 342649
12672 342649 349422 353925 356642 353334 332554 315463 299017 286332 292006 303926 302491 306528 309410
12659 309410 305761 310290 333275 351748 349235 367294 400175 410404 415077 421818 426675 443427 449722
12646 449722 462741 477984 520108 539466 546163 565050 578877 570001 589875 601317 595833 604489
12634 604489 605663 613427 632537 655090 687946 699757 748396 809191 847121 889424 936153 978402
12622 978402 1004747 1040286 1084052 1137049 1191391 1257917 1326622 1404233 1458736 1511859 1556726
12611A556726L8787O7037R3620J01785J24038J70935K10158K18588K13902K14892
12601C010468K14552K33398K71089L49964M08893M90653N67587O53001P84781
12592F984386R63937J175185J489860J871313K332022K873269L586622M576890
12584B5853484O028956Q326713J1871270J7447154K5818135L6735799M6699786
12577A78781297N0175292M6943451L3627197P638342j2105701l2555700m5647112
12570B26857066m2925485l7918912k8519939j9003328j3026608j0176136q928573
12563F6358085q262635p854672p201765o288243n345050m472330l713021l074020
12555B0146349k542893k146514j834774j548172j322148j176651j027345r20291
$$ plain form
12611 1556726 1595513 1662550 1756170 1857955 1981993 2152928 2363086 2581674 2795576 3010468
12601 3010468 3225020 3458418 3729507 4079471 4488364 4979017 5546604 6199605 6984386
12592 6984386 7948323 9123508 10613368 12484681 14816703 17689972 21276594 25853484
12584 25853484 31882440 40209153 52080423 69527577 95345712 132081511 178781297
12577 178781297 228956589 275900040 309527237 317165579 305059878 272504178 226857066
12570 226857066 183931581 146012669 117492730 98489402 85462794 75286658 66358085
12563 66358085 58095450 50240778 43039013 36750770 31405720 26933390 23220369 20146349
12555 20146349 17603456 15456942 13622168 12073996 10751848 9575197 8547852 7627561
12547G627561q04810o90661n93513m89394m19381l54997l26361l23340l06895
12538C318209l00747k58956k36979k08053j53234j29254j07456r4487q8825q4790
12528A655428q6952p5573n7497p9161p7910n1958m5641k3422j5895k3651k4160
12517A093608l1423l7862l7587k2201k8320k5621j7753j4274q648L726j4367k0963
12505H38315k4203k0637l1283l6641m2333k7684j4173k3571j8180j3391j3482
12494E72737j9308j4943p599p326o563j4075r919p717l531J0471k933j2272j8189
12481D58833j2140q22j4108m482k613k2956j6130j1299q396r786j3022k5114q976
12468C08989j0769n746m004Q38K849l516J7092J2909J637M625L808N810K6635
$$ plain form
12547 7627561 6822751 6132090 5538577 5049183 4629802 4274805 3948444 3625104 3318209
12538 3318209 3017462 2758506 2521527 2313474 2160240 2030986 1923530 1829043 1740218 1655428
12528 1655428 1568476 1492903 1435406 1356245 1278335 1226377 1180736 1157314 1141419 1117768 1093608
12517 1093608 1062185 1024323 986736 964535 936215 910594 892841 878567 869919 873645 859278 838315
12505 838315 814112 793475 762192 725551 683218 655534 641361 617790 599610 586219 572737
12494 572737 553429 538486 530887 523561 516998 502923 493004 485287 481756 492227 489294 477022 458833
12481 458833 446693 445871 431763 427281 424668 401712 385582 374283 365887 356101 343079 317965 308989
12468 308989 298220 292474 288470 289308 292157 288641 305733 318642 320279 324904 328712 334522 361157
12455C61157L4008M2728L7231L9464O191N706l403j3693j9254k5155q595j3084
12443D43301k0233j683R458q333J745M042M232O027j465q610j798N886L578Q622
12429D44769M422P169Q836p040r70o500j0006o275j9945k0328q568j4833k4205
12416C46526k6341k3967k1341N58l463l726L408j2327j2104J924j4497j8146l359
12403B13145j0255J5002K5336J3574L476R289M835J6947J2513m442j3404j0523
12391B75493k0123k5693k1941k4504k6230r726k769o687o574J976J4909J336p701
12378A41766j7125k0101j6404k1974l967J7801r847j3170o973J7966J3466L1489
12366A12927K0961R220L2412K8675J059O918l2k1915p251n677l1060j6438j5392
$$ plain form
12455 361157 395165 437893 475124 514588 520779 526485 523082 509389 490135 464980 456385 443301
12443 443301 423068 421385 430843 422510 424255 428297 432529 438556 437091 428481 426683 432569 436147 444769
12429 444769 449191 456360 465196 458156 457186 450686 440680 434405 414460 394132 385564 370731 346526
12416 346526 320185 296218 274877 275435 271972 268246 271654 259327 247223 249147 234650 216504 213145
12403 213145 202890 217892 243228 256802 260278 269567 274402 291349 303862 299420 286016 275493
12391 275493 255370 229677 207736 183232 157002 147276 144507 137820 131246 133222 148131 149467 141766
12378 141766 124641 104540 88136 66162 62195 79996 70149 56979 50006 67972 81438 112927
12366 112927 133888 143108 175520 204195 205254 212172 212140 190225 182974 177297 146237 129799 114407
12353A14407j2092P833q93j1530k886j585j3619j0596l06M430J201k814L187j5350
12339E9387p234M228j0293Q973J0807O568j148P09m295R580R153j0196J276L633
12325H1148k614O412r94J359J2170j5398j8069R61r444K896J005k313J6718L564
12311G7401q895j2267j1404o719k142O48J6151J053o127j9585j019J1621M130
12298D2846O85j27J6152k09p330j1787N860Q63o978j1858K115Q874l673m323J480
12283C2590J1004n762q140j0060m435J958J533r852j059q977p216r034Q615j5389
12269b4224k781K6795R810J4892M908J7757L005j5359l769K531j8712o838R685
12256A7700N940n987k697n935L357j1725M828J3186L354M599J3207J3419L385
$$ plain form
12353 114407 102315 110148 109255 97725 94839 93254 79635 69039 68733 73163 74364 71550 74737 59387
12339 59387 52153 56381 46088 55061 65868 72436 71288 71997 67702 77282 86435 76239 77515 81148
12325 81148 78534 84946 83952 85311 97481 82083 64014 64975 55531 58427 59432 57119 73837 77401
12311 77401 68506 56239 44835 38116 35974 36622 52773 53826 47699 28114 27095 38716 42846
12298 42846 43531 43404 59556 59347 52017 40230 46090 46953 39975 28117 30232 39106 35433 31110 32590
12283 32590 43594 37832 29692 19632 15197 17155 18688 8836 7777 -1200 -8416 -17450 -8835 -24224
12269 -24224 -27005 -210 9600 24492 29400 47157 50162 34803 31034 33565 14853 8015 17700
12256 17700 23640 17653 14956 9021 12378 653 5481 18667 22021 26620 39827 53246 56631
12243E6631J8529Q074J0112K0094J2015k411p377n529n932j823r869j732n568
12230H5214j6785j2234L899J2366P281o970L868o009J2012J451j6312p736q193
12217E1852j6456j7035j1189J8660J1166J51L717R967o072m003M365K27n532L741
12203D3559n752q456m82O621J0031O49n074J603Q881j2085j7745k10Q756J1568
12189D1864j582j073L163q399k3445o288P382M969O389M123r797N539J3910L681
12175D0436K409N657k717r5m805J120k548J70k428O808K290p407q855R299j864
12160C7470k771q404n780O964n861j5838o664R290J3064L104K645K982P998Q797
12146D6996k294J3833J4606P083q265j7057q886J7283M0334K2718N156J9848L2211
$$ plain form
12243 56631 75160 83234 93346 113440 125455 123044 115667 110138 104206 102383 92514 90782 85214
12230 85214 68429 56195 60094 72460 79741 72771 76639 70630 82642 84093 67781 60045 51852
12217 51852 35396 18361 7172 25832 36998 37149 40866 50833 44761 40758 45123 45350 39818 43559
12203 43559 37807 29351 28869 35490 45521 46170 41096 42699 51580 39495 21750 21540 30296 41864
12189 41864 40282 39209 42372 33973 10528 4240 11622 16591 22980 27103 17306 22845 36755 40436
12175 40436 42845 48502 45785 45690 40885 42005 39457 39627 37199 44007 46297 38890 30035 39334 37470
12160 37470 34699 26295 20515 27479 21618 5780 -884 8406 21470 24574 27219 30201 38199 46996
12146 46996 44702 58535 73141 80224 71959 54902 46016 63299 103633 126351 131507 151355 183566
12133A83566M7554P9481J04003J69040K28246K49831K53908K06215R4320j8242
12123A597922j18609k20038k22272k15766j70411j19588q0277o1793m8169m3510
12113B97489l6480l4948l6300j8553j2247j9800j4894k1518l912j7908j3213r425
12101E8291j6049J956J1692J3586L295q370j4400j1538j7394O634Q801q692K460
12088C0272p543M619p119o524N41K94p760P726J3172n782k275q881n839r154K678
12073a575p732J0465m17r659M954Q596J895k57J8273k901l8j212p70L752O321
12058B9695O044j3210N375Q533J8095K088j8203j3717m782n094n129j090L709
12045A2314J832k788K761P606J0029m18k612j0951r508m092o599o931m39J446
$$ plain form
12133 183566 231120 310601 414604 583644 811890 1061721 1315629 1521844 1616164 1597922
12123 1597922 1479313 1259275 1037003 821237 650826 531238 450961 389168 340999 297489
12113 297489 261009 226061 189761 171208 158961 139161 124267 102749 98837 80929 67716 58291
12101 58291 42242 44198 55890 69476 72771 64401 50001 38463 21069 27703 36504 27812 30272
12088 30272 22729 27348 20229 13705 14246 14540 6780 14506 27678 21896 19621 10740 4901 -4253 -1575
12073 -1575 -9307 1158 741 -8918 -3964 4632 6527 6270 24543 21642 21604 20392 19622 23374 29695
12058 29695 35739 22529 27904 36437 54532 56620 38417 24700 19918 14824 9695 8605 12314
12045 12314 14146 11358 14119 21725 31754 31336 28724 17773 8265 4173 -2426 -9357 -9796 -8350
12031h350R328J1809j6317P596O044P411L164r018j3629j7129O179N122R385K584
12017D179o061Q986P949q774N5Q845q786l430q642P680P428P558k437j6292q278
12002a0020m126j0020n612n47J2019J2145n417q777R654J2005J2710N858j3442
11989F430j5880k2351q162K665J143J1637O211K078m159M194o591n299K1814O926
11975F56j406R920j1288k603m805M008P732N447K295j3220L660Q041j0212k1987
11961b3762J066O344P400J4384J5975K84j0930n864R273R869p055l430L834L55
11947A7743j6175j8227m019j0928o407J065J1618Q631R344m776j610M412J0085
11934G56N394M427k110l106J1209o451j4527L300p44O528J63p639O951Q554l629
$$ plain form
12031 -8350 978 12787 -3530 4066 10110 17521 20685 11667 -1962 -19091 -12912 -7790 1595 4179
12017 4179 -1882 7104 15053 6279 6334 15179 6393 2963 -5679 2001 9429 16987 14550 -1742 -10020
12002 -10020 -14146 -24166 -29778 -30325 -18306 -6161 -11578 -20355 -10701 1304 14014 19872 6430
11989 6430 -9450 -31801 -39963 -37298 -36155 -24518 -18307 -16229 -20388 -16194 -22785 -28084 -6270 656
11975 656 -750 9170 -2118 -4721 -9526 -5518 2214 7661 9956 -3264 396 8437 -1775 -23762
11961 -23762 -22696 -16352 -8952 5432 21407 21691 10761 4897 14170 24039 16984 13554 17388 17743
11947 17743 1568 -16659 -20678 -31606 -38013 -36948 -25330 -16699 -7355 -12131 -13741 -9329 756
11934 756 6150 10577 8467 5361 16570 10119 -4408 -1108 -1852 4676 4839 -2800 4151 12705 9076
11919I076J620j6352M035K183m125P076J5865n96q765o648p646p887Q359M859
11905A054n846o68J5729n794o774K557j0458K697j832O268j3480r419K872J6059
11891g035L437K084j76J0394o870n415M36j661L720J550o934N178K483m972m325
11876h106J2707K0282p801r427J344P578j92n170n84m526l71m709K983m332P298
11861F974O874m528j364N231O405j315j1680O488N326j4777j9843R988J0615N436
11847I830j159Q863J338j6001j8847O896O260q865q375J1506o200J562J1945J8499
11833A7252r22j067q349k666o11K176j379o818K796J2839j544J420O391o927j7100
11818d509j4102K565J3528J1829j330m95j306j225q740m786o39K092M739R482
$$ plain form
11919 9076 10696 -5656 -1621 562 -3563 3513 19378 18782 10017 3369 -4277 -12164 -3805 1054
11905 1054 -4792 -5460 10269 4475 -2299 258 -10200 -7503 -9335 -3067 -16547 -25966 -23094 -7035
11891 -7035 -3598 -1514 -1690 8704 1834 -3581 -3145 -4806 -1086 464 -6470 -1292 1191 -3781 -8106
11876 -8106 4601 24883 17082 7655 8999 16577 16385 11215 10631 6105 5734 1025 4008 -324 6974
11861 6974 13848 9320 7956 13187 19592 18277 6597 13085 18411 3634 -16209 -6221 4394 9830
11847 9830 8671 17534 18872 2871 -15976 -9080 -2820 -11685 -20060 -8554 -14754 -13192 -1247 17252
11833 17252 16330 15263 6914 4248 3637 5813 4434 -2384 412 13251 11707 13127 19518 12591 -4509
11818 -4509 -18611 -16046 -2518 9311 7981 7486 6180 4955 -3785 -8571 -9210 -7118 -2379 7103
11804G103q117p300J6503L322j0939o565n181j1565K566J0105J94L329R478L247
11790F180J2280R222j6761L519j3542n116O599J9908R879j4979q208q868O863
11777F976K234j0958o005K441J4813L485l740j310R500o306j289P666Q01l349
11763A4959Q44K301N400O875l00J75p904J136J592p727k267q604j2488N440L862
11748C294n16m31j5191j345K53n801j172K844J5170n56j8630N910J6694n132k13
11733d822J486M536K818Q442J3000r203j4129o709m481Q471Q613m911J2198O352
11719B1661r650l401j4556k629O313M443k4M105k359n164n903n316m036q999M744
11704b0771J2446l341O20r04r158L902J1727J3140N55L160o518K867L896r290
$$ plain form
11804 7103 -1014 -8314 8189 11511 572 -5993 -11174 -22739 -20173 -10068 -9874 -6545 2933 6180
11790 6180 18460 27682 10921 14440 898 -4218 2381 22289 32168 17189 8981 113 6976
11777 6976 9210 -1748 -7753 -5312 9501 12986 9246 7936 17436 11130 9841 17507 18308 14959
11763 14959 15803 18104 23504 30379 30079 30254 22350 23486 25078 17351 15084 6480 -6008 -568 3294
11748 3294 2778 2347 -12844 -14189 -13936 -19737 -20909 -18065 -2895 -3451 -22081 -16171 523 -4609 -4822
11733 -4822 -3336 1200 4018 12460 25460 16257 2128 -4581 -9062 -591 8022 3111 15309 21661
11719 21661 12011 8610 -5946 -8575 -2262 2181 2157 6262 3903 -1261 -7164 -12480 -16516 -25515 -20771
11704 -20771 -8325 -11666 -11046 -11950 -21108 -17206 -5479 7661 8216 11376 4858 7725 11621 2331
11690B331p361J8440K021o741l05K656n674j2690m455N385M181l87n308J1416
11676C509J2389J0596n45k4074r801O67N887P360m596q566p75J3909J2542r889
11662H613j9210K343k414q059j36J4667m98j3316o577J0640J7858k787n389N013
11648G48k531q126M988l863q636J7735Q190j5756j8073N318J3741J3677L104o723
11634C793P75r291n246L376N373p702j5377J8160K1992j57o30k07j2276k755r050
11619i222J1522j940j1831m63N726j482k326Q560R26J434j688K615L944Q64L212
11604I851j609l742j0602J0968J3931P943q658j3749n6P99Q951O26j2682p604
11590e633k681J278J4043J8309j0612j2668l571o528n415o888O911N609N598m176
$$ plain form
11690 2331 -5030 13410 15431 8690 8385 11041 5367 -7323 -11778 -6393 -2212 -2599 -7907 3509
11676 3509 15898 26494 25949 1875 -7926 -7259 -1372 5988 1392 -7174 -7949 5960 18502 8613
11662 8613 -10597 -8254 -10668 -18727 -18863 -4196 -4694 -18010 -24587 -13947 3911 1124 -4265 748
11648 748 -1783 -9909 -4921 -8784 -17420 315 8505 -7251 -25324 -20006 -6265 7412 10516 3793
11634 3793 4568 -4723 -9969 -6593 -1220 -8922 -24299 -6139 15853 15696 15066 14859 2583 -172 -9222
11619 -9222 2300 360 -11471 -11934 -6208 -7690 -10016 -1456 -530 904 -784 1831 5775 6639 9851
11604 9851 8242 4500 -6102 4866 18797 26740 18082 4333 4277 5076 14027 14653 1971 -5633
11590 -5633 -8314 -7036 7007 25316 14704 2036 -1535 -8063 -13478 -20366 -13455 -7846 -2248 -6424
11576f424k878l255n193O626O890Q561j0676k995Q921j0019j5038J2959L793m228
11562a2956M535j960r789N121J0377O350J398l699l070O370P250N232M89L475
11548A9123N338k822l1467O14J0561J0042q741j5776m343M957O927M514o085n258
11534a2416P399l60O085J7069J0844j1224J728M945j7057j5296N48r055p932J3618
11520a1104J31Q537J2468k4366o783R619m172J0149J0786r179j5500J7270K0377
11507A8233l421j0462p861l99j1959R625L920j1156j0962j634n353k631Q480J5756
11493i824J1473Q81j9110o783J5108m061j8211J0761J8341R406m776k687o078
11480e560J9026l367o779n503R622k722j7847p600J9732q655j7188Q322P072P026
$$ plain form
11576 -6424 -9302 -12557 -17750 -11124 -4234 4327 -6349 -9344 -423 -10442 -25480 -12521 -8728 -12956
11562 -12956 -8421 -10381 -20170 -15049 -4672 1678 3076 -623 -3693 2677 9927 15159 15648 19123
11548 19123 24461 21639 -9828 -9214 1347 11389 2648 -13128 -17471 -12514 -5587 -1073 -7158 -12416
11534 -12416 -5017 -5377 708 17777 28621 17397 19125 24070 7013 -8283 -7735 -16790 -24722 -11104
11520 -11104 -10973 -2436 10032 -14334 -21117 -11498 -15670 -5521 5265 -3914 -19414 -2144 18233
11507 18233 14812 4350 -3511 -3910 -15869 -6244 -2324 -13480 -24442 -26076 -31429 -34060 -25580 -9824
11493 -9824 1649 2530 -16580 -23363 -8255 -12316 -30527 -19766 -1425 7981 3205 518 -5560
11480 -5560 13466 10099 3320 -2183 7439 4717 -13130 -20730 -998 -9653 -26841 -18519 -11447 -4421
11466d421j62l997J2543R509m815o708q462J1305n966M675J9367K194l990r407
11452A1665j0889q56r037J1313J7043K278j3632k3490m961R315N924J3757k386
11439F044j8926l542K844K495K12K91j5815q25J7737N369p685l050P988J3007
11425F144L668j582n70j3845J670j502j0891K139O00O848R68o805L21l741k781
11410a9359O273p371n817J1019J0396J0571L107j4694L286j219q214l211r229
11397b4462q769J1490J2617M250K899n998j432n147M065Q809j8240o979K6131
11384g66R836K770P083r864j9385J2102J1360m76j0678p918n098O047m976R678
11370b85Q278L789o982N947N582J732r412q580o581p487L261j639l87N919m486
$$ plain form
11466 -4421 -4583 -8580 3963 13472 8657 1949 -6513 4792 -1174 3501 22868 25062 21072 11665
11452 11665 776 -80 -9117 2196 19239 21517 7885 -15605 -20566 -11251 -5327 8430 6044
11439 6044 -12882 -16424 -13580 -11085 -10873 -10582 -26397 -27222 -9485 -4116 -11801 -14851 -6863 6144
11425 6144 9812 8230 7660 -6185 -4515 -6017 -16908 -14769 -14169 -7321 -6353 -13158 -12837 -16578 -19359
11410 -19359 -13086 -20457 -26274 -15255 -4859 5712 8819 -5875 -2589 -3808 -12022 -15233 -24462
11397 -24462 -33231 -21741 -9124 -4874 -1975 -7973 -9405 -14552 -10487 -1678 -19918 -26897 -766
11384 -766 9070 11840 18923 9059 -10326 1776 13136 12660 1982 -5936 -11034 -4987 -9963 -285
11370 -285 7993 11782 4800 10747 16329 18061 8649 69 -6512 -13999 -10738 -12377 -12764 -6845 -11331
11355a1331k482j671j657R833J0430o713q344J0701O391k824K365J7449J2475
11342C4622j0272k4261l049r549o572J850M300L630k96q876J556J0133J3453k123
11328D546j4129R282J4572j116j2125l997L635j1083o304M88R578J0704L175N84
11314G810j6361n545K0378q622r894m600J6485J5816j5114j42R577n730J0934
11301A4992J2880J76j3210k1689n369r824J364J4643O949L314o892O62k380j702
11287f086J3693J3132j409p286l055L755p605m238j0252j0214o589m57P707J2167
11273f737Q097n365j3074j2901P895j860L321P259r798q269O135J1975J1518O82
11259a122p26j576Q892R117j0101j0957j1728L499J2100n777m359NL961j0873
$$ plain form
11355 -11331 -13813 -15484 -17141 -7308 3122 -3591 -11935 -1234 5157 2333 4698 22147 34622
11342 34622 24350 89 -2960 -12509 -19081 -17231 -12931 -9301 -9597 -18473 -16917 -6784 6669 4546
11328 4546 -9583 -301 14271 13155 1030 -2967 668 -10415 -16719 -16231 -6653 4051 7226 7810
11314 7810 -8551 -14096 6282 -2340 -12234 -16834 -349 15467 353 211 9788 4058 14992
11301 14992 27872 28048 14838 -6851 -12220 -22044 -20680 -6037 912 4226 -2666 -2004 -4384 -6086
11287 -6086 7607 20739 19330 12044 8989 12744 5139 901 -9351 -19565 -26154 -26611 -18904 -6737
11273 -6737 1360 -4005 -17079 -29980 -22085 -23945 -20624 -13365 -23163 -31432 -25297 -13322 -1804 -1122
11259 -1122 -1848 -3424 5468 14585 4484 -6473 -18201 -14702 -2602 -8379 -12738 -12733 -8772 -19645
11245a9645k356K703J4089Q138J73j4473K647l400k410N240p818m737J0219J1507
11231a23M902q786L542K465k553L965k129j6344L833j2158L096J4298n922P479
11217d435j824r223P628J8134P794r993Q56K176j1070j2178J2169J1873n079r780
11203b952o341j2826N492n413J4408J1945m726r684l932q03k282r080J6680Q758
11189g56J3311J334j447P401j4300j0644j0890J600J1655l492q983O87M936J800
11175g788L30l212j3331p949P176K0225J2033p200L813K973L940R062n172p931
11161F969K732j3533m805m613K3513R139N653q399o361j1335p279k456R309K293
11147H27k613l72l744j08O022k500l011o525K674J0042N41P560J5538n405n703
$$ plain form
11245 -19645 -22001 -19298 -5209 2929 3102 -11371 -8724 -12124 -14534 -9294 -17112 -21849 -11630 -123
11231 -123 4779 -4007 -465 2000 -553 3412 1283 -15061 -11228 -23386 -20290 -5992 -11914 -4435
11217 -4435 -6259 -15482 -7854 10280 18074 8081 8937 11113 43 -12135 34 11907 6828 -2952
11203 -2952 -9293 -22119 -16627 -22040 -7632 4313 -413 -10097 -14029 -14832 -17114 -26194 -9514 -756
11189 -756 12555 13889 12442 19843 5543 -5101 -15991 -14391 -2736 -6228 -15211 -14524 -9588 -7788
11175 -7788 -7458 -10670 -24001 -31950 -24774 -4549 7484 284 4097 7070 11010 20072 14900 6969
11161 6969 9701 -3832 -8637 -13250 10263 19402 25055 16656 10295 -1040 -8319 -10775 -1466 827
11147 827 -1786 -2158 -5902 -6010 12 -2488 -5499 -12024 -9350 692 1233 8793 24331 18926 13223
11132A3223l554n229l908j4626J418P361j725j356N553N512K271O7Q981N518n330
11117A4176j372j3805M148P297O357L159k582O234J382n147p526O023O493q168
11103A6669j0779L074l706J0709O731j0606O705Q825M232R44j5378j6214P312
11090H518j6851j4723P664Q869m955P720J5479O697J1688q226k425k948n498j77
11076A0832j1850L550O969m705k015L97n833M339K4893K586j0863l107m192m593
11062F408n433r002M441J4168o927q787m988J1112m062l353M835O422p352p680
11048a0198O252j2749p63O939J9835J7646j48j3154n147n507j176l650j1064N417
11034g467J197j1873k210N341L783K794K394N44R981O506K720p428J7626p603
$$ plain form
11132 13223 9669 4440 532 -14094 -12676 -5315 -7040 -8396 -2843 2669 4940 5007 13988 19506 14176
11117 14176 12804 -1001 3147 10444 16801 19960 17378 23612 24994 19847 12321 18344 24837 16669
11103 16669 5890 8964 5258 15967 22698 12092 18797 27622 31854 32798 17420 1206 8518
11090 8518 -8333 -23056 -15392 -6523 -11478 -3758 11721 18418 30106 21880 19455 16507 11009 10832
11076 10832 -1018 2532 9501 4796 2781 3178 -2655 1684 26577 29163 18300 15193 11001 6408
11062 6408 975 -8027 -3586 10582 3655 -5132 -10120 992 -3070 -6423 -1588 4834 -2518 -10198
11048 -10198 -3946 -16695 -17458 -10519 9316 26962 26814 13660 8513 3006 1830 -1820 -12884 -7467
11034 -7467 -6270 -18143 -20353 -15012 -11229 -8435 -6041 -5497 4484 10990 13710 6282 23908 16305
11020A6305j7358n60J747P313q506O860N661p062R86P738N779o750m211j0578
11006b636j759J838J294L886p86N786m560l225P499m002q961L408J6621N853j7254
10991C002m696j721M160n018j0994r17N923l078o138O829J684K387k626J2987
10977A784J8155o58j8317q647J7426M445r46j4519r298L52p892k351j0742N348
10963b5860P069j833K304P729K119R076o085R00j247p77O910k530j1338Q417L285
10948a861J227Q796n641j5086j0768j6697O29Q389J0058L296R262m832J818Q907
10934b503J0727R231o507p320P087J899m397o833Q422M822j3713j2435m082M627
10920a0975L058J6000k77j954o301j747N541O87O58R487l834M094L58p21J7124
$$ plain form
11020 16305 -1053 -1613 134 7447 -1059 5801 11462 4400 5386 13124 18903 12153 7942 -2636
11006 -2636 -4395 -2557 -1263 2623 1837 7623 3063 -162 7337 3335 -5626 -2218 14403 20256 3002
10991 3002 -1694 -3415 745 -4273 -15267 -16184 -10261 -13339 -19477 -12648 -10964 -8577 -11203 1784
10977 1784 19939 19281 964 -7683 9743 14188 13242 -1277 -10575 -10223 -18115 -20466 -31208 -25860
10963 -25860 -18791 -20624 -18320 -10591 -8472 604 -5481 -4581 -5828 -6605 305 -2225 -13563 -5146 -1861
10948 -1861 -634 8162 2521 -12565 -23333 -40030 -39401 -31012 -20954 -17658 -8396 -13228 -11410 -2503
10934 -2503 8224 17455 10948 3628 10715 12614 8217 1384 9806 14628 915 -11520 -15602 -10975
10920 -10975 -7917 8083 7806 5852 -449 -2196 3345 4032 4690 14177 10343 14437 14795 14074 31198
10905C1198J0978j6874q549k745K281J9961q634r451K0268k051j4884m798N098
10892B1798k985J779P456q289J541P247J491j0412j0347p493r436R258J5165q783
10878G990k729M791n72j5129j7838O667J3464m944L756J49J3744J0054J9246o033
10864C2616k0029n201l616l789j489l364P285J5708P319P909r446mQ396J3495
10850D5790o949n757k468p601q391l024K093l922j13J4179l814j4117j914P429
10836A1421P946J608m04M624j2722P738O459O73P727Q510p431j9558m739M20k58
10821A2014Q706N465k304r857O523q295P575J1710K293o717m656j008n506j4914
10807A029R683J9081J842L357l749j0245j2930l086j4398R019J2041Q50m970n596
$$ plain form
10905 31198 42176 25302 16753 14008 16289 36250 27616 18165 38433 36382 21498 16700 21798
10892 21798 18813 20592 28048 19759 21300 28547 30038 19626 9279 1786 -7650 1608 16773 7990
10878 7990 5261 10052 9480 -5649 -23487 -16820 -3356 -8300 -4544 -4395 9349 19403 38649 32616
10864 32616 12587 7386 3770 -19 -1508 -4872 2413 18121 25440 33349 23903 23899 32295 45790
10850 45790 38841 33084 30616 23015 14624 11600 13693 9771 9658 23837 20023 5906 3992 11421
10836 11421 19367 20975 20571 25195 12473 20211 26670 27343 35070 43580 36149 16591 11852 12272 12014
10821 12014 20720 26185 23881 14024 20547 12252 19827 31537 33830 27113 22457 21449 15943 1029
10807 1029 10712 29793 31635 34992 31243 20998 8068 4982 -9416 -397 11644 12494 7524 1928
10793A928l786J0235P282O918j3060r303L410k003M355n314J5342O049N04j1692
10779A0865j9599q778O868Q868J3028N700j980R074r972K260K033J5439k481j7718
10765A3607k1386Q152J9055M635n288O155j1243j3827J914P115q477n117J276
10752c429J1888J1983O168m29o446j4175P565m472j5340L677o867O719J6626J3651
10738B7119l411k1557k740J886j3309P346J5127Q631L23j2343j1678Q597N499
10725I490j1509k371k995J2506P592L865p319O348N547j7845j6946O282M402p157
10711a0110M129j5171J857K671r79P134J5590L128P731j4515j1294M223l22J0507
10697D579L937j793n102J852R738k887j3128N723j022j1019q435j409L862P497
$$ plain form
10793 1928 -1858 8377 15659 22577 9517 214 3624 1621 5976 662 16004 22053 22557 10865
10779 10865 -8734 -17512 -10644 -1776 11252 16952 14972 24046 14074 16334 18367 33806 31325 13607
10765 13607 -7779 373 19428 24063 18775 24930 13687 -140 1774 8889 412 -4705 -3429
10752 -3429 8459 20442 26610 26181 19735 5560 13125 8653 -6687 -3010 -9877 -3158 13468 27119
10738 27119 23708 2151 -589 1297 -12012 -4666 10461 19092 19415 7072 -4606 3991 9490
10725 9490 -2019 -4390 -7385 5121 12713 16578 9259 15607 21154 3309 -13637 -7355 -2953 -10110
10711 -10110 -5981 -21152 -19295 -16624 -17603 -10469 5121 8249 15980 1465 -9829 -5606 -5928 4579
10697 4579 8516 6723 1621 3473 13211 10324 -2804 2919 1897 -9122 -17557 -18966 -15104 -7607
10683g607L2314J0530k790j8478j2110o685k815J6016q028o071N904n696n895
10670a1411R177J5029Q052M96n416j3988j3302o621M781l679J2052M381q651N039
10656d061R906m809o000m772n756q619J5856M164m042N649n88j6045m315Q296
10642a5136o689l12N278J3010R802J2007n541o282j3038k202M387J339O485J274
10628D382j6542L408J7188j295M023J4014K832r216p745p599O920J2091n147r730
10614G584j3543j615J0388Q092M096n240j473l732k49j0703j2992j09J1983K3256
10600A5743j785n151o227o24n465n491j0402p051K821K702N095J0068N757k224
10586b234M195m809o67q568M11q630k3670R893J9127K119l140P802J1912J3569
$$ plain form
10683 -7607 24707 35237 32447 13969 1859 -4826 -7641 8375 347 -5724 180 -5516 -11411
10670 -11411 -2234 12795 20847 21343 15927 1939 -11363 -17984 -13203 -16882 -4830 -449 -9100 -4061
10656 -4061 5845 1036 -4964 -9736 -15492 -24111 -8255 -4091 -8133 -2484 -3072 -19117 -23432 -15136
10642 -15136 -21825 -22137 -16859 -3849 5953 17960 12419 6137 -6901 -9103 -4716 -3377 3108 4382
10628 4382 -12160 -8752 8436 7141 11164 25178 28010 18794 11049 3450 10370 22461 17314 7584
10614 7584 -5959 -7574 2814 10906 15002 9762 8289 4557 4308 -6395 -19387 -19496 -7513 15743
10600 15743 13958 8807 2580 1956 -3509 -9000 -19402 -26453 -23632 -20930 -15835 -5767 -10 -2234
10586 -2234 1961 -2848 -3515 -12083 -11672 -20302 -43972 -34079 -14952 -12833 -15973 -8171 3741 17310
10572A7310k57j3683M526L331L360r563j873J1945J1930k226j667j1386q713M625
10558G659p222m213K056l271Q046O489J962L598O462l919j1448k536j66J362j2710
10543g851o255j17P538m269J4752j274j9013r88O481K361J5594J5905p399k3736
10529h271J1494P346n664O239o189j3901L665l384K149J215K149P623P923j2793
10515c99q63j283j1487J1454N604k3460J22J7530J1730j128k411p337J407J4995
10501A4474j687M284o80p655l575L777j0029j5369M72k629K1637J0574J392K723
10487A7709r770j9902o47j4689n163m210R551N229k54J8275K910p979Q88J792
10473f260K512j0362o723J4557J087j909P328P819j2264o622Q809K133m753k27
$$ plain form
10572 17310 17053 3370 7896 11227 14587 5024 3151 15096 27026 24800 23133 11747 3034 7659
10558 7659 437 -3776 -1720 -4991 3055 9544 11506 15104 21566 17647 6199 3663 3497 4859 -7851
10543 -7851 -14106 -14223 -6685 -10954 3798 2524 -16489 -17477 -10996 -8635 6959 22864 15465 -8271
10529 -8271 3223 10569 4905 11144 4955 -8946 -5281 -8665 -6516 -5301 -3152 4471 12394 -399
10515 -399 -1262 -2545 -14032 -2578 3026 -20434 -20312 -2782 8948 7820 5409 -1928 -521 14474
10501 14474 12787 17071 16391 8736 5161 8938 -1091 -16460 -15988 -18617 3020 13594 14986 17709
10487 17709 7939 -11963 -12610 -27299 -32462 -36672 -27121 -21892 -22146 -3871 -961 -8940 -8052 -6260
10473 -6260 -3748 -14110 -20833 -6276 -5189 -7098 230 8049 -4215 -10837 -2028 105 -4648 -4875
10459d875J557R95j101j1941R316L368P76k724P199N542j4884J9168j3486r357
10445a0447l458j0257N480J9026J1882j1511j1182q355j0802J705K2439j3330
10433a8810j0629O367P697n92N836J7564R152n79j3345k729Q782k714J1396J0986
10419B8382p949N76J82J6813J0119j9255q40J788O04J693j8815p442R012L899
10405A8767j2769o13j2127j911R71J476M724j95N363m032j0074q585j4440J2517
10391b0928J4044M878o611J6405J0277n900o738Q943j3144p880j3182j0522P014
10378b3344oO940K592r04J855j0509J5485m967n17Q230j2287L900j791M598L311
10363g414K2444P095j5424n344m035P594J1065j6121j4010K0353J9965j2266l10
$$ plain form
10459 -4875 -3318 -2323 -3424 -15365 -6049 -2681 -1905 -4629 2570 8112 -6772 12396 -1090 -10447
10445 -10447 -13905 -24162 -18682 344 12226 715 -10467 -18822 -29624 -27919 -5480 -18810
10433 -18810 -29439 -23072 -15375 -15967 -10131 7433 16585 16006 2661 -68 8714 6000 17396 28382
10419 28382 20433 21009 21191 38004 48123 28868 28028 29816 30420 32113 13298 5856 14868 18767
10405 18767 5998 5385 -6742 -8653 -7682 -6206 -1482 -1677 3686 -346 -10420 -19005 -33445 -20928
10391 -20928 -6884 -2006 -8617 7788 18065 12165 5427 14370 1226 -6654 -19836 -30358 -23344
10378 -23344 -23350 -16410 -13818 -14722 -12867 -23376 -7891 -12858 -13375 -5145 -17432 -13532 -15323 -10725 -7414
10363 -7414 15030 22125 6701 1357 -2678 4916 15981 -140 -14150 6203 26168 13902 13592
10350A3592P250J4811o616k3073j6334p18J5020O504p288K732n699j4881J065
10337a3635J3183M210r30J2046J0174o414p762r503o468K623O442O41R625p562
10323F670q235m886P730O14n617j4717J2762L324J2203K6808j727j3950q530J8157
10309C0606Q163j6591o344M365O740N704N870r549j0354O003p223r631k388M713
10295A0084p755p463R276p2M739J0345L340O999r295n431J394J2772j4801K100
10281A6232j592j6420q159J9267J3316K8q33J283k712P596r810p557j1218N303
10267D724J2451j3769l111l328J3890J2823m836l945o265P492J9310J3087j1163
10254C7360j5857p591N411J930p264J545Q471n100m318l310O599R016j3060L831
$$ plain form
10350 13592 20842 35653 29037 5964 -10370 -11088 3932 10436 3148 5880 181 -14700 -13635
10337 -13635 -452 3758 2828 14874 25048 18634 10872 1369 -5099 -2476 3966 4607 14232 6670
10323 6670 -1565 -6451 1279 1893 -3724 -18441 -5679 -2355 9848 36656 34929 20979 12449 30606
10309 30606 38769 22178 15834 20199 26939 32643 38513 28964 18610 24613 17390 7759 5371 10084
10295 10084 2329 -5134 4142 4070 8809 19154 22494 29493 20198 14767 16161 28933 14132 16232
10281 16232 14640 -1780 -9939 9328 22644 22672 21839 23122 20410 28006 18196 10639 -579 4724
10267 4724 17175 3406 295 -3033 10857 23680 18844 14899 8634 16126 35436 48523 37360
10254 37360 21503 13912 19323 21253 13989 15534 24005 18905 14587 11277 17876 26892 13832 17663
10240A7663J0650M588O385k2482k8808M472J5109K0519j7488j2708O690Q774m662
10227H702P198j154j4417j71P602K0798P889j042j5337j3022j883N350K444J3238
10213B6195L701j6882j4040l370o389k917J2165K4718q629j2683O015L371J5538
10200B6793J0378j2394L073O292j417J025j2420j3809p913l045J377K173J060
10187A173R125N966m903J0161k15N795J3111N689M102k040j3670k442j683K590
10173C2759J0154j2445r098n177O112K364K83j2162J1832l42n013o876n566M948
10159A1773j952l607J769J1081N881o729k023N007l723r192O174J3461m289k4397
10145g66n264P893m141k506J3795r97r50o44M190P192Q476O912n420k22N667j5344
$$ plain form
10240 17663 28313 32901 39286 16804 -12004 -7532 7577 28096 10608 -2100 4590 13364 8702
10227 8702 15900 14746 329 158 7760 28558 36447 35405 20068 7046 5163 10513 12957 26195
10213 26195 29896 13014 -1026 -4396 -10785 -13702 -1537 23181 14552 1869 7884 11255 26793
10200 26793 37171 24777 27850 34142 32725 33750 21330 7521 -392 -3437 -2060 113 1173
10187 1173 10298 16264 11361 21522 21307 27102 40213 45902 50004 47964 34294 31852 30169 32759
10173 32759 42913 30468 21370 16193 22305 24669 24952 12790 24622 24280 19267 12391 6825 11773
10159 11773 9821 6214 7983 19064 24945 18216 16193 21200 17477 8285 14459 27920 23631 -766
10145 -766 -6030 1863 -2278 -4784 9011 8014 7064 6420 10610 17802 26278 33190 27770 27548 33215 17871
10129A7871j2147J119M533o456j3125J418J83Q240q24J9378J0758p501r521k777
10115A1149M674r674l855N427j654j5838q040N196K2996J2928m911j5642J0683
10102A3439K053n594k640O028M076N216m191k784J538j579R426J5980o233O813
10088D1548n943j8558j9988O03J1000J6P906O061p612o493m845M779J068L224
10074A2766J68p918l717J504J3918q299j0479r57J3937J2207m721k797n805M360
10060A4167K6234K82o807j102n97P396N338m680k8352n655K5484K470m634J1701
10046D1245K643j5010o913k612k859n598K3047J1795j773k0281j0295k341l771
10033G277J960l058j5172Q433M471p894q739n80J6693J1298r906l831o470j876
$$ plain form
10129 17871 5724 6843 11376 4920 -8205 -6787 -6604 1636 812 20190 30948 23447 13926 11149
10115 11149 15823 6149 2294 7721 6067 -9771 -17811 -12615 10381 23309 18398 2756 13439
10102 13439 15492 9898 7258 13286 17362 22578 18387 15603 17141 15562 24988 40968 34735 41548
10088 41548 35605 17047 -2941 -2338 8662 8678 16584 22645 15033 8540 3695 8474 9542 12766
10074 12766 12934 5016 1299 2803 16721 8422 -2057 -3014 10923 23130 18409 15612 9807 14167
10060 14167 40401 40683 33876 32774 32177 39573 44911 40231 11879 6224 31708 34178 29544 41245
10046 41245 43888 28878 21965 19353 16494 10896 33943 45738 43965 23684 13389 11048 7277
10033 7277 9237 6179 -8993 -560 3911 -3983 -12722 -13302 3391 14689 4783 952 -5518 -7394
10019g394J0327K0777L931j8485l497j2624m855Q305k529J3092P892J0703n87
10006B5056k969R025P767K42p360q939l018N287n684K92L13Q439p498Q014J55
9991B9122n082O449j3844L537Q129J1551l975k4127j2723L093O340J7o579J52
9977B060K403M162J4877j120k1740r941n05M067o132j5735K1630J6889J8820J679
9963C1414k474k144o473m631p054L032K027l993J2415J79k394r114R849M429q047
9948A7021K867K360j8898K819K0871J361m540o599o769O896J767K622j350m774
9934A5654N388L095o591n104M644K8490p180r271J4565N86j2482q854L669j0421
9920A6188p033R902J1738N608R961K475j6132j2542O588J330j851J313J3813q293
$$ plain form
10019 -7394 2933 23710 27641 9156 5659 -6965 -11820 -3515 -6044 7048 14940 25643 25056
10006 25056 22087 31112 38879 39121 31761 22822 19804 25091 19407 19699 20012 28451 20953 28967 29122
9991 29122 24040 30489 16645 20182 28311 39862 35887 11760 -963 2130 8470 8487 1908 2060
9977 2060 4463 8625 23502 22382 642 -9299 -9804 -5737 -11869 -27604 -5974 10915 29735 31414
9963 31414 28940 26796 20323 15692 8638 11670 13697 9704 22119 22298 19904 10790 20639 25068 17021
9948 17021 19888 22248 3350 6169 27040 28401 23861 17262 10493 17389 19156 21778 20428 15654
9934 15654 21042 24137 17546 12442 17086 45576 38396 29125 43690 44276 31794 22940 26609 16188
9920 16188 9155 19057 30795 36403 46364 48839 32707 20165 26753 28083 26232 27545 41358 33065
9906C3065P005K613j0457j433M959o362l811Q381n85j5520k1491L143R698K5280
9892C4485R086j8840K237O152r657k374j438N745N025q819L266M701K127O890
9878C8586R370M923O602k2149j6123O748J0357j0605L932R509o522K849J6801
9865E4278r714j7285K507R871R995O723K110K61J62R146K4148J4969r209j1258
9851H6704j0218j3174N17K513j479n704k0620N754J25n84L132J0028j568L698
9837E9124o937R252O978J493n288j524k3571j3799L163L222j051k831M74J6738
9823D5443O973N066J680q292J763l946j4629J4427P049p969J0679j057m876k0398
9809C1913p371l67j0122m781n137L134O043J3897Q898K496J2655J380j2822r670
$$ plain form
9906 33065 40070 42683 32226 30793 35752 29390 25579 33960 33375 17855 -3636 -493 9205 34485
9892 34485 43571 24731 26968 33120 23463 21089 19651 25396 30421 21602 24868 29569 31696 38586
9878 38586 47956 52879 59481 37332 21209 27957 38314 27709 31641 41150 34628 37477 54278
9865 54278 44564 27279 29786 39657 49652 56375 58485 58746 58908 68054 92202 107171 97962 86704
9851 86704 76486 63312 63829 66342 64863 59159 38539 44293 44418 43834 46966 56994 55426 59124
9837 59124 52187 61439 68417 69910 64622 63098 39527 25728 28891 32113 31062 28231 28705 45443
9823 45443 52416 57482 59162 50870 52633 48687 34058 48485 55534 47565 58244 57187 52311 31913
9809 31913 24542 24175 14053 9272 4135 7269 13312 27209 36107 38603 51258 52638 39816 30146
9795C0146m199Q409J7460n408P719P956Q590J3385o332k0632q166J1438M886N116
9781G0368j5204n923O727L435R877J2267K148j5605K463J7836J3322K402o068
9768I8045j138K6363J9729r300j4210j7785K54J6585J4438J8026k579J4760K027
9755A65215K70J3856N727K2665N9242K6854O379J3417M0095L5114K9753M5689
9743D64276P0362Q0678R8484J18667J30136J81823K14419K61495L30924L87935
9733B339199M06243M04893L67157K63214R8353p3047j97987l06582l65670l52505
9723B583268l12563k67931k16750j99030j72414j45083j36835j28006j27917r5919
9713G80820q5378o8157n2475n6479m8795m4730l9825l3159k0151l4698l6133k9082
$$ plain form
9795 30146 25947 34356 51816 46408 54127 62083 70673 84058 77726 57094 48928 60366 65252 70368
9781 70368 55164 49241 55968 59403 69280 81547 83695 68090 70553 88389 101711 104113 98045
9768 98045 96907 123270 142999 133699 119489 101704 101958 118543 132981 151007 148428 163188 165215
9755 165215 165485 179341 185068 207733 266975 293829 300208 313625 353720 388834 418587 464276
9743 464276 534638 615316 713800 832467 962603 1144426 1358845 1620340 1951264 2339199
9733 2339199 2745442 3150335 3517492 3780706 3879059 3806012 3608025 3301443 2935773 2583268
9723 2583268 2270705 2002774 1786024 1586994 1414580 1269497 1132662 1004656 876739 780820
9713 780820 695442 627285 574810 518331 469536 424806 384981 351822 331671 296973 260840 231758
9701B31758j6668j4635j1049r705j4628j6866j4199j1061P556n215l482o711q680
9688A06415l0942j6166J4219k195k1065N037P469j2087j3345o055J0607K800n892
9675C8800L98K778p07r687J0954N603R313J2341m114j0780r960j2938j5527r672
9661F802J3307O679j356n723j80n463K1547J1638K470q298p914L050O401j132
9647D1828j7700n317j712M263j390j3668O494l178r631K118K104J4928P895p665
9633A9369m780j4081K294j0288M287J5312M244O046r263K819n856L7O667j221
9619A5586N00l0l247n339m983M508k486J795O497J934k771q447m175N286k70j2886
9603h528J3864J5635m222l00M021K16M810J872m905p59N573m728j1439o40J765
$$ plain form
9701 231758 215090 200455 189406 179701 165073 148207 134008 122947 130503 125288 121806 115095 106415
9688 106415 75473 59307 73526 71331 50266 55303 62772 50685 37340 31285 41892 44692 38800
9675 38800 39198 41976 41269 31582 42536 48139 57452 69793 65679 54899 44939 32001 16474 6802
9661 6802 20109 26788 25432 19709 19529 14066 35613 47251 49721 41423 33509 36559 42960 41828
9647 41828 24128 18811 17099 21362 19972 6304 12798 9620 -11 2107 4211 19139 27034 19369
9633 19369 14589 508 2802 -7486 -3199 12113 16357 22403 13140 15959 10103 10140 16807 15586
9619 15586 16086 16056 12809 7470 2487 6995 4509 6304 12801 14735 11964 3517 -658 4628 4358 -8528
9603 -8528 5336 20971 16749 16449 20470 20686 25496 27368 22463 21704 27277 22549 11110 10470 12235
9588A2235L609M846p741n647L693l265j3208r961O923K1294J2199r934j7758K312
9574d03J3196K432j294n243M292j124p379j524Q709P955n668J6J843L073l574
9559A5307o163k224m905J5177K534k0720j8148J4248J5565Q156J404L238O934
9546C0403p176j0647k757j2176j7636O934M02J3324J2937l670j9965L646J8847
9533A2466m551j3676M123K290p04Q92r604J057O613J1943J258k2451L874N976
9519d94K144j059l471j2015K921J9977M397p453p993P594J876om763K42n044M447
9503A300M04O434m164j5558p0o228R533l309j1537l536O570K4795K4781j3917
9489A5498n062j3979l073R197L541j5734j3056R530J5374k752K45M178J81o598
$$ plain form
9588 12235 15844 20690 12949 7302 10995 7730 -5478 -15439 -8516 12778 24977 15043 -2715 -403
9574 -403 12793 15225 13931 8688 12980 11856 4477 2953 11662 19617 13949 13965 15808 18881 15307
9559 15307 9144 6920 2015 17192 19726 -994 -19142 -4894 10671 18827 20231 23469 30403
9546 30403 23227 12580 9823 -2353 -19989 -13055 -12653 671 13608 9938 -10027 -6381 12466
9533 12466 7915 -5761 -1638 652 -52 840 -8764 -7707 -1094 10849 12107 -10344 -6470 -494
9519 -494 1650 591 -2880 -14895 -11974 8003 12400 4947 -3046 4548 6424 6418 1655 1897 -3147 1300
9503 1300 1704 8138 3974 -11584 -11654 -17882 -8349 -11658 -23195 -26731 -20161 4634 29415 15498
9489 15498 10436 -3543 -6616 2581 6122 -9612 -22668 -13138 2236 -516 -271 3907 4088 -2510
9475b510m479O624L719j572j748r340n845J3674M598k626l227q824N347j954M156
9460d007R799r206M295J0389Q522L899P327N973j2376j0557j5706j0582R092O528
9446C390P723J463M96K46o141o50N898P75J389j3356j1021N682j760M684R861
9431H679J1455J509K120J955j189j67l464q939M770K0188L060r434m081J850j3515
9416A4797k1248J1210Q753R010M377m203p496J109P176r064n051J089j759J02
9402H802J0094n35r583o018r591R81J8739K600K594K982J765L610q068j1422l50
9387F600p230m901p290O46M044j190p20J0429L278L492M602k4970j3098p329R951
9372b3686N467K436M728O491J1833R072r406l304k904J603J542j363l362k329
$$ plain form
9475 -2510 -6989 -365 3354 1782 34 -9306 -15151 -1477 3121 495 -2732 -11556 -6209 -8163 -4007
9460 -4007 5792 -3414 881 11270 19792 23691 31018 36991 24615 14058 -1648 -12230 -3138 3390
9446 3390 11113 12576 13072 13318 7177 6527 12425 13200 14589 1233 -9788 -4106 -5866 -1182 8679
9431 8679 20134 21643 23763 25718 24529 24362 20898 11959 16729 36917 39977 30543 26462 28312 14797
9416 14797 -6451 4759 13512 22522 26899 22696 15200 16309 23485 14421 9370 10459 8700 8802
9402 8802 18896 18361 8778 2760 -6831 -5850 12889 15489 18083 21065 22830 26440 18372 6950 6600
9387 6600 -630 -5531 -12821 -12175 -8131 -9321 -10041 388 3666 7158 11760 -13210 -26308 -33637 -23686
9372 -23686 -18219 -15783 -11055 -4564 7269 16341 6935 3631 727 2330 3872 2509 -853 -3182
9358c182R9Q631L895r22o868j0237M897K871n873K145J090N258n24r208N589o971
9342i310n538l050O922J5568Q110J7416M098j4801n556k869J3404p232l129Q768
9328B2801n000m683j2189R620L631k008l195m839o236O564J630J368l194k549
9314A721o133k071R146n1l520j681J3494o766Q352Q727J2609K787N664K4208J3472
9299G9958M342R937m244n586j1716j7200j4492j2310K716O242P092J2715L783
9286F1237K0493j85Q06P657Q049j0140k1561K136L613m363J821J3259J4510J78
9272I7510k2327M837M508j096o542Q907J0700K4833L5888L7723K6372J3520m915
9259B29918j5826k1269l5984j6559j3150m781J278o843k7888j5821l708j2221
$$ plain form
9358 -3182 -3083 5548 9443 8521 1653 -8584 -3687 -816 -6689 -4544 -3454 1804 1280 -7928 -2339 -9310
9342 -9310 -14848 -17898 -10976 4592 12702 30118 34216 19415 13859 10990 24394 17162 14033 22801
9328 22801 17801 13118 929 10549 14180 12172 8977 4138 -2098 4466 6096 7464 4270 1721
9314 1721 -4412 -6483 2663 2612 -908 -2589 10905 4139 12491 21218 33827 36614 42278 66486 79958
9299 79958 84300 94237 89993 84407 72691 55491 40999 28689 31405 37647 44739 57454 61237
9286 61237 81730 81545 82351 90008 98057 87917 66356 68492 72105 67742 69563 82822 97332 97510
9272 97510 75183 80020 84528 83432 76890 85797 96497 121330 157218 194941 221313 234833 229918
9259 229918 214092 192823 156839 140280 127130 122349 123627 116784 88896 73075 69367 57146
9247E7146N142J9455k130J0064J1427r092l843k020r133q541k0498p918o935J9032
9233E2156m6k2985J6890J1741M668j2890R017N466R070N719K842j2400j2840l937
9219E2471r466j0002j6568m128P535j1456m242Q308R817J178m397l388j8300j3389
9205a6027j255r241J1606Q121J701Q603l221K335R15K161n575r337k692P982N818
9190A894J986o54j0617N65j247L377J5288O749k432l113j0780o879q645R355P168
9175B015l077j3778j4149N268l694R924J3186k91J2867P768k73j4490Q73j4879
9161a2730k2427K851P286M536J3383m156K085k879L960R090O475J3292J1232j0931
9147B1067j101P082j4530j1239j638j0057q135n560R258O854L157N098K648J0033
$$ plain form
9247 57146 62288 81743 79613 89677 101104 92012 88169 86149 77016 68475 47977 40059 33124 52156
9233 52156 52110 29125 46015 57756 62424 49534 58551 64017 73087 78806 81648 69248 56408 52471
9219 52471 43005 33003 16435 12307 19842 8386 4144 12452 22269 23447 19050 15662 -2638 -16027
9205 -16027 -17282 -26523 -14917 -6796 -5095 3508 287 2622 3537 5698 123 -9214 -11906 -3924 1894
9190 1894 3880 3226 -7391 -6826 -8073 -4696 10592 17341 14909 11796 1016 -5863 -14508 -5153 2015
9175 2015 -1062 -14840 -28989 -23721 -27415 -17491 -4305 -4596 8271 16039 15766 1276 2149 -12730
9161 -12730 -35157 -32306 -25020 -20484 -7101 -11257 -9172 -12051 -8091 999 7474 20766 31998 21067
9147 21067 19966 27048 12518 1279 -359 -10416 -18551 -24111 -14853 -7999 -4842 256 2904 12937
9133A2937J8645N778r231l168q576l567k0296j8817J7034J8948m485J713p40j3358
9119g183o814M897L138J9554O714l813k153j3419l491R806Q933o653j2645j25
9105c254R40n253l712n326J0790m087L401J5960M239J255k998J7520R581l866
9091C5190j9741k5507j379M13K531L230K3416J206O208n29l333J396k2443j1366
9077a0708L015R008M68P535j403q268K026O468p413J1830j2306m934j643J251
9063e074J910p770P614J4257Q89p78R508o425j355j0507k2655N025Q821q033l22
9048a4895R097J4164m369q556l037J529N484J7928M094m696j116j2383n549J2199
9034I894N833J2186J9733L0653K0807R186P761j0528j688o757j6227j9125j6710
$$ plain form
9133 12937 31582 37360 28129 24961 16385 12818 -7478 -26295 -9261 9687 5202 6915 6175 -7183
9119 -7183 -13997 -9100 -5962 13592 20306 16493 14340 921 -2570 7236 16169 9516 -3129 -3254
9105 -3254 -2314 -7567 -11279 -16605 -5815 -9902 -6501 9459 13698 14953 11955 29475 39056 35190
9091 35190 15449 -10058 -11437 -11024 -8493 -5263 18153 19359 25567 25038 21705 23101 658 -10708
9077 -10708 -7693 1315 1783 9318 7915 -353 1673 8141 728 12558 252 -4682 -6325 -5074
9063 -5074 -3164 -10934 -3320 10937 11826 11048 20556 14131 12776 2269 -20386 -15361 -6540 -14573 -14895
9048 -14895 -5798 8366 3997 -4559 -7596 -6067 -583 17345 21439 16743 15627 3244 -2305 9894
9034 9894 15727 27913 47646 78299 99106 108292 116053 105525 103837 97080 80853 61728 45018
9021D5018q605n339J1130q467n703J195P870L157n385k3959K295N206j439m939
9007A2035j998O012j199m424j1921q402N745R097j928J1625j765J353j1738k60
8993B232P13J3445m165O207K418J6155J9143K2979J6055L1412M4529M6545K5703
8980B43371k079l4612m3871l6351j9015r316k6072j9311j4191q980J1034J4351
8968E4958l833j0560J19k845k752j8493j3988n658J1779M915L442j1879p640n596
8954h031l619k923J6589J2517M864o338l122j163Q927m715j028R699J6922j152
8940C7427M553L832j183J5010K4638K6416J1507j0920k4299q780j3568k3791j3792
8927B7050j0627J3383n077J829o406J647J618j0317j3227j0064P647K736n108
$$ plain form
9021 45018 36413 31074 42204 33737 28034 29229 37099 40256 34871 10912 13207 18413 16974 12035
9007 12035 10037 16049 14850 10426 -1495 -9897 -4152 4945 3017 14642 12877 14230 2492 2232
8993 2232 2945 16390 12225 18432 20850 37005 56148 79127 95182 126594 171123 217668 243371
8980 243371 241292 206680 162809 126458 107443 98127 72055 52744 38553 29573 40607 54958
8968 54958 51125 40565 40684 37839 35087 16594 2606 -3052 8727 13642 17084 5205 -2435 -8031
8954 -8031 -11650 -14573 2016 14533 19397 13059 9937 8774 17701 12986 11958 21657 38579 37427
8940 37427 41980 45812 44629 59639 84277 110693 122200 111280 86981 78201 64633 40842 27050
8927 27050 16423 29806 24729 26558 20152 21799 23417 13100 -127 -10191 -2544 192 -4916
8914d916j405r664o832K4835J0519p237q741P747J2548m65k543j6465j7575j862
8900b2056p116o765J488Q00lP952J7568O559O134P77j3919O218J5890n068j1596
8885c137n778M734J3477q69n774j981n356m720J562K569J3955M556J18q603M471
8870I224J732q222o057m209M681m086j0377m29K869R664O640l15k791p623R642
8855C43L628n619n810r831k743J2916J591j4230j457j8391J0333J8202L66n419
8841a6121O435M803N048k017p636M960Q137J0557M33L189j0229m394L474O075
8827A2714J312N477J0284M417O693j4836j8718j5184N15Q022j1386J27Q535K544
8813E16j0988l491l843l111J3805K732P444j3927j1126n176P863J6646K904K58
$$ plain form
8914 -4916 -6321 -15985 -22817 2018 12537 5300 -3441 4306 16854 16389 13846 -2619 -20194 -22056
8900 -22056 -29172 -35937 -34449 -33649 -33652 -25700 -8132 -1573 4561 5338 -8581 -2363 13527 8459 -3137
8885 -3137 -8915 -4181 9296 8427 2653 672 -4684 -9404 -7842 -5273 8682 13238 13356 4753 9224
8870 9224 10956 2734 -3323 -7532 -2851 -6937 -17314 -17743 -14874 -5210 1430 1115 -1676 -9299 343
8855 343 3971 -1648 -7458 -17289 -20032 -7116 -5525 -19755 -21212 -39603 -29270 -11068 -10702 -16121
8841 -16121 -9686 -4883 165 -1852 -9488 -4528 3609 14166 14599 17788 7559 3165 6639 12714
8827 12714 14026 19503 29787 34204 40897 26061 7343 -7841 -7326 696 -10690 -10563 -2028 516
8813 516 -10472 -13963 -17806 -20917 -7112 -4380 3064 -10863 -21989 -27165 -19302 -2656 248 506
8799E06Q485O504m951J7720O376n193r851k022J793m976L542P90J017j527p524
8784A0689l059o163p51O574m889o725l724J3072K272k1452r805J062J0744J4821
8770B666J4418n78m678m22m097o860K376J0916j251j1527p10j4005j0438j334
8756b5524P069N917L423P066j485K920j3054j1913j015Q460M741J30M549J4241
8742E525k0888j3461N359K2699J4902j0193j3186J903N050k62r08j2614K42k311
8728a8143j3247M06O843J7626R167o192K200l244r435j541P231m91N975m796j0929
8713a8570m613J062J2432q13m937O953J4879q576l174K592m255j0713l67J5922
8699b178Q108p662p229O926R497k373m64j895k245K937J222L191o73r918j0545
$$ plain form
8799 506 8991 15495 10544 28264 34640 29447 19596 17574 19367 14391 17933 18723 19740 18213 10689
8784 10689 7630 1467 716 7290 2401 -4324 -8048 5024 7296 -14156 -23961 -22899 -12155 2666
8770 2666 17084 16506 11828 11406 7309 449 2825 13741 12490 963 253 -13752 -24190 -25524
8756 -25524 -18455 -12538 -9115 -2049 -3534 -614 -13668 -25581 -26596 -18136 -13395 -13265 -8716 5525
8742 5525 -15363 -28824 -23465 -766 14136 3943 -9243 -7340 -2290 -2552 -3460 -16074 -15832 -18143
8728 -18143 -31390 -30984 -24141 -6515 2652 -3540 -1340 -4584 -14019 -15560 -8329 -8820 -2845 -7641 -18570
8713 -18570 -23183 -22121 -9689 -10502 -15439 -8486 6393 -2183 -5357 -2765 -7020 -17733 -18100 -2178
8699 -2178 5930 -1732 -8961 -2035 7462 5089 4625 2730 485 3422 4644 7835 7162 -2756 -13301
8684a3301O811J4889j0482p385m41Q848p832p412n524k52K613J2582k009r629
8670a8524K318l621J7859J0199j720j2396j0116J3404l023j722k861M802M58P823
8656B880J905o463p158m446J2285J1057J747K796J0466Q127r950l691N116J6071
8642D0742k0618j8699Q842J6419m959l980o556M325j2519j1388r726P791O497
8629c829K941J9792J0058n828O077M93p41j775j184K784L608K860j035l642J2612
8614D3191P839k0554l31m218m681K75J2437L230o97o819O03Q844N427j6621l680
8599B4245P020m97J191r328J110K3933J894J0578R729K305o42Q387m212m092N253
8584G6874J7593J2242L280r438j2243j0459J2393o037k503m509o157q933J3653
$$ plain form
8684 -13301 -6490 8399 -2083 -9468 -9909 -1061 -8893 -16305 -21829 -22081 -19468 -6886 -8895 -18524
8670 -18524 -16206 -19827 -1968 8231 6511 -5885 -16001 -2597 -5620 -7342 -10203 -5401 -4943 2880
8656 2880 4785 -1678 -8836 -13282 -997 10060 11807 14603 25069 33196 23246 19555 24671 40742
8642 40742 20124 1425 10267 26686 21727 17747 11191 15516 2997 -8391 -18117 -10326 -3829
8629 -3829 -888 18904 28962 23134 29211 29704 28963 27188 26004 28788 32396 35256 34221 30579 43191
8614 43191 51030 30476 30145 25927 21246 21521 33958 37188 36491 29672 30275 39119 44546 27925 24245
8599 24245 31265 30768 31959 22631 23741 47674 49568 60146 69875 72180 71538 79925 75713 71621 76874
8584 76874 94467 106709 109989 100551 88308 77849 90242 84205 81702 77193 71036 62103 75756
8571G5756R231J990N330j03j0590o481J2058L686m281p062p205k763j0505m57
8557E8604j583j5589j3962J379Q730P374k195m468j0744l936J1289P255p086K713
8543C7781K407j9991j3417J0685J823o666p846m55m263J5030J5143q508j126J256
8529B1853j2466p232J0575P195L758K461o569n971L606J046K40L510o01j4174
8515G231j2093Q851P424J6259j1581o440j052k930J4344q798k432L871L844n444
8501A1054Q255k603o183p996R437N479j3606q144p078J6015K998o133O307R548
8487A7350r213K116K876j3493k715M993L01J3649M438n659m31p502j823j0292
8473e405J367J2494O267R61k0095J105n478j7844K447p995M657J4747j2675o183
$$ plain form
8571 75756 84987 86977 92307 92204 81614 75133 87191 90877 86596 79534 72329 69566 59061 58604
8557 58604 57021 41432 27470 28849 37579 44953 42758 38290 27546 23610 34899 42154 35068 37781
8543 37781 40188 20197 6780 17465 19288 12622 4776 4321 58 15088 30231 21723 20597 21853
8529 21853 9387 2155 12730 19925 23683 26144 19575 13604 17210 18256 18496 22006 21405 7231
8515 7231 -4862 3989 11413 27672 16091 9651 8599 5669 20013 11215 8783 12654 16498 11054
8501 11054 19309 16706 10523 2527 11964 17443 3837 -4307 -11385 4630 7628 1495 7802 17350
8487 17350 8137 10253 13129 -364 -3079 1914 2215 15864 20302 14643 14212 6710 4887 -5405
8473 -5405 -4038 8456 14723 15684 -4411 -3306 -8784 -26628 -24181 -32176 -27519 -12772 -25447 -31630
8459c1630J699J3848P502K024J3617j2639j4260Q227J2430Q319j421P923n46j1137
8445C956P39N155k910Q21n558K44J121k928P693J210p411j8823K621P199L225
8430c646q70l129Q222R749j3098j2847M808Q319p665P19m661J6326K338K104P253
8415A3922K382k2727j6341J3531O771n398J0077R682k626m432R511o160j9661
8402a1469R802M436P760L387K333j7235k3811J012R048j8106l674J2162J3753
8389a0602n52p668K968k570n119O343O53Q469J7369N992j6133j197k760l493L370
8374d930M044N257j433m375K480J3002J947n368n731q911L938N026J3740K22k082
8359A6826J2656o71K11l373j5814R428Q505n647k554k909j6490L053J1289k525
$$ plain form
8459 -31630 -29931 -16083 -8581 -6557 7060 -5579 -19839 -11612 818 9137 7716 15639 15093 3956
8445 3956 4695 9850 6940 7761 2203 2447 3568 640 8333 9543 2132 -16691 -14070 -6871 -3646
8430 -3646 -4516 -7645 577 10326 -2772 -15619 -10811 -2492 -10157 -9438 -14099 2227 4565 6669 13922
8415 13922 16304 -6423 -22764 -9233 -2462 -7860 2217 11899 9273 4841 14352 8192 -11469
8402 -11469 -1667 2769 10529 13916 16249 -986 -24797 -23785 -14737 -32843 -36517 -24355 -10602
8389 -10602 -11154 -18822 -15854 -18424 -23543 -17200 -16547 -8078 9291 15283 -850 -2047 -4807 -8300 -4930
8374 -4930 -886 4371 2938 -1437 1043 14045 15992 10624 4893 -4018 -80 4946 18686 18908 16826
8359 16826 29482 28811 29022 25649 9835 19263 27768 22121 19567 16658 168 3221 14510 11985
8345A1985K033J1315Q849k965p281j2180k364j8389J107J2599Q773k070o031K536
8331G917R73J805m205o214J596K999n560j398P575O370N47j940k023O303m575
8316A0170m068j840P761J376m978k4752Q579J2111L084J255l217L715l826l288
8302B082r70j0743J3586K844N59j218J198K217l40k725q017O08q439q35J2677
8287B484o169l042R778l509k0603j610Q808J5960j829j0697l123L169j608J2948
8273I57l778N732j176j0189j6346j317P927O863k927n001Q080P952r893q116J427
8258a9805K390J2416R936J310q039l094R295L101r878J1302J4166o313j425m795
8244A0567j172J1112j818n403l104J1545J829j3018k734l112K64L218l9p256N16
$$ plain form
8345 11985 14018 25333 34182 31217 23936 11756 9392 -8997 -7890 4709 13482 11412 5381 7917
8331 7917 8890 10695 6490 276 1872 4871 -689 -2087 5488 11858 12405 10465 8442 14745 10170
8316 10170 6102 4262 12023 13399 8421 -16331 -7752 4359 7443 8698 5481 9196 5370 2082
8302 2082 1112 -9631 3955 6799 7358 6140 7338 9555 9215 6490 -1527 -919 -9358 -10193 2484
8287 2484 -3685 -6727 3051 -458 -21061 -22671 -13863 2097 268 -10429 -13552 -10383 -11991 957
8273 957 -2821 2911 1735 -8454 -24800 -26117 -18190 -11327 -14254 -19255 -11175 -3223 -13116 -21232 -19805
8258 -19805 -17415 -4999 4937 6247 -1792 -4886 4409 7510 -2368 8934 23100 16787 15362 10567
8244 10567 9395 20507 18689 13286 10182 21727 23556 10538 7804 4692 4956 8174 8135 879 1395
8229A395K996R041r071j364p543j828J2305j0413N798p111j2171j435J241R886
8215h274J2291J0884m338m066j725O328J0466r504k4032j3696K596J3127K6276
8202A6333O875J283r05M408k0332l831J7388j948j0917j1112r080p415l023P878
8188a4398j375n244l937L416L47P594N510M973n67l297j0097J2759J5824l191
8174H317j8025j2664O442J6725K36j2087j6553M69J4297L765n00j130J5973J7764
8160B3029L28J949q118j0207J0065O081J669j1909j2544r496O084j2395J0409
8147e055n217p013J2256P241K85o648P063K1681J4705o669m816K194m260n554
8133B0193o034o614j0529J219j716p94l461l485J441N89o616J390Q834K339K745
$$ plain form
8229 1395 4391 13432 4361 2997 -4546 -6374 5931 -4482 1316 -5795 -17966 -19401 -18160 -8274
8215 -8274 4017 14901 10563 6497 4772 11100 21566 12062 -11970 -25666 -23070 -9943 16333
8202 16333 23208 24491 23586 27994 7662 3831 21219 19271 8354 -2758 -11838 -19253 -22276 -14398
8188 -14398 -15773 -21017 -24954 -21538 -21191 -13597 -8087 -3114 -3681 -6978 -17075 -4316 11508 8317
8174 8317 -9708 -22372 -15930 795 1031 -11056 -27609 -27140 -12843 -9078 -9578 -10708 5265 23029
8160 23029 23357 25306 17188 6981 17046 23127 24796 12887 343 -9153 -3069 -15464 -5055
8147 -5055 -10272 -17285 -5029 2212 2497 -4151 2912 24593 39298 32629 27813 30007 25747 20193
8133 20193 14159 7545 -2984 -1765 -3481 -4275 -7736 -11221 -9780 -9191 -15807 -14417 -5583 -3244 -499
8118d99J0334n768o846j4316J720r099j2344K588N206R957J5697K2113N947L292
8104B7982j9191j90q309N202j4676N348J7143J9635N638q524k0791l196J2039
8091A8110J120n976M714j204j3480j0859J2971O969n535K211j511R36K017N136
8077A5619K085n987O11j1001p719R04n44m23Q673O440k734j6560N374J6485R616
8062B0839N160j1061k2529j1796R961N073r01O787L260O87J644N345N477q520
8048I426j3148Q692m683r670k483P485M026N193q688j361o56m771j0217M582Q902
8033g371R228m27n806J9804L895M33J95o523J1734K132m142p901M021k360o696
8018A0216j757O301J1308M302p470j819O057O870l115j210J635R392k455n557
$$ plain form
8118 -499 9835 4067 -2779 -17095 -15375 -24474 -36818 -34230 -29024 -19067 -3370 18743 24690 27982
8104 27982 8791 8601 292 5494 -9182 -3834 13309 32944 38582 30058 9267 6071 18110
8091 18110 19230 13254 17968 16764 3284 -7575 5396 12365 6830 9041 7530 8466 10483 15619
8077 15619 17704 11717 12328 1327 -6392 -5488 -6032 -6455 2218 8658 5924 -10636 -5262 11223 20839
8062 20839 25999 14938 -7591 -19387 -9426 -4353 -5254 1533 4793 5480 7124 12469 17946 9426
8048 9426 -3722 4970 287 -9383 -11866 -4381 -355 4838 -3850 -5211 -5867 -10638 -20855 -16273 -7371
8033 -7371 1857 1430 -4376 15428 19323 19756 19951 13428 25162 27294 23152 15251 19272 16912 10216
8018 10216 8459 14760 26068 30370 22900 21081 27138 34008 30893 29683 31318 40710 38255 32698
8004C2698n802J7657o055j6870j1849j604J2919J3637l8L79J165m115l010l531
7990B5581q105o315q52K635J7520K348L767n654j4899J0532R633p247j4012l342
7976A1590J4198J9678K1625J9214L359R741Q682k70M402o884q830j2917j9322
7963F4266p568l563j5181J4644K0257N967J027P547M965j4221k3222j7639l221
7950C4058N273n257q858j3885j905R661J2737P67j821k543o768r238j662L84J670
7935A2613J2284J0090K0181R453N082J5980O864k561l788l711P144J741j625j5227
7921G4520k4538R425J2422j332M087K402j625J0510J689j5967j2750k3707n811
7908B9325Q786J3054m203l361l796m614j7512K570m536n797N05J330p715J4274
$$ plain form
8004 32698 26896 44553 38498 21628 9779 8175 21094 34731 34693 35072 36237 32122 29112 25581
7990 25581 17476 11161 10309 12944 30464 32812 36579 30925 16026 26558 36191 28944 14932 11590
7976 11590 25788 45466 67091 86305 89664 99405 108087 107817 112219 105335 96505 83588 64266
7963 64266 56698 53135 37954 52598 72855 78822 79849 87396 92361 78140 54918 37279 34058
7950 34058 39331 34074 25216 11331 9426 19087 31824 32591 30770 28227 21459 12221 10559 10943 12613
7935 12613 24897 34987 55168 64621 69703 85683 92547 89986 86198 82487 89631 91372 89747 74520
7921 74520 49982 59407 71829 70497 74584 76986 75361 85871 87560 71593 58843 35136 29325
7908 29325 38111 51165 46962 43601 39805 35191 17679 20249 15713 9916 10421 11751 4036 18310
7894A8310J5559n596r497J1218L465j5055k0923p24K497N922J8224L961R124j562
7880C4923m865k365j2142j4279J0797j497p80k125L545N852P979l456j611j5606
7866D370l285N91p713N395J0428n110J59N563K022l612o537j4851k4630J6952
7852b0258J5118k065K20J511J1688J0064o492m998J6248p189MN274M67j6038j9388
7837a5834J2618J3980m833N069J2847J1592J1041j1073p458j5671n033M307j652
7824I900K0196j01m642j5717j5218p913o799J1246Q915o06q868J4756K158P724
7810A5031O095l642j8R98k699l454k938J2452k93n789j6164O046q79j0375j1198
7795a6827Q517J8214J1372k734n403Q733p663k2751m396O688p866j6908j907J7594
$$ plain form
7894 18310 33869 28273 18776 29994 33459 18404 -2519 -3243 -746 5176 23400 27361 36485 34923
7880 34923 30058 27693 15551 1272 12069 10572 9792 7667 11212 17064 25043 21587 19976 4370
7866 4370 1085 1676 -6037 -642 9786 4676 4835 10398 12420 8808 2271 -12580 -37210 -20258
7852 -20258 -5140 -7205 -6985 -5474 6214 16278 9786 4788 21036 13847 13851 19125 19592 3554 -15834
7837 -15834 -3216 10764 5931 11000 23847 35439 46480 35407 27949 12278 7245 11552 9900
7824 9900 30096 29995 25353 9636 -5582 -13495 -20294 -9048 -133 -739 -9607 5149 7307 15031
7810 15031 21126 17484 17466 18464 15765 12311 9373 21825 21532 15743 -421 5625 4746 -5629 -16827
7795 -16827 -8310 9904 21276 18542 13139 21872 14209 -8542 -12938 -6250 -14116 -31024 -32931 -15337
7781a5337K784K809R962M804q837n807j1087n471J1555J533r830p055J9834J2466
7767B323j78N10p263m65L410k76o902n929q012J926L987j000J1818O405n123m014
7751h783k030L38M567L095N856P219R728l386n922J454J171m434R142O522o410
7736A8127q863j2106m253l299m868R658J0398O424M874p867q207J2236O011l143
7722A5122k973j3023j5702j647J9571q90K195N62o695P62R434J501j0255q524
7708a0562K215j2544J1171L221k574K8601J1033j1594N511k093q797k0581N40
7695f453k610J0453J2058j904j3934j4726J781j404P231L250n361p23O802l171
7681h711K2419J5257k0662l2529k667J3703K1547K005k2123L023O469Q244l398
$$ plain form
7781 -15337 -12553 -9744 218 5022 -3815 -9622 -20709 -26180 -14625 -13092 -22922 -29977 -10143 2323
7767 2323 2145 2655 -4608 -5073 -1663 -1939 -8841 -14770 -22782 -20856 -16869 -17869 -6051 354 -4769 -8783
7751 -8783 -10813 -10475 -5908 -2813 3043 10262 19990 16604 10682 12136 13307 8873 18015 24537 18127
7736 18127 9264 -2842 -7095 -10394 -15262 -5604 4794 11218 16092 8225 18 12254 18265 15122
7722 15122 12149 -874 -16576 -18223 1348 458 2653 3215 -3480 -2718 6716 8217 -2038 -10562
7708 -10562 -8347 -20891 -9720 -6499 -9073 19528 30561 18967 24478 22385 13588 -6993 -6453
7695 -6453 -9063 1390 13448 11544 -2390 -17116 -15335 -16739 -9508 -6258 -11619 -12342 -5540 -8711
7681 -8711 13708 28965 8303 -24226 -26893 -13190 8357 10362 -11761 -8738 -2269 5975 2577
7668B577j5103J5907J0305j1091n815J4476N283K653J0929K657q789o464k5833
7655h308j1042R504m78O765R202K527P182O792o973j1417j9980K120l742k753
7641b0601J0904N380J570L354p156j0738Q184j375L98k240j1005R051P578j579
7627h275r770P118J6592L242p413j0185l314L073L415j4352m078n487N660J1526
7613a2248L038l125q084p946m636m320R912J4571n272j393L97R963N95n040L100
7598a0488N226J0867n006r503O779M713R549k552l2344j7267J080R392N431J2311
7584a1812K0132J316j2245L318K879Q943L224k210j3217m940j0462j2303O801
7571b0576R441J1981K846p263l157j4020N755R403j684K241p532j670j29o957
$$ plain form
7668 2577 -12526 3381 13686 2595 -3220 11256 16539 19192 30121 32778 23989 17525 -8308
7655 -8308 -19350 -9846 -10324 -3559 5643 8170 15352 22144 15171 3754 -16226 -14106 -17848 -20601
7641 -20601 -9697 -4317 -2747 607 -6549 -17287 -9103 -10478 -10080 -12320 -23325 -14274 -6696 -8275
7627 -8275 -18045 -10927 5665 8907 1494 -8691 -12005 -8932 -5517 -19869 -23947 -29434 -23774 -12248
7613 -12248 -9210 -12335 -20419 -28365 -33001 -37321 -27409 -12838 -18110 -19503 -19106 -9143 -8548 -13588 -10488
7598 -10488 -5262 5605 599 -8904 -2125 2588 12137 9585 -22759 -40026 -38946 -29554 -24123 -11812
7584 -11812 8320 9636 -2609 709 3588 12531 15755 13545 328 -4612 -15074 -27377 -20576
7571 -20576 -11135 846 3692 -3571 -6728 -20748 -14993 -5590 -7274 -5033 -12565 -14235 -14364 -21321
7557b1321K224Q706L042J2028K289J217M38j738M596O817K941j1781j8818j852
7543a1212O598N224j5109o150m636J023P251L839N389J0686J1878j2489j4444
7530a2152l711l850o517m113Q924J5439l040j4807k0654P385J4970J2635k202
7517a1693k976M031J1792n70m293L876J3348k342j2638r339j4383M494j221L472
7503a8442L203J564J1322M000k2621N045K1761N088M6p22l181p536j122l898r41
7488f434J2304L160J056q919j5644j936J3872Q28P284P051Q536O78l147m40O989
7473B5238j1160l833L91m366j4114m544j057j3L180L662J1005p898K946n947O425
7458h5l051q710J7129Q581p169j1042n416q054J1054o444p005m220P993P218m735
$$ plain form
7557 -21321 -19097 -10391 -7349 4679 6968 8185 8623 6885 11481 18298 21239 9458 -9360 -11212
7543 -11212 -4614 610 -14499 -20649 -25285 -24262 -17011 -13172 -7783 2903 14781 2292 -12152
7530 -12152 -15863 -19713 -26230 -30343 -21419 -5980 -9020 -23827 -44481 -37096 -22126 -9491 -11693
7517 -11693 -14669 -10638 1154 584 -3709 167 13515 11173 -1465 -10804 -25187 -20693 -21914 -18442
7503 -18442 -15239 -13675 -2353 1647 -20974 -15929 5832 10920 10966 10244 7063 -473 -1595 -5493 -6434
7488 -6434 5870 9030 10086 1167 -14477 -16413 -2541 -1713 5571 12622 21158 21836 18689 18249 25238
7473 25238 14078 10245 10636 6270 -7844 -12388 -13445 -13458 -10278 -6616 4389 -3509 -563 -6510 -85
7458 -85 -3136 -11846 5283 13864 6695 -4347 -9763 -17817 -6763 -13207 -20212 -24432 -16439 -9221 -13956
7443a3956p696n101J0879K7645R1o572O994r07j5493q480k003Q478J1768k913
7429B734P231k779N263L321j108k250o102j5582j5895J432n003Q791K877P206
7415i864R899r812m697J6778o776J581O547K666j437l0324L864J0352J6592Q016
7401A3385r855r318n68o829R271L331L597O831r887j2416J4714K1739j920m013
7387A8062k511p963n087P109O745J307k606r467R73J6650J914j452j371m123J2565
7372C0745J267r688j0898j5222J732o745j337J67L704j0076m606J0432R970r618
7358a0173q872K442q826q812J886L5056k59j2258k68Q058O392k887m436j2910
7344a5867J375K759P564o444j2481l145M644L307J9749q73k8831q603J4355R936
$$ plain form
7443 -13956 -21652 -26753 -15874 11771 11862 5290 12284 11377 -4116 -12596 -14599 -6121 5647 2734
7429 2734 9965 7186 12449 15770 14662 12412 6310 -9272 -25167 -23735 -28738 -19947 -17070 -9864
7415 -9864 35 -9777 -14474 2304 -4472 -2891 3656 6322 4885 -25439 -21575 -11223 5369 13385
7401 13385 3530 -5788 -6356 -13185 -3914 -583 3014 9845 -42 -12458 2256 23995 22075 18062
7387 18062 15551 7588 2501 9610 16355 17662 15056 5589 6562 23212 25126 23674 22303 18180 30745
7372 30745 32012 22324 11426 -3796 -2064 -8809 -10146 -9979 -6275 -16351 -20957 -10525 -555 -10173
7358 -10173 -19045 -16603 -25429 -34241 -32355 2701 2442 -9816 -10084 -2026 4366 1479 -2957 -15867
7344 -15867 -14492 -11733 -4169 -10613 -23094 -26239 -21595 -18288 1461 588 -28243 -36846 -22491 -12555
7330a2555n812k67P654J612m932j0110P610L764P231J3496j5079j0135j2369o272
7316c6164J486P788R136Q018O321R589q97k054q402j375O30j4835K042M688K38
7301a3791R954J7588m225j1041J456K401q793J807L386Q65j212k992J659j882
7287d820j677R608M227K459l140J643m059J204j3184J374j116l337N052J6587
7273A0821l559j3166n93n809j8166J0054P484M62m130N567J1831j2355O23m199
7259a5135j1277K3482O520N104N268n223J0826n708j0945r537m938m474N705R50
7245i382j0000j3923P879j687j064J2912J5837J01m048J8017J5109j5892j7121
7232c262j1251M977Q445j02k81o323r301K720O203r77o072j2997J228J5427J0518
$$ plain form
7330 -12555 -18367 -18634 -10980 -9368 -14300 -24410 -16800 -13036 -5805 7691 -7388 -17523 -29892 -36164
7316 -36164 -34678 -26890 -17754 -9736 -3415 6174 5277 3223 -5179 -6554 -5924 -20759 -18717 -14029 -13791
7301 -13791 -3837 13751 9526 -1515 -59 2342 -6451 -4644 -1258 -393 -1605 -4597 -2938 -4820
7287 -4820 -6497 3111 7338 9797 6657 8300 4241 5445 -7739 -6365 -7481 -10818 -5766 10821
7273 10821 7262 -5904 -6497 -12306 -30472 -20418 -12934 -12472 -16602 -11035 796 -11559 -10936 -15135
7259 -15135 -26412 -2930 3590 8694 13962 8739 19565 13857 2912 -6625 -11563 -16037 -10332 -9382
7245 -9382 -19382 -33305 -25426 -27113 -28177 -15265 572 673 -3375 14642 29751 13859 -3262
7232 -3262 -14513 -9536 -1091 -1193 -1474 -7797 -17098 -14378 -8175 -9152 -15224 -28221 -26993 -11566 -1048
7217a048n272j4733r733O444J9060L84j5581R005K4462J54j2516j1784j505n314
7203a7977M40J1594P554n657l231R868J6977K307j1197j2013p678R545j4861o251
7189b0580Q771O276k835k523M648O900L944r401p317K582J2372j185J0655j2481
7175a74o598n185M08O12J5046L907j6816j0868l792J1285j0903r469J0284Q300
7161a3963J0206m751j803k602K706j2803j0357J4101j0275R567k458l6L164R720
7147i584r07J4064K716M136p814j1711j244J5072J3256l019j6031j2603o787n78
7133b1034k591J5160O944k1631J239J5672k504M353R17j612J3449J4923O901k362
7119B7824j8849j2247N951j847r388l016q356r158L217k476J3835P044n789Q104
$$ plain form
7217 -1048 -6320 -21053 -30786 -24342 -5282 -4898 -20479 -11474 12988 13142 626 -11158 -12663 -17977
7203 -17977 -17537 -5943 1611 -4046 -7277 2591 19568 21875 10678 -1335 -9013 532 -14329 -20580
7189 -20580 -11809 -5533 -8368 -10891 -6243 657 4601 -4800 -12117 -9535 2837 1652 12307 -174
7175 -174 -6772 -11957 -11549 -10937 4109 8016 -8800 -19668 -23460 -12175 -23078 -32547 -22263 -13963
7161 -13963 -3757 -8508 -10311 -12913 -10207 -23010 -33367 -19266 -29541 -19974 -22432 -22468 -19304 -9584
7147 -9584 -10491 3573 6289 10425 2611 -9100 -10344 4728 17984 14965 -1066 -13669 -20456 -21034
7133 -21034 -23625 -8465 -1521 -23152 -21913 -6241 -8745 -4392 -3475 -5087 8362 23285 30186 27824
7119 27824 8975 -3272 2679 832 -8556 -11572 -19928 -29086 -25869 -28345 -14510 -7466 -13255 -5151
7105e151N391O764j135k4342l395R782O491Q66J1750m151j4095o783J5618J3568
7091A1178L268Q284P7j795n101J5855q328k3378o589O628K353q574m345O275O357
7076B165j1245r191M843O466J8605L457K062O430r385p163N181j6402j7552J500
7062b0229Q35J1878Q193j470r655n081O906J5310m939n537N040L673n040L125
7048C009R665k966r315K373M4K296q076k579O117L249R487j8806j1060o926R19
7033b2569k58P662R028M295n58P315m362L704J6932l663j0856K117o64n746m055
7018a678q12Q231K214j0330j2325P06J4712n823j0828J528P523P058j104j1344
7004a2272P278l741j45K364N999J956L656k1859M298M527r1J1280q560m205J2053
$$ plain form
7105 -5151 240 7004 5869 -18473 -21868 -12086 -5595 -4729 7021 2870 -11225 -18008 -2390 11178
7091 11178 14446 22730 22807 21012 15911 31766 23438 60 -6529 99 2452 -6122 -10467 -4192 2165
7076 2165 -9080 -18271 -13428 -6962 11643 15100 17162 23592 14207 7044 12225 -4177 -21729 -20229
7062 -20229 -19394 -7516 677 -793 -10448 -15529 -8623 6687 1748 -3789 1251 4924 -116 3009
7048 3009 12674 9708 393 2766 2810 5106 -2970 -5549 568 3817 13304 -5502 -16562 -23488 -22569
7033 -22569 -22827 -15165 -6137 -1842 -2400 4915 553 4257 21189 17526 6670 8787 8123 2377 -1678
7018 -1678 -2490 5741 7955 -2375 -14700 -13994 718 -5105 -15933 -14405 -6882 176 -928 -12272
7004 -12272 -4994 -8735 -8880 -6516 -517 1439 5095 -16764 -12466 -7939 -8030 3250 -5310 -9515 2538
6989B538R798j6697k153l291J010L534M569R491M630k503j6431j284J4308O264
6975A3783p353p209j0828J0359J0429l862j117r269r885j4757n165N272N995J2586
6961a1021J7762J0359j2707J973J1618l860j3673j5936j6322M890J3666O285l264
6948a0230n066P681J3560O415k131k012K730j7942k0015l465k276J0769J5689
6935f293m64p645l349K384n817r479J2464J8456j0929p715r0J3626J1044j0204
6921d011m274K274k826K345m82J1878k150l494l16q9J0119J8762J1257j2624o083
6906B0286q84j7582j1426k2898P147K1276J9266q828K779M171p431j2540o897
6893a3561j519r267J0974J019l091J6603N203j6421J0953J0134k238r001K951
$$ plain form
6989 2538 12336 -4361 -6514 -9805 -8795 -5261 -692 8799 13429 10926 -5505 -6789 7519 13783
6975 13783 6430 -779 -11607 -1248 9181 5319 4202 -5067 -14952 -29709 -34874 -29602 -23607 -11021
6961 -11021 6741 17100 4393 6366 17984 14124 451 -15485 -31807 -26917 -13251 -6966 -10230
6948 -10230 -15296 -7615 5945 12360 10229 8217 10947 -6995 -27010 -30475 -32751 -21982 -6293
6935 -6293 -6757 -14402 -17751 -15367 -21184 -30663 -18199 257 -10672 -18387 -18477 -4851 6193 -4011
6921 -4011 -8285 -6011 -8837 -6492 -6974 4904 2754 -740 -1056 -1145 8974 27736 38993 26369 20286
6906 20286 19402 1820 -9606 -32504 -25357 -4081 15185 6357 9136 13307 5876 -6664 -13561
6893 -13561 -15080 -24347 -13373 -12354 -15445 1158 6361 -10060 893 11027 8789 -212 2739
6880B739P919R884N321n211j3243m933m082l674l630m896J0966n04j0948l071
6866a7363l850k004O881P017N049J0761q847j1517L539J0760l398K164j1317o642
6852a8767p33J374j0176M692J1062p817k75R543m629j0149P568J9291O706l013
6838D677l900L78q08n981K545l595M174j1834M883k06K321j597k292P213l011
6823g033q710j0483P889Q155m837L129Q776L995l175j2462M45j0232r675q765
6809d2983K8077J4247m662l913J7718j2324o299M869P216l573k499K087j05l038
6795e182n738p486L703p098m240Q780P676P832l462k939p421Q441K187J4519R285
6780A8857K432m420n159M270p411j1986K247j3l246K531k475J3479q39j2591K692
$$ plain form
6880 2739 10658 20542 25863 20652 7409 2476 -1606 -5280 -8910 -13806 -2840 -3344 -14292 -17363
6866 -17363 -21213 -23217 -16336 -9319 -4270 6491 -2356 -13873 -10334 426 -2972 -808 -12125 -18767
6852 -18767 -19500 -18126 -28302 -23610 -12548 -20365 -20640 -11097 -15726 -25875 -18307 984 7690 4677
6838 4677 777 1155 347 -5634 -3089 -6684 -2510 -14344 -9461 -9667 -7346 -8943 -11235 -4022 -7033
6823 -7033 -15743 -26226 -18337 -10182 -15019 -11890 -3114 881 -2294 -14756 -14311 -24543 -34218 -42983
6809 -42983 -14906 -659 -5321 -9234 8484 -3840 -10139 -5270 1946 -1627 -4126 -2039 -2144 -5182
6795 -5182 -10920 -18406 -14703 -21801 -26041 -17261 -9585 -1753 -5215 -8154 -15575 -7134 -4947 9572 18857
6780 18857 21289 16869 11710 15980 8569 -3417 -1170 -1183 -4429 -1898 -4373 9106 8267 -4324 -1632
6765a632o993O385k722j671l992J5810J9593K870o513j4481k037P823j0178p620
6751e358l745K4108n449j0174n570J012M072L10m663O463k763k64J4057J0095
6737B2131J376j1446m333P670L394l784O413q618l369l580o902N25j660J1797
6723I614P524j6786N829R11j3955R012l14O685j410j7755L158p55NJ4045K33J0106
6707A6147l808P754m732j4259j2686j0211n455N06K0613K6407j493j6963l536
6694a716K9634J3348P270K9103K7183L1699L4221L7720L2070Q219l4250m4970
6682A69531m7079l3390k7138j9637o322J406o761q197j42j2938J4607n221n330
6669A3389K695J972j5276j2703Q120J4259r29O180Q203j633j7705m642L971O072
$$ plain form
6765 -1632 -8625 -2240 -4962 -6633 -10625 5185 24778 27648 21135 6654 4617 12440 2262 -5358
6751 -5358 -9103 15005 9556 -618 -6188 -5176 -1104 -794 -5457 1006 -1757 -2021 12036 22131
6737 22131 23507 12061 7728 15398 18792 15008 21421 12803 9434 5854 -1048 -523 -2183 9614
6723 9614 17138 352 6181 7092 -6863 2149 1835 8520 7110 -10645 -7487 -8242 -8237 5808 6041 16147
6707 16147 12339 20093 15361 1102 -11584 -21795 -27250 -26744 -6131 20276 18783 1820 -1716
6694 -1716 27918 41266 48536 77639 104822 136521 170742 208462 240532 248751 214501 169531
6682 169531 122452 89062 61924 42287 35965 37371 30610 22413 22271 9333 23940 18719 13389
6669 13389 16084 18056 2780 -9923 -1803 12456 11527 17707 25910 24277 6572 1930 5901 11973
6655A1973N184J4704j0174j2409p991O400n353l5J3730n112j4618m78J3744K060
6641A1625j1599N25k754J490k153L668J021j4155j3939J3118j1127J299k839o924
6627c2744P119J5948q742k460M851M954P878J0693L805j3443O214K203M507j081
6613I702j902Q131O229j3416j8546q36R01O166o38j530j40L746J070P03P99P001
6597G440q759R679l700k034Q379m171o011K611J4675n056j5608q957J2893K473
6583C854p241n207J2941M23J3123j2710j0919J834l490M068K649l87K853K405
6569D196K748o654L59N897n162j402L406P131r717j590J080j1829K451P211J7104
6554A5229J0044j4163k7400q364J0914m95n323Q333R185j0407j278L919j827l728
$$ plain form
6655 11973 17157 31861 21687 9278 1287 7687 2334 2299 16029 10917 -3701 -4179 9565 11625
6641 11625 26 551 -2203 -713 -2866 802 1823 -12332 -26271 -13153 -24280 -22981 -25820 -32744
6627 -32744 -25625 -9677 -18419 -20879 -16028 -11074 -3196 7497 11302 -2141 4073 6276 10783 9702
6613 9702 7800 15931 22160 8744 -9802 -10638 -9737 -3571 -4209 -5739 -5879 -2133 -1063 -360 439 7440
6597 7440 -1319 8360 4660 2626 11005 6834 823 3434 18109 13053 -2555 -11512 1381 3854
6583 3854 -3387 -8594 4347 4770 17893 5183 -5736 -3902 -7392 -3324 -675 -1062 1791 4196
6569 4196 6944 290 649 6546 1384 -18 3388 10519 802 -788 292 -11537 -9086 -1875 15229
6554 15229 25273 11110 -16290 -24654 -13740 -14235 -19558 -11225 -2040 -12447 -13725 -9806 -11633 -15361
6540a5361J514J0122Q959J688m04j7608j4624J252n498N500K4552L2178J0132
6527D2402k524Q312j0409k5655k0320m242n777J5939J67J0355k852k0115m079
6514a8798J84m490M439K822p953m511j0418O893J0732J0986j2475N011J5153J4023
6500A1598K015k0421j1578l56Q180O436m866k5695l195P253j0145O556N178K681
6486b6359R693p774L13J713j57j837N269Q275Q015l496j4914J862O165r340O35
6471b1937J686j469l967R902J78n763o812l779R368J1647J91k957n033N407J6238
6456B900J137j5333R133J0218L474N681m568k0946l919j7838J9J5434K948l590
6442a5250J377J2014L087m53N36J0705j7507N99J0147j5559j0478n452N03O424
$$ plain form
6540 -15361 -13847 -3725 5234 6922 6518 -11090 -25714 -24462 -29960 -24460 92 32270 42402
6527 42402 39878 48190 37781 12126 -8194 -12436 -18213 -2274 -2107 8248 5396 -14719 -18798
6514 -18798 -18614 -23104 -18665 -15843 -23796 -28307 -38725 -31832 -21100 -10114 -22589 -17578 -2425 11598
6500 11598 13613 -6808 -18386 -18742 -10562 -4126 -8992 -34687 -37882 -30629 -40774 -34218 -29040 -26359
6486 -26359 -16666 -24440 -24127 -22414 -22571 -24408 -19139 -10864 -2849 -6345 -21259 -19397 -13232 -22572 -21937
6471 -21937 -20251 -21720 -25687 -15785 -15607 -21370 -28182 -31961 -22593 -10946 -10755 -13712 -18745 -13338 2900
6456 2900 4037 -11296 -2163 8055 11529 17210 12642 -8304 -12223 -30061 -30042 -14608 -11660 -15250
6442 -15250 -13873 -1859 1228 775 1311 12016 -5491 -4892 5255 -10304 -20782 -26234 -25731 -19307
6428a9307j0376m473J5298J8904J8217R256k0146o658J0946q853m671N680p763
6415c946j9853l122J5595q58q1J6316R783r762j2758r637o291p17O52R185q784
6400b4278K210K186r690J4609O797K760L249p272j7642n771J5237R833p418L769
6386a1421L481k230K562j2924J603j7264L342k174P951K0514Q919n569l158K184
6372d184N644J991K624n922o247L491R137M697r423p748Q53p800n889j159p089
6357b7024q98Q128O228M53P801p09j4645K425J1380m029O430l367K0864M161k615
6342A4583l544l201J733n509j2458J5412J7207k0420k3256j2059L633M304R428
6329a4147j232j424O116O490k423Q758M789j0005j1746J7383N252k0549j3683
$$ plain form
6428 -19307 -29683 -34156 -18858 46 18263 27519 7373 715 11661 2808 -1863 3817 -3946
6415 -3946 -23799 -26921 -11326 -12184 -12265 4051 13834 4072 -8686 -18323 -24614 -25331 -24679 -15494 -24278
6400 -24278 -22068 -19882 -29572 -14963 -8166 -5406 -2157 -9429 -27071 -32842 -17605 -7772 -15190 -11421
6386 -11421 -7940 -10170 -7608 -20532 -18929 -36193 -32851 -35025 -27074 -6560 2359 -3210 -6368 -4184
6372 -4184 1460 3451 6075 153 -6094 -2603 6534 11231 1808 -5940 -5087 -12887 -18776 -19935 -27024
6357 -27024 -27922 -19794 -13566 -13113 -5312 -6021 -20666 -18241 -6861 -10890 -4460 -7827 13037 17198 14583
6342 14583 11039 7838 9571 4062 -8396 7016 24223 3803 -19453 -31512 -27879 -23575 -14147
6329 -14147 -15379 -16803 -10687 -4197 -6620 2138 6927 -3078 -14824 2559 7811 -12738 -26421
6316b6421J697p815j1300j806Q397Q175J7506K0695J5342l271j2318j2042N850
6303B689O663m158j9157o463J2913n289J0936O707J2721j0491l455K661n22K717
6289H472q868k3565l077o159R176J9727L854J753L860Q01j16q36m50o811j0862
6274a3101k457J4587M472O895M704m446k681Q671L649l883j0836r835j2172M247
6260a2186M360k058j3191J2M846J3894J440p221j3K714M528l143p263J692O662
6245d927J474j5998n301m988k620L343M826J5211J5273K4348R183p483m123r566
6231A8652l235n334j335o638L71l878q35m805j260j003K982k508j0672Q755K829
6216g914J3411R668J430j4888Q25K900J63q543l512j1256J2890J0564r548P89
$$ plain form
6316 -26421 -24724 -32539 -43839 -45645 -37248 -29073 -11567 9128 24470 21199 8881 -3161 2689
6303 2689 9352 5194 -13963 -20426 -7513 -12802 -1866 4841 17562 7071 3616 6277 5755 8472
6289 8472 -396 -23961 -27038 -33197 -24021 -4294 -440 1313 5173 5974 5858 5022 4572 -2239 -13101
6274 -13101 -15558 -971 3501 10396 15100 10654 7973 16644 20293 16410 5574 -4261 -16433 -12186
6260 -12186 -7826 -9884 -23075 -23063 -18217 -4323 -2883 -10104 -10117 -7403 -2875 -6018 -13281 -11589 -4927
6245 -4927 -3453 -19451 -24752 -29740 -32360 -29017 -24191 -8980 6293 30641 39824 32341 28218 18652
6231 18652 15417 10083 8748 2110 2481 -1397 -2232 -7037 -8297 -9300 -6318 -8826 -19498 -10743 -7914
6216 -7914 5497 15165 16595 1707 2532 5432 5595 -2948 -6460 -17716 -4826 5738 -3810 -3021
6202c021l129r505j0692M334L602n460J2697n614q151Q927J9244N223p439k841
6188a825P375r376j6361Q783J1638P320N384L260p195J612q091j3703K606k0429
6174b9002M761J4274p637k847R362K277o213P368J2599J917N233j161j2373K85
6160a157L672M818J2082R175j1099j3026j7123l071O365Q664K0327k528k975k0599
6146f475j1536P07j131Q686j2837j81N168Q73J386m899m7o800M596K0043J6918
6131A4471L405l857j6791L356K4989m724o767L18L145j3059j2020J2547J358j4516
6117h145j0326J2870q821o219M356J5230M248p145O457R060j6418j933M08J349
6103e029O82o007k11Q705O537j4689j413J7842p270j4586Q815J4491l29p251q667
$$ plain form
6202 -3021 -6150 -15655 -26347 -22013 -18411 -23871 -11174 -16788 -24939 -16012 3232 8455 1016 -1825
6188 -1825 5550 -3826 -20187 -11404 234 7554 12938 16198 9003 10615 2524 -11179 -8573 -29002
6174 -29002 -24241 -9967 -17604 -20451 -11089 -8812 -15025 -7657 4942 6859 12092 10931 -1442 -1157
6160 -1157 2515 7333 19415 28590 17491 4465 -12658 -15729 -9364 -700 19627 17099 14124 -6475
6146 -6475 -18011 -17304 -18435 -9749 -22586 -22767 -17599 -16726 -15340 -20239 -20286 -27086 -22490 -2447 14471
6131 14471 17876 14019 -2772 584 25573 20849 14082 14400 17545 4486 -7534 5013 6371 -8145
6117 -8145 -18471 -5601 -14422 -20641 -16285 -1055 3193 -3952 2505 11565 -4853 -6786 -6378 -5029
6103 -5029 -4347 -10354 -10565 -1860 4677 -10012 -11425 6417 -853 -15439 -6624 7867 7538 287 -8380
6088h380l076O673Q128K731n175j2489J1874k415o66l739q312n324J8074J0077
6074G981q818j0735J26M19O93q975P934J5889M32L929o491L675m136M924O80j7402
6058i875q778J1363O794Q025k665j1653k377Q980j0101k828n540k0145J3085O691
6044a9024m645K554j1440J8158J4570Q775J145q516j4604J864J4071r35k578l835
$$ plain form
6088 -8380 -11456 -4783 3345 6076 901 -11588 286 -2129 -2795 -6534 -14846 -20170 -2096 7981
6074 7981 -837 -11572 -11446 -11027 -10334 -19309 -11375 4514 4946 8875 2384 6059 1923 6847 7527 -9875
6058 -9875 -18653 -7290 -496 7529 4864 -6789 -9166 -186 -10287 -13115 -18655 -38800 -25715 -19024
6044 -19024 -23669 -21115 -32555 -14397 173 8948 10093 1577 -13027 -11163 2908 1973 -605 -4440
$$ [...]
##END NTUPLES=NMR SPECTRUM
##END=
