##TITLE=Analysis number 307817
Compound Code cc 03804
Project Code adrs
Chemist Name ugmt
##JCAMPDX= 6.0         $$ Bruker NMR JCAMP-DX V2.0
##DATA TYPE= NMR SPECTRUM
##DATA CLASS= NTUPLES
##ORIGIN= Bruker BioSpin GmbH
##OWNER= NMR
$$ XWIN-NMR		Version 3.5
$$ Fri May 13 15:23:12 2005 GMT Daylight Time (UT+1h)  MAYBRIDGE\NMR@NMR_250MHZ
##.OBSERVE FREQUENCY= 250.131544655141
##.OBSERVE NUCLEUS= ^1H
##.ACQUISITION MODE= SIMULTANEOUS (DQD)
##.ACQUISITION SCHEME= undefined
##.AVERAGES= 16
##.DIGITISER RES= 18
##SPECTROMETER/DATA SYSTEM= dpx250
##.PULSE SEQUENCE= zg30
##.SOLVENT NAME= CDCl3
##.SHIFT REFERENCE= (INTERNAL, CDCl3, 0, 16.451)
##AUDIT TRAIL= $$ (NUMBER, WHEN, WHO, WHERE, WHAT)
$$ ##TITLE= Audit trail, XWIN-NMR		Version 3.5
$$ ##JCAMPDX= 5.01
$$ ##ORIGIN= Bruker BioSpin GmbH
$$ ##OWNER= NMR
$$ C:\u/data/dgb/nmr/ADRS/2940/pdata/1/auditp.txt
$$ ##AUDIT TRAIL=  $$ (NUMBER, WHEN, WHO, WHERE, WHAT)
(   1,<2005-05-13 15:22:53.82 +100>,<MAYBRIDGE\NMR>,<NMR_250MHZ>,
      <created by zg, POWCHK disabled, PULCHK disabled
       configuration hash MD5:
       62 19 C7 07 E1 42 D1 B7 37 6C 3D D0 77 39 F9 E6
       data hash MD5: 64K
       AB B0 B7 EB 18 7F 17 8C 3C 3C 56 FB DE 85 C4 68>)
(   2,<2005-05-13 15:23:05.42 +100>,<MAYBRIDGE\NMR>,<NMR_250MHZ>,
      <Start of raw data processing
       ef LB = 0.3 FT_mod = 6 PKNL = 1 SI = 32K 
       data hash MD5: 32K
       43 80 67 08 DD C2 66 1F 3F 67 DE DA E6 D2 2C B5>)
(   3,<2005-05-13 15:23:07.18 +100>,<MAYBRIDGE\NMR>,<NMR_250MHZ>,
      <apk 
       data hash MD5: 32K
       FD A4 91 5F 98 AD 6A B5 F7 D4 58 6C 26 F3 01 E4>)
(   4,<2005-05-13 15:23:07.82 +100>,<MAYBRIDGE\NMR>,<NMR_250MHZ>,
      <abs ABSG = 5 
       data hash MD5: 32K
       49 61 12 0D 31 E5 2C EF 01 F2 9D F8 3F CB D8 BF>)
$$ ##END=
$$ 
$$ hash MD5
$$ 7E B1 B4 66 2A 5F 65 50 4D 9F BB 80 6D 75 8E 15
##$RELAX= 
##$RELAX= 
##$RELAX= 
##$RELAX= 
##$RELAX= 
##$RELAX= 
##$RELAX= 
$$ Bruker specific parameters
$$ --------------------------
##$DU= <C:\u>
##$EXPNO= 2940
##$NAME= <ADRS>
##$PROCNO= 1
##$TYPE= <nmr>
##$USER= <dgb>
##$AMP= (0..31)
100 100 100 100 100 100 100 100 100 100 100 100 100 100 100 100 100 100 
100 100 100 100 100 100 100 100 100 100 100 100 100 100 
##$AQSEQ= 0
##$AQ_mod= 3
##$AUNM= <au_zg>
##$AUTOPOS= <47 >
##$BF1= 250.13
##$BF2= 250.13
##$BF3= 250.13
##$BF4= 250.13
##$BF5= 500.13
##$BF6= 500.13
##$BF7= 500.13
##$BF8= 500.13
##$BYTORDA= 1
##$CFDGTYP= 0
##$CFRGTYP= 5
##$CHEMSTR= <none>
##$CNST= (0..31)
1 1 145 1 1 1 1 1 1 1 1 1 1 1 1 1 1 1 1 1 1 1 1 1 1 1 1 1 1 1 1 1 
##$CPDPRG= <>
##$CPDPRG1= <>
##$CPDPRG2= <>
##$CPDPRG3= <>
##$CPDPRG4= <mlev>
##$CPDPRG5= <mlev>
##$CPDPRG6= <mlev>
##$CPDPRG7= <mlev>
##$CPDPRG8= <mlev>
##$CPDPRGB= <>
##$CPDPRGT= <>
##$D= (0..31)
0 1 0 0 0 0 0 0 0 0.06 0 0 0 0 0 0 0.0002 0 0 0 0 0 0 0 0 0 0 0 0 0 0 
0 
##$DATE= 1115994172
##$DBL= (0..7)
120 120 120 120 120 120 120 120 
##$DBP= (0..7)
150 150 150 150 150 150 150 150 
##$DBP07= 0
##$DBPNAM0= <>
##$DBPNAM1= <>
##$DBPNAM2= <>
##$DBPNAM3= <>
$$ [...]
##$SUBNAM7= <"">
##$SUBNAM8= <"">
##$SUBNAM9= <"">
##$SW= 20.6930455092707
##$SWIBOX= (0..15)
0 0 3 0 0 0 0 0 0 0 0 0 0 0 0 0 
##$SW_h= 5175.983436853
##$TD= 65536
##$TD0= 1
##$TE= 297.16
##$TE2= 300
##$TE3= 300
##$TEG= 300
##$TL= (0..7)
0 120 120 120 120 120 120 120 
##$TP= (0..7)
150 150 150 150 150 150 150 150 
##$TP07= 0
##$TPNAME0= <>
##$TPNAME1= <>
##$TPNAME2= <>
##$TPNAME3= <>
##$TPNAME4= <>
##$TPNAME5= <>
##$TPNAME6= <>
##$TPNAME7= <>
##$TPOAL= (0..7)
0.5 0.5 0.5 0.5 0.5 0.5 0.5 0.5 
##$TPOFFS= (0..7)
0 0 0 0 0 0 0 0 
##$TUNHIN= 0
##$TUNHOUT= 0
##$TUNXOUT= 0
##$USERA1= <user>
##$USERA2= <user>
##$USERA3= <user>
##$USERA4= <user>
##$USERA5= <user>
##$V9= 5
##$VALIST= <valist>
##$VCLIST= <CCCCCCCCCCCCCCC>
##$VD= 0
##$VDLIST= <DDDDDDDDDDDDDDD>
##$VPLIST= <PPPPPPPPPPPPPPP>
##$VTLIST= <TTTTTTTTTTTTTTT>
##$WBST= 1024
##$WBSW= 4
##$XGAIN= (0..3)
0 0 0 0 
##$XL= 0
##$YL= 0
##$YMAX_a= 331614
##$YMIN_a= -280588
##$ZGOPTNS= <>
##$ZL1= 120
##$ZL2= 120
##$ZL3= 120
##$ZL4= 120
##$ABSF1= 16.45095
##$ABSF2= -4.242222
##$ABSG= 5
##$ABSL= 3
##$ALPHA= 0
##$AQORDER= 0
##$ASSFAC= 0
##$ASSFACI= 0
##$ASSFACX= 0
##$ASSWID= 0
##$AUNMP= <proc_1d>
##$AZFE= 0.1
##$AZFW= 0.1
##$BCFW= 0
##$BC_mod= 0
##$BYTORDP= 0
##$COROFFS= 0
##$CY= 12.5
##$DATMOD= 1
##$DC= 0
##$DFILT= <>
##$DTYPP= 0
##$F1P= 14.0000005364418
##$F2P= -0.99999901652339
##$FCOR= 0.5
##$FTSIZE= 32768
##$FT_mod= 6
##$GAMMA= 0
##$GB= 0
##$INTBC= 1
##$INTSCL= 1
##$ISEN= 128
##$LB= 0.3
##$LEV0= 0
##$LPBIN= 0
##$MAXI= 10000
##$MC2= 0
##$MEAN= 0
##$ME_mod= 0
##$MI= 0
##$NCOEF= 0
##$NC_proc= -3
##$NLEV= 6
##$NOISF1= 0
##$NOISF2= 0
##$NSP= 0
##$NTH_PI= 0
##$NZP= 0
##$OFFSET= 16.45095
##$PC= 1
##$PHC0= -70.97173
##$PHC1= 5.147635
##$PH_mod= 1
##$PKNL= yes
##$PPARMOD= 0
##$PSCAL= 4
##$PSIGN= 0
##$REVERSE= no
##$SF= 250.130017769753
##$SI= 32768
##$SIGF1= 0
##$SIGF2= 0
##$SINO= 400
##$SIOLD= 32768
##$SREGLST= <1H.CDCl3>
##$SSB= 0
##$STSI= 32768
##$STSR= 0
##$SW_p= 5175.98343685301
##$SYMM= 0
##$S_DEV= 0
##$TDeff= 65536
##$TDoff= 0
##$TI= <Analysis number 999999
Compound Code 99
Book Reference 9
Project Code 9>
##$TILT= no
##$TM1= 0
##$TM2= 0
##$TOPLEV= 0
##$USERP1= <user>
##$USERP2= <user>
##$USERP3= <user>
##$USERP4= <user>
##$USERP5= <user>
##$WDW= 1
##$XDIM= 32768
##$YMAX_p= 533517734
##$YMIN_p= -216254
$$ End of Bruker specific parameters
$$ ---------------------------------
##NTUPLES= NMR SPECTRUM
##VAR_NAME=  FREQUENCY,     SPECTRUM/REAL,   SPECTRUM/IMAG
##SYMBOL=    X,             R,               I
##VAR_TYPE=  INDEPENDENT,   DEPENDENT,       DEPENDENT
##VAR_FORM=  AFFN,          ASDF,            ASDF
##VAR_DIM=   32768,         32768,           32768
##UNITS=     HZ,            ARBITRARY UNITS, ARBITRARY UNITS
##FACTOR=    0.157963299565203, 1,           1
##FIRST=     4114.87657154991, 0,            0
##LAST=      -1061.1068653031, 0,            0
##MIN=       -1061.1068653031, -216254,      0
##MAX=       4114.87657154991, 533517734,    0
$$ Real data points
##PAGE= N=1
##DATA TABLE= (X++(R..R)), XYDATA
$$ [...]
##PAGE= N=2
##DATA TABLE= (X++(I..I)), XYDATA
$$ plain form
18223 -5292501 -5241673 -5073568 -4901792 -4720499 -4610992 -4525387 -4539382 -4566048 -4588740 -4614477
18213 -4614477 -4653343 -4577879 -4433966 -4316270 -4217236 -4071755 -3999657 -4010369 -4017453 -3998776 -3974334
18202 -3974334 -3890824 -3819626 -3786745 -3684179 -3571658 -3542084 -3616300 -3678447 -3652037 -3616474 -3529677
18191 -3529677 -3417281 -3312125 -3193467 -3025609 -2874983 -2751194 -2624534 -2472899 -2352642
18182 -2352642 -2195783 -1972990 -1810187 -1712039 -1712434 -1791958 -1954740 -2100611 -2173543 -2213595 -2191109
18171 -2191109 -2117244 -2049922 -1893332 -1707197 -1525856 -1317232 -1112218 -925547 -736568 -535467
18161 -535467 -297439 -148248 7416 124125 217026 312416 383785 406217 514965 670695
18151 670695 794457 913275 960343 971549 1020028 1115202 1228844 1421432 1665335 1908494
$$ packed form
18223e292501N0828J68105J71776J81293J09507Q5605j3995k6666k2692k5737
18213d614477l8866P5464J43913J17696R9034J45481P2098j0712p084J8677K4442
18202c974334Q3510P1198L2881J02566J12521K9574p4216o2147K6410L5563Q6797
18191c529677J12396J05156J18658J67858J50626J23789J26660J51635J20257
18182b352642J56859K22793J62803R8148l95p9524j62782j45871p2932m0052K2486
18171b191109P3865O7322J56590J86135J81341K08624K05014J86671J88979K01101
18161e35467K38028J49191J55664J16709R2901R5390P1369K2432J08748J55730
18151F70695J23762J18818M7068J1206M8479R5174J13642J92588K43903K43159
$$ plain form
18141 1908494 2218762 2587757 2891837 3212818 3525575 3861655 4248400 4641965 5080746
18132 5080746 5566288 6045413 6489362 6861236 7179831 7650250 8311459 9079200 9985839
18123 9985839 11067037 12333245 13732268 15337805 17115336 19088209 21245650 23570535
18115 23570535 26319686 29811377 34483252 40604612 48035344 54862387 53688267 33340276
18107 33340276 -4911430 -38699364 -57217045 -62572106 -58016639 -50959225 -44623350 -39622478
18099 -39622478 -35632463 -32296751 -29382909 -26957845 -24842409 -22905067 -21180388 -19668065
18091 -19668065 -18254296 -17110463 -16280086 -15850323 -15824725 -15808139 -15927993 -16236671 -16464301
18082 -16464301 -16451649 -16129251 -15612773 -14914674 -14200385 -13526424 -12972848 -12425339 -12031640
$$ packed form
18141A908494L10268L68995L04080L20981L12757L36080L86745L93565M38781
18132E080746M85542M79125M43949L71874L18595M70419O61209P67741R06639
18123I985839J081198J266208J399023J605537J777531J972873K157441K324885
18115B3570535K749151L491691M671875O121360P430732O827043j174120k0347991
18107C3340276l8251706l3787934j8517681n355061M555467P057414O335875N000872
18099c9622478L990015L335712K913842K425064K115436J937342J724679J512323
18091a9668065J413769J143833Q30377M29763K5598J6586j19854l08678k27630
18082a6464301J2652L22398N16478O98099P14289O73961N53576N47509L93699
$$ plain form
18073 -12031640 -11873678 -11941066 -12151980 -12410631 -12450585 -12240001 -11936786 -11579785 -11192485 -10828786
18063 -10828786 -10515740 -10198010 -9896527 -9809726 -9847898 -9914294 -9951493 -9850552 -9654888 -9370755
18053 -9370755 -9069549 -8920901 -8924828 -8954507 -8907218 -8774977 -8580498 -8291844 -8074023 -8134581
18043 -8134581 -8358065 -8675312 -8866099 -8952755 -8896627 -8723968 -8545396 -8358499 -8163130 -7925276
18033 -7925276 -7731167 -7534384 -7331272 -7111157 -7015767 -7064215 -7238893 -7466306 -7778431 -8079563
18023 -8079563 -8276535 -8285100 -8207846 -8060976 -7910378 -7767294 -7638229 -7496835 -7340541 -7236320
18013 -7236320 -7206126 -7165289 -7105738 -6979188 -6918636 -6838358 -6772133 -6759851 -6712943 -6665713 -6598991
18002 -6598991 -6625807 -6692843 -6721149 -6740790 -6675283 -6660939 -6596101 -6537002 -6464313 -6367612 -6278635
$$ packed form
18073a2031640J57962o7388k10914k58651l9954K10584L03215L57001L87300L63699
18063a0828786L13046L17730L01483Q6801l8172o6396l7199J00941J95664K84133
18053i370755L01206J48648l927k9679M7289J32241J94479K88654K17821o0558
18043h134581k23484l17247j90787q6656N6128J72659J78572J86897J95369K37854
18033g925276J94109J96783K03112K20115R5390m8448j74678k27413l12125l01132
18023h079563j96972q565P7254J46870J50598J43084J29065J41394J56294J04221
18013g236320L0194M0837N9551J26550O0552Q0278O6225J2282M6908M7230O6722
18002f598991k6816o7036k8306j9641O5507J4344O4838N9099P2689R6701Q8977
$$ plain form
17991 -6278635 -6211438 -6114589 -6027682 -5980845 -5984323 -5991282 -5945491 -5895855 -5835398 -5796683 -5787587 -5725906
17979 -5725906 -5666142 -5642594 -5626333 -5592236 -5566519 -5538524 -5496368 -5462540 -5470897 -5498773 -5511899
17968 -5511899 -5546449 -5538784 -5500501 -5500056 -5466620 -5423369 -5391623 -5441869 -5522483 -5581884 -5552100 -5506689
17956 -5506689 -5465503 -5372682 -5320657 -5297921 -5331165 -5310340 -5232329 -5235325 -5224741 -5176676 -5114618
17945 -5114618 -5068926 -5038928 -5013813 -5009523 -4957797 -4902564 -4913591 -4885809 -4851248 -4793651 -4720206
17934 -4720206 -4732761 -4696643 -4705384 -4724313 -4749117 -4716683 -4614094 -4513998 -4450072 -4394537 -4368579
17923 -4368579 -4416609 -4468775 -4425648 -4382524 -4342244 -4332076 -4383471 -4423074 -4503970 -4539023 -4484078
17912 -4484078 -4487857 -4474165 -4427174 -4466390 -4506065 -4506091 -4551755 -4514218 -4514269 -4505078 -4502086 -4512847 -4468622
$$ packed form
17991f278635O7197R6849Q6907M6837l478o959M5791M9636O0457L8715R096O1681
17979e725906N9764K3548J6261L4097K5717K7995M2156L3828q357k7876j3126
17968e511899l4550P665L8283M45L3436M3251L1746n0246q0614n9401K9784M5411
17956e506689M1186R2821N2025K2736l3244K0825P8011k996J0584M8065O2058
17945e114618M5692K9998K5115M290N1726N5233j1027K7782L4561N7597P3445
17934d720206j2555L6118q741j8929k4804L2434J02589J00096O3926N5535K5958
17923d368579m8030n2166M3127M3124M0280J0168n1395l9603q0896l5053N4945
17912d484078l779J3692M6991l9216l9675k6m5664L7537n1R191K992j0761M4225
$$ plain form
17899 -4468622 -4421778 -4360970 -4276539 -4293251 -4297430 -4283058 -4259106 -4251929 -4167468 -4164595 -4154510 -4105315
17887 -4105315 -4046187 -4021837 -4016572 -3996956 -3955057 -3929817 -3930103 -3940493 -3892776 -3864051 -3868550 -3875429
17875 -3875429 -3951359 -3989903 -3931427 -3920334 -3933748 -3906681 -3826526 -3757080 -3716967 -3721171 -3696945
17864 -3696945 -3691209 -3697285 -3731222 -3789549 -3805618 -3839093 -3878172 -3821853 -3823207 -3797543 -3813700 -3841557
17852 -3841557 -3820078 -3781163 -3671223 -3631097 -3587645 -3539468 -3509933 -3523522 -3484225 -3452417 -3455296
17841 -3455296 -3483044 -3460495 -3436944 -3430527 -3420644 -3410037 -3416817 -3473229 -3578483 -3561278 -3517610 -3457719
17829 -3457719 -3368948 -3394686 -3403878 -3394842 -3427786 -3439310 -3464882 -3507549 -3533334 -3483433 -3418847 -3413069
17817 -3413069 -3449030 -3519559 -3604509 -3615856 -3598530 -3542420 -3508689 -3449137 -3411970 -3435377 -3430730
$$ packed form
17899d468622M6844O0808Q4431j6712m179J4372K3952P177Q4461K873J0085M9195
17887d105315N9128K4350N265J9616M1899K5240k86j0390M7717K8725m499o879
17875c875429p5930l8544N8476J1093j3414K7067Q0155O9446M0113m204K4226
17864c696945N736o076l3937n8327j6069l3475l9079N6319j354K5664j6157k7857
17852c841557K1479L8915J09940M0126M3452M8177K9535j3589L9297L1808k879
17841c455296k7748K2549K3551O417R883J0607o780n6412j05254J7205M3668N9891
17829c457719Q8771k5738r192R036l2944j1524k5572m2667k5785M9901O4586N778
17817c413069l5961p0529q4950j1347J7326N6110L3731N9552L7167k3407M647
$$ plain form
17806 -3430730 -3465219 -3481233 -3438773 -3387823 -3378317 -3352941 -3302732 -3244432 -3193188 -3218198 -3217747 -3211767
17794 -3211767 -3206835 -3194373 -3206701 -3217491 -3204265 -3159531 -3158792 -3172532 -3204873 -3297465 -3396428 -3429218
17782 -3429218 -3422743 -3456421 -3424570 -3414938 -3377804 -3352471 -3319944 -3281519 -3284157 -3295785 -3255640 -3309625
17770 -3309625 -3335634 -3328459 -3321238 -3290736 -3240165 -3212899 -3229762 -3186029 -3131201 -3082185 -3049831 -3029684
17758 -3029684 -3039642 -3025142 -2995742 -2930067 -2837849 -2756446 -2754133 -2857041 -2946753 -3056596 -3079273
17747 -3079273 -3104062 -3131185 -3136537 -3141137 -3148375 -3178936 -3172215 -3167818 -3214700 -3220530 -3217343 -3208341 -3231511
17734 -3231511 -3193851 -3145098 -3127335 -3117286 -3068504 -3077452 -3162369 -3195660 -3236024 -3184347 -3113885
17723 -3113885 -3100274 -3093632 -3081709 -3081292 -3055220 -3009076 -2985887 -2952205 -2890948 -2890722 -2886495 -2936979
$$ packed form
17806c430730l4489j6014M2460N0950R506K5376N0209N8300N1244k5010M51N980
17794c211767M932J2462j2328j0790J3226M4734P39j3740l2341r2592r8963l2790
17782c429218O475l3678L1851R632L7134K5333L2527L8425k638j1628M0145n3985
17770c309625k6009P175P221L0502N0571K7266j6863M3733N4828M9016L2354K0147
17758c029684r958J4500K9400O5675R2218Q1403K313j02908q9712j09843k2677
17747c079273k4789k7123n352m600p238l0561O721M397m6882n830L187R002k3170
17734c231511L7660M8753J7763J0049M8782q948q4917l3291m0364N1677P0462
17723c113885J3611O642J1923M17K6072M6144K3189L3682O1257K26M227n0484
$$ plain form
17711 -2936979 -2906663 -2860444 -2839496 -2829653 -2831918 -2812273 -2800950 -2812539 -2822538 -2847740 -2887577 -2886348
17699 -2886348 -2876994 -2884413 -2846569 -2842918 -2902453 -2912131 -2853213 -2823958 -2814360 -2809212 -2847375 -2823645
17687 -2823645 -2817418 -2826442 -2874447 -2868136 -2843006 -2831334 -2867058 -2837467 -2786125 -2728751 -2681706 -2618411
17675 -2618411 -2618288 -2613711 -2624162 -2609930 -2581363 -2586807 -2605124 -2608052 -2622618 -2604221 -2569652 -2545588
17663 -2545588 -2524422 -2542046 -2551635 -2536059 -2590498 -2630446 -2596039 -2620350 -2648572 -2626908 -2610920
17652 -2610920 -2582625 -2584899 -2641191 -2665972 -2696778 -2742892 -2715637 -2717851 -2758920 -2745237 -2776782 -2835569
17640 -2835569 -2813656 -2786731 -2756147 -2706686 -2659007 -2605154 -2597282 -2583656 -2543942 -2534528 -2551790 -2604334
17628 -2604334 -2607974 -2581200 -2566270 -2535714 -2492203 -2455660 -2439302 -2478471 -2469853 -2446050 -2436779 -2466249
$$ packed form
17711b936979L0316M6219K0948R843k265J9645J1323j1589r999k5202l9837J229
17699b886348R354p419L7844L651n9535r678N8918K9255R598N148l8163K3730
17687b823645O227r024m8005O311K5130J1672l5724K9591N1342N7374M7045O3295
17675b618411J23M577j0451J4232K8567n444j8317k928j4566J8397L4569K4064
17663b545588K1166j7624r589J5576n4439l9948L4407k4311k8222K1664J5988
17652b610920K8295k274n6292k4781l0806m6114K7255k214m1069J3683l1545n8787
17640b835569K1913K6925L0584M9461M7679N3853P872J3626L9714R414j7262n2544
17628b604334l640K6774J4930L0556M3511L6543J6358l9169Q618K3803R271k9470
$$ plain form
17616 -2466249 -2451247 -2409396 -2366458 -2379121 -2398910 -2407933 -2429076 -2439624 -2463488 -2461705 -2485051 -2514056
17604 -2514056 -2519902 -2512728 -2540254 -2531112 -2516429 -2548292 -2560350 -2572538 -2534132 -2499607 -2455332 -2470662
17592 -2470662 -2468142 -2477179 -2492273 -2470178 -2470840 -2441429 -2405010 -2370293 -2355279 -2338845 -2314454 -2345840
17580 -2345840 -2367320 -2366002 -2311436 -2318918 -2370488 -2372792 -2402263 -2389133 -2345894 -2335427 -2338781 -2355665
17568 -2355665 -2358697 -2354461 -2346588 -2314943 -2339938 -2337725 -2321467 -2348959 -2333774 -2307747 -2273033 -2273833
17556 -2273833 -2278123 -2301231 -2282418 -2278013 -2335827 -2374420 -2335726 -2304302 -2261853 -2199609 -2147214 -2171071
17544 -2171071 -2260111 -2256009 -2242335 -2215477 -2284016 -2313777 -2230008 -2206221 -2205673 -2213320 -2257414 -2223837
17532 -2223837 -2228192 -2253315 -2207860 -2169781 -2150429 -2169518 -2170639 -2109176 -2081951 -2109864 -2171850 -2142724
$$ packed form
17616b466249J5002M1851M2938j2663j9789r023k1143j0548k3864J783k3346k9005
17604b514056n846P174k7526R142J4683l1863j2058j2188L8406L4525M4275j5330
17592b470662K520r037j5094K2095o62K9411L6419L4717J5014J6434K4391l1386
17580b345840k1480J318N4566p482n1570k304k9471J3130M3239J0467l354j6884
17568b355665l032M236P873L1645k4995K213J6258k7492J5185K6027L4714q00
17556b273833m290k3108J8813M405n7814l8593L8694L1424M2449O2244N2395k3857
17544b171071q9040M102J3674K6858o8539k9761Q3769K3787N48p647m4094L3577
17532b223837m355k5123M5455L8079J9352j9089j121O1463K7225k7913o1986K9126
$$ plain form
17520 -2142724 -2102352 -2061888 -2068051 -2112722 -2129196 -2166253 -2163951 -2116531 -2110248 -2136697 -2113737 -2105755
17508 -2105755 -2072773 -2099269 -2134504 -2123494 -2052954 -1999571 -2020208 -2028086 -2050571 -2056615 -2034394 -2039261
17496 -2039261 -2075029 -2073021 -2045971 -2054407 -2044876 -2033350 -2041157 -2092034 -2113194 -2098829 -2098416 -2059232
17484 -2059232 -2026585 -1958886 -1947699 -1928882 -1943524 -1967821 -1967696 -1963643 -1973286 -1979768 -1982290 -1932168
17472 -1932168 -1938631 -1940072 -1948086 -1988416 -1966816 -1929210 -1934316 -1920963 -1928857 -1910897 -1870384 -1817400
17460 -1817400 -1758386 -1782742 -1856300 -1914137 -1892042 -1857874 -1867028 -1856219 -1815366 -1764194 -1744296
17449 -1744296 -1783724 -1791033 -1792138 -1800966 -1765955 -1695832 -1666565 -1734396 -1865480 -2060779 -2175780
17438 -2175780 -2215454 -2228215 -2210093 -2168539 -2162028 -2082197 -2062668 -2064213 -2049188 -2048528 -2021381 -1949394
$$ packed form
17520b142724M0372M0464o163m4671j6474l7057K302M7420O283k6449K2960P982
17508b105755L2982k6496l5235J1010P0540N3383k0637p878k2485o044K2221m867
17496b039261l5768K008K7050q436R531J1526p807n0877k1160J4365M13L9184
17484b059232L2647O7699J1187J8817j4642k4297J25M053r643o482k522N0122
17472a932168o463j441q014m0330K1600L7606n106J3353p894J7960M0513N2984
17460a817400N9014k4356p3558n7837K2095L4168r154J0809M0853N1172J9898
17449a744296l9428p309j105q828L5011P0123K9267o7831j31084j95299j15001
17438b175780l9674j2761J8122M1554O511P9831J9529j545J5025O60K7147P1987
$$ plain form
17426 -1949394 -1938912 -1960988 -1973909 -1919951 -1904289 -1913156 -1935136 -1920405 -1893469 -1858345 -1830706
17415 -1830706 -1838290 -1869239 -1832565 -1845201 -1892352 -1859074 -1851085 -1854636 -1861101 -1866645 -1893044 -1890463
17403 -1890463 -1855480 -1793328 -1763152 -1786010 -1830665 -1876485 -1902355 -1913751 -1929392 -1947107 -1959248
17392 -1959248 -1933661 -1892275 -1807414 -1777027 -1780368 -1768451 -1827761 -1815762 -1816766 -1811696 -1811030 -1840322
17380 -1840322 -1823509 -1845561 -1845737 -1826734 -1848464 -1789085 -1744192 -1788342 -1797763 -1764661 -1739930 -1736466
17368 -1736466 -1751620 -1796464 -1789764 -1761023 -1749996 -1781287 -1791516 -1752068 -1796574 -1796353 -1770882 -1711688
17356 -1711688 -1750851 -1757173 -1744874 -1721242 -1688119 -1700360 -1714824 -1717316 -1730895 -1744251 -1727264 -1727553
17344 -1727553 -1753576 -1751292 -1710313 -1687241 -1711682 -1751378 -1743673 -1702547 -1740647 -1783124 -1751946 -1726287
$$ packed form
17426a949394J0482k2076j2921N3958J5662q867k1980J4731K6936L5124K7639
17415a830706p584l0949L6674j2636m7151L3278P989l551o465n544k6399K581
17403a890463L4983O2152L0176k2858m4655m5820k5870j1396j5641j7715j2141
17392a959248K5587M1386Q4861L0387l341J1917n9310J1999j004N070O66k9292
17380a840322J6813k2052j76J9003k1730N9379M4893m4150r421L3102K4731L464
17368a736466j5154m4844O700K8741J1027l1291j0229L9448m4506K21K5471N9194
17356a711688l9163o322J2299K3632L3123j2241j4464k492j3579j3356J6987k89
17344a727553k6023K284M0979K3072k4441l9696P705M1126l8100m2477L1178K5659
$$ plain form
17332 -1726287 -1668844 -1644893 -1661607 -1646711 -1678863 -1714118 -1716978 -1702039 -1646927 -1626449 -1630455 -1626118
17320 -1626118 -1594354 -1607595 -1617972 -1610611 -1614939 -1576471 -1598834 -1610894 -1614760 -1577474 -1572778 -1579516
17308 -1579516 -1605240 -1630347 -1648892 -1612889 -1587822 -1560230 -1580956 -1591414 -1595524 -1613295 -1604108 -1578876
17296 -1578876 -1655156 -1667745 -1632435 -1626552 -1617837 -1603878 -1592118 -1566781 -1577122 -1606254 -1666461 -1680885
17284 -1680885 -1616887 -1606894 -1615208 -1610621 -1606242 -1584180 -1585319 -1605570 -1620052 -1591986 -1572062 -1590776
17272 -1590776 -1581053 -1591981 -1584892 -1583344 -1569435 -1524542 -1507863 -1539682 -1596212 -1634956 -1616988 -1595833
17260 -1595833 -1565685 -1562414 -1596507 -1563921 -1529730 -1541593 -1583121 -1603059 -1563654 -1528539 -1493135
17249 -1493135 -1507169 -1580809 -1618427 -1575043 -1521440 -1511272 -1502690 -1537752 -1523166 -1462694 -1458036 -1503838
$$ packed form
17332a726287N7443K3951j6714J4896l2152l5255k860J4939N5112K0478m006M337
17320a626118L1764j3241j0377P361m328L8468k2363j2060l866L7286M696o738
17308a579516k5724k5107j8545L6003K5067K7592k0726j0458m110j7771R187K5232
17296a578876p6280j2589L5310N883Q715J3959J1760K5337j0341k9132o0207j4424
17284a680885O3998R993q314M587M379K2062j139k0251j4482K8066J9924j8714
17272a590776R723j0928P089J548J3909M4893J6679l1819n6530l8744J7968K1155
17260a595833L0148L271l4093L2586L4191j1863m1528j9938L9405L5115L5404
17249a493135j4034p3640l7618M3384N3603J0168Q582l5062J4586O0472M658m5802
$$ plain form
17237 -1503838 -1492232 -1446113 -1436556 -1437130 -1390897 -1381527 -1440417 -1452805 -1471527 -1474864 -1440927 -1417721
17225 -1417721 -1405264 -1437628 -1469575 -1497761 -1476149 -1475180 -1485295 -1449484 -1423430 -1467256 -1497532 -1445139
17213 -1445139 -1457669 -1475377 -1416757 -1354263 -1380642 -1410558 -1456768 -1494735 -1499838 -1469333 -1450892
17202 -1450892 -1493251 -1495937 -1485734 -1476793 -1409761 -1398561 -1373651 -1349404 -1400933 -1451882 -1430389 -1397979
17190 -1397979 -1344578 -1385303 -1430776 -1411188 -1426813 -1443788 -1431896 -1404322 -1380142 -1341517 -1315077
17179 -1315077 -1284894 -1283948 -1318779 -1358235 -1384860 -1329021 -1322539 -1319713 -1316370 -1338739 -1365619 -1395751
17167 -1395751 -1352218 -1291472 -1306126 -1355659 -1419292 -1460661 -1456311 -1437581 -1338880 -1298656 -1279952
17156 -1279952 -1266757 -1284191 -1333421 -1332758 -1320250 -1345459 -1412756 -1382134 -1357247 -1354924 -1365869 -1354429
$$ packed form
17237a503838J1606M6119R557n74M6233R370n8890j2388j8722l337L3937K3206
17225a417721J2457l2364l1947k8186K1612R69j0115L5811K6054m3826l0276N2393
17213a445139j2530j7708N8620O2494k6379k9916m6210l7967n103L0505J8441
17202a450892m2359k686J0203Q941O7032J1200K4910K4247n1529n0949K1493L2410
17190a397979N3401m0725m5473J9588j5625j6975J1892K7574K4180L8625K6440
17179a315077L0183R46l4831l9456k6625N5839O482K826L343k2369k6880l0132
17167a395751M3533O0746j4654m9533o3633m1369M350J8730R8701M0224J8704
17156a279952J3195j7434m9230O63J2508k5209o7297L0622K4887K323j0945J1440
$$ plain form
17144 -1354429 -1294589 -1277068 -1332362 -1337846 -1369084 -1462976 -1496257 -1410472 -1327857 -1338714 -1323370
17133 -1323370 -1332956 -1350029 -1357473 -1335011 -1308099 -1289234 -1259797 -1225691 -1249663 -1273047 -1274999 -1311920
17121 -1311920 -1309220 -1308711 -1251156 -1229901 -1268064 -1283405 -1297961 -1267449 -1237065 -1280597 -1320933 -1302999
17109 -1302999 -1288428 -1256920 -1242618 -1248812 -1295917 -1351277 -1315162 -1303662 -1303770 -1284597 -1260665 -1273160
17097 -1273160 -1263470 -1272678 -1288519 -1356980 -1331196 -1268551 -1290935 -1316372 -1308420 -1251160 -1203123 -1228520
17085 -1228520 -1301475 -1238879 -1207810 -1217548 -1207530 -1240597 -1279863 -1272105 -1274149 -1296915 -1287079 -1310782
17073 -1310782 -1255050 -1179259 -1205441 -1191162 -1199048 -1223788 -1219587 -1231388 -1227474 -1176259 -1177919 -1187078
17061 -1187078 -1169139 -1132579 -1143952 -1170310 -1211268 -1212700 -1186037 -1171069 -1180013 -1208595 -1232966 -1206748
$$ packed form
17144a354429N9840J7521n5294n484l1238r3892l3281Q5785Q2615j0857J5344
17133a323370r586j7073p444K2462K6912J8865K9437L4106k3972k3384j952l6921
17121a311920K700N09N7555K1255l8163j5341j4556L0512L0384m3532m0336J7934
17109a302999J4571L1508J4302o194m7105n5360L6115J1500j08J9173K3932j2495
17097a273160R690r208j5841o8461K5784O2645k2384k5437P952N7260M8037k5397
17085a228520p2955O2596L1069r738J0018l3067l9266P758k044k2766R836k3703
17073a310782N5732P5791k6182J4279p886k4740M201j1801L914N1215j660r159
17061a187078J7939L6560j1373k6358m0958j432K6663J4968q944k8582k4371K6218
$$ plain form
17049 -1206748 -1212262 -1220794 -1228248 -1248948 -1280617 -1258207 -1252512 -1239994 -1231410 -1190632 -1138026 -1101472
17037 -1101472 -1088279 -1125924 -1155386 -1145358 -1154293 -1163691 -1086687 -1115005 -1152688 -1159041 -1103405 -1111143
17025 -1111143 -1140237 -1186087 -1180492 -1174721 -1216081 -1207137 -1236688 -1228177 -1183248 -1170329 -1160225 -1165693
17013 -1165693 -1200770 -1209948 -1180079 -1198954 -1172825 -1129675 -1117308 -1100360 -1106117 -1125849 -1141140 -1164058
17001 -1164058 -1162400 -1151828 -1122113 -1096164 -1124008 -1164055 -1163068 -1190629 -1167707 -1127317 -1110190 -1096854
16989 -1096854 -1112906 -1124955 -1102995 -1091530 -1131870 -1169688 -1172212 -1156417 -1136627 -1068500 -1060502 -1067345
16977 -1067345 -1071453 -1101458 -1119237 -1065879 -1052386 -1082124 -1091048 -1115560 -1088154 -1118014 -1163494 -1136506
16965 -1136506 -1073894 -1066668 -1085374 -1067299 -1044466 -1015140 -1038724 -1064797 -1044268 -1049447 -1041592 -1038265
$$ packed form
17049a206748n514q532p454k0700l1669K2410N695J2518Q584M0778N2606L6554
17037a101472J3193l7645k9462J0028q935r398P7004k8318l7683o353N5636p738
17025a111143k9094m5850N595N771m1360Q944k9551Q511M4929J2919J0104n468
17013a165693l5077r178K9869j8875K6129M3150J2367J6948n757j9732j5291k2918
17001a164058J658J0572K9715K5949k7844m0047R87k7561K2922M0390J7127J3336
16989a096854j6052j2049K1960J1465m0340l7818k524J5795J9790O8127P998o843
16977a067345m108l0005j7779N3358J3493k9738q924k4512K7406k9860m5480K6988
16965a136506O2612P226j8706J8075K2833K9326k3584k6073K0529n179P855L327
$$ plain form
16953 -1038265 -1043732 -1042100 -1039942 -1058939 -1080201 -1073409 -1088036 -1091345 -1103794 -1112844 -1099657 -1087973
16941 -1087973 -1074587 -1103008 -1081326 -1074522 -1058735 -1056926 -1087094 -1088063 -1092213 -1096184 -1084489 -1086201 -1044491
16928 -1044491 -1042357 -1042751 -1044237 -1005623 -1028208 -1094932 -1071119 -1026339 -1010880 -1022606 -1013046 -1054505
16916 -1054505 -1046103 -963439 -957618 -950793 -892323 -893632 -957921 -960634 -993185 -1016732 -1066313 -1080697
16904 -1080697 -1057750 -1060798 -1062932 -1033717 -965800 -937519 -934341 -963374 -939264 -931363 -952857 -973821
16892 -973821 -1002620 -993587 -980226 -955227 -989340 -974677 -958496 -984964 -1003082 -994391 -997476 -975168
16880 -975168 -949645 -920092 -988142 -1050113 -1046692 -1054254 -1044780 -1057933 -1051059 -999692 -969327 -973711
16868 -973711 -964152 -963083 -977702 -997105 -959868 -943643 -983630 -1010480 -1025296 -1032790 -1048702 -1025934
$$ packed form
16953a038265n467J632K158j8997k1262O792j4627l309j2449r050J3187J1684
16941a087973J3386k8421K1682O804J5787J809l0168r69m150l971J1695j712M1710
16928a044491K134l94j486L8614k2585o6724K3813M4780J5459j1726R560m1459
16916a054505Q402Q2664N821O825N8470j309o4289k713l2551k3547m9581j4384
16904a080697K2947l048k134K9215O7917K8281L178k9033K4110P901k1494k0964
16892i73821k8799R033J3361K4999l4113J4663J6181k6468j8118Q691l085K2308
16880i75168K5523K9553o8050o1971L421p562R474j3153O874N1367L0365m384
16868i73711R559J069j4619j9403L7237J6225l9987k6850j4816p494j5912K2768
$$ plain form
16856 -1025934 -1028708 -1029663 -1013723 -1037196 -992919 -960014 -961062 -996010 -976674 -981947 -944470 -926759
16844 -926759 -947668 -965987 -981681 -983038 -981357 -971964 -1002246 -1014865 -973418 -969926 -937182 -895680
16832 -895680 -897369 -932538 -913049 -934980 -965369 -966168 -971105 -1018962 -1020698 -1072996 -1068620 -1077313 -1025241
16819 -1025241 -1022560 -1004330 -993812 -956992 -947123 -918692 -963968 -978641 -1020189 -1013202 -986249 -941918
16807 -941918 -882238 -923458 -978782 -993749 -961767 -943059 -981277 -954620 -898994 -926719 -942375
16796 -942375 -962305 -942514 -923501 -921477 -941377 -987544 -981723 -990108 -983344 -945706 -927792 -897829
16784 -897829 -896488 -884900 -891637 -859100 -812726 -776025 -775233 -790221 -805620 -828890 -848127 -864742
16772 -864742 -867804 -925748 -952214 -907864 -888944 -861491 -916222 -971036 -983234 -982691 -940052 -932100
$$ packed form
16856a025934k774r55J5940k3473M4277L2905j048l4948J9336n273L7477J7711
16844i26759k0909j8319j5694j357J681R393l0282j2619M1447L492L2744M1502
16832h95680j689l5169J9489k1931l0389p99m937m7857j736n2298M376q693N2072
16819a025241K681J8230J0518L6820R869K8431m5276j4673m1548O987K6953M4331
16807i41918N9680m1220n5324j4967L1982J8708l8218K6657N5626k7725j5656
16796i42375j9930J9791J9013K024j9900m6167N821q385O764L7638J7914K9963
16784h97829J341J1588o737L2537M6374L6701P92j4988j5399k3270j9237j6615
16772h64742l062n7944k6466M4350J8920K7453n4731n4814j2198N43M2639P952
$$ plain form
16760 -932100 -894784 -861811 -906423 -893344 -878793 -884963 -855301 -823419 -811031 -839105 -896629 -916876
16748 -916876 -945395 -956343 -893472 -868777 -860025 -883249 -943497 -913060 -896453 -879207 -887650 -898941
16736 -898941 -873401 -820050 -802167 -849546 -864285 -838853 -839406 -860233 -802629 -795461 -837600 -869718
16724 -869718 -891769 -871594 -814008 -839390 -840923 -877839 -853055 -809612 -777144 -801727 -805901 -814339
16712 -814339 -840635 -803511 -768856 -804334 -850448 -845019 -847384 -819272 -819964 -833949 -861120 -854705
16700 -854705 -892713 -848268 -806008 -800169 -816130 -863034 -858498 -879534 -860987 -768245 -782133 -828689
16688 -828689 -875747 -910568 -908582 -897916 -882413 -826532 -813332 -823178 -850155 -812737 -796253 -813528
16676 -813528 -831837 -826270 -852131 -875647 -890432 -834117 -775498 -780019 -785472 -773678 -730403 -778343
$$ packed form
16760i32100L7316L2973m4612J3079J4551o170K9662L1882J2388k8074n7524k0247
16748i16876k8519j0948O2871K4695Q752k3224o0248L0437J6607J7246q443j1291
16736h98941K5540N3351J7883m7379j4739K5432n53k0827N7604P168m2139l2118
16724h69718k2051K0175N7586k5382j533l6916K4784M3443L2468k4583m174q438
16712h14339k6296L7124L4655l5478m6114N429k365K8112o92j3985k7171O415
16700h54705l8008M4445M2260N839j5961m6904M536k1036J8547R2742j3888m6556
16688h28689m7058l4821J986J0666J5503N5881J3200r846k6977L7418J6484j7275
16676h13528j8309N567k5861k3516j4785N6315N8619m521n453J1794M3275m7940
$$ plain form
16664 -778343 -837815 -872538 -929850 -918172 -913013 -905488 -839026 -834653 -856089 -845952 -878751 -910544
16652 -910544 -888153 -868636 -834499 -807182 -837925 -888371 -846791 -796854 -802622 -817369 -802901 -770281
16640 -770281 -783697 -819566 -800728 -770059 -801916 -822815 -837878 -788323 -826413 -828270 -886649 -901065
16628 -901065 -858667 -780204 -715967 -663640 -694606 -710381 -720547 -766764 -819544 -796986 -708805
16617 -708805 -666556 -727874 -804236 -814453 -791333 -778482 -794936 -783811 -818634 -821885 -789517 -780112
16605 -780112 -798469 -794485 -782438 -798601 -780344 -745463 -684013 -676792 -666064 -672699 -711219 -736323
16593 -736323 -733392 -732973 -731976 -727188 -709076 -745423 -744775 -750907 -765147 -782416 -764197 -767799 -728362
16580 -728362 -666169 -648046 -684519 -742950 -758634 -730912 -733192 -749285 -789879 -763851 -736539 -716871
$$ packed form
16664g78343n9472l4723n7312J1678N159P525O6462M373k1436J0137l2799l1793
16652i10544K2391J9517L4137K7317l0743n0446M1580M9937n768j4747J4468L2620
16640g70281j3416l5869J8838L0669l1857k0899j5063M9555l8090j857n8379j4416
16628i01065M2398P8463O4237N2327l0966j5775j0166m6217n2780K2558Q8181
16617g08805M2249o1318p6362j0217K3120J2851j6454J1125l4823l251L2368R405
16605g80112j8357L984J2047j6163J8257L4881O1450P221J0728o635l8520k5104
16593g36323K931M19R97M788J8112l6347O48o132j4240j7269J8219l602L9437
16580g28362O2193J8123l6473n8431j5684K7722k280j6093m0594K6028K7312J9668
$$ plain form
16568 -716871 -710074 -772814 -805362 -783897 -710343 -735855 -753961 -734532 -739027 -785931 -767581 -739807
16556 -739807 -707225 -708523 -727492 -744832 -712576 -690746 -706676 -665196 -664829 -717493 -711716 -690166
16544 -690166 -707902 -747482 -746517 -730109 -777714 -823486 -834922 -806757 -800585 -814257 -805134 -773171
16532 -773171 -803476 -822359 -838443 -834824 -755977 -702982 -684052 -757771 -773247 -746758 -691678 -669201
16520 -669201 -686427 -678124 -689916 -656243 -640995 -653432 -640109 -668264 -747876 -780325 -746004 -732199
16508 -732199 -748607 -740271 -655479 -630299 -621686 -620860 -662711 -675457 -668895 -674747 -673561 -624815 -641944
16495 -641944 -666113 -670563 -712787 -745126 -754694 -680335 -702757 -744572 -784524 -777587 -685480 -661408
16483 -661408 -687057 -626092 -634967 -640413 -667130 -672568 -662500 -643686 -666194 -620587 -572380 -619570
$$ packed form
16568g16871O797o2740l2548K1465P3554k5512j8106J9429m495m6904J8350K7774
16556g39807L2582j298j8969j7340L2256K1830j5930M1480L67n2664N777K1550
16544f90166j7736l9580R65J6408m7605m5772j1436K8165O172j3672R123L1963
16532g73171l0305j8883j6084L619P8847N2995J8930p3719j5476K6489N5080K2477
16520f69201j7226Q303j1792L3673J5248j2437J3323k8155p9612l2449L4321J3805
16508g32199j6408Q336Q4792K5180Q613Q26m1851j2746O562n852J186M8746j7129
16495f41944k4169m450m2224l2339r568P4359k2422m1815l9952O937R2107K4072
16483f61408k5649O0965q875n446k6717n438J0068J8814k2508M5607M8207m7190
$$ plain form
16471 -619570 -657817 -671446 -655370 -659553 -645137 -618278 -623157 -603105 -630910 -648012 -650194 -615741
16459 -615741 -592151 -552693 -571307 -618905 -606913 -589835 -654074 -655268 -685885 -699741 -647073 -643888
16447 -643888 -632476 -608332 -566082 -578891 -613989 -609015 -660430 -692796 -702214 -730715 -691772 -625809
16435 -625809 -557829 -566675 -565537 -599412 -612873 -610051 -630232 -659455 -686047 -679779 -678904 -639255 -623505
16422 -623505 -651667 -680220 -651613 -675295 -629333 -595964 -551558 -535605 -536414 -569510 -619529 -616768
16410 -616768 -568021 -621752 -661505 -661479 -659265 -637458 -645321 -652713 -663260 -714525 -693139 -645141 -666371
16397 -666371 -639053 -622564 -615451 -619549 -633340 -599201 -602141 -601744 -601281 -607178 -629387 -645942 -643436
16384 -643436 -545794 -523578 -519136 -550290 -586771 -570792 -617499 -655654 -623929 -623425 -611387 -626963
$$ packed form
16471f19570l8247j3629J6076m183J4416K6859m879K0052k7805j7102k182L4453
16459f15741K3590L9458j8614m7598J1992J7078o4239j194l0617j3856N2668L185
16447f43888J1412K4144M2250j2809l5098M974n1415l2366r418k8501L8943O5963
16435f25809O7980q846J138l3875j3461K822k0181k9223k6592O268Q75L9649J5750
16422f23505k8162k8553K8607k3682M5962L3369M4406J5953q09l3096n0019K761
16410f16768M8747n3731l9753K6K214K1807p863p392j0547n1265K1386M7998k1230
16397f66371K7318J6489P113m098j3791L4139k940L97M63n897k2209j6555K506
16384f43436R7642K2216M442l1154l6481J5979m6707l8155L1725N04J2038j5576
$$ plain form
16372 -626963 -584673 -604942 -579209 -554625 -521144 -506768 -471818 -515063 -549167 -587706 -590076 -535260
16360 -535260 -542045 -543359 -621169 -648658 -620146 -630523 -634589 -602175 -618442 -593911 -631775 -633958
16348 -633958 -636089 -651763 -622940 -610973 -613532 -614442 -609816 -661322 -677537 -670695 -636837 -590146 -606754
16335 -606754 -626281 -593562 -568284 -542422 -569529 -584121 -554636 -577009 -568771 -583568 -589915 -568789
16323 -568789 -542360 -486705 -481989 -552772 -561885 -588306 -616422 -585878 -575889 -522971 -536407 -573822
16311 -573822 -565445 -530081 -502097 -523599 -566926 -595472 -593057 -580310 -549530 -542656 -500276 -539451
16299 -539451 -548695 -548278 -573847 -501794 -459303 -474050 -528375 -544868 -530142 -546043 -590856 -589895
16287 -589895 -591285 -568911 -524692 -517517 -506186 -567041 -603809 -569421 -533480 -492147 -517196 -581899
$$ packed form
16372f26963M2290k0269K5733K4584L3481J4376L4950m3245l4104l8539k370N4816
16360e35260o785j314p7810k7489K8512j0377m066L2414j6267K4531l7864k183
16348f33958k131j5674K8823J1967k559r10M626n1506j6215O842L3858M6691j6608
16335f06754j9527L2719K5278K5862k7107j4592K9485k2373Q238j4797o347K1126
16323e68789K6429N5655M716p0783r113k6421k8116L0544R989N2918j3436l7415
16311e73822Q377L5364K7984k1502m3327k8546K415J2747L0780O874M2380l9175
16299e39451r244M17k5569P2053M2491j4747n4325j6493J4726j5901m4813R61
16287e89895j390K2374M4219P175J1331o0855l6768L4388L5941M1333k5049o4703
$$ plain form
16275 -581899 -585212 -508917 -499586 -507217 -494945 -451086 -469798 -485258 -524131 -530593 -584009 -593702
16263 -593702 -563993 -604751 -618503 -606113 -568204 -588238 -599416 -560343 -499789 -476441 -484324 -454129
16251 -454129 -481414 -522530 -530753 -530936 -557995 -606596 -592688 -562318 -584723 -577491 -508397 -463311
16239 -463311 -468121 -463621 -524623 -572912 -571675 -526207 -487105 -494922 -492684 -495813 -487475 -485475 -508122
16226 -508122 -529754 -571262 -577895 -567455 -542906 -526639 -488244 -434224 -434354 -463814 -436729 -412074
16214 -412074 -436705 -491558 -502030 -509082 -465266 -524731 -551472 -546427 -519539 -511677 -492497 -451347
16202 -451347 -448818 -442976 -433052 -450917 -430655 -405406 -408079 -447998 -493221 -465872 -442265 -443701
16190 -443701 -436490 -434029 -405780 -372478 -402651 -472373 -483749 -462338 -476660 -502763 -471508 -429474
$$ packed form
16275e81899l313P6295R331p631J2272M3859j8712j5460l8873o462n3416r693
16263e93702K9709m0758j3752J2390L7909k0034j1178L9073O0554K3348p883L0195
16251d54129k7285m1116q223j83k7059m8601J3908L0370k2405P232O9094M5086
16239d63311m810M500o1002m8289J237M5468L9102p817K238l129Q338K000k2647
16226e08122k1632m1508o633J0440K4549J6267L8395N4020j30k9460K7085K4655
16214d12074k4631n4853j0472p052M3816n9465k6741N045K6888P862J9180M1150
16202d51347K529N842R924j7865K0262K5249k673l9919m5223K7349K3607j436
16190d43701P211K461K8249L3302l0173o9722j1376K1411j4322k6103L1255M2034
$$ plain form
16178 -429474 -496707 -541076 -527647 -529383 -502239 -504680 -457249 -426542 -459414 -472497 -442418 -424099
16166 -424099 -463315 -495529 -441685 -438659 -503505 -522571 -519510 -536988 -492010 -496491 -526723 -530954
16154 -530954 -544221 -562361 -544280 -554789 -578389 -590638 -549523 -500558 -494485 -396474 -382794 -376999
16142 -376999 -359659 -404334 -475606 -528560 -515058 -443203 -413671 -406788 -370772 -403193 -449938 -488901
16130 -488901 -456037 -471438 -424678 -376663 -376996 -402135 -409371 -442052 -513188 -508927 -485672 -484891 -497668
16117 -497668 -471138 -442730 -401819 -399470 -424618 -438317 -441315 -387568 -383774 -412076 -408380 -440451
16105 -440451 -459656 -402860 -352994 -344149 -400601 -476476 -521791 -510126 -499733 -503087 -463458 -425604
16093 -425604 -376062 -336133 -342359 -385729 -379817 -369556 -415001 -403492 -436403 -419142 -426843 -417024
$$ packed form
16178d29474o7233m4369J3429j736K7144k441M7431L0707l2872j3083L0079J8319
16166d24099l9216l2214N3844L026o4846j9066L061j7478M4978m481l0232m231
16154e30954j3267j8140J8081j0509k3600j2249M1115M8965O073R8011J3680N795
16142c76999J7340m4675p1272n2954J3502P1855K9532O883L6016l2421m6745l8963
16130d88901L2864j5401M6760M8015l33k5139p236l2681p1136M261K3255P81j2777
16117d97668K6530K8408M0911K349k5148j3699k998N3747L794k8302L696l2071
16105d40451j9205N6796M9866Q845n6452p5875m5315J1665J0393l354L9629L7854
16093d25604M9542L9929o226m3370N912J0261m5445J1509l2911J7261p701R819
$$ plain form
16081 -417024 -414246 -414430 -363937 -362491 -417527 -416637 -428087 -430653 -423475 -411500 -384353 -416482 -424553
16068 -424553 -408822 -412764 -416397 -382231 -399237 -400405 -432649 -405407 -422638 -428158 -397600 -400586
16056 -400586 -396681 -361617 -356726 -344155 -384574 -471902 -461772 -394616 -354912 -341200 -313247 -303916
16044 -303916 -350643 -382306 -376161 -368953 -375477 -353366 -367026 -388635 -410889 -423504 -437140 -417440
16032 -417440 -414712 -427199 -413296 -362415 -284834 -314487 -398328 -354276 -314035 -286458 -341689 -382753
16020 -382753 -379477 -342748 -300996 -341280 -343070 -314785 -291709 -296152 -328437 -340502 -415109 -510589
16008 -510589 -460179 -384668 -357180 -347454 -379042 -395853 -427417 -399393 -371275 -322380 -361828 -396192
15996 -396192 -375729 -369656 -398869 -395094 -386294 -374700 -309452 -292188 -312567 -326015 -355711 -394512
$$ packed form
16081d17024K778j84N0493J446n5036Q90j1450k566P178J1975K7147l2129q071
16068d24553J5731l942l633L4166j7006j168l2244K7242j7231n520L0558k986
16056d00586L905L5064M891J2571m0419q7328J0130O7156L9704J3712K7953R331
16044c03916m6727l1663O145P208o524K2111j3660k1609k2254j2615j3636J9700
16032d17440K728j2487J3903N0881P7581k9653q3841M4052M0241K7577n5231m1064
16020c82753L276L6729M1752m0284j790K8285K3076m443l2285j2065p4607r5480
16008e10589N0410P5511K7488R726l1588j6811l1564K8024K8118M8895l9448l4364
15996c96192K0463O073k9213L775Q800J1594O5248J7264k0379j3448k9696l8801
$$ plain form
15984 -394512 -393870 -375398 -350611 -334153 -366294 -406141 -371564 -365007 -375679 -365480 -348575 -349385
15972 -349385 -356798 -337968 -378229 -391021 -342082 -343350 -389596 -402480 -415887 -400638 -356604 -391770
15960 -391770 -460758 -409697 -341532 -256638 -217504 -242912 -255858 -286520 -322347 -321759 -281329 -258376
15948 -258376 -303719 -346383 -346489 -324383 -295411 -304359 -329619 -325280 -305872 -295473 -278707 -276639
15936 -276639 -286358 -315448 -332427 -327916 -337155 -331751 -334656 -391829 -387321 -380376 -392655 -336144 -331335
15923 -331335 -350357 -367492 -332205 -367022 -401772 -411391 -370809 -382531 -367804 -331178 -338877 -333131
15911 -333131 -375767 -393479 -359343 -347090 -303275 -234341 -252704 -334544 -391881 -370946 -344787
15900 -344787 -341690 -309730 -287466 -312976 -324548 -301083 -294982 -329053 -304035 -286456 -298120 -299308
$$ packed form
15984c94512O42J8472K4787J6458l2141l9847L4577O557j0672J0199J6905q10
15972c49385p413J8830m0261j2792M8939j268m6246j2884j3407J5249M4034l5166
15960c91770o8988N1061O8165Q4894L9134k5408j2946l0662l5827N88M0430K2953
15948b58376m5343m2664j06K2106K8972q948k5260M339J9408J0399J6766K068
15936b76639r719k9090j6979M511r239N404k905n7173M508O945j2279N6511M809
15923c31335j9022j7135L5287l4817l4750r619M0582j1722J4727L6626p699N746
15911c33131m2636j7712L4136J2253M3815O8934j8363q1840n7337K0935K6159
15900c44787L097L1960K2264k5510j1572K3465O101l4071K5018J7579j1664j188
$$ plain form
15888 -299308 -310242 -326769 -334980 -343780 -332876 -279058 -337484 -390212 -338996 -308969 -308133 -317050
15876 -317050 -321303 -345408 -335304 -377522 -351647 -285633 -294976 -298433 -335047 -356750 -354163 -356023
15864 -356023 -348016 -358607 -361723 -350810 -354596 -339646 -338165 -301996 -299543 -304787 -347788 -324584 -282363
15851 -282363 -312751 -305372 -297517 -299220 -317583 -340594 -301845 -307288 -275111 -308975 -332170 -304011
15839 -304011 -269338 -296728 -299820 -312433 -331681 -314155 -313488 -341216 -279660 -225145 -244256 -258308
15827 -258308 -278437 -279560 -302013 -293929 -271945 -285673 -314105 -365453 -323636 -286419 -283301 -243544
15815 -243544 -199382 -179399 -167975 -200215 -232821 -246954 -251592 -234318 -244436 -229133 -203293 -199367
15803 -199367 -245589 -250921 -249398 -236689 -206838 -155708 -140226 -193326 -245951 -250492 -205650 -184203
$$ packed form
15888b99308j0934j6527q211q800J0904N3818n8426n2728N1216L0027Q36q917
15876c17050m253k4105J0104m2218K5875O6014r343l457l6614k1703K587j860
15864c56023Q007j0591l116J0913l786J4950J481L6169K453n244m3001K3204M2221
15851b82363l0388P379P855j703j8363k3011L8749n443L2177l3864k3195K8159
15839c04011L4673k7390l092j2613j9248J7526O67k7728O1556N4515j9111j4052
15827b58308k0129j123k2453Q084K1984j3728k8432n1348M1817L7217L118L9757
15815b43544M4162J9983J1424l2240l2606j4133m638J7274j0118J5303K5840L926
15803a99367m6222n332J523J2709K9851N1130J5482n3100n2625m541M4842K1447
$$ plain form
15791 -184203 -183617 -150633 -138343 -174057 -212943 -257199 -284111 -269888 -255415 -235758 -249980 -265269
15779 -265269 -286864 -299958 -231659 -199499 -196906 -173429 -192995 -206863 -187696 -221275 -222724 -206233
15767 -206233 -196841 -232451 -219566 -194820 -238935 -250419 -258612 -255379 -249970 -246940 -222107 -194367
15755 -194367 -181533 -207312 -246225 -249705 -256022 -234175 -222511 -247808 -271946 -252203 -222363 -210459
15743 -210459 -196475 -206666 -197994 -244710 -225994 -221454 -206657 -171861 -154941 -183471 -239389 -271163
15731 -271163 -261289 -199718 -164306 -149855 -182223 -162025 -190692 -218449 -191763 -192467 -232066 -281398
15719 -281398 -283480 -294118 -278930 -236192 -197722 -247121 -240506 -193390 -245998 -244833 -185036 -163673
15707 -163673 -184843 -177549 -175066 -181439 -175484 -188593 -122120 -128486 -161478 -152302 -129602 -153876 -158222
$$ packed form
15791a84203N86L2984J2290l5714l8886m4256k6912J4223J4473J9657j4222j5289
15779b65269k1595j3094O8299L2160K593K3477j9566j3868J9167l3579j449J6491
15767b06233R392l5610J2885K4746m4115j1484q193L233N409L030K4833K7740
15755a94367J2834k5779l8913l480o317K1847J1664k5297k4138J9743K9840J1904
15743b10459J3984j0191Q672m6716J8716M540J4797L4796J6920k8530n5918l1774
15731b71163R874O1571L5412J4451l2368K0198k8667k7757K6686p04l9599m9332
15719b81398k082j0638J5188M2738L8470m9399O615M7116n2608J165N9797K1363
15707a63673k1170P294K483o373N955j3109O6473o366l2992R176K2700k4274m346
$$ plain form
15694 -158222 -177537 -175977 -212178 -232988 -236890 -194646 -167178 -173169 -196027 -219579 -205399 -205254
15682 -205254 -227188 -188826 -179128 -153682 -173617 -185320 -219066 -252232 -224961 -235822 -252908 -246902
15670 -246902 -251438 -193451 -158201 -116317 -140963 -161729 -172894 -160749 -133406 -118568 -79196 -63133
15658 -63133 -124550 -148497 -147116 -174959 -173317 -197977 -189296 -185875 -165514 -199221 -212340 -197302
15646 -197302 -201561 -215211 -238662 -240811 -238062 -194212 -184863 -184040 -190520 -187689 -149485 -133308 -187127
15633 -187127 -205210 -225400 -278177 -251317 -181194 -155484 -97626 -88944 -78002 -81868 -122366 -169834
15621 -169834 -208721 -155624 -96399 -100576 -162801 -168267 -98836 -117848 -160048 -175135 -195941 -173695
15609 -173695 -125143 -56927 -79176 -83469 -72554 -102417 -171956 -211985 -217243 -205806 -201895 -185927
$$ packed form
15694a58222j9315J560l6201k0810l902M2244K7468n991k2858k3552J4180J45
15682b05254k1934L8362R698K5446j9935j1703l3746l3166K7271j0861j7086O006
15670b46902m536N7987L5250M1884k4646k0766j1165J2145K7343J4838L9372J6063
15658f3133o1417k3947J381k7843J642k4660Q681L421K0361l3707j3119J5038
15646a97302m259j3650k3451k149K749M3850R349Q23o480K831L8204J6177n3819
15633a87127j8083k0190n2777K6860P0123K5710N7858Q682J0942l866m0498m7468
15621a69834l8887N3097N9225m177o2225n466O9431j9012m2200j5087k0806K2246
15609a73695M8552O8216k2249m293J0915k9863o9539m0029n258J1437L911J5968
$$ plain form
15597 -185927 -182399 -236627 -250353 -195339 -207090 -220700 -203656 -151987 -115458 -117715 -124674 -89878
15585 -89878 -63762 -70779 -90275 -142160 -174635 -198186 -165601 -169939 -184762 -115909 -83738 -125826
15573 -125826 -148963 -130675 -148054 -102786 -55662 -68346 -87393 -102109 -79412 -117982 -152568
15562 -152568 -153552 -185095 -148168 -44258 7343 -10964 -42852 -115936 -131515 -105988 -29300 -61370
15550 -61370 -73887 -107265 -168393 -193969 -160218 -129893 -157171 -160244 -161250 -141621 -128350 -107158
15538 -107158 -101561 -104590 -93356 -87803 -93179 -46205 -49588 -116706 -158813 -168822 -177333 -159758 -122195
15525 -122195 -120593 -112420 -86688 -88916 -104812 -89373 -106154 -94884 -61102 -79268 -107743 -83722
15513 -83722 -114996 -128899 -118898 -119890 -111536 -91222 -84656 -88126 -103870 -126528 -110824 -98633 -103620
$$ packed form
15597a85927L528n4228j3726N5014j1751j3610J7044N1669L6529k257o959L4796
15585h9878K6116p017j9496n1885l2475k3551L2585m338j4823O8853L2171m2088
15573a25826k3137J8288j7379M5268M7124j2684j9047j4716K2697l8570l4586
15562a52568r84l1543L6927J03910N1601j8307l1888p3084j5579K5527P6688l2070
15550f1370j2517l3378o1128k5576L3751L0325k7278l073j006J9629J3271K1192
15538a07158N597l029J1234N553n376M6974l383o7118m2107j0009q511J7575L7563
15525a22195J602Q173K5732k228j5896J5439j6781J1270L3782j8166k8475K4021
15513h3722l1274j3903J0001r92Q354K0314O566l470j5744k2658J5704J2191m987
$$ plain form
15500 -103620 -58311 -97944 -118433 -143272 -92778 -43398 -48527 -45728 -60417 -95370 -104801 -110322
15488 -110322 -137344 -101845 -45566 -80199 -108411 -136189 -90656 -80881 -68249 -78313 -131595 -101448
15476 -101448 -73009 -83890 -130567 -110536 -71946 -72103 -83154 -86900 -84936 -93556 -68310 -71618 -134517
15463 -134517 -74475 -38141 -64712 -114487 -107371 -78332 -72837 -93555 -136333 -190949 -182101 -120206
15451 -120206 -131188 -152761 -126176 -109368 -83560 -66876 -83984 -134929 -120204 -46989 -58248
15440 -58248 -112747 -135759 -99865 -94360 -73940 -81837 -87564 -107908 -89291 -62134 -43263 -52757
15428 -52757 -43820 -35330 -69818 -132144 -161409 -106898 -83243 -53639 -15545 11866 5195 -32342
15416 -32342 -53038 -32458 10318 49538 79741 105092 59441 -14691 -115843 -118649 -80314 -27810
$$ packed form
15500a03620M5309l9633k0489k4839N0494M9380n129K799j4689l4953r431n521
15488a10322k7022L5499N6279l4633k8212k7778M5533R775J2632j0064n3282L0147
15476a01448K8439j0881m6677K0031L8590j57j1051l746J964q620K5246l308o2899
15463a34517O0042L6334k6571m9775P116K9039N495k0718m2778n4616Q848O1895
15451a20206j0982k1573K6585J6808K5808J6684j7108n0945J4725P3215j1259
15440e8248n4499k3012L5894N505K0420p897n727k0344J8617K7157J8871r494
15428e2757Q937Q490l4488o2326k9265N4511K3655K9604L8094K7411o671l7537
15416c2342k0696K0580M2776L9220L0203K5351m5651p4132j01152k806L8335N2504
$$ plain form
15404 -27810 -12850 7704 25068 -50649 -70569 -52358 -43029 -5050 -24780 -75844 -76820 -57681
15392 -57681 -60908 -25730 -15562 20785 39000 24427 -529 21980 22900 25205 40036 45580 22808
15379 22808 -22206 -39644 -36030 -65798 -82463 -47941 -64317 -102480 -92471 -95122 -54378 -52640
15367 -52640 -19899 1858 -5165 -7547 59212 60161 -19191 -41823 -12206 35517 21471 -29608
15355 -29608 -56982 -55223 -17559 -24249 -44616 -11390 -4653 21289 54692 59664 39022 -9901
15343 -9901 15232 52037 53944 39117 9426 -4687 11208 45332 19429 -54949 -66648 -83702
15331 -83702 -95872 -88015 -61165 -61990 -79286 -85148 -40391 26743 38780 -12130 -59288 -59203 -21694
15318 -21694 3192 2581 18715 32714 422 -39400 -43294 -80112 -103136 -132637 -145221 -99926
$$ packed form
15404b7810J4960K0554J7364p5717j9920J8211R329L7979j9730n1064r76J9139
15392e7681l227L5178J0168L6347J8215j4573k4956K2509R20K305J4831N544k2772
15379B2808m5014j7438L614k9768j6665L4522j6376l8163J0009k651M0744J738
15367e2640L2741K1757p023k382O6759R49p9352k2632K9617M7723j4046n1079
15355b9608k7374J759L7664o690k0367L3226O737K5942L3403M972k0642m8923
15343i901K5133L6805J907j4827k9691j4113J5895L4124k5903p4378j1699j7054
15331h3702j2170P857K6850q25j7296n862M4757O7134J2037n0910m7158Q5L7509
15318b1694K4886o11J6134J3999l2292l9822l894l6818k3024k9501j2584M5295
$$ plain form
15306 -99926 -39924 -443 51540 72152 45094 13607 -8743 -41555 -24873 -31624 -63836 -9744
15294 -9744 10768 -22626 -1138 101913 115600 78699 54850 15830 11744 25412 33425 28068
15282 28068 64361 53242 -41962 -43054 -22575 6469 -3693 -52327 -20147 16676 1282 45628
15270 45628 88977 83113 97008 98053 38126 -333 -2477 19246 43608 49588 93009 78735
15258 78735 29794 19033 15033 15512 21652 29677 21000 -22025 -28992 6300 38929 28775 6766
15245 6766 23799 5970 -21234 20713 58773 58865 63113 72531 71671 51834 21342 -8623 49381
15232 49381 76447 65145 65722 71320 51988 15650 49888 93225 80558 58803 61354 60858 81418
15219 81418 90392 85130 84107 98007 93080 82436 52675 45476 57337 104701 67728 46868 51231
$$ packed form
15306i9926O0002L9481N1983K0612k7058l1487k2350l2812J6682o751l2212N4092
15294i744K0512l3394K1488J03051J3687l6901k3849l9020m086J3668Q013n357
15282B8068L6293j1119r5204j092K0479K9044j0162m8634L2180L6823j5394M4346
15270D5628M3349n864J3895J045n9927l8459k144K1723K4362N980M3421j4274
15258G8735m8941j0761m000M79O140Q025q677m3025o967L5292L2629j0154k2009
15245F766J7033j7829k7204M1947L8060R2M248R418q60j9837l0492k9965N8004
15232D9381K7066j1302N77N598j9332l6338L4238M3337j2667k1755K551m96K0560
15219H1418Q974n262j023J3900m927j0644k9761p199J1861M7364l6973k0860M363
$$ plain form
15206 51231 77210 126991 93208 96152 103049 120050 133893 123201 95339 117184 95888 84136
15194 84136 92396 53217 17440 62971 121207 155780 131171 139088 129062 57102 65435 69192
15182 69192 76626 80257 89637 97515 149457 160114 102067 82174 73553 80094 95340 94251 87750
15169 87750 138115 123633 69910 80184 90576 93658 131708 165056 166733 162922 144843 141464
15157 141464 141495 145822 83820 48859 5937 -3427 22539 45507 33113 98547 153434 150319 111919
15144 111919 91123 123368 148089 150469 115358 110657 55477 77559 64602 91318 100100 73967
15132 73967 83828 130774 139798 79102 25837 16532 75165 55429 63153 25117 7215 76528
15120 76528 133730 134374 102889 69890 71658 67990 66194 103685 127652 134664 138786 117972 103508
$$ packed form
15206E1231K5979M9781l3783K944O897J7001J3843j0692k7862K1845k1296j1752
15194H4136Q260l9179l5777M5531N8236L4573k4609P917j0026p1960Q333L757
15182F9192P434L631R380P878N1942J0657n8047j9893q621O541J5246j089o501
15169H7750N0365j4482n3723J0274J0392L082L8050L3348J677l811j8079l379
15157A41464L1M327o2002l4961m2922r364K5966K2968j2394O5434N4887l115l8400
15144A11919k0796L2245K4721K380l5111m701n5180K2082j2957K6716Q782k6133
15132G3967R861M6946R024o0696n3265r305N8633j9736P724l8036j7902O9313
15120G6528N7202O44l1485l2999J768l668j796L7491K3967P012M122k0814j4464
$$ plain form
15107 103508 107373 78617 110236 142007 176889 198283 220040 232211 187835 139068 120790 145016
15095 145016 126627 106875 80662 90907 88554 87693 76092 51570 30369 63953 85450 33938
15083 33938 44259 79622 114476 157599 166115 178690 202961 252173 193476 121452 121211 130404
15071 130404 211572 203987 132927 86863 73691 90165 107618 103640 110088 117000 134567 132623
15059 132623 77032 94617 135035 124912 116623 106818 115616 133787 149407 174270 162405 153489
15047 153489 148403 101141 92234 106071 166138 146029 138991 153020 177513 190966 186127 194940
15035 194940 170883 192705 194863 162039 114490 94768 98230 78701 129421 158413 135878 127528
15023 127528 113335 120959 118540 99744 112491 125204 146010 119339 125814 160746 181313 176503
$$ packed form
15107A03508L865k8756L1619L1771L4882K1394K1757J2171m4376m8767j8278K4226
15095A45016j8389j9752k6213J0245k353q61j1601k4522k1201L3584K1497n1512
15083C3938J0321L5363L4854M3123Q516J2575K4271M9212n8697p2024k41R193
15071A30404Q1168p585p1060m6064j3172J6474J7453l978O448O912J7567j944
15059A32623n5591J7585M0418j0123q289r805Q798J8171J5620K4863j1865q916
15047A53489n086m7262q907J3837O0067k0109p038J4029K4493J3453m839Q813
15035A94940k4057K1822K158l2824m7549j9722L462j9529N0720K8992k2535q350
15023A27528j4193P624k419j8796J2747J2713K0806k6671O475L4932K0567m810
$$ plain form
15011 176503 170517 190326 157155 130646 125147 134776 171203 168818 163371 192759 223912 240828
14999 240828 262575 253127 256189 249534 238066 197577 114773 57363 54999 92156 163514 233245
14987 233245 215644 190942 160495 152221 194198 177190 139772 190281 167859 163230 160658 148247
14975 148247 148564 171925 221581 184827 156980 155432 162333 161302 142697 180486 223384 213527 211324
14962 211324 211548 228385 223377 208344 156066 126485 97105 84914 132174 198169 220307 192904
14950 192904 152110 121861 93761 111545 153358 170832 179177 161364 163165 196063 225591 254384
14938 254384 243239 254517 305159 270106 255152 299819 298663 275300 225309 247061 285336 276331
14926 276331 258111 305167 313560 294519 258429 256705 292765 313963 308474 257846 228620 224611
$$ packed form
15011A76503n986J9809l3171k6509n499R629L6427k385n447K9388L1153J6916
14999B40828K1747r448L062o655j1468m0489q2804n7410k364L7157P1358O9731
14987B33245j7601k4702l0447q274M1977j7008l7418N0509k2422m629k572j2411
14975A48247L17K3361M9656l6754k7847j548O901j031j8605L7789M2898r857k203
14962B11324K24J6837n008j5033n2278k9581k9380j2191M7260O5995K2138k7403
14950A92904m0794l0249k8100J7784M1813J7474Q345j7813J801L2898K9528K8793
14938B54384j1145J1278N0642l5053j4954M4667j156k3363m9991K1752L8275r005
14926B76331j8220M7056Q393j9041l6090j724L6060K1198n489n0628k9226m009
$$ plain form
14914 224611 223726 214842 191382 179507 212870 240026 241892 245737 278474 299689 292691 285186 294628
14901 294628 265945 277535 287639 256732 209326 219914 211757 181078 141875 189519 194875 210760
14889 210760 262195 268648 250384 226823 188954 201570 282618 295782 234070 204161 186446 184932
14877 184932 198976 250102 271610 298428 277200 264242 310822 316610 286129 263800 232253 227191
14865 227191 216025 245769 270816 277984 270370 285181 299186 317635 305311 288727 295551 309274
14853 309274 333160 312427 259293 260496 302359 334921 336202 337196 321038 295303 303867 311648 320011
14840 320011 286821 283491 321021 318482 286270 245629 294667 311400 298049 314665 275102 250006
14828 250006 279419 288772 286867 278319 301475 296852 280614 292821 298984 295712 310256 323280 305567
$$ packed form
14914B24611q85q884k3460j1875L3363K7156J866L845L2737K1215o998p505R442
14901B94628k8683J1590J0104l0907m7406J0588q157l0679l9203M7644N356J5885
14889B10760N1435O453j8264k3561l7869J2616Q1048J3164o1712k9909j7715j514
14877A84932J4044N1126K1508K6818k1228j2958M6580N788l0481k2329l1547n062
14865B27191j1166K9744K5047P168p614J4811J4005J8449j2324j6584O824J3723
14853C09274K3886k0733n3134J203M1863L2562J281R94j6158k5735Q564P781Q363
14840C20011l3190l330L7530k539l2212m0641M9038J6733j3351J6616l9563k5096
14828B50006K9413R353j905q548K3156m623j6238J2207O163l272J4544J3024j7713
$$ plain form
14815 305567 319058 323147 354575 328213 311093 332344 350068 316897 322168 307868 322375 350216
14803 350216 333131 315504 275113 273575 298840 303466 281189 259281 227443 204580 206774 248497
14791 248497 278871 293065 287751 333430 374858 360352 337886 294179 275002 265974 296085 349243
14779 349243 393886 406859 345024 315066 330829 324742 305008 236238 229313 331955 354795 326152
14767 326152 332493 283388 205845 271933 335282 291994 314970 331595 355466 373556 380368 357722
14755 357722 365347 395943 378027 385580 393086 375049 372869 381703 406819 393616 307148 288176
14743 288176 320527 292451 251764 276436 340955 379991 343255 353046 390747 389001 346439 341889
14731 341889 354430 361768 378295 428073 421788 425172 401247 365315 404484 413311 361413 328637
$$ packed form
14815C05567J3491M089L1428k6362j7120K1251J7724l3171N271j4300J4507K7841
14803C50216j7085j7627m0391j538K5265M626k2277k1908l1838k2863K194M1723
14791B48497L0374J4194n314M5679M1428j4506k2466m3707j9177r028L0111N3158
14779C49243M4643J2973o1835k9958J5763o087j9734o8770o925J02642K2840k8643
14767C26152O341m9105p7543O6088O3349m3288K2976J6625K3871J8090O812k2646
14755C57722P625L0596j7916P553P506j8037k180Q834K5116j3203q6468j8972
14743B88176L2351k8076m0687K4672O4519L9036l6736R791L7701j746m2562m550
14731C41889J2541P338J6527M9778o285L384k3925l5932L9169Q827n1898l2776
$$ plain form
14719 328637 320278 325283 322045 345013 416808 482618 445488 422731 422621 349984 281514 249711
14707 249711 204954 237413 312940 363258 418080 462435 494569 504045 443289 402717 401876 387923
14695 387923 386974 334265 322331 309015 354904 375790 366301 375008 373986 385490 435044 423152
14683 423152 382139 381925 390256 361424 383794 399874 412917 386328 379317 387874 374544 432921
14671 432921 440542 424896 411382 404967 408137 437681 452944 456017 504534 525143 504435 450396
14659 450396 420920 390666 400950 403817 432005 432021 462276 450843 428113 460333 449937 439565
14647 439565 393298 384875 396224 397267 415592 421188 406956 422798 429943 436346 400336 405397 438564
14634 438564 450154 405721 401061 409358 377962 409711 469295 462209 475770 505255 495748 450034
$$ packed form
14719C28637q359N005l238K2968P1795O5810l7130k2757j10p2637o8470l1803
14707B49711m4757L2459P5527N0318N4822M4355L2134R476o0756m0572q41j3953
14695C87923r49n2709j1934j3316M5889K0886r489Q707j022J1504M9554j1892
14683D23152m1013k14Q331k8832K2370J6080J3043k6589p011Q557j3330N8377
14671D32921P621j5646j3514o415L170K9544J5263L073M8517K0609k0708n4039
14659D50396k9476l0254J0284K867K8188J6L0255j1433k2730L2220j0396j0372
14647D39565m6267q423J1349J043J8325N596j4232J5842P145O403l6010N061L3167
14634D38564J1590m4433m660Q297l1396L1749N9584p086J3561K9485r507m5714
$$ plain form
14622 450034 407024 432668 442709 438231 376303 418779 448390 456645 451325 429386 372112 313920
14610 313920 367469 416760 430261 422691 394047 443047 483581 424265 419225 421022 388101 372032
14598 372032 414064 427168 452222 480679 521403 503159 499030 520943 498734 490946 482540 511524
14586 511524 486695 432054 457104 515644 533436 499255 508008 543058 581867 580578 576888 573963
14574 573963 560331 562396 554606 511961 475739 452363 472461 489554 534218 517063 508722 511189
14562 511189 542424 530523 494261 456376 482221 537628 554115 544634 569916 588047 614975 592241
14550 592241 500368 477579 495767 494075 430101 414749 478196 480068 436912 434264 468359 473270
14538 473270 488187 483199 509995 562136 545077 584543 612514 539308 487180 490372 520285 528846
$$ packed form
14622D50034m3010K5644J0041m478o1928M2476K9611Q255n320k1939n7274n8192
14610C13920N3549M9291J3501p570k8644M9000M0534n9316n040J797l2921j6069
14598C72032M2032J3104K5054K8457M0724j8244m129K1913k2209p788q406K8984
14586E11524k4829n4641K5050N8540J7792l4181Q753L5050L8809j289l690k925
14574E73963j3632K065p790m2645l6222k3376K0098J7093M4664j7155q341K467
14562E11189L1235j1901l6262l7885K5845N5407J6487r481K5282J8131K6928k2734
14550E92241r1873k2789J8188j692o3974j5352O3447J872m3156k648L4095M911
14538D73270J4917m988K6796N2141j7059L9466K7971p3206n2128L192K9913Q561
$$ plain form
14526 528846 555645 582131 499538 462400 506410 531325 539774 527063 515798 522075 523012 581247
14514 581247 623993 642070 631131 555959 541281 559188 589044 548548 524609 542936 567548
14503 567548 582231 581592 563346 577127 570499 568966 527326 536291 554349 589883 588111 543175 542289
14490 542289 521034 505218 506829 539940 578373 545775 527864 536697 575056 543656 564687 585578
14478 585578 571803 557688 525689 533419 538878 559130 560504 560620 553841 581097 532045 519061 524800
14465 524800 537689 564203 595724 632022 646158 617747 660826 686857 685804 735920 745653 716574
14453 716574 705024 665104 664456 625774 546239 512521 539516 573776 623686 623768 647511 664363
14441 664363 674514 702211 696295 665775 647928 634114 636393 652031 658828 613557 592362 555760
$$ packed form
14526E28846K6799K6486q2593l7138M4010K4915Q449j2711j1265O277R37N8235
14514E81247M2746J8077j0939p5172j4678J7907K9856m0496k3939J8327K4612
14503E67548J4683o39j8246J3781o628j533m1640Q965J8058L5534j772m4936q86
14490E42289k1255j5816J611L3111L8433l2598j7911Q833L8359l1400K1031K0891
14478E85578j3775j4115l1999P730N459K0252J374J16o779K7256m9052j2984N739
14465E24800J2889K6514L1521L6298J4136k8411M3079K6031j053N0116R733k9079
14453G16574j1550l9920o48l8682p9535l3718K6995L4260M9910Q2K3743J6852
14441F64363J0151K7697n916l0520j7847j3814K279J5638O797m5271k1195l6602
$$ plain form
14429 555760 535722 549011 604037 601619 578318 583530 641298 652452 632829 617464 594099 617876
14417 617876 670437 684119 676886 685734 687352 642352 580085 573923 641242 617443 643814 725111
14405 725111 748123 707236 669755 612018 559286 578120 646007 626772 581242 573174 583596 649242
14393 649242 696221 741175 782240 761719 709782 657457 632413 616846 633682 682806 690419 683856
14381 683856 661432 651810 665184 672442 702074 726250 715966 690592 686638 690618 690737 735329 772527
14368 772527 784111 731421 703621 668566 675607 771045 785585 719289 709801 703516 700881 698946
14356 698946 699355 679227 653188 646967 675180 729803 743972 748882 757954 737200 696461 671461
14344 671461 722327 740143 720633 723783 794767 830006 790971 736164 748856 758069 767310 789294
$$ packed form
14429E55760k0038J3289N5026k418k3301N212N7768J1154j9623j5365k3365K3777
14417F17876N2561J3682p233Q848J618m5000o2267o162O7319k3799K6371Q1297
14405G25111K3012m0887l7481n7737n2732J8834O7887j9235m5530q068J0422O5646
14393F49242M6979M4954M1065k0521n1937n2325k5044j5567J6836M9124P613o563
14381F83856k2424r622J3374P258K9632K4176j0284k5374l954L980J19M4592L7198
14368G72527J1584n2690k7800l5055P041R5438J4540o6296r488o285k635j935
14356F98946M09k0128k6039o221K8213N4623J4169M910R072k0754m0739k5000
14344F71461N0866J7816j9510L150P0984L5239l9035n4807J2692R213R241K1984
$$ plain form
14332 789294 811059 805103 810302 816686 819591 823908 842200 813840 787189 735230 740226 779523 814682
14319 814682 819503 820448 856099 890799 878395 853283 859635 900357 875399 848067 829737 831503
14307 831503 806341 729407 733701 786589 869828 874639 846325 815186 762548 711436 731529 734003
14295 734003 749618 808465 870538 894092 837500 806116 809508 880324 864496 822463 781561 748490
14283 748490 792276 807045 806883 815961 842635 864764 882460 847975 808293 792889 829167 819597
14271 819597 782377 817989 860029 886382 870367 835307 826044 818990 801940 794426 799709 843298
14259 843298 949997 974607 969468 910194 818594 825028 890416 930877 934015 908951 854185 818904
14247 818904 806232 822986 818406 833544 818679 849392 889487 893036 883562 859639 820106 848476
$$ packed form
14332G89294K1765n956N199O384K905M317J8292k8360k6651n1959M996L9297L5159
14319H14682M821R45L5651L4700j2404k5112O352M0722k4958k7332j8330J766
14307H31503k5162p6934M294N2888Q3239M811k8314l1139n2638n1112K0093K474
14295G34003J5615N8847O2073K3554n6592l1384L392P0816j5828m2033m0902l3071
14283G48490M3786J4769j62R078K6674K2129J7696l4485l9682j5404L6278r570
14271H19597l7220L5612M2040K6353j6015l5060r263p054j7050p514N283M3589
14259H43298J06699K4610n139n9274r1600O434O5388M0461L138k5064n4766l5281
14247H18904j2672J6754m580J5138j4865L0713M0095L549r474k3923l9533K8370
$$ plain form
14235 848476 887265 888924 872480 891772 909753 914121 927201 918496 903942 887247 924138 917365
14223 917365 895581 906540 934893 923609 917254 958665 951772 970571 946346 914712 919471 949033
14211 949033 952964 917598 947894 930851 920059 902468 915091 939539 987176 1047017 1056167 1027571
14199 1027571 981648 1017898 1011102 986633 995097 982806 992310 951191 898013 874954 843783 886020
14187 886020 976685 1004188 977814 904735 916080 934621 976686 973601 936357 958345 980796 959486
14175 959486 919063 933005 939389 941577 972692 1027319 999727 934859 948536 990813 996010 1033580
14163 1033580 1039234 1035043 1018653 1005227 1025789 1045792 1034688 1022392 962300 986534 1010564 1029347
14151 1029347 1013877 1021000 995696 989447 992076 1011493 970830 952893 996421 1034171 1044594 1040423
$$ packed form
14235H48476L8789J659j6444J9292J7981M368J3080q705j4554j6695L6891o773
14223I17365k1784J0959K8353j1284o355M1411o893J8799k4225l1634M759K9562
14211I49033L931l5366L0296j7043j0792j7591J2623K4448M7637N9841R150k8596
14199A027571m5923L6250o796k4469Q464j2291R504m1119n3178k3059l1171M2237
14187H86020R0665K7503k6374p3079J1345J8541M2065l085l7244K1988K2451k1310
14175I59486m0423J3942O384K188L1115N4627k7592o4868J3677M2277N197L7570
14163A033580N654m191j6390j3426K0562K0003j1104j2296o0092K4234K4030J8783
14151A029347j5470P123k5304o249K629J9417m0663j7937M3528L7750J0423m171
$$ plain form
14139 1040423 1035829 1045688 1015155 971631 934547 952413 998769 1080245 1067388 1080133 1112511 1132199
14127 1132199 1125267 1113116 1129864 1100425 1095881 1102886 1100979 1062557 1051966 1062769 1066270 1081680
14115 1081680 1095791 1118470 1104805 1100599 1109389 1089363 1107729 1160670 1195901 1201997 1177122 1161224
14103 1161224 1107110 1096712 1141054 1157497 1149604 1170816 1185107 1148710 1126396 1089200 1073387
14092 1073387 1092705 1121409 1146796 1138626 1144431 1173547 1160221 1181815 1196295 1185481 1150526 1126942
14080 1126942 1078076 1078058 1108945 1166117 1181433 1174799 1114407 1071287 1095538 1147063 1215318 1217528
14068 1217528 1219902 1237628 1238072 1235494 1248519 1206603 1160041 1170919 1185859 1176847 1168947 1222127
14056 1222127 1245968 1236156 1226296 1243513 1207658 1215125 1250727 1236977 1237792 1207436 1162960 1168676
$$ packed form
14139A040423m594R859l0533m3524l7084J7866M6356Q1476j2857J2745L2378J9688
14127A132199o932j2151J6748k9439m544P005j907l8422j0591J0803L501J5410
14115A081680J4111K2679j3665m206Q790k0026J8366N2941L5231O096k4875j5898
14103A161224n4114j0398M4342J6443p893K1212J4291l6397k2314l7196j5813
14092A073387J9318K8704K5387q170N805K9116j3326K1594J4480j0814l4955k3584
14080A126942m8866j8L0887N7172J5316o634o0392m3120K4251N1525O8255K210
14068A217528K374J7726M44k578J3025m1916m6562J0878J4940r012p900N3180
14056A222127K3841r812r860J7217l5855P467L5602j3750Q15l0356m4476N716
$$ plain form
14044 1168676 1197908 1234250 1266216 1303439 1276294 1251656 1195222 1153114 1177077 1173759 1179985 1219390
14032 1219390 1233077 1287116 1272399 1287014 1293142 1308211 1324497 1341012 1297327 1239820 1283399
14021 1283399 1316095 1342246 1282438 1260117 1233886 1224058 1230972 1237975 1260108 1309756 1308440 1254429
14009 1254429 1257737 1272417 1270112 1264946 1306547 1352176 1363741 1344691 1333459 1317239 1314432 1328602
13997 1328602 1304631 1332468 1359275 1344015 1328253 1337067 1352189 1321876 1308059 1291658 1300255 1327176
13985 1327176 1314739 1309599 1329832 1367250 1346693 1354471 1357803 1391460 1396836 1394603 1408488 1435002
13973 1435002 1443963 1410130 1390465 1411708 1430233 1401357 1390246 1387039 1404696 1430654 1457622 1506131
13961 1506131 1506143 1481349 1477174 1493282 1490217 1492554 1509044 1505262 1521873 1532646 1514549 1452082 1413882
$$ packed form
14044A168676K9232L6342L1966L7223k7145k4638n6434m2108K3963l318O226L9405
14032A219390J3687N4039j4717J4615O128J5069J6286J6515m3685n7507M3579
14021A283399L2696K6151n9808k2321k6231r828O914P003K2133M9648j316n4011
14009A254429L308J4680k305n166M1601M5629J1565j9050j1232j6220k807J4170
13997A328602k3971K7837K6807j5260j5762Q814J5122l0313j3817j6401Q597K6921
13985A327176j2437n140K0233L7418k0557P778L332L3657N376k233J3885K6514
13973A435002Q961l3833j9665K1243J8525k8876j1111l207J7657K5958K6968M8509
13961A506131J2k4794m175J6108l065K337J6490l782J6611J0773j8097o2467l8200
$$ plain form
13948 1413882 1453687 1484986 1510223 1494730 1508589 1518576 1500395 1453099 1463903 1492240 1445429
13937 1445429 1464451 1553330 1562794 1555976 1527032 1519755 1528466 1563972 1581502 1548670 1530088 1537847
13925 1537847 1618818 1640724 1657567 1611485 1571500 1586506 1591574 1552696 1545330 1531134 1540233 1575880
13913 1575880 1577449 1537167 1542254 1591650 1591521 1614480 1602658 1573175 1577154 1597110 1640409 1662250
13901 1662250 1630745 1620707 1642282 1652266 1578429 1554394 1542788 1542723 1598859 1649469 1713120 1742604
13889 1742604 1726266 1709643 1689840 1681267 1709551 1713339 1718368 1714124 1710883 1747577 1750788 1730537
13877 1730537 1718470 1714417 1700820 1723016 1746101 1751142 1747487 1766731 1807866 1816515 1780618 1768113
13865 1768113 1808211 1813367 1805951 1774826 1766305 1782907 1780726 1751693 1788541 1807217 1800048 1811629
$$ packed form
13948A413882L9805L1299K5237j5493J3859R987j8181m7296J0804K8337m6811
13937A445429J9022Q8879R464o818k8944p277Q711L5506J7530l2832j8582P759
13925A537847Q0971K1906J6843m6082l9985J5006N068l8878p366j4196R099L5647
13913A575880J569m0282N087M9396j29K2959j1822k9483L979J9956M3299K1841
13901A662250l1505j0038K1575R984p3837k4035j1606o5N6136N0610O3651K9484
13889A742604j6338j6623j9803q573K8284L788N029m244l241L6694L211k0251
13877A730537j2067m053j3597K2196K3085N041l655J9244M1135Q649l5897j2505
13865A768113M0098N156p416l1125q521J6602k181k9033L6848J8676p169J1581
$$ plain form
13853 1811629 1773326 1791413 1823260 1835007 1827855 1835192 1867915 1890167 1907713 1896806 1903491 1887768
13841 1887768 1885287 1868951 1887880 1849682 1822315 1790154 1763423 1760607 1703859 1740772 1800893 1812952
13829 1812952 1815669 1831646 1778239 1785360 1789300 1804458 1807960 1780743 1741743 1745931 1802625 1883668
13817 1883668 1874566 1874917 1944897 1989108 2005781 1971098 1974005 1943349 1968599 2004702 1951625 1942531
13805 1942531 2018737 2033947 2035108 1997287 1950243 1954823 1989131 2021921 2025274 2060323 2095096 2055778
13793 2055778 2022748 2056064 2085700 2098789 2050823 1987976 1981139 2019163 2025031 2025062 2031211 2000925
13781 2000925 2045697 2081483 2100503 2091557 2123432 2150207 2185603 2185854 2125138 2102815 2135170 2143725
13769 2143725 2189550 2197141 2146971 2164974 2194371 2169778 2177142 2197371 2183921 2148659 2172393 2159859
$$ packed form
13853A811629l8303J8087L1847J1747p152P337L2723K2252J7546j0907O685j5723
13841A887768k481j6336J8929l8198k7367l2161k6731k816n6748L6913O0121J2059
13829A812952K717J5977n3407P121L940J5158L502k7217l9000M188N6694Q1043
13817A883668r102L51O9980M4211J6673l4683K907l0656K5250L6103n3077r094
13805A942531P6206J5210J161l7821m7044M580L4308L2790L353L5049L4773l9318
13793B055778l3030L3316K9636J3089m7966o2847o837L8024N868L1O149l0286
13781B000925M4772L5786J9020q946L1875K6775L5396K51o0716k2323L2355Q555
13769B143725M5825P591n0170J8003K9397k4593P364K0229j3450l5262K3734j2534
$$ plain form
13757 2159859 2182035 2245389 2285971 2293414 2294705 2288881 2300242 2268050 2236323 2209822 2231142 2228854
13745 2228854 2240135 2278794 2293900 2238618 2191892 2200305 2233828 2243335 2215738 2227270 2302887 2298556
13733 2298556 2289677 2288405 2293001 2341173 2342353 2344459 2362795 2382894 2380406 2395522 2393657 2363424 2378887
13720 2378887 2436026 2449103 2421707 2405524 2347931 2368936 2412201 2403692 2423304 2475448 2527656
13709 2527656 2525291 2501995 2488876 2529763 2589602 2660906 2685403 2616395 2573788 2548244 2562152
13698 2562152 2575415 2548813 2548439 2596890 2635637 2645872 2659574 2655529 2603366 2584574 2626994 2637494
13686 2637494 2671694 2689297 2699938 2718200 2693069 2679834 2724408 2795821 2884138 2953758 2941153
13675 2941153 2920451 2948227 2990037 3006314 3032610 3073103 3102132 3188808 3233869 3318915 3372289
$$ packed form
13757B159859K2176O3354M0582P443J291n824J1361l2192l1727k6501K1320k288
13745B228854J1281L8659J5106n5282m6726Q413L3523R507k7597J1532P5617m331
13733B298556q879j272M596M8172J180K106J8336K0099k488J5116j865l0233J5463
13720B378887N7139J3077k7396j6183n7593K1005M3265q509J9612N2144N2208
13709B527656k365k3296j3119M0887N9839P1304K4497o9008m2607k5544J3908
13698B562152J3263k6602l74M8451L8747J0235J3702m045n2163j8792M2420J0500
13686B637494L4200J7603J0641J8262k5131j3235M4574P1413Q8317O9620j2605
13675B941153k0702K7776M1810J6277K6296M0493K9029Q6676M5061Q5046N3374
$$ plain form
13664 3372289 3418721 3503675 3612293 3747463 3926074 4105568 4145924 3873336 3153236 2262914
13654 2262914 1631461 1315573 1293287 1448055 1629274 1748427 1854007 2002303 2066517 2096008
13644 2096008 2143154 2156077 2264027 2383205 2392752 2454632 2449794 2439098 2436643 2422759 2440574
13633 2440574 2494703 2563981 2595642 2641379 2675241 2652611 2651363 2689197 2722012 2702654 2707365 2667991
13621 2667991 2666355 2729993 2809425 2816278 2796768 2785761 2833040 2867620 2961057 2974100 2975599 2957375
13609 2957375 2949211 2974182 2983384 3001345 3030104 3028199 3052150 3034666 3018954 3030711 3039256 3046416
13597 3046416 3039360 3058973 3070840 3109977 3108790 3129981 3181980 3189984 3152966 3127196 3130971 3246417
13585 3246417 3258825 3199252 3159704 3139988 3182956 3244512 3248324 3245446 3239841 3218633 3222074 3218733
$$ packed form
13664C372289M6432Q4954J08618J35170J78611J79494M0356k72588p20100q90322
13654B262914o31453l15888k2286J54768J81219J19153J05580J48296O4214K9491
13644B096008M7146J2923J07950J19178R547O1880m838j0696k455j3884J7815
13633B440574N4129O9278L1661M5737L3862k2630j248L7834L2815j9358M711l9374
13621B667991j636O3638P9432O853j9510j1007M7279L4580R3437J3043J499j8224
13609B957375q164K4971R202J7961K8759j905K3951j7484j5712J1757Q545P160
13597C046416p056J9613J1867L9137j187K1191N1999Q004l7018k5770L775J15446
13585C246417J2408n9573l9548j9716M2968O1556L812k878n605k1208L441l341
$$ plain form
13573 3218733 3249278 3256700 3293009 3332130 3343355 3368293 3391647 3429541 3488213 3490736 3511881 3503579
13561 3503579 3497371 3515063 3518167 3462563 3449841 3476868 3526972 3635132 3690407 3663535 3672697 3691309
13549 3691309 3688823 3706894 3685451 3650815 3638105 3678826 3696675 3648682 3634470 3596970 3656714
13538 3656714 3775294 3820808 3813821 3779673 3824776 3912860 3898460 3854420 3832935 3811786 3846653
13527 3846653 3878617 3887294 3917947 3966781 3982426 3974675 4021381 4045245 4081331 4087935 4012707 3967035
13515 3967035 4006202 4030130 4050040 4022444 4073019 4170713 4251035 4295831 4367487 4422440 4471236
13504 4471236 4464011 4481448 4554716 4557900 4537320 4516335 4559134 4584793 4616345 4624923 4684298 4737652
13492 4737652 4755671 4763316 4769194 4796434 4813127 4826204 4848482 4811353 4856169 4936247 5001403 5052565
$$ packed form
13573C218733L0545P422L6309L9121J1225K4938K3354L7894N8672K523K1145q302
13561C503579o208J7692L104n5604j2722K7027N0104J08160N5275k6872R162J8612
13549C691309k486J8071k1443l4636j2710M0721J7849m7993j4212l7500N9744
13538C656714J18580M5514o987l4148M5103Q8084j4400m4040k1485k1149L4867
13527C846653L1964Q677L0653M8834J5645p751M6706K3864L6086O604p5228m5672
13515C967035L9167K3928J9910k7596N0575R7694Q0322M4796P1656N4953M8796
13504D471236p225J7437P3268L184k0580k0985M2799K5659L1552Q578N9375N3354
13492D737652J8019P645N878K7240J6693J3077K2278l7129M4816Q0078O5156N1162
$$ plain form
13480 5052565 5078395 5127259 5162957 5181244 5107691 5146084 5225648 5258597 5312727 5395957 5457458
13469 5457458 5511564 5529762 5554427 5592748 5646307 5749828 5806595 5627939 5182466 4678872
13459 4678872 4365986 4205150 4251969 4398688 4490871 4545253 4579662 4664682 4765464 4847109
13449 4847109 4955412 4993283 4998217 4990957 5048180 5104999 5138931 5189905 5252666 5267014 5254919
13438 5254919 5271432 5343909 5395457 5430069 5454431 5475179 5448330 5458047 5495276 5562938 5637782
13427 5637782 5691462 5729021 5754432 5793026 5874253 5933729 5954874 5978392 5956802 5990599 6041930
13416 6041930 6097770 6151343 6223827 6300426 6324364 6358514 6413645 6445282 6434501 6395223 6410943
13405 6410943 6489600 6557385 6632244 6701170 6744138 6757888 6753609 6803220 6855209 6894276 6953689
$$ packed form
13480E052565K5830M8864L5698J8287p3553L8393P9564L2949N4130Q3230O1501
13469E457458N4106J8198K4665L8321N3559J03521N6767j78656m45473n03594
13459D678872l12886j60836M6819J46719R2183N4382L4409Q5020J00782Q1645
13449D847109J08303L7871M934p260N7223N6819L3932N0974O2761J4348j2095
13438E254919J6513P2477N1548L4612K4362K0748k6849R717L7229O7662P4844
13427E637782N3680L7559K5411L8594Q1227N9476K1145K3518k1590L3797N1331
13416F041930N5840N3573P2484P6599K3938L4150N5131L1637j0781l9278J5720
13405F410943P8657O7785P4859O8926M2968J3750m279M9611N1989L9067N9413
$$ plain form
13394 6953689 7007698 6990216 6997652 7005835 7085227 7153740 7191395 7264666 7323212 7375133 7405194 7442582
13382 7442582 7497049 7525481 7592633 7656800 7743902 7795800 7861930 7902353 7896778 7907535 7969747
13371 7969747 8062540 8194547 8277287 8362211 8424606 8455451 8495079 8527435 8498807 8510661 8511495
13360 8511495 8501167 8574894 8650571 8741320 8836877 8991937 9082725 9123043 9164951 9253776 9367846
13349 9367846 9441464 9559456 9647571 9682543 9700836 9797389 9874563 9955997 10053024 10210426 10392998
13338 10392998 10518903 10584182 10627009 10639731 10675495 10797319 10908978 10952665 11001817 11016395
13328 11016395 11101266 11194939 11294015 11420153 11527634 11654861 11842120 11945468 12019893 12154834
13318 12154834 12307611 12353095 12469656 12650296 12825657 12959192 13100402 13223944 13368378
$$ packed form
13394F953689N4009j7482P436Q183P9392O8513L7655P3271N8546N1921L0061L7388
13382G442582N4467K8432O7152O4167Q7102N1898O6130M0423n575J0757O2212
13371G969747R2793J32007Q2740Q4924O2395L0845L9628L2356k8628J1854Q34
13360H511495j0328P3727P5677R0749R5557J55060R0788M0318M1908Q8825J14070
13349I367846P3618J17992Q8115L4972J8293R6553P7174Q1434R7027J57402J82572
13338A0392998J25905O5279M2827J2722L5764J21824J11659M3687M9152J4578
13328A1016395Q4871R3673R9076J26138J07481J27227J87259J03348P4425J34941
13318A2154834J52777M5484J16561J80640J75361J33535J41210J23542J44434
$$ plain form
13309 13368378 13507975 13637640 13747453 13835625 13922648 14065586 14226236 14377603 14551753 14714843
13299 14714843 14902517 15066696 15211543 15327429 15502693 15665138 15819403 16081604 16345285
13290 16345285 16540724 16755982 17004943 17265064 17454741 17621550 17850907 18168545 18471811
13281 18471811 18776433 19114418 19450047 19762500 20008930 20250712 20513177 20817869 21237480
13272 21237480 21644924 22030847 22439664 22853435 23290970 23652003 24052220 24497042 24980266
13263 24980266 25447835 25929450 26457431 26993684 27539903 28129671 28740548 29383589 30054370
13254 30054370 30838723 31670695 32456022 33246891 34070058 35003301 36024386 37092474 38155280
13245 38155280 39265712 40470440 41721661 43081951 44579058 46092089 47726739 49533797
$$ packed form
13309A3368378J39597J29665J09813Q8172Q7023J42938J60650J51367J74150J63090
13299A4714843J87674J64179J44847J15886J75264J62445J54265K62201K63681
13290A6345285J95439K15258K48961K60121J89677J66809K29357L17638L03266
13281A8471811L04622L37985L35629L12453K46430K41782K62465L04692M19611
13272B1237480M07444L85923M08817M13771M37535L61033M00217M44822M83224
13263B4980266M67569M81615N27981N36253N46219N89768O10877O43041O70781
13254C0054370P84353Q31972P85327P90869Q23167R33243J021085J068088J062806
13245C8155280J110432J204728J251221J360290J497107J513031J634650J807058
$$ plain form
13237 49533797 51453052 53564534 55853199 58355579 61157447 64235185 67603482 71296617
13229 71296617 75361913 79892304 85027533 90842305 97529252 105213016 113878106 123593716
13221 123593716 134654550 147787839 163998555 184632162 211306844 244346873 279967085
13214 279967085 300383257 264119376 136552412 -45516338 -191373210 -269760260 -286519313
13207 -286519313 -264359223 -232401240 -203273961 -179495292 -160505529 -145181143 -132426954
13200 -132426954 -121396670 -111799971 -103311114 -95860290 -89347694 -83666862 -78771462 -74469571
13192 -74469571 -70617665 -67225165 -64147194 -61336184 -58786420 -56353274 -54029571 -51921923
13184 -51921923 -49969150 -48233472 -46653640 -45041687 -43537902 -42140248 -40802461 -39547037
$$ packed form
13237D9533797J919255K111482K288665K502380K801868L077738L368297L693135
13229G1296617M065296M530391N135229N814772O686947P683764Q665090R715610
13221A23593716J1060834J3133289J6210716K0633607K6674682L3040029L5620212
13214B79967085K0416172l6263881j27566964j82068750j45856872p8387050j6759053
13207b86519313K2160090L1957983K9127279K3778669J8989763J5324386J2754189
13200a32426954J1030284R596699Q488857P450824O512596N680832M895400M301891
13192g4469571L851906L392500L077971K811010K549764K433146K323703K107648
13184e1921923J952773J735678J579832J611953J503785J397654J337787J255424
$$ plain form
13176 -39547037 -38403369 -37400582 -36444908 -35493516 -34530034 -33661946 -32826754 -32055583 -31359480
13167 -31359480 -30693022 -30074372 -29452275 -28798037 -28202556 -27588184 -27017334 -26458169 -25863593
13158 -25863593 -25384643 -24879169 -24434032 -24066771 -23745844 -23443779 -23134085 -22781991 -22405138
13149 -22405138 -22052913 -21689373 -21339749 -20972624 -20644351 -20338913 -20085759 -19799232 -19507417
13140 -19507417 -19296901 -19077362 -18796173 -18508928 -18250552 -17972745 -17693618 -17425467 -17182351
13131 -17182351 -16934038 -16710206 -16504370 -16336149 -16159337 -15936725 -15704290 -15560884 -15392575
13122 -15392575 -15193754 -15080958 -14979376 -14812835 -14616599 -14425271 -14241568 -14065770 -13897669
13113 -13897669 -13734124 -13570263 -13456576 -13313053 -13220559 -13202453 -13153479 -13095038 -12958888 -12857467
$$ packed form
13176c9547037J143668J002787R55674R51392R63482Q68088Q35192P71171O96103
13167c1359480O66458O18650O22097O54238N95481O14372N70850N59165N94576
13158b5863593M78950N05474M45137L67261L20927L02065L09694L52094L76853
13149b2405138L52225L63540L49624L67125L28273L05438K53154K86527K91815
13140a9507417K10516K19539K81189K87245K58376K77807K79127K68151K43116
13131a7182351K48313K23832K05836J68221J76812K22612K32435J43406J68309
13122a5392575J98821J12796J01582J66541J96236J91328J83703J75798J68101
13113a3897669J63545J63861J13687J43523R2494J8106M8974N8441J36150J01421
$$ plain form
13103 -12857467 -12736411 -12573205 -12437077 -12344014 -12253510 -12141804 -12018393 -11914600 -11806371 -11700504
13093 -11700504 -11590360 -11457494 -11328360 -11207188 -11077780 -10954509 -10823298 -10690364 -10575400
13084 -10575400 -10578945 -10596057 -10617376 -10568972 -10555716 -10510069 -10429721 -10318132 -10194383 -10144886 -10070256
13073 -10070256 -9959466 -9849248 -9801394 -9725031 -9673024 -9622688 -9527736 -9470905 -9429202 -9431957 -9434551
13062 -9434551 -9366171 -9285757 -9180810 -9086269 -8959666 -8848825 -8775798 -8710881 -8696029 -8672260 -8612958
13051 -8612958 -8541295 -8502868 -8486960 -8502430 -8445709 -8402888 -8376501 -8319031 -8232356 -8180433 -8131166
13040 -8131166 -8088577 -8057932 -8022268 -7990638 -7952819 -7895850 -7821296 -7732404 -7669298 -7616247 -7583985
13029 -7583985 -7548501 -7539319 -7517170 -7528201 -7511357 -7419987 -7320334 -7312491 -7252511 -7189649 -7158908 -7119374
$$ packed form
13103a2857467J21056J63206J36128R3063R0504J11706J23411J03793J08229J05867
13093a1700504J10144J32866J29134J21172J29408J23271J31211J32934J14964
13084a0575400l545j7112k1319M8404J3256M5647Q0348J11589J23749M9497P4630
13073a0070256J10790J10218M7854P6363N2007N0336R4952N6831M1703k755k594
13062i434551O8380Q0414J04947R4541J26603J10841P3027O4917J4852K3769N9302
13051h612958P1663L8427J5908j5470N6721M2821K6387N7470Q6675N1923M9267
13040h131166M2589L0645L5664L1630L7819N6969P4554Q8892O3106N3051L2262
13029g583985L5484R182K2149j1031J6844R1370R9653P843N9980O2862L0741L9534
$$ plain form
13017 -7119374 -7066783 -6985948 -6928001 -6867489 -6826941 -6831745 -6796121 -6732715 -6703305 -6697130 -6715547 -6686553
13005 -6686553 -6655456 -6635781 -6616872 -6560272 -6508644 -6521211 -6530167 -6497593 -6462457 -6390322 -6328442
12994 -6328442 -6313961 -6306472 -6252323 -6189899 -6180395 -6129661 -6070290 -6070071 -6066890 -6036746 -6015798 -6014279
12982 -6014279 -5994849 -5970858 -5959747 -5945590 -5913655 -5864828 -5847581 -5827458 -5829266 -5781835 -5699440
12971 -5699440 -5667347 -5616294 -5574005 -5539894 -5546585 -5543672 -5448929 -5411587 -5417174 -5418632 -5406200 -5373734
12959 -5373734 -5301722 -5249686 -5239458 -5264003 -5233647 -5200604 -5170592 -5117571 -5160055 -5138480 -5066395
12948 -5066395 -5088557 -5176006 -5215633 -5222387 -5175017 -5114815 -5124266 -5108767 -5049284 -4976476 -4991328 -4960818
12936 -4960818 -4913525 -4900800 -4895679 -4842052 -4802906 -4774616 -4786291 -4827160 -4814408 -4805381 -4778591 -4726785
$$ packed form
13017g119374N2591Q0835N7947O0512M0548m804L5624O3406K9410O175j8417K8994
13005f686553L1097J9675J8909N6600N1628j2567q956L2574L5136P2135O1880
12994f328442J4481P489N4149O2424R504N0734N9371K19L181L0144K0948J519
12982f014279J9430K3991J1111J4157L1935M8827J7247K0123j808M7431Q2395
12971e699440L2093N1053M2289L4111o691K913R4743L7342n587j458J2432L2466
12959e373734P2012N2036J0228k4545L0356L3043L0012N3021m2484K1575P2085
12948e066395k2162q7449l9627o754M7370O0202r451J5499N9483P2808j4852L0510
12936d960818M7293J2725N121N3627L9146K8290j1675m0869J2752R027K6790N1806
$$ plain form
12924 -4726785 -4738997 -4711317 -4631040 -4597405 -4585337 -4543134 -4480682 -4461437 -4470310 -4491134 -4543629
12913 -4543629 -4641113 -4722001 -4725616 -4693034 -4679520 -4657850 -4608416 -4524611 -4488294 -4487693 -4470301 -4468239
12901 -4468239 -4441154 -4428252 -4424458 -4384315 -4307688 -4316429 -4328481 -4257661 -4225186 -4193012 -4189022 -4171563
12889 -4171563 -4165660 -4100393 -4010854 -4036857 -4033985 -4029708 -4037492 -4046574 -4076327 -4099017 -4051757 -3997666
12877 -3997666 -3969287 -3985236 -4024400 -4063826 -4101143 -4136378 -4121656 -4098525 -4071908 -4003908 -4001076
12866 -4001076 -4008405 -3959369 -3930019 -3950318 -3917515 -3808344 -3789817 -3786995 -3795114 -3754402 -3744039 -3704941
12854 -3704941 -3649764 -3655088 -3674401 -3707379 -3727833 -3773834 -3752314 -3719641 -3724056 -3740153 -3738346 -3711167
12842 -3711167 -3652290 -3679499 -3692908 -3687934 -3684745 -3637836 -3602612 -3562867 -3575185 -3551181 -3484162 -3457684
$$ packed form
12924d726785j2212K7680Q0277L3635J2068M2203O2452J9245q873k0824n2495
12913d543629r7484q0888l615L2582J3514K1670M9434Q3805L6317O01J7392K062
12901d468239K7085J2902L794M0143P6627q741j2052P0820L2475L2174L990J7459
12889d171563N903O5267Q9539k6003K872M277p784r082k9753k2690M7260N4091
12877c997666K8379j5949l9164l9426l7317l5235J4722K3131K6617O8000K832
12866d001076p329M9036K9350k0299L2803J09171J8527K822q119M0712J0363L9098
12854c704941N5177n324j9313l2978k0454m6001K1520L2673m415j6097J807K7179
12842c711167N8877k7209j3409M974L189M6909L5224L9745j2318K4004O7019K6478
$$ plain form
12830 -3457684 -3448313 -3474481 -3480810 -3451273 -3409567 -3380091 -3353727 -3342703 -3311942 -3283899 -3272998 -3304779
12818 -3304779 -3277927 -3278831 -3297509 -3274758 -3269771 -3238446 -3266440 -3259111 -3208527 -3158391 -3115725 -3080511
12806 -3080511 -3107215 -3121428 -3082795 -3063321 -3054704 -2996062 -2931162 -2927658 -2948148 -2957106 -2939635 -2953314
12794 -2953314 -2942420 -2895877 -2902449 -2954990 -2923853 -2896426 -2891538 -2905779 -2883728 -2845914 -2823158 -2758196
12782 -2758196 -2717033 -2742877 -2684595 -2610832 -2597034 -2543719 -2481363 -2409383 -2343787 -2320904 -2323363
12771 -2323363 -2229606 -2145745 -2133248 -2056405 -1924005 -1778678 -1637476 -1449706 -1279492 -1305041
12761 -1305041 -1738938 -2585922 -3403042 -3934674 -4082897 -3950923 -3723392 -3593220 -3511202 -3399250
12751 -3399250 -3317800 -3272998 -3108771 -2984907 -2926811 -2875846 -2848351 -2811170 -2714361 -2632330 -2570102
$$ packed form
12830c457684R371k6168o329K9537M1706K9476K6364J1024L0761K8043J0901l1781
12818c304779K6852r04j8678K2751M987L1325k7994P329N0584N0136M2666L5214
12806c080511k6704j4213L8633J9474Q617N8642O4900L504k0490q958J7471j3679
12794b953314J0894M6543o572n2541L1137K7427M888j4241K2051L7814K2756O4962
12782b758196M1163k5844N8282P3763J3798N3315O2356P1980O5596K2883k459
12771b323363R3757Q3861J2497P6843J32400J45327J41202J87770J70214k5549
12761a305041m33897q46984q17120n31632j48223J31974K27531J30172Q2018J11952
12751c399250Q1450M4802J64227J23864N8096N0965K7495L7181R6809Q2031O2228
$$ plain form
12740 -2570102 -2562764 -2493359 -2453725 -2442530 -2378113 -2294941 -2248028 -2241298 -2202293 -2180326 -2118173 -2052880
12728 -2052880 -1957438 -1882833 -1809583 -1730020 -1628275 -1563550 -1475119 -1314515 -1172981 -1052760
12718 -1052760 -870210 -637679 -355992 -99080 243993 598324 922565 1135743 1006852
12709 1006852 234803 -1090316 -2736733 -4414624 -5752731 -6469776 -6658291 -6515235 -6223955
12700 -6223955 -5887902 -5562521 -5268431 -5014427 -4829696 -4738030 -4589969 -4438358 -4331393 -4157513
12690 -4157513 -3995079 -3919817 -3896588 -3862705 -3832479 -3820759 -3813171 -3764100 -3684324 -3647561 -3563566
12679 -3563566 -3525044 -3510943 -3503274 -3459461 -3400157 -3329151 -3282227 -3252824 -3232120 -3189587 -3139745
12668 -3139745 -3073971 -3054715 -3065640 -3056142 -3051013 -3080700 -3117007 -3166429 -3140825 -3121868 -3086119 -3056976
$$ packed form
12740b570102P338O9405L9634J1195O4417Q3172M6913O730L9005K1967O2153O5293
12728b052880R5442P4605P3250P9563J01745O4725Q8431J60604J41534J20221
12718a052760J82550K32531K81687K56912L43073L54331L24241K13178j28891
12709A006852p72049j325119j646417j677891j338107p17045j88515J43056K91280
12700f223955L36053L25381K94090K54004J84731R1666J48061J51611J06965J73880
12690d157513J62434P5262K3229L3883L0226J1720P588M9071P9776L6763Q3995
12679c563566L8522J4101P669M3813N9304P1006M6924K9403K0704M2533M9842
12668c139745O5774J9256j0925R498N129k9687l6307m9422K5604J8957L5749K9143
$$ plain form
12656 -3056976 -3030636 -2975129 -2928594 -2896103 -2898230 -2867447 -2821515 -2824160 -2807115 -2809262 -2796027 -2778067
12644 -2778067 -2735109 -2721110 -2682860 -2674282 -2634895 -2603063 -2605680 -2632962 -2653753 -2657526 -2618576 -2628229
12632 -2628229 -2651895 -2638581 -2586092 -2524883 -2498241 -2469179 -2451856 -2462489 -2438095 -2451038 -2470365
12621 -2470365 -2503610 -2466592 -2407545 -2324520 -2297681 -2278267 -2244940 -2266121 -2282414 -2276267 -2197408
12610 -2197408 -2159974 -2173725 -2138753 -2047426 -2022311 -2035606 -2055388 -2061007 -2082862 -2136616 -2144377 -2168566
12598 -2168566 -2176755 -2199212 -2228211 -2214541 -2265905 -2277476 -2242803 -2230302 -2183574 -2192378 -2176455 -2154431
12586 -2154431 -2105922 -2025219 -2006561 -1992313 -1959030 -1921214 -1948294 -1931117 -1897347 -1877188 -1838962
12575 -1838962 -1837283 -1864766 -1871165 -1875272 -1894500 -1894289 -1821107 -1779601 -1764178 -1670304 -1613224 -1636929
$$ packed form
12656c056976K6340N5507M6535L2491k127L0783M5932k645J7045k147J3235J7960
12644b778067M2958J3999L8250Q578L9387L1832k617k7282k0791l773L8950r653
12632b628229k3666J3314N2489O1209K6642K9062J7323j0633K4394j2943j9327
12621b470365l3245L7018N9047Q3025K6839J9414L3327k1181j6293O147P8859
12610b197408L7434j3751L4972R1327K5115j3295j9782n619k1855n3754p761k4189
12598b168566q189k2457k8999J3670n1364j1571L4673J2501M6728q804J5923K2024
12586b154431M8509Q0703J8658J4248L3283L7816k7080J7177L3770K0159L8226
12575a838962J679k7483o399m107j9228K11P3182M1506J5423R3874N7080k3705
$$ plain form
12563 -1636929 -1623457 -1616842 -1601754 -1553632 -1505834 -1511335 -1514395 -1464164 -1384147 -1313979 -1242040 -1194459
12551 -1194459 -1178898 -1135926 -1059144 -1044018 -1047115 -1013085 -997113 -957116 -946203 -883012 -834155
12540 -834155 -776069 -710308 -641093 -541745 -391713 -265936 -171769 -88792 2765 111787 301655
12529 301655 481944 657849 865511 1059486 1320983 1598720 1890923 2277173 2677995 3072473
12519 3072473 3533831 4107863 4875962 5893922 7211808 8703809 10027818 9951065 6586500
12510 6586500 -164170 -7494100 -12359133 -14423153 -14237192 -13006922 -11695411 -10540738
12502 -10540738 -9608318 -8866288 -8213640 -7746238 -7352753 -6994272 -6680107 -6350996 -6063408
12493 -6063408 -5816798 -5649178 -5450188 -5286588 -5128226 -5028758 -4908360 -4796204 -4746149 -4649416
$$ packed form
12563a636929J3472O615J5088M8122M7798n501l060N0231Q0017P0168P1939M7581
12551a194459J5561M2972P6782J5126l097L4030J5972L9997J0913O3191M8857
12540h34155N8086O5761O9215R9348J50032J25777R4167Q2977R1557J09022J89868
12529C01655J80289J75905K07662J93975K61497K77737K92203L86250M00822L94478
12519C072473M61358N74032P68099J017960J317886J492001J324009p6753l364565
12510F586500o750670p329930m865033k064020J85961J230270J311511J154673
12502a0540738R32420P42030O52648M67402L93485L58481L14165L29111K87588
12493f063408K46610J67620J98990J63600J58362R9468J20398J12156N0055R6733
$$ plain form
12483 -4649416 -4513793 -4429128 -4348735 -4277344 -4219311 -4133830 -4086668 -4015781 -3964376 -3915307 -3899085
12472 -3899085 -3857103 -3756363 -3688256 -3664921 -3634726 -3632110 -3613119 -3563863 -3479702 -3460709 -3458004
12461 -3458004 -3408734 -3361611 -3375640 -3325038 -3280147 -3302038 -3310753 -3315331 -3336516 -3296615 -3273813 -3268200
12449 -3268200 -3226855 -3184804 -3146161 -3148812 -3127943 -3088612 -3084451 -3059977 -3015790 -2954307 -2971277 -2997708
12437 -2997708 -2966953 -2916499 -2851744 -2825389 -2796245 -2787756 -2816714 -2877039 -2866159 -2831464 -2824554 -2826180
12425 -2826180 -2815510 -2793895 -2752739 -2753161 -2730100 -2695117 -2685473 -2668500 -2652660 -2670421 -2696740 -2719927
12413 -2719927 -2704485 -2673170 -2689525 -2705679 -2721523 -2720810 -2695671 -2690558 -2671634 -2626545 -2581953 -2541044
12401 -2541044 -2533479 -2601818 -2710526 -2794744 -2790945 -2742628 -2687834 -2659742 -2695669 -2670878 -2638983
$$ packed form
12483d649416J35623Q4665Q0393P1391N8033Q5481M7162P0887N1405M9069J6222
12472c899085M1982J00740O8107K3335L0195K616J8991M9256Q4161J8993K705
12461c458004M9270M7123j4029N0602M4891k1891q715m578k1185L9901K2802N613
12449c268200M1345M2051L8643k651K0869L9331M161K4474M4187O1483j6970k6431
12437b997708L0755N0454O4755K6355K9144Q489k8958o0325J0880L4695O910j626
12425b826180J0670K1615M1156m22K3061L4983R644J6973J5840j7761k6319k3187
12413b719927J5442L1315j6355j6154j5844P13K5139N113J8924M5089M4592M0909
12401b541044P565o8339j08708q4218L799M8317N4794K8092l5927K4791L1895
$$ plain form
12390 -2638983 -2611951 -2629683 -2687935 -2689782 -2648972 -2601488 -2590564 -2577734 -2531769 -2534595 -2533872 -2534397
12378 -2534397 -2538176 -2547021 -2499056 -2438889 -2444964 -2412917 -2380108 -2383281 -2359994 -2338515 -2352749 -2399795
12366 -2399795 -2397978 -2367493 -2375366 -2385082 -2438470 -2422277 -2430013 -2463143 -2480779 -2453613 -2410113 -2334320
12354 -2334320 -2354700 -2409481 -2390258 -2391416 -2408919 -2378508 -2336635 -2294344 -2240696 -2281125 -2367988
12343 -2367988 -2352658 -2335760 -2288199 -2202756 -2169423 -2244397 -2346913 -2372988 -2376135 -2340677 -2364707
12332 -2364707 -2348615 -2270204 -2234191 -2174421 -2167671 -2206470 -2242983 -2271077 -2303983 -2313088 -2270746 -2282111
12320 -2282111 -2269264 -2247624 -2259838 -2272030 -2223479 -2192434 -2228101 -2263725 -2240524 -2171313 -2161329
12309 -2161329 -2181284 -2207838 -2195925 -2199510 -2163043 -2109064 -2124524 -2150551 -2194845 -2183687 -2208902
$$ packed form
12390b638983K7032j7732n8252j847M0810M7484J0924J2830M5965k826P23n25
12378b534397l779q845M7965O0167o075L2047L2809l173K3287K1479j4234m7046
12366b399795J817L0485p873r716n3388J6193p736l3130j7636K7166M3500P5793
12354b334320k0380n4781J9223j158j7503L0411M1873M2291N3648m0429q6863
12343b367988J5330J6898M7561Q5443L3333p4974j02516k6075l147L5458k4030
12332b364707J6092P8411L6013N9770O750l8799l6513k8094l2906r105M2342j1365
12320b282111J2847K1640j2214j2192M8551L1045l5667l5624K3201O9211R984
12309b161329j9955k6554J1913l585L6467N3979j5460k6027m4294J1158k5215
$$ plain form
12298 -2208902 -2221913 -2202133 -2208762 -2194881 -2142923 -2118791 -2136951 -2118820 -2110044 -2074597 -2063374 -2019935
12286 -2019935 -1992191 -2037382 -2037944 -1999663 -2015216 -2052785 -2075009 -2063756 -2045709 -2009321 -2006214 -1989267
12274 -1989267 -1992176 -2002821 -2091848 -2140240 -2145149 -2137902 -2095739 -2056293 -2012559 -2011724 -2059307 -2027576
12262 -2027576 -1973729 -1973844 -2007987 -2002657 -2015614 -2040426 -2038419 -2018395 -1973019 -1961049 -1945997 -1940888
12250 -1940888 -1956223 -1955059 -1989885 -1976795 -1965766 -1977035 -1987047 -1943288 -1934650 -1909892 -1883813 -1910571
12238 -1910571 -1913403 -1886311 -1916811 -1897174 -1867033 -1849008 -1853359 -1899499 -1953571 -1991231 -1990385 -1925305
12226 -1925305 -1914996 -1949047 -1913826 -1869313 -1826122 -1845750 -1858687 -1868616 -1884086 -1884221 -1895592 -1848123
12214 -1848123 -1803799 -1767828 -1790691 -1861090 -1886514 -1893809 -1863456 -1842370 -1824257 -1837456 -1864246
$$ packed form
12298b208902j3011J9780o629J3881N1958K4132j8160J8131Q776L5447J1223M3439
12286b019935K7744m5191n62L8281j5553l7569k2224J1253J8047L6388L107J6947
12274a989267k909j0645q9027m8392m909P247M2163L9446M3734Q35m7583L1731
12262b027576N3847j15l4143N330j2957k4812K007K0024M5376J1970J5052N109
12250a940888j5335J164l4826J3090J1029j1269j0012M3759Q638K4758K6079k6758
12238a910571k832K7092l0500J9637L0141J8025m351m6140n4072l7660Q46O5080
12226a925305J0309l4051L5221M4513M3191j9628j2937r929j5470j35j1371M7469
12214a848123M4324L5971k2863p0399k5424p295L0353K1086J8113j3199k6790
$$ plain form
12203 -1864246 -1865440 -1885541 -1889738 -1925982 -1946832 -1906401 -1848530 -1755042 -1739730 -1761363 -1794641 -1845330
12191 -1845330 -1872995 -1876659 -1848133 -1803526 -1786291 -1800513 -1813954 -1824204 -1855831 -1863694 -1805938 -1747304
12179 -1747304 -1773580 -1775185 -1796392 -1832034 -1865081 -1861540 -1851515 -1822688 -1846003 -1836381 -1766625 -1745775
12167 -1745775 -1765457 -1779073 -1777994 -1815138 -1861343 -1848416 -1802192 -1776801 -1836442 -1929066 -1948188
12156 -1948188 -1907262 -1932841 -1968394 -1958836 -1867315 -1831577 -1840200 -1816376 -1752604 -1758639 -1751286 -1761407
12144 -1761407 -1778965 -1772563 -1780127 -1794178 -1755419 -1710403 -1727790 -1709439 -1696144 -1693223 -1691386 -1637680
12132 -1637680 -1663230 -1701509 -1732102 -1717449 -1686923 -1686190 -1755197 -1731065 -1666253 -1600792 -1593573 -1655253
12120 -1655253 -1654325 -1659168 -1674391 -1696164 -1674120 -1685026 -1721424 -1748412 -1723942 -1660115 -1598284 -1642667
$$ packed form
12203a864246j194k0101m197l6244k0850M0431N7871R3488J5312k1633l3278n0689
12191a845330k7665l664K8526M4607J7235j4222j3441j0250l1627p863N7756N8634
12179a747304k6276j605k1207l5642l3047L541J0025K8827k3315R622O9756K0850
12167a745775j9682j3616J079l7144m6205J2927M6224K5391n9641r2624j9122
12156a948188M0926k5579l5553R558R1521L5738q623K3824O3772o035P353j0121
12144a761407j7558O402p564j4051L8759M5016j7387J8351J3295K921J837N3706
12132a637680k5550l8279l0593J4653L0526P33o9007K4132O4812O5461P219o1680
12120a655253R28m843j5223k1773K2044j0906l6398k6988K4470O3827O1831m4383
$$ plain form
12108 -1642667 -1665124 -1633089 -1667980 -1637050 -1619745 -1607367 -1598504 -1595847 -1626955 -1649245 -1627011 -1585514
12096 -1585514 -1593187 -1600388 -1568661 -1566786 -1568454 -1587307 -1609467 -1580580 -1515332 -1543332 -1561522 -1551177
12084 -1551177 -1553798 -1523675 -1491707 -1566262 -1608198 -1645400 -1664064 -1645261 -1665767 -1665828 -1601917 -1557171
12072 -1557171 -1579604 -1600761 -1588291 -1560407 -1542612 -1537785 -1546010 -1591288 -1659504 -1684548 -1677091 -1638497
12060 -1638497 -1616985 -1576078 -1568890 -1595532 -1623849 -1599767 -1594261 -1572043 -1548802 -1526317 -1475947 -1472811
12048 -1472811 -1482125 -1472747 -1467387 -1476764 -1506480 -1514736 -1480550 -1451124 -1419459 -1466367 -1475363 -1451605
12036 -1451605 -1475671 -1435437 -1439335 -1446122 -1434284 -1426536 -1418626 -1390380 -1347447 -1296235 -1242003 -1253029
12024 -1253029 -1264683 -1198105 -1157389 -1167422 -1179408 -1191678 -1144361 -1136715 -1128500 -1089951 -1052647 -1052125
$$ packed form
12108a642667k2457L2035l4891L0930J7305J2378Q863K657l1108k2290K2234M1497
12096a585514p673p201L1727J875j668j8853k2160K8887O5248k8000j8190J0345
12084a551177k621L0123L1968p4555m1936l7202j8664J8803k0506o1O3911M4746
12072a557171k2433k1157J2470K7884J7795M827q225m5278o8216k5044P457L8594
12060a638497K1512M0907P188k6642k8317K4082N506K2218K3241K2485N0370L136
12048a472811r314R378N360r377k9716q256L4186K9426L1665m6908q996K3758
12036a451605k4066M0234l898o787J1838P748P910K8246M2933N1212N4232j1026
12024a253029j1654O6578M0716j0033j1986j2270M7317P646Q215L8549L7304N22
$$ plain form
12012 -1052125 -1017148 -960488 -863663 -817975 -797342 -705458 -599014 -517389 -415690 -242200 -11610
12001 -11610 185056 236317 70588 -476810 -1299173 -2234429 -2909309 -3263400 -3311936 -3225747
11991 -3225747 -3052385 -2878675 -2759281 -2634368 -2547057 -2481461 -2403045 -2351335 -2315350 -2240194
11981 -2240194 -2198600 -2136842 -2072072 -2041740 -2006931 -2023273 -2051675 -2061962 -2056789 -2058227 -2002451 -1979877
11969 -1979877 -1954194 -1949748 -1950298 -1953315 -1966796 -1898359 -1815031 -1800285 -1794464 -1773134 -1757581 -1764051
11957 -1764051 -1780202 -1842890 -1843625 -1796903 -1779993 -1804702 -1748031 -1724275 -1717135 -1654510 -1637670 -1638431
11945 -1638431 -1687015 -1723885 -1711253 -1741395 -1757153 -1739031 -1725012 -1657973 -1587428 -1576810 -1615944
11934 -1615944 -1637339 -1661888 -1662940 -1638649 -1663661 -1706764 -1722256 -1744714 -1728955 -1721372 -1718653 -1703963
$$ packed form
12012a052125L4977N6660R6825M5688K0633R1884J06444Q1625J01699J73490K30590
12001a1610J96666N1261j65729n47398q22363r35256o74880l54091m8536Q6189
11991c225747J73362J73710J19394J24913Q7311O5596P8416N1710L5985P5156
11981b240194M1594O1758O4770L0332L4809j6342k8402j0287N173j438N5776K2574
11969a979877K5683M446n50l017j3481O8437Q3328J4746N821K1330J5553o470
11957a764051j6151o2688p35M6722J6910k4709N6671K3756P140O2625J6840p61
11945a638431m8584l6870J2632l0142j5758J8122J4019O7039P0545J0618l9134
11934a615944k1395k4549j052K4291k5012m3103j5492k2458J5759P583K719J4690
$$ plain form
11922 -1703963 -1667421 -1583979 -1558643 -1553910 -1564256 -1573961 -1603079 -1632239 -1657340 -1653770 -1649426 -1632524
11910 -1632524 -1570215 -1551066 -1507993 -1520071 -1596173 -1616229 -1608040 -1570380 -1580192 -1596743 -1563585 -1534869
11898 -1534869 -1541028 -1585059 -1587517 -1553946 -1568535 -1546037 -1529183 -1559513 -1591280 -1604569 -1597205 -1580710
11886 -1580710 -1573913 -1531572 -1496320 -1536860 -1562530 -1546343 -1517691 -1500193 -1545469 -1510551 -1459242
11875 -1459242 -1445198 -1498591 -1517871 -1485091 -1473782 -1469352 -1496793 -1512427 -1521724 -1558568 -1516037 -1483177
11863 -1483177 -1507311 -1548440 -1515728 -1520446 -1536381 -1538451 -1547198 -1529677 -1509740 -1495755 -1457419 -1488788
11851 -1488788 -1486876 -1488700 -1510477 -1502145 -1495888 -1532081 -1595536 -1640207 -1628283 -1595938 -1552544 -1488500
11839 -1488500 -1459312 -1517210 -1517478 -1543001 -1526209 -1450138 -1440266 -1458318 -1477940 -1431335 -1407322 -1431952
$$ packed form
11922a703963L6542Q3442K5336M733j0346r705k9118k9160k5101L570M344J6902
11910a632524O2309J9149M3073j2078p6102k0056Q189L7660r812j6551L3158K8716
11898a534869o159m4031k458L3571j4589K2498J6854l0330l1767j3289P364J6495
11886a580710O797M2341L5252m0540k5670J6187K8652J7498m5276L4918N1309
11875a459242J4044n3393j9280L2780J1309M430k7441j5634r297l6844M2531L2860
11863a483177k4134m1129L2712m718j5935k070q747J7521J9937J3985L8336l1369
11851a488788J912j824k1777Q332O257l6193o3455m4671J1924L2345M3394O4044
11839a488500K9188n7898k68k5523J6792P6071R872j8052j9622M6605K4013k4630
$$ plain form
11827 -1431952 -1472560 -1506398 -1496696 -1502278 -1520459 -1513312 -1466583 -1403101 -1408279 -1399792 -1390146 -1359739
11815 -1359739 -1371075 -1364725 -1388499 -1368746 -1370785 -1458049 -1509952 -1491662 -1456273 -1462604 -1497080 -1479170
11803 -1479170 -1474369 -1452569 -1448956 -1427825 -1395649 -1397492 -1409490 -1407208 -1424359 -1425126 -1438373 -1451537
11791 -1451537 -1430349 -1413677 -1402238 -1375142 -1389756 -1409959 -1440549 -1440089 -1432097 -1457682 -1486421 -1487637
11779 -1487637 -1517061 -1517553 -1440138 -1429103 -1414299 -1444641 -1505487 -1525722 -1491715 -1475859 -1468485 -1433352
11767 -1433352 -1421729 -1407351 -1428858 -1421891 -1429537 -1412718 -1387444 -1420136 -1410866 -1397195 -1374176 -1357272
11755 -1357272 -1339760 -1342422 -1357177 -1395138 -1398235 -1410842 -1369376 -1372596 -1413425 -1374459 -1350209 -1359755
11743 -1359755 -1341368 -1379727 -1418841 -1453237 -1387798 -1329860 -1378268 -1360732 -1333061 -1352981 -1416446
$$ packed form
11827a431952m0608l3838R702n582j8181P147M6729O3482n178Q487R646L0407
11815a359739j1336O350k3774J9753k039q7264n1903J8290L5389o331l4476J7910
11803a479170M801K1800L613K1131L2176j843j1998K282j7151p67j3247j3164
11791a451537K1188J6672J1439K7096j4614k0203l0590M60P992k5585k8739j216
11779a487637k9424m92P7415J1035J4804l0342o0846k0235L4007J5856P374L5133
11767a433352J1623J4378k1507O967p646J6819K5274l2692R270J3671K3019J6904
11755a357272J7512k662j4755l7961l097j2607M1466l220m0829L8966K4250r546
11743a359755J8387l8359l9114l4396O5439N7938m8408J7536K7671j9920o3465
$$ plain form
11732 -1416446 -1449973 -1432018 -1399719 -1387354 -1363078 -1345894 -1412640 -1462469 -1396589 -1388398 -1427161
11721 -1427161 -1441200 -1369160 -1320389 -1332615 -1339264 -1336426 -1281866 -1285346 -1366760 -1373839 -1378212 -1376431
11709 -1376431 -1323953 -1279986 -1304432 -1298867 -1266138 -1232122 -1310793 -1312480 -1287985 -1296507 -1318262 -1304549
11697 -1304549 -1273178 -1269069 -1301612 -1301517 -1306553 -1332790 -1329873 -1317255 -1288944 -1290453 -1283728 -1222924 -1228015
11684 -1228015 -1283551 -1335001 -1353588 -1336715 -1328872 -1328467 -1324132 -1311900 -1341600 -1352215 -1366597 -1373211
11672 -1373211 -1390056 -1368618 -1336163 -1269641 -1226465 -1200493 -1198187 -1207497 -1260604 -1281036 -1271282 -1259235
11660 -1259235 -1301034 -1324572 -1297427 -1260505 -1241868 -1251837 -1242101 -1223078 -1241617 -1291250 -1294933 -1268591
11648 -1268591 -1258607 -1264086 -1235956 -1290651 -1305563 -1299994 -1308376 -1260776 -1246557 -1280490 -1266939 -1283968
$$ packed form
11732a416446l3527J7955L2299J2365K4276J7184o6746m9829O5880Q191l8763
11721a427161j4039P2040M8771j2226o649K838N4560l480q1414p079m373J781
11709a376431N2478M3967k4446N565L2729L4016p8671j687K4495q522k1755J3713
11697a304549L1371M109l2543R5n036k6237K917J2618K8311j509O725O0804n091
11684a228015n5536n1450j8587J6873P843M05M335J2232k9700j0615j4382o614
11672a373211j6845K1438L2455O6522M3176K5972K306r310n3107k0432R754J2047
11660a259235m1799k3538K7145L6922J8637r969R736J9023j8539m9633l683K6342
11648a268591R984n479K8130n4695j4912N569q382M7600J4219l3933J3551j7029
$$ plain form
11636 -1283968 -1309549 -1322529 -1295542 -1253089 -1209863 -1179928 -1239910 -1264249 -1258498 -1231556 -1201939
11625 -1201939 -1176497 -1171970 -1224350 -1280762 -1277805 -1265792 -1255011 -1263715 -1256677 -1237452 -1247220 -1209051
11613 -1209051 -1216615 -1210780 -1230848 -1291105 -1263701 -1218469 -1205071 -1267624 -1257229 -1244782 -1235856 -1315943
11601 -1315943 -1363185 -1341051 -1297307 -1294227 -1327359 -1325350 -1299686 -1276232 -1276681 -1243730 -1191443 -1113369
11589 -1113369 -1108019 -1138624 -1188569 -1208879 -1173561 -1181292 -1219371 -1236958 -1245841 -1222881 -1194091 -1207510
11577 -1207510 -1237012 -1254261 -1230232 -1190462 -1190586 -1222557 -1239178 -1262725 -1274525 -1269464 -1227215 -1235609
11565 -1235609 -1232494 -1201663 -1207362 -1209205 -1155154 -1168798 -1196761 -1241753 -1275727 -1174995 -1086205 -1115286
11553 -1115286 -1144904 -1120496 -1132119 -1188213 -1200187 -1197568 -1214333 -1247249 -1226816 -1246344 -1265356
$$ packed form
11636a283968k5581j2980K6987M2453M3226K9935n9982k4339N751K6942K9617
11625a201939K5442M527n2380n6412K957J2013J0781q704P038J9225r768L8169
11613a209051p564N835k0068o0257K7404M5232J3398o2553J0395J2447Q926q0087
11601a315943m7242K2134M3744L080l3132K009K5664K3454m49L2951N2287P8074
11589a113369N350l0605m9945k0310L5318p731l8079j7587q883K2960K8790j3419
11577a207510k9502j7249K4029L9770j24l1971j6621k3547j1800N061M2249q394
11565a235609L115L0831n699j843N4051j3644k7963m4992l3974J00732Q8790k9081
11553a115286k9618K4408j1623n6094j1974K619j6765l2916K0433j9528j9012
$$ plain form
11542 -1265356 -1242491 -1240282 -1241589 -1203660 -1163479 -1120609 -1101485 -1071070 -1074280 -1081978 -1064333 -1054265
11530 -1054265 -1056038 -1096984 -1149927 -1201641 -1180121 -1168022 -1149806 -1131099 -1163441 -1136989 -1126308
11519 -1126308 -1107088 -1144581 -1229380 -1196510 -1161650 -1150652 -1214972 -1263151 -1201121 -1171405 -1163724
11508 -1163724 -1186230 -1171300 -1145035 -1135290 -1168008 -1188241 -1218157 -1196088 -1178356 -1156639 -1162209 -1153938
11496 -1153938 -1098002 -1091510 -1079888 -1127715 -1145935 -1179376 -1159834 -1102341 -1086019 -1082590 -1081185 -1085531
11484 -1085531 -1090342 -1110160 -1165253 -1174571 -1142597 -1177442 -1130223 -1082033 -1108529 -1136972 -1108058 -1117892
11472 -1117892 -1135338 -1098106 -1124378 -1119830 -1110459 -1134425 -1130626 -1101637 -1128091 -1152592 -1176118 -1219343
11460 -1219343 -1164699 -1105091 -1104664 -1174798 -1182568 -1178859 -1166490 -1144450 -1102781 -1105937 -1116769 -1150724
$$ packed form
11542a265356K2865K209j307L7929M0181M2870J9124L0415l210p698J7645J0068
11530a054265j773m0946n2943n1714K1520J2099J8216J8707l2342K6452J0681
11519a126308J9220l7493q4799L2870L4860J0998o4320m8179O2030K9716P681
11508a163724k2506J4930K6265R745l2718k0233k9916K2069J7732K1717n570Q271
11496a153938N5936O492J1622m7827j8220l3441J9542N7493J6322L429J405m346
11484a085531m811j9818n5093r318L1974l4845M7219M8190k6496k8443K8914r834
11472a117892j7446L7232k6272M548R371k3966L799K8989k6454k4501k3526m3225
11460a219343N4644N9608M27p0134p770L709J2369K2040M1669l156j0832l3955
$$ plain form
11448 -1150724 -1122990 -1159035 -1173631 -1142971 -1124308 -1122796 -1136400 -1150032 -1174710 -1140674 -1081971
11437 -1081971 -1078737 -1111555 -1134264 -1105412 -1112598 -1109034 -1126044 -1139734 -1133486 -1096647 -1068842 -1088853
11425 -1088853 -1102100 -1099625 -1095383 -1124795 -1161732 -1180698 -1151156 -1106558 -1102387 -1108693 -1113646 -1083901
11413 -1083901 -1037601 -1022756 -1033527 -1032618 -1043586 -1028334 -1072031 -1147285 -1106274 -1058693 -1089909 -1095821
11401 -1095821 -1071756 -1057330 -993083 -1012310 -1064535 -1097463 -1118265 -1108083 -1087828 -1094215 -1096686 -1064658
11389 -1064658 -1075886 -1056081 -1071622 -1106462 -1109106 -1150739 -1117631 -1117766 -1129489 -1139961 -1119984 -1093481
11377 -1093481 -1073177 -1079388 -1103781 -1071060 -1039712 -1024436 -1007807 -1021491 -1121105 -1131566 -1104178
11366 -1104178 -1091570 -1078089 -1026248 -994262 -986024 -980761 -1018139 -1061031 -1031010 -1027347 -1052428 -1065720
$$ packed form
11448a150724K7734l6045j4596L0660J8663J512j3604j3632k4678L4036N8703
11437a081971L234l2818k2709K8852p186L564j7010j3690O248L6839K7805k0011
11425a088853j3247K475M242k9412l6937j8966K9542M4598M171o306m953K9745
11413a083901M6300J4845j0771R09j0968J5252m3697p5254M1011M7581l1216n912
11401a095821K4065J4426O4247j9227n2225l2928k0802J0182K0255o387k471L2028
11389a064658j1228J9805j5541l4840k644m1633L3108j35j1723j0472J9977K6503
11377a093481K0304o211k4393L2721L1348J5276J6629j3684r9614j0461K7388
11366a104178J2608J3481N1841L1986Q238N263l7378m2892L0021L663k5081j3292
$$ plain form
11354 -1065720 -1088993 -1066053 -1094107 -1093360 -1117387 -1110341 -1086918 -1059838 -987572 -987746 -1065363 -1061308
11342 -1061308 -1065381 -1066260 -1029334 -1015458 -985632 -992507 -1036483 -1042739 -1012904 -955256 -946500 -1009757
11330 -1009757 -987274 -988232 -994597 -1026499 -1046713 -1027294 -986357 -968714 -950394 -931666 -974845 -1026101
11318 -1026101 -1046826 -1080002 -1115224 -1078163 -1078158 -1067988 -1065643 -1015180 -1002290 -1064184 -1085362 -1016737
11306 -1016737 -1014117 -1032705 -1031450 -985141 -984473 -1004424 -998227 -997669 -1002471 -1002801 -1021531 -1035505 -1049977
11293 -1049977 -1011470 -957370 -959288 -964479 -994734 -1034149 -1008999 -1004182 -1020580 -1001163 -936917 -963744
11281 -963744 -1000166 -1039216 -1045893 -1002771 -999762 -958915 -934520 -943919 -970961 -927576 -922487 -937363
11269 -937363 -946020 -942497 -924113 -940199 -949331 -970341 -964673 -1009366 -999862 -955191 -926096 -906363
$$ packed form
11354a065720k3273K2940k8054P47k4027P046K3423K7080P2266j74p7617M055
11342a061308m073q79L6926J3876K9826o875m3976o256K9835N7648Q756o3257
11330a009757K2483r58o365l1902k0214J9419M0937J7643J8320J8728m3179n1256
11318a026101k0725l3176l5222L7061NJ0170K345N0463J2890o1894k1178O8625
11306a016737K620j8588J255M6309O68j9951O197N58m802l30j8730j3974j4472
11293a049977L8507N4100j918n191l0255l9415K5150M817j6398J9417O4246k6827
11281i63744l6422l9050o677M3122L009M0847K4395r399k7042M3385N089j4876
11269i37363q657L523J8384j6086r132k1010N668m4693R504M4671K9095J9733
$$ plain form
11257 -906363 -900049 -935234 -1005151 -972897 -974774 -1022952 -1027243 -1012097 -987347 -1004958 -1023077 -972910
11245 -972910 -938578 -893812 -951057 -998838 -1021464 -971115 -920290 -980864 -1022308 -993345 -988208 -982786
11233 -982786 -946151 -916392 -894658 -912917 -964844 -981461 -946565 -936668 -971784 -1008957 -1009929 -954977
11221 -954977 -931433 -952708 -1006679 -959771 -905611 -946919 -956348 -902681 -894642 -947642 -948016 -907110
11209 -907110 -933379 -897793 -854343 -900843 -930575 -966747 -951899 -939163 -921534 -938329 -951122
11198 -951122 -923653 -887691 -917863 -975199 -976153 -953788 -969886 -962263 -952294 -945404 -920409 -952058
11186 -952058 -922452 -885054 -902723 -861777 -826300 -840529 -852787 -867456 -868366 -858819 -861844 -867196
11174 -867196 -899649 -901290 -853681 -849807 -894459 -883385 -841791 -853173 -912328 -946120 -941941 -921299
$$ packed form
11257i06363O314l5185o9917L2254j877m8178m291J5146K4750j7611j8119N0167
11245i72910L4332M4766n7245m7781k2626N0349N0825o0574m1444K8963N137N422
11233i82786L6635K9759K1734j8259n1927j6617L4896R897l5116l7173r72N4952
11221i54977K3544k1275n3971M6908N4160m1308r429N3667Q039n3000l74M0906
11209i07110k6269L5586M3450m6500k9732l6172J4848J2736J7629j6795j2793
11198i51122K7469L5962l0172n7336r54K2365j6098P623R969O890K4995l1649
11186i52058K9606L7398j7669M0946L5477j4229j2258j4669r10R547l025n352
11174h67196l2453j641M7609L874m4652J1074M1594j1382n9155l3792M179K0642
$$ plain form
11162 -921299 -930008 -930376 -905669 -892455 -884227 -848684 -869300 -861811 -863462 -892009 -900289 -896474 -918274
11149 -918274 -881680 -845759 -891049 -926280 -896720 -849036 -801957 -817556 -832921 -849468 -876110
11138 -876110 -969841 -966433 -961624 -1032476 -1029301 -1052801 -1018779 -969930 -960934 -968591 -953178 -924793
11126 -924793 -933413 -932604 -965152 -1009957 -946656 -954845 -971904 -943626 -889610 -870538 -898385 -863247
11114 -863247 -817040 -817991 -876941 -889778 -886285 -862471 -847423 -867734 -868097 -823511 -813227 -809723 -802418
11101 -802418 -806558 -843107 -874800 -862495 -842137 -852442 -863955 -852936 -866852 -917375 -978333 -931317
11089 -931317 -871085 -853592 -876369 -874212 -873372 -864313 -856477 -881452 -869972 -836432 -820358 -840501
11077 -840501 -878148 -877395 -868864 -867438 -836267 -826042 -819149 -823732 -831585 -909614 -921619 -875497 -845134
$$ packed form
11162i21299q709l68K4707J3214Q228L5543k0616P489j651k8547q280L815k1800
11149i18274L6594L5921m5290l5231K9560M7684M7079j5599j5365j6547k6642
11138h76110r3731L408M809p0852L175k3500L4022M8849Q996p657J5413K8385
11126i24793q620Q09l2548m4805O3301q189j7059K8278N4016J9072k7847L5138
11114h63247M6207r51n8950j2837L493K3814J5048k0311l63M4586J0284L504P305
11101h02418m140l6549l1693J2305K0358j0305j1513J1019j3916n0523o0958M7016
11089i31317O0232J7493k2777K157Q40R059P836k4975J1480L3540J6074k0143
11077h40501l7647P53Q531J426L1171J0225O893m583p853p8029j2005M6122L0363
$$ plain form
11064 -845134 -841588 -840068 -825670 -789202 -801809 -838126 -823749 -823309 -810341 -786929 -747430 -749797
11052 -749797 -795352 -779500 -725461 -761971 -815263 -800875 -818905 -862759 -845746 -816905 -802708
11041 -802708 -869539 -870800 -870715 -827190 -816967 -836368 -791869 -836221 -880426 -878826 -825386 -761384
11029 -761384 -740711 -784074 -799734 -768398 -746097 -726290 -731415 -780096 -786197 -736149 -769144 -837436
11017 -837436 -843459 -847175 -831170 -752706 -728601 -743205 -780346 -760324 -706857 -708050 -743887 -730414
11005 -730414 -755816 -758348 -742045 -784515 -802764 -793157 -748724 -762511 -817492 -826533 -780440 -747931
10993 -747931 -729273 -774437 -802838 -825726 -808630 -756387 -752507 -768171 -768815 -757036 -754237 -736377
10981 -736377 -725597 -701401 -711135 -718927 -729695 -715145 -758903 -735006 -729499 -739185 -780165 -749468
$$ packed form
11064h45134L546J520J4398L6468j2607l6317J4377M40J2968K3412L9499k367
11052g49797m5555J5852N4039l6510n3292J4388j8030m3854J7013K8841J4197
11041h02708o6831j261Q5M3525J0223j9401M4499m4352m4205J600N3440O4002
11029g61384K0673m3363j5660L1336K2301J9807n125m8681o101N0048l2995o8292
11017h37436o023l716J6005P8464K4105j4604l7141K0022N3467j193l5837J3473
11005g30414k5402k532J6303m2470j8249R607M4433j3787n4981r041M6093L2509
10993g47931J8658m5164k8401k2888J7096N2243L880j5664o44J1779K799J7860
10981g36377J0780K4196r734p792j0768J4550m3758K3897N507r686m0980L0697
$$ plain form
10969 -749468 -740081 -677842 -662066 -720627 -730082 -682534 -671309 -720772 -733197 -705972 -679443 -713927
10957 -713927 -719957 -727379 -731474 -725126 -721401 -748274 -776990 -743934 -714555 -690018 -682726 -689716 -695341
10944 -695341 -724476 -696123 -671033 -665345 -707668 -732334 -751014 -723932 -676647 -681739 -684189 -704515
10932 -704515 -710207 -678415 -699458 -697024 -649641 -639896 -643916 -626720 -609262 -619848 -604068 -600262
10920 -600262 -622311 -581290 -530331 -563879 -650103 -640260 -594537 -557018 -544788 -535240 -551695 -589613
10908 -589613 -640647 -645105 -627547 -633534 -634319 -601767 -574256 -531252 -522469 -536890 -574242 -604894
10896 -604894 -645554 -626186 -602024 -611536 -618163 -588908 -553478 -517645 -505724 -524429 -532869 -530576
10884 -530576 -510345 -533129 -547805 -544189 -495443 -450819 -436181 -476349 -501541 -493212 -422896 -425458
$$ packed form
10969g49468R387O2239J5776n8561r455M7548J1225m9463j2425K7225K6529l4484
10957g13927o030p422m095O348L725k6873k8716L3056K9379K4537P292o990n625
10944f95341k9135K8353K5090N688m2323k4666j8680K7082M7285n092k450k0326
10932g04515n692L1792k1043K434M7383R745m020J7196J7458j0586J5780L806
10920f00262k2049M1021N0959l3548q6224R843M5723L7519J2230R548j6455l7918
10908e89613n1034m458J7558n987p85L2552K7511M3004Q783j4421l7352l0652
10896f04894m0660J9368K4162r512o627K9255L5430L5833J1921j8705q440K293
10884e30576K0231k2784j4676L616M8746M4624J4638m0168k5192Q329P0316k562
$$ plain form
10872 -425458 -498479 -491773 -491411 -449704 -462085 -470598 -411836 -348924 -365272 -377462 -393401 -452292
10860 -452292 -455320 -451492 -486261 -480152 -496019 -516491 -422316 -372878 -369301 -373202 -370320 -351523 -314570
10847 -314570 -297902 -301503 -329439 -386356 -365624 -322969 -307522 -366337 -393167 -370470 -346866 -311613
10835 -311613 -330621 -339112 -365290 -314664 -293396 -295717 -286562 -261245 -275494 -232664 -231504 -217530
10823 -217530 -211147 -195570 -217142 -242203 -241910 -252841 -211111 -215196 -264144 -227725 -218937 -213722 -192995
10810 -192995 -156957 -111057 -110389 -52468 14181 -8711 -43888 -57890 -75640 -25570 -13704 -10185
10798 -10185 29263 62492 81439 128196 133010 113864 131266 174069 183446 207578 230814 200469
10786 200469 207338 259105 303920 347456 382873 377036 365401 430744 489981 579843 645856 674783
$$ packed form
10872d25458p3021O706L62M1707j2381q513N8762O2912j6348j2190j5939n8891
10860d52292l028L828l4769O109j5867k0472R4175M9438L577l901K882J8797L6953
10847c14570J6668l601k7936n6917K0732M2655J5447n8815k6830K2697K3604L5253
10835c11613j9008q491k6178N0626K1268k321R155K5317j4249M2830J160J3974
10823b17530O383J5577k1572k5061K93j0931M1730m085m8948L6419Q788N215K0727
10810a92995L6038M5900O68N7921O6649k2892l5177j4002j7750N0070J1866L519
10798a0185L9448L3229J8947M6757M814j9146J7402M2803R377K4132K3236l0345
10786B00469O869N1767M4815M3536L5417n837j1635O5343N9237Q9862O6013K8927
$$ plain form
10774 674783 738126 811265 814719 844290 818989 793330 794312 841053 923088 986695 1063918 1136125
10762 1136125 1224193 1357742 1451249 1558595 1664089 1727895 1814335 1972814 2162857 2329954
10752 2329954 2525564 2773185 3132352 3442794 3753390 4128602 4550663 5154442 5793696
10743 5793696 6572840 7608605 8851646 10202705 11145636 10449368 6690608 244298 -6295654
10734 -6295654 -10651585 -12475120 -12320401 -11235681 -9996140 -8931154 -8062010 -7348511 -6773522
10725 -6773522 -6281205 -5811436 -5398951 -5063981 -4748567 -4501097 -4249461 -4017097 -3847226
10716 -3847226 -3744162 -3610571 -3500866 -3383519 -3274622 -3203361 -3177694 -3090579 -2996695 -2929810
10706 -2929810 -2840035 -2755644 -2697826 -2636221 -2518521 -2499777 -2540815 -2511742 -2463665 -2422087 -2335100
$$ packed form
10774F74783O3343P3139L454K9571k5301k5659R82M6741Q2035O3607P7223P2207
10762A136125Q8068J33549R3507J07346J05494O3806Q6440J58479J90043J67097
10752B329954J95610K47621L59167L10442L10596L75212M22061O03779O39254
10743E793696P79144J035765J243041J351059R42931o96268l758760o446310o539952
10734f295654m355931j823535J54719J084720J239541J064986Q69144P13499N74989
10725f773522M92317M69769M12485L34970L15414K47470K51636K32364J69871
10716c847226J03064J33591J09705J17347J08897P1261K5667Q7115R3884O6885
10706b929810Q9775Q4391N7818O1605J17700J8744m1038K9073M8077M1578Q6987
$$ plain form
10695 -2335100 -2260483 -2207713 -2169417 -2190153 -2207357 -2218377 -2212743 -2138534 -2074581 -2013892 -1988857
10684 -1988857 -2012617 -1993634 -1942300 -1860067 -1898672 -1936776 -1881874 -1810026 -1837294 -1839230 -1889050
10673 -1889050 -1870995 -1782906 -1758634 -1770350 -1767373 -1672121 -1624221 -1662501 -1671417 -1637287 -1614561 -1624671
10661 -1624671 -1595520 -1606737 -1622744 -1632401 -1570589 -1549194 -1555826 -1527493 -1542868 -1560522 -1543922 -1525864
10649 -1525864 -1552361 -1535959 -1475623 -1482375 -1457073 -1458783 -1449560 -1440013 -1505629 -1545194 -1518894 -1501419
10637 -1501419 -1510854 -1493472 -1495016 -1450700 -1427937 -1401801 -1362917 -1389851 -1370950 -1320759 -1314358 -1382479
10625 -1382479 -1451840 -1417620 -1416684 -1419602 -1421394 -1388743 -1330578 -1283020 -1279696 -1296954 -1296448 -1260665 -1270372
10612 -1270372 -1363985 -1419500 -1375541 -1333746 -1276356 -1234207 -1218499 -1201138 -1246713 -1248320 -1247435 -1250705
$$ packed form
10695b335100P4617N2770L8296k0736j7204j1020N634P4209O3953O0689K5035
10684a988857k3760J8983N1334Q2233l8605l8104N4902P1848k7268j936m9820
10673a889050J8055Q8089K4272j1716K977R5252M7900l8280q916L4130K2726j0110
10661a624671K9151j1217j6007r657O1812K1395o632K8333j5375j7654J6600J8058
10649a525864k6497J6402O0336o752K5302j710R223R547o5616l9565K6300J7475
10637a501419r435J7382j544M4316K2763K6136L8884k6934J8901N0191O401o8121
10625a382479o9361L4220R36k918j792L2651N8165M7558L324j7258N06L5783r707
10612a270372r3613n5515M3959M1795N7390M2149J5708J7361m5575j607Q85l270
$$ plain form
10600 -1250705 -1338273 -1350184 -1252794 -1207773 -1212641 -1239994 -1232368 -1216483 -1220275 -1270789 -1251057 -1245943
10588 -1245943 -1302420 -1314276 -1330028 -1303052 -1326081 -1277018 -1233924 -1184748 -1154133 -1151466 -1154033 -1148790
10576 -1148790 -1153936 -1238627 -1315770 -1331456 -1280595 -1256602 -1271061 -1232481 -1207439 -1133785 -1095039
10565 -1095039 -1109909 -1156024 -1178443 -1159993 -1194784 -1237447 -1235114 -1137243 -1100997 -1113575 -1123342 -1108376
10553 -1108376 -1139652 -1200294 -1191841 -1183511 -1147311 -1145553 -1133078 -1106076 -1100213 -1088186 -1114958 -1126846
10541 -1126846 -1114003 -1100272 -1139114 -1107333 -1048441 -1035196 -1030012 -1067436 -1097485 -1090408 -1045163 -1052427
10529 -1052427 -1069713 -1074565 -1079904 -1118802 -1119225 -1051871 -1031480 -1045210 -1054612 -1042705 -1006035 -989333
10517 -989333 -969664 -1003738 -1040284 -1108822 -1071326 -1021451 -1057798 -1071487 -1042921 -1022637 -1060559
$$ packed form
10600a250705q7568j1911R7390M5021m868k7353P626J5885l792n0514J9732N114
10588a245943n6477j1856j5752K6976k3029M9063M3094M9176L0615K667k567N243
10576a148790n146q4691p7143j5686N0861K3993j4459L8580K5042P3654L8746
10565a095039j4870m6115k2419J8450l4791m2663K333R7871L6246j2578r767J4966
10553a108376l1276o0642Q453Q330L6200J758J2475K7002N863J2027k6772j1888
10541a126846J2843J3731l8842L1781N8892J3245N184l7424l0049P077M5245p264
10529a052427j7286m852n339l8898m23O7354K0391j3730r402J1907L6670J6702
10517i89333J9669l4074l6546o8538L7496M9875l6347j3689K8566K0284l7922
$$ plain form
10506 -1060559 -1076816 -1050209 -1043533 -1071588 -1065263 -1034806 -1062634 -1058439 -1050542 -1029309 -1024172 -1065695
10494 -1065695 -1002331 -963260 -1014705 -1078590 -1121547 -1147189 -1114541 -1096105 -1044495 -1027398 -1038981
10483 -1038981 -1017107 -1003897 -998843 -1012825 -1007588 -1031056 -1039808 -1035712 -1031797 -1069119 -1051531 -1041822
10471 -1041822 -1018640 -1026865 -983901 -1010812 -1047780 -1068674 -1035460 -1010418 -1014117 -990730 -1010230 -970333
10459 -970333 -977744 -978008 -964576 -981066 -984881 -982530 -1018478 -1041506 -1046766 -1016220 -985294 -984478 -965320
10446 -965320 -951566 -927562 -934489 -943873 -895545 -904511 -902284 -916492 -939180 -934758 -908048 -867788
10434 -867788 -866653 -857894 -885654 -904494 -927942 -931443 -976537 -973957 -930833 -888065 -904050 -916545
10422 -916545 -898277 -934583 -920655 -902200 -933016 -928466 -909496 -914980 -927864 -933605 -933254 -908025
$$ packed form
10506a060559j6257K6607O676k8055O325L0457k7828M195P897K1233N137m1523
10494a065695O3364L9071n1445o3885m2957k5642L2648J8436N1610J7097j1583
10483a038981K1874J3210N054j3982N237k3468q752M096L915l7322J7588R709
10471a041822K3182q225M2964k6911l6968k0894L3214K5042l699K3387j9500L9897
10459i70333p411k64J3432j6490l815K351l5948k3028n260L0546L0926Q16J9158
10446i65320J3754K4004o927r384M8328q966K227j4208k2688M422K6710M0260
10434h67788J135Q759k7760j8840k3448l501m5094K580M3124M2768j5985j2495
10422i16545J8268l6306J3928J8455l0816M550J8970n484j2884n741L51K5229
$$ plain form
10410 -908025 -902591 -878368 -914349 -925958 -945817 -956466 -956811 -980993 -1018524 -996357 -982292 -968495
10398 -968495 -932295 -937039 -941284 -981981 -1029168 -1009139 -981838 -970946 -976601 -953450 -923440 -939817
10386 -939817 -905295 -869488 -923406 -922649 -925363 -932938 -890422 -878308 -925563 -968650 -990087 -988294
10374 -988294 -911254 -880559 -905015 -871315 -851809 -847092 -886911 -890651 -892028 -894253 -910184 -905880
10362 -905880 -889202 -829086 -859604 -875760 -923125 -905278 -917626 -930747 -914996 -937814 -916313
10351 -916313 -892431 -925196 -924612 -931558 -901773 -831820 -863635 -910092 -920465 -946890 -883501 -838050
10339 -838050 -856568 -884205 -916346 -911502 -890889 -856893 -806998 -818034 -840894 -828865 -819800 -824392
10327 -824392 -869889 -895257 -926698 -921463 -927013 -957359 -962073 -948344 -947253 -936622 -875333 -826607
$$ packed form
10410i08025N434K4223l5981j1609j9859j0649l45k4182l7531K2167J4065J3797
10398i68495L6200m744m245m0697m7187K0029K7301J0892n655K3151L0010j6377
10386i39817L4522L5807n3918P57k714p575M2516J2114m7255m3087k1437J793
10374i88294P7040L0695k4456L3700J9506M717l9819l740j377k225j5931M304
10362i05880J6678O0116l0518j6156m7365J7847j2348j3121J5751k2818K1501
10351i16313K3882l2765N84o946K9785O9953l1815m6457j0373k6425O3389M5451
10339h38050j8518k7637l2141M844K0613L3996M9895j1036k2860J2029R065m592
10327h24392m5497k5368l1441N235n550l0346m714J3729J091J0631O1289M8726
$$ plain form
10315 -826607 -856443 -843394 -827663 -767244 -762463 -782027 -822992 -886071 -913527 -915397 -920643 -908373
10303 -908373 -928110 -917950 -897933 -891628 -886379 -850254 -813767 -810419 -837419 -829380 -863213 -844080
10291 -844080 -847370 -841684 -805996 -804904 -833378 -773870 -772677 -829761 -882083 -917131 -922409 -953294
10279 -953294 -906707 -849516 -869211 -872998 -888449 -878766 -865470 -818743 -850172 -905210 -929204 -943986
10267 -943986 -978928 -934100 -890228 -923164 -947193 -911438 -904668 -929635 -903891 -894153 -845172 -814459
10255 -814459 -827482 -874841 -929454 -932164 -916769 -903755 -894005 -872125 -843932 -828425 -751176 -736669
10243 -736669 -778593 -851249 -868580 -824480 -843320 -887602 -909569 -884110 -800083 -784035 -815012
10232 -815012 -877528 -871540 -834095 -834774 -836035 -823013 -789191 -805261 -820677 -859504 -865777 -816254
$$ packed form
10315h26607k9836J3049J5731O0419M781j9564m0965o3079k7456j870n246J2270
10303i08373j9737J0160K0017O305N249L6125L6487L348k7000Q039l3833J9133
10291h44080l290N686L5688J092k8474N9508J193n7084n2322l5048n278l0885
10279i53294M6587N7191j9695l787j5451R683J3296M6727l1429n5038k3994j4782
10267i43986l4942M4828M3872l2936k4029L5755O770k4967K5744R738M8981L0713
10255h14459j3023m7359n4613k710J5395J3014R750K1880K8193J5507P7249J4507
10243g36669m1924p2656j7331M4100j8840m4282k1967K5459Q4027J6048l0977
10232h15012o2516N988L7445o79j261J3022L3822j6070j5416l8827o273M9523
$$ plain form
10220 -816254 -799208 -808235 -802482 -784893 -805733 -838989 -855416 -874154 -863581 -834394 -853936 -829182
10208 -829182 -830971 -845298 -812473 -752432 -766695 -808514 -826070 -804808 -834428 -877965 -876529 -858332
10196 -858332 -845347 -840124 -801818 -757219 -751214 -767511 -819351 -825968 -819422 -818041 -869289 -873195 -850733
10183 -850733 -842736 -845869 -809668 -784557 -790750 -773923 -747204 -763852 -749486 -735131 -733365 -754733
10171 -754733 -779920 -772512 -780128 -768688 -765073 -732852 -729369 -754342 -786301 -784921 -778110 -815416 -823300
10158 -823300 -800515 -740596 -773070 -765813 -794229 -818234 -825396 -836035 -816012 -830015 -796660 -755814
10146 -755814 -722132 -762349 -778211 -786555 -753645 -756939 -767280 -740917 -767347 -770752 -763337 -790929
10134 -790929 -802642 -805137 -820972 -846734 -760204 -757727 -755127 -737176 -744260 -784088 -789597 -802316
$$ packed form
10220h16254J7046r027N753J7589k0840l3256j6427j8738J0573K9187j9542K4754
10208h29182j789j4327L2825O0041j4263m1819j7556K1262k9620m3537J436J8197
10196h58332J2985N223L8306M4599O005j6297n1840o617O546J381n1248l906K2462
10183h50733P997l133L6201K5111o193J6827K6719j6648J4366J4355J766k1368
10171g54733k5187P408p616J1440L615L2221L483k4973l1959J380O811l7306p884
10158h23300K2785N9919l2474P257k8416k4005p162j0639K0023j4003L3355M0846
10146g55814L3682m0217j5862q344L2910l294j0341K6363k6430l405P415k7592
10134g90929j1713k495j5835k5762Q6530K477K600J7951p084l9828n509j2719
$$ plain form
10122 -802316 -752520 -732186 -730937 -756076 -779515 -756171 -776628 -803578 -778674 -755833 -801844 -810718
10110 -810718 -754736 -733820 -766357 -815969 -839555 -867249 -885685 -834828 -825566 -836955 -810520 -736793
10098 -736793 -709210 -744070 -749119 -749332 -755271 -766573 -806904 -822779 -788199 -736275 -760906 -766918
10086 -766918 -760554 -702207 -673248 -731775 -761933 -727736 -727310 -777479 -784162 -755010 -745898 -784346
10074 -784346 -793511 -767745 -765014 -812940 -845223 -822436 -769832 -758251 -762383 -715532 -686972 -747402
10062 -747402 -728808 -690083 -756463 -805767 -778317 -722311 -710792 -703447 -707788 -722093 -766310 -744020
10050 -744020 -745321 -739239 -731811 -710446 -686068 -689458 -737539 -748781 -748502 -730324 -722730 -740401 -725891
10037 -725891 -734537 -723074 -720062 -745491 -749430 -751822 -773807 -793658 -761566 -735074 -707427 -689053
$$ packed form
10122h02316M9796K0334J249k5139k3439K3344k0457k6950K4904K2841m6011q874
10110h10718N5982K0916l2537m9612k3586k7694j8436N0857R262j1389K6435P3727
10098g36793K7583l4860n049k13n939j1302m0331j5875L4580N1924k4631o012
10086g66918O364N8347K8959n8527l0158L4197M26n0169o683K9152R112l8448
10074g84346r165K5766K731m7926l2283K2787N2604J1581m132M6851K8560o0430
10062g47402J8594L8725o6380m9304K7450N6006J1519P345m341j4305m4217K2290
10050g44020j301O082P428K1365K4378l390m8081j1242K79J8178P594j7671J4510
10037g25891q646J1463L012k5429l939k392k1985j9851L2092K6492K7647J8374
$$ plain form
10025 -689053 -707962 -687231 -718205 -782347 -792987 -766684 -753882 -758720 -745156 -692574 -698206 -682304
10013 -682304 -713368 -751648 -768217 -770676 -792663 -751048 -768935 -759732 -776794 -745291 -755508 -785269
10001 -785269 -757170 -770527 -765711 -719619 -729091 -796788 -799465 -770217 -816863 -813354 -771017 -739079
9989 -739079 -744699 -748643 -757881 -729172 -712107 -697385 -683214 -697065 -662052 -606483 -598006 -620255
9977 -620255 -671195 -659305 -650809 -636468 -670713 -681359 -707649 -768458 -752476 -722060 -693928 -664448
9965 -664448 -667590 -697749 -727118 -750186 -721297 -674940 -658570 -697597 -744351 -714640 -698709 -655299
9953 -655299 -649400 -708407 -819844 -866117 -804484 -775390 -768662 -778743 -784702 -753857 -709279 -709864
9941 -709864 -747765 -729557 -678966 -636593 -673099 -694271 -637897 -636363 -699960 -721930 -739577 -743504
$$ packed form
10025f89053j8909K0731l0974o4142j0640K6303J2802m838J3564N2582n632J5902
10013f82304l1064l8280j6569k459k1987M1615j7887R203j7062L1503j0217k9761
10001g85269K8099j3357M816M6092r472o7697k677K9248m6646L509M2337L1938
9989g39079n620l944r238K8709J7065J4722J4171j3851L5013N5569Q477k2249
9977f20255n0940J1890Q496J4341l4245j0646k6290o0809J5982L0416K8132K9480
9965f64448l142l0159k9369k3068K8889M6357J6370l9027m6754K9711J5931M3410
9953f55299N899n9007j11437m6273O1633K9094O728j0081n959L0845M4578n85
9941g09864l7901J8208N0591M2373l6506k1172N6374J534o3597k1970j7647l927
$$ plain form
9929 -743504 -712965 -677088 -654641 -614069 -639085 -619691 -610579 -649737 -715366 -751152 -741774 -712273
9917 -712273 -715853 -673204 -676411 -701634 -661170 -658389 -637096 -658295 -634090 -614896 -657381 -738579
9905 -738579 -741523 -724833 -745003 -784718 -760765 -744444 -678284 -658632 -614400 -584891 -612185 -676491
9893 -676491 -716917 -692201 -644219 -619747 -589751 -587325 -622421 -676787 -618821 -614730 -650021 -658098
9881 -658098 -649118 -636755 -626844 -629045 -619107 -641486 -594453 -543136 -571629 -582248 -542329 -519705
9869 -519705 -479233 -509787 -539284 -502051 -480977 -468346 -460929 -469073 -479053 -461217 -418870 -379002
9857 -379002 -361260 -325036 -330308 -317925 -284400 -290010 -285043 -243982 -123992 -22785 1490 -113701
9845 -113701 -356056 -697189 -953728 -1150211 -1192716 -1150571 -1097526 -1028316 -1014575 -1061995 -1046064
$$ packed form
9929g43504L0539L5877K2447M0572k5016J9394R112l9158o5629l5786R378K9501
9917g12273l580M2649l207k5223M0464K781K1293k1199K4205J9194m2485q1198
9905g38579k944J6690k0170l9715K3953J6321O6160J9652M4232K9509k7294o4306
9893f76491m0426K4716M7982K4472K9996K426l5096n4366N7966M091l5291q077
9881f58098Q980J2363R911k201R938k2379M7033N1317k8493j0619L9919K2624
9869e19705M0472l0554k9497L7233K1074J2631P417q144r980J7836M2347L9868
9857c79002J7742L6224n272J2383L3525n610M967M1061J19990J01207K4275j15191
9845a13701k42355l41133k56539j96483m2505M2145N3045O9210J3741m7420J5931
$$ plain form
9834 -1046064 -941032 -861565 -851724 -851140 -848183 -796983 -749765 -720007 -701675 -687625 -748566 -778374
9822 -778374 -805261 -769011 -747247 -755359 -794408 -834240 -803066 -795495 -723116 -743547 -760039 -753624
9810 -753624 -740024 -728741 -776348 -755175 -706204 -694063 -700703 -725051 -760481 -754263 -718685 -735558
9798 -735558 -717628 -665363 -660576 -697122 -670270 -644292 -621956 -622226 -645442 -665834 -703100 -680949
9786 -680949 -645845 -669458 -657886 -616346 -617921 -665670 -658585 -682216 -738187 -756437 -699123 -662144
9774 -662144 -643826 -658862 -614493 -565949 -571402 -598352 -618762 -579055 -614342 -682816 -648140 -585331
9762 -585331 -600399 -639901 -663822 -648423 -604954 -624870 -659274 -681894 -685327 -664409 -699325 -729185
9750 -729185 -715760 -726310 -670463 -642917 -688764 -687709 -693166 -672974 -691168 -706898 -720707 -724094
$$ packed form
9834a046064J05032P9467R841N84K957N1200M7218K9758J8332J4050o0941k9808
9822g78374k6887L6250K1764q112l9049l9832L1174P571P2379k0431j6492O415
9810g53624J3600J1283m7607K1173M8971J2141o640k4348l5430O218L5578j6873
9798g35558J7930N2265M787l6546K6852K5978K2336k70k3216k0392l7266K2151
9786f80949L5104k3613J1572M1540j575m7749P085k3631n5971j8250N7314L6979
9774f62144J8318j5036M4369M8544n453k6950k0410L9707l5287o8474L4676O2809
9762e85331j5068l9502k3921J5399M3469j9916l4404k2620l433K0918l4916k9860
9750g29185J3425j0550N5847K7546m5847J055n457K0192j8194j5730j3809l387
$$ plain form
9738 -724094 -682290 -610455 -560840 -575706 -589333 -641294 -685541 -631154 -584218 -607985 -644204 -660998
9726 -660998 -625207 -635533 -660222 -678390 -664747 -640419 -606549 -573723 -598808 -583306 -630857 -650237
9714 -650237 -638142 -587950 -543842 -566743 -564472 -540362 -547602 -538811 -526720 -600868 -652775 -669866
9702 -669866 -642970 -591193 -577673 -583901 -562492 -580837 -604412 -642560 -667629 -603249 -578212 -595390
9690 -595390 -598943 -596561 -583688 -560888 -566527 -574069 -563651 -566809 -596774 -547585 -504853 -537870 -540920
9677 -540920 -552979 -519439 -509355 -522356 -546024 -530683 -558203 -571336 -584718 -585624 -613734 -627777
9665 -627777 -605416 -585329 -571076 -527751 -511320 -508388 -524073 -530810 -539287 -542201 -554767 -566979
9653 -566979 -542648 -533426 -567780 -574811 -536280 -534417 -540991 -546598 -517747 -518435 -538889 -547695 -551121
$$ packed form
9738g24094M1804P1835M9615j4866j3627n1961m4247N4387M6936k3767l6219j6794
9726f60998L5791j0326k4689j8168J3643K4328L3870L2826k5085J5502m7551j9380
9714f50237J2095N0192M4108k2901K271K4110p240Q791J2091p4148n1907j7091
9702f69866K6896N1777J3520o228K1409j8345k3575l8148k5069O4380K5037j7178
9690e95390l553K382J2873K2800n639p542J0418l158k9965M9189M2732l3017l050
9677e40920j2059L3540J0084j3001k3668J5341k7520j3133j3382r06k8110j4043
9665f27777K2361K0087J4253M3325J6431K932j5685o737q477k914j2566j2212
9653e66979K4331R222l4354p031L8531J863o574n607K8851o88k0454q806l426
$$ plain form
9640 -551121 -554285 -546830 -514060 -484105 -443626 -450566 -475700 -515672 -558494 -565861 -508806 -491528
9628 -491528 -487360 -479099 -441310 -458142 -514724 -505287 -489656 -515647 -591250 -574964 -549702 -537785
9616 -537785 -574818 -601212 -610321 -627156 -628479 -574997 -564833 -548355 -533869 -487452 -471515 -526250
9604 -526250 -568276 -571495 -580655 -488007 -466113 -473485 -501440 -505977 -494836 -551739 -529278 -509282
9592 -509282 -480625 -492818 -502515 -456488 -415118 -385600 -425884 -454507 -438371 -447301 -438528 -435404
9580 -435404 -443307 -447749 -435709 -426408 -401218 -420930 -437453 -446862 -486613 -499279 -491856 -512626 -516853
9567 -516853 -512431 -519013 -547340 -568416 -564507 -538658 -514867 -501219 -491335 -459932 -455488 -429073 -398617
9554 -398617 -421359 -442635 -487516 -514512 -533616 -516551 -529674 -559823 -537428 -500806 -476308 -468468
$$ packed form
9640e51121l164P455L2770K9955M0479o940k5134l9972m2822p367N7055J7278
9628d91528M168Q261L7789j6832n6582R437J5631k5991p5603J6286K5262J1917
9616e37785l7033k6394r109j6835j323N3482J0164J6478J4486M6417J5937n4735
9604e26250m2026l219r160R2648K1894p372k7955m537J1141n6903K2461J9996
9592e09282K8657j2193r697M6027M1370K9518m0284k8623J6136q930Q773L124
9580d35404p903m442J2040R301K5190j9712j6523r409l9751j2666P423k0770m227
9567e16853M422o582k8327k1076L909K5849K3791J3648R884L1403M444K6415L0456
9554c98617k2742k1276m4881k6996j9104J7065j3123l0149K2395L6622K4498P840
$$ plain form
9542 -468468 -488663 -497907 -497964 -528893 -530002 -516599 -537222 -546612 -522567 -491286 -477321 -523255 -541155
9529 -541155 -501108 -453004 -399767 -385537 -420814 -438556 -426436 -374228 -384880 -418228 -434421 -463924
9517 -463924 -448934 -380506 -417430 -415884 -415045 -417660 -380134 -404361 -392447 -371426 -339298 -344237 -346632
9504 -346632 -356530 -343657 -304321 -284579 -320035 -342987 -320884 -339823 -398231 -391325 -358351 -345585
9492 -345585 -377878 -389434 -373862 -367637 -367750 -367032 -351390 -343891 -368553 -383325 -399772 -419899 -429176
9479 -429176 -390606 -396335 -439187 -434307 -366629 -330971 -367295 -383526 -382135 -321420 -294119 -319867
9467 -319867 -333661 -339809 -352898 -330725 -336080 -321177 -299980 -292724 -290990 -295907 -268951 -281972 -321961
9454 -321961 -282898 -266475 -297273 -286589 -286718 -263911 -263061 -225808 -230098 -258445 -276258 -266377 -241499
$$ packed form
9542d68468k0195r244n7l0929j109J3403k0623r390K4045L1281J3965m5934j7900
9529e41155M0047M8104N3237J4230l5277j7742J2120N2208j0652l3348j6193k9503
9517d63924J4990O8428l6924J546Q39k615L7526k4227J1914K1021L2128m939k395
9504c46632r898J2873L9336J9742l5456k2952K2103j8939n8408O906L2974J2766
9492c45585l2293j1556J5572O225j13P18J5642P499k4662j4772j6447k0127r277
9479d29176L8570n729m2852M880O7678L5658l6324j6231J391O0715K7301k5748
9467c19867j3794o148j3089K2173n355J4903K1197P256J734m917K6956j3021l9989
9454c21961L9063J6423l0798J0684j29K2807Q50L7253m290k8347j7813R881K4878
$$ plain form
9441 -241499 -215001 -180089 -179954 -232249 -289055 -299720 -268110 -266523 -220104 -184120 -162562 -185661
9429 -185661 -213677 -212939 -194764 -217489 -192514 -183646 -182480 -188832 -223912 -231135 -229549 -261046 -246306
9416 -246306 -272656 -279915 -226858 -217514 -204324 -182441 -207462 -221872 -249322 -242206 -213246 -188693
9404 -188693 -172366 -137597 -137266 -119444 -107525 -99860 -111286 -81559 -111210 -169279 -145229 -56400
9392 -56400 -16359 -34758 -53383 -12842 -7542 -32243 -42533 -56009 -85547 -45155 -17815 9649
9380 9649 36695 39589 36689 -9455 7787 73316 55459 824 12885 48816 11460 -16659
9368 -16659 4628 42459 43055 56638 67557 27244 14999 11354 19388 65728 76498 56302 94846
9355 94846 129052 131743 136535 153003 159482 167017 152696 186848 166786 180800 222375 241505 253476
$$ packed form
9441b41499K6498L4912J35n2295n6806j0665L1610J587M6419L5984K1558k3099
9429a85661k8016P38J8175k2725K4975Q868J166o352l5080p223J586l1497J4740
9416b46306k6350p259N3057R344J3190K1883k5021j4410k7450P116K8960K4553
9404a88693J6327L4769L31J7822J1919P665j1426K9727k9651n8069K4050Q8829
9392e6400M0041j8399j8625M0541N300k4701j0290j3476k9538M0392K7340K7464
9380I649K7046K894k900m6144J7242O5529j7857n4635J2061L5931l7356k8119
9368a6659K1287L7831N96J3583J0919m0313j2245l645Q034M6340J0770k0196L8544
9355I4846L4206K691M792J6468O479P535j4321L4152k0062J4014M1575J9130J1971
$$ plain form
9342 253476 247315 239817 297930 318240 330258 343033 336848 305278 326456 408064 413602 395297
9330 395297 422399 436798 420541 457105 505976 501014 468644 473348 443830 451907 468274 466566
9318 466566 442866 453246 535805 571859 593991 617495 663415 709453 713422 719175 713795 755339
9306 755339 774086 775427 849090 854720 813215 859728 878229 885949 888448 871936 821018 798680
9294 798680 800420 815691 841401 834538 816076 780248 739489 767386 766223 766944 709605 631280 644298
9281 644298 613786 571319 511769 436708 358234 248906 192079 135637 36783 -100225 -238606
9270 -238606 -371791 -486009 -619537 -711352 -817113 -946778 -1080192 -1248507 -1325714 -1411692
9260 -1411692 -1487611 -1547488 -1679226 -1782029 -1862872 -1921776 -1972315 -1955312 -1996654 -2115420 -2142273
$$ packed form
9342B53476o161p498N8113K0310J2018J2775o185l1570K1178Q1608N538j8305
9330C95297K7102J4399j6257L6564M8871m962l2370M704k9518Q077J6367j708
9318D66566k3700J0380Q2559L6054K2132K3504M5920M6038L969N753n380M1544
9306G55339J8747J341P3663N630m1505M6513J8501P720K499j6512n0918k2338
9294G98680J740J5271K5710o863j8462l5828m0759K7897j163P21n7339p8325J3018
9281F44298l0512m2467n9550p5061p8474j09328n6827n6442r8854j37008j38381
9270b38606j33185j14218j33528r1815j05761j29665j33414j68315p7207q5978
9260a411692p5919n9877j31738j02803q0843n8904n0539J7003m1342j18766k6853
$$ plain form
9249 -2142273 -2155349 -2195543 -2279167 -2262827 -2250194 -2246656 -2247901 -2215166 -2220085 -2273971 -2244719 -2229395
9237 -2229395 -2247230 -2285744 -2266703 -2196620 -2178959 -2185743 -2184805 -2145554 -2084181 -2067401 -2114581 -2069270
9225 -2069270 -2057391 -2046308 -2024754 -2019718 -2027284 -2024792 -2016248 -1999734 -1972021 -1977424 -1959730 -1899647
9213 -1899647 -1847094 -1805264 -1805297 -1761420 -1760215 -1766618 -1775812 -1774086 -1763505 -1740368 -1767402 -1708343 -1715766
9200 -1715766 -1714129 -1716173 -1696485 -1671855 -1679048 -1705719 -1716918 -1680129 -1603859 -1550957 -1526570 -1547859
9188 -1547859 -1587446 -1644681 -1603398 -1578303 -1638559 -1647509 -1615875 -1604159 -1494303 -1509571 -1573317
9177 -1573317 -1518378 -1468448 -1485497 -1460153 -1390382 -1386892 -1394845 -1392510 -1366840 -1353742 -1365952 -1350637
9165 -1350637 -1352589 -1317660 -1304099 -1318263 -1353575 -1328387 -1296249 -1323462 -1334977 -1412766 -1443479 -1413630
$$ packed form
9249b142273j3076m0194q3624J6340J2633L538j245L2735m919n3886K9252J5324
9237b229395j7835l8514J9041P0083J7661o784R38L9251O1373J6780m7180M5311
9225b069270J1879J1083K1554N036p566K492Q544J6514K7713n403J7694O0083
9213a899647N2553M1830l3M3877J205o403r194J726J0581K3137k7034N9059p423
9200a715766J637k044J9688K4630p193k6671j1199L6789P6270N2902K4387k1289
9188a547859l9587n7235M1283K5095o0256q950L1634J1716J09856j5268o3746
9177a573317N4939M9930j7049K5344O9771L490p953K335K5670J3098j2210J5315
9165a350637j952L4929J3561j4164l5312K5188L2138k7213j1515p7789l0713K9849
$$ plain form
9153 -1413630 -1363297 -1343352 -1353129 -1351745 -1365020 -1375903 -1346364 -1338115 -1306558 -1270408 -1283578 -1257547
9141 -1257547 -1269884 -1284904 -1255979 -1202065 -1192908 -1172523 -1141239 -1144686 -1155969 -1181087 -1224020 -1178993
9129 -1178993 -1165436 -1157760 -1187431 -1201922 -1197319 -1145513 -1143289 -1202459 -1198494 -1112194 -1067261 -1073449
9117 -1073449 -1078737 -1058553 -1069694 -1076818 -1120981 -1186737 -1173165 -1102019 -1091358 -1087944 -1126472 -1154122
9105 -1154122 -1126551 -1070501 -1086802 -1071599 -1125228 -1134607 -1157895 -1113528 -1038043 -1034364 -1080562 -1106451
9093 -1106451 -1078283 -1041553 -1014614 -1011777 -1031971 -1064341 -1117509 -1137899 -1127248 -1109362 -1080861 -1031927
9081 -1031927 -1008572 -1011874 -975431 -972987 -974323 -993032 -1005047 -1070141 -1091726 -1066595 -1041748 -1061686
9069 -1061686 -1088948 -1070379 -1038589 -1026362 -1007605 -1039892 -1008972 -949462 -938244 -944281 -972170 -1058810
$$ packed form
9153a413630N0333J9945r777J384j3275j0883K9539Q249L1557L6150j3170K6031
9141a257547j2337j5020K8925N3914R157K0385L1284l447j1283k5118m2933M5027
9129a178993J3557P676k9671j4491M603N1806K224n9170L965Q6300M4933o188
9117a073449n288K0184j1141p124m4163o5756J3572P1146J0661L414l8528k7650
9105a154122K7571N6050j6301J5203n3629r379k3288M4367P5485L679m6198k5889
9093a106451K8168L6730K6939K837k0194l2370n3168k0390J0651J7886K8501M8934
9081a031927K3355l302L6443K444j336j8709j2015o5094k1585K5131K4847j9938
9069a061686k7262J8569L1790J2227J8757l2287L0920N9510J1218o037k7889q6640
$$ plain form
9057 -1058810 -1068841 -1078877 -1038907 -993556 -930363 -907293 -939582 -925998 -950843 -947613 -959562 -959021
9045 -959021 -983151 -972700 -956065 -955955 -988538 -999230 -1006066 -987872 -983008 -972474 -924207 -912698
9033 -912698 -916594 -923591 -960360 -969439 -944246 -928054 -930630 -911314 -887708 -877465 -887934 -882332 -896094
9020 -896094 -959600 -965157 -939984 -967771 -991545 -951231 -939685 -878690 -857053 -856802 -890193 -890659 -907382
9007 -907382 -904652 -892928 -946190 -967189 -922659 -915277 -919976 -891088 -927579 -938219 -934771 -935161 -913358
8994 -913358 -882932 -860973 -892058 -907741 -877517 -821702 -846003 -905181 -893782 -847555 -830450 -860987
8982 -860987 -876702 -833863 -814015 -798257 -789353 -828909 -866443 -923538 -1006394 -986901 -981559 -993468
8970 -993468 -1007331 -1002032 -939916 -864237 -889152 -929065 -965011 -942201 -891856 -856885 -852509 -861140
$$ packed form
9057a058810j0031j0036L9970M5351O3193K3070l2289J3584k4845L230j1949N41
9045i59021k4130J0451J6635J10l2583j0692o836J8194M864J0534M8267J1509
9033i12698l896o997l6769r079K5193J6192k576J9316K3606J0243j0469N602j3762
9020h96094o3506n557K5173k7787k3774M0314J1546O0995K1637K51l3391m66j6723
9007i07382K730J1724n3262k0999M4530P382m699K8888l6491j0640L448l90K1803
8994i13358L0426K1959l1085j5683L0224N5815k4301n9178J1399M6227J7105l0537
8982h60987j5715M2839J9848J5758Q904l9556l7534n7095q2856J9493N342j1909
8970i93468j3863N299O2116P5679k4915l9913l5946K2810N0345L4971M376q631
$$ plain form
8958 -861140 -871750 -847290 -834339 -896356 -903158 -927907 -916860 -890312 -934900 -940340 -896254 -864751
8946 -864751 -852951 -837315 -830154 -831749 -789297 -778853 -758148 -752872 -816973 -885447 -873942 -839826
8934 -839826 -867136 -875395 -864659 -774877 -777540 -865213 -929140 -956127 -956912 -941882 -917795 -891993
8922 -891993 -855309 -864486 -863723 -876657 -895444 -864825 -859645 -823571 -769253 -791336 -803503 -785388
8910 -785388 -794314 -764104 -799031 -851475 -884654 -891025 -882066 -835823 -831427 -851252 -829582 -821727 -831220
8897 -831220 -887464 -876408 -830767 -781340 -763361 -760678 -777528 -822147 -834355 -799563 -769540 -824120
8885 -824120 -798365 -754556 -799230 -830544 -876953 -860817 -854399 -881583 -874306 -853651 -841520 -786689
8873 -786689 -712056 -720569 -776503 -796687 -782636 -819679 -794844 -803667 -805599 -804821 -824968 -818072 -812787
$$ packed form
8958h61140j0610K4460J2951o2017o802k4749J1047K6548m4588n440M4086L1503
8946h64751J1800J5636P161j595M2452J0444K0705N276o4101o8474J1505L4116
8934h39826k7310q259J0736Q9782k663q7673o3927k6987p85J5030K4087K5802
8922h91993L6684r177P63j2934j8787L0619N180L6074N4318k2083j2167J8115
8910g85388q926L0210l4927n2444l3179o371Q959M6243M396j9825K1670P855r493
8897h31220n6244J1056M5641M9427J7979K683j6850m4619j2208L4792L0023n4580
8885h24120K5755M3809m4674l1314m6409J6136O418k7184P277K0655J2131N4831
8873g86689P4633q513n5934k0184J4051l7043K4835q823j932P78k0147O896N285
$$ plain form
8860 -812787 -759767 -726227 -789117 -821554 -790257 -814172 -856052 -825057 -769210 -739668 -755457 -741870
8848 -741870 -717330 -754399 -806259 -796204 -767170 -767785 -799536 -808294 -789349 -736150 -748287 -795407
8836 -795407 -785782 -788888 -784870 -760158 -753407 -728516 -654637 -651498 -675586 -683004 -718538 -756900 -762412
8823 -762412 -771514 -791507 -808758 -740803 -688290 -673646 -661352 -691969 -741477 -773742 -718165 -676815
8811 -676815 -677664 -643574 -678438 -690395 -704533 -750502 -752467 -763928 -769256 -739339 -715737 -731286
8799 -731286 -751142 -743342 -756582 -752991 -790922 -866019 -875475 -840225 -829295 -826108 -774999 -780517 -755504
8786 -755504 -698737 -686712 -709665 -743161 -742051 -774053 -742737 -725893 -714000 -681057 -762612 -803059
8774 -803059 -777615 -736269 -721211 -763667 -734080 -685292 -673675 -664432 -684982 -689303 -773500 -794847
$$ packed form
8860h12787N3020L3540o2890l2437L1297k3915m1880L0995N5847K9542j5789J3587
8848g41870K4540l7069n1860J0055K9034o15l1751q758J8945N3199j2137m7120
8836g95407R625l106M018K4712O751K4891P3879L139k4088p418l5534l8362n512
8823g62412r102j9993j7251O7955N2513J4644J2294l0617m9508l2265N5577M1350
8811f76815q49L4090l4864j1957j4138m5969j965j1461n328K9917K3602j5549
8799g31286j9856P800j3240L591l7931p5097r456L5250J0930L187N1109n518K5013
8786g55504N6767J2025k2953l3496J110l2002L1316J6844J1893L2943q1555m0447
8774h03059K5444M1346J5058m2456K9587M8788J1617R243k0550m321q4197k1347
$$ plain form
8762 -794847 -718544 -694731 -693787 -684670 -660125 -678993 -732792 -725547 -703629 -718985 -730399 -723824 -737694
8749 -737694 -704756 -693124 -700700 -688294 -699200 -753090 -783938 -772966 -714744 -717305 -718044 -736988
8737 -736988 -736354 -763859 -783205 -757177 -741254 -755809 -729016 -685826 -682763 -773453 -760750 -731635
8725 -731635 -710885 -692438 -696956 -722260 -709669 -742884 -706164 -670520 -669961 -675641 -689948 -684977 -709957
8712 -709957 -671958 -637764 -608944 -667554 -698557 -646339 -662462 -650459 -641523 -597218 -619408 -695918
8700 -695918 -727851 -743260 -721918 -720052 -674200 -658740 -654235 -667196 -652731 -650677 -643793 -675056
8688 -675056 -692949 -710950 -680041 -698501 -734762 -752480 -770724 -695561 -663428 -705607 -704588 -655107
8676 -655107 -626261 -644465 -659396 -621608 -586818 -597470 -583382 -596492 -584174 -612411 -605678 -610289
$$ packed form
8762g94847P6303K3813R44R117K4545j8868n3799P245K1918j5356j1414O575j3870
8749g37694L2938J1632p576J2406j0906n3890l0848J0972N8222k561p39j8944
8737g36988O34k7505j9346K6028J5923j4555K6793M3190L063r0690J2703K9115
8725g31635K0750J8447m518k5304J2591l3215L6720L5644N59n680j4307M971k4980
8712g09957L7999L4194K8820n8610l1003N2218j6123J2003Q936M4305k2190p6510
8700f95918l1933j5409K1342J866M5852J5460M505j2961J4465K054O884l1263
8688f75056j7893j8001L0909j8460l6261j7718j8244P5163L2133m2179J019M9481
8676f55107K8846j8204j4931L7788L4790j0652J4088j3110J2318k8237O733m611
$$ plain form
8664 -610289 -604175 -576766 -560175 -565390 -564747 -572309 -549119 -560263 -580304 -560597 -547872 -535024 -515550
8651 -515550 -523445 -504565 -520480 -504545 -470439 -442969 -524843 -634527 -694125 -700160 -665703 -640995
8639 -640995 -706451 -716831 -763083 -760360 -724614 -693272 -701719 -696289 -664809 -613309 -632513 -635662
8627 -635662 -611059 -592033 -526718 -514483 -541286 -499955 -503168 -510251 -507152 -530508 -483881 -440377
8615 -440377 -469251 -485622 -482588 -476929 -442509 -393540 -326311 -305281 -355017 -368674 -298411 -253333
8603 -253333 -241586 -252468 -263255 -341998 -531291 -712162 -773363 -777822 -839806 -893698 -921888
8592 -921888 -961724 -1030253 -1094635 -1151499 -1221914 -1273640 -1308270 -1314951 -1271561 -1230245 -1184359 -1172343
8580 -1172343 -1176246 -1132126 -1067432 -1071464 -1054045 -1079266 -1135139 -1121445 -1042897 -984656 -943148 -921031
$$ packed form
8664f10289O114K7409J6591n215O43p562K3190j1144k0041J9707J2725J2848J9474
8651e15550p895J8880j5915J5935L4106K7470q1874j09684n9598o035L4457K4708
8639f40995o5456j0380m6252K723L5746L1342q447N430L1480N1500j9204l149
8627f35662K4603J9026O5315J2235k6803M1331l213p083L099k3356M6627M3504
8615d40377k8874j6371L034N659L4420M8969O7229K1030m9736j3657P0263M5078
8603b53333J1747j0882j0787p8743j89293j80871o1201m459o1984n3892k8190
8592i21888l9836o8529o4382n6864p0415n1726l4630o681M3390M1316M5886J2016
8580a172343l903M4120O4694m032J7419k5221n5873J3694P8548N8241M1508K2117
$$ plain form
8568 -921031 -927625 -926553 -900336 -858567 -837502 -837606 -821106 -816968 -830744 -857370 -893216 -883104 -847615
8555 -847615 -863887 -958847 -1036232 -1041429 -1058041 -1066291 -1070662 -987335 -988366 -976751 -969500 -1011494 -1003056
8542 -1003056 -999604 -987032 -921530 -899486 -873732 -904201 -924334 -888944 -869276 -893351 -911410 -964263
8530 -964263 -971543 -982234 -1012584 -996147 -962177 -900069 -872710 -905306 -892624 -846977 -864733 -856733
8518 -856733 -815436 -824609 -839067 -822407 -866032 -889763 -884544 -815193 -823707 -842000 -820832 -847958
8506 -847958 -890080 -906543 -907355 -915858 -902602 -888940 -858203 -831274 -808713 -774261 -757226 -757445 -776436
8493 -776436 -800223 -827321 -841519 -808628 -809617 -780162 -805060 -827038 -839096 -836744 -847092 -890228
8481 -890228 -860469 -864724 -825688 -831512 -849108 -874251 -838726 -786550 -787794 -787854 -845311 -865078 -818369
$$ packed form
8568i21031o594J072K6217M1769K1065j04J6500M138j3776k6626l5846J0112L5489
8555h47615j6272r4960p7385n197j6612q250m371Q3327j031J1615P251m1994Q438
8542a003056L452J2572O5502K2044K5754l0469k0133L5390J9668k4075j8059n2853
8530i64263p280j0691l0350J6437L3970O2108K7359l2596J2682M5647j7756Q000
8518h56733M1297r173j4458J6660m3625k3731N219O9351q514j8293K1168k7126
8506h47958m2122j6463q12q503J3256J3662L0737K6929K2561L4452J7035k19j8991
8493g76436k3787k7098j4198L2891r89K9455k4898k1978j2058K352j0348m3136
8481h90228K9759m255L9036n824j7596k5143L5525N2176j244o0n7457j9767M6709
$$ plain form
8468 -818369 -788240 -821893 -868153 -871300 -869012 -853128 -846925 -795579 -773088 -763207 -814029 -769522
8456 -769522 -740684 -725935 -799492 -851657 -866565 -821052 -744164 -715779 -735475 -747089 -777621 -803922
8444 -803922 -788149 -779156 -780376 -766595 -787149 -741171 -725301 -697330 -685983 -694522 -762290 -794268
8432 -794268 -802134 -834590 -866710 -852390 -827692 -816450 -792867 -837759 -811912 -776393 -795874 -751281
8420 -751281 -772863 -788007 -764840 -723628 -724678 -749401 -764358 -741177 -753481 -757791 -707025 -705631
8408 -705631 -660492 -664812 -704517 -758237 -786631 -770543 -760051 -736128 -711023 -733568 -753579 -744702
8396 -744702 -746965 -780175 -754399 -698295 -719001 -762664 -784867 -784650 -740797 -732589 -722912 -743423 -729170
8383 -729170 -750335 -723615 -720700 -740638 -758735 -758898 -736376 -726331 -791900 -793486 -773663 -769946 -751349
$$ packed form
8468h18369L0129l3653m6260l147K288J5884O203N1346K2491R881n0822M4507
8456g69522K8838J4749p3557n2165j4908M5513P6888K8385j9696j1614l0532k6301
8444h03922J5773Q993j220J3781k0554M5978J5870K7971J1347q539o7768l1978
8432g94268p866l2456l2120J4320K4698J1242K3583m4892K5847L5519j9481M4593
8420g51281k1582j5144K3167M1212j050k4723j4957K3181j2304m310N0766J394
8408g05631M5139m320l9705n3720k8394J6088J0492K3923K5105k2545k0011Q877
8396g44702k263l3210K5776N6104k0706m3663k2203K17M3853Q208R677k0511J4253
8383g29170k1165K6720K915j9938j8097j63K2522J0045o5569j586J9823L717J8597
$$ plain form
8370 -751349 -738033 -746383 -708402 -682133 -722090 -786423 -751591 -703026 -701630 -727312 -746889 -752878
8358 -752878 -752555 -766725 -751609 -763143 -781152 -756230 -760056 -813185 -819875 -813866 -812820 -801372 -787907
8345 -787907 -773792 -708772 -707590 -698659 -682146 -686672 -712579 -734245 -743715 -718353 -696378 -702748 -733635
8332 -733635 -780637 -807215 -815929 -761612 -673540 -651121 -671182 -672075 -666173 -654000 -650419 -652475 -666146
8319 -666146 -675774 -670255 -688848 -746952 -781666 -764437 -728139 -729624 -732174 -728150 -748967 -730365 -697782
8306 -697782 -703305 -715750 -727361 -749730 -765730 -763963 -731994 -733336 -719511 -721065 -732963 -729595 -747354
8293 -747354 -715039 -702394 -700549 -628598 -640839 -701245 -702206 -695765 -747333 -764577 -762736 -724488 -728538
8280 -728538 -735273 -759229 -764248 -699433 -657783 -649811 -642480 -651304 -708718 -714208 -730892 -748859 -748839
$$ packed form
8370g51349J3316q350L7981K6269l9957o4333L4832M8565J396k5682j9577n989
8358g52878L23j4170J5116j1534j8009K4922l826n3129o690O009J046J1448J3465
8345g87907J4115O5020J182Q931J6513m526k5907k1666r470K5362K1975o370l0887
8332g33635m7002k6578q714N4317Q8072K2419k0061q93N902J2173L581k056j3671
8319f66146r628N519j8593n8104l4714J7229L6298j485k550M024k0817J8602L2583
8306f97782n523j2445j1611k2369j6000J767L1969j342J3825j554j1898L368j7759
8293g47354L2315J2645J845P1951j2241o0406r61O441n1568j7244J841L8248m050
8280g28538o735k3956n019O4815M1650P972P331q824n7414n490j6684j7967K0
$$ plain form
8267 -748839 -730495 -678256 -681965 -687443 -714784 -748388 -713220 -654793 -654744 -710454 -728701 -697517 -677125
8254 -677125 -664583 -651917 -629983 -619758 -680445 -724386 -765197 -757461 -749656 -734297 -711676 -702469
8242 -702469 -697999 -688214 -657879 -594092 -614559 -633612 -674737 -747394 -817899 -749361 -701031 -728080
8230 -728080 -727224 -684684 -654072 -670763 -695797 -710304 -636102 -596111 -626937 -643311 -687061 -660030
8218 -660030 -677861 -733971 -724844 -661240 -595218 -611134 -651919 -683713 -720716 -696221 -660835 -637188
8206 -637188 -667362 -643559 -651978 -634331 -657493 -657024 -656251 -646893 -677510 -681615 -681753 -674480 -714468 -712882
8192 -712882 -681171 -665412 -682332 -714559 -692970 -683209 -655825 -642449 -643298 -668994 -647346 -611307
8180 -611307 -655096 -668534 -626575 -602438 -645143 -708131 -732308 -709364 -678418 -638943 -597822 -616124
$$ packed form
8267g48839J8344N2239l709n478k7341l3604L5168N8427M9n5710j8247L1184K0392
8254f77125J2542J2666K1934J0225o0687m3941m0811P736P805J5359K2621R207
8242g02469M470R785L0335O3787k0467j9053m1125p2657p0505O8538M8330k7049
8230g28080Q56M2540L0612j6691k5034j4507P4202L9991l0826j6374m3750K7031
8218f60030j7831n6110R127O3604O6022j5916m0785l1794l7003K4495L5386K3647
8206f37188l0174K3803q419J7647k3162M69P73R358l0617m105j38P273l9988J586
8192g12882L1711J5759j6920l2227K1589R761K7384J3376q49k5696K1648L6039
8180f11307m3789j3438M1959K4137m2705o2988k4177K2944L0946L9475M1121j8302
$$ plain form
8168 -616124 -620467 -669291 -711709 -666607 -569035 -555060 -588109 -621411 -631483 -644826 -657221 -633168
$$ packed form
8168f16124m343m8824m2418M5102R7572J3975l3049l3302j0072j3343j2395K4053
$$ [...]
##END NTUPLES=NMR SPECTRUM
##END=
