##TITLE=Analysis number 308012
Compound Code cc 04103
Book Reference 408/176/1
Project Code adrs
Chemist Name laurenf
##JCAMPDX= 6.0         $$ Bruker NMR JCAMP-DX V2.0
##DATA TYPE= NMR SPECTRUM
##DATA CLASS= NTUPLES
##ORIGIN= Bruker BioSpin GmbH
##OWNER= NMR
$$ XWIN-NMR		Version 3.5
$$ Thu May 19 08:55:25 2005 GMT Daylight Time (UT+1h)  MAYBRIDGE\NMR@NMR_250MHZ
##.OBSERVE FREQUENCY= 250.131544655141
##.OBSERVE NUCLEUS= ^1H
##.ACQUISITION MODE= SIMULTANEOUS (DQD)
##.ACQUISITION SCHEME= undefined
##.AVERAGES= 16
##.DIGITISER RES= 18
##SPECTROMETER/DATA SYSTEM= dpx250
##.PULSE SEQUENCE= zg30
##.SOLVENT NAME= DMSO
##.SHIFT REFERENCE= (INTERNAL, DMSO, 0, 16.522)
##AUDIT TRAIL= $$ (NUMBER, WHEN, WHO, WHERE, WHAT)
$$ ##TITLE= Audit trail, XWIN-NMR		Version 3.5
$$ ##JCAMPDX= 5.01
$$ ##ORIGIN= Bruker BioSpin GmbH
$$ ##OWNER= NMR
$$ C:\u/data/dgb/nmr/ADRS/3150/pdata/1/auditp.txt
$$ ##AUDIT TRAIL=  $$ (NUMBER, WHEN, WHO, WHERE, WHAT)
(   1,<2005-05-19 08:55:07.09 +100>,<MAYBRIDGE\NMR>,<NMR_250MHZ>,
      <created by zg, POWCHK disabled, PULCHK disabled
       configuration hash MD5:
       62 19 C7 07 E1 42 D1 B7 37 6C 3D D0 77 39 F9 E6
       data hash MD5: 64K
       C7 10 74 EA 94 F0 55 A5 14 5F C1 50 1C B0 FE 60>)
(   2,<2005-05-19 08:55:17.84 +100>,<MAYBRIDGE\NMR>,<NMR_250MHZ>,
      <Start of raw data processing
       ef LB = 0.3 FT_mod = 6 PKNL = 1 SI = 32K 
       data hash MD5: 32K
       77 56 2E A2 E7 3E 7A 7E DA D3 83 06 80 15 B0 63>)
(   3,<2005-05-19 08:55:19.99 +100>,<MAYBRIDGE\NMR>,<NMR_250MHZ>,
      <apk 
       data hash MD5: 32K
       F9 76 1D 35 29 CD 2E DD C7 B3 A1 9F 17 F0 41 1A>)
(   4,<2005-05-19 08:55:20.99 +100>,<MAYBRIDGE\NMR>,<NMR_250MHZ>,
      <abs ABSG = 5 
       data hash MD5: 32K
       51 01 05 9C 84 B5 70 91 13 59 7D F2 4F D5 0C DC>)
$$ ##END=
$$ 
$$ hash MD5
$$ 4F E4 D6 46 75 5C 0A EE 29 88 33 E2 E5 0B 05 D3
##$RELAX= 
##$RELAX= 
##$RELAX= 
##$RELAX= 
##$RELAX= 
##$RELAX= 
##$RELAX= 
$$ Bruker specific parameters
$$ --------------------------
##$DU= <C:\u>
##$EXPNO= 3150
##$NAME= <ADRS>
##$PROCNO= 1
##$TYPE= <nmr>
##$USER= <dgb>
##$AMP= (0..31)
100 100 100 100 100 100 100 100 100 100 100 100 100 100 100 100 100 100 
100 100 100 100 100 100 100 100 100 100 100 100 100 100 
##$AQSEQ= 0
##$AQ_mod= 3
##$AUNM= <au_zg>
##$AUTOPOS= <10 >
##$BF1= 250.13
##$BF2= 250.13
##$BF3= 250.13
##$BF4= 250.13
##$BF5= 500.13
##$BF6= 500.13
##$BF7= 500.13
##$BF8= 500.13
##$BYTORDA= 1
##$CFDGTYP= 0
##$CFRGTYP= 5
##$CHEMSTR= <none>
##$CNST= (0..31)
1 1 145 1 1 1 1 1 1 1 1 1 1 1 1 1 1 1 1 1 1 1 1 1 1 1 1 1 1 1 1 1 
##$CPDPRG= <>
##$CPDPRG1= <>
##$CPDPRG2= <>
##$CPDPRG3= <>
##$CPDPRG4= <mlev>
##$CPDPRG5= <mlev>
##$CPDPRG6= <mlev>
##$CPDPRG7= <mlev>
##$CPDPRG8= <mlev>
##$CPDPRGB= <>
##$CPDPRGT= <>
##$D= (0..31)
0 1 0 0 0 0 0 0 0 0.06 0 0 0 0 0 0 0.0002 0 0 0 0 0 0 0 0 0 0 0 0 0 0 
0 
##$DATE= 1116489306
##$DBL= (0..7)
120 120 120 120 120 120 120 120 
##$DBP= (0..7)
150 150 150 150 150 150 150 150 
##$DBP07= 0
##$DBPNAM0= <>
##$DBPNAM1= <>
$$ [...]
##$SUBNAM7= <"">
##$SUBNAM8= <"">
##$SUBNAM9= <"">
##$SW= 20.6930455092707
##$SWIBOX= (0..15)
0 0 3 0 0 0 0 0 0 0 0 0 0 0 0 0 
##$SW_h= 5175.983436853
##$TD= 65536
##$TD0= 1
##$TE= 295.16
##$TE2= 300
##$TE3= 300
##$TEG= 300
##$TL= (0..7)
0 120 120 120 120 120 120 120 
##$TP= (0..7)
150 150 150 150 150 150 150 150 
##$TP07= 0
##$TPNAME0= <>
##$TPNAME1= <>
##$TPNAME2= <>
##$TPNAME3= <>
##$TPNAME4= <>
##$TPNAME5= <>
##$TPNAME6= <>
##$TPNAME7= <>
##$TPOAL= (0..7)
0.5 0.5 0.5 0.5 0.5 0.5 0.5 0.5 
##$TPOFFS= (0..7)
0 0 0 0 0 0 0 0 
##$TUNHIN= 0
##$TUNHOUT= 0
##$TUNXOUT= 0
##$USERA1= <user>
##$USERA2= <user>
##$USERA3= <user>
##$USERA4= <user>
##$USERA5= <user>
##$V9= 5
##$VALIST= <valist>
##$VCLIST= <CCCCCCCCCCCCCCC>
##$VD= 0
##$VDLIST= <DDDDDDDDDDDDDDD>
##$VPLIST= <PPPPPPPPPPPPPPP>
##$VTLIST= <TTTTTTTTTTTTTTT>
##$WBST= 1024
##$WBSW= 4
##$XGAIN= (0..3)
0 0 0 0 
##$XL= 0
##$YL= 0
##$YMAX_a= 338071
##$YMIN_a= -357108
##$ZGOPTNS= <>
##$ZL1= 120
##$ZL2= 120
##$ZL3= 120
##$ZL4= 120
##$ABSF1= 16.522
##$ABSF2= -4.171173
##$ABSG= 5
##$ABSL= 3
##$ALPHA= 0
##$AQORDER= 0
##$ASSFAC= 0
##$ASSFACI= 0
##$ASSFACX= 0
##$ASSWID= 0
##$AUNMP= <proc_1d>
##$AZFE= 0.1
##$AZFW= 0.1
##$BCFW= 0
##$BC_mod= 0
##$BYTORDP= 0
##$COROFFS= 0
##$CY= 12.5
##$DATMOD= 1
##$DC= 0
##$DFILT= <>
##$DTYPP= 0
##$F1P= 14.0000005364418
##$F2P= -0.99999901652339
##$FCOR= 0.5
##$FTSIZE= 32768
##$FT_mod= 6
##$GAMMA= 0
##$GB= 0
##$INTBC= 1
##$INTSCL= 1
##$ISEN= 128
##$LB= 0.3
##$LEV0= 0
##$LPBIN= 0
##$MAXI= 10000
##$MC2= 0
##$MEAN= 0
##$ME_mod= 0
##$MI= 0
##$NCOEF= 0
##$NC_proc= -5
##$NLEV= 6
##$NOISF1= 0
##$NOISF2= 0
##$NSP= 0
##$NTH_PI= 0
##$NZP= 0
##$OFFSET= 16.522
##$PC= 1
##$PHC0= -82.07333
##$PHC1= 9.873749
##$PH_mod= 1
##$PKNL= yes
##$PPARMOD= 0
##$PSCAL= 4
##$PSIGN= 0
##$REVERSE= no
##$SF= 250.13
##$SI= 32768
##$SIGF1= 0
##$SIGF2= 0
##$SINO= 400
##$SIOLD= 32768
##$SREGLST= <1H.DMSO>
##$SSB= 0
##$STSI= 32768
##$STSR= 0
##$SW_p= 5175.98343685301
##$SYMM= 0
##$S_DEV= 0
##$TDeff= 65536
##$TDoff= 0
##$TI= <Analysis number 999999
Compound Code 99
Book Reference 9
Project Code 9>
##$TILT= no
##$TM1= 0
##$TM2= 0
##$TOPLEV= 0
##$USERP1= <user>
##$USERP2= <user>
##$USERP3= <user>
##$USERP4= <user>
##$USERP5= <user>
##$WDW= 1
##$XDIM= 32768
##$YMAX_p= 316992646
##$YMIN_p= -1818653
$$ End of Bruker specific parameters
$$ ---------------------------------
##NTUPLES= NMR SPECTRUM
##VAR_NAME=  FREQUENCY,     SPECTRUM/REAL,   SPECTRUM/IMAG
##SYMBOL=    X,             R,               I
##VAR_TYPE=  INDEPENDENT,   DEPENDENT,       DEPENDENT
##VAR_FORM=  AFFN,          ASDF,            ASDF
##VAR_DIM=   32768,         32768,           32768
##UNITS=     HZ,            ARBITRARY UNITS, ARBITRARY UNITS
##FACTOR=    0.157963299565203, 1,           1
##FIRST=     4132.6476996994, 0,             0
##LAST=      -1043.33573715361, 0,           0
##MIN=       -1043.33573715361, -1818653,    0
##MAX=       4132.6476996994, 316992646,     0
$$ Real data points
##PAGE= N=1
##DATA TABLE= (X++(R..R)), XYDATA
$$ [...]
26095A11463J08534n4973j81057j40818o0011J53172n4276L5805J39315M0486
$$ 111463 219997 165024 -16033 -156851 -216862 -63690 -117966 -82161 57154 97640
26085I7640r947J89027O6906J0563p1982j48183P588j61024j89807k7632o9819
$$ 97640 87693 276720 343626 354189 282207 134024 141612 -19412 -209219 -236851 -306670
26074c06670o707N5059M9067J28907N0554k1646J10738J6888J07603L4505j52819
$$ -306670 -313377 -258318 -209251 -80344 -29790 -51436 59302 76190 183793 218298 65479
26063F5479l6451R044J94637p2605r5383k0444n0451r1416p2044O1245l2852k13408
$$ 65479 29028 38072 232709 160104 64721 44277 -6174 -97590 -169634 -108389 -141241 -354649
26051c54649Q6083K10342Q6953r6168R2242J21863K0751q6295j41063O762N1875
$$ -354649 -268566 -58224 28729 -67439 24803 146666 167417 81122 -59941 -53179 -1304
26040a304r9354o5267K08388K5774q0397m7886K9222k5976M8073j89094o1244
$$ -1304 -100658 -165925 42463 68237 -12160 -60046 -30824 -56800 -8727 -197821 -259065
26029b59065K9870o7116j5094n5737j33119L2184J31938J34220M2142r7102R1960
$$ -259065 -229195 -296311 -311405 -367142 -500261 -468077 -336139 -201919 -159777 -256879 -164919
26018a64919J19311q3365l9226O5570J57096J88667l9708j57118J35789j04866
$$ -164919 -45608 -128973 -168199 -102629 54467 243134 203426 46308 182097 77231
26008G7231k20711q1164P7738j34795M2767M3382J8020j01288K2394J04196O9371
$$ 77231 -143480 -224644 -146906 -281701 -238934 -195552 -177532 -278820 -256426 -152230 -82859
25997h2859J307j5680n6634j57605r5066l7823J36958J8167k173o886M9102o0397
$$ -82859 -81552 -97232 -153866 -311471 -406537 -444360 -307402 -289235 -291408 -298294 -249192 -309589
25985c09589q535O9129J10792K23025j35144l8472j29154o5887J93647K45347
$$ -309589 -318124 -248995 -138203 84822 -50322 -88794 -217948 -283835 -90188 155159
25975A55159K7794p7030j05893j21850R780O1212o245n491o6879J7948J67157
$$ 155159 182953 105923 30 -121820 -112040 -50828 -57073 -62564 -129443 -111495 55662
25964E5662l4742j51567o8156R3393M1315j3606Q9033J40167q343p8727n543L5389
$$ 55662 20920 -130647 -198803 -105410 -64095 -77701 11332 151499 143156 64429 58886 94275
25952I4275n6577J20309L755o8851j49270Q0914J2204M3116R7793N1678P8381
$$ 94275 37698 158007 161762 92911 -56359 24555 36759 79875 177668 229346 307727
25941C07727q6970j72354n0934K5128N9657n0790k4818j07619r6972p1285J47455
$$ 307727 220757 48403 -2531 22597 82254 31464 6646 -100973 -197945 -269230 -121775
25930a21775J35763K1174l9865k10348j76464J12717K52826R2008j56314q1523
$$ -121775 13988 35162 -4703 -215051 -391515 -278798 -25972 66036 -90278 -171801
25920a71801K26249O2821j80775p3686M6277R4229N0387o2892n342j9854q80K5980
$$ -171801 54448 117269 -63506 -137192 -90915 3314 53701 -9191 -14533 -34387 -35267 -9287
25908i287N5681o3621j01519j21595o5040N1270K58363N9302n55L2405n9653q6531
$$ -9287 46394 -17227 -118746 -240341 -305381 -254111 4252 63554 62999 95404 35751 -50780
25896e0780l7896P6848J21748p3448K0376k07807o1657J34063P3405j46614j60409
$$ -50780 -88676 -11828 109920 36472 56848 -150959 -212616 -78553 -5148 -151762 -312171
25885c12171K11477K47231O4198P5053J5172L811l4413j82792k40442k6599O0935
$$ -312171 -100694 146537 210735 285788 300960 304771 270358 87566 -152876 -179475 -118540
25874a18540J12170N5708M1583K7407q736L7623n3165j71993j67286r3357P5243
$$ -118540 -6370 49338 90921 118328 109592 147215 94050 -77943 -245229 -338586 -263343
25863b63343J49122J00388j73948p4020Q7328Q5220l6742n4054n6664J6517J02432
$$ -263343 -114221 -13833 -187781 -261801 -174473 -89253 -125995 -180049 -236713 -220196 -117764
25852a17764J44086k0130j59921k2680J59225l445r8526J4670k9302j36801J85156
$$ -117764 26322 6192 -153729 -176409 -17184 -20629 -119155 -104485 -133787 -270588 -85432
25841h5432K20394J00140r6852K820k6273k30192M3664P3845j09789N1155M0547
$$ -85432 134962 235102 138250 141070 114797 -115395 -71731 2114 -107675 -56520 -15973
25830a5973p9121J70719L3074n5855l4492K2561k2510L8041l9590L83j2892Q7522
$$ -15973 -95094 75625 108699 52844 18352 40913 18403 56444 16854 17237 4345 91867
25818I1867p8105j26364n2793K2200j9275P7842K10315o7080j36958l8287M5676
$$ 91867 13762 -112602 -165395 -143195 -162470 -84628 125687 58607 -78351 -116638 -70962
25807g0962j7834l3489k7647J04512o880K8012O2566m0054j62118j3236j4487
$$ -70962 -88796 -122285 -149932 -45420 -52300 -24288 38278 -1776 -163894 -177130 -191617
25796a91617K5198R5625L3497q1296j12096j24525K03343J21572l6172J22131
$$ -191617 -166419 -70794 -37297 -118593 -230689 -355214 -151871 -30299 -66471 55660
25786E5660P5011o0105o0777n4947r7499R598n7730N5398K20010J12194n1724
$$ 55660 130671 70566 9789 -45158 -142657 -133059 -190789 -135391 84619 196813 145089
25775A45089k2062j7438j08312j44477o3051L9973L4990J31566J21955m4025j44080
$$ 145089 123027 105589 -2723 -147200 -210251 -170278 -135288 -3722 118233 74208 -69872
25764f9872k5627J22518l1136L4794n7534j5482J9175j88166q0475P9442J03585
$$ -69872 -95499 27019 -4117 30677 -26857 -42339 -23164 -211330 -291805 -212363 -108778
25753a08778n666M3322J21732Q4387n0667k21426n9239j09989J3366J59399J71620
$$ -108778 -114444 -71122 50610 134997 84330 -137096 -196335 -306324 -292958 -133559 38061
25742C8061R0838M7686p7746j21375J7320K0112P0619M5259K0619o3157J7315
$$ 38061 128899 176585 98839 -22536 -5216 14896 85515 130774 151393 88236 105551
25731A05551N2231R1224p1546k10981k69887r5626n2900J75059J01344P4265J12337
$$ 105551 157782 249006 177460 -33521 -303408 -399034 -451934 -276875 -175531 -101266 11071
25720A1071p474j55069r9213J06461n1488L505J13250o7723M9325P8808N4947
$$ 11071 3597 -151472 -250685 -144224 -195712 -192207 -78957 -146680 -97355 -18547 36400
25709C6400p096m4395M4697k3377j40178j46728J07317J72926q9298M6778r2647
$$ 36400 29304 -15091 29606 6229 -133949 -280677 -173360 -434 -89732 -42954 -135601
25698a35601K5228Q8513j51245j00005J08278K02612J52590o9441k6821k9840
$$ -135601 -110373 -21860 -173105 -273110 -164832 37780 190370 120929 94108 64268
25688F4268j6855m2065r5927n1513L4355j18650j0715m1068Q7241P915j0282P8686
$$ 64268 47413 5348 -90579 -142092 -107737 -226387 -237102 -278170 -190929 -183014 -193296 -114610
25676a14610R7990M9191q4410k4172N1703O97k45513M3889P2090k6630j0072K39166
$$ -114610 -16620 32571 -51839 -76011 -24308 -23611 -269124 -225235 -153145 -179775 -189847 49319
25664D9319J13632j59330p4006J3763K1990J3982K4515p0361r8360P5611L2427
$$ 49319 162951 3621 -70385 -56622 -34632 -20650 3865 -66496 -164856 -89245 -56818
25653e6818l8023J59465N5994j56888m5961J45810n1072j46384m1744P3147O8576
$$ -56818 -94841 64624 120618 -36270 -82231 63579 12507 -133877 -175621 -102474 -33898
25642c3898R5363K3480l0693J18925j2111k18286m6199J17907l0218n0451q7525
$$ -33898 61465 84945 54252 173177 161066 -57220 -103419 14488 -15730 -66181 -153706
25631a53706J31240P3838J4171J14443j30223j90889j13837j1544m3135M0881
$$ -153706 -22466 51372 65543 179986 49763 -141126 -254963 -266507 -309642 -268761
25621b68761J42166Q4040N2028j7838N7453N771J50650M5660j84125o3551r8059
$$ -268761 -126595 -42555 9473 -8365 49088 54859 205509 251169 67044 3493 -94566
25610i4566L9164J14344q4871m5037J51441R8099j48208j27079l4217L5276K00832
$$ -94566 -55402 58942 -25929 -70966 80475 178574 30366 -96713 -130930 -95654 105178
25599A05178j6701J5708j64674r3343j6485J40847O8505K7503l3982q1904l9976
$$ 105178 88477 104185 -60489 -153832 -170317 -29470 39035 66538 32556 -49348 -89324
25588h9324r6496j52483j22643J05002J15472N3430j13951m0508K9141J34258
$$ -89324 -185820 -338303 -460946 -355944 -240472 -187042 -300993 -341501 -312360 -178102
25578a78102n1728q7854N1608J04971l1433l73N328n3344q428K13614q8497k20014
$$ -178102 -229830 -317684 -266076 -161105 -192538 -192911 -187583 -240927 -249355 -35741 -124238 -344252
25566c44252j54992k4944J46202J65368J35912P4502N5330m1542j46218p1992
$$ -344252 -499244 -524188 -377986 -212618 -76706 -2204 53126 11584 -134634 -206626
25556b06626M0318Q2740M4232J218L3278r5577O0322J14818r7968m5283R6708
$$ -206626 -166308 -83568 -39336 -38118 -4840 -100417 -40095 74723 -23245 -68528 28180
25545B8180O7099K4653L9446Q0278J399m2313k24170m083K1934j06561o0275J31666
$$ 28180 95279 119932 159378 239656 241055 198742 -25428 -29511 -7577 -114138 -174413 -42747
25533d2747J09540J11333J3369O811p1315K8590j72317k4517N3032j5826j04177
$$ -42747 66793 178126 191495 198306 126991 155581 -16736 -41253 11779 -4047 -108224
25522a08224J30979R1000O4384J7744j8475j28020j01561j04644N0578N6754J884
$$ -108224 22755 113755 178139 195883 177408 49388 -52173 -156817 -106239 -49485 -47601
25511d7601M3909l2470j23476J3038j35486q4117k3757J4083M3231J95409J43035
$$ -47601 -3692 -36162 -159638 -146600 -282086 -366203 -389960 -375877 -332646 -137237 5798
25500E798O1655N3670J19860J26721j32933j28679K7548r0712k6212L9945L3503
$$ 5798 67453 121123 240983 367704 234771 106092 133640 42928 16716 56661 90164
25489I0164R2764n4962j26933j16511P8664N024j42995L3816n7898M3384m1337
$$ 90164 182928 127966 1033 -115478 -36814 -31790 -174785 -140969 -198867 -155483 -196820
25478a96820j72933r400J26074J24384J15518J2991k1021M2565O4652j43393m8692
$$ -196820 -369753 -379153 -253079 -128695 -13177 -186 -21207 21358 86010 -57383 -106075
25467a06075k0646J05327J02501J00744l2463j1054j59479k92410j59951J39537
$$ -106075 -126721 -21394 81107 181851 149388 138334 -21145 -313555 -473506 -333969
25457c33969R5487Q7626R5507M7323J35949n2211q994l94P452j47862J13895M255
$$ -333969 -238482 -150856 -55349 -8026 127923 75712 66718 66324 73776 -74086 39809 44064
25445D4064j98318m1542L3180r6661n3261J01005j3874j24297m0628r698R362
$$ 44064 -154254 -195796 -162616 -259277 -312538 -211533 -225407 -349704 -390332 -400030 -390668
25434c90668p5493j8838J85749K97188j7378K1781q8536J3054K38710P5366n9817
$$ -390668 -466161 -484999 -299250 -2062 -19440 2341 -86195 -73141 165569 240935 181118
25423A81118r2358j24391m2689M1076P9364Q5754q8868O8025O9943o3804j36404
$$ 181118 88760 -35631 -78320 -37244 42120 127874 39006 107031 176974 113170 -23234
25412b3234j28635J8170J72685n5934l0933N9153M6491J03611j24057j29172J4799
$$ -23234 -151869 -133699 38986 -16948 -47881 11272 57763 161374 37317 -91855 -77056
25401g7056j50735j39613m4610k9351J61640J84099J01972j62364q2736n9617
$$ -77056 -227791 -367404 -412014 -441365 -279725 -95626 6346 -156018 -238754 -298371
25391b98371k7369M2340o2909o3831J75140J50881J68337o7674j44111k3404J14425
$$ -298371 -325740 -283400 -346309 -410140 -235000 -84119 84218 16544 -127567 -150971 -36546
25380c6546o6299o4831J4236n2198J41118M8608J8853j30174l5859j28055O0521
$$ -36546 -102845 -167676 -153440 -205638 -64520 -15912 2941 -127233 -163092 -291147 -230626
25369b30626K6820j33865r8507N9754K06491k2233p1200N5798J72829J65098L8239
$$ -230626 -203806 -337671 -436178 -376424 -169933 -192166 -263366 -207568 -34739 130359 168598
25358A68598k02404j13661k07768m0596O4000K04784K17475l441J500J074L7408
$$ 168598 -33806 -147467 -355235 -395831 -331831 -127047 90428 86987 88487 89561 126969
25347A26969R6648J21149K4423l5184m1696j15534N3708j23325q5387k4588J90008
$$ 126969 223617 344766 369189 334005 292309 176775 230483 107158 21771 -2817 187191
25336A87191M9909m2422o2209L7549J246r8356p5799r4900M6381m4553J20105
$$ 187191 237100 194678 132469 170018 171264 72908 -2891 -97791 -51410 -95963 24142
25325B4142M4673J32372J1866J04656J16923p7085j8955j77677j53394Q5342R37
$$ 24142 68815 201187 213053 317709 434632 357547 338592 160915 7521 92863 93800
25314I3800l4292l4702r843J27927p8127j27404m2811N2823J7143N7230m4020
$$ 93800 59508 24806 14963 142890 64763 -62641 -105452 -52629 -35486 21744 -22276
25303b2276J23758N8496M0536m279l1884r4547J1234j9053j72504k57145P1808
$$ -22276 101482 159978 200514 196235 164351 69804 81038 61985 -110519 -367664 -295856
25292b95856K56684K64038K4019j00517k07735m4004p647j28172Q8946J2505O7036
$$ -295856 -39172 224866 248885 148368 -59367 -103371 -111018 -239190 -150244 -137739 -70703
25281g0703R4277L479j22219q4848O4917L6552j24J1057J87j97484l2128k413
$$ -70703 23574 27053 -95166 -180014 -115097 -78545 -78669 -67612 -67425 -264909 -297037 -299450
25269b99450Q492J19473l6551r0019L9256J40865P9399j03273L4417j38507L2743
$$ -299450 -290958 -171485 -208036 -298055 -258799 -117934 -38535 -141808 -107391 -245898 -213155
25258b13155N8216q74p5953L3873J53419J93637k8814M9323N0731k45361r6418
$$ -213155 -154939 -155813 -231766 -197893 -44474 149163 120349 169672 220403 -24958 -121376
25247a21376k0976J46551K0076l1636k0253j42977O5770K23423j20828j15117
$$ -121376 -142352 4199 24275 -7361 -27614 -170591 -104821 118602 -2226 -117343
25237a17343J80005J29517m3450k18482k1552L1985p020q9850r2736R1842O2114
$$ -117343 62662 192179 148729 -69753 -91305 -59320 -66340 -156190 -248926 -157084 -94970
25226i4970O636P8850J8680k99976k50918m0535K23010L11553K16518M879K608
$$ -94970 -88334 -9484 9196 -290780 -541698 -582233 -359223 -47670 168848 173727 176335
25215A76335M212j03099r8385j36008j02678k8940R9789L7639j06231r0829J14273
$$ 176335 180547 77448 -20937 -156945 -259623 -288563 -188774 -151135 -257366 -348195 -233922
25204b33922J01929l411q622n7187L8940J45070r4338j2426N0273P1961Q3687
$$ -233922 -131993 -135404 -144026 -201213 -162273 -17203 -111541 -123967 -73694 -1733 81954
25193H1954J18250p6523j24405M7504L7116r2399j25820q4154J43273J77444J31973
$$ 81954 200204 123681 -724 46780 83896 -8503 -134323 -218477 -75204 102240 234213
25182B34213l9185k7529k30899j38447R3079K3465J27528R0622r1599j88115P0940
$$ 234213 195028 167499 -63400 -201847 -108768 -85303 42225 132847 41248 -146867 -75927
25171g5927k196j51158r7692O5752k04l208Q4325J14411K5512N3580k1885O8683
$$ -75927 -78123 -229281 -326973 -261221 -261425 -264633 -180308 -65897 -40385 13195 -8690 59993
25159E9993m9684j09600K2843m2203j23425O1695J29574r6574J37413R6021q8597
$$ 59993 10309 -99291 -76448 -118651 -242076 -180381 -50807 -147381 -9968 86053 -2544
25148b544j63238J05304j03241q5069p544J57293M9391j4549O5396m8797k1397
$$ -2544 -165782 -60478 -163719 -248788 -256332 -99039 -49648 -64197 1199 -47598 -68995
25137f8995R7871M8016J0572R474K6105m784l8055j39389j12494j6944J2985J26067
$$ -68995 28876 76892 87464 96938 123043 118259 80204 -59185 -171679 -188623 -175638 -49571
25125d9571M4582j05694k4869R029O9966K16456p0807L8977P1352K3983r3372
$$ -49571 -4989 -110683 -135552 -126523 -56557 159899 89092 128069 199421 223404 130032
25114A30032o7818J01044J24595P5813k2237j74214j21419k9114Q3947n241M6730
$$ 130032 62214 163258 287853 363666 341429 167215 45796 16682 100629 95388 142118
25103A42118n1514j88257J15506K36825m2912j07807K6608r6821J18252N7314
$$ 142118 90604 -97653 17853 254678 211766 103959 130567 33746 151998 209312
25093B09312J3460j57607p6742r906n2433O7501j45155K1388j12539J21141O5419
$$ 209312 222772 65165 -11577 -21483 -73916 -6415 -151570 -130182 -242721 -121580 -56161
25082e6161J3597j9066Q0111Q9601R442q747Q8573k3288l6776J145k7186j15470
$$ -56161 -42564 -61630 18481 108082 117524 108777 197350 174062 137286 138431 111245 -4225
25070d225p2539n3539L8366J37847M3909k16852o999L2687k1715L6758O6249Q1040
$$ -4225 -76764 -130303 -91937 45910 89819 -127033 -134032 -101345 -123060 -86302 -20053 60987
25058F0987j11809J4788k8405j0674j00461K7816J31908n599j0501J2584k2866
$$ 60987 -50822 -36034 -64439 -75113 -175574 -147758 -15850 -21449 -31950 -19366 -42232
25047d2232J07978K14284j23314k01672j01335Q8941Q058q532L3728o0293l1036
$$ -42232 65746 280030 156716 -44956 -146291 -57350 -49292 -57824 -24096 -84389 -115425
25036a15425j08430M2794k4850l2409m9919J1924j42146j6544K85538n8801r4412
$$ -115425 -223855 -181061 -205911 -238320 -288239 -276315 -418461 -435005 -149467 -208268 -302680
25025c02680K20214J80672K4143j19822l6924M1681l9650Q2820j90097j68035
$$ -302680 -82466 98206 122349 2527 -34397 7284 -32366 50454 -139643 -307678
25015c07678j4202O5877O7095j2588R6213M4226M2530j3381k302o9323j50562
$$ -307678 -321880 -256003 -188908 -201496 -105283 -61057 -18527 -31908 -34210 -103533 -254095
25004b54095O460p892J4264q7983O5399P3433j13247k313J65631n274j4091J2513
$$ -254095 -247635 -255527 -241263 -329246 -263847 -190414 -303661 -305974 -140343 -145617 -159708 -147195
24992a47195n5528Q7097K68005P2500j72390m2640M6184R0756o1123q5414R0942
$$ -147195 -202723 -115626 152379 224879 52489 9849 56033 146789 85666 252 91194
24981I1194k8793o6987l1670q1378N0631l8327L1751m7213j1985J19096J09302
$$ 91194 62401 -4586 -36256 -117634 -67003 -105330 -73579 -120792 -132777 -13681 95621
24970I5621p795p1414K0222j6627K1134m1959M9471n3918j33616m143J46692J88223
$$ 95621 87826 16412 36634 20007 41141 -818 48653 -5265 -138881 -143024 3668 191891
24958A91891j46092j3974j7149J60998K8698k93075j98688j67103l5752J77849
$$ 191891 45799 31825 14676 175674 204372 -88703 -287391 -454494 -490246 -312397
24948c12397L0121K15038J83203M2090J41720l8196j44124r9460o607l7178M5106
$$ -312397 -282276 -67238 115965 158055 299775 261579 117455 17995 11388 -25790 19316
24937A9316J72897J0809q4291j75536j5986J28142J94946J21419j25101k5062
$$ 19316 192213 203022 118731 -56805 -72791 55351 250297 371716 246615 221553
24927B21553o9447j49037j50112j79574J72013J79584J20901j0826L3588R7165
$$ 221553 152106 3069 -147043 -326617 -154604 24980 145881 135055 168643 265808
24917B65808J19152j14961k17792p881j32343o463p1114m8004l9642N8097j458
$$ 265808 384960 269999 52207 44326 -88017 -94480 -165594 -213598 -253240 -195143 -196601
24906a96601J9103J09794M2264n2786M0183J00234J03403J14869k1806n4760n7929
$$ -196601 -177498 -67704 -25440 -78226 -38043 62191 165594 280463 258657 203897 145968
24895A45968O117j30420j10969k10009M1606J78075p4687j8982J10441J02579
$$ 145968 152085 21665 -89304 -299313 -257707 -79632 -154319 -173301 -62860 39719
24885C9719R5837l4415r7237k3996J55343O5076P306l773J8045o0658j63432Q469
$$ 39719 135556 101141 3904 -20092 135251 200327 207633 203860 221905 161247 -2185 6284
24873F284J6845q336J38875k9457m6041O524K2638J3604l2959r9770L4086Q9568
$$ 6284 23129 14793 153668 124211 78170 84694 107332 120936 87977 -11793 22293 111861
24861A11861M4165M651j25405O4352O0351r577p1711j1639Q7019j00227N7799
$$ 111861 156026 160677 35272 99624 159975 150398 78687 67048 154067 53840 111639
24850A11639q2582o1732M1494L9392O0276k1965k4883m6080J20794N893j23913
$$ 111639 29057 -32675 8819 48211 108487 86522 61639 15559 136353 142246 18333
24839A8333r8877j0473J78606m607j57496o5494P9637n8724N9484L5548M8527
$$ 18333 -80544 -91017 87589 82982 -74514 -140008 -60371 -119095 -59611 -24063 24464
24828B4464j81815o4066J17716J47569j49142l9253l9827K6650K9917q3149K9271
$$ 24464 -157351 -221417 -103701 43868 -105274 -144527 -184354 -157704 -127787 -210936 -181665
24817a81665J03340q840j05073R2116r121j28746J39134J95114J12327j2149m3881
$$ -181665 -78325 -87165 -192238 -100122 -109243 -237989 -98855 96259 208586 196437 152556
24806A52556j28664q9120r9071l312n3700o6520J9608N2146J06280p5404k3355
$$ 152556 23892 -65228 -164299 -167611 -221311 -287831 -268223 -216077 -109797 -185201 -208556
24795b08556J44397Q2258n9717j03331j1707P8686K7182k8551n2569o0549k0856
$$ -208556 -64159 18099 -41618 -144949 -156656 -77970 -50788 -79339 -131908 -192457 -213313
24784b13313K05865J96219L8860p4650J22763J091p3842J6675M8916L1828j47174
$$ -213313 -7448 188771 227631 152981 275744 276835 202993 219668 268584 300412 153238
24773A53238l26550r4555J21557P0175J23623p1671j01053J5284J27853R3669
$$ 153238 -173312 -267867 -146310 -76135 47488 -24183 -125236 -109952 17901 111570
24763A11570Q5009k010p1110o324k0622j26369K185l0676L0915j27548j7660k8204
$$ 111570 196579 194569 123459 117135 96513 -29856 -27671 -58347 -27432 -154980 -172640 -200844
24751b00844M1662J54756J21148J40874k0767j16538r3060Q7436J88351P391j18725
$$ -200844 -159182 -4426 116722 257596 236829 120291 27231 114667 303018 310409 191684
24740A91684k0627q1087j84114k6076N8934J2565K9635J88666L5047j6250j570
$$ 191684 171057 89970 -94144 -120220 -61286 -48721 -19086 169580 204627 188377 186807
24729A86807l0146j05691q7789p5109K35132Q4988j85426K4813J30585o8907p5011
$$ 186807 156661 50970 -36819 -111928 123204 208192 22766 47579 178164 109257 34246
24718C4246j10513l0585N1782Q9191Q6233n5949j1321p6843j17478k954j02836
$$ 34246 -76267 -106852 -55070 34121 120354 64405 53084 -23759 -141237 -144191 -247027
24707b47027O3018K56781n4758j80727J2766P5916j8025M5046k4386R9907l434
$$ -247027 -184009 72772 18014 -162713 -149947 -74031 -92056 -47010 -71396 28511 25077
24696B5077J82P7387n2310k7661O5817J0051n7982k8758p0136J00975l4576j80829
$$ 25077 25259 102646 50336 22675 88492 98543 40561 11803 -58333 42642 8066 -172763
24684a72763O3550Q4820J26065n4841l2397m6276J049K7293O3755l2583o5746
$$ -172763 -109213 -24393 101672 46831 14434 -31842 -30793 -3500 60255 27672 -38074
24673c8074j6189J1965Q696l6484R7431n9816j11723O2940K02442J48287P012
$$ -38074 -54263 -42298 -33602 -70086 27345 -32471 -144194 -81254 121188 269475 276487
24662B76487j45025j12174j85669J66046L9168m7901o8436M5602L1342n6117j11608
$$ 276487 131462 19288 -166381 -335 38833 -9068 -77504 -31902 -560 -56677 -168285
24651a68285j02986M4035J31119J25030l5636J03170J08666j46035j78140R5488
$$ -168285 -271271 -227236 -96117 28913 -6723 96447 205113 59078 -119062 -23574
24641b3574L927m0796r4441Q1261N0158n3712J31189k7227j69475N776K29209
$$ -23574 -19647 -60443 -154884 -73623 -23465 -77177 54012 26785 -142690 -136914 92295
24630I2295R3388j5164j10591j69849o3341j41667K8716J88824J50574o3467k81664
$$ 92295 185683 170519 59928 -109921 -173262 -314929 -286213 -97389 53185 -10282 -291946
24619b91946L2019K7811j7703K04742M9614Q4079n2414k51023k2328N5397K9979
$$ -291946 -259927 -232116 -249819 -45077 4537 88616 36202 -214821 -237149 -181752 -151773
24608a51773J11784j9820Q550k8812m9330O2129M9821L4620J47245o9502k17976
$$ -151773 -39989 -59809 -51259 -80071 -129401 -67272 -17451 17169 164414 94912 -123064
24597a23064j11653j13113j09361L6436M7476O8830k4736l4036J33662J12102
$$ -123064 -234717 -347830 -457191 -420755 -373279 -304449 -329185 -363221 -229559 -117457
24587a17457J44977j37910j71421R6001J69701J31784O4789L9300M17N0567n0487
$$ -117457 27520 -110390 -281811 -185810 -16109 115675 180464 219764 220181 270748 220261
24576B20261J60653J7227M2527j41689j5420n386n529j76009q5911p6519Q6052
$$ 220261 380914 398141 440668 298979 283559 278173 272644 96635 10724 -65795 20257
24565B0257K3812j42762J76957l5275k75927R6571P4919J02070J60494M0834p4785
$$ 20257 44069 -98693 78264 42989 -232938 -136367 -61448 40622 201116 241950 167165
24554A67165k14488k31466R1350J41252j42603n019N7165L9568m194O8174M2824
$$ 167165 -47323 -278789 -187439 -46187 -188790 -193809 -136644 -97076 -101270 -33096 9728
24543I728j26100j4770L5925J42347n3913N5722l3044r1898l9477N4764p878O0849
$$ 9728 -116372 -131142 -95217 47130 -6783 48939 15895 -76003 -115480 -60716 -68594 -7745
24531g745J33303n2556j31857k2751Q3421r5853l9027K5267O7234P2496P296r2533
$$ -7745 125558 73002 -58855 -81606 1815 -94038 -133065 -107798 -40564 31932 39228 -53305
24519e3305r5971n9243k4825P4945J73757j33008o0009J22703j0139r157L5838
$$ -53305 -149276 -208519 -233344 -158399 15358 -117650 -177659 -54956 -65095 -74252 -38414
24508c8414o4742O9429L8921q1080Q7671J45463M3749l3874P0857k1291k21556
$$ -38414 -103156 -33727 5194 -75886 11785 157248 200997 167123 237980 216689 -4867
24497d867o8112N9356M3946k4714O1774J26287N823k18253j75013n0208M5371
$$ -4867 -72979 -13623 30323 5609 67383 193670 199493 -18760 -193773 -243981 -198610
24486a98610m6723j327J80564P1104p7539J16370K0346M8777n3602j12421J09831
$$ -198610 -245333 -246660 -66096 5008 -72531 43839 64185 112962 59360 -53061 56770
24475E6770m3058L161M5718m9558j47362N7917K0040J7675J59893P8503L3946
$$ 56770 13712 16873 62591 13033 -134329 -76412 -56372 -38697 121196 199699 233645
24464B33645j38195o2500j29831J5917J04298K3217m6683o9223l3959R9470Q3333
$$ 233645 95450 32950 -96881 -80964 23334 46551 -132 -69355 -103314 -3844 79489
24453G9489j38902j69842L4106J31646L4483J42651j81349K9523N7124j7095j5724
$$ 79489 -59413 -229255 -195149 -63503 -29020 113631 -67718 -38195 18929 1834 -13890
24442a3890r6756N6623O7061L6637l5638j05117j3144L1528R6120l1466r9204
$$ -13890 -110646 -54023 13038 49675 14037 -91080 -104224 -72696 23424 -8042 -107246
24431a07246n927K2448J28670r7208j00114l983O4027M300n426m1358p8158Q5469
$$ -107246 -113173 -90725 37945 -59263 -159377 -163360 -99333 -95033 -100459 -141817 -219975 -134506
24419a34506J60526N0100m9438j7486L5007O9041n9092N3216Q1517M0634m3073
$$ -134506 26020 76120 26682 9196 44203 113244 54152 107368 188885 229519 186446
24408A86446l3701n9965k363Q7775P8575m4687n7544m1036r0035j21359J34236
$$ 186446 152745 92780 90417 178192 256767 212080 154536 113500 23465 -97894 36342
24397C6342n059j27356N2423j49675j0662j2341L4170R5912n7967j8404J76681
$$ 36342 31283 -96073 -43650 -193325 -203987 -216328 -182158 -86246 -144213 -162617 14064
24386A4064J62199N2279K7840j30524n4543m4925j00983J3076J05660k3306K3856
$$ 14064 176263 228542 256382 125858 71315 26390 -74593 -61517 44143 20837 44693
24375D4693j577j70043L6803J21123L4810k20939j54611J81786J28148M262p6709
$$ 44693 43116 -126927 -90124 30999 65809 -155130 -309741 -127955 193 4455 -72254
24364g2254q6252J37346K8011r1738m7980m7655R9513J09085R7767m9721n63Q0363
$$ -72254 -158506 -21160 6851 -84887 -132867 -180522 -81009 28076 125843 76122 75559 155922
24352A55922l3840j56225K8346p848m1613N222L2508M2900L7665J73389L2181
$$ 155922 122082 -34143 -5797 -13645 -55258 -50036 -17528 25372 63037 236426 268607
24341B68607p8318j40487n0968Q8824O09L7263Q114j2560n4857k07532J9629J91127
$$ 268607 190289 49802 -1166 87658 88267 125530 133644 121084 66227 -141305 -121676 69451
24329F9451K67770l8220j64661J4415N141j95830P0727N2374r1329m0309J41138
$$ 69451 337221 299001 134340 148755 153896 -41934 28793 81167 -10162 -50471 90667
24318I0667O1517r0716m3421n7046K5136m763j03356J66491O9379N7207p2816
$$ 90667 152184 61468 18047 -38999 -13863 -18626 -121982 44509 113888 171095 98279
24307I8279o420m9970L2680p802j27033r2361O9546k3872j22608J5204K13407
$$ 98279 91859 41889 74569 66767 -60266 -152627 -83081 -106953 -229561 -214357 -950
24296i50J20891j40051j33709l3184K9068k5134o6034J06994J27496J51776J00090
$$ -950 119941 -20110 -153819 -187003 -157935 -183069 -249103 -142109 -14613 137163 237253
24285B37253j08305k8366L1112o6404j51092k1900N5131J84908m1707j23790K2746
$$ 237253 128948 100582 131694 65290 -85802 -107702 -52571 132337 90630 -33160 -10414
24274a0414O4609k0996P9906N8074j26661r8285r7946r4489P6620J91942m4432
$$ -10414 54195 33199 113105 171179 44518 -53767 -151713 -246202 -169582 22360 -22072
24263b2072j75415P4900P6888j167L4666K53473q374j13291J6167J29228N3893
$$ -22072 -197487 -122587 -45699 -46866 -12200 241273 232899 119608 135775 265003 318896
24252C18896r5640k95956J754J18538M121L1066j72830j299P3304M1920m8541
$$ 318896 223256 -72700 -70946 47592 51713 82779 -90051 -91350 -18046 23874 -24667
24241b4667p0579l1383K7088N1019k1711L9764M3958o3816n2634o3042M7637J96329
$$ -24667 -95246 -126629 -99541 -48522 -70233 -30469 13489 -50327 -102961 -166003 -118366 77963
24229G7963Q1022j31613p0577k179J59748P5163o7123M9094n4925p7432j8314
$$ 77963 158985 27372 -43205 -45384 114364 189527 122404 171498 116573 39141 20827
24218B0827q4364R3368k3294l2252n4268J21599N4624j21892p5940n4078l4775
$$ 20827 -63537 29831 6537 -25715 -79983 41616 96240 -25652 -101592 -155670 -190445
24207a90445P4375O4241J48359O8787q5594k11890j9037Q1094n820J65180J63244
$$ -190445 -116070 -51829 96530 165317 79723 -132167 -151204 -70110 -75930 89250 252494
24196B52494j00157j66999j4697j63097L1392J01035N0063l6707K06202J27958
$$ 252494 152337 -14662 -29359 -192456 -161064 -60029 -9966 -46673 159529 287487
24186B87487p5820J16774M714r2467o2479l4166j11787l6924j35027o1113P4797
$$ 287487 211667 328441 333155 240688 178209 144043 32256 -4668 -139695 -200808 -126011
24175a26011J14175n5645N6040j5356j39792L8194m5817n0978p639k0755N2780
$$ -126011 -11836 -67481 -11441 -26797 -166589 -128395 -174212 -225190 -232829 -253584 -200804
24164b00804Q9342k8852N8841K0167o9965J18049J42308J51533J6935j9118j49905
$$ -200804 -111462 -140314 -81473 -61306 -131271 -13222 129086 280619 297554 278436 128531
24153A28531n8994J77020m3039L0763J7199k2132K13973j01731l1924j31031r3997
$$ 128531 69537 246557 203518 234281 251480 229348 443321 341590 309666 178635 84638
24142H4638J10645l7557J0409P964o3506K8605L2880m4743j9143p606j98206r2214
$$ 84638 195283 157726 168135 176099 112593 141198 174078 129335 110192 102586 -95620 -187834
24130a87834j37838J13811J19803q4426P5343J03225Q4717o8080R3205K67496
$$ -187834 -325672 -211861 -92058 -176484 -101141 2084 86801 18721 111926 379422
24120C79422M6948j41386j12891j20694j29727M0503J18186R3944j35818N7969
$$ 379422 426370 284984 172093 51399 -78328 -37825 80361 174305 38487 96456
24110I6456J97250k4118q0991Q125j65434j76905m8667O2539J17253J165O0706
$$ 96456 293706 269588 188597 196722 31288 -145617 -194284 -131745 -14492 -13327 47379
24099D7379J37688p4166j58076r1023q4734L8000K6939L5075m5361l3879K89418
$$ 47379 185067 110901 -47175 -138198 -222932 -184932 -157993 -122918 -168279 -202158 87260
24088H7260R6489L4187O8581j24508j35609r9655n4935N579M7964J38693l8337
$$ 87260 183749 217936 286517 162009 26400 -73255 -128190 -122611 -74647 64046 25709
24077B5709r2147l5212Q4065m1360o8534p5443m8086J64749J24843j08534L7580
$$ 25709 -66438 -101650 -17585 -58945 -127479 -202922 -251008 -86259 38584 -69950 -32370
24066c2370J78411j12035j15326k2852N7721j09598j5797M4494N276K3061J55819
$$ -32370 146041 34006 -81320 -104172 -46451 -156049 -171846 -127352 -122076 -99015 56804
24055E6804N1709j23572j17097J40229J11712q9860p9749L516R1799m0181j5940
$$ 56804 108513 -15059 -132156 8073 119785 29925 -49824 -46308 45491 5310 -10630
24044a0630J02358p7409j31622j09869L869J16996r6862j53274J15107J17964
$$ -10630 91728 14319 -117303 -227172 -223303 -106307 -203169 -356443 -241336 -123372
24034a23372r2134K30148K06075K3273j30398j68236L9377K79597N8974k18276
$$ -123372 -215506 14642 220717 243990 113592 -54644 -15267 264330 323304 105028
24024A05028j85962j1365K41359Q2496j14112l07711j52791P7936J54004J72219
$$ 105028 -80934 -92299 149060 231556 117444 -190267 -343058 -265122 -111118 61101
24014F1101J00040k6946m7765j00936n0087M8971N121j1502N9868J15293j10146
$$ 61101 161141 134195 86430 -14506 -64593 -15622 -10501 -22003 37865 153158 43012
24003D3012j31267q7309J44377J25630K4771k6046L6066K5068r0743J7871r5435
$$ 43012 -88255 -175564 -31187 94443 119214 93168 129234 154302 63559 81430 -14005
23992a4005j22306J87458j05741K124J79769L6398k73185m5569L09699K3590L0230
$$ -14005 -136311 51147 -54594 -52470 127299 163697 -109488 -155057 154642 178232 208462
23981B08462L4543j02447j99137j04371P2371N4421J34872N4382n3439k4771l2037
$$ 208462 243005 140558 -58579 -162950 -90579 -36158 98714 153096 99657 74886 42849
23970D2849j945M4195k6232j86973L8718J77912J5463j06288O2215O627p3105
$$ 42849 40904 85099 58867 -128106 -89388 88524 103987 -2301 59914 66541 -6564
23959f564J20245K6366n0921p4544j08810l9431J12262J13217O4323R2352n7485
$$ -6564 113681 140047 89126 14582 -94228 -133659 -21397 91820 156143 248495 191010
23948A91010n2659m198J08673N2042k39369k37260j3870J93824P313K5861r4776
$$ 191010 138351 134153 242826 294868 55499 -181761 -195631 -1807 5506 31367 -63409
23937f3409r8851Q6656O9720J14970J10400O6888P4816l8784j27172J8603j03258
$$ -63409 -162260 -75604 -5884 109086 219486 286374 361190 322406 195234 213837 110579
23926A10579K6626R7k36467j88018q9876J12157K36933O352K571M0837M4848n7368
$$ 110579 137205 137302 -99165 -287183 -377059 -264902 -27969 -21617 -19046 21791 66639 9271
23914I271n1848K5248l3019K8947J96748J31225o6968j4315j85534m4980k9373
$$ 9271 -42577 -17329 -50348 -21401 175347 306572 239604 225289 39755 -5225 -34598
23903c4598o2579O4828K01807p6645n2626K8811J8175j26988j00361l3962J397
$$ -34598 -97177 -32349 169458 92813 40187 68998 87173 -39815 -140176 -174138 -172741
23892a72741J07772n8878L5131p6102J58450J76419J738M9529k2446J2984j18502
$$ -172741 -64969 -123847 -88716 -164818 -6368 170051 171789 221318 198872 211856 93354
23881I3354j52953N7500m7318j33714l2988J18147J09783K7453l8266K5470L3102
$$ 93354 -59599 -2099 -49417 -183131 -216119 -97972 11811 39264 998 26468 59570
23870E9570p248j71873k7848R2856K4604p4929J17538K6651n2249r5214k5259
$$ 59570 52322 -119551 -147399 -54543 -29939 -104868 12670 39321 -12928 -108142 -133401
23859a33401J76786L7435J18318P7106j37953q4431r6020n6766q1435J06448K02541
$$ -133401 43385 80820 199138 276244 138291 53860 -42160 -98926 -180361 -73913 128628
23848A28628O0728P531p1829k6523M8777j61383N7177j50252j29783K45604J55531
$$ 128628 189356 196887 125058 98535 147312 -14071 43106 -107146 -236929 8675 164206
23837A64206k8657o6957o6721l0508j164M3204J08307j00709n7842O232M2474
$$ 164206 135549 68592 1871 -28637 -29801 13403 121710 21001 -36841 -30609 11865
23826A1865J5142l2919O8060M7387j14593J41840O0609M9708L3174M2911M623
$$ 11865 27007 -5912 62148 109535 -5058 136782 197391 247099 280273 323184 327807
23815C27807j01097J66455K0913j19750n6679L781m1303J9664j19510R5246P5248
$$ 327807 226710 393165 414078 294328 237649 241430 200127 219791 100281 195527 270775
23804B70775M3384j2004j41759j38966l3267J59361R7175k50840r4895N0187o4402
$$ 270775 314159 302155 160396 21430 -11837 147524 244699 -6141 -101036 -50849 -115251
23793a15251K6213P5095M7306j48313q3359P2827N7096M6939m3009p7062J70391
$$ -115251 -89038 -13943 33363 -114950 -198309 -125482 -68386 -21447 -64456 -141518 28873
23782B8873K3420j12982P6081O3166m3493k47920p9434K35923J23765j81119o4840
$$ 28873 52293 -60689 15392 78558 35065 -212855 -292289 -56366 67399 -113720 -178560
23771a78560J26340q592J71903J61024O3961j0712m9766j78726j53437r0921N5949
$$ -178560 -52220 -60812 111091 272115 336076 325364 275598 96872 -56565 -147486 -91537
23760i1537J29659n0973j8370M4795L1917k7878J8670N6017l0170P7130m4389
$$ -91537 38122 -12851 -31221 13574 45491 17613 36283 92300 62130 139260 94871
23749I4871n1624m1173r6281j06537n2890J7871l0536o0498J49340J39010j29228
$$ 94871 43247 2074 -94207 -200744 -253634 -235763 -266299 -326797 -177457 -38447 -167675
23738a67675j51361K8958R2969J58198q7461j78445J06478K03341R6375O8149
$$ -167675 -319036 -290078 -197109 -38911 -126372 -304817 -198339 5002 101377 169526
23728A69526J64406o6883r8987j02724p640m0641k3590j0268J52715K00253j7676
$$ 169526 333932 267049 168062 65338 57698 17057 -6533 -16801 135914 336167 318491
23717C18491n7244j35038k36534k9451k1477J4234R5566k39M2118K9780P5824
$$ 318491 261247 126209 -110325 -139776 -161253 -147019 -51453 -51692 -9574 20206 96030
23706I6030L4962P3574k0327m1707J00459J40273p5626o8863N628O719j49052
$$ 96030 130992 204566 184239 142532 242991 383264 307638 238775 244403 251122 102070
23695A02070j22139J12569J7240R5178p7906q2822q3420N8262J71624P2089p8938
$$ 102070 -20069 92500 109740 204918 127012 44190 -39230 19032 190656 262745 183807
23684A83807o2810K376J2777M7023Q6567J05947J0917o9700j65856l5239o9742
$$ 183807 120997 123373 136150 183173 269740 375687 386604 316904 151048 115809 46067
23673D6067m0856K4091j247J2833J7939L3055P3328j25920o437J06569p408k8228
$$ 46067 5211 29302 28055 40888 58827 91882 165210 39290 32853 139422 132014 103786
23661A03786J4658M6025q2096j35850k7154K8623K578J93172p2210M9076K880
$$ 103786 118444 164469 82373 -53477 -80631 -52008 -49430 143742 71532 120608 123488
23650A23488p586q9963K9766o4240J3397M9089q0719r1931l0195J05012J35163
$$ 123488 115902 25939 55705 -8535 4862 53951 -26768 -118699 -148894 -43882 91281
23639I1281J04256L4082J0831L0248m3540j05648o1621p3780r6051j10055J95371
$$ 91281 195537 229619 240450 270698 227158 121510 59889 -13891 -109942 -219997 -24626
23628b4626J12902L7716j48659m2600J11307P2856P574l2737J905O8660N7612
$$ -24626 88276 125992 -22667 -65267 46040 118896 126470 93733 95638 164298 221910
23617B21910r7205j5626P4817J43816l2200j85625j00759K5165M6335j57580q5448
$$ 221910 124705 109079 183896 327712 295512 109887 9128 34293 80628 -76952 -162400
23606a62400j02164n1504O5521R1656L9979J63195J35655j15020m9752J94009
$$ -162400 -264564 -316068 -250547 -158891 -118912 44283 179938 64918 15166 209175
23596B09175j5757J3090k7345J4686J10331k08810j67055Q6312m5822J1377L838
$$ 209175 193418 206508 179163 193849 304180 95370 -71685 14627 -31195 -19818 -15980
23585a5980l3461q791J728j8575J5649J04273N0253j00214j8692m1384n8974J23749
$$ -15980 -49441 -58232 -56504 -75079 -59430 44843 95096 -5118 -23810 -65194 -124168 -419
23573d19J5000j57803J8980K12669O9196J29712J3556j60787r0259k2424M9954
$$ -419 14581 -143222 -124242 88427 157623 287335 300891 140104 49845 27421 77375
23562G7375J12212o4880l5828R3250M0425j11945l878Q0556J8957L5605j13151
$$ 77375 189587 124707 88879 182129 222554 110609 106731 187287 206244 241849 128698
23551A28698k36831o3776q8364J76564J16750J73667n7064p7983m0921M074P5423
$$ 128698 -108133 -171909 -260273 -83709 33041 206708 149644 71661 30740 34814 110237
23540A10237j39786J12271J02354l9013j31477J2124o3431N2412k4077P2693m3350
$$ 110237 -29549 82722 185076 146063 14586 26710 -36721 15691 -8386 64307 20957
23529B0957j17013K7200J17078N9734j0563J2402O8516m4339m0475K9378l0065
$$ 20957 -96056 -68856 48222 107956 97393 109795 178311 133972 93497 122875 92810
23518I2810n6214N6463J26384m7636P441n516j47219k20803m9309K40991J70581
$$ 92810 36596 93059 219443 171807 179248 173732 26513 -194290 -243599 -2608 167973
23507A67973j42576J1998j62630o8585q7813J31376K62658J8016j13978j13064
$$ 167973 25397 37395 -125235 -193820 -281633 -150257 112401 130417 16439 -96625
23497i6625l1046J30781n1846r0470O6102o9230o8218p5105O9497K19938J58235
$$ -96625 -127671 3110 -48736 -139206 -73104 -142334 -210552 -285657 -216160 3778 162013
23486A62013R1940J79865R367n6671k97740o7252O0193q5682p4666R5732N3722
$$ 162013 253953 433818 443185 386514 88774 21522 81715 -3967 -78633 17099 70821
23475G0821j73072j0012M4514L2304R7533K24591J6737p6829j80206L8528p2729
$$ 70821 -102251 -112263 -67749 -35445 62088 286679 303416 226587 46381 84909 12180
23464A2180p7711J82511J12140l7262j76720j11817j1403M912j82268j3951K7588
$$ 12180 -65531 116980 229120 191858 15138 -96679 -108082 -103170 -285438 -299389 -271801
23453b71801J19285m542J49415O7904j07354j64380L7187J44206J8970o3103K55318
$$ -271801 -152516 -157058 -7643 60261 -47093 -211473 -174286 -30080 -11110 -74213 181105
23442A81105j04379p4145J02686j03233Q7244O9131p6526j87246Q9331J37962
$$ 181105 76726 2581 105267 2034 89278 158409 81883 -105363 -16032 121930
23432A21930L4152m9966j22644l2151M4181K5606K5306m7580j21826J4646J07536
$$ 121930 156082 106116 -16528 -48679 -4498 21108 46414 -1166 -122992 -108346 -810
23421h10J53822P2571n2185j01892q7144O2840J05956j59817J931M8157P6224
$$ -810 153012 225583 173398 71506 -15638 47202 153158 -6659 -4728 43429 119653
23410A19653j8238m0244j60912k20399O1517M6583o2414J31608Q3051j93934j33070
$$ 119653 101415 61171 -99741 -320140 -258623 -212040 -274454 -142846 -59795 -253729 -386799
23399c86799L65244R9046n8479q1793L756j0851j11260Q1233N2422M0899R2387
$$ -386799 -21555 77491 19012 -62781 -59025 -69876 -181136 -99903 -47481 -6582 85805
23388H5805K7591J45713j59753j327m1915m4966P157O5079q8700n3852j768P9999
$$ 85805 113396 259109 99356 98029 56114 11148 18305 83384 -5316 -59168 -60936 19063
23376A9063J47979K9681J04710k2619l4994n0003j13961J2742k3526k17197k07603
$$ 19063 167042 196723 301433 278814 243820 193817 79856 92598 69072 -148125 -355728
23365c55728M2574j7101O9901J0380Q4998J07531K4538k5856M812K27723l0542
$$ -355728 -313154 -330255 -260354 -249974 -164976 -57445 -32907 -58763 -53951 173772 143230
23354A43230j06237r9888K5626Q4159Q2607Q6663m0983k1672j30430j93470m140
$$ 143230 36993 -62895 -37269 46890 129497 216160 175177 153505 23075 -170395 -174535
23343a74535j7239j12912K3982J42079J67290n2480j08269j57515K6624J77826
$$ -174535 -191774 -304686 -280704 -138625 28665 -23815 -132084 -289599 -262975 -85149
23333h5149O3429P3979j45324j33312k8136J56978l5281j08436J6833R7573p993
$$ -85149 -21720 52259 -93065 -226377 -254513 -97535 -132816 -241252 -224419 -126846 -134839
23322a34839J09883J5725j00203n5310K024L3153n547P8270k2128J48060J4990
$$ -134839 -24956 -9231 -109434 -164744 -162720 -129567 -135114 -56844 -78972 69088 84078
23311H4078n2757J43495j07082k81498q5786K20484P1062K2834k8852M4669M8789
$$ 84078 31321 174816 67734 -213764 -299550 -79066 -8004 14830 -14022 30647 79436
23300G9436J1429n0521N0320O2379M2080K7835M7094j15670j84235k7148R8120
$$ 79436 90865 40344 90664 153043 195123 222958 270052 154382 -29853 -57001 41119
23289D1119K43658k5054j28886j22585J5774n0079l8369p8431N9525J04184O9589
$$ 41119 284777 259723 130837 8252 24026 -26053 -64422 -142853 -83328 20856 90445
23278I0445n9366J73082l5229m7708j792J13495p4724j57003J24810J21993p1253
$$ 90445 31079 204161 168932 121224 119432 232927 158203 1200 126010 248003 176750
23267A76750L295k1846j32242J03498J2892m0032l5821J58965P2321j69219l037
$$ 176750 180045 158199 25957 129455 142347 102315 66494 225459 297780 128561 125524
23256A25524k6530L6376O2140p1664k7864J23079K27474j67720j85809J7975j27666
$$ 125524 98994 135370 197510 125846 97982 221061 448535 280815 95006 112981 -14685
23245a4685j12098l1766K78687K2781j337R1019K4681O5521j10556j03050J2836
$$ -14685 -126783 -158549 120138 142919 141582 232601 257282 322803 212247 109197 122033
23234A22033O8563j95351p3999M3649o5959J35093K51078J6566m1668r1641K7200
$$ 122033 190596 -4755 -78754 -35105 -101064 34029 285107 301673 260005 168364 195564
23223A95564m1532q6990J25529O8255J02598L1234j69410j19472k896j77988j68869
$$ 195564 154032 67042 192571 260826 363424 394658 225248 105776 102880 -75108 -243977
23212b43977J4898J48069r3301J19313K70736J75791J27870n3926k42179j42346
$$ -243977 -229079 -81010 -174311 -54998 215738 391529 519399 465473 223294 80948
23202H0948j2301p749R9886j48007n2998R5334L5747P1351J0094o9255N889j1257
$$ 80948 68647 60898 160784 12777 -40221 55113 90860 162211 172305 103050 108939 97682
23190I7682k7264M3974r5682k17831P485J04776j0414J31901N8107p1718R1782
$$ 97682 70418 114392 18710 -199121 -191636 -86860 -97274 34627 92734 21016 112798
23179A12798R0159j43633q6911J43530J0563m8898l1595k2571M4285o5247j3673
$$ 112798 202957 59324 -27587 115943 126506 77608 46013 23442 67727 2480 -11193
23168a1193p7354K1838J82327J46780M9949r8486L8214l8181j4918p5679O869
$$ -11193 -88547 -66709 115618 262398 312347 213861 252075 213894 198976 123297 130166
23157A30166j1341P9473j06557o1348M9793L0652m9326q1328J6662L2820K2694
$$ 130166 118825 198298 91741 30393 80186 110838 61512 -19816 -3154 29666 52360
23146E2360k9974L6600R1746q4769M9952J05815M030r9254P456J8611p0150N8832
$$ 52360 22386 58986 150732 65963 115915 221730 225760 126506 133962 152573 82423 141255
23134A41255L30946o6217k58663j98116j41762L6591J42782J5505J787k7988n8102
$$ 141255 472201 405984 147321 -50795 -192557 -155966 -13184 2321 4108 -23880 -81982
23123h1982r5166K2303K1586r00m8783J78706J32968j00663j78105J40776J51426
$$ -81982 -177148 -154845 -133259 -134159 -182942 -4236 128732 28069 -150036 -9260 142166
23112A42166J7836j62781k0408j652m7693L1389J00538M8891Q9899n7082p7008
$$ 142166 160002 -2779 -23187 -24839 -72532 -41143 59395 108286 198185 141103 64095
23101F4095J72597J6228j2880M3627N584j14312N6620j49960q9766J9715J18386
$$ 64095 236692 252920 240040 283667 289251 174939 231559 81599 -8167 11548 129934
23090A29934O6895L245l3899j53004m7611J9795J76712M1974K4876l0326l5667
$$ 129934 196829 200074 166175 13171 -34440 -14645 162067 204041 228917 198591 162924
23079A62924m0007M9299q2052j09518r8091l349J1900M644N4758J62542K23936
$$ 162924 122917 172216 90164 -19354 -117445 -120794 -108894 -104250 -49492 113050 336986
23068C36986j03438l5273j42639k77935n3097K53453R5863M7021j98014m063J48523
$$ 336986 233548 198275 55636 -222299 -275396 -21943 73920 120941 -77073 -81136 67387
23057F7387J46814N9802k66641m4536P4751L4294L5163k2479r2600j87901P1579
$$ 67387 214201 274003 7362 -37174 37577 71871 107034 84555 -8045 -195946 -124367
23046a24367J04578K9696p9041r7182Q5572K12820p8841p3484J06207Q2136P6095
$$ -124367 -19789 9907 -69134 -166316 -80744 132076 53235 -20249 85958 168094 244189
23035B44189j47291J52816p6560k45685j73243j9532J93703K00852N3256R35j04245
$$ 244189 96898 249714 173154 -72531 -245774 -265306 -71603 129249 182505 183440 79195
23024G9195k2874M1321K7206J48433p000j54723k64493q0290J74183J04115J84355
$$ 79195 56321 97642 124848 273281 266281 111558 -152935 -233225 -59042 45073 229428
23013B29428j4327R671N1682j71204k4834J2107o0412o9551K0614P5466o4476
$$ 229428 215101 224772 276454 105250 80416 92523 32111 -37440 -16826 58640 -5836
23002e836J33324L3887n8494n7683M0662J23894j87309j29422M9162N9128M1956
$$ -5836 127488 161375 102881 45198 85860 209754 22445 -106977 -57815 1313 43269
22991D3269J7081Q0287q5619K1752K9375K817R2974O0271n8324k60202k62208
$$ 43269 60350 140637 55018 76770 106145 108962 201936 262207 203883 -56319 -318527
22980c18527M607J54510R6593N2757M6304Q7580p8647r1430j08064j33535J1190
$$ -318527 -313920 -159410 -62817 -10060 36244 123824 45177 -46253 -154317 -287852 -276662
22969b76662m3099N159J54955J45663N0043r5008L303J6544J06831j29783q8005
$$ -276662 -319761 -314602 -159647 -13984 36059 -58949 -55646 -39102 67729 -62054 -150059
22958a50059k6133N420J69777R3648J1868J09375P4457j38349j83070m7114n169
$$ -150059 -176192 -170772 -995 92653 104521 213896 288353 150004 -33066 -80180 -85349
22947h5349j24331J8301m97J51923l434m5575Q8202M0594o6281l5484J71556K64050
$$ -85349 -209680 -191379 -191876 -39953 -43387 -88962 -760 39834 -26447 -61931 109625 373675
22935C73675r834k43506j94097l5029J25876J7273l3907M3590Q4751R1421J04595
$$ 373675 363841 120335 -73762 -108791 17085 34358 451 44041 128792 220213 324808
22924C24808M2310j85830j00029J15588o6309O342N7042N3670K521n4633P4N4322
$$ 324808 367118 181288 81259 196847 130538 136880 193922 247592 250113 195480 195554 249876
22912B49876P0789J64574M5161q2890j01885j12455k00364O8558J12315Q7057
$$ 249876 320665 485239 530400 447510 345625 233170 32806 101364 213679 300736
22902C00736q5475K6850J12142j49948q3980J39855p8371k04102K7359J17565
$$ 300736 215261 242111 354253 204305 120325 260180 181809 -22293 5066 122631
22892A22631j27180j53017k6434J6612j9815k4628K45747J61457j04321j80220
$$ 122631 -4549 -157566 -184000 -167388 -187203 -211831 33916 195373 91052 -89168
22882h9168m5775M9794J33404K7945K10713j8689n1879q5297l541j3707p1257
$$ -89168 -134943 -85149 48255 76200 286913 268224 216345 131048 127507 113800 42543
22871D2543j75319l3965N14M24O2792K8602K0886J6176M9138Q1666m9956j29230
$$ 42543 -132776 -166741 -166227 -165803 -103011 -74409 -53523 -37347 11791 93457 43501 -85729
22859h5729O2673J05962m8010k34814j15899j04400K754J31547K45120R4698k2890
$$ -85729 -23056 82906 34896 -199918 -315817 -420217 -417463 -285916 -40796 53902 31012
22848C1012p9401k1323n0111L0628O8814N4178p021Q8730J06693O7052n2213p3130
$$ 31012 -48389 -69712 -119823 -89195 -20381 33797 26776 115506 222199 289251 237038 163908
22836A63908N6222j1138J27118M8865J7715p0410j08717j09059N9547q1530j4620
$$ 163908 220130 208992 336110 384975 402690 332280 223563 114504 174051 92521 77901
22825G7901j26559m4396M8456J65424J34994j20922l2149o2270L2064p618n7796
$$ 77901 -48658 -93054 -44598 120826 255820 134898 102749 40479 72543 64925 7129
22814G129J12150J46726J29204J63581O9122j25157j68227j99326k68132m8021
$$ 7129 119279 266005 395209 558790 627912 502755 334528 135202 -132930 -180951
22804a80951J33682J88956L1634p8214M8409r9819o4746J63442O6415q0401j18061
$$ -180951 -47269 141687 173321 95107 143516 43697 -21049 142393 208808 128407 10346
22793A0346R9489M4798Q2581k2966k9192k1482l8887l2999r2469J7326j2656L7880
$$ 10346 109835 154633 237214 214248 185056 163574 124687 91688 -781 16545 3889 41769
22781D1769N4034J7062q99j30191L5783J31679q5076l1632K6643l8356m3333R0601
$$ 41769 95803 112865 111966 -18225 17558 149237 64161 32529 59172 20816 -22517 68084
22769F8084J86143j01690j44898j79452J33393k5608M9296N6450J00374L890j78250
$$ 68084 254227 152537 7639 -171813 -38420 -64028 -14732 41718 142092 145982 -32268
22758c2268j35820j8003M0855J50947K1164K4243N2167p7315J0914o8517N0265
$$ -32268 -168088 -186091 -145236 5711 26875 51118 103285 25970 36884 -31633 18632
22747A8632j78811l1769O2277j429J31538J06597j10310p6268q995M1581O8691
$$ 18632 -160179 -191948 -129671 -131100 438 107035 -3275 -79543 -88538 -46957 21734
22736B1734J34537N513P9204L0624L899j9031K2657j75999j92589n011j6402O28
$$ 21734 156271 161784 240988 271612 275511 256480 279137 103138 -89451 -94462 -110864 -110236
22724a10236J00946L8063j23981J03095J21182J34627J7103l22915k5735R0444
$$ -110236 -9290 28773 -95208 7887 129069 263696 280799 -42116 -67851 22593
22714B2593k9742L4852r5531Q5634j4280j0775N1403n9727j6885J26508K16719
$$ 22593 -7149 27703 -67828 17806 3526 -7249 44154 -15573 -32458 94050 310769
22703C10769j75113j35276j00437M7243j52393J5795J68118o946j80024J81877
$$ 310769 135656 380 -100057 -52814 -205207 -189412 -21294 -28240 -208264 -26387
22693b6387R3509m5041N4051j6218j56709p7488K8120R6719R687J29915k56083
$$ -26387 67122 22081 76132 59914 -96795 -174283 -146163 -49444 -39757 90158 -165925
22682a65925j15065J59063k9272j55375O8415J07191L0001o0696J82116J71734
$$ -165925 -280990 -121927 -151199 -306574 -238159 -130968 -100967 -161663 20453 192187
22672A92187j45671q8213J63980j25008k59501m538R6651K30109J81207j7440
$$ 192187 46516 -41697 122283 -2725 -262226 -266764 -170113 59996 241203 223763
22662B23763r0067m1034j00691j31414k7490j0956j16985O7937J77545Q2128J52604
$$ 223763 133696 92662 -8029 -139443 -166933 -177889 -294874 -226937 -49392 32736 185340
22651A85340j72392p8827J10195l9859J6172q1838j04475j3690Q0203N8260P2068
$$ 185340 12948 -65879 44316 4457 20629 -61209 -165684 -179374 -99171 -40911 31157
22640C1157n1769J63482M3179J1731l8689N9447K9079k3751L2937M2080M713l5427
$$ 31157 -20612 142870 186049 197780 159091 218538 247617 223866 256803 298883 303596 268169
22628B68169k20506k5637P944P1024k9151K6751L3633N834k5991k6638Q8296N4386
$$ 268169 47663 22026 29970 100994 71843 98594 132227 138061 112070 85432 173728 228114
22616B28114P6635j26470p9963J49751j05156n3578j7043j32665R6980l06j5193
$$ 228114 304749 178279 98316 248067 142911 89333 72290 -60375 36605 36299 21106
22605B1106K9077M9208J01135k8763O1275K2214j43756j41j4955j49730Q4780
$$ 21106 50183 99391 200526 171763 233038 255252 111496 111355 96400 -53330 31450
22594C1450j05314O7556R3454j28471r6012k5722J1965j106M0406J16484O8341
$$ 31450 -73864 -6308 87146 -41325 -137337 -163059 -151094 -152200 -111794 4690 73031
22583G3031r650q5867r4971K5793M2946l3080L16553P9558j65215Q9803k7312
$$ 73031 63381 -22486 -117457 -91664 -48718 -81798 234755 314313 149098 238901 211589
22572B11589o6873l7286l7512o354m320O0425l0585M8380r6125j24569R1167J83707
$$ 211589 144716 107430 69918 63564 59244 119669 89084 137464 41339 -83230 7937 191644
22560A91644K06679n5062j31276K3619r9015j29243O270J9425l6066O3845J7797
$$ 191644 398323 343261 211985 235604 136589 7346 13616 33041 -3025 60820 78617
22549G8617J0039O4145Q3741q2998q562m8574K0681n0846P9401p5483j14941R139
$$ 78617 88656 152801 236542 153544 144982 96408 117089 66243 145644 70161 -44780 -35641
22537c5641K3231m6170L2898Q0227J68583r8808m4582P3479N132j15716j31874
$$ -35641 -12410 -58580 -25682 54545 223128 124320 79738 153217 158349 42633 -89241
22526h9241l2754K5537J9313J28040J15418L9764q450N3544J4121J355R529J04705
$$ -89241 -121995 -96458 -77145 50895 166313 206077 197627 251171 265292 266647 276176 380881
22514C80881o8544J59253K3314k31686k18604r5354k4346j0387M9385m3576J03039
$$ 380881 312337 471590 494904 263218 44614 -50740 -75086 -85473 -36088 -79664 23375
22503B3375L5607o6131O796J4225l6087N6426J04616m494j64732R7077P2952j50501
$$ 23375 58982 -7149 -353 13872 -22215 34211 138827 134333 -30399 66678 139630 -10871
22491a0871J04209R3138O0065N2532r0489M1266p4635L7959J2986j42646j59448
$$ -10871 93338 186476 246541 299073 208584 249850 175215 213174 226160 83514 -75934
22480g5934M6425n1656J29488J29744l905r2824q575J8788n7398r9021L6509J05735
$$ -75934 -29509 -81165 48323 178067 174162 81338 72763 91551 34153 -64868 -28359 77376
22468G7376N5009j01943j6424n8436L0037m0479R4334m576r2954J14873O8509
$$ 77376 132385 30442 14018 -44418 -14381 -54860 39474 34898 -58056 56817 125326
22457A25326j10596j25010J6699J18610q0561m8270j7550J8476M4573j6614j8454
$$ 125326 14730 -110280 -93581 25029 -55532 -103802 -121352 -102876 -58303 -74917 -93371
22446i3371J54807Q3085P0730K6008J09476o7474j11082K2391j0163o7014j19836
$$ -93371 61436 144521 215251 241259 350735 283261 172179 194570 184407 117393 -2443
22435b443J1620Q7173R7470N612l3658o6114o256J25997L9789j2861J6628m1031
$$ -2443 9177 96350 193820 199432 165774 99660 93404 219401 259190 246329 262957 221926
22423B21926J7966J17648k80241j39395M4385K5221r9415N1257k8618R4425M0356
$$ 221926 239892 357540 77299 -62096 -17711 7510 -91905 -40648 -69266 25159 65515
22412F5515p7936O2052N552O8564K9964Q2920j1234j54442j19920J2024L7421
$$ 65515 -12421 49631 55183 123747 153711 236631 225397 70955 -48965 -36941 480
22401D80J52037K3935p9823J24085q7307p3692J36309M1735k4650l6821j77361
$$ 480 152517 176452 96629 220714 133407 59715 196024 237759 213109 176288 -1073
22390a073o0645M7599k0789K3431L6229N3459m2888j3198L5088m5892K7510m9261
$$ -1073 -61718 -14119 -34908 -11477 24752 78211 35323 22125 57213 11321 38831 -10430
22378a0430q6920N3214J21926j45586j23982K6498l2255O9205j53030r392K07606
$$ -10430 -97350 -44136 77790 -67796 -191778 -165280 -197535 -128330 -281360 -290752 -83146
22367h3146K27930j03677k18121K075R7670Q2785k1716o1807o0867N6682J40081
$$ -83146 144784 41107 -177014 -174939 -77269 5516 -16200 -78007 -138874 -82192 57889
22356E7889l2003r5581R3120Q7139r2439k0447O4456J6240j38381l3020R4420
$$ 57889 25886 -69695 23425 110564 18125 -2322 62134 78374 -60007 -93027 1393
22345A393j4251j50912O8420L4607O5L3210J74636p03k23363M3830J44006j12320
$$ 1393 -12858 -163770 -95350 -60743 -60678 -27468 147168 146465 -76898 -33068 110938 -1382
22333a382k9304P2898m4508K854J14352J17265p8702M3064R2893K3880j0141j65472
$$ -1382 -30686 42212 -2296 558 114910 232175 153473 196537 289430 313310 303169 137697
22321A37697J9786J09098R141m4315r4853O6131R931m4821k25772L4652J62811
$$ 137697 157483 266581 275722 231407 136554 202685 212616 167795 -57977 -23325 139486
22310A39486L7331J19600Q1514j68968j31799K02859j6845l8758n2406j52816
$$ 139486 176817 296417 377931 208963 77164 280023 263178 224420 172014 19198
22300A9198J33970K3562k22104J15262K9479j45067j31628N9850R3866o4233K2478
$$ 19198 153168 176730 -45374 69888 99367 -45700 -177328 -117478 -23612 -87845 -65367
22289f5367J46723N873J18707M8477o1576p9228m253Q8583O6082O7228m0410j97752
$$ -65367 81356 87229 205936 254413 192837 113609 109356 197939 264021 331249 290839 93087
22277I3087j24244M7459J4142l2434J67576j04548r5235j7328O9688q2537P5018
$$ 93087 -31157 16302 30444 -1990 165586 61038 -34197 -51525 18163 -64374 10644
22266A0644L0655K600K29620M6319j7682m0441j94642j3615J55808n6327q1865
$$ 10644 41299 43899 273519 319838 302156 261715 67073 53458 209266 152939 71074
22255G1074l5721K7236K22935R4495J0884j44681j14397j5937J70947Q4163j33714
$$ 71074 35353 62589 285524 380019 390903 246222 131825 115888 286835 370998 237284
22244B37284q9265M905n2052o5557N2742K7581j45346m1913n6037P6998K29462
$$ 237284 148019 152924 100872 35315 88057 115638 -29708 -71621 -127658 -50660 178802
22233A78802R632p6567L2012l750P4549j8917q4349l365M3041j12163K326J90508
$$ 178802 188434 111867 143879 140129 214678 195761 111412 108047 151088 38925 41251 231759
22221B31759L4691O1728j82524j81658m7551O1574J88247o5107K083M448j5313
$$ 231759 266450 328178 145654 -36004 -83555 -21981 166266 101159 103242 107690 92377
22210I2377K8382J04916m9166r4534m0215J06157L3828m5297Q9512p9062m9287
$$ 92377 120759 225675 176509 81975 41760 147917 181745 136448 225960 146898 97611
22199I7611K9339n1467j3165K5288N0285q2966N8679R5264M0463K13452m3223
$$ 97611 126950 75483 62318 87606 137891 54925 113604 208868 249331 462783 419560
22188D19560k60801M482J01880J9364q7181J8832q9499J86760n3521p4614j97316
$$ 419560 158759 163241 265121 284485 197304 216136 126637 313397 259876 185262 -12054
22177a2054j5017n0624n9095K80372K99450j84944j35165o4599j93843N9433J98562
$$ -12054 -27071 -77695 -136790 143582 443032 258088 122923 58324 -135519 -76086 122476
22166A22476p762j03115N2452J35131p964k36661o5775K12916o909K2985J7918
$$ 122476 114714 11599 64051 199182 191218 -45443 -111218 101698 94789 117774 135692
22155A35692J41130o7553j89295k51411k9852K5903N4789J04701k5762j33068
$$ 135692 276822 209269 19974 -231437 -261289 -235386 -180597 -75896 -101658 -234726
22145b34726O9848P8257J17985R9358m5549J14156R7226R0339M2124j99320o3617
$$ -234726 -164878 -86621 31364 130722 85173 199329 296555 386894 429018 229698 166081
22134A66081O1203l5506K3753N3942p049K8488J48j55435j22142M0372m8127R7583
$$ 166081 227284 191778 215531 269473 262424 290912 291060 135625 13483 53855 5728 103311
22122A03311J93235k4852k09649k15688k8741L2940q0597J2270n3291p7742K06884
$$ 103311 296546 271694 62045 -153643 -182384 -149444 -230041 -217771 -271062 -348804 -141920
22111a41920j02090j7682K64947k2969J17393J08231J13716L2588o5340k48188
$$ -141920 -244010 -261692 3255 -19714 97679 205910 319626 352214 286874 38686
22101C8686k39082j2358n286R2556P0502P4772K03579j0267L3703Q581m686m0873
$$ 38686 -200396 -212754 -218040 -125484 -54982 19790 223369 213102 246805 255386 250700 209827
22089B09827M519n9066J01011J60521m2877j73533k00382J37700M1087j67859
$$ 209827 214346 155280 256291 416812 373935 200402 20 137720 178807 10948
22079A0948j90900J2654J22324J47222N0221m8110P017L8912j8592j65732k14336
$$ 10948 -179952 -167298 -44974 102248 152469 104359 111376 150288 131696 -34036 -248372
22068b48372O7097J38714K5778m8998Q6031r0309J4312J69873J33832K508O2347
$$ -248372 -181275 -42561 -16783 -65781 20250 -70059 -55747 114126 247958 250466 312813
22057C12813j16880n3420j43806l8441J6953o9630N1886K2205R0364N4356K3832
$$ 312813 195933 142513 -1293 -39734 -22781 -92411 -40525 -18320 72044 126400 150232
22046A50232m0282L7860o6366l6509q6881J89972j01870q5044o498J53832J39347
$$ 150232 109950 147810 81444 44935 -41946 148026 46156 -38888 -45386 108446 247793
22035B47793O3627l9868l7512n2549m83p6171Q0613m2306j44587J88517K5387
$$ 247793 311420 271552 234040 181491 181008 104837 185450 143144 -1443 187074 212461
22024B12461Q6047J7029P319N4952L2822K9113j01513J60352j27480j58732j9507
$$ 212461 298508 315537 322856 377808 410630 439743 338230 498582 371102 212370 192863
22013A92863j98012j03039J67639N1380Q6679J6579M7792r5280p9773L2304m0274
$$ 192863 -5149 -108188 59451 110831 197510 214089 261881 166601 86828 119132 78858
22002G8858J07582N1794M3051J4780j06396l7835R113O2769Q2965P2517r1747
$$ 78858 186440 238234 281285 296065 189669 151834 160947 223716 306681 379198 287451
21991B87451o7176O1296J04059O5240j5642r7122p7997m6185q12q0385k00038
$$ 287451 220275 281571 385630 450870 435228 338106 260109 213924 213112 132727 -67311
21980f7311n030J43296p4424M1391M9068j17864N6647m3862R5748Q2075j754J65376
$$ -67311 -72341 70955 -3469 37922 86990 -30874 25773 -18089 77659 159734 157980 323356
21968C23356j7262k37580l0388m4337p907J16520P6271o9454n0722J56737j51778
$$ 323356 306094 68514 38126 -6211 -14118 102402 178673 109219 58497 215234 63456
21957F3456n3702J67090o7555n9420J00410J10357j19126q2779j3593n2991P4306
$$ 63456 9754 176844 109289 49869 150279 260636 141510 58731 45138 -7853 66453
21946F6453J10584R2601j9345J10227m4687J9473j72212j13828L3288J36044L4379
$$ 66453 177037 269638 250293 360520 315833 335306 163094 49266 82554 218598 252977
21935B52977j9401j78776o4645p928p6552M78j7672j0423M6884M3593N3720j7019
$$ 252977 233576 54800 -9845 -17773 -94325 -93847 -111519 -121942 -75058 -31465 22255 5236
21923E236J0079o9970Q229J46739J13678M4614P2900o8413J03997J12878j23783
$$ 5236 15315 -54655 -46426 100313 213991 258605 331505 263092 367089 479967 356184
21912C56184R787J2707j7256o0311P6725m1081k8351k0816l8727J6971n0814Q5890
$$ 356184 365971 378678 361422 301111 377836 336755 308404 287588 248861 265832 215018 300908
21900C00908K7493M0359L7944j09434j03708j78082J9553J05317J02733n8963
$$ 300908 328401 368760 406704 297270 193562 15480 35033 140350 243083 184120
21890A84120j24000q5121M0894p508J16444K15792n7431l232q9068j20954M6758
$$ 184120 60120 -25001 15893 8385 124829 340621 283190 279958 190890 69936 116694
21879A16694J053j8247K1094O3569j73169q0244J44936J50143J29796j66262m7076
$$ 116694 117747 99500 120594 184163 10994 -69250 75686 225829 355625 189363 142287
21868A42287k2129p6767Q9741J7280l5896P0423J12159o6350j98583l4247J01030
$$ 142287 120158 43391 133132 150412 114516 184939 297098 230748 32165 -2082 98948
21857I8948J26306M2610J23903q1218J13106o7333j26721m8465J2745L7021P5557
$$ 98948 225254 267864 391767 310549 423655 356322 229601 181136 193881 230902 306459
21846C06459L0272q4306k2779O7966k388K3532j03383r2141P7397M1425o2286
$$ 306459 336731 252425 229646 297612 295224 318756 215373 123232 200629 242054 179768
21835A79768l0110J49192j10859j50804l9853n3058p7421l2928N3334K09716N4327
$$ 179768 149658 298850 187991 37187 -2666 -55724 -133145 -166073 -112739 96977 151304
21824A51304j2467J25706j9188j35517J4594l8779M9087j36365m2813N2386r689
$$ 151304 138837 264543 245355 109838 124432 85653 134740 -1625 -44438 7948 -1741
21813a741J50045J3921j02594m4867n9318O8848L7467n2207R60J19019j9499R1556
$$ -1741 148304 162225 59631 14764 -44554 24294 61761 9554 10514 129533 110034 201590
21801B01590O0302K1251j8506o4566J70324j25058j69974l5587j90718L8482K39497
$$ 201590 261892 283143 264637 200071 370395 245337 75363 39776 -150942 -112460 127037
21790A27037J16726j6391j5771J38172J66817j42927p8208j27646J40964m924
$$ 127037 243763 227372 211601 349773 516590 373663 295455 167809 308773 303849
21780C03849q305n1814M8607n8932n4395K1068j04647j30958J2771K3615j4268
$$ 303849 295544 243730 292337 233405 179010 200078 95431 -35527 -22756 859 -13409
21769a3409J50588O6787Q7824L6783l9920j29416j03372Q5864J4608q2762k57420
$$ -13409 137179 203966 291790 328573 288653 159237 55865 141729 156337 73575 -183845
21758a83845J08663P9609M4677l9367Q0157Q2569K330L9720O4067o3234K0044
$$ -183845 -75182 4427 49104 9737 89894 172463 174793 214513 278580 215346 235390
21747B35390M3606l9543l0614N2511J3657L7187P639p9320p1522R002J1381k8981
$$ 235390 278996 239453 208839 261350 275007 312194 319833 240513 168991 177993 189374 160393
21735A60393J2728o592j00673l4287j54675r2442J62698o5730j60367M6877J65448
$$ 160393 173121 166529 65856 31569 -123106 -215548 -52850 -118580 -278947 -232070 -66622
21724f6622l1500J55208J50560p9492j12155J53896r9970j31293M8507J07449
$$ -66622 -98122 57086 207646 128154 15999 169895 69925 -61368 -12861 94588
21714I4588J12302P1316k0683n2899m3137P1592J84567o5482j31489O9646q0870
$$ 94588 206890 278206 257523 204624 161487 233079 417646 352164 220675 290321 209451
21703B09451J21008Q3573j07533j62814n3350O6446N8132O6655O0228l650j4994
$$ 209451 330459 414032 306499 143685 90335 156781 214913 281568 341796 338146 323152
21692C23152L5757M1765M5873j78400j19408M4071l3290m7177Q6592J03750O8223
$$ 323152 358909 400674 446547 268147 148739 192810 159520 112343 198935 302685 370908
21681C70908O6363m9089J57272k0813N8638p8821j45008q8285J93499O3719j48569
$$ 370908 437271 388182 545454 524641 583279 504458 359450 271165 464664 528383 379814
21670C79814j58572P735J16777j04229j04015L9246M2885n9108j39338j8319J79291
$$ 379814 221242 228977 345754 241525 137510 176756 219641 160533 21195 2876 182167
21659A82167K4903k52662l7085k96N5334K6161J86304J18073p9625j51887L7485
$$ 182167 207070 -45592 -82677 -82973 -27639 -1478 184826 302899 223274 71387 108872
21648A08872o5745R9326Q5576J20908l4251R844O5729j50331k8326M4525j70223
$$ 108872 43127 142453 228029 348937 314686 324530 390259 239928 211602 256127 85904
21637H5904l0384P5483O6630k3730O6195O0155j34470P2666J91973j79613j2255
$$ 85904 55520 131003 197633 173903 240098 300253 165783 238449 430422 250809 238554
21626B38554J9120p3111J03493P1319j2149k4078J33890R9294j61455p9128l3147
$$ 238554 257674 184563 288056 359375 347226 323148 457038 556332 394877 315749 282602
21615B82602Q524j53286J4141j0399J29758J0147j28396n5589n205j9429q4254
$$ 282602 291126 137840 151981 141582 271340 281487 153091 97502 92297 72868 -11386
21604a1386R2550J82377l4836L992n5954Q6025M1910P1590P3761J16219q3250
$$ -11386 81164 263541 228705 232697 176743 262768 304678 376268 450029 566248 482998
21593D82998M1666j14161j61791j74791k9431J29465R8502m6203j49801j03471
$$ 482998 524664 410503 248712 73921 44490 173955 272457 226254 76453 -27018
21583b7018N5960J92917J68775k0209K293l991r3755j02555M4114j02453o9498
$$ -27018 28942 221859 390634 370425 372718 368727 274972 172417 216531 114078 44580
21572D4580j02563J63431l4906j01397J51968Q0396n4043J29903m5886r117K4215
$$ 44580 -57983 105448 70542 -30855 121113 201509 147466 277369 231483 222366 246581
21561B46581K0208J78007L0361r6093p8875J426J88649K6064l7507r5705o2357
$$ 246581 266789 444796 475157 379064 300189 301615 490264 516328 478821 383116 320759
21550C20759j235J4823j6948k1298j48380R0652R5862J08432j2596o9118M4284
$$ 320759 319524 334347 317399 296101 147721 238373 334235 442667 430071 360953 405237
21539D05237L5713O2446O0500M5383j29621k75807P014P0129l9689j03324k6241
$$ 405237 440950 503396 563896 609279 479658 203851 210865 280994 241305 137981 111740
21528A11740n5146J29405J3669o5318M0553M344j883M8818P8236j5515M8906R4794
$$ 111740 56594 185999 199668 134350 174903 179247 177364 226182 304418 288903 337809 432603
21516D32603N5526l8151r655L6765q9741k2028Q0866J3659K953j9674m4117N1876
$$ 432603 488129 449978 440323 477088 387347 365319 446185 459844 462797 443123 399006 450882
21504D50882j74549n938J72606J09425j68700O503m8726p4046J32235J89178l8429
$$ 450882 276333 270395 443001 552426 383726 390229 341503 267457 399692 588870 550441
21493E50441n1139p3016O7796k1425J7201j34407L1504J59914J93662Q3648q2090
$$ 550441 499302 426286 494082 472657 489858 355451 386955 546869 740531 824179 742089
21482G42089L0667K8090k27579k17440K8455P8884L5898K0938J48010J48106l3247
$$ 742089 772756 800846 573267 355827 384282 463166 499064 520002 668012 816118 782871
21471G82871k4622Q5013J10913J99389K68814N1448K30990K8772J80179J24102
$$ 782871 758249 843262 954175 1153564 1422378 1473826 1704816 1733588 1913767 2037869
21461B037869J2961j18062k35821P2928J02298n7559q8027O8491J52799R6326
$$ 2037869 2050830 1932768 1696947 1769875 1872173 1814614 1726587 1795078 1947877 2044203
21451B044203l2797J59870P5012j90615k53121k39877k25461q7031r6618r9223
$$ 2044203 2011406 2171276 2246288 2055673 1802552 1562675 1337214 1250183 1153565 1054342
21441A054342j50655j36454k35478k3712q1346q3035Q2126L2078k9749j58176
$$ 1054342 903687 767233 531755 508043 426697 343662 425788 457866 428117 269941
21431B69941r3396Q774J0594K7159o501k5676L664J01423O4969L5330j30409j01607
$$ 269941 176545 185319 195913 223072 216571 190895 194559 295982 360951 396281 265872 164265
21419A64265J49184J61789k10336l1764M9950j38607K01951N1263R628n0483J81922
$$ 164265 313449 475238 264902 233138 283088 144481 346432 397695 407323 356840 538762
21408E38762O6r6092j4613m6049K3812l9584L9756P6893R4048L2119o5195j04873
$$ 538762 538828 442736 428123 382074 405886 366302 406058 482951 576999 609118 543923 439050
21396D39050j1815k141j06868j706O8124J26200M8329l9718K4533K07851J33462
$$ 439050 427235 425094 318226 316520 384644 510844 559173 519455 543988 751839 885301
21385H85301j18522k01455J25930P5295j57547j02456K3059J41944P2380m8214
$$ 885301 766779 565324 691254 766549 609002 506546 529605 671549 743929 695715
21375F95715M6567K18437j0229o6556M6195O5975Q6926J58462M324J23320m3838
$$ 695715 742282 960719 950490 883934 930129 996104 1083030 1241492 1245816 1369136 1325298
21364A325298O7246J01104j97719j36942J08194k6430r7077m2953k7485j26610
$$ 1325298 1392544 1493648 1295929 1158987 1267181 1240751 1143674 1100721 1073236 946626
21354I46626m4375j68347q9383m7524r0884J57481q137M2978J54685J64117J1652
$$ 946626 902251 733904 644521 596997 506113 663594 655457 698435 853120 1017237 1028889
21343A028889P1702n8152p4941J34482m0827q4161M6041K40080J83464k4493l0245
$$ 1028889 1100591 1042439 967498 1101980 1061153 976992 1023033 1263113 1446577 1422084 1391839
21332A391839p6676Q6349P4276k31277k38904j01601J54486N4817o4322j65600
$$ 1391839 1315163 1401512 1475788 1244511 1005607 904006 1058492 1113309 1048987 883387
21322H83387J06958L0800p7199k91833l6063L0038L743J78185J11350j66282k42289
$$ 883387 990345 1021145 943946 652113 616050 646088 649831 828016 939366 773084 530795
21311E30795l3538L8636N6865L8825j46631m6743o1647N3186J84844q508m2480
$$ 530795 497257 535893 592758 631583 484952 438209 376562 429748 614592 606084 563604
21300E63604M8785J5972J9409K2212j7024l117o9101J1132j43163r6822l7406
$$ 563604 612389 628361 647770 669982 652958 649841 580740 591872 448709 351887 314481
21289C14481R8326K5464J15667J18258n6129k8693J0852J8722m7631J6884Q0396
$$ 314481 412807 438271 553938 672196 616067 587374 598226 616948 569317 586201 666597
21278F66597O9610L542P2966r6988l9120J19829J7044o6728Q5180j30955j6862
$$ 666597 736207 739749 812715 715727 676607 796436 813480 746752 831932 700977 684115
21267F84115J03964R1672j19939j49463M5942K67109Q7709L8375m616j13225j19128
$$ 684115 788079 879751 759812 610349 656291 923400 1011109 1049484 1044868 931643 812515
21256H12515K082K00003L64396J43290J60201J31633N7354J91249M64176N59313
$$ 812515 814597 1014600 1378996 1522286 1682487 1814120 1871474 2062723 2526899 3086212
21246C086212M59833O15770R92797J363743J775062K180240K225987J816734J498297
$$ 3086212 3546045 4161815 5154612 6518355 8293417 10473657 12699644 14516378 16014675
21237A6014675J387020J337958Q01510L69761O97205J571080K196864J973350
$$ 16014675 17401695 18739653 19541163 19910924 20608129 22179209 24376073 26349423
21229B6349423J634383J078921l6443j392908j873549j987762j903373j146728
$$ 26349423 27983806 29062727 29026284 27633376 25759827 23772065 21868692 20721964
21221B0721964j99886l32004p57785j133846j215775j352869j897049k567495
$$ 20721964 20522078 20190074 19432289 18298443 17082668 15729799 13832750 11265255
21213A1265255k631604k189984j361616r06722n49353m75298m73035m19333l57743
$$ 11265255 8633651 6443667 5082051 4175329 3625976 3150678 2677643 2258310 1900567
21204A900567j78967j83495J9052m63j59302j94011q1645J0075r8420k19230j38625
$$ 1900567 1721600 1538105 1557157 1556694 1397392 1203381 1121736 1131811 1033391 814161 675536
21193F75536m529J53458J61248J7298o2065l8415J8589N8958n9331J41800O8789
$$ 675536 671007 824465 985713 1003011 940946 902531 921120 980078 920747 1062547 1131336
21182A131336j84045l8463J11035P2734l7414j1710j39480O1283Q5099r7751O9822
$$ 1131336 947291 908828 1019863 1092597 1055183 1043473 903993 965276 1050375 952624 1022446
21171A022446m2654j21841q5933J02412P2019m2733j3148j6705k5495k06843k09286
$$ 1022446 979792 857951 772018 874430 946449 903716 890568 873863 848368 641525 432239
21160D32239J06757J86597K43741m3265m2964j53738j19926l4662m2793j22682
$$ 432239 538996 725593 969334 926069 883105 729367 609441 574779 531986 409304
21150D09304j01967M5046j8063j32799m967J33312J66280L2383m5295K52632J83554
$$ 409304 307337 352383 334320 201521 196554 329866 496146 528529 483234 735866 919420
21139I19420p6704m8710J27487k0937j56968k5460j7470J75434L1588j33270j30355
$$ 919420 842716 794006 921493 900556 743588 718128 700658 876092 907680 774410 644055
21128F44055l3518j438j07301r722l5987J52309K41991J4812k7998J04114J31846
$$ 644055 610537 609099 501798 492076 456089 608398 850389 865201 837203 941317 1073163
21117A073163o3756Q211j0392q7134K5287O9775j5927J32166K11343P3160j17649
$$ 1073163 1009407 1017618 1007226 920092 945379 1015154 999227 1131393 1342736 1415896 1298247
21106A298247j01625O4453J8018j25959N01r1058P4179l3541J61591O3368k5351
$$ 1298247 1196622 1261075 1279093 1153134 1153635 1062577 1136756 1103215 1264806 1328174 1302823
21095A302823J49157J58578j7531R4906J77982J28857q9663M6105J21065K34405
$$ 1302823 1451980 1610558 1593027 1687933 1865915 1994772 1905109 1951214 2072279 2306684
21085B306684Q6303K6235K15279K17777M22082N20317P28005R71726Q47438J219867
$$ 2306684 2392987 2419222 2634501 2852278 3274360 3794677 4522682 5494408 6341846 7561713
21075G561713J220459R44942P49300L06582R9037J16941N13756J002136J516086
$$ 7561713 8782172 9727114 10476414 10782996 10882033 10998974 11512730 12514866 14030952
21066A4030952J467429N76875m94866j160820j643908j314744o92000k24948L9110
$$ 14030952 15498381 16075256 15580390 14419570 12775662 11460918 10768918 10543970 10583080
21057A0583080j20339o67747r27448j106206j155215r27613o69045l01211k94233
$$ 10583080 10462741 9794994 8867546 7761340 6606125 5678512 5009467 4708256 4414023
21048D414023j06585J21870J5233k0425m4739J19458M51239L82337N89506Q92282
$$ 4414023 4307438 4429308 4444541 4424116 4379377 4498835 4950074 5332411 5921917 6814199
21038F814199R44794J360449J345196Q34784K73145j0463J9571O70034J279405
$$ 6814199 7758993 9119442 10464638 11299422 11572567 11562104 11581675 12251709 13531114
21029A3531114J588598J508131Q85638k75502j168660j624898j656203r46558
$$ 13531114 15119712 16627843 17513481 17237979 16069319 14444421 12788218 11841660
21021A1841660m62248j26244j55991m36000r09430j378468j124122r54654p41655
$$ 11841660 11379412 11253168 11097177 10661177 9751747 8373279 7249157 6294503 5552848
21012E552848o13884o13880m15250r0465k69708l91641l5077j06423k73727n4138
$$ 5552848 4938964 4325084 3909834 3819369 3549661 3158020 3122943 3016520 2742793 2688655
21002B688655J99577J22914l7031l8557j76847k42880k32894j69097l9552O7973
$$ 2688655 2888232 3011146 2974115 2935558 2758711 2515831 2282937 2113840 2074288 2142261
20992B142261p933q8833k4052n3918j14402O6922o7549k02392j70091R701p9949
$$ 2142261 2134328 2045495 2021443 1967525 1853123 1920045 1852496 1650104 1480013 1489714 1409765
20981A409765j87087o868J10369R1101j2804j1489l0138J00774K15163K5986k37476
$$ 1409765 1222678 1215810 1326179 1417280 1404476 1392987 1362849 1463623 1678786 1704772 1467296
20970A467296j29754J01187K73130J42694o8692o2734o5635o9549R6946J85507
$$ 1467296 1337542 1438729 1711859 1854553 1785861 1723127 1657492 1587943 1684889 1870396
20960A870396N8952J9875q0849j60806j29964J75105Q7391R4405J21746K6830
$$ 1870396 1929348 1949223 1868374 1707568 1577604 1752709 1840100 1934505 2056251 2083081
20950B083081R5471K48373J37605k1901k14185j74667j16521M9032J51281K71752
$$ 2083081 2178552 2426925 2564530 2542629 2328444 2153777 2037256 2086288 2237569 2509321
20940B509321P7249j44051P9052K813k03387r1656r4177l3876M4978p1760O818
$$ 2509321 2586570 2442519 2521571 2524384 2320997 2229341 2135164 2101288 2146266 2074506 2081324
20929B081324p1520o5627O8002m5766J6036Q2568J03920N1494R3537J17193O9721
$$ 2081324 2009804 1944177 2012179 1966413 1982449 2065017 2168937 2220431 2313968 2431161 2500882
20918B500882J1543L4127o9329J63530J14750j19877j10575J99095K12024M9770
$$ 2500882 2512425 2546552 2477223 2640753 2755503 2635626 2525051 2724146 2936170 2985940
20908B985940J58959K394j63940K09790K87300J48942Q2691J6952P1244J99664
$$ 2985940 3144899 3147293 2983353 3193143 3480443 3629385 3712076 3729028 3800272 3999936
20898C999936K58175K14143J93617J85717K41399J15527J68881K03081K46934
$$ 3999936 4258111 4472254 4665871 4851588 5092987 5208514 5377395 5580476 5827410
20889E827410K24615L05024J56733K98777M79883N83600N34952M80405P56059
$$ 5827410 6052025 6357049 6513782 6812559 7292442 7876042 8410994 8891399 9647458
20880I647458P35433Q85838J089717J125951J221531J223315J376597J380224
$$ 9647458 10382891 11268729 12358446 13484397 14705928 15929243 17305840 18686064
20872A8686064J904685K394833K812557L481022M355322N575643P322607R845814
$$ 18686064 20590749 22985582 25798139 29279161 33634483 39210126 46532733 56378547
20864E6378547J3416329J8291325K3558887K7813382K9662713K9466310K8510360
$$ 56378547 69794876 88086201 111645088 139458470 169121183 198587493 227097853
20857B27097853K8125516K5699447J8774498O856265n106516r914694o763086
$$ 227097853 255223369 280922816 299697314 306553579 301447063 291532369 284769283
20850B84769283j611471O40585M23066J294819M472803Q732558J0952648P318355
$$ 284769283 283157812 283798397 284221463 285516282 289989085 298721643 309674291 316992646
20842C16992646l940477j8453133k8047810k9611006k8762853l0045953l2054738
$$ 316992646 313052169 294599036 266551226 236940220 208177367 178131414 146076676
20835A46076676l0695355k5681811j9440481j3741754r880341p344915n505247
$$ 146076676 115381321 89699510 70259029 56517275 46636934 39292019 33786772
20828C3786772m137447l318995k717168k159519j890113j467515j290214j234056
$$ 33786772 29649325 26330330 23613162 21453643 19563530 18096015 16805801 15571745
20820A5571745j154517j156446r52973q25435n74936l87327m30108l41614m25177
$$ 15571745 14417228 13260782 12307809 11482374 10907438 10520111 10090003 9748389 9323212
20811I323212m09543l57596k97173j72541j52334P9622O6598L24415L11252L6210
$$ 9323212 8913669 8556073 8258900 8086359 7934025 8013647 8080245 8404660 8715912 8752122
20801H752122K635O0055L63267K99037K10117M82022O66812O37051O42194N66938
$$ 8752122 8754757 8814812 9178079 9477116 9687233 10169255 10836067 11473118 12115312 12682250
20791A2682250O66537P08294Q47978P60357N96686Q94161R82986J232765J380266
$$ 12682250 13348787 14057081 14905059 15665416 16262102 17156263 18139249 19372014 20752280
20782B0752280J418585J568834K156825K596016L064196L942064M801863O178296
$$ 20752280 22170865 23739699 25896524 28492540 31556736 35498800 40300663 46478959
20774D6478959P713585R674432J2060703J4363236J5626275J4598949J1598021
$$ 46478959 54192544 63866976 75927679 90290915 105917190 120516139 132114160
20767A32114160Q246743O292847O053526N777255M698579L472075K455007J041988
$$ 132114160 140360903 146653750 152707276 158484531 163183110 166655185 169110192 170152180
20759A70152180j649999m722603o394440o709561p378319j0147911j3216595j5007145
$$ 170152180 168502181 163779578 157385138 150675577 143297258 133149347 119932752 104925607
20751A04925607j4591422j2515494r744016p321629n404086l652577k384262j102535
$$ 104925607 90334185 77818691 68074675 60753046 55348960 51696383 49312121 48209586
20743D8209586o2294Q60991J789447L232775M709871O412272Q701642J1197877
$$ 48209586 48147292 49008283 50797730 54030505 58740376 65152648 73854290 85052167
20735H5052167J3951041J5742724J5282733J2313801Q565495O337186N917106
$$ 85052167 99003208 114745932 130028665 142342466 150907961 157245147 163162253
20728A63162253N761353M492440K362628P89599m88861k905551n457551p057954
$$ 163162253 168923606 173416046 175778674 176568273 176079412 173173861 167716310 160658356
20720A60658356p522553q351142j0717050j4269339j6519697j6355483j4600187
$$ 160658356 153135803 144784661 134067611 119798272 103278575 86923092 72322905
20713G2322905j2170180r719001p590799n942965m854893l804975l111620k547434
$$ 72322905 60152725 50433724 42842925 36899960 32045067 28240092 25128472 22581038
20705B2581038k222977k037339j747626j351760j164631j126077j004858q79340
$$ 22581038 20358061 18320722 16573096 15221336 14056705 12930628 11925770 11046430
20697A1046430q89178p02264p07324n74731m93143o00054n41015n57624l24759
$$ 11046430 10157252 9454988 8747664 8172933 7679790 7079736 6538721 5981097 5656338
20688E656338k89329l87590k48814k88012k19335j40975k49066l22062j80316
$$ 5656338 5367009 4979419 4730605 4442593 4223258 4082283 3833217 3511155 3330839
20679C330839k19272q1425Q2533p4268o6369M5105p9382j56076j18838m8185K5586
$$ 3330839 3111567 3030142 3112675 3038407 2972038 3017143 2937761 2781685 2662847 2614662 2640248
20668B640248r3275q8853l6066j20324j90890n4189n8169R6273K0646l8484M8977
$$ 2640248 2546973 2458120 2422054 2301730 2110840 2056651 1998482 2094755 2115401 2076917 2125894
20657B125894p0664m0250K5327J22813j5773L0220l1692j16289p0125j00904K2112
$$ 2125894 2055230 2014980 2040307 2163120 2147347 2177567 2145875 2029586 1959461 1858557 1880669
20646A880669j49445r5824M5794P253j40719j02722Q8438J04401N1918J30306
$$ 1880669 1731224 1635400 1681194 1688447 1547728 1445006 1533444 1637845 1689763 1820069
20636A820069j93627k34099m267k3684L6037Q2882L6051J19593P5998j04447K8848
$$ 1820069 1626442 1392343 1388076 1364392 1400429 1483311 1519362 1638955 1714953 1610506 1639354
20625A639354q5284j58013K321J8332q5630L196r0348N0440p6345r0704p3064
$$ 1639354 1554070 1396057 1398378 1416710 1331080 1334276 1243928 1294368 1218023 1127319 1054255
20614A054255l6591J15893K42869j42021j84012n0603j0476J58962O0507j9681
$$ 1054255 1017664 1133557 1376426 1234405 1050393 999790 989314 1148276 1208783 1189102
20604A189102j01914k22674m2717J58883J23368n7057o5962K8136J50323o592
$$ 1189102 1087188 864514 821797 980680 1104048 1046991 981029 1009165 1159488 1152896
20594A152896J01876M9536m8779r8441j55385m9237L09J40249Q6286R7456J5688
$$ 1152896 1254772 1304308 1255529 1157088 1001703 952466 952775 1093024 1179310 1276766 1292454
20583A292454j74231m8799N2748J77037l8892r3164q4078p8856O0251m2345j24098
$$ 1292454 1118223 1069424 1122172 1299209 1260317 1167153 1083075 1004219 1064470 1022125 898027
20572H98027m5852j7499J5661K21556L5282M9739j15160m8574K0430J01031l5154
$$ 898027 852175 834676 850337 1071893 1107175 1156914 1041754 993180 1013610 1114641 1079487
20561A079487k8120r3054j31233O3727M3144P6272J84960J32170K4047L5301k0030
$$ 1079487 1051367 958313 827080 890807 933951 1010223 1195183 1327353 1351400 1386701 1366671
20550A366671j71831m0465j5432k23077j09786K2170J55865J2661J8007K09993
$$ 1366671 1194840 1154375 1138943 915866 806080 828250 984115 996776 1014783 1224776
20540A224776N0140J40736r8777k27391M8878K366k8987j35385L996P3282K2377
$$ 1224776 1274916 1415652 1316875 1089484 1138362 1140728 1111741 976356 980352 1053634 1076011
20529A076011J04187J2035p4223p989Q3260j20629k38496J0147j3326q7122k3467
$$ 1076011 1180198 1192233 1118010 1110021 1193281 1072652 834156 844303 830977 743855 720388
20518G20388K29769J97156k4391J13306K53262K19175K15069J5979n3160o4249
$$ 720388 950157 1147313 1122922 1236228 1489490 1708665 1923734 1939713 1886553 1822304
20508A822304Q1351J35973J10628N5295Q8124J75972J80974J95329R4045J17913
$$ 1822304 1903655 2039628 2150256 2205551 2293675 2469647 2650621 2845950 2939995 3057908
20498C057908K92640K39274J98904J95428K26127L23973K84243L30756K71528
$$ 3057908 3350548 3589822 3788726 3984154 4210281 4534254 4818497 5149253 5420781
20489E420781M31799O71377N37263N02446O74207R55801Q93178R22107J124203
$$ 5420781 5852580 6523957 7061220 7563666 8237873 9193674 10086852 11008959 12133162
20480A2133162J718113K181520K482784L162210M432308O308275R331663J3762494
$$ 12133162 13851275 16032795 18515579 21677789 26110097 32418372 41750035 55512529
20472E5512529J9746614K4347510K2436910J1583618l002551j0806233r652372
$$ 55512529 75259143 99606653 122043563 133627181 130624630 119818397 110166025
20465A10166025l497501M721310J4089097K2195803K4093171J7086834O335848
$$ 110166025 106668524 111389834 125478931 147674734 171767905 188854739 195190587
20458A95190587j893519r604554j9066726k4156360k1258879j3747772m626191
$$ 195190587 193297068 183692514 164625788 140469428 119210549 105462777 100836586
20451A00836586M365546J0835640J0872677J241196j3797428k3393550k2522670
$$ 100836586 105202132 116037772 126910449 128151645 114354217 90960667 68437997
20444F8437997j6881847j1486436p435904m779268l305284k516079j817307j130495
$$ 68437997 51556150 40069714 32633810 27854542 24549258 22033179 20215872 19085377
20436A9085377o56634m03998J27475k1168L12030O94702R17509J257874J806205
$$ 19085377 18428743 18024745 18152220 18131052 18443082 19137784 20055293 21313167 23119372
20427B3119372K393895L187280M753213O800122J0274515J5272875K2280835K7575799
$$ 23119372 25513267 28700547 33453760 40253882 50528397 65801272 88082107 115657906
20419A15657906K5488851J2555449m562298j3741491j2043373n065897M701629
$$ 115657906 141146757 153702206 149139908 135398417 123355044 118289147 122990776
20412A22990776J5340234K3631809K5220324J8531381Q547167K79261r516291
$$ 122990776 138331010 161962819 187183143 205714524 214261691 214540952 205024661
20405B05024661k2137230k9088796k5216955j5605086m804865N035063J1759606
$$ 205024661 182887431 153798635 128581680 112976594 108171729 113206792 124966398
20398A24966398J1009532m61799j6720938k6000248k4471072j8285876j2470435
$$ 124966398 135975930 135514131 118793193 92792945 68321873 50035997 37565562
20391C7565562q309736n741679m131462l122846k290979j606127j439347j235161
$$ 37565562 29255826 23514147 19382685 16259839 13968860 12362733 10923386 9688225
20383I688225j060276q53296o24815n73785l99057l46959k24917l52223l62716
$$ 9688225 8627949 7774653 7149838 6576053 6176996 5830037 5605120 5252897 4890181
20374D890181m34430n66359l57737k36523j51620k78298k81982M3069l0934l57154
$$ 4890181 4455751 3889392 3531655 3295132 3143512 2865214 2583232 2626301 2595367 2238213
20364B238213m06637p6542j55054n5767Q145Q2726O4283j94671o1325J2886R795
$$ 2238213 1831576 1755034 1599980 1544213 1552358 1635084 1699367 1504696 1443371 1456257 1466052
20353A466052K9807k1817k30607k911r8230q3922j07192q0351k4346J7120K17473
$$ 1466052 1495859 1474042 1243435 1240524 1142294 1058372 951180 870829 846483 863603 1081076
20342A081076M879J34472P9384L3621n1202K9433N9088N9638j55490j52941k6603
$$ 1081076 1085955 1220427 1299811 1333432 1282230 1311663 1370751 1430389 1274899 1121958 1095355
20331A095355J05088L7558o6757J12789R0990j2046m9187j21722k56261j01137
$$ 1095355 1200443 1238001 1171244 1284033 1375023 1362977 1313790 1192068 935807 834670
20321H34670k5085l8314P4030J47961k24163m512j62351j43293r0902L7396j47885
$$ 834670 809585 771271 845301 993262 769099 764587 602236 458943 368041 405437 257552
20310B57552j44182l1628o2686J8404R9192K38190O3089l63716q8412J79997L8111
$$ 257552 113370 81742 19056 37460 136652 374842 437931 74215 -14197 165800 203911
20299B03911J1068M3388j7048n3027j48648l2258q017J08232L3386N3650l3736
$$ 203911 214979 258367 241319 188292 39644 7386 -631 107601 140987 194637 160901
20288A60901J60662J28826l0230N9926J62479L1559k52961n5945O3424j4156q0824
$$ 160901 321563 450389 420159 480085 642564 674123 421162 365217 428641 414485 333661
20277C33661r5041j50414n085l396l8110J57132J42219j55202N1055O252l9229
$$ 333661 238620 88206 83121 79725 41615 198747 340966 185764 236819 243071 203842
20266B03842q0674j49586P2882P4934K8223j00661m6966J4987j0966j4599l9866
$$ 203842 123168 -26418 46464 121398 149621 48960 1994 16981 6015 -8584 -48450
20255d8450k4144M692J05262J79309K06995J82898J43876J2178J8660J73721K65373
$$ -48450 -72594 -67902 37360 216669 423664 606562 750438 762616 781276 954997 1220370
20244A220370L7774p3590K5180J67758l7163m3706M6523M8480k1350j2992N0905
$$ 1220370 1258144 1184554 1209734 1377492 1340329 1296623 1343146 1391626 1370276 1357284 1408189
20233A408189j17426J0907J34341j07202j42009j49409k30246o0804J10884p6256
$$ 1408189 1290763 1301670 1436011 1328809 1186800 1037391 807145 746341 857225 780969
20223G80969j59768j05402K4869j82799o7546j2720k3316p7921q5911o3181J72663
$$ 780969 621201 515799 540668 357869 290323 277603 254287 176366 90455 27274 199937
20212A99937L1874k12072P8811J63511Q68k8278n5315J0059R142l0240O353o8880
$$ 199937 231811 19739 98550 262061 262929 234651 179336 189395 198537 168297 174650 105770
20200A05770R4317p0300j29350Q0102j2098O6392O2823j25841o2747Q5583k4355
$$ 105770 200087 129787 437 80539 68441 134833 197656 71815 9068 94651 70296
20189G0296r6834R2376j22891l6210m7609L3968m741M7807J56893J85997p0775
$$ 70296 -26538 65838 -57053 -93263 -140872 -106904 -111645 -63838 93055 279052 208277
20178B08277j46681k032J68068J45157J34097j5484p9017k10456J4607k6705M8272
$$ 208277 61596 59564 227632 372789 506886 491402 412385 201929 216536 189831 238103
20167B38103J16906J03341r2638j3721J52807J75210J922j33084k0257R7292k6358
$$ 238103 355009 458350 365712 351991 504798 680008 681930 548846 528589 625881 599523
20156E99523J47676J58488J03416K268k0659J24980M1943M0947j3580k01667j8871
$$ 599523 747199 905687 1009103 1011371 990712 1115692 1157635 1198582 1185002 983335 964464
20145I64464r9511k30424q1954J50904R094n3466l6247o1977m026L5505k9617
$$ 964464 864953 634529 552575 703479 712573 659107 622860 560883 556857 592362 562745
20134E62745j99216m1128J1136J20547k1981o8464k8536N0137K685K0969L50258
$$ 562745 363529 322401 333537 454084 432103 363639 335103 385240 387925 408894 759152
20123G59152K47707p5333j10066R0227Q2690J2172J28o121k4988p2380Q3190Q9789
$$ 759152 1006859 931526 821460 911687 994377 1006549 1006677 1000556 975568 903188 986378 1076167
20111A076167j26656M2528M2629j36277q8253M3042p1344p8864l0051J85420n3645
$$ 1076167 949511 992039 1034668 898391 810138 853180 781836 702972 672921 858341 804696
20100H04696k17528r3037j20968j93513j05765J12076k16199j37407J0457J99514
$$ 804696 587168 494131 373163 179650 73885 185961 -30238 -167645 -157188 42326
20090D2326J7497j26909J12110j3794l01568q0645r2658n80Q602M6094J11913
$$ 42326 59823 -67086 45024 31230 -270338 -350983 -443641 -444221 -435619 -389525 -277612
20079b77612N3707n3964N6022J38565R6696O0162j98453j51281k5231k9782Q0919
$$ -277612 -223905 -277869 -221847 -83282 13414 73576 -124877 -276158 -301389 -331171 -250252
20068b50252J58708J61951j24625n624K24358J13749r7107k09538j4393m734k0221
$$ -250252 -91544 70407 -54218 -59842 164516 278265 181158 -28380 -42773 -47507 -67728
20057f7728J03405j37517M6391P8970j25959k892J38562k21630j41358N0667j8549
$$ -67728 35677 -101840 -55449 23521 -102438 -105330 33232 -188398 -329756 -279089 -297638
20046b97638J13175J41044j1414N9677J78118J54495l0819L5451M8909M9426N4949
$$ -297638 -184463 -43419 -54833 4844 182962 337457 306638 342089 390998 440424 495373
20035D95373K12088J63021L3144j45071J30892J11147j36873k21371j04922j10403
$$ 495373 707461 870482 903626 758555 889447 1000594 863721 642350 537428 427025
20025D27025j38205l7673j10000J29478o0900m4467j9800o6265r9847j01203R5609
$$ 427025 288820 251147 141147 270625 209725 165258 145458 79193 -20654 -121857 -26248
20014b6248J73002J1402p7520K6414j27704j16167P2596N1874O3835J28469J87939
$$ -26248 146754 158156 80636 107050 -20654 -136821 -64225 -12351 51484 179953 367892
20003C67892J59389l3260K7879l7188N5754R3980L6420O7093j41085J8474j9976
$$ 367892 527281 494021 521900 484712 540466 634446 670866 737959 596874 615348 595372
19992E95372j25482N3189l2028m5350o3085J81014K32579O1044j67652o9534o2754
$$ 595372 469890 523079 491051 445701 382616 563630 796209 857253 689601 620067 557313
19981E57313J61100M2282M8182M9546M9266j95437j77588M7736j24908k06749
$$ 557313 718413 760695 808877 858423 907689 712252 534664 582400 457492 250743
19971B50743k5044J04163O1987N2155K3560j79765j98492j09021P7399r5408j22581
$$ 250743 225699 329862 391849 444004 467564 287799 89307 -19714 57685 -37723 -160304
19960a60304J60298J57448r1140R4227L4880o0261O2460J63050j04849J13057
$$ -160304 -6 157442 66302 160529 195409 135148 197608 360658 255809 368866
19950C68866R4147K8442O0304J03671m2626j51844k3681N9681P7312N076n4345
$$ 368866 463013 491455 551759 655430 612804 460960 437279 496960 574272 579348 525003
19939E25003K7897m8985q5092N9217n8515k23455k2021J26809r8602R5976M6447
$$ 525003 552900 503915 418823 478040 419525 196070 174049 300858 202256 298232 344679
19928C44679J9583P9481K0674j2299J81717J12355k4557j55173k19651j47644
$$ 344679 364262 443743 464417 452118 633835 746190 721633 566460 346809 199165
19918A99165K9707J97784J91168K08298J01446r9081k69661J21714K19886l8541
$$ 199165 228872 426656 617824 826122 927568 828487 558826 680540 900426 861885
19908H61885r0567j42226j07291k9076R3799N0818k7859o6477p6317r1559j6624
$$ 861885 771318 629092 521801 492725 586524 637342 609483 543006 466689 375130 358506
19897C58506l8296K1103n3982J4131N478J11505J14697p3769j10071N2432O9229
$$ 358506 320210 341313 287331 301462 306940 418445 533142 459373 349302 401734 470963
19886D70963N0696J10216K5090J3739J27146O8626j60910j10233J2288K04423
$$ 470963 521659 631875 656965 670704 797850 866476 705566 595333 607621 812044
19876H12044L17264J86071r2904J51415r210j03049j05423K8707J38462J19519
$$ 812044 1129308 1315379 1222475 1373890 1364680 1261631 1156208 1184915 1323377 1442896
19866A442896Q8652N5971J21987M4524o0827j8590q4082O9570j83983l3956J9600
$$ 1442896 1531548 1587519 1709506 1754030 1693203 1674613 1590531 1660101 1476118 1442162 1461762
19855A461762k56207j18225p6114k72736j42065r9666l3314L5835L5824j34285
$$ 1461762 1205555 1087330 1011216 738480 596415 496749 463435 499270 535094 400809
19845D00809j41267J01276J20899J53881k3387j32794m1751J2761J25815q5059
$$ 400809 259542 360818 481717 635598 612211 479417 437666 450427 576242 491183
19835D91183l1757K7582L1638J7771K16840L90612K16427K51856L51194O58811
$$ 491183 459426 487008 518646 536417 753257 1143869 1360296 1612152 1963346 2622157
19825B622157J166948K058764J751633o33162j750548j539335j060974m31930
$$ 2622157 3789105 5847869 7599502 6966340 5215792 3676457 2615483 2183553
19817B183553m45186k18629k48049r9392j2258k4416p6011q1542N0276M6873j41994
$$ 2183553 1738367 1519738 1271689 1172297 1160039 1135623 1059612 978070 1028346 1075219 933225
19806I33225p5367N5966L0794j32433j49253l3831n9681k0484M482m0198j02472
$$ 933225 857858 913824 944618 812185 662932 629101 569420 548936 553418 513220 410748
19795D10748j5160l3151j36956j279q6803M5927N566k13160j55777r1201j19641
$$ 410748 395588 362437 225481 224202 137399 183326 188892 -24268 -180045 -271246 -390887
19784c90887O0553O107R0963k1496L14502J60530L3859j84052m6751O1583P302
$$ -390887 -330334 -324227 -233264 -254760 59742 220272 254131 70079 23328 84911 92213
19773I2213M0185j5595J69698n7557n0869K8444m5965Q2970L3158o2543K5279
$$ 92213 132398 116803 286501 228944 178075 206519 160554 243524 276682 214139 239418
19762B39418j3739o0319j10422J26106R1206R5055o5368j05553M1116J70664J8937
$$ 239418 225679 165360 54938 181044 272250 367305 301937 196384 237500 408164 427101
19751D27101o386k50000k88965M7971K0833J25004Q8626K6938k2366j2139N9990
$$ 427101 420715 170715 -118250 -70279 -49446 75558 164184 191122 168756 156617 216607
19740B16607j08192M1103M3576R2475k1638j61736j34326r0066J58108M7213l7931
$$ 216607 108415 149518 193094 285569 263931 102195 -32131 -122197 35911 83124 45193
19729D5193P0545J79939O6375r8558J0134j56006o6518L4241J48399J16374J40243
$$ 45193 115738 295677 362052 263494 273628 117622 51104 85345 233744 350118 490361
19718D90361l3038k02883j21397m7305k2796n6716J26186N8508l3096J9984j3507
$$ 490361 457323 254440 133043 85738 62942 6226 132412 190920 157824 177808 164301
19707A64301J4016J5933p1865R2287J12617l1828r5128m4329m3803m2160Q2879
$$ 164301 178317 194250 122385 214672 327289 295461 200333 156004 112201 70041 152920
19696A52920J38246P4694l1688j31731j54918J24644J48967k9927J68354N5248
$$ 152920 291166 365860 334172 202441 47523 172167 321134 291207 459561 514809
19686E14809J6790n4559j1940p3594k9187q9147J83159N7512p0240M3221M96J00052
$$ 514809 531599 477040 465100 391506 362319 273172 456331 513843 443603 486824 487320 587372
19674E87372J18466Q3295p4451M956n6896j07792q8230J77293j08960r6434J54254
$$ 587372 705838 789133 714682 719638 662742 554950 466720 644013 535053 438619 592873
19663E92873J16299o8925n6117k231M338J26145N080n4334j85364J4232l7807
$$ 592873 709172 640247 584130 581899 586237 712382 717462 663128 477764 491996 454189
19652D54189j62858m2434P6215P7621N6042J02224Q0544j35504k5768L3867Q8160
$$ 454189 291331 248897 325112 402733 458775 560999 641543 506039 480271 514138 602298
19641F02298j07456k4088Q6958Q716O557M6706K46494j7196j69731O2440J33382
$$ 602298 494842 470754 557712 566428 572985 619691 866185 848989 679258 741698 875080
19630H75080K0004J35160J17755r2597r8662k3848J15881J12011j9028J09341
$$ 875080 895084 1030244 1147999 1055402 956740 932892 1048773 1160784 1141756 1251097
19620A251097O1813J90327J81862N6051J36639L17517K39352K99143L24897N08005
$$ 1251097 1312910 1503237 1685099 1741150 1877789 2195306 2434658 2733801 3058698 3566703
19610C566703O10046Q22693J141564J266524J285969J341880P53803K14885K82327
$$ 3566703 4176749 4999442 6141006 7407530 8693499 10035379 10789182 11004067 11286394
19601A1286394r2897o19816q62486j114371j393886j301848p72865q38556o41783
$$ 11286394 11193497 10573681 9711195 8596824 7202938 5901090 5128225 4289669 3647886
19592C647886l02942j60067q1298j21085l5131j36704k94796j56163L9036L5522
$$ 3647886 3344944 3184877 3103579 2982494 2947363 2810659 2515863 2359700 2398736 2434258
19582B434258J16335J13396n2893J35991Q1059K20067J70145J83190M26547N35191
$$ 2434258 2550593 2663989 2611096 2747087 2828146 3048213 3218358 3401548 3828095 4363286
19572D363286O83510Q90823J014666J270994J246442J183054J037156P19611L59580
$$ 4363286 5046796 5937619 6952285 8223279 9469721 10652775 11689931 12409542 12769122
19563A2769122J23912k45525n87204n64922n58688k47834J83324L79884M43814
$$ 12769122 12893034 12647509 12060305 11495383 10936695 10688861 10872185 11252069 11695883
19554A1695883M89284K02503r1926k72359n94962r01479r31544j277886j248375
$$ 11695883 12185167 12387670 12295744 12023385 11428423 10526944 9595400 8317514 7069139
19545G069139r79134p42474o77540m11838j87639k56853k02172j31003j56629
$$ 7069139 6090005 5347531 4669991 4258153 4070514 3813661 3611489 3480486 3323857
19536C323857k86303o4193J83042J87760k8873m6777J67107K19926j8934R9001
$$ 3323857 3037554 2973361 3156403 3344163 3315290 3268513 3435620 3655546 3636612 3735613
19526C735613L71899K27961L06969N62801N00676O94899Q41865J076640J089080
$$ 3735613 4107512 4335473 4642442 5205243 5705919 6400818 7242683 8319323 9408403
19517I408403J225021J011596P16709L51778J7992j60521n24290q54268r74289
$$ 9408403 10633424 11645020 12361729 12713507 12731499 12570978 12046688 11192420 10218131
19508A0218131p49263n17536l11795j69255K3335j2750J60323L05197M21195N36031
$$ 10218131 9468868 8951332 8639537 8470282 8493617 8480867 8641190 8946387 9367582 9903613
19498I903613P31248R73845J087261J426906J650624K051657K611125L275847
$$ 9903613 10634861 11608706 12695967 14122873 15773497 17825154 20436279 23712126
19490B3712126M698023O388879Q591475J1748038J6304625K1344419K3730624
$$ 23712126 28410149 34799028 43390503 55138541 71443166 92787585 116518209
19483A16518209J9767645J0727836L277922P83079k26981n862303j5205372k1732177
$$ 116518209 136285854 147013690 150291612 151074691 150847710 144985407 129780035 108047858
19475A08047858k1893267j8355864j3750532r714944o994425n087917l864103
$$ 108047858 86154591 67798727 54048195 44333251 37338826 32250909 28386806
19468B8386806k809227j763256j077668q77248n00957k79377L2844K96610N94913
$$ 28386806 25577579 23814323 22736655 21859407 21358450 21079073 21111917 21408527 22003440
19459B2003440Q95492J237153J726475K313458L094535M340306N598346P787902
$$ 22003440 22898932 24136085 25862560 28176018 31270553 35610859 41209205 48997107
19451D8997107J0835894J5029255J9600125K2056364J9388741J1455094L680032
$$ 48997107 59833001 74862256 94462381 116518745 135907486 147362580 151042612
19444A51042612J172318R38268l326410j1520787j7773800j7732316j2739586
$$ 151042612 152214930 153153198 149826788 138306001 120532201 102799885 90060299
19437I0060299o209369R90410P789686J3941021J7299574J4619587P274674P84340
$$ 90060299 83850930 84841340 92631026 106572047 123871621 138491208 145765882 146550222
19429A46550222p32696j163651o232095j4870943k0624638k0720073j7228110
$$ 146550222 145817526 144653875 138421780 123550837 102926199 82206126 64978016
19422F4978016j2746947r253823o700466m984529l804729k831187k107254j383576
$$ 64978016 52231069 42977246 36276780 31292251 27487522 24656335 22549081 21165505
19414B1165505j017230p00350l39909k23637K7916K64018N57471R69353J368041
$$ 21165505 20148275 19447925 19108016 18884379 18912295 19176313 19733784 20703137 22071178
19405B2071178J751003K373061L353543M575480O740049R383514J3179385J7570506
$$ 22071178 23822181 26195242 29548785 34124265 40864314 50247828 63427213 80997719
19397H0997719J9904059J7124200R404829J921025l40249o48037m884396j3026622
$$ 80997719 100901778 118025978 127430807 129351832 129011583 128363546 123479150 110452528
19389A10452528j9501268k0343534j6845606j2370719r107003o578938m555035
$$ 110452528 90951260 70607726 53762120 41391401 32284398 25705460 21150425
19382B1150425l391674k642603k079343j600053j332189j002140p56237o89866
$$ 21150425 17758751 15116148 13036805 11436752 10104563 9102423 8346186 7656320
19374G656320o33689p13771p41806l67615j67752l65737k58003l14975m34224
$$ 7656320 7022631 6308860 5567054 5199439 5031687 4665950 4407947 4092972 3658748
19365C658748l33007k44637j49189N9037j99511l17551j25149j7732j20237l47707
$$ 3658748 3325741 3081104 2931915 2990952 2791441 2473890 2348741 2331009 2210772 1863065
19355A863065j66589q4724j46244l62M0677K3206p0959j10231j68053K6877j6450
$$ 1863065 1696476 1611752 1465508 1465146 1505823 1529029 1458070 1347839 1179786 1206663 1190213
19344A190213L5978l1256P8718k22033o9521J31454R8971p8058k1122m2127j8813
$$ 1190213 1226191 1194935 1273653 1051620 982099 1113553 1212524 1134466 1113344 1071217 1052404
19333A052404P2402q3611k59852r4842J74349Q7069o6643K6245L697j34645p3554
$$ 1052404 1124806 1041195 781343 686501 860850 947919 881276 907521 911218 776573 703019
19322G03019m930j19688j04576R7070N7101j8418K7383k8465j7587m7797J0310
$$ 703019 698089 578401 473825 570895 627996 609578 636961 608496 590909 543112 553422
19311E53422q6956m0181J02229P7026j67809N913J14404o3135o265n3381N4950
$$ 553422 466466 426285 528514 605540 437731 443644 558048 494913 488648 435267 490217
19300D90217p370q5674j32468n969N8211q6681J32512K2947j16198j79274J5044
$$ 490217 482847 397173 264705 258736 316947 230266 362778 385725 269527 90253 105297
19289A05297N0278l4896j46864J9846N4703O8519J20931J77710k227L3098J25730
$$ 105297 155575 120679 -26185 -6339 48364 116883 237814 415524 413297 446395 572125
19278E72125l7507r9187q5969q4837k1689J39852p5670r7990J0569J9149m7757
$$ 572125 534618 435431 349462 264625 242936 382788 307118 209128 219697 238846 191089
19267A91089j17810r5344o677P2506M4599r7070o9214K5804J5651k1170R4774
$$ 191089 73279 -22065 -28742 43764 88363 -8707 -77921 -52117 -36466 -57636 37138
19256C7138o6270r298L7092q8001P0559N8027J28016R5754M2145r3909j0508j03960
$$ 37138 -29132 -38430 -1338 -89339 -18780 39247 167263 263017 305162 211253 200745 96785
19244I6785j24576J2028k5399M6378N4645j6976J10886J8854o2483o393j57076
$$ 96785 -27791 -15763 -41162 5216 59861 42885 153771 172625 110142 103749 -53327
19233e3327K9432J32712J15247j04008k39155k615O0733J69308J20220m9360n5701
$$ -53327 -23895 108817 224064 120056 -119099 -121714 -60981 108327 228547 179187 123486
19222A23486k1629l6017P9158K1569q3374j31092j22235r8398Q8398J96309k8784
$$ 123486 101857 65840 144998 166567 83193 -47899 -170134 -268532 -180134 16175 -12609
19211a2609l4002L7024k8548o929J5582n710n3696N0207j0918k1116N527L9875
$$ -12609 -46611 -9587 -38135 -45064 -29482 -35192 -88888 -38681 -49599 -70715 -65188 -25313
19199b5313K36428J96294k13204m2807q905q0311q1183K1661p0281o7914N7758
$$ -25313 211115 407409 194205 151398 142493 62182 -19001 2660 -67621 -135535 -77777
19188g7777j20739j50378k1181Q8076J74013Q1644J37388N3933j18589j4737L6818
$$ -77777 -198516 -348894 -370075 -281999 -107986 -26342 111046 164979 46390 31653 68471
19177F8471J7004J04590p4025j90005j00n0105L7610J08421Q2413j08650J5764
$$ 68471 85475 190065 116040 -73965 -74065 -124170 -86560 21861 104274 -4376 11388
19166A1388l4947r2432p6005J4964K73520Q4399q4598j35990J6214K5906J05501
$$ 11388 -23559 -115991 -191996 -177032 96488 180887 96289 -39701 -23487 2419 107920
19155A07920K9897m8210j0851j25248K6366n3577k3318j15561J29232K6162Q9526
$$ 107920 137817 89607 78756 -46492 -20126 -73703 -97021 -212582 -83350 -57188 32338
19144C2338R0548K40985K39581k00007l84761j71773l9433J4545L0605J07686
$$ 32338 122886 363871 603452 403445 18684 -153089 -192522 -177977 -147372 -39686
19134c9686J63967J10264J10355P7869O6718m8071k2265m2052j04435j56071j53434
$$ -39686 124281 234545 344900 422769 489487 441416 419151 377099 272664 116593 -36841
19123c6841N9927J03974k05216P9846J13512J3571k10966j44143l3432J29347
$$ -36841 23086 127060 -78156 1690 115202 128773 -82193 -226336 -259768 -130421
19113a30421k0301k1498J65297L4348j32461J7522N5368j1859l217K8217J14754
$$ -130421 -150722 -172220 -6923 27425 -105036 -87514 -32146 -44005 -47222 -19005 95749
19102I5749j01724j15685O3224M667m2882L9053J12542N7624l2942N0225M7379
$$ 95749 -5975 -121660 -58436 -53769 -96651 -57598 54944 112568 79626 129851 177230
19091A77230K6288r3964j97773j949m5096L4603n5149M509Q6897O1471k7601m8334
$$ 177230 203518 109554 -88219 -90168 -135264 -100661 -155810 -151301 -64404 -2933 -30534 -78868
19079g8868N7414j3873q384m733o771k3987r7682O9339n0987P4846N2119j13163
$$ -78868 -21454 -35327 -43711 -48444 -55215 -79202 -176884 -107545 -158532 -83686 -31567 -144730
19067a44730o2452k9773k1348q1928J7170M3193J1150K14914J20146j96917q1417
$$ -144730 -207182 -236955 -258303 -340231 -323061 -279868 -268718 -53804 66342 -130575 -211992
19056b11992J4452P5719J17646l2243j88348j00406p5982l4905J02143K2169n1850
$$ -211992 -197540 -121821 -4175 -36418 -224766 -325172 -401154 -436059 -333916 -311747 -363597
19045c63597J14781J84244J00656j03230J70237R4852n9003j20634l3077k01809
$$ -363597 -248816 -64572 36084 -67146 103091 197943 138940 18306 -14771 -216580
19035b16580r9749M5418n1213J01732K1031j97316j4236M7285M0594m2444J10958
$$ -216580 -316329 -270911 -322124 -220392 -199361 -396677 -410913 -363628 -323034 -365478 -254520
19024b54520K08647J34455j33115j42397J55037J38260J23713O3949k0972k46955
$$ -254520 -45873 88582 -44533 -186930 -31893 106367 230080 294029 273057 26102
19014B6102j52095o442K5988j7613J97373Q4711M2191O332k06964j72331p7444
$$ 26102 -125993 -132435 -106447 -124060 73313 158024 200215 206547 -417 -172748 -250192
19003b50192O4206J63573K8795J19997O8884j85437O9941J22217J48845L3124
$$ -250192 -185986 -22413 6382 126379 195263 9826 79767 201984 350829 383953
18993C83953K03735L0336j2810j6412p5845K6182l8907j6229P061M0310m0864
$$ 383953 587688 618024 605214 588802 512957 539139 500232 484003 491064 531374 490510
18982D90510j37535R02j04789j66885J50230n6676q067j13629l2110R0683P3294
$$ 490510 352975 353877 249088 82203 232433 175757 167690 54061 21951 112634 185928
18971A85928r3761j03436r166P6049J26994K08456M6440k9579Q9424J02853m815
$$ 185928 92167 -11269 -20435 55614 182608 391064 437504 407925 497349 600202 595387
18960E95387K2432R4367K40364n8359j406j01244m7225O1281j28572j39381r7913
$$ 595387 617819 712186 952550 894191 892785 791541 744316 805597 677025 537644 439731
18949D39731p2581q6432m7870J5343l1970J89122j0480J84108N606k8579M6505
$$ 439731 367150 280718 232848 248191 216221 405343 394863 578971 584577 555998 602503
18938F02503q71J07696J00469l1585r6511l2253j13307O6020N5804m757j01056
$$ 602503 601632 709328 809797 778212 681701 649448 536141 602161 657965 653208 552152
18927E52152o9349P4105R3964J91425O4796l582j53792k04335k38819j4392M5587
$$ 552152 482803 556908 650872 842297 907093 903511 749719 545384 306565 292173 337760
18916C37760R7995R0451L1147o4952k01809j27657K64106J43865Q5947Q130q5357
$$ 337760 435755 526206 557353 492401 290592 162935 427041 570906 656853 664983 579626
18905E79626P0370O8708N9203J55718j58396k32248m6164j81721j76705Q6210
$$ 579626 649996 718704 777907 933625 775229 542981 496817 315096 138391 224601
18895B24601n8648o259Q4163M5749J82473R0734k0640n614j3535j46865k4865
$$ 224601 165953 159694 243857 289606 472079 562813 542173 536559 523024 376159 351294
18884C51294k108J82097K9762j89519m3440J5938j50480O8893J04466J52600J41899
$$ 351294 349186 531283 561045 371526 328086 344024 193544 262437 366903 519503 661402
18873F61402M2995J22517K17887N7992k78424j61164O669j2559j74622j90710
$$ 661402 704397 826914 1044801 1102793 824369 663205 669874 657315 482693 291983
18863B91983j43774J30806J36188J06567q3095r0703j46644r7735J1841n8108
$$ 291983 148209 279015 415203 521770 438675 347972 201328 103593 115434 57326
18853E7326n5333O8811q4587p5482K8422J04088R2444J65886O4331r5835J34835
$$ 57326 1993 70804 -13783 -89265 -60843 43245 135689 301575 365906 270071 404906
18842D04906J62977q611J74586K7468k952J35411P1267j436q9588r7775J2818
$$ 404906 567883 559272 733858 761326 758374 893785 965052 963616 874028 776253 789071
18831G89071j8483l49789l34555j63951J7830J16484J2799J5576r180J5522q4188
$$ 789071 770588 420799 86244 -77707 -59877 56607 69406 84982 75802 91324 7136
18820G136j48990j03001K3957o7699J24512O6435r3626P5060J34886K4061m9832
$$ 7136 -141854 -244855 -220898 -288597 -164085 -97650 -191276 -116216 18670 42731 -7101
18809g101O5756P364o776k30357j5098N2468J51202R8781m693j82529j34264l7403
$$ -7101 58655 66019 59243 -171114 -186212 -133744 17458 116239 111546 -70983 -205247 -242650
18797b42650J43042M3815j59040k6688K11821O022P7538O2080m2375J5284j7156
$$ -242650 -99608 -55793 -214833 -241521 -29700 -23678 53860 115940 73565 88849 71693
18786G1693N8221r2217j17321j02144O0828N4186k3199j42855k8709m3220R6883
$$ 71693 129914 37697 -79624 -181768 -120940 -66754 -89953 -232808 -261517 -304737 -207854
18775b07854P3471o8526O168J4880P161j9512J76768r0351j92460Q991m9689J47936
$$ -207854 -134383 -202909 -196741 -181861 -174700 -194212 -17444 -107795 -300255 -291264 -340953 -193017
18763a93017N010M6704J80180j23585j3931q5930k09407L7972n0718O3923m5582
$$ -193017 -188007 -141303 38877 -84708 -98639 -184569 -393976 -356004 -406722 -342799 -388381
18752c88381K16997J31104O911j21200k955n8022R7124R8130n861O6204J16642
$$ -388381 -171384 -40280 -33369 -154569 -157524 -215546 -118422 -20292 -26153 40051 156693
18741A56693j27506j11917m7151r7451L046k9421K9396J11015n99R1765J18343
$$ 156693 29187 -82730 -129881 -227332 -224286 -253707 -224311 -113296 -113895 -22130 96213
18730I6213O6621j22291j28386O9568L0379k19175r5343J15853K23980J5076p4717
$$ 96213 162834 40543 -87843 -18275 12104 -207071 -302414 -186561 37419 52495 -22222
18719b2222N0193O1092j73356r4385l6171l5808L6337Q143M8036J53134J24266
$$ -22222 27971 89063 -84293 -178678 -214849 -250657 -214320 -206177 -158141 -5007 119259
18708A19259q9250k92155r5110J32498J58200m7632m224M0048k44551m6350R3763
$$ 119259 30009 -262146 -357256 -224758 -66558 -114190 -118414 -78366 -322917 -369267 -275504
18697b75504Q452J10730n3225j08645o5377k1165J50700l42j09683J64294J20968
$$ -275504 -267052 -156322 -209547 -318192 -383569 -404734 -254034 -254376 -364059 -199765 -78797
18686g8797o0801J98171p2966k06259l4152L7950J11462K26479J24630j36405
$$ -78797 -139598 58573 -14393 -220652 -254804 -216854 -105392 121087 245717 109312
18676A09312j33125j08630j5716q1867j12766J69021k8068j21963O3230N1715
$$ 109312 -23813 -132443 -148159 -230026 -342792 -173771 -201839 -323802 -260572 -208857
18666b08857m2267p779k7192R813p0912m080m4864M9255R9029M4656n8988m9722
$$ -208857 -251124 -258903 -286095 -276282 -347194 -351274 -396138 -346883 -247854 -203198 -262186 -311908
18654c11908L09164J34783q0151m6022R9790k4684k3219r6766P3543m0478m6805
$$ -311908 -2744 132039 51888 5866 105656 80972 57753 -39013 34530 -5948 -52753
18643e2753Q431J02331J65833n4811j36145n6962m5216l5842j35651j4060K09594
$$ -52753 -44322 58009 223842 169031 32886 -24076 -69292 -105134 -240785 -254845 -45251
18632d5251J92749L4221K6217p2491j59205q9884K0361o5450j8404k2859J7150
$$ -45251 147498 181719 207936 135445 -23760 -113644 -93283 -158733 -177137 -199996 -182846
18621a82846l4796P0170j15751o7539K1329m441M4814j1564n2851M1751Q6872
$$ -182846 -217642 -147472 -263223 -330762 -309433 -313874 -269060 -280624 -333475 -291724 -204852
18610b04852J95315m4009j09679j55156R0931J27783P9271J9596n285j26774L2174
$$ -204852 -9537 -53546 -163225 -318381 -227450 -99667 -20396 -800 -6085 -132859 -100685
18599a00685J84618K2399j44162k02016J5170J31655J26428O9336m3594j30694
$$ -100685 83933 106332 -37830 -239846 -224676 -93021 33407 102743 59149 -71545
18589g1545J4781Q2741m7697k9896P3864J70262J4037l07811j1125L0296j3846
$$ -71545 -56764 25977 -21720 -51616 22248 192510 206547 -101264 -112389 -82093 -95939
18578i5939L0989J22105M5074j0485j36453K3057N844N0286J22546O7285L6614
$$ -95939 -64950 57155 102229 91744 -44709 -21652 -15808 34478 157024 224309 260923
18567B60923k6632j13432j62537J0154O5693p091j48506j16963J9947K160j7282
$$ 260923 234291 120859 -41678 -31524 34169 27078 -121428 -238391 -218444 -216284 -233566
18556b33566q6196n6026J05540J64170J46512K29269j17542q2582Q8103j17937
$$ -233566 -319762 -375788 -270248 -106078 40434 269703 152161 69579 157682 39745
18546C9745k1399M8462K09708P667j27890r3852K7558P1557j44524Q50L2365l2111
$$ 39745 18346 66808 276516 284183 156293 62441 89999 161556 17032 17882 50247 18136
18534A8136N682j16456j30808R1930m9941p054N7016O3735J38326o2307r0438
$$ 18136 23818 -92638 -223446 -131516 -181457 -188511 -131495 -67760 70566 8259 -82179
18523h2179M427j63287j03889R4097J53714J26090o1855p093Q2162J14220K7756
$$ -82179 -77752 -241039 -344928 -250831 -97117 28973 -32882 -39975 42187 156407 184163
18512A84163j12836N8407k4373p5130M4641M166r1614n5214n1819J7082O0714
$$ 184163 71327 129734 105361 30231 74872 79038 -12576 -67790 -119609 -102527 -41813
18501d1813J7086J51952j09241j80161J1322J90856M0912k1106j65623J19845
$$ -41813 -24727 127225 17984 -162177 -150855 40001 80913 59807 -105816 14029
18491A4029J09063j96866l2610m0504P9165J14643k64936o9180N0234M3230J20037
$$ 14029 123092 -73774 -106384 -146888 -67723 46920 -218016 -287196 -236962 -193732 -73695
18480g3695P2627j00533o4786J27313L66600l2228j71420j42436M5148n3170j8999
$$ -73695 -1068 -101601 -166387 -39074 327526 295298 123878 -18558 26590 -26580 -45579
18469d5579K757j63808N8863k0828M4950J50537O4885j1492j20473m8872j066
$$ -45579 -42822 -206630 -147767 -168595 -123645 26892 91777 80285 -40188 -89060 -90126
18458i0126j3448m3184q5191P6851P2931J13884q5237m5743j34818n5039K6595
$$ -90126 -103574 -146758 -231949 -155098 -82167 31717 -53520 -99263 -234081 -289120 -262525
18447b62525J8065J00957k8428L3671J7788l3112L5342o9358p47K6939r9462N5261
$$ -262525 -244460 -143503 -171931 -138260 -120472 -153584 -118242 -187600 -188347 -161408 -260870 -205609
18435b05609n4238k7980R9430k5403o179p1160P4407M5589J31773J37539j34865
$$ -205609 -259847 -287827 -188397 -213800 -219979 -291139 -216732 -171143 -39370 98169 -36696
18424c6696M6906M0140J2941p2344N0178K01068j16304J89865J27297L5518j06813
$$ -36696 10210 50350 63291 -9053 41125 242193 125889 315754 443051 478569 371756
18413C71756k63424q3561N6776m7475L6133M8619Q246l1375J2035j48746q5890
$$ 371756 108332 24771 81547 34072 70205 118824 127070 95695 107730 -41016 -126906
18402a26906K4139Q1670k83374r0109q867M3438K13811J77254J04123l872o2397
$$ -126906 -102767 -21097 -304471 -394580 -403447 -360009 -146198 31056 135179 131307 68910
18391F8910j18169j51442K9367K62301K2703j56182J9039K8311P3091k4588j99512
$$ 68910 -49259 -200701 -171334 90967 113670 -42512 -23473 4838 77929 53341 -146171
18380a46171J819Q5774L0378n1890j78614J90566m6512j56312L2548n676J05988
$$ -146171 -144352 -58578 -28200 -80090 -258704 -68138 -114650 -270962 -238414 -244090 -138102
18369a38102j113J66339j16816N4994R6155p4760j37085Q2652J26905O8937j40742
$$ -138102 -139215 27124 -89692 -34698 61457 -13303 -150388 -67736 59169 128106 -12636
18358a2636k2993J47836o1400j12868p9321Q604J48609M843k1335K708P7016J2813
$$ -12636 -35629 112207 50807 -62061 -141382 -132778 15831 20674 -661 2047 79063 91876
18346I1876n5588j3541k4511o0838M6054p5293N8322M4497R3508N7037n2338k05843
$$ 91876 36288 22747 -1764 -62602 -16548 -91841 -33519 10978 104486 161523 109185 -96658
18334i6658r5182J65755Q5145j9836j13038k51091k4746J36569J20791Q2704j76167
$$ -96658 -191840 -26085 59060 39224 -73814 -324905 -349651 -213082 -92291 -9587 -185754
18323a85754J30846M0448j00957r2326o3893K0712r5963j39475J00356O3851J7588
$$ -185754 -54908 -14460 -115417 -207743 -271636 -250924 -346887 -486362 -386006 -322155 -304567
18312c04567K40428k3111l0967m2655p2126J9341J08717J29214J0579L9141O3287
$$ -304567 -64139 -87250 -118217 -160872 -232998 -213657 -104940 24274 34853 73994 137281
18301A37281q9781O558L3446J38784j04229j34247j44999N923l2590Q9185J30923
$$ 137281 47500 54058 87504 226288 122059 -12188 -157187 -151264 -183854 -94669 36254
18290C6254J17034j37392j32813k0969J1865J07970J86679j00602j70767p6759
$$ 36254 153288 15896 -116917 -137886 -126021 -18051 168628 68026 -102741 -179500
18280a79500K3118K2590K3317o872K1316J0491K465j41124j6416J04343Q6267
$$ -179500 -156382 -133792 -110475 -117347 -96031 -85540 -83075 -224199 -240615 -136272 -50005
18269e0005Q554P0083j25267p3632K6481L6339p6252n9878K27814J03222l8363
$$ -50005 -41451 28632 -96635 -170267 -143786 -107447 -183699 -243577 -15763 87459 49096
18258D9096j06131J48172R3070r9943k12908j3804O3748j5778j34972k7818m870
$$ 49096 -57035 91137 184207 84264 -128644 -142448 -78700 -94478 -229450 -257268 -262138
18247b62138M2346n9112J9940J53598q2840j06423N7081j5176o8895J04695K5515
$$ -262138 -219792 -278904 -258964 -105366 -188206 -294629 -237548 -252724 -321619 -216924 -191409
18236a91409R1048p6567o9927o7974n0382M244R5508J10710J5762K7270J8059
$$ -191409 -100361 -176928 -246855 -314829 -365211 -360967 -265459 -154749 -138987 -111717 -93658
18225i3658j5938o8082J41650M8955M5486k00842j36986J19057r2680m8041J80574
$$ -93658 -109596 -177678 -36028 12927 58413 -142429 -279415 -160358 -253038 -301079 -120505
18214a20505K9990J10084Q798j54743k1498J32072k07219j84164k6886R1516L07751
$$ -120505 -90515 19569 28367 -126376 -147874 -15802 -223021 -407185 -434071 -342555 -34804
18203c4804J05572K0588k2965j41166q5401O1163N2137j53278j47207K3214J71923
$$ -34804 70768 91356 68391 -72775 -158176 -97013 -44876 -198154 -345361 -322147 -150224
18192a50224j80668N3640K08765r7784p6368q6012j46944J15221P1555J20405
$$ -150224 -330892 -277252 -68487 -166271 -242639 -328651 -475595 -360374 -288819 -168414
18182a68414m992K3847Q5966J39389j20614j70187P6056R6549j25304O0523k3349
$$ -168414 -173406 -149559 -63593 75796 -44818 -215005 -138949 -42400 -167704 -107181 -130530
18171a30530l3619n0633K9956J09646Q870j19015K1886L3162p8280L7416J86876
$$ -130530 -164149 -214782 -184826 -75180 -66310 -185325 -163439 -130277 -208557 -171141 15735
18160A5735J14371p926o1096o0750L6254p5353j54079Q9197L2964q4388J58292
$$ 15735 130106 122180 61084 334 36588 -38765 -192844 -103647 -70683 -155071 3221
18149C221O7053l3155k59477j44107l0345J05765Q6608J20824J53337j06544k80197
$$ 3221 70274 37119 -222358 -366465 -396810 -291045 -204437 -83613 69724 -36820 -317017
18138c17017K5256K14758l565o5074p1239R411Q121j25546O4284J52443O6884
$$ -317017 -291761 -77003 -80568 -145642 -216881 -207470 -199349 -324895 -260611 -108168 -41284
18127d1284n9205K340K4266L8379r880j41660n451J30543P214j35553J4731J4526
$$ -41284 -100489 -98149 -73883 -35504 -45384 -187044 -192495 -61952 -54738 -190291 -175560 -161034
18115a61034Q0124M7104O8557j4110Q0251J7175j05273p1514l4187l0763O9026
$$ -161034 -80910 -33806 34751 20641 100892 118067 12794 -58720 -92907 -123670 -54644
18104e4644J0464L4611l348J7228j07247q0544J0857l6818j15575k3054J1305
$$ -54644 -44180 -9569 -12917 4311 -102936 -183480 -172623 -209441 -325016 -348070 -336765
18093c36765J63913R9463k70643j82247J85391O1117J47979N7681J91507j75886
$$ -336765 -172852 -73389 -344032 -526279 -340888 -279771 -131792 -74111 117396 -58490
18083e8490p3772O1968L2177N6026j9815J0657l4757j41545j5384m2872K9012
$$ -58490 -132262 -70294 -38117 17909 -1906 8751 -26006 -167551 -182935 -225807 -196795
18072a96795j5613N4351M7234R4722N6812p9282M9446J87051Q9301j80565j49491
$$ -196795 -212408 -158057 -110823 -16101 40711 -38571 10875 197926 287227 106662 -42829
18061d2829q1283Q4192L981R9043r0008j1580J66511l0138J4357m6016M5015R7089
$$ -42829 -124112 -39920 -35939 63104 -26904 -38484 128027 97889 112246 66230 111245 208334
18049B08334j073q9738m3777q2369j10006Q714l8711r6934o1737K4166m2940N6090
$$ 208334 207261 117523 73746 -8623 -118629 -109915 -148626 -245560 -307297 -283131 -326071 -269981
18037b69981J95083N2375l9723n4412j87222n4976K36468K34144L55q727j340
$$ -269981 -74898 -22523 -62246 -116658 -303880 -358856 -122388 111756 112111 103384 102044
18026A02044N5606j017p0314P5821j78264j44767m4709r5783J75395Q8755n9056
$$ 102044 157650 156633 86319 162140 -16124 -160891 -205600 -301383 -125988 -37233 -96289
18015i6289l8784J50449p3201n493J33849L7065j05171o3300m5290J13709Q1249
$$ -96289 -135073 15376 -57825 -63318 70531 107596 2425 -60875 -106165 7544 88793
18004H8793j22860j38471J5032o7142M0581M8174N7853P179k1948m8902L4739
$$ 88793 -34067 -172538 -157506 -224648 -184067 -135893 -78040 -70861 -92809 -141711 -106972
17993a06972m5922o2332R9047L3772J6375n1712J71819N2994p3442q4489n530
$$ -106972 -152894 -215226 -116179 -82407 -66032 -117744 54075 107069 33627 -50862 -56392
17982e6392O3033l1538q5410J11464R6058L1881N4791J09352j48289k69216j15570
$$ -56392 6641 -24897 -110307 1157 97215 129096 183887 293239 144950 -124266 -239836
17971b39836q5337P0380K02023K13319J2106j86271l8018K8188J09359J53045
$$ -239836 -325173 -254793 -52770 160549 172655 -13616 -51634 -23446 85913 238958
17961B38958j17140m0602O639L0039k46613j99133J27105J13149Q4696k6397J6911
$$ 238958 121818 81216 87855 117894 -128719 -327852 -200747 -87598 -2902 -29299 -12388
17950a2388K6474M0027q719j50286p5722Q6995N6296o9091p2633l565q3876J7041
$$ -12388 14086 54113 45394 -104892 -180614 -93619 -37323 -106414 -179047 -182612 -266488 -249447
17938b49447K21184J07070k66774L0238Q6225r5597L217J03245P5094j35948m6692
$$ -249447 -28263 78807 -187967 -157729 -71504 -167101 -163884 -60639 14455 -121493 -168185
17927a68185q9800J94083j0928M4554J11442Q6460j10449R1910J60425K3267l31985
$$ -168185 -257985 -63902 -74830 -30276 81166 167626 57177 149087 309512 332779 794
17916G94j38998k833M6134p8730m0362R6528P268Q5894J54244j22961n7349N0973
$$ 794 -138204 -141037 -94903 -173633 -213995 -117467 -110199 -24305 129939 6978 -50371 602
17904F02R7938J68503k0227k58721j38724N4183o326J17724L4585j56236L3830
$$ 602 98540 267043 246816 -11905 -150629 -96446 -102772 14952 49537 -106699 -72869
17893g2869q6455p2585J38248J08810n8563k4780m4847L259J00841m3864R651
$$ -72869 -159324 -231909 -93661 15149 -43414 -68194 -113041 -109782 -8941 -52805 -43154
17882d3154O2308n2025J52236J13843j02205j37372j41097M751J2561N5986J05899
$$ -43154 19154 -32871 119365 233208 131003 -6369 -147466 -142715 -130154 -74168 31731
17871C1731r800j1626m4499j14051l692m8796l8274J2015K03497J23162j42418
$$ 31731 21931 10305 -34194 -148245 -151937 -200733 -239007 -226992 -23495 99667 -42751
17860d2751P4952K23168P3014j27348l27499M5150K55595R7812k98821l29115
$$ -42751 32201 255369 328383 201035 -126464 -81314 174281 272093 -26728 -355843
17850c55843j02191J47354Q0550o9223J1945N2293j16901J50877J13093K02435
$$ -355843 -458034 -310680 -230130 -299353 -287408 -235115 -352016 -201139 -88046 114389
17840A14389k5196m544L8432p0869l4690o000J972k6962o4770M0361m2585k7937
$$ 114389 89193 84649 123081 52212 17522 11522 13494 -13468 -78238 -37877 -80462 -108399
17828a08399Q6103J65714m9433p5563J8364N7663l0605j55348o6299J6278m3315
$$ -108399 -22296 143418 93985 18422 36786 94449 63844 -91504 -157803 -141525 -184840
17817a84840J2747J58151k7036j3686P5181K1519P8277L7652j797o8832K2744
$$ -184840 -172093 -13942 -40978 -54664 20517 42036 120313 157965 156168 87336 110080
17806A10080O5833p2847j16779k9358L1504l7886n9466O5647k2972l1415l9870
$$ 110080 175913 103066 -13713 -43071 -11567 -49453 -108919 -43272 -66244 -97659 -137529
17795a37529q478j724Q7058J26414R711J8585q637M2419k8331n4923K2963k3045
$$ -137529 -146007 -147731 -60673 65741 75452 94037 85400 127819 99488 44565 67528 44483
17783D4483k04802j62613O0590J09784M5178M9148j68779K3329o5458J2646Q8829
$$ 44483 -160319 -322932 -262342 -152558 -107380 -58232 -227011 -203682 -269140 -256494 -167665
17772a67665J37546J14641P764k15907M0694J03329J25176N7394p9959M3503r2750
$$ -167665 -30119 84522 92286 -123621 -82927 20402 145578 202972 123013 166516 73766
17761G3766j24107J5608j29356R1402j8325M0329j32391O7615K13986j4624n6752
$$ 73766 -50341 -34733 -164089 -72687 -91012 -50683 -183074 -115459 98527 83903 27151
17750B7151j68776q1537K0426J03753P6721j800n0289p3476J05328J43720K7288
$$ 27151 -141625 -223162 -202736 -98983 -22262 -24062 -74351 -147827 -42499 101221 128509
17739A28509m3266j69918O1844M3802J01265K7068j2070P11P873N8861J60305
$$ 128509 85243 -84675 -22831 20971 122236 149304 137234 137945 145818 204679 364984
17728C64984L6663q7008P153n2653j32667n3573M087j96340J74297J33465m8253
$$ 364984 401647 314639 321792 269139 136472 82899 86986 -109354 64943 198408 150155
17717A50155j63466j46832j24878k8846J90369J13692J8337M3510k20631k8460
$$ 150155 -13311 -160143 -285021 -313867 -123498 -9806 8531 52041 -168590 -197050
17707a97050K68084K4190j17435J9517O8246m7673Q5111J27778j96314k30405
$$ -197050 71034 95224 -22211 -2694 65552 17879 102990 230768 34454 -195951
17697a95951o7786q4535K6221J26938R8924j35973Q0961J39901J37916o728K7393
$$ -195951 -263737 -348272 -322051 -195113 -96189 -232162 -151201 -11300 126616 119888 147281
17686A47281M251j92246j91225o8657k573J58198j3336j85546M5252L8036J04143
$$ 147281 151532 -40714 -231939 -300596 -303169 -144971 -158307 -343853 -298601 -260565 -156422
17675a56422O4722M046k0286J4229J76727L5690j43231j97518n7146p8540j1729
$$ -156422 -91700 -87654 -107940 -93711 83016 118706 -24525 -222043 -279189 -357729 -369458
17664c69458R9065J58172l3176O843p4707R8116L17551J7730q0146p2227j79595
$$ -369458 -270393 -112221 -145397 -138554 -213261 -115145 202406 220136 139990 67763 -111832
17653a11832j57974Q069P2340O941L03R442o8404J68247P4606l0679m9613r3484
$$ -111832 -269806 -261737 -189397 -182456 -182153 -172711 -241115 -72868 1738 -28941 -78554 -172038
17641a72038Q0393j1045k0517m895n6833Q8880Q1786q6521J01074J8295m7984
$$ -172038 -91645 -102690 -123207 -128102 -184935 -96055 -14269 -100790 284 18579 -29405
17630b9405j2330j87782J2772J76161N4786M8898q6529R2089N7294j58006J6191
$$ -29405 -41735 -229517 -216745 -40584 14202 63100 -23429 68660 125954 -32052 -15861
17619a5861m6582M1400L5169j41614k0779P4001J49355p020n7506J07486K0456
$$ -15861 -62443 -21043 14126 -127488 -148267 -74266 75089 68069 10563 118049 138505
17608A38505j92948N5719j30092j29131j7221N5537Q4505K0857R1727J9648J31626
$$ 138505 -54443 1276 -128816 -257947 -275168 -219631 -135126 -114269 -22542 -2894 128732
17597A28732K6516J36208K7967j34657j29895p2124J71833J46026j82529r4128
$$ 128732 155248 291456 319423 184766 54871 -17253 154580 300606 118077 23949
17587B3949j7589j70873q1458J92027J49767q6260k27109p7111K68688n443o7319
$$ 23949 6360 -164513 -245971 -53944 95823 9563 -217546 -294657 -25969 -31412 -98731
17576i8731j15595p279J25604J85898N4642J47834j04141r2122k71053j27930
$$ -98731 -214326 -221605 -96001 89897 144539 292373 188232 96110 -174943 -302873
17566c02873p5943N3777K58035J07218K8979r844o3509l281N091Q7549O1065o8627
$$ -302873 -378816 -325039 -67004 40214 69193 59349 -4160 -7441 -2350 85199 146264 77637
17554G7637o151N5086j10457m7890K0105j47750j53818J09272l741l1460J6402
$$ 77637 71486 126572 16115 -31775 -11670 -159420 -313238 -203966 -207707 -239167 -222765
17543b22765j41298K7626J75222N2013q5113j44130j29391j7328J17720O6720
$$ -222765 -364063 -336437 -161215 -109202 -194315 -338445 -467836 -485164 -367444 -300724
17533c00724J46480O4381J48505J39745j59484k26279p4787J17112m597j08128
$$ -300724 -154244 -89863 58642 198387 38903 -187376 -262163 -145051 -149648 -257776
17523b57776Q2733J32594J32646K7714o98j88199p3450n6094j07078P5613l9190
$$ -257776 -175043 -42449 90197 117911 117213 -70986 -144436 -200530 -307608 -231995 -271185
17512b71185P888r897N8912Q637m0296O4599K45008m766n4165j02486l6343j9442
$$ -271185 -263297 -273194 -214282 -205645 -245941 -181342 63666 58900 4735 -97751 -134094 -153536
17500a53536j09403n6284j045J28679P8923P2319l1971J29246K47081j23951k09747
$$ -153536 -262939 -319223 -320268 -191589 -112666 -40347 -72318 56928 304009 180058 -29689
17489b9689k12428r7820J31457O9077j76225p3425K15573N4548L06p6224N4104
$$ -29689 -242117 -339937 -208480 -139403 -315628 -389053 -173480 -118932 -118626 -194850 -140746
17478a40746M4229j52011l1201q4381k8302K31121J71083N5794R0922j1414Q8398
$$ -140746 -96517 -248528 -279729 -364110 -392412 -161291 9792 65586 156508 145094 233492
17467B33492j5865j18220J1538J03434r4905r9548m9329o563j5106k8821N3634
$$ 233492 217627 99407 110945 214379 119474 19926 -29403 -35966 -51072 -79893 -26259
17456b6259O0824k14616j12956q323J33750N1016J42892k2072m4092L3919l036
$$ -26259 34565 -180051 -293007 -301330 -167580 -116564 26328 4256 -39836 -5917 -8953
17445h953r465K7942n4891J8758J3133l0203P0899l9463R3676m8694j4258R0259
$$ -8953 -18418 9524 -45367 -26609 -13476 -43679 27220 -12243 81433 32739 18481 108740
17433A08740K1735Q6422j83166k45282J94465J36946L0176p4300k12054K1955
$$ 108740 130475 216897 33731 -211551 -17086 119860 150036 75736 -136318 -114363
17423a14363n4023j76404N4051j5628l776n58j4806J25388Q9094m3352J04935
$$ -114363 -168386 -344790 -290739 -306367 -310143 -310701 -325507 -200119 -111025 -154377 -49442
17412d9442O6036O3168K7434p6866p4576m1198k170q5988j02076J0847L471m080
$$ -49442 16594 79762 107196 30330 -44246 -85444 -87614 -173602 -275678 -264831 -261360 -265440
17400b65440J09811r067j6189n5100O6254l4741j13368k6484K39123L223j34278
$$ -265440 -155629 -164696 -180885 -235985 -169731 -204472 -317840 -344324 -105201 -101978 -236256
17389b36256k9167N7278L25344J62703j01884k16575k4418J7332M6119L2899m2687
$$ -236256 -265423 -208145 117199 279902 178018 -38557 -62975 -45643 476 33375 -9312
17378i312r5823l1756L2414J42765O2689k17006K239Q5005p9775k92866k4602
$$ -9312 -105135 -136891 -104477 38288 100977 -116029 -113790 -28785 -108560 -401426 -426028
17367d26028J13540K08326J26717O1980j7437N6266m842j2899p6464j9302J4496
$$ -426028 -312488 -104162 22555 84535 67098 123364 118522 105623 29159 9857 24353
17356B4353j9266j14702m4984p8314K216J26582J27810j8889M2027l3710m1571
$$ 24353 5087 -109615 -154599 -232913 -230697 -104115 23695 4806 46833 13123 -28448
17345b8448l1403n891P2835R9046r5681k1393P2745K3702k0802q9395j81468Q920
$$ -28448 -59851 -65742 7093 106139 10458 -10935 61810 85512 64710 -24685 -206153 -197233
17333a97233O8401N5370J29068M4106K0150M5772r3798o0638p7367j17992k90
$$ -197233 -128832 -73462 55606 99712 119862 165634 71836 11198 -66169 -184161 -184451
17322a84451J37512P0978J16699L1227o0681n9936J1710j86866j68838R0923N7967
$$ -184451 -46939 24039 140738 171965 111284 51348 63058 -123808 -292646 -201723 -143756
17311a43756j4120M6801j5393Q4402J68683k1686l3276m5240n0172j58412L9528
$$ -143756 -157876 -111075 -126468 -42066 126617 104931 71655 26415 -23757 -182169 -142641
17300a42641N6913l8083o8331j16992j13784K6377J43111R4740r9153J4687Q1445
$$ -142641 -85728 -123811 -192142 -309134 -422918 -396541 -253430 -158690 -257843 -243156 -161711
17289a61711p0978p950J85746P6398n8596J0363n8963j14840j07205P2283O6240
$$ -161711 -232689 -240639 -54893 21505 -37091 -26728 -85691 -200531 -307736 -235453 -169213
17278a69213M5013k05192p5334R9771J51472q636M7404m6459r9772p843M386J43666
$$ -169213 -124200 -329392 -404726 -304955 -153483 -162119 -114715 -161174 -260946 -268789 -264403 -120737
17266a20737o9355K8362J7240Q5696J89277o9763j80449p6310J7883N7057K11452
$$ -120737 -190092 -161730 -144490 -58794 130483 60720 -119729 -196039 -178156 -121099 90353
17255I0353P9300j41788j17449J53460P8931L604j05535j33052R8681O7438M6021
$$ 90353 169653 27865 -89584 63876 142807 146411 40876 -92176 6505 73943 119964
17244A19964m1396j72051p958n490O7816N7589n8389m1386K9635M5949l4645o094
$$ 119964 78568 -93483 -101441 -106931 -39115 18474 -39915 -81301 -51666 -5717 -40362 -46456
17232d6456J16874P7703j93546k2594l7597K1960R9544o747k4445j24989M155
$$ -46456 70418 148121 -45425 -68019 -105616 -83656 15888 9141 -15304 -140293 -136138
17221a36138k7881k03716j07586R8995M4023k6868J33065N8643j18883j66340
$$ -136138 -164019 -367735 -475321 -376326 -332303 -359171 -226106 -167463 -286346 -452686
17211d52686P4873K23453J5137j50714J58979Q7521p0641N9809q883p691L9960
$$ -452686 -377813 -154360 -139223 -289937 -130958 -43437 -114078 -54269 -63152 -70843 -30883
17200c0883l0025K5107K4288P6116o0992j32380R3590r106m5603m3644j23514
$$ -30883 -60908 -35801 -11513 64603 3611 -128769 -35179 -44285 -89888 -133532 -257046
17189b57046P7701J02729k4729J3482O931m8614k4745n6636j18034Q2699J22972
$$ -257046 -179345 -76616 -101345 -87863 -80932 -129546 -154291 -210927 -328961 -246262 -123290
17178a23290j22300m282o8510j588M8935R3768j3962O3938R341j7518O07J09099
$$ -123290 -245590 -249872 -318382 -319970 -271035 -177267 -191229 -127291 -117950 -135468 -134861 -25762
17166b5762l5405r4220J25881P2250m5350m2748q5625j3889O0227J14504J92121
$$ -25762 -61167 -155387 -29506 42744 -2606 -45354 -130979 -144868 -84641 29863 221984
17155B21984q4530k39792l297J44567N2151q4301N3717l2317J9100j33973j03290
$$ 221984 137454 -102338 -105635 38932 91083 6782 60499 28182 47282 -86691 -189981
17144a89981K1469K97598J45225k53689J21510q706j25190q1210o8065j7017m0358
$$ -189981 -168512 129086 274311 20622 142132 133426 8236 -72974 -141039 -158056 -198414
17133a98414J04762P6713J89625Q230j26941j27731J0008k2054L9150J06568p0019
$$ -198414 -93652 -16939 172686 180916 53975 -73756 -63748 -85802 -46652 59916 -10103
17122a0103k63664q5855P1214l9973J19899N9650k0312J38648J9714l8831P2938
$$ -10103 -273767 -359622 -288408 -328381 -208482 -148832 -169144 -30496 -10782 -49613 23325
17111B3325J2496k841M5380J0773O0419M7886J69720J16884k69932r857R7718
$$ 23325 35821 32980 78360 89133 149552 197438 367158 484042 214110 204253 301971
17100C01971o4926q9395n7330o5995l320J589n5769n040K1704m6723o2994N2508
$$ 301971 237045 147650 90320 24325 21005 22594 -33175 -38215 -16511 -63234 -126228 -73720
17088g3720m5550j21921Q7112J46028N2148j51287J7274n2341m9820N0318L1899
$$ -73720 -119270 -241191 -154079 -8051 44097 -107190 -89916 -142257 -192077 -141759 -109860
17077a09860K00044j17539p7902j29685j2072K7077J8303R5840K17315k0559o914
$$ -109860 90184 -27355 -105257 -234942 -247014 -219937 -201634 -105794 111521 90962 84048
17066H4048J31626p9939L413j89320j20226K83355J47566k0136j51475l29500
$$ 84048 215674 135735 139148 -50172 -170398 112957 260523 240387 88912 -240588
17056b40588Q4572K08683l0333k6533p5557j81595j0291K8201J46360N6148m3790
$$ -240588 -156016 52667 22334 -4199 -79756 -261351 -271642 -243441 -97081 -40933 -84723
17045h4723j58711m1456J04234O3475J20873J2896j42934j91827J0311P729K9330
$$ -84723 -243434 -284890 -180656 -117181 3692 16588 -126346 -318173 -307862 -300133 -270803
17034b70803j8906k702J59497R0128J72914j5453j02824p8145k1984M6935j1830
$$ -270803 -289709 -292411 -132914 -42786 130128 114675 11851 -66294 -88278 -41343 -53173
17023e3173K3450K5140p5669K4738n2047K8086L1139N0764N1904n0694j03460
$$ -53173 -29723 -4583 -80252 -55514 -107561 -79475 -48336 2428 54332 3638 -99822
17012i9822J00439J3783j77990M0440o91j13549N0357J50832J31575j35087k2900
$$ -99822 617 14400 -163590 -123150 -123841 -237390 -187033 -36201 95374 -39713 -62613
17001f2613L7121m5201k6924Q3516O7961P4956J7886m8807J123j64825K8550J38001
$$ -62613 -25492 -70693 -97617 -14101 53860 128816 146702 97895 99018 -65807 -37257 100744
16989A00744n805j00102k19092Q9903P6109n4807J72765R0480q9691j32000l7890
$$ 100744 94939 -5163 -224255 -134352 -58243 -113050 59715 150195 60504 -71496 -109386
16978a09386j27043J14718J37467L0945P6561R1719N8838N2179n9622j22356r4754
$$ -109386 -236429 -121711 15756 46701 123262 214981 273819 325998 266376 144020 49266
16967D9266M7547R7432j04294j48465j6683j50376j2887J86756J19003M7065j17408
$$ 49266 96813 194245 89951 -58514 -75197 -225573 -238460 -51704 67299 114364 -3044
16956c044j3568J2169m0035l3388P3908J34126j49444R7598k9947j31986P924
$$ -3044 -16612 -4443 -44478 -77866 -3958 130168 -19276 78322 48375 -83611 -75687
16945g5687q6443N3216P4412j82900O681Q2119P8842l2452K729Q5263j24240M6859
$$ -75687 -162130 -108914 -34502 -217402 -210721 -128602 -49760 -82212 -79483 5780 -118460 -71601
16933g1601J19891N9723K7282k20048j86374O0588J37960n8817q4566J12488l0521
$$ -71601 48290 108013 135295 -84753 -271127 -210539 -72579 -131396 -215962 -103474 -133995
16922a33995m2365J70908k6338N665p8318j28318r0257j1107o7851l6139O3974
$$ -133995 -176360 -5452 -31790 -26125 -104443 -232761 -323018 -334125 -401976 -438115 -374141
16911c74141K06300M1596O4409l0579L9164J1902q8707K4918k4022K1482P4397
$$ -374141 -167841 -126245 -61836 -92415 -53251 -41349 -130056 -105138 -129160 -107678 -33281
16900c3281N5663o8379p4595l2696j6658O1292Q0669m236j8133l1492K2706R6357
$$ -33281 22382 -45997 -120592 -153288 -169946 -108654 -27985 -32221 -50354 -81846 -59140 37217
16888C7217J60531L5808K9260j56788k55780m4068J13885p8601K2174L9090J04347
$$ 37217 197748 233556 262816 106028 -149752 -193820 -79935 -158536 -136362 -97272 7075
16877G075q4474N8901N2021J96432n5046j30466n7967n1888l058M9692J10686
$$ 7075 -77399 -18498 33523 229955 174909 44443 -13524 -65412 -68470 -18778 91908
16866I1908l5750q4658k1737J05041P2262j67355k37220k9081J28633J14199M8145
$$ 91908 56158 -28500 -50237 54804 127066 -40289 -277509 -306590 -177957 -63758 -15613
16855a5613J258q186J05031l9281k8099m1086J44126j14520j55131K0300N2106
$$ -15613 -14355 -22541 82490 43209 15110 -25976 118150 3630 -151501 -131201 -79095
16844g9095J57528O9733L598M158j75252j15211m2237j0986k1150J46545O1062
$$ -79095 78433 148166 151764 155922 -19330 -134541 -176778 -187764 -208914 -62369 -1307
16833a307L3059j34491o8552M5716M3650q9907j9140J56099J01525N1880j03453
$$ -1307 31752 -102739 -171291 -125575 -81925 -171832 -190972 -34873 66652 118532 15079
16822A5079n9808j47946J28454J21496N3945M6687o2496j77656k1357K4391k5389
$$ 15079 -44729 -192675 -64221 57275 111220 157907 95411 -82245 -103602 -79211 -104600
16811a04600M3367J76896P4881r6467m2014R6074j2329n5537j69283N4640J1559
$$ -104600 -61233 115663 190544 94077 52063 148137 135808 80271 -89012 -34372 -22813
16800b2813L1554n8955m1064n1482J67701q0336q0971J47932P7704o391n2533
$$ -22813 8741 -50214 -91278 -142760 24941 -55395 -136366 11566 89270 82879 30346
16789C0346Q515Q9874n220q7578r9478K9982R5269j6212J4218p9446O3313j24845
$$ 30346 38861 128735 123515 35937 -63541 -33559 61710 45498 59716 -19730 43583 -81262
16777h1262o6767j26512J23345K42320J55288p5617j11932j12157n0777K4706
$$ -81262 -148029 -274541 -151196 91124 246412 170795 58863 -53294 -104071 -79365
16767g9365j0614J41800k9005m3631p5118P0509J2098n564j27660P5132J54208
$$ -79365 -89979 51821 22816 -20815 -95933 -25424 -13326 -18890 -146550 -71418 82790
16756H2790j05328j35136Q0298j17291o0844N9114K15429O3230K0962n9156j47136
$$ 82790 -22538 -157674 -77376 -194667 -255511 -196397 19032 82262 103224 44068 -103068
16745a03068L3240Q4701J32833J43373n2166K4739j29494j18297k095q1566N7222
$$ -103068 -69828 14873 147706 291079 238913 263652 134158 15861 13766 -67800 -10578
16734a0578J92167m8050p6681j49297J34394j08517q5315K04003j0471O0929j20820
$$ -10578 181589 133539 56858 -92439 41955 -66562 -151877 52126 41655 102584 -18236
16723a8236j212O7224j50705N4654J78007J1046l2840l9539K5921Q0717J32965
$$ -18236 -19448 47776 -102929 -48275 129732 140778 107938 68399 94320 175037 308002
16712C08002q1805n038k3632j91794j64119P5352J30343J09959J3224j99490j48939
$$ 308002 226197 221159 197527 5733 -158386 -83034 47309 157268 170492 -28998 -177937
16701a77937R4570J2086o3000j83823J45770K7790N6134P5734l2651q3372K0396
$$ -177937 -83367 -71281 -134281 -318104 -172334 -144544 -88410 -12676 -45327 -128699 -108303
16690a08303J7543R9450J39984J46796r9240j76699j91104j97415O3891J82761
$$ -108303 -90760 8690 148674 295470 196230 19531 -171573 -368988 -305097 -122336
16680a22336O6621j61057J724J84481R0579q9984o3619n6753J10340J67230n7106
$$ -122336 -55715 -216772 -215048 -30567 60012 -29972 -93591 -150344 -40004 127226 70120
16669G0120r1598j20484j04228J80707j12511M8073R665k939n5407R80n7199l1013
$$ 70120 -21478 -141962 -246190 -65483 -177994 -129921 -120256 -123195 -178602 -177622 -234821 -265834
16657b65834J948J14594m1192R4215J58268N7472r4680J67090K2609J60877J1562
$$ -265834 -263886 -149292 -190484 -96269 61999 119471 24791 191881 214490 375367 386929
16646C86929j99335k94483j02451K2025R8818l6488J24864N7588p3189p9200j22995
$$ 386929 187594 -106889 -209340 -187315 -88497 -124985 -121 57467 -15722 -94922 -217917
16635b17917J14101m3520j42219L1137R9119N3880n6916j12173J20931J0540L5282
$$ -217917 -103816 -147336 -289555 -258418 -159299 -105419 -162335 -274508 -153577 -143037 -107755
16624a07755M6461L2147L2646N5392m8329m5316J49051J57340j89432n0887l5967
$$ -107755 -61294 -29147 3499 58891 10562 -34754 114297 271637 82205 31318 -4649
16613d649J12454N4238j68407j15240o0576l1881N52J60815J32755J39411o8849
$$ -4649 107805 162043 -6364 -121604 -182180 -214061 -213509 -52694 80061 219472 150623
16602A50623M6275O4099k27349l19429k4907J8853N0370K5309L4558j51845P8497
$$ 150623 196898 260997 33648 -285781 -310688 -291835 -241465 -216156 -181598 -333443 -254946
16591b54946N7848l643Q0097K7460Q2960O3309j07448j2769j43573l8055o4856
$$ -254946 -197098 -200741 -120644 -93184 -10224 53085 -54363 -67132 -210705 -248760 -313616
16580c13616J7616J8339L063J69393J12078K1601p273j07980M067R6150O6984
$$ -313616 -296000 -277661 -274598 -105205 6873 28474 21201 -86779 -82712 13438 80422
16569H0422M4038r4418j25641j9638K8892j9438J3667J6180M3428q0562Q2797
$$ 80422 124460 30042 -95599 -115237 -86345 -105783 -92116 -75936 -32508 -113070 -30273
16558c0273j11442J3165K25191J16085r8155q0597j50470Q6171l2712n9200J21239
$$ -30273 -141715 -128550 96641 212726 114571 33974 -116496 -30325 -63037 -122237 -998
16547i98L8477J39985j11248o5460o3851l7030P5621J5436R96q4940J0567l9218
$$ -998 37479 177464 66216 756 -63095 -100125 -24504 -9068 -8072 -93012 -82445 -121663
16535a21663j4240q8550L6658Q1513o2597q3893J52692R9744L3665M9924L5677
$$ -121663 -135903 -224453 -187795 -106282 -168879 -252772 -100080 -336 33329 83253 118930
16524A18930k8943j54688l7592l996m9919K0714p0575L1961k0725J6032J04717
$$ 118930 89987 -64701 -102293 -106289 -156208 -135494 -206069 -174108 -194833 -178801 -74084
16513g4084N5114j28921Q3100N0254r7606m5158N9485K04274M0174j74648K006
$$ -74084 -18970 -147891 -64791 -14537 -112143 -157301 -97816 106458 146632 -28016 -26010
16502b6010J20523J22809o3029j44701M8808J4319r1542p2316k0707m967J43909
$$ -26010 94513 217322 154293 9592 58400 72719 -18823 -91139 -111846 -116813 27096
16491B7096J69256j22429j16309n5859R6899J13210J8297O0727k3880M5728r7442
$$ 27096 196352 73923 -42386 -98245 -1346 111864 130161 190888 167008 212736 115294
16480A15294p2821j23425r616K1214O6471K6603Q1940J2417o8988O5707q6545
$$ 115294 42473 -80952 -90568 -69354 -2883 23720 105660 118077 49089 114796 28251
16469B8251K3663R6751L630j37435j60941L1199K29257J12932j09096J6652j71957
$$ 28251 51914 148665 152295 14860 -146081 -114882 114375 227307 118211 134863 -37094
16458c7094j44034q2046R2151P2090M1099q625j03468K9584P5785P0769J63026
$$ -37094 -181128 -263174 -171023 -98933 -57834 -66459 -169927 -140343 -64558 6211 169237
16447A69237j61156j48856J89501O7568m8335j10857R0786r5962k37950j39267
$$ 169237 8081 -140775 48726 116294 67959 -42898 47888 -48074 -286024 -425291
16437d25291J20096J93457K0767J1918k056q9988L5048J22841O4459j06620P5540
$$ -425291 -305195 -111738 -90971 -79053 -81109 -171097 -136049 -13208 51251 -55369 20171
16426B0171K35509m5920j47092p3851j32855j53232l8484J26246J34984M3876
$$ 20171 255680 209760 62668 -11183 -144038 -297270 -335754 -209508 -74524 -30648
16416c0648P0748L3791R5911P0903K6027j1116q3691l05216m3510J66520k2843
$$ -30648 40100 73891 169802 240705 266732 255616 171925 -133291 -176801 -10281 -33124
16405c3124j24286M2620j9632K537K7166J6355j25990r6460j4167K29752J78303
$$ -33124 -157410 -114790 -134422 -131885 -104719 -88364 -214354 -310814 -324981 -95229 83074
16394H3074K8155Q2160j25217L35J31916M3896j76093o0499N4631J07406l2348
$$ 83074 111229 193389 68172 68507 200423 244319 68226 7727 62358 169764 137416
16383A37416q3890M9857M5789l3412J21694n4073k10067P7722j12815j53159R9940
$$ 137416 53526 103383 149172 115760 237454 183381 -26686 51036 -61779 -214938 -114998
16372a14998J426j349J89685J5976j51272J4760O3838J17289k813L2141l8324
$$ -114998 -113572 -114921 74764 90740 -60532 -45772 18066 135355 132542 164683 126359
16361A26359j15310n4410j11387J30160k4356n3615j7308k0337j58960o4327n6923
$$ 126359 11049 -43361 -154748 -24588 -48944 -102559 -119867 -140204 -299164 -363491 -420414
16350d20414J42788K23523K08141J46344j44150j65882q4991o9623j31014j12507
$$ -420414 -277626 -54103 154038 300382 156232 -9650 -94641 -164264 -295278 -407785
16340d07785L2133J33151K02681J6700J67016O0636k1760k8320l6737M8433n6106
$$ -407785 -375652 -242501 -39820 -23120 143896 204532 182772 154452 117715 166148 110042
16329A10042j11880p4526P3940K0579l3153P7546O188j01198m5657J85279j28364
$$ 110042 -1838 -76364 -2424 18155 -14998 62548 68736 -32462 -78119 107160 -21204
16318b1204m9508J0611P2589J11318J04706j1473k56093l68560O3345J35935J38180
$$ -21204 -70712 -60101 12488 123806 228512 217039 -39054 -407614 -344269 -208334 -70154
16307g0154L8567j21036j04260J04722R7421J5079l6648j12294J34432J91121
$$ -70154 -31587 -152623 -256883 -152161 -54740 -39661 -76309 -188603 -54171 136950
16297A36950n8317j02980j28456K4585P5963k4705R5434Q1606O6960p0451k62602
$$ 136950 78633 -24347 -152803 -128218 -52255 -76960 18474 100080 167040 96589 -166013
16286a66013r8352K267p4036J25914K73392N3162O1933l4596j37242J4793l5891
$$ -166013 -264365 -262098 -336134 -210220 63172 116334 178267 143671 6429 21222 -14669
16275a4669J05063l177j39953p8358J14124m3754j115m1403r6893J7243o1851
$$ -14669 90394 87217 -52736 -131094 -16970 -60724 -61839 -103242 -200135 -182892 -244743
16264b44743j14774M6422J73213L09693L2733n8640J90558l382j11180r3432k29143
$$ -244743 -359517 -313095 -139882 169811 202544 143904 334462 331080 219900 126468 -102675
16253a02675q0382q4839P1005j915k0356R49M8612O4645Q9838P1992N8499k06366
$$ -102675 -183057 -267896 -196891 -198806 -219162 -218213 -169601 -104956 -15118 56874 115373 -90993
16241i0993m9802J880K82516Q3104j70004l5690j46902L3097J47950J28470N7265
$$ -90993 -140795 -138915 143601 226705 56701 21011 -125891 -92794 55156 183626 240891
16230B40891r3672j60534N522n0252L5373L4474j91768n8918J08449K3140J14464
$$ 240891 147219 -13315 -7793 -58045 -22672 11802 -179966 -238884 -130435 -107295 7169
16219G169n5875K4651J25134q4421p4636J43964r5654j6770j2339J3685K3185
$$ 7169 -48706 -24055 101079 16658 -57978 85986 -9668 -26438 -38777 -25092 -1907
16208a907J5217J14385J1354J04420p3431q0030j26715J00486J33742o3971k40881
$$ -1907 13310 127695 139049 243469 170038 90008 -36707 63779 197521 133550 -107331
16197a07331j10407P3776P5520P1503l5315r3980O1038J42690j16191j20345L8870
$$ -107331 -217738 -143962 -68442 3061 -32254 -126234 -65196 77494 -38697 -159042 -120172
16186a20172J3226N6070J33851J37422j68777q6824J50647n49j68893j2253P1332
$$ -120172 -106946 -50876 82975 220397 51620 -35204 115443 114894 -53999 -66252 5080
16175E080q1330k3284O33J43047L4361j98588j22120J16147K19L4737J04036N0239
$$ 5080 -76250 -99534 -98901 44146 78507 -120081 -242201 -126054 -125835 -91098 12938 63177
16163F3177j23360J32140R3724J3275j22873O4858Q9035j64267j55863j6087L4525
$$ 63177 -60183 71957 165681 178956 56083 120941 209976 45709 -110154 -126241 -91716
16152i1716J07559K0169J53412l4682R9376m45j70471Q7922K4990q1411k16548
$$ -91716 15843 36012 189424 154742 254118 253673 83202 171124 196114 114703 -101845
16141a01845j53185k3424J41037J18043Q3180l4466J7636j41096n232m1530p2218
$$ -101845 -255030 -278454 -137417 -19374 63806 29340 46976 -94120 -99352 -140882 -213100
16130b13100k3631M9761J77235Q2590j02546k2138p16R2998K55200J24497k17560
$$ -213100 -236731 -186970 -9735 72855 -29691 -51829 -52545 40453 295653 420150 202590
16119B02590k36870j26202K45964K52083j35487j07250O5760m539p0004k8541
$$ 202590 -34280 -160482 85482 337565 202078 94828 160588 156049 86045 57504
16109E7504r9000l3540K36804o0471j79815p4945j7357l2921l9574J20313J07677
$$ 57504 -41496 -75036 161768 101297 -78518 -153463 -170820 -203741 -243315 -123002 -15325
16098a5325k3131R914n0820l3170J04724K8727r8675R7797n0312j0020j03635
$$ -15325 -38456 -28542 -79362 -112532 -7808 20919 -77756 20041 -30271 -40291 -143926
16087a43926L8203M8792Q010N8031l1973k46179K8126J25245L1798p115P3024
$$ -143926 -105723 -56931 -48921 9110 -22863 -269042 -240916 -115671 -83873 -90988 -17964
16076a7964N8504m1626K0310j43335j4287K9179j4864p2857Q971J43666J05965
$$ -17964 40540 -1086 19224 -124111 -138398 -109219 -124083 -196940 -187969 -44303 61662
16065F1662o8706M8380j46331j71287J4128k44l0451O8721J58083M0504j20127
$$ 61662 -7044 41336 -104995 -276282 -262154 -262398 -292849 -224128 -66045 -25541 -145668
16054a45668k08269L7257K77706K45972j33010M3259o3855r4659o6200J2308L2875
$$ -145668 -353937 -316680 -38974 206998 73988 117247 53392 -41267 -107467 -95159 -62284
16043f2284p1553Q8339P0489l6347L5307J20266J10493m7670o6478r0202K0075
$$ -62284 -133837 -45498 24991 -11356 23951 144217 254710 207040 140562 50360 70435
16032G0435l2353K431r5409k2160R5041m6149j77606p7229n028N7902M5790J78512
$$ 70435 38082 40513 -54896 -77056 17985 -28164 -205770 -282999 -288027 -230125 -184335 -5823
16020e823K66503l750p9766m0587o9358J47967O1004j21630k00662L2290J47318
$$ -5823 260680 256930 177164 136577 67219 215186 276190 154560 -46102 -13812 133506
16009A33506k0229r8407j48035J3263L8429q241j5428J00315k6233o0077m9708
$$ 133506 113277 14870 -133165 -119902 -81473 -89714 -105142 -4827 -31060 -91137 -140845
15998a40845k7350L6469m273j8084m5206j24242M9581J79447P2522j13940O3718
$$ -140845 -168195 -131726 -135999 -154083 -199289 -323531 -273950 -94503 -21981 -135921 -72203
15987g2203J31241O7370j4729l6503N587K1594M2205r2503q1360N7530q0916r6360
$$ -72203 59038 126408 111679 75176 80763 102357 144562 52059 -29301 28229 -52687 -149047
15975a49047Q8680m5674j23809J79925J11287P7218j8894m0700O3048o6239o2880
$$ -149047 -60367 -106041 -229850 -49925 61362 138580 119686 78986 142034 75795 12915
15964A2915p3456q616Q6555K5101K8067L4477l3230j10120K2160k2113R0202P1275
$$ 12915 -60541 -69157 17398 42499 70566 105043 71813 -38307 -16147 -38260 51942 123217
15952A23217q4916j83054P6688m8464o4220J51767J4208P582J55738m4504j78286
$$ 123217 38301 -144753 -68065 -116529 -180749 -28982 -14774 -7192 148546 104042 -74244
15941g4244Q6682L5543j7660p1737n4562Q3959R9206l0924m3292J7031q94j3942
$$ -74244 12438 47981 30321 -41416 -95978 -12019 87187 56263 12971 30002 29108 15166
15929A5166J2574r6566n3976M8311N530n4316k00816l5462J77674J53387J6476
$$ 15166 27740 -68826 -122802 -74491 -68961 -123277 -324093 -359555 -181881 -28494 -12018
15918a2018n7130R6769J46248P3232K6876p7635k8431n1446q4747l5515N8947
$$ -12018 -69148 27621 173869 247101 273977 196342 167911 116465 31718 -3797 55150
15907E5150k9566J0250n4834K175N520l5011K09605K07629r2663m383k05535j42704
$$ 55150 25584 35834 -19000 -16825 -11305 -46316 163289 370918 278255 273872 68337 -74367
15895g4367j68185K7582K45385J5637J8707J31411K3628l19255l7951O6693k6099
$$ -74367 -242552 -214970 30415 46052 64759 196170 219798 -99457 -137408 -70715 -96814
15884i6814j09898Q7760Q2564J58518N8429n5615k07114J55724P9271p240P6196
$$ -96814 -206712 -118952 -36388 122130 180559 124944 -82170 73554 152825 145585 221781
15873B21781O704j05899j22625p300k6720R0651O5187K0520q8359l9342J55893
$$ 221781 228485 122586 -39 -7339 -34059 56592 121779 142299 53940 14598 170491
15862A70491K34835k1386n6296q1693j67244k6881l13j38179J16970J13202o1461
$$ 170491 405326 383940 327644 245951 78707 51826 51513 -86666 30304 143506 82045
15851H2045R8185R8988p7781l6850m2353J9033m1777o7284O4635q024m1362l1077
$$ 82045 180230 279218 201437 164587 122234 141267 99490 32206 96841 88817 47455 16378
15839A6378m5920K7294L1901P0551q9995l7798k3579k20403j04526J51477L1049
$$ 16378 -29542 -2248 29653 100204 10209 -27589 -51168 -271571 -376097 -224620 -193571
15828a93571l3675o6713L3717L4561J5474J2276K3084K08753J10134j40467r5721
$$ -193571 -227246 -293959 -260242 -225681 -210207 -197931 -174847 33906 144040 3573 -92148
15817i2148n0673J6232k2502m8945L7187J18309J0074Q4395l1453R8073k2446
$$ -92148 -142821 -126589 -149091 -198036 -160849 -42540 -32466 51929 20476 118549 96103
15806I6103j03173J73428J03295j27489k10049j69814j8528n6122J9471Q8063
$$ 96103 -7070 166358 269653 142164 -67885 -237699 -256227 -312349 -292878 -204815
15796b04815n211M7805J15037J32851j1778r3016o7654m4466q2202J16264J20649
$$ -204815 -210026 -162221 -47184 85667 73889 -19127 -86781 -131247 -213449 -97185 23464
15785B3464J28046p5791q2969N6499M6686p1084J3912j5830J00939Q607J51951
$$ 23464 151510 75719 -7250 49249 95935 24851 38763 22933 123872 132479 284430
15774B84430P9079k08606o7514j21415O7389K5489M3869N1541j37982j44746m0373
$$ 284430 363509 154903 87389 -34026 33363 58852 102721 154262 16280 -128466 -168839
15763a68839O7632K2202J4631r743m9200J32249M3318L010m4527N5303L4259J01516
$$ -168839 -101207 -79005 -64374 -74117 -123317 8932 52250 55260 10733 66036 100295 201811
15751B01811P5072j65061j75359o3887M0980J70668l2678j25088N410k6187J612
$$ 201811 276883 111822 -63537 -127424 -86444 84224 51546 -73542 -68132 -94319 -92707
15740i2707J7000p33j5882P7603j00998Q1494J41137P326q6714j11636N5899j20833
$$ -92707 -75707 -76440 -92322 -14719 -115717 -34223 106914 114240 27526 -84110 -28211 -149044
$$ [...]
##END NTUPLES=NMR SPECTRUM
##END=
