##TITLE=Analysis number 311732
Compound Code cc 05601
Book Reference 446/6
Project Code qc-cat
Chemist Name roba
##JCAMPDX= 6.0         $$ Bruker NMR JCAMP-DX V2.0
##DATA TYPE= NMR SPECTRUM
##DATA CLASS= NTUPLES
##ORIGIN= Bruker BioSpin GmbH
##OWNER= NMR
$$ XWIN-NMR		Version 3.5
$$ Fri Jul 15 11:54:52 2005 GMT Daylight Time (UT+1h)  MAYBRIDGE\NMR@NMR_250MHZ
##.OBSERVE FREQUENCY= 250.131544655141
##.OBSERVE NUCLEUS= ^1H
##.ACQUISITION MODE= SIMULTANEOUS (DQD)
##.ACQUISITION SCHEME= undefined
##.AVERAGES= 16
##.DIGITISER RES= 18
##SPECTROMETER/DATA SYSTEM= dpx250
##.PULSE SEQUENCE= zg30
##.SOLVENT NAME= DMSO
##.SHIFT REFERENCE= (INTERNAL, DMSO, 0, 16.522)
##AUDIT TRAIL= $$ (NUMBER, WHEN, WHO, WHERE, WHAT)
$$ ##TITLE= Audit trail, XWIN-NMR		Version 3.5
$$ ##JCAMPDX= 5.01
$$ ##ORIGIN= Bruker BioSpin GmbH
$$ ##OWNER= NMR
$$ C:\u/data/dgb/nmr/ADRS/5900/pdata/1/auditp.txt
$$ ##AUDIT TRAIL=  $$ (NUMBER, WHEN, WHO, WHERE, WHAT)
(   1,<2005-07-15 11:54:33.58 +100>,<MAYBRIDGE\NMR>,<NMR_250MHZ>,
      <created by zg, POWCHK disabled, PULCHK disabled
       configuration hash MD5:
       62 19 C7 07 E1 42 D1 B7 37 6C 3D D0 77 39 F9 E6
       data hash MD5: 64K
       E4 32 07 F1 E0 12 EB 88 02 D2 C5 64 EB 86 05 5B>)
(   2,<2005-07-15 11:54:44.19 +100>,<MAYBRIDGE\NMR>,<NMR_250MHZ>,
      <Start of raw data processing
       ef LB = 0.3 FT_mod = 6 PKNL = 1 SI = 32K 
       data hash MD5: 32K
       15 31 08 98 8D 75 F1 E6 9D 7A DD 66 42 99 DC E5>)
(   3,<2005-07-15 11:54:46.07 +100>,<MAYBRIDGE\NMR>,<NMR_250MHZ>,
      <apk 
       data hash MD5: 32K
       83 FD EC 5B 83 A4 30 31 FC FF A5 F0 BF B2 14 08>)
(   4,<2005-07-15 11:54:46.72 +100>,<MAYBRIDGE\NMR>,<NMR_250MHZ>,
      <abs ABSG = 5 
       data hash MD5: 32K
       08 92 99 93 93 0D 2F 3C C2 87 2B 62 A8 8B 8E 04>)
$$ ##END=
$$ 
$$ hash MD5
$$ A8 B7 4A CC 72 E8 B8 48 7A F5 82 9F 6B 59 66 AE
##$RELAX= 
##$RELAX= 
##$RELAX= 
##$RELAX= 
##$RELAX= 
##$RELAX= 
##$RELAX= 
$$ Bruker specific parameters
$$ --------------------------
##$DU= <C:\u>
##$EXPNO= 5900
##$NAME= <ADRS>
##$PROCNO= 1
##$TYPE= <nmr>
##$USER= <dgb>
##$AMP= (0..31)
100 100 100 100 100 100 100 100 100 100 100 100 100 100 100 100 100 100 
100 100 100 100 100 100 100 100 100 100 100 100 100 100 
##$AQSEQ= 0
##$AQ_mod= 3
##$AUNM= <au_zg>
##$AUTOPOS= <17 >
##$BF1= 250.13
##$BF2= 250.13
##$BF3= 250.13
##$BF4= 250.13
##$BF5= 500.13
##$BF6= 500.13
##$BF7= 500.13
##$BF8= 500.13
##$BYTORDA= 1
##$CFDGTYP= 0
##$CFRGTYP= 5
##$CHEMSTR= <none>
##$CNST= (0..31)
1 1 145 1 1 1 1 1 1 1 1 1 1 1 1 1 1 1 1 1 1 1 1 1 1 1 1 1 1 1 1 1 
##$CPDPRG= <>
##$CPDPRG1= <>
##$CPDPRG2= <>
##$CPDPRG3= <>
##$CPDPRG4= <mlev>
##$CPDPRG5= <mlev>
##$CPDPRG6= <mlev>
##$CPDPRG7= <mlev>
##$CPDPRG8= <mlev>
##$CPDPRGB= <>
##$CPDPRGT= <>
##$D= (0..31)
0 1 0 0 0 0 0 0 0 0.06 0 0 0 0 0 0 0.0002 0 0 0 0 0 0 0 0 0 0 0 0 0 0 
0 
##$DATE= 1121424872
##$DBL= (0..7)
120 120 120 120 120 120 120 120 
##$DBP= (0..7)
150 150 150 150 150 150 150 150 
##$DBP07= 0
##$DBPNAM0= <>
##$DBPNAM1= <>
$$ [...]
##$SUBNAM7= <"">
##$SUBNAM8= <"">
##$SUBNAM9= <"">
##$SW= 20.6930455092707
##$SWIBOX= (0..15)
0 0 3 0 0 0 0 0 0 0 0 0 0 0 0 0 
##$SW_h= 5175.983436853
##$TD= 65536
##$TD0= 1
##$TE= 295.16
##$TE2= 300
##$TE3= 300
##$TEG= 300
##$TL= (0..7)
0 120 120 120 120 120 120 120 
##$TP= (0..7)
150 150 150 150 150 150 150 150 
##$TP07= 0
##$TPNAME0= <>
##$TPNAME1= <>
##$TPNAME2= <>
##$TPNAME3= <>
##$TPNAME4= <>
##$TPNAME5= <>
##$TPNAME6= <>
##$TPNAME7= <>
##$TPOAL= (0..7)
0.5 0.5 0.5 0.5 0.5 0.5 0.5 0.5 
##$TPOFFS= (0..7)
0 0 0 0 0 0 0 0 
##$TUNHIN= 0
##$TUNHOUT= 0
##$TUNXOUT= 0
##$USERA1= <user>
##$USERA2= <user>
##$USERA3= <user>
##$USERA4= <user>
##$USERA5= <user>
##$V9= 5
##$VALIST= <valist>
##$VCLIST= <CCCCCCCCCCCCCCC>
##$VD= 0
##$VDLIST= <DDDDDDDDDDDDDDD>
##$VPLIST= <PPPPPPPPPPPPPPP>
##$VTLIST= <TTTTTTTTTTTTTTT>
##$WBST= 1024
##$WBSW= 4
##$XGAIN= (0..3)
0 0 0 0 
##$XL= 0
##$YL= 0
##$YMAX_a= 289905
##$YMIN_a= -257119
##$ZGOPTNS= <>
##$ZL1= 120
##$ZL2= 120
##$ZL3= 120
##$ZL4= 120
##$ABSF1= 16.522
##$ABSF2= -4.171173
##$ABSG= 5
##$ABSL= 3
##$ALPHA= 0
##$AQORDER= 0
##$ASSFAC= 0
##$ASSFACI= 0
##$ASSFACX= 0
##$ASSWID= 0
##$AUNMP= <proc_1d>
##$AZFE= 0.1
##$AZFW= 0.1
##$BCFW= 0
##$BC_mod= 0
##$BYTORDP= 0
##$COROFFS= 0
##$CY= 12.5
##$DATMOD= 1
##$DC= 0
##$DFILT= <>
##$DTYPP= 0
##$F1P= 14.0000005364418
##$F2P= -0.99999901652339
##$FCOR= 0.5
##$FTSIZE= 32768
##$FT_mod= 6
##$GAMMA= 0
##$GB= 0
##$INTBC= 1
##$INTSCL= 1
##$ISEN= 128
##$LB= 0.3
##$LEV0= 0
##$LPBIN= 0
##$MAXI= 10000
##$MC2= 0
##$MEAN= 0
##$ME_mod= 0
##$MI= 0
##$NCOEF= 0
##$NC_proc= -5
##$NLEV= 6
##$NOISF1= 0
##$NOISF2= 0
##$NSP= 0
##$NTH_PI= 0
##$NZP= 0
##$OFFSET= 16.522
##$PC= 1
##$PHC0= -84.74195
##$PHC1= -0.1435125
##$PH_mod= 1
##$PKNL= yes
##$PPARMOD= 0
##$PSCAL= 4
##$PSIGN= 0
##$REVERSE= no
##$SF= 250.13
##$SI= 32768
##$SIGF1= 0
##$SIGF2= 0
##$SINO= 400
##$SIOLD= 32768
##$SREGLST= <1H.DMSO>
##$SSB= 0
##$STSI= 32768
##$STSR= 0
##$SW_p= 5175.98343685301
##$SYMM= 0
##$S_DEV= 0
##$TDeff= 65536
##$TDoff= 0
##$TI= <Analysis number 999999
Compound Code 99
Book Reference 9
Project Code 9>
##$TILT= no
##$TM1= 0
##$TM2= 0
##$TOPLEV= 0
##$USERP1= <user>
##$USERP2= <user>
##$USERP3= <user>
##$USERP4= <user>
##$USERP5= <user>
##$WDW= 1
##$XDIM= 32768
##$YMAX_p= 430316757
##$YMIN_p= -928264
$$ End of Bruker specific parameters
$$ ---------------------------------
##NTUPLES= NMR SPECTRUM
##VAR_NAME=  FREQUENCY,     SPECTRUM/REAL,   SPECTRUM/IMAG
##SYMBOL=    X,             R,               I
##VAR_TYPE=  INDEPENDENT,   DEPENDENT,       DEPENDENT
##VAR_FORM=  AFFN,          ASDF,            ASDF
##VAR_DIM=   32768,         32768,           32768
##UNITS=     HZ,            ARBITRARY UNITS, ARBITRARY UNITS
##FACTOR=    0.157963299565203, 1,           1
##FIRST=     4132.6476996994, 0,             0
##LAST=      -1043.33573715361, 0,           0
##MIN=       -1043.33573715361, -928264,     0
##MAX=       4132.6476996994, 430316757,     0
$$ Real data points
##PAGE= N=1
##DATA TABLE= (X++(R..R)), XYDATA
$$ [...]
24440b16253l6623j31786j7374R0801K05457j03528j15494j14387L6622J34674
24430b67891N9111r2555j15771j61401K76662Q1342k4443j94348J86524J09686
24420a43084N1340l5766P481k37993j73767L03679J65214o6518M7361j7081j1258
24409a10392o535n5202j52356r249Q7914k16580Q5387j9425j65985J69710J27992
24398b64721j5067r4326K36280J60244j92333k98755q1584n560K90300J01866
24388a63656O2668j14210J29479R0429J6533q7865O2724Q3670j75564Q7220k9188
24377c7760j08878J86414J19611m8519k42556Q33k09j1770P0366K36393j05211
24366E8714J5213r7686N6020J36344j09480j47711R5246J55932J03936k8524j27161
$$ y = [-216253, -252876, -384662, -402036, -311235, -105778, -209306, -324800, -439187, -402565, -267891, -208780, -301335, -417106, -578507, -301845, -220503, -244946, -439294, -252770, -143084, -91744, -127510, -120029, -358022, -531789, -228110, -62896, -129414, -82053, -99134, -110392, -116927, -172129, -324485, -333734, -245820, -462400, -377013, -396438, -562423, -392713, -264721, -279788, -374114, -137834, 22410, -169923, -468678, -550262, -555822, -265522, -163656, -100988, -215198, -85719, 4710, 21243, -66622, -3898, 79772, -95792, -8572, -37760, -146638, 39776, 159387, 110868, -131688, -130855, -131064, -142834, -72468, 163925, 58714, 73927, -23759, 32261, 168605, 59125, -88586, 6660, 162592, 266528, 238004, 110843]
24355A10843J11256Q1807k95899q193o0310j205j13708j70194q1029r6766L0152
24344d93246J46051J45088J61714J32273j0268k82486j30177J40529Q5595M1173
24334f3754n4326k1928J08548j06719j60831O6569j23848M39L34401l671M1879
24323A6759j08970K4597k09300K6707j52676q3959j45024j01157P4439J88299
24313d70285J61861J96730J13839j52344J8434J33173j93087k03767K7133J52286
24303b16027J0582k8053K20082J5790l10787r2992K07464O9878K4439P2691n8979
24292h5912j53658n8495m9562O6011J70700m6954j76356j20853K1913M1478J11574
24281b80114J21399j72905p4524J37778Q0424n8095j435M0114l1989p968K2988
$$ y = [110843, 222099, 303906, 8007, -186, -60496, -61701, -175409, -345603, -426632, -523398, -493246, -347195, -202107, -40393, 91880, 81612, -200874, -331051, -190522, -104927, -63754, -118080, -140008, -31460, -138179, -299010, -232441, -356289, -355850, -21449, -25120, 16759, -92211, -67614, -276914, -250207, -402883, -486842, -631866, -733023, -658584, -470285, -308424, -111694, 2145, -150199, -131765, 1408, -191679, -395446, -368313, -216027, -205445, -233498, -13416, 2374, -308413, -401405, -193941, -124063, -99624, -26933, -85912, -239570, -298065, -347627, -281616, -110916, -157870, -334226, -455079, -433166, -391688, -280114, -158715, -331620, -406144, -268366, -187942, -246037, -247472, -207358, -239347, -247315, -224327]
24270b24327j4357j25046k24302j11647l3005K20724O8030P8598J21459K88543
24260D4670J90820p0530p7232p4907j0683o5762R9074j5594k62593q0401P395
24249c15743K48791P387J17529j1120M9512j75656O7044K5111k4842L5149j86583
24238a63421j88880j72731O2885J56943k9720O2416P7367R4565k17725L1854M6282
24227b40165J05362r5095R3779j01251j56068M2561K2618K09445L0665R7270q3009
24216g3888j1741J13879r6414k46872P5066K3155L8075K67707m1040j4784P4760
24205A07903j40983j33307K5618q2413j90524P0210k0650o2712J52391o5552o3238
24194d03257J15101M9501n8785j99091k64955J47279J26045K53788q3118L6742
$$ y = [-224327, -238684, -363730, -588032, -699679, -732684, -511960, -443930, -365332, -243873, 44670, 235490, 164960, 87728, 12821, 2138, -63624, 35450, 19856, -242737, -323138, -315743, -66952, -59565, 57964, 46844, 96356, -79300, -12256, 12855, -11987, 23162, -163421, -352301, -525032, -462147, -305204, -334924, -272508, -195141, -100576, -318301, -286447, -240165, -134803, -229898, -136119, -237370, -393438, -350877, -328259, -118814, -88149, 9121, -73888, -85629, 28250, -68164, -315036, -239970, -216815, -178740, 88967, 47927, 33143, 107903, -33080, -166387, -140769, -223182, -413706, -343496, -364146, -426858, -274467, -340019, -403257, -288156, -238655, -297440, -496531, -761486, -614207, -488162, -234374, -317492, -280750]
24184b80750R262n0531O294p7606O1187M1705j12586k06213J33392L33212M1312
24173a01322j63947n0931R560m7185J4384J92880j57867L8588L527m4527K40712
24162f6128P4061o9286k57044O5597n6785o9412R7265J87424O1412j97875j34371
24151c65142j2800J84456M7738j73813J75540L678J2058j21437R6079p7307l77675
24140f08625O7672J69463K02938r9576j86997M6796J31977J42775m3442l3361
24130b10380L32478n0260k32744k02797J90383K01996j27805l47822m2735J74198
24120c15488j5718J70868K72208j01912j71398j09609P6685m8750p4056o6387
24110c83557K60201j13725j10206M9850J40430j0459r7590j6897j20656O6139
$$ y = [-280750, -271488, -322019, -315725, -393331, -332144, -290439, -403025, -609238, -475846, -142634, -101322, -265269, -316200, -306640, -353825, -339441, -146561, -304428, -265840, -262313, -306840, -66128, 7933, -61353, -318397, -252800, -309585, -378997, -281732, -94308, -32896, -230771, -365142, -377942, -193486, -145748, -319561, -144021, -140343, -128285, -249722, -153643, -230950, -608625, -540953, -371490, -168552, -268128, -455125, -408329, -276352, -133577, -177019, -210380, 122098, 71838, -160906, -363703, -173320, 28676, -99129, -446951, -489686, -315488, -331206, -160338, 111870, 9958, -161440, -271049, -194364, -243114, -317170, -383557, -123356, -237081, -347287, -297437, -157007, -167466, -265056, -281953, -402609, -336470]
24100c36470K0723r5643K16954J12170l3319k39797n5359Q0495l2828J09881K64817
24089A1624l7180k37710m2389J35399l7068j10734j14195o2351N557K11812O0397
24078b16838j14363j51832o9480j3124K07299k6908j32236k0047k2435J11218
24068d48746O8569M6297q7079R781m5101j04258r5320J37030n251p6876Q6397
24057e14557J43170j06489p7043K58178J91862r8466N5179J4837L3943j15552
24047b14938k04684j13751m6146K55394J70291n6851O6654o9149j06706r5224
24037d15110k04100N4850J68887L2966k6107l4779m0640p7542L1986K7543R2461
24026c89585J8726k7361J2149K2002k23473j12701K11110Q8297N5976j598J12475
$$ y = [-336470, -315747, -411390, -194436, -82266, -115585, -355382, -410741, -330246, -363074, -253193, 11624, -25556, -263266, -305655, -170256, -207324, -318058, -432253, -494604, -489047, -277235, -216838, -331201, -483033, -552513, -565637, -358338, -385246, -517482, -537529, -559964, -448746, -380177, -333880, -420959, -411178, -456279, -560537, -655857, -518827, -524078, -600954, -514557, -371387, -477876, -554919, -296741, -104879, -203345, -148166, -133329, -99386, -214938, -419622, -533373, -579519, -324125, -153834, -210685, -144031, -213180, -319886, -415110, -619210, -564360, -395473, -362507, -388614, -423393, -464033, -541575, -509589, -482046, -389585, -370859, -398220, -386071, -364069, -587542, -700243, -489133, -400836, -344860, -346458, -233983]
24015b33983N680j75191j5812L772j71600Q8439n165J66879m0388k19805N7175
24004e39999K87949J10197J5730k44558k60597q6363P444J879J33141J36608R0304
23993c48265l05211j6950L51169m8310j95289j73689N2913K53681Q5894J48158
23983a95899o2489j53816J508J64816K07326j17239j52568k72534J80271P2662
23973c27962N3685j10595j94016L1036r953O8164O0882K85113J60067q3684q568
23962g5831j82824j05988J05195N8986K9965J9160l4373k57023P2422J36806l4959
23951b68464Q2390q3548J42804J22489n1133K54682j41728k26145Q396N5713R8728
23940e816j65009j05438K74759L08648j30800j24481j35860j86278k08856m8425
$$ y = [-233983, -228303, -403494, -419306, -415534, -587134, -498695, -503860, -336981, -377369, -597174, -539999, -252050, -141853, -126123, -370681, -631278, -717641, -710197, -708318, -575177, -438569, -348265, -653476, -670426, -319257, -367567, -562856, -736545, -683632, -429951, -344057, -195899, -258388, -412204, -410696, -245880, -38554, -155793, -308361, -580895, -400624, -327962, -274277, -384872, -578888, -547852, -557805, -489641, -428759, -143646, 16421, -67263, -75831, -258655, -364643, -259448, -200462, -170497, -151337, -185710, -442733, -370311, -233505, -268464, -186074, -269622, -126818, -4329, -55462, 199220, 57492, -168653, -160257, -104544, -5816, -170825, -276263, -1504, 307144, 176344, 51863, -83997, -270275, -479131, -527556]
23930e27556O0266n3237j3822K00372K7890k4351P8182j8189Q8526q0279k0092
23919b82290O6489l9965q6762N6420r4117o0776R4988L1148k34083j38721K48104
23908d39565N6158j94022K0316J83412O8596J57342J62468j2419j61352O7115
23898i1951N5759j01496k25075o1258M8326m8292J04619Q3123J05860l7075j88946
23887c56406j876N4971R1082Q0418M8144q310O9079Q6140J48450j58372k17248
23876a63928K18887j24656k52101n8722P7284m3514j82587K286K81926J04042
23866a41083J25342R4225j48514j35399J16185j68434j26333j46654k01750J1558
23856g20857J7454m8706q4890P3023K30983J55181J50147N1260K00292J24480
$$ y = [-527556, -467290, -520527, -534349, -333977, -306087, -330438, -252256, -270445, -181919, -262198, -282290, -215801, -255766, -342528, -286108, -380225, -441001, -346013, -314865, -548948, -687669, -439565, -383407, -577429, -557113, -373701, -305105, -147763, 14705, 2286, -159066, -91951, -36192, -137688, -362763, -424021, -375695, -423987, -319368, -236245, -130385, -167460, -356406, -358282, -303311, -212229, -131811, -83667, -91977, -22898, 63242, 211692, 53320, -163928, 54959, -69697, -321798, -380520, -303236, -346750, -529337, -527051, -245125, -141083, -15741, 78484, -70030, -205429, -89244, -257678, -384011, -530665, -732415, -720857, -703403, -752109, -836999, -763976, -532993, -377812, -227665, -176405, 23887, 148367]
23846A48367p0720P0483j01580Q4388J35538N4020k674j10048k65981M2594o9194
23835h4807q125Q0949j54923j8312Q3108k1881j01201j08575j4501K39781K27816
23824A19329m3882m1724j79453n9804n9635J4679Q5711l463k30947j77874p1836
23813f48899Q9956K81037J94611M9498J18995o6431r4374j91575j01210P4893
23803b93499K22760k4752K7864n8799k2981J96984k41742p8501L22068K32683
23793B82085J3336j17846j91436j19032N2167p1141k64248j36756J22575J91863
23783b38433J49552l362Q458J24032j27094j51607L2808k12088j75319L600K7840
23772e61613N1544j42322K06123L37254K6017q644L6425q8011k16500k78857O6270
$$ y = [148367, 77647, 148130, 46550, 130938, 266476, 320496, 317822, 207774, -58207, -15613, -84807, -92932, -11983, -166906, -185218, -102110, -123991, -225192, -333767, -348268, -108487, 119329, 75447, 33723, -145730, -205534, -265169, -250490, -164779, -168242, -399189, -577063, -648899, -558943, -277906, -83295, -33797, 85198, 18767, -75607, -267182, -368392, -293499, -70739, -95491, -67627, -126426, -149407, 47577, -194165, -272666, 49402, 282085, 295421, 177575, -13861, -132893, -80726, -151867, -416115, -552871, -430296, -238433, -88881, -92243, -83785, 40247, -86847, -238454, -205646, -417734, -593053, -589453, -561613, -510069, -652391, -446268, -109014, -82997, -91641, -55216, -143227, -359727, -638584, -572314]
23761e72314K81458M7594k4460K56727k06401j35428j2889J48711K13639Q4304
23751H0941r6444J50657l904k52869m0306J7068l3171q0581j29804j31435J54298
23740c65550j7543K06884q7980p9915J31915K4039N0317J58212j2371k21153j70063
23729c83208K40370J32474k57657n4572M7991j2947J17941k92202j21596J4849
23719e68557J22931j13306K3364K18142n8425m9008K2257k0321q9007J26408L7013
23708c48509p3753R6816N6011M5933P9719k5827l5801q3883L8315q1016J00653
23697b31342J49675k71085j7314Q5526N8393J13956l5232k21482j07592M8376
23687d28121K16314L24435M0463p018l66239k06849j7165j02269M2375M2700K37489
$$ y = [-572314, -290856, -243262, -267722, -10995, -217396, -352824, -365713, -217002, -3363, 80941, -15503, 135154, 131250, -121619, -161925, -144857, -178028, -258609, -388413, -519848, -365550, -383093, -176209, -264189, -344104, -212189, -188150, -137833, 20379, 8008, -213145, -383208, -142838, -10364, -268021, -322593, -274602, -287549, -169608, -461810, -583406, -568557, -445626, -558932, -535568, -317426, -375851, -424859, -402602, -422923, -511930, -385522, -348509, -422262, -325446, -269435, -223502, -143783, -169610, -205411, -289294, -250979, -331995, -231342, -81667, -352752, -370066, -284540, -226147, -112191, -147423, -368905, -476497, -428121, -211807, 112628, 153091, 146073, -220166, -427015, -444180, -546449, -504074, -461374, -223885]
23676b23885M3149p7128K3886K1084j08611l88622Q1032L84068O8996J44392q4537
23665a16176j16917j52582o8902J2937R4774J06375J40743j84561p0526P9476
23655b75359J62308q9871j11088J23583J38596j2317l10508p9162N2226k61858
23645f63450j16144J61500J54777L15231m8717p4748j34437Q5969J98450j19206
23635b40775k35136J21174K7370J04687j6839n2248m9799K35850J3206L4017Q5328
23624B6835q8256q8987P7827R3348K7342j0605j54293q8209q2819p9351k515k547
23612c72230N342j30703j11077K68266J7598k17456l01918j914J06012j3536R7343
23601f54273L36097K26280J14866p402M3113j85391m0243l4350j71617l7425J44146
$$ y = [-223885, -180736, -257864, -233978, -212894, -321505, -710127, -629095, -245027, -176031, -31639, -116176, -233093, -385675, -454577, -441640, -346866, -240491, -99748, -284309, -354835, -275359, -113051, -202922, -314010, -190427, -51831, -64148, -374656, -453818, -401592, -663450, -779594, -618094, -463317, -148086, -196803, -271551, -405988, -320019, -121569, -240775, -475911, -354737, -327367, -222680, -239519, -291767, -341566, -105716, -92510, -58493, 26835, -61421, -150408, -72581, 20767, 48109, 37504, -116789, -204998, -287817, -367168, -369683, -372230, -366888, -497591, -608668, -340402, -322804, -540260, -842178, -844092, -738080, -751616, -654273, -318176, -91896, 22970, 15568, 58681, -126710, -166953, -201303, -372920, -410345, -266199]
23590b66199r4215k24829j8514q5901K71863K24002J78923l4533k71556j48279
23580d69238l9874P1060n7901J15161J38434J16861P8588Q0323L2983j45733m9607
23569a28943k4530M2290n360n8564j66369N8748K05438k43898J06541R4425R4020
23558b6202J53608k6469k58050J18757k17078j75847L51263k6162n8944r60R2475
23547g3609J41653n7749k36539j61027o4419J0040J81261j16224k6458J92948
23537b10123j29107j51845k05910J52428J3468L94472k10869k92509J75272O3413
23527d01310R8536k1170j21229p6081J96009j59813j86784l3041n9167J62804
23517f01246Q4222J22040O0129R983J7382j25037p4113K9289R4667J8907Q5145
$$ y = [-266199, -360414, -585243, -603757, -689658, -417795, -193793, -14870, -49403, -320959, -469238, -509112, -438052, -495953, -380792, -242358, -125497, -46909, 33414, 66397, -79336, -128943, -153473, -111183, -116543, -175107, -341476, -282728, -77290, -321188, -214647, -120222, -26202, 127406, 100937, -157113, -38356, -255434, -431281, -80018, -106180, -165124, -166084, -73609, 68044, 10295, -226244, -387271, -451690, -441650, -260389, -376613, -403071, -210123, -339230, -491075, -696985, -544557, -531089, -136617, -347486, -639995, -464723, -401310, -302774, -323944, -445173, -521254, -325245, -485058, -671842, -704883, -764050, -601246, -517024, -394984, -334855, -324872, -307490, -432527, -506640, -477351, -382684, -363777, -278632]
23506b78632Q7264K46657P0122j64732j35903m2829L7202n7978j17858l9623O3869
23495c32441J10612l51418k0041K2230K07434J46843j17541o2066K45584R0478
23485f0326j27373j44002j15899K01199N773k03958j11753j11130K6748Q7166
23475e53555N4944n5724J75282P9998Q8823Q425k07413n0188m4247o0196K16828
23464c47023n2734k46113J2068J47494J38255R4281j115j00309k2622L9505J9518
23453c18795n4354n7732p9551L8835R7958J47257P8574K3309p9286m3637R6553
23442a50869N4062j47863j57358P8981L0618P8480l0013J27872j54998j8264J43086
23431a46266Q5239k91676k79453K50226O7607q7574n6676j15338M9233L11410
$$ y = [-278632, -191368, 55289, 125411, -39321, -175224, -218053, -180851, -238829, -356687, -396310, -332441, -221829, -573247, -593288, -571058, -363624, -216781, -334322, -396388, -150804, -60326, -187699, -331701, -447600, -246401, -240628, -444586, -556339, -667469, -640721, -553555, -498611, -554335, -379053, -299055, -210232, -201807, -409220, -459408, -503655, -563851, -347023, -399757, -645870, -633802, -486308, -348053, -253772, -254887, -355196, -377818, -338313, -318795, -373149, -430881, -510432, -471597, -373639, -226382, -147808, -124499, -203785, -247422, -150869, -96807, -244670, -402028, -323047, -292429, -213949, -243962, -116090, -271088, -289352, -146266, -61027, -352703, -632156, -381930, -314323, -401897, -458573, -573911, -524678, -213268]
23421b13268m7118l06603P9454J47310M2970J33831o167k13135K8289l2840l4686
23410d21963k086K0218q2600r6007l1860K0192O3165o03K04256L4770k67872r1215
23398f51605N9713o5185R9396K60576J00834o2431N8284j2267J8828j61486l8746
23387c94089P2384J43646J08614n829m8580p3440K9351J27433n9555K3311K1734
23376e5020M1332j06514j30681Q8809k4220J67630R5793k86399j89824m6756m5310
23365d91160J51991J36289N4042p3258M947K6470L0068K4371j02754k9660J9402
23354b49252n6647j78010q7734K87366M06426j14254L8742M9155O0619l31379
23344a74968j81875P4432r7392p1996j25001J74128J94499o7703K35233o9396
$$ y = [-213268, -260386, -566989, -487535, -340225, -297255, -163424, -169591, -382726, -354437, -387277, -421963, -424049, -403831, -486431, -582438, -614298, -594106, -530941, -531544, -327288, -292518, -560390, -651605, -591892, -657077, -557681, -297105, -196271, -258702, -200418, -212685, -193857, -355343, -394089, -321705, -178059, -69445, -75274, -123854, -197294, -167943, -40510, -100065, -76754, -55020, -13688, -120202, -250883, -162074, -186294, -18664, 77129, -209270, -399094, -445850, -491160, -339169, -202880, -148838, -222096, -217149, -190679, -160611, -136240, -238994, -268654, -249252, -305899, -483909, -571643, -284277, 122149, 7895, 46637, 95792, 156411, -174968, -356843, -282411, -379803, -451799, -576800, -402672, -208173, -275876, -40643, -110039]
23334a10039j70592J08417j1873K784R8665P9625k04165q2880J09962J53157J9746
23323g193k06382r2743L462J55091j13230J30507J49111J2661l1544P3695N3078
23312A26513j11612n1796q0848K5480K13335j30114J32753r5839j51429r6223
23302b19780L9614J12128o8435k21551j84581l3975K7151J64989K42601M1511
23292a00328j38143j6731r6971L3834J8988l8189J58492J60069J7635p0569p0852
23281a42765q7729J5505L6597l6917Q1821n2448J32496J21787M6799R3835j22927
23270H6054n39288m36274K52277J13238J32502o1613j98181P913J74817K9523
23260d39032j26561q100J72626m9860j3399Q8186J36601J54297j35474n1475L8041
$$ y = [-110039, -280631, -172214, -184087, -181303, -82638, -3013, -207178, -290058, -180096, -26939, -7193, -213575, -306318, -302856, -147765, -260995, -130488, 18623, 31284, -260, 73435, 126513, 14901, -36895, -117743, -92263, 121072, -9042, 123711, 27872, -123557, -219780, -180166, -68038, -136473, -358024, -542605, -576580, -549429, -384440, -141839, -100328, -238471, -255202, -352173, -318339, -299351, -337540, -179048, -18979, -1344, -71913, -142765, -230494, -214989, -178392, -215309, -133488, -185936, -53440, 68347, 115146, 208981, 86054, -453234, -889508, -637231, -523993, -391491, -453104, -651285, -643372, -468555, -439032, -565593, -573693, -401067, -450927, -464326, -376140, -239539, -85242, -220716, -272191, -234150]
23249b34150K7567m8178R8767j73888l40991p5696J24708K26273R9402J4627k7601
23238c09160J2234j64867J08584K45612q6224r9537p3664Q4035J1861k2901K2907
23227b71120j63875q7364L1854j06002Q5874M6504N5991K62024J8519n6348j81060
23216c65003n8788j5750K6317k7729O4443R4121M0811j36182M9489K24243k68673
23205c72701k51957l9819L1835l7780n2766J56851Q3811o2947J92803K63138k16862
23194c06394m8094r5514Q76J89778N0395K60641K22376j76105k51300q4102k13938
23183d51381J57856J27214J21002Q3967p0160j16488j05695j62973l659J13686
23173c06631K18748k22201r0051r262k2140j3990N9433K47509P6797O4050k3351
$$ y = [-234150, -206583, -254761, -155994, -329882, -670873, -746569, -621861, -395588, -296186, -281559, -309160, -296926, -461793, -353209, -107597, -193821, -293358, -367022, -282987, -271126, -294027, -271120, -434995, -522359, -490505, -596507, -510633, -464129, -408138, -146114, -127595, -183943, -365003, -423791, -439541, -413224, -440953, -376510, -282389, -241578, -377760, -328271, -104028, -372701, -624658, -664477, -632642, -670422, -723188, -566337, -482526, -545473, -352670, -89532, -306394, -354488, -450002, -449126, -259348, -208953, 51688, 274064, 97959, -153341, -237443, -451381, -293525, -166311, -45309, 38658, -31502, -147990, -253685, -416658, -420317, -306631, -87883, -310084, -400135, -409397, -431537, -445527, -386094, -138585, -61788, 2262, -21089]
23162b1089k00023l1364M4822M438R7472r2683q6322O9420m9876M6025j5961j33622
23150c68763J71351M9384M0091Q4915r9796K4895k34604j48186K66412K72170
23140E7869j68981k90911k18548l2393k19158O4362L23234L1643j39400J97895
23130c94388J38066K55541J39076J2351N2679l18332l0697j64983j23756j48021
23120e82464P3163J91643o2460J10099K28118p188j96525j08191j05755o2251
23110e21811O8194J69535M6312P9999J78493j06142j36656j02168Q4504J92934
23100d6806J70868M1178r0274k81182k02128J4758R8354K25403o8552k84721l12683
23089g35785L3173L21456J44866J2234m0866p1441k4774K13494K16256O5269j54174
$$ y = [-21089, -221112, -252476, -207654, -203216, -105744, -198427, -284749, -215329, -265205, -219180, -235141, -368763, -197412, -148028, -107937, -23022, -122818, -97923, -332527, -480713, -214301, 57869, -111112, -402023, -620571, -652964, -872122, -807760, -484526, -452883, -592283, -394388, -256322, -781, 138295, 150646, 203325, -115007, -145704, -310687, -434443, -582464, -509301, -317658, -380118, -270019, -41901, -49089, -245614, -353805, -459560, -521811, -453617, -284082, -237770, -157771, 20722, -85420, -222076, -324244, -239740, -46806, 124062, 165240, 74966, -206216, -408344, -393586, -295232, -69829, -138381, -423102, -735785, -702612, -381156, -236290, -224056, -264922, -336363, -361137, -147643, 68613, 133882, -20292]
23078b0292k9996o4350k03155o5536j07731K11263K43112R2937L7997j12362k59340
23067b77453j13228J35041J87715M2950l0064k0070m0177n1474k97420k51442
23057g15622K29935J60436K28600m3401q1719q9170l25962k51965l7741Q2437
23047h44172K05329J05455j00271J4376K48118j44230j00820K60587Q0444m7896
23037c23080J66899n4783Q8226R0092k8573J4664J52187o169r1317j53211l84812
23026e29877R7311K59658j74149O0310J42425K83261J07109Q1941l11963l37334
23016c21308j02340O6447R8780j68782l40830J7613O5772L308K21269J60095J69416
23005a30560p9435j59899j25199J02322K57379K68953J54741j10399j64894l33115
$$ y = [-20292, -50288, -114638, -317793, -383329, -491060, -279797, -36685, 56252, 94249, -18113, -277453, -390681, -255640, -67925, -24975, -55039, -75109, -115286, -166760, -464180, -715622, -485687, -325251, -96651, -140052, -221771, -310941, -636903, -888868, -926609, -844172, -638843, -533388, -633659, -619283, -371165, -515395, -616215, -355628, -275184, -323080, -156181, -210964, -122738, -32646, -61219, -46555, 105632, 99463, 8146, -145065, -529877, -432566, -172908, -347057, -286747, -144322, 138939, 246048, 327989, 16026, -321308, -423648, -357201, -258421, -427203, -768033, -750420, -684648, -681340, -460071, -299976, -130560, -209995, -369894, -495093, -392771, -135392, 133561, 288302, 177903, 13009, -320106]
22995c20106k13910K50713J3727R8798J54953O5330j74323j34940j79156J24192
22985c14722J56526p0209p0588j62194J23190J29965o890J84602N8126N5364M0083
22974A23253p3389q202M9195q4611n0583j61570j96347k24793J79847K61755J5670
22963a69775r678R9024j03246j23923J41250l129m4505j64568J16188M7300J7265
22952a97797j53721j43315j92087j20872J57302K12489L34329Q215j41518o9718
22942c06693j73190J01950Q6171l13889k67921K96936J23245N490K8522J79157
22932b40222j98246o9323J58194L51112o3263j80481J38039J51600N5739l21401
22922b18252j3362l8959K8719J45516q312Q7644j54240j10477M2531j55924J30864
$$ y = [-320106, -534016, -283303, -269576, -170778, -15825, 49505, -124818, -259758, -438914, -314722, -158196, -228405, -298993, -461187, -337997, -208032, -214922, -30320, 27806, 83170, 123253, 49864, 41662, 90857, 6246, -44337, -205907, -402254, -627047, -447200, -185445, -169775, -179453, -80429, -183675, -307598, -166348, -169477, -213982, -378550, -262362, -215062, -197797, -351518, -494833, -686920, -807792, -650490, -438001, -103672, -95457, -236975, -306693, -479883, -377933, -291762, -605651, -873572, -576636, -453391, -447901, -419379, -240222, -438468, -507791, -349597, 1515, -61748, -242229, -104190, 47410, 103149, -218252, -231614, -270573, -241854, -96338, -104650, -17006, -171246, -281723, -239192, -395116, -264252]
22911b64252J70655Q2695K51718j9001k44414k16499j58249r8908M284J32725
22901c59246K55157R6424l3890j18708j51562m0333O7650m8247Q1681R8486O5559
22890h7029j97740k38066K3632o7630P0516L4749k90516j73316K75896L59996
22880b89508J24917M5991k43152j60991n0162m8391J94858R301O2469m4562J72325
22869b26905L2629j21457j11288j13109j00136J30774J21034j16334J52615J18069
22859b34108j70706j1592K76054R9375Q2457m1411j41284m1746j3986J17495k50151
22848c29603l29834K09335M65638o0121k79097P3195o0643j22983K68668L42028
22838A76583j34414r9670J215N1057k17377p2708N9024K2370K49933J03729k11967
$$ y = [-264252, -93597, -10902, 240816, 221815, -22599, -239098, -397347, -496255, -491971, -359246, -104089, -7665, -41555, -160263, -311825, -352158, -284508, -332755, -251074, -152588, -87029, -284769, -522835, -499203, -566833, -496317, -461568, -752084, -925400, -649504, -289508, -164591, -118600, -361752, -522743, -572905, -621296, -426438, -417137, -354668, -399230, -226905, -194276, -315733, -427021, -540130, -640266, -509492, -388458, -504792, -352177, -234108, -404814, -416406, -140352, -40977, 41480, 69, -141215, -182961, -196947, -79452, -329603, -659437, -450102, 15536, -44585, -323682, -250487, -311130, -434113, -165445, 176583, 42169, -57501, -56286, -5229, -222606, -295314, -236290, -213920, 36013, 139742, -72225]
22827g2225j04435j1965O8174J45923j67465k63681l0338J71785J12829N3803
22817i7595k54401j89479K84414K37788N8124N2406q0399j73007J2968J10971
22807c8210j19254K0904k6813j38434l7649P3527J58217L2973j88141P7087J92408
22796F615m1058j55531j00645J9431K600l2635M4214j25634l9935O6500J85939
22785a70139R5130n8703l55409k67179K95267K88734J23645R9146r6643P2249
22775B6098K7552J46164p5985l20482j91771k1985R8368P568J5178J77930K17677
22764A06312l33681l55841m8919Q2490J27715O6993k3418n9517k6643J34423M0835
22753b89251j77185j25120K34041J85025j24452L2855k8409r5327j47933P2627
$$ y = [-72225, -176660, -188625, -120451, 25472, -141993, -405674, -436012, -264227, -151398, -97595, -351996, -541475, -257061, -19273, 38851, 91257, 10858, -162149, -149181, -38210, -157464, -136560, -163373, -301807, -339456, -265929, -107712, -74739, -262880, -185793, 6615, -34443, -189974, -290619, -271188, -268588, -301223, -257009, -382643, -422578, -356078, -170139, -75009, -133712, -489121, -756300, -461033, -172299, -48654, 50492, -46151, 26098, 53650, 199814, 123829, -196653, -388424, -410409, -312041, -304473, -289295, -111365, 106312, -227369, -583210, -632129, -549639, -421924, -354931, -378349, -437866, -464509, -330086, -289251, -466436, -591556, -357515, -172490, -296942, -264087, -292496, -387823, -535756, -463129]
22743d63129K66491J21882k311j88963o0927q2845J3672P4526r6035K15278J08928
22732i3433q1416l03364j73491J77745K15707q7590j021j36790J6423m5449K8957
22721d83722k6123j24703K3558j41273J55748N0556j36326j64261P062K96458
22711e43026M1188P5088R292J25329J07077n9180j58348k65169J36801L00867
22701b30081J25292Q7293j44881J36041j04525k5229j28353J13247O4527J46139
22691C9470j03510N2796j32967k61680K04331J99164j64398n5351K2361j28084
22681c27868j74011N9491L5799J72131J29348m8430p4471N4229j20479J13186
22671a81075L335o6988k9976J36671o9821k57066J09546l1488J65593N8313j41662
$$ y = [-463129, -196638, -74756, -77067, -266030, -326957, -409802, -396130, -321604, -417639, -202361, -93433, -174849, -478213, -651704, -473959, -258252, -345842, -346863, -483653, -467230, -512679, -483722, -509845, -634548, -610990, -752263, -596515, -545959, -682285, -846546, -839484, -543026, -501838, -426750, -417458, -292129, -185052, -244232, -402580, -667749, -530948, -230081, -104789, -17496, -162377, -26336, -130861, -156090, -284443, -171196, -106669, 39470, -64040, -11244, -144211, -405891, -201560, -2396, -166794, -222145, -199784, -327868, -501879, -442388, -406589, -234458, -105110, -153540, -228011, -173782, -294261, -181075, -177740, -244728, -274704, -138033, -207854, -464920, -355374, -386862, -221269, -162956, -304618]
22660c04618j63116m1001K4247J87939K64911J10330j90689R3581J76479j14612
22650D3451j41365n8332k66034O8087k9494j39455J92251l4480o1163L944J31646
22639b90944J5751K6557j6155J4001r6437l5936L46975L7511J46108L75001o8183
22628D54249j1345L79j24582j13676k01260O4672R8598k71077j77261J27K33Q6365
22616a94578P1679p7922j98863N4641N2851P6062M9529k16406L578J81819l7801
22605b35411J79243r122j44976q5993m6304q7890j8698J43672K16604J24683j53725
22594a17917j29201j28531K8253J8305K09570P5994k2496k39741M0434l6549L1919
22583b69960j93947n4432J73082L9347n1889k2290J18595K25340L8433l1104j17225
$$ y = [-304618, -467734, -508735, -484488, -296549, -31638, 78692, -111997, -18416, 158063, 43451, -97914, -156246, -422280, -354193, -383687, -523142, -330891, -365371, -426534, -422590, -290944, -275193, -248636, -264791, -250790, -347227, -383163, -36188, 1323, 147431, 522432, 454249, 442904, 443283, 318701, 205025, 3765, 68437, 167035, -104042, -281303, -281176, -280943, -194578, -122899, -200821, -399684, -345043, -292192, -216130, -166601, -383007, -379429, -197610, -235411, -56168, -65290, -210266, -296259, -342563, -430453, -449151, -305479, -88875, 35808, -117917, -247118, -375649, -347396, -329091, -119521, -43527, -66023, -305764, -265330, -301879, -269960, -463907, -518339, -345257, -305910, -357799, -380089, -261494, -36154, 2279, -28825, -146050]
22572a46050K05210j19340l80435q598L6074Q124L0899r8758j67081J75074J90481
22561b74400J9673J87077l7052j74008J00060J45543j02647k51151k4466K4023
22551c87348r8833l9476P0604n2122P4915j71547l24457L5137J81600J35097J14839
22540d61591K75712j1670j41666l59242j71612J94390K48883l1786K0934J8260
22530d19388K0477O5076R7634O3781r5844q4711J37820P0012j60281L5094K1680
22519b48650k09374N4445L17799j0955Q7642J29178k82741j14862j6261J12760
22509a81019k80196K6025O0189N6755m6215j8727O6207P2107K8390j511j42273
22498c60268m1246k16979n1135p178J79678J75213K4531n9280k9800J2940O5190
$$ y = [-146050, 59160, -60180, -440615, -449213, -413139, -405015, -374116, -472874, -639955, -464881, -274400, -254727, -67650, -104702, -278710, -178650, -33107, -135754, -386905, -411371, -387348, -486181, -525657, -455053, -507175, -432260, -603807, -928264, -893127, -711527, -576430, -461591, -185879, -197549, -339215, -698457, -870069, -675679, -426796, -458582, -437648, -419388, -398911, -333835, -236201, -172420, -268264, -352975, -215155, -145143, -305424, -270330, -248650, -458024, -403579, -85780, -96735, -9093, 120085, -162656, -277518, -293779, -181019, -461215, -435190, -375001, -318246, -364461, -383188, -316981, -244874, -216484, -217995, -360268, -401514, -618493, -669628, -676806, -497128, -321915, -297384, -356664, -386464, -373524, -308334]
22487c08334o106K8826K31792L9043j66555r3019j1127Q4671q1007j6479j01491
22476c99786J26179P9110K11344k8963k63553K4124j30254j05068k8795m8301
22466e63963J28523P0065m0367J52317K8068L4364j00413l5956M4066p5143n1872
22455d10311k37063K46389L61532L8377N1073L8635j02780J35184J5529l33129
22445a96564j64353K68110R0662L3619J6680n549O9934L6779k81107j72721m2990
22434c47500J2850m0962L3438Q3525n7920m0027K49739J43205M48k30895j8583
22423b12682j70803k25741O2365J80224P5259J01594o5457p1780O0929m1731q9200
22412c97023M9959L1314k4657K4260L9971k08581J01207Q7282l1934k1739l5655
$$ y = [-308334, -314440, -285614, -53822, -14779, -181334, -274353, -285480, -200809, -281816, -298295, -399786, -273607, -194497, 16847, -12116, -275669, -251545, -381799, -486867, -515662, -563963, -435440, -365375, -405742, -253425, -225357, -190993, -291406, -327362, -283296, -358439, -410311, -647374, -400985, -39453, -1076, 49997, 88632, -14148, 121036, 136565, -196564, -360917, -92807, -2145, 31474, 48154, 42605, 112539, 149318, -131789, -304510, -347500, -334650, -375612, -342174, -258649, -316569, -356596, -106857, 36348, 36796, -194099, -212682, -383485, -609226, -546861, -366637, -291378, -189784, -255241, -327021, -266092, -307823, -397023, -347064, -315750, -340407, -316147, -276176, -484757, -383550, -296268, -328202, -349941, -385596]
22401c85596K39590K67045j17429j75294k4576J5310j4386J60932j8824p9576
22391a32804j7725J65084p9855j183N1526j11270M7131j90277j64969J70104l4010
22380b98248n9384j22794J02740n3512J71558J30914J01070L9588l7627j61639
22370a87334p4185J09145j03391j46891k18617K41994J46126r8731j74j567j19258
22359d52883j68037n1199J38454L12373K73959J02624j09472k98869j41470J63490
22349b31030M09090j96928k71796K7452p7328N5464m0750J08290J7091p7550J70572
22338a07423J09646q4435k06028j04831J09167J27107P3753q1111J09574M4931
22328i650n3059r0607n8983J60706L7077J03780N4134m8223j8992j19033O6636
$$ y = [-385596, -146006, 121039, 3610, -171684, -196260, -180950, -195336, -34404, -53228, -132804, -150529, 14555, -65300, -66483, -14957, -126227, -79096, -269373, -434342, -264238, -298248, -357632, -480426, -377686, -431198, -259640, -128726, -27656, 11932, -25695, -187334, -261519, -152374, -255765, -402656, -621273, -379279, -233153, -331884, -332058, -333625, -452883, -620920, -672119, -533665, -221292, 52667, 155291, 45819, -253050, -394520, -231030, 178060, -18868, -290664, -263212, -340540, -285076, -325826, -217536, -200445, -277995, -107423, 2223, -82212, -288240, -393071, -283904, -156797, -83044, -164155, -54581, -9650, -62709, -153316, -212299, -51593, -14516, 89264, 143398, 95175, 76183, -42850, 23786]
22317B3786J9544Q5050j50255k42560j16150J81706L4390n9414J4683J17377O687
22306h5156k00852N456K39037J51500j92434j52200j21667K17480K20225k0722
22296F0667k00172k62128R8004J00726J1352n1144p8293k80455K29699J24037
22286b47707j34554p8025P9188q6174K1240L21495p8657k28785M0414k44078k73892
22275i09535J70380L11063J35932q4802J15097N9649j07797j1165P1878K2693
22265b26607Q631L0509p0647k07217m6039P018L066K79471K42857o8728O203Q775
22253c2708j1129n9027k41569q1834K6887J69001J68058k5569j77145j4866J90855
22242h9046j82359n1458M9738N2795P7642K20530L701j18492N7868q5187l317
$$ y = [23786, 43330, 128380, -21875, -264435, -380585, -198879, -164489, -223903, -209220, -91843, -85156, -286008, -280552, -41515, 109985, -82449, -234649, -356316, -138836, 81389, 60667, -139505, -401633, -303629, -202903, -191551, -242695, -320988, -601443, -371744, -247707, -382261, -460286, -381098, -467272, -446032, -124537, -203194, -431979, -391565, -635643, -909535, -739155, -428092, -292160, -376962, -261865, -202216, -310013, -321178, -249300, -226607, -217976, -187467, -258114, -465331, -511370, -504352, -501286, -221815, 21042, -47686, -41483, -32708, -43837, -102864, -344433, -426267, -399380, -230379, -62321, -87890, -265035, -279901, -89046, -271405, -322863, -273125, -220330, -142688, 77842, 81543, -36949, 20919, -64268, -67585]
22231f7585j67663j2722l0723o5321M2874J96329Q9034k89713J5503j02374r8386
22220d90747R3380N5984j51651p7499k12027r2260K22780Q4368k4765N3598n5963
22209e94802j9996J98752R689j52121J56704L121L1022J79516J22207J05020n9231
22198b0119j93538J04333j27128N6251p9676m52249j61781J69024L68666R1467
22188b44750J00127m8785l247J8092q1273k61617n2365J14033j59664J43157J18824
22177c57468J969L1901k51774k59491K66511J84365L6402N0042p6377K7234K33899
22166a12787L6299j7492J63005j73881l49170p3474k85653K2182L72557K58727
22156a59687r3089k26476Q7534p7524O5769j00611J7823J06619K8115J15443o980
$$ y = [-67585, -235248, -247970, -278693, -344014, -301140, -104811, -15777, -305490, -289987, -392361, -490747, -397367, -341383, -493034, -570533, -782560, -874820, -652040, -567672, -592437, -538839, -594802, -614798, -416046, -406357, -558478, -401774, -398653, -367631, -188115, -65908, 39112, -20119, -213657, -109324, -236452, -180201, -259877, -712126, -873907, -704883, -336217, -244750, -144623, -193408, -196655, -178563, -259836, -521453, -573818, -459785, -619449, -476292, -357468, -355499, -323598, -575372, -834863, -568352, -383987, -347585, -297543, -373920, -346686, -112787, -76488, -93980, 69025, -104856, -454026, -527500, -813153, -790971, -418414, -159687, -252776, -479252, -391718, -469242, -403473, -504084, -486261, -379642, -351527, -236084, -243064]
22145b43064n9473o8450N1540k149j06507L4041R3040Q8979L279r9425k71759
22134e79948n842L03174K06671p288r4015j83238k23789p9889J19605K60888K43008
22123d0663L19192j68345k08615P1231l0192K1604j12430r2751J33638o053j64204
22112b77588l0438l4672O7629M5517n3537n989j06482m9520k7072j54178n2051
22101f78381J46278R6550n9404k1268L0596K62645J02883j64317o2033K99706
22091d6745O9364k49734k15259j83192J46153J78310r7543k54395O7888L36488
22081b48665K48110p6064l05610k81883Q2801L10830L33756K93221n6832j50085
22071A49579k06050j75279O6765R2425R1908K9241j37827p2505K00093P0751l27647
$$ y = [-243064, -302537, -370987, -319447, -321596, -428103, -394062, -301022, -212043, -208764, -308189, -579948, -585790, -282616, -75945, -83233, -177248, -360486, -584275, -664164, -544559, -283671, -40663, 278529, 110184, -98431, -27200, -57392, -35788, -148218, -240969, -107331, -113384, -277588, -308026, -342698, -275069, -229552, -283089, -289078, -395560, -445080, -472152, -626330, -678381, -532103, -435553, -494957, -516225, -485629, -222984, -120101, -284418, -346451, -46745, 22619, -227115, -442374, -625566, -479413, -301103, -398646, -653041, -585153, -248665, -555, -76619, -382229, -664112, -581311, -270481, 63275, 356496, 299664, 149579, -56471, -231750, -164985, -72560, 19348, 48589, -89238, -161743, 38350, 109101, -218546]
22060b18546m5268J67938J48864l5471j19382q3441j82222j546K72319j2559J3868
22049i5446M9372O9501O8385j14048j36706j44410J1467l5582j40286k19097J34124
22038e52726Q423o6356J64915P7601J14050r7952j41859N7540K3053J6526l4331
22027d31116K75149K93723j12991j87619k39402j26977j7120L75544J01861j33155
22017b02103J0374k8572r885j40515J5310o842Q1608O5447J87255j07256o6481
22006b01660j5094j08417R048n0462K57617K8392L8363j12737o8038M0019j02542
21995b85511m2669K77309J73673J75552r8999k6141L0193k02732j04509M8o445
21984a10231J02831o4540o2593j06642j18339k3410j28465M861J24373P0616Q058
$$ y = [-218546, -263814, -95876, 52988, 17517, -101865, -185306, -367528, -369074, -96755, -109314, -95446, -46074, 23427, 91812, -22236, -158942, -303352, -291885, -327467, -467753, -686850, -552726, -544303, -610659, -445744, -368143, -254093, -352045, -493904, -436364, -413311, -396785, -431116, -155967, 137756, 24765, -162854, -402256, -529233, -546353, -170809, -68948, -202103, -191729, -220301, -230186, -370701, -355391, -362233, -280625, -215178, -27923, -135179, -201660, -216754, -325171, -316123, -366585, -108968, -80576, -42213, -154950, -222988, -182969, -285511, -328180, -50871, 122802, 298354, 199355, 173214, 203407, 675, -103834, -103786, -110231, -7400, -71940, -134533, -241175, -359514, -382924, -511389, -506528, -382155, -311539, -303481]
21973c03481O8909R0068k28003J21138O4330j28713k09272J01644K38048L41752
21963A56420K70517M3061k25692l75190k21821k20505q7493k5781L23960M49271
21953H6747r4774j99850J66142q8571M111n4025j35464J7256J48939K07569j2865
21942D5215k72530R0613j00596j63437M9979N8235P5043j01578R5088O5092R9154
21931e9722Q8714J34823K354k46256p7098q3604L54681J27018j4151k10385j60840
21920a44466M8647J1226o4940J39382Q2683j12990l7529K04661q6402j25294L68282
21909B83260J80792l41184j16235K0512J19655O0539j09090n4167r0799k98984
21899c45701q2893n6931M425Q7474K9471J14272n569R5178J68220j05081N1460
$$ y = [-303481, -234572, -144504, -372507, -251369, -187039, -315752, -525024, -423380, -185332, 156420, 426937, 469998, 244306, -130884, -352705, -573210, -660703, -686484, -362524, 86747, -8027, -207877, -41735, -130306, -126195, -180220, -315684, -298428, -149489, 58080, 45215, -227315, -136702, -237298, -400735, -350756, -292521, -217478, -319056, -223968, -158876, -59722, 28992, 163815, 166169, -80087, -157185, -240789, 113892, 240910, 226759, 16374, -144466, -95819, -84593, -149533, -10151, 72532, -40458, -77987, 126674, 40272, -85022, 283260, 464052, 122868, 6633, 27145, 146800, 207339, 98249, 44082, -46717, -345701, -428594, -485525, -481100, -393626, -364155, -249883, -255452, -160274, 7946, -97135, -45675]
21888d5675k00862j32738k00408J27446J43625Q620J79686R3306l44411J9223
21878c52188J51389q9150j33748j5291n7491Q4853J13983m8087k2425L6598L0832
21867c00725M9728p7241M0368L9908o6415J25504N0633n2327J55640O196j74729
21856b03460J01776J6382m9675k29096j76470J47591K53247J44877j58455k76310
21846d29593P3211K56253j48983j47161J20621J93447m6560k38026j96621K1071
21836e42341N868j53768R8913L32127m7855L3627m0382J22573O6022q3042O3417
21825a44841J12899m5726Q9508K16652o8885j65911k81256k34421j9386R0128
21815d51239J1531p3094m7156J68947K74554P7374k753j06486j97088l63189K0456
$$ y = [-45675, -246537, -379275, -579683, -452237, -308612, -299992, -120306, -27000, -371411, -352188, -200799, -289949, -423697, -438988, -496479, -411626, -297643, -345730, -368155, -331557, -300725, -250997, -328238, -287870, -247962, -314377, -188873, -138240, -190567, -34927, -28731, -203460, -101684, -85302, -134977, -364073, -540543, -392952, -139705, 5172, -153283, -429593, -356382, -100129, -249112, -396273, -275652, -82205, -128765, -366791, -563412, -542341, -536473, -690241, -591328, -259201, -307056, -273429, -313811, -191238, -125216, -208258, -144841, -31942, -77668, 11840, 228492, 159607, -6304, -287560, -521981, -541367, -451239, -439708, -512802, -559958, -391011, -116457, -39083, -41836, -148322, -345410, -708599, -688143]
21804f88143K62168P4286j78810j11893J14791J67652J41247O3820J60839J190
21794G147n4300j23673K1368M6519R9505j99527L4200n2182j49293j02820M1789
21783d31267K7165K27223L13733J83243p1169m47280m15347J70460L1885k74798
21773f86152Q1429n622q139M1943J52062J57198j7138m6579j10059q09k0992q525
21761d71383R8925J95207J8299q512p8325N3026n410j45832j3589J13455J373
21750b42766L8900J64748p3223j68236m4282J24594K78389J04492l6524j0167
21740A35925J2761j11943k62463j9704m6408P8447J37402j67501J23n8752M7469
21729b54644J77304J06711o9069J9772n9007j47341q216J4666l2096Q5587J77289
$$ y = [-688143, -425975, -351689, -530499, -642392, -527601, -359949, -218702, -154882, 5957, 7147, -47153, -170826, -149458, -102939, -3434, -202961, -168761, -220943, -370236, -473056, -431267, -404102, -176879, 136854, 320097, 248928, -198352, -613699, -443239, -411354, -686152, -604723, -610345, -618484, -576541, -424479, -267281, -284419, -330998, -441057, -441866, -462858, -471383, -372458, -177251, -158952, -167464, -245789, -192763, -198173, -344005, -357594, -244139, -242766, -203866, -39118, -112341, -280577, -324859, -200265, 78124, 182616, 146092, 135925, 148686, 36743, -225720, -245424, -291832, -213385, -75983, -243484, -243361, -302113, -254644, -77340, 29371, -39698, -19926, -78933, -226274, -234490, -219824, -251920, -166333, 10956]
21718A0956o7027k23341J58347J58738J66181J85662j4751n7679p4242k29946
21708A2898j72610K33195l8279J9907K26009L7528q8103q4855o0785P424q9094
21697C235O6637J27475j95578j29490j21975o6974J24046J26122K39777R0652
21687B63927j88659j09698k09522q4542j78466K67457P2069K03214j12402k83420
21677c60042m5270L7642K65854J49731j8975K504m8144r7857K40115J39079r6415
21666A68222j45477p597n2122k23715K56600L75455o7270k78335j88515K28563
21656F5809J00580r8444p6977J89548N0765j61299j86190L1307K4869R3082j58368
21645a25318R0327R9039j1275K02034L00843j92882k76289j93766l15603R8262
$$ y = [10956, -56071, -279412, -121065, 37673, 203854, 389516, 374765, 317086, 242844, 12898, -159712, 73483, 35204, 55111, 281120, 318648, 230545, 145690, 84905, 92329, 3235, 69872, 197347, 1769, -127721, -249696, -316670, -192624, -66502, 173275, 263927, 75268, -34430, -243952, -328494, -506960, -239503, -167434, 35780, -76622, -360042, -405312, -367670, -101816, 47915, 28940, 31444, -16700, -114557, 125558, 264637, 168222, 22745, 15148, -36974, -260689, -4089, 371366, 304096, 25761, -162754, 65809, 166389, 67945, -9032, 180516, 231281, 69982, -116208, -84901, -60032, 33050, -125318, -34991, 64048, 52773, 254807, 555650, 362768, 86479, -107287, -422890, -324628]
21635c24628J32300j22007J34645j66860k63565O551m9199N9397J46063O2901
21625c84402P4261J57147J28276k1666k25661o0031J60190J25387n3997P067r6375
21614a89804m653l7819n1867m4450j83991K24773L31796J46740r1157N3755J17974
21603B71297j97511j62616k17417p2877j45697p4907J07098K58461N0664r0091
21593b73596K1334j25916J12481J99184j15306p4475J11091R0102n2135J07996
21583G60J30476K1818j97416r9960R6908n8642N6904l6009K82591J0512j16977
21572I0965j68199j29783O3538l9744q702J82366J10460j39251j35332R6888K15164
21561A38370m3935J06534n8599l64975j00469J06638n3277J07871j10547j87397
$$ y = [-324628, -192328, -314335, -179690, -346550, -610115, -603564, -652763, -593366, -447303, -384402, -310141, -152994, -24718, -46384, -272045, -332076, -171886, -46499, -100496, -93429, -189804, -194457, -232276, -284143, -328593, -512584, -287811, 43985, 190725, 99568, 153323, 271297, 73786, -88830, -306247, -379124, -524821, -599728, -492630, -234169, -183505, -273596, -252262, -378178, -265697, -66513, -181819, -256294, -145203, -55101, -107236, 760, 131236, 153054, -44362, -144322, -47414, -106056, -49152, -85161, 197430, 207942, 90965, -77234, -207017, -143479, -183223, -191925, -9559, 100901, -38350, -173682, -76794, 138370, 94435, 200969, 142370, -222605, -323074, -216436, -269713, -161842, -272389, -459786]
21551d59786j95201m0149K9850M9559K35756Q1006J11612Q4501j18438L0498J80222
21540a0570m3965j1534Q9572k3536J12413J01327j8280J8990q701l45470J11213
21529b8541m0492j62292P7526j28417k07102m4596K08897J75054K02960J12215
21519A65212M0434k81664O7645j2044r2400o6659q6692J09430r6875K7294j45470
21508c71789j50749o7901q634p2580R9784K2936J25949R2975j18917o6497J97446
21497c17977J21229K0155K30393k14314j39242R4655J69618J60542j72084j64899
21487b11924m2541O9815j02233m1721r8785O4287j52507j59166J31447L81423
21477a61905m248L2111K89279Q9296m7848R403k02045m48427J39424K96884j36724
$$ y = [-459786, -654987, -695136, -665286, -615727, -379971, -298965, -187353, -102852, -221290, -190792, -10570, -54535, -66069, 23503, -33, 112380, 213707, 195427, 214417, 205716, -139754, -28541, -69033, -231325, -153799, -282216, -489318, -533914, -325017, -149963, 52997, 165212, 205646, -76018, -8373, -20417, -112817, -179476, -266168, -156738, -253613, -226319, -371789, -522538, -590439, -599073, -671653, -571869, -548933, -422984, -330009, -448926, -515423, -317977, -196748, -176593, 53800, -160514, -299756, -205101, -35483, 125059, -47025, -211924, -254465, -184650, -286883, -328604, -427389, -363102, -515609, -674775, -543328, -161905, -166153, -134042, 155237, 244533, 196685, 206088, 4043, -444384, -304960, -8076, -144800]
21466a44800m9156k8320k1653P1597Q4399q8826j6075l3936J3279p5563K44251
21455d4803n0459k04926O400O6449O9141k19435K2089K08920L08261K8614r0770
21444I9481l5415j8594m2847O5722p6193m23034j9703M2293N868L8695j06476
21433d70203J60274l5640p532j23598j98210m4738K12477L13927n3648N1671M7802
21422a47418R9009J11758M4456j00799k99173J28790J86550k17848Q6989K38575
21412A30889N3480K42466M9614r801l1302j84242l47497j50939j39456N4687M4586
21401b87515k27629j4449J74090K14094P3725o4458j79965j1787j57666j13384
21391e94944Q6895J16456K6426j0265J06602K74986K03333r1036j07912L0286
$$ y = [-144800, -193956, -222276, -243929, -172332, -87933, -176759, -192834, -226770, -213491, -289054, -44803, -95262, -300188, -293788, -227339, -158198, -377633, -355544, -146624, 161637, 190251, 99481, 64066, 45472, 2625, 68347, -7846, -430880, -450583, -408290, -402422, -363727, -470203, -309929, -345569, -353101, -476699, -674909, -719647, -507170, -193243, -246891, -195220, -147418, -48409, 63349, 107805, 7006, -292167, -163377, 23173, -194675, -107686, 130889, 184369, 426835, 476449, 466648, 435346, 251104, -96393, -247332, -386788, -332101, -287515, -515144, -529593, -355503, -141409, -67684, -132142, -312107, -323894, -481560, -594944, -508049, -391593, -365167, -375432, -268830, 6156, 209489, 118453, 10541, 40827]
21381D0827m4100l45847n1433K2935J04791K424j5302m6849Q4522J70755j50173
21370b27450j62527j13533R6438J68211J53892o1961m6137O6246J10112K3448
21360F739M5042J22691o8991m9431o0424K6785J56482J26870n8503j16324l0360
21349A00576P4294n0091k8305k3279J5898O1179k2739N28j66027l9579J88623
21338A11078J70097N280l5868k06285J31369J02126Q067l60147l83743J42260
21328c15766J93921Q5599q1274M5484k13055M624l1034J78372K17024K9979k10196
21317i6322k11064R7342J03344l3010J89123o3800l9461K24861J65654k92688
21307D3979J6190L17200j57613l03563j84477j20975O2878L9516L191j60945l5244
$$ y = [40827, -3273, -349120, -400553, -377618, -272827, -270403, -285705, -332554, -248032, -77277, -227450, -389977, -503510, -407072, -238861, -84969, -146930, -193067, -126821, -16709, 6739, 51781, 174472, 105481, 56050, -4374, 22411, 178893, 305763, 247260, 130936, 100576, 174870, 124779, 96474, 73195, 89093, 150272, 127533, 128061, -37966, -77545, 111078, 281175, 286455, 250587, 44302, 175671, 277797, 285864, -74283, -458026, -315766, -121845, -36246, -117520, -72036, -285091, -280467, -311501, -133129, 83895, 113874, -96322, -307386, -210044, -106700, -139710, 49413, -14387, -53848, 171013, 336667, 43979, 60169, 377369, 219756, -83807, -268284, -389259, -326381, -286865, -283674, -444619, -479863]
21296d79863K06115K55582r3056j4758k7943k53377q7822K60742j29474m0057
21286d03911Q9941k85268O9446J82343J8910K6023K10859K43494l16789o9904
21276b34856M28189J77838J6929j30222j10582l11146j48039R2667J00514J39786
21266B1078L27669J54861j35088m54534j98477K0669J62758K17604R6088j06039
21256A06589j20822R8407j2940j38749j50889j86588M8500K01380O2840j65002
21246b57274P7356K47601J12231r7069k63640J609L94476k5605j11386q5264j35686
21235a42651j22773L8269K52916J82475j07134k44723p874r8009O5805J80673
21225c026P3914j08013m7025J70812j841k59998j13140p2728k1922J88806K31588
$$ y = [-479863, -273748, -18166, -111222, -125980, -153923, -407300, -495122, -234380, -363854, -403911, -313970, -599238, -529792, -347449, -328539, -302516, -91657, 151837, -164952, -234856, 193333, 371171, 388100, 257878, 147296, -163850, -311889, -219222, -118708, 21078, 348747, 503608, 368520, -86014, -284491, -263822, -101064, 116540, 212628, 106589, -14233, 84174, 71234, -67515, -218404, -404992, -356492, -155112, -92272, -257274, -179918, 67683, 179914, 82845, -180795, -179186, 215290, 189685, 78299, -6965, -142651, -265424, -227155, 25761, 208236, 101102, -143621, -151495, -249504, -183699, -3026, 70888, -37125, -84150, 86662, 84821, -175177, -288317, -361045, -382967, -194161, 37427]
21214C7427J40151p3673o6848K53406K01894j78636j74318L0233L8323o5922q4512
21203E7525K5720P0585J5301j28516m6656K4092j09320J23315P3321Q8370J53826
21192C47563k25337j45607J34794J01979r2942r8382k5448k5805j5908o0524J4815
21181i0802Q8558Q6020l7901j66089p3395K75612Q7531k09661j15129j33765j4174
21170c03195J904P0526J00181j56228m5430K3582M1047m5387J54355J04148l4956
21159h9453Q7467K62316r6282j41488L6526M4755j18897j08729J44134M9543P6268
21148A46160J3581J19331Q9254K3117j55092m13519J81644K96570j67643M5376
21138A78779m6285l2201J01551k3724j33380j25496J03461K17488J88891J63563
$$ y = [37427, 177578, 103905, 37057, 290463, 492357, 313721, 139403, 169636, 207959, 142037, 57525, 83245, 153830, 169131, 40615, -6041, 18051, -91269, 32046, 105367, 193737, 347563, 122226, -23381, 111413, 213392, 120450, 22068, -3380, -29185, -45093, -105617, -90802, -2244, 83776, 45875, -120214, -193609, 82003, 169534, -40127, -155256, -289021, -303195, -301291, -230765, -130584, -286812, -332242, -308660, -267613, -313000, -158645, -54497, -89453, -1986, 260330, 164048, 22560, 59086, 103841, -15056, -123785, 20349, 69892, 146160, 159741, 279072, 368326, 391443, 236351, -177168, 4476, 301046, 133403, 178779, 132494, 100293, 201844, 178120, 44740, -80756, 22705, 240193, 429084, 592647]
21128E92647k75115j71464J8679k47593l4842L30266J92965k0804j70021R2913
21118C07631p9574k712j65733r5112P6570Q1811j46511m1923j46095K7347J44468
21107c9833J95550k34573k12135j26537L24564m5433o4661K8890L1793Q5511J54243
21096I7379j04919J8419P4194r6332K23440N7510K6307j18540j26445J6308J4435
21085H1756j76379J5876j2033l09996n589j36467K87455J19875l17883n6141J37820
21074c71706Q1924k1133L365n1331K45361J10366l5238k60202j40281J86559J08354
21063a43962q8721r3347j16872K02228J77581K91955R0283J45206J4919q2887
21053C96383j17336k34842j41456q52k7184J53576M3876L252J86815J37308j40877
$$ y = [592647, 317532, 146068, 164747, -82846, -117688, 212578, 405543, 384739, 214718, 307631, 228057, 225345, 59612, -35500, 41070, 122881, -23630, -65553, -211648, -184301, -39833, 155717, -78856, -290991, -417528, -92964, -138397, -203058, -174168, -142375, -56864, 97379, -7540, 10879, 85073, -11259, 212181, 269691, 295998, 177458, 51013, 67321, 81756, -94623, -78747, -90780, -400776, -406365, -542832, -255377, -135502, -453385, -509526, -371706, -289782, -310915, -307550, -358881, -113520, -3154, -38392, -298594, -438875, -252316, -143962, -232683, -326030, -442902, -240674, -63093, 228862, 319145, 464351, 479270, 396383, 279047, 44205, -97251, -98103, -125287, 28289, 72165, 75417, 262232, 399540, 258663]
21042B58663J20159j04921k65753k38998N9944J676l1421l60815o7319K01975
21032d26810J17232j7325J2124K21755J15925o2748R640k59253p9677P3102o9438
21021c65473k0239R0960K79049m6793j0329L49373Q1073q6531k76703j04252j65192
21010b75057R106J98278J07072o9050n9822p4543m9273k4681j1424j24421N9324
20999c14491M9560o1832K47023J1595j83899l6533o4782J43722J18840p5069K35374
20988F9508K03446R7360J0851j95432l662K60367o238L3267J04743R4672m557
20977F64325O333J56556k34527j02600o4843Q1229j38132j13368Q3545j24561
20967B13957k03893k08791J9362K03897K81075j92905k4985J21741J82966M5064
$$ y = [258663, 378822, 273901, 8148, -230850, -170906, -169230, -200651, -561466, -628785, -426810, -309578, -326903, -314779, -93024, 22901, -39847, -30207, -289460, -369137, -296035, -365473, -385712, -294752, -15703, -62496, -72825, 276548, 357621, 271090, -5613, -109865, -275057, -265951, -67673, 39399, -29651, -89473, -164016, -213289, -237970, -249394, -373815, -314491, -264931, -326763, -79740, -68145, -252044, -288577, -353359, -209637, -90797, -165866, 69508, 272954, 370314, 381165, 185733, 182071, 442438, 436200, 469467, 574210, 668882, 664325, 670658, 827214, 592687, 490087, 425244, 506473, 368341, 254973, 338518, 213957, 10064, -198727, -179365, 24532, 305607, 112702, 87717, 209458, 392424, 437488]
20957D37488L7231j08903r6331m9052O7909j43728j65839J89374R6954J55942
20947D21045J10415k44726q7187J35214K54894J80676O2853k47891l9459r1430
20937D54404j16727M07163J08015k97799l71103r3928J87415P507l9n742j02611
20926A76555l3432j19801J25662Q6526j51373k53913J22403J29901Q0502k43921
20916h0891Q7773J775j20796J25408O6632K08561j28984k35994k0826m0941o9875
20905b08158J33097K97759k84211l7507j46226j19151O8033K14647K64416K63523
20895D46222j61210k07533j79846j44032J87045J95911j08234j51237J53053p8802
20885d8663m5868M50183P2722l09208k772l9927k16299J51345M3255j01658j46601
$$ y = [437488, 474719, 365816, 269485, 220433, 288342, 144614, -21225, 168149, 265103, 421045, 531460, 286734, 199547, 334761, 589655, 770331, 833184, 585293, 545834, 454404, 337677, 744840, 852855, 555056, 183953, 90025, 277440, 284947, 284908, 279166, 176555, 143123, 23322, 148984, 235510, 84137, -169776, -47373, 82528, 163030, -80891, 6882, 8657, -112139, 13269, 79901, 288462, 159478, -76516, -97342, -138283, -208158, -75061, 222698, -61513, -99020, -245246, -364397, -296364, -81717, 182699, 446222, 285012, 77479, -102367, -246399, -59354, 136557, 28323, -122914, 30139, -48663, -94531, 355652, 428374, 119166, 116394, 76467, -139832, 11513, 54768, -46890, -193491]
20874a93491K61952P7859q4882R6129q542R5950J1371k00291o0086j5134o1203
20863h0368p4770P7747J22447p6311k26387p4647K5460r1471J16940J44394j7789
20852a54755n3338J64207K87574k73332P1169J84680k24666j06726k32678N3405
20842b84460j0548J68689R2635j95198J6099J64785j6070K1502J92650K33243
20832C83327n7245j37128j02480k1439L7828J03998l7097k62439R4904L3366J10136
20821A45731J26044k9141j3095j13426j04217J0806j12227p2850Q0008J03784
20811B1417J08268l4756m6249J71380K16712R4453R277n2104j61519J01910j09420
20800C19369j32997J2256k5687j26847j40730l1737P7796j47552o5616J86345
$$ y = [-193491, 68461, 146320, 61438, 157567, 149025, 244975, 256346, 56055, -4031, -19165, -80368, -155138, -77391, 45056, -31255, -257642, -332289, -306829, -398300, -281360, -136966, -154755, -208093, -43886, 243688, -29644, 41525, 226205, 1539, -105187, -337865, -284460, -295008, -126319, -33684, -228882, -212783, -47998, -64068, -42566, 150084, 383327, 326082, 188954, 86474, 65035, 102863, 206861, 169764, -92675, 2229, 35595, 145731, 271775, 242634, 229539, 116113, 11896, 22702, -89525, -162375, -82367, 21417, 129685, 94929, 48680, 220060, 436772, 531225, 540502, 488398, 326879, 428789, 319369, 186372, 198628, 172941, 46094, -94636, -126373, -48577, -196129, -261745, -75400]
20790g5400Q6445O8031J49160K10720l1560j11456l6499k21206j96771L4661K03297
20779G9422P3063J5446P3947j05178j416O140K7499j140l28871j67817n0689O3915
20767c15679J28051P7632P3648J49270j94834Q3357J31377j41702r4945m8942
20757a52767J48476P6245n6822j69304J69664Q0668j32099J07938J42335K63675
20747D78009j46049j21732N4163r8333j30719j4546j10396j14447n2234r5356
20737c51640Q1130L85251L42857j46132l3475L8138j65785j54274M8839K85054
20727C29963J9640J1565K8041n2156j24190J04727M9864j60610j01885j93289
20717h8330J23464K05366O3419J7721m9448j65326L8155q160j27486K36155J91841
$$ y = [-75400, 11045, 79076, 228236, 438956, 407396, 295940, 259441, 38235, -158536, -123875, 79422, 152485, 167931, 241878, 136700, 135284, 141424, 168923, 167783, -161088, -328905, -379594, -315679, -187628, -109996, -36348, 112922, -81912, 1445, 132822, -8880, -103825, -152767, -4291, 71954, 15132, -154172, 15492, 96160, -35939, 71999, 214334, 478009, 331960, 210228, 264391, 166058, 35339, 20793, -89603, -204050, -256284, -351640, -270510, 114741, 457598, 311466, 277991, 316129, 150344, -3930, 44909, 329963, 349603, 361168, 389209, 337053, 212863, 317590, 367454, 206844, 104959, -88330, 35134, 240500, 303919, 321640, 272192, 106866, 145021, 136861, 9375, 245530, 437371]
20706D37371k95646n5733K1431j56570j26302Q6355j32946p4105R5074o630j89388
20695c97089q2004J43004K01139J38625m343K83185j07577j9687J05656R9607
20685C60516k5189n3763j14881j39272k8846q2452L1882J50044P3303K08204l8583
20674C40963p7436J37480K23474J4282r1809k60007j11087k5732J12266L341j34362
20663A31373j35181n1953o2263J23139Q0482k1459J20994J79122M8971L8886j27354
20652C24757n0865p0837o0827K42999j71693J67715L18868L051l16417j69996
20642B16755m1314j9592O9241J13080l01355k17103j4068K16810k3952j09292
20632a10790Q8403J08632K21968k6823j63785j71947K08148J62540Q5968j58254
$$ y = [437371, 141725, 85992, 107423, -49147, -175449, -89094, -222040, -296145, -201071, -207701, -397089, -479093, -336089, -134950, 3675, -668, 282517, 174940, 155253, 260909, 360516, 335327, 281564, 166683, 27411, -1435, -83887, -52005, 98039, 171342, 379546, 340963, 263527, 401007, 624481, 638763, 546954, 286947, 175860, 150128, 262394, 265735, 131373, -3808, -55761, -118024, 5115, 85597, 64138, 185132, 364254, 413225, 452111, 324757, 273892, 203055, 142228, 385227, 213534, 381249, 700117, 703168, 386751, 216755, 175441, 155849, 225090, 338170, 36815, -180288, -194356, 22454, -1498, -110790, -22387, 86245, 308213, 281390, 117605, -54342, 153806, 316346, 402314, 244060]
20622B44060J40325M8651j08852j77827k05024M5857k13106K7706Q2972Q1264
20612c3974K5266J06362J55894p0674J0379L09633J94605j0451j98685j81163
20602C07192J00095L3019k3832J16115j80197N0433J28649k179P1110O5411O6279
20591G32095l7354J39497p3763p8337j96548n1781k042j55995k00052J28858N8401
20580B62979p7514q4942P7997Q0578q639r1278R9474J39532J39334k0654q2440
20569D34427j8846O2256l3249R0018Q5789R746j08380j69158k4244q302k7677
20558B92380J9787J51077J18219K5194M0136J9021m8749R458j14694K87042J67361
20547I66232k67155l32893j60581J43313p1298k3853J65240M9155J5619R4818
$$ y = [244060, 384385, 433036, 324184, 146357, -58667, -12810, -225916, -198210, -115238, -33974, -8708, 97654, 253548, 182874, 193253, 502886, 697491, 687040, 488355, 307192, 407287, 440306, 416474, 532589, 352392, 402825, 531474, 529295, 600405, 665816, 732095, 694741, 834238, 760475, 682138, 485590, 433809, 431767, 275772, 75720, 204578, 262979, 185465, 100523, 178520, 259098, 250459, 159181, 258655, 398187, 537521, 516867, 434427, 415581, 477837, 444588, 534606, 620395, 630141, 521761, 352603, 328359, 320057, 292380, 312167, 463244, 581463, 606657, 646793, 665814, 617065, 626523, 511829, 798871, 966232, 699077, 366184, 205603, 348916, 277618, 253765, 419005, 468160, 483779, 578597]
20537E78597P7427m6963L8165K04492j31665j29640r4018J40514J15422J34318
20527H86649j75463j42457j38094k4551M3974K0549M7068R453K82151P9414r2315
20516G96378r6407n7223M7065J01755J62617J57326K41649j84481j85790K0462
20506A003351L2533J19758K29112j3693k7281K00216o4276r6990o3021J65911
20496A485620J88321L7378r3474J35884l7240O772K659j10155L1420R1780R277
20485A748242K25881p2717K55756J48759k71781j12143M8738j79039j41655r2251
20475A557790L18449K09218n3915K0315P0214n7609j21249n7631j28264K28595
20465A985913J76372M26587K47202J47951R3636K1384j84010J23155K40502J75081
$$ y = [578597, 656024, 609061, 647226, 851718, 720053, 590413, 496395, 636909, 752331, 886649, 711186, 568729, 430635, 406084, 450058, 470607, 517675, 527128, 809279, 888693, 796378, 699971, 642748, 689813, 791568, 954185, 1111511, 1353160, 1168679, 982889, 1003351, 1035884, 1155642, 1384754, 1371061, 1343780, 1543996, 1479720, 1382730, 1319709, 1485620, 1673941, 1711319, 1617845, 1753729, 1716489, 1723261, 1725920, 1615765, 1647185, 1738965, 1748242, 1974123, 1901406, 2157162, 2305921, 2034140, 1921997, 1970735, 1791696, 1650041, 1557790, 1876239, 2085457, 2031542, 2051857, 2122071, 2064462, 1943213, 1885582, 1757318, 1985913, 2162285, 2588872, 2836074, 2984025, 3077661, 3099045, 2915035, 3038190, 3278692, 3453773]
20455C453773r7698O6169K11235j12881K47920K73196n1279k0905J36261K98615
20445D404406L07400K96596J22532K19980J46246r9895R2241K61201J87855K31899
20435F170461N29877L90702M48266P14610N96334L76400O60149Q80318J095809
20426A1862926J462360K034408K703090M217979N692437P813201J0747265J4114833
20418F0648499J7296573J7392646J2392892N024397l153374j1640635j4652456
20411H3308542j0159034k306192M802637J1337617J5524028J4622136P329713
20404A24459447j522894j1204088k0650905k1235795j5346440r418674n475598
20397C9605053k643686m95988J286988K569289M347879O382562R495901J3356045
$$ y = [3453773, 3356075, 3422244, 3633479, 3520598, 3768518, 4041714, 3990435, 3969530, 4105791, 4404406, 4711806, 5008402, 5130934, 5350914, 5497160, 5397265, 5489506, 5750707, 5938562, 6170461, 6700338, 7091040, 7539306, 8253916, 8850250, 9226650, 9886799, 10767117, 11862926, 13325286, 15359694, 18062784, 22280763, 27973200, 35786401, 46533666, 60648499, 77945072, 95337718, 107730610, 112755007, 109601633, 97960998, 83308542, 73149508, 70843316, 75645953, 86983570, 102507598, 117129734, 124459447, 122936553, 111732465, 91081560, 69845765, 54499325, 45080651, 39605053, 36961367, 36465379, 37752367, 40321656, 44669535, 51052097, 60547998, 73904043]
20389G3904043J7468894J8387593J3561698N477367l032462j2902720j7434734
20382I5429679j2438923m215365L345492R539223J3644060J3697873P718635j102250
20374A25618424j0447805k0001544k2665346j7765023j1653324p510458m990200
20367C0584724l213411k303375j755665j455971r18345p97342j083930r83517
20359A8073168j140632r92914j043202o00403l32649n73664l71384m64403q02510
20350A1751407j033470r07009m87358l25543n95197m46709l82850o17400l95439
20341F560432m16869m12159m49649l64370o0562k52261m66077k86968k67257k49938
20331C334322j09984j78418l01155l68507k39694j13667m7012l2073l07520l98727
$$ y = [73904043, 91372937, 109760530, 123322228, 128799595, 125767133, 112864413, 95429679, 82990756, 78775391, 82120883, 91660106, 105304166, 119002039, 126720674, 125618424, 115170619, 95169075, 72503729, 54738706, 43085382, 35574924, 30584724, 27371313, 25067938, 23312273, 21856302, 20937957, 20140615, 19056685, 18073168, 16932536, 15939622, 14896420, 14296017, 13963368, 13389704, 13018320, 12553917, 11751407, 10717937, 9810928, 9323570, 8998027, 8402830, 7956121, 7573271, 6955871, 6560432, 6143563, 5731404, 5281755, 4917385, 4856823, 4604562, 4138485, 3851517, 3584260, 3334322, 3224338, 3045920, 2744765, 2376258, 2136564, 2022897, 1975885, 1943812, 1636292, 1237565]
20321A237565j42287J47844L8063j53919O7909J9656r6365j55561j69701j16423
20311F76781R8642J73559P3709R493j35309l06172k06024k10113l2790N4238P939
20300B03953K87035k02784l0981O7113j99673P822J07044K1314K7800k1153J00597
20289C68087N6225J05362q1867k18756j27017j49841R922J9529Q5180K6908J52758
20278B46490m5214p2452p4441o5268P9236r5147r5554J25232Q7369l6215K87911
20267C41947K93885k4516m37369j08083K614r053j07296j57668N5306K35415K27892
20256C13074j17705o0775J12765o548q490J67687r958j55260l11042J7207N2690
20245f355k286k0564j59221M3164j42288p7378J93673L1075l6591l0149l758J85340
$$ y = [1237565, 1095278, 1243122, 1281185, 1127266, 1195175, 1214831, 1118466, 962905, 793204, 676781, 775423, 948982, 1022691, 1032184, 896875, 590703, 384679, 174566, 141776, 196014, 203953, 490988, 288204, 257223, 324336, 124663, 132485, 239529, 260843, 288643, 267490, 368087, 424312, 529674, 447807, 229051, 102034, -47807, -37885, -18356, 66824, 93732, 246490, 201276, 128824, 54383, -10885, 68351, -26796, -122350, 2882, 90251, 54036, 341947, 635832, 611316, 173947, 65864, 68478, 59425, -47871, -205539, -150233, 85182, 313074, 195369, 134594, 247359, 240811, 232321, 400008, 390050, 234790, -76252, -59045, -6355, -8641, -29205, -188426, -145262, -287550, -364928, -171255, -140180, -176771, -206920, -210678, -25338]
20233b5338J1344j37461J18346o2942l5974Q0972J18589p9469q8722p5098J38560
20222c7193Q9591n5185J77124j2736o771J26649l3622K46137j68746J2146O6901
20211D04295q8291M7714l6280j18739j19201J26844r5666p7487j0637J09524k5144
20200A16932l2408R4662L8538K2965k6454l2593L6899k52813m4429J47956Q1962
20189A51217J18465j77500N6652J4936M8099k45532l4512J1094J35548M435K0720
20178A03622K4614J07273Q1682N2542j14630J89215m610j09846K55324l6133k28016
20167C21037o2301l9750k96987r7744j4907L05283R7563K8239J9942o8993r4039
20156I7343J60140J53490R7835N8983j28625J04771j47985j44834J9383j96245
$$ y = [-25338, -13994, -151455, -33109, -96051, -132025, -51053, 67536, -11933, -100655, -175753, -37193, 52398, -2787, 174337, 161601, 154830, 281479, 247857, 493994, 325248, 337394, 404295, 316004, 363718, 327438, 208699, 89498, 216342, 120676, 43189, 32552, 142076, 116932, 84524, 179186, 217724, 240689, 214235, 181642, 218541, -34272, -78701, 69255, 151217, 269682, 92182, 148834, 163770, 211869, -33663, -68175, -57081, 78467, 82902, 103622, 128236, 235509, 317191, 369733, 255103, 444318, 439708, 329862, 585186, 549053, 321037, 258736, 218986, -78001, -175745, -190652, 114631, 212194, 240433, 260375, 191382, 97343, 257483, 410973, 508808, 567791, 439166, 543937, 395952, 251118, 270501, 74256]
20146G4256p8930J23735J91888j27973j73485l5302j05473J48660P0966k60298
20136a71956J75819Q9801m7292n0592P6514K46061k60363L1794J71485J48318
20126D09589l3424j58267K9796O0150O2431Q2541O2154J45268q163l99471m065
20115B48539O9205J6610j6900K4871K75203R9870j09435m3665K63779N4072O7442
20104I49591j58045k02156j06902k7015l32603P5661N16010J92177k42417j36591
20094E27710K32418K39000J43895j30125j75292k1443n1748R6129l6531j67980
20084F56033k56550K03285P0288J77540J93762J7407n4925j42565j17181j19222
20074F27872j9824L51719J92880R9613o4032k80143k83162R2284J2138o4535l683
$$ y = [74256, -4674, 119061, 310949, 182976, 9491, -25811, -131284, 17376, 88342, -171956, 3863, 93664, 46372, -4220, 72294, 318355, 57992, 89786, 261271, 409589, 376165, 217898, 247694, 307844, 370275, 452816, 514970, 660238, 652075, 252604, 248539, 317744, 334354, 317454, 342325, 617528, 717398, 607963, 564298, 828077, 882149, 949591, 791546, 589390, 482488, 455473, 122870, 198531, 714541, 906718, 664301, 527710, 760128, 999128, 1143023, 1012898, 837606, 816163, 764415, 860544, 824013, 656033, 399483, 602768, 673056, 850596, 1044358, 1061765, 1006840, 864275, 747094, 627872, 608048, 959767, 1152647, 1252260, 1188228, 908085, 624923, 717207, 729345, 664810, 661127]
20063F61127J17738N2582J12135M0782n8140j03020k87719r8489Q8190J19900
20053F45086j20274L85356J46676j24839k46406M2157q8198L045K85760j81044
20043G47319J61430L13498K37313J13030Q560j96774k60445j85351j70525J72472
20033I40527K36335K88405P6783K2489N2110J34536k36888j25579q18M5155N9895
20022A492950L07981J69562j18142p0646R843l2793K23537J82665J00076o5468
20012B199565m7738K89200K41601l6944o0985L39750L61578R2491j17218L1280
20002C292580J24722Q2064k7298J27736J17669Q5629J86978M04055L36752K34971
19992D965858N88437N73282L12795L97852Q89427O53965M22119M68826L78326
$$ y = [661127, 778865, 831447, 943582, 984364, 926224, 823204, 535485, 436996, 525186, 645086, 524812, 910168, 1056844, 932005, 685599, 727756, 639558, 642603, 928363, 747319, 908749, 1222247, 1459560, 1572590, 1581150, 1384376, 1123931, 938580, 768055, 940527, 1176862, 1465267, 1542050, 1564539, 1616649, 1751185, 1514297, 1388718, 1387900, 1433055, 1492950, 1800931, 1970493, 1852351, 1781705, 1791548, 1758755, 1982292, 2164957, 2265033, 2199565, 2151827, 2441027, 2682628, 2645684, 2584699, 2924449, 3286027, 3378518, 3261300, 3292580, 3417302, 3499366, 3472068, 3599804, 3717473, 3803102, 3990080, 4394135, 4730887, 4965858, 5554295, 6127577, 6440372, 6838224, 7727651, 8381616, 8803735, 9272561, 9650887]
19983I650887L90914O39011R00843J041975J604913K125491K735067L722969N196310
19974B8008380P442995J0285207J3871141J6888695J7531606J3901867P294852
19967A15224743j931369j0380065j4104119j2411806o286827J539283Q664759
19960H0314599J2776473J2546476Q246036R54686q917110j6367748j8870134j6756965
19952E3926313j2135204p488339m561459l021461k225023j358160j160046j025054
19944B0951567r72210p97154n61918l71116o62022m25830l72031j69962n2129
19935A6567195p3250K4781L63887M55622L41469M66107P60196R36239J337711
19926B1179957K204176L153160M520279O485282R759762J3424471J7261256J9441217
$$ y = [9650887, 10041801, 10680812, 11581655, 12623630, 14228543, 16354034, 19089101, 22812070, 28008380, 35451375, 45736582, 59607723, 76496418, 94028024, 107929891, 115224743, 113293374, 102913309, 88809190, 76397384, 70110557, 71649840, 80314599, 93091072, 105637548, 113883584, 114838270, 105921160, 89553412, 70683278, 53926313, 41791109, 34302770, 29741311, 26719850, 24494827, 23136667, 21976621, 20951567, 19979357, 19182203, 18620285, 18249169, 17587147, 17161317, 16789286, 16619324, 16567195, 16493945, 16518726, 16882613, 17338235, 17679704, 18145811, 18906007, 19842246, 21179957, 23384133, 26537293, 31057572, 37542854, 47302616, 60727087, 77988343, 97429560]
19918I7429560J7508170J1732494J867065q725065j5132976j6401772j0655579
19911G7621897k004395N743857J1513934J3650515J0868329M313090n028447j3914174
19903A02764606j9495664j9929997j5218433j0106754o264840m080905k529380
19896B5138633j852040j601926j433425j236035j298458j065047r48353q15656
19888A4887693o07835n05967k58607k26454m66210m98251m31210n61184o94878
19879A0637097o86821p88433p39736p36618o23202l91121o45174m64537k89033
19870E272422l57114l00923k14904Q0414m0884k61676k95935j78533k74655l29660
19860C098552j56884j94574k83643k03598n6441l4457M9825k15550k75482J17869
$$ y = [97429560, 114937730, 126670224, 128537289, 119812224, 104679248, 88277476, 77621897, 75617502, 81361359, 92875293, 106525808, 117394137, 121707227, 116678780, 102764606, 83268942, 63338945, 48120512, 38013758, 31748918, 27668013, 25138633, 23286593, 21684667, 20251242, 19015207, 17716749, 16651702, 15703349, 14887693, 14279858, 13773891, 13515284, 13288830, 12822620, 12324369, 11893159, 11331975, 10637097, 9950276, 9161843, 8422107, 7685489, 7062287, 6671166, 6025992, 5561455, 5272422, 4915308, 4614385, 4399481, 4479895, 4439011, 4177335, 3881400, 3702867, 3428212, 3098552, 2941668, 2747094, 2463451, 2259853, 2203412, 2168955, 2218780, 2003230, 1727748, 1845617]
19850A845617N3814j88907J04867N1731j122q1056J18444M0507k39704P978J10813
19839A822982J01563Q6051m4675N6305J46444K8896j0308j38958l10450l76416
19829A361434j23025l5005r1065o7882j38989J61776Q6181j81852l3618J29599
19819A067554J7442k39781J7444J7720n3890N266M2697L2378Q2368O4551N9788
19808A113537j3081k51605J23079J14130J91229K12237j88277k38029P34R8491
19798A162445J89404j64664M4100k682p956q9244P7122O7729Q1930j81037J90700
19787A367847J22769j71840l38330k8254L7936k66614j84798P136J54837q331
19777F92358l20907j94580Q1519K39524K27719N3431j6450r837j49186j16536
$$ y = [1845617, 1899431, 1710524, 1815391, 1867122, 1866000, 1784944, 1903388, 1943895, 1704191, 1712169, 1822982, 1924545, 2010596, 1965921, 2022226, 2168670, 2197566, 2187258, 2048300, 1737850, 1361434, 1238409, 1203404, 1112339, 1044457, 905468, 1067244, 1153425, 971573, 937955, 1067554, 1084996, 845215, 862659, 880379, 826489, 831755, 874452, 906830, 989198, 1053749, 1113537, 1100456, 848851, 971930, 1086060, 1277289, 1489526, 1301249, 1063220, 1063954, 1162445, 1351849, 1187185, 1231285, 1228603, 1220647, 1131403, 1208525, 1276254, 1358184, 1177147, 1367847, 1490616, 1318776, 980446, 952192, 990128, 723514, 538716, 545852, 700689, 692358, 371451, 176871, 258390, 497914, 725633, 779064, 762614, 752777, 603591, 487055]
19767D87055p4961j38497j50211J93191P4724K65561O7979K5998l2776Q0946R9218
19756H98227k51039j73481M0792k15504L7154N5914J8392J41113o3634k07621
19746B80313J15180j20537j74300n2319K0122L6723J28049N7762K89P9791l1189
19735C39884r947K02419P7037j77850J17243P7331P672j13341Q3443N1261n2436
19724F02716j60077k9586K57034J30349j13775j03399n4966j06598j49834j36871
19714A34993p4370j6786n8968J76827J24929n4867P5463o4192j79301J44774N4083
19703B62585J61350l382M2214L4746O130J0783N093J6270k01407K23048J82151
19692G39581L7437j71100k53170R8258O0883r1838j35572J40383J67793J70028
$$ y = [487055, 412094, 273597, 123386, 316577, 391301, 656862, 724841, 750839, 718063, 799009, 898227, 647188, 473707, 514499, 298995, 336149, 392063, 410455, 551568, 487934, 280313, 395493, 274956, 100656, 48337, 68459, 105182, 233231, 290993, 291282, 371073, 339884, 329937, 532356, 609393, 431543, 548786, 626117, 633789, 520448, 603891, 655152, 602716, 442639, 413053, 670087, 800436, 686661, 583262, 528296, 421698, 271864, 134993, 60623, 43837, -15131, 161696, 286625, 231758, 307221, 243029, 63728, 208502, 262585, 423935, 420553, 462767, 497513, 503643, 514426, 519519, 535789, 334382, 557430, 739581, 777018, 605918, 352748, 451006, 511889, 420051, 284479, 424862, 592655, 762683]
19682G62683K633j10318j67120j42703j21120r1005J06712N3498J61588Q3693
19672E38541o1724J2277R1297o3333q7190J05008J39737M6509J61553l281L1539
19661I10933r9130n6808J30039K9280j96476j25775j22814o4036j04885O5633
19651C65961K31653N7291M5973J10956k60390l56773k56113K42028J22886l88766
19641h5294J0228M05626J85203j65151m8828k6949P71J95357J18246J05690r9209
19630E95690k56142Q6029R7586j23583k6621n507r0037Q4966J54214j54646q8411
19619B73538K65043J67469k43984j11751J81949J3343o6909J6199j16298j29533
19609B49066r7666l4073P7192Q6708j00175l52595J25027J72066N8048O2432k8775
$$ y = [762683, 765316, 654998, 487878, 345175, 224055, 133050, 239762, 293260, 454848, 538541, 476817, 489094, 580391, 517058, 429868, 534876, 674613, 721122, 882675, 879394, 910933, 811803, 754995, 885034, 914314, 717838, 592063, 469249, 405213, 300328, 365961, 597614, 654905, 700878, 811834, 551444, 194671, -61442, 180586, 303472, -85294, -75066, 330560, 515763, 350612, 301784, 274835, 275606, 470963, 589209, 694899, 595690, 339548, 425577, 523163, 399580, 372959, 367452, 277415, 362381, 516595, 361949, 273538, 538581, 706050, 462066, 350315, 532264, 545607, 478698, 494897, 378599, 249066, 151400, 117327, 194519, 281227, 181052, -171543, -46516, 125550, 183598, 246030, 217255]
19598B17255r8000k3578J41818J14178P6905k32535n9653K22053J72685L6034
19588E67162M7174k6542P4362n9282k43209L9162M1233L38722N8268o2319q539
19577G66192K3403k18528j36562n0378l3910K32663J07582J91483n1182J30658
19567I61421n7267L3922L02944J71954p1981J6775N2754o8655J23248j47873k41399
19556A075843l5978l5736r3268j70379J31689K3140n08845q9539K10130J71518
19546F78575n052O776J18272k9235L2328j03365p4554j56482K9951K93434P3620
19535H64268m2834J00686N4886J46203m6419k52393j67491k8416K60904L06145
19525A195539J64422j33844m8554J64836O4351j07304M1015j10627j02374L08636
$$ y = [217255, 119255, 95677, 237495, 351673, 428578, 196043, 136390, 358443, 531128, 567162, 614336, 587794, 662156, 602874, 359665, 398827, 440060, 778782, 837050, 774731, 766192, 789595, 571067, 434505, 384127, 350217, 582880, 690462, 881945, 830763, 961421, 904154, 938076, 1241020, 1412974, 1340993, 1357768, 1410522, 1341867, 1465115, 1317242, 1075843, 1039865, 1004129, 910861, 740482, 872171, 895311, 386466, 296927, 507057, 678575, 673523, 680299, 798571, 769336, 801664, 698299, 623745, 467263, 497214, 790648, 864268, 821434, 922120, 977006, 1123209, 1076790, 824397, 656906, 628490, 889394, 1195539, 1359961, 1226117, 1177563, 1342399, 1406750, 1299446, 1340461, 1229834, 1127460, 1436096]
19515A436096J09291r5p6504P5661N4513j4172o7669J75672N2099m546r1446P9603
19503A728503J86148J15896j65758k53915j66407J42371K14930K13614l3241J31821
19493B113962O4188j39816N609J54720J37237j15258m8764J64049R9502j16038
19483B319391o0414j67546J81514K54416M45240K21924J31162M6922P4816L93129
19473C840554J61041Q9056M22645O07036M62925N29400M65607K61453N6367j09569
19463F786515k60185Q0800K82886L89576J92686N81221J054114R69860J312945
19454A1390418J486437J907189K186458K512047K903109L143506L599226M260067
19446C3388457N518359P310863J0353335J4473020K0771441L0053049M3066969
$$ y = [1436096, 1545387, 1545292, 1468788, 1544449, 1598962, 1584790, 1517121, 1692793, 1744892, 1740346, 1648900, 1728503, 1914651, 2030547, 1864789, 1610874, 1444467, 1586838, 1801768, 2015382, 1982141, 2113962, 2178150, 2038334, 2043943, 2198663, 2335900, 2220642, 2171878, 2335927, 2435429, 2319391, 2258977, 2091431, 2272945, 2527361, 2972601, 3194525, 3325687, 3372609, 3447425, 3840554, 4001595, 4090651, 4513296, 5120332, 5583257, 6112657, 6578264, 6839717, 6896084, 6786515, 6526330, 6607130, 6890016, 7279592, 7472278, 8053499, 9107613, 10077473, 11390418, 12876855, 14784044, 16970502, 19482549, 22385658, 25529164, 29128390, 33388457, 38906816, 46217679, 56571014, 71044034, 91815475, 121868524, 164935493]
19439A64935493N8526414P0990344O9278930N0016287J6569289k6827390o2847480
19432C40641887q0336926p4809588n3403906l3117924j9875881j2702815q678522
19425E7716325o187795m749282l568057k696125j981964j837466j928220j876870
19417C2890546j645360j198593q92614n73518n04643o35701j084011j449351j510610
19408B3396145j532922j340112j128867r89135j284430j221217j310789j208202
19400A3380471j198489j252114r27027o34257o61170p37967n22415m68695k68372
19391F709965l75704m18981k67777J482j22372j30822j58145k39103k00521M5629
19381D843651j10444k22515j39004L2971j26499o5319m70795n97750k72281J2188
$$ y = [164935493, 223461907, 294452251, 363731181, 413747468, 430316757, 403489367, 340641887, 260304961, 185495373, 132091467, 98973543, 79097662, 66394847, 57716325, 51528530, 46779248, 43211191, 40515066, 38533102, 36695636, 34767416, 32890546, 31245186, 30046593, 29153979, 28580461, 28075818, 27440117, 26356106, 24906755, 23396145, 21863223, 20523111, 19394244, 18405109, 17120679, 15899462, 14588673, 13380471, 12181982, 10929868, 10002841, 9368584, 8707414, 7969447, 7447032, 6978337, 6709965, 6334261, 5915280, 5647503, 5648985, 5526613, 5395791, 5237646, 4998543, 4798022, 4843651, 4733207, 4510692, 4371688, 4404659, 4278160, 4212841, 3742046, 3144296, 2872015, 2884203]
19371B884203m52774n12344l54156k01316n7559j80622R8334k5002J26720p7231
19361A248253k21310P2610j09158q2477m13558m49851k04735J00338l6580o2937
19351a59405O8549N0724o3607j23569j3907Q0183j28280j61415j59603L8193K44025
19340c28112P7827k2327n499Q3443l4764j58709j54707J13841O6236n8472j5124
19329d36367j3502n3422Q3512J84486j5800L6510j01812q2115o029J70025K93648
19318E9134N435j36850J39774O9872K4483L02252J72201m4299j72001K26417J73559
19307H19977j49222j94299k46451k97797J27258L01401M7427k09079j44349O3990
19297A18856M7367P9847k3377k50157r9754k48922O8476O1180J12954K62336l28575
$$ y = [2884203, 2431429, 1919085, 1564929, 1363613, 1306054, 1125432, 1223766, 1198764, 1325484, 1248253, 1026943, 1099553, 990395, 907918, 494360, 44509, -160226, -59888, -96468, -159405, -90856, -40132, -103739, -227308, -241215, -161032, -289312, -450727, -610330, -572137, -328112, -250285, -272612, -278111, -194668, -229432, -388141, -542848, -429007, -362771, -421243, -436367, -449869, -503291, -419779, -235293, -251093, -214583, -316395, -398510, -404539, -234514, 59134, 64569, -72281, 67493, 137365, 161848, 464100, 636301, 592002, 420001, 646418, 819977, 670755, 476456, 230005, -67792, 59466, 360867, 408294, 199215, 54866, 118856, 166223, 246070, 222693, -27464, -127218, -376140, -307664, -246484, -133530, 128806, -199769]
19286a99769j23287J99895Q6114J40412p2828r9363J62163P1060k96614k50087
19276c82304Q0517J44431J3340j5577J9649p4025J10488l6271N9481j14711J4641
19265a80341l4188K06334M08036N2577j17880l4116m2351L4983J95760j79914
19255C08900j17082k24460q1584m629J32866j2828K4900j02652Q0695r1597Q239
19244g9232R6208K4765j10113L5496J99258K13783K44134j42430k06874j2049
19234B62946J4458N2234m860j9929j27953j98933m2777Q9668l9344j44904l972
19223a63366K692R7780J01332K0652j94262q5234K09774J11683k09256q4542J59555
19212c3192n9502k50587j52738Q8326K3205k23522J68609M8002Q4451N2667k05492
$$ y = [-199769, -323056, -123161, -37047, 103365, 30537, -68826, 93337, 164397, -132217, -382304, -301787, -157356, -144016, -159593, -139944, -213969, -103481, -139752, -80271, -194982, -180341, -214529, -8195, 399841, 452418, 334538, 300422, 258071, 293054, 488814, 308900, 191818, -32642, -114226, -118855, 14011, 1183, 26083, -76569, 4126, -87471, -79232, 16976, 41741, -68372, -32876, 166382, 380165, 624299, 481869, 274995, 262946, 277404, 329638, 324778, 304849, 176896, -22037, -64814, 24854, -14490, -159394, -163366, -160674, -62894, 38438, 59090, -135172, -220406, -10632, 101051, -108205, -192747, -33192, -92694, -343281, -496019, -407693, -384488, -608010, -439401, -391399, -306948, -254281, -459773]
19201d59773P6402k4199m0511m8307J70458K28235R8279k5028M3555p4997p3076
19190a28962M4001k31076M921K50058J03067k59774n176O6351K76531K22979N5418
19179C98338o5712J09080J17157p7658q0680j7094j43684q4870N9369J24032r0506
19168B47772k10280k83375p645p0478M7738M4085J15531j11542j1167k4208o5250
19157c28819M5170M3111J27112O8685L32L7538n5625j72729n9405K5916J43710
19146a25004O8931j83709j47788j10695l4494K21508J29570j06383j24959M8189
19136c64834j43397m5255M8661J41758K54022J46322L3353r8653m6263l9550M955
19125a08881r0619o2444N5205J6554l4332p9147L3141J20075K73980L8963k6494
$$ y = [-459773, -383371, -407570, -448081, -496388, -325930, -97695, 584, -24444, 19111, -55886, -128962, -84961, -316037, -311116, -61058, 42009, -217765, -222941, -156590, 119941, 342920, 398338, 332626, 441706, 558863, 481205, 400525, 383431, 239747, 154877, 214246, 338278, 247772, 37492, -245883, -253528, -324006, -276268, -232183, -116652, -228194, -239361, -263569, -328819, -283649, -240538, -113426, -44741, -44409, -6871, -62496, -235225, -294630, -268714, -125004, -56073, -239782, -387570, -498265, -532759, -311251, -181681, -288064, -413023, -364834, -508231, -553486, -504825, -363067, -109045, 37277, 70630, -28023, -74286, -113836, -108881, -199500, -261944, -206739, -190185, -224517, -303664, -270523, -150448, 123532, 162495, 136001]
19114A36001R6715J0988J04087K27637j96598m6852j2016j40721j6178P4010j41702
19103I5371q8209J78427J61752J01493P6170k93951j26650O898j5418l583J58101
19092B50401l5249j40935j31399q6840j13125j06401K463R3533M3944K51871N2601
19081H0864N3561P2052J6785J35395j43143k33168j67485l5936L4774O5369J31597
19070A0665J37895J87677J08558k7855p6438j38254j06956k2484j48834R4879
19060A8853L1837J51397N3655Q8850j32058M7145k46063k4734L60292P1982q2632
19049C38524r6850j72015k42876k264r3605q6100N18740K70563j60032J0662j72029
19038A12718j09073R4533Q7815n4027o0547j13335J04718p9639l69113o8677M22756
$$ y = [136001, 232716, 243704, 347791, 575428, 378830, 331978, 319962, 179241, 163063, 237073, 95371, 7162, 185589, 347341, 448834, 525004, 231053, 104403, 111301, 95883, 92300, 250401, 215152, 74217, -57182, -144022, -257147, -363548, -361085, -267552, -223608, 28263, 80864, 134425, 206477, 223262, 358657, 215514, -17654, -185139, -221075, -186301, -120932, 10665, 148560, 336237, 444795, 416940, 340502, 202248, 95292, 72808, -76026, 18853, 50690, 202087, 255742, 344592, 212534, 259679, 13616, -11118, 349174, 421156, 338524, 241674, 69659, -173217, -175481, -269086, -355186, 163554, 434117, 274085, 284747, 112718, 3645, 98178, 185993, 131966, 71419, -41916, 62802, -16837, -385950, -454627, -31871]
19027c1871L60878o8178o963J34571K61206m1315k09716O9525j04643k82812J5208
19016I5890k4765L4612j23512L0398K85156N2349j9420k3190k12145P5918m538
19005A66753k3941j55067k3633n9109Q9790J07895q1314k6593j30955l0174N5357
18994a10991K31120J71574l0210r4421n834L1449j05404M130j6323K6187L118
18983A04395J5319l1758o6464J58269L19705j39789n9568J64425K78154J38299
18973H80987K70242J09874j92966P6211J25641k05899l1707O7812j9383l3720
18963A047092o2794j89394j67800m0871p0403q7972j37301l33580k00742K51461
18953G696K38021J09403L6592K5657j80154o6990k02120J43821P7491J28609N2385
$$ y = [-31871, 329007, 260829, 253866, 388437, 649643, 608328, 398612, 468137, 363494, 80682, 95890, 71125, 105737, -17775, 12623, 297779, 350128, 330708, 307518, 95373, 171291, 166753, 142812, -12255, -35888, -94997, -5207, 102688, 21374, -5219, -136174, -166348, -110991, 120129, 291703, 261493, 167072, 161238, 192687, 87283, 91413, 75090, 101277, 104395, 119714, 87956, 21492, 179761, 499466, 359677, 300109, 464534, 742688, 880987, 1151229, 1261103, 1068137, 1144348, 1269989, 1064090, 1032383, 1100195, 1080812, 1047092, 984298, 794904, 627104, 586233, 515830, 427858, 290557, -43023, -243765, 7696, 245717, 355120, 391712, 417369, 237215, 170225, -31895, 111926, 189417, 318026, 370411]
18942C70411j21422k31862M4953J3817L9908j12872k00570j27217L54798K29280
18932B59224j16954J4334J00916j52599L7894m2254N9912j35096J5992K92793
18922C34162K510o3606P2560j48849L2124L7236j0342j92228q8987K74168j0153
18911B38595j89252Q4365J32669j34586j02535J4426J30326L07409L6151k83002
18901B34566n2830O5595j55365J2649M05313j8370l12732j33523r1327k0126O6896
18890G46K68763K73447j67943j12926J73794K45563K28371J60762M04959J15530
18880A591066K16997K30912K12014r3733k96434l68934j66969o7144k1752K63351
18870A499374L20889J47077k87392n016J20858j48129l65176m1084j64571k1186
$$ y = [370411, 248989, 17127, 62080, 75897, 115805, 2933, -197637, -324854, 29944, 259224, 142270, 156604, 257520, 104921, 142815, 100561, 160473, 25377, 41369, 334162, 336672, 273066, 345626, 196777, 228901, 266137, 255795, 63567, -25420, 248748, 238595, 49343, 133708, 266377, 131791, 29256, 43682, 174008, 481417, 517568, 234566, 181736, 247331, 91966, 104615, 509928, 491558, 178826, 45303, -46024, -66150, 746, 269509, 542956, 375013, 262087, 435881, 681444, 909815, 1070577, 1475536, 1591066, 1808063, 2038975, 2250989, 2157256, 1860822, 1491888, 1324919, 1257775, 1236023, 1499374, 1820263, 1967340, 1679948, 1674932, 1795790, 1647661, 1282485, 1241401, 1076830, 1055644]
18860A055644k09330j09500j89950k97862o9500J84655j3736j50692k2554j9836
18850A57339m8341J87256M468l49482K7492K00065p3474j26458R1225j2084n011
18839E2995O1807J60737R6960l6761m4697J24873j03706O7375J6496o7107L2434
18828C61406J76j43684j59575j49583o913R0485J0942J14587J918n6747l3216
18817B9796K2603O8764J04389o3830L1902p8349j68793J08989O5029k0717N9013
18806A58796J2540n5581O3056J41523j77475j98128L10801K78064j55918l61290
18796A6388j85971J45115N7953R048J2142J67305r7826q2540j04863m0557J80032
18785G6226K1129j28208K74813K28819j09338k40182k8906m883J3575J38506J53198
$$ y = [1055644, 846314, 736814, 546864, 249002, 179502, 364157, 350421, 199729, 177175, 157339, 108998, 296254, 300722, -48760, -21268, 178797, 105323, -21135, 70090, 58006, 52995, 114802, 275539, 372499, 335738, 291041, 415914, 312208, 379583, 396079, 328972, 361406, 361582, 217898, 58323, -91260, -98173, -7688, 3254, 117841, 119759, 63012, 29796, 52399, 121163, 225552, 161722, 193624, 115275, -53518, 55471, 120500, 99783, 158796, 171336, 115755, 178811, 320334, 142859, -55269, 255532, 533596, 377678, 16388, -169583, -24468, 33485, 42533, 54675, 221980, 124154, 41614, -63249, -103806, 76226, 97355, -30853, 243960, 472779, 363441, 123259, 94353, 89470, 103045, 241551, 394749]
18774C94749P8334k1937j90868k98450l5336q4970p4466K43705k06526k03557
18764c99322q6709J45885K58691j47697p8100L57500L36928J49186K534k9877
18754E09019j1530l4989r8814k54228J29882J38562l862j63497k2880k0492J5869
18743A83040J04327K6082P0856j81098j4152K1730q5778O4270p8595J17400L8041
18732B66123j32379k48298l3213J44662K03799K2764K03618K61400l5897n9602
18722E92977j98086p097J54274r336k20044N0819R992N6976j1648j73402q9122
18711A56303o6408K6578P5555j40043l1590J48543J36735J9914j54478J60619
18701C31728K70934N4586J55802N4355l15824q5511k909j53762J74521J88085
$$ y = [394749, 473083, 451146, 260278, -38172, -73508, -158478, -232944, 10761, -195765, -399322, -486031, -340146, -81455, -229152, -307252, 50248, 387176, 536362, 538896, 509019, 497489, 462500, 363686, 109458, 239340, 377902, 374040, 210543, 187663, 167171, 183040, 287367, 313449, 384305, 203207, 189055, 210785, 125007, 189277, 110682, 228082, 266123, 133744, -114554, -147767, -3105, 200694, 223458, 427076, 688476, 652579, 592977, 394891, 387794, 542068, 532732, 312688, 363507, 373499, 430475, 418827, 245425, 156303, 89895, 116473, 192028, 51985, 20395, 168938, 305673, 325587, 171109, 331728, 602662, 657248, 813050, 867405, 551581, 466070, 463161, 309399, 483920, 672005]
18691F72005j4993j15969M9013N3576p7055l10929j60155q0595J96468J92160
18681D03526Q4327K86669J05820j6551K45284j70993j48538j7482J44975l0612
18671H86425j62635j13480n1508K47543L4973J06837L41179q5253j84301o8823
18661I50957K0159J2570j23201R7594K91027L11349O2688k33829k38132l8783
18651A112399M0206J06215K4246k13159O5708J57472j6272k25997k036K6946o5240
18640A010488Q922J54881O9434J72033J3016K2728J65582J01265J98102J18847
18630B035298k31194j52928K26457J78954L3684j9040k20041j01862M243M8192
18620A801763K7769n4915k17304L6243J80468J33655j2760L22986J31182j36918
$$ y = [672005, 657012, 541043, 590056, 643632, 566577, 255648, 95493, 14898, 211366, 403526, 487853, 774522, 880342, 863791, 1109075, 938082, 789544, 772062, 917037, 886425, 723790, 610310, 558802, 806345, 841318, 948155, 1289334, 1204081, 1019780, 950957, 971116, 983686, 860485, 958079, 1249106, 1560455, 1623143, 1389314, 1151182, 1112399, 1152605, 1258820, 1283066, 1069907, 1135615, 1293087, 1276815, 1050818, 1048782, 1075728, 1010488, 1019410, 1174291, 1243725, 1415758, 1428774, 1451502, 1617084, 1718349, 1916451, 2035298, 1804104, 1651176, 1877633, 2056587, 2090271, 2071231, 1851190, 1749328, 1753571, 1801763, 1829532, 1774617, 1557313, 1593556, 1774024, 1907679, 1894919, 2217905, 2349087, 2212169]
18610B212169J45599J99403K7239J53805K32698J65383J46644K33444M40780J9275
18600C976439L0898J77750O6810L26956L69900M71449L94736N89697R00850J122521
18590H428006J297964J929831K371956K878839L986296N794010Q353625J1400697
18582D6441224J5726057K0067929K1044251J4580675M104499o487124j9223804
18575I6253707k5463057k0480207j2836796p913403m985113l043189j998339j457252
18567A8076351q47740l00787k18464M6286M35179N92842Q81817J454576K086223
18558B2206283K809797L860632N650833P951264J0451612J3688090J7424167J8822538
18550A02865216J3454231M095870n107914j6072575k3180016j9984290j3110890
$$ y = [2212169, 2357768, 2557171, 2584410, 2738215, 2970913, 3136296, 3282940, 3516384, 3957164, 3976439, 4007337, 4185087, 4251897, 4578853, 4948753, 5420202, 5814938, 6404635, 7305485, 8428006, 9725970, 11655801, 14027757, 16906596, 20892892, 26686902, 35040527, 46441224, 62167281, 82235210, 103279461, 117860136, 121964635, 115477511, 96253707, 70790650, 50310443, 37473647, 29560244, 24575131, 21531942, 19533603, 18076351, 17228611, 16927824, 16709360, 16755646, 17190825, 17783667, 18665484, 20120060, 22206283, 25016080, 28876712, 34527545, 42478809, 52930421, 66618511, 84042678, 102865216, 116319447, 120415317, 115307403, 99234828, 76054812, 56070522, 42959632]
18543D2959632p953155n035417l111310j843307o36109J30518Q79142J586476
18535B6976470K576900M213669O287745R074314J2452024J6654224J8720897J5137449
18527A12093692O365275k680349j3791217k2204889k0939080j4492578r169739
18520C5181115n706286l721237k639771j988785j424373j041648o96433k75570
18512A7687012r3897K70347N92683O78695J113766J923444L003871M315487O234354
18503C5725762Q781855J1874168J5474126J8555529J6063944P422637j570231
18496A12327790j2422736k2778273k2449305j5588448r753573n964012l844093
18489A9527350k651924j940486j314068j087700o74435p28134p02675m61704k26482
$$ y = [42959632, 35006477, 29971060, 26859750, 25016443, 24380334, 24510852, 25389994, 26976470, 29553370, 33767039, 40054784, 49129098, 61581122, 78235346, 96956243, 112093692, 118458967, 115778618, 101987401, 79782512, 58843432, 44350854, 35181115, 29474829, 25753592, 23113821, 21125036, 19700663, 18659015, 17962582, 17687012, 17593115, 17863462, 18456145, 19134840, 20248606, 22172050, 25175921, 29491408, 35725762, 44507617, 56381785, 71855911, 90411440, 106475384, 113898021, 112327790, 99905054, 77126781, 54677476, 39089028, 29335455, 23371443, 19527350, 16875426, 14934940, 13620872, 12533172, 11858737, 11130603, 10427928, 9966224, 9739742]
18480I739742o64217o70100j76733k01589Q3594M65065J90610m59544o63148m92499
18470G151181m99049p44775o40309m50973m69519n00861m21654j91171r6395k19035
18460B917440l02568k67561J8747l26221j91777n4983J66284q5843j96881k63237
18450A413400J17313j78852l39272j16734K72056k30022m05437m8870K7836O7435
18440E78853K48996j806j53354j4667j59706m03068j39677k39439m2483M70783
18430A44432J16265m7506j72764l058N8580K4949n8041K39322j94115j45183j21349
18419a58468K1955M9698J21165k3740l3157j41316q1635K14503J54404O3692m5944
18408A41157l0460k1707K59621K23916o2691L6683p1765j30515j00660j51950
$$ y = [9739742, 9075525, 8405425, 8228692, 8027103, 8110697, 8575762, 8766372, 8306828, 7643680, 7151181, 6652132, 5907357, 5267048, 4816075, 4346556, 3845695, 3424041, 3232870, 3136475, 2917440, 2614872, 2347311, 2366058, 2039837, 1848060, 1793077, 1959361, 1873518, 1676637, 1413400, 1530713, 1351861, 1012589, 895855, 1167911, 937889, 532452, 483582, 511418, 578853, 827849, 826043, 672689, 658022, 498316, 95248, -44429, -283868, -326351, 144432, 260697, 213191, 40427, 37369, 95949, 120898, 62857, 302179, 108064, -37119, -158468, -136513, -86815, 34350, 10610, -22547, -163863, -245498, -30995, 123409, 187101, 141157, 110697, 88990, 348611, 572527, 509836, 546519, 474754, 344239, 243579, 91629]
18398I1629l1512N7676J69455j05741j07421j11875J21137J0248r2926J4026Q0176
18387I4872J56636k86j19117k55646K5271K05611J21174r97k18599J12108K07422
18376C28449m2825q3920J57025K12768J64106m7382K1915P3353m0597p2027k66624
18365D04241j81963k11574l3157J27961K95574M2288R1177K19159o5162j65309
18355E23235j39150j0962k5116J9485J95071m4520Q158Q0888K02957p3252l6504
18344G00290k32296k46218q7763l4348p8270J50640n6295l6999j144j25750j4112
18333f2265O4963J60258R0920J4469k4608k69375j43032K4314L9752m4418N4071
18322i4951O6620j506k4537q4579m6964K38764P1274P7187n1086j60583n7561
$$ y = [91629, 60117, 117793, 287248, 181507, 74086, -37789, 83348, 93596, 670, 14696, 94872, 251508, 251222, 132105, -123541, -98270, 107341, 228515, 227518, 8919, 121027, 328449, 285624, 201704, 358729, 571497, 735603, 688221, 710136, 783489, 742892, 670865, 404241, 222278, 10704, -22453, 105508, 401082, 443370, 534547, 753706, 688544, 523235, 384085, 373123, 348007, 367492, 562563, 518043, 526201, 607089, 810046, 736794, 700290, 467994, 221776, 134013, 99665, 21395, 172035, 115740, 78741, 77597, -48153, -62265, 2698, 162956, 253876, 268345, 243737, -25638, -168670, -144356, -104604, -149022, -94951, -28331, -29837, -54374, -138953, -185917, 52847, 124121, 201308, 150222, -10361, -67922]
18311f7922j3666k2511k80415M9884l7709J42767j431k36149j00033L14524K68939
18300A6278J17407j18822j788j4264q8553j53178j51594j6472j4229J16497l9648
18289c48366M3330K60448K24370j15935m7055j05396O822P8206n1725m23810j61293
18278f40404K87470K74477k1088j99731K45039J72621q5898J14187J34398o573
18268B74498M8202j66036m7886J10818J28570K06561k03627L7631l21419j36239
18258f8927O5851L01776O9245l18340k57694J5450J02189j39185j7905M21j9925
18247b67044r5875j66328L83565L43274l2653k6872j65498K15029K57486K2165
18237D67249m7970K9385J7873p5460R2306k67809k16958L9332J05465O5712Q6659
$$ y = [-67922, -81588, -104099, -384514, -334630, -372339, -229572, -231003, -467152, -567185, -252661, 16278, 133685, 14863, 13075, -1189, -89742, -242920, -394514, -410986, -425215, -308718, -348366, -305036, -44588, 179782, 63847, 16792, -88604, -81782, -3576, -55301, -479111, -640404, -352934, -78457, -99545, -299276, -54237, 118384, 32486, 146673, 281071, 274498, 322700, 156664, 108778, 219596, 348166, 554727, 351100, 388731, 67312, -68927, -3076, 298700, 367945, 49605, -208089, -192639, -90450, -229635, -247540, -247119, -267044, -362919, -529247, -145682, 197592, 164939, 138067, -27431, 187598, 445084, 467249, 419279, 448664, 466537, 391077, 483383, 215574, -1384, 37948, 143413, 209125, 295784]
18226B95784Q2284j66054k43240j1122J0085n8264n7868Q087p7147R775R0252
18215a17428R4517j79355k02351J98157L43195k7952l7043K42369M0024j43734
18205B10399J57129N4927k70575j22707m5540P2867Q8192j13661O8691J1030o3196
18194D7556m4583J67844J89038n8937j24459J41277J15808L8711M8416j63653
18184C57018j64482j76447j75344P7355Q6714j05074l2471j12649n5508J73204
18174a27684j14417j31730M8882K07773j10485n26J23063Q6029j3797P2855J41653
18163A81616K5568R4929j71973j42760j7383m969J52788J51507O0862J31326j75378
18152B86133j4633M8347m4370J764n3335K2379J3351j66236j93565N9680J99209
$$ y = [295784, 378068, 212014, -31226, -42348, -32263, -90527, -148395, -140308, -217455, -207680, -117428, -22911, -202266, -404617, -206460, 136735, 108783, 71740, 314109, 354133, 210399, 367528, 422455, 151880, 29173, -16367, 56500, 144692, 31031, 99722, 110752, 47556, 2973, 170817, 359855, 300918, 176459, 317736, 433544, 472255, 520671, 357018, 192536, 16089, -159255, -81900, 4814, -100260, -132731, -245380, -300888, -127684, -242101, -373831, -324949, -117176, -227661, -228187, -105124, -19095, -32892, 39963, 181616, 207184, 302113, 130140, -12620, -30003, -34972, 117816, 269323, 330185, 461511, 286133, 271500, 319847, 275477, 277241, 223906, 246285, 259636, 93400, -100165, -40485, 158724]
18141A58724J22702p5939l98077K1127K6500Q0684Q6516J3997N0131l6262J42569
18130A92672N1880K512l7150K7767l80220k33083n1866o0409m96O316J30916o574
18118c57735J20252M37489K55873p4364k1562P0863J5135R1261q9837k36905j40268
18107G0202n9614o238J02151j26631j14541j08017q5206p8458K10281L17501M3888
18096A65318N045o0940r1919L36282J54949j89200l29780j36601O2699K2269J56489
18085I4611K37621p993l1698J29706o3601j7762K10040Q3266j81981k29789k28874
18074f454j53713J51597m3279k06826J9488K88969J35973J00287j21183l54973
18064a90114m6533L5904O6872n3368R577R6919L5983j85648l2708p6681O5113
$$ y = [158724, 281426, 205487, -192590, -171463, -144963, -64279, 22237, 36234, 86365, 50103, 192672, 244552, 247064, 209914, 237681, -142539, -375622, -427488, -487897, -488393, -482077, -351161, -357735, -237483, 200006, 455879, 381515, 359953, 430816, 445951, 537212, 447375, 210470, 70202, 10588, 4350, 106501, -20130, -134671, -242688, -327894, -406352, -196071, 121430, 165318, 170363, 109423, 17504, 353786, 508735, 319535, -10245, -146846, -84147, -61878, 94611, 332232, 324239, 292541, 422247, 358646, 340884, 550924, 634190, 452209, 222420, -6454, -160167, -8570, -51849, -258675, -239187, 49782, 185755, 286042, 164859, -190114, -236647, -200743, -133871, -187239, -177662, -80743, -44760, -230408, -263116, -339797, -274684]
18053b74684J99346L84014K53795j13618j68663j37439l81636r9675O8255K28703
18043d1602L2587j02462o8769k44043M3683K77703J70772l8364p9716k11204l4241
18032b95656J97517K12232k6304m6168n471k36770j22708L23928J90298J69737
18022C60635l8671J26418j11670r2130p2479N5241k27338k09416o1576j18034
18012c89020n3537N9124j05950J04644M62610J56838J09760J01901j16330j84433
18002A45607k57759l3217J54595N3480j69919L4756J42382J63299N0843j43118
17992A40949m4490Q5191j094j78751j08070P5372L7432J5832P5313p3869j17962
17981i4147j32373L5511K08140j13863R4493r8911J39009K50762q8296j13832
$$ y = [-274684, -75338, 308676, 562471, 448853, 280190, 142751, -238885, -338560, -270305, -41602, -9015, -111477, -180246, -424289, -380606, -102903, 67869, 29505, -50211, -261415, -295656, -98139, 114093, 87789, 41621, 36150, -200620, -323328, 600, 190898, 360635, 321964, 448382, 336712, 244582, 172103, 227344, 6, -209410, -270986, -389020, -442557, -383433, -489383, -384739, 77871, 234709, 344469, 446370, 330040, 145607, -112152, -145369, 9226, 62706, -107213, -72457, 69925, 233224, 284067, 140949, 96459, 181650, 180556, 1805, -106265, -30893, 6539, 22371, 97684, 23815, -94147, -226520, -191009, 17131, -96732, -2239, -101150, 37859, 288621, 200325, 86493]
17971H6493K67824r1239q0429K4295J4943j77l67514j32602J39162K03590J56939
17960B21285j91061j44269K39664k37379M916K04962q8378L7742P4868n6229j41266
17949g5145O2791O9290j0981k17741l416P467q9035J7079J06378j190l0738r8591
17937b63832j12335J27141Q9569m2621L9589J21952k5219q2432j00260O7904j08870
17926b89414m4030J29123J90494j71233q2372J54472J70739r4181n010l7819m6806
17915a26037P5532l8859k00189j04250j58320O2227J58933J15448K1627j71400
17905c65288L8477j9461j44430J3197J44081N7113j6125K4913J93417K97842M3850
17894B67586k11523k65919k10230k6381M6085j0996P8844J83952r7300L7625J43951
$$ y = [86493, 354317, 263078, 182649, 206944, 221887, 221710, -145804, -278406, -139244, 64346, 221285, 30224, -114045, 125619, -111760, -106844, 98118, 9740, 47482, 122350, 66121, -75145, -12354, 56936, 45955, -171786, -175202, -167735, -256770, -239691, -133313, -134503, -165241, -263832, -376167, -249026, -159457, -202078, -162489, -40537, -65756, -148188, -248448, -180544, -289414, -333444, -204321, -13827, -185060, -267432, -112960, 57779, -36402, -41412, -79231, -126037, -50505, -89364, -289553, -393803, -552123, -489896, -330963, -215515, -193888, -365288, -326811, -346272, -490702, -477505, -333424, -276311, -292436, -267523, -74106, 223736, 267586, 56063, -209856, -420086, -446467, -400382, -411378, -332534, -148582, -245882, -208257, -64306]
17883f4306l827k0108M3515P57k002P1558j13095n1024j20761j57239j06524j36678
17871f59734L3489J59009Q6041n681j2262m9246m2233J26193J04991k27980J3684
17860d73729r0003J44802L24143J49548q0945j25481n2538J33908n8275k05566
17850c34136j51555J38513J45347j4776j01800J27660K20091j31005k65917L2677
17840c34901K04399n2292j1006P9229k5957o6184O2666j7904r7091j41372J11870
17829b88543J41515J7379K12116J16420m1792j43067J68612m3015p1325j89723
17819a21423k05055J09770P2923o2952j2034L2111K010J96519J96311k393n483
17808B00304L1821j15293l1469j82931P7257J24598l33780j01241J55335r0906
$$ y = [-64306, -68133, -88241, -44726, -43969, -45971, 25587, -87508, -138532, -259293, -416532, -523056, -659734, -626245, -467236, -381195, -386876, -399138, -448384, -490617, -364424, -259433, -487413, -473729, -563732, -418930, -94787, 54761, -26184, -151665, -204203, -70295, -128570, -334136, -485691, -347178, -201831, -216607, -318407, -190747, 29344, -101661, -367578, -334901, -130502, -182794, -193800, -114571, -140528, -206712, -144046, -161950, -259041, -400413, -288543, -147028, -129649, 82467, 198887, 157095, 14028, 182640, 139625, 68300, -121423, -326478, -216708, -143785, -206737, -218771, -186660, -184650, 11869, 208180, 205787, 200304, 232125, 116832, 85363, -97568, -20311, 104287, -229493, -330734, -175399, -266305]
17798b66305j6838J26714K05160k0256l6110J4732p1328m8767M771l6715O5739
17787g9203J07367P619J23769m30479k10332J57055N936J35506K72961J4662k87727
17776a82866O1770J53854m2301R0779j49619j25135J56635J66571j48869l0230
17766d9411j0730O8961J42352j53382o3230r0193m922J31964k4397k7880J02708
17755B1840O079p9884r0022j20716q6356Q8016K54363K24170k0014k41987j29396
17744a73907m9216R0088q9309P2770k66468r1184P5994J00698R3538J36891J94519
17733I4414J75086r1215j89485q268M8525K7218J15171j91005j44240j20845l6090
17722c20734K7302j77456m1232P2642K08301j94320K5745j0531p4755J7259R9004
$$ y = [-266305, -283143, -156429, 48731, 28475, -7635, 7097, -64231, -112998, -108227, -144942, -79203, 28164, 35783, 159552, -270927, -481259, -324204, -318268, -182762, 90199, 104861, -182866, -121096, 32758, -9543, 81236, -68383, -193518, -36883, 129688, -19181, -49411, -60141, 8820, 151172, -2210, -65440, -155633, -160555, -28591, -52988, -80868, 21840, 27919, -51965, -141987, -262703, -349059, -261043, -6680, 217490, 197476, -44511, -173907, -223123, -133035, -222344, -149574, -416042, -507226, -431232, -330534, -236996, -100105, 94414, 269500, 178285, -11200, -19468, 29057, 56275, 171446, -19559, -163799, -284644, -320734, -293432, -470888, -512120, -439478, -231177, -425497, -399752, -410283, -485038, -467779, -368775]
17711c68775M0848r480Q1271N518j32783q4767k9401J88910N4221M404m2653p9860
17699c72547k67550q7338J01444P3380K51584K10262j46326l3049K8327P0352
17689a71461K430q4894K8473j48836q1207J02432K80698p1619o9696L5748m6350
17678b24282m4140r1635J5920Q5707m5129m1139K73476N5576L9104k7858J92798
17667A88398J26240j11282K7054r3748k57714n5473r3860N1756O451k16615m7308
17656d76101J62241L32950R3398K4156J06048l13013Q3358J6782J44706Q1219
17646B55744O146j98659k56625P7892o670n3471K38000J02067r1306J55453o727
17635B21844R9877k8024j42214Q4238o5250j77226j96944j25304J14855J96206
$$ y = [-368775, -327927, -337407, -256136, -250618, -383401, -468168, -497569, -308659, -254438, -250034, -292687, -372547, -640097, -727435, -625991, -552611, -301027, -90765, -237091, -270140, -241813, -171461, -169031, -253925, -225452, -374288, -455495, -353063, -72365, -143984, -213680, -177932, -224282, -268422, -360057, -344137, -258430, -303559, -344698, -71222, -15646, 23458, -4400, 188398, 314638, 203356, 230410, 136662, -121052, -176525, -270385, -218629, -212178, -428793, -476101, -313860, 19090, 112488, 136644, 242692, -70321, 13037, 29819, 174525, 255744, 261890, 63231, -193394, -115502, -122172, -175643, 62357, 164424, 73118, 228571, 221844, 321721, 293697, 151483, 235721, 170471, -6755, -203699, -329003, -214148, -17942]
17625a7942J72841n4605p0349p9884N6539R83j08623J41361k9456n7449l7487
17614h4071o5270j266K7872j64445k83906J32088L1341J90726J97655j19316M2490
17603i6102j3851O5091J06957j13726k83083K37664K8783k27474k07121l08827
17593h11689q825L09592J92524K12353m6986j53493J10876J17853j13765L9932
17583a51628M7053M4428j05280l3271M1612J3520L03247J27165r1849q2185o7481
17572D5331l1489J22014p1931p2084j3454O5561P7880J56364p0826k51373j42820
17561a86827K36150L1540k99186p804O6365K0750J87453J49432p5694l23989m858
17550b06668K8413N5046q144M5812Q1510k7714l1177q2004j6525N2133J7853p5845
$$ y = [-17942, 154899, 100294, 29945, -49939, 6600, 7583, -101040, 40321, 10865, -46584, -84071, -149341, -150607, -122735, -287180, -571086, -438998, -407657, -216931, -19276, -138592, -96102, -109953, -44862, 62095, -51631, -334714, -97050, -68267, -295741, -502862, -811689, -820514, -510922, -318398, -106045, -153031, -306524, -195648, -77795, -191560, -151628, -104575, -60147, -165427, -198698, -157086, -143566, 159681, 286846, 194997, 112812, 45331, 13842, 135856, 63925, -8159, -21613, 43948, 121828, 278192, 207366, -44007, -186827, 49323, 80863, -218323, -226127, -159762, -139012, 48441, 197873, 122179, -201810, -206668, -178255, -123209, -131353, -85541, -4031, -31745, -62922, -144926, -161451, -109318, -91465, -167310]
17538a67310R1280k0259P8528j6664l2555p5185j10448j00629l0913J75060l4543
17527b43638J76953R633r6080r8742J00551L84196J47028j21490k12855m54225
17517d08669Q3689j12577O8753K86389j39131o3315J5692Q4207J96876K12632
17507B24546k90553k89361P1035K42511R8016j62044j2058j28584j41077J29089
17497b58480J35878R6043q5181j46299L6662J04849K7997K0743P0257K06728r3403
17486A15794J13980R4249K9264n9725k42731j75809L9784j86785l29205p2613
17476f73797J14901M8136J48993O6836q7939k36955m2748J32331P4255q7527N9814
17465d83700l07850k0646O1879K84024R4836K13639P2678k6126j28953J7856p3451
$$ y = [-167310, -76030, -96289, -17761, -34425, -66980, -142165, -252613, -353242, -384155, -209095, -243638, -66685, -57052, -153132, -251874, -151323, 232873, 379901, 258411, 45556, -408669, -324980, -437557, -368804, -82415, -221546, -284861, -269169, -184962, 11914, 224546, -66007, -355368, -284333, -41822, 56194, -105850, -117908, -246492, -387569, -258480, -122602, -26559, -111740, -258039, -221377, -116528, -88531, -67788, 2469, 209197, 115794, 229774, 324023, 353287, 293562, 50831, -124978, -85194, -271979, -601184, -673797, -558896, -510760, -361767, -294931, -382870, -619825, -662573, -530242, -455987, -543514, -483700, -791550, -812196, -750317, -466293, -371457, -157818, -85140, -111266, -240219, -222363, -295814]
17454b95814J28484J17087J78667r8431j31755o4469O5016j82911j12804J47411
17444b49519r5869l0535J97931L726l0287O5287o7409K83564J61256j73994r5224
17433c1073k11708q6111J54107P8651Q3283k0733j32655J30116o6633p0045L8202
17422a34599m2494j16438p5285R8152l38011P5044J80691J42315J63445J43413
17412I6233p6877j75931J08675R3257m075j28443J83663j20788k44041P8429K6648
17401a63250K55051n9730q1204k08149l7731J44434J4937j71748j4897M9477o2317
17390c35127j55009J61991j68613m4342k10298n1329O0836L1561K20340J10485
17380c79505L30940O0528O4984N0413k91226J36476P1448k83890p5637m501l0872
$$ y = [-295814, -167330, -50243, 128424, 29993, -101762, -166231, -101215, -284126, -396930, -249519, -345388, -375923, -177992, -174266, -204553, -139266, -206675, 76889, 238145, 64151, -31073, -242781, -328892, -174785, -96134, -12851, -33584, -166239, -36123, -102756, -172801, -134599, -177093, -293531, -368816, -270664, -608675, -533631, -352940, -210625, -47180, 96233, 19356, -156575, -47900, 45357, 41282, -87161, 96502, -24286, -268327, -189898, -163250, 91801, 32071, -49133, -257282, -295013, -150579, -135642, -307390, -322287, -272810, -335127, -490136, -328145, -496758, -541100, -751398, -802727, -741891, -710330, -489990, -379505, -48565, 11963, 76947, 127360, -163866, -27390, 44058, -239832, -315469, -319970, -350842]
17369c50842P9790n776q8957n3337J83981N8230O9258m0240j227k6368k75959
17358d51447J4926j22985L2372J44207K50973l3283L485N5381n2729j1331m6429
17347b16860q2030J9670j8792n5529M2588P304j61441Q8169N8441Q2800J05909
17336a29771p594j066L14318o1003l30834K3062Q35M8032O3969K65696K7103J04321
17324C17068j24263J65430L40623K35291L02206K20851K41406k05896l90691k75665
17314H26360m71212k20590j87410J24957K54804m5180k39000l78927q7242P1437
17304c52003l1713M2366J68236J14483R8064n4636J04966J84759N0111k75362
17294D9271P0869R689k48950j60853J96222K17169n460J6779L0673j3619R2490
$$ y = [-350842, -271052, -276828, -365785, -419122, -235141, -176911, -107653, -147893, -149120, -175488, -451447, -436521, -559506, -527134, -382927, -131954, -165237, -161752, -106371, -159100, -170431, -216860, -298890, -279220, -298012, -353541, -310953, -303649, -465090, -376921, -318480, -235680, -129771, -137365, -138431, 175887, 114884, -215950, -192888, -192053, -144021, -80052, 185644, 212747, 317068, 192805, 358235, 698858, 934149, 1236355, 1457206, 1698612, 1492716, 1102025, 826360, 355148, 134558, -52852, 72105, 326909, 281729, 42729, -336198, -423440, -352003, -383716, -341350, -173114, -58631, 39433, -15203, 89763, 274522, 324633, 49271, 120140, 129829, -119121, -279974, -83752, 133417, 127957, 144736, 175409, 161790, 254280]
17283B54280q3385q7038r6077j19076j9369K3897P2181j80524J02349K23142M6657
17272A37037j27351j76239o1481J80551n6328q1850P2949J00930J18952j97010
17262h9840O619L6190N9850j68325j41489K9837J5705Q6093L12971Q4576q4409
17251A47778j04699j68237j37047n3224K7350J45088j69176r7238M2104R4709
17241b72592J39030j77511j79300j22369J09577K22457J72141o4671O362j68446
17231c35322n0051Q0144J82144K3189j6327N2850K35420K77666L89453Q1586j4115
17220I06637L12337K08759j2843j68374p1657k26481l10257m34569j08093r5609
17210a50r8956K0280k1286K20921K07877N5557j10919j81297j28414J48954j01786
$$ y = [254280, 170895, 83857, -12220, -131296, -150665, -126768, -54587, -235111, -132762, 90380, 137037, 9686, -166553, -228034, -47483, -103811, -185661, -112712, -11782, 107170, -89840, -83221, -47031, 12819, -155506, -296995, -267158, -251453, -165360, 147611, 232187, 147778, 43079, -125158, -262205, -315429, -288079, -142991, -312167, -409405, -367301, -272592, -133562, -311073, -490373, -612742, -503165, -280708, -108567, -173238, -166876, -335322, -385373, -305229, -123085, -99896, -116223, -63373, 172047, 449713, 839166, 920752, 906637, 1218974, 1427733, 1414890, 1246516, 1174859, 948378, 638121, 203552, 95459, -150, -99106, -78826, -100112, 120809, 328686, 384243, 273324, 92027, -36387, 112567, 10781]
17199A0781l7796m9608P2519k0896j29583j12126J25224J16888L36981k2590m64475
17188a74681m5341K32601Q410r1402l3619j02458j46962K2044j26811K5447K54033
17177a78739J4154M9403O9771J0440J36089o815q0274k42766k03731J74393L21876
17166F3801J49199p1285j46599k22709n9833J56858j84513K6030L08718k4942
17156e275M5546j12801J13849O1317j58091j05459n668j62709J90557J51278O6582
17145G9126p2340J66501N6810j52856k2230J52746m025j62053o1851j32446o8131
17134b20749L7530l2827j8296J1072J57087j36560p5195j79786j30150J26908
17124d60966K31418J93590O3875K71754J8923j22388j13655j6188j28895L4149
$$ y = [10781, -27015, -76623, -4104, -25000, -154583, -266709, -141485, -24597, 312384, 289794, -174681, -220022, 12579, 20989, -70413, -104032, -206490, -353452, -331408, -458219, -432772, -178739, -164585, -115182, -45411, -34971, 101118, 94303, 14029, -228737, -432468, -258075, 63801, 213000, 141715, -4884, -227593, -287426, -130568, -315081, -289051, 19667, -5275, 40271, -72530, 41319, 102636, -55455, -160914, -166582, -329291, -138734, 12544, 79126, 6786, 173287, 230097, 77241, 55011, 207757, 203732, 41679, -20172, -152618, -220749, -183219, -216046, -234342, -223270, -66183, -202743, -277938, -457724, -587874, -460966, -229548, -35958, 27917, 299671, 318594, 196206, 82551, 66363, -62532, -28383]
17114b8383J24775J81817J28439L0905m9116k6806J4384k32304o6422R1558O4404
17103B33251j74147k5758K07191J66703j93285k38928j15606k0559R4595l8664
17093a05207l7102J14300j99814J04403J06038l9387n5229Q0441J64227M649j20252
17082A7067P9892j53309j3547j80001K3038K67756o1843M3041J03656m5835j16944
17071c7029l9133j81864k13200m9260K14926J05981p6914O1169r5025K3348Q964
17060b78037o0922M9410j55842K09314K30455j60033k7068r1093n8660J2290N188
17049c24998M11J12805N7291q4406k8205J33601K03338P2920j28554k09176Q0337
17038a14636R6520p5946j32295J29604M9871j72400J98409o0460k72293K7467
$$ y = [-28383, 96392, 278209, 406648, 437553, 388437, 361631, 376015, 143711, 77289, 168847, 233251, 59104, 33346, 240537, 407240, 213955, -24973, -140579, -161138, -66543, -105207, -142309, -28009, -227823, -123420, -17382, -56769, -111998, -31557, 132670, 137319, 17067, 96959, -56350, -69897, -249898, -226860, 40896, -20947, 22094, 125750, 79915, -37029, -76162, -258026, -471226, -520486, -305560, -199579, -276493, -215324, -310349, -287001, -278037, -338959, -289549, -445391, -236077, -5622, -165655, -192723, -283816, -342476, -330186, -324998, -324587, -211782, -154491, -238897, -267102, -133501, 69837, 142757, 14203, -194973, -114636, -18116, -94062, -226357, -96753, -46882, -219282, -20873, -81333, -353626, -326159]
17028c26159J62020p0450r2098J24880K9636M9427l563M1386k51228j37662N4588
17017d19223K99884J66708K65867N0664j07843r4181j31942j98453j2078O5032
17007a15565K8481m8301k23560J01404r0349K72945J59161O2178j7054J6756J17251
16996B63347p6184N9464j56963l12640k23488J35823K08771Q7676J40293J78157
16986C04256j20494K09521j2952k86423p2963l4546o4939j34282o828J81453J13309
16975G5112k25452l8742p9885M5962K2822K10641o7304k04663L9921Q8265M6982
16964h6341L2392K27452J1j60110k5450k91493j32348k9996K20701K76214K01272
16953B32304j11637N567j34240o3590n3635p2189n7839L9376K54915N5795m577
$$ y = [-326159, -164139, -234589, -326687, -201807, -172171, -122744, -126307, -84921, -336149, -473811, -419223, -119339, 47369, 313236, 363900, 256057, 161876, 29934, -168519, -180597, -115565, -87084, -135385, -358945, -257541, -347890, -74945, 84216, 146394, 129340, 146096, 263347, 187163, 246627, 89664, -222976, -446464, -310641, -101870, -14194, 126099, 304256, 183762, 393283, 380331, 93908, 20945, -13601, -78540, -212822, -219650, -38197, 75112, -150340, -189082, -268967, -223005, -200183, 10458, -56846, -261509, -221588, -133323, -86341, -53949, 173503, 173514, 13404, -12046, -303539, -435887, -465883, -245182, 31032, 232304, 120667, 126234, -8006, -71596, -125231, -197420, -255259, -215883, 39032, 94827, 90250]
16942I0250O0109J07668l9587p7159l7287p1523k08230N720O5639J38142q1887
16931d8145J7268J57978L921q8764L2948p0648J93873K01003l91891n9429P8949
16920B7063j46430M6407R8004o2902j63452O3537Q7253J09688k1395j10527R4587
16909B1833j38040o1407J6454j5472j8374k725l0029K70698k2285j21390j22304
16898b23041j22810n3547N1379K23063K24970j7185n6987j76581j6724J9004M5884
16887a02575M5793M0451j01751P5901k57764Q9751K96338P7311n2497o8816r0175
16876d8033J26162J53840Q4599k50340q8323J05165N9624R11J28931j51111j31017
16865i592k72216p1194j2012J60276K7494O6984L491j82568j52015K89892Q9938
$$ y = [90250, 150359, 258027, 218440, 141281, 103994, 32471, -175759, -170039, -104400, 33742, -48145, -30877, 127101, 131022, 42258, 75206, 4558, 198431, 399434, 7543, -51886, 27063, -119367, -72960, 25044, -37858, -201310, -137773, -50520, 59168, 37773, -72754, 21833, -116207, -177614, -161160, -176632, -195006, -197731, -227760, 42938, 20653, -100737, -223041, -345851, -399398, -348019, -124956, 100014, 82829, 25842, -150739, -167463, -148459, -102575, -56782, -16331, -118082, -42181, -299945, -210194, 86144, 163455, 110958, 42142, -48033, 78129, 231969, 316568, 66228, -22095, 83070, 142694, 143605, 272536, 121425, -9592, -281808, -353002, -365014, -204738, -177244, -110260, -106769, -289337, -441352, -151460, -61522]
16854f1522j08173p4169m7372K81661J33901M8889o9597l5726M4411K02473l809
16843C10967k16042m9188J53678o1598L9485q35p2681K17026r4973j75836j09866
16832e9863k05937j15715M0070J03975J41525q6617r5018K4750J69874J30141
16822D7185k2606n9598o1099J13063o9749j08353j85810J39232r673n1610k17203
16811d86221l429K33241K5065J12926k6082R4457J80954j8675o9619k6304j46561
16800a30248R0829L3579K3753J84314L8789k65258j46887R519j98742N8637Q2992
16789b18723o7475j4463j36100m5319J20635P4951j18573k69030R3658J22250
16779d58189m2929j51748R4697J47328J60859p2243J7611J74222J02610K2013
$$ y = [-61522, -169695, -243864, -291236, -9575, 124326, 173215, 103618, 67892, 112303, 314776, 310967, 94925, 45737, 199415, 137817, 177302, 176467, 103786, 320812, 225839, 50003, -59863, -265800, -381515, -341445, -237470, -95945, -182562, -277580, -252830, -82956, 47185, 24579, -35019, -96118, 16945, -52804, -161157, -346967, -207735, -217408, -269018, -486221, -489650, -256409, -231344, -118418, -144500, -50043, 130911, 112236, 42617, 16313, -130248, -39419, -5840, 17913, 202227, 241016, -24242, -171129, -161610, -360352, -301715, -218723, -286198, -300661, -436761, -482080, -361445, -286494, -405067, -674097, -580439, -458189, -501118, -652866, -558169, -410841, -249982, -322225, -304614, -130392, -27782, -5769]
16769e769m9982k11045j1330K85673N9278P0813R387n4751n9681k25564n977J19837
16757g9111K84367J16005j5132r984o8605J4210J4492p0253j23589J1324O5962
16746A39686k0593m6929j69372m3162q6347L2168P2434K44249j4327o2066k32626
16735a86885k6553M6007k6556p6506N5651K02933J59550k83449j97254Q863J61367
16724a62832J06029J29631p3888k13563M0745n5794P0269J54260J80m8980L8761
16713a5182L6416k54532j05909J76352J22689Q9041n6057K01383j33439j91320
16703a30558N5010L2972J4024N4768O6903j83375J44401P1769q2359j57779l0519
16692a44743J01058N8649m1575k67781r1053J33426O2719J50563k4333j69013
$$ y = [-5769, -55751, -266796, -278126, 7547, 66825, 137638, 147025, 92274, 32593, -192971, -198948, -79111, 205256, 321261, 306129, 296145, 227540, 241750, 256242, 185989, 62400, 73724, 139686, 119093, 72164, -97208, -140370, -226717, -194549, -122115, 122134, 107807, 45741, -186885, -213438, -167431, -193987, -270493, -214842, -11909, 147641, -135808, -333062, -324199, -162832, -56803, 72828, -1060, -214623, -173878, -229672, -159403, -5143, -4963, -53943, -15182, 21234, -233298, -339207, -162855, -40166, 48875, -7182, 194201, 60762, -130558, -75548, -42576, -28552, 26216, 93119, -90256, 54145, 125914, 43555, -114224, -144743, -43685, 14964, -26611, -294392, -385445, -252019, -189300, -38737, -63070, -232083]
16682b32083m4884O4645K85860N4881j18497j05019k1923K1014p4955j3546L9303
16671a45204O8570P4443r3499m7654k9567J03737L07556J42872r3244N2330L8825
16660C79165j13372o9770l3264q5503j67806N6368m8125j490n3978j26117Q2064
16649a81828K53252J24156J44135J98576l10446j38126J45340N3166j26277N6549
16639B18497L0983q4648j73684k156N0756k87590m4055K22580R2005j23601R0614
16628a0299J81850Q4432n8630R4866j89544n7118K5475K9118r1761j10047j73186
16617b74844n9419q8843j09910n8612J39231L77535K55018O1353j74186L8226
16607A05549Q3250o3860J11608P5899j9726j50038R6764J9512o0209j42704J48682
$$ y = [-232083, -276967, -212322, 73538, 128419, 9922, -95097, -117020, -96006, -170961, -184507, -145204, -76634, -2191, -95690, -143344, -172911, -69174, 238382, 381254, 288010, 340340, 379165, 265793, 196023, 162759, 77256, -90550, -34182, -82307, -83797, -137775, -263892, -181828, 71424, 195580, 339715, 538291, 227845, 89719, 235059, 288225, 161948, 218497, 249480, 164832, -8852, -11008, 39748, -247842, -291897, -69317, 22688, -100913, -10299, 171551, 255983, 197353, 292219, 102675, 45557, 71032, 100150, 8389, -101658, -274844, -334263, -423106, -533016, -591628, -452397, -74862, 180156, 241509, 67323, 105549, 188799, 124939, 236547, 312446, 292720, 142682, 239446, 258958, 198749, 56045, 204727]
16596B04727K6886k92687k50018J65996J5693o0799k40725L0829K11880J23660
16586f4558P3663o027J30541j05170L3488k1085l832J1053q1400k02043L3047
16575b02323j5210J36330J67060j85226j02297M2940N0172l8363J32562L772k8882
16564c9465k67807q3871r6882K28945K82695k3304K0486j52106j37684N3129L2071
16553a83793P2852l0761j09231m3057N7024M7972l6058n1870N7644K2370J35935
16542f0973k1082K52367R8182j19418q1297p6492l1966j49072J29601K09400r4485
16531E4765j76514j03234J09026J82524J20599J71657L5193p2552K1462p2341
16521B70585J8889K31147k97267k78264N7139K5835n3838j60082K3183j8355P2094
$$ y = [204727, 231613, -61074, -311092, -145096, -129403, -190202, -430927, -400098, -188218, -64558, 9105, 3078, 133619, 28449, 61937, 40852, 37020, 48073, -33327, -235370, -202323, -217533, -81203, 85857, -99369, -201666, -158726, -108554, -146917, -14355, -10583, -39465, -307272, -391143, -488025, -259080, 23615, 311, 20797, -131309, -268993, -215864, -183793, -110941, -141702, -250933, -293990, -236966, -188994, -225052, -276922, -219278, -196908, -60973, -82055, 170312, 268494, 149076, 67779, -8713, -40679, -189751, -60150, 149250, 54765, -121749, -224983, -115957, 66567, 187166, 358823, 394016, 321464, 342926, 270585, 289474, 520621, 223354, -54910, 2229, 28064, -25774, -185856, -162673, -181028, -108934]
16510a08934j8187j03947R7470J01325k1274k9038n6576J92622J12386j43091
16500B2756k55748O0124J0630M0169n4342M2129P8326N761r3008J81057j1661
16489B6193P1783k5506L2709J82750j22886j07199j10893j28942N8586R0149j84652
16478b17908j02362m7678r0579m2794N4182J03254K62627R2525p6299k39257q9316
16467c93605K38506K40161o1383j58109K09666J8412K6154O9825R6822k20916
16457F5533j07952J12656j00161n7699k59808j16105n626o3263J16224M33657
16447A7456L6438k42857k5959K03197M01j7361J11991j9753r9473q320k3985N8989
16435i236J64351K44770O3242j73060j61538k43953n6050Q4581j4248J12170P8272
$$ y = [-108934, -127121, -231068, -133598, -32273, -53547, -82585, -139161, 53461, 165847, 22756, -232992, -172868, -162238, -122069, -176411, -134282, -55956, -50195, -143203, 37854, 26193, 97976, 72470, 105179, 287929, 165043, 57844, -53049, -181991, -123405, -33256, -217908, -320270, -367948, -458527, -501321, -447139, -343885, -81258, 11267, -65032, -304289, -393605, -155099, 85062, 23679, -134430, 75236, 93648, 119802, 189627, 286449, 65533, -42419, 70237, -29924, -87623, -347431, -463536, -469162, -532425, -416201, 17456, 53894, -188963, -214922, -11725, -11324, -28685, 83306, 63553, -35920, -44240, -68225, -9236, 155115, 399885, 463127, 290067, 128529, -115424, -171474, -86893, -101141, 11029, 89301]
16424H9301J01659N6560o1996l21531K04487L1525j8843o2539k29075j69993N7491
16413c22954J45563J17889J6304k00641r4135K36501J35336K37505J7643o0454
16403B28557k23624l08357j73863K36683L20218J19377k55453K6277n4860M9389
16393c5656J1732n3761M7769J93343N6156K5383k00664N7038Q8197o3359k88135
16382a61957j03565N585P3504m1792q4203L15140Q7424l39928j27128J56620J62742
16371e7558k96510j39686R1053K66788L81966J38902j93715p7190r1932K4704
16361D6822K61677K15653k4903P9224M4158k6990j49664j34346o1977j72570j72177
16350i5093K81022j7622Q145q2069p0985K26815N5703j16089l1680j426j1650
$$ y = [89301, 190960, 247520, 185524, -136007, 68480, 100005, 81162, 18623, -210452, -380445, -322954, -177391, -59502, -43198, -243839, -337974, -101473, 33863, 271368, 289011, 228557, 4933, -303424, -477287, -240604, 79614, 198991, -56462, -30185, -85045, -35656, -23924, -77685, -29916, 163427, 219583, 244966, 44302, 101340, 189537, 126178, -161957, -265522, -259937, -186433, -228225, -312428, 2712, 90136, -249792, -376920, -220300, -57558, -354068, -493754, -402701, -135913, 246053, 384955, 191240, 114050, 22118, 46822, 308499, 524152, 499249, 578473, 622631, 595641, 445977, 311631, 249654, 77084, -95093, 185929, 168307, 176452, 94383, 23398, 250213, 305916, 189827, 158147, 156721, 145071]
16339A45071k03177k57567R9844K21941k8568P2236p4366P2776K23507J61793
16329D33490k9716n79429l5476L00409J61937P5379q8985n478p9862m9978J29651
16318B31942J79332J6025k59468M1920J46879J10735q4476j5827j26364m1465
16308A99233J33596j79121l0975l8212Q5353k9717j26852k0328M26581j5431l0227
16297C73900n863j43545J53614j09255k72294r772R7405O9200k31333k90290J08105
16286b60128O6391K12276j07161L1317K10886k9968k53086p2386O0008J11505
16276c0346O700J59864K2289j84932j52226j62508N894N1580L7293Q9548J13638
16265d3206L42222J15630n4214k58334j86284J20287N1250l8899n5120n7967m7432
$$ y = [145071, -58106, -315673, -215829, 6112, -22456, 49780, -24586, 48190, 271697, 433490, 403774, -175655, -211131, 89278, 251215, 326594, 237609, 232131, 152269, 102291, 231942, 411274, 427299, 167831, 209751, 356630, 467365, 382889, 367062, 240698, 199233, 332829, 153708, 122733, 84521, 169874, 140157, 13305, -7023, 419558, 404127, 373900, 368037, 224492, 378106, 268851, -3443, -13215, 84190, 153390, -77943, -368233, -260128, -193737, 18539, -88622, -57305, 153581, 123613, -129473, -201859, -141851, -30346, -23646, 136218, 158507, -26425, -178651, -341159, -335265, -283685, -246392, -156844, -43206, 299016, 414646, 360432, 102098, -84186, 36101, 87351, 48452, -6668, -64635, -112067]
16254a12067J22049K04673P8004n9111j28460j08752p3946j55320o1070p0344
16244c64344J56063J72673L7472j66100R0892J74352j16240p1091K03843K7205
16234A44725n8976J4759Q9526j31951k92121n9372j00663K70512J91266k74188
16224b06483r1453J02479P1186N3203k07j05615K22667L2491p2851K5469p6933
16213d6047o5162J10210M31477l4680j55461l32056j47508L68004J41385J11332
16203C81494j41719J5374J00305m1432o5570p5459q4323J20970P5637l65899n3996
16192a34618J00466m32657k83474L52817L07599J46712Q3239K3569j7596j00309
16182D5748o1859K94817m1119j52794q6110L503J7975p7953J50093J43475j8264
$$ y = [-112067, 9982, 214655, 292659, 233548, 105088, -3664, -77610, -232930, -294000, -364344, -208281, -35608, 1864, -164236, -73344, 101008, -15232, -86323, 117520, 144725, 85749, 100508, 190034, 58083, -234038, -293410, -394073, -123561, 67705, -206483, -297936, -195457, -124271, -71068, -71275, -176890, 45777, 78268, 5417, 30886, -46047, -111209, -999, 430478, 395798, 240337, -91719, -239227, 128777, 270162, 381494, 239775, 255149, 355454, 314022, 248452, 172993, 88670, 209640, 285277, -80622, -134618, -34152, -466809, -750283, -397466, -89867, 56845, 140084, 163653, 146057, 45748, -16111, 278706, 237587, 84793, -1317, 2186, 20161, -57792, 92301, 235776, 217512]
16171B17512o772q9477j61725o4037p3578n3394J77144m6369J62551J03578j12650
16160E2783J26915P1176l01149j71379J36068o7805j21957J37827Q2426j68361
16150b23456K4358J24120K1755o1452r831R2071k2347K15746K69964O2711k08233
16139B85406k61865k2161j1759q5775O1207R5096K0693P980j90802J89489J69712
16128B57221o9816M195L6474P1235N2587p3901k57244J33720m111k39240K6298
16117f2582K53870J4705k09408k75865R4989o2404l8784J53922N4403j06212j19495
16106c02861J45482J89764R9176J52841L8792R8800q454j66775j11029l0737Q1494
16095A86493k1003K8711j6496O0964k54129k8643M9789L35l9208J3779L2412P7596
$$ y = [217512, 210740, 121263, -40462, -104499, -178077, -231471, -54327, -100696, 61855, 165433, 52783, 179698, 250874, -50275, -221654, -85586, -153391, -275348, -137521, -55095, -223456, -199098, -74978, -53223, -114675, -124506, -32435, -54782, 160964, 430928, 493639, 285406, 23541, 1380, -10379, -96154, -34947, 60149, 80842, 88822, -101980, 87509, 257221, 187405, 191600, 228074, 299309, 351896, 277995, 20751, 154471, 150360, -88880, -62582, 191288, 205993, -3415, -279280, -184291, -246695, -285479, -131557, -77154, -183366, -302861, -157379, 32385, 131561, 284402, 323194, 421994, 413540, 246765, 135736, 104999, 186493, 165490, 194201, 177705, 238669, -15460, -44103, 5686, 6021, -33187, -19408, 13004, 90600]
16083I0600J65709P3990j26644j22415J00794Q7385K45771j43866l82109k8681
16073c9466J28790K0737l2210K6461m4806r0053J28262R3134N170P6507J49554
16062D22080j21887r0530K4475n7786L3942P6547K3611k44899j47384L11928L4661
16051B64758J0762L2065j04833n8663k78205L9610R826r0157m8885J02187K19815
16040I8280O4878l1875J45278K9638R4592L8081l8924r9372L6660p5615j20314
16029A41307r3029r9059Q3100R9497n3748n8460L3962l7931n373M4040J20086
16018A74392r0777P9474R6838J31546j0595m8129j45157j10473j085J36085Q5712
16007B97831j85974Q8295P3134o021m1303j33557J8869j47316j46693n5148L9293
$$ y = [90600, 256309, 330299, 203655, 81240, 182034, 269419, 515190, 371324, -10785, -39466, 89324, 110061, 77851, 104312, 59506, -30547, 97715, 190849, 196019, 272526, 422080, 300193, 209663, 234138, 176352, 210294, 286841, 310452, 65553, -81831, 230097, 264758, 275520, 307585, 202752, 144089, -134116, -94506, -84680, -174837, -223722, -121535, 98280, 163158, 131283, 276561, 306199, 400791, 438872, 399948, 300576, 337236, 261621, 141307, 48278, -50781, 32319, 131816, 78068, 19608, 53570, 15639, 10266, 54306, 174392, 83615, 163089, 259927, 391473, 380878, 332749, 187592, 77119, 76034, 212119, 297831, 111857, 200152, 273286, 267265, 225962, 92405, 111274, -36042, -182735, -237883, -198590]
15996a98590K23049K31567p6204j92119J47843J18583L1142J80758J1613l07225
15986A70417q9818M51j72581J85231K45607P8002P2466J7427j47913k40154O6487
15975A85622Q143J8967n3718k03598j80919J8558J03703p7806J25485J21416Q9913
15964A55766J11000r5584p2727o9822M8723o7497R4323L6557j05376k97479q1269
15953c43385J16101J25275R0847P6521J42007n898j14197j87440m1868j29680
15943b71717j71501J55325J16587L9630l90m3623J5070K39866j8152j00289J37318
15932I8124O4502O942P5434R1339j39379k34099M3116j1307J50414L1861O8888
15921B45835j31014o3099J70267j73057J16380L18661j02725o2048r8743j27041
$$ y = [-198590, 24459, 256026, 179822, -12297, 135546, 254129, 285271, 466029, 477642, 170417, 80599, 81050, -91531, 93700, 339307, 417309, 489775, 507202, 359289, 119135, 185622, 193765, 212732, 159014, -44584, -225503, -206945, -103242, -181048, -55563, 65853, 155766, 266766, 171182, 98455, 28633, 77356, 9859, 104182, 140739, 35363, -262116, -343385, -227284, -102009, -11162, 65359, 207366, 201468, 87271, -100169, -142037, -271717, -443218, -287893, -171306, -131676, -132066, -175689, -160619, 79247, 61095, -39194, 98124, 162626, 169568, 245002, 336341, 196962, -37137, 5979, -5328, 145086, 176947, 245835, 114821, 51722, 221989, 48932, 165312, 483973, 381248, 319200, 220457, 93416]
15911I3416Q2277n8031j17625j40532K2681K74342N3359o8449l5374n974K6549
15900A26639r1396l2711L6153J74602j42178p5605K77175P3485o2284Q0187R3327
15889D57394J66150L5988j23625j67821K4105j23998j95399j9035N0922N3754
15879A58435r2802L1168K03840J00650p2542O5238k4014Q9676k83394l3152r7530
15868D5573k665R1958J42738o2680K6210n5981j91654m9742j78000K73463J3254
15857E2474J03905J41515N2364j72778j04859J60616L5879k7362q2861o2901K18069
15846C14061J23823N1679j15156K541j14753j17774n6895j95152p4628J00699
15836h1555m085P393K01668m4798J7660j93378k40461R6464J93244J57875J13401
$$ y = [93416, 175693, 117662, 37, -140495, -117814, 156528, 209887, 141438, 106064, 100090, 126639, 35243, 2532, 38685, 213287, 71109, -4496, 272679, 346164, 283880, 364067, 457394, 623544, 659532, 535907, 368086, 392191, 268193, 72794, 53759, 104681, 158435, 65633, 96801, 300641, 401291, 328749, 393987, 369973, 459649, 176255, 143103, 45573, 42908, 134866, 277604, 214924, 241134, 185153, -6501, -56243, -234243, 39220, 52474, 156379, 297894, 350258, 177480, 72621, 233237, 269116, 241754, 158893, 95992, 314061, 437884, 489563, 374407, 376948, 262195, 144421, 87526, -107626, -182254, -81555, -85640, -78247, 123421, 78623, 96283, -97095, -337556, -241092, -47848, 110027, 223428]
15825B23428k63653J0841J96035J35658K81505J06689k21175k58558m3412o5630
15815A01728K34527L123k4079r1415j9838J38848q4286k24079j8018J24045L6607
15804A77163P9222J92156J69441J54436n6872r5005n0873l79564q6769p581J5564
15793A11318l9207r6882R9311J04712p5354j15920M525r3222k7007J55156K05074
15782B32504R1719k8102q3207r6375l9327n810m1167K58561J97058p9413j42906
15771B63535K1992Lj28350j89988L5519R8096j30036q0333p0199j26939J07774
15760a98926Q1426L1427P3966K92616J76000p6286j79335k00695r7157o0847M2978
15749a14833p0950l8150J9515K30467L39708K36187j16718o5617L693j9939J1423
$$ y = [223428, -40225, -29384, 166651, 302309, 583814, 690503, 469328, 210770, 167358, 101728, 336255, 339378, 315299, 223884, 204046, 342894, 258608, 34529, 16511, 140556, 177163, 256385, 448541, 617982, 772418, 715546, 620541, 569668, 190104, 103335, 95754, 111318, 72111, -24771, 74540, 179252, 103898, -12022, -7497, -100719, -127726, 27430, 232504, 324223, 296121, 212914, 116539, 77212, 71402, 30235, 288796, 485854, 406441, 263535, 285527, 285530, 157180, -32808, 2711, 100807, -29229, -109562, -179761, -306700, -198926, -117500, -86073, -12107, 280509, 456509, 380223, 200888, 193, -96964, -157811, -114833, -185783, -223933, -204418, 26049, 365757, 601944, 485226, 419609, 423302, 403363, 414786]
15738D14786q1693k31092j69360K10170J00855J36963P311j00317j21229Q653
15728A75047J18720M4872o1798j69723j02923K14630K29291p9236j39597j37902
15718I1381j91655K49331j6520j27115j9047j2814O4127L73809P3635j03560N7502
15707D39074j35030l09155o4068j9408J08682n6655k9571J59035O519P088l9585
15696F6926Q5626p2998j5170J04223r8056L4608J14874n6337k29395j79998J81844
15685f3853J73406J25078j61478j23275M195j4898n6867n3960l3188k6488O6743
15674a64585p842R7232J89543p717n5217K09345R8989o1647J56458J26929P1036
15663F52524k54946l10545k31417J30851J00008j71968m5775L0893Q1662K60451
$$ y = [414786, 333093, 102001, -67359, 142811, 243666, 380629, 387940, 287623, 166394, 175047, 293767, 338639, 276841, 107118, 4195, 218825, 448116, 368880, 229283, 91381, -100274, 149057, 132537, 5422, -13625, -26439, 37688, 411497, 485132, 381572, 439074, 304044, -5111, -69179, -88587, 20095, -36560, -66131, 92904, 99423, 106511, 66926, 152552, 79554, 64384, 168607, 70551, 105159, 220033, 163696, -65699, -245697, -63853, 109553, 234631, 73153, -50122, -45927, -60825, -117692, -171652, -204840, -231328, -164585, -172427, -75195, 114348, 106631, 51414, 260759, 359748, 298101, 454559, 581488, 652524, 397578, 87033, -144384, -13533, 86475, -85493, -131268, -100375, -18713, 241738]
15653B41738j4932m1184K50193j00538k88650k92685n9397K99708J11664j62102
15643e6185q7819M5069O043R7972J46171k7066J3715j28953j36138Q9856j9750
15632e7085m9891J63911J03712K4335K6092M8716m8719K1051K40552j81006k14455
15621G7213r7258k048J63241n5085k51947j8112L548J55080K80575O0810j39479
15610A76538P71K04480j5736k40136m84649j81133J31222K94073J34376K7896
15600D7702j33292J78K9835J39607R0275J07047M9336M0935k05047n4722j7980
15589I3874J5311J04642q2327p6898M35J78306J13922l2866k04109j9060J52016
15578B43246M5107J45772K2110k52073k84166k51802J98956Q7434P2855l7313
$$ y = [241738, 226806, 185622, 435815, 335277, 46627, -246058, -305455, -5747, 105917, -56185, -144004, -98935, -92892, 5080, 151251, 124185, 137900, 8947, -127191, -37335, -57085, -106976, 56935, 160647, 184982, 211074, 259790, 211071, 232122, 472674, 291668, 77213, -20045, -22093, 141148, 86063, -165884, -183996, -180448, -25368, 255207, 316017, 176538, 177309, 381789, 366053, 125917, -358732, -539865, -408643, -114570, 19806, 47702, -85590, -85412, -55577, 84030, 174305, 281352, 330688, 371623, 166576, 111854, 93874, 109185, 213827, 131500, 54602, 55037, 233343, 347265, 314399, 110290, 91230, 243246, 288353, 434125, 456235, 204162, -80004, -331806, -132850, -45416, 27439, -9874]
15568i874j92809k14793O8072L21922K98961M7181m2364P0115j70295l01543o8392
15557a93819R6199p7306k67516J58483J50335J84658N0943r2548K03Q0743K15818
15546C06193J76726J43128L239q5788k43843j46208R3248K37267P7291J94351
15536G55604O2132P0234J03583K63628Q0362J54797P7719n1206k17543l17998
15526I81312r7905Q3537k21759j56676k58666l42823J12629P7558O9558J38500
15516C85265j34804J34296K64387j25269k51576P5123K7609K0757j60408P505
15506B42885k2710j816L114p3878r7664M1639K09279l4179K3398J08305k29439
15495A68934j39180K27647J55367K4718P091J08n9533L3564l07398p3431J89796
$$ y = [-9874, -202683, -417476, -349404, -27482, 271479, 318660, 276296, 346411, 176116, -125427, -193819, -97620, -174926, -442442, -283959, -133624, 51034, 101977, 9429, 9632, 90375, 306193, 482919, 626047, 629286, 543498, 299655, 153447, 246695, 483962, 561253, 755604, 817736, 887970, 991553, 1255181, 1335543, 1490340, 1568059, 1516853, 1299310, 981312, 883407, 966944, 745185, 588509, 329843, -12980, 99649, 177207, 246765, 385265, 250461, 384757, 649144, 523875, 272299, 347422, 375031, 395788, 235380, 242885, 220175, 218359, 221473, 147595, 49931, 91570, 300849, 266670, 290068, 398373, 168934, 29754, 257401, 412768, 437486, 444577, 444685, 385152, 418716, 111318, 37887, 227683]
15484B27683J1759j23619j13096K96761Q7129l8869r6933N7742K4737j06707J8826
15473B45413P6006k3665p9477r4851p4730K19192n4933N5400J42938q2229k25240
15462A03824j59728M7927J00015R6051M8121K10036K17071k97132l29037k481
15452C4667l5785J6100o9067m9984j30266P4417O7195k844K41689o0897q5479
15441b54l803J28627K11450M5483J06086R5338K47299k06498j35945k24772j97502
15430F5509j08125L6734J07898l0049k20814L4487J35645r085j1098Q1136K73246
15419C55484j50427q3800m5619k38931K30018M285R4527K5668L7016r8112j07018
15408B3091n5450p0571n2199J27323j0357k13343r6863J50851K46932J71666p2217
$$ y = [227683, 239442, 115823, 2727, 299488, 386617, 347748, 250815, 308557, 333294, 226587, 245413, 321419, 297754, 218277, 123426, 48696, 267888, 212955, 268355, 411293, 329064, 103824, -55904, -7977, 92038, 188089, 236210, 446246, 663317, 366185, 37148, 34667, -1118, 14982, -54085, -104069, -234335, -159918, -92723, -95567, 146122, 85225, -254, -4057, 124570, 336020, 381503, 487589, 582927, 830226, 623728, 487783, 263011, 65509, -42616, -5882, 102016, 71967, -148847, -114360, 21285, 12200, 1102, 82238, 355484, 205057, 121257, 75638, -163293, 66725, 71010, 165537, 191205, 228221, 130109, 23091, -32359, -102930, -155129, -27806, -38163, -251506, -348369, -197518, 49414, 221080, 148863]
15397A48863j43607n8131j02276M4151J9834J69095L0618j0925j55853M0681J57403
15386A39853K68650L5397M1941j36538J27946k4685k02181k70096j4107L68156
15376C34336k8156K5985L9269m4434m5996j72759Q6567J50490k5907J73136J09539
15365F02070k39485k9136J7689j78773j93361j22570O8487P2556K26800K92364
15355E16641O5560Q4470l16233k00332j13067L8479J88366N7200J00964k49231
15345A72817j38549R7054q154R5006K65430M1980k31333j89154M1247K49802J05098
15334E01244p3358q7872n7544q5424K56180q9344n0244q4647k6575j5764M240
15323A90892r516l8619k7579Q2970K66686Q0185J2063n7336j18225P547l7070
$$ y = [148863, 5256, -52875, -155151, -111000, -91166, 77929, 108547, 97622, -58231, -17550, 139853, 408503, 443900, 485841, 349303, 477249, 452564, 250383, -19713, -33820, 334336, 306180, 332165, 371434, 327000, 281004, 108245, 194812, 345302, 319395, 492531, 602070, 362585, 333449, 351138, 172365, -20996, -143566, -75079, -2523, 224277, 516641, 582201, 666671, 350438, 150106, 37039, 75518, 263884, 321084, 422048, 172817, 34268, 131322, 123168, 218174, 483604, 525584, 294251, 105097, 146344, 396146, 501244, 427886, 340014, 282470, 197046, 453226, 363882, 313638, 228991, 202416, 186652, 190892, 181376, 142757, 115178, 198148, 464834, 545019, 557082, 499746, 381521, 389068, 351998]
15312C51998l3612p9454J86759K38746j74462k31319k96947P5776J23265j25948
15302C4802J44883L30272L0068j36107R3728j130m8859j06020k22052j29190J30204
15291A20599Q192O3982L2156J45904J00476k39911j21650r7833R8914J4037m2251
15280H2615j65016p6554J34985J30654p4121J06832j32052r3926J27902J72697
15270B14016J97404j07727k65577j35457q8420O6006N7402P2137o4882R3205M4536
15259H2643P6629J62371K9866M0729l7728o5858r2026P533l5087j32921k3407
15248A2744J6326k1692J76713K82484Q763j59025K8465J59908J30155N7193j98670
15237D93364l58459N6428R9639j3667n9240L19672K7832l22997l99194K75988
$$ y = [351998, 318386, 238932, 425691, 664437, 489975, 258656, -38291, 37485, 160750, 34802, 179685, 509957, 540025, 403918, 497646, 496516, 447657, 341637, 119585, -9605, 120599, 128791, 192773, 224929, 370833, 471309, 231398, 109748, 11915, 110829, 124866, 82615, -82401, -158955, -23970, 106684, 32563, 139395, 7343, -86583, 41319, 214016, 411420, 303693, 38116, -97341, -185761, -119755, -62353, 9784, -55098, 38107, 82643, 159272, 321643, 351509, 392238, 354510, 288652, 196626, 204159, 169072, 36151, 12744, 29070, 7378, 184091, 466575, 475338, 316313, 344778, 504686, 634841, 692034, 493364, 134905, 191333, 290972, 277305, 218065, 537737, 565569, 242572, -156622, 119366]
15227A19366J89588R5330q8803q0819j26095j07466j18614P0166K90350K58033
15217E01036r7992k08868j54305r4121K07773K19947j24028k25813o9173P0233
15207B4689K97816L35854j18409m4994P3559k56249j65331l4358J04666J13730
15197C30973j28939p9790n790J67064K47931R1612j61998j60829n72J97645j60731
15186C36576N5683L14422m658j05064K1428k50347j69868M8395j94673j19133
15176f7239N9032Q4649J24899L0538k0280K1087j627Q9935N880k12878j48012
15165c4016K0673L84194N5570k85090j56143L18238J02387k00756J05366J79517
15155D89940j38592l868r1598j33226J88157K94536j93538o7766p2142P7052M3061
$$ y = [119366, 308954, 404284, 315481, 234662, 108567, 1101, -117513, -47347, 243003, 501036, 403044, 194176, 39871, -54250, 153523, 373470, 249442, 23629, -45544, 24689, 322505, 658359, 539950, 494956, 568515, 312266, 146935, 112577, 217243, 330973, 202034, 122244, 116454, 283518, 531449, 623061, 461063, 300234, 299662, 497307, 336576, 392259, 706681, 702023, 596959, 618387, 368040, 198172, 246567, 51894, -67239, -8207, 76442, 201341, 231879, 211599, 232686, 231059, 320994, 326874, 113996, -34016, -13343, 370851, 426421, 141331, -14812, 303426, 405813, 205057, 310423, 489940, 351348, 347480, 255882, 122656, 310813, 605349, 411811, 344045, 271903, 348955, 392016]
15144C92016K61365J30433n2914k16930r8347p9725N174J73063P3973k05298j00590
15133B82220r6636j08485j97139q8537n5062J35593L46797R6511o1920j03413
15123A49929j7636K51872J3811j96455j6941n824J40064m169l32395j95216L07616
15112I4656L18706p8494j65207l5936Q9075n4406j22738m8963L6922L20432P4445
15101D28492q3477j2786k79555j14890K07438p9429l6088K1990p1430J17788J22961
15090B21014Q1352l0831j38224j89854l903J04176Q9373J70842M2926j20976N5408
15079B81303p0202M2909J83871R8813n4357j47081j50866J56018K58333r8400
15069E00341m3404j01693j74643P5520J32437Q6022N6856K86349J69013j61602
$$ y = [392016, 653381, 783814, 730900, 513970, 415623, 335898, 341072, 514135, 588108, 382810, 282220, 185584, 77099, -120040, -208577, -263639, -128046, 218751, 315262, 253342, 149929, 132293, 384165, 397976, 201521, 184580, 178756, 318820, 314651, -17744, -212960, 94656, 413362, 334868, 169661, 133725, 222800, 168394, 45656, -3307, 33615, 354047, 428492, 345015, 332229, 52674, -62216, 145222, 65793, 29705, 51695, -19735, 98053, 221014, 302366, 271535, 133311, -56543, -60446, 43730, 133103, 303945, 346871, 225895, 281303, 211101, 254010, 437881, 536694, 482337, 335256, 184390, 340408, 598741, 500341, 456937, 355244, 180601, 256121, 388558, 474580, 531436, 817785, 986798, 825196]
15059H25196l72395j38198K17987J21913p1719j13762k22878j55431K13867Q0975
15049C85555j48063L0696j8405o0352j48188M3016J18789J30922p939n406M1410
15038C62035J67024j30576N4259R133M752O0012m9112k04411j25784j7377j38816
15027h861N3392J59785o7926j02329Q7323J98318J07336k1232m9588L7316p7969
15016C15565j52556k23263k7738O9813J6400J69500o7037q7823n6437k795J99979
15005A53608M5236Q6147O874Q634o1007l4730J51131J23497J79596j71326j68136
14994C19524m1165k3045N0549K93094L32157k78158j96909K8392q1121k7470N4888
14983D30736j89808j07858J16707L2475J0417l9930J34645j9904j16886o4052
$$ y = [825196, 452801, 314603, 532590, 654503, 582784, 469022, 246144, 90713, 304580, 385555, 237492, 268188, 249783, 189431, 41243, 84259, 203048, 333970, 326031, 320625, 362035, 529059, 398483, 452742, 461875, 466627, 526639, 477527, 273116, 147332, 129955, -8861, 44531, 204316, 136390, 34061, 121384, 319702, 427038, 405806, 356218, 393534, 315565, 163009, -60254, -87992, -18179, -1779, 167721, 100684, 12861, -43576, -46371, 153608, 198844, 284991, 291865, 300499, 239492, 204762, 355893, 479390, 658986, 487660, 319524, 278359, 255314, 305863, 598957, 931114, 652956, 456047, 484439, 403318, 375848, 430736, 240928, 133070, 249777, 282252, 292669, 252739, 387384, 367480, 250594, 186542]
14973A86542k0136j36993l6865J54772R4649r841P3643p6934p2225j12881q8244
14962d4513K61669K30076j57141k8474l1007J46218j37932j65559O3023K2185
14952A58545J31110j9293J9506m8069j86683J06031J18191R7912J37790r0121
14942D24919P3538k39127l5986J08862o0498j51909K61867K03223J12699j20608
14932E76980K1489m3158j65149J8942J86106o3525k4849j45923J5610l49996k41867
14921b15340L38153K5470j43069Q1789Q6952Q2502L2438J11426M1071q0059o3345
14910B97988r2064k7258j73340j19513K79290J26296j36337J1355K4460K9461
14900B20338j39300k42763j9367J74704J68336j77329K14658K94258j52775p615
$$ y = [186542, 166406, 29413, -7452, 147320, 241969, 232128, 305771, 228837, 156612, 43731, -44513, 217156, 447232, 290091, 261617, 230610, 376828, 238896, 73337, 136360, 158545, 289655, 270362, 289868, 241799, 55116, 161147, 279338, 377250, 515040, 424919, 498457, 259330, 223344, 332206, 271708, 119799, 381666, 584889, 697588, 576980, 598469, 555311, 390162, 409104, 595210, 531685, 506836, 360913, 376523, 26527, -215340, 122813, 148283, 5214, 87003, 173955, 256457, 288895, 400321, 441392, 361333, 297988, 205924, 178666, 5326, -114187, 165103, 291399, 155062, 166417, 190877, 220338, 81038, -161725, -181092, -6388, 161948, -15381, 199277, 493535, 340760, 333145]
14890C33145J35330K513J55791J3009J04508K2925r7122n4900j53240q3321O9170
14879D47808k25973N8294j0131k1024Q7568P8250J55903N1826l01390k94129J43416
14868A70418p6246L2122L39981J04518k50667j8270J15994J2601j77387n5303
14858A97761j44921k9230k5632j14483K26898K52716J55613j06852k87379J00656
14848B25147j36428k37089Q4237K13480O4251j0557K0165J43020j24486J0884
14838B52624J07162j44215k31522R6368M21783R8912j82276L07596J21835k16150
14828F32117n7236l910J03242K2528j27331O9979j39957J63673J8266j78696Q4232
14817E86907j9526m5448j55245K5076N7497M5571J0569j08319j11775j87519J78461
$$ y = [333145, 468475, 470988, 626779, 639788, 744296, 767221, 670099, 615199, 461959, 378638, 447808, 221835, 280129, 269998, 248974, 336542, 414792, 570695, 622521, 321131, 27002, 170418, 94172, 126294, 466275, 570793, 320126, 301856, 417850, 430451, 253064, 197761, 52840, 23610, -2022, -116505, 110393, 363109, 518722, 411870, 124491, 225147, 88719, -148370, -64133, 149347, 213598, 203041, 223206, 366226, 241740, 252624, 359786, 215571, -15951, 80417, 502200, 601112, 418836, 726432, 848267, 632117, 574881, 570971, 674213, 696741, 569410, 639389, 499432, 663105, 681371, 502675, 586907, 567381, 521933, 366688, 391764, 449261, 494832, 505401, 397082, 285307, 97788, 276249]
14806B76249K22749R6495L1961j79442r4253J5086J17770j04183j33789J22640
14796C71283K715n940P3295J51766K17334p6742k6153J38308J93905j17488j38731
14785G83552N774J27739J26272j47083k94436r6005N6106K0308J64901r4487r7626
14774E55015p1422J30384J1273j75924o3739P8733K46561J74617j40943L1450
14764G76005j65365l6665O2085M3062j60463j17027J14769o162k37052l8078r7041
14753A38068j19637J22314K9461L5131M3242j06364Q857K04217Q319M6927m7450
14742C63085j01653k62555J89175K81710p7413P3694j44199M3675K17100J27119
14732G09738l0697M9812N437j68172k00925P7014m8424J5984L52452J44450l1073
$$ y = [276249, 498998, 595493, 627454, 448012, 353759, 368845, 486615, 382432, 248643, 371283, 373998, 368058, 441353, 593119, 810453, 733711, 707558, 845866, 1039771, 922283, 783552, 789326, 917065, 1043337, 896254, 601818, 505813, 561919, 582227, 747128, 652641, 555015, 483593, 613977, 625250, 449326, 385587, 464320, 710881, 885498, 744555, 776005, 610640, 573975, 636060, 679122, 518659, 401632, 516401, 510239, 273187, 235109, 138068, 18431, 140745, 170206, 205337, 248579, 142215, 151072, 355289, 363608, 410535, 363085, 261432, -1123, 188052, 469762, 392349, 466043, 321844, 365519, 582619, 709738, 679041, 728853, 734290, 566118, 365193, 442207, 393783, 409767, 762219, 906669, 875596]
14721H75596J91940N594o2575j2444j03793k70585j29182j27845J28155p6974
14711D17887P7649N7817n7898j0663L6138M1809j02545j99089J5128J63390J41422
14700E81045j00289j60461O8316R9756k3085r9795l52308q7625P5906K40197O7600
14689C09257p9158p4903j03070q0547J51786J13246k2289n2742Q9380M40513J10793
14678H02266j28909L643k06067j21645n7013p7831K40353Q7822l16935O484K90159
14667E22327R9717O6830J97863k57540o1549m2974M1003r7691L0328J38j70060
14656C28392J32928j00846J27423K03052N1382j85634m5282j87746j90229L81488
14646E14928m6394o7307n1868J1520K9378j38728K34262K03634j97453l22677
$$ y = [875596, 1067536, 1073130, 1010555, 998111, 894318, 623733, 494551, 366706, 494861, 417887, 495536, 553353, 495455, 484792, 520930, 562739, 460194, 261105, 276233, 439623, 581045, 480756, 320295, 388611, 488367, 465282, 365487, 13179, -74446, 1460, 241657, 309257, 230099, 155196, 52126, -28421, 123365, 236611, 214322, 161580, 250960, 691473, 802266, 673357, 677000, 470933, 349288, 292275, 214444, 454797, 542619, 225684, 232168, 522327, 622044, 688874, 886737, 629197, 567648, 524674, 565677, 467986, 498314, 498452, 328392, 461320, 360474, 487897, 690949, 742331, 556697, 511415, 323669, 133440, 514928, 468534, 401227, 349359, 360879, 390257, 251529, 485791, 689425, 491972, 169295]
14636A69295K3473J68089j14944J7402J27449k15379l2005k45445r6904K47913
14626D8944L89030K09354k9746k12056k09640L9727K94517J60339r4510m4702
14616E51257R5501k02174J37310p5391J4844j75388j1455M4609j92931N7636L7749
14605B81567N0866K0631j63297k123Q3717J92175O6978j24798J4915j06125M2742
14594C57248Q5823j8696l4042j00907L6377J2598J03536L9413k47005O1009Q5048
14583C80402n3103R4586j40091k26336J61305K70356K85852J4593k10276J9585
14573E96873J50589j91466l48422N1511L59573l0651j75582j21021o396j13895
14563A71113L2195J75485K41834K5767k869l2047l4824r6059p2220J55736Q0479
$$ y = [169295, 192768, 360857, 245913, 263315, 390764, 175385, 143380, -102065, -198969, 48944, 437974, 647328, 617582, 405526, 195886, 235613, 530130, 690469, 595959, 551257, 646758, 444584, 581894, 506503, 521347, 345959, 334504, 379113, 186182, 243818, 281567, 332433, 353064, 189767, 187644, 271361, 463536, 530514, 405716, 420631, 314506, 357248, 443071, 424375, 390333, 289426, 325803, 338401, 441937, 481350, 234345, 295354, 380402, 327299, 421885, 281794, 55458, 216763, 487119, 772971, 787564, 577288, 596873, 747462, 555996, 207574, 259085, 618658, 588007, 412425, 291404, 285008, 171113, 203308, 378793, 620627, 646394, 643525, 611478, 576654, 480595, 408375, 564111, 644590]
14552F44590K09085o8317O741l06451k80452Q8514o1908k53628k23328O3319K36953
14541E5118K98267J2821k3201j58625k2280J07447J17366M117j399o7268P6432
14530C98795J96882l5573l44816J44376m6055k04720j74560J52827j197o148O6727
14519A46538j38811K13329r766j0904K48645J06237j37627L9454K5315k0895o7382
14508C94133J07010j02670J47299J9816r3603j07777j2472N2243k51665q8737
14498F3577K18048L58013j9718j23779j8379k31N184k9858l8962J35558J74428
14487G23881m9780J77268K0667j02756j53304J03557L73062k55256m02836k72858
14477A61645j56759K26127K08392k73275k45254J24454M021O5291K91242m6875
$$ y = [644590, 853675, 785358, 792099, 485648, 205196, 293710, 231802, -21826, -245154, -181835, 55118, 353385, 366206, 343005, 184380, 162100, 269547, 386913, 391030, 389631, 322363, 398795, 595677, 560104, 215288, 359664, 313609, 108889, -65671, 87156, 85959, 79811, 146538, 7727, 221056, 211290, 200386, 449031, 555268, 417641, 457095, 482410, 461515, 394133, 501143, 398473, 545772, 565588, 471985, 364208, 351736, 403979, 152314, 63577, 281625, 639638, 619920, 496141, 477762, 477531, 482715, 452857, 413895, 549453, 723881, 674101, 851369, 872036, 769280, 615976, 719533, 1092595, 837339, 434503, 161645, 4886, 231013, 439405, 166130, -79124, 45330, 49351, 114642, 405884, 359009]
14467C59009j62280j95000q5022m5934K68448J7301N9968m9978j7971R0485J82744
14456D21770J94857R1373j49607k9592Q7893R8712p5303N8629Q2946J674K6155
14445H09507j84321K0511K25j74907m8940J90381J9776j17721j17797Q2542K79187
14434G58443O084k40666k21593n158r401j75793R8592j19546J13966J40394o2959
14423B82363j19914J92472M3608O6754J56006P454k1365k28209o1990J22661J53624
14412E93464r16j65254j35351P2548j2727l14614n9244K28083R2330n3719J6907
14401B61507K70052q3100p7541J35149r5448K24670O6435k05961j96312o2802
14391B36649j41633j25105J24779R747J28922O281n3309J12249K43390J12305
$$ y = [359009, 196729, 1729, -83293, -129227, 139221, 156522, 216490, 166512, 148541, 239026, 421770, 616627, 708000, 558393, 528801, 616694, 715406, 640103, 698732, 781678, 783352, 809507, 625186, 645697, 645922, 471015, 422075, 612456, 632232, 514511, 396714, 479256, 758443, 764527, 523861, 302268, 297110, 287709, 111916, 210508, 90962, 204928, 345322, 282363, 162449, 354921, 398529, 465283, 621289, 628743, 607378, 379169, 317179, 439840, 593464, 592548, 427294, 291943, 364491, 351764, 37150, -22094, 205989, 298319, 244600, 261507, 531559, 448459, 370918, 506067, 410619, 635289, 701724, 495763, 299451, 236649, 95016, -30089, 94690, 104437, 233359, 239640, 186331, 298580, 541970, 654275]
14381F54275k2532j23221Q9081J10789j74104L07505J63538m0961k5691k61403
14371F77276N5527K8759k11536r2136j3279q2054l0459J02230M900J6520J959
14360D57707j60756j14744P0097J12680K35338J20660J6653M9402k00246j56802
$$ y = [654275, 631743, 508522, 597603, 708392, 534288, 841793, 1005331, 964370, 938679, 677276, 732803, 761562, 550026, 457890, 444611, 362557, 332098, 434328, 439228, 455748, 457707, 296951, 182207, 252304, 364984, 600322, 720982, 737635, 787037, 586791, 429989]
$$ [...]
##END NTUPLES=NMR SPECTRUM
##END=
