##TITLE=Analysis number 312110
Compound Code cc 05604
Book Reference 446/14
Project Code adrs
Chemist Name roba
##JCAMPDX= 6.0         $$ Bruker NMR JCAMP-DX V2.0
##DATA TYPE= NMR SPECTRUM
##DATA CLASS= NTUPLES
##ORIGIN= Bruker BioSpin GmbH
##OWNER= NMR
$$ XWIN-NMR		Version 3.5
$$ Tue Jul 26 10:24:09 2005 GMT Daylight Time (UT+1h)  MAYBRIDGE\NMR@NMR_250MHZ
##.OBSERVE FREQUENCY= 250.131544655141
##.OBSERVE NUCLEUS= ^1H
##.ACQUISITION MODE= SIMULTANEOUS (DQD)
##.ACQUISITION SCHEME= undefined
##.AVERAGES= 16
##.DIGITISER RES= 18
##SPECTROMETER/DATA SYSTEM= dpx250
##.PULSE SEQUENCE= zg30
##.SOLVENT NAME= CDCl3
##.SHIFT REFERENCE= (INTERNAL, CDCl3, 0, 16.4541)
##AUDIT TRAIL= $$ (NUMBER, WHEN, WHO, WHERE, WHAT)
$$ ##TITLE= Audit trail, XWIN-NMR		Version 3.5
$$ ##JCAMPDX= 5.01
$$ ##ORIGIN= Bruker BioSpin GmbH
$$ ##OWNER= NMR
$$ C:\u/data/dgb/nmr/ADRS/6580/pdata/1/auditp.txt
$$ ##AUDIT TRAIL=  $$ (NUMBER, WHEN, WHO, WHERE, WHAT)
(   1,<2005-07-26 10:23:49.60 +100>,<MAYBRIDGE\NMR>,<NMR_250MHZ>,
      <created by zg, POWCHK disabled, PULCHK disabled
       configuration hash MD5:
       62 19 C7 07 E1 42 D1 B7 37 6C 3D D0 77 39 F9 E6
       data hash MD5: 64K
       C5 28 6B 36 36 B9 90 77 A4 8E 40 33 F7 E1 79 55>)
(   2,<2005-07-26 10:24:00.74 +100>,<MAYBRIDGE\NMR>,<NMR_250MHZ>,
      <Start of raw data processing
       ef LB = 0.3 FT_mod = 6 PKNL = 1 SI = 32K 
       data hash MD5: 32K
       99 E2 A3 7B B9 25 00 2F 84 67 84 AA 1D 82 E8 33>)
(   3,<2005-07-26 10:24:02.66 +100>,<MAYBRIDGE\NMR>,<NMR_250MHZ>,
      <apk 
       data hash MD5: 32K
       4E A7 F8 DA 92 4C D4 80 48 F0 D1 33 10 6E 21 EC>)
(   4,<2005-07-26 10:24:03.35 +100>,<MAYBRIDGE\NMR>,<NMR_250MHZ>,
      <abs ABSG = 5 
       data hash MD5: 32K
       D1 99 0D 5C 82 93 69 67 99 1B F8 E9 83 BD 70 D4>)
$$ ##END=
$$ 
$$ hash MD5
$$ 7F 4B EA 6A 68 81 33 35 92 FF FE 5E F6 98 E4 E6
##$RELAX= 
##$RELAX= 
##$RELAX= 
##$RELAX= 
##$RELAX= 
##$RELAX= 
##$RELAX= 
$$ Bruker specific parameters
$$ --------------------------
##$DU= <C:\u>
##$EXPNO= 6580
##$NAME= <ADRS>
##$PROCNO= 1
##$TYPE= <nmr>
##$USER= <dgb>
##$AMP= (0..31)
100 100 100 100 100 100 100 100 100 100 100 100 100 100 100 100 100 100 
100 100 100 100 100 100 100 100 100 100 100 100 100 100 
##$AQSEQ= 0
##$AQ_mod= 3
##$AUNM= <au_zg>
##$AUTOPOS= <14 >
##$BF1= 250.13
##$BF2= 250.13
##$BF3= 250.13
##$BF4= 250.13
##$BF5= 500.13
##$BF6= 500.13
##$BF7= 500.13
##$BF8= 500.13
##$BYTORDA= 1
##$CFDGTYP= 0
##$CFRGTYP= 5
##$CHEMSTR= <none>
##$CNST= (0..31)
1 1 145 1 1 1 1 1 1 1 1 1 1 1 1 1 1 1 1 1 1 1 1 1 1 1 1 1 1 1 1 1 
##$CPDPRG= <>
##$CPDPRG1= <>
##$CPDPRG2= <>
##$CPDPRG3= <>
##$CPDPRG4= <mlev>
##$CPDPRG5= <mlev>
##$CPDPRG6= <mlev>
##$CPDPRG7= <mlev>
##$CPDPRG8= <mlev>
##$CPDPRGB= <>
##$CPDPRGT= <>
##$D= (0..31)
0 1 0 0 0 0 0 0 0 0.06 0 0 0 0 0 0 0.0002 0 0 0 0 0 0 0 0 0 0 0 0 0 0 
0 
##$DATE= 1122369828
##$DBL= (0..7)
120 120 120 120 120 120 120 120 
##$DBP= (0..7)
150 150 150 150 150 150 150 150 
##$DBP07= 0
##$DBPNAM0= <>
##$DBPNAM1= <>
$$ [...]
##$SUBNAM7= <"">
##$SUBNAM8= <"">
##$SUBNAM9= <"">
##$SW= 20.6930455092707
##$SWIBOX= (0..15)
0 0 3 0 0 0 0 0 0 0 0 0 0 0 0 0 
##$SW_h= 5175.983436853
##$TD= 65536
##$TD0= 1
##$TE= 296.16
##$TE2= 300
##$TE3= 300
##$TEG= 300
##$TL= (0..7)
0 120 120 120 120 120 120 120 
##$TP= (0..7)
150 150 150 150 150 150 150 150 
##$TP07= 0
##$TPNAME0= <>
##$TPNAME1= <>
##$TPNAME2= <>
##$TPNAME3= <>
##$TPNAME4= <>
##$TPNAME5= <>
##$TPNAME6= <>
##$TPNAME7= <>
##$TPOAL= (0..7)
0.5 0.5 0.5 0.5 0.5 0.5 0.5 0.5 
##$TPOFFS= (0..7)
0 0 0 0 0 0 0 0 
##$TUNHIN= 0
##$TUNHOUT= 0
##$TUNXOUT= 0
##$USERA1= <user>
##$USERA2= <user>
##$USERA3= <user>
##$USERA4= <user>
##$USERA5= <user>
##$V9= 5
##$VALIST= <valist>
##$VCLIST= <CCCCCCCCCCCCCCC>
##$VD= 0
##$VDLIST= <DDDDDDDDDDDDDDD>
##$VPLIST= <PPPPPPPPPPPPPPP>
##$VTLIST= <TTTTTTTTTTTTTTT>
##$WBST= 1024
##$WBSW= 4
##$XGAIN= (0..3)
0 0 0 0 
##$XL= 0
##$YL= 0
##$YMAX_a= 372702
##$YMIN_a= -242357
##$ZGOPTNS= <>
##$ZL1= 120
##$ZL2= 120
##$ZL3= 120
##$ZL4= 120
##$ABSF1= 16.45407
##$ABSF2= -4.239103
##$ABSG= 5
##$ABSL= 3
##$ALPHA= 0
##$AQORDER= 0
##$ASSFAC= 0
##$ASSFACI= 0
##$ASSFACX= 0
##$ASSWID= 0
##$AUNMP= <proc_1d>
##$AZFE= 0.1
##$AZFW= 0.1
##$BCFW= 0
##$BC_mod= 0
##$BYTORDP= 0
##$COROFFS= 0
##$CY= 12.5
##$DATMOD= 1
##$DC= 0
##$DFILT= <>
##$DTYPP= 0
##$F1P= 14.0000005364418
##$F2P= -0.99999901652339
##$FCOR= 0.5
##$FTSIZE= 32768
##$FT_mod= 6
##$GAMMA= 0
##$GB= 0
##$INTBC= 1
##$INTSCL= 1
##$ISEN= 128
##$LB= 0.3
##$LEV0= 0
##$LPBIN= 0
##$MAXI= 10000
##$MC2= 0
##$MEAN= 0
##$ME_mod= 0
##$MI= 0
##$NCOEF= 0
##$NC_proc= -4
##$NLEV= 6
##$NOISF1= 0
##$NOISF2= 0
##$NSP= 0
##$NTH_PI= 0
##$NZP= 0
##$OFFSET= 16.45407
##$PC= 1
##$PHC0= -76.82468
##$PHC1= 11.07636
##$PH_mod= 1
##$PKNL= yes
##$PPARMOD= 0
##$PSCAL= 4
##$PSIGN= 0
##$REVERSE= no
##$SF= 250.130016989833
##$SI= 32768
##$SIGF1= 0
##$SIGF2= 0
##$SINO= 400
##$SIOLD= 32768
##$SREGLST= <1H.CDCl3>
##$SSB= 0
##$STSI= 32768
##$STSR= 0
##$SW_p= 5175.98343685301
##$SYMM= 0
##$S_DEV= 0
##$TDeff= 65536
##$TDoff= 0
##$TI= <Analysis number 999999
Compound Code 99
Book Reference 9
Project Code 9>
##$TILT= no
##$TM1= 0
##$TM2= 0
##$TOPLEV= 0
##$USERP1= <user>
##$USERP2= <user>
##$USERP3= <user>
##$USERP4= <user>
##$USERP5= <user>
##$WDW= 1
##$XDIM= 32768
##$YMAX_p= 520530329
##$YMIN_p= -357446
$$ End of Bruker specific parameters
$$ ---------------------------------
##NTUPLES= NMR SPECTRUM
##VAR_NAME=  FREQUENCY,     SPECTRUM/REAL,   SPECTRUM/IMAG
##SYMBOL=    X,             R,               I
##VAR_TYPE=  INDEPENDENT,   DEPENDENT,       DEPENDENT
##VAR_FORM=  AFFN,          ASDF,            ASDF
##VAR_DIM=   32768,         32768,           32768
##UNITS=     HZ,            ARBITRARY UNITS, ARBITRARY UNITS
##FACTOR=    0.157963299565203, 1,           1
##FIRST=     4115.65659293308, 0,            0
##LAST=      -1060.32684391993, 0,           0
##MIN=       -1060.32684391993, -357446,     0
##MAX=       4115.65659293308, 520530329,    0
$$ Real data points
##PAGE= N=1
##DATA TABLE= (X++(R..R)), XYDATA
$$ [...]
24647C5887l6489l8498j8406j1155j2597K0877m859M8962J4323k8413m2780o6848
24635a39996r4376J1611J32229J03299L9156M2489n019j3854K4772l1375L2591
24624A01527P4748r7764j488O4357m5716j132p4062K274j2817r7685j7594J12443
24612G091O8819n0366J0867L9477j3613j16502Q412M6367K5929L612n0183J2894
24600g196l2320o472J3365p7693M4018m0733o1616O8602q3040o2435J27875O9724
24588d7921j5150n8016m0863N1944r370k1928K9690P8699L3956m3939r574j8912
24576g1384n4198K9869k21j6397j2029M3263O8840Q0548j41820j96252K5117J54908
24564h9756M3735l4242j120k6414n8353q807N0047M3182P5434P296L6815r0965
$$ y = [35887, -602, -39100, -57506, -68661, -81258, -60381, -65240, -16278, -1955, -30368, -73148, -139996, -234372, -222761, -90532, 12767, 51923, 94412, 89393, 75539, 100311, 68936, 101527, 176275, 78511, 77023, 141380, 95664, 94532, 20470, 22744, 9927, -87758, -105352, 7091, 75910, 25544, 36411, 75888, 62275, -54227, -45815, 552, 26481, 30093, -20090, -7196, -39516, -45988, -32623, -110316, -66298, -107031, -168647, -100045, -183085, -245520, -117645, -47921, -63071, -121087, -161950, -110006, -119376, -141304, -111614, -32915, 1041, -42898, -52472, -71384, -125582, -95713, -95934, -112331, -124360, -81097, -12257, 68291, -73529, -269781, -244664, -89756, -46021, -80263, -81383, -107797, -166150, -174957, -124910, -81728, -6294, 1002, 37817, -53148]
24552e3148L3525J06677j1075o1750l5948j5344O7538N4492R6079p1079O9734
24541A79701p5082j23862n4922N5265P931N237M7977P9159O3259Q778k6030j29168
24529C8243n7651O181k5551l500P8721L0769l1472k6959l1323M9953L5194l5244
24517B7361J548o0950k2056O8366k6665j5137k3981K2615K833r164L6384n535
24505d381K4225P5590j8251j0629L0018O5884K9331o3020j27804r6662o5555Q8317
24493g2937J16307J4242j40p0055R341J91140L0197n9974K3594o2953n9417p4728
24481a5383k4769p5771K179j767J3478J6480J01100J70193j3734k9948l1671p8403
24469C1984p6549k9963j6566k6601M4330l4968P39j4766O3975N8795n0455J1857
$$ y = [-53148, -19623, 87054, 75979, 14229, -21719, -37063, 30475, 84967, 181046, 109967, 179701, 104619, -19243, -74165, -18900, -10969, -5732, 42245, 121404, 184663, 193441, 167411, 38243, -19408, -13227, -38778, -42278, 36443, 67212, 35740, 8781, -22542, 27411, 62605, 27361, 28909, -32041, -54097, 14269, -12396, -27533, -51514, -28899, -26066, -35230, 1154, -4381, 19844, 95434, 77183, 66554, 96572, 162456, 191787, 128767, 963, -95699, -161254, -72937, 43370, 57612, 57472, -12583, -3242, 187898, 218095, 158121, 181715, 118762, 59345, -15383, -40152, -115923, -113744, -115511, -102033, -85553, 15547, 185740, 172006, 142058, 110387, 31984, -44565, -74528, -91094, -117695, -73365, -108333, -107594, -122360, -58385, 410, -50045, -38188]
24457c8188N75N2090l6018r1615l8170J23082J0058O0333M3005o7469k3278k2874
24445b8469Q3764n3915L7842L0320Q689k0607q3024o0304p7138k6401P2979J16384
24433A20j063j09067q9966K6636J56550Q3158p6675j7424J05710j1533j02761
24422c6315p1001p2609j5898J19265O6188M4736l3556R735O8355k7353N1752k0855
24410H2444o5167R739m8268j6073j7485m9315O2507L6610k5920N6965j1127k9008
24398a4098K4954N3238n2368m3765J04440J5706o9373L4697Q6219l8541P074L203
24386A11386n6928o3061P064O3750O1534R4590l0454l7092l2420j67180p7075
24375a25886J17073k4006j8266Q9011k2127l6208p768k3505m746m9501O4767O8479
$$ y = [-38188, -37613, 14477, -21541, -113156, -151326, -28244, -18186, 42147, 85152, 17683, -5595, -28469, 55295, 1380, 39222, 69542, 78231, 57624, -25400, -85704, -162842, -189243, -116264, 120, -943, -110010, -199976, -173340, -16790, 66368, -10307, -27731, 77979, 66446, -36315, -107316, -179925, -195823, -76558, -10370, 34366, 810, 10545, 78900, 51547, 103299, 82444, 17277, 27016, -21252, -37325, -54810, -104125, -41618, -5008, -30928, 26037, 14910, -14098, 10856, 64094, 11726, -32039, 72401, 88107, 18734, 53431, 139650, 101109, 108183, 111386, 54458, -8603, -1539, 62211, 123745, 218335, 187881, 150789, 118369, -48811, -125886, -8813, -32819, -51085, 37926, 15799, -20409, -28177, -51682, -56428, -105929, -41162, 27317]
24363B7317L9176j31454q2971M4411N7954M1576J07779j4300J2075K7686k0107
24352A09142o332r9000j06303j252m7316p2124M2385J12630O6267k4403L8924
24341A2618j02366p0034J137K6468L991n1388L2644m1714p8911R7049N7473l0481
24329a43514N3926K6655O590J6892m748M3513n5003q4171k451J8268K1583Q289
24317i4171j3129Q012O5602Q7363r9632L849N0158p612l7844k5770N8448j6478
24305b1204P1285l61o3623J00903K0623j3135O2392o5207K0655L8592n183q2205
24293F3532p0766P63L1740L4039O1739N7270j23124j49055K1086l6644n8936O4308
24281a04048J04610p1296l110k4954M0107K6014L5128R4143j00981m8183j2557
$$ y = [27317, 66493, -64961, -147932, -103521, -45567, -3991, 103788, 89488, 101563, 129249, 109142, 102810, 3810, -102493, -103745, -151061, -223185, -180800, -68170, -1903, -26306, 12618, -89748, -159782, -158645, -132177, -128186, -179574, -146930, -188644, -267555, -170506, -113033, -143514, -89588, -62933, -56343, -39451, -44199, -686, -55689, -139860, -142311, -124043, -102460, -94171, -107300, -99288, -33686, 53677, -45955, -42106, 8052, 440, -37404, -63174, -4726, -21204, 50081, 49720, -13903, 87000, 107623, 94488, 156880, 91673, 112328, 150920, 145737, 63532, -7234, -6471, 25269, 59308, 121047, 178317, 55193, -93862, -72776, -109420, -168356, -104048, 562, -70734, -73844, -98798, -58691, -32677, 2451, 96594, -4387, -52570, -65127]
24270f5127J4412K800M3548K6418j5546k2490r5464m5350L9152K4174l8644m1475
24258a73592Q4026M906l8774j7637R3563M8931j157j2070p4213l8930N4095K6331
24246d4521K2493K3063p003j2444J7246m8431p5051J7577L1295M1730L5076J7219
24234A8249l0323n8569j6656P315n4251L1248L0941P4708L7092m081M9022O1919
24222A46614n2847K0670Q42k3840O5995N5709j08087L6070K6666o9037k0431k3111
24210E5213m1954P506J589J5746M3017p2679m3461J6094k9279N7894Q8409l0450
24198F7645n6711m0733l5516J9684O423O4782j27759j9987O278Q1577O5286l6434
24186e465M9693k1599k0m5784m051j6222J23575N5713j33519R7L6980n0740l1690
$$ y = [-65127, -50715, -47915, -4367, 22051, 6505, -15985, -111449, -156799, -117647, -93473, -132117, -173592, -89566, -84660, -123434, -141071, -47508, 1423, 266, -11804, -86017, -124947, -70852, -44521, -22028, 1035, -5968, -18412, -1166, -49597, -124648, -107071, -75776, -34046, 1030, 18249, -12074, -70643, -87299, -79984, -134235, -102987, -72046, 2662, 39754, 35673, 84695, 146614, 93767, 114437, 115279, 91439, 157434, 213143, 105056, 141126, 167792, 98755, 78324, 55213, 13259, 20765, 22354, 38100, 81117, 8438, -35023, -18929, -48208, 9686, 98095, 67645, 10934, -29799, -65315, -45631, -39208, 25574, -102185, -122172, -115894, -34317, 30969, -5465, 44228, 22629, 22609, -23175, -27226, -43448, 80127, 135840, 2321, 2418, 39398, -11342, -43032]
24173d3032r526o4035L1600N5387O9610Q1853m2798n4900N5452M048J6704L0784
24161A31147k3839r295j33319q0265j6895M4770J6840J1090m7652O0603P87m6035
24149i2063R2842L5207O390J617n1403p360m3427M552N4417J30741p0645J503
24137F2371R6428p0482K940l6438L2280k5349m5032l8791j5420k4553K5606o5193
24125a01633Q0801L2660j5448o1542Q480N2105M5943j5848r393q3577m219n2509
24113a24180j08936P4925J97180P7871j66007p696l8996m2221O0271J42605j3609
24102E1207p6872o4912L0470O1325R0596L2950j29291k8035L6824L0468M1493
24091G6223K7818j02373j95085Q10N3795k5749O2087p872P2805J17911J43216
$$ y = [-43032, -52558, -116593, -84993, -29606, 40004, 121857, 79059, 24159, 79611, 83659, 100363, 131147, 107308, 98013, -35306, -115571, -132466, -87696, -70856, -59766, -107418, -46815, -46028, -92063, 779, 35986, 42376, 43993, -7410, -14770, -58197, -53645, 772, 131513, 60868, 62371, 158799, 88317, 91257, 54819, 87099, 61750, 16718, -22073, -37493, -62046, -36440, -101633, -20832, 11828, -3620, -65162, -56682, -4577, 41366, 25518, 16125, -67452, -71671, -124180, -233116, -158191, 38989, 116860, -49147, -56843, -95839, -138060, -77789, 64816, 51207, -25665, -90577, -60107, 1218, 91814, 124764, -4527, -32562, 4262, 34730, 76223, 104041, 1668, -193417, -192607, -138812, -164561, -102474, -110346, -37541, 80370, 223586]
24080B23586l8114j44169J5135Q575l7559r605K7703J8946L9856Q247P165j06456
24068A3310n8725q1369l2770J9948O5077l2057L560J61134J81331k2532j25690
24057I1217o5056p38k0585M722M8127n018m408L3084o4299j1313n5193o943J4066
24044d2337J3527l4992K675r8580m4183J11102J16593J6911j6423P352N132J0562
24032D7339J8481q3066n8520J3734J2856k8910j3966j8717l8588J00134j6448
24021f5671n9898k2806O3858m8082K4873K4853o689M5130N9488Q4523l9444J3109
24009G3244J7802j53203j69988j5316N8672J20172M0611K0735M0453r0614J0223
23998d7209m0715N976k740n298J30315O7490p8932m9305p1743k8274J273L6606
$$ y = [223586, 185472, 41303, 56438, 65013, 27454, 17849, 45552, 64498, 104354, 112601, 119766, 13310, -45415, -126784, -159554, -139606, -74529, -106586, -103026, 58108, 239439, 216907, 91217, 26161, 25423, 4838, 9560, 57687, 52669, 48261, 81345, 17046, 5733, -49460, -56403, -42337, -28810, -63802, -61127, -159707, -203890, -92788, 23805, 40716, 24293, 31645, 36777, 47339, 65820, -17246, -75766, -62032, -49176, -78086, -92052, -110769, -149357, -49223, -65671, -125569, -148375, -84517, -132599, -107726, -82873, -89562, -44432, 15056, 99579, 60135, 73244, 91046, -62157, -232145, -247461, -188789, -68617, -28006, -7271, 33182, -57432, -47209, -87924, -81948, -84688, -89986, 40329, 107819, 28887, -20418, -92161, -120435, -119162, -82556]
23986h2556N4553J42451L7863r3344q6169j12776j8981J30799L9689Q1952M4818
23975A38299k4976L0507j2120L9075m7425r5904j43706L9186J5353m1058J07978
23964E209J12793k1880J7101J3067m8563l8966L4559K3622R176J6667l3740j62550
23952g3505n0356j6948L5843Q2976J8151k5472K1031q8657q14Q4991o2911L8020
23940c7651O1408m7387L4962K4925o4974j8610j9269R066k7719k0040J77J01074
23928d038M0598m1373O746Q2621J1522j2219j4318n4937n736J23195O9954l800
23916A98215l0812K6232m3776j05652p6046J2624L0769M385K5364L736o8235m2360
23904f5556k9172k5158P2781L4947N1043J2674N8107o995j01610q9387o8470k8014
$$ y = [-82556, -28003, 114448, 152311, 58967, -27202, -139978, -158959, -28160, 11529, 93481, 138299, 113323, 143830, 131710, 170785, 123360, 27456, -116250, -77064, -61711, -102769, 5209, 118002, 96122, 113223, 126290, 77727, 38761, 73320, 96942, 106118, 122785, 89045, -73505, -123861, -140809, -104966, -21990, -3839, -29311, -8280, -96937, -97751, -12760, -75671, -37651, 23757, -23630, 11332, 36257, -28717, -47327, -66596, -57530, -85249, -105289, -105112, -4038, 36560, -4813, 1933, 84554, 96076, 83857, 69539, 14602, 8866, 132061, 202015, 198215, 167403, 193635, 149859, 44207, -31839, -19215, 11554, 15939, 41303, 45039, -23196, -65556, -94728, -119886, -47105, -12158, 38885, 51559, 109666, 102671, 1061, -88326, -156796, -184810]
23892a84810P4727j21879P1369P4002P4075J14579K6702k4448p5477m9703k6856
23881d7719L9316J3510K3445K1387m1783O440r9969m560Q9808N3720n105m1088
23869G402r694K7495k5451R0582p0636p5215M21K7092n9715k8728K0114Q5742
23857a0591l655K4855k7822M0495k854N5497J0717o5005j33497l5769K2470O6677
23845e8482J32901m319O5767j6629m7792q8387N515K9217j0424p3441p9137l4460
23833a79671J23826k3513p7502O1457K0024J8607L4642Q0324M3488k6730l2407
23822D2545l2517k8906n3187l8355o034M8586J8144N083j37593Q0868P8468J9792
23810c106m9953n3273O4821p781N0985Q5086o4621K592k5678R509J02116K4686
$$ y = [-184810, -110083, -231962, -160593, -86591, -12516, 102063, 128765, 104317, 28840, -20863, -47719, -8403, 5107, 28552, 49939, 8156, 14596, -85373, -89933, -125, 53595, 48490, 7402, -2292, 25203, -248, 90334, 19698, -55517, -55096, -28004, -87719, -116447, -96333, -10591, -14246, 10609, -17213, 23282, 20428, 75925, 86642, 21637, -111860, -147629, -125159, -58482, 74419, 70100, 135867, 119238, 71446, -16941, -11426, 17791, 7367, -66074, -145211, -179671, -55845, -79358, -156860, -95403, -75379, -56772, -22130, 58194, 101682, 74952, 42545, 10028, -18878, -72065, -110420, -116454, -67868, -49724, -44641, -182234, -101366, -22898, -3106, -53059, -106332, -41511, -49292, 1693, 86779, 22158, 24750, -928, 8581, 110697, 135383]
23798A35383m7125P984M3864l8063k2951l6478L6165M769L0871r911j876n3622
23786D9010J25173M1524j25922j45007o8514K1027J47613n8835m274O3563j1871
23775C3487j6915j4122K8967O7189K26r0422J6102K4547Q5603o73j59473k4406
23763d9890k6944Q1949k4438L9918n7587r6032k2959L9004J73440R8713o6743
23752H8431l7368M970n31j03849m3419m9297j3820L7999J20580P2134N2346n1979
23740G6197o8721l1419Q709L4701j0928p2916m5249l5489l2623K1537N6278J25886
23728B5963P8177n4300L7732L4824m267o7639o9840l4745M0354p12m9807j9786
23716h4046l7024J961R940K5176l8088l3950L5740J03974R5913l9229j01821J5468
$$ y = [135383, 88258, 96242, 140106, 102043, 79092, 42614, 78779, 83548, 114419, 104508, 102632, 49010, 174183, 215707, 89785, -55222, -123736, -102709, 44904, -13931, -18205, 45358, 33487, 16572, 2450, 31417, 98606, 98832, 8410, 24512, 49059, 134662, 133989, -25484, -49890, -76834, 5115, -19323, 20595, -36992, -133024, -155983, -116979, 56461, 155174, 88431, 51063, 56033, 55502, -48347, -91766, -141063, -154883, -116884, 3696, 75830, 128176, 76197, 7476, -23943, -15234, 19467, 8539, -64377, -109626, -145115, -177738, -156201, -99923, 25963, 104140, 49840, 87572, 122396, 118129, 50490, -19350, -54095, -13741, -14453, -64260, -84046, -121070, -119109, -109169, -83993, -122081, -156031, -120291, -16317, 79596, 40367, -61454, -45986]
23704d5986L8382L1910J0911k8656n8645J7184K8367l9353k3286j3965j8829j2467
23692a14433O0398N3737p145m5658n8022P8025N4182J08030o6747j3108k978l4905
23680A1376R826N3224M8095N3675k68M780L7730k8340K5448j2526o2822j33494
23668F704q4110J0810N6453J06610j2570J10857l4070o2985r9918o8752O5490
23657e481n983P702p4491j8247R2407P195n6853M7922J1862k0207J9524k9698
23645b4348p0564J09337J16019j4219r5806j8612M450r0214r960J9581n544K9564
23633e0316j17471q4932j1828R2796P2944K0761j8139o8316k243o4356j04245
23622c35345O403J34474M6049J0135j7463L3907J0975M9183J21485O177n5958
$$ y = [-45986, -7604, 24306, 35217, 6561, -52084, -34900, -6533, -45886, -69172, -83137, -101966, -114433, -54035, -298, -7443, -53101, -111123, -33098, 21084, 129114, 62367, 49259, 46281, 11376, 21202, 74426, 122521, 176196, 175928, 180708, 218438, 190098, 215546, 203020, 140198, 6704, -77406, -66596, -10143, 96467, 83897, 194754, 160684, 97699, -2219, -70971, -5481, -11464, -3762, -78253, -96500, -4093, 3102, -53751, -5829, 6033, -14174, 5350, -24348, -94912, 14425, 130444, 116225, 20419, 1807, 6257, -83957, -93917, -74336, -79880, -50316, -167787, -252719, -264547, -171751, -98807, -78046, -96185, -164501, -166744, -231100, -335345, -328942, -194468, -148419, -138284, -155747, -121840, -110865, -61682, 59803, 65980, 10022]
23611A0022k0610L9988k5539o4999k7030M2882N3602k538L6987L3104o3853L762
23599A5778p2272p2802O4806K0737N249r5098j0641N7801j0404L4529k985J04994
23587C9692l6541M4683N2720n3893o2416m3406N8604J1851P1997M1534J8371o8122
23575G5074j92188q5256J36476K14279Q2341K7415r4733n2394O8994q120l3343
23564A38545j05812Q4901m6543o9411l432k7648J4283R2276J4712n5362n231l2057
23552g79k7719m6454j7458M9285K8748n4899q3255K2142J20254J7864j05082p8656
23540a76009O9691L756K9665J8276P0869k9108r1492p7213N1614N2931O2822j8393
23528c2591O390J1516J27000P4004j12625m7823J215N425k725k4966Q773R1788
$$ y = [10022, -10588, 29400, 3861, -61138, -88168, -45286, 8316, 5778, 42765, 75869, 12016, 15778, -56494, -129296, -64490, -43753, -38504, -133602, -144243, -86442, -96846, -62317, -65302, 39692, 3151, 47834, 100554, 46661, -15755, -59161, -557, 11294, 83291, 124825, 143196, 75074, -117114, -202370, -65894, 148385, 230726, 258141, 163408, 111014, 180008, 171888, 138545, 32733, 117634, 71091, 1680, -1752, -29400, -15117, 77159, 91871, 36509, 31278, -779, -28498, -74952, -92410, -43125, -14377, -69276, -152531, -130389, -10135, 7729, -97353, -176009, -106318, -102562, -72897, -54621, 16248, -12860, -104352, -181565, -129951, -77020, -14198, -32591, -26201, -14685, 112315, 186319, 73694, 25871, 27086, 32511, 29786, 4820, 13593, 105381]
23516A05381j08258l1521L1874m1264p5449J9375r339M505O5015J92553r847k164
23504A40861k3958L678Q281p0195j10508k5659r050K7374j3066L6473k2735l7975
23492i6479P2022J2291N0684K8884o0623Q057j12218l4561o3936O1217R2274l4379
23480g6767Q7911N6949r5463m7984L2953o4600O3477J08301L1197M8363m045j01742
23468C8550j59022j3188J5572K6813L7138J01759L7313n5704J600J7864p4130
23457b5435k8384Q207N6270j7682p7720L087J1255K3363O4589j1707m5936j9242
23445e9335K0486M0672j5268N9249K6371p8202l465K0402M3132j3516o870l6616
23433b960J23196k311j11416k7116N2905L2269j3667o5774l1589O5847M7857o8834
$$ y = [105381, -2877, -34398, -2524, -43788, -119237, -99862, -109201, -104696, -39681, 152872, 143025, 140861, 116903, 120581, 128862, 58667, -51841, -77500, -86550, -59176, -72242, -35769, -58504, -96479, -24457, -12166, 38518, 67402, 6779, 14836, -97382, -131943, -195879, -134662, -42388, -76767, 11144, 68093, -27370, -75354, -42401, -107001, -43524, 64777, 95974, 144337, 140292, 38550, -120472, -133660, -118088, -91275, -54137, 47622, 84935, 29231, 30831, 48695, -25435, -53819, -45612, 10658, -7024, -84744, -81657, -70402, -47039, 17550, 5843, -40093, -59335, -38849, 1823, -13445, 45804, 72175, -6027, -9492, 10910, 54042, 40526, 33656, -2960, 120236, 117925, 6509, -20607, 32298, 64567, 50900, -14874, -46463, 19384, 67241, -1593]
23421a593p9266J2008R2805M9285o7535k4248Q3983M0826j00278N225K7422L583
23409D2217l8026k318M2223Q9023Q2911j55123j36683J8038k2330j2437m7758
23398a40263l3325J4623P331N4533N9369O5487l0694l1538l8516k6625l7846O2180
23386g5284N4374P183O7764k8010q8932Q267M2747P9710L6400L4374j4328n3645
23374G0620P2893Q1422j0970L7590l5634j41891n8361K419n9275O65l9325m8486
23362a28333K635O6118L152L0585l260m5615l370K8317M535P0808Q7660p857m1055
23349F4320J0409P79j49708r684L3564l3585M9944N557L4532N328q524j13554
23337a10622o2433M3649P3106k246j1333j00304O9451J38571K2214j17827l1619
$$ y = [-1593, -80859, -68851, 23954, 73239, 5704, -18544, 65439, 106265, 5987, 11212, 38634, 42217, 4191, 1873, 44096, 133119, 216030, 60907, -75776, -57738, -80068, -92505, -140263, -173588, -158965, -151634, -97101, -37732, 27755, -2939, -34477, -72993, -99618, -137464, -75284, -20910, -13727, 54037, 26027, -62905, -54638, -11891, 67819, 104219, 138593, 124265, 70620, 143513, 224935, 213965, 251555, 215921, 74030, 15669, 18088, -41187, -40522, -79847, -128333, -125698, -59580, -56428, -25843, -29103, -74718, -78088, -49771, -45236, 25572, 113232, 105375, 64320, 74729, 75508, -74200, -83884, -50320, -83905, -33961, -28404, 6128, 11456, 2932, -110622, -173055, -129406, -56300, -58546, -69879, -170183, -100732, 37839, 60053, -57774, -89393]
23326h9393J1350K5164O6324N1438L7943K6029J0380r949l5744o0342K0235l2252
23314B1183j6776R029j18537j01952O8254P2054L2402j02303N8762R0557o3858
23303e1185l7073R7196K317n1971j11366O3114K151k1598N7247M4235k1871k2336
23291e1140q4209o9543M9744O5819N6742N1053P8928L7812L1300n9440j19251
23280a2185q72k9452K4242M2270m9171K8391J17461M1160q8112N910o3050j15271
23268i8679l4523J05839O4376m0873l224M9890k1401J1721l611m8628n6361Q401
23256f7073J1365N2863N1531o7599l0943P7033q4098j6914N9074k9658N1350m4467
23244c7536o344N7933N9827Q351m3442p4304K1425J54568R68j12186p3862Q571
$$ y = [-89393, -78043, -52879, 13445, 64883, 102826, 128855, 139235, 129286, 93542, 33200, 53435, 21183, 4407, 13436, -105101, -207053, -138799, -66745, -34343, -136646, -77884, 12673, -51185, -88258, 8938, 11255, -40716, -152082, -88968, -86817, -108415, -51168, -6933, -28804, -51140, -135349, -204892, -155148, -89329, -32587, 18466, 97394, 135206, 166506, 107066, -12185, -13057, -42509, -18267, 24003, -25168, 3223, 120684, 161844, 73732, 79642, 16592, -98679, -133202, -27363, 37013, -3860, -7084, 42806, 21405, 33126, 29515, -19113, -75474, -67073, -55708, -2845, 48686, -18913, -49856, 27177, -56921, -73835, -14761, -44419, 6931, -37536, -43880, 14053, 73880, 82231, 38789, -35515, -14090, 140478, 141446, 29260, -44602, -36031]
23232c6031K7250J4002N1159J7279n2958j6340R3985K1786J8447M4737l839j06425
23220G3052j4526j6797K3981J01600J17145l8666j08011l683n7330n1144q473
23209A7148j6775K687N3751J2712N2138J59434N0099k1186K799J22516Q1264R7776
23197F14363K51819M04651N41795N74960K75077K5167l58814n54666n07081m07898
23187H59373l45531j79471l9266q0624j21153l9514n5659l2215P2889L3653J7245
23176H9727j2399m4865Q758k573p2350k3765O156L1612j5377O4394j7950N8854
23164G0222K1170O020K3285L5761j8008j2260L421L5876o7383J184M8957K2924
23152A71169O7042j03184j12837q088J0887j3716P8883k5245J1255k3234L4222
$$ y = [-36031, -8781, 5221, 56380, 73659, 20701, 4361, 98346, 120132, 138579, 183316, 179477, 73052, 58526, 41729, 65710, 167310, 284455, 245789, 137778, 134095, 76765, 25621, 17148, 373, 3060, 56811, 69523, 121661, 281095, 331194, 310008, 312807, 435323, 516587, 614363, 866182, 1270833, 1812628, 2387588, 2662665, 2687832, 2329018, 1774352, 1267271, 859373, 513842, 334371, 295105, 214481, 93328, 53814, -1845, -34060, 38829, 72482, 89727, 77328, 32463, 41221, 38648, -33702, -57467, -51311, -19699, -35076, 29318, 11368, 70222, 91392, 97412, 120697, 156458, 138450, 126190, 129611, 165487, 98104, 99288, 148245, 171169, 238211, 135027, 22190, 14102, 24989, 11273, 90156, 64911, 76166, 52932, 87154]
23141H7154r546l0255o5864L6805n9256l2218J37771O8695j7723L9824J8411j8790
23129A55008m5383P9512k2728j42296j8235k116o297J0836k6711m9687o9944k3970
23117a62011Q6225L3484l9324K8732l3990l0910P4179P495N2408j7104M4767j2814
23105C1137K6743l0857r8857m6354N8343K4948J9057q0971K6773L6034k312N2243
23093A5927l0580j02332K4262O4565M3846o566m2046j22150j446M3902J00364
23082a2254J34915n2535r5684r905P004Q643j605O9120N1842M1360m1481N2728
23070A52148N787p9939k1538P2499p7777j5043l4423K4203n04o4541n4550p805
23058a01483P5655Q4621p3883j3390L0521J18025n3453M6269J7582j12923j8408
$$ y = [87154, 77608, 47353, -18511, 18294, -40962, -73180, 64591, 133286, 115563, 155387, 173798, 155008, 109625, 189137, 166409, 24113, 5878, 3762, -2535, 8301, -18410, -68097, -138041, -162011, -75786, -42302, -81626, -52894, -86884, -117794, -43615, -36120, 16288, -816, 43951, 31137, 57880, 27023, -71834, -118188, -59845, -34897, -15840, -96811, -70038, -34004, -36316, 15927, -14653, -116985, -92723, -28158, 15688, 9122, -32924, -155074, -156520, -112618, -12254, 122661, 70126, -25558, -35463, -28459, -19816, -21421, 47699, 99541, 140901, 99420, 152148, 157935, 77996, 56458, 128957, 51180, 36137, 1714, 25917, 25413, -39128, -93678, -101483, -25828, 58793, -15090, -28480, 2041, 120066, 66613, 112882, 130464, 17541, -867]
23047h67J0907p8910K0004j0973p077Q5354P547l0030J2961N8813R1072K0203
23035A79004o1564q5764n8016N5981j2290O6577Q8649k8585n6749o4908r2931
23024g0596L3568K3500K7402M5851m1132J7921l592o6864k6706Q6837K5853o6530
23012a4488j27978o6715Q3088P1572L9604N1146M5866M223l2761j27324m5137
23001a18904O7867l1039m6111L5973J2697K0643M6002K0745q8658M4890J10147
22990G4252N3764m06r3537j10141n9911Q3753Q153p4774l3992M0120M1177n0472
22978a22014K0595P0817P4052K8680o7192O3244P6489j1445R071n8312j14247
22967c0262r9542K6060R0341J8395k6245L4228n981j4742K3252j7829l4492l6065
$$ y = [-867, 10040, -68870, -48866, -59839, -66916, 18438, 25985, -4045, 8916, 67729, 158801, 179004, 117440, 31676, -26340, 29641, 17351, 83928, 172577, 143992, 87243, 22335, -70596, -37028, -13528, 13874, 59725, 18593, 36514, 32922, -33942, -60648, 26189, 52042, -14488, -142466, -209181, -126093, -54521, -14917, 36229, 82095, 86318, 53557, -73767, -118904, -51037, -82076, -128187, -92214, -79517, -58874, -12872, 7873, -80785, -35895, 74252, 128016, 127610, 34073, -76068, -135979, -52226, -44073, -118847, -152839, -112719, -71542, -122014, -101419, -30602, 43450, 72130, 4938, 68182, 144671, 133226, 142297, 83985, -30262, -129804, -103744, -13403, 4992, -21253, 12975, 6994, -7748, 15504, -2325, -36817, -72882]
22955g2882J2179R2074N2460N7945N8998o7018j53793j20675j0696L9361L8503
22944g3544j94k8789l0201J6081o1255k5602P222J65491K7532j6678j8806j6114
22932e4857n490P5506j2213n3631J26819N5874l60o2363k7540P3957r861N0848
22920A56689l972R751J3487q9277j22293r6978L3275J59421N3957m9661n2060
22909A2339L7565R5430r7141o2523P1399j1000M3689J04506O8295m2762r0867
22898A28930j8330p8642k5637L2907M257o6766m0626J09161O9588o7784N5797
22887A02855O9144L4559O0136N7809m5148K508J31295L9413q3939j09030j7412
22876B42190k6457j41811r7521R2719j62782j69265O970M5378j3953K4463K2599
$$ y = [-72882, -60703, 31371, 83831, 141776, 200774, 133756, -20037, -140712, -151408, -112047, -73544, -73738, -102527, -132728, -116647, -177902, -203504, -196282, -30791, -3259, -19937, -38743, -54857, -60347, 15159, 2946, -50685, 76134, 132008, 131648, 69285, 41745, 115702, 105841, 156689, 152717, 162468, 175955, 86678, -35615, -132593, -99318, 60103, 114060, 64399, 12339, 49904, 145334, 48193, -14330, 57069, 46069, 89758, 194264, 262559, 219797, 128930, 110600, 31958, 6321, 39228, 43485, -23281, -63907, 45254, 114842, 47058, 102855, 171999, 206558, 266694, 324503, 279355, 281863, 413158, 452571, 368632, 259602, 242190, 215733, 73922, -23599, 69120, -93662, -262927, -255957, -210579, -224532, -200069, -177470]
22865a77470Q7153J01317N2112J5609k6046n252K5220O7541Q4186o8700j3626
22854A42044O1286o6906r5142j9206N1920o8393m5879M4737J100m8623K2946k0954
22842d1070l0036n1618L8973O2442j7207j1983P0970N0849k9577q591P678Q2952
22830A23782L6565j66010m2059J16633K4265J0563K1671o6594N437J1689K7244
22819A03186L2830o7309o8782n1464N0481L1862K1323K603O8466m5407n0318j5818
22807A1653k2073O1473K4672j0345O6775k6025l8314l4421q0484J4497J48847
22796A16255m1808K3265K8897N6767p703q7663J08098R065M051n0324o5004L0664
22784A24560K6324j3626j03029o3857J11761R9001N1675M2183P635o0907j8680
$$ y = [-177470, -90317, 11000, 63112, 78721, 52675, 47423, 72643, 140184, 224370, 155670, 142044, 203330, 136424, 41282, 22076, 73996, 5603, -40276, 4461, 5561, -43062, -20116, -41070, -71106, -122724, -83751, -21309, -38516, -50499, 20471, 71320, 41743, 33152, 40830, 123782, 160347, -5663, -47722, 68911, 93176, 103739, 125410, 58816, 64253, 75942, 103186, 136016, 68707, -75, -51539, -1058, 30804, 52127, 54730, 123196, 77789, 27471, 11653, -10420, 51053, 75725, 65380, 132155, 106130, 67816, 33395, -47089, -32592, 116255, 74447, 97712, 126609, 183376, 175673, 88010, 196108, 205173, 209224, 158900, 93896, 124560, 150884, 137258, 34229, -29628, 82133, 181134, 232809, 274992, 282627, 221720, 203040]
22773B03040j05084j08464L4023N9032L2927k4489K8941O8295J48k5855J9077
22762A81591L9446P4971P2546N5222q570M3636p47M5724K45445N14058N57050
22751A820372L6684l46670n96490l38254k65816j0823O0611k6833l9021M1329
22741C35089o5619M9042J26810J54080J88713K42428M58941O84987O66546L01412
22731C142429o2946n30988p87099o18230l44548j49277j83607m4582j7932o8161
22721C35059q9648M9706n0322j9032K8378N2451K975m1417o0390K7107L2077K0693
22709B87637O0492N9078J5922J6191n7589R2934J26324K7713l7709m1869r1995
22698D57129n2508K4403O6218L6584k740M5454n405J6518k1958m9057P5896Q5300
$$ y = [203040, 97956, -10508, 23515, 82547, 115474, 90985, 119926, 188221, 188369, 162514, 181591, 221037, 296008, 368554, 423776, 415206, 458842, 458095, 503819, 749264, 1263322, 1820372, 1857056, 1510386, 913896, 575642, 309826, 299003, 359614, 332781, 293760, 335089, 269470, 318512, 445322, 599402, 788115, 1030543, 1489484, 2174471, 2841017, 3142429, 3079483, 2548495, 1761396, 1143166, 798618, 649341, 465734, 421152, 403220, 335059, 245411, 295117, 244795, 225763, 254141, 306592, 309567, 268150, 207760, 234867, 266944, 287637, 348129, 407207, 423129, 439320, 381731, 474665, 600989, 628702, 590993, 549124, 457129, 404621, 429024, 495242, 531826, 529086, 574540, 569135, 585653, 563695, 514638, 590534, 675834]
22686F75834Q5020n6959p8334j1638J08573J01038N5790r4488P2601N7551J3517
22675I28505J24810J9736O3094P2028J6998m2485M1878Q6756Q2215Q7324Q1935
22664A562794M5104J0328J40631K16778K32729J52170P1658M7937J27325R6707
22654B704161M3909J36571K36320J50595L11277M50158M40665M19316N13033N67100
22644E973105P46964R96782J132120J228827J656864K019253K348822K929991
22636A9032728L685031M816458O321509Q575716J1995787J7708219K8146870M9237441
22628A49519759Q5962746J25379410J17011850M2656564m1190027j01388376j07999151
22621B69952775q2934068n8943457l9265106k5106720j6328562j0965166p752252
$$ y = [675834, 760854, 703895, 625561, 613923, 722496, 823534, 879324, 784836, 857437, 914988, 928505, 1053315, 1073051, 1136145, 1208173, 1225171, 1182686, 1224564, 1311320, 1393535, 1480859, 1562794, 1607898, 1618226, 1758857, 1975635, 2208364, 2360534, 2432192, 2480129, 2607454, 2704161, 2748070, 2884641, 3120961, 3271556, 3582833, 4032991, 4473656, 4892972, 5406005, 5973105, 6720069, 7716851, 8848971, 10077798, 11734662, 13753915, 16102737, 19032728, 22717759, 27534217, 33855726, 42431442, 54427229, 72135448, 100282318, 149519759, 235482505, 360861915, 477873765, 520530329, 479340302, 377951926, 269952775, 187018707, 128075250, 88810144, 63703424, 47374862, 36409696, 28657444]
22614B8657444n760651m354209l163661k371615j724129j336978j110123q96830
22606G939248p62455o43439o21508n02116l42890k94151l04241j77973l39079
22597C951396m45609l07498k34531k81480l44214j54729j14383q2372L7722j21695
22587A902607m8758j28066p1021r7489k8426k8598n0717k7151p6642j31665l5607
22576A178467k3670N0001J255j26970n5036r0488j35786l622j8948k6710n5160
22565F93333k3521M9348j4927k4871r7613r1763p2996M0143M7449R481l1182K236
22553D85117K3482q613L2269P952q9814j06522p4649j7929J34864Q1163Q1833
22542E49153j26521m6362K7116J08936r5522j00792K6025K5925K0153m009r7675
$$ y = [28657444, 22896793, 18542584, 15378923, 13007308, 11283179, 9946201, 8836078, 7939248, 7176793, 6533354, 5911846, 5409730, 5066840, 4772689, 4468448, 4290475, 3951396, 3505787, 3198289, 2963758, 2682278, 2338064, 2183335, 2068952, 1986580, 2024302, 1902607, 1853849, 1725783, 1654762, 1557273, 1528847, 1500249, 1449532, 1422381, 1345739, 1214074, 1178467, 1154797, 1204798, 1206053, 1079083, 1024047, 933559, 797773, 794151, 775203, 748493, 693333, 669812, 719160, 704233, 679362, 581749, 489986, 416990, 457133, 504582, 514063, 482881, 485117, 508599, 499986, 532255, 540207, 450393, 343871, 269222, 251293, 386157, 467320, 549153, 422632, 376270, 403386, 512322, 416800, 316008, 342033, 367958, 388111, 384102, 286427]
22531B86427r0413K7512l8619K677J30509J46346N3703J7124k980J63301K92697
22520I88284K83909N72621P53229M99286k1977m59020o35785n51842l83218k03820
22510H41667j98781j77780q6025m7106r9141p604J22280J08257N2278L6954j11691
22499D33308J588l1900k15093j21086Q3846J29725L1319j06896k2360N1268M254
22488B37973k6567p71l1001K9125m5066q0991k7137l6218j080P9097k2005Q3399
22476A58758o9262k08159r057N581j26813m8269N9823M3841j9319J24777Q3100
22465d999J983k5953p5251l6246J31447R6442L047o6547j4703R9503N4640m5444
22453A17919M2611L452l6699p8078j6549Q095J14000m2118j07507p1856N9914
$$ y = [286427, 196014, 223526, 184907, 187584, 318093, 464439, 518142, 535266, 532286, 695587, 988284, 1272193, 1844814, 2598043, 3097329, 3075352, 2616332, 1980547, 1428705, 1045487, 841667, 642886, 465106, 379081, 331975, 232834, 225230, 347510, 455767, 508045, 544999, 433308, 434896, 402996, 187903, 66817, 150663, 280388, 311707, 204811, 182451, 233719, 237973, 211406, 210635, 179634, 208759, 163693, 82702, 55565, 19347, 18267, 97364, 75359, 158758, 89496, -118663, -127720, -122139, -248952, -297221, -237398, -193557, -212876, -88099, -4999, -3016, -28969, -104220, -140466, -9019, 87423, 90470, 23923, 9220, 108723, 163363, 117919, 160530, 163982, 127283, 49205, 32656, 40751, 154751, 112633, 5126, -66730, -6816]
22442f816p889n1705L5546R1672N07m4251k2371n5574M4490J6258j0730K765j6150
22429b4248j02040N2806M6172J3016Q6380k4846l9461J19801K9001p0696J9079
22418A04964m002m0955j9996n5216j1427J14388l853j6840Q9434l2498l9091l8343
22406D6565m6429q1438M9720J58474L8136m6049j08305l2506j086L1607j11060
22395a02371k524p715K7683J84754L3388r3706m1926J4343j1321P967j0027J832
22383C77o93j4922l2539r4428l6773R6996O9546J9550q177K2997R7844p8364j1957
22370B9457j21365m4977J09875J1057n030O8255k1750k4701o4833n76o9937K4537
22358a09988J11729J21449o0583K2868J50522p0193j37892J2467r30N2230K1447
$$ y = [-6816, -14705, -66410, -30864, 60808, 61315, 17064, -5307, -60881, -16391, -133, -10863, -8098, -24248, -126288, -73482, -27310, -14294, 72086, 47240, 7779, 127580, 156581, 85885, 104964, 100962, 60007, 40011, -15205, -26632, 87756, 83903, 67063, 156497, 123999, 84908, 46565, 136, -81302, -31582, 126892, 165028, 118979, 10674, -21832, -22918, 8689, -102371, -104895, -112610, -84927, 99827, 133215, 39509, -2417, 11926, 605, 8572, -1455, 377, -316, -15238, -47777, -142205, -178978, -81982, -12436, 7114, -1063, 21934, 119778, 41414, 29457, -91908, -136885, -27010, -15953, -20983, 47272, 25522, 821, -64012, -64588, -134525, -109988, 1741, 123190, 62607, 85475, 235997, 165804, 27912, 40379, 39449, 91679, 113126]
22347A13126o3295o6492k4549q5798J4744K6675j0770L5175J3255m3021k4259
22336a15209O4269K2035J5310j6258q3506O8352N3040J0821K7596P763q5016m5429
22324g6232J0134m08N9139l3501L408O2138Q940k4032j238o8073K6281o629m5104
22311h5177j24539k2813J55192J17481Q3063O484q4588j09031n4252J14569p340
22300a0951l2077K9388K7697j5722p1270n49R3323M9895m2671J377n9934k2794
22288e4288j00114k8651J07714P1610M969q1602L7477L1271j02941n2214R8596
22277f8173P1927J07K7158l0243k5388m1476j2640j2576N9876Q7591K3740p7244
22265B659L7163m0462j16046J3896M1895O4725M4169M609j37485j3171l5899N5421
$$ y = [113126, 49831, -16661, -41210, -127008, -112264, -85589, -96359, -61184, -47929, -90950, -115209, -50940, -28905, -13595, -29853, -113359, -45007, 8033, 18854, 46450, 54213, -30803, -76232, -66098, -66506, -7367, -40868, -37460, 24678, 33618, 9586, 8348, -59725, -33444, -40073, -85177, -209716, -232529, -77337, 40144, 123207, 129691, 45103, -63928, -118180, -3611, -10951, -43028, -13640, 14057, -1665, -72935, -73484, 19839, 69734, 27063, 28440, -31494, -54288, -154402, -183053, -75339, -3729, 1240, -80362, -42885, -11614, -114555, -166769, -68173, 3754, 3861, 31019, 776, -24612, -66088, -78728, -91304, -31428, 56163, 79903, 2659, 39822, -640, -116686, -102790, -60895, 3830, 47999, 52608, -84877, -98048, -133947, -78526]
22253g8526J92314J39909o2283n299l3299n9920j6855K928p3886k6701m2299K5631
22241c8286P5987J24131L1624K3981J30372J27517J21697J1101n1851n1033j19449
22230C85791l0201J4363j35011J9985q7382l8649q446n39J1039m7858j2505M2351
22218A12938L1371P247j07128q6614Q7250J6472m047K9992j6525j36178r3974
22207a59196L4036Q8767r93N7817J5114K4331o3021p6086l5517j064J2704M7342
22195e5766k0312M8859N8003j1505m1578m1693J2008Q672M0257Q2581N840M5932
22183A31298o3279r4307l9411M3960N362l3669l1925J23965O3884J0731j6816
22172I9793J23j07850j12626M2017L4526k3072l2072O7676M4840J9443Q9473J3120
$$ y = [-78526, 113788, 253697, 191414, 186115, 152816, 92896, 76041, 78969, 5083, -21618, -63917, -38286, 37701, 161832, 193456, 217437, 347809, 475326, 597023, 608124, 556273, 505240, 385791, 355590, 369953, 234942, 254927, 167545, 128896, 120450, 119911, 130950, 83092, 70587, 112938, 144309, 151556, 44428, -42186, 45064, 61536, 57489, 87481, 70956, -65222, -159196, -125160, -36393, -37386, 20431, 35545, 59876, -3145, -79231, -114748, -115812, -103108, -55766, -76078, -27219, 30784, 19279, -22299, -63992, -51984, -43312, -3055, 79526, 85366, 131298, 68019, -26288, -65699, -21739, -16377, -50046, -81971, 41994, 105878, 116609, 99793, 99916, -7934, -120560, -78543, -44017, -67089, -99161, -31485, 13355, 32798, 122271, 135391]
22160A35391M6495N1792o4446j00596j1672Q36p7989r8498p8341K5376J04409
22149f7243J4257l6357p1554p745k4604J5190P5983M0003J5614M761m3227R335
22137g5587j5479k3831K7736N8520l4807J5282o987L2674O1062k6657R589Q33
22125B2348L8244q578o5345L9713J1864M7798n4941L6217r7593j37670j05126
22114b73069R8467P3574R818O103J6601j12401j5816m9583P397J15085L7074K6783
22102e9967j2036l5734J2618o4751r480N5873J28321P1832Q844j6265l9984r1807
22090e2536J2536k2232K0900L2880O9586N6015k555M8947o9877j24632P9174n7470
22078i264r60K6282j05614p2550n7069J4003p4346M8111P4055R5765J2102o217
$$ y = [135391, 181886, 233678, 169232, 68636, 56964, 57800, -20189, -118687, -197028, -171652, -67243, -52986, -89343, -160897, -168642, -193246, -178056, -102073, -62070, -46456, -41695, -84922, -75587, -91066, -114897, -87161, -28641, -63448, -48166, -55153, -22479, 38583, 11926, 21515, 22348, 60592, 52014, -13331, 26382, 38246, 86044, 31103, 67320, -30273, -167943, -273069, -174602, -101028, -91210, -85107, -68506, -180907, -196723, -246306, -238909, -123824, -86750, -59967, -72003, -107737, -95119, -159870, -169350, -113477, 14844, 86676, 95520, 79255, 39271, -52536, -40000, -62232, -41332, -8452, 61134, 117149, 114594, 163541, 93664, -30968, 48206, -9264, -10224, 16058, -89556, -162106, -219175, -205172, -279518, -231407, -157352, -61587, -49485, -55702]
22066e5702r1805O6207M5833N9013L6314J6899Q8808L5993J906N0659R8447R0374
22054D42946o8923J67226L62949M94538P09956O07939R3815l57812n52093n64203
22044A336338m00738k49526k35791j15499j13037q9206L628j01249p0167O2307
22034B7060M2311J6995k640o317J8726N9802n8758n6356K4597J0766p6151j43105
22022a43070l3714Q9074K5751l1333L0754M3545o435k2846N353K2256P4333Q0637
22010A34305P171N489n6921j54919N413L1154o4453L5400O8387m1713n0953q218
21998h9858j4042O0943m6864n2010o8175M1656n0524P5928J16492O4635p5156
21987c6975l1671j6577P0858Q0042O7893m0934o3004k7125J6701j62206O857K3099
$$ y = [-55702, -147507, -81300, -35467, 23546, 59860, 76759, 165567, 201560, 203466, 254125, 352572, 442946, 374023, 541249, 904198, 1398736, 2108692, 2716631, 2810446, 2452634, 1900541, 1336338, 935600, 686074, 450283, 334784, 221747, 132541, 136169, 34920, -35247, 27060, 69371, 86366, 83726, 77409, 96135, 155937, 97179, 40823, 65420, 76186, 35, -143070, -176784, -87710, -61959, -93292, -62538, -18993, -25428, -48274, -42921, -20665, 53668, 134305, 141476, 146965, 90044, -64875, -59462, -28308, -92761, -57361, 11026, -30687, -81640, -89858, -103900, -42957, -89821, -141831, -210006, -168350, -218874, -142946, -26454, 38181, -36975, -68646, -85223, -14365, 65677, 133570, 92636, 29632, 2507, 19208, -142998, -136141, -113042]
21975a13042J195m4006O6373j132p4711j23907R004J56559P5612q939m4924n2478
21963a54396o7470J4235M8752M624N4029l7853j14044k501J34747R88K5909j3322
21951a06302K7117M4661k3024L1866j824J7119k574j25208j6813N6675M9480J44525
21939I5698J6233n4649k9844j09838o965m1305p400J1974p2999Q9020J4577n6544
21927a52042K3172m5089j6935n4067R6278J25059P8981J11985r6403j16852l4260
21916h0173j7502p8616n2632R2804N4359R397n885J2982O2284J1156J8232J4212
21904D0618k1927K0989k2004p0356j0783O3295k7795j2395l1062j5711N1736R3205
21892E7810l3952j05091R1665q224p1322J0354J8496Q5358O3646m2633m1149l3754
$$ y = [-113042, -111847, -155853, -89480, -90612, -165323, -289230, -280226, -123667, -48055, -56994, -101918, -154396, -221866, -207631, -158879, -154255, -100226, -138079, -252123, -254624, -119877, -118889, -92980, -106302, -79185, -34524, -57548, -25682, -27506, -10387, -12961, -138169, -154982, -98307, -48827, 95698, 111931, 57282, 27438, -82400, -89365, -130670, -138070, -126096, -199095, -110075, -95498, -152042, -128870, -173959, -190894, -244961, -148683, -23624, 55357, 167342, 70939, -45913, -80173, -97675, -176291, -228923, -136119, -81760, -72363, -78248, -65266, -2982, 8174, 26406, 40618, 18691, 39680, 17676, -52680, -63463, -168, -27963, -40358, -71420, -87131, -35395, 57810, 23858, -81233, 10432, 2208, -69114, -58760, -40264, 45094, 108740, 66107, 24958, -8796]
21880h796M6365k8572j5808j2240q1311j01412L8192P3263Jo0992j9636J01622
21868f9324J17690M0984j04484p7626P0172K3239r1141k4243k0077j8943P7924
21857g5829K6070K7700j1099J5740j8480J682O882p5114K868L6543N662k9123
21845h6498M776Q4531L0364J807j1926o1553K0410J17574K095n3139q6215k278
21833d0052R7345K9151j20790l7063R6112M9326J1261L5297Q9551l4919j0643
21822A64576j28008j31563J5237K5664j1097q8458P1937J00278o7377k757k215
21811e3783k9298L5651M5060L0609r4910L6278J35020m7408j39691r3200Q10k2984
21799a97846Q9319J786M340P173k1819L7925L6571K4567L6074p6213k2940N1889
$$ y = [-8796, 37569, 8997, -6811, -19051, -100362, -201774, -163582, -90319, -90318, -151310, -170946, -69324, 48366, 89350, -15134, -92760, -22588, 651, -90490, -114733, -134810, -153753, -75829, -49759, -22059, -33158, -17418, -35898, -34216, -27334, -102448, -99580, -63037, -57375, -86498, -81722, 2809, 33173, 34980, 23054, -38499, -18089, 99485, 101580, 48441, -37774, -40052, 57293, 86444, -34346, -71409, 24703, 74029, 85290, 120587, 210138, 175219, 164576, 36568, -94995, -79758, -54094, -65191, -153649, -81712, 18566, -48811, -51568, -53783, -83081, -47430, -2370, 28239, -66671, -30393, 104627, 57219, -82472, -175672, -174862, -197846, -108527, -106741, -102401, -95228, -117047, -79122, -42551, -17984, 18090, -58123, -81063, -29174]
21787b9174O9613r749j7099K1105j8141m1126j1930n6258O3278N2802j5007o9485
21775f1171K0811k325l538R4190Q3297m1005j08821p5937O30L4844O0534N2020
21763E3529O8671j8922j31330j00726k9448m174K2209L1339P5221P1069N1446
21752H8884O0981J5681m1740p7355l2296l7062R520j7894m5261m138j3921K1943
21740g2658n9884j5707J06877M9651k7512o9309J8612j13129l446M1316P0387
21729g4802o7089O9891Q6194O6405m0909m2935O0299M742n0091q3257k9919P8133
21717b3338O6302k4059m2765k0559j28361n5053J4020M3212J02934N2519Q7428
21706G2280J27467k6728j50078j31856j11263L3622J31159O0748n2366L1182K5835
$$ y = [-29174, 40439, 30690, 13591, 34696, 16555, -24571, -36501, -92759, -29481, 23321, 8314, -61171, -40360, -42685, -46223, 47967, 131264, 90259, -18562, -94499, -93869, -59025, 1509, 53529, 122200, 103278, -28052, -128778, -158226, -162400, -140191, -108852, -33631, 37438, 88884, 149865, 165546, 123806, 46451, 14155, -22907, -13387, -31281, -76542, -80680, -94601, -72658, -132542, -148249, -41372, 8279, -19233, -88542, -69930, -183059, -186505, -145189, -74802, -141891, -72000, 14194, 80599, 39690, -3245, 57054, 61796, 11705, -71552, -101471, -23338, 42964, 18905, -23860, -44419, -172780, -227833, -213813, -170601, -67667, -15148, 72280, 199747, 173019, 22941, -108915, -220178, -186556, -55397, 5351, -47015, -15833, 10002]
21695A0002L2412k5005L7150M5752N2726q8414r5547j8083J5815L3683m1660J4912
21683b6257r340k4191P3323K2813n0853n6359O8135n6906K0463P0588P7158j1749
21671I6825m1654j4867J4957n2273j36274j6776Q482N628J00966o532p565P6157
21659B7074P6045j3826L979n5291o2166j2019N3063M1532j8960q0289k57M7489
21647F374r62l9731J0917O5406j1191l8308Q5270N2201p9277n2120k0365q8731
21635a10517J657J9878R1716L4436k0259r027k3640j15794l9234o155P0548j2630
21623a19021k9163K9774M2900K5575K4290m4019l020L3554j3210O601J5428J3803
21611a6508j9422o5814n2701P6110N8118R0327p6054r0166K8384o0516j9215M3413
$$ y = [10002, 42414, 17409, 54559, 100311, 153037, 64623, -30924, -49007, -33192, 491, -41169, -26257, -35597, -59788, 13535, 36348, -14505, -70864, -2729, -59635, -39172, 31416, 108574, 96825, 55171, 40304, 55261, 2988, -133286, -150062, -141580, -135952, -34986, -41518, -49083, 27074, 103119, 89293, 93272, 37981, -24185, -36204, 16859, 58391, 39431, -40858, -41115, 6374, 5412, -34319, -23402, 42004, 30813, -7495, 77775, 129976, 50699, -1421, -21786, -110517, -108860, -88982, 2734, 37170, 16911, 7884, -15756, -131550, -170784, -176939, -106391, -119021, -148184, -118410, -75510, -49935, -25645, -69664, -72684, -39130, -52340, -45739, -30311, -16508, -35930, -101744, -154445, -78335, -20217, 70110, -5944, -96110, -67726, -128242, -147457, -104044]
21599a04044j2765m2401K7838q790O9191j2689N2112k4548L6260J05180P851j0742
21587H2453j07401n0096j4845M8010K0116k3921j9787N8380m4389n5739n455m8285
21575a60959L1999K8011L8438j1926K4005q5059M4295M0605J13359l4377m0356
21564a1965j0624P5287Q0940l6462n983o5392m0304m0281n906J15282O4108n5534
21552F3166q3655l0701O3529O7023q4091k6386m6633j7516L9833N6079L9672R9068
21540A39388l2206k9192K2987M0515m1838j59998m8475j9571K9148J9913M4949
21529c4380J09056P450K5365l0764n6708K0516P0227m5120l7203l2741r1036k1750
21517a17088K9174K6061K8089N5672k8506L2952L3906l4383j26376J0960j0734
$$ y = [-104044, -116809, -159210, -131372, -140162, -70971, -83660, -31548, -56096, -19836, 85344, 93195, 82453, -24948, -75044, -89889, -41879, -21763, -45684, -65471, -7091, -51480, -107219, -112674, -160959, -128960, -100949, -62511, -74437, -50432, -135491, -91196, -50591, 62768, 28391, -11965, -22589, 52698, 133638, 97176, 91193, 25801, -14503, -54784, -60690, 54592, 118700, 63166, -20489, -51190, 12339, 79362, -4729, -31115, -77748, -95264, -55431, 648, 40320, 139388, 107182, 77990, 100977, 141492, 99654, -60344, -108819, -128390, -99242, -79329, -34380, 74676, 82126, 107491, 76727, 20019, 40535, 110762, 65642, 28439, -4302, -95338, -117088, -87914, -61853, -33764, 21908, -6598, 26354, 60260, 25877, -100499, -89539, -100273]
21506a00273N9793M927j7523r0136n0583l7593P5698N6429J32855J8839o3621
21495a1188L080k7025r7172L5743R6812r2771n8964O5413M2569m675J7506O925
21483b3747O6204M24j00179j3396J07685n8597k1788N4163J07526o7331l5008
21472A5956J5746l6264j13437o3025L337P2884J61807L1704j7249k2409k7303
21461B1747P3580K2761m4947k0062P3N5495q184j22038l2616P6897m4410m1998
21449f3702j12754K3286P9984M293M7973L0859N863L1128k8729q4787j1002l6421
21437a14009J24282J5850q7522n1094P3068K875q5289m1278p6101M9145J2784
21426a77289K3907j0596K5980O2068l4422J00246l0590o493M5129M4192K8017
$$ y = [-100273, -40480, -35553, -53076, -143212, -193795, -231388, -155690, -99261, 33594, 52433, -11188, -8108, -35133, -132305, -96562, 250, -92521, -151485, -86072, -43503, -48178, -30672, -23747, 42457, 42881, -57298, -70694, 36991, -21606, -43394, 10769, 118295, 50964, 15956, 31702, -4562, -117999, -181024, -177687, -104803, 57004, 88708, 71459, 49050, 21747, 95327, 118088, 73141, 53079, 53152, 108647, 100463, -21575, -54191, 22706, -21704, -63702, -176456, -153170, -73186, -68893, -20920, 9939, 15802, 46930, 18201, -66586, -77588, -114009, 10273, 26123, -61399, -112493, -39425, -36550, -121839, -163117, -239218, -190073, -177289, -153382, -163978, -137998, -75930, -110352, -10106, -40696, -47189, -2060, 42132, 70149]
21415G0149L8605J4029L2231q2832j73184J7706N0853m6716J6659J9238M2586
21404f76J4558R5034N4921r8174o5696p0215j5724M2243N2914m3330k7767j8683
21392h0595k4163K2711l7514L5817j3288J1177o3918P9027L5236O7170P9271l4156
21380G6775p5847J2456n3354J1676N2674N2676j7450r6473q3288P632o3293j237
21368a77053j14975P1713J61854N1943j13094n1069N1408O6929l368O6794L7758
21357D8840J5954L9681Q1822k1866o3986K9447l3552n9826n8956N4633P5458j8062
21345H9587l3091m1272j05460j4559p5464o3075M2923J31903J99267n9162p8604
21334g007k1517r0322M6540P9278r4385L5777J34587L9325q119r8789j15547k1175
$$ y = [70149, 108754, 122783, 155014, 72182, -101002, -83296, -32443, -79159, -62500, -43262, -676, 13882, 108916, 163837, 65663, -33, -70248, -85972, -43729, 9185, -34145, -61912, -80595, -104758, -82047, -119561, -83744, -97032, -85855, -149773, -70746, -35510, 31660, 110931, 76775, 928, 13384, -39970, -28294, 24380, 77056, 59606, -36867, -120155, -112523, -175816, -177053, -292028, -220315, -58461, -6518, -119612, -170681, -119273, -52344, -55712, 11082, 48840, 64794, 104475, 186297, 164431, 100445, 129892, 96340, 36514, -22442, 32191, 107649, 89587, 56496, 15224, -90236, -104795, -180259, -243334, -200411, -68508, 130759, 71597, -7007, -28524, -118846, -72306, 6972, -87413, -51636, 82951, 122276, 114157, 15368, -100179, -121354]
21322a21354J7092J01691R2962K6810K0401q1309l1892J2151k1033K234K3471
21311D1224k3260J8813n6997L2151M3539j8279p891K8496j5291m2315k7241N7832
21299C0781P0783J11460l7457q7309m722n024R610K0522o7524J3969l0548J7610
21287D2151J18431Q5070p4815r4483r6264q6525k690K7791R8949J7802j21010
21276h5593m9702M6435n4609Q1411P6405k1740L4625m1248k4864J7448L6734k4235
21264h933M7497J35731j2997j21039j07605J4415j5771l7346N9957N7401K6227
21253C7537j9043m9328L4112J3622k8538J117k6609j2005K0223k1883M57J6831
21241c3507m694q8391n1997J3693j0701J4184P7812M9149p781j08284m5112J31843
$$ y = [-121354, -104262, -2571, 90391, 117201, 137602, 56293, 24401, 36552, 15519, 17753, 41224, 17964, 36777, -20220, 11931, 55470, 37191, 29300, 57796, 42505, 190, -27051, 30781, 101564, 213024, 175567, 88258, 83536, 78512, 88122, 108644, 41120, 55089, 24541, 42151, 160582, 245652, 170837, 76354, -19910, -106435, -109125, -81334, 17615, 35417, -85593, -135295, -88860, -143469, -62058, 14347, -7393, 27232, -14016, -38880, -21432, 15302, -8933, 38564, 174295, 161298, 40259, -67346, -52931, -68702, -106048, -46091, 11310, 37537, 18494, -30834, 3278, 16900, -11638, -10521, -37130, -49135, -28912, -50795, -50338, -33507, -38201, -126592, -178589, -164896, -175597, -161413, -83601, -34452, -42233, -150517, -195629, -63786]
21229f3786Q765r2406O6747K4940p091P0596l1049r0891j0506j0604M2608o0056
21217a52733j5397L0789M070N3989N6295K7253K6805Q142k7448J5697j1313L1499
21205D7648n1870j08812m0518L8588M0982J12541J1146k6676j7746N2800K5651
21194H3734j11257m4308q3554R331J59905p3445l394R9724K2591Q695o6497L104
21182D629J14295Q8218q7108j10398o2904l0700Q8406M5378p060k5383m791N1939
21170F4521J2756Q3240q3799q7688k654M0581N0682r4982r1606K3661R346k8946
21158a04888M5246k8875N838J5301J4527n892R274k7384o139J12139R0378j37917
21146a8392k1786K3004j376N1212P2840l96q9146m9076J0880N1873l2437k4392
$$ y = [-63786, -55021, -147427, -80680, -55740, -62831, 7765, -23284, -114175, -124681, -135285, -92677, -152733, -168130, -137341, -133271, -79282, -22987, 4266, 31071, 39213, 11765, 27462, 16149, 47648, -4222, -113034, -153552, -114964, -73982, 38559, 49705, 23029, 5283, 58083, 83734, -27523, -71831, -155385, -146054, 13851, -59594, -62988, 36736, 59327, 68022, 1525, 4629, 118924, 207142, 120034, 9636, -53268, -83968, 4438, 49816, 42756, 17373, 12582, 64521, 77277, 160517, 76718, -10970, -13624, 26957, 77639, -17343, -108949, -85288, -75942, -104888, -59642, -88517, -82679, -67378, -52851, -58743, -49469, -76853, -82992, 29147, 119525, -18392, -40178, -17174, -18550, 32662, 105502, 105106, 15960, -33116, -22236, 29637, -2800, -27192]
21134b7192l2702K3026M7084j2363K4512j32101R403J57010O457n9422p4979K2671
21122d8596N0915p1663k7926K7746P5774m319r0424n7041K4367N9715Q1214j13088
21110i3326k8470J04245O3183q524K9350k0653k0803M4654k6571K4596J314j04693
21098c5698p798M3087N2565J6971l740M8003L9972q5121j46660j23300q2295P6318
21086b07696Q2392L2360K470K4720o4400P1018n4997r7243N902J02131P7140n9884
21074h6087k5886n220n0386n6577J3729R6081j5375J6655P3849M4246o9184L5640
21062b8515N0345r412N7546K4647l4632j12176K9506J01123P0081l9834j09422
21051g43m347O2072K8852m0878j0381m6495Q7353k5932q3453n7717l2878P048
$$ y = [-27192, -59894, -36868, 10216, -2147, 22365, -109736, -100333, 56677, 63134, 3712, -71267, -48596, 2319, -69344, -97270, -69524, 6250, 1931, -88493, -145534, -121167, -61452, 19762, -93326, -121796, -17551, 45632, 37108, 66458, 45805, 25002, 69656, 43085, 67681, 68995, -35698, -43496, -409, 52156, 69127, 65387, 113390, 153362, 68241, -78419, -201719, -284014, -207696, -125304, -92944, -90474, -65754, -130154, -59136, -114133, -211376, -205474, -103343, -26203, -86087, -111973, -117193, -167579, -224156, -210427, -114346, -129721, -113066, -39217, 5029, -64155, -28515, 21830, 12418, 69964, 94611, 59979, -52197, -22691, 78432, 148513, 108679, -743, -5090, 56982, 85834, 44956, 34575, -11920, 75433, 49501, -33952, -91669, -124547, -117499]
21039a17499N9642j3797n11K499q939K0770J5011R8037O0568L264q54l8397O88
21026H0482L6997N3163p2564p6704R3510P5958J02266J38748N8035O697k1524
21015D75064M2898L3000j2802j9930j4137Q652j8645J4379J2P3329L4978j4425
21003F02373o6164j95979j84104l9671K9945j30727r5674N2154j2228P2920N2843
20992H5688M8550L3032K0564M0592Q593K07286J26679m0616j09197R63j29125
20981B93009k8255J5259N3553O1481J31829K0773q8327j0497o9166j48803k0557
20970B10299q5185j05023N0775R9004M8335j3858p3774m2131K1237N8904m1893
20959A26690j03563j01502M3526J9284p9182N3879J05354j02993l9703J6132O0706
$$ y = [-117499, -57857, -71654, -72165, -69666, -78605, -57835, -42824, 55213, 115781, 119045, 118191, 79794, 80482, 117479, 170642, 98078, 21374, 114884, 190842, 293108, 431856, 489891, 496588, 475064, 517962, 550962, 538160, 518230, 504093, 512745, 494100, 508479, 508491, 581820, 616798, 602373, 536209, 340230, 156126, 116455, 146400, 15673, -80001, -27847, -40075, 32845, 85688, 134238, 167270, 187834, 228426, 237019, 444305, 570984, 530368, 421171, 422134, 293009, 264754, 280013, 333566, 395047, 526876, 547649, 459322, 448825, 379659, 230856, 210299, 125114, 20091, 70866, 169870, 218205, 204347, 130573, 88442, 109679, 168583, 126690, 23127, -78375, -34849, -15565, -94747, -40868, 64486, -38507, -78210, -62078, -1372]
20948a372l4117l50L227K4834m7103q1502o9630l4784J00597J36319N6821k3663
20936B9277o2412J6348O6962J10339J307p1087k7181k6990Q1613J5892o4593j3643
20924E5832o5229p819M1023M2328r612J2350j02683q0268Q156N113o8847o6963
20912b36619P8587J37152O2784l1844n5611O7300L7433m9079r4029K4714M9849
20901i363L5777m2855p9575j80K6031K3835m1432M8879L0416q8040j0068J29681
20889B3106J59m9565o0083l5523O8596j9668o809J8419l6735l2337K7444R8478
20877d518o290j2578p7691J4556J8782l6629P6313N5265P1741j8662r3871j1884
20865b5466N1444J9540m1711k7293N9268Q0502o02L5281o4757j31347m5897n7776
$$ y = [-1372, -35489, -35839, -32612, -7778, -54881, -136383, -206013, -240797, -140200, -3881, 52940, 29277, -33135, -16787, 50175, 160514, 161821, 90734, 63553, 36563, 118176, 134068, 69475, 55832, -9397, -17216, 23807, 66135, 56523, 68873, -33810, -114078, -105922, -100809, -169656, -236619, -158032, -20880, 41904, 10060, -45551, 21749, 59182, 10103, -83926, -59212, -9363, 26414, -16441, -96016, -96196, -70165, -46330, -87762, -38883, -8467, -96507, -106575, 23106, 23265, -26300, -86383, -121906, -53310, -72978, -79787, -61368, -98103, -130440, -102996, -4518, -10808, -23386, -101077, -86521, -67739, -104368, -28055, 27210, 98951, 80289, -13582, -25466, 25978, 45518, 3807, -23486, 35782, 116284, 115682, 150963, 86206, -45141, -91038, -148814]
20853a48814j9040p3540l6436L7041O2880Q6142K0771l8367l146L2187l350k6885
20841a10557N3518Q0947K5190j5522N040M1738k3405n5267m6865L1829R4971o9638
20829A1979q7932q2049M3585J42725R7221j4047o7704L6376k7357o2256o3105
20818g2564k1722m0459n8324Q5182K144m9785J9666o181K7463M3065j6272k4708
20806a12495o1500j0541q38R178L4604k7877j8464R6744O3085K0298K6784o013
20794A2965q5990q174p5943K3895M0255Q848k6123O4953L1598K3549O8188M0120
20782A18141L0012j7936j5781l9450j7516j26577p9790k9905k983k8088N836K3409
20770a80628P1501O0297M9076K4939o6312K2764m111p5637n2199J5239J4126q7700
$$ y = [-148814, -167854, -241394, -277830, -240789, -177909, -91767, -70996, -109363, -112509, -80322, -83672, -110557, -57039, 23908, 49098, 33576, 38616, 80354, 56949, 1682, -45183, -13354, 81617, 11979, -75953, -158002, -114417, 28308, 125529, 111482, 43778, 80154, 52797, -9459, -72564, -94286, -134745, -193069, -107887, -105743, -155528, -135862, -142043, -114580, -71515, -87787, -112495, -173995, -184536, -185374, -176196, -141592, -169469, -187933, -91189, -28104, -7806, 18978, 12965, -73025, -81199, -157142, -133247, -92992, -84144, -110267, -45314, -13716, 9833, 78021, 118141, 148153, 130217, 114436, 74986, 57470, -69107, -148897, -178802, -181785, -209873, -204037, -180628, -109127, -48830, 246, 25185, -41127, -18363, -22474, -98111, -150310, -135071, -120945, -208645]
20758b08645l049J32393L5778o6806P609J02858J9336n4802L492n7836o51J18529
20746B8206K1410r1442j2718m8004p2233R0062k8410R663O533m5918l1735J15406
20734e9180J37408k318k8868K6710L5890K8123n6674K3934m4062m0599l2932j12184
20722a24752j9675R8907P1199p581j7256p984n506k8294j5098m3769k6515n6534
20710a82858n5645K7937N8293J06389J04632R1143q0731n8023K6809P0934N1234
20699A60114m753m2506L3518L807j9213l0381j04029J9455m9043O829P6988P719
20687E8505n3500p1614q8029Q4132N0419N734M2462K124l2804q6003j677J9404
20675g0847M4191Q8229O3545N275j11269m8532N6663N2730j9797K0464J4949n0361
$$ y = [-208645, -211694, -79301, -43523, -110329, -102720, 138, 19474, -35328, -31836, -89672, -90323, 28206, 49616, -41826, -54544, -102548, -174781, -84719, -113129, -103466, -96933, -142851, -174586, -59180, 78228, 75910, 47042, 73752, 109642, 137765, 81091, 105025, 60963, 20364, -12568, -124752, -144427, -45520, 25679, 18098, 842, -7142, -12648, -40942, -56040, -99809, -126324, -182858, -238503, -210566, -152273, -45884, 58748, 149891, 69160, 11137, 37946, 108880, 160114, 155361, 112855, 146373, 150180, 130967, 100586, -3443, 16012, -33031, -26202, 50786, 58505, 5005, -66609, -154638, -70506, -20087, -14353, 28109, 30233, -2571, -88574, -90251, -70847, -26656, 61573, 125118, 130393, 19124, -29408, 27255, 79985, 60188, 80652, 95601, 45240]
20663D5240K7073j2693l6477m5038K7582q9467j9946L2013L4523M2512l9690q774
20651d3142K4926N4775M794L274m3142m3432j6972R6859M2493k5482L7944O1548
20639A54443j2806L3696m5395K6312n0463m7139M6783L2453N980m5410N2734q564
20627A42624n0407L3519m5239j9412o4550o1233N2295N7064L5641j26891J2592
20616c3997O6805R9811K9720J4494m1977m370n4037m0680K7597m1781j13286J7994
20604g3707Q7854p2220l9553K2103K0588k5918R2205Q7576k3811o4901l324L9798
20592D6690j2419P0344K9815k4883p1050J2423P059J31592k4338p2502m0516J00569
20580A52784K4632n976n169P4914J31654P2703N7506J9960J4596o5128o5512l5609
$$ y = [45240, 72313, 59620, 23143, -21895, 5687, -83780, -103726, -71713, -37190, 5322, -34368, -43142, -18216, 36559, 41353, 44627, 1485, -41947, -58919, 37940, 80433, 54951, 92895, 154443, 141637, 175333, 129938, 156250, 105787, 58648, 105431, 137884, 143864, 98454, 151188, 142624, 92217, 125736, 80497, 61085, -3465, -64698, -12403, 44661, 80302, -46589, -33997, 32808, 132619, 162339, 176833, 134856, 130486, 76449, 35769, 63366, 21585, -91701, -73707, 14147, -58073, -97626, -75523, -54935, -80853, 11352, 98928, 75117, 10216, 6892, 46690, 34271, 104615, 134430, 109547, 38497, 50920, 57979, 189571, 165233, 92731, 52215, 152784, 177416, 171440, 166271, 241185, 372839, 445542, 503048, 523008, 537604, 472476, 406964, 371355]
20568C71355m3942R174J11170O1174j37028l3502L3499P8778O3406K7585j35228
20557D06441j58333q5358P131K32066J03360k6181j89083m113n9819l0192J9230
20546B15149Q4771J15058N1131Q7677L4134k139o8768r6076j54517p2664j344
20535A92412Q8266M2555Q6145j1005L7317j7502p8345m3465N360J3662j4245J749
20523C02904m8340k012n9402n1916N8000J62617J23404m1667P3407o02R482l7728
20511D88147K2846O8064k5334L4281j08885j7565L6968n8696P7704J22117J0859
20500F50506N8581N3002M4278Q3336R2196Q110L6423J16782J00785J58126k179
20489A399946L1243O7527N067n0619J23258M7705k1689J69975K30619K02234Q4795
$$ y = [371355, 327413, 336587, 447757, 508931, 371903, 338401, 371900, 450678, 514084, 541669, 406441, 248108, 162750, 169881, 401947, 505307, 479126, 290043, 285930, 226111, 195919, 215149, 299920, 414978, 466109, 553786, 587920, 585781, 517013, 420937, 266420, 193756, 192412, 280678, 323233, 409378, 398373, 435690, 418188, 339843, 296378, 301738, 315400, 301155, 302904, 254564, 252552, 193150, 141234, 199234, 361851, 485255, 443588, 516995, 516393, 525875, 488147, 510993, 579057, 553723, 588004, 479119, 461554, 498522, 439826, 517530, 639647, 650506, 709087, 762089, 806367, 889703, 981899, 990009, 1026432, 1143214, 1243999, 1402125, 1399946, 1431189, 1498716, 1503783, 1453164, 1576422, 1624127, 1602438, 1772413, 2003032, 2205266, 2290061]
20478B290061J67171J9108N2904N7776J52046J43308J98569K01066J80946J41043
20468C603998K14883K54919J79613K73895L76812M74663M79815O06553O82038
20459G147189O67464R52090J206108J351482J759598K198902L014850M314652
20451B2612335O018730Q479187J2291526J6717240J8859400J4710077N205559
20444A04894054m919905j1338490j1989706q937151m165964J429099P742340J3509857
20436H6224134J4947264Q981103j566477j1512315j6567323j6016571j3067574
20429E1422241r695169o574555m064840k202163p17897P58290K400539M189171
20421C5515617O916391J0975020J5854225J8910007J6027828O687106m056217
$$ y = [2290061, 2457232, 2476340, 2529244, 2587020, 2739066, 2882374, 3080943, 3282009, 3462955, 3603998, 3818881, 4073800, 4253413, 4527308, 4904120, 5378783, 5858598, 6465151, 7147189, 7814653, 8766743, 9972851, 11324333, 13083931, 15282833, 18297683, 22612335, 28631065, 37110252, 49401778, 66119018, 84978418, 99688495, 104894054, 99974149, 88635659, 76645953, 67708802, 63542838, 64971937, 72714277, 86224134, 101171398, 110152501, 108586024, 97073709, 80506386, 64489815, 51422241, 41727072, 35152517, 31087677, 28885514, 28167617, 28925907, 31326446, 35515617, 42432008, 53407028, 69261253, 88171260, 104199088, 110886194, 106829977]
20414A06829977j1686486j3252869j0332015n656494R0941O495029J2547252J4925538
20406I9960873J0126986k40484j0897170j7116501j7447398j4851427j1487000
20399C8047879q398043o019706m275052l179738k411921j876939j411254j226985
20391I248241j017984p00169o19267m64025m07009l46404k44337l89087m51427
20382D608532m20265k24267q1712j27740j93759j12497j41029j37916p5494j46931
20372B946922j40469k29158j77273k13928p3821N4888j45006p5989K7242J14701
20362B088109r48j57303k68645j64847j61449j43964j31455m1912p9926n6487
20352H81173k3871j41242J0053J28644m2194K0880L8284l3913k419j4339k9136
$$ y = [106829977, 95143491, 81890622, 71558607, 65902113, 65993054, 72488083, 85035335, 99960873, 110087859, 109847375, 98950205, 81833704, 64386306, 49534879, 38047879, 29649836, 23630130, 19355078, 16175340, 13763419, 11886480, 10475226, 9248241, 8230257, 7530088, 6910821, 6446796, 6039787, 5693383, 5449046, 5059959, 4608532, 4188267, 3964000, 3882288, 3754548, 3560789, 3448292, 3307263, 3169347, 3093853, 2946922, 2806453, 2577295, 2400022, 2186094, 2112273, 2167161, 2022155, 1946166, 1973408, 2088109, 2087161, 1929858, 1661213, 1496366, 1334917, 1190953, 1059498, 1017586, 937660, 881173, 857302, 716060, 726113, 854757, 812563, 833443, 871727, 837814, 835395, 821056, 791920]
20341G91920l0712j3760M7459l1514j50768q2166R7508L8612n1645p9580K825
20330E38179M8343l4063r8260k1115M1371M9531r042m1685l6769J02932O0917
20319F00339p66q5575n5652N1108j5156m8925m0166J2110Q7820j5975J1081R360
20307E09603k5454r0729o2406l2489M70L6846Q5037L1409r6279k5637M0730m766
20295C66335p4976K1399j3297J7214j8514m1417n0957N6944l0259j16379m4438
20284G1655N1130L295J3900L4388L9089q0695n6007l8103L2375Q5971O9224P4790
20272C01012k5424q8633J9386O8098J5721j25253J8585M2549l0759j53526m8965
20261g209J6996o7701Q7852N2290P0516n3656N9472M6593q5513j35452k2877Q3280
$$ y = [791920, 761208, 747448, 794907, 763393, 612625, 530459, 627967, 666579, 614934, 535354, 538179, 586522, 552459, 454199, 433084, 474455, 523986, 514944, 473259, 436490, 539422, 600339, 599573, 513998, 458346, 509454, 494298, 445373, 405207, 417317, 505137, 489162, 500243, 509603, 484149, 393420, 331014, 298525, 298995, 335841, 420878, 452287, 356008, 330371, 371101, 366335, 291359, 312758, 299461, 316675, 298161, 256744, 205787, 262731, 232472, 116093, 71655, 122785, 126080, 139980, 174368, 213457, 132762, 76755, 38652, 71027, 156998, 226222, 301012, 275588, 186955, 206341, 274439, 290160, 164907, 183492, 226041, 195282, 41756, -7209, 9787, -57914, 29938, 82228, 152744, 99088, 158560, 205153, 119640, -15812, -38689, 44591]
20249D4591p263r5617N1808M4685m849k1833P240P4720O1309o2918o9587J28622
20237A50908J6731p5046K0248j6375j1925J24760k9465j08651k8055O4350J36612
20226B44092Q6764j01432k8460K3019m1949k6121J8501q569p9331K602L9035k5823
20214A02328J16177k1091j20415k7981K0345O0624J8400N0634L6525O7951Q8786
20203C92283k7197n8369m056J89K1423Q8726J50541J39257j7571J40171m4978
20192G80419j99713r3827j3187J5554m8793J2362J69776q936p5402J5724j2606
20181E41371q9124j11777r8161n5665l2403R8316L977J155N1647m9632p2240k047
20169A85417j11178l1439Q6118O3905P8317P415m5862K3133q4328o8518k5660
$$ y = [44591, 37328, -58289, -6481, 38204, 33355, 11522, 18762, 93482, 154791, 91873, 22286, 150908, 167639, 92593, 112841, 96466, 84541, 209301, 179836, 71185, 43130, 107480, 244092, 330856, 229424, 200964, 223983, 182034, 155913, 174414, 165845, 86514, 89116, 128151, 102328, 218505, 197414, 76999, 49018, 69363, 129987, 148387, 199021, 235546, 303497, 392283, 365086, 306717, 302661, 302850, 324273, 412999, 563540, 702797, 685226, 825397, 780419, 580706, 486879, 473692, 489246, 440453, 452815, 622591, 613655, 538253, 553977, 541371, 452247, 340470, 242309, 186644, 154241, 252557, 256534, 257689, 309336, 259704, 187464, 185417, 74239, 42800, 128918, 192823, 271140, 278555, 232693, 255826, 171498, 102980, 77320]
20158G7320R3584m7786o4346o0777l6332P5260N0197k0046M8362M4956K2918P8037
20146B61347K43940K18454J00138j7398m9347j70706o8695q8540n2881j5658O794
20135C67448P0796J45877J52475J5064o1722j00998p6025m4734j512m0370j46979
20124B79320o8044j40555n6294J46865R2493k3653j8521l1651j3147n1409O5265
20113A80669J0333j00903n8848P988p816r985K7410n5319l5136J2771N3122m5445
20101b1159j8726J31117P1991m0153j38262l8475J2288q7760Q4949O2686O3188
20090H1684L6303j5519N2462M4408p6712j29779m8298K674Q6200J37218P3675
20079B44316j3796q2821k9331P2707K1962l5143L0556J4716j02833K0538Q894
$$ y = [77320, 170904, 123118, 58772, -2005, -38337, 36923, 87120, 67074, 115436, 160392, 183310, 261347, 505287, 723741, 823879, 806481, 757134, 586428, 517733, 429193, 376312, 360654, 367448, 438244, 584121, 736596, 751660, 689938, 588940, 512915, 468181, 466669, 426299, 279320, 211276, 70721, 14427, 161292, 253785, 230132, 211611, 179960, 166813, 115404, 180669, 191002, 90099, 31251, 39239, 31423, 21438, 48848, -6471, -41607, -28836, 24286, -21159, -39885, 91232, 163223, 123070, -15192, -53667, -41379, -129139, -44190, 18496, 81684, 117987, 102468, 154930, 199338, 122626, -7153, -55451, -52777, 33423, 170641, 244316, 230520, 147699, 118368, 191075, 213037, 177894, 208450, 223166, 120333, 140871, 149765]
20068A49765R8689k9156p2033L0419j57508k2297R559R2784M9874j13066q9399
20057e2369k3253J6515O8637M1676j4656N5732J3994O5295P7970N5460m3162k7454
20045B34385L2018m5631q0300l6068J9642Q4173J06177J1291j06192n6079N5663
20034B19079J7362j2555l6092l5632j9520j9523o6732N619N5877k6600j6117q371
20022E6795O8677M6663l5948j9867L6621l0872m626J7824J44540M5926r3388J03127
20010C35472k191q6371n9378K7268L413P9249J5589q9378q3209K0503M8178l1532
19998A77613L2065L9574j68115q1797K7894J21322j04634n255N6804J18036p4683
19987A38824j75696n4822P9729N9545o4752j2653O3793P1155J01042K3483r6703
$$ y = [149765, 248454, 219298, 147265, 177684, 20176, -2121, 7438, 100222, 150096, 37030, -52369, -75622, -59107, 9530, 51206, 36550, 92282, 106276, 171571, 249541, 305001, 261839, 234385, 266403, 220772, 140472, 104404, 124046, 208219, 314396, 325687, 219495, 163416, 219079, 236441, 223886, 187794, 152162, 132642, 113119, 46387, 52006, 107883, 81283, 65166, 56795, 125472, 172135, 136187, 116320, 152941, 122069, 117443, 135267, 279807, 325733, 232345, 335472, 333281, 246910, 187532, 214800, 218213, 297462, 313051, 223673, 140464, 160967, 209145, 177613, 209678, 249252, 81137, -660, 27234, 148556, 43922, 38667, 95471, 213507, 138824, -36872, -91694, -11965, 47580, -17172, -29825, 33968, 105123, 206165, 229648, 132945]
19976A32945m4497O336O6397j31154l9627J87429N4693j25956N388P3145k4920
19965A60179p5127M6246N0710J07251o5366j12592m4381P8762l9041p1451k3662
19954A1528O4668N2504q5055j04004P3458P3127l1172p3707k97N0335j6437O0205
19942G5153R0562K2499m0683L5919O8038l2600j06812j05428K9679J82581Q1080
19931B99988l7091l2768q3533l5463N266k5901l9204o1164M5134P7198J00907
19920B13369J7144P0760L734j5165p1930O8947N6164j14602K7850K1538K6158
19909C03967j74140n1576J7500r405O468l9946o5430k3083K351P7424J2158l366
19897E2922l3059J10823Q2722r773l4931o1717j23432J26459J2546k0080n5639
$$ y = [132945, 88448, 94784, 161181, 30027, -9600, 177829, 232522, 106566, 111954, 185099, 160179, 85052, 131298, 182008, 289259, 223893, 111301, 66920, 145682, 106641, 35190, 11528, 76196, 128700, 43645, -60359, 13099, 86226, 55054, -18653, -18950, 31385, 14948, 75153, 165715, 188214, 147531, 183450, 251488, 218888, 112076, 6648, 36327, 218908, 299988, 262897, 230129, 146596, 111133, 116399, 90498, 51294, -9870, 35264, 112462, 213369, 230513, 301273, 305007, 289842, 217912, 286859, 343023, 228421, 256271, 277809, 303967, 129827, 78251, 95751, 86346, 92814, 52868, -12562, -35645, -33294, 44130, 56288, 52922, 19863, 130686, 213408, 203635, 168704, 106987, -16445, 110014, 122560, 102480, 46841]
19886D6841L0263J48738N1328O6372L119m561j2890Q1364J22574j53611k9128
19875C50409L9207p448J2317l4605J47275R6356O6441n125K3928K1056o0166o9823
19863E79822j47257j14977q42L5243J34756P7498M590k2892k3570q175j45639
19852C68557j32785k0553l3072J4354J05771L9441o1111n7940M6611J434J29776
19841D00483J37035K9611P8405O7003l0750l5031l0910k3624L8136P6633M9088
19830G56079K842O2605N5690m6512K7082j27497j76882j33625K3218l9387r8807
19819C04806o7757n632J5018Q0530Q7256j12524r1157n093N9570R2217O35j23488
19807B34381N3824J16793J13067J29360R2579Q7621j01938r6862j05273m0088
$$ y = [46841, 77104, 225842, 277170, 343542, 346661, 342100, 329210, 410574, 533148, 379537, 350409, 389616, 382168, 394485, 359880, 507155, 603511, 669952, 664827, 688755, 709811, 649645, 579822, 432565, 317588, 316746, 351989, 486745, 564243, 568833, 545941, 522371, 514196, 368557, 235772, 215219, 182147, 196501, 302272, 341713, 280602, 222662, 269273, 270707, 400483, 537518, 567129, 645534, 712537, 681787, 646756, 615846, 592222, 630358, 706991, 756079, 758921, 821526, 877216, 830704, 857786, 730289, 553407, 419782, 443000, 403613, 304806, 237049, 231417, 246435, 326965, 414221, 301697, 210540, 205447, 265017, 357234, 357869, 234381, 288205, 404998, 518065, 647425, 740004, 827625, 725687, 628825, 523552, 483464]
19797D83464J74786J46066J89402M27796O55631O42187K97589r8112k87895m09080
19787B221834n26812l89596l32103j72999J8045r7787j05328j98398q3689N9379
19777C92546J20041P2779l9782p3733r9498Q8739L3006J1653k7833l5485K7490
19766D69923n8310o5925R7357P9051l4733p1814M2787M9695M916q1596q9088J3028
19754C55291J19309K04403M5187q8715p2953K3578n9906n9896l7570M686K422
19743D35836K21654K57100O1076p2371j22310k8488o8134j38452m4817l5287n9356
19732D06451j0063O2765J18198r625j7722j6471J10568n30l1626R684L3006R0627
19720G45262r0860j1732J36785R2066k5492J0755P3493P2135L3045N309j3013
$$ y = [483464, 658250, 804316, 993718, 1421514, 2077145, 2719332, 3016921, 2918809, 2630914, 2221834, 1695022, 1305426, 973323, 800324, 818369, 720582, 615254, 416856, 333167, 392546, 512587, 585366, 545584, 471851, 372353, 461092, 494098, 505751, 477918, 442433, 469923, 411613, 345688, 443045, 522096, 487363, 415549, 458336, 508031, 512947, 431351, 342263, 355291, 474600, 679003, 724190, 635475, 562522, 586100, 526194, 466298, 428728, 433414, 435836, 657490, 914590, 975666, 903295, 780985, 752497, 684363, 545911, 501094, 465807, 406451, 396388, 459153, 577351, 567726, 550004, 533533, 644101, 643571, 611945, 621629, 654635, 745262, 654402, 642670, 779455, 871521, 846029, 856784, 930277, 1002412, 1035457, 1040766, 1027753]
19709A027753R8240P9822J29334R4751J37556K56924M04119K77497K90628L14433
19699C111057P9764K6777k3792N6253K61415M25732N46093O83233P45899Q98957
19689F811388J027039J068875J206415J563102K117674L207330M918972P830618
19681B9751413J2785099J9929038K4744173K1376793J0867734n107532j5086251
19674I9260467j8497719j5150183q563849j167936P504158J6491790K0198852
19667A00075580J5060568K759819j2274268j9870476k1359014j7358137j2639254
19660C4394818q678644n812158l713825k397856j726968j257105j070143q94583
19652H843536q49677m72078j28512N0357j67644k09460q1743r4725J4256K4044
$$ y = [1027753, 1125993, 1205815, 1335149, 1429900, 1567456, 1824380, 2228499, 2505996, 2796624, 3111057, 3190821, 3217598, 3193806, 3250059, 3511474, 3937206, 4483299, 5166532, 5912431, 6811388, 7838427, 8907302, 10113717, 11676819, 13794493, 17001823, 21920795, 29751413, 42536512, 62465550, 87209723, 108586516, 119454250, 114346718, 99260467, 80762748, 65612565, 57048716, 55880780, 63384938, 79876728, 100075580, 115136148, 117895967, 105621699, 85751223, 64392209, 47034072, 34394818, 25716174, 19904016, 16190191, 13792335, 12065367, 10808262, 9738119, 8843536, 7993859, 7521781, 7393269, 7443626, 7275982, 7066522, 6984779, 6890054, 6904310, 6928354]
19642F928354J67088L29241M70387P06127Q31941Q40946J049770J384801J763882
19633A4472537K773338M301211O708146J0961128J7696005K5001864K6157755
19626A08071984J8600321K991236j2517463j9528127j9292170j3004594n348157
19619E9973030L276620J3122309K0623690J9587695J0457214n954491j8280777
19612A02805290k3260450k1446339j5984678j1294514p744384m979964l287234
19605A4807727k324508j647737j330432j337920j140275q67889p26092o00662
19597D832212m58515k43128r8147j2785l7712j76798k29534l23608m21979k33517
19587B596489k48488k47839j20239j67074j62598j46173j00763L051r1188r2529
$$ y = [6928354, 7095442, 7424683, 7895070, 8601197, 9433138, 10274084, 11323854, 12708655, 14472537, 17245875, 21547086, 28255232, 39216360, 56912365, 81914229, 108071984, 126672305, 129663541, 117146078, 97617951, 78325781, 65321187, 59973030, 63249650, 76371959, 96995649, 116583344, 127040558, 121086067, 102805290, 79544840, 58098501, 42113823, 30819309, 23074925, 18094961, 14807727, 12483219, 10835482, 9505050, 8167130, 7026855, 6158966, 5432874, 4832212, 4373697, 4130569, 4032422, 4019637, 3981925, 3805127, 3575593, 3251985, 2830006, 2596489, 2348001, 2100162, 1979923, 1812849, 1650251, 1504078, 1403315, 1406366, 1315178, 1222649]
19577A222649j21086m7873n2755o8733l162l9274m4243l9496m6480m4266K8255
19566G43536Q044o1149j933P3417r479k4084J1169J8234q3567o5830l0142L7633
19554F15849K3521j1755j3943m8083m292L3913m3197p6993l7547r477k2848L279
19542D08427Q1763N5095L0683n9284r7370p9729k872j8151P2079L9244P2127L4220
19530E36232m8467m8636l9827o0430r6947j24827K2429J89774L794l7016j6264
19519B79815j0089l7572O4902P0784K1145P3321J3157l5373M9761L2272R1351
19508F13474p5301n4503K0296m1695K6657l0823o2240j09505m6411q3660j719
19497A54570M7152q6259j9969J9296l8976J6195K8647O644N1497J910M452q0849
$$ y = [1222649, 1101563, 1053690, 1000935, 932202, 929040, 889766, 845523, 806027, 759547, 715281, 743536, 751580, 690431, 688498, 761915, 752436, 728352, 739521, 757755, 674188, 608358, 578216, 615849, 639370, 627615, 613672, 565589, 561297, 595210, 552013, 475020, 437473, 427996, 405148, 408427, 490190, 545285, 575968, 516684, 419314, 339585, 336713, 318562, 390641, 429885, 502012, 536232, 487765, 439129, 399302, 338872, 241925, 117098, 139527, 329301, 333095, 296079, 279815, 269726, 232154, 297056, 367840, 388985, 462306, 475463, 440090, 489851, 522123, 613474, 538173, 483670, 503966, 462271, 488928, 458105, 395865, 286360, 239949, 156289, 154570, 201722, 115463, 95494, 114790, 75814, 92009, 120656, 127300, 178797, 180707, 185159, 104310]
19485A04310M4898K1253J310M5287n6994K082n8037j40992K4056R6688J30457
19474B14318M2375j3239j21531l8449j9519J738r175K3189R092k0323J7081Q0885
19462A66442j865m6335j23766q646O2108Q2040L9350n992r8944j745j990j13280
19450e2623o1762P1761J8587M1253L1109N8363R7009m074n5097l533Q9696J1108
19438B41797m1906r878O6461k3265n3752j01991o0454k9110K7871J26309L4640
19427A76722j28029l7810P0084R2151L3372J4458k1831r9072l098O4065j622m6519
19415A12871o5709r529N4146Q482J3318J14882m5649L2651J6541J8423L0520n8231
19403B22716L6097j00262N9199O8574j1368o2310p819m4521N2256J03759L5797
$$ y = [104310, 149208, 170461, 171771, 217058, 160064, 162146, 104109, -36883, -12827, 83861, 214318, 256693, 243454, 121923, 83474, 63955, 65693, 56518, 79707, 88799, 68476, 85557, 166442, 164577, 118242, -5524, -14170, 47938, 129978, 169328, 163336, 64392, 62647, 60657, -52623, -114385, -42624, -24037, 17216, 48325, 106688, 203697, 199623, 144526, 140993, 230689, 241797, 199891, 190013, 256474, 233209, 179457, 77466, 17012, -12098, 15773, 142082, 176722, 48693, 10883, 80967, 173118, 206490, 220948, 199117, 100045, 96947, 161012, 159390, 112871, 47162, 37633, 91779, 100261, 113579, 228461, 182812, 215463, 232004, 250427, 280947, 222716, 258813, 158551, 217750, 286324, 274956, 212646, 204827, 160306, 212562, 316321, 352118]
19392C52118p0626q8195l2858M7418K4007j5069P4998O4951L4395J74060K52416
19381H17615L39221L18601P3251j38829k82565l01163k64606k02013j39710m6987
19371A72815o2741L8332Q0656Q170m0403n1683J9238J00381J07280J07485l1554
19360D47976j33145j13154L2272J34708j8720j17404P2492Q2749q6725r8546l4980
19349A67523Q8802j4510O0300P7605j6923j30419j7494Q7825N552m2669l4745
19338B30847M4552L4656J8389M1311J48704M8558j54212K636L893N6834J10782
19327E86950O719m5259N53L7458o0685q4495k3341N1012L9752M4217L2453O2902
19315F48236k6917q545l8421j859Q9181M9973j17367k8120J4069r091R5642J1765
$$ y = [352118, 281492, 193297, 160439, 207857, 231864, 216795, 291793, 356744, 391139, 565199, 817615, 1156836, 1475437, 1548688, 1409859, 1127294, 826131, 561525, 359512, 219802, 172815, 110074, 148406, 229062, 237232, 196829, 145146, 164384, 264765, 372045, 479530, 447976, 314831, 201677, 233949, 368657, 349937, 232533, 305025, 387774, 301049, 202503, 167523, 256325, 241815, 302115, 379720, 362797, 232378, 214884, 302709, 308261, 265592, 230847, 275399, 310055, 328444, 369755, 518459, 567017, 412805, 415441, 419334, 476168, 586950, 593669, 548410, 548963, 586421, 525736, 441241, 417900, 468912, 508664, 552881, 585334, 648236, 621319, 612774, 574353, 572494, 661675, 711648, 594281, 566161, 580230, 571139, 666781, 678546]
19303F78546Q3950J00911p078J23819J29475M1014O2604O785n2584J4633J50212
19292A332287J70077K17625L05822L29828L50434N22783O42158N35201L40868
19283D747083J29680j56933l65811k99673K6517M5151J57420M70808O29012O65569
19273F048823R08304J311725J778070K399403K921736K767854K323983J782781
19265B2242679J760750K309257L692530N875894Q657783J2501509J8943333L1196709
19257A07180444N2867813Q1131107R8565210Q5277918L8551298k4923880p1620379
19250C67029531q8187808p9308404n9235403m1075285k7461909j8135560j2200186
19243D1424976q214864n545282l531626k174572j413866j159996j365612j751834
$$ y = [678546, 762496, 863407, 856329, 980148, 1109623, 1150637, 1213241, 1220026, 1167442, 1182075, 1332287, 1502364, 1719989, 2025811, 2355639, 2706073, 3228856, 3871014, 4406215, 4747083, 4876763, 4719830, 4354019, 4054346, 4080863, 4126014, 4283434, 4754242, 5383254, 6048823, 6957127, 8268852, 10046922, 12446325, 15368061, 18135915, 20459898, 22242679, 24003429, 26312686, 30005216, 35881110, 44538893, 57040402, 75983735, 107180444, 160048257, 241179364, 339744574, 425022492, 463573790, 438649910, 367029531, 278841723, 199533319, 140297916, 99222631, 71760722, 53625162, 41424976, 33210112, 27664830, 24133204, 21958632, 20544766, 19384770, 18019158, 16267324]
19235A6267324k077310k125642j782570j395405j024978p32030o04855n62326
19227E962208k99860l1772J08308J43769R3783m9955m12823p48285p92242n80387
19217C392744m29171k59265r4869j41973k33549m4811j19514j40500K2841j28796
19207A823137j88907r7742j07241N0026O3012o1798j49902l1176l6836m1347l0153
19196A191073p9616q0386J0529q5867o0844n3067O3054N6514k7710j4084m2358
19185H77238l2440N8151q4771n2956K5674J5575L3054R351l9784M843m5602K8368
19173G96701k0482m0380J1067j15451m7846J14582N6713j1576p0337q229q4393
19162E80369J8558L6501R852q438r40P320L7696P1175M5264N2442K03167j2861
$$ y = [16267324, 14190014, 12064372, 10281802, 8886397, 7861419, 7129389, 6524534, 5962208, 5662348, 5630576, 5738884, 5882653, 5976436, 5926481, 5513658, 4765373, 3973131, 3392744, 2963573, 2704308, 2609439, 2467466, 2233917, 2189106, 2069592, 1929092, 1951933, 1823137, 1634230, 1536488, 1429247, 1479273, 1542285, 1480487, 1330585, 1299409, 1262573, 1221226, 1191073, 1111457, 1031071, 1041600, 955733, 894889, 841822, 904876, 961390, 933680, 919596, 877238, 844798, 902949, 818178, 765222, 790896, 806471, 839525, 848876, 809092, 813935, 768333, 796701, 776219, 735839, 746906, 631455, 583609, 698191, 754904, 743328, 672991, 664762, 580369, 598927, 635428, 645280, 636842, 635902, 643222, 680918, 752093, 797357, 849799, 1052966, 1040105]
19150A040105j61779j00887R9409m4560K074J39638J04492k2354L4786j2928K4434
19139A102430j22162j85187r6336O2011r7368p1171N4851m8018o0986J18140J63757
19128H19961P3369j53406j98046q2249l5946n2290O2891R8856N6292o3933j11939
19117D13560j03007j7205J09147K3832n3219o1090J4231j4285n5545M232k0748
19106B39903L6992Q1863J24434P0388J06526R8117m2206j45887n2804j08139j25938
19095B83249N8206N4228J99613K17426K1389J0014j29302o4147k1507q9349j07076
19084D32744n0356j2179m7871o9349L5758N0390j06038r5745N130J08572l918
19073B47138q4466J9110j3592p930l3430j983Q5033O8291q9646o8459k552K2839
$$ y = [1040105, 878326, 777439, 876848, 832288, 834362, 974000, 1078492, 1056138, 1090924, 1077996, 1102430, 980268, 795081, 698745, 760756, 663388, 592217, 647068, 599050, 538064, 656204, 819961, 893330, 739924, 541878, 459629, 423683, 371393, 434284, 533140, 589432, 525499, 413560, 310553, 293348, 402495, 426327, 373108, 312018, 326249, 311964, 256419, 260651, 239903, 276895, 358758, 483192, 553580, 660106, 758223, 716017, 570130, 517326, 409187, 283249, 341455, 395683, 595296, 812722, 834111, 844125, 714823, 650676, 629169, 539820, 432744, 382388, 370209, 322338, 252989, 288747, 339137, 233099, 137354, 142484, 251056, 247138, 162672, 181782, 168190, 160260, 126830, 124847, 209880, 278171, 188525, 120066, 117514, 140353]
19061A40353l9468K4149N9854o630K2787J05146o0110n4180l812J748K1883o0756
19049A50964k3786q2887K4111P1246p7293n2018L1926L150Q6698Q7588O8477r064
19037B79112r3836j0649j3155n4043n8081M6180J01575k4499j11347J3927j5303
19026E9881M4927J09717K4616m9333q5575N0526O8545O9330p9951q5984l1602
19015I5097N1597o6783r0686N6599M9428O206j184j01929j0665J30691p64L5536
19003A53143N9984J9703j4435j62798L1187L3960j2661R7957L9147k2118j10480
18992A12589K1002O2520M7040O4297J4683m2211n6696l4329P4722k2398p7702
18981A63517n6427j4860l1715k8406J43176Q0706m245m7158M2024j2312j6588
$$ y = [140353, 100885, 125034, 184888, 178258, 201045, 306191, 246081, 191901, 188089, 189837, 211720, 150964, 127178, 44291, 68402, 139648, 62355, 10337, 42263, 45413, 132111, 219699, 288176, 279112, 185276, 174627, 161472, 107429, 49348, 95528, 197103, 172604, 61257, 75184, 59881, 104808, 214525, 239141, 189808, 104233, 154759, 223304, 292634, 212683, 126699, 95097, 146694, 79911, -10775, 45824, 95252, 101458, 100274, -1655, -12320, 118371, 117607, 153143, 213127, 232830, 218395, 55597, 86784, 120744, 108083, 206040, 245187, 223069, 112589, 133591, 196111, 243151, 307448, 322131, 279920, 223224, 188895, 263617, 241219, 163517, 107090, 92230, 60515, 32109, 175285, 255991, 251746, 204588, 246612, 234300, 217712]
18970B17712J2892p5883k3684n5299l4366K4620j06947r4175O5596J70583k4567
18959G6482K0900o6101r4858J30241J00740j06560K6518K2726q0323k7031L4826
18948C7560N7336L9101m8532r77n5472P412j1118R6881N8347k8386l318J5450
18936A64284o123m9366j8330J09230l4867o4916k8564m3186Q7363R2010j6109
18925A91426r4463N77p316m349O5201o9582L0428n5K2572m4880k4795j0405J22572
18912A76931n1432r0666n2890p7211R8813J32996N3392j2743p5034j3393N1081
18901A39844K7903J58207K04981J44296P8158M753o0875n4035r9647q8888j68114
18890B86583j28203l2699P85j0244j20777q5537q780J8890O4505R4606M188j5487
$$ y = [217712, 230604, 154721, 131037, 75738, 41372, 65992, -40955, -135130, -69534, 101049, 76482, 97382, 31281, -63577, 66664, 167404, 60844, 87362, 110088, 29765, 2734, 37560, 94896, 133997, 85465, 84488, 29016, 36428, 25310, 122191, 180538, 152152, 148834, 164284, 158161, 108795, 90465, 199695, 164828, 99912, 71348, 28162, 115525, 207535, 191426, 96963, 97540, 90224, 85875, 151076, 81494, 111922, 111867, 134439, 89559, 64764, 54359, 176931, 125499, 34833, -18057, -95268, 3545, 136541, 189933, 177190, 102156, 88763, 139844, 167747, 325954, 530935, 675231, 753389, 758142, 697267, 643232, 543585, 454697, 286583, 158380, 125681, 126466, 116222, -4555, -90092, -98872, -79982, -15477, 79129, 83317, 67830]
18878F7830r253R987O9351j2576m9000j1978J16591J51791J47561J06366J03273
18867F89943O1574j62403q9460o9447j95001L2557P878n0361K1878k5982m386
18856B16790o5063J4807l1856J5185O0321L0636J09411K097N0120J17014J62113
18845F81575P0745r1567j48203j02740q9444n8477l0034j09111r5123M118N259
18834C6998K9948l0846K3613k0881J7329N6402m6007m9841m1207Q6976N916j1495
18822E6905P6520P1529J43095J11728J18292J31798N0903j32382j00479o0814
18812D67095r7352k7756l5413J4542m1776r4793m049j29390k4575O0648P2276
18801A59457J871k1117n674p048n6295j22765Q1390M0148j0543J0276k2603k4765
$$ y = [67830, 58577, 68564, 137915, 125339, 76339, 64361, 180952, 332743, 480304, 586670, 689943, 751517, 589114, 499654, 430207, 235206, 267763, 275641, 225280, 247158, 221176, 216790, 151727, 166534, 134678, 149863, 210184, 240820, 350231, 352328, 402448, 519462, 681575, 752320, 660753, 512550, 409810, 320366, 261889, 231855, 122744, 27621, 31739, 36998, 66946, 36100, 59713, 38832, 56161, 112563, 66556, 16715, -24492, 62484, 68400, 56905, 133425, 204954, 348049, 459777, 578069, 709867, 760770, 628388, 527909, 467095, 369743, 341987, 306574, 321116, 279340, 184547, 180498, 51108, 26533, 87181, 159457, 161328, 140211, 134537, 127489, 71194, -51571, 29819, 69967, 59424, 69700, 47097, 22332]
18789B2332O1216J5987P1787K9962j34892j15716K1606L7694M4100P0781j4827
18778A10030m3314J39240k101N4703L6614r0993l8837O7732L4278Q1505K01437
18767E50294K60279J55078N9746K0115j63637j73604j93516r2794k3306j03177
18757B95478n8521l3850L3472r3698j08024o9535j04927j5338Q5911J07412p989
18746C0391K3262j4596m4444L8047O7830k5736J3554j1189M9358n7189O8646Q0121
18734B18055j0004q5138n9379L9128J47560P6695o4618m9912L7362q290K993K1010
18722B65462j3310k4570k0946P0085J54686J39852R5198N4251P5494L09156M25339
18711A530697M71816L12795J06700p6967k59274m94671n34629l89639j56828q2434
$$ y = [22332, 83548, 99535, 171322, 201284, 66392, -49324, -27718, 9976, 54076, 124857, 110030, 66716, 205956, 203855, 258558, 295172, 204179, 165342, 233074, 267352, 348857, 550294, 810573, 965651, 1025397, 1045512, 881875, 708271, 514755, 421961, 398655, 295478, 236957, 203107, 236579, 142881, 34857, -34678, -139605, -154943, -69032, 38380, 30391, 53653, 39057, -5387, 32660, 100490, 74754, 88308, 77119, 126477, 69288, 137934, 218055, 208051, 122913, 63534, 102662, 250222, 326917, 262299, 212387, 249749, 241459, 244452, 265462, 252152, 227582, 206636, 276721, 431407, 571259, 666457, 720708, 796202, 1105358, 1530697, 2002513, 2315308, 2422008, 2345041, 2085767, 1591096, 1056467, 666828, 510000, 427566]
18701D27566j83531n3730k3217o5908K6944m7130P266P8110o9100l7197k4538
18690C5535P294q4512J0902k5316N6520K10O5570Q0636o3135p0034Q2595j2239
18678H4026m5545k882J7290j0251P6397O7061O5339j16715o1242l0825r3287k4489
18666g5123L6573n874k8880J44344O0234j40308m7763r049k3108o3250m4580L9261
18654a57523J48278O0490k1507L0355J12398k5578k9071J8495k5866L5316O4046
18643B09833M9321K3099J28979k288o0038n1363L2509p2348q6632N9813J22218
18632C53103j4701P4750k1882r6069k4787k3834r8692j70096r787P5138J07407
18621A50550N8248k9551o3285p310l3349L929N3210l2450m1400j0833k3029R184
$$ y = [427566, 244035, 190305, 167088, 101180, 128124, 80994, 88260, 166370, 97270, 60073, 35535, 42829, -41683, -30781, -56097, 423, 633, 66203, 146839, 83704, 13670, 96265, 84026, 38481, 35599, 52889, 42638, 119035, 186096, 251435, 134720, 73478, 42653, -50634, -75123, -38550, -44424, -73304, 71040, 131274, -9034, -56797, -65846, -88954, -152204, -196784, -157523, -9245, 51245, 29738, 60093, 172491, 146913, 117842, 136337, 110471, 145787, 209833, 259154, 282253, 411232, 408944, 348906, 297543, 330052, 257704, 171072, 230885, 353103, 338402, 413152, 391270, 295201, 270414, 246580, 147888, -22208, -31995, 43143, 150550, 208798, 179247, 115962, 108652, 75303, 79232, 132442, 99992, 58592, 47759, 24730, 33914]
18609C3914O019j6237j02896O0255J12047P4130l0015K9771M7966N8772l5541
18598B38185o3739O6654J7526n9483J3740L6846N673r828M3802l1776L9336L5437
18586C32373L0603J0709j4392N585J21150j5176q3066J2694j14220j52875q520
18575A24865o4917n1653K726k1137o3585m8198N5975N3405L7865m0732o3767K2073
18563e7080L7366J3440K3487o1026j5362J8956q165R0229P3811P7161K3024l3664
18551A82177m2745n2522K0222Q2655j5643N5330l6716j36760J0895k2861j00831
18540e6799L0430L2598j6652o212o898l9131J73287J64422M5093r0256p3668J1289
18528A67503o5588o8459J4852J65706J91479Q0798P5258o5389j18227J2841o5830
$$ y = [33914, 39933, 23696, -79200, -18945, 93102, 167232, 137217, 166988, 214954, 273726, 238185, 174446, 241100, 258626, 199143, 212883, 249729, 255402, 245574, 289376, 257600, 296936, 332373, 362976, 373685, 359293, 364878, 486028, 470852, 387786, 400480, 286260, 133385, 124865, 59948, 8295, 11021, -10116, -73701, -121899, -65924, -12519, 25346, -15386, -79153, -57080, -19714, -6274, 17213, -43813, -59175, -40219, -48384, 41845, 115656, 192817, 215841, 182177, 139432, 86910, 107132, 189787, 174144, 229474, 192758, 55998, 66893, 44032, -56799, -26369, 6229, -10423, -16635, -23533, -62664, 110623, 275045, 320138, 229882, 156214, 167503, 101915, 33456, 48308, 214014, 405493, 486291, 561549, 496160, 377933, 390774, 324944]
18517C24944p352m7976j03461r3288K9568k7375k4026M05M8252J38083K60J1858
18505B49892O6489K02743O2031p7764r7270j72337p7487J7000j4388O3459q6960
18494A35408K8454K4982l4823P007N551l4262K0898k4504k7837L218L329N7834
18482A65255L5108l9215m8066R1435J06566K5571J7749Q5069O6515j11607p0294
18471C24086j55745J3306p419j23127j53759M8502M4451q8666J3028J08969K6523
18460E0149j7160J00129K4620L5923n2446L392J44044J22664L0988j60163o3619
18449B18521L6304O536m5242j8036o1065m138J4538K3530N8742n2409l6305k7712
18437A13264M9278N4952J05408r317n7078l5016Q5280J19926N7976m6549n3221
$$ y = [324944, 317592, 269616, 166155, 72867, 102435, 75060, 51034, 51439, 99691, 237774, 238034, 249892, 316381, 519124, 581155, 503391, 406121, 233784, 156297, 173297, 158909, 222368, 135408, 163862, 188844, 154021, 161028, 166579, 132317, 153215, 128711, 100874, 104092, 107421, 165255, 200363, 161148, 113082, 204517, 311083, 336654, 354403, 439472, 505987, 394380, 324086, 168341, 181647, 174228, 51101, -102658, -54156, -9705, -98371, -85343, 23626, 50149, 32989, 133118, 157738, 193661, 141215, 144607, 288651, 411315, 442303, 282140, 218521, 254825, 261361, 216119, 198083, 137018, 132880, 147418, 170948, 229690, 177281, 140976, 113264, 162542, 217494, 322902, 313585, 256507, 221491, 306771, 426697, 484673, 438124, 384903]
18426C84903P2323J29655J42657J03348j56562n3635r3118k8562j6359J6638l1537
18415D69751R934Q4326Q1132Q8385Q12J04739J19624J6500L6209P9518K18013
18404A308943K44739J83122J12919N9780N1543M5337M6272N8539J59063J27923
18394B398180L14331M52456O32083Q16655Q59099Q83576J012444J173084J751862
18385A0293770K415806L544674N229221Q090733J3399775K2134119L0729051K6809906
18377A22647055Q058238j0958870k4441958k4691901j9239371j4202941r876472
18370B7293780o528879m268293k829737j927300j168772p52501l52810j05738
18362I359750J541K77768N40669O51188Q74956J286197K081710L155744M804726
$$ y = [384903, 457226, 586881, 729538, 832886, 676324, 622689, 529571, 501009, 484650, 501288, 469751, 479685, 564011, 645143, 733528, 734340, 839079, 958703, 975203, 1011412, 1090930, 1308943, 1553682, 1736804, 1849723, 1909503, 1961046, 2006383, 2052655, 2111194, 2270257, 2398180, 2712511, 3164967, 3797050, 4613705, 5472804, 6356380, 7368824, 8541908, 10293770, 12709576, 16254250, 21483471, 29574204, 42973979, 65108098, 95837149, 122647055, 130705293, 119746423, 95304465, 70612564, 51373193, 37170252, 27293780, 20764901, 16496608, 13666871, 11739571, 10570799, 9818298, 9465488, 9359750, 9361291, 9639059, 10179728, 10830916, 11705872, 12992069, 15073779, 18229523, 23034249]
18353B3034249P337113J1955144J9764581K8440313K7666265J0818566q045107
18346A20971124k2676185k5053457j9775877j4463261r827249o345276m033514
18339A8796305k461548j333831o28115l8026N41910J222681K090120L373826N513274
18330B7076596R275208J5835286K4829920K8657495J6692488j919242j7894553
18323A02553198k4477086k0691004j5551483j1052821p484614n078969l397097
18316A4820124k330386j613668r13471n44016l77343j4797K59346K24637L79348
18307I889774P04869R65687J527567K365520L419601N251671Q382299J4224987
18299D6731975K2685297K8062553J8929628O62900j5599972k4054576k1176196
$$ y = [23034249, 30371362, 42326506, 62091087, 90531400, 118197665, 129016231, 120971124, 98294939, 73241482, 53465605, 39002344, 29175095, 22829819, 18796305, 16334757, 15000926, 14372811, 14334785, 14876695, 16099376, 18189496, 21563322, 27076596, 36351804, 52187090, 77017010, 105674505, 122366993, 120447751, 102553198, 78076112, 57385108, 41833625, 30780804, 23296190, 18217221, 14820124, 12489738, 10876070, 9962599, 9418583, 9041240, 9026443, 9285789, 9510426, 9889774, 10594643, 11560330, 13087897, 15453417, 18873018, 24124689, 32506988, 46731975, 69417272, 97479825, 116409453, 117072353, 101472381, 77417805, 56241609]
18292E6241609j5882116j1479634p814037n067051l404771k470390j756075j229411
18284G138124p66251n63709o09416n63706m90203l77946k68677j91718j48893
18275C157605j25647n5516K6231j16128j80284j62180k70134k24134j73662j46525
18265A729626n6647j50766j54539o1942O3489l0575o3181n7319J6727K71J2612
18254A247756j6388j4988k7432j4012j7384r3985q5596l8216J1401L7114l8517
18243I49753j8247k3946J3912n558L6097m3683k5702K5575R8846J64330k5456
18232A145921j09809j41445j35706j7801p385J9222k5051K4537N2123K8974n7830
18221G75750k01834j06822Q999Q010r7499K9859L6591q34k1115K3551P9690M6187
$$ y = [56241609, 40359493, 28879859, 21065822, 15998771, 12594000, 10123610, 8367535, 7138124, 6371873, 5808164, 5198748, 4635042, 4144839, 3766893, 3498216, 3306498, 3157605, 3031958, 2976442, 3002673, 2886545, 2706261, 2544081, 2273947, 2049813, 1876151, 1729626, 1672979, 1522213, 1367674, 1305732, 1369221, 1338646, 1275465, 1218146, 1234873, 1235144, 1247756, 1231368, 1216380, 1188948, 1174936, 1157552, 1063567, 977971, 939755, 951156, 988270, 949753, 931506, 907560, 921472, 915914, 952011, 908328, 882626, 908201, 1007047, 1171377, 1145921, 1036112, 894667, 758961, 741160, 733775, 752997, 727946, 752483, 804606, 833580, 775750, 573916, 467094, 476093, 484103, 386604, 416463, 453054, 452220, 431105, 454656, 534346, 580533]
18209E80533J14904J22812K2797m5380m3679p5888J3747L3147o5954n9582q9120
18198E08337m84j5320l8477M9248N3953q7318j470p3606P7614N1935k4806M2935
18186E42541K4142m5873j8169J5769m7530p204O1695J37957K17776M2658o5729
18175H58033k12976j37416n9064L1073R5408J1677L1397n0494q8137j0755p8571
18164C90175J70464J05043Q665M0675N5796L0264n4380j762n0167O9398l2600
18153G31571o8715p270M0643m2329n972J5132j6555n4390P386k0043p670R1787
18141F63575R0768J43355K20074Q7221j07706l1005L5126O7249L2244O0270O4985
18130A326156J37865O8721K23631K93460K31260K89233K65516M67645O24993O75081
$$ y = [580533, 695437, 818249, 841046, 795666, 751987, 676099, 689846, 722993, 657039, 597457, 508337, 507853, 492533, 454056, 503304, 557257, 469939, 468469, 394863, 472477, 524412, 499606, 542541, 566683, 520810, 502641, 518410, 470880, 463676, 525371, 663328, 881104, 923762, 858033, 645057, 507641, 448577, 479650, 575058, 586735, 618132, 567638, 479501, 468746, 390175, 560639, 665682, 674347, 715022, 770818, 801082, 746702, 744940, 694773, 764171, 731571, 662856, 655586, 696229, 653900, 647928, 663060, 646505, 592115, 599501, 579458, 571788, 663575, 754343, 897698, 1117772, 1204993, 1097287, 1066282, 1101408, 1168657, 1200901, 1261171, 1326156, 1464021, 1532742, 1756373, 2049833, 2281093, 2570326, 2835842, 3303487, 3928480, 4603561]
18120D603561O74487R91783J259437J554619K064924K687559L738771N540859
18112B3116000Q718941J4728944K6693715M2590712M5431047J8173459j0388067
18105A69064751l4942694l8290606k8736677k0780404j3989100q895246n719536
18098A7710488l933397k785834k041810j468066j147219r33160q30451o13492
18090C957059m59135l32020j66127j89070j44794j82201k31590k10195K5743r4463
18080A973207j08282j52260j76798j38461j53757j27555p0534r1877l748j06046
18070H43889m082M6600j3542L7965n7391m4990N4476O7527p212j8056j06289k2260
18058G76635n4622K20K6841Q3508N1012j0060j16246r3312k0163P5618j29608
$$ y = [4603561, 5278048, 6269831, 7529268, 9083887, 11148811, 13836370, 17575141, 23116000, 31834941, 46563885, 73257600, 115848312, 161279359, 179452818, 169064751, 134122057, 95831451, 67094774, 46314370, 32325270, 23430024, 17710488, 13777091, 10991257, 8949447, 7481381, 6334162, 5401002, 4570551, 3957059, 3497924, 3165904, 2999777, 2810707, 2665913, 2483712, 2252122, 2041927, 2067670, 1973207, 1864925, 1712665, 1535867, 1397406, 1243649, 1116094, 1045560, 953683, 949935, 843889, 839807, 886407, 872865, 910830, 853439, 808449, 862925, 930452, 923240, 905184, 798895, 776635, 722013, 722233, 749074, 832582, 883594, 873534, 757288, 663976, 643813, 719431, 589823]
18047E89823j54386l1242q407J11960o3101m319k7306M1440N0622R4192m7404
18036E51872j30041L2781Q6621p0432L3039M6811P590k6054j04999j1956m3440
18025C71792J8288m4159j31661Q0288J13358o2952J7481J37353J08965k108k8985
18014E77660K6742L6149m1154m921j46168r9826o1304j08491j762K3481N4315
18003B54721J04200J7869k5932J8853q751J6854M6057m6025l6192q2529r3115
17992A66010k4736j4607J10299J42753J37423J07446O5O484j8085j26371j38596
17981C48085q7592P9788o4150j27717j2646L6023P3610l2791J3579J8983O2874
17970C08046o3771J3644J00005R019J1391j0258O3847M2077o2496o4459j9466
$$ y = [589823, 435437, 404195, 395788, 507748, 444647, 440328, 413022, 454462, 505084, 599276, 551872, 421831, 454612, 541233, 470801, 503840, 550651, 558241, 532187, 427188, 415232, 371792, 390080, 345921, 214260, 294548, 407906, 344954, 362435, 499788, 608753, 606645, 577660, 604402, 640551, 599397, 594476, 448308, 348482, 287178, 178687, 176925, 200406, 254721, 358921, 376790, 350858, 369711, 360960, 377814, 423871, 377846, 341654, 259125, 166010, 141274, 126667, 236966, 379719, 517142, 624588, 624653, 631137, 613052, 486681, 348085, 260493, 340281, 276131, 148414, 135768, 171791, 245401, 212610, 226189, 245172, 308046, 244275, 257919, 357924, 366943, 378334, 368076, 431923, 474000, 411504, 347045, 327579]
17959C27579O7867l0035j61700n1573L5097J05534J2933K8656p6678l5037p438
17948B15205L2401O5111J8191N2609j2794j10230j5465M4251J0007M3936J01574
17937D44796k6540n303q0083k0620m5427l9149K230J33557L5739o0390J1181r1272
17925B58719L1773k0200r0143L3591k2139j56108k8250J71699J80720R176p9053
17914B89785o5266N0686M4610Q0566j9607j16980j44536K4754K8237k5057K9068
17903A76260K2055j02275n4610J398J07488P0705O2791N1335l9441n0447n3524
17892A91735j33523j763J15365k5149j5292O1260Q0156O6390O0622K1578m1594
17881C79785J20107o1901j01167j26147j2417l951j00414m5779P1403k1460n3421
$$ y = [327579, 395446, 365411, 203711, 152138, 187235, 292769, 305702, 334358, 257680, 222643, 215205, 247606, 312717, 330908, 383517, 370723, 260493, 245028, 289279, 299286, 343222, 444796, 418256, 412953, 332870, 312250, 266823, 227674, 229904, 363461, 399200, 338810, 349991, 258719, 290492, 270292, 180149, 213740, 191601, 35493, 7243, 178942, 359662, 368838, 289785, 224519, 275205, 319815, 400381, 380774, 263794, 119258, 144012, 172249, 147192, 176260, 198315, 96040, 41430, 42828, 150316, 221021, 283812, 335147, 295706, 245259, 191735, 58212, 56449, 171814, 146665, 131373, 192633, 272789, 339179, 399801, 421379, 379785, 499892, 437991, 336824, 210677, 198260, 194309, 93895, 48116, 119519, 98059, 44638]
17870D4638K9394Q3840O9313J9154n8410l7443j2788j10619k8901q2318R299j5777
17858i0618R4841J15994J61095R0313J06713J88148K30988n89o8868n3579r2746
17847F81692r1114j22691r0638j39969j46976M6122k5337m4113m371N9650K6045
17836A48300J00889m7118q5566L1831M7092p2254K2251J29357N3555N3935R6643
17825D78915P8073L5278J90658J10156n3196k20935j94256o0350k4209o4729j52241
17814A23164q87K5455L0079J1434L4244M7866k2323k7850l1882n747M1049J53376
17802C77978K39089J87612K3448n4620j41618p2175r8213r6416j16989l9555j4230
17791A94311J2588K1781P2588N377r4618K5323J37108l8445R524k3453l6958K7031
$$ y = [44638, 74032, 157872, 227185, 246339, 187929, 150486, 137698, 27079, -1822, -84140, -74841, -90618, 4223, 120217, 281312, 371625, 478338, 666486, 897474, 896885, 828017, 774438, 681692, 590578, 467887, 377249, 237280, 90304, 136426, 111089, 66976, 62605, 122255, 148300, 249189, 202071, 116505, 148336, 195428, 123174, 145425, 274782, 328337, 382272, 478915, 556988, 592266, 782924, 893080, 839884, 618949, 424693, 364343, 340134, 275405, 123164, 122277, 147732, 177811, 189245, 223489, 271355, 249032, 221182, 189300, 183553, 224602, 377978, 617067, 804679, 828127, 773507, 631889, 559714, 461501, 365085, 248096, 208541, 194311, 206899, 228680, 301268, 306645, 212027, 237350, 374458, 336013, 345537, 322084, 285126, 312157]
17779C12157M9527J40323J1356r5555m7039J3715R5251J96756J32006J5180m4614
17768G79063j60383j48793q0158k8970m2449p9044j10200n9242p3844K8268J55071
17757A79319J67109Q2322M5045n6954m7765P6314q804o5062p9422k6589Q551n9588
17745B14476N1815L661p4493k8670K372K0153J21938n249P3827j7219q095j035
17733C53481j29419o1216p2298j0023O1584j8825r3804J02383K7383J31763l3287
17722B57722j626n6428o1862q6852j7637J3684o9475M2670J29683J04264j04506
17711A49637M5990Q8302J03178M3585j07129m8675o8051j16833M3641K7823N2877
17700B14345p9527m8477J0399n0235j0762M8562J621n4857l1151p1535q031J8527
$$ y = [312157, 361684, 502007, 513363, 417808, 370769, 384484, 479735, 676491, 808497, 823677, 779063, 618680, 469887, 389729, 360759, 318310, 239266, 129066, 69824, -4020, 24248, 179319, 346428, 428750, 473795, 416841, 369076, 445390, 436586, 371524, 292102, 265513, 274064, 214476, 266291, 269952, 195459, 166789, 169161, 189314, 311252, 306003, 379830, 362611, 354516, 353481, 224062, 162846, 90548, 80525, 142109, 123284, 29480, 131863, 159246, 291009, 257722, 256096, 199668, 137806, 50954, 33317, 47001, -22474, 20196, 149879, 254143, 149637, 195627, 283929, 387107, 430692, 323563, 274888, 206837, 90004, 133645, 161468, 214345, 134818, 86341, 96740, 46505, 35743, 84305, 85926, 31069, -82, -71617, -79648, -61121]
17688f1121m7272k9910P094M387J06266M0896l3968j0239O5901L2992p9317j32420
17676a36711L0475K9148K3363k0194J6837L195j8920k7807l073l66N4250m6299
17664i6102J5996R1524k8733O3335L7731K5597P8266j8246m3611j61228q565m9095
17652i3131K4315n6609K0128L7642Q6331R1715q4134L136Q6837o2332k9811k8766
17640d679k899J8933p952R2947L8924m1374o1033L4139J8636J8721J20403J38424
17628C63190Q7881q3956j38183m9081M545Q1598J09569m9646p7265j16955N2750
17617A84447n4318m5833J2900M5119k9764p8888L6515q19M4307J0650K1857l7831
17605A08342j2992p0866K0318P1496l1971K055l9255j57293N6329Q3648J8435
$$ y = [-61121, -108393, -138303, -131209, -126822, -20556, 20340, -13628, -23867, 42034, 75026, -4291, -136711, -106236, -77088, -53725, -73919, -57082, -53887, -72807, -100614, -103687, -104053, -49803, -96102, -80106, 11418, -17315, 46020, 83751, 109348, 187614, 169368, 125757, -35471, -44036, -93131, -68816, -125425, -105297, -67655, 18676, 110391, 26257, 29393, 116230, 53898, 24087, -4679, -7578, 11355, 3403, 96350, 135274, 93900, 32867, 67006, 85642, 104363, 224766, 363190, 451071, 367115, 228932, 179851, 184396, 265994, 375563, 325917, 248652, 131697, 184447, 130129, 84296, 97196, 142315, 112551, 33663, 70178, 69359, 113666, 124316, 146173, 108342, 95350, 24484, 44802, 116298, 84327, 86382, 47127, -110166, -53837, 29811, 48246]
17594D8246k4570o9824K9164M6075M0462m7650M1877m3424k4074K1241m1067j1671
17582c5215J7145K4232K6532l2990o8538L1731J5285m0413j083L3103N8857L945
17570C2591K0468m4076q1630O548J6369J20242L7405J0968k7357l2047M9471n4927
17558E4025N264J3789l5641k5173K5486j9187O6966K2790J8758k1346k3282m2797
17546C9652q7043n189K0089j8823Q9841n574j7424o0450p935J02412J9593l5484
17534C3665j2002o1971n1118M7563j524L9831J19592Q7375o353r9809n7525K3464
17522F1188r330K3219L7847k03069o6923P9780K0424K1706j6042N8193J06309
17511A13302M1622L003l976o3359p8020M6700O9851J330J4601M9171n0908j43521
$$ y = [48246, 23676, -46148, -16984, 29091, 69553, 21903, 63780, 20356, -3718, 17523, -23544, -35215, -18070, 6162, 32694, -296, -68834, -37103, -21818, -62231, -63314, -30211, 28646, 32591, 53059, 8983, -72647, -66099, -49730, 70512, 107917, 118885, 91528, 59481, 108952, 54025, 59289, 73078, 37437, 12264, 37750, 18563, 85529, 108319, 127077, 105731, 82449, 39652, -47391, -52580, -32491, -51314, 38527, 32953, 15529, -44921, -52856, 49556, 69149, 33665, 21663, -40308, -91426, -43863, -45387, -5556, 114036, 201411, 195058, 95249, 37724, 61188, 51858, 75077, 112924, -90145, -157068, -77288, -56864, -35158, -51200, 6993, 113302, 154924, 157927, 153951, 90592, 12572, 59272, 129123, 130453, 145054, 194225, 143317, -204]
17499b04j09956O641m225R3340J16480J65243P6800r363j16720j24297j20040
17488b6301k5370J45911r244n4141J9702J948M9065k670N3823P6901j17370j85282
17476g3028j4032J00352k6123j8978J2091N6458o7390j2221J0657N3722J7608
17465C9116O3561P7754l1218o7550j19367l9591n7429p609J17393J47202J8997
17454A41259o1315o7263J7877O7000J11803J02207r5983o6201k8886L0155N0523
17443B01176K67348K44423N9699R5081n810j56052j67738j24250j56144j7712
17433B40021m0738l8947n7694K9938L910o58k1825p4042k089k8440J7854N8635
17421H5925l918o2140L8737N6078m7650n0012m9862k2167q673j446l7391K397
$$ y = [-204, -110160, -103519, -107744, -14404, 102076, 267319, 344119, 334756, 218036, 93739, -26301, -51671, 94240, 84996, 30855, 50557, 52505, 101570, 98900, 152723, 229624, 112254, -73028, -87060, 13292, -12831, -31809, -19718, 36740, -30650, -42871, -32214, 21508, 39116, 102677, 180431, 149213, 81663, -37704, -77295, -134724, -142333, -24940, 122262, 141259, 79944, 12681, 30558, 97558, 209361, 311568, 215585, 149384, 120498, 150653, 201176, 468524, 712947, 772646, 867727, 861917, 705865, 538127, 413877, 257733, 240021, 199283, 160336, 102642, 132580, 136490, 135832, 114007, 39965, 37876, 9436, 27290, 85925, 82007, 19867, 58604, 114682, 67032, 17020, -32842, -55009, -63682, -65128, -102519, -100122]
17409a00122J7703L941K2296L2170L8233k035L0589N4007J19790k5698q4068m0164
17397F6642j7166m2396o4649o0090O8740O433J5088L1593J16477K6448n9766n5318
17385C2036k7192J53183m3374j3830p8646r5906J3350N5971Q444k4838l6462K5594
17373c1670o5607N5389N1782j3221M4576m2521j39318n8574O1352O3369K66084
17362A91641N4121l5507o8149l0807j12598k2539j8733j27446P873J03328l9982
17351i8798M8544Q2706m7928j7517O58K9683q224r8786j03584M7355M4368j145
17339a22668M1336L9698o1592m2435P401k0061l1357n5455N7787P6452k5j2593
17327a23512k3644n4969L5980K988j280K5069L3440O3713J30002k7925l3331m1038
$$ y = [-100122, -82419, -78478, -56182, -24012, 14221, 12186, 42775, 96782, 216572, 190874, 106806, 66642, 49476, 7080, -57569, -117659, -48919, -42486, -27398, 4195, 120672, 147120, 87354, 32036, 4844, 158027, 114653, 100823, 22177, -73729, -60379, -4408, 4036, -20802, -57264, -31670, -97277, -41888, 9894, -3327, 41249, -1272, -140590, -199164, -137812, -74443, 191641, 245762, 210255, 142106, 111299, -1299, -23838, -42571, -170017, -162144, -58816, -98798, -50254, 32452, -15476, -32993, -32335, -2652, -10876, -109662, -213246, -165891, -121523, -122668, -81332, -41634, -103226, -145661, -138260, -158321, -189678, -245133, -187346, -110894, -110919, -123512, -147156, -202125, -166145, -163157, -164437, -139368, -105928, -42215, 87787, 59862, 26531, -14507]
17315a4507k5191L016L5685J2234j33601j01145O3622O7656K1006k6528N0907
17304d6846M7585J1674l4152o2490P667O1621L6422m9345m6438K6389R6420O1996
17292A10503L1271r8774q31k5480Q336o6581q1336k9145J20977J41533n0917j09010
17280d9454m0194J05583M1457J1244j29629j4802O1864N0628j41685k6718P5931
17269e5775k7555m9865J22532l0384j70791o0261N6982L5002j2762N5102R3372
17258d4403m7708L0036K1896n3143m3347k271O0020J10620R3138j5140q0772j0401
17246A8525j41718J3338Q6692K5275k755J0710l312l5767L6069L9097M0397L0601
17234A17152k9487O5838j9602n8239N9210l0687n6773k9749j38858L4940L3667
$$ y = [-14507, -39698, -36682, -997, 11237, -122364, -223509, -159887, -92231, -71225, -97753, -46846, 739, 12413, -21739, -84229, -76562, -14941, 21481, -27864, -74302, -47913, 48507, 110503, 141774, 43000, 42169, 16689, 25025, -41556, -122892, -152037, -31060, 110473, 59556, -49454, -89648, 15935, 57392, 68636, -60993, -75795, -13931, 36697, -104988, -131706, -55775, -83330, -133195, -10663, -41047, -211838, -272099, -215117, -180115, -192877, -137775, -44403, -92111, -62075, -40179, -93322, -136669, -138940, -78920, 31700, 124838, 109698, 28926, 18525, -123193, -109855, -23163, 2112, -643, 10067, 6755, -29012, 7057, 46154, 86551, 117152, 87665, 153503, 133901, 75662, 134872, 104185, 47412, 17663, -121195, -86255, -52588]
17223e2588P6225M8370o1660M1468l6226N6584J1283r0063l4061K1941P400l5577
17211d6904l1608L7270Q691k1245j2024L7169L8020K5898N4626K9440l71n8986
17199E9976o3213R6888J80764l1209j78497j37904m9412M3525J10223J9805L333
17188E4279L5101r966l8112j02363L0922n4052p4433o1248j8993L7734J31667
17177f9464k5901N2897R8731R521r5520o0407L3490p236j4099q047M919R3073
17165A1957K2966K8366q3502O0682j6386L728j8179K4631m9163M8646j1536J14536
17153A36746k3591o117n3796l0729J5380O4181K830K4875K3247q6411M5472o8333
17141D3754n5j4903j09901k7679Q1883l2905r5264K8889J01533p2774j03218J7848
$$ y = [-52588, 23637, 72007, 10347, 51815, 15589, 72173, 83456, -6607, -40668, -18727, -11327, -46904, -78512, -41242, -32551, -53796, -65820, -28651, 9369, 35267, 89893, 119333, 118962, 59976, -3237, 93651, 274415, 243206, 64709, -73195, -122607, -79082, 31141, 50946, 54279, 89380, 79414, 41302, -61061, -30139, -84191, -158624, -219872, -238865, -201131, -69464, -95365, -42468, 56263, 65784, -29736, -90143, -56653, -63889, -77988, -86035, -81116, 11957, 34923, 63289, -20213, 40469, 24083, 27811, 9632, 34263, -14900, 33746, 22210, 136746, 113155, 107038, 53242, 22513, 37893, 102074, 104904, 129779, 153026, 66615, 112087, 43754, 43699, 28796, -81105, -108784, -26901, -59806, -155070, -126181, -24648, -97422, -200640, -182792]
17129a82792O3767Q6865P5319L4484j99844N1007R2340J051K9271k8220k8172
17118d924o3826k0654O8945P8090L3696q7538N0267Q6873J7084r5908j11812O6209
17106A6502L4900k8112P9312N1255j18023j74993j17576M9384J60142Q6749m4977
17095e437r0438N1804j4900j5323K4297k4410m962P5429K2902O7008L1221l2490
17083H4701o3576n3837j25849K6904Q1801m5694O5609Q8942j9915m8619r2477
17072a02010j6999P4954k2433K0044O6348O0344m5060r5472k0071N2724Q1771
17061E4140l6472j29841j9555P4312K0555O434l9960j1429K2500m8012n1663M7275
17049a11716M0025J7010L8740L5074k3964n211Q0241n1631j8851k7417M1776J02431
$$ y = [-182792, -119025, -32160, 43159, 77643, -122201, -71194, 21146, 22197, 51468, 23248, -4924, -68750, -89404, -20459, 57631, 91327, 3789, 54056, 140929, 158013, 62105, -49707, 16502, 51402, 23290, 102602, 153857, 35834, -139159, -256735, -207351, -47209, 39540, -5437, -95875, -44071, -58971, -74294, -49997, -74407, -79369, -3940, 18962, 85970, 117191, 84701, 21125, -32712, -158561, -131657, -49856, -95550, -29941, 59001, 39086, -9533, -102010, -119009, -44055, -66488, -46444, 19904, 80248, 35188, -60284, -80355, -27631, 54140, 17668, -112173, -131728, -57416, -36861, -30427, -70387, -81816, -59316, -107328, -158991, -111716, -71691, -54681, -15941, 19133, -4831, -10042, 70199, 18568, -283, -27700, 14076, 116507]
17037A16507j11821j30721O599J07245L3384K4247L1975o0423o4700o7938J0789
17026a04857l0954P5636o7593j7023n5535q0002J6351O7116N6093p4943P2432
17015a43279J10773L216r124J8452N5335K0383J9835p5387o4814r1202l3705N6106
17003a33411O1235n6996j554o7400K8899M6883N9874L9576L5328N180O4542J2112
16991I4268l5792q9024p6294J6198Q4373P6803l987P6168J1454o3054J3476P4807
16979A79396j71443j52947L1117J37498L2089L4500N323l1972l7397p9621j1381
16968f4838O674k5277O0823K2708K2683k8653p4207O6341M164r5325j75622N4622
16956b25907N8131N4755J6824r9576K7696j094m1978O6961P3349k9027L0686J7632
$$ y = [116507, 4686, -126035, -119436, -12191, 21193, 45440, 77415, 16992, -47708, -115646, -104857, -135811, -60175, -127768, -144791, -200326, -280328, -263977, -196861, -140768, -215711, -143279, -32506, -29290, -38414, -19962, 35373, 55756, 75591, 204, -64610, -155812, -189517, -133411, -72176, -129172, -130726, -198126, -169227, -122344, -62470, -22894, 12434, 17614, 82156, 94268, 58476, -30548, -106842, -90644, -6271, 70532, 66545, 142713, 154167, 91113, 104589, 179396, 7953, -144994, -113877, 23621, 55710, 90210, 95533, 63561, 26164, -53457, -64838, -58164, -83441, -22618, 90, 22773, -5880, -80087, -13746, -9582, -104907, -280529, -225907, -167776, -113021, -96197, -195773, -168077, -169171, -211149, -144188, -70839, -99866, -69180, -51548]
16944e1548o6402j0163J24147P5842l0364O38m1646k12L5226N9901o7774p7697
16932e0052L2962j6064L8805r472J16910M5025j12429k2287O003j3034l2638K7530
16920A1259M9239o8199o9758K0998J28588R1032n7135l0924r1635K554p3858l3406
16908a21245N6107j0868K4439n8055j9603J6871O786p962M2302n339q3556O5513
16896i4610M2221p5302P477M2536L632K6787O2112O1007M1796q18l026o0136j0782
16883D2894q4164R2342J3675p7002L1092L2554K0349n4321K6065n2096N5559k3064
16871B3883R8077k0036p4076k6856J1960N9815M7141l4217j37798j09576O8162
16860i3521p0412Q878J02237R293O1049k2514j48012L8984o7158N4068R2292J1117
$$ y = [-51548, -117950, -128113, -3966, 71876, 41512, 42150, 504, 292, 35518, 95419, 27645, -50052, -17090, -33154, 5651, -3821, 113089, 158114, 45685, 23398, 29401, 16367, -16271, 11259, 60498, -7701, -77459, -56461, 72127, 163159, 106024, 75100, -16535, -13981, -87839, -121245, -65138, -76006, -51567, -109622, -129225, -112354, -105568, -113530, -71228, -76567, -160123, -94610, -52389, -127691, -120214, -77678, -74046, -47259, 14853, 75860, 117656, 116838, 113812, 53676, 42894, -41270, 51072, 64747, -12255, 18837, 51391, 71740, 17419, 43484, -8612, 46947, 23883, 121960, 101924, 27848, 992, 12952, 72767, 119908, 85691, -52107, -161683, -93521, -163933, -155055, -52818, -43525, 17524, -4990, -153002, -114018, -181176, -127108, -34816, -23699]
16848b3699k2269j9345j7078l166k8233N5669j4652J02392K1799l2881l3901p0810
16836h6174k8052N8509m2050Q5752n0532k3688k677k8207L9103R2656o8538o2888
16824a16786n949J4271J04911K0661N4526J12l8231j1630j18947o5939L1131o659
16812a38529k0151M357m6149K6179P6224K6162l3544L0931K1643R6267R8830m8474
16800I3746p7779o6966L1555k0517n219M4605O5565J9898R3164M4853j11931q8681
16788B2293n0861J28398M4665k1232o6396K6813k3332n1383n265P600K9596r8541
16776e7645n4281m301N679n423j6160o91k9825K2465N1429O5341K4157n9543L7874
16763b0924J9277m712m7930n8689n9972k6314O9214K7585p697n9160N0735O2696
$$ y = [-23699, -45968, -65313, -82391, -85557, -113790, -58121, -72773, 29619, 51418, 18537, -15364, -86174, -114226, -55717, -97767, -12015, -62547, -86235, -88912, -117119, -78016, 14640, -53898, -116786, -122735, -108464, -3553, 17108, 71634, 71746, 33515, 21885, -97062, -163001, -131870, -138529, -158680, -154323, -200472, -174293, -98069, -71907, -105451, -74520, -52877, 43390, 142220, 93746, 15967, -50999, -19444, -39961, -45180, -575, 64990, 84888, 178052, 222905, 110974, 22293, -28568, 99830, 144495, 123263, 56867, 83680, 60348, 8965, 3700, 11300, 40896, -57645, -111926, -116227, -110548, -115971, -132131, -132822, -162647, -140182, -88753, -23412, 745, -58798, -20924, -1647, -6359, -54289, -112978, -172950, -199264, -130050, -102465, -110162, -169322, -118587, -55891]
16751e5891J0136M450R3355k5074q8067l6326p762j782J40848J17994l289j60386
16739a1794r9280Q8890O9266j8521n5566k5541n247k4977M454K2111k950J6695
16727d2460m8198N1651M8264k6764r4253j676J48098p4987m3710J47381N152P275
16715G5773m0343m9075j31784l3463N6808p731n7828Q7680N453O8481R7797l6711
16703C5057o7093M6511j8624j15503k4693l3745N1236J6420O4679N3700m1500
16692c3555p0869N4492J47884q9883j02529p2843m6851j0203L28Q3688J23839
16681a6502N2003R5128J83007k3391j38327j61108j30820k6913J22038J37992
16671I3107l0374m4894K4948J14838r015j4109j41881j21937N9815j3303Q1577
$$ y = [-55891, -45755, -41305, 52050, 26976, -61091, -97417, -105179, -106961, 33887, 151881, 148592, -11794, -111074, -22184, 47082, 28561, -27005, -52546, -57793, -82770, -78316, -56205, -59155, -42460, -90658, -39007, 9257, -17507, -111760, -113436, 34662, -40325, -84035, 63346, 68498, 75773, 35430, -13645, -145429, -178892, -122084, -129815, -187643, -99963, -94510, -26029, 71768, 35057, -32036, 14475, -4149, -119652, -144345, -178090, -126854, -110434, -45755, 7945, -33555, -104424, -49932, 97952, 8069, -94460, -167303, -214154, -224357, -224029, -140341, -16502, 35501, 130629, 313636, 290245, 151918, -9190, -140010, -166923, -44885, 93107, 62733, 17839, 42787, 157625, 148610, 134501, -7380, -129317, -69502, -82805, -1228]
16660a228J8807m2443R9048P753l7047m9086K3796M4918p1640J3017L1262J4234
16648E1391M581L1732j10561o6870J0149N2455P4660k9272m9518r48q1987o8446
16636a82634m9562R0051J0265n9709r9222Q2206P5528O5639M7039m6159j49233
16625b15791J13438R7932K2734l4292k5508P1198L3081n4918m1079K6255q9524
16614i6474N6391M7468j0749K5425M1895k287J7050k3476j9297m5631n428l1411
16602d6524m0219m4621k0818o4353m320Q6585N7501R2126j32234n068J03693O0707
16590D2455p545q0345K5679M798m5618m9142O9326J05509K4578k0860Q214l0350
16578D6699k4376O139j1841n166N8815O6680k3150p0605q6997r1984P9544J62753
$$ y = [-1228, 17579, -24864, 74184, 81937, 44890, -4196, 19600, 64518, -7122, 5895, 37157, 51391, 55972, 87704, -22857, -89727, -79578, -27123, 47537, 18265, -31253, -32201, -114188, -182634, -232196, -142145, -131880, -191589, -290811, -208605, -133077, -67438, -20399, -66558, -215791, -102353, -4421, 18313, -15979, -41487, 29711, 62792, 7874, -33205, -6950, -96474, -40083, 7385, -3364, 22061, 63956, 61669, 78719, 55243, 35946, -9685, -15113, -46524, -86743, -131364, -152182, -216535, -220855, -134270, -76769, 15357, -116877, -121945, -18252, 42455, 34910, -45435, -19756, -14958, -60576, -109718, -40392, 65117, 89695, 68835, 77049, 46699, 22323, 28462, 16621, 11455, 70270, 136950, 113800, 43195, -43802, -135786, -56242, 106511]
16566A06511O7413j1755j0486n7501j46299k8942R0755J9011M2481P7589j0588
16555A38189j01131r9554N243M9954k6275o5197p1315N5394J26878l5867o8088
16544i1769m4067m5945p382l5046J33417K4776n1010j7185n3799O0089J01595
16533b6326N3202n8376k2846j8626k8634O4643Q1836J3109m2406K8202k8369m8889
16521c3480n8535J12002O3723l3670j38361m166K3837K209N8159n628R19l4007
16509d6998o6913j0443O0661O5580j25573j83R1090q814k3392O887L786L9774
16497a4538K5440j8531n302l6621L3107m941k8550j0221l0474n9883l5169Q3081
16485a02602P6952k3726m7698r0655l7431J32877J6114j44891n9199L3330Q1380
$$ y = [106511, 173924, 162169, 151683, 94182, -52117, -81059, 9696, 28707, 71188, 148777, 138189, 37058, -62496, -57253, -7299, -33574, -98771, -170086, -114692, 12186, -23681, -91769, -135836, -181781, -189163, -224209, -90792, -66016, -117026, -134211, -188010, -127921, -26326, 26876, -31500, -54346, -72972, -101606, -36963, 44873, 57982, 15576, 43778, 15409, -33480, -92015, 19987, 83710, 50040, -88321, -92487, -68650, -66441, -8282, -13910, -12991, -46998, -113911, -124354, -63693, 1887, -123686, -123869, -32779, -41593, -64985, -58098, -54312, -14538, 10902, -7629, -12931, -49552, -16445, -21386, -49936, -60157, -90631, -150514, -185683, -102602, -25650, -49376, -97074, -187729, -225160, -92283, -76169, -221060, -280259, -246929, -165549]
16474a65549R4737l2134k6723N2527O7808Q3043K5993n7611O678r997q7359L1681
16462a6906k7148j4625l3201J4272q303J5263J210p2752n9375M1683M6500R3208
16450b0174L4441R879K4135r0129j04464Q2927R8460P4400Q9491n250k7357o3127
16438A03232o4602p8019q694M1902N542M4598k5900J0401k4233L6533J144j21273
16426g9369K2004P5315j1363q8484O8621R7553j08021L4696J21784l1351p7786
16415B3599m2797q7459l0474Q2020M8324m1933L7686m3608m7134N371Q4882N5878
16403D4355q920o5645p6376O6899J2300n995k4076j55830K20J08237L2304K4258
16391d8269J2329j5015J4254K8644l3036j27872O6613J56799P7224J3130k8683
$$ y = [-165549, -70812, -102946, -129669, -77142, -9334, 73709, 99702, 42091, 48769, 38772, -48587, -16906, -44054, -58679, -91880, -77608, -85911, -70648, -69438, -142190, -201565, -159882, -113382, -20174, 14267, 24146, 48281, -41848, -146312, -63385, 35075, 109475, 198966, 193716, 166359, 103232, 38630, -39389, -48083, -6181, -639, 43959, 18059, 28460, 4227, 40760, 41904, -79369, -57365, 17950, 6587, -81897, -13276, 84277, -23744, 10952, 132736, 101385, 23599, -19198, -106657, -137131, -55111, -6787, -48720, -11034, -54642, -101776, -96405, -11523, 44355, 35435, -30210, -106586, -39687, -27387, -33382, -57458, -213288, -213068, -104831, -72527, -48269, -35940, -50955, -36701, -8057, -41093, -168965, -102352, 54447, 131671, 144801, 116118]
16380A16118j03830k9266m9197j8235M805r5190p1670M8300N6888L0930j0989
16369a21336Q9277P7536k6035m9223M5140J6175k072o9577q212O3014o089J068
16357I666l2555p719k790l5454M3917k4757m9330p751m3421M4975R9862M0425
16345C5068M6036N557l7200K5357R6344P909o6923N6092p4965o1471K0351l4259
16333A7896M919l7433O298O5311q016J4274k7048N1818m2687J05834N4988J8225
16321B24379j31851K870N7336J5991l8644m1801j1985j47700q6734Q5163P5421
16310B445j4814M9238j2799J2172L1222q181L496m7515j00001l9834K4953J6071
16298h3547j1797J6572J7438k336L3164k1443M4909q09j3478M7285K6202m4038
$$ y = [116118, 12288, -16978, -66175, -84410, -79605, -174795, -246465, -198165, -141277, -110347, -121336, -32059, 45477, 19442, -29781, 15359, 31534, 29462, -40115, -48327, 14687, 8598, 9666, -22889, -30608, -33398, -68852, -24935, -49692, -99022, -106773, -150194, -105219, -5357, 35068, 81104, 86661, 49461, 74818, 171162, 179071, 112148, 168240, 93275, 31804, 52155, 17896, 22815, -14618, -8320, 56991, 48975, 63249, 36201, 88019, 45332, 151166, 206154, 224379, 92528, 95398, 152734, 168725, 130081, 88280, 76295, -71405, -158139, -72976, 2445, -12369, 36869, 24070, 36242, 67464, 59283, 62779, 15264, -84737, -124571, -99618, -83547, -95344, -78772, -61334, -63670, -30506, -51949, -7040, -7849, -21327, 25958, 52160, 8122]
16286H122n0434N8052l8047k8631k188n2552o217K6634n852j7967n6119N1388
16274a13811j8673J9097R2980O0935L9973m1294m8820n3781O5431l1043m4650
16263g3656J17526q398j05995n8228q773K9668P2818J47846L085M6551L444j66094
16251b06p5639l3647K9619L7136n0409L1400L8005M5915n8337M437n4803K4620
16239f1909O2646J01864q9202l7906J7223q751o0183J0651m2187L4543M1104k0624
16227e2731J0658N010j6904N3517q0292j06615P4535Q6449P3016M9870j02374
16216e861n1801J30833R385m7013k5152M9397M5512N1068k6337p8599q350j53884
16204a10802K6567O3423K2039p7627m9360K0328K3991P5580j9031Q538l2853r3724
$$ y = [8122, -42312, 15740, -22307, -50938, -53126, -105678, -111895, -85261, -91113, -109080, -165199, -113811, -132484, -113387, -20407, 40528, 80501, 39207, -9613, -63394, 2037, -29006, -73656, 43870, 35472, -70523, -128751, -137524, -107856, -35038, 112808, 115893, 162444, 165888, -206, -75845, -109492, -79873, -42737, -93146, -61746, -23741, 22174, -36163, -31726, -86529, -61909, 737, 102601, 13399, -24507, -7284, -16035, -76218, -65567, -107754, -73211, -32107, -52731, -42073, -37063, -53967, -450, -80742, -187357, -112822, -26373, 46643, 96513, -5861, -57662, 73171, 82556, 35543, 10391, 59788, 105300, 156368, 130031, 51432, 43082, -110802, -84235, -20812, 1227, -76400, -125760, -105432, -81441, -5861, -24892, -16354, -49207, -142931]
16192a42931J16235J5955N5836M0805p8663K739J7483m1474K9614J3452j9629
16181I422o8294p1961m7531j7014P139N6076L9031P08k3151P9934R5443m9291
16169A0511n5798J9351J412J7326J1877L4264k5319o8911j01272m1314p640p909
16157b13422L8978Q1588l3534M8774m7923K7483J31361R7866P778j52643l9339
16146e3033n0945q2170K40J03705J64570P6260p4456k4673O8622m722r0148q8224
16134e4974M0049J3634K989j7472N8378Q3476q738o0628n2336j00145k2815K9905
16122h8677l8957k4282L0863N4300j21834o2094N653J65844L9995k413P652m994
16110c8944q229J6859p434K4268J7236k8643K721N9413k0161j6737j5891q6591
$$ y = [-142931, -26696, -10741, 45095, 85900, 7237, 9976, 27459, -14015, 15599, 29051, 9422, -58872, -130833, -178364, -195378, -188239, -132163, -93132, -92424, -115575, -35641, 59802, 10511, -45287, -25936, -24524, -7198, 4679, 38943, 13624, -55287, -156559, -197873, -205513, -213422, -174444, -92856, -126390, -77616, -125539, -98056, 33305, 131171, 138949, -13694, -53033, -103978, -186148, -185908, -82203, 82367, 158627, 84171, 59498, 128120, 123398, 33250, -54974, -14925, -1291, 1698, -15774, 42604, 126080, 117342, 56714, 4378, -95767, -118582, -88677, -127634, -151916, -121053, -66753, -188587, -250681, -245028, -79184, -39189, -41602, -33950, -38944, -47173, -30314, -37748, -13480, 3756, -24887, -22166, 37247, 17086, 349, -15542, -102133]
16098a02133m430J9637R0718m7333n2185J367P2729K5686j1813k2864Q64J531
16086b8226J2444n1983L4842N3447Q6063L3098m7539j0722p9109j55029R0676
16075f2038M6819J0193m8136l6757P1387k111o8582o762n2926l3751M498L014
16063a75152N3535J0938J15763O1652k1192L2073l8512K2898n6991o9741N3108
16052a1621l3683m4345J09684j780p5112q9262m348J04574O4222N3645K0669k8469
16040F4174P7927j2418j23495J4916k7271J2685o9365j00442k4034m9353j5525
16029b52201m2066J84470R2164r1334Q8557P5756J2275J3439K4786p9179j32349
16018a05682J1120J12091P1843N8882j4980q5251j04141m9440M8683M0321j50
$$ y = [-102133, -106563, -86926, 3792, -43541, -95726, -94359, -21630, 4056, -7757, -30621, -29757, -28226, -15782, -67765, -32923, 20524, 106587, 139685, 92146, 81424, 2315, -152714, -62038, -15219, -5026, -53162, -89919, -18532, -20643, -89225, -95987, -148913, -182664, -178166, -175152, -121617, -110679, 5084, 66736, 45544, 77617, 39105, 62003, 5012, -64729, -11621, -45304, -89649, 20035, 18255, -56857, -146119, -150467, -45893, 18329, 71974, 92643, 64174, 142101, 129683, 6188, 21104, -6167, 6518, -62847, -163289, -187323, -236676, -252201, -294267, -109797, -17633, -108967, -20410, 55346, 67621, 81060, 105846, 26667, -105682, -94562, 17529, 89372, 148254, 133274, 48023, -56118, -105558, -56875, -16554, -16704]
16007a6704n7442k1088J4284r9669L7028K3220J22356l1787o1129J2769K8653
15996d9509j2866p974l2874o2308j0714P7413n379k6755L7596N0171N2741J6495
15984B6037j02955m1424L0511J4101m7529k6951J06791J0831K3662L8961j99j2398
15972A9438O0087l7917p8996O4880l91p1187p0817Q1678O8650k7278p009O159
15960G297j6815J2162J71152O7728m4639j47222q9137n2672N2088N8051P366m6419
15948b1060n0854o5387l3670k5709J6853M240N3943l923L4463M1049K7745k6895
15936d9205M8217L1904M936J0946J0786j48718J2252O5063l1921l7955k5603j45548
15924b54846M0732J34234q448P9053J12344J8q3963J14488m82j13439n2083m6382
$$ y = [-16704, -74146, -95234, -80950, -180619, -143591, -120371, 1985, -29802, -90931, -78162, -49509, -62375, -70349, -103223, -165531, -176245, -98832, -104211, -130966, -93370, -43199, 9542, 26037, -76918, -118342, -87831, -73730, -121259, -148210, -41419, -30588, -6926, 32035, 31836, 19438, 79525, 41608, -37388, 27492, 27101, -44086, -114903, -33225, 35425, 8147, 1138, 7297, -9518, 2644, 173796, 241524, 196885, 49663, -39474, -92146, -40058, 17993, 25359, -21060, -71914, -137301, -170971, -196680, -179827, -175587, -121644, -125567, -91104, -50055, -22310, -49205, -988, 30916, 35852, 46798, 57584, -91134, -78882, -13819, -45740, -83695, -109298, -254846, -214114, -79880, -88328, -9275, 103069, 103087, 19124, 133612, 133130, 19691, -32392, -78774]
15912g8774j2824M2577J1849R9892M3071L9158q728M2498p0921q3126l1443k0657
15900b7428N4836K36l0059N2652n0270l8741l6325q26R3692p8532p5805l6777
15888a73347m5501K6461K2413O2329M3126J46902J4968p2023r7865q0321J30676
15877b2182q671p0158j03576P5634J67551J281p4258l0429l2445j8938M9239r5978
15865a62930m6938P2029M3918q717L408Q6631L1830l6650j04639R5313R336j2866
15853c0275K6307J7397K674O478P4932R3197p8631n7615o1329l430L9837k3681
15841E861R579o4631Q4627N4562J7035n274m5546p6038M1161o2418J7761k9669
15829e2990o1535K5282K0069j3230j17342n528l056P8459o149O0913K7778N5446
$$ y = [-78774, -91598, -49021, -37172, 62720, 105791, 144949, 136221, 178719, 107798, 24672, -6771, -27428, 27408, 27644, -2415, 50237, -33, -38774, -75099, -75925, 17767, -60765, -136570, -173347, -218848, -192387, -169974, -107645, -64519, 82383, 97351, 25328, -72537, -152858, -22182, -30853, -101011, -204587, -128953, 38598, 39879, -34379, -64808, -97253, -116191, -66952, -162930, -209868, -137839, -93921, -102638, -99230, -12599, 19231, -17419, -122058, -26745, -17409, -30275, -3968, 13429, 16103, 22581, 97513, 190710, 112079, 54464, -6865, -10295, 29542, 5861, 15440, -49191, 35436, 89998, 107033, 101759, 56213, -19825, 21336, -41082, -23321, -52990, -114525, -89243, -69174, -82404, -199746, -205274, -208330, -129871, -136020, -75107, -47329, 8117]
15817H117L2552l8505l0355m6360m3421M1829Q1008o1541q9946m5044N6985P2197
15805f2484K2311R3778N5268j41337j31376m7738M0217J02730J48848P634m9913
15794C7938l0727j16570o5141O1367L4957Q3503O3530M3313N2209L2446r9358
15783I7467j09613R1727L1654R8926J6249j23147n7766j562q0800Q4342k82o2629
15771a5434j0569l2086L0076r5681J4190J67079Q3318j12787l4403K1586K1857
15760C7146j3392l9543l8290p9018J1667J1178n7555M3883J7069k0174q6826M5962
15748a67893j2979l2397K2092O7602O7373L5265l8149k1930J0276M5517n0889
15737g6112n0690N6353R5304q7709r952P20J851P9920m355q1767n7539m6802R5385
$$ y = [8117, 40669, 2164, -28191, -74551, -117972, -76143, 4865, -56676, -146622, -191666, -134681, -62484, -40173, 53605, 108873, -32464, -163840, -211578, -171361, -68631, 80217, 87851, 37938, 7211, -109359, -174500, -113133, -78176, 5327, 68857, 112170, 164379, 196825, 97467, -12146, 79581, 111235, 210161, 226410, 103263, 45497, 43935, -36865, 47477, 47195, -15434, -26003, -58089, -28013, -123694, -109504, 57575, 140893, 28106, -6297, 15289, 37146, 23754, -15789, -54079, -133097, -121430, -110252, -167807, -123924, -106855, -127029, -213855, -167893, -180872, -213269, -191177, -123575, -56202, -20937, -59086, -81016, -70740, -25223, -76112, -126802, -70449, 24855, -62854, -72806, -72086, -70235, 9685, 5330, -76437, -133976, -180778, -85393]
15724h5393J8339J04434j4165o7406m0970J35189L6982n8576q552J25522P5768
15713B21172r359N4992r2407j3184k4487J18719k5475r6244j19982l5777r28L8606
15701A5646j7622J7676L6458q5884J9342N1840p646q5184k1989j181N2153K4792
15689a599K2297p8682j60263L4655Q1862m5547n7539K1092K6009Q5105J16328
15678D3718P4484n0985q9118l3447k3462o7724j26245l0249O7036J20249k0730
15667a36473K4279R1891j0940j3232N1220P211p3043q1650l0984m1109R6506Q3274
15655c3050o4464m9385J3993P6425J7601q8527q301p374n078l478N4115M2081
15643e5442o143O5895M5558k2299l7402Q0025P7245l8463J3906m1670j29800j11962
$$ y = [-85393, -67054, 37380, 23215, -44191, -85161, 50028, 87010, 28434, 19882, 145404, 221172, 211813, 266805, 174398, 161214, 136727, 255446, 229971, 133727, 13745, -22032, -22960, 15646, -1976, 15700, 52158, -33726, -14384, 37456, 29810, -55374, -77363, -78544, -26391, -1599, 20698, -57984, -218247, -183592, -101730, -147277, -204816, -183724, -157715, -72610, 43718, 118202, 67217, -21901, -55348, -78810, -146534, -272779, -303028, -235992, -115743, -136473, -112194, -20303, -31243, -44475, 6745, 13956, -59087, -140737, -171721, -212830, -116324, -33050, -97514, -146899, -132906, -56481, -38880, -127407, -135708, -143082, -148160, -151638, -97523, -55442, -61585, 4310, 49868, 27569, -9833, 70192, 147437, 108974, 122880, 81210, -48590, -160552]
15631a60552Q5773q761r755L1995n6800n37K6464l0957n747k10K2588K0603O4835
15618b1061N1052L9123j07644k8715K2277J1165M1175K5005R5092M867o1041L376
15606G4671r1906m7290M4377M5983l6789O8868n33j198m7444o5871p301q2426
15594a46859K5628J48488M1799o5913j6104M3429j096m6566k7042o187M3352q683
15582a5754n0253P453R180k7285P2120M3406r2026r3853n2976N9337N3011m232
15570i1872J7550j4786p186p1020P2846l4318M9405J6735M8962Q4076p981L7119
15558I9530M3328l4340J4571n7259m1413K4384Q1986K0562r7179k1761K054k7415
15546G048m3905k2006N3499O6987L1527p8993j74785J5750J26556J55451q957
$$ y = [-160552, -74779, -83540, -93295, -61300, -118100, -118637, -92173, -123130, -128877, -129087, -106499, -85896, -21061, 29991, 69114, -38530, -67245, -44968, -33803, 7372, 32377, 127469, 132336, 71295, 74671, -17235, -64525, -20148, 25835, -10954, 57914, 57381, 56183, 8739, -57132, -64433, -146859, -121231, 27257, 69056, 3143, -12961, 30468, 29372, -17194, -44236, -50423, -7071, -15754, -66007, -58554, -49374, -76659, -4539, 38867, -53159, -147012, -199988, -140651, -87640, -91872, -74322, -89108, -96294, -167314, -94468, -128786, -79381, -62646, -13684, 70392, 62411, 99530, 142858, 108518, 123089, 65830, 24417, 48801, 130787, 151349, 54170, 32409, 34463, 7048, -36857, -58863, -5364, 61623, 93150, 14157, -160628, -144878, -18322, 137129, 128172]
15535A28172k1452o0121m723j6348q4594K6384O3879l907R025p1250m2707l981
15523h1623q8983j1525M9566J41797ln1853Q2469J7464r0492p5332j2825q0152
15511b01492p4467M5815L6597r1382J1246O5076L2854n959K5243N3643q9888j7765
15499b10479K4946j0209P301K169k9311Q7204J07017O0231l1281n6446K1339R1461
15487F3942L0882j06818l9271j5740K462O7255O5828l3469k0219o5462K7314N9741
15475C6445K6233n8381l7408k2201j2292r0487K9149J25725m2171j788M46K2643
15463b4087j151M2254j7239k6998n2537N4355M60M4454N6097L4369q9070r8957
15451g8050k3087K5700P3267K2157j6550m9447o5287p403J0730l9589J5651N9255
$$ y = [128172, 106720, 46599, 41876, 25528, -59066, -32682, 31197, 27290, 36315, -34935, -77642, -81623, -170606, -182131, -132565, 9232, 9229, -42624, 39845, 57309, -33183, -108515, -121340, -201492, -275959, -230144, -193547, -284929, -273683, -208607, -175753, -181712, -156469, -102826, -192714, -210479, -185533, -195742, -188441, -186272, -215583, -128379, -21362, 38869, 7588, -48858, -27519, 63942, 94824, -11994, -51265, -67005, -64543, 2712, 68540, 35071, 14852, -50610, -23296, 36445, 62678, 4297, -33111, -55312, -67604, -158091, -128942, -3217, -45388, -47176, -46730, -24087, -25238, 17016, -223, -27221, -79758, -25403, -24943, 19511, 75608, 109977, 20907, -78050, -101137, -75437, -2170, 19987, 3437, -46010, -111297, -118700, -107970, -147559, -131908, -72653]
15439g2653l5275k4197R8186O8225j1970j22203j0003j347N3948o0963n3773L3532
15427a38493L9569N2267N627l6334L0641J7649O1139Q4479m0095j61127n3748
15416a38426j7708L0655j1915M5010R3302P6707n563j26510K5941L8305N7290
15405F7088m0781L3013L5221o3246n3367o1224p5672O4377J06607L1974m6954
15394b964M4610M3152n5031r3928Q2031M4436m0661Q215j4425n2O4222L9310j37430
15381a8515q1467m2350j854M9266N1435l3078m1984k6783L6971j055M5069J6338
15369d8007l316q0062M5217K6477m3428J005Q3174J984l0820m4613N2723J26173
15357H6507K5962j39253o7188j7394L8520j42850j1583K0011P5352L0143Q5513
$$ y = [-72653, -107928, -132125, -33939, 34286, 22316, -99887, -109890, -111237, -57289, -118252, -172025, -138493, -98924, -46657, -41030, -77364, -46723, -29074, 32065, 116544, 76449, -84678, -138426, -156134, -125479, -137394, -92384, 918, 77625, 72062, -54448, -28507, 9798, 67088, 26307, 59320, 94541, 31295, -22072, -83296, -158968, -94591, 12016, 43990, -2964, 41646, 84798, 29767, -64161, 17870, 62306, 21645, 29860, 15435, 15383, 79605, 118915, -18515, -99982, -142332, -144186, -94920, -43485, -76563, -118547, -145330, -108359, -109414, -64345, -48007, -51323, -131385, -86168, -59691, -103119, -102114, -18940, -16956, -47776, -92389, -39666, 86507, 112469, -26784, -93972, -111366, -72846, -215696, -227279, -207268, -131916, -101773, -16260]
15346a6260q0278o3981O7562n4531o0943O7289J06504N2010r6501n7519p2122
15335b08770J4744M6849J1460j4905k7455K2113M3003O6031K1383R545L2040n804
15323A0234o7578J06823R0765J0537m1380r4967m1805J9881k1199j5473K5293
15312a8869j6861l2859j8095M8315P0323K0259m8574m1182l1009Q1802J118l0856
15300a6488N5651M8560K5227n7841j91498j8689J32499M8507r0654m2526J83266
15289G6014K4498J4533m4490l9616N4172J41746p3850j35407j85500p9548K7167
15278b20281M2099J8302J09527J25797p0386j1158l1346k8097J8368M4085p0936
15267g4026Q7876J0417n2356M0190N1549k6889q3266p4822k2711P2205M6853L7141
$$ y = [-16260, -96538, -160519, -92957, -147488, -208431, -141142, -34638, 17372, -79129, -136648, -208770, -194026, -147177, -135717, -150622, -178077, -155964, -112961, -46930, -25547, -16002, 16038, 10234, -57344, 49479, 140244, 150781, 109401, 14434, -27371, -7490, -28689, -44162, -18869, -35730, -68589, -86684, -38369, 31954, 52213, 3639, -37543, -68552, 13250, 14368, -16488, 39163, 87723, 112950, 55109, -136389, -155078, -22579, 25928, -64726, -107252, 76014, 100512, 115045, 70555, 30939, 85111, 226857, 153007, 17600, -167900, -247448, -220281, -178182, -159880, -50353, 75444, 5058, -6100, -37446, -65543, -47175, -3090, -74026, 13850, 24267, -28089, 12101, 63650, 36761, -46505, -121327, -144038, -71833, -24980, 12161]
15255A2161M44k414m3557k2788K856j4764K7768m1475n4505j9522m630k1218L7905
15242a43739n7830l2064M6474J16712N3088l0249j14090J8659O0072l5189o1520
15231a79676j4691j632m1560N3723J33597J1973M9348K1504m3100p4886l6977
15220a22377j9072l3733L8102m790N333K1326P9123J0181k1044J05030p984n298
15208D4797R1343l8240J2766K1993J0253j17996l0774K0157p7027j6161J1059
15197f7830k9971M249l583j01799Q3497Q0346O0484K4605k5191K925j07426l2149
15185a11843j1632Q5951Q0854q846p402r415r4304K0130N7530j0335j05784o3975
15173a79071R647P5392J70375j0048l9525N3401L8248q3270J39699o933m1455
$$ y = [12161, 12605, 10191, -33366, -56154, -53298, -68062, -40294, -81769, -136274, -155796, -160426, -181644, -143739, -201569, -233633, -187159, -70447, -17359, -47608, -161698, -143039, -82967, -118156, -179676, -194367, -195999, -237559, -183836, -50239, -38266, 11082, 32586, -10514, -85400, -122377, -141449, -175182, -137080, -141870, -136537, -115211, -36088, -25907, -46951, 58079, 50095, 44797, 136140, 97900, 110666, 132659, 142912, 24916, -5858, 14299, -62728, -78889, -67830, -97801, -93552, -97135, -198934, -115437, -35091, 25393, 49998, 24807, 27732, -79694, -111843, -123475, -37524, 43330, 34484, 27082, 17667, -76637, -56507, 1023, -9312, -115096, -179071, -169424, -94032, 76343, 66295, 26770, 80171, 118419, 35149, 174848, 167915, 126460]
15162A26460p1667q230J6704j8195l9805l1552k2789n7117j04220l8806K439J36744
15150a10034R110o5441l2988J24369J68023k8530l8532n1132N7406K119M0926
15139G5296l2260p7626j8463L0553l5098k6981J23878N5302m4839q4059n5341
15128h9638R2887k3192m2082R8525J9370j28582m1229J2691n9614j9558k1476
15117b01898j3493J450Q3379O7169L835J7671J3529j5268N3139P1494j9471j83369
15105a21833k2229Q2981J5857K0617Q8784O3864M278r3324o1960l2605J1863L026
15093d0681n1010P6149M698j5080K6826R4141p4135j56404J8599N8432r925L5675
15081c2715M9204r9547P1971J23261m4738l7063K3198R9372P1065J4530m4958
$$ y = [126460, 54793, 46563, 63267, 45072, 5267, -26285, -49074, -106191, -210411, -249217, -246778, -110034, -100924, -166365, -199353, -74984, 93039, 64509, 25977, -25155, 32251, 34370, 75296, 43036, -34590, -53053, -22500, -57598, -84579, 39299, 94601, 49762, -34297, -89638, 3249, -19943, -62025, 36500, 55870, -72712, -113941, -101250, -160864, -180422, -201898, -215391, -213941, -130562, -63393, -59558, -41887, -28358, -43626, 9513, 81007, 61536, -121833, -144062, -61081, -45224, -24607, 64177, 128041, 132319, 38995, -22965, -55570, -43707, -40681, -91691, -15542, -10844, -25924, 902, 95043, 20908, -135496, -116897, -58465, -68390, -32715, 16489, -83058, -11087, 112174, 67436, 30373, 53571, 152943, 224008, 238538, 193580]
15070A93580r7289j8311j4083n7158j5443j6213p0235r9819K9582N4970Q5542
15059b4877j2401N8827J30083J8908q6875p8077J5911M1970k8502n2007q7836
15048a04876p2866K169L5757j8519J7256L7960N0272j597L2101q7888o2460J3626
15036a59065m1622l9704J35512M2316k2951n983N8157L3187j1968K9186m5218
15025b8153o6827P6164l9944j04770j22094p872M6559m6844N3417L7645L4282
15014a68437K0984n547j2452o517K0892N2917L4125m457j4981Q7367L5057o2117
15002b3166M6037O7675K5876o6395M5165M1781k3789j8686K3794K3913m2376r8226
14990A603n8166o7245N126m8267O1396m2970m5961P5739P4264j8859r8627P644
$$ y = [193580, 96291, 77980, 63897, 6739, -8704, -24917, -95152, -194971, -165389, -110419, -24877, -37278, 21549, 151632, 170540, 83665, 5588, 21499, 63469, 34967, -17040, -104876, -177742, -175573, -139816, -158335, -141079, -103119, -52847, -54444, -22343, -110231, -172691, -159065, -200687, -240391, -104879, -62563, -85514, -91497, -33340, -153, -12121, 17065, -28153, -94980, -18816, -58760, -163530, -285624, -293496, -246937, -293781, -240364, -202719, -168437, -147453, -153000, -165452, -171969, -151077, -98160, -64035, -68492, -83473, 3894, 38951, -23166, 22871, 90546, 116422, 50027, 95192, 136973, 113184, 94498, 118292, 142205, 99829, 1603, -56563, -123808, -118682, -166949, -105553, -148523, -194484, -118745, -44481, -63340, -161967, -154323]
14978a54323Q45L2675P7440n6252p3346p7191J4466O0101R9769J01658J7638l1293
14966A2187p8686j5714R297l0564k8475p755O4458J41963R1160m3062J3023J1625
14954A39457L9311q8008n9612j4370p6499J0841K1876l7569Q9956L0479m9980
14943E882K5390j1794n6394j04555k7185L2833J4602M0100N6224J069N2772l6991
14931h047r3942m5601N1076N6680J4324L2541K9414m7855j2966l2499n4051L4532
14919g6394J8113M5014O126m7747j1754m587j9466O2730N8592q5425q1976M8981
14907h7793j5464J05281P5020r1375o1144q3846j2362L0475k5830M0581m3386
14896a69843J5575J38879k2754n1193N6852P7140m9536k6193j27601k1950L0755
$$ y = [-154323, -153478, -120803, -43363, -99615, -172961, -250152, -235686, -175585, -75816, 25842, 43480, 12187, -66499, -82213, -72916, -103480, -131955, -139710, -75252, 66711, 157871, 114809, 127832, 139457, 178768, 90760, 31148, 16778, -59721, -48880, -27004, -64573, 25383, 55862, 5882, 31272, 19478, -36916, -141471, -168656, -135823, -121221, -81121, -24897, -23828, 28944, -8047, -101989, -147590, -96514, -39834, -25510, 7031, 36445, -11410, -24376, -56875, -110926, -76394, -58281, -13267, -7141, -54888, -66642, -71229, -90695, -27965, 30627, -54798, -136774, -87793, -103257, 2024, 77044, -14331, -75475, -159321, -171683, -141208, -167038, -126457, -169843, -154268, -15389, -38143, -89336, -32484, 44656, -4880, -31073, -158674, -180624, -149869]
14885a49869L8174k87Q8846P5641K1553L4734n0284n6511r431n1276r6715J30457
14873b4968P4068J0325j2107L7803N296m2148n8O3929k3866j63751j00827J675
14861a74629J02608n3866j1093k3772R797L0450L1647j3150J0575J1K4871O288
14849f0263K7218M4900M311l9307n0231o2720l6080N0896J9602N5904O4869M8059
14837F7158J4852k8707j63554o4782L3064P6614m6758L5702P8366k672K8448n3376
14825b5645R0122l7027j88143q9875R1385N359N7895k9751m8015q074k9795k0367
14813b31931J5801m1973L1990J22284N2667m9645M2038N7070K5248o5740l7361
14802g9552N3186l366J5379L7935N109p2829r0138p029N9565l6255j01134O2970
$$ y = [-149869, -111695, -111982, -23136, 52505, 74058, 108792, 58508, 1997, -7434, -58710, -155425, -24968, 49100, 59425, 47318, 85121, 90417, 48269, 48211, 112140, 88274, -75477, -176304, -174629, -72021, -125887, -136980, -160752, -150955, -120505, -88858, -102008, -91433, -91422, -66551, -60263, -33045, 11855, 16166, -23141, -73372, -136092, -172172, -121276, -101674, -45770, 19099, 67158, 82010, 53303, -110251, -175033, -141969, -65355, -112113, -76411, 1955, -717, 27731, -25645, 64477, 27450, -160693, -250568, -159183, -153824, -95929, -125680, -173695, -181769, -211564, -231931, -216130, -258103, -226113, -103829, -51162, -100807, -58769, -1699, 23549, -42191, -79552, -26366, -29732, -14353, 23582, 28691, -44138, -134276, -141305, -81740, -117995, -219129, -156159]
14790a56159K623q792L0790J72360J7784l3119q9902R0486j6223j0585n3178p8517
14778a32432n1773J3351J32069P4438l6103L3071j3859j16896n6923J02241J05206
14767E2390q5483o0118j6102P0165O7576M5471q8645p5365L4222R8138o4316l843
14755b5910J1123l2185j24742m0254P4059J07953n795J1472k4202n1259m6863
14744a46603K8575j5412l280n6843j120j2527J9650k2936l649K8538P0835M330
14732a10442n3270k0244J07528J6750M5006N6236J2871r9097o2432R2970Q9160
14721G5036M0568m0927r7708j39365M8283j3146L236M2207P7201l2696Q4009N948
14709E2646k1362p756j0550J4571o6863k9071p1151n4648Q462J07804k8205m9606
$$ y = [-156159, -153536, -162328, -131538, 40822, 58606, 25487, -64415, 26071, 9848, -737, -53915, -132432, -184205, -170854, -38785, 35653, -450, 32621, 18762, -98134, -155057, -52816, 52390, -33093, -93211, -109313, -39148, 28428, 73899, -14746, -90111, -55889, 42249, -22067, -25910, -14787, -46972, -171714, -211968, -137909, -29956, -35751, -24279, -48481, -99740, -146603, -118028, -133440, -136720, -193563, -194683, -207210, -187560, -210496, -214145, -185607, -114772, -110442, -163712, -183956, -76428, -59678, -14672, 41564, 54435, -44662, -107094, -14124, 75036, 115604, 74677, -23031, -162396, -114113, -127259, -124023, -81816, -4615, -37311, 46698, 52646, 31284, 23528, 12978, 27549, -39314, -68385, -139536, -194184, -185722, -77918, -106123, -155729]
14697a55729n8399Q9892M3620L8880l44r24M970n327L1311m6598n8805J5516Q577
14684i3360K7611P409N3530J04822J9755n7K953o1407n9020l8197K6272O2824
14672E3135M7033n8981l6949m595n4584M8461Q4964P5064O4545J2795j67435m5208
14660A8245K3237K6295m5741p231P1555Q7330k7006l4493j49568j13961q3495
14649b34833Q0171J16340P7553p3788r6678k566j2850L1803m5714l5535P8678
14638a17419N7333l1699P523L5006P1181j03638n3605J04666P3253n904q7504
14627e0807M4267P3708M4361j227l1683l5878l2121l7945l551N5341l4376k8508
14615c8419L8160P4562k1701k4900q4047r6438J3546j8627l6141O1797M5993j09660
$$ y = [-155729, -214128, -124236, -80616, -41736, -42080, -43004, -38034, -43361, -12050, -58648, -117453, -101937, -93360, -65749, -58340, -4810, 100012, 119767, 119710, 122663, 61256, 2236, -35961, -9689, 53135, 100168, 41187, 4238, -357, -54941, -6480, 78484, 153548, 218093, 230888, 63453, 18245, 41482, 67777, 22036, 14805, 86360, 173690, 146684, 112191, -37377, -151338, -234833, -154662, -38322, 39231, -34557, -131235, -133801, -146651, -114848, -160562, -196097, -117419, -60086, -91785, -84262, -49256, 21925, -81713, -135318, -30652, 42601, 36697, -50807, -6540, 67168, 111529, 110302, 78619, 42741, 10620, -27325, -30876, 24465, -9911, -38419, -259, 74303, 52602, 27702, -56345, -152783, -139237, -157864, -194005, -132208, -86215, -195875]
14603a95875j19420R4769P8025O9943J5826O9338R122R1728p2612o2692L6253
14592A4405k1916l6768o8973j3803n0729j2834K1504O0805K1746O1050k0549o9120
14580a15182l6977O028K0537l5241k6547p418J12026J47204q991j20518k0309
14569h5388K2674K8790n9756J2235J06325o006m7524k7442o620L0934J555O0380
14557C0157l8432l5727L0232J44348R4064j28795n0571m7491l7039M2974k1777
14546a8057n8546m81m0020J21Q6539o962n1239O0028q171o6036K0699l5957K6841
14533i1241J7163J099m0237P610L0387p1762m0361N4535k8169K6687Q1785l0072
14521h2576l9027r765n2996k9882N7777J03219j3854j5776O1663P1864N8037R331
$$ y = [-195875, -315295, -220526, -142501, -72558, -56732, 12606, 21728, 113456, 40844, -21848, 14405, -7511, -44279, -113252, -127055, -177784, -190618, -169114, -108309, -86563, -25513, -46062, -115182, -152159, -146131, -125594, -160835, -187382, -194800, -82774, 64430, 55439, -65079, -85388, -62714, -33924, -93680, -81445, 24880, 18874, -28650, -56092, -62712, -31778, -30223, 30157, -8275, -44002, -13770, 130578, 224642, 95847, 45276, -2215, -39254, 3720, -18057, -76603, -77084, -117104, -116983, -30444, -37406, -88645, -28617, -36788, -102824, -82125, -118082, -91241, -74078, -72979, -113216, -105606, -75219, -146981, -187342, -132807, -160976, -134289, -52504, -82576, -121603, -131368, -184364, -214246, -156469, -53250, -67104, -82880, -21217, 50647, 108684, 118015]
14509A18015n4476j4600p8540M674R1683L8827N8920L2533q5018q1393N5796j8283
14497F8138K8336k6237l7078M4045m8327m3665r0191o5593k7315P1062K7096o0412
14485a60141n8817N736n46L6446J02212P0254m7800K0624J07703n0439n2515l1002
14473e8285l0985O9394k237J1342K8618j3234j4597M0001L3411L5926m5320j6451
14461C7583L2679l2725Q0873q1952r5130N4379J17506o0627j34103K2554N31r1675
14449a50107l1584O7717P5472N360p9684o5983L8652L8248p180R596K5741j0550
14437h4302k5230K403N4162o9413m8172J21755j1903M5308P5138J5233n1836j14013
14425i0870K1455L4057L9855O6198K612q642L6461R346m2819J13690L1441p4591
$$ y = [118015, 63539, 48939, -29601, -24927, 66756, 105583, 164503, 197036, 112018, 30625, 86421, 68138, 96474, 70237, 33159, 77204, 28877, -14788, -104979, -170572, -197887, -126825, -99729, -160141, -218958, -213222, -213768, -177322, -75110, -4856, -52656, -32032, 75671, 25232, -27283, -58285, -89270, -19876, -22113, -10771, 17847, 4613, -9984, 30017, 63428, 99354, 54034, 37583, 70262, 37537, 118410, 36458, -58672, -4293, 113213, 52586, -81517, -58963, -58432, -150107, -181691, -113974, -38502, -33142, -112826, -178809, -140157, -101909, -109089, -99493, -73752, -84302, -109532, -107129, -52967, -122380, -170552, -48797, -60700, -15392, 59746, 74979, 23143, -90870, -69415, -35358, 4497, 70695, 73307, 64665, 101126, 110472, 67653, 181343, 212784, 138193]
14413A38193P144l6927K5919l5337p2006k0060M0785j5506q1359l1406j274k4808
14401a06642J0122P0440l523q21l0215n766Q231O2573L6860M2791J8976L4256
14389A37282n3738p7401q243K0409j47482l0282M8445J65109N6551o1982N725
14378E4393Q3499M3055j36955l7937N829m9651O8773n7236l6899L9039m7386j2385
14366h3861J92582J00789r2681p4341k9880j5497j37822M2578J1427M2839M3146
14355g21J6254j1730p6993k1132K3899O43l035J7111N7628k6464J6765l0866k7852
14342f6493j29050j20657N6260J25866R6809K074n9821M4342j4346K6186J4418
14331b4412P5882N9273l2925j06045P5517K6332N1560J3281K7347j16961o2117
$$ y = [138193, 145337, 108410, 134329, 98992, 26986, 6926, 47711, 32205, -49154, -80560, -81834, -106642, -96520, -26080, -29603, -30424, -60639, -66405, -58174, 4399, 41259, 84050, 103026, 137282, 83544, 6143, -2100, 18309, -129173, -159455, -111010, 54099, 110650, 48668, 54393, 137892, 180947, 43992, 6055, 11884, -37767, 31006, -26230, -63129, -24090, -71476, -83861, 108721, 209510, 116829, 42488, 12608, -2889, -140711, -98133, -86706, -43867, -721, 15533, 3803, -73190, -94322, -70423, -69780, -72815, -55704, 1924, -24540, -7775, -38641, -66493, -195543, -316200, -259940, -134074, -37265, -35191, -95012, -50670, -65016, -38830, -24412, 51470, 110743, 77818, -28227, 47290, 73622, 125182, 138463, 165810, 48849, -13268]
14320a3268P8281o6622l2613r6868K0871O2708J5572L339k4431r3124L2822O3310
14308e0023k9549r8278n7554M9619J14464N6293P4436N4945k7080j26286l0192
14297f9205M7714l736Q5482P4192k6690j08713N4578l249k5316q862j4756k1507
14285b0068R615J47o6818L2154K0495L7240L1307J03946M1920o4184N138j1915
14273A18977m3545j1954j36300m1263J08116J3085j2202l4176q008m9201k0648
14262a17119N6357J09956L1847q9376q843j0678r52M5911j2381L5923o6431n8884
14250h4670k0918L0743J8269Q4309m2347l0541R9528R7914J1101j46312r4861
14239g7785J3210m5651K7309M0171q750K0088j5952o8571P1527R0423K8216K4720
$$ y = [-13268, 65013, -1609, -34222, -131090, -110219, -47511, -31939, -28600, -53031, -146155, -113333, -50023, -79572, -177850, -235404, -185785, -71321, -15028, 59408, 114353, 87273, -39013, -69205, -21491, -25227, 60255, 134447, 107757, -956, 53622, 50373, 25057, 16195, 1439, -20068, -10453, -10306, -77124, -44970, -24475, 12765, 44072, 148018, 189938, 125754, 130892, 118977, 75432, 63478, -72822, -114085, -5969, 7116, -5086, -39262, -47270, -96471, -117119, -60762, 49194, 81041, -8335, -17178, -27856, -28808, 17103, 4722, 40645, -25786, -84670, -105588, -74845, -56576, 27733, -14614, -45155, 54373, 152287, 163388, 17076, -77785, -64575, -110226, -82917, -42746, -51496, -31408, -47360, -115931, -44404, 46019, 74235, 98955]
14227I8955K4107m9716p7296k2635J3587Q5121o3926j33271j7817Q5052P0429
14216A2590l4684q6147p7532m5697j6966J3038J03553J89353L2491r1928l7223
14205c9152n8527M0915N7415P666p2970J5810j179m1138j17430N2356Q2576k353
14193g6011k1222L7776L7200L7803N4245q4616j1454o3927p1736P6751L2153N8787
14181E749P1521o2219r1685q0340L7008L1431L7224J66098o0430j15640P8107
14170A6824L8611m2577k7051L8000n726m4430L6394O2062o8500q638N399j2741
14158a2373j1962o9353l4069L2699Q988j02448k3332J60469R2988J3228l3679
14147B1156l5139m0094m3687J779L823o993k5063Q670P2207P1162o501K2602M1907
$$ y = [98955, 123062, 73346, -3950, -26585, -12998, 72123, 8197, -125074, -142891, -57839, 12590, -22094, -108241, -185773, -231470, -248436, -235398, -131845, 57508, 89999, -1929, -39152, -97679, -56764, 651, 8317, -64653, -48843, -50022, -91160, -208590, -156234, -73658, -76011, -97233, -59457, -22257, 15546, 69791, -14825, -26279, -90206, -161942, -85191, -53038, 5749, 77270, 15051, -76634, -156974, -119966, -88535, -51311, 114787, 54357, -61283, 16824, 55435, 12858, -14193, 23807, 18081, -26349, 10045, 72107, 3607, -5031, 368, -12373, -24335, -93688, -127757, -95058, -86070, -188518, -211850, -51381, 41607, 54835, 21156, -13983, -54077, -97764, -95985, -92162, -99155, -124218, -115548, -43341, 27821, 21320, 43922, 85829]
14134H5829o5273q8704k8051O239P254Q835l3098p5409O5668l9562L2920N2989
14122g0363n2578N7994L8263J5583K0335j1658K8098L7198j11280q0766r1936
14111b21110M8864P1651R073o3054L0425M7715L895o2217J3344L4339m6848N2954
14099h0969N5800Q6558j2468p1907L031K6659p6975p4991J00099p1462j24996
14088b41621O3470R2880O4816O7394L3851q3584p153J25244L0138m6682R010K8705
14076A36468j21346k6454M6368o3357o6365j104o2467l9408P4204R5732J44212
14065A16483K9349k6252p3681M5230N8199m0762p1653j6203n7316m9326J2481
14054g3451P2986p5823p8334L5858J05719J08875Q349j20406j42864P4060J23619
$$ y = [85829, 20556, -68148, -96199, -89960, -82706, -73871, -106969, -182378, -116710, -156272, -123352, -70363, -122941, -64947, -26684, -11101, 9234, -2424, 25674, 62872, -48408, -129174, -221110, -172246, -100595, -91522, -154576, -124151, -76436, -72541, -134758, -121414, -87075, -133923, -80969, -25169, 61389, 48921, -22986, -19955, 6704, -70271, -145262, -45163, -116625, -241621, -178151, -85271, -20455, 46939, 80790, -2794, -9947, 115297, 145435, 98753, 107763, 136468, 15122, -11332, 35036, -28321, -94686, -95790, -158257, -197665, -123461, -27729, 116483, 145832, 119580, 45899, 91129, 149328, 108566, 36913, 20710, -36606, -85932, -73451, -465, -76288, -154622, -118764, -13045, 95830, 104179, -16227, -159091, -85031, 38588]
14043C8588Q3562j3389o0855J5534K5914L9542n003q6062Q0K9146m011k8917K9383
14030F3512K0831j886n4067n9718L3657j8768q419l0949j112J4561O5780L5238
14018E8660m4296q1746L8997J43880l9587q5275p0400k9899l4401K7504n9618
14007a76181O5847P7894K1700N6108l1380R960L7796m4028J8032r0224p5568n6889
13995a86933L4781J8678l6292l1648k8424J5816K17989q8339l4834N6107R4097
13984C0998m3013L359O5835j9873l0035j9363R4101q837k3316J9753p4564L519
13972a436P9688j20634J5990R2814l1584o4917O1465k2298N7238N0078m8931m5575
13960B1898q4543R5343R895Q452M4575j05442j24644J2354R149j6091J17312P6862
$$ y = [38588, 122150, 108761, 47906, 63440, 89354, 128896, 123893, 37831, 37911, 67057, 63046, 34129, 63512, 84343, 82457, 28390, -31328, 2329, -16439, -24858, -55807, -56919, -42358, 23422, 58660, 14364, -67382, -28385, 115495, 75908, -9367, -79767, -109666, -144067, -116563, -176181, -110334, -32440, -10740, 45368, 13988, 23948, 61744, 17716, 35748, -54476, -130044, -186933, -152152, -133474, -169766, -201414, -229838, -214022, 3967, -84372, -119206, -63099, 30998, -12015, -8656, 57179, 37306, 7271, -12092, 82009, 73172, 49856, 69609, -4955, -1436, 78252, -42382, -26392, 66422, 34838, -30079, 31386, 9088, 66326, 116404, 67473, 21898, -62645, 32698, 42593, 51045, 95620, -9822, -134466, -122112, -112963, -129054, -11742, 65120]
13948F5120O7343j8314j19064o5580k213L0673q129O9370j47036M4879Q4843K1486
13936B3378k6019p8348k004J13298M3933L6402M6816p7984o1277m4630j1342n7870
13924i5647L5141l1953N3943Q8940j1298k2960L7457k8394j3322K1273k2282l6207
13912b5309j1090K0943P6750j4304K0478l9809m2586P2157L2480n1630r7126n9542
13900a18588k6193o63L8922Q6066Q620m0948J3556Q235j9838L780O95j9834m4267
13887a10457q611K0672P52O1241O8475k3828N6228j1185N8956N0614o7992m8571
13875D6294J8404N5033K3491k5941m5323O5801n56j7361o2171j09130l6025m1523
13863a29007K3289K6592J08421Q8102n8487n1462j70437k7235J01769J01196j5013
$$ y = [65120, 132463, 114149, -4915, -70495, -72708, -42035, -50164, 19206, -127830, -82951, 1892, 23378, -2641, -80989, -82993, 30305, 74238, 110640, 157456, 79472, 18195, -26435, -37777, -95647, -60506, -92459, -38516, 50424, 39126, 16166, 53623, 25229, 11907, 33180, 10898, -25309, -36399, -15456, 61294, 46990, 67468, 27659, -14927, 57230, 89710, 38080, -59046, -118588, -144781, -145444, -106522, -20456, -11836, -52784, -39228, -30993, -50831, -47051, -46356, -66190, -110457, -119068, -98396, -97644, -36403, 32072, 8244, 64472, 53287, 112243, 162857, 94865, 46294, 64698, 119731, 143222, 117281, 71958, 137759, 137203, 119842, 57671, -51459, -87484, -129007, -105718, -79126, 29295, 117397, 58910, 7448, -162989, -190224, -88455, 12741, -2272]
13852b272p3526n813Q5708J52501o0510j18308M6287J2834n0155j4166M3936m4689
13840b8173l1976M2365N4449l6864J9084j9737L5866r0258j48939M0785J46964
13829a6434m616l9013M3524J401P852R3818R269p7509p461l9074M776P0337L951
13816E0821p7623k6963M4630L2263J5387j445l6975K6644o5465N5696J02506o5821
13804E3655r3656L7626m6517o146L6076L3825m1274J7873J2860q952R1393O707
13792I3470N648k0472k5376k846R1235n9828j45272l1511K8302K1765O1683q699
$$ y = [-2272, -75798, -81611, 4097, 156598, 96088, -22220, 24067, 36901, -13254, -27420, 16516, -28173, -60149, -17784, 36665, -199, 18885, -852, 35014, -55244, -204183, -163398, -16434, -21050, -60063, -16539, -15138, -7286, 86532, 95801, 18292, 10831, -28243, -23467, 46870, 50821, -26802, -53765, -9135, 23128, 38515, 37070, 95, 26739, -38726, 16970, 119476, 53655, -40001, -2375, -48892, -55038, -18962, 14863, -26411, -8538, 4322, -4630, 86763, 93470, 99118, 78646, 53270, 50424, 141659, 81831, -63441, -94952, -66650, -44885, 16798, 8099]
$$ [...]
##END NTUPLES=NMR SPECTRUM
##END=
