##TITLE=Analysis number 311979
Compound Code cc 05609
Book Reference 446/8
Project Code adrs
Chemist Name roba
##JCAMPDX= 6.0         $$ Bruker NMR JCAMP-DX V2.0
##DATA TYPE= NMR SPECTRUM
##DATA CLASS= NTUPLES
##ORIGIN= Bruker BioSpin GmbH
##OWNER= NMR
$$ XWIN-NMR		Version 3.5
$$ Thu Jul 21 09:28:01 2005 GMT Daylight Time (UT+1h)  MAYBRIDGE\NMR@NMR_250MHZ
##.OBSERVE FREQUENCY= 250.131544655141
##.OBSERVE NUCLEUS= ^1H
##.ACQUISITION MODE= SIMULTANEOUS (DQD)
##.ACQUISITION SCHEME= undefined
##.AVERAGES= 16
##.DIGITISER RES= 18
##SPECTROMETER/DATA SYSTEM= dpx250
##.PULSE SEQUENCE= zg30
##.SOLVENT NAME= CDCl3
##.SHIFT REFERENCE= (INTERNAL, CDCl3, 0, 16.522)
##AUDIT TRAIL= $$ (NUMBER, WHEN, WHO, WHERE, WHAT)
$$ ##TITLE= Audit trail, XWIN-NMR		Version 3.5
$$ ##JCAMPDX= 5.01
$$ ##ORIGIN= Bruker BioSpin GmbH
$$ ##OWNER= NMR
$$ C:\u/data/dgb/nmr/ADRS/6230/pdata/1/auditp.txt
$$ ##AUDIT TRAIL=  $$ (NUMBER, WHEN, WHO, WHERE, WHAT)
(   1,<2005-07-21 09:27:31.91 +100>,<MAYBRIDGE\NMR>,<NMR_250MHZ>,
      <created by zg, POWCHK disabled, PULCHK disabled
       configuration hash MD5:
       62 19 C7 07 E1 42 D1 B7 37 6C 3D D0 77 39 F9 E6
       data hash MD5: 64K
       97 0D CB 93 F3 B1 BD 6E B4 19 4D 81 BE 16 26 D5>)
(   2,<2005-07-21 09:27:43.47 +100>,<MAYBRIDGE\NMR>,<NMR_250MHZ>,
      <Start of raw data processing
       ef LB = 0.3 FT_mod = 6 PKNL = 1 SI = 32K 
       data hash MD5: 32K
       B4 92 20 5B 82 37 9A 06 7B F7 10 1E 13 D3 AF 18>)
(   3,<2005-07-21 09:27:45.72 +100>,<MAYBRIDGE\NMR>,<NMR_250MHZ>,
      <apk 
       data hash MD5: 32K
       47 86 0F DA 62 F1 4B C4 72 2E 6F AE B5 B9 ED AB>)
(   4,<2005-07-21 09:27:46.54 +100>,<MAYBRIDGE\NMR>,<NMR_250MHZ>,
      <abs ABSG = 5 
       data hash MD5: 32K
       A7 F5 2C C3 09 C0 C9 C4 58 81 64 18 A8 AB 7A 8A>)
$$ ##END=
$$ 
$$ hash MD5
$$ DE 2C BC 19 6D 27 34 04 73 52 2F 70 F0 F7 76 5F
##$RELAX= 
##$RELAX= 
##$RELAX= 
##$RELAX= 
##$RELAX= 
##$RELAX= 
##$RELAX= 
$$ Bruker specific parameters
$$ --------------------------
##$DU= <C:\u>
##$EXPNO= 6230
##$NAME= <ADRS>
##$PROCNO= 1
##$TYPE= <nmr>
##$USER= <dgb>
##$AMP= (0..31)
100 100 100 100 100 100 100 100 100 100 100 100 100 100 100 100 100 100 
100 100 100 100 100 100 100 100 100 100 100 100 100 100 
##$AQSEQ= 0
##$AQ_mod= 3
##$AUNM= <au_zg>
##$AUTOPOS= <1 >
##$BF1= 250.13
##$BF2= 250.13
##$BF3= 250.13
##$BF4= 250.13
##$BF5= 500.13
##$BF6= 500.13
##$BF7= 500.13
##$BF8= 500.13
##$BYTORDA= 1
##$CFDGTYP= 0
##$CFRGTYP= 5
##$CHEMSTR= <none>
##$CNST= (0..31)
1 1 145 1 1 1 1 1 1 1 1 1 1 1 1 1 1 1 1 1 1 1 1 1 1 1 1 1 1 1 1 1 
##$CPDPRG= <>
##$CPDPRG1= <>
##$CPDPRG2= <>
##$CPDPRG3= <>
##$CPDPRG4= <mlev>
##$CPDPRG5= <mlev>
##$CPDPRG6= <mlev>
##$CPDPRG7= <mlev>
##$CPDPRG8= <mlev>
##$CPDPRGB= <>
##$CPDPRGT= <>
##$D= (0..31)
0 1 0 0 0 0 0 0 0 0.06 0 0 0 0 0 0 0.0002 0 0 0 0 0 0 0 0 0 0 0 0 0 0 
0 
##$DATE= 1121934450
##$DBL= (0..7)
120 120 120 120 120 120 120 120 
##$DBP= (0..7)
150 150 150 150 150 150 150 150 
##$DBP07= 0
##$DBPNAM0= <>
##$DBPNAM1= <>
$$ [...]
##$SUBNAM7= <"">
##$SUBNAM8= <"">
##$SUBNAM9= <"">
##$SW= 20.6930455092707
##$SWIBOX= (0..15)
0 0 3 0 0 0 0 0 0 0 0 0 0 0 0 0 
##$SW_h= 5175.983436853
##$TD= 65536
##$TD0= 1
##$TE= 295.16
##$TE2= 300
##$TE3= 300
##$TEG= 300
##$TL= (0..7)
0 120 120 120 120 120 120 120 
##$TP= (0..7)
150 150 150 150 150 150 150 150 
##$TP07= 0
##$TPNAME0= <>
##$TPNAME1= <>
##$TPNAME2= <>
##$TPNAME3= <>
##$TPNAME4= <>
##$TPNAME5= <>
##$TPNAME6= <>
##$TPNAME7= <>
##$TPOAL= (0..7)
0.5 0.5 0.5 0.5 0.5 0.5 0.5 0.5 
##$TPOFFS= (0..7)
0 0 0 0 0 0 0 0 
##$TUNHIN= 0
##$TUNHOUT= 0
##$TUNXOUT= 0
##$USERA1= <user>
##$USERA2= <user>
##$USERA3= <user>
##$USERA4= <user>
##$USERA5= <user>
##$V9= 5
##$VALIST= <valist>
##$VCLIST= <CCCCCCCCCCCCCCC>
##$VD= 0
##$VDLIST= <DDDDDDDDDDDDDDD>
##$VPLIST= <PPPPPPPPPPPPPPP>
##$VTLIST= <TTTTTTTTTTTTTTT>
##$WBST= 1024
##$WBSW= 4
##$XGAIN= (0..3)
0 0 0 0 
##$XL= 0
##$YL= 0
##$YMAX_a= 325585
##$YMIN_a= -383549
##$ZGOPTNS= <>
##$ZL1= 120
##$ZL2= 120
##$ZL3= 120
##$ZL4= 120
##$ABSF1= 16.522
##$ABSF2= -4.171173
##$ABSG= 5
##$ABSL= 3
##$ALPHA= 0
##$AQORDER= 0
##$ASSFAC= 0
##$ASSFACI= 0
##$ASSFACX= 0
##$ASSWID= 0
##$AUNMP= <proc_1d>
##$AZFE= 0.1
##$AZFW= 0.1
##$BCFW= 0
##$BC_mod= 0
##$BYTORDP= 0
##$COROFFS= 0
##$CY= 12.5
##$DATMOD= 1
##$DC= 0
##$DFILT= <>
##$DTYPP= 0
##$F1P= 14.0000005364418
##$F2P= -0.99999901652339
##$FCOR= 0.5
##$FTSIZE= 32768
##$FT_mod= 6
##$GAMMA= 0
##$GB= 0
##$INTBC= 1
##$INTSCL= 1
##$ISEN= 128
##$LB= 0.3
##$LEV0= 0
##$LPBIN= 0
##$MAXI= 10000
##$MC2= 0
##$MEAN= 0
##$ME_mod= 0
##$MI= 0
##$NCOEF= 0
##$NC_proc= -4
##$NLEV= 6
##$NOISF1= 0
##$NOISF2= 0
##$NSP= 0
##$NTH_PI= 0
##$NZP= 0
##$OFFSET= 16.522
##$PC= 1
##$PHC0= -80.16071
##$PHC1= 6.600245
##$PH_mod= 1
##$PKNL= yes
##$PPARMOD= 0
##$PSCAL= 4
##$PSIGN= 0
##$REVERSE= no
##$SF= 250.13
##$SI= 32768
##$SIGF1= 0
##$SIGF2= 0
##$SINO= 400
##$SIOLD= 32768
##$SREGLST= <1H.CDCl3>
##$SSB= 0
##$STSI= 32768
##$STSR= 0
##$SW_p= 5175.98343685301
##$SYMM= 0
##$S_DEV= 0
##$TDeff= 65536
##$TDoff= 0
##$TI= <Analysis number 999999
Compound Code 99
Book Reference 9
Project Code 9>
##$TILT= no
##$TM1= 0
##$TM2= 0
##$TOPLEV= 0
##$USERP1= <user>
##$USERP2= <user>
##$USERP3= <user>
##$USERP4= <user>
##$USERP5= <user>
##$WDW= 1
##$XDIM= 32768
##$YMAX_p= 460406814
##$YMIN_p= -347653
$$ End of Bruker specific parameters
$$ ---------------------------------
##NTUPLES= NMR SPECTRUM
##VAR_NAME=  FREQUENCY,     SPECTRUM/REAL,   SPECTRUM/IMAG
##SYMBOL=    X,             R,               I
##VAR_TYPE=  INDEPENDENT,   DEPENDENT,       DEPENDENT
##VAR_FORM=  AFFN,          ASDF,            ASDF
##VAR_DIM=   32768,         32768,           32768
##UNITS=     HZ,            ARBITRARY UNITS, ARBITRARY UNITS
##FACTOR=    0.157963299565203, 1,           1
##FIRST=     4132.6476996994, 0,             0
##LAST=      -1043.33573715361, 0,           0
##MIN=       -1043.33573715361, -347653,     0
##MAX=       4132.6476996994, 460406814,     0
$$ Real data points
##PAGE= N=1
##DATA TABLE= (X++(R..R)), XYDATA
$$ [...]
$$ plain form
19875 284737 313144 292718 178309 173535 189181 162278 115798 125668 146558 116976 104600 104212
19863 104212 144089 139150 121182 112448 103369 103238 188146 243493 317595 321565 295889 278238 243682
19850 243682 235521 175417 174581 256577 276429 280688 302712 254707 274332 324956 264740 221415
19838 221415 174493 151637 191222 271423 254327 237391 205564 164096 205002 253678 237093
19827 237093 206897 190405 214367 263890 259211 259372 234123 223335 207210 237319 265930 244022
19815 244022 296241 325520 315680 285106 270445 267366 268230 243025 220763 200605 132681 99252
19803 99252 66706 100994 149078 209896 224870 201536 167446 82125 49931 59662 16721 27279
19791 27279 113760 178156 193449 206756 159702 156285 134839 128699 110444 118108 131147 153571
$$ packed form
19875B84737K8407k0426j14409m774J5646k6903m6480R870K0890k9582j2376l88
19863A04212L9877m939j7968q734r079j31Q4908N5347P4102L970k5676j7651l4556
19850B43682q161o0104q36Q1996J9852M259K2024m8005J9625N0624o0216m3325
19838B21415m6922k2856L9585Q0201j7096j6936l1827m1468M0906M8676j6585
19827B37093l0196j6492K3962M9523m679J61k5249j0788j6125L0109K8611k1908
19815B44022N2219K9279r840l0574j4661l079Q64k5205k2262k0158o7924l3429
19803I9252l2546L4288M8084O0818J4974k3334l4090q5321l2194R731m2941J0558
19791B7279Q6481O4396J5293J3307m7054l417k1446o140j8255P664J3039K2424
$$ plain form
19779 153571 171825 144700 90915 70813 32160 13102 6361 11631 46279 126914 145723 119906
19767 119906 128156 124448 101753 104280 128646 133478 145136 200573 189198 191570 151770 140064
19755 140064 113054 117196 116398 157256 234400 283619 281772 256336 214021 177505 191563 235362
19743 235362 254182 256210 314126 311699 352177 363494 386679 387803 410053 493491 565499 651861
19731 651861 780740 877210 874907 824589 760293 651294 514791 473589 517763 571834 658726
19720 658726 724215 712796 708094 606041 507360 405763 352648 273792 241272 253998 273368
19709 273368 311030 253252 256892 305127 253469 197472 191817 238462 243320 188340 165578 139593
19697 139593 165518 203631 187492 124212 110032 117152 119800 119615 141143 211083 139634 134115
$$ packed form
19779A53571J8254k7125n3785k0102l8653j9058o741N270L4648Q0635J8809k5817
19767A19906Q250l708k2695K527K4366M832J1658N5437j1375K372l9800j1706
19755A40064k7010M142p98M0858P7144M9219j847k5436m2315l6516J4058M3799
19743B35362J8820K028N7916k427M0478J1317K3185J124K2250Q3438P2008Q6362
19731F51861J28879R6470k303n0318o4296j08999j36503m1202M4174N4071Q6892
19720F58726O5489j1419m702j02053r8681j01597n3115p8856l2520J2726J9370
19709B73368L7662n7778L640M8235n1658n5997n655M6645M858n4980k2762k5985
19697A39593K5925L8113j6139o3280j4180P120K648j85K1528O9940p1449n519
$$ plain form
19685 134115 132761 202963 316892 421061 542631 664730 706434 732828 699570 653039 519568
19674 519568 456631 448900 446112 534312 606497 673410 665887 623758 515969 471944 380184 240277
19662 240277 184236 114785 121877 124250 68470 31037 2529 3265 -17868 22167 54960 102204
19650 102204 100087 102998 110451 118161 132406 167558 179820 251026 254508 151482 133629 153119
19638 153119 128623 98738 108508 118833 138725 113017 93645 91962 143070 167283 107997 115110
19626 115110 182370 134155 107824 64789 47584 67141 66133 75234 119286 148249 124892 94205
19614 94205 40139 70954 139254 143801 95763 121716 142031 132718 127725 175357 191204 131019
19602 131019 101972 146731 155676 147706 165150 146784 89899 52291 17568 23263 4099 28665
$$ packed form
19685A34115j354P0202J13929J04169J21570J22099M1704K6394l3258m6531j33471
19674E19568o2937p731k788Q8200P2185O6913p523m2129j07789m4025r1760j39907
19662B40277n6041o9451P092K373n5780l7433k8508P36k1133M0035L2793M7244
19650A02204k117K911P453P710J4245L5152J2262P1206L482j03026j7853J9490
19638A53119k4496k9885R770J0325J9892k5708j9372j683N1108K4213n9286P113
19626A15110O7260m8215k6331m3035j7205J9557j008R101M4052K8963k3357l0687
19614I4205n4066L0815O8300M547m8038K5953K0315r313m993M7632J5847o0185
19602A31019k9047M4759Q945p970J7444j8366n6885l7608l4723N695j9164K4566
$$ plain form
19590 28665 52792 45464 32760 5403 81812 72577 26643 57051 40618 30626 67260 81437
19578 81437 94655 106440 109473 55273 13079 -14955 33665 37002 -35483 -72671 -32853 25860
19566 25860 49193 79793 56230 64198 82354 85699 87488 66440 -932 26856 100386 107205
19554 107205 158014 170598 147629 154726 79860 56753 82197 97828 64754 85461 112569 120735
19542 120735 100710 95875 69253 81416 69716 30598 6814 120602 179699 179485 169227 148492
19530 148492 179758 186327 182668 186270 147635 93494 63129 72655 76084 65363 7703 9520 75995
19517 75995 186358 212158 140520 84753 26508 30998 80441 66885 68700 30004 25635 8876
19505 8876 14169 33372 44890 -6988 -45647 -85073 -64268 -97981 -52014 8100 30886 18642
$$ packed form
19590B8665K4127p328j2704k7357P6409r235m5934L0408j6433r992L6634J4177
19578H1437J3218J1785L033n4200m2194k8034M8620L337p2485l7188L9818N8713
19566B5860K3333L0600k3563P968J8156L345J789k1048o7372K7788P3530O819
19554A07205N0809J2584k2969P097p4866k3107K5444J5631l3074K0707K7108Q166
19542A20735k0025m835k6622J2163j1700l9118k3784J13788N9097k14j0258k0735
19530A48492L1266O569l659L602l8635n4141l0365R526L429j0721n7660J817O6475
19517G5995J10363K5800p1638n5767n8245M490M9443j3556J815l8696m369j6759
19505H876N293J9203J1518n1878l8659l9426K0805l3713M5967O0114K2786j2244
$$ plain form
19493 18642 25432 14837 61955 80045 51739 -5589 -32351 -36858 1296 27705 28352 17645
19481 17645 -5913 63334 166480 197793 149473 158320 198088 201821 210443 246825 307054 433543
19469 433543 553063 631982 644989 638188 586451 519291 466803 398927 354217 398367 511608
19458 511608 591759 653103 596757 553289 446799 375106 373904 297327 219673 204198 192138
19447 192138 199052 126430 122999 116240 178768 244779 296060 382541 460397 538134 557803 512199
19435 512199 471376 453766 444984 469541 444221 512507 593277 617888 622248 634776 598422 534582
19423 534582 479952 398245 308545 233587 267478 249343 207571 208698 203074 216271 200023 128357
19411 128357 142435 177476 176855 156932 122484 84878 137452 108111 57271 -12593 -20836 -14161
$$ packed form
19493A8642O790j0595M7118J8090k8306n7328k6762m507L8154K6409O47j0707
19481A7645k3558O9247J03146L1313m8320Q847L9768L733Q622L6382O0229J26489
19469D33543J19520P8919J3007o801n1737o7160n2488o7876m4710M4150J13241
19458E11608Q0151O1344n6346m3468j06490p1693j202p6577p7654j5475j2060
19447A92138O914p2622l431o759O2528O6011N1281Q6481P7856P7737J9669m5604
19435E12199m0823j7610q782K4557k5320O8286Q0770K4611M360J2528l6354o3840
19423E34582n4630q1707q9700p4958L3891j8135m1772J127n624J3197j6248p1666
19411A28357J4078L5041o21j9923l4448l7606N2574k9341n0840o9864q243O675
$$ plain form
19399 -14161 -28021 20285 20860 53551 32714 -20238 11447 66048 71416 29325 -13815 -23959
19387 -23959 -2634 37304 36802 23321 32548 43705 60487 35533 2685 18379 34576 37670
19375 37670 69088 60558 -1582 -8226 9361 -48258 -51223 -9880 187 5650 40097 71984
19363 71984 61012 27068 26764 52346 75022 81410 71157 86882 80404 79275 69818 90756 127650
19350 127650 131691 160534 151335 90886 148483 186726 230361 200025 179589 183791 149172 116749
19338 116749 95835 90713 165483 228832 214945 195790 203190 182792 118648 62273 78541 110217
19326 110217 69223 90563 132986 118196 118451 114645 65342 65272 31824 -5851 15581 47062 78629
19313 78629 123947 216468 244186 274104 289585 325898 287913 304015 352640 371309 365140 404228
$$ packed form
19399a4161j3860M8306N75L2691k0837n2952L1685N4601N368m2091m3140j0144
19387b3959K1325L9938n02j3481R227J1157J6782k4954l2848J5694J6197L094
19375C7670L1418q530o2140o644J7587n7619k965M1343J0067N463L4447L1887
19363G1984j0972l3944l04K5582K2676O388j0253J5725o478j129r457K0938L6894
19350A27650M041K8843r199o0449N7597L8243M3635l0336k0436M202l4619l2423
19338A16749k0914n122P4770O3349j3887j9155P400k0398o4144n6375J6268L1676
19326A10217m0994K1340M2423j4790K55l806m9303p0l3448l7675K1432L1481L1567
19313G8629M5318R2521K7718K9918J5481L6313l7985J6102M8625J8669o169L9088
$$ plain form
19301 404228 379889 333108 317339 315683 327062 376770 439315 504107 510590 535372 561942 476062
19289 476062 425913 383456 364381 391335 408539 433836 506195 577100 524604 481231 498449
19278 498449 519639 535995 511174 512058 539581 566129 536461 491544 504420 497955 495178 528328
19266 528328 513203 583847 682888 648357 640065 624710 713806 783431 789013 824306 810580 772756
19254 772756 756069 779928 822525 920069 982198 1018182 1104127 1154081 1275650 1419799 1643200
19243 1643200 1883163 2097374 2327191 2617613 2822779 2898519 2958144 3031127 3193566 3487230
19233 3487230 3876361 4401180 5118249 5962955 6840570 7709394 8666402 9922655 11610371
19224 11610371 14129000 18012396 24474404 35400981 52681545 75226346 96741780
$$ packed form
19301D04228k4339m6781j5769j656J1379M9708O2545O4792O483K4782K6570q5880
19289D76062n0149m2457j9075K6954J7204K5297P2359P0905n2496m3373J7218
19278D98449K1190J6356k4821Q84K7523K6548k9668m4917J2876o465k777L3150
19266E28328j5125P0644R9041l4531q292j5355Q9096O9625N582L5293j3726l7824
19254G72756j6687K3859M2597R7544O2129L5984Q5945M9954J21569J44149K23401
19243A643200K39963K14211K29817K90422K05166P5740N9625P2983J62439K93664
19233C487230L89131N24819P17069Q44706Q77615Q68824R57008J256253J687716
19224A1610371K518629L883396O462008J0926577J7280564K2544801K1515434
$$ plain form
19217 96741780 109715929 110560625 101482129 87290823 72745640 61809939 57779953 62930421
19209 62930421 77013229 95031474 108495884 111203522 102604356 86810079 68407777
19202 68407777 50926421 36640369 26394972 19640329 15418439 12713375 10869366 9526497
19194 9526497 8500512 7727672 7119476 6684123 6387243 6204196 6027480 5902825 5950363
19185 5950363 6051464 6223883 6400440 6660040 7069822 7588141 8215935 8917076 9753484
19176 9753484 10775800 12201689 14212283 17216897 22058096 30306875 44193649 65269036
19168 65269036 90729054 112668772 123384160 120490179 107923322 91404991 75884014
19161 75884014 65470094 63565667 71967269 89091921 108040215 119647709 118758866 106603009
$$ packed form
19217I6741780J2974149Q44696r078496j4191306j4545183j0935701m029986N150468
19209F2930421J4082808J8018245J3464410K707638q599166j5794277j8402302
19202F8407777j7481356j4286052j0245397o754643m221890k705064j844009j342869
19194I526497j025985p72840o08196m35353k96880j83047j76716j24655M7538
19185E950363J01101J72419J76557K59600M09782N18319O27794P01141Q36408
19176I753484J022316J425889K010594L004614M841199Q248779J3886774K1075387
19168F5269036K5460018K1939718J0715388k893981j2566857j6518331j5520977
19161G5884014j0413920j904427Q401602J7124652J8948294J1607494q88843j2155857
$$ plain form
19153 106603009 88124954 68087348 49855572 35530245 25521949 18966069 14750397
19146 14750397 12029656 10111186 8655735 7401767 6323790 5425704 4650538 4035804
19138 4035804 3565198 3291439 3153884 3107438 3116900 3041236 2848339 2578349 2218501 1917313
19128 1917313 1638921 1397725 1208963 1133714 1067898 1016095 1006495 930199 830415 809177 816721
19117 816721 825844 754170 676167 579662 581521 612435 623895 601825 561202 527865 520751 473911
19105 473911 387159 397739 442044 415103 424062 423340 377269 304295 325819 326579 366420 407757
19093 407757 376658 330143 375606 437257 429578 377289 375915 366969 342900 342227 388830 369708
19081 369708 260800 197536 196430 259878 261327 171691 144059 114003 93553 114164 78058 58570
$$ packed form
19153A06603009j8478055k0037606j8231776j4325327j0008296o555880m215672
19146A4750397k720741j918470j455451j253968j077977q98086p75166o14734
19138D035804m70606k73759j37555m6446R462p5664j92897k69990l59848l01188
19128A917313k78392k41196j88762p5249o5816n1803r600p6296r9784k1238P544
19117H16721R123p1674p8003r6505J859L0914J1460k2070m0623l3337p114m6840
19105D73911q6752J0580M4305k6941Q959p22m6071p2974K1524P60L9841M1337
19093D07757l1099m6515M5463O1651p679n2289j374q946k4069o73M6603j9122
19081C69708j08908o3264j106O3448J449q9636k7632l0056k0450K0611l6106j9488
$$ plain form
19069 58570 134789 123994 91227 44105 73580 133864 160407 169676 141438 182192 172818 183832
19057 183832 143276 137958 144406 111817 152976 181462 266735 287150 277637 241498 225647 234535
19045 234535 281199 297329 220234 178435 166895 162003 156453 143603 179313 164853 149413 181615
19033 181615 235499 228814 218939 215337 182296 143490 106556 81971 107961 101679 78816 67587
19021 67587 94177 21086 23404 68366 62236 16160 23149 92199 120482 185430 234084 209494
19009 209494 170661 110171 103394 126446 104348 106440 87002 117059 178595 190717 181953 193993
18997 193993 103217 101349 202093 202696 131426 129693 119654 75495 59160 -5917 -33810 -7087
18985 -7087 7709 8537 10237 -23005 6204 28120 36474 49036 8155 19669 112102 100712 72262
$$ packed form
19069E8570P6219j0795l2767m7122K9475O0284K6543R269k8238M0754r374J1014
19057A83832m0556n318O448l2589M1159K8486Q5273K0415r513l6139j5851Q888
19045B34535M6664J6130p7095m1799j1540m892n550j2850L5710j4460j5440L2202
19033A81615N3884o685r875l602l3041l8806l6934k4585K5990o282k2863j1229
19021F7587K6590p3091K318M4962o130m6076O989O9050K8283O4948M8654k4590
19009B09494l8833o0490o777K3052k2098K092j9438L0057O1536J2122q764J2040
18997A93993r0776j868J00744O03p1270j733j0039m4159j6335o5077k7893K6723
18985g087J4796Q28J700l3242K9209K1916Q354J2562m0881J1514R2433j1390k8450
$$ plain form
18972 72262 77105 84860 49457 14582 92363 95455 83778 146757 120744 69164 104557 88036
18960 88036 48477 17189 4489 69959 129997 99179 69057 97040 144630 123158 102775 87107
18948 87107 71346 32212 37080 19514 30493 61412 72834 106485 136416 143575 162504 175180
18936 175180 133234 115373 151660 143577 74332 67805 109831 143394 99404 95181 120613 52543
18924 52543 85935 94752 74401 38353 99735 138148 131630 111768 159209 134089 111024 115791
18912 115791 162326 178600 127915 128348 139771 96622 68415 76231 136078 159597 157779 161295
18900 161295 159821 68469 18657 -9104 -53037 -92744 -88909 -68839 -78224 -43057 17659 -4778
18888 -4778 -37330 -31885 -20581 -23147 34341 76065 66036 106847 95426 101468 48846 19356
$$ packed form
18972G2262M843P755l5403l4875P7781L092j1677O2979k6013n1580L5393j6521
18960H8036l9559l1288j2700O5470O0038l0818l0122K7983M7590k1472k0383j5668
18948H7107j5761l9134M868j7566J0979L0919J1422L3651K9931P159J8929J2676
18936A75180m1946j7861L6287q083o9245o527M2026L3563m3990m223K5432o8070
18924E2543L3392Q817k0351l6048O1382L8413o518j9862M7441k5120k3065M767
18912A15791M6535J6274n0685M33J1423m3149k8207P816N9847K3519j818L516
18900A61295j474r1352m9812k7761m3933l9707L835K0070r385L5167O0716k2437
18888d778l2552N445J1304k566N7488M1724j0029M0811j1421O042n2622k9490
$$ plain form
18876 19356 75958 62759 47586 67890 28944 70718 122227 132146 126922 85586 75308 61290
18864 61290 86215 152383 127716 130824 180590 167584 135958 136191 90289 -7160 -50843 -24549
18852 -24549 -34899 -61655 -40519 17843 74860 68683 40808 99481 88941 83790 18823 -1545
18840 -1545 -27862 -43773 13359 58047 49963 60655 77762 120687 129973 72754 22721 -20662
18828 -20662 5355 29284 26452 76566 111628 68648 69382 76448 82344 37271 62146 72960 99730
18815 99730 88601 102639 129537 67529 35776 75360 100593 82060 38283 46473 89876 106985
18803 106985 57667 14997 13580 -15795 -36502 -27426 -48720 -433 26232 -12462 -17123 4028
18791 4028 9801 49920 -7809 16639 -1355 -52011 -31206 -48076 -53770 -19395 51415 61600
$$ packed form
18876A9356N6602j3199j5173K0304l8946M1774N1509R919n224m1336j0278j4018
18864F1290K4925O6168k4667L108M9766j3006l1626K33m5902r7449m3683K6294
18852b4549j0350k6756K1136N8362N7017o177k7875N8673j0540n151o4967k0368
18840a545k6317j5911N7132M4688q084J0692J7107M2925R286n7219n0033m3383
18828b0662K6017K3929k832N0114L5062m2980P34P066N896m5073K4875J0814K6770
18815I9730j1129J4038K6898o2008l1753L9584K5233j8533m3777Q190M3403J7109
18803A06985m9318m2670j417k9375k0707R076k1294M8287K6665l8694m661K1151
18791D028N773M0119n7729K4448j7994n0656K0805j6870n694L4375P0810J0185
$$ plain form
18779 61600 73754 70834 46043 4762 -4710 26862 18006 61725 117671 152179 260151 417306
18767 417306 577008 662882 643973 594047 511834 384913 254772 101112 44810 -17296 -78905
18756 -78905 -90807 -24528 -11385 -17902 15581 42022 47747 19112 -14388 -24369 -17492 -26351 -36413
18743 -36413 -31957 -12291 44231 62348 37032 -11033 13783 49993 110550 94928 25117 51734
18731 51734 48609 9116 11753 25077 3943 72694 123850 51483 17004 38532 82267 89068
18719 89068 62165 9747 7114 37329 47327 51863 89971 87082 84606 72074 37035 -12422 -23081
18706 -23081 54073 69538 105409 108517 119910 244423 339896 488433 565109 622626 608792
18695 608792 556948 473743 481703 458702 411678 373483 450328 560366 598744 602876 532840 454051
$$ packed form
18779F1600J2154k920k4791m1281r472L1572q856M3719N5946L4508J07972J57155
18767D17306J59702Q5874j8909m9926q2213j26921j30141j53660n6302o2106o1609
18756g8905j1902O6279J3143o517L3483K6441N725k8635l3500r981O877q859j0062
18743c6413M456J9666N6522J8117k5316m8065K4816L6210O0557j5622o9811K6617
18731E1734l125l9493K637J3324k1134O8751N1156p2367l4479K1528M3735O801
18719H9068k6903n2418k633L0215R998M536L8108k889k476j2532l5039m9457j0659
18706b3081P7154J5465L5871L108J1393J24513R5473J48537P6676N7517j3834
18695F08792n1844q3205P960k3001m7024l8195P6845J10038L8378M132p0036p8789
$$ plain form
18683 454051 334535 229548 161321 109734 89364 136933 168888 103439 40954 -20898 -3281
18672 -3281 18965 38682 -19381 2772 93144 72066 54512 117332 200824 146615 155882 146560
18660 146560 124956 118456 169333 165096 195455 161788 171638 254507 319518 391812 549633 737911
18648 737911 907715 1140323 1341250 1348723 1236592 1136836 1027320 855455 727639 691700
18638 691700 759701 839706 854096 798062 710307 601073 437664 370102 325497 273655 245354
18627 245354 243960 223815 184369 193312 227901 177767 178401 292689 416644 514988 646505 780604
18615 780604 792217 743926 650725 565107 485204 393351 303885 275716 300628 330814 336983 310513
18603 310513 310568 329375 350492 318545 298260 298815 371733 508868 618748 663232 579558 530594
$$ packed form
18683D54051j19516j04987o8227n1587k0370M7569L1955o5449o2485o1852J7617
18672c281K2246J9717n8063K2153R0372k1078j7554O2820Q3492n4209R267r322
18660A46560k1604o500N0877m237L0359l3667R850Q2869O5011P2294J57821J88278
18648G37911J69804K32608K00927P473j12131r9756j09516j71865j27816l5939
18638F91700O8001Q0005J4390n6034q7755j09234j63409o7562m4605n1842k8301
18627B45354j394k0145l9446Q943L4589n0134O34J14288J23955R8344J31517J34099
18615G80604J1613m8291r3201q5618p9903r1853q9466k8169K4912L0186O169k6470
18603C10513N5J8807K1117l1947k0285N55P2918J37135J09880M4484q3674m8964
$$ plain form
18591 530594 452536 319372 218351 141976 77086 22132 35079 31188 57433 114204 124149
18580 124149 131663 177928 193617 177970 132320 90506 107658 154981 172637 247568 325594 301090
18568 301090 346535 479204 623750 681487 635344 576844 534251 432856 385693 357783 313883
18557 313883 228282 143938 125863 177589 187196 200794 218405 174258 210968 187149 164360 76481
18545 76481 87956 119060 122570 86087 101474 80680 51246 74398 112238 67464 22603 48152
18533 48152 80207 77428 80420 76119 100793 118405 92848 84931 50982 77818 49439 97361
18521 97361 117643 103508 29466 19683 105948 152010 144603 121850 99846 101046 72544 55293
18509 55293 23415 41944 75510 85219 60313 37202 -23795 -35869 31588 143893 188547 141534
$$ packed form
18591E30594p8058j33164j01021p6375o4890n4954J2947l891K6245N6771R945
18580A24149P514M6265J5689j5647m5650m1814J7152M7323J7656P4931P8026k4504
18568C01090M5445J32669J44546N7737m6143n8500m2593j01395m7163k7910m3900
18557C13883q5601q4344j8075N1726R607J3598J7611m4147L6710k3819k2789q7879
18545G6481J1475L1104L510l6483J5387k0794k9434K3152L7840m4774m4861K5549
18533D8152L2055k779K992m301K4674J7612k5557p917l3949K6836k8379M7922
18521I7361K0282j4135p4042r783Q6265M6062p407k2753k2004J200k8502j7251
18509E5293l1878J8529L3566R709k4906k3111o0997j2074O7457J12305M4654m7013
$$ plain form
18497 141534 110381 74261 74235 39790 46713 77250 166243 209238 148071 83578 35305 42707
18485 42707 78853 156283 158483 106561 72090 88413 143756 132202 83833 72676 43153 51293
18473 51293 25820 44448 98677 89937 4860 20149 42292 96322 132966 114173 40198 30277
18461 30277 65703 59198 90359 118049 130091 96332 64532 33220 51323 107929 134436 170697
18449 170697 130732 126069 163472 278828 351537 307040 223222 200270 179054 194916 177400
18438 177400 134365 136370 104397 115394 109804 40559 2066 -4028 67120 188067 250237 323946
18426 323946 466056 671746 811464 945037 1036407 1064870 1058551 1124543 1332907 1527791
18416 1527791 1513270 1457976 1351164 1192346 1097191 1038432 969367 874620 742221 578856
$$ packed form
18497A41534l1153l6120k6l4445O923L0537Q8993M2995o1167o4493m8273P402
18485D2707L6146P7430K200n1922l4471J6323N5343j1554m8369j1157k9523Q140
18473E1293k5473J8628N4229q740q5077J5289K2143N4030L6644j8793p3975r921
18461C0277L5426o505L1161K7690J2042l3759l1800l1312J8103N6606K6507L6261
18449A70697l9965m663L7403J15356P2709m4497q3818k2952k1216J5862j7516
18438A77400m3035K005l1973J0997n590o9245l8493o094P1148J20947O2170P3709
18426C23946J42110K05690J39718J33573R1370K8463o319O5992K08364J94884
18416A527791j4521n5294j06812j58818r5155n8759o9065r4747j32399j63365
$$ plain form
18406 578856 460117 389898 311169 225847 217498 209607 169121 115312 82862 89327 125081 165247
18394 165247 177954 185970 249711 293198 346483 376677 305983 252791 100049 -11405 -19726
18383 -19726 26982 61213 103843 77533 78978 81282 62942 49637 57508 76489 78258 51487
18371 51487 83978 137059 184059 100483 100374 173717 224105 207279 219216 306743 384713 354178
18359 354178 255326 207357 184249 190451 254799 213924 188603 237171 269666 241377 187778 223237
18347 223237 271427 328842 347568 349503 393931 430025 464024 464441 421089 351375 361706 401793
18335 401793 390228 400903 472007 469572 437302 358929 285162 241121 229541 161523 145717 162774
18323 162774 179009 215436 217851 214086 192673 234452 222244 185297 174319 187353 190366 220374
$$ packed form
18406E78856j18739p0219p8729q5322q349p891m0486n3809l2450O465L5754M0166
18394A65247J2707Q016O3741M3487N3285L0194p0694n3192j52742j11454q321
18383a9726M6708L4231M2630k6310J445K304j8340j3305P871J8981J769k6771
18371E1487L2491N3081M7000q3576j09P3343N0388j6826J1937Q7527P7970l0535
18359C54178r8852m7969k3108O202O4348m0875k5321M8568L2495k8289n3599L5459
18347B23237M8190N7415J8726J935M4428L6094L3999M17m3352o9714J0331M0087
18335D01793j1565J0675P1104k435l2270p8373p3767m4041j1580o8018j5806J7057
18323A62774J6235L6427K415l765k1413M1779j2208l6947j0978J3034L013L0008
$$ plain form
18311 220374 323255 318851 367405 426494 425566 449404 458787 462626 559278 561985 497130 494154 450439
18298 450439 366959 314475 284342 295180 253803 320996 294849 279169 246582 214188 210986 180019
18286 180019 162261 196340 264160 271689 228743 215512 220823 210930 209988 206576 220526 310230 337386
18273 337386 300970 235128 179930 199695 211574 183036 159429 127053 159825 196117 202615 168999
18261 168999 235196 352248 415108 461593 447392 433696 465333 455133 443785 390049 390893 365808
18249 365808 350270 380136 378621 329724 332977 391419 506022 564939 557196 531084 487084 499400
18237 499400 561661 620833 729590 770073 756447 758436 795520 864156 899439 944137 903196
18226 903196 874665 843012 814966 731642 691665 644665 598731 561724 505554 491007 504067
$$ packed form
18311B20374J02881m404M8554N9089r28K3838R383L839R6652K707o4855k976m3715
18298D50439q3480n2484l0133J0838m1377O7193k6147j5680l2587l2394l202l0967
18286A80019j7758L4079O7820P529m2946j3231N311r893r42l412J3950Q9704K7156
18273C37386l6416o5842n5198J9765J1879k8538k3607l2376L2772L6292O498l3616
18261A68999O6197J17052O2860M6485j4201j3696L1637j0200j1348n3736Q44k5085
18249C65808j5538K9866j515m8897L253N8442J14603N8917p743k6112m4000J2316
18237D99400O2261N9172J08757M0483j3626J989L7084O8636L5283M4698m0941
18226I03196k8531l1653k8046q3324l9977m7000m5934l7007n6170j4547J3060
$$ plain form
18215 504067 511449 483146 484416 467304 445096 459909 521259 556209 561394 578097 578395 621958
18203 621958 662597 685530 748497 781125 791653 777907 731582 768398 841488 860091 816254
18192 816254 751443 724176 755592 756437 750136 721582 715015 751489 778199 797773 811588 767310
18180 767310 755294 779958 838965 883321 936685 969274 1004546 1006994 1018013 1030846 947841 965697
18168 965697 999150 916354 886284 864053 901713 913773 965756 1063993 1166539 1253102 1358462
18157 1358462 1547207 1824532 2066234 2238316 2367461 2464964 2515784 2602723 2756576 2924423
18147 2924423 3154886 3584649 4133689 4725767 5467727 6349979 7336600 8520977 10090612
18138 10090612 12108715 14904307 19005485 25700097 37301375 58361706 92033046 123510218
$$ packed form
18215E04067P382k8303J270j7112k2208J4813O1350L4950N185J6703K98M3563
18203F21958M0639K2933O2967L2628J0528j3746m6325L6816P3090J8603m3837
18192H16254o4811k7267L1416Q45o301k8554o567L6474K6710J9574J3815m4278
18180G67310j2016K4664N9007M4356N3364L2589L5272K448J1019J2833q3005J7856
18168I65697L3453q2796l0070k2231L7660J2060N1983R8237J02546Q6563J05360
18157A358462J88745K77325K41702J72082J29145R7503N0820Q6939J53853J67847
18147B924423K30463M29763N49040N92078P41960Q82252R86621J184377J569635
18138A0090612K018103K795592M101178O694612J1601278K1060331L3671340L1477172
$$ plain form
18130 123510218 130647550 119771035 101999751 80146435 58174716 41190904 29945745
18123 29945745 22909298 18536014 15691315 13982918 13125874 12947098 13310493 14219477 15690292
18114 15690292 17997253 21741682 28007834 39736396 63436092 101869653 128153489
18107 128153489 126425674 116638859 106242109 98392679 103636555 125276905 141429899
18100 141429899 136301042 119868401 98970117 75544122 54248651 38906533 29014776
18093 29014776 22898245 19166095 16906310 15644434 15164169 15520988 16717213 18857950
18085 18857950 22515981 29030750 41102828 63402792 95554623 118458578 118380298 105903009
18077 105903009 88252297 67442435 48120550 33968423 24577208 18594181 14646231
$$ packed form
18130A23510218P137332j0876515j7771284k1853316k1971719j6983812j1245159
18123B9945745p036447m373284k844699j708397q57044j78776L63395R08984J470815
18114A5690292K306961L744429O266152J1728562K3699696L8433561K6283836
18107A28153489j727815r786815j0396750p849430N243876K1640350J6152994
18100A41429899n128857j6432641k0898284k3425995k1295471j5342118r891757
18093B9014776o116531l732150k259785j261876m80265L56819J196225K140737
18085A8857950L658031O514769J2072078K2299964L2151831K2903955p8280j2477289
18077A05903009j7650712k0809862j9321885j4152127r391215n983027l947950
$$ plain form
18070 14646231 11929233 10048955 8764395 7938338 7511219 7226173 7137709 7251845 7583810
18061 7583810 8068510 8747011 9830639 11396781 13626105 16632964 21216241 29107687
18053 29107687 43716001 69519851 101023733 115994533 110075966 95565905 76753020
18046 76753020 56102278 38617266 26564056 18859864 13872038 10595942 8383520 6814933
18038 6814933 5748667 4953556 4329663 3819263 3391816 3059393 2754715 2530873 2375968
18029 2375968 2249279 2191695 2240125 2216021 2101374 1935922 1832351 1613497 1412384 1377464
18019 1377464 1320826 1274352 1191970 1147366 1160546 1182466 1206226 1270337 1302276 1248606 1221252
18008 1221252 1192354 1167738 1159560 1201429 1172871 995696 909207 870235 826583 808103 823112
$$ packed form
18070A4646231k716998j880278j284560q26057m27119k85046q8464J14136L31965
18061G583810M84700O78501J083628J566142K229324L006859M583277P891446
18053B9107687J4608314K5803850L1503882J4970800n918567j4510061j8812885
18046G6753020k0650742j7485012j2053210p704192m987826l276096k212422j568587
18038F814933j066266p95111o23893n10400m27447l32423l04678k23842j54905
18029B375968j26689n7584M8430k4104j14647j65452j03571k18854k01113l4920
18019A377464n6638m6474q2382m4604J3180K1920K3760O4111L1939n3670k7354
18008A221252k8898k4616q178M1869k8558j77175q6489l8972m3652j8480J5009
$$ plain form
17997 823112 769470 705503 612106 541154 494575 502091 544858 559048 563352 556251 500797 558141
17985 558141 602955 609033 612067 649671 674713 660374 640318 583453 608502 674198 676990 603920
17973 603920 620553 664944 576041 513923 483877 503466 510399 517057 589891 594342 548451 475388
17961 475388 470727 568704 640776 641154 662101 677364 655084 719167 738421 751150 784182 866524
17949 866524 942173 905076 859126 895759 972387 1006368 998164 997498 989886 1060334 1056330 1093796
17937 1093796 1121004 1079613 1085098 1035904 1060286 1053065 1046185 1093706 1140867 1217922 1312746 1486666
17925 1486666 1620889 1865798 2125057 2392062 2586602 2690873 2826380 2943958 3133716
17916 3133716 3509389 3886756 4209362 4290102 4390079 4575537 4924057 5467756 6141751 6752154
$$ packed form
17997H23112n3642o3967r3397p0952m6579P516M2767J4190M304p101n5454N7344
17985E58141M4814O078L034L7604K5042j4339k0056n6865K5049O5696K792p3070
17973F03920J6633M4391q8903o2118l0046J9589O933O658P2834M451m5891p3063
17961D75388m661R7977P2072L78K0947J5263k2280O4083J9254J2729L3032Q2342
17949H66524P5649l7097m5950L6633P6628L3981q204o66p612P0448m004L7466
17937A093796K7208m1391N485m9194K4382p221o880M7521M7161P7055R4824J73920
17925A486666J34223K44909K59259K67005J94540J04271J35507J17578J89758
17916C133716L75673L77367L22606Q0740R9977J85458L48520N43699O73995O10403
$$ plain form
17906 6752154 7412632 8160253 9081784 10247735 11690918 13446418 15514753 18082972 21477712
17897 21477712 26161989 33440361 45502948 65655922 93512630 120766181 138736762
17890 138736762 144537612 144879613 150114668 171123681 209656656 246805827 263276729
17883 263276729 251755273 224537675 195414850 173990805 164427564 160438091 152379091
17876 152379091 135595641 113193151 89543030 67417374 49218301 35999636 27133604
17869 27133604 21410001 17758196 15308060 13379782 11662504 10153169 8912998 8007416
17861 8007416 7337893 6784338 6253923 5750768 5312473 4999855 4752319 4455310 4057095
17852 4057095 3702317 3352698 3035166 2834861 2694535 2518230 2358166 2176356 1945252
$$ packed form
17906F752154O60478P47621R21531J165951J443183J755500K068335K568219L394740
17897B1477712M684277P278372J2062587K0152974K7856708K7253551J7970581
17890A38736762N800850L42001N235055K1009013L8532975L7149171J6470902
17883B63276729j1521456k7217598k9122825k1424045r563241l989473q059000
17876A52379091j6783450k2402490k3650121k2125656j8199073j3218665q866032
17869B7133604n723603l651805k450136j928278j717278j509335j240171r05582
17861H007416o69523n53555n30415n03155m38295l12618k47536k97009l98215
17852D057095l54778l49619l17532k00305j40326j76305j60064j81810k31104
$$ plain form
17843 1945252 1706850 1464044 1348757 1350366 1298082 1219897 1181971 1095167 1053126 973245 943684
17832 943684 946880 903153 862603 799042 793032 788181 799099 785140 656709 550420 503947 476090
17820 476090 410218 396519 376684 385490 408043 400770 353404 378318 436445 447145 418905 471541
17808 471541 441466 397728 411543 443072 507981 496238 450197 422831 409536 445993 360998
17797 360998 289186 311786 382280 313825 185393 93139 87309 82705 84831 94382 72080 95502
17785 95502 104387 169643 186894 132780 73090 100684 139860 155400 142755 124005 176872 213659
17773 213659 261095 283714 239933 196990 193921 154609 77952 35130 80543 97837 86290 98035
17761 98035 105111 90513 129395 208483 202394 107468 44926 72391 138531 166540 159472 161942
$$ packed form
17843A945252k38402k42806j15287J609n2284p8185l7926q6804m2041p9881k9561
17832I43684L196m3727m0550o3561o010m851J0918j3959j28431j06289m6473k7857
17820D76090o5872j3699j9835Q806K2553p273m7366K4914N8127J0700k8240N2636
17808D71541l0075m3738J3815L1529O4909j1743m6041k7366j3295L6457q4995
17797C60998p1812K2600P0494o8455j28432r2254n830m604K126R551k2302K3422
17785I5502Q885O5256J7251n4114n9690K7594L9176J5540j2645j8750N2867L6787
17773B13659M7436K2619m3781m2943l069l9312p6657m2822M5413J7294j1547J1745
17761I8035P076j4598L8882P9088o089r4926o2542K7465O6140K8009p068K470
$$ plain form
17749 161942 173445 155847 107100 76616 83634 125973 197959 204852 86703 -19497 16388
17738 16388 -21478 -49042 -34660 -2837 -19698 -11830 19162 9401 32344 108775 167888 230393
17726 230393 314473 311544 342648 364173 269605 314208 357173 350938 251354 203511 240963 190475
17714 190475 117474 100629 109375 82612 66030 72447 87709 91155 96713 86474 127118 124453
17702 124453 115302 189942 183091 150842 141287 122639 105894 94231 98985 124523 159551 185170
17690 185170 138562 138044 63617 59814 130325 158205 148202 108605 84430 61216 -12701 -55888
17678 -55888 -33793 -45840 -13695 45171 73481 55350 35954 -17090 -4368 58134 100454 107170
17666 107170 95465 123311 98495 66362 16963 15768 42892 50051 101809 92326 39186 -11946
$$ packed form
17749A61942J1503j7598m8747l0484P018M2339P1986O893j18149j06200L5885
17738A6388l7866k7564J4382L1823j6861P868L0992r761K2943P6431N9113O2505
17726B30393Q4080k929L1104K1525r4568M4603M2965o235r9584m7843L7452n0488
17714A90475p3001j6845Q746k6763j6582O417J5262L446N558j0239M0644k665
17702A24453r151P4640o851l2249r555j8648j6745j1663M754K5538L5028K5619
17690A85170m6608n18p4427l803P0511K7880j0003l9597k4175k3214p3917m3187
17678e5888K2095j2047L2145N8866K8310j8131j9396n3044J2722O2502M2320O716
17666A07170j1705K7846k4816l2133m9399j195K7124P159N1758r483n3140n1132
$$ plain form
17654 -11946 -57368 -71399 5069 -32644 -62413 -76364 -49746 -55674 26783 31288 14029 26922
17642 26922 81960 71375 -2429 -25240 -21952 -44346 13273 41238 728 26411 49452 70109
17630 70109 44966 10381 -13868 60681 73396 35568 -4708 -10969 -16429 19701 91756 124138
17618 124138 128452 154425 188654 222691 274016 245656 326901 480595 670564 725991 727004
17607 727004 663767 527381 458048 380443 362824 281625 238968 265631 288839 349560 314312
17596 314312 278027 302235 294874 192901 140775 169421 236635 236962 237168 251014 306410 349220
17584 349220 384632 409758 390133 493136 667997 814456 792593 656542 429470 218440
17574 218440 138870 37557 23086 27575 1583 -60025 -136534 -164528 -144927 -99354 -112995
$$ packed form
17654a1946m5422j4031P6468l7713k9769j3951K6618n928Q2457M505j7259J2893
17642B6922N5038j0585p3804k2811L288k2394N7619K7965m0510K5683K3041K0657
17630G0109k5143l4585k4249P4549J2715l7828m0276o261n460L6130P2055L2382
17618A24138M314K5973L4229L4037N1325k8360Q1245J53694J89969N5427J013
17607G27004o3237j36386o9333p7605j7619q1199m2657K6663K3208O0721l5248
17596C14312l6285K4208p361j01973n2126K8646O7214L27K06J3846N5396M2810
17584C49220L5412K5126j9625J03003J74861J46459k1863j36051k27072k11030
17574B18440p9570j01313j4471M489k5992o1608p6509k7994J9601M5573j3641
$$ plain form
17563 -112995 -66757 -31056 -14436 153372 340210 462999 469075 415727 344434 217192 152820
17552 152820 79516 19796 -3882 -38658 24754 9058 14055 -15864 -15533 -54427 -112130 -82155
17540 -82155 -58959 -58226 -35926 -7956 23258 49459 33577 8776 94092 218289 338700 493812
17528 493812 535909 538186 470761 379234 331793 209728 88248 49300 25662 10860 -5831
17517 -5831 -15654 -14931 15900 30226 1791 -22915 -45273 -77861 -49235 1966 -23715 -29805 -44714
17504 -44714 -85434 -69583 -68837 -48304 -36230 -17187 -24057 -30385 -8872 18763 8981 12370 -46600
17491 -46600 -29772 1029 12419 36579 43986 53231 45927 20216 31002 42471 12875 -8000
17479 -8000 8904 57807 29084 -2416 71110 115655 121075 94572 12757 -654 4818 37945
$$ packed form
17563a12995M6238L5701J6620J67808J86838J22789O076n3348p1293j27242o4372
17552A52820p3304n9720k3678l4776O3412j5696M997k9919L31l8894n7703K9975
17540h2155K3196P33K2300K7970L1214K6201j5882k4801Q5316J24197J20411J55112
17528D93812M2097K277o7425r1527m7441j22065j21480l8948k3638j4802j6691
17517e831r823P23L0831J4326k8435k4706k2358l2588K8626N1201k5681o090j4909
17504d4714m0720J5851P46K0533J2074J9043o870o328K1513K7635r782L389n8970
17491d6600J6828L0801J1390K4160P407R245p304k5711J0786J1469k9596k0875
17479h000J6904M8903k8723l1500P3526M4545N420k6503q1815j3411N472L3127
$$ plain form
17467 37945 54229 35971 38772 55786 37544 -76885 -45400 -39759 -66927 -69420 -52251 6532
17455 6532 31451 44605 38797 3842 -34198 -37571 -48026 -7370 59350 112662 131606 158668
17443 158668 316005 605798 652676 477492 336840 212583 91393 112285 100502 9407
17433 9407 -3770 21992 -40757 -76085 -75240 -96355 -92797 -116928 -63996 -70679 -100929 -107395 -82868
17420 -82868 -36586 -10949 5752 -33999 -42737 -24159 -18339 -58234 -88276 -99252 -87253 -81348
17408 -81348 -100497 -50774 -7865 -14191 -53586 -87435 -84199 -57823 -55014 -48828 -16240 4101
17396 4101 -31118 7034 38985 29286 -68079 -103433 -64981 -18126 5644 -28187 -62768 -62701 -50211
17383 -50211 5841 -11298 -36908 3727 20350 63503 91329 113343 89594 -12998 -81477
$$ packed form
17467C7945J6284j8258K801J7014j8242j14429L1485N641k7168k493J7169N8783
17455F532K4919J3154n808l4955l8040l373j0455M0656O6720N3312J8944K7062
17443A58668J57337K89793M6878j75184j40652j24257j21190K0892j1783r1095
17433I407j3177K5762o2749l5328Q45k1115L558k4131N2932o683l0250o466K4527
17420h2868M6282K5637J6701l9751q738J8578N820l9895l0042j0976J1999N905
17408h1348j9149M9723M2909o326l9395l3849L236K6376K809O186L2588K0341
17396D101l5219L8152L1951r699r7365l5354L8452M6855K3770l3831l4581O7J2490
17383e0211N6052j7139k5610M0635J6623M3153K7826K2014k3749j02592o8479
$$ plain form
17372 -81477 -94256 -70140 3661 26870 -13859 -45946 -76363 -57599 -62046 -22699 -34371 -34449
17360 -34449 -12706 20413 64219 198009 316008 449598 526871 669333 760921 799705 824916
17349 824916 948361 1138209 1293690 1382218 1346608 1230447 1068406 990016 920095 810471
17339 810471 805514 818190 661841 485262 360175 245053 169765 141334 81651 9437 -50030
17328 -50030 -25002 10163 44161 85974 36280 13819 4776 19587 45690 -13362 15857 46558
17316 46558 87075 14085 -73028 -82645 -61429 -74646 -19872 23180 30605 -26562 -54961 -19221
17304 -19221 -3834 -16623 -18950 -3892 -21599 -705 8048 43581 56782 92368 88107 76707
17292 76707 70378 17533 -60269 -77222 -32014 -32312 -21580 -33664 -50037 -44614 -137124 -137126 -45081
$$ packed form
17372h1477j2779K4116P3801K3209m0729l2087l0417J8764m447L9347j1672p8
17360c4449K1743L3119M3806J33790J17999J33590P7273J42462R1588L8784K5211
17349H24916J23445J89848J55481Q8528l5610j16161j62041p8390o9921j09624
17339H10471m957J2676j56349j76579j25087j15122p5288k8431n9683p2214n9467
17328e0030K5028L5165L3998M1813m9694k2461r043J4811K6103n9052K9219L0701
17316D6558M0517p2990q7113r617K1216j3217N4774M3052P425n7167k8399L5740
17304a9221J5387j2789k327J5058j7707K0894Q753L5533J3201L5586m261j1400
17292G6707o329n2845p7802j6953M5208k98J0732j2084j6373N423r2510kR2045
$$ plain form
17279 -45081 5720 38528 28933 34154 -30165 -65212 -42193 -85618 -154426 -156465 -76630 -42370
17267 -42370 -40460 -38155 -25723 31483 37841 13038 13967 -27199 7350 -1908 -40794 -50839 -21881
17254 -21881 -43698 -75630 -54741 -46755 -68036 -39896 -57505 -75514 -23554 29848 51663 66824
17242 66824 11630 -50359 -22284 27984 61452 43785 86993 56493 12268 42 13749 19485
17230 19485 -51549 -153630 -99155 -45136 -44001 -50276 -65412 -44464 2991 14259 25195 1131
17218 1131 -71439 -140436 -214766 -188891 -148525 -87377 -82532 -83869 -19780 -22194 -17671 -37991 -47017
17205 -47017 -53212 2812 11241 7619 1931 3456 -57441 -83807 11643 5904 -46210 -44173 -10513
17192 -10513 -5754 -34399 -90578 -160617 -120395 -64836 -21696 -14888 -16103 -39338 -13758 -34919
$$ packed form
17279d5081N0801L2808r595N221o4319l5047K3019m3425o8808k039P9835L4260
17267d2370J910K305J2432N7206O358k4803R29m1166L4549r258l8886j0045K8958
17254b1881k1817l1932K0889P986k1281K8140j7609j8009N1960N3402K1815J5161
17242F6824n5194o1989K8075N0268L3468j7667M3208l0500m4225j2226J3707N736
17230A9485p1034j02081N4475N4019J135o275j5136K0948M7455J1268J0936k4064
17218A131p2570o8997p4330K5875M0366O1148M845j337O4089k414M523k0320r026
17205d7017o195N6024Q429l622n688J525o0897k6366R5450n739n2114K037L3660
17192a0513M759k8645n6179p0039M0222N5559M3140O808j215k3235K5580k1161
$$ plain form
17180 -34919 -107638 -153432 -100060 -69400 -4163 47776 44788 120390 191177 233397 301905 343084
17168 343084 338849 256768 205544 121302 34794 742 -15229 11847 61819 44169 42254 -15681
17156 -15681 -61570 -80977 -88899 -67334 -51611 -24887 -3000 -38516 -49121 54285 92050 82913
17144 82913 51016 22469 -7070 -51528 -60090 -9163 -18479 11187 57153 64453 74061 149825
17132 149825 221152 233931 259081 297950 363261 353838 325593 335040 337205 358712 320173 242675
17120 242675 229503 204411 175143 125161 45352 -1237 -30289 -26045 -18505 5356 50808 75448
17108 75448 22546 -37266 -128262 -161161 -127668 -84888 -72707 -104367 -68896 -36083 -44989 -62637
17096 -62637 -95623 -96400 -88071 -95212 -99827 3240 -4342 -91 83903 89961 36015 122152 171865
$$ packed form
17180c4919p2719m5794N3372L0660O5237N1939k988P5602P0787M2220O8508M1179
17168C43084m235q2081n1224q4242q6508l4052j5971K7076M9972j7650j915n7935
17156a5681m5889j9407p922K1565J5723K6724K1887l5516j0605J03406L7765r137
17144H2913l1897k8547k9539m4458q562N0927r316K9666M5966P300R608P5764
17132A49825P1327J2779K5150L8869O5311r423k8245R447K165K1507l8539p7498
17120B42675j3172k5092k9268m9982p9809m6589k9052M244P540K3861M5452K4640
17108G5448n2902n9812r0996l2899L3493M2780J2181l1660L5471L2813q906j7648
17096f2637l2986p77Q329p141m615J03067p582M251Q3994O058n3946Q6137M9713
$$ plain form
17083 171865 161763 123212 95194 37084 -20522 -11872 -8112 -13870 -15083 -24028 -25193 -73083 -89218
17070 -89218 -101760 -83812 -61537 -56621 -41974 40595 82471 74416 10430 -45273 -129217 -175131
17058 -175131 -142134 -150331 -144736 -170904 -147373 -128787 -45251 -11246 -22835 -60873 -102554 -39434
17046 -39434 -29335 -66035 -80034 -95887 -49753 -7755 51491 56580 25058 18237 26713 23780
17034 23780 -27936 -27209 6369 -6500 -38954 -44050 -52968 -44238 -81543 -110241 -128078 -79653 -44453
17021 -44453 -56057 -67872 -57139 -54400 -79867 -170791 -203942 -170056 -144529 -130665 -112250 -82032
17009 -82032 -123670 -144326 -118759 -113479 -24809 -11308 -64632 -69507 -75538 -65300 -33304 -39030
16997 -39030 -58711 -81864 -95386 -73685 -26232 -21136 -8112 24202 -8422 -9018 -6342 -57471
$$ packed form
17083A71865j0102l8551k8018n8110n7606Q650L760n758j213q945j165m7890j6135
17070h9218j2542J7948K2275M916J4647Q2569M1876q055o3986n5703q3944m5914
17058a75131L2997q197N595k6168K3531J8586Q3536L4005j1589l8038m1681O3120
17046c9434J0099l6700j3999j5853M6134M1998N9246N089l1522o821Q476k933
17034B3780n1716P27L3578j2869l2454n096q918Q730l7305k8698j7837M8425L5200
17021d4453j1604j1815J0733K739k5467r0924l3151L3886K5527J3864J8415L0218
17009h2032m1638k0656K5567N280Q8670J3501n3324m875o031J0238L1996n726
16997c9030j9681k3153j3522K1701M7453N096J3024L2314l2624n96K676n1129
$$ plain form
16985 -57471 -124650 -183327 -200704 -194022 -32442 -33284 -64045 -123788 -108993 -56155 -57309 -60380
16973 -60380 -73671 -90775 -84766 -37587 -7960 9287 6045 -22247 -51475 -96871 -152346 -93493
16961 -93493 12701 62438 85477 73573 39841 4904 3201 -22533 -28309 -44372 -72416 -118906
16949 -118906 -132752 -75437 -57359 37743 61631 -20414 -44932 -69257 -70532 1841 -48645 -122828
16937 -122828 -112550 -8500 42809 3338 -33819 -59824 -91947 -50572 -30410 -47714 -20342
16926 -20342 11373 -8232 -10835 13514 -28038 -63650 -45032 -87733 -141444 -123542 -115419 -104544
16914 -104544 -3406 29495 32120 -12720 -54940 -31673 -20568 -1769 26093 24339 -18810 18090
16902 18090 -19088 -35361 8285 6822 -6223 -1729 -19076 -50763 6306 45274 74762 119157
$$ packed form
16985e7471o7179n8677j7377O682J61580q42l0761n9743J4795N2838j154l071
16973f0380j3291j7104O009M7179K9627J7247l242k8292k9228m5396n5475N8853
16961i3493J06194M9737K3039j1904l3732l4937j703k5734n776j6063k8044m6490
16949a18906j3846N7315J8078R5102K3888q2045k4518k4325j275P2373n0486p4183
16937a22828J0278J04050N1309l9471l7157k6005l2123M1375K0162j7304K7372
16926b0342L1715j9605k603K4349m1552l5612J8618m2701n3711J7902Q123J0875
16914a04544J01138L2901K625m4840m2220K3267J1105J8799K7862j754m3149L6900
16902A8090l7178j6273M3646j463j3045M494j7347l1687N7069L8968K9488M4395
$$ plain form
16890 119157 118335 40697 73296 51136 -28324 27189 6780 -47328 -25860 -8546 -11567 -27616
16878 -27616 -27268 16838 78288 53953 21982 -55192 -45044 -7556 -18956 -42442 -68962 -92926
16866 -92926 -38083 -36217 -26168 -12047 -11359 33082 110056 136078 74926 -9937 -28585 -32199
16854 -32199 -30496 -44165 -9262 -26414 -48884 -61514 -13457 34498 24045 -3710 4329 -224
16842 -224 -2354 -39096 -8791 48674 24008 -29515 -51320 -33869 -32336 -13003 -15021 4867 6979
16829 6979 -10765 -50104 -61650 -21672 -45852 -88428 -73053 -61057 -16247 -16094 33324 15137
16817 15137 -13739 27347 92100 111117 73957 74584 99580 90046 75358 59981 13710 -15957
16805 -15957 -994 -53063 -30156 -13711 55513 105154 106858 60935 4090 66517 63739 1034
$$ packed form
16890A19157q22p7638L2599k2160p9460N5513k0409n4108K1468J7314l021j6049
16878b7616L48M4106O1450k4335l1971p7174J0148L7488j1400k3486k6520k3964
16866i2926N4843J866J0049J4121O88M4441P6974K6022o1152q4863j8648l614
16854c2199J703j3669L4903j7152k2470j2630M8057M7955j0453k7755Q039m553
16842b24k130l6742L0305N7465k4666n3523k1805J7451J533J9333k018J9888K112
16829F979j7744l9339j1546L9978k4180m2576J5375J1996M4810J53M9418j8187
16817A5137k8876M1086O4753J9017l7160O27K4996r534j4688j5377m6271k9667
16805a5957J4963n2069K2907J6445O9224M9641J704m5923n6845O2427k778o2705
$$ plain form
16793 1034 -53165 -81784 -72430 -77301 -36575 -21839 -37372 -54973 -26461 -39032 -70624 -53940
16781 -53940 -68663 -39804 -45955 -67332 -54067 -51486 -89558 -90450 -72778 -72291 -69744 -84858 -66587
16768 -66587 -68879 -55627 -87034 -67691 -45922 6916 9564 -33339 -75324 -36971 -40322 -78812
16756 -78812 -84824 -115365 -65919 -51171 -58480 -71001 -78882 -60104 -86952 -112039 -114791 -93635
16744 -93635 -72046 -113403 -183030 -125386 -73475 -59736 -52115 -58088 -62482 -45817 -23402 -38842
16732 -38842 -64694 -74747 -88868 -81073 -80738 -64397 -30946 -23836 12109 31521 16114 -13556
16720 -13556 7622 -11533 -8053 -9281 -33975 -22189 -54050 -20241 1115 -36401 -41228 -9780
16708 -9780 68647 50031 4070 -2348 23834 8747 5930 918 -27221 -59302 -63494 -101602 -120158
$$ packed form
16793A034n4199k8619R354m871M0726J4736j5533j7601K8512j2571l1592J6684
16781e3940j4723K8859o151k1377J3265K581l8072q92J7672M87K547j5114J8271
16768f6587k292J3252l1407J9343K1769N2838K648m2903m1985L8353l351l8490
16756g8812o012l0541M9446J4748p309j2521p881J8778k6848k5087k752K1156
16744i3635K1589m1357o9627N7644N1911J3739P621n973m394J6665K2415j5440
16732c8842k5852j0053j4121P795L35J6341L3451P110L5945J9412j5407k9670
16720a3556K1178j9155L480j228k4694J1786l1861L3809K1356l7516m827L1448
16708i780P8427j8616m5961o418K6182j5087k817n012k8139l2081m192l8108j8556
$$ plain form
16695 -120158 -118357 -126572 -141277 -117891 -96972 -98297 -82968 -65284 -25904 -23413 -51683 -107241
16683 -107241 -105035 -102033 -99702 -99997 -70742 -61345 -86992 -50020 -19148 -28090 -42557 -6393 7390
16670 7390 -60925 -75130 -65736 -88037 -103389 -41352 31508 -20380 -50698 -53762 -38340 -8978
16658 -8978 -18179 -10244 -12871 -28812 -77508 -59367 -6649 1093 35493 -2128 -91906 -90674 -63611
16645 -63611 -42885 -35367 -28122 -18764 -39460 -150316 -135728 -93396 -47184 -124746 -148669 -125275
16633 -125275 -57208 -534 31118 -29857 -70593 -55657 -56618 -46351 -69568 -94768 -118560 -104050
16621 -104050 -55327 -65075 -85669 -52162 -26953 -34311 -27743 -22561 -34158 -53722 -49055 -25768
16609 -25768 -41234 -66111 -114857 -106310 -89863 -128482 -113592 -74820 -67057 -77041 -57879 -84327
$$ packed form
16695a20158J801q215j4705K3386K0919j325J5329J7684L9380K491k8270n5558
16683a07241K206L002K331k95K9255R397k5647L6972L0872q942j4467L6164J3783
16670G390o8315j4205R394k2301j5352O2037P2860n1888l0318l064J5422K9362
16658h978r201P935k627j5941m8696J8141N2718P742L4400l7621q9778J232K7063
16645f3611K0726P518P245R358k0696j10856J4588M2332M6212p7562k3923K3394
16633a25275O8067N6674L1652o0975m0736J4936r61J0267k3217k5200k3792J4510
16621a04050M8723r748k0594L3507K5209p358O568N182j1597j9564M667K3287
16609b5768j5466k4877m8746Q547J6447l8619J4890L8772P763r984J9162k6448
$$ plain form
16597 -84327 -81783 31030 29131 20712 38992 36638 -17162 -54111 -20709 -9736 17414 31774
16585 31774 35581 -9153 -29459 -28439 -47438 -57885 -33388 -61973 -16282 13467 9368 -9740
16573 -9740 13511 17664 26484 -11656 -81489 -79936 -116772 -157869 -125995 -75824 -8597 43779
16561 43779 61580 92552 38665 -18844 -15519 -49430 -89455 -99580 -86995 -108225 -127154 -140729
16549 -140729 -123734 -76558 -40544 -5865 -31133 -49350 -95536 -96309 -13163 -20752 -80349 -121421
16537 -121421 -75608 -73663 -40535 -47571 -66560 -54980 -43620 -12528 -73288 -118275 -123021 -93608
16525 -93608 -6653 -22624 -56963 -45696 -71120 -60409 -12723 46729 47786 -32009 -81155 -113675
16513 -113675 -157941 -109456 -59294 -12346 -9253 2212 28644 -2655 -41039 22848 5325 -3089
$$ packed form
16597h4327K544J12813j899q419J8280k354n3800l6949L3402J0973K7150J4360
16585C1774L807m4734k0306J020j8999j0447K4497k8585M5691K9749m099j9108
16573i740K3251M153Q820l8140o9833J553l6836m1097L1874N0171O7227N2376
16561D3779J7801L0972n3887n7509L325l3911m0025j0125J2585k1230j8929j3575
16549a40729J6995M7176L6014L4679k5268j8217m6186p73Q3146p589n9597m1072
16537a21421M5813J945L3128p036j8989J1580J1360L1092o0760m4987m746K9413
16525i3608Q6955j5971l4339J1267k5424J0711M7686N9452J057p9795m9146l2520
16513a13675m4266M8485N0162M6948L093J1465K6432l1299l8384O3887j7523q414
$$ plain form
16501 -3089 -29120 -58287 -80423 -91836 -47513 -69173 -72813 11793 -18183 -46707 -78717 -65604
16489 -65604 -43607 -31422 -46034 -68840 -53911 -52047 -98890 -49227 3536 3688 71022 82166
16477 82166 11964 -45427 -48722 -5573 -25983 -59208 -76359 -92214 -53976 -18941 -13692 13922
16465 13922 -18386 -16843 -6503 -65578 -60896 -31617 -27808 -55496 -77752 -66133 -20650 7332
16453 7332 6240 -9926 -83800 -90750 20092 42050 -9975 -90685 -109326 -83371 -75499 -29848
16441 -29848 8816 15282 18792 -6559 -12518 -7282 58538 109488 74709 18595 3372 -24256
16429 -24256 -7233 -16500 -23628 -38231 -81846 -74861 -50315 -667 6549 -2838 -14913 -47943 -105224
16416 -105224 -99244 -53908 -28402 -77438 -88453 -79790 -71940 -108185 -63789 2049 -29759 -48330
$$ packed form
16501c089k6031k9167k2136j1413M4323k1660l640Q4606k9976k8524l2010J3113
16489f5604K1997J2185j4612k2806J4929J864m6843M9663N2763J52O7334J1144
16477H2166p0202n7391l295M3149k0410l3225j7151j5855L8238L5035N249K7614
16465A3922l2308J543J0340n9075M682K9279L809k7688k2256J1619M5483K7982
16453G332j092j6166p3874o950J10842K1958n2025q0710j8641K5955P872M5651
16441b9848L8664O466L510k5351n959N236O5820N0950l4779n6114j5223k7628
16429b4256J7023r267p128j4603m3615O985K4546M9648P216r387j2075l3030n7281
16416a05224N980M5336K5506m9036j1015Q663P850l6245M4396O5838l1808j8571
$$ plain form
16404 -48330 -71843 -41855 -13445 -23505 -1823 14970 37630 17283 -24835 -83995 -85586 -30605
16392 -30605 -4188 -7208 -3987 17694 -27389 -36090 -67825 -81878 -74959 -83536 -103657 -113221 -90685
16379 -90685 -34508 -13746 -17599 -19914 -8966 1935 -12097 -1248 -38188 -34202 -32392 -36587 -31511
16366 -31511 -32113 -55385 -49621 -46391 -63787 -91012 -111067 -143772 -117457 -56808 4502 5452 -81921
16353 -81921 -98439 -49611 -60195 21243 -13309 -13785 -15032 16317 5766 -52676 -64660 -75468
16341 -75468 -83517 -69733 -44276 5500 50768 25787 19786 -3754 -181 43967 26247 -1562
16329 -1562 -34174 -51672 -70078 -104771 -32903 -35357 -42701 -49801 -58180 -21387 -169 -31479 -55655
16316 -55655 -60636 -88885 -152352 -101213 -58313 -52111 -85875 -65688 -80172 -79696 -78061 -106970 -89802
$$ packed form
16404d8330k3513K9988K8410j0060K1682J6793K2660k0347m2118n9160j591N4981
16392c0605K6417l020L221K1681m5083q701l1735j4053O919q577k0121r564K2536
16379i0685N6177K0762l853k315J0948J0901j4032J0849l6940L986J810m195N076
16366c1511o02k3272N764L230j7396k7225k0055l2705K6315O0649O1310R50q7373
16353h1921j6518M8828j0584Q1438l4552m76j247L1349j0551n8442j1984j0808
16341g5468q049J3784K5457M9776M5268k4981o001k3540L573M4148j7720k7809
16329a562l2612j7498j8406l4693P1868k454p344p100q379L6793K1218l1310k4176
16316e5655m981k8249o3467N1139M2900O202l3764K0187j4484M76J635k8909J7168
$$ plain form
16303 -89802 -36441 -3248 -7790 7607 -82635 -92262 -115576 -151966 -137688 -79583 -49067 -34941
16291 -34941 -31218 3903 -7573 -40845 -74077 -49278 17619 46197 89855 31180 -85065 -130865
16279 -130865 -85114 -14027 -97540 -171252 -201737 -133988 -95845 -57738 9409 27262 -405
16268 -405 -37696 -9576 4865 -29323 -53831 -65824 -53061 -69594 -28599 -24850 -63368 -37404
16256 -37404 -7762 -2267 -26813 -25700 -9500 39170 56198 63543 57294 -80 -62704 -43449
16244 -43449 -6486 -35476 -45101 -35229 -38471 -108143 -136409 -149227 -125804 -112220 -92705 -93068 -81074
16231 -81074 -77421 -70421 -85699 -38125 -17139 10029 -1124 -37690 -71975 -73602 -65088 -71331 -43090
16218 -43090 20132 83775 70634 21985 51353 72546 119388 63638 27736 -2996 -27838 6746
$$ packed form
16303h9802N3361L3193m542J5397r0242r627k3314l6390J4278N8105L0516J4126
16291c4941L723L5121j1476l3272l3232K4799O6897K8578M3658n8675j16245m5800
16279a30865M5751P1087q3513p3712l0485O7749L8143L8107O7147J7853k7667
16268d05l7291K8120J4441l4188k4508j1993J2763j6533M0995L749l8518K5964
16256c7404K9642N495k4546J113J6200M8670J7028P345o249n7374o2624J9255
16244d3449L6963k8990r625R872l242o9672k8266j2818K3423J3584J9515l63J1994
16231h1074L653P000j5278M7574K0986K7168j1153l6566l4285j627Q514o243K8241
16218d3090O3222O3643j3141m8649K9368K1193M6842n5750l5902l0732k4842L4584
$$ plain form
16206 6746 41907 29902 -4342 39321 72233 46689 64403 58097 -13902 11490 59019 28555
16194 28555 -46016 -42078 -37402 -33141 -2671 3164 20001 -8016 -59710 -74057 -29896 51736
16182 51736 44343 -14292 -48479 -8096 32445 6410 9214 -22591 -12390 -1369 18432 43854
16170 43854 -5179 -20902 -3374 322 -38898 -31603 -12327 12177 45715 36184 51308 16141
16158 16141 18364 -16595 13401 74097 43206 19507 51352 22264 45954 11584 24096 -8521
16146 -8521 -47845 -17064 64943 89240 47035 70344 53385 27803 27150 63244 56814 29758
16134 29758 -7185 -2878 1613 51335 82212 69465 59732 26489 2938 -18754 -11916 4324
16122 4324 231 8200 9347 -28556 24482 36982 20740 -52891 -44765 -115 -11522 -46254 -25835
$$ packed form
16206F746L5161j2005l4244M3663L2912k5544J7714o306p1999K5392M7529l0464
16194B8555p4571L938M676M261L0470N835J6837k8017n1694j4347M4161Q1632
16182E1736p393n8635l4187M0383M0541k6035K804l1805J0201J1021J9801K5422
16170D3854m9033j5723J7528L696l9220P295J9276K4504L3538r531J5124l5167
16158A6141K223l4959K9996O0696l0891k3699L1845k9088K3690l4370J2512l2617
16146h521l9324L0781Q2007K4297m2205K3309j6959k5582o53L6094o430k7056
16134B9758l6943M307M491M9722L0877j2747r733l3243k3551k1692O838J6240
16122D324m093P969J147l7903N3038J2500j6242p3631Q126M4650j1407l4732K0419
$$ plain form
16109 -25835 21051 13322 -9165 -29597 -13596 -3418 10077 13556 -70885 -56402 2531 -4764
16097 -4764 39652 50857 186 2717 38034 67364 84710 116973 69738 10747 -11329 -21250
16085 -21250 -56067 -72654 -66642 -45466 -17181 3324 42296 67952 43234 -3843 35086 -6916
16073 -6916 -50884 -77601 -60249 -31228 -20819 48693 72525 51723 38672 58926 104119 80552
16061 80552 52798 39901 72692 6643 -24665 -50647 -63653 -106447 -156475 -142153 -146238 -177997
16049 -177997 -117754 -42140 2194 43362 684 -6534 32501 -14911 -104899 -66968 10621 1942
16037 1942 -67287 -88727 -88032 -53869 28911 -24145 -72388 -52358 -76010 -139223 -128644 -53629
16025 -53629 -41313 -39162 -6053 16710 51026 40598 -13038 -53772 -36249 -56294 -65235 -51560
$$ packed form
16109b5835M6886p729k2487k0432J6001J0178J3495L479q4441J4483N8933p295
16097d764M4416J1205n0671K531L5317K9330J7346L2263m7235n8991k2076r921
16085b1250l4817j6587O012K1176K8285K0505L8972K5656k4718m7077L8929m2002
16073f916m3968k6717J7352K9021J0409O9512K3832k0802j3051K0254M5193k3567
16061H0552k7754j2897L2791o6049l1308k5982j3006m2794n0028J4322m085l1759
16049a77997O0243P5614M4334M1168m2678p218L9035m7412q9988L7931P7589q679
16037A942o9229k1440O95L4163Q2780n3056m8243K0030k3652o3213J0579P5015
16025e3629J2316K151L3109K2763L4316j0428n3636m0734J7523k0045q941J3675
$$ plain form
16013 -51560 -47120 -31997 24233 -1845 3162 -21576 -8369 -42986 -86826 -65748 -24224 1586
16001 1586 48678 36767 -2662 -73592 -28063 72307 109019 90648 47294 2943 -31809 -58946
15989 -58946 -31271 -11901 -47523 -115072 -97852 25225 53413 33328 2313 -9075 -1842 -3304
15977 -3304 -38082 -56473 -85083 -86306 -66400 -4761 71425 15930 -29141 22835 8389 -26094
15965 -26094 -76454 -120949 -143982 -137707 -80818 -6439 -292 32522 69427 54169 26023 -54
15953 -54 13609 7993 -6876 -52007 -88872 -98134 -111091 -39339 42491 43989 31391 44429 -14256
15940 -14256 -64965 -94559 -76677 -45477 -54923 -9521 12823 674 41457 38398 16398 -38998
15928 -38998 -56785 -76310 -59006 -26460 421 -13554 -78351 -92969 -62674 -79896 -70149 -7350
$$ packed form
16013e1560M440J5123N6230k6078N007k4738J3207l4617m3840K1078M1524K5810
16001A586M7092j1911l9429p0930M5529J00370L6712j8371m3354m4351l4752k7137
15989e8946K7675J9370l5622o7549J7220J23077K8188k0085l1015j1388P233j462
15977c304l4778j8391k8610j223J9906O1639P6186n5495m5071N1976j4446l4483
15965b6094n0360m4495k3033O275N6889P4379O147L2814L6905j5258k8146k6077
15953e4J3663n616j4869m5131l6865r262j2957P1752Q1830J498j2598J3038n8685
15940a4256n0709k9594J7882L1200r446M5402K2344j2149M0783l059k2000n5396
15928c8998j7787j9525J7304L2546K6881j3975o4797j4618L0295j7222R747O2799
$$ plain form
15916 -7350 85161 58278 -17074 -87279 -73170 -23472 -15667 -39032 -112491 -124889 -100646 -41278
15904 -41278 -32799 -7777 -23395 -26975 56213 43711 45380 58902 6824 -49187 -40457 -69150
15892 -69150 -24917 -32680 -77073 -69551 -92303 -102669 -82709 -94855 -133835 -94564 -86059 -92258
15880 -92258 -83256 -22995 57377 25168 -7425 -40741 -72327 -76019 -100089 -107342 -144514 -75370
15868 -75370 19235 78385 89370 39825 24427 15567 -124654 -177938 -155875 -97433 -49877 363
15856 363 23261 5625 23675 25854 12005 -22966 -18432 -4027 -19520 -81534 -61964 -34387
15844 -34387 -78042 -138294 -109634 -89029 -29840 -78351 -103502 -57641 -30577 -19617 -46188 -82510
15832 -82510 -125320 -80400 -90909 -83542 -57908 -67973 -90677 -89384 -60379 -38275 -25090 -64856
$$ packed form
15916g350R2511k6883p5352p0205J4109M9698P805k3365p3459j2398K4243N9368
15904d1278Q479K5022j5618l580Q3188j2502J669J3522n2078n6011Q730k8693
15892f9150M4233p763m4393P522k2752j0366J9960j2146l8980L9271Q505o199
15880i2258R002O0261Q0372l2209l2593l3316l1586l692k4070p253l7172O9144
15868g5370R4605N9150J0985m9545j5398q860j40221n3284K2063N8442M7556N0240
15856C63K2898j7636J8050K179j3849l4971M534J4405j5493o2014J9570K7577
15844c4387m3655o0252K8660K0605N9189m8511k5151M5861K7064J0960k6571l6322
15832h2510m2810M4920j0509P367K5634j0065k2704J293K9005K2104J3185l9766
$$ plain form
15820 -64856 -100513 -50493 13702 -50724 -46278 -39508 -62445 -104120 -66703 -33281 -28473 -24774
15808 -24774 -21195 -14595 -46435 -43529 -55712 -13203 25874 -7873 -57271 -63398 -57674 -1574 -3094
15795 -3094 -25781 3658 -22124 -62787 -104518 -34101 19085 28326 13405 -68326 -68127 14274
15783 14274 51515 -8644 -56740 -95831 -67139 -95036 -120817 -38206 8321 52581 4019 2078
15771 2078 22933 18360 61167 117118 123565 68911 19429 38718 49064 24709 20536 13658 -53116
15758 -53116 -53157 -107916 -116299 -128177 -84700 -43324 -24743 -74476 -93305 -52889 -75295 -25139
15746 -25139 -29418 -257 -33419 -46952 -33591 9982 -46587 -13305 2468 13607 -13767 -37127
15734 -37127 16465 18535 -28768 -86539 -122438 -74033 -96555 -104944 -146658 -145085 -100730 -41232
$$ packed form
15820f4856l5657N0020O4195o4426M446O770k2937m1675L7417L3422M808L699
15808b4774L579O600l1840K906j2183M2509L9077l3747m9398o127N724N6100j520
15795c094k2687K9439k5782m0663m1731P0417N3186R241j4921q1731J99Q2401
15783A4274L7241o0159m8096l9091K8692k7897k5781Q2611M6527M4260m8562j941
15771B078K0855m573M2807N5951O447n4654m9482J9289J0346k4355m173o878o6774
15758e3116m1n4759q383j1878M3477M1376J8581m9733j8829M0416k2406N0156
15746b5139m279K9161l3162j3533J3361M3573n6569L3282J5773J1139k7374k3360
15734c7127N3592K070m7303n7771l5899M8405k2522q389m1714J573M4355N9498
$$ plain form
15722 -41232 15542 69850 61554 46349 1448 -19902 -36267 -29682 13159 46028 53925 42663
15710 42663 26117 -7478 -49803 -33109 30482 45051 6670 -9539 54978 64878 -10098 -43067
15698 -43067 -49740 -65834 11702 59619 79206 46388 17960 45608 143188 203947 163565 110174
15686 110174 60752 63768 105332 78680 17525 -48595 -39986 -56785 -47702 -31838 -56197 -82285
15674 -82285 -85077 -23510 -36494 -14468 -507 -30184 -63686 -68566 -23424 -5480 13758 -19124
15662 -19124 -44534 -37733 2811 31961 36710 -7215 -27273 -62616 -74378 -36454 -53519 -45630
15650 -45630 -39382 -53110 15097 79119 83613 45150 1196 17027 51612 62991 59755 28975
15638 28975 5050 10260 38685 51240 37255 40964 88572 129467 53317 -6966 -9592 19700
$$ packed form
15722d1232N6774N4308q296j5205m4901k1350j6365O585M2841L2869P897j1262
15710D2663j6546l3595m2325J6694O3591J4569l8381j6209O4517R900p4976l2969
15698d3067o673j6094P7536M7917J9587l2818k8428K7648R7580O0759m0382n3391
15686A10174m9422L016M1564k6652o1155o6120Q609j6799R083J5864k4359k6088
15674h2285k792O1567j2984K2026J3961k9677l3502m880M5142J7944J9238l2882
15662a9124k5410O801M0544K9150M749m3925k0058l5343j1762L7924j7065P889
15650d5630O248j3728O8207O4022M494l8463m3954J5831L4585J1379l236l0780
15638B8975k3925N210K8425J2555j3985L709M7608M0895p6150o0283k626K9292
$$ plain form
15626 19700 448 -22394 15064 74450 123688 109789 12498 -45848 -98052 -158931 -133747 -88290
15614 -88290 -48190 8421 38728 44608 8421 -48626 -51715 -9930 55032 60096 35448 20755
15602 20755 -30320 -65728 -24404 -3210 -36076 -67894 -16811 -18124 1281 7978 -34072 -7225
15590 -7225 10666 13899 -26356 -15468 -18166 -19350 6425 31727 30999 -19342 -73164 -38029 29338
15577 29338 20525 23398 22941 -8439 -81327 -159590 -149523 -72095 -5807 31949 1955 12504
15565 12504 38437 9712 50046 67959 41976 -2575 -55330 -43888 -9194 22960 62248 104332
15553 104332 45738 30747 71582 102441 101223 85858 82713 103674 62611 30756 92459 78201
15541 78201 78065 60587 33604 2590 -22522 -68426 -36120 -22147 -66841 -77359 -28742 10971
$$ packed form
15626A9700j9252k2842L7458N9386M9238j3899r7291n8346n2204o0879K5184M5457
15614h8290M0100N6611L0307N880l6187n7047l089M1785O4962N064k4648j4693
15602B0755n1075l5408M1324K1194l2866l1818N1083j313J9405O697m2050K6847
15590g225J7891L233m0255J0888k698j184K5775K5302p28n0341n3822L5135O7367
15577B9338q813K873m57l1380p2888p8263J0067P7428O6288L7756k9994J0549
15565A2504K5933k8725M0334J7913k5983m4551n2755J1442L4694L2154L9288M2084
15553A04332n8594j4991M0835L0859j218j5365l145K0961m1063l1855O1703j4258
15541G8201j36j7478k6983l1014k5112m5904L2306J3973m4694j0518M8617L9713
$$ plain form
15529 10971 9036 -11884 7514 -3942 -14445 -43225 -51839 -53301 -33126 6371 144 -60832
15517 -60832 -51926 -77717 -86569 -78537 -74551 -58061 -26404 -23047 -29433 -53059 -66639 -85358 -65298
15504 -65298 -45821 -71240 -76424 -54214 -66179 -54425 75350 93785 62277 30339 11934 -7528
15492 -7528 -25024 -30852 -21363 4840 35566 28965 -59852 -130805 -54870 42007 -22612 -41686
15480 -41686 -67301 -103301 -115968 -156850 -148151 -46320 16366 61170 66178 17554 -88827 -74859
15468 -74859 -47923 -32861 24812 32965 72548 128008 100286 91598 97947 27975 51910 58164
15456 58164 37008 48911 41044 58 -27977 -79447 -106693 -127599 -15781 22421 8131 67037
15444 67037 108837 84479 73032 68678 96332 158691 139496 145721 184765 177321 165258 30765
$$ packed form
15529A0971j935k0920J9398j1456j0503k8780q614j462K0175L9497o227o0976
15517f0832Q906k5791q852Q032L986J6490L1657L357o386k3626j3580j8719K0060
15504f5298J9477k5419n184K2210j1965J1754J29775J8435l1508l1938j8405j9462
15492g528j7496n828R489K6203L0726o601q8817p0953P5935R6877o4619j9074
15480d1686k5615l6000j2667m0882Q699J01831O2686M4804N008m8624j06381J3968
15468g4859K6936J5062N7673Q153L9583N5460k7722q688O349o9972K3935O254
15456E8164k1156J1903p867m0986k8035n1470k7246k0906J11818L8202j4290N8906
15444F7037M1800k4358j1447m354K7654O2359j9195O225L9044p444j2063j34493
$$ plain form
15432 30765 -7350 9289 14777 6642 -8121 45742 106735 64575 -19251 -19984 -11573 -28749 -40043
15419 -40043 -19645 -6283 -53008 -42927 -1960 50856 54204 3629 45228 -514 -24997 -22885
15407 -22885 9039 27793 55955 -14320 -59413 -63875 -78597 -62437 -46349 -45824 -66987 -63868
15395 -63868 -126396 -175875 -184078 -92037 -51659 -34704 -89381 -98508 -60930 -53085 -7852 3231
15383 3231 -63201 -31011 -38914 -26054 19601 -21675 -2864 9801 -46233 -21493 -75210 -71052
15371 -71052 -47444 -15718 -32441 -133051 -152139 -64027 13498 19382 15254 4285 69879 107848
15359 107848 98508 93993 114724 58049 25591 -49976 -27232 37068 92368 135606 140711 101477
15347 101477 111402 80861 25914 -28944 -17530 -38797 -108626 -125434 -94844 -98376 -70853 -30900
$$ packed form
15432C0765l8115J6639N488q135j4763N3863O0993m2160q3826p33Q411j7176j1294
15419d0043K0398J3362m6725J0081M0967N2816L348n0575M1599m5742k4483K112
15407b2885L1924J8754K8162p0275m5093m462j4722J6160J6088N25k1163L119
15395f3868o2528m9479q203R2041M0378J6955n4677r127L7578P845M5233J1083
15383C231o6432L2190p903J2860M5655m1276J8811J2665n6034K4740n3717M158
15371g1052K3608L1726j6723j00610j9088Q8112P7525N884m128j0969O5594L7969
15359A07848r340m515K0731n6675l2458p5567K2744O4300N5300M3238N105l9234
15347A01477R925l0541n4947n4858J1414k1267o9829j6808L0590l532K7523L9953
$$ plain form
15335 -30900 -117695 -98347 -52431 -50795 -62149 -109137 -80657 -50332 -58362 -61036 2528 13864
15323 13864 9118 11754 68459 -7040 -31409 -9725 29076 -2707 7816 2194 34533 113676
15311 113676 63963 -21754 -50869 -53464 -73870 -69772 -47398 -7085 300 13493 48754 44114
15299 44114 29835 91155 113775 -20641 -106518 -29536 -1298 3853 5917 -13680 993 -23090
15287 -23090 -7983 -4807 -9505 -23050 6461 72482 65846 82216 64988 38725 16389 12782
15275 12782 3378 -40999 10906 111962 139133 91620 61366 56620 26764 -42761 -66478 -78725
15263 -78725 5107 34267 39169 49211 81939 48043 16285 -7908 -53043 -20886 811 20280
15251 20280 -5655 -30168 -70972 415 25168 8000 1832 49050 53076 53507 -7225 -74587
$$ packed form
15335c0900q6795J9348M5916J636j1354m6988K8480L0325q030k674O3564J1336
15323A3864m746K636N6705p5499k4369K1684L8801l1783J0523n622L2339P9143
15311A13676m9713q5717k9115k595k0406M098K2374M0313P385J3193L5261m640
15299D4114j4279O1320K2620j34416q5877P6982K8238N151K064j9597J4673k4083
15287b3090J5107L176m698j3545K9511O6021o636J6370j7228k6263k2336l607
15275A2782r404m4377N1905J01056K7171m7513l0254m746k9856o9525k3717j2247
15263g8725Q3832K9160M902J0042L2728l3896l1758k4193m5135L2157K1697J9469
15251B0280k5935k4513m0804P1387K4753j7168o168M7218M026M31o0732o7362
$$ plain form
15239 -74587 -78385 -31186 -3635 23130 75531 51342 -6142 -25484 -904 65516 127542 160790
15227 160790 99091 68129 52482 24791 17329 -25438 772 10209 27436 5608 -31616 26266
15215 26266 5876 11788 26630 30027 105350 136714 90281 51280 17091 14961 -17210 -42307
15203 -42307 -14984 -17997 2866 -11059 -38090 -32830 17804 12151 -61718 -38798 13514 23352
15191 23352 57809 74531 46715 32326 -6615 6615 11168 49046 40168 32431 12972 -15502
15179 -15502 -32220 -31301 -22317 -68014 -80233 -88259 -37260 -64729 -72419 -52153 -33887 -17579 7800
15166 7800 73475 33516 -17983 -17393 -44921 -26513 -44252 -12991 46358 104634 139808 90941
15154 90941 16396 44290 83315 98809 44331 253 12204 -9229 -12852 -13104 -45967 -31298
$$ packed form
15239g4587l798M7199K7551K6765N2401k4189n7484j9342K4580O6420O2026L3248
15227A60790o1699l0962j5647k7691p462m2767K6210R437J7227k1828l7224N7882
15215B6266k0390N912J4842L397P5323L1364m6433l9001l4189k130l2171k5097
15203d2307K7323l013K0863j3925k7031N260N0634n653p3869K2920N2312R838
15191B3352L4457J6722k7816j4389l8941J3230M553L7878q878p737j9459k8474
15179a5502j6718R19Q984m5697j2219q026N0999k7469p690K0266J8266J6308K5379
15166G800O5675l9959n1499N90k7528J8408j7739L1261N9349N8276L5174m8867
15154I0941p4545K7894L9025J5494n4478m4078J1951k1433l623k52l2863J4669
$$ plain form
15142 -31298 2509 25437 29854 51801 67393 43063 9706 -7069 32391 67190 1198 -10070
15130 -10070 -67575 -55468 11212 66091 62391 27306 37604 14513 48837 -5894 -94923 -34784
15118 -34784 9913 28949 39845 3343 86309 81562 86452 104190 68268 64099 86223 75587
15106 75587 70438 42005 21093 -1774 -4477 94215 109494 58080 -23707 -40205 -4845 24938
15094 24938 42994 87589 157146 126263 41910 46234 50184 10215 -5213 1051 1696 9343 -2356
15081 -2356 -9832 -13369 56100 102033 82446 99483 71485 122293 139746 118337 63854 23419
15069 23419 9665 41379 11445 33852 89945 107464 57453 41542 81336 79285 100889 102993
15057 102993 82406 96878 89315 109544 120243 147198 144576 169180 174606 205279 152133 136207
$$ packed form
15142c1298L3807K2928M417K1947J5592k4330l3357j6775L9460L4799o5992j1268
15130a0070n7505J2107O6680N4879l700l5085J0298k3091L4324n4731q9029O0139
15118c4784M4697J9036J0896l6502Q2966m747M890J7738l5922m169K2124j0636
15106G5587n149k8433k0912k2867k703R8692J5279n1414q1787j6498L5360K9783
15094B4938J8056M4595O9557l0883q4353M324L950l9969j5428O264O45P647j1699
15081b356p476l537O9469M5933j9587J7037k7998N0808J7453k1409n4483m0435
15069B3419j3754L1714k9934K2407N6093J7519n0011j5911L9794k051K1604K104
15057A02993k0587J4472p563K0229J0699K6955k622K4604N426L0673n3146j5926
$$ plain form
15045 136207 128664 16905 -41907 72554 134829 113373 75826 38407 94179 97141 93253 75008
15033 75008 67606 84040 73926 -22405 -63357 -69975 -25504 15305 18902 68198 87516 35022
15021 35022 -2329 22588 86794 100473 72669 36784 32190 91915 113045 98999 66333 68075
15009 68075 80908 38736 56958 81407 21922 61751 28402 -19217 -165 23246 23826 -4825
14997 -4825 33865 45294 37264 23384 49094 19184 19581 80549 60904 29168 119939 160012
14985 160012 83421 51046 83966 94701 61251 34409 -5512 -29835 -54048 -40135 30765
14974 30765 67711 71599 48102 -25334 -12500 40565 97712 150542 69499 41366 44007 58688
14962 58688 24734 -1364 -4473 -18145 -18118 38845 64298 42574 25408 28466 12512 30474 34577
$$ packed form
15045A36207p543j11759n8812J14461O2275k1456l7547l7419N5772K962l888j8245
15033G5008p402J6434j0114r6331m0952o618M4471M0809L597M9296J9318n2494
15021C5022l7351K4917O4206J3679k7804l5885m594N9725K1130j4046l2666J742
15009F8075J2833m2172J8222K4449n9485L9829l3349m7619J9052K3411N80k8651
14997d825L8690J1429q030j3880K5710k9910L97O0968j9645l1736R0771M0073
14985A60012p6591l2375L2920J0735l3450k6842l9921k4323k4213J3913P0900
14974C0765L6946L888k3497p3436J2834N3065N7147N2830q1043k8133K641J4681
14962E8688l3954k6098l109j3672K7N6963K5453k1724j7166L058j5954J7962M103
$$ plain form
14949 34577 71530 186208 125488 52570 62442 101838 131971 86640 66273 71685 52650 77233
14937 77233 73054 71745 99668 125237 150687 137887 117559 86928 13764 24495 52750 89586
14925 89586 138724 127347 145323 124408 121120 181033 232455 187855 176716 220524 294635 320724
14913 320724 285233 319292 411286 401726 375608 363475 428184 541380 709587 868200 994597
14902 994597 1092878 1258179 1526927 1823045 2157435 2363688 2402648 2330167 2325562 2410681 2466411
14891 2466411 2479402 2393156 2164652 1866714 1569607 1308806 1053224 858373 647238 537922
14881 537922 460014 392984 345249 288521 274253 284639 270092 261361 172337 190683 200502 209176
14869 209176 178029 142610 103268 105564 121858 93022 124197 105665 77887 85372 118395 115211
$$ packed form
14949C4577L6953J14678o0720p2918R872L9396L0133m5331k0367N412j9035K4583
14937G7233m179j309K7923K5569K5450j2800k0328l0631p3164J0731K8255L6836
14925H9586M9138j1377J7976k0915l288N9913N1422m4600j1139M3808P4111K6089
14913C20724l5491L4059R1994r560k6118j2133O4709J13196J68207J58613J26397
14902I94597R8281J65301K68748K96118L34390K06253L8960p2481m605Q5119N5730
14891B466411J2991q6246k28504k97938k97107k60801k55582j94851k11135j09316
14881E37922p7908o7030m7735n6728j4268J0386j4547q731q9024J8346R819Q674
14869B09176l1147l5419l9342K296J6294k8836L1175j8532k7778P485L3023l184
$$ plain form
14857 115211 143701 93599 76064 120619 118168 130195 141773 92855 75815 30434 28547 65096
14845 65096 89476 100477 127929 160807 166113 154702 129397 151178 201740 183047 169140 154175
14833 154175 128069 102028 93456 102653 124356 130549 42462 60480 115478 92237 103649 91715
14821 91715 125326 158764 191524 154725 135204 84468 82850 118340 160107 104330 75071 66384
14809 66384 56339 12496 20366 128806 149522 125177 99342 101896 140319 169583 173645 146789
14797 146789 150509 173532 213426 180679 161910 97261 114134 179401 228209 192296 125343 95385
14785 95385 72738 107036 92636 84002 158999 225043 197630 139281 221670 282922 276645 196971
14773 196971 171093 230424 233994 238622 275358 333570 308458 313774 290042 341985 398565 362749
$$ packed form
14857A15211K8490n0102j7535M4555k451J2027J1578m8918j7040m5381j887L6549
14845F5096K4380J1001K7452L2878N306j1411k5305K1781N0562j8693j3907j4965
14833A54175k6106k6041q572R197K1703O193q8087J8018N4998k3241J1412j1934
14821I1715L3611L3438L2760l6799j9521n0736j618L5490M1767n5777k9259q687
14809F6384j0045m3843P870J08440K0716k4345k5835K554L8423K9264M062k6856
14797A46789L720K3023L9894l2747j8769o4649J6873O5267M8808l5913o6953k9958
14785I5385k2647L4298j4400q634P4997O6044k7413n8349Q2389O1252o277p9674
14773A96971k5878N9331L570M628L6736N8212k5112N316k3732N1943N6580l5816
$$ plain form
14761 362749 334700 365119 425068 496979 513192 502735 495374 447665 393129 399433 340920 276945
14749 276945 120435 52689 17067 -19378 9199 -1596 -75634 -193263 -235951 -283142 -299895
14738 -299895 -263297 -295021 -311936 -274068 -207890 -166485 -145142 -127855 -112624 -88090 -43386
14727 -43386 -53630 -62196 -13891 -19574 -581 -52815 -63256 -28282 -63516 -108757 -80520 -21375
14715 -21375 33554 72177 26730 63723 65986 -46527 -66157 -38334 68105 78002 53635 101651
14703 101651 142002 97551 91421 118920 179429 294999 320328 339233 342165 334183 311280 328792
14691 328792 381134 387502 362135 326549 306147 303065 278335 183098 196439 151610 90764 109605
14679 109605 110617 111374 110376 86152 120281 155489 225620 201809 201274 233450 255968 233406 201053
$$ packed form
14761C62749k8049L0419N9949P1911J6213j0457p361m7709n4536O304n8513o3975
14749B76945j56510o7746l5622l6445K8577j0795p4038j17629m2688m7191j6753
14738b99895L6598l1724j6915L7868O6178M1405K1343J7287J5231K4534M4704
14727d3386j0244q566M8305n683J8993n2234j0441L4974l5234m5241K8237N9145
14715b1375N4929L8623m5447L6993K263j12513j9630K7823J06439R897k4367M8016
14703A01651M0351m4451o130K7499O0509J15570K5329J8905K932p982k2903J7512
14691C28792N2342O368k5367l5586k0402l082k4730r5237J3341m4829o0846J8841
14679A09605J012P57r98k4224L4129L5208P0131k3811n35L2176K2518k2562l2353
$$ plain form
14666 201053 206422 170671 158825 147417 223354 237680 192891 138097 141342 117025 61281 67553
14654 67553 138501 154233 173118 202105 204635 146705 77159 78730 96417 153454 187030 226383
14642 226383 251749 210532 117788 89459 128122 176417 175358 134945 126034 94743 33248 4739
14630 4739 70546 58754 580 -14206 -53712 -77847 -59390 -13014 -22503 -109708 -59196 43089
14618 43089 86560 82253 74211 127832 180819 202270 161797 146567 157457 137963 82477 1803
14606 1803 -29394 -85477 -31228 -13999 -75727 -111559 -107196 -125525 -137245 -117251 -101375 -45151
14594 -45151 -11003 -8064 75853 128147 205345 282817 357342 425289 459066 484517 500294 500699
14582 500699 450204 507484 568586 568288 611045 631367 620343 624885 675176 739784 905751 1122118
$$ packed form
14666B01053N369l5751j1846j1408P5937J4326m4789n4794L245k4317n5744O272
14654F7553P0948J5732J8885K8987K530n7930o9546J571J7687N7037L3576L9353
14642B26383K5366m1217r2744k8329L8663M8295j059m0413q911l1291o1495k8509
14630D739O5807j1792n8174j4786l9506k4135J8457M6376r489q7205N0512J02285
14618D3089M3471m307q042N3621N2987K1451m0473j5230J0890j9494n5486q0674
14606A803l1197n6083N4249J7229o1728l5832M363j8329j1720J9994J5876N6224
14594d5151L4148K939Q3917N2294P7198P7472P4525O7947L3777K5451J5777M05
14582E00699n0495N7280O1102k98M2757K0322j1024M542N0291O4608J65967K16367
$$ plain form
14570 1122118 1249744 1296469 1325242 1363727 1373937 1353713 1409173 1425301 1363808 1353861 1280851
14559 1280851 1228248 1121850 1059221 947074 862322 834106 746602 725754 733716 754795 712661
14548 712661 712729 715096 659085 671486 686750 687610 728262 745331 754173 809551 789318 739933 733779
14535 733779 819540 854175 865619 852106 863815 951189 976374 983424 1002836 991586 1056366 1045255
14523 1045255 1073008 1136674 1185981 1189556 1153552 1141940 1149326 1169130 1253112 1319840 1321934 1378357
14511 1378357 1475414 1492216 1538146 1544012 1553905 1581299 1643940 1694842 1716442 1796145 1946110
14500 1946110 2075306 2089439 2110909 2154933 2217001 2306279 2426529 2471702 2509993 2563892 2681754
14489 2681754 2735818 2825305 2949928 3084122 3220691 3431487 3617637 3809468 3964035 4110334
$$ packed form
14570A122118J27626M6725K8773L8485J0210k0224N5460J6128o1493r947p3010
14559A280851n2603j06398o2629j12147q4752k8216q7504k0848P962K1079m2134
14548G12661O8K367n6011J2401J5264Q60M0652J7069Q842N5378k0233m9385o154
14535G33779Q5761L4635J1444j3513J1709Q7374K5185P050J9412j1250O4780j1111
14523A045255K7753O3666M9307L575l6004j1612P386J9804Q3982O6728K094N6423
14511A378357R7057J6802M5930N866R893K7394O2641N0902K1600P9703J49965
14500A946110J29196J4133K1470M4024O2068Q9278J20250M5173L8291N3899J17862
14489B681754N4064Q9487J24623J34194J36569K10796J86150J91831J54567J46299
$$ plain form
14479 4110334 4312853 4461653 4640570 4898625 5220605 5577771 5966091 6322590 6702500
14470 6702500 7196169 7777751 8380481 9054224 9828780 10667193 11652537 12848864 14192297
14461 14192297 15765726 17677771 19993774 22784783 26023274 29840397 34216472 39326599
14453 39326599 45304258 52698519 62072254 74326133 90828518 113890382 146880905
14446 146880905 193760421 255634124 325468991 388169243 428905183 443645857 440887684
14439 440887684 435188353 438035224 450163552 460406814 454138282 424397973 374681927
14432 374681927 314338291 252993334 197972055 153246923 119259144 94374371 76191081
14425 76191081 62845476 52761828 45019750 38825251 33721134 29351679 25633453 22480693
$$ packed form
14479D110334K02519J48800J78917K58055L21980L57166L88320L56499L79910
14470F702500M93669N81582O02730O73743P74556Q38413R85344J196327J343433
14461A4192297J573429J912045K316003K791009L238491L817123M376075N110127
14453C9326599N977659P394261R373735J2253879J6502385K3061864L2990523
14446A46880905M6879516O1873703O9834867O2700252M0735940J4740674k758173
14439D40887684n699331K846871J2128328J0243262o268532k9740309m9716046
14432C74681927o0343636o1344957n5021279m4725132l3987779k4884773j8183290
14425G6191081j3345605j0083648p742078o194499n104117m369455l718226l152760
$$ plain form
14417 22480693 19830908 17616045 15835294 14347928 13074411 12007248 11076393 10216795
14409 10216795 9447607 8750033 8127478 7553196 7072968 6675410 6243722 5861430 5572194
14400 5572194 5271733 4946787 4670380 4407524 4217097 4063462 3866645 3725167 3597599
14391 3597599 3426096 3248071 3077839 2960643 2861063 2721797 2613714 2483806 2344389 2242351
14381 2242351 2098187 2005563 1917185 1848633 1729529 1696540 1634143 1653767 1641258 1642510 1630799
14370 1630799 1631552 1569691 1521033 1523804 1523091 1506858 1488388 1415992 1416283 1407066 1351082 1308134 1229325
14357 1229325 1150443 1163335 1121120 1040715 985727 944156 895248 828549 777916 783163 734428
14346 734428 753500 733363 644630 647812 691394 697913 705982 736728 773471 724445 699377 697808
$$ packed form
14417B2480693k649785k214863j780751j487366j273517j067163r30855q59598
14409A0216795p69188o97574o22555n74282m80228l97558m31688l82292k89236
14400E572194l00461l24946k76407k62856j90427j53635j96817j41478j27568
14391C597599j71503j78025j70232j17196r9580j39266j08083j29908j39417j02038
14381B242351j44164r2624q8378o8552j19104l2989o2397J9624j2509J252j1711
14370A630799P53o1861m8658K771p13j6233j8470p2396K91r217n5984m2948p8809
14357A229325p8882J2892m2215q0405n4988m1571m8908o6699n0633N247m8735
14346G34428J9072k0137q8733L182M3582O519Q069L0746L6743m9026k5068j569
$$ plain form
14334 697808 627985 623191 612852 641465 658759 665714 647492 577184 516819 555871 620140 604874
14322 604874 638197 681532 708430 732818 790198 802697 759681 742596 719825 713881 649919 633572
14310 633572 635084 532527 503278 409783 328253 383078 412333 362585 272118 270630 272879 259433
14298 259433 240723 311271 346904 315502 287024 264615 275484 282095 292291 288008 357965 396146
14286 396146 430502 487009 527494 547804 555653 615822 721339 733727 742242 785182 796906 767460
14274 767460 707221 624905 589614 516926 408343 399732 383751 319395 323790 346123 334097 282350
14262 282350 256441 296615 347249 381263 406484 440886 429691 422641 478130 527732 516233 487563
14250 487563 519892 470909 462453 430592 454351 456475 383767 348019 295426 286567 308054 355157
$$ packed form
14334F97808o9823m794j0339K8613J7294O955j8222p0308o0365L9052O4269j5266
14322F04874L3323M3335K6898K4388N7380J2499m3016j7085k2771n944o3962j6347
14310F33572J512j02557k9249r3495q1530N4825K9255m9748r0467j488K249j3446
14298B59433j8710P0548L5633l1402k8478k2409J0869O611J0196m283O9957L8181
14286C96146L4356N6507M0485K0310P849O0169J05517J2388Q515M2940J1724k9446
14274G67460o0239q2316l5291p2688j08583q611j5981o4356M395K2333j2026n1747
14262B82350k5909M0174N0634L4014K5221L4402j1195p050N5489M9602j1499k8670
14250D87563L2329m8983q456l1861K3759K124p2708l5748n2593q859K1487M7103
$$ plain form
14238 355157 344467 303422 325121 338605 323380 346466 234182 136540 143697 214482 286092
14227 286092 246071 201002 210290 263889 276697 245536 258874 264699 245831 271745 274646 259377
14215 259377 240994 240804 252610 197726 187173 131926 132237 110216 102380 100170 77902 35260 50917
14202 50917 42385 34065 26044 104238 144073 188278 167135 154940 138429 147000 186445 157179
14190 157179 200340 216686 216529 239735 249826 229847 243359 281899 304589 281513 271689 328281
14178 328281 348704 289079 260316 278671 277559 233094 234173 233701 180592 211907 190824 206460
14166 206460 266218 260400 155541 145770 153757 188871 254470 256986 265952 260391 241581 306070
14154 306070 296583 298398 278848 278412 300797 270134 254527 224513 287243 349181 362274 346907
$$ packed form
14238C55157j0690m1045K1699J3484j5225K3086j12284r7642P157P0785P1610
14227B86092m0021m5069R288N3599J2808l1161J3338N825j8868K5914K901j5269
14215B59377j8383j90J1806n4884j0553n5247L11k2021p836k210k2268m2642J5657
14202E0917q532q320q021P8194L9835M4205k1143j2195j6511Q571L9445k9266
14190A57179M3161J6346j57K3206J0091j9979J3512L8540K2690k3076r824N6592
14178C28281K0423n9625k8763J8355j112m4465J079m72n3109L1315k1083J5636
14166B06460N9758n818j04859r771P987L5114O5599K516Q966n561j8810O4489
14154C06070r487J815j9550m36K2385l0663j5607l0014O2730O1938J3093j5367
$$ plain form
14142 346907 387178 422975 477993 494179 507228 540147 522058 453304 361446 318735 270320
14131 270320 185855 108572 53538 2330 -113030 -214320 -245068 -244074 -284936 -342854 -347653 -315338
14119 -315338 -326592 -319142 -275221 -206916 -105705 -110749 -138305 -101365 -31442 -34598 -55825 -37589
14107 -37589 -40035 -40237 -4442 -1295 -33512 -29598 19436 41964 -21432 -55944 -72833 -85388 -19206
14094 -19206 -6161 -46858 -85524 -114037 -101897 -130110 -82195 -87072 -83091 -103759 -80663 -57497
14082 -57497 -51459 -41336 -48143 -104120 -100987 -34700 -50520 -26307 -27360 -29327 -12663 -84794 -69682
14069 -69682 -58324 -43015 -27282 -38880 -70275 -71799 -85532 -72387 8712 1466 20003 -45260
14057 -45260 -142049 -189476 -119618 -22162 -15565 -11806 -9116 -49490 -90797 -70440 -42410 -101034
$$ packed form
14142C46907M0271L5797N5018J6186J3049L2919j8089o8754r1858m2711m8415
14131B70320q4465p7283n5034n1208j15360j01290l0748R94m0862n7918m799L2315
14119c15338j1254P450M3921O8305J01211n044k7556L6940O9923l156k1227J8236
14107c7589k446k02L5795L147l2217L914M9034K2528o3396l4512j6889j2555O6182
14094a9206J3045m0697l8666k8513J2140k8213M7915m877L981k0668K3096K3166
14082e7497O038J0123o807n5977L133O6287j5820K4213j053j967J6664p2131J5112
14069f9682J1358J5309J5733j1598l1395j524j3733J3145Q1099p246J8537o5263
14057d5260r6789m7427O9858R7456O597L759K690m0374m1307K0357K8030n8624
$$ plain form
14045 -101034 -139878 -60586 -31826 -75278 -90188 -88114 -118475 -57473 -81181 -94142 -80490 -47526
14033 -47526 -1816 17095 66352 63634 36517 43443 79160 26704 -4547 61807 117193 123247
14021 123247 131082 87837 30272 88879 146100 139023 135020 111093 72212 56218 115899 189031
14009 189031 248740 202062 142908 94612 73097 96847 79066 115647 154658 170763 137213
13998 137213 175530 187111 209839 211159 194574 217546 240001 288626 327363 365421 420798 493185
13986 493185 603042 787994 1043042 1346816 1644267 1993334 2226260 2291959 2303047 2314866
13976 2314866 2266181 2335887 2360680 2313611 2233526 2021572 1775246 1495638 1185839 888665
13966 888665 700677 517577 448413 395621 304903 202813 123519 65329 88986 156131 133417
$$ packed form
14045a01034l8844P9292K8760m3452j4910K074l0361O1002k3708j2961J3652L2964
14033d7526M5710J8911M9257k718k7117O926L5717n2456l1251O6354N5386O054
14021A23247P835m3245n7565N8607N7221p077m003k3927l8881j5994N9681P3132
14009A89031N9709m6678n9154m8296k1515K3750j7781L6581L9011J6105l3550
13998A37213L8317J1581K2728J320j6585K2972K2455M8625L8737L8058N5377P2387
13986D93185J09857J84952K55048L03774K97451L49067K32926O5699J1088J1819
13976B314866m8685O9706K4793m7069q0085k11954k46326k79608l09799k97174
13966H88665j87988j83100o9164n2792r0718j02090p9294n8190K3657O7145k2714
$$ plain form
13955 133417 167643 160266 127470 131945 140764 105964 125042 148251 69468 -5031 18632 25791
13943 25791 26367 22731 5306 25712 16638 -37267 -78943 -44296 8311 20682 21266 -29326 14670
13930 14670 58193 42332 32622 48257 22581 -28670 -55017 -32903 -17540 -61477 -48990 3685
13918 3685 -23546 -50142 -34686 37782 -11906 -33546 -34440 -45341 -21089 -33294 -16854 -22597
13906 -22597 -64617 -21001 44685 42462 63243 69078 -8613 15407 -14612 -37560 -50727 -58701
13894 -58701 -107780 -87523 -42681 -7268 16867 4972 -49725 -18013 -37136 -9527 -40937 -70348
13882 -70348 -48690 -108860 -116280 -108368 -82657 -24221 -42713 -90589 -97912 -71028 -63930 -68842 -20966
13869 -20966 -21658 -65711 -92423 -87457 -28601 -9839 -11643 4831 42913 10949 13337 33691 78278
$$ packed form
13955A33417L4226p377l2796M475Q819l4800J9078K3209p8783p4499K3663P159
13943B5791N76l636j7425K0406r074n3905m1676L4647N2607J2371N84n0592M3996
13930A4670M3523j5861r710J5635k5676n1251k6347K2114J5363m3937J2487N2675
13918C685k7231k6596J5456P2468m9688k1640q94j0901K4252j2205J6440n743
13906b2597m2020M3616O5686k223K0781N835p7691K4020l0019k2948j3167p974
13894e8701m9079K0257M4842L5413K4135j1895n4697L1712j9123K7609l1410k9411
13882g0348K1658o0170p420P912K5711N8436j8492m7876p323K6884P098m912M7876
13869b0966o92m4053k6712M966N8856J8762j804J6474L8082l1964K388K0354M4587
$$ plain form
13856 78278 35688 49353 41218 -9924 11701 44157 53655 27653 37847 34264 82137 100057
13844 100057 76319 40577 34300 134361 140954 117931 76180 -19397 -24857 -13375 -30381 -20676
13832 -20676 -60057 -68904 -33388 -1264 -6933 -40632 -77467 -69535 -53187 -35213 28130 71097
13820 71097 49455 32183 33063 51717 66963 40532 13103 21203 27547 18177 -17223 30306 71814
13807 71814 75237 73125 35302 23764 45507 37808 45463 10570 -31885 20257 78026 24070
13795 24070 -11895 -3157 -27449 -43100 -46038 -98254 -53911 -5959 19527 20861 68156 77673
13783 77673 73288 -11974 -56021 6883 54024 49821 5605 5966 23422 48071 4947 -23933
13771 -23933 -57848 -33741 36337 41444 25407 -745 -177 -19988 2495 64455 73300 23240
$$ packed form
13856G8278m2590J3665q135n1142K1625L2456R498k6002J0194l583M7873J7920
13844A00057k3738l5742o277J00061O593k3023m1751r5577n460J1482j7006R705
13832b0676l9381q847L5516L2124n669l3699l6835P932J6348J7974O3343M2967
13820G1097k1642j7272Q80J8654J5246k6431k7429Q100O344r370l5400M7529M1508
13807G1814L423k112l7823j1538K1743p699P655l4893m2455N2142N7769n3956
13795B4070l5965Q738k4292j5651k938n2216M4343M7952K5486J334M7295R517
13783G7673m385q5262m4047O2904M7141m203m4216L61J7456K4649m3124k8880
13771b3933l3915K4107P0078N107j6037k6152N68j9811K2483O1960Q845n0060
$$ plain form
13759 23240 -89272 -153807 -129538 -43167 -19871 12572 61039 27218 5227 18401 73262
13748 73262 56231 -5153 -6999 20113 38665 -15707 -31035 6918 23668 -756 -12577 -807
13736 -807 -28267 -60990 -89841 -97125 -97870 -5390 -38647 -56481 -114645 -96325 -23894 43244 24304
13723 24304 -14041 49706 85748 -24619 -71751 -75344 -16833 14057 81238 114631 158086 106808
13711 106808 43822 -4751 18122 58718 79566 66648 4920 -35958 -35754 -43795 -19965 -31902
13699 -31902 -33500 -47056 -60632 -85943 -65829 -53876 -70353 -59296 -25779 50634 34879 3016
13687 3016 25953 -5006 -38948 -56891 -59102 -19265 14897 -35935 -20654 -47560 -78504 -46326
13675 -46326 -47486 1166 -6473 36680 53350 54014 69094 46491 20824 -23783 -60603 -37811
$$ packed form
13759B3240j12512o4535K4269Q6371K3296L2443M8467l3821k1991J3174N4861
13748G3262j7031o1384j846K7112J8552n4372j5328L7953J6750k4424j1821J1770
13736h07k7460l2723k8851p284p45R2480l3257j7834n8164J8320P2431O7138j8940
13723B4304l8345O3747L6042j10367m7132l593N8511L0890O7181L3393M3455n1278
13711A06808o2986m8573K2873M0596K0848j2918o1728m0878K04q041K3830j1937
13699c1902j598j3556j3576k5311K0114J1953j6477J1057L3517P6413j5755l1863
13687C016K2937l0959l3942j7943k211L9837L4162n0832J5281k6906l0944L2178
13675d6326j160M8652p639M3153J6670O64J5080k2603k5667m4607l6820K2792
$$ plain form
13663 -37811 -52863 -65085 -75843 -25693 -14036 -30984 -15214 -6240 36387 48155 65849 23070
13651 23070 -33327 16636 102767 129551 153270 114658 89009 27740 10619 22897 9437 27890
13639 27890 65186 41465 47674 69837 51140 38864 24008 17283 -29779 -27945 50005 40073
13627 40073 2114 31976 -29754 -58758 -43911 -4477 18610 55095 40831 33192 -32595 -55858
13615 -55858 -39895 -24859 -47797 -40019 -31816 1725 -12776 -14673 -4537 19403 75114 43320
13603 43320 -15979 -40850 -21736 11427 4808 6380 18084 -10318 -22756 -23809 -19965 -54796
13591 -54796 -40782 -67756 -88693 -62068 -57013 -88580 -70330 -64864 -60523 17203 72395 74279
13579 74279 44013 14105 -14851 19349 56703 12554 -6881 32557 52319 16374 -11248 -20063
$$ packed form
13663c7811j5052j2222j0758N0150J1657j6948J5770Q974M2627J1768J7694m2779
13651B3070n6397M9963Q6131K6784K3719l8612k5649o1269j7121J2278j3460J8453
13639B7890L7296k3721O209K2163j8697j2276j4856o725m7062J834P7950r932
13627D0073l7959K9862o1730k9004J4847L9434K3087L6485j4264p639o5787k3263
13615e5858J5963J5036k2938P778Q203L3541j4501j897J0136K3940N5711l1794
13603D3320n9299k4871J9114L3163o619J572J1704k8402j2438j053L844l4831
13591e4796J4014k6974k0937K6625N055l1567J8250N466M341P7726N5192J884
13579G4279l0266k9908k8956L4200L7354m4149j9435L9438J9762l5945k7622q815
$$ plain form
13567 -20063 37454 121244 168565 130700 80205 39573 44814 17646 -8130 -2014 -5048 -23959
13555 -23959 17848 36997 44482 38049 -3927 -8468 11570 26879 46106 42466 5828 -43057
13543 -43057 -45758 -29469 -8031 52499 23492 1440 6207 102920 113940 85387 76435 54926
13531 54926 9929 -11030 9201 7563 1337 4717 49850 96252 68460 45711 11970 36919
13519 36919 25627 -672 29675 54756 25844 2726 -35050 -871 60129 18959 38339 58376
13507 58376 94014 37494 -32868 -35920 -25188 -3137 -57915 -96012 -85129 -17052 1248 -36497
13495 -36497 -40583 -46643 -41763 -24143 -9454 -30255 -63669 -52639 46254 44664 10616 -25982
13483 -25982 15459 -5531 -17712 12184 51841 143824 104195 -8320 29959 105098 114889 81387
$$ packed form
13567b0063N7517Q3790M7321l7865n0495m0632N241k7168k5776O116l034j8911
13555b3959M1807J9149P485o433m1976m541K0038J5309J9227l640l6638m8885
13543d3057k701J6289K1438O0530k9007k2052M767R6713J1020k8553q952k1509
13531E4926m4997k0959K0231j638o226L380M5133M6402k7792k2749l3741K4949
13519C6919j1292k6299L0347K5081k8912k3118l7776L4179O1000m1170J9380K0037
13507E8376L5638n6520p0362l052J0732K2051n4778l8097J0883O8077J8300l7745
13495c6497m086o060M880J7620J4689k0801l3414J1030R8893j590l4048l6598
13483b5982M1441k0990j2181K9896L9657R1983l9629j12515L8279P5139R791l3502
$$ plain form
13471 81387 14041 32953 63672 108146 126170 66529 62539 21528 24035 32643 13680 -9288
13459 -9288 -38637 -111012 -111356 -20369 9255 35548 40290 51441 11467 32300 80846 43381
13447 43381 30943 -9906 -3668 35568 78359 107347 57724 -14372 23090 33341 27034 4837
13435 4837 -14243 -15440 -5723 75693 107567 75882 50246 10796 6177 63607 58883 77811 65645
13422 65645 10688 31829 76057 66572 74945 30307 6292 -2674 -25462 10263 17373 -18939
13410 -18939 -341 -17865 -36399 -13669 -27416 -38732 11695 31219 63401 53536 29758 46608
13398 46608 36638 1972 18906 2108 9089 7005 102603 105551 103740 122851 115006 105040 83726
13385 83726 83672 61508 21284 -11469 20815 69254 -1885 -31869 -89380 -93372 -52310 -25517
$$ packed form
13471H1387o7346J8912L0719M4474J8024n9641l990m1011K507Q608j8963k2968
13459i288k9349p2375l44R0987K9624K6293M742J1151l9974K0833M8546l7465
13447D3381j2438m0849O238L9236M2791K8988m9623p2096L7462J0251o307k2197
13435D837j9080j197R717Q1416L1874l1685k5636l9450m619N7430m724J8928j2166
13422F5645n4957K1141M4228r485Q373m4638k4015q966k2788L5725P110l6312
13410a8939J8598j7524j8534K2730j3747j1316N0427J9524L2182r865k3778J6850
13398D6608r970l4666J6934j6798O981k084R5598K948j811J9111p845r966k1314
13385H3726n4k2164m0224l2753L2284M8439p1139k9984n7511l992M1062K6793
$$ plain form
13373 -25517 -32467 -66190 -89034 -90358 -82137 -76027 -56634 -23739 -21285 -26181 23206 56287 59374
13360 59374 100094 113357 112987 94776 -5507 -21112 -41465 -72753 -104135 -136757 -79279 -19470
13348 -19470 28926 81936 39123 -28093 -78499 -128573 -135213 -111649 -68700 -55489 -82718 -86320
13336 -86320 -57527 -27875 -882 25349 50443 51607 32341 940 16176 26188 16119 8246
13324 8246 40839 135019 158458 147998 121081 120796 94878 85688 62816 63955 46504 83187 97556
13311 97556 89125 106023 90442 88836 90796 83493 68727 48911 44543 62606 42831 -1856 14461
13298 14461 -6491 4196 17703 110099 124599 143346 154401 120869 68311 85579 96912 119578
13286 119578 82987 51759 86391 86449 117894 169276 169353 153878 146888 91478 115669 135059 161065
$$ packed form
13373b5517o950l3723k2844j324Q221O110J9393L2895K454m896M9387L3081L087
13360E9374M0720J3263l70j8211j00283j5605k0353l1288l1382l2622N7478N9809
13348a9470M8396N3010m2813o7216n0406n0074o640K3564M2949J3211k7229l602
13336h6320K8793K9652K6993K6231K5094J164j9266l1401J5236J0012j0069p873
13324H246L2593R4180K3439j0460k6917k85k5918r190k2872J139j7451L6683J4369
13311I7556q431J6898j5581j606J960p303j4766j9816m368J8063j9775m4687J6317
13298A4461k0952J0687J3507R2396J4500J8747J1055l3532n2558J7268J1333K2666
13286A19578l6591l1228L4632N8L1445N1382P7j5475o990n5410K4191J9390K6006
$$ plain form
13273 161065 108701 88858 156152 191272 106219 66007 24752 16352 26270 15934 53763 64875
13261 64875 74019 46069 18418 53825 59998 -3627 26766 48534 58569 64598 14273 -8834
13249 -8834 -25377 24631 49776 40284 11554 6816 -11366 -30217 50546 85185 103960 119748
13237 119748 112386 95525 122015 129731 101913 11989 -29237 4108 51920 146551 159041 139269
13225 139269 147495 129498 143649 136537 72065 77771 139019 202793 263561 186141 124075 123812
13213 123812 72822 71468 27493 33937 46208 138554 156544 149564 103043 101760 82353 71899
13201 71899 91523 79920 37776 38494 76320 88166 48387 28652 58170 106382 204736 338553
13189 338553 339339 308989 330249 358614 465430 541396 657621 630877 504771 367057 236230
$$ packed form
13273A61065n2364j9843O7294L5120q5053m0212m1255q400R918j0336L7829J1112
13261F4875R144k7950k7651L5407O173o3625L0393K1768J0035O029n0325k3107
13249h834j6543N0008K5145r492k8730m738j8182j8851Q0763L4639J8775J5788
13237A19748p362j6861K6490P716k7818q9924m1226L3345M7812R4631J2490j9772
13225A39269Q226j7997J4151p112o4472N706O1248O3774O0768p7420o2066k63
13213A23812n0990j354m3975O444J2271R2346J7990o980m6521j283j9407j0454
13201G1899J9624j1603m2144P18L7826J1846l9779j9735K9518M8212R8354J33817
13189C38553P86l0350K1260K8365J06816P5966J16225k6744j26106j37714j30827
$$ plain form
13178 236230 169915 176736 164899 158736 104228 129331 146847 196087 209447 208065 237803 317740
13166 317740 394692 436251 529228 580134 648139 657742 576360 462885 335723 298448 309492
13155 309492 274086 267592 327353 417773 421834 437247 441838 442775 458821 510429 536310 508314
13143 508314 627899 788627 1052894 1406724 1637628 1714173 1577553 1358676 1126457 916259
13133 916259 666830 496321 454381 475810 486788 437873 426962 440750 560050 787739 1012979
13122 1012979 1144707 1237739 1210040 1129835 1042074 890072 761192 670268 586575 528370 449939
13111 449939 399263 393664 470343 506674 471652 490231 485746 495233 575335 628668 636536 636818 659028
13098 659028 649839 729560 955179 1226676 1560295 1760316 1716648 1524327 1255553 956693
$$ packed form
13178B36230o6315O821j1837o163n4508K5103J7516M9240J3360j382K9738P9937
13166C17740P6952M1559R2977N0906O8005R603q1382j13475j27162l7275J1044
13155C09492l5406o494N9761R0420M061J5413M591R37J6046N1608K5881k7996
13143E08314J19585J60728K64267L53830K30904P6545j36620k18877k32219k10198
13133I16259k49429j70509m1940K1429J0978m8915j0911J3788J19300K27689K25240
13122A012979J31728R3032k7699q0205q7761j52002j28880r0924q3693n8205p8431
13111D49939n0676n599P6679L6331l5022J8579m485R487Q0102N3333P868K82K2210
13098F59028r189P9721K25619K71497L33619K00021m3668j92321k68774k98860
$$ plain form
13088 956693 781511 662722 526061 500796 489176 507031 519235 595383 696813 734832 686802
13077 686802 634863 492165 377011 360506 409255 371580 306186 257795 262631 323553 313019
13066 313019 283911 256661 341502 366362 359647 347674 313052 273940 227015 220600 270206 315830
13054 315830 298224 308807 363350 375766 493742 601939 669335 673558 627587 563595 450769
13043 450769 333323 253401 228604 207060 188818 106174 106995 137004 131608 148229 149290 115801
13031 115801 135432 135676 119874 92010 74869 82572 99223 138047 223266 235320 243765 279542
13019 279542 282107 251914 268691 278764 245673 260125 270414 255686 233358 218919 153436 72602
13007 72602 69459 66426 28512 43672 67390 22031 45252 48385 10263 -9265 -66862 -35318
$$ packed form
13088I56693j75182j18789j36661k5265j1620J7855J2204P6148J01430L8019m8030
13077F86802n1939j42698j15154j6505M8749l7675o5394m8391M836O0922j0534
13066C13019k9108k7250Q4841K4860o715j1973l4622l9112m6925o415M9606M5624
13054C15830j7606J0583N4543J2416J17976J08197O7396M223m5971o3992j12826
13043D50769j17446p9922k4797k1544j8242q2644Q21L0009n396J6621J061l3489
13031A15801J9631K44j5802k7864j7141P703J6651L8824Q5219J2054Q445L5777
13019B79542K565l0193J6777J0073l3091J4452J0289j4728k2328j4439o5483q0834
13007G2602l143l033l7914J5160K3718m5359K3221L133l8122j9528n7597L1544
$$ plain form
12995 -35318 44376 71664 35442 107858 206473 195733 144956 187056 180286 130923 202498 307183
12983 307183 330278 172446 137893 111741 100286 89134 129023 156751 153148 141483 154943
12972 154943 175729 98705 76013 90040 79766 84459 88869 65011 68523 110196 77832 55132
12960 55132 95380 60823 79286 84844 94372 117605 193232 174477 125646 94097 139130 139538
12948 139538 129572 167077 145053 213792 186916 202069 240782 194110 111697 67993 107655 97083
12936 97083 84831 85048 61969 43127 111574 82358 57309 106655 87705 69276 97046 103899
12924 103899 141273 114820 76866 107058 122684 133290 146060 164224 188015 182280 211961 206675
12912 206675 214491 161366 75409 27076 -14585 -8747 8479 47100 111005 102923 71652 85965
$$ packed form
12995c5318P9694K7288l6222P2416R8615j0740n0777M2100o770m9363P1575J04685
12983C07183K3095j57832l4553k6152j1455j1152L9889K7728l603j1665J3460
12972A54943K0786p7024k2692J4027j0274M693M410k3858L512M1673l2364k2700
12960E5132M0248l4557J8463N558R528K3233P5627j8755m8831l1549M5033M08
12948A39538r966L7505k2024O8739k6876J5153L8713m6672q2413m3704L9662j0572
12936I7083j2252K17k3079j8842O8447k9216k5049M9346j8950j8429K7770O853
12924A03899L7374k6453l7954L0192J5626J0606J2770J8164K3791n735K9681n286
12912B06675P816n3125q5957m8333m1661N838J7226L8621O3905q082l1271J4313
$$ plain form
12900 85965 121162 82156 82710 114829 110992 73745 37560 85443 113654 38806 30328 101719
12888 101719 119580 121573 106261 104808 115271 114477 120118 92681 63383 104700 172524 143881
12876 143881 104444 120369 101108 19771 -42658 -11320 26966 53767 71705 99806 128391
12865 128391 122212 148182 190208 204080 172406 114040 64174 105318 147394 118812 49752 92291
12853 92291 146380 145513 91794 83755 124242 91727 115140 156874 124958 132826 108024 148576
12841 148576 132615 96770 134256 171018 131525 84000 100861 117832 87396 42878 -7076
12830 -7076 2484 5277 45497 107830 141392 199057 211452 131775 129203 167637 163608 169076 140852
12817 140852 127796 104789 101952 87052 109007 131839 120500 124586 120327 120491 126596 79284 70687
$$ packed form
12900H5965L5197l9006N54L2119l837l7247l6185M7883K8211p4848q478P1391
12888A01719J7861J993j5312j453J0463p94N641k7437k9298M1317O7824k8643
12876A43881l9437J5925j9261q1337o2429L1338L8286K6801J7938K8101K8585
12865A28391o179K5970M2026J3872l1674n8366m9866M1144M2076k8582o9060M2539
12853I2291N4089q67n3719q039M0487l2515K3413M1734l1916P868k4802M0552
12841A48576j5961l5845L7486L6762l9493m7525J6861J6971l0436m4518m9954
12830g076R560K793M0220O2333L3562N7665J2395p9677k572L8434m029N468k8224
12817A40852j3056k3007k837j4900K1955K2832j1339M086m259J64O105m7312q597
$$ plain form
12804 70687 71763 104770 115149 74451 122319 173381 191562 167904 81655 41350 65132 91043
12792 91043 90880 34376 63548 129198 152725 130450 121359 137493 102931 72150 131863 117465
12780 117465 121428 119239 107736 126518 146466 158874 121435 99309 136884 142708 176099 227636
12768 227636 177842 71851 45029 103270 108257 64353 49194 14629 -37177 1456 13621
12757 13621 53144 99288 126709 142139 137278 188082 202143 221335 144719 107058 124328 207488
12745 207488 188638 123955 86411 73762 51729 86579 53203 75118 118423 116671 120554 111655
12733 111655 60495 4252 21226 76115 67753 53664 105178 113962 96081 72906 124492 79156
12721 79156 45940 109430 106000 120926 134878 109654 142125 138459 61807 80838 96822 68394
$$ packed form
12804G0687J076L3007J0379m0698M7868N1062J8181k3658q6249m0305K3782K5911
12792I1043j63n6504K9172O5650K3527k2275r091J6134l4562l0781N9713j4398
12780A17465L963k189j1503J8782J9948J2408l7439k2126L7575N824L3391N1537
12768B27636m9794j05991k6822N8241M987m3904j5159l4565n1806L8633J2165
12757A3621L9523M6144K7421J5430m861N0804J4061J9192p6616l7661J7270Q3160
12745B07488j8850o4683l7544j2649k2033L4850l3376K1915M3305j752L883q899
12733A11655n1160n6243J6974N4889q362j4089N1514Q784j7881k3175N1586m5336
12721G9156l3216O3490l430J4926J3952k5224L2471l666p6652J9031J5984k8428
$$ plain form
12709 68394 110596 70332 20071 46744 109973 178143 149473 117648 139175 156365 88971 42831
12697 42831 93751 127760 172133 177043 135768 96735 147238 189556 183524 155593 174388 119596
12685 119596 172687 158922 127485 138147 172230 146025 132171 95978 112195 135044 144123 173751
12673 173751 168264 163594 223096 279467 270200 243576 155128 107980 102335 181539 192055 138042
12661 138042 94216 132908 180128 181979 149353 128439 57005 65690 63040 34336 24988 77205
12649 77205 110941 141522 191626 252275 254803 228704 261604 282579 231530 188727 193036 123743
12637 123743 123205 164490 140552 151050 102710 93274 157782 267488 311456 317383 284894 223763
12625 223763 172120 189333 224132 228460 221719 188350 184016 178998 189207 122330 22478 17628
$$ packed form
12709F8394M2202m0264n0261K6673O3229O8170k8670l1825K1527J7190o7394m6140
12697D2831N0920L4009M4373M910m1275l9033N0503M2318o032k7931J8795n4792
12685A19596N3091j3765l1437J0662L4083k6205j3854l6193J6217K2849R079K9628
12673A73751n487m670N9502N6371r267k6624q8448m7148n645P9204J0516n4013
12661A38042m3826L8692M7220J851l2626k0914p1434Q685k650k8704r348N2217
12649G7205L3736L0581N0104O0649K528k6099L2900K0975n1049m2803M309o9293
12637A23743n38M1285k3938J0498m8340r436O4508J09706M3968N927l2489o1131
12625B23763n1643J7213L4799M328o741l3369m334n018J0209o6877r9852m850
$$ plain form
12613 17628 74938 119590 114859 139515 148510 161286 138670 121166 64496 39241 50348 37345
12601 37345 5545 -14684 124341 226863 179263 158055 200597 219954 223229 256227 247868 201319
12589 201319 163979 99175 101774 154123 130170 149001 184998 194046 195912 228509 237110 218848
12577 218848 177679 146898 136833 145056 149709 198932 184260 174397 188701 211941 280650 280578 269793
12564 269793 238303 280881 286266 233598 229982 232834 289350 264955 215927 181905 233022 282081
12552 282081 322764 332473 346306 319499 357861 317433 270174 316993 351519 363177 330893 351787
12540 351787 360222 381195 334076 281675 312881 330219 350854 411053 439104 401707 334240 325819
12528 325819 347371 318940 279900 271881 266189 299467 295155 320096 401016 466363 460196 415431
$$ packed form
12613A7628N7310M4652m731K4656Q995J2776k2616j7504n6670k5255J1107j3003
12601C7345l1800k0229J39025J02522m7600k1208M2542J9357L275L2998q359m6549
12589B01319l7340o4804K599N2349k3953J8831L5997R048J866L2597Q601j8262
12577B18848m1169l0781j0065Q223M653M9223j4672r863J4304K3240O8709p2j0785
12564B69793l1490M2578N385n2668l616K852N6516k4395m9028l4022N1117M9059
12552B82081M0683R709J3833k6807L8362m0428m7259M6819L4526J1658l2284K0894
12540C51787Q435K0973m7119n2401L1206J7338K0635O0199K8051l7397o7467q421
12528C25819K1552k8431l9040q019n692L3278m312K4941Q0920O5347o167m4765
$$ plain form
12516 415431 413132 408698 438706 499608 495200 506533 486901 528105 514806 535794 526969 467395
12504 467395 474036 449883 460932 489034 491027 481007 452196 420129 370504 358333 352609 308252
12492 308252 270297 238684 338157 425546 329299 251188 241560 285733 309135 318765 314888 343984
12480 343984 358090 332216 363305 431535 513099 583957 642637 708725 730332 759692 724463
12469 724463 637826 605446 585943 535506 509513 510346 477273 447117 411899 346985 348322 361819
12457 361819 376063 382971 402316 404290 446271 481631 468665 447710 402882 375619 369306 380546
12445 380546 393359 418440 396071 380135 390483 411812 432232 406675 395177 453140 426200
12434 426200 399101 484895 519114 525304 546266 518482 533111 598290 638510 651563 577831 489275
$$ packed form
12516D15431k299m434L0008O0902m408J1333j9632M1204j3299K0988q825n9574
12504D67395O641k4153J1049K8102J993j0020k8811l2067m9625j2171n724m4357
12492C08252l7955l1613R9473Q7389r6247p8111r628M4173K3402R630l877K9096
12480C43984J4106k5874L1089O8230Q1564P0858N8680O6088K1607K9360l5229
12469G24463q6637l2380j9503n0437k5993Q33l3073l0156l5218o4914J337J3497
12457C61819J4244O908J9345J974M1981L5360j2966k0955m4828k7263o313J1240
12445C80546J2813K5081k2369j5936J0348K1329K0420k5557j1498N7963k6940
12434D26200k7099Q5794L4219O190K0962k7784J4629O5179M0220J3053p3732q8556
$$ plain form
12422 489275 440634 426381 392778 433557 409378 458666 477005 372481 333976 323333 358932
12411 358932 409429 349692 344961 333964 333356 348892 317066 367495 389411 368761 386980 408246
12399 408246 344572 332724 371814 428612 440779 411714 392985 403877 366800 337747 285044
12388 285044 310976 334939 345914 313286 331061 416718 399304 372024 376857 369543 348835 352806
12376 352806 330050 309983 291956 393206 448167 379192 364766 313508 294501 304699 318772
12365 318772 372019 394241 391224 388531 393801 424726 522964 560310 456600 424256 418887 420845
12353 420845 423559 411089 423616 397048 392655 396686 398913 399416 425719 404235 399706 361661 362157
12340 362157 397445 447281 447682 465228 380342 293672 292283 259718 291923 292749 232328 246073
$$ packed form
12422D89275m8641j4253l3603M0779k4179M9288J8339j04524l8505j0643L5599
12411C58932N0497n9737m731j0997o08J5536l1826N0429K1916k0650J8219K1266
12399D08246o3674j1848L9090N6798J2167k9065j8729J0892l7077k9053n2703
12388B85044K5932K3963J0975l2628J7775Q5657j7414k7280M833p314k0708L971
12376C52806k2756k0067j8027J01250N4961o8975j4426n1258j9007J0198J4073
12365C18772N3247K2222l017k693N270L0925R8238L7346j03710l2344n369J958
12353D20845K714j2470J2527k6568m393M031K227N03K6303k1484m529l8045M96
12340C62157L5288M9836M01J7546q4886q6670j389l2565L2205Q26o0421J3745
$$ plain form
12328 246073 323934 323190 351778 372343 370014 366806 388851 422494 411739 409147 352169 285907
12316 285907 331664 389242 430793 445527 432479 408203 375925 362499 337775 298613 363603
12305 363603 429482 443996 409570 414433 447097 446488 476892 549869 538508 533472 514782 470809
12293 470809 497218 502259 508092 476056 501454 475184 397008 397180 418134 396602 385582 414617
12281 414617 449197 470249 463608 555650 557114 461783 480582 470710 443206 457987 450450 430077
12269 430077 444497 415170 402940 403977 390880 367531 377378 359703 358545 351790 407301 419870
12257 419870 437545 438518 458772 430004 381164 354965 335936 352880 384896 452590 444498 434301
12245 434301 467166 484821 459587 473429 419991 410756 444677 496570 513551 486559 441526 419729
$$ packed form
12328B46073P7861p44K8588K0565k329l208K2045L3643j0755k592n6978o6262
12316B85907M5757N7578M1551J4734j3048k4276l2278j3426k4724l9162O4990
12305C63603O5879J4514l4426M863L2664o09L0404P2977j1361n036j8690m3973
12293D70809K6409N041N833l2036K5398k6270p8176J72K0954k1532j1020K9035
12281D14617L4580K1052o641R2042J464r5331J8799r872k7504J4781p537k0373
12269D30077J4420k9327j2230J037j3097k3349R847j7675j158o755N5511J2569
12257D19870J7675R73K0254k8768m8840k6199j9029J6944L2016O7694q092j0197
12245D34301L2865J7655k5234J3842n3438r235L3921N1893J6981k6992m5033k1797
$$ plain form
12233 419729 398744 381227 404122 471264 500577 481248 458615 461135 472745 490322 483742 523319
12221 523319 584401 522981 503497 501224 559338 603760 626218 572729 503771 453766 496391 524983
12209 524983 583385 615900 618019 628001 687428 661198 637069 575872 572399 566063 533376 527971
12197 527971 525915 567595 560567 543328 565274 644209 662652 612576 544398 524087 554038 526300
12185 526300 549595 592877 593904 593439 605871 618642 609869 657918 655362 596310 603553 603943 622109
12172 622109 621994 604281 656874 674811 683900 666307 648783 645812 680300 729795 768208 822871
12160 822871 822795 738733 685233 677858 677392 767519 820755 837985 832830 762910 677648 650923 664996
12147 664996 657376 671772 715981 696161 710895 789512 848426 833214 825116 844945 823117 754788
$$ packed form
12233D19729k0985j7517K2895O7142K9313j9329k2633K520J1610J7577o580L9577
12221E23319O1082o1420j9484k273N8114M4422K2458n3489o8958n0005M2625K8592
12209E24983N8402L2515K119R982N9427k6230k4129o1197l473o336l2687n405
12197E27971k056M1680p028j7239K1946P8935J8443n0076o8178k0311K9951k7738
12185E26300K3295M3282J027m65J2432J2771q773M8049k556n9052P243L90J8166
12172F22109j15j7713N2593J7937R089j7593j7524k971L4488M9495L8413N4663
12160H22871p6q4062n3500p375m66R0127N3236J7230n155o9920q5262k6725J4073
12147F64996p620J4396M4209j9820J4734P8617N8914j5212q098J9829k1828o8329
$$ plain form
12135 754788 809454 873083 838131 814217 813600 808867 777871 789358 803856 886725 935250 939536
12123 939536 913681 925512 969786 961956 925533 941920 982722 1025399 1027729 991569 894677 888574
12111 888574 869371 836661 894399 944448 938246 962281 924588 943937 1026183 990179 1003679 1004320
12099 1004320 1016751 1039405 1083567 1071425 1065126 1095427 1125600 1102272 1059378 1040299 1051965
12088 1051965 1102367 1138890 1127635 1132185 1179517 1208124 1266140 1279667 1349172 1367864 1311549
12077 1311549 1209287 1192230 1210964 1221301 1257983 1249014 1223192 1178750 1184662 1226404 1232384 1234056
12065 1234056 1206001 1236565 1346960 1367169 1370706 1369613 1388432 1397776 1333338 1351231 1372089 1374693
12053 1374693 1411763 1475177 1475337 1404348 1372241 1362212 1367740 1342771 1364978 1392410 1355554 1363765
$$ packed form
12135G54788N4666O3629l4952k3914o17m733l0996J1487J4498Q2869M8525M286
12123I39536k5855J1831M4274p830l6423J6387M0802M2677K330l6160r6892o103
12111H88574j9203l2710N7738N0049o202K4035l7693J9349Q2246l6004J3500O41
12099A004320J2431K2654M4162j2142o299L0301L0173k3328m2894j9079J1666
12088A051965N0402L6523j1255M550M7332K8607N8016J3527O9505J8692n6315
12077A311549j02262j7057J8734J0337L6682q969k5822m4442N912M1742N980J672
12065A234056k8055L0564J10395K0209L537j093J8819R344o4438J7893K0858K604
12053A374693L7070O3414J60p0989l2107j0029N528k4969K2207K7432l6856Q211
$$ plain form
12041 1363765 1365327 1419532 1453486 1509675 1593997 1657137 1649631 1635642 1586094 1557676 1554957 1539964
12029 1539964 1534812 1529370 1563949 1577657 1567701 1641758 1626299 1601593 1598502 1577683 1571562 1603189
12017 1603189 1646274 1694014 1779225 1784610 1804348 1833912 1869370 1869937 1799976 1817418 1943121 1976519
12005 1976519 2004611 2003467 1991882 1950845 1930936 1943837 1980834 1988321 1968188 1948992 2003839 2076344
11993 2076344 2080946 2059987 2107514 2138130 2131405 2147661 2133637 2130375 2081461 2086455 2170349 2249457
11981 2249457 2247356 2196067 2246839 2335333 2354757 2397666 2416821 2414128 2431626 2422646 2449226 2497427
11969 2497427 2528502 2559663 2564491 2551607 2522509 2530910 2588704 2588233 2582604 2642648 2715745 2739363
11957 2739363 2718842 2725898 2716985 2743328 2778939 2806568 2911110 3023061 3033577 3046151 3110298
$$ packed form
12041A363765J562N4205L3954N6189Q4322O3140p506j3989m9548k8418k719j4993
12029A539964n152n442L4579J3708r956P4057j5459k4706l091k0819o121L1627
12017A603189M3085M7740Q5211N385J9738K9564L5458N67o9961J7442J25703L3398
12005A976519K8092j144j1585m1037j9909J2901L6997P487k0133j9196N4847P2505
11993B076344M602k0959M7527L0616o725J6256j4024l262m8914M994Q3894P9108
11981B249457k101n1289N0772Q8494J9424M2909J9155k693J7498q980K6580M8201
11969B497427L1075L1161M828j2884k9098Q401N7794m71n629O0044P3097K3618
11957B739363k0521P056q913K6343L5611K7629J04542J11951J0516J2574O4147
$$ plain form
11946 3110298 3139643 3103349 3136742 3185001 3212018 3240664 3321389 3362105 3353100 3368063 3363045 3385566
11934 3385566 3420218 3432955 3472896 3467918 3410616 3551673 3630422 3630178 3710403 3773947 3799470 3776634
11922 3776634 3748928 3773483 3808117 3810861 3905373 3955280 4040601 4154030 4184906 4264041 4344259
11911 4344259 4436725 4528021 4603579 4690519 4712639 4685321 4647385 4680054 4674232 4689930 4699544 4654928
11899 4654928 4670290 4748430 4816977 4873727 4957013 4966388 5006371 5088608 5139454 5162409 5250649
11888 5250649 5326334 5368984 5358366 5400297 5501018 5593981 5646979 5715422 5782821 5851200 5880083
11877 5880083 5959295 5986242 6010482 6090833 6137946 6165468 6245520 6375423 6516949 6554355 6566645
11866 6566645 6731498 6793729 6831702 6888726 6937913 7012763 7085123 7157322 7150495 7150116 7267030
$$ packed form
11946C110298K9345l6294L3393M8259K7017K8646Q0725M0716r005J4963n018K2521
11934C385566L4652J2737L9941m978n7302J41057P8749k44Q0225O3544K5523k2836
11922C776634k7706K4555L4634K744R4512M9907Q5321J13429L0876P9135Q0218
11911D344259R2466R1296P5558Q6940K2120k7318l7936L2669n822J5698R614m4616
11899D654928J5362P8140O8547N6750Q3286R375L9983Q2237N0846K2955Q8240
11888E250649P5685M2650j0618M1931J00721R2963N2998O8443O7399O8379K8883
11877E880083P9212K6947K4240Q0351M7113K7522Q0052J29903J41526L7406J2290
11866F566645J64853O2231L7973N7024M9187P4850P2360P2199o827l79J16914
$$ plain form
11855 7267030 7416079 7506588 7555925 7559214 7640458 7708307 7780740 7881853 7992818 8096553 8201775
11844 8201775 8234903 8275781 8397901 8451099 8491093 8529558 8615364 8735955 8799910 8882318 9011374
11833 9011374 9132580 9232839 9265689 9252173 9366695 9513270 9572339 9632249 9663841 9791456
11823 9791456 9878406 9958778 10063957 10148638 10151375 10151687 10221702 10314430 10411899 10536948 10576072
11812 10576072 10610585 10656009 10792981 10870486 10960386 11045664 11085430 11159853 11296279 11411438
11802 11411438 11454790 11439655 11525644 11625717 11729028 11848015 11876444 11845958 11892107 11941979
11792 11941979 12015909 12073794 12085969 12189564 12341780 12398081 12482356 12516822 12504265 12493971 12492389
11781 12492389 12618855 12647676 12682282 12708958 12744220 12790836 12792026 12861954 12880402 12882795 12858170
$$ packed form
11855G267030J49049R0509M9337L289Q1244O7849P2433J01113J10965J03735J05222
11844H201775L3128M0878J22120N3198L9994L8465Q5806J20591O3955Q2408J29056
11833I011374J21206J00259L2850j3516J14522J46575N9069N9910L1592J27615
11823I791456Q6950Q0372J05179Q4681K737L12P0015R2728R7469J25049L9124
11812A0576072L4513M5424J36972P7505Q9900Q5278L9766P4423J36426J15159
11802A1411438M3352j5135Q5989J00073J03311J18987K8429l0486M6149M9872
11792A1941979P3930N7885J2175J03595J52216N6301Q4275L4466j2557j0294j582
11781A2492389J26466K8821L4606K6676L5262M6616J190O9928J8448K393k4625
$$ plain form
11770 12858170 12867674 12801037 12745938 12776791 12820014 12853960 12857163 12835445 12847870 12874067 12865498 12878769
11758 12878769 12923991 12921913 12893826 12852894 12790275 12813332 12828408 12794104 12768399 12702483 12630715
11747 12630715 12579822 12506055 12487045 12468812 12461046 12454506 12429556 12354755 12291703 12253485 12190552
11736 12190552 12147399 12116538 12112426 12058954 11991202 11889726 11818327 11745461 11694310 11610250 11583291
11725 11583291 11545956 11458783 11372971 11313871 11267496 11242661 11108467 11045328 11027209 10995047 10914716
11714 10914716 10823872 10772354 10699452 10605036 10520165 10454830 10401147 10368549 10276715 10132112 10092807
11703 10092807 10081543 9980536 9893757 9820924 9679242 9520909 9530984 9496565 9413313 9305705
11693 9305705 9236025 9178345 9069440 8945240 8898672 8891397 8836853 8699348 8590808 8524616 8470844
$$ packed form
11770A2858170R504o6637n5099L0853M3223L3946L203k1718J2425K6197q569J3271
11758A2878769M5222k078k8087m0932o2619K3057J5076l4304k5705o5916p1768
11747A2630715n0893p3767j9010j8233p766o540k4950p4801o3052l8218o2933
11736A2190552m3153l0861m112n3472o7752j01476p1399p2866n1151q4060k6959
11725A1583291l7335q7173q5812n9100m6375k4835j34194o3139j8119l2162q0331
11714A0914716r0844n1518p2902r4416q4871o5335n3683l2598r1834j44603l9305
11703A0092807j1264j01007q6779p2833j41682j58333J0075l4419q3252j07608
11693I305705o9680n7680j08905j24200m6568p275n4544j37505j08540o6192n3772
$$ plain form
11682 8470844 8398591 8335387 8190959 8069903 8018348 7997213 7961486 7894482 7842795 7787784 7715120
11671 7715120 7664018 7638878 7609217 7588097 7603222 7517725 7410563 7370467 7279469 7181240 7116144
11660 7116144 7034338 6982431 6922113 6865679 6792919 6748072 6647643 6518858 6509981 6511652 6467379
11649 6467379 6406508 6413390 6322297 6217965 6145706 6145599 6129276 6047240 5987158 5933174 5895843 5924026
11637 5924026 5910954 5824537 5751233 5605744 5548845 5544119 5520228 5537729 5456895 5347594 5271804
11626 5271804 5284732 5269980 5239479 5175265 5158448 5152284 5108767 5097799 5055433 4935142 4854595
11615 4854595 4802059 4803134 4757473 4700751 4669549 4640563 4684564 4664899 4543533 4479732 4467021
11604 4467021 4427472 4375324 4423697 4426438 4353176 4342493 4285988 4293005 4235301 4179182 4108800 4012053
$$ packed form
11682H470844p2253o3204j44428j21056n1555k1135l5727o7004n1687n5011p2664
11671G715120n1102k5140k9661k1120J5125q5497j07162m0096r0998r8229o5096
11660G116144q1806n1907o0318n6434p2760m4847j00429j28785q877J671m4273
11649F467379o0871O882r1093j04332p2259j07j6323q2036o0082n3984l7331K8183
11637E924026j3072q6417p3304j45489n6899m726k3891J7501q0834j09301p5790
11626E271804J2928j4752l0501o4214j6817o164m3517j0968m2366j20291q0547
11615D854595n2536J075m5661n6722l1202k8986M4001j9665j21366o3801j2711
11604D467021l9549n2148M8373K741p3262j0683n6505P017n7704n6119p0382r6747
$$ plain form
11592 4012053 4005775 4038968 4050355 4042619 4031387 4011136 3962866 3914096 3843959 3781711 3752861 3771659
11580 3771659 3777108 3758322 3728453 3680703 3625647 3583635 3567487 3582532 3592779 3601427 3570978 3549458
11568 3549458 3512723 3492164 3508870 3483638 3452391 3371844 3316850 3301135 3286251 3249161 3145026
11557 3145026 3120067 3162823 3165863 3161067 3086521 3039853 3038042 3064381 3070693 3082159 3044802 3008213
11545 3008213 3002028 3026361 3004249 2963095 2911257 2894396 2914698 2924972 2904704 2867374 2843749
11534 2843749 2793737 2737130 2715834 2723712 2724164 2699259 2634777 2596844 2586822 2610954 2594017 2593030
11522 2593030 2588893 2600124 2554438 2584793 2610039 2497476 2455785 2463901 2452550 2450743 2442327 2402020
11510 2402020 2389391 2377091 2329277 2267661 2315417 2339694 2345309 2377511 2346566 2270364 2215988
$$ packed form
11592D012053o278L3193J1387p736j1232k0251m8270m8770p0137o2248k8850J8798
11580C771659N449j8786k9869m7750n5056m2012j6148J5045J0247Q648l0449k1520
11568C549458l6735k0559J6706k5232l1247q0547n4994j5715j4884l7090j04135
11557C145026k4959M2756L040m796p4546m6668j811K6339O312J1466l7357l6589
11545C008213o185K4333k2112m1154n1838j6861K0302J0274k0268l7330k3625
11534B843749n0012n6607k1296P878M52k4905o4482l7933j0022K4132j6937r87
11522B593030m137J1231m5686L0355K5246j12563m1691Q116j1351j807q416m0307
11510B402020j2629j2300m7814o1616M7756K4277N615L2202l0945p6202n4376
$$ plain form
11499 2215988 2216380 2199104 2262490 2282045 2267532 2227654 2188535 2155767 2141463 2146253 2142765 2095792
11487 2095792 2061631 2074452 2130478 2134240 2069485 2035955 2014992 1973682 1953781 1990357 1991152 2016893
11475 2016893 2005191 2000249 1999948 1971542 2059595 2062815 1999570 1903291 1890921 1883641 1869081 1850289
11463 1850289 1853528 1889874 1893170 1867001 1940380 1875443 1780545 1788190 1842488 1862515 1878960 1866075
11451 1866075 1803529 1812077 1817594 1785467 1802725 1835779 1809502 1770701 1739839 1652250 1633481 1605872
11439 1605872 1611271 1653484 1687469 1646537 1633665 1681638 1670169 1626902 1591141 1619400 1655856
11428 1655856 1641769 1621560 1627247 1683504 1655031 1631487 1631758 1638944 1581697 1549182 1566389 1533108
11416 1533108 1516390 1467331 1422268 1412722 1426614 1450130 1505282 1535744 1541297 1516956 1475073 1506289
$$ packed form
11499B215988L92j7276O3386J9555j4513l9878l9119l2768j4304M790l488m6973
11487B095792l4161J2821N6026L762o4755l3530k0963m1310j9901L6576P95K5741
11475B016893j1702m942l01k8406Q8053L220o3245r6279j2370p280j4560j8792
11463A850289L239L6346L296k6169P3379o4937r4898P645N4298K0027J6445j2885
11451A866075o2546Q548N517l2127J7258L3054k6277l8801l0862q7589j8769k7609
11439A605872N399M2213L3985m0932j2872M7973j1469m3267l5761K8259L6456
11428A655856j4087k0209N687N6257k8473k3544K71P186n7247l2515J7207l3281
11416A533108j6718m9059m5063r546J3892K3516N5152L0462N553k4341m1883L1216
$$ plain form
11404 1506289 1567351 1536376 1499101 1526618 1454071 1409430 1405004 1435814 1465724 1479111 1447326
11393 1447326 1390642 1292607 1355765 1387808 1365520 1385811 1384534 1338517 1295977 1320262 1298036
11382 1298036 1275170 1305716 1265791 1189208 1169960 1170493 1168656 1217379 1246054 1339387 1389520 1354789
11370 1354789 1292021 1299992 1275648 1231257 1254684 1274603 1304233 1263760 1189146 1205113 1245095
11359 1245095 1228440 1178779 1122855 1101903 1126268 1190359 1265566 1243503 1210378 1221644 1310645
11348 1310645 1304040 1241652 1209859 1206261 1217345 1205232 1143244 1124088 1147498 1147815 1126477 1176753
11336 1176753 1157357 1098031 1054530 1075602 1057632 1016158 1027527 1060193 1090289 1192589 1225279
11325 1225279 1254814 1210668 1123421 1108339 1111057 1069322 1050361 1034111 1086697 1164254 1156476 1122836
$$ packed form
11404A506289O1062l0975l7275K7517p2547m4641m426L0810K9910J3387l1785
11393A447326n6684r8035O3158L2043k2288K0291j277m6017m2540K4285k2226
11382A298036k2866L0546l9925p6583j9248N33j837M8723K8675R3333N0133l4731
11370A354789o2768P971k4344m4391K3427J9919K9630m0473p4614J5967L9982
11359A245095j6655m9661n5924k0952K4365O4091P5207k2063l3125J1266Q9001
11348A310645o605o2388l1793l598J1084j2113o1988j9156K3410L17k1338N0276
11336A176753j9396n9326m3501K1072j7970m1474J1369L2666L0096J02300L2690
11325A225279K9535m4146q7247j5082K718m1735j8961j6250N2586P7557p778l3640
$$ plain form
11313 1122836 1080750 1063332 1062791 1093921 1121079 1088576 1061459 1047672 1058912 1034122 974530 1006789
11301 1006789 1086510 1100010 1036043 1053911 1143999 1161926 1091821 1038886 1027304 1023938 1023126 1000301
11289 1000301 1014701 1036148 1025915 994236 1000333 1007803 981663 997859 1004153 1004432 985339 1013517
11277 1013517 1017307 1014234 965747 1018416 1069001 1084921 1077239 1103082 1135036 1159862 1134919 1102922
11265 1102922 1134518 1130942 1100172 1082207 1041170 1023800 1023578 1003554 970311 984812 1000185 989689
11253 989689 1045878 1064715 1077467 1041077 1011501 1056534 1073092 1167325 1229557 1238934 1251754 1283839
11241 1283839 1282420 1286606 1250907 1215918 1178407 1163053 1118882 1102561 1116773 1084383 1039507 1051401
11229 1051401 1001519 973094 928762 929690 957560 908269 858603 915582 955256 976572 922229 837835
$$ packed form
11313A122836m2086j7418n41L1130K7158l2503k7117j3787J1240k4790n9592L2259
11301A006789P9721J3500o3967J7868R0088J7927p0105n2935j1582l366q12k2825
11289A000301J4400K1447j0233l1679O097P470k6140J6196O294K79j9093K8178
11277A013517L790l073m8487N2669N0585J5920p682K5843L1954K4826k4943l1997
11265A102922L1596l576l0770j7965m1037j7370k22k0024l3243J4501J5373j0496
11253I89689N6189J8837J2752l6390k9576M5033J6558R4233O2232R377J2820L2085
11241A283839j419M186l5699l4989l7511j5354m4171j6321J4212l2390m4876J1894
11229A051401m9882k8425m4332R28K7870m9291m9666N6979L9674K1316n4343q4394
$$ plain form
11217 837835 848892 944497 964016 946097 935788 931260 912867 944678 908287 847998 843575 872305
11205 872305 903317 967628 993247 1027285 1087711 1113824 1125710 1126008 1185976 1163063 1183703 1151588
11193 1151588 1069187 1029126 1040403 1103568 1115851 1150412 1162523 1165612 1122212 1057816 1052796 1069632
11181 1069632 1086845 1058031 999117 959938 924060 832230 815908 890626 885195 874701 865489 855003
11169 855003 844390 849523 828043 802628 836065 818119 804146 835791 774137 773311 841610 806626
11157 806626 814122 845805 850005 893502 923061 963355 987218 999298 1081692 1079260 1062419 1098438
11145 1098438 1112497 1111372 1106492 1108388 1096927 1051911 1016318 961589 897639 889833 899847 915011
11133 915011 912562 851970 802600 862533 879379 816216 777973 748919 697344 700211 699356 709529
$$ packed form
11217H37835J1057R5605J9519j7919j0309m528j8393L1811l6391o0289m423K8730
11205H72305L1012O4311K5619L4038O0426K6113J1886K98N9968k2913K0640l2115
11193A151588q2401m0061J1277O3165J2283L4561J2111L089m3400o4396n020J6836
11181A069632J7213k8814n8914l9179l5878r1830j6322P4718n431j0494r212j0486
11169H55003j0613N133k1480k5415L3437j7946j3973L1645o1654q26O8299l4984
11157H06626P496L1683M200M3497K9559M0294K3863J2080Q2394k432j6841L6019
11145A098438J4059j125m880J896j1461m5016l5593n4729o3950p806J0014J5164
11133I15011k449o0592m9370N9933J6846o3163l8243k9054n1575K867q55J0173
$$ plain form
11121 709529 767245 792647 784233 838872 900055 908340 897050 804335 850379 849380 847756 786505
11109 786505 746344 767567 805127 807762 773188 712661 651909 660429 666337 662905 680001 679082 684869
11096 684869 681346 653838 634411 659468 682890 684997 675496 684283 701750 699773 703163 665901 644412
11083 644412 660783 702861 719924 690778 665485 645358 686873 719885 726381 732998 740395 772038
11071 772038 818769 798372 768810 806643 787129 766464 758913 745651 715962 723653 754783 804200
11059 804200 841932 853858 854167 841101 835292 849775 833168 815880 794292 788022 761268 714232
11047 714232 719404 797263 797535 746687 754591 797633 771052 698317 702948 699556 696703 677170 625811
11034 625811 629032 616695 593768 607856 632545 670854 690419 736079 728811 771287 840839 809014
$$ packed form
11121G09529N7716K5402q414N4639O1183Q285j1290r2715M6044r99j624o1251
11109G86505m0161K1223L7560K635l4574o0527o0752Q520N908l432J7096r19N787
11096F84869l523k7508j9427K5057K3422K107r501Q787J7467j977L390l7262k1489
11083F44412J6371M2078J7063k9146k5293k0127M1515L3012O496O617P397L1643
11071G72038M6731k0397k9562L7833j9514k0665p551j3262k9689P691L1130M9417
11059H04200L7732J1926L09j3066n809J4483j6607j7288k1588o270k6754m7036
11047G14232N172P7859K72n0848P904M3042k6581p2735M631l392k853j9533n1359
11034F25811L221j2337k2927J4088K4689L8309J9565M5660p268M2476O9552l1825
$$ plain form
11022 809014 776500 750341 711902 737642 746802 713479 700817 707025 717623 675656 695791 678113
11010 678113 677305 690372 676035 697823 717857 702706 700399 668262 649001 675081 700345 751959
10998 751959 816836 767799 720774 698767 747222 825894 866037 843716 773697 718078 696840
10987 696840 721919 686833 610350 595360 611168 582676 589190 604523 553149 532682 557708 617887
10975 617887 657666 627088 563344 549697 537099 538630 590192 622851 614402 654324 667652 635666
10963 635666 585428 555818 576190 554659 570228 628703 689835 694006 674075 711647 677864 550730
10951 550730 589757 616790 636679 640665 671467 686010 669264 686386 665764 677764 673091 652881
10939 652881 642600 645002 681692 674193 662293 655086 607314 543610 560947 511395 548041 549939
$$ packed form
11022H09014l2514k6159l8439K5740R160l3323j2662O208J0598m1967K0135j7678
11010F78113q08J3067j4337K1788K0034j5151k307l2137j9261K6080K5264N1614
10998G51959O4877m9037m7025k2007M8455P8672M0143k2321p0019n5619k1238
10987F96840K5079l5086p6483j4990J5808k8492O514J5333n1374k0467K5026O0179
10975F17887L9779l0578o3744j3647j2598J531N1562L2659q449L9922J3328l1986
10963F35666n0238k9610K0372k1531J5569N8475O1132M171j9931L7572l3783j27134
10951E50730L9027K7033J9889L986L0802J4543j6746J7122k0622J2000m673k0210
10939F52881j0281K402L6690p499j1900p207m7772o3704J7337m9552L6646J898
$$ plain form
10927 549939 541127 580754 560398 582067 596878 590346 541086 551731 591080 573444 574294 579189
10915 579189 578744 578381 587604 625298 616474 579089 588109 609990 618855 569074 559112 511816 450792
10902 450792 435606 451020 473514 492307 514164 573093 616181 586676 546273 562633 541156
10891 541156 523064 514066 481439 502622 503245 509021 489965 490991 551845 593831 601242 598309 581643
10878 581643 551469 547048 548885 509064 498977 521147 481508 535882 564026 565588 561646 580822
10866 580822 555621 555979 577299 576780 584859 573100 532364 526434 490161 517661 525148 481660 504985
10853 504985 500926 461543 453295 499780 532662 536645 572219 562303 550387 586016 615380 579807
10841 579807 556478 546294 551741 533705 516242 539778 567099 544214 491004 513773 589710 598094
$$ packed form
10927E49939q812L9627k0356K1669J4811o532m9260J0645L9349j7636Q50M895
10915E79189m45l63R223L7694q824l7385R020K1881Q865m9781r962m7296o1024
10902D50792j5186J5414K2494J8793K1857N8929M3088k9505m0403J6360k1477
10891E41156j8092q998l2627K1183O23N776j9056J026O0854M1986P411k933j6666
10878E81643l0174m421J837l9821j0087K2170l9639N4374K8144J562l942J9176
10866E80822k5201L58K1320n19Q079j1759m0736n930l6273K7500P487m3488K3325
10853E04985m059l9383q248M6485L2882L983L5574r916j1916L5629K9364l5573
10841E79807k3329j0184N447j8036j7463K3536K7321k2885n3210K2769P5937Q384
$$ plain form
10829 598094 538140 534326 510927 560493 602044 616438 663124 632741 565176 522522 501804 522527
10817 522527 572321 546112 568358 553788 479388 512959 537969 528262 511562 520454 565110 578428
10805 578428 588700 601950 579439 553639 522071 520023 520297 543364 559863 625689 647139 631751
10793 631751 631251 591808 564148 605325 569835 501248 448768 493637 525174 526819 499291 452732
10781 452732 450301 499717 497637 499271 459212 493361 536562 577351 598617 621498 735027 809920
10769 809920 827207 814968 782291 774473 690353 636704 631006 525083 481879 487656 518360 534143
10757 534143 551559 538002 508960 576081 564806 530520 502642 512974 508217 496480 526442 533911
10745 533911 571838 616059 698068 714156 652181 601705 508888 465398 447990 452648 495298 564768
$$ packed form
10829E98094n9954l814k3399M9566M1551J4394M6686l0383o7565m2654k0718K0723
10817E22527M9794k6209K2246j4570p4400L3571K5010r707j6700Q892M4656J3318
10805E78428J0272J3250k2511k5800l1568k048K74K3067J6499O5826K1450j5388
10793F31751n00l9443k7660M1177l5490o8587n2480M4869L1537J645k7528m6559
10781D52732k431M9416k080J634m0059L4149M3201M0789K1266K2881J13529P4893
10769H09920J7287j2239l2677p818q4120n3649n698j05923m3204N777L0704J5783
10757E34143J7416j3557k9042O7121j1275l4286k7878J0332m757j1737K9962P469
10745E33911L7927M4221Q2009J6088o1975n0476r2817m3490j7408M658M2650O9470
$$ plain form
10733 564768 574873 560082 556293 526935 533391 514253 534810 552736 526724 568373 631631 660543
10721 660543 621893 619883 648395 692878 697875 653464 608425 575784 616827 668956 720291 719802
10709 719802 669209 717449 719783 676122 678920 662655 655599 608331 562868 534696 582806 560204
10697 560204 587822 593905 570656 591161 640398 657012 594672 627712 661097 660981 632296 616658
10685 616658 681683 732220 739376 712440 698592 719440 631690 598803 645609 640909 615587 600007
10673 600007 610878 613220 637376 655274 669753 659481 687809 628109 632797 579490 499814 483917
10661 483917 511603 506749 523303 572735 616780 601597 539677 545637 576266 562692 516747 489381
10649 489381 514703 547292 597561 592584 520505 494753 471512 462927 447314 501672 513108 476309
$$ packed form
10733E64768J0105j4791l789k9358O456j9138K0557J7926k6012M1649O3258K8912
10721F60543l8650k010K8512M4483M997m4411m5039l2641M1043N2129N1335m89
10709G19802n0593M8240K334m3661K798j6265p056m7268m5463k8172M8110k2602
10697E60204K7618O083k3249K0505M9237J6614o2340L3040L3385j16k8685j5638
10685F16658O5025N0537P156k6936j3848K0848q7750l2887M6806m700k5322j5580
10673F00007J0871K342K4156J7898J4479j0272K8328n9700M688n3307p9676j5897
10661D83917K7686m854J6554M9432M4045j5183o1920N960L0629j3574m5945k7366
10649D89381K5322L2589N0269m977p2079k5752k3241q585j5613N4358J1436l6799
$$ plain form
10637 476309 430121 449502 510525 522689 481909 428019 392962 397628 424932 447328 455590 504857
10625 504857 564587 539077 462150 430144 432317 441678 468989 570188 601047 563169 541041 510764
10613 510764 473978 461889 533528 541375 522984 562536 496857 512481 509642 529058 518145 536702
10601 536702 492373 471857 443451 423947 469454 455115 494589 463684 439137 476088 477842 469034
10589 469034 434843 466535 445390 448069 480058 474477 456342 463777 508518 475010 446646 450884
10577 450884 488063 514108 550072 587147 557993 501879 433205 425967 427044 440062 465710 468926
10565 468926 450607 448645 465994 517437 477122 464098 478278 487065 424434 370956 359567 416943
10553 416943 441886 452434 416436 395952 402077 399939 460601 533886 520814 507489 482488 499691
$$ packed form
10637D76309m6188J9381O1023J2164m0780n3890l5057M666K7304K2396Q262M9267
10625E04857N9730k5510p6927l2006K173R361K7311J01199L0859l7878k2128l0277
10613E10764l6786j2089P1639P847j8391L9552o5679J5624k839J9416j0913J8557
10601E36702m4329k0516k8406j9504M5507j4339L9474l0905k4547L6951J754q808
10589D69034l4191L1692k1145K679L1989n581j8135P435M4741l3508k8364M238
10577D50884L7179K6045L5964L7075k9154n6114o8674p238J077J3018K5648L216
10565D68926j8319j962J7349N1443m0315j3024J4180Q787o2631n3478j1389N7376
10553D16943K4943J0548l5998k0484O125k138O0662P3285j3072j3325k5001J7203
$$ plain form
10541 499691 503435 521594 507383 508033 524318 550736 534369 509947 531860 510093 462838 469707
10529 469707 496529 528159 529117 493561 490727 455663 459933 450989 453814 477680 463531 414422 444914
10516 444914 473685 540133 570967 565389 598964 542789 498887 449483 489121 501080 502026 521981
10504 521981 536001 534097 498327 467252 519243 515422 462133 401881 443897 501080 569931 539953
10492 539953 523045 470083 470958 490823 428251 462527 448378 397841 388761 422674 388970 374691
10480 374691 388953 419082 479150 536585 554375 475657 444181 483429 481129 486523 476257 454755
10468 454755 455227 430863 448839 441075 462241 487919 485527 476354 456949 460108 500315 469588 408427
10455 408427 423070 448247 476771 489731 537544 585375 533753 463640 407070 428941 457200
$$ packed form
10541D99691L744J8159j4211O50J6285K6418j6367k4422K1913k1767m7255O869
10529D69707K6822L1630R58l5556k834l5064M270q944K825K3866j4149m9109L0492
10516D44914K8771O6448L0834n578L3575n6175m3902m9404L9638J1959R46J9955
10504E21981J4020j904l5770l1075N1991l821n3289o0252M2016N7183O8851k9978
10492E39953j6908n2962Q75J9865o2572L4276j4149n0537r080L3913l3704j4279
10480C74691J4262L0129O0068N7435J7790p8718l1476L9248k300N394j0266k1502
10468D54755M72k4364J7976p764K1166K5678k392r173j9405L159M0207l0727o1161
10455D08427J4643K5177K8524J2960M7813M7831n1622p0113n6570K1871K8259
$$ plain form
10444 457200 475087 574897 617255 564257 565058 615808 605331 587070 641518 709963 780901 812370
10432 812370 817352 790201 743305 722986 714433 742717 760077 771241 696936 643758 613067 637136
10420 637136 610370 578550 558724 565289 515303 517355 527929 574160 607668 601139 605170 585270
10408 585270 572812 536780 559584 615889 591563 526415 559873 532938 532215 508468 520509 595211
10396 595211 629978 567809 542033 500955 484778 471683 505172 520593 523387 522816 482882 452134
10384 452134 428371 434502 476155 548723 553124 555351 537687 538116 534205 574027 597796 604888 615868
10371 615868 624420 647656 624788 534702 514423 526818 552261 541994 506786 545361 632388 644616
10359 644616 609636 617742 674402 675532 616267 614309 586587 601387 600474 586936 632602 627782 588644
$$ packed form
10444D57200J7887R9810M2358n2998Q01N0750j0477j8261N4448O8445P0938L1469
10432H12370M982k7151m6896k0319q553K8284J7360J1164p4305n3178l0691K4069
10420F37136k6766l1820j9826O565m9986K052J0574M6231L3508o529M031j9900
10408E85270j2458l6032K2804N6305k4326o5148L3458k6935p23k3747J2041P4702
10396E95211L4767o2169k5776m1078j6177j3095L3489J5421K794n71l9934l0748
10384D52134k3763O131M1653P2568M401K227j7664M29l911L9822K3769P092J0980
10371F15868Q552K3236k2868r0086k0279J2395K5443j0267l5208L8575Q7027J2228
10359F44616l4980Q106N6660J130n9265j958k7722J4800r13j3538M5666m820l9138
$$ plain form
10346 588644 566570 541038 610259 654122 656968 639863 594553 582934 553104 468049 483226 554167
10334 554167 584286 572055 591285 570528 555807 532757 545838 542283 509085 529015 536040 529694
10322 529694 480325 477736 467048 500444 547780 536149 527608 505854 528048 536338 558459 575924
10310 575924 542912 507599 476915 472369 488758 521028 570476 594124 559156 540213 556699 587809
10298 587809 563586 544245 568520 613497 678909 702624 676287 623760 638338 682969 713502
10287 713502 695451 697800 732196 776104 800132 730656 629376 644918 688520 664224 611329
10276 611329 577378 609701 621201 598248 637038 654523 668992 694236 670819 660647 686656
10265 686656 696351 620265 629568 619817 657662 727899 705130 719587 687984 617748 574349 548550
$$ packed form
10346E88644k2074k5532O9221M3863K846j7105m5310j1619k9830q5055J5177P0941
10334E54167L0119j2231J9230k0757j4721k3050J3081l555l3198J9930P025o346
10322E29694m9369k589j0688L3396M7336j1631q541k1754K2194Q290K2121J7465
10310E75924l3012l5313l0684m546J6389L2270M9448K3648l4968j8943J6486L1110
10298E87809k4223j9341K4275M4977O5412K3715k6337n2527J4578M4631L0533
10287G13502j8051K349L4396M3908K4028o9476j01280J5542M3602k4296n2895
10276F11329l3951L2323J1500k2953L8790J7485J4469K5244k3417j0172K6009
10265F86656R695p6086R303r751L7845P0237k2769J4457l1603p0236m3399k5799
$$ plain form
10253 548550 556290 617193 604959 555837 550888 592849 656628 612093 607972 642685 663768 647062
10241 647062 652959 690519 709781 645447 606768 643755 577595 484911 500543 671130 735075
10230 735075 742334 706600 692609 710136 678139 617304 615364 647784 619585 591781 545734 522619
10218 522619 545563 569963 560171 551314 588871 635169 602691 627714 658656 671349 637437 612513
10206 612513 583014 603881 650755 676251 664563 642749 616368 620813 595344 587252 521485 501372
10194 501372 583274 592139 522104 488324 489054 531605 599286 633675 654123 692649 681947 686656
10182 686656 745660 758929 765712 743557 722251 701877 674617 647451 606944 598374 595806 613496
10170 613496 624316 646696 650510 587471 585234 580359 621624 725959 765322 788419 811439 803614
$$ packed form
10253E48550P740O0903j2234m9122m949M1961O3779m4535m121L4713K1083j6706
10241F47062N897L7560J9262o4334l8679L6987o6160r2684J5632J70587O3945
10230G35075P259l5734j3991J7527l1997o0835j940L2420k8199k7804m6047k3115
10218E22619K2944K4400r792q857L7557M6298l2478K5023L0942J2693l3912k4924
10206F12513k9499K0867M6874K5496j1688k1814k6381M445k5469q092o5767k0113
10194E01372Q1902Q865p0035l3780P30M2551O7681L4389K0448L8526j0702M709
10182F86656N9004J3269O783k2155k1306k0374k7260k7166m0507q570k568J7690
10170F13496J0820K2380L814o3039k237m875M1265J04335L9363K3097K3020p825
$$ plain form
10158 803614 792614 728820 723133 726312 736629 715047 662421 667172 701243 726773 665429 629089
10146 629089 680341 696056 679192 701998 731024 721945 812460 879016 854708 784360 681339
10135 681339 653698 611760 589638 655111 731540 744015 828272 888148 881430 852015 844848 773631
10123 773631 684007 684372 688711 694014 707754 686295 679352 765955 731840 765308 759109 775683 801510
10110 801510 786568 819013 854359 833138 740538 716893 704740 710744 735023 750542 752366 738032
10098 738032 734518 756237 811884 877936 908574 900100 863906 828796 825281 773875 745635 784676
10086 784676 851082 861566 852410 849502 889387 867421 867261 865628 873463 874961 869214 897694 905977
10073 905977 937393 1021798 1018056 974247 1012413 1011027 957129 914859 968149 977208 1010846 1063892
$$ packed form
10158H03614j1000o3794n687L179J0317k1582n2626M751L4071K5530o1344l6340
10146F29089N1252J5715j6864K2806K9026r079R0515O6556k4308p0348j03021
10135F81339k7641m1938k2122O5473P6429J2475Q4257N9876o718k9415p167p1217
10123G73631q9624L65M339N303J3740k1459o943Q6603l4115L3468o199J6574K5827
10110H01510j4942L2445L5346k1221r2600k3645j2153O004K4279J5519J824j4334
10098G38032l514K1719N5647O6052L0638q474l6194l5110l515n1406k8240L9041
10086G84676O6406J0484r156k908L9885k1966j60j633P835J498n747K8480Q283
10073I05977L1416Q4405l742m3809L8166j386n3898m2270N3290R059L3638N3046
$$ plain form
10061 1063892 1080397 1133827 1167037 1116678 1161993 1207202 1227792 1320249 1508799 1645795 1891625
10050 1891625 2109855 2243999 2350612 2451244 2593743 2766101 3130222 3601112 4232782
10041 4232782 5090039 6179639 7510533 9467418 12559748 18138169 29587253 52914744
10033 52914744 81292638 87994508 79115181 66798530 51648790 35354650 23227069
10026 23227069 15688628 11205182 8422308 6615505 5382959 4454704 3722018 3221376
10018 3221376 2738810 2380266 2229970 2140996 2163044 2180298 2040812 1919091 1824162 1700334
10008 1700334 1544876 1427564 1364401 1350847 1368583 1314155 1277212 1262805 1174118 1168857 1167930
9997 1167930 1157537 1136700 1077213 1043586 1042931 1071219 1062577 1016064 987355 1036322 1040190 1015154
$$ packed form
10061A063892J6505N3430L3210n0359M5315M5209K0590R2457J88550J36996K45830
10050A891625K18230J34144J06613J00632J42499J72358L64121M70890O31670
10041D232782Q57257J089600J330894J956885L092330N578421J1449084K3327491
10033E2914744K8377894O701870q879327j2316651j5149740j6294140j2127581
10026B3227069p538441m483446k782874j806803j232546r28255p32686n00642
10018C221376m82566l58544j50296q8974K2048J7254j39486j21721r4929j23828
10008A700334j55458j17312o3163j3554J7736n4428l6943j4407q8687n261r27
9997A167930j0393k0837n9487l3627o55K8288q642m6513k8709M8967L868k5036
$$ plain form
9985 1015154 1017166 1009201 993780 1052298 1089986 1066862 958867 1012292 1107883 1188444 1244412 1243009
9973 1243009 1235777 1201517 1219198 1195732 1122269 1052451 1004736 978299 963027 965269 997188 1019480
9961 1019480 1036690 1075736 1031675 1036264 1078578 1007481 929812 996346 1093044 1118124 1075378 1064435
9949 1064435 1058354 998426 985867 996729 1025863 1037673 1027000 1008261 1014348 1003738 1008494 1069093
9937 1069093 1131400 1214771 1399087 1560328 1579419 1563726 1488121 1430399 1386041 1280870 1198943
9926 1198943 1156142 1130246 1040597 1006487 1048633 1073708 1033810 1051759 1006843 1014092 1093185 1166344
9914 1166344 1179740 1150537 1124202 1085317 1070934 1041077 1065929 1105742 1169960 1148654 1138374
9903 1138374 1171581 1146429 1116929 1046989 1048640 1045172 1040764 1078664 1120328 1128826 1193519 1244909
$$ packed form
9985A015154K012p965j5421N8518L7688k3124j07995N3425R5591Q0561N5968j403
9973A243009p232l4260J7681k3466p3463o9818m7715k6437j5272K242L1919K2292
9961A019480J7210L9046m4061M589M2314p1097p7669O6534R6698K5080m2746j0943
9949A064435o081n9928j2559J0862K9134J1810j0673j8739O087j0610M756O0599
9937A069093O2307Q3371J84316J61241J9091j5693p5605n7722m4358j05171q1927
9926A198943m2801k5896q9649l4110M2146K5075l9898J7949m4916P249P9093P3159
9914A166344J3396k9203k6335l8885j4383k9857K4852L9813O4218k1306j0280
9903A138374L3207k5152k9500o9940J651l468m408L7900M1664Q498O4693N1390
$$ plain form
9891 1244909 1309048 1370127 1474289 1585111 1563422 1507167 1513107 1506695 1563080 1729695 1875276
9880 1875276 1963224 2044845 2272115 2581302 2876271 3161387 3368705 3503111 3468335 3328882
9870 3328882 3256176 3243640 3416729 3963491 4861620 5707179 5914144 5602155 4952630 4201679
9860 4201679 3492146 2901895 2467396 2202500 2020236 1924332 1841064 1781093 1822325 1846067
9850 1846067 1924800 2053292 2088337 2117389 2146370 2153631 2162773 2124051 2150811 2226720 2356370
9839 2356370 2603130 2978246 3518097 4407628 5829171 7479889 8524970 8454851 7514304
9830 7514304 6270184 5016669 3987780 3150043 2532328 2209600 2077946 2051554 1995775
9821 1995775 1955766 1902534 1823532 1766219 1781220 1741857 1730740 1631720 1616061 1592709 1585413 1605044
$$ packed form
9891A244909O4139O1079J04162J10822k1689n6255N940o412N6385J66615J45581
9880A875276Q7948Q1621K27270L09187K94969K85116K07318J34406l4776j39453
9870C328882p2706j2536J73089N46762Q98129Q45559K06965l11989o49525p50951
9860D201679p09533n90251m34499k64896j82264r5904q3268n9971M1232K3742
9850A846067P8733J28492L5045K9052K8981P261R142l8722K6760P5909J29650
9839B356370K46760L75116N39851Q89531J421543J650718J045081p0119r40547
9830G514304j244120j253515j028889q37737o17715l22728j31654k6392n5779
9821A995775m0009n3232p9002n7313J5001l9363j1117r9020j5659k3352p296J9631
$$ plain form
9809 1605044 1624800 1601137 1545425 1573198 1500696 1469597 1432247 1368421 1328525 1328058 1323334 1366495
9797 1366495 1450547 1458592 1433206 1448535 1506803 1516097 1560263 1688188 1837607 1842007 1798732 1712472
9785 1712472 1672291 1604210 1516668 1497428 1496328 1509160 1564538 1592333 1613683 1658767 1641822 1556617
9773 1556617 1594920 1591607 1503879 1431663 1356394 1307740 1275045 1292281 1273936 1287632 1331628 1299927
9761 1299927 1312997 1306715 1314084 1303558 1269543 1309383 1364411 1357824 1266689 1197710 1191299 1225685
9749 1225685 1289353 1289084 1278528 1312973 1384221 1327352 1318531 1358377 1394987 1438229 1480299 1493557
9737 1493557 1468289 1495943 1475340 1504929 1505007 1476820 1478541 1491166 1498610 1519100 1440632 1400916
9725 1400916 1377608 1322742 1302572 1286008 1322571 1328412 1289919 1363264 1378968 1298453 1285643 1289690
$$ packed form
9809A605044J9756k3663n5712K7773p2502l1099l7350o3826l9896m67m724M3161
9797A366495Q4052Q045k5386J5329N8268R294M4166J27925J49419M400m3275q6260
9785A712472m0181o8081q7542j9240j100J2832N5378K7795K1350M5084j6945q5205
9773A556617L8303l313q7728p2216p5269m8654l2695J7236j8345J3696M3996l1701
9761A299927J3070o282P369j0526l4015L9840N5028o587r1135o8979o411L4386
9749A225685O3668k69j0556L4445P1248n6869q821L9846L6610M3242M2070J3258
9737A493557k5268K7654k0603K9589P8k8187J721J2625P444K0490p8468l9716
9725A400916k3308n4866k0170j6564L6563N841l8493P3345J5704q0515j2810M047
$$ plain form
9713 1289690 1275982 1317620 1322245 1332775 1322107 1300413 1255514 1245918 1287754 1338733 1361705 1344522
9701 1344522 1355089 1376962 1402045 1418182 1405313 1346016 1328580 1352541 1405444 1397754 1358415 1371350
9689 1371350 1359663 1296146 1268085 1203426 1212283 1261567 1288554 1305963 1284138 1280195 1324442 1375033
9677 1375033 1454401 1473596 1452568 1445919 1400772 1380310 1416357 1432248 1461312 1423396 1415017 1395932
9665 1395932 1446088 1480043 1478063 1449500 1414533 1467104 1512290 1511164 1467748 1409714 1401832 1431018
9653 1431018 1408910 1393775 1379939 1318710 1320053 1365207 1417967 1467727 1406206 1365690 1375805 1316148
9641 1316148 1318213 1345470 1371509 1363642 1373286 1399325 1371708 1391813 1382797 1461000 1501386 1503268
9629 1503268 1458301 1513606 1573933 1627964 1620322 1586283 1549955 1576951 1533089 1438777 1352627 1384818
$$ packed form
9713A289690j3708M1638M625J0530j0668k1694m4899r596M1836N0979K2972j7183
9701A344522J0567K1873K5083J6137j2869n9297j7436K3961N2903p690l9339J2935
9689A371350j1687o3517k8061o4659Q857M9284K6987J7409k1825l943M4247N0591
9677A375033P9368J9195k1028o649m5147k0462L6047J5891K9064l7916q379j9085
9665A395932N0156L3955j980k8563l4967N2571M5186j126m3416n8034p882K9186
9653A431018k2108j5135j3836o1229J343M5154N2760M9760o1521m0516J0115n9657
9641A316148K065K7257K6039p867R644K6039k7617K0105r016P8203M0386J882
9629A503268m4967N5305O0327N4031p642l4039l6328K6996m3862r4312q6150L2191
$$ plain form
9617 1384818 1415388 1420317 1360351 1348782 1409570 1438762 1436869 1449672 1407254 1420393 1410638 1361640
9605 1361640 1330954 1363068 1333848 1319358 1363538 1304366 1351785 1316492 1288134 1316016 1317810 1298464
9593 1298464 1275163 1296031 1300033 1278871 1284789 1307529 1299963 1270684 1214239 1215072 1209916 1201085 1271469
9580 1271469 1306038 1258904 1242867 1227393 1227800 1242990 1270587 1269126 1275293 1292782 1312326 1269116
9568 1269116 1278166 1278583 1239652 1188272 1230138 1305487 1313893 1309861 1337789 1312243 1223570 1205021
9556 1205021 1206021 1251718 1232022 1135730 1086719 1128641 1199460 1250797 1236919 1205961 1159505 1165212
9544 1165212 1178456 1185107 1197737 1146089 1149897 1147301 1175864 1192308 1168535 1137725 1177379 1125534
9532 1125534 1141278 1102716 1046430 1109309 1072265 1023909 1109461 1151583 1148578 1105049 1067923 1078273
$$ packed form
9617A384818L0570M929n9966j1569O0788K9192j893J2803m2418J3139r755m8998
9605A361640l0686L2114k9220j4490M4180n9172M7419l5293k8358K7882J794j9346
9593A298464k3301K0868M002k1162N918K2740p566k9279n6445Q33n156q831P0384
9580A271469L4569m7134j6037j5474M07J5190K7597j461O167J7489J9544m3210
9568A269116R050M17l8931n1380M1866P5349Q406m032K7928k5546q8673j8549
9556A205021J000M5697j9696r6292m9011M1922P0819N1337j3878l0958m6456N707
9544A165212J3244O651J2630n1648L808k596K8563J6444k3773l0810L9654n1845
9532A125534J5744l8562n6286O2879l7044m8356Q5552M2122l005m3529l7126J0350
$$ plain form
9520 1078273 1094066 1121454 1146565 1107037 1098969 1175720 1164567 1111503 1072983 1073247 1071530 1057137
9508 1057137 1031959 1039889 1048799 1033229 974479 990871 963013 993016 1008522 927703 929492 911178
9496 911178 959436 1031957 1028294 1043462 1008134 964751 911389 905604 940951 962854 1020469 1028268
9484 1028268 979095 932545 929382 900418 905180 954811 987865 960255 958752 964183 946059 1007697
9472 1007697 1038704 1022837 1036676 989899 965724 961315 985654 963000 897007 864886 833533 885407
9460 885407 908336 893208 843447 862918 876779 896374 912409 902738 960604 997740 999336 962483
9448 962483 910465 919288 884081 888069 927000 912938 901940 898293 920476 993775 1012718 1027207
9436 1027207 1030972 977633 946643 981593 991748 924867 886569 852816 879479 865720 861386 904312
$$ packed form
9520A078273J5793K7388K5111l9528q068P6751j1153n3064l8520K64j717j4393
9508A057137k5178P930Q910j5570n8750J6392k7858L0003J5506q0819J789j8314
9496I11178M8258P2521l663J5168l5328m3383n3362n785L5347K1903N7615P799
9484A028268m9173m6550l163k8964M762M9631L3054k7610j503N431j8124O1638
9472A007697L1007j5867J3839m6777k4175m409K4339k2654o5993l2121l1353N1874
9460H85407K2929j5128m9761J9471J3861J9595J6035r671N7866L7136J596l6853
9448I62483n2018Q823l5207L988L8931j4062j0998l647K2183P3299J8943J4489
9436A027207L765n3339l0990L4950J0155o6881l8298l3753K6663j3759m334M2926
$$ plain form
9424 904312 934408 882754 889014 921450 938596 855708 820170 832591 869756 862210 844028 857373
9412 857373 899017 863141 820392 808524 837655 872384 929209 874520 804952 747431 739403 755168
9400 755168 794037 849108 798471 703517 748630 785486 790758 809937 772888 751422 770233 747143
9388 747143 732460 692857 729004 788710 834709 843950 860790 764315 752939 736878 722951 707613
9376 707613 722884 689876 707914 769129 784635 752694 668975 658825 600954 558714 578731 614159
9364 614159 614266 643395 660242 726352 778362 763175 688510 639586 655863 667323 689331 706524
9352 706524 710906 704875 662626 600855 605982 646475 697440 675449 653119 690637 713224 720822
9340 720822 733569 628463 588327 580394 583542 572125 644375 708919 719395 748963 755978 709209
$$ packed form
9424I04312L0096n1654O260L2436J7146q2888l5538J2421L7165p546j8182J3345
9412H57373M1644l5876m2749j1868K9131L4729N6825n4689o9568n7521q028J5765
9400G55168L8869N5071n0637r4954M5113L6856N272J9179l7049k1466J8811k3090
9388G47143j4683l9603L6147N9706M5999R241J6840r6475j1376j6061j3927j5338
9376G07613J5271l3008J8038O1215J5506l1941q3719j0150n7871m2240K0017L5428
9364F14159J07K9129J6847O6110N2010j5187p4665m8924J6277J1460K2008J7193
9352G06524M382o031m2249o1771N127M0493N0965k1991k2330L7518K2587P598
9340G20822J2747j05106m0136p933L148j1417P2250O4544J0476K9568P015m6769
$$ plain form
9328 709209 670586 647586 643819 615537 570099 592526 592855 562216 540927 574493 584783 600473
9316 600473 562135 570444 609130 585890 578362 549620 488735 514856 532075 549342 579213 593959
9304 593959 591250 631860 659827 630551 579524 558535 575816 635885 652903 632954 616234 573453
9292 573453 555255 581941 630743 637846 677315 672222 644693 653517 675745 667605 620655 667512
9280 667512 696503 660018 571558 524872 580013 633322 685944 695504 595885 569393 552575 519765
9268 519765 540682 577778 627909 611232 614922 615478 616465 547299 566127 559030 516712 497939 503561
9255 503561 500758 515174 530367 500374 518411 503568 472857 512338 532330 504807 516472 506534
9243 506534 462784 486174 554509 593425 526649 498834 505395 515447 541332 553483 465413 420453
$$ packed form
9328G09209l8623k3000l767k8282m5438K2427L29l0639k1289L3566J0290J5690
9316F00473l8338Q309L8686k3240p528k8742o0885K6121J7219J7267K9871J4746
9304E93959k709M0610K7967k9276n1027k0989J7281O0069J7018j9949j6720m2781
9292E73453j8198K6686M8802P103L9469n093k7529Q824K2228q140m6950M6857
9280F67512K8991l6485q8460m6686N5141N3309N2622R560r9619k6492j6818l2810
9268E19765K0917L7096N0131j6677L690N56R87o9166J8828p097m2318j8773N622
9255E03561k803J4416J5193k9993J8037j4843l0711L9481J9992k7523J1665r938
9243E06534m3750K3390O8335L8916o6776k7815O561J0052K5885J2151q8070m4960
$$ plain form
9231 420453 406588 407378 483391 504146 473234 465982 492876 476891 465469 505612 545320 567752
9219 567752 582549 586443 532338 447050 412538 436925 467714 473574 500539 523275 545286 505117
9207 505117 474552 486050 473827 484941 446617 407675 435974 435511 452759 441513 407835 417754
9195 417754 470877 533054 533851 492310 437989 444501 491438 484712 443108 442377 427859 429060 450336
9182 450336 421873 406001 422736 438266 442462 437263 424015 446324 411726 413973 420957 428097 489216
9169 489216 493829 478018 471018 449145 495974 456762 405594 389056 418273 421472 442961 408478
9157 408478 428728 420142 403762 385024 413129 424771 415233 424787 366376 348641 387137 403057
9145 403057 419999 353240 333119 361219 358937 338753 390682 440794 441408 422609 419834 398548
$$ packed form
9231D20453j3865P90P6013K0755l0912p252K6894j5985j1422M0143L9708K2432
9219E67752J4797L894n4105q5288l4512K4387L0789N860K6965K2736K2011m0169
9207E05117l0565J1498j2223J1114l8324l8942K8299m63J7248j1246l3678R919
9195D17754N3123O2177P97m1541n4321O512M6937o726m1604p31j4518J201K1276
9182D50336k8463j5872J6735J5530M196n199j3248K2309l4598K247O984P140O1119
9169D89216M613j5811p000k1873M6829l9212n1168j6538K9217L199K1489l4483
9157D08478K0250q586j6380j8738K8105J1642r538R554n8411j7735L8496J5920
9145D03057J6942o6759k0121K8100k282k0184N1929N0112O14j8799k775k1286
$$ plain form
9133 398548 372615 380441 307936 303915 350398 382988 378429 356069 348849 418724 453418 425602
9121 425602 419126 313207 306563 344512 378241 404762 427834 377813 339392 353574 318592 309105
9109 309105 333906 352727 291359 314156 340603 344060 349515 380135 404994 395327 331797 302585
9097 302585 331270 389829 422143 395296 365923 339598 376092 363859 368850 385951 364815 340462
9085 340462 359433 365037 357529 377248 365943 387044 414705 437734 408391 354775 296443 289791
9073 289791 282521 233192 243406 315203 385472 425635 334470 234061 277996 353037 364093 299319
9061 299319 318568 307795 320059 281785 295319 312067 289820 268935 344508 339765 292682 224482
9049 224482 237792 314741 387344 360466 332396 292523 275987 265604 287286 315758 311688 352748
$$ packed form
9133C98548k5933P826p2505m021M6483L2590m559k2360p220O9875L4694k7816
9121D25602o476j05919o644L7949L3729K6521K3072n0021l8421J4182l4982r487
9109C09105K4801J8821o1368K2797K6447L457N455L0620K4859r667o3530k9212
9097C02585K8685N8559L2314k6847k9373k6325L6494j2233M991J7101k1136k4353
9085C40462J8971N604p508J9719j1305K1101K7661K3029k9343n3616n8332o652
9073B89791p270m9329J0214P1797P0269M0163r1165j00409M3935P5041J1056o4774
9061B99319J9249j0773J2264l8274J3534J6748k2247k0885P5573m743m7083o8200
9049B24482J3310P6949P2603k6878k8070l9873j6536j0383K1682K8472m070M1060
$$ plain form
9037 352748 364801 357315 320928 314802 326180 278714 272105 248608 222588 222935 245005 216226 266032
9024 266032 304552 343245 320736 287388 275095 211793 182635 178474 207377 170536 168422 196555
9012 196555 237705 268246 268975 256959 240784 230053 202265 186983 139915 183065 231467 282385
9000 282385 310942 315725 250761 205710 190922 192998 225335 258911 252645 250575 245343 234420 219710
8987 219710 184499 163746 142710 162868 174157 239507 324981 326170 312713 331345 291409 231139
8975 231139 271415 271571 219928 169492 217734 225132 218615 209794 169846 159537 172378 166316 138079
8962 138079 139254 110020 151796 174241 197462 225395 236119 263603 198570 160161 251824 337814
8950 337814 265028 144355 198754 217775 181247 205146 182991 218616 244930 216980 248582
$$ packed form
9037C52748J2053p486l6387o126J1378m7466o609k3497k6020L47K2070k8779M9806
9024B66032L8520L8693k2509l3348j2293o3302k9158m161K8903l6841k114K8133
9012A96555M1150L0541P29j2016j6175j0731k7788j5282m7068M3150M8402N0918
9000B82385K8557M783o4964m5051j4788K076L2337L3576o266k070n232j0923j4710
8987B19710l5211k0753k1036K0158J1289O5350Q5474J189j3457J8632l9936o0270
8975B31139M0276J56n1643n0436M8242P398o517q821l9948j0309J2841o062k8237
8962A38079J175k9234M1776K2445K3221K7933J0724K7484o5033l8409R1663Q5990
8950C37814p2786j20673N4399J9021l6528K3899k2155L5625K6314k7950L1602
$$ plain form
8939 248582 297538 322614 321934 274929 169846 122033 98914 143500 177735 208509 184563 133614
8927 133614 159004 179549 181137 185812 217028 216925 256794 258799 207199 198170 214456 167444 156819
8914 156819 162377 128785 97994 62791 67259 99358 169178 145197 171358 166899 174347 142423
$$ packed form
8939B48582M8956K5076o80m7005j05083m7813k3119M4586L4235L0774k3946n0949
8927A33614K5390K0545J588M675L1216j03L9869K005n1600r029J6286m7012j0625
8914A56819N558l3592l0791l5203M468L2099O9820k3981K6161m459P448l1924
$$ [...]
##END NTUPLES=NMR SPECTRUM
##END=
