##TITLE=Analysis number 312691
Compound Code cc 05701
Project Code adrs
Chemist Name synnovation
##JCAMPDX= 6.0         $$ Bruker NMR JCAMP-DX V2.0
##DATA TYPE= NMR SPECTRUM
##DATA CLASS= NTUPLES
##ORIGIN= Bruker BioSpin GmbH
##OWNER= NMR
$$ XWIN-NMR		Version 3.5
$$ Thu Aug 11 09:55:35 2005 GMT Daylight Time (UT+1h)  MAYBRIDGE\NMR@NMR_250MHZ
##.OBSERVE FREQUENCY= 250.131544655141
##.OBSERVE NUCLEUS= ^1H
##.ACQUISITION MODE= SIMULTANEOUS (DQD)
##.ACQUISITION SCHEME= undefined
##.AVERAGES= 16
##.DIGITISER RES= 18
##SPECTROMETER/DATA SYSTEM= dpx250
##.PULSE SEQUENCE= zg30
##.SOLVENT NAME= DMSO
##.SHIFT REFERENCE= (INTERNAL, DMSO, 0, 16.522)
##AUDIT TRAIL= $$ (NUMBER, WHEN, WHO, WHERE, WHAT)
$$ ##TITLE= Audit trail, XWIN-NMR		Version 3.5
$$ ##JCAMPDX= 5.01
$$ ##ORIGIN= Bruker BioSpin GmbH
$$ ##OWNER= NMR
$$ C:\u/data/dgb/nmr/ADRS/7600/pdata/1/auditp.txt
$$ ##AUDIT TRAIL=  $$ (NUMBER, WHEN, WHO, WHERE, WHAT)
(   1,<2005-08-11 09:55:16.42 +100>,<MAYBRIDGE\NMR>,<NMR_250MHZ>,
      <created by zg, POWCHK disabled, PULCHK disabled
       configuration hash MD5:
       62 19 C7 07 E1 42 D1 B7 37 6C 3D D0 77 39 F9 E6
       data hash MD5: 64K
       74 48 6E FF 27 7D 6A 04 7C 29 DD B3 D5 24 3D 60>)
(   2,<2005-08-11 09:55:27.42 +100>,<MAYBRIDGE\NMR>,<NMR_250MHZ>,
      <Start of raw data processing
       ef LB = 0.3 FT_mod = 6 PKNL = 1 SI = 32K 
       data hash MD5: 32K
       58 32 CD 00 99 26 B6 2A 22 0D 15 1D EF D9 4C DA>)
(   3,<2005-08-11 09:55:29.18 +100>,<MAYBRIDGE\NMR>,<NMR_250MHZ>,
      <apk 
       data hash MD5: 32K
       52 F7 41 E7 5C E9 30 CA A8 4F FF EC 88 6D 02 7F>)
(   4,<2005-08-11 09:55:30.03 +100>,<MAYBRIDGE\NMR>,<NMR_250MHZ>,
      <abs ABSG = 5 
       data hash MD5: 32K
       F9 F0 51 12 BD B5 5A 82 35 A5 88 00 D7 A0 85 E2>)
$$ ##END=
$$ 
$$ hash MD5
$$ 04 3E 52 AA B7 25 AC FF 2C 4C D1 D0 A9 E0 AD 95
##$RELAX= 
##$RELAX= 
##$RELAX= 
##$RELAX= 
##$RELAX= 
##$RELAX= 
##$RELAX= 
$$ Bruker specific parameters
$$ --------------------------
##$DU= <C:\u>
##$EXPNO= 7600
##$NAME= <ADRS>
##$PROCNO= 1
##$TYPE= <nmr>
##$USER= <dgb>
##$AMP= (0..31)
100 100 100 100 100 100 100 100 100 100 100 100 100 100 100 100 100 100 
100 100 100 100 100 100 100 100 100 100 100 100 100 100 
##$AQSEQ= 0
##$AQ_mod= 3
##$AUNM= <au_zg>
##$AUTOPOS= <9 >
##$BF1= 250.13
##$BF2= 250.13
##$BF3= 250.13
##$BF4= 250.13
##$BF5= 500.13
##$BF6= 500.13
##$BF7= 500.13
##$BF8= 500.13
##$BYTORDA= 1
##$CFDGTYP= 0
##$CFRGTYP= 5
##$CHEMSTR= <none>
##$CNST= (0..31)
1 1 145 1 1 1 1 1 1 1 1 1 1 1 1 1 1 1 1 1 1 1 1 1 1 1 1 1 1 1 1 1 
##$CPDPRG= <>
##$CPDPRG1= <>
##$CPDPRG2= <>
##$CPDPRG3= <>
##$CPDPRG4= <mlev>
##$CPDPRG5= <mlev>
##$CPDPRG6= <mlev>
##$CPDPRG7= <mlev>
##$CPDPRG8= <mlev>
##$CPDPRGB= <>
##$CPDPRGT= <>
##$D= (0..31)
0 1 0 0 0 0 0 0 0 0.06 0 0 0 0 0 0 0.0002 0 0 0 0 0 0 0 0 0 0 0 0 0 0 
0 
##$DATE= 1123750515
##$DBL= (0..7)
120 120 120 120 120 120 120 120 
##$DBP= (0..7)
150 150 150 150 150 150 150 150 
##$DBP07= 0
##$DBPNAM0= <>
##$DBPNAM1= <>
##$DBPNAM2= <>
$$ [...]
##$SUBNAM7= <"">
##$SUBNAM8= <"">
##$SUBNAM9= <"">
##$SW= 20.6930455092707
##$SWIBOX= (0..15)
0 0 3 0 0 0 0 0 0 0 0 0 0 0 0 0 
##$SW_h= 5175.983436853
##$TD= 65536
##$TD0= 1
##$TE= 295.16
##$TE2= 300
##$TE3= 300
##$TEG= 300
##$TL= (0..7)
0 120 120 120 120 120 120 120 
##$TP= (0..7)
150 150 150 150 150 150 150 150 
##$TP07= 0
##$TPNAME0= <>
##$TPNAME1= <>
##$TPNAME2= <>
##$TPNAME3= <>
##$TPNAME4= <>
##$TPNAME5= <>
##$TPNAME6= <>
##$TPNAME7= <>
##$TPOAL= (0..7)
0.5 0.5 0.5 0.5 0.5 0.5 0.5 0.5 
##$TPOFFS= (0..7)
0 0 0 0 0 0 0 0 
##$TUNHIN= 0
##$TUNHOUT= 0
##$TUNXOUT= 0
##$USERA1= <user>
##$USERA2= <user>
##$USERA3= <user>
##$USERA4= <user>
##$USERA5= <user>
##$V9= 5
##$VALIST= <valist>
##$VCLIST= <CCCCCCCCCCCCCCC>
##$VD= 0
##$VDLIST= <DDDDDDDDDDDDDDD>
##$VPLIST= <PPPPPPPPPPPPPPP>
##$VTLIST= <TTTTTTTTTTTTTTT>
##$WBST= 1024
##$WBSW= 4
##$XGAIN= (0..3)
0 0 0 0 
##$XL= 0
##$YL= 0
##$YMAX_a= 442823
##$YMIN_a= -413090
##$ZGOPTNS= <>
##$ZL1= 120
##$ZL2= 120
##$ZL3= 120
##$ZL4= 120
##$ABSF1= 16.522
##$ABSF2= -4.171173
##$ABSG= 5
##$ABSL= 3
##$ALPHA= 0
##$AQORDER= 0
##$ASSFAC= 0
##$ASSFACI= 0
##$ASSFACX= 0
##$ASSWID= 0
##$AUNMP= <proc_1d>
##$AZFE= 0.1
##$AZFW= 0.1
##$BCFW= 0
##$BC_mod= 0
##$BYTORDP= 0
##$COROFFS= 0
##$CY= 12.5
##$DATMOD= 1
##$DC= 0
##$DFILT= <>
##$DTYPP= 0
##$F1P= 14.0000005364418
##$F2P= -0.99999901652339
##$FCOR= 0.5
##$FTSIZE= 32768
##$FT_mod= 6
##$GAMMA= 0
##$GB= 0
##$INTBC= 1
##$INTSCL= 1
##$ISEN= 128
##$LB= 0.3
##$LEV0= 0
##$LPBIN= 0
##$MAXI= 10000
##$MC2= 0
##$MEAN= 0
##$ME_mod= 0
##$MI= 0
##$NCOEF= 0
##$NC_proc= -2
##$NLEV= 6
##$NOISF1= 0
##$NOISF2= 0
##$NSP= 0
##$NTH_PI= 0
##$NZP= 0
##$OFFSET= 16.522
##$PC= 1
##$PHC0= -91.96999
##$PHC1= 6.144118
##$PH_mod= 1
##$PKNL= yes
##$PPARMOD= 0
##$PSCAL= 4
##$PSIGN= 0
##$REVERSE= no
##$SF= 250.13
##$SI= 32768
##$SIGF1= 0
##$SIGF2= 0
##$SINO= 400
##$SIOLD= 32768
##$SREGLST= <1H.DMSO>
##$SSB= 0
##$STSI= 32768
##$STSR= 0
##$SW_p= 5175.98343685301
##$SYMM= 0
##$S_DEV= 0
##$TDeff= 65536
##$TDoff= 0
##$TI= <Analysis number 999999
Compound Code 99
Book Reference 9
Project Code 9>
##$TILT= no
##$TM1= 0
##$TM2= 0
##$TOPLEV= 0
##$USERP1= <user>
##$USERP2= <user>
##$USERP3= <user>
##$USERP4= <user>
##$USERP5= <user>
##$WDW= 1
##$XDIM= 32768
##$YMAX_p= 431403856
##$YMIN_p= -57754
$$ End of Bruker specific parameters
$$ ---------------------------------
##NTUPLES= NMR SPECTRUM
##VAR_NAME=  FREQUENCY,     SPECTRUM/REAL,   SPECTRUM/IMAG
##SYMBOL=    X,             R,               I
##VAR_TYPE=  INDEPENDENT,   DEPENDENT,       DEPENDENT
##VAR_FORM=  AFFN,          ASDF,            ASDF
##VAR_DIM=   32768,         32768,           32768
##UNITS=     HZ,            ARBITRARY UNITS, ARBITRARY UNITS
##FACTOR=    0.157963299565203, 1,           1
##FIRST=     4132.6476996994, 0,             0
##LAST=      -1043.33573715361, 0,           0
##MIN=       -1043.33573715361, -57754,      0
##MAX=       4132.6476996994, 431403856,     0
$$ Real data points
##PAGE= N=1
##DATA TABLE= (X++(R..R)), XYDATA
$$ [...]
21905 -4671 -11519 -6533 2764 18026 30027 21550 26471 25610 21 -20307 -20998 -27133 -30804 -11959
21891 -11959 3257 -5946 -4036 6538 9543 1721 4670 16756 20661 22821 8555 -15514 -31607
21878 -31607 -25107 -22317 -24749 -13203 -9690 -15041 -9090 -88 -614 -7541 -5276 6082 3103 -2288
21864 -2288 8258 12302 10133 4269 -1368 9329 28159 33299 28275 12339 11847 12570 10891 7864
21850 7864 6814 7378 -1347 -10296 -5845 2592 4250 -138 -5240 -5353 -12251 -14287 -3200 -333 -1493
21835 -1493 -1428 -3483 -4587 -16825 -19515 -28903 -26236 -11682 -1778 -15852 -19377 -10115 -1699 7814
21821 7814 16128 8298 3461 3245 542 4827 5483 -1972 -5656 -5608 -16711 -21847 -25784 -15180 -10458
21806 -10458 -3797 1754 -4360 9562 22447 9509 -838 -12731 -15890 -22372 -36785 -34133 -24055
21793 -24055 -21917 -24035 -27937 -18847 -26121 -22704 -11006 -2328 4494 8415 1047 -5945 -2141 -3039
21779 -3039 -15316 -27291 -19994 -22732 -13153 -15996 -20344 -4114 7093 22828 20524 9956 11469
21766 11469 1782 5951 -684 -7604 14005 11663 -328 -1657 -9314 -15878 -27945 -25094 -14851
21753 -14851 -18881 -5187 -4436 -1901 1677 -2007 7594 6958 3388 -8841 -10084 -15862 -3956 2767
21739 2767 -17933 -31350 -26737 -17271 -12314 -6132 6420 5454 2769 3262 10997 7158 -3170 2272
21725 2272 -849 10822 8404 8793 12310 29086 20038 9503 -653 -4055 -1425 8134 3277 -5187
21711 -5187 -9191 -11977 -3219 6153 -3869 -13218 -4871 -353 -115 -13249 -22231 -13847 -11753 -6496
21697 -6496 349 -1005 6781 3673 764 -5994 -9971 -12300 -24437 -25599 -5852 9532 9565 -4058
21683 -4058 -10384 -12262 -21706 -26510 -26434 -15463 -13058 -17518 -4542 8204 8341 1721 -5473 -11899 -10942
21668 -10942 -9919 -16884 -17941 -14323 -6443 -5636 -2135 -12462 -455 5452 -762 -2385 4621 14177
21654 14177 9129 19392 23716 5220 4308 18807 17789 18844 20058 14588 18798 13278 15290 4899
21640 4899 -8809 -2498 14543 13152 5836 5045 16434 15810 14633 -4408 -2160 17979 22239 10752
21626 10752 -6847 -15235 -21749 -13922 -11446 -10005 -8725 958 4594 -157 7264 1077 8044 1229
21612 1229 -14171 -15094 1244 6497 11323 4842 4354 6822 7213 -39 -1054 -5634 -12553 -21307 -12962
21597 -12962 -1154 3172 6801 6643 -2519 -15611 -13597 -1297 3974 2329 -587 -454 2061 1880
21583 1880 2141 -2743 4267 18488 27047 29033 19172 7679 9534 10251 17971 20493 24448 12211
21569 12211 -15477 -24954 -12623 -7937 6025 14392 11078 8118 5475 658 2874 95 7575 14435
21555 14435 15306 18805 20461 3711 16148 25321 18438 -762 94 7003 6936 19436 21852 26702
21541 26702 25822 20671 11403 8651 16065 10702 -1997 -1432 9963 15820 22989 23666 17128 4275
21527 4275 5889 -2849 -4683 -55 19177 33059 29667 25173 23385 21539 14148 3911 -1501 -7548
21513 -7548 -7110 -6424 -2551 1417 6407 -782 -4288 -12623 -20115 -9847 3455 8995 -2465 931
21499 931 -9287 1241 16590 27431 9779 -13971 -17862 -14883 -9119 -618 4079 15985 8538
21486 8538 -6126 -8618 -8912 -10166 -11442 -16389 -14135 -13156 -13422 -11906 -7873 -4598 2396 1895 -8742
21471 -8742 7318 22797 6177 10020 20143 18486 11972 8504 -9454 -19694 -15370 -11646 -5660
21458 -5660 -3907 3013 -15339 -15763 -6994 -5548 -44 -6293 -11335 -8804 2591 -11344 -20656 -28730
21444 -28730 -18031 -19023 -24599 -4714 -23134 -18942 -13078 -23494 -8430 13321 11474 -4520 -9061
21431 -9061 10082 20520 14215 14079 15189 8736 -5394 -2035 17529 9509 10354 18825 20824 12860
21417 12860 18863 17654 17418 19542 24908 15229 9049 12626 -2070 -807 6099 4829 1118 -546
21403 -546 -21698 -27408 -11211 -9922 724 2095 -4181 1859 -397 -21056 -27677 -17607 -7535
21390 -7535 -6562 -47 18930 16679 20480 26759 17603 6565 -11502 -14815 -19848 -26767 -35898 -21481
21376 -21481 -15772 -26854 -17697 5346 7136 2067 -7431 -6814 -5619 -474 5948 7927 -99 -9018
21362 -9018 -12889 -15055 -16602 -11134 -3167 -17815 -35010 -31710 -18609 -12595 -9849 -12311 -17948 -37688
21348 -37688 -52523 -28701 -352 8688 6593 6070 2570 6318 4497 10981 -5556 -9526 4209
21335 4209 11907 4618 -6608 -16312 -30533 -36843 -25274 -13096 -4436 -5617 2684 -1281 824 -10361
21321 -10361 -17929 -30046 -43029 -41537 -36751 -29884 -6636 2027 -4638 3060 2569 -6068 6016 17521
21307 17521 10077 -3414 -11129 -15573 -14769 108 3363 3865 -6661 -13125 -18641 -18296 -17967 -19894 -19057
21292 -19057 -7212 -7069 -5333 -11157 -10381 5930 647 3332 8926 -1746 -7832 10328 10607 14431
21278 14431 7945 -1632 -5561 1624 -5231 -13604 -22071 -23114 -19716 -3268 -1277 4094 18930 19952
21264 19952 22668 12720 14297 30428 34710 26388 33364 35313 15668 5816 -820 941 9627 1547
21250 1547 -12960 -26958 -22278 -8137 -8592 -10063 -9580 -9313 660 13438 23364 20083 15492 14363
21236 14363 16834 12462 14311 14392 6424 -11042 -18486 -8964 -11939 -23268 -22868 -18182 -13333 -19391 -12709
21221 -12709 -3320 5737 11136 22147 13162 -8982 -26249 -25098 -4170 -4488 -11523 -7098 5737
21208 5737 -358 -9546 -15956 -13323 -17029 -4283 -3694 -1862 7009 11018 7099 1151 -1379 9915
21194 9915 16740 11074 13114 12893 19028 12803 5761 5364 -8994 -12223 -14137 -14787 -23999 -24423 -25852
21179 -25852 -24339 -7808 -1999 2733 12000 11046 6427 8995 13960 20804 3822 -15408 -9431 -8427
21165 -8427 -9567 4720 5215 -8932 -3313 1115 5915 10680 16881 5539 12416 6382 11877 13315
21151 13315 4670 464 2279 -1328 -7689 -7870 -22013 -20244 -20910 -14768 4785 7625 -1 9730
21137 9730 6309 -231 1437 6120 17840 7038 -7328 -10300 -5997 684 6414 13849 12740 17839
21123 17839 6826 11657 14497 10862 18747 13321 7276 -1777 7069 17391 8063 -9704 -12954 -16425
21109 -16425 -17942 -10808 -10764 -7825 -2020 21159 20374 26274 28147 12160 2376 4593 7965 1807 -2714
21094 -2714 -11750 -3524 13502 6241 -536 6001 -8121 -13277 -631 11764 15724 3840 2577
21081 2577 12643 5197 2994 -4120 -25054 -25312 -23104 -23544 -31870 -19349 -10019 -11960 -3687 932
21067 932 10245 1707 -4338 -1646 -1317 -7906 -19922 -15439 -8210 -18211 -6518 -8364 -10417 -7439
21053 -7439 -1165 6810 15058 19749 21249 14594 23327 20426 9278 4970 9421 26229 23462 13668
21039 13668 13245 11952 7313 2118 -13513 -10847 -10582 -16512 -13733 -11520 -7186 -4761 -3497 1321 16
21024 16 15935 17203 3081 -7781 -14727 -17486 -18097 -13813 -10056 -4405 5986 5582 7654 10310 17967
21009 17967 12932 756 -3627 -4800 5894 10838 1056 -12403 -12144 -6095 1585 -3295 -14236 -10530
20995 -10530 1745 -4727 -12559 -2899 -974 -15859 -34862 -40856 -31801 -20243 3136 6295 -9417
20982 -9417 -14052 -22362 -22964 -33864 -32775 -26431 -16430 -22477 -24672 -24170 -18276 -11333 -11475 1230 -199
20967 -199 -9545 -16938 -28256 -12793 -680 1684 -2647 -17053 -8927 4639 -3394 -6683 -19776
20954 -19776 -18053 -11003 -823 6784 6266 7262 2600 10272 10813 13713 -4919 -13407 -22566 -8788
20940 -8788 1001 -8782 -22582 -15738 -8427 -8538 -2775 -3766 -7133 2828 7025 -8571 -21590 -21073 -1812
20925 -1812 870 -9797 -15593 -26211 -21994 -7432 13803 14763 5823 17554 28041 31124 12814
20912 12814 3083 -5308 -3518 -2027 -2228 -9258 -15833 -21483 -23153 -20053 -23418 -20941 -20549 -32313 -31490
20897 -31490 -16997 -9602 -7128 -13477 -8301 -11590 -6503 -4917 4228 10373 1198 14495 6398 4958
20883 4958 9800 -818 -4106 537 1487 571 13645 31680 34974 18276 -4217 -18287 -32197
20870 -32197 -31572 -27105 -20957 -12334 -11752 -17390 -17534 -6030 -7173 -2983 2243 1261 6108 8019 2083
20855 2083 5171 3567 -555 13239 24136 8313 -4133 -1435 -6708 -13477 -10197 3407 -1278
20842 -1278 -7005 -7876 -2774 189 -13103 -11599 -12859 -28673 -18244 -12998 -9749 -9950 -11525 -15814
20828 -15814 -9422 -21740 -10908 978 -9858 -25321 -27389 -21808 -27426 -25519 -13023 9163 15262
20815 15262 3671 1975 5302 -1616 807 -4516 -84 8509 -547 -8556 -10060 -12359 -15991 -435
20801 -435 -4730 -11483 -9402 -2795 1475 1920 -163 -3428 -7909 -9263 -9452 243 -4616 -14390 -11151
20786 -11151 -12981 -24947 -14495 -10075 -8611 -10806 -8391 -10844 -7767 -4792 2589 1244 -4956 5053
20772 5053 11993 21055 15019 15191 14708 19728 6500 -12144 -17964 -16387 -391 17782 13345 -3973
20758 -3973 -10336 -13912 -22889 -31875 -16157 -12981 -8018 2572 12839 17137 9152 975 1167 -14432
20744 -14432 -33520 -26663 -15828 -16822 -28721 -25239 -25115 -13327 32 9061 12978 2610 -10711
20731 -10711 -23098 -19467 -11737 -11418 -6611 -2601 -485 -10349 -20686 -22501 -19357 -6704 -7271 1568
20717 1568 -191 -1487 -3205 2148 -944 9831 26369 17382 7205 2148 -3474 -4019 3713 11002
20703 11002 6848 1673 4496 8526 2442 -2902 390 5722 6598 808 -97 -597 6741 24506 23626
20688 23626 9180 1303 6257 5210 -1452 -2413 33 -2497 4486 4544 4306 11385 15026 21453 15311
20673 15311 5790 -459 -4147 4600 -2447 -617 -1728 -8205 -3794 1248 1240 2918 8904 6240 -2444
20658 -2444 5512 7441 1687 -4108 -5802 -8924 -1466 10730 13565 8302 945 2848 11628 5263
20644 5263 -5718 -7248 -1725 14436 8659 2943 7101 -384 7339 -3191 -5558 713 5888 6914
20630 6914 -690 -3083 -5924 843 6812 -1563 -2263 -7722 36 650 3565 6415 -1144 -17648 -15260
20615 -15260 -4601 -8491 -14731 -17651 -12813 -1726 -1058 -6740 -21095 -17302 -8842 -5921 -7326 -11610
20601 -11610 -5733 2257 6064 -3913 -5101 -1239 811 10109 22326 13585 11518 2339 -9933 -9109
20587 -9109 158 -6996 -2779 -380 -7702 -11075 1073 -2068 -5252 -627 -9349 -11812 -9786 588
20573 588 5571 13671 9124 -3513 -13636 -20964 -18014 -10726 -21377 -28136 -33264 -12360 -8396 -6830
20559 -6830 -5274 -6273 -27654 -17213 -486 8223 10409 19651 11383 5512 5898 -17641 -26810 -27256
20545 -27256 -22994 -14587 -11407 14643 33117 30905 18564 4180 -10002 -9298 3761 -7491 -20519
20532 -20519 -7701 6560 2948 4735 1870 -11743 -8039 -423 688 -11273 -16779 -2487 13930
20519 13930 6509 2502 -2545 3998 -7358 -21759 -28401 -21082 -9744 -2983 -4550 -24992 -33950
20506 -33950 -17296 -14638 -13274 -2409 14028 26533 21377 26060 16848 17790 20601 20155 16735 2099
20492 2099 -6493 442 11773 14756 10273 24009 26945 18613 15782 16577 5751 2272 2006 4164
20478 4164 -5674 -12610 1888 14357 14007 -762 -3023 -15628 -16708 -17193 -21305 -20537 -23685 -14839
20464 -14839 -9546 -7828 955 8082 -3512 -12227 -16163 -10028 -8226 -8221 -13315 -20362 -16534 -9318 -6257
20449 -6257 -12843 -2529 9895 2250 -2019 -3621 6126 16640 16147 11421 7164 -4354 4575 6928
20435 6928 -922 -709 2215 -1916 -2797 -5549 4015 -4513 -2112 3896 3849 12586 17396 7643 -8810
20420 -8810 -12608 -2754 -770 1343 1384 9557 13117 1340 -443 10446 -4871 -22099 -8024 -4185
20406 -4185 5708 10206 10083 -980 5117 10285 10035 17669 8912 9378 5399 -4507 -3108 -4845 -4215
20391 -4215 6998 7374 11033 8723 11823 19132 21878 17460 7509 5575 4450 7367 9282 -2374
20377 -2374 -14252 7240 22349 20059 12221 -4175 694 13324 7398 18927 14975 12781 16894
20364 16894 18460 13761 16455 25143 25306 48158 73484 115436 155106 218245 292118 395790 541283
20351 541283 710867 796264 746300 624871 497886 387859 293871 228806 184389 145249 110690
20340 110690 100386 87498 69741 49073 32919 30166 30748 38654 33939 14182 840 -2407 12621
20327 12621 29635 23484 17441 17632 10786 12938 6648 5461 24399 22898 5315 4604 2705 4416
20313 4416 8728 5817 6735 8405 7587 -3489 -3706 6166 14881 19153 20811 22419 17988 28615 21518
20298 21518 -1144 -8145 -997 5325 8406 10444 921 -5310 -6460 10070 28329 24857 5770
20285 5770 5493 11419 28251 32423 35400 21268 7425 -1214 -3989 7078 -6926 -9842 1232
20272 1232 7620 10766 6620 6163 4119 1444 8293 19426 24083 12056 1560 6235 15090 15042 24872
20257 24872 31337 27171 22019 23976 19046 21951 19868 24272 21045 18374 18477 10130 -7649 -3485
20243 -3485 12878 16792 24137 18048 4169 -10344 -19155 -21757 -21933 -3579 -3581 -10150 -9660 -6379 -7380
20228 -7380 -6819 -7316 -19230 -14801 -8003 -5797 1209 11992 11015 5959 2599 15058 11443 6254 4836
20213 4836 -4767 -793 20812 28081 32214 19479 10683 3790 7554 10586 4855 8329 9008 7481
20199 7481 11702 19183 26353 24514 22123 23674 31703 28269 21897 27601 29990 26086 33519 13991
20185 13991 14568 10866 3637 7982 1714 -8457 -6488 8244 13776 11564 5604 -3501 -15863 -17017
20171 -17017 -5306 10516 6819 7144 10723 21184 23437 26707 9731 5121 9489 17430 25629 7957
20157 7957 -6630 2242 9624 23430 16775 14132 16480 4610 -6018 5053 19638 19915 7161
20144 7161 -2929 -1251 12294 1547 9558 15201 16042 11627 8861 5621 -916 -539 -297 -4108 6321
20129 6321 4297 -2055 -1823 11543 17217 -2043 -19104 -8751 -7009 4815 -1855 6401 5340 7068
20115 7068 7421 1650 -849 307 -7143 11919 19082 17404 21951 21397 22227 5787 -2932 -6961 -6475
20100 -6475 -19925 -39365 -30621 -6291 20340 29564 31667 42370 26352 8847 8914 4390 9159
20087 9159 7735 -1696 8174 10204 7958 18122 15560 9510 5804 -2968 12405 7764 4881 26047
20073 26047 31545 29728 15281 5947 13942 9157 8866 19171 22337 30647 36150 22429 4992 12219
20059 12219 29271 41694 40656 18940 16722 6740 -6016 1047 6239 20661 35782 34383 23466
20046 23466 12299 11044 6212 31338 37326 16759 15469 26537 32286 21831 26262 17344 14150
20033 14150 399 -2126 3612 -6611 -10641 -190 11453 10151 6880 -8269 -12580 -16524 -11611
20020 -11611 -7855 -1741 -1869 -1954 13807 18624 14076 7624 -2692 2329 14822 8827 5414 -7964
20006 -7964 -36068 -41571 -11706 17078 42689 58242 81333 116310 130891 155402 147650 132022
19994 132022 106446 96437 85701 59009 41840 34226 1772 -13737 -9056 -7820 -4849 -3241
19982 -3241 -4729 7395 13868 23203 17705 6135 18129 42629 39696 34496 31897 21301 27883
19969 27883 34133 24686 23820 29375 41979 50826 45080 47192 37053 28393 32922 31051 37942 33670
19955 33670 23917 30231 38699 39780 44397 44480 31505 19022 21431 16456 13489 18551 16944 -2291
19941 -2291 272 9188 14234 33768 36039 43507 44122 44464 28601 18616 13930 17117 18185 7988
19927 7988 9665 22758 32966 23925 27639 43232 38206 32995 28771 36463 39619 44176 54328 53498
19913 53498 52473 29231 30184 35525 38016 43581 57901 47978 50741 63002 68070 57422 33378
19900 33378 35030 53219 61227 72270 89186 81746 87913 73332 70861 65187 42538 26964 37202
19887 37202 45880 45065 44088 59107 62955 64663 69862 86630 84431 60006 33486 28364 32764 52973
19873 52973 106176 222934 371648 485183 495160 416544 337455 237432 87397 -19614 -51300
19862 -51300 -37748 -640 38102 59502 66010 67722 81298 69034 74380 55595 48757 59663
19850 59663 63692 54186 45006 60930 63328 60458 54220 64018 57627 53996 44840 39541 42586 43910
19836 43910 44250 61436 83044 86914 98176 95467 77145 74990 78637 97140 106013 116186 126962
19823 126962 131902 124748 117359 114227 117349 108256 101443 112035 131704 134157 117756 106590 110789
19810 110789 120578 129763 135778 142505 152287 184459 196457 197600 201533 212328 224340 221291 208578
19797 208578 207530 195309 206837 205723 198564 207751 231694 251607 266914 294875 313376 334257
19785 334257 349763 354283 385175 413283 445672 493371 528173 548654 552745 576876 606067 645146
19773 645146 672619 724135 803366 894702 1006719 1161353 1346719 1605799 1924595 2194794
19763 2194794 2298980 2310916 2326877 2397159 2543493 2801093 3212186 3806757 4455501 5021161
19753 5021161 5610403 6392718 7500839 9112121 11482226 15047655 20559788 29159341
19745 29159341 42881538 65529643 101859354 143961820 160251546 141969752 112608386
19738 112608386 84337199 60134864 42432663 30544431 22645112 17263072 13455958
19731 13455958 10689162 8638354 7136476 6070458 5356426 4915967 4539007 4066565 3586188
19722 3586188 3181862 2874220 2697419 2645910 2593310 2415084 2136054 1858463 1626128 1425222
19712 1425222 1272069 1155433 1073329 991544 922628 855715 794942 737400 678890 620318 588269
19701 588269 560885 542612 527974 520010 527661 498704 469835 435172 417138 400651 390582 380657
19689 380657 362675 351413 338687 315524 295447 289518 275900 260789 253199 250738 236675 220817
19677 220817 213834 214243 216118 226389 227104 207300 183411 176887 168976 164883 163228 151665 127852
19664 127852 133949 133254 124954 118282 112332 109983 124588 122257 117511 107095 97666 95284 81871 85490
19650 85490 91292 96118 112097 119226 114586 116783 108073 95253 82919 86986 86831 82132 81674 85894
19636 85894 84319 74568 71297 83411 102753 97856 78975 60279 68562 77611 72467 58707 51666
19623 51666 64163 73480 70743 92107 148872 198114 241910 295424 322894 254101 149526 71884
19611 71884 9388 -16041 -2695 28530 57301 65720 67154 44979 42785 55376 45852 13774
19599 13774 7605 17503 18010 20970 24903 19102 5670 1530 6863 15479 21734 14233 -888 -14042
19585 -14042 -7668 -12545 -4031 12819 9174 6237 3000 1151 13274 11236 6706 15122 12525 12160
19571 12160 10774 13400 17525 6755 3952 4829 17705 12576 20954 29075 30537 30849 16322 13642
19557 13642 24418 23129 32607 30605 21755 32510 32547 27447 18793 2945 -5377 -3380 -4304 -11792
19543 -11792 -19060 -12955 -5118 -7719 3625 14590 18634 11259 -3271 -18278 -6793 -8253 -12020
19530 -12020 -8391 -10226 -11751 -2792 4947 -7536 -8102 -1041 1647 2133 8717 12978 16506 13243 8102
19515 8102 -3438 -305 3746 -7694 -8072 -1474 204 16376 14457 10048 13171 13920 12357 6435
19501 6435 10869 9280 19635 24457 28094 28863 24930 22397 29194 21269 9248 12036 19877 24195
19487 24195 26790 9810 6731 17147 19266 23085 31893 30721 19007 6089 4450 7779 5899
19474 5899 -6859 2234 11631 3604 -7372 -11934 -816 1886 4620 3591 10395 6395 -3497 -1014
19460 -1014 13689 9592 -6856 -7717 11889 10055 3938 867 -789 -5830 356 805 637 -309 9868
19445 9868 18110 1005 -2934 -4593 -13143 -14525 2473 14563 22730 18539 21098 26999 38178 57763
19431 57763 56342 58840 49470 36331 24742 6679 14399 31830 30349 15149 9219 5789 3698
19418 3698 3481 3592 4326 2697 9001 13670 3202 -1524 -8132 -1970 -8219 -4769 -5335 -6628 -11463
19403 -11463 -1301 6268 8033 12975 17703 11106 -11019 882 406 -6079 3718 3261 -2029 5005
19389 5005 8132 4766 7418 3118 -13 6030 -608 -11183 -1838 742 758 -9016 -13821 -28258 -29806
19374 -29806 -16653 -7203 -16253 -27659 -4731 -4399 -10008 -5693 -16946 -15134 -505 -4444 -7171
19361 -7171 -3029 4977 -6301 7627 10312 -1603 -4840 -3941 11643 9450 1658 395 -8520 -16299
19347 -16299 -6315 1622 6414 11642 3532 12978 5275 -5055 -9972 -1965 -225 -4106 -6063 6179
19333 6179 6427 -4047 -4492 -19032 -8525 -17038 -17740 -13527 -13601 -19181 -15497 -2784 10492 11324 9823
19318 9823 12273 -801 438 -3011 -291 -5412 4010 -6829 -23289 -23449 -4014 4946 9226 9897
19304 9897 10140 12604 2022 2616 -6092 -19905 -17378 -14419 5952 18548 8381 33226 29903 15516
19290 15516 10254 14357 15262 9431 13699 14645 10825 -10250 -20683 -4999 -15509 -25674 -20404 -11873
19276 -11873 -24038 -24233 -14690 -935 -2274 6852 -5048 -23313 -19982 -14289 -15676 -8665 -5554 11694
19262 11694 10667 -1923 -5351 3217 5631 -10000 -9528 1409 2576 3980 2922 -3675 -19037 -31330
19248 -31330 -39844 -41513 -32852 -11954 -12213 -29787 -26040 -10518 -8515 509 14236 9901 70 5940
19234 5940 1407 3144 13001 11339 2838 -4543 -5347 3015 18175 10927 14621 12058 16778 16586 10070
19219 10070 -6565 -13149 -6955 4808 12247 -1188 -7113 -4688 -8127 -10297 2815 -8342 -5042
19206 -5042 -9106 113 -6560 -14387 -28731 -25264 -12404 -1200 -9448 -9934 -4033 5948 4614 -12140
19192 -12140 -3966 -1011 -4764 -10535 -14814 -13743 -11821 -13052 -788 9705 4998 -9482 -2970 -3533
19178 -3533 -3671 -4118 -2057 -8755 -13508 -12043 4112 5627 5998 2215 -1982 -12998 -1203 5744 12680
19163 12680 24777 14338 5356 2125 -7103 -14472 -13591 -5227 -2578 -6762 7570 8521 8208 11578
19149 11578 19612 18527 10872 10962 14998 16080 17463 15505 23129 37659 35157 25059 34532 41693
19135 41693 42024 45442 72614 102289 125581 147095 209172 304125 450845 620953 764871 784793
19123 784793 688983 571171 435672 326274 243274 180697 140190 114918 105338 85983 66958
19112 66958 44550 47556 51940 53919 44334 47257 38581 44190 46803 48919 56803 57819 43034 21518
19098 21518 14012 6897 1099 7976 -1234 -8627 -14765 -20731 -22589 -19844 -26997 -33912 -9692 -2508
19084 -2508 -400 5236 15559 33638 32167 18726 9414 14685 20176 21459 23309 10665 11527 25837
19070 25837 29475 6273 -1324 -1224 -2992 -6200 -3600 -10572 -17610 -13628 -16475 -3167 10983 6441
19056 6441 9204 -547 -4124 -1628 7296 3957 3617 15974 11390 -2947 2233 7985 7912 -795 -9562
19041 -9562 -15888 -12289 3236 9979 12333 16864 11902 12770 8219 4147 4410 7590 10823 16604 9922
19026 9922 6694 8978 2569 -10235 -17489 -10026 1464 1202 -3414 -6741 -3821 3728 11885 14524
19012 14524 7073 10135 6542 -1994 -4897 -6146 -5587 -21598 -30170 -9061 -7759 -7205 -1041 10703
18998 10703 16945 8167 4211 9017 2442 -12041 -3024 5977 -1774 -3859 -7695 -19145 -24537 -27796
18984 -27796 -23959 -9237 -17104 -19689 -13950 -19479 -19931 -10915 -6696 -3719 -2178 -13137 -10603 13855
18970 13855 6112 2110 11381 13056 -470 -16403 -10998 -2074 -5316 -2609 -1201 3219 -255 5542
18956 5542 24567 15801 -2438 -9892 -9989 -1695 12558 14732 16061 1140 -4970 5410 7964 -1858
18942 -1858 -18979 -24111 -25787 -25784 -15735 -12601 -13123 -13455 -12047 -13137 2477 1861 9816 11814 17420
18927 17420 17049 15776 3187 -10246 -5923 -5682 -21 13301 10423 -16161 -23041 -20820 -21086 -4842
18913 -4842 794 5297 -4907 -8086 -4895 -17701 -16033 -9782 -9965 -19256 -27383 -37185 -19589 -11760
18899 -11760 -7017 3138 8131 12433 14821 -4586 2764 -2682 -16064 -22491 -23693 -19457 -24733 -21676
18885 -21676 -15988 -8789 -1770 -6574 -12307 -24540 -21701 -16490 -21524 -29256 -27068 -16378 -15809 -7325
18871 -7325 5117 -2772 -22082 -9856 -3346 -19151 -17831 -1047 -3906 -12499 -25016 -31743 -30220
18858 -30220 -17421 -17391 -29300 -27109 -20903 -6747 -6943 -4145 -6335 -14753 -9762 -1545 -7615 -1164
18844 -1164 7864 528 -3337 -6853 -3840 -1260 -10830 -1283 8218 1085 8874 3221 -5144 -16247
18830 -16247 -21686 -18595 906 15480 10908 7850 10028 7713 -1233 -12870 -6851 -306 -8947 -19292
18816 -19292 -15866 -10130 -6794 -4600 5141 1117 -6356 -19446 -16437 -26296 -22765 -25361 -16059 -11186
18802 -11186 -17232 -4262 -5176 -14378 -22476 -34657 -46104 -40156 -26970 -28133 -22560 -10804 -5128
18789 -5128 1352 7600 12892 11841 5572 2652 14289 1711 -3423 -836 -1496 1188 1874 10525 16532
18774 16532 13507 14766 -6796 -16619 -4985 -13926 -5491 -1502 -10117 -18618 -19274 -18050 -3663 -730
18760 -730 -11197 -18755 -14539 -21818 -16861 -8482 -4342 804 -11505 -9006 -1076 -3969 -5728 -8160
18746 -8160 -4289 -4726 2365 12266 19231 13353 -14260 -34796 -29159 -31284 -29885 -23828 -14968 -5009
18732 -5009 1456 -6857 -7816 -1648 3053 -2442 -11934 -7310 -20126 -28727 -25172 -12314 -18482 -25043
18718 -25043 -27748 -16345 -14078 -13578 -27537 -24563 -28057 -26311 -33352 -25026 -12562 4361 20444
18705 20444 10614 -3524 -9162 -485 -10177 -15490 6850 15751 12700 2446 10247 3088 -18061
18692 -18061 -4501 -849 -3365 4706 2994 1141 5129 1816 -10418 -10326 -14517 -4007 -4398 -7351
18678 -7351 -17257 -23189 -19681 -26391 -25080 -42662 -32774 -32421 -18832 -2801 -6890 -6829 -8259 -18176 -20045
18663 -20045 -8478 -11560 -16397 -19917 -19480 -1227 5724 10027 8681 8177 14709 -4123 -19524 -24817
18649 -24817 -20833 -23109 -18833 -21253 -15536 -3794 1395 24589 40636 22000 -9004 -23727 -25548
18636 -25548 -23626 -28528 -23424 -15411 3037 7891 2482 -1766 -13402 -17036 -26443 -20524 -19117 -16940
18622 -16940 -8665 -14730 -9579 -11585 -23482 -32426 -20695 2420 9310 -3653 6121 -385 -1412
18609 -1412 -819 3538 -3377 -164 11180 11327 4997 5846 -9437 -27078 -39745 -34522 -37488 -29978
18595 -29978 -11480 -7234 -2599 -19585 -7861 1829 -5510 -9499 -764 8232 4637 1821 9270 21374
18581 21374 19445 14150 17381 14796 -4998 -20080 -6411 -7161 -10424 108 -3512 2564 2419 -7685
18567 -7685 -774 7560 -2721 1163 13401 22171 17700 7540 7831 14771 16134 4591 -657 -1922
18553 -1922 -250 1859 -4402 -9283 330 23221 20118 -6013 -861 14528 18516 24948 37557 30872
18539 30872 7188 -4345 -6575 -12889 -14070 -6254 -5548 -10924 -8934 -11574 -3713 -7413 -13484 -24897
18525 -24897 -16786 -476 407 -20048 -19283 -3094 4508 3381 9481 15661 31247 26608 22279 10067
18511 10067 -12461 -21245 -13528 -362 -11180 -18308 -13877 -21878 -22548 -14687 -12901 -7708 -3234 1796
18497 1796 -2127 -2546 6002 235 -6950 -12945 -15888 -22666 -17374 -14406 -9717 -3610 2549 10216 5449
18482 5449 4806 -3144 4970 15924 6219 2360 4859 1413 7135 13980 13562 11934 3497 -3328 -2307
18467 -2307 -7935 -11458 2936 48 -10353 -6970 7689 10191 14287 12771 14306 1353 -7594 -16945
18453 -16945 -10722 -9871 2439 10844 4802 3301 1632 -18036 -13442 -9248 -10641 -6867 1694 -3409
18439 -3409 -4982 -1575 -13994 -19117 -4370 3165 8227 1782 4229 163 -14230 -19835 -24113 -17406
18425 -17406 -22952 -17647 -12385 1032 13471 8224 10194 10878 20818 12966 8350 20562 14934 143
18411 143 -7693 -15163 -8258 -14559 -20670 -16223 -18997 -14316 -1595 -14050 -11424 -578 -1101 9345
18397 9345 10293 11755 10561 18474 23365 26012 21019 17691 16906 11307 1562 -3995 149 -6473 -997
18382 -997 -4386 -7509 4434 8377 12671 16400 12239 3182 -11423 -8296 18981 25827 6659 -4969
18368 -4969 -2318 13855 6629 -7530 -8564 -15683 -3483 2990 -4480 -5023 -16511 -20490 -12895 -19419
18354 -19419 -20722 -16758 -1800 -9059 -14445 -9178 -16420 -10878 -275 11394 3245 10027 2240 -9588
18340 -9588 -16454 -27963 -26473 -23718 -13795 -17933 -16454 -15786 -14031 -2621 17551 23064 17017 -1686
18326 -1686 -17301 -17795 -12850 -8436 9092 27598 23789 13607 12127 17148 23021 13592 -4544 -28297
18312 -28297 -22167 -4086 -16366 -31780 -20636 -9627 -2775 6089 -336 1593 -942 -11118 -3344
18299 -3344 16163 4430 -5745 1598 3969 4931 -2653 -2262 170 -1709 -3667 -10671 -21882 -19859
18285 -19859 -18669 -17552 -4700 -3507 -11808 -5902 2234 -384 -5269 -4485 -5727 -8084 -15391 -12280
18271 -12280 -12001 -18941 -10575 -1399 4750 14831 12033 -6617 -11621 -25323 -25677 -7811 3154 -1455
18257 -1455 -1889 -8225 -21762 -20928 -7871 5819 -1829 -32 -5320 -7551 -1340 -10198 -17295 -12391
18243 -12391 -5962 -5527 -3580 -4738 -11529 -14408 -10079 -3131 13841 -6663 -21944 -26611 -28569 -9930
18229 -9930 1091 12213 -861 -2667 -7128 -17331 -15101 -12559 -4248 -10664 -14996 -19841 -16566 -10893
18215 -10893 -17690 -19976 -7769 -2400 -1397 6254 5270 1205 -3684 -8849 -3545 1520 1482 2198 12580
18200 12580 27955 24010 7699 -7414 -6471 -2634 8412 -6694 -9823 -24637 -11216 -10692 -2120
18187 -2120 -2346 -21034 -14333 -825 -2748 -8523 -8870 -3451 2470 -902 -13712 -9659 -2825 7479
18173 7479 7204 21629 31661 19653 6732 1942 -2560 -7287 -12113 -8354 -15035 -21712 -34932 -45251
18159 -45251 -39570 -30820 -33201 -39207 -41280 -29531 -2076 -3173 -6737 -17303 -32316 -32929 -26660 -38090
18145 -38090 -30849 -21329 -5183 -837 -6123 -7852 -21256 -21397 -19956 -10058 -16466 -21466 -26066 -23210
18131 -23210 -15863 -3992 1692 1910 6042 6432 7816 11647 17284 9800 13216 15161 16889 13940 1014
18116 1014 -586 128 13192 5171 -11601 -22983 -14686 -13386 7596 10459 -1996 -7746 11650
18103 11650 7633 4209 -5289 -16332 -11922 -22088 -24019 -2541 5082 -5126 -12257 -19222 -27366
18090 -27366 -11530 -6496 -12833 -12344 -26567 -17908 -13188 -16874 -745 -512 833 8283 21257 27959
18076 27959 22833 24233 19230 530 -1812 13655 13189 6697 3234 -4919 -15234 -30521 -32581 -17801
18062 -17801 -19371 -24938 -20804 -17952 -871 6905 2155 9469 12205 -9708 -29689 -39143 -36379 -23677
18048 -23677 -27189 -27257 -28491 -33498 -31097 -39356 -55301 -36354 -11191 4851 10668 1810 -4204 -4674
18034 -4674 -13523 -15563 -3024 -9086 -9782 320 1288 3818 4170 -12863 -10962 -10516 -6944 -11049 -16271
18019 -16271 -20187 -9548 -8734 218 -15225 -16534 -12475 -7089 -6753 -1005 2408 7358 5733 -1778
18005 -1778 -10688 -15764 -15465 -8245 -1489 -4754 -6024 -7429 -9591 -4670 -9837 -7909 795 3822 8396
17990 8396 16766 16008 3993 -401 7140 13139 -3621 -28702 -20202 -7440 -2091 -7956 -6585 -9901
17976 -9901 -5102 6167 5646 6767 9311 684 -3586 13003 14503 8344 7837 8423 3801 10317 18394
17961 18394 3274 -11135 -20832 -17262 -8149 -20313 -18334 -18503 -17809 -11827 106 12840 1176
17948 1176 -17107 -22062 -20604 -3797 9537 16477 10330 6188 7619 31 -12129 -18723 -16791 -6631
17934 -6631 -5634 -11618 -9041 8290 13611 5901 2803 772 12066 24472 19777 5952 8135 4425
17920 4425 -8916 -2387 -2699 -1655 -2166 4291 12464 15024 13192 10575 275 -15741 -21285 -11939
17906 -11939 -7223 123 -9783 -23441 -31940 -24240 -9624 -18051 -20218 -7471 -5487 -16627 -15265
17893 -15265 -23545 -26788 -17037 -7218 -9538 1418 -855 -736 4528 -5821 -4663 5143 905 -230
17879 -230 -12119 -7836 1347 -2294 -9611 -21539 -9065 195 -7144 -11318 -24265 -33001 -18915 -1727
17865 -1727 -9689 -4855 4185 -13569 -25801 -17773 -23843 -24884 -5860 4793 4638 11936 10858 4136
17851 4136 -18172 -18267 -9990 -13787 -20043 -16798 -4417 6632 10505 15725 1672 6148 -5880 -11158
17837 -11158 -5151 -3270 -3370 -14565 -17424 -17589 -19819 -26126 -25478 -27503 -37667 -31139 -22099 -15599 6426
17822 6426 1690 -14479 -28348 -23938 -22574 -29193 -39556 -44433 -43507 -43259 -48405 -43196 -40427 -42146
17808 -42146 -26796 -10011 -12305 -22578 -24983 -30868 -31525 -36853 -27849 -29451 -17078 -12537 -16109 -8247
17794 -8247 3387 9296 8756 -4195 -14952 -19719 -19108 -16734 -17559 -15584 -23187 -14145 -21693 -32815
17780 -32815 -21311 -7716 -4493 -3675 -23933 -26830 -10492 -8677 -7318 -20440 -20745 -20500 -18655 -5833
17766 -5833 -9911 10903 15332 20309 25948 12132 959 5323 -1865 824 4839 4730 -14177 -20392
17752 -20392 -17170 -30205 -23969 -15260 -7090 -8994 -16163 -8474 -15946 -12390 -21146 -13061 2678 3327
17738 3327 4594 2954 -809 3969 -739 2813 728 3841 -3200 8600 -6179 -22561 -13466 -5950
17724 -5950 -1273 -5392 -2138 9962 16106 15993 11754 4931 -2950 -2050 359 -5893 2990 13741 1053
17709 1053 -11699 -7757 3513 12764 8663 5222 708 3985 1123 -7753 662 12122 -2731 -10947
17695 -10947 -11606 -1219 -1301 -9565 -4589 -6571 -14336 -7293 15211 9635 2567 4100 -10407 -24005
17681 -24005 -30551 -29460 -25588 -22513 -21302 -11955 4760 6502 -368 -18170 -22067 -16055 -5255 -2185
17667 -2185 -3557 10988 -708 -15479 -17008 -16636 -7715 -13996 -23673 -21059 -19266 -17194 -15765 -29028
17653 -29028 -35489 -21187 -23380 -23903 -20844 -4490 8777 -9516 -2388 -4884 -5396 10848 14340 15985
17639 15985 18538 17397 12140 5733 10324 14329 7306 -16772 -17786 -1144 11295 6643 5755 8086
17625 8086 9058 7431 -4463 -7399 11282 6800 2417 -4143 -4736 -4196 -1408 18107 21988 7271
17611 7271 -12 4407 3771 -1524 -14736 -10664 -12868 -19774 -20494 -14372 -16548 -13195 -2867 -2055 -7725
17596 -7725 -14086 -8496 -3656 -459 3160 4375 15404 4634 405 1630 10984 -7909 -17670 -9371
17582 -9371 3921 3259 15975 26240 6046 -11973 -22237 -20472 -37394 -35279 -30713 -24564 -19901
17569 -19901 -19245 -23887 -24159 -15085 -9064 -4701 -895 16787 21122 20262 13875 8565 4222 5424 370
17554 370 1919 4180 8139 243 -6232 -5284 6720 27404 29779 15842 5601 10887 8087 -2218
17540 -2218 -1762 10551 12877 15930 4675 -3802 -6070 -12743 1471 6155 6439 -3597 -15625 -14190
17526 -14190 -18350 -9857 -11314 -7227 6442 2964 3822 1923 254 2163 15157 12045 4062 2266
17512 2266 6129 3545 8349 -2251 -2074 7865 9791 -3881 -7165 -3534 -25117 -17760 -22966 -13219
17498 -13219 -13919 -24495 -26069 -7491 6939 -9470 -13868 -10836 -6796 7070 707 -9818 -5948
17485 -5948 8842 1988 -1110 -9264 -11924 -13846 -27387 -28738 -25844 -29172 -13776 11599 27006
17472 27006 27596 10841 -2829 -7075 -3923 10619 9516 4614 10934 10525 26734 30780 28919 6807
17458 6807 -17741 -29434 -17657 -7997 -871 -495 -14831 -25443 -20244 337 17616 14237 7224
17445 7224 6587 7097 1174 4785 10096 8817 -1662 -7599 -11329 -12758 -6872 4265 10541 -6334
17431 -6334 -23882 -24143 -17102 -9008 -6596 -5698 -2423 -3424 1778 -7281 -11201 -7094 10488 12055 5563
17416 5563 14356 18534 9856 1472 -6473 -2411 -15235 -6565 7065 9016 5818 -5277 -382 9304
17402 9304 -6617 -25664 -23862 -27152 -35424 -40755 -25623 -9808 650 -3511 -4437 8074 14772
17389 14772 3556 -7781 -14565 491 13494 10524 -1590 11953 3141 -9901 -21789 -26389
17377 -26389 -31241 -14764 -8052 -24238 -39917 -41909 -30306 -12129 -20901 -11767 -9952 9062 13210
17364 13210 4204 12470 19206 15912 20085 8325 -2277 -4812 -8805 1219 -4944 -7178 -5573 9982
17350 9982 7458 -5559 -1575 -6572 -2985 -13007 -19901 -26297 -29093 -10336 7773 7421 11717 6126
17336 6126 4910 16750 18920 1295 -14780 -20739 -17205 -31655 -33424 -34607 -38995 -19231 -7053
17323 -7053 -2605 -3933 -13499 -22787 -12841 -15687 -12265 -6614 -6388 -8272 -7966 -15165 -8547 8932 7711
17308 7711 490 -5790 -3505 -1169 2616 3415 4381 -8678 -15643 -14785 -15248 -16139 -8691 -2360 -3195 -14957
17292 -14957 -14718 -15459 -14269 3793 4558 -6855 -12220 -6148 9699 23912 14504 20033 14332 13260
17278 13260 11683 5911 9156 8938 13890 17056 10175 7284 23165 21540 26900 17822 9812 17155
17264 17155 20483 12310 10949 10884 9666 3048 1891 -12171 -15823 -4888 -11773 -24670 -32271 -5103
17250 -5103 10871 8275 9902 -2298 7803 4029 -15413 -8530 9826 7980 9493 13212 4617
17237 4617 3293 -2342 -7027 -14796 -8351 -11444 -20614 -27299 -25550 -16116 -14493 368 6969 -5151
17223 -5151 -4510 1353 11361 2886 10755 19516 27342 36802 27910 9430 933 -345 -11003 -16154
17209 -16154 -9728 3582 1484 6076 14535 6782 -13812 -19508 -22139 -21644 -27399 -33015 -19748 -2211
17195 -2211 5198 -727 -2305 8706 3207 -11452 1892 -7397 -11727 -8237 -10867 -21115 -16607 -1599
17181 -1599 21222 12665 6244 -157 -20843 -11893 -16599 -17336 -20212 -22934 -17313 -17714 -21212 -19944 -24357
17166 -24357 -23286 -21286 -11855 -9411 1322 9872 8806 5980 15497 17541 13321 -1791 -6154 5330
17152 5330 5391 -7460 -14462 -18080 -8585 -718 12717 1488 -3967 -7890 -3451 -9535 -7682 5761
17138 5761 -496 -2978 8078 11012 9310 -3399 -4678 4279 -1127 -2993 -2648 6926 15130 8784
17124 8784 -2818 31 3751 141 11390 7391 -1705 -12728 -8680 -5957 -17036 -17132 -19141 -12676
17110 -12676 -5194 -4063 -260 3911 13421 20647 12741 9423 4421 533 -9437 -2381 -9620 -18281
17096 -18281 -12357 -3931 -514 3046 9059 18054 1225 -1701 8070 5283 -4187 -12951 -12687 -7918
17082 -7918 -10620 -8536 -15454 -9676 -1747 -2354 -5139 -16789 -29447 -26487 -24712 -12191 -17794 -6484
17068 -6484 2993 -4918 -26742 -42935 -41399 -34540 -8300 -9718 4052 14877 937 2040 -1639
17055 -1639 -8844 1220 -55 2405 7567 1894 -6964 -9225 -2491 -1994 -2378 -8290 -20897 -4260
17041 -4260 5421 1742 -946 15786 15410 13226 12096 12365 10004 12105 2018 -9055 -7599 13656
17027 13656 13330 13142 12869 16144 7874 16853 14173 12373 13272 8490 -4293 -656 4265 5783 1522
17012 1522 5163 -1746 -4780 -1405 762 11968 19873 19035 32705 33166 9692 -7715 -14029 -5616
16998 -5616 -8286 -8205 -9888 -5802 -9511 -12043 -12833 -13380 -12957 -7858 -2727 -5245 -24354 -18741 -12806 -8889
16982 -8889 3796 -4249 -12018 -19052 -14567 -8412 2730 11223 9213 6569 7938 -2136 -8679 -21808
16968 -21808 -32767 -31913 -31043 -26940 -18654 -22942 -7395 -6850 -11192 -14411 -3153 1968 -1355 -7491
16954 -7491 -4907 -16757 -11229 -9488 -5557 -21 2842 -14331 -15186 -24234 -32478 -27240 -12655 4172
16940 4172 -5392 -14931 -19518 -23062 -17921 -13663 -26858 -31339 -1706 -6365 -14506 -20608 -25542 -15106
16926 -15106 -4963 -11050 -17806 -31743 -35370 -25229 -2403 9887 11559 2327 -16412 -21675 -18516
16913 -18516 -1788 5320 438 -410 6163 4236 -10671 -21799 -26183 -31186 -33556 -29268 -26099 -18586
16899 -18586 -18597 3375 22482 23203 9743 -395 -2712 1082 2668 4132 9511 4194 -1129 1738
16885 1738 11252 5573 2239 5285 9276 4177 -3015 6076 22076 22851 17390 17522 15238 8677 4232
16870 4232 4882 9816 1436 -20345 -28186 -25788 -30335 -9220 16509 13584 4050 -826 13996 19088
16856 19088 3254 -6479 -7297 -12827 -8201 3174 5517 -7263 -4337 -11658 -1025 -5085 -21596
16843 -21596 -29518 -20946 -12078 -19157 -17092 -18537 -16017 -14480 543 -1244 -15802 -10355 -11887 -19081
16829 -19081 -24765 -19309 -3123 10834 1369 14722 26008 10126 -3443 -6380 -3167 -2841 -5363
16816 -5363 -19406 -27806 -41066 -38615 -43270 -36121 -9659 -1128 -6207 -5709 278 6208 9365 11162
16802 11162 -676 -15524 -26383 -19038 -16494 -13889 -9372 -9971 -7998 -16147 -18548 -20150 -22415 -4763
16788 -4763 1809 -9180 -5431 10660 12224 -1631 -6797 -1070 -2147 -16494 -17606 -12570 -10893 -15066
16774 -15066 -2520 -8631 -6662 -4038 -6569 -4958 -18556 -23565 -13181 -5526 -11394 -20354 -10697 -7664
16760 -7664 -428 5485 7725 4306 7910 -5949 -8900 -7977 10974 4272 -10742 -13412 4188 16955
16746 16955 11851 16391 9524 -1804 436 12902 23943 7462 -8064 -11715 -4588 2750 8100
16733 8100 19212 10941 -8184 -9872 -2505 -6099 4391 7297 -4350 -2663 -7061 -9245 -4228 -2925
16719 -2925 -3336 2421 11810 29847 12261 1308 -7055 -22167 -20384 -8525 -2492 -1193 -3807 -10695
16705 -10695 -6797 -8433 -14020 -17588 -11880 -6085 -16837 -21872 -1512 18236 17598 10413 5497 3039
16691 3039 -10557 -20365 -25654 -12722 -3487 -9468 -3598 -6606 1679 11790 -2989 -14334 -22915
16678 -22915 -4167 -13144 -14955 -8923 -18283 -16781 -14785 -733 -3546 -8281 -8902 2893 1569 -5800
16664 -5800 -17557 -20072 -25076 -14945 -10270 -20148 -9862 -4170 5780 14249 7198 8192 3337 -1349
16650 -1349 -3671 -2953 -5505 142 11885 5947 -14629 -12649 2831 12846 9471 -10150 -19569 -12917
16636 -12917 -9792 -27412 -41776 -29402 -20800 -28541 -17345 -9795 -16935 -17505 -16462 -36177 -37360
16623 -37360 -18464 -24259 -27993 -9997 1459 18828 9914 -10699 -1746 17639 25111 9622 2719
16610 2719 7766 9038 -5599 -16557 6340 21121 24623 13276 -3257 -16984 -17399 -20939 -10453
16597 -10453 -6859 -5492 -2199 -8509 2978 10892 12693 11917 -536 5849 7522 11674 9121 10724
16583 10724 -8804 -20258 -22639 -12207 -1961 506 1227 11494 15725 7012 13510 10088 2779
16570 2779 -271 -7235 -5922 -7679 -5998 -6749 -9022 -33353 -27249 -8808 2001 13244 13835 17644
16556 17644 21994 18277 12022 14116 4466 -2642 1315 -8863 -11776 1272 7979 6536 2598 4043
16542 4043 7830 10967 7942 11987 5655 -9907 -12471 -12656 10279 -685 -9413 -11708 -17225 -13679
16528 -13679 -14351 -10792 2293 3412 -2388 -7818 -5018 -9763 -10045 -9796 -3222 10170 2050 -4223 1487
16513 1487 -386 -1823 4215 -303 -6425 -1204 -8372 2673 11931 15629 10675 2446 -1481 11966
16499 11966 6495 -13704 -14818 -12676 67 -617 9980 7982 2640 7497 -5839 -9740 -13285 811
16485 811 3892 23199 31192 15328 4712 7131 2736 1373 9355 22538 29320 31034 18871 7463
16471 7463 13062 1708 -8109 -9782 -17941 -10487 -7030 -15488 -10799 -1821 1135 1166 9987 19765 9723
16456 9723 -16691 -10783 -4955 -16545 -19927 -8481 -17503 -23431 -8550 5538 -876 -14861 -4937
16443 -4937 -3493 -6798 -14321 -12874 -13419 -5897 -6893 8756 16500 6572 -1604 -5131 4018 -1565 -3849
16428 -3849 13354 16600 12771 10360 7568 1191 9909 8292 -1720 -864 -1907 -663 -3728 -3781 7053
16413 7053 1055 -4611 -2694 -6873 -3650 2309 -4193 -8826 -21380 -24588 -17105 -16736 -10514 -8915 -4869
16398 -4869 -4058 -4303 -17562 -29962 -25220 -19640 -17925 -1964 12447 20028 6176 2081 3563 -4933
16384 -4933 -14298 -8439 -3445 241 -10549 -29100 -23046 -20499 -25622 -14264 -21930 -32043 -29035 -9779
16370 -9779 -8380 -18807 -29423 -29382 -16260 -8168 -8231 -9885 -4097 14646 13701 -7051 -15254 -10409 6757
16355 6757 13196 3402 1063 -4085 -13826 -16446 -17856 -13144 -14040 -17639 -19594 -16604 -15717 -12705 -14069
16340 -14069 -17248 -14577 -21658 -17666 -17336 -15546 595 6446 2868 2605 -4695 -15445 -18605 -10427
16326 -10427 -14270 -17040 -17683 -18802 -8897 -5046 -13122 -24587 -18509 -22008 -19580 -14160 -3112 9286
16312 9286 5546 4761 -1035 11537 15749 -1166 -10349 -662 -3281 -7311 -6296 2781 574 -1758
16298 -1758 -4664 -13773 -6762 -5409 -10542 -15117 -15892 -7388 -3666 -8045 -27108 -28363 -17954 5219
16284 5219 18981 11595 5176 21219 17793 2174 -4576 -12293 1441 4309 1071 -6406 8341
16271 8341 14806 -2106 -8301 -6939 -7941 679 4456 14492 28858 16801 4666 -1598 -12524
16258 -12524 -15735 -22323 -8324 -1498 12876 22595 27469 25962 21203 2845 -3961 -5390 4555 22306
16244 22306 26462 20764 8290 -2914 -9662 865 2269 -3505 -1190 -19497 -22274 -15965 -5941
16231 -5941 -1600 -6396 15259 24833 16414 -1015 -8594 -8287 4407 -2238 -8193 3167 1844 -5944
16217 -5944 -5624 11889 23020 1859 -11523 -12426 -9539 -3637 -9523 -19123 -9697 8515 15204 12887
16203 12887 262 -9743 -14723 -9067 -11579 207 -4814 -1826 6515 6288 3829 -14162 -26960
16190 -26960 -28336 -26590 -13628 3579 -1682 -4461 -17047 -25639 -18843 -10203 -12377 -8178 12362
16177 12362 13344 6132 -10146 -7481 -12160 -16576 -9263 -7325 -5411 -4789 -833 -11313 -8951 -4202
16163 -4202 -6854 -3810 -6428 -20531 -23037 -30021 -16453 -27375 -33984 -14766 -4858 -6034 -4755 8019
16149 8019 16433 12760 4695 -3182 -16396 -9349 -15414 -15841 -18666 -23224 -23152 -24081 -22445 -19213 -10397
16134 -10397 -11144 -549 3923 -8953 -15072 -17942 -13605 -7716 -1574 -6082 -6821 -9629 13331 15682
16120 15682 -11474 -9242 6886 3821 -4850 -4826 16768 14843 6532 4500 6163 6550 10382 -1275
16106 -1275 -11583 -13203 -9864 9276 14512 13421 14936 14721 18872 29700 14190 1596 -3463 -9588
16092 -9588 -22553 -26586 -16002 -74 4142 4238 -10447 -24604 -15537 -7207 -2594 -2150 3315 10296
16078 10296 13435 7370 9866 11649 6996 -8663 -6731 -3167 3493 14695 6549 -9945 -13003 -12782
16064 -12782 -2102 -5140 -13000 -10324 3325 812 -993 15507 13372 19956 11065 6141 10672 15709
16050 15709 1435 -5133 -9117 -15155 -23457 -28036 -13156 -488 4566 -1047 -2889 -13 -2387 13586
16036 13586 7572 -18337 -25924 -26128 -23500 -17532 -15127 -12295 -5393 5922 7434 5365 2453 -8692
16022 -8692 -8951 -12556 -11667 -5697 1705 87 -5693 -5021 -23093 -30889 -28265 -31129 -29098 -7179 98
16007 98 30 2561 20014 29347 9727 1624 2612 -7465 -24703 -24703 -18920 -12850 -4081 11783 3693
15992 3693 2288 12563 19912 1327 -8208 -3097 -15143 -8139 20553 20154 14680 4076 -12409
15979 -12409 -8665 7263 6177 -7403 -13644 -7732 -942 732 10216 16671 24323 7820 -8068
15966 -8068 -7051 -3833 -1171 652 -7943 -19952 -4980 10451 -1053 -16801 -21426 -15792 -10616
15953 -10616 5725 4590 12868 5407 -9737 -6721 -507 -1654 3778 5197 8113 6583 6706 6067
15939 6067 -551 -844 -123 -2678 6003 -6664 -11742 11328 17932 8519 -5427 7779 9468 1272
15925 1272 12521 28223 23942 14909 7015 2793 2739 -8602 -16539 -16741 -15166 -4767 7278 1646
15911 1646 -6336 -13523 -17835 -7586 -4408 -14147 -10794 7735 16100 10888 2575 -5061 -5589 354
15897 354 2074 6697 11531 381 -5665 -4823 -14017 -17471 -19372 -13944 -1846 12005 13460 817
15883 817 -11597 -13616 -5213 -2992 4049 2632 -97 -1340 15411 10437 13581 1775 -278 8310
15869 8310 8882 4229 3671 6767 -9564 -20322 -23099 -17084 -8634 10046 23347 5034 -11044 -13288
15855 -13288 -12850 -2675 8611 8338 9841 14183 6672 5359 4124 812 7787 -1388 8022 20180
15841 20180 25404 7277 7178 7857 3980 -7630 -6564 -5104 -4014 -11828 -13586 -9440 -15315 -19280 -11941
15826 -11941 -16625 -21894 -1900 812 -7255 -2994 14893 21028 12896 7368 15291 15194 4605 -5111
15812 -5111 6413 16216 9875 843 -3840 -14263 -23951 -13490 5483 3857 2309 2494 -5746 -5808
15798 -5808 4975 16288 15486 6113 11899 1513 5194 4796 -5656 -4807 -2743 -14446 -23014 -22430
15784 -22430 -11778 -7276 -6463 -4517 -12777 -21262 -15208 -11658 9300 7821 -3485 -5265 6516 11195
15770 11195 3204 1225 3199 730 -1722 -5244 2481 -851 -7567 -10753 -25344 -26105 -2773 3136
15756 3136 -3238 -9199 1080 8247 12794 10310 18009 12511 1057 -9293 -9130 -6394 -14419 -11487
15742 -11487 -2577 -13962 -19559 -15771 -18533 -21704 -11578 -3884 3832 -657 -9873 -1078 15878 10614
15728 10614 -3348 -6344 -8974 -7253 475 -7578 -16019 -20571 -7201 6613 4311 -5430 4797
15715 4797 -5987 -3638 -1637 1176 -12512 -3322 6699 10318 8520 28557 27652 4555 5403 7148
15701 7148 1729 -10929 -17658 -23555 1294 12080 4473 5271 11965 15703 11733 7320 4923 4133
15687 4133 -6437 3376 11588 -3363 -15404 -16158 -1580 -71 -8370 -11783 -6057 7478 12118 9535
15673 9535 14008 12993 8528 15212 22623 30480 40603 41497 34726 36625 20873 3310 1837 -849
15659 -849 -6808 -3442 -3119 -13730 -8605 -14910 -22755 -21835 -13370 -2565 -12733 -23208 -21936 -21879 -18915
15644 -18915 -23148 -36342 -28142 -5919 4119 12015 16263 13312 20497 30203 14555 -6800 -18340
15631 -18340 -14010 -7328 -12286 -22670 -26565 -30473 -38850 -29281 -18561 -16141 -9816 -19401 -17530 -9297
15617 -9297 -9827 -2692 11312 -7366 -10838 4974 5797 -12937 -14290 -20132 -13956 -3105 -3766 -12931
15603 -12931 -7548 12983 23252 14270 13262 -3380 5823 14038 -3483 -16522 -31806 -52361 -39702
15590 -39702 -20860 -6558 -12331 -13650 6082 15702 1030 -17438 -21721 -15206 -1675 -12154 -14619
15577 -14619 -20163 -18772 -22489 -31245 -24237 -18927 -26526 -13538 5662 4298 -6524 861 7434 4443
15563 4443 77 996 -756 -4946 -5155 -1404 -9202 -4099 28625 37772 21426 3908 -5736 -25949
15549 -25949 -16783 2484 6439 3244 -2840 -6599 -22548 -19074 -15523 -14566 -8781 1057 -2128 -3746
15535 -3746 -7777 -2800 -6618 -17769 -16651 -24446 -28014 -25671 4521 27954 22928 15343 3544 -10952
15521 -10952 -19212 -7897 -1101 4218 12548 3458 4341 13774 20608 9672 1049 -8026 -3418 -6834
15507 -6834 -12714 -4871 -6505 -11465 -12425 9815 28500 19131 -155 815 12089 27263 23286 9519
15493 9519 16625 26436 16223 4500 -4609 -9297 -8747 2287 8183 9975 10631 9284 2244 4137
15479 4137 6437 3625 962 36 -3990 -10241 -8791 -15873 -19170 -12967 -13207 -12824 -2704 1182 4919
15464 4919 15929 10821 199 -3108 -64 -5431 -1415 4010 -1120 3279 -792 -7589 -9342 -12816
15450 -12816 7496 8879 9027 13389 4486 -12365 -4352 10429 16449 15854 2034 -5282 -13277 190
15436 190 756 -6285 -10847 -15605 -13360 2924 16020 16999 14620 16100 6785 -4003 11112 9872
15422 9872 5016 9070 13875 7043 6986 2508 -3481 -10070 -476 -2793 873 -2238 4756 -10913 -27602
15407 -27602 -26676 -17238 -2823 -1886 7598 -2455 -11388 -6043 -18180 -15973 -4453 -1430 -1730 -4264
15393 -4264 -726 -17721 -27059 -11962 11350 21818 18295 18620 11747 10862 16249 30236 26748 10177
15379 10177 -2181 -8759 -2761 -10006 -13917 -12478 -20975 -7639 12419 13314 14223 7420 12613 3448
15365 3448 404 5109 10126 4501 14680 24832 24524 33409 32378 25085 18455 28650 34638 23624
15351 23624 14516 12078 -11401 -19725 -12494 -6812 13855 19281 9516 5053 6361 15232 6907 -1638
15337 -1638 5011 1119 1190 5954 -2440 -3060 1787 15769 11007 2770 9765 4389 9555 15004 16884
15322 16884 16695 2160 -11314 -10381 -8436 3675 10090 8267 14869 9627 11440 13542 6725 -5032
15308 -5032 -9703 -14521 -12417 -18281 -16905 -22014 -12542 -3720 7475 10090 -2111 2444 -4068 -12922
15294 -12922 -15353 1822 1635 -13955 -21380 -15335 -5060 3476 7002 5442 1107 8586 17669 26760
15280 26760 27278 26217 4094 -9175 -9093 -3643 -3520 -4737 6947 16767 25909 24647 11717 4901
15266 4901 2402 3050 4602 8364 -21 894 1259 -11749 -11749 -6019 -12037 -8677 8339 6830 7982 13401
15250 13401 -10840 -15969 12102 13607 2699 68 9656 10006 -1053 -6997 -8301 -684 5479 9973
15236 9973 8312 15543 3605 -2254 -4154 -11463 -552 14350 26566 14484 11198 11035 -5374
15223 -5374 -6811 6985 23634 18566 14249 17103 14695 10949 -9135 -12379 -20058 -26506 -12740 16178
15209 16178 19930 10361 10309 12193 1427 -5514 891 3322 -7042 -26773 -20649 -10016 -9506 -17603
15195 -17603 -9584 -2079 -464 961 11700 12508 1446 1375 7515 5417 12147 18045 -443 -7578
15181 -7578 3126 14882 17981 8137 -10659 -13784 -15874 -22203 -16838 -14643 130 2585 -5948 -6297
15167 -6297 -4477 -1114 -6923 -497 -3297 -14074 -15176 -15858 -6144 -2349 725 -1462 9615 20744
15153 20744 21427 11852 -8495 80 18503 18102 10150 -6094 -7165 -13071 -15738 1862 8740 17308
15139 17308 -7006 -10466 -1597 8742 4971 3151 6361 -7729 -18502 1054 14050 -1678 3342
15126 3342 16322 22575 20631 22458 -5009 -8491 5574 29653 41629 28700 25139 19183 9824
15113 9824 12012 22189 18632 1888 -16597 -6328 5133 4121 -1782 5344 9863 3213 -4156
15100 -4156 4228 7201 5658 176 25615 38769 32436 21902 14658 19662 18827 29129 10597 1729
15086 1729 507 5868 15474 2207 -720 2573 16480 20727 10055 8043 7305 -5279 -7292 -11473
15072 -11473 1358 19065 20672 23632 19935 20265 19347 10477 -7050 -13778 -8066 -10211 -23863 -30403
15058 -30403 -24584 -18611 665 4606 -8599 -22846 -37653 -27827 -2727 10551 6888 -7380 -5720
15045 -5720 -5776 -10079 -9477 -20313 -7228 -142 -6580 -13584 -3065 -6746 -1463 -10490 -26837 -24865
15031 -24865 -18786 -17488 -22392 -30098 -28628 -13545 -12317 -9863 -88 14051 10732 6781 12995 5297
15017 5297 -7466 -4695 -14584 -10004 6236 9619 21193 24253 19491 9492 -3543 -11230 1054
15004 1054 -4434 -2906 -6203 -20608 -1698 5804 16959 14829 15000 9364 1278 1083 6663 12930
14990 12930 6048 -1454 -4492 2838 423 10263 13838 6475 -322 -1617 -14452 -20018 -3712 9166
14976 9166 13060 10581 10352 8392 -2518 -4357 8193 16430 8540 13679 9603 -1806 -5347 -2994
14962 -2994 1757 1563 4153 3802 -67 -306 -2099 6914 15998 9618 -113 -6861 -5734 1255 13304
14947 13304 19725 27782 14869 7459 -1092 -9444 -6642 -7752 -8502 -4657 6587 14303 15163 18795
14933 18795 7398 1344 6752 6533 4063 -10512 -28547 -23555 -13705 -387 1417 -944 5130 6983
14919 6983 18733 21021 17398 10546 4187 8314 9881 -7621 -12359 -21986 -27661 -19428 -13416 -5022
14905 -5022 -2882 -1208 -885 3965 7370 2184 10892 9281 -687 3995 2145 -5390 -12524 -2573 12497
14890 12497 13807 -3589 -9887 -663 11717 22397 15606 11223 14363 2760 -10094 -9198 2780
14877 2780 7102 13969 23002 25450 15485 11622 15104 30453 33615 14206 -8960 -18138 -14683 -17373
14863 -17373 -24146 -8226 13414 2183 -3157 4862 5027 6433 17354 15618 13519 13935 22494 19459
14849 19459 -6965 -9612 -498 12508 24223 22262 20388 13542 13114 16412 21936 24683 22730 1044
14835 1044 -748 5959 20778 19648 7775 -6419 -23092 -16208 -6055 10662 21574 16706 13869
14822 13869 10707 12485 557 -3180 -2315 10155 15855 -3203 -8694 -6323 -529 -2896 7559 3371
14808 3371 -8023 -8299 -9757 -12580 -498 8386 8650 4791 6849 4028 6127 7750 312 7485 13223
14793 13223 22194 14725 11381 19682 23758 21593 4013 1914 23922 24425 12082 15638 21481 18010
14779 18010 11864 12719 17647 9138 3384 6665 8865 6677 -6304 3012 20383 22002 5126 4449
14765 4449 7024 5486 -2693 -4062 -13878 -17169 -4386 15565 22051 15429 -235 -5931 -10518 -10228
14751 -10228 -4867 -666 -12584 -23324 -11153 10163 27258 6280 -6289 12163 27206 28453
14739 28453 17843 8940 -3182 -9773 -129 22541 23124 16542 53 -4485 -5187 -12378 -10606 2473
14725 2473 12034 12552 15998 27906 21383 2796 -2268 -4297 5061 -759 -2939 -3929 -969 -5178 300
14710 300 17506 8081 -2104 324 -3757 -2786 647 8532 5464 -2051 -12394 -16658 -18152 -1526
14696 -1526 2784 479 393 -18729 -27455 -20932 -22266 -3812 9725 9607 6049 10085 2808 -11216
14682 -11216 -26493 -20960 -3778 -1111 -6116 -8756 19791 23416 12737 16112 18662 16987 10136
14669 10136 19679 8221 7124 5368 -1280 -5157 -6286 -7035 -8103 -7126 5352 1969 -19692 -24335
14655 -24335 -11265 -5316 -4647 -12992 -21587 -16359 -18561 -26132 -23444 -27574 -35119 -31836 -21314 -18834
14641 -18834 4845 13032 -1915 -7972 5483 15640 10036 -2904 -6462 4123 12645 11585 11365
14628 11365 14936 4011 5776 15383 8040 -11908 -21860 -149 11730 10223 -3804 -18049 -31762
14615 -31762 -12303 13854 18284 5204 863 -4174 1047 5118 16234 29485 30274 10327 1324
14602 1324 -11037 -19066 -23955 -13357 -1163 5186 5612 6391 -2008 -19714 -19456 -12061 3092 6636
14588 6636 14642 11218 4599 12782 11974 1056 -12264 -8506 6226 6658 12604 8573 2530 24019
14574 24019 38366 40352 36232 27218 15094 22245 17842 19794 19252 6535 1981 6284 12098 3118
14560 3118 -4166 2285 12795 23683 22958 12694 8444 2863 -4291 -18929 -24492 7845 26575
14547 26575 14209 18954 25018 13588 -70 2783 -568 -849 11322 9606 -247 -3046 -13164
14534 -13164 -23152 -11790 3334 13688 20983 29280 14842 11444 2535 13795 27650 32410 31790
14521 31790 19645 -2267 -865 13298 9817 3689 8751 13856 -7419 1717 9896 26041 29951
14508 29951 29339 36398 25461 33810 29493 31623 30849 6552 -15387 -22779 -6584 -198 -1046 3798
14494 3798 14664 398 -11964 9512 17949 21108 4349 -3285 -5674 51 8243 -15579 -16639
14481 -16639 -15481 -7813 506 2800 9462 17855 15485 15732 9999 -3077 -13485 3358 26195 28948
14467 28948 23314 21047 12223 11903 7464 -4968 -3646 5819 7983 -8660 -10286 -1579 -8065 -7147
14453 -7147 -3728 -11031 -111 6457 -620 9433 21938 18519 17863 22679 19371 21747 22196 15850
14439 15850 9286 6667 2801 -5772 -917 -12434 -9314 -4763 -2831 7023 10303 -2638 -8038 -9371
14425 -9371 -5346 -6105 -9076 -17568 -4858 -1258 -6118 78 -1035 5921 18581 11066 21514 13053
14411 13053 -7266 -13926 1963 19186 23195 4225 -10927 -48 -3430 -10352 -5588 6606 11904
14398 11904 11276 4598 21033 33404 41884 29514 12735 16809 32852 34458 18302 11403 9766
14385 9766 14400 3377 -5634 -298 -57 7408 5805 -10372 1876 2313 17145 25124 11114 14428
14371 14428 19888 15599 13869 23741 21613 8318 14951 7611 2405 -6521 3738 718 -7494 -8412
14357 -8412 -15341 -7348 4723 9050 10710 20079 11839 -7229 -8515 924 11379 2582 -11033 -7747
14343 -7747 -11850 -14540 -5678 -16278 -20794 -25923 -31831 -34405 -22448 -9706 605 -7570 3763
14330 3763 13542 12200 17451 19153 6123 11985 -3246 -1632 9438 10202 8349 248 6100 -1050
14316 -1050 2754 18366 27077 27100 16392 16262 22351 12708 18210 31838 24208 24024 28188 18319 11456
14301 11456 16501 9967 4228 20493 31384 35257 25460 24201 6201 -4658 1272 -1040 -6307
14288 -6307 3881 7658 16173 19435 10409 11334 -3159 -6033 1121 10001 22676 28676 28895 6702
14274 6702 -693 -3408 -10954 -3717 -844 -5087 -17072 -17529 -20800 -15783 -9345 1328 13398 25586
14260 25586 22962 17454 29188 29512 16995 13599 9203 974 -6378 -3578 5250 -792 -3871 3254
14246 3254 4957 -7137 1729 11764 5129 2075 11899 9768 14804 22881 18615 13939 15723 9200
14232 9200 18145 13313 9511 9892 16511 9530 2924 13368 15138 14382 19485 25996 17432 16255 20856
14217 20856 18102 7803 13972 14060 2788 -6097 -10720 -11759 -3606 3760 -10524 -14180 1244 6357
14203 6357 6576 1449 940 7643 9413 5786 9241 7420 147 25557 37398 16131 8737 17839
14189 17839 15328 1465 1036 4642 21160 25609 8324 -9094 -8992 -7409 -4330 -17334 -12975 -459
14175 -459 4106 6219 -4055 -21334 -28074 -29431 -22604 3338 9289 9445 14817 3784 -4278 -6774
14161 -6774 -10709 -463 1107 6897 4212 3653 -7433 -12366 3122 -1239 1907 4367 -1067 -4227
14147 -4227 -9746 8336 21823 25058 34689 37947 39241 36372 26709 14319 8460 14473 11918 -934
14133 -934 -1093 -210 -1467 13713 10999 1034 -1488 11290 8881 22241 30745 34825 28318 30586 25627
14118 25627 16392 19751 18918 1814 1454 -7378 -2108 11317 12602 14536 26965 28858 8985 955
14104 955 4840 2545 4171 13483 13559 3805 -809 4539 9907 2076 12101 16492 16140 22607 25409
14089 25409 28675 22135 17225 9127 -585 2495 7842 5732 1904 2627 4792 -8168 -12487 -3813
14075 -3813 16 8059 -9451 -18459 -10356 -5649 7985 13234 7584 7425 2688 -2713 -849 17871
14061 17871 25601 11619 4327 7383 18576 17731 14581 11050 641 -2494 10150 9293 12060 5599
14047 5599 4499 7258 7267 19145 23698 23865 14210 17242 30109 33859 35661 16182 -210 4959 2348
14032 2348 -2830 5991 12986 2969 4593 10121 16108 6387 4796 9819 9713 5839 8606 4752 4709
14017 4709 -11638 -13978 -4683 -5158 -4392 3395 8252 -3759 -11233 725 1409 4095 952 -5536 -5439
14002 -5439 3777 7054 -7808 -15013 2514 13375 214 -8160 3145 7005 8502 4949 1254
13989 1254 2910 5642 -6289 -7398 6229 13414 12011 -1765 6694 2058 10688 14352 9663 17928
13975 17928 27639 30513 26144 9588 4284 4675 9678 7758 14827 19467 10552 4335 -3414 -14637
13961 -14637 -17299 -7530 -3879 -4532 -3202 -4746 16264 21928 9562 565 -3233 2320 -3210 13648
13947 13648 11508 3466 -9186 -16769 -8423 7825 14760 15661 13719 -6886 -23573 -20560 -23228 -6306
13933 -6306 1231 10098 2812 -5714 -3992 -14294 -2129 8422 16326 25235 25239 7790 8413 2124 7224
13918 7224 10199 4893 2415 8404 16581 15002 9809 10757 15382 2102 -9329 1256 -4833 -2530
13904 -2530 -2 14193 29974 32846 19687 11918 -901 5193 13180 7333 7569 9356 9358 12414 8771
13889 8771 1839 -2478 20647 31352 13300 7937 16222 23999 13914 20121 24333 22139 25955 20850
13875 20850 5604 -1446 -3853 -28988 -29680 -15604 -6588 4247 9360 -502 2030 2874 6542 8492
13861 8492 2997 19109 24280 18576 13393 -5682 1066 5634 -11396 -10766 -1920 -1666 16156 25852
13847 25852 13503 584 1336 -1628 -5615 8894 17555 24041 22941 19416 25130 17554 30222 31838
13833 31838 18804 18635 31003 36858 34244 21532 20028 16244 31027 26024 -5951 -7105 -5257
13820 -5257 -12261 1487 11454 19471 13806 6962 5651 11845 13263 17337 6842 6432 -5908 -22747
13806 -22747 -7439 7879 22226 32311 29329 32344 32548 14871 10323 26697 26747 14910 4961
13793 4961 6203 11124 17449 14192 7355 11195 928 -8679 -670 556 -10578 -11271 -10314 -9815 2019
13778 2019 14811 17311 22676 18138 17404 15439 7289 10556 12920 22674 16957 17705 31401 32343 23463
13763 23463 22465 27867 28522 31725 23560 16642 11747 -5252 382 3062 3283 12545 7702 6951 17313
13748 17313 18600 15610 9910 7695 1799 -126 1617 18107 30531 26427 18741 13306 10275 5354
13734 5354 5915 1938 12538 27169 15672 10757 3059 -1719 8426 6497 -9835 -19036 -29984
13721 -29984 -11901 16145 24425 29760 25901 8216 8849 8337 7891 7385 21279 32119 30139 20662
13707 20662 15198 15120 17982 15850 10149 8157 13062 14409 13030 6762 -1987 -5125 2713 19163 18735
13692 18735 19142 17371 21122 12772 7353 9185 254 780 21881 21456 14841 -2827 -14084 2143
13678 2143 13166 17014 17349 18032 15102 5052 -1451 2499 4061 5941 19244 20592 23282 17778
13664 17778 9020 1298 -4631 -13348 -6242 4175 7173 -6591 -3755 1109 873 -324 1496 19070
13650 19070 35014 23493 17322 17114 26353 27786 26276 23791 11797 11554 13287 20010 19743 22009
13636 22009 19554 24473 21481 23770 22630 26362 29139 37708 19825 17745 27723 12561 -3440 -19370
13622 -19370 2242 13958 11544 15971 23911 31276 25152 18843 16892 24856 22850 8984 -715 -5538
13608 -5538 -3670 28071 37009 33848 18065 -6085 -2888 10639 10187 10858 23021 22865 23212 16437
13594 16437 10797 -788 -3116 4097 12818 27028 20654 11089 2074 -9084 -7204 3243 19152
13581 19152 25184 23927 19685 12548 6302 10066 23938 18478 307 -1167 9438 20845 23498
13568 23498 24662 19659 8839 -2818 -2284 -739 9052 11800 12656 12362 32776 38714 27080 17934
13554 17934 -731 -14217 -10944 -4447 1031 -3075 -3902 3177 -3638 -11741 -6284 4605 9783 -83
13540 -83 -5262 6 6036 22690 23763 17210 17607 29619 16406 4182 -7864 -7418 -9767 -3405
13526 -3405 -1367 1400 9132 31265 33602 30931 46745 43683 12127 -14821 -10996 -2605 -11 8440
13512 8440 6702 1629 3425 -2674 2642 14326 17970 23728 16323 15760 24841 24497 27458 23442 22404
13497 22404 18434 10078 6831 14789 12428 14910 13282 14134 17535 26360 31974 22588 25698 34144 26393
13482 26393 28565 23230 11175 18743 20514 9840 -1829 -6954 -4355 2819 16276 19853 14845
13469 14845 12442 21005 15716 18249 18486 7843 2296 3359 8635 12544 9163 5470 11199 13560
13455 13560 9335 16093 28033 34054 21114 20622 22482 18707 1587 -10102 -10121 -11448 -696 -9328
13441 -9328 -5520 2014 10704 11028 8011 6964 8124 4538 2745 10135 17290 12802 18471 19856 -718
13426 -718 -8058 2537 19372 22325 28898 21341 16153 3296 7370 5015 2618 -5191 -9048 -11501
13412 -11501 -6154 12248 10647 16519 24695 26804 27426 25579 17032 17876 26208 30333 18668 11909
13398 11909 19661 23074 36239 20939 12103 17278 12203 9765 9095 15202 -222 -8700 -580 4260
13384 4260 6707 6646 5395 11236 -1660 4877 14772 14383 14959 14575 19102 40292 51771 40346 21625
13369 21625 18529 25042 28618 29114 48584 55615 38648 25022 29247 20362 15661 12628 7166 15354
13355 15354 21765 23302 30820 27826 23897 11009 -3322 3375 15042 18542 9219 15387 25652
13342 25652 39697 37000 20755 32609 23333 12133 11900 23801 28134 34578 45702 63518 61151
13329 61151 59537 40726 27987 26070 23259 18263 13416 4201 -1760 -1080 6360 12287 12328 13631 22211
13314 22211 22233 30865 42968 50821 33045 11491 3455 -6982 -5037 -5587 -6180 -6893 -8988 -6587 -3252
13299 -3252 19036 21132 7767 -834 5896 14206 29970 20712 12957 6981 -2688 -17878 -13460 6776
13285 6776 16034 11923 6768 1544 10878 11157 10087 18186 21218 9848 12217 7820 4773 3469 8317
13270 8317 5967 10080 18419 20091 9740 20682 40964 42299 37067 27295 17842 14636 29497 37434
13256 37434 38897 34288 17336 16096 26404 25931 19638 21305 24551 21313 20452 18227 17891 24515 32936
13241 32936 43852 33310 23377 28207 20795 12889 14072 19694 22767 14704 11569 12049 3424 6083
13227 6083 16485 19215 33054 22128 17608 17842 27904 31229 30830 22785 3134 5623 14064 18673
13213 18673 23918 32108 39205 33810 26522 20823 23391 33717 40951 33696 27894 30465 19541 15274
13199 15274 14685 19171 20914 24415 12815 15895 25320 29337 30571 17057 11425 13028 16324 13792
13185 13792 5789 14960 13824 12852 11380 22841 24306 20228 17405 24772 18990 25925 27625 16533
13171 16533 20768 9363 3362 12736 13927 14654 18128 16378 15539 21944 33400 33522 20421 10570
13157 10570 10460 22945 37685 32410 33610 36145 34642 15866 15350 17318 28583 31572 17559 17790
13143 17790 25685 18489 13495 -3146 13834 18067 20293 11816 11397 30532 36392 37786 39591 24773
13129 24773 13512 18482 16536 24677 33301 35647 33264 27789 35825 36223 19583 3172 581 6920
13115 6920 20322 3615 -2932 3091 -276 -9227 -3236 10640 12839 7865 3069 2023 2961 9714
13101 9714 14339 -4848 -13910 -9648 3725 2176 -3618 -6770 2439 16193 16539 11630 3354 10872
13087 10872 13866 12938 27266 33921 38525 34969 44418 29508 28151 33018 33751 27989 26064 31671
13073 31671 24292 24732 29174 27254 10688 -5530 -5615 6703 3052 11060 12415 8535 -3612 -9026
13059 -9026 19077 33276 26028 37210 45181 41180 35634 33720 33780 31094 20686 16951 14094 11471
13045 11471 7739 14627 9676 18620 37520 40950 39928 36403 47661 32006 16253 22910 40105
13032 40105 45043 44451 31366 16013 14825 17682 17544 31319 28094 31976 35154 37720 39472 31361
13018 31361 21988 26873 33300 41286 45187 36044 19432 -1994 -16157 -1259 23026 21788 15501
13005 15501 25177 16187 9912 13853 15439 23008 16117 24680 15736 9179 9943 22417 36414 37877
12991 37877 35354 36765 26698 27046 30331 22640 23598 21841 22859 37193 51912 48707 52144 43494
12977 43494 26678 15669 26435 37997 24542 11964 8187 12507 23408 25694 24531 30499 24102
12964 24102 19094 13768 9070 16509 19278 18026 24559 29508 26075 31179 23598 14508 15628 31686
12950 31686 36438 46189 42719 44454 39520 38911 35616 36280 30155 21893 29890 29841 46097 60955 46559
12935 46559 31640 43649 50218 50430 36650 36443 22262 25140 8226 390 8613 32013 36933
12922 36933 27666 32896 22988 13578 16314 913 -351 6853 18379 6955 5081 13106 8955 13013
12908 13013 33270 46236 44683 49241 55410 45733 37319 29240 32010 31806 32110 33977 44296 40424
12894 40424 30664 34568 40371 34553 34247 39337 38201 32909 42099 46537 50766 70302 71691 54909
12880 54909 34795 26441 33141 38446 32076 27578 28278 28797 25407 22605 27026 41424 54152 41435
12866 41435 33456 34433 27086 13799 22984 20452 23626 31426 33288 22888 25592 25859 23732 24686 27218
12851 27218 27772 13886 22559 24811 28962 43460 32511 28052 25010 21989 10555 8077 16790 28802
12837 28802 42089 33369 29095 36802 33299 33056 34688 42740 45153 39151 36875 29753 23992 23643 36626
12822 36626 30594 28995 27414 25060 37342 52611 55042 55856 70357 66696 56285 44187 34111
12809 34111 35575 43723 40877 43959 53894 66884 75716 62622 57757 47917 56793 64967 53315 47522
12795 47522 29532 21098 33596 40663 48085 46109 48411 36881 51033 58057 47688 48404 61439
12782 61439 63425 65264 65250 67044 54826 51793 64880 61700 42851 45284 60286 64830 48523 41422
12768 41422 43956 38548 32807 42161 41417 36098 25856 17313 13892 36703 62541 76979 70775 65620
12754 65620 56825 53693 68922 66578 62234 62905 63568 68153 71533 75244 89046 94412 76192 56295
12740 56295 40471 43533 61307 64585 49303 51733 62518 68411 54482 53905 61441 57202 53898
12727 53898 55592 46687 50689 44710 33811 38690 37922 37479 36024 46353 51923 50264 52812 49564
12713 49564 36728 33686 40242 54960 50386 44037 59132 70413 63600 60611 61477 68216 72239 85707
12699 85707 85776 74535 43734 41767 48789 58012 60755 70031 58101 34575 24705 46423 55337 52523
12685 52523 40419 33959 40169 39057 43692 50915 42522 42789 46436 43016 53536 72099 70792 60601
12671 60601 50494 44001 56949 62780 58338 44983 52848 55851 62932 48870 43458 39938 41115
12658 41115 46152 45640 39038 48393 44521 47041 59546 58815 63827 62387 58425 63781 54596 49263 61741
12643 61741 68793 77733 74672 52531 49072 58534 68705 71001 71200 65441 64443 60977 53577 51307
12629 51307 48053 59278 69419 57195 57158 73234 83060 64196 54262 53109 45420 36901 46663 45172
12615 45172 32026 53132 63821 69997 59348 46359 45855 44950 50980 53037 61387 82696 78334
12602 78334 74193 71783 64007 56904 56547 49865 58209 65104 68638 58779 49772 46732 49353 58074 70239
12587 70239 71612 80323 86095 84204 76882 55663 47468 49282 54017 46384 27780 27736 30588 33402
12573 33402 41329 37770 35779 43533 48959 56350 55354 57812 70146 69741 68828 75148 79395 83272 77936
12558 77936 78652 69455 78250 78177 72332 77834 75871 71934 78676 90800 87639 76375 94863 103400
12544 103400 97410 80537 83171 79258 72929 70739 73431 84491 80371 67167 68944 72259 80489
12531 80489 89596 93066 93431 92859 93293 82828 86693 110510 119059 109788 95969 81949 75058 69665
12517 69665 75292 77566 89483 89057 80019 82994 70059 65733 58950 64523 62020 61671 79927 80039
12503 80039 71405 67228 73677 82376 77760 76427 76963 60404 71636 80731 72952 61422 66285 79827
12489 79827 93225 98790 107330 104389 97663 99886 103716 93059 84057 91963 89671 83203 91511 81752
12475 81752 85175 95543 105069 92211 94996 101703 101891 102035 104029 93027 86865 80003 77395 98943
12461 98943 105540 88283 84715 91651 88950 93081 100729 114707 122295 113752 98574 92225 75977
12448 75977 74835 81510 79599 87868 97016 99766 105789 104508 101503 98191 109246 125381 116528 107637
12434 107637 118282 114671 108293 114818 101262 87134 88262 106723 123627 116672 108998 98474 89905
12421 89905 105551 127323 128382 131854 128073 125209 124614 116942 120907 128478 129666 122517 132852 135753
12407 135753 121435 121862 130122 143214 139811 120349 116457 116940 119659 115190 102044 115373 127542
12394 127542 115192 97577 98255 116121 130529 134797 135895 126923 118836 115541 122900 120013 122793
12381 122793 131413 155008 157356 148229 148038 147089 155921 145749 146949 155960 154128 147004 129825 117643
12367 117643 109897 122108 121859 128784 140101 129412 129778 131317 137889 141734 144409 149791 150788 154550
12353 154550 154801 138652 131029 141827 158374 153427 162392 163018 155481 155047 142795 148909 152258 132519
12339 132519 125828 124312 129447 141192 140863 151702 163884 173587 181732 189279 186949 177186 167247 178304
12325 178304 176206 170823 181303 171948 169695 174232 170212 164342 168893 169379 169087 172815 173168 185056
12311 185056 198678 189320 182800 180543 170599 155111 149501 151308 158645 176931 203591 200467 203071
12298 203071 195573 195698 198116 197897 210991 210249 209529 212773 228969 221189 206787 206556 199964 197195 199782
12283 199782 198466 197761 196816 197811 186752 183447 193043 208861 210022 215077 205678 208597 219263 218323
12269 218323 218207 221293 231240 237867 235074 228260 227811 229521 216960 219969 223715 228080 226970 235078
12255 235078 237512 247202 240814 220358 212955 216268 222387 231935 248956 240670 237863 242431 245067 245037
12241 245037 240230 243410 256469 262571 263057 258309 250639 259400 255674 266999 269491 259151 256765 259183
12227 259183 261963 267448 275955 275348 272766 281568 283545 274010 268973 273363 287086 296884 302527 296899
12213 296899 301294 297529 292346 289140 291913 287736 288270 282232 289079 301427 304058 298881 313217 309425
12199 309425 312354 311510 304482 313816 322135 334688 334443 318150 318928 315744 328219 338300 338209 344633
12185 344633 350532 350450 363249 362858 368406 368751 366674 354306 355024 366782 367886 371836 360263 362858
12171 362858 383540 377308 358156 354537 374541 381559 377746 385565 390217 384306 374079 372181 386910
12158 386910 397595 401753 402747 399779 402350 406036 402707 403146 407551 423980 431620 422735 425814 424602
12144 424602 431288 437680 450752 457706 450074 457531 457937 455257 467762 479536 470975 457223 457357 453516
12130 453516 444588 440066 454175 463796 470188 473727 482526 493680 500051 500446 486489 477212 482783 504739
12116 504739 519963 522254 528149 542949 540165 531398 523828 528825 542096 541062 543493 538470 536701
12103 536701 536345 535918 539179 545014 538130 530765 546346 556184 560001 569844 592812 606770 622463 600469
12089 600469 590180 603340 629225 640796 640399 639781 634436 622889 630452 642872 656344 666208 677699
12076 677699 689197 683819 693304 685316 681205 669461 684590 694438 702201 694073 696791 705366 709022
12063 709022 706162 701398 709694 733083 745268 749235 752472 763809 764370 761131 769709 781423 780725 768486
12049 768486 761404 760336 769594 786846 794496 792010 791713 794693 799922 810516 819085 818128 815068 825219
12035 825219 844845 854009 853422 849441 848982 848952 868198 878546 880461 890433 895656 888863 888025 904468
12021 904468 913508 930664 930548 920094 915953 920427 911960 908642 920332 930646 935520 941574 957704
12008 957704 962661 969719 987690 1011380 1001782 1008367 1006223 998832 1002637 1002379 1004218 1015242 1024686 1034497
11994 1034497 1028099 1024240 1014995 1022018 1032519 1050718 1069642 1060967 1039095 1045410 1056067 1056004 1053682
11981 1053682 1062578 1059222 1033482 1038954 1058795 1066820 1077898 1074708 1069988 1073075 1084958 1091775 1095752
11968 1095752 1100580 1091355 1087690 1096007 1089313 1097717 1108762 1116115 1120287 1119305 1111325 1125394 1122869 1117370
11954 1117370 1112754 1114057 1124073 1118240 1104616 1114660 1119461 1121739 1120213 1119051 1107565 1107910 1099678
11941 1099678 1090798 1095614 1106206 1115271 1115165 1110770 1103398 1090256 1087165 1093901 1095932 1097747 1104899 1099968
11927 1099968 1080667 1076293 1067709 1068526 1083185 1100860 1103024 1101029 1099131 1089254 1090599 1080990 1070874
11914 1070874 1080532 1084599 1075707 1071507 1060603 1053838 1052421 1052283 1057238 1046730 1028047 1011682 1000469
11901 1000469 993926 1001712 999964 987934 986493 996613 997856 987535 977764 967312 972582 977257 988786
11888 988786 977900 964213 964901 970317 974556 961278 943109 933679 930211 926735 932713 930619 926243
11875 926243 916050 899259 880216 874965 879330 889801 893809 884549 868126 861388 843688 837174 837770
11862 837770 836755 840142 842907 851845 853429 852719 830985 806760 805504 804941 807269 809538 791963 783286
11848 783286 778500 778657 786305 780240 768905 755527 747150 743572 728292 718390 720127 718360 714780 718679
11834 718679 723778 721892 721055 714279 717120 720194 712574 708513 708300 694775 675366 664031 664716 673502
11820 673502 673056 656555 649566 646494 659525 644509 619379 622406 627101 627794 628754 632084 613970 602492
11806 602492 591364 578153 571234 590029 612159 606503 598338 584230 583596 588777 581970 570577 572142
11793 572142 564963 560416 558658 551016 544617 536585 544384 532974 516374 519478 523291 503971 493471
11780 493471 496117 502021 502195 494406 498125 489135 498252 490844 479304 473275 467518 481130 486585 492985
11766 492985 483617 462710 445211 440065 443593 444641 449560 449394 451263 454031 444897 437273 429777 427765
11752 427765 435110 434966 419061 421223 416588 421337 432390 428703 426945 406769 394528 398752 389426
11739 389426 394538 393649 382712 374799 371977 378932 388916 371974 353666 356600 356539 357530 366795 365452
11725 365452 349900 348907 357163 372038 367150 367089 343688 340239 340491 343287 347703 339612 338052 337535 335414
11710 335414 327807 337202 345983 341985 325648 321056 323672 322892 307943 296033 298959 299403 304620 302276
11696 302276 308392 311492 310484 312267 297706 292983 291563 299948 299755 308429 305570 300648 300727 286417
11682 286417 268883 271885 271064 269379 266454 281801 294117 284231 272767 263901 261562 262060 257537 268517
11668 268517 275098 274522 282815 289887 288394 285115 283289 279950 277666 263963 269830 273040 262414 248982
11654 248982 242449 242310 233837 227421 232091 226099 222268 216218 218567 218787 219356 215212 216550 225550 225455
11639 225455 211384 199417 201130 209658 224790 216895 219064 214807 203260 210395 215434 202343 180446
11626 180446 187334 203893 201437 192958 186917 195339 189948 190618 198814 206785 218433 206611 204291 194344
11612 194344 187719 195428 203699 213979 201386 207497 206438 199373 198876 191561 191576 192613 193283 181367
11598 181367 186738 189923 198123 206004 200813 204535 193131 186186 173142 180408 172091 161511 170709
11585 170709 171682 166580 162638 171762 174122 166948 166110 169742 175370 173947 168678 167149 164068 172092 179202
11570 179202 156023 156038 153277 153962 156302 162612 160054 149946 154835 150995 153199 145346 134813 130701
11556 130701 136057 118222 106812 113772 124163 134100 136807 135925 141467 146716 144951 137109 147193
11543 147193 151790 150605 144987 136939 127592 139706 155523 154095 145308 148110 152969 149160 137457
11530 137457 130290 143606 152609 147046 150948 154584 143239 151726 162249 156342 163624 161128 156803
11517 156803 156942 146337 141285 143253 143220 141514 155018 151601 142989 144698 135121 122969 119431 118951
11503 118951 115733 120252 128964 124732 117256 104764 97149 105944 112995 114382 140552 134474 135692 146028
11489 146028 159501 155667 148644 150299 156234 149826 145572 143733 143021 134795 119903 124642 147500 148380
11475 148380 126807 117384 126243 135113 123740 116945 122475 124396 113652 116106 121413 105886 112804
11462 112804 131765 126334 121917 126743 130187 128145 120806 116887 108091 100209 113299 128419 106895
11449 106895 97034 92966 92251 96581 103189 96927 100378 95524 94075 115311 120575 99757 88748 102361
11435 102361 111652 120356 114959 118403 108915 103864 102191 99456 113411 110057 110669 111485 112703 112856 113521
11420 113521 108344 109197 109190 111207 104860 101251 108949 107151 106703 110339 115312 113237 108225 120099 117454
11405 117454 111490 123814 122415 103477 98771 95376 97320 97076 97990 102994 104079 98348 101140 107809
11391 107809 112605 115400 115645 105106 94548 100445 100684 105386 112960 100565 96251 90517 87933 91000
11377 91000 114915 119319 104111 110815 112948 108846 112554 108432 95833 95724 99363 95947 84934 91452
11363 91452 89615 87922 92617 98974 114774 104667 94221 85194 81321 83950 79620 92493 100637
11350 100637 90708 80218 78031 78829 76815 80950 103226 104524 94745 94448 89606 98306 99207 89050
11336 89050 76584 88796 107323 95912 90715 95870 104378 104830 104903 103722 114944 120935 126256 132794
11322 132794 136079 137191 118235 101563 103111 105176 104296 109968 90930 83052 87785 104920 102796
11309 102796 88789 91672 84730 80135 84774 83128 69416 62397 70015 70241 78771 90973 106286
11296 106286 102099 100391 110378 129278 135804 140897 144640 141493 132451 133457 136228 148282 162052
11283 162052 187878 209122 224285 260058 302938 348404 406377 500401 655123 894662 1231357
11272 1231357 1682016 2161027 2375213 2214338 1880943 1528209 1194275 916857 720569
11263 720569 575583 459284 374491 317911 276317 243971 217693 207699 199523 195611 185124 169203
11251 169203 161639 165187 163098 163152 165611 164340 145024 118839 118757 128762 131070 122894 110230 107598
11237 107598 101350 104750 106179 112903 112215 94691 99514 92561 86562 86072 81828 86314 87966 79604
11223 79604 79505 96577 113492 101789 85842 83291 83529 97538 90842 83433 85699 80564 82264 82165
11209 82165 80464 83790 82758 87270 90326 92977 87608 91345 80397 68909 76840 76060 78872 77212
11195 77212 74958 78171 84910 85279 79580 76177 73597 78752 91556 95905 90448 100874 122017 125086
11181 125086 101433 99942 106275 100254 82779 48665 31975 31121 25389 30468 31934 49180 54409
11168 54409 66544 56689 58373 69964 70947 79575 91290 107451 113136 105334 112219 122914 107142
11155 107142 96932 95982 88847 91471 78566 64264 65324 76469 72482 71156 73546 77421 80025
11142 80025 94647 94563 82113 65711 66938 63444 72236 77925 80698 85130 82848 79483 80409 82904
11128 82904 77112 79443 91796 101769 115911 165102 220328 269783 345912 440305 510915 524222
11116 524222 490716 437618 396469 356372 312131 258802 196877 127227 77227 53268 45901 45619
11104 45619 65094 80590 90397 91883 105718 97909 104455 123002 140691 152904 147665 136239 140025
11091 140025 145226 159188 141616 126867 129460 133907 137643 129350 119260 115062 109182 104552 103688
11078 103688 109152 115727 115569 121299 141243 142834 154435 165761 161652 152372 135721 135949 136439 123308
11064 123308 120310 132166 129627 123546 135963 165102 193743 228660 233082 217710 192842 151897
11052 151897 95019 70108 65102 73659 72704 89133 117577 133684 134190 155253 162985 171076 182581
11039 182581 200446 194785 189658 206988 211342 217095 237626 249699 241866 235159 248575 255086 251019
11026 251019 265339 293886 302819 305566 317961 334199 357981 379472 391678 404195 397650 377214
11014 377214 360813 342654 310590 289046 302834 308470 315071 313400 299360 296118 292350 296993 295437
11001 295437 292003 271375 286866 289337 281471 292116 331266 401011 566859 866610 1243850
10990 1243850 1509941 1535982 1374143 1160343 845123 448224 181040 94736 98375 134019
10980 134019 186334 219679 237982 260371 270799 277938 302456 314294 304376 277185 256617 245008
10968 245008 247791 269365 292922 311018 316353 317654 307173 288129 278641 273665 272944 300218 324365
10955 324365 356584 378657 383372 397134 397327 395378 405835 417252 442511 463754 483175 504899
10943 504899 515228 510389 507614 507310 516654 529880 536009 551228 567332 570213 568656 576375 584738
10930 584738 607463 630278 646743 676309 728143 775514 804831 830871 852749 873835 893920
10919 893920 926453 951851 983507 1007735 1022881 1029797 1059489 1088808 1144703 1211234 1277621 1329895
10907 1329895 1392866 1465572 1540263 1633055 1750204 1863082 1990227 2112504 2222787 2328979
10897 2328979 2438415 2567778 2711255 2889635 3104171 3334469 3605892 3947355 4359905
10888 4359905 4871615 5524339 6348872 7306747 8185949 8707170 8995057 9297409 9723435
10879 9723435 10349916 11255896 12474343 14040875 16025849 18530385 21728697 25861629
10871 25861629 31194055 38167052 47569103 60871128 80491471 110058941 154651700
10864 154651700 220669483 310864477 400446892 431403856 392876636 326681504 257345844
10857 257345844 194327356 144660222 108822720 83552683 65583961 52448654 42518809
10850 42518809 34879231 28979090 24392665 20827615 18033531 15825688 14040881 12580264
10842 12580264 11402852 10485252 9820029 9413831 9224019 8982489 8428172 7668800 6899212
10833 6899212 6172200 5561515 5056980 4642791 4288558 3963350 3671890 3418564 3190185
10824 3190185 2985614 2803690 2645066 2524494 2426541 2350897 2268307 2192491 2110009 2012330
10814 2012330 1921818 1843350 1777563 1711599 1644835 1589867 1524683 1441333 1364394 1307060 1255798
10803 1255798 1205653 1166464 1116215 1050145 1024336 1014865 1002592 994303 979812 954884 917950 892398
10791 892398 875760 850518 821156 795738 766437 739667 716039 689987 674103 658154 627051
10780 627051 590698 579634 560565 545388 551782 554269 539805 530829 521107 502770 491988 479487
10768 479487 489277 489376 493648 493538 491490 479956 462714 453854 437674 430864 419926 420121 425537 417417
10754 417417 405907 406368 414363 401064 382954 384085 379554 370577 373490 381941 384259 391785 422603
10741 422603 458482 532323 637164 764280 876543 959113 978454 856980 641705 450629
10731 450629 297325 243301 243994 255642 273079 288070 289037 281650 279430 253352 242975 244910 253865
10718 253865 265808 264788 259259 270519 264944 242769 204603 170539 142583 132654 142945 141730
10706 141730 125307 115721 107962 102117 111950 119497 112654 108972 115845 113790 128253 136415 145234 145390
10692 145390 138596 133716 121304 116724 113852 114346 113928 117466 125003 124137 129455 146314 148774 134110
10678 134110 145887 157551 168347 187735 220813 245047 238727 228642 183378 135879 115620 107829
10666 107829 92786 87732 89367 97336 105190 134883 163620 169845 178533 172138 163689 172442 174327
10653 174327 178275 174338 166865 165883 169791 178464 200028 226761 234159 224704 227613 241848 266457
10640 266457 284848 309918 302746 284914 276045 294539 326257 345222 382789 429254 474734 513211
10628 513211 555559 625110 698340 772503 856392 984494 1155882 1362799 1623800 1973876
10618 1973876 2462167 3113040 3936816 4892740 5824033 6539791 6893757 6932655 6809829 6687467
10608 6687467 6698456 6943798 7537494 8555800 10008090 11812896 13575892 14716116 14916485
10599 14916485 14347131 13442369 12589240 12060034 12011677 12550959 13746692 15570996 17780331
10590 17780331 19778593 20726101 20246991 18727295 16773185 14898662 13434223 12524404
10582 12524404 12219151 12498914 13268294 14290356 15117926 15183097 14327889 12854310 11185305
10573 11185305 9670675 8439747 7574305 7093286 6930733 6998879 7161079 7212189 6970456
10564 6970456 6365727 5521566 4622402 3793711 3090714 2507663 2065576 1715905 1461375
10555 1461375 1258667 1096424 966222 878931 818658 746290 676576 626438 581653 533479 476403
10544 476403 424627 389534 366745 354350 328759 303852 287964 267373 240142 229623 225156 215922
10532 215922 199916 190000 200353 201303 201237 188059 192704 186775 179621 181302 182732 187410 185413 168263
10518 168263 154994 152377 144600 147703 145716 127238 115318 115441 116867 110989 112173 121281 129225 124434
10504 124434 124279 126283 119758 102550 91359 91506 90516 97334 109111 106393 104364 95540 66297 62225
10490 62225 75522 87862 100956 98382 100651 116811 125502 119070 98474 88839 89399 92012 91604 100155
10476 100155 108576 108528 93387 94416 96687 89171 92368 111454 127361 132142 138397 134847 148727 165258
10462 165258 168958 159309 145446 154147 182833 211736 235395 273808 342811 442611 568469 747728
10450 747728 1018814 1409101 1881092 2248183 2280705 2022137 1663931 1311169 1003367 765239
10440 765239 603484 473934 386224 331952 295266 245433 202078 177328 173400 153732 145444
10429 145444 130726 98688 93289 105422 120277 124616 110320 96227 80382 66490 66558 68783 67427
10416 67427 55092 57022 68569 79401 72946 55456 42668 28565 36367 32528 31901 21238 14342
10403 14342 26555 29572 13892 9248 18446 16936 22033 15995 20538 35459 32707 33624 38865 43772
10389 43772 47839 53134 56544 57575 35749 25641 38957 53064 51041 49160 42958 36264 37075 30930
10375 30930 18811 20382 28073 31150 25391 15184 5710 2195 15895 28449 29002 9954 -3143
10362 -3143 446 9976 14853 21509 30289 25471 35777 41303 25274 15413 20385 24868 27508 31277
10348 31277 33852 26962 16843 10063 8019 12216 10174 13477 19483 32111 27790 17629 24439 41311
10334 41311 47713 35823 37153 39139 30120 31479 35109 23546 13492 19788 33260 31143 25981
10321 25981 29080 37010 28695 3585 8609 18475 14867 30828 30275 14495 21111 15740 11201 5956
10307 5956 584 18833 27330 23817 19040 30930 30430 9564 10160 34779 35834 29345 20325 13638
10293 13638 11895 7540 -41 3907 5212 14039 13840 11416 2188 768 2507 -3200 -1333 6411 7225
10278 7225 6240 13800 -592 -9150 -5407 9168 23393 32010 41838 28373 25825 26924 22243 25204
10264 25204 18821 7635 19848 27259 34180 14438 10180 21450 -1071 -8144 11297 13510 2048
10251 2048 -5216 -16947 -20078 -23142 -17561 5164 24816 24326 13249 12246 11020 -1497 -325 7179
10237 7179 9022 5299 4445 14867 12024 6191 9092 1664 6467 28187 33746 16853 10446 18982
10223 18982 33232 21880 -7264 -16376 -6145 -7432 -7491 -6099 -1302 -1695 1721 -4092 2804 -5209
10209 -5209 -15610 -5444 3431 18481 17177 4122 1329 7285 7559 -2609 2798 14116 25783
10196 25783 31321 36172 22241 2445 10371 28348 24703 19649 1875 10971 10500 9428 15487 34163
10182 34163 36951 36880 40270 38390 36715 44745 48566 55583 62206 52594 53082 58587 61186 60862 61426 67271
10166 67271 80993 84631 97148 109246 97288 85645 75002 70109 72743 86632 105898 116320
10154 116320 118487 113215 111721 117368 111513 120075 113642 82139 67580 74001 62586 67946 66129
10141 66129 78832 88137 95721 102505 103341 77822 55179 42399 37422 50730 64735 62466 54442
10128 54442 44816 47004 61891 52707 41952 24663 10908 15077 16127 14586 3383 8805 17160
10115 17160 21700 20458 15142 14701 5518 6329 -506 -15249 -11099 -10148 -320 10932 7480 9766 -5006
10100 -5006 1169 13648 19211 17356 20004 30234 32291 32465 20119 10057 12157 4340 11983 18090
10086 18090 9028 13884 29084 20985 22753 16684 7269 -6374 -14278 -10681 -1486 706 18059 32570
10072 32570 33450 27830 24029 12010 8249 -6619 -10544 -10027 -3562 8349 30117 18913 2580
10059 2580 3266 -8201 -14465 -11773 3204 4758 -11817 -14552 -23178 -24351 -23075 -39626 -46389 -28927
10045 -28927 -13818 -8455 -9857 -2652 13557 -2041 -10711 -637 -293 -14289 -15549 -20230 -37268
10032 -37268 -44767 -34814 -24818 -21162 -10840 -22095 -23331 -17269 -14144 -11620 -6472 9625 18206 5007
10018 5007 -7563 -4166 1072 -421 1084 7318 -163 13077 16375 11902 9476 15515 17675 18809
10004 18809 15644 18490 -1193 -6530 -4762 -8695 3615 16518 14451 9911 10984 15843 7541 -2560
9990 -2560 10734 28956 23722 5723 3043 -4351 -10130 10505 8328 -9300 -20157 -14536 -16516
9977 -16516 -15943 -7205 16573 27979 16935 7292 7694 8084 13584 5862 -6439 -3837 -6331 -15507
9963 -15507 -14776 -15392 -9387 -10655 -22435 -20676 -13476 -11275 3385 17781 13398 7349 6601 17423
9949 17423 18702 8736 4434 6874 15324 23827 14791 21470 16314 12581 13744 5500 8743 16243 2313
9934 2313 -4607 -2203 -1065 -9811 4406 7672 -423 -8272 -7131 444 -4905 -1881 6284 -3103 -16036
9919 -16036 -22694 -25424 -23075 -12978 -9165 -6606 -3629 -5049 9327 9782 -3245 550 1515 -1742
9905 -1742 -2250 -14248 -24570 -24099 -25011 4911 22842 31967 20842 10724 10582 11889 18246 31712
9891 31712 25333 14815 973 11028 23089 17724 17126 10070 -2552 -5972 -491 16139 20952
9878 20952 33088 38000 19738 402 -3883 -10150 -28378 -20495 -10617 -2235 10707 18000 19163
9865 19163 21004 13330 6255 -12823 -25741 -30173 -28177 -24550 -11743 -15902 -15927 -15454 -13702 -12962 -10125
9850 -10125 -4242 -3788 -2730 4619 3405 9595 7469 685 12415 9489 -8507 -10505 -12616 -1957
9836 -1957 3031 -108 3536 7536 3643 -7449 -9325 -3619 -4555 -849 -6745 -5114 -5496 9304 10386
9821 10386 2626 8656 11811 9247 -10014 -8962 -1676 1068 10080 5031 -6042 -10819 -13489 -12672
9807 -12672 -7275 -15169 -12788 9076 17627 8487 -10119 -22978 -31496 -33021 -19385 -9544 -4409 860
9793 860 -4875 -6912 4678 4768 9226 15758 3993 -5733 -3900 -2701 -823 -3582 -6128 4600 -2826
9778 -2826 -6138 -7812 -14788 -17274 -13971 -6156 9538 5230 -739 15531 16430 11726 5504 2559 5809
9763 5809 19378 20874 25582 21716 14571 6267 11286 16222 8172 -3989 -2104 3865 15799 23948
9749 23948 3246 -2664 -4098 -7080 -5316 -2616 -6974 1274 1357 10585 17004 23747 20638 17651 15869
9734 15869 7647 268 -6547 -4372 -1270 -2420 -5288 -16536 -11610 652 -2327 -2113 482 -2528
9720 -2528 4077 6557 2571 9707 2874 -4863 10606 37261 43588 25823 18894 6889 925 13302
9706 13302 18198 2158 -4101 15760 11910 -6634 -15217 -17529 -5801 5299 13971 14997 7390
9693 7390 10243 19260 17971 -11349 -29576 -31698 -22325 -648 5450 1259 -4161 9442 12765 5255
9679 5255 1245 -13917 -16939 -9317 1619 4401 -8340 -20311 -18378 -19646 -29828 -41056 -24966
9666 -24966 -12422 -17321 -22634 -15038 -16428 -10357 -15719 -24281 -38728 -40050 -26767 -14390 -1296
9653 -1296 7964 15848 23838 27439 50829 80213 87137 64489 48036 34264 17067 20809 23104
9640 23104 26962 17952 10587 6411 5193 2952 -5053 -12807 -10554 -14176 -26236 -14868 -16162 -29439
9626 -29439 -29855 -23489 -12888 -12109 -17573 -10053 4525 2213 -3388 7882 -6120 -10523 -2428 -7562
9612 -7562 -8933 -13403 -18368 -14710 -13553 -3991 -2183 -12418 -19093 -25726 -19128 -26795 -22476 -28386 -30433
9597 -30433 -20623 -20357 -9850 -9358 -15016 1526 16585 16146 10754 16068 11428 6208 264 4051 -1609
9582 -1609 2962 -5790 -7669 -936 -7240 -8527 2997 16042 28294 25633 19999 21144 6870 -27
9568 -27 2434 1679 -3655 -5528 -7506 -19212 -20871 397 10224 20583 22072 24640 23047 15352 -3638
9553 -3638 -8668 -13148 -21243 -22573 -23238 -8551 -3244 -11757 -18808 -10912 -10514 -8885 4727 6018 19452
9538 19452 10132 -9046 -3193 15057 13429 770 -11497 17 -1955 -14370 4512 9572 -16486
9525 -16486 -22681 -16142 -9200 -6022 4594 6138 3491 7831 12051 9957 -1978 -35 3255 12920
9511 12920 16404 11233 -5470 -22632 -16502 -1298 2357 11802 10793 8890 5743 -844 11636 15895
9497 15895 12854 10781 14975 11969 18894 28194 19396 21722 21600 17214 4805 -6041 -4231 -692
9483 -692 -4014 -11505 1183 -1373 -4245 -13038 -11456 6560 20147 12616 -3411 -3125 -4206 2484
9469 2484 19375 23271 26810 22880 2704 10032 13518 17859 14112 15726 13155 26010 37732 38431
9455 38431 17905 13953 10109 18479 40193 48565 31904 25661 14811 4808 -4694 934 14679
9442 14679 4945 -12658 -12130 -3401 -2358 7793 -1150 10607 16426 9547 10772 433 3352 -6570
9428 -6570 -12982 -8505 -14894 -6390 1971 847 8392 17181 21200 11458 13278 9423 -3544 -9133 -8968
9413 -8968 -1192 4649 4633 3910 11204 14111 8514 1188 18383 24966 18498 14094 3461 -3756 -21691
9398 -21691 -20344 -10638 3923 6976 8244 7551 9379 12541 11674 14080 15929 20515 14896 14083 8316
9383 8316 3439 -6292 -11438 -1685 -9427 -6736 -15866 -21511 -28921 -28031 -18225 -23389 -17628 -2723 11957
9368 11957 7363 3847 -415 5567 8506 10463 13414 14948 19790 22309 11911 606 -23882 -20487
9354 -20487 -11745 -15436 -1641 -1912 -20004 -14790 -17373 -15999 10630 20824 15616 -1980 -15570
9341 -15570 -16965 -12107 -2447 -1354 -10655 -8306 1394 8869 3244 357 -5067 -152 5382 5883 -10019
9326 -10019 -10253 -3978 -7929 -4183 929 -10483 -20497 -18372 -9156 -11525 -16135 -10934 -5180 -1128
9312 -1128 -19992 -14979 -16216 -13077 -11504 -8063 -6300 -28658 -25978 -16090 -10877 151 12772 13999
9298 13999 1896 -6121 2808 5071 19472 20057 12487 -1556 -3759 -5546 -6542 -2613 6437 6979 2452
9283 2452 3450 -2311 273 13699 17677 16946 21509 8646 2877 12488 15946 1821 -10025 -14911
9269 -14911 -16729 -14295 1162 -17964 -24835 -17667 -5485 1795 3694 10673 16140 -8555 -13911 3044
9255 3044 29612 35026 8276 -4697 836 10615 11274 1330 -13900 -20010 -18094 -20945 -16423 -11083
9241 -11083 -2710 12971 18700 27180 18195 15196 3047 5116 12817 8000 13447 7649 10096 10322
9227 10322 6360 -5989 -13600 -14570 -16476 -13817 3025 10844 4640 10730 5610 6392 12865 28903
9213 28903 22403 6862 -46 -8881 -8121 -19337 -24929 -30715 -23244 -6748 -3104 -1552 3192 -5428
9199 -5428 -8068 -3011 8173 19387 12907 22832 27484 30849 22690 17989 28351 31729 13494 8009
9185 8009 -5143 -12125 -10577 -15202 -35547 -32430 -24850 -10236 -24 -2278 -6800 -3093 -3089 26 -5729
9170 -5729 -2674 -7315 4589 10483 5204 -5015 -13261 -11344 -1105 9785 18786 24906 10096 4814
9156 4814 20396 15379 1039 2725 -822 8473 14442 19783 8572 11856 14495 9096 10060 -3000
9142 -3000 -4863 -6743 -9959 -3764 -125 5279 18167 23453 21875 1948 -14656 -19840 -20080 -10222
9128 -10222 1531 -700 -2344 -11572 -15574 -10689 -9588 -2693 -6498 -2061 3233 10660 14535 12930
9114 12930 -5098 5276 21289 20013 4076 1123 6771 14223 27567 23343 6702 -8465 -7036
9101 -7036 12051 35572 35666 25462 27081 26830 27814 20551 1884 -1973 -12009 -25496 -31355 -28583
9087 -28583 -27138 -12958 -14235 3384 6349 -4711 351 7724 5354 7278 637 -10612 -9440 3165
9073 3165 19582 16472 3694 -10108 -15976 -16748 -9476 3014 9527 2207 6567 12869 25584 21983
9059 21983 20289 25025 28390 19701 12743 15515 19643 19759 25463 22335 1109 -9582 -15424 -20656
9045 -20656 -17663 4862 18096 22472 14177 4971 4342 3145 5478 8494 4352 -4212 -6655 11179
9031 11179 10120 9111 -3364 -10688 -5205 2481 14754 20966 14211 4253 2681 -14372 -8689 404
9017 404 19080 1696 -7569 481 -8420 -14393 -8917 -8140 -19862 -12941 -1123 -3609 -5083 -9776
9003 -9776 -4841 -728 -9069 -6015 6022 4936 3734 18936 27375 36020 39082 38746 41139 46016 40451
8988 40451 30116 31231 21744 2431 5402 224 -144 13457 12574 6306 11011 -1959 -1895 -4766 9325
8973 9325 3442 -7633 -20607 -18195 -18352 -21782 -6909 -6155 -1210 -5922 6554 13288 8512 4288
8959 4288 -5917 -9975 -2302 14104 12415 5915 -12573 -25975 -15979 -23754 -29327 -18577 -5413
8946 -5413 10672 13111 -2197 4680 18199 33600 31174 18021 3611 960 3129 12835 22833
8933 22833 18161 5218 -4313 17034 10397 7930 19623 10989 -3185 -2754 -1675 7714 1032 -5769
8919 -5769 -6939 -11972 -15380 -15710 -10507 -19098 -21724 -9599 4443 741 1804 15285 17716 7502
8905 7502 -2206 7964 20102 13074 6664 5456 83 -11771 -17345 -17753 -23104 -14986 6089 9119
8891 9119 -3765 -21453 -24231 -28666 -19003 -14612 -22543 -20431 -12101 -13215 -15658 -27498 -39794 -27171
8877 -27171 -3860 -12217 -27873 -27975 -23375 -22642 -23331 -17971 -8123 -1157 -1363 359 -4857 -8200 -8187 -7509
8861 -7509 -10897 -4586 -3485 -18500 -34783 -27797 -10335 8517 17218 17565 -1088 -5324 253 1322
8847 1322 -3940 -14981 -3801 5515 8115 9404 21252 15472 9390 11801 1221 -6858 -10772 -7629
8833 -7629 -6821 2496 3325 -3885 -12803 -17559 -17047 -14608 5786 6635 -3807 -7669 -8335 7193 26764
8818 26764 24182 24420 22028 16285 17526 6923 -10828 -14986 -2423 18799 25176 24355 22013 17113
8804 17113 7921 -1284 -5393 4315 15011 11667 -3320 -6468 -645 9922 6608 -1515 17947 20452
8790 20452 20111 25091 29454 20648 2731 -6889 -8412 -6456 -461 10039 4273 6667 -1073 1733
8776 1733 620 5031 8420 -5497 -9231 -4773 -3636 -3479 -8524 2779 8773 8625 19721 16125 12142
8761 12142 15228 12413 3390 2375 5463 4853 9600 -2233 -7342 -2213 -1550 -113 7515 7166 4526
8746 4526 6604 -3786 -5074 4286 -444 -5547 -9803 -9903 -8498 -3524 1712 6165 6810 3100 -2144
8731 -2144 -4783 -5823 -9224 -6472 -15619 -25635 -19835 -17049 -26445 -24984 -28508 -37724 -23601 -15562
8717 -15562 -4037 6188 -60 -1554 -520 -1315 3462 6702 15129 1188 -4711 -17154 -3584 -7098
8703 -7098 -7565 3503 12800 21138 18702 8494 -13156 -8239 1887 -20174 -18086 -8345 -2797 -2806 8312
8688 8312 9486 5561 -6402 -2657 11551 13262 14150 10093 7061 -3708 -7058 3717 1638 -2787
8674 -2787 3821 3433 -436 -3832 1236 15094 12778 14189 8915 5817 15264 -691 3558 -2059 3687
8659 3687 4129 10049 -1 -16002 -14941 -3577 2757 -11015 -11843 -12082 -10373 -6839 -3321 -3963 -19881
8644 -19881 -17193 -11990 2651 14961 5509 13012 20919 6965 -680 -3007 -4635 12319 814
8631 814 4854 17948 14283 2673 2015 -4244 -20125 -21462 -8718 6082 11670 -3433 -24478 -1483
8617 -1483 15069 15259 21373 22526 9244 -1221 -7980 -1244 7824 24318 24696 19592 25101 37954
8603 37954 31669 5486 -3216 -5919 -6180 -1457 -2841 -6096 -19324 -18030 -9797 3180 12848 13632
8589 13632 4853 4086 -1995 -17115 -25153 -22506 -13591 -19609 -22978 -19551 -8088 -1065 13778 11430
8575 11430 -474 -6279 -10368 330 -10245 -18199 -9612 -10304 -9768 1274 9571 20981 9968 -7746
8561 -7746 2977 10704 4944 4240 12127 2482 -2683 -3065 -8379 -15391 -4477 -1601 -6628 -12063 -16330
8546 -16330 -24495 -20099 3839 9425 1648 -10318 1541 11550 11623 4035 -6519 -10312 3002 -42
8532 -42 -7294 -8049 -21855 -19048 -5912 741 -1103 5664 13480 3506 1345 5562 -12258 -23422 -17898
8517 -17898 -4108 11958 17790 10355 9140 12897 6288 -6774 -3955 4388 5105 10346 12796 2890
8503 2890 -16498 -19019 -10125 5073 18636 6371 -5903 637 -5395 -15436 -8570 10326 6836
8490 6836 -10941 -3306 -1883 3920 -5705 -13948 -17107 -30321 -29822 -15280 -10388 -8642 -6964 -5120
8476 -5120 -1451 -6246 -3036 2561 3138 7807 19121 26788 19246 6622 3489 11210 -1863 -3267
8462 -3267 2229 -5283 -13248 -21582 -25620 -14125 -9811 3252 23227 19873 19395 12950 16005 6997
8448 6997 -3977 -3741 -147 2975 -3223 -1366 19715 35274 33488 25582 28433 24906 30601 17562
8434 17562 2468 2832 21626 22881 9409 -4596 5998 10944 5476 3329 -19897 -17800 -9982
8421 -9982 216 1122 6833 3225 -651 11953 5158 -12079 -21014 -9144 -4743 -3694 6242 10341
8407 10341 6579 5464 8608 8534 12638 12759 -552 4628 11053 12948 5952 -2236 2722 18900 29560
8392 29560 18058 14270 7525 7078 -848 596 -11518 -9131 -3436 -8927 -9547 -13374 -19897 -11743 -2568
8377 -2568 9921 5934 2448 15092 17730 14410 4837 -3072 -8679 -4187 9517 9510 -1696 -7211 -16851
8362 -16851 -30880 -26961 -13300 -9467 -12804 -10712 -18153 -19155 -10653 3756 10694 -9654 -5461 18095
8348 18095 13353 629 -8649 897 9608 2041 6990 291 2153 5363 3881 10841 11109 2079 -3637
8333 -3637 -750 4366 -5492 1297 -4916 -18896 -14779 -14006 -7660 6245 -6010 -13792 -7523 -1694
8319 -1694 4423 8589 10648 4898 -477 -5963 -20341 -20880 -5813 116 -11340 -18184 -15440 -8239
8305 -8239 3137 -255 -15697 -34108 -11417 880 -1323 -810 -5896 -7337 1950 5159 -12398 -18126
8291 -18126 -22181 -2926 -9 -508 -4880 -8294 -6902 -9606 -2798 -6660 -9979 -330 9523 6812 995
8276 995 -9052 -14374 -16097 1569 3962 -2338 -1308 -285 4423 -12259 -21752 -13774 -12307 -12029 -15380
8261 -15380 -9602 14774 38694 25257 -10798 -26332 -10323 4608 15729 18786 10831 13311 932
8248 932 -7434 3736 -310 -3087 -1238 2705 -1847 1995 -2081 1746 -4424 -9781 -4379 9461 4465
8233 4465 11877 12534 12813 4757 8558 1985 1665 -4496 -14623 -17286 -13556 -10910 -2528 -5502 -9589
8218 -9589 -3341 -6635 -21611 -24954 -28289 -8227 10753 8730 6297 -1341 2668 11508 -4628 -18924
8204 -18924 -29803 -19203 -4498 -4196 3875 4516 -7379 -17019 -2766 -1984 -13991 -11720 -10290 -4346
8190 -4346 -631 9060 14926 20828 28172 26224 15779 -1758 -17043 -14995 -4633 -5548 -1242 -2360
8176 -2360 7562 11597 4178 -7273 -7847 -4313 8204 5637 8712 17846 18392 15298 1453 14392
8162 14392 31053 24764 22685 2986 -771 382 -3981 -13199 -13239 1546 6254 -48 5289 15865
8148 15865 13959 2786 -991 2227 7523 -8970 -19150 5692 15754 8617 800 149 12026
8135 12026 12309 9912 -1599 -13920 -15352 -10447 -7874 363 -7980 -11574 -8924 -6592 -13895 -20715
8121 -20715 -36453 -29191 -16213 -388 19445 3606 -18561 -17037 -9485 -15094 -21564 -9456 -1896
8108 -1896 -6534 -3808 5130 4400 -5760 -8059 346 -3842 -17998 -18013 -21121 -22055 637 3437 -21
8093 -21 -3933 -5433 20937 31179 17863 13680 5081 -8955 -15079 -7396 9303 12330 9261 -10227
8079 -10227 -10371 18079 24008 25736 27456 31452 12066 -8088 -14059 1378 9769 3013 6379 1871
8065 1871 -119 -8548 -6984 251 -629 11197 22513 19770 20510 15048 10977 7872 6771 4244 -1941
8050 -1941 -5175 -4486 -16037 -21973 -28711 -22724 -13793 -1438 4527 6347 678 18248 17732 -782
8036 -782 4175 6223 16430 16467 9370 -5339 -12722 -14801 -12380 -6796 -10812 -22632 -28110 -21698 -13031
8021 -13031 -8728 -7004 -9680 949 4279 -3772 -5647 2163 14462 11429 -5766 -3981 -5907 3252
8007 3252 -5141 -5817 -9626 -21720 -29384 -37309 -29713 -27162 -16787 -1442 -12966 -38827 -38752 -33773
7993 -33773 -23854 -12836 -11588 3585 11155 17550 16033 21213 26814 32116 24790 22594 25715 23245
7979 23245 22716 3550 -7681 -9848 -9939 -2854 5786 9936 14353 19388 17919 7982 -1478 -7079 -15972
7964 -15972 -17695 -10841 -8399 -8466 -13485 -7528 -443 8346 4756 2018 11385 11900 12986 15079 12768
7949 12768 10884 5472 9940 -1629 -4105 -3816 -13075 -21252 -13590 -11858 -8494 -7861 -7856 -12888 -7544 1958
7933 1958 3345 -2022 -10542 -896 2168 4786 2410 4994 2556 11828 625 -4712 -12396 -18294 -17274
7918 -17274 -11672 -9030 -10624 -14463 -14673 -10171 -18639 -18239 -7333 -4404 4650 9968 19882 15447 13088
7903 13088 9362 7993 13189 18362 25594 30130 30940 32521 16843 15147 12283 789 7443 21882
7889 21882 12222 9167 21907 22549 9191 1015 -6805 6577 16507 11278 13841 14724 8872 -8893
7875 -8893 -19600 -23708 -23507 -15745 -11449 -5098 -4192 -10261 -17344 -8822 -10050 -23437 -23933 -13846 -9032
7860 -9032 -14829 -18426 -16000 -12254 -10040 -15577 -23210 -14717 -6465 -8801 -7314 -1140 514 9132 13143
7845 13143 7954 2105 -5388 -10084 -4778 7386 820 -3481 -10 -10375 -8838 2234 7716 6614
7831 6614 10980 13265 19484 35074 33430 20879 15498 16213 18226 16045 19511 8080 7340 20854
7817 20854 15990 14273 25592 21431 10831 4199 10866 8528 5870 3013 -4509 2585 13905 6878
7803 6878 126 -316 2272 16291 8377 5231 10955 27541 32889 21354 13647 3691 6705 21850
7789 21850 27107 25730 33595 46136 40835 16803 3940 4679 4315 6838 2115 -7074 -2885 7875
7775 7875 1113 -2848 -2344 -14803 -10225 -17119 -17300 -15776 -4185 -8643 -15252 -37535 -26939 -12860
7761 -12860 -21082 -19981 -5668 3867 -3790 11924 13626 11055 2332 -6664 -10277 -10207 -2466 8391
7747 8391 8176 8996 3498 6563 -295 -4854 -15451 -11561 3712 -9423 -8306 -9262 -14275 -12568 -7646
7732 -7646 -967 2994 8240 13256 -5921 -3302 -5936 -14339 -15009 -2915 -8414 -15148 -5109 6118
7718 6118 5143 -1590 3820 13224 14048 14750 9051 10775 16353 23760 15834 12348 15271 2150 10876
7703 10876 7583 2290 4373 -327 -4745 4009 -667 -3720 4823 4821 4538 1224 -5845 -15707 -18238 -5671
7687 -5671 2223 7442 -11540 -16973 -16948 -24712 -12765 1084 9149 4499 8685 2192 -5146 -3001 -17451
7672 -17451 -24227 -15803 -15361 -14708 -1343 -2065 -1674 116 -3671 1053 16780 17537 8203 -8726 -12797
7657 -12797 -3282 10825 5214 3982 10125 -7216 -16174 -9615 1054 6384 15688 7090 571 2848
7643 2848 -2882 352 -950 -14100 -11733 -10281 -10843 -6163 -9797 -22305 -30584 -23545 -9505 12593
7629 12593 16274 1230 -14286 -12832 -3993 5784 5283 6550 9219 9018 5491 -6924 -8529 9320
7615 9320 19978 21859 32062 23427 14779 5886 -129 647 728 1594 10481 27953 27038 14430 16459
7600 16459 8692 9645 2431 -13758 -7277 12494 14639 278 -2931 5246 21895 28581 3014 -2448
7586 -2448 7860 10562 13194 9283 -5444 -14364 -10 6650 15888 33007 35711 34833 35004 19830
7572 19830 6601 -4340 -15634 -5648 -1862 -8526 -12584 -15875 -21413 -17214 415 221 7594 11093
7558 11093 13188 -1978 -9612 -7378 3291 -673 -7461 -16336 -17507 -7597 -23810 -30514 -24284 -19817
7544 -19817 -22717 -34198 -32535 -15664 -15577 -19509 -13326 -4688 -1096 -4415 -4248 -9098 8349 16648 34164
7529 34164 31823 18006 4631 7112 11748 20421 20551 13015 2021 -7060 -2734 -13054 -2578 1383
7515 1383 14966 16798 10336 3006 11170 19969 17284 12240 -939 -4835 1737 -1093 -3284 -10311
7501 -10311 -5525 -3014 -2332 -16963 -32092 -21400 -23819 -23027 -21871 -21445 -20783 -25045 -25255 -29149 -25333
7486 -25333 -27834 -30720 -26572 -19570 -16228 -14679 -12995 -19734 -27728 -22751 -539 2947 -1073 631
7472 631 -18753 -20975 -9840 -1355 14371 10725 7303 -5939 -8250 79 9588 -7963 -16591 -6416
7458 -6416 -6507 -10895 -21402 -19065 -19741 -16502 -6686 -7427 -7460 -12609 975 10580 14272 5268 -6045 5087
7442 5087 19424 24843 9350 -13082 -22878 -34419 -35872 -31988 -33252 -25222 -2483 -800 542 7512
7428 7512 -3943 -16715 -17699 -4733 -9035 -8132 -6796 -9889 -22699 -14478 -8978 -9222 -680 16187
7414 16187 16006 7561 7599 7516 19553 16289 10560 7724 858 -3419 -8098 -2764 894 9327 7145 -7371
7398 -7371 5184 19869 6917 5748 3220 3075 2056 -128 -9053 -1136 -7915 -10826 -8933 -13507
7384 -13507 -9819 -10899 -15427 -5679 -478 -10560 -11688 -4902 -2003 1299 6868 10646 13481 12859 6752
7369 6752 754 -21495 -32916 -27260 -25812 -26992 -27880 -29101 -26314 -13838 -2554 2918 7143 17046
7355 17046 18203 10806 3544 3319 -7484 -8978 4009 13550 6644 7260 6693 8061 6822 -4759 1266
7340 1266 2217 -3307 -6464 -6704 -7772 -7028 -5888 -6551 -10055 -3592 -5469 -10646 -9195 -8447 -7758 1924
7324 1924 -889 3525 6402 9664 6620 -4941 -2741 6079 -8160 -9507 -14243 -27236 -19392 -147
7310 -147 5924 14330 5934 2723 -1697 -7789 -6269 -8285 -642 -250 -8215 -6742 -1091 -2987 9585
7295 9585 18561 13837 5283 2333 4402 750 6672 -5840 -8644 -6885 -18497 -21767 -17663 -23305
7281 -23305 -20781 -9935 9466 2593 -7059 -2512 -11549 -2272 -9109 -9549 -8400 4281 1850 -4798
7267 -4798 140 6526 3141 -20066 -25718 -24767 -23688 -5747 173 -12854 -13952 -13942 986 8514 20676
7252 20676 20890 -1624 -13205 -17719 -11678 -1955 9471 36274 40527 36912 18155 -1487 7569
7239 7569 20773 11718 -5159 3039 8128 16846 19866 11246 5008 1293 -5908 -19930 -12204 -2538
7225 -2538 -4857 -5621 -7511 -1278 12661 2401 1813 470 -9300 -16419 -23041 -18932 -9626 5739 10815
7210 10815 -558 1781 761 -7292 -2410 10376 4010 -13515 -19763 -16769 -19159 -18468 -30497 -30062
7196 -30062 -17651 -7324 -2229 -4259 -1824 2752 2831 -392 14522 25062 11551 13678 11200 10120
7182 10120 9271 -3402 4238 -1033 -10598 -20679 -20861 -17542 -9066 14792 21190 25905 21371 14696
7168 14696 -414 -12988 -9578 -8687 -12211 -9480 1470 2672 7070 6172 -9904 -11945 -14342 -4782
7154 -4782 1148 -1816 -31 -3759 9779 12035 17684 10659 11366 21410 7245 -12471 -17973 -16311
7140 -16311 1310 -4489 2379 2187 -1577 -6914 -1906 -2339 -7658 -9964 1072 9529 6435 8172 15752
7125 15752 19538 15795 11284 14241 34333 32007 9125 6479 14541 14019 1269 -2731 11129 22357
7111 22357 35967 43661 37652 31451 24537 31725 25608 9034 -8475 -8092 -20543 -28242 -31067 -25619
7097 -25619 -16629 5139 20383 2982 7072 -1665 -7237 -1976 -22255 -33895 -40572 -17928 -3528
7084 -3528 10333 15284 -950 -9090 -8189 -8777 -4129 -11828 -807 -391 -16386 -25964 -17825 -16377 3063
7069 3063 12033 2558 -6651 -9090 -18548 -20738 -6377 -7020 -4843 2679 6364 6138 10150 5552 -3976
7054 -3976 -1517 -1327 -2672 -10103 -5855 4753 5462 14391 7607 -1425 -6380 -14943 -19222 -13440 -7873
7039 -7873 4187 9757 9598 -607 5994 10909 4487 12328 10813 2003 1132 -6737 -4386 3470 3352
7024 3352 -13313 -19350 -16297 -9459 -2635 -1819 -7797 -5207 14565 25903 -3734 -18201 -17697 4276
7010 4276 -18058 -25119 -17076 -13349 -14567 -19827 -17911 -27477 -20617 -6806 10010 10331 6051 7926
6996 7926 868 -3650 -439 15274 19823 9572 6115 4005 -4721 -9053 -25685 -20520 -22559 -20612
6982 -20612 -17174 -20554 -6211 -7586 -7828 7987 4206 -6429 -11997 -16808 -11031 -12524 -29587 -38614
6968 -38614 -32445 -18097 -13288 -6613 -1813 7159 12650 6045 -5657 -11916 -268 9552 -5974 -2805
6954 -2805 -4736 -2125 14686 12516 -6251 -22014 -18629 -15285 -12168 -17813 -29285 -18870 7558
6941 7558 6108 4120 24311 24495 31883 29902 11928 7756 9588 -2165 16768 13266 13887 10209
6927 10209 10707 26674 13818 7559 6443 7738 1254 -11623 -3970 3958 7158 -6647 -8232 -4162
6913 -4162 -13311 -4731 1023 353 -1740 -961 513 -648 -7490 -8281 4900 7073 3966 9159 11293
6898 11293 20169 16966 19921 12063 4749 9244 17311 11982 -13953 -18934 -760 3388 5977 9560
6884 9560 7062 -6274 -4552 3136 -2398 560 -16557 -29081 -19123 -4424 1666 -6641 -20581 -14836
6870 -14836 3556 3296 -2433 771 11276 17732 27236 41035 37474 16909 16182 21711 16528 -694
6856 -694 1706 7894 -233 -12134 -8570 -10730 5591 17915 21160 14971 7625 2708 7408 5489
6842 5489 909 5016 1846 -3815 -8700 -5800 -5070 1379 1761 -595 6495 13994 5866 4162 -9601
6827 -9601 -17971 -12676 -23682 -20883 -7116 -9099 -13233 -6174 4086 11984 6407 10198 20360 16319
6813 16319 2204 -12797 -17287 -7350 -3441 1078 3038 -10596 -12321 -17894 -27570 -4788 -1856 -11926
6799 -11926 -25362 -26762 -17301 -15132 -6486 -7810 -7261 -5173 -16567 -12893 -6749 -15469 -27279 -27937
6785 -27937 -20058 -7862 961 -3403 -3557 -3404 -1546 -6225 -10906 -10055 7966 154 -13513 -15939 -6103
6770 -6103 2819 -127 -1869 -5070 -5038 -2966 -11488 -10027 -14339 778 12713 21702 6238 -13286
6756 -13286 -19639 -20900 -12208 -4197 -16046 -17610 -12857 -9291 -4466 -8060 -11753 -4980 -2042 5367
6742 5367 7028 6896 -5840 -18504 -16683 -14408 -9452 2011 8227 -244 -7008 -8105 5283 5289 18688
6727 18688 20246 20917 16249 -5430 -6089 -2190 5476 5159 -1365 -2780 3624 -2770 -19709 -1462 15261
6712 15261 28961 18826 6774 -4798 -16769 -22369 -26172 -15964 3139 24158 25581 16734 -2062
6699 -2062 -21331 -12271 -3537 -443 -5552 -20604 -26312 -20931 -11788 -1656 -4504 -18571 -21711 -32753
6685 -32753 -27882 -30794 -34871 -32678 -34030 -25573 -24384 -25834 -24919 -19092 -16348 -18880 -10612 -316 -2891
6670 -2891 -16668 -23851 -12180 -7729 -11074 -19980 -11164 -15239 -8546 -10592 -13851 -3477 4486 10881
6656 10881 9563 12987 10782 -250 -12644 -9204 -2605 -3572 -2752 -621 -7101 -16959 -1877 -2191 -1110
6641 -1110 4323 382 8548 7437 10324 10604 15064 11417 524 -17589 -18608 -15604 -20253 -23727 -13738
6626 -13738 -3168 5270 14234 1404 -449 14582 24806 15825 19849 22330 30144 36285 27499 13399
6612 13399 20472 29837 14911 4197 3882 -2362 -22307 -29098 -21149 -11369 -10376 -16008 -22006 -12274
6598 -12274 -2567 -12556 -8498 -9506 -16968 -31163 -25304 -32768 -32320 -24195 -22478 -30410 -22712 -31520 -26270
6583 -26270 -17900 -6663 -17588 -22443 -18585 -14569 -12837 -12234 -20007 -15375 -11010 5027 18957 16596
6569 16596 18377 26969 20773 8880 -203 -2462 -6404 -4887 2452 -1342 -6323 -5451 -12576 -16451 -15166
6554 -15166 11960 27287 12412 158 -6122 -4798 7819 3541 477 5513 3769 5933 -885
6541 -885 2780 14448 14878 16038 22969 19656 14087 8065 7770 20091 10208 4627 16858 16600 1905
6526 1905 -2324 1946 5053 9444 4458 -1314 1866 4828 6824 -3438 -16352 -10484 -6559 -6545 -4011
6511 -4011 -9538 -4412 -4787 -8176 -7482 -13355 -17855 -16117 -21112 -13661 -16113 -23088 -14077 -7622 -10224
6496 -10224 -18911 -18690 -8323 1556 6217 9806 17420 25536 7689 -3725 -401 -16801 -16334 3676
6482 3676 10097 2589 5780 9441 8958 11509 13838 7859 -3611 -6656 -6886 -3132 -9974 -19439 -4526
6467 -4526 604 7276 9594 23519 36603 22843 15875 9703 -805 -6601 -17364 -21667 -18575 -18820
6453 -18820 -2244 -3024 -7312 -13857 -13417 -11026 -9092 -9293 -5019 -9438 -6903 3784 2540 5152 63
6438 63 -6129 -3659 -302 -4126 12566 21601 10978 8984 4741 -1656 -11264 -13014 -24762 -27911 -16418
6423 -16418 -9640 -2047 11239 19618 32676 16918 4169 -7581 -20094 -1868 7665 11509 13874
6410 13874 33184 36365 19855 7815 3850 7113 491 4 3271 -1035 -2939 8295 12280 4942
6396 4942 -4223 -6188 -11631 -21113 -28627 -20263 -8082 4559 -6092 -2787 -8026 -19541 -23301 -12849
6382 -12849 -5290 -9965 -15050 -10898 -5671 4983 -179 -1128 9082 6793 2492 3840 -2387 -13413
6368 -13413 -7338 -5479 -7125 -8893 -6611 -18345 -6854 -1797 49 7371 10358 9106 23383 19132
6354 19132 15871 11002 -1070 -1979 -1742 4617 14598 4728 -8165 -8622 -6029 -4866 512 1704 700
6339 700 8955 9124 4302 7422 2940 12517 21163 20578 11383 1024 -999 -467 -5187 -10021 -7075 -13572
6323 -13572 -1601 -2313 -4271 -675 1072 -4179 -9623 -15461 -13221 -954 5457 -16119 -9600 -270
6309 -270 3967 13270 17935 10572 9026 2512 5077 651 4176 11625 5310 6705 -1451 -28156 -39020
6294 -39020 -33344 -24837 -6529 -3326 -3828 -9400 -14656 -17254 -3763 78 -725 3009 4034 17536
6280 17536 18711 13216 20954 13800 11582 5622 2476 -9984 -28740 -23371 -16458 -14137 -10520 -126
6266 -126 13543 19020 14914 9454 11626 4065 -11120 -26247 -27127 -16167 -18833 -35236 -36036 -29815
6252 -29815 -25109 -16373 -4241 -3821 -15303 -10099 -8525 -15378 -25617 -5958 -3660 -1712 -2809 -1392
6238 -1392 8474 4071 -10826 -20681 -26791 -11456 -11044 -20714 -17777 -13342 -9363 -12792 -26143 -29309
6224 -29309 -27048 -26730 2529 14465 9130 -349 6743 12655 11357 -2951 -15990 -18326 -25836 -33324
6210 -33324 -23347 -10763 -2304 -2954 -8157 -22155 -24409 -16720 -5689 3325 744 -2265 -19083 -18699
6196 -18699 2342 21993 28222 12459 6134 16173 17667 15684 16193 -616 -14079 -17260 -11906
6183 -11906 -10097 -15133 -2955 5856 6204 4929 2704 -4727 2128 15146 8680 1050 8700 22686
6169 22686 18353 12885 6370 -274 -8050 -15370 -24079 -16823 -358 21 7102 14421 16338 11254 3309
6154 3309 1858 9212 19790 24275 19951 5313 -6029 -13261 -16329 -11169 -2492 12944 21297 10367
6140 10367 5796 4617 1467 2803 -2425 3371 9092 7531 909 -5797 1545 2753 4737 10191 3417
6125 3417 7567 7861 10079 17317 19002 11612 18985 13908 7584 -2495 -2214 -8623 -1091 -7637 -4425
6110 -4425 -17994 -35330 -32887 -20852 -18094 -19388 -33726 -33801 -26433 -11092 -17049 -20085 -204 17280
6096 17280 16643 12939 29406 30240 6198 1222 -1789 -17267 -16992 281 10007 10775 6456 -1403 -6039
6081 -6039 1568 10463 651 -14329 -11486 -12253 -18687 -20620 -14500 -26426 -26332 -10311 -5433 -9376 -11579
6066 -11579 -16984 -17471 -25015 -23726 -20793 -28725 -25005 -16514 -13835 -10736 -605 1610 3342 -4268 -14729
6051 -14729 -13354 -1186 16711 34301 34429 34330 25471 9462 -939 -19720 -17864 -2084 12 -8120
6037 -8120 -16420 -8251 4305 -1771 680 2172 3639 -9256 -22438 -15577 -3011 10433 12256 14459
6023 14459 22515 18795 6283 3932 7450 289 1067 6204 3443 -7545 -5658 -9990 1803 9999
6009 9999 14092 6193 -5194 -3482 -12512 -19867 10998 12507 1058 4573 1450 13141 20893 11489
5995 11489 -235 -1921 3054 -4182 -27087 -17193 -6524 -16181 -11992 -7985 -7033 -13874 -14290 4821
5981 4821 23395 31400 24533 14038 -1387 -16304 -7493 -4725 -8641 -6253 -3333 859 -9964 -13945
5967 -13945 -1081 2350 4890 10133 6065 2786 -852 -3058 -469 -969 4040 5696 3663 28836
5953 28836 35444 16310 -8272 -13715 6917 8194 1656 -14462 -34445 -42952 -29431 -20749 -16746
5940 -16746 -7771 -3022 -3518 -4197 -717 1470 5737 11790 2277 -3928 -8030 -7715 9656 6530 8930
5925 8930 11520 5376 6623 10207 9506 6724 6901 16390 23577 20622 29632 22802 3406 2909 13254
5910 13254 18512 20073 11136 14920 12344 11163 -3321 -4419 13526 27363 5176 1294 -6177 -7156
5896 -7156 -5584 -9126 -654 3345 -4092 -11723 -21235 -15363 -17271 -20568 -22197 -14265 -12547 -17030 -9679
5881 -9679 672 16100 13395 13120 13345 6169 -5665 -11800 -10003 -4985 -14432 -21554 -9785 3296
5867 3296 6191 -132 -3699 8124 5116 548 16198 17073 1580 -9949 -15701 -27317 -41699 -38956
5853 -38956 -22799 -5800 5051 11562 12755 12522 -821 4668 9700 18912 8475 -3297 -10754
5840 -10754 -6013 5679 1108 6997 154 2177 -9073 -19842 -25631 -16392 -8210 -922 -7729 -12102
5826 -12102 -9812 -17852 -22304 -11382 -6962 -7572 -3445 -986 4775 -1685 6900 -5772 -3231 -2884 4688
5811 4688 7231 -2766 1182 6466 5966 2415 6140 6724 -6633 -10894 -13982 -8162 -576 -9632 -24675
5796 -24675 -17842 -11988 -11619 -11995 -16208 -24430 -24992 -16229 -2047 -12121 -24191 -23871 -16447 -23357 -31359
5781 -31359 -41839 -27131 -16946 -8748 -6479 -1778 -14909 -20414 -13755 -10188 7880 14384 8498
5768 8498 9754 -7434 -20564 -18825 -26016 -36998 -35527 -14226 -18239 -17593 -3139 -10621 -10465 -20482
5754 -20482 -3960 -4018 -1684 6571 6022 -219 -5913 -3085 2029 1733 10219 8863 -2303 -27490 -19930
5739 -19930 -10505 -17875 -23559 -20005 -25663 -20882 -248 -5404 -15740 -18217 -2592 2907 8949 -2908
5725 -2908 4290 16056 1472 5383 23084 20325 22670 19798 1657 -4567 -15429 -17157 -2664
5712 -2664 -447 -2664 6050 3713 9753 12622 2985 -4226 -4353 18293 17743 5903 6823 -1406 -3534
5697 -3534 5509 19654 20815 11942 24022 21407 3718 -14543 -9498 -421 2595 -1355 -5612 -885
5683 -885 -8067 -15599 -4130 -1632 -2405 -3340 -8127 -9712 -1822 -3173 -18674 -27848 -25292 -16572 3728
5668 3728 24467 6636 -5559 -12025 -14228 -20453 -16127 -8677 -2300 -11047 -14290 -11326 -6959 -6046
5654 -6046 -6907 -14932 -17478 -11340 6065 1732 -16212 -11929 2610 6384 11467 14061 11808 16679
5640 16679 -1335 -5551 -843 -5789 -7914 1783 15508 13044 12961 10694 6660 4837 -7381 -704
5626 -704 11100 21533 34099 46641 30976 9808 4335 87 -3373 -4584 -4778 -4443 -7570 -8521
5612 -8521 -3466 9274 29551 16858 263 -9869 9156 14061 748 2186 16776 33848 28526
5599 28526 20844 12517 9854 4836 -1775 -5935 -1122 -9581 -15392 2765 9041 7541 -2997 -9149
5585 -9149 -3942 8787 8596 6294 12169 7738 -7246 -21681 -23563 -34597 -17229 -3355 5188 4548
5571 4548 -11402 -12909 -9793 -18925 -15203 -11642 -8633 -6511 -1503 9929 11719 5478 -2382 -1479 -6758
5556 -6758 -2805 9625 11426 14046 6582 54 -7169 -16170 -13636 9032 14237 4629 -1201 739
5542 739 -7307 -12128 -13186 -7276 475 3262 6128 6336 6769 2002 -8036 -6427 -11056 -15476 -16568
5527 -16568 -3750 594 -11872 -17494 -12818 -1902 4880 6205 8330 5977 -1874 -3786 14002 12925
5513 12925 5644 -12538 -34909 -35130 -26328 -6144 14898 19080 16442 -4333 -9225 -2029 -18203
5500 -18203 -10658 -4406 -12927 -15422 -13032 -14587 -6892 4645 8544 1792 713 -6735 -10732 -8175
5486 -8175 11714 9157 -10570 -13605 -13554 -14289 -14124 -24924 -21968 -12072 -3334 12104 12627 -986 1267
5471 1267 13238 21506 19204 9682 -6050 -11993 2002 3789 437 -4165 -12950 -21306 -19531 -28987
5457 -28987 -41379 -39783 -24287 -19915 -20808 -7248 6461 2855 -6350 -3030 -1718 12499 17753 3106
5443 3106 -1743 -54 3207 10872 11793 11435 3807 5005 10891 5446 -44 9118 4152 -2035 7706
5428 7706 8727 1962 -4500 5002 13050 7752 -3717 -3520 -3787 11122 15775 12851 27371 33299 39032
5413 39032 42356 34686 24953 16389 7825 4001 5038 9847 14118 -4123 -17933 -18820 -28766 -30454
5399 -30454 -19925 -5031 -970 -9362 -25102 -18832 -8225 -6092 4656 11336 7277 4046 5141
5386 5141 17004 25934 17250 -5636 -5889 -1433 -5081 -8628 -10321 -10072 -11519 -60 -6665 -7712 -9240
5371 -9240 -9237 -4608 9040 13355 2313 -3363 1571 5036 6675 -1405 -2454 -7253 -12147 -6855 -17353
5356 -17353 -6210 2912 9392 14805 25486 17548 2597 10061 4094 -12774 -15088 -14845 559 12377
5342 12377 20885 19588 6115 -3067 9929 6338 -5573 -8486 -14322 -11886 -14232 -26533 -15546
5329 -15546 4609 5839 -1896 -313 -8969 -14827 -6976 -9498 -9091 -11140 -7364 41 -5559 5531
5315 5531 1632 -3315 -14955 -6456 3254 10086 -1882 -4795 -4190 6617 29846 30446 12348 -8162
5301 -8162 -8919 -6771 -16987 -6500 -11659 -12736 -14657 -10814 6318 4071 -521 5580 10810 -19468
5287 -19468 -27178 -972 -4257 -6995 -13469 -287 841 -6612 -10558 -11929 -12454 -12374 -13253 -2947 3389
5272 3389 -2748 8275 14059 408 -8954 -12618 -23212 -29158 -28145 -18400 -4045 12349 8586 6353
5258 6353 4715 463 -10380 -14653 -5532 409 9254 6019 6889 20195 13608 15483 303 -11860
5244 -11860 -17346 -9600 523 734 -16772 -17077 -5227 -1962 17486 15951 12464 2782 -1649 3196
5230 3196 -3917 6507 5963 8795 1580 -10619 -6858 -2089 -5865 -8358 -17329 -9473 506 2639 -6435
5215 -6435 -11596 -16760 -14753 -24136 -17948 -21172 -26836 -17040 -13045 -26286 -19782 -23745 -6910 22320
5201 22320 16517 9401 10859 1034 -7313 -1408 9155 13340 3191 7240 11306 -2936 -6751 -3669
5187 -3669 6319 1779 -9906 -2112 9552 9282 8014 4101 4124 3595 -8437 -9741 -9990 -6370 -15621
5172 -15621 -16586 -24109 -22652 -6327 -21803 -22306 -13429 689 6784 5207 -3535 6426 2774 -4841
5158 -4841 -7258 -9126 -2607 -1091 -5092 -11876 -5537 27001 33605 13627 1124 -3188 -2546 -5149
5144 -5149 7218 10647 14666 9636 3274 -17847 -29108 1103 8041 -4509 -2527 4807 8443 2416
5130 2416 1591 4524 1469 -3503 -1066 -4374 -1164 12849 23514 20508 17194 590 -11333 -18810
5116 -18810 -12996 -4203 -6871 -12670 -9069 -1029 75 6831 15446 21050 13855 6740 13320 2032
5102 2032 -11954 -5718 -3920 10003 22928 37682 17467 -968 -13670 -14888 -19936 -17422 -23172
5089 -23172 -24063 -20985 -13817 -5976 -1478 -15734 -24528 -11410 -13523 -8058 -7516 -5979 -7715 -9003 -6542
5074 -6542 1946 -1502 628 5443 12228 8246 2896 7253 7250 -15565 -16285 4984 10020 3665 -3601
5059 -3601 -5824 2149 3134 2834 -6827 -3526 -10509 -15706 -10403 -6165 667 8204 12088 6125 7268
5044 7268 7446 348 -7766 -3933 2616 -3587 -6096 -8769 824 12572 9396 -4813 -8308 442 -1603
5029 -1603 -6590 -1007 8393 17004 8854 11498 21999 23804 10664 -7217 -10231 -22972 -31147 -17463
5015 -17463 -7405 -4056 21027 24790 16798 9765 19186 26685 28877 21187 11286 6757 11802 20791
5001 20791 27942 16430 9495 7326 10370 -8198 -10113 -14628 5835 26352 21198 -6972 -3319
4988 -3319 851 -12168 -13731 -17153 -2838 13389 18092 10262 -31 -15745 -12212 -5897 457 4731
4974 4731 -10441 -24094 -14381 -2724 -11784 -27300 -27321 -11814 -12172 -13310 -13966 -22513 -20839 -4716
4960 -4716 -956 156 -2683 279 6972 7187 -2552 -7780 -11908 -18876 -12069 -5815 -2199 -784 7275
4945 7275 4152 -11915 -12774 -15986 -25152 -9806 -12591 -9473 2992 3655 -3373 2029 3203 5437 -10476
4930 -10476 -29933 -30922 -4441 5271 -7553 -13275 -16014 -13442 -4569 312 19322 38301 37751 25454
4916 25454 14339 12074 19820 18302 5962 3808 -542 2218 3030 5832 12785 15555 12071 15025
4902 15025 11938 -4388 -4670 12582 19449 16787 4520 -8896 -9038 -1254 -753 -358 1029 -11966
4888 -11966 -8069 6234 8673 -4191 -7330 -5188 -9967 -16513 -7391 -11146 -18524 -6150 601 -5680
4874 -5680 -4900 295 2743 -3614 9195 9205 15618 10030 9658 -1360 -2600 15414 21334 19608 29894
4859 29894 30950 17429 -1666 -5990 -9413 -6662 -10625 -10539 -10165 -6349 11904 21196 11253 3719 591
4844 591 92 2308 8996 2938 -2603 -22466 -20352 -8426 13023 33776 30183 10682 -1651 3586
4830 3586 6629 6292 12097 11241 4428 15835 17867 9771 -7558 -17158 -29890 -21470 -14262 -7124 72
4815 72 -706 -7219 -13837 -23525 -19825 -3645 -13916 -8167 -13251 -18251 972 17839 17696 8299 3698
4800 3698 -4872 -10564 -4549 -972 -1308 2700 3514 19755 17692 18521 2550 -19354 -25232 -19542 -14326
4785 -14326 -487 3828 666 -15243 -29282 -25315 -37330 -34544 -35992 -31317 -11042 -6684 -11033
4772 -11033 -8777 4174 8651 -3090 -12319 -8499 -3186 -5438 4514 16544 17032 9159 6552 7649
4758 7649 13507 435 -1911 19568 8337 3185 -16896 -7170 1862 -7837 -4171 1974 3501 -6346
4744 -6346 -18538 -9194 -1363 -6321 -17906 -16087 -9060 -7512 174 108 -3883 -2324 -5752 2970 10852
4729 10852 2556 -11818 5238 15361 11244 18650 16881 10227 8722 9060 -4756 -7136 -4425 -12334
4715 -12334 -8223 -4300 -12008 -9055 -8045 13032 13624 3325 2235 4042 4172 1133 -11273 -7631
4701 -7631 983 3240 23730 17935 3276 -12406 -3318 15146 14326 1905 -15260 -24702 -24877 -9543
4687 -9543 2653 6766 15877 19600 19813 21401 12453 9236 -2608 -7738 8481 12320 14890 19466
4673 19466 18624 8618 2286 1342 -18467 -23451 -15773 -1260 5722 8790 9607 6953 25845 39509
4659 39509 32491 23606 18494 25634 29335 10474 -7202 -5614 -14165 -15537 -10178 -10026 -22617 -13824
4645 -13824 -4879 -12310 -7311 15456 19846 14245 14899 13291 17735 6415 -510 3186 7925 16853
4631 16853 8533 13526 1802 1474 20 4298 9394 -5018 -15040 -13154 -10396 3459 4561 -3127
4617 -3127 -1993 2453 1699 1450 -8151 2863 4199 16252 20388 -1866 -8074 -7949 -4705 -6957 -19109
4602 -19109 -11254 -6274 -9384 -22309 -22780 -18381 1487 7202 -7202 2921 8855 7957 -4090 -20097
4588 -20097 -28854 -17327 -11069 -4469 -16542 -31421 -23894 -9869 -5360 -688 19847 28608 7954
4575 7954 3431 2598 -3217 -6283 -6407 7371 23838 15330 10042 5988 5548 1337 -5073 6768 8105
4560 8105 -1927 2931 1766 -231 -5896 -2095 3438 14207 9933 -16521 -25747 -15755 2246 6478
4546 6478 20656 17219 3126 2522 2286 7289 12557 14692 12467 1260 -6778 -13924 -9945 -3237 -11987
4531 -11987 -11966 -7201 -2115 -7667 -22155 4547 -9533 -32569 -37598 -39573 -32932 -19001 -11368 -25221
4517 -25221 -24261 -4351 19496 28003 29515 34818 34508 24182 6939 510 -1053 -1428 14032 21831
4503 21831 14297 12468 -3864 -17166 -25958 -20231 -17235 -23260 -12684 -4196 -12782 -8155 -11625 -12189
4489 -12189 -13978 -8047 -3740 -4293 3178 2207 -10718 -13367 -6453 -5989 -10401 -12587 -11363 -2261 -5424
4474 -5424 519 16147 20300 7104 10652 18765 12581 1255 1472 19262 21095 11191 8415 4977
4460 4977 9462 5788 -2616 -6436 -25464 -36858 -25116 -16513 -16482 -17885 -24409 -36797 -37793 -41677 -38686
4445 -38686 -11249 -1924 664 9502 5555 -331 2073 1710 2020 -7158 -12354 -11363 -430 9416 17923
4430 17923 23773 13263 -8839 -24792 -16152 -6388 -13421 -5884 -13804 -18687 -18659 -28956 -12931 1374
4416 1374 9813 21066 20377 22249 24287 14029 -5063 -12068 1920 13195 11379 11788 7377 -854
4402 -854 -9757 -17907 -2172 4065 5507 10501 12038 10336 10737 15544 13652 7753 -25 -17262 -19431
4387 -19431 -14425 -10018 -2293 -9932 -11940 -371 14768 20750 9694 6272 -8780 -23193 -25847
4374 -25847 -24873 -18519 -7161 779 2259 -4562 -4203 -11144 -24895 -11018 -2934 -16604 -18989 -4159
4360 -4159 9845 11861 6371 5762 3280 -10638 -3560 7545 3507 5455 -345 -9188 -16115 13340
4346 13340 36620 23612 -739 -3092 6523 16301 15669 13052 4872 2716 712 -3548 -16580 -20563
4332 -20563 -21049 -19398 -11264 -4052 -6569 -5085 -7980 -782 8709 13086 13071 1724 9752 17224 12554
4317 12554 -12300 -25248 -18693 -2368 4958 6647 17805 17936 15516 11926 16953 2267 -16431
4304 -16431 -6849 17958 18334 9418 15244 1109 -9455 -22777 -16988 -9872 -4033 -5042 -1508 1177
4290 1177 7180 12086 24279 17538 6924 -1306 -6080 -5604 -3293 -7280 -8876 -9306 -5489 -15864 -10714
4275 -10714 -10798 -24512 -21855 -8174 -10079 -20555 -27673 -22904 -19222 -8786 -9171 -22300 -11677 -18398
4261 -18398 -20368 -21204 -11751 6984 2766 3387 2412 3766 11404 13342 -12856 -24326 -8259 -7252
4247 -7252 2091 -104 -719 -3438 2637 5080 2638 15932 8801 1327 4945 -7510 -19026 -30438
4233 -30438 -33933 -28547 -23324 -24641 -19134 -4421 5017 -4393 -6470 -12665 -23078 -32266 -24165 1739
4219 1739 -6907 1783 8228 5462 3715 -3107 3537 3376 38 -3182 -18731 -26220 -36962 -25009
4205 -25009 -6631 3247 4618 11085 -5782 -12475 -13669 -15448 -7180 -1794 -7683 -4975 -2446 -1395
4191 -1395 -15529 -20361 -5362 20448 34362 25707 11551 9532 2939 -7193 2184 3889 16136
4178 16136 9746 2987 31 -5760 3470 6315 13802 32000 34953 28637 23955 16489 6397 8298
4164 8298 2015 -8205 1806 13315 6129 -3151 -3238 3877 -9925 -25161 -19437 -4328 3811 14287
4150 14287 7200 -364 310 9816 10754 12140 1223 -3786 -3900 8343 6841 -1068 -10211 -16635 -14179
4135 -14179 -10380 -22297 -28234 -20577 -14245 -3688 5868 -570 -3892 -7825 -5942 -7780 1250 2963
4121 2963 -4745 -9618 -1074 1560 4349 -2935 -2782 5398 1862 5158 17571 33933 37792 24529
4107 24529 14664 15457 18392 18289 7193 -5449 -19988 -11470 3653 4593 -6866 -11485 -4007 -51
4093 -51 -9396 -19886 -10272 1041 11465 11259 16324 16022 8288 -6866 -16233 -19301 -14040 -18570 -23380
4078 -23380 -27119 -13607 -1322 1225 2543 7160 1202 945 -8890 7305 6698 -16126 -11813 -3929
4064 -3929 -4663 1115 1453 4995 10886 17927 27755 24252 14143 12551 21910 35459 25429 11333
4050 11333 15630 18587 11818 -5809 2625 13237 15126 19468 -4629 -21443 -19285 -13446 -21821 -22486
4036 -22486 -6994 -8229 -16141 -21730 -13605 -16994 -16037 -2968 -9658 -15715 -12131 12244 26099 26582
4022 26582 5029 -15148 -16721 -4984 -1761 3462 -14 -5817 15986 18080 8395 -2260 -10324
4009 -10324 -15175 -13062 -11585 2287 10877 -3534 155 -7385 -16491 -16046 -7050 -4347 -9226 -16526
3995 -16526 -14851 8674 4961 7571 -765 4076 4527 8053 -282 -10745 -16873 -15292 -13248 -4679
3981 -4679 12156 14760 23247 9388 5393 -1455 -3016 -5 -8899 -17733 -17358 12626 22034 13275
3967 13275 1899 -20110 -29498 -23512 -18201 -19566 -23024 -19183 -3098 4416 -405 7174 10708 19401
3953 19401 26688 31436 34255 24263 12531 3448 7727 15350 -6035 -7154 -1338 3981 4964 11386
3939 11386 7458 -8528 -24332 -31082 -30340 -28711 -15550 -3557 1120 1125 12333 28026 37719 20998
3925 20998 -4730 -17192 -7901 9543 8715 14195 13536 4391 -7284 -16569 -23245 -14919 -18415 -19440
3911 -19440 3453 2199 -3680 364 -1964 -130 -7827 -5984 -17658 -25201 361 16789 6189
3898 6189 6451 12959 20215 15143 18145 14239 2589 -4108 -6153 -9155 -7232 -1994 1126 -1170 -6834
3883 -6834 -6826 -3704 3830 8942 9747 10843 5341 4057 13413 24772 7206 5301 1225 -4515 -8446
3868 -8446 -11272 -5141 -2362 -3413 -7899 -7793 -3490 -12491 -18791 -14706 -6569 -4029 1451 4767 -10114
3853 -10114 -13431 -14343 -13321 8023 10774 2495 4436 12656 9290 13564 -1571 -5094 11674 18453
3839 18453 19009 22771 24376 20810 15185 18786 5362 -11374 -11879 -7746 -6822 -5036 9964 8508 -341
3824 -341 5004 16786 25489 14956 5989 -10932 -11986 3170 9916 15234 30722 28919 8700 12236
3810 12236 877 -15724 -7768 -3472 -16396 -15569 -13948 -11198 -5904 902 -2263 6526 14183 15756
3796 15756 -4512 -9450 3466 8865 13922 6896 -12750 -14477 -8605 -7348 -7986 -3255 3974 -5677
3782 -5677 -5010 -1061 1246 13971 10068 -10854 -23230 -3690 -2260 -1695 4664 -14967 -13467 -6871
3768 -6871 -3266 -9802 -10179 -1134 -9782 -16157 -10340 -4059 -8829 -10899 -5967 598 6284 4338 2387
3753 2387 11350 6 -12087 -12982 -8981 -12196 -14006 -24216 -12834 2104 9910 5330 5620 -11578
3739 -11578 -13205 -3512 -1752 -6165 -10157 -8060 -6555 -6424 872 13341 24831 24277 9525 -3737
3725 -3737 -8332 255 12266 16687 9768 463 -3860 418 8909 13079 8951 5199 844 -13390
3711 -13390 -11986 -8196 -2475 4515 9511 7584 2755 624 -1248 -4130 -3950 -10536 -6726 -5700 8225
3696 8225 3262 -9707 -29098 -34233 -15635 -6064 1187 -7104 -651 8510 8615 7644 17787 22245
3682 22245 16577 9906 11208 30739 31039 8323 -10951 -19431 -22547 -16872 -8122 -5662 -14790 -17717
3668 -17717 -21563 -4724 -4083 -3481 -724 -6819 -19701 -24773 -16466 -6778 11233 17367 3965 -17169
3654 -17169 -18221 -9704 -18617 -26619 -24411 -9334 -18378 -3069 3625 -2618 9916 19418 14353 1283
3640 1283 638 6996 7792 9146 4723 6051 -8077 -21859 -15620 -16851 -3020 2741 -5853 -15982
3626 -15982 -32167 -39661 -34364 -17881 -5109 -15043 -21296 -24819 -23594 -13334 -22803 -27703 -15268
3613 -15268 -3960 -374 -18629 -15045 2914 8241 8129 4125 -5699 -9217 -14736 -14914 -2405 -1348
3599 -1348 -260 -7372 1226 2913 7285 768 -10892 -2982 8750 8609 13270 8906 10801 23604
3585 23604 13670 -2119 -8707 2117 8247 15326 18266 18773 6767 5665 -5797 -15366 -8278 -2637
3571 -2637 6755 31374 32957 34860 40363 18339 3426 8211 10109 -6030 -16976 -21537 -23730 -24471
3557 -24471 -9962 2089 3696 5753 8890 23874 20155 12640 16501 22831 27740 19945 4845 2130
3543 2130 -9623 -14230 -15597 -11079 1506 4871 -3774 3254 11021 13000 428 5585 8697 -3729
3529 -3729 -12029 -8064 -13915 -34207 -38502 -29083 -23775 -16591 -22672 -28809 -14547 -1630 1639 7560
3515 7560 6419 4581 11650 8740 -15117 -24245 -20624 -4769 -4982 -5097 3669 1508 -10861 -236
3501 -236 7254 2953 5212 -5440 -19207 -18086 -15024 -6217 7264 -1913 -8454 -9058 -17015 -18688 -13660
3486 -13660 -15920 -2309 -9737 -11342 -17340 -21225 -36858 -27046 -16179 -4029 -4534 10101 24955
3473 24955 13531 -136 -1134 -7122 -21607 -12224 7659 9272 2848 -1074 4918 8232 9003 513
3459 513 -7095 -14891 -10352 -9442 -8904 -3004 -6448 -11606 -13002 -6235 10115 6103 -11400 -14549 -8960
3444 -8960 -5959 -1104 12044 9994 9921 18399 7772 4374 1051 -12155 -5755 9402 23511 9073
3430 9073 -5857 -11111 -4887 -11802 -2094 -12605 -16903 -15371 -5635 -1803 -698 -4813 -16403 -28706
3416 -28706 -45744 -19391 -2518 288 8486 5944 -6052 -5765 307 -8455 -17787 -12793 -12779 -151
3402 -151 2674 4219 6350 3054 6494 6574 -197 -9106 -10605 -8760 -13819 -24790 -6675 1164 -9239
3387 -9239 -3769 -12491 -25108 -17948 -2051 4106 -10106 -12387 -11138 -19496 -32066 -17495 -9982 -10693
3373 -10693 -15062 -6104 -4243 -5760 -2545 1179 13526 6689 3131 5350 -10552 -21665 -12901 -8149
3359 -8149 -1026 6922 4100 2028 6534 16896 17912 17574 13463 26547 12928 485 8784 887
3345 887 -4922 -3400 2505 3728 6698 3779 1359 613 2851 8986 6413 5234 17058 14167 12279
3330 12279 6603 -15332 -17803 -16002 -22864 -6510 -3643 -3820 -2089 452 -1856 -3043 -2012 -4685
3316 -4685 14822 17540 -21 -9937 -2293 -1547 -5535 -1555 -4398 -7719 -6448 -18887 -21529 -17805
3302 -17805 -15604 -3040 6090 13604 28701 22865 6260 -8740 -3706 11356 -6594 -15215 -5181
3289 -5181 -3395 -12239 -18194 -30518 -34511 -16271 -291 2984 4411 15390 8993 2927 -5923 -8471
3275 -8471 -8034 -15923 -17953 -23462 -20136 -17919 -9166 -1812 -6534 -9054 -9020 2237 8702 185 -790 1736
3259 1736 -6661 -5273 -2656 5496 556 9822 13785 -14994 -29235 -36751 -18601 -7663 -14192 -19856
3245 -19856 -15948 -16107 -14416 -18452 -27685 -31551 -4782 2658 -3314 -5864 -15651 -15818 -15858 -19806 -21552
3230 -21552 -4627 3806 -7362 -9171 -15024 -7873 -6803 -9499 -4934 47 -1026 -9209 -11126 -9519
3216 -9519 -9462 -9952 -16812 -10481 -13775 -15560 -9409 5519 3888 6491 -1265 -11866 4001 11746 18406
3201 18406 13476 -4420 -16552 -7663 -7379 -9201 -2761 14705 11332 4232 5471 5838 3156 -13272
3187 -13272 -13290 -13463 -14132 -12801 -5187 -557 -4060 -22320 -10909 -5004 -18921 2756 11254 9246 8011
3172 8011 3552 3278 13977 13542 21198 1294 -7241 -2946 5484 11120 8921 10404 9399 -7937 -24954
3157 -24954 -27481 -20559 -5644 13849 12883 4076 11567 18774 13155 -8096 -7029 -9613 -17096 -22938
3143 -22938 -26994 -8387 -6648 936 4284 -1658 -201 2785 8856 15750 22676 31539 29157 13723
3129 13723 8827 -546 -2948 -6171 -10677 -2116 5987 4659 -5255 -2071 -3712 -8750 -13381 -21020 -10865
3114 -10865 12815 9530 -5388 -9205 -9171 -13799 -15863 -19041 -17514 -15448 -6040 -7090 -12267 709
3100 709 -2510 -7737 -3103 3850 11223 19947 11508 -10545 -14308 1846 6372 4415 -8569 8383
3086 8383 23651 8573 8614 8629 10678 10728 6802 13767 14410 6767 12800 -665 -5437 444 -4494 -4667
3070 -4667 2908 18316 7304 -5501 112 992 3431 10967 -5228 -4422 7446 -1034 -11711 -19048
3056 -19048 -21320 -14175 1806 8062 8222 16594 14150 4798 -7286 -10397 9034 8528 -3067 -17360
3042 -17360 -22661 -9182 6015 7393 11699 10022 3731 -1610 -10063 -23186 -27544 -26425 -26731 -30204
3028 -30204 -22898 -7467 7067 9019 4573 439 -1105 601 -15545 -11435 -2851 -1807 -3138 -12507
3014 -12507 -7805 -6331 9417 7975 12240 25086 25045 21501 14970 16339 10602 814 4227 21211
3000 21211 24936 30790 33453 15245 3884 4782 7605 -1460 -4669 -54 14997 16256 21303 18332
2986 18332 20246 19413 29127 26136 25180 14960 7041 464 -620 -3614 -5537 14133 16919 2628
2972 2628 -2030 -3887 5309 9478 9864 13545 3663 -4859 -8860 -9540 -2960 15313 10158 12994 8554
2957 8554 17387 18446 18722 19194 27509 40456 34851 28557 26845 14472 10535 13548 10179 21761 24724
2942 24724 34574 28093 20030 14824 -1812 -18981 -10934 -8841 -7672 -62 -3524 -5972 2274 -2253
2928 -2253 3562 3842 -16196 -11332 -7338 6646 13459 -531 2911 15199 21721 27346 28812 28822 35895
2913 35895 25238 7383 2663 13544 8628 -1223 -4596 6495 -729 7347 9746 -7485 14155
2900 14155 13158 -7556 -4375 357 5468 7855 17910 13525 2542 8360 20101 7994 19176
2887 19176 21767 20790 26379 23883 10619 -1432 9299 16074 16287 9988 3697 -1987 6452 13768
2873 13768 8517 1472 -9419 -6278 1980 9284 3768 -17277 -20878 3574 8366 -8301 -9572 -9844
2859 -9844 -17510 -24246 -24644 -15887 -14370 -7806 13413 10829 -1895 -14999 -7195 -4608 -17912 -29120
2845 -29120 -28749 -20919 -17534 -3435 -5978 -9198 -6744 7109 7271 15680 14568 5569 746 -6634 -11766
2830 -11766 -12321 -8020 1412 1666 -4132 -3134 -3872 -342 -1612 -8324 -4283 3861 4510 14622 20088 1885
2814 1885 -9054 -11927 1534 21115 17661 -864 -4404 -4330 -14171 -45037 -57754 -52360 -40037 -17950
2800 -17950 -13072 -17366 -5566 13779 16643 12136 -7146 -17121 -10620 3345 5665 1408 2089 -3866
2786 -3866 5227 -175 14444 23939 12061 20630 7237 -8648 -12067 -403 -6901 -7106 -7171 -10620
2772 -10620 -7775 769 13221 18583 9572 -4500 9278 18714 21952 7866 -4824 -13560 -11611
2759 -11611 -1474 922 -7599 -9439 10935 15403 878 -3323 5 3535 6325 2382 9848 19156
2745 19156 29732 23441 11079 -8732 -4275 -947 1644 -3270 -22707 -21255 -10876 5343 22961
2732 22961 28345 28015 29463 21670 5555 4403 -621 5270 1215 5144 5221 15779 28821 1622
2718 1622 -21787 -9818 -5119 -6137 -19159 -18071 1972 1110 -7900 -20720 -17903 -9659 15276 36747
2704 36747 40287 41502 40353 36401 32483 24015 11996 8367 4381 -2612 -6844 -22895 -13796 -2508
2690 -2508 -15021 -24495 -25600 -11873 6301 19396 4832 -2068 1234 -474 14364 18062 18835 5465
2676 5465 -5804 -5131 3936 5381 -6099 -18085 -15242 -12302 -1774 -4070 -10310 -3788 9385 1616
2662 1616 9757 29512 23968 13764 8024 -6662 -7163 566 7596 9672 2473 1258 17660 28465
2648 28465 28912 12447 -1941 -7972 -6298 839 -5076 -8377 -7369 3786 8797 15066 4550 12985
2634 12985 16394 7375 -6220 -5553 2057 -7250 5755 8921 1100 6106 8535 -4997 -4529 -3391
2620 -3391 -1002 10243 24995 9629 -11529 -14964 -3657 1698 18898 27992 34412 31108 31631 17092
2606 17092 6502 3412 855 -5288 -5350 -4952 -8121 -32 7955 10350 10611 -2622 -15898 -18936 -12446
2591 -12446 -5858 10288 16227 20011 20046 13234 9320 17587 4076 -12240 -8996 -4247 -2363 12693
2577 12693 14940 -586 -25126 -25231 -21881 -33125 -34539 -11257 -8334 -9336 -11466 -16095 -13331 2694
2563 2694 6006 -1030 -452 1885 -1889 -2768 402 7772 10680 8063 643 10387 18678 11478 2552
2548 2552 -9989 -20874 -20111 -14265 -21188 -19602 -9165 3306 -2931 -9821 -6810 -2073 3861 -3871
2534 -3871 -11456 -1733 1739 1347 -9599 -28628 -23899 -15322 7883 16066 -1247 -1163 642 -3960 -11116
2519 -11116 -11491 -13857 -10799 520 -56 10881 9191 19994 27766 7651 -9940 5256 11795 21878
2505 21878 16967 3827 -10912 -3180 10616 2439 -9607 -8433 3521 1176 -898 -7311 -6794 -1873
2491 -1873 8769 5605 13969 8586 -12053 -15517 -7926 1822 2035 4028 6232 -10528 -16324 -3699
2477 -3699 -2531 2674 -2707 6169 8442 5093 -9062 1363 14873 -411 -16076 -13817 -11264 -2643
2463 -2643 -8368 8336 18107 20481 22119 12117 7134 -955 -1577 9556 8942 5674 17308 8316
2449 8316 -18233 -14198 -2113 10343 10517 9980 8899 -4717 4716 3399 -5413 -10767 -1460 971
2435 971 -11088 -14469 -2901 4965 14582 19415 16170 7951 4036 -3438 -10649 -6837 -20851 -18112
2421 -18112 -15201 -19104 -6301 -5367 -4614 -4640 -20171 -18531 -713 3477 -7177 -11488 -21230 -12202 6425
2406 6425 7626 13902 14311 16554 5956 10106 -3965 -20896 -13745 -6323 1813 -15406 -25192 -18845
2392 -18845 -8333 -13252 -38982 -38837 -28583 -14572 1436 -9339 -23612 -14785 -19732 -23194 -16826
2379 -16826 -21184 -9137 8673 10617 13339 20902 10639 1727 8195 5775 8326 10842 843 2783
2365 2783 17066 19230 3410 11103 11257 -3576 -12407 -2593 4023 16353 12014 1015 -3350 -4181
2351 -4181 -10050 2861 14757 12734 -4560 -17473 -12469 -13289 -9481 -1754 210 -5074 -4338 9273
2337 9273 19720 20913 20099 23698 27220 13276 -8312 -16817 3223 14892 11017 -5801 7667
2324 7667 16187 11354 -4279 85 -900 2235 6703 -885 7776 8916 -7251 -5585 -4425 -4344 -121
2309 -121 8845 9913 17825 17662 13973 5740 -10125 -9129 2658 -3246 -8272 -1248 9585 19299 13305
2294 13305 14363 5700 -3875 -6599 -20676 -30042 -21646 -6925 -2725 7893 16054 16115 11504 22464
2280 22464 22511 19917 14940 13768 19994 15582 11581 4470 -11401 -22809 -20488 -23663 -14831 1318
2266 1318 13337 11312 20393 10422 10768 -3061 -4848 -4925 -15152 5590 4313 -5089 -4387 -731 -7695
2251 -7695 -15500 -8867 2594 7945 8751 -6110 -23277 -11733 7868 14974 -78 2559 -4974 -15075
2237 -15075 -20056 -9534 4662 16305 -1181 -16176 -9949 -4936 -9318 -13292 -2491 5854 12983
2224 12983 9577 2641 2520 -419 -5308 13915 13116 10459 2099 -10433 -8704 7859 10307 9510 7758
2209 7758 -4483 -3622 7618 13543 17520 18375 22576 19066 1245 -12217 2960 5375 9835 12999
2195 12999 6964 -851 3576 2877 3287 3550 8486 5852 -243 -4852 -2671 809 8107 30385 34880
2180 34880 18308 9833 15578 18681 19923 17969 5119 -9426 -10496 7623 19991 16108 12939
2167 12939 15959 5448 7980 5547 5621 5842 14308 13400 11307 2799 2541 4591 9549 15525 14517 14773
2151 14773 4264 -2716 9300 13511 8855 -1356 3715 9699 2079 -5891 -104 18165 12506 3389
2137 3389 -2513 -22175 -36791 -37373 -21965 -14422 12714 18185 5740 3256 5610 9454 -9019 -3551
2123 -3551 8685 17286 12195 6596 9249 6131 -10943 -2774 7135 210 -14828 -16964 -11690 -16530
2109 -16530 -9162 -15915 -10493 4809 -1196 -17417 -28742 -26324 -28534 -30340 -22453 -13217 -6238 9974
2095 9974 13222 16448 17468 19166 18671 28041 14873 10201 9770 4921 2791 2844 6500 731 8091 22399
2079 22399 17999 8163 12358 23717 13001 16125 30093 30394 11743 3418 -1898 -9811 -12107 208
2065 208 -839 4015 3579 -3843 -2493 4848 -1305 -15817 -18068 -15961 -9663 -6892 -11683 -18617 -19791
2050 -19791 -10248 -1310 3542 2715 -3426 -3025 1649 8458 4978 9727 17916 13396 26052 21643 20826
2035 20826 18483 16885 11879 3517 -834 237 -4303 -6419 -2792 -1324 -17711 -10834 -2409 -385
2021 -385 2997 6975 8125 15485 18430 7306 741 -9568 -20870 -11451 14068 21033 14460 -5234
2007 -5234 -20219 -20028 -10538 -8135 -6756 16483 22755 25203 19046 13167 18556 31359 24981 14147
1993 14147 18913 12222 -3321 -6160 5213 16904 1150 -7731 -18022 -9592 28054 55378 66791
1980 66791 58553 22409 12223 17330 14074 2991 -2930 2764 9698 11534 11180 5632 13686 15194
1966 15194 1564 -14607 -3491 5702 6402 -8177 -14686 -8919 -6316 -705 13900 23570 25072 23041
1952 23041 11109 15305 1953 3242 5552 11313 4117 -5825 -8840 -6128 -1222 5428 8907 17418
1938 17418 17848 11562 7936 6217 4524 -9404 -5857 656 13768 -99 298 14234 15728 11769
1924 11769 18045 12240 6937 -1087 -2509 -7689 -13008 -10902 -15936 -12280 3355 11620 -4265 -7830
1910 -7830 -8103 -5535 -12557 -3146 -1205 -2924 4368 6427 -1948 -3513 -10960 -5029 -5204 -6709 -5311
1895 -5311 1801 -483 4232 -688 4268 7496 12779 12958 5113 -6761 -19737 -24127 -23547 -34197 -29496
1880 -29496 -24257 -19698 -27871 -27467 -13070 2096 12285 22745 21796 17657 16184 16443 15124 14809 8663
1865 8663 2557 -11715 -18820 2267 17634 17589 9735 2582 -9090 -16855 -9852 -15394 -6723 12051
1851 12051 6682 537 -1124 10240 -2797 -4986 -10983 -10066 3256 9320 6160 7771 10481 10023
1837 10023 11733 27101 23987 22412 16438 8319 6825 -1318 3833 -5047 -8002 2692 2595 -3112 -7457
1822 -7457 -12265 -7061 -6607 -6666 -9207 -15526 -24211 -9386 -10904 -7591 -6178 -945 -8964 -9373 -24102
1807 -24102 -20028 569 -5859 -6274 -2719 -2087 -12115 -8946 265 965 6395 2575 800 3079 3066
1792 3066 5624 861 1406 10294 12954 -3759 -14089 -11086 -8650 -6785 -2752 -11232 -16094 -12334 -17989
1777 -17989 -8361 9653 24797 24326 13749 -3271 -27491 -18435 -1492 4736 2962 -6288 -16195
1764 -16195 -22202 -21002 -11849 644 -4102 -3457 -1725 514 10775 10654 7100 1237 -1871 -10379 -21497
1749 -21497 -30902 -24130 -7059 9472 9910 8285 6117 5429 -12335 -24401 -15303 -11717 -9216 3078
1735 3078 -143 6334 3194 9315 24065 13849 2154 -789 -1051 -4942 -2581 -5604 -5116 613 2198
1720 2198 12010 11237 -1391 -1548 -2587 -14625 -12463 -16729 -14258 -9819 -703 -924 -1609 -19431 -26003
1705 -26003 -31105 -26274 -14923 -12230 -7332 -15727 -10823 -4032 -2594 6637 -3746 -741 1873 7699
1691 7699 9602 -4276 -2431 -6258 -10144 2017 884 -7634 -6881 -15580 -3259 -2670 -10186 -8862 -1676
1676 -1676 5210 12038 14852 21562 24161 20113 6970 -4333 -4278 3853 10009 4384 6615 13217 12819
1661 12819 9151 13215 10532 11751 8220 -3462 -11510 -12051 -1966 -14724 -13092 -5262 -4023 -8627
1647 -8627 -3343 5676 6554 5727 12654 5289 18688 14186 15743 10956 6104 13688 7355 -4530 -12109
1632 -12109 2355 7662 6718 9672 1074 3489 10711 14619 -52 -3996 -1549 -203 -3913 -8914
1618 -8914 -20736 -27624 -29490 -23690 -11913 -16263 -6524 -6442 -836 6127 -8758 -8730 2667 22050 19196
1603 19196 -5081 1808 -15177 -16573 -14815 -10071 -11772 -5066 -6858 -3944 3772 9083 5857 -5627
1589 -5627 -7104 1464 9369 24285 23570 20211 28574 34532 32398 26254 -1749 -17971 -14309 -22274
1575 -22274 -28555 -27498 -22457 -7377 2420 6205 11750 -3738 -8581 828 2087 -13795 -12441 -6438
1561 -6438 -5832 -1419 -8426 -14691 -16791 169 -3661 1210 100 918 -3308 -9775 -4703 9995 13934
1546 13934 11511 22716 16443 448 3 9485 10871 14267 19178 20429 13363 12188 24335 26021
1532 26021 18621 2687 -3398 7512 5709 -6090 664 8854 3851 -414 21119 19582 23563 18438
1518 18438 -2482 -3532 -4573 1065 7694 18415 10400 -659 342 -9131 -9190 -6631 1409 -6586
1504 -6586 -16850 -5587 1900 -4334 -1154 -1001 4079 7806 14065 24729 18154 9465 1109 -465
1490 -465 -3614 2071 8792 332 -9553 -3779 3999 2703 19259 14096 -562 -5255 3895 23255
1476 23255 28636 11247 8977 14529 12289 16069 14349 4077 323 6627 16859 18382 12754 12319
1462 12319 14091 22429 26452 18177 22822 24634 12676 -1833 -8581 -3291 -3455 -9672 -16758 4717
1448 4717 9687 1149 5507 8805 15883 20373 2401 -18488 -17130 -1567 13999 1883 -18443
1435 -18443 -21321 -30992 -18648 -8498 -14196 -13029 -8881 -8126 -12782 -16701 -11642 -11320 -20186 -31803
1421 -31803 -31652 -24792 -12439 -13907 -8225 -7252 -257 4186 -31 1601 2469 7660 22266 32818 12364
1406 12364 -7542 -21889 -26394 -18807 -1163 10819 18844 1721 -1838 13221 -289 -17630 -16119
1393 -16119 331 3007 -9952 -16785 -11974 2659 3240 -3294 11180 23310 22351 22448 26345 13295
1379 13295 11617 5030 2328 10271 14217 9600 4374 3842 10056 12184 14272 13214 616 -6529 931
1364 931 18737 24730 25982 10041 3673 7251 28581 16872 350 2852 6259 15785 22545 8744
1350 8744 8805 1573 -11659 2733 8065 13513 15563 3546 3669 9340 7519 -455 -9108 3126 13948
1335 13948 10363 4865 -5109 -15461 -11788 -3744 -8994 -19338 762 11761 19133 8320 -11165
1322 -11165 -26964 -32773 -36021 -20945 -8155 5547 25913 43212 26624 19565 -289 -7703 -3608
1309 -3608 4681 -8470 -13130 -18645 -34863 -14287 -7425 -17813 -28294 -23077 -14038 -4772 -15661
1296 -15661 -12835 -5517 -8484 -8110 -3102 -10125 -15637 -7726 14149 28365 21756 20390 22079 13711
1282 13711 15040 18944 13748 3907 -3465 623 2514 3196 -4720 -2783 3218 -9270 -594 6751 7491
1267 7491 -9862 -37377 -34503 -17809 -2060 1300 9958 -2177 -7622 3922 5416 -5897 -10205
1254 -10205 -15586 -16339 -11600 5518 14391 14913 16786 10760 -1392 -8637 2461 16344 19173 17432
1240 17432 2538 3287 -10616 -7089 11994 14271 14139 24506 35566 40105 31975 18926 4818
1227 4818 999 -10163 -16210 -12420 -8370 8756 6096 -1871 7524 2404 -3471 4606 20992 16001
1213 16001 13136 24259 26913 17508 4188 -3643 -8961 -5792 -6114 -4132 -4860 -22047 -18521 -808
1199 -808 5972 17361 20310 15210 9624 -841 4143 7811 24223 28158 14257 5705 -1422 -4194
1185 -4194 -2160 1170 15654 23351 23313 12682 1670 -4072 16124 14031 12756 88 -8854 3184
1171 3184 9923 7540 3696 7779 19756 15136 1879 -6368 -7313 457 -8631 -14218 -10262 -9004 -21629
1156 -21629 -22653 -9126 -287 -6152 -896 943 -3953 -9554 -26413 -18514 -6309 -12948 -12904 6040
1142 6040 18541 29286 29144 35759 30048 18277 13624 12847 -1853 8147 21880 19481 12504 12515
1128 12515 5601 10677 8204 5102 -6217 -16017 -19185 -5627 18416 23210 8025 6905 6357 7543
1114 7543 18199 4073 -2864 5154 4361 4682 -3148 -19475 -17326 -2917 3504 5314 -8456 -6163
1100 -6163 -9463 -10927 1481 -9172 -5884 -5233 -10252 -18767 -21422 -22776 -32550 -25693 -20394 -14646 -7086
1085 -7086 7098 5801 12505 5877 -6018 -15779 -9761 -4099 2815 14087 19093 10729 -2760 -9104
1071 -9104 -952 7989 4624 2290 995 -13010 -6829 -900 -1909 -2912 -6597 4997 15043 23224
1057 23224 6100 7551 16378 22014 17378 5536 3298 7322 7115 -6802 -11318 -12737 2367 -2989
1043 -2989 3394 12994 15876 9043 -2628 -16741 -20038 -26780 -33472 -26140 -11274 -20396 -13456 -7338
1029 -7338 -4109 -2173 12722 18767 22988 22621 9676 15126 17211 -2239 -3505 -7039 131 -14531
1015 -14531 -6762 9584 1240 -9746 -1380 3160 3946 -554 5024 -1017 -9562 -17981 -14373 -3860
1001 -3860 -10164 -2439 8379 6042 8137 18963 32849 31740 33561 29345 22986 29551 27139 17374
987 17374 8299 13804 13631 8261 -2286 -8700 -2862 2751 6437 5272 -15446 -14767 -16756 -15587 2401
972 2401 7904 14563 21735 15355 8784 -410 -6652 -7536 -14916 -12456 2497 14919 6536 -7108 -4843
957 -4843 -4419 -4750 10155 15458 19626 21699 14263 17708 20784 21596 14448 10675 12343 15377 9329 14709
941 14709 10290 16793 14779 -3809 1295 2425 6032 1621 -6357 2051 7790 -1324 -117 -6092 1328
926 1328 -13434 -17397 1054 16901 21962 17601 16714 16025 15897 14557 1846 11931 13693 17228 9547
911 9547 19949 22452 22960 32029 37421 29499 17174 21696 13697 690 -17768 -11651 3702 13557
897 13557 14773 6606 -1466 1257 -6003 -23739 -20614 -14849 -15271 -5594 9792 12212 31978 26656
883 26656 16043 10469 20275 25974 19466 14452 4335 -1185 2541 4917 3118 10526 2566 3383 3856
868 3856 -5244 -7283 -7892 -1888 7279 10963 6359 -282 -9427 -18197 -31468 -20516 -21519 -27963 -7966
853 -7966 -3947 -8489 -15927 -6201 -6117 -16029 -24580 -30111 -28449 -17254 -5716 -7288 -12715 456 -693
838 -693 2821 -12696 -11802 -13716 -10038 -4827 342 1052 -9306 -12035 -8349 -19187 -23493 -281 9084
823 9084 7103 6332 13937 10469 -4302 -13415 -13046 -5594 -161 16655 13077 12344 28765 34377 13242
808 13242 -5097 3542 10637 10773 4559 5006 -5590 -15645 -11850 3054 -8228 -24370 -13880 -2401
794 -2401 2751 13588 7981 -283 -10894 -22094 -26279 -22009 -4278 7345 -2602 260 -4943 -10255
780 -10255 -20051 -18345 -17407 -21548 -33172 -38060 -37337 -30499 -5205 5038 323 8835 9298 12152 1901
765 1901 2148 -12735 -6063 -1307 4750 6396 1792 14254 10880 -3580 -13911 -15139 773 -5035
751 -5035 76 -5610 -5554 -1597 3013 -12315 -5881 -3009 -5176 -7959 -5273 -2971 -10495 -15706 -24361
736 -24361 -19074 -12625 -9029 -3478 -3467 -4933 -13871 -23778 -13392 -9996 -15639 -8499 -7768 -13329 -9569
721 -9569 -7522 729 15264 10929 6625 3476 5918 1056 -3157 -18597 -30957 -35866 -29470 -16076
707 -16076 7689 19266 10205 13601 5945 1319 -14324 -18981 -10177 -6978 -13208 1340 -10059 -21216
693 -21216 -27792 -21612 -16735 -3858 9196 24854 14719 2259 4763 1803 -9742 -9756 -6627 -15685
679 -15685 -14841 -10205 -1868 9967 5645 -2492 11598 10555 1259 8754 14660 2696 9299 13991
665 13991 16992 17828 18181 7432 -3893 -13545 -24904 -17956 -31800 -37766 -21215 -7762 -5603 161
651 161 2821 13314 3932 -279 15117 19554 10849 8385 20897 33681 25556 20451 11446 3538
637 3538 2434 -2778 -20271 -22760 -14962 -2706 8564 11243 5991 3638 22619 34679 34315 22578
623 22578 4988 -3928 -12760 -3072 23783 25254 11641 10715 2272 901 -2681 -9175 -2895 -7539
609 -7539 -21193 -17256 -14418 -16146 -12757 -15865 -14820 -17749 -13405 -5866 5501 2974 2908 16710 10992
594 10992 -5820 -14078 -10137 2079 -117 5372 11937 10241 7182 -770 -13760 -15056 -15531 -8923
580 -8923 -7358 -13933 -15039 -19574 -16077 -3552 1157 -5330 -12475 -8363 -11025 -10486 -8574 -9834 -2588
565 -2588 8072 -999 3086 -3440 -9884 -13936 -12077 -16268 -23065 -40607 -47639 -41210 -42993 -25214
551 -25214 -9829 -128 -7133 -15844 -9618 -11688 -17571 -25341 -23198 -7438 2267 -7899 -10064 -16464
537 -16464 -40363 -56368 -46956 -18533 695 4000 4930 3678 9796 26649 26620 14143 9390 14773
523 14773 4920 -1257 4351 5990 -12485 -18184 -19459 -28040 -30366 -24476 -11313 -5785 9268 6044
509 6044 3880 -9291 -13947 186 1895 -5880 -16161 1364 11982 5949 1781 8242 13306 12772
495 12772 1986 4232 5878 9290 7407 -2075 -391 -6206 -13122 -17622 -15577 -6376 10160 16129
481 16129 15491 17246 8322 8047 5446 7548 8993 -678 -3324 -5056 -6967 -1989 -853 13308 20385
466 20385 18335 2779 151 -673 6083 9625 1459 -1765 -7343 -554 552 -4358 -13034 -21710 -13193
451 -13193 -14698 -20655 -20112 -25974 -29330 -27516 -11354 -13147 -18778 -3521 -7243 -12448 -4630 -16158
437 -16158 -8178 6418 13103 6727 2153 -4941 -7692 -5391 -755 -376 1946 8138 13157 19888 23432
422 23432 8714 -8272 -14195 -9220 -2274 -1300 -5920 -12747 -7849 -1294 -8315 -5982 16109 13589
408 13589 18308 6148 -8900 -5913 -7553 -13828 -12373 -15700 -4520 97 -2056 6307 20957 17192
394 17192 688 -5699 -15437 -10847 -1866 -3629 -6051 -1287 6906 27495 22388 8481 1416 -1372
380 -1372 -3932 -12373 -3541 -5279 -19364 -22528 -14106 -5922 -9410 72 -2420 -6978 -9017 -6362 -1450
365 -1450 -1080 -1712 -6265 -4962 -5529 -1418 16874 22146 19855 4592 -1814 -10759 -6508 -21033 -17557
350 -17557 -3972 -11865 -14793 -7953 -9815 -11917 -12646 -3314 -8733 -12072 -6393 -13000 -11073 -14021 -4806
335 -4806 -1323 -5031 -11470 -16619 -9002 -447 -4095 -6053 -208 7251 12950 599 -1829 2294 -4372
320 -4372 -11491 -762 -9539 -9099 -11262 -16198 1575 12451 1573 6283 10081 4180 -11289 -14708
306 -14708 -11258 -4721 128 -360 -13228 -9517 -5075 -11390 -19647 -18801 -17488 -1653 16079 7851 -5868
291 -5868 -12719 -15083 -11625 -10799 -10842 -17470 -23866 -17136 420 7943 1765 -12845 -16033 -15764 -16082 -19812
275 -19812 -22070 -26658 -24464 -20002 -20422 -14154 782 5027 14698 15157 4751 5374 1489 -2655 -2769
260 -2769 7939 24209 19977 2774 -8108 -3901 5586 20105 18180 1613 -4797 2379 282 5385
246 5385 10796 -5037 -8817 -10934 -14994 -13252 -2147 10571 5237 728 6878 15531 10729 -3106
232 -3106 3991 15841 -2247 -6274 -982 -2975 -5070 -11576 -8628 -11341 -8461 -4207 -11910 -17554 -19756
217 -19756 -14669 -8523 -50 -4110 -4114 -10309 -5405 -235 1025 881 319 8477 9564 2081 -12037 -18840
201 -18840 -8801 -9124 -5896 4051 20273 21752 15834 10469 9274 -2467 -8786 -17162 -8628 8114
187 8114 -901 -6685 10413 15998 10480 4817 -1786 -10864 -7673 -1183 898 3899 -8473 -2200 -3116
172 -3116 -39 -9494 -12706 -6031 -6379 -3896 -22 -6807 -8698 -6712 -7812 2564 12006 16353 10802
157 10802 2723 2258 8581 -785 -7569 -2250 7409 -198 -8604 -16057 -12656 486 -69 -263 3527
142 3527 -2830 -9305 -8491 -10211 -10554 -9061 -3089 2469 5931 12531 15016 -4957 -4053 2785 5081 -1608
126 -1608 -9089 4972 19748 16200 305 -7992 -15285 -16965 1387 16592 15308 11172 8288 -1724
112 -1724 -803 -3687 -3900 -4778 -3610 1512 -984 -1636 -14856 -14382 -16247 -19383 -11840 -3272 -5489 811
96 811 -4033 -9395 -2822 -3180 6897 15856 12408 6826 2194 -12450 -16652 -14759 -15630 -17695 -25022 -17775
80 -17775 -16223 -15272 -13378 -11928 -15671 -23097 -25545 -20995 -20508 -17636 -5926 -5723 -11672 -14820 -7276 830
64 830 11911 3347 -959 436 -3679 -2040 -5159 4253 15552 8668 2146 -3956 -4435 -1006 274
49 274 -2586 -4381 2292 2568 2064 -1047 -1453 -5275 -9384 -947 7111 7034 -5103 -6187 -9837 -15655 -5686
32 -5686 -292 -5208 -14392 -18620 -15609 -9146 -8561 -7183 843 -5521 -10843 -6246 -1165 -218 -17370 -17897
16 -17897 -8290 -4250 318 -87 2921 13876 18293 7172 -2275 -1579 -2892 -3465 14011 18409 10490
1 10490 4121
0 4121
$$ Imaginary data points
##PAGE= N=2
##DATA TABLE= (X++(I..I)), XYDATA
32767 48125 63957 70149 64635 55131 61570 57485 48533 49886 54137 46100 48329 48480 63734 78346
32753 78346 88124 89040 75540 72685 75349 77375 76766 81400 88201 89748 91538 92041 90889 90174 90276
32738 90276 89689 81581 73392 80000 81373 82023 73085 69058 68730 75717 79114 79901 80247 83856 83405 87617
32722 87617 83805 76698 73663 65361 71663 88770 89375 87294 82920 90204 99150 95539 98674 88528
32708 88528 93475 93944 86975 77159 79454 89803 91493 85464 85297 95775 95113 100383 102295 98813 96761
32693 96761 90906 84593 80122 91481 109861 111059 99288 96189 97810 104602 117562 122970 115205
32680 115205 101501 110365 113556 106672 105318 98935 96900 105758 109782 103452 112629 118940 117291 122916
32666 122916 119523 110092 109189 121785 121303 113040 103867 100998 106060 104019 106018 111785 108433 104948
32652 104948 110492 111014 113580 103195 118309 126746 136570 131927 132816 122601 114529 109087 105965 110118
32638 110118 122567 129067 121410 114472 113887 125177 130000 129149 126868 118548 115869 120335 123536 122581
32624 122581 122510 125807 121937 114354 124448 132921 134079 140699 135933 135337 138424 137460 120970 126994 134220
32609 134220 130905 131294 129336 139027 144245 143246 137010 134254 135571 143256 144861 144627 139994 143914 134523
32594 134523 133681 132992 142907 148759 141705 140393 139451 130588 126597 138863 141209 128509 125570 116298
32580 116298 113703 121455 123439 137092 136729 133195 143407 147886 151705 154908 150250 146784 147387 157348
32566 157348 165206 161639 160990 151784 143216 129826 125844 131426 125760 123275 138634 157114 159724 153507
32552 153507 151410 157810 164666 169953 168013 164252 165334 162062 156768 151060 144288 157956 167906 167029
32538 167029 173861 167540 175804 177272 161620 159499 167349 182732 190634 190126 180837 175428 172316 169334
32524 169334 165218 157829 152362 156719 163074 156050 153847 162568 150374 141453 157748 170544 174618
32511 174618 186333 185703 181627 175792 173159 178013 171848 160229 169337 173578 177194 178955 182204 186236
32497 186236 179279 180294 169351 164581 174105 172420 172644 169358 170004 178825 171376 155976 151558 161144
32483 161144 164565 170716 179601 185750 197331 180873 160346 158164 160140 160225 167572 174185 184397 176282
32469 176282 179666 190161 201241 203481 200307 193865 194077 183362 174714 166369 177671 180520 185442
32456 185442 191644 196875 193415 190077 191492 183475 194072 191820 181082 188170 197036 199250 202633 201362
32442 201362 192177 199378 202132 196077 188451 175913 178159 176842 176842 182347 202131 211721 198965 180352
32428 180352 182552 184223 177685 191437 201863 193388 174821 175842 180384 201241 203966 194560 194067
32415 194067 213235 216510 199664 199540 198615 186975 181593 185688 186480 182050 179356 188502 200995 201301
32401 201301 196754 193580 195793 196924 182305 179560 193353 215924 227508 217395 215967 198975 194310
32388 194310 210282 207316 205097 217799 220201 222909 203834 212464 221742 227314 220640 221514 235295
32375 235295 225772 220062 215190 215477 204186 193376 187398 187155 188397 192222 197707 199325 201959 206205
32361 206205 209716 215717 221977 231780 224169 213485 216526 232850 224184 216257 222171 221404 215195 203035
$$ [...]
##END NTUPLES=NMR SPECTRUM
##END=
