##TITLE=Analysis number 311888
Compound Code cc 05901
Project Code adrs
Chemist Name aldrich
##JCAMPDX= 6.0         $$ Bruker NMR JCAMP-DX V2.0
##DATA TYPE= NMR SPECTRUM
##DATA CLASS= NTUPLES
##ORIGIN= Bruker BioSpin GmbH
##OWNER= NMR
$$ XWIN-NMR		Version 3.5
$$ Tue Jul 19 10:11:16 2005 GMT Daylight Time (UT+1h)  MAYBRIDGE\NMR@NMR_250MHZ
##.OBSERVE FREQUENCY= 250.131544655141
##.OBSERVE NUCLEUS= ^1H
##.ACQUISITION MODE= SIMULTANEOUS (DQD)
##.ACQUISITION SCHEME= undefined
##.AVERAGES= 16
##.DIGITISER RES= 18
##SPECTROMETER/DATA SYSTEM= dpx250
##.PULSE SEQUENCE= zg30
##.SOLVENT NAME= DMSO
##.SHIFT REFERENCE= (INTERNAL, DMSO, 0, 16.522)
##AUDIT TRAIL= $$ (NUMBER, WHEN, WHO, WHERE, WHAT)
$$ ##TITLE= Audit trail, XWIN-NMR		Version 3.5
$$ ##JCAMPDX= 5.01
$$ ##ORIGIN= Bruker BioSpin GmbH
$$ ##OWNER= NMR
$$ C:\u/data/dgb/nmr/ADRS/6020/pdata/1/auditp.txt
$$ ##AUDIT TRAIL=  $$ (NUMBER, WHEN, WHO, WHERE, WHAT)
(   1,<2005-07-19 10:10:57.25 +100>,<MAYBRIDGE\NMR>,<NMR_250MHZ>,
      <created by zg, POWCHK disabled, PULCHK disabled
       configuration hash MD5:
       62 19 C7 07 E1 42 D1 B7 37 6C 3D D0 77 39 F9 E6
       data hash MD5: 64K
       92 DD 74 FF C7 F3 FB 47 10 91 94 7D 1D C2 23 A4>)
(   2,<2005-07-19 10:11:08.32 +100>,<MAYBRIDGE\NMR>,<NMR_250MHZ>,
      <Start of raw data processing
       ef LB = 0.3 FT_mod = 6 PKNL = 1 SI = 32K 
       data hash MD5: 32K
       F0 C4 62 C3 6E E6 D2 35 D8 F6 23 0A E9 52 9E 67>)
(   3,<2005-07-19 10:11:10.13 +100>,<MAYBRIDGE\NMR>,<NMR_250MHZ>,
      <apk 
       data hash MD5: 32K
       76 3F AF FC 67 92 56 AF 14 9F C0 36 55 80 55 D3>)
(   4,<2005-07-19 10:11:10.80 +100>,<MAYBRIDGE\NMR>,<NMR_250MHZ>,
      <abs ABSG = 5 
       data hash MD5: 32K
       47 76 4A 32 77 01 0C 13 FC E3 57 40 6A 55 1C 99>)
$$ ##END=
$$ 
$$ hash MD5
$$ CE 87 17 3B E7 BC A4 2F 87 9D C7 E5 AE 76 98 59
##$RELAX= 
##$RELAX= 
##$RELAX= 
##$RELAX= 
##$RELAX= 
##$RELAX= 
##$RELAX= 
$$ Bruker specific parameters
$$ --------------------------
##$DU= <C:\u>
##$EXPNO= 6020
##$NAME= <ADRS>
##$PROCNO= 1
##$TYPE= <nmr>
##$USER= <dgb>
##$AMP= (0..31)
100 100 100 100 100 100 100 100 100 100 100 100 100 100 100 100 100 100 
100 100 100 100 100 100 100 100 100 100 100 100 100 100 
##$AQSEQ= 0
##$AQ_mod= 3
##$AUNM= <au_zg>
##$AUTOPOS= <6 >
##$BF1= 250.13
##$BF2= 250.13
##$BF3= 250.13
##$BF4= 250.13
##$BF5= 500.13
##$BF6= 500.13
##$BF7= 500.13
##$BF8= 500.13
##$BYTORDA= 1
##$CFDGTYP= 0
##$CFRGTYP= 5
##$CHEMSTR= <none>
##$CNST= (0..31)
1 1 145 1 1 1 1 1 1 1 1 1 1 1 1 1 1 1 1 1 1 1 1 1 1 1 1 1 1 1 1 1 
##$CPDPRG= <>
##$CPDPRG1= <>
##$CPDPRG2= <>
##$CPDPRG3= <>
##$CPDPRG4= <mlev>
##$CPDPRG5= <mlev>
##$CPDPRG6= <mlev>
##$CPDPRG7= <mlev>
##$CPDPRG8= <mlev>
##$CPDPRGB= <>
##$CPDPRGT= <>
##$D= (0..31)
0 1 0 0 0 0 0 0 0 0.06 0 0 0 0 0 0 0.0002 0 0 0 0 0 0 0 0 0 0 0 0 0 0 
0 
##$DATE= 1121764256
##$DBL= (0..7)
120 120 120 120 120 120 120 120 
##$DBP= (0..7)
150 150 150 150 150 150 150 150 
##$DBP07= 0
##$DBPNAM0= <>
##$DBPNAM1= <>
##$DBPNAM2= <>
##$DBPNAM3= <>
$$ [...]
##$SUBNAM7= <"">
##$SUBNAM8= <"">
##$SUBNAM9= <"">
##$SW= 20.6930455092707
##$SWIBOX= (0..15)
0 0 3 0 0 0 0 0 0 0 0 0 0 0 0 0 
##$SW_h= 5175.983436853
##$TD= 65536
##$TD0= 1
##$TE= 295.16
##$TE2= 300
##$TE3= 300
##$TEG= 300
##$TL= (0..7)
0 120 120 120 120 120 120 120 
##$TP= (0..7)
150 150 150 150 150 150 150 150 
##$TP07= 0
##$TPNAME0= <>
##$TPNAME1= <>
##$TPNAME2= <>
##$TPNAME3= <>
##$TPNAME4= <>
##$TPNAME5= <>
##$TPNAME6= <>
##$TPNAME7= <>
##$TPOAL= (0..7)
0.5 0.5 0.5 0.5 0.5 0.5 0.5 0.5 
##$TPOFFS= (0..7)
0 0 0 0 0 0 0 0 
##$TUNHIN= 0
##$TUNHOUT= 0
##$TUNXOUT= 0
##$USERA1= <user>
##$USERA2= <user>
##$USERA3= <user>
##$USERA4= <user>
##$USERA5= <user>
##$V9= 5
##$VALIST= <valist>
##$VCLIST= <CCCCCCCCCCCCCCC>
##$VD= 0
##$VDLIST= <DDDDDDDDDDDDDDD>
##$VPLIST= <PPPPPPPPPPPPPPP>
##$VTLIST= <TTTTTTTTTTTTTTT>
##$WBST= 1024
##$WBSW= 4
##$XGAIN= (0..3)
0 0 0 0 
##$XL= 0
##$YL= 0
##$YMAX_a= 301896
##$YMIN_a= -250551
##$ZGOPTNS= <>
##$ZL1= 120
##$ZL2= 120
##$ZL3= 120
##$ZL4= 120
##$ABSF1= 16.522
##$ABSF2= -4.171173
##$ABSG= 5
##$ABSL= 3
##$ALPHA= 0
##$AQORDER= 0
##$ASSFAC= 0
##$ASSFACI= 0
##$ASSFACX= 0
##$ASSWID= 0
##$AUNMP= <proc_1d>
##$AZFE= 0.1
##$AZFW= 0.1
##$BCFW= 0
##$BC_mod= 0
##$BYTORDP= 0
##$COROFFS= 0
##$CY= 12.5
##$DATMOD= 1
##$DC= 0
##$DFILT= <>
##$DTYPP= 0
##$F1P= 14.0000005364418
##$F2P= -0.99999901652339
##$FCOR= 0.5
##$FTSIZE= 32768
##$FT_mod= 6
##$GAMMA= 0
##$GB= 0
##$INTBC= 1
##$INTSCL= 1
##$ISEN= 128
##$LB= 0.3
##$LEV0= 0
##$LPBIN= 0
##$MAXI= 10000
##$MC2= 0
##$MEAN= 0
##$ME_mod= 0
##$MI= 0
##$NCOEF= 0
##$NC_proc= -5
##$NLEV= 6
##$NOISF1= 0
##$NOISF2= 0
##$NSP= 0
##$NTH_PI= 0
##$NZP= 0
##$OFFSET= 16.522
##$PC= 1
##$PHC0= -85.20851
##$PHC1= 9.374351
##$PH_mod= 1
##$PKNL= yes
##$PPARMOD= 0
##$PSCAL= 4
##$PSIGN= 0
##$REVERSE= no
##$SF= 250.13
##$SI= 32768
##$SIGF1= 0
##$SIGF2= 0
##$SINO= 400
##$SIOLD= 32768
##$SREGLST= <1H.DMSO>
##$SSB= 0
##$STSI= 32768
##$STSR= 0
##$SW_p= 5175.98343685301
##$SYMM= 0
##$S_DEV= 0
##$TDeff= 65536
##$TDoff= 0
##$TI= <Analysis number 999999
Compound Code 99
Book Reference 9
Project Code 9>
##$TILT= no
##$TM1= 0
##$TM2= 0
##$TOPLEV= 0
##$USERP1= <user>
##$USERP2= <user>
##$USERP3= <user>
##$USERP4= <user>
##$USERP5= <user>
##$WDW= 1
##$XDIM= 32768
##$YMAX_p= 395018360
##$YMIN_p= -820492
$$ End of Bruker specific parameters
$$ ---------------------------------
##NTUPLES= NMR SPECTRUM
##VAR_NAME=  FREQUENCY,     SPECTRUM/REAL,   SPECTRUM/IMAG
##SYMBOL=    X,             R,               I
##VAR_TYPE=  INDEPENDENT,   DEPENDENT,       DEPENDENT
##VAR_FORM=  AFFN,          ASDF,            ASDF
##VAR_DIM=   32768,         32768,           32768
##UNITS=     HZ,            ARBITRARY UNITS, ARBITRARY UNITS
##FACTOR=    0.157963299565203, 1,           1
##FIRST=     4132.6476996994, 0,             0
##LAST=      -1043.33573715361, 0,           0
##MIN=       -1043.33573715361, -820492,     0
##MAX=       4132.6476996994, 395018360,     0
$$ Real data points
##PAGE= N=1
##DATA TABLE= (X++(R..R)), XYDATA
$$ [...]
26953F38866Q6203j92816p6539j72129k84766J16680J63510L509j52468j56092
26943b6042K77255K84323j32769M3403K80853j5946P2218p3153k261j8927J50821
26932H39775J3250j14604k09295j0837P9675J57702k15467J51889J46355j8291
26922H20152j93709P9596Q9910j13044k9745K18031O0182k03612j86158l43596
26912A98007k58155q3950J44064J91582J16091K5838K92051J2678r2215P8787
26902F24778j78892k59679P8650m071P0656J52141J29766j17035O4602N9746P1469
26891F92131m1845k33353J25071j46626r8188L35759K01969j40286J5235o0988
26881F48879P393j54373j35480L2449o5134K76131K20170l53938k18939j23393
$$ y = [638866, 725069, 532253, 455714, 283585, -1181, 115499, 279009, 282518, 130050, -26042, 251213, 535536, 402767, 446170, 727023, 711077, 783295, 710142, 707881, 688954, 839775, 853025, 738421, 529126, 518289, 597964, 755666, 540199, 692088, 838443, 820152, 626443, 706039, 795949, 682905, 653160, 871191, 931373, 727761, 541603, 198007, -60148, -144098, -34, 191548, 307639, 333477, 625528, 638206, 545991, 624778, 445886, 186207, 264857, 260786, 331442, 483583, 613349, 496314, 560916, 620662, 692131, 650286, 416933, 542004, 395378, 297190, 632949, 834918, 694632, 709867, 648879, 656272, 501899, 366419, 398868, 333734, 609865, 830035, 476097, 257158, 133765]
26871A33765q0416M4122J51732j41903R3779j38142j04404Q0813R6968J64483
26861C00797n0785j51022J99394L1967n512k14460j05662p05K66203M5276J81226
26850D96717K2515j384J7785j04311J70002R2073l57045n6868K30988J33387n86
26839F43273o1212L548K22696O1376j03856j62357l6310R9130j03628p4038J47952
26828F36574Q5213j68351j66499k6170m9124q9144K16651K36396O1290j48801
26818E88035l95114l0180N7538j11291O6491l5450Q1030l2014l2574p0555J66701
26807B52617Q7040j38781R5832K2945o3239n5018K92099J4827J7693j55099j74109
26796A96807L7660o0411q1771q2816J41590j24015p0837K47619p2523k8891j70476
$$ y = [133765, 53349, 97471, 249203, 107300, 201079, 62937, -41467, 39346, 136314, 300797, 250012, 98990, 298384, 330351, 324839, 110379, 4717, 4012, 270215, 315491, 496717, 519232, 517848, 535633, 431322, 601324, 693397, 336352, 279484, 510472, 643859, 643273, 582061, 585609, 808305, 869681, 765825, 603468, 567158, 666288, 562660, 488622, 636574, 721787, 553436, 386937, 360767, 311643, 222499, 439150, 675546, 736836, 588035, 192921, 162741, 220279, 108988, 175479, 140029, 221059, 189045, 156471, 85916, 252617, 339657, 200876, 296708, 319653, 256414, 201396, 493495, 508322, 526015, 370916, 196807, 234467, 174056, 92285, 9469, 151059, 27044, -43793, 203826, 131303, 102412, -68064]
26785f8064j07286q0194L23180k5699j06804M3338M1189P0648R8424M1901k84471
26774e3838r124k4998q2104J2589J4532J79459J02468k3122J12134K15918J6926
26763D60840q8945J07068K4650L5909L8880j92465k436l9747N0734j09314l72435
26752h7261j03542K17067n4553j09896j73231J0863K83323L41891J71890j68329
26742C28222Q8759j42607k17707n6589m5030j22258J34545J81219P1503J61557
26732C81614L45629j33950l15284m8720j23095j72639k49907K16278K99587N9526
26722B59039J7849j94287m8478O0852M8982P2282m5518j00346R1513r6578k05518
26711a40208J06156J57310K9700o0248J16467j1770j53718N5882q184k5272l0188
$$ y = [-68064, -175350, -255544, 67636, 41937, -64867, -21529, 19660, 90308, 188732, 230633, -53838, -62962, -87960, -170064, -157475, -142943, 36516, 138984, 115862, 227996, 443914, 460840, 371895, 478963, 503613, 539522, 578402, 385937, 383501, 343754, 394488, 285174, -87261, -190803, 26264, -28289, -138185, -311416, -300553, -17230, 324661, 496551, 328222, 416981, 274374, 56667, 78, -44952, -167210, -32665, 148554, 220057, 381614, 727243, 593293, 278009, 229289, 106194, -66445, -316352, -100074, 199513, 259039, 276888, 82601, 34123, 94975, 143957, 216239, 170721, 70375, 161888, 65310, -140208, -34052, 123258, 152958, 92710, 209177, 197407, 43689, 99571, 91387, 66115, 35927]
26700C5927k0995J23321j35539l1924o499o063J63829J15914o3688J38324L36
26689C12943K97947J68766j43381j75084k13302j07632J2401M2949J4744m017
26679B06334k56634r0065N1057J44378J0411R0873n7865j24997p3m2671Q0767
26668A1515J25236P4930n6206M964K4851j47716k20488L08181k1788o7121n0758
26657a4400K63948Q6190M8101J716l21233m713J44817L0897j41629M2547J96240
26646C32481l4967j97620j44203O9864P489j70355K5104J62771J69038j63168
26636E6434j62768J80482J66342O3737L0590j22575k3465j99034j35928N7962
26626h8223L63098j2870j15346J46040K2182j68556m1142K8511l0766N282j72
$$ y = [35927, 14932, 138253, 2714, -29210, -35709, -41772, 122057, 237971, 174283, 312607, 312943, 610890, 779656, 636275, 461191, 247889, 140257, 152658, 195607, 210351, 206334, -50300, -140365, -89308, 55070, 65481, 156354, 98489, -26508, -26581, -69252, 11515, 136751, 211681, 155475, 160439, 185290, 37574, -182914, 125267, 103479, 36358, -14400, 249548, 335738, 383839, 385555, 64322, 59609, 204426, 235323, 93694, 136241, 332481, 297514, 99894, -44309, 25555, 33044, -137311, -112207, 50564, 219602, 56434, -106334, 74148, 240490, 304227, 334817, 212242, 188777, -10257, -146185, -88223, 274875, 262005, 146659, 292699, 314881, 146325, 105183, 133694, 102928, 108210, 108038]
26615A08038K9057r2952J60245K84476j56230k15529n667J00508J3935k351j5959
26604B07571R008m464N8676r8688j26680j9208l05251R4998K50958L2527j6948
26593H2499R2692j8573k23206k28983l8601J42652M1032O9077K36884q9320k71609
26582b05456K5895N9149j5634j52126J08023K16978P146l8547l7988K9208R2299
26571H8947N9132o4079J41618K3098Q2423l07631j53972K15328J96494Q7989r4730
26560B74617q350P4691J05903L9804q1699O1114J95700p6387j44264k10622j11341
26549A19166j56558j0482N980K14603l9822j74251l3489l8224J14065J4526j45677
26538a30163j2350O6017n0493l54585J18326M73335K88005j58814j52030Q2792
$$ y = [108038, 137095, 44143, 204388, 488864, 332634, 117105, 111438, 211946, 225881, 223530, 207571, 216579, 212115, 270791, 172103, 45423, 26215, -279036, -184038, 66920, 99447, 82499, 175191, 156618, -66588, -295571, -334172, -191520, -150488, -81411, 155473, 66153, -205456, -179561, -120412, -136046, -288172, -180149, 36829, 43975, 5428, -32560, -3352, 88947, 148079, 84000, 225618, 248716, 331139, 23508, -130464, 84864, 281358, 369347, 274617, 266267, 340958, 446861, 486665, 404966, 466080, 661780, 585393, 441129, 230507, 119166, -37392, -47874, -41894, 172709, 132887, -41364, -74853, -113077, 988, 15514, -130163, -142513, -76496, -126989, -481574, -363248, 110087, 398092, 239278, 87248, 170040]
26528A70040J74751j01299O033M1694j88458j66412P1786J95442P4402o2288j50937
26517F4754k04306j22211j48483J69961K05201J33201j6088K6437L18665K03862
26507F30993J01224l48428k62460k35944k8841k1299o453L17594J85638N8429
26497C90453n8834q7475K306O9340r7365k72253J07877r4949M2598J25951j93696
26486f6047q722Q9031J59664J43017O3370l38847j97136J24882L7985m7363N4368
26475A4202O8471L7963K3886p2995k38406K4755J12953m9702j2913o5184q3537
26464b40507k36497J67954M20597J94058j63733j88328J80193J0974p6677O9147
26454A37181M4571J03977L2450j98829J02445j1665j16837q4190k6996J57689
$$ y = [170040, 344791, 243492, 249525, 291219, 102761, -63651, 8135, 203577, 277979, 215691, 64754, -139552, -261763, -410246, -240285, -35084, 98117, 82029, 108466, 427131, 630993, 732217, 383789, 121329, -114615, -143456, -164755, -171208, 146386, 332024, 390453, 331619, 244144, 246450, 315790, 218425, -53828, 54049, -40900, 1698, 127649, -66047, -74769, 14262, 173926, 316943, 380313, 41466, -155670, -30788, 7197, -40166, 14202, 82673, 120636, 144522, 71527, -166879, -142124, -29171, -78873, -91786, -156970, -240507, -477004, -309050, 111547, 305605, 141872, -46456, 133737, 144711, 68034, 137181, 181752, 285729, 318179, 119350, 221795, 210130, 93293, 9103, -17893, 139796]
26444A39796q77j66070r0471J1902N514o2635M8497r2233m1753r5552O6994J21457
26432a55431p430m4078o0868L0759K64051J54105K2721k62165j12200J56660R6463
26421H2587K39983J41669k44196l44525M8107K45667J65222p5212J56773J38212
26411E54287N4399l68571k61552Q0976K47499m4374J7983J93887Q9782l34933
26401B29383l31271j11885J52652J99467j76176n025p1221m8788J39948J02425
26391G9509J05393j86223m11125j7985K52270J92641P1370m4565k90332o8883
26381c17930K35931K27865j02970n3946l5641r9485j83971l8806K49382K2637
26371i6934R829J22442j69392N123J3833j12225M9592L8324j54633O8142O4326
$$ y = [139796, 138919, -27151, -117622, -105720, -100206, -162841, -114344, -206577, -248330, -343882, -276888, -155431, -162861, -206939, -267807, -237048, 27003, 181108, 203829, -58336, -170536, -13876, 82587, 322570, 464239, 220043, -124482, -76375, 169292, 334514, 259302, 416075, 554287, 608686, 240115, -21437, 59539, 307038, 262664, 280647, 474534, 564316, 229383, -101888, -213773, -61121, 138346, -37830, -42855, -114076, -162864, -22916, 79509, 184902, -1321, -412446, -430431, -178161, 14480, 85850, 41285, -249047, -317930, -81999, 145866, 42896, -11050, -46691, -146176, -330147, -368953, -119571, -96934, -87105, 35337, -134055, -128932, -115099, -227324, -177732, -139408, -294041, -225899, -161573]
26360a61573P0426J74717p1541p29m8354q4275q2690K27769O2385J2707Q4861
26349A83703L00356J20594j88375k0641k3735j87218j83093j8956o4048J14027
26339C2614J79314J7008q8317Q4663K08716J417p553l7307k03157k6158n2188
26328A09052M6162n0465k81998o1349N8106J19405j27372N9502N0196J55353M4103
26317A20695N0958R4888J159m4057J36464L8430J32246M367m7314j77657l08035
26306B144J33982Q7590k47454j44934j5252K5069Q2432J13668j62911K6841J78765
26295G9940j51443m5552Q4760p9860j75616j50377q8849j09618J68866K72438
26285a95311J60608r5120r6622K64954J76158j92948N7792L0022O578Q6972J7096
$$ y = [-161573, -91147, 83570, 12029, 11300, -37054, -121329, -204019, 23750, 86135, 98842, 183703, 484059, 604653, 416278, 395637, 371902, 184684, 1591, -17365, -81413, 32614, 211928, 228936, 140619, 225282, 433998, 435415, 427862, 390555, 187398, 161240, 109052, 155214, 104749, -177249, -238598, -180492, -61087, -188459, -128957, -78761, 76592, 120695, 171653, 266541, 267700, 223643, 360107, 398537, 530783, 535150, 487836, 310179, 2144, 136126, 223716, -23738, -168672, -183924, -158855, -76423, 37245, -125666, -98825, 79940, -71503, -117055, -32295, -112155, -287771, -438148, -526997, -636615, -467749, -195311, -34703, -129823, -226445, 38509, 214667, 21719, 79511, 109533, 116111, 203083, 220179]
26274B20179j74960l13800j4920R4281K55406J97257k59932j84034M0577J33324
26264f622J48360K92224P0065q8603k0973j09542j07766P30M3698L6478J1070
26253B69119m8648j09113J41902j17711o8610J53197o3723N2938n0020L1961l1794
26242A59498j86227j33911M8900J17397O8671Q2473j76925Q241j31093J79701
26232C6725K31066r9861M2265j4955l5859k72113j6040J2042K1000Q3438O217
26221f075J29497O2617k66544j51171L4738Q1334K3926K449n3180J4343m4676
26210a72742R8019J39248R6540j62613q0316o2084q95J50317L146j26308j67523
26199b85211Q536O3619J49872J90629N4065j77408J39921J10191j22466k89768
$$ y = [220179, 45219, -268581, -283501, -189220, 66186, 263443, 3511, -180523, -139946, -6622, 141738, 433962, 504027, 415424, 394451, 284909, 177143, 177873, 221571, 258049, 269119, 220471, 111358, 253260, 135549, 66939, 220136, 156413, 209351, 159331, 191292, 159498, -26729, -160640, -111740, 5657, 74328, 156801, -20124, -11883, -142976, 36725, 267791, 167930, 210195, 195240, 159381, -112732, -128772, -116730, -95730, -12292, -6075, 123422, 186039, -80505, -231676, -196938, -115604, -91678, -89229, -142409, -128066, -172742, -74723, 64525, 161065, -1548, -81864, -143948, -144843, 5474, 8620, -117688, -285211, -276675, -213056, -63184, 127445, 181510, 4102, 144023, 254214, 131748, -158020]
26189a58020j88377P9914N8721r5611M5696k5821J53146J11425L2398j04387K659
26178h8257K18400J94430j17938j29285J49069J5246n4943k32320m8698j9592
26168a13888q833J80571K66266q1588k19556R3781J81879j03285j21338J08302
26158A82311j94734p8346N7800L9522k9152l1353J33241K44504J20438k9219k39332
26147A75680k47917q9463J00928L92217k08755k16561J42803j95893Q0425L03845
26137B37309k07767l63684r1297J10796L27956N9366k67152q5980K60991j5137
26127c4599j01879L3291M6251N1703J3001j75465J11273K8001m679O8770o372
26116B9296K01530q381j02413L3625o869J71996L1071j91350r875j93290k53601
$$ y = [-158020, -346397, -266483, -207762, -303373, -257677, -283498, -130352, -18927, 13471, -90916, -88257, 130143, 324573, 206635, 77350, 226419, 241665, 186722, -45598, -94296, -113888, -122721, 57850, 324116, 242528, 22972, 116753, 298632, 195347, 74009, 182311, -12423, -90769, -32969, 6553, -22599, -53952, 79289, 323793, 444231, 415012, 175680, -72237, -161700, -60772, 331445, 122690, -93871, 48932, -146961, -66536, 237309, 29542, -334142, -425439, -314643, 13313, 72679, -194473, -280453, -19462, -34599, -136478, -103187, -56936, -5233, 7768, -167697, -56424, -28423, -33102, 35668, 29296, 230826, 222445, 120032, 153657, 146788, 318784, 349855, 158505, 148630, -44660, -298261]
26105b98261J69314J02985l6744j28944K27324O9110k45556j60602K68931K65299
26095B32856L2433j62414j27364j52733k7803j21646m7062J38780J6207L3146
26085a85600J64801J47510j62683l23910k11032r9352J66217K49477O1247Q6319
26075a07006L1460J3319N7725o2141j60884r6212K57574K44684p5191l4701j1264
26064E7363j60777j7764O6310j61988m0879R0547J15387k51873J96584J42731
26054C5641k14970j31466J28338R9957j45592M1046J32411M5922J13096l0514
26044G3869l47227l8885p8656q7043j21770J85865J64987r2746L2711J95373R5326
26033a8196l7421Q8497j78577k23419K18753R2463M2044J6139O4558L2281q8392
$$ y = [-298261, -128947, -25962, -62706, -191650, 35674, 104784, -140772, -301374, -32443, 232856, 265289, 102875, -24489, -177222, -205025, -326671, -373733, -234953, -218746, -185600, -20799, 126711, -35972, -359882, -570914, -670266, -504049, -254572, -193325, -107006, -75546, -62227, -4502, -66643, -227527, -323739, -66165, 178519, 103328, 68627, 57363, -103414, -121178, -54868, -216856, -257735, -167188, -51801, -303674, -107090, 35641, -179329, -310795, -182457, -82500, -228092, -187046, -54635, -8713, 104383, 73869, -273358, -312243, -390899, -477942, -599712, -413847, -248860, -341606, -308895, -113522, -18196, -55617, 32880, -145697, -369116, -150363, -57900, -15856, 283, 64841, 97122, 8730]
26022H730M8116Q8330p6966Q4929Q444J89985o34q2953M282j32512M9099k29599
26010d0749j32535L052j14024J32627K47746J99655L1272j66579j52511k45849
26000b37895k04748J95787J84451J00717p5988o3085r6558o8895L5624r0350J76565
25989a44375M3246l9731j82869m1894K98692K15758k68752K2922J11134j43800
25979a29669j22613J0674J27487J58819L822J57585O2531j48860j2124l5933j76079
25968a04360J6330Q1833k7466j24466o9687k62774j0432J51886K15118K19814
25958H5796j32160j88336j82025O9707L74714M28231L9822j35831j87248j7352
25948A55318j18968k07351n4283K82010P6810N4601K99720O320l08140k56939
$$ y = [8730, 56846, 145176, 68210, 153139, 161583, 351568, 350934, 267981, 272263, 139751, 188850, -40749, -173284, -170232, -284256, -151629, 96117, 295772, 327044, 160465, 7954, -237895, -442643, -246856, -62405, 38312, -37676, -100761, -197319, -266214, -230590, -320940, -144375, -101129, -140860, -323729, -365623, -66931, 148827, -119925, -97003, 14131, -129669, -252282, -241608, -114121, 44698, 48520, 206105, 268636, 119776, 107652, 71719, -104360, -88030, -6197, -33663, -158129, -227816, -490590, -501022, -349136, -134018, 85796, -46364, -234700, -416725, -347018, 27696, 455927, 495749, 359918, 172670, 155318, 36350, -171001, -225284, 56726, 133536, 188137, 487857, 494177, 186037, -70902]
25938g0902L9303R3292K6890j9225M2473O6418j61860p2438P6446J91846J0596
25927B22839p3382j58896j03179L1853K04857q7243n7740p4574P2154L7348k9272
25916a5235j3408L254K46965K16741j33491j43014N9374M1509P8933q6856j79870
25905G4902o626J2248O7041k79759j18267J77106R9450j17931q0233N4771J63484
25894D6186J08499R9033j66966j40981K0733P864j28108m3391k43897O1787J87077
25883a92164m3396J51583Q7411q4488r9086j11137M0059l90318p4891L00833J42126
25872b73468j31217L8065N0540N4267K54888P2230L2165j2207J57261O116L0261
25861B78901l5742k08885k36918K1219J09702j64012j52319R4342K91333M3838
$$ y = [-70902, -31599, 61693, 88583, 69358, 111831, 178249, 16389, -56049, 20397, 212243, 222839, 149457, -9439, -112618, -80765, 124092, 36849, -20891, -95465, -23311, 14037, -15235, -28643, -25389, 221576, 438317, 304826, 161812, 221186, 262695, 341628, 254772, 74902, 68276, 80524, 147565, -132194, -250461, -73355, 26095, -91836, -172069, -117298, 46186, 154685, 253718, 86752, -54229, -33496, -25632, -153740, -197131, -441028, -379241, -192164, -235560, -83977, 3434, -81054, -180140, -291277, -251218, -641536, -716427, -415594, -273468, -404685, -366620, -316080, -261813, -6925, 65305, 97470, 85263, 242524, 248640, 278901, 243159, 34274, -202644, -181425, -71723, -235735, -388054, -293712, -2379, 41459]
25851D1459r4227K0049o7127K45913L1163k8414j96460j66462O7793K28919J75032
25840B57638k70770K705O600o070M7401l2729k5930l8102Q3971Q6354l9077j7955
25828E4036p7276m2506J9505J55884r2363l67902p0368R4001P0674J85494M36071
25817C65250o318k54611j34312P177j86173J8500K84999J28409O2047J8914L9815
25806C43697K4048M3354k46266j21109J45665k91738j57877o4937J34472L6861
25796a53830J70635O5864Q8857p7911k26237o7368N7920n0839K069j08226j2999
25785c12065P8422J68502L3935k06675n9326m1300O9530P3636l6674O2266K54912
25774H5163n5830q9584J37388K0004k30118Q4437J98315n5474O9466J05607k71420
$$ y = [41459, -52768, -32719, -99846, 146067, 177230, 148816, -47644, -214106, -146313, 82606, 257638, -13132, -10427, -3827, -9897, 37504, 4775, -21155, -59257, 24714, 111068, 71991, 54036, -23240, -65746, -46241, 109643, 17280, -350622, -420990, -326989, -256315, -70821, 365250, 358932, 104321, -29991, -22814, -208987, -190487, 94512, 222921, 284968, 303882, 343697, 367745, 411099, 164833, 43724, 189389, -102349, -260226, -325163, -190691, -153830, 16805, 82669, 171526, 93615, -132622, -199990, -142070, -192909, -190840, -299066, -312065, -233643, -65141, -31206, -237881, -297207, -338507, -268977, -195341, -232015, -169749, 85163, 29333, -60251, 77137, 97141, -132977, -48540, 149775, 94301, 163767, 269374, -2046]
25763b046k30609O0704J76032Q5476n1513k87820Q3456l2404m3387M8455Q0840
25752a12816J52389J30149k13731M5433n283J33764q5019n0843n4286Q1583j34183
25741a12843o4596j19630k2896J1423k88715O9157L81058k6867o5803J88234K17544
25730A66066p7040j02117J85259j8732k50279r2563R6495Q8410m941j58772K5284
25719a42930K5937o431J40440k2618o5369L2434R2848R2940K475N0619M93m6854
25707A53984j95452j09092j01130j44499j0939l7566m4622K50466P934n0413j45916
25696d27245o3628K9447L61652K17564L7641j41025j32537n5487r5397Q7009N9631
25685a22375j10076l550J77700l2794K0636J17819k4727o4570J43977j57806l58631
$$ y = [-2046, -232655, -171951, 4081, 89557, 38044, -249776, -166320, -198724, -242111, -193656, -112816, 39573, 169722, -44009, 1424, -3859, 129905, 44886, -5957, -60243, 21340, -112843, -177439, -297069, -319965, -308542, -597257, -528100, -147042, -173909, -239712, -51478, 166066, 89026, -13091, 172168, 153436, -96843, -189406, -92911, -4501, -9442, -168214, -142930, -116993, -123424, 17016, -5602, -70971, -38537, 54311, 147251, 149726, 200345, 200838, 153984, -41468, -150560, -251690, -396189, -407128, -444694, -489316, -238850, -230916, -281329, -427245, -490873, -461426, -99774, 117790, 155431, 14406, -118131, -173618, -269015, -182006, -122375, -232451, -236001, -58301, -91095, -70459, 47360, 22633, -41937, 102040, -55766, -414397]
25674d14397P8994r86P4096J90799n5772J45837O5440J74586j5229o9896j66443
25663G029j6769J01673N41j19689p5208r1414r164J30952J13682J10403r5876
25652E6160m102N7388J643l0993N9750P5274j03864j12916j02597k21406N6000
25641b69663j39146M7247O7015L4505r9700J23931k35639j25960j8210J40940
25631d74680L3871j96045O4J71768k020J93614K64501Q2229P597j5699j39738
25620g4538J93259Q5094j42114k9673j36225N2996K22006M9119K92535j62081
25610C50378k87823J44145N0755j33525k40441k71973l0815L4962q9081J36243
25600c37175J09121K2027j9380J05015l3975J37138q1671J21172n4341j33614
$$ y = [-414397, -335403, -336389, -262293, -71494, -127266, 18571, 84011, 258597, 243368, 173472, 7029, -9740, 91933, 92474, -27215, -102423, -193837, -203001, -72049, 41633, 152036, 56160, 52058, 109446, 111089, 80096, 139846, 215120, 111256, -1660, -104257, -325663, -269663, -408809, -361562, -294547, -260042, -359742, -235811, -471450, -597410, -615620, -474680, -440809, -636854, -636790, -465022, -467042, -273428, -8927, 73302, 80899, 65200, -74538, 118721, 203815, 61701, 32028, -104197, -51201, 170805, 219924, 512459, 350378, 62555, 206700, 257455, 123930, -116511, -388484, -419299, -384337, -473418, -337175, -228054, -206027, -225407, -120392, -154367, -17229, -98900, 22272, -32069, -165683]
25590a65683J47535o4981q533J46598R8692q6634L4465J92613R6577r5322k57926
25579C7401Q2586K8550j70887n1956R2232O3519J29007j05382k32284N0162J82493
25568A05441k14673m5969m856P7044K69422Q2987o3622j3312j11793r002k34918
25557a63251m1591J41446J8122J35664J79324J57559M4561k56707q2000J51543
25547B84670k01194m5193J07686p5891J9749r8658j56966j97874K09644J49096
25537d931K02108k8615l05755k68259p2863P106N8476K72551K94391j18116j49922
25526a13829j07282r465O4102l7790J78954p5639m9331k14184J37798l3572j12083
25515c72321J31805K25292J13245j01410q6506K05891J05921L02776q889j94309
$$ y = [-165683, -18148, -83129, -91662, 54936, 153628, 66994, 101459, 294072, 390649, 295327, 37401, 119987, 148537, -22350, -74306, 17926, 81445, 210452, 105070, -127214, -77052, 105441, -109232, -155201, -160057, -83013, 186409, 269396, 205774, 192462, 80669, 71667, -163251, -204842, -63396, -45274, 90390, 269714, 427273, 471834, 215127, 133127, 284670, 83476, 38283, 145969, 70078, 89827, -8831, -165797, -363671, -154027, -4931, 197177, 168562, -137193, -405452, -478315, -471209, -412733, -140182, 154209, 36093, -113829, -221111, -230576, -166474, -204264, -25310, -100949, -150280, -364464, -226666, -260238, -372321, -240516, -15224, 98021, -3389, -89895, 115996, 221917, 524693, 515804, 321495]
25505C21495k44105q3873L4847J1312J36021K73102k22336j51883o0991r3181
25495g9592j43694o3290K44009K0333J4206l9997K9607p1580K07167J46848j30759
25484A33258k14059m3425J23714J90942O7471q1955j24004R5539O2916K46651
25474D57048N9423k38784j59406k41235k89242P7134l1027J50581O2041J7921
25464a35546P9145l7365o7416j7657L5225J22792j44450j54073m8455J20068O0793
25453a86939L7764J73205k22786j1009J88022j70999j07710q82j03571N0409J09860
25442b44636J50744J82923J2153j08710P3987P8325P8078N2017j00380q650k0584
25431A45267J47003J47292J29375Q9798k48499k14998r6658K0612j01305l03358
$$ y = [321495, 77390, -6483, 28364, 39676, 175697, 448799, 226463, 74580, 13589, -79592, -223286, -286576, -42567, -22234, -8028, -48025, -18418, -89998, 117169, 264017, 133258, -80801, -124226, -512, 190430, 257901, 175946, 51942, 147481, 210397, 457048, 516471, 277687, 118281, -122954, -412196, -335062, -366089, -215508, -153467, -135546, -56401, -93766, -161182, -178839, -143614, -20822, -165272, -319345, -367800, -247732, -186939, -149175, 24030, -198756, -209765, -21743, -192742, -300452, -301334, -404905, -354496, -244636, -93892, 89031, 101184, -7526, 66461, 144786, 222864, 274881, 174501, 165851, 145267, 292270, 439562, 568937, 658735, 410236, 195238, 98580, 119192, 17887, -285471]
25421b85471R4975L91873J71822j79461k71606k94340K08629K98418l4697r3287
25411F855K2312J93249Q9606j55426J3153K321M4419O1632j3313q9223j57642
25400A7943k9101J26636P4108J20372j35525k87752k43369L6294J61533k4205
25390a83066o6696j9399R2809o4325J028p9837Q8736M1242l5414J4468J35116
25379g5338l1022j88567J06393J55294j25230N9536J95779L4244k9829l3513Q9461
25368A57208K02394n3499k6793K3638L8292j17983j44021J62026N9819l41998
25358d0917j40565K2660J23438j3669k50954n2643J15867J64212J11959m0031
25348f43j44025J20998J76939K97694k52211j28769o4977R977r8890j8351j30916
$$ y = [-285471, -190496, 201377, 373199, 193738, -77868, -372208, -163579, 134839, 100142, 6855, 29167, 222416, 312022, 156596, 169749, 172070, 216489, 278121, 264808, 175585, 17943, -11158, 115478, 189586, 309958, 174433, -113319, -356688, -320394, -158861, -183066, -249762, -269161, -176352, -240677, -239649, -319486, -230750, -189508, -224922, -210454, -75338, -106360, -294927, -188534, -33240, -158470, -98934, 96845, 131089, 101260, 67747, 157208, 359602, 306103, 279310, 302948, 341240, 223257, 79236, 241262, 301081, -40917, -181482, -158822, -35384, -49053, -300007, -352650, -236783, -72571, 39388, -643, -144668, -23670, 153269, 450963, 198752, 69983, 5006, 14983, -83907, -102258, -233174]
25337b33174M2738J09177k8641O0827n1754n1141R8310M0242j44025R2349M7125
25326a7967M2360j18297N7151j1900j90827j9607M1817l4784J93185l7309P1448
25315b4730J01323j25346j8339j1217m1152J97963n3787k05433M8074k56151m0025
25304d28820P1045Q6952K0037Q8673J82633Q5044j57089J22091l7366p7170m3758
25293h7728o8500k2715P895j21014J26266J79353j41173j06766j52204J15542
25283b71044O1040l3111J80764k9431j47725K08293O6360J5819r8839M9762R9620
25272A01508n9580L722N4448J45373Q3489J5028n5429r2650k5100m6693J17475
25261B41591j72927P1278K25022r8909k89125j67693k4292K6401O992K15723J83090
$$ y = [-233174, -190436, -81259, -109900, -49073, -100827, -151968, -53658, -13416, -157441, -65092, -17967, 24393, -93904, -36753, -48653, -239480, -259087, -217270, -252054, -58869, -96178, -24730, 76593, -48753, -67092, -78309, -119461, 78502, 24715, -180718, -132644, -388795, -428820, -357775, -270823, -250786, -162113, 20520, 105564, -51525, 70566, 33200, -43970, -87728, -156228, -178943, -171048, -292062, -165796, 13557, -127616, -234382, -386586, -271044, -210004, -243115, -62351, -91782, -239507, -31214, 35146, 50965, -47874, 1888, 101508, 41928, 45650, 100098, 245471, 328960, 343988, 288559, 195909, 170809, 124116, 241591, 68664, 139942, 364964, 266055, -23070, -190763, -215055, -188654, -181662, 34061, 217151]
25250B17151M0762j59510j23851J17591J9334j57662j14897j8910N3256M8843
25240g7893n4611j69173P4147K32165J46710K5713k2813m0348k6892J00315j04171
25229H3149k58392r3504n4596J58067L3319l8673M8638r7642R6568k3518o9842
25218b16426K6791K3956L5866K87874J38325k11283j75183k43371J28186K47362
25208D2097J95199j75153j04183M5233j48559k11849o6893J38616M5601l4631
25198b74522n7048m784O9015K98899J62985N4847k1965r4547j89135j73634k15188
25187d45077N0836K82397L9575J735K5670N6436K9311M303J7288n4618J23347
25176A31203m6697j50936J18992n2746k06933J04243j36875R7164O081j15508
$$ y = [217151, 257913, 98403, -25448, 92143, 111477, -46185, -161082, -179992, -126736, -77893, -132504, -301677, -227530, 4635, 151345, 177058, 154245, 113897, 87005, 187320, 83149, -175243, -268747, -323343, -165276, -131957, -170630, -121992, -219634, -123066, -146584, -216426, -189635, -165679, -129813, 158061, 296386, 85103, -90080, -333451, -205265, 42097, 237296, 62143, -42040, 3193, -145366, -357215, -424108, -285492, -239891, -274522, -331570, -336354, -267339, 31560, 194545, 249392, 227427, 132880, -56255, -229889, -445077, -394241, -111844, -72269, -70534, -44864, 11572, 40883, 45186, 62474, 7856, 131203, 84506, -66430, 52562, -184, -207117, -102874, -239749, -142585, -136504, -252012]
25166b52012m3535o8416O1772n888Q1648K5429j7167L6526r5522n2905l1457M7347
25154c14180J78387J16890K8554j911o8750m9924R1499J6060J69732o3339j21133
25143a8115J9090n8997j34926J3733n286j23373j28617J28665J54136j28960q6790
25132c69440J07412j00957n905J40426L27825r5176j47652K821j60786J18652
25122a82780K1456O1079j7996J8069J29334M4420j61309p1601q8996J04295Q8307
25111e5722k9254j47137n0581k9775r0423j4400r8155o5631N6924J39441L94345
25100I632K34056j40850p3647J37080l1182J04982L5815j37207j34487j63638
25090a59446J9094j6996l3893J87136m6287l8758j0341Q1255j10198j69697j71000
$$ y = [-252012, -295547, -363963, -302191, -308079, -226431, -201002, -218169, -181643, -277165, -330070, -361527, -314180, -135793, -18903, 9651, 7740, -61010, -110934, -19435, -3375, 166357, 103018, -18115, 975, -58022, -192948, -179215, -184501, -307874, -436491, -307826, -153690, -282650, -369440, -262028, -362985, -368890, -228464, 99361, 4185, -143467, -140646, -301432, -182780, -161324, -100245, -118241, -100172, 29162, 73582, -87727, -159328, -248324, -144029, -55722, -84976, -232113, -282694, -312469, -402892, -417292, -515447, -581078, -524154, -384713, 9632, 243688, 102838, 29191, 166271, 135089, 240071, 275886, 138679, 4192, -159446, -140352, -157348, -191241, -4105, -50392, -89150, -99491, -18236, -128434, -298131, -469131]
25079d69131R2949K16848j3943q313J15821N8698P4204r3255j07167R8591j9624
25068e4322j1774J5737j38947O629K9954j89161N0570Q3364J35071N8142N6715
25057D1978j03195L8868J1625j18009L0797Q9273J04157j89037k0944p5192L7376
25046a52303l776J11994J80048N2055n6354J69959m3253j77304j6849P4837K30549
25035C69603r1226k33697k95083J23006K57641K01696K0775K3053j73298P2887
25025B75357K05827M5238m9934q4976l30045k79841L8008N9682J31393K2710q9522
25014e6103J32986k4551k04619j3652n8038J68892J48212k65664p8435J48321
25004a02651Q8796L1018j09473P4660M4244k2112q5542r1615J35504P6509q2637
$$ y = [-469131, -376182, -159334, -173277, -181590, -65769, -7071, 67133, -26122, -133289, -34698, -54322, -66096, -50359, -189306, -182677, -152723, -341884, -291314, -207950, -72879, -14737, 41978, -61217, -22349, -10724, -128733, -97936, -8663, 95494, -93543, -114487, -189679, -152303, -156079, -44085, 135963, 188018, 131664, 301623, 258370, 81066, 64217, 139054, 369603, 278377, 44680, -250403, -127397, 130244, 331940, 352715, 375768, 202470, 275357, 481184, 526422, 476488, 391512, 61467, -218374, -180366, -120684, 10709, 33419, -56103, 76883, 52332, -152287, -165939, -223977, -55085, 93127, -172537, -250972, -102651, -13855, 17163, -92310, -17650, 26594, 4482, -81060, -172675, -37171, 39338, -43299]
24993d3299j44321m3942N2858J05055J54283j4590P8922J25216k3382o9947o5140
24982A11713j71052M627q1039j57601j39177j31451K44807K08384r3811J62961
24972d1639M5218P1017j53258J48234J34602r7807m60954l1091J09864L60413
24962H4599r9399k61511P3893k03624m7805L03618J42443k12238l4083K31195
24952b2912j22890p3883q5010J00843O1530q836J74325R5628j01242N0835L1909
24941A00297j81141j78780j38762j21671K5005j06637R5305M02568J79229l02644
24931b27231k34303L1058N4831J20004J07501J01056K12959N6354q4482j38953
24921a206O3542J33556l842k5992r6307m4357q7518J09446j5824R3552j73709
$$ y = [-43299, -187620, -231562, -178704, -73649, 80634, 66044, 144966, 270182, 246800, 176853, 111713, -59339, -54712, -135751, -293352, -432529, -563980, -319173, -110789, -204600, -41639, 3579, 74596, -78662, 69572, 204174, 106367, -354587, -385678, -275814, 84599, -14800, -276311, -202418, -406042, -453847, -150229, -7786, -220024, -254107, -22912, -145802, -219685, -304695, -203852, -142322, -151158, 23167, 118795, 17553, 68388, 100297, -80844, -259624, -398386, -520057, -495052, -601689, -506384, -103816, 75413, -227231, -461534, -430476, -375645, -255641, -148140, -47084, 165875, 222229, 137747, -1206, 62336, 195892, 192050, 166058, 69751, 25394, -62124, 47322, 31498, 125050, -48659]
24910d8659l50871J79153J79106k30755R0230J93944J26786k9732L8581J30681
24900B78464j99893k53461o2704O3392p9194m7937p3784P6898J56668L30154P2344
24889B60947j76489M6045L29290m1126q4584n423k58766k02768j03620p7547J97779
24878a16262r0364n8958J6659o6498p3789m0634J4990J86723J09634q3422J6388
24867a85533K07124n3010K535r304j61935J02648j3969J05158r9105O2024M0932
24856b435q5593O6615J69773p4509M0549J33543k9873p1341q6063k2493O2687
24845A00860m0640J76273J25065j62274k0431O4012o0029l6201m8765O78k62029
24834a63481k9255K01572J76745K44704q0866k85716j87674r8416R0710O7428
$$ y = [-48659, -399530, -220377, -41271, -272026, -181796, 12148, 138934, 109202, 147783, 278464, 78571, -174890, -237594, -174202, -253396, -301333, -375117, -298219, -141551, 188603, 260947, 84458, 130503, 459793, 418667, 334083, 328660, 69894, -132874, -236494, -314041, -116262, -206626, -265584, -248925, -315423, -389212, -429846, -414856, -228133, -118499, -201921, -185533, 21591, -31419, -28884, -38188, -200123, -97475, -111444, -6286, -105391, -43367, -2435, -88028, -21413, 148360, 73851, 114400, 247943, 218070, 146729, 60666, 38173, 100860, 60220, 236493, 361558, 199284, 178853, 242865, 182836, 146635, 97870, 98548, -163481, -192736, 8836, 185581, 430285, 349419, 63703, -123971, -222387, -131677, -64249]
24824f4249j9589l2826R1310j22006k33112n8526j11883O0750J02396P2101R1498
24813b24136J9933o7911p4734l0243M2203J30649P6121O1550J02650j32036l0411
24802a26365R9727K6548J3477P4023k021o9224j90923J51946J07368O3523J17752
24791B65831o5470O353j72504k78546M2006J43535j5419q3868o1486R2487K5701
24780a01380Q8978J16313K9807j8753q3793r4145j13306j05628P0598R1224o3056
24769a83141k45341R8235K53865J0329j31238J6607K82829K6133k06791R9991
24759B1478l1832m9500O71J21973J62661k9048M8875J1179l36718P1423o6991
24748g5829q0125J98443o3087O866o4714j97732J54469L19581j48788M362j35
$$ y = [-64249, -83838, -116664, -25354, -147360, -380472, -438998, -550881, -490131, -387735, -315634, -224136, -204203, -272114, -346848, -377091, -334888, -204239, -128118, -66568, 36082, -95954, -126365, -26638, -90, 13387, 87410, 85389, 16165, -174758, -22812, 84556, 148079, 265831, 200361, 206714, 34210, -244336, -202330, -58795, -74214, -158082, -219568, -127081, -101380, -12402, 103911, 133718, 114965, 31172, -62973, -176279, -281907, -211309, -120085, -183141, -428482, -330247, -76382, -66053, -197291, -180684, 102145, 128278, -78513, 21478, -10354, -59854, -59183, 62790, 225451, 196403, 245278, 256457, -80261, -8838, -75829, -155954, 42489, -20598, -13732, -78446, -276178, -121709, 197872, 49084, 53446, 53311]
24737E3311L6204l7957j75185j80887J31000L43398J45041j29500R9578q4972
24727B00031k79466J8616M4414R2523j72k45664n87J16184q371O7092P4296j4904
24715F3992o9752k72694k2880K22835J7124J92467J60933k6316k80594j26214
24705a41099R0940O0215J38785M3734J0098L6468j46050j28235L3428k10946j92435
24694d05097J53645K90568n216j03933J92285J59504l3555j42021l1040k792j21793
24683d9445l2217J39970O9297j0346k54253k64156j04M83727J69928J42479J5987
24672D10867j11301k76768j68078K55282J41480p5246q2829k203k26027j3554
24662a48377j10151o298J21067j62598J22062R6848J02995l4699P0312R1156j24659
$$ y = [53311, 89515, 51558, -123627, -304514, -173514, 169884, 314925, 185425, 285003, 200031, -79435, -60819, -16405, 76118, 75946, -169718, -170305, -54121, -62492, 4600, 78896, 63992, -5760, -278454, -301334, -78499, -61375, 131092, 292025, 265709, -14885, -141099, -50159, 10056, 148841, 192575, 202673, 239141, 93091, -35144, -1716, -212662, -405097, -251452, 39116, 33900, -70033, 122252, 281756, 248201, 106180, 75140, 72348, -49445, -81662, 58308, 127605, 117259, -136994, -401150, -401254, 82473, 252401, 394880, 410867, 299566, 22798, -145280, 110002, 251482, 176236, 93407, 91204, -134823, -148377, -258528, -264826, -143759, -306357, -184295, -87447, 15548, -19151, 51161, 142317, 17658]
24651A7658j48370l5774K04326L8501j56561k45254j68237L55041K10872J47215
24641B19417m5745l40276K4904J64424J25321Q265L407M002r5979Q3298k07509
24630e6471r7404k02890M5452r8486J90119K11484K4830K04838J24711J22999
24620D69182l48744r6341j61894K2639J08354K5758N3102n6916j32081k1051N1291
24609h6701o6929J10269K14766Q9584R3215R0588j47666j98919k44169k00395
24599c46357n5585K04766j2471K8998K28192K70912P9212J16988M0821k19623
24589C35853j85226m8715L6385r9504q9687q439N6571J73424j42210k3100n4162
24578d8810q44J01861j75533j64851P0012K11915j93216r7180L02422J34204j7058
$$ y = [17658, -130712, -166486, 37840, 76341, -80220, -325474, -493711, -138670, 72202, 219417, 173672, -166604, -141700, 22724, 148045, 156310, 159717, 163719, 67740, 151038, -56471, -153875, -356765, -311313, -409799, -219680, -8196, 16634, 221472, 346183, 469182, 120438, 24097, -137797, -115158, -6804, 18954, 72056, 15140, -116941, -137992, -86701, -153630, -43361, 171405, 260989, 354204, 444792, 297126, 98207, -145962, -346357, -401942, -197176, -209647, -180649, 47543, 318455, 397667, 514655, 555476, 335853, 150627, 101912, 138297, 38793, -50894, -59333, -2762, 170662, 28452, 5352, -48810, -49654, 52207, -123326, -288177, -218165, -6250, -199466, -296646, 5776, 139980, 122922]
24567A22922j04945o0785J18775l3725M5622n3057j20711J34456J90215j80514
24557E8253j83476j14044O5037m5215n9271K48749L15967K05612k02049k63235
24547B6328j20227J03061J94477o1021k58924l57108j34418o4748r7391K9826
24537g40145J15508K30478K18445N6178p870K49049o4237k86015O2768k66566
24527d32407o8603K36767K60085n2434o931l8465j76555j92231L6207K08696J98817
24516b7054l4286j02061J5195P1666p1693r3404P0737J49554M7888j35029J11728
24505C241j4160q3639J04573J19233K1614j01206j19413K6293j530J5058O7279
24494C7343q5367j01827M7942p8211j19333l2409J0157k8820J67001N1918k70508
$$ y = [122922, 17977, -42808, 75967, 42242, 87864, 34807, -85904, 48552, 238767, 58253, -125223, -239267, -174230, -219445, -278716, -29967, 286000, 491612, 289563, 26328, -93899, 9162, 203639, 142618, -116306, -473414, -607832, -672580, -769971, -740145, -624637, -394159, -175714, -119536, -127406, 121643, 57406, -228609, -165841, -432407, -501010, -264243, -4158, -56592, -63523, -101988, -278543, -470774, -434567, -225871, -27054, -61340, -163401, -148206, -76540, -148233, -241637, -170900, -21346, 26542, -108487, 3241, -10919, -94558, 10015, 129248, 150862, 49656, -69757, -43464, -44994, -29936, 37343, -48024, -149851, -101909, -180120, -299453, -331862, -321705, -350525, -183524, -131606, -402114]
24483d02114k04299J38073L45412K04683n6961O1257K3286O8698J15876K1423
24473C15334l45310J38558P8453r1636j36160M687K61138J58537j81087j50004
24463E2510m9207P2306p1498k29207q580J08208j03822n6791J23281L19328J21043
24452B77571j19260p9309p1243J569R2416m0887J33312J92901R633k86955l57258
24441b47510m8695n5486K24396K39580Q172j7079K37569N5979q4642k77940l6234
24430a890Q5668k8096O4287j28409l9370l0354j85667j08159P8524K85658J29659
24419A21851o098j06722l8256J51442j08834j27655m0533J03675J70316n7623
24409F1563j84965K1325K51332J88188j97358l54305l27466Q2577J21625n0515
$$ y = [-402114, -606413, -468340, -122928, 81755, 24794, 86051, 109337, 178035, 293911, 315334, -29976, 108582, 187035, 95399, -40761, -36074, 225064, 383601, 202514, 52510, 3303, 75609, 4111, -225096, -233676, -125468, -229290, -286081, -162800, 156528, 277571, 158311, 79002, 7759, 9328, 101744, 60857, 194169, 387070, 396703, 109748, -247510, -296205, -351691, -127295, 112285, 120457, 103378, 340947, 396926, 312284, 34344, -1890, 83778, 55682, 119969, -8440, -47810, -78164, -263831, -371990, -293466, -7808, 121851, 115753, 9031, -29225, 122217, 13383, -114272, -154805, -51130, 119186, 61563, -123402, -102077, 149255, 337443, 140085, -214220, -541686, -459109, -337484, -387999]
24399c87999P4312J5890K96192k9248j06571q0422j6678J01866L3337j1977j0829
24388a22127Q2037j09941j50804Q2324M1833n1174L24898K41182k54925k02036
24378a18733j50029k31767K24150K69246j6586j70127k74382K87716q2800r9651
24368c62963J76936K01296Q3306M3547j5979N4195Q7253N812R7533l2304k31815
24357A06817r4332L7272M7646L9921J5767j67892j21421n4016K0496Q2439k41230
24346c28533j69046L152M34889K68376j57404l35816n1118K759K34295J12272
24336A3826p3836j16932L2606n4710j02801o2815L4731P1777J28908Q119n9617
24325a80744J18218J78292j94252j01920N6634p2192L1744j24960k1196J12971
$$ y = [-387999, -313687, -297797, -1605, -30853, -137424, -217846, -234524, -132658, -99321, -111298, -122127, -40090, -150031, -300835, -218511, -176678, -227852, 97046, 338228, 83303, -118733, -268762, -500529, -276379, -7133, -23719, -193846, -468228, -180512, -263312, -362963, -186027, 15269, 98575, 142122, 126143, 180338, 267591, 273403, 370936, 338632, 106817, 12485, 49757, 97403, 137324, 153091, -14801, -136222, -190238, -169742, -87303, -328533, -497579, -494427, -59538, 208838, 51434, -284382, -335500, -332741, -98446, 13826, -60010, -176942, -144336, -199046, -301847, -364662, -329931, -258154, -129246, -121127, -180744, -62526, 115766, -78486, -180406, -123772, -195964, -164220, -289180, -310376, -197405]
24315a97405K13947R3242k73778J8972j7755j11405R6491P6704j06834j30387
24305c38208P9633K4446j07760K3821L21628k6763O461J6812K5553j54770J10156
24294a8991j11991j75966J7517J13560M2425k5013M5149L67593r4282j37720j70957
24283a48676K5630K02190M3221k05253P9774j16622m2199j55095j64235J7459
24273d63806K80443M2581J64978p904R6531Q3991l2243P9180K5635j16341q6111
24262F6934N8099k0902m7476O2697R9843Q9060O3117N3665L2112n9498k04903
24251A92748j29626o007L0017J18223j93012J1050K7383m4930J16512j20382j93696
24240a91720j13518M3457L4155L3831j35274J8462J07636K28856O2379m3738j69145
$$ y = [-197405, 16542, 109784, -163994, -145022, -162777, -274182, -177691, -100987, -207821, -338208, -258575, -234129, -341889, -318068, 3560, -23203, -16742, 70, 25623, -129147, -18991, -130982, -306948, -289431, -175871, -133446, -158459, -113310, 254283, 160001, 22281, -148676, -123046, 79144, 122365, -82888, -3114, -119736, -161935, -317030, -481265, -463806, -183363, -140782, 24196, 16292, 112823, 196814, 164571, 243751, 269386, 153045, 66934, 125033, 104131, 56655, 119352, 219195, 308255, 371372, 425037, 457149, 397651, 192748, 63122, 57115, 87132, 205355, 12343, 23393, 50776, 5846, 122358, 1976, -191720, -305238, -261781, -227626, -193795, -329069, -310607, -202971, 25885, 88264, 44526, -124619]
24229a24619P4660L8463O6791j1470k19798j36487k2117K76774K60410j7921j30621
24218E4065n3618L99593J47219j43597k28318j14089k56040J36550j39553j54330
24208c52118N3168K71436J18914l0241q4959J52771L9117j10882j97971m7609
24198a88374K06615K34026l29737k16731L6152J78853K67494J01868N4025j80127
24188A64064k64812j87836J86244J87224L7402j4797p9547j26216J4906j16288
24178a99656j14674J10434K01101n3752j04850P7515j03757j60061K57946J55958
24168F6204N8609k73663P1611Q8345j26165k37044j70735J39934L55840K04103
24158A77039j37848j74285r2696j20472L3441J49594Q6926J23230m2556J76098
$$ y = [-124619, -49959, -11496, 55295, 43825, -175973, -312460, -334577, -57803, 202607, 184686, 54065, 447, 400040, 547259, 403662, 175344, 61255, -194785, -58235, -197788, -352118, -298950, -27514, 91400, 61159, -23800, 128971, 168088, 57206, -140765, -188374, 18241, 252267, -77470, -294201, -258049, -79196, 188298, 290166, 344191, 164064, -100748, -288584, -102340, 84884, 122286, 107489, 27942, -98274, -83368, -199656, -314330, -203896, -2795, -56547, -161397, -83882, -187639, -347700, -89754, 66204, 124813, -148850, -77239, 11106, -115059, -352103, -522838, -382904, -27064, 177039, 39191, -135094, -227790, -348262, -314821, -165227, -78301, 44929, 2373, 178471]
24148A78471J44061r1977P2683k70645m3994L2175j01403p3263M0823j65827j21830
24137d00726N2204L2925L39145N1214j17047o6442J28389K43073l8303j98527
24127B5905l8901K83894J32138k75349k00420k55924J1636K08384K48m4522m4084
24116a96995J26436r8388O5888Q7346j05153p0672j3605l0516J02308J90514r4037
24105c6874o8783n409p1800J30508J5459N4678J9757J33271K137j19597p0361
24094a7014n7119k7819N7213J97845l52717l4064P7874M1011p7805J1997k32226
24083d12824J03537l4126k4881P1262k450j5988J57169K31355q0616r8041l9066
24072a44669L8277K2735K44809J87682r7586K8826k78743J4628j70943m2226l8563
$$ y = [178471, 322532, 230555, 303238, 32593, -11401, 20774, -80629, -153892, -113069, -278896, -400726, -348522, -315597, 23548, 74762, -42285, -108727, 19662, 262735, 224432, 25905, -12996, 270898, 403036, 127687, -72733, -328657, -317021, -108637, -108389, -152911, -196995, -70559, -168947, -103059, -15713, -120866, -191538, -205143, -235659, -133351, 57163, -36874, -105657, -111066, -182866, -52358, -36899, 17779, 37536, 170807, 172944, 53347, -17014, -74133, -101952, -44739, 153106, -199611, -233675, -155801, -114790, -192595, -180598, -412824, -309287, -343413, -368294, -297032, -299482, -315470, -158301, 73054, -7562, -105603, -144669, -106392, -83657, 161152, 348834, 251248, 280074, 1331, 15959, -154984, -197210, -235773]
24061b35773j09313J47141n7377J76312K7573l07090n4695l9503M37412L51123
24051C35810J4727m52768l81243r8902J22828R0301J02252K59290o5610r1644
24041a64959j50254N3588J1790j5909Q5773M6403p2792K512K1687m3663J75819
24030e0005J04892l44354j36286J40926L02953P1312l8245l02449m1215J63124
24020a29347K33782j41783j67520k71804q6296J32306l9726J67356J42836K75252
24010A15056l0727J1714O3357j54579r8274p5421L22476N540j44834q2644N7503
23999a0833M0343j79275j7826J21174J14614K726r0134j65812j06105n6006K31132
23988a16002k6611j35861k183J52831N5497J25800N5465q7566j0057j7034K18932
$$ y = [-235773, -345086, -197945, -255322, -79010, -51437, -358527, -413222, -452725, -15313, 335810, 350537, -102231, -483474, -582376, -459548, -369247, -266995, -7705, -73315, -164959, -315213, -261625, -249835, -265744, -179971, -133568, -206360, -203848, -182161, -225824, -50005, 54887, -289467, -425753, -284827, 18126, 89438, 51193, -251256, -292471, -129347, 104435, -37348, -204868, -476672, -562968, -430662, -470388, -303032, -160196, 115056, 84329, 96043, 159400, 4821, -93453, -168874, 153602, 159142, 14308, -68336, -10833, 29510, -149765, -167591, -46417, 68197, 70923, -19211, -185023, -291128, -347134, -116002, -142613, -278474, -280657, -127826, -72329, 53471, 108936, 21370, 11313, -5721, 213211]
23977B13211K2459l06955N9084M4811R6273n9865j1589O691N3339J25589r770
23966B33278k2036j26247l6627J04224M4506M5196J16505R1429k24543o9741j82406
23955b6462k36407k8459J62661J8654R0252j32990j29510J3849L8944K97527K00824
23944B68883j31991j42189j08868R5573l2988k26630J34698K47370M5563k59969
23934a10548j63117O2754K02679J85125L0178q3840j27489J15882j35160K38325
23924B14789K06242J97811j52215l72561j01723j83876p2930O2779J52318M1089
23914h277k5015O4798o6616q16j7456j27088r9178P3821K95223j80878j55673
23903b47155l9102J08065J12410q3316j13896K37236K41231m5271m04105o6135
$$ y = [213211, 235670, -71285, -12201, 32610, 128883, 69018, 57429, 64120, 117459, 243048, 233278, 211242, 84995, 48368, 152592, 197098, 242294, 358799, 450228, 225685, 155944, -26462, -262869, -291328, -128667, -110013, -19761, -152751, -282261, -268412, -229468, 68059, 268883, 136892, -5297, -114165, -18592, -51580, -278210, -143512, 103858, 149421, -110548, -273665, -210911, -8232, 176893, 207071, 123231, -4258, 111624, -23536, 214789, 421031, 618842, 466627, 94066, -7657, -191533, -264463, -201684, -49366, -8277, -33292, 31506, -35110, -35926, -53382, -180470, -279648, -205827, 89396, -91482, -247155, -286257, -178192, -65782, -149098, -262994, -25758, 215473, 170202, -233903, -300038]
23893c00038L68214J22445k2341R629J31508p5173o9332k05138l6411k5404o7425
23882a69466k82963r8259R8248K3669J91831k52023r4052O6881k363J91648J7061
23871c09788l454l467L48584N1870l3662p6566N876k60679j20127M6037J89630
23860a65746N4354M4664P1436M2351K19560R9172j12175j49515j59062k29008
23850b83969K10516K16656m7425N6293j16555j37113P6590M6901L477J4009j6391
23839B2989l070J36093K44900r6648l10279j57407N0300J68988J14310k84818
23829a14642J03669K66083n3950p5020l5168j19134k95346M3625O6000R5347K51522
23818A32986K03829j87665j01503O3190j76643j08641J64285J69394m2955l88591
$$ y = [-300038, 68176, 190621, 168280, 177909, 309417, 234244, 164912, -40226, -76637, -102041, -169466, -452429, -550688, -452440, -428771, -236940, -488963, -583015, -516134, -518497, -326849, -309788, -313242, -316709, 31875, 83745, 50083, -26483, -20607, -281286, -401413, -355376, -165746, -111392, -66728, 4708, 47059, 266619, 365791, 253616, 104101, -54961, -283969, -73453, 143203, 95778, 152071, 35516, -101597, -25007, 21894, 25371, 39380, 22989, 19919, 156012, 400912, 304264, -6015, -163422, -113122, 55866, 170176, -114642, -10973, 255110, 201160, 126140, 90972, -28162, -323508, -279883, -213883, -118536, 132986, 336815, 149150, 47647, 110837, -65806, -174447, -10162, 159232, 116277, -272314]
23808b72314j12486K62507k7321j74404J64828L26174N3572M0800j49192j46100
23798c3936J21418k3168k078n0280j00823J09354R631J745k20598k4249J44940
23787f8044Q683j82730P243J51162R9993K25107J39634r1586k1400j13912k69543
23776a15393R430R5853J47679r4744k14354p4529K4669J70157K59052q1241R620
23765A36199L4089j61053l6618j38029O0080M9481N823Q3927K06671r0452m7874
23754A02244j2835O1239o7565M6297P4056l41213J39326J42129J8169J5469K1031
23743A98347J18480r0540k72460J91890L02313p1603k7731J03786j95592l01813
23733d4923p8921M657J9443J8523N0593m8559K13604K16290n9566j06427j67009
$$ y = [-272314, -384800, -122293, -149614, -324018, -159190, 166984, 220556, 261356, 112164, -33936, 87482, 64314, 62236, 11956, -88867, 20487, 30118, 31863, -188735, -212984, -68044, -59361, -242091, -234848, -83686, 16307, 241414, 381048, 289462, 268062, 154150, -115393, -105963, -10110, 137569, 42825, -171529, -246058, -221389, -51232, 207820, 126579, 136199, 170288, 9235, -27383, -165412, -105332, -55851, -50028, 33899, 240570, 150118, 102244, 89409, 150648, 83083, 129380, 203436, -137777, 1549, 143678, 161847, 177316, 198347, 316827, 226287, -46173, 145717, 448030, 376427, 348696, 452482, 256890, -44923, -123844, -119187, -99744, -81221, -30628, -79187, 134417, 350707, 291141, 184714, 17705]
23722A7705k47811j1377K8878p5795k2198J05167J54877J47034R2367k56104k60916
23711c28173j29218j67318K26249P1126K21526J38564M4551l49568k71677j26809
23701f70747M4565R3447J18413J83613j24974L168K93701Q1107r9807J72805q7039
23690H252j64529l4270j8885J45941J4628k7547j2531r8944N8930J04940J8882
23679e133K12796j88255l5036q1784j43974K9678J82516J90250j60342r5308K76987
23668A82395J81504j20183k6338n7818q179M5776J91800m0595r6718q6925j2280
23657A52439m0743m1278J46369O0506p7886N6638j58498j50985j20928j78612
23647c52978M5414p7150k1975o2651n8018K20169J03387K47409n7021j38485O0634
$$ y = [17705, -230106, -241483, -212605, -288400, -310598, -205431, -50554, 96480, 188847, -67257, -328173, -457391, -624709, -398460, -327334, -105808, 32756, 77307, -272261, -543938, -670747, -626182, -532735, -414322, -230709, -355683, -352515, -58814, 22293, -77514, 95291, 8252, -156277, -190547, -209432, -63491, -48863, -76410, -88941, -187885, -128955, -24015, -5133, 207663, 19408, -15628, -97412, -241386, -211708, -29192, 161058, 716, -94592, 182395, 363899, 243716, 217378, 159560, 151381, 197157, 388957, 348362, 251644, 164719, 152439, 111696, 70418, 216787, 277293, 199407, 256045, 97547, -53438, -174366, -352978, -307564, -384714, -406689, -469340, -527358, -307189, -203802, 43607, -13414, -151899, -91265]
23636i1265p812j2290Q9901J58309J41817o2270j26600j64026o5374Q257K14988
23625H3635l3177j90213m6824J46621R571n0779J03137J41271j65952j59793K73947
23614A11444J18711J78560j04623l3751j62140k5583P6442J02740o1285j0379
23604A90136j23020k83619Q2185K59723m0795l27507j40230J21010k0239j77654
23594d60010j2934J9098o9061R3393K0468J94332J02423O9243J01626J29713J9733
23583B08024J34321j58514l27868p4836L8706J8966j31167J08401J79423K09893
23573B05349k03360r4992M9762M9575k0637k21435R159J04281Q5415j17449k00619
23562c54951J09462J62624j36878K82888K95291o7305j59623k0420Q406O2323
$$ y = [-91265, -99077, -111367, -21466, 136843, 278660, 216390, 89790, -74236, -139610, -131353, 83635, 50458, -139755, -186579, -39958, -30387, -81166, 21971, 163242, -2710, -162503, 111444, 230155, 408715, 304092, 270341, 108201, 82618, 159060, 261800, 200515, 190136, 67116, -216503, -134318, 125405, 84610, -242897, -383127, -262117, -282356, -460010, -472944, -453846, -522907, -429514, -409046, -214714, -112291, -43048, 58578, 188291, 208024, 342345, 183831, -144037, -218873, -180167, -161201, -292368, -183967, -4544, 205349, 1989, -93003, -43241, 6334, -14303, -235738, -226579, -122298, -36883, -154332, -354951, -245489, -82865, -219743, 63145, 358436, 291131, 131508, 111088, 119494, 181817]
23552A81817Q833j68993k75081o1888r043j58464J53131K5956m4408k8021p54
23541c76915J08302Q3236L16576j41626k42557O0710R1043J40641l7369J14155
23531A16196J9246O9533j4430P7617M1550K7905k15498r4459R4983K05861o4784
23520B63720l44667J21552k18870q3202P2308J51097J28000o2096p9700P2651
23510B0793P9468O7861J39136j09660j61702j36987j30258p6047j41863j3984
23500d63243K20337L07623J7074k83391j37253r3296J2680K8542J08417J36728
23490a45782J28801k5208j68968k39059m978J03369N3688R232L12980j11136J5533
23479g1528J05298j9748R7414j53613M5373l5238j30981J67110Q5531j95439k04546
$$ y = [181817, 190650, 21657, -253424, -315312, -324355, -482819, -329688, -303732, -348140, -376161, -376915, -268613, -185377, 131199, -10427, -252984, -192274, -101231, 39410, 2041, 116196, 135442, 204975, 190545, 268162, 309712, 337617, 122119, 27660, 122643, 328504, 263720, -80947, 40605, -178265, -261467, -189159, -38062, 89938, 27842, -51858, 20793, 100261, 168122, 307258, 197598, 35896, -101091, -231349, -307396, -449259, -463243, -242906, 64717, 81791, -201600, -338853, -432149, -419469, -390927, -282510, -145782, -16981, -42189, -211157, -450216, -455194, -351825, -298137, -288905, 24075, -87061, -71528, 33770, 14022, 111436, -42177, 3196, -32042, -163023, 4087, 89618, -105821, -310367]
23468c10367q9897J47750J27278L975j95435Q6282L8274J74733K40509J7241j24577
23457A15766p0422k10701p2539j31655J02589L24182J85380l04043K8436J29152
23447I6145J09291r0633q3967r9583j34452q9119K02139J91409K4931j07661j69730
23436a51230q9852j4281k66892K1923K44760P2636k0766j09709k19916O0545J12714
23425c60068M113j24352p8007K46057L15083n3162p7052J0279j67768j78967Q2660
23414c81184K25717k8906K0473M9016J86597R2811j2555k12962n8946n6535K4306
23403a52168K17387p0878J6579M3405j6186O1900k67087j30255K65748P2375J61741
23392B02561j28055k87522k79048n4551J18989K41582J31622k30667K9424J10885
$$ y = [-310367, -400264, -252514, -125236, -121261, -316696, -230414, -192140, -17407, 223102, 240343, 115766, 45344, -165357, -237896, -369551, -266962, 57220, 242600, -61443, -33007, 96145, 205436, 114803, 30836, -68747, -203199, -292318, -90179, 101230, 126161, 18500, -151230, -241082, -255363, -522255, -500332, -255572, -182936, -203702, -313411, -533327, -472782, -360068, -355955, -480307, -558314, -312257, 2826, -50336, -127388, -117109, -284877, -463844, -381184, -155467, -184373, -163900, -114884, 71713, 164524, 151969, -60993, -119939, -176474, -152168, 65219, -5659, 10920, 54325, 38139, 100039, -167048, -297303, -31555, 40820, 202561, 74506, -213016, -492064, -546615, -427626, -186044, -54422, -285089, -255665, -144780]
23382a44780m3076K91859J28684J19376k19187j04422l4093m5376O2050q0802
23372f9767j08190J54567j4904o0412k23764J07093K38449N5268j13156J6228
23362a8588q4954o0176l888J879K81208k02179k43910J13208J41811K09666J57377
23351B91454M9440j10288Q9793n6312k10509k25994J00488j33030r8736M7991
23341b55703K65093J06615N5318j21123L173j1618J71316N3186j47327r1990k30974
23330b04034M882Q9573m7747K98604J12645J42706k11531l67866o1604m8504r7731
23319c90607j54808P1246O0026K62077j5854j42489l2685P3856N9101K6241n8813
23308b42709j07832P7376R5896O859O5949j45798r8548J50817K96280J31395J6722
$$ y = [-144780, -187856, 104003, 232687, 352063, 132876, 28454, -5639, -51015, 11035, -69767, -177957, -23390, -38294, -98706, -322470, -215377, 23072, 78340, -34816, -18588, -103542, -163718, -167606, -165727, 115481, -86698, -330608, -217400, -75589, 134077, 291454, 340894, 230606, 320399, 264087, 53578, -172416, -71928, -204958, -303694, -255703, 9390, 116005, 171323, 50200, 53373, 41755, 213071, 266257, 118930, 26940, -204034, -199152, -109579, -157326, 141278, 253923, 396629, 185098, -182768, -244372, -292876, -390607, -545415, -474169, -414143, -152066, -167920, -310409, -343094, -269238, -210137, -183896, -242709, -350541, -273165, -177269, -170410, -104461, -250259, -348807, -197990, 98290, 229685, 246407]
23297B46407j99828r0758J46607Q9231r3318j20249o0960q5011K21487k31820
23287a78212n3635n1838k21744J68101K96442n5434j14455k6848K73964K13006
23277B49347J9495q9995j16284q4700N9680k85310m8095K44037J8117j55553j97643
23266c86904J50139R1502l0901j27465J58217J99814R763j37123O1472L5444L6202
23255F0160k7791L6516R4905m1302m4794R3346J18467k79769k05641k20906k6329
23244d43138M66608J20700o4847o8155m9101K3778j79231R9512k0586J01322M8114
23233C4976p2701j89255k9904K7948j32111J79880L8621O6814K53310j17300j75409
23222a15131k22704m7864p0239P2172L50332K3625j54997J95639m3454k7462k7040
$$ y = [246407, 46579, -44179, 102428, 191659, 98341, -21908, -82868, -167879, 53608, -178212, -231847, -283685, -505429, -337328, -40886, -96320, -210775, -237623, 36341, 249347, 268842, 178847, 62563, -22137, 37543, -247767, -295862, -51825, -33708, -189261, -386904, -236765, -145263, -176164, -303629, -145412, 54402, 64165, -72958, -11486, 23958, 60160, 32369, 68885, 163790, 122488, 77694, 171040, 289507, 9738, -195903, -416809, -443138, 23470, 144170, 79323, 11168, -37933, -14155, -193386, -93874, -114460, -13138, 34976, -37725, -226980, -256884, -228936, -361047, -181167, -142546, -75732, 177578, 60278, -115131, -337835, -385699, -455938, -383766, -33434, -9809, -164806, 30833, -12621, -40083, -67123]
23211f7123o3198P4373L5036k36042j77077R4671J28632O6097l5482K22410R0463
23200A32760K04156R6511j06758j72530k95902j31402k4601M26884P7728k65K12781
23189D19362k20825K4416J46074j01979j60077M0558j6906K6893o3198j68569
23179g4251j36026l5469N2648N4166L975J7180j90807j62552k8799n0850L05525
23168b45260K88675j5865q8724J03853L9131j1200L7471K3850k9825J0600L2708
23157A45414P4480J36795o7092j98417N8611Q7680J44104J33577j00997L5925
23147D50080j18272k32618k5604j53714k524M4633j5202k2306O5042J1694q3802
23136h2593j23556J05116L1840j37679O9245O608M7604K623O8577n7365j16559
$$ y = [-67123, -130321, -55948, -20912, -256954, -434031, -339360, -210728, -144631, -180113, 42297, 132760, 336916, 433427, 326669, 154139, -141763, -273165, -297766, 129118, 206846, 206581, 419362, 198537, 222953, 369027, 267048, 106971, 147529, 130623, 157516, 94318, -74251, -210277, -245746, -193098, -138932, -134957, -117777, -308584, -471136, -499935, -550785, -245260, 43415, 27550, -61174, 42679, 81810, 70610, 108081, 131931, 102106, 112706, 145414, 219894, 356689, 289597, 91180, 149791, 237471, 381575, 515152, 414155, 450080, 331808, 99190, 73586, -80128, -82652, -38019, -53221, -75527, -10485, 1209, -82593, -206149, -101033, -69193, -206872, -137627, -131019, -83415, -80792, -12215, -69580, -186139]
23125a86139o6432R3797P4817J27986N5451J7230n3634L0033k2128k4730P0166
23114A16417j68367j75641l7658O9701p2983L6791J00131l2638J5784K34363l572
23103H2328j0850j5950K90979K14921j10991j61853j31559j74660j45662j54894
23093c18191J31801P4946R7418L9748k46102K1087L1947J57586J16661j29539
23083b2638J79924L9595j02638l8242N420K4505O3025k64814N0794p0861J33636
23072b294J89142r9463j60219k25049R3442J15056k21121J45548K09777j63978
23062a19159J40050J04295M0683K7704k04766j63243m6067Q6633N413O4629l2391
23051i6219j02934j40336J15089J67796Q5610K18676j3745R4569j60109j72262
$$ y = [-186139, -252571, -158774, -83957, 44029, 99480, 116710, 63076, 93109, 70981, 46251, 116417, -51950, -227591, -265249, -195548, -268531, -231740, -131609, -164247, -148463, 85900, 82328, 71478, 55528, 346507, 561428, 450437, 288584, 157025, -17635, -163297, -318191, -186390, -111444, -14026, 25722, -220380, -199293, -167346, -9760, 106901, -22638, 157286, 196881, 94243, 56001, 61421, 85926, 148951, -115863, -65069, -135930, -2294, 186848, 87385, -72834, -297883, -204441, -89385, -310506, -164958, 44819, -119159, 20891, 125186, 165869, 193573, -11193, -174436, -220503, -133870, -128457, -63828, -96219, -199153, -339489, -224400, -56604, 29006, 247682, 233937, 328506, 168397, -3865]
23041c865J83764O1283P9478j4865L5880k66361k5996j65021j81972M5305K88421
23030C6051L76931j16688k91347k40253L9451K33699k3018k70498k28825K24622
23020b59875K25558Q7967k00365M0167K2720r5846N9172n3022J24713o6898N2353
23009f3356N2691r1124l0643r924k23955R1896P0124q4559J77338p1868o0269
22998b43649P3783o0610J09212J67491j91456j37574J97882j61803k82395m0412
22988e69531N6968m064J48875J96806J07399K85663J6822q1834m2433K46925n613
22977C55983k35847l3400l3351j87819j94499r4085m860J18311J52947J8398o563
22966a44785K00622J91514j06107j603L4203m1201O217q9085j58003j26070k2955
$$ y = [-3865, 179899, 241182, 320660, 305795, 341675, 75314, 49318, -115703, -297675, -252370, 36051, 412982, 296294, 4947, -235306, -195855, 37844, 14826, -255672, -484497, -259875, -34317, 53650, -146715, -106548, -83828, -179674, -120502, -173524, -48811, -115709, -63356, -10665, -101789, -132432, -142356, -366311, -274415, -204291, -288850, -111512, -183380, -243649, -169866, -230476, -121264, 46227, -145229, -282803, -84921, -246724, -529119, -569531, -512563, -516627, -367752, -170946, -63547, 222116, 238938, 157104, 114671, 361596, 355983, 120136, 86736, 53385, -134434, -328933, -423018, -427878, -309567, -156620, -138222, -144785, 55837, 247351, 141244, 139641, 173844, 132643, 138860, 49775, -108228, -234298, -257253]
22955b57253K61507K68570q4129j72692k2955N5208J4632k92978M6786J87708
22945D404O6245J2477M1136L7848l9104j02212q4955p8314p4800j5798J89990
22934d3083N3007J0650j16945m0633J64115J2739o0332O5871K68216n8674l5035
22923B19896o7195n1761K19822q076r681q0996J26783q9526k00166j2331k81265
22912b34496k28631K07806K61319J75293J09321n4971m4105m7630N2971Q5990
22902B82867k7103j23589N0022K86218j67315j14945j41693p6192j90158q8737
22892c10625J51402p0966j04714r0829K01313J09524r5535O9636k3512J62099
22882b207L8869j57467j05596j00644m6267J85183J78246J82116J1418q5190j46915
$$ y = [-257253, 4254, 272824, 188695, 16003, -6952, 48256, 62888, -230090, -183304, 4404, 70649, 83126, 124262, 162110, 123006, 20794, -64161, -142475, -217275, -233073, -43083, 9924, 20574, -96371, -137004, 27111, 39850, -20482, 45389, 313605, 254931, 219896, 152701, 100940, 320762, 312686, 303005, 222009, 348792, 259266, 59100, 46769, -234496, -463127, -255321, 5998, 181291, 290612, 235641, 191536, 143906, 196877, 282867, 255764, 132175, 182197, 468415, 301100, 186155, 44462, -31730, -221888, -310625, -159223, -230189, -334903, -425732, -224419, -114895, -210430, -140794, -164306, -2207, 36662, -120805, -226401, -327045, -373312, -188129, -9883, 172233, 183651, 98461, -48454]
22871d8454Q3019j14710J56178K0338P3799j27642R0194J10606p2354Q306j77690
22860A590k64424O3209k7185j42383q49j4461M5309L9726J63566L0657j8819J95517
22848G1453L43457Q259J1950k5201j63097k11957j5658K3575p9586o6641N4147
22837d9299J26242r650q2926K8650j11563j01787Q8928K04724N3117J03428J45141
22826C95005k77447k06092J24759j19580o0631J74675J56283M010o8375j87476
22816f4869M6137k9362j65363j41720J09021m5231N4462J32501l9921J21609P3500
22805E0764N8153n7234j07029r4702j94635J39919L36396K91310j20039j26549
22795A76354L6711L6851j24878J02386J39077l1830p4613k13831l25778j01666
$$ y = [-48454, 34565, -80145, 76033, 96371, 170170, 42528, 132722, 243328, 170974, 179280, 1590, -262834, -199625, -226810, -369193, -370042, -384503, -339194, -299468, -135902, -105245, -124064, 71453, 414910, 423169, 435119, 409918, 246821, 34864, 19206, 42781, -36805, -103446, -49299, 76943, 67293, -15633, 13017, -98546, -200333, -111405, 93319, 146436, 249864, 395005, 117558, -88534, 36225, -83355, -143986, 30689, 186972, 190982, 122607, -64869, -18732, -48094, -213457, -355177, -246156, -291387, -236925, -104424, -144345, -22736, 50764, 108917, 51683, -55346, -150048, -344683, -204764, 131632, 422942, 302903, 176354, 213065, 249916, 125038, 227424, 366501, 334671, 260058, 46227, -279551, -381217]
22785c81217P8114K81579o1950o7456L04233l5388j15816j02607p3821J83817
22775I488Q4361K6621J48017Q4723j91876j67608J9701m1684j57925J14602K32773
22764A61193q4273k22765q5768J29836O9263J94284j95432o3828p4289j39090
22754c10869O7725J53731J00142l2936q969j1794l3233q0350L9431j73130J68132
22743a22120J68582l05263k79547K25525K81202L99421J6353k88512j54364J32816
22733G4093L2218L059Q8001J57927L22997n9572m41435k53809n2483q5147j20697
22722c34848M5942L63895M9156m4035j08530N4709J09844R4423l12397j78972
22712b60813R0918J90919J98182k1251n2633k7074L3021J1297J08569m9881j33937
$$ y = [-381217, -303103, -21524, -83474, -150930, 153303, 117915, 2099, -100508, -174329, 9488, 93849, 120470, 268487, 353210, 161334, -6274, 13427, -28257, -186182, -71580, 161193, 76920, -145845, -231613, -101777, -32514, 161770, -33662, -97490, -171779, -310869, -243144, -89413, 10729, -22207, -31176, -42970, -76203, -156553, -117122, -290252, -122120, 46462, -258801, -538348, -312823, -31621, 367800, 384153, 95641, -58723, 74093, 106311, 109370, 197371, 355298, 678295, 618723, 177288, -76521, -129004, -214151, -334848, -288906, 74989, 124145, 80110, -28420, 26289, 136133, 230556, -81841, -260813, -169895, 21024, 219206, 197955, 145322, 118248, 151269, 162566, 271135, 221254, 87317]
22701H7317K8007R9620j81850o8108O05j46261J317K15449K41386l5043m2593
22690A99846j13396j15673j06336K93362K0784M68k95202K8657K2372n5022j79454
22679b99594K89594j34737l4120J59544l7371q561j27328q726N0572O0006K62643
22668A71922Q4548M5148L8514r0948k29838j63440J3609J8927J8250M1792q3900
22657a35416j19075P3096q5043k78491J07465K25855J58814j49183K14074J03693
22647A15789k07390L3021J08605J44927k06872r3570j13015j06276k5723J31405
22637b19099J1090P7800k35936j21419J43710J03002J88381Q4742j0551j07957
22627h6237j4772O2129L6248k82131k50708N6677J45784L12739K0584K950P9854
$$ y = [87317, 115324, 214944, 33094, -35014, -34409, -180670, -179353, 36096, 277482, 242439, 199846, 86450, -29223, -135559, 157803, 178587, 179055, -116147, -87490, -65118, -120140, -299594, -10000, -144737, -178857, -19313, -56684, -65245, -192573, -201299, -150727, -90721, 171922, 256470, 301618, 340132, 249184, 19346, -144094, -130485, -111558, -93308, -51516, -135416, -254491, -181395, -266438, -544929, -437464, -211609, -52795, -201978, 12096, 115789, -91601, -58580, 50025, 194952, -11920, -105490, -218505, -324781, -350504, -219099, -208009, -130209, -366145, -487564, -343854, -240852, -52471, 32271, 21720, -86237, -101009, -38880, -2632, -284763, -535471, -478794, -333010, -20271, 313, 3263, 83117]
22616H3117N7486k06004M0002K00737k8809J57046J6720r9598J49596o6352k34910
22605F9031M9667J27888m8461l54220R0167K18476M4971R7390l3185k2211J06339
22594C45852m8741j08413r5027j56084k22298J56134J71838m450m5735J4084J56490
22583A63650Q9273q3380n2619o5552J00600q8174o9221m6702J43871J07432r4240
22572A04938j43932l2922N8735J215R3761L9336P3182l6371j19137J60954R8718
22561B98477j07200l08569q3053J48836k01936j34088m3248J67407J03903K4707
22551a34764L3844j0327n8958O5728J72838Q0161j92496L1281j01803O4819J49546
22540I9869k0348p1065j7780o0815q6535J94898k45091N5792n4048j08834J49780
$$ y = [83117, 140603, -65401, -25399, 175338, 146529, 303575, 320295, 220697, 370293, 303941, 69031, 118698, 246586, 198125, -156095, -65928, 152548, 197519, 294909, 261724, 239513, 345852, 297111, 188698, 93671, -62413, -284711, -128577, 43261, 38811, -6924, 7160, 163650, 252923, 169543, 116924, 51372, 151972, 63798, -5423, -52125, 91746, 199178, 104938, -38994, -71916, -13181, -11966, 81795, 121131, 194313, 157942, 38805, 199759, 298477, 191277, -117292, -200345, -51509, -253445, -387533, -430781, -263374, -159471, -134764, -100920, -111247, -170205, -104477, 68361, 148522, -43974, -12693, -114496, -49677, 99869, 79521, 8456, -9324, -70139, -156674, 38224, -206867, -151075, -205123, -313957, -164177]
22529a64177N276l2529k29671k31732J82644L55612J92064j8374K23589J34433
22519D17135r5480m5523q45q2688r3265j06466j20582o9902J00731l0474o295
22508a33654j51986o6012l8306L493K36355K27220j07655j37268O3170J40049
22498C5406J30495L1914J3125j15820k83363R0949P9674k4212n9112L23977O5750
22487B88783q565Q7571L0514o8750J45403K39549j1493q0959j00958L68129L61424
22476A250648J56676J26351j00417q3838j26640k55477j22075k9587k24658L6220
22466F27203m2937Q9094j46181j26418j32884l16429j42127m7138J21810Q0727
22456c5280k32454n694j58459J07019K71059K26149J13458J51009L0429l03172
$$ y = [-164177, -158901, -191430, -421101, -652833, -470189, -114577, 77487, 59113, 282702, 417135, 321655, 276132, 275287, 192599, 99334, -7132, -127714, -197616, -96885, -127359, -133654, -285640, -351652, -389958, -386465, -150110, 77110, -30545, -167813, -104643, 35406, 165901, 197815, 210940, 95120, -188243, -97294, -17620, -41832, -100944, 223033, 288783, 280218, 367789, 398303, 329553, 474956, 714505, 703012, 622053, 521095, 889224, 1250648, 1407324, 1533675, 1433258, 1349420, 1222780, 967303, 845228, 815641, 590983, 627203, 584266, 673360, 527179, 400761, 267877, -48552, -190679, -237817, -116007, -35280, -267734, -273428, -431887, -324868, -53809, 172340, 285798, 436807, 467236, 164064]
22446A64064j55635j27201q3636j53885Q4020K19457r586K5731R7753Q9972R539
22435A60593k23532n5129J06061J07663M7666O0164m0848l2563K704p2210K0697
22424H1266K3556j49987m09445o0357K07230O5856K14050j99578J1308M4985j83053
22413c54169Q7036K89783l77p8822k0865k8113N1642J29701J3394O0504j01792
22402D7922m4000k6962N6512n603J6155L6481J07885Q3101j87454J7783L3315
22391A35135j53815k5167O5717n2623J730N1269K24393Q4908j19779j23368l6451
22380E1949j47256j47453J04506N4608l87884k29002J88043J00097j18756K00615
22370c30533J81133K20161O7465k04053j15233r6346J86960J46622L4705J69678
$$ y = [164064, 8429, -118772, -202408, -356293, -272273, -52816, -62402, -36671, 61082, 151054, 160593, -62939, -118068, -12007, 95656, 143322, 203486, 162638, 130075, 132779, 60569, 81266, 104822, -45165, -454610, -514967, -307737, -241881, -27831, -227409, -216101, -171116, -354169, -267133, 22650, 22273, -56549, -77414, -105527, -53885, 75816, 89210, 149714, 47922, 3922, -23040, 33472, 27869, 44024, 80505, 188390, 271491, 84037, 101820, 135135, -18680, -43847, 21870, -30753, -29023, 22246, 246639, 331547, 211768, 88400, 51949, -95307, -242760, -138254, -83646, -471530, -700532, -512489, -412392, -531148, -330533, -149400, 70761, 138226, -65827, -181060, -277406, -90446, 56176, 90881, 260559]
22360B60559p7482j26768r5581j2116p579K06187J57575j25899o1212K07491J07829
22349D33004J9906q329k14324m07398l9508M5487N9222J86208J93535j74986j54731
22338f1914J26027J51891j12176l2176j09006j7164J73448p9417n7109p4793J2229
22327h0160J17488J65682j9824j28853K149P0729J76091J26267m6535j22454p6226
22316A84354j22375K3435j38036J21470J14101n6862q1289o5319j51936J41408
22306c1049J59349j85642q5739r2922O9166J49712M2818J28635N0398R5156r594
22295B90288j94692j89565k8307Q9862Q0769J93255J01738J2019j1306l0347l24435
22284a0721P6116o9097k8677J08627K4217q9454J38665l8414l2233q1552l9647
$$ y = [260559, 183077, 56309, -39272, -51388, -58967, 147220, 304795, 178896, 117684, 325175, 433004, 452910, 444581, 230257, -177141, -216649, -171162, -111940, 74268, 267803, 92817, -61914, 64113, 216004, 103828, 71652, -37354, -54518, 118930, 39513, -17596, -92389, -80160, 37328, 203010, 183186, 54333, 56482, 127211, 303302, 429569, 383034, 260580, 184354, 61979, 85414, -52622, 68848, 182949, 126087, 44798, -20521, -172457, -31049, 128300, -57342, -143081, -236003, -166837, -17125, 25693, 154328, 204726, 299882, 290288, 95596, -93969, -122276, -32414, 48355, 241610, 343348, 355367, 344061, 313714, -10721, 65395, -3702, -32379, 76248, 100465, 11011, 149676, 111262, 79029, -2523, -42170]
22273d2170L49342P3150L6681p1375j60201j97649N3962K75269J69410j49836
22263C36583j07708n8390Q9042L9216j14157L5254k26787l6091m6141O7289o673
22252b8563m2721Q6701k34178q1520P6560J10288R6798k34227k31048J48682O9428
22241b63800M7565q415R1387j08955M5592k8977N0913O4894K05305M3402J75661
22230C14572o1726j61758q7531K44009L03060K64331k07685k71106l25321q2726
22220g1881K40071O6360j15262O0918J40189J1373k4831K0326j7031l39606j82649
22209b12023l5987J18802K29265k501q9008K09691o0915O3038n3921k671k55318
22198i1548k64273m0790L0655L84816J31670k19489r6573J42383J22566K5801
$$ y = [-42170, 307172, 380322, 417003, 345628, 185427, -12222, 41740, 317009, 486419, 336583, 228875, 170485, 259527, 298743, 184586, 219840, -6947, -43038, -89179, -21890, -28563, -71284, 15417, -218761, -300281, -223721, -113433, -16635, -250862, -481910, -333228, -263800, -216235, -224650, -133263, -242218, -196626, -225603, -174690, -109796, 95509, 138911, 314572, 252846, 91088, 3557, 247566, 550626, 814957, 607272, 336166, 10845, -71881, 168190, 234550, 119288, 180206, 320395, 331768, 306937, 327263, 310232, -29374, -212023, -248010, -129208, 100057, 97556, 8548, 218239, 157324, 220362, 166441, 163770, -91548, -355821, -396611, -365956, 18860, 150530, -68959, -165532, -23149, 99417, 125218]
22188A25218j17955l0292K18866k20634j12419K68191J2684P1404j11152q4324
22178A9587k38652M7024K49599L54947j58032l06201J60599k5929J5118k02322
22168h4262J05635K82515k13477j40415q18j4058J35435R1046j02285J7209R6909
22157A73434k9378k00779Q0349K51776L15289j23506k74987l94734j01737R4638
22147b09635j29901P6986L48295J71778j11899n6263p7607j12025O1240p8475
22137a17506m6100L52351J66719l2788m5417J56559J65215m2825J79672L8964
22127G74844l77985k02722R5959J21030L2530j54997j10996k02500p5591J57256
22117E6828m1042j21096N0580J3651O1622k1590K28918R0338j04277K8965k0536
$$ y = [125218, 7263, -23029, 195837, -24797, -137216, 130975, 143659, 215063, 103911, 19587, -219065, -172041, 77558, 432505, 274473, -31728, 128871, 102942, 118060, -84262, 21373, 303888, 90411, -50004, -50822, -64880, 70555, 161601, 59316, 76525, 173434, 144056, -56723, 23626, 275402, 590691, 467185, 192198, -202536, -304273, -209635, -339536, -262550, 85745, 257523, 145624, 89361, 11754, -100271, -39031, -117506, -163606, 188745, 355464, 322676, 277259, 433818, 599033, 556208, 735880, 774844, 396859, 194137, 290096, 411126, 443656, 288659, 177663, -24837, -100428, 56828, 15786, -105310, -54730, -41079, 20543, -1047, 227871, 318209, 213932, 242897, 222361]
22106B22361j94795l269O7170N7585K448L1207J29187j09004l66908j33421m183
22095c01622P8342J43048J06346L8601K8217N2502p5514j3365O7677M51536R4397
22084F70165m03102r1278Q3556j73320k03853j41672K55P8126l356J81068J19447
22073A16036M9634j57642n6163o6571O0741J29833K0041l8993J50524J29386k0385
22062C16441q5734R6878J69666J1773o4631p615l2026Q5131J7081j73691o7990
22051B65283o344J4618k77963j88353j08355N4051K89452p7403j16707K4188K3686
22040a03847L40219J35980J04P8223K2046M5603K11464j40630j10542P0029J56430
22029G05079o095k37967j09917K60212k02535j46423j91957J11333J24957O4506
$$ y = [222361, 27566, 24297, 91467, 149052, 151500, 182707, 311894, 202890, -164018, -297439, -301622, -223280, -80232, 26114, 64715, 92932, 145434, 69920, 56555, 124232, 575768, 670165, 267063, 175785, 259341, 86021, -117832, -259504, -259249, -181123, -184479, -3411, 116036, 165670, 8028, -48135, -114706, -53965, 75868, 95909, 56916, 207440, 336826, 316441, 230707, 327585, 497251, 509024, 444393, 436778, 404752, 489883, 506964, 333273, 265283, 258939, 273557, -4406, -192759, -301114, -247063, 42389, -35014, -151721, -127533, -103847, 236372, 372352, 372456, 450679, 472725, 518328, 729792, 589162, 478620, 548649, 705079, 698984, 461017, 351100, 611312, 408777, 262354, 70397, 181730, 306687, 371193]
22019C71193K5988l6552p261J29921j71183k28085k912Q109M221j6489J1584k11482
22007a22948L8296R4389K4453K9401o765o6075K2073j68517k22368K8993K03137
21996a45931n9444j67972K88979J08582J8711J94137J25266k5769o4677j92044
21986G9838M6552J36760L7259r2192m9758j1259m4267Q9919J05789k08605j22730
21975c2694J80391J64116m8118k0266m8654k06090j39278J35374n2170L1700L0094
21964e595R4093n6277j04947J40656J854J13868m5239j52859p6405L5613K60232
21953B04994K32390j51230j54607J2757P4393j56295K05062j3418p8075J8678
21943A94649j11871J15857K99379J39066M1175k90782l3484J51059L16741N5819
$$ y = [371193, 397181, 360629, 353368, 483289, 312106, 84021, 81109, 89218, 93439, 76950, 88534, -122948, -84652, 9737, 34190, 63591, 56826, -9249, 12824, -155693, -378061, -349068, -145931, -205375, -373347, -84368, 24214, 42925, 237062, 362328, 336559, 271882, 79838, 126390, 263150, 300409, 208217, 158459, 147200, 102933, 192852, 298641, 90036, -32694, 147697, 311813, 263695, 243429, 194775, -11315, -150593, -15219, -67389, -35689, -5595, 88498, 32221, -72726, 67930, 69784, 183652, 138413, -14446, -90851, -55238, 204994, 437384, 286154, 131547, 144304, 218697, 62402, 267464, 254046, 175971, 194649, 82778, 198635, 498014, 637080, 678255, 387473, 353989, 505048, 821789, 877608]
21933H77608q6597l0996K44363L08767J56660l6947R4924K05157R5051L5240k10289
21922A652941j59155l03970k00240k05932j03389k51841O6225J0287j37639N0921
21912D18208k3651J26956M645j89715j82597p4339O0216O6153Q659J17045K23543
21901E55123K0485j5076R97K15400L81854j70972j50737k3899J54692K765M4913
21890A015545J37468n57m1089j84488j58804J26043J14149j7042k35408j22977
21880F32840j3971J51254K31741K63383M0202j2648J22381n0597j47606P6414
21870A293393r7550J09269L51905P5831l09350N927n1285n5344p2624r2063J29494
21859A287603k1864K46429R1808K07755K33393M8260Q4555J11011R0140L16374
$$ y = [877608, 791011, 760015, 1004378, 1313145, 1469805, 1432858, 1527782, 1732939, 1827990, 1863230, 1652941, 1493786, 1189816, 989576, 783644, 680255, 428414, 494639, 504926, 367287, 418208, 394557, 521513, 526158, 336443, 153846, 79507, 139723, 205876, 214535, 331580, 555123, 575608, 560532, 561529, 776929, 1158783, 987811, 837074, 813175, 967867, 970632, 1015545, 1153013, 1152456, 1111367, 926879, 768075, 894118, 1008267, 991225, 755817, 632840, 618869, 770123, 1001864, 1265247, 1305449, 1292801, 1415182, 1364585, 1216979, 1293393, 1195843, 1305112, 1657017, 1732848, 1423498, 1429425, 1378140, 1322796, 1250172, 1158109, 1287603, 1265739, 1512168, 1603976, 1811731, 2045124, 2093384, 2177939, 2288950, 2379090, 2695464]
21849B695464K98532K80434K94894K90652Q7445k35806q7217m79979j34245P3340
21839C083514J10528K3395r8213L2383L42926L00441J13727j20053k6656K70777
21829D032769K9237N9085L52418K46722J59022L41022L27603M93749O86703P52376
21819G480706N03920P68763J001818R34548J154136J971738K567715K860098L714315
21810B2957757N448283P590218R705003J3006037J7788481K4131279L2593069
21803A33220127M4076738N7472380O4621731N5926443L4314207N386734k9794686
21796C65223674o3581507p7472031o6515040m5079189k7710467j7051788j1049922
21789E6763730p729474n981656m470591l272912k520717k131214j688694j413952
$$ y = [2695464, 2993996, 3274430, 3569324, 3859976, 3947421, 3711615, 3624398, 3144419, 3010174, 3083514, 3194042, 3217437, 3119224, 3151607, 3494533, 3794974, 3908701, 3788648, 3761992, 4032769, 4062006, 4121091, 4473509, 4720231, 4879253, 5220275, 5547878, 6041627, 6728330, 7480706, 7984626, 8753389, 9755207, 10689755, 11843891, 13815629, 16383344, 19243442, 22957757, 28406040, 35996258, 45701261, 58707298, 76495779, 100627058, 133220127, 177296865, 234769245, 299390976, 355317419, 389631626, 395018360, 365223674, 301642167, 224170136, 157655096, 112575907, 84865440, 67813652, 56763730, 49034256, 43052600, 38582009, 35309097, 32788380, 30657166, 28968472, 27554520]
21781B7554520j041760q78554l79420j49971q5512k66067o62693j128047j257098
21772B1705398j549321j640354j380232j007318j080323j099125j040808q03402
21764A2104515o36627n37762p92387n70535o45775m72332n09064j85969k99449
21755G454615k64202o5213k48136k98546m18193l05804l02759n46981o41213l94038
21745C969530j91064l23123n05410j34406j20750j28170r9222j84939m8891k80459
21735A953096j82842k05430j05384l2225K85625j39906j54162k6612j27964n8626
21725A205570O4919K044K3850k36837j34607j54004k6157p9195j17747j32895
21715D14941j35207J31408J60419O6321o1264N7882K7666j12246j42668n4369
$$ y = [27554520, 26512760, 25634206, 25254786, 25104815, 25019303, 24753236, 24090543, 22962496, 21705398, 20156077, 18515723, 17135491, 16128173, 15047850, 13948725, 12907917, 12104515, 11467888, 10930126, 10137739, 9567204, 8921429, 8449097, 7940033, 7754064, 7454615, 7190413, 7125200, 6877064, 6578518, 6160325, 5854521, 5551762, 5004781, 4363568, 3969530, 3778466, 3455343, 2949933, 2815527, 2694777, 2566607, 2467385, 2282446, 2233555, 1953096, 1770254, 1564824, 1459440, 1427215, 1712840, 1572934, 1418772, 1392160, 1264196, 1205570, 1270489, 1272533, 1296383, 1059546, 924939, 770935, 744778, 665583, 547836, 414941, 279734, 411142, 571561, 637882, 576618, 634500, 662166, 549920, 407252, 352883]
21705C52883P886M6734j12969l8929j37166j43587M1041k0021P8680k9314J7518
21694F2756l3928J75174K97222j06716q4061j57246r3280n867j21468P5307J9635
21683B7528P3817O7408J72177K94004l1240p6139j4394J93975Q7861q7683j23065
21672E84249j09260r678j24934k80579j68335K4683n7944K38311J59513j41827
21662A14199k30539j34469Q4114P8849J27885J485K00009l8038k19302K20314
21652B04507q0471o0482l2044j92165m2687J21959K6079J23577j565J8603k8444
21641E6867J20666N7413k0069j31920j23532J99260J63788J40991j64490m6515
21631B52459j1509M0847q0539P3654M3913O7388k20713M2695K8114l9615j41660
$$ y = [352883, 360769, 407503, 294534, 255605, 118439, -25148, 15893, -4128, 74552, 45238, 62756, 28828, 204002, 501224, 394508, 310447, 153201, 59921, 54054, -67414, 7893, 27528, 101345, 168753, 340930, 634934, 603694, 527555, 513161, 707136, 794997, 707314, 584249, 474989, 465311, 340377, 59798, -108537, -83854, -141798, 96513, 256026, 114199, -116340, -250809, -166695, -87846, 40039, 41524, 241533, 203495, -15807, 204507, 124036, 63554, 31510, -160655, -203342, -81383, -55304, 68273, 66708, 85311, 56867, 177533, 234946, 214877, 82957, -40575, 158685, 322473, 463464, 298974, 252459, 240950, 281797, 201258, 274912, 318825, 386213, 165500, 208195, 236309, 196694, 55034]
21620E5034j38452r1766j15368k2801K14427J84652J44545m5183j67451m5792
21610b8155J004J49313P3044q8976m7513J93414J28023K00677J64758n0642k55392
21599D39555k31896k14666j77733n1664R7710L928J5788J27018M6575j22726k04883
21588b72994M2742j08496R6666L24812J11576q2344K2300j02447o018n5451J62131
21577A32477j33238l58116J61959J78989j33633k17431o050O7063J0662J24992
21567a72326j45525j04750K47759J1888n8710J60988O6430j47454J81219p4408
21557c4889o0674j45117j55930J89358K36659n5971j05281j50601r3924O2553
21547c13817J77825J29054l4221O9824n0900Q0534j92791j61314L18114R1252
$$ y = [55034, -83418, -175184, -290552, -313353, -98926, 85726, 230271, 185088, 17637, -28155, -27151, 122162, 195206, 106230, 58717, 252131, 380154, 580831, 745589, 694947, 439555, 207659, -7007, -184740, -236404, -138694, -134766, -118978, 8040, 54615, -68111, -272994, -230252, -338748, -242082, 82730, 194306, 111962, 134262, 31815, 25797, -29654, 132477, -761, -358877, -196918, -17929, -151562, -368993, -375043, -307980, -297318, -172326, -317851, -422601, -174842, -162954, -221664, -60676, 5754, -141700, 39519, -34889, -95563, -240680, -396610, -207252, 29407, -26564, -131845, -282446, -376370, -313817, -135992, -6938, -41159, 28665, -22235, 58299, -134492, -295806, 22308, 113560]
21537A13560J1967J12693j47465o412J60515l10372p9363R5172J39831J26779
21527B16905j62763n710J5794k12486o7609J07577P6619K2874P0066j17872k5120
21516h1725l9337k09212j87841K08964J23113J33341j56182O9181L64280K65952
21506D90534j67304l4101j47326j29230K0999K03724M8226j34340k24198P9173
21496F157K82580J2546j50382j7926j34756M2455J39384L5931N6871j61870n3581
21485E7409k38557k35835j54376r8858J65447O112J35951J30659P1852M0205K4082
21474i5909N770J44411K9091j65431J09396l30R4261M2232P1986o9603L2425l1043
21462A67256J20619N4979k38070k42502k79193J9084J88285K9305k27880r2478
$$ y = [113560, 125527, 238220, 90755, 84343, 244858, -65514, -144877, -49705, 90126, 216905, 54142, 48432, 64226, -148260, -215869, -108292, -31673, -8799, 61267, -56605, -81725, -121062, -330274, -518115, -309151, -186038, -52697, -208879, -139698, 224582, 490534, 323230, 289129, 141803, 12573, 33572, 237296, 285522, 151182, -73016, 6157, 288737, 301283, 150901, 132975, -1781, 40674, 180058, 215989, 272860, 110990, 57409, -181148, -416983, -571359, -670217, -504770, -498658, -362707, -232048, -160196, -119991, -95909, -90139, 54272, 83363, -82068, 27328, 26998, 121259, 163491, 235477, 165874, 198299, 167256, 287875, 342854, 104784, -137718, -416911, -397827, -209542, -180237, -408117, -500595]
21452e00595O3687k5332m6208L39304l9938j08646k9414L9359P8979j16677j54209
21441d99690K02517P3068j36677j35620k8307n9788j7926J10301Q0771O3166J29111
21430b19074P5811J97777J17912J7852r4602j56924o0302N1583j5811m6293Q9921
21419d2150J80652j4747j33580j95018k88559Q1473K23021p1532m5643J05462
21409b00621M13000J8890r7555R798j92332M6623j15192K27298J9779j832r4468
21398C3388P2894j29820N9966n1110J93248Q4970j78285k0426j51444o2583o1378
21387b10580k78767J527L33917l0166J91878J49871J3267j62834j23129q7887
21377b02903j72327J68700L29708J11431o4586k57412j37507J60684O4777o1443
$$ y = [-500595, -436908, -462240, -508448, -169144, -209082, -317728, -347142, -307783, -228804, -345481, -499690, -297173, -224105, -360782, -496402, -524709, -584497, -602423, -492122, -411351, -348185, -219074, -143263, 54514, 172426, 190278, 95676, -61248, -121550, -69967, -85778, -132071, -42150, 138502, 123755, -9825, -204843, -493402, -411929, -188908, -260440, -306083, -200621, 212379, 231269, 133714, 143512, -48820, -2197, -117389, 109909, 129688, 127856, 33388, 106282, -23538, 36428, -14682, 178566, 263536, 85251, 64825, -86619, -149202, -210580, -489347, -487820, -153903, -184069, 7809, 157680, 170947, 8113, -115016, -202903, -375230, -206530, 123178, 234609, 170023, -87389, -224896, -64212, 565, -60878]
21367f0878J66102j12314j70250j49854M8205J09891J15561J6716j83834r0994
21357c11649J48078K20352K9368j53362m4021J01254J11732r6866j04773p2458
21347a72345K9362J42877p5008O046j35339j52887Q8783J50223J63157P9317k18328
21336i4142l36718M8425K78761J65741N8531j13396p4667j143J58748M9047j3870
21325A25317r6120k2270j6762r1885j09275J90156O1311P4600O167p5412n5125
21314i298p2304M4721J0072J42604N877m1611m2646j12910J65659J66123q3659
21303A72628o7334n611j7143r9033q479j16489K14131R8127N722l94388j91411
21292d09280N4180K93710K83493j9383k17346r3223N2662L8362j30465k8451J53386
$$ y = [-60878, 105224, -7090, -177340, -327194, -278989, -169098, -53537, -36821, -220655, -311649, -163571, 56781, 86149, -67213, -111234, -9980, 101752, 4886, -99887, -172345, -142983, -106, -75114, -69068, -204407, -357294, -268511, -118288, 44869, 124186, -94142, -430860, -382435, -103674, 62067, 120598, 7202, -67465, -68608, 90140, 139187, 125317, 29197, 6927, -9835, -101720, -210995, -20839, 40472, 115072, 121239, 45827, -9298, -81602, -36881, -26809, 115795, 121672, 80061, 37415, -75495, 90164, 256287, 172628, 105294, 99683, 82540, -16493, -24972, -141461, 72670, 170797, 176519, -217869, -409280, -355100, -61390, 222103, 202720, -14626, -107849, -55187, -16825, -147290, -175741, -22355]
21281b2355J30894n2974j08955j01983N7609L3188o5938J10035j14158r6394J23748
21270a07283J48894J13674J19918r9534k43825j34384J84697O0436J40658k32998
21260d9747m9797l5067J1244J14014j29922j73123J79170L84117j82267j06460
21250c7838J55384Q9370j12908k04416M7151m1459j69757k19535K64676K53725
21240B4393m7745J29762j01644J970k9190J6823l3724j84697l16550j88404J67499
21229e61507M2871K52133K26129l4021o4710R4210J66392o4707n5617j86108j1685
21218a96620J4247j08762J08349J20131j10139j96873J05752J53462j7119j80335
21208c07907l3255J3219K51081L29543j05827k8357N2426k27690P05O6138j76702
$$ y = [-22355, 108539, 55565, -53390, -155373, -97764, -64576, -130514, -20479, -134637, -231031, -107283, 41611, 155285, 275203, 175669, -68156, -202540, -17843, 42593, 183251, -49747, -99544, -134611, -123367, -9353, -139275, -312398, -133228, 250889, 68622, -37838, 117546, 206916, 94008, -110408, -63257, -104716, -274473, -494008, -229332, 24393, -23352, 106410, 4766, 6736, -22454, -5631, -39355, -224052, -540602, -729006, -561507, -518636, -266503, -40374, -74395, -139105, -44895, 121497, 56790, 1173, -184935, -196620, -182373, -291135, -182786, -62655, -172794, -369667, -263915, -110453, -127572, -307907, -341162, -327943, -76862, 252681, 146854, 118497, 170923, -56767, -56062, 10076, -166626]
21197a66626j33690J18977P7430J15001l0348k95775J25858L82870J13914o2531
21187B45080p3730J79282M7986k51735n1874K50835m9530j12674J0676J17756
21177C12072N5266j22365r9399n0623k969L8088j73167j317j4345r1000J17406
21166c2353j0435k94108O2007J75495j20460J8690J15330O3001p1146J12656K79571
21155B98248P6673j51200n4977j56419j96829n3026J30119k04250J20424L27583
21145A36346P4410L4273j2424j8643p1320l9652J38339q363j86616R7575K69081
21134D13006K3558j10388k28885r920K52318L52080J29757k3387J5316J26824
21124I40279J83873M96985K3063k12860J34212L28157K64552k9211L099L38368
$$ y = [-166626, -300316, -181339, -103909, 11092, -19256, -315031, -189173, 193697, 307611, 245080, 171350, 350632, 398618, 146883, 95009, 345844, 296314, 183640, 194316, 312072, 367338, 244973, 145574, 94951, 91982, 130070, -43097, -44414, -58759, -149759, -32353, -42788, -336896, -274889, -99394, -219854, -201164, -85834, -22833, -93979, 18677, 298248, 374921, 223721, 168744, 12325, -184504, -237530, -107411, -311661, -191237, 136346, 210756, 245029, 232605, 213962, 142642, 102990, 241329, 232966, 46350, 143925, 413006, 436564, 326176, 97291, 87371, 339689, 691769, 821526, 798139, 813455, 940279, 1124152, 1621137, 1644200, 1431340, 1565552, 1893709, 2158261, 2129050, 2132149, 2470517]
21114B470517P1647j75168j82167k56125m32774j52915j29319j92664j48304r2399
21104G80329K1729j20368k69082J7813K67202J57027j57323j19264O3340O0316
21094G01719j1569j35421K5042o4361J5646j91574n0612p7631o6323J02443J1538
21083B58897k52310j400K34746k79947J9888J62708k59804j30584O7259J16061
21073f4486j44461l8197L8198q2436R0787J58819L431k0924J79313K76553J82971
21062E79568l13431k17766N9970j35964k41401M8457j9940J33080K03319q6922
21052H970j02641o354k98252J95119J18255J57401j4612K5200K4224K33974j62839
21041A78445j61115J8413K24997n5134n5623k7159K1309j73022k27906M4816J17043
$$ y = [2470517, 2542164, 2366996, 2184829, 1928704, 1495930, 1343015, 1213696, 1021032, 872728, 780329, 802058, 681690, 412608, 430421, 697623, 854650, 697327, 578063, 641403, 701719, 690150, 554729, 579771, 515410, 531056, 339482, 288870, 211239, 144916, 247359, 258897, 6587, 5187, 239933, -40014, -20126, 142582, -117222, -247806, -180547, -64486, -208947, -247144, -208946, -291382, -200595, -41776, -38345, -59269, 120044, 396597, 579568, 266137, 48371, 108341, -27623, -269024, -220567, -240507, -107427, 95892, 8970, -93671, -100025, -398277, -203158, -84903, 72498, 57886, 83086, 107310, 341284, 178445, 17330, 35743, 260740, 205606, 149983, 122824, 144133, -28889, -256795, -211979, -94936]
21030i4936k19057N552K04994k9132J04190J71977n5315k18989p5508L3817J18529
21019e3878j00787m3330J74735M34456K9120r4777l653p8023J32762j6428k18861
21008A61336K59090P0811p1564k29655J8310M218m9351j30508n1827J73057p6905
20997G7012N1208J59297O0102O359M2086j46174k48225J42417k48930j12789M479
20986b13158Q739M1998K06464R3769j59962l21851J8536R5135J90279J39315J6977
20975A16241p2127m8481j83221o5130R3334J63800O4881N5663K21829n0660k13681
20964H2448Q3174q6718k1242K7061j0537r2682O6099Q4654o7093K8642J03371
20953A97177j91772j46035N4375j53354k04334N2408J36439L1285K2092N0767
$$ y = [-94936, -313993, -308441, -103447, -132579, -28389, 143588, 88273, -130716, -206224, -172407, -53878, -154665, -197995, -23260, 411196, 440316, 345539, 341886, 263863, 396625, 380197, 161336, 420426, 491237, 419673, 190018, 208328, 212546, 163195, 32687, -19140, 153917, 77012, 128220, 287517, 347619, 353978, 396064, 249890, 1665, 144082, -104848, -217637, -213158, -204419, -162421, 44043, 137812, -22150, -344001, -325465, -230330, -40051, 99264, 116241, 44114, -4367, -187588, -252718, -159384, 4416, 69297, 124960, 346789, 296129, 82448, 165622, 78904, 57662, 84723, 74186, -18496, 47603, 132257, 65164, 93806, 197177, 5405, -140630, -86255, -239609, -443943, -391535, -255096, -223811, -201719, -150952]
20943a50952J28307Q3613k02105j45422j03322p2034j22806K40873N3956L11171
20933B1279N00268j80353l25481j75363q6363k0662J0616J17555J20080J14109
20923I5685J6010j48394K03698j7983l0166K05279j8354k86746j11121r0677L52835
20912A70066M7630j95361K3973Q3019K1033M0994j19649k9804J56239j57194n2459
20901a1513k4407L5530m2744o2255k19312r6982O9379K97434K98298J51451l8007
20890C56872l66709l13826k42706k8427K44868K24812n4193J19411j2552K97910
20880B25460Q8524j60266l71918k8386J90175R7096K7124N8623O2381M5045j34089
20869I9769k12236K01037J85752k55544k10505J4356J16672L17947L8319m9614
$$ y = [-150952, -22645, 60968, -141137, -286559, -389881, -461915, -584721, -343848, -289892, 21279, 521547, 341194, 15713, -159650, -246013, -266675, -256059, -138504, -18424, 95685, 111695, -36699, 166999, 149016, 118850, 324129, 305775, 19029, -92092, -182769, 170066, 217696, 22335, 46308, 129327, 150360, 191354, 71705, 41901, 198140, 40946, -11513, -35920, -390, -43134, -105389, -324701, -421683, -352304, -54870, 243428, 394879, 356872, -9837, -323663, -566369, -594796, -349928, -125116, -179309, -59898, -72450, 225460, 313984, 153718, -218200, -246586, -56411, 40685, 67809, 126432, 188813, 233858, 99769, -112467, 88570, 274322, 18778, -191727, -177371, -60699, 257248, 295567, 245953]
20859B45953p408J29847N101j37693J87854j09941L5412j18639j90570J18662
20849A58578J82801R9810M3679k06289l13700R0329k7819J0971K86017k39653
20839H4724J2717J53287o625k2276o9693o0915J28348J3513n7901N8792R1373
20828C25344K14340j37483l38929j48532K14414K62221k305q9729j12483n530
20818A81328L45145K114k20279k506m851k38396Q8026Q8897P9078k44507J02164
20807A76213j0101k05810R5071R8078M8572k8622N8180J56525o6739r1012j16364
20796A13991r946M6188L77030j85089k67519l5492l8315m3766O33J38935P2410
20785A69060k35633k31420j59539J96642K89516R9561j60453K4031J39857m4207
$$ y = [245953, 238545, 368392, 373493, 235800, 423654, 313713, 349125, 230486, 39916, 158578, 341379, 441189, 484868, 278579, -35121, 55208, 27389, 38360, 324377, 84724, 97441, 250728, 244103, 221827, 152134, 91219, 219567, 233080, 175179, 233971, 325344, 539684, 402201, 63272, -85260, 129154, 391375, 389070, 299341, 186858, 181328, 526473, 528587, 308308, 305802, 300951, 62555, 150581, 239478, 318556, 74049, 176213, 166112, -39698, 55373, 153451, 202023, 173401, 231581, 388106, 321367, 230355, 113991, 104045, 150233, 527263, 342174, 74655, 39163, 848, -42918, -42285, 96650, 169060, -66573, -297993, -457532, -260890, 28626, 128187, -32266, -8235, 131622, 87415]
20775H7415K7942R0265Q9671J26269J36101P1700o0422l57317j16385J10614M2504
20764B48357O8819n929K6914j85962P5834j56250q819l8215j60809J0736K36438
20753A11114L87389q0401q1015N8788k6220j23529N6634j82126j15916k9977j95509
20742b20768J89234J52516N9636j19242k1848M4257j58942j14686K45047P3927
20732A29131O1475j6933j73654P2875J55858J73334P9429J10360j27920r8842
20722C65113L0526O1897q6923l31335J48861K91302J68813J24598j38593n7907
20712E76352M0951p2778j1462P8350j2973Q3835J12219O0539j92375r1817j5868
20701E54973l0347o3819N3280N3765j03521k89635r679J52739p5839Q3657r088
$$ y = [87415, 115357, 205622, 295293, 421562, 557663, 629363, 568941, 211624, 95239, 205853, 248357, 317176, 311247, 338161, 152199, 228033, 71783, 62964, 24749, -136060, -125324, 111114, 498503, 418102, 337087, 395875, 369655, 246126, 302760, 120634, 4718, -25259, -220768, -31534, 120982, 180618, 61376, 39528, 83785, -75157, -189843, 55204, 129131, 190606, 173673, 19, 72894, 228752, 402086, 481515, 591875, 463955, 365113, 395639, 457536, 370613, 39278, 188139, 479441, 648254, 772852, 634259, 576352, 617303, 544525, 533063, 611413, 598440, 682275, 794494, 855033, 662658, 570841, 554973, 524626, 460807, 514087, 567852, 464331, 174696, 165017, 317756, 241917, 325574, 316486]
20690C16486l157q9813k1414L36885R1188n2184k34636M786L14184N8759k49273
20679D71811J22331J92347N7870j8700K92476j06516l40158m3790Q9173P2493
20669G89337N4363K35660J62706J01761O8239k72490k33201J30800j17543k8933
20659H90699q9724Q1481J75151J05669J74804O0373n3620J9004m1844J03386R8913
20648A524292j15994q2672j27663J47556O8212N7287L11820J61344q9074N176
20638A860284j14849K9227J91843j895P902l6808J53106j1676N2962Q5519R4749
20627B310364J85279q9675Q1242K2951K57518K60005K52111J45769K49618J91886
20617C867068J48732J99033N05031K68089N90483N26238N75558P81899O23401
$$ y = [316486, 313329, 223516, 202102, 538987, 630175, 577991, 343355, 348141, 662325, 721084, 471811, 594142, 786489, 844359, 825659, 1118135, 1011619, 671461, 627671, 716844, 789337, 843700, 1079360, 1242066, 1343827, 1412066, 1139576, 906375, 1037175, 919632, 890699, 800975, 882456, 1057607, 1163276, 1338080, 1398453, 1344833, 1363837, 1321993, 1425379, 1524292, 1408298, 1325626, 1197963, 1345519, 1413731, 1471018, 1782838, 1944182, 1855108, 1860284, 1745435, 1774662, 1966505, 1964610, 1972512, 1935704, 2088810, 2077134, 2130096, 2215615, 2310364, 2495643, 2405968, 2487210, 2510161, 2767679, 3027684, 3279795, 3425564, 3675182, 3867068, 4015800, 4214833, 4719864, 4987953, 5578436, 6104674, 6680232, 7462131, 8085532]
20608H085532P11045J069702J116499J207104J434578J933683K655135L421664
20600B1634942M549994N665871P868121J0423926J4362530J8701282K2409365
20593A05616031K3217214K1692492J9246637J4377163O234499n16785k998069
20586A86869182m140118n903478m246513J284803O319472Q222456O139955o53277
20578A93892482r062635j4356760j7493944k1310722k4558575k3352681j7773869
20571F5983296j1613836p667245n367536l651279k962267k483280j649273j452365
20563B9136215j529263j242306j124249r99177r02427j106985j142774j035029
20555B0054005j244751j388473j162397r75092j228614j054082r85876j107089
$$ y = [8085532, 8796577, 9866279, 10982778, 12189882, 13624460, 15558143, 18213278, 21634942, 26184936, 31850807, 39718928, 50142854, 64505384, 83206666, 105616031, 128833245, 150525737, 169772374, 184149537, 190384036, 189867251, 186869182, 182729064, 176825586, 172579073, 173863876, 180183348, 188405804, 194545759, 193892482, 184829847, 170473087, 152979143, 131668421, 107109846, 83757165, 65983296, 54369460, 46702215, 41334679, 37683400, 34721133, 32237853, 30588580, 29136215, 27606952, 26364646, 25240397, 24241220, 23338793, 22231808, 21089034, 20054005, 18809254, 17420781, 16258384, 15283292, 14054678, 13000596, 12014720, 10907631]
20547A0907631j023091o27280l78579n30586q14420n28523l53487m90839m23850
20538E736976l57244k50645l75376j92798j97036l44101l43993j91667j73195
20529C310921j5911k27900j25614j79340r4089k5308k63452k16701k10068k47828
20519A704710J11268J31840n8088j38654l59522j55101M3018P8588j57875j13977
20509A086207j46659J42024j41644J07539j63888M8786k49828n4427O7285k00520
20499D94875j43439k32628k3249L66468K34777R1948k3836j08997m5909j98179
20489D11831j53123j05018m8934j14306q7766K34427K07187K11900M4874k11508
20479C89564j58621j78945k04763K3098q8001J2659J51314r7838j953J09066j7692
$$ y = [10907631, 9884540, 9257260, 8878681, 8348095, 7533675, 7005152, 6651665, 6160826, 5736976, 5379732, 5129087, 4753711, 4560913, 4363877, 4019776, 3675783, 3484116, 3310921, 3295010, 3067110, 2941496, 2762156, 2668067, 2642759, 2379307, 2162606, 1952538, 1704710, 1815978, 1947818, 1889730, 1751076, 1391554, 1236453, 1279471, 1358059, 1200184, 1086207, 939548, 1081572, 939928, 1047467, 883579, 932365, 682537, 628110, 695395, 494875, 351436, 118808, 95559, 462027, 696804, 788752, 764916, 655919, 610010, 411831, 258708, 153690, 104756, -9550, -97316, 137111, 344298, 556198, 601072, 389564, 230943, 51998, -152765, -129667, -217668, -205009, -53695, -151533, -153486, -44420, -62112]
20468f2112q5153P3999J47811j53992j272M3272J36874J32734L2922R907k0645
20457B54345k08834J31857P8758k41150j3794J80620J13138p1441j18308k39357
20447a34166j37819K8096l3862P575K4517J05664N5419Q2940k255M5959J42700
20436A84768J22878j33776j08025o3661J22185k5178q2477k7533P0021O4183k7296
20425I6089j4332K5072J71884J26416k62271j74641Q6852K24398N5007Q3000k13078
20414B04396L6819M3871j64178j44609J19658J04445K6012j19931J40769l3566
20404B13686M8005j24234j89997Q3082L08537K2827j51926P2757j0621J42421
20394D14537j246j05723j82979N7761o4159J23802k0318J00879N699k2813j7256
$$ y = [-62112, -147265, -73266, 74545, -79447, -80719, -37447, 99427, 232161, 265083, 274990, 254345, 45511, 177368, 256126, 14976, 1182, 181802, 294940, 223499, 105191, -134166, -271985, -243889, -277751, -270176, -245659, -139995, -84576, -1636, -3891, 42068, 184768, 307646, 173870, 65845, 2184, 124369, 99191, 16714, -10819, 59202, 123385, 96089, 81757, 106829, 278713, 405129, 142858, -31783, 55069, 279467, 334474, 417474, 204396, 241215, 285086, 120908, -23701, 95957, 200402, 226414, 106483, 247252, 213686, 261691, 137457, -52540, 30542, 339079, 361906, 209980, 282737, 272116, 414537, 413291, 307568, 124589, 182350, 118191, 241993, 221675, 322554, 328253, 305440, 288184]
20383B88184N637j71190l67172j92699M5652J22585J03108j03799m1093K31552
20373g9235L2278O0203j49677K6175J7909q1833j35054j17895K2299J42512P6257
20362a86061j3923R1363j8224j63362j21819j58961J30732L51638j9583j17775
20352b25975L736K95201l6280q2045R9913j34248K6023K2673j78371k33971O0782
20341c82562K55650L9917m8705K49936R2479j49430l7582K02018k08068L9908
20331E3561j07880j7458J29323K67770r7547k33456k84023n6811K58112J49731
20321F1322J02376Q8787l4768n5263j81413l06181L8942J91067K26638r3289j08826
20310g0608j81137K856J12726k0900J30568L0322P6077m8911J29418j1427r4372
$$ y = [288184, 293821, 122631, -244541, -437240, -391588, -269003, -165895, -269694, -310787, -79235, -46957, 13246, -136431, -110256, -92347, -174180, -309234, -427129, -404830, -262318, -186061, -199984, -108621, -126845, -290207, -412026, -570987, -440255, -88617, -108200, -225975, -222239, 72962, 36682, -45363, 54550, -79698, -53675, -31002, -209373, -443344, -382562, -126912, -86995, -135700, 114236, 206715, 57285, 19703, 221721, 13653, 53561, -54319, -71777, 57546, 325316, 227769, -5687, -289710, -346521, -88409, 61322, 163698, 252485, 217717, 162454, -18959, -325140, -286198, -95131, 131507, 38218, -70608, -251745, -248889, -136163, -157063, -26495, 3827, 79904, 30993, 160411, 148984, 54612]
20299E4612j11613l3188R8010j52972M2183K94900J2748j47381n0606L7457m5083
20288i33l15J28650j49587o4558P0815J42135l5922j5302j14954N7372j87085
20277a69684k13576P8517J76507J39800n7157k36628m9338m926O5189J33227p4670
20266b12739K342J62069k4785k2786m9398j1762k04479j1843O2822p3371k64413
20255f48343P7852L21940K44096R0412K8380j23038J48802J37473J84604o151
20245D56027k13052k36065j46009k8181R7098O7449Q7049m980k06094j1236J85610
20234D7616K65291J09899k34752q9820l7104j73598j39314j90178J45869L99665
20224A03574N16830J98792l13228l39867j23791m241K57798R4891j52202n0321
$$ y = [54612, -57001, -90189, 7821, -145151, -102968, 191932, 204680, 57299, 6693, 44150, -933, -1248, 127402, -22185, -86743, -15928, 126207, 90285, 74983, -39971, 17401, -169684, -383260, -304743, -128236, 11564, -45593, -282221, -331559, -336485, -271296, -138069, -212739, -210397, -48328, -73113, -95899, -145297, -157059, -361538, -373381, -310559, -383930, -648343, -570491, -248551, -4455, 85957, 114337, -8701, 140101, 277574, 462178, 456027, 242975, 6910, -139099, -167280, -70182, -2733, 84316, 79336, -126758, -137994, 47616, 312907, 422806, 188054, 98234, 61130, -112468, -251782, -441960, -296091, 103574, 620404, 819196, 505968, 166101, 42310, 38069, 295867, 390758, 238556, 188235]
20214A88235Q5628n2490j51260j7139Q6609K9825j09580j71707L8618n7578r0492
20203b21331j21590J46675K44307k9806j94233k55578m5774p2268K49559K15764
20193h4275J00672p946K890J33863J5350J8214J01310k13738j1021N7490N454
20182A18263r6574q9277k54099n6263r9660o0028J43013K3850J4168J04130O2141
20171a90336K40854P3801k82709j35840k6842L2237N9785j5182J04110M0422j9354
20160a19054J50858J51158j38368k14919n3714O4900M3083J50698r7515n2324
20150a15197J69846R9465m9523j23881O9584j2393o5085R0346l8581p4007J9951
20139b9475J50267l8487j21193j48307j34632j49874m63j3J04969J25274J71396
$$ y = [188235, 273863, 221373, 70113, 52974, 139583, 169408, 59828, -111879, -73261, -130839, -221331, -342921, -196246, 48061, 18255, -175978, -431556, -477330, -549598, -300039, -84275, 16397, 8451, 11341, 145204, 160554, 178768, 280078, 66340, 55319, 112809, 118263, 21689, -67588, -321687, -377950, -477610, -537638, -394625, -370775, -356607, -252477, -190336, 50518, 124319, -158390, -294230, -321072, -288835, -229050, -244232, -140122, -99700, -119054, 31804, 182962, 44594, -170325, -224039, -159139, -116056, 34642, -62873, -115197, 54649, 154114, 104591, -19290, 50294, 37901, -27184, 63162, 24581, -49426, -29475, 120792, 82305, -38888, -187195, -321827, -471701, -472164, -472177, -367208, -241934, -70538]
20128g0538Q3541K19072R933j84580j28021N3373K27304K3237o5009q0364N1309
20117A39257J27026r8402M2899K0158k51701P8878R2950L5398j55762K00628K95670
20106E26999K27812J11337l1992J15648L7353j54871P334L5345j6575j67899j16940
20095E73551m371k77520k02485K01032J98861L0426j56538k34686p9868J59515
20085B07917J20324k19508N3409N1351M8676j15355o8534P3034m0973J29325m9087
20074A90579l7520K9474k9940K36213K24364m7008j96929Q4500L5171k146J389
20063D88147j8406J53243J62805k4777P6462K81857R8721J68116K19627J73202
20053A778997K20430J24828Q3768j34833j89622L0694J85082m5878k69412L0508
$$ y = [-70538, 13003, 232075, 242008, 57428, -70593, -17220, 210084, 233321, 168312, 87948, 139257, 266283, 167881, 210780, 230938, -20763, 58115, 151065, 186463, 30701, 231329, 526999, 754811, 866148, 834156, 949804, 987157, 832286, 839620, 874965, 858390, 690491, 573551, 569180, 291660, 89175, 290207, 489068, 519494, 362956, 128270, 48402, 207917, 328241, 108733, 162142, 213493, 262169, 146814, 78280, 151314, 110341, 239666, 190579, 153059, 182533, 152593, 388806, 613170, 566162, 369233, 453733, 488904, 486758, 488147, 469741, 622984, 785789, 761012, 837474, 1119331, 1218052, 1386168, 1605795, 1778997, 1999427, 2124255, 2208023, 2073190, 1883568, 1914262, 2099344, 2053466, 1784054, 1814562]
20043A814562J06738Q5370j7152l31021j01029l27482j40161k15593j69438k52481
20033D52313J10090O9544j07396J28416Q2274k02238Q9481m5597k7900m1759j87664
20022C19564o2438o7721J0476k8478j89176J65275M6150J16369O6553q9649j77160
20011A09765o4846J18950K06441m1336r3546J10352n5901j46546J55812l9332
20001B59813l4117Q340j01937j62466j56146K91414K94919M6554m3886j03842
19991B98646K7996O6206Q1657l609r7751N013O8459J63163K9622M6427J66595
19980H52424j04746k17936J373N1456q1318k54161n6860L20673O4146J24042r0420
19969F08673n8885o0689J21774j52232n2516J56069k447O4427j0061j23094J01476
$$ y = [1814562, 1921300, 2006670, 1989518, 1658497, 1557468, 1229986, 1089825, 874232, 704794, 452313, 562403, 631947, 524551, 652967, 735241, 533003, 622484, 576887, 548987, 507228, 319564, 257126, 189405, 199881, 171403, -17773, 147502, 193652, 310021, 376574, 286925, 109765, 44919, 163869, 370310, 328974, 235428, 345780, 289879, 143333, 299145, 259813, 225696, 234036, 132099, -30367, -186513, 104901, 399820, 446374, 402488, 298646, 326642, 392848, 474505, 470896, 373145, 378158, 446617, 609780, 639402, 685829, 852424, 747678, 529742, 531115, 582571, 501253, 247092, 190232, 510905, 575051, 699093, 608673, 549788, 489099, 610873, 458641, 406125, 562194, 559747, 624174, 614113, 491019, 592495]
19958E92495P666L1717J221n3560J71906j44479j04920p2491k12054K4243J57816
19947C99560k4843r8522J03857J29756p2830j31115j10455K07238m52j94618r6178
19936A11398j08101l3426q1030j8033K53159k5393L6136J44640K19902J84903
19926F84155l2277J21388j59002p5535k65250N6751L40913L20718M6946k02213
19916H36594k56712l00459J12109K73913O9221j19888j56453J77615j72331l12748
19906A50861K19617J83411k5543k20637j63195j27980J34288J17334J03484j0517
19896C61123k94080k76322p3804J41998j2901J01587j28338Q4518N6808K4891
19886a4520j77809p1541L41165J08441j90614P9310N3837R3343N8226n0830j63431
$$ y = [592495, 600161, 631878, 633099, 579539, 751445, 606966, 502046, 429555, 217501, 241744, 399560, 374717, 276195, 380052, 509808, 436978, 305863, 195408, 402646, 402194, 207576, 111398, 3297, -30129, -111159, -129192, 123967, 98574, 134710, 279350, 499252, 684155, 651878, 773266, 614264, 538729, 273479, 330230, 671143, 991861, 1038807, 836594, 579882, 279423, 391532, 665445, 734666, 614778, 458325, 635940, 463609, 150861, 370478, 553889, 528346, 307709, 144514, 16534, 150822, 268156, 371640, 361123, 67043, -209279, -283083, -141085, -153986, -52399, -180737, -96219, -39411, -14520, -192329, -263870, 77295, 185736, -4878, 74432, 128269, 221612, 279838, 229008, 65577]
19875F5577m871l4705J01205J33315O9493O4475P6791R0410P3919j24753K6785
19864E37641j35101q6172K8326o2759k35936P9669J32167m1119j5917J58842o5444
19853B94197k46759J02344K38801j04310P0289J340j53267Q0280J27411K12522
19843F22848J18082q9697k32716l07868k19347P6627J21014J34952j53303l36934
19833b66342N1478J45092K05681J29728j6125L8926R3636P531k5957J18820j6733
19822D65735j96731L9627P3344j85469r0118R6400M2825q0182q4796Q2545k34911
19811g1731L1718m9779n6948N9374K93636L69567j2989J8732n654R8304k40441
19800D33789Q959R3561L6407J03817J2598m3137o7908L4079l952r8705j9378o9009
$$ y = [65577, 60706, 26001, 127206, 260521, 330014, 394489, 471280, 561690, 635609, 510856, 537641, 402540, 316368, 344694, 281935, 45999, 125668, 257835, 216716, 200799, 359641, 294197, 47438, 149782, 388583, 284273, 354562, 355902, 202635, 282915, 410326, 622848, 740930, 651233, 418517, 110649, -108698, -32071, 88943, 223895, 70592, -266342, -214864, -69772, 135909, 265637, 249512, 288438, 382074, 389605, 363648, 482468, 465735, 269004, 308631, 381975, 196506, 106388, 202788, 245613, 165431, 80635, 163180, -71731, -40013, -89792, -146740, -87366, 206270, 575837, 562848, 581580, 575926, 674230, 433789, 442748, 536309, 572716, 676533, 689131, 645994, 578086, 612165, 608213, 509508, 490130, 421121]
19788D21121k25843p2954N7973m7615P0786q8480j18178m4102J7317l8916O328
19777f2563K43J30622k2075J95580J86536o838k7181l8054J94575L05909j98465
19766F58289j33872k00484R0047J82480K4433k91093K1103P2793j66172j4766
19756B42758J43546k5692j68714j45837o0970J81350J11024J54624K02315j37211
19746D97193m550j48424j55646R6121o8459K15040j38843j23738j41559J68792
19736A95927J14393p2927J55045L1799N3199K43316j53187L581K8221k36949j36661
19725B25757l0504L32291K69642N4933O379K0702l4003k5686M0154K66772P2855
19714A199292q2368K6895J10762P1545J07708o8875J01855j85391k63608p8033
$$ y = [421121, 195278, 122324, 180297, 132682, 203468, 114988, -3190, -47292, -29975, -68891, -62563, -62320, 68302, 46227, 241807, 428343, 421505, 394324, 356270, 550845, 856754, 658289, 524417, 323933, 413980, 596460, 620893, 329800, 350903, 423696, 257524, 242758, 386304, 360612, 191898, 46061, -14909, 166441, 277465, 432089, 634404, 497193, 492643, 344219, 188573, 284694, 216235, 431275, 292432, 168694, 27135, 195927, 310320, 237393, 392438, 424237, 477436, 720752, 567565, 571146, 599367, 362418, 225757, 195253, 527544, 797186, 852119, 858498, 879200, 845197, 819511, 859665, 1126437, 1199292, 1116924, 1143819, 1254581, 1326126, 1433834, 1364959, 1466814, 1281423, 1017815, 939782]
19704I39782N4288L4712m5706K91087M28631K25593N2441l17451l9588j95556
19694A428233j16952L3538K87643m0675l15147r7229q2068j10460L03301K23229
19684A513413J4646k4791J02154K4218m2790K26651J41225Q743K07048j15320
19674B055197j38884n6064R884l8542P7425p3384j42774N8631K04653K02726q8619
19663B070249m4826J50858J01824J82512O859l48758l45803L6351j84445k40420
19653A384401k91254J05180J75372k9841j4331O6335K7916J34203l177l9162m0971
19642A474671k4028N8215L5578k00069m2832R3739K9911K41155L5388o2048m9344
19631A590336k48365m4663K53707L6905m7466L01746J69653P8335o3265L933J36386
$$ y = [939782, 994070, 1028782, 983076, 1274163, 1702794, 1928387, 1980828, 1663377, 1623789, 1428233, 1311281, 1344819, 1632462, 1591787, 1276640, 1179411, 1097343, 986883, 1290184, 1513413, 1528059, 1503268, 1605422, 1629640, 1586850, 1813501, 1954726, 1963469, 2170517, 2055197, 1916313, 1860249, 1870133, 1831591, 1909016, 1835632, 1692858, 1751489, 1956142, 2158868, 2070249, 2025423, 2176281, 2278105, 2460617, 2467476, 2118718, 1772915, 1809266, 1624821, 1384401, 1093147, 1198327, 1373699, 1343858, 1329527, 1395862, 1423778, 1557981, 1554804, 1515642, 1474671, 1450643, 1508858, 1544436, 1344367, 1301535, 1395274, 1425185, 1666340, 1701728, 1639680, 1590336, 1341971, 1297308, 1551015, 1587920, 1540454, 1842200, 2011853, 2090188, 2026923, 2030856, 2167242]
19620B167242R9064J34525n155P0858L44899K30402M69973L51655J46841K55480
19610D265784N24642K83765K02889J79255M4692L5093J40393N08594J072334J047378
19600H304819J516400J974818K409701L640757M656798O250642Q540456J1370889
19592D8665280J3859583J4283318J2476849J0199447O495893J77894n283268p709497
19584I3165499r847555j3314649j5047212j3347122r287862n808812l866847k547353
19576B0098087k006961j237945r63215o81316o47179o04261l55589j78267J4732
19567A3438086l0852K83258j27967J66996P3455j10596j93832j85389R823j47384
19557A3175598J51007P4229j62457R6716L50800M03931L80826P10299R57338J354794
$$ y = [2167242, 2266306, 2400831, 2395676, 2466534, 2811433, 3041835, 3511808, 3863463, 4010304, 4265784, 4790426, 5074191, 5277080, 5456335, 5501027, 5536120, 5676513, 6185107, 7257441, 8304819, 9821219, 11796037, 14205738, 17846495, 22503293, 28753935, 37294391, 48665280, 62524863, 76808181, 89285030, 99484477, 105980370, 106158264, 100874996, 93165499, 83317944, 70003295, 54956083, 41608961, 32321099, 26512287, 22645440, 20098087, 18091126, 16853181, 15889966, 15208650, 14561471, 13957210, 13601621, 13423354, 13438086, 13407234, 13690492, 13562525, 13729521, 13802976, 13692380, 13498548, 13313159, 13322982, 13175598, 13326605, 13400834, 13238377, 13335093, 13685893, 14089824, 14470650, 15180949, 16138287, 17493081]
19547A7493081K208336L170990M059655N955321Q092547J0903800J4325908J9292634
19539H5502272K5648504L1180593L2264587K8310133K3103968J4960284J327175
19532B42297516j2136180j8675061k2858260k9397172l4098038l0894045k2282768
19525G1955992j4639917r777730o439292m383665l492085k556592j980463j454682
19517B7231566j074613p63225m80819n36201k82387n24559p44682n83882o45393
19508B1595805j063966j272262j015947j386665j421289j109243q35208q25164
19500A2666061o63008o95421p72431n35464l81318m02309k05241k67522k28973
19491H514374l56708j6697K13213J12076j35780o6005j46872k56482O4691K19218
$$ y = [17493081, 19701417, 22872407, 26932062, 32887383, 40979930, 51883730, 66209638, 85502272, 111150776, 142331369, 174595956, 202906089, 226010057, 240970341, 242297516, 230161336, 211486275, 188628015, 159230843, 125132805, 94238760, 71955992, 57316075, 47538345, 41099053, 36715388, 33223303, 30666711, 28686248, 27231566, 26156953, 25393728, 24912909, 24376708, 24094321, 23569762, 22825080, 22241198, 21595805, 20531839, 19259577, 18243630, 16856965, 15435676, 14326433, 13491225, 12666061, 12003053, 11307632, 10535201, 9999737, 9618419, 9216110, 9010869, 8743347, 8514374, 8157666, 8140969, 8354182, 8466258, 8330478, 8264473, 8117601, 7861119, 7925810, 8145028]
19481H145028J351q2689L50569L85046M80145O35351L79064L21640L79578J101438
19471A2096521J458577J640716K342274L254514L912862M773477O588812Q623111
19463D4690864J1411042J5722821K0590899K4963990K5772167J9644717P718517
19456A70515017p101630k1923670k4270738j4889043l267242O397382J4306814
19449A19766890J8885134J7259943Q679589l875756j9314233l0378351k8452350
19442H2570866k0135282j2780460p977564n115755l675317k616381j882645j132699
19434B7254763j121858j437002r85587q88966j091803r38294o56874p10015o01592
19425A8822772m28801k87339l49069q31301q98592n11092m34929l50708J81274
$$ y = [8145028, 8146379, 8063690, 8414259, 8799305, 9279450, 9914801, 10293865, 10615505, 10995083, 12096521, 13555098, 15195814, 17538088, 20792602, 24705464, 29478941, 36067753, 44690864, 56101906, 71824727, 92415626, 117379616, 143151783, 162796500, 170515017, 163413387, 141489717, 117218979, 102329936, 99062694, 105460076, 119766890, 138652024, 155911967, 164591556, 160715800, 141401567, 111023216, 82570866, 62435584, 49655124, 41677560, 36561805, 32886488, 30270107, 28387462, 27254763, 26132905, 24695903, 23710316, 22821350, 21729547, 20791253, 20134379, 19424364, 18822772, 18393971, 18106632, 17757563, 16926262, 16027670, 15516578, 15081649, 14730941, 14912215]
19416A4912215K48836M28222N92092R73271J433858K192757L357618M406441O173374
19407C4718684Q348194J0611107J1310631Q694149L700018k998570r921072j1184448
19399E3278693o970301j931552K683476O648759R076573Q571682N162870q99030
19391G5621170q731491j5002127j4100645r447308n756853l592473k322000j626588
19383A5041685j269989p70969l36564n97656p58473o85081p31523n89040l51255
19374H951135k27425k79150j73075m23389n01685l28220k11501m37728n42643
19365E826319m33543l61834j57281l72235n06163l71830l68459q9972j25140k04999
19355B834863m42625k78013J24268P6372j97425o2871j47939j53043j14409j96174
$$ y = [14912215, 15161051, 15589273, 16181365, 17154636, 18588494, 20781251, 24138869, 28545310, 34718684, 43066878, 53677985, 64988616, 73682765, 77382783, 74384213, 64463141, 53278693, 46308392, 44376840, 47060316, 53709075, 62785648, 71357330, 76520200, 75621170, 66889679, 51887552, 37786907, 28339599, 22582746, 18990273, 16668273, 15041685, 13771696, 13000727, 12664163, 12066507, 11308034, 10622953, 9891430, 9302390, 8951135, 8723710, 8444560, 8271485, 7848096, 7346411, 7018191, 6806690, 6368962, 5826319, 5392776, 5030942, 4873661, 4501426, 3995263, 3623433, 3254974, 3165002, 3039862, 2834863, 2392238, 2114225, 2238493, 2314865, 2117440, 2054569, 1906630, 1753587, 1639178, 1443004]
19345A443004j83602j55683k0040j26661j26850K35299K66051q907k28078P6997
19335A171530J3299J14940J07030o9985P1253k03045j84010l42308j4068q4414
19325E80222R249J14793k90322j68465J42738J3780J52886l5454J39280J02625
19315G61332l10928o4843k44987l90063p3766J88721J04051O3042K19365L75339
19305F27263L4069k05206k08759o5108R1146R41l1040o0182k1893J25722K55190
19294E42143M5026k81573k457J89250j07015k4620j23886m2816J64453K49525
19284F08030P9353P2691O1614m2768j37702j60428K08941J43455k2755k59715
19274E50716k36310l2426J00310R6305l8697k39319k17850J28894K02058J16307
$$ y = [1443004, 1259402, 1103719, 1083679, 957018, 830168, 1065467, 1331518, 1322611, 1094533, 1171530, 1184829, 1299769, 1406799, 1336814, 1408067, 1205022, 1021012, 678704, 664636, 580222, 589471, 704264, 413942, 245477, 388215, 401995, 554881, 519427, 658707, 761332, 450404, 385561, 140574, -249489, -323255, -134534, -30483, 32559, 251924, 627263, 661332, 456126, 247367, 182259, 273405, 274346, 243306, 183124, 161231, 286953, 542143, 587169, 305596, 303139, 492389, 385374, 360754, 236868, 194052, 358505, 608030, 687383, 760074, 821688, 778920, 641218, 480790, 689731, 833186, 810431, 550716, 314406, 281980, 382290, 478595, 439898, 200579, -17271, 111623, 313681, 429988]
19264D29988L6805J28776m3459K5197l0124J34342M8885p8195k45145k23845p0555
19253A12670j98226J4032J28480J54275l9238k5079p4022k231o1137K8808J86026
19242B24358j73151k20411K41742K15934m7579J06802J28614j96245j59796J02487
19232B22755J25673j7548J17316J68548j68067o9794J15204R1678M2183K58519
19222H86467P8025k32380k89665R0159L87683k38824l59948m2305J0323o3826
19212B25709J39671K37439k005j63503j08965N816L5691o8204n6623l6686L14567
19201E22907j59417l32799Q1900J02415L04864K64402J51902K2689N3930m5465
19191I67328j6580K8914j05408j54360j00936Q2568j7456j81260j27222J15689
$$ y = [429988, 466793, 595569, 552110, 577307, 547183, 681525, 730410, 652215, 407070, 183225, 112670, -85556, -71524, 56956, 211231, 171993, 146914, 72892, 70661, 9524, 38332, 224358, 51207, -169204, 72538, 288472, 240893, 347695, 476309, 280064, 120268, 222755, 348428, 330880, 448196, 616744, 448677, 378883, 494087, 585765, 627948, 886467, 964492, 732112, 442447, 532606, 920289, 681465, 321517, 279212, 289535, 225709, 365380, 602819, 600814, 437311, 328346, 334162, 369853, 301649, 245026, 208340, 522907, 363490, 30691, 112591, 215006, 519870, 784272, 936174, 958863, 1012793, 967328, 950748, 979662, 874254, 719894, 618958, 701526, 684070, 502810, 375588, 491277]
19181D91277J41403k67034j42273k42579j22911L1697P8690K53772J30557J92895
19171E45494P9604k79089k43257J22532J51399J32875P6136r0747k65463p9908
19161A49576j51918J23740J95448R6995k19037R2814K8713k04479m3415M7355
19151A15792j06087l7407O170r8184J01760J28647J32637k19525N6834J57910
19141B38547k18529k33792m6882J06763J42814p83J19010N9037J01592j49320
19131A18457J3731N3396j62353q9121m6501J72881J5484j10557J94715O2148J28204
19120C50484J4160J16408J20543R321j88914j9757J65829K3322k2818J13967n0873
19109F31672K91831o4491j78052m0673l51663k39689M9993j07742k36656j18525
$$ y = [491277, 632680, 365646, 223373, -19206, -142117, -110420, -31730, 222042, 352599, 545494, 625098, 346009, 102752, 225284, 376683, 509558, 585694, 494947, 229484, 149576, -2342, 121398, 316846, 413841, 194804, 287618, 316331, 111852, 68437, 115792, 9705, -27702, -21532, -119716, -17956, 110691, 243328, 23803, 80637, 238547, 20018, -213774, -260656, -153893, -11079, -11862, 107148, 166185, 267777, 118457, 132188, 185584, 23231, -65890, -112391, 60490, 75974, -34583, 160132, 222280, 350484, 364644, 481052, 601595, 610916, 422002, 402245, 568074, 591396, 568578, 682545, 631672, 923503, 859012, 680960, 640287, 288624, 48935, 98928, -8814, -245470, -363995]
19099c63995k8692J06534K77829J83918l5577J1759k76342L1543M3662j44461
19089a93822P9400L11834M2863j58727N630K03905R2792M7350j5087j45820L25064
19078E95382J44433l6808k8687k6860J63121l9360l04147P4881J61062Q1218K71895
19067A056130J67622l48115k91701Q9002K24449K63534J18327j90090m8023J04797
19057A145932J19598L77999J66751r5114k64237l09748j17473k70085k69205n1801
19047D32617K134j91416j4662P6124M07M3321J91981q1028l03626O8017J20428
19036C44297j47902J09573J66688L15979r6324j15327j24991r850K5527J76249
19026F43919p0994N6015k19702l63863j6780K56996K56873L21544J08426j04121
$$ y = [-363995, -392687, -286153, -8324, 175594, 140017, 151776, -124566, -93023, -49361, -193822, -114422, 197412, 240275, 81548, 87178, 291083, 383875, 431225, 416138, 270318, 595382, 739815, 703007, 674320, 647460, 810581, 771221, 467074, 541955, 703017, 784235, 1056130, 1223752, 875637, 583936, 672938, 897387, 1160921, 1279248, 1089158, 1041135, 1145932, 1265530, 1643529, 1810280, 1715166, 1450929, 1141181, 1023708, 753623, 484418, 432617, 434751, 243335, 228673, 304797, 305204, 348525, 540506, 459478, 155852, 223869, 344297, 196395, 305968, 472656, 788635, 692311, 576984, 451993, 442143, 467670, 643919, 572925, 628940, 409238, 45375, 28595, 285591, 542464, 864008, 972434, 868313]
19016H68313m3354m7469M3519n9026J32287j47756M2987p4239J06104J64042K2058
19005A007466M4805K61834J27454k6839j2009m1173n8578j30419j63730j13279
18995H95532J19545j70775j21544j06973j80939j92406j77431j97325k6847j11370
18985b70533J33383J13240n827J15922q6926J04527k52369m1175J22577j66575
18975b33756k22035K02151J95081M4205M9761L36535K39696L0198l06673k31280
18965A03883j373o0977j23509N1926M3390J62392j38541q2925N3736J08370J86531
18954C02903K17270o2352k32791j1278J92554L3717R2514K46281k2177M8150J91188
18943I95979J17618j82013m53867k58051O9238J08815R4734J26191q2427k57416
$$ y = [868313, 824959, 777490, 821009, 761983, 894270, 746514, 789501, 715262, 821366, 985408, 1007466, 1052271, 1314105, 1441559, 1414720, 1402711, 1361538, 1302960, 1172541, 1008811, 895532, 1015077, 844302, 722758, 615785, 434846, 242440, 65009, -132316, -159163, -270533, -137150, -23910, -29737, 86185, -741, 103786, -148583, -189758, -67181, -233756, -455791, -253640, -58559, -14354, 35407, 371942, 611638, 641836, 335163, 103883, 102510, 41533, -81976, -30050, 13340, 175732, 37191, -45734, 8002, 116372, 302903, 520173, 457821, 225030, 213752, 406306, 440023, 532537, 778818, 756641, 804791, 995979, 1113597, 931584, 477717, 219666, 288904, 397719, 492453, 618644, 536217, 278801]
18933B78801j51861k10432J87782o362j10L7684N9102Q3301n2856k8373m8536
18922A48140k07497k20902J382J61622j01528J28374P7246K34270Q8590j98045
18912A11652k53941k79132J23431J97059R1647J62759j1779k48930k8818J44834
18902H782j2725j62848j242K34214j3792j52091J84825K28210N6789q8715K9738
18891C11145m2243p8024q677P9588k13595K67780L31410J60744k44589k57022
18881C06517l2095M0073j04303K19436N4961r1938j30929k69331k29901M7280
18871a90230K0779L8048j00460o2736j06335J15439K63713J93068p1168Q4233
18861A84351j74855J1927r3639J2382K8654o9775J45843j32644o8477K63139Q1432
$$ y = [278801, 126940, -83492, 104290, 97928, 97818, 135502, 194604, 277905, 225049, 196676, 148140, -59357, -280259, -278877, -117255, -218783, -90409, -13163, 221107, 309697, 111652, -142289, -421421, -297990, -100931, -9284, 153475, 141696, -107234, -136052, 8782, -3943, -166791, -168033, 66181, 52389, -99702, 85123, 313333, 370122, 281407, 311145, 268902, 190878, 182201, 261789, 48194, 315974, 647384, 808128, 563539, 306517, 274422, 314495, 210192, 429628, 484589, 392651, 261722, -7609, -237510, -190230, -169451, -131403, -231863, -294599, -400934, -285495, -21782, 171286, 100118, 184351, 9496, 21423, -72216, -59834, -31180, -100955, 44888, -87756, -156233, 106906, 188338]
18850A88338L8357j60033k16300K925K63818J17377j63776j15664J31828J34054
18840B20924N4893j26858k34718J32656J49470q6148k22117k7659k9668L04235
18830A35010P9818J0287O9737P2867q3009q6882R6187N0974J26233o2215j29686
18819B79321j56713r4921P4825j41697j45657J77596J83228K01312j9832M13J84797
18808E42672r5758j22356K10583n7273j09652r1450M4263K16116N9254j34833
18798D61566l16336j32286N4797J64577q9700j81838K81307R9701j0310j01233
18788B30245j00886Q413M7590N507J86477l0772j78717k30861K9146k4067n2031
18777a09956L8911p6932Q7690O6602J32336L9598K02843J42679L7487j76137j19021
$$ y = [188338, 226695, 66662, -149638, -146713, 117105, 234482, 70706, -44958, 86870, 220924, 275817, 148959, -85759, 46897, 196367, 110219, -111898, -139557, -169225, 135010, 214828, 225115, 294852, 367719, 284710, 197828, 294015, 344989, 471222, 409007, 279321, 122608, 27687, 102512, -39185, -184842, -7246, 175982, 377294, 357462, 357875, 542672, 446914, 324558, 535141, 477868, 368216, 276766, 321029, 537145, 596399, 461566, 145230, 12944, 67741, 232318, 142618, -39220, 242087, 341788, 331478, 230245, 129359, 137772, 185362, 190869, 377346, 346574, 167857, -63004, -33858, -57925, -109956, -71045, -147977, -60287, 6315, 138651, 178249, 381092, 523771, 561258, 385121, 266100]
18766B66100K8510j04759o3967N7863j00291k32875M6100K56692J29221R3943
18756C76537k06964k46348k04253j8614J96211J8567n6233J75102J03736R2627
18746B30368j13290J01565l6366j08562O740J15819K29189O887j92914J32615
18736C72051K17692k27274l0557j19164J00441J48839j46009j22495J68044l4196
18726C27372j17048j08620k67031J46650J71368l9660j90873j2756k6508k05791
18716c22897j3365J14066J04318l1030J992J49130O5681r6240j98797j65461Q6690
18705c05913J44488J20916O947q5473P9566J00118K56176j56354k93734p8537
18695b11800j132J80479N7912N7072L5099p3012l8242r4172l08519P0434K14004
$$ y = [266100, 294610, 189851, 125884, 183747, 83456, -149419, -103319, 153373, 282594, 376537, 169573, -76775, -281028, -299642, -103431, -84864, -141097, 34005, 137741, 230368, 117078, 218643, 182277, 73715, 80455, 196274, 425463, 432350, 239436, 372051, 589743, 362469, 331912, 212748, 313189, 462028, 316019, 193524, 361568, 327372, 210324, 101704, -165327, -18677, 152691, 113031, -77842, -90598, -117106, -322897, -336262, -222196, -117878, -148908, -146916, 2214, 67895, -28345, -227142, -392603, -305913, -161425, -40509, -33562, -119035, -39469, 60649, 316825, 160471, -133263, -211800, -212932, -32453, 25459, 82531, 117630, 44618, 6376, -87796, -396315, -325881, -111877]
18684a11877j10398J96749K31715K4784j33745j63388j60924O9210J00969R5533
18674C8628J96902m8635n9221k45087O5704Q1120J36737l3658k803q6019r3063
18663d9395j07259p0624K5495K36970R8228k46196l29201j39104Q8640L14773
18653a77673K11148r119q8729j10053P6494R2705J55542J92529l04886l48184
18643c10226l3809J34546K52731L3404l8793j06613j3286k4583J731k11398j30504
18632d46800J02599o5559N9524L69051J39779r2374M3125j24126k0584n7603k0729
18621a13697R2495J97314J36042j5818J2024r0482j66434J29287k38632m9807
18611a07708l0060M2806L7277J26377j34294J79945R2457k36272m9595J71709
$$ y = [-111877, -222275, -25526, 206189, 230973, 97228, -66160, -227084, -157874, -56905, 38628, 235530, 186895, 127674, -117413, -51709, 29411, 166148, 132490, 129687, 43668, -49395, -156654, -227278, -201783, 35187, 133415, -112781, -441982, -581086, -492446, -177673, 33475, 24356, -64373, -174426, -97932, -5227, 150315, 342844, 37958, -310226, -344035, -209489, 43242, 76646, 37853, -68760, -82046, -106629, -104898, -316296, -446800, -344201, -409760, -350236, 18815, 158594, 66220, 109345, -14781, -35365, -92968, -113697, -21202, 176112, 312154, 296336, 308360, 217878, 51444, 180731, -57901, -107708, -137768, -94962, -57685, 68692, -65602, 114343, 206800, -29472, -79067, 92642]
18601I2642j466j74317L1984J0582j39375l62653K3142N8197J33854Q0418J18747
18590a28245J23576k3956K60875K5249q0758J72500J93237M600k74534j02507
18580A70037J0278j5928j09692j48450J20643L4866j6562j0190j22641p3547m5114
18569b06300O018P3672J22865k17348l8571L01952l421O3056O4536O8259k74739
18558d0021m6356K50122R1313l3162l32327j48150N6153N8682J579J3714J3928
18547a14525k04602p2977J13216j28515J96681J55188J78336l7147j73676l8567
18537a26588J36402M7007J78312Q1750J114J43598Q7055r042O8990j16286j64367
18526C27945k51649j6493j01374j489J42741Q5997O8171K6391L718j7370j63675
$$ y = [92642, 91176, -83141, -51157, -40575, -179950, -542603, -519461, -461264, -327410, -246992, -128245, -4669, -28625, 232250, 257499, 176741, 349241, 542478, 547078, 272544, 170037, 180315, 164387, 54695, -93755, 26888, 61754, 45192, 35002, -87639, -161186, -206300, -200282, -126610, -3745, -221093, -259664, 42288, 38867, 101923, 166459, 234718, -40021, -86377, 163745, 255058, 221896, -110431, -258581, -202428, -143746, -142167, -128453, -114525, -319127, -392104, -278888, -407403, -210722, -55534, 122802, 85655, -88021, -126588, 9814, 56821, 235133, 316883, 317997, 461595, 548650, 539608, 608598, 492312, 327945, 76296, 59803, -41571, -43060, 99681, 185678, 253849, 280240, 283958, 266588, 102913]
18515A02913l30486k14243M0771J5786M3459J46262j97540K00784P2022q3334
18505b03606J39672k07432r831R6189r4769j10227J24457L3303J1475l1602J16559
18494a35812L36354M3983j72140m41208j36222K18123J30573j0574N051n7268
18484b19140J77261J15197o6296o7436j15542J53573K756Q1240M6671k05632K02565
18473A05217P3076k27166J1951K58205L0750k03534m12945k4596J60329J01068
18463a27645R0334J46940J03323M896j80102r9006J20553n88n4787j21213j46214
18452b63509J22273N173J44883m0809j56056J28917J37032q8162j87550j82841
18442c80649J00797l7240j9942L4813O2551K53406K87215N5577k48147j73097
$$ y = [102913, -227573, -441816, -401045, -385259, -341800, -195538, -393078, -192294, -120272, -203606, -63934, -271366, -281197, -185008, -279777, -390004, -265547, -232244, -220769, -252371, -135812, 200542, 244525, 72385, -368823, -505045, -286922, -156349, -166923, -161872, -219140, -41879, 73318, 7022, -60414, -175956, -22383, -19627, 61613, 108284, -97348, 105217, 178293, -48873, -36922, 221283, 252033, 48499, -364446, -389042, -228713, -127645, -37311, 109629, 212952, 217848, 37746, -61260, 59293, 58705, 3918, -117295, -263509, -141236, -136063, 8820, -31989, -188045, -59128, 77904, -10258, -197808, -380649, -279852, -317092, -337034, -302221, -239670, 13736, 300951, 356528, 108381, -64716]
18432f4716M2860q4724j95717n7613R201K50694K8979j40975K456L3967j21318
18421b96906m7395L29130K46126k8905j96634K6686k42J52824Q9747j44607j14708
18410A5116J0290J15977J15042j8323l43J83807O545k20623k64361J14510K1635
18399G9272j19521p955j21710k41249R7604K96994M1268k75972K8542k6241o9448
18388c18416J88790J0980J8064Q8422j03397j20632J86924L13807O1679L404j01754
18377B27871l34038l24584j0665O5180J33681M7699J1231n247J6469L6114m4469
18366a80758p3114L5824J31035J58936P8224j86019l0299J917m3841r6525Q3389
18355a21231K91813j60643j86656M9393K08658J03945j54609j60015j70435j78735
$$ y = [-64716, -21856, -106580, -302297, -359910, -350709, -100015, -71036, -212011, -209555, -175588, -296906, -344301, -15171, 230955, 202050, 5416, 32102, 31860, 184684, 274431, 129824, 15116, 25406, 141383, 256425, 238102, 237759, 421566, 428111, 207488, -56873, 57637, 79272, -40249, -48204, -169914, -411163, -313559, -16565, 24703, -251269, -222727, -248968, -318416, -129626, -118646, -100582, -12160, -115557, -236189, -49265, 264542, 326221, 329625, 227871, -106167, -430751, -441416, -376236, -242555, -194856, -183625, -188872, -172403, -136289, -180758, -253872, -218048, -87013, 71923, 150147, -35872, -66171, -64254, -108095, -204620, -121231, 170582, 9939, -176717, -127324, 81334, 185279, 30670, -129345, -299780, -478515]
18345d78515N408N0525J67208N4325j36857l856J12722j15949j7924J25800j9181
18334b56294J81821j4859R1511L7306r7526M4708j53924j06515J66533J70575
18324F3336J98060L0673l71403j12010Q5560R6269K42382N5075r2820l24871r1452
18313b21201O2255o715j1407n3804j75383N9405L09842K57660q7905n7078J45040
18302B20709Q5162l51002l18474O5595R6670Q9707J49321R4918M697J30607L37433
18291F05343j968k37063j32648k63413r1091L31716K43741O3051j92591r2254
18281B32823P0581p5026m02490j77685J04958J66182l3463p8838j44J45791l1285
18270g8596j78019M2003J39593K13138j68169m12314n3306J50177M0289K63919
$$ y = [-478515, -473107, -422582, -255374, -201049, -337906, -341762, -229040, -344989, -362913, -237113, -256294, -74473, -89332, 2179, 39485, -58041, -13333, -167257, -273772, -107239, 63336, 261396, 292069, -79334, -191344, -105784, -9515, 232867, 287942, 195122, -129749, -221201, -158946, -165661, -177068, -230872, -406255, -346850, -37008, 220652, 132747, 75669, 220709, 305871, -45131, -363605, -298010, -201340, -111633, 37688, 132606, 137303, 267910, 605343, 603375, 366312, 233664, -29749, -120840, 210876, 454617, 517668, 325077, 232823, 303404, 228378, -174112, -351797, -246839, -80657, -114120, -192958, -193102, -47311, -78596, -256615, -214612, -75019, 138119, -30050, -442364, -495670, -345493, -305204, -41285]
18260d1285J95246p8457N3284j01227k82256k36336l4938N7130n9473J53381K19449
18249a55482K77517J6303n0078J47884N7808k87200R3733J73408J68475J24434
18239E66802j07762j25312O1716L5024j86391O1979q8773j42948m3177J05535
18229A36693k47007j45440o186N1983O2630r1083n7800j48730Q5229J49468m4349
18218b54592o7983o9968l3381K8378J27487K39923k87473k27784K15678J69010
18208a60705l4804K07116K00837K9938j28784J46885K1401J1389j79487o593m4000
18197F3193J2938o6253j38666j3402p5247j12363j43292J12884l2194L0677k17338
18186e79063q4460K55477K29456K47987m3731j16713L7473K81399j03791o4101
$$ y = [-41285, 153961, 75504, 128788, 27561, -254695, -491031, -525969, -468839, -528312, -374931, -155482, 122035, 138338, 88260, 236144, 293952, 6752, 100485, 273893, 442368, 566802, 459040, 333728, 395444, 430468, 244077, 306056, 217283, 74335, 31158, 136693, -110314, -255754, -261940, -209957, -147327, -238410, -296210, -444940, -359711, -210243, -254592, -322575, -392543, -425924, -397546, -270059, -30136, -317609, -545393, -329715, -160705, -195509, 11607, 212444, 242382, 113598, 260483, 281884, 293273, 113786, 107193, 63193, 76131, 9878, -128788, -142190, -217437, -329800, -473092, -360208, -392402, -361725, -579063, -663523, -408046, -178590, 69397, 25666, -91047, -53574, 227825, 124034, 59933]
18176E9933j42231j20619l5904j87015J68820J93166J2110K3625j29987k31191
18166c89293n355J97651P6225n2268m4268P8518R9586l3600l02022j8811M9909
18155c43728p7338n2338k2044o4173l8314Q5889M48488n6143k03247j7697R1343
18144b49302J9970Q1008k6972m2329j55556P848J09830P0193P0017M3366l0703
18133a02630j10302R9703Q1629r765k8250k43605p4930K22222p7862r1062Q6397
18122b48455q9907P6679K10977J30821o7626L1929J65475n0875k91557n0225P5733
18111a07031J08045P2522j16130J2561r4128m0575N6011j13400k31006L5498J10101
18100c07532K4737K38007J00524q4048O1543j875j52020J02157l4514k20933j62909
$$ y = [59933, -82298, -202917, -238821, -425836, -257016, -63850, -51740, -28115, -158102, -389293, -394648, -196997, -120772, -173040, -217308, -138790, -39204, -72804, -374826, -393637, -343728, -421066, -473404, -495448, -559621, -597935, -512046, -63558, -119701, -322948, -340645, -249302, -229332, -148324, -175296, -217625, -373181, -365333, -255503, -185310, -115293, -71927, -102630, -212932, -113229, -31600, -41365, -69615, -313220, -388150, -165928, -243790, -334852, -248455, -338362, -261683, -50706, 80115, 12489, 44418, 209893, 159018, -132539, -182764, -107031, 1014, 73536, -42594, -30033, -124161, -164736, -108725, -222125, -453131, -417633, -307532, -282795, -44788, 55736, -28312, 33231, 31356, -120664, -18507, -53021, -273954, -436863]
18089d36863K28796J01776K0777K32157j68791j81909K41433P0246j43535J8696
18079a7217N8923K12032l0938p5927L6323p6063j72418q894R0188j83558j09887
18068b77436K32322L8209j34457J76124Q7746j33120n4097J22884P9280l8614
18058I8841j07626Q3509m6737k40447o0643K24803o351p7682K0025j45558Q3258
18047a74608K5568k7572J3010J95914K98066O3319k4189k60769K01412K25309
18037E35460j23822q543K79530O8675k2431j65413o1165l2290k41048K4625J31010
18026C84588k60815j64274j57500R3719J35244j11228j1067N6370J11247j273
18016G5011J26954o472j55003j06300N616o4515j07404p4996N2194n9284J07087
$$ y = [-436863, -208067, -106291, -85514, 146643, -22148, -204057, 37376, 107622, -35913, -17217, 41706, 253738, 222800, 146873, 183196, 107133, -65285, -74179, 16009, -167549, -277436, -45114, -6905, -141362, 34762, 122508, -10612, -64709, 58175, 137455, 98841, -8785, 74724, 27987, -212460, -273103, -48300, -54651, -132333, -112308, -257866, -174608, -149040, -176612, -163602, 32312, 330378, 393697, 369508, 108739, 310151, 535460, 411638, 403095, 682625, 751300, 728869, 563456, 502291, 470001, 228953, 253578, 384588, 123773, -40501, -198001, -104282, 30962, -80266, -91333, -34963, 76284, 75011, 201965, 195493, 40490, -65810, -60194, -124709, -232113, -307109, -254915, -314199, -207112]
18005b07112Q2591L8994J06740J0019J08809J2229k05124l4164r5677o2462l5897
17994b81054K08284K40155K67992L9317k43680j53828P5273J45420L16801K7228
17984F41908n7233O4805Q5667j98799N9596Q5864l157k3401j73870k11932k25884
17973D3564N7669J24773j69032n3854k60520k2479J41236K09366p1286j92418
17963a92981K516Q5867m6068J21563j83138r4036K82603J05822j1366j44801J144
17952g2875J42349R9286N2906P6727k44240l7927J42194J245j97752n7314k32897
17941c28298k28214K55874J20035j45971j5946j7779N8031j90648M2904K71359
17931a78653P9083J59343O0011k20498k12080q4218K05286P2858j32862J73351
$$ y = [-207112, -124521, -85527, 21213, 31232, 140041, 152270, -52854, -87018, -182695, -245157, -281054, -72770, 167385, 435377, 474694, 231014, 77186, 152459, 297879, 614680, 641908, 584675, 649480, 735147, 536348, 595944, 681808, 678651, 655250, 481380, 269448, 43564, 101233, 226006, 56974, 3120, -257400, -279879, -138643, 70723, -563, -192981, -190465, -104598, -150666, -29103, -212241, -306277, -23674, 82148, 70782, -74019, -72875, 69474, 168760, 221666, 298393, 54153, 16226, 158420, 159665, -38087, -95401, -328298, -556512, -300638, -180603, -326574, -342520, -360299, -302268, -492916, -450012, -178653, -99570, 59773, 119784, -100714, -312794, -397012, -191726, -118868, -251730, -78379]
17921g8379J01326K69536J11406k8561j67388j09823l0570P1461k9248n9920j93022
17910a43182j03065j66271M5323J84346K22987k9432p1662j07694n8708j7713
17900b45071J23620j48273j66301O9105J25519j13645j22404q6696K52969K56914
17890e4263j59758O6521L7668k06440l9047m3815q9740K00643O1866L2338j7365
17879b11392Q7079J95846J5732r7174k93558J93443l136n0433J02404K27270j86153
17868b0072k09287q5192k7189j5840J38424J30858m3178j74501j21879l3336J11553
17857c49639J12220q5083m5890L59185O9050k27781O2140P2296q9606k33737K8381
17846c28464l2044O0287q2718r9389K8431K24109m769j83748N1435K15880P8232
$$ y = [-78379, 22947, 292483, 403889, 375328, 207940, 98117, 67547, 139008, 109760, 49840, -143182, -246247, -412518, -367195, -182849, 40138, 10706, -60956, -168650, -227358, -245071, -121451, -269724, -436025, -366920, -241401, -355046, -477450, -564146, -311177, -54263, -214021, -147500, -109832, -316272, -355319, -399134, -488874, -288231, -226365, -194027, -211392, -124313, 71533, 87265, -9909, -303467, -110024, -113160, -163593, -61189, 166081, -20072, -229359, -314551, -341740, -357580, -219156, -88298, -131476, -305977, -427856, -461192, -349639, -237419, -322502, -368392, -9207, 59843, -167938, -105798, -33502, -123108, -356845, -328464, -360508, -300221, -382939, -482328, -453897, -229788, -234557, -418305, -366870, -150990, -72758]
17835g2758N1476N1880J3835k22356M6772q8168J2709k6051m9578o1686l4106
17824c78031K0935J01410n5854J6739J75685j331r9690J08451k12284j84422K4110
17813d84282J72205R2421J35552K61638P1149o9446j26738k78442l7458p2277
17803c35678N6050K4388P7352n3038R7544j03069K0311K1551J42161q8747j20435
17792b61610q7110Q8501J47136J4340k8924m8712p397J91122K37454k97618n2074
17781a04892K26146J25621l88027k87194j61257l1664J5858K93925J07153L8452
17771a65879L35949K16807Q8394q6085l24821j78481j09512j87570N6126O3900
17761b91172O6290k5145l3524k4981J49680J18977j82401k99326L6541N4359L12951
$$ y = [-72758, -21282, 30598, 44433, -177923, -131151, -219319, -206610, -232661, -282239, -343925, -378031, -357096, -255686, -311540, -294801, -119116, -120447, -220137, -111686, -323970, -508392, -484282, -312077, -219656, -84104, 177534, 248683, 179237, 52499, -225943, -263401, -335678, -279628, -255240, -177888, -230926, -133382, -236451, -216140, -194589, -52428, -141175, -261610, -348720, -260219, -113083, -98743, -127667, -176379, -183776, 7346, 244800, -52818, -104892, 121254, 246875, -141152, -428346, -589603, -621267, -605409, -311484, -204331, -165879, 170070, 386877, 475271, 389186, 64365, -114116, -223628, -411198, -355072, -291172, -224882, -250027, -283551, -308532, -158852, -39875, -222276, -521602, -485061, -430702, -117751]
17750a17751J09813n8862P9535J3945j49065J64026r7582j86654K12246j14397
17740a44746q0363J27664m3901O2794j29657K59625K61068k9410q2283k07890
17730g099q5541M1444R6804j02747K08652o0336k16979J68248q3598j07505p0818
17719b19475l2692K6841k7270P7721J04584K60061j7167o52j72966k33757J01947
17708a32825J14857K69592K29404K502J15013J3170N5997k79330j77583J13966
17698C24763j49517j03732k2147J1446k7696m1824Q5577n5798j67146j74356J19186
17687b01244J9705J2127Q3099J24707J52929M1903l56595r0081J65358j03324
17677a51416J3987J96584K16978j55716j29057m9378K7436q2587j16688M8188
$$ y = [-117751, -7938, -66800, 12735, 26680, -122385, 41641, -55941, -242595, -30349, -144746, -225109, -97445, -141346, -78552, -208209, 51416, 312484, 283074, 200791, -7099, -92640, -51196, 45608, -57139, 151513, 91177, -125802, 42446, -41152, -148657, -219475, -252167, -225326, -252596, -174875, -70291, 189770, 172603, 171951, -1015, -234772, -132825, -17968, 251624, 481028, 483530, 598543, 611713, 667710, 388380, 210797, 324763, 175246, 71514, 49367, 60813, 33117, -8707, 76870, 21072, -146074, -320430, -201244, -181539, -169412, -86313, 38394, 191323, 233226, -123369, -213450, -48092, -151416, -137429, 59155, 276133, 120417, -8640, -58018, -30582, -113169, -229857, -181669]
17667a81669K03042j2707M0532K67259J18081j17621p1291r7429k60442k07463
17657c19708O3404J1139l7972Q3036L44563P0024k87735k74760K20740L16440
17647A89171J09624R5998j79969l1880J00358J80496K4029l58661l7335Q5384
17637A77215q3779r0156P8999K32873n2732r5616k23461P8472J4059k67198p2622
17626c03946j28431M8101K65619J35055M3633R5118M1332K09586l4753o0670m542
17615C06102M4933r7075j70979j42886n8295j04642K93821k6990L3767q067M2542
17604A12231P7755J12695n9966k7490j50624p4452j9350q3537M2808N1924J25718
17593A07712o0145o2817j74122j14998J08337K67059K82217j24503k77777j33214
$$ y = [-181669, 21373, 8666, 49198, 316457, 434538, 316917, 245626, 148197, -112245, -319708, -256304, -245165, -283137, -200101, 144462, 214486, -73249, -348009, -127269, 189171, 298795, 394793, 214824, 182944, 283302, 463798, 487827, 129166, 91831, 177215, 93436, 3280, 82279, 315152, 262420, 166804, -56657, 21815, 35874, -231324, -303946, -432377, -384276, -118657, 16398, 60031, 155149, 196481, 406067, 371314, 310644, 306102, 351035, 253960, 82981, -59905, -118200, -222842, 70979, 43989, 77756, 69689, 112231, 189986, 302681, 242715, 215225, 64601, -9851, -29201, -112738, -69930, -18006, 107712, 47567, -15250, -189372, -304370, -196033, 71026, 353243, 228740, -49037, -182251]
17583a82251L76935P7407o6288k10721j45927J51909M5026r2023k05701j17849
17573c69483J35911Q3811j17552J6516N1022J86346k7459M7902J85940K8186j53073
17562F8067m3944L8367J8736Q5851J00776L5386k60984m26696N8419J3346j07175
17551d19851q4782K79640J25230K73771L12962L3491k80251m7986M9314m2679
17541A98859j98131j62925j33594R3629Q1518q7331K711L642j8985J8648M4315
17530a57644j14795p8535L6433j25260P256K06351r6172P1064P7543j1630k128
17519a87517n6812q0757m5598j5205J0827K4623J01592m471J528j15463J8131
17508c49122K5741M6799R164J55696n4204n9858N7483J86365o0890k09826J55641
$$ y = [-182251, 194684, 272091, 205803, -4918, -150845, 1064, 46090, -45933, -251634, -369483, -233572, -149761, -267313, -250797, -199775, -13429, -40888, 7014, 192954, 221140, 68067, 24123, 62490, 81226, 167077, 267853, 303239, 42255, -384441, -326022, -312676, -419851, -504633, -224993, -99763, 174008, 486970, 520461, 240210, 192224, 241538, 198859, 728, -162197, -295791, -202162, -120644, -207975, -205264, -201622, -220607, -201959, -157644, -272439, -350974, -314541, -439801, -432545, -226194, -322366, -251302, -173759, -185389, -187517, -244329, -325086, -370684, -385889, -375062, -350439, -248847, -253318, -251790, -367253, -349122, -323381, -276582, -267418, -111722, -165926, -225784, -168301, 18064, -42826, -252652, -97011]
17497i7011J16126k5692r0701j06897j32065R6008J14882K97476J33683k9089
17487B76720l38133j11269J6861o4415j03040J17439J71754O364J4888l4762k27612
17476b75205j02698n2259M7385N6054q0784j0321J35663R4793J13260m3309l22643
17465d40064p0452L58220P2897o9315q2219K2517J00962L5844j55167J8091K13074
17454D388L814j16657k64826J03577K80571m252M3868P8347j95645k55721J43412
17443a79124J64867O6515k0380q7007p556k0546q4124O1085j04885J47671R7881
17432C4397p9068j12117M3318m7965J23893Q375P0471j17514o9677j04321j7994
17421b68202J16421l4802J8867J67091p1611k36110j68554K42483P5848M2609
$$ y = [-97011, 19115, -6577, -97278, -204175, -336240, -240232, -125350, 172126, 305809, 276720, -61413, -172682, -155821, -220236, -323276, -205837, -34083, -27719, -12831, -47593, -275205, -377903, -430162, -382777, -326723, -407507, -417828, -282165, -187372, -74112, -117421, -440064, -510516, -152296, -79399, -148714, -230933, -208416, -107454, -71610, -226777, -208686, 4388, 8202, -108455, -373281, -269704, 10867, 6615, 50483, 128830, -66815, -322536, -179124, -14257, 52258, 31878, -55129, -62685, -83231, -167355, -106270, -211155, -63484, 34397, -44671, -156788, -113470, -161435, -37542, -29167, 41304, -76210, -145887, -250208, -268202, -151781, -186583, -167716, -625, -72236, -308346, -476900, -234417, -158569, -115960]
17411a15960J05783R3972r0633j03923J7456L2156j986k9258j60835J52573n6872
17400a57527m8658J44040J78825O6353j0719j54471N2630J01615j31168J30855
17390A71775r3827k51954j43852L0502J97799m9730J77941j10309Q3948P9024
17380I1317r2494j26779R1676J44668J58567j25698p7628j87542l762L4576J05431
17369A2332N8033j3165N6430n0022k05568k17264O9834Q4979J34456j20502j14858
17358c05315J15683P5680J02652n1458k6060J69394k6792L35628J50882k81065
17348B59229k35873j6390p9021J28614k04642k49360K9467r8866l0615J11162
17338c86295L03660K00351R7188J48832k68313j32794J72554n3789k34724l9080
$$ y = [-115960, -10177, 83795, -6838, -110761, -93305, -61149, -63135, -92393, -253228, -100655, -157527, -206185, -62145, 116680, 183033, 172314, 17843, 70473, 172088, 40920, 171775, 77948, -174006, -317858, -287356, -89557, -139287, 38654, -71655, 12293, 91317, -1177, -127956, -36280, 108388, 266955, 141257, 63629, -123913, -127675, -93099, 12332, 70365, 57200, 113630, 63608, -141960, -359224, -289390, -204411, -69955, -190457, -305315, -189632, -113952, -11300, -62758, -88818, 80576, 53784, 389412, 540294, 259229, 23356, 6966, -72055, 56559, -148083, -397443, -367976, -466842, -497457, -386295, -82635, 117716, 214904, 363736, 95423, -37371, 135183, 81394, -153330, -192410]
17328a92410J21498K33081n5375m0323J40873k20893k5056p4550j40472k9532
17318b83159K183Q2086P5711J11996o0659P5058L0529k47030j48462j8354J5184
17307c64917j12112J97667J90116j8117j18675J0089J89859J555q8150k27102
17297c39787J39707P1002l7032j39284K26047L49604k20668j16906R6553P0962
17287A00198K45336j38599r1472K19030Q3540k24746Q7443j16232l4907k49707
17277a20116o7188J36060K9571j83753O5560J57401J42743M3980P3493l0108j00212
17266A47431k30069j38427k7266N3115R7891n2471L4433R6686j70620l198K02941
17255A0446j68459o045j06174k56493n5145L9655R9718J59089K97223l1914m0923
$$ y = [-192410, -70912, 162169, 106794, 66471, 207344, -13549, -38605, -113155, -253627, -283159, -280976, -198890, -123179, -11183, -71842, 3216, 33745, -213285, -361747, -380101, -364917, -477029, -279362, -89246, -107363, -226038, -215949, -26090, -24535, -112685, -339787, -200080, -129078, -166110, -305394, -79347, 270257, 49589, -67317, 29236, 100198, 345534, 206935, 115463, 334493, 418033, 193287, 280730, 164498, 129591, -120116, -187304, -51244, -21673, -205426, -139866, 17535, 160278, 204258, 277751, 247643, 147431, -82638, -221065, -248331, -195216, -97325, -149796, -115363, -18677, -189297, -192495, 10446, -158013, -164058, -270232, -526725, -581870, -542215, -442497, -283408, 13815, -18099, -59022]
17244e9022j36102p7089J28573K26616j86713j96856k46535J92164K49793M2519
17234f2652l9431J61076L6849j31310j24827j80468J04967O4407j87564j59134
17224e18087K46526R9707j28383K33407K02112K9067p9047l1405o4173o8236J89960
17213A11448j17504j77611k08846J03669K34051J4549J75144J16353K9986q0352
17203B00887j45507j34348Q7269n8177j65788j6895n2563o2188J5719l5389J00582
17192b66398K28802N7007j56888L8003M8633l2511Q8722J14072J63560m6302j52995
17181H3705J54232k74788j2721l5091n062j36398j29475l9762K65390K3583k15796
17170c22183J22539J1980R6428K34405r7095l9502m2432M275N1892M24666J3484
$$ y = [-59022, -195124, -272213, -143640, 82976, -103737, -300593, -547128, -354964, -105171, -62652, -102083, 58993, 95842, -35468, -160295, -340763, -235796, -171389, -358953, -518087, -271561, -171854, -300237, -66830, 135282, 164349, 85302, 53897, -10276, -78512, 111448, -6056, -183667, -392513, -288844, -54793, -40244, 134900, 251253, 281239, 200887, 55380, -78968, 8301, -49876, -215664, -232559, -285122, -347310, -331591, -366980, -266398, -37596, 19411, -137477, -99474, -50841, -83352, 5370, 119442, 283002, 236700, 83705, 237937, -36851, -49572, -84663, -89725, -226123, -355598, -395360, -129970, -106387, -322183, -199644, -187664, -91236, 143169, 46074, 6572, -35860, -31585, 20307, 444973, 458457]
17159D58457o63715j75065K94145l4426k69245o0915K94935n1996M8987J82043
17149B3205j59063N1242Q4199N9452J1038m0415m477n9275M5445j65618K64899
17138A10632m1220n652N083K8457n3167j12046M9124p7237J20626J59716O7631
17127B51947N966k4734k52798j13966L30390o9757m9394O7739k79699j49691q7317
17116c71314k57837M7199K47550M8903P7367J34844r7399k5418J28742R0309L4943
17105E7889Q3033J49867r5805m4039Q3784Q0426J7580k00731l12778j05769j53403
17094d39946N7735j22417n1295j54524K14541L84716R4267j27434L4178L08266
17084A98087J1219j18117j19307r3386l9300P6742O4567p1262K31729j66735p8168
$$ y = [458457, -205258, -380323, -86178, -120604, -389849, -450764, -155829, -207825, -158838, 23205, -135858, -84616, -417, 59035, 70073, 29658, 25181, -34094, 11351, -154267, 110632, 69412, 63760, 68843, 97300, 44133, -67913, -18789, -96026, 24600, 184316, 251947, 257913, 233179, -19619, -133585, 196805, 127048, 77654, 145393, -134306, -283997, -371314, -629151, -581952, -334402, -285499, -208132, -73288, -170687, -196105, -67363, 22946, 57889, 140922, 290789, 194984, 150945, 234729, 315155, 332735, 132004, -180774, -286543, -439946, -382211, -504628, -555923, -710447, -495906, -111190, -16923, -144357, -110179, 198087, 209306, 91189, -28118, -121504, -160804, -84062, -19495, -90757, 140972, -25763, -103931]
17073a03931K1637j05650K20577J67727m33717j31040K19658j96770j7086q567
17063c67162n9843J16076J10353R9692j02690O0381N2046P8877j07305m1866j28109
17052b89550M553J71099Q3773R156O86M5948O2431J70845K08790r3124k2175n6350
17040B96082j15596j93488j65765O5193R0145k1352j03478O5614q4455J2106j01431
17029b56425j61423J2970j13666J24011K13683J33581q4260l7824O8409j38397
17019b39341j64585l6399O0728m1674j20411K92358J53071l8706j06760j11047
17009c52766K5368J17823J81405k37471m979L1283K31098J87957m1751l2661J59406
16998B64712q211j45973j73172m8380j57678K00635J47246j3392j39746P9546
$$ y = [-103931, -82294, -187944, 32633, 200360, -233357, -364397, -144739, -341509, -358595, -367162, -427005, -310929, -200576, -100884, -203574, -143193, -91147, -12270, -119575, -161441, -289550, -284997, -113898, -30125, -20969, -20283, 25665, 88096, 258941, 467731, 374607, 352432, 296082, 180486, -13002, -178767, -113574, -23429, -44781, -148259, -82645, -167100, -154994, -256425, -417848, -404878, -518544, -394533, -180850, -47269, -131529, -169353, -100944, -239341, -403926, -440325, -379597, -421271, -541682, -249324, -96253, -134959, -241719, -352766, -327398, -209575, -28170, -265641, -270620, -239337, -8239, 179718, 137967, 105306, 264712, 256501, 110528, -62644, -111024, -268702, -68067, 79179, 65787, -73959, 5587]
16988E587Q9476k2983j197j87615J3462J30659R6998M5101K9870l84282j43850
16977c28774j5948L0753R447J9652J15512K6732J44675J74522k16474j97956j80312
16966d18171J69017J82594N8438J4496j06304l22552J5071J23355K84838q3033
16956h2251k09696o2013K3797j63547J34391J26679J16118j48380J5832J94154
16946e4916R3475L5878j10001J53625L089j62653k13308J65832K44085J07695
16936B62801l0184k56190j45418M533J03344Q5188j92587j35553j11114L70411
16926d4769K45173p7360K6763L14391j39023k72695k846P8134K1272r8420K12219
16915B62839j7659j70773n3540J2859j1567o4732p6322J22036O4533m8490J16337
$$ y = [5587, 95063, 72080, 70883, -116732, -103270, 27389, 124387, 169488, 199358, -184924, -328774, -344722, -313969, -304522, -284870, -169358, -142626, 2049, 176571, -39903, -237859, -418171, -249154, -66560, -8122, 6374, -99930, -422482, -407411, -284056, 782, -82251, -291947, -353960, -330163, -493710, -359319, -232640, -116522, -264902, -249070, -54916, 38559, 74437, -35564, 118061, 121150, -41503, -254811, -88979, 155106, 262801, 232617, -23573, -168991, -164458, -61114, 24074, -168513, -304066, -415180, -44769, 200404, 123044, 149807, 464198, 325175, 52480, 49634, 127768, 149040, 50620, 262839, 245180, 74407, 20867, 33726, 22159, -42573, -118895, 3141, 67674, 19184, 135521]
16904A35521k2640j56062m1861j88328J92875m501j88755j14765n9493j8075j7009
16893d83093J02298P0413J47790J36181Q9976j71566J29061j3792k74524k05593
16883d72849L0589l5501J53255J93313L3440Q335j66551o9285r0767r0831K65335
16872b41517J54391N5375l34134k93652L61811K34656J88962P1610j66747j65477
16862a34722k27855k75834J4427J51429J77057J24376k3700m8456J27682O2168
16852e3428j86510l10599L80869J87956J42438P0752q8864l7470j21604j26186
16842a42646l7202j21156N9627M8314j19500o0938J38053R1380n8066q2241R9689
16831a84686k02718Q9133L05534j8587J27524J04001q8095Q125J26083r5353O13
$$ y = [135521, 112881, -43181, -85042, -273370, -80495, -84996, -273751, -388516, -448009, -466084, -483093, -380795, -310382, -162592, -26411, 63565, -108001, 21060, 7268, -267256, -472849, -442260, -477761, -324506, -131193, -97753, -89418, -255969, -325254, -416021, -506852, -241517, -87126, -31751, -365885, -659537, -297726, -63070, 125892, 197502, 30755, -134722, -362577, -638411, -623984, -472555, -295498, -171122, -194822, -243278, -115596, -53428, -239938, -550537, -169668, 18288, 160726, 231478, 142614, 105144, -16460, -142646, -179848, -301004, -241377, -193063, -312563, -373501, -235448, -144068, -202134, -284375, -184686, -387404, -298271, 7263, -11324, 116200, 220201, 132106, 140231, 266314, 170961, 171574]
16820A71574j01196k84468j0459J0675j22448P1577L03704j3173J65280O7950
16810B59016j61111O8827n8683j16041J5053J38531R2851N1839r48m8035n9192
16799A82107j35409K0181j264j77218j87554j67925J62620N1231R5060P6184q0197
16788a62184K73299N2722n7590J5005k25132M5757j4699J54622J00275j86341
16778d266k5817q6161K1265J553l8189L4467O3294J18108J8911m0084R6652K11037
$$ y = [171574, 70378, -214090, -224549, -213874, -336322, -264745, 38959, 25786, 191066, 259016, 97905, 166732, 108049, -7992, 7061, 145592, 238443, 290282, 289334, 241299, 182107, 46698, 66879, 65615, -111603, -299157, -467082, -304462, -253231, -158171, -81987, -162184, 111115, 163837, 106247, 121252, -103880, -58123, -72822, 81800, 182075, -4266, -30083, -116244, -94979, -93426, -131615, -97148, -33854, 84254, 103165, 63081, 159733, 370770]
$$ [...]
##END NTUPLES=NMR SPECTRUM
##END=
