##TITLE=Analysis number 307341
Compound Code cc 05910
Project Code qc-cat
Chemist Name endeavour
##JCAMPDX= 6.0         $$ Bruker NMR JCAMP-DX V2.0
##DATA TYPE= NMR SPECTRUM
##DATA CLASS= NTUPLES
##ORIGIN= Bruker BioSpin GmbH
##OWNER= NMR
$$ XWIN-NMR		Version 3.5
$$ Thu Apr 28 10:42:01 2005 GMT Daylight Time (UT+1h)  MAYBRIDGE\NMR@NMR_250MHZ
##.OBSERVE FREQUENCY= 250.131544655141
##.OBSERVE NUCLEUS= ^1H
##.ACQUISITION MODE= SIMULTANEOUS (DQD)
##.ACQUISITION SCHEME= undefined
##.AVERAGES= 16
##.DIGITISER RES= 18
##SPECTROMETER/DATA SYSTEM= dpx250
##.PULSE SEQUENCE= zg30
##.SOLVENT NAME= CDCl3
##.SHIFT REFERENCE= (INTERNAL, CDCl3, 0, 16.522)
##AUDIT TRAIL= $$ (NUMBER, WHEN, WHO, WHERE, WHAT)
$$ ##TITLE= Audit trail, XWIN-NMR		Version 3.5
$$ ##JCAMPDX= 5.01
$$ ##ORIGIN= Bruker BioSpin GmbH
$$ ##OWNER= NMR
$$ C:\u/data/dgb/nmr/ADRS/2430/pdata/1/auditp.txt
$$ ##AUDIT TRAIL=  $$ (NUMBER, WHEN, WHO, WHERE, WHAT)
(   1,<2005-04-28 10:41:39.96 +100>,<MAYBRIDGE\NMR>,<NMR_250MHZ>,
      <created by zg, POWCHK disabled, PULCHK disabled
       configuration hash MD5:
       62 19 C7 07 E1 42 D1 B7 37 6C 3D D0 77 39 F9 E6
       data hash MD5: 64K
       43 01 EF 0A 54 E2 41 0E B8 B2 EA A4 E5 25 2F AB>)
(   2,<2005-04-28 10:41:52.85 +100>,<MAYBRIDGE\NMR>,<NMR_250MHZ>,
      <Start of raw data processing
       ef LB = 0.3 FT_mod = 6 PKNL = 1 SI = 32K 
       data hash MD5: 32K
       53 5B 76 0B 05 FE F0 A5 0C 56 AB D6 AF 62 A4 0E>)
(   3,<2005-04-28 10:41:55.27 +100>,<MAYBRIDGE\NMR>,<NMR_250MHZ>,
      <apk 
       data hash MD5: 32K
       10 20 56 A6 27 28 25 CC E0 BB 5F C9 99 3E 93 6F>)
(   4,<2005-04-28 10:41:56.02 +100>,<MAYBRIDGE\NMR>,<NMR_250MHZ>,
      <abs ABSG = 5 
       data hash MD5: 32K
       88 B6 77 21 13 B7 EA E4 D1 C5 04 A2 C8 37 0C F8>)
$$ ##END=
$$ 
$$ hash MD5
$$ 8B 4F 4D C9 89 B0 ED 62 6D 42 4B 3A 71 45 6F 30
##$RELAX= 
##$RELAX= 
##$RELAX= 
##$RELAX= 
##$RELAX= 
##$RELAX= 
##$RELAX= 
$$ Bruker specific parameters
$$ --------------------------
##$DU= <C:\u>
##$EXPNO= 2430
##$NAME= <ADRS>
##$PROCNO= 1
##$TYPE= <nmr>
##$USER= <dgb>
##$AMP= (0..31)
100 100 100 100 100 100 100 100 100 100 100 100 100 100 100 100 100 100 
100 100 100 100 100 100 100 100 100 100 100 100 100 100 
##$AQSEQ= 0
##$AQ_mod= 3
##$AUNM= <au_zg>
##$AUTOPOS= <10 >
##$BF1= 250.13
##$BF2= 250.13
##$BF3= 250.13
##$BF4= 250.13
##$BF5= 500.13
##$BF6= 500.13
##$BF7= 500.13
##$BF8= 500.13
##$BYTORDA= 1
##$CFDGTYP= 0
##$CFRGTYP= 5
##$CHEMSTR= <none>
##$CNST= (0..31)
1 1 145 1 1 1 1 1 1 1 1 1 1 1 1 1 1 1 1 1 1 1 1 1 1 1 1 1 1 1 1 1 
##$CPDPRG= <>
##$CPDPRG1= <>
##$CPDPRG2= <>
##$CPDPRG3= <>
##$CPDPRG4= <mlev>
##$CPDPRG5= <mlev>
##$CPDPRG6= <mlev>
##$CPDPRG7= <mlev>
##$CPDPRG8= <mlev>
##$CPDPRGB= <>
##$CPDPRGT= <>
##$D= (0..31)
0 1 0 0 0 0 0 0 0 0.06 0 0 0 0 0 0 0.0002 0 0 0 0 0 0 0 0 0 0 0 0 0 0 
0 
##$DATE= 1114681299
##$DBL= (0..7)
120 120 120 120 120 120 120 120 
##$DBP= (0..7)
150 150 150 150 150 150 150 150 
##$DBP07= 0
##$DBPNAM0= <>
##$DBPNAM1= <>
##$DBPNAM2= <>
$$ [...]
##$SUBNAM7= <"">
##$SUBNAM8= <"">
##$SUBNAM9= <"">
##$SW= 20.6930455092707
##$SWIBOX= (0..15)
0 0 3 0 0 0 0 0 0 0 0 0 0 0 0 0 
##$SW_h= 5175.983436853
##$TD= 65536
##$TD0= 1
##$TE= 295.16
##$TE2= 300
##$TE3= 300
##$TEG= 300
##$TL= (0..7)
0 120 120 120 120 120 120 120 
##$TP= (0..7)
150 150 150 150 150 150 150 150 
##$TP07= 0
##$TPNAME0= <>
##$TPNAME1= <>
##$TPNAME2= <>
##$TPNAME3= <>
##$TPNAME4= <>
##$TPNAME5= <>
##$TPNAME6= <>
##$TPNAME7= <>
##$TPOAL= (0..7)
0.5 0.5 0.5 0.5 0.5 0.5 0.5 0.5 
##$TPOFFS= (0..7)
0 0 0 0 0 0 0 0 
##$TUNHIN= 0
##$TUNHOUT= 0
##$TUNXOUT= 0
##$USERA1= <user>
##$USERA2= <user>
##$USERA3= <user>
##$USERA4= <user>
##$USERA5= <user>
##$V9= 5
##$VALIST= <valist>
##$VCLIST= <CCCCCCCCCCCCCCC>
##$VD= 0
##$VDLIST= <DDDDDDDDDDDDDDD>
##$VPLIST= <PPPPPPPPPPPPPPP>
##$VTLIST= <TTTTTTTTTTTTTTT>
##$WBST= 1024
##$WBSW= 4
##$XGAIN= (0..3)
0 0 0 0 
##$XL= 0
##$YL= 0
##$YMAX_a= 582324
##$YMIN_a= -410220
##$ZGOPTNS= <>
##$ZL1= 120
##$ZL2= 120
##$ZL3= 120
##$ZL4= 120
##$ABSF1= 16.522
##$ABSF2= -4.171173
##$ABSG= 5
##$ABSL= 3
##$ALPHA= 0
##$AQORDER= 0
##$ASSFAC= 0
##$ASSFACI= 0
##$ASSFACX= 0
##$ASSWID= 0
##$AUNMP= <proc_1d>
##$AZFE= 0.1
##$AZFW= 0.1
##$BCFW= 0
##$BC_mod= 0
##$BYTORDP= 0
##$COROFFS= 0
##$CY= 12.5
##$DATMOD= 1
##$DC= 0
##$DFILT= <>
##$DTYPP= 0
##$F1P= 14.0000005364418
##$F2P= -0.99999901652339
##$FCOR= 0.5
##$FTSIZE= 32768
##$FT_mod= 6
##$GAMMA= 0
##$GB= 0
##$INTBC= 1
##$INTSCL= 1
##$ISEN= 128
##$LB= 0.3
##$LEV0= 0
##$LPBIN= 0
##$MAXI= 10000
##$MC2= 0
##$MEAN= 0
##$ME_mod= 0
##$MI= 0
##$NCOEF= 0
##$NC_proc= -3
##$NLEV= 6
##$NOISF1= 0
##$NOISF2= 0
##$NSP= 0
##$NTH_PI= 0
##$NZP= 0
##$OFFSET= 16.522
##$PC= 1
##$PHC0= -75.36304
##$PHC1= 9.736101
##$PH_mod= 1
##$PKNL= yes
##$PPARMOD= 0
##$PSCAL= 4
##$PSIGN= 0
##$REVERSE= no
##$SF= 250.13
##$SI= 32768
##$SIGF1= 0
##$SIGF2= 0
##$SINO= 400
##$SIOLD= 32768
##$SREGLST= <1H.CDCl3>
##$SSB= 0
##$STSI= 32768
##$STSR= 0
##$SW_p= 5175.98343685301
##$SYMM= 0
##$S_DEV= 0
##$TDeff= 65536
##$TDoff= 0
##$TI= <Analysis number 999999
Compound Code 99
Book Reference 9
Project Code 9>
##$TILT= no
##$TM1= 0
##$TM2= 0
##$TOPLEV= 0
##$USERP1= <user>
##$USERP2= <user>
##$USERP3= <user>
##$USERP4= <user>
##$USERP5= <user>
##$WDW= 1
##$XDIM= 32768
##$YMAX_p= 280289657
##$YMIN_p= -360403
$$ End of Bruker specific parameters
$$ ---------------------------------
##NTUPLES= NMR SPECTRUM
##VAR_NAME=  FREQUENCY,     SPECTRUM/REAL,   SPECTRUM/IMAG
##SYMBOL=    X,             R,               I
##VAR_TYPE=  INDEPENDENT,   DEPENDENT,       DEPENDENT
##VAR_FORM=  AFFN,          ASDF,            ASDF
##VAR_DIM=   32768,         32768,           32768
##UNITS=     HZ,            ARBITRARY UNITS, ARBITRARY UNITS
##FACTOR=    0.157963299565203, 1,           1
##FIRST=     4132.6476996994, 0,             0
##LAST=      -1043.33573715361, 0,           0
##MIN=       -1043.33573715361, -360403,     0
##MAX=       4132.6476996994, 280289657,     0
$$ Real data points
##PAGE= N=1
##DATA TABLE= (X++(R..R)), XYDATA
$$ [...]
26937C1053j2732j7594Q766L3375P33j6681l094K5107r478p426J5362k600k2938
$$ 31053 18321 727 9493 42868 43601 26920 23826 48933 39455 32029 47391 44791 21853
26924B1853l4675q718K5568J0279r010n93k2165k0016L746P000J6826P619K7O901
$$ 21853 -12822 -21540 4028 14307 5297 4704 -17461 -37477 -33731 -26731 -9905 -2286 -2259 4642
26910D642J0913j4272k2298j1166N168O447L2307j5139k4275r431j2173J0761
$$ 4642 15555 1283 -21015 -32181 -27013 -20566 11741 -3398 -27673 -37104 -49277 -38516
26898c8516L9434R962n455J898J9543o348m41j601j1364Q487p741p253J8875R692
$$ -38516 918 10880 5425 7323 26866 20518 20077 18476 7112 15599 7858 605 19480 29172
26884B9172J4425N259j2605l063r224j0913j870k030r25n873j775j3083R988O709
$$ 29172 43597 48856 36251 33188 23964 13051 11181 9151 8226 2353 578 -12505 -2517 4192
26870D192j9363J4649l00O350k0217L022K0061j54O080J4175j338l5230J893K4453
$$ 4192 -15171 -522 -822 5528 -14689 -11667 8394 8240 14320 28495 27157 -8073 -6180 18273
26856A8273N43l466J3529j945L605q56p00k5780j9684J1991k786p480k3072o704
$$ 18273 18816 15350 28879 26934 30539 29683 28983 3203 -16481 -4490 -7276 -14756 -37828 -44532
26842d4532N334J4118J2042J838R215K3465l069k6219k2421j1998j028r524O765
$$ -44532 -39198 -25080 -13038 -11200 -1985 21480 18411 -7808 -30229 -42227 -43255 -52779 -46014
26829d6014Q92k176N441K9406J0091o885K569o411O036r397n505k1627L291j965
$$ -46014 -45122 -47298 -41857 -12451 -2360 -9245 -6676 -13087 -7051 -16448 -21953 -43580 -40289 -42254
26815d2254Q754K0504J273o367J3945J3378J9559o849k7454k6411k774k888P67
$$ -42254 -33500 -12996 -11723 -18090 -4145 9233 28792 21943 -5511 -31922 -34696 -37584 -36817
26802c6817K2281K2047K21o035O768k3225k2179l962K674k908N040m359j3135
$$ -36817 -14536 7511 7732 1697 8465 -14760 -36939 -40901 -38227 -41135 -36095 -40454 -53589
26789e3589L0732J7069j000j4305Q492K036l624j1240j9329l2651J3513L1079
$$ -53589 -22857 -5788 -6788 -21093 -12601 -10565 -14189 -25429 -44758 -77409 -63896 -32817
26777c2817o160J4853L4475P820k2491R923J5868j9525l3528j8176J2513J5391
$$ -32817 -38977 -24124 10351 18171 -4320 5603 21471 1946 -31582 -49758 -37245 -21854
26765b1854K1444J9262L3671n956k2954j6642K2740J3585k9313j7958L489J2967
$$ -21854 -410 18852 52523 46567 23613 6971 29711 43296 13983 -3975 -486 12481
26753A2481o400M001l529j3768o082k892K9797L117m069k1350j2718N680M102
$$ 12481 6081 10082 6553 -7215 -13297 -16189 13608 16725 12656 -8694 -21412 -15732 -11630
26740a1630K7694M435j2259J4968Q871m0653j6037j5062M590J7460j3960j1503
$$ -11630 16064 20499 8240 23208 32079 -8574 -24611 -39673 -35083 -17623 -31583 -43086
26728d3086m651L18J7912L316N964j714Q760J7174o18j1797j6853k6625j7530
$$ -43086 -47737 -47419 -29507 -26191 -20227 -21941 -13181 3993 3375 -8422 -25275 -51900 -69430
26715f9430J6983J5657J1354j773J2825J8175R099M301M771r73j4408q576k5873
$$ -69430 -52447 -36790 -25436 -27209 -14384 3791 12890 17191 21962 20989 6581 -1995 -27868
26702b7868k1043j2743P47K1622J5805m390M726K241Q081J8494J3637N290L489
$$ -27868 -48911 -61654 -60907 -39285 -23480 -27870 -23144 -20903 -12822 5672 19309 24599 28088
26689B8088j6500m735N469J1828j8837n922R235J8915J8850l1369j9108j2919
$$ 28088 11588 6853 12322 24150 5313 -609 8626 27541 46391 15022 -4086 -17005
26677a7005k4804K8493L6868L034j3903K439m792m368j2978n067j5963J2694P571
$$ -17005 -41809 -13316 23552 26586 12683 15122 10330 5962 -7016 -12083 -28046 -15352 -7781
26664g781o920K9160j8585j0965j0352N329K5896K2199j0675k1959M184J321j0807
$$ -7781 -14701 14459 -4126 -15091 -25443 -20114 5782 27981 17306 -4653 -469 852 -9955
26651i955l703J7340m133Q279P768m024j4655p583L0421L5180k0959j7798n495
$$ -9955 -13658 3682 -451 7828 15596 11572 -3083 -10666 19755 54935 33976 16178 10683
26638A0683l610j7988L327j0481O409K5810M554Q20K1557j1688j1674o869k4872
$$ 10683 7073 -10915 -7588 -18069 -11660 14150 18704 19524 41081 29393 17719 10850 -14022
26625a4022r779J9755L1024q318j1021m0795K7337K7086J1235k2678j8821L111
$$ -14022 -23801 -4046 26978 18660 7639 -33156 -5819 21267 32502 9824 -8997 -5886
26613e886J1453Q769j6720l1684K586J5784k18N877L871J4154K6642r630J0765
$$ -5886 5567 14336 -2384 -34068 -31482 -15698 -15916 -10039 -6168 7986 34628 24998 35763
26600C5763J617j9887j0054J2639j2961k4940n113P517o726k2374N204J7879P758
$$ 35763 37380 17493 7439 20078 7117 -17823 -22936 -15419 -22145 -44519 -39315 -21436 -13678
26587a3678N975n016n555J474K3806L2572k9699q405L508p418P225m919j1549
$$ -13678 -7703 -12719 -18274 -16800 7006 39578 9879 1474 4982 -2436 4789 -130 -11679
26574a1679J4897Q746R74m395n362J2095o183J968k5827M592K3942m254o649r618
$$ -11679 3218 11964 12938 8543 3181 15276 9093 11061 -14766 -10174 13768 9514 2865 -6753
26560f753K1017J5399j6869k6371n440j0897K0789R712J0282O534r911r67Q802
$$ -6753 14264 29663 12794 -13577 -19017 -29914 -9125 587 10869 17403 7492 6525 15327
26547A5327K0066m645k2730k3599K812J2985k373J1618j9816k2261J0288N751
$$ 15327 35393 30748 8018 -15581 -12769 216 -2157 9461 -10355 -32616 -22328 -16577
26535a6577J1336J8398K4770j4662k874N352j3633j4600L895R55j3059m336J9800
$$ -16577 -5241 13157 37927 23265 20391 25743 12110 -2490 1405 2360 -10699 -15035 4765
26522D765j5256p614j0789M087J8830r069J1519m540r983J6218m830Q875l551
$$ 4765 -10491 -18105 -28894 -24807 -5977 -15046 -3527 -8067 -18050 -1832 -6662 2213 -1338
26509a338l0314K665L0169K4905Q562o717k4858k9869m365K9363J9695p58o743
$$ -1338 -31652 -28987 1182 26087 34649 27932 3074 -26795 -31160 -1797 17898 17140 10397
26496A0397m267j2851m36l563j539J0185J0879J0676j4816k4131J0437J2558J9716
$$ 10397 6130 -6721 -7157 -10720 -12259 -2074 8805 19481 4665 -19466 -9029 3529 23245
26483B3245r690j5975o501n64J2804L372r486o816j5575M450M54K7970k579K452
$$ 23245 13555 -2420 -8921 -9485 3319 6691 -2795 -9611 -25186 -20736 -20282 7688 5109 7561
26469G561N405j4303l807j1662k1262K0327K143j921L189K6514O651k890j4322
$$ 7561 12966 -1337 -5144 -16806 -38068 -17741 -15598 -17519 -14330 12184 18835 15945 1623
26456A623L1515j4525j4941P756m07k4773J8646M900L014k2372p238j80K1891
$$ 1623 33138 18613 3672 11428 11021 -13752 4894 9794 12808 -9564 -16802 -16982 4909
26443D909j7901p636R6J787N544K1833J2791k3262j6345L0308K5212k816l256
$$ 4909 -12992 -20628 -20532 -18745 -13201 8632 21423 -1839 -18184 12124 37336 34520 31264
26430C1264j5649j2353r593l735J799l636n799J4463M443l668m723j48K209M405
$$ 31264 15615 3262 -6331 -10066 -8267 -11903 -17702 -3239 1204 -2464 -7187 -7335 -5126 -721
26416g21N336K050j1758P530L6310k6030j2363J3731l996r005L773j3196j7824
$$ -721 4615 6665 -5093 2437 38747 12717 354 14085 10089 1084 4857 -8339 -26163
26403b6163L2329K7062n803j7471j524K3234J076J1935j038L805k8511k9186R44
$$ -26163 6166 33228 27425 9954 8430 31664 32740 44675 43637 47442 18931 -10255 -9311
26390i311j3576M378J5678k921j3672J1210L1832j5591r396J7073N287k1646l6075
$$ -9311 -22887 -18509 -2831 -5752 -19424 -8214 23618 8027 -1369 15704 20991 -655 -36730
26377c6730q940K074Q501M66L5143J0736j6115R983o261j1678K6798Q404r768
$$ -36730 -45670 -43596 -35095 -34629 514 11250 -4865 5118 -1143 -12821 13977 22381 12613
26364A2613o092j2442J0059J2876J5697l523r261j537j947R098P306j3263j996
$$ 12613 6521 -5921 4138 17014 32711 29188 19927 18390 16443 25541 32847 19584 17588
26351A7588M031k9070j1337q092q255P729J9142K329j6601l4671J8565J9948L448
$$ 17588 21619 -7451 -18788 -26880 -35135 -27406 -8264 -5935 -22536 -57207 -38642 -18694 -15246
26338a5246J4979j1621J7473J9978J9582J0483j0520k6328K498m711J3922P690
$$ -15246 -267 -11888 5585 25563 45145 55628 45108 18780 21278 16567 30489 38179
26326C8179j1821j5927j5695j2349M872o67J1637J7203j0229Q230j2856J8782
$$ 38179 26358 10431 -5264 -17613 -12741 -13408 -1771 15432 5203 13433 577 19359
26314A9359L422j2126J466P062J988j094J1201k1560j2936Q706P881r38j8332
$$ 19359 22781 10655 12121 19183 21171 20077 31278 9718 -3218 5488 13369 12431 -5901
26301e901q527J510r46P795K1093J3480q371J324J4727k398o685j4466j4301J8266
$$ -5901 -14428 -12918 -13864 -6069 15024 28504 20133 21457 36184 33786 27101 12635 -1666 16600
26287A6600j4239k2517q256m640j7050J3198J5740L0073K0588J1846M306m179
$$ 16600 2361 -20156 -28412 -33052 -50102 -36904 -21164 8909 29497 41343 45649 41470
26275D1470j1234r631j8896j510K5358J1268k272k4477J6430L771j1378Q693J7655
$$ 41470 30236 20605 1709 199 25557 36825 34553 10076 26506 30277 18899 27592 45247
26262D5247R457J5038l594k5237n6318q362k604k904J1004n145J712J7522O037
$$ 45247 54704 69742 66148 40911 -15407 -23769 -26373 -29277 -18273 -23418 -21706 -4184 1853
26249A853j620j1006J2578R710j3039n119j5438o546R885K0269m257j6754P467
$$ 1853 233 -10773 1805 11515 -1524 -6643 -22081 -28627 -18742 1527 -2730 -19484 -12017
26236a2017R110N519J5198K3057Q750p166j2616o057M10r428q618o090K40j663
$$ -12017 -2907 2612 17810 40867 49617 42451 29835 23778 24188 14760 6142 52 292 -1371
26222a371J1464n324n866L758j840J0990l592P545J9141j2753j8088j6802l932
$$ -1371 10093 4769 -1097 2661 821 11811 8219 15764 34905 22152 4064 -12738 -16670
26209a6670q616r058J7618R961J505j0691N166j5153L95l078J0488L0883K009
$$ -16670 -25286 -34344 -16726 -6765 -5260 -15951 -10785 -25938 -25543 -28621 -18133 12750 14759
26196A4759k1831j2030m92J4559j1259J2352j5707M582J6492j4537j9839J1392
$$ 14759 -7072 -19102 -19594 -5035 -16294 -3942 -19649 -15067 1425 -13112 -32951 -21559
26184b1559J4584k1081j2409O783L6255p116p754L28m135J534j7298q695L284
$$ -21559 -6975 -28056 -40465 -33682 2573 -4543 -12297 -11969 -16104 -14570 -31868 -40563 -37279
26171c7279m34L4551J886k9108j7282J4304m166N221J259L0617Q576j0367j8784
$$ -37279 -37713 -3162 -1276 -30384 -47666 -33362 -37528 -32307 -31048 -431 8145 -2222 -21006
26158b1006j8344J1901m879N063n713J5672M5106j165k0176j348j3007m141J0992
$$ -21006 -39350 -27449 -32328 -27265 -32978 -17306 27800 26635 6459 5111 -7896 -12037 -1045
26145a045j4165j1404L9191J9244r800o249j1384k1783k2746Q562J4398M051l52
$$ -1045 -15210 -26614 12577 31821 22021 15772 4388 -17395 -40141 -31579 -17181 -13130 -13482
26132a3482j2214M629k143j3477K0709J303L46J8776K9771j4714n967R81Q825
$$ -13482 -25696 -21067 -23210 -36687 -15978 -14675 -14329 4447 34218 19504 13537 14518 23343
26119B3343p701k0368p034r199J2503J3748J0849q505j3198J7637k8743q458Q709
$$ 23343 15642 -4726 -11760 -20959 -8456 5292 16141 7636 -5562 12075 -16668 -25126 -16417
26106a6417J9103R438P671M110j0086k87J920l0493k7737l494Q293j436K1176
$$ -16417 2686 12124 19795 23905 13819 13532 15452 -15041 -42778 -46272 -37979 -39415 -18239
26093a8239J4401j4958n16M609J3995m011l288J4596l024j9943k4869n814L4283
$$ -18239 -3838 -18796 -19312 -14703 -708 -4719 -8007 6589 3565 -16378 -41247 -47061 -12778
26080a2778j6626j7249J392J0952O46Q881l58J857l017j3693J0307M1312J368
$$ -12778 -29404 -46653 -45261 -34309 -33663 -24782 -25140 -23283 -26300 -39993 -29686 11626 12994
26067A2994k6514p470m603M744M068J185p528J4777q37K8323J505L804M470j6158
$$ 12994 -13520 -20990 -25593 -20849 -16781 -15596 -23124 -8347 -9184 19139 20644 24448 28918 12760
26053A2760l374k0782q331j3078Q580j2887J3702J3077J1481K240j3968k416p456
$$ 12760 9386 -11396 -19727 -32805 -24225 -37112 -23410 -10333 1148 3388 -10580 -12996 -20452
26040b0452K1667J3527m248k0592k7897q8l052J3512P978j3700R615J5932J0687
$$ -20452 1215 14742 10494 -10098 -37995 -38083 -41135 -27623 -19645 -33345 -23730 -7798 2889
26027B889P298M279l777k518j2536j003J3556P502j7116j2086L841R141J8711
$$ 2889 10187 14466 10689 8171 -4365 -5368 8188 15690 -1426 -13512 -9671 -530 18181
26014A8181k1305k1990n417K2460J0502P067R538l2195j8406j4528R696R935J7288
$$ 18181 -3124 -25114 -30531 -8071 2431 9498 19036 -13159 -31565 -46093 -36397 -26462 -9174
26001i174L124k275j217J1026J5185J6388k1671k1850j7692j0329J8292M7545
$$ -9174 -6050 -8325 -9542 1484 16669 33057 11386 -10464 -28156 -38485 -20193 27352
25989B7352N590l5957m90N353J4015M898r273J2696n605r599j9671J5822M200
$$ 27352 32942 -3015 -3505 1848 15863 20761 11488 24184 18579 8980 -10691 5131 9331
25976I331l419j6373k773P223j3113j709J968l376j6386J1292k929K1488J5688
$$ 9331 5912 -10461 -13234 -6011 -19124 -20833 -18865 -22241 -38627 -27335 -30264 -8776 6912
25963F912k290o272l1223N555K2402l202l651J055L355J2223R459k0708j500M848
$$ 6912 4622 -1650 -32873 -27318 -4916 -8118 -11769 -10714 -7359 4864 14323 -6385 -7885 -3037
25949c037k6700J638Q755J3206J1019M130j1265j7542j4000o442Q569K7884J4203
$$ -3037 -29737 -28099 -19344 -6138 4881 9011 -2254 -19796 -33796 -40238 -31669 -3785 10418
25936A0418J0177j2128j238l154j2828L309J7445J0265j1675j6612q177M86Q992
$$ 10418 20595 8467 7229 4075 -8753 -5444 12001 22266 10591 -6021 -14198 -13712 -4720
25923d720l203J4864J5716N223J924p73o467l847J8231J3871j420k3757r851j2840
$$ -4720 -7923 6941 22657 27880 29804 29031 22564 18717 36948 50819 49399 25642 15791 2951
25909B951K2406j8607k5233K2570L244k3730J0205L134j1292j3832L7561K8038
$$ 2951 25357 6750 -18483 4087 7331 -16399 -6194 -3060 -14352 -28184 9377 37415
25897C7415l0633k4727j142k4705p851J8152L0613P470J3125o783j9510n123j2269
$$ 37415 6782 -17945 -19087 -43792 -51643 -33491 -2878 4592 17717 10934 -8576 -13699 -25968
25884b5968j2788Q95j8508J9261K7979j0108l747P918R747j7145j0578q643J8125
$$ -25968 -38756 -37861 -56369 -37108 -9129 -19237 -22984 -15066 -5319 -22464 -33042 -41685 -23560
25871b3560J6652o690L911L99N291K5056r402m442J7079L71k3442K4394k1893
$$ -23560 -6908 -13598 -9687 -9288 -3997 21059 11657 7215 24294 24665 1223 25617 3724
25858C724m8390J0969J4275J4793K5950J2937j7867l0231j4646j490J1085M926
$$ 3724 -44666 -33697 -19422 -4629 21321 34258 16391 -13840 -28486 -29976 -18891 -13965
25846a3965N405K296j3324O201J0631J9153j2798r178k108l869p150J4027m973
$$ -13965 -8560 -6264 -19588 -13387 -2756 16397 3599 -5579 -7687 -11556 -18706 -4679 -9652
25833i652l476j7533J8810L2281J0010J2699R865K499m489k7326l0198n926R410
$$ -9652 -13128 -30661 -11851 20430 30440 43139 53004 55503 51014 23688 -6510 -12436 -3026
25820c026k6071j0930J7756K1431l688Q710J3085J1106L036j9177j0434J4988
$$ -3026 -29097 -40027 -22271 -840 -4528 4182 17267 28373 31409 12232 1798 16786
25808A6786Q301M736q562k5553J0045P933J054p947j3722j0500J145J2362k829
$$ 16786 25087 29823 21261 -4292 5753 13686 14740 6793 -6929 -17429 -16284 -3922 -6751
25795f751K3870J0511j1860j034O147j6643O214J3131J7651M880M54j7787j7596
$$ -6751 17119 27630 15770 14736 20883 4240 10454 23585 41236 46116 46570 28783 11187
25782A1187o722k6525M666M794J2342R608p361j198O290K291m198p251r377N050
$$ 11187 4465 -22060 -17394 -12600 -258 9350 1989 791 7081 9372 5174 -2077 -11454 -6404
25768f404N465J9154j481K979j4491j2312J3399J5233j4659k2618j1493r398J7280
$$ -6404 -939 18215 16734 19713 5222 -7090 6309 21542 6883 -15735 -27228 -36626 -19346
25755a9346J3355J6148J2700j7362j2781P83P824j1139r089k559l16Q29J4689
$$ -19346 -5991 10157 22857 5495 -7286 -6503 1321 -9818 -18907 -21466 -21782 -20953 -6264
25742f264n611Q048R224n135J2984k0711r789J0351n971n119L101N063M335j888
$$ -6264 -11875 -3827 5397 262 13246 -7465 -17254 -6903 -12874 -17993 -14892 -9829 -5494 -7382
25728g382o238J45P03N150Q696J8821k0441k544R162R495M378j2489j8051R86
$$ -7382 -13620 -13475 -12772 -7622 1074 19895 -546 -3090 6072 15567 19945 7456 -10595 -9609
25714i609J4645N224j4649P040n173j7740P260M128m182O44J4496k073j1197o56
$$ -9609 5036 10260 -4389 2651 -2522 -20262 -13002 -8874 -13056 -12412 2084 11 -11186 -11842
25700a1842r692J308P404J400n612J904n808M946N941j5095j6210J0639K2047
$$ -11842 -21534 -20226 -12822 -11422 -17034 -15130 -20938 -15992 -10051 -25146 -41356 -30717 -8670
25687h670K5411R114R364m125l2502l540K4587N567j0227j1871M415k9910k2726
$$ -8670 16741 25855 35219 31094 -1408 -4948 19639 25206 14979 3108 7523 -22387 -45113
25674d5113R901J0429k102j6178J2308J2852q882n224L788M318k1748r036K34
$$ -45113 -35212 -24783 -26885 -43063 -30755 -17903 -26785 -32009 -28221 -23903 -45651 -54687 -54453
25661e4453m019J7868L2448J3730p050m191J8605Q675l056j0059k4887R561L4234
$$ -54453 -58472 -40604 -8156 5574 -1476 -5667 12938 21613 18557 8498 -16389 -6828 27406
25648B7406j824j487P658k7855j9819j9315Q924L630o146L1518o532k1444J4900
$$ 27406 25582 24095 31753 3898 -15921 -35236 -26312 -22682 -28828 2690 -3842 -25286 -10386
25635a0386K0698j7097l974J1032j988K6597K971k8373j462J2160q87M613R691
$$ -10386 10312 -6785 -10759 273 -1715 24882 27853 -520 -1982 10178 9291 13904 23595
25622B3595j4674j5086n437J4847K2558p870k7343M339R918P043k628j5295K860
$$ 23595 8921 -6165 -11602 3245 25803 17933 -9410 -5071 4847 11890 9262 -6033 -3173
25609c173K8860K257j5777r211r008Q322M771j1409o224J6743p522j4471J2832
$$ -3173 25687 27944 12167 2956 -6052 2270 7041 -4368 -10592 6151 -1371 -15842 -3010
25596c010o669J0780j5869p429k307j9278N047J0925l918J045K6568J7718J9351
$$ -3010 -9679 1101 -14768 -22197 -24504 -43782 -38735 -27810 -31728 -30683 -4115 13603 32954
25583C2954j7207j8612r656Q861J4040j3807J7349m032p615K743P96o093J2905
$$ 32954 15747 -2865 -12521 -3660 10380 -3427 13922 9890 2275 5018 5814 -279 12626
25570A2626n843j4454Q240J3905k182P618J5051m275q578J2310j2254j34l747
$$ 12626 6783 -7671 569 14474 12292 19910 34961 30686 22108 34418 22164 22030 18283
25557A8283q578j0870J6743j1244m295J7221l553k1742k0714j1849p524K3639
$$ 18283 9705 -1165 15578 4334 39 17260 13707 -8035 -28749 -40598 -48122 -24483
25545b4483K8335K1487j281o764J530L691p921K354j7469j9019j9664M080j6702
$$ -24483 3852 25339 24058 17294 18824 22515 14594 16948 -521 -19540 -39204 -35124 -51826
25532e1826n040J1623J2698L907N869K1881J9614k7585j0751J8247J6974Q846
$$ -51826 -56866 -45243 -32545 -28638 -22769 -888 18726 -8859 -19610 -1363 15611 24457
25520B4457P837j445O672j1136j9292m436J929j1823k8930p700K9259N201l205
$$ 24457 32294 30849 37521 26385 7093 2657 4586 -7237 -36167 -43867 -14608 -9407 -12612
25507a2612M83J212l706J4572K5188k1140j9814m714J4113J076o840L789j0143
$$ -12612 -12129 -10917 -14623 -51 25137 3997 -15817 -20531 -6418 -5342 -12182 -8393 -18536
25494a8536k2160J6420L3663p165j5098J0999M17K0109q387M558m282k5597o650
$$ -18536 -40696 -24276 9387 2222 -12876 -1877 -1460 18649 10262 14820 10538 -15059 -21709
25481b1709K2636j373Q072p43j6459q621j0252k718J2878O649N446j3203J4756
$$ -21709 927 -446 7626 6883 -9576 -18197 -28449 -31167 -18289 -11640 -6194 -19397 -4641
25468d641l96m821J2620K3308J0201l2042k1866r58L888J740j0801k2291K2713
$$ -4641 -5037 -9858 2762 26070 36271 4229 -17637 -18595 -14707 -12967 -23768 -46059 -23346
25455b3346j893L718J1935r082J9329J3380k6881P821J6497j0542j6660J8535
$$ -23346 -25239 -21521 -9586 -18668 661 14041 -12840 -5019 11478 936 -15724 2811
25443B811p708o272R850L276o362N692N108M467J0109j9013k1551k964L0655K1862
$$ 2811 -4897 -11169 -1319 1957 -4405 1287 6395 10862 20971 1958 -19593 -22557 8098 29960
25429B9960q197j3236k1131j1938J198j7462n784n570J9313N4171Q159k5893j0859
$$ 29960 21763 8527 -12604 -24542 -23344 -40806 -46590 -52160 -32847 21324 29483 3590 -7269
25416g269o055Q50L035K9724j596j8675k7852o580J1647o27J3645m651j7138r12
$$ -7269 -13324 -12474 -9439 20285 18689 14 -27838 -34418 -22771 -23398 -9753 -14404 -31542 -32454
25402c2454J6236J106j7515R099L521J9906L283j2029N027Q306K0657N220j5647
$$ -32454 -16218 -15112 -32627 -23528 -20007 -101 3182 -8847 -3820 4486 25143 30363 14716
25389A4716J672r767l139k8967R494K3299J0718j0213p171M890m541j5737k0522
$$ 14716 16388 6621 3482 -25485 -15991 7308 18026 7813 642 5532 991 -14746 -35268
25376c5268j2192p929P345Q731N86r67J9865R633o257j3903O719J3172J993p056
$$ -35268 -47460 -55389 -48044 -39313 -38727 -39694 -19829 -10196 -16453 -30356 -23637 -10465 -8472 -15528
25362a5528P652J5250j6180K900N49k321J4442k553j6798p243K040j4180J1167
$$ -15528 -7876 7374 -8806 -5906 -5357 -7678 6764 4211 -12587 -19830 -17790 -31970 -20803
25349b0803J181j4347R739K3579K6441J3408j4576j2655r883r790k7377J524M2717
$$ -20803 -19622 -33969 -24230 -651 25790 39198 24622 11967 2084 -7706 -35083 -33559 9158
25336I158J4520k321n493j40N903q596p006J158j9118l0408k5228J8531J9795
$$ 9158 23678 21357 15864 15724 21627 13031 6025 7183 -11935 -42343 -67571 -49040 -29245
25323b9245J915J9560K96L520O632j2624j1289O041L3335M817k1634k3410m854
$$ -29245 -27330 -7770 -7474 -3954 2678 -9946 -21235 -15194 18141 22958 1324 -22086 -26940
25310b6940J5362K763j5795r642j4366j4858Q056K5487N089K2889J2626J2650
$$ -26940 -11578 -8815 -24610 -34252 -48618 -63476 -55420 -29933 -24844 -1955 10671 23321
25298B3321K682m936k4995j5151R397q076n282J0752J6003J6194k3872j9098j1382
$$ 23321 26003 21067 -3928 -19079 -9682 -17758 -23040 -12288 3715 19909 -3963 -23061 -34443
25285c4443J3609j293O801L1390K3923J660J1637N350j3829l0341j8179l46J4450
$$ -34443 -20834 -22127 -15326 16064 39987 41647 53284 58634 44805 14464 -3715 -4061 10389
25272A0389j0928q269k0578Q98J1252l309J0550J4401J0566K3538L892l929j536
$$ 10389 -539 -8808 -29386 -28488 -17236 -20545 -9995 4406 14972 38510 42402 38473 36937
25259C6937k3564l191r660l510j5962M493K3033J8644l1282j9190N816J7482J6840
$$ 36937 13373 10182 522 -2988 -18950 -14457 8576 27220 -4062 -23252 -17436 46 16886
25246A6886R446L532R784k777k6503k9987j6404o22K9832R039L647K3591L179
$$ 16886 26332 29864 39648 36871 10368 -19619 -36023 -36645 -6813 2226 5873 29464 32643
25233C2643j8831O238K4514k8414k7133Q490J1158o178P657K80m736M026j3036
$$ 32643 13812 20050 44564 16150 -10983 -2493 8665 2487 10144 10424 5688 9714 -3322
25220c322j519k25j287j4048m69L661K0137r240p628j2053j4773m376k998j81
$$ -3322 -4841 -5066 -6353 -20401 -20870 -17209 2928 -6312 -13940 -25993 -40766 -45142 -48140 -48321
25206d8321J0607J2285K0293J7467p003K1936J0677j6769k7877Q523q755r31J8971
$$ -48321 -37714 -25429 -5136 12331 5328 27264 37941 21172 -6705 1818 -6937 -7868 11103
25193A1103K0841L169j3692n219N641n947l515J950K965Q110l675O34J231l864
$$ 11103 31944 35113 21421 16202 21843 15896 12381 14331 17296 25406 21731 22365 23596 19732
25179A9732j3058o398R418P882J0251r583k9113r472j3075k1224j9179R361K7252
$$ 19732 6674 276 9694 17576 27827 18244 -10869 -20341 -33416 -54640 -73819 -64458 -37206
25166c7206J2484L3121J5368k4040N614l047o984m62J6872R048p201r455M56J1990
$$ -37206 -24722 8399 23767 -273 5341 2294 -4690 -5152 11720 20768 13567 4112 4568 16558
25152A6558j6066p846j6571K3859L194j7231p027j2069J5030j3913j6547R114
$$ 16558 492 -7354 -23925 -66 3128 -14103 -21130 -33199 -18169 -32082 -48629 -39515
25140c9515J6030J1499k4580j232J62j5332M6567L1543r703R498l248o223N292
$$ -39515 -23485 -11986 -36566 -37798 -37636 -52968 -6401 25142 15439 24937 21689 15466 20758
25127B0758R5o450O199m636R438Q453l27j3561k2553j127o402k302M718m842q830
$$ 20758 20853 14403 20602 15966 25404 33857 33530 19969 -2584 -3711 -10113 -12415 -7697 -12539 -21369
25112b1369M505r889k669J3148R747L475P848k713j6983O664k339o779O173N206
$$ -21369 -16864 -26753 -29422 -16274 -6527 -3052 4796 2083 -14900 -8236 -10575 -17354 -11181 -5975
25098e975j1179q498K6295J0046j5378j0253j3743l385J4270O175M974L4232J4533
$$ -5975 -17154 -25652 643 10689 -4689 -14942 -28685 -32070 -17800 -11625 -6651 27581 42114
25085D2114k3525j5474l160j493j0169N820J4138q568N137J2887K186q507l162
$$ 42114 18589 3115 -45 -1538 -11707 -5887 8251 -317 4820 17707 19893 11386 8224
25072H224j0811L189L877l168j1303j9137o997M212P573j8229p320L065R388J1959
$$ 8224 -2587 602 4479 1311 -9992 -29129 -36126 -31914 -24341 -42570 -49890 -46825 -37437 -25478
25058b5478J0289J9949k728j8942m60j0726J6814J6162L1870j6706j8319K409
$$ -25478 -15189 4760 2032 -16910 -17370 -28096 -11282 4880 36750 20044 1725 4134
25046D134K7027j1576P547O899O861k8777k7056K640Q200N30n035p251n037Q576
$$ 4134 31161 19585 27132 34031 40892 12115 -14941 -12301 -4101 -3571 -8606 -15857 -20894 -12318
25032a2318m706j1232p918J3627L21M011Q209p713p183N181j528m846m043j648
$$ -12318 -17024 -28256 -36174 -22547 -22226 -18215 -10006 -17719 -24902 -19721 -21249 -26095 -30138 -31786
25018c1786K966m266o740J1914J282o260k1336R565L2020J4886m438r517K0177
$$ -31786 -28820 -33086 -39826 -27912 -26630 -32890 -54226 -44661 -12641 2245 -2193 -11710 8467
25005H467j2064n938J1847K706K0462J6750l3232j6716q52K4717j5922j9615K945
$$ 8467 -3597 -9535 2312 5018 25480 42230 8998 -7718 -8570 16147 225 -19390 -16445
24992a6445J0963k964l440r09K4960J7373J930j459k7675k9201j5221J4563K6234
$$ -16445 -5482 -8446 -11886 -12795 12165 29538 31468 30009 2334 -26867 -42088 -27525 -1291
24979a291K0379j6761K4478j006j5692j9899j1440q724K1340J8680l694j831l199
$$ -1291 19088 2327 26805 25799 10107 -9792 -21232 -29956 -8616 10064 6370 4539 1340
24966A340l7j3158j5350J7607L13J5991J1825k1804k7795M343K4812j1019k4765
$$ 1340 1303 -11855 -27205 -9598 -9285 6706 18531 -3273 -31068 -26725 -1913 -12932 -37697
24953c7697J921O147j3289J4148K3536j7844K1357L748r757k898j4597k267J814
$$ -37697 -35776 -29629 -42918 -28770 -5234 -23078 -1721 2027 -7730 -10628 -25225 -27492 -25678
24940b5678K5238J9077j7922j5415j2871k6758K032J629J2372J3899r740p227
$$ -25678 -440 18637 715 -14700 -27571 -54329 -52297 -50668 -38296 -24397 -34137 -41364
24928d1364K2745R625k900K4213o996p685K3305J2875j2567k601k0931O055K5370
$$ -41364 -18619 -8994 -11894 12319 5323 -2362 20943 33818 21251 18650 -2281 3774 29144
24915B9144n213m9095k0991K0306R763l304j5362p55L374n314J8682J1961j2695
$$ 29144 23931 -25164 -46155 -25849 -16086 -19390 -34752 -35507 -32133 -37447 -18765 -6804 -19499
24902a9499j590j1054J2263J1811j7351J8766q107J2475k562p84n10j4631k356
$$ -19499 -21089 -32143 -19880 -8069 -25420 -6654 -14761 -2286 -4848 -5632 -6142 -20773 -23129
24889b3129j636Q090K3041J5615j8109k2127K4758q878J1486N04n814N88O220
$$ -23129 -24765 -16675 6366 21981 3872 -18255 6503 -2375 9111 9615 3801 4389 10609
24876A0609j8095K0293L118K916M502k2024J772L3045N549p157J7847L7347j3367
$$ 10609 -7486 12807 15925 18841 23343 1319 3091 36136 41685 34528 52375 89722 76355
24863G6355l7895j0396N088k6266m5350j8850p831K5033K4714K0190r87K697M656
$$ 76355 38460 28064 33152 6886 -38464 -57314 -65145 -40112 -15398 4792 3805 6502 11158
24850A1158K527j2301M534j0865k512N094K8522J127j3613j7498k2030n424q005
$$ 11158 13685 1384 5918 -4947 -7459 -2365 26157 27284 13671 -3827 -25857 -31281 -39286
24837c9286J7484K7425J0554o011n055j5214J6642P153r412J090p102k68k95M08
$$ -39286 -21802 5623 16177 10166 5111 -10103 6539 13692 4280 5370 -1732 -2000 -2295 -1887
24823a887J5933K763j0381n393Q349k5761j2542J7091L2079K561j636L374o490
$$ -1887 14046 16809 6428 1035 9384 -16377 -28919 -11828 20251 22812 21176 24550 18060
24810A8060k674J0485J4856n88k688m951j096j0426J856k1387L720K411q200j5076
$$ 18060 15386 25871 40727 40139 37451 32500 31404 20978 22834 1447 5167 7578 -622 -15698
24796a5698p733J4666K1612N528k026K557q166k5708J720R628q424J7205J1816
$$ -15698 -23431 -8765 12847 18375 16349 18906 10740 -14968 -13248 -3620 -12044 5161 16977
24783A6977l4377k2767P221j011n400J7293J5524j4673O216K1756J6574L681j3587
$$ 16977 -17400 -40167 -32946 -33957 -39357 -22064 -6540 -21213 -14997 6759 23333 27014 13427
24770A3427k4152j7176K222L938J5350R100o145J0198Q305q071k2087Q206P966
$$ 13427 -10725 -27901 -25679 -21741 -6391 2709 -3436 6762 15067 6996 -15091 -6885 1081
24757A081J3528j0410j0492l844J1632K6927Q57k0195QR702r774p907l970L164
$$ 1081 14609 4199 -6293 -10137 1495 28422 29279 9084 9092 18794 9020 1113 -2857 307
24743C07j887K95J9271j795K468K502J900N870k1392j4602K148R922Q7l535m856
$$ 307 -1580 -1285 17986 16191 18659 21161 23061 28931 7539 -7063 -4915 5007 5094 1559 -3297
24728c297J553R984l19R517K274o908k1569p106O115K0093K950k1598J8687J2637
$$ -3297 -1744 8240 7921 17438 19712 12804 -8765 -15871 -9756 10337 13287 -8311 10376 23013
24714B3013k6355k5658n33J6403K195j5743q455K5495K0503J3300j7013p954r203
$$ 23013 -3342 -29000 -29533 -13130 -10935 -26678 -35133 -9638 10865 24165 7152 -802 -10005
24701a0005l316N495p216k4418K0411j8180K824K1675j3790k4703O313K7136K746
$$ -10005 -13321 -7826 -15042 -39460 -19049 -37229 -34405 -12730 -26520 -51223 -44910 -17774 -15028
24688a5028P930K8880j2896j2971J0557R075j3617l9882j709L281J3960R222O34
$$ -15028 -7098 21782 8886 -4085 6472 15547 1930 -37952 -39661 -36380 -22420 -13198 -12564
24675a2564J1867j6887m434K85k1682K4134L7733J767j2040R781L48j0029P956
$$ -12564 -697 -17584 -22018 -21733 -43415 -19281 18452 20219 8179 17960 18308 8279 16235
24662A6235J504k8908j5465N202L847J1795j7715J8172K2075K109l263j6354j0251
$$ 16235 17739 -11169 -26634 -21432 -17585 -5790 -23505 -5333 16742 18851 15588 -766 -11017
24649a1017J7292p84j9185j0409J718k418l497q75q168k24J1965K1761J836j571
$$ -11017 6275 5491 -13694 -24103 -22385 -24803 -28300 -29175 -37343 -37567 -25602 -3841 -2005 -3576
24635c576l1J6571K18k0501k481q333l452L0932K5087o339k046k7268j5723J5257
$$ -3576 -3607 12964 13182 -7319 -9800 -18133 -21585 9347 34434 28095 26049 -1219 -16942 -1685
24621a685j1496j1448J171M770k581j1250j0735J6612M324j125n6J5979p705p453
$$ -1685 -13181 -24629 -23458 -18688 -21269 -32519 -43254 -26642 -22318 -23443 -23499 -7520 -15225 -22678
24607b2678J9875K8026j2441k4773j8327L494J7690J3524m54k2707J576L2084
$$ -22678 -2803 25223 12782 -11991 -30318 -26824 -9134 4390 3936 -18771 -17195 14889
24595A4889O083l1005o248N894J6455L668j3897k3879j3737J8361J4943j5303
$$ 14889 20972 -10033 -16281 -10387 6068 9736 -4161 -28040 -41777 -23416 -8473 -23776
24583b3776r822J8311R200r534j2306Q064J698L9220J3047K3472r527k1710j8444
$$ -23776 -33598 -15287 -6087 -15621 -27927 -19863 -18165 21055 34102 57574 48047 26337 7893
24570G893o486J1220l98j970k7295k4679J3639J2067J088l842J0382J6025J1777
$$ 7893 1407 12627 12229 10259 -17036 -41715 -28076 -16009 -14921 -18763 -8381 7644 19421
24557A9421l319l7153Q441K724j2808Q128K607Q498M776J1258J2605j7244j2513
$$ 19421 16102 -21051 -12610 -9886 -22694 -14566 -11959 -3461 1315 12573 25178 7934 -4579
24544d579m735j966N226n954k1138O875L723J0120Q26m214J9003l751l626j5632
$$ -4579 -9314 -11280 -6054 -12008 -33146 -26271 -22548 -12428 -11602 -15816 3187 -564 -4190 -19822
24530a9822j0111L794J3074J869K533R321P095J4270K785K795m4157j7672K3906
$$ -19822 -29933 -26139 -13065 -11196 -8663 658 7753 22023 24808 27603 -16554 -34226 -10320
24517a0320L717j2944k933j0892J0799J032n521J2773K1421j745O321M208n621
$$ -10320 -6603 -19547 -22480 -33372 -22573 -21541 -27062 -14289 7132 5387 11708 15916 10295
24504A0295k3638J0538K0473J0429M674m541J720j0943j3273J3986j117k775q11
$$ 10295 -13343 -2805 17668 28097 32771 28230 29950 19007 5734 19720 18603 15828 15017
24491A5017j3670n426m528q01j3468J3043M3258l090j2902j1699q171J4043m312
$$ 15017 1347 -4079 -8607 -9408 -22876 -9833 33425 30335 17433 5734 -2437 11606 7294
24478G294m153j3177M412L134j3116J3164N521J991P16o694q944J1317o154q053
$$ 7294 3141 -10036 -5624 -2490 -15606 -2442 3079 5070 5786 -908 -9852 1465 -4689 -12742
24464a2742K62J2769R718j261J0606p62R676r224j9372j4931K38J1690q513M775
$$ -12742 -12480 289 10007 8746 19352 18590 28266 19042 -330 -15261 -15023 -3333 -11846 -7071
24450g071k3570J9594L1957j8174n642j1119l8222K273J5836J9904J8352J3128
$$ -7071 -30641 -11047 20910 2736 -2906 -14025 -52247 -49974 -34138 -14234 4118 17246
24438A7246J6208q937j866M652r764j4244Q479K5669j5381j1222r238n752n582
$$ 17246 33454 24517 22651 27303 17539 3295 11774 37443 22062 10840 1602 -4150 -9732
24425i732r039j6776j2949K302J6317L707J8520J2410J233j4846j1620P948P331
$$ -9732 -18771 -35547 -48496 -46194 -29877 -26170 -7650 4760 5993 -8853 -20473 -12525 -5194
24412e194K35o77J3967J9388J6791J2139j5654k7923l071J8249K910j4548o619
$$ -5194 -4959 -5636 8331 27719 44510 56649 40995 13072 10001 28250 31160 16612 9993
24399I993Q59k4610o920P244j0756k714j5189L693J7059L848R119n175k0120q499
$$ 9993 10852 -13758 -20678 -13434 -24190 -26904 -42093 -38400 -21341 -17493 -8374 -13549 -33669 -42168
24385d2168J2992n321J4495j342l188J1546J7390j04k2219j3752M163m80j5454
$$ -42168 -29176 -34497 -20002 -21344 -24532 -12986 4404 4300 -17919 -31671 -27508 -27988 -43442
24372d3442l31R970O632n06j6696N133K5870J5700j358q213Q022k02j4442j2547
$$ -43442 -43773 -33803 -27171 -27677 -44373 -39240 -13370 2330 972 -7241 781 579 -13863 -26410
24358b6410J6711j411k295J9797R83K857Q383k1122k1614N962L980q939j0433
$$ -26410 -9699 -11110 -13405 6392 7375 10232 18615 -2507 -24121 -18159 -14179 -23118 -33551
24345c3551K1675K3494m819P075l465j3491j3020R40R900K61K0196L927q08K6447
$$ -33551 -11876 11618 6799 13874 10409 -3082 -16102 -15162 -5262 -5001 15195 19122 18314 44761
24331D4761j8235j334j0038k7543j1257J3391J1176J9428J8916L028r641r012
$$ 44761 26526 25192 15154 -12389 -23646 -10255 921 20349 39265 42293 32652 23640
24319B3640j1655j8762j2310o971Q588J3073Q613J5417o169j7097K296L576J1098
$$ 23640 11985 -6777 -19087 -26058 -17470 -4397 4216 19633 13464 -3633 -1337 2239 13337
24306A3337J5553j0138r129o403k0478m319m426J4242J7074K197k0661K3826J7853
$$ 13337 28890 18752 9623 3220 -17258 -21577 -26003 -11761 5313 7510 -13151 10675 28528
24293B8528j0352r596k5443j5925l607J4373k015p920J1726o175l0044j7335R212
$$ 28528 18176 8580 -16863 -32788 -36395 -22022 -24037 -31957 -20231 -26406 -56450 -73785 -64573
24280f4573J1742J4493Q034p727Q425Q126j005Q114J3153j2919j8367k283L3336
$$ -64573 -52831 -38338 -30304 -38031 -29606 -21480 -22485 -14371 -1218 -14137 -32504 -34787 -1451
24267a451L1970P538P13l5508j5129J7527m917K421J1445M09k5908J099L27J5274
$$ -1451 30519 38057 38770 3262 -11867 5660 743 3164 14609 15018 -10890 -9791 -9464 5810
24253E810j1452j8395J5120M3402j376j40l371J101j0964j7933j4441k0335J4477
$$ 5810 -5642 -24037 -8917 34485 33109 32969 29598 30699 19735 1802 -12639 -32974 -18497
24240a8497o25J8445j5116r585Q534l3997m332O653K1766K934Q394J5164J5040
$$ -18497 -19122 -677 -15793 -25378 -16844 -50841 -55173 -48520 -26754 -23820 -15426 -262 14778
24227A4778Q995k7111m7646r193J5632Q663J5623L1581j0945m880k118p242R399
$$ 14778 23773 -3338 -50984 -60177 -44545 -35882 -20259 11322 377 -4503 -6621 -13863 -4464
24214d464K7941J79j3273j6530j6524K1285J1418j4062P634Q748N032l393m33
$$ -4464 23477 23656 10383 -6147 -22671 -1386 10032 -4030 3604 12352 17384 13991 13558
24201A3558k549o654O782l4225n980j5022J514J5360K0568J2149o103K782j3610
$$ 13558 11009 4355 11137 -23088 -29068 -44090 -42576 -27216 -6648 5501 -602 2180 -11430
24188a1430P080K4448n935M89j8967j4954O36J4703J5846k1171O607p323o424
$$ -11430 -4350 20098 14163 14652 -4315 -19269 -18633 -3930 11916 -9255 -2648 -9971 -16395
24175a6395P698J1791M945J2123o224j7662O414K7224r064k6023l56m641K5629
$$ -16395 -8697 3094 8039 20162 13938 -3724 2690 29914 20850 -5173 -5529 -10170 15459
24162A5459P757N280l538p014j6463j4228J67J4757J9959O786j4766j2752K926
$$ 15459 23216 28496 24958 17944 1481 -12747 -12580 2177 22136 28922 14156 1404 4330
24149D330J0115J3736j6879N275j3008j1840o900j4298P048J7989J3232j4963
$$ 4330 14445 28181 11302 16577 3569 -8271 -15171 -29469 -22421 -4432 8800 -6163
24137f163m266k375m981J3874J379p200k5209J9753l825j7633K5187K0429J6235
$$ -6163 -10429 -12804 -17785 -3911 -2532 -9732 -34941 -15188 -19013 -36646 -11459 8970 25205
24124B5205r797k130L999J6379o493j5278k4213m159J458L551K0878Q804j2764
$$ 25205 15408 13278 17277 33656 27163 11885 -12328 -16487 -15029 -11478 9400 18204 5440
24111E440J2536J2089o144O674J0651p528j3145j3757K2394R783r961J289l417
$$ 5440 17976 30065 23921 30595 41246 33718 20573 6816 29210 38993 29032 30321 26904
24098B6904p747j7177j1289l813m018J2589J4081m908j3405j7351R049J0077L6016
$$ 26904 19157 1980 -9309 -13122 -17140 -4551 9530 4622 -8783 -26134 -17085 -7008 29008
24085B9008n498l1503k660m528j4305J0127Q048O054Q052J9164L1988q073j4054
$$ 29008 23510 -7993 -10653 -15181 -29486 -19359 -11311 -5257 2795 21959 53947 45874 31820
24072C1820l4854j7865J8914l450O008J0429K158j1143K659J5429j3784r278j8399
$$ 31820 -3034 -20899 -1985 -5435 573 11002 13160 2017 4676 20105 6321 -2957 -21356
24059b1356K964J7887j0822O26K005j512J8672L537j496k346k2233j6482J0558
$$ -21356 -18392 -505 -11327 -10701 -8696 -10208 8464 12001 10505 8159 -14074 -30556 -19998
24046a9998k304L877j1031K6945J9060j4232p517L4137J8124l983j5056j5865
$$ -19998 -22302 -18425 -29456 -2511 16549 2317 -5200 28937 47061 43078 28022 12157
24034A2157j4664j6174p860J3605M738K6113M412J1587P29O490O9k1436k2819
$$ 12157 -2507 -18681 -26541 -12936 -8198 17915 22327 33914 34643 41133 41202 19766 -3053
24021c053j0823J5050M035k1619k5308L259K4172J4627L228j5751j1533K6919
$$ -3053 -13876 1174 5209 -16410 -41718 -38459 -14287 340 3568 -12183 -23716 3203
24009C203J0089q016N692k445j7476m450J9113R079k7811j3834J5640L0479K219
$$ 3203 13292 5276 10968 8523 -8953 -13403 5710 14789 -13022 -26856 -11216 19263 21482
23996B1482k3181k6553l1186L593K6802L4130O887k9981j1594o935P173K373O912
$$ 21482 -1699 -28252 -59438 -55845 -29043 5087 11974 -18007 -29601 -36536 -29363 -26990 -20078
23983b0078J6665r92j613P115r76P942R193K142k0961p332Q056k1917Q676R725
$$ -20078 -3413 -4405 -6018 1097 121 8063 17256 19398 -1563 -8895 -839 -22756 -14080 -4355
23969d355J8199q353R110O975R324j0743r909l4654q804K5317J8243j510o726
$$ -4355 13844 5491 14601 21576 30900 20157 10248 -24406 -33210 -7893 10350 8840 2114
23956B114M411P54J9485l1697j9573o314K4606j141M816n923O521J6722M986j0688
$$ 2114 6525 7279 26764 -4933 -24506 -30820 -6214 -7355 -2539 -8462 -1941 14781 19767 9079
23942I079q106R179q98M824J7492k432j9193j5000m452K927r960K731R565j3060
$$ 9079 973 10152 9254 14078 31570 29138 9945 -5055 -9507 -6580 -16540 -13809 -4244 -17304
23928a7304q146N397k998p92j3937J7496K8082j99k1035K837n500J086K5797j993
$$ -17304 -25450 -20053 -23051 -23843 -37780 -20284 7798 7599 -13436 -10599 -16099 -15013 10784 8791
23914H791M173N743l500j302j7622j7133M348J5116j3592K745K1568j1591n000
$$ 8791 12964 18707 15207 13905 -3717 -20850 -16502 -1386 -14978 -12233 9335 -2256 -7256
23901g256J0522J6607K0026k8381k2387q787p04p289l270K2342L876O171j1364
$$ -7256 3266 19873 39899 11518 -10869 -19656 -20360 -27649 -30919 -8577 -4701 1470 -9894
23888i894Q052n515j5969N136J6315j4058J1241M585j0202J4546J1073o084j2918
$$ -9894 -1842 -7357 -23326 -18190 -1875 -15933 -4692 -107 -10309 4237 15310 9226 -3692
23875c692k498j4312j150J3454J6976Q230J946j3956Q526N691k5395k3326J897
$$ -3692 -6190 -20502 -21652 -8198 8778 17008 18954 4998 13524 19215 -6180 -29506 -27609
23862b7609K894J1085J7411j6886K2913J2842K4029j6782m1776K406J6042J0348
$$ -27609 -24715 -13630 3781 -13105 9808 22650 46679 29897 -11879 -9473 6569 16917
23850A6917p906k0687j4795L291K9472P571n332j2304r34K751j2254j2240K4888
$$ 16917 9011 -11676 -26471 -23180 6292 13863 8531 -3773 -4707 -1956 -14210 -26450 -1562
23837a562n683j3762m34K2905n638r527J8145Q524m693j2934o542n159j2527P078
$$ -1562 -7245 -21007 -21441 1464 -4174 -13701 4444 12968 8275 -4659 -11201 -16360 -28887 -21809
23823b1809O49o17K6543K1976k104m660R663Q578o330j6013j0649N95n200R800
$$ -21809 -21160 -21777 4766 26742 24638 19978 29641 38219 31889 15876 5227 5822 622 10422
23809A0422j3625m024K1781J0258k1733l0993o974J3747L368j5360n5K4441k01
$$ 10422 -3203 -7227 14554 24812 3079 -27914 -34888 -21141 -17773 -33133 -33188 -8747 -8948
23796h948n947L51J232L908Q856P526m866P603J829j7355l577p055Q995j3484
$$ -8948 -14895 -14544 -13312 -9404 -548 6978 2112 9715 11544 -5811 -9388 -16443 -7448 -20932
23782b0932R720L5336j673n186j5543l278P294K1954p634l205R049J284j007o06
$$ -20932 -11212 24124 22451 17265 1722 -1556 5738 27692 20058 16853 25902 27186 26179 25573
23768B5573K078j6271j7720P800k777J002M993j4631p357J3458r147J2140J3328
$$ 25573 27651 11380 -6340 1460 -1317 -315 4678 -9953 -17310 -3852 -12999 -859 12469
23755A2469j0114n156j2677j0107J5376K3803M845q883j7277l294L2496J508J289
$$ 12469 2355 -2801 -15478 -25585 -10209 13594 18439 9556 -7721 -11015 21481 22989 24278
23742B4278R799p224j4162n671M759j4143K727J4580P228j6523m613O536K0159
$$ 24278 34077 26853 12691 7020 11779 -2364 363 14943 22171 5648 1035 7571 27730
23729B7730J5663p424j0839m231K1739r562l6108j7363J2161K8590K1646J1310
$$ 27730 43393 35969 25130 20899 42638 33076 -3032 -20395 -8234 20356 42002 53312
23717E3312n453m7367j6909j0378J61K3227O530k4424p523J218j156R574M373
$$ 53312 47859 492 -16417 -26795 -26634 -3407 3123 -21301 -28824 -27606 -28762 -19188 -14815
23704a4815J3104r989J4679j566k4908o826k8234K898R434L0563j1135P014J4175
$$ -14815 -1711 -11700 2979 1413 -23495 -30321 -58555 -55657 -46223 -15660 -26795 -19781 -5606
23691e606J8294j252k8600K888J0140n457R786R697j918p177o526M660J386K549
$$ -5606 12688 11436 -17164 -14276 -4136 -9593 193 9890 7972 795 -5731 -1071 315 2864
23677B864m667j7783K139K7532J0221J5826J7244j1578j5130j7168K333L811M721
$$ 2864 -1803 -19586 -17447 10085 20306 36132 53376 41798 26668 9500 11833 15644 20365
23664B0365o662q908k6110j1424m995K6423J0481R169n160k0011M154K2466o209
$$ 20365 13703 4795 -21315 -32739 -37734 -11311 -830 8339 3179 -16832 -12678 9788 3579
23651C579k7905P024L8115j4240l0483J907N724K0507j1153k3203J1445N7146
$$ 3579 -24326 -17302 20813 6573 -23910 -22003 -16279 4228 -6925 -30128 -18683 38463
23639C8463J1242k5729m082j9148J090J1428J7601k336j1490j9753m343L565Q533
$$ 38463 49705 23976 19894 746 1836 13264 30865 28529 17039 -2714 -7057 -3492 5041
23626E041k0586j3753J4283q422R129K9247m566m117q277L659m770K3283J7308
$$ 5041 -15545 -29298 -15015 -23437 -14308 14939 10373 6256 -2021 1638 -3132 20151 37459
23613C7459r259L467O602L480j2275j6845j4438o836l09J980N706j6562r47K6565
$$ 37459 28200 31667 38269 41749 29474 12629 -1809 -8645 -8954 -6974 -1268 -17830 -18777 7788
23599G788l305l0994j0643m843j0330L840M380J1878P982j3033R539L6912K5747
$$ 7788 4483 -26511 -37154 -41997 -52327 -48487 -44107 -32229 -24247 -37280 -27741 9171 34918
23586C4918p371q598j6031k8360o3J2632j5214J0839J2932o631O196L8695p760
$$ 34918 27547 18949 2918 -25442 -25505 -12873 -28087 -17248 -4316 -10947 -4751 33944 26184
23573B6184m548j3359o723J050J294J6018l758k7796j3185j6666K6978q954j1570
$$ 26184 21636 8277 1554 2604 3898 19916 16158 -11638 -24823 -41489 -14511 -23465 -35035
23560c5035k850j2413J613K4429N164L976l417k3311j1368k77L5788j1347Q291
$$ -35035 -37885 -50298 -48685 -24256 -19092 -15116 -18533 -41844 -53212 -53489 -17701 -29048 -20757
23547b0757O080P528j0495j8216k726R102L312j0387P271K478j1662m774K8779
$$ -20757 -14677 -7149 -17644 -35860 -38586 -29484 -26172 -36559 -29288 -26810 -38472 -43246 -14467
23534a4467L1255m900j1111j6009L2971J4147j1128j3191J2914N869j343o573
$$ -14467 16788 11888 777 -15232 17739 31886 20758 7567 20481 26350 25007 18434
23522A8434q786m411j4493j6666J4544K4574n946P31o877k489M994k1008J8108
$$ 18434 9648 5237 -9256 -25922 -11378 13196 7250 7981 1104 -1385 3609 -17399 709
23509G09N755j4984J2867O589k1474j5392J00M192J7686m879j1659J1827K139
$$ 709 6464 -8520 4347 10936 -10538 -25930 -25830 -21638 -3952 -8831 -20490 -8663 -6524
23496f524O512J2729P460J0490j032j3619k3571k7654J5068J2082o089J4479K6674
$$ -6524 -12 12717 20177 30667 29635 16016 -7555 -35209 -20141 -8059 -14148 331 27005
23483B7005k1230r594j7548K0855j7607O780J0791j1555L817J2003J3887K5445
$$ 27005 5775 -3819 -21367 -512 -18119 -11339 -548 -12103 -8286 3717 17604 43049
23471D3049q691k7054j5550k155K862L72L178j2117p462j6406j3183J6624j1985
$$ 43049 34358 7304 -8246 -10401 -7539 -7167 -3989 -16106 -23568 -39974 -53157 -36533 -48518
23458d8518q40R695O570j5653N135J7609J0644J63J1855O68r236N776k0785L5208
$$ -48518 -49358 -39663 -33093 -48746 -43611 -26002 -15358 -15195 -3340 -2672 -11908 -6132 -26917 8291
23444H291M3156k316k4349l488k5900j1516M320J6571J1057N309k020J041j9945
$$ 8291 51447 49131 24782 21294 -4606 -16122 -11802 4769 15826 21135 19115 20156 211
23431B11j4307o771k428K1335j1627j7487q524K8102N628j9307J2424P65o877
$$ 211 -14096 -20867 -23295 -1960 -13587 -31074 -39598 -11496 -5868 -25175 -12751 -11986 -18863
23418a8863J4025J1980n456k467m049k2420k88K8538J962K041N930k593p247m313
$$ -18863 -4838 7142 1686 -781 -4830 -27250 -27538 1000 2962 5003 10933 8340 1093 -3220
23404c220q931J3772k8820j277K9070J1346P975r095K3400j4011o831J879O760
$$ -3220 -12151 1621 -27199 -28476 594 11940 19915 10820 34220 20209 13378 15257 22017
23391B2017J548j2874N666J4636n055o941j6342q676j4510r343L1465K020J202
$$ 22017 23565 10691 16357 30993 25938 18997 2655 -6021 -20531 -29874 1591 3611 4813
23378D813K1184Q033J4897r924j0663j2088j1820J0517Q444j8076p062j475K5454
$$ 4813 25997 34030 48927 39003 28340 16252 4432 14949 23393 5317 -1745 -3220 22234
23365B2234J162o426K725Q677K207j125L571j7880j9082O05K985j2559n747q012
$$ 22234 23396 16970 19695 28372 30579 29454 33025 15145 -3937 -3332 -347 -12906 -18653 -26665
23351b6665j704j623k5J7028O229p780n554J5475m285q79l426J6794J9077j5610
$$ -26665 -28369 -29992 -30017 -12989 -6760 -14540 -20094 -4619 -8904 -9783 -13209 3585 22662 7052
23337G052O412N655J1972N011m15J3068j2022k9769k4093j0913N996K7192R792
$$ 7052 13464 19119 31091 36102 35687 48755 36733 6964 -17129 -28042 -22046 5146 14938
23324A4938K5612o453k7753j9145O845L3834J4780l417q989K813o778j7479R349
$$ 14938 40550 34097 6344 -12801 -5956 27878 42658 39241 30252 33065 26287 8808 18157
23311A8157J1177j1144K434l027k1741l888J1531M644J0320N391k9209j8015J9294
$$ 18157 29334 18190 20624 17597 -4144 -8032 3499 8143 18463 23854 -5355 -23370 -4076
23298d076j488r405j4142P501J6799k295k068R112j5491p352K153o006K0658J6696
$$ -4076 -5564 -14969 -29111 -21610 -4811 -7106 -9174 -62 -15553 -22905 -20752 -26758 -6100 10596
23284A0596r424K605J641j6136J7815J2212m527j586J1316O484k0080k4827M202
$$ 10596 1172 3777 5418 -10718 7097 19309 14782 13196 24512 30996 10916 -13911 -9709
23271i709J3814O289J5112k746r242r80j9485k3083j8868k085J1747K1384J1121
$$ -9709 4105 10394 25506 22760 13518 12538 -6947 -30030 -48898 -50983 -39236 -17852 -6731
23258f731K1632J7225O522j3128j0586j1819p611J1055R261L962J642J7517k994
$$ -6731 14901 32126 38648 25520 14934 3115 -4496 6559 15820 19782 21424 38941 35947
23245C5947j4562k3010k6962p585J5558P506K9767m255N288L814m662P775J308
$$ 35947 21385 -1625 -28587 -36172 -20614 -13108 16659 12404 17692 21506 16844 24619 25927
23232B5927n822j5053P722n807k0735J1766N607K2875M343P872q464p154k1158
$$ 25927 20105 5052 12774 6967 -13768 -2002 3605 26480 30823 38695 30231 23077 1919
23219A919q340q879k2855L492J7280M0010J1301k1221k3268p290r730N887N698
$$ 1919 -6421 -15300 -38155 -34663 -17383 22627 33928 12707 -10561 -17851 -27581 -21694 -15996
23206a5996n916J7729k262M739J6925O940j2791l4319r105L0847K691J0483K5311
$$ -15996 -21912 -4183 -6445 -1706 15219 22159 9368 -24951 -34056 -3209 -518 9965 35276
23193C5276q708J6446j2502k4025j9880l467J4593j2898k5278P016J6095N139
$$ 35276 26568 43014 30512 6487 -13393 -16860 -2267 -15165 -40443 -33427 -17332 -12193
23181a2193J386m810L163J5523M682K634p082p579L201p224N892j2559J050J5966
$$ -12193 -10807 -15617 -12454 3069 7751 10385 3303 -4276 -1075 -8299 -2407 -14966 -13916 2050
23167B050k6691r180K8000K8691q422p388q808R976q437k0824l98K587L830m611
$$ 2050 -24641 -33821 -5821 22870 14448 7060 -1748 8228 -209 -21033 -21431 -18844 -15014 -19625
23153a9625R198j4690j4452R875K0916k9160k2080r194J1699L2311J6456J0783
$$ -19625 -10427 -25117 -39569 -29694 -8778 -37938 -60018 -69212 -57513 -25202 -8746 2037
23141B037K61k890k4511m549J0075K7152J5485J3549j6560n514J3345j4502j1458
$$ 2037 2298 -592 -25103 -29652 -19577 7575 23060 36609 20049 14535 27880 13378 1920
23128A920K2602K104M46p684k7712J4661P593O46j6584r121M39P33n012L9769
$$ 1920 24522 26626 27072 19388 -8324 6337 13930 14576 -2008 -11129 -10690 -9957 -14969 24800
23114B4800K560j5182l968l211M149p49k6896j4355J6708J6130J7956L1132J8008
$$ 24800 27360 12178 8210 4999 9148 8399 -18497 -32852 -16144 -14 17942 49074 67082
23101F7082j8666m6373k4115L53j9163m26p622m945L6862J8820o833K611O937
$$ 67082 48416 2043 -22072 -21719 -40882 -41308 -48930 -53875 -17013 1807 -5026 -2415 4522
23088D522q317K918j9382J427R808K522j9830J385J277m591N505J369J0822O125
$$ 4522 -3795 -877 -20259 -18832 -9024 -6502 -26332 -24947 -23670 -28261 -22756 -21387 -10565 -4440
23074d440n247n23K567L338J4442J1362L409k2721k5568J3490L917k8343j107
$$ -4440 -9687 -10210 -7643 -4305 10137 21499 24908 2187 -23381 -9891 -5974 -34317 -35424
23061c5424P212m470q948M591K3054M393J3923l675j5110j2645L5802J4469k5985
$$ -35424 -28212 -32682 -41630 -37039 -13985 -9592 4331 656 -14454 -27099 8703 23172 -2813
23048b813k381J7678j0948j3198p922p333N746K1690R779p311m34J1398j7827
$$ -2813 -5194 12484 1536 -11662 -19584 -26917 -21171 519 10298 2987 2553 13951 -3876
23035c876j1500K1701j881j693n767j6296J8072J5470K0400k862n500p968N33
$$ -3876 -15376 6325 4444 2751 -3016 -19312 -1240 14230 34630 31768 26268 18300 18833
23022A8833l92n002k206P431j4481N824p906j8034O834M80L955l866j578K5397
$$ 18833 18441 13439 11233 18664 4183 10007 2101 -15933 -9099 -8619 -4664 -8530 -10108 15289
23008A5289J2043p475k8661K3075L187Q91p559P536o556n083j2623j3369N516
$$ 15289 27332 19857 -8804 14271 17458 18349 10790 18326 11770 6687 -5936 -19305 -13789
22995a3789L830K63J7187L05k3475l4388p346K9226L0736j945j1599K843k2212
$$ -13789 -9959 -9696 7491 7796 -15679 -50067 -57413 -28187 2549 604 -10995 -8152 -30364
22982c0364Q488L338k95K6385m048J4425M083j7170j0446J1828M134j36k1796
$$ -30364 -21876 -18538 -18833 7552 3504 17929 22012 4842 -5604 6224 10358 10222 -11574
22969a1574p747j5949K8216J1412n056j272O769K7664P802q774j1741o294R950
$$ -11574 -19321 -35270 -7054 4358 -698 -1970 4799 32463 40265 31491 19750 13456 23406
22956B3406k782l1179j2498O950m744J0028j5406N386J0500p660J2862L81j6290
$$ 23406 20624 -10555 -23053 -16103 -20847 -10819 -26225 -20839 -10339 -17999 -5137 -4756 -21046
22943b1046m282J8729J2900p248j5729j8587O060J5354K037l035J9074R814J247
$$ -21046 -25328 -6599 6301 -947 -16676 -35263 -29203 -13849 -11812 -14847 4227 14041 15288
22930A5288j9036k6625l341J0299J9279j3364m977n879K950N291R855L424o0k5192
$$ 15288 -3748 -30373 -33714 -23415 -4136 -17500 -22477 -28356 -25406 -20115 -10260 -6836 -6896 -32088
22916c2088j3409N539P957J5297j228J1244Q536J0646r100p86L771j4747m341
$$ -32088 -45497 -39958 -32001 -16704 -17932 -6688 1848 12494 3394 2608 6379 -8368 -12709
22903a2709K1608l784j1311l4096P062K649R942n602K2359l640k5164j5831j358
$$ -12709 8899 5115 -6196 -40292 -33230 -30581 -20639 -26241 -3882 -7522 -32686 -48517 -49875
22890d9875J6741K0343N600J0437N13l791k115q912N330J3759p550j5357K6013
$$ -49875 -33134 -12791 -7191 3246 3759 -32 -2147 -11059 -5729 8030 480 -14877 11136
22877A1136K2168j1734J348p54J0250k1493j9519O167k480m028q577J978j7080
$$ 11136 33304 21570 22918 22164 32414 10921 -8598 -2431 -4911 -8939 -17516 -15538 -32618
22864c2618P815J5147K889L661J472l493K236l9k5564q974J3577J5763N613j3593
$$ -32618 -24803 -9656 -6767 -3106 -1634 -5127 -2891 -2930 -28494 -37468 -23891 -8128 -2515 -16108
22850a6108l16L985J1367k4228m256L7172p582p452n3q798R708P73L832J632K905
$$ -16108 -16424 -12439 -1072 -25300 -29556 7616 34 -7418 -7471 -16269 -6561 -5788 -1956 -324 2581
22835B581K1381j4998J728J9145J3747k3194j1239j0212k5413J914J1097J156
$$ 2581 23962 8964 10692 29837 43584 20390 9151 -1061 -26474 -24560 -13463 -12307
22823a2307J7807J1663J656J1001l2036j3787J5769L4119J2081r013j6859J1236
$$ -12307 5500 17163 18819 29820 -2216 -16003 -234 33885 45966 36953 20094 31330
22811C1330O96j1966k7337n073L7245R155k3132o215n875J9039J0414R831r862
$$ 31330 32026 20060 -7277 -12350 24895 34050 10918 4703 -1172 17867 28281 38112 28250
22798B8250j1558r974j5278M129J1434q470l422J7728J49q761j7911k8637J988
$$ 28250 16692 6718 -8560 -4431 7003 -1467 -4889 12839 12988 4227 -13684 -42321 -40333
22785d0333k2990K3037R769L202R27p493m45p751J2810J4373j2236r348p412n639
$$ -40333 -63323 -40286 -30517 -27315 -26388 -33881 -34326 -42077 -29267 -14894 -27130 -36478 -43890 -49529
22771d9529M1979J9818j2673q195J6636J9q846J3137o73k0692k7134J6845J8058
$$ -49529 -7550 12268 -405 -8600 8036 8055 -791 12346 11673 -9019 -36153 -19308 -1250
22758a250j5057r466l7796k049J7099J0784K7672j695Q071K8907q921o359Q187
$$ -1250 -16307 -25773 -63569 -65618 -48519 -37735 -10063 -11758 -3687 25220 16299 9940 18127
22745A8127j0631r336r007q94L175P422J1303J9280j1588l8676r215N918k501
$$ 18127 7496 -1840 -10847 -11741 -8566 -1144 10159 29439 17851 -20825 -30040 -24122 -26623
22732b6623J6289K2578J9601j0192k5853O886l893Q58J1879k615j0173j7964j7778
$$ -26623 -10334 12244 31845 21653 -4200 2686 -1207 -349 11530 8915 -1258 -19222 -37000
22719c7000J5198K6529K483j370j372M30n64J0553k0729l8639J0600o290J0267
$$ -37000 -21802 4727 7210 5840 4468 4898 4334 14887 -5842 -44481 -33881 -40171 -29904
22706b9904O309M381J0693l173J1258M078J1255j4138j6919j4725M890J2735k2252
$$ -29904 -23595 -19214 -8521 -11694 -436 3642 14897 759 -16160 -30885 -25995 -13260 -35512
22693c5512J7250K4255R018j7053j2939n198p123j9109L7500R662k1306j50K1752
$$ -35512 -18262 5993 15011 -2042 -14981 -20179 -27302 -46411 -8911 751 -20555 -20705 1047
22680A047J1709L041j0958k7098j339K3541N58j0065r186M260r304m049J7535
$$ 1047 12756 15797 4839 -22259 -23598 -57 501 -9564 -18750 -14490 -23794 -27843 -10308
22667a0308m714K220k1554Q59j4264J3909m85Q068J5957l1500L532J9699J6514
$$ -10308 -15022 -12802 -34356 -33497 -47761 -33852 -34337 -26269 -10312 -41812 -38280 -18581 -2067
22654b067K0941K0028J18q064l0735M456K0008K5030q509k3474j5471n959J3453
$$ -2067 18874 38902 39020 30956 221 4677 24685 49715 41206 17732 2261 -3698 9755
22641I755M119k6226J1722l775L432K7303K0836k4429l951R83o453k711p043j4927
$$ 9755 13874 -12352 -630 -4405 -973 26330 47166 22737 18786 19769 13316 10605 3562 -11365
22627a1365p477o19Q600K2655j4706J1666K1459n38n049l21n670K146K0506o616
$$ -11365 -18842 -19461 -10861 11794 -2912 8754 30213 29675 24626 24305 18635 20781 41287 34671
22613C4671k9708j5544q670J2601J5308M56K882k4028j1183L9500L889m1666K386
$$ 34671 4963 -10581 -19251 -6650 8658 9114 11996 -12032 -23215 16285 20174 -21492 -19106
22600a9106J9352O40j0191J9339K6147M710l24l965j5161j9974r800J338j2582
$$ -19106 246 886 -9305 10034 36181 40891 40567 36602 21441 1467 -8333 -6995 -19577
22587a9577l927K1473j3736p208J8772r912N324J1436K0482q46M738j3778l13
$$ -19577 -23504 -2031 -15767 -22975 -4203 -14115 -8791 2645 23127 22281 27019 13241 12928
22574A2928N903j8099P320M860P248J041j5627j675j283L495K2869M738K864j5358
$$ 12928 18831 732 8052 12912 20160 21201 5574 3899 2616 6111 28980 33718 36582 21224
22560B1224j406K8715p202K268J4895n01j7453k7187j8994Q019J4506J0090P853
$$ 21224 19818 48533 41331 43599 58494 57993 40540 13353 -5641 2378 16884 26974 34827
22547C4827k221J107N703j8414m524p80n84K1428m633l0581J34K2122L587j1379
$$ 34827 32606 33713 39416 21002 16478 15698 15114 36542 31909 1328 1462 23584 27171 15792
22533A5792j7394j2688K179j4648j655K4212N967o218j0432k46R578K2628J943
$$ 15792 -1602 -14290 -12111 -26759 -28414 -4202 1765 -4453 -14885 -15131 -5553 17075 19018
22520A9018p211l479j0650n922r292J0956M135L066j709J884q066J8826P763j7343
$$ 19018 11807 8328 -2322 -8244 -17536 -6580 -2445 621 -1088 796 -7270 11556 19319 1976
22506A976j4892j93k238L812k4123j065K1133J5401J705J0977J5213J989j0079
$$ 1976 -12916 -13109 -15347 -11535 -35658 -36723 -15590 -189 1516 12493 27706 29695 19616
22493A9616P65k8389j6128n698J4590R159J0991J3603j6598P854M815q386J6718
$$ 19616 20381 -8008 -24136 -29834 -15244 -6085 4906 18509 1911 9765 14580 6194 22912
22480B2912q749n627L8145j685j7224p781j6632l2742O996K2185n891K2968J3597
$$ 22912 14163 8536 46681 44996 27772 19991 3359 -29383 -22387 -202 -6093 16875 30472
22467C0472k4J4009j2624L493k9896o303j0854L122J627m779l418r344k6731Q642
$$ 30472 30448 44457 31833 35326 5430 -873 -11727 -8605 -6978 -11757 -15175 -24519 -51250 -42608
22453d2608K4311J7091J2312K3074J3756k8662R12Q51r077n993J6338J9537o588
$$ -42608 -18297 -1206 11106 34180 47936 19274 20186 21037 11960 5967 22305 41842 35254
22440C5254j0008N568N040o981o336p076l0666n973M4828K1074q203k4655R687
$$ 35254 25246 30814 35854 28873 22537 15461 -15205 -21178 23650 44724 36521 11866 21553
22427B1553J2398p624j4348L885j0127M830J3522m299k6577j1689K945o473J9724
$$ 21553 33951 26327 11979 15864 5737 10567 24089 19790 -6787 -18476 -15531 -22004 -2280
22414b280K3249n673m631j306q457K7366Q339q213l1347j7450P135J7157k317
$$ -2280 20969 15296 10665 9359 902 28268 36607 28394 -2953 -20403 -13268 3889 1572
22401A572n493K246O79m425k2625O188L963J7881o086j2499J7611N997o881J8596
$$ 1572 -3921 -1675 -996 -5421 -28046 -21858 -17895 -14 -6100 -18599 -988 5009 -1872 16724
22387A6724q31M465k0236k9003J6260J2355n79n383L621l747Q017K041j4352J3747
$$ 16724 15893 20358 122 -28881 -12621 -266 -845 -6228 -2607 -6354 1663 3704 -10648 3099
22373C099J6379m448j070J1830K1934n533o10J1693k5497k641n742j1906j1681
$$ 3099 19478 15030 13960 25790 47724 42191 41581 53274 27777 25136 19394 7488 -4193
22360d193K647L891L9004J065o585R587j1620k2322k7144J8143J5718K480J266
$$ -4193 -1546 2345 41349 42414 35829 45416 33796 11474 -15670 2473 18191 20671 21937
22347B1937j4917j2530j0277n845k725Q576L96J230m851J3309J1400l552j8386
$$ 21937 7020 -5510 -15787 -21632 -24357 -15781 -15385 -14155 -19006 -5697 5703 2151 -16235
22334a6235n063J0682J6879K3490m138l3533L588L188K417j299n268J4985J5273
$$ -16235 -21298 -10616 6263 29753 25615 -7918 -4330 -1142 1275 -24 -5292 9693 24966
22321B4966J9542J0593O576J2030r884r591k9345j1616j607k386M51K3957p341
$$ 24966 44508 55101 61677 73707 63823 54232 24887 13271 11664 9278 9729 33686 26345
22308B6345q889j6188k4131J0647J3508m184Q604j2846r690J5507K0645J2298
$$ 26345 17456 1268 -22863 -12216 1292 -2892 5712 -7134 -16824 -1317 19328 31626
22296C1626m776j7834O556J2038o905j0710p209j4179J2379l430J1514K5243J6593
$$ 31626 26850 9016 15572 27610 20705 9995 2786 -11393 986 -2444 9070 34313 50906
22283E0906l1743j4787K584M743n37J6720J5391j8944m817k0076q663J0784K0125
$$ 50906 19163 4376 6960 11703 11166 27886 43277 24333 19516 -560 -9223 1561 21686
22270B1686K339k3533r858R166n147J4622J1156m788j1067n488J304j012K311
$$ 21686 24025 492 -9366 -200 -5347 9275 20431 15643 4576 -912 392 -620 1691
22257A691n429j3954j369P380Q286P983K589N126K6553J313l8953l3518Q696J7097
$$ 1691 -3738 -17692 -19061 -11681 -3395 4588 7177 12303 38856 40169 1216 -32302 -23606 -6509
22243f509N341L919o770K426K2058j0053k8463j2838j3981K1146J3833N311J3129
$$ -6509 -1168 2751 -4019 -1593 20465 10412 -18051 -30889 -44870 -23724 -9891 -4580 8549
22230H549P985l979j7695P651L3684l334J394k94o931j1858k886J1691L14Q406
$$ 8549 16534 12555 -5140 2511 36195 32861 34255 33961 27030 15172 12286 23977 24291 32697
22216C2697j5712j4335r804J062K558k710J0935N164J0092p661k6665N248P010
$$ 32697 16985 2650 -7154 -6092 -3534 -6244 4691 9855 19947 12286 -14379 -9131 -2121
22203b121j3178m726J1940n462J1072J8480J7531N641M79O090k4863LR833R500
$$ -2121 -15299 -20025 -8085 -13547 -2475 16005 33536 39177 39656 45746 20883 20886 30719 40219
22189D0219p110j4034J578O447Q420M136k4505K52K2756K265J8898j1288k2369
$$ 40219 33109 19075 20653 27100 35520 39656 15151 15403 38159 40424 59322 48034 25665
22176B5665k788l482k4765j2579k512J2315J7820N277J0420j5391j8399J0893
$$ 25665 22877 19395 -5370 -17949 -20461 -8146 9674 14951 25371 9980 -8419 2474
22164B474P781j8198O901J4220q407P221J5890J8401J2120j6828j2201J3171P594
$$ 2474 10255 -7943 -1042 13178 4771 11992 27882 46283 58403 41575 29374 42545 50139
22151E0139j6505J6599J1890k6548j4034K733j9487j0411m165K0684J7539m458
$$ 50139 33634 50233 62123 35575 21541 24274 4787 -5624 -9789 10895 28434 23976
22139B3976j9002j0713j2427K3375L7874J3106j0824l6587j4449m569j5949Q241
$$ 23976 4974 -5739 -18166 5209 43083 56189 45365 8778 -5671 -10240 -26189 -17948
22127a7948K8812l212L602o65n437O802j1914k1911j2342Q317O246q812J1963
$$ -17948 10864 7652 11254 10589 5152 11954 40 -21871 -34213 -25896 -19650 -28462 -16499
22114a6499J1071J151O462j1403r515J6038J7017l884p945R390K0537o264l5840
$$ -16499 -5428 -4277 2185 -9218 -18733 -2695 14322 10438 2493 11883 32420 26156 -9684
22101i684j3720k263k168J1676K0778q82l513j5874k5302J209J2321J0504K4482
$$ -9684 -23404 -25667 -27835 -16159 4619 3737 224 -15650 -40952 -39743 -27422 -16918 7564
22088G564R872q92l645j6415J095J1114J3341K4255m8272j4296q112r35J474Q588
$$ 7564 17436 16544 12899 -3516 -2421 8693 22034 46289 -1983 -16279 -24391 -25326 -23852 -15264
22074a5264k58j6857J1132L7344J2017K2989l189p661M05p468q066J2819M844
$$ -15264 -15522 -32379 -21247 16097 28114 51103 47914 40253 40658 33190 25124 37943 42787
22061D2787n77j3685j0397o446M66k1017k0122o694m82K3727J0029j736j8581
$$ 42787 42210 28525 18128 11682 12148 -8869 -28991 -35685 -36167 -12440 -2411 -4147 -22728
22048b2728j044L3797M2794l071l3211p409J1330j162j0741k150J4801j1354J6976
$$ -22728 -23772 10025 52819 49748 16537 9128 20458 19296 8555 6405 21206 9852 26828
22035B6828o300Q016J691k6154q940J1976J1180K860p251P50n047J608l116O458
$$ 26828 20528 28544 30235 4081 -4859 7117 18297 21157 13906 14656 9609 11217 8101 14559
22021A4559k961J2885J3103k7709l430K8036K787M278O154M115k813m85r781l101
$$ 14559 11598 24483 37586 9877 6447 34483 37270 41548 47702 51817 49004 48519 38738 35637
22007C5637L733j4299k1836k0591q36J6666J7179m652j2975l682l067k9516L4976
$$ 35637 39370 25071 3235 -17356 -18192 -1526 15653 11001 -1974 -5656 -8723 -38239 -3263
21994c263K5302p237n244O139J219j6662M253J2858J4369Q351k5849l1808M661
$$ -3263 22039 14802 9558 15697 16916 254 4507 17365 31734 40085 14236 -17572 -12911
21981a2911L8095K5039k2188O832j48k4103k4576j5926j2693J833J3837J8399
$$ -12911 25184 50223 28035 34867 34719 10616 -13960 -29886 -42579 -40746 -26909 -8510
21969h510K4711R451o282k6715j0226P217o451j4984J3968J3129O345m618l67
$$ -8510 16201 25652 19370 -7345 -17571 -10354 -16805 -31789 -17821 -4692 1653 -2965 -3332
21956c332j4378r794J6565O557k382J2336j0679k0109l08K4373L6347J3294J621
$$ -3332 -17710 -27504 -10939 -4382 -6764 5572 -5107 -25216 -25524 -1151 35196 48490 50111
21943E0111m2719k929M2562J2188j6241j3483L552r22J7711q551j870J3114p484
$$ 50111 7392 4463 47025 59213 42972 29489 33041 32119 49830 41279 39409 52523 45039
21930D5039J0162J832l0046p071K9731j2360l5455j1099O378J9560n596M058P693
$$ 45039 55201 57033 26987 19916 49647 37287 1832 -9267 -2889 16671 11075 15133 22826
21917B2826k5946j1616N142k982j496Q155Q754r58q944L750J4184N781J1632j5909
$$ 22826 -3120 -14736 -9594 -12576 -14072 -5917 2837 1879 -7065 -3315 10869 16650 28282 12373
21903A2373p200K4529J3531j8543j1860K1018N142k837j2939m8018q087K1650
$$ 12373 5173 29702 43233 24690 12830 33848 38990 36153 23214 -24804 -32891 -11241
21891a1241Q96l512K3570J9230n57j0597n201O587L826K931r449m535q022O386
$$ -11241 -10345 -13857 9713 28943 28386 17789 12588 19175 23001 25932 16483 11948 3926 10312
21877A0312J8262k9507j085J1222k905L378j4124J2436J0612k980l015p096O465
$$ 10312 28574 -933 -2018 9204 6299 9677 -4447 7989 18601 15621 12606 5510 11975
21864A1975P68k0030R199K1577k260K2210J3065k9778m417J9970N552k7711j9792
$$ 11975 12743 -7287 1912 23489 21229 43439 56504 26726 22309 42279 47831 20120 328
21851C28r165J7638J0749k8793k449N576J555Q860K4874j2611j8125N82P065k2641
$$ 328 -8837 8801 19550 -9243 -11692 -6116 -4561 4299 29173 16562 -1563 -981 6084 -16557
21837a6557j4954j575L7393J8502j0999n554J3538J4060k1437l1068j6712q537
$$ -16557 -31511 -33086 4307 22809 11810 6256 19794 33854 12417 -18651 -35363 -43900
21825d3900K4890N120K288J4482Q49q387l459K1289j1741j7426q474J3056j858
$$ -43900 -19010 -13890 -11602 2880 3729 -4658 -8117 13172 1431 -15995 -24469 -11413 -13271
21812a3271M76J7350Q885N147K6195l407j7279p732R93n862K283j4320m638J1361
$$ -13271 -12795 4555 13440 18587 44782 41375 24096 16364 17357 11495 13778 -542 -5180 6181
21798F181P753M990k770r593Q476J985L175J1150m169J821j3093N115K3290j4040
$$ 6181 13934 18924 16154 6561 15037 17022 20197 31347 27178 28999 15906 21021 44311 30271
21784C0271p525k0416j7640J5276K892p892r7q45K2230n695j3569j6577L715K4201
$$ 30271 22746 2330 -15310 -34 2858 -5034 -5131 -5976 16254 10559 -3010 -19587 -15872 8329
21770H329K7326Q938j1750m213j1518n826k2053r647K827K6742J8820o439N341
$$ 8329 35655 44593 32843 28630 17112 11286 -10767 -20414 -17587 9155 27975 21536 26877
21757B6877L424k986l210j8613m94j536k414j1440j2404K6243j800L506q65k461
$$ 26877 30301 27315 24105 5492 4998 3462 1048 -10392 -22796 3447 1647 5153 4288 1827
21743A827J5109l401m035q067J7074j0943M748r938j3991J4203J0458K2369R165
$$ 1827 16936 13535 9500 1433 18507 7564 12312 2374 -11617 2586 13044 35413 44578
21730D4578o601J170p112L112K1969J3109k3072j1103N276k7612n315K05J0563
$$ 44578 37977 39147 32035 35147 57116 70225 47153 36050 41326 13714 8399 8604 19167
21717A9167j2523j1323J1826J5777k7247n09N849L5333J8252K464j3841n883j6184
$$ 19167 6644 -4679 7147 22924 -4323 -4832 1017 36350 54602 57066 43225 37342 21158
21704B1158l901P724n985Q200M583j0109l0338j578K5275J2861r295N790j473
$$ 21158 17257 24981 18996 27196 31779 21670 -8668 -10246 15029 27890 18595 24385 22912
21691B2912N96J7348K48O664k0680k1247Q777q106k5176j0029J7907J3097M801
$$ 22912 23508 40856 41104 47768 27088 5841 14618 6512 -18664 -28693 -10786 2311 7112
21678G112J65o3j531K822J2595J410m20j9300J0134M737n71Q008l02j1099k688
$$ 7112 7277 7214 5683 8505 21100 22510 22090 2790 12924 17661 17090 25098 24796 13697 11009
21663A1009j4691m866J3903K1489n994l1761p566K1652J0322K0029J9899j8366
$$ 11009 -3682 -8548 5355 26844 20850 -10911 -18477 3175 13497 33526 53425 35059
21651C5059k0353n714m332J1348K4924R895K290l1277j9981j5110J3094J1170
$$ 35059 14706 8992 4660 16008 40932 50827 53117 21840 1859 -13251 -157 11013
21639A1013k497k0640M307J6113m635R749K0904L067j8209q917j646R202K1056
$$ 11013 8516 -12124 -7817 8296 3661 13410 34314 37381 19172 10255 8609 17811 38867
21626C8867M65j2128Q838K1408J0685J5649J310o104k3496r835k1256j200J0568
$$ 38867 39332 27204 36042 57450 68135 83784 85094 78990 55494 45659 24403 23203 33771
21613C3771J6272K460j5619J5487j1585j0049J5290j3992j2450j0010m046k359
$$ 33771 50043 52503 36884 52371 40786 30737 46027 32035 19585 9575 5529 3170
21601C170J1384L923M861J3438J6322j4192l3368J2024L5306K3304k8302j0103
$$ 3170 14554 18477 23338 36776 53098 38906 5538 17562 52868 76172 47870 37767
21589C7767j5967q94j0929n563J198J3932P006k862R941j0685l849L648n759K7178
$$ 37767 21800 20906 9977 4414 5612 19544 26550 23688 33629 22944 19095 22743 16984 44162
21575D4162K0510r557j8389j5432J4003q021j0360J932O079j3415L4883R471j8792
$$ 44162 64672 55115 36726 21294 35297 27276 16916 18848 24927 11512 46395 55866 37074
21562C7074L134k2251l604M801J1018P88j3407J157l1205J2230J1955J5243J6461
$$ 37074 40208 17957 14353 19154 30172 30960 17553 18710 -12495 -265 11690 26933 43394
21549D3394j6138p469Q751J933J917j0758O731Q089j8096K291J1528O14l292P386
$$ 43394 27256 19787 28538 30471 32388 21630 28361 36450 18354 20645 32173 32787 29495 36881
21535C6881n390R794K743L789j1910k258J2032K1686k0956j3298j6508J5349J446
$$ 36881 31491 41285 44028 47817 35907 33649 45681 67367 46411 33113 16605 31954 33400
21522C3400K8639l768m980p166J06K086l0960p70O129L5679j2400r887J5529k26
$$ 33400 62039 58271 53291 46125 46231 48317 17357 16587 22716 58395 45995 36108 51637 51411
21508E1411j3480J1118R038K631j5255n52M819j4636J436r546m346j1219j7865
$$ 51411 37931 49049 58087 60718 45463 44911 49730 35094 36530 26984 22638 11419 -6446
21495f446J0551K9413P390M24J202K43J7181L0131J6561k7098N739K5895Q549
$$ -6446 4105 33518 40908 41332 42534 42777 59958 90089 106650 79552 85291 111186 119735
21482A19735j9016j1612K4110J5644J471J0858J9884M5510J6661J7422L6369O3025
$$ 119735 100719 89107 113217 128861 130332 141190 161074 206584 223245 240667 277036 340061
21470C40061O0506P9310P6470J30384K04350K25505J65101J32709P9181J5817
$$ 340061 400567 479877 556347 686731 891081 1116586 1281687 1414396 1493577 1509394
21460A509394l7638r9603j37400j51007j63201j57715j45866j05269o2189l8142
$$ 1509394 1471756 1372153 1234753 1083746 920545 762830 616964 511695 449506 411364
21450D11364n0311j7421l1219k8809j8008q991k0112l5013j5432l5073k8652n306
$$ 411364 361053 343632 312413 283604 265596 256605 236493 201480 186048 150975 122323 117017
21438A17017Q629k481j743j7680m7500k315J8994J9913j0113M171N712j1811j4900
$$ 117017 125646 123165 121422 103742 56242 53927 72921 92834 82721 86892 92604 80793 65893
21425F5893j6034l206M514K077M955l581j0945j7462P167J5340J2375J8052l0429
$$ 65893 49859 46653 51167 53244 58199 54618 43673 26211 33378 48718 61093 79145 48716
21412D8716k2759k502J5094J9463N430l8059j5150K1167J8362l999j6842k7644
$$ 48716 25957 23455 38549 58012 63442 25383 10233 31400 49762 45763 28921 1277
21400A277j5830K0377M5383Q969j8771J5817J1991j0280k2479l0710p217J3673
$$ 1277 -14553 5824 51207 60176 41405 57222 69213 58933 36454 5744 -1473 12200
21388A2200Q662P275J9009K3235J3691K324q324k091j1768k386N423k000k5749
$$ 12200 20862 28137 47146 70381 84072 86396 78072 75981 64213 61827 67250 65250 39501
21375C9501L22J2774j06j3639r396Q253J1466j9745j1223q099j1605r38K5043
$$ 39501 39823 52597 52491 38852 29456 37709 49175 29430 18207 10108 -1497 -2435 22608
21362B2608L4686l874j7206P163K4079j1075k1495k0075j479R16K0631J9320l794
$$ 22608 57294 53420 36214 43377 67456 56381 34886 14811 13332 14248 34879 54199 50405
21349E0405k7243k6976l924K2181M369Q227r49k6891J5267J4042K845K219k126
$$ 50405 23162 -3814 -7738 14443 18812 27039 26090 -801 14466 28508 31353 33572 31446
21336C1446R190J5242n98M493j7525l5272q636Q278P376r32L6491K3591p869j4810
$$ 31446 40636 55878 55280 59773 42248 6976 -1660 6618 13994 13062 49553 73144 65275 50465
21322E0465j0393n665j6724J3593l044N10J8672N926o399O992n406K2557K2904
$$ 50465 40072 34407 17683 31276 28232 28742 47414 53340 46941 53933 48527 71084 93988
21309I3988k2476j9145l603M489K8369k1201j0283j1532P467L2231j9779j4191
$$ 93988 71512 52367 48764 53253 81622 60421 50138 38606 46073 78304 58525 44334
21297D4334K8338J6998j798J706n630q535L932n393j2837J2092r577k1063k083
$$ 44334 72672 89670 87872 89578 83948 75413 79345 73952 61115 73207 63630 42567 40484
21284D0484R324l550r549j4507Q773p578P567L72P815r406Q755M864J9310J3457
$$ 40484 49808 46258 36709 22202 30975 23397 30964 31336 39151 29745 38500 43364 62674 76131
21270G6131J275r445m684K170k4929L217K3966Q208o91j4271k8662J798M5195
$$ 76131 77406 67961 63277 65447 40518 43735 67701 75909 75218 60947 32285 34083 79278
21257G9278J7533n873l1127j4789L809K0409J949o133R377N792p211j1011r168
$$ 79278 96811 90938 59811 45022 48831 69240 71189 65056 74433 80225 73014 62003 52835
21244E2835k709r145J513P605l307l364J4050N423k4769j7184J9067R743k3204
$$ 52835 50126 40981 42494 50099 46792 43428 57478 62901 38132 20948 40015 49758 26554
21231B6554k0842q082J9877P767P649J3888o833k2710m265o311J8773O141o335
$$ 26554 5712 -2370 17507 25274 32923 46811 39978 17268 13003 6692 25465 31606 25271
21218B5271p904r559K703K774J6001j891j7237l892R462J6709n300L304j105L894
$$ 25271 17367 7808 10511 13285 29286 27395 10158 6266 15728 32437 27137 30441 29336 33230
21204C3230L900j0135J1183J2511j5964n288o789j3250R225K4946R705K090J554
$$ 33230 37130 26995 38178 50689 34725 29437 22648 9398 18623 43569 53274 55364 56918
21191E6918n222M382K34K1388n728q206J143L67J0935j7321k4781k487M460j7992
$$ 56918 51696 56078 56312 77700 71972 63766 64909 65276 76211 58890 34109 31622 36082 18090
21177A8090j6019R964Q249N196l387L848K2214L380N618j2551j4482k3198j5079
$$ 18090 2071 12035 20284 25480 22093 25941 48155 51535 57153 44602 30120 6922 -8157
21164h157K9653J6522j0285J2784L0224k581o465m450L362J9496P930o073m519
$$ -8157 21496 38018 27733 40517 70741 68160 61695 57245 60607 80103 88033 81960 77441
21151G7441L949K4244J0524P85k6131j8301j3428q75k0903k1401K316K137L090
$$ 77441 81390 105634 116158 116943 90812 72511 59083 58208 37305 15904 18220 20357 23447
21138B3447n438R529J4139K5799R532j4890p008j178j8526j0823R471j2066l0269
$$ 23447 18009 27538 41677 67476 77008 62118 55110 53932 35406 24583 34054 21988 -8281
21125h281n216r981j1341Q434Q851J353Q430j3086k2582K536j2941j3244k5792
$$ -8281 -13497 -23478 -34819 -26385 -17534 -16181 -7751 -20837 -43419 -40883 -53824 -67068 -92860
21112i2860n8345j8773P01j5734n0017m9382o5661j0332M1032J6744L2139N3010
$$ -92860 -151205 -169978 -169277 -185011 -235028 -284410 -350071 -360403 -319371 -302627 -270488 -217478
21100b17478P8424J09001P8872L9080J4303J6463O858N844J6046M535k3412k1155
$$ -217478 -139054 -30053 48819 87899 102202 118665 125523 131367 147413 151948 128536 107381
21088A07381M891K0116K7982j1695k1161o169K8293J6818l1076j4966M3438R528
$$ 107381 112272 132388 160370 148675 127514 121345 149638 166456 135380 120414 163852 173380
21076A73380j2706J6166K0968K627k0936J0018J5784l501j2484j2662K6274K8974
$$ 173380 160674 176840 197808 200435 179499 189517 205301 201800 189316 176654 202928 231902
21064B31902m56J6032k296j6077L967O25q378N2751L8498J5216K1674J8535O964
$$ 231902 231446 247478 245182 229105 233072 233697 225319 278070 316568 331784 353458 371993 378957
21051C78957k5110j0454O488o075j8965J0008n558k7134j8649j9264j8612p373
$$ 378957 353847 343393 349881 343806 324841 334849 329291 302157 283508 264244 245632 238259
21039B38259j3732j0137q988o928O77k7047j6206O291J8038J35m123m48N56J136
$$ 238259 224527 214390 205402 198474 199151 172104 155898 162189 180227 180362 176239 175791 176347 177483
21025A77483q556J2180R205j3587J5943O12j1515P674q485R067M972O283J6726
$$ 177483 168927 181107 190312 176725 192668 193280 181765 189439 180954 190021 194993 201276 218002
21012B18002j3086l7653j1191j8692R469K9921K3547o099k304J2487j5273j5707
$$ 218002 204916 167263 156072 137380 146849 176770 200317 194218 191914 204401 189128 173421
21000A73421J3843K2901p518k5458R757J45J9057K6556K8878L5392k010j2073
$$ 173421 187264 210165 202647 177189 186946 187091 206148 232704 261582 296974 294964 282891
20988B82891r570j3385j6715M833P78P656K7886o566j4558n764L184O380j1801
$$ 282891 273321 259936 243221 248054 248832 256488 284374 277808 263250 257486 260670 267050 255249
20975B55249r338P252K2506J2069m773J6531Q677P129k301j6464j2292n413J0614
$$ 255249 245911 253163 275669 287738 282965 299496 308173 315302 313001 296537 284245 278832 289446
20962B89446L076n261r8K6035o877P333J8473J2076k3813J236O752j5890k1401
$$ 289446 292522 287261 287163 313198 306321 313654 332127 344203 320390 321626 328378 312488 291087
20949B91087l6835k3353r483r317N360Q987J992n945O488K9339K4269J0246K7178
$$ 291087 254252 230899 221416 212099 217459 226446 228438 222493 228981 258320 282589 292835 320013
20936C20013L6806J9418L2404J4963L9318N1560M4777M0712K7402J9369M8428
$$ 320013 356819 376237 408641 423604 462922 514482 559259 599971 627373 646742 695170
20925F95170M0928K8989J9690n68o116j256M032j5419j089j2362j2867n4836m7526
$$ 695170 736098 765087 784777 784209 778093 776837 780869 765450 764361 751999 739132 684296 636770
20912F36770o692O986K952O649q413J068J1113r771n62L5339Q223K5401L8821
$$ 636770 630078 637064 640016 646665 638252 639320 650433 640662 640100 675439 683662 709063 747884
20899G47884M953J1301m24L284L0510n618J2490k3004l8888r300K9641Q85M4767
$$ 747884 752837 764138 763714 766998 797508 791890 804380 781376 742488 733188 762829 763714 808481
20886H08481l38j7467o079q902P642R193j47J790L8594N8883L600l5423k1366
$$ 808481 808143 790676 784597 775695 783337 792530 792383 794173 832767 891650 895250 859827 838461
20873H38461N382J8082P075K3627J6433K9594j3432j1692L8558L3928N2678O3687
$$ 838461 843843 861925 869000 892627 909060 938654 925222 913530 952088 986016 1038694 1102381
20861A102381K9628J6882L3126J0839N4773O2389O2255Q6871J07076R3456R2052
$$ 1102381 1132009 1148891 1182017 1192856 1247629 1310018 1372273 1459144 1566220 1659676 1751728
20850A751728J10913J35449J82394K03442K43642K72451K19612Q8062N7987O0319
$$ 1751728 1862641 1998090 2180484 2383926 2627568 2900019 3119631 3207693 3265680 3325999
20840C325999N36o9919r3605p3293l9122j9291M0019P2606J09786J79575K09716
$$ 3325999 3326535 3256616 3163011 3089718 3050596 3031305 3071324 3143930 3253716 3433291 3643007
20829C643007J88028K18492K08917K30212K16056K24524K34315K45325L46137
$$ 3643007 3831035 4049527 4258444 4488656 4704712 4929236 5163551 5408876 5755013
20820E755013M42451N09758N74989O77041P63217R04798J071263J309793J656744
$$ 5755013 6197464 6707222 7282211 7959252 8722469 9627267 10698530 12008323 13665067
20811A3665067K078723K651171L528987M645491O037641P560882R147972J1082250
$$ 13665067 15743790 18394961 21923948 26569439 32607080 40167962 49315934 60398184
20803F0398184J3753171J7706195K3436203L0938469L8105058L9477392L1643639
$$ 60398184 74151355 91857550 115293753 146232222 184337280 223814672 255458311
20796B55458311J8455646O375700l955145j5216952k6163059l2741552l3450324
$$ 255458311 273913957 280289657 276334512 261117560 234954501 202212949 168762625
20789A68762625k9952473k4599115j9092343j4460553j1174953r045632p679961
$$ 168762625 138810152 114211037 95118694 80658141 69483188 60437556 52757595
20782E2757595o670498n803063n031262m334515l653972l101104k684548k294855
$$ 52757595 46087097 40284034 35252772 30918257 27264285 24163181 21478633 19183778
20774A9183778j967572j698580j481737j289080j107127j012618q97567p59704
$$ 19183778 17216206 15517626 14035889 12746809 11639682 10627064 9729497 8969793
20766H969793o57590n67184m79386m26908m23549m00260l76497l80168l44931
$$ 8969793 8312203 7745019 7265633 6838725 6415176 6014916 5638419 5258251 4913320
20757D913320l06997k89561k32788j34264p7718j0111N8372M1425m4810q5760
$$ 4913320 4606323 4316762 4083974 3949710 3871992 3861881 3920253 3961678 3916868 3831108
20747C831108j14022j83860k62904k72495k96151k71270k42930k17300j58645
$$ 3831108 3717086 3533226 3270322 2997827 2701676 2430406 2187476 1970176 1811531
20738A811531j34798j13574q6936j04758j12565r3776q2983o3659l8752o6066
$$ 1811531 1676733 1563159 1476223 1371465 1258900 1165124 1082141 1018482 979730 913664
20728I13664n6920k4268l421l3215n1080m6800j6185m626l835p886k8659o3505
$$ 913664 856744 832476 829055 795840 744760 697960 681775 677149 673314 665428 636769 573264
20716E73264m5860n14K877j9029k1102j3610p418n7062q468k70j7821l5458k475
$$ 573264 527404 526890 529767 510738 489636 476026 468608 411546 403078 402808 384987 349529 347054
20703C47054J1904k1468j0736j4402j7584k157r954p369q15k091J6915q591j3413
$$ 347054 358958 337490 326754 312352 294768 292611 282657 275288 274473 272382 289297 280706 267293
20690B67293o113Q253l18k008j7388J064J6612R399r304j4566K172Q886l501j671
$$ 267293 261180 269433 269115 267107 249719 250783 267395 276794 267490 252924 255096 263982 260481 258810
20676B58810K6557K5080J049J7560j3972q838Q192j1861k0076L34r93k534k125
$$ 258810 285367 310447 311496 329056 315084 306246 314438 302577 282501 282835 281842 279308 277183
20663B77183j6079K582O62j8056M46M1876L6666J1044k5286p26L6001k315Q824
$$ 277183 261104 263686 264348 246292 246738 288614 325280 336324 311038 310312 346313 343998 352822
20650C52822R293J5021L2925j3851j6838M666j7931l1123k5139k7701k0142j7227
$$ 352822 362115 377136 410061 396210 379372 384038 366107 334984 309845 282144 262002 244775
20638B44775j4901l2032l9316j1099R69m177J7633l379M263J25j7532l9700l4734
$$ 244775 229874 197842 158526 147427 148396 144219 161852 158473 162736 162861 145329 105629 70895
20625G0895k021Q044j687r347r028q403J1714K9915J9387j1322k6936L833J0288
$$ 70895 68874 76918 75231 65884 56856 48453 60167 90082 109469 98147 71211 75044 85332
20612H5332o801k1822k3739k42K217Q46j3605j0621K3889J8777n552J223M060
$$ 85332 78531 56709 32970 32728 34945 35791 22186 11565 35454 54231 48679 49902 53962
20599E3962k2225j7306J1627Q142o852j0521o407m571J2807J1385R68k4098R355
$$ 53962 31737 14431 26058 34200 27348 16827 10420 5849 18656 30041 31009 6911 16266
20586A6266K1361J9156L312j1447M58j486n774P856m122k1694j4997k675N885
$$ 16266 37627 56783 60095 48648 49106 47620 41846 49702 45580 23886 8889 6214 12099
20573A2099l264n400j999K6766k629q002j3301O441j1207j9772j0646L342L8461
$$ 12099 8835 3435 1436 28202 25573 17571 4270 10711 -496 -20268 -30914 -27572 10889
20560A0889J0856r480j7802K4066J5542k746j3201J6592L145J6100j1754p810
$$ 10889 21745 12265 -5537 18529 34071 31325 18124 34716 37861 53961 42207 34397
20548C4397k684J7915j2428K3206K1785k6033k0629n133L427k3644P274M500k4857
$$ 34397 31713 49628 37200 60406 82191 56158 35529 30396 33823 10179 17453 21953 -2904
20535b904l003R421k2248p975M174J4099L047K515J9184o1j6289l5477k6506J9454
$$ -2904 -5907 3514 -18734 -26709 -22535 -8436 -5389 -2874 16310 16249 -40 -35517 -62023 -42569
20521d2569J3947J4095J1697p422P548K3563k676j7180k2119k7087J0679J5107
$$ -42569 -28622 -14527 -2830 -10252 -2704 20859 18183 1003 -21116 -48203 -37524 -22417
20509b2417p453j2090j3549n154J9515M0047j5248j6734j8299J6853N034j0371
$$ -22417 -29870 -41960 -55509 -60663 -41148 -1101 -16349 -33083 -51382 -34529 -29495 -39866
20497c9866J7666J6436J2289K2590J0514L2509N2483O7100J04373R4297N0509
$$ -39866 -22200 -5764 6525 29115 39629 72138 124621 191721 296094 390391 440900
20486D40900J3691K5405j8629l1715l1428m9463l8548k5164l6339q049R558N020
$$ 440900 454591 479996 461367 429652 398224 348761 310213 285049 248710 240661 250219 255239
20474B55239l1558k4550k0590q048k5121k1296k3933j3416L0539J7920J0464j7394
$$ 255239 223681 199131 178541 170493 145372 124076 100143 86727 117266 135186 145650 128256
20462A28256j1216K172k4678L418k4160j1797r759J5338J8402o035j0698k525
$$ 128256 117040 119212 94534 97952 73792 61995 52236 67574 85976 79941 69243 66718
20450F6718n300k2442r245m394O949j4748L978L812R282j561j2703k3145J7490
$$ 66718 61418 38976 29731 25337 32286 17538 21516 25328 34610 33049 20346 -2799 14691
20437A4691K8230j3921o326n443P566l1923j7525K6566K1927J2884k230n542j1710
$$ 14691 42921 29000 22674 17231 24797 -7126 -24651 1915 23842 36726 34496 28954 17244
20424A7244k855n476J2401K6045M44j3007p861j036j7278j7203P204J7905J9369
$$ 17244 14389 8913 21314 47359 47803 34796 26935 25899 8621 -8582 -1378 16527 35896
20411C5896o73l912J3796n319j849L368q074L3781M275L297j5726l0946j9356
$$ 35896 35223 31311 45107 39788 37939 41307 33233 67014 71289 74586 58860 27914 8558
20398H558m267J1602L4558p056k4783o872M019N777L479R526j1062J7388P571
$$ 8558 4291 15893 50451 43395 18612 11740 15759 21536 25015 34541 23479 40867 48438
20385D8438j1784J4772J6889j9144k9972l1902m293M6035M683j8759Q251J2244
$$ 48438 36654 51426 68315 49171 19199 -12703 -16996 29039 33722 14963 23214 35458
20373C5458L289J4899j3771j1271j799n259j835j2368j2433m082N017J0485J505
$$ 35458 38747 53646 39875 28604 26805 21546 19711 7343 -5090 -9172 -4155 6330 7835
20360G835K2661k0031J4213P812j2575p362N616M029R728J6870J094k9771N71
$$ 7835 30496 10465 24678 32490 19915 12553 18169 22198 31926 48796 49890 20119 20690
20347B0690J9516r739M638P20k529o105K545J3641J4424j204J4771m389p71n481
$$ 20690 40206 30467 35105 35825 33296 27191 29736 43377 57801 56597 71368 66979 66208 60727
20333F0727j5610J9868K93q605n2187j4941m561o459j261J2639J3356K3872Q98
$$ 60727 45117 64985 65278 56673 4486 -10455 -15016 -21475 -22736 -10097 3259 27131 28029
20320B8029k5216j4571J341n565k1955J3885J2147l973R785J2127p506q593k2624
$$ 28029 2813 -11758 -10417 -15982 -37937 -24052 -11905 -15878 -6093 6034 -1472 -10065 -32689
20307c2689J271K7990J2844l365j5480o179J0088J0090J3650q157Q619M217j066
$$ -32689 -31418 -3428 9416 6051 -9429 -15608 -5520 4570 18220 10063 18682 22899 21833
20294B1833O753J898j1489j914Q64j514J758j6246n215R07N245J5818r536N613
$$ 21833 28586 30484 18995 17081 17945 16431 18189 1943 -3272 -2365 2880 18698 9162 14775
20280A4775j3526l287L089l731P622m533k7776J5303J3167J6306l885n378J3979
$$ 14775 1249 -2038 1051 -2680 4942 409 -27367 -12064 1103 17409 13524 8146 22125
20267B2125K5996m115k958j2751o137M592j3402j6163K0353m525k1680j2349J9337
$$ 22125 48121 44006 41048 28297 22160 26752 13350 -2813 17540 13015 -8665 -21014 -1677
20254a677J0340J2370N694J1937j2832q221M047R777J2986J5819Q484j1193Q642
$$ -1677 8663 21033 26727 38664 25832 17611 21658 31435 44421 60240 68724 57531 66173
20241F6173j8235j7645J0628Q655P063k815k9181j1590j0052k181J4358J7682
$$ 66173 47938 30293 40921 49576 56639 53824 24643 13053 3001 820 15178 32860
20229C2860j0523k472m539J1706J095K0121P232k6344o946r961J2710J4758j5175
$$ 32860 22337 19865 15326 27032 28127 48248 55480 29136 22190 12229 24939 39697 24522
20216B4522J7272k0779O320K7736N761q480L909r749j1868R200J1614L89j2001
$$ 24522 41794 21015 27335 55071 60832 52352 56261 46512 34644 43844 55458 55847 43846
20203D3846n547j570J2573K7679j8121J0413l354j5178r695k699k2420J2293J1065
$$ 43846 38299 36729 49302 76981 58860 69273 65919 50741 41046 38347 15927 28220 39285
20190C9285J2234N286j3556k687J12k8594k986J626k5224j7554K8467L4654J5994
$$ 39285 51519 56805 43249 40562 40674 12080 9094 10720 -14504 -32058 -3591 31063 47057
20177D7057K3351J6599j8813J3551j7697j7384j2711L676J4278q53J2180K0306
$$ 47057 70408 87007 68194 81745 64048 46664 33953 37629 51907 51054 63234 83540
20165H3540j6595J027o59j2879j8759n72L409J8121J7520j1810l1543J0683M359
$$ 83540 66945 67972 67313 54434 35675 35103 38512 56633 74153 62343 30800 41483 45842
20152D5842J0060m310k2540j9741j4104M0573L0276N464O549p522j1633J0648
$$ 45842 55902 51592 29052 9311 -4793 35780 66056 71520 78069 70547 58914 69562
20140F9562J8136N765R90J388J2913K5965L4923J9261K4295N5070N1205M1067
$$ 69562 87698 93463 94453 95841 108754 134719 169642 188903 213198 268268 319473 360540
20128C60540P8041Q0704Q6568J61387K11437K31872J72071R9369L6215l1084q9137
$$ 360540 438581 519285 605853 767240 978677 1210549 1382620 1481989 1518204 1487120 1397983
20117A397983j40536j72706j54245j53031j31326j04309r3869k8983l6927n3385
$$ 1397983 1257447 1084741 930496 777465 646139 541830 447961 418978 382051 328666
20107C28666m1391m5769k2165k3384n6664l3201J0525N853j0846j0904r263o319
$$ 328666 287275 241506 219341 195957 139293 106092 116617 122470 111624 100720 91457 85138
20095H5138J369L625N745j102O917l825j6702k3565P728j6688j6205J7939M450
$$ 85138 86507 90132 95877 94775 101692 97867 81165 57600 65328 48640 32435 50374 54824
20082E4824J1495j9493k510r184L755r102j225N168Q474J7131N310m74J4134j5137
$$ 54824 66319 46826 44316 35132 38887 29785 28560 33728 42202 59333 64643 64169 78303 63166
20068F3166J0584K652q452l0287j1555O455N364J7628j771j2013R610J8095L655
$$ 63166 73750 76402 67950 37663 26108 32563 37927 55555 53784 41771 51381 69476 73131
20055G3131J1843l0273P7Q727L842o027j0054K0503Q769r55J8520K1033R050M1411
$$ 73131 84974 54701 54778 63505 67347 61320 51266 71769 80538 79583 98103 119136 128186 169597
20041A69597O9054N2932M5240P8931J05475O6979O0911N9783M4218l1606l7035
$$ 169597 238651 291583 336823 415754 521229 588208 649119 708902 753120 721514 684479
20030F84479k6274n6814q8906p8970n9940m9808m2956j1052j9073j0030k6884
$$ 684479 658205 601391 512485 433515 373575 323767 280811 269759 250686 240656 213772
20019B13772n9540j2804O188j3386k1277r712J020J657k7041k717p312j4340O618
$$ 213772 154232 141428 147616 134230 112953 103241 104261 105918 78877 76160 68848 54508 61126
20006F1126j0347l087K0356J9900r138o28j1598q434J3766J6986m951j3502J1287
$$ 61126 50779 47692 68048 87948 78810 78182 66584 58150 71916 88902 83951 70449 81736
19993H1736p35k2416j8189K8835L0087K5507K4744M6137O4595M8914N8151P5352
$$ 81736 81001 58585 40396 69231 99318 124825 149569 195706 260301 309215 367366 442718
19981D42718J09029P2995P9950R5707L5731k9787k7783m9459p8243q3668r1566
$$ 442718 551747 624742 704692 800399 836130 806343 778560 729101 650858 567190 475624
19970D75624n8418n4353m6345m7572k6880q508l7670j5045n035M25O491Q969L0440
$$ 475624 417206 362853 316508 268936 242056 233548 195878 180833 175798 176223 182714 191683 222123
19957B22123K9427Q120L6491O5867Q0080J10256Q7662R4166J01385O1351J58J098
$$ 222123 251550 259670 296161 362028 442108 552364 640026 734192 835577 896928 897086 898184
19945H98184K402n0063j3878j5971k2633J1297K7433P3237O4220N817k7452k9984
$$ 898184 900586 850523 836645 820674 798041 809338 836771 910008 974228 980045 952593 922609
19933I22609o6936n9784q0794r3820r8585q8201p6073o2203n0806k0910j7168
$$ 922609 855673 795889 715095 621275 522690 434489 358416 296213 245407 224497 207329
19922B07329l0871k2929j8218k268j0269j3186q578J9477l793j0443j6718k5487
$$ 207329 176458 153529 135311 133043 122774 109588 101010 120487 116694 106251 89533 64046
19910F4046N094K0451j0879j379j6802M003J5736L3m360o95l612J5194M353r626
$$ 64046 69140 89591 78712 77333 60531 64534 80270 80303 75943 75248 71636 86830 91183 81557
19896H1557N404p393K3985m652k9697k6067M329J7586J915L1685j1414j7964O314
$$ 81557 86961 79568 103553 98901 69204 43137 47466 65052 66967 98652 87238 69274 75588
19883G5588j7437j7510O240K2660O574M18j2963j4343j8831M466R663J1583j6197
$$ 75588 58151 40641 46881 69541 76115 76533 63570 49227 30396 34862 44525 56108 39911
19870C9911R175J6335k515M859M908J9119n492j140k857J7559m098k120j5281
$$ 39911 49086 65421 62906 67765 72673 91792 86300 85160 82303 99862 95764 93644 78363
19857G8363Q2j1509l5849j617L0190L122k598j289m39l011p676O997L6260M095
$$ 78363 78445 66936 31087 29470 59660 62782 60184 58895 58456 55445 47769 54766 91026 95121
19843I5121l4833k3097J3510R677l000J769Q019j5881O621r186J2895m20j1450
$$ 95121 60288 37191 50701 60378 57378 59147 67166 51285 57906 48720 61615 61195 49745
19830D9745j0742K4220Q486O268m123J778k0012j253J3332J4777j1995j5020o22
$$ 49745 39003 63223 71709 77977 73854 75632 55620 54367 67699 82476 70481 55461 54839
19817E4839J5658o55K080J0910N529l615j6666o169Q335L0620L1059J281J6034
$$ 54839 70497 69842 71922 82832 88361 84746 68080 61911 70246 100866 131925 133206 149240
19804A49240k348L264O234L4220L9150O8491P9621P9337J04320R0064Q7087Q2029
$$ 149240 146892 150156 156390 190610 229760 298251 377872 457209 561529 651593 738680 820709
19792H20709M2770p436n6937p6944q0418p8029q8491o4304m0133l7452l5500k3539
$$ 820709 863479 856043 799106 722162 641744 563715 475224 410920 370787 333335 297835 274296
19780B74296l9576j8655j5179j2698j5651l0610n802l3445k0072J2359K1930P199
$$ 274296 234720 216065 200886 188188 172537 141927 136125 102680 82608 94967 116897 124096
19768A24096N550k795j6141j8187r414J1909O709m482J447j0852Q081K334l900
$$ 124096 129646 126851 110710 92523 83109 95018 101727 97245 98692 87840 95921 98255 94355
19755I4355K332J9304N440n360R108K5932J6793J9863J0920M019N3375N5643O2724
$$ 94355 96687 115991 121431 116071 125179 151111 167904 187767 198687 202706 256081 311724 374448
19742C74448J10846J16103Q0407P5462N9675K2282R658l1707r2161j00562j01000
$$ 374448 485294 601397 681804 757266 816941 839223 848881 817174 725013 624451 523451
19731E23451j00627q9080p1865q1008n6726m0241j7657l7269m3690l6696l1837
$$ 523451 422824 333744 261879 180871 124145 83904 66247 28978 -14712 -51408 -83245
19720h3245l2881p616L2693K7016L4196N964J7019J5756O174m5169m1715k5464
$$ -83245 -116126 -123742 -91049 -64033 -29837 -23873 -6854 8902 15076 -30093 -71808 -97272
19708i7272j5787L727M3824N5549L1433M5156L0391K4637L7288J9711j1602l0517
$$ -97272 -113059 -109332 -65508 -9959 21474 66630 97021 121658 158946 178657 167055 136538
19696A36538j3627k0983j9K7025L0650J7805M14J499N811K9277l346J4776j0616
$$ 136538 122911 101928 101909 128934 159584 177389 177803 179302 185113 214390 211044 225820 215204
19683B15204n301L922l228n35j5129K1825N2061J2783N772O403L0881M3430N5867
$$ 215204 209903 213825 210597 210062 194933 216758 268819 281602 287374 293777 324658 368088 423955
19670D23955O1605M4610P8521J19438J09609N2065O7601R5306N1733j021J2985
$$ 423955 485560 530170 608691 728129 837738 889803 957404 1052710 1104443 1103422 1116407
19659A116407P078k0542j5604p555J3134l65m354K0103L372k7669p1472p0334
$$ 1116407 1123485 1102943 1087339 1079784 1092918 1092553 1088199 1108302 1111674 1084005 1012533 942199
19647I42199q4435j02326q3833p6965o8915n9732m1630k8581l9557k5303r394
$$ 942199 857764 755438 671605 594640 525725 465993 424363 395782 356225 330922 321528
19636C21528j2034m964n816k785l2356j6153k978k0748L340k7225l4857j115Q150
$$ 321528 309494 304530 298714 295929 263573 247420 244442 223694 227034 199809 164952 163837 171987
19623A71987O263k158R706N427l658k1904l1121o619L726J7346J3204J7326Q433
$$ 171987 178250 176092 185798 191225 187567 165663 134542 127923 131649 148995 162199 179525 187958
19610A87958m325L590M551k5101K132q470l8545Q242J0199R485j1872J2676j395
$$ 187958 183633 187223 191774 166673 168805 160335 121790 130032 140231 149716 137844 150520 149125
19597A49125K4219J2297P93j1691J5484j6249j5039K4720k2520l7152k572j3214
$$ 149125 173344 185641 186434 174743 190227 173978 158939 183659 161139 123987 121415 108201
19585A08201k4128q165J6249M249m1281j025M2786M1336Q341L4100K8410M9147
$$ 108201 84073 75908 92157 96406 55125 54100 96886 138222 146563 180663 209073 258220
19573B58220M0981K8492J2688j1562N540J9769K4085M069O286o586j2448m390
$$ 258220 299201 327693 340381 328819 334359 354128 378213 382282 388568 381982 369534 365144
19561C65144J0525Q859J0949K404R609O639k9368j1461m729p659p984j5491r197
$$ 365144 375669 384528 395477 397881 407490 414129 384761 373300 368571 360912 352928 337437 328240
19548C28240J1801o871j451K0654J5911J4446K6472P078J7585n54n928j805O007
$$ 328240 340041 333170 331719 352373 368284 382730 409202 416280 433865 433311 427383 425578 431585
19535D31585K4829j2231m847J4599Q200j5700o0165m2731k527Q891O967M3540
$$ 431585 456414 444183 439336 453935 462135 446435 386270 343539 341012 349903 356870 400410
19523D00410M3395O3670M6105N9249N8211O2892M3172P034o56p09p413l186P009
$$ 400410 443805 507475 553580 612829 671040 733932 777104 784138 783482 782773 775360 772174 779183
19510G79183J4183L8108J3552k2665k4365J9514J8298k3552m913j1171m156k1858
$$ 779183 793366 831474 845026 822361 797996 817510 835808 812256 807343 796172 792016 770158
19498G70158j5845J5118Q178k39j6454j4348K928J2490L783j0745J2953k2549
$$ 770158 754313 769431 777609 777370 760916 746568 749496 761986 765769 755024 767977 745428
19486G45428r535K6033M30q53J5512K835J560K4583J4811K1220N6149K1481L020
$$ 745428 735893 761926 762356 761503 777015 779850 781410 805993 820804 842024 898173 919654 922674
19473I22674J2601j2957j2219K5204L9028L0808Q473K6079J9620M4353K5905L567
$$ 922674 935275 922318 910099 935303 974331 1005139 1013612 1039691 1059311 1103664 1129569 1133136
19461A133136l107J1785L0062J3378J3353J6269M9442M3966L9186M7668L2286
$$ 1133136 1130029 1141814 1171876 1185254 1198607 1214876 1264318 1308284 1347470 1395138 1427424
19450A427424M5609M0851P2127O3149O3061R0796J06987R8714J24611J37418J52704
$$ 1427424 1473033 1513884 1586011 1649160 1712221 1803017 1910004 2008718 2133329 2270747 2423451
19439B423451J69753K01737K65965L05297L71674M28364M53009N12490N42743
$$ 2423451 2593204 2794941 3060906 3366203 3737877 4166241 4619250 5131740 5674483
19430E674483N83001O43771P36457Q64062J051564J415513J900908K470385L093938
$$ 5674483 6257484 6901255 7637712 8501774 9553338 10968851 12869759 15340144 18434082
19421A8434082L843623M798131O103608P933799J1050396J5797344J9274625J8020761
$$ 18434082 22277705 27075836 33179444 41113243 52163639 67960983 87235608 105256369
19413A05256369J5909217J5872868J2420897M535492j290173k843609m237972
$$ 105256369 121165586 137038454 149459351 153994843 152704670 149861061 145623089
19406A45623089o241138n780368q19599N315263P028325O476944P853737P340806
$$ 145623089 139381951 133601583 132781984 138097247 145125572 151602516 159456253 166797059
19398A66797059P67259o511793r487648j1379145j4573808j7242152j7157296
$$ 166797059 167564318 161052525 151564877 140185732 125611924 108369772 91212476
19391I1212476j5386228j3433221j1049961q353648o147618m746869l834601l217139
$$ 91212476 75826248 62393027 51343066 42989418 36841800 32094931 28260330 25043191
19383B5043191k769855k391440j988517j716222j571777j439700j275983j137197
$$ 25043191 22273336 19881896 17893379 16177157 14605380 13165680 11889697 10752500
19375A0752500j061654r68467q24010p47004o87206n65272m91115m56369m09519
$$ 10752500 9690846 8722379 7898369 7151365 6464159 5898887 5407772 4951403 4541884
19366D541884l51642l27252k68246k36826k29408k04505j77447j47182j60903
$$ 4541884 4190242 3862990 3594744 3357918 3128510 2924005 2746558 2599376 2438473
19357B438473j23604j09563q9340o9469j05442j12225r2371p3760q8858p0951
$$ 2438473 2314869 2205306 2115966 2046497 1941055 1828830 1736459 1662699 1573841 1502890
19347A502890m0333n4198l8403j5059j834q605j7687l1970j6993k1966j8572k2404
$$ 1502890 1462557 1408359 1369956 1354897 1353063 1344458 1326771 1294801 1277808 1255842 1237270 1214866
19335A214866L439l2896j7645k3688j2434j0552j3306p177K8259J6137J5864j0622
$$ 1214866 1218305 1185409 1167764 1144076 1131642 1121090 1107784 1100607 1128866 1145003 1160867 1150245
19323A150245o209L6486J3486P114K2299m439J8680N1895O3361Q9103R3645J14821
$$ 1150245 1144036 1180522 1194008 1201122 1223421 1218982 1237662 1289557 1352918 1442021 1535666 1650487
19311A650487J15834O5832R0502J13620R0838M6027Q069J4248J933L2167O2981
$$ 1650487 1766321 1832153 1922655 2036275 2127113 2173140 2181209 2195457 2197390 2229557 2292538
19300B292538J18538J80667J73453J88474K18596K22198J75104J82390K09715
$$ 2292538 2411076 2591743 2765196 2953670 3172266 3394464 3569568 3751958 3961673
19291C961673K46586L03085L95249N50488Q00328J155449J600502K127538K673731
$$ 3961673 4208259 4511344 4906593 5457081 6257409 7412858 9013360 11140898 13814629
19282A3814629L346926M209704N372764P056721R710148J3957042J8282569J8063535
$$ 13814629 17161555 21371259 26744023 33800744 43510892 57467934 75750503 93814038
19274I3814038J5073914J4324718J1722430K964960n548313r277227j1968255
$$ 93814038 108887952 123212670 134935100 137900060 132351747 123074520 111106265
19267A11106265j5164987j6482392j4902131j2227576r564339p117580n237814
$$ 111106265 95941278 79458886 64556755 52329179 42764840 35647260 30409446
19260C0409446m016088l212971k669284k262743j950915j635402j327938j068354
$$ 30409446 26393358 23180387 20511103 18248360 16297445 14662043 13334105 12265751
19252A2265751q95865q02167o87171n73295n16958m85348m14509l01428k33337
$$ 12265751 11369886 10567719 9880548 9307253 8790295 8304947 7890438 7589010 7355673
19243G355673j67704j09031j5067O7824R5446J17406J56223J92506K37083L46455
$$ 7355673 7187969 7078938 7063871 7131695 7227141 7344547 7500770 7693276 7930359 8276814
19233H276814N46522Q44723J237564J721379K326845L062498L880689M839248
$$ 8276814 8823336 9668059 10905623 12627002 14953847 18016345 21897034 26736282
19225B6736282O138527Q025155J1052296J5893595K1290525K1858851J8282788
$$ 26736282 32874809 40899964 51952260 67845855 89136380 110995231 129278019
19218A29278019J6953457J4634512M852284n812714j0866349j4005661j7849812
$$ 129278019 146231476 160865988 165718272 159905558 149039209 135033548 117183736
19211A17183736j9838787j8262543j5083092j1919108q899852o492161m932723
$$ 117183736 97344949 79082406 63999314 52080206 43180354 36688193 31755470
19204C1755470m012485l420984k959639k583982k205149j852581j536980j227949
$$ 31755470 27742985 24322001 21362362 18778380 16573231 14720650 13183670 11955721
19196A1955721j009626p91074o83925o89003o52577o07262n93926n92287n67193
$$ 11955721 10946095 10155021 9471096 8782093 8129516 7522254 6928328 6336041 5768848
19187E768848m96247m07127l18032k49002k38908k11827j85850k28078k52433
$$ 5768848 5272601 4865474 4547442 4298440 4059532 3847705 3661855 3433777 3181344
19178C181344k57617k40512k48838k31808j97993j77486j67516j05681q6176r9986
$$ 3181344 2923727 2683215 2434377 2202569 2004576 1827090 1659574 1553893 1467717 1367731
19168A367731n6131m0556o7488n2251p695O663R732M2815K5435J4513J1189k974
$$ 1367731 1311600 1271044 1203556 1151305 1143610 1150273 1160005 1202820 1228255 1242768 1253957 1250983
19156A250983k6423m9409l4893K7q696o577J2843L9757L6336M444L024K0654l7807
$$ 1250983 1224560 1175151 1140258 1140285 1131589 1125012 1137855 1177612 1213948 1218392 1221416 1242070 1204263
19143A204263n9442o0779n3078n0652m7745o5061p0833m9117m9776n2398l8132
$$ 1204263 1144821 1084042 1030964 980312 932567 867506 796673 747556 697780 645382 607250
19132F07250m6058m1294l6310l6621m3260j5484q826l147j8916k3854k2629j1692
$$ 607250 561192 519898 483588 446967 403707 388223 379397 376250 357334 333480 310851 299159
19120B99159q27o788j5337l4315m2006l020r075N618r575l849J4310j1767o031
$$ 299159 298332 291544 276207 241892 199886 196866 187791 193409 183834 179985 194295 182528 176497
19107A76497K5416M0984K0850K1285J2465p95P216J2670L5369J1262P711N839
$$ 176497 201913 242897 263747 285032 297497 296702 303918 316588 351957 363219 370930 376769
19095C76769J0994L4528K2979J7168J7413K8314o063j5535l2903j4086k5646k8713
$$ 376769 387763 422291 445270 462438 479851 508165 502102 486567 453664 439578 413932 385219
19083C85219q180l5672k8976m765L156N00o646j313Q75N775o891J0066p769Q256
$$ 385219 377039 341367 312391 307626 310782 311282 304636 303323 304198 309973 303082 313148 305379 313635
19069C13635J0627j8907j9996m498M626p25j7829j1653k4962k7422j4004j9070
$$ 313635 324262 305355 285359 280861 285487 284762 266933 255280 230318 202896 188892 169822
19057A69822k0651j7527k0315M419k6036k5320j5799O134K6674K198j1040m446
$$ 169822 149171 131644 111329 115748 89712 64392 48593 54727 81401 83599 72559 68113
19045F8113K002Q173M958J7862Q79l2391J173M46j6830n904K5076L2551l610j5446
$$ 68113 70115 78288 83246 101108 101987 69596 70769 71215 54385 48481 73557 106108 102498 87052
19031H7052j5618l402J3719j3629K747K8886J5248L819J44o693J1919J9440L0102
$$ 87052 71434 68032 81751 68122 70869 99755 115003 118822 118966 112273 124192 143632 173734
19018A73734J8130L9550P9943O2254L5899O4257L7943p874l2161m8864m0024q2616
$$ 173734 191864 231414 311357 373611 409510 473767 511710 503836 471675 422811 382787 300171
19006C00171o6636l6934m0529k8625k9001l7316n0605k8970k7124j9820j2122
$$ 300171 233535 196601 156072 127447 98446 61130 10525 -18445 -45569 -65389 -77511
18995g7511L921J6628k124L715J9690K3788K773n668q75k4353k8481J5625K3752
$$ -77511 -73590 -56962 -59086 -55371 -35681 -11893 -9120 -14788 -15663 -40016 -68497 -52872 -29120
18982b9120J0590r910r754R850J3726J9459M2612M2248K6762k4467l221J5124
$$ -29120 -18530 -28440 -38194 -28344 -14618 4841 47453 89701 116463 91996 88775 103899
18970A03899K6052K9923L9583M9296P5568P4962O9120P7456J07199Q9668L2739
$$ 103899 129951 159874 199457 248753 324321 399283 468403 545859 653058 742726 775465
18959G75465K1867N8616J0226j9025p5737o5029o6903r0788r4163p4645o5063
$$ 775465 797332 855948 866174 847149 771412 706383 639480 548692 454529 379884 314821
18948C14821m4192l3144j1144l979k8605m4223m9149k1485J1610J4568k1099n468
$$ 314821 270629 237485 226341 222362 193757 149534 100385 78900 90510 105078 83979 78511
18936G8511K5217L0050L6189J3110J528L385l2254l2404k6712K12N227Q343J2992
$$ 78511 103728 133778 169967 183077 184605 187990 155736 123332 96620 96832 102059 110402 123394
18923A23394j8888K7142J6415j2485p327k5238k4037J4740J3342J1604N3474M8213
$$ 123394 104506 131648 148063 135578 128251 103013 78976 93716 107058 118662 172136 220349
18911B20349L8682O1119L8912L1260K1923p127R408p474k2429l6994j3732l1645
$$ 220349 259031 320150 359062 390322 412245 405118 414526 407052 384623 347629 333897 302252
18899C02252k3694j3355N31L3965p983l1696k2930o765k092q615J3385K6928J9773
$$ 302252 278558 265203 265734 299699 291716 260020 237090 230325 228233 219618 233003 259931 279704
18886B79704J8066R215k0362J3253O4144K5789M2981K0476L1446N3347L9961P5859
$$ 279704 297770 306985 286623 299876 364020 389809 432790 453266 484712 538059 578020 653879
18874F53879Q4396Q8813R3761J63840J67084J48783P7919L7960q130p04k4271
$$ 653879 738275 827088 920849 1084689 1251773 1400556 1478475 1516435 1508305 1507601 1483330
18863A483330l1703k1219k0831M0527O7156N2122L2446j0270l7233m8924r0863
$$ 1483330 1451627 1430408 1409577 1450104 1517260 1569382 1601828 1591558 1554325 1505401 1414538
18852A414538j07701j18989j35386j56945j40861j13696n9867m8571m4721n4989
$$ 1414538 1306837 1187848 1052462 895517 754656 640960 581093 532522 487801 432812
18842D32812l9464k0503j8401m0147k9595M920m6887j5033J0807M455j0826o03
$$ 432812 393348 372845 354444 314297 284702 289622 242735 227702 238509 242964 232138 231535
18830B31535j369r782J4536O755r75j3028j4634P420L5664K787J1265K0794M246
$$ 231535 230166 220384 234920 241675 240700 227672 213038 220458 256122 258909 270174 290968 295214
18817B95214M5534P6850P1121R6133O2747N626j752K2074L4823j1101j8753j8383
$$ 295214 340748 417598 488719 584852 647599 653225 651473 673547 708370 697269 678516 660133
18805F60133k1146r29N8329L5089J822k056m827m623j5019j7261l6446m9736l1974
$$ 660133 638987 638058 696387 731476 733298 731242 726415 721792 706773 689512 653066 603330 571356
18792E71356l5965k7910k3857N817q530j8557j2479l1836j3320R009j1041N633
$$ 571356 535391 507481 483624 489441 480911 462354 449875 418039 404719 413728 402687 408320
18780D08320M489N29P53J4238J1007J0514O71k8378J0023M0622M791M677M2488
$$ 408320 412809 413338 414091 428329 439336 449850 450521 422143 432166 472788 477579 482256 524744
18767E24744M1206J7574R986j049L29k5745j0499L554K2693K5621K2604L4312
$$ 524744 565950 583524 593510 592461 592790 567045 556546 560100 582793 608414 631018 665330
18755F65330N9395N4254K1773N385L107m0102l7019k5067n541j9803j1234k5732
$$ 665330 724725 778979 800752 806137 809244 769142 732123 707056 701515 681712 670478 644746
18743F44746R111N7377N2275L517K4019J2560l948k4757K7536L2968J3087K6566
$$ 644746 653857 711234 763509 767026 791045 803605 799657 774900 802436 835404 848491 875057
18731H75057J2574K5501L5195L0151M7167M1313L2469M6294O1995N3719O1973
$$ 875057 887631 913132 948327 978478 1025645 1066958 1099427 1145721 1207716 1261435 1323408
18720A323408R2483J40005J55060J01159Q8227R9365Q5792R1091J02041J16512
$$ 1323408 1415891 1555896 1710956 1812115 1900342 1999707 2085499 2176590 2278631 2395143
18710B395143J52203K45215L07521L44573L63558L74885M14301M85804N30042
$$ 2395143 2547346 2792561 3100082 3444655 3808213 4183098 4597399 5083203 5613245
18701E613245N75318P26025J019121J436415J871006K263765K575770L011433
$$ 5613245 6188563 6914588 7933709 9370124 11241130 13504895 16080665 19092098
18693A9092098L811747N147863P239912J0918920J6271521J7475013P817724J776284
$$ 19092098 22903845 28051708 35291620 46210540 62482061 79957074 87774798 89551082
18685H9551082K687923J832598l108726p512006p877747o299679l519687J680225
$$ 89551082 92239005 94071603 90962877 83450871 75573124 69273445 65753758 67433983
18677F7433983Q822050J3738727P625953q76562j240175j268213n086219j0206560
$$ 67433983 76256033 89994760 97620713 96744151 95503976 94235763 89149544 78942984
18669G8942984j1998956j1511116j0546640q479486n932935m083024l022660k474391
$$ 78942984 66944028 55432912 44886272 36406786 30473851 26390827 23368167 20893776
18661B0893776k199794k000235j726626j442700j217672j010733q26456o65305
$$ 20893776 18693982 16693747 14967121 13524421 12306749 11296016 10469560 9804255
18653I804255m90844m28943l79090l30244k45321j29337k9424J42338K31006M28362
$$ 9804255 9313411 8884468 8505378 8175134 7929813 7800476 7771052 7913390 8144396 8572758
18643H572758Q34018J298932J691250J953045K303376K958117M007992N641928
$$ 8572758 9406776 10705708 12396958 14350003 16653379 19611496 23619488 29261416
18635B9261416Q490809J2899820J4921633P614397J480647K055456J751835k039241
$$ 29261416 37752225 50652045 65573678 73188075 74668722 76724178 78476013 76436772
18627G6436772o075242o742782n506869l395372O08719O421813J1329275P541213
$$ 76436772 70361530 63618748 58111879 54716507 55325226 61747039 73076314 80617527
18619H0617527l91015j244477q77000l651768q176911j0024885r691328q980645
$$ 80617527 80226512 78982035 78105035 74453267 66276356 56251471 46560143 37579498
18611C7579498p389426n256542l588897k628804k175302j894679j675402j435246
$$ 37579498 30190072 24933530 21344633 18715829 16540527 14645848 12970446 11535200
18603A1535200j235747j077133r31445p97923o79966n84845n06684m61868m50886
$$ 11535200 10299453 9222320 8290875 7492952 6812986 6228141 5721457 5259589 4808703
18594D808703m05437l57811k68455k43818k32326k32901k27023k26312j90168
$$ 4808703 4403266 4045455 3777000 3533182 3300856 3067955 2840932 2614620 2424452
18585B424452j95105k00561k00984j58210j23406j15963r0972q9669q5530p2288
$$ 2424452 2229347 2028786 1827802 1669592 1546186 1430223 1339251 1249582 1164052 1091764
18575A091764p4013m1464n8133o4161m9935n8323k6771l0888m8744m6595Q968
$$ 1091764 1017751 976287 918154 853993 804058 745735 718964 688076 639332 592737 601705
18564F01705J094k1200k6918j5718J4907J6774o71N559L66Q875J8996M2848k542
$$ 601705 602799 581599 554681 538963 553870 570644 569973 575532 575898 584773 603769 646617 644075
18551F44075Q364J1018L475k2371j5555j7564k144n347K181L4865L5230R006k4651
$$ 644075 652439 663457 666932 644561 629006 611442 609298 603951 606132 640997 676227 685233 660582
18538F60582j447K9956j2114m2181m0621m8822m6043m6308l9475l5619k5042o272
$$ 660582 659135 689091 676977 634796 594175 545353 499310 453002 413527 377908 352866 346594
18526C46594k1127q132R151l848j2884m3018l4427k3624m2929K0118K5366o509
$$ 346594 325467 317335 326486 322638 309754 266736 232309 208685 165756 185874 211240 204731
18514B04731k1170j2954j1634l859Q368J1062R646o742k5520o641J8869l073j5888
$$ 204731 183561 170607 158973 155114 163482 174544 184190 177448 151928 145287 164156 161083 145195
18501A45195o191L5500K9950J046j2169K4260J3175J6189q042J9595J8918j9384
$$ 145195 139004 174504 204454 205500 193331 217591 230766 246955 238913 258508 277426 258042
18489B58042m2765j8905L279J3186j1623L407J6053j633J1286p730j0322k7246
$$ 258042 215277 196372 199651 212837 201214 204621 220674 219041 230327 222597 212275 185029
18477A85029j3094o095j6874j3577k1511k790L563K2712J5267j5102l3707l8747
$$ 185029 171935 165840 148966 135389 113878 111088 114651 137363 152630 137528 103821 65074
18465F5074Q77J4263M832j271q351J9642J7265O043p977L32P214k692J7002J7482
$$ 65074 65951 80214 85046 83775 75424 95066 112331 118374 110397 110729 117943 115251 132253 149735
18451A49735j0930K778r629r185k418j4419k5984j1614J0556J8318r341j3042
$$ 149735 138805 141583 131954 122769 120351 105932 79948 68334 78890 97208 87867 74825
18439G4825J6604J7504M106l7526m2025q802Q483m10J701K5548J4324n004k859
$$ 74825 91429 108933 113039 75513 33488 24686 33169 32759 34460 60008 74332 69328 66469
18426F6469J5657K1008M131R75J844k7018q356j1239k3653j6200m396R128k2914
$$ 66469 82126 103134 107265 108240 110084 83066 74710 63471 39818 23618 19222 28350 5436
18413E436J0331K9937M6654L2572K3146n395l1328k4297j897m59p262j3773J5851
$$ 5436 15767 45704 92358 124930 148076 142681 111353 87056 85159 84700 77438 63665 79516
18400G9516J3546k114K2275o063j9936j1729j4543j1954j0158J2745j9038n030
$$ 79516 93062 90948 113223 107160 87224 75495 60952 48998 38840 51585 32547 27517
18388B7517p180j3928L875K7702K6423N464J3097L2806K4756L2972J6907J0785
$$ 27517 20337 6409 10284 37986 64409 69873 82970 115776 140532 173504 190411 201196
18376B01196Q430j503j859J1768K1272L5829M3277K1508R777r054o090J3623K2392
$$ 201196 209626 208123 206264 218032 239304 275133 318410 339918 349695 340641 334551 348174 370566
18363C70566j3470l6804l3405j8081k6742k3209k4499k1845j7692l316k4721k7355
$$ 370566 357096 320292 286887 268806 242064 218855 194356 172511 154819 151503 126782 99427
18351I9427J8007L3512q961j3438k66j3395l1187l9249j3439m984K703q664M1225
$$ 99427 117434 150946 141985 128547 128281 114886 83699 44450 31011 26027 28730 20066 61291
18338F1291J9586k1390L320O731p690q880o418j9620o054J556o10L1889M5158
$$ 61291 80877 59487 62807 69538 61848 52968 46550 26930 20876 22432 21822 53711 98869
18325I8869M8189n686k0735r630J3699J5080l0759k2887m819J5819K6399J3667
$$ 98869 147058 141372 120637 111007 124706 139786 109027 86140 81321 97140 123539 137206
18313A37206J4384J2619p220R747J9227K2890r071j3029j7555k5706j4448l1349
$$ 137206 151590 164209 156989 166736 185963 208853 199782 186753 169198 143492 129044 97695
18301I7695k1945J1126r398Q650J1247J1293j1246J2887p473k7929K941r455q292
$$ 97695 75750 86876 77478 86128 97375 108668 97422 110309 102836 74907 77848 68393 60101
18288F0101L438j2562q74k919J2796n551N202K2525m022n595j5825r184q661K937
$$ 60101 63539 50977 50103 47184 59980 54429 59631 82156 78134 72539 56714 47530 38869 41806
18274D1806J4266K2094j2325j1078J1614K4002j0867k2703j807r897Q037M578
$$ 41806 56072 78166 65841 54763 66377 90379 79512 56809 55002 45105 53142 57720
18262E7720K1746J8188j7522J7519M950k372J7213l84k3454o159k323j7796r848
$$ 57720 79466 97654 80132 97651 102601 100229 117442 117058 93604 87445 85122 67326 57478
18249E7478k354L223M457j9146n750L417O838P403j83J5558L91P153J266o329
$$ 57478 55124 58347 62804 43658 37908 41325 48163 55566 55383 70941 71332 78485 79751 73422
18235G3422j3553J5455N821J3110m091j0648K924j837J2542oq779Q895j48K7639
$$ 73422 59869 75324 81145 94255 90164 79516 82440 80603 93145 93139 84360 93255 93107 120746
18221A20746L6469N592l0678j4028J3878M483k2296k1687J77J6467k64p967J7893
$$ 120746 157215 162807 132129 118101 131979 136462 114166 92479 92656 109123 108859 100892 118785
18208A18785J5242j1311K9391K2142l996j0102j3142j3574k8057k8592Q486J3726
$$ 118785 134027 122716 152107 174249 170253 160151 147009 133435 105378 76786 85272 98998
18196I8998j968o339r494J325j3150N658J5336Q972m467J9555k7776m2480j2336
$$ 98998 97030 90691 81197 82522 69372 75030 90366 99338 94871 114426 86650 44170 31834
18183C1834J2633J7254J0457O143j6669n743J0651J4469O873n085M215k501J8403
$$ 31834 44467 61721 72178 78321 61652 55909 66560 81029 87902 82817 87032 84531 102934
18170A02934m16l0307m511L0027K5644J6807l052J3306L3263L7446K5238J5515
$$ 102934 102518 72211 67700 97727 123371 140178 137126 150432 183695 221141 246379 261894
18158B61894L8297Q5937R6847P1787K2854J6872N4031j8616n6258j8311k6595
$$ 261894 300191 386128 482975 554762 577616 594488 648519 629903 573645 555334 528739
18147E28739l4363j9629N0700O3101P1832L6262O06j514k1149m9007l4524n0070
$$ 528739 494376 474747 525447 588548 660380 696642 697248 695734 674585 625578 591054 540984
18135E40984o1648o927L6920K9827P866M579J3311L1511N3764N0110N7685Q1482
$$ 540984 479336 472409 509329 539156 547022 551601 564912 596423 650187 700297 757982 839464
18123H39464Q3826J03254J61842K62800L46993M98608O63040P76557R38121J172746
$$ 839464 923290 1026544 1188386 1451186 1798179 2296787 2959827 3736384 4674505 5847251
18113E847251J595285K219102L232321M841788O334610L917471O55880K01450
$$ 5847251 7442536 9661638 12893959 17735747 24070357 27987828 28643708 28845158
18105B8845158k411338n777629n518259l561965j949691j261584j092408q96787
$$ 28845158 26433820 20656191 15137932 11575967 9626276 8364692 7272284 6375497
18097F375497p22625n99238n35875n09489m72458m27678l51505k81709k18980
$$ 6375497 5652872 5053634 4517759 4008270 3535812 3108134 2756629 2474920 2255940
18088B255940k04938j75729j33242j45535j41160j20347j55801j26189j28070
$$ 2255940 2051002 1875273 1742031 1596496 1455336 1334989 1179188 1052999 924929
18079I24929j00167o2993q2319o3855o4422l1777n4208m3278l6343j3041j8830
$$ 924929 824762 761769 679450 615595 551173 519396 465188 421910 385567 372526 353696
18068C53696m5717n7696k4300q164l485P540j510l0020k6760l0010M983l3009
$$ 353696 307979 250283 225983 217819 214334 221874 220364 190344 163584 133574 138557 105548
18056A05548j0965J9419k1502j4512Q608O27k6665K313J0360N326j9555m8476
$$ 105548 94583 114002 92500 77988 86596 87223 60558 62871 73231 78557 59002 10526
18044A0526j3017j0310m594J4626K8005J9726J0041N818K638j6319m665q708K504
$$ 10526 -2491 -12801 -17395 -2769 25236 44962 55003 60821 63459 47140 42475 33767 36271
18031C6271k1350k1035O044K8903J1212O191N023j1600n638k397o021k8518l4265
$$ 36271 14921 -6114 -70 28833 40045 46236 51259 39659 34021 31624 25603 -2915 -37180
18018c7180j5767n369K8449M8452K1386R639k8157l4393k7619R617K213K0983
$$ -37180 -52947 -58316 -29867 18585 39971 49610 21453 -12940 -40559 -30942 -28729 -7746
18006g746J5301J3942k770P836J938j9554o008L621r059J7740J4523j1111N10
$$ -7746 7555 21497 18727 26563 28501 8947 2939 6560 -2499 15241 29764 18653 19163
17993A9163m932l1111K0218J6894j0375l4274P25J2919j215j6843o293K3072J2404
$$ 19163 14231 -16880 3338 20232 9857 -24417 -23692 -10773 -11988 -28831 -35124 -12052 352
17980C52J501p538j4488N515J3868m674j1855Q058N923j4973q657M838j929k577
$$ 352 1853 -5685 -20173 -14658 -790 -5464 -17319 -9261 -3338 -18311 -26968 -22130 -24059 -26636
17966b6636J9690p049o84K7032P882Q298P661k3449J626N157L259o149K574J9871
$$ -26636 -6946 -13995 -14679 12353 20235 28533 36194 12745 14371 19528 22787 16638 19212 39083
17952C9083j1719j7769J2456j0775k0920M109L195j3973n745O328j3291J901J1273
$$ 39083 27364 9595 22051 11276 -9644 -5535 -2340 -16313 -22058 -15730 -29021 -27120 -15847
17939a5847J1096K3373j4666l280l263J7156K0141Q296j0266J6965J3682k8681
$$ -15847 -4751 18622 3956 676 -2587 14569 34710 43006 32740 49705 63387 34706
17927C4706k0894R840K1066p887o656k708q172k3390j0377Q628j0228J9802j331
$$ 34706 13812 23652 44718 36831 30175 27467 19295 -4095 -14472 -5844 -16072 3730 2399
17914B399l4695j0756J0063Q001O991L015J1114O66r977O962o223j4845k3148
$$ 2399 -32296 -43052 -32989 -24988 -17997 -14982 -3868 -3202 -13179 -6217 -12440 -27285 -50433
17901e0433j1659M5624L3687j451j0196j839j46N150K3447o41k9874j165J3225
$$ -50433 -62092 -16468 17219 15768 5572 3733 3587 8737 32184 31543 1669 504 13729
17888A3729J059j6373j1000J0053j091J5733J279J8794j6508k2874m938Q411p000
$$ 13729 14788 -1585 -12585 -2532 -3623 12110 13389 32183 15675 -7199 -12137 -3726 -10726
17875a0726J5006J6154J620R531p74k4081j3965j3713r739n319k293J0905Q113
$$ -10726 4280 20434 22054 31585 30811 6730 -7235 -20948 -30687 -36006 -38299 -27394 -19281
17862a9281r46J83M856J2698P980Q887K4106O337l7501m3628n175J9499K0503
$$ -19281 -20227 -20044 -15188 -2490 5490 14377 38483 44820 7319 -36309 -41484 -21985 -1482
17849a482R735q278J483j8500k6637R754l386J1835r048m156K82j014J1682j905
$$ -1482 8253 -25 1458 -17042 -43679 -33925 -37311 -25476 -34524 -38680 -38398 -39412 -27730 -29635
17835b9635k865L5521K0678Q057L744k4261k577o189K1440j323K9412L0128P180
$$ -29635 -32500 3021 23699 31756 35500 11239 8662 2473 23913 22590 52002 82130 89310
17822H9310J64k5592j3375R165n123p352j1470O677K93j3911j1694j6175l1590
$$ 89310 89474 63882 50507 59672 54549 47197 35727 42404 42697 28786 17092 917 -30673
17809c0673j0338J3434J730N934J2641K4108Q110r396M012K210J0917N180j500
$$ -30673 -41011 -27577 -25847 -19913 -7272 16836 24946 15550 19562 21772 32689 37869 36369
17796C6369j6825K541k285K104L596r403K753M003K1152J4939K0239j2148l2814
$$ 36369 19544 22085 19800 21904 25500 16097 18850 22853 44005 58944 79183 67035 34221
17783C4221l7232j6087K1015L7168q063k2449N471J733o924R847R916j8448o365
$$ 34221 -3011 -19098 1917 39085 31022 8573 14044 15777 8853 18700 28616 10168 3803
17770C803j5739j7837O818L1656K6065l194O755j7074r078k2024l1323j573K6544
$$ 3803 -11936 -29773 -22955 8701 34766 31572 38327 21253 12175 -9849 -41172 -42745 -16201
17757a6201k832k0115J1556Q776m703j3216Q617L5117K5831J7738K447n791l3995
$$ -16201 -19033 -39148 -27592 -18816 -23519 -36735 -28118 6999 32830 50568 53015 47224 13229
17744A3229k4758r055Q859j7750j1829N411j3632J354O113J2538Q90r03J3349
$$ 13229 -11529 -20584 -11725 -29475 -41304 -35893 -49525 -48171 -42058 -29520 -28630 -29533 -16184
17731a6184q011l031p398n293r39K935J8367K4066q921j9775j3026J0958K282
$$ -16184 -24195 -27226 -34624 -39917 -40856 -37921 -19554 4512 -4409 -24184 -37210 -26252 -23970
17718b3970L231J1746M883L583m290J1642J3978L213M057J4902j848k5598j8499
$$ -23970 -20739 -8993 -4110 -527 -4817 6825 20803 24016 28073 42975 41127 15529 -2970
17705b970k3836j1727Q627L252Q420L868j4639j5224K4811K9353J4223J1351j1790
$$ -2970 -26806 -38533 -29906 -26654 -18234 -14366 -29005 -44229 -19418 9935 24158 35509 23719
17692B3719j6384j7872o371r543p367j14J0970R090J4011l224O999p710J235q453
$$ 23719 7335 -10537 -16908 -26451 -33818 -33932 -22962 -13872 139 -3085 3914 -3796 -2561 -11014
17678a1014k1819o909k975J8980J0631J5745j4598j0368K230j5845P97M065N25
$$ -11014 -32833 -39742 -42717 -23737 -13106 2639 -11959 -22327 -20097 -35942 -35145 -31080 -30555
17665c0555J8441J8711L5988J5387J5922o865o869J1558J6499J1386J5143K628
$$ -30555 -12114 6597 42585 57972 73894 67029 60160 71718 88217 99603 114746 117374
17653A17374j4446k1297j4343P778J1128K958l7799k6705K863k48m3706k581L6896
$$ 117374 102928 81631 67288 75066 86194 89152 51353 24648 27511 27263 -16443 -19024 17872
17640A7872L335J165r98k5297m593p052o117p636j0233j751J5734K492k696q884
$$ 17872 21207 22372 21374 -3923 -8516 -15568 -21685 -29321 -39554 -41305 -25571 -23079 -25775 -34659
17626c4659j227j737Q467J8585J1936k151m783O74P547P261R294j6891m551J5126
$$ -34659 -35886 -37623 -29156 -10571 1365 -786 -5569 -4895 2652 9913 19207 2316 -2235 12891
17612A2891J533l5925k0270l756K758J8841J4967q117J7781r36J2433j0264k1999
$$ 12891 14424 -21501 -41771 -45527 -42769 -23928 -8961 -17078 703 -233 12200 1936 -20063
17599b0063R857J3201l883J385k151k6909K619n907m833K2629N220j3292l2937
$$ -20063 -10206 2995 -888 497 -1654 -28563 -25944 -31851 -36684 -14055 -8835 -22127 -55064
17586e5064p950J9878K3731J5092O910j6382j5931j5556P076K8185L059r239O235
$$ -55064 -63014 -43136 -19405 -4313 2597 -13785 -29716 -45272 -38196 -10011 -6952 -16191 -9956
17573i956P625L833o743J5321M319N696j8270m623O388k6206j4290J3525L298
$$ -9956 -2331 1502 -5241 10080 14399 20095 1825 -2798 3590 -22616 -36906 -23381 -20083
17560b0083J765j5889J7078K8216r697k7401l395j4257P035K8222J7997O507k0809
$$ -20083 -18318 -34207 -17129 11087 1390 -26011 -29406 -43663 -36628 -8406 9591 16098 -4711
17547d711l535o760j0184P504j0755n75O217K462R347k5421j4316J4238J6281
$$ -4711 -8246 -15006 -25190 -17686 -28441 -29016 -22799 -20337 -10990 -36411 -50727 -36489 -20208
17534b0208m592j0154J9652O148j1653K561K0036J618k685O223j7020j5182J6419
$$ -20208 -24800 -34954 -15302 -9154 -20807 -18246 1790 3408 723 6946 -10074 -25256 -8837
17521h837J1121k9293q104J1905j385K280J3713L699q576k587n593R685R380R96
$$ -8837 2284 -27009 -35113 -23208 -24593 -22313 -8600 -4901 -13477 -16064 -21657 -11972 -2592 -1596
17507a596j16j0824k1857k670J051m572j8829J2639M555j7285N832L168l047j5155
$$ -1596 -1712 -12536 -34393 -37063 -36012 -40584 -59413 -46774 -42219 -59504 -53672 -50504 -53551 -68706
17493f8706q497K8086K717k1437j489J4918J7993J3920M887k348j4627R530q90
$$ -68706 -77203 -49117 -46400 -67837 -69326 -54408 -36415 -22495 -17608 -19956 -34583 -25053 -25943
17480b5943m641J8208o950j7062J8016L6041J1386j9764j0869k2551n82J2368
$$ -25943 -30584 -12376 -19326 -36388 -18372 17669 29055 9291 -1578 -24129 -24711 -12343
17468a2343J2664j0519m162K4309l383k6109k473J9009J687k629j0708q945j9765
$$ -12343 321 -10198 -14360 9949 6566 -19543 -22016 -3007 -1320 -3949 -14657 -23602 -43367
17455d3367J4M2439L7085J9599r016o623j2400k4667p852K8431J1237K7663M3322
$$ -43367 -43353 -914 36171 55770 46754 40131 27731 3064 -4788 23643 34880 62543 105865
17442A05865K3994q451j9762M255j9439j9787J90P399j1683n924o940q474k2234
$$ 105865 129859 121408 101646 105901 86462 66675 66865 74264 62581 56657 49717 41243 19009
17429A9009K066j0912k6578p025K3853o704j3793q010r184J8965L991n311j1022
$$ 19009 21075 10163 -16415 -23440 413 -6291 -20084 -28094 -37278 -18313 -14322 -19633 -30655
17416c0655Q43J5856K096J3504j3830j2870k3860q831J9787J0062L729K2167p189
$$ -30655 -29812 -13956 -11860 1644 -12186 -25056 -48916 -57747 -37960 -27898 -24169 -2002 -9191
17403i191o857J2536j1549j4827Q05j327J3186K7132J2736J030r800p708j5339
$$ -9191 -16048 -3512 -15061 -29888 -29083 -30410 -17224 9908 22644 23674 13874 6166 -9173
17390i173k7909l9857K7186L7982L2173k32k8498j0829J253J1602K5137L270n861
$$ -9173 -37082 -76939 -49753 -11771 20402 20170 -8328 -19157 -17904 -6302 18835 22105 16244
17377A6244K649j0449k2894j4929P797O780J0301L4q584m665J3091J0113m272
$$ 16244 18893 8444 -14450 -29379 -21582 -14802 -4501 -4467 -13051 -17716 -4625 5488 1216
17364A216L04J5703r456j8960k9588Q113m713r526R955K0054J791j345j1807Q377
$$ 1216 1520 17223 7767 -11193 -40781 -32668 -37381 -46907 -36952 -16898 -15107 -16452 -28259 -19882
17350a9882J6405r737L160J3705Q015l605Q097r898l0436J1154J8193R380J3848
$$ -19882 -3477 -13214 -10054 3651 11666 8061 16158 6260 -24176 -13022 5171 14551 28399
17337B8399p939J7182m301k102J7745M277j181l283p683N663K1255r662k363q953
$$ 28399 20460 37642 33341 31239 48984 53261 52080 48797 41114 46777 68032 58370 56007 47054
17323D7054k7774j858o697O716j4248m23L1204L701j0408q208N57j6722j0162
$$ 47054 19280 17422 10725 17441 3193 2770 33974 37675 27267 19059 19616 2894 -7268
17310g268Q923K2143O901k0483j8297j3900O209K2053j405o722P78k611j8090
$$ -7268 1655 23798 30699 10216 -8081 -21981 -15772 6281 4876 -1846 -1068 -3679 -21769
17297b1769q919J7673Q512j0989K0386J5058J2423K4714J4508j9890r542j9173
$$ -21769 -30688 -13015 -4503 -15492 4894 19952 32375 57089 71597 51707 42165 22992
17285B2992p70q818q582J0588O736J4996N893M744Q578n600o465k0794J3698K938
$$ 22992 22222 13404 4822 15410 22146 37142 43035 47779 56357 50757 44292 23498 37196 40134
17271D0134q447k7483k4722j0975J7903L14j365q799j4061j0980J2530J3913p141
$$ 40134 31687 4204 -20518 -31493 -13590 -13276 -14641 -23440 -37501 -48481 -35951 -22038 -29179
17258b9179J5015J2355J2973j425j2051P370m860j8268k2392Q387p030K1712Q560
$$ -29179 -14164 -1809 11164 9739 -2312 5058 198 -18070 -40462 -32075 -39105 -17393 -8833
17245h833J1807L514J4084J8545l1383k5575Q158L433l80p231P441L074j1905
$$ -8833 2974 6488 20572 39117 7734 -17841 -9683 -6250 -6630 -13861 -6420 -3346 -15251
17232a5251p237p745J3938j641P174p586J1054J3155N673j741J671j9555j6975
$$ -15251 -22488 -30233 -16295 -17936 -10762 -18348 -7294 5861 11534 9793 11464 -8091 -25066
17219b5066l132J1087O5j786P8j5422p257M509k5699j3455J1617J4654M0516Q24
$$ -25066 -28198 -17111 -17046 -18832 -18754 -34176 -41433 -36924 -62623 -76078 -64461 -49807 -9291 -8467
17205h467P130k4933j6226J8448O447o217j3376j5347R833K9370K832N207R345
$$ -8467 -1337 -26270 -42496 -24048 -17601 -23818 -37194 -52541 -42708 -13338 -10506 -5299 4046
17192D046j849J746j2191m79l597M848L961l941l2177j8491o6J1499N52L569p313
$$ 4046 2197 3943 -8248 -8727 -12324 -7476 -3515 -7456 -39633 -58124 -58190 -46691 -46139 -42570 -49883
17177d9883o729n082Q169m36k338J1831K1141J0454m113k344N4j7126j7757j0386
$$ -49883 -56612 -61694 -53525 -53961 -56299 -44468 -23327 -12873 -16986 -19330 -19276 -36402 -54159 -64545
17163f4545j559J0302K3074K3592j3726J4040j3008L22R045m364R775r88j1468
$$ -64545 -66104 -55802 -32728 -9136 -22862 -8822 -21830 -21508 -12463 -16827 -7052 -8040 -19508
17150a9508j1419l633J1458M616l1877p525K0230J4795l708j0908J8387L592j6474
$$ -19508 -30927 -34560 -23102 -18486 -50363 -57888 -37658 -22863 -26571 -37479 -19092 -15500 -31974
17137c1974k1741p353J8762J2823J2366K779Q196j0551j2384q043P958J628m22
$$ -31974 -53715 -61068 -42306 -29483 -17117 -14338 -6142 -16693 -29077 -37120 -29162 -27534 -27956
17124b7956k152j201j3170K517M2513L89k2647k9056K4265j219Q172J0216k5088
$$ -27956 -30108 -31309 -44479 -41962 551 940 -21707 -50763 -26498 -27717 -19545 -9329 -34417
17111c4417j0175Q499K3394K7932o209r405k992J6670j892k0620L549n270R030
$$ -34417 -44592 -36093 -12699 15233 9024 -381 -3373 13297 11405 -9215 -5666 -10936 -1906
17098a906j44j1611J0579R91j531L0678l974m3327l6680J0678J9597n278J5513
$$ -1906 -2050 -13661 -3082 -2091 -3622 27056 23082 -20245 -56925 -46247 -26650 -31928 -16415
17085a6415M885j4951O49r797p549K4477L2797L639j6019O567J472r780K432J715
$$ -16415 -11530 -26481 -25832 -35629 -43178 -18701 14096 17735 1716 8283 9755 -25 2407 4122
17071D122k8791k446l785J9287J0077Q451K7938j3554j6016R880M627j631O605
$$ 4122 -24669 -27115 -30900 -11613 -1536 6915 34853 21299 5283 15163 19790 18159 24764
17058B4764j233Q239l332j3679k6446O336m637Q670J4018l533o787O440j0686
$$ 24764 23531 31770 28438 14759 -11687 -5351 -9988 -1318 12700 9167 2380 8820 -1866
17045a866L3465j4541k3201r368j4101K3623J4821o006p595j3721J8131J7321
$$ -1866 31599 17058 -6143 -15511 -29612 -5989 8832 2826 -4769 -18490 -359 16962
17033A6962j1259k5107m039J6118J8462n229j6578N899n372n594n496J3735K338
$$ 16962 5703 -19404 -23443 -7325 11137 5908 -10670 -4771 -10143 -15737 -21233 -7498 -5160
17020e160J1866Q285j3691K766k695K0299L0056l0917k0748j518Lk112l834q999
$$ -5160 6706 14991 1300 4066 1371 21670 51726 20809 61 -1457 -1454 -3566 -7400 -16399
17006a6399j0916j3982J1077j604J6377n829J3520L622j3104j7616m699J2122
$$ -16399 -27315 -41297 -30220 -31824 -15447 -21276 -7756 -4134 -17238 -34854 -39553 -27431
16994b7431J7833J467j3921K6169L6399j4621k6580j2842k4656M512k559K1906
$$ -27431 -9598 -8131 -22052 4117 40516 25895 -685 -13527 -38183 -33671 -36230 -14324
16982a4324L4317Q998k548j4949j0655Q336j1216o012j4126j5835J1259K5061
$$ -14324 19993 28991 26443 11494 839 9175 -2041 -8053 -22179 -38014 -26755 -1694
16970a694r454j3998q697O543o194k482M546K3123P640j5202p339P776j6181k4586
$$ -1694 -11148 -25146 -33843 -27300 -33494 -35976 -31430 -8307 -667 -15869 -23208 -15432 -31613 -56199
16956e6199J537Q72l550K23J4264j788n800m820Q283K6374J0054k327p610q241
$$ -56199 -54662 -53790 -57340 -57117 -42853 -44641 -50441 -55261 -46978 -20604 -10550 -12877 -20487 -28728
16942b8728l4858j1074J5874J2853K1003P650k308m911j6959J276J4884L255N641
$$ -28728 -63586 -74660 -58786 -45933 -24930 -17280 -19588 -24499 -41458 -40182 -25298 -22043 -16402
16929a6402P11q660L46j0686P76M193j554J7269P85K1958j881j1053q458j4986
$$ -16402 -15691 -24351 -24005 -34691 -33915 -29722 -31276 -14007 -13222 8736 6855 -4198 -12656 -27642
16915b7642k0919l313K2956K342j6210m400J1258J5284K6008N386M212j5058k5855
$$ -27642 -48561 -51874 -28918 -26576 -42786 -47186 -35928 -20644 5364 10750 14962 -96 -25951
16902b5951N564J6110K4508K9436M139m448k0416k8358N894k290k4196K2690J1035
$$ -25951 -20387 -4277 20231 49667 53806 49358 28942 584 6478 4188 -20008 2682 13717
16889A3717r20J5890j492j7919k0340k4438p115J6390K6239N017J0919j1402j6806
$$ 13717 12797 28687 27195 9276 -11064 -35502 -42617 -26227 12 5029 15948 4546 -12260
16876a2260L5551j4931k8644M890P386o232j2381n628J9508k243J9030R629k1727
$$ -12260 23291 8360 -20284 -15394 -8008 -14240 -26621 -32249 -12741 -14984 4046 13675 -8052
16863h052k0413J3701l015j8550m726K3083P602L788K802R386r877k1860j2927
$$ -8052 -28465 -14764 -17779 -36329 -41055 -17972 -10370 -6582 -3780 5606 -4271 -26131 -39058
16850c9058J2078J9323j2253k038N884K4600M763k6407j225r76O285P878q063
$$ -39058 -26980 -7657 -19910 -21948 -16064 8536 13299 -13108 -14333 -15309 -9024 -1146 -9209
16837i209J4213O233j6822k2972M523K6307L1727k2603k5853j5609j7545L02Q446
$$ -9209 5004 11237 -5585 -28557 -24034 2273 34000 11397 -14456 -30065 -47610 -47308 -38862
16824c8862O638J2792J8491O504J1903P441J435j0832o190k6190j4303m402N857
$$ -38862 -32224 -19432 -941 5563 17466 24907 26342 15510 9320 -16870 -31173 -35575 -29718
16811b9718k597j9580J0123J2072J899J7935J7812J307r95j3529l2000j1028M914
$$ -29718 -32315 -51895 -41772 -29700 -27801 -9866 7946 9253 8258 -5271 -37271 -48299 -43385
16798d3385M718J3050L5393J2675j4096j4654q535j4822N259l378p191K6363K0123
$$ -43385 -38667 -25617 9776 22451 8355 -6299 -14834 -29656 -24397 -27775 -34966 -8603 11520
16785A1520j6508k202J6738n930j6091J9347m563j1367J5914p912R124N112j0959
$$ 11520 -4988 -7190 9548 3618 -12473 6874 2311 -9056 6858 -1054 8070 13182 2223
16772B223j7528P955o358j0857q754n329Q449J3653O446J5537L5192j8112J299
$$ 2223 -15305 -7350 -13708 -24565 -33319 -38648 -30199 -16546 -10100 5437 40629 22517 23816
16759B3816K4234L1208K9000J0758J3850K9552K7368J3385K1239J6885J1803j7432
$$ 23816 48050 79258 108258 119016 132866 162418 189786 203171 224410 241295 253098 235666
16747B35666j7757j4050k2437j743j5792j4753l1518k282J3010k5799k088Q115
$$ 235666 217909 203859 181422 179679 163887 149134 117616 115334 128344 102545 100457 108572
16735A08572m686N408J660j5878r428l2945j9008K2035L9433J2000n157J5533
$$ 108572 103886 109294 110954 95076 85648 52703 33695 55730 95163 107163 102006 117539
16723A17539K5304K0440K2340K7069K7855K7894j4024k8025j3931k1366j4282
$$ 117539 142843 163283 185623 212692 240547 268441 254417 226392 212461 191095 176813
16712A76813l7470m687l04l0507l686J9771l0658l6115r026k1356Q38J1895n227
$$ 176813 139343 134656 134352 103845 100159 119930 89272 53157 44131 22775 23613 35508 30281
16699C0281j7861J364j2213K679J0805O683J3467m121k5904o524j503r408p985
$$ 30281 12420 13784 1571 4250 15055 21738 35205 31084 5180 -1344 -2847 -12255 -20240
16686b0240m759J7085K1653J1126j9277j8855J5290N090l947J4750P496j7347
$$ -20240 -24999 -7914 13739 24865 5588 -13267 2023 7113 3166 17916 25412 8065
16674H065k1304r096J3145j632p436j8430R050R073J4165o575m890o003k806o873
$$ 8065 -13239 -22335 -9190 -10822 -18258 -36688 -27638 -18565 -4400 -10975 -15865 -21868 -24674 -31547
16660c1547l657J395J0553k087M507J93L285k785m885J310O96j3010j3975k1200
$$ -31547 -35204 -33809 -23256 -25343 -20836 -20643 -17358 -20143 -25028 -23718 -23022 -36032 -50007 -71207
16646g1207K8553J0066j3928l369K811J4467N565j1246O950P292Q317k1266r441
$$ -71207 -42654 -32588 -46516 -49885 -47074 -32607 -27042 -38288 -31338 -24046 -15729 -36995 -46436
16633d6436M586K5026J6069p985J90Q024J988j2363M920R954j0632k5084o507
$$ -46436 -41850 -16824 -755 -8740 -8550 -526 1462 -10901 -5981 3973 -6659 -31743 -38250
16620c8250J486j1976K5354J1468N075k3451k7715L381K0923O735m239j3915J2835
$$ -38250 -36764 -48740 -23386 -11918 -6843 -30294 -58009 -54628 -33705 -26970 -31209 -45124 -32289
16607c2289K2824j623J4659k0781n495L793L012j171M0686L366k2623k113j9483
$$ -32289 -9465 -11088 3571 -17210 -22705 -18912 -15900 -17071 23615 26981 4358 2245 -17238
16594a7238N305j1733N02N528j0578q861Q75K4394J0673N510k5343j5425m299
$$ -17238 -11933 -23666 -23164 -17636 -28214 -37075 -36200 -11806 -1133 4377 -20966 -36391 -40690
16581d0690K608P170J9463P513o476J5161J0797j4283K920m901Q7J5894R664k153
$$ -40690 -38082 -30912 -11449 -3936 -10412 4749 15546 1263 4183 -718 -631 15263 24927 22774
16567B2774k5116M99j1491J337K3483k733k9068j6488K040p563K968J6986l332
$$ 22774 -2342 -1843 -13334 -11997 11486 8753 -20315 -36803 -34763 -42326 -39358 -22372 -25704
16554b5704L656N582k605j7295j8676O34n466J3854K346q938l0708Q591M6800
$$ -25704 -22048 -16466 -19071 -36366 -55042 -54408 -59874 -46020 -43674 -52612 -83320 -74729 -27929
16541b7929K72j3035r048J8242K8107J0960n375J1863O367j786L490k1952k914
$$ -27929 -27657 -40692 -49740 -31498 -3391 7569 2194 14057 20424 18638 22128 176 -2738
16528b738J289j0442m475O815j9376k498O788Q42j2460P287m494J3455j118M649
$$ -2738 -1449 -11891 -16366 -9551 -28927 -31425 -24637 -23795 -36255 -28968 -33462 -20007 -21125 -16476
16514a6476K3215K042k4544m231K0611j1163k0160p041p767J5573K2971J5115
$$ -16476 6739 8781 -15763 -19994 617 -10546 -30706 -37747 -45514 -29941 -6970 8145
16502H145r264r852p84j2692j567J6559N582j668j225j4309j3078K114J8149J7803
$$ 8145 -1119 -10971 -11755 -24447 -26014 -9455 -3873 -5541 -6766 -21075 -34153 -32039 -13890 3913
16488C913k86k3082p745m159J6344J0668j5932j1519K2477m407m6K4840P404j2450
$$ 3913 3627 -19455 -27200 -31359 -15015 -4347 -20279 -31798 -9321 -13728 -13774 11066 18470 6020
16474F020j0664J139k516O421q226j2241L895R578j6953J0752k782K362R07k2470
$$ 6020 -4644 -3505 -6021 400 -7826 -20067 -16172 -6594 -23547 -12795 -15577 -13215 -12308 -34778
16460c4778j6032J7479J6126j250J4151m499j8902k348k790m036P509Q103P146
$$ -34778 -50810 -33331 -17205 -18455 -4304 -8803 -27705 -30053 -32843 -36879 -29370 -21267 -14121
16447a4121L25J6964J5474q131J5845J6176j0559l5788j3423M339M1066J7516
$$ -14121 -13796 3168 18642 10511 26356 42532 31973 -3815 -17238 -12899 28167 45683
16435D5683j7330j7265m357k3983j9477K6580J3596j7441M47k6165P946L5387
$$ 45683 28353 11088 6731 -17252 -36729 -10149 3447 -13994 -13547 -39712 -31766 3621
16423C621p989k9756j0518K6818M876k166l232j8511J1873J2980o070j1085j3647
$$ 3621 -4368 -34124 -44642 -17824 -12948 -15114 -18346 -36857 -24984 -12004 -18074 -29159 -42806
16410d2806M104J6967J1567j1126k028R045k542j1341R175n099m228J6387j412
$$ -42806 -38702 -21735 -10168 -21294 -23322 -14277 -16819 -28160 -18985 -24084 -28312 -11925 -13337
16397a3337l38j8073j3369P028o42j5757N485L5068K685J9701M381j4741n208
$$ -13337 -13675 -31748 -45117 -38089 -38731 -54488 -49003 -13935 -11250 8451 12832 -1909 -7117
16384g117m628o744J3335q409L611N61J9984Q224O254j1384r247j9767j4104j0179
$$ -7117 -11745 -18489 -5154 -13563 -9952 -9391 10593 18817 25071 13687 4440 -15327 -29431 -39610
16370c9610o714k05o213J1034J5552K6447K987K1527q049k6010p492k765n832
$$ -39610 -46324 -46529 -52742 -41708 -26156 291 3278 24805 16756 -9254 -16746 -19511 -25343
16357b5343n500J3904P6K7097j8755j5956O474j1621J6143L1259n18o391p961
$$ -25343 -30843 -16939 -16863 10234 -8521 -24477 -18003 -29624 -13481 17778 17260 10869 2908
16344B908r684Q997L635n901k13K859r772j9471K99j0768j0503n9J1399L136m0294
$$ 2908 -6776 2221 5856 -45 -258 2601 -7171 -26642 -26343 -37111 -47614 -47673 -36274 -33138 -73432
16329g3432k2784M506L2021J6777R460J5594m07K361r83k5390R594j3407n062
$$ -73432 -96216 -91710 -59689 -42912 -33452 -17858 -18265 -15904 -16887 -42277 -32683 -46090 -51152
16316e1152J2479m351m605j2433J150r909J5659o713r180J814K274K1969M0221
$$ -51152 -38673 -43024 -47629 -60062 -58912 -68821 -53162 -59875 -69055 -67241 -64967 -42998 -2777
16303b777L1326K78k3324j6671R513q812k8738p418j214N676P494K2172Q587m712
$$ -2777 28549 28827 5503 -11168 -1655 -10467 -39205 -46623 -47837 -42161 -34667 -12495 -3908 -8620
16289h620J353l543J205o179j934L797o488p539J3048L5151l515j0970r15k4122
$$ -8620 -7267 -10810 -9605 -15784 -17718 -13921 -20409 -27948 -14900 20251 16736 5766 4851 -19271
16275a9271r363K373J389q385m629J1012L038J5764p32j2783j1007m285J4891
$$ -19271 -28634 -26261 -24872 -33257 -37886 -26874 -23836 -8072 -8804 -21587 -32594 -36879 -21988
16262b1988R158J2901k5981k1638J3589J9791J3588M717P318M317J3366j500j4383
$$ -21988 -12830 71 -25910 -47548 -33959 -14168 -580 4137 11455 15772 29138 27638 13255
16249A3255k1459J5851J7181l210k432m859M569o274r456n122j1431j8750j7339
$$ 13255 -8204 7647 24828 21618 19186 14327 18896 12622 3166 -1956 -13387 -32137 -49476
16236d9476M316J0117N555K5465r896k9503P14k489m0765J1912L6343K3674J3031
$$ -49476 -45160 -35043 -29488 -4023 -13919 -43422 -42708 -45197 -85962 -74050 -37707 -14033 -1002
16223a002N074o210k37J465k245k565J36r405J1930j9262l737k058M786n574O244
$$ -1002 4072 -2138 -2375 -910 -3155 -5720 -5584 -14989 -3059 -22321 -26058 -28116 -23330 -28904 -22660
16208b2660J5101q493p765K3398J6895k2560k178q385M970L020k3159L93j2850
$$ -22660 -7559 -16052 -23817 -419 16476 -6084 -8262 -16647 -11677 -8657 -31816 -31423 -44273
16195d4273j3944J0558L1088K5980j3294R183N298J1741j1713l1303j4478K344
$$ -44273 -58217 -47659 -16571 9409 -3885 5298 10596 22337 10624 -20679 -35157 -32813
16183c2813n50R888J6746k112r772K387j4178j6039J5130K7709j7341k3972J7506
$$ -32813 -33363 -23475 -6729 -8841 -18613 -16226 -30404 -46443 -31313 -3604 -20945 -44917 -27411
16170b7411K3294J5960k1312l9847j3277N022P624M213J6013J4715o886o996M801
$$ -27411 -4117 11843 -9469 -49316 -62593 -57571 -49947 -45734 -29721 -15006 -21892 -28888 -24087
16157b4087J7203J70o461P805J1104k1500j4527M899j2049q722K3674k88r101
$$ -24087 -6884 -6714 -13175 -5370 5734 -15766 -30293 -25394 -37443 -46165 -22491 -22779 -31880
16144c1880p273J8593N788P520P044m960J788J8636j2446l1398j184O197k683
$$ -31880 -39153 -20560 -14772 -7252 -208 -5168 -3380 15256 2810 -28588 -29772 -23575 -26258
16131b6258J9194n115j4848k0217j5867J3569L0109o624r402J7688J7595M951
$$ -26258 -7064 -12179 -27027 -47244 -63111 -49542 -19433 -26057 -35459 -17771 -176 4775
16119D775m656j6605l368K559k170j5815j8942K0961M006k163j7091J3721m631
$$ 4775 119 -16486 -19854 -17295 -19465 -35280 -54222 -33261 -29255 -31418 -48509 -34788 -39419
16106c9419P794k817J184J3381K9764n51l0359k2199j8016K5081J2034j3998J9168
$$ -39419 -31625 -34442 -33258 -19877 9887 9336 -21023 -43222 -61238 -36157 -24123 -38121 -18953
16093a8953J4706j0285k659n240J083k051l1699j9200Q081K4328J5609j5273q998
$$ -18953 -4247 -14532 -17191 -22431 -21348 -23399 -55098 -74298 -66217 -41889 -26280 -41553 -50551
16080e0551K6057J0828l4702J0833K458o389m662R257J1499K5645p456j6863j4900
$$ -50551 -24494 -13666 -48368 -37535 -35077 -41466 -46128 -36871 -25372 273 -7183 -24046 -38946
16067c8946J130j2226J7396Q983Q145J2069j4692r522k7052k1605J2505L4986
$$ -38946 -37816 -50042 -32646 -23663 -15518 -3449 -18141 -27663 -54715 -76320 -63815 -28829
16055b8829o927P881J1974J2316r132J0839j065k1316j4267j3753o729q794J4744
$$ -28829 -35756 -27875 -15901 -3585 -12717 -1878 -2943 -24259 -38526 -52279 -59008 -67802 -53058
16042e3058N781K1576M621j5093J3082K2092j9693j7969k406l604k524K5869p901
$$ -53058 -47277 -25701 -21080 -36173 -23091 -999 -20692 -38661 -41067 -44671 -47195 -21326 -29227
16029b9227k8449p529q110K9245n397o113M013P350M356J2080j0228n321K0668
$$ -29227 -57676 -65205 -73315 -44070 -49467 -55580 -51567 -44217 -39861 -27781 -38009 -43330 -22662
16016b2662J7574m675K937N571j302L595k1013M75l864l283K0599j441n118m069
$$ -22662 -5088 -9763 -6826 -1255 -2557 1038 -19975 -19500 -23364 -26647 -6048 -7489 -12607 -16676
16002a6676j8892J356J854J5811J1678m192J915N38J2674j4283k5138K2591J4397
$$ -16676 -35568 -34212 -32358 -16547 -4869 -9061 -7146 -6608 6066 -8217 -33355 -10764 3633
15989C633n91k346j842l4913J0715O281o564R817j5720k1762r795R746L1052o661
$$ 3633 3042 696 -1146 -36059 -25344 -19063 -25627 -15810 -31530 -53292 -63087 -53341 -22289 -28950
15975b8950j2834K8416P018j4489k6230K3509M779r203R659K0800o007P205j5324
$$ -28950 -41784 -13368 -6350 -20839 -47069 -23560 -18781 -27984 -18325 2475 -3532 3673 -11651
15962a1651p251o122K0896O701R556q813k2418n287J2717J1553j3711r123M202
$$ -11651 -18902 -25024 -4128 2573 12129 3316 -19102 -24389 -11672 -119 -13830 -22953 -18751
15949a8751R792J4934R463j1948l1202p312J26J3689N860R629J561m728l898j9507
$$ -18751 -8959 5975 15438 3490 -27712 -35024 -34898 -21209 -15349 -5720 -4159 -8887 -12785 -32292
15935c2292j1659K3962J051N222J495L006L857j992M050P876l719J576J0426J5906
$$ -32292 -43951 -19989 -18938 -13716 -12221 -9215 -5358 -7350 -3300 4576 857 2433 12859 28765
15921B8765j5900l2426N576k10n450J8702K3068J0971j2295J1172r256j7855p535
$$ 28765 12865 -19561 -13985 -14195 -19645 -943 22125 33096 20801 31973 22717 4862 -2673
15908b673N175J3253k3767j3898N564m342P652l2376L167J12r202J7328p139K3499
$$ -2673 2502 15755 -8012 -21910 -16346 -20688 -13036 -45412 -42245 -42133 -51335 -34007 -41146 -17647
15894a7647J7582J1083j7119l7012j6911K3320J9733j0066J1742o483J2130K9521
$$ -17647 -65 11018 -6101 -43113 -60024 -36704 -16971 -27037 -15295 -21778 -9648 19873
15882A9873j2546j4303j367L852j5383m9J361K2392R257l922m702q261N57l285
$$ 19873 7327 -6976 -8343 -4491 -19874 -19923 -18562 3830 13087 9165 4463 -3798 -3241 -6526
15868f526r346j7201j9543n761K797K8792J2412J2295p020j5733Q56N267J6097
$$ -6526 -15872 -33073 -52616 -58377 -55580 -26788 -14376 -2081 -9101 -24834 -23978 -18711 -2614
15855b614j2109r126k056j5386K3683K5373r350j4282N138P421j8244j1840K4138
$$ -2614 -14723 -23849 -25905 -41291 -17608 7765 -1585 -15867 -10729 -3308 -21552 -33392 -9254
15842i254L2362M935k7932k7438p215j2494K3389K4242j6696k3392k0694j506
$$ -9254 23108 28043 111 -27327 -34542 -47036 -23647 595 -16101 -39493 -60187 -61693
15830f1693J0493K5164J1185N489p566r606K1644Q939o263K7197M795q132K467
$$ -61693 -51200 -26036 -14851 -9362 -16928 -26534 -4890 4049 -2214 24983 29778 21646 24113
15817B4113J2985j8671k9085J766m876j1402J2090J5298o220k4444k7480Q549
$$ 24113 37098 18427 -10658 -8892 -13768 -25170 -13080 2218 -4002 -28446 -55926 -47377
15805d7377K201j0624R965L1695J5174j4052k125K1755J396j7501j4527m298j701
$$ -47377 -45176 -55800 -45835 -14140 1034 -13018 -15143 6612 8008 -9493 -24020 -28318 -30019
15792c0019K0525K3444p888j4139K502j6055P404J074q444Q022j1760j6458j1852
$$ -30019 -9494 13950 6062 -8077 -5575 -21630 -14226 -13152 -21596 -13574 -25334 -41792 -53644
15779e3644J9204L303J5100K3468k774j517n837j5670j8413n349M986R516K0365
$$ -53644 -34440 -31137 -16037 7431 4657 3140 -2697 -18367 -36780 -42129 -37143 -27627 -7262
15766g262R818j500K437j6277P351P851j7934j0856M88m318J7589j7536p346J207
$$ -7262 2556 1056 3493 -12784 -5433 2418 -15516 -26372 -25884 -30202 -12613 -30149 -37495 -36288
15752c6288J8002K4139K6534J1362j0732j2331l2920q856N401j780j4278o872
$$ -36288 -18286 5853 32387 43749 33017 20686 -12234 -21090 -15689 -17469 -31747 -38619
15740c8619Q313M567q682o777j1433J5780N625R39j7791m398K6360j5898n075
$$ -38619 -30306 -25739 -34421 -41198 -52631 -36851 -31226 -30287 -48078 -52476 -26116 -42014 -47089
15727d7089J8562Q465R71J3716k59k2017j5494J6780K9302j5340l089k733J7224
$$ -47089 -28527 -20062 -19091 -5375 -5634 -27651 -43145 -26365 2937 -12403 -15492 -18225 -1001
15714a001r251j6279Q461J4063j679k4135l036J5854J0144q335m117p60R859j724
$$ -1001 -10252 -26531 -18070 -4007 -5686 -29821 -32857 -17003 -6859 -15194 -19311 -20071 -10212 -11936
15700a1936Q353n028k1631j869O531N986j9188j6116K6807K4833L652R964l603
$$ -11936 -3583 -8611 -30242 -32111 -25580 -19594 -38782 -54898 -28091 -3258 394 10358 6755
15687F755j0900O126k4198j4089K4768L874n399O41J9992R335j6535j1572Q14
$$ 6755 -4145 1981 -22217 -36306 -11538 -7664 -13063 -12422 7570 16905 370 -11202 -10388
15674a0388l035j7276l198J1710j2741P700n424k013l424R958J6847L1271J9658
$$ -10388 -13423 -30699 -33897 -22187 -34928 -27228 -32652 -34665 -38089 -28131 -11284 19987 39645
15661C9645j0972k7687j8848k2111Q573K5383r475o245J3887o194j0720j555k179
$$ 39645 28673 986 -17862 -39973 -31400 -6017 -15492 -21737 -7850 -14044 -24764 -26319 -28498
15648b8498j5144J2567L791R49R302k0978j5379N623r510M169l269J5355K7800
$$ -28498 -43642 -31075 -27284 -26335 -17033 -38011 -53390 -47767 -57277 -53108 -56377 -41022 -13222
15635a3222J2452n53L10n090K604J4034j0585m2374J3614J0271J4211J1613M265
$$ -13222 -770 -1323 -1013 -6103 -3499 10535 -50 -42424 -28810 -18539 -4328 7285 11550
15622A1550j6631j5821o532K0437Q906q321O122j3205j5274J0718M835l0275j3608
$$ 11550 -5081 -20902 -27434 -6997 1909 -6412 -290 -13495 -28769 -18051 -13216 -43491 -57099
15609e7099J8565l204J766N976j1019L688K76J8512J6517P865K481q784J2716
$$ -57099 -38534 -41738 -39972 -33996 -45015 -41327 -41051 -22539 -6022 1843 4324 -4460 8256
15596H256J3189j572q811j292r844q916K5142J1266j7722o728J0848j3236r21
$$ 8256 21445 19873 11062 9770 -74 -8990 16152 27418 9696 2968 13816 580 -341
15583c41J6214J0320K6458J6223r221k6536j7999j6352O885p850M372p57k314
$$ -341 15873 26193 52651 68874 59653 33117 15118 -1234 5651 -2199 2173 1416 -898
15570h98j3841P21K4438J6923k934J3713q924j369r724k15j308l7407j0030J1313
$$ -898 -14739 -14018 10420 27343 24409 38122 29198 27829 18105 17890 16582 -20825 -30855 -19542
15556a9542N77p931J9816j38N576q367j5731M585j3151p02L6746J9123k0700l155
$$ -19542 -18965 -26896 -7080 -7218 -1642 -10009 -25740 -21155 -34306 -35008 1738 20861 161 -2994
15542b994j1969j7550K7877J5977k9443p078J7136R939j5670K781O564j7372m899
$$ -2994 -14963 -32513 -4636 11341 -18102 -25180 -8044 1895 -13775 -10994 -4430 -21802 -26701
15529b6701l161M308K7741N178k1562j725J40n104J0916J7453o413p041l540j2663
$$ -26701 -29862 -25554 2187 7365 -14197 -15922 -15782 -20886 -9970 7483 1070 -5971 -9511 -22174
15515b2174q540m83J9525j0497m615L868j132k0605r403J0656Q040R513o35M19
$$ -22174 -30714 -31197 -11672 -22169 -26784 -22916 -24048 -44653 -54056 -43400 -35360 -25847 -26482 -26063
15501b6063o689j3319k884L2455J4319O437k2953j8551k1515j2899N000L1406
$$ -26063 -32752 -46071 -48955 -16500 -2181 4256 -18697 -37248 -58763 -71662 -66662 -35256
15489c5256K9905J4159j321Q25j8950j9534J3209N37n071J4372M248J3221p050
$$ -35256 -5351 8808 7487 8312 -10638 -30172 -16963 -16426 -21497 -7125 -2877 10344 3294
15476C294k113M610k2383N193J4808k632j5590k0888j2007l466j3464P567M3756
$$ 3294 1181 5791 -16592 -11399 3409 777 -14813 -35701 -47708 -51174 -64638 -57071 -13315
15463a3315J4857m260J6885J5311j4449k8043R963l556j3178r129o314K981j1861
$$ -13315 1542 -2718 14167 29478 15029 -13014 -3051 -6607 -19785 -28914 -35228 -32247 -44108
15450d4108N476J1273K1783R328j7684k659M801K4285n724n198J497L447L763
$$ -44108 -38632 -27359 -5576 3752 -13932 -16591 -11790 12495 6771 1573 3070 6517 10280
15437A0280m726j0423q437j0203K7591J8587j3367k2010j6260R018j1164Q645
$$ 10280 5554 -4869 -13306 -23509 4082 22669 9302 -12708 -28968 -19950 -31114 -22469
15425b2469M648P472O634Q728j324K944j2128j2963l748r289M857M033J6458m236
$$ -22469 -17821 -10349 -3715 5013 3689 6633 -5495 -18458 -22206 -31495 -26638 -22605 -6147 -10383
15411a0383k2180p627O98N736j1541J399K9694l842J71p494n078L5005j0643j5120
$$ -10383 -32563 -40190 -39492 -33756 -45297 -43898 -14204 -18046 -17875 -25369 -30447 4558 -6085 -21205
15397b1205o409n056J396L8138J7003K898l274o454k5819q273L2500J253k8036
$$ -21205 -27614 -32670 -31274 6864 23867 26765 23491 17037 -8782 -17055 15445 16698 -11338
15384a1338k0535K74L97P396J8697j3214j7404J6529R768k7362j6636k850m227
$$ -11338 -31873 -31599 -31202 -23806 -5109 -18323 -35727 -19198 -9430 -36792 -53428 -56278 -60505
15371f0505m468m143K498K5799L796j1712o443K963k342K2012m094J5731J6194
$$ -60505 -64973 -69116 -66618 -40819 -37023 -48735 -55178 -52215 -54557 -32545 -36639 -20908 -4714
15358d714m03l487J466r193L117j0472J690o416M680J6966l762j6036O740J8025
$$ -4714 -5117 -8604 -7138 -16331 -13214 -23686 -21996 -28412 -23732 -6766 -10528 -26564 -19824 -1799
15344a799J0085N040j6458Q030j3755j8492k3101K9461J7522j0037k6269m058
$$ -1799 8286 13326 -3132 4898 -8857 -27349 -50450 -20989 -3467 -13504 -39773 -43831
15332d3831K0288m43j6750J8893J004K103O641J0259j3139Ko666q420k601K1p912
$$ -43831 -23543 -23986 -40736 -21843 -20839 -18736 -12095 -1836 -14975 -14973 -21639 -30059 -32660 -32639 -40551
15317d0551K006k0866J9803n877l999R67O161L1138n366J3294N170J32O832l39
$$ -40551 -38545 -59411 -39608 -45485 -49484 -48517 -42356 -11218 -16584 -3290 1880 2012 8844 8505
15303H505j3957L377j733J923r108k0109R972Q025o832R418J2784P90P505M301
$$ 8505 -5452 -2075 -3808 -1885 -10993 -31102 -21130 -13105 -19937 -10519 2265 3055 10560 14861
15289A4861n257r932k3514J1624p411j2174k965K3542m517k0648k2758J46J6455
$$ 14861 9604 -328 -23842 -12218 -19629 -31803 -34768 -11226 -15743 -36391 -59149 -59003 -42548
15276d2548j6048J3711K2931K1077Q742o2j9214p146j0510p428p572j484K5633
$$ -42548 -58596 -44885 -21954 -877 7865 7803 -11411 -18557 -29067 -36495 -44067 -45551 -19918
15263a9918K3112j7742j2438o517j0625j099j256M184J8435l432m239J6348P900
$$ -19918 3194 -14548 -26986 -33503 -44128 -45227 -46483 -42299 -23864 -27296 -31535 -15187 -7287
15250g287J334O050j471R64L559j7403r146L140J1484J8504n597j2134j7193r23
$$ -7287 -5953 97 -1374 -410 3149 -14254 -23400 -20260 -8776 9728 4131 -8003 -25196 -26119
15236b6119l043P326R60K6590j853k8684K514J0118J2216j5891r001K9304J8756
$$ -26119 -29162 -21836 -20876 5714 3861 -24823 -22309 -12191 25 -15866 -24867 4437 23193
15223B3193n65K94J4933Q154K310q326k0826J5319j0939j2655J815l65k2331o396
$$ 23193 22628 22922 37855 46009 48319 39993 19167 34486 23547 10892 12707 12342 -9989 -16385
15209a6385l214K0100k8388j2212J0060J7751J5202L096J696k5204K422N083K3026
$$ -16385 -19599 501 -27887 -40099 -30039 -12288 2914 6010 7706 -17498 -15076 -9993 13033
15196A3033J9956j8713j1119q499k6349l341o002J0559l624j8954J1485K0695
$$ 13033 32989 14276 3157 -5342 -31691 -35032 -41034 -30475 -34099 -53053 -41568 -20873
15184b0873J5203O907m103j1051o44J7372K079Q491n447l419n417o126J0122n05
$$ -20873 -5670 1237 -2866 -13917 -14561 2811 4890 13381 7934 4515 -902 -7028 3094 2589
15170B589J05k61J780r36q682k4945l8367l179L233O833L2284j3005p671m272
$$ 2589 2694 2433 4213 3277 -5405 -30350 -68717 -71896 -68663 -61830 -29546 -42551 -50222 -54494
15156e4494K1406J2828J0089j289j4251j3174O603J3888J6979L472P25O996O810
$$ -54494 -33088 -20260 -10171 -11460 -25711 -38885 -32282 -18394 -1415 2057 2782 9778 16588
15143A6588R921q234k3364P701J1605J219l2773o274K7132R424k3795p019J0908
$$ 16588 26509 18275 -5089 2612 14217 15436 -17337 -23611 3521 12945 -10850 -17869 -6961
15130f961J0275J9998l574J036L480p055n381k403j74k426k8905n510M34j5741
$$ -6961 3314 23312 19738 20774 24254 17199 11818 9415 9241 6815 -22090 -27600 -27166 -42907
15116d2907l947L307k460r953n03J7147m012N768o97j3772j4748J0326K0646Q748
$$ -42907 -46854 -43547 -46007 -55960 -56463 -39316 -43328 -37560 -38257 -52029 -66777 -56451 -35805 -27057
15102b7057p272N376J9072k87k394R904J205j2659k214j0420n366j033J0341J7533
$$ -27057 -34329 -28953 -9881 -10168 -12562 -2658 -1453 -14112 -16326 -26746 -32112 -33145 -22804 -5271
15088e271J4778J7411k4347m0938j8203n710K1187m298j950J8481K3892k0027
$$ -5271 9507 26918 2571 -38367 -56570 -62280 -41093 -45391 -47341 -28860 -4968 -24995
15076b4995j6496K3874R871n3J3110J9432J7099j7937n0319j8342J2506M15M017
$$ -24995 -41491 -17617 -7746 -7799 5311 24743 41842 23905 -26414 -44756 -32250 -31835 -27818
15063b7818n488k4389M6214K5900j5850J741q979j1302J4p43q8L809P46K4727
$$ -27818 -33306 -57695 -11481 14419 -1431 310 -8669 -19971 -19957 -20700 -20788 -16979 -16233 8494
15049H494J0495k0911j2848N028J4254k4758J0193L7944Q159l0570k6625N692
$$ 8494 18989 -1922 -14770 -9742 4512 -20246 -10053 27891 36050 5480 -21145 -15453
15037a5453N770M551j708J2478j1509k3300J0772J5564j6730P344j1758j15L752
$$ -15453 -9683 -5132 -6840 5638 -5871 -29171 -18399 -2835 -19565 -12221 -23979 -24094 -20342
15024b0342J0857L867J2797j728k6850j3328j704L15K4074K0621J1433J0311m134
$$ -20342 -9485 -5618 7179 5451 -21399 -34727 -36431 -36116 -12042 8579 20012 30323 26189
15011B6189J199j3666N909o126k8550j3782J7365q26m549k913Q355R658J9808
$$ 26189 27388 13722 19631 13505 -15045 -28827 -11462 -12288 -16837 -19750 -11395 -1737 18071
14998A8071j1005q833J0539J106k1261j0791J9007K821l073J2082j4561m243k0825
$$ 18071 7066 -1767 8772 9878 -11383 -22174 -3167 -346 -3419 8663 -5898 -10141 -30966
14985c0966k6073O413L3982Q240O929N268j3885L2076Q748O371p361j9862j5534
$$ -30966 -57039 -50626 -16644 -8404 -1475 3793 -10092 21984 30732 37103 29742 9880 -5654
$$ [...]
##END NTUPLES=NMR SPECTRUM
##END=
