##TITLE=Analysis number 307820
Compound Code cc 06002
Project Code adrs
Chemist Name synnovation
##JCAMPDX= 6.0         $$ Bruker NMR JCAMP-DX V2.0
##DATA TYPE= NMR SPECTRUM
##DATA CLASS= NTUPLES
##ORIGIN= Bruker BioSpin GmbH
##OWNER= NMR
$$ XWIN-NMR		Version 3.5
$$ Fri May 13 15:48:27 2005 GMT Daylight Time (UT+1h)  MAYBRIDGE\NMR@NMR_250MHZ
##.OBSERVE FREQUENCY= 250.131544655141
##.OBSERVE NUCLEUS= ^1H
##.ACQUISITION MODE= SIMULTANEOUS (DQD)
##.ACQUISITION SCHEME= undefined
##.AVERAGES= 16
##.DIGITISER RES= 18
##SPECTROMETER/DATA SYSTEM= dpx250
##.PULSE SEQUENCE= zg30
##.SOLVENT NAME= CDCl3
##.SHIFT REFERENCE= (INTERNAL, CDCl3, 0, 16.522)
##AUDIT TRAIL= $$ (NUMBER, WHEN, WHO, WHERE, WHAT)
$$ ##TITLE= Audit trail, XWIN-NMR		Version 3.5
$$ ##JCAMPDX= 5.01
$$ ##ORIGIN= Bruker BioSpin GmbH
$$ ##OWNER= NMR
$$ C:\u/data/dgb/nmr/ADRS/2970/pdata/1/auditp.txt
$$ ##AUDIT TRAIL=  $$ (NUMBER, WHEN, WHO, WHERE, WHAT)
(   1,<2005-05-13 15:48:07.81 +100>,<MAYBRIDGE\NMR>,<NMR_250MHZ>,
      <created by zg, POWCHK disabled, PULCHK disabled
       configuration hash MD5:
       62 19 C7 07 E1 42 D1 B7 37 6C 3D D0 77 39 F9 E6
       data hash MD5: 64K
       FB E4 B5 00 A8 BE F0 D8 1C DA 1C 09 26 26 C4 C6>)
(   2,<2005-05-13 15:48:19.10 +100>,<MAYBRIDGE\NMR>,<NMR_250MHZ>,
      <Start of raw data processing
       ef LB = 0.3 FT_mod = 6 PKNL = 1 SI = 32K 
       data hash MD5: 32K
       24 1B 26 2C 2D 29 23 9E 98 B3 6A FC F4 B4 E3 01>)
(   3,<2005-05-13 15:48:21.70 +100>,<MAYBRIDGE\NMR>,<NMR_250MHZ>,
      <apk 
       data hash MD5: 32K
       EA 39 C3 06 59 04 0F 63 EE 61 1D F7 42 F8 0B 1E>)
(   4,<2005-05-13 15:48:22.40 +100>,<MAYBRIDGE\NMR>,<NMR_250MHZ>,
      <abs ABSG = 5 
       data hash MD5: 32K
       8A 1E D9 92 23 FC 08 1C 48 3F 5D AA 19 A2 3C AB>)
$$ ##END=
$$ 
$$ hash MD5
$$ 40 3D 43 26 25 BE CD C5 D5 B5 99 56 59 78 96 38
##$RELAX= 
##$RELAX= 
##$RELAX= 
##$RELAX= 
##$RELAX= 
##$RELAX= 
##$RELAX= 
$$ Bruker specific parameters
$$ --------------------------
##$DU= <C:\u>
##$EXPNO= 2970
##$NAME= <ADRS>
##$PROCNO= 1
##$TYPE= <nmr>
##$USER= <dgb>
##$AMP= (0..31)
100 100 100 100 100 100 100 100 100 100 100 100 100 100 100 100 100 100 
100 100 100 100 100 100 100 100 100 100 100 100 100 100 
##$AQSEQ= 0
##$AQ_mod= 3
##$AUNM= <au_zg>
##$AUTOPOS= <50 >
##$BF1= 250.13
##$BF2= 250.13
##$BF3= 250.13
##$BF4= 250.13
##$BF5= 500.13
##$BF6= 500.13
##$BF7= 500.13
##$BF8= 500.13
##$BYTORDA= 1
##$CFDGTYP= 0
##$CFRGTYP= 5
##$CHEMSTR= <none>
##$CNST= (0..31)
1 1 145 1 1 1 1 1 1 1 1 1 1 1 1 1 1 1 1 1 1 1 1 1 1 1 1 1 1 1 1 1 
##$CPDPRG= <>
##$CPDPRG1= <>
##$CPDPRG2= <>
##$CPDPRG3= <>
##$CPDPRG4= <mlev>
##$CPDPRG5= <mlev>
##$CPDPRG6= <mlev>
##$CPDPRG7= <mlev>
##$CPDPRG8= <mlev>
##$CPDPRGB= <>
##$CPDPRGT= <>
##$D= (0..31)
0 1 0 0 0 0 0 0 0 0.06 0 0 0 0 0 0 0.0002 0 0 0 0 0 0 0 0 0 0 0 0 0 0 
0 
##$DATE= 1115995686
##$DBL= (0..7)
120 120 120 120 120 120 120 120 
##$DBP= (0..7)
150 150 150 150 150 150 150 150 
##$DBP07= 0
##$DBPNAM0= <>
##$DBPNAM1= <>
##$DBPNAM2= <>
$$ [...]
##$SUBNAM7= <"">
##$SUBNAM8= <"">
##$SUBNAM9= <"">
##$SW= 20.6930455092707
##$SWIBOX= (0..15)
0 0 3 0 0 0 0 0 0 0 0 0 0 0 0 0 
##$SW_h= 5175.983436853
##$TD= 65536
##$TD0= 1
##$TE= 296.16
##$TE2= 300
##$TE3= 300
##$TEG= 300
##$TL= (0..7)
0 120 120 120 120 120 120 120 
##$TP= (0..7)
150 150 150 150 150 150 150 150 
##$TP07= 0
##$TPNAME0= <>
##$TPNAME1= <>
##$TPNAME2= <>
##$TPNAME3= <>
##$TPNAME4= <>
##$TPNAME5= <>
##$TPNAME6= <>
##$TPNAME7= <>
##$TPOAL= (0..7)
0.5 0.5 0.5 0.5 0.5 0.5 0.5 0.5 
##$TPOFFS= (0..7)
0 0 0 0 0 0 0 0 
##$TUNHIN= 0
##$TUNHOUT= 0
##$TUNXOUT= 0
##$USERA1= <user>
##$USERA2= <user>
##$USERA3= <user>
##$USERA4= <user>
##$USERA5= <user>
##$V9= 5
##$VALIST= <valist>
##$VCLIST= <CCCCCCCCCCCCCCC>
##$VD= 0
##$VDLIST= <DDDDDDDDDDDDDDD>
##$VPLIST= <PPPPPPPPPPPPPPP>
##$VTLIST= <TTTTTTTTTTTTTTT>
##$WBST= 1024
##$WBSW= 4
##$XGAIN= (0..3)
0 0 0 0 
##$XL= 0
##$YL= 0
##$YMAX_a= 314705
##$YMIN_a= -214116
##$ZGOPTNS= <>
##$ZL1= 120
##$ZL2= 120
##$ZL3= 120
##$ZL4= 120
##$ABSF1= 16.522
##$ABSF2= -4.171173
##$ABSG= 5
##$ABSL= 3
##$ALPHA= 0
##$AQORDER= 0
##$ASSFAC= 0
##$ASSFACI= 0
##$ASSFACX= 0
##$ASSWID= 0
##$AUNMP= <proc_1d>
##$AZFE= 0.1
##$AZFW= 0.1
##$BCFW= 0
##$BC_mod= 0
##$BYTORDP= 0
##$COROFFS= 0
##$CY= 12.5
##$DATMOD= 1
##$DC= 0
##$DFILT= <>
##$DTYPP= 0
##$F1P= 14.0000005364418
##$F2P= -0.99999901652339
##$FCOR= 0.5
##$FTSIZE= 32768
##$FT_mod= 6
##$GAMMA= 0
##$GB= 0
##$INTBC= 1
##$INTSCL= 1
##$ISEN= 128
##$LB= 0.3
##$LEV0= 0
##$LPBIN= 0
##$MAXI= 10000
##$MC2= 0
##$MEAN= 0
##$ME_mod= 0
##$MI= 0
##$NCOEF= 0
##$NC_proc= -5
##$NLEV= 6
##$NOISF1= 0
##$NOISF2= 0
##$NSP= 0
##$NTH_PI= 0
##$NZP= 0
##$OFFSET= 16.522
##$PC= 1
##$PHC0= -101.2057
##$PHC1= 83.48454
##$PH_mod= 1
##$PKNL= yes
##$PPARMOD= 0
##$PSCAL= 4
##$PSIGN= 0
##$REVERSE= no
##$SF= 250.13
##$SI= 32768
##$SIGF1= 0
##$SIGF2= 0
##$SINO= 400
##$SIOLD= 32768
##$SREGLST= <1H.CDCl3>
##$SSB= 0
##$STSI= 32768
##$STSR= 0
##$SW_p= 5175.98343685301
##$SYMM= 0
##$S_DEV= 0
##$TDeff= 65536
##$TDoff= 0
##$TI= <Analysis number 999999
Compound Code 99
Book Reference 9
Project Code 9>
##$TILT= no
##$TM1= 0
##$TM2= 0
##$TOPLEV= 0
##$USERP1= <user>
##$USERP2= <user>
##$USERP3= <user>
##$USERP4= <user>
##$USERP5= <user>
##$WDW= 1
##$XDIM= 32768
##$YMAX_p= 353693652
##$YMIN_p= -1033364
$$ End of Bruker specific parameters
$$ ---------------------------------
##NTUPLES= NMR SPECTRUM
##VAR_NAME=  FREQUENCY,     SPECTRUM/REAL,   SPECTRUM/IMAG
##SYMBOL=    X,             R,               I
##VAR_TYPE=  INDEPENDENT,   DEPENDENT,       DEPENDENT
##VAR_FORM=  AFFN,          ASDF,            ASDF
##VAR_DIM=   32768,         32768,           32768
##UNITS=     HZ,            ARBITRARY UNITS, ARBITRARY UNITS
##FACTOR=    0.157963299565203, 1,           1
##FIRST=     4132.6476996994, 0,             0
##LAST=      -1043.33573715361, 0,           0
##MIN=       -1043.33573715361, -1033364,    0
##MAX=       4132.6476996994, 353693652,     0
$$ Real data points
##PAGE= N=1
##DATA TABLE= (X++(R..R)), XYDATA
$$ [...]
23002A98444K9119J07814L5811k94948K3324K43803k61736M9081j8538j93718
22992h1544J83425n0591Q501j24809P5401M7822p7934O7437K02186k0759k27681
22981A454j18271k4360J8184q8712k8210j10487j45016J63910m0233j49543k8536
22970e49820J51952M56551J45544p3626j14555o6192J26454m0394j77971R6144
22960d5913j26242j09807J00052o4596j18236L77656K98484J70484j21530j85356
22950A74996L1401j47593k11966p2308O455k27043K716M74593n1500k89120J30740
22939a78629O1916k6518J05269j03322J80025Q2161k04151j00089P3459j45626
22929b55505r9665k8702J59664J7152K37714P1876j93955j63871j3758K37142
$$ y = [198444, 227563, 335377, 371188, 76240, 99564, 343367, 81631, 130712, 112174, -81544, 101881, 51290, 59791, -65018, 10383, 58205, -19729, 47708, 249894, 229135, 1454, -116817, -141177, -122993, -211705, -239915, -350402, -495418, -331508, -371741, -521284, -549820, -397868, 58683, 204227, 130601, 16046, -50146, 76308, 35914, -142057, -45913, -172155, -281962, -181910, -246506, -364742, 12914, 311398, 481882, 360352, 174996, 206397, 58804, -153162, -225470, -219015, -446058, -443342, 31251, -20249, -309369, -178629, -116713, -143231, -37962, -141284, 38741, 120902, -83249, -183338, -109879, -255505, -355170, -383872, -224208, -207056, 30658, 102534, -91421, -255292, -269050, -31908]
22919c1908R4357O791k67289Q2254J65732J98726o6578j37367L2483M5161j1042
22908A11320L01457R0533k06175l25811k59388r4822K08982M4351j30726k4772
22898b85051L08354J10180l9040k01245J29801J14642j33279j08285n0878j89136
22888c43937j04116K51794K44404J10131J50018q3215n6926j79826j59261j45010
22878c15944J94347J29686K4029r2192P9849m5791k58796n2850K4581P4567R1013
22867a47501m0256O9924K38115j03612l40412j86531J00303K73471J49577J6911
22857B9989N8842J96150o1301k78413q7016o5719j015J82983L7080K19817J05353
22846C36750l20624K0688J7056P7499j52347J08079l00242k26603L14752O0850
$$ y = [-31908, 62449, 69240, -198049, -115795, 49937, 248663, 182085, 44718, 77201, 122362, 111320, 412777, 503310, 297135, -28676, -288064, -382886, -173904, -129553, -260279, -285051, 23303, 133483, 94443, -106802, 22999, 137641, 4362, -103923, -154801, -343937, -448053, -196259, 48145, 158276, 308294, 225079, 168153, -11673, -170934, -315944, -121597, 8089, 32118, -60074, 19775, -26016, -284812, -337662, -313081, -238514, -147501, -187757, -117833, 120282, 16670, -323742, -510273, -409970, -136499, 13078, 29989, 88831, 284981, 223680, -54733, -141749, -207468, -208483, -25500, 11580, 231397, 336750, 16126, 36814, 53870, 131369, -20978, 87101, -213141, -439744, -124992, -64142]
22836f4142L7173j18061P3946J06429j55669k45016N587j18768L53805N5154j73796
22825b43358j58698j08135J36977J23655m966J14131P3151k21472R2394m4404
22815b40725j35621n9049J60855R2526R0894Q0206q4657J45045J85788K13080
22805D48342j79948l3378j68260J18139R4409l6106q6584K5959P2307N2167l81120
22794g4073k24928j61270j81751j09274J38171K53383J24752J26960J63997P9294
22784A35261j64304j07890J46186n5841o8815l0734k3789j10469m9902o560k3680
22773c60537O3643K13791N2769j32914j10251J26650M2339k11603q1658J23164
22763b74607O170l5318P9164k28706J28022J46201N6649l0966j18014j39851K13398
$$ y = [-64142, -26969, -145030, -71084, 35345, -120324, -365340, -359753, -478521, -124716, -69562, -243358, -402056, -510191, -373214, -249559, -254525, -140394, -67243, -288715, -196321, -240725, -376346, -435395, -274540, -182014, -91120, -10914, -95571, 49474, 235262, 448342, 268394, 235016, 66756, 184895, 279304, 243198, 156614, 182573, 254880, 307047, -74073, -299001, -460271, -642022, -751296, -613125, -359742, -234990, -108030, 55967, 135261, -29043, -136933, 9253, -46588, -115403, -146137, -169926, -280395, -330297, -336857, -360537, -296894, -83103, -30334, -163248, -273499, -146849, -104510, -316113, -397771, -274607, -268437, -303755, -224591, -453297, -325275, -179074, -122425, -153391, -271405, -411256, -197858]
22752a97858J34132P6370j96790j08411J36216k2267j47811m5010k3000M6907
22742c47522K43653j25321J80115L28335J21697o5028J43146k9361k00986k7159
22732B21569J88670R4244l01064k50570j9386j49036m3670j31822K34301K19913
22722F3149J54110L9636k96457J00366j42997k89106L3023K9225j92128K20421
22712b80758K77230J94160j21842J40618K30630J73009j81614j87204l10083k68622
22702c34476Q0295j48547m3692J74683J57029n2879J1492k30296r715J55155L50659
22691A09708P1611k2536q3432j50753j34579p4077J4159J63124J10235j17259
22681a13799n9856l21733J07695Q8296o5834j24418K71227J1961L7651J5350K53322
$$ y = [-197858, -63726, 12644, -184146, -292557, -156341, -178608, -326419, -371429, -394429, -347522, -103869, -229190, -49075, 279260, 400957, 335929, 479075, 449714, 248728, 221569, 410239, 504483, 203419, -47151, -66537, -215573, -259243, -391065, -156764, 63149, 217259, 256895, -39562, 60804, -82193, -371299, -338276, -309051, -501179, -280758, -3528, 190632, 68790, 209408, 440038, 613047, 431433, 244229, -65854, -334476, -254181, -402728, -446420, -271737, -114708, -167587, -156095, -386391, -396106, -240951, 109708, 181319, 158783, 75351, -75402, -209981, -284058, -269899, -106775, 3460, -113799, -173655, -495388, -387693, -299397, -365231, -489649, -218422, -206461, -168810, -153460, 99862]
22670I9862J36451N245k8386j83868n7051O4989J54970J37215k3561q8064j63415
22659E4387J00865K59811R3679L9004n86j46861m06524k19388O03q3828j86516
22648d95354l4296L7658k242L83357m10720k077J18379P0932K20646L65208n4391
22637A97100j94292m8141Q6798k69787k0675J46012J86723J6541k80580r9876
22627b80177K39977j554k3528J3766r0929M5768j2949j745J45951m2778p7291
22616h5489J63791o6342p7776P6475R4796K01708j14871k07201j32193K07731
22606F0629O05865M4981k85541j10326j8079p1945k3990o0007l8159n2183n696
22595D5549Q2337j6291J237k98561j59279J92052K89271J90138j62099j39601
$$ y = [99862, 236313, 241558, 213172, 29304, -27747, 37242, 192212, 329427, 305866, 217802, 54387, 155252, 415063, 508742, 547746, 547160, 400299, -6225, -225613, -225010, -308838, -495354, -529650, -491992, -494234, -110877, -521597, -523674, -405295, -334363, -113717, 251491, 197100, 2808, -45333, 41465, -228322, -248997, -102985, 83738, 100279, -180301, -280177, -40200, -41754, -65282, -51516, -142445, -96677, -109626, -111371, 34580, -8198, -85489, 78302, 11960, -65816, 10659, 105455, 307163, 192292, -14909, -147102, 60629, 666494, 711475, 425934, 315608, 297529, 225584, 201594, 141587, 103428, 51245, 45549, 127886, 111595, 112832, -185729, -345008, -152956, 136315, 326453, 164354, 24753]
22585B4753p4137J83353j36153p5749j54736j74602n6227L6842r2467N0657L76349
22574i2117K79394j24553R9118J98148K30944k21962k09283o2688l30867J56284
22564g7582K6462R1985J93198N6375m32680l36122P4942K67362Q9902K85648K5956
22553B65446q6815j25290j51566K16738K06835k18155p551O5951J83930k04332
22543A45191n5983J25023k23323l5313k53759j90037L12900K07096K23229J71401
22533D26425K3299m295k22335J17398L3585j91914j56400l7626J59803j81468
22523c3528m2976L00855m5939J38080j96405q4915k6592o6328j43549m433J11209
22512i4521K12849N0641o9836k2799j57543k95437K10827J28104K3845O1297J24956
$$ y = [24753, -49384, 133969, -2184, -77933, -232669, -407271, -463498, -426656, -519123, -468466, -92117, 187277, 62724, 161842, 359990, 590934, 368972, 159689, 97001, -233866, -77582, -51120, 40865, 234063, 290438, -142242, -478364, -403422, -136060, -46158, 239490, 265446, 178631, 53341, -98225, 118513, 325348, 107193, 99642, 165593, 349523, 145191, 89208, 214231, -9092, -44405, -298164, -488201, -175301, 31795, 255024, 426425, 449724, 445429, 223094, 340492, 374077, 182163, 25763, -11863, 147940, -33528, -76504, 224351, 178412, 316492, 120087, 35172, 8580, -57748, -201297, -205730, -94521, 118328, 168969, 99133, 76334, -81209, -376646, -165819, -37715, -13870, 47427, 172383]
22501A72383j2541J46634m0951j11430l00087J05687o9021M0200j46419L12882
22491I7337J35410m03017k9478J91359M8644l44099l3894k8682R8207J17895J3871
22480a36447J62011J65098k49946j75143J54112K28096J8475j72474k67700K26640
22470d7278J06788l77521q5284J29010j8647j0594J86191L30729K70710j87575
22460B96529j98510l5651J12189r6026n5319R82k28101J0933J21158J02257Q3741
22449A14182O6761M3765l81748K9885K7900o2560o6472j40667K75732J20511j01994
22438g4705R7259l9318J44204L20071L231M8434k58331n0651K6044p9146j78274
22427d1182j44808J44794o9886m5394m8879K1471K24173K89988J4406l8977J5061
$$ y = [172383, 159842, 306476, 265525, 154095, -145992, -40305, -109326, -69126, -215545, 97337, 232747, -170270, -199748, -8389, 40255, -303844, -337738, -366420, -268213, -150318, -136447, 25564, 190662, -59284, -234427, -80315, 147781, 166256, -6218, -273918, -47278, 59510, -318011, -403295, -274285, -292932, -303526, -117335, 213394, 484104, 296529, 98019, 62368, 174557, 78531, 23212, 24194, -203907, -192974, -71816, 30441, 114182, 180943, 224708, -157040, -127155, -99255, -161815, -228287, -368954, -93222, 27289, -74705, 22554, -16764, 127440, 447511, 450742, 499176, 240845, 190194, 216238, 137092, -41182, -185990, -41196, -111082, -156476, -205355, -183884, 40289, 330277, 344683, 305706, 320767]
22416C20767M1196r9455l33305p9252P8482o9050j63850j09955j12146j02123
22406f28691K37141J58904k32081j86613K78667m0717k53468J73908L60124M0439
22396i2387J15684O683j864L9497J90601R411j48411j65744K68477P0698n843
22385B86802j5620q8570p7899j03031Q0550K71688J09747k81761j83467M8356
22375D6795o3154J49936l9190J17060K02039n5838j23852l23392k68857K54787
22365a03666J40093j11070j81035j56218J37218J12664O4479p6677k1554R2453
22355a03313q7833J45281J37410o8847k6989N2283K06714k37359j94739p5886
22345b53278j70869R1655P7402P3964P4587O2558K68091N9351j75648k8948L2029
$$ y = [320767, 361963, 262508, -70797, -150049, -71567, -140617, -304467, -414422, -526568, -628691, -391550, -232646, -464727, -651340, -372673, -413390, -666858, -492950, -132826, -92387, 23297, 29980, 28116, 67613, 258214, 267625, 119214, -46530, 221947, 292645, 286802, 271182, 182612, 104713, 1682, 82232, 353920, 463667, 181906, -1561, 46795, -16359, 133577, 94387, 211447, 413486, 357648, 233796, -89596, -358453, -103666, 36427, -74643, -255678, -411896, -274678, -162014, -97535, -174212, -195766, -103313, -191146, -45865, 91545, 22698, -4291, 47992, 254706, 17347, -177392, -253278, -424147, -332492, -255090, -181126, -106539, -43981, 224110, 283461, 107813, 78865, 110894]
22334A10894k50441J92913Q7631R9717j1489L2999j46177k52090K1867j27374
22324b41550j89415J86926k6329J50497l17444l01449K36097J76488j15287M2674
22314c98792J73479Q2452L7467k02293J33833j62818l18827j10257K31094K59681
22304b74981o9046j67393L8411J67642K15946J8813j42211O9476J22562N3138
22294C2357K14373K34612M8716j96859j68549n20850l11068L29002P6078j0997
22284b73185K59868Q6534N1616j0049l1380j44440J15081q7220l12890j41024
22274d87089L10276L7429J03541J30703j746j56654K14866O0137k84977K4728
22264d8786J72572L12662L19478n3181l47508q5558J61845j76161l60065m4271
$$ y = [110894, -139547, 53366, 140997, 240714, 229225, 262224, 116047, -136043, -114176, -241550, -430965, -244039, -270368, -119871, -437315, -738764, -502667, -326179, -441466, -398792, -225313, -142861, -105394, -307687, -173854, -336672, -655499, -765756, -534662, -274981, -344027, -511420, -473009, -305367, -89421, -70608, -212819, -143343, -20781, 32357, 246730, 481342, 530058, 333199, 164650, -356200, -667268, -338266, -262188, -273185, -13317, 73217, 124833, 114784, 83404, -61036, 54045, -33175, -346065, -487089, -176813, -139384, -35843, 94860, 93114, -63540, 151326, 211463, -73514, -48786, 123786, 436448, 755926, 702745, 355237, 269679, 431524, 255363, -104702, -148973]
22254a48973J3941K20127L08012j4196k32709l48588m9062K88689J16305j89456
22244c5910j98104k0981N9947k508j71889J32553J82422j05156k27450j40257
22234e27333J12795K87000j7602J21404K98633K30790j01039o1612p6133j78362
22224H8541J98224K6513j53714o4524R410o2066J41340J0764l18425r5090j90305
22213d09332Q7531N9957j50958L51768K06260r9840j14549J3616J86644L6497
22203A67594m4018M5161K35302j39184k41159j44258j73128J15381L70070K45951
22193D37712k43506k53409l00060P6069L24603j01178K06733J17547j64726k84142
22183a84357l0188k47978J08001J41126K4989q819p4329K25164P1373Q0825J62152
$$ y = [-148973, -135032, 85095, 393107, 378911, 146202, -202386, -251448, 37241, 153546, -35910, -234014, -254995, -195048, -197556, -369445, -236892, -54470, -159626, -387076, -527333, -414538, -127538, -145140, -23736, 274897, 505687, 404648, 343036, 266903, 88541, 286765, 313278, 159564, 95040, 104450, 42384, 183724, 194488, -123937, -219027, -409332, -321801, -261844, -412802, -61034, 145226, 45386, -69163, -55547, 131097, 167594, 123576, 168737, 404039, 264855, 23696, -120562, -293690, -178309, 191761, 437712, 194206, -59203, -359263, -283194, 41409, -59769, 146964, 264511, 99785, -184357, -214545, -462523, -354522, -213396, -188407, -197226, -271555, -46391, 24982, 105807, 267959]
22172B67959p4960J1972k53398k16201N4899q2878K4578J11230m0869M3007r3911
22161b48572K20529L8627l450j5255P0699j2828m18164q1018K96730j11599K25567
22150c8734K48249J01660L2072k40417n22456l04938K92386J7753O0445K74761
22140g9219j20590O2362L3852k88954J7903O8463J76840K09447J50960m6227L0871
22129B15708J40659j27525K16293j10729k90167K53265M687q984J23505N312l4163
22118C87861k58431k5962j48859k362j99365r2601K42378L40599m8488l09237
22108a14467Q7839K7632k8988k499J15954K27588L4352j21024K57851m4318k28772
22097B11148k16321Q3540J58047j53353j67273K09576j65150J09079K57101j07106
$$ y = [267959, 192999, 204971, -48427, -264628, -209729, -292607, -268029, -156799, -197668, -154661, -248572, -28043, 10584, 7134, -8121, 62578, 49750, -368414, -449432, -152702, -264301, -38734, 209515, 311175, 343247, 102830, -419626, -724564, -432178, -414425, -353980, -79219, -199809, -137447, -103595, -392549, -374646, -306183, -129343, 80104, 231064, 184837, 215708, 356367, 228842, 445135, 334406, 44239, 297504, 302191, 293207, 416712, 422024, 387861, 129430, 103468, -45391, -47753, -247118, -339719, -97341, 243258, 194770, -114467, -26628, 1004, -27984, -30483, 85471, 313059, 347411, 226387, 484238, 439920, 211148, -5173, 78367, 236414, 83061, -84212, 125364, -39786, 69293, 326394, 219288]
22087B19288j05017J41296n5168k19004J47634K81523O144j06666P250n5867k19149
22076D2264q0960j84043k20827r4N3520K81991J44571L2258j70891j87545K9945
22065b59811K00607j09766M0428K66238n3326j7585R8150k09654J06198J01959
22055A63438J65097j10834k70563o6331J74550J63322M8860J90831r8771R3479
22045D53078K74435J26544j37982l15828l12270n4150Q1945K70494o7044j50244
22035A68978m8986o5316k49062N03765O6744k54478J34440j12361p5660J5386
22025H3450J7155K2966q0447O7015K1432j9908j79816K28775J10275M8584J69134
22014D88615L46011p2913k4599j9256m28979j74846q6734K45395l7905n2333K32175
$$ y = [219288, 114271, 255567, 200399, -18605, 129029, 410552, 416696, 310030, 317280, 261413, 42264, -38696, -222739, -443566, -443660, -390140, -108149, 36422, 68680, -102211, -289756, -259811, -59204, -168970, -128542, 137696, 84370, 66785, 164935, -44719, 61479, 163438, 328535, 217701, -52862, -119193, 55357, 218679, 267539, 458370, 359599, 453078, 727513, 854057, 716075, 400247, 87977, 33827, 115772, 386266, 319222, 168978, 119992, 54676, -194386, 309379, 376123, 121645, 256085, 143724, 68064, 83450, 100605, 123571, 43124, 110139, 131571, 111663, -68153, 160622, 270897, 319481, 488615, 834626, 761713, 737114, 717858, 288879, 114033, 27299, 272694, 234789, 182456, 414631]
22003D14631m5546l42350L0316j3092k05078R7027J35984K0323L454j96142K05594
21992A05121K56427R8065j0857o0619q00j60103j33896M00161o7693k22769J0840
21981B13877K21551L06352O8849k07691j25455p5657j70830j49540J01521O6711
21971B49688J41195K8730J37841j59695l2245J88017K33500k1357q0324o0661
21961F24689j71547l7977J8307j47543J35131K01310J05857m8015n7029O0105
21951F83288j54918r6809K08023j54013n3087J21434K3897j25476o8657j76646
21941B07036j1714M7963K45693l1651j18276J02411R6579K12170M2493q9466Q5497
21930G88735P0287j47469l00447j02948N2911M9024K54649q3076j52318J70396
$$ y = [414631, 369085, 26735, 57051, 43959, -161119, -64092, 71892, 92215, 95669, -100473, 105121, 361548, 459613, 448756, 388137, 387337, 227234, 93338, 493499, 425806, 203037, 213877, 435428, 741780, 810629, 602938, 477483, 401826, 230996, 81456, 182977, 249688, 390883, 419613, 557454, 397759, 365514, 553531, 787031, 765674, 685350, 624689, 453142, 415165, 433472, 285929, 421060, 622370, 728227, 680212, 623183, 683288, 528370, 431561, 639584, 485571, 432484, 553918, 577815, 452339, 383682, 207036, 195322, 243285, 488978, 457327, 339051, 441462, 538041, 750211, 792704, 703238, 788735, 859022, 711553, 411106, 308158, 361069, 410093, 664742, 581666, 429348, 599744]
21920E99744j79485J95639K28607j28279j18332j1478J31423O2863K7999K09484
21910A018185p5180l42288k30063O5300J67678j62409j38032J18870J06646J38150
21900F66857L64520O5514j04274r0516J51685K33913K7535J33765Q9572o7246
21890A471325j64650p4910K4462R1899p0587k22861k2241P6847K8784j38125L4445
21879A034388K16510R4142j63998k76252k18940M3277L30262Q0594r494O2340
21869A192829k25160J29186J34486k88419j28741k55262P2602R9111Q0512J63498
21859I74642L3612j26804n0918r922p3571J54637K2778k16598r0805K9138j1485
21848F34704P3217q4486m9870J50918L17981J05384l43512L2533j34155m04223
$$ y = [599744, 420259, 615898, 844505, 716226, 597894, 586416, 717839, 780702, 808701, 1018185, 943005, 600717, 370654, 435954, 603632, 441223, 303191, 422061, 528707, 666857, 1031377, 1096891, 992617, 902101, 1053786, 1287699, 1315234, 1448999, 1538571, 1471325, 1306675, 1231765, 1256227, 1348126, 1277539, 1054678, 1032437, 1109284, 1138068, 999943, 1034388, 1250898, 1345040, 1181042, 904790, 685850, 729127, 1059389, 1139983, 1130489, 1192829, 967669, 1096855, 1231341, 942922, 814181, 558919, 631521, 730632, 811144, 974642, 1008254, 881450, 830532, 820610, 747039, 901676, 924454, 707856, 617051, 646189, 634704, 707921, 623435, 573565, 724483, 1042464, 1147848, 804336, 836869, 702714, 298491]
21838B98491r810K66284M125J16198k40471l21410j83150J24436M18299K94358
21828G67350k16625j85170k41890J13354O4187l9243L47897J16103q0020k13715
21818D32228K38486R2638k41854j8083j98456m4220K9088J21602J03566J19266
21808F34261k53740j90502L9322J91489K11265j71594l4184J62920j89899J7957
21798D17295k2495k00092r4252j76459o2494J66878K60391M83715p1407l69218
21788C31862k37621o4882K16708J9459j28020j58616n5604P9577K35833j4731
21778B23965j31705k54163K50829Q1475J08631R6341k2875J79967k39344j96698
21768I6423J7390J15668l4593q2110k9766K58522K48542m4859k35477M9323o2097
$$ y = [298491, 288681, 554965, 559090, 675288, 434817, 113407, -69743, 54693, 472992, 767350, 550725, 365555, 123665, 237019, 301206, 261963, 609860, 725963, 645943, 432228, 670714, 763352, 521498, 503415, 304959, 260739, 289827, 411429, 514995, 634261, 380521, 190019, 229341, 420830, 632095, 460501, 426317, 589237, 399338, 417295, 394800, 194708, 100456, -76003, -138497, 28381, 288772, 772487, 701080, 331862, 94241, 29359, 246067, 265526, 137506, -21110, -76714, 2863, 238696, 223965, 92260, -161903, 88926, 170401, 279032, 375373, 352498, 532465, 293121, 96423, 113813, 229481, 194888, 112778, 83012, 341534, 590076, 545217, 309740, 359063, 296966]
21757B96966J47316o8688j15723n1532j26253K8300L00762L1647o0325K1252M5776
21746D49498k01116l18694j5172k2242Q5419J89670K64250R5825j9741l1132r7733
21735C78832J0160J91593L02759k25585k82134j32392R3015r4076k40385J27845
21725A29632r8882k30898O6997j53154R5914M56433K3525j86544l12338j45792
21715c55107L9558K20941J06535J04446q8984j35113j87707J21235K78299l5490
21705F8613k87329J4272J19752J89103J71988J2657Q3628L57009j49262k51594
21695C28837o6022M7570n805k27179L1281M4513J9734J99992K9246j23336p0188
21684B08643l0179Q4548K45336k28852L8377k1639k99438R967K16756l4348l22632
$$ y = [296966, 444282, 375594, 259871, 208339, 82086, 110386, 411148, 442795, 382470, 403722, 449498, 248382, -70312, -85484, -107726, -22307, 167363, 431613, 527438, 507697, 476565, 378832, 388992, 580585, 883344, 657759, 375625, 243233, 336248, 242172, 1787, 129632, 30750, -200148, -133151, -286305, -190391, 266042, 289567, 103023, -209315, -355107, -315549, -94608, 11927, 116373, 27389, -107724, -295431, -174196, 104103, 68613, -218716, -204444, -84692, 104411, 276399, 289056, 372684, 729693, 580431, 328837, 262815, 310385, 304580, 77401, 108682, 153195, 172929, 372921, 402167, 278831, 208643, 178464, 263012, 508348, 279496, 317873, 296234, -3204, 6763, 223519, 189171, -133461]
21673a33461J76430J82926j62949k60095O3397K34107n5343j64629r8228L28136
21663A10291R0200k70339k75581R7837K06906P7912J5214j48764N9954O0607j30648
21652a06411M0693j3534j45642M7977j96738m6947N3174n7390j18879J36817K63703
21641a43177K69599l6481m49774k20634K84738M0766P2527K88186m9246r2763
21631c6259L8355j32187j32023M35799K85332J961m79832m39590j74920J66648
21621d66716j1872l41469J68980K63729l9354j078j22844q9017N5823J21885K81076
21610a80857R7692J72986P5304j25403j14365l4685J21124J74751m9975k15974
21600g9402o570q6292J0455J13726J42244J24204j44226j77966p3278p1453j0511
$$ y = [-133461, 42969, 225895, 62946, -197149, -133752, 100355, 45012, -119617, -217845, 110291, 200491, -69848, -345429, -247592, -40686, 37226, 52440, -96324, -36370, 24237, -106411, -65718, -79252, -224894, -176917, -373655, -420602, -367428, -424818, -543697, -406880, -143177, 126422, 89941, -359833, -580467, -295729, -254963, -182436, 105750, 56504, -36259, 2096, -130091, -262114, 173685, 459017, 460978, -18854, -458444, -633364, -466716, -478588, -820057, -651077, -387348, -426702, -427780, -550624, -639641, -583818, -461933, -180857, -83165, 89821, 165125, 39722, -74643, -109328, 11796, 186547, 136572, -79402, -85972, -172264, -161809, -48083, 94161, 218365, 74139, -103827, -177105, -248558, -259069]
21589b59069n1705J60166N3272O2644J73073Q5541n303L0672K0880m2015O538
21578B34694M4124M5631n6589r8114p6358j91964j00122k6967j42125k03328J97747
21567c73371J34757o6243j22236N2866K10036J69698J98592j11154q2410l5833
21557b5298R6601K21828j86041j74924j71873J28941J44188J32902j59941j77753
21547a71370r9530J85766O6474R3209O9219k19814R2643L0474N9544P5995j98345
21536a5735j93638j09851j5102J53009K99396o7676p2169J13308O3489l73566
21526b18535k9279J65136L22161j5910k22704k0076P9969q3094j16762N7593N3155
21515b8346l59050j03702K81979R5173j03243J35758J92969l2575j23817J20702
$$ y = [-259069, -310774, -150608, -97336, -34692, 138381, 223922, 218619, 249291, 270171, 228156, 234694, 278818, 324449, 267860, 169746, 93388, -98576, -198698, -225665, -367790, -571118, -373371, -238614, -304857, -427093, -374227, -164191, 5507, 204099, 92945, 10535, -25298, 71303, 293131, 107090, -67834, -239707, -110766, 33422, 166324, 6383, -171370, -270900, -85134, -18660, 74549, 143768, -76046, 16597, 47071, 106615, 182610, -15735, -209373, -319224, -334326, -181317, 118079, 50403, -21766, 91542, 155031, -218535, -247814, -82678, 239483, 223573, 869, -19207, 60762, -22332, -139094, -81501, -28346, -387396, -491098, -209119, -113946, -217189, -81431, 111538, 78963, -44854, 75848]
21505G5848j32279j44974p709J54797j66542o4123J96557Q7613l20796q7501k6112
21494d35221M5661k02600k929N19781L3833j42154p2800J52328k72879N1110J97570
21483a28300j70012k49527J73008J08019n7409K19015K12621K6393k46653j62981
21473b75826L08144K95804m9154j49702k94757j48425m0968k38055R2704J56681
21463c43554r6204O3399j25974O1707K42561J55389K0261m0449Q2859j28761J63218
21452E4452J37163j61613n5183P8274K5974n4322j33223j92770N4884K93143K32840
21441B79619r0350k55560j16379m3850J43619J76450o2406k65922Q2845L06283
21431A54349n9871k63400Q3500J32239J59264o4232J45381o6533j38348m53870
$$ y = [75848, -56431, -201405, -209114, -54317, -220859, -284982, -88425, -812, -321608, -409109, -435221, -389560, -592160, -595089, -75308, -41475, -183629, -256429, -104101, -376980, -325870, -128300, -298312, -547839, -374831, -266812, -324221, -105206, 107415, 133808, -112845, -275826, 32318, 328122, 278968, 129266, -165491, -313916, -354884, -592939, -500235, -343554, -439758, -376359, -502333, -440626, -198065, -42676, -22415, -62864, 19995, -108766, 54452, 191615, 30002, -25181, 53093, 79067, 24745, -108478, -301248, -246364, 46779, 279619, 189269, -66291, -182670, -226520, -82901, 93549, 31143, -234779, -151934, 154349, 94478, -168922, -85422, 46817, 206081, 141849, 287230, 220697, 82349, -371521]
21421c71521l15502J80953L23946R611n3685J06984L519n9937r8048j45732l6192
21410d55604Q3894N0613J12067J76244P8789j25111q5047j84931k29803P218J23402
21399d48269J76756J99857j14049K5211R875K78601j2670k82929J93573L01017
21389C26973l6194j40332j1279k75451k74946J69406M06834l9013n3066q996j9912
21378D4024j07085k4654J07698Q0585J22258j02315r043M5490M9997J80409r9981
21367B87383M9778j16481J16190n0781l17785N3021L5753k05785M2641M30060
21357C23994M2187j81752j039k78354j42262J59456Q7497J65219n0438k97820
21347a73312K13542L00027n4088o2700j38508p45j79653R6791k08581m13891R9719
$$ y = [-371521, -687023, -506070, -182124, -172513, -226198, -119214, -115695, -175632, -273680, -419412, -455604, -371710, -321097, -209030, -32786, 46003, -79108, -164155, -349086, -578889, -571671, -448269, -271513, -71656, -185705, -160494, -150619, 127982, 115312, -167617, 25956, 326973, 290779, 150447, 139168, -136283, -411229, -241823, 165011, 125998, 72932, 63936, 44024, -63061, -87715, 19983, 100568, 222826, 120511, 111468, 156958, 206955, 387364, 287383, 337161, 220680, 336870, 286089, -31696, 21325, 57078, -148707, -106066, 323994, 366181, 184429, 183390, -94964, -237226, -77770, 9727, 174946, 124508, -173312, 40230, 340257, 286169, 223469, 84961, 84216, -95437, 1354, -207227, -621118, -521399]
21336e21399R1277L4138J90815J11991q5648o0805P9587K54151J66430j16796
21326A43741m3171O5519l0802r5169J79922K2015j33172J9568k83876j85084K58202
21315h2307K84035M2898o2605N4629M0925k64442R2040J22869k26831k42619K09346
21304c2062J51339O8512j97726k73097O8614o5630o4053K1175j16462K4804R7611
21293c16975J02040J0591j45617K89961K45819N8661j46383J6403J78956k13869
21283G9587k95999J53898J26428o5321j95007J82099J91457j46644J73490N9134
21273B63122j37373l10911k58038N3699j4160P0292n2612j16086K67225J14245
21263a20597l6932p2035K49075P8529J03063J9098r3455j70880q4883j11704L17694
$$ y = [-521399, -430122, -395984, -205169, -93178, -178826, -239631, -160044, 94107, 260537, 143741, 100570, 166089, 135287, 40118, 220040, 242055, 108883, 128451, -155425, -340509, -82307, 201728, 244626, 182021, 236650, 277575, 13133, 105173, 228042, 1211, -241408, -32062, 119277, 187789, -9937, -283034, -214420, -280050, -344103, -322928, -439390, -414586, -316975, -214935, -204344, -349961, -60000, 185819, 244480, 98097, 114500, 293456, 79587, -216412, -62514, 63914, -1407, -196414, -14315, 177142, 30498, 203988, 263122, 125749, -185162, -443200, -389501, -403661, -333369, -385981, -502067, -234842, -120597, -157529, -229564, 19511, 98040, 201103, 220201, 126746, -44134, -129017, -240721, 76973]
21252G6973K36554m8454l65664K7698O7115J04179J4086j14207k83825K3165J36255
21241a26125j27091k07934o8840j07556m1440L6671J29865J95817K29018K9457
21231e8158j41931k1117n8018L03164J22453O0601k5591j35941N676N3311l439
21220A01010j10345j70030j44747K04438K81955K10416J05382j90751k54028o4842
21210c1542j81760j62722J18818L90652n51l5381r7626j62020Q4569L79224J28529
21199D30190k57494N4386K7121j29102J12793k42281k66327j2988O7560k19931
21189d36073J32539K99940k66947k175n7284O6792L5162J16698J87324K18330
21179B94306K1137o2041p3412k98229R8953O92k0405J20572J61428j66936L4926
$$ y = [76973, 313527, 265073, -100591, -72893, -5778, 98401, 112487, -1720, -285545, -262380, -126125, -253216, -461150, -529990, -637546, -678986, -642315, -512450, -316633, -87615, -58158, -200089, -221206, -279224, 23940, 146393, 206994, 181403, 45462, 51138, 104449, 101010, -9335, -179365, -324112, -119674, 162281, 372697, 478079, 287328, 33300, -31542, -213302, -376024, -257206, 133446, 132895, 97514, -112, -162132, -77563, 301661, 430190, 172696, 227082, 254203, 125101, 237894, -4387, -270714, -283702, -216142, -436073, -303534, -3594, -270541, -272716, -330000, -263208, -228046, -111348, 75976, 294306, 315443, 253402, 179990, -118239, -19286, -18594, -38999, 81573, 243001, 76065, 110991]
21168A10991Q8527p2075m8956O4987J98647L5790n6486k58175k60566P5565j5988
21157a37739J2264Q7569l660L1229R8727O3417P1218K00867N7299q6830j15000
21146B79361K6171k09312j21930J33058j00638j74304J0602n2390P3193K91347
21136A55158O9263J46368n3344j97157J09259K25924k78185j26709j58970K7782
21126h0611J22408L6257J76870K58816j42520j56952j44373m09102L25085R9537
21116H5415J10931K43346p9272m09853k77202j60504j81138O6035J34570L23289
21106a44383l4200o1809J71200m7210j30443m6296J25649q2056j1454J56633L55245
21095B50876n7940r2961l20601l2251J52430J99447J11017j21733k68813j98055
$$ y = [110991, 199518, 127443, 78487, 143474, 342121, 377911, 321425, 63250, -197316, -121751, -137739, -125475, -37906, -41566, -10337, 88390, 151807, 223025, 423892, 481191, 394361, 279361, 305532, 96220, -25710, 107348, 6710, -167594, -156992, -209382, -136189, 155158, 224421, 370789, 317445, 120288, 229547, 455471, 177286, 50577, -108393, -80611, 41797, 78054, 254924, 513740, 371220, 214268, 69895, -339207, -14122, 85415, 196346, 439692, 360420, -49433, -326635, -487139, -668277, -602242, -467672, -144383, -178583, -240392, -69192, -116402, -246845, -293141, -167492, -249548, -261002, -104369, 250876, 192936, 99975, -220626, -252877, -100447, 99000, 210017, 88284, -180529, -378584]
21085c78584n1978J24711R4933K4871K51086J828Q7866j28203j33464Q3115J02380
21074G8561r778L11925k28860l18798o1956q4129j80842P0059L59947j53603R2386
21063a25088L695J1165J63762j9237L3418R977r0607j46982J29343J96038Q2194
21052B47678j85048J898p225J4722m9454j96140P5947P4577j21576m04621m84122
21041a033364K94126L31441L43207K81184J08508j02198l87640j674M0407J14918
21031a1085o6553j98509k56387L5895J85489K6377k98400k59857R9685R548J81958
21020e51839L3423Q4143L34333m4033j83064k42601L3425l790L9872K65217J40271
21009i4643J93333O3189r0225Q2517J89244K3139Q4833R4808n7272p7991l17634
$$ y = [-378584, -430562, -305851, -210918, -186047, 65039, 66867, 154733, 26530, -106934, -23819, 78561, 68783, 380708, 151848, -166950, -228906, -313035, -493877, -423818, -63871, -217474, -125088, -121393, -110228, 53534, 34297, 67715, 77692, -12915, -159897, -30554, 165484, 247678, 62630, 64528, 57303, 72025, 22571, -173569, -97622, -23045, -144621, -549242, -1033364, -739238, -407797, -64590, 216594, 325102, 222904, -164736, -166410, -126003, -11085, -77638, -276147, -532534, -496639, -311150, -284773, -583173, -843030, -743345, -733797, -551839, -518416, -434273, -99940, -143973, -327037, -569638, -536213, -540003, -500131, -234914, -94643, 98690, 161879, 71654, 154171, 343415, 366554, 451387, 546195, 488923, 410932, 93298]
20998I3298k33776P8678j1475l15604J25722K81853K56453P956k12942M1785o5295
20987D6653J4445j93318m8612J04406K64820J33993j52689j22137j23054j49934
20977b25427J12472j36927l28749P3243J88618J54506j22781j97046O9132K94967
20967a17992J66292j24128j04664k55903O9640K47666L9961J45762M9722n481
20957A10875n7595k40872k72231J88476K94363j49514L233m1106L5263J21906
20947g202K61945p9726k12178k20073P9327k8817N356q4722q7132m2876k3452
20936d39550m2073J69214L72568K0289k20498k44732r6979J84245k56405r577
20926e63498N0704N3597L94251K972j8583p4201r5572r8793j28112J21875J04348
$$ y = [93298, -140478, -61800, -73275, -388879, -263157, 18696, 275149, 283105, 70163, 111948, 46653, 61098, -132220, -180832, -76426, 188394, 322387, 169698, 47561, -75493, -225427, -112955, -249882, -578631, -505388, -316770, -162264, -285045, -482091, -412959, -117992, 48300, -75828, -180492, -436395, -366755, -119089, -79128, 66634, 116356, 110875, 53280, -187592, -459823, -271347, 23016, -126498, -123265, -164371, -129108, -7202, 254743, 175017, -37161, -257234, -177907, -206724, -201368, -286090, -373222, -416098, -439550, -481623, -312409, 60159, 80448, -140050, -384782, -481761, -297516, -553921, -563498, -512794, -459197, -64946, -61974, -80557, -154758, -250330, -349123, -477235, -355360, -251012]
20915b51012J10437k14926k52586r4273L05346K86209o2410J4642n3091J787L4208
20904a75669J53414J69204K55468j694P9466k7616j05030m0424l03352j67815
20894a64048j85411k5995K44490J57977K1632j90584m3171l9570j14877M4387
20884b95170J36494j26002r6781J16150R8016J1089K2437J35733N5501j33690
20874g6223m3785L63363J33106j94379m9462L30180o9589q8743k26015J19388
20864A97841O5862k88646O3995q2347k20068P1434M9133j12107j88504L8098L711
20853d01598L1730j13351P1583J28300n1000n8084j6022O5232J01526L4591O0230
20842a46863q4580P0665j18292J809K64075J76530L39595J18377o4279j74269
$$ y = [-251012, -140575, -355501, -608087, -702360, -397014, -110805, -173215, -158573, -211664, -209877, -175669, -22255, 146949, 402417, 400723, 480189, 452573, 347543, 307119, 3767, -164048, -349459, -375454, -130964, 27013, 48645, -141939, -185110, -224680, -339557, -295170, -158676, -284678, -381459, -265309, -167293, -156204, -133767, 1966, 57467, -76223, -120008, 243355, 376461, 182082, 132620, 462800, 393211, 304468, 78453, 197841, 263703, -24943, 39052, -43295, -263363, -191929, -142796, -254903, -443407, -405309, -401598, -369868, -483219, -411636, -283336, -334336, -392420, -408442, -343210, -241684, -207093, -146863, -231443, -160778, -279070, -277261, -13186, 163344, 502939, 621316, 557037, 382768]
20832C82768m4807P7091j9616l53199n13569J91611J15661j47525M9211o6267
20822c28641J75932Q9152q3836q3126J78301L32226q6770q5210o7416r9855j37682
20811a96925J22216j02653J86249M5115R2647K64156j04889k14197k9926l0798
20801C0995Q4303K98218K67609l25458j68836K69767K26561k42775k58971j01553
20791G9860K2657K07269J26767k50357m1898R529j25077J67918P1534m6752o6559
20780A54891J05408j12060K07113O2772j29206j57306j568O481m5681M4309j91591
20769e6438O8204J42016Q8872n4907j40526l11128J70542O1538j35392R0793J17929
20758D1503J57043n6315Q6564r385k11441m6663j42189k64365k15048p127M10321
$$ y = [382768, 337961, 415052, 395436, 42237, -471332, -279721, -164060, -311585, -262374, -328641, -152709, -63557, -147393, -230519, -52218, 280008, 193238, 108028, 40612, -59243, -196925, -74709, -177362, 8887, 54002, 146649, 410805, 305916, 91719, 61793, 30995, 115298, 413516, 681125, 355667, 186831, 456598, 683159, 440384, 181413, 79860, 102517, 309786, 436553, 186196, 144298, 153827, 28750, 196668, 268202, 221450, 154891, 260299, 148239, 355352, 418124, 288918, 131612, 130044, 136525, 90844, 135153, -56438, 11766, 153782, 242654, 187747, 47221, -263907, -93365, -31827, -167219, -76426, 41503, 198546, 142231, 228795, 219410, 7969, -38694, -180883, -445248, -660296, -667423, -257102]
20747b57102J45336j08349l06317J53533P7122K9149J66552j61J66212Q5785M2444
20736A94204k44611q4910K05182K00672j36847p6775k18010j75622n2746L6901
20726c52562J66612J30019J01534j01844n5312m4299m864R1395R6386K91481O7348
20715C85894j953l9638j09491k61182j34442N8485o8289K45150K32297j64175
20705A42656n52729J3300l4508K6169J66148J40659J61682j05223j72998P2672
20695a42172J50791j72812Q3526J48900O6565J09384O362k14616n4152n8673j74168
20684b51065j17455k4232J9446K67984L99701L7868j820O3303k91900k79937j95658
20673c73765Q4584K21898J11750l69655l3119N9565R7844K23621R2339q0021r338
$$ y = [-257102, -111766, -220115, -526432, -372899, -295777, -266628, -100076, -100237, 65975, 151760, 194204, -50407, -135317, 69865, 270537, 133690, 56915, -161095, -336717, -389463, -352562, -185950, -55931, 45603, -56241, -111553, -155852, -160716, -69321, 27065, 318546, 385894, 383941, 344303, 234812, -26370, -160812, -102327, -170616, 74534, 306831, 142656, -410073, -396773, -431281, -405112, -238964, -98305, 63377, -41846, -214844, -142172, 8619, -164193, -80667, 68233, 134798, 244182, 250544, 35928, -18224, -76897, -251065, -368520, -392752, -373306, -105322, 294379, 332247, 330427, 393730, 101830, -178107, -373765, -289181, -67283, 44467, -325188, -358307, -298742, -200898, 22723, 115062, 35041, 25703]
20662B5703k72089M4928J65345P844j25755j26844P1505K38005N0498k0425j21006
20651f2291N0937O1952O7515j2063n4734K14467K0824M3490J20510j64188m11242
20640a24823j59025l8235P2187r8603M7219n4895j22775O9899K49065J12201l0714
20629g8499j27577J6604L6518J78002K5070j09160k93510R0878j77917Q4883r2875
20618d47583K551L89998l3923j9753L7221k5151J9964L95788K33055j59762j20165
20607B72240J8216j1563k12070m10858k51008j76509l6535Q6913K64803K99974
20597a56397R3003n5152k32805m6801J98334J31767m6129K067j141q0970J53979
20586d0245m0094O4672j19331j37890J00038k26363J48688L9289N0986m6999j22732
$$ y = [25703, -246386, -201458, -36113, -28269, -154024, -280868, -209363, 28642, 79140, 58715, -62291, -11354, 50598, 118113, 106050, 51316, 265783, 286607, 330097, 450607, 286419, -124823, -283848, -322083, -249896, -348499, -301280, -356175, -478950, -409051, -159986, -47785, -78499, -206076, -189472, -152954, 25048, 50118, -59042, -352552, -261674, -439591, -354708, -447583, -445032, -55034, -88957, -108710, -71489, -96640, -76676, 319112, 552167, 392405, 272240, 290456, 278893, 66823, -344035, -595043, -771552, -808087, -721174, -456371, -156397, -63394, -118546, -351351, -398152, -199818, -68051, -114180, -112113, -113254, -194224, -40245, -80339, -15667, -134998, -272888, -172850, -399213, -250525, -211236, -160250, -207249, -329981]
20575c29981l5773J25760L51065L25396P0079O4164k15532k89116j07063j97476
20565b38477k54262p0532J21924L63141M00271j41998k29714k50236Q2008J36811
20555h1064J61870j48057o3171K2163L4797J16691R3430K9086j02413j78220j65442
20544b80330K39661Q2194k9407j37985l8705J7060L87700K09368j02621k97092
20534D9843k73529K38880J03002j86436J64798l5353k14085Q0527J04122k50544
20524b18775n5553R8522k25367O9849J21180K4145L37701N9799p6057J95938J18321
20513D49703j16874l35742j02925j63718j09793k16450J17923J4600k42902N8916
20503f47262K05957O9869j30597R176J84963L04485M1691k21101K8759q8259r1262
$$ y = [-329981, -365754, -239994, 111071, 436467, 506546, 570710, 355178, 66062, -41001, -238477, -492739, -563271, -441347, -78206, 322065, 180067, -49647, -299883, -217875, -81064, 80806, -67251, -130422, -108259, -73462, 43229, 136659, 165745, 63332, -114888, -280330, -40669, 41525, 12118, -125867, -164572, -147512, 240188, 449556, 346935, 49843, -223686, 15194, 118196, -68240, 96558, 61205, -152880, -72353, 31769, -218775, -274328, -175806, -401173, -331324, -210144, -185999, 151702, 211501, 135444, 331382, 449703, 332829, -2913, -105838, -269556, -379349, -595799, -477876, -463276, -706178, -647262, -441305, -371436, -502033, -492857, -307894, -3409, 38282, -182819, -154060, -242319, -333581]
20492c33581L0700J27200o188o4467L3635J06179j0727J30905Q1219k36225p733
20481a49083K78370J02363q6651l51326q970J77916K63627j33925k69575k0904
20471a98158J27607l23704M264R6152J34702n7562O0242j20356J06381J61998
20461h434R2718j26796j01025j36723J32413K51159J82153k12678k41752j60918
20451c29883K06904j58089N4314K41221k27263J9758Q8368j10973l01593J85683
20441c31553K98083J15787o9131l11257k24797j65050J02092K40959l3557J45991
20431b32433J37138J4618N014j86502k67014J53530J95626J44612J65946k697
20421A27838k69631k30496m9526M2849M34878L51045Q4299o5159k43078N0945
$$ y = [-333581, -302881, -175681, -181869, -246336, -212701, -106522, -117249, 13656, 94875, -141350, -149083, 129287, 231650, 144999, -206327, -215297, -37381, 226246, 92321, -177254, -198158, -70551, -394255, -389991, -293839, -159137, -216699, -156457, -276813, -170432, -8434, 84284, -42512, -143537, -280260, -147847, 103312, 285465, 72787, -168965, -329883, -122979, -281068, -226754, 14467, -212796, -193038, -104670, -215643, -517236, -331553, -33470, 82317, 13186, -298071, -522868, -687918, -585826, -344867, -378424, -232433, -95295, -80677, -75663, -262165, -529179, -375649, -180023, -35411, 130535, 127838, -141793, -372289, -421815, -378966, 55912, 406957, 491256, 426097, 183019, 233964]
20411B33964M2975j36509N3471J29839O7582k96774l22993l6411j55175J74731
20401b45300j537n0870j15341L8519M36537J29197q9793l6564J65875J49766p0616
20390C09873K3269J44527k18007m29897k01969L1888K19834j77545M4961L05409
20380E2343J1870J16815J39948J3577R4476j37563Q7919N5543j25115J41069l1906
20369D18976j55240J23351Q286m78723j05802K1042K6681O6755j48238J06981
20359a15931j16488K6030K91443K55059l915k79027R2083L94990J87844J85945
20349I18033K8903j34936J516O8141J44066k03228j55053j25523j21280J87281
20339F07920L47250j32472k79048l0996j47951j89896R1853K47221J44479N0751
$$ y = [233964, 276939, 140430, 193901, 323740, 391322, 94548, -228445, -264856, -420031, -245300, -246837, -297707, -413048, -374529, 62008, 191205, 101412, 64848, 230723, 380489, 309873, 333142, 477669, 259662, -170235, -372204, -340316, -120482, -298027, -253066, 52343, 64213, 181028, 320976, 334553, 429029, 291466, 379385, 434928, 309813, 450882, 418976, 263736, 387087, 395373, -83350, -189152, -168110, -141429, -74674, -222912, -115931, -232419, -206389, 85054, 340113, 336198, 57171, 149254, 544244, 732088, 918033, 946936, 812000, 813516, 881657, 1025723, 822495, 667442, 541919, 420639, 607920, 955170, 822698, 543650, 512654, 364703, 174807, 266660, 513881, 658360, 709111]
20329G09111J36134J59350j98934j28609J16007m18927p0580r9512K51007J72062
20319F27109k68320O4983K83680j11482j29774k14035j91474N3988j75158J09260
20309D8777J37238j10539p3164K5043j03630J36226J20465K87661m0182j62538
20299B65357J56042r1929o5278N5073J30527L2205m9705J95884J60899J54973
20289I44048j66086j63157q9312r5846L31879J303j91641k63109j05556J80174
20279C82697j26257k02551L0064k822N6792K3704k4255P5519l6767j80515n7606
20268f1997P9818m5227J35528r2846j18351M323N7504j507J87367n8271K48380
20257C34721O1349J35273J10555j07746m02155Q370n045j88937P7060q3465R8817
$$ y = [709111, 845245, 1004595, 805661, 677052, 793059, 374132, 303552, 204040, 455047, 627109, 358789, 423772, 707452, 595970, 466196, 252161, 60687, 114675, -60483, 48777, 186015, 75476, 2312, 27355, -76275, 59951, 180416, 468077, 427895, 265357, 421399, 329470, 264192, 319265, 449792, 481997, 432292, 628176, 789075, 944048, 777962, 614805, 525493, 429647, 761526, 762829, 571188, 308079, 202523, 382697, 256440, 53889, 83953, 81131, 137923, 161627, 137372, 212891, 176124, -4391, -61997, 17821, -27406, 108122, 15276, -103075, -98752, -41248, -42755, 144612, 86341, 334721, 396070, 531343, 641898, 534152, 131997, 140367, 135322, -53615, 23445, -60020, 38797]
20246C8797L9606o8538J08922k70139l06223J15524J69191K06799j48238N0235
20236f4064n7410j14384J92406J53084K56988P3279n1795m56040Q6927l1235k354
20225a4598J46610J63655J87176Q7598O0445j72276l50545l983J091L5247m4236
20214I6184N8905p011M6708P8219k3247j37243k99139J837J73495J64162k5261
20203A27609j00649n2907j5881J4329P4816j62495N5471K2311k2341r8761m2971
20192b01469J01283l2288J73385K89544O3186n1612L2317L2791r5835l1719K2461
20181C02044l7573j88906j88564K12703J23042K6933R2144r4499k98299l8807
20171h9782j48406K25024J44525j70270j63181L6094M30410L6193l20210l3835
$$ y = [38797, 78403, 9865, 118787, -151352, -457575, -342051, -172860, 33939, -114299, -64064, -121474, -235858, -43452, 109632, 366620, 439899, 388104, -67936, 18991, -12244, -14598, 132012, 295667, 482843, 570441, 630886, 458610, 108065, 104082, 105173, 140420, 96184, 155089, 148078, 194786, 273005, 249758, 112515, -186624, -184787, -11292, 152870, 127609, 26960, -25947, -41828, -27499, 47317, -115178, -59707, -37396, -59737, -158498, -201469, -100186, -132474, 40911, 330455, 393641, 342029, 374346, 407137, 311302, 279583, 302044, 264471, 75565, -112999, 99704, 222746, 249679, 341823, 247324, -50975, -89782, -238188, -13164, 131361, -38909, -202090, -165996, 264414, 300607, -19603, -53438]
20161e3438J44427Q966P7961Q2192K68167L54866k89315k41025j01332r8187J3354
20150A66636O2175K30253n4309J58878j96204k98202j1607l60816k13100J57571
20140c58725K1708J35246J59855P5285J99789K35817K7549L4925o3102r6707k13905
20129A57735k05648J77251J48138j01703J31993J87780J03183q2034L3652J09055
20119F59402J00321p3279k22620l62503n460L35965j15756N9771L80283J90880
20109I47004M5968J22026l6189j83220O0545N8956M8096k17450K09239O26073
20099A681048J81705K48098n9857L61440K62572M2468k11971K61360J76003J50777
20089C093643K34395k7152p9261K10133Q302J52739M0940n36413k21923O7820
$$ y = [-53438, 90989, 99955, 177916, 260108, 528275, 883141, 593826, 352801, 251469, 153282, 166636, 228811, 459064, 404755, 563633, 367429, 69227, 57620, -303196, -516296, -358725, -337017, -201771, -41916, 33369, 233158, 468975, 496524, 531449, 468347, 371640, 157735, -47913, 129338, 277476, 175773, 307766, 495546, 598729, 516695, 550347, 659402, 759723, 686444, 463824, 101321, 95861, 431826, 316070, 375841, 756124, 947004, 992972, 1114998, 1078809, 895589, 956134, 1015090, 1063186, 845736, 1054975, 1681048, 1862753, 2110851, 2050994, 2412434, 2675006, 2717474, 2505503, 2766863, 2942866, 3093643, 3328038, 3300886, 3221625, 3431758, 3440060, 3592799, 3633739, 3097326, 2875403, 2943223]
20079B943223Q201m1347j83707j40500j39972J7110l8572N7536j80709k57456
20069B043807o1845l60167M2390n4920k94084K03147l6605K02481j53119j55358
20059A375727k19322m1180K61536N7526L3611p8178J12825L77695J64327J26758
20049B171325J0676m7122Q1512q3240Q5503J98366K27798J31132J10825J44190
20039C030965K08007K02230K94171l8477R8602j49967p3669k5085k74121l33460
20029B939196j0671P0642k52450n8925K71528k14945J7518j72913l69782l22660
20019A896538l19240O1318m7113k51759k96334j22868o757K42503n4648K0614
20009A122254Q5877j45662l4143k37451q1900l2832J33926j9686l96152O0437
$$ y = [2943223, 2951424, 2910077, 2726370, 2585870, 2445898, 2463008, 2424436, 2481972, 2301263, 2043807, 1981962, 1621795, 1664185, 1609265, 1315181, 1518328, 1481723, 1684204, 1531085, 1375727, 1156405, 1115225, 1376761, 1434287, 1467898, 1389720, 1502545, 1880240, 2044567, 2171325, 2182001, 2134879, 2216391, 2133151, 2218654, 2417020, 2644818, 2775950, 2886775, 3030965, 3238972, 3441202, 3735373, 3696896, 3795498, 3645531, 3571862, 3546777, 3272656, 2939196, 2928525, 2999167, 2746717, 2687792, 2959320, 2744375, 2761893, 2588980, 2219198, 1896538, 1577298, 1638616, 1591503, 1339744, 1043410, 920542, 913785, 1156288, 1101640, 1122254, 1208131, 1062469, 1028326, 790875, 708975, 676143, 810069, 790383, 394231, 454668]
19999D54668r1444N1073r6645j05099J46919j6046n0379K16999n2888P5146p8539
19988D53765n6347j33071K60893J35157k15681R362K4853K18027o8523k01864
19978D26571K0938k20930J6814J87947M90480p0892l62010j71492J13064K6459
19968D56949L063J71211O2422J94683k32777P8844l1838j69305N1838O6597k0992
19957F30695k14712q4330Q0845P1697l1210J59324l9310J97777m8788R571k018
19946G29541Q65j71779j62257K15563J55853K14994J22731K01295o5828K52826
19936A493804J96113J54543J10540j49607l07122n79940P7350K69728j4554K1694
19926A272549K13957M06490j96544k47687O8498N3545P3332l6382n3685j16512
$$ y = [454668, 363224, 414297, 317652, 212553, 359472, 343426, 293047, 510046, 457158, 532304, 453765, 397418, 264347, 525240, 660397, 444716, 454078, 478931, 696958, 628435, 426571, 447509, 226579, 243393, 431340, 921820, 850928, 488918, 317426, 430490, 456949, 460012, 631223, 693645, 888328, 655551, 734395, 702557, 533252, 585090, 651687, 630695, 415983, 331653, 412498, 484195, 452985, 612309, 572999, 770776, 721988, 731559, 729541, 730406, 558627, 396370, 611933, 767786, 982780, 1105511, 1306806, 1240978, 1493804, 1689917, 1844460, 1955000, 1805393, 1498271, 918331, 995681, 1265409, 1250855, 1272549, 1486506, 1892996, 1696452, 1448765, 1517263, 1570808, 1644140, 1607758, 1554073, 1437561]
19916A437561j75072j10912R3413m5340R4415k07847l39861q9226P0144J07563
19906H34838M9102K90899K60668Q7851k38451l943K17407Q9487r6716o6148J2577
19895A437571o656K28744n4308j52198J06731J77724J89983K89367R0011j20552
19885B186417j70184p0305j16323J81353J66126l7004k7750L76950L43050M43893
19875C276223M54794L53129O9851l75236m54008j09278m8723j44196j31086J09446
19865C000916R9794r0807P4833M20879J64013M63574L52251K95980M48980O66857
19855E897270J331189K241188K525433J950044M2516q66830q23567m89860m68137
19846A1339246m44374l99367n90644l4642M476N0322L04391J19515K65971O91412
$$ y = [1437561, 1262489, 1151577, 1244990, 1199650, 1294065, 1086218, 746357, 657131, 727275, 834838, 883940, 1174839, 1435507, 1523358, 1284907, 1280964, 1498371, 1587858, 1491142, 1424994, 1437571, 1430915, 1659659, 1605351, 1453153, 1559884, 1737608, 1927591, 2216958, 2306969, 2186417, 2016233, 1945928, 1829605, 2010958, 2177084, 2140080, 2112330, 2489280, 2832330, 3276223, 3731017, 4084146, 4153997, 3778761, 3324753, 3215475, 3166752, 3022556, 2891470, 3000916, 3100710, 3009903, 3084736, 3505615, 3669628, 4133202, 4485453, 4781433, 5230413, 5897270, 7228459, 9469647, 11995080, 13945124, 13987640, 13120810, 12297243, 11807383, 11339246, 10894872, 10495505, 9904861, 9870219, 9874695, 9925017, 10229408, 10348923, 10614894, 11306306]
19836A1306306R51354J236061J803570K837400M157474O498387J0350500J5444561
19828E4585613J9599141J4232382M681950M869884R777528Q861363k679846j0763111
19820A03164904j0553360q450544o726994m786739k615918P73219N246464J0489832
19812H6540864J3541330P362336k208401k668822J983399N075102j04290q731842
19804A00789676j1447702j0260292q667943p628467o590581n727852m516865l845731
19796D2104243l170947j860497j152350k75119J517304M165209Q538362J3590564
19788F3456769J2700628M84796p616173p960035n979572m468642l498383k592495
19780D4526893j695824O6022K028279N171771J0060668J6190486J7881373O011270
$$ y = [11306306, 12257660, 13493721, 15297291, 18134691, 22292165, 28790552, 39141052, 54585613, 74184754, 88417136, 93099086, 97968970, 107746498, 116607861, 113928015, 103164904, 92611544, 84161000, 77434006, 72647267, 70031349, 70804568, 76051032, 86540864, 100082194, 107444530, 105236129, 102567307, 104550706, 109625808, 109521518, 100789676, 89341974, 79081682, 70413739, 62785272, 56194691, 50466839, 45949974, 42104243, 38933296, 37072799, 35920449, 35645330, 37162634, 41327843, 49866205, 63456769, 76157397, 76642193, 69026020, 61065985, 55086413, 50617771, 47119388, 44526893, 42831069, 42897091, 44925370, 50097141, 60157809, 76348295, 94229668, 100240938]
19772A00240938n136570m293072O31100O851239J3932165J5281196M744563j289132
19764A30962427L233904P590290M94953j2746585j6828735j4768657j2274994
19757H5662603j0691238r387218q107274p163670o215765n401394m800928m077397
19749B9817719l308674k656412k239962j475113l57653O29766J192305P63809
19741B2365785j444672k425119k295532j711948j474483j629435j395771j191125
19733H797700j009904j050497p03357n11346p22909n38777m37554o73019m31246
19724B719091k42494m61261l01002k4240J5000j57594o5296R7676L46473K1220
19714A947573J17800K96383K79332K68352j17480j83063m60174k37435K2558m19870
$$ y = [100240938, 95104368, 90811296, 91442396, 98293635, 112225800, 127506996, 132251559, 130962427, 134196331, 141786621, 142281574, 129534989, 112706254, 97937597, 85662603, 74971365, 65584147, 57476873, 50313203, 44097438, 38696044, 33895116, 29817719, 26509045, 23852633, 21612671, 20137558, 19779905, 20409671, 21601976, 22365785, 20921113, 18495994, 16200462, 14488514, 13014031, 11384596, 9988825, 8797700, 7787796, 6737299, 6033942, 5522596, 4799687, 4260910, 3823356, 3150337, 2719091, 2476597, 2015336, 1714334, 1690094, 1705094, 1547500, 1482204, 1579880, 1926353, 1947573, 2065373, 2361756, 2641088, 2909440, 2791960, 2608897, 2148723, 1911288, 1933846, 1513976]
19704A513976l59762k61362k32906j2203j30958j26775J5503K30529R6899r7330
19694F35611n0233Q1619j07872j39569k72308k32570l3357M8221J30800J39255
19684A99597J72305n0242l03352L19472n4833r2302K27276j26517j96213j03151
19674g960p1404L3309J81640O7607k71309O7905J61427Q35k7297n6780j05003
19663b7030o5228J5796j25198K27495R3864Q8349K05127K28062L11734M97674
19653A450645M20144P0494L99353Q02677L31698J22618K82702J32767L49039M5486
19643D407623n36692k92589o898L0952K29643M12626L10854J83575M17007J25189
19633E281290j31849j02069o83221n70472m17164m28426l90381j77037k59969
$$ y = [1513976, 1154214, 892852, 659946, 647743, 516785, 390010, 405513, 636042, 732941, 635611, 585378, 666997, 559125, 419556, 147248, -85322, -118679, -70458, 60342, 199597, 371902, 321660, 18308, 337780, 282947, 190645, 417921, 291404, 95191, -7960, -79364, -46055, 135585, 203192, -68117, -212, 161215, 162050, 134753, 77973, -27030, -92258, -76462, -201660, 25835, 119699, 208048, 413175, 641237, 952971, 1450645, 1870789, 1941283, 2340636, 3143313, 3475011, 3597629, 3880331, 4013098, 4362137, 4407623, 3870931, 3578342, 3571444, 3602396, 3832039, 4244665, 4555519, 4739094, 5156101, 5281290, 5149441, 5047372, 4364151, 3793679, 3376515, 2948089, 2557708, 2380671, 2120702]
19624B120702l64977L0604j37343m01305j03891r3819q4763j90863j07663P7869
19614G44551j59741K3669n7971j4054N7120M98328J55230K75423N64703L88191
19604B475449J49916Q0369N9712p926j04537j19397L79197O57179P33558Q17309
19594E120829L56004j1885j3586L62108O89264J92522J49958K09976J18358J9787
19584G193335P2054m02511n88572p45248n92272q23714m92269n83325n81426j99371
19574B256681J9788l968o1402k04268l10420l03377k63696k63505Q775j13889
19564G60719p1007j42471m1293j75288J7586j38814P532J50496J80103K30522
19554G78085p5427k62258O9788O5724k13457n4800J00157J07121n1225P2136L70375
$$ y = [2120702, 1755725, 1786329, 1648986, 1247681, 1143790, 1049971, 965208, 774345, 666682, 744551, 584810, 608479, 550508, 536454, 593574, 1091902, 1247132, 1522555, 2087258, 2475449, 2625365, 2705734, 2765446, 2757520, 2652983, 2533586, 2912783, 3569962, 4303520, 5120829, 5476833, 5464948, 5451362, 5813470, 6502734, 6695256, 6845214, 7055190, 7173548, 7193335, 7265389, 6862878, 6274306, 5529058, 4936786, 4113072, 3620803, 3037478, 2456052, 2256681, 2276469, 2272501, 2211099, 2006831, 1696411, 1393034, 1129338, 865833, 874608, 760719, 689712, 547241, 505948, 330660, 348246, 209432, 216964, 367460, 547563, 778085, 702658, 440400, 510188, 575912, 362455, 307655, 407812, 514933, 463708, 535844, 906219]
19543I06219K37054j86116J28758M37739L8716l51945k04800J28550M12110j89675
19533A356610M9881J76874K60135J94769k35202n54538l30271j96136k08214j10720
19523D03188j8060J04681l89066J96752R8296r4514l00954K68594J34145j02858
19513C00204p4794o8814J9176L0764n9207R2237k7106k08359N9317J4837j67096
19502h8841q725K00700K32730K37186l9601l05844l38983l10156j13603J00991
19492d34146K46257M4110m7269l3797K26290K31669J05504o1595J61666O3017
19482E01706k39172k03181k06144m2527J54162K86662j64688j2986J40523k3440
19472A90915J66694J86245l2876l37161j26107J62290L69090L464j6368K02191
$$ y = [906219, 1143273, 957157, 1085915, 1523654, 1562370, 1210425, 1005625, 1134175, 1546285, 1356610, 1406491, 1583365, 1843500, 2038269, 1803067, 1248529, 918258, 722122, 513908, 403188, 385128, 489809, 100743, 297495, 395791, 301277, 323, 268917, 403062, 300204, 225410, 156596, 175772, 206536, 147329, 239566, 212460, 4101, 63418, 78255, -88841, -97566, 103134, 335864, 573050, 533449, 227605, -111378, -421534, -535137, -434146, -187889, -143779, -191048, -224845, 1445, 233114, 338618, 277023, 438689, 501706, 262534, 59353, -146791, -189318, -35156, 251506, 86818, 73832, 214355, 190915, 357609, 543854, 510978, 173817, 47710, 210000, 579090, 582554, 566186, 768377]
19462G68377m2159N5612Q3654q1724J96487n032O5494J06497K30969J52227M34825
19451A965227K66225L28235J44539K20551k4093o198P3206J67202J14705l7124
19441C212475J0941K2290J01130k5593j46052p1263m9382R1793j85752l30548
19431B630039j43209K27657J1810P13J7848k72537k09891J5231j27938K23281
19421B373004K35335J44563j14909j43303k50979j09948r6349l35175j55546r5556
19411A451137J76300K88056J05934J7430K22572J35962K04193L84211L13472O949
19401C306216J45661J28834L3020J41391M68902M85257K39409L15664J22302l26391
19391E060265p803K46691M03195M58213J72481L1206m32300l77358k85725j98771
$$ y = [768377, 726218, 781830, 865484, 783760, 980247, 975215, 1040709, 1147206, 1378175, 1530402, 1965227, 2231452, 2559687, 2704226, 2924777, 2900684, 2894486, 2967692, 3134894, 3249599, 3212475, 3223416, 3245706, 3346836, 3321243, 3175191, 3103928, 3054546, 3146339, 2960587, 2630039, 2486830, 2714487, 2726297, 2727010, 2744858, 2472321, 2262430, 2277661, 2149723, 2373004, 2608339, 2752902, 2637993, 2494690, 2243711, 2133763, 2037414, 1702239, 1546693, 1451137, 1627437, 1915493, 2021427, 2038857, 2261429, 2397391, 2601584, 2985795, 3299267, 3306216, 3451877, 3580711, 3613731, 3755122, 4224024, 4709281, 4948690, 5264354, 5386656, 5060265, 5052462, 5299153, 5702348, 6160561, 6333042, 6364248, 5931948, 5554590, 5268865, 5070094]
19381E070094j08762K49265m09868n23766m99181k69624p7091o553K6036Q2499
19371C533049q2025k74489o5650J50624K49986l71J51643k5515J549M43710M59306
19360D541817K61002L63578Q29032J219195J772179K278957J751618M67565o01929
19351A2883014p12236m72404m63808l45430J95077p2316M1578M05402R16498J158990
19341A3534365J811576K688738M419666O527606R943321J5392822J9490311J4495162
19333H8303567M865732M463028R711563R721907j120482q983073p825206l850063
19325I5286973P47790P495306J0761070J892894j0145072j2513303j0615652r164542
19317G3745464p964813o131534m575745k747827r91195O30411L938473Q717681
$$ y = [5070094, 4961332, 5210597, 4800729, 4276963, 3777782, 3508158, 3431067, 3424514, 3450550, 3533049, 3451024, 3176535, 3110885, 3261509, 3511495, 3511124, 3662767, 3637252, 3638801, 4082511, 4541817, 4802819, 5166397, 5995429, 7214624, 8986803, 11265760, 13017378, 13484943, 12883014, 12170778, 11698374, 11234566, 10889136, 11084213, 11011897, 11053475, 11458877, 12375375, 13534365, 15345941, 18034679, 22454345, 28981951, 38925272, 54318094, 73808405, 88303567, 93169299, 97632327, 107343890, 117065797, 115945315, 106962242, 99137036, 95286973, 96034763, 103530069, 114291139, 116184033, 106038961, 93525658, 82910006, 73745464, 65780651, 59649117, 55073372, 52325545, 51334350, 51964761, 55903234, 64620915]
19309F4620915J2766395O729988n467803r199986p499824o037164n029085l814050
19301D7069386l127759k209313j425404p75782M53583K002466M351250P922323
19293E4260750J2523802J5008222R803854K551722L153993R148809J2470474N171655
19285A24093281o558175j0549178r809868q213554o333578m160236j496308K715269
19277G9687653Q032107J5123171J9332642J0969128M45366J506427P517443N500712
19269A48114649q084300j6354780j5576809j3352622j1666048j0026512q507495
19262F4546083p848699p010947o025096n164286m487791l496367k898643k400204
19254B5214050k307612j888728r40867r59513n45849K4982R03312J719989K015354
$$ y = [64620915, 77387310, 84117298, 78649495, 69449509, 61949685, 55912521, 50883436, 47069386, 43941627, 41732314, 40306910, 39531128, 39984711, 41987177, 46338427, 54260750, 66784552, 81792774, 91596628, 94148350, 97302343, 106451152, 118921626, 124093281, 117535106, 106985928, 97176060, 88962506, 82628928, 78468692, 76972384, 79687653, 87719760, 102842931, 122175573, 133144701, 133590067, 135096494, 142613937, 148114649, 140030349, 123675569, 108098760, 94746138, 83080090, 73053578, 64546083, 56697384, 49686437, 43661341, 38497055, 34009264, 30512897, 27614254, 25214050, 22906438, 21017710, 20076843, 19117330, 18571481, 18596463, 19499775, 21219764, 23235118]
19245B3235118K3843j953303j977065j699796j850252j530519j108788q95420
19237A2243818r71483j279838j216382r34621q57379p59137n29265l97548n30224
19228D767941o27862Q5996k94246l20293L97120L80838J35019l29369k43587k79005
19218C672552n57194l68131J6978O0071j37972q1775j07728j75656m1919L5744
19208B314970J78844j47611j26156j83370m5947j71024J866L4035k89321k00730
19198A365556j55600k01483K64827J38956l24144k24925p3964j52717k04228j19044
19188C13234L7677J34545j79092r8592J08544K21299j30232j58589J3597j48815
19178A13576l34129j46272J5297J93507N4920o3718R017J58829J40971L7082k7997
$$ y = [23235118, 23258961, 21305658, 19328593, 17628797, 15778545, 14248026, 13139238, 12243818, 11272335, 9992497, 8776115, 7841494, 6984115, 6224978, 5695713, 5298165, 4767941, 4140079, 4226075, 3931829, 3611536, 4008656, 4389494, 4524513, 4195144, 3951557, 3672552, 3115358, 2747227, 2764205, 2824276, 2686304, 2604529, 2496801, 2321145, 2279226, 2314970, 2493814, 2346203, 2220047, 2036677, 1990730, 1819706, 1821572, 1855607, 1566286, 1365556, 1209956, 1008473, 1273300, 1412256, 1088112, 863187, 789223, 636506, 432278, 313234, 350911, 485456, 306364, 207772, 316316, 537615, 407383, 248794, 262391, 113576, -220553, -366825, -351528, -158021, -103101, -166819, -157802, 1027, 141998, 179080, 151083]
19167A51083q7697r3155J26272K12779K05526J20061n2462j56447J51181o5506
19157E11635j14759k0591j37573L1181J42893J72942l07175j21579K40324j26972
19147B70326m09448l48085J64036J14460o0977K5414R8265o7191j50137N3739
19137c09598K50107k01025j32715q879o1487k30773J82432K68560o2624l7009
19127c43011j17826l3566p7220j41288K54392J87615R3664J62874m29425J7075
19117d26716J09657J43422N6270k4836N670j1026q614M5823K3413k35880k5244
19106c48061J02579J58722R2725m8309q3711o9425l3327J94000l9464L0148J69029
19095A24906L5997k84050q2028J7109J69997K70146J10525l9302k90845j47313
$$ y = [151083, 63386, -29769, 96503, 309282, 514808, 634869, 582407, 425960, 577141, 511635, 396876, 376285, 238712, 269893, 412786, 585728, 278553, 156974, 397298, 270326, -139122, -487207, -323171, -208711, -269688, -244274, -146009, -213200, -363337, -309598, -59491, -260516, -393231, -402110, -463597, -694370, -511938, -243378, -306002, -343011, -460837, -494403, -571623, -712911, -458519, -270904, -177240, -14366, -443791, -426716, -317059, -173637, -117367, -142203, -136533, -147559, -156173, -110350, -86937, -322817, -348061, -245482, -86760, 5965, -42344, -126055, -195480, -228807, -34807, -74271, -44123, 124906, 160903, -123147, -205175, -188066, -18069, 252077, 362602, 323300, 32455, -114858]
19085a14858M3614j65215N9026n7427l9337M11186J99478k16447o0719j19652
19075f0351R1945m714r0309M0882Q8243m2833k16715j63583k40782P0815l2464
19064e59866J17361J61371L1688j69710m1750R8414K4791k30324N6844N0899k37176
19053f97458K4013Q626O695L1864N4378P6508j00991J01528L23436J92993k42439
19042b20847l81219j65907J20594O2804K13085K03965K13467j7393l63714j39178
19032d74343j6789K8406K75641J73956j8302k98721j68694n552j07239K78867
19022c32770K12021J94786k84555j54524j54680J39049l3184N2888L68111P9383
19012H6525j28537l66889o554K7869J09434j8557K9759J35148J13388p9542m8209
$$ y = [-114858, -71244, -236459, -177433, -234860, -274197, 136989, 336467, 120020, 59301, -60351, 31594, 26880, -63429, -22547, 65696, 22863, -193852, -357435, -598217, -527402, -559866, -442505, -281134, -249446, -419156, -460906, -362492, -337701, -568025, -511181, -460282, -697458, -673445, -664819, -658124, -626260, -571882, -495374, -596365, -494837, -171401, 21592, -220847, -602066, -767973, -647379, -584575, -371490, -167525, 45942, 28549, -335165, -474343, -491132, -462726, -187085, -13129, -31431, -330152, -498846, -504398, -611637, -332770, -120749, 74037, -210518, -365042, -519722, -380673, -413857, -360969, 7142, 86525, -42012, -408901, -415455, -387586, -278152, -296709, -266950, -131802, -18414, -97956, -146165]
19001a46165K94182K0727j95627p3763O8362q9241k26992J50365J63539N9039
18991B4426K4889R3531k23817j16167j5208J94224J75060M4293k41179k75058
18981c15006Q7554j9470l15731N7102K77361J62175M09102K78334Q9904R4909
18971H06234K95794p3574k72067j56784n7903K76866K53215K8199L15055q0346
18961A334689R627M3723k13045j14508k77390k08734j36015j38465l5902J1180
18951B75160J52299Q2055P1189M4244j5093j57766N8969K77709J62212R0145l34417
18940G06706m04376n4027J89177P0182O2642N742J43423O0761k60K5796L25868
18929A131634K22398M18789N35469k2180j53397q9586j3197J37645L10657J65888
$$ y = [-146165, 148017, 168744, -26883, -100646, -32284, -121525, -348517, -198152, -34613, 24426, 49315, 142846, -80971, -197138, -212346, -18122, 156938, 201231, -39948, -315006, -227452, -246922, -562653, -505551, -228190, -66015, 343087, 621421, 711325, 806234, 1102028, 1028454, 756387, 599603, 541700, 818566, 1071781, 1099980, 1415035, 1334689, 1344316, 1388039, 1174994, 1060486, 783096, 574362, 438347, 299882, 263980, 275160, 427459, 509514, 580703, 624947, 609854, 452088, 511057, 788766, 950978, 1041123, 706706, 302330, 248303, 437480, 507662, 570304, 576046, 719469, 780230, 779970, 805766, 1131634, 1354032, 1772821, 2308290, 2286110, 2132713, 2043127, 2029930, 2167575, 2478232, 2644120]
18919B644120L32223L05763m0955j7801m9282j62412j13516j07747o4807k85783
18909B439803k08702q9156K7194p1472q4802k15957k03285j21197l9284j17817
18899A315325j85251j91619n5751q824q3279J34545j8891o6497j35401J06440
18889H10797J71704J74411j34159k03219j98182L61516J62212J26613J45797M06280
18879A823770L04020K62504m3457P1029Q3570N9699J41054J87680p1932k03403
18869B614534p111J57272m0184m420K49771M0950q4047r355q9024J28531L66013
18858C322930R0153M7850k11641j13366M4192J61624J96831P4570R3506J4948
18848C721597J2094o845q0204j37285m00739k73199k42118k37017k25026P4957
$$ y = [2644120, 2976343, 3282106, 3241151, 3223350, 3174068, 3011656, 2898140, 2790393, 2725586, 2439803, 2231101, 2141945, 2169139, 2097667, 2012865, 1796908, 1593623, 1472426, 1433142, 1315325, 1130074, 938455, 882704, 873880, 790601, 925146, 906255, 839758, 704357, 810797, 982501, 1156912, 1022753, 819534, 621352, 982868, 1145080, 1271693, 1417490, 1823770, 2127790, 2390294, 2346837, 2417866, 2501436, 2561135, 2702189, 2889869, 2817937, 2614534, 2607423, 2764695, 2724511, 2720091, 2969862, 3010812, 2926765, 2917410, 2828386, 2956917, 3322930, 3413083, 3460933, 3249292, 3135926, 3180118, 3341742, 3538573, 3613143, 3706649, 3721597, 3733691, 3726846, 3646642, 3509357, 3108618, 2835419, 2593301, 2356284, 2131258, 2206215]
18838B206215j52501J61243J1625J3618K17659j76970j88776k32766j11407j42087
18828A605853k6764O891k07331K63630R786M8080k6520j25861J73050K58513L51016
18817B330343R4491M75755N25703O53163Q61194J019682J558011K122743L344281
18808A2985366N403679N577718J996998j165304j557486j211918p83417k9668
18800B1215968N45367J439717L567214O177938R374551Q792292O24986n128492
18792D6609541n456090m522016l677161l107129k811644k623652k267144j814648
18784B0330057j758196j557838j570812j071712n55591n89420p28886n05458l01619
18775A1690525p7871L46224O38289Q26635J353118K272295L055043L717806M873372
$$ y = [2206215, 2053714, 2214957, 2226582, 2240200, 2457859, 2280889, 2092113, 1859347, 1747940, 1605853, 1579089, 1585980, 1378649, 1642279, 1652065, 1700145, 1673625, 1547764, 1720814, 1979327, 2330343, 2424834, 2900589, 3426292, 4079455, 4940649, 5960331, 7518342, 9641085, 12985366, 18389045, 23966763, 25963761, 24798457, 23240971, 22029053, 21245636, 21215968, 21761335, 23201052, 26768266, 32946204, 42320755, 51113047, 51738033, 46609541, 41153451, 36631435, 32954274, 29847145, 27035501, 24411849, 22144705, 20330057, 18571861, 17014023, 15443211, 14371499, 13815908, 13226488, 12497602, 11992144, 11690525, 11612654, 11958878, 12597167, 13423802, 14776920, 17049215, 20104258, 23822064, 28695436]
18766B8695436O595083R943629J6191858K5700957L2304072K1217795k641915
18759A38006915j2725784j1528361q953109o530405m109410q66625L603162R976819
18751A06873202J8582812K4077459J4935955m84895k796040K910478Q154985J6168103
18743A88422059K0326317L512509j6768638k1179120j8416632j6086430j4294707
18736A25515358j2243368j0693124r102118p593425n651029m160455k685933m96349
18728G2889557K176397O322923J3061052K3440487M1135666O4582564P0928896
18721B94537542K2656145k7823216l6108216l0711760k6919981k2287110j8800150
18714A54543254j6387839j3927788j2006391j0421735r289666p818856n209005
$$ y = [28695436, 35290519, 45234148, 61426006, 87126963, 119431035, 140648830, 138006915, 125281131, 113752770, 104799661, 98269256, 94159846, 93293221, 96896383, 106873202, 125456014, 149533473, 164469428, 163984533, 161188493, 164098971, 172253956, 188422059, 208748376, 212260885, 195492247, 174313127, 155896495, 139810065, 125515358, 113271990, 102578866, 93476748, 85883323, 80232294, 76071839, 73385906, 72889557, 75065954, 81388877, 94449929, 117890416, 159026082, 223608646, 294537542, 317193687, 289370471, 253262255, 222550495, 195630514, 173343404, 154543254, 138155415, 124227627, 112221236, 101799501, 92509835, 84690979, 79481974]
18707G9481974l448802j535118J780734O639922J3145840K2344072K9643777K2170244
18699A70222643L960278k65156M730794Q984158J0069678j141593j5087821j8063485
18691A63409496j5282709j2582807j0233282o966612k471198M133818J2832566
18684A32839272J9461634J1886464q916228j8086339j6653495j3947166j2509364
18677I4074778j0930965r440793p881090o562175n446811m677655m036183l418357
18669D1680749l330879l292422l056354k876148k537764k009028j684316j453272
18661B1440566q20434K0814M31352R15407R53009J324321J349901J484886J736047
18652B8835869K612519N302742P765735N608537j621590m853759m265588l403352
$$ y = [79481974, 76033172, 74498054, 76278788, 82918710, 96064550, 118408622, 148052399, 170222643, 174182921, 173917765, 178648559, 187632717, 197702395, 196560802, 181472981, 163409496, 148126787, 135543980, 125310698, 118344086, 115872888, 120006706, 132839272, 152300906, 164187370, 155271142, 137184803, 120531308, 106584142, 94074778, 83143813, 73703020, 65821930, 59259755, 53812944, 49135289, 45099106, 41680749, 38349870, 35057448, 32001094, 29124946, 26587182, 24578154, 22893838, 21440566, 20620132, 20640946, 21072298, 21987705, 22940714, 24265035, 25614936, 27099822, 28835869, 31448388, 36751130, 44516865, 50125402, 48503812, 43650053, 39384465, 35981113]
18644C5981113k707058j998061j035349J69473J218895K248299K290996r27152
18636C5241156l611486l886886l227337k748358k517217j988845j481907j223386
18628A4555734r46574j137895r43416o11171k70544o1817J58341L65726j14843
18619A0993541n53450n54781m92247j36761l94386Q2077K31542J26135M29110
18610I730780O20007J55223m95553r19584p78566o03590l90460l54429m32737
18601F531091n05547j74737m10903k36171j86889k69363k05100l68830n03477
18592C670074l66346k61086p5818L492k34315l24692m54049m4854K2347K5328
18582A960081R8793K1006J48059P0946J63424L96978K0353N20263M55757k18770
$$ y = [35981113, 33274055, 31275994, 30240645, 30410118, 31629013, 33877312, 36168308, 35241156, 31629670, 27742784, 24515447, 21767089, 19249872, 17261027, 15779120, 14555734, 13609160, 12471265, 11527849, 10916678, 10646134, 10584317, 10742658, 11108384, 10993541, 10440091, 9885310, 9393063, 9256302, 8861916, 8943993, 9175535, 9301670, 9730780, 10350787, 10506010, 10010457, 9090873, 8312307, 7708717, 7318257, 6963828, 6531091, 6025544, 5850807, 5439904, 5203733, 5016844, 4747481, 4542381, 4173551, 3670074, 3303728, 3042642, 2966824, 2970316, 2736001, 2411309, 1957260, 1912406, 1934753, 1960081, 2058874, 2079880, 2227939, 2298885, 2462309, 2859287, 2879640, 3399903, 3855660, 3636890]
18572C636890j84253o5449p4223k21823k23194L37089K70129J93877J91849Q105
18562C868997j49008k63889l20940k8595O9113j33112m38599M5563m6980r443
18552B593107K94997j92095n05417q5295J01382p7834j51708o3246l29865P940
18542A591966k9077m3705K44939N9027J67543J27963J13080p59j79861J13355
18532B164471O7431J51515j8019r3345J07597O1843k61616n10924k41732l9474
18522A387747n9755j13958J74586K17024j84597n6717J54192j23842j96860j25201
18512A072619k50584J58069j56774o0615J67787k4882m6693p5840K62773L24602
18502A370462J08215k29627m1421j18151r2702j94378K25413P1044q5753J69000
$$ y = [3636890, 3452637, 3387188, 3312965, 3091142, 2867948, 3205037, 3475166, 3669043, 3860892, 3868997, 3719989, 3456100, 3135160, 3106565, 3175678, 3042566, 2603967, 2649530, 2602550, 2593107, 2888104, 2696009, 2190592, 2105297, 2206679, 2128845, 1977137, 1913891, 1584026, 1591966, 1562889, 1519184, 1764123, 1823150, 1990693, 2118656, 2231736, 2230977, 2051116, 2164471, 2231902, 2383417, 2365398, 2272053, 2379650, 2441493, 2179877, 1668953, 1427221, 1387747, 1327992, 1214034, 1388620, 1605644, 1421047, 1364330, 1518522, 1394680, 1197820, 1072619, 822035, 980104, 823330, 762715, 930502, 905620, 858927, 783087, 1045860, 1370462, 1478677, 1249050, 1207629, 1089478, 996776, 802398, 1027811, 1098855, 1013102, 1182102]
18492A182102K67885m7828l1313j29053K36105J17238J01568K09875P1952k14246
18482A764285j91825r026K92124O6951j14316j53914p0437m7892k38496l00612
18472I96842j84694o8533j52363N0836R1815o9391k4860M8487j38870J70683j30624
18461E89328J87727N5549J14393N4022k40974j50832j29229n0269L04840J17824
18451H52379J2090k00090n57689k21068L29048K18691K41997L81543K2977m4133
18441A035745K52355K01506k34938j2631j38126J75319L83090k00553j86927k5724
18431A249116q8017n1678l42677m20585j88445K51622J47320M1478J44909J62565
18421I05608r5376k82524L7236J51618j20184r1076J21298k83414j71189K86922
$$ y = [1182102, 1449987, 1402159, 1370846, 1241793, 1477898, 1595136, 1696704, 1906579, 1978531, 1764285, 1572460, 1563434, 1855558, 1922509, 1808193, 1654279, 1583842, 1535950, 1297454, 996842, 812148, 743615, 591252, 642088, 733903, 664512, 639652, 688139, 549269, 719952, 589328, 777055, 832604, 946997, 1001019, 760045, 609213, 479984, 429715, 734555, 852379, 864469, 664379, 106690, -114378, 214670, 433361, 675358, 1056901, 1079878, 1035745, 1288100, 1489606, 1254668, 1242037, 1103911, 1279230, 1662320, 1461767, 1274840, 1249116, 1161099, 1109421, 766744, 346159, 157714, 409336, 556656, 598134, 743043, 905608, 810232, 527708, 564944, 716562, 596378, 505302, 626600, 343186, 171997, 458919]
18411D58919r6878j81930K0145L02594O8668j54806l19922J49288L76027R4361
18401G16466O110j02330n3342k99632m03932k8405K01596K36909L4276J20479
18391D28195P8153n6961l1250L4584r0269K6245l3546P6074J27580J28097q1188
18380F05714k33741j92536k63021p3882Q7390L26932j1680o0302J45332Q0428
18370D10634l3928j53369J18036K74061J02506k04123l1616j14538J10642J19702
18360E98007m7278k1238j11990j93842q1964P0065n9197n1351M692j45356K22630
18349A83178K04063K0838j22829k39825q9020o8893O1482K10774j65225j76141
18339a81598q962q3312p4485p2806J84673K99117K39297j31572j83485k29181
$$ y = [458919, 362041, 180111, 200256, 502850, 571518, 416712, 96790, 246078, 622105, 716466, 722576, 620246, 566904, 267272, -136660, -165065, 36531, 273440, 307716, 428195, 506348, 449387, 418137, 452721, 362452, 388697, 355151, 431225, 558805, 686902, 605714, 371973, 179437, -83584, -157466, -70076, 256856, 245176, 184874, 330206, 410634, 376706, 223337, 341373, 615434, 717940, 513817, 482201, 367663, 478305, 598007, 550729, 529491, 417501, 223659, 141695, 211760, 152563, 101212, 105904, -39452, 183178, 387241, 408079, 285250, 45425, -43595, -112488, -51006, 159768, -5457, -181598, -190560, -273872, -348357, -421163, -236490, 62627, 301924, 170352, -13133, -242314]
18329b42314J98351K80876j25282l73113J46096O9032n7641R9199J89615j53797
18319C1022p8801J51458R3071K85650j58905k10726J01402m7385k23668P2576
18309A5694N6948j37296m0203J34506Q798k45283J3094j57486n8208J63551j77671
18298d23556J14564J57911K14353J3260j3929n2071j59853Q8686m993m13156k0474
18287d99258K35417K9581J01334P8200K33778j48376j99740J89479K33428K76530
18277E30373r8265j65922O3864J6630M2263J1256L8357J54775J32556j18606L0420
18266F37701q8812k88516j41784j01725n6709l9981j04463O5531p3057K09592
18256A7777K22054N4329k4667j49367n7330K71785M1570j41457k18406j26910
$$ y = [-242314, -43963, 236913, 111631, -261482, -115386, -46354, -103995, -4796, 184819, 31022, -47779, 103679, 196750, 482400, 323495, 112769, 214171, 166786, -56882, 15694, 72642, -64654, -104857, 29649, 38447, -206836, -193742, -351228, -409436, -245885, -423556, -308992, -151081, 63272, 76532, 62603, 10532, -149321, -60635, -65628, -478784, -499258, -263841, -234260, -132926, -54726, 179052, 30676, -169064, 20415, 253843, 530373, 432108, 266186, 330050, 346680, 388943, 400199, 438556, 593331, 725887, 607281, 637701, 548889, 260373, 118589, 16864, -39845, -79826, -184289, -118758, -191815, 17777, 239831, 294160, 269493, 120126, 62796, 334581, 376151, 234694, 16288, -110622]
18246a10622k80732M6145O925K9935M70164K62865j12041P4955O0058k19607L05105
18235E33150J18140q4320O1918l5114j45690j2230L44660L38687J60142P1154
18225A350497j94909j61348k99493r124o0163k09899o0009J00620J25927p050
18215E75049k26816k7597J7234j89943j35228J70862L22557j50681k19896j72801
18205c7260p8309q295j93523j86216K8765K20759K07029k09951P4415K27607j90539
18194a45518j90520k42057J86399N18784J20271j86015J92604J89099J39292J14856
18184F97195Q7854j23477J48599K8943m6231K5980o0525l37397O2942r829m0889
18173D33165J87220K61999j26071k49212j82608j19791n3872K56110k36917k14943
$$ y = [-110622, -391354, -345209, -338284, -308349, 161815, 424680, 312639, 387594, 447652, 228045, 533150, 651290, 566970, 628888, 593774, 448084, 435854, 780514, 1119201, 1279343, 1350497, 1155588, 994240, 694747, 685623, 625460, 415561, 355552, 456172, 582099, 575049, 348233, 320636, 337870, 147927, 12699, 183561, 506118, 355437, 135541, -37260, -115569, -123864, -317387, -503603, -474838, -254079, -47050, -257001, -182586, 45021, -145518, -336038, -578095, -391696, 127088, 247359, 61344, 253948, 443047, 582339, 697195, 785049, 661572, 810171, 839114, 792883, 818863, 758338, 420941, 483883, 474054, 433165, 620385, 882384, 756313, 507101, 324493, 204702, 150830, 406940, 170023, -44920]
18163d4920N7173K29147Q7075j55073m14155j19582O0500n170N4558m3291m9276
18152c43014R9535K29274J20945J39508K17783j773j62224L32358j13577o4217
18142D54598j20237q819j14142L39950L35781J5759J93990R0424j49257M05961
18132A444008K91839K60769N19893K72220M35415K60298K65997K01328P24200
18123D675967M84573Q67041J516914K163674K278282K703794L860362N659654
18115B4210261Q190229J2832320K0796948L5791330O2512746R6853779Q9800514
18108C50988127K705525m6237665m2135252l3897640l0119756k4529676k1350437
18101A55423226j8528909j5755656j3828273j2731257j2124666j1077216r131238
$$ y = [-44920, 12253, 241400, 328475, 173402, -240753, -360335, -299835, -305005, -250447, -293738, -343014, -243479, -14205, 106740, 246248, 464031, 462258, 300034, 632392, 518815, 454598, 334361, 325542, 211400, 551350, 887131, 902890, 1096880, 1187304, 1038047, 1444008, 1735847, 1996616, 2516509, 2788729, 3224144, 3484442, 3750439, 3951767, 4675967, 5160540, 6027581, 7544495, 9708169, 11986451, 14690245, 18550607, 24210261, 32400490, 45232810, 66029758, 101821088, 164333834, 261187613, 350988127, 353693652, 307455987, 265320735, 231423095, 201303339, 176773663, 155423226, 136894317, 121138661, 107310388, 94579131, 82454465, 71377249, 62246011]
18094F2246011p934713p248926o309882n070891m196646l781631l191683k817036
18086B1694603k410714j831730j565847j322546j162366j230520j255366j162672
18078I752842r07844n74581o17464o14266m64544n44938k90063k88862l68500
18069E081780k99256m25506j97065q3125m6117k81796k04428J98093K20849N0791
18059D014220J48438J76906k51345k60077M9804j87696k92570j90759o7831j68628
18049B970462q3425P0918j72785l42711j62498M8167K40446K4708j58151n8015
18039B377116l52182m07348j44242L00637q7079j6148m1033m4989l10530q4729
18029A189473K18635j94994j76244r3749j69023l1987J06454N316j54939J73583
$$ y = [62246011, 54311298, 47062372, 40752490, 35681599, 31484953, 27703322, 24511639, 21694603, 19283889, 17452159, 15886312, 14563766, 13401400, 12170880, 10915514, 9752842, 8844998, 8270417, 7652953, 7038687, 6574143, 6029205, 5739142, 5450280, 5081780, 4782524, 4357018, 4159953, 4076828, 4030711, 3748915, 3544487, 3742580, 3963429, 4014220, 4162658, 4339564, 4088219, 3828142, 3877946, 3690250, 3397680, 3206921, 3139090, 2970462, 2887037, 2957955, 2785170, 2442459, 2279961, 2328128, 2568574, 2593282, 2435131, 2377116, 2024934, 1617586, 1473344, 1773981, 1686902, 1670754, 1629721, 1584732, 1274202, 1189473, 1408108, 1213114, 1036870, 943121, 774098, 742111, 848565, 853881, 698942, 872525]
18019H72525J72591r3367L2521K04861J23768J18226j54228J92376k16450l36065
18009I16758N294M0805j30064k2998j466J07247K04805J03397N9788J9563o789
17998A296340J94689J32410K54342J58993m8196R731K0578L5942Q4097n103N00774
17987B634597K65092K16216J10778Q4004r9702l88455k26790l81879l70088k63621
17977A580152j46611L2641P6778N221r5332k11355k63339k29886q9941K45815
17967I04143K94604l64j67861n2396k33754k98403q6734K47225R3858K76595J42260
17956A119173j28208k87030L0014J57376P1K29092K48722J22500k6479J06004
17946A571235M1315J57538j04302k47835q203M2651m9721O805m0567k04932q7783
$$ y = [872525, 1045116, 951749, 984270, 1189131, 1312899, 1431125, 1276897, 1469273, 1252823, 916758, 922052, 962857, 832793, 809795, 808329, 915576, 1120381, 1223778, 1283566, 1303129, 1296340, 1491029, 1623439, 1877781, 2036774, 1988578, 1998309, 2018887, 2054829, 2138926, 2133823, 2634597, 2899689, 3115905, 3226683, 3310687, 3210985, 2822530, 2595740, 2213861, 1843773, 1580152, 1433541, 1466182, 1542960, 1548181, 1452849, 1241494, 978155, 748269, 658328, 904143, 1198747, 1198383, 1030522, 978126, 744372, 445969, 359235, 606460, 700318, 976913, 1119173, 990965, 703935, 733949, 891325, 891396, 1120488, 1369210, 1491710, 1465231, 1571235, 1612550, 1770088, 1665786, 1417951, 1409748, 1452399, 1402678, 1409483, 1368916, 1163984, 1076201]
17935A076201k9167J55707P9084l86604k54958k9713J87540J66814N1547j37550
17925H78901k70613O1979j957M6553Q7120j06584q9027J56021M831o5091M2800
17914G44933k36930j13364m1386j60043J9098n4755n1599M387J68989k4445P4387
17903C29272j42586N1321j92115k8580k5641K50877K22681J54224P4660j34553
17893E59560K50788J76554K996q7984K6391k97255k00058L5862m1031j05865m4530
17882B75428k75202L7614K40215O4534l81746j30045J10463K59599K34615P8729
17872E14204l6082o9896J36882p4874k33583L1629p8672R428J01791R4623N4267
17861D49717l15757k13196r0208N6883P7658Q359q1018M03145J49188r4815J32733
$$ y = [1076201, 1047034, 1202741, 1281825, 895221, 640263, 610550, 798090, 964904, 1016451, 878901, 608288, 670267, 668310, 714863, 801983, 695399, 606372, 762393, 767224, 702133, 744933, 508003, 394639, 353253, 193210, 212308, 157553, 105954, 110341, 279330, 254885, 329272, 186686, 238007, 45892, 17312, -8329, 242548, 465229, 619453, 694113, 559560, 810348, 986902, 989898, 901914, 928305, 631050, 430992, 466854, 425823, 319958, 275428, 226, 37840, 278055, 342589, -39157, -169202, -58739, 200860, 435475, 514204, 478122, 408226, 545108, 470234, 236651, 268280, 189608, 199036, 300827, 395450, 449717, 133960, -79236, -169444, -112561, -34903, -26544, -107562, 295583, 444771, 349956, 482689]
17850D82689q1112j17799p6610k4393J65877l00593j2599L6884k96328k19396
17840d43380j4562Q6120L27384K38327j08041J0502M8567J19760r3345o6626r5603
17829I103k55868J86509J28257J92900L05782j27015k15128j23215k12017P9528
17819c1164r9570Q3075J12059J17606O9047m8161N4782q7738j35353K90118L09136
17808F33837p6307k70039R2360l5985j31712o5782J82871L36782p4517k34488
17798C57020k19486K03123J55185k04401k39272P1044j019P5798j14440j96728
17788a13176j58079o0829J46930M61127K69076J16266J28761r4055n2165k85904
17778C57952K1214q1564j3599j01390j90485K4236L65620L53776j67288m04827
$$ y = [482689, 401577, 283778, 207168, 182775, 348652, 48059, 35460, 72344, -223984, -443380, -457942, -371822, -44438, 193889, 85848, 96350, 144917, 264677, 171332, 104706, 9103, -246765, -60256, 68001, 260901, 566683, 439668, 224540, 101325, -110692, -31164, -130734, -47659, 64400, 182006, 251053, 202892, 257674, 169936, 34583, 324701, 633837, 557530, 287491, 379851, 343866, 212154, 146372, 329243, 666025, 591508, 357020, 137534, 340657, 495842, 291441, 52169, 123213, 122194, 197992, 83552, -113176, -271255, -332084, -185154, 275973, 545049, 661315, 790076, 696021, 643856, 357952, 379166, 297602, 284003, 182613, -7872, 16364, 381984, 735760, 568472, 163645]
17768A63645l21210j40927o5884K76044K41430J4150j7557j45734L6170L95056
17758D35183K6674k77581J01787R8303j33788q0470N3743J95185N4658q1095k88532
17747A04067j47450K26256J16945j08135j79785k44314K38674L78631M1041j64779
17737B61151K2062j57810l6348k01126Q6254K44329L4723J90609r5470K510j82302
17726A68582j55806l53902O6327N8700R9847j9492o8188L52191Q3939N6788k46659
17715D2327J38495P5844J7212J5438o5457q0074j4286K9289k3971K50710q0061
17704C05466k14562l7764j1935n1952J20305R4242Q9879O7052J56075j93790m191
17693C18825p0675j52080j98288P2818L12995K82057p3230q7301J09213r9940
$$ y = [163645, -157565, -298492, -364376, -88332, 153098, 167248, 149691, 3957, 40127, 435183, 461857, 184276, 286063, 384366, 250578, 170108, 223851, 419036, 473694, 392599, 104067, -43383, 182873, 299818, 191683, 11898, -232416, 6258, 384889, 425930, 261151, 283213, 125403, 89055, -112071, -25817, 218512, 253235, 443844, 348374, 350884, 168582, 12776, -341126, -274799, -216099, -116252, -135744, -203932, 148259, 232198, 288986, 42327, 180822, 256666, 273878, 289316, 223859, 143785, 129499, 158788, 134817, 385527, 305466, 90904, 53140, 41205, -10747, 109558, 203800, 293679, 360731, 516806, 323016, 318825, 248150, 96070, -102218, -29400, 283595, 565652, 492422, 405121, 514334, 414394]
17683D14394j66112q8067M7390J05898J11579p6667k91856k2751J99088Q5273
17673C18169J6353K3155j8374j27614l060j16846k16354J60337m413l317j53948
17662a25912J15371M34175N4608k87432k05580K4761N0511J86268K22304j5651
17652D53423l54367m4445r8377l27051J71298R1306k09122M0088L34641J61042
17642B18436j04801j67764J19485O5562J411l6023J0585J53599j37006K04254
17632C27738J67409j75954j11367Q2566k42626j73393R7754J87943j80360k10143
17622b30433K03280K44953j92028r663K2470J02521K57209r531m9276k22535K2084
17611A39051K47900j49176k42585l27752M5997K12315J88715j77179j26391K57962
$$ y = [414394, 248282, 160215, 207605, 313503, 425082, 348415, 56559, 33808, 232896, 318169, 334522, 357677, 339303, 211689, 208629, 91783, -124571, 35766, 31353, 28036, -125912, -10541, 423634, 478242, 190810, -14770, 9991, 60502, 246770, 469074, 453423, 99056, 54611, -43766, -370817, -199519, -108213, -317335, -277247, 57394, 218436, 113635, -54129, 65356, 130918, 132329, 96306, 106891, 260490, 123484, 327738, 495147, 319193, 207826, 290392, 47766, -125627, -27873, 160070, -20290, -230433, -27153, 217800, 25772, 16109, 38579, 141100, 398309, 388778, 339502, 116967, 139051, 386951, 237775, -4810, -332562, -286565, -74250, 114465, -62714, -189105, 68857]
17601F8857m4054q8032M5394l1280n2732j70633k06241l1762L34341K70074j10567
17590a6635N4195J44666m08230k6974J96161k4686k4042l2256K47K78278K81747
17579D22471j0266j15687k20118l54158J63172R2756r6205k94259j07246J12995
17569d06545K78229J30022l9778J02148r3263j49358j42053J71807L22036J53785
17559C27030K04875L8467l84282l16144J26070j87169j71514J32203R1834R3244
17549d5386l1538N4099j63222j04574Q6709J17910P1653J96682L63846Q4540j34285
17538D96434j22994r7863j20192m34114n7076j7717j49701J37567K74076Q9698
17528a882P7193o660J10128P8454o1932k03527j24123j6364K56399N6103j08775
$$ y = [68857, 24803, -63229, -17835, -49115, -101847, -272480, -478721, -510483, -176142, 93932, -16635, 37560, 182226, -226004, -252978, -56817, -81503, -105545, -137801, -137554, 140724, 422471, 412205, 296518, 76400, -277758, -114586, -21830, -118035, -412294, -519540, -406545, -128316, 1706, -38072, 64076, -29187, -178545, -320598, -148791, 173245, 327030, 531905, 570372, 186090, -130054, -3984, -191153, -362667, -230464, -138630, -45386, -76924, -22825, -186047, -290621, -203912, -86002, -14349, 182333, 546179, 630719, 496434, 373440, 275577, 155385, -278729, -335805, -353522, -503223, -365656, -91580, -1882, 75311, 68651, 178779, 257233, 195301, -8226, -132349, -148713, 107686, 163789, 55014]
17517E5014l1535r4541k8633n7218l4551j9336k63996L868J13402N390m1041L7256
17505c55921K67433J87521J51237K07237J09151k66647J76736k3684o1212k10222
17495A81629k56012k87948J07883K88465K28275j48574m6756J22922J58947n336
17485C43495R8269O2493k40148k17007j97867o3555k10L8314L1649J2917n5713
17474a87363j38540L901K20204M0154j16331K31874K48691k56954k26842r512
17464a90718l6327J74274K1573M640j28044R8002o4241N7002J56621M41351J69734
17453G03867l62254r3187l4558p4089K8723J25007J34854p3737Q048M40278O58491
17442A461443k4755j57994K3893k07826k61703j14116o2148j32852L07409K32579
$$ y = [55014, 23479, -71062, -99695, -156913, -191464, -210800, -474796, -470928, -357526, -352136, -393177, -355921, -88488, 99033, 250270, 457507, 566658, 300011, 476747, 453063, 391851, 181629, -74383, -362331, -254448, 34017, 262292, 113718, 66962, 189884, 348831, 343495, 441764, 504257, 264109, 47102, -150765, -214320, -214530, -176216, -144567, -131650, -187363, -325903, -322002, -101798, -61644, -177975, 53899, 302590, 45636, -181206, -190718, -227045, -52771, -31198, -26558, -154602, -56600, -120841, -63839, 92782, 534133, 703867, 341613, 248426, 213868, 139779, 168502, 293509, 428363, 354626, 362674, 802952, 1461443, 1436688, 1278694, 1302587, 1094761, 833058, 718942, 656794, 523942, 831351, 1063930]
17432A063930J2094k57130l16643K2061k4403M2221R9718r7010k71735K9605P0233
17421C72941k72938j18604L12066q1672p5839K73120J6551k69056m15677j74017
17411d33125j8947J21817Q0763k06695J29146J71059K26935Q4826k06392p6572
17401a27185J3945p4044j66264n9459M08809q1482r0746J7811k8375J5825q2473
17390b53638J92677M37049K57999j49272j96022N5059Q6018r3123l10282N706
17380C2171N7965j56344n3869j80609R6774k53913m7600r1403K25377r9874O6634
17369d04691M50928J8913l8581k65356j78836J18603J36397J99171J18208o3214
17359I1542k8497J09624K17535q9221k52617j31101J27089J01603j23774M946
$$ y = [1063930, 1076024, 818894, 502251, 524312, 499909, 542130, 641848, 544838, 273103, 302708, 372941, 100003, -18601, 293465, 211793, 135954, 409074, 425625, 156569, -259108, -433125, -452072, -330255, -249492, -456187, -327041, -155982, 70953, 155779, -50613, -127185, -113240, -187284, -353548, -413007, -4198, -85680, -176426, -158615, -186990, -171165, -253638, -60961, 376088, 634087, 484815, 288793, 343852, 429870, 336747, 26465, 32171, 90136, -66208, -120077, -300686, -203912, -457825, -505425, -596828, -371451, -471325, -404691, 46237, 65150, 26569, -238787, -417623, -299020, -162623, 36548, 154756, 91542, 63045, 172669, 390204, 300983, 48366, -82735, 44354, 145957, 22183, 27129]
17349B7129P6769j0836J08025j2275j77168j53483P6596P8093l8044r9290K73747
17338A49263J70121K6328l24991k34807J48879J05643l5932n5829J06921K485
17328E8081O8030q6343N2038J52864O4334J2219p3861M744K53647L6111j72875
17317C68989M6226j72415j91936k9585r4451p1568K81435r9588q2008J61676j10964
17306E811l09942R383L69613L49206k04397j45161j80299j22439q4830l413K57972
17295e8496j54703j02099O735k79725P5204j78370J12008K66495O1596m9586m0490
17284c41431P0611J404K3785L09428K21248J46675l18279p2504o9214r8282J90083
17273F3524K05343j69893j07127M9184J77538q0913k0846j36232j96563k70591
$$ y = [27129, 103898, 93062, 201087, 188812, 11644, -141839, -65243, 12850, -25194, -124484, 149263, 319384, 345712, 20721, -214086, -65207, 40436, 4504, -51325, 55596, 58081, 126111, 39768, 91806, 244670, 309004, 321223, 247362, 252106, 505753, 541864, 368989, 415215, 242800, 50864, 21279, -73172, -144740, 136695, 37107, -44901, 116775, 5811, -304131, -294748, 74865, 424071, 219674, 74513, -105786, -228225, -313055, -316468, -58496, -213199, -315298, -308563, -588288, -513084, -691454, -579446, -312951, -251355, -300941, -341431, -270820, -269416, -245631, 63797, 285045, 431720, 113441, 40937, -28277, -126559, 63524, 268867, 98974, -8153, 41031, 218569, 137656, 116810, -19422, -215985, -486576]
17263d86576J52922P7962J72279l0617m5571Q4558J9435j16467j26002k6276J68973
17252a55380J91676J28271N4871j24501M2753o8142j49407r518p5586j15306J17512
17241a62757J98142J9020k2353p619r5345J86443j14314m13455l4194K02520j54153
17230c98065k29956R0338J1688Q3136M21710N5927j16112j45660l6709n9707k267
17219c25677r9545J50651L89785J94630j81442m3481n8994K85365Q1366M1833
17209D34491L40135j49914l81158l35190L9886J68599q9406J3554J1084l03342
17199b51261M7120L07735L2060L2325k01082k36862n66j3944J80198K1750j20459
17188b02986J07371J3792J21232L5850p4857M8870k16547l9997P4715j19497p6152
$$ y = [-486576, -333654, -255692, -83413, -114030, -159601, -75043, -55608, -172075, -298077, -324353, -155380, 36296, 164567, 219438, 94937, 137690, 69548, -79859, -89377, -164963, -280269, -162757, 35385, 54405, 32052, 24433, -70912, 115531, 1217, -412238, -446432, -243912, -398065, -628021, -537683, -525995, -442859, -21149, 34778, -81334, -226994, -263703, -323410, -325677, -425222, -274571, 115214, 309844, 128402, 84921, 25927, 311292, 392658, 434491, 774626, 624712, 243554, -91636, -51750, 116849, 27443, 40997, 52081, -251261, -204141, 103594, 135654, 167979, -33103, -269965, -270531, -284475, -104277, -82527, -202986, -95615, -81823, 39409, 75259, 402, 49272, -167275, -207272, -132557, -252054, -328206]
17177c28206J44223P1435K87067J13899j95071j80667n8795o8015l5437J44793
17167a04774j00721q3725K3256J62346K74550r8312j93101j65897O7834j0453
17157b28997R27J40661N2581k86590j21422K22505K05381M6070j08371J27216
17147D9961N6677J55834J41046l59736l43924r6202L9598J53957j49354p5276
17137d27419J45756M0572Q0134J29436m0763j14496k44782L2L37023K9257M1681
17126b3569j11163K25343j05659n7253K11627J3097p1831n5126j20297R8058j23361
17115a20134n2582j23675N4833J60425L39701J96261k42771m9236n7995n0039
17105E4788k01337O0794k80497j37047M0555J50809L40926Q8246k78008M5211
$$ y = [-328206, -183983, -112548, 174519, 288418, 93347, -87320, -146115, -214130, -249567, -104774, -205495, -289220, -265964, -103618, 170932, 72620, -120481, -286378, -218544, -228997, -228070, -87409, -34828, -321418, -442840, -220335, -14954, 31116, -77255, 49961, 106638, 262472, 403518, 43782, -300142, -396344, -356746, -202789, -352143, -427419, -281663, -241091, -160957, -31521, -72284, -186780, -431562, -431530, -94507, -65250, -23569, -134732, 90611, -15048, -72301, 139326, 152423, 80592, 25466, -94831, 3227, -120134, -172716, -296391, -241558, -81133, 258568, 454829, 212058, 162822, 104827, 54788, -146549, -85755, -366252, -503299, -462744, -311935, 28991, 117237, -160771, -115560]
17095a15560J46627j02467o8183O6824J50547J06289L34600K30747j28481l14022
17085C06921j70592j85007k61490k1188l4588J13221J79628J30393R3416q884
17075A41830l7987j06043J50962R7292l0316k7457m6053j68086p3409l9138J4066
17064a24339J68055k35872j33037K01453J24870P7122K21519J29872j56346k15569
17054E7728K294J1359p6814j82474P6390L9761O162J91650J4888N3829K38038
17043D32811k7362l13202l27097M5216J63426J55531j69560p1969r2713j19532
17033c24451O987Q1553k0845j31231J9531K70961J53012k92411j16380K614R7487
17022b53173R0295N7097J98761j5238j53499j88171N6452K96766j93917j88108
$$ y = [-115560, 31067, -71400, -139583, -72759, 77788, 184077, 518677, 749424, 620943, 306921, 136329, -48678, -310168, -331356, -365944, -252723, -73095, 57298, 150714, 141830, 103843, -2200, 148762, 246054, 215738, 188281, 142228, -25858, -99267, -138405, -124339, 43716, -192156, -325193, -123740, 1130, 78252, 299771, 429643, 273297, 57728, 60022, 71381, -5433, -187907, -111517, -71756, -65594, 126056, 140944, 194773, 432811, 405449, 92247, -234850, -189634, -26208, 129323, -40237, -112206, -204919, -324451, -317464, -235911, -256756, -387987, -368456, -97495, 55517, -236894, -353274, -350660, -253173, -162878, -105781, 92980, 77742, -75757, -263928, -207476, 89290, -104627, -292735]
17012b92735J08483j08449j45930O7837M06072L92140J52277m26329m21235P1738
17002a96131j6117K9962l5995M8753L07808K97033K48361N2831j13916l09330
16992C13259j43167j04886o3130J20473K10326p2218n7670l22237l38635O3696
16982c94189m6364j02989k81705M03547M93035J02945j96463m5380L3632j00526
16972a34457M5538R5200J22168K6973Q2988r264j96493r5883l0408m161J72485
16961G4686R4239q4860p9841j87705j352j65250j1546L63681j73116l16196j23392
16950f10652J66952L22700K2448K38732m8882r2955m4233L7255J88535l5694J86024
16939C30230N5928R878j4329m02949j30926j07755J88023R1253J03403J69006
$$ y = [-292735, -184252, -292701, -438631, -370794, 35278, 427418, 579695, 153366, -267869, -196131, -212248, -182286, -218281, -169528, 138280, 435313, 683674, 736505, 622589, 313259, 170092, 65206, 2076, 122549, 332875, 260657, 202987, -119250, -457885, -394189, -440553, -543542, -825247, -421700, 71335, 174280, -22183, -67563, -33931, -134457, -88919, 6281, 128449, 155422, 238410, 229146, 32653, -63230, -93638, -97799, 74686, 168925, 84065, 4224, -183481, -184833, -350083, -361629, 2052, -171064, -487260, -610652, -443700, -121000, -98552, 140180, 91298, -1657, -45890, -8635, 179900, 144206, 330230, 386158, 396036, 381707, -21242, -152168, -259923, -71900, 19353, 122756, 291762]
16929B91762j70980p2328J6734K91022L8770n7418R4442l02138j15800j51042
16919a36976l10704j53017l2392J31670J62581K11055K60990o4593k64694j28413
16909c24493j00945J48363J28310q5687r5228M255K06146K77343J68552m1888
16899B84728k83708n1390J54418k28951l03531M4658J79771R4398M23492K38744
16889E52629l76248j53770j67621Q4472l681l24426Q9997K71251O2928q905l89687
16878c63061l67935K85005K34148J34060K68229j27329k94229m1226R3568L06796
16868A28026K79164L3271k88721k59281J76623k2410j13658k03098M6640J3904
16858b09540J71993k8832j06050j3883j5359J9919J1826R5718k91735j12648K3420
$$ y = [291762, 120782, 48454, 65188, 356210, 394980, 337562, 432004, 129866, 14066, -136976, -447680, -600697, -633089, -501419, -338838, -127783, 133207, 68614, -196080, -324493, -425438, -277075, -148765, -234452, -329680, -325425, -119279, 158064, 326616, 284728, 1020, -50370, 104048, -124903, -428434, -383776, -204005, -109607, 313885, 552629, 176381, 22611, -145010, -60538, -64219, -388645, -298648, -27397, 35531, 26626, -363061, -730996, -445991, -211843, -77783, 190446, 63117, -231112, -272338, -178770, 128026, 407190, 440461, 151740, -107541, 69082, 46672, -66986, -270084, -223444, -209540, -37547, -66379, -172429, -186312, -201671, -181752, -169926, -74208, -365943, -478591, -455171]
16847d55171j6816n0749j2153Q9680J8558j08861K86893K58020k36795j82343
16837d09737r716J14259J55261J73654n8479l12692k2784K31889m5471l04181
16827d87997m8186L42058L94636O6444l0976k76274k3794K25713j24375j45408
16817a08159n9152M8617Q7693j84785R8710J48734j89978j49442K72298R767k14380
16806b40077K029k6732m9458N3004Q0031j76898n7546o1042m0691P6964J4502
16795d25914j61583k44852J54268J29709K14010j06073P9409J86285p4162J47393
16785a01510J22977N5211L0313j27350j71663J06854m2742m6892O1096m4398J41464
16774a6640k47536j13575L41265K03681k60923j08506N5063j6467j6050R4117
$$ y = [-455171, -471987, -522736, -534889, -445209, -426651, -535512, -248619, 9401, -227394, -409737, -419453, -305194, -149933, 23721, -34758, -347450, -370234, -138345, -183816, -487997, -536183, -194125, 200511, 266955, 235979, -40295, -64089, 161624, 37249, -108159, -167311, -118694, -31001, -215786, -117076, 31658, -158320, -307762, -35464, -25697, -240077, -238048, -264780, -314238, -261234, -181203, -358101, -415647, -476689, -517380, -440416, -425914, -587497, -832349, -678081, -548372, -334362, -440435, -361026, -174741, -248903, -101510, 21467, 76678, 106991, -20359, -192022, -85168, -127910, -174802, -113706, -158104, -16640, -264176, -377751, -36486, 167195, -93728, -202234, -147171, -163638, -179688, -85571]
16764h5571J82004K80124P1988k25711k28266J48646j66235l0064Q560K27558
16754A83033J33869k54116o1473M4975j99935N4346o2813q335m789k76000j0103
16743d61341K65496K28798J54364j34036j7944j4017j4796J99874K9071n8898
16733A76571j04874n0827L34246J83738l50023J25243K50601J528k97056j53781
16723A15366K51921Q2661r1521l23799r9849Q9406n8977k99296J2221J78073O3696
16712h0098P1587j78186k34361K1046J67497K3069M938o5886J8103L3180P4574
16701a44537J7718K10804J46837n3192l43318o3404J6308J04684J80171j40737
16691f8666k8447K50401R9792j75264k68372O5302P7867j94740L4761M3566J43202
$$ y = [-85571, 96433, 376557, 448545, 222834, -5432, 143214, -23021, -53085, -44525, 183033, 316902, 62786, 1313, 46288, -153647, -99301, -162114, -170449, -175238, -451238, -461341, -195845, 32953, 187317, 53281, 35337, 21320, 6524, 206398, 235469, 176571, 71697, 20870, 355116, 538854, 188831, 314074, 564675, 566203, 269147, 115366, 367287, 449948, 358427, 34628, -65221, 24185, -34792, -334088, -321867, -143794, -80098, -8511, -186697, -421058, -400012, -232515, -209446, -204508, -270394, -252291, -219111, -144537, -126819, 83985, 230822, 177630, -165688, -229092, -212784, -108100, 72071, -68666, -97113, 153288, 253080, 77816, -190556, -125254, -47387, -242127, -207366, -163800, -20598]
16680b0598K17036j9460j51882j12126o063o0442M24833Q3252o0064m20164l22410
16669d48088r8715L1172k8785R230R1287M1580k1834K46401J92390q6531m3967
16658a15860r3999J10202m990k33058k19549L8968q0071J6227M48718j2671m792
16647a50875k3818j19527l06920J33752L29753Q5669l11599j0738m1592K00572
16637b15323K25762O5565O8914k69204j41773k06647L74037J83338L72258J24844
16627E81771l31733j59170L4405R6152l4942k90355j40716Q021J91060R7130O7556
16616A19179N2356j62992P2436L52348L04835j87663l06204l80095j62384K44952
16606e3232J3018J03760j17537J00462M0312k02974L9648P0211J04702L3872K1504
$$ y = [-20598, 196438, 176978, 25096, -87030, -93093, -153535, 271298, 354550, 294486, -125678, -448088, -546803, -515631, -544416, -535186, -443899, -402319, -424153, -177752, 14638, -71893, -115860, -209859, -99657, -104647, -337705, -557254, -518286, -598357, -582130, -133412, -146083, -150875, -174693, -294220, -601140, -467388, -137635, -51966, -363565, -374303, -415895, -215323, 10439, 76004, 144918, -124286, -266059, -472706, -98669, 84669, 456927, 581771, 250038, 90868, 125273, 221425, 186483, -103872, -244588, -236567, -45507, 51623, 119179, 171535, 8543, 80979, 433327, 738162, 550499, 244295, -135800, -298184, -53232, -40214, 63546, -53991, 46471, 86783, -116191, -76543, -6332, 98370, 132242, 153746]
16595A53746k52457K10441R0398j76145n1643m09403J35239M40361J06309l29133
16585h2287k05865O6763j32259K74068R4533O1088N8824K24205q0069j85399k20947
16574a27345l48446j15515j12837M40907J00579r9258R9509J49482J73964m4852
16564A16188j32817N9372M2696O276Q5315R6643R4376P4711j98322k60057q0493
16553i6112N9444j3261j89229M9036J19497j14542J34410J68226r2397n7431K8402
16542c957J94046J3406j8277j03221k76309k32689K04988M4299j14917k6423j24592
16531d43646J6894L56195J23765j72556L03384k79569j94230J59478k5411M8918
16521a06778n0187j26009j72263J23006J25198J87014L0595j72751j32513k86698
$$ y = [153746, -98711, 111730, 202128, 25983, -25660, -435063, -299824, 140537, 246846, -82287, -288152, -221389, -353648, -79580, 14953, 76041, 134865, 359070, 279001, 93602, -127345, -475791, -591306, -704143, -263236, -162657, -261915, -162406, -12924, 161040, 116188, -16629, 42743, 85439, 91715, 177030, 273673, 368049, 442760, 244438, -15619, -96112, -36668, -49929, -239158, -190122, -70625, -185167, -50757, 117469, 25072, -32359, -3957, 190089, 203495, 185218, 81997, -194312, -427001, -222013, -177714, -292631, -319054, -443646, -426752, -70557, 53208, -119348, 184036, -95533, -289763, -130285, -155696, -106778, -156965, -282974, -455237, -332231, -207033, -20019, 10576, -162175, -294688, -581386]
16511e81386K0340L16861m042K18630j3707j67280O2724P489k3466l12816n0059
16500e26712M79344J00470j6916p6725j28119j2303j55165j5664m8578L31145
16490f9223K25147M8255k12749j35359m3329j66199K33766J75285k41717k53760
16480d39883j79073J93822L98235Q2817n3880K5972J69808L7756k56594l29933
16470c50953Q2012J78282L8934J93754J57923J03129J10417m7100j29558L7711
16460C74551k44532j8121j5441j84008l40P7419q9029J23436J57J89692Q4671
16449B98455n8643k37298J9473J61618L4567j39866K6263j94473Q207J01352j05974
16438h6319k00216J70138r9495k54867K05280N7026M3756N931m2632J51422m1305
$$ y = [-581386, -561046, -244185, -248227, -29597, -43304, -210584, -147860, -140371, -163837, -476653, -526712, -47368, 53102, 36186, -40539, -168658, -180961, -336126, -351790, -400368, -69223, 155924, 204179, -8570, -143929, -187258, -353457, -119691, 55594, -186123, -439883, -618956, -425134, -26899, 55918, 2038, 28010, 197818, 235574, -21020, -350953, -268941, -90659, -51725, 142029, 299952, 403081, 513498, 466398, 336840, 374551, 130019, 111898, 96457, -87551, -87891, -10472, -99501, 23935, 24092, 213784, 298455, 239812, 2514, 21987, 183605, 218172, 78306, 104569, -89904, -81697, 19655, -86319, -286535, -116397, -215892, -470759, -265479, -208453, -164697, -158766, -201398, -49976, -91281]
16427i1281Q4184N5789J1582k67278L7845J19845l3561L494r3355j1103Q8694
16416i5145j03751j54332M7097j00862K04262K98479k3736j17985n4897m9845
16406a50715k4184r0750K49798K83041j83730m09820k1468K12354J3410j29277
16396b51341K1448j2528j12119n9039o91J92077K46560J48964J18511J15955l21394
16385H6403k42016j24904K65935K02006J44382J35910k81178l18245k68717J72034
16375b28390M9240k35269j40152J39746J9263R048M5552k55850J94660L54508
16365d7644J04167k58892k96688K76219J77837j40559L8352L0103L6356m8646
16355a29395Q5814n388J65417J5339k44791k89917K27226J89147O933m11330l43713
$$ y = [-91281, -7097, 48692, 60274, -207004, -169159, -49314, -82875, -79381, -172736, -183839, -95145, -198896, -353228, -306131, -406993, -202731, 95748, 72012, -45973, -100870, -150715, -174899, -265649, -15851, 267190, 83460, -326360, -347828, -135474, -122064, -251341, -229893, -242421, -354540, -413579, -414270, -222193, 24367, 173331, 291842, 407797, 86403, -155613, -280517, -14582, 187424, 331806, 467716, 186538, -131707, -400424, -228390, -179150, -414419, -554571, -414825, -395562, -386514, -340962, -596812, -402152, -47644, 56523, -202369, -499057, -222838, -45001, -185560, -147208, -117105, -80749, -129395, -43581, -48969, 116448, 131787, -113004, -402921, -175695, 13452, 20385, -390945, -734658]
16344g34658M57362K41625m794M8196r5574j61254J38301Q7967L8131K28412L19066
16333E62780j26414q2538j42090l23912J30725m65K20115L7465m0124m8782L8347
16322B25107l5291l3951j05624j23286k77620K3420J77618M51827n0719j65968
16312H5513k89695j89868M80061R9067l46096j56871n8358j67113J11068j54582
16302e86874Q0486K36878j4387j44043j4343L36239J76950l6062q6188j36984
16292a88328j08836Q0815K72663k6225l678q4390J31720j0402q7568P2023o5312
16281a7518J89673K68528m0420k51752m6022j27165k49097k02968J80306O5576
16271b30859M2113J69017J10835r6747k94143p0760R8661j01093o747J47091R069
$$ y = [-734658, -277296, -35671, -40465, 7731, -87843, -249097, -110796, -22829, 15302, 243714, 562780, 436366, 353828, 211738, -112174, 18551, 18086, 238201, 275666, 235542, 186760, 225107, 189816, 155865, 50241, -73045, -350665, -327245, -149627, 302200, 251481, 85513, -204182, -394050, 86011, 185078, -161018, -317889, -376247, -543360, -432292, -586874, -506388, -269510, -283897, -427940, -442283, -106044, 70906, 34844, -51344, -188328, -297164, -216349, 56314, 30089, 26411, -57979, 73741, 63339, -24229, 47794, -17518, 172155, 440683, 400263, 148511, 102489, -24676, -273773, -476741, -296435, -230859, -188746, -19729, 91106, -5641, -299784, -370544, -271883, -372976, -379723, -232632, -223563]
16260b23563o0612K05108j92701l794O0565J94934R5110Q4904J76381J4884l52415
16249a199o6812p6066K06237K13539J72551M0752m13434k21132L90931M4456m3777
16238B46046k3212L9895j75073P0225j20523p4882P1092j53986J18228r5649j89364
16227b87203j19382m8549O9799J69618J99617k8203j66545j09478j24149J53004
16217b91471k1297K48505K752O979j77964j15208J79695j37134o1429k3351J67570
16206b22353K33720K18527J07233O4629R029r5457j21548j2608J71336j47445
16196B05063k22490q803J67234k9466o5515l3234j86113j76120K51459K05656
16186A07671n8319N4018k13264j79380l0582J51147K34905K71255p4164J78491
$$ y = [-223563, -284175, -79067, -271768, -275562, -214997, -20063, 75047, 159951, 336332, 351216, -1199, -68011, -144077, 62160, 275699, 448250, 489002, 75568, -145564, 245367, 289823, 246046, 222834, 262729, 87656, 157881, 37358, -37524, 33568, -120418, -2190, -97839, -287203, -406585, -455134, -385335, -215717, -16100, -44303, -210848, -320326, -444475, -291471, -312768, -64263, -61511, -54532, -232496, -347704, -168009, -305143, -366572, -389923, -222353, 11367, 229894, 337127, 401756, 410785, 315328, 193780, 181172, 352508, 205063, -17427, -26230, 141004, 111538, 46023, 12789, -173324, -349444, -97985, 107671, 49352, 103370, -109894, -289274, -319856, -168709, 66196, 337451, 263287, 441778]
16176D41778j22726j19615j65325l69960k11794J26974Q4235k21044l9314J18991
16166d77800P0417K77995j6439P513p7234j0968j13781O0949q3585k46963L0931
16155e78965L43326J31481j42522m17815j11140K85106K01346o8097K14504J26226
16145a6550J04461j12977m26445j13435K29132K6317J87166Q9229n8900q2236
16135a74238n9558m86435N2015K61962L39177J05002n2674J772J33784K15166
16125C35973J10188k04359j47546j56793J19349m09536l46766p3055L35820K36746
16115a99979j27678l1849J74688J43690L5938P2122k80945R497j94221R689K22952
16104a66096Q9161J47055k10446k0874J73110M7799k7429m0309K0334O5046q258
$$ y = [441778, 319052, 199437, 34112, -335848, -547642, -420668, -336433, -557477, -596791, -477800, -407383, -129388, -145827, -138314, -215548, -226516, -340297, -279348, -362933, -609896, -578965, -235639, -104158, -246680, -664495, -775635, -490529, -289183, -357280, -142776, -16550, 87911, -25066, -451511, -564946, -335814, -309497, -122331, -33102, -92002, -174238, -233796, -720231, -668216, -406254, -67077, 37925, -14749, -12977, 120807, 335973, 446161, 241802, 94256, -62537, 56812, -352724, -699490, -772545, -436725, -199979, -327657, -359506, -184818, -41128, -5190, 66932, -214013, -204516, -398737, -389048, -166096, -76935, 70120, -140326, -161200, 11910, 59709, 32280, -8029, 12305, 77351, 69093]
16093F9093m8936L25923p1003l26853j61423R8310K2843l21817K62836L53908
16083B02881l2060k93588j49384J89463J66595j02102q113o115l3316O4729J07510
16072A06500m0652J0492k31893J26968J34358L04977J82238p7621n9804K1242
16062D76805m6536J1338j96308l02603J31123J37870J0909j01020j03438j46736
16052a28596O2544k5094j01072j53807N383J68952M6968M190L8029J49491k4397
16041D2591Q7024k2622m2916j7588j6940k32965o8687k1126K77981K90358r1064
16030A84046j47025j48633K05928j93724j13848p5941q6521k2572J60204R8559
16020a39527J38568J6772m8158L4642j92401J84047K30428p236j22527N0271P9934
$$ y = [69093, 20157, 346080, 275077, -51776, -213199, -114889, -92046, -413863, -151027, 202881, 170821, -122767, -272151, -82688, 83907, -18195, -26308, -32423, -65739, -1010, 106500, 65848, 76340, -155553, -28585, 105773, 410750, 592988, 515367, 455563, 476805, 430269, 441607, 245299, -57304, 73819, 211689, 222598, 121578, 18140, -128596, -66052, -91146, -192218, -346025, -340642, -171690, -124722, -120532, -82503, 66988, 42591, 129615, 106993, 64077, 46489, 29549, -203416, -272103, -293229, -15248, 275110, 184046, 37021, -111612, 94316, -99408, -213256, -289197, -375718, -398290, -238086, -139527, -959, 15813, -32345, 2297, -190104, -6057, 224371, 217135, 94608, 144879, 224813]
16009B24813J6245k80331K4073M2544q1989O3745O0552J93629J14533J8093l50649
15998D5258j53760L34728m354k83774O3913P6822q3271j75112J49585K78828j7226
15987B31637j05762k17225j71086J40630L68603n0697k03195k62056K827J33886
15977a32438R9125p0159n8774J11658p3289l8647O0513l34920l09188K01841L16243
15966b28035n1044J94089J39000l87600m9075K05524J41132J91936m74227r9905
15956d18205l1882j68937p6463K92359L3704M23K87859L76403n262p3042j65361
15945E1596o9907J15118L28026q3413j69884k66142L4370O1809J76587j9606k66320
15934a07766J13335J90064n6487j19261R3018l868l4772k79595R6553K45570j23149
$$ y = [224813, 241058, -39273, -15200, 27344, -54645, 9100, 69652, 263281, 377814, 395907, 45258, -108502, 226226, 221872, -61902, 2011, 78833, -4438, -179550, -29965, 248863, 231637, 125875, -91350, -262436, -121806, 246797, 196100, -7095, -269151, -266324, -132438, -33313, -103472, -162246, -50588, -123877, -162524, -102011, -436931, -746119, -544278, -228035, -279079, -84990, 54010, -333590, -382665, -177141, -36009, 155927, -318300, -418205, -450087, -619024, -695487, -403128, -369424, -369001, -81142, 295261, 289999, 216957, 51596, -18311, 96807, 424833, 341420, 171536, -94606, -60236, 1573, 178160, 158554, -107766, 5569, 195633, 139146, 19885, 112903, 109035, 74263, -205332, -108779, 136791, 13642]
15923A3642j21780j76775R3884j14755K11829r989j98455j82579q6250r0629J56756
15912e05101N5280P6106J71483J45949j91201j7649M0937r310M0355p2094P4779
15901a90466J46989j11888l15227N8815L03859N0430q8360N8598K75251J47687
15891C35688j47890k10393j34255K00510J5578j98761j42612N5786M0065n6724
15881b43008l047m1882J13476r1818k36982K64856r6276j21194r607K25669K32961
15870f852k03304M4231l05884k78807m7962K6769K87813M38665J24894k34733
15860a55170k02707R9219J12055j93080k10517M12115J22930m31321j7656K50841
15850b13291L31938K8715J21288k19337p6806J5775J08728k25965J83286N1588
$$ y = [13642, -108138, -284913, -191029, -305784, -93955, -103944, -302399, -484978, -571228, -661857, -505101, -449821, -373715, -202232, -56283, -247484, -265133, -224196, -233506, -193151, -265245, -190466, -43477, -155365, -470592, -411777, -107918, -57488, -145848, -87250, 188001, 335688, 187798, -22595, -156850, 43660, 59238, -139523, -282135, -226349, -186284, -243008, -246055, -287937, -174461, -266279, -503261, -238405, -334681, -455875, -465482, -239813, -6852, -210156, -165925, -471809, -750616, -798578, -771809, -483996, -45331, 79563, -155170, -357877, -258658, -146603, -339683, -550200, -138085, -15155, -446476, -464132, -213291, 118647, 147362, 268650, 49313, -27493, -11718, 97010, -128955, 54331, 105919]
15840A05919O4767j42293K3344K4943L6618q0116j29439o977j43156k00790K0973
15829d26207P1282K77292M63055k04376k49913J76926j41036J18855Q0037j59236
15819F679k30248J02091k0648j71225J78445J17834J12932Q7771J09140l6595
15809B56176p7496p6795j41430m6294j63129k94828m1944L5225K43592n5339j22196
15798d84458o578J53857J42175j1737j46918J68916L34583J39195j38865k76109
15788a25939k18693j66898K3064K24906L12441J80120j24495l65408L268J96821
15778f0813K4868R4594K9268j99664l13219m8818J54546j15452J98981p9354k10927
15767e25990J88926K05847P259l71985P4216L29869k8894j59339J03634l7910
$$ y = [105919, 170686, 28393, 51737, 76680, 113298, 33182, -96257, -103234, -246390, -447180, -426207, -354925, -77633, 385422, 181046, -68867, 108059, -32977, 85878, 165915, 6679, -223569, -121478, -142126, -313351, -134906, -17072, 95860, 183631, 292771, 256176, 178680, 101885, -39545, -85839, -248968, -543796, -585740, -550515, -306923, -362262, -484458, -491036, -337179, -195004, -206741, -353659, -184743, 149840, 289035, 150170, -125939, -344632, -511530, -488466, -263560, 48881, 229001, 104506, -260902, -257634, -60813, -35945, 58649, 87917, -111747, -424966, -473784, -319238, -434690, -235709, -315063, -525990, -337064, -131217, -123958, -495943, -421727, -91858, -120752, -280091, -176457, -214367]
15757b14367j96053K38467L22426r3422l11429k34786k0620L19696L87233j4105
15747A83040j18471J65058r4074K0493o7964r3712j43101o4778L060K09268L5726
15736C4545O2221J12997O3925k75622j16394m6643j43077k57865r585K13671K58524
15725a03303J67011j40097l44985l12343j65482J7276K28190M21545J13918l1290
15715a49560l1691j32636J49337L96697j10422k79504L4010j35938l3279J5976
15705b77010J83253m6309k78568m1905j93183k53612m9002L64236J05700n8726
15695e45126j1589M8024K41109J81243L5456k44385N9066K28913J39522r6447
15685C5786j59744J85270J6476R5065J6160l35480p9083O5526M4733k5076l67265
$$ y = [-214367, -410420, -171953, 150473, 57051, -254378, -489164, -509784, -190088, 197145, 183040, 64569, 229627, 135553, 156046, 88082, -5630, -148731, -213509, -210449, -1181, 34545, 96766, 209763, 273688, -1934, -118328, -164971, -308048, -565913, -575498, -361827, -103303, 63708, -76389, -421374, -733717, -899199, -881923, -653733, -232188, -118270, -149560, -181251, -313887, -164550, 232147, 121725, -157779, -123769, -259707, -292986, -277010, -93757, -140066, -418634, -460539, -653722, -907334, -956336, -592100, -486400, -545126, -556715, -508691, -267582, -86339, -50883, -295268, -236202, -7289, 132233, 35786, -123958, 61312, 77788, 172853, 189013, -146467, -225550, -160024, -115291, -140367, -507632]
15674e07632o1156J17432j4008K87889o8347K0733N2484K7990J43887M6241q4555
15663c9042O652K09944k4351J16720j0331k06688N9277L5780j51092K3722r0692
15652g0101J03809J99780j32292k97387R1699k8751k64029m2573K70092p3581
15642b43334k60466K19491k4038p8855q7988k1751K55972L78910j45185k17943
15632b25187k73868j86473m2647K06685j64845j31602P2580K46353O8318J76538
15622b54148K19807J08564p6449p6126j52540j03093K56795M19004L8848k23349
15612A57313L1599o2562p227k7440p5914K8714k9135K02844k70246M7008P6479
15601G1433K1138j59608j57337j48197J66372M0440K01611Q5776M9802k37724
$$ y = [-507632, -568788, -451356, -465364, -177475, -245822, -225089, -172605, -144615, -728, 45513, -39042, -32390, 177554, 153203, 269923, 259592, 52904, 112181, 147961, -3131, 20591, -70101, 33708, 233488, 101196, -196191, -104492, -133243, -397272, -439845, -169753, -243334, -503800, -284309, -308347, -387202, -475190, -496941, -240969, 137941, -7244, -225187, -499055, -685528, -728175, -521490, -686335, -817937, -745357, -499004, -430686, -254148, -34341, 74223, -2226, -78352, -230892, -333985, -77190, 341814, 380662, 157313, 188912, 126350, 119123, 91683, 15769, 44483, 15348, 218192, -52054, -5046, 71433, 92571, -67037, -224374, -372571, -206199, -165759, 35852, 121628, 171430, -66294]
15591f6294j9464o0565M53j51701l7854Q2582q659p5622r5851J81678J95957p7258
15579a32598j13102R0728j26453O3075J41687P02j14727n2680R1558J75260J17797
15568A41247j04873o9515J25384J39264R1269j62833r1193J69358K4113l70740
15558a08519k65444M3886o871J86656J58494J67970K9974k29608L3077n2179k51080
15547b93644J02656r4639o3407k12260N5978K10812M28493L69746m5364n49947
15537i1576j09085q5453R6473J8516n4180n5322P0744N7647j49652N6623k8291
15526b73556O0749K29342J35214l8060Q5049l49004j08255K76643k1054j84637
15516a87569J19756j53818L8122R7529L7124j57223R0511Q5718j42446J98331
$$ y = [-66294, -85758, -146323, -145870, -297571, -335425, -252843, -261502, -337124, -432975, -251297, -55340, -132598, -245700, -154972, -281425, -218350, -76663, -75961, -190688, -243368, -151810, 23450, 141247, 36374, -33141, 92243, 231507, 322776, 159943, 68750, 238108, 262221, -108519, -373963, -330077, -336948, -150292, 8202, 176172, 206146, -23462, 9615, -42564, -293644, -190988, -285627, -349034, -561294, -505316, -294504, 133989, 503735, 458371, -91576, -200661, -286114, -189641, -171125, -225305, -280627, -209883, -152236, -301888, -245265, -273556, -212807, 16535, 151749, 113689, 198738, -150266, -258521, 18122, -2932, -187569, -67813, -221631, -183509, -85980, -48856, -206079, -115568, -29850, -172296, 26035]
15506B6035o387k08286j54714M2072K77280R6871j97546o113J13449j72810j94727
15495c84876J27180L04119J49437r8260k05318j01585q6020q0389k75238P9226
15485e71724L06829L55357O5698j94956j65560q9080L84353k50025k70196J14630
15475c14674R3160n483n5456J16893K75514k0875j24813J75939K26071q4280Q3207
15464C65203M9220k21656L1500j5281k70848k63733K51610J67845L769p1786l0561
15453d718j09973l620k19446j85583K57976J89785p9134j05506J8628o0339L3029
15442b68901j5999K28115J17613M2349j73609K5527J39198P9237J13671Q8714
15432C75915j29234k04863K60240N365j21762K42807O6935j6897L7710l29749
$$ y = [26035, 19648, -188638, -343352, -301280, -24000, 72871, -124675, -130788, -17339, -190149, -384876, -257696, 46423, 195860, 97600, -107718, -209303, -295323, -375712, -650950, -571724, -264895, 90462, 156160, -38796, -204356, -293436, 90917, -159108, -429304, -314674, -221514, -226997, -282453, -165560, 109954, 89079, -35734, 140205, 366276, 281996, 365203, 414423, 192767, 224267, 208986, -61862, -325595, -73985, 93860, 97629, 25843, -4718, -114691, -118311, -337757, -523340, -265364, -75579, -154713, -260219, -241591, -301930, -268901, -284900, -56785, 60828, 103177, -70432, -44905, 94293, 173530, 287201, 375915, 246681, 41818, 302058, 307423, 185661, 428468, 495403, 478506, 516216, 186467]
15422A86467l16163j04180K9572J93531J92007k76700k67759j45885N2702L34679
15412a21729K5611j18506J00645j02108k26422J19080L44411M865j51257j8286
15402a43696o141K84486J64142l13400l2127J4426R818K3465J05291J27690l37423
15391a03469l47101M6275K85182N9721j79818j07529J4454K13475L9946Q8980
15381A0116J38620N7505o6290k18676l40306L0795L08680J44647l8405j3532j03238
15370i0084k2120L05577j39025K4647J02143j3562k2767L9835o2218O4752L8930
15359B26108j86254R7696k33754J0739Q9689r8637j4641J10012o7156r5978p5710
15348b37886K8675J11052N455J51756q8213J6550q4998p5490J57883q9628J14301
$$ y = [186467, -129696, -233876, -204304, -10773, 181234, -95466, -363225, -509110, -456408, -121729, -96118, -214624, -113979, -216087, -442509, -323429, 20982, 25847, -125410, -143696, -149837, 134649, 298791, -14609, -46736, -32310, -22492, 973, 106264, 233954, -103469, -450570, -404295, -119113, -59392, -239210, -346739, -332285, -118810, -78864, 10116, 148736, 206241, 139951, -78725, -419031, -388236, -79556, 65091, 26686, 13154, -90084, -112204, 193373, 54348, 78995, 181138, 167576, 144809, 184644, 122426, 187178, 226108, 39854, 137550, -96204, -85465, 4224, -94413, -109054, 958, -66198, -162176, -237886, -209211, -98159, -92704, 59052, -29161, -12611, -97609, -173099, -15216, -104844, 9457]
15337I457q186j42483l7588j60705r2589J53380J1226p354O5747o9217k36392
15326e14704J36858K60642j7079P4259j74985M8330L16320Q7462j42141o0100
15316A4862n9822j62987J2868J65424J01854J79285k05543k87085l7002K49404
15306b8742M3239p9420Q5226J06689K1283K85744K9003j77246k02765l3871J39485
15295A88625P3349k89507N8778P5860j64913M00921J947k59295L9333M9216j13855
15284F0459k05737o1355J062O1246O4565k1397N3211K9167J10578m9274R781q1852
15272b9546K71555J90399l9418O3105m77421k30147j80150J49076K83417K34655
15262B35525L0962J64413J2888j10205J04558k8725l25752l12658k24300J69378
$$ y = [9457, 1271, -141212, -178800, -339505, -432094, -278714, -267488, -274842, -209095, -278312, -514704, -377846, -117204, -134283, -60024, -235009, -186679, 129641, 217103, 74962, 14862, -44960, -207947, -195079, -29655, 72199, 251484, 45941, -241144, -278146, -28742, 14497, -64923, 20303, 126992, 148275, 434019, 463022, 285776, 83011, 49140, 188625, 261974, -27533, 31245, 107105, -57808, 343113, 345060, 85765, 125098, 174314, 60459, -145278, -206633, -205571, -144325, -79760, -101157, -47946, -18779, 91799, 42525, 52306, -29546, 242009, 432408, 392990, 456095, -21326, -251473, -431623, -282547, 870, 235525, 266487, 430900, 443788, 333583, 438141, 409416, 83664, -228994, -453294, -283916]
15252b83916J91824k14018j65097K26947L34194J23254R9023J58436J2125j92941
15242B89831k33734k13035N4902O5350j08473j05930j29754J40283J39478J63995
15232F2913q5497j82385o1733K03452j82504k32920J70360o570J7865R158P4470
15221b13391L9655p4046o7301j00291R5540Q0562M20768l06218m2859J53679J0331
15210c571k6661j44530j01124K74299J37388N7467o1877j38301k19411l0753J37328
15199a19746K45152J37250k23024p0387J34230o8129j6728O1728j23720P9590
15189C6216J08745m9465J7447p4856k78111j18799p2172L47141J32670j1638n6083
15178a8905k7586k31843K54379K08994O3138j270j99985P2879J11857q6834o7336
$$ y = [-283916, -92092, -306110, -471207, -244260, 89934, 213188, 312211, 470647, 482772, 289831, 56097, -156938, -102036, -36686, -145159, -251089, -380843, -240560, -101082, 62913, -22584, -204969, -266702, -63250, -245754, -478674, -308314, -314884, -297019, -287861, -213391, -173736, -247782, -315083, -415374, -319834, -239272, 181496, -124722, -167581, -13902, -3571, -30232, -174762, -275886, -1587, 135801, 193268, 131391, -6910, -226321, -257074, -119746, 125406, 262656, 39632, -30755, 103475, 35346, 18618, 80346, -43374, 36216, 144961, 95496, 112943, 38087, -240024, -358823, -430995, -83854, 48816, 37178, -18905, -46491, -278334, -23955, 185039, 248177, 246907, 46922, 119801, 231658, 144824, 77488]
15167G7488j28101j56531K3921j54734J31117R006l1221M9345J65600p0268J28899
15156D4521L07533O9886P0206k35259M0761k63468j67752n4688k05490k71118
15146f64868J86312L67423J4980q5532J78385J20894q1725J29537K12408K20476
15136E98290r5836j46687l23128n2828J14462j39828M1780r3712N9488j30167
15126a68166K29440P492k32815L636Q5862K27375N7285j43741j92439J233k9474
15115a54312j30415m6243j58018N8497n8016L62742J18306j09991o0749l3907
15105b12106n2750n5441M1260O8728r2467Q0276J21005J74607J81461l25577R5946
15094B4942j48912k43056R0567q4255Q2465Q6645j81508J82273r5914m9242J86937
$$ y = [77488, -50613, -207144, -183223, -337957, -206840, -197834, -229055, -179710, -14110, -84378, 44521, 352054, 421940, 492146, 256887, 297648, 34180, -133572, -188260, -393750, -664868, -478556, -111133, -96153, -181685, -3300, 117594, 35869, 165406, 377814, 598290, 502454, 355767, 32639, -20189, 94273, -45555, -3775, -97487, -37999, -168166, 61274, 68766, -164049, -160413, -74551, 152824, 210109, 66368, -126071, -124838, -154312, -284727, -330970, -488988, -430491, -488507, -125765, -7459, -117450, -178199, -212106, -264856, -320297, -279037, -210309, -302776, -222500, -101495, 73112, 254573, -71004, 24942, -123970, -367026, -276459, -360714, -278249, -191604, -373112, -190839, -286753, -335995, -149058]
15083a49058M91039M9633j52109q616j15430L7731M3798l89492k85693n1265J33397
15072c96065J71229n622j25159j64252M0019J34730p3778q0158k6960J40393L86204
15061E81O2578j23585j52844j84830k6629j2898N0297K00604m3549j30607K3159
15050c37723N66459J73210k54194k91611N6502L93476L11961l03957l28531P5807
15040F1399J07872j06211l4272p8158l6097M33474Q0703k2305J6502p3037L2884
15029C82754k01270o3534k37413j19729K35753R0959j13227q9038k67201K9988
15019c51958L39715N7974j68603K66067R6210j22700j71273K45216p8900k29913
15009a18165R690L2478p7094r1235K1888K8180k17062J04588P2802O9999K74765
$$ y = [-149058, 341981, 391614, 239505, 230889, 115459, 153190, 196988, -192504, -478197, -529462, -396065, -224836, -230458, -355617, -519869, -479850, -345120, -418898, -499056, -526016, -385623, 581, 63159, -60426, -213270, -398100, -424729, -437627, -387330, -186726, -230275, -360882, -337723, 228736, 401946, 147752, -143859, -87357, 306119, 618080, 314123, -14408, 61399, 169271, 63060, 28788, -49370, -85467, 348007, 428710, 406405, 422907, 349870, 382754, 181484, 117950, -119463, -239192, -3439, 87520, -25707, -114745, -381946, -351958, -12243, 45731, -122872, 143195, 239405, 116705, -54568, 190648, 111748, -118165, -108475, -75997, -153091, -244326, -222438, -194258, -411320, -306732, -233930, -163931, 110834]
14998A10834k47705N2385R4869p2394J46800K10739j07903k04720r1766n6216
14988a65077j82925J16394J52111L4777r4400j92731J08950m4393O2737L94769
14978A90212J47937k05069L5145J71217j01870k48392k1957j91038q530M059R3943
14967a34343L03406k2625q0462k49397p4273P1871K37955Q6097m9485Q5019J46479
14956C20242n6400o3693j33262l539k02114j98334J96006N8309j73227K25857
14946c0155J16725j14531K71231J44140O018r4768j64429o1282j55949j31304
14936b14304k9652j83798K89879K14150j44252j85828m1379Q1924P4141q5456
14926b24575l49599P6390J89761K12638K37071K2360j59229n3717K1020l0918
$$ y = [110834, -136871, -84486, 10383, -62011, 84789, 295528, 187625, -17095, -108861, -165077, -348002, -231608, -79497, -44720, -139120, -331851, -222901, -267294, -204557, 190212, 338149, 133080, 168225, 339442, 237572, -10820, -32777, -223815, -232345, -228286, -134343, 169063, 146438, 65976, -183421, -257694, -185823, 52132, 138229, 88744, 173763, 320242, 263842, 200149, 66887, 63348, -138766, -337100, -141094, -82785, -256012, -30155, 86570, -27961, 243270, 387410, 393428, 298660, 134231, 72949, -83000, -214304, -243956, -427754, -137875, 76275, -67977, -253805, -295184, -213260, -139119, -224575, -574174, -497784, -308023, -95385, 141686, 164046, 4817, -48900, -27880, -58798]
14916e8798J2774L526M1358J33817j22576j30569j66414K68277J61664l9654j89619
14905h6214j66528P841O1210r2445K3518J55743r3293j71907K1316J45813J76101
14894a8845L78537R3926k09465k81902j67323n7987J48465M5271J65093j08713
14884a2943j36528r1067J12813L65346k86776l29268L1871K84913R7558L4860
14874G0779N9128R2653J6422j89314l23982n212m6677j40583j42745J82187j46001
14863e73345o5010N9535J36564J70049M6189j01305N8365J832j7908m6777J29061
14852b02750k8836j85o016k5027j17885o3955J57941K3141J17210k8856q6495
14841b61713J36961J66246j5472j79370l0344l9654n4612J44243k4867j05073
$$ y = [-58798, -46024, -42498, -1140, 132677, 10101, -120468, -286882, -18605, 143059, 103405, -86214, -252742, -244901, -183691, -276136, -252618, -96875, -190168, -362075, -340759, -194946, -18845, 359692, 453618, 244153, -37749, -205072, -263059, -114594, -69323, 95770, -12943, -149471, -240538, -127725, 237621, -49155, -378423, -346552, -61639, 35919, 70779, 129907, 222560, 238982, 49668, -274314, -279526, -326203, -466786, -609531, -427344, -573345, -638355, -578820, -442256, -272207, -226018, -327323, -268958, -267126, -285034, -331811, -202750, -231586, -231771, -237787, -262814, -380699, -444654, -286713, -263572, -146362, -175218, -261713, -124752, 41494, 26022, -153348, -183692, -223346, -277958, -133715, -158582, -263655]
14831b63655L4572o5291K9612L41974j1885j57401N3148L19885l2088l5333R7498
14820C11036P5944k7839m39791k53908J30593N5641j18642K73562J38676j86349
14810d1077j50602J09886K43751J49588l6127k20180J60515J4459k59596N8221
14800B8838M3726O4932j18203j7203p144k80691O1783O69153J95587k15830j88861
14789B36087k5313O3721p4737j66309l25455K5582J88262k135J03602J43885q1425
14778H5765l33629N3373r3004K19838j2830k83296k93767K95714M31438j29254
14768e9652J82208L90695k06703j87544q5206K7791J40761J25452L8465j42821
14758B23446p0217j14900l11854k2318L61978J63705J30297o5234m02400K12899
$$ y = [-263655, -229083, -294374, -264762, 77212, 65327, -92074, -38926, 280959, 248871, 213538, 311036, 386980, 359141, -80650, -334558, -203965, -148324, -266966, 6596, 145272, -41077, -191679, -81793, 161958, 311546, 275419, 55239, 215754, 230213, -29383, 28838, 72564, 137496, 19293, 2090, -5054, -285745, -223962, 445191, 640778, 424948, 236087, 210774, 274495, 199758, 33449, -292006, -266424, -78162, -80297, 23305, 167190, 85765, -247864, -194491, -287495, -67657, -80487, -363783, -657550, -361836, 69602, -59652, 122556, 513251, 306548, 119004, 33798, 61589, 202350, 327802, 366267, 223446, 153229, 38329, -273525, -295843, 66135, 229840, 360137, 294903, -107497, 105402]
14748A05402M73315j97067m7089j07679M1140j07862k17902L6059P4086k11950
14738a59547j43028J97071K99014m8653k94035P2061O9023J53905j56367J7348
14728F792J99975k7071J35728J0128j50359K13262K9433l1160q2325j17682j09451
14717G7270k45620j4851k78756o791J2979J30983N41032K67850k59021k01697
14707B3378j14469K00005Q740k36402j0969J24368J72596j7514K47849j29273
14697B68309k58849q7890M7567o4378J04087L07025j51141m9244l7004k60247
14687a81765N9617K37858n2410j10279l96980p1425K30992L06124J3196l41996
14677c07068j88145J12606K46284L54852J39163M9183N4794J94433r7035Q2048
$$ y = [105402, 578717, 381650, 334561, 226882, 268022, 160160, -57742, -21683, 52403, -159547, -302575, -105504, 193510, 144857, -149178, -77117, -8094, 145811, -10556, 6792, 206767, 179696, 315424, 325552, 175193, 388455, 417888, 386728, 304403, 186721, 77270, -168350, -183201, -461957, -468748, -455769, -324786, 216246, 484096, 225075, 23378, -91091, 108914, 117654, -118748, -129717, -5349, 167247, 149733, 397582, 268309, 9460, -78430, -30863, -95241, 8846, 315871, 164730, 115486, 78482, -181765, -122148, 115710, 63300, -46979, -443959, -515384, -284392, 21732, 34928, -307068, -495213, -382607, -136323, 218529, 357692, 406875, 461669, 656102, 559067, 641115]
14667F41115l87301l32761J96603k7197j4775R0994P2063j18558J00145o6290
14657A54038n22094L07561J96412J57326J18399q0787J8344N9049o8329k40410
14647I9509l10873o9934K59669L50758L2920l59765r2103L25773L32476K9885
14637E98315j57711J766m8098N0992O3001J49501j48144k64708L2040p181J2909
14626B82682j80074k6342L69260N082p031L6273j72143k80250M331M5597R2705
14615A70090M0981k6913K40029J5089j11572M0469k58049J48103m0187l50149
14605a32109J15524J48076k17573k3223m4242j4451J99724J75747o8624K8109
14595A66958J78760j43119j36035j33644M3915M1504K3890p3267K15192K38156
$$ y = [641115, 253814, -78947, 117656, 90459, 75684, 166678, 238741, 120183, 220328, 154038, -368056, -60495, 135917, 293243, 411642, 330855, 349199, 408248, 339919, 99509, -211364, -281298, -21629, 329129, 362049, 2284, -89819, 235954, 568430, 598315, 440604, 442370, 394272, 445264, 508265, 657766, 509622, 244914, 276954, 269773, 282682, 102608, 76266, 445526, 450608, 443577, 479850, 307707, 27457, 31788, 77385, 170090, 211071, 184158, 424187, 439276, 327704, 368173, 110124, 258227, 218040, -132109, -16585, 131491, -86082, -109305, -153547, -167998, 31726, 207473, 138849, 166958, 345718, 202599, 66564, -67080, -23165, 18339, 42229, -31038, 184154, 422310]
14585D22310j85985p7435R4531l41565n0068K09517o598N6726K53283J68084j03853
14574D38947l45506J04909j03937J67830K40392k93015J76211j27247n6677l34159
14564a32252L46060K74913q4312k69044J17230R7120j45375j32825K04029J97523
14554D73067j10611q2025J09879l5168j8620J8658r133q2775J50203j19704l29876
14543c6105M0166n27K6031K34544p8589j80253l43037n5565o979J0892J65897
14532b23525J24131O5986K1587o1236O219K8088K9204m4772J66315J87374j37530
14521A61841k4006k813n9050j42364m0047q8757k5497n3140K34601N7373k2377
14510d236J85555j05589j57567k12573K4863K6693L05608j63859j45625k55879
$$ y = [422310, 236325, 158890, 253421, -88144, -138212, 71305, 64707, 121433, 374716, 542800, 438947, 93441, 198350, 94413, 262243, 502635, 209620, 385831, 258584, 201907, -132252, 213808, 488721, 404409, 135365, 252595, 349715, 204340, 71515, 275544, 473067, 362456, 280431, 390310, 355142, 336522, 355180, 346047, 263272, 413475, 293771, -36105, 4061, 3534, 29565, 264109, 185520, 5267, -337770, -393335, -400314, -389422, -223525, -99394, -33408, -11821, -73057, -66838, -38750, -9546, -54318, 111997, 299371, 161841, 137835, 135022, 75972, -66392, -106439, -195196, -220693, -273833, -39232, 18141, -4236, 181319, 75730, -81837, -294410, -269547, -242854, 62754, -101105, -246730, -502609]
14500e02609R7924Q5145L54637K21075J90003o1730r0682J04258M0731j03543
14490C35209n4797r2650j23404n6495J37400J15741J68807Q2460j28073l0781
14480C53417j56362n7360J06298j1567k14980l5954L7924k4704k95028K25459
14470g2857J84842J2202K26371o3820k18769m3793K87288L69219J6734n803O4715
14459G56329k44131k03094k54958K95448r8783k88564j40011j42797K71414J09375
14449F0228N7573R9115p8314o4993L19152L372P2592o2451p0339q3895j03234
14438A48806j72739j039J15829j71036K476K91402L18397r2637k25504j01177
14428A12778n7849j7687K07185L93662J34126j79677l52647k36623O5211J87178
$$ y = [-502609, -404685, -319540, 35097, 256172, 446175, 384445, 293763, 398021, 438752, 335209, 280412, 187762, 64358, 7863, 145263, 261004, 429811, 512271, 384198, 353417, 197055, 139695, 245993, 234426, 19446, -16508, 21416, -3288, -298316, -72857, 111985, 124187, 350558, 286738, 67969, 24176, 311464, 680683, 697417, 691614, 756329, 512198, 309104, 54146, 349594, 250811, -37753, -177764, -320561, -49147, 60228, 117801, 216916, 138602, 73609, 392761, 396133, 468725, 406274, 335935, 252040, 148806, -23933, -24972, 90857, -80179, -77703, 213699, 532096, 439459, 213955, 112778, 54929, 37242, 244427, 638089, 772215, 592538, 239891, 3268, 68479, 255657]
14418B55657K2657r2579J6703o0201R935n3965o9687L08758J22086p8324p9265
14407C01775j96189o6622j1455q5081J62657n2404q4336P027K28039J62637L2393
14396C98441M2255q4018m9456P3613Q9577j9133k36894N8343n189j71486o6510
14385B9543j07451j26620p3955K36105J2024O5855J90921L7964j53407o4590L14855
14374C61244K9357j41196m9961J82589M04199k04451k48408L387n276m11056j83760
14363b63332m4897J94276M83152K49138o8987j28106m6621m8394j99734k33736
14353a07241M5869J2615o0798P7691j43212j85985L66631J47379J12383J66114
14343D31446J9678L2615l44764k78072J29035j5829Q68O2969N8758k0938k25574
$$ y = [255657, 278314, 185735, 202438, 142237, 152172, 98207, 28520, 337278, 459364, 381040, 301775, 105586, 38964, 27509, -57572, 105085, 52681, -31655, -24628, 203411, 366048, 398441, 440696, 356678, 307222, 380835, 470412, 451279, 214385, 272728, 267539, 96053, 29543, -77908, -204528, -278483, -42378, -30354, 35501, 226422, 264386, 110979, 46389, 361244, 390601, 249405, 199444, 382033, 786232, 581781, 333373, 336760, 331484, -79572, -263332, -308229, -113953, 369199, 618337, 549350, 421244, 374623, 326229, 126495, -107241, -61372, -48757, -109555, -31864, -175076, -361061, 5570, 152949, 265332, 431446, 451124, 483739, 138975, -139097, -10062, -25891, -25023, 37946, 96704, 75766, -149808]
14332a49808p1715J55407L83560J73867k75760j81779O03q6991K64265j2992k1489
14321A77168j2723r0603j20619O8653J18759l6527j91459N1161q0613J57487J72741
14310B13425M3576L4018r7559k6622K5585R5538J41485j75336n862k79926O4065
14299C2387L21408K10393j98675j77629J07731m672J63431m051l20799K4236L3476
14288A87236Q2241L13863L52061R9681j32687l94198m36780Q6753j9504J75534
14278C14200l8836K00323p8801k2161K89676L07567k33622j70599J31509J10088
14268H09344j63647k29429J07829j3680j58995p2257N2972l1055j22018R3176
14258B72240j6216K1786j45174J19146L5084Q2949m28263k43187M41854Q5205
$$ y = [-149808, -221523, -66116, 317444, 491311, 215551, 33772, 34375, -52616, 211649, 198657, 177168, 164445, 73842, -46777, 21876, 140635, 104108, -87351, -36190, -116803, 40684, 213425, 257001, 291019, 193460, 166838, 192423, 287961, 429446, 254110, 248248, -31678, 32387, 353795, 564188, 365513, 187884, 295615, 290943, 454374, 450323, 129524, 153760, 187236, 269477, 583340, 935401, 1035082, 902395, 508197, 71417, 158170, 138666, 314200, 275364, 475687, 396886, 374725, 664401, 971968, 738346, 567747, 699256, 809344, 645697, 416268, 524097, 510417, 351422, 279165, 332137, 301082, 179064, 272240, 256024, 277810, 132636, 251782, 286866, 369815, -58448, -301635, 140219, 225424]
14248B25424j25471j21345j23364L6470P8510O2215K34678L90063J2784l00182
14238C69782l12547J7496j08790J0966k8440J20630L2738K2773k20180j91389
14228b86961M9185o4346J30188K06351R2577l4830Q4617m9773k06405J44603K46974
14217C12180J69082N9026j40113j77979j03508L39416n5067K797J5321j88027
14207B33128K18752L26250j4686J59040J56904q4843l9671p9929r0892k55077
14197E28976j02250J56142P4108r3638l4115q2904R1283j81829J27475J69268
14187F52516J80182j37165k32368k25366K05001J08168j07896j31295m8718o5455
14177A97604p0260N0847O2775Q0453L22810J57577j8258j3823r6817m7031j21241
$$ y = [225424, 99953, -21392, -144756, -108286, -29776, 32439, 267117, 657180, 669964, 369782, 57235, 74731, -34059, -23093, -51533, 69097, 101835, 124608, -95572, -286961, -237776, -302122, -171934, 34417, 126994, 92164, 176781, 127008, -79397, 65206, 312180, 481262, 540288, 400175, 222196, 118688, 458104, 403037, 405834, 421155, 233128, 451880, 778130, 763444, 922484, 1079388, 994545, 954874, 874945, 784053, 528976, 426726, 582868, 656976, 563338, 529223, 446319, 537602, 355773, 483248, 652516, 832698, 695533, 463165, 237799, 442800, 550968, 443072, 311777, 263059, 197604, 127344, 178191, 240966, 321419, 644229, 801806, 783548, 769725, 672908, 625877, 504636]
14166E04636J10520Q8330j17511q7136j14845Q3182J32541M3763r5981q499o2520
14155D76480j22569o7660K24002J58218j316P4413K63515l3174j09386J19527
14145I82050j59002j47849k4216k60154r0139O0706K70159J3765j45295R286K13694
14134G23005j66943l50616J49338R8001j36006j37698J79582J34661m9189J68219
14124F12354K693m5290n8605j63333Q7593L32956j9302j43365j48281j52269K09710
14113E14861J40940j62011q43K27520o7315j89866l49514r9020K02972p8977N5875
14102A94622K45725J85735J07817j56282P0616O4147J35191j31589m4054K77284
14092I49212j8114Q5483n9545j21496j47266M2974l6821J4536k62124j05278K19574
$$ y = [504636, 615156, 703486, 585975, 498839, 383994, 467176, 599717, 643480, 547499, 539000, 476480, 353911, 286251, 510253, 668471, 667155, 741568, 1005083, 971909, 862523, 982050, 823048, 675199, 650983, 390829, 300690, 361396, 631555, 645320, 500025, 509311, 723005, 556062, 205446, 354784, 452785, 316779, 179081, 358663, 493324, 444135, 612354, 615047, 569757, 511152, 347819, 435412, 768368, 749066, 605701, 457420, 305151, 514861, 655801, 493790, 492947, 720467, 653152, 463286, 113772, 14752, 217724, 138747, 194622, 440347, 626082, 733899, 577617, 648233, 712380, 847571, 715982, 671928, 949212, 931098, 1016581, 957036, 835540, 688274, 731248, 694427, 708963, 446839, 341561, 561135]
14081E61135K40185p9695l41653k35635K19618K14153K76028J27085j11045k68185
14071F01991p6867J50357J34445p2826Q3279R8243p5622k36191k53918N441J00620
14060D58952P9997L36089Q7702J42023Q3684j16887J66189J46373M8779k19989
14050A212912j87891K7528K23752J7004k33890j9212j84659k18289j15225J18396
14040F40426L04040r2576j94452k34719M7676m6957O2676R2409o9239R5038J36680
14029G41002J22788K22188o4229O4461P7656j85112O4791j66081J42229q2068
14019I37625j41206J38253m5199k9203K40240J31199J6482j93591j6182m2135
14009I96283O493j14990o0841Q5452J47599p8174k90444j81985j13161J51872
$$ y = [561135, 801320, 721625, 379972, 144337, 363955, 578108, 854136, 981221, 870176, 601991, 525124, 675481, 809926, 737100, 820379, 918622, 843000, 606809, 352891, 358332, 458952, 538949, 875038, 962740, 1104763, 1188447, 1071560, 1237749, 1384122, 1432901, 1212912, 1025021, 1052549, 1276301, 1293305, 1059415, 1040203, 855544, 637255, 522030, 640426, 944466, 851890, 657438, 422719, 470395, 423438, 486114, 578523, 509284, 604322, 741002, 863790, 1085978, 1021749, 1086210, 1163866, 978754, 1043545, 877464, 1019693, 937625, 796419, 934672, 889473, 860270, 1100510, 1231709, 1248191, 1054600, 1038418, 996283, 1002776, 887786, 826945, 912397, 1059996, 981822, 691378, 509393, 396232, 548104]
13999E48104M9400K05557J93072n7141J38050j46697r506o51n9057j91091K3035
13988F93075K2793Q8387j37105k21393j29781J65253p7387n9281J16038J10601
13978E71200K1611l39J53889N9342L216K89527n6098j36491j39545q1606L4577
13967G19283O9154O9103Q7194k6858J8444J11429M4447r8738J3649K1425P8661
13956A107193J34689N2255p2576m3637Q09l9270j69000J80468L9616k30828N9092
13945A018811K99190K06051l9147j65945J09823r5821j42115k89587R7601M73222
13935A472083J37187l68709l59678K2930O0643J78738o2335j99253n4933J62214
13925I88887K89892O7096j75485j05772k2986k09088J21735R1814j04234O2180
$$ y = [548104, 597504, 803061, 996133, 938992, 1077042, 930345, 920839, 920188, 861131, 670040, 693075, 715868, 804255, 667150, 445757, 315976, 481229, 403842, 344561, 460599, 571200, 592811, 592472, 746361, 805703, 808919, 1098446, 1042348, 905857, 766312, 684706, 719283, 788437, 857540, 944734, 917876, 936320, 1047749, 1092196, 993458, 1007107, 1028532, 1107193, 1241882, 1294137, 1221561, 1177924, 1178733, 1139463, 970463, 1150931, 1190547, 959719, 1018811, 1318001, 1524052, 1484905, 1318960, 1428783, 1332962, 1190847, 901260, 998861, 1472083, 1609270, 1240561, 880883, 903813, 964456, 1143194, 1080859, 881606, 826673, 988887, 1278779, 1345875, 1170390, 1064618, 1041632, 832544, 954279, 1046093, 941859, 1004039]
13915A004039n4650J19730O7649j88130j62879Q4917J13448k4777o5766j9061
13905H74520m4052j54020j41243N861J35459L44165K95270l06948q4941o4751
13895H59320K08625O4238O6068l25079l34896J92808M29219L32706O2310p2122
13885A483197k00345k27826l8591r0588j03162j38515j00259K06253J31727j5732
13875I06159J97026K521j5314m0639p5959k5241K40407o9587j4797j1173J05869
13864A199272p9533j38257q8023Q1971Q7408O1295J04464p0916j47554j34506
13854H75621J02971J48409J27752J37205k78173j22546J84708M74140O0957j20681
13844A590363P545R4905J28281J7704j30825j52612k91939r7636L8057M8170q6883
$$ y = [1004039, 949389, 1069119, 1136768, 948638, 785759, 870676, 984124, 959347, 893581, 874520, 830468, 676448, 535205, 541066, 676525, 1020690, 1315960, 1009012, 924071, 859320, 1067945, 1132183, 1198251, 873172, 538276, 731084, 1160303, 1493009, 1555319, 1483197, 1282852, 1055026, 1016435, 925847, 822685, 684170, 583911, 790164, 921891, 906159, 1103185, 1105706, 1090392, 1049753, 973794, 948553, 1188960, 1119373, 1104576, 1093403, 1199272, 1119739, 981482, 893459, 975430, 1062838, 1124133, 1228597, 1157681, 1010127, 875621, 978592, 1127001, 1254753, 1391958, 1113785, 991239, 1175947, 1650087, 1711044, 1590363, 1597908, 1692813, 1821094, 1838798, 1707973, 1555361, 1263422, 1165786, 1203843, 1252013, 1165130]
13833A165130j18528n2017j01423j0209P6835q8677j2145l8213J23685J11291
13823A055729K76828R5697k30411j34226l2527k4J25858J91551k56336j09208
13813I82931R9891m6426j9552O0112M14354L90700j19867j08138m528n5329j96866
13802A397282q7956K63022J55509j10604O2078l5311l1959J2035j34695Q2759
13792A572160j48710j77519R5111K8991n2393k3379J62123q918j00426j57559
13782A189481k00717k691j11664r8003K95671K94919R677j85079J5459j38363
13772A068690p1510J18598J56255J57899j1557j19068k32569j75462K33756J48895
13762A273927j46953J18596M6236K64024K2648r5129k49211k43690J82905L95443
$$ y = [1165130, 1046602, 994585, 893162, 882953, 959788, 871111, 858966, 820753, 944438, 1055729, 1332557, 1428254, 1197843, 1063617, 1031090, 1031066, 1156924, 1348475, 1092139, 982931, 1082822, 1036396, 1016844, 1076956, 1491310, 1882010, 1762143, 1654005, 1649477, 1594148, 1397282, 1309326, 1572348, 1727857, 1617253, 1679331, 1644020, 1612061, 1624096, 1489401, 1572160, 1423450, 1245931, 1341042, 1370033, 1317640, 1294261, 1456384, 1447466, 1347040, 1189481, 988764, 986073, 874409, 776406, 1072077, 1366996, 1376673, 1191594, 1207053, 1068690, 997180, 1115778, 1272033, 1429932, 1418375, 1299307, 1066738, 891276, 1125032, 1273927, 1126974, 1245570, 1291806, 1555830, 1578478, 1483349, 1234138, 990448, 1173353, 1568796]
13752A568796K95392L2748m26147l01710K8652j27327J38830M01701j02892j44900
13742A363143j56178j90506J26564K04260q0398K4856J02106M8673j6461n2205
13732A373854p7984l23255k41102L4489J30249J43778J62603O1021n4210j22900
13722A086543M3713J39971j6331n9349K70957J95744k57J1814j21028N4180J66203
13711A772160j64619j44670k34733o0380L51022q1736k84033j43937Q7403K23845
13701A320322N5197j15751J54248j5539l00679K27646K80397k6349r7599k54093
13691A227800K0161L08945m4949K2404J08756j19436Q3430k7669l5115O570J83813
13680A734710P1072p9979K6635p1679J8501k58262k68605q0125j77173J11081
$$ y = [1568796, 1864188, 1896936, 1470789, 1169079, 1197731, 1070404, 1209234, 1610935, 1508043, 1363143, 1206965, 1016459, 1143023, 1347283, 1266885, 1291741, 1393847, 1442520, 1426059, 1373854, 1295870, 972615, 731513, 766002, 896251, 1040029, 1202632, 1263653, 1209443, 1086543, 1130256, 1270227, 1253896, 1194547, 1465504, 1661248, 1660991, 1672805, 1551777, 1605957, 1772160, 1607541, 1462871, 1228138, 1167758, 1518780, 1437044, 1153011, 1009074, 1096477, 1320322, 1375519, 1259768, 1414016, 1398477, 1097798, 1325444, 1605841, 1579492, 1481893, 1227800, 1247961, 1556906, 1511957, 1534361, 1643117, 1523681, 1607111, 1579442, 1544327, 1550897, 1734710, 1805782, 1725803, 1752438, 1680759, 1699260, 1440998, 1172393, 1092268, 915095, 1026176]
13670A026176l0304J75812J14138q5152k21666J78123K45792Q3272o551k44853
13660A234787M9932Q0309k13305l0864J77480n1297L724j37753J77663J73472
13650A464148J73506N0569k30797k14959O5437R2013R4811r6873k22006R1268
13640A267117J69605k85133L0759J62750r2680j75109r4820R7150o3792L426K11057
13629A230330j60807J57064q0240j83959L2644M04826K00610j63302j72011n7098
13619A208057l20652l65085J95019M39930L0240L78778Q2963M703O8175k75987
13609A446141J67660k16821p6567M53043Q8433m09239o5609n2781J51852M46373
13599A932485l244k23509m07789K75230K33467l99750j98161o209o7639M0345
$$ y = [1026176, 995872, 1171684, 1285822, 1200670, 979004, 1157127, 1402919, 1486191, 1479640, 1234787, 1284719, 1365028, 1151723, 1120859, 1298339, 1247042, 1250766, 1113013, 1290676, 1464148, 1637654, 1688223, 1457426, 1242467, 1307904, 1399917, 1494728, 1397855, 1175849, 1267117, 1436722, 1151589, 1182348, 1345098, 1252418, 1077309, 982489, 1079639, 1015847, 1019273, 1230330, 1069523, 1226587, 1146347, 962388, 995032, 1399858, 1600468, 1437166, 1265155, 1208057, 887405, 522320, 717339, 1157269, 1187509, 1566287, 1649250, 1653953, 1722128, 1446141, 1613801, 1396980, 1320413, 1773456, 1861889, 1452650, 1387041, 1334260, 1486112, 1932485, 1929241, 1705732, 1297943, 1573173, 1806640, 1406890, 1208729, 1202520, 1134881, 1175226]
13589A175226j3505K10697j80336J6477j44266Q1082n128J57953J75538m9676
13579A424062Q700o7730j61103L2492J90339J35907j00406l4210r9362l9331O2301
13568A351659p8962P569M5432J44800l22629k27892J9261J88154K18594q7044
13558A258942k4298K24168Q0340j85999q0695o6266J09602K03892L9922N8373
13548A617981l13749l45837j74495o1784J32120K15194J48489M0799r2765j44891
13538A021062m3825l0795j54984J6822J42126M6915l4602j28223K44927P3664
13528A153087j37358R6820Q6331k73397J10137K79432L3490m06733n0019J68600
13518A060390J9243p5901j54572O7684K04747j88972k90796j98061J20962K78080
$$ y = [1175226, 1161721, 1372418, 1192082, 1208559, 1064293, 1145375, 1140247, 1298200, 1473738, 1424062, 1432762, 1365032, 1203929, 1236421, 1426760, 1562667, 1462261, 1428051, 1328689, 1289358, 1351659, 1272697, 1280266, 1325698, 1470498, 1147869, 919977, 939238, 1127392, 1345986, 1258942, 1234644, 1458812, 1539152, 1353153, 1272458, 1206192, 1315794, 1519686, 1559608, 1617981, 1304232, 958395, 783900, 722116, 854236, 1069430, 1217919, 1258718, 1165953, 1021062, 977237, 946442, 791458, 808280, 950406, 997321, 962719, 834496, 1079423, 1153087, 1015729, 1112549, 1198880, 925483, 1035620, 1315052, 1348542, 941809, 891790, 1060390, 1079633, 1003732, 849160, 916844, 1121591, 932619, 641823, 443762, 564724, 842804]
13508H42804J34552O1769M4488L2245M1670k8659M3590j47895j87206k30902l4461
13497E71995N7960J5211m7566K06921L1836R1054k7852p8893M8774K61722K12175
13486A343337j04713k97265N5339K35103M0293Q578j54313k46264j2023J59862
13476A027934M3333k4730L0504p8848K1181p6794K05877K8700j49361L3509R6918
13465A158223l8311P9832N2513N0378k40826k77080Q2451o0301M1432J10100J46198
13454A104609m3472j74467J67296j32604j06727J79238K36182j84032K454j48682
13444H99795K7938m1857K63802O5049j11521J25772j89124q3323j24755J6126
13434H47902r2820j76613N6357M0408q5827k54228k31847p0734P6242M15478N6133
$$ y = [842804, 977356, 1039125, 1083613, 1115858, 1157528, 1128869, 1172459, 1024564, 837358, 606456, 571995, 629955, 645166, 597600, 804521, 836357, 927411, 899559, 820666, 869440, 1131162, 1343337, 1238624, 941359, 996698, 1231801, 1272094, 1280672, 1126359, 880095, 868072, 1027934, 1071267, 1046537, 1077041, 998193, 1019374, 942580, 1148457, 1177157, 1027796, 1061305, 1158223, 1119912, 1199744, 1252257, 1302635, 1061809, 784729, 867180, 806879, 848311, 958411, 1104609, 1061137, 886670, 1053966, 921362, 814635, 993873, 1230055, 1046023, 1048477, 899795, 927733, 885876, 1149678, 1214727, 1103206, 1228978, 1039854, 956531, 831776, 847902, 755082, 578469, 634826, 675234, 589407, 335179, 103332, 32598, 108840, 524318, 580451]
13423E80451P9415q5355P6632J6064L01247L46085j77990k92829k70253k220J88639
13412G59886J88848R3524M2048O3013k4781k32249j6638k63025M3695J49908J13045
13401I17274J14282k9692m2742k41697k85853K1219K46467K36396J26419q7126
13391I74947j16922m981r5585J1874J7882j94468p3534j51366K30807R8581O0567
13380G57802j08884j6112j57416L99201L09931j10802j18163J67630o95l66172
13370G56320j27368m4883N2132K75821J03762r8341J39217K24818j0932j45219
13360A125327o3911L9212l7596j6429O004K4155l38280m5797M8970m3207k13934
13349D84514J76141J24565q0420L03160j13451k02215j49675o9575j11078K8616
$$ y = [580451, 659866, 574511, 651143, 667207, 968454, 1314539, 1136549, 843720, 573467, 571247, 759886, 948734, 1042258, 1084306, 1147319, 1122538, 890289, 873651, 610626, 654321, 804229, 917274, 1031556, 1001864, 959122, 717425, 431572, 452791, 699258, 935654, 1062073, 974947, 858025, 853044, 757459, 769333, 787215, 592747, 519213, 367847, 598654, 697235, 757802, 648918, 632806, 475390, 874591, 1184522, 1073720, 955557, 1123187, 1122492, 756320, 628952, 584069, 636201, 912022, 1015784, 917443, 1056660, 1281478, 1270546, 1125327, 1061416, 1100628, 1063032, 1046603, 1052607, 1076762, 738482, 692685, 741655, 698448, 484514, 660655, 785220, 704800, 1007960, 894509, 692294, 542619, 473044, 361966, 390582]
13339C90582P4111j07339K70739K13444K22024L1469J08507k9814o3282j10142
13329A000299n8530K25136j0945l18345k64145M8312K00557o5553k1234P9657
13319H15209j00122j18590o418l2255p365J40285J94482J16599M9344j21252J30063
13308A059980J34244j56487m4015o3425J06422P8311N5013l3206j64833l0674
13298I41330J16346j18352R27N9634j60442l18752J01670J87137l36441l73240
13288I9817J89625L0380J14048O60K39748J20893o9454P6845K40638p5487k0396
13277I47317K15630K395j95051j34535J9542m04703k16622j9946p7748N1382K01772
13266C89433J47307j65254o4745K85607K94606j09352j60200j01741J8884L3477
$$ y = [390582, 464693, 357354, 628093, 841537, 1063561, 1095030, 1203537, 1173723, 1110441, 1000299, 941769, 1166905, 1155960, 837615, 573470, 621782, 822339, 756786, 735552, 815209, 715087, 596497, 590079, 557824, 550459, 690744, 885226, 1001825, 1051169, 929917, 1059980, 1194224, 1037737, 993722, 930297, 1036719, 1115030, 1170043, 1136837, 972004, 941330, 1057676, 939324, 940251, 999885, 839443, 520691, 622361, 809498, 473057, 99817, 289442, 319822, 433870, 434530, 674278, 795171, 725717, 802562, 1043200, 967713, 947317, 1162947, 1165342, 970291, 835756, 855298, 450595, 233973, 214027, 136279, 187661, 389433, 536740, 371486, 306741, 592348, 886954, 777602, 617402, 515661, 534545, 568022]
13256E68022j16827j26203J38045J03530j89637P8545n8886J54636j94213j81648
13246A75364M4395j67867k34199r1002K44198K27163K0692Q3621Q4024q2550n008
13235B98831J70788k01764p3907M7204j26354j2454J93195L74601p6378K0887
13225F14649l9737j35907J42257L54655k91921k97765n6965K93792P8914K3953
13215F85925J70014r1358o7605k70916k36760J88709o776J39345l864o0762n1107
13204C94845Q4394j16704L964L18497N0035j81995k3643j788j12399k76035j14624
13193B4547K31368L16156o5224k39952n8693K5466O2795K5106M9049N9116N3394
13182D83128p4570o9924J72533J02819n2186Q4961L1976J9660r0139k800J99384
$$ y = [568022, 451195, 324992, 463037, 566567, 376930, 455475, 396589, 551225, 357012, 175364, 219759, 51892, -182307, -273309, -29111, 198052, 218744, 302365, 386389, 303839, 298831, 469619, 267855, 193948, 241152, 114798, 102344, 295539, 670140, 593762, 614649, 574912, 439005, 581262, 935917, 643996, 346231, 289266, 583058, 661972, 685925, 855939, 764581, 696976, 426060, 189300, 378009, 371233, 510578, 506714, 445952, 394845, 479239, 362535, 366499, 684996, 735031, 553036, 529393, 527605, 415206, 139171, 24547, 255915, 572071, 506847, 266895, 208202, 233668, 296463, 321569, 370618, 429734, 483128, 408558, 338634, 511167, 613986, 561800, 646761, 678737, 698397, 608258, 605458, 804842]
13171H04842J01017N5889k64319K0575J40700j45800k55154q8874J34226J21629
13161F24731R143J8222k38586m9868O3500k07168l87777K60884L67694J35648
13151E96423J90346J93336j31967n3058j63788K3714p5655n334j39222j04186
13141C30609l2019O0086j04721m7519J44287j24860N3272k11541J42653K42122
13131D52369M3246l1722L8371K4322j33930Q132k39738L76837P9746k40563k57156
13120A19914M0502P3473j28540j00248K01836J06181j08636K9230K27437j46244
13110C14905j32652K68922K46463k8167N993M2698j10578J2174j2208j07660Q5817
13099E85707r703p3017N7529j09736J65165K67799j35156j04944j39663m9035
$$ y = [804842, 905859, 961748, 697429, 718004, 858704, 712904, 457750, 368876, 503102, 624731, 633874, 652096, 413510, 363642, 427142, 219974, -167803, 93081, 460775, 596423, 786769, 980105, 848138, 795080, 631292, 655006, 579351, 574017, 434795, 330609, 298590, 358676, 253955, 206436, 350723, 225863, 279135, 67594, 210247, 452369, 495615, 463893, 502264, 526586, 392656, 400788, 161050, 537887, 617633, 377070, 119914, 160416, 233889, 105349, 5101, 206937, 313118, 204482, 233712, 461149, 314905, 182253, 451175, 697638, 669471, 675464, 718162, 607584, 619758, 607550, 499890, 585707, 576004, 502987, 560516, 450780, 615945, 883744, 748588, 643644, 503981, 454946]
13089D54946p9131o3557K18526K65502M156j31593k07342p810J2833K67378Q9338
13078H23246r413k88876N7825J3447m0565k177K55737N76j25153j57436j15102
13067D12109j10040j1877Q4596J07456J8231q188r0239J42687n0551n2755M0096
13056D81525j6928r8763p6071o8574J99597j63364l25541L1275K57386L27551
13046E48093R7788j58000q3928P7612j155J70249Q6209q4436J07546Q8768k71484
$$ y = [454946, 375815, 312258, 530784, 796286, 800442, 668849, 461507, 453697, 466530, 733908, 823246, 813833, 524957, 582782, 596229, 555664, 553487, 809224, 809800, 684647, 527211, 412109, 302069, 290192, 374788, 482244, 500475, 492287, 402048, 544735, 494184, 441429, 481525, 464597, 365834, 289763, 221189, 420786, 257422, -68119, -36844, 220542, 548093, 645881, 487881, 403953, 481565, 480410, 650659, 736868, 652432, 759978, 848746, 577262]
$$ [...]
##END NTUPLES=NMR SPECTRUM
##END=
