##TITLE=Analysis number 308225
Compound Code cc 06301
Book Reference 440/16
Project Code adrs
Chemist Name craigr
##JCAMPDX= 6.0         $$ Bruker NMR JCAMP-DX V2.0
##DATA TYPE= NMR SPECTRUM
##DATA CLASS= NTUPLES
##ORIGIN= Bruker BioSpin GmbH
##OWNER= NMR
$$ XWIN-NMR		Version 3.5
$$ Mon May 23 10:47:34 2005 GMT Daylight Time (UT+1h)  MAYBRIDGE\NMR@NMR_250MHZ
##.OBSERVE FREQUENCY= 250.131544655141
##.OBSERVE NUCLEUS= ^1H
##.ACQUISITION MODE= SIMULTANEOUS (DQD)
##.ACQUISITION SCHEME= undefined
##.AVERAGES= 16
##.DIGITISER RES= 18
##SPECTROMETER/DATA SYSTEM= dpx250
##.PULSE SEQUENCE= zg30
##.SOLVENT NAME= DMSO
##.SHIFT REFERENCE= (INTERNAL, DMSO, 0, 16.522)
##AUDIT TRAIL= $$ (NUMBER, WHEN, WHO, WHERE, WHAT)
$$ ##TITLE= Audit trail, XWIN-NMR		Version 3.5
$$ ##JCAMPDX= 5.01
$$ ##ORIGIN= Bruker BioSpin GmbH
$$ ##OWNER= NMR
$$ C:\u/data/dgb/nmr/ADRS/3280/pdata/1/auditp.txt
$$ ##AUDIT TRAIL=  $$ (NUMBER, WHEN, WHO, WHERE, WHAT)
(   1,<2005-05-23 10:47:13.09 +100>,<MAYBRIDGE\NMR>,<NMR_250MHZ>,
      <created by zg, POWCHK disabled, PULCHK disabled
       configuration hash MD5:
       62 19 C7 07 E1 42 D1 B7 37 6C 3D D0 77 39 F9 E6
       data hash MD5: 64K
       8D EE BE A0 B0 CE C8 72 A3 79 8B 5B D3 C6 D8 BE>)
(   2,<2005-05-23 10:47:24.85 +100>,<MAYBRIDGE\NMR>,<NMR_250MHZ>,
      <Start of raw data processing
       ef LB = 0.3 FT_mod = 6 PKNL = 1 SI = 32K 
       data hash MD5: 32K
       C5 CD FB BE FF E1 05 8D 35 45 E1 0C FE 70 EF 37>)
(   3,<2005-05-23 10:47:26.63 +100>,<MAYBRIDGE\NMR>,<NMR_250MHZ>,
      <apk 
       data hash MD5: 32K
       7C 23 C7 26 49 A2 D6 5D 59 61 97 E9 42 33 76 5C>)
(   4,<2005-05-23 10:47:27.48 +100>,<MAYBRIDGE\NMR>,<NMR_250MHZ>,
      <abs ABSG = 5 
       data hash MD5: 32K
       0A 4A B0 0B 3F D2 7F ED C8 BB EE AB 40 97 04 57>)
$$ ##END=
$$ 
$$ hash MD5
$$ F0 6F 4A 0E D9 A4 B6 8F 84 DB 3B C8 C9 4E 83 B6
##$RELAX= 
##$RELAX= 
##$RELAX= 
##$RELAX= 
##$RELAX= 
##$RELAX= 
##$RELAX= 
$$ Bruker specific parameters
$$ --------------------------
##$DU= <C:\u>
##$EXPNO= 3280
##$NAME= <ADRS>
##$PROCNO= 1
##$TYPE= <nmr>
##$USER= <dgb>
##$AMP= (0..31)
100 100 100 100 100 100 100 100 100 100 100 100 100 100 100 100 100 100 
100 100 100 100 100 100 100 100 100 100 100 100 100 100 
##$AQSEQ= 0
##$AQ_mod= 3
##$AUNM= <au_zg>
##$AUTOPOS= <13 >
##$BF1= 250.13
##$BF2= 250.13
##$BF3= 250.13
##$BF4= 250.13
##$BF5= 500.13
##$BF6= 500.13
##$BF7= 500.13
##$BF8= 500.13
##$BYTORDA= 1
##$CFDGTYP= 0
##$CFRGTYP= 5
##$CHEMSTR= <none>
##$CNST= (0..31)
1 1 145 1 1 1 1 1 1 1 1 1 1 1 1 1 1 1 1 1 1 1 1 1 1 1 1 1 1 1 1 1 
##$CPDPRG= <>
##$CPDPRG1= <>
##$CPDPRG2= <>
##$CPDPRG3= <>
##$CPDPRG4= <mlev>
##$CPDPRG5= <mlev>
##$CPDPRG6= <mlev>
##$CPDPRG7= <mlev>
##$CPDPRG8= <mlev>
##$CPDPRGB= <>
##$CPDPRGT= <>
##$D= (0..31)
0 1 0 0 0 0 0 0 0 0.06 0 0 0 0 0 0 0.0002 0 0 0 0 0 0 0 0 0 0 0 0 0 0 
0 
##$DATE= 1116841632
##$DBL= (0..7)
120 120 120 120 120 120 120 120 
##$DBP= (0..7)
150 150 150 150 150 150 150 150 
##$DBP07= 0
##$DBPNAM0= <>
##$DBPNAM1= <>
$$ [...]
##$SUBNAM7= <"">
##$SUBNAM8= <"">
##$SUBNAM9= <"">
##$SW= 20.6930455092707
##$SWIBOX= (0..15)
0 0 3 0 0 0 0 0 0 0 0 0 0 0 0 0 
##$SW_h= 5175.983436853
##$TD= 65536
##$TD0= 1
##$TE= 295.16
##$TE2= 300
##$TE3= 300
##$TEG= 300
##$TL= (0..7)
0 120 120 120 120 120 120 120 
##$TP= (0..7)
150 150 150 150 150 150 150 150 
##$TP07= 0
##$TPNAME0= <>
##$TPNAME1= <>
##$TPNAME2= <>
##$TPNAME3= <>
##$TPNAME4= <>
##$TPNAME5= <>
##$TPNAME6= <>
##$TPNAME7= <>
##$TPOAL= (0..7)
0.5 0.5 0.5 0.5 0.5 0.5 0.5 0.5 
##$TPOFFS= (0..7)
0 0 0 0 0 0 0 0 
##$TUNHIN= 0
##$TUNHOUT= 0
##$TUNXOUT= 0
##$USERA1= <user>
##$USERA2= <user>
##$USERA3= <user>
##$USERA4= <user>
##$USERA5= <user>
##$V9= 5
##$VALIST= <valist>
##$VCLIST= <CCCCCCCCCCCCCCC>
##$VD= 0
##$VDLIST= <DDDDDDDDDDDDDDD>
##$VPLIST= <PPPPPPPPPPPPPPP>
##$VTLIST= <TTTTTTTTTTTTTTT>
##$WBST= 1024
##$WBSW= 4
##$XGAIN= (0..3)
0 0 0 0 
##$XL= 0
##$YL= 0
##$YMAX_a= 266664
##$YMIN_a= -300625
##$ZGOPTNS= <>
##$ZL1= 120
##$ZL2= 120
##$ZL3= 120
##$ZL4= 120
##$ABSF1= 16.522
##$ABSF2= -4.171173
##$ABSG= 5
##$ABSL= 3
##$ALPHA= 0
##$AQORDER= 0
##$ASSFAC= 0
##$ASSFACI= 0
##$ASSFACX= 0
##$ASSWID= 0
##$AUNMP= <proc_1d>
##$AZFE= 0.1
##$AZFW= 0.1
##$BCFW= 0
##$BC_mod= 0
##$BYTORDP= 0
##$COROFFS= 0
##$CY= 12.5
##$DATMOD= 1
##$DC= 0
##$DFILT= <>
##$DTYPP= 0
##$F1P= 14.0000005364418
##$F2P= -0.99999901652339
##$FCOR= 0.5
##$FTSIZE= 32768
##$FT_mod= 6
##$GAMMA= 0
##$GB= 0
##$INTBC= 1
##$INTSCL= 1
##$ISEN= 128
##$LB= 0.3
##$LEV0= 0
##$LPBIN= 0
##$MAXI= 10000
##$MC2= 0
##$MEAN= 0
##$ME_mod= 0
##$MI= 0
##$NCOEF= 0
##$NC_proc= -3
##$NLEV= 6
##$NOISF1= 0
##$NOISF2= 0
##$NSP= 0
##$NTH_PI= 0
##$NZP= 0
##$OFFSET= 16.522
##$PC= 1
##$PHC0= -83.50346
##$PHC1= 5.75361
##$PH_mod= 1
##$PKNL= yes
##$PPARMOD= 0
##$PSCAL= 4
##$PSIGN= 0
##$REVERSE= no
##$SF= 250.13
##$SI= 32768
##$SIGF1= 0
##$SIGF2= 0
##$SINO= 400
##$SIOLD= 32768
##$SREGLST= <1H.DMSO>
##$SSB= 0
##$STSI= 32768
##$STSR= 0
##$SW_p= 5175.98343685301
##$SYMM= 0
##$S_DEV= 0
##$TDeff= 65536
##$TDoff= 0
##$TI= <Analysis number 999999
Compound Code 99
Book Reference 9
Project Code 9>
##$TILT= no
##$TM1= 0
##$TM2= 0
##$TOPLEV= 0
##$USERP1= <user>
##$USERP2= <user>
##$USERP3= <user>
##$USERP4= <user>
##$USERP5= <user>
##$WDW= 1
##$XDIM= 32768
##$YMAX_p= 476926543
##$YMIN_p= -126560
$$ End of Bruker specific parameters
$$ ---------------------------------
##NTUPLES= NMR SPECTRUM
##VAR_NAME=  FREQUENCY,     SPECTRUM/REAL,   SPECTRUM/IMAG
##SYMBOL=    X,             R,               I
##VAR_TYPE=  INDEPENDENT,   DEPENDENT,       DEPENDENT
##VAR_FORM=  AFFN,          ASDF,            ASDF
##VAR_DIM=   32768,         32768,           32768
##UNITS=     HZ,            ARBITRARY UNITS, ARBITRARY UNITS
##FACTOR=    0.157963299565203, 1,           1
##FIRST=     4132.6476996994, 0,             0
##LAST=      -1043.33573715361, 0,           0
##MIN=       -1043.33573715361, -126560,     0
##MAX=       4132.6476996994, 476926543,     0
$$ Real data points
##PAGE= N=1
##DATA TABLE= (X++(R..R)), XYDATA
$$ [...]
23547 -35300 -27268 -24234 -36919 -70654 -60961 -26447 -34974 -52625 -28929 -31139 -36474 -9638 516
23534 516 3419 -15763 -23686 -22222 -9998 -8051 -19156 -35091 -63122 -42084 -52802 -40171 -15400
23521 -15400 -3375 22061 35482 27619 22609 8876 26609 31504 21616 14418 19350 -8045 -26732
23508 -26732 14289 6609 504 7248 5631 -22112 -8880 4501 44752 48877 25810 -4846 -47952
23495 -47952 -20407 -10559 -13352 -6101 -2708 5454 -9715 -10120 -28078 -29606 -11795 -22425 -8833
23482 -8833 -29462 -51700 -23565 -35858 -23343 -46358 -57080 -46093 -9836 -17036 -28493 -39575
23470 -39575 -21205 -36599 -41206 -1722 1624 -10153 -6339 -20032 -36828 -30177 -30250 -35146 -5205
23457 -5205 -14661 -26852 -36089 -35413 -30288 -56309 -70483 -37171 -28791 -46761 -7987 -2407 -6187
23444 -6187 12616 10090 4322 28562 29929 1056 -38011 -22342 -17035 -14307 -23218 -35060 15868
23431 15868 47297 17601 -10353 -58577 -66893 -50291 -47139 -66877 -32335 -10110 915 -6224
23419 -6224 423 -27330 -15208 7620 -741 23621 7329 -14 -15197 -38772 -27596 -24304 -56078
23406 -56078 -72524 -63650 -53048 -44662 -18586 3369 33452 24972 16395 38679 18606 -2940
23394 -2940 7914 31047 38095 48262 41847 41267 25982 25763 10582 6271 -5429 -4858 -13865 13719
23380 13719 3103 -29160 10597 31903 25691 -12293 -27767 -17280 7403 -19582 -38795 -24477
23368 -24477 3385 12725 17346 13806 7397 -8224 -18133 -25550 -27975 -11465 1570 27824 -7211
23355 -7211 -34334 -11135 9649 22539 44639 55403 67869 68937 104871 104680 50898 25533
23343 25533 21763 18478 8026 -22656 -25271 -23929 -30851 -60584 -44517 -43315 -38958 -38622 -41690 -40660
23329 -40660 -32501 -35647 -40176 -35945 -5870 -20596 -14677 -2858 4156 6275 -49908 -53764 -48588
23316 -48588 -41872 -33293 -15508 10408 27579 32842 51187 31764 22104 54851 74600 58382
23304 58382 8203 -21935 -20615 -33976 -34809 -25669 16039 2036 -25022 -44348 -32328 -28152 -1992
23291 -1992 8156 24926 12268 -8255 127 -6496 -36682 -26232 -12691 42427 39461 -509
23279 -509 -23005 -11180 14261 2754 -14882 -38211 -27855 17984 35000 8659 28086 40853
23267 40853 18969 24739 43899 23539 -8136 -28474 -22718 -23581 -51236 -76064 -71728 -59589 -19245
23254 -19245 -19363 -34950 -76288 -58760 -16074 17016 35759 26357 11852 19508 17535 -1523 23533
23241 23533 40428 41125 54040 56623 47616 40034 33196 38075 51733 20416 21017 30829 5815 -26232
23227 -26232 -23933 30691 36653 33152 33902 67815 58009 5846 -13771 -2174 13132 21051 -741
23214 -741 2150 41624 48505 6221 -2276 -7248 -20902 -19030 -14021 -20879 4271 28932 47107
23201 47107 38976 34261 25984 12549 10938 16402 15082 1667 -44374 -74759 -43345 -25822 -35522
23188 -35522 7050 30515 16921 -12976 -15136 9784 -16192 -5504 2389 -9481 11477 5536
23176 5536 12139 -798 -3428 -1055 -18984 -50741 -37071 -25919 -12661 8784 -242 -2511 17361
23163 17361 28012 8800 16377 -7220 -9834 -3710 12388 13787 6207 -16572 -1825 11031 28307
23150 28307 29816 15653 26064 33103 33249 -2465 11430 34793 42702 16507 13952 -14138 -1000
23137 -1000 28471 34606 28898 82 1342 49035 58192 30520 30594 26514 20976 14754 18901 36491
23123 36491 19440 -35826 -23663 9756 13538 -15345 -10035 9416 27023 10144 -39769 -62206
23111 -62206 -21811 -10270 18417 9152 -3633 3462 -19543 -37692 -40275 -54148 -30033 -21336
23099 -21336 -24017 -16613 20193 13265 -16164 -29913 -2188 29448 34924 17201 -1208 9145
23087 9145 9519 35908 8226 14792 4832 -23279 -44871 -29166 4603 7266 -17770 -27369 11465
23074 11465 37852 26582 16424 5610 -28823 -56821 -48110 -65081 -34206 -31504 -22241 2373
23062 2373 -21112 -44649 -20196 14608 26580 1464 22109 25260 20427 1812 17057 52805
23050 52805 55141 47614 32802 28207 12884 -6989 6032 24130 11910 23661 35488 14693
23038 14693 -7799 -8009 10703 17904 -1187 -31357 -31999 -49235 -66025 -50073 -36317 -26671 -49013
23025 -49013 -56306 -54782 -34124 -11782 -16871 -27030 -41191 -36982 2328 -13616 -54740 -43761
23013 -43761 -15388 -8436 -22279 -35860 -26187 -19210 -22079 -6569 15742 20151 11675 571 -6497
23000 -6497 5958 5942 -6262 -9450 35071 48475 32123 29669 20208 8436 -7660 -32880 -44639
22987 -44639 -27985 -3727 12992 -2812 -26724 -45780 -19675 8144 20325 40413 27557 30510
22975 30510 60722 38119 -250 -28776 -20601 -15087 -8428 -2387 -8624 40155 82894 58990 72352
22962 72352 39800 16253 501 -10525 -4190 -7471 -31849 -31761 9936 18778 12909 19302 41736
22949 41736 28480 -8176 807 24273 28965 22137 8024 4216 -10120 -25233 -25477 -44470 -36788
22936 -36788 -31293 -1254 49153 84477 96628 89476 93137 63401 22680 18269 16281 18191 29255
22923 29255 32358 41543 21403 34405 55734 59125 80801 65141 32648 13103 2068 -10365
22911 -10365 -6787 5919 -9124 -30312 -41014 -60312 -57237 -50686 -66764 -55383 -4810 6924
22899 6924 21394 14945 -7540 -15628 -1086 20700 33256 14129 5079 -16 -217 -4401 -4918 41418
22885 41418 66157 47919 41686 17154 10402 27303 -10029 -8708 19300 -25536 -64641 -37537
22873 -37537 -28133 -34300 -30093 -29444 32469 40036 9565 23129 17617 4347 20445 17337 17309 43928
22859 43928 38537 26833 -8194 -37190 -14798 1806 -4837 -6949 -16386 -9946 -25774 -50536 -28310
22846 -28310 2726 -3096 -6907 -4935 -15559 -8643 2646 -6128 -26184 -69638 -64450 -44486 -13672
22833 -13672 27457 7494 -40465 -44148 -33963 -60513 -66721 -43781 -39792 -34939 -24314 -35922
22821 -35922 -66221 -76185 -58514 -7013 2094 9369 16081 9751 8764 23334 37969 56968 55492
22808 55492 21397 3690 13312 17114 20827 -14096 -39013 -46406 -19374 805 -1265 -22778 -14322
22795 -14322 32772 34626 -20052 -39161 -50396 -24737 -178 29681 33873 15457 -6942 -25081
22783 -25081 -51474 -59303 -47819 -39322 -30050 -5311 -1282 885 -12536 -23811 -25521 -7401 30760
22770 30760 60076 65861 43450 37424 3701 12087 -5798 -9976 8206 3376 -2179 -16917 -6998
22757 -6998 -12790 -18203 7398 36313 39243 44440 38684 12800 -17769 -13576 -2841 -17051 -12626
22744 -12626 -246 -44940 -52997 -29597 -44407 -46516 -43722 -37542 -35288 -8298 -1838 -14237 -37400
22731 -37400 -44570 -36259 -17896 -11600 1111 4363 26702 9866 -42818 -65631 -55201 -31334
22719 -31334 -18924 -10624 -35229 -27475 -21958 -18265 -3886 7959 -34349 -15080 -14076 -10146 -4772
22706 -4772 14947 34781 18872 11020 -19777 -43277 -14948 -12047 -4385 5346 28798 -1516 1181
22693 1181 12826 19528 -22652 -23641 -13983 -6091 -4335 -2101 -18293 -32846 -46014 -62130 -71853
22680 -71853 -21129 23853 38246 25589 -21312 -39013 -26784 -23662 -11635 -1970 8047 23965
22668 23965 18353 8050 -2345 -28103 -36518 -25223 -25630 -29940 -24471 11684 48562 56275 34427
22655 34427 -5513 2550 20221 18111 838 -13680 -21904 -23350 -14916 -4714 40182 57337 76341
22642 76341 49518 44094 16442 7175 27236 -2122 29926 46095 20096 5825 313 21006
22630 21006 -410 -13191 -8810 7811 6797 13310 2879 -20337 -28525 -36311 -42336 -19935 -28150
22617 -28150 -26894 -40038 -56806 -24605 7056 49324 58851 45314 40645 16712 19259 33334
22605 33334 24268 28239 25502 16850 22340 611 -14178 -12058 10315 25290 12833 22568 25660
22592 25660 22649 -12386 -19115 -29638 -29187 -33189 -9623 32413 15897 -19536 -36173 -33024 -23253
22579 -23253 -7157 -14678 -1833 -4738 1618 -2559 -19176 -6814 -9106 -21756 -26252 -9836 -12542
22566 -12542 19156 32469 31469 47214 52370 30737 28450 -4845 -43070 -35174 -19132 -29850
22554 -29850 -1246 -3689 -3445 -868 13594 4828 8565 8086 -10777 -30331 -50619 -46618 -47051 -36142
22540 -36142 -4982 -27036 -22627 -19552 -45536 -45879 -40056 -43154 -70255 -60744 -18513 -2967 -11977
22527 -11977 -23172 -38235 -43973 -9944 20564 9161 14492 9835 -22320 -38908 -44002 -44077 -24102
22514 -24102 12528 51830 48255 27336 -7352 -30785 -26276 -39854 -23862 -32559 -18875 -27812
22502 -27812 -47616 -13519 12194 11892 1336 -8395 -4736 -18776 -12170 12922 38777 49884 69916
22489 69916 43871 -12492 -38645 -6557 -14068 -40148 -48657 -85878 -86631 -74127 -64660 -46565 -27873
22476 -27873 -30037 -11370 19693 15162 -4354 -4596 -4495 -12897 -16592 -11475 -19538 -9363 -2857 -13373
22462 -13373 -51168 -69433 -91678 -71427 -34202 7993 5258 35220 3915 11797 53112 55318
22450 55318 9077 -29967 -32558 -39300 -30266 -3782 6180 -1846 9051 14720 21771 16484 -23889
22437 -23889 -25701 -13708 6748 -1807 -26013 -45736 -40961 -21848 -18012 -6910 2842 35468 22613
22424 22613 2313 1644 14048 -1967 -18790 -9447 22299 43194 37116 36520 32415 35469 -6420
22411 -6420 -38555 -33910 -35382 -36460 -40209 -21543 18759 7808 -22941 -36015 -27157 2970 524
22398 524 -24194 -17686 -18155 -16008 -16763 -9738 5893 10483 4273 13458 21538 14400 4307 -291 -9630
22383 -9630 -13959 14076 5009 -12773 12936 4817 -2158 -29817 -44898 -71272 -60470 -59709 -43831
22370 -43831 12539 1887 -14901 -22944 -11585 -37387 -60287 -39735 -14926 -22584 -33928 -16008
22358 -16008 -10068 -20961 -31643 -35601 -11588 -15583 -32913 -75406 -62217 -48009 -34763 39734
22346 39734 54433 29927 17571 -1085 -19463 -14620 -6434 4087 -14329 -10415 -14089 -1494
22334 -1494 9156 30879 28371 23770 35434 14056 -8129 -31086 -37467 -36757 -46289 -39039 -1764
22321 -1764 33130 17628 -15502 -68857 -75869 -49313 -23934 9030 19868 23827 20723 26320 15898
22308 15898 -16875 -34248 -14514 6179 21687 4812 -20739 -27016 -18851 -16940 -19035 -15460 -7851
22295 -7851 9 -2151 -25724 6025 14600 -12605 -18551 -20995 -14174 -23145 -43946 -79667 -91997
22282 -91997 -87742 -72164 -53094 -40704 -46514 -31133 -51838 -59128 -55691 -59916 -27229 -38449 -37964
22269 -37964 -13778 45371 82211 73814 36040 -2361 -19520 -14805 -35633 -48641 -57542 -62494
22257 -62494 -23956 8859 16094 17298 8579 1944 12377 33028 23892 -12256 -24227 2731 -5910
22244 -5910 -26744 -22011 10410 14253 727 11594 11842 36108 27940 1757 21741 55528 47607
22231 47607 19873 -3558 -17099 -38673 -19373 -19281 -12027 13061 30344 33349 -2051 -21297 -17867
22218 -17867 -56966 -62739 -65246 -46952 -71398 -59421 -17424 2416 14992 2564 7358 9250
22206 9250 -30062 -28262 7231 33862 18690 -22280 -49342 -78669 -71472 -25113 -26496 -23332 -16023
22193 -16023 6902 11761 -1450 15950 45203 25745 20357 43693 24574 950 27378 41589
22181 41589 15668 9935 -12175 -24583 -10468 -5597 1919 -38775 -66627 -17151 749 -30426
22169 -30426 -35099 -52750 -40603 -28734 -33972 -13385 14538 35284 4430 -36771 -2666 25830
22157 25830 31707 37934 1125 -46944 -42209 6333 33062 27974 14133 -366 -12547 -16106 -1985
22144 -1985 9543 8273 -3048 1564 -3088 9100 16437 16486 28505 50467 26885 17773 41318
22131 41318 43897 43415 33804 -11307 -12928 -13412 -39222 -40996 23966 53262 59895 49736 36581
22118 36581 10672 23517 37342 44446 44991 13858 10052 15248 9775 -25172 -31640 -25146 -27958
22105 -27958 -14705 8500 51456 69214 51744 26889 13930 6186 4290 28986 25804 17665
22093 17665 14685 13621 20540 20475 8703 9905 5449 -28401 -67919 -92299 -96164 -53739 -29732
22080 -29732 -28543 -49278 -53668 -49130 -53051 -64152 -70114 -14255 20866 27942 28181 1424 -3890
22067 -3890 -9542 11895 -34007 -40285 -23505 -40773 -38577 -8594 -5027 -21886 -57280 -65406 -58961
22054 -58961 -53475 -47567 -50744 -39232 -40553 -42272 -41596 -34167 4126 18163 -6221 -20256 -10968
22041 -10968 -40507 -46770 -19805 10123 12930 -8214 -5848 25065 43365 46443 11361 -9331
22029 -9331 -23354 -30311 -28190 -19931 -16103 -10525 21220 56167 23866 -4719 -21819 -41319 -44103
22016 -44103 -20923 -9975 5150 44050 64765 53481 40767 -16987 -53994 -41135 -25970 -41334
22004 -41334 -78141 -71986 -34984 10297 10533 7250 13066 24568 38166 52662 23594 -7819 -16196
21991 -16196 -19818 -13436 34826 22047 1868 3381 16162 24619 -180 -14678 12472 16574 -9275
21978 -9275 -33509 -55311 -38614 -10298 -9618 -42196 -25506 -3384 2464 -23258 -30602 -39989 -25692
21965 -25692 -15329 -28560 -15414 -26616 -26139 -15917 -12837 -6661 -7940 73 38764 36780 -24719
21952 -24719 -34294 -31145 -16884 -4022 1746 20631 11896 15164 20629 20466 7740 14921 43280
21939 43280 30909 8451 -10659 4621 29822 15160 29107 16490 -29796 -41899 -34809 -45295
21927 -45295 -14761 -23394 -66156 -49607 -31555 -39544 -17462 -25794 -21237 -14777 -11823 -15205 -11062
21914 -11062 -13907 -17397 -22301 -21414 -15515 -31924 -11734 18571 9051 22596 27415 10134 12817
21901 12817 1328 -23859 -17657 -48203 -38808 -32020 -23932 -23508 -36230 -25921 -24516 -31547 -17435
21888 -17435 -12245 11554 -4078 -4925 18996 54742 51809 66389 58939 44355 25361 21503 1717
21875 1717 -19526 -18666 -30651 -10565 16484 47959 17787 12353 13583 21000 13021 -7835 -29491
21862 -29491 -31983 -15342 -6749 -9742 4995 -7975 -39994 -38404 -23332 5640 33018 11927
21850 11927 -13436 6282 5227 669 41709 78929 31311 -37274 -80700 -57175 -49803 -70305
21838 -70305 -50875 -55416 -43067 -36832 -23664 -657 -28446 -17786 -12500 19319 22993 15171 -9095
21825 -9095 -29602 -38023 -21733 -10611 -14898 6825 35377 10394 3547 -36899 -40223 -20731 -35431
21812 -35431 -26810 -22477 -4517 -21526 20569 36566 17318 -5208 18631 28095 15720 -28814
21800 -28814 -25274 -10444 -39509 -43083 -40445 -42758 -37358 -28321 -27929 -1447 345 -9333 -15585 8139
21786 8139 22913 34722 28788 20376 22115 15573 -23438 -21715 -24293 -22960 -11058 -27768 -34296
21773 -34296 -59828 -62558 -46011 -41380 -53039 -53408 -66012 -58183 -17704 2572 -8806 -32484 -32967
21760 -32967 -37619 -16739 -14934 -17160 -30252 -40742 -23790 -21129 -19173 -46574 -47114 8966 5135
21747 5135 -18424 4574 14274 -14484 -34560 -36993 -15237 5854 18428 13041 23276 22730 16540
21734 16540 5509 -46849 -41914 -10634 -2250 1064 -19716 -19659 -21544 -8575 -12244 -21532 -59539
21721 -59539 -61516 -77100 -74005 -52138 -31710 -28002 -1761 18141 34005 39616 10059 -15594
21709 -15594 -28106 -14241 -222 26029 33525 57002 40995 20053 4075 -9271 -8842 -18663
21697 -18663 9850 9865 -5771 -8447 -1974 11842 -18247 -2699 20598 21579 -10350 -46029 -61629
21684 -61629 -82254 -36419 7865 5770 7454 -21701 -21147 27725 30169 10087 12814 -582 -36799
21671 -36799 -31466 3313 18841 43538 45239 6425 -30914 -22697 -4231 -19871 -28508 -33276 -40500
21658 -40500 -44281 -33241 -33232 -18122 -13879 -19343 -12157 -897 -1107 -34077 -19654 10326 31233 12471
21644 12471 -6378 -31978 -25534 -355 3385 -23656 -68114 -54231 -12694 17396 6765 -53746
21632 -53746 -63664 -47981 -19994 -8904 1788 -22202 1963 4258 -26156 -13997 -1738 -23705
21620 -23705 -23505 -20265 -44702 -41151 -35743 -77645 -59079 -52237 -24256 -22806 -22575 17177 -8409
21607 -8409 -28782 -15787 -11335 -5356 9770 19776 29250 30835 39051 31699 16443 6383 -23878
21594 -23878 -45732 -61802 -43631 -27806 -24672 -24893 -25742 -5880 2000 -7689 -16831 -32049 -21337
21581 -21337 11134 14274 13033 52490 47941 31386 8987 9091 21248 22178 8353 6539 11492
21568 11492 17326 21705 17397 40538 46843 30774 16328 15647 -629 10503 21027 -727 -9649
21555 -9649 -28536 -35009 -18546 20723 38716 30193 41488 25095 38046 34247 47389 16352
21543 16352 -28744 -34918 -33336 -32434 -43323 -28867 -12609 -1620 -27094 -7683 -14415 -25685 2490
21530 2490 -15117 -32832 -35885 -12659 -25380 -36046 -29828 1175 -10169 -36616 -32747 -19316
21518 -19316 -3862 -21107 -32966 -6127 -4478 -15087 17491 24267 11138 -19969 -46686 -48962
21506 -48962 -43555 -36492 -8926 -27250 -33134 -20568 -11989 -10472 18757 31977 18288 15111 30915
21493 30915 43948 40226 37261 29476 8168 -6434 12159 -2381 14516 45450 73662 74395 85536
21480 85536 92133 80395 85684 62294 32092 43906 60160 26085 -9429 -25654 -15686 9971
21468 9971 24291 -19328 -12335 -14545 -26317 -30927 -48727 -25664 18727 19573 -229 25887 45116
21455 45116 31520 12045 -19760 -23768 -1534 19975 25194 23137 -7411 1534 -18069 -64269
21443 -64269 -75758 -62721 -47195 -27139 11310 6341 9759 -2133 -14102 -26951 -9816 10979
21431 10979 -19465 -29660 -53223 -39811 -44670 -37150 -24954 -59692 -73053 -44119 -20701 -25374
21419 -25374 -15051 -19995 -9915 2284 -15162 -45630 -14279 -5456 -13410 -245 -20665 -12189
21407 -12189 -25031 -21312 -52585 -80905 -75993 -48455 -16763 -32105 -50069 -53925 -30555 -11559
21395 -11559 -39237 -37330 -19958 -29164 -37682 -52087 -66343 -89017 -87350 -63954 -55727 -31043 -59423
21382 -59423 -61900 -55674 -37315 -22144 -5807 -18317 -8705 6031 -25405 -26564 -10561 9185
21370 9185 9563 -16915 -66806 -47358 9915 3282 -13755 5267 27919 30001 29130 15060 -821
21357 -821 22785 12575 -5770 6048 -15924 -27677 -48305 -41345 -54478 -66636 -53777 3863
21345 3863 30350 12336 -22829 -52670 -5573 -2196 -38793 -10236 1423 -10164 -3779 -3848 -3438
21332 -3438 18034 6465 2190 22090 14285 3937 8108 1732 -7185 -9931 -12426 926 3102
21319 3102 14370 -3100 9400 28018 23826 8260 20934 22747 4579 -3642 -17583 -25449 6873
21306 6873 24495 33131 38480 22485 40285 11225 3980 7403 14106 15046 -3784 -15901 -27738
21293 -27738 -4214 7835 -6923 -14644 -4155 -1079 -15995 3937 6604 4643 711 1923 -8062
21280 -8062 16698 3750 -188 15964 -14048 -8557 -12271 -21250 -17205 -11846 8328 11451 -6097
21267 -6097 -20007 -25529 -8419 -15083 -10125 -29704 -48900 -61816 -59930 -49682 -12381 38403 36773
21254 36773 5934 209 2289 18223 47790 53945 9760 29236 51362 10364 7323 47567
21242 47567 55927 48373 40811 28682 -9053 -20705 -396 27900 36620 40688 31491 16026 16020 -15595
21228 -15595 -21533 -6479 19694 7022 -6773 -10114 -7339 -17675 -48049 -42824 -23391 -9955
21216 -9955 -29818 -66110 -59964 -27215 -47554 -58081 -59854 -55798 -24604 -12882 14888 48343
21204 48343 5634 -42615 -53750 -59875 -54527 -63978 -36037 9275 5102 3512 12860 -6412 -41908
21191 -41908 -46536 -24293 -7906 -6358 10679 11658 6920 -18431 -25657 -30217 -7835 4751 7691
21178 7691 6525 26569 21499 361 1271 -6471 -48886 -63319 -41401 -19287 -17240 -9574 15698
21165 15698 -2936 -3878 -330 707 -39723 -69239 -67479 -26348 -21508 -1464 2929 8945 -3501
21152 -3501 -18171 -2908 23527 28909 34835 10678 -8581 -9491 -14624 -21656 -40720 -51190 -59736
21139 -59736 -63796 -59892 -39909 3682 30511 -6246 -13508 -17188 -36910 -7076 26225 47200
21127 47200 20218 -20647 4181 23565 17943 5542 6770 25818 -2686 466 -17299 -23147
21115 -23147 -11686 44890 48251 15416 -5771 16499 9138 2645 -2125 22410 25931 19185 27483
21102 27483 21175 -4964 -16425 -23135 -14375 -41343 -77149 -84436 -47068 -27317 -32826 -37412 -6935
21089 -6935 4702 16621 7633 -23986 -20854 -10484 -23511 -63485 -88678 -52885 -2483 2266
21077 2266 -17514 -12889 597 -27910 -39196 -15445 20636 9444 -17106 -35566 -58105 -53814
21065 -53814 -29432 -815 6536 24911 6979 -8432 -18891 -9800 -22332 -36512 -53822 -40925
21053 -40925 -11247 35541 15702 -27288 -35924 -24602 -18870 844 16799 13694 -16605 -19822
21041 -19822 -35513 -40528 -43993 -49562 -35913 4031 21550 42722 8371 -28769 -20104 -31911
21029 -31911 -81527 -66808 -28154 -15490 -12690 -22079 -42726 -42074 -27263 -30991 -18513 -43258 -17716
21016 -17716 -17796 -31682 -30709 -39259 -39811 -52440 -61327 -59554 -21700 -10423 -21804 -39342 -52234 -68649
21002 -68649 -60492 -42376 -21884 -6539 14120 26480 9708 -21252 -6197 9470 22907 4079
20990 4079 -2838 48351 45700 20627 1910 5807 -7848 -22484 -2157 13073 -4681 15544
20978 15544 5728 -5665 -4907 -15851 7768 -8745 -11760 -9959 -10158 -639 9154 14188 13954 33990
20964 33990 20397 12949 276 -10990 -8480 -32084 -40805 -26192 -24146 -13811 -26440 -36568
20952 -36568 -39854 -31105 -29251 -15558 -30734 -33778 -10758 -3139 -30238 -29302 -27554 -27647 -41250 -25902
20938 -25902 -30428 -29419 -25664 -8078 4308 -15767 -17400 -26537 -33720 -15240 27729 24892 17105
20925 17105 20901 -14584 -33306 -19535 -14179 15959 20827 15146 2596 -21995 -19100 13059 32620
20912 32620 42627 15460 -287 -1459 12444 15709 -24281 -28029 -27667 -26378 -14146 -14941 -16524
20899 -16524 9308 40893 16018 -5036 21025 38184 32368 56799 63441 42607 41657 20700
20887 20700 -18424 -19300 14966 39712 40639 17954 -3378 -11945 -18778 -17663 -615 -6656 -4925
20874 -4925 13509 -2890 13055 40413 33427 -27560 -44927 -29932 -20160 -13802 -14122 -46433 -34589
20861 -34589 -46963 -53857 -56485 -50692 -31130 2443 18766 -17832 -2250 17487 9458 -12074
20849 -12074 -19725 -10150 10764 55771 21017 -424 30352 20107 -11922 -27187 -14708 -10428
20837 -10428 -37377 -33377 -4612 13308 19239 15687 -8670 4924 46760 42126 46955 52037 32649
20824 32649 -288 -2100 -8461 -4337 23529 74126 111647 103456 97599 103589 82973 46081 45306
20811 45306 41617 53981 53751 58629 58247 67241 41879 60721 39035 25601 37283 7906 2993
20798 2993 28727 36315 6127 -13749 -2329 23450 8842 -5459 -11944 -48375 -50434 -37545
20786 -37545 -26434 4299 17523 6832 -6567 -32364 -26745 -30765 -35080 -62238 -49973 -31390
20774 -31390 -34247 -81643 -91868 -102311 -75480 -45574 -24972 -28028 -39575 4918 49606 74188
20762 74188 45180 787 -34784 -16716 -22906 -44584 -30944 -10631 -22437 -59888 -69099 -45845
20750 -45845 -26037 -19519 -20834 16526 37055 60143 66465 52622 25097 46048 44747 27696
20738 27696 30030 38330 7679 13766 25315 12848 -20705 -28574 -23084 -8233 -19751 -59809 -99105
20725 -99105 -81431 -50707 -55851 -39001 -5574 5559 1962 -7791 -5657 4145 -1277 25494 33384
20712 33384 -12538 -21686 -32096 -54803 -69197 -37899 -13849 -13604 -10397 -881 -9940 -4135 6709
20699 6709 5381 7402 7726 14734 16508 19405 -6484 -24298 -30346 -24642 5227 25057 860 -6729
20685 -6729 -8630 1989 29943 18831 5816 -14821 -37033 -27420 -80934 -74738 -14561 2318
20673 2318 -29435 -17961 21446 30676 27124 31534 30787 28010 12013 -32176 -56329 -64763 -38114
20660 -38114 27863 31477 14211 5236 1042 27760 72934 82476 69200 47330 55441 30032 4947
20647 4947 24070 28701 31046 20449 39616 12930 -18351 -28060 -12502 -18687 8900 12030 -3853
20634 -3853 -26893 11 4606 -4237 14078 16004 26069 14701 10090 23215 14084 -19860 -19024
20621 -19024 -14578 -2003 24016 26677 35274 100 8250 12095 -26755 -56866 -63139 -43557 -11443
20608 -11443 -5787 -364 -12497 -29811 -27021 -28585 -22217 -30150 -17504 -6942 -33538 -25632 -3823
20595 -3823 9986 38550 49888 23678 -23755 -52785 -36986 -35153 -44248 -42595 -46114 -35797 -45317
20582 -45317 -74224 -53407 -58355 -40282 -43868 -39686 -31324 -24810 -30291 -42368 -35774 -34226 -22385
20569 -22385 -10 3615 -3783 16884 15690 8140 -7869 2915 17931 521 -13385 -4302 14756
20556 14756 377 -21906 -51361 -46370 -25237 11209 9005 31599 51886 39408 12726 9656
20544 9656 607 -19446 -46332 -31155 -27015 -12583 -5529 -13855 -54907 -89816 -68867 -56628 -40932
20531 -40932 -41272 -64132 -77647 -54926 -31200 -16583 -9327 -19705 -31907 -52375 -79548 -56917
20519 -56917 -49503 -62312 -47889 -28178 -32156 -27135 -5521 -14324 -11064 9979 -16646 -2124 -12932
20506 -12932 -1033 -18134 -31319 -12684 -17204 2780 3857 19826 47077 54000 28956 -8406
20494 -8406 -21409 -35026 -52899 -21149 -6578 -41203 -23004 -32175 -12862 -7893 4278 24430
20482 24430 -9934 -22251 -46234 -32588 -40701 -54086 -42339 -35194 -32523 -14560 32915 21346
20470 21346 -8303 -12656 -19289 -12863 -10946 -4691 -27844 -59238 -36108 -34429 -38897 -40275 -37361
20457 -37361 -26697 -20149 -10717 3744 15061 -4432 -14420 -26430 -58166 -48137 -26374 -16417
20445 -16417 -42630 -64518 -69042 -34493 16671 60970 69621 47215 69789 46112 -3838 -45808
20433 -45808 -49402 -27860 -3020 -1768 -28593 -36372 3201 28663 23266 -7239 -34530 -36190 -44887
20420 -44887 -31971 -19190 -38775 -17740 2085 8558 -53277 -54763 -23423 -44396 -47591 -20243
20408 -20243 -25235 -25490 -33243 -24577 35945 37118 13697 -11689 -27970 -17606 1626 5585 -5374
20395 -5374 -33636 -48939 -53568 -34381 -10479 8078 -7239 -36345 -36197 -29002 -8229 -13486 477
20382 477 11257 -15304 -15744 -15729 -26545 6343 13637 24495 38532 4519 -12200 -29360 -40727
20369 -40727 -35126 -4594 22488 -6382 -12819 3921 22545 2303 -1408 -911 -1677 6873 -15610
20356 -15610 4605 5340 6925 -4418 -29247 -42276 -45440 -64048 -71139 -61063 -51059 -23697 -1784
20343 -1784 -15906 -27976 -7114 -8796 -26291 -28097 -24348 -25984 -24715 -31275 -33800 -20191 -6215
20330 -6215 105 -6945 3562 12527 -9666 -45436 -33466 -8313 -6798 -20468 404 3187 19599
20317 19599 31132 -18347 -28375 5514 16816 -21936 -16555 2567 35310 35722 40254 41176 19956
20304 19956 -2500 24519 -4563 -47392 -73981 -72605 -15615 32292 3282 -35622 -33381 -13013
20292 -13013 -48254 -63367 -58013 -58900 -45676 -36868 -26153 -33125 -13949 101 -25657 -38335 -20419
20279 -20419 14630 402 -29126 -14892 -22279 -10681 20977 22688 34918 49516 44680 12930
20267 12930 25463 15879 -1158 -31299 -18319 18406 34923 -703 -21565 -18995 -10862 2268
20255 2268 -13597 -26098 9126 55519 31393 21553 192 -24889 13683 52494 21399 -18993
20243 -18993 -48682 -27740 -19374 -26113 -27433 -24867 -10969 4893 7608 -1813 -8510 4455 21131
20230 21131 16908 -22268 -34074 -39970 -24541 -10547 -10285 -2431 7653 8796 3391 5838 15386
20217 15386 34445 10753 -13217 -19179 -22743 -32542 -524 10304 -3216 -1016 14593 -14405
20205 -14405 -38531 -41964 -43297 -54239 -47501 -15650 -11171 -11619 -3121 -13657 -7543 -16021 -12953 -25761
20191 -25761 -36926 -37661 -28949 -2262 -9839 -41578 -41815 -7388 12084 471 -2737 11442 -2982
20178 -2982 -6747 -1553 -3886 -9011 -24725 4583 16752 13579 20683 28215 59371 31625 -9101
20165 -9101 -19259 -27642 -19425 -34098 -50152 -44691 -51849 -51477 -62605 -61698 -46275 -58322 -54688 -20472
20151 -20472 -13618 -15526 -39045 -34312 -12780 34246 48224 21549 10721 -26832 -69707 -67939
20139 -67939 -40992 -179 34646 21892 -8141 -6989 6824 6209 284 -7968 -11835 -3132 9294
20126 9294 46805 30262 -5309 -8816 -11449 -13780 13566 30368 18469 -15470 -33335 -10981
20114 -10981 -20363 -236 17990 8842 1160 -28483 -38829 489 22064 55972 113419 88898
20102 88898 31764 -11954 -22689 -21800 19409 5437 -21100 -32063 -17303 1916 -23658 -26222
20090 -26222 2555 31075 20647 10621 53747 78998 54490 19724 -21033 -49935 -37658 -30753
20078 -30753 -14152 16290 22788 18779 4620 7991 -27614 -50148 -45563 -59019 -65361 -38622 -16509
20065 -16509 -41285 -48310 -36551 -26798 -2012 -13976 -24235 -33764 -17363 -15202 -24179 -6667 -5402
20052 -5402 -2642 -13823 -9243 -23650 -27335 -6806 9964 40273 -6087 -57666 -59317 -46245 -15272
20039 -15272 -35173 -58671 -43950 -26557 -17625 6787 51379 13459 -25123 -32589 -1179 -8117
20027 -8117 -8477 -20181 -66002 -66451 -30497 -1697 4349 5848 -23964 -34135 -54025 -50733 -29981
20014 -29981 -9323 -9998 3192 19026 39184 49268 63687 51759 24128 8741 -12272 -55646
20002 -55646 -67664 11789 21786 -18576 -36334 -59251 -53700 -79998 -25037 880 6566 17294
19990 17294 11298 17609 -11286 6747 23225 19149 7924 -20569 -14696 -1926 36825 88370
19978 88370 86993 71962 97887 84568 90904 102669 102787 128713 163818 183720 200715 198505 170999
19965 170999 147897 139652 162600 148655 103088 53636 49629 81225 86078 74413 50659 36222
19953 36222 11113 -8422 11557 10839 4737 6678 -15150 12638 12211 -32837 -36139 2254 -20468
19940 -20468 -36867 -36505 13260 55319 64065 47362 26098 3393 21307 26070 59967 64510 91249
19927 91249 56755 26418 58794 81879 93017 105848 155572 158492 144969 137085 166286 158695
19915 158695 128526 131549 114148 158049 164458 122333 80893 41678 41846 40447 36774 32634 44988
19902 44988 33496 19584 -19892 -68698 -84405 -45871 -36983 -35020 -54957 -59595 -26689 -2782
19890 -2782 3711 7632 41088 35317 34311 33171 32700 10545 -18741 -11461 20089 28296 44656 36429
19876 36429 -20737 5065 55097 62156 60242 25593 -7116 -8899 -9039 -10017 -39253 -59127 -68120
19863 -68120 -51470 -28076 -2679 35541 8385 -30755 -19756 -3394 15029 13701 19257 -6831
19851 -6831 -57892 -36488 -33965 -66353 -36682 5992 34825 46138 55159 47565 33610 44405
19839 44405 53660 38814 13061 -4957 -42766 -32207 -5916 -8926 -30244 292 13111 8417
19827 8417 -9194 -12270 -10744 -2949 14185 -5782 -21692 14171 7712 -36805 -33725 -39704 -43438
19814 -43438 -36875 -31834 -32611 -18613 14303 31412 33325 14365 30748 17111 30172 21135 12566
19801 12566 4462 13026 16408 34913 16349 22832 -2522 -7462 18342 44801 71138 65291 61296
19788 61296 31917 -19675 -25617 -19049 -482 4286 12034 33662 39421 43298 22540 7803 -1846
19775 -1846 5233 -13322 -31036 -51063 -73119 -59085 -20925 13686 41244 41026 56570 35749
19763 35749 7003 -9134 -4055 13927 15818 47785 37115 13172 -26509 -24045 -27757 -52179
19751 -52179 -48155 -14544 173 13050 45004 22552 45573 70455 49207 24749 5820 -3287
19739 -3287 28092 25204 36525 57107 39531 33322 31212 40946 56216 38695 27501 43043 59534
19726 59534 50013 35941 16219 5645 -7876 -12822 -7429 20235 -3870 -9812 -12676 -10772 -6514
19713 -6514 5822 33324 37677 22359 -6597 -5510 11696 1373 2156 34572 41578 30165 36614
19700 36614 33048 51859 50440 52037 31473 4702 7156 4612 7087 -2824 -8308 8199 19786
19687 19786 -19913 -35629 -35500 -36658 -25238 -65 -9494 -772 399 32440 50151 48323 22471
19674 22471 -22865 -49582 -44793 -13666 20625 62898 66976 35957 20533 10021 -11977 -11760
19662 -11760 -13339 5319 32338 20803 26224 19953 20582 32932 36005 18576 -16952 -14992 34067
19649 34067 32308 20975 29117 24524 -7414 -14310 15399 11823 34958 11051 18525 19800 3460
19636 3460 -21853 -27959 3333 52351 55011 37075 27951 4202 3463 23771 22607 6334 -13974
19623 -13974 -2139 2302 10789 38540 43223 3534 -44173 -13518 21204 14307 34323 36163 5498
19610 5498 -5611 -44682 -58956 -52380 -53046 -26836 1744 1194 5160 42246 63031 37264 16471
19597 16471 -9998 -2658 -22847 -55231 -63565 -13742 20950 37334 24240 -10456 -1840 21358
19585 21358 26316 52452 84160 98807 58347 65716 60010 24024 6817 41340 49759 25545
19573 25545 7932 31153 41934 42877 37418 50066 46958 41559 9718 26474 38584 43791 74149
19560 74149 74896 57091 34325 18660 35226 38128 18662 43501 44348 44945 32554 24960 39357
19547 39357 31017 28837 29433 10404 17606 -1185 -7342 37580 55652 48541 53694 67391 40737
19534 40737 18382 35230 50468 55347 66440 56184 45262 34602 60449 53617 84155 114294
19522 114294 116119 99663 111189 116600 102106 84053 71286 71231 79971 87871 91366 119431 135471
19509 135471 129423 134856 125430 131886 131788 124101 140805 155097 196349 203492 191807 189169 180016 158615
19495 158615 157330 151437 161659 180267 164700 125430 145074 184914 200199 206478 207016 263169
19483 263169 313769 330507 351568 402813 464843 519966 606508 712370 806762 881330 934227
19472 934227 997823 1122060 1260305 1399599 1453056 1499843 1552891 1599467 1742908 1937607
19462 1937607 2148629 2430645 2854952 3483905 4346427 5662578 7798649 11268707 16228819
19453 16228819 21402467 24582693 25374084 25165836 26605023 31410202 38468014 44173993
19445 44173993 44925447 40452013 33862832 28766513 27379849 28460002 28474507 25568038
19437 25568038 20331554 14762428 10579935 7781490 5961575 4739053 3884789 3281099
19429 3281099 2890293 2594015 2377398 2258538 2208537 2178118 2186915 2229383 2235261 2249090 2279277
19418 2279277 2313099 2362595 2397856 2426125 2425867 2447480 2504968 2663695 2910666 3257296 3721192
19407 3721192 4389313 5385383 6941097 9509586 13773710 19844588 25670804 28693467
19399 28693467 29034560 28791403 31314584 37797717 45223828 49265984 47532404 41345222
19391 41345222 34592183 30432590 29822061 30550192 29281793 25183178 19357812 13938476
19383 13938476 10053853 7440150 5683779 4503312 3666027 3037784 2612609 2280137 2015267
19374 2015267 1806114 1649725 1562563 1466993 1369843 1318442 1215019 1123156 1059961 1016639 942180
19363 942180 894091 819794 744615 689024 620918 545083 500902 488996 492511 484928 461578 441493
19351 441493 389245 334003 305268 295324 301468 269650 237704 214802 205294 230943 231362 222879 198700
19338 198700 177673 140983 163194 184006 209111 181006 146494 129141 152401 148841 111493 87053
19326 87053 83761 95530 113945 110140 96811 111000 118060 121085 120877 106919 97356 101627 89238
19313 89238 108702 135613 134472 141695 136758 112353 108429 92095 96445 85531 74492 81847 88955
19300 88955 84605 85540 88941 101135 116775 83573 64366 80424 97746 112704 140145 127936
19288 127936 106250 96986 106573 85310 62958 63909 44245 60840 116090 104080 83408 83657 60169
19275 60169 46117 48094 52336 37137 29083 7695 29885 58910 58011 49357 44747 42784 53061
19262 53061 30525 8340 -11059 -29973 -1050 39805 35170 39733 42023 52709 63801 56437
19250 56437 24235 19870 70423 123410 85822 81185 76970 76214 81539 64712 59204 88635 106428
19237 106428 69209 39926 34270 23470 18825 22318 31483 38154 50942 21384 41530 70623
19225 70623 46395 39998 31889 21338 26791 44693 51157 47459 20250 -181 27661 35475 5214
19212 5214 1604 26908 36145 37820 24859 28336 60255 59702 26749 31297 32998 25259 20330 24885
19198 24885 50845 78663 70416 69113 75516 76134 74606 115011 105589 65325 51107 56084 61362
19185 61362 76774 70448 56872 53787 50824 40925 33440 48348 66895 60582 58201 44722 41103
19172 41103 36871 19416 24072 34636 23163 40575 51846 44495 21850 10279 15523 24844 37315
19159 37315 36211 92366 70724 28730 20497 33781 21160 41530 52858 46853 30049 57510
19147 57510 79982 75241 70460 61833 51991 75730 79390 74172 47014 76832 65867 33554 53624
19134 53624 109176 107014 91164 81442 62037 57533 60429 63004 65471 53627 39883 89739 122346
19121 122346 79476 36266 19926 58939 74297 66410 62641 17898 -17852 -62562 -45765 -30172
19109 -30172 -45001 -76574 -79933 -49237 -61799 -38578 24879 49843 37591 20351 5525 45920
19097 45920 59012 28107 19085 17054 50301 70803 71293 22452 19469 15126 57764 71404 50163
19084 50163 53355 40371 27987 6484 8021 6111 38677 40849 30924 54873 66230 25754 27302
19071 27302 40686 69647 89982 116759 96692 71390 40565 49014 49798 29730 39278 30238 -5398
19058 -5398 24251 82476 83459 60728 51826 56621 56069 60628 86237 98862 110359 99730 95573
19045 95573 112390 98359 40144 66114 133118 147083 116560 109963 100311 115797 115741 122255 94702
19032 94702 58703 59691 39762 47593 74031 91538 92792 121525 130250 108701 105378 127567 124823
19019 124823 108381 85069 115462 137740 149099 140131 138720 123040 109007 133307 182286 178567
19007 178567 188173 180965 145249 134810 140388 126915 127034 140769 150907 155573 156732 185713 207412
18994 207412 224271 225975 230843 253168 285638 286247 305823 315879 332712 370244 394633 426248
18982 426248 439414 468702 510768 497705 479850 522554 538233 584899 642817 693290 754788
18971 754788 832521 902992 979983 1044077 1139166 1236167 1312130 1446165 1633526 1888611 2209777
18960 2209777 2533736 2980510 3704297 4870754 6714995 9643734 13941614 18952421 22876794
18951 22876794 24934566 26074694 28536104 34249021 41476528 45162048 43267099 37521402
18943 37521402 31969614 29320806 28494321 26742082 22998716 17895126 13099522 9565119
18935 9565119 7189184 5606772 4590473 3901370 3408353 3023225 2697795 2424870 2266869
18926 2266869 2195051 2090384 2008435 1978550 1945864 1904712 1873229 1888384 1899831 1940192 1975383
18915 1975383 2018332 2098921 2149682 2216595 2309447 2419055 2645167 2925196 3263103 3734058
18905 3734058 4428078 5446353 7070415 9738024 14046399 20268544 26948748 31302683
18897 31302683 32867753 33550927 36862223 44686188 53643583 57109634 53480311 45564324
18889 45564324 38665623 35488880 34209869 31685287 26908574 20796910 15163783 10989498
18881 10989498 8113849 6223232 5017571 4188944 3596005 3119304 2718545 2421265 2207342
18872 2207342 2034177 1890088 1781919 1645868 1525577 1400552 1257675 1160305 1101993 1049901
18862 1049901 970339 842275 766499 725955 690478 635647 594814 569576 554002 535758 497592
18851 497592 439054 397480 391379 354214 332008 350864 338456 283245 259100 229864 242793 255346
18839 255346 240815 219766 239207 270820 247058 204300 167492 164555 151876 176873 187392 180136
18827 180136 175064 152271 193587 238529 243388 226252 190537 181940 180249 138097 97847 105065
18815 105065 110167 127457 113517 73052 69301 135285 134159 103500 81971 97311 109000 104377
18803 104377 107228 90019 115731 105712 118887 120266 106867 109572 84289 58074 53584 54891
18791 54891 50573 63968 76342 78581 84813 104409 117462 141469 144956 146630 113958 76325 100490
18778 100490 106148 76889 61957 74968 97319 119555 127344 93224 87268 112779 147972 153599
18766 153599 171003 187763 217955 218061 173701 172798 182573 184238 193528 152071 115253 103631 112825
18753 112825 115143 108457 102026 94708 104066 82810 79818 129437 147759 114285 104189 113211 130129
18740 130129 115924 144389 151965 148083 129518 121722 131562 123634 116161 97919 129626 171001 222029
18727 222029 256455 233144 211246 216991 229658 241307 239731 267921 268854 269527 243909 225830 216416
18714 216416 179285 193989 209714 193144 179790 176581 157817 161105 138873 133791 155478 155961
18702 155961 112525 113862 127529 110545 94709 95006 85385 82308 82613 82668 91307 96095 108764 123335
18688 123335 86496 71841 65357 97949 118274 141108 170556 161611 162185 150264 183918 222640
18676 222640 238135 254135 238141 239037 244710 244877 224559 227256 187282 139602 124328 116073 117078
18663 117078 126862 99240 70107 34076 24246 61321 79136 66995 88330 74702 72679 90985
18651 90985 118364 93832 77491 81937 96625 92121 65010 70481 58571 56873 31751 21216
18639 21216 26496 1968 14912 56358 105283 90118 79950 69176 84590 110337 96601 98893
18627 98893 90499 91466 104288 73331 32292 37931 35294 35330 35998 30285 35144 64458 63585 45325
18613 45325 25188 1458 24431 65685 63349 38414 18252 50682 54013 29419 46014 77671
18601 77671 64274 35483 57186 94465 110793 96703 105043 131223 90772 72313 94822 79210
18589 79210 86109 123882 122894 119304 136687 148531 149169 136540 133639 109600 93226 113867 107592
18576 107592 109107 122298 117877 99205 93777 95414 94578 143302 141246 130102 149383 156825 166950
18563 166950 162884 185734 208631 234699 307895 343426 350142 358658 388259 436002 484621 537272
18551 537272 588211 591686 569225 559044 539333 565018 619663 680036 748200 791424 810669 878912
18539 878912 1021991 1187601 1380472 1615833 1974752 2480070 3259553 4481687 6439233
18530 6439233 9599961 14239611 19135049 21775504 21252614 18618998 16133213 15649335
18522 15649335 17729793 21532473 23944500 22937503 18964965 13937973 9872167 7103281
18514 7103281 5307370 4164234 3412958 2891394 2529456 2282940 2109950 1977816 1880110
18505 1880110 1821951 1774465 1745970 1735248 1748046 1779608 1838859 1912039 2026141 2160528 2342618
18494 2342618 2577065 2846829 3219659 3778385 4636377 5970206 8036588 11403625 16772047
18485 16772047 23977965 29914425 31609551 29375392 25487755 23180913 24087584 28123748
18477 28123748 33229266 36463187 36890192 34513724 30175210 25161106 20362795 17047249
18469 17047249 15931506 17007378 19207054 20119448 18546045 15040417 11125597 8118892
18461 8118892 6088489 4754200 3913482 3341988 2921109 2606008 2400240 2251755 2123523
18452 2123523 2022410 1957741 1858614 1767445 1747824 1726539 1739873 1754170 1772092 1788850 1868046
18441 1868046 1951626 2099888 2379112 2765972 3288963 4061000 5242291 7090270 10251464
18432 10251464 15213508 21292054 25407075 25585471 22575920 18843704 16955581 17804260
18424 17804260 21011318 24175892 24329750 21187554 16105899 11430191 8066915 5837646
18416 5837646 4388699 3450486 2812017 2327424 1996991 1760058 1602646 1452028 1348278
18407 1348278 1277112 1215595 1128738 1060134 1031425 983911 896384 862520 853774 821444 760923
18396 760923 680483 641400 613922 624123 663167 613078 535305 496947 443838 419175 426222 414645
18384 414645 373365 327951 321404 325595 298699 267176 243910 274686 305026 302177 270850 258575
18372 258575 261047 270442 276208 280466 272869 234935 230769 241906 244512 265042 232123 213108 219543
18359 219543 236379 243997 250681 240339 231037 223543 228691 236441 236483 260556 271132 282879 255768
18346 255768 234029 217820 207383 205904 213631 210401 200449 178100 169859 191477 217981 227025 238284
18333 238284 249962 231790 186111 167323 158142 155844 197231 222140 191515 162446 197595 206965
18321 206965 181636 181087 215278 216535 230533 252119 263475 246984 200485 177256 172557 197171
18309 197171 228672 225551 196383 175959 171305 192033 218561 222704 216185 249168 286885 303993
18297 303993 287291 299433 325058 372466 414150 493440 557695 610966 628983 671884 705313
18286 705313 757313 795862 792652 802582 847036 865413 885925 917051 965052 1059317 1156429 1287689
18274 1287689 1432410 1631542 1913732 2248274 2751626 3495153 4606537 6284971 8944651
18265 8944651 13163910 19287210 25585736 29085190 29064429 27078565 26131751 27964589 30739456
18256 30739456 30858674 27382803 21407661 15491167 11064201 8070770 6101093 4842881
18248 4842881 3951162 3304373 2828377 2471007 2190301 2035370 1928848 1879700 1891060 1894064
18238 1894064 1920639 1931836 1960159 2005515 2076004 2146915 2196730 2258600 2365131 2539491 2716195
18227 2716195 2952791 3312380 3903167 4875803 6373432 8869266 12859420 18193373 22724529
18218 22724529 24504841 24001258 23130843 24492558 28687862 34107593 38807876 40848105
18210 40848105 39004855 34859255 30598701 28818479 30165081 31698432 30122791 25346214
18202 25346214 19040229 13631347 9890180 7454304 5831139 4715392 3912079 3315225
18194 3315225 2853564 2552191 2338625 2207502 2081224 1997843 1896752 1822546 1786712 1749588
18184 1749588 1684865 1633353 1580225 1586870 1641692 1724721 1821528 1953268 2130471 2354918 2704106
18173 2704106 3274099 4163272 5686790 8163820 12064774 16843812 20153745 20717699 19293280
18164 19293280 17899334 18375818 20165955 20727436 18808675 14982925 10867422 7696974
18156 7696974 5557264 4169590 3233041 2570533 2046663 1686183 1443107 1259477 1130437
18147 1130437 1006884 911611 847659 793602 734737 681592 624301 550373 560147 606111 627042
18136 627042 605683 531526 485741 465918 442107 407886 376262 352810 364805 364068 321120 294851
18124 294851 272741 264240 237945 229288 209434 208780 221785 208027 203003 209263 224914 230677 219883
18111 219883 206892 219429 221131 198148 187496 209166 223565 211222 183639 196619 194789 169871
18099 169871 142506 123036 119318 115656 131784 140185 183457 167889 155868 162560 151139 128908
18087 128908 128530 91438 54330 75482 104389 135757 122873 63365 62589 127849 138617 132720
18075 132720 146068 171207 111687 100890 95784 98960 119576 124782 85723 51609 52011 70816
18063 70816 97767 116112 106750 81914 50974 59492 94462 112815 118211 135751 123242 90778
18051 90778 71282 84290 96479 86886 105115 78516 51815 51635 55040 67913 92323 93697 50973
18038 50973 24817 39925 48029 79668 107395 106599 99627 88711 79400 97056 103011 79638 49544
18025 49544 31460 42334 28898 41540 56410 112746 132771 121957 132475 140303 172141 194319
18013 194319 239912 281210 290869 261012 221136 190554 185524 161636 160093 150227 161357 164747
18001 164747 172916 136032 78577 70251 108739 124527 99114 81970 70831 51836 68567 50821
17989 50821 33953 41938 77644 94685 70659 36374 28853 25699 38682 43976 58401 60001 51719
17976 51719 67100 88070 97179 121529 176757 199103 186823 180231 144965 147815 169822 167575
17964 167575 183260 167450 162427 191717 218261 235135 234496 210841 189317 165327 132747 147418
17952 147418 126220 118229 107199 87397 75534 67675 52130 53845 48416 75083 66683 80098
17940 80098 116397 117913 88956 75509 55524 38597 50097 82955 79508 79651 71447 69101 68371
17927 68371 105447 92994 51468 57928 46100 51978 87393 89041 69035 72405 96958 124870
17915 124870 144073 142789 125592 118995 112104 93564 125049 131850 150597 139833 103761 77524
17903 77524 74404 75267 53750 49033 25543 12388 17785 22947 40579 57896 40905 -1298 -17266
17890 -17266 -752 28466 3300 10829 30452 9486 16194 18998 35738 13364 14960 49219
17878 49219 39783 -13544 -14736 -1301 22929 33164 49838 50847 40082 24354 -4528 -17828
17866 -17828 1759 15385 -8367 -33195 -22961 -26523 -42711 -38387 -15245 -4288 -25479 -38325
17854 -38325 -28569 -11050 -30056 -13546 -409 -21540 -35526 -50426 -37123 -27415 -34161 -7423
17842 -7423 -8875 -34250 -58971 -21191 9731 4505 4319 10992 -27669 -40985 -15220 -45755 -72784
17829 -72784 -34655 6794 14126 10298 -12634 18691 23357 29801 58278 35674 -6727 -8058 -3379
17816 -3379 15245 1759 -6109 12681 45505 16731 -26044 -27751 -14101 -5834 -16116 -7118 -2604
17803 -2604 18470 24532 -3023 -30600 -60607 -25348 8868 19845 -11159 -39562 -13077 -24015
17791 -24015 -3954 2772 13510 16643 34147 65132 44231 15356 1860 -21167 -51451 -58851
17779 -58851 -27441 -15230 1934 -747 -4684 11149 37070 38092 44151 54093 32041 25037 35609
17766 35609 19217 -6152 -21007 18615 42200 23050 33102 40305 58269 67397 62640 79529
17754 79529 81210 111248 155162 148096 126563 124025 116605 119218 156437 152368 127365 117358 148645
17741 148645 140425 103064 82930 76170 84854 79381 77918 52505 39385 60301 51478 -11156 21761
17728 21761 48532 19029 27141 38204 36806 26919 62941 27032 -5661 -53360 -41731 -12309
17716 -12309 28951 40709 45634 75682 92243 102340 130498 159431 168363 150028 126519 137449
17704 137449 156096 139295 192761 218762 213878 220034 213540 207885 170034 117556 81395 90675
17692 90675 111019 89233 73637 67245 33912 32925 31330 48099 68178 65779 76800 74335 73095
17679 73095 44519 34864 29393 39976 47288 54213 32723 5814 9734 12730 -15412 -33857 -11537
17666 -11537 -16037 -33037 6001 30886 33204 36959 67162 87296 95851 89978 111074 101988 96281
17653 96281 94039 73767 79289 78799 54490 62576 35638 -14493 -13761 -3901 302 14816 37546
17640 37546 43908 44158 45392 15855 9666 15667 4026 21782 40846 -57 -8355 -3196 12459
17627 12459 24963 33312 42177 56790 71745 74365 50528 47770 41125 18821 29250 22166 7179
17614 7179 6724 28268 17676 10669 38320 21897 -1233 52455 86510 42995 7049 -45900
17602 -45900 -98916 -107900 -103877 -72827 -29382 -18661 -20781 -24130 -22053 -28950 -50443 -52140 -9329
17589 -9329 10322 29262 28783 13675 -5665 -13982 -12136 -22080 -26661 3022 9705 20671 46120
17576 46120 35552 33015 2867 2195 -8611 16788 12840 47721 76325 88766 72522 57134
17564 57134 45023 31685 -12486 -52060 -22149 45203 89726 73118 64892 93487 111366 96953
17552 96953 33589 8024 17075 36175 -7870 -45358 -38559 -36521 1896 6018 -28893 -29856 -18652
17539 -18652 -11769 5137 23794 35985 31668 13701 5402 11704 -15297 -52811 -43207 -20314 -37534
17526 -37534 -10668 15454 8172 8224 9562 39677 34505 2362 9548 1484 -29147 -32726 -17969
17513 -17969 -76526 -33090 1867 25016 23691 20994 26822 36211 34519 553 -39143 -48239 -37510
17500 -37510 -13794 -9977 -2938 -2291 -18073 -20038 -14857 -505 14076 3724 21559 21893 34509
17487 34509 75814 88016 29218 6861 21544 70491 60356 3049 -38495 -41330 -22372 1304
17475 1304 27263 37497 11175 14639 19104 3785 12030 14813 4754 -30205 -10266 19779 35728
17462 35728 12419 16723 26232 22838 -2699 -4274 -671 -10010 -24175 -33346 -52229 -3232 40933
17449 40933 4171 -14757 31211 30796 34067 54351 77988 50858 16858 39117 43905 39151 4651
17436 4651 9151 56801 65470 28022 23576 30402 9023 9009 31240 45850 41369 16734 9422 -1699
17422 -1699 -3049 -17726 -28756 -43369 -40496 -7026 48894 55101 16997 317 -8656 6505 3342
17409 3342 2323 9651 10422 37494 51224 23743 21836 39769 60707 38559 17385 3988 4756
17396 4756 241 -19216 -49730 -54035 -32132 -8671 -26083 -47905 -35830 -4660 33574 23369
17384 23369 4817 17418 43761 46836 45309 30592 20925 62423 70308 29748 4159 -28182
17372 -28182 -29115 1167 26861 26684 10558 -8414 -2161 -13502 -26718 17140 22516 18575 2553
17359 2553 -2005 14252 42818 41880 22324 24867 28385 8971 7786 10457 22086 14509 2681
17346 2681 4022 20064 10839 8259 26265 35880 26294 30845 24357 -2073 -14502 -23841 -3950
17333 -3950 26690 36993 25135 23964 6568 13939 1358 25323 45233 49997 34665 -17272
17321 -17272 -36143 9592 37227 38196 46947 33196 37518 26877 1860 -18912 28143 -11117
17309 -11117 -28084 -36458 -40756 -21887 -25812 -49436 -25723 -37849 -28936 -2049 19156 -15553
17297 -15553 -29315 4779 1677 -20223 -8279 14464 10746 -24232 -63776 -43391 -20824 -24622
17285 -24622 -24805 -22608 -1720 9659 37901 48635 25005 15225 7640 16445 -5831 -19868 -26418
17272 -26418 -22224 -43828 -42481 -43553 -17866 12306 28550 41976 22682 7638 17653 45137
17260 45137 67662 25059 -16058 -34903 -43581 -18612 4529 1580 -11228 -5724 -17001 7379
17248 7379 26669 9924 -23143 -44306 -18823 -41017 -61938 -81431 -41137 -24289 -50824 -75437
17236 -75437 -72515 -52738 -45535 -48317 -62138 -34545 -10702 -25164 -28610 -50526 13430 17201 22366
17223 22366 7252 -2315 -41777 -58716 -42976 -40829 -32518 -11591 -144 -6975 -13883 -21021 -11528
17210 -11528 -32748 -24890 -8436 -25433 -14974 -13913 -26960 -17459 15573 42440 54707 -299
17198 -299 -17226 -1955 8413 11168 -13161 6499 39285 21830 2471 22573 9674 -10234
17186 -10234 17249 26186 25271 27970 8448 -12286 19279 34900 -1156 -20980 -10168 12883
17174 12883 56140 45809 19297 16501 25276 12690 -19597 -19934 -29147 -36608 -28363 -13567 -1751
17161 -1751 3178 24554 11110 -1728 -13289 -20383 -9837 1951 -16467 -14043 -20541 -39185 -67477
17148 -67477 -96180 -70785 -57217 -44113 -38421 -4902 28102 36543 55667 62734 29714 32485
17136 32485 36298 31722 22118 -2726 6704 -9090 -22378 -25768 4711 20999 -14422 -33769 -23356
17123 -23356 -20433 -22331 -52928 -77490 -65076 -15710 -34650 -23878 -15466 -18898 -32256 -56324
17111 -56324 -33656 -14792 -32984 -39255 -20293 285 -5896 -3774 28 7769 22741 47715 32286
17098 32286 22373 39070 50817 25657 -2970 -25101 -47051 -52306 -25113 6348 -19153 -17223
17086 -17223 -17866 -3569 -1581 -25649 -30698 -1747 23641 14350 -25671 -9170 12987 7269 -37458
17073 -37458 -35289 -13403 160 11371 5245 8014 31789 43411 46633 22842 -752 3259 45507
17060 45507 26373 18643 -3214 -22661 -26046 -37250 -29003 -13772 -9250 -1460 -5100 -24050 -13196
17047 -13196 33518 31713 -4110 -4957 -15367 -26147 -29074 -40313 -13860 -13794 -1963 16179 15515
17034 15515 29909 27682 30974 51197 37191 -6302 -12152 21537 12383 10226 -5352 6535 13079
17021 13079 -2499 2608 26697 25846 21952 -42557 -83666 -65427 -21508 11504 9975 27592 20300
17008 20300 31079 42081 57823 21741 3903 15392 40393 26393 -978 -14698 -14160 1511
16996 1511 -13406 20418 23733 7953 9133 32392 17357 -34635 -24231 -21891 -60736 -54277 -42571
16983 -42571 -51242 -72406 -41232 -14062 -6786 16624 8777 -16401 -12244 1681 5972 47524 62220
16970 62220 31476 44927 58424 41440 19146 21473 13319 -30391 -56375 -40505 -27039 -22654
16958 -22654 -19494 367 10038 -22082 -21380 -31802 -45617 -25120 -16145 -18867 -36425 -42050 -32899
16945 -32899 -10627 -123 18786 16001 3969 -5600 -13447 -17839 -22190 -23169 -20957 -37603 -12801
16932 -12801 16414 11850 12417 9821 -936 -34729 -44983 -42527 -37215 -41154 -42468 -29809 3367
16919 3367 30672 11950 2344 21093 26960 1076 -7 -2093 -8076 -18209 -37622 -53736 -44550
16906 -44550 -39517 -2125 12073 17524 42477 65302 50454 21627 15709 -23977 6672 2112
16894 2112 4407 -27778 -29045 -24852 -18454 -4529 10907 1250 -2212 2522 -20057 -39024 -7040
16881 -7040 8866 -13499 -206 4174 -3308 -8042 -16403 -22975 -43432 -40157 -49497 -67282 -52546
16868 -52546 -44672 -8506 33834 23416 9557 14333 20780 -1298 -16192 -19190 12756 9115 -49160
16855 -49160 -67567 -57548 -42033 -37668 -18158 6610 518 -10625 -7114 8627 26452 11043
16843 11043 -8189 -38893 -46301 -22239 -5699 7335 12241 -3078 5879 6870 -13391 -27628 -46587
16830 -46587 -42176 -29290 -783 -17332 -16374 -9130 -22674 -29677 -27517 -19048 -180 -2885 -2814 7714
16816 7714 18971 33156 506 8779 15138 34757 34467 -390 -30845 -19727 -11351 -18523 -27748
16803 -27748 -12671 -5419 -28555 -44859 -20751 -30253 -56368 -54500 -26181 -2215 11118 6995
16791 6995 -5079 -19265 -25052 -31977 -38404 -37782 -40924 -24430 -2413 -10967 -45726 -28873 -27703
16778 -27703 -1037 3678 16273 13468 -435 -39574 -7793 19377 -2734 -17486 -11964 7250
16766 7250 -15758 -44729 -74587 -75056 -38452 -11040 -38090 -73638 -71865 -78281 -46522 -34649 -29187
16753 -29187 -23202 -25303 -41520 -34723 -26981 -23265 -15608 32591 25847 5349 -12556 -32672 -60779
16740 -60779 -42624 -16025 13842 6091 -54413 -49110 -45124 -28259 12780 26106 20860 19145 904
16727 904 -10880 -16058 -30529 -19677 -31460 -47598 -46503 -19265 -17782 6067 20262 7905 1382
16714 1382 -5537 37502 46460 11822 -9582 -35739 -52927 -85941 -90718 -81853 -82496 -63353 -39433
16701 -39433 -7661 14528 -17322 -23240 -52889 -41603 -25065 5674 -15875 -3330 4064 14326
16689 14326 21480 47269 19408 6192 -20160 -10543 -43506 -57667 -32746 -28037 -32518 -40518 -59715
16676 -59715 -35817 -32426 28656 21100 -20683 -42515 -65865 -67043 -76512 -73158 -50911 -72182 -80926
16663 -80926 -63237 -30759 1386 23492 6338 -35124 -42496 -41083 -946 -9142 -37910 -6424
16651 -6424 18112 20616 31281 7482 -11975 -6385 -11427 -22736 -42035 -30673 20153 12238 40338
16638 40338 25050 -5064 -8884 -30177 -38315 -37574 -55066 -61921 -55144 -21982 847 18390 44992
16625 44992 18077 -10943 -19964 -7039 -6801 -8639 5792 29799 29630 12562 18684 22361 12585
16612 12585 10919 11810 -5998 9974 6757 30514 30831 16154 -5022 28443 56436 24286 -458
16599 -458 -9975 -13568 17173 1954 12687 7486 8267 39618 33619 40545 46151 10790 4278 -6024
16585 -6024 -30686 -33805 -17660 30014 62426 59756 33280 19025 16828 799 4717 18277 27288
16572 27288 33610 20681 257 -27599 -9020 30984 52101 31624 -33329 -28664 -15275 -2803
16560 -2803 10991 26829 13565 23924 8122 -15542 -21738 -22632 -22359 -1270 4498 3022 11483
16547 11483 32610 27360 -20477 -24698 -35886 -27815 -4128 -1932 -22458 -21816 5585 31914 3767
16534 3767 -23108 -43106 -41133 -7126 -4834 -17147 -26532 -45869 -25562 -19628 -16093 -2454 18928
16521 18928 13071 6294 19125 28557 33221 25884 10429 15022 5923 -3946 10952 -15119 -16615
16508 -16615 -39802 -8639 -17172 -43758 -28937 -36136 -9981 -9825 15149 13654 -11567 8575 2575
16495 2575 -28946 -44067 -54131 -9021 21871 26889 18981 -8295 -49924 -72188 -58150 -44990
16483 -44990 -36996 -31118 -37349 -20277 -746 2175 -51936 -75605 -48175 -41942 -49553 -40093 8207
16470 8207 19600 -11825 -12852 -10296 -22308 -16454 -11052 -14492 -37322 -43139 -50993 -24532 -25797
16457 -25797 -22551 -3126 16896 30510 -11887 -38192 -23365 9909 10807 17040 20783 -7196 -23728
16444 -23728 -20754 9572 5257 -15199 -4064 7781 -25129 -47515 -36205 -22021 -35084 -11584
16432 -11584 -11501 -14222 -19332 -19043 -12512 15977 1244 -22771 -17291 -10054 7263 41035 27568 -9861
16418 -9861 4061 24970 32355 25739 19752 -7769 -20953 -6441 -5962 5879 21118 18414 -20760
16405 -20760 -5879 -14793 -37853 -38265 -56513 -23324 10508 34162 34797 -15011 -47261 -58495 -21489
16392 -21489 14918 15700 -6266 -1530 6639 39144 34565 22888 1533 264 -37844 -66168 -62698
16379 -62698 -27305 -10609 3644 7695 2329 -3789 3316 -11206 -29173 -31937 -44939 -45414 -13729
16366 -13729 34712 48419 44102 72047 58075 60623 56757 39216 43932 16553 -31890 -60598
16354 -60598 -48178 -44170 -34018 -23592 3245 5751 13068 331 -17842 -2155 -4610 -3873 9760
16341 9760 25159 35693 16866 15206 37961 17564 20126 26469 28438 53720 48815 42415 46376
16328 46376 20419 -25895 -20069 732 14794 8775 -8322 -7623 -905 22360 24717 17714 3111
16315 3111 -8119 -14063 2406 40445 12817 -10347 19081 52660 35505 24593 25433 -8704
16303 -8704 -29480 -10311 41888 92593 53464 34247 38950 38202 44207 35086 26282 20896 1265
16290 1265 11926 10306 300 10046 22719 15098 23395 25704 5835 -3880 10961 44354 26580
16277 26580 -7639 -11861 11729 25686 25016 14308 15467 5341 13587 -14103 -24880 -933 -14696
16264 -14696 -37953 -50856 -34495 10925 32781 7046 2462 41447 17527 -28395 -52924 -12418
16252 -12418 20215 10309 26204 17647 -19233 -14212 15697 9664 6680 23735 2121 -31543 -38642
16239 -38642 -32030 -58804 -34516 -15259 -16092 -11593 -22047 -42694 -32463 -36582 -32188 -19284 -46342
16226 -46342 -51137 -63371 -39760 -7971 43634 68445 42767 34566 16819 7822 4588 -3397 -10278
16213 -10278 -25403 -11791 -42140 -64285 -45304 -5017 42654 36204 18528 2507 -53351 -29300
16201 -29300 4605 46618 29845 -11724 -33116 4450 23859 27476 12277 -5427 -32876 -54533
16189 -54533 -45015 -24673 -15826 -12572 -8734 9729 10683 -9846 -23134 -5047 -16568 -2982 -4856
16176 -4856 -15868 -30502 -14723 -8264 -24035 -37906 -10294 -15909 -51902 -32695 1005 28716
16164 28716 4414 21104 38054 55942 54447 45565 62925 47868 -711 -37077 -28286 -11137
16152 -11137 -44193 -51554 -48913 -58547 -27469 -43496 -23911 22730 25597 -8683 -27904 835
16140 835 15647 10377 -14434 -19322 -31497 -38155 -23596 8333 48713 81345 63548 -7798 -7749
16127 -7749 -8590 -11098 10656 27271 34488 39324 35057 30225 32424 -13651 -50815 -45134 1689 21502
16113 21502 -359 -16669 -33544 -10498 1185 -2351 4283 15240 17941 24959 13254 8249 1056
16100 1056 806 -11238 -30578 -27580 -20897 -38960 -54604 -29085 -12639 -38740 -54269 -55802 -19612
16087 -19612 -11296 -23307 -4125 569 -14528 -18452 -29997 -15378 6339 59023 49203 17818
16075 17818 -315 -24089 -5956 5534 8097 -6440 -39973 -46077 -37173 -41385 -31916 -48997 -41978
16062 -41978 -13653 -14716 -10531 -6839 -11917 -12679 -2076 14013 22736 -2381 -4521 -3052 -2159 9165
16048 9165 32878 24168 20029 23434 -11029 -43262 -69853 -78107 -76889 -16920 -11435 4172 19121
16035 19121 28695 43406 55043 40119 6650 2336 -12227 -59247 -52103 -3748 -5824 -34158
16023 -34158 -35431 -22014 -12153 -24048 -17858 -3394 -1191 7970 924 -11379 -37294 -25389 5074
16010 5074 7450 -10339 4356 5840 9355 -20165 -41229 -34164 -37679 -53489 -55207 -25728 -3936
15997 -3936 -5753 16547 2137 -24960 -41191 -55730 -15830 -15061 -28293 1115 6447 4343 -30021
15984 -30021 -70200 -73335 -64186 -34858 -16699 -731 -7176 -44966 -67724 -41484 -14465 -21161
15972 -21161 -12020 -13791 -15312 -13535 -17349 -4851 -5632 -20203 -42651 -63553 -53040 -41324 -47836
15959 -47836 -54685 -22244 9630 -1810 2687 24051 33516 43907 38662 10015 -2773 -16814
15947 -16814 754 18321 -21863 -35413 -16117 -47011 -68674 -63209 -46493 -71851 -71513 -52143
15935 -52143 -22604 -20039 -12909 4250 28798 -5402 -31279 -47203 -41027 -41675 -36598 -41706 -10196
15922 -10196 3931 18469 -8020 -64529 -59505 -51928 -23970 -14979 1925 -12141 -21414 -40951
15910 -40951 -40420 -26481 -19038 -9959 -22804 -19633 -4017 6388 44097 72413 65994 19309 -5980
15897 -5980 -27633 -25434 1440 15699 9545 25930 24768 -6668 -14443 6004 16533 4307 -14151
15884 -14151 1765 0 -8216 -4119 -53162 -84795 -88331 -72429 -47249 -31589 -20553 412
15872 412 8282 18303 27117 2616 -8307 -26119 -9490 -28684 -42232 -44497 3665 -647 -17950
15859 -17950 -49204 -22783 -13838 -8707 -34229 -30225 -5061 100 5314 -11167 -2063 7949 -29061
15846 -29061 -16998 10077 -9159 735 40147 50343 35772 18295 17398 -805 -21718 -24268
15834 -24268 -8294 4165 -3794 1458 46831 56034 28622 -25104 -40426 -3475 -17267 -25901
15822 -25901 -15371 -18644 -16958 -2803 11690 31599 20194 14523 -7704 -60791 -88043 -99364
15810 -99364 -68834 -61834 -72461 -65705 -28134 4154 20766 32290 32237 596 -33056 -34759 -20605
15797 -20605 -23655 -28833 -16173 13152 11337 12774 21761 15193 -7263 -4475 2882 -3204 -2706 16297
15783 16297 8755 -8312 -36093 -58620 -79240 -80763 -59532 -31723 -34007 -48904 -43920 -25699
15771 -25699 -31487 -27165 -3886 10059 5413 -25414 -11736 18330 1190 -20483 -27557 -15929
15759 -15929 3737 11830 2387 -39087 -37080 -17636 -1794 -3967 13744 -1952 -24777 -52131
15747 -52131 -45907 -21289 -15247 91 -13251 -5343 -8048 2607 -18310 -24618 -17489 -9288 -24207
15734 -24207 -51460 -61434 -56665 -20958 14716 -13096 -21760 -26116 -25813 -25305 -47339 -63561 -58581
15721 -58581 -42592 -13632 -2649 -1439 12074 19331 3693 -11790 -2868 21884 21486 -6662 -21362
15708 -21362 -22297 -8036 -36556 -62185 -55283 -21472 -10334 -22471 -37147 -18890 -13134 -48655
15696 -48655 -69622 -45956 -28201 -31833 -36261 -11415 1156 -15137 -28432 -19729 -49592 -36012
15684 -36012 6374 13956 -9275 -36330 -55506 -51101 -39294 -48149 -45585 -41983 -48339 -30642 -18411
15671 -18411 -23529 -47962 -44144 -37036 -40417 -55841 -68360 -55476 -37203 -25191 -23664 -16498 -17940
15658 -17940 -35522 -59152 -43569 -41957 -32715 -5557 -1313 4807 43008 52448 51960 24649 -3674
15645 -3674 -33915 -13058 18445 12136 8534 24589 19266 -7561 -3170 -8630 -7572 -15892 -39598
15632 -39598 -3831 42053 39419 35956 22015 427 15394 18330 -11336 -30046 -688 -10787
15620 -10787 -36162 -63331 -29878 -30665 -51664 -44222 -41067 -22091 -33143 -37665 -32490 -57745 -73336
15607 -73336 -54550 -30209 -8881 -8204 4764 -11564 -26139 -9736 -23352 -19911 15938 38357
15595 38357 44881 41223 42375 38830 52315 24516 12205 -602 6867 20429 -12003 -9609 19140
15582 19140 39576 24048 2224 3323 -5812 -27726 -44430 -47774 -18809 6311 -11357 -9108
15570 -9108 -17921 -36908 -26612 2519 44388 29137 8741 -16303 -36835 -45456 -15866 2293
15558 2293 36087 37326 42416 40435 34676 27699 31333 2781 7145 21367 17201 -37451 -30110 1256
15544 1256 3704 2222 -9068 -14161 -14703 -26390 -33653 -7987 22820 -5114 -1975 -20624 -48205
15531 -48205 -80063 -63128 -57574 -45353 -18723 -1041 -15712 -58377 -73608 -45343 -10205 20666
15519 20666 32231 22277 54878 52752 38267 -1715 13725 -24942 -58539 -43082 -10405 1873
15507 1873 5143 -9891 -39606 -47107 -44701 -60932 -81305 -65247 -39156 -13169 -32089 -27199 -15524
15494 -15524 -21853 -54367 -47536 -41825 -56904 -55221 -61744 -55760 -51638 -16002 4559 10876 3246
15481 3246 -6139 16480 4840 5092 46869 56009 45312 25981 17492 -10948 -24200 -21800 -24419
15468 -24419 -61129 -70232 -46450 -16067 15056 35476 29197 40414 47905 50488 40046 49950 37416
15455 37416 61563 34530 -11098 -40489 -78254 -86479 -79542 -44456 -31828 -20926 -8662 -5359
15443 -5359 -1664 -9403 -23726 -69899 -71799 -13811 13675 -798 5067 13236 8005 33942 27274
15430 27274 8194 26129 25347 20720 22853 17748 1131 9847 9589 16765 8673 -1832 17830 38273
15416 38273 31703 49143 54700 49252 21748 3243 16480 2601 -21444 -37618 -32940 -27397 -37515
15403 -37515 -43290 -54665 -63599 -69583 -60891 -50390 -46868 -20949 -24184 10691 14104 -10390 4788
15390 4788 19633 25038 17889 -13949 -17570 -14101 15873 21220 19922 12184 31347 19542 -34244
15377 -34244 -79843 -57226 -50215 -65562 -31117 -29643 -30707 -36951 -25075 -10712 -6827 29009 27096
15364 27096 18913 280 -5274 1246 21888 -5491 -31266 -26400 2993 11203 18853 21699 26325
15351 26325 6937 5081 39935 33392 -25014 6324 16145 -2456 3227 1501 -260 -10537 -4446
15338 -4446 37797 28561 11360 -17808 -37065 -24801 -4297 2467 3323 23672 4903 -29390 -39281
15325 -39281 -41506 -64596 -65828 -57645 -43011 -6405 -11382 -16243 5882 6032 28446 26947 10854
15312 10854 24907 9393 7243 11720 -12573 -44710 -38710 -25772 -28586 -1923 19979 400
15300 400 -28345 -41233 -43831 -27288 -15615 -11239 -18993 -21136 -12041 7893 19953 39888 43584
15287 43584 33216 -9921 -33538 -32141 -7042 -11295 -6294 -5019 16450 -17927 -10841 22873 4602
15274 4602 -24658 -25965 -97 16141 9760 -19412 3342 5334 -5355 -16147 -13935 -15339 -8225
15261 -8225 -9544 -19393 -26146 -1898 -5303 -27490 -25652 -16740 -2092 4864 -8332 21756 17609
15248 17609 -9412 3387 -2343 13145 -5078 -2539 3724 23092 20322 -7068 -9955 -24193 -1706
15235 -1706 17519 10270 11323 28734 4483 4552 41591 53259 58471 59206 88094 43993 25732
15222 25732 9084 24656 26565 -2345 -27357 -49187 -38571 -27876 -14252 18234 7459 -25618
15210 -25618 -31606 1169 16928 -7063 9470 24324 36331 39740 30986 35431 46979 28834
15198 28834 959 6609 4954 -12881 -5202 -11104 -34361 -22935 -9470 2695 5963 1781 -11872
15185 -11872 -5170 16349 23607 17428 13702 -6353 -8261 -33902 -27604 -18063 -10461 5020 16610
15172 16610 38665 54188 47611 45010 36466 33381 59564 41922 43057 56805 40156 11659 23974
15159 23974 55102 62276 41376 45144 66620 34271 -12454 -4584 -28733 -26573 -40123 -43065 -29611
15146 -29611 -4506 4383 -643 -16 -20561 -13971 10876 -16952 -2367 3043 -5256 -22365 -34287
15133 -34287 -36427 -54473 -57053 -43237 -35042 -36918 -25572 -52054 -46560 -34950 -11370 14225 -13504
15120 -13504 -15098 -13445 -26577 -15596 -9576 -2994 7019 39229 49764 32646 56640 56048 28092
15107 28092 6169 -28405 -24393 -643 21818 46912 30019 10466 25000 15099 36211 24026
15095 24026 11266 -9490 -2817 2213 8791 14607 6454 -1166 1028 -3582 -25672 -35015 -41404 -57184
15081 -57184 -56177 -80478 -78178 -66328 -48196 -75253 -72741 -25834 598 2350 -1504 -6225 2651
15068 2651 -11717 -35697 -30977 3169 15669 -9006 -11340 -11798 -29956 -45233 -25630 5924 4590
15055 4590 19642 18103 -17464 -19743 17078 29951 18794 -13445 2915 22992 -16435 -53459
15043 -53459 -31095 -7558 -3436 -3405 7864 17848 10053 15324 10074 7047 15925 2656 -10625 -1388
15029 -1388 -9773 -7033 -13892 10480 26439 42198 38916 22719 9878 20845 44542 67369 84147
15016 84147 66484 63730 19856 -4027 -23208 -393 8220 23639 16357 4616 -37643 -47646
15004 -47646 -65786 -66331 -38989 -23746 -25552 -18397 -6521 39233 25286 18273 6233 -19889 14870
14991 14870 26691 -1512 -20324 -8913 5012 13126 -15167 -17690 -3853 -14248 -45870 -68151
14979 -68151 -44199 -11674 -5322 12059 3225 -17582 -43595 -30311 -15645 -3805 -3697 -18920
14967 -18920 -16609 -18679 10785 21677 -13020 -21139 -12649 -40564 -31690 -11934 -20794 -14428 -23075
14954 -23075 -31338 -10813 -9812 -29787 -33624 -44687 -43200 -22596 -19692 -24364 -28770 -7972 -13035
14941 -13035 -10457 7383 -776 -23778 -79968 -95095 -41122 -814 -17651 4759 43912 26414
14929 26414 -11644 -42399 -36693 4843 5718 22629 33205 12531 -14697 -37636 -49320 -31186
14917 -31186 -24326 -38715 -35289 -45238 -38146 -6330 10385 -19989 1034 30242 34419 29207 -19523
14904 -19523 -32044 -20089 -39660 -25169 17675 4230 1050 -26747 1369 7764 14953 38097
14892 38097 68552 82956 80869 54839 43379 3785 -44705 -37014 -38522 -44384 -35700 -3918 28667
14879 28667 55637 45645 11998 -17574 -26823 -36727 -34765 -42532 -19415 16627 19280 -3922 14399
14866 14399 49318 42281 -15189 -8651 -4892 -38314 -50607 -39574 -14162 -5510 -6706 -5454 -8533
14853 -8533 -55958 -64445 -55010 -70592 -94274 -57171 -58 15167 34977 36367 4834 -25199
14841 -25199 -26690 2427 -6837 -15120 -25833 -22855 -16157 -39928 -36958 -5465 1659 6603 1460
14828 1460 12583 -6664 -19181 -13584 -34015 -54757 -35858 2103 791 -28872 9828 42165
14816 42165 54016 48196 21494 22791 29486 40166 1567 -12598 -6260 -12932 -22897 -11667 -1660
14803 -1660 2545 -24027 -10643 -18336 -56375 -50159 -37253 -33587 -51389 -45287 -48851 -45160 -14234
14790 -14234 -4117 -21236 -14464 -5849 -11091 -11579 -44022 -71209 -54419 -18460 -15588 -33845 -44481
14777 -44481 -34736 -34375 -37636 -49462 -52840 -45682 -27180 -2733 -29289 -68127 -48198 -31407 -19941
14764 -19941 2886 6250 -24428 -18090 -12567 -8885 -27708 -52816 -70490 -79899 -71154 -3472 50523
14751 50523 60177 22965 -22334 -13876 -4217 6811 3600 -5921 -21331 -3639 3979 -3124 -16668
14738 -16668 -18045 -7399 2852 -9833 -32256 -31025 -593 -4885 -11332 -10523 -44511 -41859 -53129
14725 -53129 -55164 -29553 -10967 -19996 -9996 -170 333 -1668 11243 12106 2242 -18132 -38483
14712 -38483 -39816 -42151 -31676 -5426 -45231 -59394 -30159 -16086 7345 11871 -1279 13950
14700 13950 7574 -11200 -26191 -14913 -4240 -33160 -41831 -31994 -19353 9450 30346 37741
14688 37741 42246 17803 -45824 -89962 -69848 -52465 -51913 -45847 -26947 -3229 -2499 -1353 23543
14675 23543 -12161 -44512 -24727 -1781 -13258 -5398 -21258 -3498 12045 -41664 -33514 -9671
14663 -9671 12264 32734 26812 -17210 -31188 -23944 -14537 -9235 -42291 -57546 -25923 -2340 1061
14650 1061 -16536 -25605 -1614 -17576 11010 12951 -6061 -1375 12245 -24651 -38172 -8096
14638 -8096 -1466 -99 6483 -22454 -37982 -41964 -34907 -18653 -9446 -53096 -83030 -61024 -50799
14625 -50799 -31216 -9125 -15059 -11194 -7037 13223 -21320 -34164 -29074 -41414 -12928 -7243 -629
14612 -629 40184 54453 54624 68485 76548 67634 34511 -20226 -51085 -45873 -46758 -36682 -67106
14599 -67106 -82394 -69306 -56152 -76767 -43267 -10834 -36777 -36927 -1970 -6899 -30931 -2743
14587 -2743 -644 16894 38765 57772 30729 -4394 -5150 9703 -20488 -23436 -12839 13253 2313
14574 2313 -3211 -18629 -44714 -38092 29551 25077 -9501 -21670 -8293 -2941 19455 38873 32119
14561 32119 26580 6780 -29639 -36807 -7123 11192 21140 1256 -24169 -20527 24026 22675 22710
14548 22710 77296 103127 41548 -200 -21663 -11944 -19304 -21043 -12301 -1231 5015 17142 14629
14535 14629 6028 -11208 52329 69590 47567 30983 4697 23037 18668 -1498 -10566 -13449
14523 -13449 -20640 6839 21983 -10644 -42429 -11584 2261 19495 8609 28861 20618 36673
14511 36673 28964 -243 -24413 -6598 -19958 -8743 11463 9125 9212 10119 -8281 826 -21399
14498 -21399 -49056 -39023 -40094 -33655 -28410 -30103 -14675 -21904 -41854 -39499 -23174 -27222 -15164
14485 -15164 -13609 -14323 12330 4141 -8223 -1792 -17267 -15247 -4016 -3314 -11265 -9950 29638 43696
14471 43696 22551 28343 11279 10785 -2518 13978 32155 33508 49577 28305 -10423 19670
14459 19670 22073 -496 -26382 -58784 -43586 -45403 -55208 -45076 -4842 2760 -34088 -47003
14447 -47003 -30445 -21067 -43112 -41893 -19784 -4092 12245 32996 64513 50455 57360 55909
14435 55909 27540 22762 5370 22893 12776 -5667 -1864 92 -16765 -37488 -31092 -40164 -58970
14422 -58970 -64910 -74332 -73633 -32621 -19641 6720 34899 51214 42639 28079 450 -13304 -18614
14409 -18614 -3044 -1287 -16453 -30043 -50534 -73935 -54708 -75216 -89477 -71328 -36762 -6107
14397 -6107 -13678 -2828 -26341 -34586 -17884 15664 33142 38800 51227 28108 13380 13149 11403
14384 11403 28443 4942 -23596 -12960 -22169 -24734 -15198 -11628 -6295 19874 13597 12879 612
14371 612 -15638 -36402 -23068 -29299 -23900 -18554 -17770 8422 48399 13264 -9224 -16435 -33866
14358 -33866 -42065 -46274 -49235 -70460 -92107 -70011 -29256 10600 14014 -16220 -24183 -36873 -29581
14345 -29581 -39391 -33486 -32045 -76457 -66447 -23051 -11290 2060 -7106 -5746 841 20530 -2348
14332 -2348 -1796 1873 -30391 -12763 16634 1201 -35755 -4350 -3602 -28679 -37722 -40030 -18304
14319 -18304 -16017 11315 -1215 -12256 -28635 -6414 -23020 -18432 -27653 -39535 -25059 -12709
14307 -12709 2521 3223 9396 9888 -9076 -49769 -54920 -41626 -62895 -44208 -21594 -31401 -17337
14294 -17337 13108 32985 13169 14147 5557 -4478 20070 16475 -3726 -8167 -16551 -62122 -73179
14281 -73179 -34651 4250 -293 5268 -1798 3919 2435 -2994 9860 -461 -13701 -3054 2093
14268 2093 10256 24822 23570 37190 32446 7682 3781 -5271 -13443 16460 -4525 3010 13051
14255 13051 41868 24920 -4444 -18222 -30272 -28984 -331 -2833 2262 11949 17171 -9246 -2911
14242 -2911 6431 5590 10581 25426 15644 24780 28603 35482 21934 -5094 -3623 -2614 -1952 7549
14228 7549 -8527 -293 6739 44763 57092 20713 -19916 -26083 -24490 -42702 -35891 -25810 -30493
14215 -30493 -48201 -57896 -61513 -56480 -35675 -44837 -38765 -11517 25351 43055 33024 47183 55049
14202 55049 34024 36048 31283 29604 13101 8404 -4192 -17383 20420 11977 -10389 -16787 -12625
14189 -12625 -6648 -1352 25825 47671 36627 16965 -13724 -21847 -4428 21350 43720 13283
14177 13283 -39651 -37791 -19290 -1937 11267 9564 20391 27702 46994 34634 13023 43688
14165 43688 57396 43766 -10271 -56865 -76861 -68717 -46750 -46721 -35105 -13017 -18804 -29191 -9016
14152 -9016 19361 23500 -462 1792 7102 8195 6789 6261 -27750 -50218 -70993 -55961 -33127
14139 -33127 5491 34662 8648 -20579 -23102 -14476 -2459 22815 24153 8189 4497 -1445 2258
14126 2258 41438 29228 1430 13678 19570 -25955 -55234 -46598 -20854 24936 40466 10447
14114 10447 -17402 -42078 -44765 -38925 -66479 -47657 -6756 8704 13497 6744 -24282 -50731
14102 -50731 -40236 -16933 -43344 -46571 -38471 -21425 -36404 -59257 -78597 -57371 -38282 -25069
14090 -25069 -10395 -25645 -29020 -22316 -12623 17965 25928 3634 -24564 -9007 -13320 -19264 -18068
14077 -18068 -13370 -19582 2913 8451 -2469 -13427 -7852 -19861 -36225 -21442 1405 -5840 -5718
14064 -5718 6320 -5422 -3119 10242 8099 -5228 -6122 -35451 -40417 -9560 -2295 11133 26178
14051 26178 -10846 -26121 -28223 -9217 -2655 1628 -17365 -38187 -49246 -59102 -39082 -27999
14039 -27999 -7995 1338 -18679 -44035 -31172 -19126 -23783 2368 7073 -15664 -31054 -27833
14027 -27833 -7859 -15107 -34386 -35414 -14903 -11233 -34498 -26918 16976 -8213 -28791 -39111
14015 -39111 -50525 -24202 4625 -20591 -17907 14569 11136 -24240 -31805 3300 17245 14287
14003 14287 26475 36165 50654 34134 -5954 -1928 33853 28215 40230 25648 11436 17113
13991 17113 33665 56950 56075 40741 5561 16847 18714 9992 -2609 -20977 -48848 -34091
13979 -34091 -16299 -43707 -30087 -27985 -25261 -54764 -67247 -74780 -41975 -4730 28548 21085
13967 21085 14084 31757 -17901 -40148 -51500 -69697 -44450 -25983 -37984 -45212 -50077 -59086
13955 -59086 -50360 -25885 -35668 -15571 -36339 -35818 -35990 -21450 -18876 -15960 -13968 -9485 -4517 -522
13941 -522 7058 14646 11443 21520 23809 12976 9961 36048 33240 25693 12957 33941 43082 35569
13927 35569 29672 -17123 -36873 -18099 -30535 -10153 -11959 5427 9065 33939 29701 44880
13915 44880 42742 38780 52628 44459 15714 8397 -14005 -14325 -2274 29881 71802 62213 38568
13902 38568 8317 29639 25202 20850 15463 12904 6886 8510 18484 31207 55686 59812 39073
13889 39073 45674 24429 25261 5202 -46835 -36410 -9936 -6527 -16972 -9918 -6510 -16896 -14029
13876 -14029 -13129 -5802 -8811 -10546 -7505 9432 -15579 -11520 -19650 -40658 -43555 -37710 -46084 -24200
13862 -24200 20948 909 -7938 2248 17256 15317 15975 37748 46396 52957 58124 74073 69014
13849 69014 91301 128552 124641 95063 89075 75988 60231 33461 58686 62432 82149 52870
13837 52870 12519 28905 23568 14001 24054 56959 77381 72573 76615 67931 66858 21087 37264
13824 37264 60175 74497 36003 10123 26857 31150 32303 27028 -2800 953 41174 56300
13812 56300 2868 984 2304 -5446 23426 48061 56313 53232 35032 51671 95102 121366 99246
13799 99246 59969 20355 8787 5545 -20730 -26498 -3261 15497 52817 62568 47926 48386 73736
13786 73736 76810 84523 94344 71580 54208 59073 87468 142532 225294 274634 270116 225439 163633
13773 163633 120058 85444 111146 78528 63116 50508 23574 45194 13615 -16665 -6071
13762 -6071 15050 40582 45742 23279 25571 15188 17280 1554 14048 25397 47256 75230
13750 75230 69695 43287 40010 36591 28385 51880 97451 118946 141916 206993 311320 476412
13738 476412 665970 872476 1017478 982478 833131 647519 476594 360995 259377 175045
13728 175045 131041 103470 85934 84762 61075 68123 40300 33758 56412 28956 21413 11519
13716 11519 23221 78504 75165 22302 32048 32833 34845 69192 63546 72420 64716 39693 32134
13703 32134 15084 11714 17720 16547 31085 44533 67482 95871 92556 60275 7861 10022 26647
13690 26647 18053 43428 61780 65358 63328 58354 57111 46415 57812 52209 6508 -22226 1633
13677 1633 1063 -17019 19448 42345 52765 49985 6689 8543 -983 4813 15485 -19994 -23784
13664 -23784 -35280 -68289 -51217 -19228 14220 49261 26883 15505 20144 38553 49914 38876
13652 38876 34737 28367 58775 101950 150284 184035 211599 255787 346374 473278 657202 939905
13640 939905 1369806 1886327 2259476 2265210 1977601 1526835 1156610 862738 617132 487840
13630 487840 380505 331140 263642 211693 162520 132106 119691 98862 108371 90003 50304
13619 50304 29849 41753 64930 68307 50761 26754 29416 25566 36516 70878 74918 51422
13607 51422 29676 50985 20025 6388 16181 8611 17576 32497 39534 42076 56134 53184 45563
13594 45563 80570 90795 93557 73227 63034 26184 10021 37642 43684 -803 18915 60675
13582 60675 67165 49600 40959 15314 25193 26958 36231 62312 87792 84748 81011 64114 24365
13569 24365 9358 26731 29949 48158 56908 42032 54606 100450 89262 96938 75810 62132
13557 62132 72994 92224 84439 48217 47401 43512 50273 72011 74543 73447 96770 108190 137845
13544 137845 162683 175462 170504 155535 108104 78679 66982 58093 60123 44344 17348 64978
13532 64978 75196 65863 21816 950 11678 -697 23310 26752 3033 -5455 532 7169 28663
13519 28663 29668 -265 6346 17648 18660 -11839 23829 56640 77893 32668 -2652 8363
13507 8363 -12019 -13449 14572 30773 36211 40196 56540 51326 45138 27753 1925 -17601 -41398
13494 -41398 -44646 -26825 -2738 29573 59905 17445 26748 40186 29674 23785 21206 22650 -12507
13481 -12507 -23184 18860 23417 25765 55294 66362 34472 35216 48869 96379 129465 107223
13469 107223 40800 41543 78544 109244 83223 76676 80126 52274 52522 105149 110330 106226 122800
13456 122800 132795 153081 158707 146787 102836 74461 117006 127202 130196 131301 90088 58137
13444 58137 79649 71907 68373 86946 68823 15566 21307 79893 89298 85311 81826 98432 94676
13431 94676 101388 119889 86421 72409 51435 49540 47023 60338 76932 90390 81206 81725 90024
13418 90024 77765 54364 55023 23110 21323 44594 44385 14667 15369 29939 54458 62468 56933
13405 56933 71431 85309 108338 83892 75202 59184 8371 -23295 -37825 -7556 47015 74455
13393 74455 71915 59854 39908 34544 43898 39673 29058 24020 35058 38818 33846 29795 40802
13380 40802 32751 49576 71797 78607 96597 109780 116639 105590 94386 76348 80020 96792
13368 96792 80462 39491 35806 45622 53928 48687 77883 79810 119882 129923 135696 130825 125527
13355 125527 133480 166983 161637 152477 126595 121206 98730 77041 127151 168858 149754 93849
13343 93849 57711 73079 84782 107464 115087 125339 158103 161099 150092 99677 88781 94919
13331 94919 107524 114739 150687 217298 273670 323602 397844 423748 362240 360045 388510 393572
13319 393572 387846 404144 390057 377741 349070 355271 424828 492997 504261 470284 453170 433782
13307 433782 414533 381531 359970 326267 298291 276248 272082 288126 306841 319413 291797 239455
13295 239455 184791 189827 223671 251512 269772 254408 246573 260701 271386 242950 255238 281995
13283 281995 310943 332232 333101 327368 365378 387237 380807 410079 410807 431339 440809 442406 465144
13270 465144 488851 490833 510221 560143 567998 577635 553755 571673 575543 594937 622922 645946
13258 645946 659609 677675 694391 717113 753739 775549 805648 853663 902078 939680 994074
13247 994074 1017554 1035704 1033296 1033923 1103593 1155852 1196556 1271367 1338009 1385190 1415783 1438841
13235 1438841 1490337 1584854 1714845 1847620 1936184 2097793 2251906 2428593 2636913 2852190
13225 2852190 3111097 3383679 3605243 3870020 4203433 4610159 5070282 5618283 6206742
13216 6206742 6831121 7493670 8249606 9162627 10313088 11787820 13601116 15836942 18644348
13207 18644348 22289936 27122068 33667884 42575000 54718979 71895952 98015447 139852689
13199 139852689 207296904 306581764 416254123 476926543 459444877 379861245 279856552
13192 279856552 197973140 141009803 103424198 78506518 61131111 48324645 38591113
13185 38591113 31198235 25570864 21304018 18074390 15560375 13566111 11870043 10399046
13177 10399046 9196814 8194624 7384652 6731094 6198710 5754691 5345289 5009119 4695097
13168 4695097 4414722 4169998 3920382 3649796 3402997 3244239 3107600 2954752 2823206
13159 2823206 2727722 2619112 2518432 2369030 2213162 2088451 2031051 1938115 1819812 1730764
13149 1730764 1681600 1595806 1521656 1497120 1434801 1352548 1279627 1226824 1177475 1152209 1112839
13138 1112839 1092945 1071935 1035215 999360 971252 952161 921969 883951 890059 852154 812322
13127 812322 783192 767006 744993 709721 716623 714455 714193 690420 657606 596898 581525 557769
13115 557769 573622 556762 555406 600536 582093 564021 547144 540465 531826 519290 491433 443523
13103 443523 437752 504359 504878 510145 502977 472050 453233 435313 415452 424653 427991 429636 409280
13090 409280 380121 364663 355591 342828 320408 303857 325830 332665 273822 216766 146365 126737
13078 126737 168343 198330 256104 273860 278455 261942 224868 181268 199623 239874 218178 225484
13066 225484 240597 228311 198600 184502 203033 219704 262644 280191 271629 254472 234626 209287
13054 209287 200572 210810 229434 230441 228253 243172 190706 117657 111149 115519 121293 134900 168607
13041 168607 199848 173321 158902 173373 161725 182463 230106 254628 248747 226420 219614 221412
13029 221412 212417 189098 174245 182806 192472 168529 150989 168598 164355 132785 137103 151869
13017 151869 139019 188595 200105 159296 130151 132818 161723 178916 167081 134588 103699 81315
13005 81315 91254 117110 118084 136100 141162 119699 128475 170438 190252 182760 201843 231903 214468
12992 214468 169313 160478 174926 172055 141396 91003 98795 88500 120470 157169 147386 140880
12980 140880 118422 132129 159703 142495 137489 174057 182600 156405 147069 129368 120885 123853
12968 123853 108873 117982 127306 119151 126114 119996 136626 176859 203634 208359 209834 205077 178705
12955 178705 182601 178947 118918 97274 102019 127106 134890 128103 136668 140579 136304 124055 100277
12942 100277 108690 142782 159843 140396 119536 133638 119306 126171 96641 65222 26149 34431
12930 34431 57667 58109 54816 77704 95141 80413 67311 64244 79437 79574 45430 55443 83876
12917 83876 70551 104090 104660 73929 71453 66879 84296 66684 58296 45239 16222 5403 -274
12904 -274 14773 20317 61495 102831 102373 84461 115259 124490 117699 117944 123652 110586 114471 92079
12890 92079 96514 101096 126227 131448 110486 102074 101292 72385 55222 54179 54957 47948 52873 100745
12876 100745 117871 105830 102320 59736 38243 26727 14142 32037 49591 56843 70410 66701
12864 66701 49966 57976 85755 51255 47924 68429 86053 73927 61598 61192 57511 46484 19267
12851 19267 5583 -18364 -59809 -32269 27718 49701 19926 35963 14222 36190 57503 84176
12839 84176 38559 -2116 27487 60645 72729 55588 52466 40620 35520 21791 6458 34667
12827 34667 64413 68850 58772 78422 97594 68009 36264 33912 60586 89403 72748 27823
12815 27823 -32126 -27703 17492 48335 92706 76141 48975 48846 38020 54700 80793 57047
12803 57047 61192 72214 54661 28486 10092 15035 4719 -25995 -45482 -10843 11926 -8222
12791 -8222 -3670 17325 52241 61096 59777 54396 60633 42263 45217 34928 27994 -3675 -18852
12778 -18852 302 37906 51123 50158 38870 51008 55997 59852 66951 52367 55630 59119 50167
12765 50167 48081 73172 57799 57133 94194 134523 133526 131942 112935 168001 274950 390797
12753 390797 505875 650359 874852 1189226 1647027 2116730 2285014 2135499 1772222 1328450
12743 1328450 983206 733605 549211 397053 291982 253176 256906 220784 158939 143848
12733 143848 110455 99949 106957 98121 112667 86372 73121 65256 62425 59091 32284 44452
12721 44452 59347 60963 52282 55221 50963 50826 75525 92029 45145 10666 -14910 -11061 -20063
12708 -20063 -7944 -1543 -204 11962 42398 58880 57460 52999 40304 18985 33469 67868
12696 67868 86034 75104 77491 56124 25615 15572 21809 699 2264 25464 49557 54852
12684 54852 48530 57059 34119 16125 28643 15397 8904 39869 49246 53438 47572 46270 55599
12671 55599 60611 37789 29907 48942 45212 49124 16664 12735 37400 21838 12601 30226 64776
12658 64776 84805 57339 57052 40301 8916 -5413 -11837 -10025 15834 49625 54644 11097 5122
12645 5122 -3154 24384 42974 53756 50547 75094 69523 51968 3803 -19823 -135 33870
12633 33870 14821 -12800 -16228 -961 6077 20933 733 2009 24558 68894 65467 33801
12621 33801 18927 27656 53317 50326 29539 39365 68670 54757 53230 60338 44252 32909 21941
12608 21941 26719 -10334 15800 24557 23074 28145 28489 56906 42815 33076 10998 -5812 -13565
12595 -13565 -9295 616 -5932 -11392 32521 22906 885 -24637 -23707 -5014 33476 83484 74447
12582 74447 40314 20852 15947 13231 7052 67359 71745 69676 91009 64625 33971 37796 38395
12569 38395 7508 -15568 -14334 3360 -2526 -13343 13822 8223 -19817 4523 23318 16000
12557 16000 -8881 -40214 -28452 1797 -4187 -162 18589 11000 17288 337 -34049 -26784 27409
12544 27409 42186 29238 27391 27183 13556 18287 31212 39182 26187 20265 16339 -518 -8999
12531 -8999 -22204 -28251 -31711 -20875 -1581 -37260 -32075 -31691 12226 5958 -18229 -4022 16345
12518 16345 44797 65999 87620 66374 25378 43196 78237 48368 14190 -11885 8218 23002
12506 23002 28079 34460 77712 77049 51706 55283 81301 56273 12701 5439 6489 10758 -1578
12493 -1578 20652 31997 18352 16636 40462 33324 13933 12724 -9165 -13198 20998 43082 9259
12480 9259 4837 -15062 -20812 -3592 10112 16036 30238 41424 10378 -16003 26819 48387
12468 48387 33426 11780 13421 7541 -11983 804 -8936 -13562 2622 3149 16505 43193 99774
12455 99774 104085 54046 35279 34436 37426 24588 48030 61700 55977 20891 12169 20279 41237
12442 41237 39910 50157 54936 30427 28115 46073 36440 21102 2268 10946 35704 16659 -1284
12429 -1284 18894 17794 33793 34436 41568 58387 70284 59311 16450 2845 27678 63441 63969
12416 63969 61093 58357 47552 77665 54552 49304 61110 52980 -62 -46994 -30117 -17982
12404 -17982 2302 3644 5749 -30749 -20394 -31777 -29938 -32532 -14598 19492 20526 47465 41775
12391 41775 9940 33994 30625 25197 42149 31093 51016 36426 39749 17371 6260 13292
12379 13292 27102 35123 29700 41196 35094 6842 13365 27977 15371 52188 89308 83392 47432
12366 47432 24174 30041 50678 39908 19284 -4880 -5700 5724 14465 18324 33955 36862 13077
12353 13077 51010 72196 54605 43768 18764 38689 52480 47617 40527 11624 -21010 -33624
12341 -33624 -30774 -26493 4445 -3115 -13283 -2598 6519 -4044 -5314 12934 44221 65689 55212
12328 55212 16288 8489 6639 45567 55829 61952 62987 43659 35005 59667 70679 74593 62778
12315 62778 47106 16645 19614 15662 6659 -8958 -51743 -29186 2455 10900 24200 22751 31477
12302 31477 58736 82903 83226 66082 38705 17095 20407 10696 11232 17994 22407 8595 10132
12289 10132 12061 -8506 -4887 11987 56301 73508 62546 65385 99063 60939 14076 -28046
12277 -28046 5 60239 83164 66550 56014 72575 82493 41948 37978 43538 42510 55297
12265 55297 65100 2287 26486 63834 50098 22255 6321 29431 49125 75005 63216 15388
12253 15388 1572 -12333 -1046 18803 2244 -11682 779 32349 76744 75661 55944 18150
12241 18150 29950 66742 103723 121317 119624 110221 103048 90204 86946 76378 72449 69409 26733
12228 26733 8453 29062 18928 6532 15398 17364 29275 29136 85334 80084 67312 29039 -501
12215 -501 -9483 524 21704 43797 69442 64111 41534 23450 -18519 8713 83005 69063
12203 69063 57256 68965 41201 16459 -18283 -26741 6274 33938 8937 15065 28166 36539
12191 36539 55535 57069 60964 80462 93721 87661 69319 53485 43564 25771 45754 61755
12179 61755 79915 95921 117225 132457 120268 76550 49509 62973 48822 70824 67090 55500
12167 55500 49218 54076 77614 63962 70259 75154 88558 120028 144734 152239 166455 155162 143208
12154 143208 148180 164730 142101 117318 145905 175464 161376 137586 115366 117375 127921 113323
12142 113323 107199 81805 54844 59176 84345 76816 64405 49539 79105 125358 160740 140607
12130 140607 94088 60815 35727 67027 67113 57254 51166 69403 94604 96024 73725 50595 32805
12117 32805 42474 52502 50125 72338 78749 114248 152646 188135 178248 140855 142980 125061 122940
12104 122940 150522 146741 142252 119479 120348 153766 176328 148227 124698 120428 129744 179366 216803
12091 216803 205267 161106 102132 118977 166761 192775 193109 182688 163319 170503 156328 151673
12079 151673 154501 161940 180586 229029 243147 237227 246750 225457 201557 190156 232425 218764
12067 218764 188395 191353 199657 208524 214601 245908 269100 263277 264613 269391 263571 227394 225719
12054 225719 262329 266292 220724 208826 210797 213752 252248 289634 319117 313138 271077 245698
12042 245698 233642 254210 294701 305083 286736 279752 274723 294690 268990 252904 259299 300931
12030 300931 303134 337305 343966 337840 352000 340061 351692 321694 347973 366775 371054 406784
12018 406784 428130 433121 440149 444272 445606 461258 506644 521289 546459 534775 531877 555387
12006 555387 552975 551281 523826 554815 574632 621346 629251 641064 668515 690385 713566 745194
11994 745194 726736 730772 809615 881410 881010 915293 964336 975758 1005662 1036366 1074598 1100491
11982 1100491 1108109 1108043 1142439 1204311 1278434 1365598 1416564 1462041 1511509 1576509 1642946 1708899
11970 1708899 1792725 1871738 1934709 2027822 2136055 2250745 2377422 2501474 2643011 2792003
11960 2792003 2923885 3083089 3286805 3505913 3778232 4015781 4277400 4541703 4835958
11951 4835958 5138762 5457391 5826514 6210443 6636677 7108894 7588740 8116570 8676385
11942 8676385 9258156 9862580 10467532 11062851 11649173 12177027 12651287 13049597 13382275
11933 13382275 13604230 13746690 13761765 13653900 13432043 13105334 12659135 12180260 11670766
11924 11670766 11107263 10536561 9968388 9398148 8809682 8249954 7733371 7250953 6814244
11915 6814244 6340393 5931635 5560493 5206023 4900754 4614920 4354391 4126015 3891186
11906 3891186 3656015 3426314 3221233 3050722 2901487 2769732 2597071 2427049 2317422
11897 2317422 2245104 2133993 2032210 1944758 1863859 1797589 1729604 1648049 1574838 1503743 1432804
11886 1432804 1373550 1342640 1283436 1232089 1186281 1126436 1093114 1077213 1050153 1006523 1016991
11875 1016991 969872 907705 897910 873914 869994 838898 828238 769363 718462 695665 667735 664225
11863 664225 654920 636487 598090 602062 597733 558929 572343 543882 511614 523193 534252 521943
11851 521943 488504 457449 451336 463719 443077 417347 429685 425545 447571 455942 457823 440950
11839 440950 409503 353763 318371 315460 333553 348479 351891 337801 331198 333246 302844 269285
11827 269285 256272 249994 263477 274488 280264 246825 220334 212761 208877 234323 242280 232546 213786
11814 213786 190597 191496 195043 172963 151674 176467 177286 179833 172108 186819 204105 224441 238092
11801 238092 214138 208549 195874 149834 140509 139312 137774 146296 173853 178533 172590 155169 124809
11788 124809 119403 109547 138717 152528 129013 118399 142947 150805 130937 136634 140242 154924
11776 154924 163318 150280 133435 116128 120950 129003 139403 112622 84547 85241 91776 116395 118232
11763 118232 92745 67708 73501 63376 55200 76055 105702 127185 127458 144008 134156 115584
11751 115584 105814 108718 107047 72288 67439 90669 98398 83536 67788 76569 80459 94463 94682
11738 94682 87578 130735 163112 139108 116514 105513 101834 117766 96707 68753 77261 88128
11726 88128 95607 114141 137951 118757 87341 78058 130879 145137 139469 101297 79354 75225
11714 75225 32349 41352 55272 40112 33067 38831 45214 40328 62640 78574 115936 148311 145166
11701 145166 115313 91441 104328 107250 93881 73036 62380 70550 79923 72974 78005 81425 104075
11688 104075 119296 91764 70493 55056 19137 2604 19440 23996 10262 36436 37264 28328
11676 28328 19428 6917 16028 14747 26400 29359 6907 22166 70211 89075 92178 80173 76365
11663 76365 44660 52412 78368 86943 122331 129764 124870 111323 133249 149597 173794 180532 178842
11650 178842 164450 165969 156548 119978 93940 96907 103986 119707 135404 116094 122100 130824 148739
11637 148739 147995 187863 181180 180638 169714 168964 203225 196641 189059 170427 174456 154386 140725
11624 140725 127288 92911 63649 47360 72713 112780 115683 91483 60983 58095 67501 93630
11612 93630 103755 91126 64597 72455 68932 59878 60262 70004 81862 60813 11780 18802 43853
11599 43853 43508 8534 -12 9398 -470 -9045 -19175 9132 9989 17784 20587 25480 22050 10656
11585 10656 -41702 -43787 -21545 19407 15765 22829 33176 64100 55777 35501 23246 20738 39198
11572 39198 51189 31152 18663 16538 21762 38272 46749 57771 32777 13774 42477 61980
11560 61980 54643 24505 -305 10635 -4278 154 -2912 -3889 15345 10154 8495 11189 43373
11547 43373 42690 7154 -6697 10987 49022 49592 37453 49933 54187 51776 73233 46536 23064
11534 23064 11510 -1733 14832 6700 20588 54616 75089 58624 26762 31721 42043 21164
11522 21164 27428 62221 97306 69463 49421 44185 29007 25863 48308 74655 91372 84266
11510 84266 68975 58369 50509 18114 15965 -212 1731 5619 -9143 838 32493 18834 13032
11497 13032 -1231 -5245 30943 32242 3998 -19624 18641 24951 3393 -7483 -10591 2104
11485 2104 15052 14140 5328 26274 41063 63628 52427 36458 34574 26082 38075 43091 42935
11472 42935 47625 24290 15457 -3959 -2841 -8678 -4866 15471 4632 -16872 -15804 -5766 -531
11459 -531 -1339 -633 -26337 1439 40563 35488 15166 26160 -9473 -28991 10080 35936 38876
11446 38876 17359 -4278 25861 21663 -26680 -33856 -9690 -482 -6975 9538 42473 28385
11434 28385 -4013 -27108 -15268 130 8975 -37 -13711 23959 46025 47947 23359 11683
11422 11683 15869 18189 17515 27813 9374 21031 5648 -3766 -7853 10418 -5866 -14679 -27266
11409 -27266 -51955 -69860 -57062 -65839 -15786 -150 -126 -4108 -30725 -2404 36558 35486 39805
11396 39805 -13884 -24004 -6991 -17591 -28141 -7734 8628 28954 44846 41173 21559 -3028
11384 -3028 -14345 -22503 -45189 -37 11016 2406 7260 1675 -7439 1444 30309 37682 40574
11371 40574 31018 13865 -14408 4667 5283 6333 -7664 8181 36462 53236 37952 7791
11359 7791 -18785 -2345 9180 6068 19827 -8000 -49293 -58757 -2851 13300 -10941 -25055
11347 -25055 -21262 7414 11805 14912 16831 -1572 -23997 -26542 -9610 14228 26520 21706 11020
11334 11020 21127 28043 52082 48094 25421 -4891 -17260 6467 18699 39661 45794 56570
11322 56570 93918 78611 61842 32773 19940 16792 13877 -4191 -28014 -16179 11387 24611
11310 24611 32790 18998 18792 18726 1279 -20633 -22039 33193 38923 33317 45558 15253 -22346
11297 -22346 -29142 -11204 -11935 -597 -33078 -37771 -47184 -13347 -6511 -18099 -23282 -9550 -4550
11284 -4550 -3802 6604 -32731 -35651 -22716 -10041 5181 27488 48814 22516 -10548 -16181 -19364
11271 -19364 -11870 -821 -1113 34902 40585 10461 -1965 3797 26823 47264 31468 11374 -5559
11258 -5559 6985 21346 44514 38954 28470 19839 29390 5810 -17726 -19943 -21230 -1561 17164
11245 17164 21432 25230 40926 32176 44848 52416 26338 17988 5986 16197 21898 14550 9719
11232 9719 -6585 -25008 -28172 -8106 -8368 6688 22950 36951 18461 5535 -10940 -51457
11220 -51457 -65250 -54036 -50858 -32732 -5548 16016 12921 32197 59192 13629 3229 25891
11208 25891 43458 49507 45447 24597 27024 53782 57538 50564 57849 53296 47324 41383 63247
11195 63247 37531 1185 16418 41107 17092 -12742 -23062 -18382 16429 15644 21823 59685
11183 59685 26941 -5490 6069 15261 19498 27115 21286 30901 34468 7522 4239 -27726 -54221
11170 -54221 -71877 -51321 -31974 -2476 5110 -17234 -51616 -31807 -18333 -20436 -4320 -22563
11158 -22563 -14661 11614 49301 50048 -533 -8893 -35366 -34798 -43973 -15075 11222 -3172 -31723
11145 -31723 -18090 30758 27704 -24304 -50372 -65438 -50715 -39880 -25666 -8191 3041 -12536
11133 -12536 -27642 -20601 -19295 -36302 -33847 -17872 -8884 -38225 -51851 -59757 -22573 -8016 9785
11120 9785 3227 24161 28498 8414 20434 24546 39006 63376 17043 6975 -17355 -11930 -24206
11107 -24206 -12860 3378 24917 30976 26548 58342 62218 1821 -31858 -20274 -14930 9398
11095 9398 -3092 -37084 -28903 -15150 -38039 -24070 -7394 -2603 19483 24674 19440 4474 29477
11082 29477 32373 28946 11478 -10892 -25647 -35733 -47133 -20963 26620 30199 17152 -19943
11070 -19943 -31197 14122 23048 1345 -28990 -17050 6240 17859 31794 -2299 3990 -143
11058 -143 -2062 3029 9652 -11101 -21159 26832 91907 83323 57454 61080 55705 41208 43783
11045 43783 35807 79322 101078 81574 90256 99973 115777 123023 118345 142667 159696 175918 197589
11032 197589 237187 239925 229493 235651 225773 204260 221477 188763 162653 144276 177867 249319
11020 249319 333439 368707 364225 324728 280972 237613 212957 188217 152197 180223 210666 233141
11008 233141 257439 282225 255262 227324 163102 101596 92687 86379 93247 95278 139498 140616
10996 140616 154845 149247 106552 90962 99218 86130 55986 39922 36814 27380 30729 11039
10984 11039 -4935 -8760 -4595 -12440 -31178 -9826 22937 67632 73434 52941 56483 51182 37522
10971 37522 27041 19477 41703 37337 16471 8273 11939 19299 17525 -9046 17587 41625 25429
10958 25429 -3502 -5368 -29470 -33158 -18497 8136 12309 22052 8996 3738 -21386 482 7053
10945 7053 265 -8966 7063 -17834 -27929 -42133 -35384 -4372 -3620 -26560 -26121 -42211 -40236
10932 -40236 -15781 -21977 -9640 -5694 -15193 3156 5512 -5553 7958 27002 55089 65903
10920 65903 20210 21701 11321 25380 30668 3098 7249 12174 -1614 -21505 -23948 -6829 32793
10907 32793 21204 4613 -29380 -33115 -18601 -10333 -21587 -21528 -25878 -47453 -32782 -51005 -50642
10894 -50642 -55432 -57692 -12178 21728 -697 -36202 -51434 -39776 -22662 -3253 37250 42521
10882 42521 44406 59009 60743 65715 56275 76876 48309 43331 49931 50525 34364 35543 15350
10869 15350 -27363 -34587 -11448 -38242 -27078 4653 41362 67987 40372 69266 81787 53704
10857 53704 22005 -9776 6688 39335 61721 74869 66762 53944 23625 10970 22911 17525
10845 17525 2799 -22860 -8188 16986 -23806 -31841 6447 -9084 -31039 -21663 -16758 -15379
10833 -15379 13390 19294 31001 4537 10944 20071 31827 19214 19008 9892 -20370 -38127 -10239
10820 -10239 23757 22789 16598 17787 22585 42227 37778 42188 43721 52249 63519 52561 34310
10807 34310 8658 26491 59242 49775 28052 9200 41604 58262 46776 41542 9342 -32105
10795 -32105 -22638 14319 7752 -17594 -33092 -23312 -17949 9942 10954 -24116 -41716 -11637 38301
10782 38301 26218 -15722 -27379 1683 -19557 -32546 -37573 -18370 -27967 -25609 18636 -1836
10770 -1836 -24003 -4432 -9460 -14871 2834 27051 53802 67468 64767 43842 28743 15194
10758 15194 1293 23414 23486 40793 55894 50068 47475 31985 5259 2600 31244 56151 67987
10745 67987 70151 80831 49780 -14085 -48013 -32654 -6818 8711 20186 53844 35754 38003
10733 38003 13186 -31668 -21458 -13340 -3211 10195 -2702 9980 32535 17800 15839 26455
10721 26455 45987 39479 17018 44870 61280 73967 102029 103040 49158 20107 5581 12944
10709 12944 26055 6631 -9310 9674 28577 36238 24533 41109 64068 64973 73708 97928
10697 97928 105468 78662 62457 89450 115208 118349 95869 48470 59317 65528 82623 124031
10685 124031 114127 78329 68910 81931 95056 100870 107713 128908 125404 150376 121346 94323
10673 94323 96776 102178 102333 103787 107093 118816 129327 144616 161628 118305 105393 99244 108914
10660 108914 112327 142408 155220 155894 199818 211432 238195 218439 196947 192724 219775 201731
10648 201731 196293 220055 249670 257816 293729 315893 294085 323425 350247 351328 378966 418053
10636 418053 441545 461084 493435 563692 655972 766040 906532 1012314 1078743 1198912 1336645
10625 1336645 1463425 1605187 1824531 2186616 2647028 3230329 4081470 5287061 6982801
10616 6982801 9203503 11910033 14813758 17237658 18519440 18515861 17698239 16755030 16206754
10607 16206754 16420032 17699384 20317710 24493488 30050642 35896573 40182294 41418585
10599 41418585 39623605 36107259 32527552 30054133 29221256 30294824 33554928 39074099
10591 39074099 46226882 53352838 57638673 57246216 52555160 45714413 39021214 33890518
10583 33890518 30762181 29638344 30484352 33135973 36926369 40439938 41836042 40082953
10575 40082953 35619368 30012486 24821094 20849749 18280917 16983346 16727369 17286609
10567 17286609 18254474 19000838 18824899 17384432 14963894 12205727 9613035 7465538
10559 7465538 5816538 4593432 3678821 3016134 2554163 2179416 1908958 1718927 1553159
10550 1553159 1360616 1219695 1096514 969587 875698 778060 738465 688090 638200 624542
10540 624542 608099 582641 570684 559977 515879 473106 449205 429823 389802 348379 349553 335033
10528 335033 322034 320393 279991 297991 302120 278355 264456 245951 245715 252244 236100 257423
10516 257423 262319 237558 220209 205785 176975 185207 176229 146300 137530 161537 172250 170647
10504 170647 162540 155797 167797 160753 158296 179208 179950 141864 138832 129988 98977 88567 87539
10491 87539 89714 86985 111799 107813 106879 84300 120253 117585 89715 77928 70269 72061 40922
10478 40922 26596 -14145 29447 75642 86361 86059 99048 77202 66807 62887 82473 93047
10466 93047 80591 35133 9992 21306 10187 12604 30963 27393 -2385 24167 62709 54518
10454 54518 62988 79894 88102 94419 66388 45523 24332 -2547 -3549 36452 68722 38194
10442 38194 40699 56715 41073 21994 24468 44392 50758 43628 26060 33291 86241 99406 95867
10429 95867 89746 94248 68871 26560 11218 51289 77242 65803 45901 33693 16006 -2103
10417 -2103 -1498 13631 14889 8252 31207 57275 83653 85543 100633 113675 130083 125115 174934
10404 174934 180297 160938 163192 173367 166161 130976 95598 66589 64078 45524 78645 78580 72639
10391 72639 110636 111300 83859 70256 42637 45225 47372 29893 37480 71711 61091 59385 72169
10378 72169 103818 84214 61695 44600 14251 19535 51852 48319 34401 35057 -6879 -15131 5684
10365 5684 9130 2808 5825 16194 42795 34173 8077 6371 11774 -6760 -17892 3170 26622
10352 26622 13003 -33415 -13407 23709 39557 20482 8806 11365 27477 43240 38499 34466
10340 34466 37331 24969 46419 58329 57460 92973 101676 73971 58372 45178 41422 11983 -7423
10327 -7423 -6276 -16254 5024 16731 45290 29741 7112 11261 36283 43275 65139 24017 -998
10314 -998 14131 41155 67602 76489 73301 65792 48792 24849 8837 38574 46020 -16268 -10205
10301 -10205 26100 48606 59552 54182 9970 -28528 -23461 3963 7163 12424 -18178 -5808
10289 -5808 33897 65578 65645 53854 12428 7544 8065 27084 37507 33370 49282 25011 -12926
10276 -12926 -2616 8300 -10257 -508 11107 -7089 311 45501 55435 64507 69285 68725 16715
10263 16715 21347 -15565 -28560 -17273 -36057 -36620 1126 -14509 -42323 -47784 -11822 3109
10251 3109 -6573 42073 50142 58211 43997 45920 44945 39955 29190 4428 -10340 -8566 23209
10238 23209 47415 89116 60613 41617 43119 46148 26407 8798 -13300 -6031 5547 4543
10226 4543 13944 2876 353 16826 -7783 -36619 -12965 -2325 -16191 -50202 -19057 -26396
10214 -26396 -7867 18867 10897 19135 26724 -1810 43110 40772 18018 24539 37526 29067 20634
10201 20634 11454 5542 -13366 10362 -1318 -30782 -31201 -14776 13812 40928 58552 84310
10189 84310 61463 29373 40730 29814 3156 22162 73050 61002 37593 50084 57906 46343
10177 46343 41910 73282 109332 108041 90315 75046 86944 112935 127801 137941 110404 143805
10165 143805 185215 222064 221990 208262 170408 144721 150715 165712 182694 221935 250847 271817
10153 271817 302849 354463 338578 292537 246578 224942 187637 151274 108858 132266 167984
10142 167984 174837 171815 163592 179987 170028 144232 153337 138845 111189 111522 104891 99701 66915
10129 66915 48212 68413 84482 53673 58550 58033 52426 41268 38641 7288 4429 -2797 -14363
10116 -14363 -30803 -29558 -47419 -34234 -11348 28000 70292 56767 35707 41373 33894 34983
10104 34983 12763 25250 81293 119805 110092 78517 32737 -11292 -4468 11248 27309 18489
10092 18489 5626 686 -1883 14678 2741 -4200 -783 -8345 25642 25413 -26944 -39396 -41963
10079 -41963 -46065 -39398 -29402 -7708 -20944 -21101 -27496 -18404 -11752 -26478 -15854 15534 32082
10066 32082 42727 20462 1355 6683 759 29230 59685 58980 26993 8576 -8604 -21588
10054 -21588 -2178 -33330 -29308 2563 -12117 -26560 -27209 -23592 -26877 -24130 -8016 13434 19537
10041 19537 2850 4759 10754 -2978 -20063 -38755 -46295 -59809 -47511 -18214 -7220 851
10029 851 7072 48 -25351 -18962 847 -20428 -4466 -12345 17244 21012 32889 44307 25044
10016 25044 4985 -5288 -12352 18797 26758 8350 -5752 3318 24390 21039 19806 -17419 -9743
10003 -9743 39138 43551 -5547 -29600 -26395 -7233 15067 2415 -50959 -75256 -67547 -64521 -44081
9990 -44081 -9678 18909 29985 41289 18265 7274 18663 17201 35893 24514 -10716 -22576
9978 -22576 -8532 -16304 -6516 2889 -1081 -16778 9537 49308 58161 46443 4185 4775 27699
9965 27699 18115 14600 11249 17091 24126 17488 12566 24004 44658 48645 44502 49551 26932 -10359
9951 -10359 -18270 -18970 -24918 -2288 5417 -4192 6075 20984 -5851 4878 7937 -21646 -33156
9938 -33156 -16431 -41801 -52859 -46375 -51238 -44407 -40507 -13570 27040 33743 14405 -4568 -2075
9925 -2075 -22690 652 6886 20081 34379 70094 29460 -11591 -24542 5122 18983 6332
9913 6332 -9850 -43088 -47720 -58170 -58570 -16967 -8093 -26758 -1884 -22898 -11358 21316 15235
9900 15235 15744 4130 13386 10972 -3062 -12743 -9284 2521 25686 20599 3315 -6362 -1613 -1932
9886 -1932 -13313 -7816 19963 37841 33039 28502 19169 33589 46151 52272 51736 29723 -929
9873 -929 -41925 -22340 -7733 -12075 25024 34052 504 -20178 -5614 9589 -2848 11320 35114
9860 35114 51200 72616 70427 27880 24451 39846 28578 2761 5955 -34590 -45917 -61667
9848 -61667 -52430 -42299 -28441 -9159 8974 -18383 -43551 -52243 -79313 -55807 -60020 -62971 -42362
9835 -42362 3153 -812 3562 23681 20799 -484 -7614 18366 22496 18131 12498 20825 19660 10873
9821 10873 13246 16501 16265 33664 23924 -5700 -4904 -4132 -16398 -52192 -41806 -18936 -14822 -45281
9807 -45281 -47148 -56879 -45116 -43966 -44468 -46171 -71100 -82884 -50252 -43340 -36909 -9233 -16315 -17014
9793 -17014 -9999 -10971 5640 -25688 -24925 4191 10503 26976 -18972 -34404 -30143 -22330 -4325
9780 -4325 12107 1413 -13738 -1028 10273 25298 -963 21443 4444 -19760 -4106 -22433
9768 -22433 -16656 -9362 -28020 -15556 27067 43067 12859 -24645 -53922 -81796 -78814 -63971
9756 -63971 -49584 -41508 -57948 -37863 -10721 5537 33035 45901 14972 -35987 -22292 3149
9744 3149 12211 8645 18518 11501 9200 32268 60074 66190 42447 -3205 1411 10705 9107 12681
9730 12681 26163 49352 61648 60661 36798 20271 -220 -22097 -18447 -15802 -45849 -84629 -79005
9717 -79005 -41864 -2057 9589 21136 26665 37680 15721 11919 47800 21705 -1001 4122
9705 4122 21574 19101 19317 -6881 -10212 -24089 -12345 -13137 -18980 -41984 -50131 -41328 -49483 -64482
9691 -64482 -52609 -26798 -25930 -45884 -39267 -43335 -7441 -22611 -37542 -26455 -59299 -54189 -23235
9678 -23235 2085 4848 -2026 -46926 -48881 -49562 -37285 -33742 -34138 -4766 4157 -3143 9589 5071
9664 5071 711 20655 -19060 -9061 -11131 -17756 -33697 -66649 -67725 -63214 -52667 -21646 15975
9651 15975 46345 83476 77485 65716 82878 40170 8614 -3197 -45860 -51088 -35670 -21075
9639 -21075 -2631 -10317 -16554 7265 35136 5244 -2599 6776 24154 4998 33711 62853 17402
9626 17402 -21148 -7774 -943 -21117 -61438 -25118 -8659 12749 10004 1352 -2233 -16836 -17215
9613 -17215 -34805 -53804 -49100 -36095 -25345 -27428 -32734 -54370 -77067 -87564 -62359 -45824
9601 -45824 -17454 4728 16407 8405 -29555 -40832 -23140 -5777 7218 17000 -17394 -51608
9589 -51608 -34715 -39555 -50633 -39624 -55465 -57245 -37320 -44143 -50371 -22681 26197 35147 31914
9576 31914 30646 19403 13094 17515 33910 26845 608 -5543 -9297 10749 49537 34927 41780
9563 41780 39358 37957 41429 49286 40296 8781 24737 39297 8602 -4449 -5783 1070 -739
9550 -739 -14160 -28826 -28798 -27298 -45304 -45317 -5155 -11011 -15251 -1466 10029 16906 3811 -4606
9536 -4606 14997 2433 -9255 -3131 -41374 -65784 -74963 -67082 -22972 -4495 25427 22521 -747
9523 -747 -16498 -19057 -166 29969 42734 7850 -4202 -251 -859 14569 28796 44321 10075
9510 10075 -10025 19064 23371 13078 12668 40841 34493 26597 43543 24681 47205 41385 -15396
9497 -15396 -25539 -30881 -35638 -54643 -53962 -26796 5663 -822 -12613 -33213 -58211 -52596 -23406
9484 -23406 11407 3270 11478 25796 39795 27156 -7724 -8269 50 2057 17034 3094 -27521
9471 -27521 88 28984 16660 3844 -26032 -26892 7302 -9092 -13487 -4849 -758 6142 13731
9458 13731 -31227 -22090 8943 44170 23156 11640 4155 10426 5813 -166 -8069 -5468 12786
9445 12786 18105 19574 20990 37580 19114 8177 33127 38891 9449 -36166 -37352 -21523 -49402
9432 -49402 -23139 12547 47414 31020 14893 36035 27063 40116 59711 43726 22811 8400
9420 8400 -2255 3910 8462 3766 -32304 -47026 -44740 -25429 -8540 -14211 -19985 -64422 -80617
9407 -80617 -51876 -37807 -58100 -32382 -17947 -29511 -33576 -38981 -27028 11217 26846 35459
9395 35459 7117 -6271 5490 15166 18567 20276 20869 -31897 -64326 -42929 -14174 7752 35557
9382 35557 33788 1441 -2379 1296 -1542 20491 15512 31264 18437 -14393 -23912 -29137 -25045
9369 -25045 5919 15223 12652 4562 -6548 -26928 -47515 -44430 -17994 7580 20979 20672 12184
9356 12184 31527 54832 39188 2237 -20217 -29650 -43055 -44969 -15156 -74 4946 3503 6323
9343 6323 9964 -7567 -29226 -41752 -44505 -14911 -10386 -27533 -44305 -10892 26678 46283 54848
9330 54848 58992 55694 49587 75104 46466 -5117 12400 13861 -3095 -9526 -9276 -8902 -20775 -50095
9316 -50095 -49585 -71298 -68752 -28672 -16828 4352 48890 45871 65764 50847 20178 8218 19299
9303 19299 8151 -3535 -21350 -31851 -10702 3582 -1432 -19836 -22996 -45170 -71949 -56518
9291 -56518 2273 35369 7223 254 16512 -8926 -29600 -37634 -35842 -35094 -43571 -15638 16647
9278 16647 -2436 -41660 -50075 -35753 -4342 21556 24592 18014 11166 4991 -32153 -71023 -51616
9265 -51616 -30260 -17924 -17182 -14585 -13386 16585 -428 -2214 -7519 -14528 -46278 -48923 -18700
9252 -18700 -17647 -18287 510 -12960 570 -8005 -34162 -18022 -34013 -49429 -27266 -30859 -43923
9239 -43923 -12861 -15964 -7824 -6318 -25482 -14294 -21006 -2589 14369 5221 -12843 6450 -504
9226 -504 -17104 -11396 -7613 16732 587 2936 -15392 -51999 -44171 -28612 -27660 1510 -22621
9213 -22621 -53525 -65868 -16838 -6845 10911 16952 12662 -4210 -23907 -19335 -4272 -10738 -11731
9200 -11731 59689 69745 25764 4892 20658 30806 24167 20166 52420 29416 -27283 -17877
9188 -17877 2483 -2131 -1740 -856 -13095 -49883 -57224 -32204 4848 -4667 -9775 8544 34288
9175 34288 19854 -2108 12323 35130 36026 28537 41484 41483 15388 -7848 -15072 -2449 -1942 78
9161 78 -29427 -47056 -33860 -46185 -32473 -18542 -56962 -69646 -71527 -38940 -27714 -26586 -45079
9148 -45079 -61679 -40599 -38964 -27447 -21413 -15657 -8022 34040 42768 46001 33568 16853 20998
9135 20998 7391 17736 28950 28659 6946 -27055 -5293 -21372 -53954 -95568 -58150 -13243
9123 -13243 -2576 3391 -2308 23099 40804 48197 53625 33375 -14391 -41436 -68685 -74824 -64049
9110 -64049 -33619 -32831 -33991 -42034 -45291 -13487 -6368 -11661 9011 12695 -16220 -30215 -32176 -34456
9096 -34456 -54819 -31347 -4436 -35698 -9359 14600 2845 2963 4754 11820 11661 -21330 -46728
9083 -46728 -26476 -14631 26586 28118 16714 14732 24081 32219 10057 11040 27498 21230 36968
9070 36968 29407 -7296 -39087 -39522 -31548 -16350 -10408 -13184 -22120 -31562 -29959 -24966 -37791 -24094
9056 -24094 -2123 -13328 -34773 -47977 -25879 -8444 -23231 -29617 -38434 -36780 -42107 -47886 -49908
9043 -49908 -32257 -6844 -23424 -16854 -27608 -42863 -56247 8572 40897 13126 571 36167
9031 36167 39666 13953 1858 25197 -3110 -17781 -343 -17862 -14149 -15329 -10883 -18352 -36663
9018 -36663 -52281 -41424 -22303 -4579 -7380 -11033 -19667 -11713 -10370 -13151 -10056 -43046 -50310
9005 -50310 -50747 -38261 -39825 -51769 -38729 -47193 -17738 430 2976 22743 30094 44373 47018
8992 47018 11324 -21037 -22362 184 24119 -3672 -14429 -11000 15191 36887 34696 8976
8980 8976 -6475 16226 36575 10497 5840 2179 -4631 23001 27125 -5107 -22550 7380 18932
8967 18932 10645 3994 8308 14194 16739 28547 21039 31679 40910 21829 56291 46521 31096
8954 31096 37872 19178 11762 -4681 19063 26401 -19393 -32501 -52133 -50304 -44404 -34851 -1659
8941 -1659 -15614 1266 -1659 -20989 7971 -4516 -26184 722 -7877 -20592 -30305 1374 -18947
8928 -18947 -50357 -14939 -12570 -11169 2973 12598 8104 -3576 -10873 13881 28074 23683 20137
8915 20137 8977 -13126 -6466 -23978 -16001 29678 6115 -51501 -99117 -125675 -108857 -74019
8903 -74019 -51982 -15979 -32326 -49317 -53403 -58799 -60535 -41357 -6992 28071 7385 -16317
8891 -16317 -42653 -72340 -85462 -81861 -61737 -53950 -53260 -51113 -26307 2229 31693 19635 -10364
8878 -10364 -20000 -21443 -18166 -13516 10931 -10222 -21221 -8679 19477 20008 17973 25764 16492 1397
8864 1397 -6506 -20927 -19868 -10388 -14741 -37646 -35824 -23757 20570 22162 16664 10038 -24072 -41849
8850 -41849 -69483 -73408 -80587 -93670 -65981 -29093 -4986 16663 21919 6396 -9697 -3916 27413
8837 27413 31694 26759 23778 -2999 -19162 -9682 37697 26164 84 124 33787 56147 43127
8824 43127 32954 30443 7558 -12068 -6139 9071 28997 43746 53650 37805 18327 14910 -17069
8811 -17069 693 7123 -26147 -45963 -16601 15977 12378 -29236 -37717 -16999 -14040 -26027 -5078
8798 -5078 10144 5934 -28202 -21292 -20039 -38530 -42068 -23655 -13298 -4745 -15294 -4158 13965
8785 13965 1432 -11384 -19547 -19410 -14987 -6277 2632 1068 -31569 -33929 -13083 -18612 1332 5271
8771 5271 -9956 -11958 12022 1777 -32718 -25997 -16211 -20489 -35367 -45349 -45239 -26999 -15329
8758 -15329 10934 33355 14532 -14843 -3246 -13312 -2477 13612 26166 7402 8265 -6107
8746 -6107 -37459 -41119 -31986 -22311 -6262 16842 9933 -4951 -6377 -26077 -37381 -25772 -4098
8733 -4098 -21862 -39374 -51556 -20042 13131 23077 37071 69832 61563 43796 49197 41575 27509
8720 27509 9442 13429 33689 -1790 -1722 5242 1050 -30413 18515 41560 42220 36836 13077 10960
8706 10960 16930 28100 35831 10659 9150 22655 -1375 -13549 -12354 -18511 -19363 -2092 4868
8693 4868 17959 35666 34008 36788 46041 43539 45887 55938 29057 -7674 -15784 -16094 -16739 -17840
8679 -17840 -46199 -28844 -19674 -26279 -46352 -55418 -56083 -51218 -7472 27352 30875 2162 -4236
8666 -4236 -14792 -7215 14974 28027 44684 39138 65626 36026 8160 3989 39476 9102 9518
8653 9518 28042 17136 27740 35810 56153 53119 42149 21574 14532 23616 13655 -34416 -33181
8640 -33181 -26903 -44891 -55584 -12304 34286 40324 34358 29434 18590 -6155 -6412 -12049 -30564
8627 -30564 -38014 -23327 -30318 -24896 -37877 -36548 -28198 -64543 -38030 -38800 -28826 -11438 -3269 -5507
8613 -5507 -38500 -53609 -66264 -35930 2866 30084 34946 36160 34359 32820 22190 -12209 -36520
8600 -36520 -42879 -4812 16045 25 4798 64514 84288 77605 46804 33492 25531 -624 17983
8587 17983 48656 33088 29649 32647 11367 16143 17675 24139 24244 23866 12621 -1777 7108 32372
8573 32372 -6216 -41921 -16731 19758 33346 30531 25225 31498 44665 63502 35492 27818 33194
8560 33194 45283 23476 -3830 -4829 -8439 -7660 -20807 17957 16212 25652 25991 20240 27850 29103
8546 29103 7924 10295 18905 36922 29122 17126 28540 48943 28902 35298 7094 -16077 -8675
8533 -8675 6232 6976 -14320 19190 17155 47786 67375 37652 57132 45089 30766 -2821 -30497
8520 -30497 -29487 -14334 -15488 -51385 -39565 -3595 -42577 -45337 -14647 -13690 679 21270 44487
8507 44487 42768 9790 19131 30598 57719 74325 80552 97130 56743 31170 11204 -1575
8495 -1575 24128 24896 37704 35553 32839 7757 -20411 -12406 25007 24007 -23124 -34483 -21425
8482 -21425 -23244 -37819 -29448 7569 35585 24651 28642 31298 32537 42794 13684 -5880 -1550
8469 -1550 -16531 -17788 -27001 -30621 -28108 -26220 -38082 -64353 -50296 -45406 -32902 -21669 -23988
8456 -23988 6752 13979 -7328 -28199 -13349 -6614 -7076 -20590 5400 38943 56427 26057 -10646
8443 -10646 -14640 10043 -3283 -28551 5683 46821 60395 52861 15286 -9847 -47278 -59634
8431 -59634 -50018 -75656 -48399 -3687 244 397 -23081 -16469 -24295 -26676 -30323 -31347 -41291 -22589
8417 -22589 13348 32281 -731 -56321 -19214 2386 -8816 22091 11947 4775 2295 -6100
8405 -6100 -35082 -49774 -44190 -63964 -81118 -41462 -22148 -5289 -18769 -39298 -62971 -47468
8393 -47468 -27271 2792 -707 13298 27203 -2130 -39910 -49521 -44025 -8105 54194 67504
8381 67504 26521 -4869 -20228 -14105 -14759 -25109 -35933 -28485 -47811 -9817 -5791 -18965 -26365
8368 -26365 -18056 -8394 -1428 -15875 -34912 -54741 -93977 -99568 -33845 19970 25619 29434 34132
8355 34132 44939 46551 49885 82078 69361 55734 86670 70773 51569 62794 49349 18731
8343 18731 31885 58704 68098 131500 196630 197938 157851 102621 78615 32305 2847 -7273
8331 -7273 16487 25849 10709 15847 3075 -16237 -23359 2904 34133 29138 16491 -3097 -10318
8318 -10318 -14131 -16153 733 2482 -6175 7335 -5433 10626 38160 32285 35570 13186 2525
8305 2525 25094 47999 55713 76505 65398 52154 50272 89879 152005 273407 374646 371583
8293 371583 288862 180921 111995 60266 65762 30179 26521 16823 25922 28452 13090 11544 -10495
8280 -10495 -23552 -31610 -29631 -21758 -22517 -35957 -46762 -30077 -11120 26197 40455 -520 -1257
8267 -1257 10942 53888 44292 14110 -5877 -29236 -35319 -23500 -15458 -1990 5875 25101 28951
8254 28951 33293 81977 117908 179527 214454 166186 101858 64688 51377 34477 23201 7053
8242 7053 755 -27765 -12185 19088 63236 77595 42198 33123 18724 16678 42188 42219 38564
8229 38564 41070 45709 6898 -43846 -40756 -29896 -2553 36289 48156 22208 25112 48371 79618
8216 79618 69569 36583 33237 25853 11269 -36648 -58740 -40806 -9730 -19477 -8255 16714
8204 16714 19507 -3063 -25875 -42716 -31127 -23819 -37238 -40831 -66730 -49116 -38903 -45639 -47344
8191 -47344 -48324 -57449 -24223 -13458 -17990 -16194 17141 27511 -20704 -27169 -43255 -43255 -44832 -60830
8177 -60830 -59606 -33510 -33189 -15495 -27085 -48646 -50239 -30117 -35523 -46461 -41593 -16147 -10513
8164 -10513 17327 40153 43098 43757 16609 -22983 -42023 -22335 -9121 -10227 -35545 -2563 -6926
8151 -6926 -39875 -45903 -17705 -22890 -8587 4391 9817 29995 28336 33698 -1343 -23648 -36652
8138 -36652 -45252 -28124 -10039 -16318 -32296 -16279 3878 12690 16961 25034 29772 22063 15699
8125 15699 -4720 15701 32142 16981 -4631 29742 20592 27088 25871 34992 35389 28750 7022
8112 7022 -3726 7377 16312 35431 39228 46341 54298 22426 -12795 -39234 -40805 12480 48127
8099 48127 20858 15790 24253 -7541 -34141 -29979 -17754 -18023 -16195 -23710 15802 47058 17950
8086 17950 8079 -1256 3548 -14304 -41602 -46554 -27679 15810 18472 82 -4725 -186 -13933
8073 -13933 1645 -16951 -16142 -27214 -49431 -25927 -18914 -40562 -53528 -28733 -17782 -11346 9323
8060 9323 -30696 -34116 2728 18102 18388 14787 7852 -5529 -1916 -3366 -8094 -4115 -7262 -15710
8046 -15710 2277 1312 -15974 590 807 5722 8819 21433 17705 18364 -1163 19564 -15693 -44378
8032 -44378 -41732 -49600 -41954 -14778 21686 -12434 -60505 -32648 -896 107 3625 47172 47790
8019 47790 13418 8328 13156 25502 21391 9410 -6079 -8178 1859 4908 8431 39987 17842
8006 17842 5941 27510 -10515 -52066 6540 17041 12777 4004 -9978 3967 21020 -1594
7994 -1594 -31069 -54292 -35624 -13024 -14107 -6806 -8603 -18861 -40121 -34967 -25476 -41745 -59557
7981 -59557 -44859 -3251 22286 21196 5602 -2204 -30708 -47136 -10753 38710 18657 49688
7969 49688 19505 -22265 -25635 -34787 -15595 19264 17427 4693 15032 25045 61957 56147 29241
7956 29241 12504 35678 15148 -17426 -31879 -33214 -42579 -40930 -35210 -18930 -30956 -50031 -46138
7943 -46138 -28928 8564 12670 1757 -5410 28467 50568 39992 45233 76662 84397 57891 46092
7930 46092 13209 41643 69830 46999 55378 59133 37575 4743 9694 35347 53415 48931 23240
7917 23240 13618 19178 28640 28703 -15971 -23643 -11352 16482 50227 12429 9181 27072 3108
7904 3108 9441 11890 34620 39495 8927 27089 2915 -30210 -31686 -16540 19233 16740 13035
7891 13035 17759 7872 16619 6335 -4132 -4920 1610 26918 4570 -17917 -18522 -15149 -58320 -71548
7877 -71548 -52796 -36417 -39899 -21210 34311 38022 23573 -8905 11297 25792 20744 28827 26414
7864 26414 18941 45826 45025 26156 637 -5695 26060 18464 -12837 -10296 -6094 -10927 7142
7851 7142 21293 32099 9418 24867 49631 43379 17717 4099 -3001 1908 -4903 2061 -7099
7838 -7099 -32374 -54075 -36869 -20844 2413 7068 32624 52528 43937 51786 43052 16946 16903
7825 16903 19117 24 -22010 -36298 -9082 -19270 -63535 -91164 -77899 -17400 8099 -30616
7813 -30616 -25451 -28402 -64505 -87889 -77585 -33023 4799 33869 10804 13297 19887 4094 -12308
7800 -12308 -34947 -13883 20048 11438 -22474 -38489 -29943 -18800 -20348 -29022 -24918 -9978 -6246
7787 -6246 -27033 -55088 -81024 -44865 3061 -17371 -37149 -37164 -32495 -34071 -37174 -20029 -20365 -5177
7773 -5177 14370 24505 26124 30314 51099 64376 59903 41428 -7598 -48616 -28551 -3556 1959
7760 1959 4418 21060 24463 -8738 -28073 -16933 -6202 -12309 -23488 -3320 6607 25348 34282
7747 34282 13397 9506 8448 -735 -16960 -18883 -10851 -8233 3759 4473 11565 5301 -19873 -51731
7733 -51731 -45793 -10479 -45087 -51351 -29607 -42499 -26792 -25626 -36988 30914 38963 19417 17373
7720 17373 31474 41626 38812 20969 -1221 -24912 -16303 -8459 -1949 -4667 -26008 -43721 -42879
7707 -42879 -29408 -2977 12084 6965 -15465 -38456 -60681 -48898 -9773 -13275 -39717 -8751
7695 -8751 11644 25718 6432 -7472 -38636 -60453 -74495 -53210 -27795 -23363 6573 25071
7683 25071 -21991 -24301 11394 18819 1863 -18050 -29897 -41351 -18433 -42842 -85680 -56012
7671 -56012 -23625 -40463 -7354 14399 15498 -2100 -6032 -17034 -36131 -41156 -77866 -69570 -38110
7658 -38110 -8878 20449 26887 24610 -16976 -66570 -51891 -44870 -18406 -9017 -10196 775 19962
7645 19962 36763 -5615 -73269 -54006 -33615 -21364 -35700 -43571 -65285 -61258 -66949 -48229
7633 -48229 -64915 -53056 3076 20110 -21529 -32376 -23407 -14727 -38332 -28022 -15193 -5382
7621 -5382 -28996 -27846 5744 34793 45200 6371 -4958 1037 -4242 -23298 -26007 -27487 -30891
7608 -30891 -21851 -10978 -4628 -2997 24178 10352 15522 11853 -27193 -51810 -34361 -18604 -14640
7595 -14640 11802 9812 34279 52220 49659 46683 39801 8551 900 7326 52157 56979 20840
7582 20840 35520 26105 -16648 -41405 -57341 -42553 -53661 -40674 -31034 -57278 -41965 -3657
7570 -3657 21413 2683 -11133 -25823 -27982 -20928 -35564 -12205 -12231 -3058 -39528 -62406 -52933
7557 -52933 -20452 -5736 -23394 -52883 -31561 -15861 -22097 -34991 -36487 -37465 -3636 319 -25518
7544 -25518 -7627 29078 32629 43801 42938 39935 45566 57501 72917 78392 16611 8894 -3769
7531 -3769 -35696 -28126 -15137 -3714 -14159 -13633 -16839 -34075 -25376 -16621 -15843 -25261 -29498 -26299
7517 -26299 -21069 -23503 -45869 -66769 -65479 -52774 -59095 -35610 -20879 -31182 -36050 -16937 -32059
7504 -32059 -60700 -64148 -58967 -46073 -28401 4433 -893 -16164 -13749 -17853 -2555 11141 5785
7491 5785 -5612 -17315 -47079 -58222 -67187 -82359 -91261 -69209 -48830 -8142 32523 3292
7479 3292 -29479 -29936 -5390 19369 16335 17388 34490 23585 36133 -4146 -44013 -14700 1081
7466 1081 -2728 -15156 -8234 -35926 -68224 -71367 -55177 -1710 36375 33087 -5862 -5183 -10133
7453 -10133 18199 13739 -17050 -20675 -24946 -17740 -14398 -22276 -31490 -46502 -66286 -66890 -20363 3866
7439 3866 34922 35267 52133 43436 58868 81225 45231 33807 23969 30667 36959 45444 72043
7426 72043 93672 81412 47841 39258 33023 18631 -9285 -21741 -20920 -16499 -24354 8170 28927
7413 28927 43739 17173 3949 5956 8251 7118 5873 -18688 -18790 12994 2483 6980 2487
7400 2487 -3910 -18415 -10823 16691 35719 31998 13442 17650 40385 19929 3257 1592 14664
7387 14664 14652 13911 24304 45140 24187 53059 46959 17860 17144 -1845 -11451 1020 -628 -15048
7373 -15048 -5782 -11756 15383 53796 57811 23620 18796 19695 2693 -12701 -18887 -10861 7266
7360 7266 -10392 -16012 1542 6999 -12217 -35901 -18711 37164 22541 -9854 8244 10738 -5677
7347 -5677 -12139 4931 26512 58786 36052 16902 19724 -535 60 9364 14355 21384 35671
7334 35671 18903 6896 2936 -29593 -17678 32857 25095 58958 44344 15789 6050 2373 13668
7321 13668 24004 9323 -954 -5218 -2336 16643 19161 16022 5262 -14255 -36725 -22577 -23929
7308 -23929 -3340 -12357 21531 31896 27056 37786 24509 23229 -18990 -49044 -53037 -37086 -21547
7295 -21547 -12616 -11208 -7447 -2678 17719 4839 15847 50668 36213 -7229 -35215 -40487 -33814
7282 -33814 -27753 -9164 -217 -15623 -11145 -7155 -8663 14961 25431 1694 -61433 -72891 -15198
7269 -15198 -33896 -49873 -53556 -34769 -50663 -48111 -28444 -17576 -26238 -34442 -43621 -67353 -90405
7256 -90405 -103681 -65412 -53043 -63282 -74925 -67067 -40260 -20721 -10705 -13487 -18120 -4515
7244 -4515 -36187 -70008 -80011 -60702 -56880 -42540 -17413 -16041 -30850 -24123 -13434 -3463 28973
7231 28973 34912 34415 28080 1363 -8319 21897 56901 33180 -2107 5790 27481 11533 16224
7218 16224 24787 20174 16334 -6078 -6584 20390 18769 11630 -3471 -10549 -25693 1903 12058
7205 12058 44478 56932 51645 31175 -2046 -43632 -26517 22457 29748 6598 -15283 10093
7193 10093 30702 -3308 6436 28456 18885 -4755 -20312 -23702 -17274 -28062 -17160 -1060 -22005
7180 -22005 -54791 -40188 114 11502 16638 13167 22857 23650 8991 47848 54398 23903 14305
7167 14305 5831 -15446 -32810 -28652 4947 19304 22037 9013 9021 -9649 -12821 -11038 -4401 30176
7153 30176 18007 -14547 -35331 -48024 -61885 -72433 -70373 -52739 -50709 -36357 -569 -19914
7141 -19914 -41400 -29745 -12710 -6842 5113 20412 -10597 -32843 -27884 -36394 -2416 -419 10745
7128 10745 32092 43214 17390 2186 -26756 -18056 2501 13000 42918 35151 5341 571
7116 571 10817 31221 1919 -14800 -12012 -12326 2 7692 17690 11455 -43576 -35833 -53089 -52710
7102 -52710 -38696 -32909 -40617 -41417 -42227 -8674 -4519 -5354 3823 37340 29429 -19140 -48643 -27633
7088 -27633 -14618 -21430 -62529 -44722 -12817 -256 863 18710 20488 7117 22486 33572
7076 33572 19233 15450 -13170 -21957 -22950 -19752 -26466 -33527 -21852 -23301 4660 -1159 -10653 -27912
7062 -27912 -36710 -57092 -62515 -67161 -66067 -67373 -35285 -21969 -25268 -49527 -26939 -3543 4301
7049 4301 24116 26003 39692 13751 -13494 -23571 -28144 -54721 -44507 -24525 2109 30557
7037 30557 14819 -407 -16582 -22513 -15283 -5575 15997 35949 40574 42187 39473 19623 -4100
7024 -4100 -5912 -26002 -38880 -77724 -84611 -48540 -12551 12462 2340 6341 -22732 -68491 -58898
7011 -58898 -48443 -36762 -22160 1791 1735 -28890 -38545 -37491 -31734 -39303 -23083 -3121 -14087
6998 -14087 192 21205 40884 74154 20613 -1574 22317 10047 2837 -34 -10592 -35619
6986 -35619 -49369 -24874 -3165 29030 12027 5959 -2832 -5232 11055 36937 47251 45484 34478
6973 34478 23780 9631 -13065 -18631 -7529 19999 2044 -7756 -11995 2429 44737 60430
6961 60430 25004 12962 11070 -7695 -17528 -11594 2412 2545 6047 -13665 3984 2922 -12778
6948 -12778 -7274 4165 -7107 -54964 -24673 -10330 -14505 -3150 14232 50750 97983 82474
6936 82474 22889 -13640 13775 -4038 -8720 -20354 -30918 -47441 -54914 -41888 -14807 14514
6924 14514 1889 -11830 -15756 -26551 -25894 -25373 -24023 -20154 -49791 -49182 7530 9674 13371 -6470
6910 -6470 -23811 -39360 -29491 -13186 -42956 -50833 -36447 20386 2932 -5889 -60276 -119353 -111939
6897 -111939 -89339 -87212 -64276 -44375 -53293 -47970 -4524 -7174 5296 2953 -28838 -21385 -11823
6884 -11823 -13170 -6669 10843 -3101 -19105 -53923 -36934 -13970 -16316 12820 53449 69711
6872 69711 35627 26603 51335 14926 -25049 -10020 -23547 -34537 -44114 -59867 -63050 -67909 -51991
6859 -51991 -24413 -33032 -24401 -14755 -399 31956 -4763 -10809 -766 1624 -8251 -48362 -29089
6846 -29089 -29015 -13984 1312 -8469 -16541 -14877 -6265 -1248 -16626 -19544 24477 3499 -19803 -45418
6832 -45418 -41474 -58135 -90431 -58332 -19912 -15764 2677 -23407 -22408 -1083 -8211 -58557 -75993
6819 -75993 -86480 -75671 -52629 -18720 -2289 -44923 -48425 -28721 735 -14804 -65049 -64797
6807 -64797 -42517 -34955 -21342 -28461 -31037 -31973 -19486 17729 53367 70280 48713 30268 20642
6794 20642 30535 22223 12459 30708 47438 31158 34960 26527 47462 51736 32364 4366 16441
6781 16441 7421 1986 18431 6410 -256 -907 -2519 -26486 -27763 -10870 -22424 -30993 -18768
6768 -18768 -39296 -53262 -40077 -41250 -28819 -12016 -2233 9913 15873 -1522 -30005 -16560
6756 -16560 10261 -1233 13258 -5149 -17336 -1360 -31937 -4477 11139 -4071 -6082 -9510
6744 -9510 1152 17659 15052 14106 4247 -320 5282 9803 -46 -24894 -21102 -2033 -1318 -11295
6730 -11295 -44844 -61376 -38299 -27445 5118 -9891 -16400 8994 5513 18717 20165 -5027
6718 -5027 -14267 -17265 -5775 -1747 4106 15631 10529 -6653 784 11178 24567 -8621 -13240
6705 -13240 -11614 -24913 -28122 -18875 -44617 -29732 -32826 -32715 -39558 -42629 -39108 -51204 -30966 -28428
6691 -28428 -31174 -8440 11974 -9637 -23684 -33832 -62993 -51709 -21263 -36582 -10947 17777
6679 17777 19679 25710 10280 5772 -19493 -38007 -40869 -17855 3660 -3194 -11088 763 8663
6666 8663 29096 2401 -12847 1401 19910 15015 6979 6123 2002 -13646 -4298 -27068 -46357
6653 -46357 -51306 -83487 -54144 -17761 -4486 28662 18048 9885 37374 79980 74525 69779 48820
6640 48820 44255 51638 42150 -1714 -28447 -17981 -6130 25254 19117 25810 22337 388 -20359
6627 -20359 16532 18358 1334 887 -165 1847 6504 12848 -1661 -30381 -17357 -3322 -1605
6614 -1605 -19050 -15776 8796 -3830 16527 6251 -9594 -9189 9081 21441 23303 23466 6697
6601 6697 -16162 -22315 -30221 -19513 -25269 -32280 -13533 6625 2684 -9512 -2103 9932 -5469
6588 -5469 -56255 -78708 -38174 -1726 7449 3512 12851 22031 2071 -21966 -15881 9825 21386
6575 21386 2671 -9192 4634 10828 -26103 -38856 -32198 -33371 1976 32912 22826 1746
6563 1746 -29676 -1087 1236 -18625 25098 46452 8358 -30958 -49747 -35175 -33878 -29160 -28639
6550 -28639 -38578 -4776 20800 10545 4651 419 -1668 -9048 -26227 -34260 -43236 -57040 -63878
6537 -63878 -14306 23270 20388 16746 -18755 -56479 -41549 -54572 -36996 -4462 -9703 -10267 -35670
6524 -35670 -62643 -43194 -31352 -28258 -47681 -64287 -41927 -44678 -48125 -28473 -33024 -52038 -35802
6511 -35802 -15027 -27169 -42309 -16193 -1166 37953 56463 48646 13338 -46967 -59093 -45231
6499 -45231 -19347 -33669 -3736 17612 4955 -19132 -9318 997 1579 -17177 -15164 -9182 -10917
6486 -10917 -2589 5875 16524 -13435 -12006 3135 12528 -7937 -9274 21375 19220 -10115 -21046
6473 -21046 -26504 10440 -22212 -23020 4450 18196 -1103 -15031 -25433 -30761 4715 22834 10230
6460 10230 5752 10662 -24721 -36705 -29144 -10908 -21351 -45264 -47737 -21605 -16349 -20733 -13077
6447 -13077 -3620 4028 -21318 -28525 -31476 -62010 -61999 -24525 -11755 -28327 -56040 -53142 -42884
6434 -42884 -7861 -9500 -16037 -13607 -33324 -36289 -25416 -49701 -27481 -7847 -15220 3377 7101
6421 7101 -9851 -24958 -44905 -56658 -18129 -17100 -29708 -18873 14537 19987 -176 22451
6409 22451 42696 23459 6920 -15820 -32270 -34316 -29864 -43201 -61019 -71894 -77187 -94708
6397 -94708 -57947 -56026 -71041 -31019 -1931 26393 37766 17949 22709 16601 4529 -15274
6385 -15274 -4622 33978 21393 35620 12998 -5543 -10375 -22837 -31905 -19572 -16788 1416
6373 1416 13473 -116 16805 27049 38825 19732 -8371 30528 21676 -14671 -697 48148
6361 48148 42751 1082 -17635 13284 -15096 -10853 15561 2646 -20860 -16885 -3608 -8929 -22717
6348 -22717 -18492 -6376 -934 4185 -32934 -51252 5204 11012 -3884 -23896 -28452 -19481 -973
6335 -973 -29994 -53066 -11935 -10530 -8949 -14338 -6734 -6448 -19310 -23202 -10611 -24140 -51964 -47727
6321 -47727 -52655 -53914 -51200 -67262 -27558 4882 8296 22366 22808 27756 44625 66001 61140
6308 61140 46974 48630 54018 28218 -7587 -20736 17175 36241 38838 20898 16158 -9728 -19014
6295 -19014 -3199 2595 -6416 24141 58264 47403 16117 24068 39188 4476 -22476 8007
6283 8007 5528 -35328 -43403 -58767 -63423 -64987 -28080 -5960 -24730 -50936 -33627 -6045 43658
6270 43658 36468 11801 37487 58762 26746 30957 37518 -12498 -20590 28619 62864 44957 50270
6257 50270 23440 5116 22587 3963 18083 10654 -8101 -34622 -48429 -67155 -38931 -23685
6245 -23685 -17328 -13734 5761 -2516 3439 14032 7395 -4631 -25117 -37103 -65782 -92853 -72133
6232 -72133 -43929 -43363 -30012 -15994 -21350 -60606 -66062 -66147 -38468 -10801 -23794 -42576 -56499
6219 -56499 -47201 -36801 -13851 26307 20972 189 16197 41875 33457 25922 14514 -12235 7164
6206 7164 44964 35122 4746 -29290 -33669 -21493 12342 17400 -22666 -44770 -34112 -14139 3427
6193 3427 15933 -17520 -17239 -2459 -2547 10741 32964 49064 36390 24919 11837 2254 10734
6180 10734 20225 18085 4418 7796 25636 24412 21335 4024 16390 9678 -25950 -59595 -44656
6167 -44656 -23832 7008 40956 58420 57885 27635 -19899 3155 -13788 3288 11992 27144
6155 27144 15092 -3621 -36279 -48419 -13087 -10651 -16717 4878 1580 -5295 -28076 -17341 4924
6142 4924 4373 10397 -14547 -15487 -17382 -17735 -5337 33476 47698 51836 53952 47313 12490 2107
6128 2107 -9987 -357 31480 32406 10178 -14447 -16559 23290 48022 29349 10081 27628 54920
6115 54920 42818 54077 82911 64578 40281 21357 10684 26087 7522 27079 58121 73352
6103 73352 81222 73119 25971 5530 -25075 -19703 -20482 3726 -14241 -22744 -37868 -42400 -19092
6090 -19092 -37203 -19083 3258 16191 61638 57183 42093 4169 -8834 -26966 -38000 4924
6078 4924 23425 19967 2002 -22516 -28958 -44555 -51229 -54840 -28960 -2561 18768 -486 -298
6065 -298 -1809 4146 -17844 -36428 -42194 -34831 -23855 11621 23245 10278 -18405 -2422 -7580
6052 -7580 13848 -20745 -16134 26142 18957 11304 23360 47880 66501 28997 42698 47148 31423
6039 31423 17484 14134 31783 28367 -11477 -26949 -19556 -14427 -4112 16994 24829 22553 45339
6026 45339 41959 18121 8711 13732 5283 -10703 -3058 13937 30653 49181 17260 46598 32019
6013 32019 22192 16738 -21760 -46283 -57385 -92451 -79391 -43367 -6671 13615 -10496 -14817
6001 -14817 -12344 7717 -8078 -2832 27523 23271 20936 18239 -8366 -18530 6802 -4762 -18149
5988 -18149 -36038 -35893 -41041 -19129 -33336 -23337 4074 -434 11155 20533 33671 -630 -31286
5975 -31286 -12846 -13014 -13923 -31289 -45338 -28315 -12213 -31729 -45956 -22888 -12288 12685 23593
5962 23593 22668 2543 12098 9865 -4875 -8502 -18572 -15810 29665 32902 -3156 -28253 -14312
5949 -14312 17339 -7674 -18343 12741 5847 9869 38394 43957 19227 28513 23014 -1691 -790
5936 -790 -17096 -12819 -34933 -34314 -8073 11621 39250 77704 63685 38088 2843 -18549 7922
5923 7922 39456 18378 -5131 10421 40512 18127 27632 24706 22166 19245 9010 15669 -7587
5910 -7587 4907 11403 -2854 2907 30226 57258 32393 26257 35664 26375 37762 12197 -10676
5897 -10676 5080 17603 20970 3549 -5694 4205 5585 -6149 -9387 16263 14703 -26231 -18029
5884 -18029 -180 -1762 27261 31375 27001 29784 12593 -10191 2601 31586 41612 39513 17090
5871 17090 9944 46562 46504 56006 50601 39276 810 -26572 -6210 10337 8189 26565 41078
5858 41078 36578 25298 21232 8798 -30515 -10694 17253 30246 1247 -3999 26830 41183
5846 41183 44818 40243 33128 26116 24614 48916 40151 31925 41986 48886 46011 26438 8619 22089
5832 22089 -3290 914 340 -9039 -32992 -26761 6676 35341 30208 32149 42845 27797 2397
5819 2397 26609 18270 -12588 -19283 -9902 7742 7806 -24485 -20917 -8564 -4661 19946 36821 13564
5805 13564 -5891 11739 5662 9430 12938 7635 8162 7454 19941 44679 43709 51077 40149 44196
5791 44196 34985 -2187 -11548 -23059 -36565 -21696 -9098 -20888 -33189 -44557 -26774 -25698
5779 -25698 -30016 -21699 -26043 -6889 -382 -10882 10061 10374 6311 4057 -12869 -27148 -15029
5766 -15029 2556 -26096 -29067 -22157 -42362 -40350 -38651 -36375 -2986 -417 -29584 -59066 -34090
5753 -34090 14661 -12699 -42812 -40468 -33786 -60106 -72991 -48864 -74089 -50162 -40920 -33089 -29709
5740 -29709 -45696 -57922 -37981 -21856 -32649 -2060 14610 5942 -29420 -32402 -25928 -42140
5728 -42140 -23777 -7217 -4741 1208 7952 -12414 -22401 -5168 31007 49219 45570 63043 81164
5715 81164 39648 40042 7419 4550 -711 6791 20831 22878 -3031 -21698 -17606 20366 31059
5702 31059 -11165 -51219 -63260 -25780 -21109 -25980 -19737 -32595 -36462 -24063 -3339 18582 45933
5689 45933 18326 2593 4556 -362 -23277 -36966 -59788 -51763 -35153 -14170 -3281 -14316
5677 -14316 -47314 -58446 -26929 -14388 -19933 -38942 -37432 -19915 -31614 -34325 12192 -8314
5665 -8314 -40422 -49556 -38963 -27434 -5914 -6273 7824 14868 29908 8875 8565 3793 -35192
5652 -35192 -36102 -8022 16853 17301 33893 18481 -11088 -38909 -39484 -25051 -21936 22350 29089
5639 29089 5163 23441 8622 4501 4222 33145 15021 -22593 5154 11043 25245 13070 3175
5626 3175 13261 -9606 7220 -1840 -15613 15762 23782 -10132 -14488 -23416 -25449 -7641 7317
5613 7317 22664 46986 50859 43085 12749 681 -12046 -9659 -13672 -30712 -23184 -13706 -19089
5600 -19089 -11556 -20933 -14476 8015 12508 -6866 -28104 -42311 -14601 -17170 -61566 -53943 -28975
5587 -28975 259 -2557 -15748 -30490 -30531 -11049 235 21716 39368 23040 15133 18603 8146
5574 8146 -3797 -1341 5779 -35845 -58994 -68746 -58983 -36611 8646 51327 37130 -24505 -29606
5561 -29606 477 20093 36132 39334 31280 35774 -4874 -39506 -18853 -16209 20609 40152 9587
5548 9587 -3104 -35177 -35210 -51826 -43734 -27347 -19080 -22557 -9089 9843 12347 -52664 -72850
5535 -72850 -76216 -25121 -15928 -28078 -23521 -32340 -56642 -51858 -53764 -66945 -81005 -41641 496
5522 496 3056 -19276 6241 9493 -16938 -52317 -39325 -11193 -35739 -11780 -13241 6318 6775
5509 6775 -36236 -33507 -11982 -13209 612 13485 22523 -5425 -6225 22991 19297 -38370 -60323
5496 -60323 -58804 -34288 -17192 -2859 2483 -35044 -37423 -22599 -14484 -6595 -9750 -19076 -41326
5483 -41326 -46918 -49065 -45333 -18499 -31535 -12235 -5263 284 43165 57170 51668 28828 29813
5470 29813 18055 -5659 -22657 -46391 -24752 4763 19281 -2882 -21610 -15209 11244 28562
5458 28562 17206 -13386 -11876 -5035 4592 15571 33833 226 19279 35253 14633 26015
5446 26015 13825 -20211 -50848 -22481 -9491 -6027 25381 38014 29240 -1799 -28847 -15061
5434 -15061 -25705 -11082 -19688 -39862 -52047 -44698 -36610 -41816 -22315 -4507 -25809 -50519 -76016
5421 -76016 -74883 -75072 -80727 -57976 -26672 -21145 -23349 -7401 -17460 -27473 5824 -277 3644
5408 3644 8292 2629 4131 -3077 -14611 -26090 -13271 -12224 -16634 12990 9081 -28864 -12222
5395 -12222 22052 16044 9198 14066 23594 15268 8707 13742 25633 33545 18028 -27349 -1787
5382 -1787 12345 15329 36068 57410 77296 65058 51844 18844 -20174 -47811 -41271 -20496
5370 -20496 -4823 -747 21062 -781 -26423 -32864 -44874 -26377 -13705 -7590 29392 64565
5358 64565 63293 47992 36086 -2584 -27103 -2581 14842 23354 10266 -28779 -21968 -7849
5346 -7849 -9885 6965 2985 12657 32456 53511 15770 -51668 -43728 -54322 -67307 -37581 4232
5333 4232 26015 17835 -15962 -21554 -15100 -4409 10999 23936 42093 32119 -3580 -345 11363
5320 11363 39 -25330 -8560 6443 -14927 -15000 -33485 -52102 -35292 -3728 -18744 -18175 10873
5307 10873 34891 18284 9945 28302 28977 9113 -15802 -21790 -666 -13881 -51428 -65256 -32451
5294 -32451 -10352 -21807 -30052 -32714 -5646 13199 -4126 -24916 -23108 -8214 -6120 -30898 -35321
5281 -35321 -25845 -5739 11090 -30893 -56324 -46505 -47493 -18144 -23222 -16520 -7155 11537 17584
5268 17584 -19863 -18021 2591 15593 -3669 5208 -6284 -61101 -56476 -15963 10061 35688
5256 35688 33164 107 3066 9515 -16319 -64705 -56408 -52458 -56191 -73948 -67562 -14409 39181
5243 39181 67687 47681 23120 17670 99 -7225 14581 28229 28727 27679 14464 11072 -31363
5230 -31363 -50406 -45355 -59107 -13630 49039 45387 22020 -12605 -34322 -38187 -46970 -37713 -2791
5217 -2791 3623 -4037 -8070 -27588 -23016 -5269 10531 27225 10588 13582 24962 30791 38730
5204 38730 -261 -5941 27988 52385 33828 18650 -6898 -10372 -19900 -12381 6669 -4934 -9568
5191 -9568 -13919 20275 45863 59950 21680 1402 -22323 -19388 11292 -25421 -32270 -14581 -9664
5178 -9664 -9165 -9597 -34560 -18292 -9900 3521 -7212 23382 38112 23130 -18722 -22984 -28932
5165 -28932 -37881 -37235 -21741 -29878 -31913 -31712 -21898 -19801 -17918 20290 42186 70274 42747 34213
5151 34213 33956 1498 -8471 22196 -3179 -16215 -26030 -35585 -46219 -30456 -15556 14835 22570
5138 22570 12017 -401 -31115 -53046 -43518 -43870 -16493 12815 -10604 -17085 -40626 -24062 -38981
5125 -38981 -47044 -41634 -25947 -1239 21317 13446 -38396 -39710 -45920 -31262 -21292 1373 16213
5112 16213 15414 31740 34275 22071 -8776 -6648 1401 641 -18344 -16540 24937 23171 -18371 -53062
5098 -53062 -59380 -93565 -89298 -34207 -6277 -1681 -9980 -11881 -27057 -6935 42968 42440 -859
5085 -859 4487 3200 25694 37464 31063 56181 57331 43447 4241 -14169 19475 18782 -14430
5072 -14430 -9342 -2128 -9803 -33816 -84433 -63752 -58161 -58942 -31417 -31728 -1898 33562 35029 -17796
5058 -17796 -66765 -61353 -49612 -44435 -28286 -51170 -48555 -18473 4902 14172 56659 74640 49432
5045 49432 30419 34805 21357 7665 -12129 1825 5782 -362 -8404 13687 15021 28525 67596
5032 67596 89200 86508 61455 42725 30885 443 -6651 -5378 -15592 -35209 -37886 -23001 -48075
5019 -48075 -50268 -8278 -7614 -25031 -20900 -9180 -41467 -45619 -1938 -8116 -10712 -32014 -52778
5006 -52778 -48480 -38371 4939 21199 22221 8837 -14185 -8905 182 12078 11059 28789 38812
4993 38812 26461 12299 -11811 -8937 -14573 -12420 -26381 -27445 -16996 -8844 -36743 -45931 -21856
4980 -21856 -5628 8608 -20276 12548 14146 4865 4195 4285 -20462 -29127 -14318 -10148 -28432 -55778
4966 -55778 -59044 -23360 9985 27633 33034 25573 -17293 -16045 25737 37372 27380 -157 -2574
4953 -2574 -31314 -38719 -11387 20475 22543 2840 -13908 -5331 38632 40250 15718 7901 28551
4940 28551 572 -22206 -36590 -29026 -14541 -7628 24154 29629 4093 -45616 -40194 -51387 -47743
4927 -47743 -12347 -11277 8017 3834 4147 7889 36118 23120 35763 10226 -21602 16981 50493
4914 50493 37504 19042 28370 34757 31907 29211 23420 11733 -880 24010 31987 13532 -3455
4901 -3455 -16374 -34426 -37376 -23043 -25084 -15086 -18515 -52792 -71822 -90313 -62319 -21517 -17767
4888 -17767 12794 5448 -24080 -12478 -9385 32415 39033 4062 -18128 -5849 -20920 11563
4876 11563 -4415 -11771 -21832 -55068 -62799 -54235 -55911 -60539 -26545 12461 19810 -13075 -33219
4863 -33219 -9872 -22842 -29857 -12204 -6632 -6547 -2950 13801 6157 -18952 -33503 -34794 3813
4850 3813 -7742 -45267 -5782 41443 77036 77610 74314 40175 38603 22189 84 -41830 -18068
4837 -18068 -1749 18889 28599 12377 -5373 16547 63613 51554 19829 5853 -16928 -10236
4825 -10236 -382 -27401 -56742 -42407 -9806 -21793 -47193 -57785 -46961 -26869 -4630 -4971
4813 -4971 -12656 -22936 -17984 -19135 -50644 -41171 -22138 -1278 13044 -18086 -9705 8642 -23207
4800 -23207 -22041 -39147 -45437 -32382 -10350 28780 48857 17251 -5837 1113 -523 -11090 -8194
4787 -8194 -3340 -14807 -25321 -395 -14470 -4756 4861 19670 36446 15898 11888 37769 22451
4774 22451 3807 -9598 -19798 -32839 -56814 -48982 -38417 -58053 -83486 -66902 -50776 -44866
4762 -44866 -17369 11288 -8423 8124 49658 24480 -10399 5183 -26671 -41100 -30385 -22486
4750 -22486 -29692 -44877 -39824 7624 10141 18874 9026 -20749 -25347 -40446 -39380 -29277 -7791
4737 -7791 21287 4888 -15597 -10213 -26366 -56109 -61760 -49448 -31635 -11900 -5809 -3983 -27323
4724 -27323 -36558 -36061 -44941 -34121 -25661 -21490 -775 10609 2848 9359 -21607 -17310 18460 16428
4710 16428 14384 5636 -33544 -77217 -72927 -40484 -16302 21442 42806 37759 2775 -10326 486
4697 486 9496 -18345 -30819 -25193 -2068 -16432 -31161 -54740 -42758 -16914 -7846 -14143 -37372
4684 -37372 -20576 -1096 1197 -5496 -32468 -56083 -24450 -40926 -49821 -29382 -33035 -12781 -15732
4671 -15732 -17912 -15211 -23805 -4023 5871 3723 20965 -6806 -29315 -44699 -23547 -18793 -39978
4658 -39978 -63949 -77430 -47200 -37410 -22157 -4610 17762 30386 22451 -9320 -2768 15750
4646 15750 29444 26584 21134 20577 18570 7069 -5308 9811 1900 -13791 -3147 3751 26737
4633 26737 42147 30861 32319 25885 -18072 -24973 -13973 33928 51844 56685 48491 20455 17051
4620 17051 31698 45648 -4859 -15302 31081 49120 18538 -30732 -16913 -21350 -26618 -23326
4608 -23326 -21481 -21643 -26417 -21471 3349 14806 33634 26414 5322 -26281 -55747 -13302 19431
4595 19431 11877 6953 18504 27535 32455 17193 21162 17411 47922 39888 37944 30984 9577 -14978
4581 -14978 -9875 9424 46400 34995 3056 -2619 11640 -1931 -11625 -30968 -17842 -18336 -16049
4568 -16049 5977 -11966 -19643 -13692 -15659 -20649 -11451 29230 56653 22817 2948 -7685 -17228
4555 -17228 21467 15846 12045 -12592 -15134 -10701 -41575 -40840 -33385 5707 59582 60582 32442
4542 32442 -31412 -60886 -47382 -382 -7559 -22211 -32556 1277 32582 56452 91196 84066
4530 84066 49375 23150 31332 19578 14149 48317 33860 20651 2606 10655 26367 43547
4518 43547 73368 59584 41319 15741 36812 40892 8267 -24011 -30473 -56552 -70388 -65480
4506 -65480 -43067 -34318 -9894 5088 38512 55777 19949 -12814 -23373 -25034 -20883 -10063
4494 -10063 -6405 19755 42575 30902 21623 25898 21387 -13738 -21568 -6244 4291 -3029 23039
4481 23039 7040 -9156 -20405 -13537 -12048 -15997 -12071 39640 50014 19709 -25853 -44654 -28366
4468 -28366 -20596 -8165 -17696 -33839 -55236 -50042 -24608 -9963 29395 32806 -7852 -35270 -80039
4455 -80039 -78761 -36953 -7229 7910 -9643 -12867 -50 6989 13931 46453 50784 -1265 14937
4442 14937 48337 64069 62549 48796 70505 65065 31585 13026 4934 -5225 -16020 -9294 -441
4429 -441 -3684 24609 12431 -5518 -15211 -21129 -13301 23543 45782 18702 11231 -20487 -32256
4416 -32256 -32834 -39543 -7294 -7509 -1429 19066 23558 35888 70230 72029 62483 51954 22207 721
4402 721 -18108 -45665 -39589 -32845 -15769 -7315 -8683 19340 9464 2976 7883 30247 20564 11403
4388 11403 -1151 1781 1590 22095 39394 33045 31119 28454 43486 30584 47102 39546 9332
4375 9332 9136 22140 52083 65305 18183 -23719 -40487 -15481 -11058 -31341 -44086 -12167 2866
4362 2866 -14146 -10443 32709 58060 57220 38307 34142 20709 32375 36340 20678 10830 17667
4349 17667 26354 14906 -16011 -5305 19922 12377 -8757 -43008 -50586 -50530 -44034 -18954 11851
4336 11851 24626 58577 66540 5822 -13872 -7553 15089 26373 15898 4305 -10317 -30509
4324 -30509 -32590 -22038 -37646 -46528 -66737 -68373 -40019 -2885 -11214 -25695 -50929 -41238 -120
4311 -120 29548 4465 -25109 -41975 -37100 -20438 -1212 -4590 -24476 3919 25293 -11057 -14560
4298 -14560 22498 -8595 -31381 -33178 -21382 -1528 -543 9771 2732 -8959 6933 -3121 -13927
4285 -13927 5015 17955 3352 -44876 -84626 -67378 -1717 22647 43631 78802 101741 96424
4273 96424 84249 56841 44916 14808 -5161 -6404 -1571 -16873 -21317 -11826 -31605 -2077 23889
4260 23889 11231 11945 -2752 7311 29357 20104 13078 -4772 827 11101 -6180 -27939 -39113
4247 -39113 -24171 -9818 -29691 -25406 -7599 31125 34198 17223 -14543 -26335 17495 25349
4235 25349 22879 43142 55724 43741 18791 21720 -9993 -8852 7137 48045 71885 44808
4223 44808 56263 67931 50969 27287 18726 16420 4911 6519 27124 67525 75523 42168 8071
4210 8071 -18268 -51387 -51841 -44732 -42746 -62565 -64445 -70313 -72290 -51279 -65883 -80364 -74590 -55492
4196 -55492 -32635 -274 8919 -443 -3573 26069 31556 25287 2248 8307 -7799 -3112 -11512
4183 -11512 -19101 -8274 27589 16748 2271 21227 38651 34776 15025 4371 -7140 30926
4171 30926 38591 3252 281 2657 13399 2527 -22331 -24843 -38334 -52761 -61875 -62190 -57099
4158 -57099 -29217 -5456 15382 23164 11498 49258 69218 44816 44520 44570 13420 21356 1031
4145 1031 9191 21897 15267 8094 11208 -3189 -3056 47114 34892 32874 49591 46162 16635 18045
4131 18045 -2614 -1662 18601 22634 15649 -43459 -37990 2248 -9721 -4764 24019 26142 -9357
4118 -9357 14393 -14605 -50693 -31821 10642 47050 14509 -16323 -8313 14521 20898 13378 -13901
4105 -13901 -10613 -8026 -55113 -50841 -33987 13755 28672 -5755 -3216 10532 6153 -3534 -3816
4092 -3816 13658 -9568 -62867 -69753 -44693 -24145 4854 4277 -14058 19348 33723 74682 57209
4079 57209 31286 3708 -38913 -70660 -54327 -31278 -18140 -11189 13929 63443 62081 45426
4067 45426 22946 13370 -2309 -21069 20367 22381 15751 17044 10684 -14133 -16827 -8763 2817
4054 2817 23538 17322 23526 16517 27533 54284 19710 -7192 13064 12730 -2960 294 10351
4041 10351 -5392 -35180 -8268 26553 18246 23779 46565 37042 7572 -16315 -16912 23363 42303
4028 42303 24741 1054 -26806 -15759 -31375 -25519 -2453 33154 17625 -9936 -3119 1500
4016 1500 -13744 -13396 -17232 7968 35654 45629 45159 69679 79342 82849 101653 77388 43754 13779
4002 13779 -30447 -28721 34557 44927 44122 41289 32547 15659 -13480 1565 -17544 -47888 -75432
3989 -75432 -53171 -30572 -7157 -2337 -7227 -36160 -35709 -26412 -10612 -21546 3506 17924 16746
3976 16746 -5061 3554 14048 20889 45711 62638 54241 63957 30790 807 -16728 4660 -6394
3963 -6394 -4352 -18471 -25175 -31103 -52375 -36530 -15138 12101 -4151 -28559 -61571 -52142 -20315
3950 -20315 15144 2040 15182 39465 648 13513 -271 -7378 17059 4696 12573 19722
3938 19722 30727 14936 12388 13638 -4463 -27414 14627 27023 17844 -17792 -40550 -16304
3926 -16304 -16252 15720 44904 55586 44509 17243 8973 6416 29615 28562 6023 20204 18099
3913 18099 -22757 -29049 -27787 -921 8654 -27145 -25688 -37618 -32167 -12987 -20370 2082 36470
3900 36470 22562 -30680 -64445 -80862 -75145 -50464 -29754 6324 -11181 12119 29666 4053
3888 4053 -3438 12177 20309 20209 7171 -1470 19721 13169 -14837 -3520 -17291 -746 16376
3875 16376 36024 41364 27124 -3385 -15788 -4551 -31759 -26637 -19385 -42329 -43030 -37968 -37973 -65191
3861 -65191 -60460 -61433 -46435 -28122 -29622 -26543 -21564 -33519 -30231 -14252 3407 -7274 -17280
3848 -17280 -18680 -23582 -13394 1857 -3603 -15951 1244 -21971 -11301 882 7177 12214 24675
3835 24675 37900 14138 -14224 -22594 -34097 -59146 -70440 -73020 -59347 -45264 -39027 -30325 -16552
3822 -16552 -22058 -25798 512 11670 -7741 -16727 -6859 16380 34216 44355 19621 16495 4945
3809 4945 -16678 -34700 8907 31610 37439 27214 -40168 -31089 -212 42646 31314 22404 32827
3796 32827 -8075 -38600 -56185 -56952 -30197 4577 33545 55027 32184 28669 35652 51119 80501
3783 80501 76406 51805 2997 -46219 -70939 -41292 -28667 -18783 -39361 -55975 -60256 -6431
3771 -6431 15030 3723 13749 5589 29747 77051 68055 54296 31857 28643 15330 -2189 11245
3758 11245 15686 -373 -44901 -52822 -41799 -50273 -64261 -63242 -35238 -30182 -19662 -22564 -15779
3745 -15779 11688 33564 39228 4537 -32518 -51164 -56922 -51928 -42851 -26925 -1784 17743 25695
3732 25695 -7377 -23528 -14353 13689 13111 -1525 19182 63740 47457 13271 23723 2096
3720 2096 -43387 -42935 -30155 -20889 1904 4468 -5078 -20888 -14908 -14666 -17732 -31537 -42113 -46953
3706 -46953 -22231 -6424 909 13901 -366 7058 8688 -23700 -32408 -12673 6496 22037 16387
3693 16387 -17578 -31632 -24633 -20315 3012 12881 -2927 3409 25873 24310 30002 34918 40879
3680 40879 12578 659 56485 86630 58753 15763 -2605 -25800 -45307 -50305 -49406 -49409 -19590
3667 -19590 11243 24081 -2497 6122 -988 -18393 -6315 -1805 -23578 -25017 -11141 22928 49767
3654 49767 45248 -2064 -12322 -3035 5993 5544 15734 10406 -5453 -11030 -34326 -20905 4276
3641 4276 19551 39435 26990 -12347 -39810 -37640 -28261 -16499 -13970 -2443 -27340 -35598 -17195
3628 -17195 -25586 -35003 -36890 -26598 -43004 -44745 -26579 5240 -20934 -8013 41899 78303 50898
3615 50898 24203 25823 17510 10436 5271 9809 5878 12092 11858 17525 65473 60730 50951 24436
3601 24436 7503 -9724 -12505 -26082 -17272 17689 -2540 -41066 -26956 -28121 -56842 -60667 -52185
3588 -52185 -38441 9943 27517 23 -16711 -2410 16906 8335 -14627 12163 40842 29666
3576 29666 41792 30517 783 -25895 -49095 -38671 -24733 3608 -2514 -19750 11719 9884
3564 9884 9510 51057 61125 34991 34873 53159 47666 49659 33232 30455 51391 50633 39243 1461
3550 1461 -5343 14864 15333 9463 23558 49975 47951 35123 50884 58305 36782 38891 40385 29696
3536 29696 16661 14380 19970 22640 18251 13087 -1321 -9227 -17015 2934 12422 -1992 -24233
3523 -24233 -60014 -44341 -28552 -25737 -24571 -21277 -9019 6154 12818 29434 22066 -18448 -46297
3510 -46297 -27426 -13354 -17835 -30315 -3265 12251 14677 43075 44901 45564 13708 -15083 -6366
3497 -6366 26264 26337 60400 66556 29856 21879 1101 -2176 -8587 -34067 -20270 -13928 -12522 -13402
3483 -13402 -10073 8060 22688 9877 30877 10930 27722 41476 34756 14816 -9626 -38804
3471 -38804 -51445 -16256 38933 35956 -2741 -38088 -65680 -64924 -46571 -25018 37863 90395
3459 90395 89357 62468 34010 33166 -11403 -20664 -21878 -5553 19910 34659 37153 19456 -19095
3446 -19095 -20915 -1689 23229 5580 -10408 28246 28732 16094 3072 -382 30569 39374 31540
3433 31540 34697 19609 31853 12415 26384 34693 37293 24520 -7334 9697 41285 40783 27588
3420 27588 -10721 9711 4522 3958 -16017 -17679 194 18893 28581 19977 10889 25690 22912
3407 22912 4936 -14717 -25897 -1197 34189 40899 26030 2779 -15404 -28765 -31355 698
3395 698 -11462 -24798 -49339 -57484 -64134 -54489 -36029 -25124 12841 42135 11337 13133 4380
3382 4380 462 -7696 -531 -3165 -33689 -16672 18459 25767 30910 14803 6368 -3982 -42667
3369 -42667 -58217 -53851 -43794 -32864 -12631 1485 -12718 12869 9754 -10155 -16819 -26890
3357 -26890 -28351 -25019 -41387 -52652 -22492 -1105 -16252 -18889 -16742 5117 1490 -1101 -1343
3344 -1343 -6831 10160 14767 27920 33807 30182 30268 38929 45501 25466 19671 3776 38457 55265
3330 55265 26926 21166 -11967 -1468 15363 22789 33674 33553 32786 14688 14131 44078 46010 54679
3316 54679 14755 16988 37421 42090 34666 -12836 -21569 -13375 22784 45505 32796 37426 56580
3303 56580 67728 47259 34917 51727 32204 24435 17843 9937 -16460 -44090 -17733 10047
3291 10047 21273 -11030 -22889 -22140 -38234 -14582 20245 34622 6730 -4389 -3679 8101 15508
3278 15508 24969 18753 -21018 -5621 17498 9043 20632 19234 22497 24245 42410 19109 -7114
3265 -7114 743 26709 52414 51522 -5621 -32267 -22889 -39409 -42019 -42465 24782 43970 -1763
3252 -1763 -6607 -7109 1803 -4394 -5708 -36140 -39806 -33296 -6756 18864 2266 -12736 17747 40867
3238 40867 52910 32446 -5178 8697 59552 91120 58768 46924 44503 75934 65534 8978
3226 8978 -13342 -9662 -33547 -19805 12484 28461 7095 -29972 -21134 5094 14163 -780 11822
3213 11822 11554 11853 13692 -105 -32889 -9616 1811 1439 -9474 -2747 -31015 -47432 -30680
3200 -30680 -38084 -30802 -29229 2580 10832 5955 -8121 -5523 -1321 -13850 -23980 948 22143
3187 22143 -5321 -49606 -51526 -48186 -25927 -13787 -31168 -31053 -34035 -26215 -45787 -46589 -18141
3174 -18141 -34031 -29662 -20752 -58607 -51385 -11582 -1368 -21837 -61035 -64889 -61038 -57517 -42642
3161 -42642 -16158 5269 35162 26747 28502 56101 64116 81267 52993 32929 15705 11637 -3633
3148 -3633 -6499 18002 34174 51262 60989 43340 55891 48093 19915 44856 63582 72815 36107
3135 36107 22897 25945 37451 65231 48986 25478 -11558 6659 11008 23844 31268 43341
3123 43341 40196 3370 -49580 -90644 -72475 -43747 -11330 15055 32407 35968 35640 29395 40296
3110 40296 19508 -4352 -3928 10905 8405 -17814 -45716 -75245 -53432 -12368 -16374 -31531 -8188
3097 -8188 -13148 -31396 -42692 -31443 -2411 28616 1231 -19428 -1118 18204 38728 66053
3085 66053 52458 17657 19687 12032 1566 -13514 2646 -3829 -15058 -2920 14578 18365 29622
3072 29622 28623 10113 -18562 -37639 -36533 -15609 11212 34451 29733 13195 -24852 -57999 -64447
3059 -64447 -38617 -28223 -33237 -49374 -55794 -29265 -17298 21480 52229 48492 25155 12416
3047 12416 13251 23462 14201 8311 6544 3921 -12239 -52375 -40426 -43585 -9913 16578 -1040
3034 -1040 -3849 -14370 20095 -4949 -19868 -6914 -30055 -30293 5009 21961 11845 22294 8281
3021 8281 -25958 -16577 10909 13205 16251 20412 25112 -4782 -26415 -9680 -25269 -21948 7080
3008 7080 22690 5239 20639 28182 24015 30087 17252 30587 42276 12345 6584 -26527 -52913
2995 -52913 -32161 -41750 -28434 -298 30175 9667 9234 25454 22656 521 -26774 -27748 -17702
2982 -17702 26819 28445 17193 35089 37502 32565 43594 24788 159 5254 12842 14732 -927
2969 -927 -20596 -20404 -17331 -13343 21772 5419 -33829 -84667 -88929 -51550 -51062 -37398 -14315 484
2955 484 10383 24246 42356 40516 11412 -6949 -15554 7272 2255 16987 38316 27912 6172
2942 6172 -2339 1086 2396 6202 14443 31887 35149 9644 -15487 -48029 -13706 -4910 -24958
2929 -24958 -47427 -65563 -42530 -24589 -20910 5481 9627 -14177 -18968 -3471 -3020 18886 48073
2916 48073 1799 -35357 -15984 -9269 -27241 -10021 -5924 3300 -21927 -32910 -23534 14045 23617
2903 23617 39843 25610 -8141 -3898 -4101 -8376 -647 13812 789 10593 9516 -2405 -26288
2890 -26288 -50920 -65922 -57820 -46149 -22662 -48757 -81915 -101939 -61409 -28847 -24218 12516
2878 12516 -765 -18509 -12899 12970 21477 33099 52463 15406 -14364 -26735 -43374 -51858
2866 -51858 -65745 -48199 -20260 -4806 20939 30754 20554 2260 -21819 -63865 -39816 11908
2854 11908 12163 1188 19452 33530 16001 -4780 -15262 -15379 -6496 -14340 -3788 22817 32074
2841 32074 -8496 -10020 -5145 -4149 24901 2364 -46923 -54135 -51718 -47625 -3242 26508 38652
2828 38652 40849 44628 36974 51818 29336 -19015 -7942 -16268 -30522 4052 26433 7018 18956
2815 18956 16361 -36481 -37167 -36669 -8992 -8798 1327 -14532 -23330 -6962 7244 15856 8785 29377
2801 29377 30400 18856 20623 20215 4398 -1906 -14669 -849 -862 18313 5841 29655 54972
2788 54972 48074 55197 73694 73376 78396 89084 86928 69035 27157 -16961 -6137 1284 7775
2775 7775 583 20485 -6488 -8232 -31464 -48891 -58117 -32874 -16349 -18896 -2242 -21684 -30470
2762 -30470 -33863 -51664 -67029 -48437 -22180 -411 -4130 -12786 2222 21258 -4685 20839
2750 20839 25600 238 -49905 -42909 -15052 11319 -7113 1924 15628 19943 -10219 -35415 -45733
2737 -45733 -45638 -20648 3917 19386 16710 7417 4530 8466 26012 19760 -1398 -8817 -29772 -43512
2723 -43512 -30932 -24751 -35616 -25259 -35431 -37640 -24836 -26637 -30533 -43022 -48576 -59679 -39755
2710 -39755 -34532 -11036 7887 3885 -4163 33367 60715 34572 3650 9536 5899 -3147 -37406
2697 -37406 -29842 -22188 -24539 -11904 12553 28410 -6271 -8562 29414 36185 29760 31330 29089
2684 29089 9936 9956 -32966 -52269 -38313 -40403 -69942 -67312 -29424 -28779 -16643 2738 -838
2671 -838 -8003 -30055 -59219 -36165 -23354 -4302 10503 14783 -12848 -34504 -6802 -4747 8757
2658 8757 45236 46818 29134 11917 8909 2824 9307 3418 -11751 13870 57421 41683 3252
2645 3252 -17877 -38067 -6010 13199 4855 17237 34204 31341 27139 4590 -16102 -3279 20171
2632 20171 55959 55368 33509 32791 27564 53543 93152 94747 74645 65008 74344 78437 38608 -1289
2618 -1289 5414 4498 -17172 -508 8687 -8032 -20636 15608 7855 4547 -26345 -39096 -30501
2605 -30501 -25650 -13950 10934 25278 3351 -3627 -24399 -6241 7806 23872 15329 3105
$$ [...]
##END NTUPLES=NMR SPECTRUM
##END=
