##TITLE=Analysis number 313306
Compound Code rf 03219
Project Code adrs
Chemist Name endeavour
##JCAMPDX= 6.0         $$ Bruker NMR JCAMP-DX V2.0
##DATA TYPE= NMR SPECTRUM
##DATA CLASS= NTUPLES
##ORIGIN= Bruker BioSpin GmbH
##OWNER= NMR
$$ XWIN-NMR		Version 3.5
$$ Fri Sep  2 12:00:50 2005 GMT Daylight Time (UT+1h)  MAYBRIDGE\NMR@NMR_250MHZ
##.OBSERVE FREQUENCY= 250.131544655141
##.OBSERVE NUCLEUS= ^1H
##.ACQUISITION MODE= SIMULTANEOUS (DQD)
##.ACQUISITION SCHEME= undefined
##.AVERAGES= 16
##.DIGITISER RES= 18
##SPECTROMETER/DATA SYSTEM= dpx250
##.PULSE SEQUENCE= zg30
##.SOLVENT NAME= DMSO
##.SHIFT REFERENCE= (INTERNAL, DMSO, 0, 16.522)
##AUDIT TRAIL= $$ (NUMBER, WHEN, WHO, WHERE, WHAT)
$$ ##TITLE= Audit trail, XWIN-NMR		Version 3.5
$$ ##JCAMPDX= 5.01
$$ ##ORIGIN= Bruker BioSpin GmbH
$$ ##OWNER= NMR
$$ C:\u/data/dgb/nmr/ADRS/8900/pdata/1/auditp.txt
$$ ##AUDIT TRAIL=  $$ (NUMBER, WHEN, WHO, WHERE, WHAT)
(   1,<2005-09-02 11:59:54.52 +100>,<MAYBRIDGE\NMR>,<NMR_250MHZ>,
      <created by zg, POWCHK disabled, PULCHK disabled
       configuration hash MD5:
       62 19 C7 07 E1 42 D1 B7 37 6C 3D D0 77 39 F9 E6
       data hash MD5: 64K
       42 08 99 CE D9 1D CC B1 25 FF 65 FA BF C9 3B B3>)
(   2,<2005-09-02 12:00:13.52 +100>,<MAYBRIDGE\NMR>,<NMR_250MHZ>,
      <Start of raw data processing
       ef LB = 0.3 FT_mod = 6 PKNL = 1 SI = 32K 
       data hash MD5: 32K
       04 E7 18 F1 63 3A A1 2A 4B 3E 07 64 46 90 5B BC>)
(   3,<2005-09-02 12:00:18.66 +100>,<MAYBRIDGE\NMR>,<NMR_250MHZ>,
      <apk 
       data hash MD5: 32K
       66 8F 0C 49 16 49 09 D6 C7 BE E4 6E D4 B7 50 27>)
(   4,<2005-09-02 12:00:20.78 +100>,<MAYBRIDGE\NMR>,<NMR_250MHZ>,
      <abs ABSG = 5 
       data hash MD5: 32K
       3D 11 FE D8 CC 29 85 ED D6 E3 81 E5 80 37 32 40>)
$$ ##END=
$$ 
$$ hash MD5
$$ BF 5B 0A 78 67 D3 BB BF 9C D7 9A 62 99 0B D7 B0
##$RELAX= 
##$RELAX= 
##$RELAX= 
##$RELAX= 
##$RELAX= 
##$RELAX= 
##$RELAX= 
$$ Bruker specific parameters
$$ --------------------------
##$DU= <C:\u>
##$EXPNO= 8900
##$NAME= <ADRS>
##$PROCNO= 1
##$TYPE= <nmr>
##$USER= <dgb>
##$AMP= (0..31)
100 100 100 100 100 100 100 100 100 100 100 100 100 100 100 100 100 100 
100 100 100 100 100 100 100 100 100 100 100 100 100 100 
##$AQSEQ= 0
##$AQ_mod= 3
##$AUNM= <au_zg>
##$AUTOPOS= <17 >
##$BF1= 250.13
##$BF2= 250.13
##$BF3= 250.13
##$BF4= 250.13
##$BF5= 500.13
##$BF6= 500.13
##$BF7= 500.13
##$BF8= 500.13
##$BYTORDA= 1
##$CFDGTYP= 0
##$CFRGTYP= 5
##$CHEMSTR= <none>
##$CNST= (0..31)
1 1 145 1 1 1 1 1 1 1 1 1 1 1 1 1 1 1 1 1 1 1 1 1 1 1 1 1 1 1 1 1 
##$CPDPRG= <>
##$CPDPRG1= <>
##$CPDPRG2= <>
##$CPDPRG3= <>
##$CPDPRG4= <mlev>
##$CPDPRG5= <mlev>
##$CPDPRG6= <mlev>
##$CPDPRG7= <mlev>
##$CPDPRG8= <mlev>
##$CPDPRGB= <>
##$CPDPRGT= <>
##$D= (0..31)
0 1 0 0 0 0 0 0 0 0.06 0 0 0 0 0 0 0.0002 0 0 0 0 0 0 0 0 0 0 0 0 0 0 
0 
##$DATE= 1125658793
##$DBL= (0..7)
120 120 120 120 120 120 120 120 
##$DBP= (0..7)
150 150 150 150 150 150 150 150 
##$DBP07= 0
##$DBPNAM0= <>
##$DBPNAM1= <>
##$DBPNAM2= <>
$$ [...]
##$SUBNAM7= <"">
##$SUBNAM8= <"">
##$SUBNAM9= <"">
##$SW= 20.6930455092707
##$SWIBOX= (0..15)
0 0 3 0 0 0 0 0 0 0 0 0 0 0 0 0 
##$SW_h= 5175.983436853
##$TD= 65536
##$TD0= 1
##$TE= 295.16
##$TE2= 300
##$TE3= 300
##$TEG= 300
##$TL= (0..7)
0 120 120 120 120 120 120 120 
##$TP= (0..7)
150 150 150 150 150 150 150 150 
##$TP07= 0
##$TPNAME0= <>
##$TPNAME1= <>
##$TPNAME2= <>
##$TPNAME3= <>
##$TPNAME4= <>
##$TPNAME5= <>
##$TPNAME6= <>
##$TPNAME7= <>
##$TPOAL= (0..7)
0.5 0.5 0.5 0.5 0.5 0.5 0.5 0.5 
##$TPOFFS= (0..7)
0 0 0 0 0 0 0 0 
##$TUNHIN= 0
##$TUNHOUT= 0
##$TUNXOUT= 0
##$USERA1= <user>
##$USERA2= <user>
##$USERA3= <user>
##$USERA4= <user>
##$USERA5= <user>
##$V9= 5
##$VALIST= <valist>
##$VCLIST= <CCCCCCCCCCCCCCC>
##$VD= 0
##$VDLIST= <DDDDDDDDDDDDDDD>
##$VPLIST= <PPPPPPPPPPPPPPP>
##$VTLIST= <TTTTTTTTTTTTTTT>
##$WBST= 1024
##$WBSW= 4
##$XGAIN= (0..3)
0 0 0 0 
##$XL= 0
##$YL= 0
##$YMAX_a= 388557
##$YMIN_a= -416111
##$ZGOPTNS= <>
##$ZL1= 120
##$ZL2= 120
##$ZL3= 120
##$ZL4= 120
##$ABSF1= 16.522
##$ABSF2= -4.171173
##$ABSG= 5
##$ABSL= 3
##$ALPHA= 0
##$AQORDER= 0
##$ASSFAC= 0
##$ASSFACI= 0
##$ASSFACX= 0
##$ASSWID= 0
##$AUNMP= <proc_1d>
##$AZFE= 0.1
##$AZFW= 0.1
##$BCFW= 0
##$BC_mod= 0
##$BYTORDP= 0
##$COROFFS= 0
##$CY= 12.5
##$DATMOD= 1
##$DC= 0
##$DFILT= <>
##$DTYPP= 0
##$F1P= 14.0000005364418
##$F2P= -0.99999901652339
##$FCOR= 0.5
##$FTSIZE= 32768
##$FT_mod= 6
##$GAMMA= 0
##$GB= 0
##$INTBC= 1
##$INTSCL= 1
##$ISEN= 128
##$LB= 0.3
##$LEV0= 0
##$LPBIN= 0
##$MAXI= 10000
##$MC2= 0
##$MEAN= 0
##$ME_mod= 0
##$MI= 0
##$NCOEF= 0
##$NC_proc= -3
##$NLEV= 6
##$NOISF1= 0
##$NOISF2= 0
##$NSP= 0
##$NTH_PI= 0
##$NZP= 0
##$OFFSET= 16.522
##$PC= 1
##$PHC0= -87.38007
##$PHC1= 5.70219
##$PH_mod= 1
##$PKNL= yes
##$PPARMOD= 0
##$PSCAL= 4
##$PSIGN= 0
##$REVERSE= no
##$SF= 250.13
##$SI= 32768
##$SIGF1= 0
##$SIGF2= 0
##$SINO= 400
##$SIOLD= 32768
##$SREGLST= <1H.DMSO>
##$SSB= 0
##$STSI= 32768
##$STSR= 0
##$SW_p= 5175.98343685301
##$SYMM= 0
##$S_DEV= 0
##$TDeff= 65536
##$TDoff= 0
##$TI= <Analysis number 999999
Compound Code 99
Book Reference 9
Project Code 9>
##$TILT= no
##$TM1= 0
##$TM2= 0
##$TOPLEV= 0
##$USERP1= <user>
##$USERP2= <user>
##$USERP3= <user>
##$USERP4= <user>
##$USERP5= <user>
##$WDW= 1
##$XDIM= 32768
##$YMAX_p= 468930338
##$YMIN_p= -416359
$$ End of Bruker specific parameters
$$ ---------------------------------
##NTUPLES= NMR SPECTRUM
##VAR_NAME=  FREQUENCY,     SPECTRUM/REAL,   SPECTRUM/IMAG
##SYMBOL=    X,             R,               I
##VAR_TYPE=  INDEPENDENT,   DEPENDENT,       DEPENDENT
##VAR_FORM=  AFFN,          ASDF,            ASDF
##VAR_DIM=   32768,         32768,           32768
##UNITS=     HZ,            ARBITRARY UNITS, ARBITRARY UNITS
##FACTOR=    0.157963299565203, 1,           1
##FIRST=     4132.6476996994, 0,             0
##LAST=      -1043.33573715361, 0,           0
##MIN=       -1043.33573715361, -416359,     0
##MAX=       4132.6476996994, 468930338,     0
$$ Real data points
##PAGE= N=1
##DATA TABLE= (X++(R..R)), XYDATA
$$ [...]
##PAGE= N=2
##DATA TABLE= (X++(I..I)), XYDATA
17149a492459J4873P408l69K6357l430l7411m870R720j3680R83K5096J4581j302
17136a454503J0321j1866o723J2956J4200N258r222J7043J889j2692m852r254
17124a447445m744j3959k2034K948J8140K294L5707r891l3394j0960m926P589
17112a480675K6696J8097j0591K4463m065k0198j5970K401J5256L85j763o213
17100a452177P415J3812J801j1263J2403K3937K0292j2128n611j8481j6746n843
17088a442589J7170K2425l065j2381j6841j6620J0924J9076O856n625J1306N198
17076a404166k685N391j1131k4349j9768J2508L0506L675j1485k5271L399M191
17064a439185J1200J0502j0751J0009o293j443j96J8772O357m443J4504Q975O371
$$ plain form
17149 -1492459 -1477586 -1470178 -1470547 -1444190 -1447620 -1485031 -1489901 -1480181 -1493861 -1492878 -1467782 -1453201 -1454503
17136 -1454503 -1444182 -1456048 -1462771 -1449815 -1435615 -1430357 -1439579 -1422536 -1420647 -1433339 -1438191 -1447445
17124 -1447445 -1452189 -1466148 -1488182 -1485234 -1467094 -1464800 -1429093 -1438984 -1472378 -1483338 -1488264 -1480675
17112 -1480675 -1453979 -1435882 -1446473 -1422010 -1426075 -1446273 -1462243 -1459842 -1444586 -1444201 -1445964 -1452177
17100 -1452177 -1444762 -1430950 -1429149 -1440412 -1428009 -1404072 -1383780 -1395908 -1401519 -1420000 -1436746 -1442589
17088 -1442589 -1425419 -1402994 -1406059 -1418440 -1435281 -1451901 -1440977 -1421901 -1415045 -1420670 -1409364 -1404166
17076 -1404166 -1406851 -1401460 -1412591 -1436940 -1456708 -1444200 -1413694 -1410019 -1421504 -1446775 -1443376 -1439185
17064 -1439185 -1427985 -1417483 -1428234 -1418225 -1424518 -1425961 -1426157 -1407385 -1401028 -1405471 -1390967 -1381992 -1375621
17051a375621R55j3904q020l0897k4725K0089L7039J578j7994K1828J9993m0579
17039a410258m702K6307n589k3417o526K7683J379J4373L322q194J2757k2072
17027a394937j5808j0609Q313J8717J7693J9082k889k9274j7287M040L987L493
17015a395479J9775P78k1981k653p041r283L7240J6269o28k84k3972K204J3769
17002a371286M0671J3327L350r283j9023K0887n618l332k0168k3149k1082J6612
16990a378094K0620p111J3745J4872j612K453l733J249o401j0395l0630j989J8346
16977a368680K7791o375R406j3111r004J1697K905l264N962K351n526J8618m397
16964a331627j4838L702K3240j1099J227Q059L5769n736l0467K2488R746l7645
$$ plain form
17051 -1375621 -1374666 -1388570 -1396590 -1427487 -1452212 -1432123 -1395084 -1393506 -1411500 -1389672 -1369679 -1410258
17039 -1410258 -1414960 -1388653 -1394242 -1417659 -1424185 -1396502 -1395123 -1380750 -1377428 -1385622 -1372865 -1394937
17027 -1394937 -1410745 -1421354 -1413041 -1394324 -1376631 -1357549 -1360438 -1389712 -1406999 -1402959 -1398972 -1395479
17015 -1395479 -1375704 -1374926 -1396907 -1399560 -1406601 -1415884 -1378644 -1362375 -1363003 -1363287 -1387259 -1385055 -1371286
17002 -1371286 -1330615 -1317288 -1313938 -1323221 -1342244 -1321357 -1326975 -1330307 -1350475 -1373624 -1394706 -1378094
16990 -1378094 -1357474 -1364585 -1350840 -1335968 -1337580 -1335127 -1338860 -1337611 -1344012 -1354407 -1385037 -1387026 -1368680
16977 -1368680 -1340889 -1347264 -1337858 -1350969 -1359973 -1348276 -1345371 -1348635 -1342673 -1340322 -1345848 -1327230 -1331627
16964 -1331627 -1346465 -1342763 -1319523 -1330622 -1329395 -1321336 -1285567 -1291303 -1321770 -1299282 -1289536 -1327181
16952a327181N766J2486j1283j8846j2766n043j513L2224K6703K5804j0190k8148
16940a311987J8932L3108J2468J0789r767q485k4446J0453N126K470l661p699
16928a272699M210J853k0434l7469M530m076p582Q491P276K736K8672n623j6209
16915a306324k482K1012N966J3844l228n831J1095o584k1727n420K1894J6588
16903a261197R400p498L002r80K0212K6809j3612j7529k8360p031N175O911J7323
16890a247375j3314k775j1497K504Q161P982K0759p66J2277n683m5559k6106J8788
16877a282604K1028R66J9806K4233j682K597k2489k5943J7728M816N023J1943
16865a224578r35N288k388k2914o280N968J5673O812J6433q205p595J0548P771
$$ plain form
16952 -1327181 -1321415 -1308929 -1320212 -1339058 -1351824 -1356867 -1358380 -1326156 -1299453 -1273649 -1283839 -1311987
16940 -1311987 -1293055 -1259947 -1247479 -1236690 -1246457 -1254942 -1279388 -1268935 -1263809 -1261339 -1265000 -1272699
16928 -1272699 -1268489 -1266636 -1287070 -1324539 -1320009 -1324085 -1331667 -1323176 -1315900 -1313164 -1284492 -1290115 -1306324
16915 -1306324 -1308806 -1287794 -1281828 -1267984 -1271212 -1277043 -1265948 -1272532 -1294259 -1299679 -1277785 -1261197
16903 -1261197 -1251797 -1259295 -1256293 -1257273 -1237061 -1210252 -1223864 -1241393 -1269753 -1276784 -1271609 -1264698 -1247375
16890 -1247375 -1260689 -1263464 -1274961 -1272457 -1264296 -1256314 -1235555 -1236321 -1224044 -1229727 -1275286 -1301392 -1282604
16877 -1282604 -1261576 -1260610 -1240804 -1216571 -1218253 -1215656 -1238145 -1264088 -1246360 -1241544 -1236521 -1224578
16865 -1224578 -1225513 -1220225 -1222613 -1245527 -1251807 -1245839 -1230166 -1223354 -1206921 -1215126 -1222721 -1212173 -1204402
16852a204402k0815q888J0202k5523k0416K4343L2660M055k9901q361Q563l937
16840a242420j0342j63j2189j6502m691n408M35M665R385J9284J4612K929j3508
16827a253913K821L7570J3459k157L879j4061l1744j2339R324L1943M506k2945
16815a233657J7659J6143j8341k9004m297K5048j157j0899J9417L774j3697J8060
16803a210951j6614J4583O811o243k1805J9N999J3700O343j4099K3168K8262J6647
16790a154180L575k3279k1291j7787q899L719K9619K2625o501J5203M0792r467
16778a125871m447O488o544l1210q181J1579q326k5023m169J45o632l91l510J4901
16764a191191J3265k1482r576J6618M3249N180k8922K829J0671r57r572j3255
$$ plain form
16852 -1204402 -1225217 -1234105 -1223903 -1249426 -1269842 -1245499 -1212839 -1208784 -1238685 -1247046 -1238483 -1242420
16840 -1242420 -1252762 -1252925 -1265114 -1281616 -1286307 -1291715 -1291280 -1286615 -1277230 -1257946 -1243334 -1240405 -1253913
16827 -1253913 -1251092 -1213522 -1200063 -1202220 -1198341 -1212402 -1244146 -1256485 -1247161 -1215218 -1210712 -1233657
16815 -1233657 -1215998 -1199855 -1218196 -1247200 -1251497 -1226449 -1227606 -1238505 -1219088 -1215314 -1229011 -1210951
16803 -1210951 -1227565 -1212982 -1206171 -1212414 -1234219 -1234200 -1228201 -1214501 -1208158 -1222257 -1199089 -1170827 -1154180
16790 -1154180 -1150605 -1173884 -1195175 -1212962 -1221861 -1218142 -1188523 -1165898 -1172399 -1157196 -1116404 -1125871
16778 -1125871 -1130318 -1123830 -1130374 -1161584 -1169765 -1158186 -1166512 -1191535 -1195704 -1195559 -1202191 -1202582 -1206092 -1191191
16764 -1191191 -1177926 -1199408 -1208984 -1192366 -1149117 -1143937 -1172859 -1170030 -1159359 -1160316 -1169888 -1183143
16752a183143k740J1595J2575P730M8599J3912n0172k9584k524j398r078Q084
16740a176144J3850K2783J0532k0704p136J504L5401M622j0530j9469l1544j3165
16728a190000J4143P695q650L9403J8197p54q192j0885P452J868q463L335J7965
16715a116886o794k5325p241J3805j0555l3405p666N555q66j431J8405J573J5596
16702a155235n178k9847j9575J3782R554K6706K3183J8303j3941k7462J2873J5580
16690a131257k3844L302j4220J2946L3665K746j045Q731L340J1512k7722q541
16678a130387N961l748j1405J5266R828J7365J1192j1202J707M679k447R04n492
16665a097779m197r042L946n531K4405P175l377j6538j0429P816J1969j1822J5519
$$ plain form
16752 -1183143 -1185883 -1174288 -1161713 -1153983 -1105384 -1091472 -1141644 -1171228 -1173752 -1175150 -1184228 -1176144
16740 -1176144 -1162294 -1139511 -1128979 -1149683 -1156819 -1155315 -1119914 -1115292 -1125822 -1145291 -1176835 -1190000
16728 -1190000 -1175857 -1168162 -1176812 -1137409 -1119212 -1119966 -1128158 -1139043 -1131591 -1129723 -1138186 -1134851 -1116886
16715 -1116886 -1123680 -1149005 -1156246 -1142441 -1152996 -1186401 -1194067 -1188512 -1189378 -1190809 -1172404 -1170831 -1155235
16702 -1155235 -1160413 -1190260 -1209835 -1196053 -1186499 -1159793 -1136610 -1118307 -1132248 -1159710 -1146837 -1131257
16690 -1131257 -1155101 -1151799 -1166019 -1153073 -1119408 -1116662 -1117707 -1108976 -1105636 -1094124 -1121846 -1130387
16678 -1130387 -1124426 -1128174 -1139579 -1124313 -1114485 -1097120 -1085928 -1097130 -1095423 -1090744 -1093191 -1092287 -1097779
16665 -1097779 -1101976 -1111018 -1107072 -1112603 -1088198 -1081023 -1084400 -1100938 -1111367 -1103551 -1091582 -1103404 -1087885
16652a087885K0690n753R112J588j15j3179k2619p303J7078R006k579k744j6683
16639a101386J7736r464l6634M157j504J4985L7371l1812k3085j605R858k7019
16627a148402R853J0438Q931J3020K7238K2641j8227j3189j4681j3157k630M31
16615a117734q76n416K0596J1824O002O97j5581J2550p944K427n913N478J0190
16602a083700n735J1852J738q728l0961j1889J5843L7471N577j3549n868j0851
16590a098800n382j761n263J2788J1710q91k1547R838K0704k0126M563l073j243
16577a098483J9937K1610L388j8930N506L96R966J2287Q209J9395m0173l9133
16565a096025K097j720j9172R265J0479L4967K4130m322j4574K426j0941j6347
$$ plain form
16652 -1087885 -1067195 -1072948 -1063836 -1062248 -1062363 -1075542 -1098161 -1105464 -1088386 -1079380 -1081959 -1084703 -1101386
16639 -1101386 -1083650 -1093114 -1129748 -1125591 -1127095 -1112110 -1074739 -1106551 -1129636 -1131241 -1121383 -1148402
16627 -1148402 -1138549 -1128111 -1119180 -1106160 -1078922 -1056281 -1074508 -1087697 -1102378 -1115535 -1118165 -1117734
16615 -1117734 -1118610 -1124026 -1103430 -1091606 -1085604 -1084907 -1100488 -1087938 -1095882 -1093455 -1099368 -1093890 -1083700
16602 -1083700 -1089435 -1077583 -1075845 -1084573 -1115534 -1127423 -1111580 -1074109 -1068532 -1082081 -1087949 -1098800
16590 -1098800 -1104182 -1105943 -1111206 -1098418 -1086708 -1087599 -1109146 -1099308 -1078604 -1098730 -1094167 -1097240 -1098483
16577 -1098483 -1078546 -1056936 -1053548 -1072478 -1066972 -1066576 -1056610 -1044323 -1036114 -1016719 -1056892 -1096025
16565 -1096025 -1093928 -1095648 -1114820 -1105555 -1095076 -1060109 -1035979 -1040301 -1054875 -1052449 -1063390 -1079737
16553a079737m478j2261n922o855l03J9716N063K6133L8247j251k1332J4514L5697
16540i92769Q272l6844j6608M504j0638r172J4698R110n161q508J0096J653J4601
16527a016766J2858l3570k0259k945K3605R239m449J2755K6579J854j9294m801
16515a015194k978j9920L029j3083k4166J2680J4934P985P473k987k0717j5708
16503a068652j495K2852J9717o948j4961p418J2231J4932J2518j3398o40K5456
16491a005806J2992j4205j7040p43j735L3260k631j535L7378m044j3910j4403
16479i92422k0969k413j4696J96l278o832O237K7503J2964j7086N012J1654r676
16466a003806k705k318K875k4084J0770K1259p067j5618L9844N631j024j1361
$$ plain form
16553 -1079737 -1084215 -1096476 -1102398 -1109253 -1109556 -1089840 -1084777 -1058644 -1020397 -1021648 -1042980 -1028466 -992769
16540 -992769 -984497 -1021341 -1037949 -1033445 -1044083 -1053255 -1038557 -1029447 -1034608 -1043116 -1033020 -1031367 -1016766
16527 -1016766 -1003908 -1037478 -1057737 -1060682 -1037077 -1027838 -1032287 -1019532 -992953 -991099 -1010393 -1015194
16515 -1015194 -1018172 -1038092 -1035063 -1048146 -1072312 -1059632 -1044698 -1036713 -1029240 -1032227 -1052944 -1068652
16503 -1068652 -1070147 -1047295 -1027578 -1034526 -1049487 -1056905 -1044674 -1029742 -1017224 -1030622 -1031262 -1005806
16491 -1005806 -992814 -1007019 -1024059 -1024802 -1026537 -993277 -995908 -997443 -960065 -964109 -978019 -992422
16479 -992422 -1013391 -1015804 -1030500 -1030304 -1033582 -1040414 -1034177 -1006674 -993710 -1010796 -1005784 -994130 -1003806
16466 -1003806 -1006511 -1008829 -1005954 -1030038 -1019268 -998009 -1005076 -1020694 -980850 -975219 -976243 -987604
16454i87604l7236K60K5139K3197l162K152n962j5199j4261J5849J3227J0367
16442i73233K2575j2203j6118k2685k4430J447J5722M820K7877m90j6931k1055
16430a014704L674N562Q961K3703K0870Q838j0935O817Q565j9043k7281j1581
16418i96554L5979J202j3387P490J0921m027J3103P566j7394j7808J6682R147
16406i47080R448n247q757Q133o048l2190n699P225L5944k204l1620j9676K127
16393i95644K3517L8056q701k5100m821j1434Q300P583k6940K3512J3764l2944
16381i90852k3964j0575P116K4040K6164R088J7482K4808P762k6489l2909Q368
16369i59961K0475q981N822P866j6627L214l712j0321j3900n221K0944K8253M863
$$ plain form
16454 -987604 -1024840 -1024580 -999441 -976244 -979406 -977254 -983216 -998415 -1012676 -996827 -983600 -973233
16442 -973233 -950658 -962861 -978979 -1001664 -1026094 -1024647 -1008925 -1004105 -976228 -976718 -993649 -1014704
16430 -1014704 -1011030 -1005468 -996507 -972804 -951934 -943096 -954031 -947214 -938649 -957692 -984973 -996554
16418 -996554 -960575 -959373 -972760 -965270 -954349 -958376 -945273 -937707 -955101 -972909 -956227 -947080
16406 -947080 -937632 -942879 -951636 -943503 -949551 -981741 -987440 -980215 -944271 -946475 -978095 -997771 -995644
16393 -995644 -972127 -934071 -942772 -967872 -972693 -984127 -975827 -968244 -995184 -971672 -957908 -990852
16381 -990852 -1014816 -1025391 -1018275 -994235 -968071 -958983 -941501 -916693 -908931 -935420 -968329 -959961
16369 -959961 -939486 -948467 -942645 -934779 -951406 -948192 -951904 -962225 -976125 -981346 -960402 -932149 -927286
16356i27286j0197j7436N206R837j051O088O331J2393O3j1068q167J8320J4445
16343i02522l217k3372q374O569N292j3100J0472P333k3216r634J4639j262K1934
16330i18458j016k609J0285p30l5647J320K0841K1231K6882r208l4105j2395J7717
16317i15892R428m574j5061j812L182j4717J78J7919J7286L263M651q744p230
16304i12123l2014j5186J0968K8192j948j2502k3001k3407K7590K4489L711O893
16292i18338L746m776r165k136J9229r87M799k401k1031O789K2649L931j9709
16279i17400O166O047r595J785J2153Q819K1065j8555k7910j7674K0912J0765
16267i03422q817k298j9958m972J9282j2992k704J5189J6273R115J266m935j0057
$$ plain form
16356 -927286 -937483 -954919 -949713 -939876 -940927 -934839 -928508 -916115 -916052 -927120 -935287 -916967 -902522
16343 -902522 -905739 -929111 -937485 -930916 -925624 -938724 -928252 -920919 -944135 -953769 -939130 -940392 -918458
16330 -918458 -919474 -922083 -911798 -912528 -948175 -946855 -926014 -904783 -877901 -887109 -921214 -933609 -915892
16317 -915892 -906464 -911038 -926099 -927911 -924729 -939446 -939268 -921349 -904063 -900800 -896149 -904893 -912123
16304 -912123 -944137 -959323 -948355 -920163 -922111 -934613 -957614 -981021 -953431 -928942 -925231 -918338
16292 -918338 -914592 -919368 -928533 -930669 -911440 -912427 -907628 -910029 -931060 -924271 -901622 -897691 -917400
16279 -917400 -911234 -905187 -914782 -912997 -900844 -892025 -870960 -889515 -917425 -935099 -914187 -903422
16267 -903422 -912239 -914537 -934495 -939467 -920185 -933177 -935881 -920692 -904419 -895304 -894038 -898973 -909030
16254i09030N822K9553p040k0621J2104L4050j3257j7476j5119Q093J4868k3083
16242i01136O687P429J0373L8794p026l9341j6762J824Q52R675K9471j2952m836
16229h76948K8205o387N209N827p629Q515j5359O818k454J4450K7841k4529l3514
16216h69955k1209l61q60j9666k489L1744m333o536p280k4415K9787K2937J8768
16203h53868L434k3574k7109j6589R319L1529J3207p144J2099K9393j0006l170
16191h42479J791j2407m726r98M689j138k0622P384O635j280p625j5724P593J8273
16177h60634M51k6687k7331k0597J6987K6122J0756K0421J8383J915K115j6793
16165h54892j9016j1650O197j1617j3401J9919M113L140L0032j6915J3286O8P309
$$ plain form
16254 -909030 -903208 -873655 -880695 -901316 -889212 -855162 -868419 -885895 -901014 -892921 -878053 -901136
16242 -901136 -894449 -887020 -876647 -837853 -844879 -884220 -900982 -899158 -898306 -888631 -859160 -872112 -876948
16229 -876948 -848743 -855130 -849921 -844094 -851723 -843208 -858567 -851749 -854203 -839753 -811912 -836441 -869955
16216 -869955 -891164 -891525 -892385 -912051 -914540 -882796 -887129 -893665 -900945 -925360 -895573 -872636 -853868
16203 -853868 -850434 -874008 -901117 -917706 -908387 -876858 -863651 -870795 -858696 -829303 -839309 -842479
16191 -842479 -840688 -853095 -857821 -858819 -854130 -855268 -875890 -868506 -861871 -863151 -870776 -886500 -878907 -860634
16177 -860634 -860183 -886870 -914201 -934798 -917811 -891689 -880933 -860512 -842129 -840214 -838099 -854892
16165 -854892 -873908 -885558 -879361 -890978 -904379 -884460 -880347 -877207 -847175 -864090 -850804 -850736 -843427
16152h43427M004j2864J2610J6960j2153j3305j6341J2759K961P070N328J782
16140h34616K124P721k1710l3700k1708L681O258J9235r01J2093J982K67Q32r701
16126h68143L484L7836J4462j7819k9159k0506k0983k2047K4256J3106K4159p189
16114h68543j4238j2923N333O075K2480J3834J3068K9745j5056j8247J3882o054
16102h30644K698J4696L0224q979j9838J903K2880J5485j1169k1057N907K382
16090g95512k7318j9K2241J6958N853k2549j4857L720j1579J825q904n557l251
16077h38949J2633J4031j4827n995P343j5073J2233N811l224k456j8376j0374
16065h57223L0882J6592J0579P099k5544j3260R669j2875k2368Q467K2652K6822
$$ plain form
16152 -843427 -839423 -852287 -839677 -822717 -834870 -848175 -864516 -851757 -848796 -841726 -836398 -834616
16140 -834616 -832492 -824771 -846481 -880181 -901889 -898208 -891950 -872715 -873616 -861523 -859541 -859274 -858442 -868143
16126 -868143 -864659 -826823 -812361 -830180 -859339 -879845 -900828 -922875 -898619 -885513 -861354 -868543
16114 -868543 -882781 -895704 -890371 -884296 -861816 -847982 -834914 -805169 -820225 -838472 -824590 -830644
16102 -830644 -827946 -813250 -783026 -792005 -811843 -809940 -787060 -771575 -782744 -803801 -797894 -795512
16090 -795512 -822830 -822849 -800608 -783650 -777797 -800346 -815203 -811483 -823062 -821237 -830141 -835698 -838949
16077 -838949 -826316 -812285 -827112 -833107 -825764 -840837 -828604 -822793 -826017 -828473 -846849 -857223
16065 -857223 -826341 -809749 -799170 -792071 -817615 -830875 -821206 -834081 -856449 -847982 -825330 -798508
16053g98508J303r080l599p048q863J1047J5858R951p682M867k339k6128l666
16040h23887O257j0130n363J9368J2428k0969J1329J319J3277K279l747r665p80
16027h08284L621J7253n003j3555O601J6712J6635J4527j3543j9634o938k3618
16015h15226k318J1932o960K9604J7608n62J8959k2154l5943k2969r641J0880
16003h26790O3824K6616j6029j0828j329R467j3234P682j0449l0089N077K3558
15991g72524j2567o151R124J6891j3165j3686N185K1093k960k5715j675O923M84
15978g88743J6395K7754K5735L67p191k4220j2490J167J9561J4223N391j4305
15966g36356Q35j3097q640R233j2672O582L4936J2676J1636R638k0191m4529k3242
$$ plain form
16053 -798508 -797205 -806285 -809884 -816932 -825795 -814748 -798890 -788939 -796621 -791754 -794093 -820221 -823887
16040 -823887 -817630 -827760 -833123 -813755 -801327 -822296 -810967 -809648 -796371 -794092 -797839 -807504 -808284
16027 -808284 -804663 -787410 -792413 -805968 -799367 -782655 -766020 -751493 -765036 -784670 -791608 -815226
16015 -815226 -817544 -805612 -812572 -782968 -765360 -765922 -746963 -769117 -805060 -828029 -837670 -826790
16003 -826790 -762966 -736350 -752379 -763207 -764536 -755069 -768303 -760621 -771070 -801159 -796082 -772524
15991 -772524 -785091 -791242 -782118 -765227 -778392 -792078 -786893 -765800 -768760 -794475 -796150 -789227 -788743
15978 -788743 -772348 -744594 -718859 -718492 -725683 -749903 -762393 -761226 -741665 -727442 -722051 -736356
15966 -736356 -735521 -748618 -757258 -748025 -760697 -754115 -719179 -706503 -694867 -685229 -705420 -749949 -773191
15953g73191N043J8144j0650k1730Q500J4612O768L959j4749m39l8410r150J8307
15940g92986J0937N824m076M935q452k1255R292J906n876R373J5093J999R859
15927g63427R215r460K727L4681K5676q727n049k7546n438K9514q964j7522j6617
15914g60937j6023J4739M501j0676Q072l625N870q252k3151R902J7113O76K3161
15901g38630J4716j5530k3027r980P331n3J9182M418K159K5219j209j5034j6459
15888g46897O584j5115Q546J7956J7475R025K843j7405j6079K094K1592k5619
15876g35000j8148K606L4080Q081k2684K2157J3867J258l170q937j7960J7986
15864g05864J1369O203p590j784J2555R639j448J8405j8006l1815r704l686J348
$$ plain form
15953 -773191 -768148 -750004 -760654 -782384 -773884 -759272 -752504 -748545 -763294 -763733 -802143 -811293 -792986
15940 -792986 -782049 -776225 -780301 -775366 -783818 -805073 -795781 -793875 -799751 -790378 -775285 -773286 -763427
15927 -763427 -754212 -763672 -760945 -726264 -700588 -709315 -714364 -741910 -747348 -717834 -726798 -744320 -760937
15914 -760937 -776960 -762221 -757720 -768396 -760324 -763949 -758079 -766331 -789482 -779580 -762467 -761791 -738630
15901 -738630 -723914 -739444 -762471 -772451 -765120 -765173 -745991 -741573 -739414 -714195 -715404 -730438 -746897
15888 -746897 -740313 -755428 -746882 -728926 -711451 -702426 -699583 -716988 -733067 -730973 -709381 -735000
15876 -735000 -753148 -750542 -716462 -708381 -731065 -708908 -695041 -693783 -696953 -705890 -723850 -705864
15864 -705864 -694495 -688292 -695882 -697666 -685111 -675472 -676920 -658515 -676521 -708336 -718040 -721726 -720378
15851g20378K650J0419j3057K3019n486q661l9135O951J3993O421j0870R280J6754
15838g08100J3978j5317k6349j7418j1790K865M295J6966K524j3550R105q899
15826g51690J6515J5771J5827J9697j2517j0552J1310L0354L0302o537k9332j8172
15814f89024j9190J4482K0839p627J6372l466o782j3849l1506J152N970M981j113
15801g08761M731K358l32J0131O428N208j4611O396K3006J1603j0080k3703j0375
15788f98001q36J9661j6649k8614J993J8030L9411K6744P871j6958o777m443j3805
15775f72373o735P758J4681O549J1067R158j021r076j3105k7948j1948l531L585
15762f92939J2604P449M889l018k1915j2276J4856K118k4627K5301R112n37J1741
$$ plain form
15851 -720378 -717728 -707309 -720366 -697347 -702833 -711494 -750629 -743678 -729685 -723264 -734134 -724854 -708100
15838 -708100 -694122 -709439 -735788 -753206 -764996 -762131 -757836 -740870 -738346 -751896 -742791 -751690
15826 -751690 -735175 -719404 -703577 -683880 -696397 -706949 -695639 -665285 -634983 -641520 -670852 -689024
15814 -689024 -708214 -693732 -672893 -680520 -664148 -667614 -674396 -688245 -719751 -718599 -712629 -707648 -708761
15801 -708761 -704030 -701672 -702004 -691873 -685445 -680237 -694848 -688452 -665446 -653843 -663923 -687626 -698001
15788 -698001 -698837 -679176 -695825 -724439 -722446 -704416 -665005 -638261 -630390 -647348 -654125 -658568 -672373
15775 -672373 -679108 -671350 -656669 -650120 -639053 -629895 -630916 -639992 -653097 -681045 -692993 -696524 -692939
15762 -692939 -680335 -672886 -667997 -671015 -692930 -705206 -690350 -688232 -712859 -687558 -678446 -678983 -667242
15749f67242j5203k1242K736L420k164J4589K0406j0237R678J2661R102j1097
15737f54593M910K452o289l2577J8405L0412l149j635k2510P499K5189r155r133
15724f50174j3664J6234j0385J445q762k2010k373J2464j2241k1099P620J210
15712g01735k470J899K2785L5326O016J9284q18r264l7996k0043P763L459K230
15699f73564J1557J4743J3063O2M996o74k8248j8373k004J23J9016J0716p838
15686f56425J0120m60K962J2515j0368K6116J4127k181r954j6122j4977j3582
15674f58229J2771J4866r809j6431r662J5817K0024p772j0364M770M846J6777
15662f22396k0924J971L0309j5493k4335k086M2821N762k0085l514J033k5065
$$ plain form
15749 -667242 -682445 -703687 -700951 -697531 -699695 -685106 -664700 -674937 -665259 -652598 -643496 -654593
15737 -654593 -649683 -647231 -653520 -686097 -667692 -637280 -640429 -642064 -664574 -657075 -631886 -641041 -650174
15724 -650174 -663838 -647604 -657989 -656544 -665306 -687316 -689689 -677225 -689466 -710565 -702945 -701735
15712 -701735 -704205 -702306 -679521 -644195 -638179 -618895 -619713 -628977 -666973 -687016 -679253 -675794 -673564
15699 -673564 -662007 -647264 -634201 -634139 -629143 -629817 -658065 -676438 -678442 -678319 -659303 -648587 -656425
15686 -656425 -646305 -646765 -643803 -631288 -641656 -615540 -601413 -603594 -613548 -629670 -644647 -658229
15674 -658229 -645458 -630592 -640401 -656832 -666494 -650677 -630653 -638425 -648789 -644019 -639173 -622396
15662 -622396 -643320 -641349 -611040 -626533 -650868 -652954 -610133 -604371 -624456 -627970 -626937 -652002
15650f52002j3897j752J1215j5516j2276P813k725J8146M9721R276J601j0047
15638f10443p275j6446L944M782J722j7327j6793l808Q604Q326K394j5567J209
15625f56678Q800l946m608N106J0980L6996p845j183k0483j5640j4832J4443J4511
15612f34379P395Q092L941m991k046K9609J3984k9416o463l875k793k1531p470
15599f49943L5871J1112j2481J5233K5091j7575j8924j004p02M933J0278n272
15587f03383J023O461j4624j3965k478Q634O640J7222K9237L914j6275j8458p258
15574f03310J0638K1539p319J165J0888J5853l0809p452j3540l1964K3396O109
15562f04806N802J2897j9902k660Q392m757J4348J5688J1813P219J1112J3223
$$ plain form
15650 -652002 -665899 -667651 -656436 -671952 -684228 -676415 -679140 -660994 -611273 -601997 -600396 -610443
15638 -610443 -617718 -634164 -630220 -625438 -623716 -641043 -657836 -661644 -653040 -644714 -642320 -657887 -656678
15625 -656678 -647878 -651824 -656432 -651326 -640346 -603350 -611195 -612378 -632861 -648501 -663333 -648890 -634379
15612 -634379 -626984 -618892 -614951 -619942 -621988 -592379 -578395 -607811 -614274 -618149 -620942 -642473 -649943
15599 -649943 -614072 -602960 -615441 -600208 -575117 -592692 -611616 -612620 -613322 -608389 -598111 -603383
15587 -603383 -602360 -595899 -610523 -624488 -626966 -618332 -611692 -594470 -565233 -561319 -577594 -596052 -603310
15574 -603310 -592672 -571133 -578452 -577287 -566399 -550546 -581355 -588807 -602347 -634311 -610915 -604806
15562 -604806 -599004 -586107 -606009 -608669 -600277 -605034 -590686 -574998 -563185 -555966 -544854 -531631
15550e31631l2440j8402P624M081m847j5952K162j5146m898K6751J7353j2618
15538e77963l7585j3547J5345J9726J6158j3053j3518M930K2199K0254m889k4397
15526e86340j695L0772L339K186n014l919j1009J0424L270l1381j6068p160R49
15513f11646L683K0160q481M544J4693K7896p446k6157j721J4062j7950J2918
15501e75445J3986R35k2766R221L4591j1258j424m65l1059j690j1179O794O072
15488e83687J9270K1084j3715m350K1622K2094j0855r396j6383k8106n554L7994
15476e49982q430k539M892K0966k9718O435J6358M942j8305k7843K3485Q813k958
15463e53884o781R053J2053q086L929j1676o141J5627j4787m502J5302N666q217
$$ plain form
15550 -531631 -564071 -582473 -574849 -570768 -575615 -591567 -589405 -604551 -609449 -582698 -565345 -577963
15538 -577963 -615548 -629095 -613750 -594024 -577866 -590919 -604437 -599507 -577308 -557054 -561943 -586340
15526 -586340 -588035 -557263 -553924 -551738 -556752 -560671 -571680 -561256 -557986 -589367 -605435 -612595 -611646
15513 -611646 -607963 -587803 -596284 -591740 -577047 -549151 -556597 -582754 -584475 -570413 -588363 -575445
15501 -575445 -561459 -560524 -583290 -574069 -539478 -550736 -552160 -552625 -583684 -585374 -596553 -589759 -583687
15488 -583687 -564417 -543333 -557048 -561398 -539776 -517682 -528537 -537933 -554316 -582422 -587976 -549982
15476 -549982 -558412 -560951 -556059 -535093 -564811 -558376 -542018 -537076 -555381 -583224 -559739 -550926 -553884
15463 -553884 -560665 -551612 -539559 -547645 -543716 -555392 -561533 -545906 -560693 -565195 -549893 -544227 -552444
15450e52444j6169n285Q266n002J577m939K6461Q78k8024k1482k19M942Q93m491
15436e95038L7473m310k7037L029K60J224J8224j606J2966o94K4576K0362m148
15423e14719j2313j3608l3584l880J0321K6848Q6L2222J0735k3989P224L336j2725
15410e24046o480r038N422m522k2692L786k4339r560J8843J4374j0090P165P643
15397e53534j3847j7015l008p618K5399K8385j9441j0318P551R39j8826j3675
15385e95008K8174L728K407l628m432l86K0867K2211J4504l1826m4653k8059K4925
15372e91176K1458K8254J4066R122m062J5363l086j7820K264L168l7267k2305
15360e82021K4695K5447q530k5329n508J3703K2327j353p891l620J385K7845J5386
$$ plain form
15450 -552444 -568613 -573898 -565632 -570634 -569057 -573996 -547535 -546657 -574681 -596163 -596382 -591440 -590547 -595038
15436 -595038 -557565 -561875 -588912 -585883 -585623 -584399 -566175 -567781 -554815 -555509 -530933 -510571 -514719
15423 -514719 -527032 -540640 -574224 -578104 -567783 -540935 -540849 -508627 -497892 -521881 -514657 -511321 -524046
15410 -524046 -530526 -539564 -534142 -538664 -561356 -557570 -581909 -591469 -572626 -558252 -568342 -561177 -553534
15397 -553534 -567381 -584396 -587404 -595022 -569623 -541238 -560679 -570997 -563446 -562507 -581333 -595008
15385 -595008 -566834 -563106 -560699 -564327 -568759 -569145 -548278 -526067 -511563 -543389 -588042 -616101 -591176
15372 -591176 -569718 -541464 -527398 -518276 -522338 -506975 -510061 -527881 -525617 -522449 -559716 -582021
15360 -582021 -557326 -531879 -540409 -565738 -571246 -557543 -535216 -536569 -544460 -548080 -546695 -518850 -503464
15347e03464o815j7041p571J6234J117j992j0969k1805J3851K1960l712J1277
15335e08930P294J1673J527n678j4064l7957j3293q225N227O994k482J4254L2423
15322e11237J0257L971J7471J5348P880j5365j8970j4742j0312l3683k944N671
15310e46655J5147J751J5289M742j3233k8705N571L1917J2845k6953n667j027
15298e34978n46J6053k715o04l571p93J9236j417J6464J9512j7725j5256J0394
15285d95946r938k2678k771J2736R31q40L0k556j4919o049j3594m143J9612n176
15271e45301j3181L5999M263q103M449j1721M382j996R54K4470P794j9976r252
15258e27219R867J3234j1590j1290P891k8591J4365Q915L446K2525J6322K1064
$$ plain form
15347 -503464 -510279 -527320 -534891 -518657 -517540 -519532 -530501 -552306 -538455 -516495 -520207 -508930
15335 -508930 -501636 -489963 -488436 -494114 -508178 -546135 -559428 -567653 -562426 -555432 -557914 -543660 -511237
15322 -511237 -500980 -497009 -479538 -464190 -456310 -471675 -490645 -505387 -515699 -549382 -552326 -546655
15310 -546655 -531508 -529757 -514468 -509726 -522959 -551664 -546093 -514176 -501331 -528284 -533951 -534978
15298 -534978 -535524 -519471 -522186 -522790 -526361 -527154 -507918 -509335 -492871 -473359 -491084 -506340 -495946
15285 -495946 -505884 -528562 -531333 -518597 -517666 -518506 -518476 -521032 -535951 -542000 -555594 -559737 -540125 -545301
15271 -545301 -558482 -522483 -518220 -526323 -521874 -533595 -529213 -531209 -530255 -505785 -497991 -517967 -527219
15258 -527219 -517352 -504118 -515708 -526998 -519107 -547698 -533333 -524418 -520972 -498447 -482125 -461061
15246d61061j0048K236J5356n70k9982j7307K2622K841o939k6773j1177j179K0998
15233e00983J3108j1197k7273K1010J5136J3818m921P741J0898J2333m490k714
15221d57534K2357j9900j1492R776Q51j8910k3907q860J2058O569M401J1577j664
15208d74678L987q516R309K3006j1039K614j52L182n602J392N576p947j240r851
15194d69959o764J5281m814j0948J8530N072N1R18q624j466J3555J002M70k3816
15180d71512k14K0688K0031j1498l4743q9J3460j3737j5709m918m063N606J4264
15167d82434P303J6822r115j6109O869K0867l57j0716J496n479l694m999K0953
15154d58593K4823r464Q85M268l922P286j3940j5173K0406l708n59Q788R199k8919
$$ plain form
15246 -461061 -471109 -468873 -453517 -454087 -484069 -501376 -478754 -475913 -482852 -509625 -520802 -521981 -500983
15233 -500983 -487875 -499072 -526345 -505335 -490199 -476381 -481302 -473561 -462663 -450330 -454820 -457534
15221 -457534 -435177 -455077 -466569 -456793 -455942 -474852 -498759 -507619 -495561 -488992 -484591 -473014 -474678
15208 -474678 -470691 -479207 -469898 -446892 -457931 -455317 -455469 -452287 -457889 -456497 -450921 -458868 -460108 -469959
15194 -469959 -476723 -461442 -466256 -477204 -458674 -453602 -453551 -452633 -461257 -462723 -449168 -448166 -447696 -471512
15180 -471512 -471726 -451038 -431007 -442505 -477248 -477337 -463877 -477614 -493323 -498241 -502304 -496698 -482434
15167 -482434 -475131 -458309 -467424 -483533 -476664 -455797 -456154 -466870 -465374 -470853 -474547 -479546 -458593
15154 -458593 -433770 -443234 -442349 -438081 -442003 -434717 -448657 -463830 -443424 -447132 -447691 -438903 -429704 -458623
15140d58623J6934K3734J757K1380j5977k9678J5003j5555m3447M21M0264l224
15128d47011M444J0691P357j5072n507m170J0367M366j666L904K132k0460k7492
15115d78117K405J5086J5461P570J5996O856O63j92l75k9020k4282K6079j1866
15102d53736M956L3683m756m69l0080o304J1070l035p428r244K358q877J795K633
15088d67434K1838J5128k1255j177l693j6153q90j3594j7443K9472M155J3375
15076d57671J9311J6949k839j8023J2025j8418L4186K1840m594J291o873k8720
15064d31536k9276M776J0381M321J5426L0863J4864j5710p48m574q675K548J505
15051d05835q428k4057Q101R4j242o992j3444k0343r937K1828J9658L3369j8149
$$ plain form
15140 -458623 -441689 -417955 -416198 -394818 -410795 -440473 -425470 -441025 -484472 -484051 -443787 -447011
15128 -447011 -442567 -431876 -424519 -439591 -445098 -449268 -438901 -434535 -436201 -432297 -430165 -450625 -478117
15115 -478117 -475712 -460626 -445165 -437595 -421599 -414743 -414080 -414272 -414647 -443667 -467949 -441870 -453736
15102 -453736 -448780 -415097 -419853 -420322 -450402 -456706 -445636 -448671 -456099 -465343 -462985 -471862 -470067 -467434
15088 -467434 -445596 -430468 -451723 -452900 -456593 -472746 -473636 -487230 -504673 -475201 -471046 -457671
15076 -457671 -438360 -421411 -424250 -442273 -430248 -448666 -414480 -392640 -397234 -395943 -402816 -431536
15064 -431536 -460812 -456036 -445655 -441334 -425908 -395045 -380181 -395891 -396639 -401213 -409888 -407340 -405835
15051 -405835 -414263 -438320 -430219 -430125 -431367 -438359 -451803 -472146 -482083 -460255 -440597 -407228 -425377
15038d25377K230M08q700K0525K2630O949P56K111k1361k6759m320J7132n217
15025d18993k979R011K857K0480q40M580l0893k4492j0977p506n878j282J6168
15012d50744N548K5252K4172k94J0062J0449k0146j5881P223K4763l694n742K4041
14999c64991j766J482j7942p067J244k2132J208K3016J1088j0440k3457N165J756
14986d02836J4449J6536R770L904l6455k4438k714k7519j6606L70M720J7726J3227
14973d29866L308Q71m321Q861K3792Q264k4274R614O874K2304j3705Q488J3542
14960c66248k6227k1278J2092J0915P548j6121K945K5884l0517M901J6116k585
14948c82575j6535k1934n159p723r303K7663k937j552Q973J4100J0799J2992j0179
$$ plain form
15038 -425377 -423147 -422739 -431439 -410914 -388284 -381335 -380579 -378468 -399829 -426588 -430908 -413776 -418993
15025 -418993 -421972 -412961 -410104 -389624 -390464 -385884 -416777 -441269 -452246 -459752 -465630 -466912 -450744
15012 -450744 -445196 -419944 -395772 -396066 -386004 -375555 -395701 -411582 -404359 -379596 -383290 -389032 -364991
14999 -364991 -366757 -365275 -383217 -390284 -389040 -411172 -409964 -386948 -375860 -386300 -409757 -404592 -402836
14986 -402836 -388387 -371851 -362081 -358177 -394632 -419070 -421784 -449303 -465909 -465539 -460819 -443093 -429866
14973 -429866 -426558 -425687 -430008 -421147 -397355 -389091 -413365 -403751 -396877 -374573 -388278 -379790 -366248
14960 -366248 -392475 -413753 -401661 -390746 -383198 -399319 -396374 -370490 -401007 -396106 -379990 -382575
14948 -382575 -399110 -421044 -426203 -433926 -443229 -415566 -418503 -420055 -411082 -396982 -386183 -373191 -383370
14935c83370k2695l561J9383o26k1735j9278j6559K3379L6589Q394O022J145j0555
14922c83467n36j1125J305K4662n975N008O552M269j3652k5557j0004L29R908
14909c98283j206M392j4595K9412K6160R642j4141l1856j4420J1536J6515N94
14897c76250J5271J9422j919R70L331J1426O334l627N583k0716j1441j7580m672
14884c73868q511J0236N316Q761m372j3910J0805R655L933N965r350P047M022
14871c44271J3217J4009n818k1102o607P931k154j5274J8139J1549M76j6266k2046
14858c68217K724J1220K2349K496j7557O897j6002M765K2436N132k42k241J7592
14845c08648p272k2105l9801j823m883J5171l2307Q554L8253J2468J637J0002
$$ plain form
14935 -383370 -406065 -409626 -390243 -390869 -412604 -431882 -448441 -425062 -388473 -380079 -374057 -372912 -383467
14922 -383467 -384003 -395128 -393823 -369161 -375136 -370128 -363576 -359307 -372959 -398516 -408520 -408191 -398283
14909 -398283 -399489 -395097 -409692 -380280 -354120 -344478 -358619 -390475 -404895 -393359 -376844 -376250
14897 -376250 -360979 -341557 -343476 -342506 -339175 -327749 -321415 -325042 -319459 -340175 -351616 -369196 -373868
14884 -373868 -382379 -372143 -366827 -358066 -362438 -376348 -365543 -355888 -351955 -345990 -355340 -348293 -344271
14871 -344271 -331054 -317045 -322863 -343965 -350572 -342641 -344795 -360069 -341930 -330381 -329905 -346171 -368217
14858 -368217 -365493 -354273 -331924 -329428 -346985 -340088 -356090 -351325 -328889 -323757 -323999 -326240 -308648
14845 -308648 -315920 -338025 -377826 -379649 -384532 -369361 -401668 -393114 -354861 -342393 -340756 -330754
14833c30754N199r059P025k3446j5375K5940K1104Q802p191m8217j9002L8577
14821c46397J2205o84N320j139L5421j4320j5252J2240j4545j0098K4196J6291
14809b96762j3355p573L0244j5318k8242k1302M957N091r556Q2p458j8472n596
14796c83260J27K0329J1726R057p092j521j1429j2176L310M1567K7223k5052k3635
14783c50826L1302K3565M214j1291k6090m659L308l4070k5137P158Q999L8757
14771c34770L7354K803p219m142o033l8325j8327J4688J3335q590k1977J3346
14759c57857L8733j0736j0861j2559K4360J9073r384M555K2082N512j1614k6969
14747c25665r027l694j6676N00K7909O423J9522m053j6121j6659M5808K9598j7161
$$ plain form
14833 -330754 -325555 -334614 -327589 -351035 -366410 -340470 -319366 -310564 -317755 -365972 -384974 -346397
14821 -346397 -334192 -334876 -329556 -330695 -295274 -309594 -324846 -312606 -327151 -337249 -313053 -296762
14809 -296762 -310117 -317690 -287446 -302764 -331006 -352308 -347351 -342260 -351816 -351734 -359192 -377664 -383260
14796 -383260 -383133 -362804 -351078 -342021 -349113 -350634 -362063 -374239 -370929 -329362 -302139 -327191 -350826
14783 -350826 -319524 -295959 -291745 -303036 -329126 -333785 -330477 -364547 -389684 -382526 -373527 -334770
14771 -334770 -297416 -294613 -301832 -305974 -312007 -350332 -368659 -353971 -340636 -349226 -371203 -357857
14759 -357857 -319124 -329860 -340721 -353280 -328920 -309847 -319231 -314676 -292594 -287082 -298696 -325665
14747 -325665 -334692 -338386 -355062 -354562 -326653 -320230 -300708 -304761 -320882 -337541 -291733 -262135 -279296
14734b79296k2677j8821O519o821O668p352l445J4779K952k3256N629L1866k246
14721b95501K688k6868k0812N806J8230j2597k7558Q637L2960K7553K8419k0245
14709b79288j9534M668N106k796p998K520j4186k6043k540K9767O322k3904k9566
14696c57472J2007J315K1979J6020J6624j2914r04K3960M2633K0857k532j9588
14684b38015j1495k0424o204J2185J4093K562q886o634K6785j8393k6135P165
14672b73396p269n74J6274J0512j3062K807K7883m690l1575j9197k2109J0449
14660c03947J9629j3893J7939K0691j6038j2568L044n1J1607N75L251L538j3585
14647b79808j1954q757Q514r863J0013K7762J5484j1802R835k1164P884J7018
$$ plain form
14734 -279296 -301973 -320794 -314275 -321096 -314428 -321780 -325225 -310446 -307494 -330750 -325121 -293255 -295501
14721 -295501 -292813 -319681 -340493 -334687 -316457 -329054 -356612 -347975 -315015 -287462 -259043 -279288
14709 -279288 -298822 -294154 -289048 -291844 -299842 -297322 -311508 -337551 -340091 -310324 -304002 -327906 -357472
14696 -357472 -345465 -344150 -322171 -306151 -289527 -302441 -303345 -279385 -236752 -215895 -218427 -238015
14684 -238015 -249510 -269934 -276138 -263953 -249860 -247298 -256184 -262818 -236033 -254426 -280561 -273396
14672 -273396 -280665 -281239 -264965 -254453 -267515 -264708 -236825 -241515 -273090 -292287 -314396 -303947
14660 -303947 -284318 -298211 -280272 -259581 -275619 -288187 -285143 -285194 -273587 -273012 -269761 -266223 -279808
14647 -279808 -291762 -300519 -292005 -301868 -291855 -264093 -248609 -260411 -250576 -271740 -263856 -246838
14635b46838j5630R617Q0o260j2112J0230K0064L402N181o028j136j0246k3748
14622b73424p770n325J2452p647p005J0599j4506k1224K1206K868n411Q599j0942
14609b97530j3132R73Q978O407L1879J1488J9172J8675q418k1217J2557k0084
14597b50252q082K2245K572k6989j6794j1078J1770J7291k1977P112N890J0333
14585b57959o909q046M432r287O674J640q78j3490j4866L067K208m028M600J2801
14571b80041p335K7960P84q984j09K2799K6521k7081j3716M08j3623j6288o116
14558b94821J7876K8174m320k213M363j1382l913P37L1194j2647j6489J4170O944
14545b42327L756K5285l111l03l332k8724Q418K1007J2519j1143R54m962j9592
$$ plain form
14635 -246838 -262468 -252851 -252771 -259031 -271143 -260913 -240849 -237447 -232266 -238294 -239430 -249676 -273424
14622 -273424 -281194 -286519 -274067 -281714 -288719 -278120 -292626 -313850 -292644 -289776 -295187 -286588 -297530
14609 -297530 -310662 -309689 -300711 -294304 -262425 -250937 -231765 -213090 -221508 -242725 -230168 -250252
14597 -250252 -258334 -236089 -233517 -260506 -277300 -288378 -276608 -259317 -281294 -274182 -268292 -257959
14585 -257959 -264868 -272914 -268482 -277769 -271095 -269455 -270333 -283823 -298689 -295622 -293414 -297442 -292842 -280041
14571 -280041 -287376 -259416 -258632 -267616 -267725 -244926 -218405 -245486 -259202 -258794 -272417 -288705 -294821
14558 -294821 -276945 -248771 -253091 -255304 -250941 -262323 -266236 -265499 -234305 -246952 -263441 -249271 -242327
14545 -242327 -238571 -213286 -216397 -216700 -220032 -248756 -240338 -219331 -206812 -217955 -217001 -221963 -241555
14532b41555j6253j0794J2127k105N810n510J273j1607p713r356J0248M719k1612
14519b92328L752L1383Q972L711J220k1821L2628J8577j5646k4402K369L700j5124
14506b63009j4390K6227L6321K7496j044J2494m829k7189J5830j1097j3222j469
14494b17881k798J9374k8047l9989n868K71j6468J1275K1591K0103K18J2123L1573
14481a94523k592K562l3756L4443K1786o700k4337k1281J0508K92k6618J1436
14469b28780r913K0339J0642p397j8596K1224l069J0090L832q391k804j0629j8555
14456b42007j5634J453K9197L0993m113P186J0695J2p218P487p04j6282m715L4
14442b03616l893K566m952P072j6110o687J9637J3388J001j7379k9281K5130M974
$$ plain form
14532 -241555 -257808 -268602 -256475 -258580 -252770 -258280 -257007 -268614 -276327 -285683 -275435 -270716 -292328
14519 -292328 -288576 -257193 -248221 -244510 -243290 -265111 -232483 -213906 -229552 -253954 -251585 -247885 -263009
14506 -263009 -277399 -251172 -214851 -187355 -188399 -175905 -180734 -207923 -192093 -203190 -216412 -217881
14494 -217881 -220679 -201305 -229352 -269341 -275209 -274938 -291406 -280131 -258540 -238437 -238219 -226096 -194523
14481 -194523 -197115 -194553 -228309 -193866 -172080 -178780 -203117 -224398 -213890 -213598 -240216 -228780
14469 -228780 -238693 -218354 -207712 -215109 -233705 -212481 -215550 -205460 -201628 -210019 -212823 -223452 -242007
14456 -242007 -257641 -256188 -226991 -195998 -200111 -192925 -182230 -182218 -189436 -181949 -182653 -198935 -203650 -203616
14442 -203616 -207509 -204943 -209895 -202823 -218933 -225620 -205983 -192595 -191594 -208973 -238254 -213124 -208150
14429b08150J140L764O522k5423R228J3374j0710j1431J3455R566q247j3233j730
14416b21875R034Q832L3084j3578k0416M30j086N745O728K446O05O512J017j2091
14402a94613L123j5268j228o487n868J5166J1160L202l834K7720J5981j6511k1875
14389a89332j9472Q613K6174L141K142j9419k3891J3962O695P232j408K1400N182
14376a58981q410J7830Q487j0271q51m5340q354K9073l54k8328J645M8233J081
14363a54540j784k3965j7521o721j8693R793M4044j0484l9629K401M5214L3744
14351a38141R471q077O055K018j1296J5862L2569k6739m9338j8916O236j428N199
14338a76525J767p387Q209K18J3255J7413J7208j4207k1434q323m373K1019M7423
$$ plain form
14429 -208150 -207010 -203246 -196724 -222147 -212919 -199545 -210255 -221686 -208231 -198665 -206912 -220145 -221875
14416 -221875 -212841 -204009 -170925 -184503 -204919 -204489 -205575 -199830 -193102 -190656 -190051 -183539 -182522 -194613
14402 -194613 -191490 -206758 -207986 -214473 -220341 -205175 -194015 -190813 -194647 -166927 -150946 -167457 -189332
14389 -189332 -208804 -200191 -174017 -170876 -168734 -188153 -212044 -198082 -191387 -184155 -185563 -164163 -158981
14376 -158981 -167391 -149561 -141074 -151345 -152196 -197536 -205890 -176817 -177171 -205499 -203854 -155621 -154540
14363 -154540 -156324 -180289 -197810 -204531 -223224 -213431 -169387 -179871 -219500 -217099 -171885 -138141
14351 -138141 -128670 -136747 -130692 -128674 -139970 -124108 -91539 -118278 -167616 -186532 -180296 -181724 -176525
14338 -176525 -174758 -182145 -173936 -173718 -160463 -143050 -125842 -140049 -161483 -169806 -174179 -153160 -105737
14325a05737J3795l7064l2811n81k331J200k14K7165Q733L921o066j3619j3880
14312a57489L121k510M922L6108Q13k5682j5440r722L279J3387J8211K0941O051
14299a04010m903l5082j8824L908m226j7481M38K7724L6529j931l0558J5911J359
14286a31146k8372N595k816l93J6890p014q620r829p435j850O968J7391J1753
14273a38878j280N85k0496o382o033k2075J4087K0536j3022J6706J1247K9540
14261a15465O149n854r36j2232M531j1191o467q279K0591M030L909j3755P048
14248a27921K0854R928J7314R195K067l5860j0339P136o231J7523Q857k4875K531
14235a09821p191j7316N210J8569q016J2062n971k0314j154J2381J6198l1309
$$ plain form
14325 -105737 -91942 -129006 -161817 -162398 -164729 -163529 -163743 -136578 -127845 -123924 -129990 -143609 -157489
14312 -157489 -154368 -156878 -151956 -115848 -115035 -140717 -156157 -165879 -162600 -149213 -131002 -110061 -104010
14299 -104010 -108913 -143995 -162819 -158911 -163137 -180618 -180180 -152456 -115927 -117858 -148416 -132505 -131146
14286 -131146 -159518 -153923 -156739 -157132 -140242 -147256 -155876 -165705 -173140 -174990 -168022 -150631 -138878
14273 -138878 -140158 -139573 -160069 -166451 -172484 -194559 -180472 -159936 -172958 -156252 -145005 -115465
14261 -115465 -109316 -115170 -116106 -128338 -123807 -134998 -141465 -149744 -129153 -125123 -121214 -134969 -127921
14248 -127921 -107067 -97139 -79825 -70630 -68563 -104423 -114762 -107626 -113857 -96334 -87477 -112352 -109821
14235 -109821 -117012 -134328 -129118 -110549 -118565 -106503 -112474 -132788 -133942 -121561 -105363 -136672
14223a36672m737j2807n39R189R370K0151K4769M793k0293j0554q382k518J2998
14210a15232j1690J1110K467J7965K1561j7874n23m1305J444L8820q609k321j8653
14197a22840p640J1222J096K7453M376M653p527O15J1251l1077j8794l825L666
14184a27371J2167K766J3922K949j1011J362J1836k1070m943Q845J113K2637o707
14171i3505k5848N853R529K0123R72q375n854j6086M428P938Q563k9868n0988
14158a73118J1059J4832L7324K7852j0655m017N88k033n29J0232J5573M176o891
14145g5607k142N273K0851J1177p924j2315j8449J5753J6838k026Q631J3672J8258
14132h010j3662k9842k7694j955J0663K0676j952M529j709k0067r68K1939j9658
$$ plain form
14223 -136672 -141409 -154216 -154755 -145566 -136196 -116045 -91276 -86483 -106776 -117330 -125712 -128230 -115232
14210 -115232 -126922 -115812 -113345 -95380 -73819 -91693 -92216 -133521 -132077 -93257 -101866 -104187 -122840
14197 -122840 -130480 -119258 -118162 -90709 -86333 -81680 -89207 -88592 -77341 -108418 -127212 -131037 -127371
14184 -127371 -115204 -112438 -98516 -95567 -106578 -105216 -93380 -114450 -119393 -110548 -109435 -86798 -93505
14171 -93505 -119353 -113500 -103971 -83848 -82876 -91251 -97105 -113191 -108763 -100825 -92262 -122130 -173118
14158 -173118 -162059 -147227 -109903 -82051 -92706 -96723 -96135 -98168 -98697 -88465 -72892 -68716 -75607
14145 -75607 -77749 -72476 -51625 -40448 -48372 -60687 -79136 -63383 -46545 -48571 -39940 -26268 -8010
14132 -8010 -21672 -51514 -79208 -81163 -70500 -49824 -51776 -47247 -48956 -69023 -69991 -48052 -67710
14119f7710l2759q42J4418j5559j5176J0874L4212J1099j1849J111m1022j2570
14107a25773J6390K4175Q930J3632K0454j2308J2277J600q534l5282k1687R036
14095i7090K7515J6367n620j347J6257L1951L101k7332o144Q801R426P565j163
14082a7713j7484j4702k7735k133K7597J6197K3032j1092L337J4049O91k9591
14070c5547J2971R827m865j0365j3235K1940J7223j0281l8921j6560j5597J1952
14058g1458m094Q580j4282Q944K0825L752j1528k4947R047J4697m054K1456J5661
14045b7401R569R241m5966J884M4513J9726k5152k9778j0989J0836j0149j3679
14033f7345J2443J7579j6811j937q005K8269J7627m269m538M3105K0577J146k1467
$$ plain form
14119 -67710 -100469 -101311 -86893 -102452 -117628 -106754 -72542 -61443 -73292 -72181 -113203 -125773
14107 -125773 -109383 -85208 -76278 -62646 -42192 -54500 -42223 -40623 -49157 -84439 -106126 -97090
14095 -97090 -69575 -53208 -58828 -60175 -43918 -11967 -8866 -36198 -42342 -33541 -24115 -16550 -17713
14082 -17713 -35197 -49899 -77634 -79767 -52170 -35973 -12941 -24033 -20696 -6647 -5956 -35547
14070 -35547 -22576 -12749 -17614 -27979 -41214 -19274 -2051 -12332 -51253 -67813 -83410 -71458
14058 -71458 -75552 -66972 -81254 -72310 -51485 -47733 -59261 -84208 -75161 -60464 -64518 -43062 -27401
14045 -27401 -17832 -8591 -54557 -52673 -8160 11566 -13586 -43364 -54353 -43517 -53666 -67345
14033 -67345 -54902 -37323 -54134 -56071 -64076 -35807 -18180 -22449 -26987 16118 36695 37841 16374
14020A6374n3019j3544n27l504k3299K1590j747p214O374J1209j6146J2412r700
14007f0741J1577K406L197m297j0355J4953J6853J8526J161j0631l0556k1943
13995f9850J3494n927r568K2875J037N945J6295k1414L5164M1l32P897o494k9988
13981d0825j3498K9617L082j725J5583K5093j1327K683L826O562l800q950q289
13968a968n636o974L855K6064k241k6441l094M069J5692n109k0142Q47L1089L068
13954A3079k9250m257j5039R538J8179J6383J6865J468K1390P213J161k8846p67
13941B7117j7286k856J530J5065K0829M68q369k9057l679N153p709k1173J5975
13928c992M3766o810l949k3294p658J2638M285L0246K2370M706N748j8198l5764
$$ plain form
14020 16374 -36645 -50189 -50716 -54220 -77519 -55929 -57676 -64890 -58516 -47307 -63453 -51041 -60741
14007 -60741 -49164 -46758 -43561 -47858 -58213 -43260 -26407 -7881 -6720 -17351 -47907 -69850
13995 -69850 -56356 -62283 -71851 -48976 -47939 -41994 -25699 -47113 -11949 -11908 -12240 -4343 -10837 -40825
13981 -40825 -54323 -24706 -21624 -23349 -7766 17327 6000 8683 12509 19071 15271 6321 -1968
13968 -1968 -7604 -14578 -10723 15341 13100 -13341 -16435 -12366 3326 -1783 -21925 -21078 10011 13079
13954 13079 -16171 -20428 -35467 -25929 -7750 8633 25498 26966 48356 55569 56730 27884 27117
13941 27117 9831 6975 8505 23570 44399 44867 36498 7441 3762 8915 1206 -19967 -3992
13928 -3992 39774 32964 29015 5721 -1937 10701 14986 45232 67602 72308 78056 59858 24094
13915B4094j7974N557J0857O627j1128j4188p336K5930J2983P354J6663K5089
13903H4528k4388l1437n330n619O538L129R434L949K135j3348m2632j4755K2685
13890e111K0775K4247K1390J099K476M094j064j4787l242n491j1572O740L2814
13877G2368N850j3537j3742k1614m0326p650K0283J9604J1206P159m101P009J5010
13864E7519o048J3521j956J5449p023j1398J696n415P114j6461j7288P754J3292
13851E0756K4694j8800j9435K3533L7574j3647j4281k8084r095K6178K61M450
13839F4104K9430m979j8074P414k2264K517j1121n035M325L971J1712l004q352
13826E0644J1803J7004j7388k5747O809K4777J1707o441N284M666K0468J5718
$$ plain form
13915 24094 6120 11677 22534 29161 18033 3845 -3491 22439 35422 42776 59439 84528
13903 84528 60140 28703 23373 17754 24292 27421 36855 40804 42939 29591 -13041 -27796 -5111
13890 -5111 15664 39911 61301 62400 64876 68970 67906 53119 49877 44386 32814 39554 72368
13877 72368 78218 64681 50939 29325 -11001 -18651 1632 21236 32442 39601 35500 42509 57519
13864 57519 51471 64992 63036 78485 71462 60064 61760 56345 63459 46998 29710 37464 50756
13851 50756 75450 56650 37215 60748 98322 84675 70394 42310 33215 59393 59654 64104
13839 64104 93534 88555 70481 77895 55631 58148 47027 41992 46317 50288 62000 58996 50644
13826 50644 62447 79451 62063 36316 43125 67902 79609 73168 78452 83118 103586 119304
13814A19304p811l1910n587N763m15k4990M66j1376j6090J3266K3956R942j6171
13801E8347k8377j8402R802J4757P743J8622J2857j9644P495K9876J2330j3800
13789I1606o876k348P508J1717K554j5603o286m750J8991J7743p7O08k2376R875
13775A02286Q572O546j7238k6669L40J4283K1503k7957q351l896J7698j0917m63
13762G5737L5868J0005j2538k2214N381J600j8144k0981J7619J3240j346L432
13750H7659j088K262J3145J9259k5427J5669L057k5910o482J2409N822J3416k3208
13737I0583k2136J0910R053K2481N931k5552O534j0633L284K2790n264n645M0275
13724A42611J8146k0244k9378j9119L6920J0323r362j4591Q899R863K6603J0867
$$ plain form
13814 119304 111493 79583 73996 79759 79344 54354 54820 43444 27354 40620 64576 74518 58347
13801 58347 29970 11568 21370 36127 43870 62492 75349 55705 63200 93076 105406 91606
13789 91606 84730 82382 89890 101607 104161 88558 82272 77522 96513 114256 114179 114787 92411 102286
13775 102286 110858 117404 100166 73497 73837 88120 109623 81666 73315 69419 87117 76200 75737
13762 75737 111605 121610 109072 86858 92239 93839 75695 54714 72333 85573 84227 87659
13750 87659 86571 88833 101978 121237 95810 111479 114536 88626 82144 94553 100375 113791 90583
13737 90583 68447 79357 88410 110891 116822 91270 97804 87171 90455 113245 107981 102336 142611
13724 142611 160757 140513 111135 92016 128936 139259 129897 115306 124205 134068 160671 171538
13712A71538k8796l1050m82m473J0907l585J661n333j9826J3495J8056n11K648
13699A24249R052n210k692m330n305j9418K6146K2663K213k7010j7711L016m054
13686A01609J2630J0578K0191K865K3037j1772k7360K850R173P061L811O740K0865
13673A82278r308l8237n498J0924K3968M158o928o354L250l522j5021M673M053
13660A48436J1073l367j167Q503j6658j5052J6074J983J4084K44o908n225K5686
13647A77706O449j1725j0790P851K2000K907L459K4819J5458J7455j0493l4001
13635B11095j2571J2572J730j4602l633k90Q489p723k9032k4468L027j884K1375
13622A64085L3222J6687L4637L515l845k3639n8706j094J6989n845r708j2742
$$ plain form
13712 171538 142742 111692 111210 106737 117644 114059 115720 110387 90561 104056 122112 121601 124249
13699 124249 133301 128091 125399 121069 115764 96346 122492 145155 147368 120358 102647 105663 101609
13686 101609 114239 124817 145008 147873 170910 159138 131778 134628 143801 150862 154673 161413 182278
13673 182278 172970 134733 129235 140159 164127 168285 161357 155003 158253 154731 139710 144383 148436
13660 148436 159509 156142 154975 163478 146820 131768 147842 149825 163909 164153 157245 152020 177706
13647 177706 184155 172430 161640 169491 191491 194398 197857 222676 238134 255589 245096 211095
13635 211095 198524 211096 212826 198224 194591 194301 202790 195067 166035 141567 144594 142710 164085
13622 164085 197307 213994 248631 252146 248301 224662 165956 164862 181851 176006 166298 153556
13610A53556L3917J9337J06m284l955Q275O800k1314r368P630j5987J1509q300
13597A77922P210M259q169J92j8368j2829K627K2674Q195o025j3056J2673J7694
13584A94999n405j0179J7972o578k8283j0380J4028L0119K8696K348k383J3023
13572B37977k1990P753p993k1816r576n011J4349P109M19J1465K3296J1487k2341
13559B25128j7801J217m9980q479K5505L1433L4573L800j2262l2929o403k222
13547A91580n010K3617J3926K3679j052k4949Q89K210P355M1731j4531j4129j355
13534B43961r713Q76R890j8902J0442J8237R709J5794j3348k9523R350k7657j4221
13521B04895M804J2664J015J2917Q618J6470K2147j6467k4495k2064L16J963M567
$$ plain form
13610 153556 187473 206810 206916 202632 198677 206952 213752 192438 183070 190700 174713 186222 177922
13597 177922 185132 189391 181222 181414 163046 150217 152844 175518 183713 177688 164632 177305 194999
13584 194999 189594 179415 197387 190809 162526 152146 166174 196293 224989 227337 224954 237977
13572 237977 215987 223740 215747 193931 184355 179344 193693 200802 201221 212686 235982 247469 225128
13559 225128 207327 208544 158564 150085 175590 207023 241596 245396 233134 200205 193802 191580
13547 191580 186570 210187 224113 247792 246740 221791 222680 224890 232245 273976 259445 245316 243961
13534 243961 234248 235124 245014 226112 236554 254791 264500 280294 266946 237423 246773 219116 204895
13521 204895 209699 222363 223378 236295 244913 261383 283530 267063 242568 220504 220820 222783 227350
13508B27350J2551L25K2585J6563p596j0959r820J5174J7725J5158J382L529r381
13495B94586k4441j3313J4594J8948p063Q786N16k3826q986j335K939M69l9561
13482B22313l377J2990K0594K0340J2547K25j335K1374k761l2930r179K0395P891
13469B89087j3013m418j8580l296O77Q923J013j2394L23m727m334K0547O128j4079
13455B51857P911K4965K6503l238Q531J0219J2937K799j4671j607k221k5883l107
13442B94995J9632K1445j925k5092J0569q128j7834q637o49L962m355R11j525
13429B83369J7072j7190K2610P971j9821j7677O437J4648o080R709N212L909l4814
13416B75355M529L0745J3424o672j2508J2172J5038l256J9516Q752k4174k7902
$$ plain form
13508 227350 239901 240226 262811 279374 271778 260819 250999 266173 283898 299056 300438 303967 294586
13495 294586 270145 256832 271426 290374 283311 292097 292613 268787 259801 258466 261405 261874 222313
13482 222313 218936 231926 252520 272860 285407 285632 284297 305671 302910 269980 260801 281196 289087
13469 289087 276074 271656 253076 249780 250457 259380 260393 247999 248322 243595 239261 259808 265936 251857
13455 251857 259768 284733 311236 307998 316529 326748 339685 342484 327813 326206 323985 298102 294995
13442 294995 314627 336072 334147 309055 319624 311496 293662 285025 284376 288338 283983 284894 283369
13429 283369 300441 283251 305861 313832 294011 276334 282771 297419 291339 301048 306260 310169 275355
13416 275355 279884 310629 324053 317381 304873 317045 332083 328827 348343 357095 332921 305019
13404C05019J4255j2988l220K0732L373M744J0469J2314K064k1208j3107J2948
13392C35395J877O767l14J9476p227j7914J5647k344j6467M44m512J1045j8398
13379C23475q420K330M284l807J1168l337J001n272m882J9795K5665K276J994
13366C66270j2497J0539k4201k4095J3033O919R381K6944j0104l558J3931J4096
13354C86658k426j32o520J3993l11J5396P304j4792j8921n79J4638r88p008j4714
13340C71598k3060l124j8875l1897P996K5440J3343j661K0768M2044R241l648
13328D08165J632k652j1368j2457j8494M820J0586P553n793r95R375L3638N310
13315D29320k8766j5399J3003k4493j785K5614K7340k825m649q255n048l6414
$$ plain form
13404 305019 319274 306286 303066 323798 327171 331915 342384 354698 356762 335554 322447 335395
13392 335395 337272 344039 343725 363201 355974 338060 353707 351363 334896 335340 330828 341873 323475
13379 323475 315055 317385 321669 317862 329030 325693 326694 321422 316540 336335 362000 364276 366270
13366 366270 353773 364312 340111 316016 329049 335968 345349 372293 362189 358631 372562 386658
13354 386658 384232 384100 377580 391573 391262 406658 413962 399170 380249 379670 394308 393320 386312 371598
13340 371598 348538 345414 326539 294642 302638 328078 341421 339760 360528 402572 411813 408165
13328 408165 409797 407145 395777 383320 364826 369646 380232 387785 381992 380997 390372 424010 429320
13315 429320 400554 385155 398158 373665 371880 397494 424834 422009 417360 409105 404057 367643
13303C67643N395J4563J3947o489k8165K6638J9119k801K477J6074r784J761m519
13290D15859J94k319J2324m117M512p764l1326N838P063K0472J0780j1396K3436
13277D43556J63l99R996k0826M096j023k0587j0257j5071j9943K0504K6933J9191
13264D36333J2853J787j0483o962k2980K5373Q721K2887J3562k4857k3251k8876
13252D04107J6795J3321K4713P749p504j5175p130K5727J2112J4389n543k7407
13240D56154j4623Q684r497l637j2280p330L386L1033L1635K723N912J6744O467
13227E15371J7605p931k2871j3895k9014R200o684Q988J0216j1978n893J414J6650
13214D81178m612K8618J7006n252l6718P213L5112P997j9599L553J5783J5489
$$ plain form
13303 367643 373038 387601 401548 395059 366894 393532 412651 409850 412327 428401 418617 420378 415859
13290 415859 416053 413734 426058 421941 426453 418689 387363 393201 400264 420736 431516 420120 443556
13277 443556 443719 443320 453316 432490 436586 435563 414976 404719 389648 369705 390209 417142 436333
13264 436333 449186 450973 440490 433528 410548 435921 444642 467529 481091 456234 432983 404107
13252 404107 420902 434223 458936 466685 459181 444006 436876 462603 474715 489104 483561 456154
13240 456154 441531 450215 440718 437081 424801 417471 420857 451890 483525 486248 492160 508904 515371
13227 515371 532976 525045 502174 488279 459265 468465 461781 470769 480985 469007 463114 464528 481178
13214 481178 476566 505184 522190 516938 480220 487433 522545 530542 510943 514496 530279 545768
13202E45768P808m1760k5664J0081O251k8051j495J4908l56J9276J4127J3906
13190E34799R706q042k4836q535J248J2251O80k2309k009J0693J5534k367j3877
13177E02936J1750j3614K112J778N330J2274o126J1149J9718J0571m180J3183
13165E66881p842j5012k6886n558J5186P260J2437Q724J8162J3922j6471j8732
13153E52071j3440J2555n357j3787L7809L944r549k284j7729R760K2830k8899
13141E47924k1941m852J3312k789P181K8435p382j7430j2070j447n278p418L2661
13128E48906J7735j2210Q16q21J3140O145j3219J354o920q527j4971K4985J7806
13115E74219L0677J8922l143l4062J1274L3794k2690j9526m991o374n492k619
$$ plain form
13202 545768 553576 511816 486152 496233 502484 474433 472938 487846 487490 506766 520893 534799
13190 534799 544505 536463 511627 503092 504340 516591 517271 494962 492953 503646 519180 516813 502936
13177 502936 514686 501072 503184 504962 510292 522566 516440 527589 547307 557878 553698 566881
13165 566881 559039 544027 517141 511583 526769 534029 546466 555190 573352 587274 570803 552071
13153 552071 538631 551186 545829 532042 569851 573795 564246 561962 544233 553993 576823 547924
13141 547924 525983 521131 534443 531654 538835 567270 559888 542458 530388 528941 523663 516245 548906
13128 548906 566641 554431 555247 554426 567566 573711 560492 561846 554926 546399 531428 556413 574219
13115 574219 604896 623818 620675 586613 597887 631681 608991 589465 584474 578100 572608 569989
13103E69989K9522J7170j1438j490J5744j712j3843m017q067k7k016J0483J235
13090F01533j5544p687N673L5383J8551j3404j0394o727n289J4875J0677R348
13078F36995J8069J352j8405l915q325o402j9502P537n517q130j8647l630J7437
13065E88917P943J615J8426R79J0219K7331J28J8290k1968j8723k762j3735J9507
13052F36167J2174j4321k9139M375L6137N15q002k110J0341J5195P65j1253j1363
13039F39481P542m38j2340l1K1535J9322O656j9264k686k1532J1014K1493N852
13026F76604M299m98p244q257p674j2653J7635O297j1524J6033K9261P855j5536
13013F94598j3318k906k1229j5322R50L8924K5289O334Q471k9277J6412P559j4997
$$ plain form
13103 569989 599511 616681 605243 603753 619497 617785 603942 599925 591858 591831 589815 600298 601533
13090 601533 585989 578302 583975 619358 637909 624505 614111 607384 602095 616970 627647 636995
13078 636995 655064 656416 638011 634096 625771 619369 599867 607404 601887 593757 575110 571480 588917
13065 588917 596860 598475 616901 617880 628099 655430 655558 673848 651880 633157 630395 616660 636167
13052 636167 648341 634020 604881 609256 645393 645908 637906 635796 646137 661332 662097 650844 639481
13039 639481 647023 646585 634245 634214 655749 675071 681727 662463 659777 638245 649259 670752 676604
13026 676604 680903 680405 673161 664904 657230 644577 662212 668509 656985 673018 702279 710134 694598
13013 694598 681280 678374 657145 641823 642773 681697 706986 713320 721791 692514 708926 716485 701488
13000G01488j4411O561L926R462r007J5695j171K0176O103K442L4147J0381l4427
12987G51365o853j5483j2083N348k587J3741P923m841k6452j6531J1625K3558
12975G28730J9140j339j1846j9673M584O723J1692N1134p75n258Q338j5701L68
12962G76117o582p073J0737M659q552k7151N894K4711J2620N855r394j1667k97
12949G69877J1972l343J4309M989j6582m961K5733p33j9975r488K6814k3286N652
12936G80978K3501j3769J589J3157M51j7984j3463K3444K1345J0365K47r870n093
12923H14898K342R775j8270p139O769rJ0332K4155m0658j2072L5481k890n236
12910H17478k2250j0443Q405k3693N897M5702Q450J6537J363R532J89j1258n153
$$ plain form
13000 701488 687077 693638 697564 707026 698019 713714 712543 732719 738822 741264 775411 785792 751365
12987 751365 744512 729029 716946 722294 719707 733448 741371 736530 710078 693547 705172 728730
12975 728730 747870 746531 734685 715012 719596 726319 738011 789145 788370 783112 791450 775749 776117
12962 776117 769535 762462 773199 777858 769306 742155 748049 772760 785380 791235 781841 770174 769877
12949 769877 781849 778506 792815 797804 781222 776261 801994 801261 781286 771798 798612 775326 780978
12936 780978 804479 790710 792299 805456 805907 787923 774460 797904 819249 829614 829861 819991 814898
12923 814898 817240 827015 808745 801606 808375 808366 818698 842853 802195 790123 825604 822714 817478
12910 817478 795228 784785 793190 769497 775394 821096 829546 846083 847446 856978 857167 845909 840756
12897H40756M05j3788r953O09J3775K7921j5191J443L1751K6313P147j4190l0759
12884H66239l4384J9290K2046l806l0779J792J7987M289K9793J2695L4371j0103
12872I29430k0354J703j9435j6394P375k2048j0309L5957K5657N879j3439J8951
12860I22973j0501l382R081j5698l8640J4728J2916m51k248j810J3945J2466K9132
12847I42511j4936l3524R128K6747N35l877K3428M639j0376j8580l1977J6232
12835I09950K3755K0828K7301k919j6377j9534j3645J2687L1795R676L887l0185
12823I57219o366L1437J8476n045k5195j7773R319o16j1944q928R865L2728L8676
12810A021853K0400k0168m7102j5659K3383J7929O080n262J533m682K2146J8096
$$ plain form
12897 840756 841161 827373 817420 818029 831804 859725 844534 845977 877728 904041 911188 896998 866239
12884 866239 831855 851145 873191 869385 838606 840398 858385 862674 892467 905162 939533 929430
12872 929430 909076 910779 891344 874950 882325 860277 849968 885925 911582 917461 904022 922973
12860 922973 912472 909090 918171 902473 863833 878561 891477 891026 888778 886968 900913 913379 942511
12847 942511 927575 894051 903179 929926 930461 926584 950012 954651 944275 925695 893718 909950
12835 909950 933705 954533 981834 978915 962538 943004 929359 942046 973841 983517 987404 957219
12823 957219 950853 982290 1000766 995721 970526 952753 962072 961456 949512 940584 950449 983177 1021853
12810 1021853 1042253 1022085 974983 959324 982707 1000636 1006716 1001454 1002987 998305 1020451 1038547
12798A038547J1533n257j185k0937R79J66J4442l566J0876m467J9619Q03k4755
12785A036798k3655j1587J9464L70M808r588n029K1551N167j121J2600j2814J7956
12772A054920L7907l0858l970L9879K5246K5294J848j8797l711J1238j7013l8254
12760A083729k6935O532R97J8692L0119J1286R62j4215j4039q284l112K0987J3926
12747A120645J7999L561j8450J2493J6527r468p773K5593R285j7203K589J8774
12735A174572J157J2394m977k6523m1474j6128j866R802L0708Q131J6252J186
12723A163234J2210K6974k729R262K0124k3387n526k3305O209j8046j2586j1120
12711A141314K5597K3162J5146K1905K2942j2448k6647k9477J0775J3204J2116
$$ plain form
12798 1038547 1050080 1044823 1043638 1022701 1023680 1023846 1038288 1034722 1045598 1041131 1060750 1061553 1036798
12785 1036798 1013143 1001556 1021020 1021390 1026198 1016610 1011581 1033132 1038299 1037178 1049778 1036964 1054920
12772 1054920 1092827 1061969 1057999 1097878 1123124 1148418 1150266 1131469 1127758 1138996 1121983 1083729
12760 1083729 1056794 1063326 1064323 1083015 1113134 1124420 1125382 1111167 1097128 1088844 1085732 1106719 1120645
12747 1120645 1138644 1142205 1123755 1136248 1152775 1143307 1135534 1161127 1170412 1153209 1155798 1174572
12735 1174572 1175729 1188123 1183146 1156623 1115149 1099021 1097155 1106957 1137665 1145796 1162048 1163234
12723 1163234 1175444 1202418 1199689 1208951 1229075 1205688 1200162 1176857 1183066 1165020 1152434 1141314
12711 1141314 1166911 1190073 1205219 1227124 1250066 1237618 1210971 1181494 1192269 1205473 1217589
12700A217589j457L647J8049Q390o122j5396K1009J6825k6767R051j5467J1271
12688A240622R441j2880k635J5513K3617j6969o20J0998k605k503l262K6292J7221
12675A302230k1857r14J9570K461K271j6237J628r610J4471R047o188q883K33
12662A288222J8795J7342K2270M935M688K330K5216j2421j0484J8041K6444k3750
12650A381628l4558J3581j37j4802N682K1745J5041k549j3645p41k0340K1726
12638A372631K5746J5427m188l6140l2350k6539K5965K0782J50L660R783L793
12626A378720j8378J0298R219L8980J5534j4152n835J7954K2231J248j0246q449
12614A437124J1042J3788l998l173k318J3021P814j4104j3569p351n247K7035
$$ plain form
12700 1217589 1216132 1219779 1237828 1246218 1240096 1224700 1245709 1262534 1235767 1244818 1229351 1240622
12688 1240622 1250063 1237183 1234548 1250061 1273678 1256709 1256089 1267087 1264482 1261979 1258717 1285009 1302230
12675 1302230 1280373 1279459 1299029 1301490 1303761 1287524 1289152 1279542 1294013 1303060 1296872 1287989 1288222
12662 1288222 1307017 1324359 1346629 1351564 1356252 1358582 1383798 1371377 1360893 1378934 1405378 1381628
12650 1381628 1347070 1360651 1360514 1345712 1351394 1373139 1388180 1385631 1371986 1371245 1350905 1372631
12638 1372631 1398377 1413804 1409616 1373476 1341126 1314587 1340552 1361334 1361484 1365144 1374927 1378720
12626 1378720 1360342 1370640 1379859 1418839 1434373 1420221 1414386 1432340 1454571 1455819 1445573 1437124
12614 1437124 1448166 1461954 1457956 1454783 1452465 1465486 1473300 1459196 1445627 1438276 1433029 1460064
12602A460064K9869J2098p168q048o278l00J054K8631L4321j3344j4072J6077
12590A532904J1809q69p623j0670J7753J1804r44J1780k587K6n163J281P377k0836
12576A546042L2558Q279j6119o34j9515l1023q197L6656m068r57K3024L765J3712
12563A583523K9402j773M755P394n291q963j4330K0213K9239R698K115J9264Q371
12550A683617k3953K298J5277J2835J9377j2588J9299J8101j5356l116k26j8692
12538A696873M268Q924l0951L4001q67o7J0275N382N978k852J5623O521J720R121
12524A763949j0170K8371J2591m693J348j012O554J4718n52j149k372k893j8854
12511A785836J0321m558n376K7295m17r384j3967R025K1322j899L0269K6854r07
$$ plain form
12602 1460064 1489933 1502031 1494863 1486815 1480537 1480237 1481291 1509922 1544243 1530899 1516827 1532904
12590 1532904 1544713 1543844 1536221 1525551 1543304 1555108 1554164 1565944 1563357 1563383 1558220 1559501 1566878 1546042
12576 1546042 1578600 1586879 1570760 1570126 1550611 1519588 1511391 1548047 1543979 1543022 1566046 1569811 1583523
12563 1583523 1612925 1611152 1615907 1623301 1618010 1609047 1594717 1614930 1644169 1653867 1655982 1675246 1683617
12550 1683617 1659664 1661962 1677239 1690074 1709451 1696863 1716162 1734263 1718907 1715791 1715565 1696873
12538 1696873 1701141 1710065 1679114 1713115 1712248 1712181 1722456 1727838 1733816 1730964 1746587 1753108 1754828 1763949
12524 1763949 1753779 1782150 1794741 1790048 1791396 1790384 1796938 1811656 1811104 1809955 1807583 1804690 1785836
12511 1785836 1796157 1791599 1786223 1813518 1813101 1803717 1789750 1798775 1820097 1818198 1848467 1875321 1874414
12498A874414m262k90j0978J1119K1339J4823k6962l3550J0644L1910L299m977
12486A886529J0109J5658K2985M399Q600l744k9178J2355J9079r533J1036k498
12474A945797J2266K9099M442J4273l6226N256L465P13L3186J6728R655r210K352
12461B031796R006N731L605k4610j8944J0967R352K4183J023j9010L0631l741
12449B059989j1459K8759J2953K6946l022n962k0903J3398K2692O977K1132r08
12437B150592m6386l3574L2105M1911M566p404K1123k880o834J4062j1790o416
12425B149075J2445K8441P974N980J0871N704K173J1513j2474N602J0371Q081
12413B245756J5178J5761Q537K181J2773k698N536J3565K3454N649Q158M071j50
$$ plain form
12498 1874414 1870152 1869862 1858884 1870003 1891342 1906165 1879203 1845653 1856297 1888207 1891506 1886529
12486 1886529 1896638 1912296 1935281 1939680 1948280 1944536 1915358 1927713 1946792 1937259 1948295 1945797
12474 1945797 1958063 1987162 1991604 2005877 1969651 1974907 1978372 1979085 2012271 2028999 2038654 2029444 2031796
12461 2031796 2040802 2046533 2050138 2025528 2006584 2017551 2026903 2051086 2052109 2033099 2063730 2059989
12449 2059989 2048530 2077289 2090242 2117188 2114166 2108204 2087301 2100699 2123391 2130368 2151500 2150592
12437 2150592 2104206 2070632 2102737 2144648 2149214 2141810 2162933 2160053 2153219 2167281 2155491 2149075
12425 2149075 2161520 2189961 2197935 2203915 2214786 2220490 2222663 2234176 2221702 2227304 2237675 2245756
12413 2245756 2260934 2276695 2285232 2287413 2300186 2297488 2303024 2316589 2340043 2345692 2353850 2357921 2357771
12400B357771l139j7527m059K064R993Q757K6138M0507O739j9194K3018j1269
12388B419799j5601j6160P706J4495K0169m47J8800Q24q40j4572K4577J8341J5509
12375B492600J3916J9248j8359J2886J1596L8730L530J3157K810J0120n140j3522
12363B581572P024P469J1070j476J4740Q741J666j494O488r779J4597J6038J6032
12350B672688N439m741J1066K5140j963L2358K6902q438q248J074J7036J588o34
12337B769267j1535J2216J5952J0591K1980M7631J3146j3151k4008M775P433N26
12325B854823J3630Q72n39M624J6620J5868Q066L6029K1699K248Q513j7798N285
12312B969940J4431J2000p422J7857M6595K7072p218M140L0712J0149n689l1104
$$ plain form
12400 2357771 2354632 2337105 2333046 2335110 2345103 2353860 2379998 2420505 2427244 2408050 2431068 2419799
12388 2419799 2404198 2388038 2395744 2410239 2430408 2429961 2448761 2449585 2448745 2434173 2458750 2477091 2492600
12375 2492600 2506516 2525764 2507405 2520291 2531887 2570617 2574147 2587304 2590114 2600234 2595094 2581572
12363 2581572 2588596 2596065 2607135 2605659 2620399 2629140 2630806 2629312 2635800 2626021 2640618 2656656 2672688
12350 2672688 2678127 2673386 2684452 2709592 2707629 2739987 2766889 2758451 2750203 2751277 2768313 2769901 2769267
12337 2769267 2757732 2769948 2785900 2796491 2818471 2866102 2879248 2866097 2842089 2846864 2854297 2854823
12325 2854823 2868453 2869325 2868786 2873410 2890030 2905898 2913964 2949993 2971692 2973940 2982453 2964655 2969940
12312 2969940 2984371 2996371 2988949 3006806 3053401 3080473 3073255 3077395 3108107 3118256 3112567 3081463
12300C081463J4299K8801K4926M2034J6698k4468J2642M0556j0949M092L949N319
12288C239362K79J8035J6356R877k252l170P705k0570K6992L2399J6437J2035
12276C353485k761J8685O467P113j029M845K9196K4964O942J6268K4690J1014
12264C499879N430K5879o974m283K807J2645J0730j0503K4370K7280J2733L9181
12252C639174J8993Q94J1344M7620K6250J5198k6355M937K0418M0057M6878L9939
12240C885347Q057O552J3040K115M604K225L8463L1633N846N735M282K0795K0188
12227D048882o30J0018P421K8535L5398J4136N69K1100O8045M6005L6547o291
12215D309735k6181P114K8699J9437O099L6589M6432K3158L3174L1702K4000j9221
$$ plain form
12300 3081463 3095762 3124563 3149489 3191523 3208221 3183753 3196395 3236951 3226002 3230094 3234043 3239362
12288 3239362 3239641 3257676 3274032 3283909 3281657 3278487 3286192 3265622 3292614 3325013 3341450 3353485
12276 3353485 3350724 3369409 3375876 3382989 3381960 3386805 3416001 3440965 3447907 3464175 3488865 3499879
12264 3499879 3505309 3531188 3524214 3519931 3522738 3535383 3546113 3535610 3559980 3587260 3599993 3639174
12252 3639174 3658167 3659061 3670405 3718025 3744275 3759473 3733118 3738055 3758473 3798530 3845408 3885347
12240 3885347 3893404 3899956 3912996 3915111 3919715 3921940 3960403 3992036 3997882 4003617 4007899 4028694 4048882
12227 4048882 4048252 4058270 4065691 4094226 4129624 4143760 4144329 4165429 4233474 4279479 4316026 4309735
12215 4309735 4283554 4290668 4319367 4338804 4344903 4381492 4427924 4451082 4484256 4515958 4539958 4520737
12203D520737L8323M7592L2315L235r6o789j3470o7949r2346o3758K7763M9173
12191D474730J3839K3225L5953L4281M5479K2839L6985L1765Q368N1085N0312
12180D828861J757O712K7217K8118N6778K0799j3676J9040J6848K0610K0177J5520
12168E048761N9864L2284L4914J3133K3522L9748M9936J1214J5115j6076P75K2596
12156E335786k432P445N7182M0439R755M1147L2011K0670L3962R776L1410L9358
12144E656509J2746M0328L0409J3046M7821L1907K2280M299K0917O5620J52388
12133F098270J90427J46341J32016N4638P730l2099j7686l1032k5662K6262N7884
12122F607089N5554L9032L4468K4899M1746P4774N7656P6585M1251L2145N2807
$$ plain form
12203 4520737 4559060 4606652 4638967 4642202 4642106 4635317 4621847 4553898 4461552 4397794 4425557 4474730
12191 4474730 4488569 4511794 4547747 4582028 4627507 4650346 4687331 4719096 4727464 4778549 4828861
12180 4828861 4830618 4837330 4864547 4892665 4949443 4970242 4956566 4975606 4992454 5013064 5033241 5048761
12168 5048761 5108625 5140909 5175823 5188956 5212478 5252226 5302162 5313376 5328491 5312415 5313190 5335786
12156 5335786 5333354 5340799 5397981 5438420 5448175 5489322 5521333 5542003 5575965 5585741 5617151 5656509
12144 5656509 5669255 5709583 5739992 5753038 5800859 5832766 5855046 5859345 5880262 5945882 6098270
12133 6098270 6288697 6435038 6567054 6621692 6629422 6597323 6579637 6548605 6522943 6549205 6607089
12122 6607089 6662643 6701675 6736143 6761042 6802788 6877562 6935218 7011803 7053054 7085199 7138006
12111G138006M1003J9593J1475M8010L3898J9623L3830J5426K1597N7491M6566
12100G486518N351L5227Q5299J25725J17126J35121Q9114L5549P146L2041K5974
12089H180191L2470P6663R2632P8619Q3382Q4830J00158Q1439O9751Q9363R5236
12078I064734P6809J44602J63941J48314J60451J42074J07673J26j85854k90008
12068I532862k28307k06632n8226K9061J13306J53380J42129J41141J41345J37274
12058I897333J22948J22532J21501J28554J28066J49244J18540R9737J23700R3270
12048A1105425R6336J11434J13607J15326R2826J01022J33186J28573J63404J43643
12038A2304782J39216J48433J77745J52054J16921J42994J45912J54593J83301
$$ plain form
12111 7138006 7179009 7198602 7210077 7258087 7291985 7311608 7345438 7360864 7382461 7439952 7486518
12100 7486518 7491869 7527096 7612395 7738120 7855246 7990367 8079481 8115030 8122176 8154217 8180191
12089 8180191 8212661 8289324 8381956 8460575 8543957 8628787 8728945 8810384 8880135 8969498 9064734
12078 9064734 9141543 9286145 9450086 9598400 9758851 9900925 10008598 10008724 9822870 9532862
12068 9532862 9304555 9097923 9039697 9068758 9182064 9335444 9477573 9618714 9760059 9897333
12058 9897333 10020281 10142813 10264314 10392868 10520934 10670178 10788718 10888455 11012155 11105425
12048 11105425 11201761 11313195 11426802 11542128 11634954 11735976 11869162 11997735 12161139 12304782
12038 12304782 12443998 12592431 12770176 12922230 13039151 13182145 13328057 13482650 13665951
12029A3665951J88353J82668J68562J83664J98010J73172K06446J81747J77449
12020A5326022K12540K11552K10768K22091K07514K04737K05113K34635K55600
12011A7290572K59282K66412K90603K82840K98918L13612K88961L27941L39954
12002A9959095L30401L42222L56193L58110L90969L96912L77454M30418M19512
11993B3361286M08524M46221N00786N10082N29216N63167O24156O52301O84224
11984B8279963P17700P25761P75780Q02807Q19121Q50051R21039R65255R99245
11975C5856722J079498J177009J240592J310745J386146J457626J570292J746438
11967D6825068J864816K063088K264701K460236K631331K864359L170589L508539
$$ plain form
12029 13665951 13854304 14036972 14205534 14389198 14587208 14760380 14966826 15148573 15326022
12020 15326022 15538562 15750114 15960882 16182973 16390487 16595224 16800337 17034972 17290572
12011 17290572 17549854 17816266 18106869 18389709 18688627 19002239 19291200 19619141 19959095
12002 19959095 20289496 20631718 20987911 21346021 21736990 22133902 22511356 22941774 23361286
11993 23361286 23769810 24216031 24716817 25226899 25756115 26319282 26943438 27595739 28279963
11984 28279963 28997663 29723424 30499204 31302011 32121132 32971183 33892222 34857477 35856722
11975 35856722 36936220 38113229 39353821 40664566 42050712 43508338 45078630 46825068
11967 46825068 48689884 50752972 53017673 55477909 58109240 60973599 64144188 67652727
11959F7652727L910193M390204M952613N600046O368397P347829Q595484J0114679
11951A18932172J2032260J4551446J7799614K1880934K6398153K8933129K1101958
11944B61629666j9127112j03120347j55904346j31790031p7325081j8375955J5108682
11937b28904524K4074031K2988254J9677437J6535808J3948298J1879333J0105033
11930a09696330Q641184P458071O468933N650458M950983M402854L945755L549124
11922f4628968L212512K902796K593404K326970K138879J986744J855062J765218
11914d5847383J659194J547472J428631J318835J218209J139769J065977J050665
11906c5418631R84361R06674Q06947P69469P68791P17787O71379O39269O17745
$$ plain form
11959 67652727 71562920 75953124 80905737 86505783 92874180 100222009 108817493 118932172
11951 118932172 130964432 145515878 163315492 185196426 211594579 240527708 261629666
11944 261629666 242502554 139382207 -16522139 -148312170 -225637251 -244013206 -228904524
11937 -228904524 -204830493 -181842239 -162164802 -145628994 -131680696 -119801363 -109696330
11930 -109696330 -101055146 -93597075 -87128142 -81477684 -76526701 -72123847 -68178092 -64628968
11922 -64628968 -61416456 -58513660 -55920256 -53593286 -51454407 -49467663 -47612601 -45847383
11914 -45847383 -44188189 -42640717 -41212086 -39893251 -38675042 -37535273 -36469296 -35418631
11906 -35418631 -34434270 -33527596 -32720649 -31951180 -31182389 -30464602 -29793223 -29153954 -28536209
11897b8536209O16834N70952N60548N41829N29016N03146N22461M99803M85396
11888b3706224M78493M42829M05185L84147L97408L76744L60826L37387L25996
11879b0197209L29311L03022K66185K89973K96946K76082K49195K46719K35885
11870a7703891K37294K50365K71733K48385K31631K09565J87481J95039J90603
11861a5681795K08740K02800J93455J68727J80913J62043J25980J28461J23502
11852a4187174J45664J54922J57344J47867J68411J56717J10060J28102J40542
11843a2877545J25314J40291J40092J14548J41341J03340J00677R8341J37436
11834a1776165J20555J18955J03115P0165Q6599Q8680Q6312O6160Q1296R6216
$$ plain form
11897 -28536209 -27919375 -27348423 -26787875 -26246046 -25717030 -25213884 -24691423 -24191620 -23706224
11888 -23706224 -23227731 -22784902 -22379717 -21995570 -21598162 -21221418 -20860592 -20523205 -20197209
11879 -20197209 -19867898 -19564876 -19298691 -19008718 -18711772 -18435690 -18186495 -17939776 -17703891
11870 -17703891 -17466597 -17216232 -16944499 -16696114 -16464483 -16254918 -16067437 -15872398 -15681795
11861 -15681795 -15473055 -15270255 -15076800 -14908073 -14727160 -14565117 -14439137 -14310676 -14187174
11852 -14187174 -14041510 -13886588 -13729244 -13581377 -13412966 -13256249 -13146189 -13018087 -12877545
11843 -12877545 -12752231 -12611940 -12471848 -12357300 -12215959 -12112619 -12011942 -11913601 -11776165
11834 -11776165 -11655610 -11536655 -11433540 -11363375 -11276776 -11188096 -11101784 -11035624 -10954328 -10858112
11824a0858112P6423Q5072J34455J12396R7650P2872J27246J40419L5215q497
11814i984861N850J1900Q0115R7389R0103P4457Q1782Q1847N7977Q3654N8956
11803i260831M7210P7174P6668Q5933P4678L5935M7831M8345N4058N9800P5975
11792h577224Q5100J02720N7667j5730Q047P874K6576Q3706P4988O6469Q8643
11781g991164R0158N2739M9177N7717N0587N3010N5488O1895O7419K9232L1733
11770g392009K9282M5880P2236M2046J7483K8420M9935K2785J4800N7246J5409
11759f996487M4378P7104Q6461R3658J16937J10621J1258p2744j15922j29028
11749f773764n2201K3975O0705K6124j734M0825M8907L0970M7369M9458N1914
$$ plain form
11824 -10858112 -10781689 -10696617 -10562162 -10449766 -10352116 -10279244 -10151998 -10011579 -9976364 -9984861
11814 -9984861 -9979011 -9967111 -9886996 -9789607 -9699504 -9625047 -9543265 -9461418 -9403441 -9319787 -9260831
11803 -9260831 -9213621 -9136447 -9059779 -8973846 -8899168 -8863233 -8815402 -8767057 -8712999 -8653199 -8577224
11792 -8577224 -8492124 -8389404 -8331737 -8347467 -8339420 -8331546 -8304970 -8221264 -8146276 -8079807 -7991164
11781 -7991164 -7901006 -7848267 -7799090 -7741373 -7690786 -7637776 -7582288 -7520393 -7452974 -7423742 -7392009
11770 -7392009 -7362727 -7316847 -7244611 -7202565 -7185082 -7156662 -7106727 -7083942 -7069142 -7011896 -6996487
11759 -6996487 -6952109 -6875005 -6788544 -6694886 -6577949 -6467328 -6456070 -6528814 -6644736 -6773764
11749 -6773764 -6825965 -6801990 -6741285 -6715161 -6716895 -6676070 -6627163 -6596193 -6548824 -6499366 -6447452
11738f447452N3233L9189J8806Q461O138L3869M5376L5618L7333L6224L1018L1393
11726f070794K3095M1040M2252O5147M1184K8223K3862K7394J804L6020k381P834
11714e735320L0026P549J9672K1549N5279N1046M1011K7590j1090K3110J9459
11703e450119J19K2716K6652J3525J7711M4383P5199L4297J8760K306J4978J1485
11691e167988K1612K8329J0536J8980L5248K5322r385J1764N6528K2394q758L9453
11679d915965M0865J5802J4281J8136J4697P649j5550J4490K6189L3830m99J9901
11667d726174L5583K2857j921K519J6016K1373K0331K3138K3606L120L2368K2815
11655d504369L3927L9503L9268J3104l5207j7342J2805J6780J0267K4887K8917
$$ plain form
11738 -6447452 -6394219 -6355030 -6336224 -6327763 -6321625 -6287756 -6242380 -6206762 -6169429 -6133205 -6102187 -6070794
11726 -6070794 -6047699 -6006659 -5964407 -5899260 -5858076 -5829853 -5805991 -5778597 -5776793 -5740773 -5743154 -5735320
11714 -5735320 -5705294 -5697745 -5678073 -5656524 -5601245 -5550199 -5509188 -5481598 -5492688 -5469578 -5450119
11703 -5450119 -5450000 -5427284 -5400632 -5387107 -5369396 -5325013 -5249814 -5215517 -5196757 -5194451 -5179473 -5167988
11691 -5167988 -5146376 -5118047 -5107511 -5088531 -5053283 -5027961 -5037346 -5025582 -4969054 -4946660 -4955418 -4915965
11679 -4915965 -4875100 -4859298 -4845017 -4826881 -4812184 -4804535 -4820085 -4805595 -4779406 -4745576 -4746075 -4726174
11667 -4726174 -4690591 -4667734 -4669655 -4667136 -4651120 -4629747 -4609416 -4586278 -4562672 -4559552 -4527184 -4504369
11655 -4504369 -4470442 -4430939 -4391671 -4378567 -4413774 -4431116 -4418311 -4401531 -4391264 -4366377 -4337460
11644d337460P668K1281J2335R340J9762J9438K3540k611L970O60J6246j6859
11632d222690j64K2016P456k722n479L865K7728N329N110K7570L2789K3954R154
11619d066084J8847M6561N257j0933M388K7815L2488j2021J4374J5087J8047L0115
11607c876059j174J7288J9581K2429J1807k798j761M6908K496J1951J8432J641
11595c729259J5006J8466J79j1021L1226L2830l001j2237J4085J4681N159j5664
11583c639550M928K1035J8102J5859K474j0113m268K6398K4727L3063K6466m866
11571c485745k078J5333K5691K0608K819P916n130m811J1752O696J0639p19j1308
11558c408337K6187K7005J1125j0268R518L2101J7306n4j0479J1358M8354R684
$$ plain form
11644 -4337460 -4329792 -4308511 -4296176 -4286836 -4267074 -4247636 -4224096 -4226707 -4222737 -4222077 -4205831 -4222690
11632 -4222690 -4222854 -4200838 -4193382 -4196104 -4201583 -4197718 -4169990 -4164661 -4159551 -4131981 -4099192 -4075238 -4066084
11619 -4066084 -4047237 -4000676 -3995419 -4006352 -4001964 -3974149 -3941661 -3953682 -3939308 -3924221 -3906174 -3876059
11607 -3876059 -3877233 -3859945 -3840364 -3817935 -3806128 -3808926 -3810687 -3763779 -3761283 -3749332 -3730900 -3729259
11595 -3729259 -3714253 -3695787 -3695608 -3706629 -3675403 -3642573 -3645574 -3657811 -3643726 -3629045 -3623886 -3639550
11583 -3639550 -3634622 -3613587 -3595485 -3579626 -3577152 -3587265 -3591533 -3565135 -3540408 -3507345 -3480879 -3485745
11571 -3485745 -3487823 -3472490 -3446799 -3426191 -3423372 -3415456 -3420586 -3425397 -3413645 -3406949 -3396310 -3397029 -3408337
11558 -3408337 -3382150 -3355145 -3344020 -3354288 -3344770 -3312669 -3295363 -3295417 -3305896 -3294538 -3246184 -3236500
11546c236500l912J077n928O415K2804j1569j6656Q840Q277l098o18K3812K3190
11533c183866K6501k099K8138K1253l18l995o49O22m641P622K2443k970K1956
11520c070003M29o714p356K2004M0006l589P748o735J1577J6618q480k3226Q061
11507c019660K3419J3922k4232P860J0933M489K0137K4117L933K0746J7571P624
11495b889141K9566K1897m167j1655k4091J9200J8967M45O111R962J5747J6443
11483b790716j983j198L007M125o124J3817J5608K8188K967J7285J5026o572N077
11470b701493l3397k384q23J9117r049j1653j206M0150L2445M35j1924J3259L3718
11457b632805L640k2757r149K4082K7563J3429J3820R45J6038K8430L446j7589
$$ plain form
11546 -3236500 -3240412 -3239335 -3245263 -3238848 -3216044 -3227613 -3244269 -3235429 -3227152 -3230250 -3230868 -3207056 -3183866
11533 -3183866 -3157365 -3159464 -3131326 -3110073 -3110391 -3114386 -3115035 -3114413 -3119054 -3111432 -3088989 -3091959 -3070003
11520 -3070003 -3069574 -3076288 -3083644 -3061640 -3021634 -3025223 -3017475 -3024210 -3012633 -2996015 -3004495 -3027721 -3019660
11507 -3019660 -2996241 -2982319 -3006551 -2998691 -2987758 -2983269 -2963132 -2939015 -2935082 -2914336 -2896765 -2889141
11495 -2889141 -2859575 -2837678 -2841845 -2853500 -2877591 -2858391 -2839424 -2838979 -2832868 -2822906 -2807159 -2790716
11483 -2790716 -2792699 -2793897 -2790890 -2786765 -2792889 -2779072 -2763464 -2735276 -2732309 -2715024 -2699998 -2706570 -2701493
11470 -2701493 -2734890 -2737274 -2738097 -2718980 -2728029 -2739682 -2740888 -2700738 -2668293 -2667858 -2679782 -2666523 -2632805
11457 -2632805 -2629165 -2651922 -2661071 -2636989 -2609426 -2595997 -2582177 -2581232 -2565194 -2536764 -2533318 -2550907
11445b550907r006j3388K9146l220N98J33j5230M476L14o480Q686J8849N321j2407
11431b543115N510N1581L4883J7554m089k985M163o010P711o7K3689q706k6205
11418b446086k997Q486Q819J5581K0710N138R139l104r902R883J0789K1134J2754
11405b339656M353J0758n190O05K332m787J1210J5116o006j293R092p352o490
11392b317308O195j496J0480J7636J9357J1271p487j5182k368L4676o400o020
11380b256646K9357L0132p691J788J6761j5476J0698O112k2237n643J8759J3913
11368b180173q868K0084j5351N79L2371J3917j4531J8832J6146L466J8134o67
11356b096061P375k5108k1675J7246J8528L139J1898j0986k4882j1307K3599l404
$$ plain form
11445 -2550907 -2559913 -2573301 -2544155 -2547375 -2546777 -2546644 -2561874 -2557398 -2557084 -2563564 -2554878 -2536029 -2530708 -2543115
11431 -2543115 -2537605 -2486024 -2451141 -2433587 -2437676 -2440661 -2436498 -2442508 -2434797 -2434864 -2411175 -2419881 -2446086
11418 -2446086 -2449083 -2440597 -2431778 -2416197 -2395487 -2390349 -2381210 -2384314 -2394216 -2384333 -2373544 -2352410 -2339656
11405 -2339656 -2335303 -2324545 -2329735 -2329130 -2326798 -2331585 -2320375 -2305259 -2311265 -2312558 -2303466 -2310818 -2317308
11392 -2317308 -2311113 -2312609 -2302129 -2284493 -2265136 -2253865 -2261352 -2276534 -2278902 -2244226 -2250626 -2256646
11380 -2256646 -2227289 -2197157 -2204848 -2203060 -2186299 -2201775 -2191077 -2184965 -2207202 -2212845 -2194086 -2180173
11368 -2180173 -2189041 -2168957 -2184308 -2183729 -2151358 -2137441 -2151972 -2133140 -2116994 -2113528 -2095394 -2096061
11356 -2096061 -2088686 -2113794 -2135469 -2118223 -2099695 -2096556 -2084658 -2095644 -2120526 -2131833 -2108234 -2111638
11344b111638j8518r8K4459L0123L6908O361R607J902R505j5518j6171K1143Q798
11331b013137R196J0338k4724R738J2638n014l680J7018J5054K1702J2612J3585
11319a924674K179j2035l5931o465J3612K6705N625l887K599j0034j4396r553
11307a966255J9534K7220M4098o507P28L583k5815k8645J4165m092l834J2048
11295a913772L769p969j1731q896K724L2660n026J1872J718J8633J7943L306p46
11282a855515O377J6192N413j7478M319R269N677K4765J7529J4973o598k0624
11270a795701l3863R274J3315J1876J1491R946j5062K1333L3385j4299j4480K1398
11258a741387K5090Q642p812P650q3k9290n491K444M346j2351J4939J0725o407
$$ plain form
11344 -2111638 -2130156 -2130254 -2105795 -2075672 -2038764 -2032403 -2022796 -2020894 -2011389 -2026907 -2043078 -2021935 -2013137
11331 -2013137 -2003941 -1993603 -2018327 -2008589 -1995951 -2000965 -2004645 -1987627 -1972573 -1950871 -1938259 -1924674
11319 -1924674 -1922495 -1934530 -1970461 -1976926 -1963314 -1936609 -1930984 -1934871 -1932272 -1942306 -1956702 -1966255
11307 -1966255 -1946721 -1919501 -1875403 -1881910 -1881182 -1877599 -1903414 -1932059 -1917894 -1921986 -1925820 -1913772
11295 -1913772 -1910003 -1917972 -1929703 -1938599 -1935875 -1903215 -1908241 -1896369 -1894651 -1876018 -1858075 -1854769 -1855515
11282 -1855515 -1849138 -1832946 -1827533 -1845011 -1840692 -1831423 -1825746 -1800981 -1783452 -1768479 -1775077 -1795701
11270 -1795701 -1829564 -1820290 -1806975 -1795099 -1783608 -1773662 -1788724 -1767391 -1734006 -1748305 -1762785 -1741387
11258 -1741387 -1716297 -1707655 -1715467 -1707817 -1707900 -1737190 -1742681 -1740237 -1735891 -1748242 -1733303 -1722578 -1728985
11245a728985j7174L883R043J0761N325M201j134O353L64Q478L9361J4587N173
11232a639764K9571j279k6081p974R923r702j8972q70Q104L2385J9019q871n933
11219a620444K1999J9382J4789J3794J5767J4472m411j6193k4032j8693M735k258
11207a581093J2492K0936n618j0177L0948K9141j3269j494K192j0820M912l19
11195a522169k2329j5696N111J3975O124J0247K1430L0968L3380m431k3016m2059
11183a508465n261J3260L2834P47j4278k1588L469J4188J6073P770J9817J1668
11171a429766j5329j0517L5042j2j1819K0593K651j642p384o527k357M910J9188
11158a402969R354Q042K008j4434J3381M932o004k144O42L348n98J621K0667J3823
$$ plain form
11245 -1728985 -1746159 -1742276 -1733233 -1722472 -1717147 -1712946 -1714080 -1707727 -1707363 -1698885 -1659524 -1644937 -1639764
11232 -1639764 -1610193 -1611472 -1637553 -1645527 -1635604 -1645306 -1664278 -1665148 -1657044 -1624659 -1605640 -1614511 -1620444
11219 -1620444 -1598445 -1579063 -1564274 -1550480 -1534713 -1520241 -1524652 -1540845 -1564877 -1583570 -1578835 -1581093
11207 -1581093 -1568601 -1547665 -1553283 -1563460 -1532512 -1503371 -1516640 -1518134 -1515942 -1526762 -1521850 -1522169
11195 -1522169 -1544498 -1560194 -1555083 -1541108 -1534984 -1524737 -1503307 -1472339 -1438959 -1443390 -1466406 -1508465
11183 -1508465 -1513726 -1500466 -1467632 -1466885 -1481163 -1502751 -1499282 -1485094 -1469021 -1461251 -1441434 -1429766
11171 -1429766 -1445095 -1455612 -1420570 -1420582 -1432401 -1411808 -1409157 -1410799 -1418183 -1424710 -1427067 -1422157 -1402969
11158 -1402969 -1393615 -1385573 -1383565 -1397999 -1384618 -1379686 -1385690 -1387834 -1387192 -1383844 -1384442 -1382821 -1362154 -1348331
11144a348331j52Q515J1061n574k3732j6619L883J6701K68l670l89K0119K362
11131a335558J8931J2000M540K1713K1746J3183j4240k947R575j3968L149m147
11119a266023K9629L3924m564j4615R532L210j6408L743q037j5697Q281N182k1195
11106a253038R940J0450J6830n064k8659M725K8636m274P69m8o158m379R527K8066
11092a192677O626M207N697K8896J5982J1629q665j9308l542M669J044K6519l208
11079a122131j8234m901K2867J3461m0413J0483K9096j240j9343K5344J1919R167
11067a083925n888M737l238J81l650p771l594p964M3414M6092P103j0822R927
11054a015398J5554K5407K3808J3179o607m506q433m260K4514r36R758l2662m4949
$$ plain form
11144 -1348331 -1348483 -1339968 -1328907 -1334481 -1358213 -1374832 -1370949 -1354248 -1353980 -1357650 -1358039 -1337920 -1335558
11131 -1335558 -1316627 -1304627 -1300087 -1278374 -1256628 -1243445 -1257685 -1260632 -1251057 -1265025 -1261876 -1266023
11119 -1266023 -1236394 -1202470 -1207034 -1221649 -1212117 -1208907 -1225315 -1221572 -1229609 -1245306 -1237025 -1231843 -1253038
11106 -1253038 -1243098 -1232648 -1215818 -1220882 -1249541 -1244816 -1216180 -1220454 -1219685 -1219733 -1225891 -1230270 -1220743 -1192677
11092 -1192677 -1186051 -1181844 -1176147 -1147251 -1131269 -1119640 -1128305 -1147613 -1151155 -1146486 -1145442 -1118923 -1122131
11079 -1122131 -1140365 -1145266 -1122399 -1108938 -1149351 -1138868 -1109772 -1111012 -1130355 -1105011 -1093092 -1083925
11067 -1083925 -1089813 -1085076 -1088314 -1088133 -1091783 -1099554 -1103148 -1111112 -1067698 -1021606 -1014503 -1025325 -1015398
11054 -1015398 -999844 -974437 -950629 -937450 -944057 -948563 -956996 -961256 -936742 -937678 -927920 -960582 -1005531
11041a005531Q001M1701K1285J130L0446J2739j8369j7865K134K1893P325j6877
11029i11988l5932K57r718n353J3640J6526L1011l850q543m260k5098l4756m3207
11016a021271J75J0408J4662L0725L3118j110M324j7370j8632l1404j2490k007
11004a010872K3758R513N089K778k398j3900R937J7469K0202l2300k3901M2627
10992i51998M2147J1473j1264N638O231N294K161P863j7021P70L5205L573L401
10979h56527J871j7772O709J4819N634O689L4560K5543K3519j5012k4758n841
10967h00566K2119K0275N656k675K117o147q910K0085N617q088Q378l052q022
10954g53213J3493J0177N774n048M133j951K463L35l31K831K3622J2805J2364
$$ plain form
11041 -1005531 -997530 -955829 -934544 -933414 -902968 -890229 -908598 -926463 -924329 -902436 -895111 -911988
11029 -911988 -947920 -947663 -957381 -962734 -949094 -932568 -901557 -905407 -913950 -918210 -943308 -978064 -1021271
11016 -1021271 -1021096 -1010688 -996026 -965301 -932183 -933293 -928969 -946339 -964971 -996375 -1008865 -1010872
11004 -1010872 -987114 -977601 -972512 -969734 -972132 -986032 -976095 -958626 -938424 -970724 -994625 -951998
10992 -951998 -909851 -898378 -909642 -904004 -897773 -892479 -890318 -882455 -899476 -898706 -863501 -859928 -856527
10979 -856527 -854656 -872428 -865719 -850900 -845266 -838577 -804017 -778474 -754955 -769967 -794725 -800566
10967 -800566 -778447 -758172 -752516 -755191 -753074 -759221 -768131 -748046 -742429 -750517 -742139 -745191 -753213
10954 -753213 -739720 -729543 -723769 -728817 -724684 -726635 -724172 -723837 -724168 -721337 -697715 -684910 -672546
10941f72546L0502j8876j7610L711L5177j348P231j6991J609J5505J9562m3594
10929f57668j0105L0442O965N721l996j7006P328M6005K0527k0776O398O742p216
10916e86639K0050M815q469k381J0644O448J5064J2924K455j776Q735J480j9912
10903e36562K7340n908q567J3359O152J0128L4671K8035J73P517J3739O744K8824
10890c74355J6334j3161j3807n744J2717M836J9658m202J0219j9320k6810J1989
10878c81646K0403J1048j777N398J0158N269K0535K4490j4339j0016K1388J671
10866b87418k214M013m668m617M1169J9603J0655R602r629K7667L6771j8492P19
10853a76839J7409J6508j2229l9708N213L3232L2254n599j1861J7829M0284J0546
$$ plain form
10941 -672546 -642044 -660920 -678530 -674819 -639642 -640990 -633759 -650750 -649141 -633636 -614074 -657668
10929 -657668 -667773 -637331 -630366 -624645 -628641 -645647 -638319 -592314 -571787 -592563 -586165 -579423 -586639
10916 -586639 -566589 -561774 -570243 -572624 -561980 -555532 -540468 -527544 -525089 -526865 -518130 -516650 -536562
10903 -536562 -509222 -515130 -523697 -510338 -504186 -494058 -459387 -431352 -431179 -423662 -409923 -403179 -374355
10890 -374355 -358021 -371182 -384989 -390733 -378016 -373180 -353522 -357724 -347505 -366825 -393635 -381646
10878 -381646 -361243 -350195 -351972 -346574 -336416 -331147 -310612 -286122 -300461 -310477 -289089 -287418
10866 -287418 -289632 -285619 -290287 -294904 -253735 -234132 -223477 -213875 -223504 -195837 -159066 -177558 -176839
10853 -176839 -159430 -142922 -155151 -194859 -189646 -156414 -124160 -129759 -141620 -123791 -83507 -72961
10841g2961j1826r180k0863K108J1541Q699L9343K1464j2513J552l1467k1360
10829i5463J0056P009J8108J9292O582J5380L0172j3680P365J5551K0193K6226
10817F6791J4675J8733o084j7643j1856J3452K3104K2193m980J0221L0652J3082
10805A72340J3696J4142j8383j9093J0818L3365R986J1075M191J1012P125K0809
10793B71083J0371n423J5207J6884K9619Q712K7331J4885J3220J6720J3793r349
10781D23053J3054J9767R347J4188K1287K0279J225J5135l107k1704M550M8948
10769E66022L1475K1492K0583K2707q555J3695Q037J9570J1355M840K0420N383
10757G37024q349J5079N251J8097J9975L6023K3474N263o880K0471M1526J0875
$$ plain form
10841 -72961 -84787 -93967 -114830 -112722 -101181 -92482 -53139 -31675 -44188 -42636 -74103 -95463
10829 -95463 -85407 -78398 -60290 -40998 -34416 -19036 11136 -2544 4821 20372 40565 66791
10817 66791 81466 100199 94115 76472 64616 78068 101172 123365 118385 128606 159258 172340
10805 172340 186036 200178 181795 162702 173520 206885 216871 227946 232137 243149 250274 271083
10793 271083 281454 276031 291238 308122 337741 346453 373784 388669 401889 418609 432402 423053
10781 423053 436107 455874 465221 479409 500696 520975 522200 537335 534228 512524 517074 566022
10769 566022 597497 618989 639572 662279 653724 667419 675456 695026 706381 711221 731641 737024
10757 737024 728675 743754 749005 767102 787077 823100 846574 851837 844957 865428 906954 917829
10745I17829K3797M7491J5985K7397M1367J3352o998n704J0277L9814K7743O569
10733A158919K6096L3945L5081M155M0252K8983k1621k6830j496L3735K4441K2600
10721A358260L1630L0633L3469K0949J4037J4499L2550n678J1111J7481L3381
10710A592322K6708N4946L3567R509N3061L4009J8638J4748L2949L3327L0944
10699A934728K2948K5189L1283L0836M3753L2694L5581L1149M8894L5106K9998
10688B302159M2206L4882M3775M5220O8648P3810M0502L3597O0130M9169K7612
10677B821710M6341N2946N9278P0825P3324P0323O8641R2130N9064M5463M0726
10666C500771N1040Q4481R6047N4120N1509P1861R0972J05076P0299J09564J10793
$$ plain form
10745 917829 941626 989117 1005102 1032499 1073866 1087218 1080220 1074516 1084793 1124607 1152350 1158919
10733 1158919 1185015 1218960 1254041 1258196 1298448 1327431 1305810 1278980 1277484 1311219 1335660 1358260
10721 1358260 1389890 1420523 1453992 1474941 1488978 1503477 1536027 1530349 1541460 1558941 1592322
10710 1592322 1619030 1673976 1707543 1717052 1770113 1804122 1822760 1837508 1870457 1903784 1934728
10699 1934728 1957676 1982865 2014148 2044984 2088737 2121431 2157012 2188161 2237055 2272161 2302159
10688 2302159 2344365 2379247 2423022 2468242 2536890 2610700 2651202 2684799 2744929 2794098 2821710
10677 2821710 2868051 2920997 2980275 3051100 3124424 3194747 3263388 3355518 3414582 3460045 3500771
10666 3500771 3551811 3636292 3732339 3786459 3837968 3909829 4000801 4105877 4176176 4285740 4396533
10655D396533J19723R8288Q1031Q2336J01842J17600J52549J35920J23764J35167
10645E544753J57814J40977J79318J69820J72982J67338J86199K04831K25194
10636G149226K23573K34183K60275K66589K78117L22214L23846L36378L62082
10627I756483L68672M20015M89352N38848N97243O92471P50968Q25166Q93450
10618A5332668R21871R01006P32700L07438m21245j115147j402655j173118n70595
10609A3512923K00083Q61709J314927J567449J552845J068152m5045j895401l704279
10600A4433363m324777l526771j886341j48535J093372J785719K059960J834905
10592A1320895Q91014r95889l815255o246146o761700n283304k805999m92401
$$ plain form
10655 4396533 4516256 4614544 4695575 4777911 4879753 4997353 5149902 5285822 5409586 5544753
10645 5544753 5702567 5843544 6022862 6192682 6365664 6533002 6719201 6924032 7149226
10636 7149226 7372799 7606982 7867257 8133846 8411963 8734177 9058023 9394401 9756483
10627 9756483 10125155 10545170 11034522 11573370 12170613 12863084 13614052 14439218 15332668
10618 15332668 16254539 17155545 17888245 18195683 17774438 16659291 15256636 14083518 13512923
10609 13512923 13713006 14574715 15889642 17457091 19009936 20078088 20033043 18137642 14433363
10600 14433363 10108586 6581815 4695474 4546939 5640311 7426030 9485990 11320895
10592 11320895 12211909 11216020 7400765 1154619 -5607081 -10890385 -13696384 -14188785
10584a4188785J063224J807055J982555J693646Q67975o44386k565584m060503
10576a4044803m169141k982020j241992K52217J142878J484727J490069J205196
10568a6862869O97693k2604q13305j356420j317443q46685j56563L87772P39751
10559a9550673Q82089Q95671Q19435P96556P08296O37502N66267N11217M77201
10550a3256439M31527M36598L69583L41111L10527K91156L05413K75960K38000
10541a0256564K21713K36197J94498J93737K13923J94692J93939J30024J40606
10532h537235J65736J46189J19576J37393J27155J38068R3242J04901J02979J16010
10522g285986J16462J09503J05004N7867M4147R2907R0602P3204N5490P6450O5981
$$ plain form
10584 -14188785 -13125561 -11318506 -9335951 -7642305 -6774330 -7418716 -9984300 -14044803
10576 -14044803 -18213944 -21195964 -22437956 -22185739 -21042861 -19558134 -18068065 -16862869
10568 -16862869 -16165176 -16187780 -17001085 -18357505 -19674948 -20521633 -20678196 -20290424 -19550673
10559 -19550673 -18668584 -17772913 -16953478 -16156922 -15448626 -14811124 -14244857 -13733640 -13256439
10550 -13256439 -12824912 -12388314 -12018731 -11677620 -11367093 -11075937 -10770524 -10494564 -10256564
10541 -10256564 -10034851 -9798654 -9604156 -9410419 -9196496 -9001804 -8807865 -8677841 -8537235
10532 -8537235 -8371499 -8225310 -8105734 -7968341 -7841186 -7703118 -7609876 -7504975 -7401996 -7285986
10522 -7285986 -7169524 -7060021 -6955017 -6897150 -6853003 -6760096 -6669494 -6596290 -6540800 -6464350 -6398369
10511f398369R2491Q1424O2645O0262N1935O9477Q8280Q7541M8902L9072L8326
10500e678014M1335P9820N0542L9442M5353K5130N0275N8072N9725M2477M0386
10489e145457M2103M4914L6684N8763L9962J130L0926M0558M2707N6544J2541
10478d738625M3379n691R512L2446O1114M2205M1670J8123K8561O0166K3289K6915
10466d356936K3652K3457j0694K317m843L1312M4956J2602J8151M8491M4007k958
10454d126486J0399K7845M5246K1266J1660J2820J9907R3M6731K2199L7833K6626
10442c843861k093K1750L0323M2745l595L1362M588Q541L1089K8688J5997J2499
10430c621967p981q532N904J2797M2004J5516J4843K4373L2261K363J6663K8656
$$ plain form
10511 -6398369 -6305878 -6224454 -6161809 -6101547 -6049612 -5980135 -5891855 -5804314 -5755412 -5716340 -5678014
10500 -5678014 -5636679 -5556859 -5506317 -5466875 -5421522 -5396392 -5346117 -5288045 -5228320 -5185843 -5145457
10489 -5145457 -5103354 -5058440 -5021756 -4962993 -4923031 -4921901 -4890975 -4850417 -4807710 -4751166 -4738625
10478 -4738625 -4695246 -4700937 -4691425 -4658979 -4597865 -4555660 -4513990 -4495867 -4467306 -4407140 -4383851 -4356936
10466 -4356936 -4333284 -4309827 -4320521 -4318204 -4323047 -4291735 -4246779 -4234177 -4216026 -4167535 -4123528 -4126486
10454 -4126486 -4116087 -4088242 -4042996 -4021730 -4010070 -3997250 -3977343 -3977250 -3930519 -3908320 -3870487 -3843861
10442 -3843861 -3845954 -3824204 -3793881 -3751136 -3754731 -3723369 -3718781 -3710240 -3679151 -3650463 -3634466 -3621967
10430 -3621967 -3629948 -3638480 -3632576 -3619779 -3577775 -3562259 -3547416 -3523043 -3490782 -3488419 -3471756 -3443100
10418c443100K758j6847j2901j4760N2103M2404K6658J3220j1677Q464K6075N528
10406c322075J2426j35J8561J2818Q965k869J2486M457K5390K0812K7173K4361
10394c157630L9081j2460J5043N359j2503J2773J9305K9039L5736P411j3849n0821
10382c083516j4590K5924O339J8311K6866L417K7234j6262l859K8847K5543M274
10370b951472J0742M2602O846j2939J3132L352J6643J3856k869M658M0206L5541
10358b779702O567P472K1491J8745j839k4313m862r7J2010n314m896K8851K8857
10345b697030j4390L064J8603j2515J1685M068J6163J7371L7167J2311o92Q100
10333b596095o68K701o769J847J4544J5933q586Q75R91J1872K6132J6566J3032
$$ plain form
10418 -3443100 -3440342 -3457189 -3470090 -3484850 -3432747 -3390343 -3363685 -3350465 -3362142 -3353678 -3327603 -3322075
10406 -3322075 -3309649 -3309784 -3291223 -3278405 -3269440 -3272309 -3259823 -3255366 -3229976 -3209164 -3181991 -3157630
10394 -3157630 -3118549 -3131009 -3115966 -3110607 -3123110 -3110337 -3091032 -3061993 -3026257 -3018846 -3032695 -3083516
10382 -3083516 -3098106 -3072182 -3065843 -3047532 -3020666 -3017249 -2990015 -3006277 -3010136 -2981289 -2955746 -2951472
10370 -2951472 -2940730 -2898128 -2891282 -2904221 -2891089 -2887737 -2871094 -2857238 -2860107 -2855449 -2815243 -2779702
10358 -2779702 -2773135 -2765663 -2744172 -2725427 -2727266 -2751579 -2756441 -2756538 -2744528 -2749842 -2754738 -2725887 -2697030
10345 -2697030 -2711420 -2708356 -2689753 -2702268 -2690583 -2686515 -2670352 -2652981 -2615814 -2603503 -2604195 -2596095
10333 -2596095 -2596763 -2594062 -2600831 -2598984 -2584440 -2568507 -2577093 -2576218 -2575227 -2563355 -2537223 -2520657 -2507625
10320b507625P859Q33L45J3671o846R326L0415L7572L868J7899K0377M134K38
10307b367934Q522J51j558K4189M7707n020j3806J967p634p733J6065K5231P378
10294b272475K753K0860J7164J2917K8850M965J3952K3826K4520K1293J7348q023
10282b092050K9302N142J3444K3876R914L1152M3676M4230M5937K9589K5515P2184
10270a718089P8678Q6082Q1062O6737P2989R660l0902n6971r2642j85656k47315
10259a936367k80468k45929k66076k30208j83579j18891n1124j0249L056L6895
10249c282940Q3848J01145O9390Q0030P6226M3910M1500P0839L3666j460K0517
10238b663329L7516K3847J8115K2165L0810K6286J0055k799Q712L0791M435K0974
$$ plain form
10320 -2507625 -2499766 -2498933 -2498588 -2484917 -2491763 -2482437 -2452022 -2414450 -2410582 -2392683 -2372306 -2368172 -2367934
10307 -2367934 -2359412 -2359261 -2360819 -2336630 -2288923 -2293943 -2307749 -2305782 -2313416 -2321149 -2305084 -2279853 -2272475
10294 -2272475 -2269722 -2248862 -2231698 -2218781 -2189931 -2184966 -2171014 -2147188 -2122668 -2101375 -2084027 -2092050
10282 -2092050 -2062748 -2057606 -2044162 -2020286 -2010372 -1979220 -1935544 -1891314 -1845377 -1815788 -1790273 -1718089
10270 -1718089 -1639411 -1553329 -1472267 -1405530 -1332541 -1322881 -1353783 -1410754 -1503396 -1689052 -1936367
10259 -1936367 -2216835 -2462764 -2728840 -2959048 -3142627 -3261518 -3312642 -3322891 -3319835 -3282940
10249 -3282940 -3199092 -3097947 -3028557 -2948527 -2872301 -2828391 -2786891 -2716052 -2682386 -2683846 -2663329
10238 -2663329 -2625813 -2601966 -2583851 -2561686 -2530876 -2504590 -2494535 -2497334 -2488622 -2457831 -2453396 -2432422
10226b432422P183p983J3551j0270l3478K6756J2780L0765K0280R731L4159M383
10214b324565p01J1996Q877L15Q687O759R820L2431O792O962Q16R335k7475M761
10200b245190j3936j956L4722M979K1167N230j6131L500J3617P165K172r043M7
10187b193657M3165L0924j3806j1156J3220J33J3079M8211K4823m15j6147o428
10175b068054r553j1079J5353R689K387J0923K4269K0076J4414j260j7455j2655
10163b022945k9991m0743k4483R602R627K9051M885J1502P312j4319k7109j0853
10151b098464j7767j7812J5920o977k2192Q532J3213M537L0340J674l2702n0640
10139b172338j4890O089J0649J9846j3731J6941K5917N935K5949R508k4524J1940
$$ plain form
10226 -2432422 -2425239 -2433222 -2419671 -2429941 -2463419 -2436663 -2423883 -2393118 -2372838 -2363107 -2328948 -2324565
10214 -2324565 -2325266 -2313270 -2304393 -2304078 -2295391 -2288632 -2278812 -2246381 -2239589 -2232627 -2231811 -2222476 -2249951 -2245190
10200 -2245190 -2259126 -2261082 -2226360 -2221381 -2200214 -2194984 -2211115 -2207615 -2193998 -2186833 -2184661 -2193704 -2193657
10187 -2193657 -2150492 -2119568 -2133374 -2144530 -2131310 -2131177 -2118098 -2069887 -2045064 -2045479 -2061626 -2068054
10175 -2068054 -2077607 -2088686 -2073333 -2063644 -2061257 -2050334 -2026065 -2005989 -1991575 -1992835 -2010290 -2022945
10163 -2022945 -2052936 -2093679 -2118162 -2108560 -2098933 -2069882 -2064997 -2053495 -2046183 -2060502 -2087611 -2098464
10151 -2098464 -2116231 -2134043 -2118123 -2125100 -2147292 -2138760 -2125547 -2121010 -2090670 -2088996 -2121698 -2172338
10139 -2172338 -2187228 -2181139 -2170490 -2150644 -2164375 -2147434 -2121517 -2115582 -2089633 -2080125 -2104649 -2092709
10127b092709l22k0750k0029N203L5699K0627k0393q820J2831j959K2163J0415
10115b058044j4754P145O594j2993j643R633R578K5650L1801L8606j044k7559
10103a987030j6418o312K2431K4934P694k2786L175N330L0615R753M117n755n925
10090a936177r289m360J0323K2390k1753j8170k857R492M919j4989j0174R600
10078a961045l403J967R329J5496M64O380Q848J8449J7648J6370j3242j2259J120
10065a893878j846j8451j2945M479L3010J1886K0197N55J9349k3311m0064O041
10053a894978J2197M289K0222R075q398j1883j229K0036Q112Q16m993J0107R937
10040a826690J7025J3059R162j8187j362J0410P541j8706k1855L052j685O169
$$ plain form
10127 -2092709 -2093031 -2113781 -2133810 -2128607 -2092908 -2072281 -2092674 -2101494 -2088663 -2090622 -2068459 -2058044
10115 -2058044 -2072798 -2065653 -2059059 -2072052 -2073695 -2064062 -2054484 -2028834 -1997033 -1958427 -1959471 -1987030
10103 -1987030 -2003448 -2009760 -1987329 -1962395 -1954701 -1977487 -1974312 -1968982 -1938367 -1928614 -1924497 -1930252 -1936177
10090 -1936177 -1945466 -1949826 -1939503 -1917113 -1938866 -1957036 -1959893 -1950401 -1945482 -1960471 -1970645 -1961045
10078 -1961045 -1964448 -1962481 -1953152 -1937656 -1937192 -1930812 -1921964 -1903515 -1885867 -1869497 -1882739 -1894998 -1893878
10065 -1893878 -1895724 -1914175 -1927120 -1922641 -1889631 -1877745 -1857548 -1856993 -1837644 -1860955 -1901019 -1894978
10053 -1894978 -1882781 -1878492 -1858270 -1849195 -1857593 -1869476 -1870705 -1850669 -1842557 -1841741 -1846734 -1836627 -1826690
10040 -1826690 -1809665 -1796606 -1787444 -1805631 -1806993 -1796583 -1789042 -1807748 -1829603 -1826551 -1828236 -1822067
10028a822067Q873M87j6895n895L4388R336k405N474J9253O103R156M897j2918
10015a762213r230l40O863j2384j1851m1249p213J288M881R605j6339M784O012
10002a827386j3843j90J5139Q984L1871J0479J370N595K0271k6301j3149J5075
9990a772085K0298K408r985n949J4475J2990o25k6569m498Q230N12Q949K0281
9977a731568Q959N17O893j3094k4047n983J3986J1543j007j5807K8854J1288j459
9964a710925N640N629J3723j4848j0968n255K1224J3555m998m9730k4738l600
9952a765291k476N760J5427L5423j1721J3690K5164J7105m192P828K0475j3301
9940a656109k3947j2066Q32r002K2603k4256p696P748K2127K5343j413n692P649
$$ plain form
10028 -1822067 -1813194 -1812707 -1829602 -1835497 -1801109 -1791773 -1794178 -1788704 -1769451 -1763348 -1754192 -1749295 -1762213
10015 -1762213 -1771443 -1771783 -1764920 -1777304 -1789155 -1830404 -1837617 -1836329 -1831448 -1821843 -1838182 -1833398 -1827386
10002 -1827386 -1841229 -1841419 -1826280 -1817296 -1785425 -1774946 -1773576 -1767981 -1747710 -1774011 -1787160 -1772085
9990 -1772085 -1751787 -1749379 -1759364 -1765313 -1750838 -1737848 -1738473 -1765042 -1769540 -1761310 -1760798 -1751849 -1731568
9977 -1731568 -1722609 -1722092 -1715199 -1728293 -1752340 -1758323 -1744337 -1732794 -1733801 -1749608 -1720754 -1709466 -1710925
9964 -1710925 -1705285 -1699656 -1685933 -1700781 -1711749 -1717004 -1695780 -1682225 -1687223 -1736953 -1761691 -1765291
9952 -1765291 -1767767 -1762007 -1746580 -1711157 -1722878 -1709188 -1684024 -1666919 -1671111 -1663283 -1642808 -1656109
9940 -1656109 -1680056 -1692122 -1691290 -1700292 -1677689 -1701945 -1709641 -1701893 -1679766 -1654423 -1655836 -1661528 -1653879
9927a653879j5434P019k1356J3574p983k3653p170M0245K3887J6404j2490o573
9915a647409J0011J5811j4511j9101o015Q51l3157m520L4000J3666J2307R13K167
9902a634987j61P659j7691j9094J160Q843n568Q564J2239j1536K3647L0745m657
9889a600837j3436j2870L097j4864j1508K1883J0284M052J9231N157K0622L410
9877a565779q316j1897J2619k4194r286J3782o16J0460o86k7370K3023K7585m599
9864a565274o116K1891n604j0173j3693j1237L2173K2656J2366j0334k4270j3596
9852a571211j9381j5704P819P108K0579N419J8673K4562J875j5450p918r079k722
9839a555430L1919l0293k6710j1005K1601J8264n72J4022r408j4636q2l788J7679
$$ plain form
9927 -1653879 -1669313 -1662294 -1683650 -1670076 -1678059 -1701712 -1708882 -1668637 -1644750 -1628346 -1640836 -1647409
9915 -1647409 -1637398 -1621587 -1636098 -1655199 -1661214 -1660363 -1693520 -1698040 -1664040 -1650374 -1638067 -1637154 -1634987
9902 -1634987 -1635148 -1627489 -1645180 -1664274 -1663114 -1654271 -1659839 -1651275 -1639036 -1650572 -1626925 -1596180 -1600837
9889 -1600837 -1614273 -1627143 -1624046 -1638910 -1650418 -1628535 -1618251 -1614199 -1594968 -1589811 -1569189 -1565779
9877 -1565779 -1574095 -1585992 -1573373 -1597567 -1606853 -1593071 -1593687 -1583227 -1583913 -1611283 -1588260 -1560675 -1565274
9864 -1565274 -1571390 -1549499 -1555103 -1565276 -1578969 -1590206 -1558033 -1535377 -1523011 -1533345 -1557615 -1571211
9852 -1571211 -1590592 -1606296 -1598477 -1591369 -1570790 -1565371 -1546698 -1522136 -1520261 -1535711 -1543629 -1552708 -1555430
9839 -1555430 -1523511 -1553804 -1580514 -1591519 -1569918 -1551654 -1552226 -1538204 -1547612 -1562248 -1562330 -1566118 -1548439
9826a548439K711j3040J2387K837J9532j4039k0710K2734R2r703K895K9804P776
9813a505163q093R357o523k3561j0394K772M0853N184k9208j6818k4986m884P058
9800a564406K0413P934O468K919R810J3003N814j572q715k621K619j5186j442
9787a524962j5208O917K095J6391N0911O531r573p877j1728J8195J3461Q389m117
9774a450575p226m4219O442N074l86k330k6185j4501P913r316J8513J9699m858
9761a501955o703K3287l9959j3978J3999J1819O896N077K1509J8486O323r736
9749a464935j4278J1662J2185k740M623k935j1061j1860K0375J623j9653l874
9737a480868m320m776J9825J3751M315Q318j5589J7181L1055J6026l9027p218
$$ plain form
9826 -1548439 -1545728 -1558768 -1546381 -1543544 -1524012 -1538051 -1558761 -1536027 -1535935 -1545638 -1542743 -1512939 -1505163
9813 -1505163 -1513256 -1503899 -1510422 -1533983 -1544377 -1541605 -1500752 -1495568 -1524776 -1541594 -1566580 -1571464 -1564406
9800 -1564406 -1543993 -1536059 -1529591 -1526672 -1516862 -1503859 -1498045 -1499617 -1508332 -1510953 -1508334 -1523520 -1524962
9787 -1524962 -1540170 -1533253 -1531158 -1514767 -1463856 -1457325 -1466898 -1474775 -1486503 -1468308 -1454847 -1446458 -1450575
9774 -1450575 -1457801 -1502020 -1495578 -1490504 -1490890 -1493220 -1519405 -1533906 -1525993 -1535309 -1516796 -1497097 -1501955
9761 -1501955 -1508658 -1485371 -1525330 -1539308 -1525309 -1513490 -1506594 -1501517 -1480008 -1461522 -1455199 -1464935
9749 -1464935 -1479213 -1467551 -1455366 -1458106 -1453483 -1456418 -1467479 -1479339 -1458964 -1457341 -1476994 -1480868
9737 -1480868 -1485188 -1489964 -1470139 -1456388 -1452073 -1443755 -1459344 -1442163 -1411108 -1395082 -1434109 -1441327
9725a441327J8593j1196m3699J9059J8992K5492n605k5357J745k5088J8328J1228
9713a438835J6816J046R499k355j3591o867K880K445l353M717R458j9759k2974
9700a460873o768R351J8107J4835L2499J491l2755J2506J4365j4151j3970l7504
9688a462867m179L835L984J4921Q189O956K326J616k1751R915K1057j659p741
9675a425398J263J2486K104l888K6948P668L94J8289K462K2839j2985j6115k1761
9662a385694j7595j169N050M973j4856p139J4726L3314R683R920j4220j1580m482
9649a379069J7453O647R59K2327K1593k8192k5079k493q570l7413n845j9079k5475
9636a462236n551Q634r081o494J7566J8927L9064Q942j0134r163o06q776J6342
$$ plain form
9725 -1441327 -1422734 -1433930 -1477629 -1458570 -1439578 -1414086 -1419691 -1445048 -1443303 -1468391 -1450063 -1438835
9713 -1438835 -1422019 -1420973 -1411474 -1413829 -1427420 -1434287 -1431407 -1428962 -1432315 -1427598 -1418140 -1437899 -1460873
9700 -1460873 -1467641 -1458290 -1440183 -1425348 -1392849 -1391358 -1424113 -1411607 -1397242 -1411393 -1425363 -1462867
9688 -1462867 -1467046 -1463211 -1459227 -1444306 -1436117 -1429161 -1426835 -1425219 -1446970 -1437055 -1415998 -1417657 -1425398
9675 -1425398 -1424135 -1411649 -1409545 -1413433 -1386485 -1378817 -1378423 -1360134 -1357672 -1334833 -1347818 -1363933 -1385694
9662 -1385694 -1403289 -1404458 -1399408 -1394435 -1409291 -1416430 -1401704 -1368390 -1358707 -1348787 -1363007 -1374587 -1379069
9649 -1379069 -1361616 -1354969 -1354010 -1331683 -1310090 -1338282 -1363361 -1365854 -1374424 -1411837 -1417682 -1436761 -1462236
9636 -1462236 -1467787 -1459153 -1468234 -1474728 -1457162 -1438235 -1399171 -1390229 -1400363 -1409526 -1410132 -1418908 -1402566
9623a402566j689M172J5532j116K841M357p858j0720K3630J0685o053k1389O74
9610a389500J0799j472M310M772K8957R586k3309l575n23j1830l5615L874L2194
9597a371332M344J7405J008j3480K442L519l781k600K0212N484j6749j0252j6347
9584a380127K0886L4617k0203j7245K5878P256K6675k7071k7105K2729K3862Q263
9572a301585n893j8753L356M156m080p294N108j0490Q345N626j0768J0802M857
9559a316613o652L1348j2722l5779L476j7098j7315k6524N420L8665J0251R446
9547a334097k9714J468j844o010J9127K3417J5326l020O065r438J2183M828j9704
9534a321413j8066n261o050J0014K5812J8921K2943m627k9138P289O041j2839
$$ plain form
9623 -1402566 -1404255 -1400083 -1384551 -1385667 -1382826 -1378469 -1386327 -1397047 -1373417 -1362732 -1368785 -1390174 -1389500
9610 -1389500 -1378701 -1380173 -1375863 -1371091 -1342134 -1332548 -1355857 -1359432 -1359955 -1371785 -1407400 -1403526 -1371332
9597 -1371332 -1366988 -1349583 -1348575 -1362055 -1359613 -1356094 -1359875 -1362475 -1342263 -1336779 -1353528 -1363780 -1380127
9584 -1380127 -1359241 -1324624 -1344827 -1362072 -1336194 -1328938 -1302263 -1329334 -1356439 -1333710 -1309848 -1301585
9572 -1301585 -1307478 -1326231 -1322875 -1318719 -1322799 -1330093 -1324985 -1335475 -1327130 -1321504 -1332272 -1321470 -1316613
9559 -1316613 -1323265 -1291917 -1304639 -1340418 -1336942 -1354040 -1371355 -1397879 -1392459 -1353794 -1343543 -1334097
9547 -1334097 -1363811 -1362343 -1364187 -1370197 -1351070 -1327653 -1312327 -1315347 -1309282 -1318720 -1306537 -1301709 -1321413
9534 -1321413 -1339479 -1344740 -1350790 -1340776 -1314964 -1296043 -1273100 -1277727 -1306865 -1299576 -1293535 -1306374
9522a306374m405k1235j2949J9217K7957K0416j269j7086l0462n887R80j7156
9510a348253p25K3516L206R560k925j333R029j64L174N141J1618J3445J3309P264
9496a254138j3882k1533J36J4008j2221p299J1386L812r65j2000j4113j800J6870
9483a291739J1288j2847R453j8951m501K8100N59J2681p501k2401j250J3551J938
9470a281620m979p67m449o682K778k217j0863J2060J1232M192J3922j083K1710
9457a246766k3396o121R419R55P014j6191j2537J9882J6760r704j9804K846J1385
9444a266258k3615J0289J873N822J6061K3502j4224J782O982m070K4986J9623
9432a197247j7472m0129p311O017o98K4084j2920j4870k2227q986J3505p240j0100
$$ plain form
9522 -1306374 -1310779 -1332014 -1344963 -1325746 -1297789 -1277373 -1278642 -1295728 -1326190 -1332077 -1331097 -1348253
9510 -1348253 -1348978 -1325462 -1322256 -1312696 -1315621 -1316954 -1307925 -1308089 -1304915 -1299774 -1288156 -1274711 -1261402 -1254138
9496 -1254138 -1268020 -1289553 -1289417 -1275409 -1287630 -1294929 -1283543 -1279731 -1280696 -1292696 -1306809 -1308609 -1291739
9483 -1291739 -1280451 -1293298 -1283845 -1302796 -1307297 -1279197 -1278638 -1265957 -1273458 -1295859 -1297109 -1283558 -1281620
9470 -1281620 -1286599 -1287366 -1291815 -1298497 -1295719 -1297936 -1308799 -1296739 -1285507 -1281315 -1267393 -1268476 -1246766
9457 -1246766 -1270162 -1276283 -1266864 -1265909 -1258895 -1275086 -1287623 -1267741 -1250981 -1260685 -1280489 -1277643 -1266258
9444 -1266258 -1289873 -1279584 -1277711 -1271889 -1255828 -1232326 -1246550 -1244768 -1237786 -1241856 -1216870 -1197247
9432 -1197247 -1214719 -1254848 -1262159 -1256142 -1256840 -1232756 -1245676 -1260546 -1282773 -1291759 -1278254 -1285494 -1295594
9419a295594n146K3325J8815K7693N388m905L3614J1736J0467k3508k0591q802
9407a227508j9470L828R528k2202k3431J5786J5114K367j3413N165K7524R971
9395a216741l4449k8340O062j420j2727K4870L4754K1166O048m058j8545q143
9383a231523K3394j7200l6459j4389j693Q800J2272J9562J695J0864P158J4609
9371a202910J5923q804j7504m667J7510r208k3222n812J2529k412j4906J210J7039
9358a225234K5362L5565k482q823l8581j5208J657J6353K4119R954j5155j1183
9346a203656j1873j10j7016L093j7467k2385J0947L1001K5861J541j1543j7132
9334a228739N169K569N499K0042n27k7238L950J9910M955R285L375J0596r195
$$ plain form
9419 -1295594 -1300740 -1277415 -1258600 -1230907 -1225519 -1230424 -1196810 -1185074 -1174607 -1198115 -1218706 -1227508
9407 -1227508 -1246978 -1243150 -1233622 -1255824 -1279255 -1263469 -1248355 -1245988 -1259401 -1254236 -1226712 -1216741
9395 -1216741 -1251190 -1279530 -1273468 -1274888 -1287615 -1262745 -1227991 -1206825 -1200777 -1204835 -1223380 -1231523
9383 -1231523 -1208129 -1225329 -1261788 -1276177 -1277870 -1269070 -1256798 -1237236 -1235541 -1224677 -1217519 -1202910
9371 -1202910 -1186987 -1195791 -1213295 -1217962 -1200452 -1209660 -1232882 -1238694 -1226165 -1228577 -1243483 -1242273 -1225234
9358 -1225234 -1199872 -1164307 -1166789 -1175612 -1214193 -1229401 -1227744 -1211391 -1187272 -1177318 -1192473 -1203656
9346 -1203656 -1215529 -1215639 -1232655 -1229562 -1247029 -1269414 -1258467 -1227466 -1201605 -1200064 -1211607 -1228739
9334 -1228739 -1223570 -1221001 -1215502 -1195460 -1195987 -1223225 -1219275 -1199365 -1194410 -1185125 -1181750 -1171154 -1180349
9321a180349l063p212J3437o296j8331j7181J759O312M735K767J43L1255N714
9308a166310J6439j4124k4567j7086J938q65n105q270J3387R314J1047P327l879
9295a180754r40j5930j5444r794J186K0097J2918J8454R185J596J9939j210j8231
9282a158928j4960J3855l4352k1464O87j046P583J8631K7740j0499k2576N363
9270a189966k095J1095K2989K9919J9625k1383j9497j7744J507R559q970J578
9258a163383o161Q412K0664j2969k6633J9291j3153j2948r291K0218J7556J693
9246a156704K6735L968J038j9499l0527k344J4034Q138O505k3573j4226o062J2350
9233a180167J1340J1582N550j4r324j6676j2321J6101Q04j2472J8817r421l610
$$ plain form
9321 -1180349 -1183412 -1190624 -1177187 -1183483 -1201814 -1218995 -1217236 -1210924 -1206189 -1203422 -1203279 -1172024 -1166310
9308 -1166310 -1149871 -1163995 -1188562 -1205648 -1203710 -1204575 -1209680 -1217950 -1204563 -1195249 -1184202 -1176875 -1180754
9295 -1180754 -1181694 -1197624 -1213068 -1222862 -1221676 -1201579 -1188661 -1170207 -1161022 -1159426 -1139487 -1140697 -1158928
9282 -1158928 -1173888 -1160033 -1194385 -1215849 -1215162 -1216208 -1208625 -1189994 -1162254 -1172753 -1195329 -1189966
9270 -1189966 -1192061 -1180966 -1157977 -1128058 -1108433 -1129816 -1149313 -1167057 -1165550 -1155991 -1164961 -1163383
9258 -1163383 -1169544 -1161132 -1140468 -1153437 -1180070 -1160779 -1173932 -1186880 -1196171 -1175953 -1158397 -1156704
9246 -1156704 -1129969 -1126001 -1124963 -1144462 -1174989 -1177333 -1163299 -1155161 -1148656 -1172229 -1186455 -1192517 -1180167
9233 -1180167 -1168827 -1157245 -1151695 -1151709 -1161033 -1177709 -1190030 -1173929 -1173125 -1185597 -1166780 -1176201 -1179811
9220a179811J6505L0100K6446m831j7790j0736p755j0210J6592k8654k1638K5219
9208a166563Q942j2691J1990j1316O57j1334J6800M5815M970j1167K547k5635
9196a146985K005j546o906k079J2712J4486n65k7694j1469J0565J8047k019K408
9183a139040R454K0635k5541l8427j9925L3541L3573k2960k8484J5800J9036k280
9171a144618j3522k3660R61J8479m146J0440K846j1249J18J1540K227K2752J0985
9158a116847m0643K570J3018L1387J513R207k2702k1431J9622J4142j4867K0072
9146a104959k2971M684k408J3033K4762q710Q965k4907k5531P992R911K27J2545
9133a107367j351J2815o00j4056J4717n509M03J4592J921l5665r221j475M606
$$ plain form
9220 -1179811 -1163306 -1133206 -1106760 -1111591 -1129381 -1140117 -1147872 -1158082 -1141490 -1170144 -1191782 -1166563
9208 -1166563 -1157621 -1170312 -1158322 -1169638 -1168981 -1180315 -1163515 -1117700 -1112730 -1123897 -1121350 -1146985
9196 -1146985 -1144980 -1146526 -1153432 -1155511 -1142799 -1128313 -1128878 -1156572 -1168041 -1157476 -1139429 -1141448 -1139040
9183 -1139040 -1129586 -1108951 -1134492 -1172919 -1192844 -1159303 -1125730 -1148690 -1177174 -1161374 -1142338 -1144618
9171 -1144618 -1158140 -1181800 -1180839 -1162360 -1166506 -1156066 -1153220 -1164469 -1164351 -1152811 -1150584 -1127832 -1116847
9158 -1116847 -1157490 -1154920 -1141902 -1110515 -1109002 -1099795 -1122497 -1143928 -1124306 -1110164 -1125031 -1104959
9146 -1104959 -1127930 -1123246 -1125654 -1112621 -1087859 -1096569 -1087604 -1112511 -1138042 -1130050 -1120139 -1119912 -1107367
9133 -1107367 -1108718 -1095903 -1096503 -1110559 -1095842 -1101351 -1100948 -1086356 -1084435 -1120100 -1129321 -1130796 -1126190
9120a126190O771K219p552j2071J9420M4354J8589l1389j5501k481j7385j3469
9108a134685J8220k218N859j3575o686K0656J3184n614k754N834l490q715j2635
9095a126619m859J1660K9621L559k4567o685r474L918p956L345J5238J4229p16
9082a099306j726J7809l447j1759P913j6375j4742j9445K2503L0730K4110n816
9070a069551J5299j6400l2975M701n505J4293m486o475j8043m032O75K367j4197
9057a134329P2M938J4582P762j0304J8398J4816Q844K5202m338P157k4702k2695
9044a094597N611K9400r934j0448J4438n359q708J7211j883J5123r31j3098j7112
9031a080287K568L250J697L428j6378k7024J3948q092L353Q854J8875N881J8654
$$ plain form
9120 -1126190 -1119419 -1117200 -1124752 -1136823 -1117403 -1073049 -1054460 -1085849 -1101350 -1103831 -1121216 -1134685
9108 -1134685 -1116465 -1118683 -1112824 -1126399 -1133085 -1112429 -1099245 -1104859 -1107613 -1101779 -1105269 -1113984 -1126619
9095 -1126619 -1131478 -1119818 -1090197 -1086638 -1111205 -1117890 -1127364 -1123446 -1131402 -1128057 -1112819 -1098590 -1099306
9082 -1099306 -1101032 -1083223 -1086670 -1098429 -1090516 -1106891 -1121633 -1141078 -1118575 -1087845 -1063735 -1069551
9070 -1069551 -1054252 -1070652 -1103627 -1098926 -1104431 -1090138 -1094624 -1101099 -1119142 -1123174 -1122499 -1120132 -1134329
9057 -1134329 -1134257 -1129319 -1114737 -1106975 -1117279 -1098881 -1084065 -1075221 -1050019 -1054357 -1047200 -1071902 -1094597
9044 -1094597 -1088986 -1059586 -1069520 -1079968 -1065530 -1070889 -1079597 -1062386 -1064269 -1049146 -1050077 -1063175 -1080287
9031 -1080287 -1077719 -1074469 -1072772 -1069344 -1085722 -1112746 -1098798 -1106890 -1103537 -1094683 -1075808 -1069927 -1051273
9018a051273N815j3150o257j4177j1800N451K4089Q044J0682p12p491k7750N853
9005a072676K0586J2843j4825l6694j326o85o670k357r22K0748K0062o061K0831
8992a047146K430O688k9185M376n931O735k654K0232k6605k2103J1428K0217j4471
8979a075989k5002K4439K1675K052l416l220P042J600j2680N214J0715J3578l305
8966a037297K0633R997j1324k4976j0399R391j1719K2464q159n664P916l0091
8954a069228j3035L8836M995k0939r38Q899q479J3301K5555p149l0358m3641P174
8941a095007P582J0438J6344J5336k0182k7294j3151K4191j4872j7281J0762j082
8929a104216k681J6970L3614K0779j73j5256O18p6M014m651k032J5603k44j1289
$$ plain form
9018 -1051273 -1045458 -1058608 -1064865 -1079042 -1090842 -1085391 -1061302 -1053258 -1042576 -1043288 -1050779 -1078529 -1072676
9005 -1072676 -1052090 -1039247 -1054072 -1090766 -1092092 -1092777 -1099447 -1101804 -1102726 -1081978 -1061916 -1067977 -1047146
8992 -1047146 -1044716 -1038028 -1067213 -1062837 -1068768 -1062033 -1064687 -1044455 -1071060 -1093163 -1081735 -1061518 -1075989
8979 -1075989 -1100991 -1076552 -1054877 -1052825 -1056241 -1059461 -1052419 -1050819 -1063499 -1058285 -1047570 -1033992 -1037297
8966 -1037297 -1016664 -1006667 -1017991 -1042967 -1053366 -1043975 -1055694 -1033230 -1041389 -1047053 -1039137 -1069228
8954 -1069228 -1082263 -1043427 -1038432 -1059371 -1060309 -1051410 -1059889 -1046588 -1021033 -1028182 -1058540 -1102181 -1095007
8941 -1095007 -1087425 -1076987 -1060643 -1045307 -1065489 -1092783 -1105934 -1081743 -1096615 -1113896 -1103134 -1104216
8929 -1104216 -1106897 -1089927 -1056313 -1035534 -1035707 -1050963 -1050345 -1050421 -1046407 -1051058 -1053090 -1037487 -1037731 -1049020
8915a049020J2766L0555L798p614K816j3867j5575j5501J1039J942K793M942k4592
8902a055518o587m458N542J0287J1029K0924Q60j3422j9759j7139K2337K0843
8890a025061J2232j0934K797n328o111M912l250J3236N80L4255j3253k6944m781
8877a027650K1400p630L710J954k913n166J683J1619J0368j9002J6528K717j1789
8864a004171J9003J5688j0984m430J6412k1331l8663j8909n099J3858o249j790
8852a046665O277k8700L961O042L4205L128p281Q131N550j1768q649q218J7828
8839a026159l258q839L6191J3906l0778k2406n597J1839Q993M285J8290j216o202
8826a010951L0420R1j5184j1817j618J4110J6282O1l2734j1564p01J912j983o175
$$ plain form
8915 -1049020 -1036254 -1005699 -1001901 -1009515 -1006699 -1020566 -1036141 -1051642 -1040603 -1038661 -1035868 -1030926 -1055518
8902 -1055518 -1062105 -1066563 -1061021 -1050734 -1039705 -1018781 -1017921 -1031343 -1051102 -1068241 -1045904 -1025061
8890 -1025061 -1012829 -1023763 -1020966 -1026294 -1032405 -1027493 -1030743 -1017507 -1016927 -982672 -995925 -1022869 -1027650
8877 -1027650 -1006250 -1013880 -1010170 -1008216 -1011129 -1016295 -1014612 -1002993 -992625 -1011627 -995099 -992382 -1004171
8864 -1004171 -985168 -969480 -980464 -984894 -968482 -989813 -1028476 -1047385 -1052484 -1038626 -1044875 -1046665
8852 -1046665 -1040388 -1069088 -1065127 -1059085 -1024880 -1021752 -1029033 -1020902 -1015352 -1027120 -1035769 -1043987 -1026159
8839 -1026159 -1029417 -1038256 -1002065 -988159 -1018937 -1041343 -1046940 -1035101 -1026108 -1021823 -1003533 -1004749 -1010951
8826 -1010951 -980531 -980440 -995624 -1007441 -1009059 -994949 -978667 -978606 -1011340 -1022904 -1023605 -1021693 -1023676 -1029851
8812a029851M418P096J3281J9437M113j893j550J4188N463j5568m9471j1458J7568
8799a024227J128J9077m267o457N181R351K0012k321k2526J4427J6295J4423Q29
8786i59075j4592r55j1119k35k4367p106n249J757M869J5894K1532r925m165j4316
8772a007052m313L218J5815J6297M621k6116O28k1709j3267O064K4401K4571m842
8759i81684p639k9339j8101j2J9227J6979Q970k4960m034p28J6443K3828J4406
8746i66644k313l7202j6262M1090J5564k7009O992J353k0496K2822J9449k2088
8734i84744J3700K2361j0306l1309l319Q039K455Q347M645N118Q152l833k6842
8721i87536o278l33K6734m349J11q014P516q843N399K6694K1588k748j3356l9937
$$ plain form
8812 -1029851 -1025433 -1018337 -1005056 -985619 -981506 -983399 -984949 -970761 -965298 -980866 -1030337 -1041795 -1024227
8799 -1024227 -1023099 -1004022 -1008289 -1014746 -1009565 -1000214 -980202 -982523 -1005049 -990622 -974327 -959904 -959075
8786 -959075 -973667 -974622 -985741 -985976 -1010343 -1017449 -1022698 -1020941 -1016072 -1000178 -978646 -988571 -992736 -1007052
8772 -1007052 -1011365 -1008147 -992332 -976035 -971414 -997530 -996902 -1018611 -1031878 -1025814 -1001413 -976842 -981684
8759 -981684 -989323 -1018662 -1036763 -1036775 -1017548 -1000569 -991599 -1016559 -1020593 -1021321 -1004878 -981050 -966644
8746 -966644 -968957 -1006159 -1022421 -981331 -965767 -992776 -985784 -984431 -1004927 -982105 -962656 -984744
8734 -984744 -971044 -948683 -958989 -990298 -993617 -985578 -983123 -974776 -970131 -965013 -956861 -960694 -987536
8721 -987536 -993814 -994147 -967413 -971762 -971651 -979665 -972149 -980992 -975593 -948899 -927311 -930059 -943415 -983352
8707i83352l1858L615K9188j166q827K2254K5412q672l6208j6938J2705O395k0955
8694a008407o437K7256O279J6500K5271Q178q015j1163k2332n401r238j7465o422
8681a011396K7740J3360l3943j1523J2985J0752l747J1933R012q098j6068R510
8669i89483J3623K8914Q434j4090k3007R556J1223q291j7410j5588J3309Q367
8657i74443l087J5492p632p685J321R40j126J559O998q085j8792j3675k2457R994
8643a020678K1483J2083j4850M157L459j1239k5357K482L0271m383J341J6461
8631i84770J4740J8174J3675j8967j3047N545j5366j0563k816q67O870K9767J6838
8618i40787O681L4747k3198l8057j7397j3526p91J1335J845J22J0881J7393j7656
$$ plain form
8707 -983352 -1015210 -1011595 -982407 -983573 -992400 -970146 -944734 -953406 -989614 -1006552 -993847 -987452 -1008407
8694 -1008407 -1014844 -987588 -981309 -964809 -939538 -931360 -939375 -950538 -972870 -978271 -987509 -1004974 -1011396
8681 -1011396 -983656 -970296 -1004239 -1015762 -1002777 -992025 -995772 -983839 -974827 -982925 -998993 -989483
8669 -989483 -975860 -946946 -938512 -952602 -975609 -966053 -954830 -963121 -980531 -996119 -982810 -974443
8657 -974443 -977530 -962038 -969670 -977355 -976034 -975094 -976220 -974661 -967663 -975748 -994540 -1008215 -1030672 -1020678
8643 -1020678 -999195 -987112 -1001962 -997805 -994346 -1005585 -1030942 -1028460 -998189 -1002572 -1001231 -984770
8631 -984770 -970030 -951856 -938181 -957148 -970195 -964650 -980016 -990579 -993395 -994262 -987392 -957625 -940787
8618 -940787 -934106 -899359 -922557 -960614 -978011 -991537 -992328 -980993 -979148 -979026 -968145 -950752 -968408
8605i68408k0108L054K8545M305j1513k0944K0506K8188k2344R851J2689P122
8593i29057j3196j6211l536J1216J9680j219J3429J291k1191j0008M561M972P238
8580i32031j7649q169L3427J2840l611j7819j3777k1648o177K5881J6585j2294
8568i44442j3385j7532J0447l094K621Q517j1678j7237L133P107p379Q512L7812
8555i36598J0390M808r643l4180j8993n720J2591r460p650Q783R107k5965J502
8542a001028J5829K9277J3229j6001k0331J0513N347n564J7508J5251j2059j5555
8530i63584l784K3417l454L906N856P401M999O312K276r885J1245j7458q660o145
8516i47558L286k073l364J1165m303q415J4399L482j1864L388j7414j8624O549
$$ plain form
8605 -968408 -988516 -985462 -956917 -952612 -964125 -985069 -964563 -936375 -958719 -948868 -936179 -929057
8593 -929057 -942253 -958464 -962000 -950784 -931104 -932323 -918894 -917603 -938794 -948802 -944241 -939269 -932031
8580 -932031 -949680 -957849 -924422 -911582 -915193 -933012 -946789 -968437 -974614 -948733 -932148 -944442
8568 -944442 -957827 -975359 -964912 -968006 -965385 -956868 -968546 -985783 -982650 -975543 -982922 -974410 -936598
8555 -936598 -926208 -921400 -931043 -965223 -984216 -989936 -977345 -986805 -994455 -985672 -976565 -1002530 -1001028
8542 -1001028 -985199 -955922 -942693 -958694 -979025 -968512 -963165 -968729 -951221 -935970 -948029 -963584
8530 -963584 -967368 -943951 -947405 -943499 -937643 -930242 -925243 -918931 -916655 -926540 -915295 -932753 -941413 -947558
8516 -947558 -944272 -946345 -949709 -938544 -942847 -951262 -936863 -933381 -945245 -941857 -959271 -977895 -971346
8503i71346J5671K3905j6846K051J5798j7625q019j8159j1251J9899L4641J6077
8491i15204l847Q756O539R346J8128j7604j1319l253P113j7054k4342K8991R179
8478i04571m2055P399L2182J3972k899j1832o215K090l283J1132J1734O148p567
8465h93765j1644j87l045L749N731J196m730j3434p070J0025J0115K6922K4140
8452h51997j3845j5712k1353j9944j6408j827J9948M186J9335J2200j9095r143
8440i13655j5960j748j0009J811J650O65j6013M5932L0899l0174p747j2862J6246
8427i10965J450M994j028j8114k4643k4113J3229J1573O459J5817j4453n348J6818
8414i28324J4705p709r802p003m534J2030J0049r142q959K5840J8090l592l1925
$$ plain form
8503 -971346 -955675 -931770 -948616 -946565 -930767 -948392 -956411 -974570 -985821 -965922 -931281 -915204
8491 -915204 -919051 -910295 -903756 -894410 -876282 -893886 -905205 -908458 -901345 -918399 -942741 -913750 -904571
8478 -904571 -946626 -939227 -907045 -893073 -895972 -907804 -914019 -911929 -915212 -904080 -892346 -886198 -893765
8465 -893765 -905409 -905596 -908641 -904892 -899161 -897965 -902695 -916129 -923199 -913174 -903059 -876137 -851997
8452 -851997 -865842 -881554 -902907 -922851 -939259 -941086 -921138 -916952 -897617 -885417 -904512 -913655
8440 -913655 -929615 -931363 -941372 -939561 -937911 -937246 -953259 -907327 -876428 -906602 -914349 -927211 -910965
8427 -910965 -909515 -904521 -905549 -923663 -948306 -972419 -959190 -947617 -941158 -925341 -939794 -945142 -928324
8414 -928324 -913619 -921328 -931130 -938133 -942667 -930637 -920588 -929730 -938689 -912849 -894759 -898351 -930276
8401i30276j5229J7514J7351p839K0299o653j8360L139L5887P979l8273k1604
8389i36065l675K5917J0141j8013J4803k663j1846j5689k2005J2950P277l183
8377i42051r786M548N83o750k6328K1636J4819J0929L3522j7254M509m90k123
8364i14236K73Q308j1011Q365R903p198K653L367j3507L321M685j983m672q180
8350i19912j0957K9646J8123j3665j0406j2684J4734q875k2242j1199L270J3428
8338i30739o068N969J4954K4354p264J0018J3402L323k7155j4321l18K3005J7275
8325h73565k1961l661k5542q28K5423J5386K276M203j3838J5443K677l2063P889
8312h98161J3081j1752q049J4981J3427o4p814j476j3968j4180J2158j2506J3955
$$ plain form
8401 -930276 -945505 -927991 -910640 -918479 -898180 -904833 -923193 -920054 -884167 -876188 -914461 -936065
8389 -936065 -939740 -913823 -903682 -921695 -906892 -909555 -921401 -937090 -959095 -946145 -938868 -942051
8377 -942051 -951837 -947289 -946706 -953456 -979784 -958148 -943329 -932400 -898878 -916132 -911623 -912113 -914236
8364 -914236 -913963 -905655 -916666 -908301 -898398 -905596 -902943 -899576 -913083 -909762 -905077 -907060 -911732 -919912
8350 -919912 -930869 -901223 -883100 -896765 -907171 -919855 -905121 -913996 -936238 -947437 -944167 -930739
8338 -930739 -936807 -930838 -915884 -891530 -898794 -888776 -875374 -872051 -899206 -913527 -913845 -890840 -873565
8325 -873565 -895526 -899187 -924729 -925557 -900134 -884748 -882472 -878269 -892107 -876664 -873987 -906050 -898161
8312 -898161 -885080 -896832 -904881 -889900 -876473 -876537 -884351 -885827 -899795 -913975 -901817 -914323 -900368
8299i00368P0J2950J8649j8434J6049J1632j1722j2787R701K906l735k6756R713
8286h92132n382k2615n169Q147n666P664j0839r110O537L2945N9O170K5558j3077
8272h76910k4445l1305J5885J3359K237k3409J3520J304p657L3621K6551N75j7151
8259h73825M864J5613J6188Q186l1443j7609j8041k0170Q349K5059K421k4339
8247i04747M7931J5384m5127j9281K002L3991J0945j2598K1738m191j0799N336
8235h59416J1827J206j6446o550L532j3228q750K3458K6660j7671j7290M152q824
8222h77340M689q401o013K9034J2641j9566j4142R696j1626J8197J0677k705o047
8209h60906r430o610J0422l175J149l455J3291j0951k9903o079P66K4545K1140
$$ plain form
8299 -900368 -900298 -887348 -868699 -887133 -871084 -859452 -871174 -883961 -874260 -871354 -875089 -901845 -892132
8286 -892132 -897514 -920129 -925298 -917151 -922817 -915153 -925992 -935102 -928565 -895620 -895561 -889391 -863833 -876910
8272 -876910 -901355 -932660 -916775 -903416 -901179 -924588 -911068 -909764 -917421 -883800 -857249 -856674 -873825
8259 -873825 -868961 -853348 -837160 -828974 -860417 -878026 -896067 -916237 -907888 -882829 -880408 -904747
8247 -904747 -856816 -841432 -886559 -905840 -903838 -869847 -858902 -871500 -849762 -853953 -864752 -859416
8235 -859416 -847589 -846383 -862829 -869379 -865847 -879075 -887825 -864367 -837707 -855378 -872668 -868516 -877340
8222 -877340 -872651 -881052 -887065 -858031 -845390 -864956 -879098 -869402 -881028 -862831 -852154 -854859 -860906
8209 -860906 -870336 -876946 -866524 -869699 -868550 -872005 -858714 -869665 -899568 -905647 -904881 -880336 -859196
8196h59196O113k0536O338l294j9433j7072J0278J1346j98K729l895J714j4724
8183h99830l0090J6290R222J0808L388J9182O779n650j5099n404J7877K5884j3529
8170h60172q488p282J1360k0006R16J6639N675K37j0712L36P367Q150k1439P969
8156h69450j3184K738O279k370O658R551n77j6544N6r421l294L1452J2582K986
8142h42538j6592q579j3417j7296p708k3969j1889L5234R126J0963K6449o632
8130h66848j2480P315o421Q310L812L71l1159j0799K231j660N530J8126o261k2280
8116i12213J3085P265M397J3346J8743L678J2280n082k8677j6373J8407J4622
8104h56522L892q437J6298J965p933p323L506K651p377M128l717j8302J1210L1792
$$ plain form
8196 -859196 -853083 -873619 -867281 -870575 -890008 -907080 -896802 -885456 -885654 -882925 -886820 -885106 -899830
8183 -899830 -929920 -913630 -904408 -893600 -890212 -871030 -864251 -869901 -885000 -890404 -872527 -846643 -860172
8170 -860172 -868660 -875942 -864582 -884588 -883672 -867033 -861358 -861121 -871833 -871497 -864130 -855980 -877419 -869450
8156 -869450 -882634 -879896 -873617 -875987 -869329 -859778 -860355 -876899 -876843 -886264 -889558 -858106 -845524 -842538
8142 -842538 -859130 -867709 -881126 -898422 -906130 -930099 -941988 -906754 -897628 -886665 -860216 -866848
8130 -866848 -879328 -872013 -878434 -870124 -866312 -865941 -897100 -907899 -905668 -907328 -901798 -883672 -889933 -912213
8116 -912213 -899128 -891863 -887466 -874120 -855377 -851699 -839419 -844501 -873178 -889551 -871144 -856522
8104 -856522 -852630 -861067 -844769 -842804 -850737 -858060 -854554 -851903 -859280 -855152 -858869 -877171 -865961 -834169
8090h34169K701j713J2380n831j7501j3330j0529j7480q138K718K4619P120l296
8077h62449K4574N686j3348k2233j8572K7161L2830K812k0291J661J7059p992
8065h33102j9706m03m722R513K2669K4551K939q322j751l8282l2189J1616L6003
8052h31186l646l4559j3556M8736J7512L1055J1392j5957m549n304k0024j4695
8040h34781j3377P47n574p916L0066K8279M312J4570J7539m6857k1022K4000K5055
8027g84959k0864L768k180n4865j0815J7528K1839J3818R722j7904j4797j1058
8015h50767J2314J5156q491j3242J567n808r521J5958R66k8732K818K7763J2768
8002h27251R225j246j2022N24J3611j1531m153O093j4722j6237J6121N224n371
$$ plain form
8090 -834169 -831468 -833181 -820801 -826632 -844133 -857463 -867992 -885472 -893610 -890892 -866273 -859153 -862449
8077 -862449 -837875 -832189 -845537 -867770 -886342 -859181 -826351 -823539 -843830 -842169 -825110 -833102
8065 -833102 -852808 -853211 -857933 -848420 -825751 -801200 -798261 -806583 -808334 -846616 -878805 -867189 -831186
8052 -831186 -834832 -869391 -882947 -834211 -816699 -785644 -774252 -790209 -794758 -800062 -820086 -834781
8040 -834781 -848158 -847411 -852985 -860901 -830835 -802556 -798244 -783674 -766135 -812992 -834014 -810014 -784959
8027 -784959 -805823 -802055 -804235 -859100 -869915 -852387 -830548 -816730 -807008 -824912 -839709 -850767
8015 -850767 -838453 -823297 -831788 -845030 -843463 -849271 -858792 -842834 -841868 -870600 -867782 -840019 -827251
8002 -827251 -818026 -819272 -831294 -830770 -817159 -828690 -832843 -826750 -841472 -857709 -841588 -836364 -841735
7989h41735K185O728Q555r673P557J9498J6489J6317j713j1130j4784P498l24
7976g94532p076j1260J153L4851Q360k1718p5458m4904m256O599J4719J9720J1303
7963h62499K079Q235r620j1786j6621n716m715L3387J6766J344Q059L368l447
7950h41166j6283q006p902P565L6935L0116k4509k9348K853j0890m740N926j0572
7937h70021K2288K4314K7721J2759M550k2675l3621j743r822l462P641j2040P596
7924h46515K7287l4885k8811M469K2340L1344k0408l5830r987R994J9155J7457
7912h44390j8313j1423N392j8930p573K6178J2463K430P619j139j0678k100o111
7899h66575L20n492O810Q400j074n737j4146j6142K2730K0060r125l5678J0651
$$ plain form
7989 -841735 -839550 -832822 -824267 -833940 -826383 -806885 -790396 -774079 -775792 -786922 -801706 -794208 -794532
7976 -794532 -801608 -812868 -811715 -776864 -768504 -790222 -865680 -910584 -914840 -908241 -893522 -873802 -862499
7963 -862499 -860420 -852185 -861805 -873591 -890212 -895928 -900643 -867256 -850490 -849146 -841087 -837719 -841166
7950 -841166 -857449 -865455 -873357 -865792 -828857 -798741 -823250 -852598 -849745 -860635 -865375 -859449 -870021
7937 -870021 -847733 -823419 -795698 -782939 -778389 -801064 -834685 -836428 -846250 -849712 -842071 -854111 -846515
7924 -846515 -819228 -854113 -882924 -878455 -856115 -824771 -845179 -881009 -890996 -881002 -861847 -844390
7912 -844390 -862703 -874126 -868734 -887664 -895237 -869059 -856596 -854166 -846547 -847686 -858364 -860464 -866575
7899 -866575 -866255 -871747 -864937 -856537 -857611 -863348 -877494 -893636 -870906 -850846 -859971 -895649 -884998
7886h84998J4643r853P60m680K6637J8994k0211k7959k7379Q56J3197K6367J4418
7873h59208N038K0482J4803p558J5248J9667R403q998j8507k6738j3578J4379
7861h35567K6750K329j7974j9972j5035J562J7925n173N649J2432L3202K5976
7849g67896j5631k8039k7765j608j9061J0533J9221j0338K1592O676j6080k8015
7837h56411q239J2800L1663O921j0526m761j4333J8511J2050j5192k0722K1109
7825h27130P748k7593N238l389K328J184k6981J7417K3327j4517r965J393J712
7812h49228N638N502k0090q887K9821o416j8687J1604J2597M811k1627l513p957
7799h66432j8131n925J9785n787L669K113o398j3675L3058K3703M802J378n027
$$ plain form
7886 -884998 -870355 -880208 -879448 -884128 -857491 -838497 -858708 -886667 -914046 -913190 -899993 -873626 -859208
7873 -859208 -854170 -833688 -818885 -826443 -811195 -791528 -782125 -791123 -809630 -836368 -849946 -835567
7861 -835567 -808817 -806488 -824462 -844434 -859469 -857907 -839982 -845155 -839506 -827074 -793872 -767896
7849 -767896 -783527 -811566 -839331 -840939 -860000 -849467 -830246 -840584 -818992 -812316 -828396 -856411
7837 -856411 -864650 -851850 -820187 -813266 -823792 -828553 -842886 -824375 -812325 -827517 -848239 -827130
7825 -827130 -819382 -846975 -841737 -845126 -842798 -841614 -868595 -851178 -827851 -842368 -852333 -850940 -849228
7812 -849228 -843590 -838088 -858178 -867065 -837244 -843660 -862347 -850743 -838146 -833335 -854962 -858475 -866432
7799 -866432 -884563 -890488 -870703 -876490 -872821 -870708 -877106 -890781 -857723 -834020 -829218 -827840 -832867
7786h32867N025j3718l04J8814J0003l8184j7815K0216K4812j375j403O31m609
7773h30774Q443K3782m917j2931K0073r58o146j497R146J1696m511l2606j9050
7760h40250Q489j272j0079K922o529m032l340J0059J3655J2429J1977j0435o75
7747h17081j0577K921J1252Q767k7678P801K8537m531p592K3935M563Q851N125
7734g65707j3221k3085O221j0448J0047n772j4602k7743N838J6023q18l852k230
7721h29349K1333O411l310l790m5224j0597J1021K7110K4605j6705j6438K312
7709h32621l0366k082K770J0609J2545J6201m029J5044P039k3608P803J5373q92
7696h06214o567m394R298R869j0481m99J5154K4141l86j6575L238k0588O320k284
$$ plain form
7786 -832867 -827842 -841560 -841864 -823050 -813047 -851231 -869046 -848830 -824018 -825393 -826796 -826165 -830774
7773 -830774 -822331 -798549 -803466 -816397 -796324 -797282 -803428 -804925 -795779 -784083 -788594 -821200 -840250
7760 -840250 -831761 -833033 -843112 -840190 -846719 -850751 -854091 -844032 -830377 -817948 -805971 -816406 -817081
7747 -817081 -827658 -824737 -813485 -804718 -832396 -824595 -796058 -800589 -808181 -784246 -779683 -770832 -765707
7734 -765707 -778928 -802013 -795792 -806240 -796193 -801965 -816567 -844310 -838472 -822449 -823267 -827119 -829349
7721 -829349 -808016 -801605 -804915 -808705 -853929 -864526 -853505 -826395 -801790 -818495 -834933 -832621
7709 -832621 -862987 -865069 -862299 -851690 -839145 -822944 -826973 -811929 -804890 -828498 -820695 -805322 -806214
7696 -806214 -812781 -817175 -807877 -798008 -808489 -808988 -793834 -769693 -770079 -786654 -783416 -804004 -797684 -799968
7682g99968k85J198M544O03q702J496j2322j6073j0903K6510J4080L551q082Q379
7668g95974J6234Q544n06k6866J0592L498j7477k7437K3120K8742j0077j1964
7656g99571J1077J4985J0793j4970J5766j9743J054q88m082K2261j4493j3912
7644g91723m733P615K813r70j813j2919l654q012m619o65j1364L49J4913j0838
7630h25620Q02j8881K0485L7188q315k1745K9806L6237J1197l0677k5458M175
7618g90806J8977m912M59P097J1566K083k4831k352M469j2298o671k2546P092
7605h12673K9084J4808J0249P9J0149j2235j9994j2211o516o9r553l167O187j538
7591h07400P677J2812K436M498J2736P246l430q753j625k175j4789j3621J9828
$$ plain form
7682 -799968 -800253 -799055 -794511 -793908 -802610 -801114 -813436 -829509 -840412 -813902 -799822 -796271 -804353 -795974
7668 -795974 -779740 -771196 -771702 -798568 -787976 -784478 -801955 -829392 -806272 -777530 -787607 -799571
7656 -799571 -788494 -773509 -762716 -777686 -761920 -781663 -780609 -781497 -785579 -763318 -777811 -791723
7644 -791723 -796456 -788841 -786028 -786998 -788811 -801730 -805384 -813396 -818015 -818680 -830044 -829695 -814782 -825620
7630 -825620 -824818 -843699 -823214 -786026 -794341 -816086 -786280 -750043 -738846 -769523 -794981 -790806
7618 -790806 -771829 -776741 -776282 -769185 -757619 -755536 -780367 -782719 -778250 -790548 -797219 -819765 -812673
7605 -812673 -783589 -768781 -758532 -758453 -748304 -760539 -780533 -792744 -799260 -799329 -808882 -812049 -805862 -807400
7591 -807400 -799723 -786911 -784475 -779977 -767241 -759995 -763425 -772178 -773803 -775978 -790767 -804388 -784560
7578g84560J1176J3680k6030r199J5949J6316r7o454J4201j6845j7967l958J595
7565g92193n307k3852O610j0472J3217N182j3320J061K1370J0680K8416J5667
7553g42941K1072j0848k8253p407M600j3078o358m481J2266K996n086J6590L351
7540g57577k6124k2184L2752L222k1993l045r14k0609N208L2414J7313o913k397
7527g70847J9373J6931k0570p409J2820K796q786L177R489J0090j3890k3440J6647
7514g53619J2519k2416N153j626K5349j2700l583j6246j4712k4866q009J7312
7502g97444R603j260K2390K002o579j8338j874K3052J898l400Q824m148J8834
7489g46440J2319k718j2385k2547k9762n61j1779r14L2792j0895L287P636m881
$$ plain form
7578 -784560 -773384 -759704 -785734 -794933 -778984 -762668 -762765 -769219 -755018 -771863 -789830 -793788 -792193
7565 -792193 -797500 -821352 -814742 -825214 -811997 -806815 -820135 -819074 -797704 -787024 -758608 -742941
7553 -742941 -721869 -732717 -760970 -768377 -763777 -776855 -783213 -787694 -775428 -772432 -777518 -760928 -757577
7540 -757577 -783701 -805885 -773133 -769911 -791904 -794949 -795863 -816472 -811264 -778850 -761537 -768450 -770847
7527 -770847 -751474 -734543 -755113 -762522 -749702 -746906 -755692 -752515 -743026 -732936 -746826 -770266 -753619
7514 -753619 -741100 -763516 -758363 -759989 -734640 -747340 -750923 -767169 -781881 -806747 -814756 -797444
7502 -797444 -787841 -789101 -766711 -764709 -771288 -789626 -791500 -768448 -766550 -769950 -761126 -765274 -746440
7489 -746440 -734121 -736839 -749224 -771771 -801533 -802094 -813873 -814787 -781995 -792890 -789603 -781967 -786848
7476g86848K203Q084N466K0967J3106j1751Q296M224m583J045j6296J7647k0270
7463g58710j2637j460l388M708R808M0968J0648k5133q35J8791j3550l0996J3002
7450g48784K7221m7040k5346K5033J7812n333j1935n702R463J4679J6772k7486
7438g60646l2189M202M382J8290j3482o098M876O612r986J1334K7139O717P404
7425g31445j5372K559m613l432k4478l550m401R507O377J6137J441J2887j1999
7412g50382n023O355K897o635j3269o433k638L1717J2267J0024L007j954l5180
7399g55247l1462M763K3949J1952q686M55R12j9954L061j121K1096J0190l672
7386g43764j9070k4311L2346K7631m528l0372k6906Q4K0478J4231l357m006M774
$$ plain form
7476 -786848 -784645 -776561 -771095 -750128 -737022 -748773 -740477 -736253 -740836 -739791 -756087 -738440 -758710
7463 -758710 -771347 -772807 -776195 -771487 -761679 -720711 -710063 -735196 -736031 -717240 -730790 -761786 -748784
7450 -748784 -721563 -768603 -793949 -768916 -751104 -756437 -768372 -774074 -764611 -749932 -733160 -760646
7438 -760646 -792835 -788633 -784251 -765961 -779443 -785541 -780665 -774053 -784039 -772705 -745566 -738849 -731445
7425 -731445 -746817 -744258 -748871 -752303 -776781 -780331 -784732 -775225 -768848 -752711 -751270 -738383 -750382
7412 -750382 -755405 -749050 -746153 -752788 -766057 -772490 -775128 -743411 -731144 -721120 -718113 -720067 -755247
7399 -755247 -786709 -781946 -757997 -746045 -754731 -754276 -753364 -773318 -770257 -771378 -750282 -740092 -743764
7386 -743764 -762834 -787145 -754799 -727168 -731696 -762068 -788974 -788890 -768412 -754181 -757538 -761544 -756770
7373g56770o821r303o754K6538R974j9870q40J1141j798j6166L0878M781j56o243
7359g41409l4538O076R364M648o986J3322O127j2278l708N198J8460j0491j0369
7346g56584j597J435P651j1382J4454j1072J546K318m924l48k0705J6754m502
7333g66956l470O305j6559j0816M3L2834L6052j5723j0592K5364j2400r256N173
7320g40001J3767k2322q628j6851J0196N676K2483J1483l995j3914j1493L2352
7308g21247J3610J0763r217J5928l3399l0080k2825K3461P616N780k796n857r258
7295g57521K265j4701k4649P268R083J2383P252j0769M070L938J6292J7014J2709
7282g15366k6052j2711M092l588J218n84J2612j2939k1583J8995L4439J9243q508
$$ plain form
7373 -756770 -763591 -772894 -779648 -753110 -743136 -763006 -763846 -752705 -754503 -770669 -739791 -735010 -735166 -741409
7359 -741409 -775947 -769871 -760507 -755859 -762845 -749523 -743396 -755674 -759382 -754184 -735724 -746215 -756584
7346 -756584 -758181 -756746 -749095 -760477 -746023 -757095 -755549 -753231 -758155 -758503 -779208 -762454 -766956
7333 -766956 -770426 -764121 -780680 -791496 -791453 -758619 -722567 -738290 -748882 -723518 -735918 -745174 -740001
7320 -740001 -726234 -748556 -757184 -774035 -763839 -758163 -735680 -724197 -728192 -742106 -753599 -721247
7308 -721247 -707637 -696874 -706091 -690163 -723562 -753642 -776467 -753006 -745390 -739610 -742406 -748263 -757521
7295 -757521 -755256 -769957 -794606 -787338 -778255 -765872 -758620 -769389 -765319 -761381 -745089 -728075 -715366
7282 -715366 -741418 -754129 -750037 -753625 -752407 -752991 -740379 -753318 -774901 -755906 -721467 -702224 -710732
7269g10732l3502M6136K2554o253o585k5368p920j3699j2598l90K3376j3275j5602
7256g53858n904J4980K5273R642j1388k8594k4773p397l881j0728J4238L0123
7244g52267O092Q436j7071J278J6903L446k0930j5653J5000K0873Q302k6433j549
7231g53573J8771M254J4199j3866J465J1539K96l3754o320K6848r049j5321Q748
7218g45763K064k450m155N607J6154J0012j3690J0570J201J1729l4152m153J1125
7205g35901J4278l010l0708j5953J1424K5259p647j8794O775K4264n615k262J1661
7192g26229l7177j8801K2177K3141k206k516j506N969Q522j0913p768K668J3798
7179g30841R056k4299k5972k257J9226L081l302Q188j6881p138J1522J06M104
$$ plain form
7269 -710732 -744234 -698098 -675544 -681797 -688382 -713750 -721670 -735369 -747967 -748357 -724981 -738256 -753858
7256 -753858 -759762 -744782 -719509 -709867 -721255 -749849 -774622 -782019 -785900 -796628 -782390 -752267
7244 -752267 -746175 -737739 -754810 -753532 -736629 -733183 -754113 -769766 -754766 -733893 -725591 -752024 -753573
7231 -753573 -734802 -730548 -716349 -730215 -728750 -717211 -716915 -750669 -756989 -730141 -739190 -754511 -745763
7218 -745763 -743699 -746149 -750304 -744697 -728543 -718531 -732221 -721651 -720450 -708721 -742873 -747026 -735901
7205 -735901 -721623 -724633 -755341 -771294 -759870 -734611 -742258 -761052 -754277 -730013 -735628 -737890 -726229
7192 -726229 -763406 -782207 -760030 -736889 -739095 -741611 -743117 -737148 -728626 -739539 -747307 -744639 -730841
7179 -730841 -721785 -746084 -772056 -774313 -755087 -752006 -755308 -747120 -764001 -771139 -759617 -759511 -755407
7166g55407J1779M212L1416L654k8794K3094K2790j8984l5064J4319J6166P111
7154g03708j8367m4148j7997J1227K0999J8867N600R971j6226M201P962J333n429
7141g25715m910n676p681n663K8775j163J1404M843k4017L746J8393j221l425
7128g12310J6969r633N479k806k778J2521J233P507l5177l0891k2652J1062L3663
7115g27813O803k1076k964K0462k400j786p978P99Q740R019j5250j9640N15J6260
7101g36309J3106J5939k7437k372J1991j8599J8791K0405J1149K2052o262j3230
7089f90776j1868r636p656J2212J4474j1076k2003J5123P720K5k593r280R540
7076g05794k2718o073R076j5863R838j923J0426R505J8170k374J192j628j4139
$$ plain form
7166 -755407 -743628 -739416 -708000 -704346 -733140 -710046 -687256 -706240 -741304 -726985 -710819 -703708
7154 -703708 -722075 -766223 -784220 -772993 -751994 -733127 -727527 -717556 -733782 -729581 -721619 -720286 -725715
7141 -725715 -730625 -736301 -743982 -749645 -720870 -722033 -710629 -705786 -729803 -726057 -707664 -708885 -712310
7128 -712310 -695341 -704974 -699495 -702301 -705079 -692558 -691325 -683818 -718995 -749886 -772538 -761476 -727813
7115 -727813 -721010 -742086 -745050 -724588 -726988 -728774 -736752 -735953 -727213 -718194 -733444 -753084 -752569 -736309
7101 -736309 -723203 -707264 -734701 -737073 -725082 -743681 -724890 -704485 -693336 -671284 -677546 -690776
7089 -690776 -702644 -712280 -719936 -707724 -693250 -704326 -726329 -711206 -703486 -703461 -706054 -715334 -705794
7076 -705794 -728512 -734585 -725509 -741372 -731534 -733457 -723031 -713526 -695356 -697730 -696538 -698166 -712305
7063g12305q420o064k457J5310q424j2563J2670o381r242R142L800J9548k1456
7050g26842l2583N990R411j7615q341K4700M0331j466m2j5320j5413j7034K644
7037g51580J4350L35K279j9270n647K8452m977l365j2241j6784Q615K8369J6844
7024g14620j0629j5055J3402P312l58J9038J2848K016o252j5387o710q185O713
7011g15867k0269K0327J7315j2000Q535j0227P800J5594M889R71P319k1991j8956
6998g16560j1774R511m041l2069J3674k700J4110N455J549j0349q429j3590q213
6985g63426R505J3535J686K9551j6903l1850R645m685K2877J5135K5005j0763
6973g00688m375l4539J3160J1513J1217K4335J700J1143J4338k3840j8463n698
$$ plain form
7063 -712305 -720725 -726789 -729246 -713936 -722360 -734923 -722253 -728634 -737876 -728734 -724934 -705386 -726842
7050 -726842 -759425 -753435 -744024 -761639 -769980 -745280 -704949 -706415 -706457 -721777 -737190 -754224 -751580
7037 -751580 -737230 -736895 -734616 -753886 -759533 -731081 -736058 -739423 -751664 -768448 -759833 -731464 -714620
7024 -714620 -725249 -740304 -726902 -719590 -719948 -700910 -688062 -686046 -692298 -707685 -714395 -722580 -715867
7011 -715867 -736136 -715809 -698494 -710494 -701959 -712186 -704386 -688792 -683903 -682932 -675613 -697604 -716560
6998 -716560 -728334 -718823 -722864 -754933 -741259 -743959 -729849 -724394 -722845 -733194 -741623 -755213 -763426
6985 -763426 -753921 -740386 -738700 -709149 -726052 -757902 -748257 -752942 -730065 -714930 -689925 -700688
6973 -700688 -705063 -739602 -726442 -714929 -703712 -679377 -677677 -666534 -652196 -676036 -694499 -700197
6961g00197K1942J1692k4510k0755P786Q33J1062j6731k0205j7656R120J8312
6949g19307k271J030K5918j8008l705m381q456j4967K5437L1058M852k497k8997
6936g14294j9010Q27R014l784j1511k0231L0063K4684k636j277R692k6044k8201
6923g52708P971J0970j49J9729J5204q604j9980j977J5806p605k1341j8499Q810
6910g52373k4124N126L6607J3553n407m223N97J6589j5204o837L713R694j9550
6897g41839N391J7629J3182r47J5389O445j5141l4598J1235J4357j3652K933K8681
6884f90935L0916k1708k7575k2859q720m822l676J3311M765q905L8220O075J348
6871f94565J0895K980J2471L6556j8021j9876k7023R490r444L305m002k5845J4324
$$ plain form
6961 -700197 -678255 -666563 -691073 -711828 -704042 -703209 -692147 -708878 -729083 -746739 -737619 -719307
6949 -719307 -721578 -720548 -694630 -712638 -716343 -720724 -729180 -744147 -718710 -687652 -682800 -685297 -714294
6936 -714294 -733304 -732477 -723463 -727247 -738758 -758989 -728926 -704242 -706878 -708155 -698463 -724507 -752708
6923 -752708 -744737 -733767 -733916 -714187 -698983 -707587 -727567 -729544 -713738 -721343 -742684 -761183 -752373
6910 -752373 -776497 -771371 -734764 -721211 -726618 -730841 -730244 -713655 -728859 -735696 -731983 -722289 -741839
6897 -741839 -736448 -718819 -705637 -706584 -691195 -684750 -699891 -734489 -723254 -708897 -722549 -719616 -690935
6884 -690935 -660019 -681727 -709302 -732161 -740881 -745703 -749379 -736068 -731303 -740208 -701988 -695913 -694565
6871 -694565 -683670 -680690 -668219 -631663 -649684 -669560 -696583 -687093 -696537 -693232 -697234 -723079 -708755
6858g08755M1006K8148k3937o8105O98N0624j0439j0978q957k961j8376m589Q236
6845g28385J3021M070J6466K7964K4030L548r848m8443l1921p853J5502O116K3404
6832f92329J3704j8649n381J7601j362l097K4484J5435m434J679M47l4966m750
6819f91618q94j790K0308L0731J3439m615n916o474l820j1857k3266N829l3539
6806g13482n835J9981j2739O741N45l322l857J1607J352j335J008J4734o575j0402
$$ plain form
6858 -708755 -667749 -639601 -663538 -731643 -730945 -680321 -690760 -701738 -710695 -713656 -732032 -736621 -728385
6845 -728385 -715364 -711294 -694828 -666864 -642834 -639286 -649134 -697577 -729498 -737351 -721849 -715733 -692329
6832 -692329 -678625 -697274 -702655 -685054 -686416 -689513 -665029 -649594 -654028 -652349 -651902 -686868 -691618
6819 -691618 -692512 -694302 -673994 -643263 -629824 -634439 -640355 -646829 -650649 -662506 -685772 -679943 -713482
6806 -713482 -719317 -699336 -712075 -705334 -704789 -708111 -711968 -700361 -699009 -700344 -699336 -684602 -691177 -701579
$$ [...]
##END NTUPLES=NMR SPECTRUM
##END=
