##TITLE=Analysis number 312247
Compound Code rf 03693
Project Code adrs
Chemist Name hixia
##JCAMPDX= 6.0         $$ Bruker NMR JCAMP-DX V2.0
##DATA TYPE= NMR SPECTRUM
##DATA CLASS= NTUPLES
##ORIGIN= Bruker BioSpin GmbH
##OWNER= NMR
$$ XWIN-NMR		Version 3.5
$$ Fri Jul 29 11:25:48 2005 GMT Daylight Time (UT+1h)  MAYBRIDGE\NMR@NMR_250MHZ
##.OBSERVE FREQUENCY= 250.131544655141
##.OBSERVE NUCLEUS= ^1H
##.ACQUISITION MODE= SIMULTANEOUS (DQD)
##.ACQUISITION SCHEME= undefined
##.AVERAGES= 16
##.DIGITISER RES= 18
##SPECTROMETER/DATA SYSTEM= dpx250
##.PULSE SEQUENCE= zg30
##.SOLVENT NAME= DMSO
##.SHIFT REFERENCE= (INTERNAL, DMSO, 0, 16.522)
##AUDIT TRAIL= $$ (NUMBER, WHEN, WHO, WHERE, WHAT)
$$ ##TITLE= Audit trail, XWIN-NMR		Version 3.5
$$ ##JCAMPDX= 5.01
$$ ##ORIGIN= Bruker BioSpin GmbH
$$ ##OWNER= NMR
$$ C:\u/data/dgb/nmr/ADRS/6850/pdata/1/auditp.txt
$$ ##AUDIT TRAIL=  $$ (NUMBER, WHEN, WHO, WHERE, WHAT)
(   1,<2005-07-29 11:25:29.85 +100>,<MAYBRIDGE\NMR>,<NMR_250MHZ>,
      <created by zg, POWCHK disabled, PULCHK disabled
       configuration hash MD5:
       62 19 C7 07 E1 42 D1 B7 37 6C 3D D0 77 39 F9 E6
       data hash MD5: 64K
       95 14 E9 34 C1 60 43 C8 E5 69 30 5F E8 A3 86 4F>)
(   2,<2005-07-29 11:25:41.10 +100>,<MAYBRIDGE\NMR>,<NMR_250MHZ>,
      <Start of raw data processing
       ef LB = 0.3 FT_mod = 6 PKNL = 1 SI = 32K 
       data hash MD5: 32K
       C9 D1 D9 8D 72 5E 3A 6F A5 C4 3C EE 5A C5 64 53>)
(   3,<2005-07-29 11:25:42.84 +100>,<MAYBRIDGE\NMR>,<NMR_250MHZ>,
      <apk 
       data hash MD5: 32K
       9A C5 33 10 3F BB F3 B4 2E 5F FD E2 84 B9 56 C3>)
(   4,<2005-07-29 11:25:43.56 +100>,<MAYBRIDGE\NMR>,<NMR_250MHZ>,
      <abs ABSG = 5 
       data hash MD5: 32K
       43 04 4D 7B E9 05 94 6A 6F 83 6D D8 F5 29 12 09>)
$$ ##END=
$$ 
$$ hash MD5
$$ 40 BB 72 95 4F 32 DF A3 DF A7 06 F6 AA FE 23 8B
##$RELAX= 
##$RELAX= 
##$RELAX= 
##$RELAX= 
##$RELAX= 
##$RELAX= 
##$RELAX= 
$$ Bruker specific parameters
$$ --------------------------
##$DU= <C:\u>
##$EXPNO= 6850
##$NAME= <ADRS>
##$PROCNO= 1
##$TYPE= <nmr>
##$USER= <dgb>
##$AMP= (0..31)
100 100 100 100 100 100 100 100 100 100 100 100 100 100 100 100 100 100 
100 100 100 100 100 100 100 100 100 100 100 100 100 100 
##$AQSEQ= 0
##$AQ_mod= 3
##$AUNM= <au_zg>
##$AUTOPOS= <16 >
##$BF1= 250.13
##$BF2= 250.13
##$BF3= 250.13
##$BF4= 250.13
##$BF5= 500.13
##$BF6= 500.13
##$BF7= 500.13
##$BF8= 500.13
##$BYTORDA= 1
##$CFDGTYP= 0
##$CFRGTYP= 5
##$CHEMSTR= <none>
##$CNST= (0..31)
1 1 145 1 1 1 1 1 1 1 1 1 1 1 1 1 1 1 1 1 1 1 1 1 1 1 1 1 1 1 1 1 
##$CPDPRG= <>
##$CPDPRG1= <>
##$CPDPRG2= <>
##$CPDPRG3= <>
##$CPDPRG4= <mlev>
##$CPDPRG5= <mlev>
##$CPDPRG6= <mlev>
##$CPDPRG7= <mlev>
##$CPDPRG8= <mlev>
##$CPDPRGB= <>
##$CPDPRGT= <>
##$D= (0..31)
0 1 0 0 0 0 0 0 0 0.06 0 0 0 0 0 0 0.0002 0 0 0 0 0 0 0 0 0 0 0 0 0 0 
0 
##$DATE= 1122632728
##$DBL= (0..7)
120 120 120 120 120 120 120 120 
##$DBP= (0..7)
150 150 150 150 150 150 150 150 
##$DBP07= 0
##$DBPNAM0= <>
##$DBPNAM1= <>
##$DBPNAM2= <>
##$DBPNAM3= <>
$$ [...]
##$SUBNAM7= <"">
##$SUBNAM8= <"">
##$SUBNAM9= <"">
##$SW= 20.6930455092707
##$SWIBOX= (0..15)
0 0 3 0 0 0 0 0 0 0 0 0 0 0 0 0 
##$SW_h= 5175.983436853
##$TD= 65536
##$TD0= 1
##$TE= 295.16
##$TE2= 300
##$TE3= 300
##$TEG= 300
##$TL= (0..7)
0 120 120 120 120 120 120 120 
##$TP= (0..7)
150 150 150 150 150 150 150 150 
##$TP07= 0
##$TPNAME0= <>
##$TPNAME1= <>
##$TPNAME2= <>
##$TPNAME3= <>
##$TPNAME4= <>
##$TPNAME5= <>
##$TPNAME6= <>
##$TPNAME7= <>
##$TPOAL= (0..7)
0.5 0.5 0.5 0.5 0.5 0.5 0.5 0.5 
##$TPOFFS= (0..7)
0 0 0 0 0 0 0 0 
##$TUNHIN= 0
##$TUNHOUT= 0
##$TUNXOUT= 0
##$USERA1= <user>
##$USERA2= <user>
##$USERA3= <user>
##$USERA4= <user>
##$USERA5= <user>
##$V9= 5
##$VALIST= <valist>
##$VCLIST= <CCCCCCCCCCCCCCC>
##$VD= 0
##$VDLIST= <DDDDDDDDDDDDDDD>
##$VPLIST= <PPPPPPPPPPPPPPP>
##$VTLIST= <TTTTTTTTTTTTTTT>
##$WBST= 1024
##$WBSW= 4
##$XGAIN= (0..3)
0 0 0 0 
##$XL= 0
##$YL= 0
##$YMAX_a= 236418
##$YMIN_a= -307962
##$ZGOPTNS= <>
##$ZL1= 120
##$ZL2= 120
##$ZL3= 120
##$ZL4= 120
##$ABSF1= 16.522
##$ABSF2= -4.171173
##$ABSG= 5
##$ABSL= 3
##$ALPHA= 0
##$AQORDER= 0
##$ASSFAC= 0
##$ASSFACI= 0
##$ASSFACX= 0
##$ASSWID= 0
##$AUNMP= <proc_1d>
##$AZFE= 0.1
##$AZFW= 0.1
##$BCFW= 0
##$BC_mod= 0
##$BYTORDP= 0
##$COROFFS= 0
##$CY= 12.5
##$DATMOD= 1
##$DC= 0
##$DFILT= <>
##$DTYPP= 0
##$F1P= 14.0000005364418
##$F2P= -0.99999901652339
##$FCOR= 0.5
##$FTSIZE= 32768
##$FT_mod= 6
##$GAMMA= 0
##$GB= 0
##$INTBC= 1
##$INTSCL= 1
##$ISEN= 128
##$LB= 0.3
##$LEV0= 0
##$LPBIN= 0
##$MAXI= 10000
##$MC2= 0
##$MEAN= 0
##$ME_mod= 0
##$MI= 0
##$NCOEF= 0
##$NC_proc= -3
##$NLEV= 6
##$NOISF1= 0
##$NOISF2= 0
##$NSP= 0
##$NTH_PI= 0
##$NZP= 0
##$OFFSET= 16.522
##$PC= 1
##$PHC0= -83.31127
##$PHC1= 4.875837
##$PH_mod= 1
##$PKNL= yes
##$PPARMOD= 0
##$PSCAL= 4
##$PSIGN= 0
##$REVERSE= no
##$SF= 250.13
##$SI= 32768
##$SIGF1= 0
##$SIGF2= 0
##$SINO= 400
##$SIOLD= 32768
##$SREGLST= <1H.DMSO>
##$SSB= 0
##$STSI= 32768
##$STSR= 0
##$SW_p= 5175.98343685301
##$SYMM= 0
##$S_DEV= 0
##$TDeff= 65536
##$TDoff= 0
##$TI= <Analysis number 999999
Compound Code 99
Book Reference 9
Project Code 9>
##$TILT= no
##$TM1= 0
##$TM2= 0
##$TOPLEV= 0
##$USERP1= <user>
##$USERP2= <user>
##$USERP3= <user>
##$USERP4= <user>
##$USERP5= <user>
##$WDW= 1
##$XDIM= 32768
##$YMAX_p= 289777218
##$YMIN_p= -246912
$$ End of Bruker specific parameters
$$ ---------------------------------
##NTUPLES= NMR SPECTRUM
##VAR_NAME=  FREQUENCY,     SPECTRUM/REAL,   SPECTRUM/IMAG
##SYMBOL=    X,             R,               I
##VAR_TYPE=  INDEPENDENT,   DEPENDENT,       DEPENDENT
##VAR_FORM=  AFFN,          ASDF,            ASDF
##VAR_DIM=   32768,         32768,           32768
##UNITS=     HZ,            ARBITRARY UNITS, ARBITRARY UNITS
##FACTOR=    0.157963299565203, 1,           1
##FIRST=     4132.6476996994, 0,             0
##LAST=      -1043.33573715361, 0,           0
##MIN=       -1043.33573715361, -246912,     0
##MAX=       4132.6476996994, 289777218,     0
$$ Real data points
##PAGE= N=1
##DATA TABLE= (X++(R..R)), XYDATA
$$ [...]
$$ plain form
18570 -87691 -84874 -61980 -4021 16380 30688 32960 7500 20283 841 -15760 16938 64710
18558 64710 74906 60931 42704 88321 111531 178082 234341 270032 313327 307176 310717 329852
18546 329852 390552 404247 412569 352373 313017 250739 159259 157807 127014 126303 88465 39232
18534 39232 -38622 -66391 -67360 -39954 41967 73963 56883 14092 63711 101177 128762 117374
18522 117374 88220 40894 2663 47264 46306 36564 26300 -1458 -47062 -42258 -22066 -568
18510 -568 -50439 -87384 -81420 -59826 -40276 -14660 -15318 -63422 -44876 10946 -20511 9201 36261
18497 36261 -5144 -62755 -32221 -5634 -17536 -54665 -58849 -12662 30726 29706 30303 38312 -7261
18484 -7261 -30723 -11322 4138 62613 -4201 -26952 43857 64574 67282 106928 100287 114240
$$ packed form
18570h7691K817K2894N7959K0401J4308K272k5460J2783j9442j6601L2698M7772
18558F4710J0196j3975j8227M5617K3210O6551N6259L5691M3295o151L541J9135
18546C29852O0700J3695Q322o0196l9356o2278r1480j452l0793p11l7838m9233
18534C9232p7854k7769r69K7406Q1921L1996j7080m2791M9619L7466K7585j1388
18522A17374k9154m7326l8231M4601r58r742j0264k7758m5604M804K0192K1498
18510e68m9871l6945N964K1594J9550K5616o58m8104J8546N5822l1457K9712K7060
18497C6261m1405n7611L0534K6587j1902l7129m184M6187M3388j020N97Q009m5573
18484g261k3462J9401J5460N8475o6814k2751P0809K0717K708L9646o641J3953
$$ plain form
18472 114240 128706 110770 59021 91175 142557 174804 209266 164781 111286 117582 110732 111547
18460 111547 48820 24100 6193 3109 -7516 42347 40836 48171 53998 34429 -7772 -11197
18448 -11197 131 -10065 9923 -1183 41486 34333 -53918 -78163 -37570 -44824 -50816 33272
18436 33272 25243 -34482 -77150 -47095 -44348 -9791 34959 -16832 -23692 -25299 -45882 -73747
18424 -73747 32764 120749 98957 116872 105084 119506 120016 108876 68637 26481 -9476 -30295
18412 -30295 16306 108496 78746 54252 43948 18099 33669 -5635 13158 69894 88298 143720
18400 143720 120848 98719 100645 74188 65245 20705 72742 102657 81613 68620 97108 137515
18388 137515 146617 196347 241338 248797 277354 293659 302269 347477 380912 413933 478675 512859
$$ packed form
18472A14240J4466j7936n1749L2154N1382L2247L4462m4485n3495O296o850Q15
18460A11547o2727k4720j7907l084j0625M9863j511P335N827j9569m2201l425
18448a1197J1328j0196J9988j1106M2669p153q8251k4245M0593p254n992Q4088
18436C3272q029n9725m2668L0055K747L4557M4750n1791o860j607k0583k7865
18424g3747J06511Q7985k1792J7915j1788J4422N10j1140m0239m2156l5957k0819
18412c0295M6601R2190k9750k4494j0304k5849J5570l9304J8793N6736J8404N5422
18400A43720k2872k2129J926k6457q943m4540N2037K9915k1044j2993K8488M0407
18388A37515R102M9730M4991P459K8557J6305Q610M5208L3435L3021O4742L4184
$$ plain form
18376 512859 497684 503198 613236 662131 762309 897215 1018620 1153545 1285088 1446961
18366 1446961 1578564 1850374 2112919 2469811 2864699 3340193 3884123 4511751 5441739
18357 5441739 6834889 8931160 12098621 17236066 25543590 38213305 53971320 65864247
18349 65864247 68639290 66615798 64448504 65594603 71037211 77656020 77500869 69539649
18341 69539649 58394201 46902410 36375609 27262066 20438565 15671706 12324536 9946990
18333 9946990 8206777 6832593 5765296 4899709 4197952 3682153 3272465 2908662 2555930
18324 2555930 2268273 1979650 1731393 1506847 1349762 1282109 1205894 1097286 1017818 961492
18314 961492 834722 786163 785604 753019 684291 591337 560364 557642 607216 597809 564592 485721
$$ packed form
18376E12859j5175N514J10038M8895J00178J34906J21405J34925J31543J61873
18366A446961J31603K71810K62545L56892L94888M75494N43930O27628R29988
18357E441739J393150K096271L167461N137445Q307524J2669715J5758015J1892927
18349F5864247K775043k023492k167294J146099N442608O618809j55151p961220
18341F9539649j1145448j1491791j0526801r113543o823501m766859l347170k377546
18333I946990j740213j374184j067297q65587p01757n15799m09688l63803l52732
18324B555930k87657k88623k48257k24546j57085o7653p6215j08608p9468n6326
18314I61492j26770m8559n59l2585o8728r2954l0973k722M9574r407l3217p8871
$$ plain form
18302 485721 455986 427532 417267 368193 346271 387602 383087 410801 377369 294334 262210 274127
18290 274127 273075 266505 278517 273396 231394 240345 301609 331239 305287 282509 260924 240966
18278 240966 229211 223494 223985 197618 140450 98393 129684 194492 207063 137778 168055 177270
18266 177270 155485 85217 57460 126415 172110 116514 122286 91872 74254 70935 108571 144293
18254 144293 146074 132489 110816 108438 102042 111429 136134 176341 195746 214826 223958 231908 232567
18241 232567 196846 160250 145096 183852 145105 133660 141813 114888 181842 232776 211584 156647
18229 156647 125408 145935 157116 206001 193864 144128 109460 49255 9416 39903 43757 39419
18217 39419 66415 54839 25149 91200 100270 75836 79117 62695 21867 43857 77737 67313
$$ packed form
18302D85721k9735k8454j0265m9074k1922M1331m515K7714l3432q3035l2124J1917
18290B74127j052o570J2012n121m2002Q951O1264K9630k5952k2778k1585j9958
18278B40966j1755n717M91k6367n7168m2057L1291O4808J2571o9285L0277R215
18266A77270k1785p0268k7757O8955M5695n5596N772l0414j7618l319L7636L5722
18254A44293J781j3585k1673k378o396R387K4705M0207J9405J9080R132P950O59
18241B32567l5721l6596j5154L8756l8747j1445Q153k6925O6954N0934k1192n4937
18229A56647l1239K0527J1181M8885j2137m9736l4668o0205l9839L0487L854m338
18217C9419K6996j1576k9690O6051R070k4434L281j6422m0828K1990L3880j0424
$$ plain form
18205 67313 97552 136899 126624 109105 63256 65860 66811 48816 19799 36072 16957 3055
18193 3055 7055 -31361 35088 76947 69091 82283 38651 29073 74089 62829 51846 113940
18181 113940 76758 39327 -10353 8858 3963 -49968 -6060 67808 26326 -11972 43699 55023
18169 55023 91199 69368 37926 4335 -1993 -34137 -83627 -50530 -12017 -43420 -76949 -55574
18157 -55574 -88115 -69737 -42562 -40873 -22672 -3687 1972 22093 10775 2200 34338 36507
18145 36507 26460 39791 43706 68694 119046 180363 265107 243097 200970 206454 216873 230974
18133 230974 286813 239398 230807 240402 145536 150846 177042 199379 196124 137804 111490 69994
18121 69994 82955 137424 140755 119174 121582 125665 123818 154023 181208 172881 167491 184589 192280
$$ packed form
18205F7313L0239L9347j0275j7519m5849K604R51j7995k9017J6273j9115j3902
18193C055M000l8416O6449M1859p856J3192m3632r578M5016j1260j0983O2094
18181A13940l7182l7431m9680J9211m895n3931M3908P3868m1482l8298N5671J1324
18169E5023L6176k1831l1442l3591o328l2144m9490L3097L8513l1403l3529K1375
18157e5574l2541J8378K7175J689J8201J8985N659K0121j1318q575L2138K169
18145C6507j0047J3331L915K4988N0352O1317Q4744k2010m2127N484J0419J4101
18133B30974N5839m7415q591R595r4866N310K6196K2337l255n8320k6314m1496
18121F9994J2961N4469L331k1581K408M083j847L0205K7185q327n390J7098P691
$$ plain form
18108 192280 163964 123887 83710 84045 56792 61716 40686 50349 33165 65061 105250 114435
18096 114435 41225 15298 73556 81947 51793 15621 9979 68879 38948 3074 39944 48398
18084 48398 -13493 -837 26741 57651 101723 101074 42298 32910 -16506 -33182 -18404 -3186
18072 -3186 98398 134555 107092 85168 59324 8698 41103 47722 95609 143745 145074 151835
18060 151835 156843 74419 29521 69943 124130 162229 178612 259584 291852 312673 261709 228872
18048 228872 280832 324277 319711 307090 349297 410190 402963 435759 477249 445917 502885 566118
18036 566118 601509 678335 808099 954019 1122401 1294717 1464658 1657732 1881560 2136394
18026 2136394 2445931 2776009 3139307 3563712 4106597 4825355 5835045 7321744 9616516
$$ packed form
18108A92280k8316m0077m0177L35k7253M924k1030R663j7184L1896M0189R185
18096A14435p3210k5927N8258Q391l0154l6172n642N8900k9931l5874L6870Q454
18084D8398o1891J2656K7578L0910M4072o49n8776r388m9416j6676J4778J5218
18072c186J01584L6157k7463k1924k5844n0626L2405O619M7887M8136J329O761
18060A51835N008q2424m4898M0422N4187L8099J6383Q0972L2268K0821n0964l2837
18048B28872N1960M3445m566j2621M2207O0893p227L2796M1490l1332N6968O3233
18036E66118L5391P6826J29764J45920J68382J72316J69941J93074K23828K54834
18026B136394L09537L30078L63298M24405N42885P18758J009690J486699K294772
$$ plain form
18017 9616516 13151347 18772816 27692254 41132705 57275964 68521834 70282065 67600731
18009 67600731 65101482 65952144 70849991 76439961 75043919 66642803 55633509 44566406
18001 44566406 34449039 25818065 19459096 14994610 11799314 9522329 7836105 6596902
17993 6596902 5676935 4881145 4236082 3681274 3250204 2875026 2573932 2312175 2064476
17984 2064476 1816463 1578146 1389487 1216508 1083311 1026712 987779 919348 880285 845888
17974 845888 772372 708915 716206 653189 599981 524269 476382 487900 457923 408626 397697 357510
17962 357510 318913 351539 337841 345872 331145 366348 407626 381675 377020 361247 368891 406681
17950 406681 364849 309460 286601 275664 255906 282459 309808 326220 335023 311540 296418 296977
$$ packed form
18017I616516L534831N621469Q919438J3440451J6143259J1245870J760231k681334
18009F7600731k499249Q50662M897847N589970j396042q401116j1009294j1067103
18001D4566406j0117367q630974o358969m464486l195296k276985j686224j239203
17993F596902r19967p95790o45063n54808m31070l75178l01094k61757k47699
17984B064476k48013k38317j88659j72979j33197n6599l8933o8431l9063l4397
17974H45888p3516o3457P291o3017n3208p5712m7887J1518k9977m9297j0929m0187
17962C57510l8597L2626j3698Q031j4727L5203M1278k5951m655j5773P644L7790
17950D06681m1832n5389k2859j0937j9758K6553K7349J6412Q803k3483j5122N59
$$ plain form
17938 296977 276924 267806 228427 158793 149168 187002 243816 253402 236987 226201 178209 168252
17926 168252 168349 182706 206739 233305 196986 153605 123669 65701 74868 77467 88335 72997
17914 72997 74211 68512 89381 111169 112747 134695 159055 145509 108070 103142 125290 113746
17902 113746 133496 182842 187769 173929 168360 210183 228388 235249 190119 150313 112638 175526
17890 175526 202724 140923 104553 97796 90813 78409 71620 36798 -20413 -55827 8898 35365
17878 35365 -7509 15670 9682 30012 84606 119259 133394 116716 56658 -8885 -17027 -8375
17866 -8375 49054 82424 60620 76826 157388 193681 155568 161759 112771 51846 19012 27226
17854 27226 55723 31129 14610 13255 20943 79295 129988 162048 95809 -5391 14995 31589
$$ packed form
17938B96977k0053r118l9379o9634r625L7834N6814R586j6415j0786m7992r957
17926A68252R7J4357K4033K6566l6319m3381k9936n7968R167K599J0868j5338
17914G2997J214n699K0869K1788J578K1948K4360j3546l7439m928K2148j1544
17902A13746J9750M9346M927j3840n569M1823J8205O861m5130l9806l7675O2888
17890A75526K7198o1801l6370o757o983j2404o789l4822n7211l5414O4725K6467
17878C5365m2874K3179n988K0330N4594L4653J4135j6678o0058o5543q142Q652
17866h375N7429L3370k1804J6206Q0562L6293l8113O191m8988o0925l2834Q214
17854B7226K8497k4594j6519j355P688N8352N0693L2060o6239j01200K0386J6594
$$ plain form
17842 31589 14532 29492 52378 21285 5993 -21218 -42390 5600 63891 107608 109326 58802
17830 58802 31239 37254 38186 18845 55900 92717 53655 -20827 -41245 -23743 37689 61215
17818 61215 -2683 -43331 -72469 -49063 -31458 31110 84370 54620 23560 27079 62827 61588
17806 61588 84941 86832 53401 14286 24213 -1876 16087 34468 34578 61969 124565 187087
17794 187087 288351 319508 342766 361185 402701 434650 478883 443147 396099 351913 294298
17783 294298 300489 265827 257396 230046 149920 78785 111216 140160 133103 110199 35539 15042
17771 15042 30536 28170 -5550 -12878 5058 17646 44504 76930 24371 47807 92554 108027
17759 108027 90632 55950 476 -76575 -65908 -5471 15223 -7914 -24367 10756 -22724
$$ packed form
17842C1589j7057J4960K2886l1093j5292k7211k1172M7990N8291M3717J718n0524
17830E8802k7563O015R32j9341L7055L6817l9062p4482k0418J7502O1432K3526
17818F1215o3898m0648k9138K3406J7605O2568N3260k9750l1060L519L5748j239
17806F1588K3353J891l3431l9115R927k6089J7963J8381J10K7391O2596O2522
17794A87087J01264L1157K3258J8419M1516L1949M4233l5736m7048m4186n7615
17783B94298O191l4662q431k7350q0126p1135L2431K8944p057k2904p4660k0497
17771A5042J5494k366l3720p328J7936J2588K6858L2426n2559K3436M4747J5473
17759A08027j7395l4682n5474p7051J0667O0437K0694k3137j6453L5123l3480
$$ plain form
17748 -22724 -24779 43709 105132 59375 21057 88174 112462 133322 54879 -22100 -3406 42229
17736 42229 -6345 -26299 21591 -10141 -83037 -127966 -96409 -111328 -63589 10443 17077 31580
17724 31580 51637 100739 118657 107129 76586 56093 120339 187458 149394 58061 70853 117809
17712 117809 101005 82197 90544 43952 43010 -1122 14754 40519 26020 76011 77998 60758
17700 60758 16756 -1911 76227 66594 64973 78359 74104 56191 21281 -54668 -44916 -8752
17688 -8752 -49082 -79147 -59021 7752 7165 9398 29095 57768 46340 -6283 21011 43873
17676 43873 138507 105718 95260 188330 207817 127065 107509 148682 140675 120046 94389 76711
17664 76711 85094 60879 -2870 13932 -32262 -45190 7616 49391 43907 -3907 28707 26463
$$ packed form
17748b2724k055O8488O1423m5757l8318O7117K4288K0860p8443p6979J8694M5635
17736D2229m8574j9954M7890l1732p2896m4929L1557j4919M7739P4032O634J4503
17724C1580K0057M9102J7918j1528l0543k0493O4246O7119l8064r1333J2792M6956
17712A17809j6804j8808Q347m6592r42m4132J5876K5765j4499M9991J987j7240
17700F0758m4002j8667P8138r633j621J3386m255j7913l4910p5949R752L6164
17688h752m0330l0065K0126O6773n87K233J9697K8673j1428n2623K7294K2862
17676D3873R4634l2789j0458R3070J9487q0752j9556M1173q007k0629k5657j7678
17664G6711Q383k4215o3749J6802m6194j2928N2806M1775n484m7814L2614k244
$$ plain form
17652 26463 -19839 -57708 -48271 -6094 84599 103217 87152 105775 116376 113117 84100 84393
17640 84393 68572 31739 21913 18405 -9046 -13706 23293 39250 -5427 -36279 -81502 -89592
17628 -89592 -76245 -65783 -54162 -62775 -77934 -64319 -56959 -83061 -88431 -62516 -64869 -89740
17616 -89740 -122603 -82916 -78380 -34967 -6066 1298 4080 -16664 -639 -6047 35486 65713
17604 65713 76344 32539 67219 46545 -18309 -26431 -37223 -44035 -6433 -16332 -56684 -102328
17592 -102328 -90561 -46243 31533 2992 3244 -61201 -98193 -112834 -106545 -112657 -80084 -26368
17580 -26368 -14333 9333 44908 38392 21468 46386 36027 56701 28224 -2661 74529 142571
17568 142571 56995 -4900 -35648 -11769 -80324 -91525 -27239 -35133 -65719 -57624 -26508 -52428
$$ packed form
17652B6463m6302l7869R437M2177R0693J8618j6065J8623J0601l259k9017K93
17640H4393j5821l6833r826l508k7451m660L6999J5957m4677l0852m5223q090
17628h9592J3347J0462J1621q613j5159J3615P360k6102n370K5915k353k4871
17616h9740l2863L9687M536M3413K8901P364K782k0744J6025n408M1533L0227
17604F5713J0631m3805L4680k0674o4854q122j0792o812L7602r899m0352m5644
17592a02328J1767M4318P7776k8541K52o4445l6992j4641O289o112L2573N3716
17580b6368J2035K3666L5575o516j6924K4918j0359K0674k8477l0885P7190O8042
17568A42571q5576o1895l0748K3879o8555j1201O4286p894l0586Q095L1116k5920
$$ plain form
17556 -52428 -59448 -66966 -22351 -29850 -6628 7500 -19375 -36198 -21234 -4736 3967 11864 36673
17543 36673 60118 9813 -7143 -4910 -17684 -13201 7483 -27955 -31719 -32965 8997 52101
17531 52101 66165 14617 5173 21858 63832 84235 108320 115806 110114 90977 63178 73111
17519 73111 36328 71899 66468 33169 -18226 -2050 -25345 2199 945 35283 -3787 9504
17507 9504 5363 24756 47487 49289 15442 -25302 -214 50628 35465 19699 10508 -10011
17495 -10011 -49647 -87425 -22363 -31700 -67321 -51876 -20236 29425 39234 -7987 -27347 -1471
17483 -1471 -18788 -32304 -14615 19821 56616 14215 -21813 -3063 10165 84866 133733 110709
17471 110709 161394 185916 214846 287530 317573 308834 288449 296966 288708 319864 361355 351159
$$ packed form
17556e2428p020p518M4615p499K3222J4128k6875j6823J4964J6498Q703P897K4809
17543C6673K3445n0305j6956K233j2774M483K0684l5438l764j246M1962M3104
17531E2101J4064n1548r444J6685M1974K0403K4085P486n692j9137k7799R933
17519G3111l6783L5571n431l3299n1395J6176k3295K7544j254L4338l9070J3291
17507I504m141J9393K2731J802l3847m0744K5088N0842j5163j5766r191k0519
17495a0011l9636l7778O5062r337l5621J5445L1640M9661R809m7221j9360K5876
17483a471j7317j3516J7689L4436L6795m2401l6028J8750J3228P4701M8867k3024
17471A10709N0685K4522K8930P2684L0043q739k0385Q517q258L1156M1491j0196
$$ plain form
17459 351159 311823 277622 195468 149604 137302 118418 150696 116220 61225 76660 62728
17448 62728 33793 5360 37582 56706 77466 94138 88359 87359 47153 9037 -28313 -55772
17436 -55772 -4507 31759 45407 6181 9812 11249 5118 -1063 -26766 -3940 7862 -3007
17424 -3007 -4297 -38710 -80251 -98211 -106344 -20372 85842 137499 78177 -35347 -49774 -34499
17412 -34499 34845 38186 27272 66050 60949 55468 46424 29654 -4868 -15605 -16052 -5703 2037
17399 2037 36875 8736 -28910 -71877 -67674 -50815 26212 67222 32161 -55776 -82965 -57738
17387 -57738 -29100 -39557 -47267 -14868 20754 55057 57959 35852 77109 40653 63028 96135
17375 96135 65465 30347 41815 73665 52563 -15171 -44473 -95234 -49448 -4607 25216 -5753
$$ packed form
17459C51159l9336l4201q2154m5864j2302j8884L2278l4476n4995J5435j3932
17448F2728k8935k8433L2222J9124K0760J6672n779j000m0206l8116l7350k7459
17436e5772N1265L6266J3648l9226L631J437o131o181k5703K2826J1802j0869
17424c007j290l4413m1541j7960q133Q5972J06214N1657n9322j13524j4427J5275
17412c4499O9344L341j0914L8778n101n481r044j6770l4522j0737m47J0349P740
17399B037L4838k8139l7646m2967M203J6859P7027M1010l5061q7937k7189K5227
17387e7738K8638j0457p710L2399L5622L4303K902k2107M1257l6456K2375L3107
17375I6135l0670l5118J1468L1850k1102o7734k9302n0761M5786M4841K9823l0969
$$ plain form
17363 -5753 -69946 -55657 -28092 -26883 -47710 -5680 -10191 2218 -2991 37056 52205 69937
17351 69937 52884 12790 -278 -32347 -67374 -35539 -10337 -45540 -75031 -38653 -2917 -2182
17339 -2182 -63880 -77561 -17219 -43727 -52400 -54917 -18738 -2755 -46686 -64889 -33419 11150
17327 11150 28088 25779 -2601 90 6922 -21570 -43134 -32085 39858 139467 170904 190660
17315 190660 282110 423555 702076 1150806 1603991 1857068 1785685 1560829 1262429 1012426
17305 1012426 745671 523575 415222 340933 276290 261609 184897 101497 41716 10502 17471
17294 17471 -3969 -70448 -16289 83090 49587 15687 26558 -20777 -29924 -10492 9944 16076
17282 16076 23768 21133 -6714 -52417 -67926 11679 12567 -16202 25720 42321 50451 9798 10885
$$ packed form
17363e753o4193J4289K7565J209k0827M2030m511J2409n209M0047J5149J7732
17351F9937j7053m0094j3068l2069l5027L1835K5202l5203k9491L6378L5736P35
17339b182o1698j3681O0342k6508q673k517L6179J5983m3931j8203L1470M4569
17327A1150J6938k309k8380K691O832k8492k1564J1049P1943R9609L1437J9756
17315A90660R1450J41445K78521M48730M53185K53077p1383k24856k98400k50003
17305A012426k66755k22096j08353p4289o4643j4681p6712q3400n9781l1214O969
17294A7471k1440o6479N4159R9379l3503l3900J0871m7335r147J9432K0436O132
17282A6076P692k635k7847m5703j5509P9605Q88k8769M1922J6601Q130m0653J087
$$ plain form
17269 10885 -809 -60421 -119174 -63136 -21374 -18157 1064 -11214 -16493 -59361 -44489 -34311
17257 -34311 -16596 -35634 -2677 21909 7713 -19065 -62884 -104072 -57404 -51678 -22805 -16899
17245 -16899 -15023 -25154 -25437 -26141 -51139 -24893 25541 53876 50627 65997 14012 -37053 -14414
17232 -14414 25542 87461 54269 17447 43740 86750 90825 68224 14739 -33744 -37988 -15987
17220 -15987 24212 63975 46310 -3669 33625 40860 8569 -48682 -34765 -30550 -19508 22124
17208 22124 12507 1002 56370 89967 59925 -12341 -17789 -15268 26225 57030 53771 35994
17196 35994 -9010 -38517 55958 75027 95789 100301 93842 67364 19841 28648 22041 -381
17184 -381 21466 16406 2068 -3623 -1812 2510 22695 -3421 -17383 17161 -10591 -29413 -57027
$$ packed form
17269A0885j1694n9612n8753N6038M1762L217J9221j2278n279m2868J4872J0178
17257c4311J7715j9038L2957K4586j4196k6778m3819m1188M6668N726K8873N906
17245a6899J876j0131k83p04k4998K6246N0434K8335l249J5370n1985n1065K2639
17232a4414L9956O1919l3192l6822K6293M3010M075k2601n3485m8483m244K2001
17220a5987M0199L9763j7665m9979L7294P235l2291n7251J3917M215J1042M1632
17208B2124r617j1505N5368L3597l0042p2266n448K521M1493L0805l259j7777
17196C5994m5004k9507R4475J9069K0762M512o459k6478m7523Q807o607k2422
17184c81K1847n060j4338n691J811M322K0185k6116j3962L4544k7752j8822k7614
$$ plain form
17171 -57027 -59530 -67254 -74526 -114442 -85075 -25183 12168 20877 30894 61075 91289 31297
17159 31297 -18567 -1238 20501 15186 7393 20435 -5060 17441 46860 24550 -7531 -1076
17147 -1076 -8185 -28784 -11187 25010 1762 -47383 -82187 -92613 -33306 23347 -3414 -24376
17135 -24376 -37306 -15689 53934 32376 -11372 -50472 -21880 -14844 -51761 -96406 -65882 -37779
17123 -37779 19344 53581 -5699 -4209 14973 -13115 -92803 -108358 -58988 68207 85237 43292
17111 43292 -14784 -55167 -29470 -7609 8883 -4180 6320 33291 82029 -22036 -120509
17100 -120509 -114489 2142 44866 105046 90785 79007 64087 -9984 -51975 -10838 -11590 -7221
17088 -7221 9539 -28638 25170 30297 10675 26265 -4197 -25845 4882 -7079 -3152 -57684
$$ packed form
17171e7027k503p724p272l9916K9367N9892L7351Q709J0017L0181L0214n9992
17159C1297m9864J7329K1739n315p793J3042k5495K2501K9419k2310l2081O455
17147a076p109k0599J7597L6197k3248m9145l4804j0426N9307N6653k6761k0962
17135b4376j2930K1617O9623k1558m3748l9100K8592P036l6917m4645L0524K8103
17123c7779N7123L4237n9280J490J9182k8088p9688j5555M9370J27195J7030m1945
17111D3292n8076m0383K5697K1861J6492j3063J0500K6971M8738j04065r8473
17100a20509O020J16631M2724O0180j4261j1778j4920p4071m1991M1137p52M369
17088g221J6760l8177N3808N127j9622J5590l0462k1648L0727j1961L927n4532
$$ plain form
17076 -57684 -38274 -9351 -49858 -72659 -70044 -66872 -56286 -53944 -44665 -103682 -90058 -21797
17064 -21797 49294 148998 150319 94692 19291 7231 27698 117944 147394 89344 79173 67102
17052 67102 -13085 -42846 -43923 -84334 -89683 -53157 -30500 -12089 -13633 -32894 -113786 -106763
17040 -106763 -47090 -48734 -27311 5012 -32469 -29197 -34951 -20313 -14661 -21229 -16014 -10494 -16258
17027 -16258 -20147 -18850 6538 2287 25115 82007 101774 61701 -21991 -35169 -33071 -30068 26191
17014 26191 60572 50628 13479 -10049 -21369 -31137 -51505 -43116 -40170 -70572 -112187 -150767
17002 -150767 -141077 -77909 -19760 32013 41770 27322 -26764 -51365 -60571 -51778 16400 20759
16990 20759 14614 -6858 6000 26110 -17145 -10466 18057 29516 59207 101399 81126 58988
$$ packed form
17076e7684J9410K8923m0507k2801K615L172J0586K342R279n9017J3624O8261
17064b1797P1091R9704J321n5627p5401j2060K0467R0246K9450n8050j0171j2071
17052F7102q0187k9761j077m0411n349L6526K2657J8411j544j9261q0892P023
17040a06763N9673j644K1423L2323l7481L272n754J4638N652o568N215N520n764
17027a6258l889J297K5388m251K2828N6892J9767m0073q3692j3178K098L003N6259
17014B6191L4381r944l7149k3528j1320r768k0368Q389K946l0402m1615l8580
17002a50767R690O3168N8149N1773R757j4448n4086k4601r206Q793O8178M359
16990B0759o145k1472J2858K0110m3255O679K8523J1459K9691M2192k0273k2138
$$ plain form
16978 58988 1173 -54019 -39735 -33079 -36652 27484 77057 54847 23522 11205 30259 60108
16966 60108 68107 65647 88541 82208 47181 52495 13031 34928 36747 -40932 -96784 -124163 -103689
16953 -103689 -78452 -39992 14382 -19455 -2619 -6094 -14437 5036 13017 6471 45143 31231
16941 31231 37651 83966 145022 106537 72825 45840 74214 77953 74660 51621 -1060 18576
16929 18576 20072 35779 74288 68782 45129 27531 29403 6915 13678 39202 51406 93005
16917 93005 30343 -14545 -39183 -26110 11851 43940 5031 -18776 3449 55344 21963 -13899
16905 -13899 55724 79071 99357 38970 75071 63466 -5647 -10458 42983 85311 38061 -3328
16893 -3328 1839 -8122 50890 81481 21429 10714 -5326 3385 -49405 -108750 -51000 37268
$$ packed form
16978E8988n7815n5192J4284O656l573O4136M9573k2210l1325j2317J9054K9849
16966F0108P999k460K2894o333l5027N314l9464K1897J819p7679n5852k7379K0474
16953a03689K5237L8460N4374l3837J6836l475q343J9473P981o546L8672j3912
16941C1231O420M6315O1056l8485l3712k6985K8374L739l293k3039n2681J9636
16929A8576J496J5707L8509n506k3653j7598J872k2488O763K5524J2204M1599
16917I3005o2662m4888k4638J3073L7961L2089l8909k3807K2225N1895l3381l5862
16905a3899O9623K3347K0286o0387L6101j1605o9113m811N3441M2328m7250m1389
16893c328N167r961N9012L0591o0052j0715j6040Q711n2790n9345N7750Q8268
$$ plain form
16881 37268 25595 10248 -3710 1351 -56230 -37641 -51871 -10782 45428 23655 -20932 39528
16869 39528 42806 -5548 -1552 -22877 -41515 19458 27317 3888 -368 13862 -21636 -9488
16857 -9488 69083 56756 6608 -308 5423 16788 38639 9341 -9953 43750 26335 4246
16845 4246 3063 40764 61956 103182 77547 27964 -16169 -30173 -46922 -21421 -37276 -92135
16833 -92135 -101314 -103872 -47980 -16661 -39300 -29508 -28135 -32091 -27589 -30690 -37595 -40761 -48953 11361
16819 11361 15110 11339 -53037 -14662 41454 24996 -8843 4540 -48896 -30360 20659 -1683
16807 -1683 14075 41193 65333 8126 3284 40735 28189 44017 55997 40744 36676 -51965
16795 -51965 -51343 10030 -5304 -3611 5674 45980 92203 54593 39720 25187 -7273 14244
$$ packed form
16881C7268j1673j5347j3958N061n7581J8589j4230M1089N6210k1773m4587O0460
16869C9528L278m8354L996k1325j8638O0973P859k3429m256J4230l5498J2148
16857i488P8571j2327n0148o916N731J1365K1851k9298j9294N3703j7415k2089
16845D246j183L7701K1192M1226k5635m9583m4133j4004j6749K5501j5855n4859
16833i2135r179k558N5892L1319k2639R792J373l956M502l101o905l166q192O0314
16819A1361L749l771o4376L8375N6116j6458l3839J3383n3436J8536N1019k2342
16807a683J5758K7118K4140n7207m842L7451j2546J5828J1980j5253m068q8641
16795e1965O22O1373j5334J693R285M0306M6223l7610j4873j4533l2460K1517
$$ plain form
16783 14244 58314 87769 66147 55241 -2828 -20970 -29898 -43607 -14762 17257 11157 -25915
16771 -25915 -65392 -66347 -21946 31409 57096 32150 -20240 -43616 -76036 -70660 -56646 -28883
16759 -28883 -65062 -32322 52154 48902 -28108 -55123 -55392 -41277 -31747 -11005 -8308 -16018 -9673
16746 -9673 16249 -9378 27640 37521 51019 -18732 -34421 -32926 -1190 6195 -13225 5667
16734 5667 -5345 -5196 -21397 -55884 -32246 -5746 -20699 7774 31020 16221 27980 16776
16722 16776 63329 61846 15938 49555 54434 -34282 -68568 -50037 -82646 -59776 8313 27072
16710 27072 -48351 -20215 -11692 -40554 -78435 -98854 -93639 -53382 -66701 -36999 -2904 8402
16698 8402 32616 37876 -10391 27388 -17051 -36115 -8066 33634 -10625 -31941 -40081 -37535
$$ packed form
16783A4244M4070K9455k1622j0906n8069j8142q928j3709K8845L2019o100l7072
16771b5915l9477r55M4401N3355K5687k4946n2390k3376l2420N376J4014K7763
16759b8883l6179L2740Q4476l252p7010k7015k69J4115R530K0742K697p710O345
16746i673K5922k5627L7018R881J3498o9751j5689J495L1736P385j9420J8892
16734E667j1012J49j6201l4487K3638K6500j4953K8473K3246j4799J1759j1204
16722A6776M6553j483m5908L3617M879q8716l4286J8531l2609K2870O8089J8759
16710B7072p5423K8136Q523k8862l7881k0419N215M0257j3319K9702L4095J1306
16698H402K4214N260m8267L7779m4439j9064K8049M1700m4259k1316q140K546
$$ plain form
16686 -37535 -37514 1326 538 -20434 -8123 -38335 -59759 -16478 64066 92257 89248 3112 -64609
16673 -64609 -60718 -15968 -1792 -27430 -46757 -47063 -66969 -112420 -121912 -31137 14676 16829 28428
16660 28428 27832 11632 -17401 2124 47039 55177 15831 -64874 -64922 -28045 -9836 -40305 -77628
16647 -77628 -67589 -111758 -108907 -103785 -100195 -112188 -143024 -53894 21417 2850 -32223 -48857
16635 -48857 -50105 -3667 -14135 10968 -49736 -98537 -73055 -49465 -52067 -61123 -97847 -110480
16623 -110480 -36062 -34022 -22938 -2810 9949 28883 -22070 -2086 2985 -37111 -41126 24421
16611 24421 56579 -31716 -81813 -27301 -27998 -22475 -36508 -43114 25910 62059 28768 15635
16599 15635 40766 49022 7915 -35241 -47809 -55646 9112 19685 12750 36399 28567 23330 40814
$$ packed form
16686c7535K1L8840p88k0972J2311l0212k1424M3281Q0544K8191l009q6136o7721
16673f4609L891M4750J4176k5638j9327l06j9906m5451r492R0775M5813K153J1599
16660B8428n96j6200k9033J9525M4915Q138l9346q0705m8L6877J8209l0469l7323
16647g7628J0039m4169K851N122L590j1993l0836Q9130P5311j8567l5073j6634
16635d8857j248M6438j0468K5103o0704m8801K5482K3590k602r056l6724j2633
16623a10480P4418K040J1084K0128J2759J8934n0953J9984N071m0096m015O5547
16611B4421L2158q8295n0097N4512o97N523j4033o606O9024L6149l3291j3133
16599A5635K5131Q256m1107m3156j2568p837O4758J0573o935K3649p832n237J7484
$$ plain form
16586 40814 57549 56657 -2516 -10815 -31925 -40336 35376 49156 -6829 -24451 -8619 32581
16574 32581 3067 24062 87903 77659 33110 39780 26807 2832 8793 -10087 -52753 -115835
16562 -115835 -151894 -188673 -183451 -80918 -38091 -60083 -39463 -16366 -19026 -29044 -28446 -88097
16550 -88097 -73359 -57697 -67520 -86319 -61939 -8332 37015 63830 43850 17350 2438 -25673
16538 -25673 -33133 -16920 -36775 23124 -3406 -54068 -56251 -49306 -28978 -30223 -2485 26776
16526 26776 4653 -7621 -4290 -70687 -82240 -80870 -52337 -34045 -95289 -128168 -69987 4020
16514 4020 4814 -34376 -11235 -68297 -122280 -65056 -52033 -31345 -4504 -36269 -49639 -60000
16502 -60000 -62966 -139088 -193510 -152826 -97151 -26850 -9357 -48809 -26324 27754 11358 -23724
$$ packed form
16586D0814J6735q92n9173q299k1110q411P5712J3780n5985j7622J5832M1200
16574C2581k9514K0995O3841j0244m4549O670j2973k3975N961j8880m2666o3082
16562a15835l6059l6779N222J02533M2827k1992K0620K3097k660j0018N98n9651
16550h8097J4738J5662r823j8799K4380N3607M5347K6815j9980k6500j4912k8111
16538b5673p460J6213j9855N9899k6530n0662k183O945K0328j245K7738K9261
16526B6776k2123j2274L331o6397j1553J370K8533J8292o1244l2879N8181P4007
16514D020P94l9190K3141n7062n3983N7224J3023K0688K6841l1765j3370j0361
16502f0000k966p6122n4422M0684N5675P0301J7493l9452K2485N4078j6396l5082
$$ plain form
16490 -23724 -15606 -4779 19489 31965 6135 -30149 -96912 -91537 -11675 25360 4926 -41339
16478 -41339 -12137 23386 -12779 19528 39784 35001 27271 62704 116400 91034 -18057 -29675
16466 -29675 17151 213 9700 55570 31346 50482 25215 -9265 13636 21948 -9274 -64345
16454 -64345 -42521 11379 -511 -34048 -49333 -27484 -25229 -9444 41475 57281 44054 21585
16442 21585 -28803 -77571 -124669 -148049 -106879 -101133 -78919 -95510 -87917 -5472 -14979 -16622
16430 -16622 -14637 49436 38166 33751 -32340 -28620 -1184 8228 28995 48444 38553 26296 49988
16417 49988 60853 85121 88030 78516 19430 20479 -3497 -13648 -26870 -1776 -28959 -811
16405 -811 41753 45115 -29178 -15926 30255 54658 34941 -21280 -73556 -88053 -38719 -15546
$$ packed form
16490b3724Q118J0827K4268J2476k5830l6284o6763N375P9862L7035k0434m6265
16478d1339K9202L5523l6165L2307K0256m783p730L5433N3696k5366j09091j1618
16466b9675M6826j6938R487M5870k4224J9136k5267l4480K2901Q312l1222n5071
16454f4345K1824N3900j1890l3537j5285K1849K255J5785N0919J5806j3227k2469
16442B1585n0388m8768m7098k3380M1170N746K2214j6591P593Q2445r507j643
16430a6622J985O4073j1270m415o6091L720K7436R412K0767J9449r891j2257K3692
16417D9988J0865K4268K909r514n9086J049k3976j0151j3222K5094k7183K8148
16405h11M2564L362p4293J3252M6181K4403j9717n6221n2276j4497M9334K3173
$$ plain form
16393 -15546 -67242 -143282 -113356 -75462 -47508 20964 80737 54318 -25578 -74955 -117630 -101976
16381 -101976 -121811 -69638 -22513 -35046 13390 94784 40122 21729 32425 65155 55454 75177
16369 75177 17578 -37174 -36496 -17991 34586 14753 6911 -71336 -7568 28548 6830 -42199
16357 -42199 -42843 14045 74030 89505 82810 40909 29095 15243 51312 30594 5023 -31319
16345 -31319 28576 46769 25508 16996 -29730 -43405 -39437 -59968 -14974 40417 88458 85101
16333 85101 48660 65284 114959 60180 43203 32627 35014 74966 109641 116891 54658 -9013
16321 -9013 29287 106513 51725 37966 -3411 1966 -37122 -29238 -7526 6688 27022 52592
16309 52592 -14011 -56087 -69369 -43924 -24201 -17960 -36869 -53453 -24480 22238 58792 52025
$$ packed form
16393a5546n1696p6040K9926L7894K7954O8472N9773k6419p9896m9377m2675J5654
16381a01976j9835N2173M7125j2533M8436Q1394n4662j8393J0696L2730r701J9723
16369G5177n7599n4752O78J8505N2577j9833p842p8247O3768L6116k1718m9029
16357d2199o44N6888N9985J5475o695m1901j1814j3852L6069k0718k5571l6342
16345c1319N9895J8193k1261q512m6726j3675L968k0531M4994N5391M8041l357
16333H5101l6441J6624M9675n4779j6977j0576K387L9952L4675P250o2233o3671
16321i013L8300P7226n4788j3759m1377N377l9088P884K1712J4214K0334K5570
16309E2592o6603m2076j3282K5445J9723O241j8909j6584K8973M6718L6554o767
$$ plain form
16297 52025 25859 4504 -12393 -34043 -66348 -11032 8563 19384 -4908 16298 67347 81057
16285 81057 56791 11959 -28626 -58884 -98703 -122734 -102577 -71388 -23551 33653 -1271 -911
16273 -911 -25164 -57684 -46781 -12274 -62291 -94419 -156388 -141794 -152626 -204486 -123084 -54934
16261 -54934 -30224 -25775 -15604 38752 56184 60588 52593 51998 50376 32448 54479 84282 53909
16248 53909 -14750 -30469 -11002 17447 13806 -17634 -37659 -43088 -35181 -4991 -3266 26393
16236 26393 10734 -31554 -39301 -36808 -52314 -44552 -62699 -45916 -2746 -19123 -40279 9770
16224 9770 -62959 -112178 -135424 -115035 -38383 27606 20001 -31919 -78144 -46022 -17139 -35945
16212 -35945 -24399 63479 87997 103288 53215 -3391 -36177 -9954 18770 1133 -19260 -49860
$$ packed form
16297E2025k6166k1355j6897k1650l2305N5316J9595J0821k4292K1206N1049J3710
16285H1057k4266m4832m0585l0258l9819k4031K0157L1189M7837N7204l4924L60
16273i11k4253l2520J0903L4507n0017l2128o1969J4594j0832n1860Q1402O8150
16261e4934K4710M449J0171N4356J7432M404p995n95j622j7928K2031K9803l0373
16248E3909o8659j5719J9467K8449l641l1440k0025n429P907L0190J725K9659
16236B6393j5659m2288p747K493j5506P762j8147J6783M3170j6377k1156N0049
16224I770p2729m9219k3246K0389P6652O5989p605n1920m6225L2122K8883j8806
16212c5945J1546Q7878K4518J5291n0073n6606l2786K6223K8724j7637k0393l0600
$$ plain form
16200 -49860 -96117 -94569 -33607 -7579 -6492 -9973 -75414 -64997 -45717 -51257 7682 20805
16188 20805 4150 40997 93008 70560 36253 38706 44001 8216 -8901 24291 26771 32530
16176 32530 3822 -34560 -92408 -47820 15559 4336 3542 21530 39466 4491 4307 50682
16164 50682 53988 67078 36976 18206 30996 89252 65933 33139 -36320 -48382 -35888 -23130
16152 -23130 -37232 -38306 31241 42394 36915 9213 2554 -8697 -4872 -8066 4023 -11200 -61394
16139 -61394 -41494 -55987 -61118 -19443 14864 7614 -27037 36488 101184 75319 46079 29428
16127 29428 11165 -26112 -26784 -5113 50270 -4044 -4911 26056 24473 -16353 3576 23271 10690
16114 10690 35192 54882 45206 29464 22960 47448 24277 -19539 -60646 -98515 -50876 17571
$$ packed form
16200d9860m6257J548O0962K6028J087l481o5441J0417J9280n540N8939J3123
16188B0805j6655L6847N2011k2448l4307K453N295l5785j7117L3192K480N759
16176C2530k8708l8382n7848M4588O3379j1223p94J7988J7936l4975j84M6375
16164E0682L306J3090l0102j8770J2790N8256k3319l2794o9459j2062J2494J2758
16152b3130j4102j074O9547J1153n479k7702o659j1251L825l194J2089j5223n0194
16139f1394J9900j4493n131M1675L4307p250l4651O3525O4696k5865k9240j6651
16127B9428j8263l7277o72K1671N5383n4314q67L0967j583m0826J9929J9695j2581
16114A0690K4502J9690r676j5742o504K4488k3171m3816m1107l7869M7639O8447
$$ plain form
16102 17571 -12204 9307 20446 26185 32278 85812 -10742 -48548 -28239 -76224 -62781 -9492
16090 -9492 -8396 -41975 -47815 -35287 39195 69077 49211 49452 46273 38245 26286 51714 75711
16077 75711 88154 90803 134128 89657 45493 158751 159619 121288 113324 65537 12093 -6301
16065 -6301 -6221 -20034 -24097 -26526 -26498 -37176 -75260 -33548 -19248 -23821 -32029 -57770 -110975 -142225
16051 -142225 -107649 -34007 -1143 22399 65809 30019 10961 -18232 -81215 -71638 -98830 -136398
16039 -136398 -58131 -40020 -73305 -67520 -78715 -35446 -15467 9784 24380 19368 -28951 -19731
16027 -19731 20083 -27226 -109601 -106620 -42630 19535 20270 -22328 20801 51117 22040 16206
16015 16206 46750 12382 7313 24741 88482 95373 32158 -8814 25466 26404 3283 41348
$$ packed form
16102A7571k9775K1511J1139N739O093N3534r6554l7806K0309m7985J3443N3289
16090i492J096l3579n840J2528P4482K9882j9866K41l179q028j1959K5428K3997
16077G5711J2443K649M3325m4471m4164J13258Q68l8331p964m7787n3444j8394
16065f301Q0j3813m063k429K8j0678l8084M1712J4300m573q208k5741n3205l1250
16051a42225L4576P3642L2864K3542M3410l5790j9058k9193o2983R577k7192l7568
16039a36398P8267J8111l3285N785j1195M3269J9979K5251J4596n012m8319R220
16027a9731L9814m7309q2375K981O3990O2165P35m2598M3129L0316k9077n834
16015A6206L0544l4368n069J7428O3741O891o3215m0972L4280R38k3121L8065
$$ plain form
16003 41348 39174 39188 40134 65280 70177 71106 94496 49308 33760 52033 37834 9414 -5345
15990 -5345 -47759 -65589 -43153 -44514 -20748 -11226 -22548 -55895 -54066 -35024 -59118 -46511
15978 -46511 -23371 1051 25220 3122 5858 -3149 -90191 -98641 -39683 -70648 -28654 -13175
15966 -13175 -36299 26833 77326 60130 -21293 -20556 8560 -1288 5976 -20486 -76920 -116316
15954 -116316 -63845 26576 31382 10193 -6927 17624 25198 -4694 -24076 -14943 -69879 -96666
15942 -96666 -74695 -64250 -37620 -37488 -14106 37280 67646 62921 1992 24044 65117 36525
15930 36525 -6746 -25413 -32039 10188 9931 8330 -24596 -8126 46351 83946 73967 94346 27764
15917 27764 -28861 -33018 -33996 -28365 17735 58461 14383 -25994 -78710 -27156 35577 57878
$$ packed form
16003D1348k174J4R46K5146M897R29K3390m5188j5548J8273j4199k8420j4759
15990e345m2414j7830K2436j361K3766R522j1322l3347J829J9042k4094J2607
15978d6511K3140K4422K4169k2098K736r007q7042q450N8958l0965M1994J5479
15966a3175k3124O3132N0493j7196q1423P37K9116r848P264k6462n6434l9396
15954a16316N2471R0421M806k1189j7120K4551P574k9892j9382R133n4936k6787
15942i6666K1971J0445K6630J32K3382N1386L0366m725o0929K2052M1073k8592
15930C6525m3271j8667o626M2227k57j601l2926J6470N4477L7595r979K0379o6582
15917B7764n6625m157r78N631M6100M0726m4078m0377n2716N1554O2733K2301
$$ plain form
15905 57878 86638 80316 33876 20007 60419 74985 54303 16443 -50702 -92992 -34223 28624
15893 28624 68222 110402 106093 64267 50427 72472 11795 -66541 -65124 -27247 -50234 -32725
15881 -32725 41089 53803 22022 36657 30224 -23983 -84976 -98755 -53241 -18257 1974 -42987
15869 -42987 -33688 1042 58966 55775 94191 11463 -65780 -31321 9137 41285 7958 -5283
15857 -5283 -9693 -33433 -43282 -6362 -11912 -31630 -49801 -22791 -42496 -61537 -55369 -82893 -67127
15844 -67127 -39862 -13155 34105 18827 -34140 -63278 -41919 21 15333 -2337 -19302 -34657
15832 -34657 -27678 10160 35157 11716 47072 67097 92734 82028 49090 28030 -22476 -7299
15820 -7299 17100 -30456 -50994 -56756 -19251 85347 61731 60440 67773 107091 110392 32536
$$ packed form
15905E7878K8760o322m6440j3869M0412J4566k0682l7860o7145m2290N8769O2847
15893B8624L9598M2180m309m1826j3840K2045o0677p8336J417L7877k2987J7509
15881c2725P3814J2714l1781J4635o433n4207o0993j3779M5514L4984K0231m4961
15869d2987R299L4730N7924l191L8416q2728p7243L4459M0458L2148l3327j3241
15857e283m410k3740r849L6920n550j9718j8171K7010j9705j9041O168k7524J5766
15844f7127K7265K6707M7260j5278n2967k9138K1359M1940J5312j7670j6965j5355
15832c4657O979L7838K4997k3441L5356K0025K5637j0706l2938k1060n0506J5177
15820g299K4399m7556k0538n762L7505J04598k3616j291P333L9318L301p7856
$$ plain form
15808 32536 -56492 -87867 -40243 31883 26114 24833 11014 52528 54015 15849 -12168 -27202
15796 -27202 -33460 -43056 -26678 -48266 -52681 -20291 -10246 45045 70162 68730 79551 28207
15784 28207 -26180 -24802 -49478 -37935 -17154 26393 28407 -5515 -3215 29430 -8329 -37365
15772 -37365 5176 -302 -26523 -26642 2967 2837 18282 30745 13629 83885 56471 21208 26109
15759 26109 36888 41995 -2715 -46990 -43061 -36469 -50009 -51323 -75832 -90510 -92425 -77917 -71198
15746 -71198 -65022 -70282 -74122 -46685 -52087 -59648 -20522 -5330 44234 63701 50206 79791 92131
15733 92131 59693 40516 22690 -19510 -22058 -7834 1506 -19337 10658 59295 48676 46485
15721 46485 -16447 -3796 20210 72205 35289 -39958 14103 26328 55361 88357 37692 -850
$$ packed form
15808C2536q9028l1375M7624P2126n769j281j3819M1514J487l8166k8017j5034
15796b7202o258r596J6378k1588m415L2390J0045N5291K5117j432J0821n1344
15784B8207n4387J378k4676J1543K0781M3547K014l3922K300L2645l7759k9036
15772c7365M2541n478k6221j19K9609j30J5445J2463j7116P0256k7414l5263M901
15759B6109J0779N107m4710m4275L929O592j3540j314k4509j4678j915J4508O719
15746g1198O176n260l840K7437n402p561L9126J5192M9564J9467j3495K9585J2340
15733I2131l2438j9177j7826m2200k548J4224R340k0843K9995M8637j0619k191
15721D6485o2932J2651K4006N1995l6916p5247N4061J2225K9033L2996n0665l8542
$$ plain form
15709 -850 -15767 -5901 30267 3057 -4310 16177 -15553 -27386 -53534 -93977 -94904 -58331 -36350
15696 -36350 1098 10446 20127 1372 9263 -16737 -5672 -41031 -79878 -49995 -52569 -66112
15684 -66112 -112230 -100398 -77222 -42862 -59317 -72835 -71005 -51644 -13094 34885 40210 756
15672 756 8266 -21741 -112426 -128214 -115409 -81023 -50530 18030 52124 57701 11346 -39936
15660 -39936 -30417 -86207 -112190 -106294 -67648 -68330 -70157 -7108 4096 50098 72535 41603 2951
15647 2951 -50822 -39722 -38436 -75953 -68135 -99444 -94516 -48902 -2931 29938 38531 -19687 -19875
15634 -19875 9624 39220 42139 -1073 18756 -9739 3613 -8467 1853 21310 -17751 -19727
15622 -19727 -8688 -56693 -45482 -55428 -86953 -71885 -39267 -38371 -14209 16823 -14091 -32611
$$ packed form
15709h50j4917R866L6168k7210p367K0487l1730j1833k6148m0443r27L6573K1981
15696c6350L7448R348R681j8755P891k6000J1065l5359l8847K9883k574j3543
15684f6112m6118J1832K3176L4360j6455j3518J830J9361L8550M7979N325l9454
15672G56P510l0007r0685j5788J2805L4386L0493O8560L4094N577m6355n1282
15660c9936R519n5790k5983N896L8646o82j827O3049J1204M6002K2437l0932l8652
15647B951n3773J1100J286l7517P818l1309M928M5614M5971L2869Q593n8218j88
15634a9875K9499K9596K919m3212J9829k8495J3352j2080J0320J9457l9061j976
15622a9727J1039m8005J1211r946l1525J5068L2618Q96K4162L1032l0914j8520
$$ plain form
15610 -32611 -38961 -50942 -7175 14594 -29485 -50351 -28592 -17667 -38965 -56173 -17284 -27139
15598 -27139 -53518 -74977 -44465 -9185 863 -40250 -67785 -68471 -63012 -68661 -25709 -11048
15586 -11048 7150 48810 64252 6650 -39842 10547 26084 -28017 -98933 -96517 -94529 -58964
15574 -58964 -92559 -108496 -31271 -9685 -37469 -4540 29249 -7430 -34600 -30617 20606 99190
15562 99190 96762 88399 86088 62433 -24001 -80964 -90472 -48236 -12777 -1413 -36834 -51602
15550 -51602 -81885 -119591 -83882 -72948 -100969 -53525 14033 -51217 -69898 -23909 73582 141270
15538 141270 121453 96029 97193 53713 26201 35082 86076 81316 14796 -1493 29454 37256
15526 37256 44950 81678 47159 41187 -23720 -44863 -31421 -5204 13737 22920 6308 -36875
$$ packed form
15610c2611o350j1981M3767K1769m4079k0866K1759J0925k1298j7208L8889r855
15598b7139k6379k1459L0512L5280J0048m1113k7535o86N459n649M2952J4661
15586a1048J8198M1660J5442n7602m6492N0389J5537n4101p0916K416J988L5565
15574e8964l3595j5937P7225K1586k7784L2929L3789l6679k7170L983N1223P8584
15562I9190k428q363k311k3655q6434n6963r508M2236L5459J1364l5421j4768
15550e1602l0283l7706L5709J0934k8021M7444O7558o5250j8681M5989R7491O7688
15538A41270j9817k5424J164m3480k7512Q881N0994m760o6520j6289L0947P802
15526C7256P694L6728l4519n972o4907k1143J3442K6217J8941R183j6612m3183
$$ plain form
15514 -36875 22657 76527 65726 22781 12006 -25609 -23435 -42141 -14024 5067 -26755 2204
15502 2204 343 -9441 -34076 -27938 -14579 -1827 45076 56029 44905 9730 -66252 -36966
15490 -36966 1326 -28656 -48837 -92666 -80549 -21232 20342 12674 45234 65743 107936 126224
15478 126224 90426 35416 -25741 -27368 1413 -19503 -32624 -36798 -12959 18169 12573 18872
15466 18872 -7645 -30870 -17573 -22768 -13540 834 18599 10539 1380 -34159 -75319 -52602
15454 -52602 34038 23656 4006 55892 76925 33161 -15838 -25215 -45530 -42304 422 17211
15442 17211 -19475 -18670 -48309 -12683 -17198 -24756 -2209 4210 45699 4498 -38123 -35372 -4810
15429 -4810 15387 -2667 7875 48438 62865 46776 30961 34651 44390 52141 -14142 -32479
$$ packed form
15514c6875N9532N3870j0801m2945j0775l7615K174j8706K8117J9091l1822K8959
15502B204j861r784k4635O138J3359J2752M6903J0953j1124l5175p5982K9286
15490c6966L8292k9982k0181m3829J2117N9317M1574p668L2560K0509M2193J8288
15478A26224l5798n5010o1157j627K8781k0916j3121m174K3839L1128n596O299
15466A8872k6517k3225J3297n195R228J4374J7765q060r159l5539m1160K2717
15454e2602Q6640j0382j9650N1886K1033m3764m8999r377k0315L226M2726J6789
15442A7211l6686Q05k9639L5626m515p558K2547O419M1489m1201m2621K751L0562
15429d810K0197j8054J0542M0563J4427j6089j5815L690R739P751o6283j8337
$$ plain form
15417 -32479 -41183 22298 -23741 -57455 -83916 -76021 -86308 -50254 -11195 15532 2239 6807
15405 6807 26002 22025 42067 51445 -19107 -10539 -15254 -44759 -101897 -121188 -37283 -22069 -64739
15392 -64739 -74279 -9073 27211 -8792 -31814 -24902 -31353 -10144 7604 -13835 -40811 4415
15380 4415 42958 50959 81567 56572 -8575 -2206 -8161 2951 -34189 -6834 -53215 -62213 16760
15367 16760 56468 44084 -6947 64858 130079 103700 40911 11289 16429 15045 36314 2797
15355 2797 -48678 -71980 -3279 48158 -28986 -58722 -27222 9908 -49517 -63912 -47940 -25998
15343 -25998 -31703 -52202 -38427 -33758 -13101 26284 13568 4993 -14108 -1791 -18720 -74211
15331 -74211 -67935 -4787 30604 -94 -42633 -34309 -30896 -52917 -46602 4871 26734 42706
$$ packed form
15417c2479q704O3481m6039l3714k6461P895j0287L6054L9059K6727j3293M568
15405F807J9195l977K0042R378p0552Q568m715k9505n7138j9291Q3905J5214m2670
15392f4739r540O5206L6284l6003k3022O912o451K1209J7748k1439k6976M5226
15380D415L8543Q001L0608k4995o5147O369n955J1112l7140K7355m6381q998P8973
15367A6760L9708j2384n1031P1805O5221k6379o2789k9622N140j384K1269l3517
15355B797n1475k3302O8701N1437p7144k9736L1500L7130n9425j4395J5972K1942
15343b5998n705k0499J3775M669K0657L9385j2716q575j9101J2317j6929n5491
15331g4211O276O3148L5391l0698m2539Q324L413k2021O315N1473K1863J5972
$$ plain form
15319 42706 969 9736 -28150 -40031 -58305 -58940 -9417 -1499 -9541 11258 57823 44322 49080
15306 49080 92514 66801 29187 27176 19889 825 -15184 -40399 -4706 -4884 -20166 -19101 -23503
15293 -23503 -81525 -36094 -27225 -19550 -26861 -67080 -30894 14019 20526 13312 37245 -15301 -40942
15280 -40942 -50910 -19157 91667 132251 115780 42900 -5616 26656 60241 46888 47568 21295
15268 21295 -18758 -26302 -19016 10458 -34088 -105058 -126082 -102071 -3540 30056 48188 57757
15256 57757 53796 62278 112628 61230 27026 45756 101008 107705 54244 -7031 -6594 25907 16454
15243 16454 -7213 1577 14564 -42917 -51582 -25267 -15356 -7064 58367 85847 81445 10628 -70929
15230 -70929 -109610 -89750 -94329 -85491 -67482 14906 12913 11613 54555 80164 74873 68696 88131
$$ packed form
15319D2706m1737Q767l7886j1881j8274o35M9523P918q042K0799M6565j3501M758
15306D9080M3434k5713l7614k011p287j9064j6009k5215L5693j78j5282J065m402
15293b3503n8022M5431Q869P675p311m0219L6186M4913O507p214K3933n2546k5641
15280d0942r968L1753J10824M0584j6471p2880m8516L2272L3585j3353O80k6273
15268B1295m0053p544P286K9474m4546p0970k1024K4011R8531L3596J8132R569
15256E7757l961Q482N0350n1398l4204J8730N5252O697n3461o1275M37L2501r453
15243A6454k3667Q790J2987n7481q665K6315R911Q292O5431K7480m402p0817q1557
15230g0929l8681J9860m579Q838J8009Q2388j993j300M2942K5609n291o177J9435
$$ plain form
15217 88131 101404 116300 88553 78643 55527 34572 51002 70515 64724 72984 100080 85812
15205 85812 50080 -35932 -40798 -71295 -60116 -23010 -12513 -18964 -15621 15563 22509 -18344
15193 -18344 -24216 -21413 23 -22720 -23808 -1147 -10095 -21564 -30815 -56046 -57188 -64868 -83400
15180 -83400 -28443 20340 50256 60493 28410 2691 -1126 -2844 -20950 -14298 -38215 -62510
15168 -62510 -59406 10030 21313 -32318 -83280 -40193 -24465 -15580 50368 96594 72922 12184
15156 12184 3570 -42643 -79434 -62827 -62209 13027 115314 170046 100403 37580 10921 49071
15144 49071 62308 46583 -3417 -15642 59767 152003 105955 72040 35264 44187 62226 45929
15132 45929 4718 -9307 -48158 -28957 -46442 -45971 -90291 -111881 -57204 -42464 -51976 -75047
$$ packed form
15217H8131J3273J4896k7747r910k3116k0955J6430J9513n791Q260K7096j4268
15205H5812l5732q6012m866l0497J1179L7106J0497o451L343L1184O946m0853
15193a8344n872K803K1436k2743j088K2661q948j1469r251k5231j142p680j8532
15180h3400N4957M8783K9916J0237l2083k5719l817j718j8106O652k3917k4295
15168f2510L104O9436J1283n3631n0962M3087J5728Q885O5948M6226k3672o0738
15156A2184q614m6213l6791J6607O18P5236J02287N4732o9643o2823k6659L8150
15144D9071J3237j5725n0000j2225P5409R2236m6048l3915l6776Q923J8039j6297
15132D5929m1211j4025l8851J9201j7485M71m4320k1590N4677J4740r512k3071
$$ plain form
15120 -75047 -35794 -22468 -47838 -43041 -38216 -51157 14732 36111 49282 62567 79429 8675
15108 8675 47417 41080 -19833 -17805 -52405 -82423 -55271 34906 -26418 -108971 -106646 -84995
15096 -84995 -110989 -89879 -65630 -104449 -87145 -55902 -25147 -17424 -44522 -70871 -77052 -54869
15084 -54869 -16555 6962 -79947 -67049 -32175 -16236 -700 -5371 27329 6299 -12502 -37385
15072 -37385 -76181 -59840 -36521 1359 23637 19671 27775 42409 -8699 -43701 -69440 -77769
15060 -77769 -44812 -39420 627 -48563 -49378 2087 -8836 -32502 -24354 -9344 57119 44526
15048 44526 -31044 -49907 -20176 -29230 -20162 -81803 -101031 -127827 -147803 -80625 -15830 5155
15036 5155 -10653 26477 65897 57778 42806 57469 83058 77317 45872 55233 79820 8191
$$ packed form
15120g5047L9253J3326k5370M797M825j2941O5889K1379J3171J3285J6862p0754
15108H675L8742o337o0913K028l4600l0018K7152R0177o1324q2553K325K1651
15096h4995k5994K1110K4249l8819J7304L1243L0755P723k7098k6349o181K2183
15084e4869L8314K3517q6909J2898L4874J5939J5536m671L2700k1030j8801k4883
15072c7385l8796J6341K3319L7880K2278l966Q104J4634n1108l5002k5739q329
15060g7769L2957N392M0047m9190q15N1465j0923k3666Q148J5010O6463j2593
15048D4526p5570j8863K9731r054R068o1641j9228k6796j9976O7178O4795K0985
15036E155j5808L7130L9420q119j4972J4663K5589n741l1445R361K4587p1629
$$ plain form
15024 8191 -8011 9398 12417 -17428 -42590 -42619 -2062 -28239 -45785 -45681 -51423 22705 87880
15011 87880 83996 51266 44220 47353 39883 6519 -40035 -72592 -107247 -53251 -46465 51195 106041
14998 106041 92560 100256 82067 82943 51988 54442 8084 -6877 25751 8756 -30826 -6298
14986 -6298 10573 -48999 -50552 -75647 -45117 10145 39464 14895 -38974 -57638 -54275 -51468
14974 -51468 -23464 4108 31581 52912 65322 36356 525 -30032 -28224 -5689 59872 117768
14962 117768 65477 15097 4447 -34017 13982 -30877 -8129 -60889 -93133 -74234 -18312
14951 -18312 26727 -830 24996 54763 43897 30652 75433 64899 -3918 -129 55445 92417
14939 92417 93428 70792 25500 2538 -6034 -11037 -35004 -15847 -25210 -18363 -6314 -8906 -50138
$$ packed form
15024H191j6202J7409L019k9845k5162k9M0557k6177j7546J04n742P4128O5175
15011H7880l884l2730p046L133p470l3364m6554l2557l4655N3996O786R7660N4846
14998A06041j3481P696j8189Q76l0955K454m6358j4961L2628j6995l9582K4528
14986f298J6871n9572j553k5095L0530N5262K9319k4569n3869j8664L363K807
14974e1468K8004K7572K7473K1331J2410k8966l5831l0557J808K2535O5561N7896
14962A17768n2291n0380j0650l8464M7999m4859K2748n2760l2244J8899N5922
14951a8312M5039k7557K5826K9767j0866j3245M4781j0534o8817L789N5574L6972
14939I2417J011k2636m5292k2962q572n003k3967J9157r363O847J2049k592m1232
$$ plain form
14926 -50138 -82526 -40779 38327 59363 46830 56622 26706 -50145 -50066 -41597 -43796 -19873 -21503
14913 -21503 -73658 -61156 -43896 -49800 -83107 -132629 -109033 -39477 30906 -28214 -64962 -44770
14901 -44770 -43928 -59714 -64843 -70967 -16625 -31915 -12985 -25668 -68920 -76095 -51815 -23584 -5603
14888 -5603 -31530 8671 31263 -2179 18196 9985 -7310 -21365 6981 40366 66807 -173
14876 -173 -65527 -75412 -20482 -11092 48477 71868 33525 -27000 -18153 -29950 -34807 -22146 -38673
14863 -38673 -58825 37125 65810 79120 50883 -7226 -21948 -4957 -783 -56957 -54527 -40935
14851 -40935 3602 10506 -5528 -24251 -4716 9097 4943 29233 47204 -9064 -79927 -20092
14839 -20092 -2284 -20457 132 80098 96655 129891 95482 -15247 -53907 -24411 -2417
$$ packed form
14926e0138l2388M1747P9106K1036j2533R792k9916p6851P9Q469k199K3923j630
14913b1503n2155J2502J7260n904l3307m9522K3596O9556P0383n9120l6748K0192
14901d4770Q42j5786n129o124N4342j5290J8930j2683m3252p175K4280K8231J7981
14888e603k5927M0201K2592l3442K0375q211j7295j4055K8346L3385K6441o6980
14876a73o5354r885N4930R390N9569K3391l8343o0525Q847j1797m857J2661j6527
14863c8673k0152R5950K8685J3310k8237n8109j4722J6991M174n6174K430J3592
14851d0935M4537O904j6034j8723J9535J3813m154K4290J7971n6268p0863N9835
14839b0092J7808j8173K0589P9966J6557L3236l4409j10729l8660K9496K1994
$$ plain form
14828 -2417 -8546 -26886 29986 80713 42409 -38895 -12289 3650 -10084 18637 12931 -3479
14816 -3479 -54319 -58782 -26571 1292 33048 -224 -40419 -30957 -32376 -63456 -37408 -22717
14804 -22717 -1076 10289 11767 -3326 -32510 -487 13574 20047 30370 17021 54546 27007
14792 27007 8811 44595 45671 1054 -20762 5832 -17353 -11352 -17860 7329 11322 8187 -57492
14779 -57492 -48500 16522 25523 15536 46086 47020 18267 -34964 -111185 -111128 -56281 -27976 -1465
14766 -1465 9050 -22683 1239 40323 77502 88582 45354 6033 33441 48130 40825 37943
14754 37943 49862 47290 -15669 -8712 51282 62123 15883 -12443 -65251 -65585 -49424 -40497 -18698
14741 -18698 -11538 -17303 -822 34582 73579 94214 28149 -31565 -32985 2017 18771 53420
$$ packed form
14828b417o129j8340N6872N0727l8304q1304K6606J5939j3734K8721n706j6410
14816c479n0840m463L2211K7863L1756l3272m0195R462j419l1080K6048J4691
14804b2717K1641J1365J478j5093k9184L2023J4061O473J0323j3349L7525k7539
14792B7007j8196L5784J076m4617k1816K6594k3185O001o508K5189L993l135o5679
14779e7492Q992O5022R001r987L0550R34k8753n3231p6221N7N4847K8305K6511
14766a465J0515l1733K3922L9084L7179J1080m3228l9321K7408J4689p305k882
14754C7943J1919k572o2959O957N9994J0841m6240k8326n2808l34J6161Q927K1799
14741a8698P160n765J6481L5404L8997K0635o6065n9714j420L5002J6754L4649
$$ plain form
14729 53420 5805 -46789 -44258 -20411 -72311 -65294 -65298 -37255 -4411 -52351 -33486 2933 -32959
14716 -32959 -40534 -36224 -34076 -1906 9062 -30774 -22520 19231 28998 28943 -36338 -99453 -113797
14703 -113797 -48934 3958 29072 43524 50161 33882 7159 -48440 -36703 -45256 -84469 -88882
14691 -88882 -40141 -23490 -58454 9931 77108 81412 -6332 -15832 40524 59168 48642 55945
14679 55945 40495 -12646 -23842 -34516 -9996 -14779 4011 64641 114120 53965 24215 17181
14667 17181 -16299 7941 95923 88010 43825 102369 106334 46670 31635 39596 23003 31099
14655 31099 25061 11307 5022 64291 141066 81021 26001 -35766 -75047 -49583 -1986 8344
14643 8344 36895 19354 19602 -13979 -48596 -27277 -10805 -45183 -41849 -14581 -19904 -47092 -68560
$$ packed form
14729E3420m7615n2594K531K3847n1900P017mK8043L2844m7940J8865L6419l5892
14716c2959p575M310K148L2170J0968l9836Q254M1751R767n5o5281o3115j4344
14703a13797O4863N2892K5114J4452O637j6279k6723n5599J1737q553l9213m413
14691h8882M8741J6651l4964O8385O7177M304q7744r500N6356J8644j0526P303
14679E5945j5450n3141j1196j0674K4520m783J8790O0630M9479o0155k9750p034
14667A7181l3480K4240Q7982p913m4185N8544L965n9664j5035P961j6593Q096
14655C1099o038j3754o285N9269P6775o0045n5020o1767l9281K5464M7597J0330
14643H344K8551j7541K48l3581l4617K1319J6472l4378L334K7268n323k7188k1468
$$ plain form
14630 -68560 -77977 -45196 -14526 20161 17208 18479 37802 55157 30812 -24049 -31570 -3090
14618 -3090 -56258 -61649 -28059 42494 94387 94389 94548 17217 -41850 -64950 -29398 -2229 34039
14605 34039 49303 33198 11455 -22320 -27955 5988 -64213 -78905 -38922 -45900 -58468 -65997
14593 -65997 -21061 14767 3662 -32536 -46905 -42536 -70331 -59563 -1131 80594 84732 58731
14581 58731 72997 4557 10648 -6344 -7031 -36700 -73363 -35549 -5979 -14840 -22011 12906 44301
14568 44301 1406 -48803 -44808 186 -3213 31786 6276 9477 10572 11665 56793 51331 55728
14555 55728 63373 72964 73306 3367 -62698 -109822 -119250 -66780 -43902 -49734 -59655 -81206 -47827
14542 -47827 -66246 -80067 -104024 -92131 -40299 -52510 -47297 -30563 22589 99 -58001 -107869
$$ packed form
14630f8560r417L2781L0670L4687k953J271J9323J7355k4345n4861p521K8480
14618c090n3168n391L3590P0553N1893KJ59p7331n9067k3100L5552K7169L6268
14605C4039J5264j6105k1743l3775n635L3943p0201j4692L9983o978j2568p529
14593f5997M4936L5828j1105l6198j4369M369k7795J0768N8432Q1725M138k6001
14581E8731J4266o8440O091j6992o87k9669l6663L7814K9570q861p171L4917L1395
14568D4301m2895n0209L995M4994l399L4999k5510L201J095J093M5128n462M397
14555E5728P645R591L42o9939o6065m7124r428N2470K2878n832r921k1551L3379
14542d7827j8419j3821k3957J1893N1832j2211N213J6734N3152k2490n8100m9868
$$ plain form
14530 -107869 -152431 -160841 -115100 -73296 -72487 -28060 22152 -6871 -60781 -105790 -59373 -21078
14518 -21078 -14065 10025 -6914 -18486 -37908 -109972 -139861 -97094 -33817 -13805 -32053 -32481
14506 -32481 -26501 -51358 -34913 11454 79875 66813 45219 36199 18135 10864 10024 25524 26072
14493 26072 -67455 -89220 -113167 -92510 -14989 14336 50122 62111 60550 45036 40562 -14829
14481 -14829 -25187 -18070 16753 9048 -2103 -21617 -14938 19557 48823 21202 -45577 -52656
14469 -52656 -67111 -20292 -8286 -15180 -26518 -850 -10891 -61948 -64948 -45946 40378 2903
14457 2903 -13314 -11042 3020 37386 50791 33753 -28898 -63457 -63902 -83744 -92045 -52152 36108
14444 36108 66534 54851 77844 84373 92844 45412 3009 -396 17408 -19005 -39849 5497
$$ packed form
14530a07869m4562q410M5741M1804Q09M4427N0212k9023n3910m5009M6417L8295
14518b1078P013K4090j6939j1572j9422p2064k9889M2767O3277K0012j8248m28
14506c2481N980k4857J6445M6367O8421j3062k1594r020j8064p271q40J5500N48
14493B6072r3527k1765k3947K0657P7521K9325L5786J1989j561j5514m474n5391
14481a4829j0358P117L4823p705j1151j9514O679L4495K9266k7621o6779p079
14469e2656j4455M6819J2006o894j1338K5668j0041n1057l000J9002Q6324l7475
14457B903j6217K272J4062L4366J3405j7038o2651l4559m45j9842q301L9893Q8260
14444C6108L0426j1683K2993O529Q471m7432m2403l405J7804l6413k0844M5346
$$ plain form
14432 5497 47521 51734 18058 26810 64097 83027 75396 76866 42883 20322 48763 52926 1807
14419 1807 -3643 -26311 -3650 26141 77921 131623 145501 125266 52274 50492 19973 22409
14407 22409 -37029 -74503 -67727 -37001 61452 82813 53107 -34692 -50798 -23781 -323 -1352
14395 -1352 -43348 -68270 -95470 -82364 -63258 -59023 -123782 -133768 -105067 -66882 -13590 31596
14383 31596 27262 19786 30143 9518 -29790 -71336 -120139 -108691 -42815 16888 6368 2722
14371 2722 58600 33964 57130 80272 36228 -36411 -63137 -22322 -19039 -257 11957 -33150
14359 -33150 -77707 -61726 8134 9093 -33039 -44192 -45452 -3450 11940 1476 45228 32363
14347 32363 26717 -1481 -2378 -13158 -43834 -56839 -54991 -85033 -69347 -86467 -111833 -53072
$$ packed form
14432E497M2024M213l3676Q752L7287J8930p631J470l3983k2561K8441M163n1119
14419A807n450k2668K2661K9791N1780N3702J3878k0235p2992j782l0519K436
14407B2409n9438l7474O776L0726R8453K1361k9706q7799j6106K7017K3458j029
14395a352m1996k4922k7200J3106J9106M235o4759r986K8701L8185N3292M5186
14383C1596m334p476J0357k0625l9308m1546m8803J1448O5876N9703j0520l646
14371B722N5878k4636K3166K3142m4044p2639k6726M0815L283J8782J2214m5107
14359c3150m4557J5981O9860R59m2132j1153j260M2002J5390j0464M3752j2865
14347C2363n646k8198q97j0780l0676j3005J848l0042J5686j7120k5366N8761
$$ plain form
14335 -53072 -32497 -81290 -69133 -35694 14343 57027 99348 116697 84952 37373 21543 23999
14323 23999 8506 41803 72998 73524 30641 60715 107021 108744 89382 31298 57290 100265
14311 100265 81010 52973 24712 1461 27187 32052 22615 50795 37409 7032 15227 92767
14299 92767 129033 85932 62265 38165 -10953 -24417 58962 81280 28086 51257 -4124 -55974
14287 -55974 -71278 -95189 -116685 -117932 -114215 -68376 -38975 -31338 -8830 -8806 6530 48518 77397
14274 77397 19083 -28036 12292 -3848 -14683 7626 39753 45961 7106 -39450 -52110 -31018
14262 -31018 -54634 -124290 -150059 -88659 -16879 25151 10843 -9003 -22220 11263 5 -13604
14250 -13604 -73184 -92193 -14967 14758 44461 71378 52085 71683 91061 95765 89467 83684
$$ packed form
14335e3072K0575m8793J2157L3439N0037M2684M2321J7349l1745m7579j5830K456
14323B3999j5493L3297L1195N26m2883L0074M6306J723j9362n8084K5992M2975
14311A00265j9255k8037k8261k3251K5726M865r437K8180j3386l0377Q195P7540
14299I2767L6266m3101k3667k4100m9118j3464Q3379K2318n3194K3171n5381n1850
14287e5974j5304k3911k1496j247L717M5839K9401P637K2508K4J5336M1988K8879
14274G7397n8314m7119M0328j6140j0835K2309L2127O208l8855m6556j2660K1092
14262c1018k3616o9656k5769O1400P1780M2030j4308j9846j3217L3483j1258j3609
14250a3604n9580j9009P7226K9725K9703K6917j9293J9598J9378M704o298n783
$$ plain form
14238 83684 81486 88761 19859 -35000 1784 46315 78882 28635 -94100 -181971 -136315 -79664
14226 -79664 -23898 -68702 -73908 -83871 -19928 -10317 2535 18632 46347 107693 89807 63140
14214 63140 59621 59360 13407 -28261 -21266 15432 51704 33895 -4949 -10184 -40335 -92022 -42173
14201 -42173 -48824 -36507 -43006 -82740 -65599 -31663 -6996 16150 28688 13571 2175 -26008
14189 -26008 -40037 30042 14862 -17763 -13503 40183 70569 5838 -98093 -160797 -97139 -31790
14177 -31790 -46092 -79957 -48140 -52612 -57076 -48354 -41345 -52342 -82460 -76986 -130713 -115386 -59133
14164 -59133 -80113 -48170 -3743 -45239 -12147 51816 -10786 -76185 -66443 47900 78865 87184
14152 87184 64242 53031 42519 67808 43555 -50 -45950 3578 36675 29115 -14528 13120
$$ packed form
14238H3684k198P275o8902n4859L6784M4531L2567n0247j22735q7871M5656N6651
14226g9664N5766m4804n206r963O3943R611J2852J6097K7715O1346j7886k6667
14214F3140l519k61m5953m1668O995L6698L6272j7809l8844n235l0151n1687M9849
14201d2173o651J2317o499l9734J7141L3936K4667K3146J2538j5117j1396k8183
14189b6008j4029P0079j5180l2625M260N3686L0386o4731j03931o2704O3658O5349
14177c1790j4302l3865L1817m472m464Q722P009j0997l0118N474n3727J5327N6253
14164e9133k0980L1943M4427m1496L3092O3963o2602o5399R742J14343L0965Q319
14152H7184k2942j1211j0512K5289k4253m3605m5900M9528L3097p560m3643K7648
$$ plain form
14140 13120 60892 -13808 1082 1800 17737 -4778 -50845 -124809 -91831 -76293 -75608 -52421
14128 -52421 -51459 -17789 -6455 -60763 -62714 -50104 -16860 36036 58004 81562 81532 30724 -41946
14115 -41946 -129646 -146741 -84781 -25772 -16857 -28656 10685 39725 29964 59219 93268 102328
14103 102328 55730 45070 62161 106241 139052 145957 121052 75346 58987 65152 55416 46474
14091 46474 9927 49270 -599 -19582 55546 103160 47414 16260 53056 71331 28345 19599
14079 19599 -4809 763 52758 41841 -9311 29214 -3195 -9678 -9975 43742 24208 -37222
14067 -37222 -38531 13365 -17690 -70007 -47340 -52005 -14982 54898 12426 -38781 -53582 -22160
14055 -22160 29710 11292 -5688 -34108 -40368 -58531 -36642 -7511 4866 25715 4549 -14294
$$ packed form
14140A3120M7772p4700J4890P18J5937k2515m6067p3964L2978J5538O85K3187
14128e2421R62L3670J1334n4308j951J2610L3244N2896K1968K3558l0n0808p2670
14115d1946q7700j7095O1960N9009Q915j1799L9341K9040r761K9255L4049R060
14103A02328m6598j0660J7091M4080L2811O905k4905m5706j6359O165r736q942
14091D6474l6547L9343m9869j8983P5128M7614n5746l1154L6796J8275m2986q746
14079A9599k4408N572N1995j0917n1152L8525l2409o483k97N3717j9534o1430
14067c7222j309N1896l1055n2317K2667m665L7023O9880m2472n1207j4801L1422
14055b2160N1870j8418j6980k8420o260j8163K1889K9131J2377K0849k1166j8843
$$ plain form
14043 -14294 8063 15947 16181 33866 17387 -58547 -32170 36168 56317 57763 46274 84311
14031 84311 67245 33323 28239 71214 33103 -15293 -12321 -16789 -23079 -55444 -77401 -109258
14019 -109258 -108477 -86998 -79838 -67676 -53660 -67546 -16260 -8404 -75047 -58408 26417 39260
14007 39260 -21846 -27963 -16758 25496 46559 -88 -57491 -74968 -104886 -106548 -100733 -79863
13995 -79863 -39507 40158 67829 28327 6187 51180 75160 93458 86602 79271 35395 55711
13983 55711 92166 110865 47534 30291 36760 30512 44786 54246 29592 6105 29434 51568
13971 51568 67110 50873 28552 -33561 -25688 -51921 -72456 -49384 -68653 -65465 -27487 6164
13959 6164 18033 37631 46541 2065 -19913 -6757 -27482 -16658 -12049 14141 5601 5689 16649
$$ packed form
14043a4294K2357P884K34J7685j6479p5934K6377O8338K0149J446j1489L8037
14031H4311j7066l3922n084M2975l8111m8396K972m468o290l2365k1957l1857
14019a09258P81K1479P160J2162J4016j3886N1286P856o6643J6639Q4825J2843
14007C9260o1106o117J1205M2254K1063m6647n7403j7477k9918j662N815K0870
13995g9863M0356P9665K7671l9502k2140M4993K3980J8298o856p331m3876K0316
13983E5711L6455J8699o3331j7243O469o248J4274R460k4654k3487K3329K2134
13971E1568J5542j6237k2321o2113P873k6233k0535K3072j9269L188L7978L3651
13959F164J1869J9598Q910m4476k1978J3156k0725J0824M609K6190q540Q8J0960
$$ plain form
13946 16649 41106 59117 47230 9627 -8616 16340 -13377 -20738 26527 57863 24960 15854
13934 15854 17886 10404 14722 2626 -33067 -102388 -102363 -26457 2804 -23205 -44933 -58025 -43659
13921 -43659 -21190 21926 60752 17371 -38736 -58714 -83673 -50187 -15049 -6332 -1073 37081
13909 37081 32536 41132 50748 35311 -14722 -38310 -55193 -19880 7317 53351 43250 -11740
13897 -11740 -72648 -87786 -59929 -71127 -76634 -86980 -87214 -89593 -80236 -72951 -50945 -27149 -1504
13884 -1504 -11071 -14156 14869 75780 73080 63414 27464 -13111 -31073 -28367 11276 45795 77513
13871 77513 111426 81251 28390 -18941 -44782 -22572 -49191 -31536 -43272 -61485 -55654 -32570
13859 -32570 -35416 -74135 -31612 -13176 4596 -32268 -29087 6569 10383 -20440 -7603 19731
$$ packed form
13946A6649K4457J8011j1887l7603j8243K4956k9717p361M7265L1336l2903r106
13934A5854K032p482M318j2096l5693o9321K5P5906K9261k6009k1728j3092J4366
13921d3659K2469M3116L8826m3381n6107j9978k4959L3486L5138Q717N259L8154
13909C7081m545Q596R616j5437n0033k3588j6883L5313K7197M6034j0101n4990
13897a1740o0908j5138K7857j1198n507j0346k34k379R357P285K2006K3796K5645
13884a504r567l085K9025O0911k700r666l5950m0575j7962K706L9643L4519L1718
13871G7513L3913l0175n2861m7331k5841K2210k6619J7655j1736j8213N831K3084
13859c2570k846l8719M2523J8436J7772l6864L181L5656L814l0823J2837K7334
$$ plain form
13847 19731 -17267 -41100 -38354 -6515 29784 71277 25924 -54080 -60925 -30054 20149 24766
13835 24766 2427 -17770 5366 20432 12185 -2008 -15582 31362 13493 -35478 -61806 -48774
13823 -48774 -14084 -59446 -15697 -29833 4946 80130 57490 27585 57717 45927 30680 23760
13811 23760 12203 10691 -45127 -50770 -17144 26666 64874 10928 -8204 53500 59280 105709
13799 105709 152353 112630 102608 58101 -2832 -56785 -68225 -37693 -3399 -82719 -127954
13788 -127954 -102835 -137709 -101877 -37672 -36530 -19123 -12879 -34707 -18966 1885 2397 -46796
13776 -46796 -85361 16687 62754 47075 -19935 -33399 -16529 59022 46959 63522 58200 45975
13764 45975 108116 145959 106374 57762 60379 9050 -29561 -34495 -4104 5218 -2266 -31325
$$ packed form
13847A9731l6998k3833K746L1839L6299M1493m5353q0004o845L0871N0203M617
13835B4766k2339k0197K3136J5066q247j4193j3574M6944j7869m8971k6328J3032
13823d8774L4690m5362M3749j4136L4779P5184k2640k9905L0132j1790j5247o920
13811B3760j1557j512n5818n643L3626M3810L8208n3946j9132O1704N780M6429
13799A05709M6644l9723j0022m4507o0933n3953j1440L0532L4294p9320m5235
13788a27954K5119l4874L5832O4205J142J7407O244k1828J5741K0851N12m9193
13776d6796l8565J02048M6067j5679o7010j3464J6870P5551j2063J6563n322j2225
13764D5975O2141L7843l9585m8612K617n1329l8611m934L0391R322p484k9059
$$ plain form
13752 -31325 -41584 -37742 -18158 24014 74904 110046 41798 18313 45836 -29657 775 -8266
13740 -8266 16054 23388 -73599 -65336 -62380 -101939 -109390 -101268 -24996 74424 146960 116123 47550
13727 47550 23758 35243 -10949 -5649 -5342 -33572 -66921 -43070 -43665 -23093 -14811 -26319 -45594
13714 -45594 6300 -38027 -58666 -19876 2936 45284 28438 11454 24901 17349 61310 29498
13702 29498 24338 78752 93549 72127 12453 -55517 -59601 -104063 -20372 -36785 -60736 -38335
13690 -38335 -1651 -38904 -87555 -66896 -12819 35990 61759 51173 25962 47432 82670 93893
13678 93893 63379 20531 -37434 -37533 4879 13284 18257 10011 8665 -41190 -71758 -23972 25510
13665 25510 18043 13797 39954 2741 23769 49352 40968 20440 26916 21547 61960 97824 67560
$$ packed form
13752c1325j0259L842J9584M2172N0890L5142o8248k3485K7523p5493L0432r041
13740h266K4320P334r6987Q263K956l9559p451Q122P6272R9420P2536l0837o8573
13727D7550k3792J1485m6192N300L07k8230l3349K3851n95K0572Q282j1508j9275
13714d5594N1894m4327k0639L8790K2812M2348j6846j6984J3447p552M3961l1812
13702B9498n160N4414J4797k1422n9674o7970m084m4462Q3691j6413k3951K2401
13690c8335L6684l7253m8651K0659N4077M8809K5769j0586k5211K1470L5238J1223
13678I3893l0514m2848n7965r9M2412Q405M973q246j346m9855l0568M7786M9482
13665B5510p467m246K6157l7213K1028K5583q384k0528O476n369M0413L5864l0264
$$ plain form
13652 67560 30151 11437 -16889 -6761 -9780 -22523 11231 46745 39333 -19454 -34762 -61954
13640 -61954 -80503 -53837 -78551 -56377 -87050 -95172 -59026 34334 106043 123090 98534 88063
13628 88063 69512 34899 64529 61308 -7241 -24140 26380 31001 47272 47507 55906 66671 31860
13615 31860 43804 67046 69998 86046 80563 79444 55142 28449 7767 3621 -7568 -18925
13603 -18925 307 269 -28833 -51683 -14854 -3044 -9040 -8031 5729 -604 -30109 -1340 850
13590 850 32618 3231 -50746 -27512 -45961 -79584 -23376 26614 -18511 -10135 29699 59543
13578 59543 94590 87941 108809 77634 25956 1781 -66062 -18709 5726 -7979 11999 59304
13566 59304 34040 31629 17477 52662 64861 31081 36430 95834 78922 34046 1880 -16259
$$ packed form
13652F7560l7409j8714k8326J0128l019j2743L3754L5514p412n8787j5308k7192
13640f1954j8549K6666k4714K2174l0673q122L6146R3360P1709J7047k4556j0471
13628H8063j8551l4613K9630l221o8549j6899N0520M621J6271K35Q399J0765l4811
13615C1860J1944K3242K952J6048n483j119k4302k6693k0682m146j1189j1357
13603a8925J9232l8k9102k2850L6829J1810n996J009J3760o333k9505K8769K190
13590H50L1768k9387n3977K3234j8449l3623N6208M9990m5125Q376L9834K9844
13578E9543L5047o649K0868l1175n1678k4175o7843M7353K4435j3705J9978M7305
13566E9304k5264k411j4152L5185J2199l3780N349N9404j6912m4876l2166j8139
$$ plain form
13554 -16259 -1128 43664 97454 72866 30750 57140 99618 141583 138959 88154 1819 -35854
13542 -35854 -49760 -43422 29522 -12862 -60721 -41354 -3900 27767 -25222 -2983 22369 21845
13530 21845 -800 32653 52122 72661 63387 47368 55292 41166 51142 37530 -6951 -30941
13518 -30941 -50806 -87227 -83212 5853 -16871 24134 53422 19887 -26368 -67423 -77092 -35279
13506 -35279 -63201 -50780 -24465 38010 -14155 21071 64208 56438 30121 51317 84019 49069
13494 49069 43429 21160 -22135 -92580 -69448 -91288 -51080 -67952 -81794 -98615 -105794 -68422
13482 -68422 -23895 35261 32606 46377 57600 63661 49026 -4070 2757 9873 -37935 -37695 -49369
13469 -49369 17447 24110 -34010 -1083 12631 10856 -43576 -86098 -72916 -42099 41142 26113
$$ packed form
13554a6259J5131M4792N3790k4588m2116K6390M2478M1965k624n0805q6335l7673
13542c5854j3906O338P2944m2384m7859J9367L7454L1667n2989K2239K5352n24
13530B1845k2645L3453J9469K0539r274j6019P924j4126R976j3612m4481k3990
13518c0941j9865l6421M015Q9065k2724M1005K9288l3535m6255m1055r669M1813
13506c5279k7922J2421K6315O2475n2165L5226M3137p770k6317K1196L2702l4950
13494D9069n640k2269m3295p0445K3132k1840M0208j6872j3842j6821p179L7372
13482f8422M4527N9156k655J3771J1223O061j4635n3096O827P116m7808K40j1674
13469d9369O6816O663n8120L2927J3714j775n4432m2522J3182L0817Q3241j5029
$$ plain form
13457 26113 -46548 -47649 -35650 -38652 -17136 -7849 15916 36074 43717 30048 -47415 -68557
13445 -68557 -25356 19012 35080 51063 73891 51401 15525 -55861 -101126 -88433 -78254 -106612
13433 -106612 -72022 -26206 -60735 -47463 7668 -34780 -27048 -25208 1114 -28330 -35958 -34723
13421 -34723 330 -3929 10383 35781 -29362 -62714 4406 38760 -11078 -13225 -28150 -33398
13409 -33398 -18087 18841 -2542 -18101 -23055 -11364 -44 -50432 -33936 -26013 -44962 -77208
13397 -77208 -110376 -118457 -53323 10973 -6126 10779 9961 -2330 55939 30300 34233 28666 9151
13384 9151 -9067 35084 58842 99785 94807 56088 13347 -17553 -43041 -40488 -35741 2184
13372 2184 37305 36215 33520 5739 14626 32508 35513 48714 5893 -19988 16896 -8590 20955
$$ packed form
13457B6113p2661j101J1999l002K1516R287K3765K0158P643j3669p7463k1142
13445f8557M3201M4368J6068J5983K2828k2490l5876p1386m5265J2693J0179k8358
13433a06612L4590M5816l4529J3272N5131m2448P732J840K6322k9444p628J235
13421c4723L5053m259J4312K5398o5143l3352O7120L4354m9838k147j4925n248
13409c3398J5311L6928k1383j5559m954J1691J1320n0388J6496P923j8949l2246
13397g7208l3168q081O5134O4296j7099J6905q18j2291N8269k5639L933n567j9515
13384I151j8218M4151K3758M0943m978l8719m2741l0900k5488K553M747L7925
13372B184L5121j090k695k7781Q887J7882L005J3201m2821k5881L6884k5486K9545
$$ plain form
13359 20955 73713 90653 63077 10144 20062 58537 98040 144878 162697 152734 96511 97023
13347 97023 109975 96408 51918 1412 -27571 -32836 -80680 -100007 -113732 -107849 -58534 -14819
13335 -14819 9817 35721 68700 74646 42486 42103 44622 61739 64767 54883 44962 18830 75752
13322 75752 82255 51960 19825 -24731 -55219 -96345 -85816 -546 24634 25162 4822 42116
13310 42116 69004 48994 25798 21479 45598 51209 30566 33510 42308 50809 49398 21464 51068
13297 51068 80631 58662 29767 22890 19752 42830 20572 7783 29575 49477 38954 57444
13285 57444 28901 -287 35762 72795 109291 172059 188506 153333 136151 155717 227344 281658
13273 281658 316748 388087 434650 492729 639400 866790 1129162 1304544 1396136 1399422 1262759
$$ packed form
13359B0955N2758J6940k7576n2933R918L8475L9503M6838J7819r963n6223N12
13347I7023J2952j3567m4490n0506k8983n265m7844j9327j3725N883M9315M3715
13335a4819K4636K5904L2979N946l2160l83K519J7117L028r884r921k6132N6922
13322G5752O503l0295l2135m4556l0488m1126J0529Q5270K5180N28k0340L7294
13310D2116K6888k0010k3196m319K4119N611k0643K944Q798Q501j411k7934K9604
13297E1068K9563k1969k8895o877l138K3078k2258j2789K1792J9902j0523J8490
13285E7444k8543k9188L6049L7033L6496O2768J6447l5173j7182J9566P1627N4314
13273B81658L5090P1339M6563N8079J46671K27390K62372J75382R1592L286j36663
$$ plain form
13262 1262759 1075340 908641 731009 521519 436557 394883 343292 265084 248394 189927
13252 189927 140537 160986 92776 48856 36594 23058 55157 90945 110182 107091 128876 116186
13240 116186 68827 121378 148995 129370 149546 81982 25983 5733 16282 37325 26449
13229 26449 27702 71730 47149 -3150 22781 16967 -24568 -24879 -30799 2839 -7226 22348 93682
13216 93682 97896 88888 83544 72057 60252 41287 -11105 -19121 34116 37878 85086 90051 45125
13203 45125 38697 78918 72351 102062 44909 34048 -22287 -9461 -21312 -32584 -57837 -75890
13191 -75890 -75671 -56233 -12395 25120 52602 5076 25975 64460 58401 49490 21974 71118
13179 71118 76673 12797 3001 17495 23571 25547 23282 47667 58081 58710 111918 128224 62853
$$ packed form
13262A262759j87419j66699j77632k09490q4962m1674n1591p8208j6690n8467
13252A89927m9390K0449o8210m3920j2262j3536L2099L5788J9237l091K1785j2690
13240A16186m7359N2551K7617j9625K0176o7564n5999k0250J0549K1043j0876
13229B6449J253M4028k4581n0299K5931n814m1535l11n920L3638j0065K9574P1334
13216I3682M214r008n344j1487j1805j8965n2392q016N3237L762M7208M965m4926
13203D5125o428M0221o567K9711n7153j0861n6335J2826j1851j1272k5253j8053
13191g5890K19J9438M3838L7515K7482m7526K0899L8485o059q911k7516M9144
13179G1118N555o3876r796J4494O076J976k265K4385J0414O29N3208J6306o5371
$$ plain form
13166 62853 38434 47301 69660 92014 109439 104216 94032 69532 91623 96572 78494 118386
13154 118386 115914 97402 92725 133814 163909 118934 114361 95643 74972 78088 81199 54734
13142 54734 89604 90801 128929 143548 89012 49095 14426 -26539 -27619 56100 91002 76131
13130 76131 27408 18004 40472 61859 43658 23991 67207 39409 6309 43499 51473 78076
13118 78076 69637 41553 12716 16833 61919 122071 120170 86301 65080 51977 61893 26613
13106 26613 -19862 23412 90998 50757 -23102 -26043 -14220 -12327 -8277 27489 -2642 3018
13094 3018 15553 52808 94745 41005 2449 16993 29801 28529 98006 71427 84325 79733
13082 79733 100337 85873 77167 82923 57874 22513 -192 23736 5758 -27266 12420 -11557
$$ packed form
13166F2853k4419Q867K2359K2354J7425n223j0184k4500K2091M949j8078L9892
13154A18386k472j8512m677M1089L0095m4975m573j8718k0671L116L111k6465
13142E4734L4870J197L8128J4619n4536l9917l4669m0965j080Q3719L4902j4871
13130G6131m8723r404K2468K1387j8201j9667M3216k7798l3100L7190P974K6603
13118G8076q439k8084k8837M117M5086O0152j901l3869k1221j3103R916l5280
13106B6613m6475M3274O7586m0241p3859k941J1823J893M050L5766l0131N660
13094C018J2535L7255M1937n3740l8556J4544J2808j272O9477k6579J2898m592
13082G9733K0604j4464q706N756k5049l5361k2705K3928j7978l3024L9686k3977
$$ plain form
13070 -11557 -83629 -95635 -4402 76716 71317 6548 26569 49162 73429 126973 133346 127657
13058 127657 126725 139021 155772 153126 141677 119530 131046 51259 81980 139887 163298 135984
13046 135984 101327 164879 128276 141938 192319 169347 134291 126962 168998 158941 160254 147496
13034 147496 86389 106016 131439 138666 116801 94323 79283 95673 118759 109121 78655 91969
13022 91969 83406 59796 81524 111456 67239 42521 6182 -36989 -27776 34768 93585 104047
13010 104047 136179 132628 79938 84936 108490 41913 49065 44042 52925 71847 58609 12718
12998 12718 56895 68732 225 26627 32712 76819 146008 104508 45465 47864 98441 94247
12986 94247 67217 65058 50579 -6852 -13197 17856 30344 40295 95127 52867 38112 94362
$$ packed form
13070a1557p2072j2006R1233Q1118n399o4769K0021K2593K4267N3544O373n689
13058A27657r32J2296J6751k646j1449k2147J1516p9787L0721N7907K3411k7314
13046A35984l4657O3552l6603J3662N0381k2972l5056p329M2036j0057J313j2758
13034A47496o1107J9627K5423P227k1865k2478j5040J6390K3086r638l0466J3314
13022I1969q563k3610K1728K9932m4217k4718l6339m3171R213O2544N8817J0462
13010A04047L2132l551n2690M998K3554o6577P152n023Q883J8922j3238m5891
12998A2718M4177J1837o8507K6402O085M4107O9189m1500n9043K399N0577m194
12986I4247k7030k159j4479n7431o345L1053J2488R951N4832m2260j4755N6250
$$ plain form
12974 94362 88571 57752 58985 99905 90827 111166 126369 118399 117752 119829 158452 168096 174327
12961 174327 153265 152481 110089 74276 99684 143725 177975 192542 190263 236249 245495 164476
12949 164476 160903 208536 186247 157782 147177 179395 139085 93567 130875 159726 212828 271950
12937 271950 283803 401092 500941 535978 554549 596093 666309 718815 738826 832112 931003
12926 931003 909547 838935 786114 702441 642325 532790 468319 466151 418905 385637 332308
12915 332308 319643 293768 297599 303254 315792 380759 390463 354716 286316 252850 221634 243529
12903 243529 324191 374972 386060 355184 324834 335384 388458 395474 371408 311669 300948 273020
12891 273020 269611 302366 308848 291285 315884 340124 372061 419456 392111 419564 478101 509560
$$ packed form
12974I4362n791l0819J233M0920r078K0339J5203p970o47K077L8623R644O231
12961A74327k1062p84m2392l5813K5408M4041L4250J4567k279M5986R246q1019
12949A64476l573M7633k2289k8465j0605L2218m0310m5518L7308K8851N3102N9122
12937B71950J1853J17289R9849L5037J8571M1544P0216N2506K0011R3286R8891
12926I31003k1456p0612n2821q3673o0116j09535o4471k168m7246l3268n3329
12915C32308j2665k5875L831N655J2538O4967R704l5747o8400l3466l1216K1895
12903B43529Q0662N0781J1088l0876l0350J0550N3074P016k4066n9739j0721k7928
12891B73020l409L2755O482j7563K4599K4240L1937M7395k7345K7453N8537L1459
$$ plain form
12879 509560 485182 481733 547781 522162 496236 511954 489790 450515 444866 472524 503746 516703
12867 516703 533150 592916 551143 582526 651016 650243 735941 772341 773192 811898 914966 973167
12855 973167 984355 976135 951571 1058712 1174434 1203074 1252884 1348823 1450883 1592179 1692186
12844 1692186 1765976 1822786 1879559 1933033 2046217 2187949 2383164 2583649 2768652 2907562
12834 2907562 3067269 3248563 3519204 3812702 4099504 4414326 4768669 5214512 5706038
12825 5706038 6317099 7018355 7787465 8822394 10106372 11561383 13352813 15446323 17892840
12816 17892840 20749943 24229159 28755475 34863325 43193989 54839130 71277739 94543721
12808 94543721 126993292 170215648 221630479 268538917 289777218 279674806 250440930
$$ packed form
12879E09560k4378l449O6048k5619k5926J5718k2164l9275n649K7658L1222J2957
12867E16703J6447N9766m1773L1383O8490p73Q5698L6400Q51L8706J03068N8201
12855I73167J1188q220k4564J07141J15722K8640M9810R5939J02060J41296J00007
12844A692186P3790N6810N6773N3474J13184J41732J95215K00485J85003J38910
12834B907562J59707J81294K70641K93498K86802L14822L54343M45843M91526
12825E706038O11061P01256P69110J034929J283978J455011J791430K093510K446517
12816A7892840K857103L479216M526316O107850Q330664J1645141J6438609K3265982
12808I4543721L2449571M3222356N1414831M6908438K1238301j0102412k9233876
$$ plain form
12801 250440930 213075178 174535638 138750115 109115686 86240961 68984991 56048749
12794 56048749 46222524 38681065 32808566 28105500 24277468 21140195 18651861 16694024
12786 16694024 15228745 14243840 13652226 13315072 12854096 11989742 10910730 9812225 8713001
12777 8713001 7716778 6830381 6074531 5404652 4917557 4562426 4259931 3939398 3673079
12768 3673079 3431193 3218461 3038760 2880833 2725638 2552792 2470557 2383311 2317605 2277139
12758 2277139 2187480 2073845 1995100 1904484 1845057 1801626 1713208 1640061 1598542 1535893 1504024
12747 1504024 1443314 1400553 1340077 1284876 1280344 1285695 1252694 1160211 1150128 1148380 1108880 1109054
12735 1109054 1161566 1116424 1101332 1067376 951992 888129 849292 853628 823736 784916 788952
$$ packed form
12801B50440930l7365752l8539540l5785523k9634429k2874725j7255970j2936242
12794E6048749r826225p541459n872499m703066l828032l137273k488334j957837
12786A6694024j465279r84905n91614l37154m60976q64354j079012j098505j099224
12777H713001r96223q86397p55850o69879m87095l55131l02495l20533k66319
12768C673079k41886k12732j79701j57927j55195j72846q2235q7246o5706m0466
12758B277139q9659j13635p8745r0616n9427m3431q8418p3147m1519o2649l1869
12747A504024o0710m2761o0476n5201m532N351l3001r2483j0083j748l9500J74
12735A109054N2512m5142j5092l3956j15384o3863l8837M336k9892l8820M036
$$ plain form
12724 788952 791060 779486 750862 714158 675463 676824 717086 750761 699660 634183 590243 652291
12712 652291 650623 620793 613048 571465 603496 555653 459510 506804 539219 548037 562846 575604
12700 575604 564319 519661 532403 498232 431494 434199 461677 501637 497574 487850 516599 491613
12688 491613 513979 556133 571154 577440 513619 507097 466186 408447 304167 234484 253118 312543
12676 312543 322159 256663 245364 280176 260352 240365 251801 246770 256849 240141 285750 320571
12664 320571 304355 280237 261975 227521 210286 264268 331465 359593 363450 324308 225532 195600
12652 195600 200893 218379 235662 237311 263205 253058 219166 234632 234556 227331 215592 187276 187626
12639 187626 233302 195683 139377 226310 266842 251268 230953 248089 273698 206231 230495
$$ packed form
12724G88952K108j1574k8624l6704l8695J361M0262L3675n1101o5477m3940O2048
12712F52291j668k9830p745m1583L2031m7843r6143M7294L2415Q818J4809J2758
12700E75604j1285m4658J2742l4171o6738K705K7478L9960m063r724K8749k4986
12688D91613K2366M2154J5021O286o3821o522m0911n7739j04280o9683J8634N9425
12676C12543R616o5496j1299L4812j9824j9987J1436n031J0079j6708M5609L4821
12664C20571j6216k4118j8262l4454j7235N3982O7197K8128L857l9142r8776k9932
12652A95600N293J7486J7283J649K5894j0147l3892J5466p6p225j1739k8316L50
12639A87626M5676l7619n6306Q6933M0532j5574k0315J7136K5609o7467K4264
$$ plain form
12628 230495 238544 238318 224320 200217 210452 177420 174622 187395 233202 204865 191239 205385
12616 205385 209346 126628 88628 77048 94649 165722 216345 216160 218435 209738 136362 132307 165701
12603 165701 239441 253365 208620 183698 149048 110816 165896 205379 201786 189896 194629 234064
12591 234064 248784 227219 172182 157610 198941 171438 180071 187022 176435 168991 120888 104392
12579 104392 121305 183691 173473 208313 211794 218335 242039 235161 222704 210444 205216 240533
12567 240533 213751 123214 123578 209706 260207 279570 220982 156904 129452 114309 82376 88025
12555 88025 128118 120541 129216 180736 209661 215589 188321 232640 187629 188372 202415 176699 133887
12542 133887 117786 115747 132621 133189 86633 61455 64266 83839 109547 114266 136444 155388
$$ packed form
12628B30495Q049k26j3998k4103J0235l3032k798J2773M5807k8337j3626J4146
12616B05385L961q2718l8000j1580J7601P1073N0623j85K275q697p3376m055L3394
12603A65701P3740J3924m4745k4922l4650l8232N5080L9483l593j1890M733L9435
12591B34064J4720k1565n5037j4572M1331k7503Q633O951j0587p444m8103j6496
12579A04392J6913O2386j0218L4840L481O541K3704o878j2457j2260n228L5317
12567B40533k6782r0537L64Q6128N0501J9363n8588o4078k7452j5143l1933N649
12555H8025M0093p577Q675N1520K8925N928k7268M4319m5011P43J4043k5716m2812
12542A33887j6101k039J6874N68m6556k5178K811J9573K5708M719K2178J8944
$$ plain form
12530 155388 121060 123231 73930 44215 117762 165607 201107 170596 130082 117287 89594 68736
12518 68736 106376 108094 102683 79981 60189 63552 106612 142149 110528 61493 90486 74202
12506 74202 61558 74443 80037 46014 96560 128669 101459 78841 135284 208349 231427 198289
12494 198289 126357 81325 106857 130753 168730 134557 93265 69512 137356 161340 125163
12483 125163 87888 108820 142959 189870 158578 171007 236003 195861 170061 172610 221825 238578
12471 238578 261173 280165 246646 208009 220309 250737 167121 87176 43811 50967 68607 92245
12459 92245 118504 161165 102183 77264 124290 172018 150815 119062 157789 205551 192900 204906
12447 204906 220598 202094 207885 176734 181767 188860 171634 171584 170115 154906 117624 143767 154216
$$ packed form
12530A55388l4328K171m9301k9715P3547M7845L5500l0511m0514j2795k7693k0858
12518F8736L7640J718n411k2702j9792L363M3060L5537l1621m9035K8993j6284
12506G4202j2644J2885N594l4023N0546L2109k7210k2618N6443P3065K3078l3138
12494A98289p1932m5032K5532K3896L7977l4173m1292k3753O7844K3984l6177
12483A25163l7275K0932L4139M6911l1292J2429O4996m0142k5800K549M9215J6753
12471B38578K2595J8992l3519l8637J2300L0428q3616p9945m3365P156J7640K3638
12459I2245K6259M2661n8982k4919M7026M7728k1203l1753L8727M7762j2651J2006
12447B04906J5692j8504N791l1151N033P093j7226n0j469j5209l7282K6143J0449
$$ plain form
12434 154216 192428 183862 140606 69961 22002 66570 151248 192851 182226 214310 207295 183074
12422 183074 145281 129845 127851 155745 154276 140433 152894 152940 88101 60238 77679 128334
12410 128334 156971 140617 141687 136906 132753 155664 168191 219768 224704 215568 200841 173436
12398 173436 172831 140101 106423 129443 151104 161768 153100 132410 143124 146984 126747 110939
12386 110939 78929 68858 91334 108638 125237 132554 118243 149601 211491 256839 331693 333499
12374 333499 261654 164852 204148 218709 209091 302438 271647 216696 189420 205395 193140 244175
12362 244175 239620 241515 208983 156972 207038 268846 237673 255638 278246 325532 327103 236960
12350 236960 264144 277394 254772 247908 271121 361264 441676 523725 578014 603450 728898
$$ packed form
12434A54216L8212q566m3256p0645m7959M4568Q4678M1603j0625L2084p015k4221
12422A83074l7793j5436j994K7894j469j3843J2461M6o4839k7863J7441N0655
12410A28334K8637j6354J070m781m153K2911J2527N1577M936r136j4727k7405
12398A73436o05l2730l3678K3020K1661J0664q668k0690J0714L860k0237j5808
12386A10939l2010j0071K2476J7304J6599P317j4311L1358O1890M5348P4854J806
12374C33499p1845r6802L9296J4561r618R3347l0791n4951k7276J5975j2255N1035
12362B44175m555J895l2532n2011N0066O1808l1173J7965K2608M7286J571r0143
12350B36960K7184J3250k2622o864K3213R0143Q0412Q2049N4289K5436J25448
$$ plain form
12339 728898 891136 1093049 1295243 1404554 1458052 1483056 1433690 1305814 1113539 927400
12329 927400 751034 637791 599414 517024 440138 453280 408837 347882 319360 339997 346765
12318 346765 328477 313573 298012 266287 227995 186673 256551 289119 275049 313074 281656
12307 281656 281865 242832 169718 152630 166674 178262 193265 221415 195040 235925 245252 252206
12295 252206 280213 272928 287141 297119 302949 257045 244213 201194 206167 254491 233026 230159
12283 230159 222051 174807 162302 176494 192185 253053 299396 294460 307579 288259 243902 243635
12271 243635 271053 254516 219130 199863 154556 150255 199231 263733 283325 281913 276944 231456
12259 231456 259021 271136 273519 266193 244856 230183 289876 299503 331047 366318 362285 351204
$$ packed form
12339G28898J62238K01913K02194J09311N3498K5004m9366j27876j92275j86139
12329I27400j76366j13243l8377q2390p6886J3142m4443o0955k8522K0637O768
12318C46765j8288j4904j5561l1725l8292m1322O9878L2568j4070L8025l1418
12307B81656K09l9033p3114j7088J4044J1588J5003K8150k6375M0885R327O954
12295B52206K8007p285J4213R978N830m5904j2832m3019M973M8324k1465k867
12283B30159q108m7244j2505J4192J5691O0868M6343m936J3119j9320m4357k67
12271B43635K7418j6537l5386j9267m5307m301M8976O4502J9592j412m969m5488
12259B31456K7565J2115K383p326k1337j4673N9693R627L1544L5271m033j1081
$$ plain form
12247 351204 323627 337244 298995 322857 302200 296704 341249 356326 319495 284748 252443 230276
12235 230276 232695 203792 237209 317179 333473 356221 442361 392924 302334 318091 376604 375626
12223 375626 342701 352939 352990 361859 375713 403081 349806 330393 371835 337174 366786 399098
12211 399098 388314 392700 411735 396312 365469 389427 391276 454050 439950 425049 462091 421890
12199 421890 376009 410827 449629 423682 384150 330167 351679 376797 362438 346405 340747 358688
12187 358688 354296 378025 403008 395687 409246 397283 363523 345706 403161 459291 460705 436493
12175 436493 496977 504120 492314 510187 539868 552476 548255 537903 534795 537722 556949 531776
12163 531776 532531 554033 513796 490227 442266 463568 475999 464933 431952 445750 532739 537037
$$ packed form
12247C51204k7577J3617l8249K3862k0657n496M4545J5077l6831l4747l2305k2167
12235B30276K419k8903L3417P9970J6294K2748Q6140m9437r0590J5757N8513r78
12223C75626l2925J0238N1Q869J3854K7368n3275j9413M1442l4661K9612L2312
12211C99098j0784M386J9035j5423l0843K3958J849O2774j4100j4901L7042m0201
12199D21890m5881L4818L8802k5947l9532n3983K1512K5118j4359j6033n658J7941
12187C58688m392K3729K4983p321J3559j1963l3760j7817N7455N6130J414k4212
12175D36493O0484P143j1806J7873K9681J2608m221j0352l108K927J9227k5173
12163E31776P55K1502m0237k3569m7961K1302J2431j1066l2981J3798Q6989M298
$$ plain form
12151 537037 582663 603155 560682 596090 553194 545395 595280 594944 557308 540214 566761 559817
12139 559817 548114 576574 605624 591658 597643 571274 565418 569581 621234 662404 611309 662929
12127 662929 701768 737648 712203 666676 671718 727957 760752 792275 793225 754490 757113 796825
12115 796825 823001 797405 845272 916805 942200 865049 816529 880367 903934 894157 830094 814719
12103 814719 881949 909180 902096 931198 991005 940555 923153 922015 907155 853412 899177 895461
12091 895461 900133 882880 865618 902913 947683 1017962 1041605 1011815 1001971 1091995 1152474 1142452
12079 1142452 1136658 1128996 1202033 1258131 1227126 1164670 1180182 1227413 1242699 1226644 1196216 1224455
12067 1224455 1219120 1220518 1208362 1305863 1303177 1307468 1412241 1466997 1476438 1442862 1442168 1470842
$$ packed form
12151E37037M5626K0492m2473L5408m2896p799M9885l36l7636j7094K6547o944
12139E59817j1703K8460K9050j3966N985k6369n856M163N1653M1170n1095N1620
12127F62929L8839L5880k5445m5527N042N6239L2795L1523R50l8735K623L9712
12115G96825K6176k5596M7867P1533K5395p7151m8520O3838K3567r777o4063j5375
12103H14719O7230K7231p084K9102N9807n0450j7402j138j4860n3743M5765l716
12091H95461M672j7253j7262L7295M4770P0279K3643k9790r844R0024O0479j0022
12079A142452n794p662P3037N6098l1005o2456J5512M7231J5286j6055l0428K8239
12067A224455n335J398j2156R7501k686M291J04773N4756R441l3576o94K8674
$$ plain form
12055 1470842 1457435 1431308 1401004 1410177 1481805 1592569 1584211 1591570 1647881 1711313 1691924 1693993
12043 1693993 1726099 1764906 1782861 1810165 1826137 1794493 1811228 1863208 1889794 1949721 1988587
12032 1988587 2055285 2131510 2190781 2219258 2264933 2231554 2217731 2283812 2414465 2412224 2360473
12021 2360473 2390591 2464080 2491004 2484729 2492888 2505012 2508505 2560137 2637593 2722101 2811986 2841785
12009 2841785 2913492 2920559 2933967 3022345 3107421 3117631 3161188 3291459 3316375 3328970 3434885
11998 3434885 3509026 3554461 3584318 3687497 3799115 3887500 3928546 3976702 3992687 4030895 4106022
11987 4106022 4179394 4306653 4454443 4570967 4578382 4596321 4742176 4894341 4985163 5041155
11977 5041155 5084907 5176932 5328271 5426565 5532182 5596917 5685707 5879534 6021030 6061679
$$ packed form
12055A470842j3407k6127l0304R173P1628J10764q358P359N6311O3432j9389K069
12043A693993L2106L8807J7955K7304J5972l1644J6735N1980K6586N9927L8866
12032A988587O6698P6225N9271K8477M5675l3379j3823O6081J30653k241n1751
12021B360473L0118P3489K6924o275Q159J2124L493N1632P7456Q4508Q9885K9799
12009B841785P1707P067J3408Q8378Q5076J0210M3557J30271K4916J2595J05915
11998C434885P4141M5435K9857J03179J11618Q8385M1046M8156J5985L8208P5127
11987D106022P3372J27259J47790J16524P415J7939J45855J52165R0822N5992
11977E041155M3752R2025J51339R8294J05617O4735Q8790J93827J41496M0649
$$ plain form
11967 6061679 6160935 6306956 6452722 6535909 6602372 6756493 6881830 6975954 7123010 7293151
11957 7293151 7455877 7580656 7757751 7919835 8051946 8166201 8282332 8405424 8552891
11948 8552891 8661646 8794601 8894446 8968436 9060000 9212712 9325653 9456759 9641781 9725312
11938 9725312 9826042 9922860 10039998 10118823 10208173 10330159 10365434 10407091 10491435 10591848
11928 10591848 10674145 10724272 10748353 10782017 10802421 10810599 10824079 10832005 10764288 10773981 10766916 10699223
11916 10699223 10655602 10671804 10676325 10600628 10437705 10316522 10221185 10152589 10091927 10047977 9963757
11905 9963757 9847535 9698777 9590214 9518844 9371092 9218084 9097579 9020101 8971638 8898555
11895 8898555 8707650 8530150 8404937 8253320 8049705 7883576 7784686 7727776 7598435 7473427
$$ packed form
11967F061679R9256J46021J45766Q3187O6463J54121J25337R4124J47056J70141
11957G293151J62726J24779J77095J62084J32111J14255J16131J23092J47467
11948H552891J08755J32955R9845P3990R1564J52712J12941J31106J85022Q3531
11938I725312J00730R6818J17138P8825Q9350J21986L5275M1657Q4344J00413
11928A0591848Q2297N0127K4081L3664K0404Q178J3480P926o7717R693p065o7693
11916A0699223m3621J6202M521p5697j62923j21183r5337o8596o0662m3950q4220
11905I963757j16222j48758j08563p1370j47752j53008j20505p7478m8463p3083
11895H898555j90905j77500j25213j51617k03615j66129r8890n6910j29341j25008
$$ plain form
11885 7473427 7321749 7217547 7056716 6890624 6836371 6702105 6571044 6507243 6427899 6248492
11875 6248492 6086657 5966980 5879667 5830048 5698532 5581858 5473434 5380270 5250292 5126349
11865 5126349 5055647 4942950 4812386 4707010 4651842 4590032 4522631 4416939 4343117 4267727
11855 4267727 4153652 4067177 4053829 4009168 3904247 3854560 3803332 3689453 3643150 3624066 3514014
11844 3514014 3397432 3279157 3237636 3288765 3256319 3216402 3215820 3120483 3004449 2970910 2920645
11833 2920645 2849332 2765724 2734317 2724718 2693265 2668200 2619007 2495724 2430324 2443068 2408541
11822 2408541 2357549 2368845 2336604 2237170 2230369 2230919 2213184 2176974 2080598 2013880 2002069 2033348
11810 2033348 2022273 1961162 1928750 1910088 1955801 1902605 1855944 1817049 1742787 1705643 1708997
$$ packed form
11885G473427j51678j04202j60831j66092n4253j34266j31061o3801p9344j79407
11875F248492j61835j19677q7313m9619j31516j16674j08424r3164j29978j23943
11865E126349p0702j12697j30564j05376n5168o1810o7401j05692p3822p5390
11855D267727j14075q6475j3348m4661j04921m9687n1228j13879m6303j9084j10052
11844C514014j16582j18275m1521N1129l2446l9917n82r5337j16034l3539n0265
11833B920645p1313q3608l1407r599l1453k5065m9193j23283o5400J2744l4527
11822B408541n0992J1296l2241r9434o801N50j7735l6210r6376o6718j1811L1279
11810B033348j1075o1111l2412j8662M5713n3196m6661l8895p4262l7144L354
$$ plain form
11799 1708997 1757408 1752669 1728029 1693238 1643507 1593822 1573420 1524745 1515693 1517827 1456941 1415900
11787 1415900 1458986 1468204 1403966 1386590 1354407 1351830 1368338 1380009 1350851 1300560 1266287 1296171
11775 1296171 1371420 1351263 1296726 1322319 1262694 1221908 1224592 1218583 1211561 1201870 1105743 1127561
11763 1127561 1133855 1102803 1077922 1037615 1110166 1113460 993457 974189 981668 963661 949485 889016
11751 889016 874453 897643 915995 943569 909789 900003 968080 926762 898597 817988 773627 798081
11739 798081 829207 836506 853229 843249 845214 800141 740807 762621 766370 719711 706483 672626
11727 672626 661653 699696 728365 713008 729545 798243 828526 755714 682674 660406 622824
11716 622824 623843 680297 709197 700696 625082 611723 641203 665732 667568 682082 678962 721730
$$ packed form
11799A708997M8411m739k4640l4791m9731m9685k0402m8675r052K134o0886m1041
11787A415900M3086R218o4238j7376l2183k577J6508J1671k9158n0291l4273K9884
11775A296171P5249k0157n4537K5593n9625m0786K684o009p022r691r6127K1818
11763A127561O294l1052k4881m0307P2551L294j20003j9268P479j8007j4176o0469
11751H89016j4563K3190J8352K7574l3780r786O8077m1318k8165q0609m4361K4454
11739G98081L1126P299J6723r980J965m5073n9334K1814L749m6659j3228l3857
11727F72626j0973L8043K8669j5357J6537O8698L0283p2812p3040k2268l7582
11716F22824J019N6454K8900q501p5614j3359K9480K4529J836J4514l120M2768
$$ plain form
11704 721730 759540 740298 695360 692361 657631 605120 607585 607286 581602 571069 532122 536988
11692 536988 547880 545896 512267 552747 547027 534353 517738 485003 429166 395149 381046 408593
11680 408593 437004 416157 419736 437163 474086 475934 510892 504507 511136 553778 583557 565197
11668 565197 476975 442748 447078 474811 500464 490352 497393 501099 467908 447474 417575 400782
11656 400782 395329 391110 352826 375537 414533 437577 435336 407342 345368 327542 266960 268614
11644 268614 321319 399275 423043 370762 369690 392271 414997 416054 380641 347994 360113 358275
11632 358275 270305 296675 333739 375232 365003 309934 310210 317550 307256 331080 339046 286623
11620 286623 281475 272458 229654 217149 211385 233435 235950 221755 211112 209527 191621 190094 208925
$$ packed form
11704G21730L7810j9242m4938k999l4730n2511K465k99k5684j0533l8947M866
11692E36988J0892j984l3629M0480n720j2674j6615l2735n5837l4017j4103K7547
11680D08593K8411k0847L579J7427L6923J848L4958o385O629M2642K9779j8360
11668E65197q8222l4227M330K7733K5653j0112P041L706l3191k0434k9899j6793
11656D00782n453m219l8284K2711L8996K3044k241k7994o1974j7826o0582J654
11644B68614N2705P7956K3768n2281j072K2581K2726J057l5413l2647J2119j838
11632C58275q7970K6370L7064M1493j0229n5069K76P340j0294K3824P966n2423
11620B86623n148r017m2804j2505n764K2050K515j4195j0643j585j7906j527J8831
$$ plain form
11607 208925 224202 196671 156245 134132 179524 228901 284569 285932 277346 227674 206555 291662
11595 291662 317801 277875 221897 244672 255872 241165 217062 218553 207064 238080 278163 238498
11583 238498 224658 241748 264826 243176 159073 111833 150097 161076 169763 193754 222171 253896
11571 253896 259233 297576 337483 281247 297734 279071 205545 227246 230094 226296 256063 272278
11559 272278 291167 260879 222800 259363 285019 293923 249261 212240 213289 202108 139055 138225
11547 138225 161112 226519 262571 237306 242836 240854 222776 226445 193065 157755 189648 174752
11535 174752 167769 157090 228081 227762 228161 259889 226932 195074 222700 228033 201729 235570 276292
11522 276292 270965 238148 248731 274306 271799 260006 247825 163309 165352 127932 122593 187467
$$ packed form
11607B08925J5277k7531m0426k2113M5392M9377N5668J363q586m9672k1119Q5107
11595B91662K6139l9926n5978K2775J1200j4707k4103J491j1489L1016M0083l9665
11583B38498j3840J7090K3078k1650q4103m7240L8264J0979Q687K3991K8417L1725
11571B53896N337L8343L9907n6236J6487j8663p3526K1701K848l798K9767J6215
11559B72278J8889l0288l8079L6563K5656Q904m4662l7021J049j1181o3053q30
11547A38225K2887O5407L6052k5265N530j982j8078L669l3380l5310L1893j4896
11535A74752o983j0679P0991l19L99L1728l2957l1858K7626N333k6304L3841M0722
11522B76292n327l2817J0583K5575k507j1793j2181q4516K043l7420n339O4874
$$ plain form
11510 187467 200290 177481 163360 198117 175224 156035 170197 117918 71647 179957 169432
11499 169432 150659 174197 142070 96305 27191 49760 94424 154509 154765 137933 161552 143121
11487 143121 124758 126534 47611 35304 123840 143697 136149 113677 131932 141345 101779 72633
11475 72633 64636 109632 73481 136632 157870 174085 176759 183460 208524 221283 184239 152317
11463 152317 118007 115479 115897 64019 65028 174161 188344 168903 159983 113180 47097 35893
11451 35893 26180 -297 19046 46815 41600 82366 93613 156874 147446 108941 93484 114620
11439 114620 78068 46089 110110 154003 137740 122430 113326 168275 222629 189610 147553 115819
11427 115819 91915 87957 64107 87629 105510 123494 156651 173430 141997 158111 186082 137758
$$ packed form
11510A87467J2823k2809j4121L4757k2893j9189J4162n2279m6271J08310j0525
11499A69432j8773K3538l2127m5765o9114K2569M4664O0085K56j6832K3619j8431
11487A43121j8363J776p8923j2307Q8536J9857p548k2472J8255R413l9566k9146
11475G2633p997M4996l6151O3151K1238J6215K674O701K5064J2759l7044l1922
11463A52317l4310k528M18n1878J009J09133J4183j9441q920m6803o6083j1204
11451C5893r713k6477J9343K7769n215M0766J1247O3261r428l8505j5457K1136
11439A14620l6552l1979O4021M3893j6263j5310r104N4949N4354l3019m2057l1734
11427A15819k3904l958k3850K3522J7881J7984L3157J6779l1433J6114K7971m8324
$$ plain form
11415 137758 149496 151299 123666 126442 165265 191404 162455 74508 14714 57518 109759 124928
11403 124928 150923 148109 103653 142290 204945 163521 141868 155086 198420 242717 235100 198856
11391 198856 164388 126703 70290 83438 74170 32213 46711 82834 124880 144481 145387 119708
11379 119708 152824 135529 111980 107456 109609 83021 70685 87658 140621 163334 149126 171398
11367 171398 132142 101615 63711 95269 107148 110778 187703 195105 161487 134163 54945 80304
11355 80304 100410 58152 -16067 -34429 -1143 -12491 7507 75554 117825 108901 86572 132771
11343 132771 92130 89472 106153 133560 93745 65968 54074 73256 101689 101126 127272 147829
11331 147829 81312 39745 53504 69278 99183 60506 72052 69261 85615 92526 107149 125826
$$ packed form
11415A37758J1738J803k7633K776L8823K6139k8949q7947n9794M2804N2241J5169
11403A24928K5995k814m4456L8637O2655m1424k1653J3218M3334M4297p617l6244
11391A98856l4468l7685n6413J3148r268m1957J4498L6123M2046J9601R06k5679
11379A19708L3116j7295k3549m524K153k6588j2336J6973N2963K2713j4208K2272
11367A71398l9256l0527l7904L1558J1879L630P6925P402l3618k7324p9218K5359
11355H0304K0106m2258p4219j8362L3286j1348J9998O8047M2271q924k2329M6199
11343A32771m0641k658J6681K7407l9815k7777j1894J9182K8433n63K6146K0557
11331A47829o6517m1567J3759J5774K9905l8677J1546k791J6354O911J4623J8677
$$ plain form
11319 125826 91573 51002 79438 69460 66859 71406 53936 31281 97282 70779 -11362 -4279
11307 -4279 41597 19729 33626 96946 114893 132402 80641 55566 116612 104552 68539 82913
11295 82913 116434 102048 93160 122185 98632 64251 66855 53011 47282 73697 89888 101371
11283 101371 179668 205545 167753 40341 7228 23384 84068 148776 181964 226968 196053
11272 196053 93634 64689 28508 26388 39554 54288 89051 113667 133148 107316 96484
11261 96484 118108 145696 119465 86705 124556 131256 108725 128400 132571 91698 68878 42902
11249 42902 32967 22065 20505 36675 25821 52049 78637 96311 100456 110545 103452 107549 70728
11236 70728 93024 78417 48942 20110 73693 64860 33087 40352 47783 55909 88869 58766
$$ packed form
11319A25826l4253m0571K8436r978k601M547j7470k2655O6001k6503q2141P083
11307d279M5876k1868J3897O3320J7947J7509n1761k5075O1046j2060l6013J4374
11295H2913L3521j4386q888K9025k3553l4381K604j3844n729K6415J6191J1483
11283A01371P8297K5877l7792j27412l3113J6156O0684O4708L3188M5004l0915
11272A96053j02419k8945l6181k120J3166J4734L4763K4616J9481k5832j0832
11261I6484K1624K7588k6231l2760L7851O700k2531J9675M171m0873k2820k5976
11249D2902r935j0902j560J6170j0854K6228K6588J7674M145J0089p093M097l6821
11236G0728K2296j4607k9475k8832N3583q833l1773P265P431Q126L2960l0103
$$ plain form
11224 58766 33293 94885 73137 -2206 8843 26544 48599 65345 54516 38311 96106 95441
11212 95441 107227 132087 100077 52204 52573 101996 112257 115111 72366 19895 58940 122442
11200 122442 93274 62790 85447 79809 78666 48322 27006 10244 1136 -24125 -57692 -47889
11188 -47889 -12805 -12843 -74509 -102277 -103172 -92351 -73934 -74708 -72186 -30004 -7427 13410 26451
11175 26451 30757 62173 81561 42730 953 -29909 -22579 -9368 11904 -6296 -40392 15042
11163 15042 20979 52457 96663 95884 83712 103850 52452 -43679 -56701 11790 97965 112172
11151 112172 65531 96187 91417 77743 56066 11746 -29234 -36802 -15633 29938 30808 -2831
11139 -2831 -14139 -39609 -34080 -55078 -42025 -38581 16349 33567 31659 -10996 -44955 -30514
$$ packed form
11224E8766k5473O1592k1748p5343J1049J7701K2055J6746j0829j6205N7795o65
11212I5441J1786K4860l2010m7873L69M9423J0261K854m2745n2471L9045O3502
11200A22442k9168l0484K2657n638j143l0344k1316j6762r108k5261l3567R803
11188d7889L5084l8o1666k7768q95J0821J8417p74K522M2182K2577K0837J3041
11175B6451M306L1416J9388l8831m1777l0862P330J3211K1272j8200l4096N5434
11163A5042N937L1478M4206p79j2172K0138n1398r6131j3022O8491Q6175J4207
11151A12172m6641L0656m770j3674k1677m4320m0980p568K1169M5571Q70l3639
11139b831j1308k5470N529k0998J3053L444N4930J7218j908m2655l3959J4441
$$ plain form
11127 -30514 -894 -35091 -52483 -26943 -58389 -114463 -93240 19082 37647 35067 52001 9432
11115 9432 -37798 -41815 -17591 -12255 29589 81281 92974 88701 79235 63419 110505 150909 117621
11102 117621 64568 68368 56657 33125 45703 46219 52837 31590 96782 80345 30707 10916
11090 10916 68879 87928 62205 87141 85154 59033 119337 127061 106618 83833 50047 57049
11078 57049 113984 95004 113048 135049 59954 49854 39382 30630 49761 -736 -59293 -26588
11066 -26588 5802 22445 16514 -10350 -81697 -39617 22581 54166 60121 87505 22607 2017
11054 2017 48919 97553 118612 126859 124009 132781 124327 98146 108127 136347 172612 205501 227878
11041 227878 197996 151313 160007 171082 165644 182418 229968 269897 281056 323055 363458 405273
$$ packed form
11127c0514K9620l4197j7392K5540l1446n6074K1223J12322J8565k580J6934m2569
11115I432m7230m017K4224N336M1844N1692J1693m273r466j5816M7086M0404l3288
11102A17621n3053L800j1711k3532J2578N16O618k1247O5192j6437m9638j9791
11090A0916N7963J9049k5723K4936j987k6121O0304P724k0443k2785l3786P002
11078E7049N6935j8980J8044K2001p5095j0100j0472q752J9131n0497n8557L2705
11066b6588L2390J6643n931k6864p1347M2080O2198L1585N955K7384o4898k0590
11054B017M6902M8634K1059Q247k850Q772q454k6181R981K8220L6265L2889K2377
11041B27878k9882m6683Q694J1075n438J6774M7550L9929J1159M1999M0403M1815
$$ plain form
11029 405273 433995 394350 378326 374319 362818 338943 324210 355654 381449 423578 459229 455632
11017 455632 355920 306407 300869 237977 214222 237977 283785 351805 374722 373079 341091 309167
11005 309167 310406 278817 273995 241823 235527 236594 168588 194778 200684 158615 140834 155019
10993 155019 154533 109533 163515 209298 176304 160576 93853 94520 80950 33601 15448 21683
10981 21683 1674 3571 5282 46483 29146 54670 112686 65089 21000 24698 17381 39612
10969 39612 29541 55708 35801 25021 89746 131043 67132 28865 14427 35981 48744 55105
10957 55105 28696 3095 18098 6130 41751 98262 80018 35931 51142 17989 -5801 -22743
10945 -22743 -14804 -2512 -8360 -15852 24023 94995 71787 6599 32959 41256 42143 19374 14645
$$ packed form
11029D05273K8722l9645j6024m007j1501k3875j4733L1444K5795M2129L5651l597
11017D55632r9712m9513n538o2892k3755K3755M5808O8020K2917j643l1988l1924
11005C09167J239l1589m822l2172o296J067o8006K6190N906m2069j7781J4185
10993A55019m86m5000N3982M5783l2994j5728o6723O67j3570m7349j8153O235
10981B1683k0009J897J711M1201j7337K5524N8016m7597m4089L698p317K2231
10969C9612j0071K6167j9907j0780O4725M1297o3911l8267j4438K1554J2763O361
10957E5105k6409k5601J5003j1968L5621N6511j8244m4087J5211l3153k3790j6942
10945b2743P939J2292n848p492L9875P0972k3208o5188K6360Q297Q87k2769m729
$$ plain form
10932 14645 -35631 -35849 -40436 -65593 -45870 47296 121754 133854 72709 35329 54899 89688
10920 89688 112436 126006 41643 -8905 -13137 -22326 -6340 -22189 -15397 -74719 -64087 -34410
10908 -34410 -594 51567 55804 74388 46711 17502 -13537 12150 61755 28409 21831 9144
10896 9144 -11442 -5632 60071 52841 6030 -32398 -57704 39460 48191 47215 -26529 -96335 -142714
10883 -142714 -101929 -42829 -42998 -81454 -93340 -101218 -48976 -21728 15158 17232 14412 -11141
10871 -11141 -26035 10364 41996 17579 -40765 -56616 -45923 47434 20130 -28686 -20130 17023
10859 17023 986 71101 118128 46446 59794 77545 79380 89522 41777 39887 66721 93345
10847 93345 49237 -17147 31865 85934 74929 98297 97323 57442 42178 39898 39242 39692 121951
$$ packed form
10932A4645n0276k18m587k5157J9723R3166P4458J2100o1145l7380J9570L4789
10920H9688K2748J3570q4363n0548m232r189J5986j5849O792n9322J0632K9677
10908c4410L3816N2161M237J8584k7677k9209l1039K5687M9605l3346o578j2687
10896I144k0586N810O5703p230m6811l8428k5306R7164Q731r76p3744o9806m6379
10883a42714M0785N9100j69l8456j1886p878N2242K7248L6886K074k820k5553
10871a1141j4894L6399L1632k4417n8344j5851J0693R3357k7304m8816Q556L7153
10859A7023j6037P0115M7027p1682J3348J7751J835J0142m7745j890K6834K6624
10847I3345m4108o6384M9012N4069j1005K3368r74l9881j5264k280o56M50Q2259
$$ plain form
10834 121951 191224 200397 188727 121392 88342 33829 70634 52263 -13466 3887 55399 -5766
10822 -5766 -39034 1831 17515 48706 76958 3601 -39752 -18611 44795 39265 -26670 -54996
10810 -54996 -63668 -79031 -20538 5972 -14418 -7492 19691 15201 -11158 -38147 -18349 -4428
10798 -4428 1988 24546 56979 73090 48623 6403 19257 65330 129550 170778 120594 108703
10786 108703 34132 9013 18536 -15352 -29864 25330 72646 87477 77452 78509 34756 12798
10774 12798 14479 7005 -17552 -26323 10362 41635 17695 -29549 16881 61766 33486 32308
10762 32308 38496 42017 11047 39787 48146 51485 36573 33734 61733 58009 27080 15036 32257
10749 32257 90410 69483 1718 20466 75811 71029 66312 83777 119927 137723 108239 116518
$$ packed form
10834A21951O9273R173j1670o7335l3050n4513L6805j8371o5729J7353N1512o1165
10822e766l3268M0865J5684L1191K8252p3357m3353K1141O3406n530o5935k8326
10810e4996q672j5363N8493K6510k0390O926K7183m490k6359k6989J9798J3921
10798d428O416K2558L2433J6111k4467m2220J2854M6073O4220M1228n0184j1891
10786A08703p4571k5119R523l3888j4512N5194M7316J4831j0025J057m3753k1958
10774A2798J681p474k4557q771L6685L1273k3940m7244M6430M4885k8280j178
10762C2308O188L521l0970K8740Q359L339j4912k839K7999l724l0929j2044J7221
10749C2257N8153k0927o7765J8748N5345m782m717J7465L6150J7796k9484Q279
$$ plain form
10737 116518 114856 138771 64217 78009 105858 101633 96284 134553 162409 118659 174015 236423
10725 236423 248942 208945 186109 252323 275291 277927 245885 172031 222723 265606 248605 255340
10713 255340 319908 374213 395469 347342 248116 228942 237632 230605 246304 265185 259731 237079
10701 237079 206738 182238 190651 205207 243900 239542 145558 107278 139405 79566 61556 66332
10689 66332 20130 63853 92579 97451 74831 56222 67820 82416 118418 121835 118220 94799
10677 94799 106346 79187 84251 125792 121454 112287 39397 26371 25284 25620 82489 135089 152835
10664 152835 139310 154688 156247 157749 117836 126353 132945 110091 94231 124762 151482 222419
10652 222419 238860 274850 336575 341013 313161 309332 385068 416226 389044 359301 410800 444302
$$ packed form
10737A16518j662K3915p4554J3792K7849m225n349L8269K7856m3750N5356O2408
10725B36423J2519l9997k2836O6214K2968K636l2042p3854N0692M2883j7001O735
10713B55340O4568N4305K1256m8127r9226j9174Q690p027J5699J8881n454k2652
10701B37079l0341k4500Q413J4556L8693m358r3984l8280L2127n9839j8010M776
10689F6332m6202M3723K8726M872k2620j8609J1598J4596L6002L417l615k3421
10677I4799J1547k7159N064M1541m338r167p2890j3026j087L36N6869N2600J7746
10664A52835j3525J5378J559J502l9913Q517O592k2854j5860L0531K6720P0937
10652B22419J6441L5990O1725M438k7852l829P5736L1158k7182k9743N1499L3502
$$ plain form
10640 444302 535502 647569 718294 666139 752219 822919 872633 1008384 1124090 1331020 1492019
10629 1492019 1648136 1816958 2015668 2257447 2534259 2908100 3420673 4037131 4941711
10620 4941711 6125664 7704777 9783373 12442086 15729580 19428273 23012082 25806426
10612 25806426 27477675 28022788 27917893 27795865 28182503 29478665 32024874 36231728 42082875
10603 42082875 49015074 55493667 59728446 60841527 59455502 56872702 54194140 52412811
10595 52412811 52359165 54582158 59330341 66383609 74592291 81630746 84916421 83554933
10587 83554933 78661878 72095104 65371961 59663233 55774502 54085822 54730142 57306840
10579 57306840 60678794 63128503 63024869 59882352 54743787 48760048 42887059 37808815
$$ packed form
10640D44302R1200J12067P0725n2155Q6080P0700M9714J35751J15706K06930J60999
10629A492019J56117J68822J98710K41779K76812L73841N12573O16458R04580
10620D941711J183953J579113K078596K658713L287494L698693L583809K794344
10612B5806426J671249N45113j04895j22028L86638J296162K546209M206854N851147
10603D2082875O932199O478593M234779J113081j386025k582800k678562j781329
10595E2412811n3646K222993M748183P053268Q208682P038455L285675j361488
10587H3554933m893055o566774o723143n708728l888731j688680O44320K576698
10579E7306840L371954K449709j03634l142517n138565n983739n872989n078244
$$ plain form
10571 37808815 33987989 31631798 30626026 30492894 30700978 30562548 29343268 26981835
10563 26981835 23850623 20445289 17088422 13991647 11447497 9406961 7777437 6572499
10555 6572499 5581159 4793917 4211127 3731089 3289891 2886610 2543888 2286162 2054619
10546 2054619 1796197 1623433 1571138 1489840 1457970 1374437 1254790 1135558 1100206 1053793
10536 1053793 1019997 931018 924645 918960 958285 927782 875473 827452 804269 822347 800232 771978
10524 771978 736470 661657 603227 592148 635780 626461 534791 470753 462728 447817 457170 451674
10512 451674 518495 504853 487506 433530 461295 431884 415684 377029 358248 364313 384165 374290
10500 374290 343619 323376 317148 313631 364986 380559 368357 326245 311038 301745 297614 283932
$$ packed form
10571C7808815l820826k356191j005772j33132K08084j38430j219280k361433
10563B6981835l131212l405334l356867l096775k544150k040536j629524j204938
10555F572499r91340p87242n82790m80038m41198m03281l42722k57726k31543
10546B054619k58422j72764n2295q1298l1870q3533j19647j19232l5352m6413
10536A053793l3796q8979o373n685L9325l0503n2309m8021k3183J8078k2115k8254
10524G71978l5508p4813n8430j1079M3632r319r1670o4038q025j4911R353n496
10512D51674O6821j3642j7347n3976K7765k9411j6200l8655j8781O065J9852r875
10500C74290l0671k0243o228l517N1355J5573j2202m2112j5207r293m131j3682
$$ plain form
10488 283932 312150 331613 380628 399086 384910 349854 338587 289407 242556 238869 223599 163752
10476 163752 201026 289683 277190 254247 255085 263789 248170 180079 130717 88934 106104 173825
10464 173825 137249 97596 105695 135606 152509 178420 187921 186128 152492 136134 103942 71205
10452 71205 105834 100494 91284 145403 125689 105216 119820 128087 92606 90549 115972 143499
10440 143499 106352 116423 181730 165051 145451 153407 142369 88313 81552 114472 116595 108084
10428 108084 78536 85975 131302 134988 138357 153264 141086 121399 126789 95628 136187 166574
10416 166574 184974 138394 91150 75414 52014 4041 -3331 28188 45801 65793 67834 88489
10404 88489 137459 98228 101622 78504 68100 57036 67971 85997 106431 120157 133035 143122
$$ packed form
10488B83932K8218J9463M9015J8458j4176l5056j1267m9180m6851l687j5270n9847
10476A63752L7274Q8657j2493k2943Q38Q704j5619o8091m9362m1783J7170O7721
10464A73825l6576l9653Q099K9911J6903K5911R501j793l3636j6358l2192l2737
10452G1205L4629n340r210N4119j9714k0473J4604Q267l5481k057K5423K7527
10440A43499l7147J0071O5307j6679j9600P956j1038n4056o761L2920K123q511
10428A08084k9548P439M5327L686L369J4907j2178j9687N390l1161M0559L0387
10416A66574J8400m6580m7244j5736k3400m7973p372L1519J7613J9992K041K0655
10404H8489M8970l9231L394k3118j0404j1064J0935J8026K0434J3726J2878J0087
$$ plain form
10392 143122 102574 94705 97169 40441 46766 71242 56178 53020 60411 85298 112432 76393
10380 76393 40360 61200 53587 112855 128681 97452 108232 74247 105816 183382 200754 188946
10368 188946 145849 90250 50787 66874 125298 149268 128443 85512 30624 55493 80436
10357 80436 52560 69940 108301 122650 110808 70322 80572 36613 36751 62399 30804 -12544
10345 -12544 -70322 -93915 -12228 26079 14667 24817 -24536 16427 47042 29702 15491 33362
10333 33362 19714 -15883 -48790 -50648 -3348 49629 115101 125405 85645 83768 54638 60124
10321 60124 41706 24090 45185 56116 83620 48532 48747 46554 116641 171067 184030 159182
10309 159182 98891 39595 38069 39246 14262 6079 -29584 -32482 -22625 -15615 32423 41465 22710
$$ packed form
10392A43122m0548p869K464n6728O325K4476j5064l158P391K4887K7134l6039
10380G6393l6033K0840p613N9268J5826l1229J0780l3985L1569P7566J7372j1808
10368A88946m3097n5599l9463J6087N8424K3970k0825m2931n4888K4869K4943
10357H0436k7876J7380L8361J4349j1842m0486J0250m3959J38K5648l1595m3348
10345a2544n7778k3593Q1687L8307j1412J0150m9353M0963L0615j7340j4211J7871
10333C3362j3648l5597l2907j858M7300N2977O5472J0304l9760j877k9130N486
10321F0124j8418j7616K1095J0931K7504l5088K15k193P0087N4426J2963k4848
10309A59182o0291n9296j526J177k4984q183l5663k898R857P010M8038R042j8755
$$ plain form
10296 22710 38069 46271 82942 98943 71334 4763 -57804 -65476 -37636 7315 23569 71837
10284 71837 65641 87475 99110 73782 75441 46133 54132 48080 72591 54303 6372 29745
10272 29745 69759 83171 27492 13691 90555 86445 71397 50152 58376 56364 34631 4085
10260 4085 2283 -17855 29525 24126 9674 11062 18691 77202 89509 21996 12147 20405 -17950
10247 -17950 18178 43612 46727 17596 -1238 12379 18109 -14227 51055 105573 87665 26464
10235 26464 -19061 -15027 9831 -37125 -32374 -11142 66277 105895 73685 10196 25844 85863
10223 85863 84633 93900 14134 -12380 6033 -40568 -24794 45736 27095 32053 32658 14267 -39926
10210 -39926 -43607 -30430 -7197 14917 39446 74348 88054 100698 106601 61691 -4136 -22312
$$ packed form
10296B2710J5359Q202L6671J6001k7609o6571o2567p672K7840M4951J6254M8268
10284G1837o196K1834J1635k5328J659k9308P999o052K4511j8288m7931K3373
10272B9745M0014J3412n5679j3801P6864m110j5048k1245Q224k012k1733l0546
10260D085j802k0138M7380n399j4452J388P629N8511J2307o7513r849Q258l8355
10247a7950L6128K5434L115k9131j8834J3617N730l2336O5282N4518j7908o1201
10235B6464m5525M034K4858m6956M751K1232P7419L9618l2210o3489J5648O0019
10223H5863j230R267p9766k6514J8413m6601J5774P0530j8641M958O05j8391n4193
10210c9926l681J3177K3233K2114K4529L4902J3706J2644N903m4910o5827j8176
$$ plain form
10198 -22312 -18739 5534 11412 -23457 -57032 -32544 37962 32077 38655 70595 114654 84016
10186 84016 41876 52249 106803 135183 134163 146715 162606 180657 193421 189256 212742 254429
10174 254429 214893 175134 282701 332226 289013 245863 276631 338296 372036 331691 320074
10163 320074 333846 318559 308658 308247 342453 336494 328402 350773 387891 449077 517427 505633
10151 505633 443330 400434 366120 309740 313469 298212 269941 352039 364483 349963 319283 336125
10139 336125 319996 306175 301310 265201 259343 228296 193306 190848 174474 191654 193027 120393
10127 120393 132221 138592 147809 147315 165665 157230 86576 47914 30058 36449 36611 25979 3546
10114 3546 5900 5637 55476 45997 16654 55709 63179 77233 57841 16299 14172 52307 123989
$$ packed form
10198b2312L573K4273N878l4869l3575K4488P0506n885O578L1940M4059l0638
10186H4016m2140J0373N4554K8380j020J2552J5891J8051J2764m165K3486M1687
10174B54429l9536l9759J07567M9525m3213m3150L0768O1665L3740m0345j1617
10163C20074J3772j5287r901m11L4206n959q092K2371L7118O1186O8350j1794
10151E05633o2303m2896l4314n6380L729j5257k8271Q2098J2444j4520l0680J6842
10139C36125j6129j3821m865l6109n858l1047l4990k458j6374J7180J373p2634
10127A20393J1828O371R217m94J8350q435p0654l8662j7856O391J62j0632k2433
10114C546K354k63M9839r479k9343L9055P470J4054j9392m1542k127L8135P1682
$$ plain form
10101 123989 182247 148686 43542 50106 79162 67703 38788 26888 12418 19874 2429 -28960
10089 -28960 21311 19683 -19663 14015 -7890 -50334 -76069 -74118 -49235 -38397 -20769 32107
10077 32107 64766 60297 47044 12695 -12711 20513 51055 -2058 -75502 -42214 51881 83016
10065 83016 60572 85363 80198 86129 33435 15814 37617 11167 28769 45795 39979 3691
10053 3691 -50098 -85056 -46264 -10159 -18777 5271 -13905 -13521 -12173 -12836 42764 93216 150917
10040 150917 162516 71729 -20835 -69135 -28535 28021 -11341 10942 36859 96349 97207 114460
10028 114460 89232 26361 43380 -40013 -95971 -79365 -33269 16065 74497 8883 -23602
10017 -23602 -48714 -11244 -67102 -26502 3529 18738 1254 -13502 -64790 -19645 18474 59069
$$ packed form
10101A23989N8258l3561j05144O564K9056j1459k8915j1900j4470P456j7445l1389
10089b8960N0271j628l9346L3678k1905m2444k5735J951K4883J0838J7628N2876
10077C2107L2659m469j3253l4349k5406L3224L0542n3113p3444L3288R4095L1135
10065H3016k2444K4791n165N931n2694j7621K1803k6450J7602J7026n816l6288
10053C691n3789l4958L8792L6105q618K4048j9176L84J348o63N5600N0452N7701
10040A50917J1599r0787r2564m8300M0600N6556l9362K2283K5917N9490Q58J7253
10028A14460k5228o2871J7019q3393n5958J6606M6096M9334N8432o5614l2485
10017b3602k5112L7470n5858M0600L0031J5209j7484j4756n1288M5145L8119M0595
$$ plain form
10005 59069 89265 84257 126385 123368 83839 79582 83116 41238 39336 58590 67803 70883 39025
9992 39025 6348 37954 85167 80686 51688 66081 47376 -11430 -23410 -47952 -28683 -23563
9980 -23563 -55192 -36126 -29796 10350 62245 38858 40807 25884 39480 23258 64122 6477
9968 6477 -42520 -1860 16066 -26277 -49436 -82776 -12465 9522 -31257 -12995 -28204 -15892
9956 -15892 -1137 -5891 -47236 -82098 -19996 25135 -25450 -28334 -16115 -16252 -7780 -23408 -69161
9943 -69161 -85678 -50307 -49766 -16071 12398 3674 33385 10222 61490 71274 21181 3254 4341
9930 4341 18910 83369 93108 39387 31192 31035 64613 80137 21279 -20584 -6036 6463 -27771
9917 -27771 -53281 -22654 10409 30564 -26288 -59079 -47076 7887 29290 -14581 -18091 15996
$$ packed form
10005E9069L0196n008M2128l017l9529m257L534m1878j902J9254R213L080l1858
9992C9025l2677L1606M7213m481k8998J4393j8705n8806j1980k4542J9269N120
9980b3563l1629J9066O330M0146N1895k3387J949j4923J3596j6222M0864n7645
9968F477m8997M0660J7926m2343k3159l3340P0311K1987m0779J8262j5209J2312
9956a5892J4755m754m1345l4862O2102M5131n0585k884J2219j37Q472j5628m5753
9943f9161j6517L5371N41L3695K8469q724K9711k3163N1268R784n0093j7927J087
9930D341J4569O4459R739n3721q195j57L3578J5524n8858m1863J4548J2499l4234
9917b7771k5510L0627L3063K0155n6852l2791J2003N4963K1403m3871l510L4087
$$ plain form
9905 15996 45125 49625 5425 -17845 -18569 -24014 57006 86476 87840 92332 124355 87974 26645
9892 26645 50625 54404 55281 64042 73131 8734 -6574 26990 48789 37897 57917 89467 96443
9879 96443 89697 23892 -9166 -1586 -4019 -62847 -93432 -93561 -118493 -91414 -23220 28751 19879
9866 19879 20093 36517 -19359 -48619 1338 9867 -21732 -40369 11070 69505 68021 69678 18559
9853 18559 -956 -45771 -79472 -90319 -97727 -57987 -14633 7386 4543 -19818 -19654 21137 6522
9840 6522 21803 59463 -1992 -68536 -70225 -30872 18601 -35314 -82899 -35098 2968 37423
9828 37423 54174 24637 -13660 4148 10067 25112 27378 -31274 -18447 -41856 -31020 1379
9816 1379 9466 -11121 7271 7372 18868 -8354 -16879 23307 98017 77484 -5991 -28724 -21605
$$ packed form
9905A5996K9129M500m4200k3270p24n445Q1020K9470J364M492L2023l6381o1329
9892B6645K3980L779Q77Q761R089o4397j5308L3564K1799j0892K0020L1550O976
9879I6443o746o5805l3058P580k433n8828l0585j29k4932K7079O8194N1971q872
9866A9879K14J6424n5876k9260M9957Q529l1599j8637N1439N8435j484J657n1119
9853A8559j9515m4815l3701j0847p408L9740M3354K2019k843k4361J64M0791j4615
9840F522J5281L7660o1455o6544j689L9353M9473n3915m7585M7801L8066L4455
9828C7423J6751k9537l8297J7808N919J5045K266n8652J2827k3409J0836L2399
9816A379Q087k0587J8392J01J1496k7222q525M0186P4710k0533q3475k2733P119
$$ plain form
9803 -21605 -12086 11057 79905 106243 74092 7046 -17132 -76733 -22740 31731 15304 46277
9791 46277 87687 114898 53644 -3891 7578 -14520 -99954 -69815 17646 50008 21123 20436
9779 20436 35100 41178 -25223 -61369 -784 74669 85938 55541 -3824 -47587 -27113 4455
9767 4455 2497 32493 76368 43860 31679 26975 21848 26972 -25144 -31996 -67017 -92287 -81938
9754 -81938 -25063 -12254 -23162 24014 12933 -32190 14256 366 47469 32138 -5370 -25620
9742 -25620 -37110 -62180 -697 -5516 7783 25582 11265 -12604 -105 16141 47728 70256
9730 70256 76326 27772 -12477 -41540 16392 8983 17741 -41337 499 42416 52590 37047
9718 37047 80499 40556 -500 48077 78377 76725 57582 75117 104118 78990 50030 99521
$$ packed form
9803b1605R519K3143O8848K6338l2151o7046k4178n9601N3993N4471j6427L0973
9791D6277M1410K7211o1254n7535J1469k2098q5434L0139Q7461L2362k8885o87
9779B0436J4664O078o6401l6146O0585P5453J1269l0397n9365m3763K0474L1568
9767D455j958K9996M3875l2508j2181m704n127N124n2116o852l5021k5270J0349
9754h1938N6875J2809j0908M7176j1081m5123M6446j3890M7103j5331l7508k0250
9742b5620j1490k5070O1483m819J3299J7799j4317k3869J2499J6246L1587K2528
9730G0256O070m8554m0249k9063N7932p409Q758n9078M1836M1917J0174j5543
9718C7047M3452l9943m1056M8577L0300j652j9143J7535K9001k5128k8960M9491
$$ plain form
9706 99521 83544 27812 5544 23720 26938 3244 33426 104366 90314 15394 -13125 9629
9694 9629 7744 -36751 -74960 -42203 39522 3913 -12413 -65206 -36715 16332 2061 33190
9682 33190 -4572 -77609 -106890 -53825 -23950 -68522 -82214 -73538 -33634 -53176 -72877 -27566
9670 -27566 -15004 -36046 -10833 -3509 36154 30954 15915 -3805 -8094 -8397 42347 69899 47817
9657 47817 6250 24356 -7578 11903 37860 85833 109910 112720 144254 131380 107190 94125
9645 94125 83794 54087 25964 25537 -1353 -30335 -9169 -28830 -47465 -39593 -19005 -56388
9633 -56388 -56753 -71051 -60105 -64615 -57087 -49312 -8790 24797 -17253 -34341 45158 111236 72312
9620 72312 -56150 -93417 -61508 -1311 -18708 -61861 -113702 -140294 -90808 -49235 -57330 -106443
$$ packed form
9706I9521j5977n5732k2268J8176L218k3694L0182P0940j4052p4920k8519K2754
9694I629j885m4495l8209L2757Q1725l5609j6326n2793K8491N3047j4271L1129
9682C3190l7762p3037k9281N3065K9875m4572j3692Q676L9904j9542j9701M5311
9670b7566J2562k1042K5213P324L9663n200j5039j9720m289l03N0744K7552k2082
9657D7817m1567J8106l1934J9481K5957M7973K4077K810L1534j2874k4190j3065
9645I4125j0331k9707k8123m27k6890k8982K1166j9661j8635P872K0588l7383
9633e6388l65j4298J0946m510P528P775M0522L3587m2050j7088P9499O6078l8924
9620G2312j28462l7267L1909O0197j7397m3153n1841k6592M9486M1573q095m9113
$$ plain form
9608 -106443 -62908 61 21575 20235 23102 53254 87981 111896 72371 64871 54859 46842
9596 46842 25486 47582 81525 124578 112176 86050 38611 41984 44490 -2610 -10081 19837
9584 19837 20796 7787 33698 11961 784 22347 -18602 -38142 -74109 -99111 -44977 13999
9572 13999 51018 72376 75247 40828 19306 4976 -37863 -77970 -11965 12974 14871 13213
9560 13213 -63058 -155414 -120981 -46925 -57594 -26997 11207 57830 13872 883 -18810 2656
9548 2656 39380 67930 -4333 -79667 -74169 -9830 -31392 -59484 -76775 -54192 -72151 -35910
9536 -35910 -21059 28429 43452 27166 35572 -1475 -42833 -15296 -34799 -79497 -113627 -73278
9524 -73278 -40817 -22281 -30481 -44742 -33194 -5211 23211 25841 3753 -29558 -79607 -20954
$$ packed form
9608a06443M3535O2969K1514j340K867L0152L4727K3915l9525p500j0012q017
9596D6842k1356K2096L3943M3053j2402k6126m7439L373K506m7100p471K9918
9584A9837R59j3009K5911k1737j1177K1563m0949j9540l5967k5002N4134N8976
9572A3999L7019K1358K871l4419k1522j4330m2839m0107O6005K4939J897j658
9560A3213p6271r2356L4433P4056j0669L0597L8204M6623m3958j2989j9693K1466
9548B656L6724K8550p2263p5334N498O4339k1562k8092j7291K2583j7959L6241
9536c5910J4851M9488J5023j6286Q406l7047m1358K7537j9503m4698l4130M0349
9524g3278L2461J8536q200j4261J1548K7983K8422K630k2088l3311n0049N8653
$$ plain form
9512 -20954 -32807 -77347 -88510 -116215 -86225 -28942 -8305 -46683 -15268 -41480 -101155 -58302
9500 -58302 9209 3456 -14750 -25454 -60004 -68995 -616 28017 31505 14154 -28578 -49320
9488 -49320 -81769 -80279 -83457 -79583 -119325 -95436 -63659 26263 106261 55546 -5400 24869
9476 24869 75910 53685 25607 16709 -3289 -4732 -3888 -38904 -28115 -52539 -67475 -77866 -91459
9463 -91459 -94061 -96881 -107325 -105131 -83019 -71173 -23259 2837 14895 -36597 -27587 30793 11213
9450 11213 -24565 -18945 -74168 -95993 -38478 -15069 26982 587 12015 -22811 -65336 -65869
9438 -65869 -17350 -31117 -27135 -19026 -17330 -15686 -33283 -71911 -68446 -3421 19644 24991 7947
9425 7947 -29153 -31005 40456 50754 18065 -4378 23332 -11499 -37293 -2322 1156 -27233
$$ packed form
9512b0954j1853m4540j1163k7705K9990N7283K0637l8378L1415k6212n9675M2853
9500e8302O7511n753j8206j0704l4550q991O8379K8633L488j7351m2732k0742
9488d9320l2449J490l178L874l9742K3889L1777Q9922P9998n0715o0946L0269
9476B4869N1041k2225k8078q898j9998j443Q44l5016J0789k4424j4936j0391j3593
9463i1459k602k820j0444K194K2112J1846M7914K6096J2058n1492R010N8380j9580
9450A1213l5778N620n5223k1825N7515K3409M2051k6395J1428l4826m2525n33
9438f5869M8519j3767L982Q109J696J644j7597l8628L465O5025K3065N347j7044
9425G947l7100j852P1461J0298l2689k2443K7710l4831k5794L4971L478k8389
$$ plain form
9413 -27233 -9287 -38927 -108270 -200885 -190656 -153976 -150186 -110164 -55692 -4244 -14582 -28186
9401 -28186 -24348 -51121 -93719 -84649 -120477 -101422 -88858 -132039 -120895 -92086 -30198 -3248
9389 -3248 -37593 -59362 -26124 25238 45959 -18264 -93150 -95112 -62815 10870 25108 -9238
9377 -9238 14309 59320 67910 38141 2646 -27331 -53492 -31650 -8624 -29394 -15555 -6465
9365 -6465 10210 47866 83949 69293 30316 -21861 -41424 -41981 -8040 -33500 -68766 -115753
9353 -115753 -132471 -141427 -162950 -117642 -71915 -83120 -57472 -27609 -62764 -24283 -3761 -19321
9341 -19321 7014 18258 45091 69595 40437 -26718 5018 55092 113602 83954 -4677 -58842
9329 -58842 -26285 -35473 -13975 -20268 -37121 -97863 -103978 -55515 -34673 -53237 -34054 -3146
$$ packed form
9413b7233J7946k9640o9343r2615J0229L6680L790M0022N4472N1448j0338j3604
9401b8186L838k6773m2598R070l5828J9055J2564m3181J1144K8809O1888K6950
9389c248l4345k1769L3238N1362K0721o4223p4886j962L2297P3685J4238l4346
9377i238K3547M5011Q590k9769l5495k9977k6161K1842K3026k0770J3839R090
9365f465J6675L7656L6083j4656l8977n2177j9563n57L3941k5460l5266m6987
9353a15753j6718q956k1523M5308M5727j1205K5648K9863l5155L8481K0522j5560
9341a9321K6335J1244K6833K4504k9158o7155L1736N0074N8510k9648q8631n4165
9329e8842L2557r188K1498o293j6853o0742o115M8463K0842j8564J9183L0908
$$ plain form
9317 -3146 37886 24294 31681 27021 6492 -20656 -43382 -58545 -71140 -132841 -88093 -66003
9305 -66003 -71182 -47857 -4711 -44729 -75081 -22660 32749 23277 -24737 -5009 16158 -4636
9293 -4636 -47706 -46913 -773 64872 163715 181495 117839 94624 43358 2880 -32899 -17222
9281 -17222 3351 -9360 69435 23928 -31963 -4840 -1185 -8490 -5405 41050 42338 69592 27296
9268 27296 41632 127151 124236 32865 14362 49441 66211 17302 50589 70677 52717 87640
9256 87640 53075 18247 -30657 -2349 39065 24533 -39163 -90933 -95194 -58486 70452 109253
9244 109253 93595 47770 3507 -328 70646 94911 33127 -59559 -67551 -29441 -19096 -30883
9232 -30883 -46148 -48214 -6813 13402 38234 85183 67494 35121 27309 44083 42799 49131 12404
$$ packed form
9317c146M1032j3592P387m660k0529k7148k2726j5163j2595o1701M4748K2090
9305f6003n179K3325M3146m0018l0352N2421N5409r472m8014J9728K1167k0794
9293d636m3070P93M6140O5645R8843J7780o3656k3215n1266m0478l5779J5677
9281a7222K0573j2711P8795m5507n5891K7123L655p305L085M6455J288K7254m2296
9268B7296J4336Q5519k915r1371j8503L5079J6770m8909L3287K0088j7960L4923
9256H7640l4565l4828m8904K8308M1414j4532o3696n1770m261L6708J28938L8801
9244A09253j5658m5825m4263l835P0974K4265o1784r2686p992L8110J0345j1787
9232c0883j5265k066M1401K0215K4832M6949j7689l2373p812J6774j284O332l6727
$$ plain form
9219 12404 68217 128824 110651 57184 47288 55165 15714 -68951 -109720 -88449 -28657 -36209
9207 -36209 -45118 -42841 -49087 10072 62799 72020 46491 -51409 -16832 23198 82 -3856 -65336
9194 -65336 -73937 -38947 24681 3901 8539 66897 30719 -68779 -104502 -114796 -73999 -20827
9182 -20827 -1632 -48821 -9542 -5379 -78922 -108116 -90842 -28104 -22505 9944 41670 67135
9170 67135 95476 50734 -6289 -43213 -53819 -39551 -64497 -103415 -74778 -47941 -4538 43372
9158 43372 -27064 -12420 21236 -2217 -52124 -72391 -76259 -83865 -61606 -79668 -62908 -20056
9146 -20056 27760 50867 -3600 7453 48293 31281 93446 130313 98437 86009 27368 -24836
9134 -24836 -22827 -66314 -50066 -46456 -89392 -118530 -79695 40786 59490 27571 -31438 -51393
$$ packed form
9219A2404N5813O0607j8173n3467r896P877l9451q4665m0769K1271N9792p552
9207c6209q909K277o246N9159N2727R221k5529r7900L4577M0030k3116l938o1480
9194f5336q601L4990O3628k0780M638N8358l6178r9498l5723j0294M0797N3172
9182b0827J9195m7189L9279M163p3543k9194J7274O2738N599L2449L1726K5465
9170F7135K8341m4742n7023l6924j0606J4268k4946l8918K8637K6837M3403M7910
9158D3372p0436J4644L3656k3453m9907k0267l868p606K2259j8062J6760M2852
9146b0056M7816K3107n4467J1053M0840j7012O2165L6867l1876j2428n8641n2204
9134b4836K009m3487J6248L610m2936k9138L8835J20481J8704l1919n9009j9955
$$ plain form
9122 -51393 -76157 -79463 -70498 -83724 -7187 27813 -69153 -76422 -96933 -173341 -127527 -121718 -54980
9109 -54980 -20077 -1123 -46746 -56281 -25368 -75107 -40344 -36218 -16943 -26917 -5959 28243
9097 28243 51181 49823 24434 13191 -1983 32362 21575 -36290 -52880 -62158 -53356 -34390
9085 -34390 -20734 -98782 -80324 -30004 -25769 -57623 -79781 -16512 1843 -71647 -72824 -4640
9073 -4640 -16455 -56832 -58630 -40194 -17673 -19436 -31098 14978 -13312 -33534 527 16625
9061 16625 -5866 22418 -44330 -19973 -30963 -46661 -29788 -35443 -7892 29220 -28284 -86469
9049 -86469 -87030 -87153 -73758 6707 47661 71370 11281 -31775 -49041 -36755 3829 10371 -35097
9036 -35097 -64702 -85943 -70703 -62079 -83668 -103494 -113630 -114092 -42951 -20930 -33506 -18761
$$ packed form
9122e1393k4764l306Q965j3226P6537L5000r6966p269k0511p6408M5814N809O6738
9109e4980L4903J8954m5623r535L0913m9739L4763M126J9275r974K0958L4202
9097B8243K2938j358k5389j1243j5174L4345j0787n7865j6590r278Q802J8966
9085c4390J3656p8048J8458N0320M235l1854k2158O3269J8355p3490j177O8184
9073d640j1815m0377j798J8436K2521j763j1662M6076k8290k0222L4061J6098
9061A6625k2491K8284o6748K4357j0990j5698J6873n655K7551L7112n7504n8185
9049h6469n61j23J3395Q0465M0954K3709o0089m3056j7266J2286M0584O542m5468
9036c5097k9605k1241J5240Q624k1589j9826j0136m62P1141K2021j2576J4745
$$ plain form
9024 -18761 -41281 -97038 -115506 -139693 -86203 -47329 -48804 -46119 14267 43695 4215 -60935
9012 -60935 -40968 -51531 -8273 16259 -18361 -68888 -45492 -10612 -9225 -14034 -32451 4289
9000 4289 -53550 -43857 -34201 -43527 -50009 -49378 -10422 1533 8942 17415 46134 53026 60234 66979
8986 66979 44527 41928 -15655 -47305 -67313 -63817 -48138 -24008 -34655 6557 -19687 -56346
8974 -56346 -49712 -11505 -27860 11377 34058 28300 53433 39051 12654 -6680 1539 10318 -40753
8961 -40753 -78226 -48806 -5311 6550 8632 -31160 16987 41244 -31676 -4548 -11264 -40317
8949 -40317 -27583 23881 19450 45590 21796 32376 -14583 -1627 39875 54052 19229 2940
8937 2940 -6439 10173 -24120 -24021 -13298 -6055 6522 -3199 42 26339 43441 56348 50675 39608
$$ packed form
9024a8761k2520n5757j8468k4187N3490L8874j475K685O0386K9428l9480o5150
9012f0935J9967j0563M3258K4532l4620n0527K3396L4880J387m809j8417L6740
9000D289n7839R693R656r326o482O31L8956J1955P409Q473K8719O892P208O745
8986F6979k2452k599n7583l1650k0008L496J5679K4130j0647M1212k6244l6659
8974e6346O634L8207j6355L9237K2681n758K5133j4382k6397j9334Q219Q779n1071
8961d0753l7473K9420M3495J1861K082l9792M8147K4257p2920K7128o716k9053
8949d0317J2734N1464m431K6140k3794J0580m6959J2956M1502J4177l4823j6289
8937B940r379J6612l4293R9J0723P243J2577r721L241K6297J7102J2907n673j1067
$$ plain form
8923 39608 63215 17066 -42720 -50737 -41424 -50035 -52463 5821 112 -11407 17093 15860 17862
8910 17862 47071 84182 13659 10242 6168 -3689 23135 18041 -49977 -42895 14190 27506 11520
8897 11520 2029 16722 41888 34047 58460 60311 31598 -34474 -81613 -26683 -15108 -20610 -1206
8884 -1206 40620 106418 63687 -16816 -44843 3262 46733 82480 96781 15342 18568 52729
8872 52729 32884 -4961 -67771 -83959 -73166 -73681 -100405 -105466 -86308 -105818 -54756 4835
8860 4835 1170 49531 73848 -4523 -65553 -48338 -34725 -6714 -21834 -26452 -7174 9641
8848 9641 25837 -9313 -46352 -52973 44257 61727 68096 82663 95630 66660 48036 19465
8836 19465 -10717 16405 -33293 -38005 -45567 -35395 -1316 13180 -43983 -39809 15346 5488 -2543
$$ packed form
8923C9608K3607m6149n9786q017R313q611k428N8284n709j1519K8500j233K002
8910A7862K9209L7111p0523l417m074r857K6824n094o8018P082N7085J3316j5986
8897A1520r491J4693K5166p841K4413J851k8713o6072m7139N4930J1575n502J9404
8884a206M1826O5798m2731q0503k8027M8105M3471L5747J4301q1439L226L4161
8872E2729j9845l7845o2810j6188J0793n15k6724n061J9158j9510N1062N9591
8860D835l665M8361K4317p8371o1030J7215J3613K8011j5120m618J9278J6815
8848I641J6196l5150l7039o621R7230J7470O369J4567J2967k8970j8624k8571
8836A9465l0182K7122m9698m712p562J0172L4079J4496n7163M174N5155r858q031
$$ plain form
8823 -2543 -27124 -66678 -84629 -80767 -69137 -85004 -64008 41497 95024 81114 84927 87949
8811 87949 16390 1488 12946 -14269 14274 6832 8521 53927 62076 35989 25977 31174 39377
8798 39377 37340 859 -7617 -23398 -30704 -45678 -66952 -42813 14055 -5643 -21376 5549
8786 5549 49973 53610 -5953 -47041 -40688 -3961 -11410 6650 1316 -25200 -41940 -47610 -8536
8773 -8536 -59298 -25571 33697 40124 37195 -18815 -24422 -44539 -2690 5379 -49027 -30391 -23832
8760 -23832 -72634 -88360 -83441 -95500 -109609 -78099 -77414 -101739 -129407 -69244 -8706 -12817 -12839
8747 -12839 13129 34749 28566 10946 -36509 -12727 39354 68469 82534 59126 24053 -59888
8735 -59888 -13085 35200 62627 30817 -4013 31220 18895 -8760 4702 53913 71618 43215
$$ packed form
8823b543k4581l9554j7951L862J1630j5867K0996J05505N3527j3910L813L022
8811H7949p1559j4902J1458k7215K8543p442J689M5406Q149k6087j0012N197Q203
8798C9377k037l6481q476j5781p306j4974k1274K4139N6868j9698j5733K6925
8786E549M4424L637n9563m1088O353L6727p449J8060n334k6516j6740n670L9074
8773h536n0762L3727N9268O427k929n6010n607k0117M1849Q069n4406J8636O559
8760b3832m8802j5726M919j2059j4109L1510O85k4325k7668O0163O0538m111k2
8747a2839K5968K1620o183j7620m7455K3782N2081K9115J4065k3408l5073q3941
8735e9888M6803M8285K7427l1810l4830L5233j2325k7655J3462M9211J7705k8403
$$ plain form
8723 43215 80193 100434 138494 133975 89572 106926 90289 62197 -3724 -67365 -7853 -5839
8711 -5839 -20942 -29381 11575 32377 23236 31749 19601 -10736 30319 22169 38676 20574 -309
8698 -309 -5541 -47386 -84540 -139990 -98909 -84416 -44514 14656 -22711 -72075 -10442 22290
8686 22290 31826 59999 53404 30821 39200 12467 -6802 36424 61622 87225 101933 152077
8674 152077 86713 62982 52558 62978 59349 42023 32156 43599 -20327 -84991 -35155 -45726
8662 -45726 -40339 -24934 -51948 -30167 -7665 -5810 -33762 -22226 5929 35176 80416 113892
8650 113892 133787 72019 -13581 -18310 33898 -10623 -45334 -51073 -21955 -20782 -20712 -2705 26628
8637 26628 -11634 -16776 15840 41852 37542 -2910 23393 7277 -3480 -1547 -32746 -22011
$$ packed form
8723D3215L6978K0241L8060m519m4403J7354j6637k8092o5921o3641N9512K014
8711e839j5103q439M0956K0802r141Q513j2148l0337M1055q150J6507j8102k0883
8698c09n232m1845l7154n5450M1081J4493L9902N9170l7367m9364O1633L2732
8686B2290R536K8173o595k2583Q379k6733j9269M3226K5198K5603J4708N0144
8674A52077o5364k3731j0424J0420l629j7326r867J1443o3926o4664M9836j0571
8662d5726N387J5405k7014K1781K2502J855k7952J1536K8155K9247M5240L3476
8650A13892J9895o1768q5600m729N2208m4521l4711n739K9118J173P0J8007K9333
8637B6628l8262n142L2616K6012m310m0452K6303j6116j0757J933l1199J0735
$$ plain form
8625 -22011 -19432 -58398 -19273 19376 38107 5038 -79562 -75894 -72900 -66202 -45492 -44068 1651
8612 1651 51834 130243 188921 193912 129980 54921 -3871 15445 60692 62873 77848 46695
8600 46695 3739 523 59872 24168 -31728 -67487 -26964 -18798 -61736 -8614 7762 2266
8588 2266 -34431 -73460 -66857 -7414 81491 80341 97654 41064 25880 81805 127444 89855
8576 89855 105637 106897 60616 41779 84966 53906 44271 102390 64229 106035 157911 76609
8564 76609 3641 -10155 60666 67470 37578 15862 -26447 -61999 -71850 -53624 -398 11081
8552 11081 21260 6693 -21687 -96221 -109793 -32759 -58893 -28433 19299 13011 -21483 -84741
8540 -84741 -44728 -6105 28461 21186 45898 106881 82280 35896 11621 -2297 -25993 51775
$$ packed form
8625b2011K579l8966L9125L8649J8731l3069q4600L668K994O698K0710J424M5719
8612A651N0183P8409N8678M991o3932p5059n8792J9316M5247K181J4975l1153
8600D6695m2956l216N9349l5704n5896l5759M0523Q166m2938N3122J6376n496
8588B266l6697l9029O603N9443Q8905j150J7313n6590j5184N5925M5639l7589
8576H9855J5782J260m6281j8837M3187l1060r635N8119l8161M1806N1876q1302
8564G6609p2968j3796P0821O804k9892k1716m2309l5552r851J8226N3226J1479
8552A1081J0179j4567k8380p4534j3572P7034k6134L0460M7732o288l4494o3258
8540h4741M0013L8623L4566p275K4712O0983k4601m6384k4275j3918k3696P7768
$$ plain form
8528 51775 71486 23831 31430 18898 26603 -21772 -43643 -26222 13634 34378 67806 89140
8516 89140 95992 95820 32102 -22437 -28836 32181 59669 34215 27189 28912 39482 37784 9802
8503 9802 41222 1821 -53131 -84498 -113336 -142764 -98738 -98957 -24058 47195 110433 98399
8491 98399 63517 4815 -47081 9447 3746 -45537 -81231 -147943 -170888 -151456 -95324 -75539
8479 -75539 -54963 -5613 -28229 -15287 -49039 -33836 -43212 -19829 -10066 -19256 2748 2904 -35649
8466 -35649 -71198 -78573 -66899 -56447 -80586 -100304 -65724 -60820 -58723 -19374 6580 -10360
8454 -10360 7993 51230 56234 121509 159594 146492 165203 153900 84185 23475 22340 66734
8442 66734 47773 33767 54248 152002 198987 189021 119831 44901 82509 70467 36535 40373
$$ packed form
8528E1775J9711m7655P599j2532P705m8375k1871J7421L9856K0744L3428K1334
8516H9140O852j72o3718n4539o399O1017K7488k5454p026J723J0570j698k7982
8503I802L1420l9401n4952l1367k8838k9428M4026k19P4899P1253O3238j2034
8491I8399l4882n8702n1896N6528n701m9283l5694o6712k2945J9432N6132J9785
8479g5539K0576M9350k2616J2942l3752J5203r376K3383R763r190K2004J56l8553
8466c5649l5549p375J1674J0452k4139j9718L4580M904K097L9349K5954j6940
8454a0360J8353M3237N004O5275L8085j3102J8711j1303o9715o0710j135M4394
8442F6734j8961j4006K0481R7754M6985r966o9190p4930L7608j2042l3932L838
$$ plain form
8430 40373 83813 67620 75094 17156 -42701 -38785 -19940 -26699 -134324 -133490 -88187 -48321 -51001
8417 -51001 -40727 -39078 -37880 4218 41348 -2024 49492 73603 81865 22964 60751 43374
8405 43374 -24230 -76651 -47201 -30938 29070 63361 -15368 34787 80920 -2081 -64809 -73063
8393 -73063 -87174 -63616 -92177 -116250 -72019 -20658 -19750 -10978 -15986 3321 25476 54403 3635
8380 3635 -19064 -12715 15598 44300 45971 47925 38483 49564 48971 7561 -32107 -8021 44090
8367 44090 79480 67869 112316 77114 27202 32571 11416 59411 141574 76996 24491 3142
8355 3142 1059 -14594 2813 51081 66025 23385 -22628 -49269 -60243 -11480 19837 18736
8343 18736 6407 -17465 -17951 -5689 11893 -14527 -35143 -38097 -4941 -4276 1551 -9051 -2657
$$ packed form
8430D0373M3440j6193P474n7938n9857L916J8845o759j07625Q34M5303L9866k680
8417e1001J0274J649J198M2098L7130m3372N1516K4111Q262n8901L7787j7377
8405D3374o7604n2421K9450J6263O0008L4291p8729N0155M6133q3001o2728q254
8393g3063j4111K3558k8561k4073M4231N1361R08Q772n008J9307K2155K8927n0768
8380C635k2699O349K8313K8702J671J954r442J1081n93m1410l9668K4086N2111
8367D4090L5390j1611M4447l5202m9912N369k1155M7995Q2163o4578n2505k1349
8355C142k083j5653J7407M8268J4944m2640m6013k6641j0974M8763L1317j101
8343A8736j2329k3872m86J2262J7582k6420k0616k954L3156O65N827j0602O394
$$ plain form
8330 -2657 56476 49454 24691 29026 36289 39540 3098 -14142 -9502 -59588 -82177 -109373 -99418
8317 -99418 -67144 -35454 -15486 -50377 -88986 -79113 -88807 -86022 -21019 -41228 -102630 -74716
8305 -74716 -37570 -29991 -48226 -49110 -56927 -32778 -43516 -34577 17890 59552 90910 56077 38131
8292 38131 51956 86392 1251 -90310 -64178 -26928 -2744 68333 53082 16561 -471 -12267
8280 -12267 -19891 -35617 -29659 -7986 55139 45017 -14234 -40261 -41880 -64027 -22784 43841
8268 43841 53738 77479 19799 -17225 -17515 4686 31558 62495 117502 114925 122113 75273 18712
8255 18712 -24685 -70712 -100177 -109254 -31980 13188 36644 -4980 -6544 25332 77730 91739
8243 91739 42763 42626 69929 88757 48405 28981 78170 29633 -40717 -82314 -45179 21686
$$ packed form
8330b657N9133p022k4763M335P263L251l6442j7240M640n0086k2589k7196R955
8317i9418L2274L1690J9968l4891l8609R873r694K785O5003k0209o1402K7914
8305g4716L7146P579j8235q84p817K4149j0738Q939N2467M1662L1358l4833j7946
8292C8131J3825L4436q5141r1561K6132L7250K4184P1077j5251l6521j7032j1796
8280a2267p624j5726N958K1673O3125j0122n9251k6027j619k2147M1243O6625
8268D3841R897K3741n7680l7024k90K2201K6872L0937N5007k577P188m6840n6561
8255A8712m3397m6027k9465r077P7274M5168K3456m1624j564L1876N2398J4009
8243I1739m8976j37K7303J8828m0352j9424M9189m8537p0350m1597L7135O6865
$$ plain form
8231 21686 20529 1753 26292 24128 -41643 -18474 -6672 38213 84676 14772 -23699 -8793
8219 -8793 -25239 -19252 -18262 -32015 -32221 -49950 -20115 -37493 -35725 -30183 -12679 65443 58984 4170
8205 4170 -18570 7064 16980 -23966 14797 50154 22328 22432 21827 -7455 11013 30921 24924
8192 24924 -22782 -21792 63341 111551 87928 50939 23000 -45481 -89369 -86428 -76590 -104331 -68276
8179 -68276 20656 7637 -9033 11072 6702 -5567 41974 44990 46089 58147 85620 56657
8167 56657 -41863 -53497 -78497 -97264 -62294 -7928 -35162 -87405 -109030 -74804 -98919 -148521
8155 -148521 -101964 -15039 -26349 -70606 -38707 10499 51423 49650 28895 58241 35175 27046
8143 27046 -14741 -39875 -23105 -35291 -71745 -9766 5669 -8944 -34984 -4164 -2226 -16161
$$ packed form
8231B1686j157j8776K4539k164o5771K3169J1802M4885M6463o9904l8471J4906
8219h793j6446N987R90j3753k06j7729K9835j7378J768N542J7504P8122o459n4814
8205D170k2740K5634R916m0946L8763L5357k7826J04o05k9282J8468J9908n997
8192B4924m7706R90Q5133M8210k3623l6989k7939o8481m3888K941R838k7741L6055
8179f8276Q8932j3019j6670K0105m370j2269M7541L016J099J2058K7473k8963
8167E6657r8520j1634k5000j8767L4970N4366k7234n2243k1625L4226k4115m9602
8155a48521M6557Q6925j1310m4257L1899M9206M0924j773k0755K9346k3066q129
8143B7046m1787k5134J6770j2186l6454O1979J5435j4613k6040L0820J938j3935
$$ plain form
8131 -16161 24240 -31599 -41319 -44788 -54101 7443 50082 7155 -53876 -86357 -124999 -112911
8119 -112911 -70965 -20849 11433 241 -8599 -36420 4713 7170 -29365 -56728 -134928 -131500
8107 -131500 -109600 -86309 -30336 -33868 -62663 -26868 27563 12862 -29691 -68294 -27988 -1338
8095 -1338 29372 39856 -2797 -39728 -34192 -41788 -77726 -51557 -6058 40755 30186 -54190
8083 -54190 -66159 -48988 -1877 -3825 20909 46206 25613 -8116 4276 20784 -22742 -93680
8071 -93680 -124383 -66130 -33847 -20211 12109 -23905 -42885 -22172 80882 52793 -19360 -25081
8059 -25081 -47766 -92935 -77293 -90156 -146771 -166004 -178184 -133174 -100254 -42259 14349 55805
8047 55805 56225 3890 -51996 -84061 -79803 -111377 -120729 -112675 -49513 -7542 33939 13567 18021
$$ packed form
8131a6161M0401n5839r720l469r313O1544M2639m2927o1031l2481l8642J2088
8119a12911M1946N0116L2282j1192q840k7821M1133K457l6535k7363p8200L428
8107a31500K1900K3291N5973l532k8795L5795N4431j4701m2553l8603M0306K6650
8095a338L0710J0484m2653l6931N536p596l5938K6169M5499M6813j0569q4376
8083e4190j1969J7171M7111j948K4734K5297k0593l3729J2392J6508m3526p0938
8071i3680l0703N8253L2283J3636L2320l6014j8980K0713J03054k8089p2153n721
8059b5081k2685m5169J5642j2863n6615j9233j2180M5010L2920N7995N6608M1456
8047E5805M20n2335n5886l2065M258l1574r352Q054O3162M1971M1481k0372M454
$$ plain form
8034 18021 18936 -10483 -62337 -120686 -168815 -116265 14173 59040 32564 41228 56506 8198
8022 8198 -12084 12061 -10920 -45701 -14050 13694 3340 -46432 4356 30207 -961 -36813
8010 -36813 -71268 -64853 -80930 -88309 -25192 15906 -3506 -3200 16054 5454 -29785 -58062 -47020
7997 -47020 6548 30560 16012 7462 53031 27961 -35684 -42702 15456 32005 -21010 -21149 -30428
7984 -30428 -73270 -37009 16586 46705 44106 18652 636 -13257 -53801 -32230 -5416 427
7972 427 -41791 -74559 -52542 -69195 -44471 -17813 -24294 -20785 6636 11423 -21081 -20997 -29509 4609
7958 4609 33893 53522 48299 48143 38692 41022 34363 -312 -39002 -92958 -97217 -93015 -85763 -48686
7944 -48686 532 -17047 -42025 -34887 -14153 2914 20770 30243 80575 63645 16289 -60292
$$ packed form
8034A8021R15k9419n1854n8349m8129N2550J30438M4867k6476Q664J5278m8308
8022H198k0282K4145k2981l4781L1651K7744j0354m9772N0788K5851l1168l5852
8010c6813l4455O415j6077p379O3117M1098j9412L06J9254j0600l5239k8277J1042
7997d7020N3568K4012j4548q550M5569k5070o3645p018N8158J6549n3015j39r279
7984c0428m2842L6261N3595L0119k599k5454j8016j3893m0544K1571K6814N843
7972D27m2218l2768K2017j6653K4724K6658o481L509K7421M787l2504Q4q512L4118
7958D609K9284J9629n223j56r451K330o659l4675l8690n3956m259M202P252L7077
7944d8686M9218j7579k4978P138K0734J7067J7856R473N0332j6930m7356p6581
$$ plain form
7932 -60292 -84925 -79609 -91194 -101657 -90444 -105379 -78268 -37714 -75417 -95602 -38934 -5720
7920 -5720 -12440 -34973 -44341 -27456 -18154 -78369 -116673 -136409 -71272 1610 35924 45136 15978
7907 15978 33661 -15910 -19341 11844 23706 2536 -4309 34910 70691 90445 92906 75423
7895 75423 72162 39428 26018 -5532 9926 42565 43720 108192 104564 18873 -3615 5705 21151
7882 21151 10321 -17138 18830 -21569 -94389 -56991 17049 99821 99558 74422 34575 36631
7870 36631 87294 82493 19229 -24033 -74628 -72536 -69335 -56813 -68752 -48100 2538 26718
7858 26718 27429 43658 40150 16297 -30033 -67527 -28290 23772 -11146 6762 35073 22638
7846 22638 -29633 -33271 -64440 -71257 -33705 -60593 -24152 31729 80571 47786 -7073 -42462
$$ packed form
7932f0292k4633N316j1585j0463J1213j4935K7111M0554l7703k0185N6668L3214
7920e720o720k2533r368J6885R302o0215l8304j9736O5137P2882L4314R212k9158
7907A5978J7683m9571l431L1185J1862k1170o845L9219L5781J9754K461j7483
7895G5423l261l2734j3410l1550J5458L2639J155O4472l628q5691k2488R320J5446
7882B1151j0830k7459L5968m0399p2820L7398P4040Q2772k63k5136l9847K056
7870C6631N0663m801o3264m3262n0595K092L201J2522j1939K0652N0638K4180
7858B6718P11J6229l508k3853m6330l7494L9237N2062l4918J7908K8311j2435
7846B2638n2271l638l1169o817L7552k6888L6441N5881M8842l2785n4859l5389
$$ plain form
7834 -42462 -55480 -74107 -71941 -62315 -14936 35010 34236 -4440 -5329 13371 -20417 15793 -15089
7821 -15089 -11582 -21715 -6817 -19271 -63335 -43976 -19979 27234 39733 18669 28319 59017
7809 59017 52188 7356 -44030 -51066 -30444 -38497 -16466 7786 -25122 -2365 1630 -37506 -52098
7796 -52098 -75108 -42892 -39693 -73165 -68197 8367 53943 63766 7390 12187 15734 -3770 -37163
7783 -37163 -38569 -59225 -35228 -15433 10627 71782 96487 80118 70756 63796 109172 64896
7771 64896 12482 11995 8529 -29379 -40406 -39936 -57415 -55826 -21195 -5803 -16083 -90413 -125966
7758 -125966 -135056 -93931 -26931 -12598 -83829 -109860 -107435 -73739 -62431 -39395 -45784 -6503
7746 -6503 5789 2187 15725 17095 15288 22208 30061 7117 9802 -32460 -68010 -33152 -54488
$$ packed form
7834d2462j3018j8627K166R626M7379M9946p74l8676q89J8700l3788L6210l0882
7821a5089L507j0133J4898j2454m4064J9359K3997M7213J2499k1064R650L0698
7809E9017o829m4832n1386p036K0622q053K2031K4252l2908K2757L995l9136j4592
7796e2098k3010L2216L199l3472M968P6564M5576R823n6376M797L547j9504l3393
7783c7163j406k0656K3997J9795K6060O1155K4705j6369r362o960M5376m4276
7771F4896n2414m87l466l7908j1027M70j7479J589L4631J5392j0280p4330l5553
7758a25966r090M1125O7000J4333p1231k6031K425L3696J1308K3036o389L9281
7746f503J2292l602J3538J370j807O920P853k2944K685m2262l5550L4858k1336
$$ plain form
7733 -54488 -63338 -34130 -49453 -43183 -44844 3938 56972 101170 80809 73250 60742 -911 -40152
7720 -40152 -28376 -23559 -66562 -73253 -19332 48454 24243 -32200 -98752 -77888 -17690 40074
7708 40074 34265 17621 12693 -5891 28377 106613 83520 104508 73267 35462 27759 7514
7696 7514 -61667 -74430 -91540 -80737 -65674 -84306 -26396 -23579 -98618 -113684 -103891 -56003
7684 -56003 6272 36430 8411 -16277 -56376 -66892 -66874 7897 19970 -43818 -121904 -108170
7672 -108170 -61166 -33393 -24597 25317 -2700 -63664 -21302 -10217 -28992 -5577 50463 30587
7660 30587 6105 19111 7485 -40429 -80393 -87087 -88826 -83340 -29358 -65570 -123721 -112187
7648 -112187 -99982 -68419 -39115 -48132 -72379 -69927 -86260 -100903 -82338 -82391 -89446 -73452 -56969
$$ packed form
7733e4488q850K9208j5323O270j661M8782N3034M4198k0361p559j2508o1653l9241
7720d0152J1776M817m3003o691N3921O7786k4211n6443o6552K0864O0198N7764
7708D0074n809j6644m928j8584L4268P8236k3093K0988l1241l7805p703k0245
7696G514o9181j2763j7110J0803J5063j8632N7910K817p5039j5066R793M7888
7684e6003O2275L0158k8019k4688m0099j0516J8P4771J2073o3788p8086J3734
7672a08170M7004K7773Q796M9914k8017o0964M2362J1085j8775K3415N6040j9876
7660C0587k4482J3006j1626m7914l9964o694j739N486N3982l6212n8151J1534
7648a12187J2205L1563K9304r017k4247K452j6333j4643J8565n3p055J5994J6483
$$ plain form
7635 -56969 -82739 -76756 -55205 -29979 -51809 -97701 -103750 -97541 -52969 -57310 -45312 -52487 -103490
7622 -103490 -146097 -124679 -74907 -14446 -8288 -32291 -2994 35845 30686 51375 49870 3406
7610 3406 -31515 8269 5533 -62754 -88889 -48933 19669 61908 37366 -4862 -12758 27345
7598 27345 85233 59769 46020 9663 -60008 -103867 -93915 -67059 -80159 -89181 -42353 19576
7586 19576 46803 -5382 -17255 -24026 -63851 -78475 -70898 -40644 -40158 -52025 -16605 -27523 -50560
7573 -50560 -79 25993 -18131 -27693 11760 35737 -26485 -90163 -63232 -55168 -79646 -71182
7561 -71182 -37678 -34575 -33536 -78645 -103298 -78578 -116085 -41853 6051 -44447 -86887 -105913
7549 -105913 -61459 -45013 -19528 -18382 -8547 -9674 -43196 -21982 42049 46922 3064 61242
$$ packed form
7635e6969k5770N983K1551K5226k1830m5892o049O209M4572m341J1998p175n1003
7622a03490m2607K1418M9772O0461O158k4003K9297L8839n159K0689j505m6464
7610C406l4921L9784k736o8287k6135L9956O8602M2239k4542m2228p896M0103
7598B7345N7888k5464j3749l6357o9671m3859R952K6856j3100r022M6828O1929
7586A9576K7227n2185j1873o771l9825j4624P577L0254M86j1867L5420j0918k3037
7573e0560N0481K6072m4124r562L9453K3977o2222o3678K6931Q064k4478Q464
7561g1182L3504L103J039m5109k4653K4720l7507P4232M7904n0498m2440j9026
7549a05913M4454J6446K5485J146R835j127l3522K1214O4031M873m3858N8178
$$ plain form
7537 61242 81145 57085 3540 27513 33356 18291 14557 -2189 -870 33327 115388 89986
7525 89986 15565 19517 13211 10405 63695 14333 -24871 -19668 -38539 -23226 33222 29909 -8735
7512 -8735 -51684 -48480 18994 -6686 -130549 -116983 -46570 -9700 31167 13136 463 28024
7500 28024 -528 -7547 29761 44818 59490 35107 7424 -16896 -64458 -1047 -1420 13792
7488 13792 -3245 -51763 -85799 -135493 -147017 -96166 -40733 -8697 40143 27137 47305 -5561
7476 -5561 -7935 28215 -5616 -9904 4025 12011 -21858 -30238 1599 2600 -6737 12004 -22283
7463 -22283 -79017 -9318 62768 47349 43947 85696 104981 112716 75929 43964 -4401 -56619
7451 -56619 -66102 -43419 -31559 -49311 -29087 -20292 -82168 -74978 -50079 2554 42345 19935
$$ packed form
7537F1242J9903k4060n3545K3973N843j5065l734j6746J319L4197Q2061k5402
7525H9986p4421L952o306k806N3290m9362l9204N203j8871J5313N6448l313l8644
7512h735m2949L204O7474k5680j23863J3566P0413L6870M0867j8031j2673K7561
7500B8024k8552p019L7308J5057J4672k4383k7683k4320m7562O3411l73J5212
7488A3792j7037m8518l4036m9694j1524N0851N5433L2036M8840j3006K0168n2866
7476e561k374L6150l3831m288J3929P986l3869q380L1837J001r337J8741l4287
7463b2283n6734O9699P2086j5419l402M1749J9285P735l6787l1965m8365n2218
7451e6619r483K2683J1860j7752K0224Q795o1876P190K4899N2633L9791k2410
$$ plain form
7439 19935 39843 45161 -23045 18721 65168 51132 8716 -6425 15898 -71101 -98625 -34511
7427 -34511 13049 87577 104619 43779 35651 2062 -52882 -74940 -29842 5160 -12160 -21299
7415 -21299 -20309 -41179 -1082 44327 30164 13065 30381 42271 -2666 -10750 -5093 4044 -7864
7402 -7864 -21229 -13976 32313 45446 78836 28822 1299 19562 29023 57538 46773 12877
7390 12877 10794 84 -39702 -30859 32318 20487 3812 -7829 -38241 -12846 -21964 -6579
7378 -6579 -52566 -70116 -67889 -111482 -68138 -71383 -125364 -86806 -104594 -82040 -44932 14246
7366 14246 3238 -5742 30466 40090 38850 -12448 -67115 -91570 -63863 -25 31617 26789 4410
7353 4410 -22015 51917 43625 16356 -23084 -104393 -113517 -41968 -8303 -13338 7636 29651 49761
$$ packed form
7439A9935J9908N318o8206M1766M6447j4036m2416j5141K2323q6999k7524O4114
7427c4511M7560P4528J7042o0840q128l3589n4944k2058M5098L5002j7320r139
7415b1299R90k0870M0097M5409j4163j7099J7316J1890m4937q084N657R137j1908
7402g864j3365P253M6289J3133L3390n0014k7523J8263R461K8515j0765l3896
7390A2877k083j0710l9786Q843O3177j1831j6675j1641l0412K5395r118J5385
7378f579m5987j7550K227m3593M3344l245n3981L8558j7788K2554L7108N9178
7366A4246j1008q980L6208R624j240n1298n4667k4455K7707O3838L1642m828k2379
7353D410k6425P3932q292k7269l9440q1309r124P1549L3665n035K0974K2015K0110
$$ plain form
7340 49761 -7655 -23573 5894 44358 86457 44973 76154 82951 100996 89574 71811 27189
7328 27189 -1552 -33115 -34025 -24995 -9286 -53857 -54313 -9038 50586 47650 41278 81588 58565
7315 58565 47064 48273 16238 966 -45641 -46064 16707 -7952 -23719 17631 18796 62807 70724
7302 70724 18027 -18026 -22806 -18493 -18831 -19379 18938 81194 82306 28155 -25581 -7774 48171
7289 48171 15590 -61387 14816 59080 24889 -40814 -54829 -44207 -67157 -82267 -57839 -27600
7277 -27600 20833 25304 7693 3487 33242 83730 96645 44116 36527 59799 59187 23506 314
7264 314 -30187 42009 84771 87692 121382 99416 62335 2429 -46955 -5730 38913 11709
7252 11709 13064 -22272 -22663 -41502 -124902 -100619 -71045 -117282 -103082 -67894 -102070 -135230
$$ packed form
7340D9761n7416j5918K9467L8464M2099m1484L1181O797J8045j1422j7763m4622
7328B7189k8741l1563r10R030J5709m4571m56M5275N9624k936o372M0310k3023
7315E8565j1501J209l2035j5272m6607m23O2771k4659j5767M1350J165M4011P917
7302G0724n2697l6053m780M313l38n48L8317O2256J112n4151n3736J7807N5945
7289D8171l2581p6977P6203M4264l4191o5703j4015J0622k2950j5110K4428L0239
7277b7600M8433M471j7611m206K9755N0488J2915n2529p589K3272o12l5681k3192
7264C14l0501P2196M2762K921L3690k1966l7081n9906m9384M1225M4643k7204
7252A1709J355l5336l91j8839q3400K4283K9574m6237J4200L5188l4176l3160
$$ plain form
7240 -135230 -88269 -18244 54847 9501 -50207 -26844 -36039 -27089 -21829 -12684 -9152 43554 88087
7227 88087 64382 7089 -4236 -6236 17364 36262 72013 121792 66184 -12235 -60555 -52028
7215 -52028 -47368 -60208 -4378 10301 -24911 -105209 -110395 -114883 -133647 -112769 -79678 -30538
7203 -30538 -49767 -61637 -63536 -89459 -94891 -111541 -87768 -54631 5042 77705 54901 14533
7191 14533 13213 12223 38485 2148 -25767 -54537 -9550 7035 25417 14231 31548 43534
7179 43534 17528 7871 3391 2923 36483 -19252 -29075 43584 77936 47699 8696 6197 39599
7166 39599 62888 19484 1377 -47918 -52102 -23118 19367 -949 -13043 -54508 -40198 5811
7154 5811 31287 -15149 -92506 -130295 -83651 -48197 -55202 -57429 -12817 40264 52218 14855
$$ packed form
7240a35230M6961P0025P3091m5346n9708K3363r195Q950N260R145L532N2706M4533
7227H8087k3705n7293j1325k000K3600J8898L5751M9779n5608p8419m8320Q527
7215e2028M660j2840N5830J4679l5212q0298n186m488j8764K0878L3091M9140
7203c0538j9229j1870j899k5923n432j6650K3773L3137N9673P2663k2804m0368
7191A4533j320r90K6262l6337k7915k8770M4987J6585J8382j1186J7317J1986
7179D3534k6006r657m480m68L3560n5735r823P2659L4352l0237l9003k499L3402
7166C9599K3289m3404j8107m9295m184K8984M2485k0316j2094m1465J4310M6009
7154E811K5476m6436p7357l7789M6644L5454p005k227M4612N3081J1954l7363
$$ plain form
7142 14855 -1448 -8807 -16805 -56985 1791 37599 8573 -2269 -30868 -41020 30118 59541
7130 59541 47648 29543 -10584 -80147 -53950 -21012 1492 19720 6019 -21306 -55643 -4541
7118 -4541 28769 1022 -12441 -40116 -100660 -98154 -87581 -90281 -40762 -11510 29818 36412 61540
7105 61540 47674 22556 72118 50665 16309 -13069 -76486 -79770 -105782 -94522 -86226 -90732
7093 -90732 -77024 -66279 -79014 -129769 -126765 -108515 -88304 -53587 -72943 -42006 -61147 -34535
7081 -34535 -63738 -80443 -80645 -70089 -75914 -77448 -66516 -8500 15665 7848 -21862 -25790 28079
7068 28079 108580 81624 66247 24043 25228 22909 -41313 -36950 -5437 52925 -2841 -38598
7056 -38598 -42645 -20511 8489 -4333 19205 49915 14096 -36979 336 -9232 4975 -7558
$$ packed form
7142A4855j6303p359p998m0180N8776L5808k9026j0842k8599j0152P1138K9423
7130E9541j1893j8105m0127o9563K6197L2938K2504J8228j3701k7325l4337N1102
7118d541L3310k7747j3463k7675o0544K506J0573k700M9519K9252M1328O594K5128
7105F1540j3866k5118M9562k1453l4356k9378o3417l284k6012J1260Q296m506
7093i0732J3708J0745j2735n0755L004J8250K0211L4717j9356L0937j9141K6612
7081c4535k9203j6705k02J0556n825j534J0932N8016K4165p817k9710l928N3869
7068B8079Q0501k6956j5377m2204J185k319o4222M363L1513N8362n5766l5757
7056c8598m047K2134K9000j2822K3538L0710l5819n1075L7315r568J4207j2533
$$ plain form
7044 -7558 8929 12959 -6 -60917 -52015 71228 115218 124370 135949 112057 74190 9495
$$ packed form
7044g558J6487M030j2965o0911Q902J23243M3990R152J1579k3892l7867o4695
$$ [...]
##END NTUPLES=NMR SPECTRUM
##END=
