##TITLE=Analysis number 310949
Compound Code rf 03850
Project Code adrs
Chemist Name hixia
##JCAMPDX= 6.0         $$ Bruker NMR JCAMP-DX V2.0
##DATA TYPE= NMR SPECTRUM
##DATA CLASS= NTUPLES
##ORIGIN= Bruker BioSpin GmbH
##OWNER= NMR
$$ XWIN-NMR		Version 3.5
$$ Tue Jun 28 10:23:55 2005 GMT Daylight Time (UT+1h)  MAYBRIDGE\NMR@NMR_250MHZ
##.OBSERVE FREQUENCY= 250.131544655141
##.OBSERVE NUCLEUS= ^1H
##.ACQUISITION MODE= SIMULTANEOUS (DQD)
##.ACQUISITION SCHEME= undefined
##.AVERAGES= 16
##.DIGITISER RES= 18
##SPECTROMETER/DATA SYSTEM= dpx250
##.PULSE SEQUENCE= zg30
##.SOLVENT NAME= CDCl3
##.SHIFT REFERENCE= (INTERNAL, CDCl3, 0, 16.522)
##AUDIT TRAIL= $$ (NUMBER, WHEN, WHO, WHERE, WHAT)
$$ ##TITLE= Audit trail, XWIN-NMR		Version 3.5
$$ ##JCAMPDX= 5.01
$$ ##ORIGIN= Bruker BioSpin GmbH
$$ ##OWNER= NMR
$$ C:\u/data/dgb/nmr/ADRS/4880/pdata/1/auditp.txt
$$ ##AUDIT TRAIL=  $$ (NUMBER, WHEN, WHO, WHERE, WHAT)
(   1,<2005-06-28 10:23:36.30 +100>,<MAYBRIDGE\NMR>,<NMR_250MHZ>,
      <created by zg, POWCHK disabled, PULCHK disabled
       configuration hash MD5:
       62 19 C7 07 E1 42 D1 B7 37 6C 3D D0 77 39 F9 E6
       data hash MD5: 64K
       94 66 2C 40 BD 71 0D 5E 1D 76 77 36 63 5C 56 3F>)
(   2,<2005-06-28 10:23:47.38 +100>,<MAYBRIDGE\NMR>,<NMR_250MHZ>,
      <Start of raw data processing
       ef LB = 0.3 FT_mod = 6 PKNL = 1 SI = 32K 
       data hash MD5: 32K
       2A 17 52 52 B7 5C C8 74 B3 5F 6C 4D D7 6F C6 96>)
(   3,<2005-06-28 10:23:49.14 +100>,<MAYBRIDGE\NMR>,<NMR_250MHZ>,
      <apk 
       data hash MD5: 32K
       2C B4 20 DC 5A 3B 26 2C 04 CD 5C 65 2D 71 32 50>)
(   4,<2005-06-28 10:23:49.88 +100>,<MAYBRIDGE\NMR>,<NMR_250MHZ>,
      <abs ABSG = 5 
       data hash MD5: 32K
       35 D7 5F 3A D8 61 9D E9 4A 18 06 0E C6 F9 D1 0D>)
$$ ##END=
$$ 
$$ hash MD5
$$ 23 79 02 9E EC 9E 48 7E 0E 2B 29 03 E7 59 A9 E0
##$RELAX= 
##$RELAX= 
##$RELAX= 
##$RELAX= 
##$RELAX= 
##$RELAX= 
##$RELAX= 
$$ Bruker specific parameters
$$ --------------------------
##$DU= <C:\u>
##$EXPNO= 4880
##$NAME= <ADRS>
##$PROCNO= 1
##$TYPE= <nmr>
##$USER= <dgb>
##$AMP= (0..31)
100 100 100 100 100 100 100 100 100 100 100 100 100 100 100 100 100 100 
100 100 100 100 100 100 100 100 100 100 100 100 100 100 
##$AQSEQ= 0
##$AQ_mod= 3
##$AUNM= <au_zg>
##$AUTOPOS= <14 >
##$BF1= 250.13
##$BF2= 250.13
##$BF3= 250.13
##$BF4= 250.13
##$BF5= 500.13
##$BF6= 500.13
##$BF7= 500.13
##$BF8= 500.13
##$BYTORDA= 1
##$CFDGTYP= 0
##$CFRGTYP= 5
##$CHEMSTR= <none>
##$CNST= (0..31)
1 1 145 1 1 1 1 1 1 1 1 1 1 1 1 1 1 1 1 1 1 1 1 1 1 1 1 1 1 1 1 1 
##$CPDPRG= <>
##$CPDPRG1= <>
##$CPDPRG2= <>
##$CPDPRG3= <>
##$CPDPRG4= <mlev>
##$CPDPRG5= <mlev>
##$CPDPRG6= <mlev>
##$CPDPRG7= <mlev>
##$CPDPRG8= <mlev>
##$CPDPRGB= <>
##$CPDPRGT= <>
##$D= (0..31)
0 1 0 0 0 0 0 0 0 0.06 0 0 0 0 0 0 0.0002 0 0 0 0 0 0 0 0 0 0 0 0 0 0 
0 
##$DATE= 1119950615
##$DBL= (0..7)
120 120 120 120 120 120 120 120 
##$DBP= (0..7)
150 150 150 150 150 150 150 150 
##$DBP07= 0
##$DBPNAM0= <>
##$DBPNAM1= <>
##$DBPNAM2= <>
$$ [...]
##$SUBNAM7= <"">
##$SUBNAM8= <"">
##$SUBNAM9= <"">
##$SW= 20.6930455092707
##$SWIBOX= (0..15)
0 0 3 0 0 0 0 0 0 0 0 0 0 0 0 0 
##$SW_h= 5175.983436853
##$TD= 65536
##$TD0= 1
##$TE= 295.16
##$TE2= 300
##$TE3= 300
##$TEG= 300
##$TL= (0..7)
0 120 120 120 120 120 120 120 
##$TP= (0..7)
150 150 150 150 150 150 150 150 
##$TP07= 0
##$TPNAME0= <>
##$TPNAME1= <>
##$TPNAME2= <>
##$TPNAME3= <>
##$TPNAME4= <>
##$TPNAME5= <>
##$TPNAME6= <>
##$TPNAME7= <>
##$TPOAL= (0..7)
0.5 0.5 0.5 0.5 0.5 0.5 0.5 0.5 
##$TPOFFS= (0..7)
0 0 0 0 0 0 0 0 
##$TUNHIN= 0
##$TUNHOUT= 0
##$TUNXOUT= 0
##$USERA1= <user>
##$USERA2= <user>
##$USERA3= <user>
##$USERA4= <user>
##$USERA5= <user>
##$V9= 5
##$VALIST= <valist>
##$VCLIST= <CCCCCCCCCCCCCCC>
##$VD= 0
##$VDLIST= <DDDDDDDDDDDDDDD>
##$VPLIST= <PPPPPPPPPPPPPPP>
##$VTLIST= <TTTTTTTTTTTTTTT>
##$WBST= 1024
##$WBSW= 4
##$XGAIN= (0..3)
0 0 0 0 
##$XL= 0
##$YL= 0
##$YMAX_a= 317358
##$YMIN_a= -277143
##$ZGOPTNS= <>
##$ZL1= 120
##$ZL2= 120
##$ZL3= 120
##$ZL4= 120
##$ABSF1= 16.522
##$ABSF2= -4.171173
##$ABSG= 5
##$ABSL= 3
##$ALPHA= 0
##$AQORDER= 0
##$ASSFAC= 0
##$ASSFACI= 0
##$ASSFACX= 0
##$ASSWID= 0
##$AUNMP= <proc_1d>
##$AZFE= 0.1
##$AZFW= 0.1
##$BCFW= 0
##$BC_mod= 0
##$BYTORDP= 0
##$COROFFS= 0
##$CY= 12.5
##$DATMOD= 1
##$DC= 0
##$DFILT= <>
##$DTYPP= 0
##$F1P= 14.0000005364418
##$F2P= -0.99999901652339
##$FCOR= 0.5
##$FTSIZE= 32768
##$FT_mod= 6
##$GAMMA= 0
##$GB= 0
##$INTBC= 1
##$INTSCL= 1
##$ISEN= 128
##$LB= 0.3
##$LEV0= 0
##$LPBIN= 0
##$MAXI= 10000
##$MC2= 0
##$MEAN= 0
##$ME_mod= 0
##$MI= 0
##$NCOEF= 0
##$NC_proc= -3
##$NLEV= 6
##$NOISF1= 0
##$NOISF2= 0
##$NSP= 0
##$NTH_PI= 0
##$NZP= 0
##$OFFSET= 16.522
##$PC= 1
##$PHC0= -77.28386
##$PHC1= 15.11893
##$PH_mod= 1
##$PKNL= yes
##$PPARMOD= 0
##$PSCAL= 4
##$PSIGN= 0
##$REVERSE= no
##$SF= 250.13
##$SI= 32768
##$SIGF1= 0
##$SIGF2= 0
##$SINO= 400
##$SIOLD= 32768
##$SREGLST= <1H.CDCl3>
##$SSB= 0
##$STSI= 32768
##$STSR= 0
##$SW_p= 5175.98343685301
##$SYMM= 0
##$S_DEV= 0
##$TDeff= 65536
##$TDoff= 0
##$TI= <Analysis number 999999
Compound Code 99
Book Reference 9
Project Code 9>
##$TILT= no
##$TM1= 0
##$TM2= 0
##$TOPLEV= 0
##$USERP1= <user>
##$USERP2= <user>
##$USERP3= <user>
##$USERP4= <user>
##$USERP5= <user>
##$WDW= 1
##$XDIM= 32768
##$YMAX_p= 398083750
##$YMIN_p= -304648
$$ End of Bruker specific parameters
$$ ---------------------------------
##NTUPLES= NMR SPECTRUM
##VAR_NAME=  FREQUENCY,     SPECTRUM/REAL,   SPECTRUM/IMAG
##SYMBOL=    X,             R,               I
##VAR_TYPE=  INDEPENDENT,   DEPENDENT,       DEPENDENT
##VAR_FORM=  AFFN,          ASDF,            ASDF
##VAR_DIM=   32768,         32768,           32768
##UNITS=     HZ,            ARBITRARY UNITS, ARBITRARY UNITS
##FACTOR=    0.157963299565203, 1,           1
##FIRST=     4132.6476996994, 0,             0
##LAST=      -1043.33573715361, 0,           0
##MIN=       -1043.33573715361, -304648,     0
##MAX=       4132.6476996994, 398083750,     0
$$ Real data points
##PAGE= N=1
##DATA TABLE= (X++(R..R)), XYDATA
$$ [...]
24537c7877J626n673P8090L731o0168l8674L6981l4711l6691Q4710N6581l3186
24525A4739n7383p990K8685J12372K9636j15420k2594L2825J3719J9865j3438
24514C5016l477o002L5246o6183r713j577l77Q8485M1637O672o7950k9176L5853
24501E8454q520J9886l6679J4293Q744L033j6917j5399k8772K6564K6650m0300
24489A1037N403L385M9799J4612n5695k8633j8714M2786J6847k35n006J0038r153
24476C6471j0698m852l7697j3423N6417K8445p0545m8605J3661L3886n8109l1044
24464a06093L7043m871P82L0278r662l6286o194L2176m2395j2289J1819N0986
24452e4706M067O9175j2255j6602q69m4610o2524J26171O8813l1429l5230l6427
$$ y = [-37877, -36251, -41924, 36166, 39897, -20271, -58945, -21964, -56675, -93366, -8656, 47925, 14739, -42644, -50634, -21949, 90423, 120059, 4639, -17955, 14870, 28589, 48454, 35016, 31539, 25537, 60783, -5400, -15113, -16690, -17067, 71418, 113055, 119727, 51777, 22601, 58454, 49934, 69820, 33141, 47434, 56178, 59211, 42294, 26895, -1877, 24687, 51337, 11037, 16440, 19825, 69624, 84236, 28541, -92, -18806, 23980, 40827, 40592, 35586, 45624, 36471, 25773, 20921, -16776, -30199, 26218, 54663, -15882, -64487, -50826, -16940, -75049, -106093, -69050, -73921, -73139, -42861, -52523, -88809, -95003, -62827, -105222, -117511, -105692, -54706, -50639, 18536, 6281, -10321, -11190, -55800, -118324, 7847, 76660, 45231, 10001, -26426]
24440b6426o386J9730n3460Q6416j4050k2792J2311j8295K7849M254K2457p68
24428C0840L7091l3552k3022o7274p945P7568N5301K4858j7744l7663m897m9046
24416a5485K6372M3572j2369o13n1780L7720m50m1225n8723N9868N5090K4226
24404F6203o247J7307j2037J7923o8784k9127j7598j3673M2779l9620k7769J3227
24392e7416M8684N4080P930M9486J0935j15729l9591J3516J9254K7620M4624k3822
24380C9571k6652M544l2449M1786N320K9580L216k9223r1464p858O4117J7761
24368A8249n5030n2336M8627O7006L2526Q0939q015o6879M8104L3841o5402q5741
24356d111l8086K3689N3864J0240J5838L3958J4857q4281j16012N591K6505L4647
$$ y = [-26426, -32812, -13082, -66542, 19874, 5824, -16968, -4657, -22952, 4897, 9151, 31608, 30840, 67931, 34379, 11357, -55917, -63862, 13706, 69007, 93865, 76121, 38458, 33561, -15485, 10887, 54459, 42090, 41477, -10303, 27417, 26967, -14258, -72981, -13113, 41977, 66203, 59956, 77263, 65226, 83149, 14365, -14762, -32360, -46033, -3254, -42874, -70643, -57416, -8732, 45348, 53278, 102764, 113699, -2030, -41621, -28105, -8851, 18769, 63393, 39571, 12919, 17463, -14986, 26800, 32120, 61700, 64916, 35693, -55771, -63629, 488, 18249, -36781, -89117, -40490, 26516, 59042, 139981, 131966, 65087, 113191, 147032, 81630, -4111, -42197, -18508, 35356, 45596, 61434, 95392, 110249, 25968, -90044, -84453, -57948, -23301]
24344b3301k278K210l1988Q054L6119N6914l8408o3141q939K555L8078L1612j3581
24331f094J4675L9210N0389N516o021m2299n9330k5189N7482N059m7192o7477
24319h1271r169L3710l8568J465M3972n535J7902n262k1626j7801J9178P5384
24307A2379L7311j1143k7672n2956o4885n06M9277M9136O4277Q3292l4264o9293
24295C4953q1597n8404m5713K658P6552K7837m4773J4774Q2555P0381N774o3902
24283B1095l5682j3771l3005J9732j9709P6609M3478l2812q9536N0641j759q0803
24271i5522O4027O7123N0268J8610m4325l1969O980m257l4105K6963J6239M992
24259D5024j9802o1749n7002N4180J8479J7500P744j9930J6640M6867l4064n5802
$$ y = [-23301, -25579, -23369, -55357, -47303, -11184, 45730, 7322, -55819, -64758, -62203, -24125, 7487, -6094, 8581, 47791, 98180, 103696, 97675, 55376, -3954, -29143, 28339, 33398, -13794, -81271, -90440, -56730, -95298, -93833, -49861, -55396, -37494, -42756, -64382, -82183, -63005, 12379, 49690, 38547, 10875, -42081, -106966, -107472, -58195, -9059, 55218, 138510, 104246, 34953, -46644, -105048, -150761, -148103, -71551, -43714, -88487, -73713, 8842, 79223, 84997, 21095, -14587, -28358, -61363, -41631, -61340, 15269, 58747, 25935, -63601, -12960, -14719, -95522, -31495, 35628, 85896, 104506, 60181, 28212, 35192, 30935, -3170, 23793, 40032, 45024, 25222, -36527, -93529, -39349, -20870, -3370, 4374, -15556, 1084, 47951, 13887, -41915]
24247d1915n5442k9602P3769l406o4464j636Q9813M0765N6421k5142J9241M2287
24235A00689J9066k9190k327m7683n1327J9189j5882l6470j9082J2016J7228m7909
24223h1682m1986k3851j1320L2783P4633K5599N847p5013k1101L4824P2253P2388
24211F3374j6636J1114J7056o5448j01744o7018K1888J07214R2446J48p7224m2619
24199e7449N979k7216O0355P239n6677l4435K4432J03045J4566k1336o8014o2302
24187a11813J5303L6209N7238o89J4619n6962L0255J1088M6863n6762n3654k9504
24175i7809M7101M3641q282P159m5062n769q505L4682j0172J3668K1137j3516
24163b1727o024O328j6554N5687J9519P528L5594K1335l8901K594J1204p2417
$$ y = [-41915, -97357, -126959, -53190, -56596, -121060, -122696, -32883, 7882, 64303, 39161, 58402, 100689, 119755, 90565, 88238, 40555, -10772, 8417, -7465, -43935, -63017, -51001, -33773, -81682, -123668, -147519, -158839, -126056, -51423, -25824, -19977, -94990, -116091, -81267, -9014, 63374, 46738, 57852, 74908, 9460, -92284, -159302, -137414, -30200, 62246, 62394, -14830, -57449, -51470, -78686, -18331, -11092, -67769, -102204, -77772, 25273, 39839, 18503, -49511, -111813, -96510, -60301, -3063, -3752, 10867, -46095, -15840, -4752, 42111, -14651, -68305, -97809, -50708, -7067, -15349, -8190, -53252, -59021, -67526, -32844, -43016, -29348, -8211, -21727, -27751, -21423, -37977, 17710, 37229, 44757, 80351, 101686, 62785, 65379, 76583, 4166]
24151D166j7456J9661k0415k1247P9359M7019n536p3830j5939p576l0410o6231
24139a08435j5439P0713L4713L937L7363M3732L0881m5010m7939M3967J3438k6943
24127C4978q0266l36P653J1238j5635l9048l8831M8063L374J7393J697k621N9511
24114G170k077M8881p8209L774R395k9128J954j9729J1810M5420J8452M9019n7180
24101I552o7480j9771J9051K0319K9582K7132K1581o3794n0865M8980J7815l4808
24089d2706J0460N0360j0197m833R354K4698L2769K4938K8831l0472n302m3811
24077D4089k8834k6801n225k373j0578N6194Q081r555J8770Q094j0627l3300O9971
24064G7906N4052p4362l1547N9189m0748o0794k1416N2556K9203K5017L4061o1193
$$ y = [4166, -13290, 6371, -14044, -35291, 44068, 91087, 85551, 11721, -4218, -11794, -42204, -108435, -123874, -53161, -18448, -14511, 22852, 66584, 97465, 52455, 4516, 48483, 61921, 34978, -45288, -45624, -37971, -26733, -42368, -81416, -120247, -72184, -68810, -51417, -49720, -52341, 7170, 5093, 53974, -24235, -20461, -11066, -40194, -38240, -57969, -46159, -739, 17713, 66732, 9552, -57928, -77699, -58648, -38329, -8747, 18385, 39966, -23828, -74693, -25713, -7898, -42706, -32246, 18114, 7917, 3084, 12438, 37136, 69905, 94843, 123674, 93202, 87900, 44089, 15255, -11546, -16771, -19144, -29722, 26472, 34553, 24998, 43768, 51862, 41235, 7935, 77906, 131958, 57596, 26049, 85238, 44490, -16304, -37720, 14836, 44039, 69056, 103117, 41924]
24052D1924L1682N1081r7963j8065O8632L28p6126k5118J4785J5479j8834N109
24040g086P4851J1306R65j1694n308l2695l3023M4197r1038j9198M1406r444N2699
24027A5938p175p980m315m1312l3622K419J7573o3533M9686J6285J1614L4748
24015i674l996n3466Q4197O5310l9101m0403k5765k6239J9861m5829l0734L5223
24003g0616J0930j7102L3073j554R6716k9069r6241l9101P3609l018J7015M0046
23991A4688M6049N5567L6062K8735q7652k8477Q7222o4250n4565Q242P813J3456
23979F2890m8174J9549K3340j9316m1972O8301j9106l8451K1927L716j9724p1339
23967e8359j0227M1305K7456J6501j9413j2646K9649q379k1688L1235J2639k7567
$$ y = [41924, 73606, 124687, 26724, 8659, 77291, 77619, 1493, -23625, -8840, 6639, -12195, -7086, 67765, 79071, 80036, 68342, 63034, 30339, -2684, 41513, -49525, -68723, -27317, -36761, 15938, 8763, 783, -3532, -44844, -78466, -76047, -58474, -122007, -72321, -56036, -44422, -9674, -13670, -67136, 17061, 82371, 43270, 2867, -22898, -49137, -29276, -75105, -105839, -70616, -59686, -76788, -43715, -45269, 51447, 22378, -73863, -112964, -39355, -42373, -25358, 14688, 60737, 116304, 152366, 181101, 93449, 64972, 152194, 87944, 33379, 41621, 49434, 62890, 14716, 34265, 57605, 38289, -3683, 64618, 45512, 7061, 28988, 32704, 12980, -58359, -68586, -27281, 175, 16676, -2737, -15383, 14266, 5887, -15801, 15434, 28073, 506]
23955E06J36J7251j6016L027o666L8906Q028l6018p2278o3747O07M1332K9282
23942e5650m227P2360m9946j6089L7885P3253n4599o8662m6606l5939Q0768R0898
23930B3446N2835m9172m693M7725j3979L775n9613j3838P5546k353k7084O538
23918C9133J8289J6m6430K3278L8580k6163n4638m920L2589P5438K9843n244r598
23905A10173p6122n4598p90L0332p494L3817N8331P904k8336p754L1828m5852
23893E1439p8672L643K5139P648r641k9357Q537L89m5551L4322O7770K3556m4928
23880A4294n147j5764q0156n866P310P2723J7540N073l4767L2984N4275k2866
23868C9633k8904m7774n309J4367l5026k222N9004K9859L1322p7676l9687J9627
$$ y = [506, 642, 17893, 1877, 4904, -1762, 37144, 45172, 9154, -63124, -126871, -126264, -84932, -55650, -59877, 12483, -37463, -53552, -15667, 57586, 2987, -65675, -112281, -148220, -67452, 23446, 76281, 27109, 22416, 70141, 56162, 59937, 324, -13514, 62032, 59679, 32595, 39133, 57422, 57438, 11008, 34286, 72866, 46703, -7935, -12855, 19734, 95172, 125015, 119771, 110173, 34051, -20547, -21337, 8995, 1501, 35318, 93649, 101553, 73217, 65463, 97291, 51439, -27233, -23590, 1549, 9197, -444, -29801, -21264, -20875, -66426, -32104, 35666, 59222, 14294, 9147, -6617, -86773, -92639, -85329, -12606, 4934, 10007, -24760, 8224, 62499, 39633, 10729, -37045, -42354, -27987, -63013, -65235, -6231, 23628, 54950, -22726, -62413, -42786]
23856d2786m27o0113m7338K0372J6170J7199k3775j1613k1088J2471J6065N3767
23844g1096Q2547L4339k2887l4170O6096O1603q321m4946j07149R647N0491l5111
23832a8957K9902M7032l4924q4221L6051j1994O565l949M3459j8230k7813j2924
23820e0003q8007J5297J25850O8252n0659l6342j901j1869L6570J1170k3532K2776
23808A7602k5905l4891M8792Q777j04966J3943J1570P2623J7052P931P453n1183
23796a1202n2495M9002O5600M5010p2457p8582k2495N9053n273L7093O2875J0483
23784H6612r133j1903J9505k9634r842k496j1518K3882O545r7200o7828K588N8801
23771d1621R0753j1863k6268k7354k2142P6452l322p2287q9644l4744N1387N5550
$$ y = [-42786, -43213, -103326, -150664, -130292, -114122, -96923, -120698, -132311, -153399, -140928, -124863, -71096, 11451, 45790, 22903, -11267, 54829, 116432, 108111, 63165, -43984, -34337, 16154, -18957, 10945, 57977, 23053, -61168, -25117, -37111, -30546, -34495, 8964, -9266, -37079, -50003, -138010, -122713, 3137, 71389, 20730, -15612, -17513, -29382, 7188, 18358, -5174, 17602, -8303, -43194, 5598, 14375, -90591, -76648, -65078, 7545, 24597, 32528, 39981, -11202, -63697, -14695, 50905, 95915, 23458, -55124, -77619, -18566, -23839, 13254, 76129, 86612, 77479, 65576, 85081, 55447, 45605, 43109, 31591, 55473, 62018, -35182, -103010, -100422, -41621, 49132, 37269, 11001, -16353, -38495, 37957, 34635, -37652, -127296, -162040, -110653, -55103]
23759e5103J8452j047j22m4880J6690J3043N278k4778m6820L081J06982N4581
23747D5357j9677k0328o7005M3777L5552k2023N2693Q1856l4963n6721n3953K378
23735a3057K3799k985k7206k0939K6421M6862M5268L1021J1257n5377m3610m633
23723A6821L4737n6803j7750J72K2294l8511K2481P5482J452q1882J483J4441
23711e583J0699O8011j0536n0027p966k4372k3480n369O3055j5265J6556M6100
23699F1823R200p3130p5637j7873L7835M2122p001l0512j5021O403k6205K7111
23687f0885O0237M8698o8544m2303P4586J00834J0063o9740n2666m9469J2818
23676c6371K1631Q392K2317n0164k7268L2527N9970j9679m0781O3149O2485M0444
$$ y = [-55103, -36651, -37698, -37820, -82700, -66010, -52967, -47689, -72467, -119287, -116206, -9224, 45357, 25680, 5352, -61653, -17876, 17676, -4347, 48346, 130202, 95239, 38518, -15435, -13057, 10742, 7757, -19449, -40388, -13967, 32895, 78163, 109184, 120441, 65064, 21454, 16821, 51558, -5245, -22995, -22823, -529, -39040, -16559, 58923, 60375, -21507, -20024, -5583, 5116, 73127, 62591, 12564, 4598, -19774, -43254, -48623, 14432, -833, 15723, 61823, 71023, -2107, -77744, -95617, -57782, -15660, -22661, -53173, -68194, -61791, -87996, -60885, -648, 48050, -20494, -62797, 11789, 112623, 122686, 52946, 280, -49189, -36371, -14740, -6348, 15969, -34195, -61463, -28936, 31034, 11355, -29426, 33723, 96208, 136652]
23664A36652m5426n3687m7779J80m2543j8383K3455J5486K5444q4444P76k5489
23652a15758M5062l645j0974L7793M120J4154O2571r67L653l7457l5937k2796
23640f0181M0021j083K2180M0522k690k6238o5941p9211M6727K4667L2047M9920
23628B0740j0116k8437o0168J6427P9982K712j11040o472Q6255M163K4180m0097
23616b1871o5365J2128O7053l2150Q0381N9769k8060l0044n7084K0405O0612p7293
23604a1519J425j2159n0245l3855R2022Q5597M1843J4084n2160R940l4880m4456
23592E637l2775l588K2657r525L9594L2087K8540q1958m1754M7463j8105J6771
23580E044R418l3585j6033M5790M7538k1896j10418K5078O7262L5564k8658p7947
$$ y = [136652, 91226, 37539, -10240, -10060, -52603, -70986, -47531, -32045, -6601, -91045, -90269, -115758, -70696, -74341, -85315, -47522, -43402, -29248, 33323, 32356, 36009, -1448, -37385, -60181, -20160, -21243, 937, 41459, 38769, 12531, -53410, -132621, -85894, -61227, -29180, 20740, 10624, -17813, -77981, -61554, 18428, 21140, -89900, -96372, -10117, -5954, 18226, -21871, -87236, -75108, -8055, -40205, 40176, 99945, 71885, 41841, -15243, 5162, 65774, -11519, -10094, -22253, -72498, -106353, -14331, 71266, 113109, 127193, 75033, 84973, 50093, 5637, -27138, -30726, -8069, -17594, 22000, 54087, 82627, 669, -41085, 6378, -11727, 5044, 14462, -19123, -35156, 10634, 58172, 36276, -74142, -49064, 18198, 53762, 25104, -52843]
23568e2843J6127l5562J4893Q1122K9649m5996J6005m5327m4223j1592P7690q135
23556h192n5911j3713K479M7949M3222J5778j5515o0994K4009J2998n224k7105
23544d0219J3330K4999J1653j1433J4081q1938l0964Q534q3067J2135R5301j7812
23532h5400k5967L1440Q7114N0205L8070L0082k6433p4894O410j3567l5207k4865
23520d3012M2405l3625p2664K7252M105K3009N766K9364J4861l4081K2588J5292
23508A260J839l4429J4231p749M0444m2080K7502k2170P8677N9405p5440j03879
23496f2389k0511k9233j2604P2317j3292P3209K1929n3676j1680K1775l5708J5628
23484c4235N0923K8226n769q1322P450N297l3578l5563L6315N500n586J4849k8622
$$ y = [-52843, -36716, -72278, -57385, 23737, 53386, 7390, 23395, -21932, -66155, -77747, -57, -8192, -64103, -77816, -75337, -27388, 15834, 31612, 16097, -44897, -20888, -7890, -13114, -40219, -26889, -1890, 9763, -1670, 12411, -69527, -100491, -91957, -175024, -162889, -67588, -85400, -111367, -79927, 7187, 57392, 95462, 125544, 99111, 24217, 30627, 17060, -18147, -43012, -607, -34232, -106896, -79644, -75539, -52530, -46764, -17400, -2539, -36620, -14032, 1260, 3099, -31330, -17099, -24848, 15596, -26484, 1018, -21152, 57525, 116930, 41490, -62389, -82900, -112133, -124737, -52420, -65712, 7497, 29426, -24250, -35930, -14155, -49863, -34235, 16688, 44914, 39145, -42177, -34727, -29430, -63008, -98571, -62256, -56756, -62342, -47493, -76115]
23471g6115J94N9791N0053j0224L7637N9220j8104Q744M9514J9957q4825l7327
23459E8515q13K5982k864l1435j6809N214J5650j1478N922m48k2712k8444L5829
23446C2109P1762M9777J7368l3530p2978l1876m525j210n1039m1786M3948N1018
23434B9038j0513p468j2676P5246k9562j0223l7873L0860k2844m0470l5668J7109
23422e5044K857o4463m6730n751K0150M4136N9988J3016K1584P7413l713k6392
23410C7051j6685o0877q2354K906O4702J7916J637J8622R0076j46l8755p6874
23398d2781J0761k5690Q9331o288j03116k4652M5482O6035L8121m68l39l0888
23386A5508j02809r5844K9096M6449l152N3837P1090Q142N2539L2320J323j7570
$$ y = [-76115, -75921, -16130, 33923, 23699, 61336, 120556, 102452, 111196, 160710, 180667, 95842, 58515, 57702, 83684, 80820, 49385, 32576, 37790, 53440, 41962, 47884, 47436, 24724, -3720, 32109, 103871, 153648, 171016, 137486, 64508, 32632, 28107, 26897, -24142, -65928, -21980, 29038, 18525, 11057, -1619, 73627, 44065, 33842, -4031, 26829, 3985, -36485, -72153, -55044, -52187, -116650, -163380, -169131, -148981, -104845, -44857, -31841, -10257, 67156, 63443, 37051, 20366, -40511, -122865, -119959, -55257, -37341, -35704, -17082, 72994, 72848, 34093, -42781, -32020, -57710, 31621, 25333, -77783, -102435, -56953, 9082, 47203, 46735, 46396, 15508, -87301, -183145, -154049, -107600, -110752, -56915, 14175, 22317, 74856, 107176, 108499, 90929]
23374I0929n7932M27N1849J6448l3079n250N6784K921l2158k7666K8561p0625
23362B1209O845N5903K767j08503N1917J9344n0301n3029k6672K4754l6033Q3096
23350h703K5430L37n8497o9393n1417Q5097J15876K9304k4138m3187j4091M022
23338i360k3099K4980M0387J4791n801M8376J2918J9735j08026o9407l778j6221
23326g4505P0386K7071j4844L5327l7002l5844N1000o789J083k0857m4873M9585
23314b62M0864q1606j8174N2702n4438k0234q463P0157p4228N5964Q0830M9060
23302I2172P961q7871n130J2031j0476r7320o4125J8553O5909K8653o530j4747
23290f0920k2249P3733L0221k6401m2862j8743L9458o331j5009M840K67L0772
$$ y = [90929, 32997, 33424, 85273, 101721, 68642, 63392, 120176, 123097, 90939, 63273, 91834, 21209, 28054, 83957, 86724, -21779, 30138, 49482, -819, -53848, -80520, -55766, -91799, -8703, 16727, 17064, -41433, -110826, -162243, -77146, 38730, 68034, 43896, 709, -13382, -9360, -32459, -7479, 32908, 47699, 41898, 90274, 103192, 122927, 14901, -54506, -58284, -74505, -4119, 22952, 8108, 43435, 6433, -29411, 21589, 14800, 15883, -4974, -49847, -262, 40602, -41004, -59178, -6476, -60914, -81148, -89611, -19454, -93682, -37718, 43112, 92172, 100133, 12262, 7132, 19163, 8687, -88633, -152758, -134205, -68296, -39643, -46173, -60920, -83169, -9436, 20785, -5616, -48478, -67221, -27763, -34094, -49103, -44263, -43996, -13224]
23278a3224J9858j7290m7927j7769O774P8405J05295m3680q7299J3100M8307L7026
23266H1576j4816m5175q788K3587J5485k9245p3925p5730l1010o902O7115R9593
23254A765M9509n0409o938J5158O5826R049o9475o0038K4630M9471k1707o112
23242G29K2977L0536Q0978k7258L204m9704m7627J6745j3649K704K1616K3586
23230F4837k7269j4890k361K7127J2536p4040J9031j6738n825L6510L288j270
23218B0936k4183P862l378j2634J8831Q10l3231J891N2411K2105M9493N9011k5736
23205A34188n4751J4211j330m7851n1240p3171j1915J6021O7271r237j865O4541
23193D4872o104k6594K6364J8161n5245p9018j9513k1853Q0025K8249N2538L1085
$$ y = [-13224, 6634, -10656, -58583, -76352, -69578, 8827, 114122, 70442, -16857, -3757, 44550, 81576, 66760, 21585, 12797, 36384, 51869, 22624, -51301, -127031, -158041, -164943, -97828, 1765, 51274, 865, -6073, 9085, 74911, 83960, 14485, -45553, -20923, 28548, 6841, 729, 23706, 54242, 135220, 107962, 111166, 61462, 13835, 30580, 16931, 19635, 41251, 64837, 37568, 22678, 20317, 47444, 59980, -14060, 4971, -11767, -17592, 18918, 22206, 20936, -3247, 4615, 1237, -11397, 7434, 8244, -24987, -23096, 29315, 51420, 100913, 159924, 134188, 79437, 93648, 92318, 44467, -6773, -79944, -91859, -75838, -8567, -17804, -19669, 44872, 38768, 12174, 38538, 56699, 1454, -77564, -97077, -118930, -38905, -10656, 41882, 72967]
23181G2967J9394l2298K5167R2777m0576j33382j9464L7766L8347o2933m8795
23170e1030l6733k5925M7996J06299Q147j04429j6490O0866O622K4044L8632J9808
23158G7807L9407j9838r507l1810l8031m9194K613K1890J0306k9306p7457N1447
23146e1673Q2011k2235j0684o959k5924J3087N9671r863j3221J2163L6376L9834
23134A02583K0541n6638k2467m6049l6106m9064M1796O7869r632j6865R710L2288
23122C7966j1291q8949J3757J3384O0513l597k8444n083l8325O003P1149N2111
23110G9194j248m5178m6334o7906L0730O1654O311n7700m365j2495j1024J3706
23098e4655l2598L6269L0971J6673L996K4570k1967k1238K158k249k025P8446
$$ y = [72967, 92361, 60063, 85230, 178007, 137431, 4049, -15415, 22351, 60698, -2235, -51030, -87763, -113688, -65692, 40607, 48754, -55675, -72165, -11299, -4677, 19367, 57999, 77807, 117214, 97376, 87869, 56059, 18028, -31166, -28553, -6663, 3643, -25663, -103120, -51673, 30338, 8103, -2581, -9540, -35464, -22377, 37294, 27431, 14210, 26373, 62749, 102583, 123124, 66486, 44019, -2030, -38136, -87200, -45404, 22465, 12833, -4032, 5678, 37966, 26675, -62274, -48517, -35133, 25380, 21783, -6661, -11744, -50069, -44066, 27083, 79194, 77946, 32768, -13566, -81472, -50742, 10912, 17223, -40477, -44842, -57337, -68361, -54655, -87253, -50984, -20013, -3340, 656, 25226, 3259, -17979, -15821, -18070, -20095, 58351]
23086E8351o831p4321O457K1140n2219K8719O4906p889m67j7318o2761J2439K9204
23073e90j1350L2903j2841P571l6826r8874N392Q0432O4505l5780m852L1030k4556
23060c836k2478j5927j547l2011J6745K8568j5470p717M5457o400L0450l4257
23048a8423o2579J5007M2557k4823j6585m8777j6107L1014L7515R9710J906q8955
23036d8540o2711P900M4681L3268q240m0743j886N8717N1581j8165o0110k1783
23024f6031l7145m9685J2288L3653P3063J11119k5856r9516o1729P9435P4934
23013D4530K5393n328k5321K8795l0494P273k0219o5557l562O3398L0121M5965
23001I4994m3232k8029j1287j8111l490K6489K6212q6462j03437K5627N4152J8167
$$ y = [58351, 51520, -22801, -16344, 4796, -47423, -18704, 46202, 38313, 37846, 20528, -42233, -29794, -590, -11940, 20963, 8122, 15693, -21133, -120007, -114615, -34183, 30322, -5458, -10310, 20720, -3836, -26314, -42241, -43788, -75799, -59054, -30486, -45956, -53673, -8216, -14616, 15834, -18423, -81002, -65995, -23438, -48261, -64846, -113623, -129730, -98716, -61201, 38509, 40415, -48540, -111251, -103351, -58670, -25402, -33642, -74385, -76271, -17554, 34027, 15862, -44248, -66031, -103176, -152861, -140573, -106920, -33857, 77262, 51406, -48110, -109839, -30404, 44530, 69923, 64595, 39274, 68069, 37575, 44848, 24629, -40928, -44490, 18908, 49029, 94994, 51762, 23733, 12446, -5665, -9155, 17334, 43546, -42916, -146353, -120726, -66574, -48407]
22989d8407j7032j802P2952O8122j3841n4079j1004l7032K4994p251m3310K6930
22977d0760R9032k4498p9770n0817m1880L091O8647n7595O3856P1896J2490O4992
22965H8684R426n752o9499m9079j664L9531O6226N522l8535n6281m1794r767O9313
22952F331L0777l946J7391L4213J1517n1632k7116K794M5012n275P1545j0204
22940A21407l5246J3924n719m9409k5151k1230o0903k2586p1K3401N7198N0292
22928D5907K4087j8395L2355J0013l4623k9723n2248j7854O49O4411O9534j1929
22916H2184l1448L4447m2818n9735L2034L053j2827O5497R5400R929k2418p1131
22904H2167k0909n7947n3005L4555R6129k2245n8543j0893Q604k4160M1107K21
$$ y = [-48407, -65439, -67241, 5711, 73833, 59992, 5913, -5091, -42123, -17129, -24380, -67690, -40760, 58272, 33774, -45996, -96813, -138693, -135602, -66955, -124550, -60694, 11202, 23692, 88684, 98110, 92358, 22859, -26220, -27884, 11647, 77873, 83395, 44860, -11421, -53215, -62982, 6331, 37108, 33162, 50553, 84766, 96283, 44651, 17535, 20329, 65341, 60066, 131611, 121407, 86161, 100085, 94366, 44957, 19806, -1424, -62327, -84913, -84984, -61583, -4385, 45907, 69994, 51599, 83954, 93967, 59344, 29621, -22627, -40481, -39832, 24579, 94113, 82184, 50736, 85183, 42365, -17370, 14664, 17717, 4890, 70387, 165787, 175716, 153298, 82167, 61258, 3311, -49694, -15139, 80990, 58745, 202, -10691, -2087, -26247, 14860, 15081]
22892A5081j9168j5583l0268n4984M0062N7011j1498j9105N9000K3539R442j2757
22880D0772K0216N3679l475l9886J3374q187J4674l7931o1567r029r0399M4746
22868f3013M0862J6604O929m527m156k1438L5097R993l8745Q919N3135L5737k6272
22855D9125O053l6708n7143k0955O9347M9287j9481k3097L6218n9459L1210l413
22843B0984k1428n3256l9446O0173P1228K1972m1084J417o2853n8343L3345l2280
22831i9571J7187L3373M95j0061R426L7523L261m85j5330m1159L9102J3866k7233
22818c9606n3125L5296J0608L5116J9715l8081N1541K2449m7959O4924l7232q6583
22806f2937J5493K1292J8829n4292l9305k3769K8803O8219J7717L5707k4078P895
$$ y = [15081, -4087, -19670, -49938, -104922, -64860, -7849, -19347, -38452, 20548, 44087, 53529, 40772, 60988, 114667, 111192, 71306, 84680, 76493, 91167, 53236, -8331, -17360, -107759, -63013, -22151, -5547, 1382, -3145, -7301, -28739, 6358, 16351, -22394, -13475, 39660, 75397, 49125, 55178, 18470, -38673, -59628, 9719, 59006, 39525, 16428, 52646, -6813, 24397, 20984, -444, -53700, -93146, -32973, 38255, 60227, 19143, 20560, -42293, -100636, -67291, -99571, -82384, -49011, -48516, -58577, -49151, -11628, -8367, -8852, -24182, -65341, -26239, -12373, -39606, -92731, -57435, -46827, -11711, 8004, -30077, 21464, 43913, -4046, 60878, 23646, -62937, -47444, -26152, -7323, -61615, -100920, -124689, -95886, -27667, -9950, 25757, 1679, 9574]
22794I574k4930o889K6822m3865k5799k4419J0373L8078Q0194M476K4059l2727
22782C4947l43M9008K1510n4738l603J4031M425m427l36M494j0474n3179j2978
22769a1663N1417n081K8854r638k9460P35K1202k4400K3922K3230n9907p5165
22757f5954K3976K7395j3293k8055N5942Q51n005n663L9726L799m4937k4091J209
22744c4100n4556o3041n935P166K4339j5016N5094L8536l5884m2663K7369M8549
22732e0142J3564P869m982K5040j7745m8439q23j65l3297M9379P6644K0395j4546
22719B2752o096p0149k3841M8039L8911j9223l2369J5897l0754m517J1614O8196
22707A8460J9614J0226K509m3301o109K3449L7714l5750l5815M7207L5369l598
$$ y = [9574, -15356, -22245, 4577, -39288, -65087, -89506, -79133, -41055, 39139, 43615, 67674, 34947, 34604, 83612, 105122, 50384, 46781, 60812, 65237, 60810, 60474, 64968, 54494, 1315, -11663, 39754, 34673, 63527, 53889, 24429, 25164, 46366, 21966, 45888, 69118, 9211, -65954, -41978, -14583, -27876, -55931, 11, 862, -4143, -9806, 29920, 33719, -11218, -35309, -34100, -88656, -151697, -157632, -150466, -126127, -141143, -86049, -47513, -83397, -126060, -98691, -50142, -36578, -28709, -33691, -8651, -26396, -74835, -75658, -75823, -109120, -59741, 16903, 37298, 22752, 16656, -53493, -77334, -29295, 9616, -9607, -41976, -26079, -56833, -61350, -49736, 18460, 38074, 48300, 50809, 7508, 1399, 24848, 62562, 26812, -9003, 38204, 73573, 69975]
22695F9975k2190n5331k2230K1974J5521j1663m8619L991Q452M0851n6529n5727
22683a11525j1217L0427L4786N8649K2837J2826k6780l1353k415L6286M857N6373
22671G3751k2635p8655l6217K2754K9753m6012n3959L5913K1579o6145J5939M5627
22659e8307J9289Q0267J5732o9755n3234Q2042O5376N0885j2404p8690j12834
22648g1633n6759k4210Q5681R1992j9395k8310M7856K1126l2090r2954p3548N8629
22636i3615j8906K9394Q678O0474L1001j9535o7522j0954L8533J618O0726j1310
22624H582L821k5123j9078j1100n040O5143N1112J0318p664k5690q457j5487m0484
22611a9147P380L5405p826N4411j5867q2356p614K2235M9395R404j8544q487o377
$$ y = [69975, 47785, -7546, -29776, -7802, 7719, -3944, -52563, -48572, -40120, 731, -55798, -111525, -122742, -92315, -57529, 1120, 23957, 36783, 10003, -21350, -23765, 12521, 17378, 73751, 51116, -27539, -63756, -41002, -11249, -57261, -111220, -75307, -53728, -119873, -103934, -58307, -39018, 41249, 56981, -12774, -66008, 16034, 81410, 132295, 119891, 41201, -71633, -128392, -152602, -66921, 25071, 5676, -22634, 25222, 46348, 14258, -78696, -152244, -93615, -112521, -83127, -74449, -13975, 17026, -2509, -70031, -80985, -42452, -40834, 19892, 8582, 12403, -12720, -31798, -42898, -47938, 17205, 68317, 78635, 70971, 45281, 36824, 21337, -19147, -11767, 23638, 15812, 70223, 54356, -28000, -35614, -13379, 36016, 45420, 26876, 18389, 12012]
22598A2012r4446J3664P0830k573k5720n987L0262P1523Q6906R227q7527k0727
22586E7444M9390k1482q4326q237L1251K4684k060p7288n627J9987L6737J2477
22574C2950o8332O041k5069k4530j6506L4278n474M6289L4833K343n5378m6503
22562h5058K0408J4064K3376L7253R463r479j4022L151k0665j6751Q538l9842
22550f9564K3783L5921L2898k3027l0420J7561j8893n9113N5641p012K2145K3082
22538C002m7058M49l2300m2365J5814M67R556K7536K7380M1576J5661m9687l3250
22525f3219K6780O4971J1541M7067Q7907k7172l2237k1451k6243j4433m6314q8633
22513h1436m2681r28L547n8157n3162k464L2711J16318J21401m3838p2974n8142
$$ y = [12012, -82434, -68770, 2060, -513, -26233, -32220, -1958, 69565, 156471, 165698, 78171, 57444, 106834, 85352, 1026, -7211, 24040, 48724, 46664, -30624, -36251, -16264, 20473, 32950, -35382, -29341, -54410, -78940, -95446, -61168, -66642, -20353, 14480, 16823, -38555, -85058, -64650, -50586, -27210, 10043, 19506, 10027, -3995, -844, -21509, -38260, -29722, -69564, -45781, -9860, 23038, 11, -30409, -12848, -31741, -90854, -35213, -42225, -20080, 3002, -44056, -43607, -75907, -118272, -102458, -101991, -92435, -64899, -37519, 4057, 19718, -29969, -63219, -36439, 28532, 40073, 87140, 175047, 147875, 115638, 94187, 67944, 53511, 7197, -81436, -124117, -125045, -121498, -179655, -232817, -235281, -202570, -86252, 35149, -8689, -81663, -139805]
22501a39805N0292j5196p190L7592N9202j0044n2810n2257j7592P8517L7850n956
22489c7397j3909M0835j28J8227L2751L6362m3147P272P217m5655j5522o1251
22477g4345l8345l041M3056P47L6657p84k2468M0058k0819L2184L6974k3486l4541
22464b8153L8757K9660J4817N1045j107q6045n9590L5939m0474o6915J7490k1488
22452a16064k7534Q2948M2907P7524k2314J409j0645m5976m2972j3572n4344Q446
22440a20187J14442K6028k8810j6459l2710J5810j0758L0727L9279j4083p1656
22429f8377J7846k2193P930N3434L5509k6769n4064J1243L0461o6760l4119p812
22417a23671L3639P132k5070L3636J1817j8467J6070O4143M7394l8289n5050j1995
$$ y = [-139805, -89513, -104709, -111899, -74307, -15105, -25149, -77959, -130216, -147808, -69291, -31441, -37397, -51306, -10471, -10599, 7628, 40379, 76741, 33594, 40866, 48083, 2428, -13094, -74345, -112690, -115731, -72675, -71928, -35271, -36055, -58523, -18465, -39284, -7100, 29874, 6388, -28153, 10604, 40264, 55081, 106126, 105019, 18974, -40616, -4677, -45151, -112066, -94576, -116064, -143598, -60650, -17743, 59781, 37467, 38876, 28231, -17745, -60717, -74289, -128633, -120187, -5745, 20283, -8527, -24986, -57696, -41886, -52644, -21917, 17362, 3279, -68377, -50531, -72724, -64794, -11360, 24149, -2620, -56684, -45441, -14980, -81740, -115859, -123671, -90032, -82900, -107970, -74334, -62517, -80984, -64914, -771, 46623, 8334, -46716, -58711]
22405e8711M0589O8396j7960j5110j6282J1657M2357l8723N8675K6288o6983J821
22393C6014k168m4386P595N1436M6612l0279j9463j8046r3074k9686K746j6677
22381a09376P0131P6906l2180L4311j05215k9048J9980o5007j2411O4143Q6588
22370a178l1330m6298j6164J6601M9062K3541J6890M4561j6950j9115j8856j3376
22358a2612J0227M1119L7440n0879J4658k6294l5553J1516J6877k9444O727P5795
22346E9577O8481q6996j1840j079j3150M8450J7825p6420o0562j5645M3407O5170
22334C7218l1224r151N447j99J877k8986k4361O4438K3542J6053N11l8295q8488
22321g1618K0553O6413m6238j3105K1668k9020k4797J0013l638k5262j0914N435
$$ y = [-58711, -18122, 50274, 32314, 17204, 922, 12579, 54936, 16213, 74888, 101176, 34193, 36014, 33846, -10540, -2945, 48491, 95103, 64824, 45361, 27315, -65759, -95445, -92699, -109376, -39245, 37661, 5481, 39792, -65423, -94471, -74491, -139498, -151909, -87766, -1178, -32508, -78806, -94970, -78369, -29307, -5766, 11124, 55685, 38735, 19620, 764, -12612, -2385, 38734, 76174, 25295, 39953, 13659, -21894, -10378, 6499, -22945, -16218, 59577, 128058, 41062, 29222, 28143, 14993, 63443, 81268, 4848, -55714, -71359, -27952, 37218, 5994, -3157, 2290, 2091, 3968, -25018, -49379, 15059, 38601, 54654, 55165, 16870, -71618, -51065, 15348, -30890, -43995, -22327, -51347, -76144, -66131, -69769, -95031, -105945, -100510]
22309a00510K6868M4994K1586k8819L2702M3174L0373m7197o7293j362K56l998
22297d9226K9926O5366M0951j6431k7166O892k2155K7508j5087K7521l2554n6338
22285b0793n0692J8334k929J6417k7519l3629O1957P3703M1482n9599j09254j144
22273i3666P1156M941N1497J7765o8747p464j4763K8018n8407M1573O2159o9278
22261c5216k6015j2727o9380j700L4165O3350k008l0672j9545K6838j2855j6041
22249a01806M4381K1672J9344N770j3064P1556O4444j2248L601k9633l5849j7339
22237B0829l1546J4829J8495K1552K8122k6355o0011n8681M5184O4166L0056l2177
22225C4463q0428j13417q019O0806M5863K8106n4897M2474Q0404J7696o1179q0638
$$ y = [-100510, -73642, -28648, -7062, -35881, -3179, 39995, 70368, 23171, -44122, -45484, -45228, -49226, -19300, 46066, 87017, 70586, 43420, 50312, 28157, 55665, 40578, 68099, 35545, -20793, -71485, -53151, -56080, -39663, -67182, -100811, -38854, 34849, 76331, 16732, -92522, -93666, -22510, -17569, 33928, 51693, -17054, -24518, -39281, -11263, -69670, -28097, 34062, -35216, -61231, -73958, -143338, -145038, -110873, -47523, -49531, -80203, -99748, -72910, -85765, -101806, -57425, -35753, -16409, -10639, -23703, 47853, 112297, 100049, 103650, 74017, 38168, 20829, -10717, 4112, 22607, 44159, 72281, 45926, -14085, -72766, -27582, 36584, 66640, 34463, -45965, -159382, -167401, -106595, -60732, -32626, -87523, -45049, 35355, 53051, -8128, -88766]
22213h8766m6635L3905m826J1299K1628j0178K5943K2234J2558O9272O0934k3009
22201H4359k0584P1573N2687k5665k3061n7130n5247M7537l2025k6912m4252n220
22189c3940R499J1766K0260K4229J00k2748l5705l5076M503j0257k9513K9081
22177f7801n063K1753M8898L0779L6990k9271k4819k8430l0246L5844j3900l6310
22165f1576K6950M414k7550Q7731J2574M491k0114k5827l0230m5885l7512l9016
22153a51550N4615l6688L4108j846N908j1044l0297P175P8850R0690m7306n8203
22141f5588K0898O402N346P017k5644k2286Q1522k1199M5961J8228N260J3967
22129F9884J382k7621n5826p5733L6627M6625J9777Q0388L1888J279L83o4506
$$ y = [-88766, -135401, -101496, -106322, -95023, -73395, -83573, -57630, -35396, -22838, 46434, 107368, 84359, 63775, 135348, 188035, 162370, 139309, 82179, 26932, 74469, 42444, 15532, -28720, -33940, -24441, -12675, 7585, 31814, 31914, 9166, -26539, -61615, -57112, -67369, -96882, -67801, -72864, -51111, -2213, 28566, 65556, 36285, 11466, -16964, -47210, -11366, -25266, -61576, -34626, -30212, -57762, 29969, 42543, 47034, 26920, 1093, -29137, -75022, -112534, -151550, -96935, -133623, -99515, -101361, -95453, -106497, -136794, -129619, -50769, 39921, -7385, -65588, -44690, -38288, -32942, -25925, -51569, -73855, 7667, -13532, 32429, 50657, 55917, 69884, 71266, 43645, -12181, -87914, -51287, -4662, 15115, 95503, 127391, 128670, 129053, 64547]
22117F4547j10983R766P0034r3115k7749M8772K0131J9727j9099P128L8685l5915
22105h071n6957k3304l3649O6896J02371K6468o0476l8443p9011L7566L4854m8958
22093h0714O8352J24537j2717m3512k053j8175p2186K0925K5843l906r703J5642
22081A2333k2467l9264J3496Q4475N3973J239j1075j2737m6406j1131k4474l3591
22069c5629j9789l6294K2586J3687n8314q088q540k0958n6355O8651O2774j9861
22057i6130P5290M6445O4064o0511O044o862j6892l1704j0645o3515j9833n055
22045a19304M5957J4506K0146O6966L5731K216P913J6445J976n4009k4179M9730
22033F4094J0917M309k7277P1482k3517k045m3332o4642o4055L1875q796N919
$$ y = [64547, -46436, -36670, 33364, -59751, -87500, -38728, -18597, 1130, -17969, -10841, 27844, -8071, -65028, -88332, -121981, -55085, 47286, 73754, 13278, -25165, -104176, -66610, -31756, -80714, -12362, 112175, 99458, 55946, 53893, 35718, -36468, -15543, 10300, 6394, -3309, 12333, -10134, -49398, -35902, 48573, 102546, 103785, 92710, 79973, 33567, 22436, -2038, -35629, -55418, -91712, -69126, -55439, -113753, -121841, -130381, -151339, -207694, -139043, -76269, -96130, -20840, 25605, 89669, 29158, 35202, 28340, 11448, -20256, -30901, -94416, -114249, -119304, -73347, -58841, -38695, 28271, 64002, 66218, 74131, 90576, 92552, 38543, 14364, 64094, 75011, 79320, 52043, 123525, 100008, 97963, 54631, -10011, -74066, -42191, -50987, -45068]
22021d5068O9256Q1538J2703j8824j02446q31K0467J3145O3595O6378n9990q8540
22009A1383K6063J1230k9933j3748k4057j1824j324J5104p650j8943O4915N7539
21997G8755L3137L434J485n9392m9138M1744j7557o0111j6042j751N6272m7393
21985c6557n6146K3349L807K947m472M1702P7300O3126m3610j6520o0514q5333
21973i0921j6530o548P6497L7613Q057J0552K5094M246k4253n3883l4431m7732
21961a12239N3206P5646n0647J8501N8899K0608K5393L1876j0698Q308k9786k6802
21949F2265o3967N272M0891L0029l7599K228n1381J2968l2999m1947j0291N9533
21937b4998j4488J5817k943L3479j074o7414L3131K4618q73m4566n2442M2298
$$ y = [-45068, 24188, 105726, 118429, 99605, -2841, -3672, 16795, 29940, 93535, 159913, 99923, 11383, 37446, 48676, 18743, 4995, -19062, -30886, -32210, -17106, -24756, -43699, 21216, 78755, 111892, 115326, 116811, 57419, 8281, 50025, 32468, -27643, -43685, -45436, 10836, -36557, -92703, -69354, -65547, -62600, -67072, -25370, 51930, 115056, 71446, 54926, -5588, -90921, -107451, -113999, -37502, 111, 8168, 18720, 43814, 48060, 23807, -30076, -64507, -112239, -59033, 16613, -34034, -15533, 43366, 63974, 89367, 121243, 110545, 118853, 89067, 62265, -1702, 3570, 44461, 74490, 36891, 39119, -12262, 706, -32293, -74240, -84531, -24998, -39486, -23669, -26612, 6867, 5793, -61621, -28490, -3872, -4745, -49311, -101753, -59455]
21925e9455Q3171J9995r880m2387k3496n8541L4597O0765K9175l7738O1095R6463
21913A53764j4345p7652k2886O969M7J4134N753l3953l7284K1843n1739M8785
21901A3436N0533j5062K516r264K1468N8729p140l2761m891L7053K1788k5362
21889A11043j02237l6449J1183K9120K7051N0770k3998j9221l5584L1413K7040
21878G0131N8807q1123l9216R64K7005K227l8759l0890J4939R709J4078m1339
21866c3467L2259l9421k9750L0679N3176N8787J8414n6809k1603m080L7414k7237
21854A8362J9758k8717L5817r1216k3914K1385j2502K2757J146J6128j4218j9633
21842e4847j914K1308k2092j3343R3439P1489k6212K0159j16334o9761L2521j1804
$$ y = [-59455, 23716, 43711, 33831, -8556, -32052, -90593, -55996, 4769, 33944, -3794, 57301, 153764, 139419, 61767, 38881, 45850, 45897, 60031, 65784, 31831, -5453, 16390, -35349, 13436, 63969, 48907, 51423, 42159, 63627, 122356, 115216, 82455, 77564, 114617, 136405, 111043, 8806, -27643, -16460, 12660, 39711, 90481, 66483, 47262, 11678, 43091, 70131, 128938, 47815, 8599, 9563, 36568, 38795, 36, -30854, -15915, -6206, 7872, -33467, -1208, -40629, -70379, -39700, 13476, 72263, 90677, 33868, 12265, 8185, 45599, 18362, 38120, 9403, 45220, -45996, -69910, -48525, -61027, -38270, -37124, -20996, -35214, -54847, -56761, -35453, -57545, -70888, 22551, 94040, 67828, 87987, -28347, -98108, -65587, -77391]
21830g7391L3797J8876n8096n1307P4772N8561j5933p3881K1469l059O0331K414
21818i447m9018N854l2077L513M5032M3402n030N4711K2107k9620l7083p9519
21806f7175r072K84O056N4421O3572P5152k5842k7109J3347q9838o0443J2311
21794e4336j3458K5765J6675K4539K558m3124n8209L5830k563M2535R095j7568
21782c2261M6859L0455n2695j1243j7336O028k9278q7691j5147O3509R2210k1543
21770b8133L0150K9014p0574l3176J5068N6986L6880N7282J3955m3223j1479j3838
21758C8912P7423j2889o6009l6164j3494j3188m5728K2092P9008l6777j5356P1270
21746D9100L7109L9839M335m5422k9862l1988j0244m8306m2335L8793N4135K4148
$$ y = [-77391, -43594, -24718, -82814, -134121, -59349, -788, -16721, -90602, -69133, -72192, -11861, -9447, -58465, -52611, -84688, -81175, -36143, 7259, 2229, 56940, 79047, 49427, 12344, -67175, -76247, -75963, -69907, -15486, 48086, 123238, 97396, 70287, 83634, -6204, -66647, -54336, -67794, -42029, -25354, -815, 1743, -41381, -99590, -63760, -66323, -23788, -14693, -32261, 14598, 45053, -7642, -18885, -36221, -30193, -59471, -147162, -162309, -98800, -6590, -28133, 2017, 31031, -39543, -72719, -57651, -665, 36215, 93497, 107452, 64229, 52750, 38912, 116335, 103446, 37437, 1273, -12221, -25409, -71137, -49045, 29963, -6814, -22170, 49100, 86209, 126048, 130383, 84961, 55099, 23111, 12867, -35439, -77774, -38981, 15154, 39302]
21734C9302M309p9278n5729L2367j7482J5161L8856J3669j9892m7779K1725L8214
21722a6557K5796J4472J7011k0459k8572l7687o0577J4058L1826k3702L7309L279
21710d3803Q8824M1921o6186k4428M3896k7851k8265j9675J3179n9261j9162J3168
21698h7643J21077l5m4751l8572K2521k7197L3065P6977J775K5940J7303M8741
21686A49201k9785n3416j7193k4984j1861J4401P3228K5953n86r3998m2143o027
21674a7210Q353L8827M0134j3218o8648K1165K4882k6854k3610p1438o4193o2347
21662b14157M9317L8190K4146N0069J4206J7085K4072q474l5263M5870L9662L6578
21650H1301j776K054m8067l9838m3030l3760J2519M3067L1184L629J9563n2914
$$ y = [39302, 43611, -35667, -91396, -59029, -76511, -61350, -22494, -8825, -28717, -76496, -54771, -16557, 9239, 23711, 40722, 20263, -8309, -45996, -106573, -92515, -60689, -84391, -47082, -43803, 45021, 86942, 20756, -3672, 40224, 12373, -15892, -35567, -22388, -81649, -100811, -87643, 33434, 33399, -11352, -49924, -27403, -54600, -21535, 55442, 57217, 83157, 100460, 149201, 119416, 66000, 48807, 23823, 11962, 26363, 99591, 125544, 124958, 30960, -11183, -17210, -8857, 29970, 70104, 56886, -11762, 9403, 34285, 7431, -16179, -87617, -151810, -214157, -164840, -126650, -102504, -52435, -38229, -21144, 2928, -5546, -40809, 5061, 44723, 81301, 79525, 81579, 33512, -6326, -49356, -83116, -70597, -27530, 3654, 7283, 26846, -26068]
21638b6068M3219N1217O3681R219k3513o1988l1550L1890j1246m2632o1061k1129
21626g9961L3386P1443O4192J4942k6255n6434l1950J1853M762l9751k3594J2091
21614d5276K8005N674N350L6824Q1321P0425j7386p0787l2544L1397m9939k8111
21602A4953K8516K0450P719N302Q035o4442m3432p1721o4061Q2011J13826K4949
21590F2105k8349O0780k3410l9285k8736O1281m0289l4051o7093j2449O5436K1144
21578b916j8811P468N6653K2991k1268L3751J5066O503j6337n154q8441q0198
21566i0693O432J8204J2286M1121k0430k1924p280p3225j9270P1123M4553J912
21554c7191N531K9341P1632L2690K011o0914o5931J0940o430j5883O7762M7150
$$ y = [-26068, 17151, 68368, 132049, 141268, 117755, 55767, 24217, 56107, 44861, 2229, -58832, -79961, -46575, 24868, 89060, 104002, 77747, 21313, -10637, 1216, 5978, -33773, -57367, -45276, -17271, -11597, -6247, 30577, 111898, 182323, 164937, 94150, 61606, 93003, 43064, 14953, 43469, 63919, 71638, 76940, 84975, 20533, -22899, -94620, -158681, -76670, 37156, 62105, 33756, 94536, 71126, 31841, 3105, 64386, 24097, -9954, -77047, -89496, -24060, -2916, -21727, -14259, 42394, 65385, 44117, 77868, 92934, 99437, 83100, 77946, -10495, -90693, -84261, -66057, -53771, -12650, -33080, -55004, -62284, -135509, -154779, -83656, -39103, -37191, -31660, -2319, 69313, 102003, 104014, 43100, -22831, -11891, -18321, -34204, 33558, 80708]
21542H0708J158m6218p6365j1523L1970j9081J42K5707l6720n2150L3991O6120
21530b261k611n8399m4492K5772R9165O1612k7838k5239l155m2693R628n4047
21518f4558j0428N1645M1557o570K2602M878J5844K8423k302m0786l1803k0487
21506a1985j1979O0316N3711k999k059j0815P584m6857k7233O4415m42n6084m9488
21493c3915N1392K4751l06m9177l8712N1301J7610O2508r185R469j7805l423n1462
21480A3046o3291j2108L5537L0716Q2225N0775m2712o0842J9723m90q4298l3414
21468f5133l3352M783L002j0374J5738J29843N8575j2099m0780n8242l9280k2180
21456f9499N0041k4293J6798N8232J096l4896J2560J308k3899k7330P4478k0141
$$ y = [80708, 81866, 35648, -40717, -52240, -20270, -39351, -39209, -13502, -50222, -102372, -68381, -2261, -4872, -63271, -107763, -81991, 17174, 78786, 50948, 25709, 22554, -20139, -10511, -64558, -74986, -23341, 18216, 11646, 34248, 39126, 54970, 83393, 81091, 40305, 8502, -11985, -23964, 36352, 90063, 87064, 85005, 74190, 81774, 34917, 7684, 72099, 71657, 15573, -33915, 17477, 42228, 41922, -7255, -45967, 5334, 22944, 85452, 76267, 85736, 67931, 64508, 13046, -50245, -62353, -26816, 3900, 86125, 136900, 94188, 33346, 53069, 52579, -31719, -65133, -98485, -93702, -90700, -101074, -85336, 44507, 103082, 90983, 50203, -8039, -47319, -69499, -19458, -43751, -26953, 31279, 32375, -2521, 10039, 11347, -12552, -39882, 34596, 14455]
21444A4455n9711p5347K156O0742M6531m19j3627P291K009j0648K793m8882K6166
21431d6491O5769m0274l2843M6765k1322p8808J4933N9755k9434N2010K2722j47
21419A2635O5412J1018m738m3195n2238l1620m3817M0588L2403n8757q65J0441
21407f2733J2809J9898J7905L8718Q240o4002j6382K0459o853m4095j7859J0580
21395h3315J3670K3856J8673l8393n6689J092m6769J3442Q4618o3734K1565R2013
21383a9971J6387J218O1394J8301n3715L1690n303m5315k3844J7594r671j8605
21371b9840l7483J5684r572M535M2269M0830M1268j2343m3166l6701J6036L8784
21359C0301l7738m0165j8434L0863K098k0862K1205P1029k7143J4192O3977m1951
$$ y = [14455, -45256, -120603, -118447, -57705, -11174, -11593, -25220, -17929, -15920, -26568, -23775, -72657, -46491, 19278, -20996, -53839, -7074, -28396, -107204, -92271, -32516, -61950, -9940, 12782, 12635, 78047, 89065, 84327, 41132, -11106, -42726, -86543, -45955, -13552, -72309, -73174, -62733, -49924, -30026, -12121, 26597, 34837, -29165, -45547, -25088, -31941, -76036, -93895, -83315, -69645, -45789, -27116, -65509, -122198, -121106, -167875, -154433, -69815, -133549, -111984, -19971, -3584, -2366, 59028, 77329, 23614, 55304, 50001, 4686, -19158, -1564, -11235, -29840, -67323, -51639, -61211, -56676, -14407, 26423, 67691, 55348, 12182, -24519, -8483, 30301, -7437, -47602, -66036, -35173, -33075, -53937, -32732, 38297, 11154, 25346, 89323, 47372]
21347D7372o9634j4513J8714p3022M829j7181K3003M5656K8796m735q0478j5241
21335a06434P2354J0457R958P1758J7275l4521m1328m3954M5004j5066n9484N0602
21323b3379L096M5864j9301n3882k7993l1724K6133N3484N3779J5316q4201n6719
21311i9527j8920L95r068J2003K1388L4624n6538J3836k0349l9271J5786K0380
21299a25261J23609Q8650N981J3007J0799o3371m5261L5540P6036k7655p0229
21288B1845l9772m7668k745P6778J5437o9727o499q42M7631O1981L21J1901k0264
21275D8377l8299k6322k095N5616J2449k9329N242j0970j760j2108m424J5661
21263A2038J2677k5071l8749M5934M6849l9915N1434Q9153j5747M2323L311j05947
$$ y = [47372, -22262, -36775, -18061, -91083, -86254, -103435, -80432, -34776, -5980, -10715, -91193, -106434, -34080, -23623, -13665, 58093, 75368, 40847, -481, -44435, 569, -14497, -73981, -23379, -20283, 25581, 6280, -47602, -75595, -107319, -81186, -27702, 26077, 41393, -42808, -99527, -118447, -118052, -127120, -115117, -93729, -59105, -115643, -101807, -122156, -161427, -145641, -125261, -1652, 86998, 92979, 105986, 116785, 53414, 8153, 43693, 119729, 92074, 21845, -17927, -65595, -68340, 8438, 23875, -45852, -52351, -53193, -5562, 56419, 56740, 68641, 48377, 10078, -16244, -18339, 37277, 49726, 20397, 25639, 14669, 12909, 801, -3623, 12038, 24715, -356, -39105, 6829, 53678, 13763, 65197, 154350, 138603, 180926, 184237, 78290]
21251G8290p5133O3391P2607n1382o7128m1881r470k6999Q415K5842K2256j3768
21239a4960J9210L54J1875L1775l312j7251k4699K5655J7035j5899j0417N984
21227B5350J8611P1113K9088P232j7723o9781o5666p0852q419M6110J04622L8869
21215A08554o8569m2686J479J4069M0797J24m9529q265p696M9453L3743p6244
21203d770k0281N3204m898n2113m1572J3797o2316P7496Q0473l3456j8040k5200
21191c7676J2639Q7863R1179O248j05535q2129k8571K4288K812J1721R2259l3323
21179D1775n5863k3633k2955N429Q1959K1524n2886j7429K3473q7936k2803P5052
21167c4293J11651K1764j5625O3852L9508o3807m9199m8754l0025k7860K3434
$$ y = [78290, 3157, 66548, 139155, 87773, 20645, -21236, -30706, -57705, -49290, -23448, -1192, -14960, 4250, 4604, 16479, 48254, 44942, 27691, 2992, 28647, 45682, 29783, 19366, 25350, 43961, 115074, 144162, 151394, 133671, 63890, -1776, -72628, -81047, -34937, 69685, 108554, 39985, -2701, -1222, 12847, 53644, 53768, 4239, -4026, -11722, 37731, 71474, -4770, -25051, 28153, 23255, -28858, -70430, -56633, -118949, -41453, 39020, 5564, -12476, -37676, -25037, 62826, 154005, 160253, 54718, -27411, -55982, -31694, -28882, -17161, 75098, 41775, -14088, -37721, -60676, -55247, 26712, 48236, -4650, -22079, 1394, -86542, -109345, -34293, 77358, 99122, 83497, 147349, 186857, 123050, 73851, 25097, -4928, -32788, -9354]
21156i354L8802l9015O07J3604m5905j3186m489k0139N7611j0307J0534L06j4144
21143c5075K7217M6048J6431L7708r382l0690j01487m1537J040j2251K7720O8179
21131f079k4668o1356k9137N3743M1216k1310j4052L8137J0713O4703O6676K2087
21119A40673r3461m5165J14268O1886M506q7201m0560R389N693n3961m7058L2441
21107A450m148K6293j2936l1503k498R828k8940l758N4507K0273k3745K754J00811
21094A08388k823j2810k8539j2378j3220o493J6878L2303K3833q752j8507K0544
21082I8424o771j37308p6749L1156N4996k5264j49J5352l0196L5059j2434L6381
21070a7503j0893j3916j0014K8270R6442Q083l1645n4302J3238j9558o137n2724
$$ y = [-9354, 29448, -9567, -8960, 4644, -41261, -54447, -58936, -79075, -21464, -31771, -21237, -20931, -35075, -7858, 38190, 54621, 92329, 82947, 52257, -49230, -90767, -89727, -101978, -74258, -6079, -30747, -92103, -121240, -67497, -26281, -47591, -61643, -23506, -12793, 51910, 118586, 140673, 47212, 2047, 116315, 178201, 182707, 95506, 54946, 64335, 70028, 16067, -30991, 1450, -2698, 23595, 10659, -20844, -23342, -13514, -42454, -46212, 8295, 28568, 4823, 7577, 108388, 105565, 92755, 64216, 51838, 38618, 32125, 49003, 81306, 105139, 96387, 77880, 98424, 91653, -45655, -122404, -91248, -36252, -61516, -61665, -46313, -76509, -41450, -53884, -17503, -28396, -42312, -52326, -24056, 72386, 80469, 48824, -5478, 7760, -11798, -17935, -70659]
21058g0659k662M8701N828J3731l0883n6058k6585K9088k3610J5659L0976O5K0617
21045d5792N4971M9533k0755m6614l3365J4527l8457M1018J2419p7822m0836P929
21033a23244K5589L1610P9070M4268J1611k5347p7897K3058J0804l5812r367J3110
21021c2547O940q429O5530j2863l7679j0293m9431L1658K1584L7477o249K287
21009G985K3897j1564O1088O9629l6025q6273m1486j7727L0455j5951K8331l3068
20997b0709J6936N1817O797m3887m0605J5340K9924j08639J0928L683K1763L4506
20985b2146N8714M6456n8989j7106K3579J3770n7695j01615o391K3668O2237M1817
20973F299j6989l8516l8477k8217J0319O463K5463R6893M0800k4712j1586M3631
$$ y = [-70659, -73321, -24620, -18792, -5061, -35944, -92002, -118587, -89499, -113109, -97450, -66474, -66409, -45792, 9179, 58712, 37957, -8657, -42022, -27495, -65952, -24934, -12515, -90337, -131173, -123244, -97655, -66045, 13025, 57293, 68904, 43557, -34340, -11282, -478, -36290, -45657, -32547, -25607, -34036, 31494, 18631, -19048, -29341, -78772, -47114, -25530, 11947, 5698, 7985, 31882, 20318, 81406, 151035, 115010, 28737, -12749, -30476, -21, -15972, 12359, -20709, -3773, 48044, 54841, 10954, -29651, -14311, 15613, -93026, -82098, -78415, -56652, -22146, 36568, 83024, 24035, 6929, 30508, 44278, -13417, -115032, -121423, -97755, -35518, 6299, -10690, -49206, -87683, -115900, -105581, -99118, -73655, 23238, 64038, 39326, 27740, 71371]
20961G1371m0475J61k7090j5467N599P95J9582m6724J8915N5019k95n181o5798
20948b9588n9502O1572J8545o5836m2139J33773P9602p926k4431l7568m9177j2246
20936c4921J3452J5378J0508l7888L9468L5930n199q5559k1678L6842Q0639o0228
20924a3256l8349M3086J5152K9854n595j0762r838m3426R868n527N5666L1942
20912E8815l6502n3974n3811K3746M4537Q5099m30o7289m5764o8818p742K3039
20900i9094k9448K2622q568J0458p572L1601N2537k9630L9113L5257L2871n70
20888D9577n6859J0337O034O039N1892J5279J5512K7037k413k8403o2422k0307
20876A1303j2991M990N744l2243p129R294M0664P032l5792j6291O0211j8109n4152
$$ y = [71371, 30896, 31057, 3967, -11500, -5901, -5106, 14476, -32248, -13333, 41686, 41391, 36210, -29588, -89090, -27518, -8973, -74809, -116948, 16825, 96427, 88501, 64070, 26502, -22675, -34921, -21469, -6091, 4417, -33471, 5997, 41927, 36728, -48831, -70509, -33667, 46972, -13256, -51605, -8519, 6633, 36487, 30892, 20130, 10292, -33134, -23266, -28793, 26873, 58815, 22313, -31661, -85472, -61726, -17189, 67910, 67480, 191, -45573, -114391, -122133, -99094, -128542, -105920, -114488, -104030, -111602, -80001, -27464, -57094, -17981, 17276, 50147, 49577, -7282, 3055, 9089, 15128, 67020, 82299, 97811, 124848, 122435, 94032, 31610, 11303, -1688, 3302, 9046, -23197, -30326, -21032, 19632, 26664, -9128, -25419, 34792, 16683, -37469]
20863c7469m74N0925J4745j5630n6469L3553M8806L19k3970l9935p6702L0745
20851g1556O7589J5200l9826N604l2791O0484O4128m7975k161m44j8405L3543
20839C3390K4002p4279n300K2191K3430j0289k5797J9701k0210n2901J5913j0555
20827f0704J684K8478J8989j5565P988j2764K7596M4150Q0708j7001P831k1382
20815I0008j37246p6917j1855P7768L5173J9818j6234p5095n584L405K9436K4460
20803d2863K9764j9867J363o588k9897J251P3604K5488k4315k6124L6596J3052
20791C1464j0067l3311l881Q8428M9285q5078P067k1704m4955n6368k1790J8210
20779h2700o122J074l103P7768P5991n0191j5489k8921l4993K1240N8034l1670
$$ y = [-37469, -37943, 12982, 27727, 12097, -44372, -10819, 37987, 38306, 14336, -25599, -102301, -71556, -3967, 11233, -28593, -22989, -55780, 4704, 68832, 20857, 18696, 18252, -153, 33390, 57392, -16887, -22187, 4, 23434, 13145, -12652, 7049, -13161, -66062, -50149, -60704, -59020, -30542, -11553, -27118, -19130, -31894, -4298, 39852, 120560, 103559, 111390, 90008, -47238, -124155, -136010, -58242, -23069, -3251, -19485, -94580, -100164, -96759, -67323, -42863, -13099, -32966, -31603, -38191, -68088, -66837, 6767, 32255, 7940, -18184, 18412, 31464, 21397, -11914, -15795, 72633, 121918, 36840, 43907, 22203, -22752, -79120, -100910, -82700, -88822, -87748, -90851, -13083, 62908, 12717, -2772, -31693, -66686, -45446, 12588, -19082]
20767a9082k6536j8420L4006L9984j1271o4516j6965J9905K4964M193N8427K2651
20755D7340J0314m5022l0933J0961K0853j1964l2494k9355j1330Q347K5272P3887
20743C5876Q1601m4090J1501p0996j01544j4333j0124J39371J06085q8151n0914
20732e718J6649O220J0943N9051M8771m6175p4095k8846q929l1424M7923K4895
20720A9265k5489N2463P3026n7235J904O50k2024N859P107K2313m9869q7282J7424
20707d1888K927j9433J7886K683N2253Q6031p583m2681J4448k8864m2672l5413
20695d2306N443j2068J5927L8304l4377N8640O2415p764l5107m873m18j6194L463
20682C1085N3334R185p0787K6705K2213j9054k5534m5495K507k5066l9376j3597
$$ y = [-19082, -45618, -64038, -30032, 9952, -1319, -65835, -82800, -62895, -37931, -33738, 24689, 47340, 57654, 12632, -18301, -7340, 13513, 1549, -30945, -60300, -71630, -63283, -38011, 35876, 117477, 73387, 84888, 13892, -87652, -101985, -112109, 27262, 133347, 45196, -5718, 10931, 17151, 28094, 87145, 135916, 89741, 15646, -13200, -22129, -53553, -5630, 19265, -6224, 46239, 119265, 62030, 63934, 64584, 42560, 48419, 55526, 77839, 27970, -59312, -41888, -38961, -58394, -40508, -37825, 14428, 100459, 92876, 50195, 64643, 35779, -6893, -42306, -36863, -48931, -33004, 5300, -29077, 29563, 91978, 84214, 49107, 44234, 43816, 27622, 31085, 84419, 93604, 22817, 49522, 71735, 52681, 27147, -18348, -15841, -40907, -80283, -93880]
20670i3880M3164l2772L41j1746J9820Q674J232P1680J0479O0798R769r7269j39497
20657a49207N0675J24625q423o6442l8366L67N6040K8284j5179n926r074j12340
20645a44966L5791J11936Q6059N8424J93r1545n0246n0034j7504P4411M612m674
20633A2457J4347j7476R658O4348K9304m6755m7287R796M8626l9483m0639r6N796
20620B596R691l7223m0432M3431N4149l1904J8707r452m8950J8293K4393m4824
20608d1525K1453N0525J4928L1555m8489j06598l1425J9707L7818R537K5824j429
20596a8119n8386m2264N4793N2441K2158k7285n6559p06P1486M8297k1304m2809
20584a8257k545k9868K3832p609j1760k8486k9400n704M418M9322K9720J7347
$$ y = [-93880, -50716, -83488, -83147, -94893, -75073, -66399, -65167, 6513, 16992, 77790, 87559, -9710, -149207, -98532, 26093, 17670, -48772, -87138, -86771, -30731, -2447, -17626, -23552, -32626, -144966, -109175, 2761, 88820, 147244, 147437, 55892, 5646, -44388, -61892, 12519, 17131, 12457, 26804, 9328, 18986, 83334, 112638, 65883, 18596, 28392, 77018, 37535, -3104, -3200, 2596, 12287, -24936, -65368, -21937, 32212, 308, 19015, 9563, -39387, -21094, 3299, -41525, -20072, 30453, 45381, 76936, 28447, -78151, -109576, -89869, -52051, -42514, -16690, -18119, -76505, -118769, -63976, -11535, 10623, -16662, -73221, -73927, -2441, 45856, 24552, -18257, -20802, -50670, -26838, -34447, -46207, -74693, -104093, -109797, -105379, -56057, -26337, -8990]
20572h990k4492O908p802L3529j2003K991k4676n9718M4059L7780l3486k0325
20560f6225j4290R3761L8922K3384j6133p6121N83R720m4815m5046p542M8977
20548e4825N9016K0199k7193R456K6020L3907L756K1153k945m3292j1751o1788
20536b8287L7470k5811r042j1362J8465Q1743K6301p6071m3012N569j0372n5451
20524h9860l6922M1426n3248p669K774Q5952M6105L4295k6149q586L1154K5222
20512D4494o8062R660M251k4123K0441K1838j9792j2987N2083J6734L2110p4355
20500B292n0671o089j2754O572J0727O4178J4016k8363P43k8930j7770p074k7782
20487h0905j6738K8301M0515K886K5173N8577j4869R143J6336j4896n2570O366
$$ y = [-8990, -33482, -26574, -34376, -847, -12850, -9859, -34535, -94253, -50194, -12414, -45900, -66225, -80515, 13246, 52168, 75552, 59419, -16702, -16119, -6399, -51214, -96260, -103802, -54825, 4191, 24390, -2803, 6653, 32673, 66580, 70336, 91489, 88544, 45252, 33501, -28287, 9183, -16628, -25670, -37032, -18567, 63176, 89477, 13406, -29606, -24037, -34409, -89860, -126782, -85356, -138604, -146273, -143499, -57547, -11442, 22853, -3296, -11882, 19272, 44494, -23568, -13908, -9657, -33780, -13339, 8499, -11293, -24280, 27803, 44537, 76647, 2292, -48379, -54468, -67222, -60650, -49923, 14255, 28271, -92, 651, -28279, -46049, -53123, -80905, -97643, -69342, -28827, -25941, -768, 57809, 42940, 52083, 68419, 53523, 953, 7319]
20475G319Q880j6870m2350L5266K0261j5113l8774l2875K2614L5867k4464j4059
20463e4298L1756M0989K5321M7262k4657j04832J1018j5023p4001j2753R1345
20452c7873L3014k8088Q590M8565o19o760j190M0009o6701j898l9085j4502j5789
20439h2327L6555J2281J0319j6827J3425l8747l1232K6927K2814K2147k290O398
20427b0557l0420L6225O078k4359O1376j6189m9195N261q6976o3356n096L6953
20415a50255N8246K1300n69n3047M5553N3514O308j895j04295L4486P4656K5879
20403I881O105N659j3671j2637J6165j8609q1002N362O8539j0385m7786p580K9223
20390e0736P9119P8011j780l115m2002j2575p9525n0995l8506O689O4105N1175
$$ y = [7319, 16199, -671, -43021, -7755, 12506, -2607, -41381, -74256, -51642, -15775, -40239, -54298, -22542, 18447, 43768, 91030, 66373, -38459, -27441, -42464, -116465, -129218, -37873, -4859, -32947, -24357, 24208, 23589, 16829, 15639, 55648, -11053, -12951, -52036, -66538, -82327, -45772, -33491, -23172, -39999, -26574, -65321, -96553, -69626, -46812, -24665, -26955, -20557, -50977, -14752, -8674, -33033, 28343, 12154, -37041, -31780, -118756, -182112, -187208, -150255, -92009, -70709, -71278, -124325, -78772, -25258, -18950, -20845, -125140, -90654, -15998, 9881, 15986, 21645, 7974, -4663, 11502, -7107, -88109, -82747, -14208, -24593, -72379, -79959, -50736, 28383, 106394, 104614, 101499, 59497, 46922, -32603, -83598, -122104, -115415, -51310, -135]
20378a35R028N5238k2454L1476k5306r1715J2751M8152K4844j2540J3739J2970
20366E6048j0643o5912m543q255k7440L9197J8999Q7269M9376L7305m8306r9236
20354B3859j4900J2234L8221m5179k3186N5783K6773k4478o2225n2753K692o686
20342f9845M4933l9256j3967n515r301N8207J8574L6144N8377J5292n2762n6298
20330a5417n1336N5605J56209N5111n7991n6099j7355k7560L2774q838r1266n2695
20318g8858N1759j5039K2901J6574O2552j7105K5925q402m3100k487M601j2226
20306G095J6219J2028N9820O751r7402p4630P445Q6194M9250n2923r459k8482
20294a8094M463k6570j992j5030l4570L9495P3808J2141k6344L3310j8894j9846
$$ y = [-135, 8893, 64131, 41677, 73153, 47847, -43868, -31117, 17035, 41879, 29339, 43078, 56048, 45405, -20507, -25050, -33305, -60745, -21548, -2549, 84720, 134096, 171401, 123095, 23859, 8959, 21193, 59414, 14235, -8951, 46832, 73605, 49127, -13098, -65851, -63159, -69845, -24912, -64168, -78135, -83650, -92951, -34744, -16170, 19974, 78351, 93643, 40881, -15417, -66753, -11148, 145061, 200172, 142181, 86082, 68727, 41167, 73941, 65103, -26163, -78858, -27099, -42138, -19237, -2663, 59889, 42784, 68709, 60307, 17207, 14720, 19321, 7095, 23314, 35342, 95162, 101913, 4511, -70119, -62674, 23520, 72770, 19847, 10388, -18094, -13631, -40201, -42193, -57223, -91793, -52298, 21510, 33651, 7307, 40617, 21723, 1877]
20282A877m186R3255J9704q4995m6418q827K4339L215j1031k0717m9864k9495
20270a13143j3610O5187J9781Q8705P0205n4863o4039j835r0281J4884K1505L0845
20258b6659L4900K7149n3143l3241J6246L4712k5205j8687L9316L9012l8153n7242
20246f0995M8527j6734j6385o6700j9277O1790L1940m5365M5453P5J8826j126
20234a9971n8429K3579O9629L9119p7778K2641K7833l3418m9323N5709M7893P7515
20222A24999M600p5419P437N7606J5407j0094n3797l0769J3078k6364L2163O6117
20210A24964k5420j1625o171j9888j8039j8321q0611K4011J6835L3629k0117m8065
20198d8818K4537O6010m7628M448N4486L2223J7930K198j2914o0145j0228k0627
$$ y = [1877, -2309, 90946, 110650, 25655, -20763, -29590, -5251, -2036, -13067, -33784, -83648, -113143, -126753, -61566, -41785, 46920, 117125, 62262, -1777, -3612, -93893, -79009, -57504, -26659, 8241, 35390, -17753, -50994, -34748, -36, -25241, -43928, -4612, 34400, -3753, -60995, -12468, -29202, -45587, -112287, -131564, -69774, -37834, -83199, -37746, -37671, -18845, -19971, -78400, -54821, 14808, 53927, -23851, -1210, 26623, -6795, -56118, -409, 47484, 124999, 129599, 54180, 61617, 119223, 134630, 124536, 70739, 39970, 53048, 26684, 58847, 124964, 99544, 87919, 81748, 61860, 43821, 25500, -55111, -31100, -14265, 19364, -753, -48818, -24281, 41729, -5899, -1451, 53035, 85258, 103188, 105386, 92472, 32327, 22099, 1472]
20186A472r538l5919q524n5411K5165L0872M7678L2321J63l9648m8570k8706M7805
20173d0840m5387j6451L3364O991J0908O4685J12351J9601p880J4958J4115j8255
20161A48160q9352n2058k2807o402M208K3641o1543M8810L1121o099j1080j4444
20149g845K1518q649o0723l3034j4882j2647O1789m809J5919N3556l987J3985
20137B0191m2406j032K4290J1009k676k0510j137M4039j7239K6961j712j2669
20125B7109l8247K8586m2597k0623K0026Q727Q5929j0259j1917n6087n9691J2699
20113e6345L5830P0408j9441k2776q4779J4112l8081j8349Q6393M5531k0422l8212
20101d6131K8181O4362K7189n5902P6206Q6408k2905k1753l4880o6035j0987j0080
$$ y = [1472, -8066, -43985, -52509, -107920, -82755, -51883, -4205, 28116, 28279, -11369, -59939, -88645, -40840, -86227, -102678, -69314, -62323, -51415, 13270, 125621, 145222, 137342, 152300, 166415, 148160, 58808, 6750, -16057, -22459, -18251, 5390, -56153, -7343, 23778, 17679, 6599, -7845, 13673, 5024, -55699, -88733, -103615, -116262, -54473, -59282, -43363, 10193, 6206, 20191, -22215, -23247, 1043, 12052, 9376, -11134, -12271, 31768, 14529, 41490, 39778, 27109, -11138, 17448, -25149, -45772, -25746, -17019, 68910, 58651, 46734, -9353, -69044, -56345, -20515, 49893, 30452, 7676, -77103, -62991, -101072, -119421, -33028, 12503, -7919, -46131, -17950, 46412, 73601, 17699, 93905, 180313, 157408, 135655, 100775, 34740, 23753, 13673]
20089A3673L0545j8961r0255o8747O2817K8070K587N9553J1808P782l1030M459
20077A2301L294j3894k0432O210L2959O3930k2631r1856k2585J3416N1865p292
20065E285n1012o4819K5685Q5672K5051M90o7809l6628N3789j0435j0019J1667
20053c3083L4345k3355o7193L9356K6676k2982J5065J2787M2158m7601n4217o120
20041h4164Q3797O1431J9891k7458m302p7692O7120M1730p5441m6856j0036K255
20029d9725J06127M235k9010L9119J5501n7493J8041r944j00189P510N4216j4293
20017a5905r913L014j3016k6636K3433K7547j2979l1183J564l680p179m7622K6079
20004h6476P4860q96l7690l6960j8327L0499L9340k1285N0137M7144J948K4340
$$ y = [13673, 44218, 25257, -64998, -133745, -70928, -42858, -40271, 19282, 31090, 38872, 7842, 12301, 15595, 1701, -18731, -12521, 20438, 84368, 61737, -30119, -52704, -39288, 12577, 5285, -45727, -110546, -84861, 811, 25862, 26352, -41457, -78085, -24296, -34731, -44750, -33083, 1262, -22093, -89286, -49930, -23254, -46236, -31171, -18384, 23774, -23827, -78044, -84164, -367, 61064, 80955, 53497, 49195, -28497, 38623, 80353, 4912, -41944, -51980, -49725, 56402, 60637, 31627, 70746, 86247, 28754, 46795, 36851, -63338, -55828, -1612, -15905, -25818, -22804, -35820, -62456, -39023, -11476, -24455, -55638, -54074, -57754, -64933, -112555, -86476, -11616, -12512, -50202, -87162, -105489, -74990, -35650, -56935, -6798, 40346, 42294, 66634]
19992F6634K1162P1768p507m9253l1244n1526K2893L9378Q029o6759m6706n0194
19980g3325M1502L807K693J0416K3990r662N9095K6875l5619l9830K0770N8364
19968H9076M567J971j308n4662l8097N7773l3589l0614L345j3221j7537m642j7678
19955e4616J8361M4812m3694K2632M7492j8504r734J0164n0997l9477l3206J9563
19943h7204M8286q35l3230L4988M9167o35M0593L0068j5518k5989m3389j9430
19931b3128m954K175L4627l4048P370M3169n0196n6142k3699P5387N3848o3958
19919c9549j1595J2652j9461L0980N1179N4084m6543k8232N0350M2028o7388n8408
19907b9903N642o732k7595o1792J1110L3211K0666j3574M8400o953M1746Q2208
$$ y = [66634, 87796, 159564, 152057, 102804, 71560, 20034, 42927, 82305, 90334, 23575, -23131, -73325, -31823, -28016, -25323, -14907, 9083, -579, 58516, 85391, 49772, 9942, 30712, 89076, 93643, 95614, 94306, 39644, 1547, 59320, 25731, -4883, -1538, -14759, -32296, -36938, -54616, -36255, 8557, -35137, -12505, 34987, 16483, 6749, 16913, -34084, -73561, -106767, -87204, -38918, -39753, -72983, -37995, 11172, 10537, 51130, 81198, 65680, 39691, -3698, -23128, -28082, -25907, 8720, -25328, -17958, 25211, -24985, -81127, -104826, -29439, 24409, -39549, -51144, -38492, -57953, -26973, 24206, 78290, 31747, 3515, 53865, 95893, 28505, -29903, -24261, -30993, -58588, -120380, -109270, -76059, -55393, -68967, -20567, -27520, 14226, 96434]
19895I6434k7479k2940J8898l824l0370R803l3323j4566J3745n1031k1407Q2506
19883A6446M0770k0753j1860j4177l3768M0727j2679o6863j03547K3242J8791
19872a23671Q2913M2060m3249O1224M4059K1117j5901k044L7034j4487p4102J8025
19860C2978k6199q1250r290Q3926o302n2281J9786M5509j7598r972K1547K7882
19848B8736L9470J796j9203k9793k6985m8622j1725L4084Q6974Q546L4286M6080
19836A43644j3631o5307j30239j2685Q6843j7112L0731N8587k1018L2237p3689
19825A8361k3830N5358k4965l9839n2112o9763q621J37555j0356k4329J4940l3171
19813f0772j8828K0835j5129L7630J4752j2637N8446N8864L3340k4362l2915l6828
$$ y = [96434, 68955, 46015, 64913, 61089, 30719, 40522, 7199, -7367, 6378, -44653, -66060, 16446, 57216, 36463, 24603, 10426, -23342, 17385, 4706, -62157, -165704, -142462, -123671, -40758, 1302, -41947, 19277, 63336, 84453, 68552, 66508, 103542, 89055, 14953, 32978, 6779, -74471, -83761, 165, -6137, -58418, -38632, 6877, -10721, -20693, 854, 28736, 68206, 70002, 50799, 21006, -5979, -54601, -66326, -32242, 54732, 63278, 97564, 143644, 130013, 64706, -65533, -78218, 8625, -8487, 22244, 80831, 59813, 92050, 18361, -5469, 49889, 24924, -14915, -67027, -136790, -145411, -7856, -18212, -42541, -27601, -60772, -79600, -58765, -73894, -36264, -21512, -34149, 24297, 83161, 116501, 92139, 59224, 22396]
19801B2396k6340M0509j2837J458L5847o011m5177l7664l697L3913m7203L2755
19789a2051n667M8320j8393j8485Q979N306N5982p0256l0686R3184l9673J9168
19777C5728L2337j6928N1934L4101k4622q526K8905p2784l7254m8934m6414M3280
19765b9177k9671O2380Q1400L3104m0216m4991M3837q806q2260J952K1268j4092
19753e272K5205j9113m9296R141K1543M8457R0578q579L537k0737m8915K0831
19741F7380N6294k48k2835m2568O17O2565K4609m2146M564n3404l2881K0872Q930
19728E1749j5751O3565N9579l0697k8557m5152l3503O3634p884M1754l0809q4465
19716C463k2989K9666M6701J5653j7677P693Q418q71m130m4324L6455j5429l9082
$$ y = [22396, -3944, 36565, 23728, 25186, 61033, 55022, 9845, -27819, -31516, 2397, -44806, -12051, -17718, 30602, 12209, -6276, 2703, 8009, 63991, -6265, -36951, 56233, 16560, 35728, 68065, 51137, 103071, 137172, 112550, 104024, 132929, 60145, 22891, -26043, -72457, -29177, -58848, 3532, 84932, 118036, 77820, 32829, 76666, 67860, -14400, -12448, 8820, -5272, 19933, 820, -48476, -39335, -17792, 30665, 121243, 112664, 116201, 95464, 46549, 67380, 123674, 123426, 100591, 58023, 58640, 121205, 145814, 103668, 108232, 54828, 21947, 42819, 51749, 35998, 99563, 159142, 128445, 99888, 54736, 21233, 84867, 76983, 118737, 87928, 3463, -19526, 10140, 56841, 72494, 54817, 62510, 70928, 70057, 65927, 21603, 58058, 42629, 3547]
19703C547L1293R747P3588l6074n4878r329L7014L5874J2493n3285O746M7807
19691A04543l2792j5029m8286K9439K2538P165j5680l6899p917J26473k2625J1158
19679A22088P970l8791p6471O5575m9120m9545n1602J4921M6461K5899O9071O5645
19667A52101l2478k7696o5400n8697j1790k212M1192O6175N3624K800j08290o4857
19655e5528q216M3842L9726j385Q0206k6217k994Q902m1834n0820R273J070j4797
19642a8772M2444L5801o96K1124m8787l5504J78n661j8766K1346J2291O6018l9572
19629C1444K0468J6567j08021k6735N3817j8482N2253m2515m5515N5504R7841
19618H6626L0037J8573k6123j5132k1781l8500k386l5920p6531l7325M2870L4151
$$ y = [3547, 34840, 44587, 118175, 82101, 27223, 17894, 54908, 90782, 103275, 49990, 56736, 104543, 71751, 56722, 8436, 37875, 60413, 67578, 51898, 14999, 7082, 133555, 110930, 122088, 130058, 91267, 14796, 80371, 31251, -18294, -69896, -54975, -8514, 17385, 86456, 152101, 119623, 91927, 26527, -32170, -43960, -46172, -4980, 61195, 114819, 117619, 9329, -55528, -63744, -19902, 19824, 18439, 98645, 72428, 69434, 78336, 36502, -14318, -5045, -3975, -18772, 23672, 59473, 58777, 79901, 31114, -4390, -4212, -9873, -28639, -7293, 4998, 71016, 31444, 51912, 68479, -39542, -66277, -12460, -30942, 21311, -21204, -66719, -11215, 86626, 116663, 135236, 109113, 93981, 72200, 33700, 31314, -4606, -81137, -118462, -75592, -41441]
19606d1441Q5968J0063O643k8275r0230K7788J13326L6704k6307q1754k4304l81
19594a2200n7221L7885Q5597J2336K6097M1613J8629m2193j28254j06493k5909
19583a50113P1976M1246K4398l2740j4756Q4899J8975N3548R1116M6357n1420
19572A83486j27899r0732J7381K8568M4060K7660K3047n673J3795j6697o915m2413
19560D7668J2341P16n7529o590O1734O6464n3209l3651N684m9174k5762J569J8904
19547a0835M44K3405K9317n4497k2M5181P2922r23l9139p0789J2423O3505M7477
19534A18469R044J2298n1698m8679M4284K3253m1329k7590k2768L595L5066L6823
19522I0768K8378J5798q140j03243l8691N4757J3311M790K3673K306J2794l3775
$$ y = [-41441, 44527, 54590, 61233, 32958, -57272, -29484, 83842, 120546, 94239, 12485, -11819, -12200, -69421, -31536, 54061, 66397, 92494, 134107, 152736, 110543, -17711, -124204, -150113, -78137, -36891, -12493, -45233, -59989, 24910, 43885, 97433, 188549, 234906, 183486, 55587, -35145, -17764, 10804, 54864, 82524, 105571, 99898, 113693, 96996, 90081, 47668, 60009, 60725, 3196, -3394, 58340, 124804, 71595, 37944, 43628, -5546, -31308, -29739, -10835, -10391, 13014, 42331, -12166, -12188, 32993, 105915, 104992, 65853, -4936, 7487, 70992, 118469, 127513, 139811, 88113, 39434, 83718, 106971, 65642, 38052, 15284, 18879, 53945, 90768, 119146, 134944, 126804, 23561, -15130, 39627, 52938, 57728, 81401, 83707, 96501, 62726]
19510F2726N292J4902j549M7146M3903J9687L6731Q324L415l5158q6631p9118
19498C9670m8430M8731L1889l1371P3568n331p3069L1596K7126l8794o4627M605
19486d437O5933K1827m7654J3787J095j2756o1737m1890k2152N8898P1058J4361
19474E6333o9630O026O2654l024k4113l2570l116j3152O5393k312p714p312J7724
19461D5187O3738k9244j26308k2172R2282N4710l9606m6990Q03K3374K1232M3591
19449H0597rk9074l1291O2282j7500k2573K2284m668k3601m2607n4131m4207J6115
19436h8383N2804N3877N2238J6245n132k9369L3913j3045k9523l1658L1286K6923
19424G0176L2213K4556p3972j8869K0539Q593p1583p4439K9894m278J3653M8861
$$ y = [62726, 68018, 82920, 81371, 128517, 172420, 192107, 228838, 237162, 240577, 205419, 118788, 39670, -8760, 39971, 71860, 40489, 114057, 108726, 35657, 67253, 94379, 55585, -9042, -4437, 61496, 83323, 35669, 49456, 50551, 37795, -23942, -65832, -87984, -29086, 41972, 56333, -13297, -7271, 55383, 52359, 28246, -4324, -7440, -20592, 44801, 42489, 34775, 27463, 45187, 108925, 79681, -46627, -68799, 23483, 78193, 38587, -8403, -7600, 15774, 37006, 80597, 80588, 51514, 20223, 82505, 65005, 42432, 64716, 60048, 36447, -6160, -60291, -104498, -88383, -35579, 18298, 70536, 86781, 81649, 52280, 86193, 73148, 43625, 11967, 43253, 70176, 102389, 126945, 52973, 34104, 54643, 63236, -8347, -82786, -52892, -57170, -43517, 5344]
19412E344K5750K1061k2383M8029O0159n8669j5725Q9497l1521n8356o8435m977
19400a0226k8131Q93L3131K7866K8302K092M4254L5094K706O153m0401m2842j4724
19387D4167L6930k319J6073l0652N79p402L2905j0379Q185r563K6055R4656K4923
19374B24158p4893k6303J8548J6062l9642J0535K8630L7226L6748M856j179k0936
19362B13810O850N2573N8647N8740J00546J56041K13741K23381K05112K30000
19352A519441K85443K43759J88237J5489o5734m2155p6823k33907k94703k32281
19342A306766k02617k09170j15303m3207p8568q3036p868L5038J8470q5105o191
19331E29209J7054l4116k6570o4393p0957j2253K7215K379O904J13219K5599n0064
$$ y = [5344, 31094, 52155, 29772, 77801, 137960, 79291, 63566, 153063, 121542, 63186, -5249, -10226, -38357, -37464, -4333, 23533, 51835, 53927, 98181, 133275, 135981, 142134, 101733, 58891, 44167, 81097, 78778, 94851, 64199, 64778, 57376, 90281, 79902, 88087, 78524, 104579, 199235, 224158, 149265, 122962, 141510, 157572, 117930, 128465, 157095, 194321, 231069, 235925, 234746, 213810, 220660, 273233, 331880, 390620, 491166, 647207, 860948, 1084329, 1289441, 1519441, 1804884, 2048643, 2236880, 2252369, 2186635, 2144480, 2067657, 1833750, 1539047, 1306766, 1104149, 894979, 779676, 736469, 657901, 574865, 566997, 602035, 620505, 535400, 529209, 546263, 512147, 485577, 421184, 350227, 337974, 365189, 367568, 374472, 487691, 513290, 463226]
19319D63226J3659l0178j0066J9189q6299k3644M8875J2084J3580J0547J1093
19308D42066p7168n7553j6921J1557m0002l9313J0319j1835k4538N5970K9254
19297B81836n9874K7556J6101N760m5232m1062m8413O138J2111P4492O9694L0004
19285C29111k2617n6862l5101J8942J2743m6901l9649K5155L1096j5384k9599
19274A70934p0442L8472P058k1482O866N5795l02k0593p1076o8460M1742k1894
19262D6618l0792K4255M917P249j8354L920j2172l2287R1843N0518j7994j01523
19250A6198n0841m8733L9980M7116N025q1996J8282L517M905J118K603J8689m934
19237b9071J7278N3861N1647K2399J7996k1267p7673P2665L2922K4189o3010j2478
$$ y = [463226, 476885, 446707, 436641, 455830, 369531, 345887, 394762, 406846, 420426, 430973, 442066, 364898, 307345, 290424, 301981, 261979, 222666, 232985, 221150, 196612, 252582, 281836, 221962, 249518, 265619, 271379, 226147, 185085, 136672, 142810, 154921, 229413, 299107, 329111, 306494, 249632, 214531, 233473, 246216, 199315, 159666, 184821, 215917, 200533, 170934, 100492, 138964, 146022, 124540, 131406, 187201, 186899, 166306, 95230, 26770, 68512, 46618, 15826, 40081, 44998, 52247, 33893, 37813, 25641, -6646, 85197, 135715, 117721, 16198, -34643, -83376, -43396, 3720, 8745, -73251, -54969, -51452, -46547, -45429, -42826, -24137, -29071, -11793, 42068, 93715, 116114, 134110, 112843, 35170, 107835, 140757, 164946, 101936, 89458]
19225H9458M1758o725O989J6406l1645J4068q9844k4924O2351J044K1056l1363
19213F8629j1750m5349k7929J4934K6327J2719K5472k5583n5184j5947K3160O9279
19201E8778J05589N4974K1073j501m1623j40785k6730K5269j0081J980j2754k1996
19189A2193j7858Q6957P4252l220q5904j2723M36J6048L199j6521q433M8800m3868
19176E3358j5895L432K0984N0146M8335n0K9371n6500k9081q398J8115P7678O5457
19163B56952j7782r9209j1206M7053n514q8359q710M4643J4275k9454P711N5397
19151A65797k4049n039k0513k5149K5428L3069n2175J5954Q3453k1969n9839n9286
19139E5682L4335j7379k39k6582M8751J0837o4236j2279N397L4230L0839K0018
$$ y = [89458, 131216, 124491, 131480, 147886, 116241, 130309, 40465, 15541, 77892, 78936, 99992, 68629, 56879, 11530, -16399, -1465, 24862, 37581, 63053, 37470, -17714, -33661, -10501, 58778, 164367, 219341, 240414, 238913, 197290, 56505, 29775, 55044, 44963, 46943, 34189, 12193, -5665, 81292, 155544, 152324, 66420, 53697, 54133, 70181, 73380, 56859, 48426, 97226, 53358, 37463, 40895, 61879, 112025, 160360, 160310, 189681, 133181, 104100, 95702, 113817, 191495, 256952, 239170, 139961, 128755, 175808, 170294, 81935, 73225, 117868, 132143, 102689, 110400, 165797, 141748, 136709, 116196, 91047, 116475, 149544, 97369, 113323, 196776, 174807, 114968, 55682, 90017, 72638, 72399, 45817, 94568, 105405, 41169, 28890, 34287, 68517, 99356, 119374]
19127A19374L4401J8090M391O3155J9687o7084p4602J8911j0462j1764N8252p361
19115A64988k2819l515K2978O287K5066M16j7904k1997L1765N9727p754k4298
19103B12940l3238k8025O436p108m5108l318K3554L3625j1585o9266K9666K4788
19091A33361N3343m218p311k6435m1529L2852L7210j1592p527J5507j15526p3338
19079a5203N300o3110m0547J101n3797p9954n424J2451n5550r915N3170J2301
19067b39177P5843L8079K5395L3035N7451Q4595Q5242j0817k8140k6927P6244
19056A70823l8169k8313M3204K030N120P9754J03852K1148L4714P2527O9065J4368
19044E50123K9418K3286J28728J21958J5259k6704j9429k29n5334j17132j23557
$$ y = [119374, 153775, 171865, 176256, 239411, 259098, 192014, 117412, 136323, 125861, 114097, 172349, 164988, 142169, 138654, 161632, 167919, 192985, 193401, 175497, 153500, 185265, 244992, 237238, 212940, 179702, 151677, 158113, 151005, 105897, 102579, 126133, 159758, 148173, 78907, 108573, 133361, 186704, 182486, 175175, 148740, 107211, 140063, 177273, 165681, 158154, 173661, 58135, -15203, -9903, -73013, -113560, -112459, -166256, -246210, -251634, -239183, -294733, -304648, -251478, -239177, -163334, -125255, -99860, -66825, -9374, 75221, 160463, 149646, 121506, 94579, 170823, 132654, 104341, 147545, 149575, 154695, 234449, 338301, 359449, 394163, 466690, 535755, 550123, 579541, 602827, 731555, 853513, 868772, 842068, 822639, 822410, 767076, 649944, 526387]
19033E26387p0732j8983n9463J4871J9134J6241K5799r5618j3273M0460P18r2009
19021B93532q0203J5381J8332M8749M4842n0689p0356p261J2727M8509J9496m7672
19009B45387M6024K5508m9076l4678k9555n7295J0621P1614M8109q458j8172q3578
18997A66451p5393L0682L9546N4055n249J0668L6475O6274k8970o445j8226N4491
18985C24359L4774J4266k1611n8531m080k5954l9082o6372n7254N3521O8345l0401
18973A91980j8592J5775L941k5141o0048o112P9557M7078n117j9817j3687Q256
18961A98073L4912j1795l8169k4131j711J7649m9481k6484L393j602K1728l654
18949A18728M101K1252l4817J07695Q2771K1757K2797r7719J4678Q1946p997J6089
$$ y = [526387, 455655, 436672, 377209, 392080, 411214, 427455, 453254, 357636, 344363, 384823, 385541, 293532, 213329, 228710, 247042, 295791, 340633, 289944, 219588, 212327, 225054, 273563, 293059, 245387, 291411, 316919, 267843, 233165, 203610, 146315, 156936, 228550, 276659, 268201, 250029, 166451, 91058, 121740, 161286, 215341, 210092, 220760, 257235, 323509, 294539, 288094, 269868, 324359, 359133, 373399, 351788, 293257, 289177, 263223, 224141, 157769, 100515, 154036, 222381, 191980, 173388, 189163, 193104, 167963, 107915, 101803, 181360, 228438, 223321, 203504, 189817, 198073, 232985, 221190, 183021, 158890, 157179, 174828, 125347, 98863, 102256, 100654, 122382, 118728, 122829, 144081, 109264, 216959, 299730, 321487, 344284, 246565, 261243, 343189, 335192, 351281]
18937C51281p0587r6226J0036K2503N9868N9331j0811m0309j1117J5505j470L198
18925B91202j1899k3892J8552R234P3293M9491N6078P7316P4871N1064P255J0107
18913F82672K9646J0444J15517J9822q7971n1763j16501K6808M4307l8263J3746
18902F48464q332r980l8664K1494q406R8861Q929J5600M3445l6143m8217M336
18890F91387J15055P7251k2672N1175O6598R1079N620k0275Q0579Q6566M2708
18879A265071M9304L3653R6521O5205J07658M2160J00486J29698J4857J44442
18869B049055J73658Q7695M6139O8532O9734M4476M3718L6197L3649L7582O212
18858B696647N9659R112J5086O0763M8320M0828Q6147M6853N1885L3225l1880
$$ y = [351281, 280694, 184468, 194504, 217007, 276875, 336206, 325395, 285086, 273969, 289474, 288004, 291202, 279303, 255411, 273963, 283197, 356490, 405981, 462059, 539375, 614246, 665310, 672565, 682672, 712318, 722762, 838279, 858101, 770130, 718367, 601866, 628674, 672981, 634718, 648464, 640132, 630152, 591488, 612982, 604576, 703437, 712366, 727966, 771411, 735268, 687051, 691387, 806442, 883693, 861021, 912196, 978794, 1069873, 1075493, 1055218, 1135797, 1222363, 1265071, 1314375, 1348028, 1444549, 1509754, 1617412, 1659572, 1760058, 1889756, 1904613, 2049055, 2222713, 2310408, 2356547, 2425079, 2494813, 2539289, 2583007, 2619204, 2652853, 2690435, 2696647, 2756306, 2765418, 2780504, 2841267, 2889587, 2930415, 3016562, 3063415, 3115300, 3148525, 3116645]
18847C116645l288J4970Q0284J04518J02968Q020J3330N0461O6626O2848K8320
18836C645702J33736N6852N3780l1572k6173L0841R7457J45637J48678J65686
18826D420624J44955J24462J37789J32601K14591J60787K20757K81549K46659
18817F084774K99167K47744L30008M50443N70317O92065P52628Q13397R43191
18808A1183734J023702J092815J118776J361469J586407J699412K046605K479957
18800B3592877L031902L992460N163617O824677R241048J2834790J7778457K4419193
18792A06879021L2763189M1171397M5467649M6233604M9346057M5973021K4497939
18785C92331877N751873j022607j6229642l7371051m3728264m0376673l8151701
$$ y = [3116645, 3113357, 3128327, 3208611, 3313129, 3416097, 3424117, 3437447, 3487908, 3554534, 3617382, 3645702, 3779438, 3836290, 3890070, 3858498, 3832325, 3863166, 3960623, 4106260, 4254938, 4420624, 4565579, 4690041, 4827830, 4960431, 5175022, 5335809, 5556566, 5838115, 6084774, 6383941, 6631685, 6961693, 7412136, 7982453, 8674518, 9427146, 10240543, 11183734, 12207436, 13300251, 14419027, 15780496, 17366903, 19066315, 21112920, 23592877, 26624779, 30617239, 35780856, 42605533, 51846581, 64681371, 82459828, 106879021, 139642210, 180813607, 226281256, 272514860, 321860917, 367833938, 392331877, 398083750, 397061143, 380831501, 343460450, 299732186, 259355513, 221203812]
18778B21203812l4500276k7636635k0466258j5023382j1179373q607660o871064
18771I6919164n556045m672327l956720l404950k933289k640350k468295k184336
18763F9102852j920731j732242j548870j230387j066713r26088n51475m18779
18755E9707567n12569o65546p09133p57262j021658j315400j402751j459267j610973
18746E0253008j810456j880332j905830k092239k087355k030555k092511k040188
18738C4313542j971188j852170j678533j605623j526824j414401j337902j222668
18730B1704233j139517j073567j066438j000824r72983q76447p72257p75009p16882
18721A3310309o93310o98528o89950n76302m91333n06101n13192n56396n09065
$$ y = [221203812, 186703536, 159066901, 138600643, 123577261, 112397888, 103790228, 96919164, 91363119, 86690792, 82734072, 79329122, 76395833, 73755483, 71287188, 69102852, 67182121, 65449879, 63901009, 62670622, 61603909, 60677821, 60126346, 59707567, 59194998, 58529452, 57820319, 57063057, 56041399, 54725999, 53323248, 51863981, 50253008, 48442552, 46562220, 44656390, 42564151, 40476796, 38446241, 36353730, 34313542, 32342354, 30490184, 28811651, 27206028, 25679204, 24264803, 22926901, 21704233, 20564716, 19491149, 18424711, 17423887, 16450904, 15574457, 14802200, 14027191, 13310309, 12616999, 11918471, 11228521, 10652219, 10160886, 9654785, 9141593, 8585197, 8076132]
18712H076132m51372l59759l23062m03123l63566k70174l48087k85990l06044
18703D964955k99851l02402j90908q9515j73820j80443j66042k53980j32872r1679
18693C083443j28456j41573j12124j41060r3265k14417j32711j00738n9544j10897
18683A848658j28691n5717j03268q9309j26286q8804k3931j07820r6521l4186
18673I94125k5672J043K199k4800n3487o2347N1470M8554N3629N8725L6295L0710
18661A110444L5279K4611r0732j49478p3160o0301j35148r4898L0554J4412m0541
18650E71042m3639p0045p9709o0485J1175J2409O5807m5653k8127M1607M7635
18639D22017l7289j0391j5852K5400M2575j2753l0901k871M1921R7721M8649K6690
$$ y = [8076132, 7624760, 7265001, 6941939, 6538816, 6175250, 5905076, 5556989, 5270999, 4964955, 4665104, 4362702, 4171794, 4082279, 3908459, 3728016, 3561974, 3307994, 3175122, 3083443, 2954987, 2813414, 2701290, 2560230, 2466965, 2252548, 2119837, 2019099, 1959555, 1848658, 1719967, 1664250, 1560982, 1471673, 1345387, 1256583, 1232652, 1124832, 1028311, 994125, 968453, 969496, 971695, 946895, 893408, 831061, 882531, 931085, 984714, 1043439, 1079734, 1110444, 1145723, 1170334, 1079602, 930124, 856964, 796663, 661515, 566617, 597171, 611583, 571042, 527403, 457358, 377649, 317164, 328339, 340748, 406555, 360902, 332775, 374382, 422017, 384728, 374337, 358485, 383885, 426460, 413707, 382806, 379935, 421856, 519577, 568226, 594916]
18627E94916L1083K0499Q8700J10657N4907p976M0505J35495Q6615R9110o796
18616A247715m300n314m6622j4281P704J6752l937J8878j5395j137p545j8272
18604A174246M7451M7496r285n6759J7031P9595M0541L2377k367q29r8017j4819
18592A256661K5108M074P5985O23o8295q3514o8266o5686p7404p4288j8384M7813
18580I54427M1412J5478r357k4560q2013K9909L5513p7035n9159l3059k3673j3411
18568G54472m1646o7311l7507p76k6185k4842J5188N3919r7187o4810K4305K8485
18556E16105q5083j0544K6980M7771L2517l8189p7345l4977j543k7649L3277K5798
18544D07118l8888n5351J8967R9725R612r119J6735j2170J2847P3889R668k1724
$$ y = [594916, 625999, 646498, 735198, 845855, 900762, 892786, 933291, 1068786, 1155401, 1254511, 1247715, 1243415, 1238101, 1191479, 1177198, 1184902, 1201654, 1197717, 1216595, 1201200, 1200063, 1192518, 1174246, 1221697, 1269193, 1259908, 1203149, 1220180, 1299775, 1340316, 1372693, 1370326, 1369497, 1271480, 1256661, 1281769, 1285843, 1361828, 1362451, 1294156, 1210642, 1142376, 1076690, 999286, 924998, 906614, 954427, 995839, 1011317, 1001960, 977400, 895387, 925296, 960809, 883774, 824615, 791556, 767883, 754472, 712826, 645515, 608008, 607232, 581047, 556205, 571393, 625312, 528125, 463315, 487620, 516105, 431022, 420478, 447458, 495229, 527746, 489557, 412212, 377235, 375692, 348043, 381320, 407118, 368230, 312879, 331846, 431571, 441183, 432064, 448799, 436629, 449476, 523365, 533033, 511309]
18532E11309K1581j4350p3689q792K1071M8961p6977l0799J887l9172j09819m8425
18520B02786k8352p508L6662K0838K1886J8773l1870K3360q144O6986O1091O3512
18508D40020O8712J06516J10073J04168K09019L56547N21076O76699P79754Q58717
18498D231301M49630m33577q47434p20296n26027l76855k61670j97541j74568
18489A142963j06053o3363R24M914n163k8785o7424k5029n4238j6976N2344j9747
18477H14367o8725J4545R0917N6743j00778l9378k2538l6747J5614j1112m0770
18466F72138p2878J0370J2478k1022N201L8917J4873l0692n699k2452m0684l1750
18454E28800O192j0329J5937n7558Q455j2642J8854o0997l7107n7486L2795J7076
$$ y = [511309, 532890, 518540, 444851, 436059, 457130, 506091, 429114, 398315, 400202, 361030, 251211, 202786, 174434, 166926, 203588, 224426, 246312, 265085, 233215, 256575, 248431, 315417, 376508, 440020, 508732, 615248, 725321, 829489, 1038508, 1395055, 1916131, 2592830, 3372584, 4231301, 4680931, 4247354, 3399920, 2679624, 2153597, 1776742, 1515072, 1317531, 1142963, 1036910, 973547, 974471, 979385, 974222, 945437, 878013, 852984, 798746, 781770, 834114, 814367, 745642, 760187, 851104, 907847, 807069, 767691, 745153, 708406, 724020, 712908, 672138, 599260, 609630, 622108, 601086, 606287, 645204, 660077, 629385, 623686, 601234, 560550, 528800, 534992, 524663, 540600, 483042, 491497, 478855, 497709, 436712, 399605, 342119, 374914, 391990]
18442C91990j6481l8218j4939m2955j2374l5095K6772K23P9124l9058J587N306
18430C05882q992K8163K3244m0673r592q861K4270J755J2735J9030k5255l6162
18418B85544m1226q8342m9547l3650Q209O8342M5922p596k7840j4084O7879j0012
18406B03599l2581o6651N754l7306K1232M0582j0932q3648L388j2077N5642M8640
18394A35642l760q3967Q722J6877N344O416O1807k1237p2007k829q24k5028P8152
18381A03308k634N100n1252o5943l9846N6225P7279J1532R0614Q521n515m4112
18369A43277J7072m317o7799p2108L4736K3688J6645l6199L1574J18986N736l0648
18357A80643j51j6989p8880M0016j6149k5711n1388j7337L9560M0142k8003l1823
$$ y = [391990, 375509, 337291, 322352, 279397, 267023, 231928, 258700, 258923, 338047, 298989, 300576, 305882, 296890, 325053, 348297, 307624, 298032, 289171, 313441, 315196, 327931, 346961, 321706, 285544, 244318, 155976, 106429, 72779, 80988, 149330, 195252, 187656, 159816, 145732, 213611, 203599, 171018, 104367, 110121, 72815, 94047, 134629, 123697, 40049, 43437, 31360, 87002, 135642, 131882, 47915, 56637, 73514, 78858, 85274, 147081, 125844, 53837, 51008, 50184, 25156, 103308, 100674, 105774, 54522, -11421, -51267, 4958, 82237, 93769, 184383, 192904, 187389, 143277, 160349, 156032, 88233, 16125, 50861, 74549, 91194, 54995, 86569, 205555, 211291, 180643, 180492, 163503, 84623, 124639, 108490, 82779, 31391, 14054, 53614, 93756, 65753, 33930]
18345C3930l5176K3314N6582K6663K9268j13p828K2762J0341l9129J4832o2324
18333G3122N5198K8934L7768L5238j7909k2558n459N2461n5203r340J6892k9522
18321A59622R974j4323K1163n7812J97Q3461L8233o10m3037l7804r787j2464m9767
18308H7046N7721K933j7212K1230l0720K0146j7756p3524k7879L3548j8888k8442
18296H203N926j133M4848L883q246R469M2588P6859J1214J8314m3062J9922k4874
18283A63911o2267k6890K7760J3759L9105o5030p2998K3136L8352r206P0534Q3340
18271B23506k0271n1043l9642k683j727J2435Q040k3705O803K2827j4028m946
18259A15566j6203o083O1872K5740l0480q767J762l1973J1105J7691j8347l6190
$$ y = [33930, -1246, 22068, 78650, 105313, 134581, 134468, 126640, 149402, 159743, 120614, 135446, 73122, 128320, 157254, 195022, 230260, 212351, 189793, 184334, 236795, 181592, 172252, 189144, 159622, 169596, 155273, 176436, 118624, 118821, 202282, 240515, 239905, 196868, 159064, 149277, 136813, 87046, 144767, 147700, 130488, 151718, 120998, 141144, 123388, 49864, 21985, 55533, 36645, 8203, 14129, 12996, 57844, 61727, 53481, 62950, 105538, 182397, 193611, 211925, 168863, 188785, 163911, 101644, 74754, 102514, 116273, 155378, 90348, 17350, 40486, 78838, 69632, 140166, 223506, 203235, 152192, 112550, 109867, 108140, 120575, 128615, 104910, 111713, 134540, 120512, 115566, 99363, 93280, 155152, 180892, 150412, 141645, 143407, 111434, 122539, 140230, 121883, 85693]
18247H5693K7575n353j1013M773l2879k9833o507O2024j8294j5337R680K4623
18235I5152L8540K0316L945M4832J1303n9030R916P1405J04229Q3515K6541J31823
18223E82487J91771K09928K77987K56299K76506K14372J18234P1275L3887p610
18213B225136j47591k40891k62648j61685j47530j50049j26581j04328j45688
18204G38145j24911j8705o4137N0096N3424j8461j6604P7864n9503r1907Q93k9284
18192D96910M0159L9541K1885N425O8701M5534m6885j8003n6358k7486M2696J4576
18180F26695J4919L4425n4425o1956Q550J9749q0013J7547j3647l7087M548k0330
18168D58975l7823O2183M6321j2815q272O90L183J7494K5238Q530K4691J8039
$$ y = [85693, 113268, 107915, 96902, 101675, 68796, 38963, 32456, 94480, 76186, 60849, 70529, 95152, 133692, 154008, 157953, 202785, 214088, 155058, 164974, 236379, 340608, 424123, 450664, 582487, 774258, 984186, 1262173, 1518472, 1794978, 2009350, 2127584, 2198859, 2232746, 2225136, 2077545, 1836654, 1574006, 1412321, 1264791, 1114742, 988161, 883833, 738145, 613234, 594529, 530392, 580488, 633912, 615451, 598847, 676711, 617208, 525301, 526194, 496910, 537069, 576610, 598495, 603920, 672621, 718155, 671270, 653267, 596909, 569423, 612119, 626695, 641614, 676039, 621614, 559658, 568208, 587957, 507944, 525491, 511844, 474757, 479305, 458975, 421152, 483335, 529656, 516841, 508569, 509259, 512442, 529936, 555174, 563704, 588395, 606434]
18156F06434m0358j8071L0521J334R888L7674L6084l9068R087M142N1386K8661
18144G17714M2600m9284m5204K8817P2011l1314J4587O758N5527O7142R4475L2361
18132A006190P5701M2842L8816R9778J23298J42479J56037J69066J88019K30562
18122B272788L45453M48009N31460O93306R99618J308853J647454K286958L289906
18113A3823805M771318P053512J0187835J3281464J4655907P921838o814870j4513008
18105E0367801j2694623q489959n506204l694058k712952j996846j410974j088853
18097A2773332r80010q55573o89048o05686m53807m75396k97164k98165k50872
18088G867611k41369k55524k36319j15322j02519o8286q6280m3477m0748L3777
$$ y = [606434, 566076, 548005, 578526, 579860, 589748, 627422, 663506, 624438, 633525, 637667, 689053, 717714, 760314, 711030, 665826, 694643, 766654, 735340, 749927, 756685, 812212, 879354, 973829, 1006190, 1081891, 1124733, 1163549, 1263327, 1386625, 1529104, 1685141, 1854207, 2042226, 2272788, 2618241, 3066250, 3597710, 4291016, 5290634, 6599487, 8246941, 10533899, 13823805, 18595123, 25648635, 35836470, 49117934, 63773841, 71695679, 64880809, 50367801, 37673178, 29183219, 23677015, 19982957, 17270005, 15273159, 13862185, 12773332, 11793322, 10937749, 10248701, 9643015, 9189208, 8713812, 8416648, 8118483, 7867611, 7626242, 7370718, 7134399, 7019077, 6916558, 6848272, 6761992, 6718515, 6677767, 6711544]
18078F711544O7324R6552N858j56119l41949k45209j05626j09252j23803j17699
18068E681621k38554k49170k40358k83807k82861k42809l01255l07285j85788
18059C349734j82660k03502j33909j81164j58890j49007j53228q2528r8874j34598
18049A871374j12365m8166j00625r2123n2096n0590p7291n2434p931j06792j18349
18038A052612p8228k0590m6369p3209n4993o2954K2206L5616k3084p5343q6062
18027E89602r80n2218r6358j9044J5458r988J4782o659k9377m9040L0048k1827
18015C64399j2540n1324K9601J9922q0781k9104N2122L7214n9432m6890o315n2217
18003A64655l1k645k8768J0885m3221m2354k6354K265L9091k9052o0144k9452
$$ y = [6711544, 6778868, 6875420, 6881278, 6725159, 6383210, 6138001, 6032375, 5923123, 5799320, 5681621, 5443067, 5193897, 4953539, 4669732, 4386871, 4144062, 3842807, 3535522, 3349734, 3167074, 2963572, 2829663, 2648499, 2489609, 2340602, 2187374, 2104846, 2005972, 1871374, 1759009, 1710843, 1610218, 1518095, 1465999, 1415409, 1338118, 1285684, 1277753, 1170961, 1052612, 974384, 953794, 907425, 834216, 779223, 716269, 738475, 774091, 751007, 675664, 589602, 588622, 536404, 440046, 421002, 436460, 426472, 441254, 434595, 405218, 356178, 386226, 364399, 351859, 300535, 330136, 350058, 269277, 240173, 292295, 329509, 270077, 223187, 216872, 164655, 164624, 161979, 133211, 144096, 100875, 58521, 32167, 34432, 73523, 44471, -15673, -45125]
17991d5125j4548K7821P2495K9625l6465K1994O0788N8049J4193O3484j2725o4826
17979A74760n2701n3650L9044n04l315j6969K361k5365k0484O3638L9695q7757
17967E8753j60257l1490L2609J427j5200l4850L8797M6130N8877j6652O0362j1098
17955B7408m2960J6355P4858J1619n7190j9247N508j8774K0153J574J18729M5299
17943A83332l5891o5727m3797L9705O362k8616p111j1419p1081J3631J46347K4857
17931A50592k3354k8566l3278L7058R9739K3935K6705M1824k5277n4269n6039
17920A59070m4200J4851O2110j5845p942R945r8100m7905J1857J9378l786L544
17908F2977M3865P6289O4943l2437n8152m5173k4372n2505J0751O0908k1685j2088
$$ y = [-45125, -59673, -31852, 40643, 70268, 33803, 55797, 116585, 174634, 188827, 252311, 239586, 174760, 122059, 68409, 107453, 106949, 103634, 86665, 89026, 63661, 43177, 106815, 146510, 58753, -101504, -132994, -100385, -98958, -114158, -149008, -110211, -64081, -5204, -21856, 38506, 27408, -15552, 803, 75661, 87280, 30090, 10843, 16351, -2423, 17730, 19304, 138033, 183332, 147441, 81714, 37917, 77622, 83984, 55368, 48257, 36838, -34243, -20612, 125735, 150592, 127238, 98672, 65394, 102452, 202191, 226126, 252831, 294655, 269378, 215109, 159070, 114870, 129721, 191831, 175986, 168044, 177989, 79889, 31984, 43841, 63219, 59433, 62977, 106842, 183131, 248074, 215637, 157485, 112312, 87940, 35435, 46186, 107094, 85409, 73321]
17896G3321k4003k6075L0551M7168M2194r4796m7987K1716M0507L233J5742L1638
17884A13209j2797q1425K0168O4871j3225q8977m4153J4089J5979j9039l4977
17873f6277j6541O3949K9008m535L5020L2103J8668k4938j1113j5450l0752k2554
17861a3412k9419L8426L273l8612J7149J7070L3756K6543N0640n2933o1859o1442
17849g0820J8533J5424M2404O3863j9663Q839j4217K4298L6222Q377n5362p391
17837E0507L632n0494k3209O3812o3885p5666L4496K766l0193P3778k8913j178
17825d4547J04924P2863j9870p1066o609N4481m5054K6789n580m3221K978L3009
17813E9097j8230p4231k3844J1628n4443K1961P9102N3559n9579m3409j1827K8636
$$ y = [73321, 49318, 23243, 53794, 100962, 143156, 48360, 373, 22089, 62596, 65829, 81571, 113209, 100412, 18987, 39155, 104026, 90801, 1824, -42329, -28240, -12261, -31300, -66277, -82818, -18869, 10139, 5604, 40624, 72727, 91395, 66457, 55344, 39894, 9142, -13412, -42831, -4405, -1132, -39744, -22595, -5525, 28231, 54774, 105414, 52481, -9378, -70820, -52287, -36863, 5541, 69404, 49741, 58580, 44363, 68661, 104883, 113260, 57898, 50507, 54139, 3645, -19564, 44248, -19637, -95303, -60807, -58041, -88234, -14456, -43369, -44547, 60377, 133240, 113370, 42304, 35695, 90176, 45122, 71911, 66331, 23110, 26088, 59097, 40867, -33364, -57208, -45580, -100023, -78062, 1040, 54599, -4980, -48389, -60216, -31580]
17801c1580L2540L2549M9680M2664l7196q3044M6340R7302m3352j06309l6600
17790c7006n7134m0256J3882J04222R7478M4805R409n9974k0367P7843J4000J7696
17778A64598m1295j18506O153R6155O621N720k0527M058M4105K0239p8625l4931
17766E3765n8008K9146j282M0025N4253K7850k1098n6351n7317j910O0822n5548
17754A4347l2774P8535Q8757o5583r4553J37k2826j9144K7350j4260j0043L1874
17742a8183N3470J7432l4234p62P3163J6755j5664k5321k6930o2753l9359j3764
17730g6150M9710m5101j9214k4838K4331q559L2692L222N5591O157n8212Q954
17718e1417P598J5427N1263j3742j7406k8930J3234k9214k0843j4460n0094l8456
$$ y = [-31580, 960, 33509, 83189, 125853, 88657, 5613, 51953, 149255, 105903, -406, -37006, -94140, -134396, -120514, -16292, 81186, 125991, 135400, 75426, 55059, 132902, 146902, 164598, 123303, 4797, 10950, 107105, 113726, 119446, 98919, 102977, 147082, 167321, 88696, 53765, -4243, 24903, 23621, 63646, 117899, 145749, 124651, 68300, 10983, 9073, 69895, 14347, -18427, 60108, 148865, 83282, -11271, -11134, -33960, -53104, -25754, -40014, -50057, -18183, 35287, 52719, 18485, 17723, 90886, 107641, 91977, 66656, 39726, -23027, -62386, -76150, -26440, -71541, -90755, -115593, -91262, -99821, -67129, -63907, -8316, -2159, -60371, -51417, -43819, -28392, 22871, 9129, -8277, -37207, -23973, -53187, -74030, -88490, -138584, -177040]
17706a77040Q3357Q505J2019l176M7009m75K538k2657l9426k3866j6557m977q498
17693a43244P3242Q6021K8572K2123j9913k5923l4438k4003L0477J5283m7220
17682c9023k5547L558J7248k5141n0431j0494L9287K4283M3123R950n051k993
17670b1231L7509L236j4489N3332o3702k7957K2789N8525k220k4676K2287N1591
17658I4994k4343K263J6887l3317m0936k0377K0132n5367j6696O0124N711l5218
17646b6143j9048N22m7266j00014N5571R9234L2937N0077K3999j3465j1193q2734
17634c7523p7436J9736J274K2512l8474Q224j0290J3838R0493l5485J2972j8300
17622d8459L0595N2596K5543J3649r1129l4225M2619K949j3259J3643L8063m153
$$ y = [-177040, -93683, -85178, -73159, -76335, -29326, -29801, -27263, -49920, -89346, -113212, -129769, -134746, -143244, -70002, 16019, 44591, 66714, 46801, 20878, -13560, -37563, -7086, 8197, -39023, -64570, -61012, -43764, -68905, -119336, -129830, -90543, -66260, -23137, -13187, -18238, -21231, 16278, 19514, 5025, 58357, -5345, -33302, -10513, 48012, 45792, 21116, 43403, 94994, 70651, 72914, 89801, 56484, 15548, -4829, 15303, -40064, -56760, 3364, 9075, -26143, -45191, -44669, -91935, -191949, -136378, -37144, -4207, 45870, 69869, 56404, 45211, -37523, -114959, -95223, -93949, -71437, -109911, -101687, -111977, -98139, -7646, -43131, -30159, -48459, -17864, 34732, 60275, 73924, -17205, -51430, -8811, -5862, -19121, -5478, 32585, 28432]
17610B8432K1212q0373q080N2708r688M0280L1811L5016o7107n537j8281k9928
17598i535R125j7405K0882m2474M3359L8688J5984M310N0734Q798n3249k5752
17586D3465K6800r7459n7772M6714O6301q322l2366L3928Q900l4637l4632K0364
17574a8716m365l627j2l5603R4655L0255k9937j03166n5980K7667O4819J08878
17562G4868k6512q6293k3187J6746M5335J1397N663k2843M0120k815l9956l5654
17550d3131n028l6075K965M3627m943l7933m5847j2549N3150O2123K2274L4381
17538C3014m077l9863k5417N9233P1374p2565k9061Q1388N9190j1153q3293r4081
17526e5311p898Q0347N6374M2533l5474p5857J073K3022l9403m7454o6405L3679
$$ y = [28432, 49644, -30729, -38809, 13899, 4211, 44491, 76302, 111318, 44211, 38674, 20393, -9535, -410, -17815, 3067, -39407, 3952, 42640, 58624, 62934, 113668, 122466, 69217, 43465, 70265, -27194, -84966, -38252, 28049, 19727, -12639, 21289, 30189, -4448, -39080, -18716, -23081, -26708, -26720, -62323, 32332, 62587, 32650, -70516, -126496, -98829, -34010, 74868, 48356, -37937, -61124, -44378, 957, 12354, 18017, -4826, 35294, 32479, -7477, -43131, -48159, -84234, -81269, -37642, -42585, -80518, -126365, -138914, -85764, -23641, -1367, 33014, 28937, -10926, -36343, 22890, 94264, 21699, -7362, 74026, 133216, 122063, 38770, -55311, -63209, 17138, 73512, 116045, 80571, 4714, 5787, 28809, -10594, -58048, -124453, -90774]
17514i0774O6252L3713m190m6477o7125k4663k9964P8726Q8937K8814m5272q6546
17502i8569n6774K4222o388J8720O5187J6369K6037n494J8960k0714j4224M4406
17490A1738L0498l7080L3441j2555m3004l1337L7399l5991L2772L813j2575j3939
17478c6820k4879M353n3610K6448P5399J2099n0558P4680P6543l6285o0107n6520
17466d9257L3114N8750p9883l1292m3935p001L0745P3283L9114m8162j8322k0333
17454f3179K3261J4009K786K8133k3028K71j0123N8491O7271J06272J37861N9514
17442D01539K6556l3801k318p2247o7291m172L7349k4535m9845K3072l4434m2892
17430A56981q0216n6405J8351J05171r618k2239j035j5233k340o0208k2343j786
$$ y = [-90774, -24522, 9191, 5001, -41476, -108601, -133264, -163228, -84502, 4435, 33249, -12023, -98569, -155343, -131121, -137509, -118789, -53602, -37233, -11196, -16690, 2270, -18444, -32668, 11738, 42236, 5156, 38597, 26042, -16962, -48299, -10900, -46891, -14119, -10306, -22881, -36820, -61699, -57346, -110956, -84508, -9109, 2990, -47568, 27112, 103655, 67370, 7263, -49257, -16143, 42607, -37276, -68568, -112503, -119504, -88759, -15476, 23638, -24524, -42846, -63179, -39918, -25909, -23123, 5010, -18018, -17747, -27870, 30621, 97892, 204164, 342025, 401539, 428095, 394294, 391976, 319729, 252438, 248266, 285615, 261080, 211235, 234307, 199873, 156981, 76765, 20360, 38711, 143882, 134264, 112025, 110990, 95757, 93417, 33209, 10866, 9080]
17418I080n5079R914j7827N2887R919L4459j4949K600L6993K980R417J1810N0470
17405A42674j4189j06342q900n1425m5077J8323O4242n6492M2536p631J4188j3951
17393b2044k5867J4591K3375O8562J6904m5052o1834j618N0931j0372n3298J3303
17381c2419N817J9638L363j9353J3936O8243N3218K532n781m7032j20564j3450
17369g1852M4797j3737n1669k7033L5203N6016M4818l491L1296K2702K0825O4498
17357A52373J9690q0510j4475L0506j3792o3495P342J8132m5969J0409m8520o0127
17345h8436L7034L0247J1157k3460P5663Q6242K7312n4111n8804l8756l7066k6814
17333e9792o7251Q766P3082K7017J667M5375n3364p2957J7309J27264p373K5161
$$ y = [9080, -45999, -36085, -53912, -1025, 8894, 43353, 28404, 31004, 67997, 70977, 80394, 92204, 142674, 128485, 22143, 13243, -38182, -83259, -64936, -694, -57186, -14650, -22281, -8093, -22044, -47911, -33320, -9945, 58617, 75521, 30469, -31365, -32983, 17948, 7576, -45722, -32419, -26602, -6964, -3601, -22954, -9018, 59225, 112443, 114975, 109194, 62162, -58402, -71852, -27055, -40792, -92461, -119494, -84291, -28275, 16543, 13052, 44348, 67050, 87875, 152373, 172063, 91553, 77078, 107584, 93792, 30297, 37639, 55771, 9802, 20211, -28309, -88436, -51402, -21155, -9998, -33458, 42205, 128447, 155759, 101648, 42844, 4088, -32978, -59792, -127043, -118277, -45195, -18178, -16511, 28864, -24500, -97457, -80148, 47116, 39743, 64904]
17321F4904k7060m1523n557k1921j27865K5924Q9947k83j250j4243N3463M0522
17309C5058O6525K211m1100k4766m8908k1567P8920N6274j6296j0993j03021q7392
17297a15055M5037M7644L928K552L2657J6148N3553l5685J857L1369O719m9074
17285D1650O257J098m1789J438M567J7189j0405k6699k2972j998K874j3724M318
17272c8196M8928J7412j8105j9771k5457J0445p414R0735N5153n1278j8572M529
17260D8409m2329o0656o1137l2970O3690J05815K6351r388q0387m8922M4053j3855
17248f1326R17K4772n911l3502J8084j8081k547R1007L3832m6072n9264n2062
17236a10153k1875j1615k8391P8385Q5203J16687M3040q8062m341j3549p4079
$$ y = [64904, 37844, -3679, -9236, -31157, -159022, -133098, -43151, -43434, -44684, -58927, -5464, 35058, 101583, 103794, 62694, 37928, -10980, -32547, 46373, 102647, 86351, 75358, -27663, -115055, -70018, -22374, -18446, -15894, 16763, 32911, 86464, 50779, 52636, 84005, 90724, 41650, 47907, 49005, 7216, 8654, 13221, 30410, 20005, -6694, -29666, -31664, -28790, -42514, -38196, 10732, 28144, 10039, -9732, -35189, -24744, -32158, 58577, 113730, 62452, 43880, 48409, 6080, -54576, -115713, -148683, -84993, 20822, 47173, 37785, -42602, -91524, -47471, -61326, -60409, -35637, -41548, -75050, -56966, -75047, -77594, 13413, 47245, 1173, -58091, -110153, -132028, -143643, -172034, -93649, -8446, 108241, 151281, 63219, 58878, 45329, -28750]
17225b8750l9676M3850M9342l7985o3248m0226L0528k8148K4851l2014J8145M1015
17213f2316P8343q3624l7290L0510N415L9308q698R945l2982J2736K4971M1920
17201A8238r063Q073N9820j7898m1215m9942j8910O9519K2800J0886P4264j4204
17189A12368k4988m4900m3532q242n4598r0702n962M4824Q0941R217p774j4613
17177d7961M8005L8542J5017r040K0986O2826n4971j12636r3238j2916M7923J07952
17165A0489l1061m0894J5457L3895O3660L9582J2482l9130n3879l4936P936J0487
17153e912m1582m9757r810J04242K2312n0242o5868l9789N6425P7020k7018p0353
17141a00332L9069L0451K2724N1344N9754j7451o7867p0175k1860J3632M026J7133
$$ y = [-28750, -68426, -24576, 24766, -13219, -76467, -116693, -86165, -114313, -89462, -121476, -103331, -62316, 16027, -67597, -104887, -74377, -68962, -29654, -38352, -28407, -61389, -48653, -23682, 18238, 9175, 17248, 77068, 59170, 17955, -31987, -50897, 18622, 41422, 52308, 126572, 112368, 87380, 42480, -1052, -9294, -63892, -154594, -160556, -115732, -34791, -25574, -33348, -47961, 44, 38586, 53603, 44563, 65549, 128375, 73404, -39232, -132470, -145386, -97463, 10489, -20572, -61466, -46009, -12114, 51546, 91128, 103610, 64480, 10601, -24335, -16399, -5912, -47494, -97251, -107061, -2819, 19493, -30749, -96617, -136406, -79981, -2961, -29979, -100332, -61263, -30812, -8088, 43256, 103010, 85559, 17692, -52483, -74343, -60711, -56685, -39552]
17129c9552r209j1608n889O7453L5957n5526l1820k5469L0865J6673o824k2895
17117e7844k7572k9791l6554O819P2103K0026J0782P857p932R592O9913k7618
17105I781n8350O2184N948l6030J1158j0054o8790K0169j0865m0153O0349O4976
17093A0323n2631n4059m9406L2858J2054K2785l6314j7304M863L6809P5433O4194
17081D9605K5375O7609N0285J6876r1619q3312J4513O3258L2446l2989J1887l9847
17069H4087l0925p6182j2104Q631m4418n0187K2295M7183N5599j312n6051k2025
17057g5409J7218N7630K1390l7366O4888M8975n4090n2270k8169J32M9441N6830
17045F9200O769k3579o799l4298k3998K712J1482R3442m1363r5258k8204L6759
$$ y = [-39552, -48761, -60369, -66258, 1195, 37152, -18374, -50194, -75663, -44798, -28125, -34949, -57844, -85416, -115207, -151761, -144942, -72839, -52813, -42031, -34174, -42106, -32514, 37399, 9781, -48569, 13615, 19563, -16467, -5309, -15363, -84153, -63984, -74849, -115002, -54653, 10323, -42308, -96367, -145773, -112915, -100861, -78076, -114390, -131694, -126831, -90022, -14589, 49605, 74980, 142589, 192874, 209750, 118131, 34819, 49332, 112590, 145036, 112047, 123934, 84087, 53162, -23020, -35124, -26493, -70911, -121098, -98803, -51620, 3979, 2667, -53384, -75409, -58191, -561, 20829, -16537, 48351, 97326, 43236, -9034, -37203, -37071, 12370, 69200, 75969, 52390, 45591, 11293, -12705, -9993, 1489, 94931, 53568, -41690, -69894, -33135]
17033c3135j9997l4509j5171K9388L9060J31711J8121n2541j6493m7553P000k3359
17021a7478l683O1885M5582N6023J0523k0868m9841n8025r282o5431p190j1905
17009f9690O246n7621M2352L2246O2513O592j6698m8909k4568J3251m9540M893
16997i8933N3840L6377o875O0465N5713l1570o4000L9143L2722j17166m2530L1890
16985e0924J6964P1974N6682J296J8875j5904n5427j3573o97p0625K646L5833
16973b880j6080k452m2599m1457M0049J46829j5737p7732O1336J2957m330j7951
16961C9953p0581p6522j7957N1903L4440k9994k4892j8276J12829N0533O6857
16950A18293M9207O5297j7027q1887m4530j3492j0424l0063p1439l0129j2100
$$ y = [-33135, -53132, -87641, -102812, -73424, -34364, 97347, 115468, 62927, 46434, -1119, 5881, -17478, -21161, 40724, 86306, 142329, 152852, 131984, 82143, 24118, 14836, -50595, -57785, -69690, -63444, -121065, -78713, -46467, 16046, 22638, 5940, -42969, -67537, -54286, -103826, -98933, -45093, -8716, -15591, 44874, 100587, 69017, 5017, 44160, 76882, -40284, -82814, -50924, -33960, 38014, 94696, 95992, 114867, 98963, 43536, 29963, 29266, -41359, -38713, -2880, -18960, -21412, -64011, -105468, -65419, 81410, 65673, -12059, 49277, 62234, 57904, 39953, -30628, -107150, -125107, -73204, -38764, -68758, -93650, -111926, 903, 51436, 118293, 167500, 232797, 215770, 133883, 89353, 75861, 65437, 35374, -36065, -66194, -78294]
16939g8294K8437N0081L2102K6680K1161J7616k7561p64j878K4787j0882p3056
16927H429n8779L4520J3996l0643o9304J0786P8469l6092l9368L4136j4773k9285
16915i7908P6295J6934K1193K1020q293m0204j9912k1442j3283j9893M5124O8050
16903B7681L7569n7194p8145n6083N7080L9158m4340Q4043L7530m5031O943j8271
16891i060L6991M7041j4856L90n922j2198n8124j2081p6815L2754k2867r1031
16879a85778M7266R8201L5277l9993J8493M9488L6648R464k5652l4332o3395n5794
16867a10107J3622j1156p0573N7077M1233J1110K2160M6170L6862K6022j1121
16856E1299j6980k4153k1740J2863J5852J0061L5705k0627l2666o7520q2639M2722
$$ y = [-78294, -49857, 224, 32326, 59006, 80167, 97783, 70222, 69458, 67580, 92367, 81485, 8429, -50350, -15830, -1834, -32477, -101781, -90995, -12526, -48618, -87986, -53850, -68623, -97908, -21613, -4679, 16514, 37534, 29241, -10963, -30875, -52317, -65600, -85493, -40369, 27681, 65250, 8056, -70089, -126172, -69092, -29934, -74274, 9769, 47299, 2268, 9211, -9060, 27931, 74972, 60116, 60506, 54584, 42386, -15738, -27819, -104634, -71880, -94747, -185778, -138512, -40311, -5034, -45027, -26534, 22954, 59602, 69066, 43414, 9082, -54313, -110107, -96485, -107641, -178214, -121137, -79904, -68794, -46634, -464, 36398, 62420, 51299, 34319, 10166, -11574, 1289, 17141, 27202, 62907, 42280, 9614, -57906, -140545, -97823]
16844i7823K4145O1651L2949l042m2108j1612j8764l7335K3977K8222o19P023
16832c3336l4637k1283L2687M1094l3709q914n190k5090J8877k0154p0486M769
16820a55372J2804J734L8013k1730J644J4069K2223K3638L0568k3116L1429m259
16808b8355j7637K4806O9764L4563n3565j5207j7430j17586K2770P4745K2819
16797c13K2121n2458m7682J9581K6411J1403K4418J4010O2194k3601o2752m8122
16785e4790L4611Q4251j7725q1153l2598N7443M1233R663p9050m9211k5052OM6581
16772f5791K7741N5945k5503n6356k5537J0246L9096k2906l4740k9548N0861r906
16760h6398N6568j2758p2430n5271K057K1361M3909N7227N4323P8927j1838r9431
$$ y = [-97823, -73678, -12027, 20922, 17880, -24228, -35840, -54604, -91939, -67962, -39740, -40359, -33336, -67973, -89256, -56569, -15475, -49184, -58098, -63288, -88378, -69501, -89655, -160141, -155372, -142568, -140834, -102821, -124551, -122907, -108838, -86615, -62977, -32409, -55525, -24096, -28355, -45992, -21186, 48578, 83141, 29576, 14369, -3061, -120647, -97877, -23132, -313, 21808, -30650, -78332, -58751, -32340, -20937, 3481, 17491, 79685, 56084, -6668, -54790, -20179, 64072, 46347, -34806, -67404, -9961, 31272, 40935, -38115, -87326, -112378, -112372, -65791, -38050, 17895, -7608, -63964, -89501, -79255, -40159, -63065, -97805, -127353, -76492, -86398, -29830, -42588, -115018, -170289, -168232, -146871, -102962, -45735, 8588, 87515, 75677, -23754]
16748b3754n7373L3751j8012L9502o006m9562N8430N3877M2914j6189J2228k441
16736F7365J3517q7891j724Q1902M8474l7335J8373j2903p1234r0242n0915P1542
16724e1071Q8832M293p996P439K6107l837l5531k1973l9547J3264N3894k6165
16712G709r1570J566P2430K2184p0376m955j6140N0592O4038j065l8121m1338
16700d5046J4680O3163L8219M5484q794r6446j3384m8539K5192N2922K0639J4079
16688F2169j0123j0534o2311Q809R1p2756k6943M5022j6397J8747N2956L4453
16676B3183J3916j271o0959J1749R828j4887l7721k7564R645L8592m3432M9701
16664b9220J25225M8560r1645q5734K0706K086m8857J2341J7248O9159n3559k3268
$$ y = [-23754, -81127, -47376, -65388, -25886, -31892, -81454, -23024, 30853, 73767, 57578, 69806, 67365, 80882, -7009, -8733, 73169, 121643, 84308, 102681, 89778, 18544, -71698, -122613, -51071, 37761, 42054, 34058, 41497, 67604, 63767, 28236, 6263, -33284, -20020, 33874, 7709, -83861, -82295, -9865, 12319, -58057, -63012, -79152, -28560, 35478, 34413, -3708, -45046, -30366, 32797, 71016, 116500, 107706, 11260, -2124, -50663, -25471, 27451, 48090, 62169, 52046, 41512, -20799, -11990, -11899, -84655, -111598, -66576, -82973, -64226, -11270, 23183, 37099, 35828, -25131, -13382, -3554, -18441, -56162, -83726, -74081, -35489, -78921, -29220, 96005, 144565, 52920, -32814, -12108, -10022, -58879, -46538, -29290, 39869, -13690, -36958]
16652c6958k1956m3850P358l814J8416K2513M6292m875k1470k7136K4774K4195
16640a6511K8553q7167p9801M2944N3167l6172L3237k026L610L7361L804J7732
16628a269M8755l5684J036P1522P7532l9308o5505k6926j2938l4934m6064L8988
16616b4795R5057L412o7049l181j0069l0450o7169P840N2836J7392J9423l909
16604a0662k4784m0896m9209M7833M3496l4974J12053K8044n1238r0287k0071
16593i0695K1312N1211O0580K8190N2940k9320q6140n4582l5364L2976L0246J0497
16581h149n5528M6762J3079n5143L3133L8254O1795J0779p207m4787n0904k9238
16569d7154m7780j9224J908J1164Q344M3506Q1690l4138j3149K7052L0143Q483
$$ y = [-36958, -58914, -102764, -95406, -99220, -80804, -58291, -11999, -16874, -38344, -65480, -40706, -16511, 12042, -75125, -154926, -111982, -58815, -94987, -61750, -63776, -60166, -22805, -19001, -1269, 47486, 11802, 12838, 84360, 161892, 122584, 57079, 30153, 17215, -17719, -63783, -24795, 70262, 73674, 6625, 3444, -6625, -37075, -104244, -96404, -43568, -26176, -6753, -10662, -35446, -76342, -125551, -77718, -34222, -69196, 42857, 70901, 19663, -70624, -90695, -69383, -18172, 42408, 70598, 123538, 94218, 8078, -46504, -81868, -48892, -18646, -8149, -63677, -16915, -3836, -58979, -25846, 12408, 74203, 84982, 77775, 32988, -17916, -47154, -94934, -114158, -112250, -101086, -92742, -49236, 32454, -1684, -14833, 12219, 42362, 50845]
16557E0845k9326j6423j807n1275m1240p214J3341M6096j5372o0713j2053N5230
16545f9911L677l7216L6266R6228M4421k1511k8665j7073j2237o6622o4916R6120
16533d1439Q5332J9180L1704m768n9799k7185K0039O2733J3499k0037J5188J4608
16521A09055R674k5453l7011K6092k6332M7073m5243p2620k323k8780J0183O1446
16509B5761j496m7695O0089m8424p5207k7166k1487R0652J07503l6271p754j1726
16497F779j1721J3237N8055m3802o9188M1218M7076J87p217j9883j469Q509J035
16484B2816k8838M2678O917K6640J5740k9148j1699P47L2414R573p0994j02596
16472h5750j1697M7657O2977J1102m0285j1482L089J4766k8475o0837K1588P2886
$$ y = [50845, 21519, 5096, 3289, -47986, -89226, -96440, -83099, -37003, -52375, -113088, -125141, -69911, -66234, -103450, -67184, 29044, 73465, 51954, 23289, 6216, -6021, -72643, -137559, -41439, 43893, 63073, 94777, 90009, 30210, 3025, 23064, 85797, 99296, 79259, 94447, 109055, 118729, 93276, 56265, 82357, 56025, 103098, 57855, -14765, -17088, -45868, -35685, 25761, 24265, -23430, 36659, -11765, -86972, -114138, -135625, -44973, 62530, 26259, 18505, 6779, -4942, 8295, 66350, 22548, -46640, -5422, 41654, 41841, 34624, 14741, 13272, 21781, 22816, -6022, 36656, 43573, 70213, 85953, 56805, 45106, 45853, 78267, 87840, 16846, -85750, -97447, -49790, 13187, 24289, -15996, -27478, -24389, -9623, -38098, -98935, -77347, -4461]
16460d461j121j7167K5452k1393J509o772R847l563j3093l0300L1702k7202K4623
16447c1939L990Q757N6184l911k1460n0481o1653K1626P5526N579N0051J241n2905
16434F05J5344j2578p2656Q6440J6378o7770j6511l3807Q412P6288K9615j6094
16422A3666m6767M417M9007N5855J959m1058Q805k6438l1304j8090O412m0211
16410f3747q923M3181m1784k4700M4734j4692P251m8778P575J5122K6742L543
16398e4476L9059R0114Q648m0183m3367o0091J0106P2633J6138k2800q8462k6640
16386i9321N1469K7779j6207N0704o601J7851M6855j4289K3013M545l7623J0025
16374E8200L3139K1471O667l4636n1831o3234n281l804P9951M5278p4212L40K5452
$$ y = [-4461, -5582, -22749, 2703, -18690, -17181, -23953, -14106, -17669, -30762, -61062, -29360, -56562, -31939, -27949, -19192, 36992, 33081, 11621, -38860, -100513, -78887, -3361, 2218, 52269, 53510, 605, 15949, 3371, -69285, 17155, 33533, -34237, -50748, -84555, -76143, 145, 29760, 13666, -33101, -28684, 20323, 76178, 78137, 37079, 45884, 19446, -11858, -29948, -23536, -63747, -72670, -29489, -71273, -95973, -51239, -65931, -58680, -107458, -99883, -84761, -58019, -54476, -15417, 74697, 83345, 43162, -205, -60296, -50190, 22443, 38581, 15781, -72681, -99321, -47852, -20073, -36280, 14424, 7823, 25674, 72529, 58240, 81253, 85798, 48175, 58200, 91339, 112810, 119477, 84841, 33010, -30224, -35505, -39309, 40642, 85920, 11708, 12048, 37500]
16361C7500J8469m5224N496o5036m1105J3167j1711J0006J2080M8170j5489K0476
16349a3201J3833L3574j8545r55M3760m7766n9639K7081K2102m2930q5185J4813
16337a13058K0495L650J9552P4178N0547J4355K4085k7007j7132j6655O178o7728
16325b8540k7053j5967p841Q4370m910J6492P5471O9817j706m6164q619m8998
16313E6352j27608k105Q6549j3601l2285k1479l4990J7279k8909k9818M8442K7754
16301e4419K3708P3476q185j8768q768L604p426Q3214l4389o1121j3304k8930
16289e1308n5652m0488K2241J3411N4261q433r4620L2173L3354N1355J4597k6937
16277e6046N5264k5859o7840n0190N955K8735K0076k473k4124J0091J9170K3785
$$ y = [37500, 55969, 10745, 16241, -48795, -89900, -76733, -88444, -78438, -66358, -18188, -33677, -13201, 632, 34206, 15661, 14706, 58466, 10700, -48939, -21858, 244, -42686, -127871, -113058, -92563, -88913, -69361, 4817, 55364, 69719, 93804, 66797, 49665, 33010, 39188, -28540, -55593, -71560, -79401, 4969, 59, 16551, 92022, 161839, 160133, 113969, 105350, 56352, -71256, -73361, 13188, -413, -32698, -54177, -89167, -71888, -100797, -130615, -82173, -54419, -30711, 42765, 34580, 15812, 7044, 10648, 3222, 86436, 52047, -9074, -22378, -51308, -106960, -147448, -125207, -111796, -57535, -65968, -160588, -128415, -95061, -43706, -29109, -56046, -782, -26641, -94481, -144671, -138716, -109981, -89905, -92378, -116502, -106411, -87241, -63456]
16265f3456M5936p722m2959M8412L6138l1871J9089L8960M1868k9053m9507p0707
16253f4872l518M1506p2785J6840J18606L116l2833N6096j5047p7313M6062N3328
16241F9186J7321l7461m6120K149K6274L2753l0345J2775R829k7231N1682J041
16229H1853J498j0685m034j2327o9243n986J8935N9756N007k4327n3651J7761
16217D557J4995n2292j911k7402M8072M1200K8786l2745O4810N2243j1864j3325
16205A15124j6391n1029q2435j4968J50980K2391p8214k5566j6857M339P1845
16194G9219M9707M3046k4068k2509j0523K9899r237o2285o6096J9765L5377J9144
16182H1439n9611L0702m5991l6477O2651j5411k7724o0910j9818J8591j9969L289
$$ y = [-63456, -17520, -25242, -68201, -19789, 16349, -15522, 3567, 42527, 84395, 55342, 5835, -64872, -68390, -26884, -99669, -82829, 35777, 38893, 6060, 62156, 47109, -30204, 15858, 69186, 86507, 49046, 2926, 5075, 31349, 64102, 33757, 46532, 56361, 29130, 80812, 81853, 83351, 72666, 68632, 56305, -12938, -18924, 11, 59767, 64774, 40447, -13204, 4557, 19552, -32740, -34651, -62053, -13981, 27219, 56005, 23260, 88070, 140313, 128449, 115124, 98733, 47704, -34731, -49699, 101281, 123672, 45458, 19892, 3035, 7374, 79219, 128926, 171972, 147904, 125395, 114872, 144771, 135534, 73249, 7153, 26918, 62295, 81439, 21828, 52530, 6539, -29938, 32713, 17302, -10422, -71332, -91150, -72559, -92528, -89239]
16170h9239r749l8035L2537K6010J8078K5808j0826m9410O120j6287l0993P7908
16158e8078J8293J273n3244L6724M3454J4731k9132J2814J3879M7328R679J459
16146E9180m5367l0488l8155o47N4423M3305N506k5911o3698j9707p356L6721
16134c2194P3308J0048J3382q4619L9592L6224l114K1978J4680o6080j1107N7374
16122F9472K4970r3403m541k8840m5947J1602Q7105n3631k9911N6308l5850q7083
16110a29749L1610J03284J0877n7789K4449M029K6705K7296k456J5034R919P191
16098G0400K0011k8197r03j5728m3436P975P78m72m0057J5449N9992k9382O7196
16085H3626l9346k095L5697j818q5046j678P4908O7733J2040J8218L5380Q854
$$ y = [-89239, -98988, -137023, -104486, -78476, -60398, -34590, -45416, -94826, -88706, -104993, -135986, -58078, -39785, -38512, -91756, -55032, -11578, 3153, -25979, -13165, 714, 48042, 57721, 59180, 13813, -16675, -54830, -55477, -1054, 42251, 47757, 21846, -41852, -61559, -68915, -32194, 41114, 51162, 64544, -20075, 19517, 55741, 52627, 74605, 89285, 23205, 12098, 69472, 94442, 1039, -3502, -32342, -78289, -66687, 20418, -33213, -63124, -6816, -42666, -129749, -98139, 5145, 16022, -41767, -17318, -13289, 13416, 40712, 38256, 53290, 63209, 70400, 90411, 62214, 61311, 45583, 2147, 10122, 10900, 10428, -29629, -14180, 45812, 16430, 83626, 44280, 42185, 77882, 76064, -8982, -10660, 64248, 131981, 144021, 162239, 197619, 206473]
16073B06473j16701j08324j3801R366q0852n5815P8551j1068L3079L7341k7841
16062d9592J4328J7559r99L6287K8722O8389J1881o207j2066l4033k3887n8335
16050g953l5458J4735q805L8242P5852J9987K5467o3321n901j8096k7465l8361
16038c1077n280N1559j3789o5797J3314M7434J3434k9907R995n8073p7101R509
16026a35779P2246P0875M4774L7620o3471L90M8671K1819J0370p9223q4957K2224
16014c4441k7452n2850m1309o228J3878J9752J6581k2613l1093J6414j6664K3930
16002a42095N3765l8125K4199p130K5961P8657M1612J9609L0609k8570n1726O2367
15990F9133M4334m9493P718l2259j9770L0509K5628m4948n8811P940P638M7198
$$ y = [206473, 89772, -18552, -32353, -22987, -103839, -159654, -81103, -92171, -59092, -21751, -49592, -35264, -17705, -18704, 17583, 46305, 114694, 126575, 120368, 108302, 74269, 50382, -7953, -43411, -28676, -37481, 761, 76613, 96600, 122067, 58746, 52845, 34749, 7284, -31077, -36357, 15202, 1413, -64384, -51070, -3636, 9798, -20109, -10114, -68187, -145288, -135779, -63533, 7342, 52116, 89736, 26265, 26655, 75326, 97145, 107515, 28292, -56665, -34441, -61893, -114743, -156052, -162280, -148402, -128650, -112069, -134682, -165775, -149361, -166025, -142095, -88330, -126455, -102256, -109386, -83425, -4768, 36844, 56453, 87062, 58492, 6766, 69133, 113467, 63974, 71692, 39433, 19663, 50172, 75800, 30852, -27959, -20019, -12381, 34817]
15978C4817P599L427q678L6051J2510L5168J0178j4528Q40l3644J3141l2187k8229
15965C6465P254j8433J0292o9877K5135M7587O4249p377m1620n7049l6802j3473
15953e3649K4266K2905j4637l5215k8386l8551j950J6184J8887Q8028o062k3405
15941c1585o6956J5140K2140k6494J5624M2763m965j9731O6084p820M4229J6368
15929F4797R126q0209p0190L4708J8591k1659m706L1021J3761M324P364j111L2083
15916C7900K3002k8395n5999l3217M4099M717N393l6508k2791J8018K2935q3929
15904a04775J8310N6441N3175K9719O553p225M438p4640k9287j1707n787N5185
15892i600k4910m331P8089J4329r6390k8374o050k981M1814j0381M441o101O4240
$$ y = [34817, 42416, 45843, 37165, 73216, 85726, 120894, 131072, 116544, 117384, 83740, 96881, 64694, 36465, 43719, 25286, 35578, -34299, -9164, 38423, 102672, 95295, 53675, -3374, -40176, -53649, -29383, -6478, -21115, -56330, -84716, -123267, -125217, -109033, -90146, -2118, -8180, -31585, -98541, -83401, -61261, -87755, -72131, -29368, -34333, -54064, 12020, 4200, 48429, 64797, 73923, -6286, -76476, -41768, -23177, -44836, -49542, -18521, -4760, -436, 6928, 5817, 37900, 60902, 32507, -23492, -56709, -12610, -7893, -2500, -39008, -61799, -43781, -20846, -104775, -86465, -30024, 23151, 52870, 59423, 52198, 56636, -18004, -47291, -58998, -64785, -9600, -34510, -38841, 39248, 53577, -42813, -71187, -77237, -80218, -38404, -48785, -44344, -50445, 13795]
15879A3795M1499J4583j5293q0989j2747K1484j8014J5853L7213k7820r468n664
15867b5568L1566N6680J1756q865j8883l0168r0232J6781J630L6070k6375L878
15855d1730j5141L0027O9756K9143j02761n0837K3552N9617l3669L7102Q7341
15844I2400n1189m0256N5030N285k8001n9450J0254N825o922P8735k6740o4098
15832b9127O6963K9931j5820K360J6527m2952M4733L8249q07n7252l9208m3046
15820b9449m2249j2396J5597M4317O3845q1740n9759K7480K3416K4947o0955N2270
15808c4676L7848L9307m3176k0332J2924N1991m8842L107P8225M723o6286j196
15796A3617K0254K9280K2852l8042k6432j6170j16334J2788N5131L487k6905j082
$$ y = [13795, 55294, 69877, 54584, -26405, -39152, -17668, -35682, -19829, 17384, -10436, -19904, -25568, 5998, 62678, 74434, 65569, 46686, 16518, -73714, -56933, -55303, -19233, -45608, -41730, -56871, -26844, 42912, 72055, -30706, -81543, -57991, 1626, -32043, 5059, 92400, 41211, 955, 55985, 61270, 33269, -26181, -15927, -10102, -17024, 61711, 34971, -29127, 37836, 67767, 51947, 54307, 70834, 27882, 72615, 110864, 110057, 52805, 13597, -29449, -71698, -84094, -68497, -24180, 39665, -42075, -101834, -74354, -50938, -25991, -86946, -34676, 3172, 42479, -697, -21029, -8105, 43886, -4956, -1849, 76376, 81099, 14813, 13617, 33871, 63151, 86003, 47961, 21529, 5359, -110975, -98187, -43056, -39569, -66474, -67556]
15784f7556P810j2403O818M6450o4k6487k228k070M407M5973O797j9638p1699
15771h3890l6113L5684J6880K3919n172N6806k0822m5190m092M3847L9508M0198
15759F1563O3309p2103m5684m0722j0533j1885J4156N5923j038L3199j9587m3261
15747a6663l3757M5670N5822K3713M4933n8475J1972M3099L921J6946n3002l5118
15735D9061j6602O463Q114l9090j637l2561L7068N0055J252q299m3335n5544K370
15722d2685N9890j2241l8145m7949n245O7465L8992o0670k6795k2798L8413P853
15710d3915l6400m9103l3597j0505J09829J11436J420q2646l5916K7555l2195
15699g4037k7449k405K9351Q006N0918K3569l923o9248n6394j9474Q7004Q2866
$$ y = [-67556, -59746, -72149, -65331, -18881, -18945, -45432, -47660, -49730, -45323, 650, 7447, -12191, -83890, -120003, -84319, -67439, -43520, -48692, 8114, -12708, -57898, -61990, -18143, 21365, 61563, 124872, 52769, 7085, -33637, -44170, -56055, -41899, 14024, 12986, 46185, 26598, -16663, -50420, -4750, 51072, 74785, 119718, 61243, 73215, 116314, 120235, 137181, 84179, 49061, 32459, 38922, 47036, 7946, 6309, -26252, 10816, 60871, 62123, 53824, 10489, -45055, -42685, 17205, 4964, -33181, -81130, -86375, -18910, 20082, -40588, -67383, -90181, -51768, -43915, -80315, -129418, -163015, -173520, -63691, 47745, 49165, -33481, -69397, -41842, -74037, -101486, -103891, -74540, -66534, -15616, 7953, 4030, -65218, -121612, -141086, -54082, 28784]
15687B8784K5561M3534j1812m2875m2741j17431q2666j1257P9021R8871P4702
15676D1691n337n4554k1977k6546P6587P9349p012l6061M3054n6175n5046P3046
15664E1019N2976j8578o6929l4643M5384j9994l9226O463m2665J0085J754l2458
15652h6812n1328L3846J00600M8876J5333Q1114M7196n9788j16864k1972j2753
15641b2552l5795j6540N8687K9932n6256k4499m1860m9964J4680J15857M967L3617
15629A0274K2964o8573L461J1688m932j676J8586k0583l3345m1179k4226J15374
15617a2167M3213K5934K589j2028p466K6811p197k857K057k3367j1161j6319j6806
15604h764j5054o5246p2465O9569P5299j181P8988L8399k3624k1877p827j1663
$$ y = [28784, 54345, 97879, 86067, 43192, 451, -116980, -199646, -210903, -131882, -33011, 41691, 36354, -18200, -40177, -66723, 9864, 89213, 82201, 46140, 89194, 33019, -22027, 51019, 103995, 85417, 18488, -16155, 29229, 9235, -29991, -23528, -66193, -56108, -54354, -86812, -138140, -104294, -3694, 45182, 60515, 141629, 188825, 129037, 12173, -9799, -22552, -58347, -74887, -16200, 13732, -42524, -67023, -108883, -158847, -144167, -28310, -23343, 10274, 33238, -35335, -31874, -20186, -25118, -26794, -8208, -28791, -62136, -103315, -127541, -12167, 31046, 56980, 59569, 47541, 40075, 66886, 59689, 56832, 58889, 35522, 24361, 8042, -8764, -23818, -89064, -161529, -91960, -16661, -17842, 61146, 99545, 75921, 54044, 46217, 34554]
15592C4554K5794n3218r0112J7457M6524j4612Q3762O3965l7726m5381M9917M8964
15580A29888J9025j1463K0268k378j02876m0123J4255l428j7506k0806k6107J6794
15568b4457M6605K6263q549m6113J3775j8353m2637K3048K0448L5708K5321L4715
15556H5774J3420M1001o9601j7408O4484m2806o2063k7084J2159N0253k4454n1703
15544b8028j5181L2731m042R745m6148o87J6427K8865K1240m8978k5859M983M2782
15531a2150j2814m6430M339l2694M329J0315K3724K1234p32r40o822k866m741
15518e6248J4446n2583q801J9702M8386P9171l3299n864k3685o979M2350l1898
15506a5302n4539k1161M9967L7737l0818o0936K051K7430O5020K8615L8050p8300
$$ y = [34554, 60348, 7130, -82982, -65525, -19001, -33613, 50149, 114114, 76388, 31007, 80924, 129888, 148913, 137450, 157718, 155340, 52464, 12341, 26596, 23168, 5662, -15144, -41251, -24457, 22148, 48411, 39862, -6251, 7524, -10829, -53466, -30418, -9970, 25738, 51059, 85774, 99194, 140195, 70594, 53186, 117670, 74864, 12801, -14283, -2124, 48129, 23675, -28028, -43209, -10478, -14520, -4775, -50923, -51610, -35183, -6318, 14922, -34056, -59915, -54932, -12150, -24964, -71394, -67055, -99749, -95420, -85105, -61381, -40147, -40879, -41819, -48641, -51507, -56248, -41802, -94385, -103186, -83484, -35098, 44073, 10774, 4910, -18775, -25754, 16596, -15302, -69841, -91002, -41035, -3298, -34116, -95052, -93001, -65571, -551, 28064, 66114, -12186]
15494a2186j20896J2689N7412J10418J2326o7172O0243M1342J0084l3185q9031
15483a7956n6796K544L3294K4212M5343O2141n2109L124O888J3008K0795j5521
15471F8967m2904m6295P764j4213j1889K4950l2275P4871N2468o5967n370P7050
15459H7157K6923r1955l0566K665M2073L820p376p2904n8562m918J02566M1153
15447D0076n3411N373K8478O0425j6226l3461p7673K5353j318J5480Q13k5375
15435c1466M8189L555l56j2437j390k138L3656o0404o2646Q208j0232l7295K0627
15422a04129J7296N4554K6624j1736N0859O6618l6002p0308m6427M5617O2568
15411E5534N4475K2784J2980o0935L426J6475M008j4707Q675J4260m2968j07634
$$ y = [-12186, -133082, -120393, -62981, 47437, 59763, -7409, 52834, 94176, 104260, 71075, -17956, -74752, -72208, -38914, -14702, 30641, 92782, 40673, 43797, 50685, 63693, 84488, 68967, 26063, -20232, -12468, -26681, -38570, -13620, -45895, 28976, 81444, 15477, 10107, 87157, 114080, 22125, -8441, -5776, 36297, 40117, 32741, -40163, -98725, -103643, -1077, 40076, -13335, -7962, 20516, 80941, 64715, 31254, -46419, -21066, -22384, -6904, -6091, -31466, 16723, 20278, 19922, 7485, 6095, 3957, 37613, -22791, -85437, -77229, -87461, -124756, -104129, -86833, -32279, -5655, -17391, 33468, 100086, 64084, -6224, -52651, -7034, 55534, 110009, 132793, 145773, 84838, 88264, 104739, 108747, 94040, 102715, 116975, 74007, -33627]
15399c3627p3340n701L6103M5053n0963p205K7358M5004O834l8132J7042J7043
15387a4531L2893l66R982l3398k3046L2169L9026q3526l5012L3248M1055Q1033
15375G9527O172k4580m9442k5923L0808Q274N899M9581j2425j6481m7351o9182
15363f5123O9918N7880j2470N69O487k5663M6041L5362R105o1767l0601l966m2044
15350a6272m787N021j3315M2149J20157l0429l1418r2205m2352L4748l6106k0924
15338h5733O5777L8634m8046p0152K5682k3693N9671N7561k7884L8069M0193n3516
15326A6563j2192j2406o1253l251M9512k6956n9105N6214J16891K2753r2196k7842
15314c3268O98j7338J0425j2785L7841O7117N1657J5222K7757k9855n4314r7005
$$ y = [-33627, -106967, -112668, -76565, -31512, -82475, -89680, -62322, -17318, -10484, -48616, -31574, -14531, 18362, 17996, 27978, -5420, -28466, 3703, 42729, -40797, -75809, -42561, -1506, 79527, 85699, 61119, 11677, -14246, 16562, 24836, 30735, 80316, 67891, 51410, 4059, -65123, 4795, 62675, 50205, 50774, 57261, 31598, 77639, 113001, 122106, 60339, 29738, 25772, -16272, -21059, -16038, -29353, 12796, 132953, 102524, 71106, -21099, -63451, -28703, -64809, -85733, -19956, 18678, -29368, -99520, -73838, -97531, -37860, 19701, -8183, 29886, 70079, 16563, 4371, -8035, -69288, -72539, -23027, -49983, -109088, -52874, 64017, 86770, -5426, -33268, -32570, -49908, -39483, -52268, -14427, 52690, 104347, 119569, 147326, 117471, 63157, -33848]
15302c3848K219L5337M6778Q0477p4139o563M1078j8971J1269J6719r77j8463
15290H0916j8284J6577J9404p5910p2197J581J0710L8448L9323K6937O1729N767
15278A35001o7135l4449j8419n378K0187O5162J5914k8350J1288l549m8270j021
15266D0981j6200o7862N6122K5587m3657L7586K8192j0169k971o0063k6510J5168
15254b3796j356L09l208j7587j4807K2155l5192j1306L3223N4228n182M0854J4939
15241E3274K8789k9694p1902J6196q266L178M6642N0194R552o0181l3132J9185
15229B3835J02364K5125o9526j9398l3751l4530K9032L9919k3742q7432K6973
15218b1131N130J7653L0072j6633m2821l8040n8174l758J04139j3821L12K4094
$$ y = [-33848, -31629, 3708, 50486, 130963, 56824, 50261, 91339, 72368, 83637, 100356, 99379, 80916, 62632, 79209, 98613, 22703, -49494, -47913, -37203, 1245, 40568, 67505, 129234, 135001, 67866, 33417, 14998, 9620, 29807, 94969, 110883, 82533, 93821, 90272, 42002, 40981, 24781, -43081, 13041, 38628, -5029, 32557, 60749, 50580, 47609, -12454, -38964, -23796, -25152, -24843, -28051, -45638, -60445, -38290, -73482, -84788, -51565, 2663, -2519, 38335, 53274, 82063, 52369, -19533, -3337, -11603, -8425, 38217, 88411, 97963, 37782, 4650, 23835, 126199, 151324, 81798, 62400, 28649, -5881, 23151, 63070, 39328, -48104, -21131, -16001, 1652, 31724, 15091, -27730, -65770, -123944, -127702, -23563, -37384, -37072, -12978]
15206a2978j2723m0572k3964O0727J0703J932r334N9115O3424o4805m0708q185
15194a7368j8190L1581Q5392l4093k0298p4234k8329l491l6334L8215M1806o5802
15182a01145J7453K5128M4805j0191j2570l6297M768k0969J1683K4150M1882L0875
15170A9572J2115l8209k3449n3756k2552j3572J4505N2780k0735N3593Q1303j2572
15158D9023l7489m1881M2439j3260M8924P397l4711o408k629J9817n0190Q60j5172
15145c3280m8299n481J0431n563L2246J08846K4682o7846k6183L6753N92k3323
15133C575J9746L2568N5586Q942m6652K3469P474p2388q876m7755K2434K5464
15121B3587J3391k0917L8647j9028l8856J693M9072r399K9619P314m3890n9603
$$ y = [-12978, -25701, -66273, -90237, -29510, -18807, -16875, -26209, 32906, 96330, 31525, -9183, -17368, -35558, -3977, 81415, 47322, 27024, -47210, -75539, -79030, -115364, -77149, -35343, -101145, -83692, -58564, -13759, -23950, -36520, -72817, -68049, -89018, -77335, -53185, -11303, 19572, 31687, -6522, -29971, -83727, -106279, -119851, -105346, -52566, -73301, -19708, 61595, 49023, 11534, -30347, 12092, -1168, 47756, 55153, 20442, 14034, 11405, 31222, -18968, -18108, -33280, -81579, -87060, -76629, -82192, -49946, 58900, 83582, 15736, -10447, 26306, 26898, 3575, 23321, 55889, 111475, 120417, 73765, 97234, 104708, 32320, 23444, -24311, -1877, 23587, 36978, 16061, 54708, 35680, -3176, -1483, 47589, 38190, 67809, 75123, 31233, -28370]
15109b8370l6609M8286k9089n838O1515J9602N0634k9105l2324N820o0898j6220
15097e2596J05821l4396o9949K2089k8000L8682P8656L0160l3424o7784K7565
15086A6824k7460o9737k0373O4515L0435J0282m4243r184k9400N4136P1881J4050
15074F1726o4166j39J8767J02377m291l9355J3539J0195L6541k9199n3163L19
15062E3151k372l9430M659M1225L6786L9721k2392n9728l0130N01o495j0700L5930
15049D0726J6159j4271k9661m7606J1825K0372P929k3430J8669J5220n2938m8181
15037h5187L0888K1155K7467k8834J096m2260j0684j8142L986P6502M9718l5517
15025i812l5397L0446N7357L3793j8443j8559j7974j6855L633Q336R30Q6451r652
$$ y = [-28370, -64979, -16693, -45782, -51620, 9895, 29497, 80131, 51026, 18702, 24522, -36376, -52596, 53225, 18829, -51120, -29031, -57031, -18349, 60307, 90467, 57043, -10741, 16824, -10636, -80373, -100746, -36231, -5796, 4486, -39757, -48941, -78341, -24205, 47676, 61726, -2440, -2579, 16188, 118565, 114274, 74919, 88458, 98653, 135194, 105995, 52832, 53151, 50779, 11349, 16008, 57233, 94019, 133740, 111348, 51620, 21490, 21991, 15496, 4796, 40726, 56885, 42614, 12953, -34653, -22828, -2456, 5473, -17957, 712, 15932, -37006, -85187, -54299, -33144, -5677, -34511, -33415, -75675, -86359, -104501, -100515, -24013, 25705, -9812, -45209, -14763, 42594, 76387, 57944, 39385, 21411, 4556, 8189, 16525, 17455, 103906, 94254]
15012I4254j9556o9589J971L6419j3799r599Q675m4750j6803k597K4390O025J1237
14999F278M953m9933M646L3204j0191k0303K1798K2807P4861j3247q2187J0084
14987B770J2747j2111p210n1155J509M447N9908J2349j0166N6723j1089q3705
14975b4983j837M5730M5915k2320l0275n2606K9278M8746R883k6876K0619N2908
14963I4182J0337m3696k091q398o0518r502K2041j8833M4072J3007J2039N7854
14951A10494l9076j9570K2378j6698J3570K0928p322j6178q786L9578p4722l2696
14939h100O1137n9690n700Q924O8205O033k4580N1533r600l6775m6465N2601L3458
14926I0981k5726p288q850M428J5627L3915L0743l372p6961o5466Q896K7841M7329
$$ y = [94254, 74698, 5109, 7080, 43499, 29700, 20101, 28776, -15974, -32777, -35374, -10984, -4959, 6278, 11231, -38702, -34056, -852, -11043, -31346, -9548, 13259, 88120, 74873, -7314, 2770, 15517, 3406, -3804, -54959, -53450, -49003, 10905, 23254, 13088, 69811, 58722, -24983, -26820, 18910, 64825, 42505, 12230, -40376, -11098, 37648, 47531, 20655, 41274, 94182, 104519, 60823, 58732, 50334, -10184, -19686, 2355, -16478, 27594, 40601, 52640, 110494, 71418, 51848, 74226, 57528, 71098, 92026, 84704, 68526, 59740, 99318, 24596, -8100, 53037, -6653, -12353, -3429, 64776, 70809, 46229, 97762, 88162, 51387, 4922, 57523, 90981, 65255, 57967, 49117, 53545, 69172, 103087, 133830, 130458, 53497, -11969, -3073, 24768, 72097]
14913G2097j2792J144j8684p4125j9826j5934l2186M81l774M1047k4945J6289
14901g1208J9527N8440L2024J990m0886L5037N3310p152j12403l6913R5022m8109
14889b1321q7029j922M9654N1127N8787q808j6156Q993k9276l9906q17L5450K9369
14876B8145k882j5692j4302N4614l3390l121L6800L4941m8490k6463r004K3436
14864B4592L9839n3502M5023L6421K7761p293r1933J5176N6250k7185m9478l3468
14852a7797j2413O3250l1591n6024m7887l2172K7827N4649L9437N3170L7844k2995
14840E5298o171L984P056J1440l0959m2200Q074J04670j8146o933n9887j13746
14828h7520M740M0572R3973K7069o487m6847j3557K1231O966k0716p8524M1506
$$ y = [72097, 59305, 60449, 41765, -32360, -52186, -68120, -100306, -99825, -103599, -62552, -87497, -71208, -51681, 6759, 38783, 40773, -113, 34924, 88234, 81082, -31321, -68234, 26788, -21321, -108350, -110272, -60618, -9491, 49296, 40488, 24332, 33325, 4049, -35857, -36674, -1224, 28145, 25263, 9571, -4731, 49883, 16493, 13372, 50172, 85113, 36623, 10160, 1156, 24592, 64431, 10929, 55952, 92373, 120134, 112841, 20908, 36084, 92334, 65149, 15671, -17797, -30210, 33040, 1449, -54575, -102462, -134634, -106807, -52158, -12721, 40449, 78293, 55298, 49127, 53111, 60167, 71607, 40648, -1552, 6522, 111192, 93046, 86113, 26226, -87520, -82780, -42208, 51765, 78834, 72347, 25500, 11943, 33174, 40140, 19424, -59100, -17594]
14816a7594O3232k4454p7413J4517K6619o6470J3928J10701L0817m804q8531j04353
14804a23805k1759L4018O7263J7553N9823J9834j7923k8857J0418R1351l7203
14793G0713L531o2302o7794j6366N1166l2528J5543M3339j8166M1089P0083k268
14781I6040k8799K7039m629l1909J1958l42o976j3066k0081m0427m0532l0109
14769h1833L8527J8413N26r80k7600p7283j1836Q7008N3008O7649P6088k3475
14757A18212m8133o234r817L9913J0993p1884k6178m708j7702q9269K9710O3007
14745a2090l2338l7861N3316k695M8400o570N807K16j4373l657K4369M6942O693
14732G6159m0942q134L6400j4020l3832l5991J0509n4564k7868L9574j9865j3520
$$ y = [-17594, 45638, 21184, -56229, -41712, -15093, -81563, -67635, 43066, 73883, 69079, -19452, -123805, -145564, -111546, -44283, -26730, 33093, 52927, 35004, 6147, 16565, 107916, 70713, 74244, 11942, -55852, -72218, -21052, -53580, -38037, 5302, -12864, 28225, 98308, 96040, 67241, 94280, 89651, 57742, 69700, 69358, 62382, 49316, 29235, -11192, -51724, -81833, -43306, -24893, -24367, -25347, -52947, -130230, -142066, -55058, -2050, 65599, 141687, 118212, 70079, 63845, 54028, 93941, 104934, 33050, 6872, 2164, -15538, -104807, -75097, -12090, -44428, -82289, -28973, -31668, 16732, 10162, 15969, 16185, 1812, -1845, 22524, 69466, 76159, 35217, 27083, 63483, 49463, 15631, -20360, -9851, -64415, -92283, -52709, -72574, -86094]
14720h6094N2378l1016J5996Q9688Q3989q0207k8259L4023k7381r5870O815k5569
14708i1507m5740J9651O0227p908J815Q9454L0745O5482P851l9988m2241j8907
14696B8934M0356j1313j6318r24k3798m5572l7973p2550O9020L4635O8656J02902
14684A36055m8088q3397p7052L3012J9911j2660K7065N8703L5255k7935m8729
14673A2140n1024p286Q644K4588o596O1908J5460n5535j6050M1733P1235l6993
14661F2224L3885n1438n8805l3373J7187L2868N682N2098K5984L9847J3881n8091
14649H1949l8417j9760j1579K3360K4601r8540r0423K0489L14L3062M6728p236
14637c5452J9020J2551L4021l5021l1338L3725M2675N6929K8172J5712n1046l2314
$$ y = [-86094, -33716, -64732, -48736, 40952, 124941, 44734, 16475, 50498, 23117, -72753, -65938, -91507, -137247, -117596, -57369, -65277, -63462, 25992, 56737, 122219, 130070, 90082, 47841, 28934, 69290, 57977, 41659, 40735, 16937, -28635, -66608, -139158, -70138, -35503, 33153, 136055, 87967, 4570, -72482, -39470, -19559, -32219, -5154, 53549, 88804, 60869, 12140, -38884, -46170, -37526, -12938, -19534, 42374, 57834, 2299, -13751, 27982, 99217, 62224, 96109, 44671, -14134, -47507, -30320, 2548, 8230, 60328, 86312, 126159, 140040, 81949, 43532, 23772, 12193, 35553, 60154, -38386, -128809, -108320, -108006, -74944, -28216, -35452, -16432, -3881, 30140, -4881, -36219, -2494, 40181, 97110, 125282, 140994, 89948, 57634]
14625E7634m528l5305l1616L6193O6893k77n206J944l4266m5658k4958L3172Q2914
14612I6936j828o8604j8309J3072l4286j5542L7574J01147o4064p6685l9044L6413
14600c3220q635j3677j8675m4885M8391N1752j2352O1920j1206n0751L41l2694
14588f3691L522J3574P181k5725M2318Q0250P709K5256K2164l928N4423q7088
14576G5965m5379M4182p8226j10215m9561P6356O7915l6903J2390N6112L6138
14565D8774j605q00P112n5789o986m8317o7506J9262P0370N5786K1662l4823q5294
14552g8154n7534o805l748Q2730O3054J4090j8045r735k0667k9397L040k863M7170
14539a6864L237p7902M0791P1140k922n9439m0964m2900J9850R2215o8119J0355
$$ y = [57634, 53106, 17801, -13815, 22378, 89271, 88994, 83788, 85732, 51466, 5808, -19150, 14022, 96936, 95108, 26504, 8195, 21267, -13019, -28561, 9013, 110160, 46096, -30589, -69633, -33220, -41855, -55532, -74207, -119092, -70701, -18949, -31301, 30619, 19413, -31338, -30997, -63691, -60169, -46595, -39414, -65139, -22821, 57429, 65138, 90394, 112558, 108630, 163053, 75965, 30586, 74768, -3458, -113673, -163234, -86878, -18963, -55866, -43476, 12636, 48774, 47169, 46369, 53481, -2308, -9294, -57611, -125117, -105855, -35485, 20301, 41963, 7140, -78154, -135688, -142493, -146241, -63511, -457, 13633, -4412, -14147, -34814, -64211, -61171, -64034, -16864, -13627, -91529, -50738, 20402, 17480, -41959, -82923, -125823, -105973, -13758, -81877, -71522]
14527g1522L7855j8259j2131L471K8124L6381l3295j7764j3780l691K9235N544
14515b9832O534K5760j6841J9526M42k0712K0378o699O4925n099l4642n6054m2410
14502g4724o96L8016k15M1076M4339P122k0569o1907K6957Q034m4331L1737l0914
14489c6075l2655J7451j1111K9339q083l1960r265J5390J2824J9915Q249k522
14477b8503M4040L7792l7207k4901k8486J9507L6617L4682J6474n2374N9735M8055
14465A25431M2560o0879q1802l4068K526J46641j1797m8800p0290q2531J8524
14454e4485j375k3406K2835J4103j5136j5594L7353P8473j2091k8492o830l8051
14442d2696p627l616l9263R612P6263k7176n7149L5329O0436M7314L832j2492
$$ y = [-71522, -33667, -51926, -64057, -60586, -32462, 3919, -29376, -47140, -60920, -64611, -35376, -29832, -23298, 2462, -14379, 5147, 5589, -15123, 5255, -1444, 63481, 58382, 23740, -32314, -74724, -75420, -37404, -37619, 3457, 47796, 54918, 34349, -27558, -601, 7433, -36898, -5161, -36075, -68730, -51279, -62390, -33051, -41134, -73094, -82359, -66969, -54145, -34230, -25981, -28503, 15537, 53329, 16122, -8779, -37265, -17758, 18859, 53541, 70015, 17641, 77376, 125431, 167991, 107112, 25310, -8758, -6232, 140409, 128612, 79812, 9522, -73009, -54485, -55860, -79266, -56431, -42328, -57464, -73058, -35705, 42768, 30677, 2185, -4645, -42696, -50323, -53939, -93202, -83590, -7327, -34503, -91652, -56323, 4113, 51427, 55259, 42767]
14430D2767l4585J918K1943j0914L1083o6768N9039j5992o6019l1765m5241J6297
14418i8237J6342j2616k1721K4000O7991K7944j6693j2285M5889j8482L587r792
14406d073M7160O6936m4709r4528l0155l7647q005R0337N2062J9577m5210o8805
14394e7060Q400O5040N846M2171O1633J8129l2401o50k9776o7428n7999K6995
14382a7100J3333j2540O996L0517L7364n4585p6379O999j8418M9494p199l1644
14370g3162K5983n550k3012J6139N0573j8807N220N1122M8675n4573p2880J4234
14358c6038P386j7263M2093M6214l4293m0849m5675L269P2428L9262k6207J8652
14346B8979k5212n5701P1725L3251n1302m008j8178k1187L6873m758M9427q019
$$ y = [42767, 8182, 10100, 32043, 21129, 52212, -14556, 44483, 28491, -37528, -69293, -114534, -98237, -81895, -94511, -116232, -92232, -24241, 3703, -12990, -25275, 20614, 2132, 5719, -4073, 43087, 110023, 65314, -29214, -59369, -97016, -105021, -14684, 37378, 56955, 11745, -57060, -48660, 16380, 22226, 64397, 126030, 144159, 111758, 111108, 81332, 13904, -44095, -17100, -3767, -16307, -9311, 21206, 58570, 3985, -72394, -65395, -83813, -34319, -41518, -73162, -47179, -52729, -75741, -59602, -9029, -27836, -22616, 28506, 77181, 22608, -50272, -36038, -28652, -45915, -3822, 42392, 8099, -32750, -78425, -75156, -2728, 36534, 10327, 28979, 3767, -51934, 19791, 53042, 1740, -2268, -20446, -41633, -4760, -9518, 39909, 31890]
14334C1890j2140K6821O233K5284P94k839j2403k2Q651l3508l3552o3140Q116
14321d9815j19J6689K1852M6828K1838k2687k8545q4762K7810M1346k6803n0063
14309h6431j9477n120K9446r467R548L4257K4730o908L5806P5923j1563p761o5309
14296b326K5549p295J6796Q5943K352r2040L301K1151q2223m9938J0967N5575
14284a2188j7017n1170J3308J02326J13121j0910j2006l6882r4133k0874L2748
14273F323L0724o376K0272p361J8378M62l3844q1124j3308J6425l863o7014M0757
14260g9549N0361j5410M293N037Q432P7940O216j6806l8791m956n267L4093J6222
14247D1815J1363l3106j2372j32232m5007N4112J00678J36229r299p7020l4696
$$ y = [31890, 19750, 46571, 52804, 78088, 78882, 76043, 63640, 63618, 72269, 38761, 5209, -57931, -49815, -49934, -33245, -11393, 35435, 57273, 34586, 6041, -78721, -50911, -9565, -36368, -86431, -105908, -111028, -81582, -91049, -81501, -47244, -22514, -29422, 6384, 82307, 70744, 62983, -2326, 23223, 15928, 32724, 118667, 121019, 28979, 32280, 53431, -28792, -78730, -67763, -12188, -29205, -80375, -67067, 35259, 148380, 137470, 125464, 88582, -5551, -26425, 6323, 37047, 30671, 50943, 43582, 61960, 62422, 28578, -52546, -65854, -49429, -53292, -120306, -79549, -29188, -44598, -40305, -35268, -26836, 51104, 57320, 40514, 1723, -3233, -8500, 25593, 41815, 53178, 20072, 7700, -124532, -169539, -115427, -14749, 121480, 112181, 35161, 465]
14236D65M6854m0595j1339Q162j0256J2065l5536l1477M8273J0870O9445J9683
14224H6614n7411n49P3528l3899o9873L7838M0298L3339k5760j2858q10j3553
14212E6904K3529P469m4505j9765K1021M357o6234j7578N427p766M5255M4645
14200E2759m8411K6754O4983J540j7695r7767l4294J022N0902J590p9073k297
14188g9987J03791K5510L3321N098m0562M363K5319m9928q434m771l9537J2208
14176a3609J2767p717J9849Q2993m4058o1954r282M0577L1582p1623J3458m825
14164a1842r1217n495O4919k8138J2775M7059L3491n636M382l6969j9611M7803
14152A1521m456m0346L4025k6265J8952n9580m746M6211j394o864j1644q267J1237
$$ y = [465, 47319, 6724, -4615, 3547, -6709, 5356, -30180, -61657, -13384, -2514, 66931, 86614, 29203, 28654, 102182, 68283, -1590, 36248, 76546, 109885, 84125, 71267, 70457, 56904, 80433, 87902, 43397, 23632, 44653, 49010, -17224, -34802, -29375, -37141, 8114, 52759, 4348, 31102, 96085, 97625, 79930, -17837, -52131, -51109, -207, 1383, -77690, -79987, 23804, 49314, 82635, 87733, 47171, 51534, 76853, 26925, 18491, 13720, -25817, -13609, -842, -8559, 11290, 94283, 50225, -11729, -21011, 19566, 51148, -20475, -7017, -11842, -103059, -108554, -43635, -71773, -58998, -11939, 21552, 15916, 20298, -16671, -36282, 11521, 7065, -33281, 744, -25521, -6569, -66149, -70895, -24684, -26078, -32942, -44586, -52853, -41616]
14139d1616J0081J1277J1198R5290L7037j1459p8184o5560L3401L5181k9821M3356
14127E0181P585q206R222R15j9146l5741P366R607n716L8957n7091n8586n841
14114f6494M5043l8465N6413j0421M0429N829K4358j587o8671l2157l9772J8377
14102f7118k529O3242N3019J613o742L030n8825M8373R2990j3337j7839o0805
14090C5072m9378J1889Q5188L4905j01939n6881K4115L9963M7455J4354j6798
14079F7945o5674l3251m5522j9649l2397M6260M671O420P2387k3239K722N6275
14067C6948J3723j8216p7786l3899L3403l6106k0926N6932N1604l1266m6517m1424
14055a13530O8954k268M8613M0426M3876l9866l5265N1110l8382R13J07957M401
$$ y = [-41616, -31535, -20258, -9060, 86230, 123267, 111808, 33624, -31936, 1465, 36646, 6825, 50181, 57766, 49560, 58782, 59697, 40551, 4810, 12176, 21783, 16067, 55024, -2067, -60653, -66494, -21451, -59916, -3503, -13924, 26505, 32334, 56692, 55105, -13566, -45723, -85495, -67118, -69647, -6405, 46614, 48227, 41485, 44515, -14310, 34063, 127053, 113716, 95877, 35072, -14306, -2417, 82771, 117676, 15737, -41144, -17029, 22934, 70389, 84743, 67945, 2271, -30980, -76502, -96151, -128548, -82288, -77617, -71197, 1190, -22049, -19327, 36948, 50671, 32455, -45331, -79230, -45827, -81933, -102859, -45927, 5677, -25589, -72106, -113530, -44576, -46844, 1769, 42195, 86071, 46205, 10940, 62050, 23668, 24581, 132538, 136939]
14043A36939l6707p7829n8544L6385j3046J3222O3664L2200n756j7972k3717K6701
14031G5540o3687q0355J658K0670N6838J5393M0467n741l9709M815K4856K0671
14019G1416L5792k1507l0475q341l5254m3425m9143O121M5941J7742r64l6709
14007d8806j7235O802J0199J0554L517K4708L392M7937K4667k6731R213n1j7445
13994C0721M31l6307M0212J8452m2017k0831p1796m1254L5830R5558j4875j1914
13982a7790L0524k9218l7422J4597K7661k8922m4684p8833k8729M4647P0754L5599
13970d1816L0525k3677l468K9257j6839J234j2234k0099l4906o4018k9480K3592
13958a61929M9294J8006J7592N1226P719j719O2586j6614n8156l6001q345p037
$$ y = [136939, 100232, 22403, -36141, 244, -12802, 420, 64084, 96284, 90528, 72556, 48839, 75540, 11853, -68502, -66844, -46174, 10664, 26057, 66524, 60783, 21074, 25889, 50745, 71416, 107208, 85701, 55226, 46885, 11631, -31794, -80937, -74816, -28875, -11133, -12097, -48806, -66041, -59239, -49040, -38486, -34969, -10261, -6869, 41068, 65735, 39004, 48217, 48166, 30721, 31152, -5155, 35057, 53509, 11492, -9339, -81135, -122389, -86559, 8999, -5876, -17790, 12734, -16484, -53906, -39309, -11648, -40570, -85254, -164087, -192816, -148169, -77415, -41816, -11291, -34968, -38436, -9179, -26018, -24784, -37018, -57117, -92023, -156041, -185521, -161929, -112635, -94629, -77037, -25811, -18092, -19811, 42775, 26161, -31995, -67996, -76341, -83378]
13946h3378N6760J01428N9183n5628j06376l5170L7797K7146N8141l3392m4126
13935a7615N6428P3910K4164l2076n1280p3179m6890K4061N9226M5297m1255o4775
13923d3984K1850M4693p253k7245M5419P8576k5456l0510j8902k9652K4346l0723
13911A159j0464L0967m433L3364j2749L453K2418p9773n291m4036Q324P065l6523
13898h6519J7472K1650N0020j2443k5727K4933j4257n5571J1427L8681j9021L0443
13886a8912m094j3206k397K2953O5530m203J503k3858p0571j5995L4339J7521
13874a1390Q451N0546J7311K9189n1500j21387j6266M7778N4403j8986l9389o0362
13862a11602N2344N3774l5534N527P993L4644L8374O4577L170k4878o8928J6203
$$ y = [-83378, -26618, 74810, 133993, 78365, -28011, -63181, -25384, 1762, 59903, 26511, -17615, 38813, 112723, 136887, 104811, 53531, -19648, -66538, -42477, 16749, 62046, 20791, -43984, -22134, 22559, 15306, -11939, 33480, 112056, 86600, 56090, 37188, 7536, 31882, 1159, -9305, 21662, 17229, 50593, 37844, 41297, 63715, -16058, -21349, -65385, -57061, -49996, -86519, -69047, -47397, 2623, -9820, -35547, -10614, -24871, -80442, -69015, -30334, -49355, -18912, -23006, -36212, -38609, -15656, 49874, 45671, 47174, 23316, -47255, -63250, -28911, -11390, -2939, 47607, 64918, 94107, 42607, -78780, -95046, -47268, 7135, -11851, -51240, -111602, -59258, -5484, -41018, -35491, -27498, 7146, 45520, 110097, 113267, 88389, 19461, 35664]
13850C5664r448r1360q995q035m089R190J2179N1000o0717j0726K6217n9038M7085
13837g1073L8237M0090N2179N538l73N8158l7m0965m2864m0766K0345P1697L0453
13824A20619M5648k5975r6803n276J1369j7747j7353j2288k7717L4929o249n80
13812B577N5274N364o5524L958L4340l5758m1697k3491P8530l5182P147P2447
13800E7985L9557n9641k0598M6467J327j2079n2176o8821m6048n122O3935M8411
13788f803M7767k504l5248L8795Q2417o07l2774J3915J4393l4355o8548o135O244
13775A6557K3254m6349J650M2215n3530r1350K6374L5024K6951l8958O4498O1524
13763F7860M899q498r8521J5202K2400l2065L9055J2674l5119k2090p714n0333
$$ y = [35664, 26216, -65144, -74139, -82174, -86263, -77073, -64894, -13894, -74611, -85337, -59120, -118158, -71073, -32836, 7254, 59433, 64971, 64598, 122756, 122719, 81754, 38890, -1876, 18469, 90166, 120619, 166267, 140292, 43489, 38213, 49582, 31835, 14482, 2194, -25523, 9406, 3157, 2577, 57851, 63215, -2309, 1649, 35989, 231, -41466, -64957, 13573, -21609, -14462, 57985, 97542, 37901, 17303, 63770, 65097, 53018, 842, -67979, -114027, -119149, -55214, -6803, 40964, 38460, 3212, 42007, 124424, 123817, 91043, 104958, 119351, 84996, 16448, 10313, 16557, 39811, -6538, -4888, 37327, -16203, -107553, -81179, -46155, -19204, -58162, 6336, 67860, 72759, 64261, -34260, -19058, 3342, -28723, 10332, 23006, -12113, -34203, -41917, -92250]
13751i2250J7767p166L1539K4533k8256J6488p448l7794l885j7589R778K0491
13739g3792O0297m102J2590p583M044n705J8659P5946k990L5488j2110j01702
13727i60o4956P4065N4008M231l4370n3608k8199J9534L2465L0010M1801M6474
13715A20495p2722j03195K0531K9636j8276j5583L9836Q7000k032n2676j8702
13704A4312m8473J2773M4520N5104K2923J5886k5305m7616k0226M2372o444p4420
13692a4594J9148J7128M4313L4722M6306L3858q2020l0333p0852l5401J4452N9333
13680C6060M2527m9276j1236R259K6255n6717l1791K3411O7911R100K4734n8080
13668C2157m8075n3966J661J0991o7918M8985O7947k0136L0213k0939q667q610
$$ y = [-92250, -74483, -81649, -50110, -25577, -53833, -37345, -44793, -82587, -86472, -104061, -94283, -73792, -13495, -17597, -5007, -12590, -8546, -14251, 4408, 80354, 77364, 112852, 100742, -960, -65916, 8149, 62157, 66388, 32018, -21590, -49789, -30255, 2210, 32220, 74021, 120495, 47773, -55422, -34891, -5255, -23531, -39114, 722, 87722, 85690, 33014, 14312, -34161, -21388, 23132, 78236, 101159, 117045, 91740, 44124, 23898, 66270, 59826, -14594, 4554, 21682, 65995, 100717, 147023, 180881, 98861, 68528, -2324, -37725, -23273, 36060, 78587, 29311, 18075, 27334, 53589, -3128, -34919, -11508, 56403, 65503, 90237, 32157, -15918, -69884, -68223, -57232, -125150, -76165, -8218, -28354, 1859, -19080, -27747, -36357]
13656c6357P0247J843m8373j46n6268M4079k6620o1485Q7891j029j7155n468k9165
13643g8006M8438J9016L3708N1325o0863q0244N9479l534O8892p3302R559K0714
13631A5182o5366l7091r507M7795O8425Q2730M9988q9425n0360k753J5136k4262
13619D92M0239m0459q2149n8772J34143M2650q1583N7455P3437L693m2114j6659
13607C0373k1176K127R160P706j2767o1933j9076N7152J4665j8755M7444O4716
13595I9636K546R03q7091l2785Q0914j6639K9556J4907N0678m8739l4230l2051
13583B7605M225n9808n8576J3827J9080K1566P828j3898L2356P4691l0740L3378
13571G1534m6589p4448L8287O4831M2540n3458j4181R155L0188j2870K3793J0197
$$ y = [-36357, 33890, 35733, -12640, -12786, -69054, -24975, -51595, -113080, -25189, -26218, -43373, -48841, -78006, -29568, -10552, 23156, 74481, 13618, -66626, -7147, -10681, 58211, -15091, -5532, 15182, -50184, -87275, -96782, -48987, 19438, 102168, 152156, 62731, 12371, 9618, 24754, 492, 40731, 272, -81877, -140649, -6506, 36144, -45439, 12016, 85453, 89146, 47032, 30373, 9197, 11324, 20484, 28190, 15423, -46510, -65586, -8434, 6231, -12524, 34920, 99636, 102182, 103085, 15994, -16791, 64123, 47484, 77040, 91947, 142625, 93886, 59656, 27605, 31830, -27978, -86554, -72727, -53647, -32081, -24253, -38151, -5795, 68896, 38156, 71534, 24945, -49503, -11216, 53615, 96155, 42697, 28516, 37671, 67859, 54989, 78782, 88979]
13559H8979o397R066K4764J2331p0470p0475j915n740m5576j0565p218m6273J0543
13546a18946L6313L9965N520M2217l751N1544M5768j9112L4134K2441l7544n3003
13534D5546k1884m3275o366j2645J5383k430J7872O3301R1612j3993O331j3286
13522A26166m3738m5598k0056L8771k4395n4216Q699K3252k4121k8973L3095k1036
13510c2150n2599k0634j9801K4525M8193q564K9543K8708j7179k2442l2323K3425
13498e1298j8331K6264M6577J2283J09748j5721j19138m9037M6009K4297o9731
13487e8078M7565J4446P727J2970k0905p8462j5368L1666Q966L7594K2560M736
13475A5417r145n3672n0901N8171J1768n1359J7153l260M7809l442k1478K3965
$$ y = [88979, 82582, 91648, 116412, 128743, 58273, -12202, -14117, -19857, -65433, -75998, -83216, -129489, -118946, -82633, -42668, -37148, 5069, 1318, 52862, 98630, 79518, 113652, 136093, 98549, 45546, 23662, -19613, -25979, -38624, -23241, -25671, -7799, 55502, 147114, 133121, 139452, 126166, 82428, 36830, 16774, 55545, 31150, -23066, -14367, 8885, -15236, -44209, -11114, -32150, -84749, -105383, -125184, -100659, -52466, -61030, -31487, -2779, -19958, -42400, -74723, -51298, -69629, -43365, 3212, 15495, 125243, 109522, -9616, -58653, -12644, 11653, -58078, -10513, 3933, 11660, 24630, 3725, -74737, -90105, -58439, -49473, -11879, 10681, 15417, 6272, -47400, -98301, -40130, -28362, -79721, -62568, -65828, -18019, -21461, -42939, -18974]
13463a8974L469r512k8925q907K6700N3105L5662M1186j0611J2182n1437m3689
13451B49k1241M5702K4285M3561j4357k4281K6091M6453L8813o0415r9753o7340
13439f2233j6801J6057r133O2208M9799K6940p9719K1300J1287J126p2247j6782
13427f8198O9892K8853m3850m2524M8066O7801K9265r0210J418L6086M7528k2771
13415F1356J2750j6442j0078K6650n74o4841p3551P2792O2167k2600P685l028
13403E2286M2120l2774o5399P86K6525M8131J9801J247p8751n1302J2476j6996
13391d1850p168j6619q018P9096N7522L0710k7471L6064O7191j01032j42295l8194
13379a12064K4410J6767m2704o899n677l3897J10017R9250l4408l7647J1549k6978
$$ y = [-18974, -15505, -25017, -53942, -62849, -36149, 16956, 52618, 93804, 83193, 95375, 43938, 249, -20992, 24710, 48995, 92556, 78199, 53918, 80009, 126462, 165275, 104860, 5107, -62233, -79034, -62977, -72110, -9902, 39897, 66837, -12882, 8418, 19705, 20831, -51416, -68198, 1694, 30547, -13303, -55827, -7761, 60040, 89305, -905, 513, 36599, 84127, 61356, 74106, 57664, 47586, 74236, 73662, 8821, -64730, 8062, 70229, 47629, 55314, 52286, 94406, 61632, -3767, -2981, 23544, 71675, 91476, 92723, 13972, -37330, -24854, -41850, -49018, -65637, -73655, 5441, 62963, 93673, 66202, 102266, 169457, 68425, -73870, -112064, -87654, -70887, -113591, -120490, -126167, -160064, -50047, 49203, 14795, -22852, -11303, -38281]
13367c8281K7201J796L8288m954l1395L8386q13k682P783k2671j3718j683J2788
13354A0045L3093l0885o8374K6077j7381k1630j1884N7336j0286k0226m2990j8901
13342a16006L65M2034P0320J5900j1647R60m0649L9610O3562O3299K5460L6499
13330A89707N472l4144k137n1036m9994l1354k6764k327K0004J7158l8598j03343
13318a07356l8451K3645R0649k0329p601n608k3165P6270L3076k5485j7497L083
13306a8769k1574L0387L74K4842m952k1315M9657M5922o2974k287M5674m4853
13294B0132n9396l5058K1761L2753L8102J8347N600k3179o3602q2030P1348O5845
13282A0623l8047N9625o441o9990k3017P513N972k2882Q060j0471n780l6409J4503
$$ y = [-38281, -11080, -9284, 29004, 24050, -7345, 31041, 30228, 27546, 35329, 12658, -1060, -2743, 10045, 43138, 12253, -56121, -30044, -47425, -69055, -80939, -23603, -33889, -54115, -97105, -116006, -115641, -73607, -3287, 12613, 966, 1926, -38723, 887, 64449, 127748, 153208, 189707, 195179, 161035, 158898, 107862, 57868, 26514, -250, -2577, 17427, 34585, -4013, -107356, -145807, -122162, -31513, -51842, -59443, -65051, -88216, -11946, 21130, -4355, -21852, -18769, -40343, -9956, -9582, 15260, 10308, -11007, 38650, 84572, 21598, 19311, 64985, 20132, -39264, -74322, -52561, -19808, 18294, 36641, 42241, 19062, -44540, -126570, -55222, 10623, -27424, 32201, 25760, -44230, -67247, -59734, -53762, -76644, -68584, -79055, -84835, -121244, -106741]
13269a06741P3970L4766k0405O1084R746j09707l7850J3002Q2561K4094l9418
13258a4898m0969L2426k9663J17872j193r0260k0066L857M7169Q2720L5515p487
13246A15023o5747k3442m037M4786J6375k2049J7670j6534l9362L7819O287L4782
13234A01571p197J1090j00294k9215l8595l3679M7654K7464j8585M736M1421L2434
13222C8805L0770k6699m5934k6224j3312o3131N3666O5217J5661k1261n1378J9534
13210b4286J2541J0408k6531P0243J0578L2009k1920p1227k8150k173M8805J2255
13198B2552n0366p438J7757L0360P234j7811j02811j9258L0673O3140K7368k3035
13186b1635k8816j0556k5673n1605N131Q5193K4842O332K383Q3836Q1644M6602
$$ y = [-106741, -32771, 1995, -18410, 42674, 52420, -57287, -95137, -82135, 426, 24520, -14898, -55867, -23441, -53104, 64768, 63575, -26685, -46751, -42894, 4275, 86995, 122510, 115023, 49276, 25834, 21797, 66583, 82958, 60909, 78579, 62045, 22683, 60502, 66789, 101571, 94374, 105464, 5170, -24045, -62640, -96319, -48665, -21201, -39786, -35050, 6371, 38805, 69575, 42876, -3058, -29282, -42594, -105725, -52059, 13158, 28819, 7558, -43820, -24286, -11745, -1337, -27868, 42375, 52953, 84962, 63042, -8185, -36335, -38508, 10297, 22552, -27814, -35252, -17495, 12865, 20099, 2288, -100523, -119781, -89108, -25968, 1400, -21635, -50451, -61007, -86680, -138285, -133154, -47961, -23119, -16787, -14404, 69432, 151076, 197678]
13174A97678r8189p6585k5509L3738L3654n0379o3813m4876Q7237Q3007j321l5724
13162C8918M6549j6651r3233o095j5991N5964N9168m525j14255J5234l3584k8245
13150i6746J292l4598j2941Q7780K1627k2878L5331j4620j9941R786r427M1983
13138a3352K8003o1514k0083j337K2269J1917q423L0312K406M541K9918O794P1123
13125A02574j187n1300l4977m8637r8778N0224N2407l981L8087j1827k382L8472
13113B8695m186o6571q0708O2467P4970N4514l7444p2055K5563M949l2752l5110
13101g7668l3723m4239Q4008J8875K5113N0900K9158o5162J7246K9323l42o5574
13089c2085K9294R4881N851m1660J0116j5597J2402J6889k9160j4721n8319J5215
$$ y = [197678, 99489, 22904, -2605, 31133, 64787, 14408, -49405, -94281, -7044, 75963, 74642, 38918, 85467, 68816, -24417, -30512, -46503, 9461, 68629, 64104, -50151, -34917, -68501, -96746, -95454, -130052, -142993, -55213, -33586, -56464, -21133, -35753, -55694, -45908, -55335, -13352, 14651, -46863, -66946, -68283, -46014, -34097, -42520, -12208, -9802, -5261, 24657, 31451, 102574, 101387, 50087, 15110, -33527, -132305, -82081, -29674, -33655, 4432, -7395, -9777, 28695, 24509, -42062, -122770, -60303, 14667, 69181, 31737, -40318, -14755, -9806, -42558, -77668, -111391, -155630, -71622, -52747, -27634, 23266, 52424, -12738, 4508, 33831, 33489, -32085, -2791, 92090, 97941, 56281, 66397, 50800, 63202, 80091, 50931, 36210, -22109, -6894]
$$ [...]
##END NTUPLES=NMR SPECTRUM
##END=
