##TITLE=Analysis number 312969
Compound Code rf 04702
Project Code adrs
Chemist Name ugmt
##JCAMPDX= 6.0         $$ Bruker NMR JCAMP-DX V2.0
##DATA TYPE= NMR SPECTRUM
##DATA CLASS= NTUPLES
##ORIGIN= Bruker BioSpin GmbH
##OWNER= NMR
$$ XWIN-NMR		Version 3.5
$$ Mon Aug 22 12:02:47 2005 GMT Daylight Time (UT+1h)  MAYBRIDGE\NMR@NMR_250MHZ
##.OBSERVE FREQUENCY= 250.131544655141
##.OBSERVE NUCLEUS= ^1H
##.ACQUISITION MODE= SIMULTANEOUS (DQD)
##.ACQUISITION SCHEME= undefined
##.AVERAGES= 16
##.DIGITISER RES= 18
##SPECTROMETER/DATA SYSTEM= dpx250
##.PULSE SEQUENCE= zg30
##.SOLVENT NAME= CDCl3
##.SHIFT REFERENCE= (INTERNAL, CDCl3, 0, 16.522)
##AUDIT TRAIL= $$ (NUMBER, WHEN, WHO, WHERE, WHAT)
$$ ##TITLE= Audit trail, XWIN-NMR		Version 3.5
$$ ##JCAMPDX= 5.01
$$ ##ORIGIN= Bruker BioSpin GmbH
$$ ##OWNER= NMR
$$ C:\u/data/dgb/nmr/ADRS/8230/pdata/1/auditp.txt
$$ ##AUDIT TRAIL=  $$ (NUMBER, WHEN, WHO, WHERE, WHAT)
(   1,<2005-08-22 12:02:24.28 +100>,<MAYBRIDGE\NMR>,<NMR_250MHZ>,
      <created by zg, POWCHK disabled, PULCHK disabled
       configuration hash MD5:
       62 19 C7 07 E1 42 D1 B7 37 6C 3D D0 77 39 F9 E6
       data hash MD5: 64K
       6C 72 89 5C DC C1 8A 18 95 6D 7E D8 A4 8F 29 EB>)
(   2,<2005-08-22 12:02:36.31 +100>,<MAYBRIDGE\NMR>,<NMR_250MHZ>,
      <Start of raw data processing
       ef LB = 0.3 FT_mod = 6 PKNL = 1 SI = 32K 
       data hash MD5: 32K
       A4 59 2B 60 60 15 F8 89 17 2B C5 8D 61 E0 C4 85>)
(   3,<2005-08-22 12:02:39.71 +100>,<MAYBRIDGE\NMR>,<NMR_250MHZ>,
      <apk 
       data hash MD5: 32K
       7E 1F FA 09 2D 76 77 24 69 9B 10 C9 57 49 03 69>)
(   4,<2005-08-22 12:02:40.78 +100>,<MAYBRIDGE\NMR>,<NMR_250MHZ>,
      <abs ABSG = 5 
       data hash MD5: 32K
       0B 3A 81 AA E3 76 7E C0 FD F6 B4 B7 D7 7C 8F AD>)
$$ ##END=
$$ 
$$ hash MD5
$$ E7 59 40 4E 62 15 4D 37 60 51 B3 09 E2 2C C6 D3
##$RELAX= 
##$RELAX= 
##$RELAX= 
##$RELAX= 
##$RELAX= 
##$RELAX= 
##$RELAX= 
$$ Bruker specific parameters
$$ --------------------------
##$DU= <C:\u>
##$EXPNO= 8230
##$NAME= <ADRS>
##$PROCNO= 1
##$TYPE= <nmr>
##$USER= <dgb>
##$AMP= (0..31)
100 100 100 100 100 100 100 100 100 100 100 100 100 100 100 100 100 100 
100 100 100 100 100 100 100 100 100 100 100 100 100 100 
##$AQSEQ= 0
##$AQ_mod= 3
##$AUNM= <au_zg>
##$AUTOPOS= <7 >
##$BF1= 250.13
##$BF2= 250.13
##$BF3= 250.13
##$BF4= 250.13
##$BF5= 500.13
##$BF6= 500.13
##$BF7= 500.13
##$BF8= 500.13
##$BYTORDA= 1
##$CFDGTYP= 0
##$CFRGTYP= 5
##$CHEMSTR= <none>
##$CNST= (0..31)
1 1 145 1 1 1 1 1 1 1 1 1 1 1 1 1 1 1 1 1 1 1 1 1 1 1 1 1 1 1 1 1 
##$CPDPRG= <>
##$CPDPRG1= <>
##$CPDPRG2= <>
##$CPDPRG3= <>
##$CPDPRG4= <mlev>
##$CPDPRG5= <mlev>
##$CPDPRG6= <mlev>
##$CPDPRG7= <mlev>
##$CPDPRG8= <mlev>
##$CPDPRGB= <>
##$CPDPRGT= <>
##$D= (0..31)
0 1 0 0 0 0 0 0 0 0.06 0 0 0 0 0 0 0.0002 0 0 0 0 0 0 0 0 0 0 0 0 0 0 
0 
##$DATE= 1124708543
##$DBL= (0..7)
120 120 120 120 120 120 120 120 
##$DBP= (0..7)
150 150 150 150 150 150 150 150 
##$DBP07= 0
##$DBPNAM0= <>
##$DBPNAM1= <>
##$DBPNAM2= <>
##$DBPNAM3= <>
$$ [...]
##$SUBNAM7= <"">
##$SUBNAM8= <"">
##$SUBNAM9= <"">
##$SW= 20.6930455092707
##$SWIBOX= (0..15)
0 0 3 0 0 0 0 0 0 0 0 0 0 0 0 0 
##$SW_h= 5175.983436853
##$TD= 65536
##$TD0= 1
##$TE= 295.16
##$TE2= 300
##$TE3= 300
##$TEG= 300
##$TL= (0..7)
0 120 120 120 120 120 120 120 
##$TP= (0..7)
150 150 150 150 150 150 150 150 
##$TP07= 0
##$TPNAME0= <>
##$TPNAME1= <>
##$TPNAME2= <>
##$TPNAME3= <>
##$TPNAME4= <>
##$TPNAME5= <>
##$TPNAME6= <>
##$TPNAME7= <>
##$TPOAL= (0..7)
0.5 0.5 0.5 0.5 0.5 0.5 0.5 0.5 
##$TPOFFS= (0..7)
0 0 0 0 0 0 0 0 
##$TUNHIN= 0
##$TUNHOUT= 0
##$TUNXOUT= 0
##$USERA1= <user>
##$USERA2= <user>
##$USERA3= <user>
##$USERA4= <user>
##$USERA5= <user>
##$V9= 5
##$VALIST= <valist>
##$VCLIST= <CCCCCCCCCCCCCCC>
##$VD= 0
##$VDLIST= <DDDDDDDDDDDDDDD>
##$VPLIST= <PPPPPPPPPPPPPPP>
##$VTLIST= <TTTTTTTTTTTTTTT>
##$WBST= 1024
##$WBSW= 4
##$XGAIN= (0..3)
0 0 0 0 
##$XL= 0
##$YL= 0
##$YMAX_a= 445132
##$YMIN_a= -568334
##$ZGOPTNS= <>
##$ZL1= 120
##$ZL2= 120
##$ZL3= 120
##$ZL4= 120
##$ABSF1= 16.522
##$ABSF2= -4.171173
##$ABSG= 5
##$ABSL= 3
##$ALPHA= 0
##$AQORDER= 0
##$ASSFAC= 0
##$ASSFACI= 0
##$ASSFACX= 0
##$ASSWID= 0
##$AUNMP= <proc_1d>
##$AZFE= 0.1
##$AZFW= 0.1
##$BCFW= 0
##$BC_mod= 0
##$BYTORDP= 0
##$COROFFS= 0
##$CY= 12.5
##$DATMOD= 1
##$DC= 0
##$DFILT= <>
##$DTYPP= 0
##$F1P= 14.0000005364418
##$F2P= -0.99999901652339
##$FCOR= 0.5
##$FTSIZE= 32768
##$FT_mod= 6
##$GAMMA= 0
##$GB= 0
##$INTBC= 1
##$INTSCL= 1
##$ISEN= 128
##$LB= 0.3
##$LEV0= 0
##$LPBIN= 0
##$MAXI= 10000
##$MC2= 0
##$MEAN= 0
##$ME_mod= 0
##$MI= 0
##$NCOEF= 0
##$NC_proc= -5
##$NLEV= 6
##$NOISF1= 0
##$NOISF2= 0
##$NSP= 0
##$NTH_PI= 0
##$NZP= 0
##$OFFSET= 16.522
##$PC= 1
##$PHC0= 136.0177
##$PHC1= -15.63777
##$PH_mod= 1
##$PKNL= yes
##$PPARMOD= 0
##$PSCAL= 4
##$PSIGN= 0
##$REVERSE= no
##$SF= 250.13
##$SI= 32768
##$SIGF1= 0
##$SIGF2= 0
##$SINO= 400
##$SIOLD= 32768
##$SREGLST= <1H.CDCl3>
##$SSB= 0
##$STSI= 32768
##$STSR= 0
##$SW_p= 5175.98343685301
##$SYMM= 0
##$S_DEV= 0
##$TDeff= 65536
##$TDoff= 0
##$TI= <Analysis number 999999
Compound Code 99
Book Reference 9
Project Code 9>
##$TILT= no
##$TM1= 0
##$TM2= 0
##$TOPLEV= 0
##$USERP1= <user>
##$USERP2= <user>
##$USERP3= <user>
##$USERP4= <user>
##$USERP5= <user>
##$WDW= 1
##$XDIM= 32768
##$YMAX_p= 320588597
##$YMIN_p= -127371
$$ End of Bruker specific parameters
$$ ---------------------------------
##NTUPLES= NMR SPECTRUM
##VAR_NAME=  FREQUENCY,     SPECTRUM/REAL,   SPECTRUM/IMAG
##SYMBOL=    X,             R,               I
##VAR_TYPE=  INDEPENDENT,   DEPENDENT,       DEPENDENT
##VAR_FORM=  AFFN,          ASDF,            ASDF
##VAR_DIM=   32768,         32768,           32768
##UNITS=     HZ,            ARBITRARY UNITS, ARBITRARY UNITS
##FACTOR=    0.157963299565203, 1,           1
##FIRST=     4132.6476996994, 0,             0
##LAST=      -1043.33573715361, 0,           0
##MIN=       -1043.33573715361, -127371,     0
##MAX=       4132.6476996994, 320588597,     0
$$ Real data points
##PAGE= N=1
##DATA TABLE= (X++(R..R)), XYDATA
$$ [...]
25762C41k6202m901J2029j998P899Q059K3254N926j3179m151M661K0375q479k4503
25748h69j8235j417J7963J4828j9734j7168K1658K1448K382m1503q555k480N245
25735b6437J3748q130M692l285R194J8552K4463q085p109m160j2025N870J2813
25722B0101N876n456n018O921p851o938o400j0723j0678k147M033J7843M871j4173
25708i739p687k557N453J7101J098Q430j2728J4176K5583n122j3547j0126j7012
25695f677m580K3806J8189j5382l398J6200P092j7214k9360m222M497O855m322
25682h516j0146J0253J1931j600l669O79J4410j6897J768J3234J676j880J2687
25669B3930L585M51n79J2927q019k0682j9469P998J2218k500o55j1000k749J1266
$$ y = [341, -25861, -30762, -18733, -20731, -12832, -4773, 18481, 24407, 11228, 7077, 11738, 32113, 23634, -869, -19104, -20521, -2558, 12270, -7464, -24632, -2974, 18474, 20856, -20647, -29202, -31682, -26437, -12689, -20819, -16127, -19412, -10218, 8334, 32797, 24712, 17603, 13443, 1418, 7288, 20101, 25977, 20521, 15503, 22424, 14573, 7635, 1235, -9488, -20166, -22313, -18280, -437, 4434, -9739, -17426, -19983, -14530, 2571, 3669, 12099, -629, 13547, 39130, 34008, 20461, 10335, -6677, -11257, 12549, 30738, 15356, 11958, 28158, 35250, 18036, -11324, -15546, -11049, -4194, -8516, -18662, -8409, 3522, 1922, -1747, -1068, 13342, -3555, -1787, 11447, 13123, 11243, 23930, 27515, 27966, 27387, 40314, 32295, 11613, -7856, 142, 12360, 9860, 9205, -1795, -4544, 6722]
25655F722J1548j465j7169j3158K371n517M214l266M646K1341q006p269J1009
25642F001N468j320n784j200Q791m700j7496r034L751M821k318j0781k880r492
25628c6173L5991K6212l065j8888j0643m225j908J9355m563M72k75j7114L921
25615a0903J0079K642M444J2040o522L65n169r561K473j4804R289J5490m00J692
25601A1155r931J870J2863n216O542o62j8186K231J6455j286r547J0197r85O812
25587B2312J8262K229k5115r343J147o030j7950k658J5573n076Q005j660k0187
25574b0491j5407N757J2011Q672j2385J9011J8404q557q416L837L27N013k732
25561E044o190J3341J0066O454j5228j3742N074m29j5584k469p430N429p312j993
$$ y = [6722, 18270, 16805, -364, -13522, -11151, -16668, -12454, -15720, -11074, 10267, 2261, -5008, 6001, 11469, 10149, 4365, 3165, 11956, 7256, -10240, -19274, -15523, -10702, -13020, -23801, -26681, -36173, -182, 26030, 22965, 4077, -6566, -10791, -12699, 6656, 2093, 2565, 2290, -14824, -10903, -824, 1818, 6262, 18302, 11780, 12145, 6976, -2585, -112, -14916, -5627, 9863, 9463, 11155, 1224, 3094, 15957, 10741, 17283, 16621, -1565, 666, 17121, 15835, 6288, 16485, 15500, 22312, 40574, 42803, 17688, 8345, 9492, 3462, -14488, -17146, -1573, -6649, 1356, -304, -20491, -35898, -30141, -18130, -9458, -21843, -2832, 15572, 7015, -1401, 2436, 2763, 7776, 5044, -1146, 12195, 22261, 28715, 13487, -255, 4819, 4390, -11194, -13663, -21093, -15664, -22976, -24969]
25547b4969J0472O756R45j0164K078J7424J3299o690N86j6830J9182J0076r835
25534A2330j3348O361m0l413j986o084J1100J9014k581j034L60k8286k0496k265
25520c0368L3023P779k6994j1536R208J4128M789J208j1113r597J844J4108m521
25507h042j3336P894J4796R582j4009k3835J5104K4108K1338J8910j1434N464
25495D6540o413j1561L414r148l7561o825p681J2083N769N218l298J6346K765
25482I648K495J4352M071j2799O511K1852l613j702n736r872j285J6368j1777
25469B8513p151K709j7403J8356M744m251j7593J2378L179j6513o741M223j0883
25456f433j4524j6606O514J4184K0709J593p053k6824m777k897O606K718K0301
$$ y = [-24969, -14497, -7741, -6796, -16960, -14882, 2542, 15841, 9151, 9737, -7093, 12089, 22165, 12330, -1018, 5343, 5303, 1890, -96, -6180, 4920, 23934, 21353, 20319, 20679, -7607, -28103, -30368, 2655, 10434, -16560, -28096, -18888, -4760, 29, 1237, -9876, -19473, -17629, -3521, -8042, -21378, -13484, 1312, 10894, -3115, -26950, -11846, 12262, 33600, 52510, 41076, 46540, 40127, 28566, 31980, 22832, -14729, -21554, -29235, -17152, -11383, -6165, -9463, 6883, 9648, 12143, 26495, 30566, 17767, 24278, 46130, 42517, 40815, 35079, 25207, 23922, 40290, 28513, 21362, 24071, 6668, 25024, 29768, 25517, 7924, 20302, 23481, 6968, 227, 4450, -6433, -20957, -37563, -31049, -16865, 3844, 5437, -1616, -28440, -33217, -36114, -29508, -26790, -6489]
25443f489J1208j0371j839q060O119m92j5450J8520j0155L261J1972J9994l962
25430A4256L120J0016L939l760q322q701j887p809K171J2119n087p448j0439j4742
25416b2574k4118M046L1875K118k0591P684M642K921J1447N821j1639j2352J244
25403a9476J1832o422R684J0513J3527o107l1333L516N246j2499L919K4183L437
25390A0020Q845K868j1954J6232j1337m434p586J1218L324k0100j388J982n412
25377g722j5224J3664O949m096P501n291J4316K9917j6390j4360j5266L527J2840
25364A0365l3687j422J8585J5917J1763j8578j4814m432K711J3629J1488L459
25352A4984m459j6958j3576Q530K6145P107J854Q129j4501k1104J786K871o29
$$ y = [-6489, 4719, -5652, -7491, -15551, -9432, -9924, -25374, -6854, -17009, -13748, -1776, 18218, 14256, 17376, 27392, 31331, 27571, 19249, 10548, 8661, 852, 3023, 15142, 10055, 2607, -7832, -22574, -46692, -42646, -10771, -8653, -29244, -21560, -16918, -13997, -2550, 3271, -8368, -20720, -19476, -7644, -14066, -4382, 6131, 19658, 13551, -17782, -14266, -9020, -21519, -17600, 6583, 10020, 18865, 21733, 9779, 26011, 14674, 10240, 2654, 13872, 17196, -2904, -4292, -2310, -7722, -22946, -9282, -2333, -6429, 1072, -4219, 10097, 40014, 23624, 9264, -6002, -2475, 10365, -23322, -24744, -6159, 9758, 21521, 2943, -11871, -16303, -13592, 37, 11525, 14984, 10525, -6433, -20009, -11479, 14666, 21773, 23627, 31756, 17255, -3849, -2063, 808, 179]
25339A79j659P761J1612o629l9717O204K0126L514r096J477q050L390N437j1426
25325a6877O134O184j4747L540k463j8702j2528J1509J8168J4934j3186J9168
25313A134L643q570q062m084k007j3320O713K173Q21K5694m980n012J0480j7030
25299a2407j6115K470J0160J3933m789K368L542r560N934J2060K622q70K812j0530
25285A630j7917j0757o2J9146J6698K935r824k3635n430l98J950N534K166r649
25271b7613j4193J0427n814K050J4183k319J2825J6980J1218j140q570J52j5419
25258g233K75K196K464O415J43p877l546J5366J6952N377j2655q141k850l744
25244C142o049m200m000m939J5628J9707L190O489j6390k7586M067Q639J0148
$$ y = [179, -1480, 6281, 17893, 11264, -28453, -22249, -2123, 1391, -7705, -6228, -14278, -10888, -5451, -16877, -10743, -4559, -19306, -15766, -18229, -36931, -49459, -37950, -19782, -4848, -18034, 1134, 4777, -3793, -11855, -15939, -17946, -31266, -24553, -22380, -21559, 4135, -845, -5857, 4623, -12407, -28522, -26052, -15892, -1959, -6748, -4380, -838, -10398, -4464, 7596, 10218, 9348, 12160, 1630, -16287, -27044, -27106, -7960, 8738, 11673, 1849, -21786, -27216, -27614, -25664, -20130, -17964, -27613, -41806, -31379, -37193, -35143, -20960, -23279, -10454, 6526, 17744, 16604, 8034, 8186, -7233, -6958, -4762, -2298, 4117, 4260, -3617, -7163, 8203, 25155, 30532, 17877, 9736, 6886, 3142, -2907, -7107, -11107, -16046, -418, 19289, 22479, 28968, 12578, -15008, -10941, -2302, 7846]
25231G846m245j6828j6158o692j5766K0513L4542L734J0522j8950k881J2780J3207
25218B1624R058r28j2043l224P555l284q36p85o797o692R326k515N512l154N543
25203A8360k798m231J5921j5427k3296N390P128k8407M564Q448N010n697K539
25190a2496M745J3213K2571o793m121J0063j8149j7058K034J966K636j4036j0261
25177b5686O500K321J1352J2463K1505j7294k1428k1213L781M17J4835K6238P81
25164A4572N794N992k881j5396j1919J941O77j2660r130J8892K3409J4014Q666
25151D1971p337j5952r865J759M706J028J4145K2610j9298k3947j0500k3369j1203
25138c5252J4597j2081Q087J5025O714n447q96j5479N533K9847O046J028j0441
$$ y = [7846, 3601, -13227, -29385, -36077, -51843, -31330, 3212, 6946, 17468, -1482, -4363, 8417, 21624, 30682, 29754, 17711, 14487, 22042, 18758, 17922, 17137, 10340, 3648, 12974, 10459, 15971, 12817, 18360, 15562, 11331, 27252, 11825, -11471, -6081, 1047, -27360, -22796, -14348, -9338, -15035, -12496, -7751, 5462, 28033, 21240, 17119, 27182, 9033, -8025, -5991, -4025, -1389, -15425, -25686, -19186, -16865, -5513, 6950, 28455, 11161, -10267, -31480, -27699, -27282, -12447, 13791, 14572, 20366, 26358, 23477, 8081, -3838, -1897, -1220, -13880, -23010, -4118, 19291, 33305, 41971, 34634, 18682, 8817, 10576, 15282, 16310, 30455, 53065, 33767, 9820, -680, -24049, -35252, -20655, -32736, -24649, -9624, -2910, -8357, -9253, -24732, -19199, 10648, 16694, 17722, 7281]
25125G281j2066P774j0716l812K2825q16k2347L702J259O171J5111J5870q29m6937
25111a7530P45J1485l291J5624j093P644J2515j816m736n245n786o085K622M90
25097E543j5151J234K4910K9922p019j5281n103j280j697j3587l072q571m819
25084a3971j642Q999j1755j0360O769J6878M498K185k278o473j5622J6821N177
25071g74r671k4191j0070L889J0457K504L145O158L041l002P059M114k2669P931
25057b2079r96L7K1311J3291j8483J7698J4108R305Q944j4325k9673j0432o193
25044a7487N109j652q760j343J4671J6439N711R528j3296r706J287m676o450k864
25030a3489M493p81k837M122r989n376K2144Q373O08j41q26j4959O018J121M977
$$ y = [7281, -4785, 2989, -7727, -11539, 11286, 10470, -11877, -8175, -6916, -745, 14366, 30236, 29407, -17530, -16785, -5300, -8591, 7033, 5940, 13584, 26099, 24283, 19547, 14302, 8516, 2431, 5053, 5543, -9608, -8374, 16536, 46458, 39439, 24158, 19055, 17775, 16078, 2491, -581, -9152, -13971, -15613, -6614, -18369, -28729, -21960, -5082, -584, 1601, -677, -7150, -22772, -5951, -774, -10445, -34636, -44706, -40817, -30360, -27856, -24711, -18553, -15512, -18514, -11455, -7341, -30010, -22079, -23075, -23038, -1727, 11564, -6919, 10779, 24887, 34192, 43136, 28811, -862, -11294, -17487, -12378, -14030, -22790, -24133, -9462, 6977, 12688, 22216, 8920, -786, 501, -4175, -10625, -13489, -8996, -9777, -12614, -8492, -18481, -23857, -1713, 6660, 7268, 7127, 6301, -8658, -2640, -1519, 3458]
25015C458j3645K116J876J454J6397M06k2940j3073J549n731j0483K5651R715
25002c250K81N290M468O535J334k043p847N037M680k721Q17K6Q084k4969L946
24987c32L4632J1176j845j4045M03j6533j6797J3114m267q09q136k3122j86O570
24973b0177Q423k381r785j9008M427K4050N493R282K1592k97j254j4274O971j0652
24959B410J9676J2393j7364k5730k787K569k225J7925m087J12j609J125J0815
24946A3223Q588j1509J224m223n943q453O367j118O577L17j8819j4705R449Q82
24932a8143q265J7806n076J9472J1159K26l270P947j2557o116Q823o905j2162
24919g061k1992m374N458N014K1116J3928K265j4887l767O387J1156m852j0876
$$ y = [3458, -10187, -8071, -6195, -4741, 11656, 12062, -10878, -23951, -22402, -28133, -38616, -12965, -3250, -2969, 2321, 6789, 13324, 14658, 12615, 4768, 9805, 14485, 11764, 12581, 12607, 20691, -4278, -332, 34300, 45476, 43631, 29586, 29989, 13456, -3341, 9773, 5506, 4697, -3439, -26561, -26747, -20177, -11754, -14135, -23920, -42928, -38501, -14451, -8958, 324, 21916, 21619, 20365, 6091, 13062, 2410, 22086, 34479, 17115, -8615, -11402, -8833, -11058, 6867, 2780, 2892, 1283, 2408, 13223, 21811, 10302, 11526, 7303, 1360, -7093, -726, -1844, 4733, 5050, -13769, -28474, -19025, -18143, -26408, -8602, -13678, 5794, 16953, 17179, 13909, 21856, 9299, 3183, 12006, 5101, -7061, -29053, -33427, -27969, -22955, -1839, 12089, 14354, -533, -4300, 2087, 13243, 8391, -2485]
24906b485r764O479q210r855R331J6091J1371j4413j0951O286p725k571J8887
24893B471j2944m480J0397o552J547J5543J544r382j2728k7943j2441o159M501
24880e6626J8732o441K0091L7864J0175j5993J67J6240r347n292K063m261j1357
24867c985o261J562J3558j7060Q70O502J1100j8301l656M930K1792L093R046j9109
24853D081j9954J3870K1347j509k1466k3595j5160J5016K3749J2528P582k598
24841A3891m270J2282j082m106j3252r699K170J0098j446O982k480l627L189m516
24827D134k1694J2490J6397P656n437l159j3650J902j6217l146n362J0986k522
24814a7622p238K926L035P799J0734k185n742j691K1812Q259k1480j7151J0471
$$ y = [-2485, -12249, -5770, -13980, -23835, -14504, 1587, 12958, -1455, -12406, -6120, -13845, -16416, 2471, -10473, -14953, -4556, -11108, -9561, 5982, 7526, -1856, -14584, -42527, -54968, -61127, -56626, -37894, -44335, -24244, 13620, 23795, 7802, 7969, 24209, 14862, 9570, 11633, 7372, -3985, -10246, -8684, 4874, -12186, -11316, -4814, 6286, -12015, -15671, -10741, 11051, 14144, 23190, 4081, -15873, -2003, 19344, 17835, -3631, -27226, -42386, -27370, -3621, 8907, 16489, 13891, 9621, 21903, 20821, 16715, 3463, -6236, -4066, 6032, 4586, 11568, 9088, 5461, 8650, 4134, -17560, -5070, 11327, 18983, 13546, 10387, -3263, -1361, -17578, -20724, -26086, -15100, -17622, -24860, -21934, -18899, -11100, -366, -2551, -8293, -9984, 11828, 20087, -1393, -18544, -8073]
24801h073j2568j482j8063o801J8263M923n402K559O21K331O529O738M834M768
24787h23p574n331N311Q220j5690k0157M070P966J832j2950J6354J6038l068j4086
24773a9888p034k253J3516R09j3329J7172Q773j4071J6802k0j8020J6281N380
24760D218L472O54k7498j2116J49K4955J1929r713N743j8242j0883K3595J1137
24747G400K410j419q575Q73k2400k571J4858N707P95q630l265J7677J4707n432
24733A2135k680M041Q618R707k2678j7803J1880J0736r40m831j4503P753M43o034
24719d156J0282j5881L369n70N781j7482j6565J6103J8920j1121j9775m099M839
24706c0355J0529Q795J111J8516n147k30J3937r485o9L503j4490j8457q04M587
$$ y = [-8073, -20641, -22123, -40186, -46987, -28724, -23801, -29203, -26644, -26023, -23692, -17163, -10425, -5591, -823, -8397, -13728, -8417, -197, -15887, -36044, -31974, -24008, -22176, -35126, -18772, -2734, -5802, -19888, -26922, -29175, -15659, -14750, -28079, -10907, -2134, -16205, 597, 577, -17443, -1162, 4218, 7690, 8344, -19154, -31270, -31121, -6166, 5763, -3950, 1793, -16449, -27332, -3737, 7400, 9810, 8391, -184, 689, -21711, -24282, -9424, -3717, -2922, -11552, -14817, 2860, 17567, 12135, 9455, 13496, 22114, 31821, 9143, -8660, 3220, 13956, 13016, 8185, -6318, 1435, 1878, -4156, 6126, -9755, -6386, -6956, -1175, -18657, -35222, -19119, -199, -11320, -31095, -35194, -30355, -19826, -11031, -9920, 8596, 3449, 3219, 17156, 7671, 7602, 11105, -3385, -21842, -22646, -18059]
24692a8059p146J7906K8025M586Q650q298n374M822m340n376j6136m132K1201
24679A6329J9281R923j2224k1903p005j3350L736J9001J849j1276l78NR916J135
24665A5039r861j4668r025J5374J4774P5m310J815N211l151p946P70R807p608
24651F296q129K4231R221k889j4374p647P196m366K1698M61k9704o355K055k067
24637d373K1556J2344J3061j0259j6672R169j1695n552j0260l246l684Q923K960
24624B272j1892j3214p071m307j2179J4994K3289J4198r870j2016L6197K3753
24612D4154j6842k5706l600l143j653K0135K989r568L370J2510k307j6583k409
24599A347k763j398O80m211j670N747k4074p924N530J5340O789m200k1046J5576
$$ y = [-18059, -25205, -7299, 20726, 25312, 33962, 25664, 20290, 25112, 20772, 15396, -740, -4872, 16329, 35610, 45533, 33309, 11406, 4401, -8949, -5213, 13788, 15637, 4361, 3983, 3988, 13904, 15039, 5178, -9490, -18515, -3141, 11633, 11708, 7398, 9213, 14424, 11273, 3327, 4097, 13904, 6296, -1833, 22398, 31619, 28730, 14356, 6709, 13905, 9539, 31237, 31698, 1994, -4361, -2306, -4373, 17183, 29527, 42588, 32329, 15657, 24826, 13131, 7579, -2681, -5927, -9611, -688, 2272, -9620, -22834, -29905, -34212, -46391, -31397, -8108, 6090, -3780, -15796, 20401, 44154, 27312, 1606, -1994, -5137, -6790, 13345, 16334, 6766, 10136, 22646, 20339, 3756, 1347, -1416, -2814, -2134, -6345, -8015, -2268, -26342, -34266, -28736, -13396, -6607, -10807, -31853, -16277]
24585a6277N006N900M94M56J0459j124o040M216J4027O18K562O110J9026j2598
24571C2835k8361j992l954m394P247J2944K055k7136L321J3287P382k328J164
24558A2070q279q107l480M591j3084j592K6770o275o078j3387J0752J0699R535
24545A4135j9187j5153O182M845l721n717j3774j6939K0236J2170k805o760J9304
24532g184L507L686R724N664m093q313q762j1632k190R805J3660R594Q651K607
24518B4724n718k1654k608J6350l738j2976k0311j4087J6844L1648J2632j6862
24506D244k1626k574K7466J8548j7934k2807j6952J1530J7562J5884k936J6050
24494B6455P305O99k7481l703P476R26j920j4789j7647r88P624J5552p881j3892
$$ y = [-16277, -11271, -5371, -4877, -4421, 6038, 4914, -1126, 3090, 17117, 17735, 20297, 26407, 45433, 32835, 4474, 2482, -1472, -5866, 1381, 14325, 16380, -10756, -7435, 5852, 13234, 10906, 12070, 3791, -4316, -7796, -3205, -16289, -17881, 8889, 2614, -3464, -16851, -6099, 4600, 14135, -5052, -20205, -14023, -9178, -12899, -18616, -32390, -49329, -29093, -16923, -19728, -26488, -7184, -3677, 9, 9733, 15397, 11304, 2991, -5771, -17403, -19593, -9788, 3872, 13466, 22117, 24724, 19006, -2648, -5256, 11094, 7356, -5620, -25931, -40018, -23174, 8474, 21106, 4244, -17382, -19956, 7510, 26058, 8124, -14683, -31635, -20105, -2543, 13341, 10405, 26455, 33760, 34459, 6978, 3275, 10751, 11677, 9757, -5032, -22679, -23667, -16043, -491, -8372, -22264]
24480b2264j2703o415M318J2182J5443j93p844o799N36J1205J4894K1026K6428
24467D9814P93j5507j736O917k7125j7717J189P094N20n917J4608J671J0692L401
24453B8697m330k785R126L044j837m221l4774j7050O808N980k378j2699O777J4090
24439e552J8104N415q062k8368O079J9614J0593j3936j621k241J172K7699J3510
24426D2406J0791j3350j2439l838j4851J292k392l93n806p399J4345j0593j3189
24413a5416j0537J1380K7779L184m699o506J448k120q089l236j7355j7285L481
24400c7971K514L5786J3713j3951O400p746j5159N804Q149L15o723O517o67j2227
24386a5246r362J867L024M866L661K9781J7679j8470j4833j3208j4727j5102m454
$$ y = [-22264, -34967, -41382, -37064, -24882, -9439, -9632, -17476, -24275, -23739, -12534, 2360, 23386, 49814, 50607, 35100, 33364, 40281, 13156, -4561, -3372, 3722, 4242, -1675, 12933, 14604, 25296, 28697, 24367, 21582, 30708, 33752, 31915, 27694, -7080, -24130, -17322, -11342, -13720, -26419, -19642, -5552, 12552, 17967, 9905, -18463, -12384, 7230, 17823, 3887, 2266, 25, 1197, 28896, 42406, 53197, 39847, 27408, 23570, 8719, 10011, 7619, 7226, 1420, -5979, 8366, -2227, -15416, -25953, -14573, 13206, 16390, 11691, 5185, 6633, 4513, -3576, -6812, -24167, -41452, -37971, -35457, 329, 14042, 91, 6491, -1255, -16414, -10610, -2461, -2146, -8869, -2352, -3019, -15246, -24608, -22741, -19717, -14851, -11190, 18591, 36270, 17800, 2967, -10241, -24968, -40070, -44524]
24373d4524L91k71l25n098J1199K1771J0459O160k374N070N954N823r41k9L829
24358A7094p349j0109L600J2913j1065J4649J1646j0331j6816l1675P475Q402
24346a1566J9281J5345q848j1204j368K711m623k0273n770l315j339K0110N608
24333e251K1195L966j8433l172j5256o711r42j761r184l435m057J4443J2913M406
24319a1279J1569K8153J1752j1395l8636j1757J1621l985r315J2083m336J1070
24307d455L936q545K742J1639J4125L686j1884j6612k14k4937J3229m9k199N982
24293a3556P133q112R74K3954K0913K355M015l519m797j5418L407o27j3199j4126
24279a0603p506K3488J1939K57n557J417N45n690K076Q430O671j1908j2772j2916
$$ y = [-44524, -44133, -44404, -44729, -49827, -38628, -16857, -6398, -238, -2612, 2458, 8412, 14235, 13294, 13265, 17094, 9745, -364, 3236, 16149, 5084, 19733, 31379, 21048, 4232, -27443, -19968, -11566, 7715, 23060, 14212, 3008, 1640, 4351, -272, -20545, -26315, -29630, -30969, -10859, -5251, 15944, 19910, 1477, -1695, -16951, -23662, -24604, -26365, -35549, -38984, -43041, -28598, -15685, -11279, 290, 28443, 40195, 28800, -9836, -21593, -9972, -13957, -23272, -11189, -15525, -4455, -519, -9064, -6322, 5317, 19442, 23128, 11244, -5368, -5582, -30519, -17290, -17339, -19538, -13556, -6423, -14535, -13561, 10393, 31306, 33661, 37676, 34157, 29360, 13942, 17349, 16722, 3523, -10603, -18109, 5379, 17318, 17575, 12018, 13435, 13980, 8290, 10366, 18796, 25467, 13559, 787, -12129]
24265a2129l286J6479J956k565O050m294R169J7173k3460r527l450L457j007l813
24251i247j186Q027J5874j240j0489J1840J4064m322l930m311j6644j7469j5350
24238c4383O244K4253P34L1116N518j1135j3258k020j3830M175J0530j0704k1489
24225b4249L210r53K1572J2783J1649k92j7172j3571Q783J1080K0502l7372o976
24212a1006o615j4715J5686J6989J5459J4137k3471r783m051n730O987J3259q427
24199a281J7952J823j4206k0362r427N658J4171Q668K611q335r408j4274J3205
24186a3205N654k637J2550J8103N459O950j9018k1796N378k132m895p13p3J9456
24172I081J147m328k1352j7531Q137J9836J5797R308j3740q597N305k1872j8604
$$ y = [-12129, -15415, 1064, 3020, 455, 6505, 2211, 11380, 28553, 5093, -4434, -7884, -4427, -5434, -9247, -10433, -2406, 13468, 12228, 1739, 13579, 27643, 23321, 19391, 15080, -1564, -19033, -34383, -28139, -3886, -3152, 27964, 33482, 22347, 9089, 7069, -6761, -2586, 7944, -2760, -24249, -21039, -21992, -420, 12363, 24012, 23720, 6548, -7023, 1760, 12840, 33342, -4030, -11006, -17621, -32336, -16650, 339, 15798, 29935, 6464, -3319, -7370, -13100, -6113, 7146, -1281, 16671, 18494, 4288, -16074, -25501, -19843, -5672, 2996, 5607, -2728, -12136, -26410, -13205, -7551, -10188, 2362, 20465, 25924, 32874, 13856, -7940, -2562, -4694, -9589, -10302, -10375, 9081, 10228, 5900, -15452, -32983, -24846, -5010, 10787, 20095, 6355, -2242, 3063, -18809, -37413]
24159c7413J9741K5702N334j4898j3599j085l151K9803J7533k3641l2441J39J3437
24146a4539O91K1191R02j923r92J1247K277n869q431K854j2308r969J6931J2856
24132A4918J0561k7352n650M681J2044L104l375m916L215k7121p987N623N951
24119a6304j2577p643j08j3669K3302K5316J1318k253n945j0978J0956J5865p879
24106I401j5961o922J1130L781j4629j667J0198J1566R793j1996j840j6956P501
24093f601j3109L005L866j5558n271K2294N805j177K197j0219j0821O941J1854
24080f794J0693j0138l640m052K905o464j284j5879J137k1863M98K2489J9761
24067a2631Q533K690J749M771k515l336L087P447L724l758n029k374N422K078
$$ y = [-37413, -17672, 8030, 13364, -1534, -15133, -16218, -19369, 10434, 27967, 4326, -28115, -27976, -14539, -13848, 7343, 8245, 6322, 5330, 16577, 18854, 12985, 4554, 7408, -4900, -14869, 2062, 14918, 25479, -1873, -7523, -2842, 9202, 12306, 8931, 4015, 7230, -19891, -27878, -22255, -16304, -28881, -36524, -36632, -50301, -26999, -1683, 9635, 7382, 1437, -9541, 1415, 17280, 9401, -6560, -13482, -2352, 1429, -13200, -14867, -4669, 6897, 16690, 4694, 2854, -14102, -6601, -19710, -16705, -12839, -28397, -33668, -11374, -5569, -6746, -4549, -14768, -25589, -18648, -6794, 3899, -6239, -9879, -13931, -11026, -17490, -18774, -34653, -33516, -55379, -54881, -32392, -12631, -4098, -1408, 341, 5112, 2597, -739, 2348, 9795, 13519, 9761, 4732, 2358, 7780, 9858]
24053I858M394J1214M66O974K343R578m742k3332j3541j3056q680N376K3507J0620
24039B0979k0642j0501P562J25j6992j6646J734l469N620J2831P525J4014Q681
24026A0821k914l09J5046p975j7226o376p257j1844m804N879j583K1388Q91J1479
24012E216l932j0174M706L294J746k0520j0689N642j424k575J3721M045j2335
23999b3279m18Q521K0805K4349n096j0961P945m85r474k85q133N087j1109J77
23985b356P812r299J0715K5993P789k2326k8721j5632n715N294p398J1151Q682
23972a4011M645L761p023k086N750J0961O116L550P943k751k6141K221L41j5090
23958b1814m736K5645K5516j818j6298j4701P515k030j5655j805J0575J5653j332
$$ y = [9858, 14252, 25466, 25932, 32906, 35249, 44827, 40085, 16753, 3212, -9844, -18524, -13148, 10359, 20979, 337, -10164, -2602, -2477, -19469, -36115, -34381, -37850, -32230, -19399, -11874, 2140, 10821, 7907, 7598, 22644, 14669, -2557, -8933, -16190, -28034, -32838, -26959, -28542, -7154, -6263, 5216, 1284, -8890, -4184, -890, 856, -19664, -30353, -24711, -26135, -28710, -14989, -10944, -23279, -23697, -15176, 5629, 29978, 24882, 13921, 21866, 21381, 11907, 11622, 3489, 8576, -2533, -2356, 5456, -3843, 6872, 32865, 40654, 18328, -10393, -26025, -31740, -26446, -33844, -22693, -14011, -9366, -5605, -12628, -14714, -8964, 1997, 8113, 11663, 19606, 16855, -9286, -7065, -6724, -21814, -26550, -905, 24611, 22793, 6495, -8206, -691, -2721, -18376, -20181, -9606, 6047, 4715]
23945D715j0704L70j804Q308K1402J6489r770k749j3931j1463n193o295p446q30
23931a8901R914l092k943J7510J9910J350p448J306M748n254j8264n711L913M04
23917b558J4005O212o893j6300r40j1950n29R704L966M258j4350J0589k434O441
23903g79J3379q972j3171P245J0290q278L727J6998K392n719q092o231L584K741
23889I114k466J319j9298j1670J0521L303N683l572j5361K3169J2850R641M572
23876B7805r972o031p384R93j0572r209M153k818M606m711K656r333J0213r004
23862a8608N963J0024l939r510l76k085Q034N633j7461k018M517N79m631J026
23848b2852J4864j0439K1118M669m491p555q334r098J0095J5563q667m166o65
$$ y = [4715, -5989, -5619, -7423, 885, 22287, 38776, 29006, 26257, 12326, 863, -4330, -10625, -18071, -18901, -8987, -12079, -15022, 2488, 22398, 23748, 16300, 17606, 22354, 17100, -1164, -6875, -2962, -2558, 11447, 17659, 10766, -5534, -6474, -18424, -18953, -9249, -5283, -1025, -15375, -4786, -7220, -779, 12600, 3628, -9543, -2298, 7992, -286, 3441, 20439, 22831, 17112, 9020, 2789, 6373, 9114, 6648, 7967, -11331, -23001, -12480, -9177, -3494, -7066, -22427, 742, 13592, 23233, 27805, 17833, 11802, 4418, 5411, -5161, -14370, -10217, -13035, -8429, -13140, -10484, -19817, -9604, -18608, -12645, -2621, -6560, -16070, -16446, -18531, -10497, -4864, -22325, -24343, -19826, -19247, -23878, -22852, -7988, -18427, 2691, 7360, 2869, -4686, -13020, -22118, -12023, 3540, -5127, -9293, -9958]
23835i958p333l699O830K321R522o361m992J1527J4309K3763j984j0991j1651
23822A1303j5135r121j2392K306J0794o820J2921N532j420n67M136J8630K849
23809B3016j6641r142p957n831L275K0142q79J1625K485L258J172n715k3885j3517
23795a8594p68J9880R08K7755K304j9786O912n525L684j2172j730M711O877r459
23781D997k969N41J0940o356j89N53m347j7905j551M928P504k1326j5985P271
23767c3894M349j9902J1496L3381M2114K882k5669r511J3637J4887k840j2779
23755A8151j4628n510J1990n160l048K550L980m091K639n121J4890j295j0478
23742D869j0974m106l884K3485J884j830j0151j3567m017K234M853L693j3489
$$ y = [-9958, -17291, -20990, -14160, -11839, -2317, -8678, -13670, -2143, 12166, 35929, 33945, 22954, 11303, -3832, -12953, -25345, -23039, -12245, -19065, -6144, -612, -2032, -2599, 1537, 20167, 23016, 6375, -2767, -10724, -16555, -13280, 6862, 5983, 17608, 20093, 23351, 24523, 18808, -5077, -18594, -19362, 518, 1426, 29181, 31485, 11699, 18611, 13086, 16770, 4598, 2868, 7579, 14456, 4997, 2028, 2569, 13509, 7153, 6964, 7517, 3170, -14735, -16286, -11358, -3854, -25180, -41165, -33894, -29545, -49447, -37951, -4570, 37544, 40426, 14757, 5246, 18883, 33770, 30930, 18151, 3523, -1987, 10003, 4843, 1795, 4345, 8325, 4234, 6873, 1752, 16642, 15347, 4869, -6105, -10211, -14095, 9390, 11274, 9444, -707, -14274, -18291, -16057, -11204, -7511, -21000]
23729b1000k207j1575J5944L8935J7351p040J1508N285r609r308j4876j5198L097
23716A307J2191r688k2673j8829n321r41j0051J4512J6494N162O77l67r59p739
23702b6225J2994Q704J0844r87j1421k4585j435j2879o83m356k381m429K9806
23689b7033J1846M417J641k238k994N358K395O480J2447n58p066k3021k2631R472
23675c1485L198J283J4950j9056m163O788J0369L28M285Q765K4538J6851R1j7051
23661A9691P302k069j465p645j5118j0808k1330Q508J4463M482J4742K520k915
23648A0358j1489n307j3416J7317R131p046J5854J4085J6986L670j5473j1124
23636B3546j9184p32M932m512m272k4755K530K633n230O485J8187M658j643j9926
$$ y = [-21000, -23207, -34782, -18838, 20097, 37448, 30408, 41916, 47201, 37592, 28284, 13408, -1790, 1307, 13498, 3810, -18863, -37692, -43013, -43954, -54005, -39493, -22999, -17837, -17160, -17527, -18486, -26225, -13231, -4527, 6317, 5330, -6091, -30676, -32111, -44990, -45673, -50029, -52410, -56839, -27033, -15187, -10770, -9129, -11367, -14361, -9003, -6608, -128, 12319, 11761, 4695, -18326, -40957, -31485, -28287, -27004, -12054, -31110, -35273, -28485, -18116, -17788, -13503, -4738, 19800, 36651, 36742, 19691, 26993, 24924, 23459, 15814, 696, -10112, -31442, -22934, -8471, -3989, 10753, 13273, 10358, -1131, -6438, -19854, -2537, 6594, -452, 15402, 29487, 46473, 50143, 34670, 23546, 4362, 3630, 8562, 4050, -222, -24977, -22447, -19814, -25044, -18559, -372, 4286, 2643, -17283]
23622a7283K774k549j4998p00K3983q093p857j0984J0030M0039J4875N251L863
23609C8351k2824r680o081j983n722n487j0169q503J4893O298j2371K1964J2514
23596A1200q298j508j3759j7415l925J1068Q099J0295R888N292N404j6447k0191
23583b0297M470N871j1772j1033k2050K918K5080R409o148j2260J0015J7101L363
23570e333j220o071j3882p760J6473N339k0212r431Q940Q648O939l522n973J4733
23556a2332J9267j0979n098K938j1680j0139k557J0565J5653O002l416K542j6373
23543a5607p33p698K700J4534P68J0254L0167K846m393l6267k8096M741K76J6132
23529a0376J99p014O674M88j3056Q060M354j078n879q472J8579Q17J2615J8345
$$ y = [-17283, -14509, -17058, -32056, -32756, -8773, -16866, -24723, -35707, -25677, 14362, 29237, 34488, 38351, 15527, 5847, -234, -2217, -7939, -13426, -23595, -32098, -17205, -10907, -23278, -1314, 11200, 2902, 1394, -12365, -29780, -33705, -22637, -14538, -4243, 5645, 10937, 16341, -106, -20297, -15827, -9956, -21728, -32761, -54811, -51893, -26813, -17404, -23552, -35812, -25797, -8696, -5333, -6553, -12624, -26506, -34266, -17793, -12454, -32666, -42097, -33157, -24509, -17570, -21092, -27065, -12332, 6935, -4044, -9142, -6204, -17884, -28023, -30580, -20015, -4362, 1640, -1776, 766, -15607, -16340, -24038, -21338, -6804, -6036, 4218, 34385, 37231, 32838, -3429, -31525, -26784, -26508, -10376, -10177, -17191, -10517, -10029, -23085, -15025, -10671, -11749, -17628, -26100, -7521, -6704, 5911, 24256]
23515B4256j3L222O79k5385j4927L543J5374o83o19l337J776M785j0442r793k515
23500a4079K0942J9939K407J773K667O310m573j0804l7005o421M260o761p099
23487b8444P462O959j3614J1212N762Q139J8560J9084j181n361J384j6269l6270
23474b2577j9037j794R056L0535K1460j5093k948R833j3239Q621j6284j768k0
23461a3255k036N690N320M039N797J984k8650k0024J454R510K404J6493M642Q342
23447A710J4084J2688J549j6603K302O595L480j3415k331K698j3863j1571k0579
23434c3256R772L2584O479P040r43j976l2849j6881M317j922l240J1488R292m332
23420a4427J171K99j2763k1398m251n573Q767J4657P661K612n630J1165L12l3191
$$ y = [24256, 24243, 27465, 28144, 2759, -12168, -8625, 6749, 6066, 5447, 2110, 3886, 8671, -1771, -11564, -14079, 6863, 26802, 29209, 30982, 33649, 39959, 35386, 24582, -12423, -18844, -14584, -21345, -28444, -20982, -14023, -27637, -16425, -10663, -2524, 16036, 35120, 33939, 28578, 29962, 13693, -22577, -41614, -43408, -34352, -3817, 17643, 2550, -398, 9435, -3804, 4817, -11467, -13235, -13255, -15291, -9601, -4281, -242, 5555, 7539, -21111, -41135, -39681, -30171, -27767, -11274, -6632, 1710, 15794, 28482, 30031, 13428, 15730, 22325, 25805, 12390, 10059, 12757, -1106, -12677, -33256, -23484, 9100, 15579, 22619, 21676, 19700, -13149, -30030, -25713, -27635, -30875, -19387, -10095, -14427, -13256, -12957, -25720, -47118, -51369, -56942, -48175, -33518, -25857, -23245, -28875, -17710, -17398, -50589]
23406e0589M98J7859K6749K4668o133M947J781q340k1413J4338L156K047r823
23393b55j0869L453J1324L437n871M642K557p70k2585j338N705J238m961K4416
23379A0123R186j5687q214q497O685M658j6053j1302J658J5943K1071J968j3442
23366a903r263K22Q450O216M236R561M996p839J2403P630r046j8631k1256L482
23352a0742R284r776p394j9838O798Q52P435L278O746m624J4540r035N308N464
23338a704k102j2908j5357j6292K4062K6944M85O800j0504l038J515j6512l296
23325b1907K4197J27j3488Q571k838o222k088k8652j1303K9108K5251J799m58
23312B097k0461k917Q160R524p153K5973P173j9193j4135o664o426j1817K829
$$ y = [-50589, -50091, -32232, -5483, 19185, 13052, 17999, 19780, 11440, -9973, 4365, 7521, 9568, -255, -11124, -7671, 3653, 7090, 1219, 5861, 8418, 7648, -14937, -16275, -10570, -9332, -14293, 10123, 19309, 3622, -4592, -13089, -6404, -1746, -17799, -29101, -27443, -11500, 9571, 11539, -1903, -11166, -10944, -2494, 3722, 7958, 17519, 22515, 14676, 27079, 34709, 25663, 7032, -14224, -10742, -1458, -11234, -18628, -38466, -31668, -30816, -23381, -20103, -13357, -17981, -3441, -12476, -7168, -1704, -3806, -16714, -32071, -48363, -24301, 2643, 3128, 9928, -576, -3614, -2099, -18611, -21907, 2290, 2417, -11071, -2500, -5338, -11560, -13648, -42300, -53603, -24495, 756, 2555, 2097, -18364, -21281, -13121, -3597, -10750, 15223, 22396, 3203, -10932, -17596, -24022, -35839, -33010]
23299c3010J3618J5108J2345J5106m603M781j8053k8275Q470o955j755M410M029
23286a4784r88l123P025j0399j5117k654J2597J5082J1187K7847K635j8579j9336
23273h607j6995l504L38j8067o382K2088J1743j264L269K270J1311K413J995J5290
23259A5898l752j8070j7865p011n072J1401P073Q575O467O840o89k387q299j9781
23245b6672J9418J1611R538K465j4322J776j785L132p670J0233n197j2156m184
23232a3813M958j0594m032M91J174K998J6606K1059K046n067j8717j0215J2813
23219b93K336K5L495j5667L011j5436r516J5551J6703L723j1228o673N07L698
23205i764j7987J509N888K387r837o469O19o632k912J4612K4901l248N381m798
$$ y = [-33010, -19392, -4284, 8061, 23167, 18564, 23345, 5292, -22983, -14513, -21468, -23223, -18813, -14784, -15772, -18895, -11870, -22269, -37386, -40040, -27443, -12361, -1174, 26673, 29308, 10729, -8607, -25602, -29106, -28768, -46835, -53217, -31129, -19386, -20650, -17381, -15111, -3800, -1387, 608, 15898, 12146, -5924, -23789, -30800, -35872, -24471, -17398, -8823, -2356, 4484, 3795, 1408, -6891, -26672, -7254, 4357, 13895, 16360, 2038, 3814, 2029, 5161, -2509, 7724, 2527, -9629, -13813, -8855, -19449, -23481, -22990, -21816, -18818, -2212, 18847, 20893, 15826, -2891, -13106, -293, 2043, 2068, 5563, -10104, -7093, -22529, -32045, -16494, 209, 3932, -7296, -13969, -13462, -9764, -27751, -26242, -20354, -17967, -27804, -34273, -33654, -40286, -43198, -28586, -3685, -6933, -1552, -6350]
23191f350j1329O076J2538o473j190o874O593Q446J1063K292Q099j2178j7193
23178f480J9403j2656j5161J2369J8252J8780J607j4754r877n267J2840j3722
23166E334j5648M493k754p203j1740K678R308K1351L423q176N570m519O782P509
23152A6408p832J6925j8397l142K0960M706J7166l1633m3387n535P720J1596j712
23139a6157L363J3737R857p040j1238m749J4086k881L768j540o623j439l96K0205
23125A2953K962J4406l044o674o480Q800J8259r76P329j5936J1198q46j3757j2228
23111A5966j3967P149L22q927p396J0068j052P094o42k2018l271R345O176n067
23097f220q44K733j6684n103j6336N100Q099Q352k2968j3359J5017J9053J3057
$$ y = [-6350, -17679, -11603, 935, -5538, -6728, -13602, -7009, 1437, 12500, 14792, 22891, 10713, -6480, 12923, 267, -14894, -2525, 15727, 34507, 36114, 21360, 11483, 6216, 19056, 5334, -10314, -5821, -8575, -15778, -27518, -24840, -15532, 5819, 9242, 1066, 6636, 2117, 8899, 16408, 8576, 25501, 7104, 3962, 24922, 29628, 46794, 15161, -28226, -33761, -26041, -14445, -16157, -12794, 943, 10800, 3760, -7478, -12227, 1859, -1022, 2746, 1206, -5417, -6856, -7252, 12953, 15915, 30321, 27277, 20603, 14123, 22923, 41182, 40206, 47535, 31599, 42797, 41951, 28194, 15966, 1999, 9148, 9470, 543, -6853, 3215, 2163, 9257, 8615, -13403, -16674, -7329, -1153, -6220, -7064, -4331, -21015, -26118, -42454, -37354, -29255, -20903, -43871, -57230, -42213, -23160, -10103]
23084a0103Q522P618j2006j2175J1627q943q220K826R541L08Q217L621O768K129
23070I730m014k326N72l902l828J0629l124Q002N079j2149k3272j2768j7664k0476
23056f9511J2193L2290N39R226J5537m435J2534l120q726K3123k069q046M015
23043A3550N221j7035l5951K1384J2595r010J4528J6645Q87j0681j2216K480p213
23030d816K029o231l421l3539j786J0840q400J6960K6562L380m6573k6076R740
23017f1331P139J2784K7060j245j0758K009K5113q029j4288q403K531J2440j9767
23004c4745Q993L476R184J3164p501j0337j298p052p56p414M586J4531J4993J0145
22990I969K365j7604r142m069J8136r276k111N213L884P930j5921j7493K8439
$$ y = [-10103, -1581, 6037, -5969, -18144, -6517, -15460, -23680, -20854, -11313, -11005, -2788, 833, 7601, 9730, 5716, 3390, 3962, 60, -3768, 6861, 3737, 11739, 16818, 4669, -18603, -31371, -49035, -69511, -57318, -25028, -24489, -15263, 274, -4161, 8373, 5253, -3473, 19650, 17581, 9535, 13550, 18771, 1736, -34215, -12831, -236, -9246, 5282, 21927, 22814, 12133, -83, 2397, -4816, -2787, -9018, -12439, -45978, -47764, -36924, -45324, -28364, -1802, 1578, -44995, -71071, -61331, -54192, -41408, -14348, -15593, -26351, -24342, 771, -7258, -21546, -29949, -27418, -14978, -34745, -25752, -22276, -13092, 72, -7429, -17766, -19064, -26116, -26872, -34286, -29700, -15169, -176, 9969, 12334, -5270, -14412, -18481, -345, -9621, -11732, -6519, -2635, 5295, -10626, -28119, 320]
22977C20J3758n771r051J0328R64k9123j1385j3276j391L445r154J0763K3716
22964a5857K6184K6175j4688k1188K153J0633M956j9886j1565j5919J151k554
22952c0405J231P284k528J463J7456o225n942K4015j564j1743j0070p591m547
22939b9166M117j0326R173J947N335J4195M494j771N459j968R357q005j1345m162
22925a2666M706J3013Q250J389j1849k0102K831O679O905J1448r821P85p266k717
22911h415k936O410K380j4042P526Q122J789m068J5907o685j6548J7869Q2O49
22897H040L416j8460r269N334N625J1563J4469k569j9113J1049P64j764m477N874
22883A0482Q623l543M104j2415j3460j4602R762K0039O716K575q362M303J0911
$$ y = [320, 14078, 8307, -744, 9584, 10548, -18575, -29960, -43236, -44627, -41182, -50336, -39573, -15857, 10327, 36502, 21814, 626, 2779, 13412, 18368, -1518, -13083, -29002, -27851, -30405, -29174, -21890, -24418, -22955, -5499, -11724, -17666, 6349, 4785, -6958, -17028, -24619, -29166, -25049, -35375, -26202, -24255, -18920, -4725, -231, -2002, 3457, 1489, 10846, 2841, -8504, -12666, -7960, 5053, 13303, 14692, 2843, -17259, -14428, -7749, -844, 10604, 783, 1568, -5698, -8415, -11351, -4941, -2561, -16603, -9077, -955, 834, -3234, 12673, 5988, -10560, 7309, 7391, 8040, 11456, -7004, -16273, -10939, -5314, 6249, 20718, 18149, -964, 10085, 10849, 9085, 4608, 10482, 19105, 15562, 19666, 7251, -6209, -20811, -11049, 8990, 15706, 18281, 9919, 14222, 25133]
22870B5133q1j2001j9347q028n973O5J1221J1417R701q337J2606j5301j1253m646
22856a4824m837l488P556j35j796O381J119j2451P92J6225J3916o141j0597j8447
22842b6727l661j0127J1243K0154j3770j6353J8727k60Q693O77Q810M64n623n212
22828a2965j2378q703J8900J3355m906r315j7306L1277J4610j9079n86k680j639
22815a1415j387J3073p445L620M487p713O893p578q442j0931J4272R567P458n797
22801a338q710M843o549L122L717o41j640j51j1727M769k523P295J076l698k115
22786a4270K4890Q048j084k3577J419J1106J8773p068K394j5773p571O192l424
22773E5j3760N769n863j0234K039k706M23J4306n799k382M512Q79j023K611k4548
$$ y = [25133, 25052, 13051, -6296, -14324, -20297, -20232, -9011, 2406, 12107, 3770, 16376, 1075, -10178, -14824, -19661, -23149, -15593, -15728, -17524, -11143, -10024, -22475, -21683, -5458, 8458, 2317, -8280, -26727, -30388, -40515, -29272, -9118, -22888, -39241, -20514, -20774, -12081, -11404, -2594, -2130, -7753, -12965, -25343, -34046, -15146, -1791, -6697, -16012, -33318, -2041, 12569, -6510, -7096, -9776, -11415, -12802, 271, -7174, -3554, 933, -6780, 113, -7465, -15907, -26838, -12566, -2999, 4459, -1338, -10048, -5205, -11754, -8632, -4915, -5556, -7196, -7347, -19074, -14305, -16828, -9533, -8457, -12155, -14270, 10620, 18668, 17584, -5993, -4574, 6532, 25305, 18237, 20631, 4858, -2713, 3479, 55, -13705, -7936, -13799, -24033, -21994, -24700, -24277, -9971, -15770, -18152, -13640, -12761, -13784, -11173, -35721]
22758c5721K759J9285J0926m907k2334m389K508J445J3537K907J6188J2971j2987
22745B188k3270K064J1850J4818l710k745k3760j6311l219J387P359K0881O699
22732e769P955j695l0751k3026j3373K3319K5296J8552J7918p819L08k3693q955
22719b1733K995O960m320J80J2812r840j456O485l749N669j0468O971O083k2453
22705b5864J0290K4349o955M519j071k7709k921R444J1496n529O49M333p732P477
22691e224J7804K910m895J72k0003j0872K769J7930K4387J2412p053k6646q47
22678B844L49j1098j3890q301l217l204L2074J5722j6474k082L425J059J0656
22665G863j2076O763J1987J5528N176j1995j5177j9782m782J3867Q020j332J6363
$$ y = [-35721, -32962, -13677, -2751, -7658, -29992, -34381, -31873, -30428, -16891, -13984, 2204, 15175, 2188, -21082, -19018, -7168, 7650, 3940, 1195, -22565, -38876, -42095, -40708, -33349, -12468, -5769, 2186, 491, -30260, -53286, -66659, -43340, -18044, 508, 18426, 10607, 10915, -12778, -21733, -18738, -11778, -16098, -15918, -3106, -12946, -14402, -7917, -11666, -5997, -16465, -9494, -3411, -25864, -15574, 8775, 1820, 6339, 5268, -22441, -25362, -15918, -4422, -9951, -9302, -4969, -12701, -5224, 12580, 15490, 10595, 10767, -9236, -20108, -17339, 591, 24978, 37390, 30337, 3691, 2844, 3193, -7905, -21795, -30096, -33313, -36517, -4443, 11279, -5195, -7277, -3852, -2793, 7863, -4213, 2550, 14537, 30065, 35241, 23246, 8069, -11713, -16495, -2628, 5392, 4060, 20423]
22652B0423K037j1941j5822k918j231j6441J2897P885r621J59K2331L01n02j7244
22638i687k2908k6933J3670K0048Q045q338n790j5340J8349L6515o949j1642m153
22625a5113r96O752K6267R608l477q253j0546K9117Q408j8421k5230n18k2093
22612b4495O506O038R800J7138N949j0807j3408L418M40m337j4571j4261P136
22599b5454K1512J094L840j3136J8051J3752j908j1383K4194R847j3542n114j697
22586B0056o128j5077K139J8054o791K0472k226n808j8728P264k3144k2409J1690
22573b0636K039k260J8532Q141K178m476J0692N313q406m818r792k9836N529r843
22559c7643L157m77j0363J540o177Q47l633q745K2911L1608l215J3304L163k088
$$ y = [20423, 22460, 10519, -5303, -8221, -9452, -25893, -12996, -5111, -14732, -14573, 7758, 8059, 7557, -9687, -32595, -59528, -45858, -25810, -17765, -26103, -31893, -47233, -28884, 7631, 682, -10960, -15113, -16109, -9357, 16910, 26518, 23041, 14788, 4242, 33359, 41767, 23346, -1884, -2402, -24495, -17989, -11951, -2151, 14987, 20936, 10129, -3279, 139, 579, -3758, -18329, -32590, -25454, -3942, -2848, 992, -12144, 5907, 19659, 17751, 6368, 30562, 40409, 26867, 21753, 20056, 13928, -1149, 990, 19044, 12253, 32725, 30499, 24691, 5963, 13227, -9917, -32326, -20636, -18597, -20857, -2325, 5816, 7994, 3518, 14210, 19523, 11117, 6299, -3493, -33329, -27800, -37643, -34486, -34963, -45326, -43786, -49963, -49116, -52749, -61494, -38583, -6975, -10190, 3114, 6277, 4189]
22545D189j2541n026l78K1856q328J966K2350J815n099L054j0057r914m225Q575
22531H237J2312O155P228N88n153k0019j1102q93j5765N96l746P709k800R33N44
22516a5176K0836N459m159J910j1681j7518N11l372J1556m415M736O979j6103
22503b0437o97O311K542Q196Q869J0759k1409n89o424k0449J1319O057K0789K1839
22489B6676j6625j2056j2152J685N281l022j4174j3382K701J3290J3385j5732
22477b4125L40N195j5768q176q29Q551K8911L660o98r68P001j1329K026j9127
22463b5336o533k716J7624J0989j6492q220M675J3224J2384J8014k2212j703L723
22450b579m303j2620K906J4555M612l855Q346l430P539l831N651j2099J4120J1648
$$ y = [4189, -8352, -13378, -13756, 8100, -228, 1738, 24088, 25903, 20804, 23858, 13801, 3887, -338, 8237, 20549, 26704, 33932, 34520, 29367, 9348, -1754, -2647, -18412, -17816, -21562, -13853, -16653, -15720, -15176, 5660, 11119, 6960, 8870, -2811, -20329, -19818, -23190, -11634, -16049, -11313, -4334, -20437, -21134, -14823, -12281, -4085, 4784, 15543, -5866, -6455, -12879, -33328, -22009, -15952, 4837, 26676, 10051, -2005, -14157, -12472, -7191, -10213, -24387, -37769, -35068, -21778, -8393, -24125, -23785, -18590, -34358, -42534, -43363, -34812, -5901, -2241, -2939, -3907, 3094, -8235, -6209, -25336, -31869, -34585, -16961, -5972, -22464, -30684, -26009, -12785, -401, 17613, -4599, -6302, -2579, -6882, -19502, -16596, -2041, 2571, -1284, 7062, 3632, 11171, 7340, 12991, 892, 15012, 26660]
22436B6660q248k1866R490J2557r881M14k621o329J086N400K257p981K125m15
22422B648L696o349j3043K27o36m836J0985J0019r870j015j684J044P028K815
22408A029q070J9396n685k1821q750J5586J0311J1163R494j793m001j3802j5177
22395a2120l722R435J8956J408n188O302P233J0650n016k7511j1346J4624n904
22382b199O268k9406j6433R649m716L136l129o710Q808J4209J1877J7338L789
22369A2481N43M252k072K176j9360k0286N064l666K1665K7696j8477q086n72j2640
22355a1282M83P852p99j2923r386m952O513J5344J2478Q900O988P147j4199k7184
22341a5020L028N959k1520J3160J0324J1617O364k6236o619J030r789m329J7855
$$ y = [26660, 18412, -3454, 6036, 18593, 8712, 9126, 6505, 176, 1262, 6662, 8919, 938, 3063, 2648, 6344, -5, -13048, -12821, -13457, -18293, -7308, 2711, -7159, -8174, -9858, -8814, -1786, 1029, -7041, 12355, 6670, -15151, -23901, -8315, 1996, 13159, 22653, 20860, 16859, 3057, -12120, -15842, -6407, 12549, 13957, 8769, 15071, 22304, 32954, 27938, 427, -10919, 3705, -2199, 4069, -25337, -41770, -32121, -36837, -33701, -36830, -43540, -34732, -20523, -8646, 8692, 12481, 13024, 17276, 15204, 17380, -1980, -22266, -17202, -20868, 797, 28493, 10016, 1930, 1358, -11282, -10799, -2947, -3746, -16669, -26055, -31007, -24494, -9150, 3328, 12228, 19216, 26363, 12164, -15020, -11992, -6033, -27553, -14393, -4069, 7548, 13912, -12324, -18943, -17913, -27702, -32031, -14176]
22328a4176K1610j1506k699K927O14q68m879j656J9666j1917p893k182J0849N
22314b105j900j2617N648m33r406m861k74J3062P183l637J5673j88r080m168q81
22299g984J5523N340N539j6084l1587J438J2271J1316J4875j3605j7638j3644
22287c4240k629J5679j1635n295O723J8874Q853j2522p488l565j6555k490j305
22274d7595p672O043J6758M86l347j335K0521o540k20R127j4719j0002k860o19
22260d1974J3450j07J5459J1321l063J455J7419L193n37j1579J769p330k1108
22247b1632o074q456K171R354r354k4089n037J3919J5162J5755M889R706J693
22234a993p149j2132p238K52Q513j706o804K20O514K1981J90K164P358Q171j3821
$$ y = [-14176, 7434, -4072, -6771, -3844, -3230, -4098, -8977, -10633, 9033, -2884, -10777, -12959, -2110, -2105, -4005, -16622, -10974, -11407, -20813, -25674, -25948, -12886, -5703, -9340, 6333, 6145, -2935, -7103, -7984, 7539, 12879, 18418, 2334, -29253, -27815, -15544, -4228, 10647, -2958, -20596, -34240, -36869, -21190, -32825, -38120, -31397, -12523, -3670, -16192, -23680, -27245, -43800, -46290, -47595, -55267, -49224, -32466, -31980, -35327, -36662, -16141, -22681, -22901, -13774, -28493, -38495, -41355, -41974, -28524, -28631, -13172, -1851, -4914, -3459, 13960, 17153, 16616, 5037, 6806, -524, -21632, -27706, -36162, -33991, -24637, -33991, -58080, -63117, -49198, -34036, -18281, -13392, -3686, -1993, -9142, -21274, -28512, -28260, -19747, -21453, -28257, -28037, -21523, 458, 648, 2812, 10170, 18341, 4520]
22219D520j7051k8618j8358K0517K7242Q69j6985j984J6714J5175j8019l0l418
22206a9426J309o720J2855k9j5070M559J1873j0822j4692P524Q383O449j7270
22193c1077J729Q667l534l263J1073J3080m506O764m464k144J954K4542K5957
22180D4778k1896j3661J6705j1689j9956K773K9467L150j0922j341n160q475j581
22167B192k7063j6828K51m440j7421q601J3467K8140J4077k558o578K296K5046
22154A980r266l8652M593K0169P632J0003J6471q757p049R181P979R339j3037
22141A0586r768J6619J3344o513l6290M705o527j0494j2517M591l941N181J3089
22128a7935J0197o890j6871o953J6274j0573K539j0324j7211q05J1715R436O064
$$ y = [4520, -12531, -41149, -59507, -38990, -11748, -10879, -27864, -29848, -13134, 2041, -15978, -16008, -19426, -18117, -24837, -11982, -12011, -27081, -22522, -10649, -21471, -36163, -28639, -20256, -13807, -31077, -29348, -20681, -24215, -27478, -16405, -3325, -7831, -1067, -5531, -7675, -5721, 18821, 44778, 22882, 9221, 25926, 14237, -5719, -2946, 26521, 29671, 18749, 17408, 12248, 3773, 2192, -24871, -41699, -41448, -45888, -63309, -71910, -58443, -30303, -16226, -18784, -25362, -23066, 1980, -7286, -45938, -41345, -21176, -13544, -3541, 12930, 4173, -2876, 6305, 14284, 23623, 10586, 818, 17437, 30781, 24268, -12022, -7317, -13844, -24338, -36855, -32264, -36205, -31024, -17935, -7738, -14628, -31499, -38452, -22178, -32751, -30212, -40536, -57747, -58552, -46837, -37401, -31337]
22115c1337J324R985n193M860K092K5393m669k916n33Q392O133k1696j0922O345
22101a2742l190j650j207m512j1616O918K1620P923P493N034j3919l2514p605
22088c9967q21K9949R912k412j3851R609j640P380J9308n243k6991j7016k010
22075c3793M181K293J3840M333j4612m743R484J8677O619l856j1907j1523l916
22062b4923k933K765k07J1294j2548J1015J4151k381O767P945k0977P68k983k1126
22048c3373p787Q230L065k56n770J1255N184Q891o518l068J6821K326R462K545
22034A1007j233p442M627k744n629J4985j3977l2425Q093R824Q453J6409j187
22021H761M429m850o473j9717j7230Q370K119J5454j6937j2589J8289K0456Q785
$$ y = [-31337, -30013, -20028, -25221, -20361, -18269, 7124, 2455, -461, -994, 7398, 13531, -8165, -19087, -12742, -15932, -17582, -18789, -23301, -34917, -27999, -6379, 1544, 9037, 14071, 152, -32362, -39967, -40788, -10839, -927, -3339, -17190, -7581, -9221, -1841, 17467, 12224, -14767, -31783, -33793, -29612, -27319, -13479, -9146, -23758, -28501, -19017, -340, 6279, 2423, -9484, -21007, -24923, -27856, -25091, -25298, -14004, -26552, -15537, -1386, -3767, 3000, 10945, -10032, -9264, -12247, -33373, -41160, -32930, -29865, -30121, -35891, -24636, -19452, -10561, -17079, -20147, -3326, -1000, 8462, 11007, 9774, 2332, 6959, 4215, -1414, 13571, -406, -32831, -24738, -14914, -6461, 9948, 8761, 13190, 8340, 1867, -17850, -35080, -26710, -24591, -9137, -26074, -38663, -20374, 82, 8867]
22008H867j6032r072M539j6631m895L4799j0055j4884O071P574J0533P876N567
21995A4257j6094k9649p565P064r559k865O692Q436J36K0532J5183m251M514J0335
21981A7166P214n505k385j2097j3877J194R580o800o206j2157k791Q693L044K3436
21967H509L953o46p047o776k5548j0857J8676Q648k0396k211J4759J3776n184
21954a0344k32k137N737j4705P905K3627m900l134p814q444j4091n782N54l162
21940c6922M452J1224R302K1366K6197K757j4538k0749j1810k3398j4993o715
21928e3827J3091J8735P889K8592K0589q029l728J0762k479j7410j3390l239j8098
21915b0542R297K3512R814J2006O078l4222j9632m285n102n017J3213p98m968
$$ y = [8867, -7165, -16237, -11698, -28329, -33224, 1575, -8480, -23364, -17293, -9719, 814, 8690, 14257, -1837, -31486, -39051, -31987, -41546, -44411, -37719, -29283, -29147, -8615, 6568, 2317, 6831, 17166, 24380, 18875, 16490, 4393, -9484, -8290, 1290, -5510, -11716, -23873, -26664, -17971, -14927, 8509, 12462, 11816, 4769, -2007, -27555, -38412, -19736, -11088, -31484, -33695, -18936, -5160, -10344, -10576, -12713, -6976, -21681, -13776, 9851, 4951, 1817, -5997, -14441, -28532, -34314, -33760, -36922, -32470, -21246, -11944, 9422, 35619, 38376, 23838, 3089, -8721, -32119, -47112, -53827, -40736, -22001, -14112, 14480, 35069, 27040, 23312, 34074, 31595, 14185, 795, -2444, -20542, -11245, 12267, 22081, 34087, 40165, 5943, -13689, -17974, -23076, -28093, -14880, -15678, -20646]
21902b0646K257J1699j0319n299O456l233J599J3858L1314m983k2498j2640o549
21889a8984J1494J093l836j0450r42K7287Q618N229j4152Q20M809j1653o639r047
21875a6353o405N653J1251r507m326J003n513J9916P328k628j9599J4618K5635
21862B1073j2390k6458q951J9622j6745k2146j5195J1896J4368M180N863n191
21850c0074j4130J3196j1731n705Q450K973J355k928N275K0788M340J5948k290
21837E467J5570J2378j176j1299j6368k4228N822n948q59J0733P091J431M896
21824C510J5465l244l6022j4719l676Q398m106K984N405O36J3760K0668R066N733
21810B3858K226p140J199L910k7950r567k771n93J2052l731K385J7219K399o304
$$ y = [-20646, -18389, -6690, -17009, -22308, -15852, -19085, -17486, -3628, 27686, 22703, 205, -12435, -18984, -7490, -6397, -10233, -20683, -21625, 5662, 14280, 19509, 5357, 6177, 10986, -667, -7306, -16353, -22758, -17105, -5854, -15361, -19687, -18684, -24197, -4281, 3047, 419, -19180, -4562, 21073, 8683, -17775, -26726, -7104, -23849, -45995, -61190, -49294, -34926, -30746, -24883, -30074, -44204, -31008, -42739, -48444, -39994, -37021, -35666, -38594, -33319, -12531, -8191, 7757, 5467, 21037, 33415, 32239, 20940, 4572, -19656, -13834, -19782, -20641, -9908, -2817, -1386, 3510, 18975, 15731, -20291, -35010, -38686, -30288, -34394, -31410, -26005, -25369, -11609, 9059, 18125, 23858, 26084, 18944, 20143, 24053, -3897, -13464, -16235, -16828, -4776, -8507, -6122, 11097, 13496, 7192]
21796G192J3355K900J77o803J277L858k151j0451o967o742j9720j3528J0312J3980
21782a3311N165M340l922L176K905o108m632K976N916P557o567J6628m053j8145
21768h075O618M967n519k3392L160J8058L572l525L1027K1347j8947k7731j3737
21755a2177j7876K183K1643N380p158J0507R221R094j1474q933M18J2157k093
21742A0892k751n092R139L216j6317q730R69R685L581l801K935j2664l289J1716
21728e11J9891P514j7109l4903P031J8467p081j4661m430j2642o28J3750J637
21715b3675j0286K3034J0469n556j7J46R981K44o431k1916p281J4862L6017P671
21701B7262j587l039j1933o992j5672j954j6594k5714n368P972K6741L5624p823
$$ y = [7192, 20547, 23447, 23624, 16821, 18098, 21956, 19805, 9354, 2387, -4355, -24075, -37603, -27291, -13311, -8146, -3806, -7728, -4552, -1647, -7755, -12387, -9411, -3495, 4062, -2505, 14123, 10070, -8075, -1457, 3510, -2009, -25401, -22241, -4183, -611, -4136, 26891, 48238, 29291, 1560, -12177, -30053, -27870, -6227, -847, -8005, 2502, 11723, 20817, 9343, 410, 828, 12985, 10892, 8141, 3049, 12188, 15404, -913, -9643, -8674, 1011, 4592, 791, 3726, -8938, -12227, -511, 19380, 26894, 9785, -25118, -18087, 380, -6701, -21362, -25792, -38434, -39062, -25312, -23675, -33961, -10927, -458, -6014, -6031, -5885, 4096, 4340, -2091, -24007, -31288, -16426, 19591, 27262, 25675, 22636, 10703, 3711, -11961, -13915, -30509, -56223, -61591, -53619, -26878, 8746, 923]
21688I23p276R758j3641m901j0777q346j7621j5020K1646J4095o004P528L4274
21675D638j8229j0656p250k7039q828J3461K6890K5012K7180k747j5637J0784
21663A7579N489l919n969j0679j3091L822O608r033j5089Q733K1905J213n904
21650A665R20r948J4737O11n713r551Q468O642J2795j169p034m556L301r655q608
21635g095n421J6057J4346m192k1877j2427j553J0262J801j8515J0735O396o084
21622a7567L490K2578O835j6673K2820m239j7004j751j2109Q096o642j8015o335
21609c6516Q130J2178R599r626j65R837k1426K808J468J1934j490O427M869P13
21595a260J0125N301k0209o097J6812L300o988n260j0306J8187K4290m848Q537
$$ y = [923, -6353, 3405, -10236, -15137, -25914, -34260, -51881, -66901, -45255, -31160, -37164, -29636, 4638, -13591, -24247, -31497, -58536, -67364, -53903, -27013, -2001, 25179, 22432, 6795, 17579, 23068, 19149, 13180, 2501, -10590, -6768, -160, -9193, -24282, -15549, 6356, 7569, 1665, 2585, -7363, 7374, 7985, 2272, -7279, 1189, 7831, 20626, 19457, 12423, 7867, 11168, 1513, -7095, -12516, 3541, 17887, 13695, -8182, -20609, -22162, -11900, -10099, -28614, -17879, -11483, -17567, -14077, 8501, 15336, -1337, 21483, 17244, 240, -1511, -13620, -5524, -12166, -30181, -36516, -28386, -16208, -6609, -16235, -16400, -6563, -27989, -25181, -23713, -11779, -13269, -6842, -1973, -1260, 8865, 14166, -6043, -12140, 4672, 7972, 984, -4276, -14582, 3605, 27895, 23047, 31584]
21582C1584l883l2454N011J1686q000j5703P846M98o706j3158r801J9325j4315
21569b8070K7K0915J1259J761n483o447O279q69q799Q616R106L771R06j0942j1613
21554i583N172r646j67J0579k839j8983j2871R504J2774L0198O294l42l855r373
21540F862j2129p47o962J2537J1785J4598N161J953j5696j0444k6618j9597j2
21527c9309o492L299Q065J0083l2k433K0394J6857j2286q79j365j7546j1580L310
21513b9914M95O415n698J1667M704n322J5185k2467j7065j1756R964J5712L941
21500b4139o358J9269R620p11o365J25N390Q426l716L16m167Pk977N280n090k1502
21484b6592K2575K0789j6183m991j1373R475K3984J4214J3987m419j9531j2880
$$ y = [31584, 27701, -4753, 258, 11944, 3944, -11759, -3913, -3415, -10121, -23279, -33080, -13755, -28070, -28043, -7128, 4131, 5892, 409, -6038, 241, -628, -9427, -811, 8295, 12066, 12972, 2030, -9583, -4411, -14057, -14224, -3645, -6484, -25467, -38338, -28834, -16060, 14138, 20432, 20090, 16235, 6862, -5267, -6014, -12976, -439, 11346, 25944, 31105, 33058, 17362, 6918, -19700, -39297, -39309, -45801, -42502, -34437, -24354, -24386, -26819, -6425, 10432, -1854, -2733, -4098, -21644, -33224, -29914, -29419, -23004, -28702, -17035, -12331, -17653, -2468, -24935, -42000, -53756, -43792, -28080, -24139, -30497, -11228, -1608, -2319, -8684, -8559, -3169, 5257, 1541, 1857, -2310, -2303, -5280, 0, -5090, -26592, -4017, 16772, 589, -4402, -15775, -6300, 17684, 31898, 45885, 41466, 21935, 9055]
21472I055N27m645J849j1377j3602p224K350j9438R025r20j163o300L483j4903
21458e3283k7123J4206O679J9081K1839n758m637P116l280j3792p411J416l808
21445d8755p407J104O217J6369J3515J8620J865L358O976l777N895k182R804l773
21431A7829L675r16m366J2608n86K0334l701q352J8978R743j5979J0583L297o420
21417E6727l628o924j0539j5827P21j512Q848P827k3902j2017j4342m283J2934
21404e917P102J1533j7378k9383o087j792J9982M204J306L230m550l2986q001
21391e8737J5973J1171l677q738j3602N946K1990j93l298M942K373J6644J4163
21378D957j3266n765Q396P426Q347P52J0236N414J735n270R161P762J6904K164
$$ y = [9055, 9582, 4937, 6786, -4591, -18193, -25417, -23067, -42505, -33480, -34400, -35563, -41863, -38380, -53283, -80406, -66200, -59521, -40440, -18601, -24359, -28996, -21880, -25160, -38952, -46363, -44947, -48755, -56162, -55058, -48841, -32472, -18957, -337, 1528, 4886, 11862, 8085, 13980, 11798, 21602, 17829, 21504, 20588, 16222, 28830, 28244, 48578, 44877, 36525, 55503, 65246, 49267, 59850, 63147, 56727, 53099, 46175, 35636, 19809, 20530, 19018, 27866, 35693, 11791, -226, -14568, -18851, -5917, 1185, 12718, -4660, -34043, -40130, -41922, -21940, -17736, -16430, -13200, -17750, -50736, -58737, -42764, -31593, -35270, -44008, -57610, -51664, -29674, -29867, -33165, -28223, -25850, -9206, 4957, -8309, -14074, -5678, 1748, 10095, 10847, 21083, 26497, 28232, 22962, 32123, 39885, 56789, 58953]
21364E8953q295j011K203p230j8664j6807m492R92L109j1049k1230l015J9840
21351f696m007j9237R89K1743P647k1307j738J3439M675K56O429P01J256q008
21337c858Q263j8295k3593r812n432J6020Q165N933k870k786Q00L095j1131L105
21323c2396K658O278R177j2952j3879Q385R88n10K1842o53k6400p093m031K1649
21309b6937O953M564M961j0953L37L039M348P523r277m892o972K356K6589R106
21295A0745R960j9539k496j9404j3459K8716K75J3017K000k5175M194R015j1056
21282a3207j0994Q580Q73m879P059j0597j2045n748n70J5985N502J532m996l392
21268b6897k2297J6709K0711L107O135q238L450p951N823j4236k5243N380K4545
$$ y = [58953, 50658, 49647, 51850, 44620, 25956, 9149, 4657, 5649, 8758, -2291, -23521, -26536, -6696, -10703, -29940, -28951, -7208, 439, -20868, -22606, -9167, -4492, -4236, 2193, 2894, 4150, -3858, 4405, -13890, -37483, -47295, -52727, -36707, -28542, -22609, -25479, -28265, -27465, -24370, -35501, -32396, -29738, -23460, -14283, -27235, -41114, -32729, -31741, -32251, -10409, -11062, -37462, -44555, -48586, -26937, -19984, -15420, -10459, -21412, -21075, -18036, -13688, -6165, -15442, -20334, -27306, -24950, 1639, 10745, 20705, 1166, -1330, -20734, -34193, -5477, -5202, 7815, 9815, -15360, -11166, -2151, -13207, -24201, -15621, -14748, -19627, -12568, -23165, -35210, -40958, -41528, -25543, -20041, -18509, -23505, -26897, -49194, -32485, -11774, -8667, -2532, -10770, -7320, -15271, -9448, -23684, -48927, -43547, -19002]
21255a9002p41J122J607m25J6300K2285l281j6385r779M132K0084J6298j8097
21242A4118q232k4597j8599k346M195r88M615J8970R988O027k3273m197K692k686
21228b4313l543J0426J4063o127o249k45Q800P520J1035l149k8548n916k852l661
21214c2759J6631J5029j4581j6495J6420K901J005M061L610Q377m24J2020r50
21201A4845j5871r039n516j0906j244J0771K1836j6684o988m545j346J5328J0077
21188G18q764q722k3980j1020J0450k020K806J7242L2613J3329P981m873Q695
21175C4455J65j466l720k6538r370j6545L39j4066Q915J1078o501O470J2325M66
21161c993L778j6102j7411k78Q844Q807J4812K410j9214K559Q581L684q12J0956
$$ y = [-19002, -19743, -18621, -17014, -17439, -1139, 21146, 17865, 1480, -8299, -4167, 15917, 32215, 14118, 5886, -18711, -37310, -39656, -35461, -36449, -31834, -12864, -2876, 3151, -20122, -24319, -21627, -24313, -27856, -17430, -3367, -9494, -15743, -15988, -7188, 332, 11367, 8218, -20330, -26246, -29098, -32759, -16128, -1099, -15680, -32175, -15755, -12854, -11849, -7788, -4178, 4199, 3775, 15795, 14845, -1026, -10065, -15581, -26487, -27731, -16960, 4876, -11808, -18796, -23341, -24687, -9359, 718, -8046, -16768, -40748, -51768, -41318, -43338, -40532, -23290, 9323, 22652, 30633, 25760, 34455, 34620, 33154, 29434, 2896, -6474, -23019, -22680, -36746, -27831, -16753, -23254, -16784, -4459, -3993, -215, -16317, -33728, -34006, -25162, -16355, -1543, 867, -18347, -15788, -7207, -3523, -4335, 6621]
21147F621K031q262l063m433j6747M739p43M465O780J763n547j8311k0286R72
21133e0021Q584J3920J0406K810j367J6891J883n052j0336K599q307k8184q762
21120e4936K96m793N575R387J8922J0528K303N350q62m826L023n829m05q640r033
21105c3940p699O74J4810o480m678J8473J3978k404j1569J4023R642J3830K1818
21092D0478k0164j3204J638K8215K728m052l782l559p924k2469r080J272P39K0699
21078A1535N289n980j7359j1003p573n845j1888j556K0462K0520J3468p371K249
21065D948Q316K612j5157j3463o957J3735J5989J21M795o864m947k703P08j600
21051d67k528J1409j3779j1606j6180J6894J7984j0652k9898J807J5304P538q287
$$ y = [6621, 8652, 390, -2673, -7106, -23853, -19114, -19857, -15392, -8612, -6849, -12396, -30707, -50993, -50021, -41437, -27517, -17111, -14301, -15668, 1223, 3106, -1946, -12282, -9683, -17990, -46174, -54936, -54640, -59433, -53858, -44471, -25549, -15021, -12718, -7368, -8230, -13056, -10033, -15862, -16267, -24907, -33940, -41639, -40965, -26155, -32635, -37313, -18840, -4862, -7266, -18835, -4812, 4830, 18660, 40478, 20314, 7110, 8748, 36963, 39691, 35639, 31857, 28298, 20374, -2095, -11175, -9903, -9164, 11535, 16824, 10844, -6515, -17518, -25091, -30936, -42824, -44380, -23918, -3398, 10070, 2699, 4948, 13264, 15876, 719, -12744, -19701, -5966, 10023, 10144, 14939, 8075, 3128, 425, 1133, -467, -2995, 8414, -5365, -16971, -33151, -16257, 1727, -8925, -38823, -37016, -21712, -14174, -22461]
21038b2461k5013J587O807k733j5150J463j1076J4007L755j676K0619J7638L676
21025h557k484K71j961Q966J593J882M131O266m310K59j3108l1005j2613j8144
21011f8814N063K2824O294Q018p795j0856K000J1412M1916N832j1910q852L285
20998a583p380J1651M624k6714P552J7831l116n92J809M022J8666J9517j0452
20985C5835p281N237r579k8350j1557j2814o538N662O258J0206k162O405K5841
20972A7163R164l266k809L698j1104j1759N752j0660k3216K2870O447j1696K815
20959f601J5648l616n675O016J0879l87k449q968O159K11N57J5812m592q912j6515
20944b433J1564M163j9817j4891J0743p86j2035l290M144P989Q108j3840o960
$$ y = [-22461, -47474, -45887, -39080, -41813, -56963, -55500, -66576, -52569, -48814, -50490, -29871, -12233, -8557, -11041, -10770, -12731, -3765, -2172, -290, 3841, 10107, 5797, 6056, -7052, -38057, -50670, -68814, -63751, -40927, -34633, -26615, -34410, -45266, -43266, -31854, 10062, 15894, 3984, -4868, -1583, -8963, 2688, 7312, -19402, -11850, 5981, 2865, 2273, 4082, 8104, 26770, 46287, 35835, 28554, 33791, 24212, -4138, -15695, -28509, -35047, -29385, -23127, -12921, -15083, -8678, 17163, 26327, 23061, 20252, 23950, 12846, 1087, 6839, -3821, -27037, -4167, 2280, -9416, -6601, 9047, 5431, -244, 5772, 16651, 16264, 13815, 4847, 11006, 11217, 11774, 27586, 22994, 14082, -2433, 9131, 13294, -6523, -21414, -10671, -11457, -23492, -26782, -22638, -14649, -6541, -20381, -27341]
20931b7341r32m510j9012j010R410K2890J6386j4636j4050R352j760R993j8438
20918c3658J6130J4525j3222n49r987l944l749N150l515K1880R174J408j2199
20905a2556m437j779M410L074o878R968Q424J023k7156Q075J1985Q313J825J2857
20891A7148o826k9192R190O871q556l676n143J6057J4273K762j1842N097L260
20878I423P94j629J838J555n186L539j071N817j2284N321o467J5606N919j4650
20864H525j6365K827K3393J297q686J4056L175j8858O997r617j6784N700M785
20851D45R750M872r95m970p360l212J4914j5567k7227J2019L261r997j95o543
20837c0805j0527Q586Q367J0445M813k1035j292P726M366q88O246J8179M6168
$$ y = [-27341, -28273, -32783, -51795, -52805, -43395, -20505, -4119, -18755, -32805, -23453, -25213, -15220, -33658, -17528, -3003, -16225, -16774, -26761, -30705, -34454, -29304, -32819, -10939, -1765, -357, -12556, -16993, -18772, -14362, -11288, -18166, -8198, 226, 1249, -25907, -17832, -5847, 2466, 4291, 17148, 10322, -18870, -9680, -2809, -11365, -15041, -20184, -4127, 10146, 12908, 1066, 6163, 9423, 10217, 8588, 10426, 11981, 6795, 10334, 9263, 15080, 2796, 8117, 1650, 17256, 23175, 8525, -7840, -5013, 18380, 19677, 10991, 25047, 28222, 9364, 16361, 6744, -10040, -4340, 445, 10195, 15067, 14072, 9102, 1742, -1470, 13444, -2123, -29350, -17331, -14070, -24067, -24262, -30805, -41332, -32746, -24379, -13934, -9121, -30156, -31448, -23722, -19356, -20244, -13998, 4181, 50349]
20824E0349J655j2178j9703k2556j5670L304j1410j6428j946K4466k702K6628
20812C809J4455n884j2415j4830l387J7416Q343j0340k0532j2042j6896J2912
20800c9391J3250q244k252R033J924J5792J0380k583L870J1853J1707K809P904
20787C6052j480r121k7267j2552J1136K0492R439J7963m732k3321j6937r110Q412
20774a026M773j3247j1689K270p167p465j1765j0999j1735J1749K0996J3584J2492
20761i229o991q629L291J6262O834r493j2537m983j2010R179J1217k311p937K911
20747b4426j5647P231J0534N033n369P255q309n299r940j7041k593N835K9532
20734b3204J0764L229M060l251J751j6649k1430O79J1290k584j911j398J962r282
$$ y = [50349, 52004, 39826, 20123, -2433, -18103, -14799, -26209, -42637, -44583, -20117, -22819, 3809, 18264, 12380, -35, -14865, -18252, -836, 7507, -2833, -23365, -35407, -52303, -39391, -26141, -34385, -36637, -27604, -25680, -9888, 492, -2091, 1779, 13632, 25339, 28148, 36052, 34572, 25451, -1816, -14368, -3232, 17260, 26699, 44662, 39930, 16609, -328, -9438, -1026, 3747, -9500, -21189, -18919, -26086, -33551, -45316, -56315, -68050, -56301, -35305, -21721, -9229, -16220, -24849, -21558, -5296, 1538, -7955, -20492, -25475, -37485, -28306, -17089, -19400, -27337, -24426, -40073, -32842, -22308, -17275, -22644, -15389, -23698, -28997, -38937, -55978, -58571, -52736, -23204, -12440, -9211, -5151, -8402, -6651, -23300, -44730, -44051, -32761, -35345, -37256, -38654, -36692, -45974]
20720d5974l975K273J3481j232l1363N770K6644J5896J4635r057j9176r615j2196
20707e3889J0348K3653Q173K679j0044K959J3586j0907l0596l21J8331M0896m964
20694I904r314j0608l166O094N969l895j549J2295j994l559j0723q260J852J6086
20680h68Q246j324k0263R362p401l6007P505j29r235N69r799J7025J4949n126
20666c2496j2836j104J8607j006j2873k995K4483J8394R986q443k794q650J304
20653a0423Q686q415j6220p802l302P37K5838l052k3541K349P5j791J1000K042
20639b3819R263P36K281N079M291p295P67j6520N289j6008r221L484J4933p17
20625b7457O068M81j5283j2663M547m621J68Q447J787N676K6802N232j4994j3298
$$ y = [-45974, -49949, -47676, -34195, -35427, -66790, -61020, -34376, -18480, -3845, -12902, -32078, -41693, -53889, -43541, -19888, -11715, -9036, -19080, -16121, -2535, -13442, -44038, -44359, -26028, 14868, 9904, 590, -10018, -13184, -7090, -1121, -5016, -6565, 5730, 3736, 177, -10546, -18806, -16954, -868, 7378, 6054, -14209, -4847, -12248, -48255, -40750, -40879, -50114, -49545, -59344, -42319, -27370, -32496, -45332, -46436, -27829, -28835, -41708, -44703, -20220, -1826, 8160, -283, -3077, -11727, -10423, -1737, -10152, -26372, -34174, -37476, -36739, -10901, -13953, -37494, -35145, -35070, -36861, -25861, -23819, -14556, -13820, -11539, -6460, -2169, -9464, -8697, -25217, -19928, -35936, -45157, -41673, -26740, -27457, -21389, -20908, -36191, -48854, -44307, -48928, -48760, -40313, -38526, -32850, -6048, -816, -15810, -29108]
20611b9108n321J197J345J0237K1450L749j1826k0019N864K18J5830j9972j635
20598b7991J0305n716Q75M330J0753m448M337O377J290J7071j3477O448L115j0318
20584B951p265j4958L280j1630j566J374R786M143P68L502K26J512q764j2453
20570b9094J4098l401k564l340q274O350J041n111j3125p800r333K5982J2627
20557b1944J616j746Q69k7280n171R182P703p2J3725K9395K3610Q125j7845j5890
20543D277q728o538n017L988l246q325k0369L411J8642j1537k0012j021m872R502
20529d9845J7735K0841o602l6421j6019J0098J1938P926J1469P275J5242N827
20517e36j8274M061l68j8341q131J6855K0894R107j3214m452K5609j5702r579
$$ y = [-29108, -34429, -33232, -31887, -21650, -200, 3549, -8277, -28296, -22432, -22214, -6384, -26356, -27991, -17686, -23402, -22527, -18197, -7444, -11892, -7555, -1178, 112, 17183, 3706, 10154, 13269, 2951, -4314, -19272, -15992, -27622, -29188, -27814, -18028, -13885, -13117, -9615, -9389, -7877, -16641, -29094, -14996, -18397, -20961, -24301, -32575, -26225, -25184, -30295, -43420, -51220, -60553, -34571, -21944, -20328, -22074, -21205, -48485, -53656, -44474, -36771, -36843, -23118, 6277, 29887, 38012, 20167, 4277, -4451, -10989, -16006, -12018, -15264, -23589, -43958, -40547, -21905, -33442, -53454, -54475, -59347, -49845, -32110, -11269, -17871, -54292, -70311, -60213, -48275, -40349, -28880, -21605, -6363, -536, -18810, -14749, -15117, -33458, -41589, -24734, -3840, 5267, -7947, -12399, 13210, -2492, -12071]
20504a2071j5881K429J8941P844J4946Q256k291j0436k0711j7324N612P996j8668
20491c1358j1899m169k53N340O333M046J099m599J4216J8132O4K116j4749O576
20477i105J3353p24k2371j8091n437j4746M646L0939L2033k172j9084q579Q542
20464a0796J0523J727k1860k1084n151Q798K4467L710j828K463M744K0634P683
20451B4030k314j1734l0680p604J6810j4237L304J8111M669k792J50r880k802
20438a4969q315j1941R132L2502J5032l409j3503M999J2873M805j3774j3006j1183
20425a0757J0222K2504q870j301m234j1000j1110N729J6159R595p016P558J674
20412A9153J2560j957k4105l5444j9899O328M675L784J610K4197k965J7923R596
$$ y = [-12071, -27952, -25523, -6582, 1262, 16208, 24464, 22173, 11737, -8974, -26298, -20686, -12690, -31358, -43257, -47426, -47679, -42339, -36006, -31960, -30861, -35460, -21244, -3112, -3048, -932, -15681, -9105, 4248, 3524, -18847, -36938, -42375, -57121, -52475, -21536, 10497, 8325, -10759, -19338, -10796, -273, 1454, -20406, -41490, -46641, -37843, -13376, -9666, -11494, -9031, -4287, 16347, 24030, 21716, 9982, -20698, -28302, -11492, -25729, -22425, -4314, 355, -2437, -2287, -12167, -14969, -23284, -35225, -26093, 6409, 21441, 18032, 4529, 9528, 22401, 27206, 13432, 426, -10757, -535, 21969, 13099, 11798, 7564, -3436, -14546, -8817, 7342, 16937, 9921, 17479, 19153, 31713, 29756, 5651, -29793, -49692, -43364, -38689, -34905, -33295, -9098, -12063, 5860, 15456]
20399A5456j3969p343L622n255N954q92P223q951o176j471k1487O18K1497K980
20385h194R30L394P895n157O746J150j6457L355Q930R704P090J2398l661k5803
20371B320l0226M42J5184M405P154K0200Q606m267J444O153J615q190j5908J2853
20357B1785j3257k689k45P532J5269j0207J2272Q652K4469J7280Q922J8238L155
20344A11176r387J936N592o438o977j0033J0312M645J8199K2197L7087K4239K3783
20331B26331M2601J5177N898J2198O288Q071L9126J5068m280L0220L9877L2509
20319D69084N6334O1194O9313O3712R9914R9681J04329J19002J09958J14862J47639
20308A515022J63549J68482J40911J13383J01479J30064J15290Q9352K2394j7535
$$ y = [15456, 1487, -5856, -2234, -7489, -1535, -2427, 4796, -4155, -10331, -11802, -33289, -32671, -11174, -8194, -7264, -3870, 4025, -1132, 5614, 6764, -9693, -6338, 2592, 12296, 19386, 31784, 28123, 2320, -27906, -27464, -12280, -7875, -721, 19479, 28085, 23818, 25262, 31415, 33030, 24840, 8932, 21785, 8528, 5839, 5594, 13126, 28395, 18188, 30460, 39112, 63581, 80861, 89783, 108021, 111176, 101789, 103725, 109317, 102879, 95902, 85869, 96181, 100826, 119025, 141222, 178309, 202548, 226331, 268932, 284109, 290007, 302205, 308493, 316564, 355690, 370758, 366478, 396698, 436575, 469084, 525418, 586612, 655925, 719637, 819551, 919232, 1023561, 1142563, 1252521, 1367383, 1515022, 1678571, 1847053, 1987964, 2101347, 2202826, 2332890, 2448180, 2537532, 2559926, 2542391]
20298B542391j8479J9122L4454J4508J866J201M3531N9190O1417N0921J0608K1028
20286B841758K9569M2043J1765o2735q3479m9219r318o189l8045m5716l7844n3741
20274B538849n7018o2226J104K1361j4628m6895o7920m7360j5939Q32M000M708
20262B258868j013k0813m3737k7782l6967m1043o668j5409q4916j24937q5884
20251A769699o3981p0365n6611p6152j07157j14280j22047j23158o0660o8984
20241I06304r4845p8944p2117n8683l6574j1563k7100j9134k0342l094k3903k0127
20229D39878j7619n8441l2780k6234k1932j0876k211m426j5432R013J347m545
20217B55742J097n85k4117j5665j5419j1751O391j978j2774M39j3723p537J1537
$$ y = [2542391, 2523912, 2543034, 2577488, 2591996, 2593862, 2595063, 2638594, 2697784, 2759201, 2810122, 2820730, 2841758, 2871327, 2913370, 2925135, 2862400, 2778921, 2729702, 2720384, 2714195, 2676150, 2630434, 2592590, 2538849, 2481831, 2419605, 2420709, 2442070, 2427442, 2380547, 2312627, 2265267, 2249328, 2250160, 2254160, 2258868, 2257855, 2237042, 2193305, 2165523, 2128556, 2087513, 2080845, 2065436, 1980520, 1855583, 1769699, 1705718, 1635353, 1578742, 1502590, 1395433, 1281153, 1159106, 1035948, 975288, 906304, 811459, 732515, 660398, 601715, 565141, 553578, 526478, 507344, 487002, 483908, 460005, 439878, 422259, 363818, 331038, 304804, 282872, 271996, 269785, 265359, 249927, 258940, 260287, 255742, 256839, 256254, 232137, 216472, 201053, 189302, 195693, 193715, 180941, 181380, 167657, 160120, 171657]
20204A71657P412j9338j4054m758O029k8674k8156q235l94r768j887J4984M917
20191H9735p666j9408p184j9248J763L7576K2118J5861q723j5281j1080j8645
20179E9818J4254k0789l1794J4048L3410l628j3710n182J4575p523k2688j7005
20167A3786o793J0741o683Q302K052J1294j0599k0294n153J3670j2981k4973n130
20154c2761J2631J9875J771k9083q782K181k506k8401n457K3614j864r094O218
20141e1658L682j507L656l485j5040M710P304Q789K1918K0666j7903k7428j635
20128d7931K516j5044J455j385j172L578M93m566m003l443k995j289K1528J411
20114e0847o685r192O143l438k901J1975Q689j2912o68K820J9711Q211j5510L651
$$ y = [171657, 179069, 159731, 145677, 140919, 146948, 118274, 90118, 81883, 81489, 71721, 69834, 84818, 89735, 82069, 62661, 55477, 36229, 37992, 75568, 97686, 113547, 104824, 89543, 78463, 59818, 74072, 53283, 21489, 35537, 68947, 65319, 51609, 46427, 61002, 53479, 30791, 13786, 6993, 17734, 11051, 19353, 21405, 32699, 22100, 1806, -3347, 10323, -2658, -27631, -32761, -20130, -255, 1516, -27567, -36349, -34168, -36674, -65075, -70532, -46918, -48782, -57876, -51658, -47976, -49483, -45827, -49312, -64352, -59642, -52338, -43549, -21631, -965, -18868, -46296, -47931, -45415, -60459, -59004, -60389, -61561, -57983, -57490, -62056, -66059, -69502, -72497, -73786, -52258, -50847, -57532, -66724, -60581, -64019, -66920, -54945, -46256, -59168, -59836, -57016, -37305, -29094, -44604, -40953]
20100d0953K4045J5365p060p815R429K6216n607k1803J846j0140M826Q995J9478
20087A6822J1382J717O226K65p87j5514J240R765n143L153j4246j6816P999j4340
20073h277k191m414m098N690l366O151j6717q425R112J2154M221Q747j1378j6523
20059b9314j466k079L437R024p474k7762k3944K009j572J3647J0108m472j9775
20046g9633N510J3758P548J6802K3913j2471k0258J320j7562O479K7355M918j3910
20033c6231p418J6819J8451P247J6428m615j3180j5206l297J2299L776j6175L685
20020a7417O624R286L460j2918K889K393k2343J1973K364N371J8520J3251M164
20007B7617n077k692j1854k0466m754J6975N084n105K1283J2056j2354j9634q917
$$ y = [-40953, -16908, -1543, -8603, -16418, -6989, 19227, 13620, -8183, -6337, -16477, -11651, -2656, 16822, 28204, 29921, 36147, 36412, 35625, 20111, 21351, 31116, 25973, 29126, 14880, -1936, 6063, -8277, -10468, -14882, -18980, -13290, -16656, -10505, -27222, -35647, -26535, -14381, -10160, -1413, -12791, -29314, -30780, -32859, -29422, -20398, -27872, -55634, -79578, -77569, -79141, -65494, -55386, -59858, -79633, -74123, -60365, -52817, -36015, -12102, -24573, -44831, -43511, -61073, -54594, -27239, -22321, -36231, -43649, -26830, -8379, -1132, 15296, 10681, -2499, -17705, -21002, -8703, -4927, -21102, -17417, -10793, -1507, 1953, -10965, -8076, -5683, -28026, -16053, -13689, -8318, 10202, 23453, 27617, 22540, 19848, 7994, -12472, -17226, -251, 4833, -272, 21011, 33067, 20713, 1079, -7838]
19994g838J0200J2507K386R60K0056J1058j4238k4070j2259l850P646J7071R2
19981A9721J4688K456J1613J4811Q917J220J049Q798J2970J6085J9788L2234J0218
19968A74568P908L0668M5384K9021J1815K0610L926Q124J8458K0947j3233J593
19956C59789P062L559J1118o83p245l03P750j4841l1514k0591j5250m574Q551
19943C02828k081j9526k8676j9065o106o126l6384k4399l3636l2665j2663j3338
19931F8163l0143q427j398k9999l7607l5669N136N682o947k993J0503j2430M30
19918g5699j8493j4081N240K211n95j012j5081r861L745R320P459J8263J5299
19905g3285J1446J5807M0792J1556P442K3995M6913L8512K8244L3132J7728L1771
$$ y = [-7838, 2362, 14869, 17255, 18215, 38271, 49329, 35091, 11021, -1238, -5088, 2558, 19629, 19721, 34409, 36865, 48478, 63289, 72206, 73426, 74475, 83273, 96243, 112328, 132116, 164350, 174568, 182476, 213144, 258528, 287549, 299364, 319974, 323900, 332024, 350482, 371429, 358196, 359789, 366851, 370410, 381528, 380845, 373600, 373297, 381047, 366206, 334692, 314101, 298851, 294277, 302828, 300747, 281221, 252545, 233480, 227374, 221248, 184864, 160465, 126829, 94164, 81501, 68163, 38020, 29593, 28195, -1804, -39411, -75080, -69944, -64262, -71209, -74202, -63699, -76129, -75699, -94192, -108273, -103033, -100822, -101417, -102429, -117510, -127371, -123626, -114306, -106847, -88584, -73285, -61839, -46032, -5240, 6316, 13758, 37753, 84666, 123178, 151422, 184554, 202282, 234053]
19893B34053L2125L2574K5125Q083M1399J9858K3834J2260l63P883L1266K9007
19881D97104J8315J0458J2485j783J928L151k052j4367p431j1646n876J054j0714
19868D90626j1373p229j0208N868J2761o335q332J7518J3065J3970J8701R662
19856E38694q491J0298k271J0605L1270M746L1256J9314L3784M1307L0903J2523
19844G53938J1991k933N015J8717R357k1425j8274M138j1315M885k0577k0061
19832G13456j7281p217k808j4054N771j769j7206J4077l71l4510j9538J1126J5812
19819F45488k4278k7491k3690O31o11k4282j1757J56J9290M9907K5763J1414J9236
19806F59776K5491M1069M6161O4288M5947L6664L2046L8626P9085Q8431M8708
$$ y = [234053, 266178, 298752, 323877, 331960, 373359, 393217, 417051, 429311, 428948, 436831, 468097, 497104, 515419, 525877, 538362, 536579, 538507, 541658, 539606, 525239, 517808, 506162, 500286, 501340, 490626, 479253, 472024, 461816, 467684, 480445, 474110, 465778, 483296, 496361, 510331, 529032, 538694, 530203, 540501, 538230, 548835, 580105, 584851, 616107, 635421, 669205, 710512, 741415, 753938, 765929, 762996, 768011, 786728, 796085, 774660, 756386, 760524, 749209, 754094, 733517, 713456, 696175, 688958, 686150, 672096, 677867, 676098, 658892, 672969, 672598, 638088, 618550, 629676, 645488, 621210, 593719, 570029, 570660, 570049, 545767, 534010, 534166, 553456, 603363, 629126, 640540, 659776, 685267, 726336, 772497, 836785, 882732, 919396, 951442, 990068, 1069153, 1157584, 1206292]
19795A206292N3366O0020P4125M9105P3462P6420P9873Q6140Q1874P7925R0848
19784B009450P4526Q5667R2732P7255Q5952J15679J06591J05197J08671J32368
19774B994088J17562J49036J40647J57869J57157J80290J66807J71321K00785
19765D435562K18003K44751K48211K69387K96226L28848L58767L82852M31703
19756G214310M50430N16387N61460N95683O61850P30841P89508Q34668Q28977
19747A3184114Q82312R63139J047792J105119J178769J216695J247552J319870
19739B2145362J429462J591163J739604J864635J984675K125395K286642K475407
19731C7642345K658626K908725L138413L415843L737885M105949M620096N291627
$$ y = [1206292, 1259658, 1319678, 1393803, 1442908, 1516370, 1592790, 1672663, 1758803, 1840677, 1918602, 2009450, 2083976, 2169643, 2262375, 2339630, 2425582, 2541261, 2647852, 2753049, 2861720, 2994088, 3111650, 3260686, 3401333, 3559202, 3716359, 3896649, 4063456, 4234777, 4435562, 4653565, 4898316, 5146527, 5415914, 5712140, 6040988, 6399755, 6782607, 7214310, 7664740, 8181127, 8742587, 9338270, 10000120, 10730961, 11520469, 12355137, 13184114, 14066426, 15029565, 16077357, 17182476, 18361245, 19577940, 20825492, 22145362, 23574824, 25165987, 26905591, 28770226, 30754901, 32880296, 35166938, 37642345, 40300971, 43209696, 46348109, 49763952, 53501837, 57607786, 62227882, 67519509]
19723F7519509O178237P349945Q813053J0291098J1393165J1804718J1793665
19716A35143390J2454542J4808959J8119410K0103319J8742003J4166365R387195
19709B42925183Q427518J2385671J6570959J6001819R859151J811921k519197
19702C05463025j221163K920797N592008N275949K557981l53362k427894m563269
19694C13244072n963370m118062J35958K066728j155365q650601j5733551j7540158
19686B62285651j3737203r072262q546428j2659559j8079498k0098027j7859253
19679A62233421j4174870j1405407j0335592j0390641j0211174r094625p483670
19672H9137442n991684m877668m085526l529470l104223k808155k593429k462837
$$ y = [67519509, 73697746, 81047691, 89860744, 100151842, 111545007, 123349725, 135143390, 147597932, 162406891, 180526301, 200629620, 219371623, 233537988, 242925183, 251352701, 263738372, 280309331, 296311150, 306170301, 307982222, 305463025, 304241862, 307162659, 312754667, 318030616, 320588597, 320235235, 317807341, 313244072, 307280702, 303162640, 303298598, 305365326, 304209961, 295559360, 279825809, 262285651, 248548448, 239476186, 230929758, 218270199, 200190701, 180092674, 162233421, 148058551, 136653144, 126317552, 115926911, 105715737, 96621112, 89137442, 83145758, 78268090, 74182564, 70653094, 67548871, 64740716, 62147287, 59684450]
19664E9684450k321498k188048k059010j928218j884823j926811j934243j902072
19656D3539727j797043j700183j709297j727880j756455j743125j669541j563655
19648B9872548j499744j457213j409743j375686j319171j246869j144876j066856
19640A9352390j020416r55625q98048q36147p78993p25562o91805o39576n91786
19631A2214432n58073n13184n04116m93878m45387m05297l94281l96139l63418
19622H140659l56807l37430k88572k88480k87792k57925k42431k54297k17457
19613E609468k12531j94140j92111j88030j74282j60433j47920j33963j23289
19604D082769j39198j24606j23340j24280j14265j14448r3513q1261r7876p8154
$$ y = [59684450, 57362952, 55174904, 53115894, 51187676, 49302853, 47376042, 45441799, 43539727, 41742684, 40042501, 38333204, 36605324, 34848869, 33105744, 31436203, 29872548, 28372804, 26915591, 25505848, 24130162, 22810991, 21564122, 20419246, 19352390, 18331974, 17376349, 16478301, 15642154, 14863161, 14137599, 13445794, 12806218, 12214432, 11656359, 11143175, 10639059, 10145181, 9699794, 9294497, 8900216, 8504077, 8140659, 7783852, 7446422, 7157850, 6869370, 6581578, 6323653, 6081222, 5826925, 5609468, 5396937, 5202797, 5010686, 4822656, 4648374, 4487941, 4340021, 4206058, 4082769, 3943571, 3818965, 3695625, 3571345, 3457080, 3342632, 3249119, 3167858, 3069982, 2991828]
19594B991828o8277o1073p6558n2705l4541m4217m3153n3715l2518j6665j2461
19583B495945p791l3977o1790l7016k7427k0812m5198l0867j4724l2029n8222
19572B126092k6489m7821l9897k1829j8001m2274m8652m7655k6172l5040l8546
19561A733716k8110m7316n3195l9222k6899l3423l7837j7657l5025m3858l6245
19550A334929k2578j2607k401O462L153k1634j5672o066Q27N678L1621L2016j0171
19537A323557K45J2052m065j5846j993K4574R119k9018l2700k0294j0559J5517
19525A270589l912k9855j7924l085j6250l072R84J472M127j4926k1436J735O938
19512A175385o942M846p555Q716j3343J907J6724J375J87J80l09n492L247J9634
$$ y = [2991828, 2923551, 2862478, 2785920, 2733215, 2698674, 2654457, 2611304, 2557589, 2525071, 2508406, 2495945, 2488154, 2454177, 2392387, 2355371, 2327944, 2307132, 2261934, 2231067, 2216343, 2184314, 2126092, 2099603, 2051782, 2011885, 1990056, 1972055, 1929781, 1881129, 1833474, 1807302, 1772262, 1733716, 1705606, 1658290, 1605095, 1565873, 1538974, 1505551, 1467714, 1450057, 1415032, 1371174, 1334929, 1312351, 1299744, 1297343, 1303805, 1306958, 1285324, 1269652, 1263586, 1264413, 1270091, 1301712, 1333728, 1323557, 1323802, 1335854, 1331789, 1315943, 1313950, 1338524, 1347643, 1318625, 1285925, 1265631, 1255072, 1270589, 1266677, 1236822, 1218898, 1215813, 1199563, 1196491, 1197475, 1198947, 1203074, 1188148, 1166712, 1168447, 1175385, 1168443, 1173289, 1165734, 1174450, 1161107, 1163014, 1179738, 1181113, 1181300, 1181480, 1181171, 1175679, 1178926, 1198560]
19498A198560J6510K5173L4122R521l62J6237n689J5595L388l656j1641j7191
19486A280567k2136N63K3061j2830l9208k8815k9393j7316j881m0234l2464J627
19474A081541N230p998k7268k4395q345j3338k6645j7664L763p401k4313k3889
19462I09278k8665l1735q670m899l4258j8707Q582P300O319p374k8045r832R94
19449G60288O641j1087L317l60n000r038j5116k5312m63j1686j9055m189J6586
19436F85526j2483k9605q840n413k0499k248Q011K29k7527k4657j3853n932P278
19423E49987n226n829K042J2897j000k4536n592J2181P287L219k4249j5653J1806
19410E17334R832J1807n39J9233l459m562n743N672J0660J1297k0010L532R295
$$ y = [1198560, 1215070, 1240243, 1274365, 1283886, 1283524, 1299761, 1294072, 1309667, 1313055, 1309399, 1297758, 1280567, 1258431, 1258994, 1282055, 1269225, 1230017, 1201202, 1171809, 1154493, 1152612, 1112378, 1079914, 1081541, 1086771, 1078773, 1051505, 1027110, 1018765, 1005427, 978782, 961118, 964881, 957480, 933167, 909278, 880613, 848878, 840208, 835309, 801051, 782344, 790926, 798226, 804545, 797171, 769126, 759294, 760288, 766929, 755842, 759159, 758799, 753799, 744761, 729645, 704333, 703870, 692184, 673129, 668940, 685526, 673043, 643438, 634598, 629185, 608686, 606438, 614449, 614678, 587151, 562494, 548641, 542709, 549987, 544761, 538932, 540974, 553871, 552871, 528335, 522743, 534924, 542211, 545430, 521181, 505528, 517334, 527166, 538973, 538434, 557667, 554208, 549646, 543903, 549575, 560235, 571532, 551522, 555054, 564349]
19397E64349O275j8206k026r627Q919l221Q937J3904K0972j2758k3029j1883J958
19384E44564J8471J5390K4897J4083q350l185o37M957j48r789j9774J2656L8335
19371F31470J1456j3676j319R09K560r287j5601k3231o964j2975j563J5951N226
19358E82956Q541J6080J8029p699J553j320l2445j8160k211j3320l084j6749n597
19345E26574J115J1943j6469l179j1462k1889O921O307J2833J1987P013j2380
19333E19314j1609j2890k7681n030J6875N731L162k1450j0844n581k6037m023
19321D19937p866k087J661n914L72m14j6022q468J4091J3514j3967r142J6125
19308D01820L968r365O230J5750j7279J0900k129k4752R042K483j7146j449J5413
$$ y = [564349, 570624, 552418, 550392, 540765, 549684, 546463, 555400, 569304, 590276, 577518, 554489, 542606, 544564, 563035, 578425, 603322, 617405, 609055, 605870, 605233, 610190, 610042, 600253, 580479, 593135, 631470, 642926, 629250, 627931, 628840, 631400, 622113, 606512, 583281, 576317, 563342, 561779, 577730, 582956, 591497, 607577, 625606, 617907, 619460, 618140, 585695, 567535, 565324, 552004, 548920, 532171, 526574, 527689, 539632, 523163, 519984, 508522, 486633, 493554, 499861, 512694, 524681, 531694, 519314, 507705, 494815, 467134, 462104, 478979, 484710, 487872, 466422, 455578, 449997, 423960, 419937, 412071, 409984, 411645, 405731, 406103, 405689, 389667, 381199, 395290, 408804, 394837, 385695, 401820, 405788, 396423, 402653, 418403, 401124, 412024, 409895, 385143, 394185, 396668, 379522, 378073, 393486]
19295C93486J4115J0667J3256K344p676m71r662j2761L808j8530o195J6797J6639
19282D15817k343J333m915L82j2980J2506n921M701J6082J1169P074k0523O936
19269D29318J256J1938J2926j1628l328l651K01L136L039Q954K9458m041k6859
19256D50719j6367N267O830M529j4331o903R419K1076J0143j0465q003P171r335
19243D49750j6886j2747k3807j4650J3376J4126j2984Q47N813L32j1055K911k040
19230C92986P570M310L525J8356L818j9964l3039m112K805l0139j5093L199J0259
19217C44481q581N09P958J5103J6779P606j4502j6440N080j5372N151q63J3046
19204C59955K425j0588o513J8769K7k2879j1077R568O824O232j0457j919q1Q249
$$ y = [393486, 407601, 418268, 431524, 433868, 426192, 425721, 416059, 403298, 407106, 388576, 382381, 399178, 415817, 413474, 414807, 409892, 410274, 397294, 409800, 403879, 408580, 424662, 435831, 442905, 422382, 429318, 430574, 442512, 455438, 443810, 440482, 436831, 437032, 440168, 443207, 452161, 481619, 477578, 450719, 434352, 439619, 446449, 450978, 436647, 429744, 439163, 460239, 470382, 459917, 451914, 459085, 449750, 432864, 420117, 396310, 381660, 395036, 409162, 396178, 397025, 402838, 403170, 392115, 395026, 392986, 400556, 404866, 408391, 426747, 430565, 410601, 377562, 373450, 376255, 346116, 331023, 334222, 344481, 335900, 336409, 344367, 359470, 376249, 383855, 369353, 352913, 357993, 342621, 347772, 346909, 359955, 362380, 351792, 345279, 364048, 364075, 341196, 330119, 339687, 346511, 352743, 342286, 340367, 340286, 348535]
19190C48535J3947Q844O692q849L62l071Q654N640o857j8146O650L4138J3412
19177D09951j9282Q772K1095Q416J380N438j7818m161J0636O220J8458J3515L683
19164D66303P941K3397L0500k799J9469Q558L439J3822L4192K2978O019J5486
19152F49305L2993J4536N6351N8215N1472O3521Q5042P5123N8918P3622R7818
19141A316916J13396J21167J02998M2459M9150O5070J04034Q9337N6894K3777
19131B085198J5901n932L0666L8454L6661L2248J2586J8280K235L904Q334N994
19119B284529L6531L5365K4677r744k668K4855M7239K9290n874q198n2195j10009
19107B293798j09551j16595j11543j04647j07702p1000o3826l1470K2421J4905
$$ y = [348535, 362482, 371326, 378018, 369169, 369531, 366460, 375114, 380754, 373897, 355751, 362401, 396539, 409951, 390669, 399441, 420536, 428952, 430332, 435770, 417952, 413791, 424427, 430647, 449105, 462620, 466303, 474244, 497641, 528141, 525342, 544811, 553369, 556808, 570630, 604822, 627800, 633819, 649305, 682298, 696834, 753185, 811400, 862872, 926393, 1011435, 1086558, 1145476, 1219098, 1316916, 1430312, 1551479, 1654477, 1696936, 1746086, 1811156, 1915190, 2004527, 2061421, 2085198, 2101099, 2095167, 2125833, 2164287, 2200948, 2233196, 2245782, 2264062, 2266297, 2270201, 2278535, 2284529, 2321060, 2356425, 2381102, 2371358, 2368690, 2393545, 2440784, 2470074, 2464200, 2456002, 2403807, 2293798, 2184247, 2067652, 1956109, 1851462, 1743760, 1672760, 1608934, 1577464, 1599885, 1614790]
19097A614790L7704N6130K7437k411k3917l0329m6048n9541p3808o6793p2804
19086A360410q6139o3066p2223m6322j8630N431j8826l1713J623R967L276J9756
19074A063544L67J9232L6383N0419N8056O2895Q4372J04489J35712J47041J51956
19063A914466J70672J70844J19278Q0409O3319O2365L0759n817l3665l3333j7858
19052B521439l3535k8548l4999k6445L874M7288N9010M2655R158K3067L6549o13
19040B618900q4440j33836j20527j11574j25210j49678j46493j51216j29104j19585
19030A347237r6121o8389l9068j3486m725l363j2493l0596j4037J0455R445J2839
19018A097698J8410M1182P0859J09122J26490J14075J21005J34817J48472J17791
$$ y = [1614790, 1652494, 1708624, 1736061, 1733650, 1709733, 1679404, 1633356, 1573815, 1500007, 1433214, 1360410, 1274271, 1211205, 1138982, 1092660, 1074030, 1079461, 1060635, 1028922, 1030545, 1040512, 1043788, 1063544, 1063911, 1083143, 1119526, 1169945, 1228001, 1290896, 1375268, 1479757, 1615469, 1762510, 1914466, 2085138, 2255982, 2375260, 2455669, 2518988, 2581353, 2612112, 2606295, 2572630, 2539297, 2521439, 2487904, 2459356, 2424357, 2397912, 2401786, 2449074, 2508084, 2550739, 2559897, 2582964, 2619513, 2618900, 2534460, 2400624, 2280097, 2168523, 2043313, 1893635, 1747142, 1595926, 1466822, 1347237, 1251116, 1182727, 1143659, 1130173, 1125448, 1122085, 1109592, 1078996, 1064959, 1075414, 1084859, 1097698, 1116108, 1157290, 1228149, 1337271, 1463761, 1577836, 1698841, 1833658, 1982130, 2099921]
19008B099921N7778r868k5542j7844p7461j33799j44793q3637l8966m2175j8687
18997A564927L8620N3932O4014Q0720J10224N9812j1246m4360o9000r2856j59319
18986A595468j80169j41164j15572r1729q9355r2454p3990m5041m2089m1690j2769
18975F69446L530j130j8134j7082L17q047k6330k1854M627j8091k5353j3050j4653
18962E14196q583j5708j8487k3339j6520L230j2761q73m570N69K900k0302k8691
18949C71061K367m360j7936j1518R939j0175j8701N35L4687L0201j5720k2131
18937C48249p820J5572r302P31q078l473O210n029n261k327J1943O57R28N628
18923C48628O634o97l988N850K4306M516K749j0124m820j1587R03p346k9796k4723
$$ y = [2099921, 2157699, 2147831, 2122289, 2104445, 2026984, 1893185, 1748392, 1664755, 1625789, 1583614, 1564927, 1603547, 1657479, 1721493, 1802213, 1912437, 1972249, 1961003, 1916643, 1847643, 1754787, 1595468, 1415299, 1274135, 1158563, 1066834, 977479, 885025, 811035, 765994, 723905, 682215, 669446, 672976, 671846, 653712, 636630, 636947, 628900, 602570, 580716, 585343, 567252, 541899, 528849, 514196, 505613, 489905, 471418, 448079, 431559, 434789, 422028, 421155, 416585, 417154, 420054, 399752, 371061, 373428, 369068, 351132, 339614, 349553, 339378, 320677, 321212, 355899, 386100, 370380, 348249, 340429, 356001, 346699, 347430, 339352, 335879, 342089, 337060, 331799, 329472, 341415, 342072, 343000, 348628, 355262, 354565, 350577, 356427, 380733, 385249, 387998, 377874, 373054, 361467, 362370, 355024, 325228, 300505]
18909C00505P787K5362J8337J0839j8959M639j032j7196J0744Q545o494j6455
18897C26622l1543o213J8164N112q870L879J4057J4502Q981L729M643j6466m488
18884C32109p115j0726n286o128j441Q251J0566J111L049k23j3590M936K2387
18871C37900K0493J1045K5974n275k1651J0202K6851n925N451k1948p104M810
18859C80823N409J2090K2765M1610Q896M780J8593L5805L4692K0698j921Q220
18847E92460p276j3421j4079k7032l0774l50J9784J1522k651Q175J6787O06j7871
18834E35880j6842m670r009k8374n231k3694p720r778l0329q727K9029j066m183
18821D15286m060n835K308k1782k6556J80Q259k479j8299m668J4489J7443K3579
$$ y = [300505, 308292, 333654, 351991, 362830, 343871, 348510, 347478, 330282, 341026, 349571, 343077, 326622, 295079, 288866, 307030, 312142, 303272, 307151, 321208, 335710, 344691, 348420, 353063, 336597, 332109, 324994, 314268, 308982, 302854, 301413, 309664, 320230, 321341, 324390, 324167, 310577, 315513, 337900, 358393, 369438, 395412, 390137, 368486, 378688, 405539, 399614, 405065, 383117, 376013, 380823, 386232, 398322, 421087, 462697, 471593, 476373, 494966, 530771, 565463, 586161, 584240, 592460, 585184, 571763, 557684, 530652, 499878, 499528, 519312, 530834, 528183, 536358, 553145, 553751, 535880, 519038, 514368, 505359, 476985, 471754, 448060, 440340, 430562, 400233, 391506, 420535, 419469, 415286, 411226, 405391, 407699, 385917, 359361, 359541, 367800, 365321, 347022, 342354, 356843, 374286, 397865]
18808C97865n642k226N484k0970j201K3139K8139J2914K7385L5489K7726J5656
18796E43758l210o187K0204K7065J7401J3116J4697J8463M4240L7055L2125K0621
18784G79348K581P718m370l36j4730k7635n933l224j2508K053J1592P94O203J6229
18770G57782J8143K9973K839J3224n343l1935q4669p6497l8442o573j5467j6498
18758E46537J423O930O268J794R624J4340k064j1293J0710L034o108N228j078
18745E85345q953L726J4017K9665K1301J5011K9998K5695K3064M6189M6324M4204
18733H75586L5763M7457K8365K9151L2746P733q35J1551p821k2633j8522m3393
18721I75148j7847q727n201j5813J8788K7067L0728N8046K2701J5532r51k1834
$$ y = [397865, 392223, 389997, 395481, 374511, 373310, 396449, 424588, 437502, 464887, 500376, 528102, 543758, 540548, 534361, 554565, 581630, 599031, 612147, 626844, 645307, 689547, 726602, 758727, 779348, 781929, 789647, 785277, 784941, 770211, 742576, 736643, 733419, 720911, 722964, 734556, 735350, 741553, 757782, 775925, 805898, 808737, 821961, 816618, 784683, 700014, 623517, 585075, 578502, 563035, 546537, 547960, 554890, 561158, 562952, 572576, 586916, 584852, 573559, 584269, 587303, 581195, 586423, 585345, 576392, 580118, 594135, 623800, 645101, 660112, 690110, 715805, 738869, 785058, 831382, 875586, 911349, 958806, 987171, 1016322, 1049068, 1056801, 1055966, 1067517, 1059696, 1037063, 1018541, 975148, 957301, 948574, 943373, 927560, 946348, 973415, 1004143, 1062189, 1084890, 1100422, 1099471, 1077637]
18709A077637q794j9761k1949l1603m9114k0850n150r904j7189k236J4682J2126
18697I17895M8727L6283K6618M4703M3539N5127K4085L6421L2665L888L7812O1816
18685A369579M1046M8977N2068N3052L6414K5769M5985O8419O7126O2514M0654
18674A911603K4891K4361L1107M7735K1311J9232R082L1995Q534J6625M9839N8162
18662B254477P8946O5963N8518J04081J16597R1125Q6826Q7995Q8310Q8715J04177
18651C225730Q2320R0197J00598J26596J52491J89842K06896J91001K21675K66263
18641D853609L19023L30140L73580M26722M44942M61539N01575N29355N19430
18632H759915N61988O20707O52818O97347P59813Q30272Q92112R64842J043011
$$ y = [1077637, 1068843, 1049082, 1027133, 995530, 946416, 925566, 920416, 910512, 893323, 891087, 905769, 917895, 966622, 1002905, 1029523, 1074226, 1117765, 1172892, 1196977, 1233398, 1266063, 1269951, 1307763, 1369579, 1410625, 1459602, 1511670, 1564722, 1601136, 1626905, 1672890, 1741309, 1808435, 1870949, 1911603, 1936494, 1960855, 1991962, 2039697, 2061008, 2080240, 2089322, 2121317, 2129851, 2146476, 2196315, 2254477, 2333423, 2399386, 2457904, 2561985, 2678582, 2769707, 2856533, 2944528, 3032838, 3121553, 3225730, 3308050, 3398247, 3498845, 3625441, 3777932, 3967774, 4174670, 4365671, 4587346, 4853609, 5172632, 5502772, 5876352, 6303074, 6748016, 7209555, 7711130, 8240485, 8759915, 9321903, 9942610, 10595428, 11292775, 12052588, 12882860, 13774972, 14739814, 15782825]
18623A5782825J128316J199449J304544J439757J563284J669294J809027J941604
18615B7838100K050900K188455K345706K483799K623470K914948L307334L887378
18607D9640090M754080O123266Q047847J0547765J3242742J5430582J6850272
18600A24636644J7669269J7845701J6354629J1840266N150909L1154k754525o889577
18592A83884470j2148772j3868840j0957630p124683l376766R82256N429602Q879811
18584A51699448J1151712J2066931J0356556N481054n51870m318099p264889j2170000
18576A66450843j7002523j7636325j5584695j3850822j2190131r710035o981024
18569G3495288m756754l212855k207225j475879q87722m94701k07096Q5196L85412
$$ y = [15782825, 16911141, 18110590, 19415134, 20854891, 22418175, 24087469, 25896496, 27838100, 29889000, 32077455, 34423161, 36906960, 39530430, 42445378, 45752712, 49640090, 54394170, 60517436, 68565283, 79113048, 92355790, 107786372, 124636644, 142305913, 160151614, 176506243, 188346509, 193497418, 193528572, 190774047, 183884470, 171735698, 157866858, 146909228, 139784545, 136407779, 137390035, 142819637, 151699448, 162851160, 174918091, 185274647, 190755701, 190203831, 185885732, 178620843, 166450843, 149448320, 131811995, 116227300, 102376478, 90186347, 80476312, 73495288, 68738534, 65525679, 63318454, 61842575, 60954853, 60460152, 60253056, 60338252, 60723664]
18560F0723664O60915R30034J227716J517738J783313K110581K550738L165685
18552G4670384M019768N251474P144991R622835J2362438J4782214J6456263J7456765
18544A61767132J7867139J6829730J2775940O065240J38230l031455o995549j2645163
18536A92771244j5581332j3210994r180368n283234p57117M085227Q043715J0749655
18528A71636796J2101438J0973230O453174n327m586265p618345j2544878j8224729
18520A58185094j9953509j8022278j6165158j4564338j2121901r202152o761188
18513F1394570n046281l950586l226674k708199k355372k165035k015960j840633
18505C8085830j686259j542119j385025j242274j095357r86240r01681q63222
$$ y = [60723664, 61384579, 62314613, 63542329, 65060067, 66843380, 68953961, 71504699, 74670384, 78690152, 83941626, 91086617, 100709452, 113071890, 127854104, 144310367, 161767132, 179634271, 196464001, 209239941, 215305181, 215443411, 212411956, 205416407, 192771244, 177189912, 163978918, 154798550, 149515316, 148758199, 152843426, 160887141, 171636796, 183738234, 194711464, 201164638, 201159311, 196573046, 188954701, 176409823, 158185094, 138231585, 120209307, 104044149, 89479811, 77357910, 68155758, 61394570, 56348289, 52397703, 49171029, 46462830, 44107458, 41942423, 39926463, 38085830, 36399571, 34857452, 33472427, 32230153, 31134796, 30148556, 29246875, 28383653]
18497B8383653q71701r02215r61284r74270j023532j096428j145417j133616j131681
18488A9143509j096531j052109r74096r22069q39067p80479p12554o57750o07007
18479A1501847n91761n54946n15858m54276m33015m12838l91946l73494l62285
18470G411428l30076l24557l06570k78786k44154k65473k71590k33174k24553
18461D932495j94723j99668j86817j70842j53300j74488j75018j47267j21177
18452C409195j14734j08319j22739j15074j12346j26672j17324j18575j12555
18443B360857r4366r2663o8804m9245n0687n4456l2303n829l1613j5327k1513
18432A844051l9252m2202l0547k2665j0306l5089k6185R990J9602K2454K4250
$$ y = [28383653, 27511952, 26609737, 25648453, 24674183, 23650651, 22554223, 21408806, 20275190, 19143509, 18046978, 16994869, 16020773, 15098704, 14259637, 13479158, 12766604, 12108854, 11501847, 10910086, 10355140, 9839282, 9385006, 8951991, 8539153, 8147207, 7773713, 7411428, 7081352, 6756795, 6450225, 6171439, 5927285, 5661812, 5390222, 5157048, 4932495, 4737772, 4538104, 4351287, 4180445, 4027145, 3852657, 3677639, 3530372, 3409195, 3294461, 3186142, 3063403, 2948329, 2835983, 2709311, 2591987, 2473412, 2360857, 2266491, 2173828, 2105024, 2055779, 2005092, 1950636, 1918333, 1912504, 1880891, 1865564, 1844051, 1804799, 1762597, 1732050, 1709385, 1699079, 1663990, 1637805, 1647795, 1667397, 1689851, 1714101]
18421A714101L9927N9003M2155M1847K326O336J6112j4919j0803n852J2340k2752
18409A879821K1175P6580J20520J63083K07562K32055K78569K56724J94684J35230
18399C566003R2938J12698O7993o7355k31087k26054j71679k08160k56922k73421
18389B404954k29677j53750j22469q9473q2369m9082m7507l6363j7139k2815k4408
18378A529902k0396K174j2482p062o774J0589J1152j345J9079R775J7692O761
18366A559065n964k627l185J0082r222j695n305K026J4017l774K5402M2555Q9146
18353A710521J17818J30809J67871K05821J95547J65374J29298J17338J15008
18344C055405P2104l7009j68354j80887j15753j39064k00725k37378k01119j61947
$$ y = [1714101, 1754028, 1813031, 1855186, 1897033, 1899359, 1905695, 1921807, 1906888, 1896085, 1890233, 1902573, 1879821, 1900996, 1977576, 2098096, 2261179, 2468741, 2700796, 2979365, 3236089, 3430773, 3566003, 3658941, 3771639, 3839632, 3772277, 3541190, 3315136, 3143457, 2935297, 2678375, 2404954, 2175277, 2021527, 1899058, 1809585, 1727216, 1678134, 1630627, 1594264, 1577125, 1554310, 1529902, 1509506, 1511680, 1499198, 1492136, 1485362, 1495951, 1507103, 1505758, 1524837, 1534612, 1552304, 1559065, 1553101, 1550474, 1547289, 1557371, 1548149, 1546454, 1541149, 1543175, 1557192, 1553418, 1578820, 1621375, 1710521, 1828339, 1959148, 2127019, 2332840, 2528387, 2693761, 2823059, 2940397, 3055405, 3127509, 3090500, 2922146, 2741259, 2625506, 2486442, 2285717, 2048339, 1847220, 1685273]
18334A685273j22335j02729o9195m3336j6574k2178n1333l9165q870k6168l9662
18323A143728k0266j1738k139o913k0989k3247j9178j1941n833k5350j3409L833
18311I86558k6631k2513k2210l0804k6042j3867k0515q734j8416k5869j3521p77
18299G56659j5739j4134j8084K745m423j7700l811O408O289j1770j9542r127j227
18286F56544j7420m727N623k1038o395k523l556j3011q066p823j1457m599r418
18273E52134r96J3762K5618m625k630J4441L569J2000l567q352k3888k0537k1498
18260E35431k2368j3361q713K2081j602k326L079L589K6438P92k0776J2328k742
18247E31850j8215j5961L795q066Q760J0360l401J0252K7722L0717k238k1017
$$ y = [1685273, 1562938, 1460209, 1391014, 1347678, 1331104, 1308926, 1257593, 1218428, 1209558, 1183390, 1143728, 1123462, 1111724, 1109585, 1102672, 1081683, 1058436, 1039258, 1027317, 1021484, 996134, 982725, 986558, 959927, 937414, 915204, 884400, 858358, 844491, 823976, 815242, 796826, 770957, 757436, 756659, 740920, 726786, 708702, 711447, 707024, 689324, 685513, 691921, 698210, 686440, 666898, 657771, 656544, 639124, 634397, 640020, 618982, 612587, 610064, 606508, 593497, 585431, 577608, 566151, 561552, 552134, 551138, 564900, 590518, 585893, 583263, 597704, 601273, 613273, 609706, 601354, 577466, 556929, 535431, 513063, 499702, 490989, 513070, 511468, 509142, 512221, 515810, 542248, 543040, 522264, 534592, 531850, 513635, 497674, 501469, 493403, 502163, 512523, 509122, 519374, 547096, 577813, 575575, 554558]
18235E54558l6642q101P358k3972l649J2589K860m819L3620O253k1419Q919K8243
18222E55798k1069l4584j7474j720K2419N081p570o134j8713J157J3125J3128
18210E03444M21j5902J037p023j39K4979J3984k47p038j4630j0930J1173J2435
18197E11564k532M281m627j4107k2426j8697k9598O332L7136J1897J2913J5794
18185E07930J4091L371j228j2385l2043J462K3800J7089j7696k5385k202J1639
18173D88443l466K1228J1155J6574J0229O379N760p688k5829j4071r976J2632
18161E11370J194J8215L8554r78L172R747J0896p307J0685L3690J5521K7785J2954
18148F85498J9813J6814M8638M6163K3000J2022J7194K4268J4618N7317M5206
$$ y = [554558, 517916, 509815, 517173, 493201, 489552, 502141, 505001, 500182, 533802, 540055, 518636, 527555, 555798, 534729, 500145, 482671, 480951, 503370, 508451, 500881, 494747, 476034, 477191, 490316, 503444, 503865, 487963, 489000, 481977, 481838, 506817, 520801, 520554, 513516, 498886, 487956, 499129, 511564, 509032, 513313, 508686, 494579, 472153, 453456, 423858, 430190, 467326, 479223, 492136, 507930, 522021, 525392, 524164, 511779, 479736, 481198, 504998, 522087, 504391, 479006, 476804, 488443, 484977, 506205, 517360, 533934, 544163, 550542, 556302, 548614, 522785, 508714, 498738, 511370, 512564, 530779, 569333, 568355, 571527, 581274, 592170, 584863, 595548, 629238, 644759, 672544, 685498, 705311, 722125, 770763, 816926, 839926, 851948, 869142, 893410, 908028, 965345, 1010551]
18137A010551K3258L8209J7615J5310M6033N6899O7690O9354P0198P7267Q7005
18126A579389J12594J26824J39316J42436J77666J69970J53886J08048R9818J26432
18116B936379J86537K75498M22550O67292R88014J472579K280359L409650M314752
18107A6953610L515898P27299l324315n646468l919301k172625j283217q33552
18099D017329n37493l74533k87712k40481j90318j41891r7282q3347p6969m5342
18089A941961l7505l6524l2272J0177J5546L6712N8185P4551P8271Q4157J14035
18078B307294J05083P9619K058l3525o9720j20452j36116j33906j12158q6008
18068A802169n2844m5556o630J0227R038L7556L3656K342k9998m6807n8033o2795
$$ y = [1010551, 1033809, 1072018, 1089633, 1104943, 1150976, 1207875, 1275565, 1344919, 1415117, 1492384, 1579389, 1691983, 1818807, 1958123, 2100559, 2278225, 2448195, 2602081, 2710129, 2809947, 2936379, 3122916, 3398414, 3820964, 4488256, 5476270, 6948849, 9229208, 12638858, 16953610, 20469508, 21196807, 17872492, 12226024, 8306723, 6134098, 4850881, 4017329, 3479836, 3105303, 2817591, 2577110, 2386792, 2244901, 2147619, 2064272, 1987303, 1941961, 1904456, 1867932, 1835660, 1845837, 1861383, 1898095, 1956280, 2030831, 2109102, 2193259, 2307294, 2412377, 2491996, 2494054, 2460529, 2390809, 2270357, 2134241, 2000335, 1888177, 1802169, 1749325, 1703769, 1697139, 1707366, 1716404, 1753960, 1787616, 1789958, 1759960, 1713153, 1655120, 1592325]
18056A592325j04310j14614r4486j04624r8066o0926n0888m0732j8435k1988j1461
18045H71795p809j7512j8872Q802K5381j2773k4660k7601J0577K1072J4895l254
18033H40041P818J9591J6120L3854N4738P8424P4342R3369Q9003N6639N9443O6236
18021A489618N6573J2698l2336l8822n9289p6759o1553n6071l0933L520K9562
18010A236208M2090N8305N4451O6826K2874k8827l9808m0219o7317r8085j20068
17999A086430r3298o7235o4852n4831n1095m4426k5122p838j0223l1079k4731
17988F11700p004Q591k63q818r66n027j4593r82N57r597j3272l5146k7664n842
17974D91674p01j6700n254p247R410P036j1619j7536L98m377j2006j7562j419
$$ y = [1592325, 1488015, 1373401, 1278915, 1174291, 1076225, 1015299, 964411, 923679, 905244, 883256, 871795, 863986, 846474, 827602, 836404, 861785, 849012, 824352, 796751, 807328, 828400, 843295, 840041, 847859, 867450, 883570, 917424, 972162, 1050586, 1124928, 1218297, 1307300, 1363939, 1423382, 1489618, 1546191, 1558889, 1526553, 1487731, 1428442, 1351683, 1290130, 1234059, 1203126, 1206646, 1236208, 1278298, 1336603, 1391054, 1457880, 1480754, 1451927, 1412119, 1371900, 1304583, 1206498, 1086430, 993132, 925897, 861045, 806214, 755119, 710693, 685571, 677733, 667510, 636431, 611700, 604696, 613287, 613024, 604206, 603240, 598213, 583620, 582638, 583195, 573598, 560326, 525180, 497516, 491674, 490973, 474273, 469019, 461772, 471182, 478218, 466599, 449063, 449461, 445084, 433078, 415516, 414097]
17961D14097j6728p369j441L555N266j1380L546n026P784J2166J3428j055j3380
17948D03463p079j081l057k4043j7778n235R161K3691K748M614l3539l1281L880
17935C24464J8942K1649L922J0599O633k6045k8848L123K878K1766Q779M467n322
17922C67007j8521k3773p896k883o974j7208L517R301O147J0850j314L449K157
17909C23859M853J441J0913J6435p550n867K478P25p378j0009R436r930r713R308
17895C29001J0634J072j3167m315O615K401j2967J1265k099J3562K88j5114k091
17882C25085L68m696K536M584l555n839n713J6413Q198r920k3152p4J8671r219
17868C13687k2997l257P370J9895K293J184J0063O171L969o175J0170k27J1312
$$ y = [414097, 397369, 390000, 388559, 392114, 397380, 386000, 389546, 384520, 392304, 404470, 417898, 416843, 403463, 396384, 395303, 392246, 368203, 350425, 345190, 354351, 378042, 380790, 385404, 351865, 320584, 324464, 343406, 365055, 368977, 379576, 386209, 360164, 331316, 334439, 337317, 359083, 367862, 372329, 367007, 348486, 324713, 316817, 313934, 306960, 289752, 293269, 302570, 308717, 319567, 318253, 321702, 323859, 328712, 330153, 341066, 357501, 349951, 344084, 346562, 347287, 339909, 329900, 339336, 329406, 319693, 329001, 339635, 340707, 327540, 323225, 329840, 332241, 319274, 330539, 328440, 342002, 342290, 327176, 325085, 325453, 320757, 323293, 327877, 324322, 318483, 312770, 329183, 337381, 327461, 304309, 304235, 322906, 313687, 290690, 287433, 294803, 314698, 316991, 318175, 328238, 334409, 338378, 332203, 342373, 342146, 353458]
17855C53458O861n844j5362L953J2058J234j3812P491m057j4421k990J3942j7995
17842C24516N105J1486J16l67K1050n17m695M258j6389j0597q71j6420j0089K2087
17828C28673l443r208K897j634J3609K0357o140j9320p556J0022J1623J3824J809
17815C55513j0003r930q844m227K7582J3098k0407r230J0082j3509J1949K6978
17803C69052J367j6940j5645j2498J05J5080Q206j4715j3311n462J8372Q832L305
17790C45748n262l073J348q223j5215q051J0800K0391k729K3611P581J0161J6130
17777C93217r583k5814j1667k934J2190n990n595P505K142l4706k2011P176J8807
17764C22737R764p534j4944l370K2813J0219L296j2951m879j5619j5121J6395
$$ y = [353458, 360319, 354475, 339113, 343066, 355124, 356358, 342546, 350037, 345980, 331559, 328569, 342511, 324516, 329621, 341107, 341223, 340856, 361906, 361389, 356694, 360952, 344563, 333966, 333095, 316675, 306586, 328673, 325230, 316022, 318919, 317285, 330894, 351251, 345111, 325791, 318235, 328257, 339880, 353704, 355513, 345510, 335580, 326736, 322509, 350091, 363189, 342782, 333552, 343634, 330125, 342074, 369052, 370419, 353479, 337834, 325336, 325441, 340521, 348727, 334012, 320701, 315239, 333611, 342443, 345748, 340486, 337413, 338761, 330538, 315323, 307272, 318072, 338463, 335734, 359345, 366926, 377087, 393217, 383634, 357820, 346153, 343219, 355409, 349419, 343824, 351329, 353471, 318765, 296754, 303930, 322737, 332501, 324967, 310023, 306653, 329466, 339685, 342981, 330030, 325151, 309532, 294411, 310806]
17752C10806K3664K2046j970k576P224j2755j8166J4454J2537J4968m832K305
17740C67705M049J057J3075j7426j4217j7752J3115o143j2602K2988J2812j6454
17728C50207k15J1319j4195m307o297J3596j647L736N462O12j1562q758K117k2837
17714C17231j0310K6907K6222M274j1154j1668R383J1274K955P398k856j2263
17702C57393o597M218k2278R33P52O736L423J0117O621K525j6150M083L4167j06
17688C85837q160o584n055j2901j4049r228j6947L129L2147K4862k80J91j533
17675C71429Q803N922r848p14r179j2643O212J6493m569j2524J3000M205L600
17662C80187j1872j7885O54K3065n610q525M715j568r57K511k237K430O785O897
$$ y = [310806, 334470, 356516, 354546, 351970, 359194, 346439, 328273, 342727, 355264, 370232, 365400, 367705, 371754, 372811, 385886, 368460, 354243, 336491, 349606, 343463, 330861, 353849, 366661, 350207, 349992, 361311, 347116, 342809, 336512, 350108, 348461, 352197, 357659, 358271, 346709, 337951, 340068, 317231, 306921, 333828, 360050, 364324, 353170, 341502, 350885, 362159, 365114, 372512, 369656, 357393, 350796, 355014, 332736, 333669, 334421, 341157, 344580, 354697, 361318, 363843, 347693, 351776, 385943, 385837, 377677, 371093, 366038, 353137, 339088, 329860, 312913, 316042, 348189, 373051, 372771, 372962, 371429, 380232, 386154, 376306, 375592, 366413, 353770, 359982, 376475, 371906, 359382, 372382, 376587, 380187, 368315, 350430, 351084, 374149, 368539, 360014, 364729, 363161, 362204, 364715, 362478, 364908, 371693, 378590]
17648C78590r545n734o456Q919J9886j9068m321J6945M742q179O233j660M673
17635C85025j7523j2786K210q156K2510J8179J0928m253j7258J0783J2706K1931
17623D24296j5454j2002r708k1265m540K024K976R325n609m100J855J0654q18
17610C77634k3043l37J4868oJ036K458P470j2177J0205J1831j6052M028j89k4242
17596C53484q02L038P806N216J1022J0468m295j3225p976j2856n065O037J0550
17583C63402L867J6818J1668j081j8235k4653J9008l68o501J5272J8585p863o133
17570C83786M529j0117M123o993k2278j7911j2587J3319P495J6654J0602J0079
17558C80701M593J8565J2030j8110j7560J1678J3834L078q104j1651K06J8037
$$ y = [378590, 369045, 363311, 356855, 365774, 385660, 366592, 362271, 379216, 383958, 375779, 382012, 380352, 385025, 367502, 354716, 356926, 348770, 371280, 389459, 400387, 396134, 378876, 389659, 402365, 424296, 408842, 396840, 387132, 365867, 361327, 363351, 366327, 375652, 370043, 365943, 367798, 378452, 377634, 354591, 354254, 369122, 369116, 370152, 372610, 380080, 367903, 378108, 389939, 373887, 377915, 377726, 353484, 352682, 355720, 363526, 368742, 379764, 390232, 385937, 372712, 364736, 351880, 346815, 352852, 363402, 367269, 384087, 395755, 394674, 376439, 351786, 370794, 370426, 363925, 379197, 397782, 389919, 383786, 388315, 378198, 382321, 375328, 353050, 335139, 322552, 335871, 343366, 360020, 370622, 380701, 385294, 403859, 415889, 397779, 380219, 391897, 405731, 408809, 400705, 389054, 389260, 407297]
17546D07297l396J306n833l1988j4977J8319k918J221K2945n494k6265j13K376
17533C62480k884R554Q754m19J3881K3658O837N097j4845o088n505j4686n8M283
17519C90059N733j467O676J3946J7580p250j5548k9319o662J2747J794J0762K6545
17506D25596L025J2885K400k0310q916j3675j5290p164J916K1849K099l39L175
17493D07251J1846P647o533M46P098k2027k7870M021L878M984k577L622j902N696
17479C95580J7136J1607n566K226q693P190K825q508l03J2514J369j6466o563
17466D04348J4709J5927J1342L004r234j3960j0760n311Q271N856N773l864j8453
17453D07648l699J5224J4158R04P053l37N572j0525Q009K5165L1620P902J3500
$$ y = [407297, 403901, 405207, 399374, 367386, 352409, 370728, 367810, 369031, 391976, 386482, 360217, 360104, 362480, 359596, 369150, 377904, 377485, 391366, 415024, 421861, 426958, 412113, 406025, 400520, 385834, 385776, 390059, 395792, 394325, 401001, 414947, 432527, 425277, 409729, 380410, 373748, 386495, 388289, 399051, 425596, 428621, 441506, 443906, 423596, 414680, 401005, 385715, 378551, 380467, 402316, 404415, 404076, 407251, 419097, 426744, 420211, 420657, 427755, 405728, 377858, 381879, 385757, 390741, 388164, 391786, 389884, 395580, 412716, 424323, 418757, 420983, 412290, 419480, 422305, 413797, 413494, 426008, 427377, 410911, 404348, 419057, 434984, 446326, 449330, 440096, 426136, 415376, 410065, 418336, 424192, 429965, 426101, 407648, 403949, 419173, 433331, 434235, 441288, 440951, 446523, 435998, 444007, 469172, 500792, 508694, 522194]
17440E22194J1311k474r536j7136k7973j0226J4950P456j2316N764J8386r398
17428D91002l686l043j3726J6030J9627J6916J6667k857J5057J0989m969k7191
17416E30816Q60J7116R994M2797J3376r67l399K7478k22O204J1657R425J4464
17403F79599J3020L836M3269M0277M4779M2773M7815N8531Q4179J04671J34788
17392A297537J36823J42298J43728J33987J09444M6852N8283P1431K325o4441
17382B078267r8765j02522q8264j25837j40043j51968j18291p9701r3370r0760
17372I88746p7841l9875k7274k0233k0206k2506Q900N530k2406j8163Q352K2939
17360G85963J4519J901p759K919L4330P32K20k2279N810J2187J2015L809J6545
$$ y = [522194, 533505, 531031, 521495, 504359, 476386, 466160, 481110, 488566, 476250, 482014, 500400, 491002, 487316, 484273, 470547, 486577, 506204, 523120, 539787, 536930, 551987, 562976, 558007, 530816, 531676, 548792, 558786, 601583, 614959, 613992, 610593, 638071, 637849, 644053, 655710, 665135, 679599, 692619, 696455, 739724, 780001, 824780, 867553, 915368, 973899, 1058078, 1162749, 1297537, 1434360, 1576658, 1720386, 1854373, 1963817, 2010669, 2068952, 2140383, 2142708, 2078267, 1979502, 1876980, 1788716, 1662879, 1522836, 1370868, 1252577, 1172876, 1079506, 988746, 910905, 871030, 843756, 823523, 803317, 780811, 789711, 795241, 772835, 754672, 763024, 785963, 800482, 802383, 794624, 797543, 831873, 832605, 832825, 810546, 816356, 828543, 840558, 844367, 860912]
17347H60912K8910M1452J9601L5928L5664J2470J8295N0237J04807R2770J15342
17336A416388J37363J09762R7240J03080P7554P8213M8262J2331m9238r3874j01629
17325A835452j07114j17308j33647j53547j10615r6948r3246p7420m7843n3265
17315H44499k4596k2730l5506l5739l3707j5829J1627o454k0381p537J0841Q751
17303F73239J507j3455k1521j814J1536J7790j998j4514J0889l202l954k2581
17291F31922j3124K713k362k3797j6635P265N06l1851k501J3270J572p058j3379
17278E46541j5782j597j2185q331j675O712Q380l851k0436r05J5519L853J4009
17265E30252N643N589q353n326j3711J4524J8839O907J7033O054l070K519J5931
$$ y = [860912, 889822, 931274, 950875, 986803, 1022467, 1034937, 1053232, 1103469, 1208276, 1301046, 1416388, 1553751, 1663513, 1760753, 1863833, 1941387, 2019600, 2067862, 2080193, 2030955, 1937081, 1835452, 1728338, 1611030, 1477383, 1323836, 1213221, 1116273, 1023027, 945607, 897764, 844499, 819903, 797173, 761667, 725928, 692221, 676392, 688019, 681565, 661184, 653647, 664488, 673239, 674746, 661291, 639770, 637956, 649492, 667282, 665284, 650770, 661659, 658457, 654503, 631922, 618798, 621511, 619149, 595352, 578717, 585982, 586488, 554637, 552136, 565406, 566978, 559920, 546541, 530759, 529162, 516977, 508646, 506971, 513683, 522063, 518212, 497776, 496871, 512390, 516243, 530252, 535895, 541484, 533131, 527805, 514094, 528618, 547457, 554364, 571397, 577451, 574381, 576900, 592831]
17252E92831M867l99j7122j144l98m324J0298K632j3591p348j4227j7987j1465
17239E22623j611n631J4595O437m878J2969R881P81k883k8529m426Q895K02j4274
17225E14151J2965J3991l420O33P794Q07j4237k2190P1J6343L023J2900K0433
17212E63264O292N796j900l369k913K2804J6217n73j5944q992M94K2934K496P416
17198F14022Q831L223N423n677Q058k244K9449Q676n462M591k023j8279j1649
17185F36939P75J168J4147K5768p201k3688j0389j0937p89J7174N626n944K0060
17172F62709j2381k1081P894K1727j188j1520L099J0699N35Q492N355O452K7529
17159G08321l250j0968m606P45k1657J305m365o688K5132R678K2522M826j2260
$$ y = [592831, 597698, 597299, 580177, 579033, 578635, 574311, 584609, 587241, 573650, 566302, 552075, 534088, 522623, 521012, 515381, 529976, 536413, 531535, 544504, 554385, 555166, 552283, 523754, 519328, 528223, 528425, 514151, 527116, 541107, 537687, 538320, 546114, 546921, 532684, 510494, 510565, 526908, 529931, 542831, 563264, 569556, 575352, 573452, 570083, 567170, 589974, 606191, 605618, 589674, 580682, 581176, 604110, 606606, 614022, 622853, 626076, 631499, 625822, 633880, 631636, 661085, 669761, 664299, 668890, 666867, 648588, 636939, 637714, 638882, 653029, 678797, 671596, 647908, 637519, 626582, 625793, 642967, 648593, 642649, 662709, 650328, 629247, 637141, 658868, 657680, 646160, 649259, 659958, 660493, 668985, 674340, 680792, 708321, 705071, 694103, 689497, 690242, 668585, 669890, 665525, 658837, 683969, 693647, 716169, 720995, 708735]
17146G08735k775R007J5797K4710n49O088J5992J0706N936K3275J9498K4916J1281
17133H72617K2823K1412K670Q960L0634K9699K5935K5480L0383J9830K100k3587
17121A068956j7221J3706r325m1835k1529j7161j9925l9427k4491j2740j1248
17110H67760j0861j5306k7141j0566j0600n822J179m563l693k2348J0322P921
17098G76282k1944M351m267J1942O089M08Q819j811J332N603J9417P518j7809
17085G95930k2597P872K1696R301O894R631J7377K3278L3898L1983K7844L1288
17073I94395M7126J3139K6920K8082M6728M0667K4765P544J7372K9064J3474K3999
17061A313275J8459J8603L0904J5321o754j0854o350j3568k3652k2405j7816l4989
$$ y = [708735, 705960, 714967, 730764, 755474, 754925, 761013, 777005, 787711, 793647, 816922, 836420, 861336, 872617, 895440, 916852, 919522, 928482, 959116, 988815, 1014750, 1040230, 1070613, 1090443, 1092543, 1068956, 1051735, 1065441, 1056116, 1014281, 992752, 975591, 955666, 916239, 891748, 879008, 867760, 856899, 841593, 814452, 803886, 793286, 787464, 788643, 784080, 780387, 758039, 768361, 776282, 754338, 758689, 754422, 766364, 772453, 772861, 781680, 779869, 781201, 786804, 806221, 813739, 795930, 773333, 781205, 802901, 812202, 819096, 828727, 846104, 869382, 903280, 935263, 963107, 994395, 1041521, 1054660, 1081580, 1109662, 1156390, 1197057, 1221822, 1229366, 1246738, 1275802, 1289276, 1313275, 1331734, 1350337, 1381241, 1396562, 1389808, 1378954, 1372604, 1359036, 1335384, 1312979, 1295163, 1260174]
17049A260174l0356l6316k0045j6034q513k8989j6343Q814J8834j5981j3357j9556
17037A082332j3688p866k108q195O690J4935J8064K0853L0886K1500K5422K8324
17025A217149K9441K4691m163N532K3026K3252M421R891K3758l868L422K7293
17013A383845K9290K4254L7119M2722N4174P7030O7047N5049M7250O7766P5118
17002A960664N7122K1555L1177o682k7267m8875o8632p1451p5607n6303m8555
16991A667146o7855p3227m0704k3875O60K4951R713K1500J2270K1838N0827K6055
16979A629299K6541M9452J1607L2932L7969N0218L6866N8260L4626L8849N6881
16968B063500L4421O0493Q2571P8522P6017N8224O5115M3711M4730L9400M8649
$$ y = [1260174, 1229818, 1193502, 1173457, 1157423, 1148910, 1119921, 1103578, 1112392, 1131226, 1115245, 1101888, 1082332, 1068644, 1060778, 1058670, 1050475, 1057165, 1072100, 1090164, 1111017, 1141903, 1163403, 1188825, 1217149, 1246590, 1271281, 1267118, 1272650, 1295676, 1318928, 1323349, 1333240, 1356998, 1353130, 1356552, 1383845, 1413135, 1437389, 1474508, 1517230, 1571404, 1648434, 1715481, 1770530, 1817780, 1885546, 1960664, 2017786, 2039341, 2070518, 2063836, 2036569, 1987694, 1919062, 1847611, 1772004, 1715701, 1667146, 1599291, 1526064, 1485360, 1461485, 1462145, 1487096, 1496809, 1518309, 1530579, 1552417, 1603244, 1629299, 1655840, 1705292, 1716899, 1749831, 1787800, 1838018, 1874884, 1933144, 1967770, 2006619, 2063500, 2097921, 2158414, 2240985, 2319507, 2395524, 2453748, 2518863, 2562574, 2607304, 2646704, 2695353]
16957B695353O4712L4586M1444N3832O0617P3631O3503P9079O7120O0551P5296
16946C369724N1096M4057M0399K9265P546K7660L9866L1443N4860M2789L6969
16935C775674N8990R5004J10490J15097J30995J32785J47128J58678J88207J93431
16925E106479K02725K21923K31537K56352K58269K90705K86195L24648L30344
16916G509177L91994M29114M77820N15395N83500O41518O95425P30493P65990
16907A2740426Q33852Q81302R04239R34654R76634J062161J134648J204959J287309
16898B1960184J411425J549783J714627J861900K040318K214916K384722K564240
16890C7702115K770905K935345L158093L377797L639058M004649M566304N396234
$$ y = [2695353, 2760065, 2794651, 2836095, 2889927, 2950544, 3024175, 3087678, 3166757, 3233877, 3294428, 3369724, 3420820, 3464877, 3505276, 3534541, 3542087, 3569747, 3609613, 3641056, 3695916, 3738705, 3775674, 3834664, 3929668, 4040158, 4155255, 4286250, 4419035, 4566163, 4724841, 4913048, 5106479, 5309204, 5531127, 5762664, 6019016, 6277285, 6567990, 6854185, 7178833, 7509177, 7901171, 8330285, 8808105, 9323500, 9907000, 10548518, 11243943, 11974436, 12740426, 13574278, 14455580, 15359819, 16294473, 17271107, 18333268, 19467916, 20672875, 21960184, 23371609, 24921392, 26636019, 28497919, 30538237, 32753153, 35137875, 37702115, 40473020, 43408365, 46566458, 49944255, 53583313, 57587962, 62154266, 67550500]
16882F7550500O500090Q118936J0504598J3573371J6634276J9038896K1095599
16875A63016266K3768888K7208031K8163399K3907852J6375308J2670660J3542676
16868C08653080Q919362l959670j7590562k0696835j7396889j9347504k6561263
16861B12019719l1114713k6928856k0600198j7527246j6254468j3793808j0131007
16854G5669423p038606m871048l416566k423649j698308j110950o77855l20858
16846E4111583m5873K03036L95772N57388O57328P80011R49003J046076J051513
16837E9705837J057488J174737J319500J448989J534721J652151J889382K253402
16829G2036207K759822L494970M516774N979645Q132561J1005609J4023564J6555246
$$ y = [67550500, 74050590, 82169526, 92674124, 106247495, 122881771, 141920667, 163016266, 186785154, 213993185, 242156584, 266064436, 282439744, 295110404, 308653080, 317572442, 313612772, 296022210, 275325375, 257928486, 238580982, 212019719, 180905006, 153976150, 133375952, 115848706, 99594238, 85800430, 75669423, 68630817, 63759769, 60343203, 57919554, 56221246, 55110296, 54432441, 54111583, 54065710, 54268746, 54664518, 55221906, 55879234, 56659245, 57608248, 58654324, 59705837, 60763325, 61938062, 63257562, 64706551, 66241272, 67893423, 69782805, 72036207, 74796029, 78290999, 82807773, 88787418, 96919979, 107925588, 121949152, 138504398]
16821A38504398J8597125K0960750K4226952K5986597K3072094J6292444J1439277
16814B79079637J2022359R300646j423776j5009092k0372841j7470855j7815035
16807B28311043k3990594k9546637k7120018k0913095j7401829j6122956j4229808
16800G8986106j0976089p907327n737770m294826l295526k597621k065772j665541
16792D0445634j350078j138265r64089q35256p76388p88932p88748p73155p65330
16783C2265393q59612j029682j124200j133802j171900j284839j372866j360922
16775B2927570j312097j285175j252986j178397j106672j050623r70354q79858
16767A3891408q09749p30625o80013o31287n79865n42929n26483n12414m69245
$$ y = [138504398, 157101523, 178062273, 202289225, 228275822, 251347916, 267640360, 279079637, 291101996, 300402642, 298978866, 283969774, 263596933, 246126078, 228311043, 204320449, 174773812, 147653794, 126740699, 109338870, 93215914, 78986106, 68010017, 60102690, 54364920, 50070094, 46774568, 44176947, 42111175, 40445634, 39095556, 37957291, 36993202, 36157946, 35381558, 34592626, 33803878, 33030723, 32265393, 31405781, 30376099, 29251899, 28118097, 26946197, 25661358, 24288492, 22927570, 21615473, 20330298, 19077312, 17898915, 16792243, 15741620, 14771266, 13891408, 13081659, 12351034, 11671021, 11039734, 10459869, 9916940, 9390457, 8878043, 8408798]
16758H408798m33468m00469l84259l84076l63438l15111k90808k69968k55549
16749E311652k22805k04644j90834j91915j80723j79756k01055j79155j54113
16740C606652j68130j69856j80270j74406j69599j46781j52367j39401j26925
16731B178917j19565j18949j17145p6830o6868o4270p7463n4008m5522m5849m6072
16720A346376k0367j5054m7834m7556l8968j0174j0256j4633J2270O0191M2095
16709A256090P0260M6608N8493M5326M4340N1047N2520K7266K3794J4090j7499
16698A672335l9054m7681m5920l3208m3379n4961k4899j1272l2403n9139o0641
16687A219778m4178o0490q0524j01629q0333n7223m6707n7142m4198k9550k498
$$ y = [8408798, 7975330, 7574861, 7190602, 6806526, 6443088, 6127977, 5837169, 5567201, 5311652, 5088847, 4884203, 4693369, 4501454, 4320731, 4140975, 3939920, 3760765, 3606652, 3438522, 3268666, 3088396, 2913990, 2744391, 2597610, 2445243, 2305842, 2178917, 2059352, 1940403, 1823258, 1746428, 1679560, 1615290, 1537827, 1483819, 1438297, 1392448, 1346376, 1326009, 1310955, 1263121, 1215565, 1176597, 1166423, 1156167, 1141534, 1153804, 1213995, 1256090, 1326350, 1372958, 1431451, 1476777, 1521117, 1572164, 1624684, 1651950, 1675744, 1689834, 1672335, 1633281, 1585600, 1539680, 1506472, 1463093, 1408132, 1383233, 1371961, 1339558, 1280419, 1219778, 1175600, 1115110, 1034586, 932957, 852624, 795401, 748694, 691552, 647354, 617804, 615306]
16676F15306J4646J6522L0239R78J4608N2670K9322k55J2853J7697O079m114K0536
16663H27087J4703M273K4540K6742l072N963N0381M5246M6667L4471N4580O6103
16651A197684O5155O2781M0365K3974L8778M1838J0138j5499k3379n3639p1063
16640A317133q7119j03696q0549n1243n7125p0976p6855n7000o2023m6497k4781
16629E99269l2819m2732j7229l748J492K532q092J8640M5056O0541L7022L4236
16617F94168M9565L5213K1909K261K97O199J6916m65k4481j9701r874j7553k3745
16604G30709j2291R55r295m2382m0108j690r005k4268m699l948j7560o900j865
16591E57653j6027p458R10j6849j4201j1657j3721p210j2165J0432o900j6082
$$ y = [615306, 629952, 646474, 676713, 677691, 692299, 744969, 774291, 774036, 786889, 804586, 810665, 806551, 827087, 841790, 846063, 870603, 897345, 894273, 900236, 950617, 995863, 1042530, 1077001, 1131581, 1197684, 1262839, 1325620, 1365985, 1389959, 1428737, 1470575, 1480713, 1465214, 1441835, 1388196, 1317133, 1230014, 1126318, 1045769, 994526, 937401, 866425, 789570, 732570, 670547, 624050, 599269, 566450, 523718, 506489, 502741, 504233, 506765, 498673, 517313, 562369, 622910, 659932, 694168, 743733, 778946, 800855, 803116, 803413, 809612, 826528, 826063, 801582, 781881, 772007, 754454, 730709, 718418, 719373, 710078, 667696, 627588, 625898, 616893, 592625, 587926, 583978, 566418, 559518, 557653, 541626, 534168, 535078, 518229, 504028, 492371, 478650, 471440, 459275, 469707, 462807, 446725]
16579D46725j5663J9038K5882M772j0673r307O479K4644p526j1694k922n964k197
16566D61594j7519k2484J1096K7265P867r670N067J1489J5511l865m493r779j062
16553D71017j3959j5901j9076O219M469n810k9934j1619K049K2087J4218j2105
16541D11655K6215J4700k6881k457r77N040M477O068p031n076Q192J1076O486
16528D51487j908o85l237o07j412p583J8054K945k1987K3245J7828J1351j2843
16515D74648k4897j4254J5206J5685k788j2362j6996J050Q764K0357J0377J487
16503D76277o381p286J0359m514j4891K074M011j4871L243j7614M466O366q134
16490D33105O602N119Q219k158j796l331J3852P082r793n153J1608J8078J4886
$$ y = [446725, 431062, 450100, 475982, 480754, 470081, 460774, 467253, 491897, 484371, 472677, 469755, 463791, 461594, 444075, 421591, 432687, 459952, 467819, 458149, 463216, 474705, 490216, 486351, 481858, 472079, 471017, 457058, 441157, 422081, 428300, 432769, 426959, 397025, 385406, 387455, 409542, 423760, 411655, 437870, 452570, 425689, 423232, 422255, 427295, 431772, 437840, 430809, 425733, 433925, 445001, 451487, 449579, 448894, 445657, 445050, 443638, 436055, 454109, 457054, 435067, 458312, 476140, 487491, 474648, 449751, 435497, 450703, 466388, 463600, 451238, 434242, 435292, 444056, 464413, 474790, 476277, 469896, 462610, 472969, 468455, 453564, 455638, 459649, 444778, 448021, 430407, 434873, 441239, 433105, 439707, 444826, 453045, 450887, 449091, 445760, 459612, 466694, 456901, 451748, 463356, 481434, 496320]
16477D96320j871r119r573O995j3074r954l346k036J5726r470j0285j422J8180
16464D67071O744k7675N214K1357K1085J8811q203j2407j0751K469J1123M982
16452D99820q241j8810J477j2683L508J4930j3487j8990K489R624K1976j6506
16440D65107j4707N697m407m062Q70j674n133N523K9864K1688J4851N372j9945
16427D99044l453P909j4539J003K177j7475r358J2308N539J3059L3485j082n72
16414E28045o810q49l856m92q840l736r428K397o323J5542O574J1542k814p562
16400E13390n348p117j0525o795M518J5024K1884O225j1023K1653p29Q667p01
16387E49123r579L485k714J4876K1603K7783M515q976J8923r70l009J1047L254
$$ y = [496320, 494449, 485330, 475757, 482752, 469678, 459724, 456378, 454342, 470068, 460598, 450313, 448891, 467071, 473815, 446140, 451354, 472711, 493796, 512607, 504404, 491997, 481246, 483715, 494838, 499820, 491579, 472769, 474246, 461563, 465071, 480001, 466514, 447524, 450013, 459637, 481613, 465107, 450400, 456097, 451690, 447628, 448498, 446824, 441691, 447214, 477078, 498766, 513617, 518989, 499044, 495591, 503500, 488961, 489964, 492141, 474666, 465308, 477616, 483155, 496214, 529699, 528617, 528045, 521235, 520386, 516530, 516038, 507198, 503462, 494034, 496431, 490108, 505650, 512224, 523766, 520952, 513390, 508042, 500925, 490400, 483605, 488123, 503147, 525031, 531256, 520233, 541886, 541157, 549824, 549123, 539544, 543029, 540315, 555191, 576794, 604577, 609092, 600116, 619039, 618069, 615060, 626107, 629361]
16374F29361J6941J1784o953O848Q288P833J3600M189K2959L7671J8082J4052
16362G84655L7012L8997L9963L8417M9998N2682N9312J08360J44841J05922J32487
16351A592646J35187J33239J37838P7887O2583P2298J3714o0736j01244r2133
16341A971279q9288j20382j39729j67910j56777j28844r5295p0177m0867j8870
16331I43140l3484m2978l1134k4764k3650J361J8085J0086J249k877J1311J217
16319H27562j5577L088N813O701M461R719L339L741K802J1361K8749J8672J5491
16306I25922K7827J7763J4673L8205M1299Q9760R4733J03040R5782J32839J35205
16295A717048J30004R9536O6208O7166Q3524M8774l5726r5746j08009r6781r8437
$$ y = [629361, 646302, 658086, 651133, 657981, 666269, 674102, 687702, 691891, 714850, 752521, 770603, 784655, 821667, 860664, 900627, 939044, 989042, 1041724, 1101036, 1209396, 1354237, 1460159, 1592646, 1727833, 1861072, 1998910, 2076797, 2139380, 2211678, 2225392, 2164656, 2063412, 1971279, 1881991, 1761609, 1621880, 1453970, 1297193, 1168349, 1073054, 1002877, 962010, 943140, 909656, 866678, 835544, 810780, 787130, 788491, 806576, 816662, 817911, 815034, 826345, 827562, 811985, 815073, 820886, 827587, 832048, 841767, 845106, 848847, 851649, 863010, 891759, 910431, 925922, 953749, 971512, 986185, 1024390, 1065689, 1155449, 1250182, 1353222, 1449004, 1581843, 1717048, 1847052, 1946588, 2012796, 2079962, 2163486, 2212260, 2176534, 2080788, 1972779, 1875998, 1777561]
16284A777561j39924j57388j48994j18553j11442o5329n3235n6074m3522j6425
16274H66675j7317k5903k0751j6647l2224j3229P867R682p417q219K16P380j3984
16261G36129K744P180J848m002j470r123k1778j8542j4871r940J1390l537k1551
16248F54477P479Q261j8318J4299kp282K742J1017N10o869Q564q680l2904j4921
16234F18373J7624Q517K360j4677Q834M948J2876K0171r201j5591k0454N683Q98
16221F40361J294j053j4490J2367r272N917K223j5135K782l153O920l409q725
16208F16627N662P439j483J1618r420o707M10k431j533P689J402J926J6476m154
16194F43521l459k297M545J5603N701L917j2906L601M903N429n976J6073r48j1361
$$ y = [1777561, 1637637, 1480249, 1331255, 1212702, 1101260, 1035931, 982696, 926622, 883100, 866675, 849358, 823455, 802704, 786057, 753833, 740604, 748471, 758153, 750736, 742517, 742733, 750113, 736129, 738873, 746053, 747901, 743899, 742429, 733306, 711528, 692986, 678115, 668175, 679565, 676028, 654477, 661956, 670217, 651899, 666198, 666196, 658914, 661656, 672673, 673183, 666314, 674878, 666198, 633294, 618373, 635997, 644514, 646874, 632197, 641031, 645979, 658855, 679026, 669825, 654234, 633780, 639463, 640361, 641655, 640602, 626112, 638479, 629207, 635124, 637347, 622212, 624994, 621841, 628761, 625352, 616627, 622289, 629728, 628245, 639863, 630443, 623736, 624146, 621715, 620182, 627871, 629273, 631199, 647675, 643521, 640062, 637765, 642310, 657913, 663614, 667531, 654625, 658226, 663129, 668558, 662582, 678655, 677707, 666346]
16180F66346k2660m520J8639J1081K421L952K940k276m163K156r721K186j5055
16167F51326Q601K4019Q365j2084J2276J2141m936j1017o74R168R337R49k3543
16154F83928j3034O136Q469k828O931K1564j005q357J1783j30k3530m157J4597
16141G00367r128K846k861j624P405p18p595j0363j4506p441L469L0154J9872
16128G09877J8131j2754n04o024Q12Q309K6109J698K242k756k33M928k0072L189
16114G32952P870j4809K675J2237j622j1668n593J2007K0322O800K497J0211J433
16101G75312q629p66k0933m319p47O998O711J1093p907j3237J2500L43J1340n57
16087G67202o094K944n942k0950J235L1749P898o170j5897J1773O354R499K844
$$ y = [666346, 643686, 639166, 657805, 668886, 671307, 675259, 678199, 675923, 671760, 673916, 664195, 666381, 651326, 659927, 683946, 692311, 680227, 692503, 704644, 699708, 688691, 688017, 697185, 706522, 707471, 683928, 670894, 677030, 685499, 682671, 689602, 711166, 710161, 701804, 713587, 713457, 689927, 685770, 700367, 691239, 694085, 691224, 689600, 697005, 696287, 688692, 678329, 663823, 656382, 659851, 690005, 709877, 728008, 715254, 714750, 708726, 709538, 717847, 743956, 745654, 747896, 745140, 744907, 749835, 729763, 732952, 740822, 726013, 728688, 740925, 739303, 727635, 722042, 734049, 754371, 761171, 763668, 773879, 775312, 766683, 765917, 744984, 740665, 739918, 746916, 753627, 764720, 756813, 743576, 756076, 756419, 767759, 767202, 761108, 764052, 758110, 737160, 738395, 770144, 778042, 771872, 755975, 767748, 774102, 783601, 786445]
16074G86445N808j9014J0266N436K0634O030k3095M452M359j537k922J1423m597
16061H03688m444K641J5275Q98J329L821O706N772R860j462q395q197N239P046
16047H39777P860j1672m205J9977n008j2405q790J0391Q169j856J4871J904p059
16034H51954n099k693Q810j071K467J0065J4385j7987o484q653o24L68O08J1647
16020H57693o644Q007J3997M421J2233n00o582O099M327J1868o543k3713J5819
16007H90482N794N018J1692J0791J1113R657q23j615j3409q281k1651L478N651
15994I07897K519j0731k107L767q58K3464L8932j2424j4797o964P406K2784J4085
15981I72973J124J834k1666j4687O261P349J7053L823J0077R683p429j049l887
$$ y = [786445, 792253, 773239, 783505, 788941, 809575, 815605, 792510, 796962, 801321, 799784, 796862, 808285, 803688, 799244, 801885, 817160, 818058, 819387, 823208, 829914, 835686, 845546, 844084, 835689, 827492, 832731, 839777, 847637, 835965, 831760, 851737, 846729, 834324, 825534, 835925, 844094, 842238, 857109, 859013, 851954, 846855, 844162, 852972, 851901, 854368, 864433, 878818, 860831, 854347, 845694, 845070, 845438, 846046, 857693, 851049, 859056, 873053, 877474, 889707, 889207, 882625, 888724, 893051, 904919, 898376, 874663, 890482, 896276, 901294, 912986, 923777, 934890, 944547, 943724, 942109, 928700, 920419, 898768, 902246, 907897, 910416, 899685, 897578, 901345, 900487, 923951, 962883, 950459, 935662, 928698, 936104, 958888, 972973, 974097, 975931, 954265, 939578, 945839, 953188, 970241, 974064, 984141, 993824, 986395, 985346, 981459]
15968I81459J2313J230o962J5715j2575j2640J2508J2392j770m852J1581R704
15956A018103K6754P465r767j4085L518K349J722O131N111k943J4045O882p899
15943A057386N662n628K480L413J0603r48n31n642O737N430J188o970o721p315
15929A059144J6135m568j4626K148J6002J7967K3085L684j1025n746M564L964
15917A110728P772K31P712O332k748j2841N245O929P7o011L143J7456K0798k7143
15903A137680k0052J3328M734L872J0439M069j0394R291p289O991K4815K2976
15891A200460j661l046k631k2865j228l960J9936L2664L0070n24N006m73k0590
15878A231158o088n830J5032J0401j723L83j1828m104K0020L343n568p21K2489
$$ y = [981459, 993772, 995002, 988040, 1003755, 991180, 978540, 991048, 1003440, 1001670, 996818, 1008399, 1018103, 1044857, 1052322, 1042555, 1028470, 1031988, 1034337, 1036059, 1042190, 1047301, 1044358, 1058403, 1065285, 1057386, 1063048, 1057420, 1059900, 1063313, 1073916, 1072968, 1072437, 1066795, 1073532, 1078962, 1080150, 1073180, 1066459, 1059144, 1075279, 1070711, 1056085, 1058233, 1074235, 1092202, 1115287, 1118971, 1107946, 1102200, 1106764, 1110728, 1118500, 1118731, 1126443, 1132775, 1130027, 1117186, 1122431, 1129360, 1129437, 1123426, 1126569, 1144025, 1164823, 1137680, 1117628, 1130956, 1135690, 1139562, 1150001, 1154070, 1143676, 1152967, 1145678, 1152669, 1177484, 1200460, 1198799, 1195753, 1193122, 1170257, 1169029, 1165069, 1185005, 1217669, 1247739, 1247215, 1252221, 1251748, 1231158, 1225070, 1219240, 1234272, 1244673, 1242950, 1243333, 1231505, 1227401, 1247421, 1250764, 1245196, 1244475, 1266964]
15865A266964L2696J9928J1259o16L759k3506j6681j4747Q431O015K6121J65R109
15852A328897j923Q844R690M817r627L534J6836j4642r976J836R936J2896o060
15839A355058j2756j2527o453o320P178J6247K5058J6616J2818J1818N289m655
15827A407371R163K443R09O973J908k952p018J9047L054M454m646L203J5080q750
15813A450239P86m792J443K9017N366J1987K066J0162J3437p003O285k000Q600
15800A525593J386j0729k496L234K9207R386N592j0582J633J6022J7543J6400
15788A602189o315j2889M414O706O820L343J8643K297j2909P3Q099J4387L9175
15775A674033J8544j1578J705J1592j5308M317K025p022P186N829J5396J5930
$$ y = [1266964, 1299660, 1319588, 1330847, 1330231, 1333990, 1310484, 1293803, 1279056, 1287487, 1293502, 1319623, 1319788, 1328897, 1326974, 1335818, 1345508, 1350325, 1340698, 1344232, 1361068, 1346426, 1336450, 1338286, 1348222, 1361118, 1355058, 1342302, 1329775, 1323322, 1317002, 1324180, 1340427, 1365485, 1382101, 1394919, 1406737, 1412026, 1407371, 1416534, 1418977, 1419886, 1426859, 1428767, 1425815, 1418797, 1437844, 1440898, 1445352, 1440706, 1443909, 1458989, 1450239, 1451025, 1446233, 1447676, 1476693, 1482059, 1494046, 1496112, 1506274, 1519711, 1512708, 1518993, 1516993, 1525593, 1526979, 1516250, 1513754, 1516988, 1546195, 1555581, 1561173, 1550591, 1552224, 1568246, 1585789, 1602189, 1595874, 1582985, 1587399, 1594105, 1600925, 1604268, 1622911, 1625208, 1612299, 1612372, 1620471, 1634858, 1674033, 1692577, 1680999, 1682704, 1694296, 1678988, 1683305, 1685330, 1678308, 1685494, 1691323, 1706719, 1722649]
15763A722649Q326K8341K7526J7936O010R977k609J500m276l342k060R270J4976
15750A834224M705J0581K0847k980q775J3564J9912m677J294j0624J1023J511
15738A890605J5350J8200J5280k288p246L365J4934J7310j153J3178J5276j6178
15726A976633n237J7213K3617K8300K5122J414J0145r883M029J6387J1415J0403
15714B109558J4920J2849o93O011L177J955O970P407J3085J3420J767K1563R516
15701B221505J844p982J370L895o971n858J1462N999l659o30R30L1782J6034j5876
15687B253845j7131r833J3565K7262J1622N712J2877k101J1398J6701j0811o148
15675B306958J1022J6009L2955J2452o053j2633k711J2579L2743J3361N021L897
$$ y = [1722649, 1730975, 1759316, 1786842, 1804778, 1810788, 1820765, 1818156, 1819656, 1815380, 1812038, 1809978, 1819248, 1834224, 1838929, 1849510, 1870357, 1867377, 1858602, 1872166, 1892078, 1887401, 1888695, 1878071, 1889094, 1890605, 1905955, 1924155, 1939435, 1937147, 1929901, 1933266, 1948200, 1965510, 1964357, 1977535, 1992811, 1976633, 1971396, 1988609, 2012226, 2040526, 2065648, 2067062, 2077207, 2067324, 2071353, 2087740, 2099155, 2109558, 2124478, 2137327, 2136634, 2142645, 2145822, 2147777, 2154747, 2162154, 2175239, 2188659, 2190426, 2211989, 2221505, 2223349, 2215367, 2216737, 2220632, 2213661, 2207803, 2219265, 2225264, 2221605, 2220975, 2221905, 2253687, 2269721, 2253845, 2236714, 2226881, 2240446, 2267708, 2279330, 2285042, 2297919, 2295818, 2307216, 2323917, 2313106, 2306958, 2317980, 2333989, 2366944, 2379396, 2373343, 2360710, 2357999, 2370578, 2403321, 2416682, 2421703, 2425600]
15663B425600L315K55j4732J8910K0871J889J4517R852k730j9017J5413K1470
15651B495613J3601l187J3010L0488l304j2466o677N752n773l9j9278J1369M153
15638B523262J1372K6660L9605L104K109r06J4055K0212J0280J6536K4031N834
15626B696154k182R695j2278r399M087J7337L013K446K0866K0727o585m2J70L7437
15612B781446R654k280J2121J666m863R665J0960p118j894R463o761K8827K8639
15599B869525J5777K0773P956k293j8307j397J6046J1448J3118J7064K6228J309
15587B977247j173J2869N493J7143J4911J3894o47K397R919K1359M703Q439M3384
15574C129938K8933j2727N987K2951p812P560J6129L533K861K0302K5593N734
$$ y = [2425600, 2428915, 2429170, 2414438, 2433348, 2454219, 2456108, 2470625, 2480477, 2477747, 2458730, 2474143, 2495613, 2509214, 2506027, 2519037, 2549525, 2546221, 2533755, 2527078, 2532830, 2527057, 2527018, 2507740, 2519109, 2523262, 2534634, 2561294, 2600899, 2604003, 2606112, 2605206, 2619261, 2639473, 2649753, 2666289, 2690320, 2696154, 2693972, 2703667, 2691389, 2681990, 2686077, 2703414, 2706427, 2708873, 2729739, 2750466, 2743881, 2743839, 2744009, 2781446, 2791100, 2788820, 2800941, 2802607, 2797744, 2807409, 2818369, 2811251, 2809357, 2818820, 2812059, 2840886, 2869525, 2885302, 2906075, 2914031, 2911738, 2893431, 2892034, 2908080, 2919528, 2932646, 2949710, 2975938, 2977247, 2976074, 2988943, 2994436, 3011579, 3026490, 3040384, 3039737, 3042134, 3052053, 3073412, 3078115, 3086554, 3129938, 3158871, 3146144, 3152131, 3175082, 3167270, 3174830, 3190959, 3194492, 3197353, 3217655, 3243248, 3248982]
15562C248982O820J7419J9691R550K1917J9742L2762K7304j8776N272L6253J5935
15550C442871R556J5456J5557K7129J9306K506J9004R837O561P342K2751K7572
15538C625448J2488K1220K3669M722J4111K2619N839J9096J2670J0362K1677J6071
15526C809992J4091o69O078K1617L8627K7002J8917L5020J8433J4237K5585P853
15514D036783K5423Q932M0014K4719P765J5615L0452J9913K0539J6038L074J0733
15502D260000K7838M5438L0179J9835J4057J4215L6313M4597K0487P209l02K1046
15490D540912L9213L3284K0193K0569J8752L3983L7778K0306J4104K0375M7889
15479D847358L5474K8360K1404L3304K8344J0251K9810M3819L2780K8008L5800
$$ y = [3248982, 3255802, 3273221, 3292912, 3302462, 3324379, 3344121, 3376883, 3404187, 3385411, 3390683, 3426936, 3442871, 3452427, 3467883, 3483440, 3510569, 3529875, 3532381, 3551385, 3561222, 3567783, 3575125, 3597876, 3625448, 3637936, 3659156, 3682825, 3687547, 3701658, 3724277, 3730116, 3749212, 3761882, 3772244, 3793921, 3809992, 3824083, 3823414, 3829492, 3851109, 3889736, 3916738, 3935655, 3970675, 3989108, 4003345, 4028930, 4036783, 4062206, 4071138, 4111152, 4135871, 4143636, 4159251, 4189703, 4209616, 4230155, 4246193, 4249267, 4260000, 4287838, 4333276, 4363455, 4383290, 4397347, 4411562, 4447875, 4492472, 4512959, 4520168, 4519866, 4540912, 4580125, 4613409, 4633602, 4654171, 4672923, 4706906, 4744684, 4764990, 4779094, 4799469, 4847358, 4882832, 4911192, 4932596, 4965900, 4994244, 5004495, 5034305, 5078124, 5110904, 5138912, 5174712]
15468E174712M5160N8818L7679K1493L5330M7375M9414K4834K0721L4971L2044
15457E582551M1548N5977L8627M1017M3581M1255L8100N1030O4268N9336M6723
15446F104013L8462L5948N0813O3832N8105P1791O0138N4581O0202P6147R9440
15435F773472J08846P2863O5663P7702J03081J22223J16699R1766R2145J19710
15425G744170J18925J27928J01505P7693P1623O5190L4608l193m746j3893n2036
15414H267774l2352k0830k6062m0147j9925R430K5279k3577J102L2898L0986J5566
15402H220142K9610M1469K9822K5219L3695M7184O0633O1220M7587K9116M8627
15391H674324L7430L3016N6701N5290N4161N2446M9104N8710O8120O7603N1080
$$ y = [5174712, 5219872, 5278690, 5316369, 5337862, 5373192, 5420567, 5469981, 5494815, 5515536, 5550507, 5582551, 5624099, 5680076, 5718703, 5759720, 5803301, 5844556, 5882656, 5933686, 5997954, 6057290, 6104013, 6142475, 6178423, 6229236, 6293068, 6351173, 6422964, 6483102, 6537683, 6597885, 6674032, 6773472, 6882318, 6955181, 7020844, 7098546, 7201627, 7323850, 7440549, 7532315, 7624460, 7744170, 7863095, 7991023, 8092528, 8170221, 8241844, 8307034, 8341642, 8338449, 8333703, 8319810, 8267774, 8235422, 8214592, 8188530, 8148383, 8128458, 8137888, 8163167, 8139590, 8140692, 8173590, 8204576, 8220142, 8249752, 8291221, 8321043, 8346262, 8379957, 8427141, 8487774, 8548994, 8596581, 8625697, 8674324, 8711754, 8744770, 8801471, 8856761, 8910922, 8963368, 9012472, 9071182, 9139302, 9206905, 9257985]
15380I257985O2075N9887N1843O3730O8798N4621O7733Q4904O7487O2615O8203
15369I969881O6179P1804M9014O4171Q1011R8720R0707Q5666Q9368R1133P1585
15358A0829239Q3204R5693R9712R1165R9827J15267R2081R5315J01293R6800R6249
15347A1895845J04993J08982J23300J25132J09955J03126J09453J06298J08590
15338A2895674J31825J09115J13583J03139J09482J33666J44368J16679J30062
15329A3987593J48719J51382J38036J36275J42035J54100J49413J40200J51647
15320A5299400J41816J46989J59543J71138J46638J48265K03856J94186J83963
15311A6795794J68392J73740J82694J89861J67947J95917J88646J79989J76001
$$ y = [9257985, 9320060, 9379947, 9431790, 9495520, 9564318, 9618939, 9686672, 9771576, 9839063, 9901678, 9969881, 10036060, 10107864, 10156878, 10221049, 10302060, 10400780, 10491487, 10577153, 10666521, 10757654, 10829239, 10912443, 11008136, 11107848, 11199013, 11298840, 11414107, 11506188, 11601503, 11702796, 11799596, 11895845, 12000838, 12109820, 12233120, 12358252, 12468207, 12571333, 12680786, 12787084, 12895674, 13027499, 13136614, 13250197, 13353336, 13462818, 13596484, 13740852, 13857531, 13987593, 14136312, 14287694, 14425730, 14562005, 14704040, 14858140, 15007553, 15147753, 15299400, 15441216, 15588205, 15747748, 15918886, 16065524, 16213789, 16417645, 16611831, 16795794, 16964186, 17137926, 17320620, 17510481, 17678428, 17874345, 18062991, 18242980, 18418981]
15302A8418981J95744K20100K26499K36538K19227K11028K22197K37818K30086
15293B0418218K19637K20035K53887K38309K46240K64667K80656K68013K75652
15284B2685314K73395K88231K84675K89625K95214L04667L18358L07528L19699
15275B5366706L12073L24313L56335L39552L54349L61138L79782L68880L88953
15266B8552081M08003M11248M08663M14569M28184M32747M50425M64039M55704
15257C2425663M55881M77988M74008M94876N21124N20645N35893N81584N86945
15248C7074607N74433N86448N90236O23740O27511O29142O51626P00345P02400
15239D2760488O83286P03832P54791P79929P97319Q03403Q12342Q16316Q43365
$$ y = [18418981, 18614725, 18834825, 19061324, 19297862, 19517089, 19728117, 19950314, 20188132, 20418218, 20637855, 20857890, 21111777, 21350086, 21596326, 21860993, 22141649, 22409662, 22685314, 22958709, 23246940, 23531615, 23821240, 24116454, 24421121, 24739479, 25047007, 25366706, 25678779, 26003092, 26359427, 26698979, 27053328, 27414466, 27794248, 28163128, 28552081, 28960084, 29371332, 29779995, 30194564, 30622748, 31055495, 31505920, 31969959, 32425663, 32881544, 33359532, 33833540, 34328416, 34849540, 35370185, 35906078, 36487662, 37074607, 37649040, 38235488, 38825724, 39449464, 40076975, 40706117, 41357743, 42058088, 42760488, 43443774, 44147606, 44902397, 45682326, 46479645, 47283048, 48095390, 48911706, 49755071]
15230D9755071Q56239Q67367R05996R32309R87378R86041R96688J022795J047347
15221E8357231J083879J098606J115559J156245J184806J207692J237456J263580
15213F7705054J303257J314468J355240J390539J424990J435044J500839J536256
15205G8965687J571635J572999J611897J656891J702495J733890J801679J808055
15197I2425228J856302J912540J936647J957011J988968K052868K104021K111487
15189A08345072K137420K181725K185774K221138K261671K310874K342432K371863
15181A26357969K400546K428548K436874K443372K453494K479396K495611K475581
15173A45971391K460067K457801K473007K445764K418949K407030K373095K358479
$$ y = [49755071, 50611310, 51478677, 52384673, 53316982, 54304360, 55290401, 56287089, 57309884, 58357231, 59441110, 60539716, 61655275, 62811520, 63996326, 65204018, 66441474, 67705054, 69008311, 70322779, 71678019, 73068558, 74493548, 75928592, 77429431, 78965687, 80537322, 82110321, 83722218, 85379109, 87081604, 88815494, 90617173, 92425228, 94281530, 96194070, 98130717, 100087728, 102076696, 104129564, 106233585, 108345072, 110482492, 112664217, 114849991, 117071129, 119332800, 121643674, 123986106, 126357969, 128758515, 131187063, 133623937, 136067309, 138520803, 141000199, 143495810, 145971391, 148431458, 150889259, 153362266, 155808030, 158226979, 160634009, 163007104, 165365583]
15165A65365583K334744K270386K211444K142710K038279J942940J881040J800894
15157A81988020J701433J599918J475847J361253J231158J098667R68010Q20636
15149A92244942O87660N74706M46592K66997J05613m7965j92055l34889m69418
15140A93282183o20383p76583r07430j046246j178663j316115j429501j522596
15132A84484666j619548j725266j822010j895414j984670k053214k111935k157668
15124A69114941k240398k284590k297479k341336k371866k375848k425744k415017
15116A50362663k437067k408382k414915k421344k418525k404688k389445k399610
15108A31068687k370811k348885k322909k288083k279378k245394k198102k199119
$$ y = [165365583, 167700327, 169970713, 172182157, 174324867, 176363146, 178306086, 180187126, 181988020, 183689453, 185289371, 186765218, 188126471, 189357629, 190456296, 191424306, 192244942, 192932602, 193507308, 193953900, 194220897, 194326510, 194278545, 194086490, 193751601, 193282183, 192661800, 191885217, 190977787, 189931541, 188752878, 187436763, 186007262, 184484666, 182865118, 181139852, 179317842, 177422428, 175437758, 173384544, 171272609, 169114941, 166874543, 164589953, 162292474, 159951138, 157579272, 155203424, 152777680, 150362663, 147925596, 145517214, 143102299, 140680955, 138262430, 135857742, 133468297, 131068687, 128697876, 126348991, 124026082, 121737999, 119458621, 117213227, 115015125, 112816006]
15100A12816006k176225k165679k107842k093352k043586k026718j988847j934471
15092I6279286j898002j856934j830641j797280j758881j723325j723380j661362
15084H2029481j610420j603394j585544j560694j501694j466377j446296j413709
15076F9841353j396737j374377j344045j308193j268896j238476j210630j170471
15068E9529528j142298j121010j085261j064494j041441j051386j007389r72428
15060E1043821r78459r55243r36551q87263q56621q56650q37601p97676p92291
15051D3145466p81713p58808p61835p28466p26349o91601o63173o87714o71764
15042C6674043o29583o06102o04531n85790n94171n64457n44235n34643n17443
$$ y = [112816006, 110639781, 108474102, 106366260, 104272908, 102229322, 100202604, 98213757, 96279286, 94381284, 92524350, 90693709, 88896429, 87137548, 85414223, 83690843, 82029481, 80419061, 78815667, 77230123, 75669429, 74167735, 72701358, 71255062, 69841353, 68444616, 67070239, 65726194, 64418001, 63149105, 61910629, 60699999, 59529528, 58387230, 57266220, 56180959, 55116465, 54075024, 53023638, 52016249, 51043821, 50065362, 49110119, 48173568, 47286305, 46429684, 45573034, 44735433, 43937757, 43145466, 42363753, 41604945, 40843110, 40114644, 39388295, 38696694, 38033521, 37345807, 36674043, 36044460, 35438358, 34833827, 34248037, 33653866, 33089409, 32545174, 32010531, 31493088]
15033C1493088n19988n10472m85731m70327m76708m58831m67144m57867m36513
15024B7209507m19334m20966l82607l95572m22145m02121l57748l39984l39752
15015B3729278l57850l49405l45587l52850l30596l05014l29122l10223k97661
15006B0750970l05712k91813k78502k69496k59212k45515k58370k45199k73582
14997A8323569k71216k38001k27605k13792k46466k05160k12446k18228k00995
14988A6289660k08855j76084j88147j97684k15456j61422j88540k05060j76480
14979A4571932j50833j88062j79765j59579j45519j50888j58919j54202j41741
14970A3142424j63352j72395j38658j24920j31105j31262j32257j25676j50138
$$ y = [31493088, 30973100, 30462628, 29976897, 29506570, 29029862, 28571031, 28103887, 27646020, 27209507, 26790173, 26369207, 25986600, 25591028, 25168883, 24766762, 24409014, 24069030, 23729278, 23371428, 23022023, 22676436, 22323586, 21992990, 21687976, 21358854, 21048631, 20750970, 20445258, 20153445, 19874943, 19605447, 19346235, 19100720, 18842350, 18597151, 18323569, 18052353, 17814352, 17586747, 17372955, 17126489, 16921329, 16708883, 16490655, 16289660, 16080805, 15904721, 15716574, 15518890, 15303434, 15142012, 14953472, 14748412, 14571932, 14421099, 14233037, 14053272, 13893693, 13748174, 13597286, 13438367, 13284165, 13142424, 12979072, 12806677, 12668019, 12543099, 12411994, 12280732, 12148475, 12022799, 11872661]
14961A1872661j52924j10235j13801r2508j20075j33058j30415j03427j25682
14952A0790536j00442r5067j10125j30511j21921r5352r6606r1857r0909r6195
14942I761551r3656q7962q2986r0351j06399j15992j01674p1546p1000o9507q5272
14931H785206r0035r9103q5704p2458p0567p7826p6244o5945o1696p7150p6055
14920G932423o0228n9230p4218p4931m1059o5580p2166n9098o9470n5920m9490
14909G251033p7257p9561m1783k4445m8212o4003n9899p2001m2500o3860l7008
14898F640504m6937l1104l9992k9143k7252m0356l8036m0517l0246j8824l8531
14887F259566o728K434k1752l1356q35Q858J437j4004L518J3894L6548L2504M4802
$$ y = [11872661, 11719737, 11609502, 11495701, 11403193, 11283118, 11150060, 11019645, 10916218, 10790536, 10690094, 10595027, 10484902, 10354391, 10232470, 10137118, 10040512, 9948655, 9857746, 9761551, 9667895, 9579933, 9496947, 9406596, 9300197, 9184205, 9082531, 9010985, 8939985, 8870478, 8785206, 8695171, 8596068, 8510364, 8437906, 8367339, 8289513, 8213269, 8147324, 8085628, 8008478, 7932423, 7872195, 7812965, 7738747, 7663816, 7622757, 7557177, 7485011, 7425913, 7356443, 7300523, 7251033, 7173776, 7094215, 7052432, 7027987, 6979775, 6915772, 6855873, 6783872, 6741372, 6677512, 6640504, 6593567, 6562463, 6522471, 6493328, 6466076, 6425720, 6387684, 6347167, 6316921, 6298097, 6259566, 6252838, 6255272, 6233520, 6202164, 6201329, 6210187, 6211624, 6197620, 6201138, 6215032, 6251580, 6284084, 6328886]
14874F328886K7768k558O044j2271k9428o3511n6779q0268r8733j10341j11229
14863E797580j06628j18583j18586j06838j00452p1951p4340r8686p8992o9918
14853D852606m5241m2257n5217m4389p3394n3908m4764m5289l6708k5948m2508
14842D342983k8606l4375m9095k4979l0363m4177l9925l7050m8233l5090k7000
14831C944090m8077n1372m7987k4924j9463j9808m1697l9585j8878k8247q240
14820C595812j9865m9379l1415k5079l7766j2526j7367j8891l7068k9478k1973
14809C295005m2212j9322r437k9509m4490l0154j5628l242l577j0478l1051l1573
14797C024332k1538k7555K575j1016k7854k8917m9212k0231j2022L143m0620m9243
$$ y = [6328886, 6356654, 6354096, 6360140, 6347869, 6318441, 6254930, 6198151, 6117883, 6019150, 5908809, 5797580, 5690952, 5572369, 5453783, 5346945, 5246493, 5174542, 5100202, 5001516, 4922524, 4852606, 4807365, 4765108, 4709891, 4665502, 4592108, 4538200, 4493436, 4448147, 4411439, 4385491, 4342983, 4314377, 4280002, 4230907, 4205928, 4175565, 4131388, 4091463, 4054413, 4006180, 3971090, 3944090, 3896013, 3844641, 3796654, 3771730, 3752267, 3732459, 3690762, 3651177, 3632299, 3604052, 3595812, 3575947, 3526568, 3495153, 3470074, 3432308, 3419782, 3402415, 3383524, 3346456, 3316978, 3295005, 3252793, 3233471, 3224034, 3194525, 3150035, 3119881, 3104253, 3101011, 3097434, 3086956, 3055905, 3024332, 3002794, 2975239, 2977814, 2966798, 2938944, 2910027, 2860815, 2840584, 2828562, 2831705, 2791085, 2741842]
14785B741842j6715j3780k7392j9540M305k344k5638k9494k9732p959J0194j677
14773B582070m4736j9737p145k4872r630j0654l2070l7154j1531j0909K520p160
14761B368992l0260m2316q090R237j2366j6780j1327m426M409l827l4701l5926
14749B182619j9219J0760j0668k7298k8425j0285k7163j8453J0968N3j6909m986
14737B040994L499j9963k1820j295j0087j54O369k4197l5523j7923J2275P453
14725A939628j0916j8745k4713l970l025J887l113k5189k1044r631j2444l2695
14713A776030j2255r786n745Q627l235j4446o623k7351l8374k6130R04N048J0210
14700A656874n722k1602o224n500r614n275l018J506k0418n696j7178M484q458
$$ y = [2741842, 2725127, 2711347, 2683955, 2664415, 2668720, 2666376, 2640738, 2611244, 2581512, 2573553, 2583747, 2582070, 2537334, 2517597, 2510452, 2485580, 2475950, 2465296, 2433226, 2396072, 2384541, 2373632, 2376152, 2368992, 2338732, 2296416, 2288326, 2297563, 2285197, 2268417, 2257090, 2252664, 2257073, 2253246, 2218545, 2182619, 2163400, 2174160, 2163492, 2136194, 2107769, 2097484, 2070321, 2051868, 2062836, 2062889, 2045980, 2040994, 2044493, 2024530, 2002710, 2001415, 1991328, 1991174, 1997543, 1973346, 1937823, 1919900, 1932175, 1939628, 1928712, 1909967, 1885254, 1881284, 1878259, 1880146, 1877033, 1851844, 1830800, 1821169, 1808725, 1776030, 1763775, 1753989, 1748244, 1756871, 1753636, 1739190, 1732567, 1705216, 1666842, 1640712, 1641616, 1646664, 1656874, 1651152, 1629550, 1623326, 1617826, 1608212, 1602937, 1599919, 1601425, 1581007, 1575311, 1558133, 1562617, 1554159]
14687A554159k906J75j7301j2199k5310k7173N363J4211r966k5225o458j4192
14675A433178r482j0472M841r261R406J3796j4625j6873n915j3564j7871R945
14663A373103q156k9973j5193r577M753p170j0790K519j7304r706J7566k0783
14651A269289k8116j5108k50j0125q242Q467K206n529j1576M189p361j5933N915
14638A187826m618j3329k7337k3542J1401J9656j452j4124j6006R676k105j5640
14626A110406j7314m075o489M36k3674j6312k518J4730j072P029l797k1930k6079
14613A009341p380o358q809L621r379j9147n627J2859L186j0843K47J984r429
14600I54266O318R718R401j1659k0256j2742j183P749M287p191p653n910j4968
$$ y = [1554159, 1551253, 1551428, 1534127, 1521928, 1496618, 1469445, 1474808, 1489019, 1479053, 1453828, 1447370, 1433178, 1423696, 1413224, 1418065, 1408804, 1418210, 1432006, 1417381, 1400508, 1394593, 1381029, 1363158, 1373103, 1364947, 1334974, 1319781, 1310204, 1314957, 1307787, 1296997, 1299516, 1282212, 1272506, 1290072, 1269289, 1241173, 1226065, 1225815, 1215690, 1207448, 1215915, 1218121, 1212592, 1201016, 1205205, 1197844, 1181911, 1187826, 1183208, 1169879, 1142542, 1119000, 1130401, 1150057, 1148605, 1134481, 1118475, 1128151, 1126046, 1110406, 1093092, 1089017, 1082528, 1082964, 1059290, 1042978, 1040460, 1055190, 1054118, 1061147, 1057350, 1035420, 1009341, 1001961, 995603, 986794, 990415, 981036, 961889, 956262, 969121, 972307, 961464, 961711, 963695, 954266, 960584, 970302, 979703, 968044, 947788, 935046, 933863, 941612, 945899, 938708, 931055, 925145, 910177]
14587I10177j6024J2614J4710J9848j2257l9601j6521r786l632J1594q926k937
14575H59259q160p839M586n118j4080j7054M087k85L052J0581j3596p866n95j1707
14561G95265M95M284m559l0586n019J21Q370O083J0263P894o322q994k262n369
14547G69664l819j6316p239j8931k152O063j9128m801L025k930m386l50n452p98
14533F92450R902K888j5034k4442M467J5487L494J1458J9401r476k6541k2702
14521F61352j3738k28P010J9885j6035j9825M312J8572O477m790m467k2142k3700
14508F12683R55J0634j1361m64n163r07P009m832l1241m650K2232M662j3693o0
14494E85804L489J0797K4375M979M578j032q272k5287j9320j4063O340l560j9737
$$ y = [910177, 894153, 906767, 921477, 941325, 929068, 889467, 872946, 863160, 859528, 871122, 862196, 859259, 851099, 843260, 847846, 842728, 828648, 811594, 815681, 815396, 818448, 829029, 815433, 807567, 806972, 795265, 795760, 800044, 795485, 764899, 759880, 760001, 768371, 774454, 784717, 792611, 786289, 777295, 775033, 769664, 765845, 749529, 742290, 723359, 721207, 727270, 708142, 703341, 706366, 703436, 699050, 698700, 693248, 692450, 702352, 705240, 690206, 665764, 670231, 685718, 689212, 700670, 720071, 710595, 684054, 661352, 647614, 647386, 654396, 674281, 658246, 638421, 642733, 661305, 667782, 662992, 658525, 636383, 612683, 613638, 624272, 612911, 612447, 607284, 606377, 613386, 608554, 577313, 572663, 594895, 599557, 585864, 585804, 589293, 600090, 624465, 629444, 634022, 632990, 624718, 599431, 580111, 566048, 572388, 568828, 549091]
14481E49091L045j177j1162J0657P662n205R297j8517q600J07L992j912o843l746
$$ y = [549091, 552136, 550959, 539797, 550454, 558116, 552911, 562208, 543691, 535091, 535198, 539190, 537278, 530435, 526689]
$$ [...]
##END NTUPLES=NMR SPECTRUM
##END=
