##TITLE=Analysis number 311372
Compound Code rh 01534
Project Code adrs
Chemist Name mariap
##JCAMPDX= 6.0         $$ Bruker NMR JCAMP-DX V2.0
##DATA TYPE= NMR SPECTRUM
##DATA CLASS= NTUPLES
##ORIGIN= Bruker BioSpin GmbH
##OWNER= NMR
$$ XWIN-NMR		Version 3.5
$$ Thu Jul  7 12:13:29 2005 GMT Daylight Time (UT+1h)  MAYBRIDGE\NMR@NMR_250MHZ
##.OBSERVE FREQUENCY= 250.131544655141
##.OBSERVE NUCLEUS= ^1H
##.ACQUISITION MODE= SIMULTANEOUS (DQD)
##.ACQUISITION SCHEME= undefined
##.AVERAGES= 16
##.DIGITISER RES= 18
##SPECTROMETER/DATA SYSTEM= dpx250
##.PULSE SEQUENCE= zg30
##.SOLVENT NAME= DMSO
##.SHIFT REFERENCE= (INTERNAL, DMSO, 0, 16.522)
##AUDIT TRAIL= $$ (NUMBER, WHEN, WHO, WHERE, WHAT)
$$ ##TITLE= Audit trail, XWIN-NMR		Version 3.5
$$ ##JCAMPDX= 5.01
$$ ##ORIGIN= Bruker BioSpin GmbH
$$ ##OWNER= NMR
$$ C:\u/data/dgb/nmr/ADRS/5460/pdata/1/auditp.txt
$$ ##AUDIT TRAIL=  $$ (NUMBER, WHEN, WHO, WHERE, WHAT)
(   1,<2005-07-07 12:13:09.54 +100>,<MAYBRIDGE\NMR>,<NMR_250MHZ>,
      <created by zg, POWCHK disabled, PULCHK disabled
       configuration hash MD5:
       62 19 C7 07 E1 42 D1 B7 37 6C 3D D0 77 39 F9 E6
       data hash MD5: 64K
       8E C4 6F D6 DF 9D D3 41 3E D7 A1 51 20 65 21 07>)
(   2,<2005-07-07 12:13:20.30 +100>,<MAYBRIDGE\NMR>,<NMR_250MHZ>,
      <Start of raw data processing
       ef LB = 0.3 FT_mod = 6 PKNL = 1 SI = 32K 
       data hash MD5: 32K
       9C 8B C1 04 60 71 80 DA CB 27 60 E7 4D FE F9 86>)
(   3,<2005-07-07 12:13:22.24 +100>,<MAYBRIDGE\NMR>,<NMR_250MHZ>,
      <apk 
       data hash MD5: 32K
       B2 FE F1 58 FB FF 37 0F 32 85 E3 D0 8C 9F 8F 6F>)
(   4,<2005-07-07 12:13:22.96 +100>,<MAYBRIDGE\NMR>,<NMR_250MHZ>,
      <abs ABSG = 5 
       data hash MD5: 32K
       54 66 98 F9 08 42 CE 5A 42 ED 03 61 95 F9 9D 1B>)
$$ ##END=
$$ 
$$ hash MD5
$$ 06 A2 1F AE 86 D8 AD DF 77 93 C2 E9 FA 54 92 52
##$RELAX= 
##$RELAX= 
##$RELAX= 
##$RELAX= 
##$RELAX= 
##$RELAX= 
##$RELAX= 
$$ Bruker specific parameters
$$ --------------------------
##$DU= <C:\u>
##$EXPNO= 5460
##$NAME= <ADRS>
##$PROCNO= 1
##$TYPE= <nmr>
##$USER= <dgb>
##$AMP= (0..31)
100 100 100 100 100 100 100 100 100 100 100 100 100 100 100 100 100 100 
100 100 100 100 100 100 100 100 100 100 100 100 100 100 
##$AQSEQ= 0
##$AQ_mod= 3
##$AUNM= <au_zg>
##$AUTOPOS= <23 >
##$BF1= 250.13
##$BF2= 250.13
##$BF3= 250.13
##$BF4= 250.13
##$BF5= 500.13
##$BF6= 500.13
##$BF7= 500.13
##$BF8= 500.13
##$BYTORDA= 1
##$CFDGTYP= 0
##$CFRGTYP= 5
##$CHEMSTR= <none>
##$CNST= (0..31)
1 1 145 1 1 1 1 1 1 1 1 1 1 1 1 1 1 1 1 1 1 1 1 1 1 1 1 1 1 1 1 1 
##$CPDPRG= <>
##$CPDPRG1= <>
##$CPDPRG2= <>
##$CPDPRG3= <>
##$CPDPRG4= <mlev>
##$CPDPRG5= <mlev>
##$CPDPRG6= <mlev>
##$CPDPRG7= <mlev>
##$CPDPRG8= <mlev>
##$CPDPRGB= <>
##$CPDPRGT= <>
##$D= (0..31)
0 1 0 0 0 0 0 0 0 0.06 0 0 0 0 0 0 0.0002 0 0 0 0 0 0 0 0 0 0 0 0 0 0 
0 
##$DATE= 1120734788
##$DBL= (0..7)
120 120 120 120 120 120 120 120 
##$DBP= (0..7)
150 150 150 150 150 150 150 150 
##$DBP07= 0
##$DBPNAM0= <>
##$DBPNAM1= <>
##$DBPNAM2= <>
##$DBPNAM3= <>
$$ [...]
##$SUBNAM7= <"">
##$SUBNAM8= <"">
##$SUBNAM9= <"">
##$SW= 20.6930455092707
##$SWIBOX= (0..15)
0 0 3 0 0 0 0 0 0 0 0 0 0 0 0 0 
##$SW_h= 5175.983436853
##$TD= 65536
##$TD0= 1
##$TE= 295.16
##$TE2= 300
##$TE3= 300
##$TEG= 300
##$TL= (0..7)
0 120 120 120 120 120 120 120 
##$TP= (0..7)
150 150 150 150 150 150 150 150 
##$TP07= 0
##$TPNAME0= <>
##$TPNAME1= <>
##$TPNAME2= <>
##$TPNAME3= <>
##$TPNAME4= <>
##$TPNAME5= <>
##$TPNAME6= <>
##$TPNAME7= <>
##$TPOAL= (0..7)
0.5 0.5 0.5 0.5 0.5 0.5 0.5 0.5 
##$TPOFFS= (0..7)
0 0 0 0 0 0 0 0 
##$TUNHIN= 0
##$TUNHOUT= 0
##$TUNXOUT= 0
##$USERA1= <user>
##$USERA2= <user>
##$USERA3= <user>
##$USERA4= <user>
##$USERA5= <user>
##$V9= 5
##$VALIST= <valist>
##$VCLIST= <CCCCCCCCCCCCCCC>
##$VD= 0
##$VDLIST= <DDDDDDDDDDDDDDD>
##$VPLIST= <PPPPPPPPPPPPPPP>
##$VTLIST= <TTTTTTTTTTTTTTT>
##$WBST= 1024
##$WBSW= 4
##$XGAIN= (0..3)
0 0 0 0 
##$XL= 0
##$YL= 0
##$YMAX_a= 562789
##$YMIN_a= -588266
##$ZGOPTNS= <>
##$ZL1= 120
##$ZL2= 120
##$ZL3= 120
##$ZL4= 120
##$ABSF1= 16.522
##$ABSF2= -4.171173
##$ABSG= 5
##$ABSL= 3
##$ALPHA= 0
##$AQORDER= 0
##$ASSFAC= 0
##$ASSFACI= 0
##$ASSFACX= 0
##$ASSWID= 0
##$AUNMP= <proc_1d>
##$AZFE= 0.1
##$AZFW= 0.1
##$BCFW= 0
##$BC_mod= 0
##$BYTORDP= 0
##$COROFFS= 0
##$CY= 12.5
##$DATMOD= 1
##$DC= 0
##$DFILT= <>
##$DTYPP= 0
##$F1P= 14.0000005364418
##$F2P= -0.99999901652339
##$FCOR= 0.5
##$FTSIZE= 32768
##$FT_mod= 6
##$GAMMA= 0
##$GB= 0
##$INTBC= 1
##$INTSCL= 1
##$ISEN= 128
##$LB= 0.3
##$LEV0= 0
##$LPBIN= 0
##$MAXI= 10000
##$MC2= 0
##$MEAN= 0
##$ME_mod= 0
##$MI= 0
##$NCOEF= 0
##$NC_proc= -4
##$NLEV= 6
##$NOISF1= 0
##$NOISF2= 0
##$NSP= 0
##$NTH_PI= 0
##$NZP= 0
##$OFFSET= 16.522
##$PC= 1
##$PHC0= -85.22092
##$PHC1= 3.179961
##$PH_mod= 1
##$PKNL= yes
##$PPARMOD= 0
##$PSCAL= 4
##$PSIGN= 0
##$REVERSE= no
##$SF= 250.13
##$SI= 32768
##$SIGF1= 0
##$SIGF2= 0
##$SINO= 400
##$SIOLD= 32768
##$SREGLST= <1H.DMSO>
##$SSB= 0
##$STSI= 32768
##$STSR= 0
##$SW_p= 5175.98343685301
##$SYMM= 0
##$S_DEV= 0
##$TDeff= 65536
##$TDoff= 0
##$TI= <Analysis number 999999
Compound Code 99
Book Reference 9
Project Code 9>
##$TILT= no
##$TM1= 0
##$TM2= 0
##$TOPLEV= 0
##$USERP1= <user>
##$USERP2= <user>
##$USERP3= <user>
##$USERP4= <user>
##$USERP5= <user>
##$WDW= 1
##$XDIM= 32768
##$YMAX_p= 281956494
##$YMIN_p= -121668
$$ End of Bruker specific parameters
$$ ---------------------------------
##NTUPLES= NMR SPECTRUM
##VAR_NAME=  FREQUENCY,     SPECTRUM/REAL,   SPECTRUM/IMAG
##SYMBOL=    X,             R,               I
##VAR_TYPE=  INDEPENDENT,   DEPENDENT,       DEPENDENT
##VAR_FORM=  AFFN,          ASDF,            ASDF
##VAR_DIM=   32768,         32768,           32768
##UNITS=     HZ,            ARBITRARY UNITS, ARBITRARY UNITS
##FACTOR=    0.157963299565203, 1,           1
##FIRST=     4132.6476996994, 0,             0
##LAST=      -1043.33573715361, 0,           0
##MIN=       -1043.33573715361, -121668,     0
##MAX=       4132.6476996994, 281956494,     0
$$ Real data points
##PAGE= N=1
##DATA TABLE= (X++(R..R)), XYDATA
$$ [...]
$$ plain form
14008 -35874 -38077 -24365 -2817 -7040 -16273 -24497 -12329 -22414 -20340 -21952 -41592 -49804 -22130
13995 -22130 -14457 13025 24137 3152 -17240 -28296 -19033 -40215 -27912 409 -88 -12258
13983 -12258 -34851 -40556 -1553 12225 4745 10451 -28162 -41225 -30664 -43617 -49923 -29969
13971 -29969 -32355 -43251 -57956 -48812 -43541 -43089 -30251 -30125 -10821 -10957 -10163 -14090 -23516 -43585
13957 -43585 -25283 -9741 -3819 -16585 -20869 -17742 -28488 -18073 -14293 -15002 -27464 -9841 -17500
13944 -17500 -37283 -47049 -39436 -19307 -40344 -38968 -21537 -48943 -39664 -21778 -19143 -16390 -19329
13931 -19329 -38023 -60809 -59698 -50572 -30798 -20278 -42152 -46040 -35862 -39717 -48380 -74569 -68099
13918 -68099 -51382 -53628 -57362 -61697 -51325 -48725 -46316 -45948 -15086 -4393 7671 15669 -14602
$$ packed form
14008c5874k203J3712K1548m223r233q224J2168j0085K074j612j9640q212K7674
13995b2130P673K7482J1112k0985k0392j1056R263k1182J2303K8321m97j2170
13983a2258k2593n705L9003J3778p480N706l8613j3063J0561j2953o306J9954
13971b9969k386j0896j4705R144N271M52J2838J26J9304j36P94l927r426k0069
13957d3585J8302J5542N922j2766m284L127j0746J0415L780p09j2462J7623p659
13944a7500j9783r766P613K0129k1037J376J7431k7406R279J7886K635K753k939
13931a9329j8694k2786J111R126J9774J0520k1874l888J0178l855q663k6189O470
13918f8099J6717k246l734m335J0372K600K409L68L0862J0693J2064P998l0271
$$ plain form
13905 -14602 -6815 -1078 -20479 -21690 -26130 -37267 -42910 -43826 -30043 -19274 -6740 -7090 -10537 -37168
13891 -37168 -41417 -41812 -44839 -23558 -23723 -32117 -31924 -55896 -59113 -48141 -25553 -13638 -10328 -8535
13877 -8535 -2421 -37791 -69914 -65267 -40014 -17774 400 -11398 -9416 -7290 -13683 -14613 -10523
13864 -10523 -19020 -25231 -28258 -45911 -58993 -70140 -68602 -48430 -50154 -68673 -68013 -46902 -43684
13851 -43684 -63139 -70363 -40707 -2030 -4050 -24323 -39141 -39916 -42037 -52140 -34456 -16591 -2196
13838 -2196 -4282 -4250 -26387 -26248 -13210 20133 -2633 -10758 12373 2953 -11785 -18910 -20326 -21031
13824 -21031 -27228 -34472 -19161 8470 -12959 -23318 -16189 -15208 -12187 -20327 -28308 -34377 -56111
13811 -56111 -33974 -6273 -29603 -25689 -6624 -19795 -39097 -34394 -39261 -52992 -61244 -41339
$$ packed form
13905a4602P787N737j9401j211m440j1137n643r16J3783J0769J2534l50l447k6631
13891c7168m249l95l027K1281j65q394J93k3972l217J0972K2588J1915L310J793
13877h535O114l5370l2123M647K5253K2240J8174j1798J982K126o393r30M090
13864a0523q497o211l027j7653j3082j1147J538K0172j724j8519O60K1111L218
13851d3684j9455p224K9656L8677k020k0273j4818p75k121j0103J7684J7865J4395
13838b196k086L2k2137J39J3038L3343k2766q125K3131r420j4738p125j416p05
13824b1031o197p244J5311K7631k1429j0359P129R81L021q140p981o069k1734
13811e6111K2137K7701k3330L914J9065j3171j9302M703m867j3731q252J9905
$$ plain form
13799 -41339 -38947 -42586 -49691 -29918 -17865 -62890 -69860 -41272 -28495 -22339 -22111 -37742 -49180
13786 -49180 -57246 -72191 -33202 -18366 -21590 -14245 2689 13766 -8713 -43213 -33547 -33568 -49235
13773 -49235 -44801 -17041 -19161 -34734 -9443 11013 -10759 -19651 1208 1693 -494 -2935 5470
13760 5470 -363 -5533 -5381 -3218 -5057 8276 -3608 -8482 -20005 -16617 -2941 3748 16803 21643
13746 21643 11083 10355 5810 -29093 -49974 -63981 -58461 -51898 -83737 -92284 -91874 -74204 -37537
13733 -37537 -28652 -38631 -19176 -18214 -24489 -43901 -34102 -36806 -48513 -43820 -17384 -19622 -49040
13720 -49040 -60549 -38622 -12720 -13733 -37850 -36880 -25376 -21948 -23563 -25494 -22979 -14199 -6934
13707 -6934 -28920 -73049 -55474 -25996 -28047 -12435 9407 6957 -4839 -21551 -23740 -21737 -12729
$$ packed form
13799d1339K392l639p105J9773J2053m5025o970K8588J2777O156K28j5631j1438
13786d9180q066j4945L8989J4836l224P345J6934J1077k2479l4500R666k1j5667
13773d9235M434K7760k120j5573K5291K0456k1772q892K0859M85k187k441Q405
13760E470n833n170J52K163j839J3333j1884m874j1523L388J3676O689J3055M840
13746B1643j0560p28m545l4903k0881j4007N520O563l1839q547M10J7670L6667
13733c7537Q885r979J9455R62o275j9412R799k704j1707M693K6436k238k9418
13720d9040j1509K1927K5902j013k4117R70J1504L428j615j931K515Q780P265
13707f934k1986m4129J7575K9478k051J5612K1842k450j1796j6712k189K003R008
$$ plain form
13694 -12729 -10121 -2911 37186 28434 10467 -5932 -9324 -12555 -12588 -28364 -20003 -16344 -8814 -9963
13680 -9963 -5216 -5288 -37376 -55910 -43186 -15543 6529 13777 -14297 -13289 -1915 -14248 -14832
13667 -14832 -37561 -36792 -27556 -49399 -36777 -17644 279 792 -13654 -21219 -33200 -11710 -13284
13654 -13284 -17317 -22008 -23461 -22476 -25252 6907 -2063 -31748 -9496 -15984 -18866 -42181 -54451
13641 -54451 -56904 -63159 -36908 -20468 -36850 -44779 -53239 -45201 -49079 -52822 -59442 -37274 -34523
13628 -34523 -27126 -23848 -13689 -18476 -35769 -33875 -50344 -46604 -51646 -57164 -37703 -6206 -16236
13615 -16236 -24510 -16870 -37485 -37573 -28156 -15091 -15018 -18643 -19550 1066 16832 2023 -905 -35525
13601 -35525 -52108 -33819 -7066 -21314 -38333 -54427 -49479 -58588 -38652 -32136 -26428 -41730
$$ packed form
13694a2729K608P210M0097q752j7967j6399l392l231l3j5776Q361L659P530j149
13680i963M747p2l2088j8534J2724K7643K2072P248k8074J008J1374j2333n84
13667a4832k2729P69R236k1843J2622J9133J7923N13j4446p565j1981K1490j574
13654a3284m033m691j453R85k776L2159q970k9685K2252o488k882k3315j2270
13641e4451k453o255K6251J6440j6382p929q460Q038l878l743o620K2168K751
13628c4523P397L278J0159m787j7293J894j6469L740n042n518J9461L1497j0030
13615a6236q274P640k0615q8R417J3065P3l625r07K0616J5766j4809k928l4620
13601c5525j6583J8289K6753j4248j7019j6094M948r109J9936O516N708j5302
$$ plain form
13589 -41730 -22319 11722 19589 3039 -9275 -30154 -33907 -51583 -43083 -8344 -14929 -10459 -9940
13576 -9940 1010 2682 -24903 -21798 -22 -3911 13249 9621 -11626 7078 6586 -18971 -2067
13563 -2067 -12118 -34025 -47889 -43990 -47973 -40533 -30644 -13837 -2560 -6039 -15959 -35690 -30876
13550 -30876 -29907 -33998 -34628 -25464 -10851 -15240 -13364 9519 35602 2549 -41673 -72424 -81690
13537 -81690 -74170 -52253 -47934 -54353 -52471 -30129 -26249 -37772 -46966 -43935 -48472 -40070 -28708
13524 -28708 -7010 8578 10876 -8763 -29966 -13869 -24699 -67039 -35929 7541 18295 44601
13512 44601 70077 62886 15773 -16170 -16853 -22714 -20894 -7870 -23270 -87357 -94205 -49839 -16874
13499 -16874 -13776 8468 15490 -8909 -22942 -10932 -37836 -79905 -73797 -33696 -22156 -16075
$$ packed form
13589d1730J9411L4041P867j6550j2314k0879l753j7676Q500L4739o585M470N19
13576i940J0950J672k7585L105K1776l889J7160l628k1247J8704m92k5557J6904
13563b067j0051k1907j3864L899l983P440R889J6807J1277l479r920j9731M814
13550c0876R69m091o30R164J4613m389J876K2883K6083l3053m4222l0751r266
13537h1690P520K1917M319o419J882K2342L880j1523r194L031m537Q402J1362
13524b8708K1698J5588K298j9639k1203J6097j0830m2340L1110M3470J0754K6306
13512D4601K5476p191m7113l1943o83n861J820J3024j5400o4087o848M4366L2965
13499a6874L098K2244P022k4399j4033J2010k6904m2069O108M0101J1540O081
$$ plain form
13487 -16075 -42876 -24627 -14267 -22647 -27188 -27683 -7987 -11097 -29298 -36346 -27046 -7468 27585
13474 27585 64022 67057 61547 31081 20314 8172 -3563 202 -7830 -12059 -5750 -705 -15353
13461 -15353 -36901 -38264 -22254 -24689 -58551 -35240 -17008 -902 7404 -14995 -15438 -9798 -16275
13448 -16275 -36040 -48436 -42087 -51876 -45837 -41356 -29174 6683 1403 -13267 -27501 -63052 -78436
13435 -78436 -58740 -53939 -44112 -13183 -6176 -5014 -19116 -21161 -34790 -67712 -78870 -59552 -41208
13422 -41208 -19998 -16685 -28432 -32146 -34614 -27126 -28829 -19891 10532 -3536 -29690 -36469 -11186
13409 -11186 -6560 3019 -855 -6464 -7105 -18291 6869 19514 -7395 -34914 -57405 -54648 -30427
13396 -30427 -8086 -24903 -36990 -46482 -38478 -18628 -12146 -12167 -23732 -36318 -45492 -48472 -28897
$$ packed form
13487a6075k6801J8249J0360q380m541m95J9696l110j8201p048R300J9578L5053
13474B7585L6437L035n510l0466j0767j2142j1735L765q032m229O309N045j4648
13461a5353k1548j363J6010k435l3862K3311J8232J6106Q306k2399m43N640o477
13448a6275j9765j2396O349r789O039M481J2182L5857n280j4670j4234l5551j5384
13435g8436J9696M801R827L0929P007J162j4102k045j3629l2922j1158J9318J8344
13422d1208K1210L313j1747l714k468P488j703Q938L0423j4068k6154o779K5283
13409a1186M626R579l874n609o41j1186K5160J2645k6909k7519k2491K757K4221
13396c0427K2341j6817j2087r492Q004J9850O482k1j1565j2586r174k980J9575
$$ plain form
13383 -28897 -2703 -12722 -32222 -22910 -25797 -45285 -62070 -55768 -44326 -37367 -14721 7061
13371 7061 -9417 -8590 6100 1065 -12784 -25632 -33284 -27514 3080 7502 -8945 -6626 3382
13358 3382 -4141 -22372 -29465 -29988 -24723 -9071 -33819 -26189 5151 25567 19135 -2038 -4586
13345 -4586 -2733 -43061 -64679 -84067 -63452 -36185 -36186 -50704 -28495 -8620 -22588 -31727 -26453
13332 -26453 -19508 -7833 -6367 -26598 -59247 -62631 -49681 -63726 -60741 -45814 -32605 -37780 -49700
13319 -49700 -29133 -9393 -3813 24062 2956 -22611 -17181 -29461 -34650 -31639 -16973 -25521 -52254
13306 -52254 -45803 -65487 -64731 -37012 -25344 -13097 -15452 -25504 -37971 -24231 -8022 14224
13294 14224 -1896 -23330 -31434 -36593 -38878 -8713 11225 11127 18275 28315 29654 9871 -19320
$$ packed form
13383b8897K6194j0019j9500R312k887j9488j6785O302J1442O959K2646K1782
13371G061j6478Q27J4690n035j3849j2848p652N770L0594M422j6447K319J0008
13358C382p523j8231p093n23N265J5652k4748P630L1340K0416o432k1173k548
13345d586J853m0328k1618j9388K0615K7267jj4518K2209J9875j3968r139N274
13332b6453O945J1675J466k0231l2649l384J2950j4045K985J4927J3209n175j1920
13319d9700K0567J9740N580K7875k1106k5567N430j2280n189L011J4666q548k6733
13306e2254O451j9684P56K7719J1668J2247k355j0052j2467J3740J6209K2246
13294A4224j6120k1434q104n159k285L0165J9938r8P148J0040J339j9783k9191
$$ plain form
13281 -19320 -27834 -27046 -7117 19000 1361 -20135 -25079 -19929 -25374 -19872 -7111 -17762 -36452
13268 -36452 -25390 -8896 -17672 -6669 -17926 -44231 -43314 -11927 -8978 -42817 -64806 -41482
13256 -41482 -25939 -11362 -18479 -35239 -19886 -14406 1903 582 -22721 -44272 -40633 -19944
13244 -19944 -42219 -40184 -3399 -4612 3787 28888 23469 12191 -23802 -43558 -53693 -34081
13232 -34081 -7934 -11311 -33595 -14684 -12967 -4682 -6392 11821 11795 25630 23165 14584 7755 -16434
13218 -16434 -34710 -31673 -4018 -10149 -27409 -16797 -52429 -61731 -40449 -39681 -52754 -28676 -624
13205 -624 17805 24877 3327 15498 21875 8246 6621 -853 -24183 -29615 -56917 -58025 -43971
13192 -43971 -38640 -30463 -38455 -10223 -5262 22731 5398 -28558 -19833 -6279 -7858 -11345 -39076
$$ packed form
13281a9320q514P88J9929K6117j7639k1496m944N150n445N502J2761j0651j8690
13268c6452J1062J6494q776J1003j1257k6305R17L1387K949l3839k1989K3324
13256d1482J5543J4577p117j6760J5353N480J6309j321k3303k1551L639K0689
13244a9944k2275K035L6785j213Q399K5101n419j1278l5993j9756j0135J9612
13232c4081K6147l377k2284J8911J717Q285j710J8213k6J3835k465q581o829k4189
13218a6434j8276L037K7655o131j7260J0612l5632r302K1282P68j3073K4078K8052
13205f24J8429P072k1550J2171O377j3629j625p474k3330n432k7302j108J4054
13192d3971N331Q177p992K8232M961K7993j7333l3956Q725J3554j579l487k7731
$$ plain form
13179 -39076 -45065 -36934 -28392 -27474 -6932 -12607 -54503 -90378 -89213 -62900 -74834 -90580 -81598
13166 -81598 -73755 -66556 -48153 -30385 -23367 -1208 5307 -7999 -13901 -19367 -27321 -31312 -41396
13153 -41396 -40720 -35729 -30634 -41010 -59156 -68624 -58929 -44462 -54361 -64079 -63983 -43014 -19015 -12463
13139 -12463 -6602 -16072 -29591 -37604 -29711 -27347 -17625 -30794 -28045 -31757 -28825 -57224 -63649 -38253
13125 -38253 -31771 -46246 -57827 -48323 -72680 -83457 -45943 -13047 -16295 -21205 -28288 -32413 -60063
13112 -60063 -48849 -57279 -50143 -40935 -14121 -25768 -25486 -4586 2979 -22004 -34104 -30967 3842
13099 3842 6967 -6842 -24442 -26630 -41730 -44134 -54133 -36082 -34673 -32301 -44830 -29048 -38509
13086 -38509 -38130 -39675 -46836 -2146 -9423 -26428 -42027 -36848 -25271 -49811 -64709 -55625 -54964
$$ packed form
13179c9076n989Q131Q542R18K0542n675m1896l5875J165K6313j1934j5746Q982
13166h1598P843P199J8403J7768P018K2159O515j3306n902n466p954l991j0084
13153d1396O76M991N095j0376j8146r468R695J4467r899r718R6K0969K3999O552
13139a2463N861r470j3519q013P893K364R722j3169K749l712K932k8399o425K5396
13125c8253O482j4475j1581R504k4357j0777L7514L2896l248m910p083m125k7650
13112f0063J1214q430P136R208K6814j1647K82K0900P565k4983j2100L137L4809
13099C842L125j3809j7600k188j5100k404r999J8051J409K372j2529J5782r461
13086c8509L79j545p161M4690p277j7005j5599N179J1577k4540j4898R084O61
$$ plain form
13073 -54964 -49076 -47954 -31732 -26711 -17681 -9624 -45238 -45490 -27113 -17448 -16808 -5009 -20261 -18166
13059 -18166 -24299 -35756 -30411 -20305 -12752 -16132 -7998 4827 7150 -7460 1822 -6129 -16125
13046 -16125 -24659 -43464 -27661 -13755 -11702 -20223 -12549 -13213 -11583 -21450 -9772 10384 11260 9316
13032 9316 14943 -2965 -26113 -29212 -27372 -23910 -14921 -19499 -25591 -29654 -12741 -19830 -21906 -14416
13018 -14416 -9316 -29717 -40407 -45741 -44567 -45336 -29997 -13761 -35096 -44231 -53792 -70882 -75037
13005 -75037 -41953 -35476 -42981 -34958 -39992 -41273 -5731 16129 4562 15885 461 -17921 -37582
12992 -37582 -53987 -37506 -20931 15266 6923 -3066 -31429 -72720 -67384 -37870 -42211 -38651 -8059
12979 -8059 20872 27855 30256 26492 24531 -18345 -24025 -25800 -7554 49478 55446 41594 15199
$$ packed form
13073e4964N888J122J6222N021R030Q057l5614k52J8377R665O40J1799j5252K095
13059a8166o133j1457N345J0106P553l380Q134J2825K323j4610R282p951r996
13046a6125q534j8805J5803J3906K053q521P674o64J630r867J1678K0156Q76j944
13032I316N627j7908k3148l099J840L462Q989m578o092m063J6913p089k076P490
13018a4416N100k0401j0690n334J174p69J5339J6236k1335r135r561j7090m155
13005g5037L3084O477p505Q023n034j281L5542K1860j1567J1323j5424j8382j9661
12992c7582j6405J6481J6575L6197q343r989k8363m1291N336K9514m341L560L0592
12979h059K8931O983K401l764j961m2876n680j775J8246N7032N968j3852k6395
$$ plain form
12966 15199 169 -10170 -13789 -26008 -47596 -31782 -23515 -26190 -24472 -27973 -23371 -25675 -41147
12953 -41147 -34582 -31320 -18110 -10947 -11814 -12598 -18094 -20439 -27838 -10224 -16851 -15664 -17915 -14885
12939 -14885 -9272 -13852 -17634 -33189 -840 -3257 -6413 5831 11507 -23247 -11623 2682 -11519
12926 -11519 -24750 -23227 -34191 -29724 -28843 -43183 -33361 -20466 -38940 -49014 -22042 8602 31221
12913 31221 33973 46447 22851 -11607 -1094 16658 -4314 -31303 -29007 -25141 -2486 892
12901 892 28882 48363 32180 -10315 -20246 -6113 -20194 -21302 -2234 18260 4047 2635 3965
12888 3965 -27285 -26817 -20870 -26438 -17675 -3400 -4023 -19227 -41868 -40266 -7939 10207 6288 30353
12874 30353 24326 27123 34510 27325 29606 4440 -13292 -7211 -989 3216 14685 -11526 -25333
$$ packed form
12966A5199j5030j0339l619j2219k1588J5814Q267k675J718l501M602k304j5472
12953d1147O565L262J3210P163q67p84n496k345p399J7614o627J187k251L030
12939a4885N613m580l782j5555L2349k417l156J2244N676l4754J1624J4305j4201
12926a1519j3231J523j0964M467Q81j4340R822J2895j8474j0074K6972L0644K2619
12913C1221K752J2474k3596l4458J0513J7752k0972k6989K296L866K2655L378
12901H92K7990J9481j6183m2495r931J4133j4081j108J9068K0494j4213j412J330
12888C965l1250M68N947n568Q763J4275o23j5204k2641J602L2327J8146l919K4065
12874C0353o027K797P387p185K281k5166j7732O081O222M205J1469k6211j3807
$$ plain form
12861 -25333 -46705 -48398 -26548 14079 34825 10738 2503 -142 2155 8535 -19787 -61677 -79324
12848 -79324 -88661 -85887 -66232 -63043 -49280 -31839 -35748 -33346 -29924 -24271 -40863 -29404 -2729
12835 -2729 2096 -10168 -3784 13530 -3205 -30507 -23251 -22360 -32808 -13688 1125 3476 -11103
12822 -11103 -26287 -44913 -53104 -57339 -37103 -45035 -65109 -36540 -45023 -46931 -44967 -53712 -53744 -58363
12808 -58363 -41552 -18106 -2282 -10152 -23368 -16795 -17386 -14931 -10848 -30970 -60278 -28378 4978
12795 4978 -10975 -28540 -35402 -32834 -35203 -13682 3452 17589 -6385 -25709 -8478 11785
12783 11785 28835 13266 -158 11366 -7015 -29934 -35962 -23754 -33903 -49539 -16634 542
12771 542 -6676 -26867 -42508 -138 14438 6187 6106 4649 10350 -9050 -26966 -17481 -5194 -17211
$$ packed form
12861b5333k1372j693K1850M0627K0746k4087q235k645K297O380k8322m1890j7647
12848g9324r337K774J9655L189J3763J7441l909K402L422N653j6592J1459K6675
12835b729M825j2264O384J7314j6735k7302P256Q91j0448J9120J4813K351j4579
12822a1103j5184j8626q191m235K0236p932k0074K8569q483j908J964q745l2m619
12808e8363J6811K3446J5824p870j3216O573n91K455M083k0122k9308L1900L3356
12795D978j5953j7565o862K568k369K1521J7134J4137k3974j9324J7231K0263
12783A1785J7050j5569j3424J1524j8381k2919o028J2208j0149j5636L2905J7176
12771E42p218k0191j5641M2370J4576q251q1j457N701j9400j7916R485J2287j2017
$$ plain form
12757 -17211 -21893 4036 -17034 -33952 -35206 -33344 -29607 -19629 -2355 13742 -1892 -20273 -28364
12744 -28364 -35047 -38160 -20847 -22229 -19971 -20266 -21540 -33268 -3670 19676 21742 5799 -29073
12731 -29073 -29741 -47098 -62354 -62110 -38468 -39482 -25080 -16238 -41813 -48016 -45202 -61589 -65246
12718 -65246 -55626 -24124 -5208 11879 16541 -13590 -17202 27289 40048 46585 38576 19619 -17159
12705 -17159 2327 22156 19578 9820 -6532 -29112 -19600 -103 48 3011 12119 15812 3121
12692 3121 7143 953 -12757 13781 28248 22172 -19470 10264 24491 18181 19369 15266 -4610
12679 -4610 -9165 -37098 -57288 -58379 -49408 -19809 -17171 -1858 -3791 2840 -1164 -27091 -29331
12666 -29331 -34429 -14231 -8231 -26496 -33388 -23606 -3352 15130 -6319 -19996 -18671 -24316 -42443
$$ packed form
12757a7211m682K5929k1070j6918j254J862L737R978J7274J6097j5634j8381q091
12744b8364o683l113J7313j382K258k95j274j1728K9598K3346K066j5943l4872
12731b9073o68j7357j5256K44K3642j014J4402Q842k5575o203K814j6387l657
12718f5246R620L1502J8916J7087M662l0131l612M4491J2759O537q009j8957l6778
12705a7159J9486J9829k578r758j6352k2580R512J9497J51K963R108L693j2691
12692C121M022o190j3710K6538J4467o076m1642K9734J4227o310J188m103j9876
12679d610m555k7933k0190j091Q971K9599K638J5313j933O631m004k5927k240
12666b9331n098K0198O000j8265o892R782K0254J8482k1449j3677J325n645j8127
$$ plain form
12653 -42443 -73961 -69804 -33974 -9601 3925 20560 21526 3271 3839 26035 31855 17959 -13523
12640 -13523 -21908 -8571 6524 23258 6074 -11783 -23147 -22319 -11840 -13582 -6543 6265 -3838
12627 -3838 -15924 -4412 -35335 -55077 -65465 -69236 -76467 -51679 -31728 -35834 -43793 -34567 -39984
12614 -39984 -951 9380 3875 11528 2468 -22184 -18991 -27386 -16466 -3773 8262 1115 -8177
12601 -8177 -8373 -2929 8765 35969 30973 16594 -2882 -28337 -30767 -23901 949 -635 5946
12588 5946 -6973 -13564 -1635 14714 16526 -18004 -42829 -54725 -66795 -61045 -28370 -7978
12576 -7978 -15273 -9325 2374 4485 -2917 22018 42828 48150 37480 23893 38825 10847 -8843
12563 -8843 -6615 -2902 10671 12922 14693 5635 -5990 -36557 -20549 -3694 2659 8498 -8460
$$ packed form
12653d2443l1518M157L5830K4373J3526J6635R66j8255N68K2196N820j3896l1482
12640a3523q385J3337J5095J6734j7184j7857j1364Q28J0479j742P039J2808j0103
12627c838j2086J1512l0923j9742j0388l771p231K4788J9951m106p959R226n417
12614c9984L9033J0331n505P653r060k4652L193q395J0920J2693J2035p147r292
12601h177j96N444J1694K7204m996j4379j9476k5455k430O866K4850j584O581
12588E946j2919o591J1929J6349J812l4530k4825j1896j2070N750L2675K0392
12576g978p295N948J1699K111p402K4935K0810N322j0670j3587J4932k7978j9690
12563h843K228L713J3573K251J771r058j1625l0567J6008J6855O353N839j6958
$$ plain form
12550 -8460 -6826 -25982 -26619 -12081 -19230 -17028 -21864 -32399 -48835 -31782 -16610 -27791 -37184
12537 -37184 -39170 -34462 -14999 -16169 -9497 -7299 5097 4328 -11696 -3078 8909 17053 31542
12524 31542 11713 -3195 -17235 -21176 -24115 -19940 17583 44165 57230 72626 59686 46143
12512 46143 34652 20291 19686 -19176 -35740 -1008 -7402 -20536 -5090 24490 32675 26736 43557
12499 43557 39739 49087 52221 29942 3781 -22567 -19168 -16268 -29697 -31174 -9583 -3150 -13157
12486 -13157 9510 -11616 -17587 5457 34686 20609 22496 21229 5971 -919 -10231 -9693 157
12473 157 3624 -12318 2406 12351 13645 8967 9523 20638 22882 31822 30997 17805 3304 -16225
12459 -16225 -23388 23851 50785 36190 18911 43574 24865 5333 -4244 -6987 1766 9887 39543
$$ packed form
12550h460J634j9156o37J4538p149K202m836j0535j6436J7053J5172j1181r393
12537c7184j986M708J9463j170O672K198J2396p69j6024Q618J1987Q144J4489
12524C1542j9829j4908j4040l941k939M175L7523K6582J3065J5396j2940j3543
12512D6143j1491j4361o05l8862j6564L4732o394j3134J5446K9580Q185n939J6821
12499D3557l818R348L134k2279k6161k6348L399K900j3429j477K1591O433j0007
12486a3157K2667k1126n971K3044K9229j4077J887j267j5258o890r312N38R850
12473A57L467j5942J4724R945J294m678N56J1115K244Q940q25j3192j4501j9529
12459a6225p163M7239K6934j4595j7279K4663j8709j9532r577k743Q753Q121K9656
$$ plain form
12446 39543 51701 54137 41700 25165 8617 -12306 -1281 16519 31097 33037 12523 5423
12434 5423 -11749 -35773 -10862 6427 32847 66306 46255 43609 36524 22739 16652 8876 -4536
12421 -4536 -3960 -28973 -29269 -14907 -19710 -14126 14392 24606 41760 57144 68457 75388 63555
12408 63555 74604 71634 44070 42120 41236 27648 21518 19754 37790 67661 75629 67485 71814
12395 71814 90459 98001 58928 22132 38772 46872 45589 20587 21253 23225 21648 28482 37382
12382 37382 43243 35235 22645 44053 69303 48728 47787 37746 11605 8441 10541 15410 -7989
12369 -7989 -18604 -29852 -31553 299 12302 26717 8361 13074 17755 3516 36664 45033 30651
12356 30651 33472 33289 71336 67437 47312 56031 59340 71924 70917 56095 40515 24075 28660
$$ packed form
12446C9543J2158K436j2437j6535j6548k0923J1025J7800J4578J940k0514p100
12434E423j7172k4024K4911J7289K6420L3459k0051k646p085j3785o087p776j3412
12421d536N76k5013k96J4362m803N584K8518J0214J7154J5384J1313O931j1833
12408F3555J1049k970k7564j950q84j3588o130j764J8036K9871P968q144M329
12395G1814J8645P542l9073l6796J6640Q100j283k5002O66J972j577O834Q900
12382C7382N861q008j2590K1408K5250k0575r41j0041k6141l164K100M869k3399
12369g989j0615j1248j701L1852J2003J4415j8356M713M681j4239L3148Q369j4382
12356C0651K821j83L8047l899k0125Q719L309J2584j007j4822j5580j6440M585
$$ plain form
12343 28660 1624 -6689 10348 40792 67883 73332 52892 23711 51575 60961 52680 63605
12331 63605 70535 48261 43561 43370 46012 61544 69756 63920 64446 66040 69963 56408 36556 52054
12317 52054 51120 61938 76457 79446 63612 51972 53849 42669 43791 57880 61256 45044 66077
12304 66077 90912 101768 98855 74576 96763 81445 26402 15942 40312 53716 33546 33430
12292 33430 61610 80966 92091 83009 61629 49670 59462 68035 59315 75338 60581 74318
12280 74318 89896 81566 66332 80997 80733 83628 94980 101577 106567 99143 105233 113010 117120 124933
12266 124933 108816 99380 89050 93914 92207 96921 83175 60798 57455 77522 116262 113504 113223
12253 113223 98477 80872 62555 76045 67785 86415 115352 126734 131518 141764 129144 100971
$$ packed form
12343B8660k7036q313J7037L0444K7091N449k0440k9181K7864R386q281J0925
12331F3605O930k2274m700j91K642J5532Q212n836N26J594L923j3555j9852J5498
12317E2054r34J0818J4519K989j5834j1640J877j1180J122J4089L376j6212K1033
12304F6077K4835J0856k913k4279K2187j5318n5043j0460K4370J3404k0170j16
12292C3430K8180J9356J1125r082k1380j1959R792Q573q720J6023j4757J3737
12280G4318J5578q330j5234J4665k64K895J1352O597M990p424O090P777M110P813
12266A24933j6117r436j0330M864j707M714j3746k2377l343K0067L8740k758k81
12253A13223j4746j7605j8317J3490q260J8630K8937J1382M784J0246j2620k8173
$$ plain form
12241 100971 92520 111193 110526 105591 94319 69653 96603 111204 118519 125822 119788 133135 147374
12228 147374 156622 163005 150313 140710 134697 137359 133808 123623 141082 154075 136110 96849 110295
12215 110295 124605 162770 181418 200067 197213 214563 205159 188786 171002 162637 188798 196868
12203 196868 202473 203689 192589 186663 179306 178031 173316 170684 186498 190231 180956 159461 156162
12190 156162 156884 178976 205749 213478 198156 204766 224457 200459 208710 232548 234822 255642 251089
12177 251089 244056 248140 254609 262931 251830 238994 246954 233481 228169 252232 258599 242075 254677
12164 254677 275519 284241 263533 236274 235084 249953 251032 244245 235017 232741 234891 214728 229347
12151 229347 248914 246553 259503 262661 267046 280227 274924 256097 261649 296581 308953 323193
$$ packed form
12241A00971q451J8673o67m935j1272k4666K6950J4601P315P303o034J3347J4239
12228A47374R248O383j2692r603o013K662l551j0185J7459J2993j7965l9261J3446
12215A10295J4310L8165J8648J8649k854J7350r404j6373j7784q365K6161Q070
12203A96868N605J216j1100n926p357j275m715k632J5814L733r275k1495l299
12190A56162P22K2092K6773P729j5322O610J9691k3998Q251K3838K274K0820m553
12177B51089p033M084O469Q322j1101j2836P960j3473n312K4063O367j6524J2602
12164B54677K0842Q722k0708k7259j190J4869J079o787r228k276K150k0163J4619
12151B29347J9567k361J2950L158M385J3181n303j8827N552L4932J2372J4240
$$ plain form
12139 323193 328205 331194 365097 360382 355918 358963 351509 341357 349496 342037 347579 363261 350475
12126 350475 359761 372213 395098 384170 373636 368365 381800 391008 385075 366257 368664 390877
12114 390877 405595 411282 438823 447294 455491 453157 449936 446275 445815 458410 464387 485480 488104
12101 488104 492523 495563 513186 523438 520451 520202 497495 512704 505054 491443 508904 550553 558942
12088 558942 570258 590921 575968 565847 580684 626669 636636 652975 658839 661833 692477 718783
12076 718783 718854 734877 753309 740169 731696 738053 747276 766451 761423 781535 820619 806424 792859
12063 792859 802334 826354 850261 868367 912886 956873 965049 965495 989190 993908 988553 994039 1001794
12050 1001794 1006015 1037387 1056651 1068700 1101205 1156414 1186086 1194423 1208318 1203270 1223148 1271829
$$ packed form
12139C23193N012K989L3903m715m464L045p454j0152Q139p459N542J5682j2786
12126C50475R286J2452K2885j0928j0534n271J3435R208n933j8818K407K2213
12114C90877J4718N687K7541Q471Q197k334l221l661m60J2595N977K1093K624
12101D88104M419L040J7623J0252k987k49k2707J5209p650j3611J7461M1649Q389
12088E58942J1316K0663j4953j0121J4837M5985R967J6339N864K994L0644K6306
12076G18783P1J6023J8432j3140q473O357R223J9175n028K0112L9084j4195j3565
12063G92859R475K4020K3907J8106M4519M3987Q176M46K3695M718n355N486P755
12050A001794M221L1372J9264J2049L2505N5209K9672Q337J3895n048J9878M8681
$$ plain form
12038 1271829 1304744 1326661 1373809 1414207 1460671 1534253 1577149 1597047 1636002 1662851 1667821
12027 1667821 1712430 1737715 1765326 1805453 1849627 1911125 1950765 1991749 2052310 2090781 2146547
12016 2146547 2227829 2289457 2365792 2408034 2433706 2506394 2589484 2642756 2712918 2792381 2886696
12005 2886696 2984735 3077091 3168317 3265271 3337867 3438541 3545147 3686625 3822098 3945523
11995 3945523 4062361 4181372 4316564 4455628 4614040 4758148 4909936 5100064 5274943
11986 5274943 5476129 5686458 5919657 6154448 6366365 6581325 6815412 7075103 7371117
11977 7371117 7661210 7948616 8236242 8567672 8914522 9219600 9542288 9919682 10329070
11968 10329070 10723098 11114780 11509022 11912742 12317681 12718868 13125040 13547380 13975889
$$ packed form
12038A271829L2915K1917M7148M0398M6464P3582M2896J9898L8955K6849M970
12027A667821M4609K5285K7611M0127M4174O1498L9640M0984O0561L8471N5766
12016B146547Q1282O1628P6335M2242K5672P2688Q3090N3272P0162P9463R4315
12005B886696R8039R2356R1226R6954P2596J00674J06606J41478J35473J23425
11995C945523J16838J19011J35192J39064J58412J44108J51788J90128J74879
11986E274943K01186K10329K33199K34791K11917K14960K34087K59691K96014
11977G371117K90093K87406K87626L31430L46850L05078L22688L77394M09388
11968A0329070L94028L91682L94242M03720M04939M01187M06172M22340M28509
$$ plain form
11959 13975889 14410782 14842253 15201230 15542330 15856345 16167260 16468299 16693565 16877684
11950 16877684 17045227 17125811 17157577 17176556 17198882 17140275 17022860 16860981 16701240 16510965
11940 16510965 16277300 16002796 15704793 15360909 15024014 14679042 14358794 14019524 13677799
11931 13677799 13310104 12922727 12549842 12212542 11856442 11519707 11181362 10839418 10520098
11922 10520098 10228500 9927412 9622268 9360340 9092923 8823279 8519287 8247586 8060878
11913 8060878 7811115 7547630 7293151 7090778 6889386 6706592 6509786 6315877 6090272
11904 6090272 5901749 5767151 5629552 5457089 5302100 5150085 5002473 4852032 4718632
11895 4718632 4584560 4463121 4349171 4229732 4086557 3992322 3895688 3778990 3657846 3575289
$$ packed form
11959A3975889M34893M31471L58977L41100L14015L10915L01039K25266J84119
11950A6877684J67543Q0584L1766J8979K2326n8607j17415j61879j59741j90275
11940A6510965k33665k74504k98003l43884l36895l44972l20248l39270l41725
11931A3677799l67695l87377l72885l37300l56100l36735l38345l41944l19320
11922A0520098k91598l01088l05144k61928k67417k69644l03992k71701j86708
11913H060878k49763k63485k54479k02373k01392j82794j96806j93909k25605
11904F090272j88523j34598j37599j72463j54989j52015j47612j50441j33400
11895D718632j34072j21439j13950j19439j43175r4235r6634j16698j21144q2557
$$ plain form
11885 3575289 3515990 3385983 3261892 3198113 3129048 3044557 2965338 2894891 2787181 2678975
11875 2678975 2632111 2586627 2534593 2454461 2381696 2338215 2288892 2234990 2183746 2139285 2072553
11864 2072553 2000268 1970809 1948987 1912764 1851408 1809816 1758473 1739122 1725490 1686438 1623998
11853 1623998 1575803 1550997 1497014 1472580 1466522 1449987 1435554 1397155 1341308 1319180 1292924
11842 1292924 1267425 1247864 1240833 1235759 1218112 1182082 1158366 1121551 1092013 1056536 1026006 1007466
11830 1007466 1003040 988542 973178 942416 920218 901821 876682 892251 893740 866103 853198 863658
11818 863658 856783 813140 797989 813470 807651 797921 776004 751350 729640 707733 696522 680083
11806 680083 679368 684992 681164 681022 673411 635574 650849 688566 689044 684034 655823 621161 581545
$$ packed form
11885C575289n9299j30007j24091o3779o9065q4491p9219p0447j07710j08206
11875B678975m6864m5484n2034q0132p2765m3481m9323n3902n1244m4461o6732
11864B072553p2285k9459k1822l6223o1356m1592n1343j9351j3632l9052o2440
11853A623998m8195k4806n3983k4434o058j6535j4433l8399n5847k2128k6256
11842A292924k5499j9561p031n074j7647l6030k3716l6815k9538l5477l0530j8540
11830A007466m426j4498j5364l0762k2198j8397k5139J5569J489k7637j2905J0460
11818H63658o875m3643j5151J5481n819r730k1917k4654k1710k1907j1211j6439
11806F80083p15N624l828j42p611l7837J5275L7717M78n010k8211l4662l9616
$$ plain form
11793 581545 582229 599060 569889 573657 582279 545129 552353 531301 515173 492509 484023 477585 470959
11780 470959 483483 475480 497951 493259 461798 456448 481415 457575 458012 469909 472902 447124 414439
11767 414439 393803 405147 425625 416074 414651 395851 375753 380008 387470 383141 386511 386697 394517
11754 394517 371002 325058 322933 332232 337699 340054 332727 328936 331189 299822 308385 300178 293596
11741 293596 296127 308917 319570 326583 326794 335762 328981 300549 278723 281546 267410 244867 230511
11728 230511 254992 265659 270103 265202 248322 257004 264784 282665 311071 321112 301108 264124
11716 264124 255177 257556 246645 217656 197707 209923 229333 205908 215089 223422 221330 228643 213620
11703 213620 223312 204563 183164 186959 175049 173040 192235 198439 192202 203579 218791 191720
$$ packed form
11793E81545O84J6831k9171L768Q622l7150P224k1052j6128k2664q486o438o626
11780D70959J2524q003K2471m692l1461n350K4967k3840M37J1897K993k5778l2685
11767D14439k0636J1344K0478r551j423j8800k0098M255P462m329L370J86P820
11754C94517k3515m5944k125R299N467K355p327l791K253l1367Q563q207o582
11741B93596K531J2790J0653P013K11Q968o781k8432k1826K823j4136k2543j4356
11728B30511K4481J0667M444m901j6880Q682P780J7881K8406J0041k0004l6984
11716B64124q947K379j0911k8989j9949J2216J9410k3425R181Q333k092P313j5023
11703B13620R692j8749k1399L795j1910k009J9195O204o237J1377J5212k7071
$$ plain form
11691 191720 167860 176500 175216 169230 167795 173255 146871 152423 168039 177671 143457 147040 176424
11678 176424 179600 168156 162127 151873 138089 144391 151704 164320 160851 159426 148226 152160 149722
11665 149722 162023 172633 159008 160349 128812 105789 113060 131591 148475 128092 117683 127219
11653 127219 116419 112647 97076 82644 81957 86030 66327 71712 72302 89544 113210 128308 100508
11640 100508 122247 143356 148229 134346 107513 112176 128947 134490 137435 133733 114795 103892
11628 103892 82299 85283 106543 105010 84946 77045 71753 72096 77075 59912 42694 35549 85877
11615 85877 89380 76837 80031 112619 117753 105058 103459 116837 132361 125712 91361 73254 90436
11602 90436 88423 108861 140164 126677 100102 69221 88178 102734 128203 129259 120329 98444
$$ packed form
11691A91720k3860Q640j284n986j435N460k6384N552J5616R632l4214L583K9384
11678A76424L176j1444o029j0254j3784O302P313J2616l469j425j1200L934k438
11665A49722J2301J0610j3625J341l1537k3023P271J8531J6884k0383j0409R536
11653A27219j0800l772j5571j4432o87M073j9703N385N90J7242K3666J5098k7800
11640A00508K1739K1109M873j3883k6833M663J6771N543K945l702j8938j0903
11628A03892k1593K984K1260j533k0064p901n292L43M979j7163j7218p145N0328
11615H5877L503j2543L194L2588N134j2695j599J3378J5524o649l4351j8107J7182
11602I0436k013K0438L1303j3487k6575l0881J8957J4556K5469J056q930k1885
$$ plain form
11590 98444 86346 76791 64363 75182 67969 36200 32193 52294 39912 42438 46059 50148 59838
11577 59838 64467 73061 58572 64564 59070 64804 35270 28628 52013 48481 48381 43159 41650 57483
11563 57483 46847 37075 41500 52624 32574 64194 92871 81002 49150 34366 50399 66259
11551 66259 98777 77781 84288 70078 60109 61516 63461 69943 67742 45300 52510 67604 78755
11538 78755 89099 87124 81842 78615 89024 68276 62405 41531 12738 13559 28508 29510 24223
11525 24223 44139 64752 66463 59490 39962 29241 40823 61837 49230 43824 53980 71469
11513 71469 51987 17104 26113 33878 20595 16619 16238 14066 10926 27985 48764 51148 45582
11500 45582 51008 42945 45802 51713 35355 202 23495 27026 17254 20486 43604 56972 59871
$$ packed form
11590I8444j2098r555j2428J0819p213l1769m007K0101j2382K526L621M089R690
11577E9838M629Q594j4489N992n494N734k9534o642K3385l532j00n222j509J5833
11563E7483j0636r772M425J1124k0050L1620K8677j1869l1852j4784J6033J5860
11551F6259L2518k0996O507j4210r969J407J945O482k201k2442P210J5094J1151
11538G8755J0344j975n282l227J0409k0748n871k0874k8793Q21J4949J002n287
11525B4223J9916K0613J711o973j9528j0721J1582K1014j2607n406J0156J7489
11513G1469j9482l4883R009P765j3283l976l81k172l140J7059K0779K384n566
11500D5582N426q063K857N911j6358l5153K3293L531r772L232K3118J3368K899
$$ plain form
11487 59871 31735 -5464 6720 24028 32258 51882 44966 22945 19360 32544 18927 4793
11475 4793 1890 3558 33556 58316 52480 42423 62172 35686 9818 19009 48156 60491 38446
11462 38446 19885 28799 42181 34163 9016 11841 26475 31557 32650 19117 72 -1892 13231
11449 13231 40785 28795 -6755 11559 31769 54674 46514 36010 5731 -12943 -1780 18317
11437 18317 34852 38400 12373 1093 -11679 -9462 51910 63755 48869 21131 16288 23493
11425 23493 22886 3881 -13233 6265 24699 39428 48139 50062 52178 28564 -3861 2599 7008
11412 7008 17109 15058 19245 34561 45115 22947 22471 30646 60220 78527 71319 22929 9647
11399 9647 11181 27990 21460 10602 -2169 -842 12762 31208 13565 6729 24959 33936 40362
$$ packed form
11487E9871k8136l7199J2184J7308Q230J9624o916k2021l585J3184j3617j4134
11475D793k903J668K9998K4760n836j0057J9749k6486k5868R191K9147J2335k2045
11462C8446j8561Q914J3382q018k5147K825J4634N082J093j3533j9045j964J5123
11449A3231K7554j1990l5550J8314K0210K2905q160j0504l0279j8674J1163K0097
11437A8317J6535L548k6027j1280j2772K217O1372J1845j4886k7738m843P205
11425B3493o07j9005j7114J9498J8434J4729Q711J923K116k3614l2425O460M409
11412G008J0101k051M187J5316J0554k2168m76Q175K9574J8307p208m8390j3282
11399I647J534J6809o530j0858j2771J327J3604J8446j7643o836J8230Q977O426
$$ plain form
11386 40362 33924 38404 34491 12258 3917 34497 30873 21201 26084 24805 6738 -1751 38292
11373 38292 59742 65659 42655 54452 49077 38465 39270 58747 46264 62188 60403 29748 4092
11360 4092 14994 6592 16419 21274 24916 21428 18200 43164 46727 26609 28834 32598 32294 30088
11346 30088 42281 48714 80382 77014 56961 38077 36831 31368 33507 27383 6451 -34809 -7598
11333 -7598 35320 51072 49598 44323 35817 41346 49662 25793 21370 18466 -1828 -21396 -45582
11320 -45582 -38639 -25094 -16215 -3711 21276 28759 24249 3355 -7144 -3547 -21783 -32578 -43137
11307 -43137 -22780 -25999 -33142 -1827 10742 -20274 -8270 14472 2809 5035 12367 38283
11295 38283 52832 20699 3462 -6756 3038 32523 34068 31787 28756 14112 6855 -9603 2267
$$ packed form
11386D0362o438M480l913k2233q341L0580l624r672M883j279j8067q489M0043
11373C8292K1450N917k3004J1797n375j0612Q05J9477j2483J5924j785l0655k5656
11360D092J0902q402R827M855L642l488l228K4964L563k0118K225L764l04k206
11346C0088J2193O433L1668l368k0053j8884j246n463K139o124k0932m1260K7211
11333g598M2918J5752j474n275q506N529Q316k3869m423k904k0294j9568k4186
11320d5582O943J3545Q879J2504K4987P483m510k0894j0499L597j8236j0795j0559
11307d3137K0357l219p143L1315J2569l1016J2004K2742j1663K226P332K5916
11295C8283J4549l2133j7237j0218R794K9485J545k281l031j4644p257j6458J1870
$$ plain form
11282 2267 9305 4638 -11377 4519 -7416 -4490 17027 39959 55576 51904 56998 66720 56515
11269 56515 57860 39105 35456 44338 51450 32113 21278 9274 25109 19531 12225 18384 20963
11256 20963 23218 15760 11941 14987 13033 41043 23759 33727 79852 90357 71636 33921 44651
11243 44651 11887 -16735 -12103 -7198 25090 36089 60010 77518 94199 128146 168610 174805
11231 174805 195538 184445 193975 213550 222987 256540 258813 265343 261726 274768 267693 228352 223611
11218 223611 244783 249816 256926 259207 254242 234804 250961 238948 216388 191287 160970 117024
11206 117024 147799 173372 170235 132120 112489 75417 73942 90146 95097 111871 74957 47398
11194 47398 56188 62799 72720 74081 55122 41725 26748 27350 36928 52529 33625 31941 25719
$$ packed form
11282B267P038m667j6015J5896j1935K926K1517K2932J5617l672N094R722j0205
11269E6515J345j8755l649Q882P112j9337j0835j2004J5835n578p306O159K579
11256B0963K255p458l819L046j954K8010j7284R968M6125J0505j8721l7715J0730
11243D4651l2764k8622M632M905L2288J0999K3921J7508J6681L3947M0464O195
11231A74805K0733j1093R530J9575R437L3553K273O530l617J3042p075l9341m741
11218B23611K1172N033P110K281m965j9438J6157j2013k2560k5101l0317m3946
11206A17024L0775K5573l137l8115j9631l7072j475J6204M951J6774l6914k7559
11194D7398Q790O611R921J361j8959j3397j4977O02R578J5601j8904j684o222
$$ plain form
11181 25719 9547 19070 33078 36034 30370 40053 35782 40634 41850 34042 34002 14938 -8302 -3985
11167 -3985 3518 27053 22348 20155 23474 13084 13642 29717 31879 9329 14015 24971 26895 34128
11153 34128 48044 40594 35635 46813 70095 66723 70401 83995 75381 77489 93227 89945 101608
11140 101608 101040 86477 69073 75304 67204 50520 29898 26202 28206 28118 33586 23075 12719
11127 12719 -14156 -30521 -8280 -6000 -17891 -29532 -8688 -9696 -6161 -1268 33071 30183 13784
11114 13784 5781 10149 -11083 -10890 6802 15910 33554 41471 53437 48104 53607 38771 16697
11101 16697 -7420 -10290 -26988 -38325 -25981 -6148 5053 -12976 -22767 -16627 1849 6995
11089 6995 1045 -12386 5700 18071 30681 39224 32547 15128 -5857 12113 41255 39002 38443
$$ packed form
11181B5719j6172R523J4008K956n664R683m271M852J216p808m0j9064k3240M317
11167c985P503K3535m705k193L319j0390N58J6075K162k2550M686J0956J924P233
11153C4128J3916p450m959J1178K3282l372L678J3594q614K108J5738l282J1663
11140A01608n68j4563j7404O231q100j6684k0622l696K004q8N468j0511j0356
11127A2719k6875j6365K2241K280j1891j1641K0844j008L535M893L4339k888j6399
11114A3784q003M368k1232J93J7692R108J7644P917J1966n333N503j4836k2074
11101A6697k4117k870j6698j1337J2344J9833J1201j8029r791O140J8476N146
11089F995n950j3431J8086J2371J2610Q543o677j7419k0985J7970K9142k253n59
$$ plain form
11076 38443 35511 26041 -2356 -22924 -13324 29523 51663 14595 -16418 -6828 2189 5919 20574
11063 20574 35128 45855 32736 9933 -7808 -4799 -3033 -67 -7086 -1680 38198 47859 60034
11050 60034 41669 15287 30119 66091 87322 104278 114942 91582 76643 68081 89732 123178
11038 123178 148040 180614 199395 212545 227939 214547 201606 204293 208749 218265 267538 281519
11026 281519 264096 272095 259793 262112 258597 231247 262048 294597 271995 249128 258956 260975
11014 260975 232999 194282 190219 165830 162684 148897 148176 169366 192771 182625 147805 132035
11002 132035 115105 129121 128594 132150 115042 116931 105815 90348 70223 71771 71344 82859 78195
10989 78195 45852 34081 56659 52596 40811 38551 42098 30193 36277 41604 29213 41206 61675
$$ packed form
11076C8443k932r470k8397k0568R600M2847K2140l7068l1013R590R017L730J4655
11063B0574J4554J0727j3119k2803j7741L009J766K966p019N406L9878R661J2175
11050F0034j8365k6382J4832L5972K1231J6956J0664k3360j4939q562K1651L3446
11038A23178K4862L2574J8781J3150J5394j3392j2941K687M456R516M9273J3981
11026B81519j7423P999j2302K319l515k7350L0801L2549k2602k2867R828K019
11014B60975k7976l8717m063k4389l146j3787p21K1190K3405j0146l4820j5770
11002A32035j6930J4016n27L556j7108J889j1116j5467k0125J548m27J1515m664
10989G8195l2343j1771K2578m063j1785k260L547j1905O084N327j2391J1993K0469
$$ plain form
10976 61675 81661 88266 64627 60017 72809 66855 41922 44777 43667 34244 32730 49041 71795
10963 71795 91292 103657 98995 87311 79565 76476 91585 104970 91721 82724 91738 97211 109512
10950 109512 121968 119079 101143 84028 73156 58902 49543 51448 65911 64536 53003 42496
10938 42496 34414 21338 23948 36887 31780 16685 27962 40621 46355 60571 85282 83195 80676
10925 80676 82889 53046 43259 48494 49374 60738 54273 63162 64907 77736 98258 108489 117565
10912 117565 139694 143125 137878 139798 148375 153086 166776 181689 199188 179172 164108 163613 172787
10899 172787 160514 137624 141183 138069 133683 158288 175075 185823 182119 152995 122853 108452
10887 108452 95187 72507 85962 81242 55794 51206 62216 79790 85849 116903 128439 113426
$$ packed form
10976F1675J9986O605k3639m610J2792n954k4933K855j110r423j514J6311K2754
10963G1795J9497J2365m662j1684p746l089J5109J3385j3249q997R014N473J2301
10950A09512J2456k889j7936j7115j0872j4254r359J905J4463j375j1533j0507
10938D2496q082j3076K610J2939n107j5095J1277J2659N734J4216K4711k087k519
10925H0676K213k9843r787N235Q80J1364o465Q889J745J2829K0522J0231R076
10912A17565K2129L431n247J920Q577M711J3690J4913J7499k0016j5064m95R174
10899A72787j2273k2890L559l114m386K4605J6787J0748l704k9124l0142j4401
10887A08452j3265k2680J3455m720k5448m588J1010J7574O059L1054J1536j5013
$$ plain form
10875 113426 129432 157041 175935 188451 209123 193360 181617 170991 171253 197150 217884 248779
10863 248779 268155 300923 318367 311765 315233 351573 366326 369052 369108 374925 387842 389891 388772
10850 388772 394026 406233 433273 439225 435972 451520 455722 452204 451325 474677 503588 525878 549512
10837 549512 580125 607773 613969 618528 640562 640840 667712 714455 751137 791025 827214 857876
10825 857876 861827 861009 884282 937024 968843 986453 1006047 1047202 1074480 1118732 1153156 1207080
10813 1207080 1265869 1311385 1369394 1419385 1470648 1557938 1643162 1731935 1845715 1961230 2094807
10802 2094807 2255352 2416115 2620086 2856267 3084048 3291339 3562760 3913799 4323247
10793 4323247 4746644 5243622 5865379 6572348 7391401 8384856 9563173 10965261 12622633
$$ packed form
10875A13426J6006K7609J8894J2516K0672j5763j1743j0626K62K5897K0734L0895
10863B48779J9376L2768J7444o602L468L6340J4753K726N6N817J2917K049j119
10850C88772N254J2207K7040N952l253J5548M202l518q79K3352K8911K2290K3634
10837E49512L0613K7648O196M559K2034K78K6872M6743L6682L9888L6189L0662
10825H57876L951q18K3273N2742L1819J7610J9594M1155K7278M4252L4424N3924
10813A207080N8789M5516N8009M9991N1263Q7290Q5224Q8773J13780J15515J33577
10802B094807J60545J60763K03971K36181K27781K07291K71421L51039M09448
10793D323247M23397M96978O21757P06969Q19053R93455J178317J402088J657372
$$ plain form
10784 12622633 14628519 17035799 19907449 23250742 27130108 31510713 36179494 40951719
10776 40951719 45493318 49500347 52729685 54978226 56267097 56718529 56623245 56371837 56245148
10767 56245148 56427095 56915188 57480287 57839698 57629514 56609092 54631855 51616422 47762791
10758 47762791 43362757 38735186 34247138 30191509 26688498 23730449 21230600 19162632
10750 19162632 17484759 16116125 14953060 13952854 13096139 12346410 11682263 11113304 10589267
10741 10589267 10109369 9657096 9266278 8872374 8523316 8196343 7877524 7574422 7252297
10732 7252297 6946211 6658392 6319736 5992290 5706666 5440342 5188464 4930283 4681619
10723 4681619 4443234 4211529 3988500 3822601 3666112 3482206 3321795 3160733 3000252
$$ packed form
10784A2622633K005886K407280K871650L343293L879366M380605M668781M772225
10776D0951719M541599M007029L229338K248541J288871M51432r5284k51408j26689
10767E6245148J81947M88093N65099L59411k10184j020422j977237l015433l853631
10758D7762791m400034m627571m488048m055629l503011k958049k499849k067968
10750A9162632j677873j368634j163065j000206q56715p49729o64147n68959n24037
10741A0589267m79898m52273l90818l93904l49058l26973l18819l03102l22125
10732G252297l06086k87819l38656l27446k85624k66324k51878k58181k48664
10723D681619k38385k31705k23029j65899j56489j83906j60411j61062j60481
$$ plain form
10714 3000252 2838809 2693407 2590781 2489786 2370367 2248498 2140728 2050829 1946853 1834167
10704 1834167 1771349 1711919 1673623 1617781 1564080 1497081 1419038 1332486 1277444 1238517 1218045
10693 1218045 1177543 1129366 1083779 1054850 1037458 1007835 943754 942621 938459 932001 914464 879731
10681 879731 862613 820593 795642 793963 787826 750404 727260 719167 678904 680198 672430 691869
10669 691869 677456 668750 690378 736929 760383 804583 870129 924412 944278 955149 949318 959928
10657 959928 974494 966773 932889 904643 868845 828010 789605 794205 781238 763389 760645 723016
10645 723016 726840 724395 686620 657824 645913 675315 691998 722867 760919 776263 787552 811862
10633 811862 866752 887342 909296 963097 1024363 1097462 1214784 1341386 1499896 1670636 1900646
$$ packed form
10714C000252j61443j45402j02626j00995j19419j21869j07770q9899j03976j12686
10704A834167o2818n9430l8296n5842n3701o6999p8043q6552n5042l8927k0472
10693A218045m0502m8177m5587k8929j7392k9623o4081j133m162o458j7537l4733
10681H79731j7118m2020k4951j679o137l7422k3144q093m0263J294p768J9439
10669F91869j4413q706K1628M6551K3454M4200O5546N4283J9866J0871n831J0610
10657I59928J4566p721l3884k8246l5798m0835l8405M600j2967j7849k744l7629
10645G23016L824k445l7775k8796j1911K9402J6683L0869L8052J5344J1289K4310
10633H11862N4890K0590K1954N3801O1266P3099J17322J26602J58510J70740K30010
$$ plain form
10622 1900646 2218630 2609596 3131337 3790559 4546070 5421346 6355458 7269399 8120526
10613 8120526 8864432 9457262 9897220 10179020 10475272 10959277 11717785 12836609 14242671
10604 14242671 15784920 17268378 18574959 19526720 20071217 20182053 19920484 19566361 19536477
10595 19536477 19979791 21013274 22450518 24025066 25451814 26514095 27031319 26865186
10587 26865186 25966344 24482101 22802173 21396434 20545467 20286508 20460326 20851063 21174265
10578 21174265 21254109 20970662 20240604 19058507 17526876 15907923 14515129 13510099 12874974
10569 12874974 12516533 12277789 12045159 11709975 11208211 10536481 9734150 8789609 7779863
10560 7779863 6850547 6051647 5435267 4926394 4501123 4190845 3917773 3698869 3520010
$$ packed form
10622A900646L17984L90966N21741O59222P55511Q75276R34112R13941Q51127
10613H120526P43906N92830M39958K81800K96252M84005P58508J118824J406062
10604A4242671J542249J483458J306581R51761N44497J10836k61569l54123k9884
10595A9536477M43314J033483J437244J574548J426748J062281N17224j66133
10587B6865186q98842j484243j679928j405739q50967k58959J73818L90737L23202
10578B1174265P9844k83447p30058j182097j531631j618953j392794j005030o35125
10569A2874974l58441k38744k32630l35184n01764o71730q02331r44541j009746
10560G779863r29316p98900o16380n08873m25271l10278k73072k18904j78859
$$ plain form
10551 3520010 3347700 3207514 3048650 2883827 2750882 2595885 2480586 2369841 2272946 2195246
10541 2195246 2099545 1972419 1858348 1779225 1708676 1635950 1561503 1483579 1389533 1323896 1273380
10530 1273380 1227657 1173977 1096567 1020439 978642 921462 884693 853726 822480 779721 755199
10519 755199 720483 687147 637896 639879 625974 597395 554804 542141 535745 520141 517652 488629
10507 488629 436620 407334 402988 394180 410202 386602 379440 372799 364445 367965 345519 352355 324238
10494 324238 296575 277889 267692 277170 299454 287448 295610 294338 311171 293049 233469 226300
10482 226300 225667 228750 245563 263675 261149 244115 240775 253172 257139 230829 241851 271197 292016
10469 292016 308528 311727 284437 245465 232884 257439 265840 250997 251165 239599 230816 229330 215917
$$ packed form
10551C520010j72310j40186j58864j64823j32945j54997j15299j10745r6895p7700
10541B195246r5701j27126j14071p9123p0549p2726p4447p7924r4046o5637n0516
10530A273380m5723n3680p7410p6128m1797n7180l6769l0967l1246m2759k4522
10519G55199l4716l3336m9251J983j3905k8579m2591j2663o396j5604k489k9023
10507D88629n2009k9286m346q808J6022k3600p162o641q354L520k2446O836k8117
10494C24238k7663j8686j0197R478K2284j2006Q162j272J6833j8122n9580p169
10482B26300o33L083J6813J8112k526j7034l340J2397L967k6310J1022K9346K0819
10469B92016J6512L199k7290l8972j2581K4555Q401j4843J68j1566q783j486j3413
$$ plain form
10456 215917 208231 219291 220734 218249 252820 288055 281954 293594 309709 322423 337542 353779
10444 353779 338653 324720 327113 336980 367571 415265 441205 451577 472462 516878 562353 592419
10432 592419 667299 727131 777503 833182 922178 1036514 1177535 1331934 1529559 1771053
10422 1771053 2011782 2269693 2578220 2910435 3259329 3624539 3956638 4274072 4547697
10413 4547697 4739558 4898228 5027368 5094634 5129058 5159845 5174877 5163217 5097900 5012473 4892093
10402 4892093 4727932 4480601 4191283 3894387 3539572 3216540 2917487 2620659 2379505
10393 2379505 2148258 1928378 1769160 1669296 1512237 1390546 1275143 1171521 1123698 1111043
10383 1111043 1066450 994060 933661 902872 893704 858536 798483 745911 714366 684391 666693
$$ packed form
10456B15917p686J1060J443k485L4571L5235o101J1640J6115J2714J5119J6237
10444C53779j5126j3933K393R867L0591M7694K5940J0372K0885M4416M5475L0066
10432E92419P4880N9832N0372N5679Q8996J14336J41021J54399J97625K41494
10422A771053K40729K57911L08527L32215L48894L65210L32099L17434K73625
10413D547697J91861J58670J29140O7266L4424L0787J5032j1660o5317q5427j20380
10402D892093j64161k47331k89318k96896l54815l23032k99053k96828k41154
10393B379505k31247k19880j59218r9864j57059j21691j15403j03622m7823j2655
10383A111043m4593p2390o0399l0789r168l5168o0053n2572l1545k9975j7698
$$ plain form
10372 666693 643108 620663 582266 556388 540910 525702 492994 461846 420686 414180 404263 389197
10360 389197 385007 369252 373395 365925 340537 297873 270502 255402 249310 264862 276176 283976
10348 283976 279312 250482 244592 227797 213628 206036 198647 206497 205705 223151 216343 208298 198270
10335 198270 177985 201199 215167 228260 242218 245220 201711 201382 242373 253131 254227 251617
10323 251617 249961 256684 274446 293773 296045 341172 365379 384263 390157 403519 417159 390750
10311 390750 362254 360295 341959 354314 345602 334167 329078 333410 333234 325843 305401 275905 253019
10298 253019 241996 236232 214367 204658 192750 184423 162960 161003 153665 131947 114696 121302 118905
10285 118905 108664 110361 91369 63132 89371 108554 112908 80526 77870 77190 74331 74406 91156
$$ packed form
10372F66693k3585k2445l8397k5878j5478j5208l2708l1148m1160o506r917j5066
10360C89197m190j5755M143p470k5388m2664k7371j5100o092J5552J1314P800
10348B83976m664k8830n890j6795j4169p592p389P850p92J7446o808q045j0028
10335A98270k0285K3214J3968J3093J3958L002m3509l29M0991J0758J096k610
10323B51617j656O723J7762J9327K272M5127K4207J8884N894J3362J3640k6409
10311C90750k8496j959j8336J2355q712j1435n089M332j76p391k0442k9496k2886
10298B53019j1023n764k1865r709j1908q327k1463j957p338k1718j7251O606k397
10285A18905j0241J697j8992k8237K6239J9183M354l2382k656o80k859P5J6750
$$ plain form
10272 91156 98776 80097 50244 23124 31598 41939 46488 50741 60162 65262 47913 41524 38668
10259 38668 55972 58272 58123 63109 20113 -937 3238 16921 8252 23716 38369 38080 43052
10246 43052 83982 105537 97226 65333 28250 -3427 23466 34767 7542 10394 43045 72334
10234 72334 58175 54488 51169 45253 28263 35221 51828 66802 72908 71002 46170 47866 52326
10221 52326 68095 24058 -36509 -37994 -6563 -5064 -21337 54 21237 33549 13771 -3296
10209 -3296 -2095 -10835 20438 23958 19909 36745 34592 22530 16232 15397 2535 19398 44740
10196 44740 33313 16448 25741 35159 50770 50509 21307 39012 39809 26008 9660 14064 44143
10183 44143 56567 59064 77524 81107 81440 66857 54614 80813 98921 118029 114133 87058 70526
$$ packed form
10272I1156P620j8679k9853k7120Q474J0341M549M253R421N100j7349o389k856
10259C8668J7304K300j49M986m2996k1050M175J3683q669J5464J4653k89M972
10246D3052M0930K1555q311l1893l7083l1677K6893J1301k7225K852L2651K9289
10234G2334j4159l687l319n916j6990O958J6607J4974O106j906k4832J696M460
10221E2326J5769m4037o0567j485L1431J499j6273K1391K1183J2312j9778j7067
10209c296J201q740L1273L520m049J6836k153j2062o298q35j2862J6863K5342
10196D4740j1427j6865R293R418J5611k61k9202J7705P97j3801j6348M404L0079
10183D4143J2424K497J8460L583L33j4583j2243K6199J8108J9108l896k7075j6532
$$ plain form
10170 70526 73380 103190 137811 146194 138054 123906 118947 152211 164050 190897 205777 207886 189059
10157 189059 173947 186032 195923 200511 177291 140425 130573 126567 103921 76851 94587 120607
10145 120607 119764 115563 122997 158564 163994 155239 129456 114998 108528 113157 76221 66670 66610 73768
10131 73768 89577 99072 111187 110025 95646 86843 58310 57176 61694 57708 49300 39269 21567
10118 21567 -184 -4012 10146 15503 2844 -9902 -7620 -1135 34020 25715 29821 8256 11711
10105 11711 40753 40823 34085 39309 45077 38342 27649 26813 41145 64860 66827 86309 105285 91728
10091 91728 73506 48000 33689 31918 43570 12848 12643 21251 30040 26471 24969 27292 26062
10078 26062 8962 -12303 -14756 12208 31873 6825 20347 3782 -16462 -7272 9457 21475
$$ packed form
10170G0526K854K9810L4621Q383q140j4148m959L3264J1839K6847J4880K109j8827
10157A89059j5112J2085R891M588k3220l6866r852m006k2646k7070J7736K6020
10145A20607q43m201P434L5567N430q755k5783j4458o470M629l6936r551o0P158
10131G3768J5809R495J2115j162j4379q803k8533j134M518l986q408j0031j7702
10118B1567k1751l828J4158N357j2659j2746K282O485L5155q305M106k1565L455
10105A1711K9042P0o738N224N768o735j0693q36J4332K3715J967J9482J8976j3557
10091I1728j8222k5506j4311j771J1652l0722k05Q608Q789l569j502K323j230
10078B6062j7100k1265k453K6964J9665k5048J3522j6565k0244R190J6729J2018
$$ plain form
10066 21475 21157 12420 28995 34415 36879 34544 49228 65997 60593 50244 22384 845 31766
10053 31766 41289 44237 41371 27793 33084 45303 52351 71633 82659 87302 70540 60344 75434
10040 75434 68697 28818 6061 13770 4176 -11449 -11960 6667 25195 -40 1744 22387 36654
10027 36654 36556 41892 36567 30281 23791 28324 49173 34978 25709 5426 17943 33874 33176 22522
10013 22522 11625 11510 41017 46175 42365 30446 38967 30113 7887 18845 39040 29187 15938
10000 15938 28133 48599 61374 46363 29268 53495 88628 68342 61406 40476 31378 26409
9988 26409 -5211 -2915 20984 38673 39824 29405 20121 -164 -17206 -8130 15328 30570 40131
9975 40131 43626 31539 24875 20567 8498 4011 -6207 -185 12900 2482 -29087 -59480 -85008
$$ packed form
10066B1475l18q737J6575N420K464k335J4684J6769n404j0349k7860k1539L0921
10053C1766R523K948k866j3578N291J2219P048J9282J1026M643j6762j0196J5090
10040G5434o737l9879k2757P709r594j5625n11J8627J8528k5235J784K0643J4267
10027C6654r8N336n325o286o490M533K0849j4195r269k0283J2517J5931o98j0654
10013B2522j0897j15K9507N158l810j1919Q521q854k2226J0958K0195r853j3249
10000A5938J2195K0466J2775j5011j7095K4227L5133k0286o936k0930r098m969
9988B6409l1620K296K3899J7689J151j0419r284k0285j7042R076K3458J5242R561
9975D0131L495j2087o664m308j2069m487j0218O022J3085j0418l1569l0393k5528
$$ plain form
9962 -85008 -86956 -53732 -19625 -16015 -12731 13957 32936 16714 16629 22016 36337 44366 22517
9949 22517 14132 16109 52496 56871 48989 54648 51380 59074 45822 13370 20990 37669 52020
9936 52020 54577 37681 22547 15487 17086 39661 51957 45162 33010 19932 11776 18763 37221
9923 37221 27358 31261 38973 37944 32104 47287 58544 39549 35405 28496 21385 11641 17817 20352
9909 20352 22512 2530 10511 15510 14854 -3023 -16479 3748 33198 36252 20889 14565 14110 28428
9895 28428 19651 35021 49522 43032 40668 44953 69032 81829 82552 45884 32445 44930 51277
9882 51277 49479 19298 1159 3266 27848 39667 31842 36209 53195 62799 56240 43226 42954
9869 42954 34056 1784 10609 22169 11525 10203 -2878 -21502 -17325 6646 7777 -16981 473
$$ packed form
9962h5008j948L3224L4107L610L284K6688J8979j6222q5N387J4321Q029k1849
9949B2517q385J977L6387M375p882N659l268P694j3252l2452P620J6679J4351
9936E2020K557j6896j5134p060J599K2575J2296o795j2152j3078q156O987J8458
9923C7221r863L903P712j029n840J5183J1257j8995m144o909p111r744O176K535
9909B0352K160j9982P981M999o56j7877j3456K0227K9450L054j5363o324m55J4318
9895B8428q777J5370J4501o490k364M285K4079J2797P23l6668j3439J2485O347
9882E1277j798l0181j8139K107K4582J1819p825M367J6986R604o559j3014k72
9869D2954q898l2272Q825J1560j0644j322j3081j8624M177K3971J131k4758J7454
$$ plain form
9856 473 13343 33818 43819 62385 70930 90013 65874 48237 73045 55925 19249 35590
9844 35590 67228 50113 42155 46265 34080 49761 45148 16361 32884 52966 56177 60259 54823
9831 54823 65334 61417 64470 70727 60523 66884 60593 57416 31412 18004 34448 59688 53529
9818 53529 45226 39291 24834 22625 29928 49216 57209 65220 61897 50450 29531 23784 50307
9805 50307 71782 52355 46391 50143 65421 70678 63692 77489 107131 126823 107766 90112 74597
9792 74597 75835 88254 79331 82943 81739 63371 71415 84797 71248 59315 68727 92948 98164
9779 98164 81279 71749 80047 87197 92288 74384 114328 140004 105921 88739 98404 111175 121108
9766 121108 86971 86755 100541 100067 106450 92317 82982 98674 83990 87780 112327 116323 115735 135861
$$ packed form
9856D73J2870K0475J0001J8566Q545J9083k4139j7637K4808j7120l6676J6341
9844C5590L1638j7115p958M110j2185J5681m613k8787J6523K0082L211M082n436
9831E4823J0511l917L053O257j0204O361o291l177k6004j3408J6444K5240o159
9818E3529q303n935j4457k209P303J9288P993Q011l323j1447k0919n747K6523
9805E0307K1475j9427n964L752J5278N257o986J3797K9642J9692j9057j7654j5515
9792G4597J238J2419q923L612j204j8368Q044J3382j3549j1933R412K4221N216
9779I8164j6885r530Q298P150N091j7904L9944K5676l4083j7182R665J2771R933
9766A21108l4137k16J3786m74O383j4133r335J5692j4684L790K4547L996n88K0126
$$ plain form
9752 135861 134977 114314 111925 98077 84122 90173 119987 146844 158786 138535 130000 148459 178322
9739 178322 192097 186893 217471 236228 258355 276623 291360 309299 320192 347111 341356 339947
9727 339947 389072 430046 444408 449049 476501 537098 568407 606126 630596 678340 742791 800072
9715 800072 873250 934990 985502 1050935 1088020 1118177 1195848 1269266 1331840 1421333 1494283 1524376
9703 1524376 1585490 1667914 1724045 1764331 1805448 1865379 1928928 1947800 1968980 2005853 2047840
9692 2047840 2033850 1988779 1982912 1985537 1956232 1914264 1899746 1878903 1843981 1780044 1713635 1668266
9680 1668266 1614562 1549490 1501318 1445113 1396060 1349687 1320543 1279535 1237009 1186054 1143364
9669 1143364 1108150 1080443 1019950 972397 928849 867362 852315 865229 868918 877906 882333 874753
$$ packed form
9752A35861q84k0663k389j3848j3955O051K9814K6857J1942k0251q535J8459K9863
9739A78322J3775n204L0578J8757K2127J8268J4737J7939J0893K6919n755j409
9727C39947M9125M0974J4362M641K7452O0597L1309L7719K4470M7744O4451N7281
9715H00072P3178O1740N0512O5433L7085L0157P7671P3418O2574Q9493P2950L0093
9703A524376O1114Q2424N6131M0286M1117N9931O3549J8872K1180L6873M1987
9692B047840j3990m5071n867K625k9305m1968j4518k0843l4922o3937o6409m5369
9680A668266n3704o5072m8172n6205m9053m6373k9144m1008m2526n0955m2690
9669A143364l5214k7707o0493m7553m3548o1487j5047J2914L689Q988M427p580
$$ plain form
9657 874753 864881 836184 835838 886070 924277 964327 995988 1045258 1087337 1121751 1179550 1249960
9645 1249960 1303310 1359204 1422435 1527724 1618879 1673071 1707469 1745762 1785973 1852559 1903869
9634 1903869 1981386 2040599 2077114 2131479 2157432 2163198 2161897 2143057 2168736 2167308 2164762 2164617 2155297
9621 2155297 2121023 2083087 2034396 1986268 1947005 1902455 1829547 1761004 1710410 1641681 1578687
9610 1578687 1542013 1495318 1423685 1387373 1302469 1217161 1159964 1098952 1039738 1000365 972540
9599 972540 936623 899020 885898 858034 838844 777450 716389 689990 678922 642650 622014 618901
9587 618901 603453 569436 516391 489681 485851 500351 516633 519103 497904 470744 454825 454105
9575 454105 446559 455796 448179 445740 430074 411638 410225 379819 381484 392386 398842 407576 420043
$$ packed form
9657H74753r872k8697l46N0232L8207M0050L1661M9270M2079L4414N7799P0410
9645A249960N3350N5894O3231J05289R1155N4192L4398L8293M0211O6586N1310
9634A903869P7517N9213L6515N4365K5953N766j301j8840K5679j428k546j45r320
9621B155297l4274l7936m8691m8128l9263m4550p2908o8543n0594o8729o2994
9610A578687l6674m6695p1633l6312q4904q5308n7197o1012n9214l9373k7825
9599I72540l5917l7603j3122k7864j9190o1394o1061k6399j1068l6272k0636l113
9587F18901j5448l4017n3045k6710l830J4500J6282K470k1199k7160j5919p20
9575D54105p546R237p617k439j5666j8436j413l0406J665J0902O456Q734J2467
$$ plain form
9562 420043 401050 400546 378564 379481 403813 391738 383931 399274 419881 421024 431029 451803 466441
9549 466441 441180 404198 397717 406828 421386 441005 404245 387783 415572 444678 457444 472147
9537 472147 457848 424443 422258 397957 402928 419406 432409 420519 392216 394809 402559 417251
9525 417251 427496 427203 409869 392600 365749 360266 398896 394839 374087 381133 384166 361805 349733
9512 349733 373206 397394 437753 411342 376405 358476 329401 324904 352248 363200 367961 363949
9500 363949 343793 335308 345021 354289 379278 373372 366031 356060 348329 327707 351216 366440 338781
9487 338781 303689 307622 307388 318179 315549 306259 301209 319952 329292 331823 305353 286464 291616
9474 291616 315944 327145 313925 305102 342314 355321 335743 315557 315572 344497 334597 323972 351749
$$ packed form
9562D20043j8993n04k1982R17K4332j2075p807J5343K0607J143J0005K0774J4638
9549D66441k5261l6982o481R111J4558J9619l6760j6462K7789K9106J2766J4703
9537D72147j4299l3405k185k4301M971J6478J3003j1890k8303K593P750J4692
9525D17251J0245k93j7334j7269k6851n483L8630m057k0752P046L033k2361j2072
9512C49733K3473K4188M0359k6411l4937j7929k9075m497K7344J0952M761m012
9500C63949k0156q485R713R268K4989n906p341r971p731k0622K3509J5224k7659
9487C38781l5092L933k34J0791k630r290n050J8743R340K531k6470j8889N152
9474B91616K4328J1201j3220q823L7212J3007j9578k0186J5K8925r900j0625K7777
$$ plain form
9461 351749 365941 350022 358572 358356 350064 352872 362023 350361 316480 313973 329162 341319 373516
9448 373516 387598 374747 404848 417188 398745 387363 383958 382949 380897 387440 410629 417048 402209
9435 402209 378618 388319 405180 394501 375502 383076 406370 426712 435355 411315 389351 417667
9423 417667 437950 445299 454454 478109 487546 454359 437555 455149 454284 451427 434104 422654 421265
9410 421265 425899 457762 491661 516406 513738 503537 499674 478673 478900 507222 535509 547252 536418
9397 536418 519126 535133 556841 566386 565404 561540 571522 556903 540807 552822 563158 555927 560506
9384 560506 582537 595200 617702 624601 612675 616666 651358 667167 655781 660592 656664 657777 686502
9371 686502 706576 714151 723315 747475 763284 756452 774121 793575 806124 809889 850870 876680
$$ packed form
9461C51749J4192j5919Q550k16q292K808R151j1662l3881k507J5189J2157L2197
9448C73516J4082j2851L0101J2340j8443j1382l405j009k052O543K3189O419j4839
9435D02209k3591R701J6861j0679j8999P574K3294K0342Q643k4040k1964K8316
9423D17667K0283P349R155K3655R437l3187j6804J7594q65k857j7323j1450j389
9410D21265M634L1863L3899K4745k668j0201l863k1001K27K8322K8287J1743j0834
9397E36418j7292J6007K1708R545r82l864R982j4619j6096J2015J0336p231M579
9384E60506K2031J2663K2502O899j1926L991L4692J5809j1386M811l928J113K8725
9371F86502K0074P575R164K4160J5809o832J7669J9454J2549L765M0981K5810
$$ plain form
9359 876680 911914 947589 976606 971361 982795 1016630 1069362 1127919 1153507 1177527 1241225 1301219
9347 1301219 1342257 1414500 1496824 1595830 1666238 1731191 1818271 1949596 2119153 2268205 2418727
9336 2418727 2600008 2768214 2976410 3179230 3344374 3539208 3727618 3914557 4098813 4232121
9326 4232121 4346393 4468341 4578389 4678201 4792313 4908497 5028626 5164608 5307393 5462287
9316 5462287 5600008 5754755 5908227 6066858 6214415 6347035 6450067 6548155 6685113 6860556
9306 6860556 7066491 7316523 7604340 7942955 8394670 8921653 9551875 10264977 11057424 11963530
9296 11963530 12941426 14044427 15248761 16506512 17835841 19265199 20771666 22382227
9288 22382227 24058658 25752617 27488894 29294551 31134071 32951462 34711707 36376437
$$ packed form
9359H76680L5234L5675K9017n245J1434L3835N2732N8557K5588K4020O3698N9994
9347A301219M1038P2243Q2324R9006P0408O4953Q7080J31325J69557J49052J50522
9336B418727J81281J68206K08196K02820J65144J94834J88410J86939J84256J33308
9326D232121J14272J21948J10048R9812J14112J16184J20129J35982J42785J54894
9316E462287J37721J54747J53472J58631J47557J32620J03032R8088J36958J75443
9306F860556K05935K50032K87817L38615M51715N26983O30222P13102P92447R06106
9296A1963530R77896J103001J204334J257751J329329J429358J506467J610561
9288B2382227J676431J693959J736277J805657J839520J817391J760245J664730
$$ plain form
9280 36376437 37869531 39163336 40199007 40986473 41528885 41825433 41903686 41848274 41734219
9271 41734219 41614596 41544661 41566918 41694919 41968065 42399497 42955194 43631481 44450184 45406659
9261 45406659 46391269 47410640 48411755 49290254 50002113 50429284 50511621 50241778 49650232
9252 49650232 48766579 47658821 46366538 44981948 43507864 41982243 40454764 38917936
9244 38917936 37385201 35888811 34444966 33122859 31946884 30873921 29939971 29206980
9236 29206980 28640584 28216379 27893959 27648612 27457404 27309763 27164775 27007705 26810968
9227 26810968 26587582 26330702 26010342 25641937 25276040 24905174 24512791 24187347 23901832
9218 23901832 23654895 23473879 23377441 23325406 23304317 23346848 23435426 23582955 23848287 24195989
$$ packed form
9280C6376437J493094J293805J035671P87466N42412K96548P8253n5412j14055
9271D1734219j19623o9935K2257J28001K73146M31432N55697O76287Q18703R56475
9261D5406659R84610J019371J001115Q78499P11859M27171Q2337k69843n91546
9252D9650232q83653j107758j292283j384590j474084j525621j527479j536828
9244C8917936j532735j496390j443845j322107j175975j072963r33950p32991
9236B9206980n66396m24205l22420k45347j91208j47641j44988j57070j96737
9227B6810968k23386k56880l20360l68405l65897l70866l92383l25444k85515
9218B3901832k46937j81016r6438n2035k1089M2531Q8578J47529K65332L47702
$$ plain form
9208 24195989 24603099 25103906 25679284 26346945 27109358 27889975 28693316 29505848 30350235
9199 30350235 31181365 32042372 32970520 33927754 34896406 35922900 37013980 38100272 39168680
9190 39168680 40195531 41184491 42058723 42830787 43495750 44029113 44468854 44858298 45240507
9181 45240507 45585423 45925335 46236590 46463496 46593648 46657991 46557420 46283417 45849809 45270300
9171 45270300 44588451 43879081 43165375 42457377 41768346 41076395 40368020 39585618 38695862
9162 38695862 37734207 36692993 35591461 34447090 33369503 32395720 31520093 30818279 30222735
9153 30222735 29745264 29411350 29183232 29053228 29021947 29065431 29160148 29314187 29534664 29801620
9143 29801620 30143387 30532828 30959547 31418977 31877742 32302121 32725167 33085991 33377400
$$ packed form
9208B4195989M07110N00807N75378O67661P62413P80617Q03341Q12532Q44387
9199C0350235Q31130Q61007R28148R57234R68652J026494J091080J086292J068408
9190C9168680J026851R88960Q74232P72064O64963N33363M39741L89444L82209
9181D5240507L44916L39912L11255K26906J30152O4343j00571k74003m33608n79509
9171D5270300o81849p09370p13706p07998o89031o91951p08375p82402q89756
9162C8695862r61655j041214j101532j144371j077587r73783q75627p01814n95544
9153C0222735m77471l33914k28118j30004l1281M3484R4717J54039K20477K66956
9143B9801620L41767L89441M26719M59430M58765M24379M23046L60824K91409
$$ plain form
9134 33377400 33651755 33871656 34046487 34212879 34372500 34540818 34739729 34985013 35245286
9125 35245286 35516627 35780506 36002357 36163148 36227173 36217768 36108186 35908495 35621041 35194332
9115 35194332 34607744 33908670 33066629 32135920 31147312 30122715 29111070 28118762 27188046
9106 27188046 26380262 25677461 25103471 24695203 24379896 24190514 24068615 23960800 23852232
9097 23852232 23748532 23532232 23207281 22798300 22325206 21804928 21203086 20553653 19944187
9088 19944187 19384054 18891532 18431965 18028673 17687214 17415955 17168487 16906257 16644167
9079 16644167 16364090 16064141 15721018 15341614 14947876 14532982 14080248 13649927 13267687
9070 13267687 12871201 12514907 12235647 11975483 11716863 11493458 11319283 11160591 10969828
$$ packed form
9134C3377400K74355K19901J74831J66392J59621J68318J98911K45284K60273
9125C5245286K71341K63879K21851J60791O4025r405j09582j99691k87454m26709
9115C5194332n86588o99074q42041r30709r88608j024597j011645r92308r30716
9106B7188046q07784p02801n73990m08268l15307j89382j21899j07815j08568
9097B3852232j03700k16300l24951m08981m73094n20278o01842o49433o09466
9088A9944187n60133m92522m59567m03292l41459k71259k47468k62230k62090
9079A6644167k80077k99949l43123l79404l93738m14894m52734m30321l82240
9070A3267687l96486l56294k79260k60164k58620k23405j74175j58692j90763
$$ plain form
9061 10969828 10796307 10672892 10581334 10530911 10471910 10478465 10542598 10624130 10721991 10829612 10955571
9050 10955571 11105167 11250989 11368965 11485113 11569218 11638595 11640372 11562974 11424320 11238308
9040 11238308 11034762 10806918 10542234 10288462 10054168 9825924 9616407 9392516 9188118
9031 9188118 9040370 8887704 8769605 8674396 8552875 8407231 8242606 8066586 7862618 7665986
9021 7665986 7468766 7226795 6983967 6741486 6497545 6297398 6133435 5958713 5837588 5763803
9011 5763803 5700068 5661712 5611656 5584698 5580575 5590706 5565891 5505445 5415350 5340828 5283777 5193907
8999 5193907 5094176 4986838 4895733 4773797 4657485 4563538 4489486 4404786 4334196 4316179 4312669
8988 4312669 4288938 4277933 4264189 4218151 4159744 4134634 4105765 4057937 3997450 3935979 3837848
$$ packed form
9061A0969828j73521j23415r1558n0423n9001O555O4133Q1532R7861J07621J25959
9050A0955571J49596J45822J17976J16148Q4105O9377J777p7398j38654j86012
9040A1238308k03546k27844k64684k53772k34294k28244k09517k23891k04398
9031I188118j47748j52666j18099r5209j21521j45644j64625j76020k03968j96632
9021G665986j97220k41971k42828k42481k43941k00147j63963j74722j21125p3785
9011E763803o3735l8356n0056k6958m123J0131k4815o0446r0095p4522n7051q9870
8999E193907r9731j07338r1105j21936j16312r3947p4052q4700p0590j8017l510
8988D312669k3731j1005j3744m6038n8407k5110k8869m7828o0487o1471r8131
$$ plain form
8977 3837848 3743886 3688738 3631698 3600640 3568851 3511390 3479230 3504092 3551613 3575218 3654696
8966 3654696 3758216 3854022 3988642 4103706 4278391 4494375 4699839 4911545 5132251 5363350
8956 5363350 5635628 5888847 6123968 6334578 6517453 6685597 6816705 6896212 7003818 7132200
8946 7132200 7236277 7343783 7441605 7586523 7756923 7967527 8208401 8492485 8792296 9068996
8936 9068996 9294568 9457428 9605781 9727344 9758468 9716566 9635687 9531440 9422691 9321440
8926 9321440 9228480 9099460 8976527 8854889 8768159 8657977 8580121 8499115 8446691 8433710 8420487
8915 8420487 8459056 8489843 8517264 8582344 8654277 8689849 8719416 8724679 8720439 8755006 8793585 8839883
8903 8839883 8907881 9023739 9234436 9546064 9907865 10313942 10764743 11265183 11796288 12298019
$$ packed form
8977C837848r3962n5148n7040l1058l1789n7461l2160K4862M7521K3605P9478
8966C654696J03520R5806J34620J15064J74685K15984K05464K11706K20706K31099
8956E363350K72278K53219K35121K10610J82875J68144J31108P9507J07606J28382
8946G132200J04077J07506R7822J44918J70400K10604K40874K84084K99811K76700
8936I068996K25572J62860J48353J21563L1124m1902q0879j04247j08749j01251
8926I321440r2960j29020j22933j21638q6730j10182p7856q1006n2424j2981j3223
8915H420487L8569L0787K7421O5080P1933L5572K9567N263m240L4567L8579M6298
8903H839883O7998J15858K10697L11628L61801M06077M50801N00440N31105N01731
$$ plain form
8893 12298019 12758517 13133179 13363512 13479839 13443996 13283150 13034990 12736388 12401945 12052987
8883 12052987 11733390 11506151 11347538 11272168 11292195 11388555 11588719 11851285 12193122 12634281
8873 12634281 13139539 13710401 14285824 14906114 15510551 16054249 16544830 16915660 17212143
8864 17212143 17394819 17462036 17412501 17264547 17016804 16706459 16358751 15953004 15487876 14990225
8854 14990225 14451607 13942023 13473532 13060265 12702624 12392708 12120821 11912424 11799548
8845 11799548 11749454 11715415 11741890 11785877 11892794 12085473 12300278 12550811 12834889 13137411
8835 13137411 13402613 13646776 13839079 13985642 14004047 13906043 13735033 13492575 13162081 12796690
8825 12796690 12467866 12115208 11797617 11541259 11344023 11209657 11147858 11116375 11125282 11184333
$$ packed form
8893A2298019M60498L74662K30333J16327l5843j60846k48160k98602l34443l48958
8883A2052987l19597k27239j58613p5370K0027R6360K00164K62566L41837M41159
8873A2634281N05258N70862N75423O20290O04437N43698M90581L70830K96483
8864A7212143J82676O7217m9535j47954k47743l10345l47708m05747m65128m97651
8854A4990225n38618n09584m68491m13267l57641l09916k71887k08397j12876
8845A1799548n0094l4039K6475M3987J06917J92679K14805K50533K84078L02522
8835A3137411K65202K44163J92303J46563J8405r8004j71010k42458l30494l65391
8825A2796690l28824l52658l17591k56358j97236j34366o1799l1483Q907N9051
$$ plain form
8815 11184333 11200548 11180259 11096917 10969843 10744710 10452552 10111353 9748000 9400877 9064933
8805 9064933 8761300 8490531 8260568 8080299 7971148 7892639 7861915 7942429 8075510 8241734
8795 8241734 8509570 8786682 9082487 9414128 9762072 10094680 10334075 10534486 10699605 10853312
8785 10853312 10939235 10943848 10882500 10720906 10540726 10272319 9933586 9586386 9229174 8841349
8775 8841349 8478438 8174685 7911948 7675633 7488751 7341001 7277442 7223804 7165404 7153066
8765 7153066 7175665 7231528 7303064 7371858 7442917 7504854 7495713 7419730 7317655 7143456 6916715
8754 6916715 6628961 6280571 5947533 5642611 5332175 5032892 4751306 4471341 4208278 3983275
8744 3983275 3812312 3652724 3506193 3381481 3261267 3151332 3055758 2931108 2815824 2717914
$$ packed form
8815A1184333J6215k0289q3342j27074k25133k92158l41199l63353l47123l35944
8805I064933l03633k70769k29963j80269j09151p8509l0724Q0514J33081J66224
8795H241734K67836K77112K95805L31641L47944L32608K39395K00411J65119J53707
8785A0853312Q5923M613o1348j61594j80180k68407l38733l47200l57212l87825
8775H841349l62911l03753k62737k36315j86882j47750o3559n3638n8400j2338
8765G153066K2599N5863P1536O8794P1059O1937r141p5983j02075j74199k26741
8754F916715k87754l48390l33038l04922l10436k99283k81586k79965k63063k25003
8744C983275j70963j59588j46531j24712j20214j09935r5574j24650j15284r7910
$$ plain form
8734 2717914 2644709 2572421 2517718 2455332 2403461 2379459 2354361 2328804 2304027 2285361 2249495
8723 2249495 2221900 2227736 2216966 2211007 2217936 2213922 2214393 2235912 2223853 2216731 2249674 2264272 2289891
8710 2289891 2314645 2334136 2353774 2362480 2404680 2455353 2493490 2523133 2540462 2565355 2608663 2644096
8698 2644096 2678968 2695310 2718832 2780036 2812874 2850739 2858831 2861076 2861179 2883595 2881870 2835462
8686 2835462 2788295 2740675 2654526 2576541 2517640 2456850 2417282 2397651 2382557 2368988 2351130
8675 2351130 2342175 2336848 2334330 2392531 2440467 2473974 2500136 2521392 2572165 2574750 2570770 2546763
8663 2546763 2492147 2421678 2346891 2231547 2117560 2020008 1948791 1871756 1795517 1720187 1676454
8652 1676454 1663471 1638484 1595233 1590251 1596154 1559187 1493204 1494936 1498944 1511252 1506397 1499919 1486777
$$ packed form
8734B717914p3205p2288n4703o2386n1871k4002k5098k5557k4777j8666l5866
8723B249495k7595N836j0770n959O929m014M71K1519j2059p122L2943J4598K5619
8710B289891K4754J9491J9638Q706M2200N0673L8137K9643J7329K4893M3308L5433
8698B644096L4872J6342K3522O1204L2838L7865Q092K245J03K2416j725m6408
8686B835462m7167m7620q6149p7985n8901o0790l9568j9631j5094j3569j7858
8675B351130q955n327k518N8201M7936L3507K6162K1256N0773K585l980k4007
8663B546763n4616p0469p4787j15344j13987r7552p1217p7035p6239p5330m3733
8652A676454j2983k4987m3251m982N903l6967o5983J732M008J2308m855o478j3142
$$ plain form
8639 1486777 1460637 1458445 1450876 1456663 1442542 1461252 1506433 1546285 1595611 1642077 1669593 1710416
8627 1710416 1769937 1832520 1904984 1993551 2041708 2074270 2119065 2159459 2197277 2209036 2197839
8616 2197839 2198536 2204751 2250190 2300027 2348956 2395784 2454970 2482571 2544906 2644807 2741021 2810791
8604 2810791 2892895 2969697 3061949 3138792 3185775 3198702 3230115 3266642 3254498 3262153 3273849 3269161
8592 3269161 3240046 3222726 3239438 3280376 3357099 3431716 3485235 3548973 3620216 3694814 3742808
8581 3742808 3813746 3892341 3953000 4039761 4119637 4191255 4265385 4324336 4380736 4421173 4445941
8570 4445941 4452163 4478586 4505681 4459115 4404657 4381745 4360565 4316386 4254607 4212148 4199421 4162295
8558 4162295 4116986 4155910 4207118 4253176 4340302 4459936 4584300 4711985 4881115 5080038
$$ packed form
8639A486777k6140k192p569N787j4121J8710M5181L9852M9326M6466K7516M0823
8627A710416N9521O2583P2464Q8567M8157L2562M4795M0394L7818J1759j1197
8616B197839O97O215M5439M9837M8929M6828N9186K7601O2335R9901R6214O9770
8604B810791Q2104P6802R2252P6843M6983J2927L1413L6527j2144P655J1696m688
8592C269161k9115j7320J6712M0938P6723P4617N3519O3738P1243P4598M7994
8581C742808P0938P8595O0659Q6761P9876P1618P4130N8951N6400M0437K4768
8570D445941O222K6423K7095m6566n4458k2912k1180m4179o1779m2459j2727l7126
8558D162295m5309L8924N1208M6058Q7126J19634J24364J27685J69130J98923
$$ plain form
8548 5080038 5317190 5647780 6013350 6422634 6932949 7538091 8244527 9080675 10054080 11145510
8538 11145510 12370680 13741374 15270681 16963409 18802260 20723151 22696362 24668796
8530 24668796 26526106 28169162 29588387 30730081 31539883 32043198 32294472 32392629 32373810
8521 32373810 32214210 31943281 31493413 30802305 29821186 28582114 27129980 25505958 23826498
8512 23826498 22179946 20623643 19214019 17955849 16906570 16033747 15325179 14717914 14192331
8503 14192331 13800246 13494064 13256458 13072084 12941971 12837689 12741914 12637820 12556346 12522647
8493 12522647 12496798 12473498 12436245 12400941 12321358 12291710 12264739 12247297 12260519 12321042 12404304
8482 12404304 12535309 12750104 13027520 13388516 13846291 14409174 15107843 15914628 16861634
$$ packed form
8548E080038K37152L30590L65570M09284N10315O05142P06436Q36148R73405J091430
8538A1145510J225170J370694J529307J692728J838851J920891J973211J972434
8530B4668796J857310J643056J419225J141694Q09802N03315K51274R8157j8819
8521C2373810j59600k70929m49868o91108r81119j239072j452134j624022j679460
8512B3826498j646552j556303j409624j258170j049279q72823p08568o07265n25583
8503A4192331l92085l06182k37606j84374j30113j04282r5775j04094q1474l3699
8493A2522647k5849k3300l7253l5304p9583k9648k6971j7442J3222O0523Q3262
8482A2404304J31005K14795K77416L60996M57775N62883O98669Q06785R47006
$$ plain form
8473 16861634 18041818 19387990 20924032 22672611 24521041 26510785 28554328 30545141
8465 30545141 32447920 34206481 35781900 37216943 38520655 39768114 41012743 42277826
8457 42277826 43557496 44894176 46301197 47762300 49312336 51052679 53129304 55723390
8449 55723390 59049835 63323227 68826510 75836586 84753049 95987904 110004977 127181002
8441 127181002 147761918 171448736 197194510 223226761 247164522 266348858 278483905
8434 278483905 281956494 276011385 261107275 239115424 213067629 186329864 161559367
8427 161559367 140149181 122482054 108312132 97038545 88066568 80862889 74997773
8420 74997773 70153596 66045046 62481680 59345770 56536639 54048029 51852541 49922940
$$ packed form
8473A6861634J180184J346172J536042J748579J848430J989744K043543J990813
8465C0545141J902779J758561J575419J435043J303712J247459J244629J265083
8457D2277826J279670J336680J407021J461103J550036J740343K076625K594086
8449E5723390L326445M273392N503283P010076Q916463J1234855J4017073J7176025
8441A27181002K0580916K3686818K5745774K6032251K3937761J9184336J2135047
8434B78483905L472589n945109j4904110k1991851k6047795k6737765k4770497
8427A61559367k1410186j7667127j4169922j1273587q971977p203679n865116
8420G4997773m844177m108550l563366l135910k809131k488610k195488j929601
$$ plain form
8412 49922940 48242320 46797636 45574782 44530361 43606595 42741806 41867032 40908053 39866837
8403 39866837 38719265 37522865 36288412 35068352 33863949 32652495 31479566 30387892
8395 30387892 29323882 28286582 27275903 26320594 25375630 24476837 23605530 22756434 21961041
8386 21961041 21230901 20582184 20003957 19457752 18994928 18618866 18303091 18072057 17922958
8377 17922958 17853940 17906496 18084355 18402765 18861725 19492924 20307951 21392784 22719578
8368 22719578 24280332 26003157 27796173 29535125 31099378 32354061 33079245 33249352
8360 33249352 32832355 31842713 30491311 28925847 27345633 25932530 24774378 23896947 23329592
8351 23329592 22975598 22786170 22723160 22760768 22889388 23075761 23340005 23712115 24113378 24588088
$$ packed form
8412D9922940j680620j444684j222854j044421r23766q64789q74774r58979j041216
8403C9866837j147572j196400j234453j220060j204403j211454j172929j091674
8395C0387892j064010j037300j010679r55309r44964q98793q71307q49096p95393
8386B1961041p30140o48717n78227n46205m62824l76062l15775k31034j49099
8377A7922958o9018N2556J77859L18410M58960O31199Q15027J084833J326794
8368B2719578J560754J722825J793016J738952J564253J254683P25184J70107
8360C3249352m16997r89642j351402j565464j580214j413103j158152q77431n67355
8351B3329592l53994j89428o3010L7608J28620J86373K64244L72110M01263M74710
$$ plain form
8341 24588088 25129286 25737602 26323052 26905043 27477348 28024301 28540848 28960588 29316817
8332 29316817 29593222 29831480 30018865 30181372 30310764 30449217 30613147 30835286 31162504
8323 31162504 31641182 32211549 32898640 33727905 34664337 35686087 36661187 37501245 38184280
8314 38184280 38606831 38632542 38270185 37495866 36360445 34939123 33386728 31804248 30293029
8305 30293029 28917003 27788596 26895701 26255561 25860951 25675960 25732150 26018805 26551826
8296 26551826 27314847 28292218 29570250 31110963 32945025 35154564 37793318 40899617
8288 40899617 44562487 48874441 53974730 59988419 67131334 75613148 85741336 97810628
8280 97810628 112040773 128607673 147479358 168240556 189961541 211308161 230563665
$$ packed form
8341B4588088N41198O08316N85450N81991N72305N46953N16547M19740L56229
8332B9316817K76405K38258J87385J62507J29392J38453J63930K22139L27218
8323C1162504M78678N70367O87091Q29265R36432J021750R75100Q40058O83035
8314C8184280M22551K5711l62357p74319j135421j421322j552395j582480j511219
8305C0293029j376026j128407q92895o40140l94610j84991N6190K86655N33021
8296B6551826P63021R77371J278032J540713J834062K209539K638754L106299
8288D0899617L662870M311954N100289O013689P142915Q481814J0128188J2069292
8280I7810628J4230145J6566900J8871685K0761198K1720985K1346620J9255504
$$ plain form
8273 230563665 245899955 255678175 258783305 254796415 244093479 228072576 208737153
8266 208737153 188295726 168604265 150834845 135566621 122938187 112681425 104437717
8259 104437717 97825806 92549656 88220420 84562553 81332400 78314223 75402294 72414431
8251 72414431 69300767 66075838 62816861 59581622 56455967 53520185 50798877 48292007
8243 48292007 45999916 43857000 41829161 39936006 38176499 36509332 34958489 33507925
8235 33507925 32121854 30838237 29683681 28598437 27632091 26739629 25921297 25175795 24512031
8226 24512031 23940220 23390306 22932428 22549200 22194494 21895521 21663226 21536356 21450865 21410217
8216 21410217 21429532 21516923 21664914 21884613 22148172 22446798 22851449 23335545 23905629 24556931
$$ packed form
8273B30563665J5336290R778220L105130l986890j0702936j6020903j9335423
8266B08737153k0441427j9691461j7769420j5268224j2628434j0256762q243708
8259A04437717o611911n276150m329236l657867l230153l018177k911929k987863
8251G2414431l113664l224929l258977l235239l125655k935782k721308k506870
8243D8292007k292091k142916k027839j893155j759507j667167j550843j450564
8235C3507925j386071j283617j154556j085244r66346q92462q18332p45502o63764
8226B4512031n71811n49914m57878l83228l54706k98973k32295j26870q5491m0648
8216B1410217J9315Q7391J47991K19699K63559K98626M04651M84096N70084O51302
$$ plain form
8206 24556931 25312144 26237600 27262695 28424311 29780109 31307954 33106864 35212676
8198 35212676 37649287 40516786 43859740 47700261 52222931 57508014 63626017 70676642
8190 70676642 78808008 88178243 98837098 110777364 123860545 137832245 152223566
8183 152223566 166398698 179521492 190672647 198990520 203778650 204609321 201352690 194267939
8175 194267939 184052224 171582614 157851323 143779334 130092349 117371557 105911278
8168 105911278 95779606 86928327 79273079 72691773 66992559 62048366 57753386 53963079
8160 53963079 50654576 47772196 45220750 42971819 40963366 39157052 37551354 36138134
8152 36138134 34818010 33550996 32372639 31214566 30098240 28961791 27808763 26671483
$$ packed form
8206B4556931P55213R25456J025095J161616J355798J527845J798910K105812
8198C5212676K436611K867499L342954L840521M522670N285083O118003P050625
8190G0676642Q131366R370235J0658855J1940266J3083181J3971700J4391321
8183A52223566J4175132J3122794J1151155Q317873M788130Q30671l256631p084751
8175A94267939j0215715j2469610j3731291j4071989j3686985j2720792j1460279
8168A05911278j0131672q851279p655248o581306n699214m944193m294980l790307
8160E3963079l308503k882380k551446k248931k008453j806314j605698j413220
8152C6138134j320124j267014j178357j158073j116326j136449j153028j137280
$$ plain form
8144 26671483 25500708 24373687 23297625 22256164 21251157 20263714 19315464 18424213 17611063
8135 17611063 16830586 16126115 15451766 14787479 14163259 13567928 13014966 12470846 11992430
8126 11992430 11532816 11073216 10650766 10242489 9838735 9501915 9164142 8846224 8572532
8117 8572532 8314586 8067821 7844979 7619620 7390453 7165692 6963921 6755362 6563795 6406915
8107 6406915 6247719 6066590 5899263 5740944 5596311 5443562 5280708 5153027 5049624 4922081
8097 4922081 4780660 4647749 4510257 4406951 4302423 4198166 4093602 3977627 3861707 3755709
8087 3755709 3650624 3547183 3464970 3383225 3289834 3209851 3139515 3093942 3036248 2978219 2936652
8076 2936652 2875796 2815448 2770236 2750736 2713101 2669788 2660548 2662638 2645416 2614224 2588345 2565643
$$ packed form
8144B6671483j170775j127021j076062j041461j005007r87443r48250q91251q13150
8135A7611063p80477p04471o74349o64287o24220n95331n52962n44120m78416
8126A1992430m59614m59600m22450m08277m03754l36820l37773l17918k73692
8117H572532k57946k46765k22842k25359k29167k24761k01771k08559j91567j56880
8107F406915j59196j81129j67327j58319j44633j52749j62854j27681j03403j27543
8097D922081j41421j32911j37492j03306j04528j04257j04564j15975j15920j05998
8087C755709j05085j03441q2213q1745r3391p9983p0336m5573n7694n8029m1567
8076B936652o0856o0348m5212j9500l7635m3313r240K090j7222l1192k5879k2702
$$ plain form
8064 2565643 2537076 2519906 2532299 2565548 2600274 2607210 2575446 2564598 2545953 2506632 2489828 2465410
8052 2465410 2459448 2435943 2423806 2412944 2371126 2344240 2344322 2353896 2387104 2443123 2504116 2572712
8040 2572712 2654516 2726608 2801034 2818016 2809027 2781510 2734519 2653632 2564454 2468066 2362558
8029 2362558 2257790 2180021 2104214 2044168 2007152 1988935 1960453 1929514 1875981 1854682 1826665
8018 1826665 1816758 1788541 1739818 1684788 1660472 1649828 1621467 1583146 1561499 1526778 1485188 1494781
8006 1494781 1470363 1462751 1425479 1382026 1355495 1349348 1320564 1316730 1296626 1255473 1206890 1183016
7994 1183016 1171751 1131323 1120264 1106294 1068112 1052229 1046852 1040051 1054559 1041611 1036917 1034969
7982 1034969 1048673 1057556 1051646 1071326 1070674 1042445 1029167 1030154 1037193 1027921 1016123 1026326 1035764
$$ packed form
8064B565643k8567j7170J2393L3249L4726O936l1764j0848j8645l9321j6804k4418
8052B465410n962k3505j2137j0862m1818k6886Q2R574L3208N6019O0993O8596
8040B572712Q1804P2092P4426J6982q989k7517m6991q0887q9178r6388j05508
8029B362558j04768p7769p5807o0046l7016j8217k8482l0939n3533k1299k8017
8018A826665r907k8217m8723n5030k4316j0644k8361l8321k1647l4721m1590R593
8006A494781k4418p612l7272m3453k6531o147k8784l834k0104m1153m8583k3874
7994A183016j1265m0428j1059j3970l8182j5883n377o801J4508j2948m694j948
7982A034969J3704Q883n910J9680o52k8229j3278R87P039r272j1798J0203R438
$$ plain form
7969 1035764 1045151 1054117 1050076 1064797 1042432 1053351 1044048 1037782 1032082 1018834 1001489 1000662 976040
7956 976040 947502 920255 913813 919164 905056 892367 854283 836688 835545 832176 813560 807339 800307
7943 800307 782856 776455 788105 783376 797180 803351 816461 818243 825257 795358 750576 751264 786612
7930 786612 803891 807617 812405 776235 759832 747701 735252 710733 720520 723483 738637 751477
7918 751477 764155 746215 737382 756291 781793 750384 732386 739890 744921 732234 719814 715323
7906 715323 685543 660481 641378 630106 636136 635073 632756 626398 646222 643578 623845 631261 645571
7893 645571 628711 626026 643101 635335 646982 683293 706514 720904 733555 767144 819429 871528
7881 871528 911478 980192 1059221 1156633 1225948 1286079 1383189 1465757 1536188 1570555 1586769 1575155
$$ packed form
7969A035764R387Q966m041J4721k2365J0919r303o266n700j3248j7345q27k4622
7956I76040k8538k7247o442N351j4108j2689l8084j7595j143l369j8616o221p032
7943H00307j7451o401J1650m729J3804O171J3110J782P014k9899m4782O88L5348
7930G86612J7279L726M788l6170j6403j2131j2449k4519R787K963J5154J2840
7918G51477J2678j7940q833J8909K5502l1409j7998P504N031j2687j2420m491
7906G15323k9780k5062j9103j1272O030j063k317o358J9824k644j9733P416J4310
7893F45571j6860k685J7075p766J1647L6311K3221J4390J2651L3589N2285N2099
7881H71528L9950O8714P9029R7412O9315O0131R7110Q2568P0431L4367J6214j1614
$$ plain form
7869 1575155 1545769 1509746 1446426 1357479 1275962 1182777 1097099 1015224 951076 908662 870756
7858 870756 837231 797211 807419 802234 780652 753593 740242 771399 774363 753476 724814 707063
7846 707063 701646 693325 668387 652228 641377 638448 633384 616095 634760 624793 573776 567640 540314
7833 540314 505286 496069 505000 493720 448699 424621 419238 400966 418261 409030 422149 424453 425025
7820 425025 440227 468848 477160 472258 471569 465635 442740 425742 413236 403855 404039 429927 472923
7807 472923 488081 485689 517022 501395 444330 424241 440541 448694 489499 509234 515946 540411
7795 540411 587626 636473 664598 676111 700738 745504 778229 817208 876158 917672 958257 1004755
7783 1004755 1077121 1117094 1140641 1151071 1157509 1147029 1162286 1153074 1091269 1052055 1017420 971246
$$ packed form
7869A575155k9386l6023o3320q8947q1517r3185q5678q1875o4148m2414l7906
7858H70756l3525m0020J0208n185k1582k7059j3351L1157K964k0887k8662j7751
7846G07063n417q321k4938j6159j0851k929n064j7289J8665r967n1017o136k7326
7833E40314l5028r217Q931j1280m5021k4078n383j8272J7295r231J3119K304N72
7820D25025J5202K8621Q312m902o89n934k2895j6998j2506r381J84K5888M2996
7807D72923J5158k392L1333j5627n7065k0089J6300Q153M0805J9735O712K4465
7795E40411M7215M8847K8125J1513K4627M4766L2725L8979N8950M1514M0585M6498
7783A004755P2366L9973K3547J0430O438j0480J5257r212o1805l9214l4635m6174
$$ plain form
7771 971246 913916 877087 830539 745510 684231 677808 638144 608223 600314 587783 547847 503665
7759 503665 489701 475095 452425 434625 418844 400491 405795 416774 406981 396632 397539 385138
7747 385138 364894 355765 361395 367687 366847 340888 348250 344774 330397 309018 297796 311222 295235
7734 295235 283497 288480 286646 288082 279520 269174 263311 272640 278626 272215 257618 259733 239415
7721 239415 232892 246625 234166 214346 221174 218410 201763 209898 205883 196437 196145 178746 166611
7708 166611 163565 161513 171545 158022 172216 184603 163428 171068 178661 187570 190628 188628 179420
7695 179420 167698 191988 199652 199428 198371 184152 186738 196116 183606 187481 198895 209827 194220
7682 194220 178075 183963 174162 188662 201044 201658 176590 165286 167909 164786 171846 160125 145651
$$ packed form
7771I71246n7330l6829m6548q5029o1279o423l9664k9921p909j2531l9936m4182
7759E03665j3964j4606k2670j7800j5781j8353N304J0979r793j0349R07j2401
7747C85138k0244r129N630O292q40k5959P362l476j4377k1379j1222J3426j5987
7734B95235j1738M983j834J436q562j0346n863R329N986o411j4597K115k0318
7721B39415o523J3733j2459j9820O828k764j6647Q135m015r446k92j7399j2135
7708A66611l046k052J0032j3523J4194J2387k1175P640P593Q909L058k000r208
7695A79420j1722K4290P664k24j057j4219K586R378j2510L875J1414J0932j5607
7682A94220j6145N888r801J4500J2382O14k5068j1304K623l123P060j1721j4474
$$ plain form
7669 145651 153365 171951 183385 167400 170865 174224 174886 176441 185973 192560 180548 158273 174125
7656 174125 149355 139892 163689 163889 166899 153214 126668 139190 132287 98673 96144 126767 161742
7643 161742 169449 151359 139335 129397 111739 132711 121798 132057 133172 139172 143284 130587 161366
7630 161366 131257 100705 105700 99345 107805 92684 85270 123443 103885 74007 81988 93855 102361
7617 102361 138818 148741 139385 116445 108163 104276 138774 142750 126601 154676 169529 147232 118679
7604 118679 107637 110532 120081 118004 95582 98468 98567 96772 90353 99483 110390 119427 123439 116281
7590 116281 136655 132507 97827 104748 111548 97628 109117 109421 81855 77047 85019 77424 86884
7577 86884 86884 96831 128229 130233 125111 111778 109575 108177 113472 113876 91486 74634 72526 91922
$$ packed form
7669A45651P714J8586J1434j5985L465L359O62J555R532O587j2012k2275J5852
7656A74125k4770r463K3797K00L010j3685k6546J2522o903l3614k529L0623L4975
7643A61742P707j8090j2024r938j7658K0972j0913J0259J115O000M112j2697L0779
7630A61366l0109l0552M995o355Q460j5121p414L8173j9558k9878P981J1867Q506
7617A02361L6457R923r356k2940q282l887L4498L976j6149K8075J4853k2297k8553
7604A18679j1042K895R549k077k2422K886R9j795o419R130J0907R037M012p158
7590A16281K0374m148l4680O921O800j3920J1489L04k7566m808P972p595R460
7577H6884%R947L1398K004n122j3333k203j398N295M04k2390j6852k108J9396
$$ plain form
7563 91922 99367 106047 106083 124795 129467 123422 122533 96783 62237 49400 84805 130609 135077 120056
7549 120056 112608 105801 72583 56499 88570 103994 88169 91754 96997 120990 108398 97520
7537 97520 81939 71804 63647 70151 113372 115971 96059 83856 76601 74485 78703 83040 102005
7524 102005 92343 83126 85029 78260 95758 92552 37758 29774 24083 44611 59066 42222 39615
7511 39615 74116 78437 55475 65331 85466 82890 79460 91126 95809 89941 99913 88522 62672
7498 62672 36566 22007 30387 43938 84136 78209 67554 66708 69484 72492 62013 68882 74453
7485 74453 55725 58644 44280 20491 40934 59931 63160 59732 86224 102997 93460 81778 70266
7472 70266 70445 42206 35404 42789 65817 43241 54687 61734 48054 38619 54583 72631 79126
$$ packed form
7563I1922P445O680L6J8712M672o045q89k5750l4546j2837L5405M5804M468j5021
7549A20056p448o807l3218j6084L2071J5424j5825L585N243K3993j2592j0878
7537I7520j5581j0135q157O504M3221K599j9912j2203p255k116M218M337J8965
7524A02005r662r217J903o769J7498l206n4794p984n691K0528J4455j6844k607
7511C9615L4501M321k2962R856K0135k576l430J1666M683n868R972j1391k5850
7498F2672k6106j4559Q380J3551M0198n927j0655q46K776L008j0479O869N571
7485G4453j8728K919j4364k3789K0443J8997L229l428K6492J6773r537j1682j1512
7472G0266J79k8239o802P385K3028k2576J1446P047j3680r435J5964J8048O495
$$ plain form
7459 79126 74898 98919 110328 89617 100242 92217 75367 70952 72093 83080 90679 77777 69234
7446 69234 87818 85374 74179 53599 50616 65927 84422 81405 80129 73518 75549 77134 87738
7433 87738 104525 107712 120077 117524 101536 69057 58446 70155 81243 71984 52940 65654
7421 65654 72198 72025 44840 52872 64990 53437 44480 32565 49270 81060 85657 74358 71090
7408 71090 73142 55801 55981 47909 37337 58445 50521 38139 49268 71441 89115 88148 86846
7395 86846 90737 73661 43802 57021 77524 92640 81771 63818 47475 19675 32844 51235
7383 51235 67744 64814 34409 25170 31793 36972 54327 67032 84518 87128 75634 52665 37785
7370 37785 62745 59676 78461 100869 107212 68817 50686 52699 40956 43997 75019 76039 49755
$$ packed form
7459G9126m228K4021J1409k0711J0625q025j6850m415J141J0987P599j2902q543
7446F9234J8584k444j1195k0580k983J5311J8495l017j276o611K031J585J0604
7433H7738J6787L187J2365k553j5988l2479j0611J1709J1088r259j9044J2714
7421F5654O544j73k7185Q032J2118j1553q957j1915J6705L1790M597j1299l268
7408G1090K052j7341J80q072j0572K1108p924j2382J1129K2173J7674r67j302
7395H6846L891j7076k9859J3219K0503J5116j0869j7953j6343k7800J3169J8391
7383E1235J6509k930l0405r239O623N179J7355J2705J7486K610j1494k2969j4880
7370C7785K4960l069J8785K2408O343l8395j8131K013j1743L041L1022J020k6284
$$ plain form
7357 49755 68679 84211 66191 45733 68983 82305 73070 51164 39248 47144 56575 46262
7345 46262 36886 54219 51731 48295 58727 66272 62911 40001 53942 93448 86607 78481 75185
7332 75185 60765 40284 40228 71751 71058 52405 52267 68568 71975 47033 54724 54505 45686 53918
7318 53918 47960 56863 75426 60326 66606 61558 42948 37826 40920 67852 69090 58838 34173
7305 34173 24392 44023 87110 73345 56676 65328 88124 92671 49895 4849 5856 32943 59252
7292 59252 78568 87651 87408 62416 51089 63265 58892 71588 76610 106293 108397 76082 106286
7279 106286 94089 48900 34433 21190 22716 308 14660 33796 32752 30518 39278 62951
7267 62951 62455 44891 49089 59693 48017 29826 23020 3394 -955 2874 24042 46063 32514
$$ packed form
7357D9755J8924J5532j8020k0458K3250J3322r235k1906j1916P896R431j0313
7345D6262r376J7333k488l436J0432P545l361k2910J3941L9506o841q126l296
7332G5185j4420k0481n6L1523o93j8653j38J6301L407k4942P691k19q819Q232
7318E3918n958Q903J8563j5100O280n048j8610n122L094K6932J238j0252k4665
7305C4173r781J9631M3087j3765j6669Q652K2796M547m2776m5046J007K7087K6309
7292E9252J9316R083k43k4992j1327J2176m373J2696N022K9683K104l2315L0204
7279A06286j2197m5189j4467j3243J526k2408J4352J9136j044k234Q760K3673
7267F2951m96j7564M198J0604j1676j8191o806j9626m349L829K1168K2021j3549
$$ plain form
7254 32514 39629 50269 52885 43287 41141 54771 54382 57495 42709 15931 10724 38169 46416 66698
7240 66698 69854 30711 -106 -2028 -6732 32213 48114 47564 42482 35490 40574 59485 43493
7227 43493 31441 33910 43276 49736 48576 47600 49255 46564 50262 42561 41079 59969 62122 42329
7213 42329 46835 67838 50973 58171 68892 77288 35973 20334 14332 23331 48436 74965 65160
7200 65160 39197 45488 60790 35126 53411 57347 40968 32871 24874 54672 66248 59465 54477
7187 54477 74030 83808 82887 64289 58380 45058 56933 73783 53981 43326 36396 32681 57890
7174 57890 73450 47924 36639 18953 19984 8790 23148 22437 11797 24947 25207 5146 -14769
7161 -14769 9643 9818 -5791 -24658 -11581 -6212 -23976 -26891 -28454 -21229 -26393 -1725 -11764
$$ packed form
7254C2514P115J0640K616r598k146J3630l89L113j4786k6778n207K7445Q247K0282
7240F6698L156l9143l0817j922m704L8945J5901n50n082o992N084J8911j5992
7227D3493j2052K469R366O460j160r76J655k691L698p701j482J8890K153j9793
7213D2329M506K1003j6865P198J0721Q396m1315j5639o002Q999K5105K6529r805
7200F5160k5963O291J5302k5664J8285L936j6379q097p997K9798J1576o783m988
7187E4477J9553R778r21j8598n909j3322J1875J6850j9802j0655o930l715K5209
7174E7890J5560k5526j1285j7686J031j1194J4358p11j0640J3150K60k0061j9915
7161a4769K4412J75j5609j8867J3077N369j7764k915j563P225n164K4668j0039
$$ plain form
7148 -11764 -15696 -20800 -14376 25549 35017 7868 -5575 31288 41594 6549 -8557 -30056 -22326
7135 -22326 -10994 -3666 -11227 13811 -2922 859 24724 2208 -13028 1834 24829 22803 26591
7122 26591 18525 16562 7493 -5958 184 6570 -20931 -37108 -22461 -2797 -9096 -2552 12681
7109 12681 11571 11717 20786 27442 -578 4590 -5033 2610 10240 3611 5653 44683 35049 54035
7095 54035 56035 32785 348 -994 23806 41172 74287 70599 43523 39508 45804 20265 -986
7082 -986 -11111 -541 8540 4112 -5672 -14940 -8530 3257 30835 30537 36413 37660 22361 16939
7068 16939 18318 18583 21819 46837 56991 52747 56513 52504 39833 28664 1880 -5074 10219
7055 10219 18860 29303 45512 41653 49461 45934 50209 62583 38762 31815 59106 67273 40899
$$ packed form
7148a1764l932n104O424L9925R468k7149j3443L6863J0306l5045j5106k1499P730
7135b2326J1332P328p561K5038j6733L781K3865k2516j5236J4862K2995k026L788
7122B6591q066j963r069j3451O142O386k7501j6177J4647J9664o299O544J5233
7109A2681j110J46R069O656k8020N168r623P643P630o629K042L9030r634J8986
7095E4035K000k3250l2437j342K4800J7366L3115l688k7076m015O296k5539k1251
7082i86j0125J0570R081m428r784r268O410J1787K7578k98N876J247j5299n422
7068A6939J379K65L236K5018J0154m244L766m009j2671j1169k6784o954J5293
7055A0219Q641J0443J6209l859P808l527M275J2374k3821o947K7291Q167k6374
$$ plain form
7042 40899 5911 6090 31860 42289 57074 48158 31069 30088 44275 80108 75114 66956 43228
7029 43228 29199 34294 24570 26003 52407 61924 38056 7904 -23216 2906 17058 -8552 -1191
7016 -1191 29274 24375 16065 -29 -5555 -11686 -3615 19543 27679 22217 19642 20215 11656 11270 10991
7001 10991 18606 9096 -13253 -23129 -16609 -18928 -8449 8858 29247 52034 58137 80846 86815
6988 86815 53775 33331 20280 20245 45746 60842 45501 34097 40905 23811 -1661 -4373 21208
6975 21208 36539 35718 29430 22816 27739 36321 62459 80103 51628 51649 48667 45914 54953 53072
6961 53072 38634 38516 42122 52616 41666 5936 14209 18865 22389 31801 39796 20404 4257
6948 4257 -4446 -11178 -8049 -3006 -73 -14854 -3716 9181 -643 -2514 6318 11130 26151 22940
$$ packed form
7042D0899l4988J79K5770J0429J4785q916j7089r81J4187L5833m994q158k3728
7029D3228j4029N095r724J433K6404R517k3868l0152l1120K6122J4152k5610P361
7016a191L0465m899q310j6094n526o131Q071K3158Q136n462k575N73q559l86k79
7001A0991P615r510k2349r876O520k319J0479J7307K0389K2787O103K2709N969
6988H6815l3040k0444j3051l5K5501J5096j5341j1404O808j7094k5472k712K5581
6975B1208J5331q21o288o614M923Q582K6138J7644k8475K1k982k753R039j881
6961E3072j4438j18L606J0494j0950l5730Q273M656L524R412P995j9392j6147
6948D257q703o732L129N043K933j4781J1138J2897r824j871Q832M812J5021l211
$$ plain form
6934 22940 10672 21155 35480 19825 5366 19622 12467 -1927 -382 3560 -14929 3695
6922 3695 17950 43806 43159 37014 15250 2699 5186 -20205 -15926 5709 11196 2465 5640 50077
6908 50077 35367 -7997 -54349 -60726 -39104 -14944 -21680 -40862 -29619 -5040 16703 -10374
6896 -10374 -35179 -39865 -33771 -35185 -41890 -20944 -23037 -12469 6378 -22672 -34349 -40055 -32823
6883 -32823 -17397 5667 -9740 -1828 -15503 -44022 -60191 -45518 -21793 -4442 3948 17069
6871 17069 3861 13226 16682 14447 20072 20995 19464 26403 22264 -20037 -12878 -13244 4126 13801
6857 13801 -6827 -11979 -10682 4995 46321 54487 53226 46752 29441 -11500 -23670 -14346 -2661
6844 -2661 15985 43030 22660 7099 -3021 10394 27108 27328 21964 25093 33417 18140 11650
$$ packed form
6934B2940j2268J0483J4325j5655j4459J4256p155j4394J545L942j8489J8624
6922C695J4255K5856o47o145k1764j2551K487k5391M279K1635N487q731L175M4437
6908E0077j4710m3364m6352o377K1622K4160o736j9182J1243K4579K1743k7077
6896a0374k4805m686O094j414o705K0946k093J0568J8847k9050j1677n706P232
6883c2823J5426K3064j5407P912j3675k8519j6169J4673K3725J7351Q390J3121
6871A7069j3208R365L456k235N625R23j531O939m139m2301P159l66J7370R675
6857A3801k0628n152J297J5677M1326Q166j261o474j7311m0941j2170R324J1685
6844b661J8646K7045k0370j5561j0120J3415J6714K20n364L129Q324j5277o490
$$ plain form
6831 11650 7532 21813 20416 19606 466 -8998 9938 21734 35894 32574 24500 28713 16653
6818 16653 20079 41956 44304 17687 -6079 -9305 8565 27724 45463 34826 33097 49873 59785
6805 59785 62214 47706 21255 22418 17479 -11034 10472 16590 56 1265 26885 45513 50162
6792 50162 34779 23821 7499 -12624 -5671 -18162 -24420 21106 23339 22751 49809 33131 17626
6779 17626 10096 -11578 12901 36832 40124 59739 69658 43826 39128 64117 88912 94404 72449
6766 72449 55353 33832 17983 3921 9309 32797 49844 41763 22682 35338 28861 -26306
6754 -26306 -33215 -19532 13943 19352 7356 11917 19193 30546 30608 42090 29757 11775 -2178
6741 -2178 -7016 -5958 7132 10639 10136 1087 -31631 -23768 -18405 -37094 -22178 36698 77452 63097
$$ packed form
6831A1650m118J4281j397q10j9140r464J8936J1796J4160l320q074M213j2060
6818A6653L426K1877K348k6617k3766l226J7870J9159J7739j0637j729J6776R912
6805E9785K429j4508k6451J163m939k8513K1506O118j6534J209K5620J8628M649
6792E0162j5383j0958j6322k0123O953j2491o258M5526K233n88K7058j6678j5505
6779A7626p530k1674K4479K3931L292J9615R919k5832m698K4989K4795N492k1955
6766G2449j7096k1521j5849j4062N388K3488J7047q081j9081J2656o477n5167
6754b6306o909J3683L3475N409j1996M561P276J1353O2J1482j2333j7982j3953
6741b178m838J058J3090L507n03r049l2718P863N363j8689J4916N8876M0754j4355
$$ plain form
6727 63097 72195 43467 24329 36576 20564 -8291 -18270 -16307 1699 9369 22733 56158 58831
6714 58831 41277 35134 19214 10834 21556 33110 37137 37695 36898 19739 17720 50934 71131
6701 71131 53035 33447 -2552 -17699 -17191 -34613 -31261 -5769 -3145 -18688 -3184 26471 49544
6688 49544 42149 26408 30563 13117 3334 19435 24638 11346 13387 12076 2326 14953 -4509
6675 -4509 -17700 3782 -4729 -6607 -2014 -26569 -40666 -24572 -9711 -8411 142 19043 20601
6662 20601 18448 8009 12332 11272 11889 -200 -23394 4710 -2005 -23472 -26031 -12933 -10553
6649 -10553 -5979 -12404 9849 36360 36054 21705 8942 5543 3714 -7563 -21155 1167 22264
6636 22264 5707 8680 -5660 -29164 -18448 6978 17437 2183 -12169 -20253 -16199 4409
$$ packed form
6727F3097R098k8728j9138J2247j6012k8855r979J963J8006P670J3364L3425K673
6714E8831j7554o143j5920q380J0722J1554M027N58p97j7159k019L3214K0197
6701G1131j8096j9588l5999j5147N08j7422L352K5492K624j5543J5504K9655K3073
6688D9544p395j5741M155j7446r783J6101N203j3292K041j311r750J2627j9462
6675d509j3191K1482q511j878M593k4555j4097J6094J4861J300Q553J8901J558
6662B0601k153j0439M323j060O17j2089k3194K8104o715k1467k559J3098K380
6649a0553M574o425K2253K6511l06j4349j2763l399j829j1277j3592K2322K1097
6636B2264j6557K973j4340k3504J0716K5426J0459j5254j4352q084M054K0608
$$ plain form
6624 4409 23496 16278 16498 37717 31124 14311 3396 -10552 -25344 -17623 3069 25384 37905
6611 37905 11999 4501 19644 5532 -8281 20939 44494 36991 28503 13653 -11418 -31400
6599 -31400 -53644 -34766 -23843 -15604 -20121 -17888 -34023 -28107 4447 13842 -3614 -44323 -51898
6586 -51898 -24784 -19845 -6255 -11598 -17425 -23532 -16683 -36995 -42588 -28046 -10296 -20612 -33294
6573 -33294 -24485 -741 25827 37735 35274 13443 -2181 -23405 -39343 -39355 -29633 -23210 -41584
6560 -41584 -64216 -46886 -17253 -4232 11409 1303 -5481 -344 -16778 -38674 -37006 -40487 -29642
6547 -29642 -34577 -23032 -1674 -144 16062 13170 9661 23819 27468 -95 -10658 2618 18191
6534 18191 4424 -13883 -8830 9899 10257 -2022 238 11146 27753 35961 14763 4146 27591
$$ packed form
6624D409J9087p218K20K1219o593j6813j0915j3948j4792P721K0692K2315J2521
6611C7905k5906p498J5143j4112j3813K9220K3555p503q488j4850k5071j9982
6599c1400k2244J8878J0923Q239m517K233j6135N916L2554R395j7456m0709p575
6586e1898K7114M939J3590n343n827o107O849k0312n593J4542J7750j0316j2682
6573c3294Q809K3744K6568J1908k461k1831j5624k1224j5938j2R722O423j8374
6560d1584k2632J7330K9633J3021J5641j0106o784N137j6434k1896J668l481J0845
6547b9642m935J1545K1358J530J6206k892l509J4158L649k7563j0563J3276J5573
6534A8191j3767j8307N053J8729L58j2279K260J0908J6607Q208k1198j0617K3445
$$ plain form
6521 27591 53956 44102 10910 -4861 -20830 -7579 -11745 -27815 -35331 -31892 -8224 -13890 6679
6508 6679 3014 -15559 -21151 -20078 -6023 -1511 -5798 -22479 -2468 16658 31059 52990 51589
6495 51589 50591 41559 14716 -16576 -25075 -12955 -5753 10662 -14696 -26126 -16746 -4103 -7246
6482 -7246 -7123 1478 -8365 -11529 -22426 -27473 -5981 -6684 -114 -14252 -34666 -42826 -9210 -15657
6468 -15657 -37545 -74033 -69557 -42812 -36697 -23530 -4204 480 7027 19305 44351 35002 23641
6455 23641 11068 -6347 1826 -10693 -9578 14560 15680 7452 -1233 -7268 17681 480 -3279
6442 -3279 -10815 -10934 -15152 -12888 -18207 -35339 -38597 -60446 -58729 -26227 923 20485 -4204 9236
6428 9236 28260 8182 -22700 -35222 -28553 -32632 -48278 -49377 -53276 -29650 2543 26827 35390
$$ packed form
6521B7591K6365r854l3192j5771j5969J3251m166j6070p516L439K3668n666K0569
6508F679l665j8573n592J073J4055M512m287j6681K0011J9126J4401K1931j401
6495E1589r98r032k6843l1292q499J2120P202J6415k5358j1430R380J2643l143
6482g246J23Q601r843l164j0897n047K1492p03O570j4138k0414q160L3616o447
6468a5657k1888l6488M476K6745O115J3167J9326M684O547J2278K5046r349j1361
6455B3641j2573j7415Q173j2519J115K4138J120q228q685o035K4949j7201l759
6442c279p536j19m218K264n319j7132l258k1849J717L2502K7150J9562k4689J3440
6428I236J9024k0078l0882j2522O669m079j5646j099l899K3626L2193K4284Q563
$$ plain form
6415 35390 23791 13948 -3411 -17257 -32674 -38648 -32119 -2629 -229 334 -23440 -20513 0
6402 0 9229 12020 9953 3563 7007 15488 4660 22636 26181 7319 10275 17187 57298 64917 27682
6387 27682 40043 44755 -95 -30103 -22348 33641 22265 -447 -3009 26711 23173 15184 33085
6374 33085 32479 9150 1188 -15860 -14870 -14459 -5551 6882 3124 -31865 -46179 -20706 8540 45226
6360 45226 57875 19674 24811 27511 20039 30056 4701 -21827 -26547 -21904 -22919 -37950 -14473
6347 -14473 -5885 6286 5982 8512 -8933 -18833 -31490 -19867 -881 7308 1601 12955 1296
6334 1296 8407 17813 -6409 -12738 1277 10480 5110 2028 -32617 -32180 -9164 15542 14632 5065
6320 5065 -2409 -1770 -1647 -14575 -27864 -47040 -49134 -23429 -23673 -47345 -31369 -906 20136 32259
$$ packed form
6415C5390j1599r843j7359j3846j5417n974O529K9490K400N63k3774K927K0513
6402@R229K791k067o390L444Q481j0828J7976L545j8862K956O912M0111P619l7235
6387B7682J2361M712m4850l0008P755N5989j1376k2712k562K9720l538p989J7901
6374C3085o06k3329p962j7048R90M11Q908J2433l758l4989j4314K5473K9246L6686
6360D5226J2649l8201N137K700p472J0017k5355k6528m720M643j015j5031K3477
6347a4473Q588J2171l04K530j7445r900j2657J1623J8986Q189n707J1354j1659
6334A296P111R406k4222o329J4015R203n370l082l4645M37K3016K4706r10r567
6320E065p474O39J23j2928j3289j9176k094K5705k44k3672J5976L0463K1042J2123
$$ plain form
6306 32259 46319 -2958 -21377 -19049 -8181 -13452 -9044 -11316 -13000 -42542 -45254 -19410 -13169
6293 -13169 -20919 -12840 3093 -12066 -9017 1557 935 -13841 -16959 -17289 4975 14784 14415 -3321
6279 -3321 -3389 6252 21511 27283 43888 14905 -15248 -7973 3735 -351 -6682 -1821 3128 -10602
6265 -10602 -36272 -31649 -36048 -31969 -4484 -15254 -6424 1895 10575 -10757 -40921 -60235 -62271
6252 -62271 -46270 -6159 28286 3067 -23140 -2677 -2695 -15009 -25864 -10017 5331 10387 25628
6239 25628 34220 23035 15125 5873 8719 10724 19673 33236 49362 59103 47893 27966 10202
6226 10202 -12283 -32057 -21155 -10277 -25948 -12659 2519 -1051 -115 3364 -2832 -26228 -34193
6213 -34193 -36262 -27361 -19095 -1625 -1637 12160 14347 -31992 -46329 -32407 -19362 -7596 -8918
$$ packed form
6306C2259J4060m9277j8419K328J0868n271M408k272j684k9542k712K5844O241
6293a3169p750Q079J5933j5159L049J0574o22j4776l118l30K2264R809l69j7736
6279c321o8R641J5259N772J6605k8983l0153P275J1708m086o331M861M949j3730
6265a0602k5670M623m399M079K7485j0770Q830Q319Q680k1332l0164j9314k036
6252f2271J6001M0111L4445k5219k6207K0463j8j2314j0855J5847J5348N056J5241
6239B5628Q592j1185p910r252K846K005Q949J3563J6126R741j1210j9927j7764
6226A0202k2485j9774J0902J0878j5671J3289J5178l570R36L479o196k3396p965
6213c4193k069Q901Q266J7470j2J3797K187m6339j4337J3922J3045J1766j322
$$ plain form
6200 -8918 8795 18046 -27957 -63573 -26471 7678 12088 15350 14326 2751 -8134 -2233 548
6187 548 -23854 -13704 -3988 20353 -5713 -20674 -2965 -30402 -24934 15304 23369 7202 15362
6174 15362 9451 3422 1293 -14884 -2593 25893 25138 -9085 -18241 3317 -2408 -8220 -15023 -18129
6160 -18129 -20501 -20374 -24477 -37145 -25491 2465 29033 3536 -3141 -22791 -54751 -60302 -18050
6147 -18050 15807 15115 28644 34280 27972 16039 -6890 10850 20039 18311 11448 19413 13927 6765
6133 6765 6275 23261 43437 33227 31611 8289 -40316 -48553 -39435 -2646 -13076 -19643 -19431 -12033
6119 -12033 -14543 6888 -20261 -15929 2585 30490 32711 14525 16912 18377 21463 21361 24433 35215
6105 35215 35598 1136 -14032 -27157 -40277 -36895 -20035 3665 5234 -8879 -8796 -12117 -35555
$$ packed form
6200h918J7713R251m6003l5616L7102L4149M410L262j024j1575j0885N901K781
6187E48k4402J0150R716K4341k6066j4961J7709k7437N468M0238Q065j6167Q160
6174A5362n911o029k129j6177J2291K8486p55l4223r156K1558n725n812o803l106
6160a8129k372J27m103j2668J1654K7956K6568k5497o677j9650l1960n551M2252
6147a8050L3857o92J3529N636o308j1933k2929J7740R189j728o863P965n486p162
6133F765m90J6986K0176j0210j616k3322m8605q237R118L6789j0430o567K12P398
6119a2033k510K1431k7149M332J8514K7905K221j8186K387J465L086j02L072J0782
6105C5215L83l4462j5168j3125j3120L382J6860K3700J569j4113Q3l321k3438
$$ plain form
6092 -35555 -44315 -54651 -52841 -33360 -8248 -1272 7085 2860 -23505 -31846 5187 11905 7218
6079 7218 -6049 5805 15898 -5919 -8986 3283 -7621 -7824 -22381 -25056 3861 24858 43025
6066 43025 53292 35585 33049 40339 39316 8563 -49888 -38296 -14729 -2669 9929 1173 -3937
6053 -3937 -5946 -17103 19001 15369 -22421 -27851 -8514 8387 7161 -11503 -17075 -24150 -18442
6040 -18442 -14400 -29108 -13740 -16504 -27122 -5756 16008 -1021 481 2414 2149 14613 37996
6027 37996 30959 5459 -3862 -21680 -9871 7615 30968 39119 31965 14206 19450 31374 13183
6014 13183 -9049 -15287 -21827 -21424 -13293 10523 26191 11140 -15533 2328 -13389 -8615 -981
6001 -981 -1492 15028 23002 15627 22680 19707 -3590 -17760 -53952 -54905 -22768 7417 20672 16590
$$ packed form
6092c5555q760j0336J810J9481K5112O976Q357m225k6365q341L7033O718m687
6079G218j3267J1854J0093k1817l067J2269j0904k03j4557k675K8917K0997J8167
6066D3025J0267j7707k536P290j023l0753n8451J1592K3567J2060J2598q756n110
6053c937k009j1157L6104l632l7790n430J9337J6901j226j8664n572p075N708
6040a8442M042j4708J5368k764j0618K1366K1764j7029J502J933k65J2464K3383
6027C7996p037k5500r321j7818J1809J7486K3353Q151p154j7759N244J1924j8191
6014A3183k2232o238o540M03Q131K3816J5668j5051k6673J7861j5717M774P634
6001i81n11J6520P974p375P053k973k3297j4170l6192r53L2137L0185J3255m082
$$ plain form
5987 16590 1858 -13360 -1347 17441 20851 27906 31892 19261 22009 7235 -23258 -17172 -5963
5974 -5963 18713 26958 16339 6032 1348 5501 -5141 -3764 6404 -4456 -32254 -20066 -8624
5961 -8624 -31476 -42661 -27060 -14638 -27872 -42090 -48037 -68610 -47605 -15806 -29885 -32283
5949 -32283 2944 8497 413 -11334 -1289 5600 8955 -3180 -21280 -20623 -7370 3876 -14036
5936 -14036 -16750 -23444 -42304 -25133 -20075 -27850 -37408 -13713 -16772 -19132 -11829 -11205 -21349 -3063
5922 -3063 -12804 -27163 -3686 17156 660 25988 30861 6751 -10197 -6575 -2886 -13587 -15193
5909 -15193 -1831 -2393 13548 3245 8691 1332 12879 20251 13925 30370 29105 16128 3814
5896 3814 5754 1903 -9368 -14819 -9077 -15272 -6406 7470 2930 -23891 -24992 -16352 -2290 -20087
$$ packed form
5987A6590j4732j5218J2013J8788L410P055L986j2631K748j4774l0493O086J1209
5974e963K4676Q245j0619j0307m684M153j0642J377J0168j0860k7798J2188J1442
5961h624k2852j1185J5601J2422j3234j4218n947k0573K1005L1799j4079k398
5949c2283L5227N553q084j1747J0045O889L355j2135j8100O57J3253J1246j7912
5936a4036k714o694j8860J7171N058p775r558K3695l059k360P303O24j0144J8286
5922c063r741j4359K3477K0842j6496K5328M873k4110j6948L622L689j0701j606
5909a5193J3362n62J5941j0303N446p359J1547P372o326J6445j265j2977j2314
5896C814J940l851j1271n451N742o195Q866J3876m540k6821j101Q640J4062j7797
$$ plain form
5882 -20087 -25956 -20587 -54513 -48592 -42395 -50703 -52533 -45705 -24926 -8944 4839 18458 -9338
5869 -9338 6320 17780 25531 28896 17904 -558 4027 15169 10350 -17612 -2687 29058 37471
5856 37471 24546 25108 23253 7279 -7393 -39213 -64881 -44186 -21085 -21605 5734 7535 2197
5843 2197 -7482 -16949 -16808 2994 2010 8940 -11759 -26675 -19906 -12358 -10346 10445 20894 -1167
5829 -1167 3389 478 -13893 -8686 10640 28565 32341 24883 26588 27557 35698 19223 7357 3169
5815 3169 -15121 -36855 -3722 -6721 -20743 -10894 -33726 -20570 -8869 -9509 -27322 -21084 -9179
5802 -9179 1040 -13995 -41971 -32788 -16228 -24292 -31204 -15693 -14161 5751 2383 -24955 -37802
5789 -37802 -38603 -38582 -44135 -34024 -8146 -3451 3156 11783 -260 -1349 24353 28025 17775 48973
$$ packed form
5882b0087n869N369l3926N921O197q308j830O828K0779J5982J3783J3619k7796
5869i338J5658J1460P751L365j0992j8462M585J1142m819k7962J4925L1745Q413
5856C7471j2925N62j855j5974j4672l1820k5668K0695K3101n20K7339J801n338
5843B197r679r467J41J9802r84O930k0699j4916O769P548K012K0791J0449k2061
5829a167M556k911j4371N207J9326J7925L776p458J705R69Q141j6475j1866m188
5815C169j8290k1734L3133k999j4022R849k2832J3156J1701o40j7813O238J1905
5802i179J0219j5035k7976R183J6560q064o912J5511J532J9912l368k7338j2847
5789c7802q01K1n553J0111K5878M695O607Q627j2043j089K5702L672j0250L1198
$$ plain form
5775 48973 36150 29659 6740 -10378 -23710 -49936 -41340 -12356 3159 -13045 -12167 -22377 -32908
5762 -32908 -24946 -17720 -9125 7498 27133 38181 36124 32248 23359 35493 31115 6304 -1441
5749 -1441 -7182 1962 11071 2889 -12853 -3237 -16083 -35182 8901 15072 1146 -15995 -10947
5736 -10947 7776 20484 34064 4891 -12058 -17254 -13906 13771 9882 13285 19031 -8409 -30348
5723 -30348 -15115 502 6941 8689 18086 24696 10858 176 2578 -13182 -34372 -24569 -22107
5710 -22107 -19003 -21709 21239 20065 4944 -12140 -34971 -28827 -35194 -26425 -29260 -21450 -13801 -30795
5696 -30795 -37800 -14742 15367 6881 -3308 4050 -7335 -18602 -18987 -26374 -24350 -19954 -41285
5683 -41285 -36627 -40995 -58941 -36524 -41144 -9542 9125 -168 -31648 -23233 -13439 769 -8927
$$ packed form
5775D8973j2823o491k2919j7118j3332k6226Q596K8984J5515j6204Q78j0210j0531
5762c2908P962P226Q595J6623J9635J1048k057l876q889J2134m378k4811p745
5749a441n741R144R109q182j5742R616j2846j9099M4083O171j3926j7141N048
5736a0947J8723J2708J3580k9173j6949n196L348K7677l889L403N746k7440k1939
5723c0348J5233J5617O439J748R397O610j3838j0682K402j5760k1190R803K462
5710b2107L104k706M2948j174j5121j7084k2831O144o367Q769k835P810P649j6994
5696c0795p005K3058L0109q486j0189P358j1385j1267l85p387K024M396k1331
5683d1285M658m368j7946K2417m620L1602J8667r293l1480Q415R794J4208r696
$$ plain form
5670 -8927 -7828 5175 26969 12430 13898 21500 -1720 -19866 -23325 -39603 -45023 -32052 -16783
5657 -16783 -17449 -27912 -14648 -7975 -16190 -29611 -45894 -48163 -52998 -40427 -18003 -31644 -14555
5644 -14555 -4486 -31259 -54243 -66292 -51404 -42005 -59629 -48849 -52427 -49750 -27361 -52798
5632 -52798 -24160 -1965 -313 -26476 -39661 -34037 -24916 13254 32288 21681 -14986 -5797 -1562
5619 -1562 -3743 -11180 -14754 -16308 -16095 -8077 -1311 4041 11468 6251 13119 9948 -10593 -19888 -15849
5604 -15849 -25728 -41950 -37398 -21042 -6902 14849 9092 -10569 -8446 -29384 -17983 19378 6329
5591 6329 -21297 -40166 -13731 4183 24823 31367 4416 -2630 11987 5321 -16060 -282 16770
5578 16770 11186 -6493 -3332 -16518 -28673 -27592 -30097 -37133 -27216 -17515 -12075 -4575 -8098 2547
$$ packed form
5670h927J099J3003K1794j4539J468P602k3220j8146l459j6278n420J2971J5269
5657a6783o66j0463J3264O673q215j3421j6283k269m835J2571K2424j3641J7089
5644a4555J0069k6773k2984j2049J4888R399j7624J0780l578K677K2389k5437
5632e2798K8638K2195J652k6163j3185N624R121L8170J9034j0607l6667R189M235
5619a562k181p437l574j554K13Q018O766N352P427n217O868l171k0541r295M039
5604a5849r879j6222M552J6356J4140K1751n757j9661K123k0938J1401L7361j3049
5591F329k7626j8869K6435J7914K0640O544k6951p046J4617o666k1381J5778J7052
5578A6770n584j7679L161j3186j2155J081k505p036R917R701N440P500l523J0645
$$ plain form
5564 2547 11747 8214 -3787 -101 10429 10783 20244 13232 1191 -24691 -29038 -36057 -16906 -16384
5550 -16384 -11112 -33567 -53672 -24415 -22653 -26361 -7864 15831 19808 31063 16219 15300 21524
5537 21524 18512 5372 -7296 889 -5833 9727 -4656 -13449 -19640 -26796 -16777 -9113 -3578
5524 -3578 13898 25175 44293 39599 13747 -21840 -38988 -44594 -31186 -18085 -2479 -6897 -17792
5511 -17792 -5441 -20528 -15716 -21167 -32932 -46170 -42102 -31100 -24793 -22119 -16090 -28228 -40520
5498 -40520 -38648 -37331 -44562 -20980 -900 34204 35368 10641 10732 1657 -12157 -24014 -9082
5485 -9082 8618 -2334 -7833 -9823 -29403 -36942 -27378 -25323 -27334 -28599 -12765 13825 22921 7001
5471 7001 -10126 17584 12617 13546 21165 4641 1895 13896 20749 19974 1755 -5101 7042 -9561
$$ packed form
5564B547R200l533j2001L686J0530L54R461p012j2041k5882m347p019J9151N22
5550a6384N272k2455k0105K9257J762l708J8497K3695L977J1255j4844r19O224
5537B1524l012j3140j2668Q185o722J5560j4383q793o191p156J0019P664N535
5524c578J7476J1277J9118m694k5852l5587j7148n606J3408J3101J5606m418j0895
5511a7792J2351j5087M812n451j1765j3238M068J1002O307K674O029j2138j2292
5498d0520J872J317p231K3582K0080L5104J164k4727R1r075j3814j1857J4932
5485i082J7700j0952n499j990j9580p539R564K055k011j265J5834K6590R096j5920
5471G001j7127K7710m967R29P619j6524k746J2001O853p75j8219o856J2143j6603
$$ plain form
5457 -9561 -32453 6714 29068 41952 27101 -13216 -17561 -5514 -8795 -12052 -29074 -18398 -19519
5444 -19519 -16572 -20849 738 24118 3095 -14589 -28546 -43736 -42381 -34807 -35941 -31664 -14927
5431 -14927 -22389 -41198 -18922 9581 -2554 -48599 -35244 -21148 617 7577 -15130 -41690
5419 -41690 -51750 -31794 -16460 -15758 -22157 -8482 -3249 32406 30536 15898 4034 -5110 -22000
5406 -22000 -19075 592 17343 39397 35087 2260 -12122 5544 42413 44123 31299 15961
5394 15961 -14655 -19193 -17660 7213 -7863 -31176 -17560 -7726 -24010 -29777 -22806 -22027 -2946
5381 -2946 -6698 -24610 -33742 -29173 -32553 -8985 -4775 -3199 -20543 -35989 -35551 -26738 -21271 -27339
5367 -27339 9292 51256 39708 4378 259 -9487 -23940 -17082 -17164 -39164 -16196 -27353 -37060
$$ packed form
5457i561k2892L9167K2354J2884j4851m0317m345J2047l281l257j7022J0676j121
5444a9519K947m277K1587K3380k1023j7684j3957j5190J355P574j134M277J6737
5431a4927p462j8809K2276K8503j2135m6045J3355J4096K1765O960k2707k6560
5419d1690j0060J9956J5334P02o399J3675N233L5655j870j4638j1864r144j6890
5406b2000K925J9667J6751K2054m310l2827j4382J7666L6869J710j2824j5338
5394A5961l0616m538J533K4873j5076k3313J3616R834j6284n767O971P79J9081
5381b946l752j7912r132M569l380K3568M210J576j7344j5446M38Q813N467o068
5367b7339L6631M1964j1548l5330m119r746j4453O858q2k2000K2968j1157r707
$$ plain form
5354 -37060 -29651 -25520 -5995 -18008 -39371 -34159 -28639 -24481 -15667 -5694 -1342 14467 22052 27271
5340 27271 52448 42216 18623 6243 -22953 -51398 -36542 -8273 -15869 -45183 -45172 -30597 -36874
5327 -36874 -35204 -17128 -18204 -38823 -59069 -64447 -42111 -32696 -20406 -18404 -25187 -37062 -43032
5314 -43032 -45697 -38206 -40006 -11009 7925 -4254 -5508 7287 1957 -24558 -11745 4214 3453
5301 3453 16869 -2734 4940 2555 12877 -9051 -25744 -19970 -476 -1203 2173 -319 12016
5288 12016 -8334 -8359 10486 25161 31058 39010 23960 15630 14569 42678 39820 21765 673
5275 673 -18837 18664 27969 41963 45143 12378 629 7956 9799 6215 31562 55672 44939
5262 44939 19324 12513 35613 28546 23446 5031 -14832 -25132 -42087 -32798 -14677 2839 7242
$$ packed form
5354c7060P409M131J9525j2013k1363N212N520M158Q814R973M352J5809P585N219
5340B7271K5177j0232k3593j2380k9196k8445J4856K8269p596k9314J1J4575o277
5327c6874J670J8076j076k0619k0246n378K2336R415J2290K002o783j1875n970
5314d3032k665P491j800K8997J8934j2179j254J2795n330k6515J2813J5959p61
5301C453J3416j9603P674k385J0322k1928j6693N774J9494p27L376k492J2335
5288A2016k0350k5J8845J4675N897P952j5050q330j061K8109k858j8055k1092
5275F73j9510L7501R305J3994L180l2765j1749P327J843l584K5347K4110j0733
5262D4939k5615o811K3100p067n100j8415j9863j0300j6955R289J8121J7516M403
$$ plain form
5249 7242 -10009 -35279 -29935 -11735 13767 9683 -43 6393 24034 19491 -13925 -35965 -45024
5236 -45024 -36256 -31586 -34570 -28115 -14037 -673 9492 5186 7837 -4053 -26697 -43993 3353
5223 3353 37097 32766 1213 -27004 -50058 -56572 -44794 -29487 -52536 -63821 -49768 -27449
5211 -27449 -38619 -55728 -69858 -51749 -28441 -9234 -10743 -13266 -36444 -41483 -46328 -29713 4742
5198 4742 11208 6309 -11474 -26673 -29300 -30581 -14744 -19366 -40612 -30954 -23855 -30495 -35417 -43618
5184 -43618 -48881 -12557 -2364 -16770 1211 6799 11112 2877 12388 40939 35127 231 10037
5171 10037 22635 19894 -12027 -43246 -37576 -21630 -22298 -28228 -45843 -48922 -22858 -15658 -19900
5158 -19900 -11706 -23317 5007 10263 11520 9522 -17933 -30067 -21115 -28986 -12027 -17944 -11774
$$ packed form
5249G242j7251k5270N344J8200K5502m084r726O436J7641m543l3416k2040r059
5236d5024Q768M670k984O455J4078J3364J0165m306K651j1890k2644j7296M7346
5223C353L3744m331l1553k8217k3054o514J1778J5307k3049j1285J4053K2319
5211b7449j1170j7109j4130J8109K3308J9207j509k523k3178n039m845J6615L4455
5198D742O466m899j7783j5199k627j281J5837m622k1246R658P099o640m922q201
5184d3618n263L6324J0193j4406J7981N588M313q235R511K8551n812l4896R806
5171A0037J2598k741l1921l1219N670J5946o68n930j7615l079K6064P200m242
5158a9900Q194j1611K8324N256J257j998k7455j2134Q952p871J6959n917O170
$$ plain form
5145 -11774 11506 24985 1679 -9753 23310 21033 11018 -8783 -10250 -6103 -17940 -38169
5133 -38169 -42764 -44545 -39407 -43050 -10039 14207 26638 -5864 -13723 -3046 -18393 -17371 -35378
5120 -35378 -46951 -19399 -32189 -28503 -28065 -38622 -59047 -74202 -51228 -17248 -13050 -22970 -24419
5107 -24419 -32867 -29490 -31496 -18321 -14531 -7817 -7894 4463 -17320 -36415 -20147 -13311 1098 5054
5093 5054 15224 11728 -6585 -22405 -25482 -23164 -9068 -19503 -24521 -11616 -349 -11715 -21301
5080 -21301 -14849 -14896 -38946 -42546 -17076 -26 -15848 -22293 -19748 -18090 2755 12412 -8510 -27817
5066 -27817 -23825 6437 8528 -2272 -1107 7177 -12360 -11631 -23758 -21536 -40491 -38121 -8948
5053 -8948 -1220 2473 -920 -9756 -11119 -12542 24219 40019 33292 13626 4105 4216 -1801 -17162
$$ packed form
5145a1774K3280J3479k3306j1432L3063k277j0015j9801j467M147j1837k0229
5133c8169m595j781N138l643L3011K4246J2431l2502p859J0677j5347J022j8007
5120c5378j1573K7552j2790L686M38j0557k0425j5155K2974L3980M198r920j449
5107b4419q448L377k006J3175L790O714p7J2357k1783j9095J6268O836J4409L956
5093E054J0170l496j8313j5820l077K318J4096j0435n018J2905J1267j1366r586
5080b1301O452m7k4050l600K5470J7050j5822o445K545J658K0845R657k0922j9307
5066b7817L992L0262K091j0800J165Q284j9537P29j2127K222j8955K370K9173
5053h948P728L693l393q836j363j423L6761J5800o727j9666r521J11o017j5361
$$ plain form
5039 -17162 -14287 -16527 -25296 -44169 -54983 -49442 -27493 -30569 -15146 -22520 -16466 -9909 -23316
5026 -23316 2876 22740 24896 33843 19449 11809 22811 28488 26910 11063 12738 -3529 -39761
5013 -39761 -25352 -31538 -30298 -47597 -74527 -76133 -41615 -3214 -13107 -29454 -29519 -14140 -11294
5000 -11294 -24218 -17393 8893 16339 38082 29249 7089 -7041 7908 6792 -41610 -21748 10227
4987 10227 5176 8460 -8390 -5260 14039 23332 -7505 -21506 -31800 -34051 -22901 3071 9310
4974 9310 24180 26643 17812 1648 -22783 -13422 -9275 -18703 -22220 -16935 9655 -4976 -645 -3167
4960 -3167 2615 30667 45561 8845 -10506 -24448 -21861 -12450 -3173 9814 28578 12431 -8792
4947 -8792 -27267 -28720 -35744 -39706 -20072 -39376 -37044 -16232 -15546 -23010 -18411 -22534 -14892 14043
$$ packed form
5039a7162K875k240q769j8873j0814N541K1949l076J5423p374O054O557j3407
5026b3316K6192J9864K156Q947j4394p640J1002N677j578j5847J675j6267l6232
5013c9761J4409o186J240j7299k6930j606L4518L8401r893j6347o5J5379K846
5000a1294j2924O825K6286P446K1743q833k2160j4130J4949j116m8402J9862L1975
4987A0227n051L284j6850L130J9299R293l0837j4001j0294k251J1150K5972O239
4974I310J4870K463q831j6164k4431R361M147r428l517N285K6590j4631M331k522
4960c167N782K8052J4894l6716j9351j3942K587R411R277J2987J8764j6147k1223
4947h792j8475j453p024l962J9634j9304K332K0812O86p464M599m123P642K8935
$$ plain form
4933 14043 5366 -13220 -24580 -35777 -47670 -63739 -41549 -1736 18428 -10393 -16151 -22907
4921 -22907 -41654 -59936 -37277 6503 23039 21728 8623 -14203 -18484 10958 4419 -10654
4909 -10654 -25708 -13999 23358 9857 -32574 -62831 -80608 -86482 -78256 -65065 -60446 -60695 -54970
4896 -54970 -24928 45 -5775 -27213 -30696 -25859 -9782 -1393 10685 16628 -12812 -24778 -37868
4883 -37868 -42617 -29536 -28636 -39699 -45036 -24621 -26047 -29114 -26646 -30444 -15556 6793 628 -32803
4869 -32803 -52359 -50232 -29062 6388 28676 32583 14456 -1016 3496 -5875 -30302 -57095 -33536
4856 -33536 -5656 -1978 -14035 -38647 -29533 -31869 -39407 -19269 -5049 -10441 -19380 -34322 -21848
4843 -21848 3900 27720 18607 -10126 -23232 -34376 -23812 -1119 25467 -2018 -21520 -11882
$$ packed form
4933A4043q677j8586j1360j1197j1893j6069K2190L9813K0164k8821n758o756
4921b2907j8747j8282K2659M3780J6536j311j3105k2826m281K9442o539j5073
4909a0654j5054J1709L7357j3501m2431l0257j7777n874Q226J3191M619k49N725
4896e4970L0042K4973n820k1438l483M837J6077Q389J2078N943k9440j1966j3090
4883c7868m749J3081R00j1063n337K0415j426l067K468l798J4888K2349o165l3431
4869c2803j9556K127K1170L5450K2288L907j8127j5472M512r371k4427k6793K3559
4856c3536K7880L678j2057k4612R114k336p538K0138J4220n392q939j4942J2474
4843b1848K5748K3820r113k8733j3106j1144J0564K2693K6586k7485j9502R638
$$ plain form
4831 -11882 11643 10847 3638 25 -15761 -9164 7912 13881 31502 37621 16352 22763 4464
4818 4464 22109 27379 17458 9224 -1841 1705 3755 7993 3818 31153 23926 18514 9428 -18965
4804 -18965 -44547 -43760 -34439 -24287 -21253 -25649 -43100 -37974 -33338 -25206 -13909 -29851 -47460
4791 -47460 -51950 -15456 -8396 -12034 -3954 -6011 -42753 -52353 -29287 -26484 -36925 -39011 -48510 -37944
4777 -37944 -37578 -45214 -50814 -33557 -51906 -65559 -49083 -50012 -43986 -33213 5327 11919 7689 21334
4763 21334 17349 17239 33465 35202 10372 21402 23353 11361 20603 19905 6902 7375 27697 16789
4749 16789 -8501 -31743 -37221 -19965 -14976 4926 24882 27999 26948 32939 45960 37922 14955
4736 14955 17294 15060 -10115 1341 -7032 7326 -1290 -4243 -18423 -6325 3556 1403 -3976
$$ packed form
4831a1882K3525p96p209l613j5786O597J7076N969J7621O119k1269O411j8299
4818D464J7645N270r921q234j1065L546K050M238m175K7335p227n412r086k8393
4804a8965k5582P87R321J0152L034m396j7451N126M636Q132J1297j5942j7609
4791d7460m490L6494P060l638Q080k057l6742r600K3066K803j0441k086r499J0566
4777c7944L66p636n600J7257j8349j3653J6476r29O026J0773L8540O592m230J3645
4763B1334l985j10J6226J737k4830J1030J951j1992R242o98j3003M73K0322j0908
4749A6789k5290k3242n478J7256M989J9902J9956L117j051N991J3021q038k2967
4736A4955K339k234k5175J1456q373J4358q616k953j4180J2098R881k153n379
$$ plain form
4723 -3976 3010 10498 14581 -8873 -15627 -17837 -14051 -14362 -14073 -3837 -19437 -16110 -5734 -24249
4709 -24249 -6854 -17602 -20223 -25304 -41823 -29706 -31685 -47364 -45409 -31393 -14606 -16962 -27788
4696 -27788 -30008 -46637 -48926 -42863 -19087 -26336 -33165 -22957 -10629 -30301 -51120 -31812 -8424
4683 -8424 -8636 -37201 -11729 18754 35198 62613 51556 62471 43146 13559 -6906 -32918
4671 -32918 -13008 -758 8417 8329 126 -11590 -32250 -42673 -39662 -45014 -51290 -54149 -47015 -29513
4657 -29513 -3470 20112 15223 14306 13628 1685 5749 -1886 -18280 -3503 -7334 -19697 -27231 -12844
4643 -12844 -17750 -352 29232 43145 16736 -28221 -39523 -22534 -12794 -20041 -50595 -32622
4631 -32622 -22782 -20769 -5386 -15834 -23580 -22564 -29738 -34153 -35094 -27208 -37705 -54076 -60335 -57758
$$ packed form
4723c976O986P488M083k3454o754k210L786l11K89J0236j5600L327J0376j8515
4709b4249J7395j0748k621n081j6519J2117j979j5679J955J4016J6787k356j0826
4696b7788k220j6629k289O063K3776p249o829J0208J2328j9672k0819J9308K3388
4683h424k12k8565K5472L0483J6444K7415j1057J0915j9325k9587k0465k6012
4671c2918J9910J2250R175q8q203j1716k0660j0423L011n352o276k859P134J7502
4657b9513K6043K3582m889r17o78j1943M064p635j6394J4777l831j2363p534J4387
4643a2844m906J7398K9584J3913k6409m4957j1302J6989R740p247l0554J7973
4631c2622R840K013J5383j0448p746J016p174m415r41P886j0497j6371o259K577
$$ plain form
4617 -57758 -47581 -11722 8391 15336 7044 1723 -3700 22925 25809 4051 -10114 -44961 -41457
4604 -41457 -25504 -3498 9495 12077 -23529 -54654 -40055 -11189 -6568 -13858 -32724 -48711
4592 -48711 -49402 -51766 -48158 -47971 -26812 -32415 -6696 14669 12205 -5032 -23192 -16215 -14572 -33519
4578 -33519 -28117 -10235 -2097 -25117 -52069 -66290 -42511 -31740 -18999 -26445 -15865 -12384 -14682
4565 -14682 -16050 -6600 5429 15025 -2778 -7803 -17885 -27553 -8577 -12201 -35963 -67118 -61861
4552 -61861 -28936 -2279 10922 -1262 -32042 -42266 -20983 -21027 -23995 -29577 5678 -5982 -31753
4539 -31753 -29871 -18851 -18689 -18590 -19638 -7070 12464 4842 18010 25747 17601 25642 21398 9069
4525 9069 7597 -12546 -29863 -31136 -48554 -51329 -52930 -34832 -23107 -2909 7436 5999 3847
$$ packed form
4617e7758J0177L5859K0113O945q292n321n423K6625K884k1758j4165l4847L504
4604d1457J5953K2006J2993K582l5606l1125J4599K8866M621p290j8866j5987
4592d8711o91k364L608J87K1159n603K5719K1365k464j7237j8160O977J643j8947
4578c3519N402J7882Q138k3020k6952j4221K3779J0771J2741p446J0580L481k298
4565a4682j368R450J2029R596j7803n025j0082r668J8976l624k3762l1155N257
4552f1861L2925K6657J3201j2184l0780j0224K1283m4k968n582L5255j1660k5771
4539c1753J882J1020J62R9j048J2568J9534p622J3168P737q146Q041m244j2329
4525I069j472k0143j7317j273j7418k775j601J8098J1725K0198J0345j437k152
$$ plain form
4512 3847 -2722 -10348 -13989 -8713 1326 19215 16509 11163 -8297 -29414 -9305 17664 3628
4499 3628 -11311 -22060 -3527 -11108 -27323 -32638 -32754 -33828 -37071 -5402 838 -25050 -21007 -22818
4485 -22818 -10139 -13398 14275 37415 26977 -12516 4935 40243 23513 20276 17618 12303 11414
4472 11414 9025 -12783 -13226 -9372 -18105 -15445 -13945 -25167 -51586 -39756 -16925 -7415 -11807 -6722
4458 -6722 -3863 -6152 -13691 -3624 12931 29096 21084 92 10480 95 10344 -13784 -56372
4445 -56372 -65408 -33192 -30149 -6439 -10832 -22223 -20003 -42658 -43336 -46266 -37451 -50134 -41088 -18047
4431 -18047 8125 -11014 -37952 -30004 -11275 -30191 -61134 -62300 -50132 -37909 -40960 -57767
4419 -57767 -76993 -56826 -21017 -20614 -32479 -72049 -79282 -38919 -20370 -17148 -26795 -32701 -29811
$$ packed form
4512C847o569p626l641N276J0039J7889k706n346j9460k1117K0109K6969j4036
4499C628j4939j0749J8533p581j6215n315j16j074l243L1669O240k5888M043j811
4485b2818J2679l259K7673K3140j0438l9493J7451L5308j6730l237k658n315q89
4472A1414k389k1808m43L854q733K660J500j1222k6419J1830K2831R510m392N085
4458f722K859k289p539J0067J6555J6165q012k0992J0388j0385J0249k4128m2588
4445e6372r036L2216L043K3710m393j1391K220k2655o78k930Q815j2683R046K3041
4431a8047K6172j9139k6938P948J8729j8916l0943j166J2168J2223l051j6807
4419e7767j9226K0167L5809M03j1865l9570p233M0363J8549L222r647n906K890
$$ plain form
4406 -29811 -7497 24782 37140 34197 32995 24771 5123 16322 4290 6386 6355 986 21127
4393 21127 25590 22363 -5382 -29588 -31453 -21947 -6887 -20775 -17867 -12505 -43981 -24624 -1100
4380 -1100 16970 20911 27524 5896 -12181 -10301 -20504 2165 702 -23187 -20773 -8959 -25710
4367 -25710 -48502 -66929 -57418 -39555 -37667 -28398 -9580 -15360 -34616 -62664 -44845 -32272 -45099
4354 -45099 -24454 -11392 -20315 -1699 -10304 -5394 -4155 -25144 -11760 -9351 -38939 -14127 -6422
4341 -6422 11254 -7971 11182 19588 8765 -31522 -27824 -16248 -17840 -30318 -26428 -30577 -33972
4328 -33972 -13288 -2779 -12497 -8759 12843 -4810 -21477 -30152 -10320 9924 -15497 -10172 3952
4315 3952 -9789 18509 50488 48227 13041 13538 18336 9288 2366 -7271 19682 22892 22790 15755
$$ packed form
4406b9811K2314L2279J2358k943j202q224j9648J1199j2032K096l1n369K0141
4393B1127M463l227k7745k4206j865R506J5060j3888K908N362l1476J9357K3524
4380a100J8070L941O613k1628j8077J880j0203K2669j463k3889K414J1814j6751
4367b5710k2792j8427R511J7863J888R269J8818n780j9256k8048J7819J2573j2827
4354d5099K0645J3062q923J8616q605M910J239k0989J3384K409k9588K4812P705
4341f422J7676j9225J9153Q406j0823m0287L698J1576j592j2478L890m149l395
4328c3972K0684J0509r718L738K1602j7653j6667q675J9832K0244k5421N325J4124
4315C952j3741K8298L1979k261l5186M97M798r048o922r637K6953L210j02p035
$$ plain form
4301 15755 13122 21356 2667 7881 -1681 -8856 -29947 -25019 -17938 -12128 -46675 -47659 -41517 -46286
4287 -46286 -34453 -7122 -4800 -6572 -18917 -24913 -8774 15576 5710 -7484 4450 6585 -16993
4274 -16993 -43660 -43814 -40254 -43906 -33325 -33728 -43217 -26513 -13800 -9481 21311 8822 4252 10090
4260 10090 -16820 -23580 -22772 -18291 -15194 -8857 -12359 -61415 -44577 -12797 15697 11363 24832
4247 24832 23701 4762 -6361 3643 9295 14394 2336 5849 -2535 -23511 -6748 -10958 -4329
4234 -4329 -12025 -23706 -27632 -8278 -5650 -10571 -6065 7154 5447 -10116 -6345 -4011 -14060 -2429
4220 -2429 9469 -13320 -21452 -9582 -10081 -19604 -27038 -39570 -21563 -37727 -35762 -7426 -2801
4207 -2801 -10655 -5730 -17829 -17557 -22949 -29202 -1779 17283 162 10204 3920 31039 46098
$$ packed form
4301A5755k633Q234j8689N214r562p175k1091M928P081N810l4547r84O142m769
4287d6286J1833K7331K322j772j2345n996J6139K4350r866j3194J1934K135k3578
4274a6993k6667j54L560l652J0581m03r489J6704J2713M319L0792j2489m570N838
4260A0090k6910o760Q08M481L097O337l502m9056J6838L1780K8494m334J3469
4247B4832j131j8939j1123J0004N652N099j2058L513q384k0976J6763m210O629
4234d329p696j1681l926J9354K628m921M506J3219j707j5563L771K334j0049J1631
4220b429J1898k2789q132J1870m99r523p434j2532J8007j6164J965K8336M625
4207b801p854M925j2099K72n392o253K7423J9062j7121J0042o284K7119J5059
$$ plain form
4194 46098 21910 -13878 -279 9802 6584 -11041 -13504 -22131 -41459 -27211 -5912 15668
4182 15668 19028 31080 53949 46855 11002 -7946 -20265 -20188 -10585 -13147 -16060 6512 -1219 -18225
4168 -18225 8188 21459 18716 13429 -9750 -11293 -25240 -50359 -5381 13299 19697 -15017 -22051
4155 -22051 -28576 -22040 8063 48766 51891 26365 14509 -6332 -39854 -60626 -75349 -70673 -56714
4142 -56714 -36897 -20369 -8039 -27881 -26732 -19872 -31570 -38868 -44765 -43637 -47168 -44092 -32814
4129 -32814 -11752 15597 24052 18227 703 -16444 -14287 12892 18097 495 -26725 -7158 -19790
4116 -19790 -47000 -45742 -32507 -25736 -31918 -48151 -41061 -22158 -7633 -3313 4717 -12666 -12668 -2170
4102 -2170 -2566 24272 33264 23336 33922 13126 1903 -16748 -46568 -36232 -1992 3361 30375
$$ packed form
4194D6098k4188l5788J3599J0081l218j7625k463q627j9328J4248K1299K1580
4182A5668L360J2052K2869p094l5853j8948j2319P7R603k562k913K2572p731j7006
4168a8225K6413J3271k743n287k3179j543j3947k5119M4978J8680O398l4714p034
4155b2051o525O536L0103M0703L125k5526j1856k0841l3522k0772j4723M676J3959
4142e6714J9817J6528J2330j9842J149O860j1698p298n897J128l531L076J1278
4129c2814K1062K7349Q455n825j7524j7147K157K7179N205j7602k7220J9567j2632
4116a9790k7210J258J3235O771o182j6233P090J8903J4525M320Q030j7383kJ0498
4102b170l96K6838Q992r928J0586k0796j1223j8651k9820J0336L4240N353K7014
$$ plain form
4089 30375 42592 20796 7668 4945 -25074 -43295 -40685 -15012 -19274 -18802 -18618 -40247 -49702
4076 -49702 -10861 5436 4268 -16562 -4053 16178 19207 32784 33874 41649 44113 39234 28085
4063 28085 36021 25595 9195 9060 -1320 12584 25027 15865 -23497 -51860 -57822 -51436 -42038
4050 -42038 -21786 -4613 -5317 -4452 -10078 -21691 -43910 -40203 -1930 3910 -1938 9401 -2084
4037 -2084 17577 12529 16685 -2127 -1326 -5503 11992 -4978 -31031 -37714 -33730 -4620 9802
4024 9802 -272 -8400 -13294 -33559 -26181 -31036 -15768 -8177 -12934 3640 -14257 -35910 -44195
4011 -44195 -50535 -35133 -3325 7642 14090 3114 -3331 -18907 -25645 -35848 -51249 -42568 -34726
3998 -34726 -37104 -46591 -25838 -7033 -35607 -42640 -23726 -16663 -21200 -23482 -15539 16803 14935
$$ packed form
4089C0375J2217k1796j3128k723l0019j8221K610K5673m262M72J84k1629r455
4076d9702L8841J6297j168k0830J2509K0231L029J3577J090P775K464m879j1149
4063B8085P936j0426j6400j35j0380J3904J2443r162l9362k8363n962O386R398
4050d2038K0252J7173p04Q65n626j1613k2219L707L8273N840n848J1339j1485
4037b084J9661n048M156j8812Q01m177J7495j6970k6053o683L984K9110J4422
4024I802j0074q128m894k0265P378m855J5268P591m757J6574j7897k1653q285
4011d4195o340J5402L1808J0967O448j0976o445j5576o738j0203j5401Q681P842
3998c4726k378r487K0753J8805k8574p033J8914P063m537k282P943L2342j868
$$ plain form
3985 14935 43261 39727 45738 25863 10555 11926 -11070 -45607 -35215 -8219 -8856 -5144 855
3972 855 25289 11625 -4858 -11998 -2089 -30425 -38312 -36268 -32268 -20017 -26849 -10300 -5300 -29950
3958 -29950 -45134 -44644 -29524 -38192 -31908 -37912 -44833 -55370 -77553 -66870 -37328 -8479 -14042
3945 -14042 -10439 18912 36045 13482 -14273 -15327 6168 22084 26209 21098 -8215 -20132 -11769
3932 -11769 5363 5763 1902 -882 10252 -24785 -52606 -70399 -44832 -30787 6577 15411 -6702
3919 -6702 -12221 -24496 -28345 -28003 -27132 -7598 -52 -5079 -8604 -21999 8462 18910 -1926 -16803
3905 -16803 -2812 -6656 -23820 -36216 -46050 -52360 -47362 -25569 -13185 -7927 3186 8239 2240
3892 2240 -17636 4369 7611 9229 13514 -9989 -22280 145 3570 -16784 -26188 -28153 -7822
$$ packed form
3985A4935K8326l534O011j9875j5308J371k2996l4537J0392K6996o37L712N999
3972H55K4434j3664j6483p140R909k8336p887K044M000J2251o832J6549N000k4650
3958b9950j5184M90J5120q668O284o004o921j0537k2183J0683K9542K8849n563
3945a4042L603K9351J7133k2563k7755j054K1495J5916M125n111k9313j1917Q363
3932a1769J7132M00l861k784J1134l5037k7821j7793K5567J4045L7364Q834k2113
3919f702n519j2275l849L42Q71J9534P546n027l525j3395L0461J0448k0836j4877
3905a6803J3991l844j7164j2396r834o310M998K1793J2384N258J1113N053n999
3892B240j9876K2005L242J618M285k3503j2291K2425L425k0354r404j965K0331
$$ plain form
3879 -7822 -4706 4773 1037 -15282 -21884 -11878 14042 16527 13471 -736 -14106 -13141 1172 7361
3865 7361 10009 17923 8574 8630 15822 3145 -13602 -32286 -21373 -10215 9292 22588 17742 24035
3851 24035 8142 -13249 -15458 -24270 -28361 -6072 2439 -18530 -30869 -29751 -30959 -44379 -31047
3838 -31047 -15104 901 11137 -19141 -34944 -34273 -15771 -2769 13570 24886 15023 8636 -15611
3825 -15611 -19473 -11128 -23544 -27880 -16416 14090 38589 54306 41113 5225 -13593 -29972
3813 -29972 -40252 -23905 -12478 -16018 -15108 -27106 6593 21986 9063 -7387 -15742 -25255 -49477
3800 -49477 -46027 -32821 -25765 -11171 -10749 -12897 488 -20448 -20833 -26260 -44161 -32725 -31363 -41005
3786 -41005 -18050 -31713 -57131 -38087 -210 11562 5860 36141 46662 25215 13814 -13894
$$ packed form
3879g822L116R479l736j6319o602J0006K5920K485l056j4207j3370R65J4313O189
3865G361K648P914r349N6P192j2677j6747j8684J0913J1158J9507J3296m846O293
3851B4035j5893k1391k209q812m091K2289Q511k0969j2339J118j208j3420J3332
3838c1047J5943J6005J0236l0278j5803O71J8502J3002J6339J1316r863o387k4247
3825a5611l862Q345j2416m336J1464L0506K4499J5717j3193l5888j8818j6379
3813b9972j0280J6347J1427l540R10j1998L3699J5393j2923j6450q355r513k4222
3800d9477L450J3206P056J4594M22k148J3385k0936l85n427j7901J1436J362r642
3786d1005K2955j3663k5418J9044L7877J1772n702L0281J0521k1447j1401k7708
$$ plain form
3774 -13894 -19224 -4225 -354 -12234 -2135 -6081 -7922 -27500 -29066 -9372 -18507 -24461 -43973
3761 -43973 -41880 -50850 -37804 -36876 -60000 -41021 -18581 -9256 -12285 -34409 -40818 -27955 -30846
3748 -30846 -12128 11619 22837 19444 622 -18098 -20715 -41151 -28808 -19002 -3721 -329 3033
3735 3033 2071 1833 -15209 -48162 -39628 -34944 -58799 -62691 -29775 -12091 -2833 -3713 -9919 -26292
3721 -26292 -41987 -52060 -47284 -30120 -22528 -13181 -16854 -47610 -41677 -22199 -6261 -15985 -26693
3708 -26693 4329 17745 13492 28622 24305 27555 25133 25457 21231 25190 19614 17898 -15976 -20407
3694 -20407 -3746 21938 26714 23842 51140 44041 5114 -21082 -30584 -6677 14240 14858 8917
3681 8917 -8374 -1000 29770 51356 14473 -17580 -18243 -14150 -21220 -13596 -13841 -35987 -30194 -27302
$$ packed form
3774a3894n330J4999L871j1880J0099l946j841j9578j566J9694r135n954j9512
3761d3973K093q970J3046R28k3124J8979K2440R325l029k2124o409J2863k891
3748c0846J8718K3747J1218l393j8822j8720k617k0436J2343R806J5281L392L362
3735C033r62k38j7042l2953Q534M684k3855l892L2916J7684R258q80o206j6373
3721b6292j5695j0073M776J7164P592R347l673l0756N933J9478J5938r724j0708
3708b6693L1022J3416m253J5130m317L250k422L24m226L959n576j716l3874m431
3694b0407J6661K5684M776k872K7298p099l8927k6196r502K3907K0917O18n941
3681H917j7291P374L0770K1586l6883l2053o63M093p070P624k45k2146N793K892
$$ plain form
3667 -27302 -61463 -55843 -34831 -11784 -5197 -742 1270 5067 19624 14170 6676 -32757 -17523
3654 -17523 -21176 -38070 -28449 -29590 -24366 -9788 -14478 3884 32473 44872 42017 6762 15739
3641 15739 1658 -12109 -12789 -42192 -30754 -7777 -28990 -31473 -11458 -3046 -4829 -15677 -1774
3628 -1774 6527 -7678 -14691 -21753 -14562 -8584 -20016 8571 17047 900 -35734 -37547 -26715
3615 -26715 -5779 -2513 -9818 -32850 -16707 -18667 -33530 -57971 -48838 -35872 2544 38938 44282
3602 44282 44750 10083 -6541 -28440 -41277 -15698 -3298 -11922 -28833 -41965 -25667 -4490
3590 -4490 -3756 -23992 -27552 -36156 -42861 -30658 -3244 -11056 -3576 -3790 -22669 -6295 11020 28410
3576 28410 28466 10583 4745 12512 -22311 -57651 -29873 -26739 -51612 -51766 -31398 116 -26869
$$ packed form
3667b7302l4161N620K1012K3047O587M455K012L797J4557n454p494l9433J5234
3654a7523l653j6894R621j141N224J4578m690J8362K8589J2399k855l5255Q977
3641A5739j4081j3767o80k9403J1438K2977k1213k483K0015Q412j783j0848J3903
3628a774Q301j4205p013p062P191N978j1432K8587Q476j6147l6634j813J0832
3615b6715K0936L266p305k3032J6143j960j4863k4441R133J2966L8416L6394N344
3602D4282M68l4667j6624k1899j2837K5579J2400q624j6911j3132J6298K1177
3590d490P34k0236l560q604o705J2203K7414p812P480k14j8879J6374J7315J7390
3576B8410N6j7883n838P767l4823l5340K7778L134k4873j54K0368L1514k6985
$$ plain form
3563 -26869 -30544 -22676 -37715 -64768 -41927 -37598 -34763 -8678 -3011 -2371 -9292 -23392 -10870
3550 -10870 5200 -12291 -10351 -6928 -2816 -5463 -12588 -11643 -20864 -59727 -72883 -71621 -75906 -51174
3536 -51174 -63207 -83304 -67269 -55611 -44682 -38151 -45621 -47818 -29413 -12688 -12672 -5046 -13766
3523 -13766 -3875 -23795 -36245 -26367 -921 8085 -27861 -37641 -19186 -13356 -13478 -18480 -39333
3510 -39333 -21262 -5673 -2405 -13108 -23287 -32640 -50147 -43077 -36258 -11920 -17942 10843 -1811
3497 -1811 -35039 -48313 -54864 -58461 -71787 -52256 -38156 -33461 -41720 -37400 -24727 -12859 -3657
3484 -3657 -3632 -15798 -40910 -36292 -14089 -27615 -37321 -28028 -12512 -18496 -12353 5779 -11233 -19798
3470 -19798 -9103 18760 41212 20538 6171 -5209 3765 21821 11816 -36700 -37150 -7003
$$ packed form
3563b6869l675P868j5039k7053K2841M329K835K6085N667O40o921j4100J2522
3550a0870J6070j7491J940L423M112k647p125R45r221l8863j3156J262m285K4732
3536e1174j2033k0097J6035J1658J0929O531p470k197J8405J6725J6P626q720
3523a3766R891j9920j2450R878K5446R006l5946r780J8455N830j22n002k0853
3510c9333J8071J5589L268j0703j0179r353j7507P070O819K4338o022K8785j2654
3497a811l3228j3274o551l597j3326J9531J4100M695q259M320J2673J1868R202
3484c657K5j2166k5112M618K2203j3526r706R293J5516n984O143J8132j7012q565
3470a9798J0695K7863K2452k0674j4367j1380Q974J8056j0005m8516m50L0147
$$ plain form
3458 -7003 21931 16576 2292 -10747 23820 20241 16588 31823 15447 21394 20831 6479 -18819
3445 -18819 -7978 15462 19736 18160 20706 4595 -5070 -24083 -26172 -1747 5105 25096 33410
3432 33410 40802 47133 34415 8985 8539 6240 454 8950 30743 25604 12303 8450 15100 1764
3418 1764 -20943 -2548 -13127 6979 23900 14096 2399 19 -4085 -24358 -3527 15362 5707
3405 5707 17161 11299 -6880 -21008 -5786 8063 -16995 -26910 -22550 -31644 -34441 -22127 -8309
3392 -8309 -25097 -60145 -58536 -42772 -48479 -41105 2202 -5159 -33104 -47519 -36884 -29494 -34465
3379 -34465 -42778 -32562 -35842 -42220 -35890 -19825 -37414 -40619 4174 30196 24353 18206 28696
3366 28696 17697 4683 -24650 -45672 -17930 1368 6319 17077 36348 30859 9829 20138
$$ packed form
3458g003K8934n355j4284j3039L4567l579l653J5235j6376N947n63j4352k5298
3445a8819J0841K3440M274j576K546j6111r665j9013k089K4425O852J9991Q314
3432C3410P392O331j2718k5430m46k299n786Q496K1793n139j3301l853O650j3336
3418A764k2707J8395j0579K0106J6921r804j1697k380m104k0273K0831J8889r655
3405E707J1454n862j8179j4128J5222J3849k5058r915M360r094k797J2314J3818
3392h309j6788l5048J609J5764n707P374M3307p361k7945j4415J0635P390m971
3379c4465q313J0216l280o378O330J6065j7589l205M4793K6022n843o147J0490
3366B8696j0999j3014k9333k1022K7742J9298M951J0758J9271n489k1030J0309
$$ plain form
3354 20138 16666 -7012 -9753 9162 8631 -12273 -32443 -49216 -48689 -68121 -58760 -33371 -12837
3341 -12837 2913 15286 19725 14015 20473 14035 -9359 -5332 -14256 -34940 -47664 -35499 -11075
3328 -11075 9311 3719 -1489 478 2068 -13882 -19715 -23390 -12839 3275 27096 17067 1691
3315 1691 -12425 -27416 -24845 -32212 -2000 22202 25535 21603 24872 5911 -8297 -23380 -12174
3302 -12174 -8128 -3362 13480 12590 -5348 4649 25379 17453 16373 9752 -27444 -42502 -25895
3289 -25895 -16910 -7640 -16120 -2626 -11636 -47771 -60360 -33740 -11724 -3412 -2515 8416 5497
3276 5497 -24065 -55489 -81194 -54633 -37494 -26587 11621 28051 30518 27089 8407 -8418
3264 -8418 -16364 -24214 -41256 -48857 -46319 -25648 -28585 -50294 -46818 -21151 -19409 -14453 -860 11675
$$ packed form
3354B0138l472k3678k741J8915n31k0904k0170j6773N27j9432R361K5389K0534
3341a2837J5750J2373M439n710O458o438k3394M027q924k0684j2724J2165K4424
3328a1075K0386n592n208J967J590j5950n833l675J0551J6114K3821j0029j5376
3315A691j4116j4991K571p367L0212K4202L333l932L269j8961j4208j5083J1206
3302a2174M046M766J6842q90j7938R997K0730p926j080o621l7196j5058J6607
3289b5895Q985R270q480J3494r010l6135j2589K6620K2016Q312Q97J0931k919
3276E497k9562l1424k5705K6561J7139J0907L8208J6430K467l429j8682j6825
3264h418p946p850j7042p601K538K0671k937k1709L476K5667J742M956J3593J2535
$$ plain form
3250 11675 4761 -646 9810 5733 23641 45707 34306 23581 40072 30585 -12297 -35340 -4442
3237 -4442 1147 -4686 5 17288 21570 26750 33555 11300 -2805 7475 -2748 -893 -19503
3224 -19503 -32370 -16293 12510 -4709 -5989 -20133 -35559 -33747 -23699 -12374 -3910 15611
3212 15611 10364 12233 32681 28647 11929 -29718 -50350 -54244 -22882 -838 1275 -15831 -21994
3199 -21994 -10125 -7998 -9809 -812 515 2382 -6552 -41431 -20921 15866 9214 -23471 -20105
3186 -20105 -26262 -31508 -45944 -31231 -2534 -8669 -19298 -26004 -34444 -61510 -50701 -20490 -2009
3173 -2009 -14018 -49065 -29732 -20330 -22491 -45762 -18384 170 -1824 6033 15072 23598 10084
3160 10084 5383 6276 -68 12367 16400 11563 -20142 -26484 -20799 -8085 9234 1403 -31993 -36804
$$ packed form
3250A1675o914n407J0456m077J7908K2066j1401j0725J6491r487m2882k3043L0898
3237d442N589n833M691J7283M282N180O805k2255j4105J0280j0223J855j8610
3224a9503j2867J6077K8803j7219j280j4144j5426J812J0048J1325Q464J9521
3212A5611n247J869K0448m034j6718m1647k0632l894L1362K2044K113j7106o163
3199b1994J1869K127j811Q997J327J867q934l4879K0510L6787o652l2685L366
3186b0105o157n246j4436J4713K8697o135j0629o706q440k7066J0809L0211J8481
3173b009j2009l5047J9333R402k161k3271K7378J8554j994P857R039Q526j3514
3160A0084m701Q93o344J2435M033m837l1705o342N685J2714J7319p831l3396m811
$$ plain form
3146 -36804 -11717 3431 6726 -29616 -59591 -29872 14572 35594 22462 16128 32929 6977
3134 6977 -17960 -7482 -4876 -1400 5715 23 -27037 -10403 7805 7227 6438 -397 2511 -30923
3120 -30923 -36224 -33051 -43567 -57829 -10461 25259 26524 16872 -2007 -21302 -34766 -26916 -39457
3107 -39457 -55580 -21184 3002 24515 27386 14525 -5239 -3233 9014 29977 18440 5887
3095 5887 -25411 -33039 -17818 -20837 -19458 -5035 -979 25188 6463 2325 4546 20888 47241
3082 47241 54896 31095 39988 29708 683 -15422 7621 19190 12479 -9080 -13720 -4506 -3252
3069 -3252 14926 14970 5706 29764 24566 13141 5431 25829 26215 17604 -9233 -30815 -27579 -9807
3055 -9807 -12112 8525 10841 20219 11958 -860 5218 31968 39279 10770 -13990 12301 7299
$$ packed form
3146c6804K5087J5148L295l6342k9975K9719M4444K1022j3132o334J6801k5952
3134F977k4937J0478K606L476P115n692k7060J6634J8208n78p89o835K908l3434
3120c0923n301L173j0516j4262M7368L5720J265r652j8879j9295j3464P850j2541
3107c9457j6123L4396K4186K1513K871j2861j9764K006J2247K0963j1537j2553
3095E887l1298p628J5221l019J379J4423M056K6167j8725m138K221J6342K6353
3082D7241P655k3801Q893j0280k9025j6105K3043J1569o711k1559m640R214J254
3069c252J8178M4r264K4058n198j1425p710K0398L86q611k6837k1582L236J7772
3055i807k305K0637K316R378q261j2818O078K6750P311k8509k4760K6291n002
$$ plain form
3042 7299 36307 45121 39428 20978 -13482 -26957 -7119 13027 1782 -39478 -32978 1361 11540
3029 11540 -2315 -9285 17845 25503 21473 6121 -17671 -16327 -26180 -47350 -37671 -28382 -50134
3016 -50134 -53876 -51954 -49678 -23627 -12835 -14502 -33533 -18958 -42608 -75457 -53243 -7812 18068
3003 18068 14169 11222 12250 17264 25678 39252 47409 24898 12140 15943 24393 43785 24543
2990 24543 1160 1969 -15632 17336 27355 3516 2248 -21315 -61947 -72648 -41137 -50204 -37011
2977 -37011 -39923 -12704 -12825 -4719 -2966 -17121 -35560 -36260 -37650 -30223 -21320 -15864 -4343 1512
2963 1512 1336 -1354 -9274 4217 19167 2850 -36149 -49373 -31515 -24638 -11636 -29791 -14135
2950 -14135 18296 32265 42692 38534 13079 -13495 -20196 -25947 -31801 -37344 -30302 -22232 -5010
$$ packed form
3042G299K9008Q814n693j8450l4460j3475J9838K0146j1245m1260O500L4339J0179
3029A1540j3855o970K7130P658m030j5352k3792J344r853k1170R679R289k1752
3016e0134l742J922K276K6051J0792j667j9031J4575k3650l2849K2214M5431K5880
3003A8068l899k947J028N014Q414J3574Q157k2511j2758L803Q450J9392j9242
2990B4543k3383Q09j7601L2968J0019k3839j268k3563m0632j0701L1511r067J3193
2977c7011k912K7219j21Q106J753j4155j8439p00j390P427Q903N456J1521N855
2963A512j76k690p920J3491J4950j6317l8999j3224J7858O877J3002j8155J5656
2950a4135L2431J3969J0427m158k5455k6574o701n751n854n543P042Q070J7222
$$ plain form
2937 -5010 -3002 3955 -4696 7678 15074 10967 33970 27740 28889 24749 28502 16975 29773 20025
2923 20025 8533 11884 34639 38957 24887 39900 26752 -3775 -20582 -1888 -627 -22016
2911 -22016 -15536 10354 46798 42302 30792 27537 13027 -16011 -8515 -20030 -23002 -27423 4153
2898 4153 30295 22983 3296 -26266 1190 -16723 -52900 -59743 -41531 -4921 -18012 -23188 -9448
2885 -9448 -8832 -17367 -8481 -9348 -6016 13896 19471 16327 -594 -9540 -6017 12552 6240 18316
2871 18316 24177 1272 -13676 -27388 2617 9363 2787 13520 32266 28161 34034 55330 35143
2858 35143 18847 1604 5202 -2770 5354 22862 24202 2433 1108 -31973 -61354 -46694 -42673
2845 -42673 -67124 -48877 -39264 -17344 -8347 -2826 17286 13592 12835 17038 1585 15089 -9118
$$ packed form
2937e010K008O957q651J2374P396m107K3003o230J149m140L753j1527J2798r748
2923B0025j1492L351K2755M318j4070J5013j3148l0527j6807J8694J261k1389
2911b2016O480K5890L6444m496j1510l255j4510k9038P496j1515k972m421L1576
2898D153K6142p312j9687k9562K7456j7913l6177o843J8212L6610j3091n176J3740
2885i448O16q535Q886q67L332J9912N575l144j6921q946L523J8569o312J2076
2871A8316N861k2905j4948j3712L0005O746o576J0733J8746m105N873K1296k0187
2858C5143j6296j7243L598p972Q124J7508J340k1769j325l3081k9381J4660M021
2845d2673k4451J8247R613K1920Q997N521K0112l694p57M203j5453J3504k4207
$$ plain form
2832 -9118 -51411 -43372 -37695 -48577 -41981 -29834 -15792 1504 -7663 -36585 -34143 -14473 -5828
2819 -5828 -20120 -6989 7434 9119 1523 -275 -10202 -20552 -40795 -55318 -60801 -61886 -59365
2806 -59365 -45320 -14636 8181 -13115 -3259 3376 8393 582 -9860 20554 45380 21478 7473
2793 7473 631 11770 25064 21927 18209 21157 4727 502 -16847 -25119 -12433 -5595 -7855 -22649
2779 -22649 -35468 -31741 -32448 -46553 -38025 -36827 -25956 -31133 -46516 -62839 -66804 -55539 -1108
2766 -1108 14893 4801 -119 12037 -6646 -37529 -21498 -19078 -10863 12269 17043 7905 -15540
2753 -15540 -22540 -10554 13723 3314 -13583 -27055 -25644 -25772 -9303 -9468 -7197 5134 18095
2740 18095 38705 31090 -6502 -3303 15421 9361 8815 -2556 -7698 -14504 -3669 16756 -10280
$$ packed form
2832i118m2293Q039N677j0882O596J2147J4042J7296r167k8922K442J9670Q645
2819e828j4292J3131J4423J685p596j798r927j0350k0243j4523n483j085K521
2806e9365J4045L0684K2817k1296R856O635N017p811j0442L0414K4826k3902j4005
2793G473o842J1139J3294l137l718K948j6430m225j7349q272J2686O838k260j4794
2779b2649j2819L727p07j4105Q528J198J0871n177j5383j6323l965J1265N4431
2766a108J6001j0092m920J2156j8683l0883J6031K420Q215K3132M774r138k3445
2753a5540p000J1986K4277j0409j6897j3472J411j28J6469j65K271J2331J2961
2740A8095K0610p615l7592L199J8724o060n46j1371n142o806J0835K0425k7036
$$ plain form
2727 -10280 -13486 9350 -20672 -15909 -5514 7998 5333 -15373 -15605 -25143 -15499 -1571 -5107
2714 -5107 -17367 -41488 -34961 -12140 -2647 21250 25430 3880 17806 -2472 -27995 -32182 -28828
2701 -28828 -42349 -26142 4278 29952 27370 20351 37877 42323 1246 5232 -640 -17191 -21122
2688 -21122 2472 34324 32831 15165 4953 4369 25138 3586 1428 3856 701 -15218 -7041
2675 -7041 -4942 19849 14895 28786 27566 7582 -14726 -38167 -52136 -46869 -38313 -33149 -13169
2662 -13169 -2421 -11385 -9296 3720 8631 -18310 -19558 -8078 -20577 17711 38691 17531 8789
2649 8789 -17777 -17656 -9504 -1845 20202 26678 28312 18166 487 8466 -2374 -14887 -31095
2636 -31095 -17313 3887 41286 39547 10383 -19875 -20584 -10224 -11047 -9781 -535 6744 2358 -18021
$$ packed form
2727a0280l206K2836l0022M763J0395J3512k665k0706k32r538R644J3928l536
2714e107j2260k4121O527K2821R493K3897M180k1550J3926k0278k5523m187L354
2701b8828j3521J6207L0420K5674k582p019J7526M446m1077L986n872j6551l931
2688b1122K3594L1852j493j7666j0212n84K0769k1552k158K428l155j5919Q177
2675g041K099K4791m954J3891j220j9984k2308k3441j3969N267Q556N164J9980
2662a3169J0748q964K089J3016M911k6941j248J1480j2499L8288K0980k1160q742
2649H789k6566J21Q152P659K2047O476J634j0146j7679P979j0840j2513j6208
2636c1095J3782K1200L7399j739k9164l0258p09J0360q23J266R246P279m386k0379
$$ plain form
2622 -18021 -18565 -4096 -18215 -31175 -43353 -40167 3720 -520 4108 30597 30763 6274 5377 29786
2608 29786 11695 -39625 -36907 -48467 -39558 -42277 -30269 -20148 -10200 -5686 -17093 -9128 11567
2595 11567 -2813 -6998 -10602 -16132 7125 -31 -9917 -18482 -8345 19701 26441 43949 55630
2582 55630 41549 15945 -6425 -21658 -33005 -20379 -24055 -26364 -1686 24998 41213 46752
2570 46752 36275 37631 29190 34367 27159 -18146 -59508 -49799 -40056 -22952 -13125 -11494 -12701 -2131
2556 -2131 -7096 -6237 -5383 1163 -9298 -20605 -15334 -21303 -3901 19231 4369 8963 -1151 14898
2542 14898 8131 11814 8432 4071 20065 20557 21497 -4927 -6541 -22273 -20290 -19257 -17303 -10749
2528 -10749 -24777 -34685 -47628 -43101 -2689 875 15900 -1300 -21448 -18297 -38264 -47246 -20244
$$ packed form
2622a8021n44J4469j4119j2960j2178L186M3887m240M628K6489J66k4489q97K4409
2608B9786j8091n1320K718j1560Q909k719J2008J0121R948M514j1407P965K0695
2595A1567j4380m185l604n530K3257p156r886q565J0137K8046O740J7508J1681
2582E5630j4081k5604k2370j5233j1347J2626l676k309K4678K6684J6215N539
2570D6752j0477J356q441N177p208m5305m1362R709R743J7104R827J631j207J0570
2556b131m965Q59Q54O546j0461j1307N271n969J7402K3132j4862M594j0114J6049
2542A4898o767L683l382m361J5994M92R40k6424j614j5732J983J033J954O554
2528a0749j4028r908j2943M527M0412L564J5025j7200k0148L151j9967q982K7002
$$ plain form
2515 -20244 -6153 -7990 -15038 -11789 7130 10788 -3030 25496 27076 27752 39788 27503 18606
2502 18606 19230 15476 25863 17097 2818 274 21172 36219 15192 5255 28426 33929 47660
2489 47660 45100 23716 38861 46145 39039 47354 50994 27472 28808 23863 -11671 -20406 -19717 -8699
$$ packed form
2515b0244J4091j837p048L249J8919L658j3818K8526J580O76J2036j2285q897
2502A8606O24l754J0387q766j4279k544K0898J5047k1027r937K3171N503J3731
2489D7660k560k1384J5145P284p106Q315L640k3522J336m945l5534q735O89J1018
$$ [...]
##END NTUPLES=NMR SPECTRUM
##END=
