##TITLE=Analysis number 310844
Compound Code rjf 00467
Project Code adrs
Chemist Name fudan
##JCAMPDX= 6.0         $$ Bruker NMR JCAMP-DX V2.0
##DATA TYPE= NMR SPECTRUM
##DATA CLASS= NTUPLES
##ORIGIN= Bruker BioSpin GmbH
##OWNER= NMR
$$ XWIN-NMR		Version 3.5
$$ Thu Jun 23 13:50:22 2005 GMT Daylight Time (UT+1h)  MAYBRIDGE\NMR@NMR_250MHZ
##.OBSERVE FREQUENCY= 250.131544655141
##.OBSERVE NUCLEUS= ^1H
##.ACQUISITION MODE= SIMULTANEOUS (DQD)
##.ACQUISITION SCHEME= undefined
##.AVERAGES= 16
##.DIGITISER RES= 18
##SPECTROMETER/DATA SYSTEM= dpx250
##.PULSE SEQUENCE= zg30
##.SOLVENT NAME= CDCl3
##.SHIFT REFERENCE= (INTERNAL, CDCl3, 0, 16.2738)
##AUDIT TRAIL= $$ (NUMBER, WHEN, WHO, WHERE, WHAT)
$$ ##TITLE= Audit trail, XWIN-NMR		Version 3.5
$$ ##JCAMPDX= 5.01
$$ ##ORIGIN= Bruker BioSpin GmbH
$$ ##OWNER= NMR
$$ C:\u/data/dgb/nmr/ADRS/4730/pdata/1/auditp.txt
$$ ##AUDIT TRAIL=  $$ (NUMBER, WHEN, WHO, WHERE, WHAT)
(   1,<2005-06-23 13:49:49.72 +100>,<MAYBRIDGE\NMR>,<NMR_250MHZ>,
      <created by zg, POWCHK disabled, PULCHK disabled
       configuration hash MD5:
       62 19 C7 07 E1 42 D1 B7 37 6C 3D D0 77 39 F9 E6
       data hash MD5: 64K
       6A EE BA 63 FA EA B1 0E F1 B3 2C 31 4F 7C F6 02>)
(   2,<2005-06-23 13:50:06.63 +100>,<MAYBRIDGE\NMR>,<NMR_250MHZ>,
      <Start of raw data processing
       ef LB = 0.3 FT_mod = 6 PKNL = 1 SI = 32K 
       data hash MD5: 32K
       07 E6 CC B7 B3 9D C1 87 60 CB 3F F3 DA 13 8D 17>)
(   3,<2005-06-23 13:50:10.33 +100>,<MAYBRIDGE\NMR>,<NMR_250MHZ>,
      <apk 
       data hash MD5: 32K
       00 AB 0A A1 77 48 39 A2 2B BE 91 1D 2A 54 CB C5>)
(   4,<2005-06-23 13:50:11.61 +100>,<MAYBRIDGE\NMR>,<NMR_250MHZ>,
      <abs ABSG = 5 
       data hash MD5: 32K
       08 67 5D 4D DE 4F A4 B8 D4 06 6A 06 69 74 9E 6F>)
$$ ##END=
$$ 
$$ hash MD5
$$ 72 9D CA 9B 20 B7 03 CD 27 DE E3 BE C4 ED D1 3C
##$RELAX= 
##$RELAX= 
##$RELAX= 
##$RELAX= 
##$RELAX= 
##$RELAX= 
##$RELAX= 
$$ Bruker specific parameters
$$ --------------------------
##$DU= <C:\u>
##$EXPNO= 4730
##$NAME= <ADRS>
##$PROCNO= 1
##$TYPE= <nmr>
##$USER= <dgb>
##$AMP= (0..31)
100 100 100 100 100 100 100 100 100 100 100 100 100 100 100 100 100 100 
100 100 100 100 100 100 100 100 100 100 100 100 100 100 
##$AQSEQ= 0
##$AQ_mod= 3
##$AUNM= <au_zg>
##$AUTOPOS= <26 >
##$BF1= 250.13
##$BF2= 250.13
##$BF3= 250.13
##$BF4= 250.13
##$BF5= 500.13
##$BF6= 500.13
##$BF7= 500.13
##$BF8= 500.13
##$BYTORDA= 1
##$CFDGTYP= 0
##$CFRGTYP= 5
##$CHEMSTR= <none>
##$CNST= (0..31)
1 1 145 1 1 1 1 1 1 1 1 1 1 1 1 1 1 1 1 1 1 1 1 1 1 1 1 1 1 1 1 1 
##$CPDPRG= <>
##$CPDPRG1= <>
##$CPDPRG2= <>
##$CPDPRG3= <>
##$CPDPRG4= <mlev>
##$CPDPRG5= <mlev>
##$CPDPRG6= <mlev>
##$CPDPRG7= <mlev>
##$CPDPRG8= <mlev>
##$CPDPRGB= <>
##$CPDPRGT= <>
##$D= (0..31)
0 1 0 0 0 0 0 0 0 0.06 0 0 0 0 0 0 0.0002 0 0 0 0 0 0 0 0 0 0 0 0 0 0 
0 
##$DATE= 1119530987
##$DBL= (0..7)
120 120 120 120 120 120 120 120 
##$DBP= (0..7)
150 150 150 150 150 150 150 150 
##$DBP07= 0
##$DBPNAM0= <>
##$DBPNAM1= <>
##$DBPNAM2= <>
$$ [...]
##$SUBNAM7= <"">
##$SUBNAM8= <"">
##$SUBNAM9= <"">
##$SW= 20.6930455092707
##$SWIBOX= (0..15)
0 0 3 0 0 0 0 0 0 0 0 0 0 0 0 0 
##$SW_h= 5175.983436853
##$TD= 65536
##$TD0= 1
##$TE= 295.16
##$TE2= 300
##$TE3= 300
##$TEG= 300
##$TL= (0..7)
0 120 120 120 120 120 120 120 
##$TP= (0..7)
150 150 150 150 150 150 150 150 
##$TP07= 0
##$TPNAME0= <>
##$TPNAME1= <>
##$TPNAME2= <>
##$TPNAME3= <>
##$TPNAME4= <>
##$TPNAME5= <>
##$TPNAME6= <>
##$TPNAME7= <>
##$TPOAL= (0..7)
0.5 0.5 0.5 0.5 0.5 0.5 0.5 0.5 
##$TPOFFS= (0..7)
0 0 0 0 0 0 0 0 
##$TUNHIN= 0
##$TUNHOUT= 0
##$TUNXOUT= 0
##$USERA1= <user>
##$USERA2= <user>
##$USERA3= <user>
##$USERA4= <user>
##$USERA5= <user>
##$V9= 5
##$VALIST= <valist>
##$VCLIST= <CCCCCCCCCCCCCCC>
##$VD= 0
##$VDLIST= <DDDDDDDDDDDDDDD>
##$VPLIST= <PPPPPPPPPPPPPPP>
##$VTLIST= <TTTTTTTTTTTTTTT>
##$WBST= 1024
##$WBSW= 4
##$XGAIN= (0..3)
0 0 0 0 
##$XL= 0
##$YL= 0
##$YMAX_a= 443284
##$YMIN_a= -551746
##$ZGOPTNS= <>
##$ZL1= 120
##$ZL2= 120
##$ZL3= 120
##$ZL4= 120
##$ABSF1= 16.27385
##$ABSF2= -4.419319
##$ABSG= 5
##$ABSL= 3
##$ALPHA= 0
##$AQORDER= 0
##$ASSFAC= 0
##$ASSFACI= 0
##$ASSFACX= 0
##$ASSWID= 0
##$AUNMP= <proc_1d>
##$AZFE= 0.1
##$AZFW= 0.1
##$BCFW= 0
##$BC_mod= 0
##$BYTORDP= 0
##$COROFFS= 0
##$CY= 12.5
##$DATMOD= 1
##$DC= 0
##$DFILT= <>
##$DTYPP= 0
##$F1P= 14.0000005364418
##$F2P= -0.99999901652339
##$FCOR= 0.5
##$FTSIZE= 32768
##$FT_mod= 6
##$GAMMA= 0
##$GB= 0
##$INTBC= 1
##$INTSCL= 1
##$ISEN= 128
##$LB= 0.3
##$LEV0= 0
##$LPBIN= 0
##$MAXI= 10000
##$MC2= 0
##$MEAN= 0
##$ME_mod= 0
##$MI= 0
##$NCOEF= 0
##$NC_proc= -4
##$NLEV= 6
##$NOISF1= 0
##$NOISF2= 0
##$NSP= 0
##$NTH_PI= 0
##$NZP= 0
##$OFFSET= 16.27385
##$PC= 1
##$PHC0= -80.01498
##$PHC1= 6.26998
##$PH_mod= 1
##$PKNL= yes
##$PPARMOD= 0
##$PSCAL= 4
##$PSIGN= 0
##$REVERSE= no
##$SF= 250.130062068159
##$SI= 32768
##$SIGF1= 0
##$SIGF2= 0
##$SINO= 400
##$SIOLD= 32768
##$SREGLST= <1H.CDCl3>
##$SSB= 0
##$STSI= 32768
##$STSR= 0
##$SW_p= 5175.98343685301
##$SYMM= 0
##$S_DEV= 0
##$TDeff= 65536
##$TDoff= 0
##$TI= <Analysis number 999999
Compound Code 99
Book Reference 9
Project Code 9>
##$TILT= no
##$TM1= 0
##$TM2= 0
##$TOPLEV= 0
##$USERP1= <user>
##$USERP2= <user>
##$USERP3= <user>
##$USERP4= <user>
##$USERP5= <user>
##$WDW= 1
##$XDIM= 32768
##$YMAX_p= 308779909
##$YMIN_p= -115815
$$ End of Bruker specific parameters
$$ ---------------------------------
##NTUPLES= NMR SPECTRUM
##VAR_NAME=  FREQUENCY,     SPECTRUM/REAL,   SPECTRUM/IMAG
##SYMBOL=    X,             R,               I
##VAR_TYPE=  INDEPENDENT,   DEPENDENT,       DEPENDENT
##VAR_FORM=  AFFN,          ASDF,            ASDF
##VAR_DIM=   32768,         32768,           32768
##UNITS=     HZ,            ARBITRARY UNITS, ARBITRARY UNITS
##FACTOR=    0.157963299565203, 1,           1
##FIRST=     4070.5789823474, 0,             0
##LAST=      -1105.40445450561, 0,           0
##MIN=       -1105.40445450561, -115815,     0
##MAX=       4070.5789823474, 308779909,     0
$$ Real data points
##PAGE= N=1
##DATA TABLE= (X++(R..R)), XYDATA
$$ [...]
17730a935j2903J6845j2187q753N111J222R515K1927K1402O694k0823j4509q662
17717B944R122k58k0844k4377q483K4408K1662J6434P715k8194m252J3599l6837
17704b7361O158J492J3707J953j3700m65M22j2666o392k970M076J2851M854J7808
17690b33P438J0250j3663n0038j2656K2616L5995P317L783p806K4555J493j9171
17677I880o857J8746k2952j2030M9886L1187l6048K830j6687l7041j0339J2146
17665a7279m367J072M482J0714J3728K07j2231r827K612P414J835Q570j143J253
17651G040m825j0761l4020q036L4808K3882J4054J1507M406j4572j1119J5487
17639B7851p993j2072Q082J1632O006K1920p581j165k2091k1473l188Q067j9626
$$ y = [-1935, -14838, 2007, -10180, -18933, -13822, -12600, -3085, 18842, 40244, 46938, 26115, 11606, 2944, 12066, 11808, -9036, -33413, -41896, -17488, 4174, 20608, 28323, 129, -4123, 9476, -27361, -21203, -19711, -6004, -4051, -17751, -18216, -17794, -30460, -36852, -39822, -35746, -22895, -18041, -233, 7205, 17455, 3792, -46246, -58902, -36286, -291, 7026, 10809, 3003, 27558, 29051, 9880, 3023, 21769, -1183, -13213, 36673, 67860, 31812, 34642, 17955, -19086, -29425, -17279, -21646, -20574, -16092, -5378, 8350, 8557, -3674, -13501, -10889, -3475, -1640, 6930, 5787, 7040, 2215, -8546, -42566, -50602, -15794, 8088, 22142, 33649, 38055, 23483, 12364, 27851, 19858, 7786, 15868, 27500, 33506, 55426, 47845, 46680, 24589, 3116, -72, 7995, -11631]
17626a1631q96L063K4096N268j3466J1368j0897J2935Q975j5478j3084k5430q356
17613c3533k463l485K4390J7181J7520k0145j9699K2970J8589j5519k2466j9893
17601c6553K8725L8952r439o658K2R774j349k1584j9315j4681Q27Q971K4666K2880
17587B5238p475j520q474P483K1771q82m2074k8330J9677R181J324L568j1476
17574a1989J57J8240O602n400N04l7887l412J6031n123k9084k2405K9317J9986
17561b4463j574N750l36L437J7440N140p074l0551r523L7992M0751o665q601K3393
17547D5116K2825L787J914l5692l7235J106q038n078m224K289L523j6668Q788
17534a7587n20J3372K484K0730K4752j9354m8823j18L272j3556K9667j2263k61
$$ y = [-11631, -12527, -9464, 14632, 19900, 6434, 17802, 6905, 19840, 28815, 13337, 253, -25177, -33533, -35996, -39481, -15091, 2090, 19610, -535, -20234, 2736, 21325, 5806, -16660, -36553, -7828, 31124, 21685, 15027, 15049, 24823, 23474, 1890, -17425, -32106, -31279, -22308, 2358, 25238, 17763, 16243, 7769, 15252, 37023, 36141, -5933, -34263, -14586, -5405, -4081, -513, -11989, -11832, 6408, 13010, 7610, 8114, -29773, -33185, -17154, -22277, -51361, -73766, -44449, -24463, -26037, -20287, -20623, -17186, 254, 5394, -1680, -32231, -41754, -3762, 36989, 30324, 21723, 45116, 67941, 71728, 73642, 37950, 715, 1821, -6217, -11295, -15519, -13230, -9707, -26375, -17587, -18107, -4735, -2251, 18479, 43231, 23877, -24946, -25064, -21792, -35348, -5681, -17944, -18205]
17521a8205K1544J2695j3546m0370J0801p631O520J7273j0989m872R018q84k3589
17508d2235j6853K8965J4200j5667K2748O435J7642J4687J0637j5712j8535m121
17496B191j7677p876L3548q90j9525K752r809K659j1214N000j0865L214K0200
17483h292j3871j0209O351K443m104j3582M703L8655J2003j0757j7969P250j4576
17470b1955P786O357l1518j691p9J0669K0886J1851J765j6568k0112J5708J4657
17457b244M510k294M502j5473j824r100M944O304Q983K8365M1700R400j1477J5912
17443H2208L9318L8216J4038l5556n3523l2210j3940J8845K0465k6420l5108J1017
17431B7350J5872j8463k4129j1981R772L1796M516j0245l8934k3034q466L9252
$$ y = [-18205, 3339, 16034, 2488, -37882, -27081, -34712, -28192, -10919, -21908, -26780, -17762, -18646, -42235, -59088, -30123, -15923, -31590, -8842, -2407, 15235, 29922, 40559, 24847, 6312, 2191, -15486, -23362, 10186, 9296, -10229, -7477, -17286, -14627, -25841, -20841, -31706, -28492, -8292, -22163, -32372, -26021, -23578, -27682, -41264, -36561, 2094, 14097, 3340, -14629, -7379, -21955, -14169, -7812, -39330, -41021, -41100, -30431, -9545, 2306, 4071, -12497, -32609, -16901, -2244, 2266, -28, 4474, -10999, -12823, -21923, -16979, -10675, -1692, 26673, 68373, 77773, 66296, 82208, 121526, 159742, 173780, 138224, 84701, 52491, 38551, 57396, 77861, 51441, 16333, 27350, 43222, 24759, 630, -11351, -1579, 30217, 34733, 24488, -14446, -37480, -45946, -6694]
17419f694L8528J3096l6583l6478r589J3407K7795j2582L560K4131J6586j3141
17407B2036P117k1059P247j9243j1117J1877J0929o054p215K480r595j2222J663
17394b3156J4882J3135L332p191J3360r536l123J3111K5396O262j7944k1349K148
17381I327l5473j1472k750M180O859m82j5566m675R398Q206P765J3925J4702R72
17367D916n213k9878j8165P066K4074L1943k440j6495j5476j0863J0964j9141
17355c8708K0202J8715j7379j6991N629N749K2084Q391L833j1222j3250j6407
17343b9354L2436j5426J5850K7566o975k6784r837J3163P226l0085l3381j918
17331e7519K7160o520K0930O974n194j4201k1175N269J0017J3127M601k0134N98
$$ y = [-6694, 31834, 44930, 8347, -28131, -37720, -24313, 3482, -9100, -5540, 18591, 35177, 22036, 29153, 8094, 15341, -3902, -15019, -3142, 7787, 1733, -5482, -3002, -12597, -24819, -23156, -8274, 4861, 8193, 1002, 14362, 4826, 1703, 14814, 40210, 46472, 28528, 7179, 9327, -26146, -37618, -40368, -36188, -29329, -29811, -45377, -50052, -40654, -32448, -24683, -10758, 3944, 4916, -297, -30175, -48340, -41274, -17200, 14743, 12303, -4192, -19668, -30531, -19567, -38708, -18506, 209, -17170, -34161, -28532, -22783, -699, 7692, 11525, 303, -12947, -29354, 3082, -12344, 3506, 31072, 24097, -2687, -12524, 639, 7865, -22220, -55601, -57519, -30359, -36879, -15949, -8975, -14169, -28370, -49545, -44276, -34259, -21132, -16531, -36665, -36067]
17318c6067K3383K7692R457j2402k9607j8269k2071Q78L0201N648J6008N852L041
17305C744q608Om954l6505J4000L4727j683K425J9320j1244r503J4772l771k0058
17291g332j776r205k595r119J0751K1450l730N054j2334k2031k0602j3975J2583
17278e2861K6364M1371k5566J3690K2616k9683l9823k53J0393J4336J5935Q439
17266D958K590J616l305j8603j060r377j3093j430L6170K6836o283J5821l872
17253C0968k6481k098J6320k9486L699J6092L170r348K5052j7916m087L341O20
17240I846J4607k5850j5237j6605j3718M913K2901Q904m154N474N514l331J1292
17227D556P355J4164k1841j7643l229K2462P125j7722j5287J3719R760j1542j3613
$$ y = [-36067, -12684, 15008, 24465, 12063, -17544, -35813, -57884, -57006, -26805, -21157, -5149, 703, 3744, -4864, -4858, -9812, -46317, -32317, 2410, 727, 3152, 22472, 11228, 1725, 16497, 12726, -7332, -9108, -18313, -20908, -30027, -19276, 2174, -1556, 3498, -8836, -30867, -51469, -65444, -52861, -26497, 14874, -10692, 2998, 25614, -4069, -43892, -44145, -33752, -19416, -3481, 4958, 7548, 9164, 5859, -12744, -13804, -23181, -36274, -37704, -1534, 25302, 19019, 34840, 30968, 4487, 2389, 18709, -10777, -7078, 9014, 12184, 2836, 27888, 9972, 5885, 9226, 9846, 24453, -1397, -16634, -33239, -46957, -42044, -19143, -10239, -14393, -8919, -3405, -6736, 4556, 11911, 26075, 4234, -13409, -16638, 5824, 12949, -4773, -20060, -6341, 3419, -8123, -21736]
17214b1736q933J4891J4780L91R773j6155j3926K504J3933m327J2423K828l6061
17201b9615k7015j2052N981J2539l887J7465R130J3600l6k724k177n987n450m867
17187c5095R970J2325j0053o669k709p101m363J409J9039J9492J4886r094j179
17174H58j3744k5538m099N122J1112o824j0812l8K1652J3989q821j921l8521l427
17160f1012K3320K9298J0713m399j9861q647K2153L5825K7828k742m0940n358
17148F178J3871O591m945j6950J1001J0195j5574R388k7246K483p951J611k3370
17135c4718k1413L3516K3751j0749r532q06J8166j0109n263J752J4135J235P585
17122G550k5603n323j1173j027k975J8011J7805P503J4674K1087N451p563j5609
$$ y = [-21736, -30669, -15778, -998, -607, 9166, -6989, -20915, -18411, -4478, -8805, 3618, 6446, -29615, -56630, -68682, -62701, -50162, -54049, -36584, -27454, -13854, -13890, -16614, -18791, -24778, -30228, -35095, -25125, -12800, -22853, -29522, -32231, -39332, -43695, -42286, -23247, -3755, 11131, 2037, 858, -12886, -38424, -42523, -37401, -26289, -33113, -43925, -43963, -22311, -8322, -17143, -19064, -57585, -61012, -37692, -8394, 2319, -2080, -21941, -30588, -8435, 27390, 55218, 52476, 11536, 6178, 20049, 26640, 21695, 4745, 15746, 25941, 10367, 19755, -7491, -5008, -12959, -11348, -34718, -56131, -22615, 1136, -9613, -19145, -19951, -1785, -11894, -17157, -15405, -1270, -35, 7550, -18053, -23376, -34549, -35576, -38551, -20540, -2735, 4768, 19442, 40529, 45980, 38417, 22808]
17109B2808n3854j3165P176j6K681R100J5687K057j0514l486O30K2791j7967j5867
17095c1939m645K671L5184J9486j7470l2888j5945m010K2733P335N913k215n227
17082b1017j6973j5327j6621j0806K2394L7556J4066Q234K545j451O087k0263
17070a1576O495L2026j3127o674j0894n342L724J1681Q98o661l431Q534r653k2238
17056b6238o664j2662k1101L8072M0529J2261j8999k1881k0039j509o592J4823
17044c0000J1485j3928K9688j0798j4237j6999J0269K2731M59o213K7388K6402
17032C6247k2627P519O355j8283K37r34r257J7970r54k912O593J619j5329J4707
17018B0951L418l3611l1328K6803K557J0196L824r083j7823O454Q647q363p292
$$ y = [22808, -31046, -44211, -37035, -37051, -34370, -25270, -9583, -7526, -18040, -21526, -20896, 1895, -16072, -31939, -36584, -33913, 1271, 20757, 3287, -29601, -45546, -49556, -26823, -19488, -13575, -15790, -21017, -37990, -53317, -69938, -80744, -58350, -20794, -6728, 1506, 4051, 2600, 8687, -11576, -5081, 26945, 13818, 7144, -3750, -9092, -5368, 6313, 7211, 550, -2881, 5653, -4000, -26238, -32902, -45564, -66665, -28593, 11936, 24197, 5198, -16683, -36722, -38231, -44823, -30000, -18515, -32443, -2755, -13553, -27790, -44789, -34520, -11789, -11330, -17543, 9845, 36247, 13620, 21139, 27494, 9211, 9448, 8514, -743, 17227, 16273, 13361, 19954, 21573, 6244, 20951, 24369, -9242, -40570, -13767, -11210, -1014, 2810, -6273, -24096, -17642, -8995, -17358, -24650]
17005b4650M652k8553p042J3522K5704L837J6966K0456j7761p454j2167r514Q865
16992a3139K0353j6896l097r942j7819K0056O810p764J2091p305Q81j5858N899
16979b5730L3339K2389j2081j5745j4561p502O543p604J2839N156r034m635J60
16966a6466O201j6200J1687K070J9723o62Q986j1366J8671k1844m2498q0J1773
16953c0005j2114K2781K9569l893j0523j4569J2192l201N740P584j3584k8742
16941c8765l7610J2147O809k38K6713J5594m070L749k286q003r054k1618J2464
16928d4168K7908K2345q756j9236j711m036J0171k7265P574L2274j53P4J180j998
16914e797L240p093P336M10q561l029j1426j104n032l4345l613K5432K1139J2015
$$ y = [-24650, -19998, -48551, -55593, -42071, -16367, -12530, 4436, 24892, 7131, -323, -12490, -22004, -13139, 7214, -9682, -12779, -22721, -40540, -20484, -13674, -21438, -9347, -16652, -15771, -31629, -25730, 7609, 29998, 17917, 2172, -12389, -19891, -13348, -20952, -8113, -2957, -11991, -16626, -16466, -10265, -26465, -14778, -12708, 7015, 6353, 15339, 3973, 22644, 800, -41698, -41778, -30005, -42119, -19338, 10231, 6338, -4185, -18754, -6562, -9763, -4023, 3561, -10023, -38765, -76375, -64228, -57419, -57657, -30944, -15350, -19420, -15671, -17957, -25960, -35014, -56632, -44168, -16260, 6085, -2671, -21907, -23618, -27654, -17483, -44748, -37174, -4900, -5053, -4979, -3799, -5797, -2557, -9650, -2314, -1904, -10465, -13494, -24920, -26024, -31056, -65401, -69014, -43582, -22443, -10428]
16900a0428n908J95n556k6159Q017J4340k023R469P783J4124P028J0203L6420
16887E7505j5288n972k2989L895R450j0290j0241O420j0986n311K724N165p948
16874c866m245p7J8811l1382J9580L5560j264k1696j8007K0094j5994p895J6037
16861E656L1372O279J9612k6838l650J4146n008o964k5751r979J5019j1939Q374
16848A0329j8104j0678J9740o063k6665J8173k3006M27K8824J638K8433Q836R701
16835D1585j9922k8795k3822J0855M046N936J4624O364J6778k3725q454j3229
16823a7759l2365q903Q799R71j275K1024O348O378m962J7583K0534j8894j7476
16810a9997j1150l043J5151K7125q314k1130M792L369J0952J0496j6637J1451
$$ y = [-10428, -16336, -16141, -21697, -47856, -39839, -25499, -27522, -18053, -10270, 3854, 10882, 21085, 57505, 42217, 36245, 13256, 17151, 26601, 16311, 6070, 12490, 1504, -3807, -1083, 4082, -3866, -8111, -8188, 10623, -20759, -1179, 34381, 33117, 11421, -6586, 13508, -2486, -10381, 5656, 37028, 43307, 62919, 36081, 32431, 46577, 41569, 34605, 8854, -1125, 13894, 1955, 10329, -7775, -18453, 1287, -4776, -31441, -13268, -36274, -35847, -7023, -5385, 23048, 31884, 41585, 21663, -7132, -30954, -20099, -16053, -10117, 4507, 10871, 27649, 3924, -4530, -17759, -50124, -59027, -50228, -49257, -50532, -29508, -23160, -16782, -21744, -4161, 16373, -2521, -19997, -31147, -34190, -19039, 8086, -228, -21358, -16566, -13197, -2245, 8251, -8386, 3065]
16798C065P936j2421j7368n578p427J0928q027J764L2136J0070k2361m335k1849
16785c3467j3025O889j1153J0547L3924r100j6417M0094O504l1505k600j2458
16773c1767o541L0181K1848K3256J1157j4715l7251j333Q93j5048P831J5843J3911
16760A8265K127j3502J1444N458j3611o37k398j3542j4109R540K069j3446R256
16747a3086L030J430M345j0803M487j6881J6687N272K4789J6980k3923o763M990
16734A0554K2429N344j9383n2451k7801j6109J8080L1821p655N047K0502J7484
16722G862p079J6899K7197j7417k3181k4792P809L123N920p247j4231R21J6262
16709g954n749M747L71k4950k8881M774K8795M306r615J5265r316k001n047l998
$$ y = [3065, 11001, -1420, -18788, -24366, -31793, -20865, -28892, -27128, 5008, 15078, -7283, -11618, -33467, -46492, -39603, -50756, -40209, -6285, -15385, -31802, 8292, 14796, -16709, -19309, -31767, -38308, -8127, 13721, 36977, 48134, 33419, -3832, -5165, -4272, -19320, -11489, 4354, 18265, 20392, 6890, 18334, 23792, 10181, 9544, 7146, -6396, -20505, -10965, -8896, -22342, -13086, -10056, -8626, -4281, -15084, -10597, -27478, -10791, -5519, 19270, 36250, 12327, 5564, 10554, 32983, 38327, 18944, -33507, -61308, -77417, -59337, -27516, -35171, -30124, -9622, 7862, 783, 17682, 44879, 27462, 4281, -20511, -12702, -9579, -3659, -10906, -25137, -24216, -7954, -13703, -8956, -8585, -33535, -62416, -57642, -28847, -24541, -34156, -18891, -28207, -30208, -35255, -39253]
16695c9253M73N618Q102P326j810k882J4274L4438K5291L2047j9080m9782j7944
16682c182J4880j9542j4547j6543j1231K1629L1354J2146k0743k1295O389J5221
16670e464J7179j1197m4064j4353Q078J4377L302p07J5178J3678q504j0305J8086
16657d716L0620L9213K1585j8892m1527l8444q538J8061J8449J5846J2030j2846
16645C0841l6462l610j9990k8860J1159M1012K6856p364k2835J4613K6583k1611
16633A0332j4071q555j2176j0524k701M15J6962P525k7875n866j2476J1566K1486
16620b5958R700r593j4897J323j7934Q910L2317J7791m465k7573K1025J5113o380
16607f21j6487P512n988M921k1223j9254o882K1897L0057l664r593N620J276P271
$$ y = [-39253, -38780, -33162, -25060, -17734, -19544, -22426, -8152, 26286, 51577, 83624, 64544, 14762, -3182, 11698, -7844, -22391, -38934, -50165, -28536, 2818, 14964, -5779, -27074, -20685, -5464, 11715, 518, -43546, -57899, -49821, -35444, -32142, -32849, -17671, -3993, -12497, -22802, -4716, 25904, 65117, 86702, 67810, 26283, -12161, -20699, -2638, 15811, 31657, 43687, 30841, -5621, -9231, -29221, -58081, -46922, -5910, 20946, 13582, -9253, 5360, 31943, 10332, -3739, -12294, -24470, -34994, -37695, -37280, -20318, -12793, -40668, -46534, -59010, -47444, -25958, -16258, -25851, -40748, -39425, -57359, -48449, -16132, 1659, -2806, -30379, -9354, 5759, -621, -17108, -9596, -15584, -10663, -31886, -51140, -58022, -36125, -6068, -9732, -19325, -13705, -12429, -5158]
16593e158Q695j6657j4340L719J0064j4805j5169J8597K9448J5705P303j1596
16581A5806K5541m164k5968j7549J990j0859m030J7820K792j1661j1070j0055
16569c1407K2910K4757n258K034O104j8328J0072N121k7725k3181J1337J287j1941
16556c4218K2155o668m253J679M943K8867k0118M34K7076j6302k0062k0379o902
16543d3748K0200O17N907J562J2203K2518L790l494p993l461K140M411J9228k3301
16529A0579l7289j9706J54M207J6704Q676J5048R774J6089K1932j0599j8785j368
16516A5416O091k268J0687m7124k9906J8128L5211J2278k3823N785J050m3235
16504d1710m889Q251P131j097q379Q032K4573J7888j5528R334j029J3796J5786
$$ y = [-5158, 3537, -13120, -27460, -23741, -13677, -28482, -43651, -25054, 4394, 20099, 27402, 15806, 41347, 37183, 11215, -6334, -4344, -15203, -19233, -1413, 1379, -10282, -21352, -31407, -8497, 16260, 11002, 13036, 19140, 812, 10884, 16005, -11720, -34901, -23564, -22277, -34218, -12063, -18731, -22984, -21305, -16362, 12505, -7613, -7179, 19897, 3595, -16467, -36846, -43748, -23548, -22931, -17024, -15462, -3259, 19259, 23049, 19555, 11562, 8101, 10241, 14652, 33880, 10579, -26710, -46416, -46262, -42055, -25351, -16675, -1627, 8147, 24236, 46168, 35569, 16784, 15416, 21507, 19239, 29926, -17198, -47104, -28976, 6235, 18513, -5310, 475, 1525, -41710, -46599, -38348, -31217, -32314, -40693, -32661, -8088, 9800, -5728, 3606, 2577, 16373, 32159]
16491C2159j2510N595K7332N928l3282j6391j7544j904q199L816L0961J2618M670
16478C3249k7120j5003P005j8742j9019K5391K4676K305O869J5808j8280j3916
16466C223M456L320J4417P847k9134k7186n58J4780k338K2186L705p977j8102
16453a1361L578J6150j0579N633o416k538r030R830J8738q153l148n683q678o976
16439a8633K4844J4713N867K2377j3120m4908j1889J6978R744k3094j1206P271
16427b1056L9637j246m8585m1161p814M5457J7767J3914l554r849M216R74L774
16414g526J676J0587J9807K3195l022O908j2797l7369j5842J053K4022K1809o872
16401B5629k3671K654J997o653k423l4007j07J3073j1884j3815J9152o23J7008
$$ y = [32159, 19649, 25244, 52576, 58504, 25222, 8831, -8713, -10617, -18816, -15000, 15961, 28579, 33249, 6129, -8874, -1869, -20611, -39630, -14239, 10437, 12742, 19611, 35419, 17139, 3223, 7679, 10999, 25416, 33263, 4129, -23057, -23615, -8835, -11173, 11013, 14718, 6741, -11361, -7783, 8367, -2212, 3421, -2995, -5533, -14563, -4733, 14005, 5852, 2704, -2979, -11657, -18633, 6211, 20924, 26791, 49168, 36048, -8860, -20749, -3771, 5973, -17121, -28327, -21056, 18581, 17335, -31250, -72411, -80225, -34768, -17001, -3087, -6641, -16490, -12274, -11300, -7526, -5850, 4737, 24544, 47739, 44717, 51625, 38828, 1459, -14383, -13330, 10692, 32501, 25629, 1958, 4612, 6609, -44, -2467, -36474, -36581, -23508, -35392, -49207, -30055, -30678, -13670]
16388a3670J8087J4235j459m097m0896o22J0118J3341M490r208j7375o580K7500
16375f136p824j3601J8119q648j600j0225n690K4277J7162K219Q323n781l1763
16362b1168l2194j251M292N334K6178M886k7069n168k8358j2316P722M1780m4
16349c7376m1700J302M1028K5216N543j8728M689J5042J9682j5165l6242L904
16337c2805J8270J2736J8247J0935O575l382p370j3014l865O776N975n530K1522
16324C5070M145O458l0239k1292k4684j5941K0663Q970Q550R016j5103o827K5043
16311C829m029k2060q838j3788J922J3497L021m905J843j0944P413k586O256J0115
16297a9254l493Q017j5925k6680j673J0411J1058K6978m356j6142k379L523m11
$$ y = [-13670, 4417, 18652, 17193, 13096, -27800, -28422, -18304, -4963, -473, -9681, -27056, -33636, -6136, -13960, -27561, -9442, -18090, -19690, -29915, -35605, -11328, 5834, 8053, 16376, 10595, -21168, -53362, -54613, -50321, -44987, -18809, -13923, -40992, -46160, -74518, -86834, -79112, -37332, -37376, -79076, -77774, -36746, -11530, -5987, -24715, -20026, -4984, 14698, -467, -36709, -32805, -14535, -1799, 16448, 27383, 33958, 30576, 23206, 10192, 6327, 13103, 19078, 13548, 35070, 39215, 45673, 15434, -5858, -30542, -46483, -25820, -16850, -8300, 716, -14387, -21214, 3829, -200, -22260, -31098, -44886, -42964, -29467, -26446, -31351, -29508, -40452, -33039, -35625, -29369, -19254, -22747, -14730, -30655, -57335, -59008, -48597, -37539, -10561, -14917, -31059, -33438, -29915, -30326]
16284c0326j115L5355J8596k0846j0437Q291j2178r3J9615J2404R05K291k2315
16271A47j114l667j525r184p902J5912k848N694k707k811r863j9051O674L2106
16257a39j3965J7910J7901J926l801j243L7544M180m760l2747k9320j4151q682
16244b9347L0481J1380k7179J2529j4614k2387J4195K1030J2307j3206q149P06
16232a2254k102l470n188M337Q687r638j5356j1909l67M666J2804K2294L561J8905
16218A4970J3320l8818k0035J0258j7503L6121n02m7357n746l028K9750K4828
16206c742J7398Q570j2041j1321O433Q981L129j6118p888L936m850j3732p558
16193b8803n8O686M551M306J0675Q380N105J3908R762j1134k7917L3249m036m3379
$$ y = [-30326, -31441, 3914, 22510, 1664, -8773, -482, -12660, -12753, 6862, 19266, 20171, 22462, 147, -967, -4634, -6159, -15343, -23245, -7333, -10181, -4487, -7194, -10005, -19868, -38919, -32245, -139, -14104, 3806, 21707, 23633, 19832, 18589, 56133, 60313, 55553, 22806, -6514, -20665, -29347, 1134, 12514, -14665, -2136, -16750, -39137, -24942, -3912, 8395, -4811, -12960, -12254, -14356, -17826, -23014, -18677, -9990, -19628, -34984, -46893, -47260, -42594, -29790, -7496, -3935, 14970, 28290, -10528, -30563, -20305, -37808, -1687, -2189, -49546, -55292, -58320, -28570, -3742, 13656, 22226, 10185, -1136, 5297, 14278, 17407, 1289, -6599, -2663, -7513, -21245, -28803, -28861, -22175, -17624, -13318, -2643, 5737, 10842, 24750, 34512, 23378, -4539, 28710, 24674, -18705]
16179a8705j2982j2137N630K3068N051J4529J3248J5286k5499J6605J3831k5743
16167A2182k5523k2594J392j12K5546J0758k2295j6852L965L7242K0268l72j9006
16154D599m9462q245K5413J3632Q24J687l237O291J7150j0989L595l891J8399
16141A5766J8294k5422k164k3175k7795q190R152L923p041j1359K1045K7311p413
16128a7068M250K0805J1487J4451J0079k1239j7406J1377l812j2663r206O465
16116b480J0024O297P957j2038k9386k2835j1357k1228j608o702M849o580J3426
16103g1661O236p96K602K0919N886L2466M2223l7270m1590K0212J3521O044j4347
16090a5555l1700p763j2736M6447J6088J123O446l4519p446J4813N413j725R102
$$ y = [-18705, -31687, -43824, -38194, -15126, -10075, 4454, 17702, 32988, 7489, 24094, 37925, 12182, -13341, -35935, -34543, -34655, -9109, 1649, -20646, -37498, -33533, 3709, 23977, 23605, 4599, -44863, -53108, -27695, -14063, -13239, -11552, -14789, -8498, 8652, -2337, 1258, -2633, 15766, 34060, 8638, 6474, -16701, -44496, -52686, -43534, -39611, -46652, -58011, -36966, -9655, -17068, -12818, 7987, 19474, 33925, 44004, 22765, 5359, 16736, 12924, 261, -8945, -2480, 7544, 13841, 21798, 9760, -19626, -42461, -53818, -75046, -76654, -83356, -78507, -85087, -71661, -65425, -66221, -63619, -42700, -36814, -4348, 37875, 605, -40985, -20773, -7252, -1208, -15555, -47255, -55018, -67754, -21307, -5219, -4096, 2350, -32169, -39615, -24802, -19389, -21114, -12012]
16077a2012J1497M224q523M0254k619J4581j3937k318P600p781r90M038J2161
16064D6175o553m9704l9603Q250o93J0135R080j187J1305l915j602j5906j5605
16051d9823J3257j911j4286m597j579K7910K7674R759r394p890j6197P140p847
16038b7784J680K8157J0229J4022j0656P772k1504l7718K831J1249J100J6994
16026c628k8419j9855J9283J5263k497j0329r774J2216O621j2369R641K1677M080
16013A910Q811M165j1310j5430k0750m506j7138P157J2561J4235M837P522k266
16000a0202Q635M223p038j2144J0569K3734K2252o744m7864k5398J5393l915j7637
15987d6136L0049L0681j6021q070m756j347J3401j5491Q185L2927R783q015K037
$$ y = [-12012, -515, 3709, -4814, 35440, 32821, 47402, 33465, 31147, 38747, 30966, 29976, 34014, 46175, 39622, -10082, -49685, -41435, -42128, -31993, -22913, -24100, -12795, -16710, -18312, -34218, -49823, -36566, -38477, -52763, -57360, -58939, -31029, -3355, 6404, -2990, -10880, -27077, -19937, -27784, -26104, 2053, 12282, 26304, 15648, 23420, 1916, -35802, -32971, -21722, -20622, -3628, -32047, -51902, -32619, -17356, -19853, -30182, -39956, -27740, -21119, -33488, -23847, -2170, 1910, 10721, 14886, 3576, -11854, -32604, -37110, -54248, -47091, -34530, -20295, -15458, -7936, -10202, -1567, 2656, -4382, -16526, -5957, 17777, 40029, 33285, -14579, -39977, -24584, -28499, -46136, -16087, 14594, -1427, -9497, -14253, -15600, -2199, -17690, -9505, 23422, 33205, 25190, 27227]
15974B7227j6513j3749J807J995k978P893J1482l300J157k815j0262j0208j5461
15961b3725L229K349l3374k1604M998j672q161o611K5422Q275j4601L188j69K6261
15947c6195K694j4626L0929j538o872J3790R87P308R175J4054J5601j6418k2226
15934c337k200K0048O897Q354J6731q54K2877K9751J4530L7003N4641K9619O07
15921B34667o019j0161l3175o4241m7884k2416J9960J724K5379O284q254k4062
15909G1802m4471j9002J5219K2390J5954q962J5678m51M551o990n319l6607K832
15896B6624L4745k2527K5118J5729j248j4702P946L5343J6633j4345J700L8638
15884A49654R1228Q9118O4347N5308N0284j2040q7572o4548m5010j6013j9744
$$ y = [27227, 10714, -3035, -1228, 767, -2211, 5682, 17164, 13864, 15021, 12206, 1944, -8264, -23725, -20496, -18147, -51521, -73125, -68127, -69799, -77960, -84571, -59149, -50874, -65475, -62287, -62456, -36195, -33501, -48127, -17198, -18736, -25608, -11818, -10831, -3523, 5652, 19706, 35307, 18889, -3337, -5537, 14511, 21408, 29762, 46493, 45639, 68516, 98267, 112797, 149800, 204441, 234060, 234667, 228648, 218487, 185312, 121071, 73187, 50771, 70731, 72455, 97834, 104118, 95864, 71802, 27331, 8329, 23548, 45938, 61892, 52930, 68608, 68157, 72708, 65718, 60399, 23792, 26624, 61369, 38842, 63960, 79689, 78441, 63739, 71685, 107028, 123661, 109316, 111016, 149654, 240882, 330000, 394347, 449655, 499939, 487899, 400327, 335779, 290769, 274756, 255012]
15873B55012l0904l7898K519R155j2876l6555l3327K2619K7603K5229M4456L835
15861B38868j6853j1067M379R400R40k299j553m371j934j6762k3031j5342K2266
15848A82641L5605k893l2552j0792n719M28J3380K2248K8443N6196K8633j3502
15836C02116l3350k6743n4398n0727O31O885j2474K3782R87O609L7978L8420K8398
15823B68114L1631N0450O6064N7398M3744L7715j1337L1773J6863J4532j3186
15812E93761k717k8975l9997m3175m4804p7983o6173m3102l1012k2529P591M525
15800B05410j9909l7042j1791K5933J0086J549j7196l33L977N965j9053L8717
15788A86313J5280K3694l285n04J9062K1582K3818K5932J7291K6972N3090J07010
$$ y = [255012, 224108, 186210, 188729, 197884, 185008, 148453, 115126, 137745, 165348, 190577, 235033, 238868, 222015, 210948, 215327, 224727, 225667, 223368, 221815, 217444, 215510, 198748, 175717, 160375, 182641, 218246, 215353, 182801, 172009, 166290, 166718, 180098, 202346, 230789, 286985, 315618, 302116, 268766, 242023, 187625, 136898, 137529, 144414, 131940, 155722, 156709, 163318, 201296, 239716, 268114, 299745, 350195, 416259, 473657, 517401, 555116, 543779, 575552, 592415, 606947, 593761, 591044, 562069, 522072, 478897, 434093, 356110, 289937, 246835, 215823, 193294, 200885, 205410, 185501, 148459, 136668, 162601, 172687, 174236, 157040, 156707, 160684, 166649, 147596, 186313, 201593, 225287, 222002, 221498, 240560, 262142, 285960, 311892, 329183, 356155, 409245, 516255]
15776E16255Q0443P6437L7178k8713l7328m8789o7311K435j3413j9549l2439n0965
15764D14241o2735k5251p071k6134l7335j2510k1670N043K5817L5907m963R001
15752B92340J7676K4193N7451R712k3804l004l9326m8698n2125k0833k4259J1193
15740B00516L3730J649j3791L937J1304K4134K5631K1960N3168o600J361J7300
15728C74299k2607p7366j1076J0703k7431p993j3751k3320N529m607r609K1173
15716B13944L0969J7479J1407L8286N0791M4128O2455J12425P3647L7435l0008
15705F62958q9255j01432r6396n2620l8285l8663k8170p046l5557k0442K4955
15694A80047R432k4615j8890k285k283l6388j3471R368J3396P626j0887o963n073
$$ y = [516255, 596698, 673135, 710313, 681600, 644272, 595483, 528172, 530607, 517194, 497645, 465206, 414241, 351506, 326255, 319184, 293050, 255715, 243205, 221535, 226578, 252395, 288302, 283339, 292340, 310016, 334209, 391660, 401372, 377568, 374564, 335238, 286540, 234415, 213582, 189323, 200516, 234246, 235895, 222104, 226041, 237345, 261479, 287110, 309070, 362238, 355638, 356999, 374299, 351692, 274326, 263250, 273953, 246522, 238529, 224778, 201458, 206987, 202380, 192771, 213944, 244913, 262392, 273799, 312085, 362876, 407004, 469459, 581884, 655531, 692966, 662958, 573703, 472271, 375875, 323255, 284970, 246307, 218137, 211091, 175534, 155092, 180047, 189479, 164864, 145974, 143689, 141406, 105018, 91547, 100915, 114311, 121937, 111050, 104087, 99014]
15681I9014j6175j37J2744k0928m389L3568K9923J0855J7046j2245K7178L4004
15669B10458M4986L7286L8181L8430J448m791O97m2650n8877m7066l2914k2634
15657A62554l6173j3631k6042p943O038K4651j5219j8602j4940n513K4812J6924
15645I6916j4661k9993l4149J7046Q024M284K4267m057j9785P607j4439K1218
15633F2278r614j2949J3854J940j3894j1498j1486m822R012L3416J1652k1557
15621D6332l0091l50L6082l8949j4386q064k0656J0104L5424k4353l3818K9173
15609a3552J5850r021k8364j6355K1305L5336K4836j0564k8762l1508J026Q801
15597c0972o149J0673M1281q32J3904p417j5451J5066M239j3672r482K242k6757
$$ y = [99014, 82839, 82702, 95446, 74518, 70129, 103697, 133620, 144475, 161521, 149276, 176454, 210458, 255444, 292730, 330911, 369341, 370789, 365998, 366695, 324045, 265168, 218102, 185188, 162554, 126381, 112750, 86708, 78765, 84803, 109454, 94235, 75633, 60693, 55180, 79992, 96916, 82255, 52262, 18113, 35159, 43183, 47467, 71734, 67677, 47892, 55499, 41060, 62278, 52664, 39715, 53569, 55509, 41615, 30117, 18631, 13809, 22821, 56237, 67889, 46332, 16241, 15891, 51973, 13024, -1362, -9426, -30082, -19978, 15446, -8907, -42725, -13552, 2298, -6723, -35087, -51442, -30137, 5199, 30035, 19471, -9291, -40799, -39773, -30972, -37121, -26448, 14833, 14001, 27905, 20488, 5037, 20103, 24342, 10670, 1188, 3430, -23327]
15584b3327J0560J2327J7102k4153k6883J2465K0977k723n923J3707n234n520
15572f625j534j0491J1736j2627j4325o545J576L6107j1583m023J3805O123P723
15559I317j9427j1472J8047l242K461Q544k0203l5889j3062J0515K3165P796J3187
15546a0263j0104k5095L6697K1205J9928l980j4492j2144j5104k02K674j0004
15534b0884k0053n953j0993m749K9659o571J2914O589J360j0522k616K092J6485
15521a3242m129J0238J5285L569k0988P93k093j809m036M275P607l080j6582n703
15507b9895K5345Q740J084P117k668l7755j3072K3760J1275Q28k8019j7768L3152
15494a7876R36n556R425L4826K2819j7851j1649J0013j6215l395j2448k9244O562
$$ y = [-23327, -12767, -440, 16662, -7491, -34374, -21909, -932, -3655, -9578, 4129, -1105, -6625, -8159, -18650, -6914, -19541, -33866, -40411, -38835, -2728, -14311, -18334, -4529, 1594, 9317, -10110, -21582, -3535, -6777, -4316, 4228, -15975, -51864, -64926, -54411, -31246, -23450, -10263, -20367, -45462, -8765, 12440, 32368, 28388, 13896, 1752, -13352, -13554, -10880, -20884, -40937, -46890, -57883, -62632, -32973, -39544, -26630, -20041, -18681, -29203, -31819, -29727, -13242, -17371, -7133, 8152, 11721, -9267, -8474, -10567, -12376, -16412, -12137, -4530, -7610, -24192, -29895, -4550, 4190, 5274, 12391, 9723, -28032, -41104, -17344, -6069, -5241, -33260, -51028, -17876, -16940, -22496, -13071, 21755, 44574, 26723, 15074, 25087, 8872, 5477, -6971, -36215, -29653]
15481b9653K5371J0002P657J5409j0656l6077L0086r112k8328k334K3816L7610
15469C3791r269p780q966q808K166j693k0134j17j637J0951J3326J5318L8033
15456E5181J7398P06k7205n043L057K2500j8038k7904j5273k4294m691J0931j2451
15443b5126j5741M321K9564M0727O309k4616j1113p729j9582j9205o482M252Q267
15430c6154m035l377J7268o050J043l0796P090J1599K7190L0624L1755k5327j3059
15417G771k6265k6115m174L2188j8000K573j4420q832j7240l566K1359J5902K6060
15404a2759j5422k4155l799J1840M737K0919J6068k0102j1392L637j4160J9216
15392b5372M0608j323k9036M397L8045J5026p890m0868j6499j6160L312K2009
$$ y = [-29653, -4282, 5720, 13377, 28786, 18130, -17947, 12139, 3027, -25301, -27635, -3819, 33791, 24522, 16742, 7776, -1032, 1134, -559, -20693, -20810, -22447, -11496, 1830, 17148, 55181, 72579, 73285, 46080, 41037, 44094, 66594, 48556, 20652, 5379, -18915, -23606, -12675, -25126, -40867, -36546, -6982, 33745, 40054, 15438, 4325, -3404, -22986, -42191, -48673, -44421, -36154, -40189, -43566, -26298, -32348, -31305, -62101, -55011, -43412, -16222, 14402, 46157, 20830, 7771, -18494, -44609, -48783, -16595, -34595, -32022, -46442, -55274, -72514, -76080, -54721, -38819, -12759, -28181, -52336, -56135, -44295, -39558, -18639, -2571, -22673, -34065, -30428, -44588, -25372, 15236, 13913, -15123, -10726, 27319, 42345, 34455, -6413, -22912, -39072, -35760, -13751]
15380a3751J0042j0749j0749J3275k666P771L277L690o230l624N550q812k7033
15367d0009Q537k565K915o017R890K7758M779m6567J1567L264L060K366J1523
15354i499J8660J142k271O961l70j5728R532j0760k1902J2408K0780J0995j3340
15341F608j1695P837J2733q543o715j6623j7277k8392J7098k0042K388N410J4259
15328d2954L8770J5605m230j0074P213l6082k8773K1514K6490m073r231L7149
15316A1324j5428l2401k304K0892N711O277k6068l3965n149J6326J3426L1664
15304i695J6987K750k6953j0059J2254J3811l713o1316r906L5259K9718K34k2049
15291c2678L660K0134k968J5868L807n232J2470L5493M980o4233l1098K2072r697
$$ y = [-13751, -3709, -14458, -25207, -11932, -14598, -6827, -3550, 140, -6090, -9714, -4164, -12976, -40009, -31472, -34037, -31122, -37139, -27249, 509, 5288, -41279, -29712, -26448, -23388, -21022, -9499, 9161, 10303, 8032, 14993, 14623, -1105, 8427, -2333, -24235, -11827, 8953, 19948, 6608, -5087, 2750, 15483, 6940, 225, -16398, -33675, -62067, -44969, -65011, -62623, -57213, -42954, -4184, 11421, 7191, -2883, 4330, -31752, -60525, -39011, -12521, -16594, -25825, 11324, -4104, -36505, -38809, -17917, -12206, -5929, -31997, -65962, -71111, -54785, -41359, -9695, 7292, 10042, -16911, -26970, -14716, -905, -4618, -65934, -75840, -40581, -10863, -10629, -32678, -29018, -8884, -11852, 4016, 7823, 2591, 15061, 50554, 55534, -8699, -39797, -17725, -27422]
15278b7422j5026l730P598K3492J1411J1383J912j3470l811O095j5328l483Q301
15265a2078O765j7651j9041J0338J7458L23J0524k534L6148k3437k9240J3254
15253i171r722Q025P491j1834l8902M523K1573J9974K1774J6327L549n669K073
15240C0011J4510j2145l7150l3790j1697P026J7090L3025l174p093j1775O825
15228h337L1967m871O737l2912l3624j1185k5727j1854K4657L5833J9998r967
15216a9285M837P64k996J1233r084J9051Q023r419L765K8012P505j3568j3700
15203A5138k5149J998j699j32J1680j1987M89k9397j7346j823K8343P601N585
15190a6699J329N381L4105J6564k2443l642j7413j3021p230q431O35O774J7370
$$ y = [-27422, -42448, -46178, -38580, -15088, -3677, 7706, 9618, -3852, -7663, -1568, -16896, -20379, -12078, -5313, -22964, -42005, -31667, -14209, -13886, -3362, -5896, 30252, 6815, -22425, -9171, -18893, -10868, -3377, -15211, -54113, -49590, -28017, -8043, 13731, 30058, 33607, 27938, 30011, 44521, 32376, -4774, -38564, -50261, -43235, -26145, 6880, 3706, -3387, -15162, -8337, 23630, 18759, 25496, -7416, -41040, -52225, -77952, -89806, -65149, -29316, -9318, -19285, -14448, -13684, -16680, -5447, -14531, 4520, 12543, 3124, 6889, 34901, 42406, 28838, 15138, -10011, -8013, -9712, -9844, 1836, -10151, -9662, -39059, -56405, -58228, -29885, -22284, -16699, -15370, -9989, 24116, 40680, 18237, 14595, -2818, -15839, -23069, -31500, -30865, -24091, -6721]
15177f721L6345M4j2762j2480m554j9757p333K0079J9039j9580j1457K2536L5319
15164C8718p051k2643j1712n710K916j3196j616J0842P22J1802J9353J0718k7500
15151E643k4245O49j539o083P359q951j28k808O459L308o118K7656J5992J4967
15137C2161k6698k1993p889J6225n599M93k2520k439J4272M3633J8965K2660r736
15124E1535l8717r939j707j0004N711j1992Q255J0760r744m109j9918O218K011
15111b1640j9656k3096o806K25K0119j6186J8744L3529r058J3693m057m185Q718
15098i656J4688j4972J416J9936N918J506K2462O331k6213m3968o267L352k1642
15085d7109M011K5378J6396o598j1350j9603l305P898l487q377M470Q616K7165
$$ y = [-6721, 29624, 29668, 16906, 4426, -128, -19885, -27218, -7139, 11900, -7680, -19137, 3399, 38718, 31667, 9024, -2688, -8398, -5482, -18678, -20294, -9452, -8730, 3072, 22425, 33143, 5643, -18602, -17953, -19492, -25575, -18216, -27167, -27295, -30103, -23644, -20336, -26454, 1202, 17194, 32161, 5463, -16530, -24419, -8194, -13793, -13300, -35820, -38259, -23987, 19646, 38611, 61271, 51535, 12818, 2879, 1172, -8832, -3121, -15113, -6858, 3902, -5842, -9951, -29869, -23651, -21640, -41296, -64392, -71198, -70973, -50854, -67040, -48296, -14767, -23825, -10132, -14189, -18374, -9656, 5032, -9940, -8524, 11412, 17330, 18836, 41298, 47629, 21416, -22552, -28819, -25467, -47109, -43098, -17720, -1324, -7922, -19272, -38875, -42180, -34282, -37769, -46146, -41676, -33060, -5895]
15072e895J3023O776j6634m606p253j2429J4586P124N883J1145l171m756p882
15059d089J6258j5003n024J0272L714j9779j2669J7265K8255j0880K3703M3662
15047G5685J705j8909j9924j550N194q7j3000l9876j8599j2591m495J140J5905
15034b9402n03j5794m396O564K9259K8721P079j4387j9027J3193L6238p149j5514
15021A4882o682k6941j4407J492J1447P404k523K110J6927J0742Q677q715K3859
15008C8272P755r305N130K8870O4169M2152L2145Q0345R7866N3721k1497p5187
14996C44436p4229n9752l4459N217l2146k9129j5706q007k7120j1732r057l059
14984D5257j6364K179m81n230j0251J2255j1636k836J3099K2413L723j0213j8177
$$ y = [-5895, 7128, 13904, -2730, -7336, -14589, -27018, -12432, -5308, 575, 11720, 8549, 3793, -4089, 12169, -2834, -7858, 2414, 6128, -13651, -26320, -9055, 19200, 8320, 32023, 75685, 77390, 58481, 38557, 37007, 42201, 42114, 29114, -10762, -29361, -41952, -46447, -45307, -29402, -29905, -45699, -50095, -43531, -14272, 14449, 21528, 7141, -11886, 1307, 37545, 30396, 14882, 8200, -18741, -33148, -31656, -20209, -12805, -15328, -13218, 3709, 14451, 23128, 14413, 38272, 46027, 36722, 41852, 70722, 134891, 177043, 209188, 289533, 387399, 441120, 419623, 344436, 270207, 210455, 175996, 181213, 149067, 119938, 104232, 96225, 69105, 57373, 48316, 45257, 28893, 31072, 30591, 25361, 15110, 27365, 15729, 12893, 25992, 48405, 52128, 41915, 23738]
14971B3738j7977L595L970J3684J2077j1999o147N979k5429J7887J283l074j7761
14958a74j0230j4550j2166K9613N968l366J3729M0329K4048k2456m1578j7042
14946g875p807K0108P490j3282m833k3223j1925j0614j3238J6262J4550M698n343
14933c5032k4122J1951M3093J4541j8636L669R951K7861J0839r010k4192j8856
14921g943j6114l609J0600J760J631L1553p121O46K669j0453K0647M501j7094
14908A1673J59r821R018j0209j3417K0463K381j028j6372j4739j6021j457K9675
14895i695K3728m80L278j5990j1393J4752k3943j9288J7502J9152K4206p609K628
14882A6848l310o660K2610Q966k1280N513L0509k575o359j2784k0773j3792p66
$$ y = [23738, 5761, 9356, 13326, 27010, 39087, 27088, 20941, 26920, 1491, 19378, 20661, 17587, -174, -10404, -24954, -37120, -7507, -1539, -4905, 8824, 49153, 73201, 50745, 9167, -7875, -15682, 4426, 11916, -1366, -6199, -29422, -41347, -51961, -65199, -48937, -34387, -29689, -35032, -59154, -47203, -4110, 10431, -8205, -4536, 5415, 33276, 44115, 35105, 10913, -7943, -24057, -27666, -17066, -15306, -13675, 17878, 10757, 11403, 14072, 3619, 24266, 28767, 11673, 11832, 2011, 11029, 820, -12597, 7866, 10247, 9219, -7153, -21892, -37913, -39370, -9695, 14033, 13553, 16831, 841, -10552, 4200, -19743, -39031, -21529, -2377, 21829, 14220, 16848, 13538, 6878, 29488, 38454, 17174, 22687, 53196, 50621, 44262, 31478, 10705, -3087, -3853]
14869c853p011N05r909p497m71j2417k0648L297K897K109L3241K4130L994J712
14855A0079k155J0014K041k704J5513Q765J2230m157j2657K5029j7588l3225q381
14842B804P855P163M993j3438J3225k6903K452O715j8169J4859K9498O301j9587
14829A7768q261N693p104J550j3461K2561N9851M6853j1183o355m207J8625N609
14816A27939J5464J2096j2954M4425N1195O5042N5533M5278k3124j0937L5508
14805D05465M8190N7999N7680J09877J48732J37490O4324k3122o5400o5523k6718
14794H48994K3232P8646J37381J46707J01763q495p5778j42218j63783j15146
14784H31303m5586N706O153M978M368o21p9577j14581q3030l7825l1935k978K0132
$$ y = [-3853, -10864, -10359, -20268, -27765, -28236, -40653, -61301, -58004, -55107, -52998, -19757, 4373, 8367, 10079, 7924, 17938, 19979, 17275, 32788, 41553, 53783, 49626, 36969, 61998, 44410, 11185, 2804, 10659, 17822, 22815, 9377, 22602, -4301, -1849, 4866, -13303, 1556, 31054, 37355, 17768, 9507, 15200, 8096, 9646, -3815, 18746, 78597, 125450, 114267, 107912, 103705, 122330, 127939, 143403, 155499, 142545, 186970, 238165, 303207, 358740, 404018, 380894, 369957, 405465, 453655, 511654, 569334, 679211, 827943, 965433, 1029757, 1006635, 941235, 875712, 848994, 872226, 950872, 1088253, 1234960, 1336723, 1328228, 1252450, 1110232, 946449, 831303, 785717, 791423, 797576, 802554, 806922, 806301, 726724, 612143, 529113, 491288, 459353, 456375, 476507]
14771D76507N183n018L668J4291J6244K1116O2623R9291J03825O1277K6193M4026
14759I29226K801K5034R9404J20031J26243P9171j3654o7098n0319l2919Q663
14748A226583K9013J4808k5586m3348l5450l8444q1695j08869o1619m7158n6913
14737G71322m1256k0097l7919o2584m0548m1176l8568j1381L154l5652m5306J0583
14725D10572P169j5560N909j918l0143j2919j6392j6980j7610k3251j493K3420
14713C10804J8659J6957n219M005j0127M761k3354m374M8032K0387K0572L1580
14701D32683N6290N7884P7876J28749J60421J60424J27950J18128Q5341J03777
14691A509523O1490O1414J37391K26507K03938O8695K068j385l3340j61573j72612
$$ y = [476507, 481690, 476672, 480340, 494631, 510875, 531991, 594614, 693905, 797730, 859007, 885200, 929226, 932027, 957061, 1056465, 1176496, 1302739, 1381910, 1368256, 1301158, 1250839, 1217920, 1226583, 1255596, 1270404, 1244818, 1201470, 1166020, 1127576, 1045881, 937012, 875393, 828235, 771322, 730066, 709969, 672050, 609466, 568918, 527742, 489174, 477793, 480947, 445295, 399989, 410572, 417741, 402181, 408090, 406172, 376029, 363110, 346718, 329738, 312128, 288877, 287384, 310804, 329463, 346420, 341201, 345206, 335079, 339840, 316486, 312112, 360144, 380531, 401103, 432683, 488973, 546857, 624733, 753482, 913903, 1074327, 1202277, 1320405, 1405746, 1509523, 1571013, 1632427, 1769818, 1996325, 2200263, 2268958, 2271026, 2269641, 2236301, 2074728, 1902116]
14680A902116p7755m6906n4819m8865p6835j05122j36509j68896j77562j11298
14670H97549p8326n7098n7705m7914m1326j3896r800j4161l3164J5533j4678j8795
14658E26219p395l2980k9776q117j277j0272k2660J3869J3083l750k3565k2835
14646C90544k0097k3598k6637k2181j2888l165l8346r772M902p253m340K048j9664
14633B09553l089j2614J2779q377P648o785j2534k7420j1755J3388j8467k3204
14621A19123L907j6910j3833j3038j754o14Q012J2392j77k426j732q943k04q990
14607G4813J17j1935q096k8351k094j5206k1807K040N636R571Q564P860l0766
14594i654j2448R698J2530M7422J5577j8868k2223j7241J2291J4801J2974P583
$$ y = [1902116, 1824361, 1777455, 1722636, 1673771, 1596936, 1491814, 1355305, 1186409, 1008847, 897549, 819223, 762125, 704420, 656506, 615180, 601284, 591484, 577323, 544159, 559692, 545014, 526219, 518824, 485844, 456068, 447951, 446674, 436402, 413742, 427611, 440694, 436944, 413379, 390544, 370447, 346849, 320212, 298031, 285143, 281978, 243632, 233860, 238762, 231509, 227169, 229217, 209553, 206464, 193850, 206629, 198252, 205900, 199115, 186581, 159161, 147406, 160794, 142327, 119123, 123030, 106120, 92287, 79249, 77495, 76881, 84893, 97285, 97108, 94682, 92950, 84007, 83803, 74813, 74930, 62995, 54899, 26548, 24454, 9248, -12559, -10519, -4883, 4688, 13252, 21112, -9654, -22102, -12404, 126, 47548, 63125, 44257, 22034, 4793, 17084, 31885, 44859, 52442]
14582E2442j9509p299n553k4047j1178k2587k868K7611R444j5105j9244J3510
14570b4383L5670M170n50j3619m352L3305J4328l6512k627L6703K70r914q194
14557B4295k0223j1736p435J0226j0950j2254K89j338J6443N849J9975k2513K0724
14544A1352p315Q880m378o615J4915Q36m178j5196n52K1486q128j5375l527j6563
14530b4358l0654k0781K5421L7183N962k577L410l4487Q372l906q123J0521k5761
14517e9778Q296K7083K4437Q989Q388P331m297l278j6978J6414q116j71K162p18
14503I764l110O023N630r266j4290K23P325K4780M268J4954J921j3154m150P488
14489C8406l023J6829j6639n584j3867k9173j0009J7704O045J779J1140K695L78
$$ y = [52442, 32933, 25634, 20081, -3966, -15144, -37731, -40599, -12988, -3544, -18649, -37893, -24383, 11287, 15457, 14907, 1288, -3064, 30241, 44569, 8057, 5430, 42133, 42403, 32489, 24295, 4072, -7664, -15099, -4873, -15823, -28077, -27788, -29126, -12683, -6834, 13141, -9372, 11352, 4037, 12917, 8539, 1924, 16839, 17675, 13497, -1699, -2251, 19235, 11107, -4268, -7795, -24358, -55012, -75793, -50372, -13189, -7227, -9804, -6394, -40881, -32509, -36415, -44538, -34017, -59778, -51482, -24399, 38, 9027, 17415, 24746, 20449, 17171, 193, 16607, 8491, 8320, 10482, 9764, 6654, 12677, 18307, 9041, -5249, -5026, 2299, 27079, 31347, 46301, 48222, 35068, 30918, 38406, 35383, 52212, 35573, 29989, 16122, -13051, -23060, -5356, 689, 2468, 13608, 16303, 16681]
14476A6681N647Q807j3066o60k4327r096J7155L0159k1582m169M271k4469r737
14463b4386m816J3725j46K953J9062j9123k2573j3511J1761K9945R536j9288J5876
14450i85n895N065k3671N431j107j4275K3861J2647L169p763J796k5655j4681
14437d2063Q237J4381j1292r632J0894L4943m695j3814k540J2347L520L3322N059
14424C8667N73k0157m5287k4974m240m480M0790K0108j1190k145N43R255M045
14411A508r141j4185j2228j2197P913R904O672q197k8800L906O916j2362P483
14398e2808N340q957J639J1917Q073J0232K4557J2223j1967k6287J5007K1455
14386A0424j1199j3507j2544Q891J7866K0643J1171Q422p776j8135k9696Q145
$$ y = [16681, 22328, 31135, 18069, 17409, -6918, -16014, 1141, 31300, 9718, 5549, 9820, -14649, -24386, -29202, -15477, -15623, -12670, 6392, -12731, -35304, -48815, -37054, -7109, 2427, -16861, -985, -6880, -1815, -25486, -20055, -21162, -35437, -11576, 1071, 4240, -3523, -1727, -27382, -42063, -33826, -19445, -30737, -40369, -29475, 5468, 773, -13041, -15581, -3234, 286, 33608, 38667, 39240, 19083, -26204, -51178, -55418, -59898, -19108, 1000, -10190, -12335, -11792, -2537, 1508, -7633, -21818, -34046, -46243, -38330, -28426, -21754, -29951, -58751, -54845, -47929, -60291, -52808, -47468, -56425, -54786, -42869, -34796, -24564, -7, 12216, 249, -26038, -11031, 10424, -775, -14282, -26826, -17935, -69, 20574, 31745, 40167, 32391, 14256, -15440, -7295]
14374g295j199J4560P003J258l5005j4090m407Q336K2207k6567j3059m968J3296
14361c9930K8248J5120K199p526n2764r660R716L1044J809N848J9442k343j3509
14348a2306J9520K4249m0937l1747K1789J2990P775N923M693K0839k0643j3678
14336a533n925l0325J6215K3014Q423o65j6628n64K656J7406J1705m133M023J1850
14322C5519l0174j9391p485m408j1430j1382K1406J6336L788O493R648K8708j1302
14309B6326L57K467o697m4227L151J1385J9758R065L220j482k3477k5250p158
14296c2562J6823K4239k025p507M805j5568j631l882K2929j7538q827K0839J7717
14283A7812l15k3758j9048M118K297J928r741P346K1494q62k2363m2934K3706
$$ y = [-7295, -8494, 6066, 13069, 14327, -20678, -34768, -39175, -30839, -8632, -35199, -48258, -53226, -39930, -11682, 3438, 5637, -1889, -54653, -64313, -54597, -23553, -21744, -15896, 3546, 1203, -12306, 7214, 31463, -9474, -41221, -19432, -6442, 1333, 7256, 11949, 32788, 12145, -1533, -7458, -37783, -21568, 1446, 9869, 9204, -7424, -7988, -5332, 12074, 23779, 19646, 23669, 35519, 5345, -14046, -21531, -25939, -37369, -48751, -27345, -11009, -7221, -728, 8920, 37628, 26326, 26683, 29150, 22453, -21774, -18623, -7238, 12520, 21585, 24805, 23323, -154, -25404, -32562, -15739, 8500, 6475, -1032, 3773, -11795, -13426, -17308, 5621, -11917, -20744, 95, 17812, 17497, -6261, -25309, -21191, -18894, -16966, -26707, -19361, 2133, 1271, -21092, -64026, -40320]
14270d0320J5026L172K3261j012q672J20K1449Q652l0525m5504j3995J7027K1051
14257c0270L1935r230P662L7731r984j7490o116J5733K356L146k4729j3589k0240
14244c3085j2198O245K576m851n315P574j6544P115M826J1038J5938M473K227
14231i981J0992K2917J679k5791q31N674K3183L689p621l6995J5906J9847j6226
14218F442J787j7112l0448P603L3112K0588l789j3108j2981K6491j4718k1834
14206a7967J4967L8926m377J4145J4693L642j8425j2697j5785k3179L422P957
14194E322p067j3772j9633K5935L2346K9131j5850p147R205j2254q405j6270j5872
14181a4331j6598J6820K1692K1072J4730n305j3995r953k2105K045k015m365K4337
$$ y = [-40320, -25294, -22122, 1139, 127, -8545, -8425, 13024, 21676, -8849, -54353, -68348, -51321, -30270, 1665, -7565, 97, 37828, 27844, 10354, 4238, 19971, 22327, 25473, 744, -12845, -33085, -45283, -39038, -36462, -41313, -46628, -39054, -55598, -48483, -43657, -32619, -16681, -12208, -9981, 1011, 23928, 25607, -184, -1015, 4659, 27842, 31531, 23910, -13085, 2821, 22668, 6442, 8229, -8883, -39331, -31728, 1384, 21972, 18183, 5075, -7906, 18585, 3867, -17967, -3000, 35926, 31549, 45694, 60387, 64029, 45604, 32907, 17122, -6057, -2635, 5322, -1745, -15517, -35150, -9215, 23131, 52262, 36412, 29265, 38470, 26216, 17811, 1541, -14331, -30929, -14109, 7583, 28655, 43385, 38080, 24085, 14132, -7973, -5928, -7943, -12308, 12029]
14168A2029J5190J9064k503k4935k7238Q024K6262j323l849J4098r084l4462N167
14155c560K5160r535j4323J9928r236m662J1236j1684j8271q482n287L380j1500
14142c6836j0999j0532J4594J0209o162l239l173L7590J7170j5767o056m88L609
14129a0080m896J543j0536k0405J5236j2196n989P649J1560L652J4414j6157j4332
14116d0537J3084q755j0657n953L611K2005J0851j9083j0070L072L4791J0461
14104B820J1339j2092k4322l5453j56J0983Q325N356p486J2235J2624K5428J0599
14091B0200q851J5111r459n143j4849j3414J0305M952m118r77k9591L380L5026
14078B572r30j2970J1311J1779M0558N432k6981l2239P885j6691r39K2790j1125
$$ y = [12029, 27219, 46283, 43780, 18845, -8393, -369, 25893, 24570, 20721, 34819, 25735, -8727, -3560, 21600, 12065, -2258, 17670, 8434, 3772, 15008, 3324, -14947, -23429, -28716, -25336, -36836, -47835, -58367, -43773, -33564, -39726, -42965, -46138, -8548, 8622, -7145, -13201, -13689, -10080, -14976, -13433, -23969, -44374, -29138, -41334, -47323, -39674, -28114, -24462, -10048, -26205, -40537, -27453, -36208, -46865, -52818, -49207, -27202, -16351, -35434, -45504, -42432, -7641, 2820, 14159, 2067, -22255, -57708, -57864, -46881, -38556, -33200, -40686, -28451, -15827, 9601, 20200, 11349, 26460, 17001, 11858, -2991, -16405, -6100, -1148, -5266, -6243, -35834, -32454, 2572, 1642, -11328, -17, 11762, 52320, 57752, 30771, -1468, 6417, -10274, -11213, 11577, 452]
14065D52p614k5699L994L3268O78K98K0366l3316k9040j861J2727J1094J5149
14052D96J0297j1114N612j8304N740k0368j7422j0616J7561Q212r934l145P923
14039c5062K2693R108J3579q229k5797k6612P855L8207J5571p69k3538k5179n940
14026d4113K3435O548M212j3790J7144J7534j2713k5047R383n444J1232J4010
14014B391j4837M546K5593k6032l5632J2853P291o898R012J3365J0156J116J15
14001C039k1385K63R971m734K469j3577q205k459l954q850J6074J7296k8080J983
13987d0149P228j710o696J7336L792j4730r481n129j1905J8324K5854K3416j3205
13974g055k5068q284j7300k432q815J0166K0700n85J9891J3393K9310j4645q880
$$ y = [452, -7162, -32861, -28867, 4401, 5079, 5377, 25743, -7573, -36613, -38474, -25747, -14653, 496, 10793, -321, 5291, -13013, -7273, -27641, -45063, -55679, -38118, -29906, -39840, -42985, -35062, -12369, -3261, 10318, 2089, -23708, -50320, -42465, -4258, 11313, 10544, -12994, -38173, -44113, -20678, -14130, -9918, -23708, -6564, 10970, -1743, -26790, -17407, -22851, -11619, 2391, -12446, -7900, 17693, -8339, -43971, -31118, -23827, -30725, -21713, -8348, 1808, 2924, 3039, -18346, -18083, -8112, -12846, -10377, -23954, -32159, -34618, -38572, -47422, -31348, -14052, -42132, -40149, -32921, -34631, -41327, -23991, -20199, -34929, -44410, -49539, -61444, -43120, -17266, 6150, -7055, -32123, -40407, -57707, -60139, -68954, -58788, -38088, -38673, -18782, -5389, 23921, 9276, 396]
13961C96M356q474k1320M028J9363m057j475K1676J032q999p342K0607R700k3887
13947E604K8720j3521k0373J7164J2196j4455P509N659q918j1552j2841j8263
13935b3071j2983j0372J0611J8163m784j9960k1508M029K3730k300o803J3967
13923c1281J3758j7374J7298L3655j957j1309J0631j791j5188K640r330P960q7
13910b375P601J4949J6836j2075k1587K0722Q049j8857k5215M852K0314R443l0094
13897g437j4118Q967J756o555J0575J2330J1991l958j1723k1947j5896J217n384
13884d0182J2841j770K4028J6165n867q303K0674R263k1546q598J383p753R930
13871B65K4315j1323m525j9635q720l500J3577L2409m998n375L2938J5588J2848
$$ y = [396, 4752, -3722, -25042, -21014, -1651, -5708, -7183, 14493, 15525, 6526, -816, 19791, 29491, 5604, 34324, 20803, 430, 17594, 29790, 15335, 22844, 28503, 19585, 8033, -4808, -23071, -36054, -46426, -35815, -17652, -22436, -42396, -63904, -59875, -36145, -38445, -45248, -31281, -17523, -34897, -17599, 16056, 14099, 2790, 13421, 11630, -3558, -918, -10248, -2288, -2375, 5226, 20175, 37011, 24936, 3349, 24071, 32120, 13263, -11952, -7100, 13214, 22657, -7437, -21555, -12588, -10832, -17387, -6812, 5518, 17509, 13551, 1828, -20119, -36015, -34798, -40182, -27341, -29111, -5083, 11082, 5215, -3088, 17586, 26849, 5303, -3295, -1912, -9665, 265, 24580, 13257, 8732, -10903, -19623, -23123, -9546, 22863, 17865, 12490, 45428, 61016, 73864]
13858G3864J7377O386J6772L1213L8180M8619M4020L0858J2944k7037q22K1486
13846C13860j0528m0498n3559l7566k6330j4768j9871l1348j2142M905j3849L623
13834F1929J6376j1402k1553O893J6229p821j4504L604Q689J8453J387k9635L655
13821E2300K3864j1343N322L6329Q635K2833M2261M7529J6082j302o316K6141
13809B62335R6093J25569P8148R6699J30291J10089P8471N1493P1107P9389N9455
13798A239139m185n7468m8074m2470m8002n7751j04105j35487r2598r2352p0861
13787D85786n7603l6215k6592j8274p995l134j7159q789l4427m7319J3896J6919
13775B59094L5310J5015j8359P085J6418J094L0132J6839m482M955M2502M6961
$$ y = [73864, 91241, 97627, 114399, 145612, 183792, 232411, 276431, 307289, 320233, 293196, 292374, 313860, 303332, 262834, 209275, 171709, 145379, 130611, 110740, 79392, 67250, 72155, 58306, 61929, 78305, 66903, 45350, 52243, 68472, 60651, 46147, 49751, 58440, 76893, 78280, 48645, 52300, 76164, 64821, 70143, 106472, 115107, 137940, 180201, 227730, 243812, 242510, 236194, 262335, 358428, 483997, 562145, 658844, 789135, 899224, 977695, 1029188, 1100295, 1179684, 1239139, 1234954, 1177486, 1129412, 1086942, 1038940, 981189, 877084, 741597, 648999, 556647, 485786, 428183, 391968, 365376, 347102, 339107, 335973, 318814, 310025, 275598, 228279, 242175, 259094, 294404, 309419, 291060, 298145, 314563, 315657, 345789, 362628, 358146, 363101, 405603, 452564]
13763D52564K5858L3252P1976R6960J02128Q4910R5649J06900J58482J75639J98678
13752A602996J95215R3639o020j4653K2562j660o9159j71158j84952j62877j41344
13741A162589r2575q2834r7907j10326p7583p3937l3363l2703l2862l124k4520
13730E00855l488k4271k4631k8260m5507l336J8265n840j4404K4471J440O938
13718D02232J9957K9726M830k4698J3152L0501N2933L3644l859N4072J09200J17271
13706H38961J16405J01535Q6117P5168O3538N6694M6610K2656o984m3230q9233
13695A268237p7778m3405n1171j29340j28242j04264q3478n0770m8403n4031l6908
13684D60447n1503l1027q528j5264k3651k7750m7606J222J2226k3063L15J6015
$$ y = [452564, 478422, 511674, 583650, 680610, 782738, 867648, 963297, 1070197, 1228679, 1404318, 1602996, 1798211, 1891850, 1885830, 1871177, 1893739, 1892079, 1822920, 1651762, 1466810, 1303933, 1162589, 1070014, 987180, 889273, 778947, 701364, 627427, 594064, 561361, 528499, 525375, 500855, 497367, 473096, 448465, 420205, 374698, 371362, 389627, 383787, 369383, 393854, 395294, 402232, 422189, 451915, 456745, 432047, 445199, 475700, 528633, 562277, 558418, 612490, 721690, 838961, 955366, 1056901, 1143018, 1218186, 1281724, 1338418, 1385028, 1407684, 1400700, 1357470, 1268237, 1190459, 1147054, 1095883, 966543, 838301, 734037, 650559, 599789, 551386, 497355, 460447, 408944, 377917, 369389, 354125, 330474, 302724, 255118, 256340, 268566, 245503, 245818, 261833]
13672B61833j0065p154j1058J9365J9605Q100Q910l6330k348j6633j1378p492
13660B15355P072o873N253K8910O2446N1774K4934K6390L4665K7180o972o682
13648D63452R197j9928l8419m9413n5491k8275o5925q020Q846j4561j1864R70
13636A90569j8053m1531k1207K686R074r975p338p215k1836k9622P141Q074K1820
13623H2587L7707j505j6705k0435j6940m614j2225Q257J2071p397k0892l23J0887
13610E0473Q182j14J7328j6570j1344N496k0182K3001K590j9109n707K0401j5974
13597C8471k0158L0808p024k9923k2599J637Q103K7612N851k2126k7376j008J5579
13584b153J345L2830M012j4390j6491R44J1291J0174M560l5583j1524L5729K9984
$$ y = [261833, 251768, 244614, 233556, 252921, 272526, 280626, 289536, 253206, 250858, 234225, 222847, 215355, 222427, 215554, 220807, 249717, 312163, 363937, 388871, 415261, 449926, 477106, 470134, 463452, 472649, 452721, 414302, 364889, 309398, 281123, 215198, 207178, 216024, 201463, 189599, 190569, 172516, 130985, 109778, 112464, 121538, 111563, 104225, 97010, 75174, 45552, 52693, 60767, 82587, 120294, 118789, 102084, 81649, 64709, 60095, 47870, 56127, 68198, 60801, 39909, 39586, 50473, 58655, 58541, 75869, 59299, 47955, 53451, 33269, 56270, 58860, 39751, 34044, 54445, 38471, 18313, 49121, 42097, 12174, -10425, -8788, -685, 26927, 32778, 10652, -16724, -17732, -2153, -808, 32022, 36034, 21644, 5153, 6097, 17388, 27562, 32122, -3461, -14985, 20744, 50728]
13571E0728K3059j3311m0785j2813L818j3410j7984j9117K8412J4246k8423L197
13559b2383J5378N382K3560p17m818l387k8363p931j1322p884M995L2944J8301
13546A3755K3326J3077j0207m0250j2936j6472J8379J7495j350J5716J6045J348
13534C7926m3780k1296J5272l980o557J2670K287j743J2853L0819J770k062j7651
13521A6528j5703k2881k5107K2328q278k6431J0936J9733J2867N639j3622j666
13509b5657J2115j4698J1233J7943J3779L270j8M967j971o325L503K313j9210
13496A244o997K8632j3094l3176j7867n60m682K421j0227J7323L477J5085L039
13483a5382K0120l627J0376l883j0714j4984k6921k4714J7072L2791K4381J8929
$$ y = [50728, 73787, 60476, 19691, 6878, 10696, -2714, -20698, -39815, -11403, 2843, -25580, -22383, -7005, -1623, 21937, 21220, 16402, 13015, -15348, -23279, -34601, -42485, -37490, -4546, 13755, 37081, 50158, 39951, -299, -13235, -29707, -11328, 6167, 4817, 20533, 36578, 37926, -5854, -27150, -11878, -15858, -22415, -9745, -7458, -9201, 3652, 34471, 36241, 34179, 16528, 825, -22056, -47163, -24835, -33113, -59544, -48608, -28875, -16008, -10369, -23991, -25657, -13542, -28240, -17007, 936, 14715, 17985, 17967, 22934, 20963, 14638, 18141, 20454, 1244, -5753, 22879, 9785, -23391, -41258, -41818, -46500, -44079, -54306, -36983, -33506, -18421, -15382, 4738, 1111, 11487, 7604, -3110, -18094, -45015, -69729, -52657, -19866, 4515, 23444]
13471B3444Q571j9647k3523N644m961J9579j5686j6062l630P326m642J2020N453
13458f114N600J9858J0792K5038N926k1466q073k1250j7635J6864j5616j8229
13446b4305m459l121L4366j0477l3062l331K8813K0775j7881j4076n234K095J8300
13433a1597Q081q211j0691j8588M043K4632J2790p313J0116Q475n291J488L15
13420H249n608j5771p291L703R243K4141J4138j2084j4936L8147N778m1144K088
13407H653M68q873j9351k0995R59L2536R508k705J8519j3346J1908K2713l5266
13394D728m0297j5244J5630K7208K2096K8127J069j9997m051R604j5046k7946
13382a4119j6936R680K8561j645j7422J6841l066k4142L38k1528q016K413M918
$$ y = [23444, 32015, 12368, -11155, -5511, -10472, 9107, -6579, -22641, -26271, -18945, -23587, -11567, -6114, -514, 19344, 30136, 55174, 61100, 39634, 31561, 10311, -7324, 9540, -6076, -24305, -28764, -31885, 2481, -7996, -41058, -44389, -15576, 5199, -12682, -26758, -31992, -29897, -11597, -3516, -11727, -22418, -41006, -36963, -12331, 459, -6854, 3262, 11737, 6446, 7934, 8249, 2641, -13130, -20421, -16718, -7475, 16666, 30804, 18720, 3784, 41931, 47709, 6565, 8653, 9121, 248, -19103, -40098, -39139, -6603, 2905, 200, 18719, 5373, 17281, 39994, 4728, -35569, -50813, -35183, -7975, 14121, 42248, 43317, 23320, 19269, 28873, 13827, -14119, -31055, -21375, 7186, 5541, -11881, 4960, 1894, -22248, -21910, -43438, -51454, -49041, -44123]
13369d4123J7091K8004P421L2012p54k1837n354j3825J028J8P464m9j615L40k0345
13354a4524R705J0091J6038n701j2568o350q064N082J7845Q510l6894l0179J8983
13341b8026K4601q037K0525M465j7279P596J2950m909j3147P624L661p281K278
13328E021J2698O322k7876l112j3632l291j8198j0531N2084J2368O967j0202j7072
13315h454r074m529J7772Q994K512j2724k6378J4473K7992J2884k592q130j4781
13302b035K81k184j6530J7584J7292n266O242P231n374r759K0432K5671j2476
13289D1109j5820R469j3936j0459K4134k7275m025J5628K3079N384j3451k0338
13277A3499j4433k912R646k414l174j3735j5203J5325J2441r066J137K0803P217
$$ y = [-44123, -27032, 972, 8393, 40405, 39651, 17814, 12460, -1365, -337, -319, 7145, 7096, 5481, 5821, -14524, -4819, 5272, 21310, 15609, 3041, -3309, -11373, -6291, 11554, 20064, -16830, -47009, -28026, -3425, -11462, 9063, 13528, -3751, 3845, 16795, 11886, -1261, 6363, 10024, 2743, 5021, 17719, 24041, -3835, -6947, -20579, -23870, -42068, -52599, -515, 11853, 18820, 8618, -8454, -17528, -22057, -4285, 4709, 7221, -5503, -31881, -17408, 10584, 23468, 20876, 12746, -2035, -1754, -3938, -20468, -2884, 14408, 9142, 15384, 22615, 17241, 7482, 27914, 53585, 41109, 25289, 34758, 20822, 10363, 34497, 7222, 3197, 18825, 41904, 47288, 33837, 13499, -934, -3846, 5800, 3386, 212, -13523, -28726, -13401, -960, -10026, -8889, 11914, 19131]
13264A9131J5747o300k944k438j6103l4799l6403k94L3724K4484N661P226N456
13251A2148J3915J0739K4285n65k6717j5296q435K3677J8465L892j6402J3642
13239E3348J827j8126j1081K0040K671k412j2329k7431l079Q985O042J0148K5999
13226E4602k1446k5545L5173j6444k3542K939L997K8881O125J874j1811j8630
13214A6173P086L6062k795j0833j169j782P167k8070R201j9996J3362J3994p67
13201C7633J3874j226m156r888l312J5374J0460O843N101m4520l3066K7960L0196
13188E1273k1862l40J6287l6026j0988k130M893J2559M528j4651J3325J8347q558
13175B6657n592Q916j0255k4633m253K7251K529k2182r129P475K0958J3251k1617
$$ y = [19131, 34878, 28578, 25634, 23196, 7093, -27706, -64109, -64403, -30679, -6195, -534, 6692, 12148, 26063, 36802, 61087, 60522, 33805, 18509, 10074, 33751, 52216, 56108, 39706, 53348, 55175, 37049, 25968, 46008, 48679, 46267, 33938, 6507, 3428, 12413, 18455, 28603, 54602, 33156, 7611, 42784, 26340, 2798, 5737, 9734, 38615, 44740, 46614, 34803, 16173, 23259, 59321, 56526, 45693, 44524, 42742, 49909, 21839, 31040, 11044, 24406, 38400, 37633, 51507, 50281, 46125, 36237, 32925, 48299, 58759, 65602, 70703, 26183, -6883, 21077, 51273, 29411, 29071, 45358, 9332, -1656, -3786, 1107, 13666, 18194, 3543, 16868, 35215, 26657, 21065, 29981, 19726, -4907, -9160, 18091, 20620, -1562, -10691, -3216, 17742, 30993, 9376]
13162I376M889P623j2472j3541K3933J910j1234j0153M8K4275K4592j1619m9287
13149a1660j2503J6254k022r088j1611K4723R704q642o296o996M689k0733j3961
13136d8142J8185O647L052m445l110l149P352J4157J9432O688k2995L699j2219
13123a4848q335J5290j2025k4958J9572M3160J062j0910N937r104n071l220n877
13110i327R385Q381L729k0005k5813P703n14M710K8987j7340k2259M841J5693
13097a1829r838n755K5353m49p579J6990J9874O495j0442q035j0359j2496k0051
13084b8121l4485R549K5043l640L487j9890J2435J5035j1352J1843J6346j521
13072e271j1044k9883j622J3600n000K210J904q119P189J5708O352k718j4254
$$ y = [9376, 14265, 21888, 9416, -4125, 19808, 21718, 10484, 331, 379, 24654, 49246, 37627, -11660, -24163, -7909, -9931, -19019, -30630, -5907, 3797, -4845, -11141, -18137, -13448, -34181, -48142, -29957, -23310, -20258, -24703, -27813, -30962, -23610, -9453, 9979, 16667, -6328, -2629, -14848, -23183, -7893, -19918, -44876, -25304, 17856, 18918, 8008, 13945, 4841, -230, -3450, -9327, 58, 8439, 12168, -7837, -33650, -25947, -26461, -21751, 7236, -10104, -32363, -27522, -11829, -21667, -27422, -2069, -2518, -10097, 6893, 26767, 33262, 22820, 14785, 4426, -8070, -28121, -62606, -53057, -28014, -31654, -28167, -48057, -35622, -20587, -31939, -20096, -3750, -5271, -16315, -46198, -47820, -34220, -39220, -37010, -35106, -43225, -36036, -20328, -13976, -16694, -30948]
13059c0948r749k048q482O460q686p022j3174P617l567K4374K4757k3275l775
13046d7518J6329K6702o946j2662N614O426P562J7783p58m9962K3629K5682Q832
13033B0713l3043Q789J5802k3761n402o755j7433k4346k7629L8306L9883L0392
13021A5516M822J90k940Q750R827p785l7559r623K918k109K9452K8717K5j2568
13007B7633K947j2642o260r516j7544J2528J396L013M200J1808k4272R907m629
12994a431j6158K0030l923j1147j0408n990L1150K1520J8026n154k2647m3198
12982b9330k8377j1452L9500K2434J5096J9381k893n929Q750J9923J8593J2617
12970G8313l980j6149p000Q068M52j7675j2927K2933J6771q486k3050j1627m03
$$ y = [-30948, -40697, -42745, -51227, -44767, -53453, -60475, -73649, -66032, -69599, -45225, -20468, -43743, -47518, -31189, -4487, -11433, -24095, -18481, -12055, -4493, 13290, 12532, -37430, -13801, 11881, 20713, -12330, -3541, 12261, -11500, -16902, -23657, -41090, -65436, -93065, -54759, -14876, 15516, 20338, 20528, 17588, 26338, 36165, 28380, -9179, -18802, -15884, -17993, 11459, 40176, 40201, 27633, 30580, 17938, 11678, 2162, -15382, -2854, -1458, 1555, 5755, 17563, -6709, 3198, -1431, -17589, 2441, -1482, -12629, -23037, -29027, 2123, 23643, 41669, 36515, 13868, -29330, -57707, -69159, -29659, -7225, 7871, 27252, 24359, 18430, 27180, 47103, 65696, 78313, 74333, 58184, 51184, 59252, 59704, 42029, 29102, 52035, 68806, 60320, 37270, 25643, 25240]
12957B5240K0154j5450q684Q198j0759l438j7794L088p178K0096j056j4040J0673
12944I050j1610r617J7741J8923J1047J1728j539j2138j8740j874R27j370l9080
12931b6552k1058P995L3528J0942J7467N4312K5132L580J5614K1894k5927j9366
12919I7561m583n441o539j8031J8245j6038k1166l194j6035Q90R227j7316O017
12906B3597l287J086J6581J3066k9588J915j8653j7717L897K5961K015k5372M733
12893a766k8321n543K45K1595j4j2818p628K0199Q518o046J4430j3376j6108K476
12879b4157K7964r884J4807r081M56J6898Q859o004k06l5270N21J4434L08m016
12865d371o871n117N542J4541P533j1897p295p265l7802j388K8779R746J2351
$$ y = [25240, 45394, 29944, 21260, 29458, 18699, 15261, -2533, 555, -6623, 13473, 12417, -1623, 9050, -2560, -12177, 5564, 24487, 35534, 47262, 45723, 33585, 14845, 12971, 13898, 12528, -26552, -47610, -39615, -6087, 4855, 22322, 76634, 101766, 105346, 120960, 142854, 116927, 97561, 92978, 87537, 80998, 62967, 81212, 65174, 44008, 40814, 24779, 25669, 34896, 17580, 23597, 20310, 21396, 37977, 51043, 21455, 23370, 4717, -13000, -9103, 16858, 18873, -6499, -1766, -30087, -35630, -35385, -13790, -13804, -26622, -34250, -14051, -5533, -11579, 2851, -10525, -26633, -24157, 3807, -6077, 8730, -351, 105, 17003, 25862, 19858, 19652, -15618, -15097, -663, -355, -4371, -11242, -16359, -10817, 3724, 11257, -640, -7935, -15200, -53002, -54390, -25611, -15865, -3514]
12852c514l1078j014J6524j838J7378j2845n820J5990N360J6844O517M920K4852
12839E2276J1185k9462j3927l767p095J0367l241J979N310R702K5999O532J093
12826F6951j2559Q14j4501R479j8428j5250O856k1425j3380K557j6798J9657N441
12813e86k5729j0596N863K15j651o396J7368J472Q523K9443Q020J7029k3915J0365
12799B9425j3614J0283K8414L7791Q070r52K0107L1918M8562j3417q325k8245
12787A50017j1254J019k1102k1182k3316l8085k3613J2030l111J2937P181p630
12775C3891J3268J1269J8044r251n351k6805j1617j604K4198p825O741K1578J801
12762F8337q274l842R202J7275j1604Q932q840l6782l6053L632n933O546J8625
$$ y = [-3514, -34592, -35606, -19082, -20920, -3542, -16387, -22207, -6217, -857, 15987, 22504, 27424, 52276, 63461, 33999, 20072, 16305, 9210, 19577, 16336, 18315, 23625, 33327, 59326, 65858, 66951, 54392, 55206, 40705, 50184, 31756, 16506, 23362, 1937, -11443, -8886, -25684, -6027, -586, -26315, -36911, -31048, -30833, -32484, -38880, -21512, -20040, -11517, 17926, 25946, 42975, 19060, 29425, 15811, 26094, 54508, 92299, 100369, 99417, 119524, 151442, 200004, 186587, 178262, 150017, 138763, 139782, 118680, 97498, 74182, 36097, 12484, 24514, 21403, 34340, 41521, 33891, 47159, 58428, 76472, 67221, 61870, 35065, 23448, 21844, 46042, 38217, 44958, 66536, 68337, 60063, 56221, 65423, 82698, 71094, 80026, 71186, 34404, -1649, 1983, -3950, 2596, 21221]
12749B1221K6680L5376J0014J1602K5236J6577J3162O565m920R659k1141k1546
12737A28485k1499l8086q772K628K872p490p524j857j3571j9343k7093J8280O541
12724A3571J6504p378k4314N611J8294K9889L1262M009j2706l7317K882J3693
12712E4000J7701P07n7172k0296j4371O753l016J3631j5619l615K4502l167m306
12699d268Q125j0322J503o904J8926R337J9529l277j325j5443q133J0646N208
12686B3602K56q298P51j0945q188L532L899J2247J097K647J1895J0021J2300J507
12672E6323j7864l5017J1784K469j500j1748r798p474J3445K2584K1192j9093
12660B5303j3982l1813R68k2309J3509K1021q57N013K100J2142M685l008k557
$$ y = [21221, 47901, 83277, 93291, 104893, 130129, 146706, 159868, 166433, 161513, 171172, 150031, 128485, 106986, 68900, 60128, 62756, 65628, 58138, 50614, 48757, 35186, 15843, -11250, 7030, 13571, 30075, 22697, -1617, 3994, 22288, 52177, 83439, 87448, 74742, 37425, 40307, 54000, 71701, 72408, 15236, -5060, -19431, -12678, -15694, -2063, -17682, -21297, 3205, 38, -4268, 3857, -6465, -4962, -11866, 7060, 16397, 35926, 32649, 31324, 15881, 7748, 18394, 23602, 23858, 15560, 16311, 5366, -2822, 710, 4609, 16856, 17953, 20600, 32495, 42516, 54816, 56323, 38459, 3442, 15226, 17695, 16195, 4447, -5351, -12825, 620, 23204, 44396, 25303, 11321, -20492, -19524, -41833, -28324, -7303, -8160, -3147, -1047, 11095, 15780, 12772, 10215]
12647A0215J431j0995j748J932J8826j940k2545J2234J3329p933l72j8248o450
12634a2264J2249k3792k4286l063J1039J2500j0927j2733K8753K9285P324J602
12622A5687k330p344k7740K004L1680K2164q498Q907J8722O464k6773j9482l2010
12609a8549J255k799k2208j6913P366L2251K8572J3727r366J7542O006p305k0108
12596I471j1113O331p636K641r686q765k4298P677K4794J9380O289K1892Q444
12583D5421j2480k8923j5898K4067M757r216l672o960q342K3687P660o272k010
12570A1819J9701m1529j3598R568O601R222M0106J7840k8092j2747J6209k7804
12558G296l1811p708O685J0479J4283j1396j0189m20K261k8275J6197K9909J4368
$$ y = [10215, 11646, 651, -1097, 835, 19661, 17721, -4824, 7410, 20739, 12806, 12434, -5814, -12264, -15, -23807, -48093, -51156, -40117, -27617, -38544, -51277, -22524, 6761, 14085, 15687, 13357, 6013, -21727, -19723, 11957, 34121, 25623, 34530, 53252, 59716, 32943, 13461, -18549, -17294, -20093, -42301, -59214, -51848, -19597, 8975, 22702, 13336, 30878, 36884, 29579, 9471, -1642, 4689, -2947, -306, -9992, -18757, -43055, -35378, -10584, 8796, 15085, 36977, 45421, 32941, 4018, -11880, 12187, 16944, 7728, 4056, -2904, -11246, 12441, 20101, 13829, 11819, 31520, -10009, -23607, -14039, -7438, 1784, 41890, 59730, 31638, 18891, 35100, 7296, -24515, -32223, -25538, -15059, -776, -12172, -22361, -22781, -20520, -48795, -32598, -2689, 11679]
12545A1679k658n307m233l707k506O949L5243o071p603J3239k0714j4095M5513
12532D5729r857k2253j5450o743j2579k0925J7168K584L268J2805j0802l366J7014
12519c407K9513k6801R839L9723N315l3965k0210M53L4938K9017j7252j4889j173
12506C1101o057J1493j3135j5156K3683L1868j6280m0976J6101K3410k7553j710
12494A6789K0332L3669K3708L300q459M488k3824l5917l1000P423j131K1445j107
12481B9716M235J0279j8306P490J119j7308j8302j3623q542K2722J6371M973m1721
12468b0897j8110J5565J0008K9802n976l6517k0855j6814K7527L4556p856m783
12456a4350L1343K1778j022l7871j927L7509K4856K0873j0379j3068J5037K7972
$$ y = [11679, 9021, 3714, -519, -4226, -6732, 217, 35460, 29389, 21786, 35025, 14311, 216, 45729, 35872, 13619, -1831, -8574, -21153, -42078, -24910, -22326, -19058, -6253, -17055, -20421, -3407, 26106, -695, 9144, 48867, 54182, 20217, 7, 460, 35398, 64415, 47163, 32274, 31101, 25044, 36537, 23402, 8246, 31929, 63797, 47517, 6541, 22642, 46052, 18499, 16789, 37121, 70790, 94498, 97798, 89339, 93827, 70003, 34086, 3086, 10509, 9378, 30823, 29716, 33951, 44230, 25924, 33414, 34533, 17225, -1077, -14700, -23242, -520, 15851, 20824, -20897, -39007, -23442, -13434, 16368, 10392, -26125, -46980, -63794, -36267, -1711, -9567, -14350, 16993, 38771, 37749, -122, -2049, 35460, 60316, 81189, 70810, 57742, 72779, 100751]
12444A00751q906m2806j2034O255J0346j9575k0201k3068m735J1294O214N225
12432H760K1702l612k4761L6263K3644j1525k0819j7207K5892L1578J5119j4014
12420G1020k1859Q126r644j0663K6540o134k1579j3103k3145o004K2394K3910
12408C9859M3466j9044j9227J945j5844J2860J8244j1975J4147R280P051l514
12396G7248M754L3836J4832J5601L7583N1791L6791N7571O4633Q9260J44441J88385
12384H16726K05970K25129J94433J41325o567j19453k14565k33192j83102j31278
12374F95426j14656o9411o8534m4721l2441m9705k6554J1837M223Q245j5892m0614
12362B57203j7200m353K0447J920k427k2982l173J0774j5899L267L5203L4167
$$ y = [100751, 91845, 49039, 37005, 43260, 53606, 34031, 13830, -9238, -13973, -2679, 3535, 8760, 30462, 26850, 2089, 38352, 61996, 50471, 29652, 12445, 38337, 69915, 85034, 71020, 49161, 57287, 47643, 36980, 63520, 57386, 35807, 22704, -441, -6445, 15949, 39859, 83325, 64281, 45054, 46999, 31155, 44015, 62259, 50284, 64431, 73711, 80762, 77248, 82002, 115838, 130670, 146271, 183854, 235645, 272436, 330007, 394640, 483900, 628341, 816726, 1022696, 1247825, 1442258, 1583583, 1577016, 1457563, 1242998, 1009806, 826704, 695426, 580770, 511359, 442825, 398104, 365663, 315958, 289404, 301241, 305464, 313709, 297817, 257203, 240003, 235650, 256097, 258017, 255590, 232608, 229435, 240209, 224310, 227577, 262780, 296947]
12350B96947J1812M192K2355J8904J3209m095r83L1312M2220L7736M6616R1355
12338F11580R6575J37864J99125K37251K35523J37893N8099r7982k02170k26201
12328A187557k11753j46169j03032r2147n5340m7384o6912l8855l2491J024m074
12317C90424l7827k6955m0649j1816l371k2713r36L577q208l2203J5604L7843
12305B62770K8492N064l262J6699j5058l7571O164L0126l5316o5790K9181K6918
12293B48417j2884R889K3342j6063l5688j891K0050p139P57l1286R628k0752k7427
12280A58953k0231J1467l960L377K722j6466o981J85J0442O111j1435k8173k2796
12267H3215J963J279J9774N3570j4554k5006K9446o902k3725n930l662q712n96
$$ y = [296947, 308759, 312951, 335306, 354210, 367419, 363324, 362341, 393653, 435873, 473609, 520225, 611580, 708155, 846019, 1045144, 1282395, 1517918, 1655811, 1713910, 1615928, 1413758, 1187557, 975804, 829635, 726603, 634456, 579116, 531732, 464820, 425965, 393474, 394498, 390424, 352597, 325642, 284993, 273177, 269806, 247093, 246157, 249734, 241526, 209323, 224927, 262770, 291262, 296326, 293064, 309763, 294705, 257134, 263298, 293424, 258108, 192318, 221499, 248417, 235533, 245422, 268764, 252701, 217013, 215122, 235172, 228033, 228790, 197504, 207132, 186380, 158953, 138722, 150189, 146229, 149606, 152328, 135862, 128881, 129066, 139508, 145619, 134184, 106011, 83215, 85178, 86457, 106231, 159801, 145247, 120241, 149687, 142785, 119060, 113130, 109468, 100756, 100160]
12254A00160O954O90J0249j8256l6998n95P438r399k431j6024J3399J0242J2623
12241G8052M992r818J1377J1207n675k5571K1924K3451O873J7846j4437k3590
12229I6631k5491j4095J8520k7000l0523l559j1241q6K1184J9684K0929J3737
12217G8690j8183L0453K7826K3276J5162k8907M191J1759j4705N503j135j9637
12205A14293l6236O52K1685n596M308r083l624q990j9758k4280M365L815j071
12192D0480j3374K79K3790J4539J535j3243j3726K6092K1278R755q824k9595j5460
12179D3526L4201m275K163J5816j7213j8643K4770O1084K2107J1500n661l984
12167A65391O0756O7635J4015J9186N0366M2066N2950N1328K6239J1842k459j2036
$$ y = [100160, 107114, 107804, 118053, 99797, 62799, 62204, 69642, 60243, 57812, 41788, 55187, 65429, 78052, 83044, 73226, 84603, 95810, 90135, 64564, 86488, 109939, 116812, 134658, 120221, 96631, 71140, 57045, 75565, 48565, 18042, 14483, 3242, 3156, 24340, 44024, 64953, 78690, 60507, 90960, 118786, 142062, 157224, 128317, 132508, 144267, 129562, 135065, 133930, 114293, 78057, 78709, 100394, 94798, 99106, 90023, 86399, 77409, 57651, 33371, 37736, 41551, 40480, 27106, 27385, 51175, 65714, 67249, 54006, 40280, 66372, 87650, 97405, 88581, 58986, 43526, 77727, 73452, 75615, 91431, 74218, 55575, 80345, 141429, 163536, 175036, 169375, 165391, 226147, 293782, 307797, 326983, 377349, 419415, 472365, 523693, 549932, 561774, 559315, 547279]
12155E47279k5625M952k3896m1467n3529o0450n4921k6381l6768j9590J8791L4372
12143B62767j9876j7330k8599j5143k853l8006j7852M035L944m854o086m382k046
12130A13719n37Q094R044J1676K0135l985j6793K7797L8054J3179L6688L7808
12118B94879L9057J8434K2921K3770N5253P4386K1988P955L9169L7211J5100O958
12106F57081l8330j4311k836r409m5283n2270k7629j2343j3175r181k3244l5401
12094C73669k8149j1245n4316j8718k6867l0567l1606O088K6578K2520J2333P532
12082B47252L3731O0781L6307K6561K6783M5732P2281P0254R7765J45891J28576
12071I91914J19205O4922k6056l9964l6451l0429j3243L2309P2641J45129K09177
$$ y = [547279, 521654, 526606, 502710, 461243, 407714, 347264, 292343, 265962, 229194, 209604, 228395, 262767, 242891, 225561, 196962, 181819, 178966, 140960, 123108, 127143, 131087, 126233, 120147, 115765, 113719, 113182, 121276, 130320, 141996, 162131, 158146, 141353, 169150, 207204, 220383, 257071, 294879, 333936, 352370, 375291, 399061, 454314, 528700, 550688, 558643, 597812, 635023, 650123, 657081, 618751, 604440, 601604, 592195, 546912, 494642, 467013, 454670, 441495, 432314, 409070, 373669, 345520, 334275, 279959, 261241, 234374, 203807, 172201, 178289, 204867, 227387, 239720, 247252, 280983, 341764, 378071, 404632, 431415, 477147, 549428, 619682, 717447, 863338, 991914, 1111119, 1176041, 1149985, 1110021, 1073570, 1043141, 1029898, 1062207, 1134848, 1279977, 1489154]
12060A489154K02270K08416K04612K31266J80968N9814j27859k33261k99290k72864
12050A643226k21513j87587j35027q2277m5615n8968o5656k5693j7994n766J0699
12039H07829L3422J3016K807L9192O7734Q8532R7908P5497O4893O2591O9740J00127
12027A523288J19135J58573J58531J26005J00721Q2438N4589N0600J28205K11548
12017B713633K50279K55181K99981L90422N61121O08614L78871p0103m30416o66791
12007D290792p01717n56645l91914k44907j62470j03328p7116o1981o2435n4343
11997A873936m7143k501R25j4751J9593L5439N4892M2557K2657N0241J02305P7173
11985B215323N1812N6386O6335P2112O5163L2568M5288Q0970P9907J17797J23350
$$ y = [1489154, 1691424, 1899840, 2104452, 2335718, 2516686, 2576500, 2448641, 2215380, 1916090, 1643226, 1421713, 1234126, 1099099, 1016822, 971207, 912239, 846583, 820890, 802896, 797130, 807829, 841251, 854267, 857074, 896266, 964000, 1052532, 1150440, 1225937, 1290830, 1353421, 1423161, 1523288, 1642423, 1800996, 1959527, 2085532, 2186253, 2268691, 2323280, 2373880, 2502085, 2713633, 2963912, 3219093, 3519074, 3909496, 4470617, 5079231, 5458102, 5387999, 4957583, 4290792, 3589075, 3032430, 2640516, 2395609, 2233139, 2129811, 2052695, 1990714, 1928279, 1873936, 1826793, 1824292, 1825217, 1810466, 1830059, 1865498, 1920390, 1962947, 1985604, 2035845, 2138150, 2215323, 2267135, 2323521, 2389856, 2461968, 2527131, 2559699, 2604987, 2685957, 2765864, 2883661, 3007011]
11974C007011J26446J20813J50326J69771J98815K76256L34370K54402R3108j28223
11964D603095l30910l45189l08301k27684j59369p7430j9452m058K2590M3906
11954C197198L3903M4158O3636N8303M0727J8574M488L4156N1209N0309M7318
11943C643979R3027J20370R7583R7549J39497J75508J85211K17721K75298K13562
11933E259305K15688K45581K47333K68802L04948L54974M28927N14647O03870
11924H444075P10873P92304R47326J113714J320918J658441K083424K628958L405284
11915B3105317M338769N428530O763892Q438415J0746303J3925881J8188294K3696768
11907A14632169L0574239L7700032M1390458L7539861K2451979k137273k5022492
$$ y = [3007011, 3133457, 3254270, 3404596, 3574367, 3773182, 4049438, 4383808, 4638210, 4731318, 4603095, 4272185, 3926996, 3618695, 3391011, 3231642, 3154212, 3134760, 3130702, 3153292, 3197198, 3231101, 3275259, 3338895, 3397198, 3437925, 3456499, 3460987, 3495143, 3546352, 3596661, 3643979, 3737006, 3857376, 3954959, 4052508, 4192005, 4367513, 4552724, 4770445, 5045743, 5259305, 5474993, 5720574, 5967907, 6236709, 6541657, 6896631, 7325558, 7840205, 8444075, 9154948, 9947252, 10894578, 12008292, 13329210, 14987651, 17071075, 19700033, 23105317, 27444086, 32872616, 39636508, 48074923, 58821226, 72747107, 90935401, 114632169, 145206408, 182906440, 224296898, 261836759, 284288738, 282151465, 257128973]
11900B57128973l6852004l8007760l2655719k4825807j7811091j2819078r497440
11893H4660074p193536n702696m757061m237726l824219l349745k887648k421072
11885E0286371j980924j632063j293702j022403p60727n49923k94712l2041K00211
11876D2920087M31261O60180R35679J188175J285838J329602J454964J837354
11868E2043140K431485L305619M310444N513372P064294R190147J2141899J6140975
11860A12141375K1366033K8074027L5807291M1437193L9836765K6748177L369048
11853C08779909k1481329l7552482m1805535l7216379k8706965k0545483j4429828
11846A07041908j0450385p979916o549218n662844n153521m733378m240258l739557
$$ y = [257128973, 220276969, 182269209, 149613490, 124787683, 106976592, 94157514, 84660074, 77466538, 71763842, 67006781, 62769055, 58944836, 55595091, 52707443, 50286371, 48305447, 46673384, 45379682, 44357279, 43596552, 43046629, 42751917, 42719876, 42920087, 43351348, 44011528, 44947207, 46135382, 47421220, 48750822, 50205786, 52043140, 54474625, 57780244, 62090688, 67604060, 74668354, 83858501, 96000400, 112141375, 133507408, 161581435, 197388726, 238825919, 278662684, 305410861, 308779909, 287298580, 249746098, 207940563, 170724184, 142017219, 121471736, 107041908, 96591523, 88611607, 82062389, 76399545, 71246024, 66512646, 62272388, 58532831]
11838E8532831l183598k692327k288076j946023j662293j400882j214922j040710
11830D3104000q65189p24421n81034l71194k21304j41144j98291m10459o85250
11821C8905714r08929j042828j058790j022297r93268j083274j207899j403108
11813C0185321j521646j550202j516973j430656j381663j291074j195989j117463
11805A9179655j065811j008825r32289q73714q58225q15299p22629o67631o21539
11796A1613693n91804n50165n22797m96842m56695m33522m37657m28825l67462
11787G327924l04921k90359k93422l26902l00120k73935k34121j78064j53034
11778D973046j27374j74492k31948j98311k13430k13613k06564j97843j80622
$$ y = [58532831, 55349233, 52656906, 50368830, 48422807, 46760514, 45359632, 44144710, 43104000, 42238811, 41514390, 40933356, 40562162, 40340858, 40199714, 40001423, 39590964, 38905714, 37996785, 36953957, 35895167, 34872870, 33879602, 32796328, 31588429, 30185321, 28663675, 27113473, 25596500, 24165844, 22784181, 21493107, 20297118, 19179655, 18113844, 17105019, 16172730, 15299016, 14440791, 13625492, 12902863, 12235232, 11613693, 11021889, 10471724, 9948927, 9452085, 8995390, 8561868, 8124211, 7695386, 7327924, 7023003, 6732644, 6439222, 6112320, 5812200, 5538265, 5304144, 5126080, 4973046, 4845672, 4671180, 4439232, 4240921, 4027491, 3813878, 3607314, 3409471, 3228849]
11769C228849j73842j44632j32635j34520j23559j37302j07396j10981j07489
11760B056493j05818j07543q8425p7419p7068p7152l2811m8207l5579j7581l2391
11749A356499l2765m3718n9013n3182r115j2498K451L5221K2629K6778N378R970
11737A248635J7667K2683J427L0883j424K7073P3372Q2492O5523N0758j8951m8568
11725A551570m3176l6353l5651m2655n0324l2276l1282M95m1306k8155l9027o3815
11713A108045m2960l29j0386k5234l7142K293n644k6958Q77j6916J472L5083J9008
11700A001209o103k1829q630R693J2861J5412K8727O796J5095L8099J4747J5225
11688A121302J6132j3160J8971J0349L632J5598K304m597L7657k8992m1553L9889
$$ y = [3228849, 3055007, 2910375, 2777740, 2643220, 2519661, 2382359, 2274963, 2163982, 2056493, 1950675, 1843132, 1754707, 1677288, 1600220, 1523068, 1490257, 1442050, 1406471, 1388890, 1356499, 1323734, 1280016, 1221003, 1167821, 1158706, 1146208, 1148659, 1183880, 1206509, 1233287, 1238665, 1248635, 1266302, 1288985, 1290412, 1321295, 1319871, 1346944, 1420316, 1502808, 1568331, 1619089, 1600138, 1551570, 1508394, 1472041, 1436390, 1393735, 1343411, 1311135, 1279853, 1280348, 1239042, 1210887, 1171860, 1108045, 1065085, 1064756, 1054370, 1029136, 991994, 994287, 988643, 961685, 962562, 945646, 947118, 982201, 1001209, 995106, 973277, 964647, 974340, 987201, 1002613, 1031340, 1038136, 1053231, 1091330, 1106077, 1121302, 1137434, 1124274, 1143245, 1153594, 1157226, 1172824, 1175128, 1170531, 1208188, 1179196, 1137643, 1177532]
11676A177532K069J5851J5901J1807l2851j3357K888q007N94q847m0160j8165
11664A105255p111m9848m9353k9444q913J0482R320j8673Q388p047L81j5330l57
11651I47750o016k0077j7114k3741l7610k9895k9678j9918k1567j6011k1412l2384
11639F72327k5218l2329k7873j4146r856k0688l0939n073p668J0168m4808j4703
11627D49194N994M165k0453o052r433j4047j8537j2212j2987J7201j9642k6872
11615C36319O734l924J3629J4918l900L406J2061J2962J9951L5795N919k289j8699
11602D32882j8035r402j4598m9089j9285l363L13l1881k6628l3094k6257J1479
11590B13042o717J4096K0899R287k949m165P125J196K48r441l2414r802k6638
$$ y = [1177532, 1179601, 1195452, 1211353, 1223160, 1190309, 1176952, 1179840, 1171833, 1172427, 1163580, 1123420, 1105255, 1098144, 1048296, 998943, 969499, 960586, 971068, 980388, 961715, 970103, 963056, 963437, 948107, 947750, 941734, 921657, 904543, 880802, 843192, 813297, 783619, 763701, 742134, 726123, 704711, 672327, 647109, 614780, 586907, 572761, 562905, 542217, 511278, 506205, 498537, 508705, 463897, 449194, 455188, 459353, 438900, 432848, 423415, 409368, 390831, 378619, 365632, 382833, 363191, 336319, 343053, 339129, 352758, 367676, 363776, 367182, 379243, 392205, 412156, 447951, 453870, 451581, 432882, 414847, 405445, 390847, 341758, 322473, 319110, 319423, 287542, 260914, 227820, 201563, 213042, 206325, 220421, 241320, 250607, 247658, 243493, 250618, 251814, 252062, 242621, 210207, 200405, 173767]
11577A73767j8681K7908K3747J4100L7836M975p30q007j7207k9495m4787R958
11565A73384J8832p574J3784k357K8710m0201k6461P198L0381J2923K2807O513
11553B37939p097J865j422k4849M085J6753j030j1128J3135K338L83L085L732
11540B37789k2827J7582J9989P689L761N062N448J327o658j5756k1994n297j4777
11527B11338J4377K3721J2015j974p933J3261J6910j1148o943j7353N726j7204
11515B34793j5811J4967k8840j1143J6251j0379m879J1821O223j7295l3076q115
11503A54517p706J5817o383j0116m671J890J3879J2512N061n97K280m136j6394
11490A55953k843J3409n741k2411N990p263j5807J553o962j4683o900J2814J0089
$$ y = [173767, 155086, 182994, 206741, 220841, 258677, 263652, 262922, 254915, 237708, 208213, 163426, 173384, 192216, 184642, 198426, 196069, 224779, 184578, 158117, 165315, 195696, 208619, 231426, 237939, 230842, 232707, 231285, 206436, 210521, 227274, 226244, 215116, 228251, 230589, 230972, 234057, 237789, 214962, 232544, 252533, 260222, 263983, 269045, 274493, 275820, 269162, 253406, 231412, 226115, 211338, 225715, 249436, 261451, 259477, 251544, 264805, 281715, 270567, 263624, 246271, 251997, 234793, 218982, 233949, 205109, 193966, 210217, 199838, 194959, 206780, 213003, 195708, 162632, 154517, 146811, 162628, 156245, 146129, 141458, 143348, 157227, 169739, 174800, 174203, 176483, 172347, 155953, 153110, 166519, 160778, 138367, 144357, 137094, 121287, 122840, 115878, 101195, 94295, 107109, 117198]
11477A17198J5129K2381p299k3602k1655Q391P684k0981j2219J4870L705j6284
11465H7318j6662n14K3343K0267j7640K5702J8752k3088k0228j1355q546K7539
11453A04888K8090j2266j3104M084j0412j062n145J1234j2220l673J3635J4980
11441A19029J189K5267N289j3498L695J3058J4291K4238O274k927j5120K1068
11429B01853K1350L6831L6990J8667N8059P7389Q7918J27900J63307J89447K49901
11418A269612K20204J25430l4353j30920k02486k23005j55245j33710q6260k9205
11408F20062o5703m5258j1547j9739j5138k0148l0430j0045O29j5152l2851k1632
11396C33048k2227j0523l343j3285l781J3707O043m123K2905P609J2672Q064L0023
$$ y = [117198, 132327, 154708, 147409, 123807, 102152, 110543, 118227, 97246, 85027, 99897, 103602, 87318, 70656, 70142, 93485, 113752, 96112, 121814, 140566, 117478, 97250, 85895, 77349, 104888, 132978, 120712, 107608, 111692, 101280, 100218, 95073, 106307, 94087, 90414, 104049, 119029, 120218, 145485, 150774, 137276, 140971, 154029, 168320, 192558, 198832, 195905, 180785, 201853, 223203, 260034, 297024, 315691, 373750, 451139, 539057, 666957, 830264, 1019711, 1269612, 1489816, 1615246, 1580893, 1449973, 1247487, 1024482, 869237, 735527, 649267, 620062, 554359, 509101, 497554, 477815, 462677, 442529, 412099, 402054, 402683, 387531, 354680, 333048, 310821, 300298, 296955, 283670, 279889, 293596, 299639, 295516, 318421, 326030, 338702, 346766, 376789]
11383C76789j2403j0046k660M0938K6780L9655O2717P2234Q7235J22454J50640
11372I54333J96156K45011K15867Q8397k909r2739k02785k26237k12640j65388
11362G97066j15971p5312n5828m1552l1437l4308k6133q343k8385m0114l6917
11351C02766L968j426o059k7679r880l4554r396O190J0088J4215O584j3067M748
11338B46498K4725k8871k7569K6846K7111p44o811m755j3227l4501m304j5441
11326A88957j0322j7237k2864K6720J1584M336K5192k1207n6535k0956l1425j0814
11314F5429j4093L4368J7831k0192j7707K5414j7026M85J0462p783j7833j2997
11302D6358j5305l033N862K1206o84R81l1241k0345J7776J4286J2665M6497m439
$$ y = [376789, 364386, 354340, 351680, 392618, 419398, 459053, 521770, 594004, 681239, 803693, 954333, 1150489, 1395500, 1611367, 1699764, 1696855, 1604116, 1401331, 1175094, 962454, 797066, 681095, 605783, 549955, 508403, 476966, 442658, 416525, 408182, 379797, 339683, 302766, 306734, 305308, 299249, 271570, 261690, 227136, 217740, 223930, 234018, 248233, 254817, 241750, 246498, 271223, 242352, 214783, 241629, 268740, 267996, 261185, 256430, 243203, 208702, 204398, 188957, 178635, 161398, 138534, 165254, 176838, 181174, 206366, 185159, 128624, 107668, 76243, 65429, 51336, 85704, 103535, 83343, 65636, 91050, 74024, 74509, 84971, 77188, 59355, 46358, 31053, 28020, 33882, 55088, 54404, 55385, 24144, 3799, 21575, 35861, 48526, 95023, 90584]
11289I0584l193r156j9876J0419k7450q400N209R910K4266M2671l4872j5643K736
11276F7205j4118j2889r788O967L8325J4309P481o056L958j1954n1475q483J0243
11263C3725k013K8949P10O418J8800J8618j4921m2637k2327J3121k2842N778P966
11250B9345o673j0271j2837J9148J8143J378l967j1335l1342Q55K9290J1386j0882
11237B2238R693P824N095n892J2671J0672J0815o163q255k0095k3983J2310K0762
11224D7692J2871j4491J1380p087k0595K40Q186J948k0052j510o360K752Q364
11211B3338r060k4740K0550J0390j3110j5751J9371j275N806j4745l1507M640
11199b6093L515l081j4468l028L8390P210L673J5763k0370J5907K3708j2585n380
$$ y = [90584, 87391, 78235, 58359, 68778, 41328, 32928, 38137, 48047, 72313, 114984, 80112, 64469, 67205, 53087, 40198, 30410, 37377, 75702, 90011, 97492, 91436, 95394, 83440, 31965, 23482, 33725, 31712, 60661, 61371, 67789, 86589, 105207, 90286, 47649, 25322, 38443, 15601, 21379, 29345, 22672, 12401, -436, 18712, 36855, 38233, 34266, 22931, -8411, -7556, 21734, 33120, 22238, 31931, 39755, 44850, 38958, 51629, 62301, 73116, 66953, 58698, 38603, 14620, 26930, 47692, 60563, 46072, 57452, 50365, 29770, 30010, 38196, 40144, 20092, 18582, 12222, 14974, 23338, 14278, -10462, 10088, 20478, 7368, -8383, 10988, 9713, 15519, 774, -30733, -26093, -22578, -25659, -40127, -43155, -4765, 2445, 6118, 21881, 1511, 17418, 41126, 28541, 23161]
11186B3161l680k816J6523k354j2756K2418L6849k511k6709j553J1974K2846L132
11173H4524L650l2565n4741j764L2166r136o117K675j3408K234J8676L415j7276
11160A2333J1637Q591J1350J4753K862l7895k0545j7227J6683Q72l486n829L6104
11147C0203J5957o490j5940K2866J1799m247j6534k9543r512J61j3727j8674J3906
11134a9775O621L0431L789p406K001p801j3731k0913N843J1648J5797j2771K1004
11121A4737J4906O057j7757k6339j9847o996R299J2679m553p515n098J0692Q703
11108a1032o062J8321m907K969j201j0244J2839k821K9445R351j2039m628K624
11095B2615N88O797m5391m113L0004j0144R120K6476n598k9153l1441k4283N143
$$ y = [23161, 19481, 16665, 33188, 30834, 18078, 40496, 77345, 74834, 48125, 46572, 58546, 81392, 84524, 88174, 55609, 868, -896, 31270, 22134, 16017, 18692, 5284, 7518, 26194, 29609, 12333, 23970, 32561, 43911, 58664, 61526, 23631, 3086, -14141, 2542, 3414, -72, -5901, 30203, 46160, 39670, 23730, 46596, 58395, 54148, 37614, 8071, -1441, -1280, -15007, -33681, -19775, -13154, 17277, 21066, 13660, 15661, 7860, -5871, -26784, -20941, -9293, 6504, -6267, 14737, 29643, 35700, 17943, -8396, -28243, -35239, -25940, -13261, -17814, -25329, -30427, -19735, -11032, -17094, 1227, -3680, -711, -1912, -12156, 683, -2138, 27307, 36658, 24619, 19991, 22615, 23203, 30000, -15391, -19504, 10500, 356, 9476, 35952, 30354, 1201, -30240, -54523, -49380]
11082d9380M2634K631j9527R435J5622n23J0707n118k4529J1217L8351K791j8916
11069A5395r85L623r26j7877j3856N766L157M610o298J3374j1806j6109p6J9553
11055b455K976m94r690L802J5887N012k0146j76J6500J3432N369k6382j6797r424
11041b2586J0217J3542K0320j3976k5871j6439K8226L0152j591j3903m082M075
11029H084j6987j7785L6531J175P685Q692O458k1361j9663J5507J0420q211N915
11016A6460J0286j0687j9591j0975q61J8060q464o791o075k1019J5283K1008L0119
11003B6753J6143k8695j4502k1387l213M405j8127J3438J0402O621K3050J9891
10991C4779n54L230j4380k4946j5022m597K453N569K6389J5093J139K6572R890
$$ y = [-49380, -6746, -4115, -23642, -14207, 1415, 892, 11599, 6481, -18048, -6831, 31520, 34311, 15395, 14410, 18033, 17107, -770, -14626, -8860, -5703, -1093, -7391, 5983, -5823, -21932, -22008, -2455, 521, 27, -9663, -5861, 10026, 15038, -5108, -5284, 11216, 24648, 30017, 3635, -13162, -22586, -12369, 1173, 21493, 7517, -18354, -34793, -6567, 23585, 21994, 8091, 4009, 8084, -8903, -26688, 9843, 11018, 18703, 27395, 33853, 12492, -7171, 8336, 18756, 10545, 16460, 26746, 16059, -3532, -14507, -15368, 2692, -5772, -12563, -18638, -39657, -24374, -3366, 26753, 42896, 14201, -301, -21688, -24901, -20496, -38623, -25185, -14783, -8162, 14888, 34779, 34225, 37455, 23075, -1871, -16893, -21490, -19037, -13468, 12921, 28014, 29153, 55725, 65615]
10978F5615k4052l7142l1730L1003J8235J5218R909m172j437N292o479j0433k7379
10965B448j7900J2531J1173k245r579K1287l607p59j305p138j807K342P224j4675
10951b010k4935r849k4187k801p64J2361L4051J1777n043J409j0626k0629J6202
10938b5044J9929k6842l0697M8594M7175j0847j9122L313K8546J8906k3207m979
10926B5725J6526K321l9735j6534O433M919K442J4170m682l9012K0319J5087K3918
10913C1897j297K3983m029m1467r759N344j3562l129J0153k7254J0284J3327q246
10900a3755j441K4247M15K682n488k4771k2680J2490n096R245L4883K0053k1875
10887H909L583n353j5040K03K1141R8P344J4244k0486m0611M562L0081J3930m797
$$ y = [65615, 41563, 4421, -27309, 3694, 21929, 37147, 47056, 42884, 41447, 46739, 40260, 29827, 2448, -15452, -2921, 8252, 6007, -3572, 17715, 14108, 13349, 12044, 4906, 3099, 5441, 12665, -2010, -26945, -36794, -60981, -63782, -64546, -52185, -18134, -6357, -11400, -9991, -20617, -41246, -25044, -5115, -31957, -62654, -14060, 33115, 22268, 3146, 6459, 35005, 53911, 30704, 25725, 42251, 44572, 4837, -11697, -5264, -345, 2097, 16267, 11585, -27427, -7108, 7979, 31897, 30600, 54583, 50554, 9087, -672, 4672, -8890, -12019, -1866, -29120, -18836, -5509, -13755, -15196, 9051, 9466, 12148, 6660, -18111, -40791, -28301, -33397, -24152, 10731, 30784, 8909, 12492, 7139, -7901, -7698, 13443, 13541, 20885, 35129, 14643, -25968, -21406, 8675, 22605, 17808]
10873A7808j3603j8449J9818L8304J605N832K0426k4563j986K3953K962N880q803
10860F9184J0936K187p045j1391j5081l1756J3511J5830L248n24l490O904L9144
10847I1657J4666o630o011K4393L14m75L431j4443K5738K8571R251M0029M0766
10834B51257K1448J6349L2121L2547Q2370P6345P8263O2857M976Q125N3025O4737
10822G84420O9616O9894K7445j572k4405m1828l8808m0556L1439K4737K9033k1241
10810H68174k7730l0932o325K898J1523J3518o543m0325l5680k6682k3260k1602
10798F77034k9443j2935l01R404L1157N3631N9396Q4755J09403J18657J23349
10787A224107J52189J76026J37841J06292O8594K764K5127J00706J59865J90251
$$ y = [17808, 4205, -14244, 5574, 43878, 45483, 51315, 71741, 47178, 45192, 69145, 72107, 77987, 69184, 80120, 82307, 75262, 63871, 48790, 17034, 30545, 46375, 49623, 49099, 45609, 52513, 91657, 106323, 99693, 93682, 118075, 118389, 117914, 121345, 106902, 132640, 161211, 170462, 210491, 251257, 272705, 289054, 321175, 353722, 436092, 512437, 590700, 653557, 658533, 666658, 719683, 784420, 854036, 923930, 951375, 949803, 925398, 883570, 844762, 804206, 835645, 860382, 889415, 868174, 840444, 809512, 803187, 806085, 817608, 831126, 824583, 784258, 748578, 721896, 698636, 677034, 647591, 634656, 634355, 643759, 674916, 728547, 787943, 872698, 982101, 1100758, 1224107, 1376296, 1552322, 1690163, 1796455, 1865049, 1867813, 1892940, 1993646, 2153511, 2343762]
10777B343762J80486J08565L4646r8936j48789j09305p6253k667m915n396j9563
10766B201635n9306j20355j24492n7906P22K9629M5392J9716j3892k3221m589
10755A893333L4268k5482l3043k7585j0679N2945P2530J04911J34041J15202J23113
10744B433554J04706J09311J73717J41262P9011L9860O38l565K7370N5317Q5620
10733C246801O8558k4710p2046j13980j19268p2702j1723O5367O2624M1169l9776
10722C030314j60730k35589k41267j44833j01163k9019J1140O7755Q0699O4565
10712B341872K5201J525p433q287k1983p6883n8686p9729j7550L9465P8711Q5110
10700B301333Q0327R2056J39998J63266J56874J39292R8640J6728o7609q1971
$$ y = [2343762, 2524248, 2632813, 2667459, 2568523, 2419734, 2310429, 2234176, 2231509, 2226594, 2221198, 2201635, 2142329, 2021974, 1897482, 1839576, 1840298, 1869927, 1915319, 1935035, 1921143, 1897922, 1893333, 1927601, 1902119, 1869076, 1841491, 1830812, 1883757, 1956287, 2061198, 2195239, 2310441, 2433554, 2538260, 2647571, 2821288, 2962550, 3041561, 3081421, 3082059, 3078494, 3105864, 3161181, 3246801, 3315359, 3290649, 3218603, 3104623, 2985355, 2912653, 2900930, 2966297, 3028921, 3070090, 3030314, 2869584, 2633995, 2392728, 2247895, 2146732, 2117713, 2128853, 2196608, 2277307, 2341872, 2367073, 2368598, 2361165, 2352878, 2330895, 2254012, 2195326, 2115597, 2098047, 2137512, 2216223, 2301333, 2381660, 2473716, 2613714, 2776980, 2933854, 3073146, 3171786, 3188514, 3120905, 3038934]
10690C038934o9687m7621n3676j07024j45289j15420o3388n352L3238L3806j1930
10679B486591j0842k2732K561Q272n270R790J966j700m3911r7283j00639k7908
10667B198895K3367O9318O5218P639l7636p4081o7800q1753j13275j27831q1421
10656A780640q8750o7933m7052q83L3183Q1739J35152J39297J07190P5122l3575
10645B114130j02128j61531j28855q1180m4366l9385o8562l2075m9577m6226p1166
10634A289079k0755J346q683l611R28L8828Q3111J24649J03714O255o5989q3142
10622A465730p1966j0744L0479L8413N8355P9259J07609R6178P7686M657m2154
10611A833502q0356q0223n559N8910J22159J26490J58816J37413J16125K5950
$$ y = [3038934, 2969247, 2921626, 2867950, 2760926, 2615637, 2500217, 2436829, 2431477, 2464715, 2498521, 2486591, 2475749, 2453017, 2455578, 2463850, 2458580, 2468370, 2470336, 2468636, 2424725, 2327442, 2226803, 2198895, 2222262, 2291580, 2356798, 2364437, 2326801, 2252720, 2184920, 2103167, 1989892, 1862061, 1780640, 1691890, 1623957, 1576905, 1576022, 1609205, 1690944, 1826096, 1965393, 2072583, 2147705, 2114130, 2012002, 1850471, 1721616, 1640436, 1596070, 1556685, 1488123, 1456048, 1406471, 1360245, 1289079, 1268324, 1269670, 1260987, 1257376, 1258304, 1297132, 1380243, 1504892, 1608606, 1614861, 1548872, 1465730, 1393764, 1383020, 1413499, 1451912, 1510267, 1589526, 1697135, 1793313, 1870999, 1875656, 1833502, 1753146, 1672923, 1667364, 1726274, 1848433, 1974923, 2133739, 2271152, 2387277, 2413227]
10601B413227j01982j80851j89819j54882j16278p1449n9765m7006n8825l8733
10591A393637m062M3665Q2994P8485Q0480K5272n3218j10371j42790j33908j11419
10580A148765o5246n1344m5315j8595k9379l7570r971q445j9400k4861j4023j3354
10568H11262o91K3092K6218K4533N8476O8384Q3835P4747O1206L2971L22K7814
10556A292169K0364P2525J19592J32415J71294J68887J57639O0643j2843o8126
10546B114559q9817l9236k6128j9151q019K8478K2542k4289k7508M073k1258Q02
10534A915048J6653j1576j3364p0868j01216o7055M190L4710L6487J3564j0828
10523A745745n4714q6257j03949j06353j19591j12748m5199k0010m0576o0590
$$ y = [2413227, 2311245, 2130394, 1940575, 1785693, 1669415, 1597966, 1538201, 1491195, 1432370, 1393637, 1389575, 1433240, 1516234, 1594719, 1675199, 1700471, 1647253, 1536882, 1394092, 1260184, 1148765, 1083519, 1032175, 986860, 968265, 938886, 901316, 891345, 882900, 863500, 838639, 824616, 811262, 810571, 833663, 859881, 884414, 942890, 1011274, 1095109, 1169856, 1231062, 1264033, 1264355, 1292169, 1312533, 1385058, 1504650, 1637065, 1808359, 1977246, 2134885, 2195528, 2182685, 2114559, 2024742, 1985506, 1959378, 1940227, 1932208, 1960686, 1983228, 1958939, 1931431, 1935504, 1914246, 1915048, 1931701, 1920125, 1906761, 1835893, 1734677, 1667622, 1671812, 1706522, 1743009, 1756573, 1745745, 1691031, 1604774, 1500825, 1394472, 1274881, 1162133, 1116934, 1096924, 1056348, 995758]
10513I95758m0971j4150j6975k9370m0674p215k0285p311J5624J8256J4759P096
10501H74542K9601L3248P818l9308m1028j2449L1438M5125M9688P8452J53069
10490A210196J35819Q2786L7142k5429l4487p7349p0683n6419n8132m9291m8080
10479A046073k9564L6617M2518P065K4177Q1481J12750J07567N7139j6561n7749
10468A411513q8011q0603q2945p9418o1034m9171k9191k4852J4588j8934n9971
10457H51971o6408m6336m3304k9092o7262k8153j75j352k1238k0884o461j852
10445E19454m2292n3641l1578J17j6974o495j3127J1500L25P201O608K929o401
10432C77626L23J3835K8376Q567J2159l243j004J7326J0414n318n7188m2851R35
$$ y = [995758, 954787, 940637, 923662, 894292, 853618, 846403, 826118, 818807, 834431, 852687, 867446, 874542, 904143, 937391, 945209, 905901, 864873, 852424, 883862, 928987, 978675, 1057127, 1210196, 1346015, 1428801, 1465943, 1440514, 1406027, 1328678, 1257995, 1201576, 1143444, 1094153, 1046073, 1016509, 1053126, 1095644, 1102709, 1126886, 1208367, 1321117, 1428684, 1485823, 1469262, 1411513, 1323502, 1242899, 1159954, 1080536, 1019502, 970331, 941140, 916288, 930876, 911942, 851971, 785563, 739227, 695923, 666831, 599569, 571416, 571241, 569889, 548651, 527767, 521306, 519454, 477162, 423521, 391943, 392060, 375086, 368591, 355464, 366964, 367289, 374490, 381098, 384027, 377626, 377949, 391784, 420160, 428727, 440886, 437643, 436639, 453965, 464379, 459061, 401873, 359022, 359957]
10419C59957r860o84O488L6739J7650L6139K1692j4094j2726l6248k5177J9201
10407C99077L453L4945N523n2196m1600k7565k4976m2718o904P227n181j2004
10395B37081J850k5585k2034k7570j2862o425O068R018k7212o92q441j1285P949
10382A19860J181P423J257j0674K820j7730j3612l9j3441m019J0445J5748O285
10369A05504k899p859R69j0310J1238k4353J7158K2033p019l0705k6521j9432
10357B7804K6185L1488L068j4478K0957K601o349j936j5642l437l2853k2365k2454
10344g411n30J4630J8653n576J2546J1095j6086L812K5896J5173m778k1915J295
10331D6804p368j2419K6925J7836r718j4300o983n023j2149n158R625M7761K3017
$$ y = [359957, 350097, 349413, 355901, 392640, 410290, 446429, 468121, 454027, 441301, 405053, 379876, 399077, 402530, 437475, 442998, 390802, 349202, 321637, 296661, 253943, 247039, 254266, 249085, 237081, 238931, 213346, 191312, 163742, 150880, 144455, 150523, 159541, 132329, 131637, 123196, 111911, 119860, 121041, 128464, 129721, 119047, 121867, 104137, 90525, 90486, 77045, 73026, 83471, 99219, 105504, 102605, 94746, 95715, 85405, 96643, 72290, 89448, 111481, 104462, 73757, 47236, 27804, 53989, 85477, 88545, 74067, 95024, 97625, 91276, 89340, 73698, 70261, 37408, 15043, -7411, -7941, 6689, 25342, 19766, 32312, 43407, 27321, 31133, 57029, 72202, 67424, 45509, 46804, 39436, 27017, 53942, 71778, 62060, 47760, 40777, 35754, 23605, 18447, 28072, 75833, 98850]
10318I8850m0542k8959J2357l196j5396j6830K9531J4552m739m901K4374n748
10306E9353q733j5167k8044j3845K8079L6450K1487J2763j0769K389k6031l7121
10294B0811j0976K1534R065j1756J9393r98J987r802j6363j199J7238j8632O447
10281B6749L672j9432j087K387n110m233O096K4914L3378k617k311j171J428j9553
10267D3110m77j6563q825P150K1301P464j0963j2300R235J791P278L09L731j7742
10253C4499k8774j2673K1643K3617L5181Q619l501l6607N460M671K4113O203l2830
10240D9621j6261p506o776K7433J2499K075j3907j3321p133j081j3290l799m955
10227C599O602K1760P504O128R278j1974j481L2065R132j9593l4896j3723k0773
$$ y = [98850, 58308, 29349, 41706, 38510, 23114, 6284, 35815, 50367, 45628, 40727, 65101, 59353, 50620, 35453, 7409, -6436, 21643, 58093, 79580, 92343, 81574, 83963, 57932, 20811, 9835, 31369, 40434, 28678, 48071, 47073, 49060, 39258, 22895, 21696, 38934, 20302, 26749, 30421, 10989, 9902, 12289, 7179, 2946, 9042, 33956, 67334, 64717, 62406, 61235, 62663, 43110, 42633, 26070, 17245, 24395, 45696, 53160, 42197, 29897, 39132, 40923, 48201, 48510, 52241, 34499, 5725, -6948, 14695, 38312, 73493, 82112, 78611, 42004, 47464, 52135, 76248, 82451, 49621, 33360, 25854, 19078, 46511, 59010, 61085, 47178, 33857, 26724, 25643, 12353, 8554, 3599, 10201, 31961, 39465, 45593, 54871, 42897, 41416, 73481, 82613, 63020, 28124, 14401, -6372]
10214f372K2237J3571k185L6183j159j4175r781K550l600K397J5742J0362M224
10201F9994O407J366m488R248l2626r431R125r80L838o383O58n565m198J2098
10187D9063j041j7252p776j565J354r565r973J5403J0226J3575K419J5556N342
10174F5766k6789k6773l7817J0196M1025K3190r966l4838o360K5030Q901j8918
10162A2647j0193L709M003j3402M048j1292k980m655J6849J1657m631M664P361
10149A7785j932J8202J3494P049j4968j6770O922L2873k196j9199j2550L968l577
10136B9101j1877j148k405k6101j6335r061J0675K4206J9807j6783m700Q185J0158
10123A3722k1937l710J1034J7589J0422j371l0976n05M347J0700L4408J0254o926
$$ y = [-6372, 15865, 29436, 27251, 63434, 62275, 48100, 38319, 40869, 37269, 39666, 55408, 65770, 69994, 76401, 77767, 73279, 82527, 49901, 40470, 49595, 48615, 52453, 46070, 46728, 41163, 36965, 49063, 48022, 30770, 22994, 21429, 22783, 13218, 3245, 18648, 28874, 42449, 44868, 60424, 65766, 38977, 12204, -25613, -15417, 25608, 48798, 38832, 3994, -2366, 22664, 31565, 12647, 2454, 6163, 10166, -3236, 812, -10480, -13460, -18115, -1266, 10391, 5760, 10424, 17785, 15853, 34055, 47549, 54598, 39630, 22860, 29782, 62655, 60459, 41260, 28710, 32678, 29101, 17224, 16076, 13671, -12430, -28765, -37826, -27151, -2945, 16862, 79, -4621, 3564, 13722, -8215, -11925, -891, 16698, 27120, 25749, -5227, -5732, -1385, 9315, 43723, 53977, 47051]
10110D7051j2224K368N589p67k0445j7150j0152j0132K2395J1666J7455K8135
10098F3789k6322j8274q841j1430O811J5646o895j8687l555O664r859n170J0742
10085e381P384j1749J4799J2148J9473Q691l177O490O743j8419l8162l224K4922
10072B0538m308K0595Q55j3270j1858R496o151l0008q810J8561J2229K0934J7424
10059D6227J6634L244k9074j8111m17K3164K9929J2820J5727L4521K9705K0505
10047A84874M2446N9746J01848J14464J49529J93524J07739p8280j91900j65680
10037E18310q5511o3203o5668l4786j2680l0171j9363k4771j6463p8j416J0779
10025A74979M2570j875j988n18P5q1j6344j650K3284N8534R497j2989o390K0679
$$ y = [47051, 34827, 37195, 42784, 42017, 21572, 4422, -5730, -15862, 6533, 18199, 35654, 63789, 37467, 19193, 10352, -1078, 5733, 21379, 14484, -4203, -7758, -1094, -10953, -16123, -5381, 2003, -9746, 5053, 17201, 36674, 45365, 42188, 48678, 55421, 37002, -1160, -4384, 20538, 16230, 36825, 37680, 24410, 12552, 22048, 15897, -14111, -22921, -4360, 7869, 28803, 46227, 62861, 66105, 37031, 18920, 18503, 41667, 71596, 84416, 100143, 134664, 164369, 184874, 227320, 287066, 388914, 503378, 652907, 846431, 954170, 875890, 683990, 518310, 432799, 369596, 303928, 269142, 256462, 226291, 206928, 182157, 165694, 165616, 164200, 174979, 217549, 215674, 213686, 213168, 213243, 213162, 196818, 195168, 218452, 276986, 286483, 273494, 267104, 287783]
10011B87783L6669L989k3975k5320J104k7079m776r804j6327O53n213j941J3687
9998B29450J4699J4309N5072O4831M4084Q124n401m61L3610K3266m2229m8261
9986C91093o7608n0571j5633l5134o0727k117j045J0532K6548o181K1341L7242
9974B47740n71J4697M8633N152R116L649l2447J3122K4076l9279k6863P866J2377
9961B87268K052j4504J381K5051M4688L8905k21O521J4261M4280L1655J3834q687
9948D86484K7968L9286N774k0217k9510J9149J2220n092k4308k056L2933K3992
9936E66623L0387R6877Q9723L4763M0867M3789L1670Q62l483n784k064O229k7854
9923I02605l1933J421J0504m6226l9848n8220k4427j5343k2717j4233j5781k9258
$$ y = [287783, 324452, 328441, 304466, 279146, 280250, 253171, 248395, 238591, 222264, 222917, 217704, 215763, 229450, 244149, 258458, 313530, 378361, 422445, 430569, 425168, 424707, 458317, 481583, 439354, 391093, 323485, 272914, 257281, 222147, 161420, 159303, 158258, 168790, 195338, 189157, 210498, 247740, 247169, 261866, 310499, 315651, 324767, 328416, 295969, 309091, 333167, 293888, 267025, 274891, 287268, 289320, 274816, 276197, 301248, 345936, 384841, 384620, 391141, 405402, 449682, 481337, 495171, 486484, 514452, 553738, 559512, 539295, 509785, 528934, 541154, 536062, 511754, 509698, 542631, 566623, 597010, 693887, 783610, 818373, 859240, 903029, 934699, 935561, 932078, 926294, 924230, 930459, 902605, 870672, 872093, 882597, 836371, 796523, 738303, 713876, 698533, 675816, 661583, 645802, 616544]
9911F16544L938L3454r977k2696l3039k147L930L7464J7274J0267J9199q266P353
9898F73298J6407k5586p881m116j494K7102N1515M3831N6119O9694P3372M7291
9886A019552O7207Q1268J19485J07037J9347p3828j27507j22005j17763r4664
9876H78129j5863L919m99M235N278L5331L5025L9958N8141Q7725O5121J9491J9397
9863A235388l899k2002j3063m4498p3051j11281j04273p6174m4031j5786L219
9852G30549J0667r43J5254R039J3377O779k2634m6544j1008j4306l303J0611j2701
9839F84837l3062l6339j4413k955n317k1179l0611k0095l0215j6368K7336J2359
9827E13978j0229J3278k365k2179j2768o93n818l1945l4095m3588j7141k3550
$$ y = [616544, 620482, 653936, 643959, 621263, 588224, 586077, 590007, 627471, 644745, 655012, 674211, 665945, 673298, 689705, 664119, 656238, 652122, 650628, 677730, 729245, 773076, 829195, 898889, 972261, 1019552, 1086759, 1168027, 1287512, 1394549, 1413896, 1340068, 1212561, 1090556, 972793, 878129, 862266, 866185, 865686, 869921, 875199, 910530, 945555, 985513, 1043654, 1131379, 1196500, 1215991, 1235388, 1231489, 1209487, 1196424, 1151926, 1078875, 967594, 863321, 787147, 743116, 727330, 730549, 741216, 740273, 755527, 764566, 777943, 784722, 762088, 715544, 704536, 690230, 686927, 697538, 684837, 651775, 615436, 601023, 598068, 592751, 571572, 540961, 520866, 490651, 474283, 501619, 513978, 503749, 517027, 514662, 492483, 479715, 479022, 473204, 441259, 407164, 363576, 346435, 322885]
9815C22885j774J4308k7876n282J3267J5036L2547L2905M8639O6576K0181j2681
9803E18731J1052j9496L267k8614n2552n0890o6381k1641P249J966j3960l0158
9791B58573m770j5199j6603j8519L3725J1592j6350R763L1547K4591J1169o109
9779C03410P197l1937k0644k6843l2890j2267j8023k5302k605J9398K067j2851
9767A48710k1404O059l345m0022l0005k166J2146J5862J3717R962p068k0529r593
9754G2324l2618R6j0640K2880q156j8287N877p76K3931L0978o776j2357o742j9613
9740D0121j3481M6426J5323l6021l6250J7847K4620O421n532j2987j1930J4047
9728D8604J4407J6533P436k4973J17j2149P120j189q173K154J8041J7990N982
$$ y = [322885, 321111, 335419, 307543, 302261, 315528, 330564, 363111, 396016, 444655, 511231, 531412, 518731, 529783, 510287, 513554, 484940, 432388, 381498, 315117, 293476, 300725, 302691, 288731, 258573, 253803, 238604, 222001, 203482, 237207, 248799, 232449, 242212, 273759, 298350, 309519, 303410, 310607, 278670, 258026, 231183, 198293, 186026, 168003, 142701, 140096, 159494, 161561, 148710, 127306, 133365, 130020, 89998, 59993, 57827, 69973, 85835, 99552, 109514, 102446, 81917, 72324, 39706, 39802, 29162, 52042, 43886, 25599, 31476, 30700, 54631, 85609, 78833, 66476, 59734, 40121, 26640, 73066, 88389, 52368, 16118, 33965, 58585, 65006, 59474, 46487, 34557, 48604, 63011, 79544, 86980, 62007, 62124, 49975, 57095, 55906, 47733, 49887, 67928, 85918, 91900]
9715I1900J4540J2486K798R893J7996J7625K4514M3338P3714P1240K3026l3946
9703C69124m5084l9396m4242o6375l2299l0641k4317r281j4911J1196M434K0718
9691I8926L437k8248l9833J4779L1166r615l3662j8674J1439J5054q104l517k374
9678C0774Q831q07q27M3795j5564J9036K6213J0074k4093j4961L8855J4268o279
9665A29315J1662k454K2511N9888M0046L6499O6839P6324R0754R1145R858O703
9653F39090K7193N091k7428l4771L319K9214N1261N6137K2562R625J4372j5129
9641G80536n9887p1677k4753M387J0481k4049o3318j04208o5452j9338j5145N525
9629C53102k5452p354k9638l9693j9067L6243K8268L5524K674l3937k0383m321
$$ y = [91900, 106440, 118926, 121724, 131617, 149613, 167238, 191752, 235090, 308804, 380044, 403070, 369124, 324040, 284644, 240402, 174027, 141728, 111087, 86770, 77489, 62578, 73774, 78208, 98926, 102363, 74115, 34282, 49061, 80227, 70612, 36950, 18276, 29715, 44769, 36665, 33148, 30774, 39605, 38798, 37971, 81766, 66202, 85238, 111451, 121525, 97432, 82471, 121326, 135594, 129315, 140977, 138523, 161034, 220922, 260968, 297467, 364306, 440630, 531384, 622529, 632387, 639090, 666283, 671374, 643946, 609175, 612494, 641708, 692969, 749106, 771668, 781293, 795665, 780536, 720649, 648972, 624219, 628606, 639087, 615038, 551720, 447512, 382060, 362722, 347577, 353102, 327650, 320296, 290658, 250965, 231898, 268141, 296409, 331933, 334607, 300670, 280287, 275966]
9617B75966j9252j3541M3468K6940J722J7845J8741M2361J9177J7475K8139N435
9605D64476L6763O7525N5075J6682K0660J2081L5693O7082R7476J36660J96660
9594A206833J57675O0826k4379r5262j02246n4726n1569l0999j354J1774K9818
9583A106391P00n0006p3470n2241l1153K9346M5409k4055p5490q9613l8966l0338
9571G16514k3620n4260l610J1285q844j6851j1690j6048l135m7987p2126j4175
9559D55453m640j4412k8263m4100K127L6988L4374O8093K6898M237j8649J8700
9547E36806O3499P0951Q7381M4109m634k5709m480O471K5113N1095O6365L9128
9535I56095M7476N3965J08683Q2539k3124l1146l722J5254O2793Q9047L4931m8000
$$ y = [275966, 256714, 243173, 286641, 313581, 315303, 333148, 351889, 394250, 413427, 430902, 459041, 464476, 501239, 568764, 623839, 640521, 661181, 673262, 708955, 776037, 873513, 1010173, 1206833, 1364508, 1425334, 1400955, 1305693, 1203447, 1148721, 1097152, 1066153, 1064799, 1076573, 1106391, 1107091, 1057085, 983615, 931374, 900221, 929567, 974976, 950921, 875431, 785818, 746852, 716514, 692894, 638634, 635024, 646309, 637465, 620614, 608924, 592876, 589741, 541754, 469628, 455453, 450813, 436401, 408138, 364038, 366165, 403153, 437527, 505620, 532518, 536755, 518106, 536806, 600305, 671256, 758637, 802746, 798112, 772403, 767923, 774394, 799507, 850602, 916967, 956095, 1003571, 1057536, 1166219, 1248758, 1225634, 1194488, 1190766, 1206020, 1268813, 1357860, 1392791, 1344791]
9523A344791j03464p7322j09941j00659o7719l2050L254k5885l2641k4930l8722
9512G34712m8367n3140l3409l2200m1181k3997K385l6503j5095k9404j8698J6440
9500D21543r37j9892O697J434j7875L613J7320O377j1348k183J2540J4701j1631
9487D20359k229J0073K2133O4802N5929L5652N9170N990j3917J8877L2079K9681
9475G38599J8739j2631k4531L692L888j6913L901k0121o545J1165j8444j2791
9463F68008j4267o8747n7818o4459o2386n8979l0224j6966k6286k2148P978J5305
9451B69011o136J680k164R875P041l385j1379k503Q204j6035j3629J2624o517
9438B46687l1514k7251M677m129m386J0914L4346K3642o510O297k5205l3804j9926
$$ y = [1344791, 1241327, 1164005, 1054064, 953405, 885686, 853636, 856890, 831005, 798364, 773434, 734712, 686345, 633205, 599796, 567596, 526415, 502418, 504803, 468300, 453205, 423801, 405103, 421543, 420606, 400714, 407411, 408845, 390970, 394583, 411903, 418280, 406932, 404749, 417289, 431990, 420359, 418130, 428203, 450336, 515138, 571067, 606719, 665889, 671879, 657962, 676839, 708918, 738599, 757338, 744707, 720176, 723868, 727756, 710843, 714744, 694623, 688078, 699243, 680799, 668008, 653741, 584994, 527176, 462717, 400331, 341352, 311128, 294162, 267876, 245728, 253706, 269011, 262875, 264555, 262391, 272266, 279307, 275922, 264543, 262040, 270244, 254209, 240580, 253204, 246687, 215173, 187922, 192599, 188470, 184084, 194998, 229344, 252986, 246476, 252773, 227568, 193764, 173838]
9425A73838M827N849j5835J0284K14k0122M669K9189O55j21J5455J1893N5498
9412B76293N989j0975k4271l7380r087q889N055k3773k1450n769q712q714j0782
9399A17535j8296J6937M0268J9965j8545k4720K093l049K3296R955K6524K4366
9387B16329K9372j5687p4863k1493K4736O339j8668j4461j4690R16j0874l0129
9375G6827J437J2873j825J719k2737j8884L2147m601j9251K3742J5213R088j934
9362A03814k055J4780p99k1053m477K4681k446J6485L7P564j4095k4545j8600
9349G9291r002j1160p115j009J1648P689R641M277k3231J341L172J8032K0761
9336A04335J5387L3160L1098j990j3787K1168L6045N3487O2348K5564l1961m0049
$$ y = [173838, 178665, 184514, 168679, 178963, 179177, 159055, 163724, 192913, 193568, 193447, 208902, 220795, 276293, 282282, 271307, 247036, 209656, 200569, 191680, 196735, 172962, 151512, 145743, 137031, 128317, 117535, 99239, 116176, 156444, 176409, 157864, 133144, 135237, 132188, 155484, 165439, 191963, 216329, 245701, 230014, 155151, 133658, 158394, 164733, 146065, 131604, 116914, 117830, 106956, 76827, 78264, 91137, 89312, 91031, 68294, 49410, 81557, 76956, 57705, 81447, 96660, 105748, 103814, 101759, 116539, 115740, 94687, 90210, 114891, 112445, 128930, 128967, 136531, 122436, 97891, 79291, 70289, 59129, 52014, 51005, 62653, 70342, 79983, 84260, 61029, 62370, 65542, 83574, 104335, 119722, 152882, 183980, 181990, 168203, 189371, 225416, 278903, 341251, 366815, 334854, 294805]
9324B94805m2579l1028k4121l2426j442J1450Q441r577M04j7748K550K1546l1033
9311A49242l5501r082j4582J2103K8334Q269j3898k3351n016j851L02o509k2073
9298F6387K6917M0167M636l77K3216O24j9306K6400K6247M8325N5040O6359N5557
9285D20192J3978l307l6890p6450m5324k4519k6302l4909q601q880N85J6305m079
9272A81799j9398j1755m788l2487K3772L6129P483M743O876J2336J4734k5473
9260A93971r334L578k5897o407M778K9386M755j9717k2355O327J1833o645o609
9247A57664O856l241r502N583K088L166J4951L4865J5630K843R041L2399K208
9234B74551j3849j6650p033j1727j1406k1852k5019j602J953J386j3376k2190
$$ y = [294805, 252226, 221198, 197077, 164651, 163209, 174659, 183100, 173523, 173927, 156179, 158729, 180275, 149242, 113741, 104659, 90077, 102180, 130514, 138783, 124885, 101534, 96518, 94667, 94969, 88460, 66387, 93304, 133471, 138107, 137730, 160946, 161570, 142264, 168664, 194911, 243236, 298276, 364635, 420192, 434170, 430863, 393973, 317523, 272199, 247680, 221378, 186469, 177868, 168988, 169573, 185878, 181799, 162401, 150646, 145858, 113371, 137143, 173272, 180755, 185498, 192374, 204710, 219444, 193971, 184637, 188215, 162318, 155911, 160689, 190075, 194830, 175113, 152758, 159085, 170918, 164273, 157664, 164520, 161279, 151777, 157360, 159448, 162614, 177565, 212430, 228060, 230903, 239944, 272343, 274551, 260702, 244052, 237019, 225292, 213886, 192034, 167015, 165413, 167366, 168752, 155376, 133186]
9222A33186O44M864L2973J2863M056J7182Q594J4644o73k4257k9559j8011P11
9209A57217K2384j0958J0853K0059j7419j1855L5241K0682q265k2414j9501J0621
9197A86645J3797L7677K0742j9770j9992K0101J2993Q940J8734L3519L8391K2791
9185C74568Q400k0864n7410n4695l160q552l0198l873k6046n155L054K467j8941
9172A59595R088j3860K2667K4880R700K3510K481k9216k6307L32o043l287M0907
9159B14447K1251j101J6698Q360n722K872j4845Q441J1913j8418j3157j5402j9463
9146A95874K494J904J2016m691j3146K6515K7188K5514M0259P244O987N542k9297
9133C04403j9579l3697m4368j9826k1966O291L4063m153k6327K2666K8018Q240
$$ y = [133186, 133830, 138694, 171667, 184530, 188586, 205768, 214362, 229006, 228333, 204076, 174517, 156506, 157217, 179601, 168643, 179496, 199555, 182136, 170281, 205522, 226204, 217939, 195525, 176024, 186645, 200442, 238119, 258861, 239091, 219099, 239200, 252193, 261133, 279867, 313386, 351777, 374568, 382968, 362104, 304694, 249999, 246839, 238287, 208089, 204216, 178170, 173015, 176069, 178536, 159595, 168683, 154823, 177490, 202370, 212070, 235580, 238061, 208845, 182538, 182870, 176827, 173540, 214447, 235698, 234597, 251295, 259655, 253933, 256805, 241960, 250401, 262314, 243896, 230739, 215337, 195874, 198368, 200272, 212288, 207597, 194451, 220966, 248154, 273668, 313927, 321171, 328158, 333700, 304403, 284824, 251127, 206759, 186933, 164967, 171258, 205321, 201168, 174841, 197507, 225525, 233765]
9121B33765j9779k458J7327j0994j0414K7316K774m918n504k0436k9860L0431
9109B07250P0956K005J5760K6059J4313k3522l3273p590k4466k6165j1261q59
9097B09207R371o929K147k686L0692J8502o388k1756K826L4942J5778L0008J7959
9084C33673l395O467O078J152K9392L6101L2353L9252M1629M3280M3334R7260
9072G06576J13988R3322J54710K47534L25775L99847N87163P59080R75744J220420
9062E584159J615898K242653K787961K480414K11210k168276k740026k269292
9054G744701j569080j031398p15288n53425m38975l26959k23562k06074j67021
9045B512919j26657j12033j00813q8663j09711p4248n9742m2064k5430l9600q1316
$$ y = [233765, 213986, 211528, 228855, 217861, 207447, 234763, 237537, 232619, 227115, 206679, 176819, 207250, 278206, 280211, 295971, 322030, 336343, 312821, 279548, 271958, 247492, 221327, 210066, 209207, 218578, 211649, 213796, 211110, 241802, 260304, 253916, 232160, 234986, 269928, 285706, 315714, 333673, 330278, 336745, 342823, 343975, 373367, 409468, 441821, 481073, 522702, 565982, 609316, 706576, 820564, 913886, 1068596, 1316130, 1641905, 2041752, 2628915, 3387995, 4363739, 5584159, 7200057, 9442710, 12230671, 14711085, 14922295, 12754019, 10013993, 7744701, 6175621, 5144223, 4428935, 3875510, 3436535, 3109576, 2886014, 2679940, 2512919, 2386262, 2274229, 2173416, 2084753, 1975042, 1900794, 1841052, 1798988, 1773558, 1733958, 1652642]
9034A652642l2716n358R35k0016K0225J1338J3351p466l3568m5724j8413q751
9022A526479n7913l8827k1779l7183o9158r2296q5153r0084o7269m7652m7391
9011H71774o3723l6403J564j8297k4708j8287l2890n7454k5085R831J1315l2250
8999E85387n2977j0960k012j1300j8883j3118k1052j1202N464m069l5228l1450
8987C78600j2483J829J0750P578k5793q751m1977j3278j2427r51j0053j1556J3512
8974B75000n31j1410r834m50P023q598j2762j1384K0361J1308m61l886j5558j864
8960B36954k0105r701J1856L5912L3497j3860R973J6582j9272n127N1211K2953
8948C50873J3282k648L226J817P087R669j3963m105k3504k1008j3395k6677j8308
$$ y = [1652642, 1619926, 1614568, 1615503, 1595487, 1615712, 1627050, 1640401, 1632935, 1599367, 1553643, 1535230, 1526479, 1468566, 1429739, 1407960, 1370777, 1301619, 1209323, 1124170, 1034086, 966817, 919165, 871774, 808051, 771648, 773212, 754915, 730207, 711920, 679030, 621576, 596491, 606322, 617637, 585387, 532410, 521450, 519438, 508138, 489255, 476137, 455085, 443883, 449347, 445278, 410050, 378600, 366117, 367946, 378696, 386274, 360481, 351730, 309753, 296475, 284048, 283097, 273044, 261488, 275000, 274469, 263059, 253225, 252775, 259798, 251200, 238438, 227054, 247415, 258723, 258262, 254376, 238818, 236954, 216849, 207148, 219004, 254916, 288413, 274553, 284526, 301108, 281836, 276709, 327920, 350873, 364155, 361507, 364733, 366550, 373637, 383306, 369343, 365238, 341734, 320726, 307331, 280654, 262346]
8935B62346j1088J0835K4662j3210l0710l932J7211j3423k2995p290R118J3357
8923B34881L154J4923o669Q417J1593O439O70m0721q29J0989J6844O951j2070
8910B54572l2245N567Q950J3954o133J4484J1964N962L1476J9226J7209K6828
8898C71814K8524P851L9453n45j9629k0507l0161k348q031j379k5875j4585k5202
8885B99380J343l408k811L114p530j0415j0876j1191r225j0325R10J1477J0528
8872B60971J243l599J3848J3073K3094J5308L357j4619j9046j5768P652k5058
8860B60456j8150M523J1433j5610O705j4032k38M7886J8386K0831K1662L347q860
8847C38339j4119J3882K506j3856j7129j2151J164J3931R084J732J3685k606j3481
$$ y = [262346, 251258, 262093, 286755, 273545, 242835, 238903, 256114, 242691, 219696, 212406, 221524, 234881, 238035, 252958, 246289, 254706, 266299, 272738, 273408, 232687, 231858, 242847, 259691, 266642, 254572, 222327, 227894, 236844, 250798, 244665, 259149, 271113, 277075, 308551, 327777, 344986, 371814, 400338, 408189, 447642, 447097, 427468, 406961, 376800, 374452, 366421, 365042, 339167, 324582, 299380, 300723, 297315, 294504, 297618, 290088, 279673, 268797, 257606, 248381, 238056, 238966, 250443, 260971, 262214, 258615, 272463, 285536, 308630, 323938, 327295, 312676, 293630, 277862, 285514, 260456, 242306, 246829, 258262, 242652, 249357, 235325, 235087, 282973, 301359, 322190, 343852, 347199, 338339, 324220, 338102, 340608, 326752, 309623, 297472, 298636, 312567, 321651, 323383, 337068, 334462, 320981]
8834C20981q725J8212L9783N299J849L1716J2546O041n239l3014j620L9097N783
8821D32709m64J0204j3404L1875q238M095L6733K4296P200J6179r528K3321K0220
8808E75198O2608P7898J10799P3884Q7938J22536J68905K28069K86671L88153
8798B182659N03212O37420P34285O58676K02460l72269o63183o19030m75570l19716
8788B468944k19479j47849j27735o6022o7839o8181l7242K1273M69L2950L2050
8777A821339P8927J55456J81235K32340K84813L41254M69014O38889P89308R77489
8767E970064J264723J501370J380758N92949o12100j272432j258896r26288n95673
8758F044475l53027j79988n109J90294L88028N43524Q01967J108801J426035J868405
$$ y = [320981, 312256, 330468, 370251, 375550, 377399, 409115, 421661, 427702, 422463, 389449, 387829, 426926, 432709, 432245, 442449, 429045, 460920, 452682, 456777, 493510, 517806, 525006, 541185, 531657, 554978, 575198, 637806, 715704, 826503, 900387, 988325, 1110861, 1279766, 1507835, 1794506, 2182659, 2685871, 3323291, 4057576, 4716252, 4918712, 4546443, 3883260, 3264230, 2788660, 2468944, 2249465, 2101616, 1973881, 1907859, 1840020, 1771839, 1734597, 1755870, 1756339, 1789289, 1821339, 1900266, 2055722, 2236957, 2469297, 2754110, 3095364, 3564378, 4203267, 4992575, 5970064, 7234787, 8736157, 10116915, 10709864, 10097764, 8825332, 7566436, 6640148, 6044475, 5691448, 5511460, 5506351, 5696645, 6084673, 6628197, 7430164, 8538965, 9965000, 11833405]
8748A1833405K315731K448604J768539M55618o32590j176504j557397j652665
8740A3802741j375239r15256m67177o6586K53989L82937J15321m69243q11216
8731A0450271p42798n08486k84236k7567J66208L67622O43006R39281J263890
8722A2267191J710674K251503K919394L783224M669071N082547M102193J679915
8714C8465712r22751k922529m012152m140104l501858k592923j761850j085922
8706A7525623n52192j27840L15588P52858J203312J771182K412772L020357L165887
8697B9487547K488781J471473M64530p53307j943671k325001j824011q45908K35973
8688B6456406J166948J776659J394961L8322j135920j586585j808963j995809
$$ y = [11833405, 14149136, 16597740, 18366279, 18821897, 18189307, 17012803, 15455406, 13802741, 12427502, 11512246, 11045069, 10978483, 11232472, 11615409, 11730730, 11261487, 10450271, 9707473, 9198987, 8914751, 8887184, 9053392, 9421014, 10064020, 11003301, 12267191, 13977865, 16229368, 19148762, 22931986, 27601057, 32683604, 36785797, 38465712, 37542961, 34620432, 30608280, 26468176, 22966318, 20373395, 18611545, 17525623, 16973431, 16845591, 17161179, 17914037, 19117349, 20888531, 23301303, 26321660, 29487547, 31976328, 33447801, 33912331, 33159024, 31215353, 28890352, 27066341, 26220433, 26456406, 27623354, 29400013, 30794974, 30833296, 29697376, 28110791, 26301828, 24306019]
8680B4306019j792596j304180p16608k00049L09164Q36832J460080K154006K999090
8671B8051758L999185N190873O342103O793188N813718L520320L05762l018850
8663E6998057n740862o875880o233540m839598l529464k486816j698672j077969
8655B4515256o27689k49814K11297O79009J124661J527496J782081J874464J889654
8646C2726415J318596k03662j489147j579172p89870L41988J479964K439152K740242
8637C6984506J974176Q71028J08133r79674k566986l578691l502890k738605j910191
8628B4660806j245158o54553j70260L30569Q78573J477470K195437K974074L728887
8619C4175845M281082M340826L466778J433760j824997m751247n683065m989847
$$ y = [24306019, 22513423, 21209243, 20492635, 20292586, 20601750, 21438582, 22898662, 25052668, 28051758, 32050943, 37241816, 43583919, 50377107, 56190825, 59711145, 60016907, 56998057, 51257195, 44381315, 38147775, 33308177, 29778713, 27291897, 25593225, 24515256, 23887567, 23637753, 23849050, 24528059, 25652720, 27180216, 28962297, 30836761, 32726415, 34045011, 33841349, 32352202, 30773030, 29983160, 30325148, 31805112, 34244264, 36984506, 38958682, 39829710, 39937843, 38958169, 36391183, 32812492, 29309602, 26570997, 24660806, 23415648, 22761095, 22590835, 22921404, 23799977, 25277447, 27472884, 30446958, 34175845, 38456927, 42797753, 46264531, 47698291, 45873294, 41122047, 35438982, 30449135]
8611C0449135l813864k781425k038820j478626j121804q88783o56955m47228k91821
8602A6929809j34382O3041L24856N61013O23286K99827k29673m55992k25771K54692
8592A8010706P88919J267865J668119J810871J744936J711435J214544n06401
8584B7710994k378792l108823k823755k173197j602337j153713q55674n87727
8576A3026976l86932k22801l8236J78384M18567O74424J004615J321820J266692
8567A7243509M05011j015082j843250j863200j498633j077170p93776n98834n01537
8558H457038m37921l34587k75977k59323k68679k66700k05437j88700j40403j24134
8548E955177p7852o7037k8085M1812J32603K16660L14165M07462N67768P39126
$$ y = [30449135, 26635271, 23853846, 21815026, 20336400, 19214596, 18325813, 17668858, 17221630, 16929809, 16795427, 16858468, 17183324, 17744337, 18367623, 18667450, 18437777, 17981785, 17756014, 18010706, 18799625, 20067490, 21735609, 23546480, 25291416, 27002851, 28217395, 27710994, 25332202, 22223379, 19399624, 17226427, 15624090, 14470377, 13614703, 13026976, 12640044, 12417243, 12379007, 12557391, 12975958, 13650382, 14654997, 15976817, 17243509, 17648520, 16633438, 14790188, 12926988, 11428355, 10351185, 9557409, 8958575, 8457038, 8019117, 7684530, 7408553, 7149230, 6880551, 6613851, 6408414, 6219714, 6079311, 5955177, 5877325, 5810288, 5782203, 5824015, 5956618, 6173278, 6487443, 6894905, 7462673, 8201799]
8538H201799P52057L17898m62624r60602j049705q25618o06679m43899l19853
8529D602774l01554k72632k42630j92327k04787j80978j58568j24176j01795j35394
8519B687933j34117r1743p6029q7311q6908p1203m9170l4221m7534l5225k4238
8508A950234J6664j1154m8091n0068m4593m6302l8925l5167l4622l2210k9937
8497A595829m2419o1536n3949o2627m7865n6018n3391j1897m6440n2850j7779
8486A089058k2837j8608j5596k3601n5166j4830J389k5852l3929k9872l5920k0546
8474G93690j9252m3655N692J4889J308O828j0022l0689o699K701k81p621R025
8461G15914M3495L2343l755j0389m4695o0359k9243r869K683j8458p331j5398
$$ y = [8201799, 8953856, 9271754, 8809130, 7848528, 6798823, 5973205, 5366526, 4922627, 4602774, 4301220, 4028588, 3785958, 3593631, 3388844, 3207866, 3049298, 2925122, 2823327, 2687933, 2553816, 2462073, 2386044, 2298733, 2211825, 2140622, 2091452, 2057231, 2009697, 1974472, 1950234, 1966898, 1955744, 1907653, 1857585, 1812992, 1766690, 1727765, 1692598, 1657976, 1625766, 1595829, 1553410, 1491874, 1437925, 1375298, 1327433, 1271415, 1218024, 1206127, 1159687, 1106837, 1089058, 1066221, 1047613, 1032017, 1008416, 953250, 938420, 939809, 913957, 880028, 850156, 814236, 793690, 774438, 730783, 736475, 751364, 752672, 759500, 749478, 718789, 712090, 714791, 714510, 706889, 715914, 759409, 791752, 787997, 777608, 732913, 672554, 643311, 633442, 636125, 617667, 610336, 594938]
8449E94938j6633q851P355K0752m369j5516k1883l413k3175N75M207m0309l917
8436D89761J752j4280J3492J5671O617N074l5706j2203O095n206j2300j2724j1349
8423D34694P134J3064n554l4174j545j603l1689O309J9982O867K519O710k656
8410D20058q683R081O65l9265k4152J2741P2738M3940j3843K0288O750r749L0173
8397E20742R261m2812J0733j0363n3020l17O066j078j0946k9972k1547j3604j3865
8384C49278j2005L1133K7555J5826R387M6871M1399M6283K5060L413k5699r197
8372E49304k7403j2479L11o969J5516J2189L2580p329k0744k8514m5155k558n620
8359D53129j8851k3622J3007K8717N2504K3230N189K6997N6024L4456P221K6137
$$ y = [594938, 578305, 569454, 576809, 597561, 593192, 577676, 555793, 552380, 529205, 529780, 533987, 493678, 489761, 491513, 477233, 490725, 506396, 513013, 518087, 482381, 470178, 476273, 471067, 458767, 446043, 434694, 441828, 454892, 449338, 415164, 413619, 412016, 380327, 386636, 406618, 413485, 416004, 422714, 420058, 411375, 420456, 421121, 381856, 357704, 370445, 443183, 487123, 473280, 493568, 500318, 490569, 520742, 530003, 487191, 497924, 487561, 434541, 434224, 440290, 439212, 428266, 398294, 376747, 363143, 349278, 337273, 368406, 395961, 411787, 421174, 468045, 509444, 555727, 580787, 584200, 558501, 549304, 521901, 509422, 509733, 502764, 518280, 530469, 563049, 555720, 534976, 506462, 461307, 458749, 453129, 434278, 410656, 423663, 452380, 504884, 528114, 533303, 560300, 616324, 650780, 658001, 684138]
8347F84138k023m3391k8601k2010j5424n846p720J9955J9897J2406K7137j264
8335F37254o0644k9525k6029j829o444L8001N7808M5320R4774O4059o937l9579
8323G66229o0254o6334m9687j1070L789l987K8003K8679K2917J2674M478K0545
8311F95982j0620j771l381k4192j7668k0062l4977m2341m024O897Q568k15J7735
8298E69931j1263R33R44l3098l7852m2423j4428l480n588K0879P3283M3120M7236
8285F08194M1398K1141K2851L1496R912k307l7108l8740q3179o0920J512o522
8273E07728j622j0015k4980m0131l3143J6456q181j9238N984J2143J5631J4501
8261D35133O540n22N816k2812m2219l264J2757j6736l1192j1782l9230o759J6916
$$ y = [684138, 682115, 638724, 610123, 588113, 572689, 566843, 559123, 579078, 598975, 611381, 638518, 637254, 576610, 547085, 521056, 519227, 512783, 550784, 608592, 653912, 748686, 812745, 805808, 766229, 705975, 639641, 589954, 578884, 582673, 578686, 606689, 635368, 658285, 670959, 675437, 695982, 685362, 683591, 680210, 656018, 638350, 618288, 583311, 540970, 536946, 543843, 552411, 552196, 569931, 558668, 559601, 560545, 527447, 489595, 447172, 432744, 429264, 423676, 444555, 517838, 560958, 608194, 649592, 670733, 693584, 725080, 734992, 732685, 695577, 656837, 573658, 512738, 514250, 507728, 506106, 496091, 471111, 430980, 397837, 414293, 406112, 386874, 392858, 405001, 420632, 435133, 441673, 441151, 446967, 424155, 381936, 378672, 391429, 374693, 343501, 331719, 292489, 285730, 302646]
8248C02646M591N291j5852J9998K1460j890j2336K4491K438J6120J1506l363m852
8235C70248L2110L5702L5977J3779k6301l3926k4950p065j8589k4412j6352j4215
8223C22006l0474j3330j4353O450J0243N395Q336M725j9492k0309p598j5567J1672
8210B47704K9978p850n3447j7307J2093J4708j7569j3844J0584N618J298J5535
8198B27501P409k717K3611L2219L1789K2108j7202k3103k3684m209R166j8775
8186B64113j7064j3119l1459R245J2258m83j5429K4516L9299l246J310M1249J7238
8173C28428j5909j7698l05k1071K7274J959j2245J0111J6958l429l045L17p512
8160C03833J791k6838j5446K5958K739n822k4874J8862R062K1123j8682N461L6301
$$ y = [302646, 307237, 312528, 296676, 316674, 338134, 336244, 323908, 348399, 350837, 366957, 378463, 375100, 370248, 402358, 438060, 474037, 487816, 461515, 427589, 402639, 395574, 376985, 352573, 336221, 322006, 291532, 278202, 263849, 270299, 280542, 285937, 294273, 298998, 279506, 259197, 251599, 236032, 247704, 277682, 269832, 216385, 199078, 211171, 225879, 208310, 194466, 205050, 210668, 211966, 227501, 234910, 232193, 255804, 288023, 319812, 341920, 324718, 301615, 277931, 273722, 282888, 264113, 247049, 233930, 202471, 211716, 223974, 223491, 208062, 232578, 271877, 268631, 269941, 311190, 328428, 312519, 294821, 294516, 273445, 300719, 302678, 290433, 300544, 317502, 314073, 311028, 311345, 303833, 305624, 278786, 263340, 289298, 292037, 286215, 261341, 280203, 289265, 310388, 291706, 297167, 333468]
8147C33468M8299K6865J1823K192J2354K0462n434k9461j5990M342M991q042l7233
8134C68636k0474J2768M3117O2361N0823O1463L7345M5866O6640O5236J4807k3169
8122G85419k9684o4353n5184l0798n4275j6072l256l5612l9557j9380J9624J2913
8110D69785J862N782j2067k5664l1170j3795J6124l068k4068n528M2744L0436
8098D51373K0040N8026N8361K7985K3938J9406K7125M0268l34q36K7944K5903
8086G79199M1346Q5615Q3312J16904J12086J33246J39065J17020O1515j8427j12837
8075A538044j53923j11747o3428o6762p6915n6811m9889o4747n4275o2900k3927
8064G52720J5459k0453l7934n1071n4717J4371j574L304j057m780j2106k0112
$$ y = [333468, 381767, 408632, 420455, 422647, 435001, 455463, 450029, 420568, 404578, 408920, 413911, 405869, 368636, 348162, 360930, 404047, 466408, 517231, 578694, 616039, 661905, 728545, 793781, 808588, 785419, 755735, 691382, 636198, 605400, 551125, 535053, 531797, 496185, 456628, 437248, 456872, 469785, 471647, 477429, 465362, 439698, 408528, 394733, 410857, 407789, 383721, 378193, 420937, 451373, 471413, 529439, 587800, 615785, 639723, 659129, 686254, 726522, 726188, 725352, 753296, 779199, 820545, 906160, 989472, 1106376, 1218462, 1351708, 1490773, 1607793, 1669308, 1650881, 1538044, 1384121, 1272374, 1208946, 1142184, 1065269, 1008458, 958569, 893822, 839547, 776647, 752720, 768179, 747726, 709792, 658721, 604004, 618375, 616801, 620105, 619048, 614268, 602162, 582050]
8052E82050K9008Q088K5756L1054K893J6303M2533N1414M4657P6572O9780P8432
8040A058540L1222R573K0183j5503L1992N5576M2321N5313J7049j8661m3711p8130
8028A165764o9256n2635o5873p8247n6781k7556l5684n7546m7839m5706m0145
8017E88496j2035Q550k1250p5551l8379J4396j757k5919k338K3155p73K1057J7339
8004D94991j529J7558M1103L1689N9674K4498l553n2553m9166k9188j9325j3495
7992E00704q947j138j7353m845k5944k1620k0850J0840k0361k4104L238N519N878
7979C81017j3503l1313P008p803j239J664l700L8042N2564L1761K8093l920K9356
7966E08027M4151M8434N4113O2700J00307J06814J24423J62613J93112K29685
$$ y = [582050, 611058, 619146, 644902, 675956, 678849, 695152, 737685, 789099, 833756, 910328, 980108, 1058540, 1089762, 1099335, 1119518, 1104015, 1136007, 1191583, 1233904, 1289217, 1306266, 1287605, 1243894, 1165764, 1096508, 1043873, 978000, 899753, 842972, 815416, 779732, 722186, 674347, 628641, 588496, 576461, 585011, 563761, 488210, 449831, 464227, 462470, 436551, 434213, 457368, 456595, 477652, 494991, 493462, 511020, 552123, 583812, 643486, 667984, 664431, 611878, 562712, 533524, 514199, 500704, 491757, 490619, 473266, 468421, 442477, 420857, 400007, 410847, 390486, 366382, 369620, 375139, 381017, 367514, 336201, 343209, 335406, 334167, 335831, 332131, 370173, 422737, 454498, 482591, 478671, 508027, 552178, 600612, 654725, 717425, 817732, 924546, 1048969, 1211582, 1404694, 1634379]
7956A634379L07608K99853J79978k2736k42332l11591k79469j94134j34071r4223
7946A143262p2141n8J1770j4192k9653k4288j6335k3641j1546j9338j787J5511
7934I57564J2450k1014j9789k899N114J6044M9306k131J7723R344M8537N8850
7922A129099M7816L3496N7392L1302L1204Q2097P3032N2352P9377Q4025P1703
7911A772895J13639O6367R5854J42822J53102J78574K58255L32660L12354K07832
7901C634354N500j53782k42712k17010j47863p9119k7394j0853R359M8335P3572
7890B892387N3392J5618L4683Q6467Q8521R7631J39794J71720J78572K10219K35014
7879D204018K77307L22227L94799M81589O32228Q53230J094861J440892J847919
$$ y = [1634379, 1941987, 2241840, 2421818, 2399082, 2156750, 1845159, 1565690, 1371556, 1237485, 1143262, 1071121, 1071063, 1082833, 1068641, 1038988, 1014700, 998365, 974724, 963178, 943840, 942053, 957564, 970014, 949000, 929211, 926312, 931426, 947470, 996776, 994645, 1012368, 1021712, 1070249, 1129099, 1176915, 1210411, 1267803, 1299105, 1330309, 1412406, 1485438, 1537790, 1617167, 1701192, 1772895, 1886534, 1952901, 2048755, 2191577, 2344679, 2523253, 2781508, 3114168, 3426522, 3634354, 3639854, 3486072, 3243360, 3026350, 2878487, 2799368, 2771974, 2761121, 2770480, 2818815, 2892387, 2945779, 2961397, 2996080, 3082547, 3171068, 3268699, 3408493, 3580213, 3758785, 3969004, 4204018, 4481325, 4803552, 5198351, 5679940, 6312168, 7165398, 8260259, 9701151, 11549070]
7870A1549070K344816K987091L779907M379869M218958L038782J568927M99938
7862C4367358n03694j959810l366519l836212l323839k448381j661374j069871
7854A6197658o65079l49000p8484J36300L65053N99769Q60949J263381J762188
7845B0092735K367003L122149M050639N146940O628471Q460324J0272819J1333395
7837G1474475J0848212Q949486O949081N430494M166742K332743k42828k106802
7829A07801603k430931q65534K703167P141219R655971P140402M00896o442453
7821A25104340r258142p161762k977966M08933R86467j034925l904927n868531
7813I6293487o310748o219759o450223o634565o132464m899493l545582k338156
$$ y = [11549070, 13893886, 16880977, 20660884, 25040753, 29259711, 32298493, 33867420, 34367358, 33863664, 31903854, 28537335, 24701123, 21377284, 18928903, 17267529, 16197658, 15532579, 15183579, 15105095, 15241395, 15606448, 16206217, 17067166, 18330547, 20092735, 22459738, 25581887, 29632526, 34779466, 41407937, 49868261, 60141080, 71474475, 82322687, 91272173, 98221254, 103651748, 107818490, 110151233, 109908405, 107801603, 105370672, 104505138, 107208305, 114349524, 124005495, 131145897, 131546793, 125104340, 115846198, 108684436, 105706470, 106115403, 107101870, 106066945, 102162018, 96293487, 89982739, 83762980, 77312757, 70678192, 64545728, 59646235, 56100653, 53762497]
7805E3762497j377074o24797R1592P85213J539327K420024L531773M714204N411209
7796G0253968N026326L666210K373584J787843J228054L05528J05555J658904
7788H6405972M433964P264945R145563R376421Q611033P255313L925192j777810
7780A34640593p000808q213817n166880n37499K865037L304755J762387j24058
7772A21529710j685715l160707m521523n152972n750157p306648q831295q960295
7764G6160398p787828o235812m829568l766176k992668k394163j892433j475368
7756D4786382j096743p46084l82440J4019M64974R39688J530386K239022L148630
7747E0897834M019512M154237L173373J305370p07598k484948m267460n438505
$$ y = [53762497, 52385423, 51760626, 51852218, 52637431, 54176758, 56596782, 60128555, 64842759, 70253968, 75280294, 78946504, 81320088, 83107931, 84335985, 84641513, 84747068, 86405972, 90839936, 98104881, 107250444, 116626865, 125237898, 132493211, 136418403, 134640593, 127639785, 119425968, 114259088, 113721589, 116586626, 119891381, 121653768, 121529710, 119843995, 116683288, 112161765, 107008793, 101258636, 93951988, 85120693, 76160398, 68372570, 62136758, 57307190, 53541014, 50548346, 48154183, 46261750, 44786382, 43689639, 42943555, 42561115, 42575134, 43040108, 43979796, 45510182, 47749204, 50897834, 54917346, 59071583, 62244956, 63550326, 62842728, 60357780, 56090320, 50651815]
7739E0651815n428186m514230l447613k742532k262864j952155j764753j601853
7731B6937629j443982j312422j198339j118461j009601r40938q87979q55663q34097
7722A7336147p35105o59547n86394n22078m59498m32596l99432l63440l44010
7713A2834047l29110l35176l13883l09660k92614k12666j54934p4078n5795O894
7703A0763025J88775L01283L07083J24020k52935o56206q05875p74517o92016
7694H502637o15680n59043m73713l98723l86999l31506k50998k59678k60432k32149
7684D733716k21432k27784j99166j81014j75639j57902j32423j05204n8843p1165
7674C203144r6202n0510J775N7511O5394J2599K6567N9409R4141L7070O012j9348
$$ y = [50651815, 45223629, 40709399, 37261786, 34519254, 32256390, 30304235, 28539482, 26937629, 25493647, 24181225, 22982886, 21864425, 20854824, 19913886, 19025907, 18170244, 17336147, 16601042, 15941495, 15355101, 14833023, 14373525, 13940929, 13541497, 13178057, 12834047, 12504937, 12169761, 11855878, 11546218, 11253604, 11040938, 10886004, 10811926, 10756131, 10763025, 10951800, 11253083, 11560166, 11684186, 11431251, 10775045, 9969170, 9194653, 8502637, 7886957, 7327914, 6854201, 6455478, 6068479, 5736973, 5485975, 5226297, 4965865, 4733716, 4512284, 4284500, 4085334, 3904320, 3728681, 3570779, 3438356, 3333152, 3274309, 3203144, 3106942, 3056432, 3058207, 3115718, 3181112, 3193711, 3220278, 3279687, 3373828, 3410898, 3416910, 3397562]
7662C397562m1092N834O3200J43856K33214K77139L35870L90549N14934N78931
7652E899997M61839J34432k84478n75159o86770n63530l82139k73540k50678k21141
7642C258833j70182j28047o7858l2895p9755r1535o7031o4570q7719o7626m0299
7631B361316K3339k4363k6045J3242q056n7561m5341r5126p0384M331J1362M241
7619B090955j7749j7928n135l965k8738k4574m2802n6347n9258n5707m5388j3366
7607A719998j246J866j9915k9405O462l3789j9987J2806m693k2450l5678n2841
7595A521128l7455p7760l2228o335K0861k5968m8834m0422J0711L0769O514j4256
7583A306725m1795m8279j6155k955j4917k9266j4646o870j4695r70k6906m0222
$$ y = [3397562, 3356470, 3362304, 3425504, 3569360, 3802574, 4079713, 4415583, 4806132, 5321066, 5899997, 6361836, 6496268, 6211790, 5636631, 4949861, 4386331, 4004192, 3730652, 3479974, 3258833, 3088651, 2960604, 2892746, 2859851, 2780096, 2688561, 2621530, 2556960, 2469241, 2401615, 2361316, 2384655, 2360292, 2334247, 2347489, 2339433, 2281872, 2236531, 2141405, 2071021, 2075352, 2086714, 2090955, 2073206, 2055278, 2050143, 2046178, 2017440, 1992866, 1950064, 1893717, 1834459, 1778752, 1733364, 1719998, 1718752, 1720618, 1700703, 1671298, 1677760, 1643971, 1623984, 1636790, 1632097, 1609647, 1573969, 1521128, 1483673, 1405913, 1373685, 1367350, 1388211, 1362243, 1313409, 1272987, 1283698, 1314467, 1320981, 1306725, 1264930, 1216651, 1200496, 1197541, 1182624, 1153358, 1138712, 1131842, 1117147, 1116177, 1089271, 1049049]
7571A049049J8386l71k8223j7088m6835j8052k7750j821j107q899j3148l1224
7559H72917k9304j7472l0296j2875j7133j148l7714n1615k6672P524K9550k270
7547F83492P580k5453Q123j3797j0150l7999l8364M001M0073J0732j1095O13K0451
7534F38207J3086J255K8481J797k4258k1600k7399J2424j561r705L8741J5394
7522F64862k5926k5907j8331j7757j9368Q651o102l4693L601k0348k9765n241
7510D73676J1775n261k747p245N649J5040k629J475l1508k6260k4035J8286N677
7497D31893K7455N4165K7995q15k8967k0549l199l333L847k8056l836L9425K6073
7484E22098j5300O989k334J3981L0921J6655m52K2100l4106k1682K2535L027L0776
$$ y = [1049049, 1067435, 1067064, 1038841, 1021753, 974918, 956866, 929116, 927295, 926188, 917289, 904141, 872917, 843613, 826141, 795845, 782970, 765837, 764689, 726975, 675360, 648688, 656212, 685762, 683492, 691072, 665619, 673742, 659945, 649795, 611796, 573432, 577433, 617506, 628238, 617143, 617756, 638207, 651293, 652548, 681029, 682826, 658568, 636968, 609569, 621993, 620432, 610727, 649468, 664862, 638936, 613029, 594698, 576941, 557573, 566224, 560122, 525429, 529030, 508682, 478917, 473676, 485451, 480190, 477443, 470198, 475847, 490887, 488258, 489733, 458225, 431965, 407930, 426216, 431893, 459348, 513513, 541508, 540693, 511726, 491177, 487978, 484645, 488492, 460436, 456600, 496025, 522098, 506798, 513787, 511453, 525434, 556355, 573010, 572558, 594658, 560552, 538870, 561405, 564432, 595208]
7471E95208O365J8782K5069k5482j0299K0427k7404k2443p032j4540o709o642
7459E45300j6218n70N753J1754Q407J3757J1243K5978L0766J1134J8833j711N300
7446F69726L059n668L4364M8516M3230n931j4878J4604j7831m0601o2506n7721
7434F08363j517l622k0447l3822k9535K3653J5060l102J1388L4881O84k3962j8871
7421E59151N339P008K5514K7860P740K3888J1055j1910k9374k057N021j3899j3180
7408F02156J023J2048k1043j3018l423k5313j1114o381k3433k1309k0782j5713
7396D53698m249k8163l8613k5526p831L4321K6636j2046j4139k5183j8435r140
7384C31330n38J8573N651Q260L4956J2481r771j816R587O176j401L4613K2335
$$ y = [595208, 601573, 620355, 645424, 619942, 609643, 630070, 602666, 580223, 573191, 558651, 551942, 545300, 529082, 528512, 534265, 546019, 554426, 568183, 579426, 605404, 636170, 647304, 666137, 664426, 669726, 672785, 667117, 701481, 749997, 793227, 787296, 772418, 787022, 769191, 728590, 666084, 608363, 606846, 603224, 582777, 548955, 519420, 543073, 558133, 555031, 566419, 601300, 601984, 578022, 559151, 564490, 571498, 597012, 624872, 632612, 656500, 667555, 655645, 626271, 624214, 629235, 615336, 602156, 603179, 615227, 594184, 581166, 577743, 552430, 541316, 534935, 511502, 490193, 469411, 453698, 449449, 421286, 382673, 357147, 349316, 383637, 410273, 398227, 384088, 358905, 340470, 331330, 330792, 349365, 355016, 363276, 398232, 410713, 400942, 399126, 408713, 414889, 413488, 448101, 470436]
7371D70436J079n392k0001l6497o049n405r860j8195k3016j005J1344n132q501
7358C43806Q390R039l52l959J0054O198K6991K0324J3817m972J1299K4379L3145
7345D98159K8922M2520K5980M59j9902j3182K3130J9611J5903L7969N0036N6111
7333G65716N3886j8304j3547k261J7765J2826Q0232R5391J27758J48035J93065
7322A460562K28720K47855K67831L02494L95980M83337M94206M12571K63568K2006
7312D579130k99593n18902n11909m08867l19705j99782j09943n9675m5273p2932
7302B032549q7767m7694m7304m3753L805J2151J9878N3204P0741P9497R2690R8151
7290B236148J24394J88274K41913K76705L58347M49665N86643O36964N24540K94368
$$ y = [470436, 471515, 466123, 446122, 409625, 403576, 398171, 388311, 370116, 347100, 346095, 357439, 352307, 343806, 352196, 361235, 360883, 356924, 366978, 373176, 400167, 420491, 434308, 429336, 440635, 465014, 498159, 527081, 569601, 595581, 596040, 576138, 562956, 586086, 605697, 621600, 659569, 709605, 765716, 819602, 801298, 787751, 785490, 803255, 816081, 896313, 991704, 1119462, 1267497, 1460562, 1689282, 1937137, 2204968, 2507462, 2903442, 3386779, 3880985, 4293556, 4557124, 4579130, 4279537, 3760635, 3248726, 2839859, 2520154, 2320372, 2210429, 2150754, 2105481, 2032549, 1944782, 1897088, 1849784, 1806031, 1809836, 1821987, 1841865, 1895069, 1965810, 2045307, 2137997, 2236148, 2360542, 2548816, 2790729, 3067434, 3425781, 3875446, 4462089, 5099053, 5623593, 5917961]
7280E917961J6590l09683n49783n49371m44589l45533k56023j74446j24848j08386
7270C071889m3406j4398k3174l6383j9527J0972K7339Q567K9788L7977Q7488J27343
7258C264475J27602J55619R8972L3195J665k0299j295K5256Q1646Q8774J05156
7247C960766J25067J07306Q9529Q0806R1030R4499J41780J51276J65459J75805
7237E183323J81599K17250K52458K86915M21221N43936P75558J038550J322355
7228A0223165J667833K052787K525488L215085M131515N040003N372647M612528
7220C8841051L112271J189664q51430k912318m240500m384451l661138k617321
7212B4475828j707107j035572n37763j89815J41201M82967R02919J488274K126701
$$ y = [5917961, 5934551, 5624868, 5075085, 4525714, 4081125, 3735592, 3479569, 3305123, 3180275, 3071889, 3028483, 3014085, 2990911, 2954528, 2935001, 2945973, 2973312, 2981879, 3011667, 3049644, 3137132, 3264475, 3392077, 3547696, 3646668, 3679863, 3681528, 3661229, 3659934, 3685190, 3766836, 3855610, 3960766, 4085833, 4193139, 4282668, 4363474, 4454504, 4549003, 4690783, 4842059, 5007518, 5183323, 5364922, 5582172, 5834630, 6121545, 6542766, 7086702, 7862260, 8900810, 10223165, 11890998, 13943785, 16469273, 19684358, 23815873, 28855876, 34228523, 38841051, 41953322, 43142986, 42291556, 39379238, 35138738, 30754287, 27093149, 24475828, 22768721, 21733149, 21195386, 21005571, 21146772, 21629739, 22532658, 24020932, 26147633]
7203B6147633K885004L844507N057350O684656Q484671J0038707J0558077R924874
7195H3625479R149622R365144J0296600J1121600J0666524P978243L236363j634005
7187A43805570m374074m411532k440641J11060K029801K217733L86446k373558
7179A34950805n014760o802681p655310p960295q175153p703555o001701l525180
7171H2112170r28363J578010L907265N725404O321801N571898M360957M138496
7163A12787638N218342O957473P820123O340546K947144q02065k684770j507225
7155A37077206K216324O555996R364862Q923975M987698n41431n729516r557812
7147A53297302j2032201j3349576j3680220j2823606j0916998q574799o570761
$$ y = [26147633, 29032637, 32877144, 37934494, 44619150, 53103821, 63142528, 73700605, 83625479, 92775101, 102140245, 112436845, 123558445, 134224969, 142203212, 145439575, 143805570, 139431496, 135019964, 132579323, 132690383, 134720184, 136937917, 137324363, 134950805, 129936045, 123133364, 115478054, 107517759, 99342606, 91639051, 85637350, 82112170, 81183807, 82761817, 86669082, 92394486, 98716287, 104288185, 108649142, 112787638, 118005980, 124963453, 132783576, 139124122, 142071266, 141269201, 138584431, 137077206, 139293530, 145849526, 155214388, 164138363, 169126061, 168584630, 162855114, 153297302, 141265101, 127915525, 114235305, 101411699, 90494701, 81919902, 75349141]
7140G5349141n144954m154030l494158l013342k592668k200379j865358j510913
7132E1373339j179063q14870m06253l3643K91878P09040J223188J880618K279901
7123E5324135J869800P48037l28406r39546j204985j301547j600713k410424l409009
7114D6747342l885878l683655l103386k545929k140837j883760j726242j543272
7106B6234383j426649j365048j208573j100787r98023r25267q98848q29933p56622
7097A6724633p26015o78631o32146n86955n56528n35201m93474m36301m59089
7088A1620293m43548m20217l90348l86707m29068m31981l86503l84947l52990
7079G993984l30937l38772l02654l10015l24599k95064k76499k28007j97563k05031
$$ y = [75349141, 70204187, 66050157, 62555999, 59542657, 56949989, 54749610, 52884252, 51373339, 50194276, 49379406, 48973153, 48939510, 49231388, 49940428, 51163616, 53044234, 55324135, 57193935, 57941972, 57613566, 56674020, 55469035, 54167488, 52566775, 50156351, 46747342, 42861464, 39177809, 36074423, 33528494, 31387657, 29503897, 27777655, 26234383, 24807734, 23442686, 22234113, 21133326, 20135303, 19210036, 18311188, 17481255, 16724633, 15998618, 15319987, 14687841, 14100886, 13544358, 13009157, 12515683, 12079382, 11620293, 11176745, 10756528, 10366180, 9979473, 9550405, 9118424, 8731921, 8346974, 7993984, 7663047, 7324275, 7021621, 6711606, 6387007, 6091943, 5815444, 5587437, 5389874, 5184843]
7069E184843j47568j69376j36786n8458n1909k5573N4169Q2368Q1821P8140j8177
7058D873494j43129k69572l54527l46178k95400k11416j95563j47230j21800j07165
7048B681514j16815q4827p2673r8976l6264k9324l289j1953K31O0872Q4211J03155
7036B475862J70614K39155K51633J75481R1656m4838j90502k41098k54426j97088
7026B476449j52887q4646p3508p9360m0339k4882n0264n6883n9915o2687k8695
7015A762383j7323k3505q730p326k1083m2571j5181J9987J1617k7957l0449n616
7003A594246l405k1693q016L438K4450J1335j5132l2726j0493P547q097k0355
6991A521099J8591k026k8399m4036K4053N794j3204n233r575j5290N184k254K6718
$$ y = [5184843, 5037275, 4867899, 4731113, 4672655, 4620746, 4595173, 4649342, 4731710, 4813531, 4891671, 4873494, 4730365, 4460793, 4106266, 3760088, 3464688, 3253272, 3057709, 2910479, 2788679, 2681514, 2564699, 2479872, 2407199, 2308223, 2271959, 2242635, 2239346, 2227393, 2227624, 2288496, 2372707, 2475862, 2646476, 2885631, 3137264, 3312745, 3404401, 3359563, 3169061, 2927963, 2673537, 2476449, 2323562, 2238916, 2165408, 2086048, 2045709, 2020827, 1970563, 1913680, 1853765, 1791078, 1762383, 1745060, 1721555, 1712825, 1705499, 1684416, 1641845, 1626664, 1646651, 1658268, 1630311, 1599862, 1594246, 1590841, 1569148, 1561132, 1564570, 1589020, 1600355, 1585223, 1552497, 1542004, 1549551, 1541454, 1521099, 1539690, 1537664, 1509265, 1465229, 1489282, 1495076, 1481872, 1476639, 1467064, 1451774, 1456958, 1454704, 1481422]
6978A481422j4971o878k8512l7722J3824O210j6933j7159l4908j4610r235k6010
6966A294518l2264N467o244k4618j7121l687p240k1441k0695l82n486j935j7232
6953A141640k1925k3980l2664M412K8762j4875l4695j6726j0284J4458k8986m5423
6941I59714m89R191j7998o330N753k5316l9866k2041J7270n737m8104k6768j1775
6928G87504k2150q123N222k8818j3083k6839j3389K3617J1464j5828k7843j7262
6916F54472k1720l3914j9362k5067J039M609j5283j3526j1745q140R615L148k4622
6903D99504j3635j287m214j532p635k4571j4547K5459l008k7498j774j225j5352
6890D08685J5812k0549k5032k6910k0149j2541m09l014l367j3571L851K695J8113
$$ y = [1481422, 1466451, 1459573, 1431061, 1393339, 1407163, 1413373, 1396440, 1379281, 1344373, 1329763, 1320528, 1294518, 1262254, 1267721, 1261477, 1236859, 1219738, 1216051, 1208811, 1187370, 1166675, 1166293, 1160807, 1158872, 1141640, 1119715, 1095735, 1063071, 1067483, 1096245, 1081370, 1046675, 1029949, 1019665, 1034123, 1005137, 959714, 959225, 968416, 950418, 944088, 949841, 924525, 884659, 862618, 879888, 874151, 826047, 799279, 787504, 765354, 757231, 762453, 733635, 720552, 693713, 680324, 703941, 715405, 699577, 671734, 654472, 632752, 598838, 579476, 554409, 555448, 560057, 544774, 531248, 519503, 511363, 520978, 524126, 499504, 485869, 484582, 480368, 478836, 471201, 446630, 432083, 457542, 454534, 427036, 425262, 424037, 408685, 424497, 403948, 378916, 352006, 331857, 319316, 318907, 315893, 312526, 298955, 302806, 305501, 323614]
6877C23614M093l720K2090m854l5330l4039n874K2543L4870K9308J3327M28k0552
6864C45904k86j728P256l010l303L764j0651j2108J5936q222j4817k533j6088
6851C00114L675L929J1051K768k117M222P05k7333k0692p84M676L3224J9147J1262
6837C43847N043k1839R96j6992l4435M0870J0520k2201j1148M70O168q592n797
6824B86910J9621n759j5163L046n220P118j0564l6811j943R745J171l637j0666
6811B37848k984l474l821L135P554R04J7145j1001q102J1631j5606l0776O178
6798B08631J7487O09j2104j0772j0326m509p562J4734k0795N08j340L193j1449
6785A66305R60J3323r646J0548J0783p183Q124j1831l4356L037J032q754j9164
$$ y = [323614, 327707, 323987, 346077, 341223, 305893, 271854, 265980, 288523, 323393, 352701, 366028, 366456, 345904, 345618, 343890, 351146, 348136, 344833, 348597, 337946, 325838, 341774, 333552, 318735, 316202, 300114, 303789, 307718, 318769, 321537, 319420, 323642, 324347, 297014, 276322, 275538, 280214, 313438, 332585, 343847, 348890, 327051, 328047, 311055, 276620, 317490, 328010, 305809, 294661, 295131, 301299, 292707, 286910, 306531, 300772, 285609, 288655, 283435, 290553, 279989, 243178, 241235, 250980, 252151, 248514, 237848, 234864, 231390, 227569, 230704, 238258, 239162, 256307, 245306, 237204, 248835, 233229, 202453, 208631, 226118, 226727, 214623, 203851, 193525, 189016, 181454, 196188, 175393, 175901, 174561, 177754, 166305, 167265, 180588, 170942, 181490, 192273, 185090, 193214, 181383, 147027, 150064, 151096, 142342, 123178]
6772A23178j4158Q671L7791K1012j3763k8068j0822K6592J5979m228k7741p475
6760A26968j2992J9221K0477j9134k7259l9257K849K3928O006J380j9300o581
6748G6306L4239K9938Q462L4125J0284l684L028J3471L7950M2714L2006L9610
6736C58449K2271q696n6369o4097l2423j6866J4244q279j4657k884J4441N392
6724B10526j1973j2548P598m890M181L3142J9309M106K5333P231O073K3120L3628
6711C44836L3413N6891Q8483P6518L2000k371n2129n0166k9984m7821l8698k62
6699D10710O667N904J1671L0728J5748J0443p741q296J3245J2863k6407l4039
6687D41496l1248l9013P52M7098M2137L0511M7095J9159N4408P2671K8637k9329
$$ y = [123178, 109020, 117691, 155482, 176494, 162731, 134663, 123841, 150433, 166412, 162184, 134443, 126968, 113976, 133197, 153674, 134540, 107281, 68024, 70873, 94801, 100807, 102187, 82887, 76306, 110545, 140483, 148945, 183070, 193354, 189670, 192698, 206169, 244119, 286833, 318839, 358449, 380720, 372024, 315655, 251558, 219135, 202269, 216513, 208234, 193577, 190693, 205134, 210526, 198553, 186005, 193603, 188713, 192894, 226036, 245345, 249451, 274784, 282015, 288088, 311208, 344836, 378249, 435140, 523623, 600141, 632141, 629770, 577641, 527475, 497491, 449670, 410972, 410710, 417377, 423281, 434952, 465680, 481428, 491871, 484130, 475834, 489079, 501942, 475535, 441496, 410248, 371235, 371987, 419085, 461222, 491733, 538828, 557987, 612395, 685066, 713703, 684374]
6675F84374n1939n6693l7560o820J3701K7089j2005o235m828p4275n5411j8314
6663D01084j5007J3470L555O565k0781J3835O1954M9254R27R61L0529L3370K3832
6650F03548M1607M5313K3602j7640n3297n8226n469Q421O430M8544M7107L1726
6638G21666j4245r6117p1012n5194p4240l6758J857N971k2638m0358J4233n451
6626C27714J6448L9371j996m971K2432N0433N7997M5744K359l4659l2256l2068
6614D56548l5776o234K7957L1237O075n728o0916n4128l5966R2k8176M131j6994
6601B82122R090m810j8180j6242J2669j0475J0956L026K1492K6113j9166l1289
6589B65306j883Q48n043j1800j3835k1174m4566m3690J0028J9230K2888j2840
$$ y = [684374, 632435, 575742, 538182, 531362, 545063, 572152, 560147, 553912, 549084, 474809, 419398, 401084, 386077, 399547, 403102, 409667, 388886, 402721, 464675, 513929, 514856, 515817, 546346, 579716, 603548, 645155, 690468, 714070, 696430, 643133, 584907, 579438, 587859, 594289, 642833, 689940, 721666, 707421, 611304, 540292, 485098, 410858, 374100, 375957, 381928, 359290, 318932, 333165, 327714, 344162, 383533, 381537, 376566, 398998, 449431, 507428, 553172, 555531, 520872, 488616, 456548, 420772, 414538, 442495, 473732, 479807, 474079, 413163, 359035, 323069, 323161, 294985, 299116, 282122, 291212, 286402, 268222, 251980, 264649, 254174, 265130, 268156, 289648, 315761, 296595, 265306, 263423, 264271, 259228, 247428, 233593, 212419, 167853, 124163, 134191, 153421, 176309, 163469]
6577A63469o346J526P755j2659J7953Q967J1032j5692l217k4240r069k0599n661
6564A13219P08l392n774K0493l181J2334o678l912Q314m928j1585j5780j2366
6551H7472K4256K1350J6534q591K127J527k5944q870J6229p654j4078J857j720
6538A04495P398j1363M45r243j9497l3646K683K5997j1939r417J1335n52J6376
6525G3072P282k7990j2335M067R415J9197j4913l6964J9369P24p160j3280J6430
6512C6914J3423J898Q772j4832j7185p570O538k253J6297J5789o342j0711q280
6499C2458L88k3545k2624O850J7823J7236J6348N843j8607J1711O653r28j5742
6486C3864l655Q471J1184j5799l358N594K8987J4204l4705j8119o590O926L2850
$$ y = [163469, 157123, 158649, 166404, 153745, 171698, 180665, 191697, 176005, 172788, 148548, 139479, 118880, 113219, 113927, 110535, 104761, 125254, 122073, 134407, 127729, 123817, 132131, 127203, 115618, 99838, 87472, 111728, 133078, 149612, 141021, 143148, 144675, 118731, 109861, 126090, 118436, 104358, 106215, 104495, 111893, 100530, 100975, 91732, 72235, 38589, 41272, 67269, 55330, 45913, 57248, 56696, 73072, 80354, 52364, 40029, 44096, 53511, 72708, 57795, 20831, 40200, 40924, 33764, 20484, 36914, 50337, 52235, 61007, 46175, 28990, 21420, 27958, 25705, 42002, 57791, 51449, 40738, 32458, 32846, 9301, -13323, -6473, 11350, 28586, 44934, 50777, 32170, 43881, 50534, 49606, 33864, 30209, 38680, 49864, 34065, 30707, 36301, 65288, 79492, 44787, 26668, 20078, 27004, 59854]
6473E9854j006m4327j6151j7536k1701K9057K4807K0772J975l1149j9852K0212
6461D955K1269j562P067n164m080L458n878J1852P835J165J1173L00o270j1853
6447C4267J2623r532K997J1818j0822r502j1593Q020L271j6342j694L217K220
6434A8948J8423N429n356j074k3725J6071J4876L4699P717j8733j3498k84J6465
6421F9958j2571n337k4888n893J2856K5127J767l0965K729M4487L0274j2392j3925
$$ y = [59854, 58848, 14521, -1630, -19166, -40867, -11810, 12997, 33769, 35744, 4595, -15257, 4955, 26224, 24662, 31729, 26565, 22485, 25943, 20065, 31917, 39752, 40917, 52090, 52390, 46120, 34267, 46890, 37358, 40355, 52173, 41351, 31849, 20256, 28276, 31547, 15205, 13511, 16728, 18948, 37371, 42800, 37444, 36370, 12645, 28716, 43592, 78291, 86008, 67275, 53777, 53493, 69958, 57387, 52050, 27162, 21269, 34125, 59252, 61019, 30054, 32783, 77270, 107544, 95152, 81227]
$$ [...]
##END NTUPLES=NMR SPECTRUM
##END=
