##TITLE=Analysis number 307819
Compound Code s 07397
Project Code adrs
Chemist Name fudan
##JCAMPDX= 6.0         $$ Bruker NMR JCAMP-DX V2.0
##DATA TYPE= NMR SPECTRUM
##DATA CLASS= NTUPLES
##ORIGIN= Bruker BioSpin GmbH
##OWNER= NMR
$$ XWIN-NMR		Version 3.5
$$ Fri May 20 02:32:06 2005 GMT Daylight Time (UT+1h)  MAYBRIDGE\NMR@NMR_250MHZ
##.OBSERVE FREQUENCY= 62.9015280498526
##.OBSERVE NUCLEUS= ^13C
##.ACQUISITION MODE= SIMULTANEOUS (DQD)
##.ACQUISITION SCHEME= undefined
##.AVERAGES= 5000
##.DIGITISER RES= 17
##SPECTROMETER/DATA SYSTEM= dpx250
##.PULSE SEQUENCE= jmod
##.SOLVENT NAME= CDCl3
##.SHIFT REFERENCE= (INTERNAL, CDCl3, 0, 219.717)
##AUDIT TRAIL= $$ (NUMBER, WHEN, WHO, WHERE, WHAT)
$$ ##TITLE= Audit trail, XWIN-NMR		Version 3.5
$$ ##JCAMPDX= 5.01
$$ ##ORIGIN= Bruker BioSpin GmbH
$$ ##OWNER= NMR
$$ C:\u/data/dgb/nmr/ADRS/3240/pdata/1/auditp.txt
$$ ##AUDIT TRAIL=  $$ (NUMBER, WHEN, WHO, WHERE, WHAT)
(   1,<2005-05-20 02:31:33.81 +100>,<MAYBRIDGE\NMR>,<NMR_250MHZ>,
      <created by zg, POWCHK disabled, PULCHK disabled
       configuration hash MD5:
       62 19 C7 07 E1 42 D1 B7 37 6C 3D D0 77 39 F9 E6
       data hash MD5: 64K
       55 A0 C2 3D B4 7E C2 32 51 4B 0C 39 F2 91 7F 35>)
(   2,<2005-05-20 02:31:48.31 +100>,<MAYBRIDGE\NMR>,<NMR_250MHZ>,
      <Start of raw data processing
       ef LB = 1 FT_mod = 6 PKNL = 1 SI = 32K 
       data hash MD5: 32K
       72 C0 A1 04 4A 4D 9A DC 16 04 EF 6D A4 39 D6 46>)
(   3,<2005-05-20 02:31:50.06 +100>,<MAYBRIDGE\NMR>,<NMR_250MHZ>,
      <apk 
       data hash MD5: 32K
       2F 02 49 FB D1 7F A3 E3 DB A1 8E E3 4E DF BA 26>)
(   4,<2005-05-20 02:31:50.82 +100>,<MAYBRIDGE\NMR>,<NMR_250MHZ>,
      <abs ABSG = 5 
       data hash MD5: 32K
       3D EB 62 3C CB 38 12 AE A3 56 8A 30 3E 6B EA C8>)
$$ ##END=
$$ 
$$ hash MD5
$$ E1 2A C6 56 44 7D 47 37 E0 AD 29 C4 02 0A 32 D3
##$RELAX= 
##$RELAX= 
##$RELAX= 
##$RELAX= 
##$RELAX= 
##$RELAX= 
##$RELAX= 
##$RELAX= 
$$ Bruker specific parameters
$$ --------------------------
##$DU= <C:\u>
##$EXPNO= 3240
##$NAME= <ADRS>
##$PROCNO= 1
##$TYPE= <nmr>
##$USER= <dgb>
##$AMP= (0..31)
100 100 100 100 100 100 100 100 100 100 100 100 100 100 100 100 100 100 
100 100 100 100 100 100 100 100 100 100 100 100 100 100 
##$AQSEQ= 0
##$AQ_mod= 3
##$AUNM= <au_zg>
##$AUTOPOS= <2 >
##$BF1= 62.895239
##$BF2= 250.13
##$BF3= 62.895239
##$BF4= 62.895239
##$BF5= 500.13
##$BF6= 500.13
##$BF7= 500.13
##$BF8= 500.13
##$BYTORDA= 1
##$CFDGTYP= 0
##$CFRGTYP= 5
##$CHEMSTR= <none>
##$CNST= (0..31)
1 1 145 1 1 1 1 1 1 1 1 1 1 1 1 1 1 1 1 1 1 1 1 1 1 1 1 1 1 1 1 1 
##$CPDPRG= <waltz16>
##$CPDPRG1= <>
##$CPDPRG2= <waltz16>
##$CPDPRG3= <>
##$CPDPRG4= <mlev>
##$CPDPRG5= <mlev>
##$CPDPRG6= <mlev>
##$CPDPRG7= <mlev>
##$CPDPRG8= <mlev>
##$CPDPRGB= <>
##$CPDPRGT= <>
##$D= (0..31)
0 2 0.003571429 0 0 0 0 0 0 0.06 0 0.03 2e-05 4e-06 0 0 0.0002 0 0 0 0.006896552 
0 0 0 0 0 0 0 0 0 0 0 
##$DATE= 1116552686
##$DBL= (0..7)
120 120 120 120 120 120 120 120 
##$DBP= (0..7)
150 150 150 150 150 150 150 150 
$$ [...]
##$SUBNAM7= <"">
##$SUBNAM8= <"">
##$SUBNAM9= <"">
##$SW= 239.425677416285
##$SWIBOX= (0..15)
0 1 3 0 0 0 0 0 0 0 0 0 0 0 0 0 
##$SW_h= 15060.2409638554
##$TD= 65536
##$TD0= 1
##$TE= 295.16
##$TE2= 300
##$TE3= 300
##$TEG= 300
##$TL= (0..7)
0 120 120 120 120 120 120 120 
##$TP= (0..7)
150 150 150 150 150 150 150 150 
##$TP07= 0
##$TPNAME0= <>
##$TPNAME1= <>
##$TPNAME2= <>
##$TPNAME3= <>
##$TPNAME4= <>
##$TPNAME5= <>
##$TPNAME6= <>
##$TPNAME7= <>
##$TPOAL= (0..7)
0.5 0.5 0.5 0.5 0.5 0.5 0.5 0.5 
##$TPOFFS= (0..7)
0 0 0 0 0 0 0 0 
##$TUNHIN= 0
##$TUNHOUT= 0
##$TUNXOUT= 0
##$USERA1= <user>
##$USERA2= <user>
##$USERA3= <user>
##$USERA4= <user>
##$USERA5= <user>
##$V9= 5
##$VALIST= <valist>
##$VCLIST= <CCCCCCCCCCCCCCC>
##$VD= 0
##$VDLIST= <DDDDDDDDDDDDDDD>
##$VPLIST= <PPPPPPPPPPPPPPP>
##$VTLIST= <TTTTTTTTTTTTTTT>
##$WBST= 1024
##$WBSW= 4
##$XGAIN= (0..3)
0 0 0 0 
##$XL= 0
##$YL= 0
##$YMAX_a= 23559091
##$YMIN_a= -26250779
##$ZGOPTNS= <>
##$ZL1= 120
##$ZL2= 120
##$ZL3= 120
##$ZL4= 120
##$ABSF1= 219.7173
##$ABSF2= -19.73232
##$ABSG= 5
##$ABSL= 3
##$ALPHA= 0
##$AQORDER= 0
##$ASSFAC= 0
##$ASSFACI= 0
##$ASSFACX= 0
##$ASSWID= 0
##$AUNMP= <proc_1d>
##$AZFE= 0.1
##$AZFW= 0.5
##$BCFW= 0
##$BC_mod= 0
##$BYTORDP= 0
##$COROFFS= 0
##$CY= 12.5
##$DATMOD= 1
##$DC= 0
##$DFILT= <>
##$DTYPP= 0
##$F1P= 219.217194556009
##$F2P= -20.2323013418194
##$FCOR= 0.5
##$FTSIZE= 32768
##$FT_mod= 6
##$GAMMA= 0
##$GB= 0
##$INTBC= 1
##$INTSCL= 1
##$ISEN= 30
##$LB= 1
##$LEV0= 0
##$LPBIN= 0
##$MAXI= 10000
##$MC2= 0
##$MEAN= 0
##$ME_mod= 0
##$MI= 0
##$NCOEF= 0
##$NC_proc= 4
##$NLEV= 6
##$NOISF1= 0
##$NOISF2= 0
##$NSP= 0
##$NTH_PI= 0
##$NZP= 0
##$OFFSET= 219.7173
##$PC= 1.4
##$PHC0= 194.7821
##$PHC1= -2.30284
##$PH_mod= 1
##$PKNL= yes
##$PPARMOD= 0
##$PSCAL= 4
##$PSIGN= 2
##$REVERSE= no
##$SF= 62.895239
##$SI= 32768
##$SIGF1= 0
##$SIGF2= 0
##$SINO= 80
##$SIOLD= 32768
##$SREGLST= <13C.CDCl3>
##$SSB= 0
##$STSI= 32768
##$STSR= 0
##$SW_p= 15060.2409638554
##$SYMM= 0
##$S_DEV= 0
##$TDeff= 65536
##$TDoff= 0
##$TI= <Analysis number 299884
Compound Code cd 11282
Book Reference complaint >
##$TILT= no
##$TM1= 0
##$TM2= 0
##$TOPLEV= 0
##$USERP1= <user>
##$USERP2= <user>
##$USERP3= <user>
##$USERP4= <user>
##$USERP5= <user>
##$WDW= 1
##$XDIM= 32768
##$YMAX_p= 411292512
##$YMIN_p= -408680154
$$ End of Bruker specific parameters
$$ ---------------------------------
##NTUPLES= NMR SPECTRUM
##VAR_NAME=  FREQUENCY,     SPECTRUM/REAL,   SPECTRUM/IMAG
##SYMBOL=    X,             R,               I
##VAR_TYPE=  INDEPENDENT,   DEPENDENT,       DEPENDENT
##VAR_FORM=  AFFN,          ASDF,            ASDF
##VAR_DIM=   32768,         32768,           32768
##UNITS=     HZ,            ARBITRARY UNITS, ARBITRARY UNITS
##FACTOR=    0.459616106566222, 1,           1
##FIRST=     13819.1721220387, 0,            0
##LAST=      -1241.06884181672, 0,           0
##MIN=       -1241.06884181672, -408680154,  0
##MAX=       13819.1721220387, 411292512,    0
$$ Real data points
##PAGE= N=1
##DATA TABLE= (X++(R..R)), XYDATA
$$ [...]
$$ plain form
24639 -197789 -77878 -5710 -48920 71237 297820 423445 537767 426458 266923 253461
24629 253461 70176 43321 251257 276242 242441 63182 -177205 -339376 -165379 28948
24619 28948 61687 -76231 -53654 -139685 -187419 -111935 -78071 -45722 39469 839 -76903
24608 -76903 7660 114524 17283 -4069 -274 191781 261474 -16017 -71473 148598 271881
24597 271881 326904 329057 430237 426498 178528 -57203 -125308 -84000 -170601 -110830 46581
24586 46581 100141 142116 186488 22660 -169886 -194966 9165 366096 364611 271268 291410
24575 291410 321519 212979 193919 275777 240890 111246 59439 40241 37037 -82064 20573
24564 20573 73742 38213 -22495 -59849 -48988 -62533 -20587 10680 65231 185810 234292
$$ packed form
24639a97789J19911P2168m3210J20157K26583J25625J14322j11309j59535j3462
24629B53461j83285k6855K07936K4985l3801j79259k40387j62171J73997J94327
24619B8948L2739j37918K2577q6031m7734P5484L3864L2349Q5191l8630p7742
24608g6903Q4563J06864r7241k1352L795J92055O9693k77491n5456K20071J23283
24597B71881N5023K153J01180l739k47970k35731o8105M1308q6601N9771J57411
24586D6581N3560M1975M4372j63828j92546k5080K04131L56931j485r3343K0142
24575B91410L0109j08540j9060Q1858l4887j29644n1807j9198l204j19101J02637
24564B0573N3169l5529o0708l7354J0861j3545M1946L1267N4551J20579M8482
$$ plain form
24553 234292 99253 -100695 -164801 -302183 -346242 -290585 -280417 -155339 16393 -71228
24543 -71228 -262720 -180869 -39236 -39568 -9186 46970 157209 30513 -67447 47937 156266
24532 156266 271055 111114 95583 218912 285781 145382 3587 51928 183047 88962
24522 88962 12591 -46900 23316 9061 -70234 -31354 52822 185910 76143 15519 -226145
24511 -226145 -394668 -410547 -362842 -318192 -393017 -365879 -233234 -151529 -285352 -333260 -251495
24500 -251495 -168223 -227462 -89529 106161 282121 194914 103552 120970 29313 -34187 140642
24489 140642 204795 199050 89520 -56883 -192042 -18341 47623 157193 250574 338232 344194
24478 344194 399306 483027 327643 303382 236587 161310 44271 77943 50221 -22405 -85203
$$ packed form
24553B34292j35039j99948o4106j37382m4059N5657J0168J25078J71732q7621
24543g1228j91492Q1851J41633l32L0382N6156J10239j26696r7960J15384J08329
24532A56266J14789j59941j5531J23329O6869j40399j41795M8341J31119r4085
24522H8962p6371n9491P0216j4255p9295L8880Q4176J33088j09767o0624k41664
24511b26145j68523j5879M7705M4650p4825K7138J32645Q1705j33823m7908Q1765
24500b51495Q3272n9239J37933J95690J75960q7207r1362J7418r1657o3500J74829
24489A40642O4153n745j09530j46403j35159J73701O5964J09570R3381Q7658N962
24478C44194N5112Q3721j55384k4261o6795p5277j17039L3672k7722p2626o2798
$$ plain form
24467 -85203 379 162355 162548 109922 228742 227155 242124 76740 -85838 -59018 117875
24456 117875 108940 66017 -20949 -48311 151092 118539 53281 -63935 -124495 -79529 32508
24445 32508 -31829 -50851 -157005 -203020 -221689 -205837 -250937 -197334 -37208 91483 193766
24434 193766 229642 179248 -1930 -220999 -225416 -159045 43187 205147 223598 68890 41320
24423 41320 83701 183179 178984 -28703 -163424 -21038 42665 4882 156215 191109 197090
24412 197090 187009 61541 127799 361575 460444 244893 -8335 125230 233805 321467
24402 321467 380681 324360 418132 279249 188662 159013 158359 94053 -84070 -270886 -282258
24391 -282258 -288533 -103380 42982 116259 60113 -60126 -85418 -51157 -51272 -66641 -108912
$$ packed form
24467h5203Q5582J61976J93n2626J18820j587J4969j65384j62578K6820J76893
24456A17875q935m2923q6966k7362J99403l2553o5258j17216o0560M4966J12037
24445C2508o4337j9022j06154m6015j8669J5852m5100N3603J60126J28691J02283
24434A93766L5876n0394j81178k19069m417O6371K02232J61960J8451j54708k7570
24423D1320M2381R9478m195k07687j34721J42386O3703l7783J51333L4894N981
24412A97090j0081j25468O6258K33776R8869k15551k53228J33565J08575Q7662
24402C21467N9214n6321R3772j38883r0587k9649o54o4306j78123j86816j1372
24391b82258o275J85153J46362P3277n6146j20239k5292L4261j15j5369m2271
$$ plain form
24380 -108912 -81650 -6852 -19977 76608 196012 218777 307400 248542 154005 123100 181572
24369 181572 327674 259627 196219 53730 -150657 -262716 -424378 -411721 -360372 -324458
24359 -324458 -129688 -232543 -313764 -314253 -342694 -232982 23815 104216 103229 175638 236866
24348 236866 242793 350538 344272 285989 229139 -48020 -118966 -26643 103113 213915 255194
24337 255194 229088 115124 29304 206269 247078 286676 174244 41239 195138 278977
24327 278977 172124 -107944 -233770 -371313 -299333 -112297 -65696 -169987 -288883 -330873
24317 -330873 -351399 -487338 -347829 -199624 -102391 63649 214147 287060 471232 317202
24307 317202 442800 496605 282118 181889 39026 -169339 -205637 -93401 84613 -9577
$$ packed form
24380a08912K7262P4798j3125R6585J19404K2765Q8623n8858r4537l0905N8472
24369A81572J46102o8047o3408j42489k04387j12059j61662J2657N1349L5914
24359c24458J94770j02855q1221m89k8441J09712K56797Q0401r87P2409O1228
24348B36866N927J07745o266n8283n6850k77159p0946R2323J29756J10802M1279
24337B55194k6106j13964q5820J76965M0809L9598j12432j33005J53899Q3839
24327B78977j06853k80068j25826j37543P1980J87036M6601j04291j18896m1990
24317c30873k0526j35939J39509J48205R7233J66040J50498P2913J84172j54030
24307C17202J25598N3805k14487j00229j42863k08365l6298J12236J78014r4190
$$ plain form
24297 -9577 -93854 -51755 59319 90019 66090 58178 10559 -91963 -243795 -261348 -187788
24286 -187788 -49180 53655 150941 140837 29244 -133716 -179979 -273460 -368259 -270965 -286443
24275 -286443 -165501 -67482 66250 185736 151340 96683 27222 -80319 41893 379676
24265 379676 477971 315830 160411 321110 400827 489610 473602 494529 429885 368966 131513
24254 131513 -137358 -251716 -258359 -84321 204645 216338 199603 312172 302141 29902
24244 29902 -32903 50132 249111 405635 432314 421977 232825 166918 221220 207505 216138
24233 216138 183010 122473 -14186 -27385 -72147 -78785 -71093 17862 230128 157792 -15334
24222 -15334 63873 37252 38855 -141775 -156604 40527 110866 -148601 -322815 -253021 -340108
$$ packed form
24297i577q4277M2099J11074L0700k3929p912m7619j02522j51832j7553P3560
24286a87788J38608J02835R7286j0104j11593j62960m6263r3481r4799R7294j5478
24275b86443J20942R8019J33732J19486l4396n4657o9461j07541J22212L37783
24265C79676R8295j62141j55419J60699P9717Q8783j6008K0927o4644o0919k37453
24254A31513k68871j14358o643J74038K88966J1693j6735J12569j0031k72239
24244B9902o2805Q3035J98979J56524K6679j0337j89152o5907N4302j3715Q633
24233B16138l3128o0537j36659j3199m4762o638P692Q8955K12266p2336j73126
24222a5334P9207k6621J603j80630j4829J97131P0339k59467j74214O9794q7087
$$ plain form
24211 -340108 -511171 -674110 -594227 -469668 -428519 -185892 144974 202815 126897 220266
24201 220266 287235 416307 418749 344994 49780 -159219 -174607 -156747 -65325 86958 173583
24190 173583 103510 57646 193425 315144 205508 -55528 -249707 -109161 137256 295343
24180 295343 188190 260661 125314 -96175 11382 76023 -109451 -338041 -149376 -27392
24170 -27392 -66098 43358 43008 -85840 -180640 -134839 -166747 -161789 -213056 -231024 -220571 -262331
24158 -262331 -296479 -103914 51454 -54946 -98175 -130859 -84582 -63208 -53329 11784 -182558
24147 -182558 -322082 -102553 163345 183487 162211 -49365 -87195 9330 140203 115197
24137 115197 88043 207238 123876 142577 158209 -29841 -125941 -195070 -269221 -124529 -119811
$$ packed form
24211c40108j71063j62939P9883J24559M1149K42627L30866N7841p5918R3369
24201B20266O6969J29072K442p3755k95214k08999j5388J7860R1422J52283Q6625
24190A73583p0073m5864J35779J21719j09636k61036j94179J40546K46417J58087
24180B95343j07153P2471j35347k21489J07557O4641j85474k28590J88665J21984
24170b7392l8706J09456l50j28848r4800M5801l1908M958n1267j7968J0453m1760
24158b62331l4148J92565J55368j06400m3229l2684M6277K1374R879O5113j94342
24147a82558j39524K19529K65898K0142k1276k11576l7830R6525J30873k5006
24137A15197k7154J19195q3362J8701J5632j88050r6100o9129p4151J44692M718
$$ plain form
24126 -119811 -176765 -192372 -126778 -9808 -30574 80697 196387 222026 98523 -1897
24116 -1897 -37664 -18364 164904 166426 42107 42543 -149526 -284553 -332853 -410241 -365410 -117265
24104 -117265 -103268 -91938 -218946 -340908 -371130 -421941 -528089 -364469 -160063 -160130 -285072
24093 -285072 -220550 -89067 -258845 -193901 -97739 -168323 -180033 -53615 205936 439038
24083 439038 380959 236523 -50125 -263175 -151400 -165491 -243200 -8383 216152 82431
24073 82431 -16801 -111047 31569 -32477 -151732 -8917 -2874 108950 34260 27205 -36515
24062 -36515 -98534 -44450 182477 428707 401488 335776 284946 206335 156338 93791 -36834
24051 -36834 5956 -149875 -194506 -209251 -224325 -123265 -95089 -96154 55531 -4821 -17883
$$ packed form
24126a19811n6954j5607O5594J16970k0766J11271J15690K5639j23503j00420
24116a897l5767J9300J83268J522j24319M36j92069j35027m8300p7388M4831K48145
24104a17265J3997J1330j27008j21962l0222n0811j06148J63620K04406o7j24942
24093b85072O4522J31483j69778O4944R6162p0584j1710J26418K59551K33102
24083D39038n8079j44436k86648k13050J11775j4091p7709K34817K24535j33721
24073H2431r9232r4246J42616o4046j19255J42815O043J11824p4690p055o3720
24062c6515o2019N4084K26927K46230k7219o5712n0830p8611m9997o2547j30625
24051c6834M2790j55831m4631j4745j5074J01060K8176j065J51685o0352j3062
$$ plain form
24040 -17883 67153 15354 -175945 -169854 -44741 -11862 -73490 -97415 -32644 -36354 -61960 -195760
24028 -195760 -194166 10228 80847 64089 -64059 -203773 -315772 -279510 -153521 6191
24018 6191 -68516 -166177 -226463 -364341 -427073 -320061 -249397 -212694 -69275 138819 223722
24007 223722 161956 198886 334835 163841 95786 269623 324474 219308 -14501 -66497
23997 -66497 -91196 -152630 -331977 -290669 -370996 -145981 -45119 -146149 10578 66238 108064
23986 108064 97112 195902 344302 348392 -6563 -166822 -16889 -12582 -132270 -127443 -117227
23975 -117227 3347 50490 64609 -75728 -121726 -113084 -160716 -61283 -3503 69877 102357
23964 102357 -60331 -227070 -179189 29012 -132917 -176791 -245819 -106905 -110765 -184795 -295059
$$ packed form
24040a7883Q5036n1799j91299O091J25113L2879o1628k3925O4771l710k5606j33800
24028a95760J594K04394P0619j6758j28148j39714j11999L6262J25989J59712
24018F191p4707r7661o0286j37878o2732J07012P0664L6703J43419K08094Q4903
24007B23722o1766L6930J35949j70994o8055J73837N4851j05166k33809n1996
23997f6497k4699o1434j79347M1308q0327K25015J00862j01030J56727N5660M1826
23986A08064j0952R8790J48400M090l54955j60259J49933M307j19688M827J0216
23975a17227J20574M7143J4119j40337m5998Q642m7632R9433N7780P3380L2480
23964A02357j62688j66739M7881K08201j61929m3874o9028J38914l860p4030j10264
$$ plain form
23953 -295059 -270208 -212788 -100269 -83610 -121581 -266129 -313326 -72968 208168 440344
23943 440344 398002 195470 259313 363147 286282 199755 260628 242092 117869 159629 30645
23932 30645 -120788 -72989 31946 74571 -61455 -171918 -84880 112117 196341 222768 99504
23921 99504 47905 -45956 -220495 -341041 -266035 -125932 -163232 -74604 -145647 -1064 132557
23910 132557 105273 195669 202765 219919 289084 279266 256866 361388 380657 350017 204401
23899 204401 121933 -70975 -154339 -91774 -191104 -214333 -52181 40500 178604 290687 264564
23888 264564 250087 255240 144009 1471 222458 337753 310050 226516 183441 29323 21679
23877 21679 96845 119925 -47156 -252665 -275402 -173362 -72940 250363 339399 277891 112194
$$ packed form
23953b95059K4851N7420J12519J6659l7971j44548m7197K40358K81136K32176
23943D40344m2342k02532O3843J03834p6865q6527O0873j8536j24223M1760j28984
23932C0645j51433M7799J04935M2625j36026j10463Q7038J96997Q4224K6427j23264
23921I9504n1599r3861j74539j20546P5006J40103l7300Q8628p1043J44583J33621
23910A32557k7284R0396P096J7154O9165r818k2400J04522J9269l0640j45616
23899B04401q2468j92908q3364O2565r9330k3229J62152R2681J38104J12083k6123
23888B64564j4477N153j11231j42538K20987J15295k7703q3534m3075j54118p644
23877B1679P5166K3080j67081k05509k2737J02040J00422L23303Q9036o1508j65697
$$ plain form
23866 112194 -45171 -2047 13147 -105899 -38433 59001 28167 -175740 -202463 1465 -42552
23855 -42552 40772 193365 122955 -93409 -241429 -246136 -299570 -250097 -144290 30442 12188
23844 12188 -109105 -260146 -324411 -142525 -42251 -29144 -22215 -166766 -288076 -499052
23834 -499052 -615252 -341199 -168348 -28399 -34061 -135696 113305 272017 161838 -88642
23824 -88642 -73200 -42280 -102866 -117479 -250111 -142128 10311 73356 -92593 -116526 -158329
23813 -158329 -129192 -31329 -144123 -126851 -93770 -164794 -6499 23458 85543 324578 465918
23802 465918 382394 191601 179743 445016 498962 340682 96527 -18043 -77706 -188719
23792 -188719 -178767 -65116 11439 -40327 -231207 -359186 -204904 -44848 130181 349789
$$ packed form
23866A12194j57365M3124J5194j19046O7466R7434l0834k03907k6723K03928m4017
23855d2552Q3324J52593p0410k16364j48020m707n3434M9473J05807J74732j8254
23844A2188j21293j51041o4265J81886J00274J3107O929j44551j21310k10976
23834d99052j16200K74053J72851J39949n662j01635K49001J58712j10179k50480
23824h8642J5442L0920o0586j4613j32632J07983J52439O3045j65949k3933m1803
23813a58329K9137R7863j12794J7272L3081p1024J58295K9957O2085K39035J41340
23802D65918q3524j90793j1858K65273N3946j58280k44155j14570n9663j11013
23792a88719R952J13651P6555n1766j90880j27979J54282J60056J75029K19608
$$ plain form
23782 349789 425143 521952 417462 209988 -79788 8302 109127 -59958 -112869 -31553
23772 -31553 197820 215167 287460 494357 444847 265502 83187 148838 189861 127246 -8302
23761 -8302 -222039 -183107 -68256 22931 118720 39000 76165 121626 192193 63194 -855
23750 -855 -108394 -138861 -89055 109321 101447 -173469 -117155 45411 53229 62906 -79753 -203525
23738 -203525 -140245 -257374 -383792 -479895 -387429 -136143 -27760 -20788 -5911 -1511 -37098
23727 -37098 -140060 -233092 -302731 -359448 -313722 -147773 120431 260258 251031 215919 78999
23716 78999 -120175 -114316 -205089 -165627 -118478 -168879 -387907 -344923 -290730 -128644 -99458
23705 -99458 -58260 -12017 -6398 52172 -55929 -15854 72441 82709 160024 190905 318815
$$ packed form
23782C49789P5354R6809j04490k07474k89776Q8090J00825j69085n2911Q1316
23772c1553K29373J7347P2293K06897m9510j79345j82315O5651M1023o2615j35548
23761h302k13737L8932J14851R1187R5789p9720L7165M5461P0567j28999o4049
23750h55j07539l0467M9806J98376p874k74916N6314J62566P818R677j42659j23772
23738b03525O3280j17129j26418r6103R2466K51286J08383O972J4877M400l5587
23727c7098j02962r3032o9639n6717M5726J65949K68204J39827r227l5112j36920
23716G8999j99174N859r0773L9462M7149n0401k19028M2984N4193J62086K9186
23705i9458M1198M6243N619N8570j08101M0075Q8295J0268P7315L0881J27910
$$ plain form
23694 318815 126719 -118752 -196848 -47256 63035 143634 -44253 -197573 -240352 -225419
23684 -225419 -144216 -109247 -104404 6027 -46448 -77027 41957 44056 87438 275195 187104
23673 187104 315170 319839 193023 61834 -109266 -150911 6910 112213 89443 21677
23663 21677 -51269 -48575 -91895 -137084 -248847 -244779 -216430 -269802 -264251 -231661 -126613 -107150
23651 -107150 -169065 -26893 49626 144401 150624 62195 -64243 -183716 -219419 -163215 112583
23640 112583 386273 349722 300519 195287 82993 -73317 -87009 53595 164419 97493
23630 97493 68991 -906 -27022 -116882 -208964 -89372 114209 83806 -115887 -169951 -143941
23619 -143941 -70962 126647 183451 165480 248609 287636 162679 105873 283113 348372 242681
$$ packed form
23694C18815j92096k45471p8096J49592J10291Q0599j87887j53320m2779J4933
23684b25419Q1203L4969M843J10431n2475l0579J18984K099M3382J87757q8091
23673A87104J28066M669j26816j31189j71100m1645J57821J05303k2770o7766
23663B1677p2946K694m3320m5189j11763M068K8349n3372N551L2590J05048J9463
23651a07150o1915J42172P6519R4775O223q8429j26438j19473l5703N6204K75798
23640A12583K73690l6551m9203j05232j12294j56310j3692J40604J10824o6926
23630I7493k8502o9897k6116q9860r2082J19592K03581l0403j99693n4064K6010
23619a43941P2979J97609N6804j7971Q3129L9027j24957n6806J77240O5259j05691
$$ plain form
23608 242681 78156 -50647 -29359 -85510 84292 117626 -70272 39146 43482 -85610
23598 -85610 -106101 -37454 -2486 43501 25556 -31909 -125220 -163165 -39167 15072 133556
23587 133556 147063 268758 440777 548039 516642 257355 3940 -112572 -63050 41017
23577 41017 99059 178167 308555 383314 448135 424293 223194 112298 156345 136789 128487
23566 128487 142818 4036 -68363 -182758 -90852 -14830 -14142 134598 292076 88325 -23276
23555 -23276 76826 25838 -144966 -153859 -136468 -156401 -47306 80155 289028 459118 623767
23544 623767 507441 325866 169291 -61747 -136579 -214068 -183974 -70666 -54898 77894
23534 77894 137450 300825 171585 -28080 17998 196011 63506 -170779 -86612 110733
$$ packed form
23608B42681j64525j28803K1288n6151J69802L3334j87898J09418M336j29092
23598h5610k0491O8647L4968M5987j7945n7465r3311l7945J23998N4239J18484
23587A33556J3507J21695J72019J07262l1397k59287k53415j16512M9522J04067
23577D1017N8042P9108J30388P4759O4821k3842k01099j10896M4047j9556q302
23566A28487J4331j38782p2399j14395R1906P6022O88J48740J57478k03751j11601
23555b3276J00102n0988j70804q893J7391j9933J09095J27461K08873J70090J64649
23544F23767j16326j81575j56575k31038p4832p7489L0094J13308J5768J32792
23534G7894N9556J63375j29240j99665M6078J78013j32505k34285Q4167J97345
$$ plain form
23524 110733 85641 -117416 -219370 -62716 134262 154760 292433 316986 346921 328349
23514 328349 242104 101813 181628 261785 332471 355604 158208 55256 79703 99620 52350
23503 52350 -94494 -181415 -76243 63672 61334 38233 16881 80456 165376 242141 419392
23492 419392 452772 301816 197554 171124 198300 27117 -78842 -139159 -227546 -346045
23482 -346045 -211483 -131073 -291703 -463236 -372581 -134964 -28743 76210 225954 323551
23472 323551 285734 108365 -85752 -236183 -130110 -53312 131987 235765 177092 -42893
23462 -42893 -203365 -197656 -163152 80426 138299 53056 -179215 -198422 -222345 -272407 -97400
23451 -97400 46716 -119505 -154811 -59974 -66475 -141697 -238514 -372709 -455374 -467136 -196507
$$ packed form
23524A10733k5092k03057j01954J56654J96978K0498J37673K4553K9935j8572
23514C28349q6245j40291P9815Q0157P0686K3133j97396j02952K4447J9917m7270
23503E2350j46844q6921J05172J39915k338k3101k1352O3575Q4920P6765J77251
23492D19392L3380j50956j04262k6430K7176j71183j05959o0317q8387j18499
23482c46045J34562Q0410j60630j71533R0655K37617J06221J04953J49744R7597
23472C23551l7817j77369j94117j50431J06073P6798J85299J03778n8673k19985
23462d2893j60472N709L4504K43578N7873q5243k32271j9207k3923n0062J75007
23451i7400J44116j66221l5306R4837o501p5222r6817j34195q2665j1762K70629
$$ plain form
23440 -196507 54149 91618 13715 80023 225445 272462 225865 118569 16645 -110402
23430 -110402 -115447 -196672 -140818 -58302 17330 -40307 61349 8551 -51058 -138961 -285861
23419 -285861 -329085 -336528 -199402 -121911 -128831 -106764 65797 183665 167697 124643 94218
23408 94218 80811 132052 144112 118019 111710 90153 211271 387064 301213 133583 107587
23397 107587 171496 110549 -48763 -80139 8614 -9161 -72456 -152247 -115405 -102616 -294974
23386 -294974 -403787 -254535 -58065 52902 45695 15288 -24516 -52169 -72878 -43258 77121
23375 77121 165244 135938 103968 136300 82807 4708 65167 200374 211773 -19175 -277801
23364 -277801 -567314 -459865 -226844 80312 71297 -211825 -317077 -154560 13143 204155
$$ packed form
23440a96507K50656L7469p7903O6308J45422M7017m6597j07296j01924j27047
23430a10402n045q1225N5854Q2516P5632n7637J01656n2798n9609q7903j46900
23419b85861m3224p443J37126P7491o920K2067J72561J17868j5968m3054l0425
23408I4218j3407N1241J2060k6093o309k1557J21118J75793q5851j67630k5996
23397A07587O3909o0947j59312l1376Q8753j7775o3295p9791L6842J2789j92358
23386b94974j08813J49252J96470J10967p207l0407l9804k7653k0709K9620J20379
23375G7121Q8123k9306l1970L2332n3493p8099O0459J35207J1399k30948k58626
23364b77801k89513J07449K33021L07156r015k83122j05252J62517J67703J91012
$$ plain form
23354 204155 215082 328738 302927 153878 -25284 -59366 -27621 -3898 50910 81166 202403
23343 202403 155100 272012 406742 234580 199282 124951 179255 190211 90926 206768 63699
23332 63699 -41096 -38710 3980 -50391 25266 147429 116464 126409 253858 259116 287438 292927
23320 292927 129388 -222989 -274752 -282095 -122424 49795 140139 216269 214614 -64474 -82902
23309 -82902 123034 54954 24582 186750 341419 235108 41072 -61558 -76830 107288
23299 107288 97550 -80474 -44795 -67482 -247026 -320246 -337744 -293483 -204625 -98762 57993
23288 57993 -29244 -138966 -106457 -80968 91371 121467 76218 -205608 -414710 -322564 -281827
23277 -281827 -173263 -162987 -96925 -53848 -92197 -19064 108431 155626 62874 -68959 -221443
$$ packed form
23354B04155J0927J13656k5811j49049j79162l4082L1745K3723N4808L0256J21237
23343B02403m7303J16912J34730j72162l5298p4331N4304J0956r9285J15842j43069
23332F3699j04795K386M2690n4371P5657J22163l0965R945J27449N258K8322N489
23320B92927j63539l52377n1763p343J59671J72219R0344P6130j655k79088j8428
23309h2902K05936o8080l0372J62168J54669j06311j94036j02630j5272J84118
23299A07288r738j78024L5679k2687j79544p3220j7498M4261Q8858J05863J56755
23288E7993q7237j09722L2509K5489J72339L0096m5249k81826k09102R2146M0737
23277b81827J08564J0276O6062M3077l8349P3133J27495M7195r2752j31833j52484
$$ plain form
23266 -221443 20232 98503 11188 2857 30388 49850 93840 119975 228103 250862 164605
23255 164605 147496 109999 44780 74812 96535 143549 190330 93488 144218 142075 148819 199100
23243 199100 168203 95232 -111412 -208981 -356587 -269363 -99478 75819 224993 296750
23233 296750 135788 -152310 -232155 67700 277263 259237 283795 92884 -54560 -151227
23223 -151227 -114942 14071 -20235 -143253 -180526 -122201 -91531 -270792 -328359 -268495 -180812
23212 -180812 -120775 -71685 156923 314535 277246 214473 76265 -100229 51672 175226
23202 175226 124542 36951 74759 39358 -200201 -103596 47156 65455 51905 132290 30865
23191 30865 46814 79080 -59062 -44734 -100885 -203763 -61354 37973 207168 95734 -105528
$$ packed form
23266b21443K41675P8271q7315q331K7531J9462M3990K6135J08128K2759q6257
23255A64605j7109l7497o5219L0032K1723M7014M6781r6842N0730k143O744N0281
23243A99100l0897p2971k06644r7569j47606Q7224J69885J75297J49174P1757
23233B96750j60962k88098p9845K99855K09563j8026K4558j90911j47444r6667
23223a51227L6285J29013l4306j23018l7273N8325L0670j79261n7567N9864Q7683
23212a80812O0037M9090K28608J57612l7289o2773j38208j76494J51901J23554
23202A75226n0684q7591L7808l5401k39559R6605J50752J8299j3550Q0385j01425
23191C0865J5949L2266j38142J4328n6151j02878J42409R9327J69195j11434k01262
$$ plain form
23180 -105528 -70513 95551 413198 416802 267599 336907 365831 168760 31802 8010 -77181
23169 -77181 35663 158657 193692 -5971 -47277 -28869 61824 27897 -112487 34241 -7294
23158 -7294 -3701 18615 149826 294768 379455 318005 160426 253344 323227 263024 136411
23147 136411 -4805 19099 -48453 -215261 -332113 -305156 -244257 -335103 -317379 -197901 -176176
23136 -176176 2775 62275 112250 138986 95161 -10070 -104781 -116278 -22781 98985 107492
23125 107492 213580 294333 159420 273141 506671 622000 395832 246193 213010 268309
23115 268309 145090 -193628 -402465 -293591 -116182 -140269 -244128 -240498 -137275 -94079
23105 -94079 -149195 -222522 -247682 -246360 -206425 -53393 -27490 139582 230932 164292 29952
$$ packed form
23180a05528L5015J66064L17647L604j49203O9308K8924j97071j36958k3792q5191
23169g7181J12844J22994L5035j99663m1306J8408R0693l3927j40384J46728m1535
23158g294L593K2316J31211J44942Q4687o1450j57579R2918O9883o0203j26613
23147A36411j41216K3904o7552j66808j16852K6957O0899r0846J7724J19478K1725
23136a76176J78951N9500M9975K6736m3825j05231r4711j1497R3497J21766Q507
23125A07492J06088Q0753j34913J13721K33530J15329k26168j49639l3183N5299
23115B68309j23219l38718k08837J08874J77409k4087j03859L630J03223M3196
23105i4079n5116p3327k5160J322L9935J53032K5903J67072R1350o6640j34340
$$ plain form
23094 29952 -102646 -167612 -141662 -88414 4745 22350 -59982 -310328 -322361 -15412 162301
23083 162301 82733 54133 185131 237090 203153 239805 416494 287872 387204 433206 265179
23072 265179 54502 -130233 -80974 -24936 71820 261278 397376 397588 213241 68804 -28430
23061 -28430 -5160 -5691 -39507 -25861 -14416 6158 -59291 -16783 -7774 38130 58335 99512
23049 99512 16579 17586 121769 111283 203433 375276 540632 604331 441837 280075 19671
23038 19671 -4171 38680 65591 105055 212927 322548 286413 404803 221819 22102 -127755
23027 -127755 -223772 -134947 -50142 -119058 -45041 152263 95088 -65032 -172890 -197781 -335271
23016 -335271 -240086 -189641 -202127 -162251 -62713 49097 -11056 -16628 88683 78299 112921
$$ packed form
23094B9952j32598o4966K5950N3248R3159J7605q2332k50346j2033L06949J77713
23083A62301p9568k8600J30998N1959l3937L6652J76689j28622R9332M6002j68027
23072B65179k10677j84735M9259N6038R6756J89458J36098K12j84347j44437r7234
23061b8430K3270n31l3816J3646J1445K0574o5449M2508R009M5904K0205M1177
23049I9512q2933J007J04183j0486R2150J71843J65356O3699j62494j61762k60404
23038A9671k3842M2851K6911L9464J07872J09621l6135J18390j82984j99717j49857
23027a27755r6017Q8825Q4805o8916P4017J97304n7175j60120j07858k4891j37490
23016c35271R5185N0445j2486L9876R9538J11810o0153n572J05311j0384L4622
$$ plain form
23005 112921 143105 19679 48825 271817 255394 226770 189399 77883 404 -171744 -253745
22994 -253745 -315172 -233834 -39169 -30462 -82957 -80200 -87438 86934 -39906 -123297 -88934
22983 -88934 -17269 99642 12188 -71854 -46128 10886 87749 36749 187123 138777 -9012
22972 -9012 -23102 8433 111982 226016 75025 11948 205718 141901 -118646 -228969 -327543
22961 -327543 -519008 -595361 -475085 -248688 -46783 56381 26417 36875 29078 96384 139989
22950 139989 203817 228456 172198 115641 200479 144445 198872 315480 384825 528438 554926
22939 554926 468632 266847 73735 -108243 -92689 -192882 -323724 -204938 21295 290292
22929 290292 372918 296898 -80294 -162865 -314847 -251819 -190145 -169266 -73391 35495 -136741
$$ packed form
23005A12921L0184j23426K9146K22992j6423k8624l7371j11516p7479j72148q2001
22994b53745o1427Q1338J94665Q707n2495K757p238J74372j26840q3391L4363
22983h8934P1665J16911q7454q4042K5726N7014P6863n1000J50374m8346j47789
22972i012j4090L1535J03549J14034j50991o3077J93770o3817k60547j10323r8574
22961c27543j91465p6353J20276K26397K01905J03164k9964J0458p797O7306M3605
22950A39989O3828K4639n6258n6557Q4838n6034N4427J16608O9345J43613K6488
22939E54926q6294k01785j93112j81978J5554j00193j30842J18786K26233K68997
22929B90292Q2626p6020l77192q2571j51982O3028O1674K0879R5875J08886j72236
$$ plain form
22918 -136741 -386501 -368982 -188183 -50967 -56637 187762 216976 199646 85226 -317374
22908 -317374 -404448 -244881 -120098 -132934 -92596 -163434 -158357 -66716 -115190 -160769 -238952
22897 -238952 -262894 -63812 25092 -37329 -169356 -355262 -371060 -349519 -416316 -469295 -274957
22886 -274957 158767 268696 226088 153672 269935 245284 82349 85992 143976 191859 270374
22875 270374 81553 -6515 -107602 -23164 110998 27477 -27094 -65993 -268813 -326036 -212301
22864 -212301 -135144 -98869 -99024 -210624 -169803 44317 107382 99173 50366 -102069 -27730
22853 -27730 -34658 -139140 -223006 -126679 77507 160704 167357 324529 391778 185682 26018
22842 26018 -234199 -409896 -403847 -395785 -247661 -76322 -77984 -4568 890 190739 310937
$$ packed form
22918a36741k49760J7519J80799J37216n670K44399K9214j7330j14420m02600
22908c17374q7074J59567J24783j2836M0338p0838N077R1641m8474m5579p8183
22897b38952k3942J99082Q8904o2421j32027j85906j5798K1541o6797n2979J94338
22886b74957M33724J09929m2608p2416J16263k4651j62935L643N7984M7883P8515
22875B70374j88821q8068j01087Q4438J34162q3521n4571l8899k02820n7223J13735
22864b12301P7157L6275j55j11600M0821K14120O3065q209m8807j52435P4339
22853b7730o928j04482q3866R6327K04186Q3197O653J57172O7249k06096j59664
22842B6018k60217j75697O049Q062J48124J71339j662P3416N458J89849J20198
$$ plain form
22831 310937 205788 61247 144821 309881 315082 408533 291490 139053 -65436 -338016
22821 -338016 -402548 -174176 -75110 -89983 -162118 -169142 -70620 -2401 84679 190030 386797
22810 386797 473741 464604 123972 -91449 -81193 64559 173301 194573 140114 -24374 -212252
22799 -212252 -232273 -152734 -85698 -128645 -148283 -28545 30695 -32679 -11559 50968 115685
22788 115685 156473 -4886 -259329 -167412 102172 203055 319962 93128 -234044 -478010
22778 -478010 -519235 -224168 91672 50929 151127 353265 431731 397478 312074 82536
22768 82536 -64156 -67453 -65333 -101820 -186266 -251003 -139942 108038 277722 268047 178403
22757 178403 149309 -984 -21153 159879 172218 174061 342418 213602 141089 25796 -106311
$$ packed form
22831C10937j05149j44541Q3574J65060N201R3451j17043j52437k04489k72580
22821c38016o4532K28372R9066j4873p2135p024R8522O8219Q7080J05351J96767
22810C86797Q6944r137l40632k15421J0256J45752J08742K1272n4459j64488j87878
22799b12252k0021P9539O7036m2947j9638J19738N9240o3374K1120O2527O4717
22788A15685M0788j61359k54443R1917K69584J00883J16907k26834l27172k43966
22778d78010m1225K95067L15840m0743J00198K02138P8466l4253q5404k29538
22768H2536j46692l297K120l6487q4446o4737J11061K47980J69684r675q9644
22757A78403k9094j50293k0169J81032J2339J843J68357j28816p2513j15293j32107
$$ plain form
22746 -106311 -195763 -268539 -159616 65785 16808 -62466 -79347 -184208 -258510 104650 433370
22735 433370 411878 75306 -327690 -242707 -93672 -36978 92965 194863 145590 -62126
22725 -62126 -44760 -126097 -119020 101179 161255 62333 -51004 -99323 -21551 -3654 22768
22714 22768 250101 305990 456262 405606 310227 95643 273765 414428 407108 455157 488042
22703 488042 486325 456452 398945 247420 368688 191361 -17053 -146613 -123895 -137044 33898
22692 33898 242775 316006 295821 406408 467413 240345 273263 232317 227070 292237 209862
22681 209862 233391 338340 344799 256892 247454 355010 356507 301808 173919 -26151 156578
22670 156578 266480 294945 331758 246390 219850 288874 216771 -4332 -40129 55155 148546
$$ packed form
22746a06311q9452p2776J08923K25401m8977p9274j6881j04861p4302L63160L28720
22735D33370k1492l36572m02996Q4983J49035N6694J29943J01898m9273k07716
22725f2126J7366q1337P077K20199O0076r8922j13337m8319P7772J7897K6422
22714B2768K27333N5889J50272n0656r5379k14584J78122J40663p320M8049L2885
22703D88042j717k9873n7507j51525J21268j77327k08414j29560K2718j3149J70942
22692C3898K08877P3231k0185J10587O1005k27068L2918m0946n247O5167q2375
22681B09862K3529J04949O459q7907r438J07556J497n4699j27889k00070J82729
22670A56578J09902K8465L6813q5368k6540O9024p2103k21103l5797R5284R3391
$$ plain form
22659 148546 5156 -156175 -117266 84574 260358 227989 80168 123841 341775 255706
22649 255706 168109 299264 170920 -23253 39478 -25268 -50573 -49246 105076 55905 -109059
22638 -109059 -89365 -25388 211432 206020 -93894 -200617 -122235 -125859 -218365 -331495 -508075
22627 -508075 -509810 -342507 -315974 -149703 -78571 -108070 -125740 -159860 -264480 -218547 -282698
22616 -282698 -403537 -279855 -82026 -67192 -47712 -94943 -150347 -143631 -152822 -131267 -72045
22605 -72045 -22583 202491 156535 99648 282844 356375 54009 -64668 -13210 19775 34180
22594 34180 53886 -65301 -232303 -438265 -541548 -512687 -418389 -296460 -134379 -81646
22584 -81646 -89903 10675 -30705 -11608 -31491 -138823 -113452 10943 4759 109662 127194
$$ packed form
22659A48546j43390j61331L8909K01840J75784l2369j47821M3673K17934q6069
22649B55706q7597J31155j28344j94173O2731o4746k5305J327J54322m9171j64964
22638a09059J9694O3977K36820n412k99914j06723P8382l624r2506j13130j76580
22627e08075j735J67303K6533J66271P1132k9499j7670l4120j04620M5933o4151
22616b82698j20839J23682J97829J4834J9480m7231n5404O716r191K1555N9222
22605g2045M9462K25074m5956n6887J83196P3531l02366j18677N1458L2985J4405
22594C4180J9706j19187j67002k05962j03283K8861R4298J21929J62081N2733
22584h1646q257J00578m1380J9097j9883j07332K5371J24395o184J04903J7532
$$ plain form
22573 127194 -121392 -178924 -192966 -194917 -422228 -535836 -446151 -505857 -558026 -329703 -227496
22562 -227496 -218648 29243 98961 31347 288306 442623 326205 197567 129863 -294971
22552 -294971 -505149 -316931 -115417 -117273 -268660 -174870 -40641 172775 105368 100131 101567
22541 101567 -59171 -203266 -211302 -240711 -414045 -444048 -198112 -149687 -17456 38703 243
22530 243 54784 82324 221860 137516 -4444 -61333 -50630 -83222 -4843 9209 -39323 -86098
22518 -86098 812 51536 30736 75067 38825 52816 182224 135414 39696 50707 171939
22507 171939 151513 12678 -33977 -74200 -79465 -82016 -85826 -205470 -235516 -168416 -134624 -279764
22495 -279764 -206561 -106532 -104422 -178408 -103346 -51449 -49585 -19768 103456 145786 44110
$$ packed form
22573A27194k48586n7532j4042j951k27311j13608Q9685n9706n2169K28323J02207
22562b27496Q848K47891O9718o7614K56959J54317j16418j28638o7704m24834
22552b94971k10178J88218K01514j856j51387R3790J34229K13416o7407n237J436
22541A01567j60738j44095q036k9409j73334l0003K45936M8425J32231N6159l8460
22530B43N4541K7540J39536q4344j41960n6889J0703l2592P8379J4052m8532m6775
22518h6098Q6910N0724k0800M4331l6242J3991J29408m6810r5718J1011J21232
22507A71939k0426j38835m6655m0223n265k551l810j19644l0046O7100L3792j45140
22495b79764P3203J00029K110p3986P5062N1897J864K9817J23224M2330j01676
$$ plain form
22484 44110 -159100 -386698 -460633 -469619 -390668 -254492 -195152 -129126 -59811 -142661 -247439
22473 -247439 -158362 -119090 -253296 -287741 -153864 -29151 230219 317955 275775 259758 198611
22462 198611 263596 305199 430704 363456 203821 138135 188615 206565 119843 39358 74396
22451 74396 239972 228732 -630 -172510 -216843 -68879 83147 128224 -29451 -15401
22441 -15401 -21242 34848 127239 84225 70572 9903 37222 53615 34831 -147700 -275142
22430 -275142 -346800 -189546 70345 -116671 -314859 -321006 -299105 -196322 -80791 42182
22420 42182 -36652 -103135 -69173 -62729 -96614 13428 149237 285092 274600 262678 53490
22409 53490 -184757 -293602 -187446 -44005 -93451 -231692 -713 110600 177220 295549
$$ packed form
22484D4110k03210k27598p3935q986P8951J36176N9340O6026O9315q2850j04778
22473b47439Q9077L9272j34206l4445J33877J24713K59370Q7736m2180j6017o1147
22462A98611O4985M1603J25505o7248j59635o5686N0480J7950q6722q0485L5038
22451G4396J65576j1240k29362j71880m4333J47964J52026M5077j57675J4050
22441a5401n841N6090R2391m3014j3653o0669K7319J6393j8784j82531j27442
22430b75142p1658J57254K59891j87016j98188o147K1901J02783J15531J22973
22420D2182p8834o6483L3962O444l3885J10042J35809J35855j0492j1922k09188
22409E3490k38247j08845J06156J43441m9446j38241K30979J11313O6620J18329
$$ plain form
22399 295549 450598 310272 137704 24642 -5582 -97095 55664 216147 227729 266266
22389 266266 222513 157056 240079 309296 179876 -92788 -229870 -129814 16409 206877
22379 206877 160887 112714 42000 -68035 -101234 -137888 45811 123394 125954 -12483 25876
22368 25876 66415 160924 273125 238579 246242 353596 256827 174118 113091 15637 25707
22357 25707 44894 -35793 -138754 -224295 -201570 -217920 -194767 -150740 -56725 2634 -217615
22346 -217615 -308171 24662 403791 449909 332395 219417 86508 21044 44538 16961
22336 16961 176689 326870 126275 45531 -18367 188281 107353 -48742 -121951 -151600 -164637
22325 -164637 -288186 -366752 -311177 -243754 -50142 158458 133061 220502 227577 -15618 -69153
$$ packed form
22399B95549J55049j40326j72568j13062l0224r1513J52759J60483J1582L8537
22389B66266m3753o5457Q3023O9217j29420k72664j37082J00056J46223J90468
22379B06877m5990m8173p0714j10035l3199l6654J83699P7583K560j38437L8359
22368B5876M0539R4509J12201l4546P663J07354r6769q2709o1027r7454J0070
22357B5707J9187q0687j02961q5541K2725j6350K3153M4027R4015N9359k20249
22346b17615r0556L32833L79129M6118j17514j12978j32909o5464K3494k7577
22336A6961J59728J50181k00595q0744o3898K06648q0928j56095p3209k9649j3037
22325a64637j23549p8566N5575O7423J93612K08600k5397Q7441P075k43195n3535
$$ plain form
22314 -69153 -268150 -309705 -130478 -152277 -382347 -278755 -296513 -324382 -260462 -240818 -84518
22303 -84518 -43446 -180661 -251332 -148673 49649 -8351 -73345 103512 299370 286777 129306
22292 129306 107316 264256 405332 390449 268440 133089 -102122 -296352 -73285 157110
22282 157110 269888 300200 375914 367328 344817 232345 204080 156712 -16623 -132901 36090
22271 36090 162250 53359 156898 115341 79015 -99057 -70272 126816 148854 -54143
22261 -54143 -200206 3544 140675 89829 37551 243466 353727 296591 165511 26992
22251 26992 99687 162145 -30492 -261235 -259556 -128411 130574 183327 221620 347463 376310
22240 376310 268279 136005 139782 106467 70041 -115381 -116069 -63672 -8540 67244 87955
$$ packed form
22314f9153j98997m1555J79227k1799k30070J03592j7758k7869O3920J9644J56300
22303h4518M1072j37215p0671J02659J98322n8000o4994J76857J95858j2593j57471
22292A29306k1990J56940J41076j4883j22009j35351k35211j94230K23067K30395
22282A57110J12778L0312P5714q586k2511j12472k8265m7368j73335j16278J68991
22271C6090J26160j08891J03539m1557l6326j78072K8785J97088K2038k02997
22261e4143j46063K03750J37131n0846n2278K05915J10261n7136j31080j38519
22251B6992P2695O2458j92637k30743J679J31145K58985N2753L8293J25843K8847
22240C76310j08031j32274L777l3315l6426j85422o88N2397N5132P5784K0711
$$ plain form
22229 87955 16786 -105935 -72358 -1343 44720 -192248 -321060 -178055 -201516 -41362 39303
22218 39303 55290 90163 113264 86128 85668 22141 164413 279815 -96725 -405218 -323103
22207 -323103 -8630 18633 -120003 -163812 -230795 -224639 -136895 -224524 -89846 11477 -60899
22196 -60899 -53154 -102049 -211803 -295084 -335963 -410580 -423167 -344215 -110107 -917 -71718
22185 -71718 -271711 -135390 10075 89391 -37386 -6501 -59470 -143923 -255273 -320964 -402293
22174 -402293 -401137 -230214 -130373 -67072 41300 141010 3620 -175642 -87801 -114633 -195247
22163 -195247 -338038 -350033 -260922 -208904 -195803 -162522 -240103 -212451 145690 267933 16610
22152 16610 -66243 -3226 176259 299257 222389 257313 399660 87955 92223 93357 60000
$$ packed form
22229H7955p1169j22721L3577P1015M6063k36968j28812J43005k3461J60154Q0665
22218C9303J5987L4873K3101k7136m60o3527J42272J15402l76540l08493Q2115
22207c23103L14473K7263j38636m3809o6983O156Q7744q7629J34678J01323p2376
22196f0899P745m8895j09754q3281m0879p4617j2587P8952K34108J09190p0801
22185g1718j99993J36321J45465P9316j26777L0885n2969q4453j11350o5691q1329
22174d02293J156J70923R9841O3301J08372R9710j37390j79262Q7841k6832q0614
22163a95247j42791j1995Q9111N2018J3101L3281p7581K7652L58141J22243k51323
22152A6610q2853O3017J79485J22998p6868L4924J42347l11705M268J134l3357
$$ plain form
22141 60000 -61363 -78862 -29119 -20966 -72440 -48662 -61617 -33421 21293 112796 12223
22130 12223 -9338 -207423 -336774 -273915 -53840 3836 54215 165483 245287 276191 119039
22119 119039 4701 8737 56101 -6129 -96453 -109100 -240199 -377645 -497062 -395242 -581232
22108 -581232 -684040 -587173 -388791 -239986 -252933 -342515 -490988 -505637 -237875 84943
22098 84943 -14134 -343296 -255447 108472 148832 -187193 -214202 -92563 -98716 -290420 -347905
22087 -347905 -154197 -222356 -439780 -500958 -282703 -13568 35328 -75666 -223041 -167543
22077 -167543 -35810 -184991 -174100 -130542 -43838 67269 24473 -137046 -235228 -296639 -329807
22066 -329807 -506552 -608193 -614037 -706638 -581283 -308239 -70370 120586 125055 -58506
$$ packed form
22141F0000j21363j7499M9743Q153n1474K3778j2955K8196N4714R1503j00573
22130A2223k1561j98085j29351O2859K20075N7676N0379J11268P9804L0904j57152
22119A19039j14338M036M7364o2230r0324j2647j31099j37446j19417J01820j85990
22108e81232j02808R6867J98382J48805j2947q9582j48473j4649K67762L22818
22098H4943r9077l29162Q7849L63919M0360l36025k7009J21639o153j91704n7485
22087c47905J93708o8159k17424o1178K18255K69135M8896j10994j47375N5498
22077a67543J31733j49181J0891M3558Q6704J11107m2796j61519r8182o1411l3168
22066c29807j76745j01641n844r2601J25355K73044K37869J90956M469j83561
$$ plain form
22056 -58506 -48468 144650 284300 314590 340570 288171 379238 433321 382854 196739 77801
22045 77801 -69805 -241890 -317382 -106779 -3937 66123 -14198 -239997 -212807 55911
22035 55911 -27385 -143030 -254580 -241331 -134178 -124863 -33600 25939 -33310 -143912 -47876
22024 -47876 -186118 -221122 -97062 -190638 -256053 -241703 -285466 -332770 -141356 -86596 -214956
22013 -214956 -120500 170619 343418 209339 108641 113739 82639 55259 229171 326278 226038
22002 226038 254096 193237 124388 148882 195829 147078 113891 38752 -123168 -145218 -170420
21991 -170420 -81937 133917 382661 260780 115900 -32373 -59679 15967 105046 164509
21981 164509 129823 92700 44888 -60975 -150545 -31517 205011 46458 -209035 -157765
$$ packed form
22056e8506J0038J93118J39650L0290K5980n2399R1067N4083n0467j86115j18938
22045G7801j47606j72085p5492K10603J02842P0060q0321k25799K7190K68718
22035E5911q3296j15645j11550J3249J07153R315R1263N9539n9249j10602R6036
22024d7876j38242l5004J24060r3576o5415J4350m3763m7304J91414N4760j28360
22013b14956R4456K91119J72799j34079j00698N098l1100k7380J73912R7107j00240
22002B26038K8058o0859o8849K4494M6947m8751l3187p5139j61920k2050k5202
21991a70420Q8483K15854K48744j21881j44880j48273k7306P5646Q9079N9463
21981A64509l4686l7123m7812j05863q9570J19028K36528j58553k55493N1270
$$ plain form
21971 -157765 -184782 -183212 -296304 -295266 -122840 -126464 -73686 -87661 -87754 -37189 -46971 -136576
21959 -136576 -221554 -245405 -135429 174195 231143 304686 422411 363533 421136 395450 200969
21948 200969 80889 43658 81451 14537 -20633 -23568 133890 196551 178567 199325 -40550
21937 -40550 -88333 -229833 -363271 -234173 -131580 -123357 -69775 -35843 -124034 -249534 -183652
21926 -183652 -127086 -232425 -387480 -196986 -180797 -189096 -84028 -63970 4133 -8923 10372
21915 10372 35245 51300 -5151 -333289 -206051 140480 207802 -131856 -243581 -124059
21905 -124059 112052 193839 171508 310190 286517 124048 59743 136528 304288 413826
21895 413826 204736 78305 84425 128955 81301 14930 19168 -152663 -329647 -514208 -476541
$$ packed form
21971a57765k7017J570j13092J038J72426l624N2778j3975r3N0565r782q9605
21959a36576q4978k3851J09976L09624N6948P3543J17725n8878N7603k5686j94481
21948B00969j20080l7231L7793o6914l5170k935J57458O2661j7984K0758k39875
21937d0550m7783j41500j33438J29098J02593Q223N3582L3932q8191j25500O5882
21926a83652N6566j05339j55055J90494J6189q299J05068K0058O8103j3056J9295
21915A0372K4873J6055n6451l28138J27238L46531O7322l39658j11725J19522
21905a24059K36111Q1787k2331J38682k3673j62469o4305P6785J67760J09538
21895D13826k09090j26431O120M4530m7654o6371M238j71831j76984j84561L7667
$$ plain form
21884 -476541 -357716 -336289 -138994 -49193 -121408 -112424 -78264 -144554 40156 167457 -56807
21873 -56807 -49073 140755 222151 166312 213074 204160 79896 -102934 -294145 -390860 -462502
21862 -462502 -381846 -139446 -81107 -230814 -450675 -342937 -75236 133863 219661 292795
21852 292795 198859 -10569 -130492 -22813 30823 -100747 -131556 -67594 -206632 -152366
21842 -152366 -64118 -103755 -137973 63249 15886 -113059 -51035 -254634 -437476 -560184
21832 -560184 -551477 -465444 -319186 -152130 -88759 -78355 17620 -77128 -278322 -142859 -76050
21821 -76050 40858 132087 81584 122787 112656 173965 283891 302737 67771 -81481 -207783
21810 -207783 -135039 22636 236937 257968 196007 -18832 -222321 -89361 186315 163871
$$ packed form
21884d76541J18825K1427J97295Q9801p2215Q984L4160o6290J84710J27301k24264
21873e6807P734J89828Q1396n5839M6762q914j24264j82830j91211r6715p1642
21862d62502Q0656K42400N8339j49707k19861J07738K67701K09099Q5798P3134
21852B92795r3936k09428j19923J07679N3636j31570l0809O3962j39038N4266
21842a52366Q8248l9637l4218K01222m7363j28945O2024k03599j82842j22708
21832e60184Q707Q6033J46258J67056O3371J0404R5975r4748k01194J35463O6809
21821g6050J16908R1229n0503M1203j0131O1309J09926J8846k34966j49252j26302
21810b07783P2744J57675K14301K1031o1961k14839k03489J32960K75676k2444
$$ plain form
21800 163871 149776 -11792 -13594 132158 187177 193466 48677 -65883 31794 145003 212381
21789 212381 13814 29733 93076 25564 58992 -81734 -11876 -58166 -137216 -226533 -253775
21778 -253775 -129038 4627 12366 -170998 -237564 78430 234669 167686 97675 -99361
21768 -99361 -396771 -500884 -447370 -418552 -358391 -328495 -198577 -132235 -129632 65004 178525
21757 178525 218130 228650 -27640 -165846 -231910 -90168 115296 280626 207411 159967
21747 159967 145231 227265 190927 57245 92203 134580 91333 74426 68377 -33589 3757
21736 3757 233828 324834 265745 237554 253002 425098 457883 405134 247299 240420 338064
21725 338064 283590 174516 154823 192704 274208 267644 326431 265013 289889 290989 253672 267443
$$ packed form
21800A63871j4095j61568j802J45752N5019O289j44789j14560R7677J13209O7378
21789B12381j98567J5919O3343o7512L3428j40726O9858m6290p9050q9317k7242
21778b53775J24737J33665P739j83364o6566L15994J56239o6983p0011j97036
21768i9361k97410j04113N3514K8818O0161K9896J29918O6342K603J94636J13521
21757A78525L9605J0520k56290j38206o6064J41742K05464J65330p3215m7444
21747A59967j4736Q2034l6338j33682L4958M2377m3247j6907o049j01966L7346
21736C757K30071R1006n9089k8191J5448J72096L2785n2749j57835o879R7644
21725C38064n4474j09074j9693L7881Q1504o564N8787o1418K4876J100l7317J3771
$$ plain form
21713 267443 380545 299094 14987 -203982 -138017 -5786 -12304 -6928 25251 -59435 -106716
21702 -106716 8884 228888 197513 63412 -43989 -22107 -93538 -106202 -24295 164014
21692 164014 195097 175866 105078 140380 267706 356908 221536 -38276 -103843 -197663 -175298
21681 -175298 -381958 -397171 -195951 -100403 -206362 -72038 -21190 -137752 -188607 -110760
21671 -110760 108818 95184 4347 33722 -126944 -295533 -217705 -61001 -128004 -246489
21661 -246489 -350873 -189816 92726 139786 43635 54328 119926 116086 57550 -1871 28675
21650 28675 114030 168003 188319 -5474 -35022 161928 205655 279991 258532 -11177 -45025
21639 -45025 160922 253992 122688 70995 141905 157751 232997 197447 31009 -21439 18596
$$ packed form
21713B67443J13102q1451k84107k18969O5965J32231o518N376L2179q4686m7281
21702a06716J15600K20004l1375j34101j07401K1882p1431j2664Q1907J88309
21692A64014L1083j9231p0788L5302J27326Q9202j35372k59812o5567r3820K2365
21681a75298k06660j5213K01220R5548j05959J34324N0848j16562n0855P7847
21671a10760K19578j3634r0837K9375j60666j68589P7828J56704o7003j18485
21661b46489j04384J61057K82542M7060r6151J0693O5598l840n8536n9421L0546
21650B8675Q5355N3973K0316j93793k9548J96950M3727P4336k1459k69709l3848
21639d5025K05947R3070j31304n1693P0910J5846P5246l5550j66438n2448M0035
$$ plain form
21628 18596 41409 -98176 -138739 -108945 -124256 -59225 -164857 29422 152006 175676 157858
21617 157858 25816 -231080 -310898 -171891 7134 190362 274479 -74825 -320825 -178896
21607 -178896 -14043 92343 -47637 -168557 -178717 -117301 -11329 101709 220657 336428
21597 336428 329193 76081 -66655 -122704 -130083 -111566 -152366 -63638 214534 308931 371038
21586 371038 309188 71316 79542 17173 105527 -13381 -344881 -367524 -192214 -19897 -77813
21575 -77813 -334380 -384771 -300637 -228231 -247726 -118467 92555 124936 5346 24312 114864
21564 114864 132770 91283 82258 225043 234630 280098 230191 228461 230128 162691 204911 211717
21552 211717 258832 360537 301128 127790 -59481 1405 23391 -9662 31079 -82811 -350998
$$ packed form
21628A8596K2813j39585m0563K9794j5311O5031j05632J94279J22584K3670j7818
21617A57858j32042k56896p9818J39007J79025J83228Q4117l49304k46000J41929
21607a78896J64853J06386j39980j20920j0160O1416J05972J13038J18948J15771
21597C36428p235k53112j42736n6049p379J8517m0800Q8728K78172R4397O2107
21586C71038o1850k37872Q226o2369Q8354j18908l31500k2643J75310J72317n7916
21575g7813k56567n0391Q4134P2406j9495J29259K11022L2381j19590J8966R0552
21564A14864J7906m1487r025J42785R587M5468m9907j730J667o7437M2220O806
21552B11717M7115J01705n9409j73338j87271O0886K1986l3053M0741j13890k68187
$$ plain form
21541 -350998 -392940 -276419 3778 55716 -70160 -258618 -224440 -20629 158307 215364
21531 215364 324392 310524 133142 20327 -38243 -21705 59716 259376 170136 155579 350887
21520 350887 525760 234637 -47688 -81574 -175424 -152549 -176447 -181905 -101784 76061 205951
21509 205951 98554 35096 135261 55644 -37416 -78349 53787 63633 -57118 -143966 64628
21498 64628 184555 65831 -118786 -51645 -55134 -74531 -100748 44387 91443 -85750 -129544
21487 -129544 19948 267249 467438 246565 6930 10893 -101086 -197068 -77031 -123459
21477 -123459 -46139 83468 65303 -44284 -36069 1731 130893 261376 157903 225440 312422
21466 312422 262455 167998 74466 -96481 -290476 -131017 -80058 -143837 -132209 -79148 -38574
$$ packed form
21541c50998m1942J16521K80197N1938j25876j88458L4178K03811J78936N7057
21531B15364J09028j3868j77382j12815n8570J6538Q1421J99660q9240j4557J95308
21520C50887J74873k91123k82325l3886r3850K2875k3898n458Q0121J77845J29890
21509B05951j07397o3458J00165p9617r3060m0933J32136R846j20751q6848K08594
21498F4628J19927j18724j84617O7141l489j9397k6217J45135M7056j77193m3794
21487a29544J49492K47301K00189k20873k39635L963j11979r5982J20037m6428
21477a23459P7320J29607j8165j09587Q215L7800J29162J30483j03473O7537Q6982
21466C12422m9967r4457r3532j70947j93995J59459N0959o3779J1628N3061M0574
$$ plain form
21455 -38574 -49425 16849 179407 315782 139618 -37455 104659 112074 40727 61030 136003
21444 136003 -224 -196158 -327624 -388117 -252254 36054 93813 100361 205119 155059
21434 155059 132451 175587 262219 366768 244001 -88041 -180740 -274473 -336303 -406135 -479489
21423 -479489 -386513 -144770 9051 3045 -36749 -57457 -14274 82152 59112 -33149 -209000
21412 -209000 -200205 -310034 -258535 -101086 -74149 -28030 13175 105361 118706 26655 71215
21401 71215 158680 30248 -118439 -134084 -44444 -14624 108639 51424 17495 -56793 -27722
21390 -27722 23778 -58394 -302280 -199319 -39677 110890 309508 387872 221621 53613
21380 53613 -45501 18767 58258 123996 86208 -28396 -70699 54169 269539 230949 82376
$$ packed form
21455c8574j0851O6274J62558J36375j76164j77073J42114P415p1347K0303P4973
21444A36003j36227j95934j31466o0493J35863K88308N7759O548J04758n0060
21434A55059k2608M3136Q6632J04549j22767l32042r2699r3733o1830o9832p3354
21423d79489R2976K41743J53821o006l9794k0708M3183R6426k3040r2261j75851
21412b09000Q795j09829N1499J57449K6937M6119M1205R2186J3345r2051M4560
21401G1215Q7465j28432j48687j5645Q9640K9820J23263n7215l3929p4288K9071
21390b7722N1500q2172k43886J02961J59642J50567J98618P8364j66251j68008
21380E3613r9114O4268L9491O5738l7788j14604m2303J24868K15370l8590j48573
$$ plain form
21369 82376 -31621 -58808 -103717 13618 205438 168162 210365 303356 149697 16015 52732
21358 52732 91022 40493 -121021 -221791 -18657 -106879 -405840 -463304 -425844 -274615 -126655
21347 -126655 -203351 -274471 -448015 -680605 -422508 -110727 -99386 -157244 -106192 -56785 104314
21336 104314 51067 191178 316601 276597 133161 -68573 -227787 -443031 -443074 -177662 95585
21325 95585 112120 -40957 -262518 -205430 -11194 256478 285135 188956 238139 132202 54759
21314 54759 147169 164655 166410 319512 480059 424283 182292 -1143 108060 194734 175126
21303 175126 238920 220542 145869 116802 406298 580691 496607 477604 328478 269586 186523
21292 186523 18583 -140205 -242715 -369456 -297357 -51013 -103090 -97942 -38415 5153 47616
$$ packed form
21369H2376j13997k7187m4909J17335J91820l7276M2203R2991j53659j33682L6717
21358E2732L8290n0529j61514j00770K03134q8222k98961n7464L7460J51229J47960
21347a26655p6696p1120j73544k32590K58097L11781J1341n7858N1052M9407J61099
21336A04314n3247J40111J25423m0004j43436k01734j59214k15244m3K65412K73247
21325I5585J6535j53077k21561N7088J94236K67672K8657r6179M9183j05937p7443
21314E4759R2410J7486J755J53102J60547n5776k41991j83435J09203Q6674j9608
21303A75126O3794j8378p4673k9067K89496J74393q4084j9003j49126n8892q3063
21292A86523j67940j58788j02510j26741P2099K46344n2077N148N9527M3568M2463
$$ plain form
21281 47616 -51641 21185 143750 238769 285264 167209 36591 -36061 -119454 -181287 -392495
21270 -392495 -322965 -254407 -347395 -399844 -423764 -279470 30885 233660 176994 45846 -162411
21259 -162411 -168937 -205124 -187543 -196035 -248709 -299740 -580484 -534553 -501739 -495255 -711752 -756254
21247 -756254 -551373 -276202 -269841 -486170 -558460 -618674 -589446 -378971 -242436 -216555 -317841
21236 -317841 -359129 -171309 -53550 -89652 -132377 -139362 -160039 -226158 -304484 -218467 -97294
21225 -97294 -219397 -308686 -204698 -50671 286192 278587 81102 -195743 -303498 -225964
21215 -225964 -234720 -280074 -180385 -168744 -148694 -142719 -147498 -96682 59806 123965 138799 173431
21203 173431 117169 188015 307914 277293 388875 280619 -45611 -272940 -296813 -170224
$$ packed form
21281D7616r9257P2826J22565R5019M6495j18055j30618p2652q3393o1833k11208
21270c92495O9530O8558r2988n2449k3920J44294L10355K02775n6666j31148k08257
21259a62411o526l6187J7581q492n2674n1031k80744M5931L2814O484k16497m4502
21247g56254K04881K75171O361k16329p2290o0214K9228K10475J36535K5881j01286
21236c17841m1288J87820J17759l6102m2725o985k0677o6119p8326Q6017J21173
21225i7294j22103q9289J03988J54027L36863p605j97485k76845j07755P7534
21215b25964q756m5354R9689J1641K0050N975m779N0816J56488O4159J4834L4632
21203A73431n6262P0846J19899l0621J11582j08256l26230k27329k3873J26589
$$ plain form
21193 -170224 -24978 201148 340586 313799 87517 25218 94676 124675 -21698 -110558
21183 -110558 95825 165837 140408 71249 16496 43867 21653 5664 -92062 -179194 -121919
21172 -121919 66057 139668 75901 38919 -29738 -67988 -210658 -258420 -143479 91319 154239
21161 154239 129781 120637 -122168 -248729 -383682 -236170 -13638 46277 92574 104797 167806
21150 167806 43 -135091 -191013 -153835 -17048 159815 296163 280575 250776 48672
21140 48672 -189962 -407470 -438446 -397414 -282417 6998 -14774 -108590 54216 164950
21130 164950 298836 451071 492150 527220 658511 712374 590091 325921 59173 -85293
21120 -85293 89031 203922 254622 372140 382101 225386 169121 105532 55947 22990 -4985
$$ packed form
21193a70224J45246K26126J39438k6787k26282o2299O9458K9999j46373q8860
21183a10558K06383P0012k5429o9159n4753K7371k2214j5989r7726q7132N7275
21172a21919J87976P3611o3767l6982o8657l8250j42670m7762J14941K34798O2920
21161A54239k4458r144k42805j26561j34953J47512K22532N9915M6297J2223O3009
21150A67806j67763j35134n5922L7178J36787J76863J36348j5588k9799k02104
21140D8672k38634k17508l0976M1032J14997K89415k1772r3816J62806J10734
21130A64950J33886J52235M1079L5070J31291N3863j22283k64170k66748j44466
21120h5293J74324J14891N0700J17518R961j56715n6265o3589m9585l2957k7975
$$ plain form
21109 -4985 26639 5845 196697 318101 429500 376497 253793 157019 55222 -22290 -40165
21098 -40165 35609 141656 218996 306301 320176 208561 -26992 -445681 -1549877 -1844123
21088 -1844123 -1201945 -843215 -653191 -671779 -477068 -291876 -195390 -133940 -58137 41942
21078 41942 -88785 -130262 -198093 -226245 -43678 122715 105379 -72784 -71818 -40986 -66650
21067 -66650 1023 219892 346037 286931 218463 225528 43684 -224957 -347111 -316175 -87876
21056 -87876 22564 66780 84576 -117658 -203722 -62896 96932 158874 170924 271888 232467
21045 232467 221432 77372 -98523 -11394 98916 121996 152788 383427 634187 853189
21035 853189 1069251 1157323 1154659 1478385 2266446 3407424 5365334 9498984 19636767
$$ packed form
21109d985L1624k0794J90852J21404J11399n3003j22704r6774j01797p7512j7875
21098d0165P5774J06047P7340Q7305J3875j11615k35553m18689j104196k94246
21088a844123O42178L58730J90024j8588J94711J85192R6486O1450P5803J00079
21078D1942j30727m1477o7831k8152J82567J66393j7336j78163R66L0832k5664
21067f6650O7673K18869J26145n9106o8468P065j81844k68641j22154L0936K28299
21056h7876J10440M4216J7796k02234q6064J40826J59828O1942J2050J00964l9421
21045B32467j1035j44060j75895Q7129J10310K3080L0792K30639K50760K19002
21035H53189K16062Q8072k664L23726P88061J140978J957910M133650J0137783
$$ plain form
21026 19636767 40920721 39403729 18884155 9483404 5423307 3422203 2389751 1968626
21018 1968626 1830798 1748548 1657578 1277860 943581 877796 665387 225177 17284 51399
21008 51399 118467 196283 120521 369030 316648 221857 133381 156069 186254 251267 70452
20997 70452 -126347 -262689 -352410 -244985 -77820 -165439 -180800 -61216 -122710 53316
20987 53316 176827 83884 50140 257651 195826 39561 35045 59236 36019 -13339 -158126
20976 -158126 -185386 66766 245465 248413 169710 160385 180726 65702 -231360 -461214 -457987
20965 -457987 -271208 -115964 -116640 -536 57276 5836 108043 299481 225873 120425 178160
20954 178160 350017 293588 35929 -15793 245536 366608 208717 115351 29070 -138897
$$ packed form
21026A9636767K1283954j516992k0519574r400751m060097k001104j032452m21125
21018A968626j37828q2250r0970l79718l34279o5785k12409m40210k07893L4115
21008E1399O7068P7816p5762K48509n2382r4791q8476K2688L0185O5013j80815
20997G0452j96799j36342q9721J07425J67165q7619j5361J19584o1494J76026
20987E3316J23511r2943l3744K07511o1825j56265m516K4191k3217m9358j44787
20976a58126k7260K52152J78699K948p8703r325K0341j15024k97062k29854L227
20965d57987J86779J55244o76J16104N7812n1440J02207J91438p3608j05448N7735
20954A78160J71857n6429k57659n1722K61329J21072j57891r3366q6281j67967
$$ plain form
20944 -138897 -248260 4166 112133 -238489 -231932 96184 296166 309633 271635 136701
20934 136701 -14703 -61310 -84535 -128485 -143966 -195695 -172525 -121560 33231 245161 357174
20923 357174 458770 671052 414672 216509 218103 354342 384773 84794 -19675 -48557
20913 -48557 -105730 -219768 -400483 -474579 -318755 -216713 -228558 -82374 -17347 -211310
20903 -211310 -371221 -351809 -280979 -424160 -617107 -569202 -454246 -228137 -161836 -67571
20893 -67571 28709 -100154 -97075 -95676 -12276 145464 367272 255659 -152811 -492228 -581159
20882 -581159 -459847 -153109 15373 -178385 -182607 -28212 -36165 -8846 -216450 -409055
20872 -409055 -386665 -371965 -307029 -269290 -254346 -418799 -310575 -147059 -88817 -156757 -127765
$$ packed form
20944a38897j09363K52426J07967l50622O557L28116J99982J3467l7998j34934
20934A36701j51404m6607k3225m3950j5481n1729K3170N0965J54791K11930J12013
20923C57174J01596K12282k56380j98163J594J36239L0431k99979j04469k8882
20913d8557n7173j14038j80715p4096J55824J02042j1845J46184O5027j93963
20903b11310j59911J9412P0830j43181j92947M7905J14956K26109O6301R4265
20893f7571R6280j28863L079J399Q3400J57740K21808j11613m08470l39417q8931
20882e81159J21312L06738J68482j93758m222J54395p953K7319k07604j92605
20872d09055K2390J4700O4936L7739J4944j64453J08224J63516N8242o7940K8992
$$ plain form
20861 -127765 -77558 -54676 -202031 -361647 -305210 -78016 -61711 -107076 -109126 -295723 -440189
20850 -440189 -547767 -616608 -476282 -243829 -167989 -265481 -339505 -318039 -273344 -340336 -343606
20839 -343606 -326227 -313395 -432652 -316820 -41192 -72270 -86096 -67284 -77033 -134694 -434807
20828 -434807 -363736 -233634 -302521 -368668 -444231 -331967 -62482 54105 119445 33878 -163755
20817 -163755 -257249 -157150 -49058 -46848 -202105 -377844 -419821 -347094 -199115 98357
20807 98357 129488 66786 -18523 -55712 -205723 -321226 -192042 -120395 -99303 -45259 72627
20796 72627 66324 -134345 -460790 -534949 -229420 212691 500985 301819 -225079 -533033
20786 -533033 -538995 -420730 -201793 -192278 -370438 -293528 -213242 -63802 37071 120054 58935
$$ packed form
20861a27765N0207K2882j47355j59616N6437K27194J6305m5365k050j86597j44466
20850d40189j07578o8841J40326K32453P5840r7492p4024K1466M4695o6992l270
20839c43606J7379J2832j19257J15832K75628l1078j3826J8812r749n7661l00113
20828d34807P1071J30102o8887o6147p5563J12264K69485J16587O5340q5567j97633
20817a63755r3494J00099J08092K210j55257j75739m1977P2727J47979K97472
20807I8357L1131o2702q5309l7189j50011j15503J29184P1647K1092N4044J17886
20796G2627o303k00669l26445p4159L05529M42111K88294j99166n26898l07954
20786e33033n962J18265K18937R515j78160P6910Q0286J49440J00873Q2983o1119
$$ plain form
20775 58935 -72575 -248489 -258321 -146805 7913 5470 -146457 -280999 -151039 -1792
20765 -1792 -101257 -366872 -367098 -188068 -263923 -381972 -353982 -359152 -359164 -297277 -243776 -179312
20753 -179312 -13992 351344 499226 411749 516027 609911 505177 344445 201159 63826
20743 63826 -146516 -107759 -16091 113304 287760 403527 516640 807238 1062081 1243882
20733 1243882 1252665 1387394 1583703 2353158 4064973 7734110 17302110 34334688 26253757
20724 26253757 12547657 6706576 3827631 2215615 1463934 1401631 1294357 864096 610194
20715 610194 424773 328118 151017 -64954 29260 129147 256986 35664 -28305 57415
20705 57415 -34917 -268907 -242609 -199857 -370185 -211024 60050 21470 901 243849 367147
$$ packed form
20775E8935j31510j75914r832J11516J54718k443j51927j34542J29960J49247
20765a792r9465k65615k26J79030p5855j18049K7990n170j2O1887N3501O4464
20753a79312J65320L65336J47882q7477J04278R3884j04734j60732j43286j37333
20743F3826k10342L8757R1668J29395J74456J15767J13113K90598K54843J81801
20733A243882Q783J34729J96309P69455J711815L669137R568000J7032578q080931
20724B6253757j3706100n841081k878945j612016p51681o2303j07274m30261k53902
20715F10194j85421r6655j77101k15971R4214R9887J27839k21322o3969Q5720
20705E7415r2332k33990K6298M2752j70328J59161K71074l8580k0569K42948J23298
$$ plain form
20694 367147 223051 253881 341345 262554 258101 319564 269588 122947 31384 47572 -51863
20683 -51863 -131509 -147087 -171618 -237782 -183348 -73673 -71843 -179166 -190969 -35228 -158048
20672 -158048 -386418 -853319 -1688886 -1566433 -700318 -376291 -511045 -540270 -358938 -198070
20662 -198070 -239636 -107327 19628 65247 18682 99309 96023 122812 4699 -69508 -13132
20651 -13132 -147985 -61375 168697 -9136 -249562 -212601 -117879 -109279 92643 106988 33388
20640 33388 -11379 -140262 73183 151077 163160 117481 -12354 20576 8284 -243954 -361430
20629 -361430 -440437 -331296 -186960 -260572 -152486 -165063 -298105 -337349 -366930 -308535 -166859
20618 -166859 9241 154691 142915 -101120 -216149 -220942 -169336 -233871 -323241 -437682 -575801
$$ packed form
20694C67147j44096L0830Q7464p8791m453O1463m9976j46641r1563J6188r9435
20683e1863p9646j5578k4531o6164N4434J09675J830j07323j1803J55741j22820
20672a58048k28370m66901q35567J22453Q66115L24027j34754k9225J81332J60868
20662a98070m1566J32309J26955M5619m6565Q0627l286K6789j18113p4207N6376
20651a3132j34853Q6610K30072j77833k40426L6961R4722Q600K01922J4345p3600
20640C3388m4767j28883K13445P7894J2083m5679j29835L2930j2292k52238j17476
20629c61430p9007J09141J44336p3612J08086j2577j33042l9244k9581N8395J41676
20618a66859J76100J45450j1776k44035j15029m793N1606o4535q9370j14441j38119
$$ plain form
20607 -575801 -415050 -342326 -517339 -410516 -292887 -407540 -350044 -191335 -196293 -63843
20597 -63843 1870 19999 -94871 -245203 -228718 -248696 -75377 91235 187156 186492 94916
20586 94916 -117324 -248523 -153885 -51933 82642 27714 -119768 -204695 31022 144855
20576 144855 -11283 -229485 -276324 -248057 -218004 -326549 -439945 -580714 -513059 -541920
20566 -541920 -598419 -441508 -321223 -235057 -188467 -221644 -171227 -263529 -236672 -266248 -189632
20555 -189632 -228342 -278480 -217377 11995 241693 232254 44791 14395 -249152 -238071 -43915
20544 -43915 46816 161220 133613 -32585 -216833 -254262 -20574 138359 112249 134918 71088
20533 71088 -100017 -278576 -233425 -178467 -180329 -98031 -788 12017 -81831 -76775 -46803 -98770
$$ packed form
20607e75801J60751P2724j75013J06823J17629j14653N7496J58709m958J32450
20597f3843O5713J8129j14870j50332J6485j9978J73319J66612R5921o64r1576
20586I4916k12240j31199R4638J01952J34575n4928j47482q4927K35717J13833
20576A44855j56138k18202m6839K8267L0053j08545j13396j40769O7655k8861
20566e41920n6499J56911J20285Q6166M6590l3177N0417r2302K6857k9576P6616
20555a89632l8710n0138O1103K29372K29698r439j87463l0396k63547J1081J94156
20544d3915R0731J14404k7607j66198j84248l7429K33688J58933k6110K2669o3830
20533G1088j71105j78559M5151N4958j862Q2298R7243J2805r3848N056K9972n1967
$$ plain form
20521 -98770 -201891 -205705 -349166 -438664 -340463 -190974 -333624 -627423 -726040 -706537 -764810
20510 -764810 -923399 -1010242 -989745 -873183 -781451 -764655 -934389 -901039 -767699 -716075 -748907
20499 -748907 -781898 -851494 -853371 -887414 -905908 -730723 -702030 -772594 -856119 -768429 -587778
20488 -587778 -312105 -197696 -296296 -398130 -574548 -524954 -415630 -377150 -399876 -501596
20478 -501596 -653958 -593455 -656529 -588553 -402280 -212149 417152 1031978 546480 23000
20468 23000 -297771 -601219 -816588 -877107 -919673 -838542 -907658 -966453 -963533 -1041094 -1224450
20457 -1224450 -1300430 -860091 435453 949324 259968 -459257 -808062 -816181 -711071 -515421
20447 -515421 -537079 -889364 -1038776 -1031634 -1031196 -1211531 -1220889 -1071864 -1015905 -1139628 -1288701
$$ packed form
20521i8770j03121l814j43461q9498R8201J49489j42650k93799r8617J9503n8273
20510g64810j58589q6843K0497J16562R1732J6796j69734L3350J33340N1624l2832
20499g48907l2991o9596j877l4043j8494J75185K8693p0564q3525Q7690J80651
20488e87778K75673J14409r8600j01834j76418M9594J09324L8480k2726j01720
20478e01596j52362O0503o3074O7976J86273J90131O29301O14826m85498n23480
20468B3000l20771l03448k15369o0519m2566Q1131o9116n8795K920p7561j83356
20457a224450p5980M40339J295544N13871o89356p19225l48805q119J05110J95650
20447e15421k1658l52285j49412P142M38j80335r358J49025N5959j23723j49073
$$ plain form
20436 -1288701 -457339 253379 -196218 -581747 -942737 -1259727 -1385808 -1209897 -1210123 -1514010
20426 -1514010 -1601421 -1638181 -1645575 -1970407 -2407124 -2840732 -3007280 -3101326 -3226023 -2752114
20416 -2752114 -3302964 -4593995 -5763797 -7126853 -9283630 -12286046 -14283656 -15997590
20408 -15997590 -19907243 -25704618 -34303992 -53316138 -91178074 -175112007 -347605035
20401 -347605035 -372347286 -199399700 -104168413 -60449137 -38121587 -26938584 -20427928
20394 -20427928 -16135202 -13768989 -11130902 -9112068 -7848676 -6819861 -5926277 -5262414
20386 -5262414 -4996453 -4820482 -4598013 -4371204 -4412117 -4787091 -5015585 -5216190 -5657783 -6222828
20376 -6222828 -7197093 -8343065 -9642016 -11505514 -13363611 -15353205 -19288573 -24137291
$$ packed form
20436a288701Q31362P10718m49597l85529l60990l16990j26081J75911k26l03887
20426a514010q7411l6760p394l24832m36717m33608j66548r4046j24697M73909
20416b752114n50850j291031j169802j363056k156777l002416j997610j713934
20408a5997590l909653n797375q599374j9012146l7861936q3933933j72493028
20401c47605035k4742251J72947586R5231287M3719276K2327550J1183003O510656
20394b0427928M292726K366213K638087K018834J263392J028815Q93584O63863
20386e262414K65961J75971K22469K26809m0913l74974k28494k00605m41593n65045
20376f222828r74265j145972j298951j863498j858097j989594l935368m848718
$$ plain form
20368 -24137291 -32103077 -48388442 -79165188 -143915684 -295250826 -408680154 -243944091
20361 -243944091 -122865483 -71034566 -45311009 -32034928 -25393464 -20710663 -18090734
20354 -18090734 -16929876 -15646620 -15567285 -16912591 -18474795 -20542927 -25689429 -35252653
20346 -35252653 -51347681 -80757621 -145708904 -297653966 -401698344 -238034633 -124051620
20339 -124051620 -73775090 -47194747 -31311838 -21892568 -16988457 -16178151 -16213618 -14286198
20331 -14286198 -11386653 -8119258 -6263415 -5190943 -4441767 -3884342 -3383581 -2951254 -2612707
20322 -2612707 -2519756 -2086426 -1595326 -1358454 -853713 -809931 -1048979 -1344298 -1782923 -2183168
20312 -2183168 -3094178 -5116650 -5877873 -3279952 -1364148 -401014 -282869 -758232 -637509
$$ packed form
20368b4137291p965786j6285365l0776746o4750496j51335142j13429328J64736063
20361b43944091J21078608N1830917K5723557J3276081O641464M682801K619929
20354a8090734J160858J283256P9335j345306j562204k068132n146502r563224
20346c5252653j6095028k9409940o4951283j51945062j04044378J63663711J13983013
20339a24051620N0276530K6580343J5882909R419270M904111Q10306l5467J927420
20331a4286198K899545L267395J855843J072472P49176N57425N00761M32327L38547
20322b612707R2951M33330M91100K36872N04741M3782k39048k95319m38625m00245
20312b183168r11010k022472p61223K597921J915804R63134J18145m75363J20723
$$ plain form
20303 -637509 -330504 95460 592644 93832 -447850 -268014 242565 550693 -161058 -702497
20293 -702497 -729729 -557480 -313385 -211078 -90002 -668952 -785635 -492009 -94182 254823
20283 254823 -62566 -341924 -459412 -668312 -1006388 -1445804 -1448183 -1515982 -2103568 -3592601
20273 -3592601 -5490335 -4241017 -2311444 -1346805 -862143 -564245 -558486 -577129 -430859
20264 -430859 -264080 -228815 -353713 -554318 -1139786 -1546084 -1443119 -1052110 -640537 -519050
20254 -519050 -625582 -827453 -607232 -11785 272793 -457205 -1345004 -1307461 -1182405 -1059949
20244 -1059949 -992540 -996590 -994986 -919909 -699132 -633113 -720088 -687825 -577243 -577329 -445297 -308969
20232 -308969 -159378 -86115 -78524 -142200 -143502 -48118 -11617 149377 226407 351556 714751
$$ packed form
20303f37509L07005M25964M97184m98812n41682J79836N10579L08128p11751n41439
20293g02497k7232J72249K44095J02307J21076n78950j16683K93626L97827L49005
20283B54823l17389k79358j17488k08900l38076m39416k379o7799n87586j489033
20273c592601j897734J249318J929573R64639M84662K97898N759j8643J46270
20264d30859J66779L5265j24898k00605n85468m06298J02965L91009M11573J21487
20254e19050j06532k01871K20221N95447K84578p29998q87799L7543J25056J22456
20244a059949O7409m050J604P5077K20777O6019q6975L2263J10582q6J32032J36328
20232c08969J49591P3263P591o3676j302R5384L6501J60994P7030J25149L63195
$$ plain form
20221 714751 1007294 1360059 1764608 2395426 3585667 5918563 10546803 21966414 46169060
20212 46169060 42972621 20662494 10278372 5950872 3998686 2832678 1867381 1016012
20204 1016012 399620 -567387 -2261108 -3591872 -2500527 -1399736 -965706 -988082 -1815656
20195 -1815656 -3600977 -3217230 -1665925 -896372 -582739 -467922 -267721 -61500 -37991
20186 -37991 43576 126336 87418 -196700 -318663 -290919 -544402 -993031 -1457746 -2134915
20176 -2134915 -2424082 -1488827 -733302 -379445 -282277 -257369 -150268 157978 848652 910662
20166 910662 583119 92995 -203027 -212428 74239 271037 663282 1456960 1626577 1014161
20156 1014161 688997 354639 181742 -4859 -108351 -14394 99289 104575 132967 84001
$$ packed form
20221G14751K92543L52765M04549O30818J190241K332896M628240J1419611K4202646
20212D6169060l196439k2310127j0384122m327500j952186j166008r65297q51369
20204A016012o16392r67007j693721j330764J091345J100791M34030k2376q27574
20195a815656j785321L83747J551305P69553L13633J14817K00201K06221K3509
20186c7991Q1567Q2760l8918k84118j21963K7744k53483m48629m64715o77169
20176b134915k89167R35255P55525L53857R7168K4908J07101L08246O90674O2010
20166I10662l27543m90124k96022r401K86667J96798L92245P93678J69617o12416
20156A014161l25164l34358j72897j86601j03492R3957J13683N286K8392m8966
$$ plain form
20146 84001 -24734 -26844 -208871 -351355 -453600 -521592 -193072 -207025 -579786 -574763 -398932
20135 -398932 -336218 -340212 -287978 -460531 -665406 -639070 -539239 -436503 -429992 -381146 -427557
20124 -427557 -400497 -385543 -613384 -855211 -939269 -1049819 -1182255 -1124359 -1227584 -1271504
20114 -1271504 -1293146 -1418117 -1527416 -1504387 -1371378 -1367890 -1528882 -1966302 -2565317 -2949373
20104 -2949373 -3237106 -3540979 -4013691 -4586339 -5511750 -6761465 -8403934 -10520311 -11859698
20095 -11859698 -14580277 -19665028 -26886770 -38740028 -63671434 -118286511 -244291758
20088 -244291758 -386905213 -256833378 -126459944 -67848420 -40813929 -27873758 -20985819
20081 -20985819 -16263091 -14674504 -13701186 -10017148 -7268203 -5491971 -4353997 -3808118
$$ packed form
20146H4001j08735k110j82027j42484j02245o7992L28520j3953l72761N023J75831
20135c98932O2714l994N2234j72553k04875K6336R9831J02736O511M8846m6411
20124d27557K7060J4954k27841k41827q4058j10550j32436N7896j03225m3920
20114a271504k1642j24971j09299K3029J33009L488j60992m37420n99015l84056
20104b949373k87733l03873m72712n72648r25411j249715j642469k116377j339387
20095a1859698k720579n084751p221742j1853258k4931406n4615077j26005247
20088b44291758j42613455J30071835J30373434N8611524K7034491J2940171O887939
20081b0985819M722728J588587R73318L684038K748945J776232J137974N45879
$$ plain form
20073 -3808118 -3482327 -3108852 -2858829 -2477248 -2285284 -2258572 -2243333 -2041733 -1740062 -1352715
20063 -1352715 -1119249 -912506 -818169 -691157 -636227 -781504 -688327 -633005 -831702 -1361408
20053 -1361408 -1926834 -2203326 -2586782 -3625771 -5699452 -5077908 -2926453 -1793850 -1369329
20044 -1369329 -1307233 -1285180 -1164924 -947946 -861957 -805426 -849721 -1127588 -1534356 -2276535
20034 -2276535 -3137796 -2816257 -2788748 -3631009 -4524299 -2291785 -193560 -255210 -770678
20025 -770678 -927655 -938659 -887726 -1247384 -2076509 -3346617 -5079052 -4235523 -2460768
20016 -2460768 -1708558 -1273293 -1041097 -1043489 -1152620 -1274948 -1523867 -1689002 -1664778 -1335303
20006 -1335303 -1064904 -1003640 -1200334 -1282453 -1589356 -1781493 -1927151 -2007694 -2137188 -2171910
$$ packed form
20073c808118L25791L73475K50023L81581J91964K6712J5239K01600L01671L87347
20063a352715K33466K06743R4337J27012N4930j45277R3177N5322j98697n29706
20053a361408n65426k76492l83456j038989k073681O21544K151455J132603M24521
20044a369329O2096K2053J20256K16978Q5989N6531m4295k77867m06768p42179
20034b276535q61261L21539K7509q42261q93290K232514K098225o1650n15468
20025g70678j56977j1004N0933l59658q29125j270108j732435Q43529J774755
20016b460768P52210M35265K32196k392j09131j22328k48919j65135K4224L29475
20006a335303K70399O1264j96694q2119l06903j92137j45658q0543j29494l4722
$$ plain form
19996 -2171910 -2150761 -2168214 -2595953 -3009256 -3363163 -3877270 -4668898 -5825609 -7225943
19987 -7225943 -9398320 -12168449 -14209716 -17496496 -23061155 -31504560 -48561647 -83630057
19979 -83630057 -161868751 -329611699 -388111810 -213114927 -107815145 -60461116 -37636443
19972 -37636443 -26608710 -20296626 -15786219 -13455016 -10716183 -8367512 -6712399 -5469360
19964 -5469360 -4597681 -3946115 -3571354 -3356843 -2799678 -2193865 -1854138 -1671443 -1500146
19955 -1500146 -1701503 -1970698 -2273142 -2775416 -3940741 -6277935 -5619997 -3184519 -2006820
19946 -2006820 -1516570 -1206818 -1052531 -1123775 -1434041 -1401731 -835360 -419591 -304190 -278352
19936 -278352 -201847 411715 1155811 762596 310106 111686 134176 533480 537012 242773
$$ packed form
19996b171910K1149j7453m27739m13303l53907n14107p91628j156711j400334
19987g225943k172377k770129k041267l286780n564659q443405j7057087l5068410
19979h3630057p8238694j67742948n8500111J74996883J05299782M7354029K2824673
19972c7636443J1027733O312084M510407K331203K738833K348671J655113J243039
19964e469360Q71679O51566L74761K14511N57165O05813L39727J82695J71297
19955a500146k01357k69195l02444n02274j165325k337194O57938K435478J177699
19946b006820M90250L09752J54287p1244l10266L2310N66371M15769J15401K5838
19936b78352P6505O13562P44096l93215m52490j98420K2490L99304L532k94239
$$ plain form
19926 242773 -90502 -336521 -257694 -39515 59916 -77357 -225379 -394885 -408112 -341390
19916 -341390 -280320 -119124 -94717 -88007 -15391 -135177 -136520 -209682 -407243 -460872 -531421
19905 -531421 -611988 -635464 -286887 -52085 49618 147139 -152606 -1546965 -2486480 -2899683
19895 -2899683 -3115492 -3199078 -4113936 -5252199 -6357662 -7954708 -10072925 -13229263 -16795663
19886 -16795663 -20910113 -26960074 -36715032 -56784269 -103082918 -209383914 -373896361
19879 -373896361 -299239786 -151373263 -79898923 -48205361 -34044737 -26174186 -21149361
19872 -21149361 -18802788 -16132465 -11544023 -8401181 -6670333 -5693255 -4771170 -3924243
19864 -3924243 -3361845 -2905099 -2579369 -2287622 -1955511 -1654323 -1467087 -1425212 -1262722 -974482
$$ packed form
19926B42773l33275k46019P8827K18179R9431j37273j48022j69506j3227O6722
19916c41390O1070J61196K4407O710P2616j19786j343p3162j97561n3629p0549
19905e31421q0567k3476L48577K34802J01703R7521k99745j394359r39515m13203
19895b899683k15809q3586r14858j138263j105463j597046k118217l156338l566400
19886a6795663m114450o049961r754958k0069237m6298649j06300996j64512447
19879c73896361P4656575J47866523P1474340L1693562J4160624P870551N024825
19872b1149361K346573K670323M588442L142842J730848R77078R22085Q46927
19864c924243N62398M56746L25730K91747L32111L01188J87236M1875J62490K88240
$$ plain form
19854 -974482 -829844 -794108 -797735 -910036 -936486 -727039 -672604 -576272 -348879 -343024 -374499
19843 -374499 -369888 -361433 -528587 -771827 -894777 -763048 -700843 -716455 -969391 -1038708 -729699
19832 -729699 -495199 -367039 -244645 -92793 -49343 706 130697 176843 231227 168132
19822 168132 -51484 -195034 36526 366730 532348 722519 966630 1188452 1571676 2111673
19812 2111673 1577946 592677 2690 -325769 -338267 -120107 210811 859558 1086659 248634
19802 248634 -379005 -586357 -629739 -584067 -499440 -431429 -315559 -289929 -501817 -606426
19792 -606426 -810639 -969739 -685237 -286756 -219908 -229353 -365023 -441027 -411872 -419701 -439827
19781 -439827 -505418 -565107 -626429 -439666 -353154 -451371 -303988 -92045 156928 192898 178196
$$ packed form
19854i74482J44638L5736l627j12301k6450K09447N4435R6332K27393N855l1475
19843c74499M611Q455j67154k43240j22950J31729O2205j5612k52936o9317L09009
19832g29699K34500J28160J22394J51852M3450N0049J29991M6146N4384o3095
19822A68132k19616j43550K31560L30204J65618J90171K44111K21822L83224N39997
19812B111673n33727r85269n89987l28459j2498K18160L30918O48747K27101q38025
19802B48634o27639k07352m3382M5672Q4627O8011J15870K5630k11888j04609
19792f06426k04213j59100K84502L98481O6848r445j35670p6004K9155p829k0126
19781d39827o5591n9689o1322J86763Q6512r8217J47383K11943K48973L5970j4702
$$ plain form
19770 178196 240304 156738 187142 201826 139637 27111 -21367 -22651 39246 -45820 -116158
19759 -116158 -82101 -41087 -40397 22345 200701 62201 -41575 19164 56736 152405 -38255
19748 -38255 -227190 -283644 -173405 -111239 36012 194852 235933 -17609 18550 194408
19738 194408 281915 205042 95509 78065 73740 164273 135201 105572 54125 -38357 38844
19727 38844 150966 187055 200852 65570 101251 231362 291980 217111 89692 -21609 -52524
19716 -52524 -194930 -218804 -50467 108438 222870 100838 21178 174793 216728 47539
19706 47539 23782 -30236 24192 -22011 1221 -139056 -175569 24607 103309 -42655 109029
19695 109029 195665 10685 -49348 83460 40484 -115288 -108241 -68688 -102984 -18301 -222048
$$ packed form
19770A78196O2108q3566L0404J4684o2189j12526m8478j284O1897q5066p0338
19759a16158L4057M1014O90O2742J78356j38500j03776O0739L7572R5669j90660
19748c8255j88935n6454J10239O2166J47251J58840M1081k53542L6159J75858
19738A94408Q7507p6873j09533j7444m325R0533k9072k9629n1447r2482P7201
19727C8844J12122L6089J3797j35282L5681J30111O0618p4869j27419j11301l0915
19716e2524j42406k3874J68337J58905J14432j22032p9660J53615M1935j69189
19706D7539k3757n4018N4428m6203K3232j40277l6513K00176P8702j45964J51684
19695A09029Q6636j84980o0033J32808m2976j55772P047L9553l4296Q4683k03747
$$ plain form
19684 -222048 -193494 -200695 -267984 -54691 284991 455770 339000 136355 -35733 -249132
19674 -249132 -329320 -322198 -380916 -183353 -142508 -140637 -169524 -110062 -65 139776 19642
19663 19642 -73707 -75424 -148232 -158461 -285429 -300558 -251508 -294754 -442751 -415252 -386539
19652 -386539 -232219 -228182 -223803 -98677 -17106 -13065 -371277 -545886 -514898 -712613 -885185
19641 -885185 -915229 -841328 -522696 -312696 -295720 -464817 -619189 -782910 -918255 -607551
19631 -607551 -458445 -418456 -196099 -45473 -243547 -505463 -386361 603614 1949456 2198951
19621 2198951 2425980 1673788 1169118 956458 787053 626778 344293 226141 102896
19612 102896 -252024 -323846 -118743 15902 1707 -62168 -126657 -162973 -210723 -439666 -789417
$$ packed form
19684b22048K8554p201o7289K13293L39682J70779j16770k02645j72088k13399
19674b49132q0188P122n8718J97563M0845J871k8887N9462J09997J39841j20134
19663A9642r3349j717p2808j0229j26968j5129M9050m3246j47997K7499K8713
19652c86539J54320M037M379J25126Q1571M041l58212j74609L0988j97715j72572
19641h85185l0044P3901L18632K10000J6976j69097j54372j63721j35345L10704
19631f07551J49106L9989K22357J50626j98074k61916J19102R89975J345842K49495
19621B198951K27029p52192n04670k12660j69405j60275k82485j18152j23245
19612A02896l54920p1822K05103J34645j4195o3875o4489l6316m7750k28943l49751
$$ plain form
19601 -789417 -868727 -879473 -907926 -926583 -1075038 -1484178 -2118154 -3604321 -6038096 -5722610
19591 -5722610 -3624606 -2627435 -2174977 -2042436 -2117754 -2184024 -2207436 -2454821 -2774710 -3211906
19581 -3211906 -3767987 -4514916 -5289211 -6273761 -7812073 -9997572 -11548874 -13513295 -17675737
19572 -17675737 -24766200 -36583591 -56377414 -94114452 -182568266 -363507937 -373932791
19565 -373932791 -195617082 -101550516 -61424381 -40042829 -26824278 -19004665 -14674199
19558 -14674199 -12421012 -10705020 -8399793 -6675369 -5556347 -4650567 -3950235 -3547883
19550 -3547883 -2961928 -2587185 -2381442 -2291587 -2209742 -2081183 -1875647 -1669253 -1385822 -1311105
19540 -1311105 -1356386 -1173302 -1110870 -991482 -899970 -1028382 -956919 -775430 -574404 -441375
$$ packed form
19601g89417p9310j0746k8453j8657j48455m09140o33976j486167k433775L15486
19591e722610K098004R97171M52458J32541p5318o6270k3412k47385l19889m37196
19581c211906n56081p46929p74295r84550j538312k185499j551302j964421m162442
19572a7675737p090463j1817391j9793823l7737038q8453814j80939671j0424854
19565c73932791J78315709R4066566M0126135K1381552J3218551P819613M330466
19558a4674199K253187J715992K305227J724424J119022R05780P00332M02352
19550c547883N85955L74743K05743Q9855Q1845J28559K05536K06394K83431P4717
19540a311105m5281J83084O2432J19388R1512j28412P1463J81489K01026J33029
$$ plain form
19530 -441375 -708680 -713350 -561651 -489586 -449889 -382129 -254126 -206815 -129533 -84092 -44908
19519 -44908 51919 176044 35907 -242301 -251308 -3775 -28759 -108140 -48661 -26302 -119864
19508 -119864 -93927 -68597 -76435 45615 310032 613491 803035 1423336 1652347 708997
19498 708997 101493 -107217 -173466 -325847 -141027 109016 543624 1157301 1484739 653681
19488 653681 -320357 -1024029 -1753556 -1693607 -1285082 -992382 -689130 -463345 -522521 -488392
19478 -488392 -245290 -4009 -77490 -152414 -228743 -321878 -245353 -197188 -215398 -347885 -422104
19467 -422104 -392267 -383279 -312249 -265763 -201974 -145617 -17696 -113646 -140937 -217010 -362669
19456 -362669 -416736 -435797 -475151 -362881 -238986 -238745 -236678 -252023 -335508 -30563 18170
$$ packed form
19530d41375k67305m670J51699P2065L9697O7760J28003M7311P7282M5441L9184
19519d4908R6827J24125j40137k78208r007K47533k4984p9381N9479K2359r3562
19508a19864K5937K5330p838J22050K64417L03459J89544O20301K29011r43350
19498G08997o07504k08710o6249j52381J84820K50043M34608O13677L27438q31058
19488F53681r74038p03672p29527N9949M08525K92700L03252K25785n9176L4129
19478d88392K43102K41281p3481p4924p6329r3135P6525M8165j8210j32487p4219
19467d22104K9837Q988P1030M6486O3789N6357J27921r5950k7291p6073j45659
19456c62669n4067j9061l9354J12270J23895K41K067j5345q3485L04945M8733
$$ plain form
19445 18170 -36921 -113145 -288616 -323792 -53100 129519 -3228 -237268 -545083 -648332
19435 -648332 -323983 -83007 -114634 -104483 -67543 51020 239632 296099 37879 -88535
19425 -88535 -156193 -197175 -114377 -206058 -244488 -192368 95228 22645 -229226 -225622 -134373
19414 -134373 -30012 -128368 -21152 90366 145036 137114 -55817 -93985 -19921 250454 592559
19403 592559 718612 598092 357918 257839 151843 79011 6439 -91918 -16888 67688
19393 67688 257297 310168 300413 224344 131401 155907 181957 387972 594379 503730 406513
19382 406513 281557 268380 241695 299156 190225 176814 222342 478741 576052 454101 294672
19371 294672 173821 41873 87990 225388 110128 184737 278758 270772 435024 507821 343681
$$ packed form
19445A8170n5091p6224j75471l5176K70692J82619j32747k34040l07815j03249
19435f48332L24349K40976l1627J0151L6940J18563J88612N6467k58220j26414
19425h8535o7658m0982Q2798r1681l8430N2120K87596p2583k51871L604R1249
19414a34373J04361r8356J07216J11518N4670p922j92931l8168P4064K70375L42105
19403E92559J26053j20520k40174j00079j05996p2832p2572r8357P5030Q4576
19393F7688J89609N2871r755p6069r2943K4506K6050K06015K06407r0649r7217
19382D06513j24956j3177k6685N7461j08931j3411M5528K56399R7311j21951j59429
19371B94672j20851j31948M6117J37398j15260P4609R4021p986J64252P2797j64140
$$ plain form
19360 343681 77192 3755 -23645 -58421 -38154 -54588 145668 207990 -29951 19780 99189
19349 99189 244068 444450 524880 507046 409756 208307 138368 -65673 -174719 32535
19339 32535 274083 411443 195065 51118 274543 398360 543052 399921 201873 290372
19329 290372 321578 306151 292944 204684 277704 462340 461569 288583 115220 93276 96572
19318 96572 24553 -113282 -181594 -163290 -49401 80471 17330 -244106 -324970 -122539 76117
19307 76117 55319 110268 203226 306945 338722 159981 20256 146731 341527 454622
19297 454622 288783 64071 -63746 -52520 126075 -58897 -278827 -149252 -195386 -150978
19287 -150978 1934 34566 27979 43273 75649 184508 174122 1404 18293 92625 -135201
$$ packed form
19360C43681k66489p3437k7400l4776K0267j6434K00256O2322k37941M9731P9409
19349I9189J44879K00382Q0430j7834r7290k01449o9939k04041j09046K07254
19339C2535K41548J37360k16378j43947K23425J23817J44692j43131j98048Q8499
19329B90372L1206j5427j3207q8260P3020J84636p71j72986j73363k1944L296
19318I6572p2019j37835o8312J8304J13889J29872o3141k61436q0864K02431J98656
19307G6117k0798N4949R2958J03719L1777j78741j39725J26475J94796J13095
19297D54622j65839k24712j27817J1226J78595j84972k19930J29575m6134M4408
19287a50978J52912L2632o587J5294L2376J08859j0386j72718J6889P4332k27826
$$ plain form
19276 -135201 -340967 -374854 -319957 -101836 27761 18370 -37814 158250 413533 480804 377752
19265 377752 268404 101461 88369 75188 199304 215452 123292 110739 164432 252907 227695
19254 227695 34749 -94729 -150 -23579 -122730 -227393 -138341 75991 44307 139864 279297
19243 279297 358384 245516 -39379 -56068 155219 288172 294653 224494 58653 -17891 65839
19232 65839 3144 -107251 -12380 200834 278524 192220 182266 87574 -126735 -213524 -97631
19221 -97631 73081 49802 63188 80651 52883 220882 265467 248109 196342 276340 223182
19210 223182 237931 154828 68114 37139 98002 182528 155869 119642 191450 212863 33077
19199 33077 99466 32680 -249375 -363924 -228108 -113816 67771 -66441 -64946 -114097 -29162
$$ packed form
19276a35201k05766l3887N4897K18121J29597r391n6184J96064K55283O7271j03052
19265C77752j09348j66943j3092j3181J24116J6148r2160j2553N3693Q8475k5212
19254B27695j92946j29478R4579k3429r9151j04663Q9052K14332l1684R5557J39433
19243B79297P9087j12868k84895j6689K11287J32953O481p0159j65841p6544Q3730
19232F5839o2695j10395R4871K13214P7690q6304r954r4692k14309q6789J15893
19221i7631J70712k3279J3386J7463k7768J67999M4585j7358n1767P9998n3158
19210B23182J4749q3103q6714l0975O0863Q4526k6659l6227P1808K1413j79786
19199C3077O6389o6786k82055j14549J35816J14292J81587j34212J495m9151Q4935
$$ plain form
19188 -29162 208988 226606 299187 403262 324444 181392 -38191 58885 180228 171847 100635
19177 100635 75005 -80084 -140190 -40137 152440 183476 110719 243135 394273 206154
19167 206154 115313 225804 142384 239143 331955 235073 192737 259469 119766 143053 52571
19156 52571 -126791 -216288 -69018 -64827 36927 38323 57734 185648 137157 -104057 -29383
19145 -29383 -52967 -166365 -329289 -153641 -41587 -192399 -254625 -267095 -155282 -66066
19135 -66066 -155063 -322809 -66951 49294 -134633 -48192 180087 457475 310414 29791
19125 29791 -51614 163443 454018 485053 461112 549222 494536 443562 518346 481373 421588
19114 421588 315150 17591 -248682 -373395 -404210 -439060 -451447 -453497 -297005 -40002
$$ packed form
19188b9162K38150J7618P2581J04075p8818j43052k19583R7076J21343q381p1212
19177A00635k5630j55089o0106J00053J92577L1036p2757J32416J51138j88119
19167B06154r0841J10491q3420R6759R2812r6882m2336O6732j39703K3287r0482
19156E2571j79362q9497J47270M191J01754J396J9411J27914m8491k41214P4674
19145b9383k3584j13398j62924J75648J12054j50812o2226j2470J11813Q9216
19135f6066q8997j67746K55858J16245j83927Q6441K28279K77388j47061k80623
19125B9791q1405K15057K90575L1035k3941Q8110n4686n0974P4784l6973n9785
19114D21588j06438k97559k66273j24713l0815l4850j2387k050J56492K57003
$$ plain form
19104 -40002 57799 42593 108998 -80725 -188448 -78240 -103525 -169030 -138290 -157905 -22678
19093 -22678 145903 42085 -10438 31841 105729 105249 248517 346617 291680 315462 134920
19082 134920 -73063 -109818 -98659 -72433 -172096 -161555 -78676 -160909 -232143 -32672 35845
19071 35845 -130439 -174454 -103121 -143966 -258420 -198989 -119934 -122924 66868 150600 299615
19060 299615 344380 219258 3074 77799 163207 147 -201249 -291594 -446401 -585534
19050 -585534 -491619 -199078 -57795 114273 245060 149301 140279 110498 93991 -142467 -435851
19039 -435851 -403241 -88591 38522 122763 166027 153096 198459 248738 174719 82756 177293
19028 177293 353623 181793 -36411 -7687 -140228 -302005 -202117 6675 49490 -4760
$$ packed form
19104d0002R7801j5206O6405j89723j07723J10208k5285o5505L0740j9615J35227
19093b2678J68581j03818n2523M2279P3888m80J43268R8100n4937K3782j80542
19082A34920k07983l6755J1159K6226r9663J0541Q2879q2233p1234J99471O8517
19071C5845j66284m4015P1333m0845j14454N9431P9055k990J89792Q3732J49015
19060B99615M4765j25122k16184P4725Q5408j63060k01396r0345j54807j39133
19050e85534R3915K92541J41283J72068J30787r5759r022k9781j6507k36458k93384
19039d35851L2610L14650J27113Q4241M3264j2931M5363N0279p4019r1963R4537
19028A77293J76330j71830k18204K8724j32541j61777R9888K08792M2815n4250
$$ plain form
19018 -4760 3843 -24036 -100726 -251322 -340745 -217047 -60602 -75421 -106173 -129121 -165458
19007 -165458 -112019 -9433 90271 179985 73179 123 81664 22836 8387 -24077 183528
18996 183528 187043 115141 -27210 136800 377400 180443 -8759 18988 -30983 -47978 -35461
18985 -35461 -76200 -190794 -148025 -19159 -173 -72226 -318424 -493327 -372355 -171487
18975 -171487 -285576 -315095 -186553 -257776 -324579 -397858 -311196 -238975 -63198 41324 -72744
18964 -72744 -175720 -322263 -391480 -360523 -278149 -218261 -197878 -191948 -133183 840 15607
18953 15607 -135789 -255019 -145495 -46994 20768 -70843 -363356 -385623 -243393 -193359 -179833
18942 -179833 -69050 -212998 -133270 153780 181334 124693 49358 74723 206339 -9428
$$ packed form
19018d760Q603k7879p6690j50596q9423J23698J56445j4819l0752k2948l6337
19007a65458N3439J02586R9704Q9714j06806p3056Q1541n8828j4449l2464K07605
18996A83528L515p1902j42351J64010K40600j96957j89202K7747m9971j6995J2517
18985c5461m0739j14594M2769J28866J8986p2053k46198j74903J20972K00868
18975a71487j14089k9519J28542p1223o6803p3279Q6662P2221J75777J04522j14068
18964g2744j02976j46543o9217L0957Q2374N9888K0383N930N8765J34023J4767
18953A5607j51396j19230J09524R8501O7762r1611k92513k2267J42230N0034J3526
18942a79833J10783j43948P9728K87050K7554n6641p5335K5365J31616k15767
$$ plain form
18932 -9428 -229026 -320530 -312116 -264153 -68051 62037 132855 80345 -42690 -107655 -149758
18921 -149758 -71401 105244 181195 124237 71160 35505 57111 53729 -14481 -84145 -100056
18910 -100056 48071 177076 159103 42173 -64348 -103994 17825 94521 44067 113319
18900 113319 293051 238332 249830 268866 247731 84589 -96179 -83641 23108 -134803
18890 -134803 -376688 -401340 -220626 -247032 -402566 -428434 -517031 -405015 -165221 -3825
18880 -3825 -59598 -232222 -94052 8550 182352 199804 99853 81580 118692 103275 32662
18869 32662 49053 25987 154934 198761 157710 -29810 -91526 13708 85604 176635 298
18858 298 -229500 -310441 -238172 -289459 -142446 -76744 -109889 -200607 -153973 -11846 -59610
$$ packed form
18932i428k19598r1504Q414M7963J96102J30088P0818n2510j23035o4965m2103
18921a49758P8357J76645P5951n6958n3077l5655K1606l382o8210o9664j5911
18910a00056J48127J29005j7973j16930j06521l9646J21819P6696n0454O9252
18900A13319J79732n4719J1498J9036k1135j63142j80768J2538J06749j57911
18890a34803k41885k4652J80714k6406j55534k5868q8597J12016K39794J61396
18880c825n5773j72624J38170J02602J73802J7452r9951j8273L7112j5417p0613
18869C2662J6391k3066J28947M3827m1051j87520o1716J05234P1896R1031j76337
18858B98k29798q0941P2269n1287J47013O5702l3145r0718M6634J42127m7764
$$ plain form
18847 -59610 -115990 -45303 -53535 -3318 66363 199489 280123 267583 171077 314741 380538
18836 380538 188206 27201 -54361 71854 204275 358923 356000 337664 316802 449596
18826 449596 412602 324899 313320 471195 493317 339720 188726 111536 -45072 -159631
18816 -159631 -187109 -143507 -122062 -227661 -168993 -65699 -161659 -201928 -149019 -249521 -20142
18805 -20142 -22693 -101643 -37045 -34961 -157430 -204015 25028 175688 117805 -64402 -189678
18794 -189678 -214401 -125095 -65648 -21152 -89460 -68411 26130 -75110 46911 46499 74705
18783 74705 150566 211245 118212 119671 216142 177231 -100061 -261047 -154230 -92192 -178077
18772 -178077 -326659 -468424 -443490 -343499 -239682 -61539 85395 142593 -3648 -94472
$$ packed form
18847e9610n6380P0687q232N0217O9681J33126Q0634j2540r6506J43664O5797
18836C80538j92332j61005q1562J26215J32421J54648k923j8336k0862J32794
18826D49596l6994q7703j1579J57875K2122j53597j50994p7190j56608j14559
18816a59631k7478M3602K1445j05599N8668J03294r5960m0269N2909j00502K29379
18805b0142k551p8950O4598K084j22469m6585K29043J50660n7883j82207j25276
18794a89678k4723Q9306N9447M4496o8308K1049R4541j01240J22021m12K8206
18783G4705P5861O0679r3033J459R6471l8911k77292j60986J06817O2038q5885
18772a78077j48582j41765K4934R9991J03817J78143J46934N7198j46241r0824
$$ plain form
18762 -94472 157320 227814 220819 288330 450084 382029 175494 -1335 -42530 18999 -75673
18751 -75673 -178984 -86128 -176997 -234582 -137425 -43634 -105695 -45319 85597 -28910 -179315
18740 -179315 -152391 -23195 -73931 -141182 -312454 -353912 6879 79432 60431 112465 -18554
18729 -18554 -99732 -114718 -195412 -276919 -219181 -128546 -15843 291490 439736 356931 416593
18718 416593 147714 -72823 41321 171647 213460 54781 -36753 33014 172929 210834
18708 210834 80290 136771 164988 138563 -75082 -240989 -252241 -290280 -362817 -513335 -467834
18697 -467834 -243191 -161722 -225666 -166839 144118 304470 174383 -91595 -36229 73472
18687 73472 64340 20099 -46896 -131893 -209373 -87609 -222846 -248721 -158829 -133603 -281104
$$ packed form
18762i4472K51792P0494o995O7511J61754o8055k06535j76829m1195O1529r4672
18751g5673j03311R2856r0869n7585R7157R3791o2061O0376J30916j14507j50405
18740a79315K6924J29196n0736o7251j71272m1458L60791P2553j9001N2034j31019
18729a8554q1178j4986q0694q1507N7738R0635J12703L07333J48246q2805N9662
18718D16593k68879k20537J14144J30326M1813j58679r1534O9767J39915L7905
18708B10834j30544N6481K8217k6425k13645j65907j1252l8039p2537j50518M5501
18697d67834K24643Q1469o3944N8827L10957J60352j30087k65978N5366J09701
18687G3472r132m4241o6995q4997p7480J21764j35237k5875Q9892K5226j47501
$$ plain form
18676 -281104 -433036 -419069 -380782 -451241 -416596 -458101 -293794 -191061 -288535 -293424 -284368
18665 -284368 -252798 -237566 -175605 -339040 -126994 16706 129470 278937 350505 206498
18655 206498 66964 106979 55971 -18222 54093 130203 102041 47246 -23706 -172629 -178933
18644 -178933 -225958 -220222 -237870 -291133 -333574 -271149 -214371 -239288 -285954 -245097 -82974
18633 -82974 -85264 -73294 12895 228982 264428 226560 278754 358192 241665 119416 -3590
18622 -3590 -153010 98924 255362 437405 193431 -205908 -355513 -201853 40687 21204
18612 21204 -154328 -232510 -84661 24378 104344 95914 36260 109628 116374 -61925 -76270
18601 -76270 -92857 -28228 -131085 -242231 -254552 -129798 46027 -14072 108896 92560 -60672
$$ packed form
18676b81104j51932J3967L8287p0459L4645m1505J64307J02733r7474m889R056
18665b84368L1570J5232O1961j63435K12046J43700J12764J49467P1568j44007
18655B06498j39534M0015n1008p4193P2315P6110k8162n4795p0952j48923o304
18644a78933m7025N736j7648n3263m2441O2425N6778k4917m6666M0857J62123
18633h2974k290J1970Q6189K16087L5446l7868N2194P9438j16527j22249j23006
18622c590j49420K51934J56438J82043k43974l99339j49605J53660K42540j9483
18612B1204j75532p8182J47849J09039P9966q430n9654P3368O746j78299j4345
18601g6270j6587O4629j02857j11146j2321J24754J75825o0099J22968j6336j53232
$$ plain form
18590 -60672 -41487 -23214 -74917 -29241 -102838 -176139 -150074 -246822 -239254 -189740 -118898 -129402
18578 -129402 -168425 -159491 -65981 -31669 -72886 -288748 -388651 -223121 35984 128065 -17615
18567 -17615 -825 78493 99246 111683 168846 383075 387868 235972 177393 207670 75310
18556 75310 -50109 -94391 -87925 -122293 -132864 52864 48694 -5556 54587 50362 -40072 12807
18544 12807 149272 247105 250562 171418 55770 144404 185439 98595 191575 211736 243995
18533 243995 365236 234259 81098 -178639 -177584 -75913 -75599 -185258 -215864 -192916 -129171
18522 -129171 37726 125152 -7064 -244982 -117995 -42238 -79885 11585 -8224 29404 2969
18511 2969 -115552 -57701 170073 280352 139530 74392 88412 403763 599476 418703
$$ packed form
18590f0672J9185J8273n1703M5676p3597p3301K6065r6748P568M9514P0842j0504
18578a29402l9023Q934R3510L4312m1217k15862r9903J65530K59105R2081j45680
18567a7615J6790P9318K0753J2437N7163K14229M793j51896n8579L0277j32360
18556G5310j25419m4282O466l4368j0571J85728m170n4250O0143m225r0434N2879
18544A2807J36465R7833L457p9144j15648Q8634M1035q6844R2980K0161L2259
18533B43995J21241j30977j53161k59737J055J01671L14j09659l0606K2948O3745
18522a29171J66897Q7426j32216k37918J26987P5757l7647R1470j9809L7628k6435
18511B969j18521N7851K27774J10279j40822o5138J4020L15351J95713j80773
$$ plain form
18501 418703 356340 216821 370741 236099 161060 178628 222163 132318 91267 301299 358269
18490 358269 91130 109314 125780 120189 220201 258878 235253 392436 523917 352264 6886
18479 6886 -226277 -368846 -173001 136884 106189 -36620 -212289 -396909 -332374 -289897
18469 -289897 -179706 -192321 -328551 -271687 -166456 -115134 -116956 -30159 81602 70207 -47807
18458 -47807 -44696 -64513 17451 185792 206989 -22479 -46945 -13651 126371 119743 23876
18447 23876 1447 40313 77749 -48170 -128699 161021 339847 201069 -94540 -196471
18437 -196471 -215369 -265352 -125492 -175463 -175813 -59022 -168455 -146976 -205269 -419457 -496852
18426 -496852 -377234 -211425 -1286 193146 229763 311921 263968 205641 182280 257436 207744
$$ packed form
18501D18703o2363j39519J53920j34642p5039J7568M3535q9845m1051K10032N6970
18490C58269k67139J8184J6466n591J00012L8677k3625J57183J31481j71653l45378
18479F886k33163j42569J95845L09885l0695j42809j75669j84620O4535M2477
18469b89897J10191j2615j36230N6864J05231N1322j822Q6797J11761j1395j18014
18458d7807L111j9817Q1964J68341K1197k29468k4466L3294J40022o628r5867
18447B3876k2429L8866L7436j25919q0529K89720J78826j38778k95609j01931
18437a96471j8898m9983J39860m9971l50J16791j09433K1479n8293k14188p7395
18426d96852J19618J65809K10139J94432L6617Q2158m7953n8327k3361P5156m9692
$$ plain form
18415 207744 -11091 -113818 -9200 149773 173920 192384 -24215 -9313 18282 -77023
18405 -77023 -199427 -89291 5041 115443 199400 196764 -29203 -171930 -88839 -16701 -94457
18394 -94457 -212013 -273640 -220529 -136230 -163835 -11806 24329 -67535 -180555 -93632 9717
18383 9717 22425 -25414 -196918 -262383 -237771 -130467 -215401 -184779 -194571 -234756 -83178
18372 -83178 154526 148731 265397 361712 426422 324512 240600 166279 -118553 -242940 -108706
18361 -108706 145170 455684 466586 222048 87208 -2297 107329 257973 252123 232515
18351 232515 152712 158105 50537 -126043 -19963 -176811 -231196 -385804 -441246 -303370
18341 -303370 -61026 -77695 -91526 228873 324880 230019 152485 18515 -61277 6556 88396
$$ packed form
18415B07744k18835j02727J04618J58973K4147J8464k16599J4902K7595r5305
18405g7023j22404J10136R4332J10402Q3957k636k25967j42727Q3091P2138p7756
18394i4457j17556o1627N3111Q4299k7605J52029L6135r1864j13020Q6923J03349
18383I717J2708m7839j71504o5465K4612J07304q4934L0622r792m0185J51578
18372h3178K37704n795J16666R6315O4710j01910q3912p4321k84832j24387J34234
18361a08706K53876L10514J0902k44538j34840q9505J09626J50644n850j9608
18351B32515p9803N393j07568j76580J06080j56848n4385j54608n5442J37876
18341c03370K42344j6669j3831L20399R6007r4861p7534j33970p9792O7833Q1840
$$ plain form
18330 88396 -36788 -335380 -362316 -214096 -221107 -70955 -170373 -157449 -156576 -216357 -252463
18319 -252463 -254749 -144966 -104420 -116564 47203 26907 -7908 -23775 -101860 -264989 -372608
18308 -372608 -433505 -136046 -209990 -210359 -360214 -346342 -283819 -269676 -106024 30948 109314
18297 109314 65696 -111961 -209420 -233704 -147438 63431 52708 -29363 -36134 23747 50494
18286 50494 47759 -22711 -35394 -30636 -14749 -6073 -305434 -540720 -516309 -332928 -142080
18275 -142080 -114180 -181158 -319867 -265746 -336847 -341929 -352104 -191340 89933 72375 95112
18264 95112 243422 220704 209135 189650 126140 117357 66494 -123426 -253007 -197934 -157945
18253 -157945 106036 312401 198545 19862 43884 -3295 90595 266374 226130 101173
$$ packed form
18330H8396j25184k98592k6936J48220p011J50152r9418J2924Q73n9781l6106
18319b52463k286J09783M0546j2144J63767k0296l4815j5867p8085j63129j07619
18308c72608o0897K97459p3944l69j49855J3872O2523J4143J63652J36972P8366
18297A09314m3618j77657r7459k4284Q6266K10869j0723q2071o771N9881K6747
18286E0494k735p0470j2683M758J5887Q676k99361k35286K4411J83381J90848
18275a42080K7900o6978j38709N4121p1101n082j0175J60764K81273j7558K2737
18264I5112J48310k2718j1569j9485o3510q783n0863j89920j29581N5073L9989
18253a57945K63981K06365j13856j78683K4022m7179R3890J75779m0244j24957
$$ plain form
18243 101173 109903 76413 56083 46541 -49080 -108581 -125678 21095 185297 279291 193348
18232 193348 39354 248086 360589 376222 287922 240654 117252 148319 244032 111612
18222 111612 86689 -28113 -79475 -85252 -88962 70369 158488 200619 127439 -8347 -66450
18211 -66450 16810 31491 -157790 -171153 -124033 -187609 -133902 -151561 -185090 -108037 -157642
18200 -157642 -202420 -142662 -165197 -183309 -96381 95256 145328 18581 16297 73102 -33460
18189 -33460 -77680 -96077 -88236 -6173 152528 172099 125859 17381 -190584 -401847 -428927
18178 -428927 -321414 -299003 -280637 -245983 -229456 -196971 6319 -18251 30477 34220 29035
18167 29035 116583 152305 114354 90762 176544 96610 13487 116457 203558 74623 -159310
$$ packed form
18243A01173Q730l3490k0330r542r5621n9501j7097J46773J64202R3994q5943
18232A93348j53994K08732J12503J5633q8300m7268j23402L1067R5713j32420
18222A11612k4923j14802n1362n777l710J59331Q8119M2131p3180j35786n8103
18211f6450Q3260J4681j89281j3363M7120o3576N3707j7659l3529P7053m9605
18200a57642m4778N9758k2535j8112Q6928J91637N0072j26747k284N6805j06562
18189c3460m4220j8397P841Q2063J58701J9571m6240j08478k07965k11263k7080
18178d28927J07513K2411J8366L4654J6527L2485K03290k4570M8728L743n185
18167B9035Q7548L5722l7951k3592Q5782p9934q3123J02970Q7101j28935k33933
$$ plain form
18156 -159310 -344341 -414262 -290010 -190027 -254658 -137865 -41300 -11465 -6273 -4575 26377
18145 26377 136922 146304 -23934 -62003 22237 -20613 72125 236339 145724 31831 -72046
18134 -72046 -114404 -250275 -270716 -368306 -459792 -467546 -325794 -185666 16589 140762 116699
18123 116699 -67031 -158501 -572 -34159 11882 250804 374304 257171 -26969 -134179
18113 -134179 -124188 -160184 -238627 -227799 7888 49065 -21512 12622 -237550 -288427 -326786
18102 -326786 -356324 -1210 206878 130670 144875 249831 181565 90252 219635 271410 173566
18091 173566 196151 118206 56607 -46644 19050 67251 209849 237279 285859 276354 -8338
18080 -8338 -344259 -399252 -322377 -144197 -42830 118243 320394 277379 49809 -74397
$$ packed form
18156a59310j85031o9921J24252R9983o4631J16793R6565K9835N192J698L0952
18145B6377J10545R382j70238l8069Q4240m2850R2738J64214r0615j13893j03877
18134g2046m2358j35871k0441r7590r1486p754J41752J40128K02255J24173k4063
18123A16699j83730r1470J57929l3587M6041K38922J23500j17133k84140j07210
18113a34179R991l5996p8443J0828K35687M1177p0577L4134k50172n0877l8359
18102c26786k9538L55114K08088p6208J4205J04956o8266r1313J29383N1775r7844
18091A73566K2585p7945o1599j03251O5694M8201J42598K7430M8580r505k84692
18080h338l35921n4993P6875J78180J01367J61073K02151m3015k27570j24206
$$ plain form
18070 -74397 -70327 -20543 66093 100638 102247 145442 103102 55260 -36168 -111321 9105 91952
18058 91952 66200 4189 -38240 -170972 -53820 153861 398064 346035 181730 73946
18048 73946 72107 -76705 -239657 -160702 29694 -64089 -108010 -94249 -147080 -277787 -121913
18037 -121913 84988 293133 255913 121958 129935 22655 -181219 -210566 124481 200790
18027 200790 178380 247032 295070 157709 137289 185059 -48260 -294973 -292635 -148935 -105247
18016 -105247 -163304 -73064 -59656 -131130 -90124 76982 188686 203235 119087 62848 16721
18005 16721 -77255 -8062 -49481 94672 82189 90131 129016 168735 202638 154322 98348 32106
17993 32106 23964 -145844 -134578 -15408 -11191 -14430 112014 140885 -21057 61198 203130
$$ packed form
18070g4397M070M9784Q6636L4545J609M3195m2340m7842r1428p5153J20426Q2847
18058I1952k5752o2011m2429j32732J17152K07681K44203n2029j64305j07784
18048G3946j839j48812j62952P8955J90396r3783m3921J3761n2831j30707J55874
18037a21913K06901K08145l7220j33955P977j07280k03874k9347L35047P6309
18027B00790k2410O8652M8038j37361k0420M7770k33319k46713K338J43700M3688
18016a05247n8057R0240J3408p1474M1006J67106J11704J4549q4148n6239m6127
18005A6721r3976O9193m1419J44153j2483P942L8885L9719L3903m8316n5974o6242
17993C2106q142j69808J1266J19170M217l239J26444K8871j61942Q2255J41932
$$ plain form
17982 203130 340046 347717 225829 145830 107682 151208 324138 234629 204100 354562 162270
17971 162270 174273 286995 273974 113666 -174603 -342263 -202791 -84082 -133198 -89403
17961 -89403 118584 170578 105412 212627 236693 124961 148353 100052 -165862 -111731 -4554
17950 -4554 56808 133777 76806 133660 275279 284457 162586 -34143 -222556 -158251 -154422
17939 -154422 -195534 -145303 93981 154494 68168 15047 -174928 -137467 72572 61542 -31705
17928 -31705 21898 246126 254906 268978 213485 10494 41981 201397 232489 305635 251046
17917 251046 158020 76383 -31530 3567 79742 288451 346882 252693 41450 -19734 49768
17906 49768 19039 -208008 -271417 -364497 -440470 -468086 -300839 15858 10358 -72699 6054
$$ packed form
17982B03130J36916P671j21888p9999l8148M3526J72930q9509l0529J50462j92292
17971A62270J2003J12722j3021j60308k88269j67660J39472J18709m9116M3795
17961h9403K07987N1994o5166J07215K4066j11732K3392m8301k65914N4131J07177
17950d554O1362P6969n6971N6854J41619R178j21871j96729j88413O4305L829
17939a54422m1112N0231K39284O0513q6326n3121j89975L7461K10039j1030r3247
17928c1705N3603K24228Q780J4072n5493k02991L1487J59416L1092P3146n4589
17917B51046r3026q1637j07913L5097P6175K08709N8431r4189k11243o1184O9502
17906D9768l0729k27047o3409r3080p5973k7616J67247L16697n500q3057P8753
$$ plain form
17895 6054 -70480 -69071 -108706 -161078 -96981 -192983 -252486 -213133 -136265 1293 998 85847
17883 85847 150047 9403 -87599 -30659 -93989 -182636 -130160 -135310 -164519 -16458 48892
17872 48892 90052 167201 170140 124511 57475 -7534 -127230 -167521 -75655 183119 362587
17861 362587 233163 172013 244003 106322 59322 76743 84846 176395 141446 377546 543645
17850 543645 419115 223794 81600 148487 233182 264558 158927 251942 262876 114655
17840 114655 10585 -96665 -50593 97591 55107 45303 53177 60995 53423 69449 88020 -15807
17828 -15807 -130780 -228852 -326970 -328789 -338476 -366741 -337169 -181464 63104 57789 49347 80496
17816 80496 94383 47023 -120713 -260386 -142274 68747 211586 321302 365838 225254
$$ packed form
17895F054p6534J409l9635n2372O4097r6002n9503L9353P6868J37558k95Q4849
17883H5847O4200j40644r7002N6940o3330q8647N2476n150k9209J48061O5350
17872D8892M1160P7149K939m5629o7036o5009j19696m0291R1866K58774J79468
17861C62587j29424o1150P1990j37681m7000J7421Q103R1549l4949K36100J66099
17850E43645j24530j95321j42194O6887Q4695L1376j05631R3015J0934j48221
17840A14655j04070j07250M6072J48184m2484r804P874P818p572J6026J8571j03827
17828a5807j14973r8072r8118j819r687k8265K9572J55705K44568n315q442L1149
17816H0496J3887m7360j67736j39673J18112K11021J42839J09716M4536j40584
$$ plain form
17806 225254 50783 -202398 -304393 -214406 -214271 -311943 -155031 32720 35373 145310 389104
17795 389104 359835 341365 303908 281132 206443 2096 -51692 -16544 176159 90932 -6450
17784 -6450 -322062 -377552 -179163 -162330 -268781 -320030 -96893 134411 330980 112365
17774 112365 44134 -35876 -165321 -161837 -29647 238321 257660 207568 218789 207695 72693
17763 72693 94981 81076 33869 81409 260169 343470 165784 103149 -310 -42106 -177821
17752 -177821 -167467 -80209 159227 264588 102942 -71165 -218129 -233350 -137327 -70746
17742 -70746 -20689 -74847 -155651 -120434 -241775 -217488 -295114 -421332 -310544 -178526 -199591
17731 -199591 -263976 -156962 -428997 -426416 -232673 -170993 -76627 -45572 84181 188949 126585
$$ packed form
17806B25254j74471k53181j01995Q9987J35r7672J56912J87751K653J09937K43794
17795C89104k9269j8470l7457k2776p4689k04347n3788L5148J92703q5227r7382
17784f450l15612n5490J98389J6833j06451n1249K23137K31304J96569k18615
17774A12365o8231q0010j29445L484J32190K67968J9339n0092J1221j1094j35002
17763G2693K2288j3905m7207M7540J78760Q3301j77686o2635j03459m1796j35715
17752a77821J0354Q7258K39436J05361j61646j74107j46964j5221R6023O6581
17742g0746N0057n4158q0804L5217j21341K4287p7626j26218J10788J32018k1065
17731a99591o4385J07014k72035K581J93743O1680R4366L1055J29753J04768o2364
$$ plain form
17720 126585 -79492 -118583 -189370 4084 107436 69773 110745 247889 261595 168483 72639
17709 72639 -15622 -202709 -177823 -245643 -300337 -168752 80239 116086 -4471 48228 -91258
17698 -91258 -182098 -186042 -116795 -197545 -278989 -106536 49773 -9935 -49549 -67909 -51938
17687 -51938 42123 -77106 -281851 -243439 -6345 61867 32261 -172757 -136311 -289308 -250060
17676 -250060 -53015 52803 39364 91839 -24190 -61854 -136683 -146347 -46987 79072 204498
17665 204498 260401 287411 124549 -121356 -168341 -78132 -264469 -386192 -553626 -480273
17655 -480273 -215909 -201131 -241116 -234466 2168 309785 333252 218615 260853 91207 -35289
17644 -35289 115604 157947 26120 -18351 -147443 -216188 -232786 -117371 80194 50826 -51033
$$ packed form
17720A26585k06077l9091p0787J93454J03352l7663M0972J37144J3706r3112r5844
17709G2639q8261j87087K4886o7820n4694J31585K48991L5847j20557N2699j39486
17698i1258r0840l944O9247q0750q1444J72453J56309n9708l9614j8360J5971
17687e1938R4061j19229k04745L8412K37094O8212k9606k05018L6446j52997L9248
17676b50060J97045J05818j3439N2475j16029l7664p4829r664R9360J26059J25426
17665B04498N5903K7010j62862k45905m6985R0209j86337j21723j67434P3353
17655d80273K64364J4778l9985O650K36634L07617K3467j14637M2238j69646j26496
17644c5289J50893M2343j31827m4471j29092o8745j6598J15415J97565k9368j01859
$$ plain form
17633 -51033 -143572 -27905 86370 101198 22829 35733 16449 -63518 -98482 -145757 -310338
17622 -310338 -140102 24556 92131 -31256 -208564 -282907 -237127 -195254 -81362 52947
17612 52947 12054 -78440 -240847 -364158 -367834 -190398 -293902 -337641 -137678 -37476 -91412
17601 -91412 -81958 100472 97460 -127567 -80140 -82467 -203495 -234690 -218827 -352601 -268604
17590 -268604 -281157 -430262 -303082 -247943 -153516 5594 113732 127145 30903 1685 21097
17579 21097 6619 85348 87797 -91135 -247910 -133476 -6385 182048 213615 276135 203170
17568 203170 209665 302943 376153 397518 506903 385874 281153 315233 105722 37657 -43812
17557 -43812 -128727 75539 184045 103480 256109 256366 180215 131710 70810 135717 119098
$$ packed form
17633e1033r2539J15667J14275J4828p8369J2904j9284p9967l4964m7275j64581
17622c10338J70236J64658O7575j23387j77308p4343M5780M1873J13892J34309
17612E2947m0893r0494j62407j23311l676J77436j03504m3739J99963J00202n3936
17601i1412R454J82430l012k25027M7427k327j21028l1195J5863j33774Q3997
17590b68604j2553j49105J27180N5139R4427J59110J08138J3413r6242k9218J9412
17579B1097j4478P8729K449j78932j56775J14434J27091J88433L1567O2520p2965
17568B03170O495R3278P3210K1365J09385j21029j04721L4080k09511o8065q1469
17557d3812q4915K04266J08506q0565J52629K57p6151m8505o0900O4907j6619
$$ plain form
17546 119098 -118139 -62983 133042 143469 200397 198461 23490 -82381 -80169 81267 262790
17535 262790 89588 -108548 -184937 -67170 95009 289746 456413 220426 77387 148927
17525 148927 182179 21861 -100628 -236869 -346888 -230235 -48845 -49038 65986 253565
17515 253565 301400 148664 209961 395256 337764 311105 354532 456794 690440 708458 358692
17504 358692 202330 167885 272003 514481 650523 496139 414927 234148 37384 -125446
17494 -125446 -192151 -60355 16897 128724 40154 -50996 -113376 -62630 81281 -11444 -256838
17483 -256838 -217338 -156518 -67715 -81259 -205046 -300643 -140729 -33792 10596 21487 103256
17472 103256 65765 -121541 -65813 -73454 -224614 -298920 -243439 -255608 -243088 -117978 88232
$$ packed form
17546A19098k37237N5156J96025J0427N6928j936j74971j05871K212J61436J81523
17535B62790j73202j98136p6389J17767J62179J94737J66667k35987j43039P1540
17525A48927L3252j60318j22489j36241j10019J16653J81390j93J15024J87579
17515B53565M7835j52736O1297J85295n7492k6659M3427J02262K33646J8018l49766
17504C58692j56362l4445J04118K42478J36042j54384q1212j80779j96764j62830
17494a25446o6705J31796P7252J11827q8570r1150o2380N0746J43911r2725k45394
17483b56838L9500O0820Q8803j3544j23787r5597J59914J06937M4388J0891Q1769
17472A03256l7491j87306N5728p641j51160p4306N5481j2169J2520J25110K06210
$$ plain form
17461 88232 90680 111111 161216 161394 33666 -78090 22419 191039 50193 -50745 -126273
17450 -126273 121888 369782 330403 350796 386465 156049 -20119 -79155 -35111 5558 74432
17439 74432 -24246 -163418 -148723 -181433 -295025 -354570 -184173 -7195 18427 82194 80632
17428 80632 124339 300502 368611 240746 48256 92956 -22820 -13083 79916 -8716 -108228
17417 -108228 -98501 2281 142453 115385 -42120 -70979 -24871 91549 162510 130997 112810
17406 112810 19295 -27196 -144607 -328445 -155345 150064 195121 206528 221667 158696 71400
17395 71400 65967 139471 176468 77716 -29472 -36503 -7354 -32632 -38023 -128545 -91841 74112
17383 74112 156809 245301 290005 150050 7967 -36400 3067 110389 27437 47193 143864
$$ packed form
17461H8232K448K0431N0105J78j27728j11756J00509J68620j40846j00938p5528
17450a26273K48161K47894l9379K0393L5669k30416j76168n9036M4044M0669O8874
17439G4432r8678j39172J4695l2710j13592n9545J70397J76978K5622O3767j562
17428H0632M3707J76163O8109j27865j92490M4700j15776R737R2999q8632r9512
17417a08228R727J00782J40172k7068j57505k8859M6108J16420P0961l1513j8187
17406A12810r3515m6491j17411j83838J73100L05409M5057J1407J5139o2971q7296
17395G1400n433P3504L6997r8752j07188p031K9149k5278n391r0522L6704J65953
17383G4112Q2697Q8492M4704j39955j42083m4367L9467J07322q2952J9756R6671
$$ plain form
17372 143864 269347 393622 311153 271121 381028 320219 102292 69722 222752 545528
17362 545528 543839 172978 -197287 -30547 163280 -159208 -326768 -67079 28088 -82245
17352 -82245 -110896 31209 192103 168064 71066 42056 -85776 -210036 -296768 -296911 -160877
17341 -160877 -81181 48337 150689 102790 -26471 -17692 -5422 63636 1577 24304 192562
17330 192562 204050 82968 -53202 -131293 -77826 -5005 -37166 60164 346809 432812 116442
17319 116442 -82844 -45695 44981 -43528 196874 317928 282887 54221 -42254 87975
17309 87975 206057 242270 -27443 36752 226345 272834 244284 190582 -104614 -248719 -20549
17298 -20549 -25015 -86761 75575 154167 121370 194283 224980 -80472 -180429 -115429 -20667
$$ packed form
17372A43864J25483J24275q2469m0032J09907o0809k17927l2570J53030L22776
17362E45528j689l70861l70265J66740J93827l22488j67560K59689R5167j10333
17352h2245k8651J42105J60894k4039r6998k9010j27832j24260q6732j43J36034
17341a60877P9696J29518J02352m7899j29261Q779J2270O9058o2059K2727J68258
17330A92562J1488j21082j36170p8091N3467P2821l2161R7330K86645Q6003l16370
17319A16442j99286L7149R0676q8509K40402J21054l5041k28666r6475J30229
17309H7975J18082L6213k69713O4195J89593M6489k8550n3702k95196j44105K28170
17298b0549m466o1746J62336P8592l2797P2913L0697l05452r9957O5000R4762
$$ plain form
17287 -20667 -20661 4957 -55093 -163704 -117229 21668 -26832 -185073 -147181 -47394 -136892 25690
17275 25690 340633 660903 644561 625888 503730 250023 -27363 -229916 -268045 -114001
17265 -114001 -23902 99571 36258 59236 222992 257238 243966 100869 -11099 -61504 -188178
17254 -188178 -70969 -124541 -386442 -371738 -212709 -160014 -186472 -202574 -98487 -46625 -182503
17243 -182503 -130412 -46450 -22264 58325 -133214 -209557 -70120 -14740 -10922 -79090 -237604
17232 -237604 -132822 33019 7402 -157544 -92844 107274 123382 -4449 -3417 52722 118554
17221 118554 -13702 -163735 -44594 89611 28329 -83970 -11854 104346 117858 99651
17211 99651 177729 110533 -29248 -153718 -137709 -78590 -52526 -57242 11105 89102 167654
$$ packed form
17287b0667OK5618o0050j08611M6475J38897m8500j58241L7892R9787q9498J62582
17275B5690L14943L20270j6342j8673j22158k53707k77386k02553l8129J54044
17265a14001R0099J23473o3313K2978J63756L4246j3272j43097j11968n0405j26674
17254a88178J17209n3572k61901J4704J59029N2695k6458j6102J04087N1862j35878
17243a82503N2091Q3962K4186Q0589j91539p6343J39437N5380L818o8168j58514
17232b37604J04782J65841k5617j64946O4700K00118J6108j27831J032N6139O5832
17221A18554j32256j50033J19141J34205o1282j12299P2116J16200J3512j8207
17211I9651P8078o7196j39781j24470J6009N9119K6064m716O8347P7997P8552
$$ plain form
17200 167654 191635 204996 174073 114726 99308 150568 226173 82771 91047 117497 12698
17189 12698 19816 13355 -160592 -155852 -190962 -301799 -293339 -176867 106775 159574 206992 264884
17177 264884 62716 -131592 -120727 40296 185118 139228 197715 40415 -40085 -65080
17167 -65080 123556 166661 44146 -149136 -251841 -378565 -398521 -145184 40680 -53157
17157 -53157 -83195 -46536 82659 -149828 -202366 -129069 -135551 -64724 75478 142853 121441
17146 121441 -63339 -70488 8936 151047 257695 90686 -153551 -100640 122748 82722
17136 82722 162134 275818 113899 197541 181109 146427 94469 -30924 114097 120461 -49447
17125 -49447 -135494 -183283 -84432 -4666 -81217 -53910 -34998 -256792 -326995 -423859 -359547
$$ packed form
17200A67654K3981J3361l0923n9347j5418N1260P5605j43402Q276K6450j04799
17189A2698P118o461j73947M740l5110j10837Q460J16472K83642N2799M7418N7892
17177B64884k02168j94308J0865J61023J44822m5890N8487j57300q0500k4995
17167f5080J88636M3105j22515j93282j02705j26724j9956K53337J85864r3837
17157e3157l0038L6659J29195k32487n2538P3297o482P0827J40202O7375k1412
17146A21441j84780p149P9424J42111J06648j67009k44237N2911K23388m0026
17136H2722P9412J13684j61919Q3642j6432l4682n1958j25393J45021O364j69908
17125d9447q6047m7789R8851P9766p6551K7307J8912k21794p0203r6864O4312
$$ plain form
17114 -359547 -285063 -393091 -552798 -313113 -164046 -219022 -2293 38753 184935 224848
17104 224848 137037 -132575 -201503 13848 178931 85514 -39510 -113609 40989 294912
17094 294912 319964 283112 248819 -18272 -47572 65509 262535 277621 119511 2078
17084 2078 55599 317834 370090 100190 -186412 -321466 -32185 -36816 -67719 -6430 -77316
17073 -77316 -27619 -79209 -132564 903 170133 52919 18462 46993 34489 -147106 -304214
17062 -304214 -258594 -274177 -342782 -214263 20780 158604 102297 12691 3124 -180325 -345959
17051 -345959 -249152 -228309 -120538 -46026 -18838 134431 215695 121092 -24077 7278 -73524
17040 -73524 -47084 256415 170302 162688 254067 173743 -5145 19777 38156 79138 185343
$$ packed form
17114c59547P4484j08028j59707K39685J49067n4976K16729M1046J46182L9913
17104B24848q7811k69612o8928K15351J65083r3417j25024p4099J54598K53923
17094B94912K5052l6852l4293k67091k9300J13081J97026J5086j58110j17433
17084B078N3521K62235N2256k69900k86602j35054K89281m631l0903O1289p0886
17073g7316M9697n1590n3355J33467J69230j17214l4457K8531j2504j81595j57108
17062c04214M5620j5583o8605J28519K35043J37824n6307q9606r567j83449j65634
17051c45959R6807K0843J07771P4512K7188J53269Q1264r4603j45169L1355q0802
17040g3524K6440L03499q6113p614R1379q0324j78888K4922J8379M0982J06205
$$ plain form
17029 185343 280031 157443 -78821 -260765 -300511 -207842 -63626 92150 36686 93599
17019 93599 134317 -23279 -335660 -353727 -407008 -115147 259750 333835 210759 203753 227364
17008 227364 256517 153988 38715 17529 189685 163346 147863 279133 251481 128837
16998 128837 88191 99126 120479 -3060 -83789 -166746 -82871 230877 277771 71264 -53987
16987 -53987 -58091 -182756 -171947 -94121 -100687 -122185 -124647 -174706 -152069 28293 95091 32044
16975 32044 -15964 -37641 25080 -70007 -62650 -113144 -166337 -143048 -62429 -243635 -315755 -309712
16963 -309712 -252871 -59650 -55373 -46635 105905 127217 -163712 -258829 -147152 -63383 -12194
16952 -12194 62139 235402 266040 209804 150245 -36618 3412 55381 -56088 -285243 -333623
$$ packed form
17029A85343R4688j22588k36264j81944l9746R2669J44216J55776n5464N6913
17019I3599M0718j57596l12381j8067n3281K91861L74897P4085j23076p006K3611
17008B27364K9153j02529j15273k1186J72156k6339j5483J31270k7652j22644
16998A28837m0646J0935K1353j23539q0729q2957Q3875L13748M6894k06507j25251
16987e3987m104j24665J0809P7826o566k1498k462n0059K2637J80362O6798o3047
16975C2044m8008k1677O2721r5087P357n0494n3193K3289Q0619j81206p2120O043
16963c09712N6841J93221M277Q738J52540K1312k90929r5117J11677Q3769N1189
16952a2194P4333J73263L0638n6236n9559j86863M0030N1969j11469k29155m8380
$$ plain form
16941 -333623 -373213 -487130 -375366 -306913 -263416 -99054 -26704 -139725 -190694 -337216
16931 -337216 -347511 -286299 -185357 -62151 -177158 -254497 -161863 151745 359188 265417
16921 265417 103740 133598 81386 184579 255631 242453 269147 301912 340187 188992 157383
16910 157383 68725 122028 254644 211420 119538 49467 -43262 -124572 -190631 -102682 -41927
16899 -41927 -263067 -243398 -26579 77698 62724 -24553 -61830 -202814 -48150 165958
16889 165958 192121 249326 143012 59472 -78218 27556 57531 -150156 -112010 134985
16879 134985 109456 -74460 -267680 -298057 -309460 -184486 -178942 -144297 -170504 -168777 10328
16868 10328 68048 143940 36607 81284 122077 96131 121251 206075 406833 514287 284874
$$ packed form
16941c33623l9590j13917J11764O8453M3497J64362P2350j13021n0969j46522
16931c37216j0295O1212J00942J23206j15007p7339R2634L13608K07443r3771
16921B65417j61677K9858n2212J03193P1052j3178K6694L2765L8275j51195l1609
16910A57383q8658N3303J32616m3224r1882p0071r2729q1310o6059Q7949O0755
16899d1927k21140J9669K16819J04277j4974q7277l7277j40984J54664K14108
16889A65958K6163N7205j06314q3540j37690J05774K9975k07687L8146K46995
16879A34985k5529j83916j93220l0377j1403J24974N544L4645k6207J727J79105
16868A0328N7720P5892j07333M4677M0793k5946K5120Q4824K00758J07454k29413
$$ plain form
16857 284874 129465 -15013 43341 47626 -47719 -50258 -44637 -130244 -17219 -45277 -215212
16846 -215212 -220589 -70511 -53301 -77771 -115000 71301 203944 -6991 -19369 81069 139758
16835 139758 128421 265414 330528 272477 180904 212855 100788 25413 -18427 -184785 -298493
16824 -298493 -200645 -58343 47038 50780 -89964 -122064 -49345 -61470 -121457 -228052 -173359
16813 -173359 -88643 19159 208418 249132 139685 -218562 -255190 11014 52738 37521
16803 37521 83255 236698 64159 65701 226168 368054 295315 82629 107280 140198 -72774
16792 -72774 -14593 181380 16840 -84664 -139411 -156496 -209973 -213182 -274026 -240479 -24064
16781 -24064 311372 405461 253942 54367 -1095 8396 -96517 -199095 -56342 -93170 -256273
$$ packed form
16857B84874j55409j44478N8354M285r5345k539N621q5607J13025k8058j69935
16846b15212n377J50078J7210k4470l7229J86301J32643k10935j2378J00438N8689
16835A39758j1337J36993O5114n8051r1573L1951j12067p5375m3840j66358j13708
16824b98493R7848J42302J05381L742j40744l2100P2719j2125n9987j06595N4693
16813a73359Q4716J07802J89259M0714j09447l58247l6628K66204M1724j5217
16803C7521M5734J53443j72539J542J60467J41886p2739k12686K4651L2918k12972
16792g2774N8181J95973j64540j01504n4747j7085n3477l209o0844L3547K16415
16781b4064L35436R4089j51519j99575n5462R491j04913j02578J42753l6828j63103
$$ plain form
16770 -256273 -311231 -375085 -190269 -34284 221111 266331 207008 182997 243894 219246 -58348
16759 -58348 -131135 50404 138966 4432 -39842 -198469 -247614 -49783 122423 240264
16749 240264 360709 193497 109706 221569 187182 -17415 -103739 85712 294150 259731
16739 259731 120090 -8569 -46428 84235 191011 216611 144154 129905 -38965 -105296
16729 -105296 86084 244120 78467 -42016 120658 277260 179346 48858 -156051 -239177
16719 -239177 -167386 -78091 -82923 -69216 -60452 -67342 -97634 -5547 108139 229572 239592 31024
16707 31024 -113388 -45572 104690 207046 166473 193958 197622 296380 370089 244345 258646
16696 258646 275805 164539 -13118 -88030 29906 -13767 -19364 190329 262096 60229 -113352
$$ packed form
16770b56273n4958o3854J84816J55985K55395M5220n9323k4011O0897k4648k77594
16759e8348p2787J81539Q8562j34534m4274j58627m9145J97831J72206J17841
16749B40264J20445j67212q3791J11863l4387k04597q6324J89451K08438l4419
16739B59731j39641j28659l7859J30663J06776K5600p2457j4249j68870o6331
16729a05296J91380J58036j65653j20483J62674J56602r7914j30488k04909q3126
16719b39177P1791Q9295m832J3707Q764o890l0292R2087J13686J21433J0020k08568
16707C1024j44412O7816J50262J02356m0573K7485L664R8758P3709j25744J4301
16696B58646J7159j11266j77657p4912J17936m3673n597K09693P1767k01867j73581
$$ plain form
16685 -113352 -166554 -57059 -54722 -132059 -175007 -172702 -137694 -23989 282721 337126 216996
16674 216996 32953 -39013 -75168 118458 280974 195202 75471 4845 130624 158904
16664 158904 87734 113828 94614 -38087 -71035 46086 8252 -123686 -225700 -140185 -201356
16653 -201356 -242353 -226391 -114296 -92580 -198930 -140667 -60373 -155193 -189249 -92818 9301
16642 9301 106165 52361 72159 99331 140098 205430 245995 73073 -238573 -386375 -297484
16631 -297484 -93052 62185 75856 80038 261547 177548 141040 56469 -121658 -109536 59202
16620 59202 362969 420332 263067 286399 487280 613916 505143 504580 477042 450749 262986
16609 262986 250485 327808 444636 415349 306733 125053 -3790 -175949 -287193 -439832
$$ packed form
16685a13352n3202J09495K337p7337m2948K305L5008J13705L06710N4405j20130
16674B16996j84043p1966l6155J93626J62516q5772j19731p0626J25779K8280
16664A58904p1170K6094j9214j32701l2948J17121l7834j31938j02014Q5515o1171
16653b01356m0997J5962J12095K1716j06350N8263Q0294r4820l4056R6431J02119
16642I301R6864n3804J9798K7172M0767O5332M0565j72922l11646j47802Q8891
16631b97484K04432J55237J3671M182J81509q3999l6508q4571j78127J2122J68738
16620E9202L03767N7363j57265K3332K00881J26636j08773n63k7538k6293j87763
16609B62986j2501P7323J16828k9287j08616j81680j28843j72159j11244j52639
$$ plain form
16599 -439832 -313314 169955 328551 216703 102995 -46895 -87058 -82328 -35047 -32052 -140074
16588 -140074 -387919 -471344 -363264 -256672 -98850 73189 158784 97531 -214266 -220752
16578 -220752 -151902 -214259 -151346 25738 173406 37356 -157213 -203750 -170384 -207387 -104202
16567 -104202 -31580 150688 -17007 -287300 -276931 -84755 20558 69911 144763 31358
16557 31358 -148645 -72501 118921 66269 133986 273622 120622 44705 134258 130460 243888
16546 243888 348415 168697 231715 314325 367527 298330 137722 134821 -1183 -89049 71512
16535 71512 -43071 41148 143733 172836 217180 194540 137807 197207 120402 -9058 -53921
16524 -53921 -72187 30422 73612 -52868 -85078 19349 42151 3768 -28407 -194944 -294286
$$ packed form
16599d39832J26518M83269J58596j11848j13708j49890m0163M730M7281K995j08022
16588a40074k47845q3425J08080J06592J57822J72039Q5595o1253l11797o486
16578b20752O8850o2357O2913J77084J47668j36050j94569m6537L3366l7003J03185
16567a04202P2622J82268j67695k70293J0369J92176J05313M9353P4852j13405
16557C1358j80003P6144J91422n2652O7717J39636j53000p5917Q9553l798J13428
16546B43888J04527j79718O3018Q2610N3202o9197j60608k901j36004q7866J60561
16535G1512j14583Q4219J02585K9103M4344k2640n6733N9400p6805j29460m4863
16524e3921j8266J02609M3190j26480l2210J04427K2802l8383l2175j66537r9342
$$ plain form
16513 -294286 -300150 -151885 -38060 -36319 -50435 -128925 -184886 -78149 -8340 7404 8115 -68871
16501 -68871 -293544 -536142 -541649 -389705 -104666 1838 41574 78744 24554 16428 -2732
16490 -2732 25936 93623 218833 272712 128574 -83903 -79753 48134 192383 71068 -4636
16479 -4636 -35784 -149487 -54557 150843 269423 343856 244611 200567 212493 119687 18835
16468 18835 12756 -64360 -94072 -68197 103153 267892 143642 -132840 -312722 -198663 -62944
16457 -62944 7702 -5281 -51349 70993 235783 196993 3412 20927 -109290 -49180 -6916
16446 -6916 -60961 -143367 -244722 -271674 -264759 -118551 -66098 -1299 -52757 -269028 -150379
16435 -150379 47763 -64550 -187527 -277011 -426429 -245133 33943 101714 -82599 -271229
$$ packed form
16513b94286n864J48265J13825J741j4116p8490n5961J06737O9809J5744P11p6986
16501f8871k24673k42598n507J51944K85039J06504L9736L7170n4190q126j9160
16490b732K8668O7687J25210N3879j44138k12477M150J27887J44249j21315p5704
16479d636l1148j13703R4930K05400J18580P4433r9245m4044J1926r2806j00852
16468A8835o079p7116k9712K5875J71350J64739j24250k76482j79882J14059J35719
16457f2944P0646j2983m6068J22342J64790l8790j93581J7515j30217O0110M2264
16446f916n4045q2406j01355k6952O915J46208N2453O4799n1458k16271J18649
16435a50379J98142j12313j22977q9484j49418J81296K79076O7771j84313j88630
$$ plain form
16425 -271229 -316759 -260127 -408815 -323563 -12251 197564 193125 261792 304653 219553 23101
16414 23101 -142641 -141304 -42562 97037 43189 -141393 -208260 -93167 87825 167198 169507
16403 169507 160385 187976 221583 105315 66541 82364 194448 82619 38716 41893 -76443
16392 -76443 -199933 -213606 -125895 4492 90283 152203 147244 55198 96096 -18228 -77568
16381 -77568 34623 33979 155677 318057 425084 320675 276181 264199 134291 128060 224894
16370 224894 213087 -43889 -188938 -112787 94123 365617 518007 407147 149000 40732
16360 40732 4177 53732 26514 -104293 -235645 -166157 -264966 -120554 35154 28489 12065
16349 12065 -163480 -347920 -333767 19338 212850 177724 217698 232315 237891 249787 80706
$$ packed form
16425b71229m5530N6632j48688Q5252L11312K09815m439O8667M2861q5100j96452
16414B3101j65742J337R8742J39599n3848j84582o6867J15093J80992P9373K309
16403A69507r122K7591L3607j16268l8774J5823J12084j11829m3903L177j18336
16392g6443j23490j3673Q7711J30387Q5791O1920m959r2046M0898j14324n9340
16381g7568J12191o44J21698J62380J07027j04409m4494j1982j29908o231R6834
16370B24894j1807k56976j45049P6151K06910K71494J52390j10860k58147j08268
16360D0732l6555M9555k7218j30807j31352O9488r8809J44412J55708o665j6424
16349A2065j75545j84440J4153L53105J93512l5126L9974J4617N576J1896j69081
$$ plain form
16338 80706 -1481 103503 256376 322467 276094 99036 38116 118955 155114 225642 376800
16327 376800 281224 148023 236893 204563 205457 160034 185223 270770 236954 111844 -119413
16316 -119413 -291328 -310561 -221720 -71685 71100 129600 127962 -25982 -135042 -257736
16306 -257736 -368091 -458445 -451492 -374781 -284887 -300842 -281833 -229096 -295294 -361605 -343957
16295 -343957 -264800 -203862 -118756 -56381 -120927 -134182 -99825 -185433 -221524 -202274 -206738 -114548
16283 -114548 -61790 -72623 -47706 42601 129526 298514 314964 164373 52307 190909 367422
16272 367422 395469 260638 -47618 -182177 -252944 -114416 -136165 -176152 -249296 -176093 -147269
16261 -147269 -122073 14531 -32047 64462 1243 -17707 41259 -65407 -243803 -213359 -105859
$$ packed form
16338H0706q2187J04984J52873O6091m6373j77058o0920Q0839L6159P0528J51158
16327C76800r5576j33201Q8870l2330Q94m5423K5189Q5547l3816j25110k31257
16316a19413j71915j9233Q8841J50035J42785N8500j638j53944j09060j22694
16306b57736j10355r0354O953P6711Q9894j5955J9009N2737o6198o6311J7648
16295c43957P9157O0938Q5106O2375o4546j3255L4357q5608l6091J9250m464R2190
16283a14548N2758j0833K4917R0307Q6925J68988J6450j50591j12066J38602J76513
16272C67422K8047j34831l08256j34559p0767J38528k1749l9987p3144P3203K8824
16261a47269K5196J36604m6578R6509o3219j8950N8966j06666j78396L0444J07500
$$ plain form
16250 -105859 -66730 -31475 37599 -85093 -47986 -91347 9457 193607 94694 -33509 -32636
16239 -32636 -62700 94930 129724 -29135 -87388 -71123 -74957 -43478 31720 -4223 -61970
16228 -61970 -179250 -250649 -304962 -231242 -193551 -105486 111887 183917 83290 -118484 -86731
16217 -86731 82003 200321 148287 122865 164902 162004 39280 -70709 -246055 -162134 -19921
16206 -19921 97874 107363 -116915 -5517 -40358 26842 117890 148522 6303 -16563 48241
16195 48241 75457 82819 61831 -54637 72932 -32320 -66100 -31427 -91268 -61443 123850
16184 123850 150516 402077 414961 58658 -263118 -305170 -159629 16373 -132590 -201678
16174 -201678 -119558 -180835 -230941 -11835 206357 384677 387354 301148 239740 269479 237994
$$ packed form
16250a05859L9129L5255O9074j22692L7107m3361J00804J84150r8913j28203Q73
16239c2636l0064J57630L4794j58859n8253J6265l834L1479P5198l5943n7747
16228f1970j17280p1399n4313P3720L7691Q8065K17373P2030j00627k01774L1753
16217h6731J68734J18318n2034k5422M2037k898j22724j09989j75346Q3921J42213
16206a9921J17795R489k24278J11398l4841O7200R1048L0632j42219k2866O4804
16195D8241K7216P362k0988j16468J27569j05252l3780L4673n9841K9825J85293
16184A23850K6666K51561J2884l56303l21776m2052J45541J76002j48963o9088
16174b01678Q2120o1277n0106K19106K18192J78320K677q6206o1408K9739l1485
$$ plain form
16163 237994 -6686 -244120 -81413 117482 264169 220005 109452 5590 3384 130481
16153 130481 197917 66554 -27351 100273 210667 122424 2325 -4097 -46427 100148 191120
16142 191120 186579 26509 -234316 -149551 -179603 -424796 -508939 -365050 -310498 -136064 -44798
16131 -44798 -25173 -123802 -122238 -45535 33988 -30465 -95779 -100411 35290 158725 224044 61287
16119 61287 77122 195449 394236 431727 412509 163957 -43959 85046 292381 319078
16109 319078 226025 218374 84875 7498 27565 40604 210303 303846 223563 142334 74040
16098 74040 157062 332844 233964 90164 79978 59356 72003 169848 302704 349821 271241
16087 271241 139263 52951 -106317 -90946 -132874 -273392 -195528 36799 254666 372021
$$ packed form
16163B37994k44680k37434J62707J98895J46687m4164j10553j03862k206J27097
16153A30481O7436j31363r3905J27624J10394q8243j20099o422m2330J46575R0972
16142A91120m541j60070k60825Q4765l0052k45193q4143J43889N4552J74434R1266
16131d4798J9625r8629J564P6703P9523o4453o5314m632J35701J23435O5319j62757
16119F1287J5835J18327J98787L7491j9218k48552k07916J29005K07335K6697
16109C19078r3053p651j33499p7377K0067J3039J69699R3543q0283q1229o8294
16098G4040Q3022J75782r8880j43800j0186k0622J2647R7845J32856M7117p8580
16087B71241j31978q6312j59268J5371m1928j40518P7864K32327K17867J17355
$$ plain form
16077 372021 475601 337309 77851 -58517 -76822 -178138 -3691 89584 313522 288696
16067 288696 108733 -181725 -344043 -253653 -362448 -292657 -113233 -174656 -217158 37812
16057 37812 106533 148432 198668 92280 5485 215480 320079 285059 209004 46033 -130946
16046 -130946 -182104 -63819 -135298 -188885 -141260 6535 167071 200464 258469 301945 205428
16035 205428 151833 208360 123044 69366 177553 87063 -184933 -420652 -207707 -2436
16025 -2436 38633 -182284 -336713 -336323 -253401 -26164 76793 -104337 -223911 -43682 37855
16014 37855 -59596 -261850 -338128 -408869 -483219 -276443 -131572 56316 121695 -25088 -11540
16003 -11540 112606 -79300 -178484 -9064 144024 101031 -103792 -283329 -519706 -502198
$$ packed form
16077C72021J03580j38292k59458j36368j8305j01316J74447R3275K23938k4826
16067B88696j79963k90458j62318R0390j08795O9791J79424o1423m2502K54970
16057C7812O8721M1899N0236j06388q6795K09995J04599l5020p6055j62971j76979
16046a30946n1158J18285p1479n3587M7625J47795J60536L3393N8005M3476r6517
16035B05428n3595N6527q5316n3678J08187r0490k71996k35719K12945K05271
16025b436M1069k20917j54429L90Q2922K27237J02957j81130j19574J80229Q1537
16014C7855r7451k02254p6278p0741p4350K06776J44871J87888O5379j46783J3548
16003a1540J24146j91906r9184J69420J53088m2993k04823j79537k36377J7508
$$ plain form
15993 -502198 -361776 -255624 -93129 115972 35808 -19955 13396 -14901 -169154 -69534
15983 -69534 130290 63022 59230 54595 160187 119626 72745 51578 81193 245935 399925
15972 399925 370770 253110 128606 6826 -194341 -68792 92333 9873 111533 189643
15962 189643 200855 103231 18030 -74183 -167206 -219355 -300384 -156647 -51495 -21820 -93805
15951 -93805 -95788 -10817 -121016 -51783 254690 383046 278129 223008 241969 275321 267650
15940 267650 347465 340616 283962 155753 88612 11064 -109108 -64388 -18444 102947 216112
15929 216112 133849 -79043 -124717 -150520 -229782 -213629 40485 17163 -13198 -69936 -30760
15918 -30760 70113 179548 295229 338967 471793 384404 260941 339715 359478 252734
$$ packed form
15993e02198J40422J06152J62495K09101q0164n5763L3351k8297j54253R9620
15983f9534J99824o7268l792m635J05592m0561m6881k1167K9615J64742J53990
15972C99925k9155j17660j24504j21780k01167J25549J61125q2460J01660P8110
15962A89643J1212r7624q5201r2213r3023n2149q1029J43737J05152K9675p1985
15951i3805j983Q4971j10199O9233L06473J28356j04917n5121J8961L3352p671
15940B67650P9815o849n6654j28209o7141p7548j20172M4720M5944J21391J13165
15929B16112q2263k12892m5674k5803p9262J6153K54114k3322l0361n6738L9176
15918c0760J00873J09435J15681M3738J32826q7389j23463P8774J9763j06744
$$ plain form
15908 252734 295147 314934 134767 66769 109192 79145 -57893 -166026 -28934 124329
15898 124329 188212 152207 43569 -65431 80219 302701 251094 210144 330968 234589
15888 234589 99928 12643 -101103 -128239 -17643 137900 134915 75589 136415 89796 123111
15877 123111 305822 383731 411406 485913 424231 108323 -45002 96793 211601 133049
15867 133049 54182 86947 324082 407197 299687 239641 289476 82679 -35850 119393
15857 119393 259070 174779 225021 398096 451407 332384 235921 178253 50661 35834 53982
15846 53982 97115 91515 4646 9549 78310 18729 149418 227812 150115 -42036 -42011 51513
15834 51513 192139 341047 193952 12452 -119140 171232 244585 -28167 -195524 -161470
$$ packed form
15908B52734M2413J9787j80167o7998M2423l0047j37038j08133J37092J53263
15898A24329O3883l6005j08638j09000J45650K22482n1607m0950J20824r6379
15888B34589j34661q7285j13746k7136J10596J55543k985n9326O0826m6619L3315
15877A23111J82711P7909K7675P4507o1682l15908j53325J41795J14808p8552
15867A33049p8867L2765K37135Q3115j07510o0046M9835k06797j18529J55243
15857A19393J39677q4291N0242J73075N3311j19023r6463n7668j27592j4827J8148
15846E3982M3133n600q6869M903O8761n9581J30689P8394p7697j92151K5R3524
15834E1513J40626J48908j47095j81500j31592K90372P3353k72752j67357L4054
$$ plain form
15824 -161470 19654 163948 55064 45933 65830 140102 312268 402054 292699 178107
15814 178107 323511 259567 162509 164342 186630 103653 204361 263359 276184 248050 130248
15803 130248 -66646 -103430 -33911 70554 57413 144951 206002 161252 -41752 -249746 -421111
15792 -421111 -316795 -32752 24570 37270 207646 412352 510395 509802 405168 138634 43217
15781 43217 128980 112163 235035 90885 -49738 50766 126345 -30702 -17661 135651
15771 135651 28053 -79845 55723 270549 303767 189804 -27559 -320978 -284272 -77060
15761 -77060 -183959 -223468 -134747 178070 406434 448395 369686 191704 5278 -236711
15751 -236711 -339627 -362749 -156883 27894 72649 129049 176426 216682 203997 64367 -74305
$$ packed form
15824a61470J81124J44294j08884r131J9897P4272J72166Q9786j09355j14592
15814A78107J45404o3944r7058J833K2288q2977J00708N8998J2825k8134j17802
15803A30248j96894l6784O9519J04465j3141Q7538O1051m4750k03004k07994j71365
15792d21111J04316K84043N7322J2700J70376K04706R8043n93j04634k66534r5417
15781D3217Q5763j6817J22872j44150j40623J00504P5579j57047J3041J53312
15771A35651j07598j07898J35568K14826L3218j13963k17363k93419L6706K07212
15761g7060j06899l9509Q8721L12817K28364M1961p8709j77982j86426k41989
15751b36711j02916k3122K05866J84777M4755N6400M7377M0256j2685j39630j38672
$$ plain form
15740 -74305 -203564 -162717 52929 283530 392867 468583 378373 239041 120184 183839
15730 183839 269323 131187 116639 179326 81196 -37287 -103439 -311422 -379591 -413030 -259513
15719 -259513 -163851 -5075 332705 572962 287530 88631 111650 314395 349857 354216
15709 354216 313078 202924 213254 170861 147218 150866 268916 217992 142116 90191 128477
15698 128477 126406 172830 132316 308080 445004 417997 98822 -99835 -17597 -13565 -153966
15687 -153966 -138412 -9658 330728 566167 292098 79584 128440 230055 159584 109862
15677 109862 125888 251589 438204 328543 125971 194669 174175 13819 -24333 -97934
15667 -97934 -105808 -103294 -89149 -133737 -202441 8520 148218 -104912 -262935 -340944 -260819
$$ packed form
15740g4305j29259M0847K15646K30601J09337P5716r0210j39332j18857O3655
15730A83839Q5484j38136j4548O2687r8130j18483o6152k07983o8169l3439J53517
15719b59513R5662J58776L37780K40257k85432j98899K3019K02745L5462M359
15709C54216m1138j10154J0330m2393k3643L648J18050n0924p5876n1925L8286
15698A28477k071M6424m0514J75764J36924k7007l19175j98657Q2238M032j40401
15687a53966J5554J28754L40386K35439k74069k12514M8856J01615p0471m9722
15677A09862J6026J25701J86615j09661k02572O8698k0494j60356l8152p3601
15667i7934p874K514J4145m4588o8704K10961J39698k53130j58023p8009Q0125
$$ plain form
15656 -260819 -264991 -81202 79324 150462 64565 92190 190285 136155 -25539 -99430 -111911
15645 -111911 -151786 -22430 205265 263256 139865 48869 162772 193930 259866 317423 361640
15634 361640 384722 390826 413313 325829 291355 178313 171196 184736 120710 -12429 -10589 -34610
15622 -34610 -84031 -74159 77451 183357 150997 106838 56967 30537 186580 473248 299712
15611 299712 60379 168205 168664 -101720 -277892 -328778 -77163 78529 96529 173927 420175
15600 420175 361982 127898 -23901 -242985 -308585 -215189 -111163 -91780 207616 346878
15590 346878 151613 288125 312808 182233 38648 -94209 -238476 -327775 -76817 109610
15580 109610 194902 319456 164182 -47483 -90798 -352 -42486 61838 207653 164771
$$ packed form
15656b60819m172J83789J60526P1138q5897K7625R8095n4130j61694p3891j2481
15645a11911l9875J29356K27695N7991j23391r0996J13903L1158O5936N7557M4217
15634C61640K3082O104K2487q7484l4474j13042p117J3540o4026j33139J840k4021
15622c4610m9421R872J51610J05906l2360m4159m9871k6430J56043K86668j73536
15611B99712k39333J07826M59k70384j76172n0886K51615J55692J8000P7398K46248
15600D20175n8193k34084j51799k19084o5600R3396J04026J9383K99396J39262
15590C46878j95265J36512K4683j30575j43585j32857j44267q9299K50958J86427
15580A09610Q5292J24554j55274k11665m3315R0446m2134J04324J45815m2882
$$ plain form
15570 164771 70987 135141 267812 195687 74103 35157 38985 -27897 3743 48113 299641
15559 299641 306080 243417 -12640 98184 -23792 -178101 44498 344197 238956 147364
15549 147364 139802 316473 395879 235959 134608 107414 117793 91609 -124025 -76379 -15057
15538 -15057 88038 291399 340728 339654 285846 219600 42801 -12838 -166695 -174931 -213020
15527 -213020 -228303 -272220 -384341 -493659 -410972 -297068 -200903 -219802 -12417 -69373 -63306
15516 -63306 65853 15972 -10669 -18413 130499 76704 -114182 -54567 -21123 72156 309998
15505 309998 674722 701207 321341 30804 15519 -78567 -172459 -319163 -216420 18723
15495 18723 -14134 -15614 -59341 -30068 -49445 -44718 -24478 -102810 -14149 83033 -946 -104038
$$ packed form
15570A64771r3784O4154J32671p2125j21584l8946L828o6882L1640M4370K51528
15559B99641O439o2663k56057J10824j21976j54309K22599K99699j05241r1592
15549A47364p562J76671P9406j59920j01351k7194J0379k6184k15634M7646O1322
15538a5057J03095K03361M9329j074n3808o6246j76799n5639j53857q236l8089
15527b13020j5283m3917j12121j09318Q2687J13904R6165j8899K07385n6956O067
15516f3306J29159m9881k6641p744J48912n3795j90886N9615L3444R3279K37842
15505C09998L64724K6485l79866k90537j5285r4086r3892j46704J02743K35143
15495A8723l2857j480m3727K9273j9377M727K0240p8332Q8661R7182q3979j03092
$$ plain form
15483 -104038 -249212 -392330 -456884 -288474 -118048 -979 -66409 -113857 -61447 -229244
15473 -229244 -239309 -149675 -291305 -381099 -418139 -237542 -196435 -198980 -185020 -91962 3501
15462 3501 126154 269261 393639 379538 278162 242641 285519 262107 134862 77088 156653
15451 156653 175576 26032 77173 413622 490350 328053 274471 208894 176655 107145 156136
15440 156136 116374 46136 62074 -13888 -141044 -240168 -199087 30168 183771 115553 -68716
15429 -68716 50150 188787 230375 258098 505415 793427 674482 495800 414581 174335
15419 174335 70502 -61822 -94903 -48890 -6219 -4140 -11769 63639 230164 286713 94863
15408 94863 -35923 -126825 -272075 -282162 -116747 -14405 22901 -88142 -319516 -225906
$$ packed form
15483a04038j45174j43118o4554J68410J70426J17069o5430m7448N2410j67797
15473b29244j0065Q9634j41630q9794l7040J80597M1107k545J3960R3058R5463
15462C501J22653J43107J24378j4101j01376l5521M2878k3412j27245n7774P9565
15451A56653J8923j49544N1141L36449P6728j62297n3582o5577l2239o9510M8991
15440A56136l9762p0238J5938p5962j27156r9124M1081K29255J53603o8218j84269
15429f8716J18866J38637M1588K7723K47317K88012j18945j78682q1219k40246
15419A74335j03833j32324l3081M6013M2671K079p629P5408J66525N6549j91850
15408I4863j30786r0902j45250j0087J65415J02342L7306j11043k31374R3610
$$ plain form
15398 -225906 -112428 -190330 -233372 -250754 -189285 -31596 145222 190661 -18270 -229744
15388 -229744 -161257 -102810 -217839 -380166 -363442 -255446 -75796 129977 247440 133818
15378 133818 208386 -2662 -178219 -175364 -225598 49742 304530 171335 -44102 -253630
15368 -253630 -363312 -202649 -233187 -229032 -157229 -180933 -78424 -50545 -17506 -74644 15382
15357 15382 52497 144337 269330 266118 137252 222228 309247 332286 448403 383088 244886
15346 244886 -3371 -98112 -104962 -51179 26477 17538 20746 -78713 -163591 -100676 5554 -175360
15334 -175360 -338836 -188312 -40573 -166954 -287873 -23097 10378 72201 184080 150691
15324 150691 56568 -129971 -215335 -239865 -153587 70385 195282 208945 192609 38014 77094
$$ packed form
15398b25906J13478p7902m3042j7382O1469J57689J76818M5439k08931k11474
15388b29744O8487N8447j15029j62327J6724J07996J79650K05773J17463j13622
15378A33818P4568k11048j75557K855n0234K75340K54788j33195k15437k09528
15368b53630j09682J60663l0538M155P1803k3704J02509K7879L3039n7138R0026
15357A5382L7115R1840J24993l212j28866Q4976Q7019K3039J16117o5315j38202
15346B44886k48257r4741o850N3783P7656q939L208r9459q4878O2915J06230j80914
15334a75360j63476J50524J47739j26381j20919K64776L3475O1823J11879l3389
15324A50691r4123j86539q5364k4530Q6278K23972J24897J3663j6336j54595L9080
$$ plain form
15313 77094 203642 179141 111116 49791 -85843 -337071 -350367 -257163 -220613 -227027 -275318
15302 -275318 -317696 -190090 -48359 -67537 -236193 -239975 -140643 -31776 -88946 -222886 -52926
15291 -52926 -30059 -186856 -192467 -104648 61672 157937 129920 74640 90016 162996 309026
15280 309026 294114 207568 97057 6394 42576 140286 34500 -61551 17929 214134 181453
15269 181453 54389 -222750 -211436 -32688 19907 -31372 -143624 -122901 -8666 6421
15259 6421 11526 35154 2497 119158 204035 85053 -17257 -62079 42395 -21979 -127124
15248 -127124 -18426 121854 126537 11209 57757 101947 131773 137579 181834 240701 109984
15237 109984 -6954 -46945 -291956 -363804 -350289 -135661 120896 64990 -189806 -90172
$$ packed form
15313G7094J26548k4501o8025o1325j35634k51228j3296R3204L6550o414m8291
15302b75318m2378J27606J41731j9178j68656l782R9332J08867n7170j33940J69960
15291e2926K2867j56797n611Q7819J66320R6265k8017n5280J5376P2980J46030
15280C09026j4912q6546j10511r0663L6182R7710j05786r6051P9480J96205l2681
15269A81453j27064k77139J1314J78748N2595n1279j12252K0723J14235J5087
15259F421N105K3628l2657J16661Q4877j18982j02310m4822J04474o4374j05145
15248a27124J08698J40280M683j15328M6548M4190K9826N806M4255N8867j30717
15237A09984j16938l9991k45011p1848J3515K14628K56557n5906k54796R9634
$$ plain form
15227 -90172 27931 87819 147096 49309 -112817 -16329 127443 234173 288986 166365 70323
15216 70323 17452 -120472 -159060 -42374 10460 -231476 -196368 -117243 -77599 73716 132747
15205 132747 55764 -11163 -83122 -21129 -104477 -202658 -299053 -345760 -392259 -464531 -467985 -329562
15193 -329562 -235325 -185296 -254123 -27073 140278 20010 -73521 -91252 -204041 -221479 5463
15182 5463 174571 96687 -15486 46846 36785 -92899 -110747 -91251 -219884 -254750 -227479
15171 -227479 -157033 -87474 -138051 -186723 -182863 -282748 -256554 -175601 45529 230786 175791
15160 175791 136963 139247 272677 290209 192801 274380 234675 231477 222914 151318 59631 56216
15148 56216 -36407 45806 133048 -7125 -31122 81494 12026 70869 234178 443017 597316
$$ packed form
15227i0172J18103N9888N9277r7787j62126R6488J43772J06730N4813j22621r6042
15216G0323n2871j37924l8588J16686N2834k41936L5108P9125L9644J51315N9031
15205A32747p6983o6927p1959O1993q3348r8181r6395m6707m6499p2272l454J38423
15193c29562R4237N0029o8827K27050J67351j20268r3531j7731j12789j7438K26942
15182E463J69108p7884j12173O2332j0061j29684j7848J9496j28633l4866K7271
15171b27479P0446O9559n0577m8672L860r9885K6194Q0953K21130J85257n4995
15160A75791l8828K284J33430J7532r7408Q1579l9705l198q563p1596r1687l415
15148E6216r2623Q2213Q7242j40173k3997J12616o9468N8843J63309K08839J54299
$$ plain form
15137 597316 597748 284522 80890 99345 256740 86085 -34467 1772 85827 128412 66254
15126 66254 94518 229 -3487 131596 272002 217149 86333 93583 316331 243725 147251
15115 147251 179798 159409 161183 203824 344540 355957 329010 271324 195493 281475 235278
15104 235278 53147 449 61907 174191 181821 231281 164912 200019 381489 218924 67339
15093 67339 112452 66052 25594 143350 235526 246857 164936 75560 137089 242015 314465
15082 314465 412069 268042 40943 51750 195805 204506 229204 209992 229896 175527 253169
15071 253169 166354 -12700 -107667 -199010 -120429 -31008 -95853 -159487 -340764 -247323 -142025
15060 -142025 28795 -14699 -155719 -178319 -89703 88509 22636 166825 138764 105733 299957
$$ packed form
15137E97316M32l13226k03632J8455J57395j70655j20552L6239Q4055M2585o2158
15126F6254K8264r4289l716J35083J40406n4853j30816P250K22748p2606r6474
15115A47251L2547k0389J774M2641J40716J1417k6947n7686p5831Q5982m6197
15104B35278j82131n2698O1458J12284P630M9460o6369L5107J81470j62565j51585
15093F7339M5113m6400m0458J17756R2176J1331q1921q9376O1529J04926P2450
15082C14465R7604j44027k27099J0807J44055Q701K4698j9212J9904n4369P7642
15071B53169q6815j79054r4967r1343P8581Q9421o4845o3634j81277R3441J05298
15060a42025J70820m3494j41020k2600Q8616J78212o5873J44189k8061l3031J94224
$$ plain form
15049 299957 368688 349660 223747 180715 95567 112157 153036 113469 154410 -954 -116373
15038 -116373 -29016 -22847 67310 269890 272003 129189 -211579 -282192 -87250 106939 31573
15027 31573 3629 118161 225115 280043 216361 124856 4927 15106 -106249 -18805 261618
15016 261618 391999 281889 91320 -38304 -154352 -6295 -37009 -146516 -258294 -267806
15006 -267806 -291049 -220674 -56088 127259 84661 52552 89299 47071 -188557 -228999 -67365
14995 -67365 -87239 -145296 -119444 -192750 -135128 -16583 108184 78789 128815 96423 31091
14984 31091 86939 296490 340912 336763 293547 255619 255563 297679 271238 229903 110688 -66936
14972 -66936 -96317 898 56264 158303 152168 -59717 -247279 119594 392824 202036 82355
$$ packed form
15049B99957O8731j9028j25913m3032q5148J6590M0879l9567M0941j55364j15419
15038a16373Q7357O169R0157K02580K113j42814l40768p0613J94942J94189p5366
15027C1573k7944J14532J06954N4928o3682r1505j19929J0179j21355Q7444K80423
15016B61618J30381j10110j90569j29624j16048J48057l0714j09507j11778r512
15006b67806k3243P0375J64586J83347m2598l2109L6747m2228k35628m0442J61634
14995f7365j9874n8057K5852p3306N7622J18545J24767k9395N0026l2392o5332
14984C1091N5848K09551M4422m149m3216l7928n6M2116k6441m1335j19215j77624
14972f6936k9381R7215N5366J02039o135k11885j87562L66873K73230j90788j19681
$$ plain form
14961 82355 132771 221529 105333 -46155 -184768 -214129 -61921 -116659 -41881 26261 221100
14950 221100 331539 250917 216740 274266 42147 -261132 -527315 -522389 -295026 -273324 -312018
14939 -312018 -269886 -186186 -4486 167968 205424 48541 58201 108079 29954 -79738 -151618
14928 -151618 -138969 -238502 -205987 -235163 -90808 -14429 72388 7463 -251800 -280504 -364741
14917 -364741 -268161 -93385 -5217 -33868 -213677 -180002 -167751 -110844 -94801 -74603 -48550
14906 -48550 -92372 -154221 -88508 -203171 -294905 -74223 216997 391392 473392 446065 315473
14895 315473 -3580 -195218 -157121 1486 88989 103602 -70416 -114347 21545 81345
14885 81345 3135 64841 6911 -157847 69349 218520 227388 109527 172170 271826 207767
$$ packed form
14961H2355N0416Q8758j16196j51488j38613k9361J52208n4738P4778O8142J94839
14950B21100J10439q0622l4177N7526k32119l03279k66183M926K27363K1702l8694
14939c12018M2132Q3700J81700J72454L7456j56883R660M9878p8125j09692p1880
14928a51618J2649r9533L2515k9176J44355P6379Q6817o4925k59263k8704q4237
14917c64741R6580J74776Q8168k8651j79809L3675J2251N6907J6043K0198K6053
14906d8550m3822o1849O5713j14663r1734K20682K91220J74395Q2000k7327j30592
14895C15473l19053j91638L8097J58607Q7503J4613j74018m3931J35892N9800
14885H1345p8210O1706n7930j64758K27196J49171Q868j17861O2643R9656o4059
$$ plain form
14874 207767 82046 -74173 -11403 125346 266946 285015 329149 174854 127641 85932
14864 85932 -64580 -242011 -76687 212701 274269 38226 -33847 51288 92135 -22682
14854 -22682 -138650 -68292 156731 182956 200094 250061 251836 197947 106589 218749 271930
14843 271930 111230 18449 -26352 -10039 26603 153276 218335 120602 -11054 -227172 -226955
14832 -226955 -2077 236731 212730 122767 92355 36113 90660 15181 -113976 -140405 44196
14821 44196 253344 308796 339593 440907 367973 250821 139247 47426 118450 30950 -63187
14810 -63187 -131922 57100 277184 416593 320217 130427 17489 98446 85847 84710 140084
14799 140084 117737 123871 8611 -316092 -344876 -207351 -233671 -159777 39834 -6488 -11165
$$ packed form
14874B07767j25721j56219O2770J36749J41600J8069M4134j54295m7213m1709
14864H5932j50512j77431J65324K89388O1568k36043p2073Q5135M0847j14817
14854b2682j15968P0358K25023K6225J7138M9967J775n3889r1358J12160N3181
14843B71930j60700r2781m4801J6313L6642J26673O5059r7733j31656k16118K17
14832b26955K24878K38808k4001q9963l0412n6242N4547p5479j29157k6429J84601
14821D4196K09148N5452L0797J01314p2934j17152j11574r1821P1024q7500r4137
14810f3187o8735J89022K20084J39409r6376j89790j12938Q0957j2599j137N5374
14799A40084k2347O134j15260l24703k8784J37525k6320P3894J99611m6322m677
$$ plain form
14788 -11165 -44122 -18498 6572 163176 134648 251797 330780 33348 -220613 -221117 56372
14777 56372 124915 -136859 120912 261039 78889 -151916 -176925 -129742 -83772 -177416 -256797
14766 -256797 -6881 84706 53871 255041 411849 469688 411461 193865 -76577 -112337
14756 -112337 -51597 -8123 -1460 -75177 -113109 -197829 32240 231802 63217 -167166 -261802
14745 -261802 -107969 -4669 -21032 -90054 5678 182264 133159 -6971 -42294 -12034 147827
14734 147827 391749 401329 401127 386036 220338 96697 149481 172256 -128547 -146913 -94064
14723 -94064 -31155 205899 292799 252516 336491 217169 -51939 -156414 -165587 181896 405603
14712 405603 356485 239354 102393 33732 -20541 -60794 67933 133929 57308 -151693 -101913
$$ packed form
14788a1165l2957K5624K5070J56604k8528J17149P8983k97432k53961n04K77489
14777E6372O8543k61774K57771J40127j82150k30805k5009M7183M5970r3644p9381
14766b56797K49916R1587l0835K01170J56808N7839n8227k17596k70442l5760
14756a12337O0740M3474O663p3717l7932q4720K30069J99562j68585k30383r4636
14745b61802J53833J03300j6363o9022R5732J76586m9105j40130l5323L0260J59861
14734A47827K43922R580k02j5091j65698j23641N2784K2775l00803j8366N2849
14723i4064O2909K37054Q6900m0283Q3975j19322k69108j04475r173L47483K23707
14712D05603m9118j17131j36961o8661n4273m0253J28727O5996p6621k09001M9780
$$ plain form
14701 -101913 22448 92196 54529 74028 82082 20446 92732 141807 70884 285577 309043
14690 309043 341605 468380 456747 352978 283809 216539 230374 208415 261082 222160 93063
14679 93063 -5289 -76120 -5229 135585 176103 145969 127473 299488 381580 405712 453538
14668 453538 311132 142101 68348 -19406 -383318 -472383 -375950 -258911 -404314 -484059
14658 -484059 -425334 -356881 -242269 -332677 -313031 -174170 -59863 -69210 -203039 1592 138463
14647 138463 38273 -89759 -205060 -150060 -60420 -92217 -224759 -276011 -217983 -16041
14637 -16041 63372 71682 157197 98616 -56277 -117898 -272014 -296621 -195751 -186854 -103340
14626 -103340 -47921 -49635 137487 106102 -86809 -241940 -149011 -101771 -138691 63607 180682
$$ packed form
14701a01913J24361O9748l7667J9499Q054o1636P2286M9075p0923K14693K3466
14690C09043L2562J26775j1633j03769o9169o7270J3835k1959N2667l8922j29097
14679I3063r8352p0831P0891J40814M0518l0134j8496J72015Q2092K4132M7826
14668D53538j42406j69031p3753q7754l63912q9065R6433J17039j45403p9745
14658d84059N8725O8453J14612r0408J9646J38861J14307r347j33829K04631J36871
14647A38463j00190j28032j15301N5000Q9640l1797j32542n1252N8028K01942
14637a6041P9413Q310Q5515n8581j54893o1621j54116k4607J00870Q897Q3514
14626a03340N5419j714J87122l1385j92911j55131R2929M7240l6920K02298J17075
$$ plain form
14615 180682 115506 164805 182545 90308 48399 -72797 -185283 -366866 -489136 -413966 -294658
14604 -294658 -351518 -382066 -210131 -301589 -215728 -19331 233645 260052 289244 287906 178232
14593 178232 142037 91216 -11131 77853 57522 56580 152194 134170 82749 183960 316037
14582 316037 403740 381241 252216 310131 384670 300948 217342 217963 168158 181370 261967 238487
14570 238487 102595 -39582 19090 77933 85658 130166 282401 234622 304257 502912 390958
14559 390958 65462 -20351 42850 193028 545798 733951 674452 375338 24351 -18054
14549 -18054 109447 259349 321626 185588 241913 334582 282185 298499 272609 -10822 106858
14538 106858 216085 257381 124151 39020 18452 -84387 -104304 51832 322383 271298
$$ packed form
14615A80682o5176M9299J7740r2237m1909j21196j12486j81583j22270P5170J19308
14604b94658n6860l0548J71935r1458Q5861J96397K52976K6407K9192j338j09674
14593A78232l6195n0821j02347Q8984k0331r42R5614j8024n1421J01211J32077
14582C16037Q7703k2499j29025N7915P4539q3722q3606O21m9805J3212Q0597k3480
14570B38487j35892j42177N8672N8843P725M4508J52235m7779O9635J98655j11954
14559C90958l25496q5813O3201J50178L52770J88153n9499k99114l50987m2405
14549a8054J27501J49902O2277j36038N6325R2669n2397J6314k5890k83431J17680
14538A06858J09227M1296j33230q5131k0568j02839j9917J56136K70551n1085
$$ plain form
14528 271298 110132 -30853 -27609 -135194 -197924 -156881 -82202 16000 138683 276811 109632
14517 109632 22197 2912 13125 73896 167230 204335 199138 233450 81011 -181431 -203555
14506 -203555 15973 186616 141157 86324 111202 -18726 -4216 126864 112744 -149070
14496 -149070 -390640 -217750 -8882 122232 -59614 -116512 -13913 20651 69076 -21778
14486 -21778 -57175 -183542 -246389 -163675 57408 286016 409687 275879 -68605 -236224
14476 -236224 -266061 -179529 42639 48101 78297 45489 116304 203734 176890 192740 50102
14465 50102 -150744 -261074 -278801 -115622 -23193 173404 291710 317297 448741 418969
14455 418969 70110 -117918 -2735 217169 279358 120618 -7870 -105558 19296 162082
$$ packed form
14528B71298j61166j40985L244j07585o2730M1043P4679R8202J22683J38128j67179
14517A09632q7435j9285J0213O0771R3334L7105n197L4312j52439k62442k2124
14506b03555K19528J70643m5459n4833K4878j29928J4510J31080j4120k61814
14496a49070k41570J72890K08868J31114j81846n6898J02599L4564M8425r0854
14486b1778l5397j26367o2847Q2714K21083K28608J23671j33808l44484j67619
14476b36224k9837Q6532K22168N462L0196l2808P0815Q7430k6844J5850j42638
14465E0102k00846j10330j7727J63179R2429J96597J18306K5587J31444k9772
14455D18969l48859j88028J15183K19904O2189j58740j28488r7688J24854J42786
$$ plain form
14445 162082 277370 110046 -60037 -183862 -275043 -179371 -26742 28421 -47062 -49813 -16284
14434 -16284 -148867 -138527 -104462 83676 442744 366181 313867 354792 266591 94366 193163
14423 193163 104662 44178 -33281 -219332 -190661 -108737 -43579 176249 380573 354642 148282
14412 148282 -47485 -67320 25653 34893 -136650 -323160 -113636 136052 211474 303442 251227
14401 251227 57084 -105790 -192518 -236470 -308298 -335890 -250355 -188288 26957 -85919 -100993
14390 -100993 -132101 -129340 -103201 -124020 -208741 -344772 -486354 -414734 -280529 -154255 -96089
14379 -96089 80730 234836 136350 -195785 -502966 -463312 -142004 210162 285097 119604
14369 119604 53012 54078 178298 242191 131604 208088 118358 -72077 -172126 -111206 -40122
$$ packed form
14445A62082J15288j67324j70083j23825r1181R5672J52629N5163p5483k751L3529
14434a6284j32583J0340L4065J88138L59068p6563n2314M0925q8201j72225R8797
14423A93163q8501o0484p7459j86051K8671Q1924O5158K19828K04324k5931k06360
14412A48282j95767j9835R2973R240j71543j86510K09524K49688P5422R1968n2215
14401B51227j94143j62874q6728m3952p1828k7592Q5535O2067K15245j12876j5074
14390a00993l1108K761K6139k0819q4721j36031j41582P1620J34205J26274N8166
14379i6089J76819J54106r8486l32135l07181L9654L21308L52166P4935j65493
14369A19604o6592J066J24220O3893j10587P6484q9730j90435j00049O0920P1084
$$ plain form
14358 -40122 142752 26197 -81379 41953 55172 253286 218101 130987 167779 337477
$$ packed form
14358d0122J82874j16555j07576J23332J3219J98114l5185q7114L6792J69698
$$ [...]
0d10
##END NTUPLES=NMR SPECTRUM
##END=
