##TITLE=Analysis number 307974
Compound Code s 10467
Book Reference 414/82
Project Code adrs
Chemist Name mattw
##JCAMPDX= 6.0         $$ Bruker NMR JCAMP-DX V2.0
##DATA TYPE= NMR SPECTRUM
##DATA CLASS= NTUPLES
##ORIGIN= Bruker BioSpin GmbH
##OWNER= NMR
$$ XWIN-NMR		Version 3.5
$$ Wed May 18 12:47:02 2005 GMT Daylight Time (UT+1h)  MAYBRIDGE\NMR@NMR_250MHZ
##.OBSERVE FREQUENCY= 250.131544655141
##.OBSERVE NUCLEUS= ^1H
##.ACQUISITION MODE= SIMULTANEOUS (DQD)
##.ACQUISITION SCHEME= undefined
##.AVERAGES= 16
##.DIGITISER RES= 18
##SPECTROMETER/DATA SYSTEM= dpx250
##.PULSE SEQUENCE= zg30
##.SOLVENT NAME= CDCl3
##.SHIFT REFERENCE= (INTERNAL, CDCl3, 0, 16.2902)
##AUDIT TRAIL= $$ (NUMBER, WHEN, WHO, WHERE, WHAT)
$$ ##TITLE= Audit trail, XWIN-NMR		Version 3.5
$$ ##JCAMPDX= 5.01
$$ ##ORIGIN= Bruker BioSpin GmbH
$$ ##OWNER= NMR
$$ C:\u/data/dgb/nmr/ADRS/3120/pdata/1/auditp.txt
$$ ##AUDIT TRAIL=  $$ (NUMBER, WHEN, WHO, WHERE, WHAT)
(   1,<2005-05-18 12:46:41.70 +100>,<MAYBRIDGE\NMR>,<NMR_250MHZ>,
      <created by zg, POWCHK disabled, PULCHK disabled
       configuration hash MD5:
       62 19 C7 07 E1 42 D1 B7 37 6C 3D D0 77 39 F9 E6
       data hash MD5: 64K
       A1 75 4E 7B 6B 4A DD 26 D0 1A 7B D5 F8 DF C1 38>)
(   2,<2005-05-18 12:46:53.68 +100>,<MAYBRIDGE\NMR>,<NMR_250MHZ>,
      <Start of raw data processing
       ef LB = 0.3 FT_mod = 6 PKNL = 1 SI = 32K 
       data hash MD5: 32K
       DB 8B 23 2B 9D C0 9B 57 B8 FB 2B 31 05 AA 76 A9>)
(   3,<2005-05-18 12:46:55.79 +100>,<MAYBRIDGE\NMR>,<NMR_250MHZ>,
      <apk 
       data hash MD5: 32K
       1D 7C CF C9 61 5D A1 F1 42 F5 82 6A 77 40 15 8F>)
(   4,<2005-05-18 12:46:56.51 +100>,<MAYBRIDGE\NMR>,<NMR_250MHZ>,
      <abs ABSG = 5 
       data hash MD5: 32K
       86 09 54 B8 0B 31 D5 AB C9 00 5B C5 6A 43 76 D2>)
$$ ##END=
$$ 
$$ hash MD5
$$ 45 89 66 2D 9F 5D 1D DA E4 AD A5 BA 99 61 E4 33
##$RELAX= 
##$RELAX= 
##$RELAX= 
##$RELAX= 
##$RELAX= 
##$RELAX= 
##$RELAX= 
$$ Bruker specific parameters
$$ --------------------------
##$DU= <C:\u>
##$EXPNO= 3120
##$NAME= <ADRS>
##$PROCNO= 1
##$TYPE= <nmr>
##$USER= <dgb>
##$AMP= (0..31)
100 100 100 100 100 100 100 100 100 100 100 100 100 100 100 100 100 100 
100 100 100 100 100 100 100 100 100 100 100 100 100 100 
##$AQSEQ= 0
##$AQ_mod= 3
##$AUNM= <au_zg>
##$AUTOPOS= <30 >
##$BF1= 250.13
##$BF2= 250.13
##$BF3= 250.13
##$BF4= 250.13
##$BF5= 500.13
##$BF6= 500.13
##$BF7= 500.13
##$BF8= 500.13
##$BYTORDA= 1
##$CFDGTYP= 0
##$CFRGTYP= 5
##$CHEMSTR= <none>
##$CNST= (0..31)
1 1 145 1 1 1 1 1 1 1 1 1 1 1 1 1 1 1 1 1 1 1 1 1 1 1 1 1 1 1 1 1 
##$CPDPRG= <>
##$CPDPRG1= <>
##$CPDPRG2= <>
##$CPDPRG3= <>
##$CPDPRG4= <mlev>
##$CPDPRG5= <mlev>
##$CPDPRG6= <mlev>
##$CPDPRG7= <mlev>
##$CPDPRG8= <mlev>
##$CPDPRGB= <>
##$CPDPRGT= <>
##$D= (0..31)
0 1 0 0 0 0 0 0 0 0.06 0 0 0 0 0 0 0.0002 0 0 0 0 0 0 0 0 0 0 0 0 0 0 
0 
##$DATE= 1116416800
##$DBL= (0..7)
120 120 120 120 120 120 120 120 
##$DBP= (0..7)
150 150 150 150 150 150 150 150 
##$DBP07= 0
##$DBPNAM0= <>
##$DBPNAM1= <>
$$ [...]
##$SUBNAM7= <"">
##$SUBNAM8= <"">
##$SUBNAM9= <"">
##$SW= 20.6930455092707
##$SWIBOX= (0..15)
0 0 3 0 0 0 0 0 0 0 0 0 0 0 0 0 
##$SW_h= 5175.983436853
##$TD= 65536
##$TD0= 1
##$TE= 295.16
##$TE2= 300
##$TE3= 300
##$TEG= 300
##$TL= (0..7)
0 120 120 120 120 120 120 120 
##$TP= (0..7)
150 150 150 150 150 150 150 150 
##$TP07= 0
##$TPNAME0= <>
##$TPNAME1= <>
##$TPNAME2= <>
##$TPNAME3= <>
##$TPNAME4= <>
##$TPNAME5= <>
##$TPNAME6= <>
##$TPNAME7= <>
##$TPOAL= (0..7)
0.5 0.5 0.5 0.5 0.5 0.5 0.5 0.5 
##$TPOFFS= (0..7)
0 0 0 0 0 0 0 0 
##$TUNHIN= 0
##$TUNHOUT= 0
##$TUNXOUT= 0
##$USERA1= <user>
##$USERA2= <user>
##$USERA3= <user>
##$USERA4= <user>
##$USERA5= <user>
##$V9= 5
##$VALIST= <valist>
##$VCLIST= <CCCCCCCCCCCCCCC>
##$VD= 0
##$VDLIST= <DDDDDDDDDDDDDDD>
##$VPLIST= <PPPPPPPPPPPPPPP>
##$VTLIST= <TTTTTTTTTTTTTTT>
##$WBST= 1024
##$WBSW= 4
##$XGAIN= (0..3)
0 0 0 0 
##$XL= 0
##$YL= 0
##$YMAX_a= 435067
##$YMIN_a= -388206
##$ZGOPTNS= <>
##$ZL1= 120
##$ZL2= 120
##$ZL3= 120
##$ZL4= 120
##$ABSF1= 16.29016
##$ABSF2= -4.403009
##$ABSG= 5
##$ABSL= 3
##$ALPHA= 0
##$AQORDER= 0
##$ASSFAC= 0
##$ASSFACI= 0
##$ASSFACX= 0
##$ASSWID= 0
##$AUNMP= <proc_1d>
##$AZFE= 0.1
##$AZFW= 0.1
##$BCFW= 0
##$BC_mod= 0
##$BYTORDP= 0
##$COROFFS= 0
##$CY= 12.5
##$DATMOD= 1
##$DC= 0
##$DFILT= <>
##$DTYPP= 0
##$F1P= 14.0000005364418
##$F2P= -0.99999901652339
##$FCOR= 0.5
##$FTSIZE= 32768
##$FT_mod= 6
##$GAMMA= 0
##$GB= 0
##$INTBC= 1
##$INTSCL= 1
##$ISEN= 128
##$LB= 0.3
##$LEV0= 0
##$LPBIN= 0
##$MAXI= 10000
##$MC2= 0
##$MEAN= 0
##$ME_mod= 0
##$MI= 0
##$NCOEF= 0
##$NC_proc= -4
##$NLEV= 6
##$NOISF1= 0
##$NOISF2= 0
##$NSP= 0
##$NTH_PI= 0
##$NZP= 0
##$OFFSET= 16.29016
##$PC= 1
##$PHC0= 135.3476
##$PHC1= 6.13007
##$PH_mod= 1
##$PKNL= yes
##$PPARMOD= 0
##$PSCAL= 4
##$PSIGN= 0
##$REVERSE= no
##$SF= 250.130057989313
##$SI= 32768
##$SIGF1= 0
##$SIGF2= 0
##$SINO= 400
##$SIOLD= 32768
##$SREGLST= <1H.CDCl3>
##$SSB= 0
##$STSI= 32768
##$STSR= 0
##$SW_p= 5175.98343685301
##$SYMM= 0
##$S_DEV= 0
##$TDeff= 65536
##$TDoff= 0
##$TI= <Analysis number 999999
Compound Code 99
Book Reference 9
Project Code 9>
##$TILT= no
##$TM1= 0
##$TM2= 0
##$TOPLEV= 0
##$USERP1= <user>
##$USERP2= <user>
##$USERP3= <user>
##$USERP4= <user>
##$USERP5= <user>
##$WDW= 1
##$XDIM= 32768
##$YMAX_p= 368470809
##$YMIN_p= -113595
$$ End of Bruker specific parameters
$$ ---------------------------------
##NTUPLES= NMR SPECTRUM
##VAR_NAME=  FREQUENCY,     SPECTRUM/REAL,   SPECTRUM/IMAG
##SYMBOL=    X,             R,               I
##VAR_TYPE=  INDEPENDENT,   DEPENDENT,       DEPENDENT
##VAR_FORM=  AFFN,          ASDF,            ASDF
##VAR_DIM=   32768,         32768,           32768
##UNITS=     HZ,            ARBITRARY UNITS, ARBITRARY UNITS
##FACTOR=    0.157963299565203, 1,           1
##FIRST=     4074.65847172042, 0,            0
##LAST=      -1101.32496513259, 0,           0
##MIN=       -1101.32496513259, -113595,     0
##MAX=       4074.65847172042, 368470809,    0
$$ Real data points
##PAGE= N=1
##DATA TABLE= (X++(R..R)), XYDATA
$$ [...]
18281G05j0671j3128N481K0038M920M69N995P131J1038m370p382j1030k247k80
18267F669k243j839K002n543O502N443r409p315k171J728N340J166r04M878j1260
18252f956O963K28m816q505M679J3922K159r455K262R905P678M622j52M250Q26
18237B7610l850m593J291P845J6292N763l200j058k235k2252j6598Q604k316j360
18223I943o09j981j050j545N670l40n104n959M65n395K350O614J3772N731j9572
18208B990l215J3177J188p002n758L07m664J5075J3185o632j3151j4906J529J3157
18194E280L061J579J1667K788J1864k613j0127l281P923J105q841k454j203P624
18180B4372o361N531O441Q799R239L259n10J411K651k413q271j1262o159M772
$$ y = [705, -9966, -23094, -17613, 2425, 7345, 7814, 13809, 20940, 31978, 27608, 20226, 9196, 6949, 6669, 4426, 2587, 4589, -954, 5548, 10991, 1582, -5733, -7904, -6176, -836, 330, -574, 4304, -6956, 7, 235, -4581, -13086, -8407, 5515, 7674, -1781, 481, 10386, 18064, 22686, 22534, 26784, 27610, 23760, 19167, 20458, 28303, 44595, 50358, 47158, 46100, 43865, 21613, 5015, 13619, 11303, 9943, 9334, 7353, 6303, 4758, 10428, 10088, 4984, -975, -510, -5905, -3555, 3059, 16831, 22562, 2990, -225, 12952, 14140, 7138, 1380, 1687, -2977, 12098, 25283, 18651, 5500, -9406, -7877, 5280, 8341, 9920, 21587, 24375, 36239, 33626, 23499, 20218, 28141, 29246, 20405, 17951, 16748, 24372, 18011, 23542, 29983, 38782, 48021, 51280, 50770, 52181, 54832, 52419, 44148, 32886, 26727, 31499]
18166C1499p696J0465L096j431m304O463J3726N180m036J0940J4108R83N292J0510
18152I4795m887k936j425N128J2456N260o569P68k917O111K0543J6016n21j995
18138A39827J8866J1432k78k040J2164K1135K1526K2491J6465J4378K6849L0299
18126C33114K8507N1031O4252O4213P5698R0823J04837J18517J67815K31868L28654
18115A659329M69176O57796R63179J503961K569208M532933O255909M019208r49030
18106B1681669m748656n432617l985382k340482j442688j024265p17993m64166
18098A525420l14328k15932j56831j31954j12840q6022p4219m2974l2682l2628
18088C25010k8436l3709k5905k4365l1041j8281j1335p553K303q132j0060j7103
$$ y = [31499, 23803, 34268, 37364, 35933, 31629, 38092, 51818, 56998, 52962, 63902, 78010, 78993, 84285, 94795, 89908, 86972, 85547, 90675, 103131, 108391, 101822, 102590, 99673, 105784, 126327, 142343, 141822, 139827, 158693, 170125, 169847, 167807, 179971, 201106, 222632, 245123, 261588, 275966, 302815, 333114, 361621, 412652, 476904, 541117, 616815, 707638, 812475, 930992, 1098807, 1330675, 1659329, 2128505, 2786301, 3749480, 5253441, 7822649, 12355582, 18611491, 22630699, 21681669, 16933013, 11500396, 7515014, 5174532, 3731844, 2707579, 1989586, 1525420, 1211092, 995160, 838329, 706375, 593535, 507513, 433294, 390320, 357638, 325010, 296574, 262865, 236960, 212595, 181554, 163273, 151938, 144385, 146688, 138556, 128496, 111393]
18076A11393j1236q891j4171r768q149j922j585o307Q139K432J921j882j8550
18063D1424j5879j583Q360L260k22q005n282m187m732J6949K687q028j5780j3587
18049d605J0777o8N946N152o3k239r361m92K19J218M363K5598N054j0994r046
18034B1459k81k149L072L266q648j7764j1001N824J8843J3849n988j3150j866
18021E466m0k166N191p68j420Q588O428l013n776M238p659j1206N668k646j4992
18006a4107J749P931M220n314m104P496O785m334o056l564k137J3982P791n665
17992D673k139k692m224J55j1231O192N734M44r683j1697j794M180K3811R932
17978A1661r513r334Q348J1178K138o103j3884N692O308Q522K90M982M823O599
$$ y = [111393, 100157, 91266, 77095, 67327, 59178, 57256, 55671, 49364, 57503, 59935, 61856, 59974, 41424, 25545, 23962, 32322, 35582, 35360, 27355, 22073, 17886, 13154, 30103, 32790, 24762, 8982, -4605, 6172, 6104, 12050, 17202, 17139, 14900, 5539, 5047, 5266, 6484, 10847, 36445, 41499, 30505, 21459, 21178, 19029, 22101, 25367, 16719, -1045, -12046, -6222, 12621, 26470, 20482, 7332, 5466, 5426, 3260, 8451, 7683, 6263, 14851, 21279, 18266, 12490, 16728, 9069, -2137, 3531, 885, -14107, -12358, -4427, -207, -5521, -9625, -2129, 4656, 322, -5734, -9298, -11435, 2547, 10338, 4673, 2534, -158, -4382, -4227, -15458, -9266, -3532, -3088, -12771, -24468, -26262, -22082, 1729, 11661, 2148, -7186, 1162, 12340, 14478, 8375, -5509, 183, 6491, 15013, 15303, 20285, 25108, 31707]
17964C1707j7401j4518l522l423N994k025j879n839l34K444m945o458K575k881
17950b0505J2432J1012j96p375j842n08K636J1901q99q338J220P443N560l773
17936H768q618j1707n051J2302M322L338p471l814o925n641N452O202J076L183
17922d584N772m929n104J788j1497m422J8674L538m527l246m019q74N344l502
17908a1588j1767J0006N223O850L363q238j3607l865M542J6824j4n52P752J223
17894F152p962l276L901l184p221o68K641K623L465J333m274K264O143m879K276
17879f66m212j8591L968J1205r682j8009k524P677K975m373P063J2844J2925j161
17865e61n172l311j2196l158L210n76l748J824J4717L374k350O353j049o039p799
$$ y = [31707, 14306, -212, -3734, -7157, -1163, -3188, -5067, -10906, -11240, -8796, -13741, -20199, -17624, -20505, -8073, 2939, 2743, -4632, -6474, -6982, -4346, 7555, 6656, -1682, -462, 6981, 12541, 8768, 150, -11557, -16608, -4306, 16, 3354, -4117, -7931, -14856, -20497, -15045, -8843, -7767, -4584, 1188, -3741, -8845, -7057, -18554, -22976, -4302, -764, -5291, -8537, -12556, -13430, -8086, -11588, -23355, -13349, -8126, -1276, 2087, -6151, -19758, -23623, -19081, -2257, -2271, -2823, 4929, 6152, -1810, -5086, -1185, -4369, -11590, -12258, -9617, -6994, -3529, -2196, -6470, -4206, 1937, -2942, -666, -4878, -23469, -19501, -8296, -17978, -35987, -38511, -30834, -27859, -32232, -25169, -12325, 600, -561, -5733, -9044, -21240, -24398, -21188, -21764, -25512, -23688, -8971, -5597, -7947, -1594, -2643, -8682, -16481]
17850a6481J1455K267o425J110l658p1M485J0051L263M720m201q295j0331O47
17836a1464J0354R294j2111m037j837L408P742o298M768k659N129J313j3266q389
17822a8053l876L312L543J0762J988R816K825J430p59N37r836j0139j5952L412
17808b0990M967o539O802O173j514p177J6491R373j0931L244j929p803j1052R617
17794a1268J6187M885j3944l101n262J0061K341J925k968L937l938p961o628K18
17780a5516N735o283m708Q857K714Q118N401n571j0280M657J0459J091j7464j947
17766a4737J3196J3453N947J289j4909p035p609l570L931m601l593m27p263O613
17752a9315J2559Q042k41o889l722j729J0924K741K495Q47K345m281j2873j0274
$$ y = [-16481, -5026, -2759, -9184, -8074, -11732, -11803, -7318, 2733, 5996, 10716, 6515, -1780, -12111, -11464, -1110, 8184, -3927, -7964, -9801, -6393, 1349, -4949, -181, -2840, 2289, 3602, -9664, -18053, -21929, -18617, -15074, -4312, -2324, 7492, 10317, 11747, 10988, 11525, 1689, -8450, -24402, -20990, -16023, -22562, -15760, -9587, -11101, -18278, -1787, 7586, -3345, -101, -2030, -9833, -20885, -11268, 4919, 9804, -4140, -7241, -12503, -2442, -101, 1824, -1144, 2793, -1145, -9106, -15734, -15516, -9781, -16064, -20772, -11915, -9201, -1083, 4318, -1253, -11533, -6876, 3583, 4674, -12790, -14737, -1541, 11912, 17859, 19148, 4239, -2796, -10405, -13975, -10044, -14645, -18238, -18665, -25928, -19315, -6756, 1286, 1045, -5844, -9566, -11295, -371, 2370, 4865, 5712, 8057, 3776, -9097, -19371]
17738a9371J458M037M446P65Q429K575K265j03j2648N217J0101N719l580n581
17724C729j2978j068j4101j5253J765O216j740M052P294r210n659O04J7044J8159
17710a146J914m623K650r907j1533R844N398O714J0353J001j0179J958q480p057
17696a3093O170M999n675r539m076O259J251O445J196m203j685n875j1674r3K641
17681b6952K296M587O813L93N935j718M119o074L82L790J0041j0466l167R448
17667e73O762j4983k879J2409o2j684k031P945J0212l110p782q050N257j856l626
17652d051r32l729O049j565P277L733L052j0726M07M033J862M016M193p201r770
17637c352j499J2810J2674q254p357J985L051O626l096q189j3097j4988N811K1720
$$ y = [-19371, -17913, -13876, -9430, -8665, -236, 2339, 4604, 4501, -8147, -2930, 7171, 12890, 9310, 3729, -9249, -10317, -24418, -39671, -37906, -31690, -33430, -29378, -22084, -31294, -36953, -36349, -19305, -1146, 768, -3855, -1205, -11112, -22645, -12801, -7403, -689, 9664, 10665, 486, 2444, -6036, -13093, -6923, -1924, -7599, -17138, -21214, -14955, -13704, -7259, -6063, -10266, -11951, -17826, -29500, -29593, -26952, -24656, -20069, -13256, -12863, -6928, -8646, -4527, -10601, -10219, -6429, 3612, -6854, -10021, -573, 6189, -8794, -11673, 736, 674, -1010, -3041, 4904, 15116, 12006, 4224, -3826, 1431, -425, -4051, -4983, -8712, -2663, -4228, 3049, 6782, 9834, -892, -485, 3548, 5410, 9426, 13619, 6418, -3352, -4851, 7959, 20633, 12379, 5022, 7007, 10058, 16684, 13588, 5399, -7698, -22686, -16875, 4845]
17623D845J5625k305r442J257L173R904N241j0753q94p901O75j2325O700J5154
17609A8954M660j0707N695J779j2445j5656n169L901m03j948J0483P058L979L939
17595A4120l408l673J6248j473j2939j0927k46J2426J354j4822j1973K55n05L791
17581a1772L895q675q299M339N797J896R208K434k021k497M332L739P603o03j162
17566H214j9538m528J1076J1407P158r95j7331r216m236O85M377L915q041J1671
17552e382j629l89k615Q597J002q651O63K030J1663K503q326l599p116O035K857
17537b357P317N197j4812j7946m378P628P712J853N566L277k574j925J1418n110
17523H66r827Q599K1645M957p929r559K945k459r786k99J538P196o606o784p045
$$ y = [4845, 20470, 18165, 8723, 9980, 13153, 23057, 28298, 17545, 16651, 8750, 9425, -2900, 3800, 18954, 23614, 12907, 18602, 20381, 7936, -7720, -12889, -8988, -9391, -11339, -856, 6202, 10181, 14120, 10712, 7039, 23287, 21814, 8875, -2052, -2298, 10128, 11482, -3340, -15313, -15058, -15563, -11772, -7877, -16552, -24851, -20512, -14715, -12819, -3611, -1177, -3198, -5695, -1363, 2376, 9979, 9376, 8214, -11324, -15852, -4776, 6631, 13789, 12794, -4537, -13753, -17989, -17304, -12927, -9012, -17053, -5382, -7011, -7400, -10015, -1418, -416, -9067, -8404, -6374, 5289, 7792, -534, -4133, -11249, -5214, -2357, 4960, 10157, -4655, -22601, -26979, -19351, -11639, -9786, -4220, -943, -3517, -5442, 5976, 866, -8961, -362, 21283, 26240, 18311, 8752, 11697, 9238, -548, -847, 691, 7887, 1281, -5503, -12548]
17508a2548p371m465J5233J2516K443k451k952r467r276J943k32Q63J4088L020
17494A344j764j3928L453J8686m198j2859k166m748n909o605m468J1082J7770
17481d310P398n495n711L741k185j3113k045J6545J1051l465j612M264l610j0602
17467i149K870M547o048K53l571J969J0045R43j2729j1603q373p99L184P217N019
17452a6225J759J187q976k52J4063J22J2318J4113K0378K9715M4254J9007j6663
17439A14800k4181l3122j8047l26k0249q693J990K059j5276o529l596O917r608
17426a3861m105L449N801J3345Q331L452j601p844q643k67O603L869J1372N74
17412B0475j0044n622J82M319p853o69J0216J1638r332k0331o558J403N211L051
$$ y = [-12548, -19919, -24384, -9151, 3365, 5808, 3357, 405, -9062, -18338, -16395, -16627, -15764, -1676, 1344, -420, -14348, -10895, 7791, 3593, -9266, -11432, -16180, -22089, -28694, -33162, -22080, -4310, 3088, -2407, -8118, -4377, -6562, -19675, -21720, -5175, 5876, 2411, 799, 5063, 1453, -9149, -6279, -1732, -7780, -7527, -11098, -9129, 916, 1859, -10870, -22473, -30846, -31645, -28461, -21244, -16225, -14466, -13279, -22255, -22507, -8444, -8322, 3996, 18109, 38487, 68202, 112456, 131463, 114800, 90619, 57497, 39450, 39124, 18875, 10182, 12172, 14231, -1045, -7574, -11170, -4253, -13861, -17966, -14517, -8716, 4629, 12960, 16412, 14811, 6967, -1676, -1943, 4660, 8529, 19901, 20475, 10431, 4809, 4991, 9310, 1457, 788, 11004, 22642, 13310, -7021, -13579, -12176, -6965, -3914]
17398c914Q619K94k721o058O48J094j4737j370J4259k152q881N889L581k938r87
17383i374L483J163m863q524J399R526R699Q253K653K696k423o431N548l222j6500
17368f917j6168K153J9714M333j2674q669j2975N20R246M170j2393j1820J2161
17355b9319J3186l176J728O93j001J6643K693p475N288O584M521L377l201k749
17341G792J359j2895m641m29j374O402k699J1692k08r251o624p599q96J4992N904
17326A525m172J6278J095j7045j2434L518N62m41J3280N442m241n714O808p159
17312b698j9557l063O720P951J7652K146j6001j0167L19P366q93k29j4689N162
17298a9981K102k539R289M663K685n907l393L839k027n178q167Q155l342P395
$$ y = [-3914, 4705, 4999, 2278, -3780, -3132, -2038, -16775, -18145, -3886, -6038, -14919, -9030, -5449, -8387, -9374, -5891, -4728, -9591, -18115, -16716, -7190, 2509, 10762, 13415, 16111, 13688, 7257, 12805, 9583, -6917, -23085, -20932, -1218, 3115, -9559, -18228, -31203, -30683, -21437, -17267, -29660, -41480, -29319, -16133, -19309, -17581, -16888, -17889, -1246, 1447, -6028, -740, 5844, 10365, 13742, 10541, 7792, 9151, -3744, -8385, -8814, -10188, -3786, -6485, 5207, 4999, -4252, -10876, -18475, -19371, -4379, 1525, -2647, 13631, 14726, -2319, -14753, -11235, -10673, -11114, 2166, 7608, 3367, -2347, 4461, -2698, -22255, -25318, -18598, -10647, 7005, 9151, -6850, -17017, -16698, -9332, -10225, -10454, -25143, -19981, -17879, -20418, -11129, -6466, -3781, -9688, -13081, -9242, -11269, -16447, -24614, -16459, -19801, -12406]
17284a2406J0875p514p000n816P93L791L767N674J883j3424Q50j250P952N202
17270f623O108m295n417j3807l295Q028J258J1878L006r245L399j103J8095m78
17256G509P15J191n201m95L531k844p742N773j1287j0140L696n665O077K2762
17242G880O991j0715O244j4457q425M173J893r8P832J1461o659j679R006j5882
17228b435r395M543P698J1856N275j9263j1562m132k307O943J2869o441L135n013
17214h229O633J2187K805n882j2324o314K199m392O629M458K008M884N231L441
17200A3334j0661K750J760q040Q523j966p217J1258J4816l162L160q594j3841
17187B120l714k777r099M326J2790k135o168j776R002N845j0243j0741o256L764
$$ y = [-12406, -1531, -9045, -16045, -21861, -21068, -17277, -13510, -7836, -5953, -19377, -18527, -19777, -11825, -6623, -515, -4810, -10227, -24034, -27329, -19301, -18043, -6165, -3159, -12404, -9005, -10108, 7987, 7509, 8224, 9415, 4214, 3719, 7250, 4406, -3336, 2437, -8850, -18990, -15294, -20959, -14882, 7880, 14871, 4156, 10400, -4057, -12482, -8309, -6416, -6514, 1318, 12779, 6120, 4441, 13447, -2435, -11830, -7287, 411, 12267, 17542, -1721, -13283, -17415, -19722, -12779, 90, -6351, -3216, -8229, -1596, 10591, 13396, 7514, -4810, -11124, -8925, -13317, -6688, -2230, -222, 4662, 9893, 13334, 2673, 5423, 7183, -857, 7666, 5700, -1517, 9741, 24557, 21395, 24555, 15961, 2120, -1594, -4371, -13470, -9144, 3646, 1511, -4657, -6433, 2569, 8414, -1829, -12570, -18826, -15062]
17173a5062Q840k038l801P236O412J632m299j107L084n632j3833M73R678j098
17159i515p929l702M677j92L793K174J522M428K688j0304K738Q655p03J0690J3000
17144B2020Q917J575j6746j3978n352j0535J457J6310K836N331k090L808Q63j0048
17130D368N635K530q900k871M741J0108J801l624j6916k1139M486q64j1009Q123
17116b3531K1059O370K995j4809p171m629L346M343M821P409k911n180j2081L579
17102a6390R870O693N544r60p56l178K317J352j3598k518J0725q310M234J2050
17088G075j4238n041L503P628n656l487N498J595J230J753J0012n964Q409N497
17074A7814r652o813q133R798M104J1306J0575p981j1494j2455n961r31N503n002
$$ y = [-15062, -6222, -8260, -12061, -4825, 1587, 3219, -1080, -2187, 897, -4735, -18568, -18095, -8417, -9515, -17444, -21146, -16469, -16661, -12868, -10694, -9172, -4744, -2056, -12360, -9622, -967, -1670, 9020, 22020, 30937, 32512, 15766, 1788, -3564, -14099, -12642, 3668, 6504, 11835, 9745, 13553, 14416, 4368, 10003, 12533, 3633, 762, 5503, 15611, 17412, 13788, -3128, -24267, -19781, -20645, -31654, -23531, -2472, 3898, 6893, -7916, -15087, -19716, -16370, -12027, -7206, 203, -2708, -7888, -19969, -16390, -6520, 173, 5717, 4757, 4001, 823, 3140, 4492, -9106, -11624, -899, -9209, -4975, 7075, -7163, -12204, -8701, -1073, -6729, -10216, -4718, -3123, -1893, -140, 9872, 3908, 12317, 17814, 8162, 1349, -6784, 3014, 7118, 18424, 28999, 21018, 9524, -2931, -8892, -9823, -4320, -9322]
17060i322O183j09K005K780K155o19J5079O341k275j2370o7p330J008M427J274
17045I160q786J0430p283j2858k884K101j023q284P024J8133J557j3614L525M097
17031A295r637j0509P973N001M929J405J553K721j3943l385R520J73j0688q990
17017b2582N746n882j2156m712J8018J5776O455M589M960q66j6195J198L506p063
17003i208p928j84J3191k787m624l359j280M053M765j2861m520J3559O758K934
16989a491J779l615J0704k86j5528q128m786k104K594P730r313o083J8778J2098
16975B349P76l007J644j092J129j071j2573o223P70j33l202J0073J3545j643p299
16960e957K418O427l917l651J8685l63j2952j0770l647o98J3999Q697n049o358
$$ y = [-9322, -3139, -3248, -1243, 1537, 3692, 3073, 18152, 24493, 22218, 9848, 9781, 2451, 3459, 7886, 9160, 374, 10804, 3521, -9337, -12221, -10120, -11143, -19427, -12403, 5730, 7287, -6327, -2802, 1295, -8342, -18851, -10878, -5877, -948, 457, 2010, 4731, -9212, -12597, -3077, -2904, -13592, -22582, -16836, -22718, -34874, -39586, -21568, -5792, 663, 5252, 10212, 9346, -6849, -5651, -2145, -9208, -17136, -17320, -4129, -6916, -11540, -14899, -16179, -12126, -7361, -20222, -24742, -11183, -4425, -1491, 288, -3327, 7377, 7091, -8437, -16565, -21351, -23455, -20861, -13131, -22444, -28527, -9749, 2349, 3125, 118, 1762, 670, 1799, 728, -11845, -18068, -17298, -17431, -20633, -10560, 2985, 1342, -5957, -3539, 2888, -1029, -4680, 14005, 13642, 690, -10080, -13727, -14425, -426, 8271, 3222, -3136]
16946c136j825J2165P962n06M082n434j4980j0965n593J0551q159N083j08q375
16932a9238L068m334n212J644J0900J4166L968Q758o999q562j0514q003Q424J0122
16918a812n290l129q283P809K3276K758k237n32N906l721j0363o401j2141j794
16904a5954P7J771j597K928P697l684J415p444K235J1849J5713N000K090o59m924
16889A6513r301j4749o196K63n73N959L436M290p753J516P002N852j0682K289
16875b134j2013l891P868k489k039N686J3228R612n868K541M916J722o555p908
16861B676j7563p766o597l617J863O351J9319J3275J1154J2021J1485M529J437
16848D8567j9186j2250k018K322q093K818N25L41K21j1790M841R733j222n426
$$ y = [-3136, -4961, 7204, 15166, 14660, 18742, 13308, -1672, -12637, -18230, -7679, -15838, -10755, -10863, -19238, -16170, -20504, -25716, -24072, -13172, 994, 4962, 13720, 6721, -1841, -12355, -20358, -11934, -1812, -7102, -10231, -18514, -10705, 12571, 15329, 13092, 12560, 18466, 14745, 4382, -2019, -14160, -15954, -15877, -14106, -15703, -12775, -5078, -8762, -7347, -14791, -12556, -707, 15006, 20006, 22096, 21437, 16513, 7212, -7537, -13733, -13470, -14043, -8084, -4648, -358, -8111, -6595, 407, 6259, -4423, -2134, -14147, -18038, -10170, -12659, -14698, -9012, 4216, 13828, 7960, 10501, 15417, 17139, 10584, 2676, -14887, -22653, -29250, -32867, -31004, -24653, -5334, 7941, 19095, 31116, 42601, 47130, 48567, 29381, 17131, 15113, 17435, 9342, 12160, 12685, 13026, 13247, 1457, 6298, 16031, 14809, 9383]
16834I383J767o68j641j9058j0548k258m697o069R036J6805K6679K644r884j9496
16820h005r70j080N639J5225O657M044n126O474n45L517K60p302j0574M385l75
16805A2224j3406j2431R60O331Q125Q065j460p956j8811k2760O36m596m151K444
16791d6786M985K1109J1789q238j1620N406J6603Q561K405m039J2127L939J537
16778A7778K804n770j5030j2174j0735j2618J7588R290O986P028Q514q392j2756
16765g487o710p991J2890j561j0463O459J0278j2125k627J3972P778J485m109
16752b11l372k880o182r866o445q92K059M889J2038n130j2672L255J0580J0980
16738c849L656O452J52J2204L670r431p801J277o361j6759o793R582p487n646
$$ y = [9383, 11150, 10482, 8841, -10217, -20765, -23023, -27720, -33789, -24753, -7948, 18731, 21375, 11491, -8005, -8975, -10055, -4416, 10809, 17466, 21510, 16384, 22858, 22313, 25830, 26090, 18788, 8214, 12599, 12224, -1182, -13613, -12653, -6322, 1803, 9868, 8408, 452, -18359, -41119, -40483, -45079, -49230, -46786, -41801, -20692, -8903, -17141, -28761, -23355, -6752, 1809, 4214, 175, 12302, 16241, 17778, 20582, 14812, -218, -12392, -23127, -35745, -18157, -8867, -1881, 5147, 13661, 5269, -7487, -14197, -22188, -9298, -10859, -21322, -14863, -4585, -16710, -19337, -5365, 2413, 3898, -211, -3583, -6463, -12645, -22511, -28956, -29848, -27789, -22900, -10862, -15992, -28664, -25409, -14829, -3849, -193, 6259, 6411, 18615, 22285, 12854, 5053, 6330, -31, -16790, -23583, -14001, -21488, -27134]
16724b7134J6925K495J965Q937L01j596n224k826O745R749L882j2040o583Q319
16710C915P180r85j5241j496J0181j755o89k810q591K132N944l989N58m752j45
16695a0543q167P470Q0N594n049m410n724Q732K1413o95l86R654P585j024n160
16680A9370j8235p248L962M374L536p211J799j5650m49Q982M380J201N914P489
16666A2214p943P40m40j712M013O163o876j2859M085m772r17j071j0460p184J929
16651b5090R473O429p0o49r193o021N513K081M408J2013O484j36q528o813j525
16636a1624P00M40J5534J1787J2924J0880j3111k9685l295R788J639O70p172r096
16622i621j0454m987O952k618j263J9922j114M65k701p597M75M761l94K315M48
$$ y = [-27134, -10209, -7714, -5749, 3188, 3489, 1893, -3331, -6157, 588, 10337, 14219, 2179, -4404, 3915, 11095, 10110, -5131, -6627, 3554, 1799, 1110, -1700, -10291, -8159, -2215, -6204, -5646, -10398, -10543, -18710, -11240, -11160, -5566, -10615, -15025, -20749, -12017, 9396, 8701, 8315, 17969, 25554, 24530, 19370, 1135, -6113, -2151, 2223, 5759, -1452, 347, -15303, -15752, -6770, -2390, -1189, 4725, 12214, 4271, 5011, 4571, 2859, 6872, 13035, 6159, -6700, -2615, -7387, -8304, -9375, -19835, -27019, -25090, -15617, -9188, -9258, -9907, -19100, -25121, -19608, -17527, -13119, -1106, 5378, 5242, -3286, -10099, -11624, -10924, -10484, 5050, 16837, 29761, 40641, 27530, -2155, -5450, 4338, 5977, 6647, -525, -9621, -20075, -25062, -18110, -20728, -21991, -2069, -3183, -2718, -5419, -13016, -12541, -7780, -8174, -5859, -5411]
16607e411k307N681j48J081k422q824L785J2734J0887J342j7210k827n206O365
16593b480j160o940J4845O583J3673k087j1393r456n458J064Q292N453j572k479
16579F885j8330l376J2263P220k607N057J578j7041L704J7545n811p29k128k569
16565A661K279M48l676p901n357l464P344r53K663L503n144J1750J8716j3157
16551H712j1823L237L528j478J330O40l80l872n942p044J2257n531q61j575o215
16536a5017L732P49K445q14R003O705N369m160j3406p672J911r752L98j353j0153
16521c2015L663k568J222J3435m126l31q261R868J0508k208l102m41R343L996
16507a017P132j0615m691J0091o882l927J4196J8655J2121P618j9888k1864j3845
$$ y = [-5411, -7718, -2037, -2185, -1104, -3526, -12350, -8565, 4169, 15056, 16398, -812, -3639, -8845, -2480, -3640, -10580, 4265, 10848, 24521, 22434, 11041, 1585, -3873, -2809, 5483, 10936, 9364, 6885, -11445, -14821, -2558, 4662, 2055, 7112, 8690, -8351, -4647, 12898, 7087, 6358, 4230, 1661, 3940, 4388, 712, -7189, -12546, -16010, -8666, -9619, -6956, -3453, -8597, 3153, 21869, 8712, -3111, 126, 3654, 2176, 3506, 4146, 3766, -106, -6048, -13092, -835, -6366, -7227, -8802, -15017, -11285, -10536, -8091, -8905, 98, 6803, 12172, 8012, -5394, -13066, -11155, -20907, -20509, -21862, -32015, -28352, -30920, -29698, -16263, -20389, -20720, -28981, -19113, -8605, -10813, -13915, -14356, -5013, -1017, 6115, -4500, -9191, 900, -5982, -9909, 4287, 22942, 35063, 42681, 22793, 929, -12916]
16494a2916N54J8282k953L23k045M086j3053o122O652J0514p434j477R776r02
16480C285l514k720j0851m537p219L07J0701o619L45J351p153J390J0591j096
16466a5739l547M41P178J0123J5126o146n515j061R880J4222o765j0966q990M10
16452a349m909j3423j0436O926J1337L817r611l919J5646P979Q738K269j0785
16439B280N009L714j1083r8j395j550m466j1730L528P788K0469J2396J2841n701
16425C2002r254K460M250l037r185j691n566j311j4054j9179J8K365J6979J4582
16411I379j419L90O407R727J473K976q953l0374r452M592K438N882J3071p905
16397a768J083N836j2039J003p3k656p046j2109R109J2794L939N496P179O997
$$ y = [-12916, -12362, 5920, 2967, 3290, 1245, 5331, -7722, -13844, -7192, 3322, -4112, -5589, 4187, 3285, -229, -2949, -13800, -18337, -25556, -25249, -14548, -21167, -20822, -19471, -26624, -25234, -14643, -15739, -19286, -18845, -11667, -1544, 13582, 7436, 1921, 860, 10740, 24962, 18197, 7231, -1759, -1349, -6258, -19681, -30117, -23191, -11854, -8037, -17648, -21567, -5921, 2058, 10796, 13065, 2280, 7289, 11003, -80, -178, -1573, -3123, -7589, -19319, -15791, -8003, 12466, 24862, 37703, 32002, 22748, 25208, 29458, 26421, 17236, 15545, 9979, 8668, -5386, -24565, -24547, -22182, -5203, 9379, 7960, 8350, 14757, 24484, 25957, 28933, 19980, -10394, -19846, -15254, -12816, -6934, 6137, -1768, -685, 5151, -6888, -5885, -5958, -8614, -15660, -27769, -18660, -5866, -1927, 3569, 10748, 17745]
16383A7745K392k36p045j5480j9746m412L625p208j4500Q4J7526J6051Q757j1976
16369a4423r073k744N763J1345Q337o815m452J1442P960M070M603J0946Q316p697
16355B7578m719J793m960j2827k670J3330O497j647Q806L891q63j1033j3247j7820
16341g891j6971q146Q93M076O097j578J0496J572P15m546L093k6016j1285M101
16327d5390M43n88m942O998P481J1850L387j0283l41r65J4040J7430J3636M479
16313A7235j1940j8690n239K941M99o493L502K0212J1260Q976K470J6082P334
16300D8149j5913k0654j5323n940j139P89J3597J6853K735K390l961q239j9221
16287e877r180r912L167j097j1275Q488O695J809N340l679l76j049l996q594n04
$$ y = [17745, 20137, 19901, 12856, -2624, -22370, -26782, -23157, -30365, -44865, -44781, -27255, -11204, -2447, -14423, -23496, -26240, -20477, -9132, -795, -7610, -12062, -620, 7340, 11410, 16013, 26959, 35275, 27578, 22859, 24652, 19692, 6865, 4195, 17525, 24022, 22375, 31181, 35072, 34209, 23176, 9929, -7891, -24862, -33008, -32115, -28039, -21942, -23520, -13024, -11452, -10737, -15283, -12190, -38206, -49491, -45390, -44947, -45535, -50477, -43479, -35998, -24148, -20761, -31044, -31385, -32350, -18310, -880, 12756, 17235, 5295, -13395, -18634, -15693, -15194, -21687, -18185, 2027, 13287, 22263, 24733, 40815, 48149, 32236, 11582, -3741, -9681, -10820, -10031, 3566, 20419, 23154, 25544, 21583, 13344, -5877, -15057, -24969, -21802, -22899, -34174, -25686, -18991, -17182, -11842, -15521, -15897, -16946, -20942, -29536, -30040]
16272c0040K978k028N164J1284K883J2487K363j0151r729L97N566k88j5863j6522
16258d1499N013J2000M836q22M977N291L667N903N245Q393j1404r894k934J6977
16244E749J6460n447n337K740m092p742r035O51M46j371J7330L143j5225p836
16230i566o486N688O581k347J199j163N470J6028k418j5838j1379O369K1980q373
16216E745j5655O885P602m480j489m244m504P582m155j667j5170j951J1892o108
16202a9717j473J2369J4141o240q994L946M331q264j349L391n975m701J546j437
16188a8426L180l848j558L331K2201J852j5964j0331O486q1o668K529J787M276
16174a1234J4341m782r878M552o568l433J300N835k602J513Q636m408p384R179
$$ y = [-30040, -27062, -29090, -23926, -12642, -9759, 2728, 5091, -5060, -14789, -14392, -8826, -9114, -24977, -41499, -36486, -24486, -19650, -20472, -15495, -10204, -6537, -634, 4611, 13004, 1600, -8294, -11228, 5749, 22209, 16762, 11425, 14165, 10073, 2331, -6704, -6053, -5607, -6978, 10352, 13495, -1730, -9566, -16052, -10364, -3783, -6130, -4931, -6094, -624, 15404, 12986, -2852, -14231, -7862, 14118, 5745, -9910, -3025, 4577, 97, -1392, -5636, -10140, -2558, -6713, -8380, -23550, -25501, -13609, -19717, -21190, -8821, 5320, -920, -9914, -5968, -1637, -9901, -11250, -7859, -13834, -18535, -16989, -18426, -15246, -19094, -20652, -17321, 4880, 6732, -9232, -19563, -13077, -13158, -19826, -17297, -15510, -11234, 3107, -1675, -11553, -7001, -13569, -17002, -15702, -9867, -12469, -10956, -2320, -6728, -14112, -4933]
16160d933Q393p98q643o129J0995L788j3731n329K0978p77j4596M201P081j827
16146a327K576l460N61J0447j4094q933k103n220O166N041J101q446J2899J0403
16132E611O757M359m362j1400j7765j0787R484m759p217R562N892n49j463J899
16118a4738j3753q145Q915K4674O336M02o884p485m55l691l743L417L211L709
16104h230m293N787J7638o338j7031r615R853N595J206o709o711O731L244J0364
16090A491R514o839l580O33n003R56K215J0374j0476r294l373N514M001p132L204
16075g795m636L179J3181Q444n367j048o936j8772l174R90L492m168n832J2715
16061a5727J9981j260K226Q815p724p215p653O810R049J1212R318o131m771m993
$$ y = [-4933, 3460, 2662, -5981, -12110, -1115, 2673, -11058, -16387, 4591, 3814, -10782, -6581, 500, -1327, 1249, -2211, -1650, 8797, -5297, -14230, -16333, -21553, -15387, -10346, -9245, -17691, -4792, 5611, 12368, 16727, 12365, 965, -16800, -27587, -18103, -22862, -30079, -20517, -14625, -15174, -16637, -14738, -28491, -36636, -27721, -3047, 3289, 3691, -3193, -10678, -11133, -14824, -18567, -15150, -11939, -8230, -12523, -6736, 10902, 4564, -12467, -22082, -12229, -6634, -5428, -12137, -18848, -12117, -8873, 1491, 11005, 4166, 586, 1219, -3784, -2828, -613, 9761, -715, -10009, -13382, -7868, -3867, -10999, -7795, -12431, -9252, 3929, 12373, 7006, 5958, -978, -19750, -22924, -21934, -18442, -22610, -28442, -15727, 4254, 2994, 5220, 14035, 6311, -904, -8557, -1747, 7302, 18514, 27832, 21701, 16930, 11937]
16047A1937j9282J025o604k995J4717M920O22m313m653k729P780M466L645J212
16033I748j2129o012K982L278J512j5484p46J7614P65r286J946M421L654m768
16019b505m020P693J95l442O14N248L220J978J740o130k640j892L917J32Q031
16004A2139J1336k095o140j1421K710Q279j1703j4956L205J400P851J141J3529
15991A5275J764j8359o059p294n34K781J0740J0382J1266J364j4625L490j7090
15978f899q791N702K518l608j1696R21N013N562J3906P755m064n947j5969o191
15964b1788n677j930J3393J2407O519k106r46p439J2414N172n957l763n023Q801
15950D077k377n165Q71J019K353Q076M629N322j2810j8358j2585n412r29J6253
$$ y = [11937, -7345, -6320, -12924, -15919, -1202, 3718, 4340, 27, -4626, -7355, 425, 4891, 8536, 9748, -2381, -8393, -5411, -2133, -621, -16105, -16851, 763, 1528, -7758, -5812, -1391, 2263, -2505, -6525, 1168, 1363, -2079, -1465, 3783, 7003, 8981, 10721, 4591, 1951, 59, 3976, 4108, 12139, 23475, 21380, 15240, 3819, 6529, 14808, 3105, -11851, -8646, -7246, 605, 1746, 15275, 17039, -1320, -7379, -14673, -15207, -12426, -1686, 8696, 19962, 21326, 6701, 10191, -6899, -15690, -9988, -7470, -11078, -22774, -21853, -16840, -11278, 2628, 10383, 6319, 372, -15597, -21788, -27465, -29395, -16002, -3595, 2924, 818, -128, -7567, 4847, 10019, 4062, 299, -4724, 4077, 1700, -3465, -2594, -1575, 778, 8854, 13483, 18805, 5995, -12363, -24948, -30360, -31289, -15036]
15936a5036L883O149P678L631Q233k682o952j0540N764L544k770p028l641j372
15922a1139l96l073k649n450k982O896N177j345J150r399q253R831J6419M868
15908c45j7042r318j388N573R549O241L671J633q340j1737n271R879J6201L493
15894B799J222j2149n291l69k440K922J4840R254j4612J320Q622p855m584n353
15880a1674M451q950q603j0189J3623m66j3947J2582J2406k25k589J1052o282
15867h811j7569P80o877O06M554J864K927J7256p593q102P10P748L744m233l631
15852a6627j2185Q067K2334J0118p207K767J4030n035q56l060o418N006K623j7405
15838c848m69J094l769n996J116m61R994J2733m396p06p974q896P177m960r60
$$ y = [-15036, -11153, -5004, 2674, 6305, 14538, 11856, 4904, -5636, 128, 3672, 902, -6126, -9767, -11139, -11535, -14608, -17257, -22707, -25689, -18793, -13616, -14961, -13811, -23210, -31463, -21632, -5213, -345, -17387, -26705, -28093, -22520, -12971, -6730, -3059, -1426, -9766, -21503, -26774, -16895, -694, 2799, 4021, -8128, -13419, -13788, -16228, -13306, 1534, 10788, -3824, -2504, 6118, -1737, -6321, -11674, -7223, -16173, -24776, -34965, -21342, -21808, -35755, -23173, -10767, -10992, -13581, -2529, -8811, -26380, -25600, -32477, -31871, -27317, -25453, -22526, -5270, -12863, -20965, -20255, -12507, -8763, -12996, -16627, -28812, -20745, 1589, 11707, 4500, 7267, 21297, 16262, 15406, 12346, 5928, 10934, 13557, -3848, -4317, -3223, -6992, -12988, -11872, -12333, -2339, 10394, 5998, 5292, -2682, -11578, -4401, -9361, -10321]
15823a0321J1644Q412N681n385k5142q571O960J174J695J850M222r039j769P527
15809a1062p68m09J959J820j71R8k644o054p843J818R935K081J35J6052N710M192
15793A4849o171k214n896m570q249q329O020l111j754N302O649q603k367P845
15779a0599J2981m42R311K542p539o432R85p862K191o342N732n092L129Q464p543
15764f516m134q768j1896Q699Q004m624J0207J2560j237R146j015j2780n458r048
15750a6860l956N137P341M017m470j839j963K209Q335M575J835L280o657m983
15736c999j0652L626L415N084L396m060K226j849j056k561K3l73j3069k728J83
15721b2394K251J8938O517o890k000N285P799q005k683k924o287n717J2990L920
$$ y = [-10321, 1323, 9735, 15416, 10031, -15111, -23682, -16722, -15548, -13853, -12003, -7781, -16820, -18589, -11062, -11830, -12239, -10280, -8460, -8631, -8533, -11177, -17231, -25074, -23256, -13321, -11240, -11105, 4947, 10657, 14849, 8678, 6464, 568, -4002, -12251, -20580, -14560, -17671, -19425, -14123, -7474, -16077, -18444, -10599, 2382, 1940, 11251, 13793, 6254, -178, 807, -7055, -4864, -11206, -5474, -10566, -7437, 1027, -6516, -10650, -19418, -31314, -22615, -14611, -19235, -9028, 3532, 2295, 11441, 10426, -2354, -7812, -16860, -20816, -15679, -8338, -4321, -8791, -10630, -12593, -10384, -2049, 2526, 4361, 7641, 984, -3999, -14651, -11025, -7610, -2526, 870, -3190, -964, -2813, -3869, -6430, -6407, -6780, -19849, -22577, -22394, -20143, -1205, 5312, -1578, -3578, 1707, 9506, 1501, -1182, -4106, -10393, -16110, -3120, 800]
15707H00M839L101p090o653L145j0001J009N264l357o741n0p512j246J0028Q836
15692e628R399K429j4011M589k282o451M690L525J232L652o886M897N894n186
15678a37j1976k936N180K723K538l807k765M563P964j2173j5709L485J6332j6
15664f734R235J1865k423q553q265m979n708O371R860J6672n405N361K086j7686
15650A697r951j8734j0765n204r7J6267J5794l138q486N687j366o252L128Q202
15636a3218M79r469N106Q950j0499K639J4383k130J1422N815p197o354j2264j1765
15622b4102j0585J4709J3133K151q597O289K0427O712j4314q594P43l77k706k178
15608g289J973j1652J332k6M284L455o813L693P682m030q586J867k349Q613P118
$$ y = [800, 5639, 8740, 1650, -5003, -1858, -11859, -10850, -5586, -8943, -15684, -15734, -23246, -24492, -14464, -5628, 3771, 6200, -7811, -3222, -5504, -11955, -7265, -3740, -2508, 1144, -5742, -845, 5049, -137, -12113, -15049, -9869, -7146, -4608, -8415, -11180, -6617, 1347, -10826, -26535, -23050, -6718, -6734, 2501, 14366, 11943, 3390, -4875, -9854, -15562, -9191, 669, 17341, 11936, 17297, 19383, 1697, -8254, -26988, -37753, -42957, -43054, -26787, -10993, -14131, -22617, -16930, -18296, -24548, -21420, -13218, -12739, -22208, -17102, -8152, -18651, -16012, -1629, -3759, 7663, 13478, 6281, -73, -12337, -24102, -34687, -19978, -6845, -4694, -13291, -7002, 13425, 20137, 5823, -2771, -2028, -2405, -5111, -7289, -5316, -16968, -15636, -15662, -11378, -7923, -14736, -11043, -3361, -7391, -15977, -14110, -16459, -7846, -728]
15593g28j2038j9R217j735j6262j1297P160K665l311K573n070J25J8094K954J15
15578g557o733m259q330p52J5857J0760n98K194n171j7103j3344J3087o7o117
15564b8133J303J0823M307j0594P13o66J5251O5O50m795j808L413k292j4524Q107
15549a8180r48j2752N68L742M400J3507O536j12N589J704O979j313o732L254k075
15534D167q032j539J645q505k859q67m0l675p436q26m913J5222J5400k627j6865
15519b1750q317O248M097k41L142K945L497j815L416K225r488j1556j5590J4602
15505b8585J3093k699j2011L751L584J2918N211o526q689P806K0942J73J798l389
15491G377j4144r995N31J1293O969k358m567N033L902r060Q389M510j2313o994
$$ y = [-728, -12766, -12785, -3568, -5303, -21565, -32862, -25702, -23037, -26348, -23775, -28845, -28720, -10626, -7672, -7557, -14290, -18549, -26879, -27631, -11774, -1014, -1612, 582, -4589, -21692, -35036, -21949, -22016, -28133, -26830, -16007, -11700, -22294, -21581, -22247, -6996, -6931, -6281, -11076, -12884, -9471, -11763, -26287, -18180, -19128, -31880, -31312, -27570, -23170, -9663, -3127, -3239, 2350, 4054, 11033, 9720, 2988, 6242, 4167, -3865, -5404, -3759, -12264, -15123, -15990, -16030, -19705, -27141, -27967, -32880, -17658, -2258, -4885, -21750, -30067, -23819, -19722, -19963, -16821, -13876, -10379, -12194, -8778, -6553, -16041, -27597, -43187, -28585, -15492, -18191, -30202, -26451, -22867, -9949, -4738, -11264, -19953, -12147, 8795, 8968, 10766, 7377, -6767, -16762, -16231, -4938, 2031, -327, -4894, 139, 4041, -5019, 3370, 7880, -4433, -11427]
15477a1427P138J0171r837m599L976R695J4047j64K128j2213j8639j973J291j3511
15463b3917l27J3721o206l093N466q7J5290J006l401p028q108q972O557J0102
15449h997L82j0006J4343J6178M331Q002j4301j6057j3866Q00N095K68J658N70
15435a1600R43K830l58q146M030P471M045N545p804p891j31L412l497M347O656
15420a48k154J0468Q472N46q973k079Q838j6401j2042q871k364J2984P545L194
15406i85r384o841r793K709K1220J8472P406j0747o845r008j0484m753K220J040
15392a5773Q171O251J0826j315q986Q6J0290J3078l677o455j688o985j9468j2318
15378b7963Q323L078J05J5247O843M978m719l361J6348l218j333j966r944r583
$$ y = [-11427, -4289, 5882, -3955, -8554, -4578, 5117, 19164, 19000, 21128, 8915, -9724, -11697, -10406, -23917, -24244, -10523, -16729, -19822, -14356, -14443, 847, 1853, -1548, -8576, -16684, -25656, -19099, -8997, -8615, -18621, -4278, 11900, 16231, 24233, 9932, -6125, -19991, -19191, -14096, -13828, -12170, -11600, -10657, -7827, -8185, -16331, -12301, -4830, -785, 4760, -3044, -10935, -11066, -7654, -11151, -6804, -148, -2302, 8166, 16638, 17184, 8211, 6132, 14970, -1431, -13473, -22344, -24708, -11724, -4179, -985, -10369, -17210, -27003, -24294, -3074, 15398, 22804, 12057, 5212, -3796, -14280, -19033, -16813, -15773, -7602, -1351, 9475, 8160, -826, -740, 9550, 22628, 18951, 12496, 10808, 3823, -15645, -27963, -19640, -16562, -16457, -1210, 5633, 10611, 5892, 2531, 18879, 15661, 14328, 12362, 2418, -7165]
15364g165m705M53q486O467L036k551j962k662m410L004J3405L961n939J858Q238
15349B542K242p283M356l979j578j893P626J627J003M144K042n632o248j1390
15335a2421p587k80J2972q46n121J177M467q896j2556q420P772R984J5266j210
15321e699Q562J966j5739m53J561j7816k962K844L501J6100J7150R48J944p908
15307C999k1751q405J3539j891j126m194j641o75M920J771P8Q479M234K0717p556
15292A0498r045m862P982n595n501o662O81N936R294M720j88K461k326j9385J68
15277a1824J2849P413J3j7218j2766k04J7132k820q379J0300J9981J224q11M51
15263A5341k4990k062Q680R063Q34M203k923j375j6389j8849Q254P881m676K448
$$ y = [-7165, -11870, -11417, -19903, -13436, -10400, -12951, -14913, -17575, -21985, -18981, -5576, -1615, -7554, -5696, 2542, 4784, -2499, 1857, -2122, -3700, -5593, 2033, 3660, 4663, 8807, 10849, 5217, -1031, -12421, -20008, -20288, -7316, -8162, -13283, -12106, -7639, -16535, -29091, -37511, -29739, -19755, -4489, -5699, 2863, 4829, -10910, -11363, -9802, -27618, -30580, -27736, -24235, -8135, 9015, 9963, 11907, 3999, -17752, -26157, -12618, -14509, -15635, -19829, -21470, -22145, -17225, -15454, -15376, -6897, -2663, 18054, 10498, 1453, -3409, 4573, -1022, -6523, -13185, -12504, -6568, 2726, 7446, 7258, 9719, 7393, -11992, -11824, 1025, 8438, 8451, -8767, -21533, -21737, -4605, -7425, -15804, -5504, 14477, 15701, 14890, 15341, -9649, -11711, -3031, 6032, 6866, 11069, 8146, 6771, -9618, -28467, -20213, -12332, -17008, -14560]
15249a4560L947J7255o495k450n957m389K593q279p553J3252N024L628k384O428
15235F0P122j3778j7691O212Q48r097J4444n484l656J3056J042n632l355j423
15221a7332p318q44r082k441K278L006n167N362R905J0455L251L479K620R011
15207G183r973o606Q346N088j6548m317M711P693n4K414n383L679k655O1N607
15192g54J075j4642j6229j288J2822J2561O537K822o752q328n920J657k004j4329
15178c2772L908O951N723N780p394l992J1126J368p77l868J8788J5002r89r465
15164I389k3404r649l38J0364J1352k477m44r651q941R439O12q979L536O904k681
15149a4968O772k301J257K051J1645L769m697k0832m425K8665J778p662j474j0295
$$ y = [-14560, -10613, 6642, 147, -2303, -8260, -12649, -10056, -18335, -25888, -12636, -7612, -3984, -6368, 60, 7182, -6596, -24287, -18075, -17227, -26324, -11880, -17364, -21020, -7964, -6922, -12554, -15909, -17332, -24650, -25494, -34576, -37017, -34739, -31733, -36900, -31538, -21633, -11178, -7927, -4448, -1828, 7183, -2790, -9396, -1050, 4038, -12510, -16827, -12116, -4423, -4477, -2063, -7446, -3767, -6422, -6361, -754, 321, -14321, -30550, -31838, -19016, -6455, 82, 2904, -3848, -12176, -18096, -16439, -18443, -32772, -28864, -21913, -16190, -10410, -17804, -21796, -10670, -9302, -10079, -13947, 4841, 19843, 18854, 9389, -14015, -23664, -24002, -13638, -2286, -4763, -5207, -14858, -23799, -14360, -13748, -22727, -19191, -12287, -14968, -8196, -10497, -9240, -7189, 4456, 8225, 3528, -17304, -21729, 6936, 8714, 1052, -422, -10717]
15135a0717m175n891R655J0512n434L657n937p057l94k591R657J027r849p302
15121b4839P943J4802Q421l903k422j333O133N190l609K094p702j4204P155M008
15107b266L627p378j609j457k831p814N927Q742j247o072q820o319R267J7222
15093a028M397M344m788j3322r828M198L366M802M327q27q407m492J0918P743
15079A403Q351L948m524k4529k3701j986J9944J112p49j611r567P375O186N964
15065a2384o404N082R667n774q591j601J2211Q000Q008m623l997o847l780M181
15051f852J05K608L554L263p782n401R307r419j7448j2096J1075J1774J1422O30
15037e260o301l743q244J7111P699l204L058N63M025L655Q626K72o387m211k917
$$ y = [-10717, -14892, -20783, -11128, -616, -6050, -2393, -8330, -15387, -15781, -18372, -8715, -7688, -17537, -24839, -16896, -2094, 6327, 2424, 2, -1331, 4802, 9992, 6383, 8477, 775, -13429, -6274, -2266, 1361, -6017, -7626, -9083, -11914, -19728, -13801, -5059, -6306, -12378, -21198, -27517, -18250, -1028, 3369, 7713, 2925, -10397, -20225, -16027, -12661, -7859, -3532, -4359, -12766, -17258, -6340, 1403, 9754, 13702, 9178, -15351, -39052, -41038, -21094, -19982, -20731, -22342, -31909, -24534, -18348, -12384, -18788, -13706, -4039, -9813, -18404, -20005, -7794, 206, 8214, 3591, -406, -7253, -11033, -6852, -6747, -4139, -585, 2678, -5104, -10505, -1198, -10617, -28065, -40161, -29086, -17312, -5890, -5260, -11561, -15304, -23548, -6437, 1262, -1942, 1116, 1679, 5704, 9359, 17985, 18257, 11870, 7659, 4742]
15022D742q508o155J4620n362j4051Q853L966j342P571r23p443K969k694p138
15008a0895K95J6564K553O740M400j2433j0517q746L854j5147n217K0273P099
14995a177r708N729k32j3733M25R870L336J0019j0792j2807P630J5631k675m66
14981A050M1l653j2519j813J221L024k518J497R548L566j0132o932N552J1239
14967h29K913j1485m218q511M906L942k872Q376J245j15K306q083p014J0632l047
14952a1854q285R492J5010j418p393P74r280p347j6220O167P538l549N39P753
14938a8073J2209N634j379j887l532R199L417j3459q911L233J2234P950L2O142
14924A2809q271j3406l330J699k181m173k275J1076Q422P61m490l725n456K036
$$ y = [4742, -3766, -9921, 4699, -663, -14714, -5861, -1895, -3237, 4334, 3411, -4032, -1063, -3757, -10895, -10600, 5964, 8517, 15257, 19657, 7224, -3293, -12039, -8185, -23332, -28549, -8276, -1177, -10885, -5156, -5388, -19121, -18696, -8826, -5490, 4529, -6263, -19070, -11440, 4191, 1516, 1050, 1091, -2562, -15081, -16894, -15673, -12649, -15167, -13670, -4122, -556, -10688, -17620, -12068, -829, 2084, -9401, -13619, -22130, -17224, -13282, -16154, -7778, -6533, -6648, -4342, -12425, -19439, -8807, -11854, -20139, -10647, 4363, 2945, -4448, -3674, -12954, -20301, -36521, -30354, -22816, -26365, -25826, -18073, -5864, -230, -1609, -3496, -7028, 2171, 5588, -7871, -16782, -13549, -1315, 6635, 6667, 12809, 4538, -8868, -12198, -10499, -12680, -16853, -19128, -8052, 370, 1131, -3359, -7084, -12540, -10504]
14910a0504p128r349l18k559k090R035K879O5N451N317K436j389n755N290R310
14895F91o700n646P397J439O970r686M255K661r542j000O982K118n880K526j07
14880c522Q282l723K316K663l156Q922O230n111o305k970P678K2961O488j7023
14866B3730L033Q641j4449n043j457m836r806K469R694Q789L42m909m581M534
14852A6151q385n681j2711r208N557k347K449J6626Q096j074J37R46L457J0878
14838B4891R043L282O613p125P89J887j0470j8799m97J2043L876q681j1111l85
14824E356J9192J5692j2521p822k255L283m37Q09J2323m850p958o453n73r220
14810D566p085j705J788o619r340m407o37m864N608N227o16K885M446J9067N523
$$ y = [-10504, -17632, -26981, -27299, -29858, -31948, -22913, -20034, -19969, -14518, -9201, -6765, -8154, -13909, -8619, 691, -6009, -11655, -4258, -2819, 4151, -5535, -1280, 1381, -8161, -9161, -2179, -61, -5941, -3415, -3522, 4760, 1037, 3353, 6016, 2860, 11782, 18012, 12901, 6596, 3626, 11304, 34265, 40753, 23730, 26763, 35404, 20955, 15912, 14455, 9619, -187, 2282, 11976, 20765, 21107, 16198, 11617, 16151, 7766, 2085, -10626, -19834, -14277, -16624, -14175, 2451, 10547, 9473, 9610, 10556, 14013, 24891, 33934, 37216, 43829, 36704, 37493, 39380, 28910, 10111, 9614, 21657, 25533, 16852, 5741, 5356, 24548, 40240, 27719, 19897, 17642, 20925, 20488, 21297, 33620, 28770, 20812, 14359, 13786, 4566, -2519, -4224, -2436, -9055, -18395, -22802, -23439, -28303, -22695, -17468, -18084, -15199, -10753, 8314, 13837]
14795A3837J422o087j0412j7045K667J7187R156r623n559M140r783n750m62O287
14781a0025M012J4164K436n360j6626L714L991Q35k786J3877m987j0088l136j0416
14767b0395m109R37N313J0893k463M11O823k769k082N81K51J960J619J4117q574
14752B513j8347k404L060M10J423J2522M921O18j5801k544Q319J855L907M263
14738D715P77R850j4445j8853M061k36K710J7708J246j6770l26j785M505j823
14724h666N971M188L359j018p230N606k50o258k940j005m778p91k557Q040M722
14709c607k685n247N613j954m009J5546k60k323M278O147K025j4649M388k316
14695I47q568k182L156K1549N825j1295l843k83K469q341j2372j958l001M905
$$ y = [13837, 15259, 9172, -1240, -18285, -15618, 1569, 10725, 1102, -4457, -317, -10100, -15850, -16312, -10025, -6013, 8151, 10587, 5227, -11399, -7685, -3694, -2859, -5645, 8232, 3245, -6843, -9979, -20395, -24504, -23567, -18254, -7361, -9824, -9413, -2590, -5359, -7441, -6860, -6609, -4649, -3030, 11087, 2513, -15834, -18238, -15178, -14768, -13345, -823, 4098, 4716, -11085, -13629, -5310, -3455, 452, 4715, 5492, 15342, 897, -17956, -13895, -14131, -11421, 6287, 7533, -9237, -9563, -11348, -6843, -8666, -2695, 1493, 4852, 3834, -3396, 2210, 1960, -4298, -7238, -8243, -13021, -13812, -16369, -8329, -3607, -6292, -11539, -5926, -7880, -11889, 3657, 3397, 1074, 5352, 11499, 13524, -1125, 3263, 947, -7621, -9803, -6647, 14902, 20727, 9432, 5589, 5306, 7775, -566, -12938, -14896, -17897, -12992]
14681a2992p740P724m794o844N117Q380J862o461N179O178p042k215J239O578
14667e831n727m24J1341N959j538q200L733L558J2867n192j3682k117P550J5361
14653A7658j3336n141p854q61L269N994K22L282J211m805Q955k474l768j0342
14639g990l031j135l795J664Q958J6058k255j0095m095q814Q175J8632M790j2006
14625E061q351q835R648L279J031j5668k543k136M422K320j3408j510J6119K2259
14611A1688j0508j0206k026J0852J0199l989j0155K854M702j637q778K921L608
14598d75M929J5919l795k3704l737N703M65j223P793m621n068P672N443k12n049
14583D0J0136M095r357l161o386j4485K32K971J6728M423m599j3970Q77R810K16
$$ y = [-12992, -20732, -13008, -17802, -24646, -19529, -11149, -9287, -15748, -10569, -4391, -11433, -13648, -12409, -5831, -11558, -11982, -641, 5318, 3780, -4420, -687, 2871, 15738, 10546, -3136, -5253, 2297, 17658, 4322, -819, -8673, -9534, -6265, -271, -49, 3233, 4444, -361, 8594, 6120, 2352, -7990, -11021, -12156, -15951, -14287, -5329, 10729, 8474, -1621, -5716, -14530, -6355, 12277, 17067, 5061, -3290, -12125, -2477, 802, 1833, -13835, -16378, -18514, -14092, -11772, -25180, -26690, -10571, 11688, 1180, -9026, -11052, -200, 9999, 6010, -4145, -1291, 3411, 1774, -7004, -4083, -475, 4454, 20373, 16578, -7126, -10863, -5160, -4695, -5918, 1875, -2746, -7814, -142, 5301, 5089, 40, 10176, 14271, 4914, 1753, -4633, -19118, -18886, -15915, 813, 5236, 637, -13333, -12456, -2646, -2430]
14568b430o047J1854J0209k530o594M437j853P46L937J729j3903q050L797j4061
14554a8759K271J2002P376j1821j4332N105J1207k546J5840N958p294N433l583
14541F857q572j4959J3087J5523R78j6872O48J668N248N529j1587r662M842K002
14527e270J663r696L725J989K941J1167k987k542J526j57k995K196o456p668N497
14512g067N802j4262m761Q861J4721P820j4108j2109j5238k352Q424L498N319
14499a5452j92J0673n17O72N03k783p644N947K303L900L736N069o660j0894j195
14484a2534Q974m228k784r36O057k455l966o470Q582J4257o828l293k042j464
14470i130n07O35r571K847K852j316L72j996Q732J205K267O694K469l944n577
$$ y = [-2430, -8477, 3377, 13586, 11056, 4462, 8899, 7046, 7792, 11729, 13458, -445, -8495, -4698, -18759, -16488, -4486, 2890, -8931, -23263, -18158, -6951, -9497, 6343, 12301, 5007, 10440, 6857, -1715, -16674, -3587, 11936, 12914, -3958, -3310, -1642, 3606, 9135, -2452, -12114, -7272, -5270, -3607, -13303, -9578, -7589, -4648, 6519, 3532, 990, 2516, 2359, -636, 1560, -4896, -12564, -7067, -1265, -15527, -20288, -11427, 3294, 11114, -2994, -15103, -30341, -32693, -24269, -20771, -15452, -15644, -4971, -5488, -4816, -4313, -7096, -14740, -8793, -6490, -2590, 1146, 6215, -445, -11339, -12534, -3560, -7788, -10572, -11508, -5451, -7906, -11872, -18342, -9760, 4497, -2331, -5624, -7666, -9130, -9637, -9002, -18573, -15726, -12874, -14190, -13818, -15814, -7082, -5877, -3610, 3084, 5553, 1609, -3968]
14455c968N299K905L906n516r65q138J617q868j4674M789K2651R224j673p598
14441a009q77j2011K644O636P507r72j141m8j070o36n326n163j636J0689J602
14426h11k892o977K402J540o649k746L067n493J1801J24N003L215J918R175j507
14411A1170N334n420k718K341o264n297Q711J3381j4589m752L668r61L983p218
14397A369j1379O656j97j6728k130J0512J8071N94n558K722P394J645L122j1763
14383D330q408J677J879L866M951j0833l043N070K0271J6611n912j8953J06j852
14369I760n618r450K344J852L194N185K123l60q060P073J229o450J848n74m203
14354a07m48j037l840P747j2819O37J3817m368P109p196l673K858J7748N823k279
$$ y = [-3968, 1331, 4236, 8142, 2626, 1661, -6477, -4860, -13728, -28402, -23613, -962, 8262, 6589, -1009, -1886, -13897, -11253, -4617, 2890, 1918, 777, 729, -341, -977, -6303, -11466, -13102, -2413, -811, -3703, -10680, -8278, -6738, -13387, -16133, -13066, -18559, -6758, -6634, -1631, 1584, 3502, 12677, 11170, 16504, 11084, 8366, 10707, 4443, -854, 7857, 21238, 6649, 1897, 5565, 4604, 8587, 1369, -10010, -3354, -3551, -20279, -22409, -11897, 6174, 6768, 1210, 3932, 11326, 12971, 16093, 4330, -4078, -2401, -522, 3344, 8295, -2538, -5581, -511, 19760, 36371, 30459, 11506, 11612, 9760, 4142, -5308, -2964, -1112, 2082, 7267, 9390, 9030, 970, 8043, 9272, 2822, 4670, 4096, -107, -555, -1592, -5432, 2315, -10504, -9867, 3950, -418, 6691, -505, -4178, -1320, 16428, 22251, 19972]
14339A9972o059m081o856o404J0150R475o017o634J401k826l14l262M594L826
14325F965j575n138q813N598p55r675k755J0125Q842J78P154M667j4962j0679
14311a0823j6344L324O714k330L704O490N681R85P031o813J2023N500q812j1719
14297e389n18k939p089J539J1672j0650K126l939n487k59m236J1401Q166L455
14283b147N243R860n77j0573L094r415j0486R91J0045j207m569N346k43l597L38
14268g897M233K14K853R11o45m72j4844j7678O257J6193L385R677J1549N707j4063
14253E380l973k484m819K205m363n579M829J1255N007l269j2048j46J1158j712
14239A441R272N932j6010j0336j0989l271J1480J3818N768l487Q501L151j1241
$$ y = [19972, 13913, 9832, 2976, -3428, 6722, 16197, 10180, 3546, 4947, 2121, 1807, -1455, 3139, 6965, 5390, 252, -8561, -2963, -3718, -13393, -16148, -6023, 2819, 2997, 10151, 14818, -144, -10823, -27167, -23843, -17129, -19459, -15755, -9265, -3584, -2599, 4432, -2381, 9642, 15142, 6330, -5389, -5907, -8846, -15935, -14396, -2724, -13374, -11248, -15187, -20674, -20933, -25169, -13768, -5602, -2147, 3096, 12956, 12379, 1806, 4900, -4515, -15001, -14010, -3965, -5172, -9741, -4395, -4638, -8235, -7897, -3664, -3450, -597, 314, -331, -803, -15647, -33325, -27068, -10875, -7490, 2187, 13736, 19443, 5380, 1407, -1077, -5896, -3691, -8054, -13633, -8804, 2451, 7458, 4189, -7859, -8005, 3153, 1441, 10713, 16645, 635, -9701, -20690, -23961, -12481, 1337, 7105, 3618, 12119, 15270, 4029]
14226D029L477J0964j264o909r650L458J529M296r066M808P494n982K123R304
14212A8611j1216O31n663M948J059j20M027r47l465p544j489m826P580L092K366
14197G044J364R25L328m337N288J2968o949q470N947K489k621Q929o051j7183
14183B671K987J2622n373j986r467J421Q855J3046O72j1395L319k402j1496n676
14169b202P51L316L76P667J2048P388o877j2540L65R324N77l498N19J3860o716
14154B4358j5182o507J027M647L360J398m184r071Q419J901l419N111N444k019
14140A5283n819m218o017J554k077L382J3085J2887N41M986r807p663J838N727
14126B3682n742r770P509j2025N336K628O127n734n824M474J7796L472N865m343
$$ y = [4029, 7506, 18470, 17206, 10297, 647, 4105, 5634, 9930, 864, 5672, 13166, 7184, 9307, 18611, 7395, 8026, 2363, 7311, 8370, 8250, 12277, 11330, 7865, 321, -1168, -5994, 1586, 4678, 7044, 8408, 9333, 12661, 8324, 13612, 26580, 19631, 11161, 17108, 19597, 16976, 25905, 19854, 2671, 5658, 18280, 12907, 10921, 1454, 2875, 11730, 24776, 25448, 14053, 17372, 14970, 3474, -2202, -1451, 1865, 2241, 9908, 21956, 29344, 22467, 9927, 10292, 19616, 20193, 16695, 17214, 31074, 24358, 9176, 2669, 3696, 8343, 11703, 13101, 8917, -154, 8265, 10166, 6747, 11858, 17302, 15283, 9464, 5246, -771, 783, -1294, 2088, 15173, 28060, 28601, 33587, 23780, 16117, 17955, 23682, 17940, 8170, 15679, 3654, 8990, 11618, 17745, 12011, 6187, 10661, 28457, 31929, 37794, 33451]
14112C3451j4957N356o959Q775j650j5493m31K478J155j811Q170J4054P648L853
14098D3639K848j3811r5L342m034J001J2281O702M717j6293j3751k041p715L461
14084B0251N575l016o386J1104N646l151j899J507j102J783q911j3512l69R314
14070A6834J1984J543j4875J017O875j277Q194J2074K589m786o412o923K824k734
14056B6927o05m000k972m005n865k653J077j836K006J243J0963O473J1677k414
14042C6016k650l994j037q60J691P750M186j4240q612r257r057K179J1573P702
14028B1390K835m221K956p66L348o437K344n293k1026j299N771M008m68J2831
14014A5973P347m398q161j2717O626J7724N606J740j274r920M417j549p048p320
$$ y = [33451, 18494, 23850, 16891, 25666, 24016, 8523, 8092, 10570, 11725, 9914, 18084, 32138, 39786, 43639, 46487, 32676, 32581, 35923, 31889, 32890, 45171, 51873, 56590, 40297, 26546, 24505, 16790, 20251, 25826, 22810, 16424, 27528, 33174, 30023, 28124, 29631, 28529, 30312, 21401, 7889, 7520, 16834, 28818, 30361, 15486, 16503, 23378, 22101, 30295, 42369, 44958, 40172, 33760, 26837, 29661, 26927, 26322, 22322, 19350, 15345, 9480, 6827, 7904, 6068, 8074, 9317, 20280, 26753, 38430, 36016, 33366, 29372, 28335, 27475, 29166, 36916, 41102, 26862, 18250, 8993, -64, 2115, 13688, 21390, 24225, 20004, 22960, 22194, 25542, 19105, 21449, 16156, -4870, -6169, -398, 3610, 3142, 15973, 23320, 18922, 10761, -1956, 4670, 22394, 28000, 29740, 28466, 18546, 22963, 21414, 14366, 7046]
14000G046L455o414q556l645O153j1640j626J8874J529P444j929n138k918N638
13986H273L936R076O531n352j3023r027M859J465j97J0038L632K86m549l406N764
13971A8306n929l180q217j0601l138L329M045O868M606J731n396Q459N239o026
13957A0096k98M178k76l23j4104o703q565J696K922J3255N148j5985j6676L178
13943b2457N971L770O207J0051n049p176m885O776m046n773L108O451L21J276
13929e455k063o356J0199M945K833j738M938R767P174k647p410J756Q998o244
13915A8697j1069j049j819K680j0978o636k202k158k257J182j001J1167j0713
13902a6156j7925k289O084J6579K229O917J5615K166m088q043l780J106M630J255
$$ y = [7046, 10501, 4087, -4469, -8114, -1961, -13601, -15227, 3647, 5176, 12620, 10691, 5553, 2635, 8273, 12209, 21285, 27816, 22464, 9441, 414, 5273, 6738, 6541, 16579, 20211, 20497, 15948, 12542, 18306, 12377, 9197, 980, -9621, -12759, -9430, -5385, 1483, 6089, 7820, 2424, 10883, 16122, 10096, 9798, 13976, 13700, 13377, -727, -7430, -15995, -14299, -11377, 1878, 7026, -8959, -25635, -22457, -16486, -12716, -6509, 3542, -1507, -8683, -13568, -6792, -10838, -16611, -13503, -7052, -6731, -5455, -7518, -13874, -3675, 1270, 4103, 2365, 7303, 17070, 24244, 21597, 14187, 15943, 24941, 18697, 7628, 6579, 4760, 7440, -3538, -10174, -12376, -14534, -16791, -15609, -16610, -5443, -16156, -34081, -36370, -30286, -13707, -11478, -4561, 11054, 13220, 9132, 1089, -2691, -1585, 3045, 4300]
13888D300k763j90J5855J0170m933j229N336l732j3873k830J1226N736j898O213
13874B7388o282j6560m415J9665k767r555m612p308q642J530M71O214J2295N231
13860A2653p839j0705k335L960O943J0259k318j399p93P454N412J628L117m151
13846B1886j0278q054O370J0970l835n043j1715p436Q115J599m91J7276O634P98
13832B6796L847Q013O626p687j0923o126P747o769q729l448J45R239O720q878
13818A6573P34m31q075r003m831M673r11q025P04J471n544m588Q440K1371J8222
13803C0780J8592K55q683j2288m412P428k690P137J0921N360K438K159k777p3
13789E4147R926P858L107m186k2376p615j2151k5237K492L557J3560M100q046
$$ y = [4300, 1537, 1347, 17202, 27372, 22439, 21210, 26546, 22814, 8941, 6111, 17337, 23073, 21175, 27388, 21106, 4546, 131, 19796, 17029, 7474, 2862, -4446, -13088, -11558, -11087, -4873, 7422, 12653, 4814, -5891, -8226, -4266, 2677, 12936, 10618, 9219, 8426, 15880, 21292, 22920, 26037, 21886, 11608, 3554, 9924, 20894, 17059, 12016, 301, -7135, 980, 2579, 2088, 19364, 25998, 26796, 30643, 38656, 45282, 37595, 26672, 20546, 28293, 21524, 12795, 9347, 9492, 18731, 25451, 16573, 17307, 16876, 8801, -202, -5033, -360, -1271, -9296, -8592, -7121, -12665, -17253, -8813, 12558, 30780, 49372, 49627, 40944, 28656, 24244, 31672, 28982, 36119, 47040, 52400, 54838, 56997, 54220, 54147, 64073, 71931, 75038, 70852, 48476, 40861, 28710, 3473, 5965, 9522, 23082, 27182, 19136]
13776A9136R067k154j9375p027j985Q570J0654K622J652q202p222k007j039P741
13762A0431n366j214J124L730l931q244J0040J1202L597J4977Q940k898k963K850
13748D2275j297j148j885J3153J8852K0237R085l412j2293j4101m586j3840M57
13735E1497j2576j9696k925m38j445J5672O726J401L332r025j80L754m773N79
13721C1903p73q679j9050n309L280P879J1557M241L845j2615O99j0490l297M892
13707H083O009Q020q38k380K361J004m149N444j1074j557J6126N692J3655M464
13693E0860j585o198m431J0456L804R79M761j775J1568L0198L0367O059p853k7053
13679A00157k9691l1321j5726n588J2056Q908K848r798j2035j3569j091m043R109
$$ y = [19136, 28203, 26049, 6674, -353, -2338, 6232, 16886, 19508, 21160, 12958, 5736, 3729, 2690, 10431, 5065, 3851, 4975, 8705, 4774, -3470, 6570, 17772, 21369, 36346, 45286, 42388, 39425, 42275, 40978, 39830, 37945, 51098, 69950, 90187, 99272, 95860, 83567, 69466, 64880, 51040, 51497, 38921, 19225, 16300, 15862, 14417, 30089, 36815, 38216, 41548, 32523, 32343, 36097, 31324, 31903, 31130, 22451, 3401, -1908, 1372, 9251, 20808, 25049, 28894, 16279, 16978, 6488, 3191, 8083, 14092, 22112, 21274, 18894, 21255, 22259, 18110, 23554, 12480, 10923, 27049, 32741, 46396, 50860, 49275, 43077, 38646, 49102, 52906, 53885, 58646, 56871, 68439, 98637, 129004, 135063, 127210, 100157, 70466, 39145, 23419, 17831, 29887, 38795, 41643, 31845, 19810, 6241, 5150, 1107, 10216]
13666A0216J5845R550p309o978k104M327m320j7049R682K0458n085p619k0016
13653d02J0669K324j650K085J0244O034R57j539n999Q122K993O261P283Q101J5089
13638G0572L6260K4977j2446j3702l0479k3170j204K024P01J40j7496j1296P008
13625C1889O011r848m656j2035n51o480j1660j551P992L341M928J321Q775J898
13611A9374j987k614R648Q461L2M564p782r654j3283L887l282Q875P82m444J67
13596A2744J0867J2693O857O003O556L969j1668o703o741j4338j0734j0494K038
13583A049M76R09p928L893N626J428r20l680n723L586M864k840l158p102R237
13568b83O575r80j600L869J390R355J5666k129m919L606J2665n122r530O47K470
$$ y = [10216, 26061, 35611, 28302, 21324, 19220, 23547, 19227, 2178, 11860, 32318, 27233, 19614, -402, 10267, 12591, 10941, 13026, 23270, 29304, 30261, 28722, 22723, 30845, 33838, 40099, 47382, 55483, 70572, 106832, 131809, 119363, 105661, 75182, 52012, 50808, 52832, 53533, 53673, 36177, 24881, 31889, 37900, 28052, 23396, 11361, 10810, 4330, -7330, -8881, -889, 2452, 7380, 8701, 17476, 19374, 17387, 14773, 24421, 32882, 32914, 37478, 29696, 20042, 6759, 10646, 7364, 16239, 17021, 12577, 12744, 23611, 36304, 43161, 49164, 55720, 59689, 48021, 41318, 34577, 20239, 9505, -989, 1049, 1525, 2434, -5494, -1601, 4025, 5453, 4533, 853, -4870, -1284, 3580, 740, -2418, -9520, -283, 6292, 5312, 3712, 7581, 8971, 18326, 33992, 31863, 26944, 30550, 43215, 38093, 28563, 29210, 31680]
13553C1680Q417J4892J8858K8968L1684K2848J5388j9805l3781k1580k2857k2290
13541E2422j9120L544M338j1868J572k714K379k904j798j9434j7648P497R202
13528E468R022J0601n040l314J3056k493j2090o511O564R010m914J488J239P796
13514B9882K225J97P199J4503K2854L0295J2592K4039N7990P3630J12183J04159
13502D91748M8078m7534j10726j08329p9107l9462l4619k7663j4538r054o688
13491F2106j0452o557j267o822J5794k309N86q917k731M250j3355j0260L121N127
13477B8314n300r863J0599J4184M500P422j7825N513P750Q455O386o86J0482J3697
13463H3628K0375L0122M9057P0181J14259J27840O4164l3831r9796j20682q5612
$$ y = [31680, 40097, 54989, 73847, 102815, 134499, 157347, 172735, 152930, 119149, 97569, 74712, 52422, 33302, 36846, 41184, 29316, 30888, 28174, 30553, 27649, 25851, 6417, -11231, -3734, 5468, 14490, 25091, 20051, 16737, 29793, 27300, 15210, 8699, 15263, 24273, 19359, 20847, 22086, 29882, 32107, 32304, 39503, 54006, 76860, 107155, 119747, 143786, 201776, 275406, 387589, 491748, 539826, 492292, 381566, 273237, 194130, 154668, 120049, 92386, 77848, 68794, 62106, 51654, 45097, 43830, 37008, 52802, 50493, 51079, 42162, 39431, 43681, 30326, 20066, 23187, 28314, 23014, 13151, 23750, 37934, 42434, 49856, 32031, 37544, 45294, 53749, 60135, 59449, 69931, 83628, 104003, 134125, 183182, 253363, 367622, 495462, 559626, 525795, 425999, 305317, 219705]
13452B19705n3686l7284k8759j8654k2623j0041nL118j7198j1362l254m139j2585
13439C233K555O980L042j4259j3926J2248J5234J1540o565m842m063k235k216
13426F726M044L512O721j148p57j0431p273Q253J1396J0312K9512K9858L9594
13413A30319L4691J7649m411k2857m6853k1548j285p055j8730k5322p077K85q321
13400A9485k25n626L22j813K128n017n949j229N502J0547J6463M790l494K390
13386C8274Q650m532j0331r945p511p444o043J971Q431N90k781K06J1113j698
13372A8950j7284l116J7722j559n110l635k38L957P666L735k965p416L302L381
13358A7390R71j0184j65J0721n394j198O871k009m791K344r57o637O378n031L290
$$ y = [219705, 166019, 128735, 99976, 81322, 58699, 48658, 48653, 51771, 34573, 23211, 19957, 15818, 3233, 5788, 12768, 15810, 1551, -12375, -127, 15107, 26647, 20082, 15240, 11177, 8942, 6726, 10770, 14282, 21003, 19855, 19098, 8667, 1394, 9647, 21043, 31355, 60867, 90725, 130319, 165010, 182659, 178248, 155391, 108538, 86990, 85705, 78650, 59920, 34598, 27521, 27806, 19485, 19260, 13634, 13956, 12143, 14271, 9254, 3305, 2076, 7578, 18125, 34588, 39378, 35884, 38274, 46924, 42392, 32061, 22116, 14605, 7161, 1118, 3089, 11520, 12110, 9329, 9535, 20648, 18950, 1666, -1450, 16272, 14713, 9603, 5968, 5730, 9687, 17353, 21088, 18123, 10707, 14009, 17390, 18361, 8177, 8012, 18733, 13339, 12141, 19012, 17003, 12212, 14556, 13599, 6962, 13340, 8309, 11599]
13343A1599M866l053n813j075N998l69j1834R1J133j798R383n255P640Q440L317
13328B3270q352k2155j3871J381J9959K1476J5370q633j247n543O059J3438j5145
13315B6007j5365l947K810R428m988o880N183K57j196N194P468K113j5817r155
13301A112J6950J3557l633j5016k341L994P84R339J0446J2241O847J097J2261
13288F7638L545n655K098J40J0430L1035L9727M9784Q1005R3948N1796k0104p1040
13275C34347q5154o0902m3657l7826k2337j7197o878K535l773k546K764m36n561
13262E3379n675N395r82j0633K161J0245j1827m643J9005P490r855K870j0263
13249D6667O71O241J3194J764M360P733J9890K9413L4325L4360M0526N0585Q9907
$$ y = [11599, 16465, 13412, 7599, 6524, 12522, 12153, 319, 410, 1543, -255, 9128, 3873, 11513, 19953, 23270, 14918, -7237, -21108, -19727, 232, 21708, 37078, 28445, 27198, 21655, 27714, 41152, 26007, 10642, 6695, 9505, 18933, 13945, 7065, 12248, 12505, 11309, 16503, 23971, 26084, 10267, 1112, 18062, 31619, 27986, 12970, 10629, 14623, 15407, 24746, 35192, 47433, 54280, 55377, 67638, 71183, 65528, 67626, 67766, 78196, 109231, 148958, 198742, 279747, 373695, 425491, 405387, 334347, 249193, 188291, 144634, 106808, 84471, 67274, 60396, 62931, 59158, 56612, 59376, 58940, 53379, 47704, 53099, 52117, 41484, 43645, 53890, 42063, 37420, 56425, 63915, 54060, 56930, 46667, 47338, 53579, 66773, 68537, 72897, 80630, 100520, 129933, 164258, 198618, 239144, 289729, 379636]
13236C79636J61616K40228K92996J92566l9568k24227k63588k10553j34592j01817
13226B92697o6622k9826k3873j6387j0865l4666k2471j5963p501j3640o076J2384
13214E7191l716M407n043p053N810P000O696n05j3102J572P484J1789N681K137
13200H0348J7516K4095J6089J4715J9879K2371L8824N5234R6676J57826K39431
13189G83004K90841K22260J659k09034k88933k40776j55656q7525n3577m4528
13179B17735m6485l3781r440j0064j1340k0633j1743m509J0628J4754K331p355
13167I0098j2205q378J833Q503Q321R898J8727J0551m250J666M934r714J485R359
13153A30828K2852J1005M786Q133L934J5407K0040M5181P0752R4457O9569J1412
$$ y = [379636, 541252, 781480, 1074476, 1267042, 1227474, 1003247, 739659, 529106, 394514, 292697, 226075, 196249, 172376, 155989, 145124, 110458, 87987, 72024, 64523, 50883, 44807, 57191, 53475, 57882, 52839, 45786, 51596, 58596, 65292, 64787, 51685, 53257, 60741, 72530, 78211, 80348, 97864, 121959, 138048, 152763, 172642, 195013, 233837, 289071, 385747, 543573, 783004, 1073845, 1296105, 1297764, 1088730, 799797, 559021, 403365, 315840, 262263, 217735, 171250, 137469, 128029, 117965, 106625, 85992, 74249, 69740, 80368, 95122, 97453, 90098, 77893, 69515, 71348, 79851, 88172, 98070, 116797, 127348, 123098, 124764, 129698, 119984, 121469, 130828, 153680, 164685, 169471, 177604, 181538, 196945, 216985, 262166, 332918, 427375, 496944, 508356]
13141E08356o1477q7026r3242p8554m0539j3983j2936r266P072n452m944M003
13129A12012r506m783l669l294k379J339J6946J5205L798P777J4924J8208J6986
13116A83564M153J0381J8761P189P45J9299J8366J1428j897p530m641L261j2123
13103B50956k7909k6504k3382k5811j6412j6572p631j530m209M145l808L83L79
13090A02095r65j1275K063J95m358p571q42n9n856M074N2j771J2131K1217J8267
13075A27397O285R380K2893J8587J8737J4104Q511Q751Q702J1950M312Q693M225
13062B72527J825M744j896o474k3367k4172l3108k6543j7936n769o460n929q916
13049A18526k3544j9602p308r132p6p04Q126J2718N655J3000l274p135j0147o28
$$ y = [508356, 446879, 359853, 266611, 188057, 147518, 133535, 120599, 111333, 118405, 112953, 108009, 112012, 102506, 97723, 94054, 90760, 88381, 89720, 106666, 121871, 125669, 133446, 148370, 166578, 183564, 187717, 198098, 216859, 224048, 224793, 244092, 262458, 273886, 271989, 264459, 259818, 263079, 250956, 223047, 196543, 173161, 147350, 130938, 114366, 106735, 105205, 100996, 105141, 101333, 101716, 102095, 101130, 89855, 91918, 92113, 87755, 80184, 79342, 79283, 73427, 77501, 77553, 75782, 87913, 109130, 127397, 133682, 143062, 165955, 184542, 203279, 217383, 225894, 234645, 243347, 255297, 259609, 268302, 272527, 274352, 279096, 277200, 270726, 247359, 223187, 190079, 163536, 145600, 139831, 133371, 127442, 118526, 94982, 75380, 68072, 58940, 58864, 58160, 66286, 79004, 84659, 97659, 94385, 87250, 77103, 76475]
13035G6475O065j4014m932o569j4969R506J9282L063N593P867J4836J2601R73
13022A15777O286Q149L684R12j9701r860q773L043K569J779p461j8619n488p461
13008F4836j1897j808L429j4048j6391m336K331M208Q475l340m626l468k01N339
12994B8503P787l050p456J0214J0079p877j4558j2391N95L524J4510Q295k188
12981C5987O490o049j4170n139o544j972J2599L817p535j1204r226O123J5041
12968A8218m75R444p026j7183q253N743Q516r91o47J0987M293Q385j515j7994
12954A1502m223l060J8242J6048L122J747J33j3021r180j0380N860j732P118L755
12940B5931j7196k816M470J0211R760l912L925j378l38M521Q64J426q807o713
$$ y = [76475, 82540, 68526, 63594, 57025, 42056, 51562, 70844, 73907, 79500, 87367, 102203, 114804, 115777, 122063, 130212, 133896, 134808, 115107, 105247, 96474, 99517, 102086, 103865, 96404, 77785, 72297, 64836, 52939, 51131, 54560, 40512, 24121, 19785, 22116, 26324, 34799, 31459, 26833, 23365, 23164, 28503, 36290, 33240, 25784, 35998, 46077, 38200, 23642, 11251, 11846, 15370, 29880, 38175, 35987, 42477, 36428, 22258, 17119, 10575, 8603, 21202, 25019, 17484, 6280, -2946, 3177, 18218, 17743, 27187, 20161, 2978, -5275, 468, 8984, 7993, 7346, 18333, 22626, 31011, 29496, 11502, 7279, 4219, 22461, 38509, 41631, 43378, 43511, 30490, 21310, 10930, 16790, 15058, 22176, 25931, 8735, 5919, 10389, 20600, 30360, 26448, 30373, 28995, 28657, 33178, 34042, 35468, 26661, 19948]
12926A9948N009J4357p043j1234r15R879n75J188r099n783j477L171J1058J2897
12912D1381q38p545j6591p199J0016J1909k392K034r05j2326m411J3585J950N417
12898C4085n480o440p627q498P207N426k022J0504j1994p103J5225J7316j057
12885C9542L077m887k054q035o666j0082m554P968J8389O637J5879k609j2065
12872D0540j4171j886M4o546j2820q950J1568K474O31o7P79N23Q036q197r915
12857B043J5942M688p770p907J8546j2628r110N183J1186j885K931k02P312j284
12843B7045O405k09l97o353j210K48L374J3389j763j7886Q01J2240J3854l854
12829D5684j0846P21m087l631j3459j1901k22R693J0013N84l073j380J881p890
$$ y = [19948, 24957, 39314, 32271, 21037, 20122, 30001, 29426, 30614, 21515, 15732, 14255, 17426, 28484, 41381, 40543, 32998, 16407, 9208, 19224, 31133, 28741, 30775, 29870, 17544, 13133, 26718, 28668, 34085, 28605, 22165, 14538, 6040, 13247, 18673, 16651, 27155, 15161, 8058, 23283, 40599, 39542, 42619, 37732, 35678, 27643, 20977, 10895, 6341, 14309, 32698, 39335, 55214, 52605, 40540, 26369, 24483, 24527, 17981, 5161, -3789, 7779, 10253, 10884, 10817, 11596, 12119, 20155, 11958, 2043, 17985, 22673, 14903, 6996, 25542, 12914, 3804, 8987, 20173, 18288, 21219, 21017, 28329, 27045, 33450, 33241, 32844, 26491, 25281, 25529, 28903, 42292, 40529, 22643, 23444, 35684, 49538, 45684, 34838, 35559, 31472, 27841, 14382, 2481, 2259, 11952, 21965, 22549, 19476, 18096, 19977, 12087]
12815A2087j542P151j542p92M54J1551J0806q780k675N759p937k621k669J42n45
12800A8847o768L491K358N153n152K499N774Q217J2061Q623r523k4979j2589q00
12786G212J5313M875q214p007J3489J2405m282O877l272o208o986Q615n13q747
12772B3557J4002k505O992Q990j718j1979j6242n275J896J3474L124M785R388
12759D8489j378j518l1j0042p884O904J6239K491q866J688N940j6778m934L505
12745C3825Q70L348j929N362n749j0444K971m891Q117o618l748Q579N75O886K628
12730C9782J0210P048j1002m77R893j432n181p577j1035M195N427j0237L578R961
12716D3153M116m784o888m048K155J0046P56m11K419J2569q846p147O922J2141
$$ y = [12087, 10545, 17696, 16154, 15362, 15816, 27367, 38173, 29393, 26718, 32477, 24540, 21919, 19250, 19392, 18847, 12079, 15570, 17928, 23081, 17929, 20428, 26202, 34419, 46480, 55103, 45580, 20601, 8012, 7212, 22525, 27400, 19186, 12179, 25668, 38073, 33791, 40668, 37396, 31188, 24202, 32817, 32304, 23557, 37559, 35054, 42046, 51036, 49318, 37339, 21097, 15822, 17718, 31192, 34316, 39101, 48489, 47111, 45593, 45562, 35520, 27636, 34540, 50779, 53270, 44404, 46092, 52032, 35254, 30320, 33825, 34695, 38043, 36114, 41476, 35727, 25283, 28254, 23363, 31480, 24862, 21114, 29693, 30268, 37154, 39782, 49992, 57040, 46038, 45561, 55454, 54022, 48841, 41264, 30229, 34424, 39851, 29614, 33192, 43153, 47269, 42485, 35597, 31549, 33704, 43750, 44506, 44095, 46514, 59083, 50237, 43090, 50012, 62153]
12702F2153j093p08n575j3612n745j2740o739J0902J3695k620j3340M427J7946
12689D6951J0380j1238p355k334J6006k753J213M338J0153M091k884j1073m904
12676E0591k185p230m326K1294J9825P377j0690l813l682o543k561p93M871K015
12662F4150M727L29n389q812j6368n021N870J95m985J3194Q824P276L936j772
12648F6154n605Q445R931N402p040j9742o399L141j755o366n921M289M535L621
12634E2690O223l469j147r095o451K275O898j4565j08m502Q28P1P841M454J367
12619D3310M413J4146J665k379q169O071N450j577R557J444j380j4423n657M343
12605E6814N499m948j4574r628p947K3962P078j12j822N910K0N222N522l614j837
$$ y = [62153, 61060, 60352, 54777, 41165, 35420, 22680, 15941, 26843, 40538, 37918, 24578, 29005, 46951, 57331, 46093, 38738, 36404, 52410, 49657, 50870, 55208, 65361, 69452, 66568, 55495, 50591, 48406, 41176, 36850, 58144, 77969, 85346, 74656, 70843, 67161, 60618, 58057, 57264, 62135, 64150, 68877, 69206, 63817, 55005, 38637, 33616, 39486, 39681, 34696, 47890, 56714, 63990, 67926, 66154, 60549, 68994, 78925, 84327, 77287, 57545, 51146, 54287, 52532, 46166, 40245, 44534, 49069, 52690, 58913, 55444, 54297, 45202, 38751, 41026, 47924, 33359, 33251, 28749, 29577, 29648, 37489, 41943, 43310, 47723, 61869, 63534, 61155, 52986, 59057, 64507, 62930, 72487, 73931, 72551, 58128, 52471, 56814, 62313, 57365, 42791, 33163, 25216, 49178, 56256, 56144, 54322, 60232, 60252, 65474, 70996, 67382, 65545]
12590F5545n697p539R074O107L921n82K821N861Q668r332j0717j2873n01O079
12576F0835k987j966K7L324l491R307J569p755J874K937P4N921M356k781j2989
12561E8255l169J0127J063j2246J1320R623O855M273J9011K5454j776j3460j6403
12548I8927p863k772n12L166K747n613j0652k0726j0411n44M337J0123N122J4917
12534H0246n28m127M786l529r840j421O660J2279J2438O55p278J871J1001J0666
12520A13879J5140J3242J1664M573j2935j2786K03O824J7403K2019J5439M6741
12508B41406M4388N219k2071l9009m9795l4426j9765k806O450O353k578j366j2166
12495A19834J056N682Q153j0114j5170j596J0421m98K397J7596J4765k246p348
$$ y = [65545, 59848, 52309, 61383, 67490, 71411, 70829, 73650, 79511, 88179, 78847, 68130, 55257, 54756, 60835, 57848, 55882, 55909, 59233, 55742, 65049, 66618, 58863, 60737, 63674, 63748, 69669, 74025, 71244, 58255, 55086, 65213, 66276, 54030, 65350, 74973, 81828, 86101, 105112, 130566, 128790, 115330, 98927, 91064, 88292, 87780, 90946, 93693, 88080, 77428, 56702, 46291, 45747, 50084, 60207, 65329, 80246, 79718, 75591, 80377, 76848, 67008, 65587, 72247, 84526, 96964, 97619, 90341, 92212, 103213, 113879, 129019, 142261, 153925, 158498, 145563, 132777, 132980, 139804, 157207, 179226, 194665, 241406, 285794, 291013, 268942, 229933, 180138, 145712, 125947, 123141, 129591, 135944, 133366, 132000, 119834, 120890, 126572, 134725, 124611, 109441, 107845, 118266, 117768, 120165, 137761, 152526, 150280, 142932]
12482A42932L438K2109P922J6219K0796L8703M5829M3047L0631j0051k7242m6803
12470B87530m9426j8069m714J1904L3617M3372L8342K5137q133m1844n7698m1208
12458B18810q139p463n609p66M246k700j2052R52J2179J3269K465J6106J7827
12445B49125K4121K7404K3600L1235L5110N4437P1755J06528J62080K14997K84960
12434A285352L30404L25421K40529Q9081r5479k65826l52539l46167k80670j95891
12424G34215j24695r6943n5050m4519l4550k4354j2543j8186j8819k7293k4379
12413B52884j6244M684j381p265q384j1865N028p17K8606L0454K4187J4637J3283
12400C27907K0888N957K0201M2985O8676J14445J60556K26406K93298L19288L03276
$$ y = [142932, 146370, 168479, 176401, 192620, 213416, 252119, 297948, 340995, 371626, 361575, 334333, 287530, 238104, 220035, 215321, 227225, 260842, 304214, 342556, 367693, 359560, 317716, 260018, 218810, 210671, 203208, 197599, 196833, 201079, 198379, 186327, 187279, 199458, 212727, 215192, 231298, 249125, 273246, 300650, 324250, 355485, 390595, 445032, 516787, 623315, 785395, 1000392, 1285352, 1615756, 1941177, 2181706, 2270787, 2175308, 1909482, 1556943, 1210776, 930106, 734215, 609520, 512577, 457527, 413008, 378458, 354104, 341561, 323375, 304556, 277263, 252884, 236640, 241324, 239943, 232678, 224294, 212429, 217457, 216740, 245346, 275800, 299987, 314624, 327907, 348795, 354752, 374953, 417938, 486614, 601059, 761615, 988021, 1281319, 1600607, 1903883]
12389A903883K04394M6549j23243k43423l14453l09277k76236k10138j29982r5188
12379D52886o8948m7880l5511k7772r597J264j1990k6180k5393j2832O965m388
12367A90624j0302p7k221M047n216l257p091j4222j0324P664P653o943j7292N806
12353A38849k593l019J2153N396k54N546j941j3216m587Q01j330l916j470J2003
12339A42422P501O201P808J953J156n790j4198m144m743n090j152Q4m369o100
12325A21539j2o057m548j796o598j1950r769P192J2236J5929J3223p626P471P502
12311A36736m909m682K332j1632l351l946j0158q102J9694J6671j759K729N235
12298A34858p334L038J0546o794J837J437k835m743N42M6L095J056K1411K7040
$$ y = [1903883, 2108277, 2154826, 2031583, 1788160, 1473707, 1164430, 888194, 678056, 548074, 452886, 383938, 336058, 300547, 272775, 263178, 264442, 252452, 226272, 200879, 188047, 195012, 190624, 180322, 180245, 178024, 182071, 176855, 173598, 166507, 152285, 141961, 149625, 157278, 150335, 133043, 138849, 136256, 133237, 145390, 150786, 150532, 156078, 154137, 140921, 136334, 137135, 135805, 131889, 130419, 142422, 149923, 156124, 163932, 165885, 167041, 161251, 147053, 142909, 138166, 133076, 131924, 132008, 127639, 121539, 121527, 115470, 110922, 109126, 102528, 90578, 80809, 88001, 100237, 116166, 129389, 121763, 129234, 136736, 131827, 127145, 129477, 117845, 114494, 110548, 100390, 92288, 111982, 128653, 126894, 129623, 134858, 127524, 130562, 141108, 134314, 136151, 137588, 134753, 130010, 130552, 130598, 133693, 134749, 156160, 183200]
12284A83200K6427M3130M7105L6873K6530n723j8461q087l445l0396k1100o923
12272B69130k713r389r981j13n478p298K479R114L175J26j0469O75K012j7477
12258B23793l067K900k992J0212J1340k677P059k82m748K875P148p451j3807M53
12244B30756K1025K5789L7644O4079Q1456O5567L4220L1498K4017L0458P760p276
12232F46993k2556j8467k3577k4219l4765k8703j9939k1306k0625l0156k4906
12221C77774j9564J15J7961J2014n329O199J3128j556J3155L7606M3023P1630
12209E66156Q2467J14533J52668J61762R1004p056r9802j40073j21721r9202q5646
12198F15090m8399j5271O444r80Q765J4500K3743K5923J0381J827j4133j4162
$$ y = [183200, 209627, 252757, 299862, 336735, 363265, 357542, 339081, 330994, 327549, 297153, 276053, 269130, 266417, 257028, 247047, 246934, 241456, 234158, 236637, 245751, 248926, 249052, 238583, 239258, 241270, 223793, 220726, 223626, 220634, 230846, 242186, 239509, 246568, 246286, 241538, 244413, 251561, 244110, 230303, 230756, 251781, 277570, 315214, 379293, 460749, 526316, 560536, 592034, 616051, 646509, 654269, 646993, 624437, 605970, 582393, 558174, 523409, 494706, 474767, 453461, 432836, 402680, 377774, 358210, 358325, 376286, 388300, 382971, 389170, 402298, 400742, 413897, 451503, 494526, 566156, 648623, 763156, 915824, 1077586, 1168590, 1161534, 1061732, 921659, 799938, 700736, 615090, 566691, 551420, 557864, 556884, 565649, 580149, 603892, 629815, 640196, 642023, 627890, 613728]
12186F13728m8074n5285j9484j8060j9494p605m159J5602J7279L2667M4070L3637
12174E84822L7467M2771N7064N5526N0074P0065J07170J84415K59854K77436J82515
12163A909179l991j73731k60151k45220k01644j42179j03741r1514n7410m2680
12153E86918k8825j4359j9331j0078j0640k5027l25k029L029K7p564k264k3367
12140D46165R75K3265J1395K734J1217J6427K4265J5682P614J9453K8286M3572
12128F51050M0061O2601P6399R5683J20293J13529N5657j5510j21006j38778j23057
12117H16922q7244o2318l6274k3483k2204K920J971Q775K7289M5472P9556R5815
12105H47197J13852R9902O1317L6950o396m3658l7264l6559m1641l0295k3729
$$ y = [613728, 565654, 510369, 490885, 472825, 453331, 445726, 441567, 457169, 474448, 507115, 551185, 584822, 622289, 665060, 722124, 777650, 827724, 897789, 1004959, 1189374, 1449228, 1726664, 1909179, 1905188, 1731457, 1471306, 1226086, 1024442, 882263, 778522, 687008, 629598, 586918, 558093, 543734, 524403, 514325, 503685, 478658, 478333, 476304, 479333, 479360, 471796, 469532, 446165, 447140, 470405, 481800, 484534, 495751, 512178, 536443, 552125, 559739, 579192, 607478, 651050, 691111, 753712, 830111, 925794, 1046087, 1159616, 1215273, 1199763, 1078757, 939979, 816922, 729678, 667360, 631086, 607603, 585399, 588319, 590290, 599065, 626354, 671826, 751382, 847197, 961049, 1060951, 1122268, 1159218, 1152822, 1109164, 1071900, 1035341, 993700, 963405, 939676]
12094I39676j8483k2882j5276k389o450j2047j2054P934J2785m255Q658j14M244
12081H79347m827j9097m339j21R873J1554J9221J6914K0791K0293O466Q871J6746
12068I81692K4391J8514L1699P6205J07510J35824J40614J23436R0167N3503J1473
12057A795028k5900n2590l9679k4476k4518j817J6767K7977L1709M3125K8819
12046A774445L1908K5955m958J1969L8454L7367L9054O5325O2325N6870M5485
12035B184199O1191N6405L9008L6640N6223O7963P5565Q7849J04139R8178Q0734
12024B948094R3638J01339J07357J28142J38888J39324J29618J28838J25451J62790
12014D203479J75498J75856J82053K20010K27982K33352K57338K84846L36251
$$ y = [939676, 921193, 898311, 883035, 880646, 874196, 862149, 850095, 858029, 870814, 866559, 875217, 875103, 879347, 874520, 855423, 851084, 850963, 860836, 872390, 891611, 908525, 929316, 949609, 956075, 964946, 981692, 1006083, 1024597, 1056296, 1132501, 1240011, 1375835, 1516449, 1639885, 1730052, 1783555, 1795028, 1769128, 1716538, 1676859, 1652383, 1627865, 1626048, 1642815, 1670792, 1702501, 1745626, 1774445, 1806353, 1832308, 1827350, 1839319, 1877773, 1915140, 1954194, 2019519, 2081844, 2138714, 2184199, 2245390, 2301795, 2340803, 2377443, 2433666, 2501629, 2577194, 2665043, 2769182, 2867360, 2948094, 3041732, 3143071, 3250428, 3378570, 3517458, 3656782, 3786400, 3915238, 4040689, 4203479, 4378977, 4554833, 4736886, 4956896, 5184878, 5418230, 5675568, 5960414, 6296665]
12005F296665L83749M47969N28312O07735O83234P94796R48798J138664J398288
11996A3228210J710908K085148K469433K830438L214502L631395M171918M911119
11988C8253071N905325P520885J0283276J4928904K2516379L3742881M6928705
11981A80079426N7057606N8116033M5827116K0811466r998790l7263468n3964029
11974B60665360n7516068n0516176l8682484k7120876j8256005j2298099q562467
11967D7713185o340963n038994m176652l488010k892980k368338j895997j485241
11959B0026010j108259p57202l94503l3575L43036P36968J166080J604029K025491
11950B3608075K449194K840580L294373L871888M629240N694046P410633J0316181
$$ y = [6296665, 6680414, 7128383, 7656695, 8264430, 8947664, 9742460, 10691258, 11829922, 13228210, 14939118, 17024266, 19493699, 22324137, 25538639, 29170034, 33341952, 38253071, 44158396, 51679281, 61962557, 76891461, 99407840, 133150721, 180079426, 237137032, 295253065, 341080181, 361891647, 351892857, 314629389, 260665360, 203149292, 152633116, 113950632, 86829756, 68573751, 56275652, 47713185, 41372222, 36333228, 32156576, 28668566, 25775586, 23407248, 21511251, 20026010, 18917751, 18160549, 17766046, 17732471, 18075507, 18812475, 19978555, 21582584, 23608075, 26057269, 28897849, 32192222, 36064110, 40693350, 46387396, 53798029, 64114210]
11942F4114210J5168958K3034512L4658104M8216221N8320235N8883128M5854712
11935C48250080K0220729j0917583l8423827n5286575n8824497n1582214l9453021
11928A13983092k7674672j8732848j2763668r018095o735936n360931m486606
11921B9210336l842154l297445k812090k403612k076019j777533j501930j252602
11913A0246951j029977q44931p25776o04590m91221m34540l87781l50028l44348
11904E033759l29845l06029k99298k67595k50750k10380j63119j35710j08238
11895B962795q7557r0999r9456j22493j28570j24341j35583j16573j14885r7551
11885A844787p7903l9691l7670m8758m4694n6431n8782m8908m3778l1381j6702
$$ y = [64114210, 79283168, 102317680, 136975784, 185192005, 243512240, 302395368, 348250080, 368470809, 357553226, 319129399, 263842824, 205018327, 153436113, 113983092, 86308420, 67575572, 54811904, 45793809, 39057873, 33696942, 29210336, 25368182, 22070737, 19258647, 16855035, 14779016, 13001483, 11499553, 10246951, 9216974, 8372043, 7646267, 7041677, 6550456, 6115916, 5728135, 5378107, 5033759, 4703914, 4397885, 4098587, 3830992, 3580242, 3369862, 3206743, 3071033, 2962795, 2875238, 2784239, 2684783, 2562290, 2433720, 2309379, 2173796, 2057223, 1942338, 1844787, 1766884, 1727193, 1689523, 1640765, 1596071, 1539640, 1480858, 1431950, 1388172, 1356791, 1340089]
11874A340089o643j7865l7232o0069m3568l0160n0944l2874k1854J134J7905J5639
11862A073558j1186l7882n3159q3742r1542q7157r4113q5554n2054j7800K4531
11851D83900N8718O3408O1447M6682K5727J5910p093j4006l683j7195o852n072
11839G01891m057j4080j3343j9018j1711l6555l2639k3238k3436j8741j2139k5266
11827D67668j8777j7423k1345k2073p351j3764k4544j9124k8253k2002k0979l2583
11815B19450l6765n4940n7635m0377k6934J1121M9529P5816R4300P8190N0357
11804C62112L6845J9657K29K249m792k421o034j105J862N728K0897q012j7014
11791D10201j1796k8911n9051n4448m1719l5079j3793J0857J4936J5778J4248
$$ y = [1340089, 1333446, 1315581, 1278349, 1218280, 1174712, 1144552, 1093608, 1060734, 1038880, 1040014, 1057919, 1073558, 1062372, 1024490, 971331, 887589, 796047, 708890, 614777, 529223, 477169, 459369, 483900, 542618, 606026, 667473, 714155, 739882, 755792, 748699, 734693, 731010, 713815, 706963, 701891, 697834, 683754, 670411, 651393, 639682, 603127, 570488, 547250, 523814, 505073, 492934, 467668, 448891, 431468, 410123, 388050, 380699, 366935, 342391, 323267, 295014, 273012, 252033, 219450, 182685, 127745, 70110, 29733, 2799, 13920, 63449, 139265, 233565, 311755, 362112, 398957, 418614, 418843, 421092, 416300, 413879, 407845, 406740, 408602, 414330, 435227, 427215, 410201, 398405, 369494, 310443, 255995, 214276, 179197, 165404, 176261, 191197, 206975, 221223]
11780B21223J0424O963M392L683j1206j0803N871q12j209j482j4375j8064n307
11767A89298O334J5469J4695J462m915n869j2831k898m477m672j2212R500M776
11754A93660n320J6709Q488L272R32j3309k1200k5025l2519m3262l0135j1334
11742D0957j5355N833M733J0658J4673J9638K6921O862J2645J5055m855o056k961
11729A28748J0707o541K194j8895m960p22r969j4393j3882j4144P62l210q376
11716D7319n385n696q920L627j4881r01K0681R298j0697n489J606J1026O544J2105
11702F0237r45r797n540m7j745M096K352q580n835m700m598n656j360p87j4102
11687B993j7552j2259J727P31l210l84j0678j4899j2486j7089j9485j1004K161
$$ y = [221223, 231647, 238610, 243002, 246685, 235479, 224676, 230547, 229735, 228526, 227044, 212669, 194605, 189298, 195632, 211101, 225796, 227258, 222343, 216474, 203643, 200745, 196268, 191596, 179384, 188884, 193660, 188340, 205049, 213537, 216809, 217741, 204432, 183232, 158207, 125688, 82426, 52291, 40957, 25602, 31435, 36168, 46826, 61499, 81137, 108058, 114920, 127565, 142620, 137765, 131709, 128748, 139455, 132914, 135108, 116213, 111253, 110531, 100562, 86169, 72287, 58143, 58905, 55695, 47319, 41934, 36238, 27318, 30945, 16064, 15163, 35844, 45142, 34445, 28956, 30562, 41588, 48132, 60237, 59292, 49495, 43955, 43908, 42163, 46259, 48611, 40031, 34196, 29496, 24898, 19242, 17882, 17095, 2993, -14559, -26818, -25091, -24360, -27570, -27954, -38632, -53531, -66017, -83106, -102591, -113595, -111434]
11674a11434K5191L1586N1349M4065L6407K9913R348m324j8294k0563o697N967
11662G2514R265o433K245J041p866j0307M881o076r548Q779q379j2119M308J0243
11648E2548j1256k2529j4050l800q690j088r897K088M18r744n066j7772j7000
11635f5838j8155j2362r403M710M0230M5772M8470N4161M2406K0538j2165j7928
11623A20436j3815j8645k491M937L641r881K613M147m082J1282J646n723q739
11610H5326J0557R951q111p424N414m684P294Q932q329k363J946j850m012q728
11596H3919N375k36q177k098m650N1L555j176q757r704J058P964L863J4256P979
11581I3222q068N873J8915O549p399k0305n526J990j2888n213N1n815l686K7q249
$$ y = [-111434, -86243, -54657, -3308, 40757, 77164, 107077, 116425, 112101, 93807, 73244, 66547, 72514, 81779, 75346, 77591, 78632, 70766, 60459, 65340, 59264, 49716, 58495, 50116, 37997, 42305, 52548, 41292, 18763, 4713, 913, -7777, -8865, -18762, -16674, -16256, -26000, -31066, -48838, -65838, -83993, -96355, -105758, -101048, -60818, -15046, 33424, 87585, 129991, 150529, 138364, 120436, 106621, 87976, 85485, 90422, 94063, 84182, 86795, 90942, 86860, 98142, 99788, 94065, 85326, 95883, 105834, 97723, 90299, 95713, 91029, 98323, 107255, 98926, 96563, 98509, 96659, 92647, 83919, 89294, 89058, 80881, 78783, 74133, 74184, 77739, 76563, 67806, 58102, 59160, 67124, 70987, 85243, 93222, 85154, 91027, 109942, 116491, 109092, 88787, 83261, 85251, 72363, 67150, 67201, 61386, 57700, 57727, 49478]
11566D9478o200n48n534K950L493R631J8866j0441m89r842R760J5539O121Q793
11552I1577M613J267j1946j2238j599K05O820K4618O317K886L835j824j7783m988
11538I1760Q3m326J2897J4598K7027K6082R767J8962K8954K5232K8718Q355J5338
11525C03447L5516M5668P6262J28775K01209K59186L17317L06266K07728N9380
11515A940754r4249k28937l06885l05366k53924j94383j32239q2124n4431n5736
11505B32480l0526l3057j0648p14m123m191r055j1569M335O72j3095j0653o05
11492A09251M845L1245K3487J7070j1025L57P663J4943L0315M3298L6766N7024
11480C65239R4609J46325K20899K93961L36194L07179K03277L9916j21764k41199
$$ y = [49478, 43278, 42730, 37196, 40146, 43639, 53270, 72136, 61695, 61206, 51364, 61124, 76663, 82784, 91577, 96190, 97457, 85511, 73273, 71674, 71879, 78699, 103317, 109634, 112520, 116355, 114531, 96748, 91760, 91843, 87517, 100414, 115012, 142039, 168121, 177888, 196850, 225804, 251036, 279754, 288109, 303447, 338963, 384631, 460893, 589668, 790877, 1050063, 1367380, 1673646, 1881374, 1940754, 1846505, 1617568, 1310683, 1005317, 751393, 557010, 424771, 342647, 288216, 232480, 201954, 168897, 158249, 157535, 153412, 149221, 140166, 128597, 132932, 133604, 120509, 109856, 109251, 114096, 145341, 168828, 185898, 174873, 175230, 182893, 197836, 228151, 271449, 308215, 365239, 459848, 606173, 827072, 1121033, 1457227, 1764406, 1967683, 2007599, 1885835, 1644636]
11470A644636l15198l03344k45780j82773j34696r4730o3107m9434l3999j2457
11460B09118j5858k1345j8881k5234j9411j4502j8031l810J5827M87j250l742
11448H3368j841p883n161M44J782m178P115j3086j3175L679L37J0104P788Q183
11434G7476M606J2777J9378K5072Q137O269O69K296K342K427J4039L255J744j1701
11420A68786l824K009J552j4641j7070j8438j0305K690l668j2783L68K795M595
11407A02066n973Q64j378n783R883J2121O526j4686n685J798L024J1883P267J1751
11393A33678J8916R486J1797K0917J9206J0175J1363J1941J3279L978j0909j1471
11381B42356j726j219M596L716l427j0448j1758l0994k2389p327j0219o47n203
$$ y = [1644636, 1329438, 1026094, 780314, 597541, 462845, 368115, 305008, 255574, 221575, 209118, 193260, 171915, 153034, 127800, 108389, 93887, 75856, 72046, 87873, 88360, 87110, 83368, 81527, 73644, 68483, 68927, 70709, 66531, 73646, 60560, 47385, 51064, 51401, 61505, 69293, 77476, 82082, 94859, 114237, 139309, 147446, 153715, 154384, 156680, 159022, 161449, 175488, 178743, 180487, 168786, 164962, 166971, 168523, 153882, 136812, 118374, 108069, 110759, 107091, 94308, 94676, 97471, 102066, 96093, 96957, 95579, 89796, 99679, 111800, 118326, 103640, 97955, 99753, 102777, 114660, 121927, 133678, 152594, 162080, 173877, 194794, 214000, 224175, 235538, 247479, 260758, 264736, 253827, 242356, 240630, 239411, 244007, 247723, 244296, 233848, 222090, 191096, 168707, 161380, 151161, 150514, 145311]
11368A45311o699p431j8189k2788j2093K714O73l058l448O409n408j724q694L185
11354F8760O054J6926J2898J148N688j630L209J1536J8828M085N112L849m779
11341A51684l120M14j318k995q595j3826k58m539j4781o490N900l037j4837j1967
11327G2235o54p529o245o092l386m127j2499l335l324J8605N906l696p29O52m477
11312D1305p97q541j8207N526J3993l933N500J262K178n986k4237p021O4J1837
11298A2943J4165L661j4499q988l522o590O606L460l350J1373J6481L550O325
11285D1615o094j2090p687p381J567M246L176O433q648L697p339j4786m990O331
11271a950J1456J680M254O568j1278q863j9J519k656n407o9k23O976J4068q838
$$ y = [145311, 138612, 131181, 112992, 90204, 78111, 80825, 81498, 78440, 74992, 81401, 75993, 74269, 65575, 68760, 74814, 91740, 104638, 105786, 111474, 109844, 113053, 124589, 143417, 147502, 152614, 156463, 151684, 148564, 148978, 147660, 144665, 136070, 122244, 121986, 117447, 102666, 96176, 102076, 99039, 84202, 72235, 71581, 64052, 57807, 51715, 48329, 44202, 31703, 28368, 25044, 43649, 49555, 45859, 45130, 45782, 41305, 40508, 31967, 13760, 19286, 33279, 29346, 34846, 36108, 38286, 32300, 8063, 1042, 1106, 12943, 27108, 30769, 16270, 7282, 3760, -2830, 3776, 7236, 3886, 15259, 31740, 35290, 41615, 35521, 23431, 15744, 8363, 9930, 14176, 17352, 23785, 15137, 18834, 11495, -3291, -8281, -1950, 9506, 11186, 15440, 22008, 10730, 1867, 1848, 3367, 711, -4696, -4765, -4988, 1988, 16056, 7218]
11256G218j1905M696J2377q790k601J989l251k396O249L955J7159n379o879r22
11242A1520m399r43q166j3520N875J3692O88k434j0783p577M882R309r6p90m393
11227g135M394k060p865J7678J3955j3644j3176R573l558J666Q441j2118n278
11214i127R26N752J908j4053J610l675l943M553M376o661P618j087R62R56m253
11199a4138k813R286O118K001j0024l394J3576R708m790j4995m487q443p353J9505
11185a0243K2328J190m049R881J89L688K506j0668j0713R120J8359J0222J1013
11172E2823j233j847j7556k1763q079L914K64N020j0885j1036J53q517N300J4304
11158H62P751J762q764o038J7938n363q747n708j5834k551Q58O378J5328k716
$$ y = [7218, -4687, 9, 12386, 3596, 995, 2984, -267, -2663, 3586, 7541, 24700, 19321, 12442, 11520, 7121, 6178, -1988, -15508, -9633, 4059, 4747, 2313, -8470, -16047, -11165, -1856, -1952, -2742, -7135, -2741, -4801, -12666, 5012, 18967, 5323, -7853, 1720, -1838, -172, 8269, -3849, -9127, -8201, -2449, -541, -14594, -12984, -16659, -20602, -16049, -11673, -18334, -10716, -11803, -10841, -9885, -14138, -16951, -7665, -1547, 454, -9570, -12964, 612, 10320, 5530, -9465, -13952, -22395, -29748, -10243, 12085, 13275, 9226, 19107, 19296, 22984, 25490, 14822, 4109, 13229, 31588, 41810, 52823, 51590, 49743, 32187, 10424, 2345, 6259, 6523, 11543, 658, -10378, -10225, -18742, -13442, 862, 8613, 10375, 1611, -4427, 13511, 8148, -599, -6307, -22141, -24692, -23834, -17456, -2128, -4844]
11144d844k374N355J2562m992q882Q037J620l84q626M461J0162L12n812j1620
11130e025j8512p74O560J5171R344j899o74J561o367n169o799K106J0832J4153
11116A4508l188k253o587k515r28m884j724L638k119q517l017O276K560q546P896
11101i400M570j3602l236N36q44o74m9J292O210L763L075L2J8004J0429l276k268
11085A4562l714p221P78K94P40j758k008m600p040N736Q207Nn122O584P541k429
11069A0555o282p904p18J1443M061r64l837m152R462m834o329j0368m969M124
11055a0712J3323P285O084n084r030n698q513n409J4051j72P309L614q077m881
11041e910p291p092J2690Q204l506j1414k148n31J206J8647N900j8832l017k19
$$ y = [-4844, -7218, -1863, 10699, 5707, -3175, 4862, 6482, 6098, -2528, 1933, 12095, 12407, 6595, -5025, -23537, -24311, -17751, -2580, 6764, 4865, 4191, 5752, -615, -5784, -12583, -10477, 355, 14508, 11320, 9067, 2480, -35, -963, -5847, -7571, -3933, -6052, -14569, -17586, -11310, -8750, -17296, -9400, -4830, -18432, -21668, -21132, -21976, -22650, -22699, -21407, -15197, -11434, -8359, -8327, 9677, 20106, 16830, 14562, 10848, 3627, 4405, 4699, 5439, 3681, 1673, -2927, -9967, -4231, 3976, 3981, -1141, 5443, 12984, 10555, 4273, -3631, -4349, 7094, 11155, 10191, 6354, 2202, 11664, 6830, 501, -9867, -14836, -10712, 2611, 9896, 15980, 10896, 1866, -3832, -12345, -17754, -3703, -3875, 3434, 7048, -1029, -5910, -13201, -20293, -7603, 601, -2905, -14319, -16467, -16998, -15792, 2855, 8755, -10077, -13094, -13313]
11027a3313q18J2116K4654R192J1191j8040j8117n012m002l651J243r77n528l899
11013a4961M67k426O115J4555N990n377j0578q594j1682j9042P776J6690R474
11000a1593j777K74R832p169j187P553m273m725o57K909j607K455M162L790p139
10985i152j804o315Q675J7950K941m326Q14n744q162j4554L282N895k209j113
10971a3822M043q885l28r49L420N950P510L474n368L401J891j5j2377Q630Q873
10956E448j0792l641N044l475m103n488l088M566r63J763p600q257O048J0025
10942a4513J483N41n190j843O281j647j4710o281R322N351L410j0068q314l186
10928c9364M073R982J4848O786p169l659L384J5318m542j0392q358n761L870O044
$$ y = [-13313, -14131, -2015, 22639, 31831, 43022, 24982, 6865, 1853, -2149, -5800, -4557, -5534, -11062, -14961, -14494, -16920, -10805, 3750, 9740, 4363, -6215, -14809, -26491, -45533, -37757, -21067, -11593, -13370, -13096, -3264, -10433, -11620, -4067, -8340, -13065, -13722, -10813, -12420, -9965, -5803, -2013, -9152, -10956, -17271, -8596, 9354, 12295, 7969, 8783, 3039, -5123, -19677, -16395, -10500, -12709, -13822, -9779, -18664, -18992, -19941, -16521, -10571, -3061, 413, -4955, -1554, 337, 322, -12055, -3425, 5448, -5344, -8985, -3941, -7416, -11519, -17007, -20095, -15529, -16492, -14729, -22329, -30586, -24538, -14513, -13030, -12489, -17679, -19522, -13241, -14888, -29598, -35879, -26557, -21206, -17796, -27864, -36178, -39364, -35291, -25309, -10461, -3675, -10844, -14503, -11119, 4199, -343, -10735, -19093, -24854, -20984, -14940]
10914a4940R331R748L983j834j0648k2476j1809J0069K820J0120J0162K857o330
10901h947r346O357O31L060o839J707Q044j2198l747n74J7761J1127o745l568
10887c277R80k062k381N874J918j8670p791M5p390m030j280O516R330P779J3376
10872a063N309r2k167P718k247j148l784l951k842n344N648P969j0295k741l080
10857a2110K52P790n520O759J0490j0312j3030L306K489l95P296m238j2738r564
10843b9525l373R761J4274K453n350N07o902j521K1951K110j4276k330O421j2467
10829a8267m871L767O04O851k052n242j81O296R45m215K860j052j0171o974J1464
10814b0238M933P170j655l078Q707Q339P93L179j0518r05p002l224Q235q967j395
$$ y = [-14940, -5609, 4139, 8122, 6288, -4360, -26836, -38645, -28576, -25756, -15636, -5474, -2617, -8947, -18293, -11936, -11305, -8245, -15084, -13377, -5333, -17531, -21278, -21852, -4091, 7036, 291, -3277, -2297, -4359, -6740, -866, 1052, -17618, -25409, -25364, -32754, -36784, -38064, -31548, -22218, -14439, -1063, 4246, 4154, 1987, 9705, 7458, 6310, 2526, -1425, -4267, -9611, -3963, 4006, -6289, -9030, -12110, -11858, -4068, -9588, -2829, 7661, -2651, -15681, -12375, -9886, -10281, -2985, -7223, -19961, -29525, -32898, -23137, -8863, -6410, -11760, -11253, -18155, -19676, 2275, 4385, -9891, -12221, -5800, -18267, -23138, -19371, -18767, -11916, -13968, -19210, -19391, -13095, -12150, -16365, -13505, -14557, -24728, -31702, -20238, -15305, -8135, -9790, -12868, -4161, 4178, 4971, 8150, -2368, -3273, -10275, -13499, -5264, -14231, -15626]
10799a5626M149J577n278P46L03J371L794M450j340N281K901r609j0804K598K758
10784a2729L40K184M898P743Q067o796n260l841q352j0218M396O002M018p481
10770a7029j815J2976P484N323l799p461q492r979j3021j1386j996J150K691Q845
10756c6509J455M813J2209Q17j237J3675Q531O937M433n23k388j3049q248j1124
10742b0208R07J1636J3676k552l246K473k775k042J498k787j1503m955J0775K980
10728f123j1141j589J757M883O292J432K202j0644r147J0520J8484J1104l400
10715A4630j4381j6547j2561Q291J276N693P005k531k262n281O727J3505j4145
10702a0581j7467K083k469l82O15J007O357J019j45L440P644L480L275N827j828
$$ y = [-15626, -11477, -9900, -15178, -14432, -14129, -12758, -8964, -4514, -5854, -573, 2328, -7281, -18085, -15487, -12729, -12389, -10205, -5307, 2436, 10503, 3707, -1553, -5394, -13746, -23964, -19568, -13566, -9548, -17029, -18844, -5868, 1616, 6939, 3140, -4321, -12813, -22792, -35813, -47199, -49195, -48045, -45354, -36509, -35054, -30241, -18032, -17215, -18452, -4777, 3754, 10691, 15124, 14601, 12213, -836, -9084, -20208, -19301, -7665, 6011, 3459, 213, 2686, -89, -2131, -633, -3420, -14923, -19878, -9103, -6123, -17264, -18853, -17096, -12213, -5921, -4489, -2287, -12931, -22078, -11558, 6926, 18030, 14630, 249, -16298, -28859, -20568, -19292, -13599, -6594, -9125, -11387, -16668, -9941, 3564, -10581, -28048, -25965, -28434, -28816, -28201, -27194, -20837, -19818, -19963, -16523, -8879, -5399, -2124, 3703, 1875]
10687A875j3245q122k299P002J1140M603O219K703j9839j4284P181M25r283j0782
10673c6706M692J9913M587n9Q377j573j1577L071Q683m181o030o857m057m786
10659b6503j907N616O29O816r539k293K350k27P952J5276o739p73R71O632M562
10644B823n221j7813J106m307r440L33m96J7322R570J9660J2088j1685j638L803
10630A6105j5907m448Q077j104m660J0255M48k1606j0068q867N622J7305J455
10617g393p208l637P526R974p677l913r97k840J4460P654j4331j633J0162J089
10603A236o868j028L012K246R212p275o724O579P98K19Q094p376j0678P325O105
10588D877o398O091N107j0719r758l151j066J975J0222J010k229l463j2232j526
$$ y = [1875, -11370, -19492, -21791, -14789, -3649, 954, 7173, 9876, -9963, -24247, -17066, -16641, -25924, -36706, -32014, -12101, -7514, -7573, 804, -769, -12346, -9275, -592, -4773, -10803, -17660, -21717, -26503, -28410, -22794, -22165, -15349, -24888, -27181, -24831, -25058, -17106, -1830, -8569, -9342, -8371, -1739, 2823, -2398, -20211, -19105, -23412, -32852, -32519, -33015, -15693, -6123, 13537, 25625, 13940, 12302, 16105, 198, -4250, 3827, 2723, -1937, 8318, 8766, -12840, -22908, -31775, -26153, -8848, -7393, -14601, -18238, -10712, -738, -8415, -12328, -13325, -16165, -1705, 5949, -8382, -10015, 147, 1236, -5632, -6660, -3648, -1402, 7810, 535, -6189, 390, 1188, 1407, 9501, 2125, -8553, -1228, 4877, -1521, 4570, 9677, -1042, -10800, -13951, -15017, -13042, -2820, -1810, -4039, -7502, -19734, -21260]
10574b1260m83k229N618J2422R537j1753j1140K85M115N033l56M708J7709m250
10560G956j3988j3323k37l671N317o694J1844P063Q303j1004m840o583n297M490
10546b0664Q269J0564J0866L177j7001j5580K441O389N766J9679n070j9087k442
10533a2693L30P956Q138j3207n513m100N355Q3r22J1214J5633l851J1529l499
10519A6453q600k007L18q739J2173Q652l845p086j936R509Q83j714r190j166q58
10504B847j1065q421r29K927J1656J470o624l130J2318J641l083M971o455j2246
10490a4123k160J747N208K536j435j1483K184J3259K037L323r330l083k217k617
10476a6154p180P055R716n396p31K028M382J6669L834q749j2168m411K14P973
$$ y = [-21260, -21743, -23972, -18354, -5932, 3605, -8148, -19288, -19003, -14888, -9855, -10211, -5503, 12206, 7956, -6032, -19355, -19592, -23263, -17946, -24640, -12796, -5733, 2570, -8434, -13274, -19857, -25154, -20664, -12395, -1831, 9035, 12212, -4789, -20369, -17928, -11539, -5773, 13906, 8836, -10251, -12693, -12363, -4407, 3731, -9476, -14989, -19089, -13734, -13651, -14573, -3359, 12274, 8423, 19952, 16453, 7853, 5846, 6164, -2575, 9598, 18250, 14405, 7319, 5383, 14892, 15775, 14061, 4871, 3705, 2847, -8218, -16639, -17568, -14641, -2985, -1515, -8139, -11269, 1049, 2690, -393, 4578, -1877, -14123, -16283, -14536, -9328, -6792, -8227, -19710, -17526, -4267, -2230, 1093, -8237, -11320, -13537, -16154, -23334, -16279, -6563, -11959, -12690, -10662, -6280, 10389, 14223, 5474, -6694, -11105, -10891, -2918]
10462b918r421n736R246Q574l983m625R071P197o306k174M85j118o113L514P053
10447B746j462j383o027o215k413R692N329N429J17j0591p551N286j3355j4671
10433c5069M364M970N572M002R517K155j3243Q751N181J827M183m245K79J085
10419f71j0197j468O362jN377J2748j3870n311J3884m767q541K984P994r425o117
10404a1019K641N119J700R827J5305l855j4484m988Q09j906o270Q203Q698N72
10390A0352k360r039m826J705O302J2402L468l925N542j4877p992N520M500p129
10376c57l683o020k322J2215O694n828j4098r463q836P498M777L985P159r896
10362a8175n71J7718L079r880O078N058N22n540O827m211l433k660o53J3920R88
$$ y = [-2918, -12339, -18075, -8829, -255, -4238, -8863, 208, 7405, 1099, -1075, -590, -1708, -7821, -4307, 2746, 1284, -99, -6126, -12341, -14754, -5062, 267, 5696, 5813, -4778, -12329, -7043, -20398, -35069, -30705, -25735, -20163, -16161, -6644, -4489, -17732, -8981, -3800, -1973, 2210, -2035, -1756, -671, -10868, -12336, -5974, -5975, -598, 12150, -1720, -7031, 6853, 2086, -6455, -3471, 4523, -4902, -11019, -8378, -3259, -1559, 8268, 23573, 19718, 5234, 246, 1055, -851, -7121, 1082, 9780, 10352, 7992, -1047, -5873, -4168, 2134, 14536, 18004, 14079, 19621, 4744, -3248, 2272, 6772, -357, -4040, -10060, -12382, -167, 6527, 699, -13399, -22862, -31698, -24200, -19423, -15438, -8279, -18175, -18746, -1028, 2051, -7829, -1751, 3307, 3829, -1711, 5116, 905, -2528, -5188, -5841, 8079, 9067]
10347I067L682K11o095L258q572j0072N344j678J3302L717j8037j2050l425q806
10333c0154j033Q456J828J2716N399l524m625j1292k704L88N261k112J381J7592
10319b423R917n022m662n481N543J4449p28o523o780O9O622K082Q28r948j1252
10304a3309K991N673L863Q38P508o374R71M417o965j0885p60l673p480J2693O088
10289d404j5479K29J8556J9300q367j4849l291j818k09m548K789m62k625j1335
10275b6513J4886Q622K49Q101J830m297K258P54j8578l172L857n494j0956J0739
10261a7714J802m688N095O6m530n621J2745j1735K894R419R242K665r786j9001
10247b9147J2156K4905P276O267p620l973N34N981p747j3371J0198K578r530r77
$$ y = [9067, 12749, 12960, 6865, 10123, 1551, -8521, -3177, -4855, 8447, 12164, -5873, -17923, -21348, -30154, -31187, -22731, -20903, -8187, -2788, -6312, -10937, -22229, -24933, -24545, -19284, -21396, -20015, -2423, 7494, 2472, -2190, -7671, -2128, 12321, 11593, 5070, -1710, -1641, 4981, 7063, 7891, -2057, -13309, -10318, -4645, -782, 56, 7564, 1190, 2161, 6578, -387, -11272, -12032, -15705, -23185, -10492, -4404, -19883, -19654, -1098, 18202, 9835, -5014, -8305, -10123, -10332, -14880, -12091, -12553, -15178, -26513, -11627, -3005, -2756, 5345, 7175, 2878, 5136, 5890, -12688, -15860, -12003, -17497, -28453, -17714, -15912, -20600, -15505, -15439, -19969, -25590, -12845, -24580, -21686, -12267, -3025, -360, -10146, -29147, -16991, 7914, 15190, 21457, 13837, 9864, 10398, 16379, 8632, -4739, 5459, 8037, -1493, -2470]
10233b470J1887M741K463L265P399o207q862J085l044N420p249r072j248O108
10219D216J551j147k641k951k699j033P585Q055K045j9802O19M320m356K311K057
10204a870k724n392m890j3119M95M672J2315J6888J1396o971r378J174P07K0306
10190B3609j493r146j0823m845r984m611J8843J3919j2891n428J3219P424j6152
10177A641l972p125K820j489o38Q675m530R655Q661M423J577j633k57n264R5l574
10161I065o680n397l094m525R44k529J2845J4622L154K556k750j3538l655l29
10147F89L977n963N085Q589K078O52j199k347o021m020L356k575l848R023J728
10132I204j970J39M533J70O134l285r077j2760P864N94K402O754J0479p824k4284
$$ y = [-2470, 9417, 14158, 16621, 19886, 27285, 21078, 12216, 13301, 10257, 15677, 8428, -644, -1892, 4216, 5767, 4620, 1979, -972, -3671, -4704, 2881, 10936, 12981, -6821, -6202, -1882, -6238, -3927, -1870, -4594, -9986, -14876, -27995, -27500, -22828, -10513, 6375, 17771, 10800, 1422, 2596, 3303, 23609, 22116, 12970, 2147, -2698, -12682, -17293, 1550, 15469, 2578, -2850, 10369, 17793, 1641, -2331, -9456, -6636, -8125, -8763, -88, -4618, 5037, 13698, 18121, 19698, 18065, 17808, 12544, 12639, 9065, 2385, -3012, -6106, -10631, -9687, -12216, 629, 15251, 18405, 20961, 18211, 4673, 1018, 689, 4666, -1297, 3788, 12377, 14455, 15107, 13908, 11561, 5540, 1520, 4876, 2301, -1547, 7476, 9204, 7234, 7373, 11906, 12076, 18210, 14925, 5848, -6912, 952, 1546, 3948, 10702, 21181, 13357, -10927]
10117a0927N275J0616R897J181q955l637J443J360m662J407p29j2061J5109j177
10103D140m107O056J4055j2415j2009q932J0950K193Q350K195l970k17M483Nl32
10088A0445j230M058k533j3955L960Q235J999L645J137L373o996K50m584P573
10074A5377M799o391L709o653o943J117K718p826J5214J0262o055p46R967J413
10060B9962m538k747N614Q094j2521o207O369m380j0822J3099N368m547M385j134
10046B5995J017n629p338n145P083j577J778n76J2147L734M770j955L076M531
10032D1911N782K737J2048J7696K3160K7065K6439M9534Q5528J56625K64519L37804
10020A050848J65914j09711k62029k78115j91378j22444p0598m6341l9442j2214
$$ y = [-10927, -5652, 4964, 14861, 16042, 7087, 3450, 4893, 6253, 1591, 2998, 2269, -9792, 5317, 4140, 33, 6089, 20144, 7729, -4280, -13212, -2262, -69, 8281, 10476, 6506, 6289, 10772, 10777, 10445, 9215, 13273, 10740, -3215, 745, 8980, 10979, 14624, 15761, 19134, 12138, 12388, 7804, 15377, 20176, 13785, 17494, 10841, 3898, 5015, 7733, -93, 15121, 25383, 19328, 18582, 28549, 29962, 25424, 22677, 28291, 36385, 23864, 17657, 24026, 19646, 8824, 21923, 27291, 22744, 27129, 25995, 27012, 21383, 14045, 8900, 15983, 14406, 16184, 15608, 27755, 31489, 36259, 34304, 37380, 41911, 47693, 50430, 62478, 80174, 103334, 130399, 156838, 206372, 291900, 448525, 713044, 1050848, 1216762, 1107051, 845022, 566907, 375529, 253085, 182487, 136146, 96704, 84490]
10010H4490o008j4827k0000N868K541k864j0689n079o08n030p537O61J646n125
9996A7439m256L663j1110p03J419k80J0163q18k847K043j1765m659R150N523j895
9981A1067J5229J2083M773j3335j9819j1947K038M637j391o465M220J529P033
9968I652J584l52J2010J4850J062p406j0327r114j2706R673J2376k7J909k182
9954B1002l376J0822j09j1428Q678k491m938k751j5513p872P557K2071J0104j0043
9940B1713P158O658Q18r015K476J860p539m108J330n46m573n201n850O856j330
9925A0707m19j608J464L575J1858p722j714m491M146J331J2202Q451p520M095
9911C4355K161j0423q927N095j64q66n996P181J874N305j5257k188P534k061n916
$$ y = [84490, 78482, 63655, 43655, 49523, 52064, 49200, 38511, 33432, 32824, 27794, 20257, 20918, 22564, 17439, 13183, 16846, 5736, 5033, 6452, 6172, 16335, 15517, 12670, 14713, 2948, -1711, 7439, 12962, 11067, 26296, 38379, 43152, 29817, 9998, -1949, 89, 4726, 3335, -3130, 1090, 2619, 9652, 11236, 10884, 22894, 37744, 38806, 31400, 21073, 11959, -747, 8926, 21302, 21275, 23184, 21002, 17626, 28448, 28339, 16911, 25589, 23098, 18160, 15409, -104, -7976, -419, 21652, 31756, 21713, 28871, 35529, 36347, 27332, 29808, 31668, 24129, 20021, 21351, 20805, 16232, 11031, 5181, 12037, 10707, 10288, 8680, 10144, 13719, 25577, 17855, 16141, 11650, 15796, 17127, 29329, 37780, 30260, 34355, 36516, 26093, 17166, 22261, 22097, 21231, 15235, 22416, 24290, 29595, 14338, 12150, 19684, 17623, 11707]
9896A1707n163K645K2207J7813m409k1318j124j8270j1338L3J9570Q728M376P567
9882C3024j0291j2826p645m330J6156R617J284J274J412k051o895L011Q07j609
9868B0938J773l085l302n905o077l047J4508K0618n302j9975r633M207J7319M602
9854B7639O460L61j258n406J3484L166k4583j2695M19R39o53M220R549P431R051
9839C8124q318j2147K709R207k282j3284K3o579K211j26J0936J1878n042K388
9825B9698m073m124O320o831m661N737O169j2809j3186R372J8741J4709N268j1848
9811C8482p971q358p053k525m686o173R422J757j281m672J1362L511O588l374
9797B5029Q541J3651N910j0672k1310j0180j0108M9J0760k756r015k141J2837
$$ y = [11707, 6544, 9189, 31396, 49209, 44800, 23482, 22358, 4088, -7250, -7217, 12353, 21081, 25457, 33024, 22733, 9907, 2262, -2068, 14088, 23705, 24989, 26263, 27675, 25624, 18729, 21740, 22547, 20938, 22711, 19626, 16324, 10419, 4342, 1295, 15803, 36421, 31119, 11144, 1511, 5718, 23037, 27639, 34099, 34460, 33202, 27796, 41280, 44446, 19863, 7168, 7587, 8526, 7873, 12093, 21642, 29073, 38124, 29806, 17659, 20368, 29575, 27293, 14009, 14032, 7453, 9664, 9538, 20474, 32352, 27310, 29698, 25625, 21501, 27821, 20990, 16329, 22066, 28235, 15426, 2240, 11612, 30353, 45062, 50330, 38482, 30511, 22153, 15100, 12575, 7889, 1716, 11138, 12895, 11614, 6942, 18304, 21815, 28403, 25029, 33570, 47221, 53131, 42459, 21149, 10969, 861, 910, 11670, 8914, -101, -2242, 10595]
9784A0595J3145l015j5021K276K004J8167k160n176q850j5561j686J548Q150j0584
9770f168O229Q773l365n043n142J1201K4068K1j5563M63P090L421j0694j710O831
9755B0412l730p804m663l018P846o368j499M29M787o784l182n329P721M803J0647
9740A4268J065p224K630j954p93J120Q468m817J2630n833N866k257N911o263j5948
9725F869o357P591l500k713O929o983m711N18J4421J5900j120o696J325R05n491
9710A6887r507P895J8322o20j3829R937r08q592K233j545K199L409o47k394n069
9695A7771K676O122k905j0553l8L589R21j5041n857N322J6399J1525k448r220
9681A8263m118m661l1P791k023q179N41N321l87J1957J1544q180j0217n440o937
$$ y = [10595, 23740, 20725, 5704, 7980, 9984, 28151, 25991, 20815, 11965, -3596, -5282, -3734, 4416, -6168, 61, 8834, 5469, 426, -4716, 6485, 30553, 30574, 15011, 15474, 22564, 25985, 15291, 13581, 20412, 16682, 8878, 4215, 1197, 9043, 2675, 1176, 1605, 6392, -392, -3574, -8903, -1182, 3621, 14268, 15333, 8109, 10739, 8785, 7992, 9112, 17580, 12763, 25393, 19560, 25426, 23169, 29080, 22817, 6869, 512, 8103, 4603, 1890, 8819, 1836, -2875, -2357, 12064, 27964, 26844, 20148, 21473, 22378, 16887, 7380, 15275, 33597, 32977, 19148, 29085, 28177, 19585, 21818, 20273, 22472, 25881, 25234, 22840, 17771, 20447, 26569, 23664, 13111, 13073, 16662, 17583, 2542, -3315, 2007, 18406, 29931, 27483, 18263, 14145, 9484, 9453, 17244, 15221, 7042, 7583, 12904, 12517, 24474, 36018, 27838, 17621, 12181, 5244]
9666E244K867m254R375J570R231k191k71r03M201L463l91o666L788L780o66k569
9650B5608N206l821m085R360k297N89N837o355K883R131o749j8026m380r473r524
9635f096J6597J267J44j3617m347J4070J3568J184o628M364K486K796p025n786
9621A2977k921P956J4209M295o7j0912j6713L133J1282O634L770L286M607r931
9607C1605q544p262o910l134J4419J0295r685M50o439k3501P754J7951L291l679
9593A6611K367J247R716r740j1770l542K3577J5780K480q97j4033j2279k05O73
9579A9985J7103n296k1403Q223J8610r96O62k592N44J410O10k412Q536k060k493
9564C8431N794l739j0248j4879o278l449k284J915R225N566L297K773l825K928
$$ y = [5244, 8111, 3857, 13232, 14802, 24033, 21842, 21571, 20668, 24869, 28332, 27941, 21275, 25063, 28843, 28177, 25608, 30814, 26993, 22908, 32268, 29971, 30560, 36397, 30042, 32925, 42056, 35307, 17281, 12901, 3428, -6096, 10501, 11768, 11912, -1705, -6052, 8018, 21586, 22770, 16142, 20506, 22992, 25788, 18763, 12977, 10056, 18012, 32221, 36516, 36449, 25537, 8824, 11957, 23239, 29873, 33643, 36929, 41536, 31605, 23061, 15799, 8889, 5755, 20174, 30469, 20784, 21234, 14795, -8706, -952, 16999, 20290, 16611, 18978, 20225, 29941, 20201, 8431, 4889, 28466, 44246, 46726, 45829, 31796, 19517, 19312, 19985, 37088, 31792, 10389, 18612, 37222, 36226, 36888, 34296, 34840, 36250, 36860, 34448, 42984, 40924, 38431, 44225, 40486, 30238, 15359, 9081, 5632, 3348, 5263, 14488, 20054, 23351, 26124, 22299, 25227]
9550B5227o945L03M621J0764k84P614J1195L657k962r587n925J342n424j2295
9536B1301N21J2314n314j085N735m2J528m80o014o973j605o030j321J722Rj3114
9520A152l171J5385J0453O080N471j5718j697L551R123n497m27q00P285Q026k648
9505C6568l940O688L165l939n917q857m664R245Q000J28m190k775r545J682Q90
9490B2539j413N538r925N506K998n165k414n344o002J621j41l943O036R835K1841
9475D1567J724k46j1280j9821n910M500q1J4864J0180j0434o898j408R93J0219
9461B7969J6776q109p305j106L75k097M247j0276j936K845J243O10k81M59l80
9446B3034j4089R619J3430J172j615j7629n605R134L083O043K106k291L973l203
$$ y = [25227, 18282, 18585, 23206, 33970, 33686, 41300, 52495, 56152, 53190, 43603, 37678, 39020, 33596, 21301, 21822, 34136, 28822, 27737, 33472, 33430, 34958, 34478, 28464, 21491, 19886, 13856, 12535, 14257, 14266, 1152, -2019, 13366, 23819, 29899, 35370, 19652, 17955, 21506, 30629, 25132, 24705, 23905, 31190, 39216, 36568, 32628, 39316, 42481, 38542, 32625, 23768, 19104, 28349, 36349, 36477, 32287, 29512, 19967, 21649, 22539, 21126, 26664, 16739, 22245, 25243, 20078, 17664, 12320, 6318, 7939, 7798, 3855, 9891, 19726, 41567, 43291, 43045, 31765, 11944, 6034, 10534, 10453, 25317, 35497, 25063, 18165, 16757, 17750, 27969, 44745, 36636, 29331, 28225, 28600, 26503, 30750, 20474, 18538, 21383, 22626, 23236, 22955, 23414, 23034, 8945, 18564, 31994, 33166, 31551, 13922, 8317, 17451, 20534, 26577, 28683, 26392, 30365, 27162]
9432B7162J136L28J1168J4292j1586j1827k87o8O311R741j3604r536J520q413
9418A6337m608j1833K307Q996J6760p98n643k662j3145L605J9927K908N245J861
9404C9257j0924J985p31J1563m581m660N96j6894l460K86K34K198P719n09N257
9389B7336n72m86j538p768P37p49p413j188L908J1037O289J8503n351n924j1209
9374B5612l111M760J8533J932k187k465j7657j6392N607L153j0637J2003J2713
9361C1864l683j977l24L768L968P1q324J6111J8385J2648k977n266J328O220J4074
9346H5886K1388J7327J5920J2337o46l377L626j0343k213j0087j3156k0446j1540
9333H4676j3646j3151m547M490J919M562m884J806J84l222l333K009k90j864M940
$$ y = [27162, 28298, 28626, 39794, 54086, 42500, 30673, 30386, 30318, 36629, 46370, 32766, 23230, 24750, 16337, 11729, -104, 2203, 11199, 27959, 27161, 21518, 18856, 5711, 9316, 29243, 32151, 37396, 39257, 28333, 30318, 29587, 41150, 36569, 31909, 32505, 15611, 12151, 12437, 12671, 14869, 22588, 22079, 27336, 26764, 26278, 24740, 16972, 17709, 16960, 9547, 8359, 12267, 23304, 29593, 48096, 42745, 36821, 25612, 22501, 27261, 45794, 47726, 45539, 43074, 25417, 9025, 14632, 17785, 7148, 19151, 31864, 28181, 26204, 25880, 29648, 33616, 33687, 25363, 41474, 59859, 72507, 69530, 64264, 65592, 71812, 85886, 107274, 124601, 140521, 152858, 152212, 148835, 152461, 142118, 139905, 129818, 116662, 96216, 84676, 71030, 57879, 53332, 57822, 59741, 64303, 59419, 61225, 61409, 58187, 54854, 56863, 56573, 54709, 59649]
9318E9649m024l069J3637K56K719J5708J0690M821Q644J0714K9161L8186M4005
9305B31097L7051M8677K8013J7689M069J3279K0307J7088Q040q391k3161n1838
9293C41920l7802l4976m3307j9927k5294k0412j2030l693M104n173J0814J7058
9281A71282J094K599R228l046k2544j5703l503j5044l936l41O110J5938J9894
9268A62028j4109J6964M1895K7227K8162L9653M7953M8778M8376L3264J7989J2093
9256E10273o239M877M753q733j7261k1695l0401l0835j8749j0558j1277j3287
9244C50868p765m479j6558j1173R37J1192k401j5467k9739l5747l7443k7909k7365
9231A46951j2304j8442p248J5815K955l37L26J1011J8075J9508L7321K7195K0600
$$ y = [59649, 55625, 52556, 66193, 66449, 69168, 84876, 95566, 100387, 109031, 119745, 148906, 187092, 231097, 268148, 316825, 344838, 362527, 366596, 379875, 400182, 417270, 425310, 416919, 393758, 341920, 304118, 269142, 225835, 205908, 180614, 160202, 148172, 144479, 148583, 143410, 154224, 171282, 172376, 174975, 184203, 181157, 158613, 142910, 139407, 124363, 120427, 120086, 126196, 142134, 162028, 147919, 164883, 206778, 234005, 262167, 301820, 349773, 398551, 446927, 480191, 498180, 510273, 504034, 508911, 513664, 504931, 487670, 465975, 435574, 404739, 385990, 375432, 364155, 350868, 343103, 338624, 322066, 310893, 311830, 323022, 320621, 305154, 275415, 239668, 202225, 174316, 146951, 134647, 116205, 108957, 124772, 127727, 127390, 127716, 138727, 156802, 176310, 213631, 240826, 261426]
9218B61426J7089N828j1091J92M063J8668K9075K3281K2424K6854L1415K0613
9206D49837M799K42j3836j0680j6357l5662k4965m1604l4236j6740j9167k3570
9194B18061k4294k7338k4367k3317r516M670K731p409k0772j0065L112P350r583
9181G9263J256J6773k641q582j017P638M019j287J2099J2797J0859J3709J4623
9168A59509L1530K5802J6117J3786Q253j3039q013j4239j7144k8217k7384j5830
9156A31131J304q472j2231k2402k8425M107N481p213R474l266j092p089j598J1102
9142G0811K3918J3854l486l827j6917j1790Q070L116j0694M682K246j746m623
9129G3614l669M399J4647Q263k34j5723j046Q135k718o299M252J1554N064P034
$$ y = [261426, 278515, 284343, 273252, 273444, 277507, 296175, 325250, 348531, 370955, 397809, 429224, 449837, 454636, 454878, 441042, 430362, 414005, 378343, 353378, 311774, 277538, 260798, 241631, 218061, 193767, 166429, 142062, 118745, 109229, 113899, 116630, 109221, 88449, 78384, 81496, 88846, 79263, 80519, 97292, 94651, 86069, 85052, 92690, 96709, 95422, 107521, 120318, 131177, 144886, 159509, 191039, 216841, 232958, 246744, 254997, 241958, 233945, 219706, 202562, 174345, 146961, 131131, 132435, 123963, 111732, 89330, 60905, 65012, 70493, 63280, 72754, 69488, 68396, 61307, 59709, 70811, 94729, 108583, 105097, 101270, 84353, 72563, 80633, 83749, 73055, 77737, 79983, 78237, 73614, 69945, 74344, 88991, 97254, 97020, 81297, 80251, 88386, 85668, 79369, 83621, 95175, 100239, 107273]
9115A07273J1486N677L564J3434p098K0165J8184k724j0686q676p508J330O770
9102A51191o472J3706N005M773J9704K5129L0699K6259M160J425J1566L228K3420
9089C13793K2671K4143J6695K1905L4934N2489P4493J09533J62827K25365L11771
9078A370619M90739Q46983J529562K255762J675278l3011j597509j982267j555716
9069C000440q95919n24841l55378k60315j64864j08862r8277o8338n4973l1695
9059D36978j6190k408l1109l5657l3690j3886r102k5109j5898j6802l189J9838
9047B53776K5758L4127R626p182k6057l4895k3945J16J4012N589L671M058O374
9034B65028j5080j4219j0356j2221j4060P930O439J3409J1774r119j260J9669
$$ y = [107273, 118759, 124436, 128000, 141434, 134336, 154501, 172685, 169961, 159275, 150599, 143091, 144421, 151191, 144719, 158425, 163430, 168203, 187907, 213036, 243735, 269994, 274154, 275579, 287145, 290373, 313793, 336464, 360607, 377302, 399207, 434141, 486630, 561123, 670656, 833483, 1058848, 1370619, 1861358, 2708341, 4237903, 6493665, 8168943, 8135932, 6538423, 4556156, 3000440, 2104521, 1579680, 1224302, 963987, 799123, 690261, 591984, 523646, 468673, 436978, 420788, 418380, 387271, 351614, 317924, 304038, 294936, 269827, 253929, 237127, 233938, 253776, 279534, 313661, 323287, 316105, 290048, 255153, 231208, 231324, 245336, 250925, 254596, 258654, 265028, 249948, 235729, 225373, 213152, 199092, 207022, 213461, 226870, 238644, 229525, 228265, 247934]
9022B47934j511N402M578j229J3937N3918O2526L0417N733j7831n1377n7004k5583
9009B69910p058M256Q9r126M51J3806J8198K4808K4543M696o160j8521j3959j2726
8995B93207k768j2916j4942p804k5374j8929k568O917J6218K5494L2235J1757
8983C00527j1662k9121j8393j3031j4302m050M410P694K7059K5438K5250J9920
8971C19739J972R35k440m743m414N862J8125J3376j5733k3073j8421n40J7321
8958C07966L8085N1841L7630L5069J0954j968o510j9993n1269o3203m7058j4819
8946B76725M059J901O757R849n805k2190j7574M06k6750j1953J1358J1278L847
8933B41908o009l0621k6790q861k381J6903K6048K4809J8468J7266L5882M0101
$$ y = [247934, 246423, 251825, 256403, 255174, 269111, 323029, 385555, 415972, 421705, 403874, 352497, 295493, 269910, 262852, 267108, 267197, 258071, 258522, 272328, 290526, 315334, 339877, 344573, 338413, 319892, 305933, 293207, 290439, 277523, 262581, 254777, 229403, 210474, 207906, 214823, 231041, 256535, 288770, 300527, 288865, 259744, 241351, 228320, 214018, 209968, 214378, 222072, 249131, 274569, 299819, 319739, 321711, 322646, 320206, 315463, 311049, 316911, 335036, 348412, 332679, 309606, 291185, 290645, 307966, 346051, 397892, 435522, 470591, 481545, 479577, 473067, 453074, 401805, 338602, 291544, 276725, 280784, 282685, 289442, 299291, 293486, 271296, 253722, 254128, 227378, 215425, 226783, 238061, 241908, 235899, 205278, 178488, 169627, 167246, 184149, 210197, 235006, 253474, 270740, 306622, 346723]
8921C46723K3449n984j7474j6046j4248q543J0460K4283L5719L0481M7439M1672
8909D97931K8984M890k82J0034J1687n492l1226k1438k785j3897r134k0231l8641
8896D10400n6375n0070l8038k7568K842j454j1546j1215j5144j6974j1234j1332
8884A62292J1694J5303R91o025k858R757K362K1724K8199K5866L1772K2442K546
8871C26065k803j8084m416N618J2865K1172L0657K9803J1758J621K2108K8173
8859D64537M3680L7918L4704P791j5919j2715l7572m7262n4062n2087n3314m8344
8847B67355k8360n836k7470j1266l191l722o297Q858L115j0558j3187j4230M884
8834A60095P525K7431N993m495K1709J338J0654K084K290p483n379J0244J3349
$$ y = [346723, 370172, 364188, 346714, 330668, 316420, 307877, 318337, 342620, 378339, 408820, 456259, 497931, 526915, 531805, 531523, 541557, 553244, 547752, 516526, 495088, 492303, 478406, 469272, 449041, 410400, 354025, 303955, 265917, 238349, 241191, 239737, 228191, 216976, 201832, 184858, 173624, 162292, 173986, 189289, 190280, 184255, 181397, 191154, 193516, 215240, 243439, 269305, 301077, 323519, 326065, 323262, 305178, 300762, 306380, 319245, 340417, 371074, 400877, 412635, 414256, 436364, 464537, 508217, 546135, 580839, 588630, 572711, 559996, 522424, 475162, 421100, 369013, 315699, 267355, 238995, 233159, 205689, 194423, 191232, 187510, 181213, 190071, 193186, 182628, 169441, 155211, 160095, 167620, 195051, 201044, 196549, 218258, 219596, 230250, 232334, 234624, 227141, 221762, 232006, 245355]
8821B45355N734Q788J9684K9197J5393J0103K9269L4735K6145P572M145r959j6917
8808D09244k3849k9968l4785k9781k0193k367j543O59r369k2993j7578l317O303
8795B20463j511q327k734J0002n01r225J015R31k090j586j67l218J60O293J2810
8780B22315J5768J6842K5115K055Q76J14r465o742m499J9749J3166J8756J0228
8767C24278J4634k78l0073k3331j1345k2031j1496J6177N790o681L846M321J3506
8754B77317L1357K6653L0112J7846L1606N8624R2979J30879J02767J302j06424
8743F95018j22996r3699n2588m0613k9883j6512O788N924J9352J5894J9692L6075
8731D42452J7468q813j6427k0340k6035k3592k2447n802k644l184k98K648N994
$$ y = [245355, 251089, 259877, 279561, 308758, 324151, 334254, 363523, 398258, 424403, 431975, 436120, 426161, 409244, 385395, 355427, 320642, 290861, 270668, 268301, 266758, 267417, 258048, 235055, 217477, 214160, 220463, 218952, 210625, 207891, 217893, 217392, 208167, 209182, 210113, 208023, 206437, 206270, 203052, 203212, 209505, 222315, 238083, 254925, 280040, 282095, 282971, 283085, 273620, 266878, 262379, 282128, 295294, 314050, 324278, 338912, 338634, 308561, 285230, 273885, 251854, 240358, 256535, 262325, 255644, 259490, 263811, 277317, 308674, 335327, 365439, 383285, 414891, 473515, 566494, 697373, 800140, 801442, 695018, 572022, 478323, 425735, 385122, 355239, 338727, 345515, 351439, 370791, 386685, 406377, 442452, 459920, 451107, 434680, 414340, 388305, 364713, 342266, 336464, 333820, 330636, 330338, 332986, 338980]
8718C38980Q414J7828J8487K8758J9861K1101L5420L2025l193M779M762J6108
8706E43330L1835O9546J34287K05955K92927K47431N9275j15503j65831r3630
8696A209622P1790K17496K60970Q8914j52680k98557k83011k09304j24009o8179
8686G13052n8595m9076n0782m3622k9009k7235j3546J0333k596K834P279P03J5996
8673D75736K2062J5137P743M6912N4085O3165P6155L9684n672k9031k3574JO373
8660G48776K1252N3607J01354J47590J66898J08120M0223K8059J24152K81392
8650A821423N29453O35212L11643k12266n42835n70981m19430k43484j59785j28892
8640A020058q1651l6732k3166l562P471K8920L8624K3926M8073O6662P6710J12890
$$ y = [338980, 347394, 365222, 383709, 412467, 432328, 453429, 488849, 520874, 517681, 522460, 527222, 543330, 575165, 644711, 778998, 984953, 1277880, 1525311, 1584586, 1469083, 1303252, 1209622, 1281412, 1498908, 1759878, 1848792, 1696112, 1397555, 1114544, 905240, 781231, 713052, 654457, 605381, 554599, 510977, 481968, 454733, 441187, 451520, 448924, 451758, 459037, 459740, 475736, 497798, 512935, 520678, 567590, 621675, 684840, 760995, 800679, 795007, 765976, 742402, 742403, 748776, 770028, 823635, 924989, 1072579, 1239477, 1347597, 1387820, 1415879, 1540031, 1821423, 2350876, 2986088, 3297731, 3085465, 2542630, 1971649, 1552219, 1308735, 1148950, 1020058, 938407, 901675, 878509, 874947, 882418, 911338, 949962, 973888, 1021961, 1088623, 1165333, 1278223]
8628A278223J57731K26618L36075M74365P12168J055774J362360J150656K70257
8619G024227o90751j160297j119082p90981n28853l73617k75692j75645q8709
8610A820600l4700R028O2524J03667J84236L00143L76348K91596P1633q0475q2445
8599C022155K0452K15741L96069N98381R04781J347467J991307K710684K690964
8590A3898001J275974p76928k146706k353228j762049j035305m69633Q063N19465
8581G157654J161554K002471K693243K292948P00128r24205j480066r00987K38730
8572A2941470J064757J201853P73316p9718j153769j895576j910073j387991o33230
8563H921039J13155P93594J102616O03783l63554j028986j038178o06124n7351
$$ y = [1278223, 1435954, 1662572, 1998647, 2473012, 3185180, 4240954, 5603314, 6753970, 7024227, 6333476, 5173179, 4054097, 3263116, 2734263, 2360646, 2084954, 1909309, 1820600, 1785900, 1794928, 1857452, 1961119, 2145355, 2445498, 2821846, 3113442, 3185075, 3104600, 3022155, 3042607, 3258348, 3654417, 4252798, 5157579, 6505046, 8496353, 11207037, 13898001, 15173975, 14397047, 12250341, 9897113, 8135064, 7099759, 6630126, 6638189, 7157654, 8319208, 10321679, 13014922, 15307870, 16007998, 15083793, 13603727, 12702740, 12941470, 14006227, 15208080, 15981396, 15901678, 14747909, 12852333, 10942260, 9554269, 8921039, 9034194, 9827788, 10930404, 11534187, 11170633, 10141647, 9103469, 8497345, 8439994]
8554H439994M78704R91515J670578K675055M116073N621888N531089K879251o40888
8545C1763259k607320k290446m02022J805849L104250K603328M24039k148938
8537C2251999l489061l232126k382265j857520j541932q22682M95954K141594
8529B1563961L134004K948059K004567L43400j682596k990889k871979j540185
8521B0908342L34538J819413K339763J679142r2287j984190k710518k086142o64537
8512A9543524O61760J212560J252633J161263Q38631N86998Q50470J132894P12800
8503B7953533Q2472L10415J951846M647726P339835Q384265O158363J071046m470035
8494E3429466p663464p521026n094478k040022O0235J45304j093529k002534j943806
$$ y = [8439994, 8918698, 9910213, 11580791, 14255846, 18371919, 23993807, 29524896, 32404147, 31763259, 29155939, 26865493, 26463471, 28269320, 31373570, 33976898, 34400937, 32251999, 28762938, 25530812, 23148547, 21291027, 19749095, 18926413, 19422367, 21563961, 24697965, 27646024, 29650591, 29993991, 28311395, 25320506, 22448527, 20908342, 21242880, 23062293, 25402056, 27081198, 26988911, 25004721, 22294203, 20208061, 19543524, 20205284, 21417844, 22670477, 23831740, 24670371, 25257369, 26107839, 27240733, 27953533, 28036005, 28346420, 30298266, 34945992, 42285827, 50670092, 56828455, 57899501, 53429466, 45766002, 38244976, 33150498, 31110476, 31170711, 31316015, 30222486, 28219952, 26276146]
8485B6276146j426014r27185q83834j257966j402404q04504N82487K316039L049584
8476B5522349K039131N3342j665001k309798j745403l62989J392269K657173K666222
8467B8247295J960345J021220n40120k382088l305071k774147j162285N27598
8459B1592747J279119J287432J505338K299623K994034K425367M80313j749159
8451C2114814k792348k012226K80992L124213M462257K233458k258738n756779
8443B9395643o540503n312152l630316k377873j546407q67289k32516M43016J082593
8434A0414196J199065M82288n55664j100663r28380k90712M90450J230603J656312
8425A2597495J508662J107660P81126J97821m94578p21706j03555J261594K330770
$$ y = [26276146, 24850132, 23922947, 23039113, 21781147, 20378743, 19574239, 20156726, 22472765, 25522349, 27561480, 27614822, 25949821, 23640023, 21894620, 21531631, 22923900, 25581073, 28247295, 30207640, 31228860, 30688740, 28306652, 25001581, 22227434, 21065149, 21592747, 22871866, 24159298, 25664636, 27964259, 30958293, 33383660, 33863973, 32114814, 29322466, 27310240, 27591232, 30715445, 35177702, 37411160, 35152422, 29395643, 22855140, 17542988, 13912672, 11534799, 9988392, 9121103, 8888587, 9331603, 10414196, 11613261, 12095549, 11539885, 10439222, 9510842, 9220130, 9710580, 10941183, 12597495, 14106157, 15213817, 15994943, 16192764, 15698186, 14976480, 14872925, 16134519, 18465289]
8416A8465289J583985o72343k695546l300813k721597j779757j010474m75006
8408G393738O1240P28474J577426K536495K848779J547576q18425k663785l127405
8399A0084113k569831j774096j212481q80954o49294m68939l23227k39292j84793
8390A781206j34925p4555o7294p0627l1615j2365J9923L7852P9448J29379J91641
8379A848068K84163M29799O31020R56706J394718J633880J081562j36175j235480
8370F888261j615723j361233r41973o65830m67907l55869k64773j66945j15298
8361I32710r3640q5442o2760n2565m5151m4725m4254l0585j8176j3081l0594j6120
8349C95617j4301j3588j3266r393r645j0982p384l814q289j0637O577L479O00
$$ y = [18465289, 20049274, 19376931, 16681385, 13380572, 10658975, 8879218, 7868744, 7393738, 7454978, 8183452, 9760878, 12297373, 15146152, 16693728, 15875303, 13211518, 10084113, 7514282, 5740186, 4527705, 3646751, 2997457, 2528518, 2205291, 1965999, 1781206, 1646281, 1571726, 1504432, 1433805, 1402190, 1389825, 1409748, 1447600, 1527048, 1656427, 1848068, 2132231, 2562030, 3193050, 4149756, 5544474, 7178354, 8259916, 8123741, 6888261, 5272538, 3911305, 2969332, 2303502, 1835595, 1479726, 1214953, 1048008, 932710, 839070, 753628, 690868, 638303, 593152, 548427, 504173, 473588, 455412, 442331, 411737, 395617, 381316, 367728, 354462, 345069, 335424, 324442, 317058, 313244, 304955, 294318, 300895, 304374, 304974]
8336C04974o304q686j7665p480j0786k210j675m492j0308l375N869Q905p039q296
8322B31432j4369j3932R861J6998J3292j283j5529J1139K0286n030p795k82L951
8309B48739J63j9133p184l527j1796j260l756p02m602n109o263p727M59J2348
8295A90650J4067J1620n196j1122j8654j1762N772J7594N828KJ091l322M724M255
8281B05547j0798k2305j0981o485j3676K980j41q520J2284L283R30M449O722J1104
8267A74393J260j2391K842Q444P445J738k1Q207m574K106j0261r125j5329o601
8253A48133J370N481P23r983l840M864K819K969Q229M946m488p517r06r236j955
8238A41609J5378R048j3121j2105J399L598O11K080P806J0021K340r033k584K271
$$ y = [304974, 298670, 289984, 272319, 264839, 254053, 251843, 250168, 245676, 235368, 231993, 237862, 246767, 239728, 231432, 217063, 203131, 212992, 229990, 243282, 241999, 226470, 237609, 257895, 252865, 245070, 244788, 248739, 248902, 229769, 222585, 219058, 207262, 206002, 202246, 201544, 196942, 191833, 185570, 177843, 178302, 190650, 204717, 216337, 211141, 200019, 181365, 169603, 175375, 192969, 198797, 198799, 199890, 196568, 201292, 205547, 194749, 172444, 161463, 154978, 141302, 144282, 144141, 135621, 147905, 151188, 152118, 156567, 163289, 174393, 175653, 163262, 166104, 174548, 181993, 183731, 183710, 191917, 187343, 189449, 179188, 170063, 154734, 148133, 149503, 154984, 155707, 145724, 141884, 146748, 149567, 152536, 160765, 165711, 161223, 153706, 152800, 143564, 141609, 156987, 166035, 152914, 140809, 142208, 145806, 146417, 148497, 156303, 166324, 168664, 159631, 157047, 159318]
8224A59318P874R871M907m309R298k506j3491K278j011j256k032j373J2734J08
8210A80410J1265r097n219L059j853P735P073J6720L4146O5646Q2780N4166j9776
8197D27055o9922o7227m4912j9739o809J7181K1775J3758J7458K9154M5041K0007
8185C82820K2749M3029M6067J9021l5802n6396m1322j6284j1912j3625q401j5414
8173C14530k6981j3073J7798J2786O526J3636K0734L0928N5988N9396M7018K5914
8161E65200j0132l0811o125J0647R863r914m0832n8607l2920k0646o681R794J6176
8148C95012K5114L7667M1314M7138O1533P7262J15163J62518K25057K77010L22754
8137A787542K67845J13454o2460j91328k64225k91776k61955j99287j30666m7954
$$ y = [159318, 167192, 177063, 181970, 177661, 186959, 184453, 170962, 173240, 172229, 170973, 168941, 167568, 180302, 180410, 191675, 182578, 177359, 180418, 178565, 186300, 193373, 210093, 244239, 309885, 392665, 446831, 427055, 357133, 289906, 244994, 225255, 218446, 235627, 257402, 271160, 288618, 317772, 362813, 382820, 405569, 448598, 494665, 513686, 477884, 421488, 380166, 363882, 351970, 338345, 329944, 314530, 287549, 274476, 292274, 305060, 311586, 325222, 345956, 376884, 432872, 492268, 539286, 565200, 555068, 524257, 518132, 528779, 538642, 528728, 487896, 429289, 396369, 375723, 369042, 378836, 395012, 420126, 457793, 499107, 546245, 607778, 685040, 800203, 962721, 1187778, 1464788, 1787542, 2055387, 2168841, 2106381, 1915053, 1650828, 1359052, 1097097, 897810, 767144, 719190]
8127G19190J6523L2203J3709m769k3954l8577j8951R770O969J6165O961R32J7
8114G36188J1025R708o811m2738o5619o6250m4036k9802j6861j0124M148L9276
8102E18104M8114P5085J11510J14830Q6353N5509M1436P4841J55892K88585L98634
8091A968893M61976M16218K05595q3989k88308l71046l78620l41671k86105k29634
8081A073309j53731j04439o4201j8202J4892K4409K0645r8k7029n4079p0907o2897
8069E77672l2245j7390j6772l606j5608j2651J0699L5378N1618L6387K616j6251
8057E99847j9683j2747m351N538J4478N3449Q6569J15997J70308J92463K03341
8046A405209J53977P7240J5013m9053j27185j71745j66309j71346j71374j54126
$$ y = [719190, 735713, 767916, 781625, 776856, 752902, 714325, 695374, 705144, 712113, 728278, 735239, 736171, 736188, 747213, 756921, 750110, 707372, 641753, 575503, 531467, 501665, 484804, 474680, 478828, 518104, 566218, 641303, 752813, 867643, 953996, 1009505, 1050941, 1125782, 1281674, 1570259, 1968893, 2430869, 2847087, 3052682, 2968693, 2680385, 2309339, 1930719, 1589048, 1302943, 1073309, 919578, 815139, 750938, 732736, 747628, 772037, 792682, 792584, 765555, 711476, 640569, 577672, 545427, 528037, 511265, 507659, 492051, 479400, 490099, 525477, 577095, 613482, 616098, 599847, 580164, 567417, 563066, 568604, 583082, 636531, 723100, 839097, 1009405, 1201868, 1405209, 1559186, 1636426, 1651439, 1602386, 1475201, 1303456, 1137147, 965801, 794427, 640301]
8036F40301j24859p3292m6046l9252k0132J275L812P581J1964P907J6110R168
8024C94537O906n310k1757k404L109J5740J4655K977M564q156j713J757k789j6902
8010C85214j1387j5074j4561Q479K0216L2709L3777M9307N2195J1634l6902l9738
7998D75869l0451j9210q051j2749j234j5494k2487q674k0669k3799k5229o378
7986B81444O689K5655J3607J2327J369k316p207m811J4336K6822K8112J6946m764
7973D08209q70m718j256M38k0479j2415K615j0281k3483k3186j3020j5937j8357
7960B67260q669Q186N117K6911K6348J6877J9097n576k2625n420l783P153k327
7947C28549j1481k0158k7783N679K1316J089J9153J7015N818L759L065m362J759
$$ y = [640301, 515442, 442150, 396104, 356852, 336720, 337995, 341807, 349388, 361352, 369259, 385369, 394537, 401443, 396133, 374376, 371972, 375081, 390821, 405476, 408453, 413017, 404861, 403148, 404905, 402116, 385214, 373827, 358753, 344192, 352671, 372887, 405596, 439373, 488680, 540875, 552509, 515607, 475869, 445418, 426208, 418157, 405408, 404174, 388680, 366193, 357519, 336850, 313051, 287822, 281444, 288133, 313788, 327395, 339722, 341091, 338775, 331568, 326757, 341093, 367915, 396027, 412973, 408209, 407339, 402621, 401365, 401803, 381324, 368909, 371524, 361243, 337760, 314574, 301554, 285617, 267260, 258591, 266777, 271894, 298805, 325153, 342030, 361127, 355551, 332926, 327506, 323723, 330876, 328549, 317068, 296910, 269127, 274806, 296122, 297211, 316364, 333379, 339197, 342956, 346021, 341659, 343418]
7934C43418p710n595j820j2788p94J2095J6563K6498K7693L3821K3947j0064k3074
7921D22190l8137l5444k4734j1241J4439J8241Q139Q750o858L162J5712J573M438
7908C80230J182K3257J1719j1942r780j1705p708Q714o444r698N391J1672J9786
7895D04674P381j1439k9349k4537j3127k386j6113q585J0282K1852K4240J8106
7883C80999K2179K2552J874r778j3474k314K677L203K065l686J4020J0136J6440
7870D46893j76L692J6385J0691Q730q898l857l565j0124o170J071J79j126p30
7856D52995o652k628J1206J7159L480j2343k4130j7927j6944p111N228J3988n331
7843D10990j3659j1921k634N80O890L966j0663R130J9434O467J0090K947P134
$$ y = [343418, 335708, 330113, 328293, 315505, 314711, 326806, 343369, 369867, 397560, 431381, 455328, 445264, 422190, 384053, 348609, 323875, 312634, 327073, 345314, 353453, 362203, 355345, 358507, 374219, 375792, 380230, 381412, 404669, 416388, 404446, 394666, 382961, 375253, 383967, 377523, 367825, 373216, 384888, 404674, 412055, 400616, 371267, 346730, 333603, 331217, 315104, 306519, 316801, 338653, 362893, 380999, 403178, 425730, 427604, 417826, 404352, 402038, 404715, 407918, 409983, 406297, 420317, 430453, 446893, 446717, 450409, 466794, 477485, 486215, 477317, 473460, 469895, 459771, 453601, 454672, 454851, 453725, 452995, 446343, 443715, 454921, 472080, 475560, 463217, 439087, 421160, 404216, 397105, 402333, 416321, 410990, 397331, 385410, 382776, 383356, 390246, 394212, 383549, 392679, 412113, 418580, 428670, 431617, 438751]
7830D38751P198M343j748j545J2194J7644P445N497K063n532n728N425J3426N548
7816E04981j247P476O318n577k3961n523R058m677l145r007k3425n560P987l938
7802D49760q795p835l792l992q242p76K934n340N290P733J0812j818p770n003
7788D23166J29o147R716Q197M210L477J5065J1133L822K6804K8167J3309P149
7775E48197J7782J076o967r825j279N343j0299o523n124j1107m626J2991K4417
7762E54056K6476J1298M248J3826P052j1283j55J0041K1730K8356J8078L7059
7750G20782O7896P5782J02155J28472J52164K13738L24882M70296N73371M43438
7740C272976Q4340k78167m81215m48413l33694k39500j60384j14685q2606n5636
$$ y = [438751, 445949, 450292, 448544, 446999, 459193, 476837, 484282, 489779, 491842, 486310, 480582, 486007, 499433, 504981, 503734, 511210, 517528, 511951, 487990, 482467, 491525, 486848, 483703, 474696, 451271, 445711, 453698, 449760, 440965, 433130, 429338, 425346, 417104, 416328, 419262, 413922, 419212, 426945, 437757, 435939, 428169, 423166, 423295, 417148, 426864, 435061, 439271, 442748, 457813, 468946, 472768, 499572, 527739, 541048, 548197, 565979, 567055, 560088, 550263, 548984, 554327, 544028, 537505, 532381, 521274, 516648, 529639, 554056, 580532, 591830, 596078, 609904, 616956, 605673, 605518, 615559, 637289, 665645, 683723, 720782, 788678, 864460, 966615, 1095087, 1247251, 1460989, 1785871, 2256167, 2829538, 3272976, 3357316, 3079149, 2597934, 2149521, 1815827, 1576327, 1415943, 1301258, 1218652, 1163016]
7730A163016l6827j8180L080J120q642j6606j0561J246r423Mj1002j8441k4812
7717A013972k7815j395j1853O310J7222J6730K4403P272J0590J5469L6271M5490
7705A152666L4701K8087K2785L727K1938M1939N3467P4867Q5813J07521J21103
7694A748614J76426K24575L01888L84429M98912N05971L00571n1369l44012m22766
7684C323239l28812k04678j14233k8059L4896P5595P1382K1623j0939r983L821
7673B833852N0578Q3408J09697J58742J81391K06425K09534K24705K72260L10188
7663D640780L58188M32554N52249P23302R94554J380633J946224K856558M346111
7654A8231153O410284Q028550P585391N241584K292285r78268m412372o964411
$$ y = [1163016, 1126189, 1108009, 1111089, 1112209, 1103567, 1086961, 1076400, 1077646, 1068223, 1068227, 1057225, 1038784, 1013972, 986157, 984762, 972909, 979219, 996441, 1013171, 1037574, 1044846, 1055436, 1070905, 1107176, 1152666, 1187367, 1215454, 1238239, 1241966, 1263904, 1305843, 1359310, 1434177, 1519990, 1627511, 1748614, 1925040, 2149615, 2451503, 2835932, 3334844, 3840815, 4141386, 4090017, 3746005, 3323239, 2994427, 2789749, 2675516, 2647457, 2682353, 2757948, 2829330, 2850953, 2840014, 2830031, 2833852, 2884430, 2967838, 3077535, 3236277, 3417668, 3624093, 3833627, 4058332, 4330592, 4640780, 4998968, 5431522, 5983771, 6707073, 7701627, 9082260, 11028484, 13885042, 18231153, 24641437, 32669987, 40255378, 45496962, 47789247, 46810979, 42398607, 35434196]
7646C5434196p545473o335580m434610k848508j774947j086908o06744k68615
7638A0532811l8853J46621L10607N30962Q14714J158479J533564J950785K481359
7629A9421049L253305M479128O501385R682671J3811169J6958178J6650970J3565360
7621A04323215J0239506O817456K501245m97958L28968L037844M141718M595416
7613A35487410Q124919J2468503R159946m105505j8598039k4610716k0418990
7606I7507528j0729511p41356O232311P967094M250613k156801p502599j0638709
7598H4188570j2353322j2941841j1958314r563694o636128m124391k398683j335565
7590B2876632o85038k03924L93502J307611K709371M802487P641514J0307343
$$ y = [35434196, 27888723, 21553143, 17118533, 14270025, 12495078, 11408170, 10801426, 10532811, 10493958, 10640579, 10951186, 11482148, 12296862, 13455341, 14988905, 16939690, 19421049, 22674354, 27153482, 33654867, 43337538, 57148707, 74106885, 90757855, 104323215, 114562721, 121380177, 123881422, 123383464, 123712432, 126750276, 130891994, 135487410, 143612329, 156080832, 165240778, 161135273, 142537234, 117926518, 97507528, 86778017, 86036661, 92268972, 100236066, 104486679, 102329878, 94827279, 84188570, 71835248, 58893407, 46935093, 37371399, 30735271, 26610880, 24212197, 22876632, 22191594, 21987670, 22381172, 23688783, 26398154, 31200641, 38842155, 49149498]
7582D9149498J0776791Q403926M859444J182401k745530n759161n967221k815157
7574E7084991K792384R014530J3363454J4239256J3168469J2883798J2781523
7567A35328405R283912J318877o534465q550942m930626j444150j125748k258275
7559A21086988l737081o442219r351031r466895o001045k563956l538185q308359
7551G1678217j2431296j2985277j0589243p442194n068035l609372k654615j909533
7543A4988652j308048q28569n04283k54216J1083L52009Q58173J579844K685157
7534A7579802M407765O911985R391467R946644P557355K836873l003542q015474
7526D7612875j0304904r628044p330234m933967l234603k252494j646570j238158
$$ y = [49149498, 59926289, 68330215, 73189659, 74372060, 71626530, 65867369, 59900148, 57084991, 59877375, 68891905, 82255359, 96494615, 109663084, 122546882, 135328405, 144612317, 145931194, 139396729, 130845787, 125915161, 124471011, 123345263, 121086988, 117349907, 110907688, 101556657, 92089762, 86088717, 83524761, 79986576, 71678217, 59246921, 46261644, 35672401, 28230207, 23162172, 19552800, 16898185, 14988652, 13680604, 12852035, 12347752, 12093536, 12104619, 12456628, 13314801, 14894645, 17579802, 21987567, 28899552, 38291019, 48237663, 55795018, 58631891, 55628349, 47612875, 37307971, 27679927, 20349693, 15415726, 12181123, 9928629, 8282059, 7043901]
7518G043901r56278p69831o43516n32671m24327l24852k59211j88437j46652j18838
7508B679288j01201j07150j29045j22013j07557r1676p1855o4514l1878l0141
7498A822258N033K0927O4703O3326L6613N3885J15514K03036L36575N63403Q95883
7487D181156J297201J496911J075850P1588r43112j423355j350767j017363o86098
7478B702011m70868l32202k17882j37021j03685q7508p1355o5109o3854m2737
7468A109790k4728k7106l9311l9388l2505k9482k8328l0342l0103l4660k7981
7457G65856k2837j7299m080J5746L1909K3359J8278K4993K1846J2672N0277P9950
7445A000670R5606J31551J70064K69566L91334O03662R71482J367386J465983
$$ y = [7043901, 6087623, 5317792, 4674276, 4141605, 3717278, 3392426, 3133215, 2944778, 2798126, 2679288, 2578087, 2470937, 2341892, 2219879, 2112322, 2020646, 1948791, 1884277, 1852399, 1822258, 1827291, 1848218, 1912921, 1976247, 2012860, 2066745, 2182259, 2385295, 2721870, 3285273, 4181156, 5478357, 6975268, 8051118, 8122706, 7179594, 5756239, 4405472, 3388109, 2702011, 2231143, 1898941, 1681059, 1544038, 1440353, 1352845, 1281490, 1216381, 1152527, 1109790, 1085062, 1057956, 1018645, 979257, 946752, 917270, 888942, 858600, 828497, 793837, 765856, 743019, 725720, 721640, 737386, 769295, 792654, 810932, 835925, 857771, 870443, 920720, 1000670, 1096276, 1227827, 1397891, 1667457, 2058791, 2662453, 3633935, 5001321, 6467304]
7436F467304Q91774j92594j108316j406044j190251q44858n67211l75084k67048
7427A407672j88627j19249p5015p5725p0995o5360n7180k9901k9991q611Q775
7416F95793r157k1825l7890l0021k9648k5825j5426k0415p750l229l969o363p966
7403D76309J2398J8406K854J1984J3343J2732Q633J0952P156J8003L6469K5909
7391F55148K2611L4073O120O890J0022j0858K26p805j3898j9376K6893N4798K8151
7378G92995j530l6711l5204k8564j7008j342Q644o158j4167m231J0565J5116J2055
7365F94460l352j3868k5442j5680n270j22R23k970n424P569J1412M854L535j4803
7351F35822K323j003k6700l0422l3665k5520n347m119j1226K911K5969K0599K9683
$$ y = [6467304, 7359078, 7166484, 6058168, 4652124, 3461873, 2617015, 2049804, 1674720, 1407672, 1219045, 1099796, 1024781, 949056, 878061, 812701, 755521, 725620, 695629, 687018, 695793, 686636, 664811, 626921, 596900, 567252, 541427, 526001, 505586, 497836, 494607, 490638, 484275, 476309, 488707, 507113, 509967, 521951, 535294, 548026, 556659, 567611, 574767, 592770, 629239, 655148, 677759, 711832, 717952, 724842, 734864, 724006, 724232, 716427, 702529, 683153, 710046, 764844, 792995, 791465, 754754, 719550, 690986, 673978, 672636, 681280, 675122, 660955, 656724, 667289, 682405, 694460, 691108, 677240, 651798, 636118, 630848, 630726, 631649, 628679, 623255, 630824, 642236, 647090, 650625, 635822, 638145, 637142, 610442, 580020, 546355, 520835, 515488, 511369, 500143, 503054, 529023, 549622, 579305]
7338E79305N3272N4092L3472O537j9037k2737j2665O736K0677J5083J0378Q486
7326G33599j053k0140j5862j1985k9651m0154m3731l3009l8983l3536j8930j6781
7314D29784p564K332l641j0283j1235l556n807Q718J6267K8558J8896M3445L4194
7301E40108K7938J1245m731O741q063K532M407M424R42j3341p673j7126l9488
7288E07915j8623p038k1036p064j7579j7943q203j802o040j648N957K473M221
7275D13590J3299J7184k362k029l186P714l83l703m299l840P94K7556L3030K6627
7261E19992L2145L6102L7416K9189J2561j4335j6237L259K951R452J7163P546
7249F77204K601J0024K6755L7991L6050K6460L6303L9709N5809P4072J18130J45126
$$ y = [579305, 632577, 686669, 720141, 726678, 707641, 684904, 672239, 678975, 699652, 714735, 725113, 733599, 732546, 712406, 696544, 684559, 654908, 614754, 571023, 538014, 499031, 465495, 446565, 429784, 422220, 424552, 420911, 410628, 399393, 395837, 390030, 398748, 415015, 443573, 462469, 505914, 540108, 568046, 579291, 574560, 581301, 573238, 575770, 580177, 584601, 585543, 572202, 564529, 547403, 507915, 489292, 482254, 461218, 454154, 436575, 418632, 410429, 408627, 402587, 400939, 406896, 409369, 413590, 426889, 444073, 441711, 439682, 436496, 444210, 443827, 440124, 435825, 431985, 432779, 460335, 493365, 519992, 552137, 588239, 625655, 654844, 667405, 653070, 636833, 640092, 643043, 652495, 669658, 677204, 679805, 689829, 716584, 754575, 790625, 817085, 853388, 893097, 948906, 1022978, 1141108, 1286234]
7237A286234J85032K65475L84681N78809Q48992J032542J087813Q74943L77850
7228F922371k21523p20562r73641r73789q08000n84046l90906k58458j65117j29906
7218A696423j06052o5738m2940m1963l3363j6032J227J955Q500L5757N4612P8721
7206A571107J20813J43421J61789K34477L50856N32703P92507J030848J136865
7197F075386R43212M14658k06258p22042j015076j003993q11591n92403l88927
7188B692966k43782j85899j37925q6874n6178m3909m4030p594L1441K7724L7088
7177A983028L4172M2967L2203K5854J1787O320m772q465J4981K9296K0675K7005
7165B215051M5192P2401Q1761R5805J24457J53407J71352J56686J41220J61042
$$ y = [1286234, 1471266, 1736741, 2121422, 2700231, 3549223, 4581765, 5669578, 6544521, 6922371, 6700848, 5980286, 5006645, 4032856, 3224856, 2640810, 2249904, 1991446, 1826329, 1696423, 1590371, 1524633, 1481693, 1439730, 1406367, 1390335, 1391562, 1393517, 1402017, 1437774, 1492386, 1571107, 1691920, 1835341, 1997130, 2231607, 2582463, 3115166, 3907673, 4938521, 6075386, 7018598, 7433256, 7226998, 6504956, 5489880, 4485887, 3674296, 3081893, 2692966, 2449184, 2263285, 2125360, 2038486, 1982308, 1938399, 1894369, 1886775, 1918216, 1945940, 1983028, 2017200, 2060167, 2092370, 2118224, 2130011, 2136331, 2131559, 2123094, 2138075, 2167371, 2188046, 2215051, 2260243, 2332644, 2414405, 2510210, 2634667, 2788074, 2959426, 3116112, 3257332, 3418374]
7155C418374J72979J80599J92062K11587K28642K61926L08755L70138M39832N27032
7145F311926O79999Q99748J173440J519059K053642K900110M311771O404927Q668999
7136C4923621J0088784R242150O025219R81413m114239p748113r108119q450689
7128C1840027o546308m447619k703317j455942n94920l0313L69562O54981R62617
7119A8048768J415830K077262L009961M346690O342325Q838603J0942824J2003186
7111F7025449J1311283R476106Q350872R230949J2297972J5986337J8299706J7191569
7103A69170243J2334316M798766k861170q101048r553360q715708o993708n272965
7095A44805366m775747n756003p361603r213490j1357197j2916750j3295353j2107434
$$ y = [3418374, 3591353, 3771952, 3964014, 4175601, 4404243, 4666169, 4974924, 5345062, 5784894, 6311926, 6991925, 7891673, 9065113, 10584172, 12637814, 15537924, 19849695, 26254622, 34923621, 45012405, 54254555, 60279774, 61261187, 57146948, 49398835, 40290716, 31840027, 25293719, 20846100, 18142783, 16686841, 16091921, 16061608, 16431170, 17086151, 18048768, 19464598, 21541860, 24551821, 28898511, 35240836, 44079439, 55022263, 67025449, 78336732, 87812838, 96163710, 105394659, 117692631, 133678968, 151978674, 169170243, 181504559, 186303325, 183442155, 175341107, 165787747, 157072039, 150078331, 144805366, 140029619, 134273616, 126912013, 117698523, 106341326, 93424576, 80129223, 68021789]
7087F8021789r349944n554047j322411K804390N946206P634770P325639N177177
7079H0683569K985622K572910M390976P899025J1483428J2329840J0299513O272662
7071A38917545K209116m1107R00246L508416N864396O766632M956609J74851n921782
7062A57334922j2048381j7444735k0549699k0979156j8970475j5448371j1551790
7055D0342315q174613n685274m053450l038215k354953j837657j419814j065599
7047A2712740p51972m97332k48322k6068K31668N82459J112548J938444L032655
7038A8086820L975938M535225M438066L430792J924796L64629r17902k144010
7030C3694354l356816m373364m824931m582334l712718k719513j895686j346375
$$ y = [68021789, 58671845, 53117798, 51795387, 54599777, 60545983, 68180753, 75506392, 80683569, 83669191, 86242101, 90633077, 98532102, 110015530, 122345370, 132644883, 138917545, 141126661, 141085554, 141985800, 145494216, 151358612, 158125244, 163081853, 163256704, 157334922, 145286541, 127841806, 107292107, 86312951, 67342476, 51894105, 40342315, 32167702, 26482428, 22428978, 19390763, 17035810, 15198153, 13778339, 12712740, 11960768, 11463436, 11215114, 11189046, 11420714, 12003173, 13115721, 15054165, 18086820, 22062758, 26597983, 31036049, 34466841, 36391637, 36756266, 35838364, 33694354, 30337538, 25964174, 21139243, 16556909, 12844191, 10124678, 8228992, 6882617]
7022F882617j011258p83949n97529m55966l50291k75657k18062j62777j10649
7013B916479n4145n2447r5707j47193j72233j51244j43467j22471q7620o2939
7003A827013m3576k3785k1500l4500m4549m4800p0759r0385j01024q2424o1838
6992A207873n7609n7937l6009k1564k5272k1792k2226k1051m849O641m698L4389
6980I75896N8342R1925J36252K23619L56663M12745L97198K63024N2875j58199
6970B810340l31772m01053l55315k74441j90851j28855j02568p8152m8776m1476
6960H57081l4599k6543l4193o742J4325J1362L4951O0212O6552R5114J87159K62736
6948A487415L21930L35854K58374R6251j10191k74253l74366l60646k97689k17122
$$ y = [6882617, 5871359, 5087410, 4489881, 4033915, 3683624, 3407967, 3189905, 3027128, 2916479, 2862334, 2809887, 2714180, 2566987, 2394754, 2243510, 2100043, 1977572, 1889952, 1827013, 1783437, 1759652, 1738152, 1703652, 1659103, 1614303, 1543544, 1453159, 1352135, 1269711, 1207873, 1150264, 1092327, 1056318, 1034754, 1009482, 987690, 965464, 944413, 939564, 946205, 941507, 975896, 1034238, 1126163, 1262415, 1486034, 1842697, 2255442, 2652640, 2915664, 2968539, 2810340, 2478568, 2077515, 1722200, 1447759, 1256908, 1128053, 1025485, 947333, 898557, 857081, 822482, 795939, 761746, 755004, 769329, 780691, 815642, 875854, 942406, 1037520, 1224679, 1487415, 1809345, 2145199, 2403573, 2499824, 2389633, 2115380, 1741014, 1380368, 1082679, 865557]
6938H65557j44795r3513n2028j6652J0154r151r255j5081r144o760p798n123n333
6925E01078n000n464O578J507K473j848l678j13J2763j1384k6040m4101l6696
6912C90075l5653l1798j9772j7799j5193k7017j9036l782R165J6264J0278J9901
6900B75633K7309J4876J5534J8457L6166L3219K4423K3423J6842K0024L2637J5778
6888E54321J6812Q743j1937j5606j9311j8973j2605j189j0610j8326k2138k5851
6876D23330l3277m4080m7073l2155k2912k3030j1931M273J4418J4866J0332R068
6864B61829J8736L7151J6756K8623R037J3294L1519J9550m88j3210p220j3997
6852D01580M571P380J5127M225j3562l1009l7996m6472n7437m4224l3690k1649
$$ y = [865557, 720762, 627249, 575221, 558569, 568723, 559572, 550317, 535236, 526092, 519332, 511534, 506411, 501078, 496078, 490614, 497192, 498699, 501172, 499324, 495646, 495533, 508296, 496912, 470872, 426771, 390075, 354422, 322624, 302852, 285053, 269860, 242843, 223807, 220025, 229190, 245454, 255732, 275633, 302942, 317818, 333352, 351809, 387975, 421194, 445617, 469040, 485882, 505906, 538543, 554321, 571133, 579876, 567939, 552333, 533022, 514049, 501444, 500255, 489645, 471319, 449181, 423330, 390053, 345973, 298900, 266745, 243833, 220803, 208872, 213145, 227563, 242429, 252761, 261829, 280565, 317716, 334472, 363095, 372132, 385426, 416945, 436495, 436007, 422797, 415577, 401580, 406151, 413531, 428658, 432883, 419321, 388312, 350316, 303844, 246407, 202183, 168493, 146844]
6840A46844r042m683j5628j4150p552o070j8736q268J1306N144m569M322M318
6827H3236M620K3323J5247m030j171q176n805J385j679j3765j3592r375j5277
6814E4941j9212k559j1497n824L52j1206j3161K378j1135q759R86j942K783p239
6800c1094j761J1262K5288J0825J6694J1239R747Q386J2052k59j8797r165R342
6787E3759R096j2925m791J7231J0802O61j6360l013p512p725p004m603m499N409
6773B8526l726K792J28J802K71O643q423n110J0186N432j774K029M786Q607K5950
6758G8119O333N368J0761P464k156J0292k453m459j5568j4857j776m649k110j479
6744F8830l627J1469J6605J977N264q762n253l179p787O187j648n595J729j072
$$ y = [146844, 137802, 133119, 117491, 103341, 95789, 89719, 70983, 62715, 74021, 79165, 74596, 78918, 83236, 87856, 111179, 126426, 122396, 121225, 113049, 107244, 108629, 106950, 93185, 79593, 70218, 54941, 35729, 33170, 21673, 15849, 16201, 4995, -8166, -5788, -16923, -25682, -24696, -26638, -23855, -31094, -32855, -21593, 3695, 14520, 31214, 42453, 52200, 60586, 72638, 72379, 53582, 44417, 53759, 62855, 49930, 45139, 62370, 73172, 73833, 57473, 54460, 46948, 39223, 32219, 27616, 23117, 28526, 24800, 27592, 27720, 29522, 29793, 36436, 28013, 22903, 33089, 38521, 36747, 38776, 43562, 52169, 78119, 84452, 89820, 100581, 108045, 105889, 116181, 113728, 109269, 93701, 78844, 77068, 72419, 70309, 68830, 65203, 76672, 93277, 95254, 100518, 91756, 86503, 83324, 75537, 81724, 80076, 74481, 76210, 75138]
6730G5138J0720K053m438K04J410p492j906m67L174p088l523M109J033m298L032
6715G1661Q488O942j2091j1015j3798P624R396J1838j5944r649M854k187l326
6702E2793M508J2392N846M669r800J234J1945P03L054q338j9871j5160J504J4046
6688E9525J434M45N118J459J549p040L62p853n608j686Q339L131k217J1392J3035
6673H1385K2825L1895M0887L2781M430j0236k5861k7087k0329l2863k1847j2802
6661F3178j1220j194p594j89J5249M37q585J081J6719P466M354k423m838R387
6647H1828l660N35L455R344R386P503J5731L7309L7824M1991L0160J2150J1682
6634B95238j2322l4947j7486j1089Q498L2545M6833M0060L4094J8740J6504N987
$$ y = [75138, 85858, 87911, 83473, 83677, 85087, 77595, 75689, 75222, 78396, 71308, 67785, 71894, 72927, 68629, 71661, 80149, 87091, 75000, 63985, 50187, 57811, 67207, 79045, 63101, 53452, 58306, 56119, 52793, 57301, 69693, 75539, 80208, 70408, 71642, 83587, 84290, 87344, 79006, 59135, 43975, 45479, 59525, 60959, 61404, 66522, 67981, 69530, 62490, 62852, 54999, 49391, 47705, 56044, 59175, 56958, 68350, 81385, 104210, 136105, 176992, 209773, 214203, 203967, 178106, 151019, 130690, 97827, 75980, 63178, 51958, 50764, 43170, 42981, 58230, 58667, 50082, 51163, 67882, 75348, 79702, 77279, 72441, 81828, 78168, 78703, 82158, 91502, 100888, 108391, 124122, 161431, 199255, 241246, 271406, 283556, 295238, 282916, 247969, 230483, 219394, 227892, 260437, 307270, 347330, 381424, 400164, 416668, 422655]
6622D22655j5331l2866l8152n8168m5944m0094k8091m694K933P922J5527K4153
6610B09850K9029K7961K2360J0561j2840j9976j9592k6302j926q816j6016J4525
6598B08818L3426N5518R8971J05516J03225O3542K9997j5418m2457l7692j4717
6587E88729j986J5675N4054M9184K2446l397m7372q9604r6176q2520n4333n4353
6575C00347m2695l0749m338j0860q449j3862l465J6225K8952L2939M5394M6632
6563C56071R445r26N613r060K960M1683O1167N8569L7267M630l6423n9193p3972
6550C97831p9844n6704k2215r327j3626j6114j6884j8784k3732k7680o022J522
6538A08421K283J7182L4087L6863M5875L5051J1821Q436j2375j4865K915R325
$$ y = [422655, 407324, 374458, 336306, 278138, 232194, 192100, 164009, 159315, 162248, 170170, 185697, 209850, 238879, 266840, 289200, 299761, 286921, 266945, 247353, 221051, 219125, 210309, 194293, 208818, 242244, 297762, 396733, 502249, 605474, 669016, 699013, 683595, 641138, 603446, 588729, 586743, 602418, 656472, 705656, 728102, 724705, 677333, 587729, 491553, 409033, 354700, 300347, 257652, 226903, 222565, 211705, 203256, 189394, 185929, 202154, 231106, 264045, 309439, 356071, 365516, 364590, 370203, 361143, 364103, 405786, 466953, 525522, 562789, 567419, 530996, 471803, 397831, 317987, 261283, 239068, 229741, 216115, 200001, 183117, 164333, 140601, 112921, 106899, 108421, 110704, 127886, 161973, 198836, 244711, 279762, 291583, 300019, 287644, 272779, 275694, 285019]
6526B85019J2771K7113J532j9120l1355k3508j0031k3626k9285l0655k5581l0447
6514A02827k2268j5076k2829k0026l9O266J477j4882q921K2281K1932J1048K7101
6501H8891L7474M1422L7921K5164K990k5484l6828l1362k5669j2556l182j4820
6489H3961j1437j7032k0580o307o81m95o372K618L043j5809p878l017J1482K946
6475A4442j1720j3624k550J6595J808r66P137N325K368J009m009k275M776j0249
6461H067k584l017k347m142L166O634R868r194j1069n106M548p907O194J598n612
6446a0903M679P231J2855o712q04k741K252j3696o063L681N904j808O410l528
6432c243j0138L033P046o719j017J5733J0490o34k8785k0474J5694J2358L866
$$ y = [285019, 297790, 324903, 326435, 307315, 275960, 252452, 242421, 218795, 189510, 158855, 133274, 102827, 80559, 65483, 42654, 22628, 22589, 28855, 30332, 15450, 6529, 28810, 50742, 61790, 88891, 126365, 167787, 205708, 230872, 233862, 208378, 171550, 140188, 114519, 101963, 98781, 83961, 72524, 55492, 34912, 28605, 27924, 27429, 21057, 23675, 26718, 10909, 3031, 14, 11496, 14442, 2722, -10902, -13452, 3143, 4951, 3985, 11122, 16447, 18815, 19824, 15815, 13540, 18316, 8067, 5483, 2466, 119, -4023, -857, 5777, 15645, 6451, -4618, -9724, -5176, -13083, -6889, -5291, -10903, -6224, 1007, 13862, 7150, 6346, 3605, 5857, -7839, -13902, -10221, -4317, -6125, 285, -3243, -13381, -10348, -3302, -10021, -11038, 4695, 15185, 14551, -14234, -34708, -19014, -6656, -2790]
6419b790J901j052r005n010P512P04l024J41J4997N074j3291k483l804l737Q089
6404e778J4482P719N793L516j4282r707J3265j2877j7411j3731Q366J8392o22
6391b875n497j7103Q139J3320O451Q647L635N98k464j0458l250r476j4189r28
6377b5450L91R666J2270P71N270P413N96j2393q89n462k760R642P723j4471N836
6362a847j918J6877J3045r680k8638j8275L377K789K384N980K430L991o950n770
6348b2205L987J8246K1618j0790j5386P73R075L040M715r736j247K588n477o081
6334f880j4767M434J2629m321j308L506q945J067Q221J142N575r505j261J1789
6320A376M942r235j683M410K839K887j0480j2903O274J4432L010r90m581K63m4
$$ y = [-2790, -889, -1941, -10946, -15956, -8444, -7740, -10764, -10623, 4374, 9448, -3843, -6326, -10130, -13867, -5778, 8704, 16423, 22216, 25732, 11450, 1743, 15008, 2131, -15280, -29011, -20645, -2253, -2875, -8372, -25475, -17336, -4016, 2435, 11082, 14717, 15315, 12851, 2393, -857, -10333, -24522, -25450, -25059, -15393, -3123, -2352, 2918, 10331, 10927, -1466, -2355, -7817, -10577, -935, 6788, -7683, -1847, -3765, 13112, 26157, 16477, -12161, -30436, -27059, -24270, -21886, -15906, -13476, -9485, -16435, -22205, -18218, 28, 21646, 10856, -4530, -3757, 5318, 8358, 13073, 3337, 2090, 4678, -799, -6880, -21647, -17213, -4584, -8905, -10213, -6707, -15652, -14585, -6364, -5222, 353, -9152, -10413, 1376, 6318, -2917, -4600, -190, 2649, 5536, -4944, -17847, -11573, 2859, 5869, 4879, 298, 561, 517]
6305E17R255k438q798p023j0517n91J1960j1275j1561p15J5086Q18l517Q191J4090
6290C482m70j2213q634J344M591R983O220j390o106q650l17O918l617p498m910
6275b1267P056P563j3046N557K81l612J3963L113r706j5141j899k06l36N787m530
6260b6423n07L290J2054J0919l390p944j1040N802J8532Q914O08P351j0973p357
6246a64j867k15k933p473j1644o044J4282J7155R334L426q627k80k242k994p447
6231g733l634k397J3357J3145J555k513j6939l547P648M663r147j0555K342J072
6217a2683p622k657j632n480J8339N477M274L032q276k965M316j0206k543J4719
6203c907K535j1341r09J0082k603Q8R269Q79K628l590j2157j5704K022J3585O986
$$ y = [517, 9772, 7334, -1464, -8487, -19004, -19595, -7635, -18910, -30471, -31186, -16100, -15282, -18799, -10608, 3482, 3012, -9201, -17835, -16491, -11900, -1917, 4303, 2913, -3193, -11843, -12160, -5242, -8859, -16357, -21267, -14211, -6648, -19694, -14137, -13856, -17468, -3505, -392, -10098, -25239, -27138, -27344, -27680, -21893, -26423, -26930, -23640, -11586, -667, -4057, -12001, -23041, -17239, 1293, 10207, 10815, 18166, 7193, -164, -2031, -2246, -5179, -12652, -24296, -30340, -16058, 1097, 10431, 13857, 5230, 4950, 2708, -286, -7733, -11367, -13764, -407, 12738, 14293, 11780, -5159, -8706, -1058, 3605, -5542, -16097, -13755, -12683, -20305, -22962, -24594, -30074, -11735, -6258, -1984, 1048, -7228, -10193, -5877, -16083, -18626, -3907, -1372, -12713, -13622, -3540, -6143, -6055, 3214, 4093, 6721, 3131, -9026, -24730, -22708, -9123, -2137]
6188b137L230j632r206k432K527n801J487J652o612o022K573P656K256p988K2671
6173B222m30r134m340L352O044j4310p276J0842l58n518J656k401L628K753J417
6158a1853o842J4931K979p844N371j210p814q257Q465J284n184M534L777R399
$$ y = [-2137, 1093, -539, -9745, -12177, -9650, -15451, -13964, -12312, -18924, -24946, -22373, -14717, -12461, -20449, 2222, 1792, -7342, -11682, -8330, -2286, -16596, -23872, -13030, -13388, -18906, -17250, -19651, -16023, -13270, -11853, -18695, -3764, -785, -8629, -3258, -4468, -12282, -20539, -12074, -10790, -15974, -11440, -7663, 1736]
$$ [...]
##END NTUPLES=NMR SPECTRUM
##END=
