##TITLE=Analysis number 312826
Compound Code sb 00733
Project Code adrs
Chemist Name stores
##JCAMPDX= 6.0         $$ Bruker NMR JCAMP-DX V2.0
##DATA TYPE= NMR SPECTRUM
##DATA CLASS= NTUPLES
##ORIGIN= Bruker BioSpin GmbH
##OWNER= NMR
$$ XWIN-NMR		Version 3.5
$$ Tue Aug 16 08:36:53 2005 GMT Daylight Time (UT+1h)  MAYBRIDGE\NMR@NMR_250MHZ
##.OBSERVE FREQUENCY= 250.131544655141
##.OBSERVE NUCLEUS= ^1H
##.ACQUISITION MODE= SIMULTANEOUS (DQD)
##.ACQUISITION SCHEME= undefined
##.AVERAGES= 16
##.DIGITISER RES= 18
##SPECTROMETER/DATA SYSTEM= dpx250
##.PULSE SEQUENCE= zg30
##.SOLVENT NAME= DMSO
##.SHIFT REFERENCE= (INTERNAL, DMSO, 0, 16.522)
##AUDIT TRAIL= $$ (NUMBER, WHEN, WHO, WHERE, WHAT)
$$ ##TITLE= Audit trail, XWIN-NMR		Version 3.5
$$ ##JCAMPDX= 5.01
$$ ##ORIGIN= Bruker BioSpin GmbH
$$ ##OWNER= NMR
$$ C:\u/data/dgb/nmr/ADRS/7970/pdata/1/auditp.txt
$$ ##AUDIT TRAIL=  $$ (NUMBER, WHEN, WHO, WHERE, WHAT)
(   1,<2005-08-16 08:36:25.06 +100>,<MAYBRIDGE\NMR>,<NMR_250MHZ>,
      <created by zg, POWCHK disabled, PULCHK disabled
       configuration hash MD5:
       62 19 C7 07 E1 42 D1 B7 37 6C 3D D0 77 39 F9 E6
       data hash MD5: 64K
       82 47 9D 26 9E 97 27 C4 54 F6 85 86 4E BB 32 47>)
(   2,<2005-08-16 08:36:39.29 +100>,<MAYBRIDGE\NMR>,<NMR_250MHZ>,
      <Start of raw data processing
       ef LB = 0.3 FT_mod = 6 PKNL = 1 SI = 32K 
       data hash MD5: 32K
       F8 C8 24 4C 4B 5D 8F 02 66 18 2B AA 5A 1F E9 37>)
(   3,<2005-08-16 08:36:41.92 +100>,<MAYBRIDGE\NMR>,<NMR_250MHZ>,
      <apk 
       data hash MD5: 32K
       D8 45 4E E5 4E D0 91 85 3D 33 02 08 4E 6E DE 1F>)
(   4,<2005-08-16 08:36:43.09 +100>,<MAYBRIDGE\NMR>,<NMR_250MHZ>,
      <abs ABSG = 5 
       data hash MD5: 32K
       40 5D 53 A8 B0 61 2A 63 8B 26 53 F4 08 83 D2 AD>)
$$ ##END=
$$ 
$$ hash MD5
$$ D3 67 09 9B B8 EA C4 40 11 5E A7 A6 2B 1C 37 30
##$RELAX= 
##$RELAX= 
##$RELAX= 
##$RELAX= 
##$RELAX= 
##$RELAX= 
##$RELAX= 
$$ Bruker specific parameters
$$ --------------------------
##$DU= <C:\u>
##$EXPNO= 7970
##$NAME= <ADRS>
##$PROCNO= 1
##$TYPE= <nmr>
##$USER= <dgb>
##$AMP= (0..31)
100 100 100 100 100 100 100 100 100 100 100 100 100 100 100 100 100 100 
100 100 100 100 100 100 100 100 100 100 100 100 100 100 
##$AQSEQ= 0
##$AQ_mod= 3
##$AUNM= <au_zg>
##$AUTOPOS= <1 >
##$BF1= 250.13
##$BF2= 250.13
##$BF3= 250.13
##$BF4= 250.13
##$BF5= 500.13
##$BF6= 500.13
##$BF7= 500.13
##$BF8= 500.13
##$BYTORDA= 1
##$CFDGTYP= 0
##$CFRGTYP= 5
##$CHEMSTR= <none>
##$CNST= (0..31)
1 1 145 1 1 1 1 1 1 1 1 1 1 1 1 1 1 1 1 1 1 1 1 1 1 1 1 1 1 1 1 1 
##$CPDPRG= <>
##$CPDPRG1= <>
##$CPDPRG2= <>
##$CPDPRG3= <>
##$CPDPRG4= <mlev>
##$CPDPRG5= <mlev>
##$CPDPRG6= <mlev>
##$CPDPRG7= <mlev>
##$CPDPRG8= <mlev>
##$CPDPRGB= <>
##$CPDPRGT= <>
##$D= (0..31)
0 1 0 0 0 0 0 0 0 0.06 0 0 0 0 0 0 0.0002 0 0 0 0 0 0 0 0 0 0 0 0 0 0 
0 
##$DATE= 1124177784
##$DBL= (0..7)
120 120 120 120 120 120 120 120 
##$DBP= (0..7)
150 150 150 150 150 150 150 150 
##$DBP07= 0
##$DBPNAM0= <>
##$DBPNAM1= <>
##$DBPNAM2= <>
##$DBPNAM3= <>
$$ [...]
##$SUBNAM7= <"">
##$SUBNAM8= <"">
##$SUBNAM9= <"">
##$SW= 20.6930455092707
##$SWIBOX= (0..15)
0 0 3 0 0 0 0 0 0 0 0 0 0 0 0 0 
##$SW_h= 5175.983436853
##$TD= 65536
##$TD0= 1
##$TE= 295.16
##$TE2= 300
##$TE3= 300
##$TEG= 300
##$TL= (0..7)
0 120 120 120 120 120 120 120 
##$TP= (0..7)
150 150 150 150 150 150 150 150 
##$TP07= 0
##$TPNAME0= <>
##$TPNAME1= <>
##$TPNAME2= <>
##$TPNAME3= <>
##$TPNAME4= <>
##$TPNAME5= <>
##$TPNAME6= <>
##$TPNAME7= <>
##$TPOAL= (0..7)
0.5 0.5 0.5 0.5 0.5 0.5 0.5 0.5 
##$TPOFFS= (0..7)
0 0 0 0 0 0 0 0 
##$TUNHIN= 0
##$TUNHOUT= 0
##$TUNXOUT= 0
##$USERA1= <user>
##$USERA2= <user>
##$USERA3= <user>
##$USERA4= <user>
##$USERA5= <user>
##$V9= 5
##$VALIST= <valist>
##$VCLIST= <CCCCCCCCCCCCCCC>
##$VD= 0
##$VDLIST= <DDDDDDDDDDDDDDD>
##$VPLIST= <PPPPPPPPPPPPPPP>
##$VTLIST= <TTTTTTTTTTTTTTT>
##$WBST= 1024
##$WBSW= 4
##$XGAIN= (0..3)
0 0 0 0 
##$XL= 0
##$YL= 0
##$YMAX_a= 427828
##$YMIN_a= -539052
##$ZGOPTNS= <>
##$ZL1= 120
##$ZL2= 120
##$ZL3= 120
##$ZL4= 120
##$ABSF1= 16.522
##$ABSF2= -4.171173
##$ABSG= 5
##$ABSL= 3
##$ALPHA= 0
##$AQORDER= 0
##$ASSFAC= 0
##$ASSFACI= 0
##$ASSFACX= 0
##$ASSWID= 0
##$AUNMP= <proc_1d>
##$AZFE= 0.1
##$AZFW= 0.1
##$BCFW= 0
##$BC_mod= 0
##$BYTORDP= 0
##$COROFFS= 0
##$CY= 12.5
##$DATMOD= 1
##$DC= 0
##$DFILT= <>
##$DTYPP= 0
##$F1P= 14.0000005364418
##$F2P= -0.99999901652339
##$FCOR= 0.5
##$FTSIZE= 32768
##$FT_mod= 6
##$GAMMA= 0
##$GB= 0
##$INTBC= 1
##$INTSCL= 1
##$ISEN= 128
##$LB= 0.3
##$LEV0= 0
##$LPBIN= 0
##$MAXI= 10000
##$MC2= 0
##$MEAN= 0
##$ME_mod= 0
##$MI= 0
##$NCOEF= 0
##$NC_proc= -5
##$NLEV= 6
##$NOISF1= 0
##$NOISF2= 0
##$NSP= 0
##$NTH_PI= 0
##$NZP= 0
##$OFFSET= 16.522
##$PC= 1
##$PHC0= -129.1475
##$PHC1= 64.73225
##$PH_mod= 1
##$PKNL= yes
##$PPARMOD= 0
##$PSCAL= 4
##$PSIGN= 0
##$REVERSE= no
##$SF= 250.13
##$SI= 32768
##$SIGF1= 0
##$SIGF2= 0
##$SINO= 400
##$SIOLD= 32768
##$SREGLST= <1H.DMSO>
##$SSB= 0
##$STSI= 32768
##$STSR= 0
##$SW_p= 5175.98343685301
##$SYMM= 0
##$S_DEV= 0
##$TDeff= 65536
##$TDoff= 0
##$TI= <Analysis number 999999
Compound Code 99
Book Reference 9
Project Code 9>
##$TILT= no
##$TM1= 0
##$TM2= 0
##$TOPLEV= 0
##$USERP1= <user>
##$USERP2= <user>
##$USERP3= <user>
##$USERP4= <user>
##$USERP5= <user>
##$WDW= 1
##$XDIM= 32768
##$YMAX_p= 462428828
##$YMIN_p= -475968
$$ End of Bruker specific parameters
$$ ---------------------------------
##NTUPLES= NMR SPECTRUM
##VAR_NAME=  FREQUENCY,     SPECTRUM/REAL,   SPECTRUM/IMAG
##SYMBOL=    X,             R,               I
##VAR_TYPE=  INDEPENDENT,   DEPENDENT,       DEPENDENT
##VAR_FORM=  AFFN,          ASDF,            ASDF
##VAR_DIM=   32768,         32768,           32768
##UNITS=     HZ,            ARBITRARY UNITS, ARBITRARY UNITS
##FACTOR=    0.157963299565203, 1,           1
##FIRST=     4132.6476996994, 0,             0
##LAST=      -1043.33573715361, 0,           0
##MIN=       -1043.33573715361, -475968,     0
##MAX=       4132.6476996994, 462428828,     0
$$ Real data points
##PAGE= N=1
##DATA TABLE= (X++(R..R)), XYDATA
$$ [...]
16151A51889l0874M2143K3161M1422K3608o3719n1595M2352J0387R8912k2728
16140B64958q0968l105j7386q326P5160j8004k6856J4678J52013q815l257K7127
16128C67219o7147L236m6734k6751k3660j13151k7908J7436j7780P5146M1349
16117A81255Q7932j8083j2662k5129q0111l8503R6592J11043m4805L639M9731
16106C10899R6773L5188K0553J4711n9272o6444n1035m3245n4428o964M5636k8963
16094B13409o6744M8410P5395L6577P8829o8471j00881m5767J7177K5076j8792
16083A94218l0459J8938K3368n7681j5218M0273J7861l8095O662L2798k9277l7650
16071A25738l007r3077m2051M1567J00192J8206R6709L3206o1769p3168J1358
$$ plain form
16151 151889 121015 163158 186319 227741 251349 187630 136035 178387 188774 287686 264958
16140 264958 183990 180885 163499 155173 230333 212329 185473 200151 352164 343349 340092 367219
16128 367219 300072 303308 256574 229823 206163 93012 65104 82540 64760 139906 181255
16117 181255 269187 251104 238442 213313 133202 94699 191291 302334 257529 261168 310899
16106 310899 407672 442860 463413 478124 418852 352408 301373 258128 203700 196736 242372 213409
16094 213409 146665 195075 270470 307047 385876 317405 216524 170757 187934 213010 194218
16083 194218 163759 182697 206065 148384 133166 173439 191300 153205 159867 192665 163388 125738
16071 125738 122731 29654 -12397 29170 129362 147568 244277 277483 215714 142546 153904
16060A53904l1313O9039P4113j2332M1840L9830R5963j1296r1333l7603r6931
16049A93881j0895Q1428j05532n1373p0947k0363k9480M5392K2203L2291M410
16038I1015L3234L6405N228k5811l5975K8468O3284N5854N5381k8099r0888j2796
16026A75300N8075N2490j4941p6863r6645M9754M3521O0414j4216j1306k8401
16015A97182o17L6795K4636r4668n0236l0221M1376R8403P1588j40020n3434o3270
16003C7514R509R7830O8570n599p8543O8533N0387m983n1747O5772J0948K529
15991B70720k4095q7079n2166L1568L0034k5212J6409k1903l6852R2233Q2660
15980B76317p6261j50237l4080K1051L4303p218n9472O4468R7488N6683n0854
$$ plain form
16060 153904 122591 191630 265743 253411 295251 335081 431044 419748 328415 290812 193881
16049 193881 182986 264414 158882 107509 36562 16199 -13281 32111 54314 86605 91015
16038 91015 124249 160654 165882 140071 104096 132564 195848 251702 307083 278984 188096 175300
16026 175300 233375 285865 270924 194061 97416 147170 190691 251105 236889 225583 197182
16015 197182 196565 233360 257996 163328 113092 82871 124247 222650 294238 154218 100784 37514
16003 37514 47023 144853 213423 207824 129281 197814 248201 243218 191471 257243 268191 270720
15991 270720 246625 159546 107380 138948 168982 143770 160179 138276 101424 193657 276317
15980 276317 200056 49819 15739 36790 71093 63875 4403 68871 166359 223042 172188
15969A72188Q9161j1096m5061j18317p6490O6064N6534K476k5187M7998N1778
15958B10048j00564L4886N1369q3105j8282k0224k0809O6690N7092r5000k355
15947G9746K1840j1852J6499J608m1405K6180J02978M2813o5049n2010l7408J00985
15935A84925M2823Q8406q1357r6658k1544M8627M3700j6952M786M3731q4271o1342
15923I4874R0323K6507k3126l0904n382L0937N814q9249p7857L8311m726P6075
15911A31597J4916K9294l5879r2255J04455J22298m6301q9770j8527p5413j683
15900D2732O634R3641M9692j013L406m5858j6510Q536n9735O9996Q9409n5668
15888A85262r1359n2931J5862R6910j3021o90m2142j7663Q9574m1290j5828M6730
$$ plain form
15969 172188 261349 250253 205192 86875 10385 76449 132983 135459 110272 158270 210048
15958 210048 109484 144370 195739 112634 94352 74128 53319 120009 177101 82101 79746
15947 79746 101586 89734 106233 107841 66436 92616 195594 238407 173358 121348 83940 184925
15935 184925 227748 316154 234797 138139 116595 165222 208922 191970 196756 240487 156216 94874
15923 94874 185197 211704 188578 157674 152292 183229 189043 99794 21937 60248 55522 131597
15911 131597 146513 175807 139928 47673 152128 274426 228125 138355 119828 44415 42732
15900 42732 49366 143007 192699 191686 195092 149234 132724 141260 81525 151521 240930 185262
15888 185262 93903 40972 56834 153744 140723 140033 97891 80228 169802 128512 112684 159414
15876A59414K2074K6535j7312o7375r7598k1940j5807k6305P4207l72r437n8789
15864c2705P2608J58603j2598N5328O209j06147l0911J6727N0196K0857l41q720
15852A89106q663n9740J8057j0801o6485j3937K3698k1848M1790O389K3967M1808
15840A63341q0277n2934n3938L5555Q5868N4359O96l5519P667j3761Q0719N2903
15828B44679j3877n35N1229M666r8578j12625L5084J24434K9235r9619q1275m1386
15816D1432o3613K1589j9796K512J54281O6602L1355j9078l0202J0212j36981
15805E8313p6653K2052O6111L8128j9069M5654M9229o0215j6873K9068n537k5995
15793A04213j1266O9629o5205l5026N5588K561m1878m1004n2986K4404K1430M8902
$$ plain form
15876 159414 181488 208023 190711 123336 25738 3798 -12009 -38314 35893 35521 26084 -32705
15864 -32705 39903 198506 185908 241236 247445 141298 110387 127114 177310 198167 197826 189106
15852 189106 180443 120703 138760 127959 61474 47537 71235 49387 91177 97566 121533 163341
15840 163341 83064 30130 -23808 11747 97615 151974 152670 117151 124818 111057 191776 244679
15828 244679 230802 230267 281496 286162 187584 74959 110043 234477 263712 164093 82818 41432
15816 41432 -22181 -592 -20388 -17876 136405 203007 234362 215284 185082 195294 58313
15805 58313 -18340 3712 69823 107951 88882 134536 183765 123550 106677 135745 130208 104213
15793 104213 92947 162576 97371 62345 117933 120494 78616 37612 -15374 9030 30460 79362
15781G9362N1714K1647m4676n0704o385q1047O8753O9391L3216J7948M221j6360
15769A47080m4557n8931O0364M3070l4030n889K6059N6499j20431o8037K4504
15758B5701K6146O7395J04025k6293l0987j0942O3829o627l6155J5235m4332l8564
15746A08431L3395O8375l978l8887j07539j2952q652m417Q5879O6471k3202k9601
15734A33323n2542L2767N0114j9604j01272o1616N6259P8742r943j5963Q1941
15723A72206J9753m8027o4024K2506M3222m6688N1563J7828p2416m0020K6985
15712H2888N1291K9012j6676l7525m3144O416n1218N3197J04785o1517o1569K1975
15700G7915J0586k0969q1174R136K922j0979r4341M9356J74170J7204M9671N5830
$$ plain form
15781 79362 131076 152723 108047 57343 50958 -30089 38664 108055 141271 159219 163440 147080
15769 147080 102523 43592 103956 147026 112996 107107 133166 189665 69234 1197 25701
15758 25701 51847 119242 223267 196974 165987 155045 218874 212247 176092 191327 146995 108431
15746 108431 141826 210201 206223 167336 59797 46845 38193 33776 119655 186126 162924 133323
15734 133323 80781 113548 163662 144058 42786 -18830 37429 116171 106228 90265 172206
15723 172206 191959 143932 79908 102414 145636 98948 150511 168339 95923 55903 82888
15712 82888 134179 163191 146515 108990 65846 72262 21044 74241 179026 117509 55940 77915
15700 77915 88501 67532 -13642 -4506 -1584 -12563 -106904 -57548 116622 133826 183497 239327
15688B39327r7703r1282R944J8761L118m3783k4303n5344m6445Q852J30424J46224
15676A97790n9554K379L7031L0286M8765o2213m4233p2455O015R6873J8210q5402
15664A13492k4068R1496l747l2745n5150n4718n419J705k2695j4475j3604m3194
15652f3122L2067J2071j4154N4725R634k8416K7188L9764j4212l6408K1918J5186
15640E6241O506n631m1387O0337K1058n6592K5385O3838L0783k018l9116q566
15628A10838j943O7038M3485j3842m6341p8322q118n7096o2677L5988j8492K8601
15616h81N1096J2732m1933l7074l66P6795P174L6858J14755j09123m4693m9365
15604A5975m1309R192p2601q1101R9427J58519k74L8287L8807O9115p4182r9751
$$ plain form
15688 239327 141624 50342 60286 79047 82165 38382 14079 -41265 -87710 -78858 51566 197790
15676 197790 138236 140615 177646 207932 256697 194484 150251 77796 83811 180684 198894 113492
15664 113492 89424 180920 177173 144428 89278 34560 29141 30846 8151 -6324 -19928 -63122
15652 -63122 -31055 -18984 -33138 21587 31221 2805 29993 69757 55545 19137 41055 56241
15640 56241 62747 57116 15729 76066 97124 40532 65917 129755 160538 158520 119404 110838
15628 110838 108895 175933 219418 205576 159235 80913 72795 15699 -46978 -10990 -29482 -881
15616 -881 50215 62947 21014 -16060 -16426 60369 67543 104401 219156 110033 65340 15975
15604 15975 -25334 -16142 -88743 -169844 -70417 88102 87828 126115 164922 234037 159855 60104
15592F0104p0315j5381J5031P2042L8968Q199K7943q059j3775J2919o5931L8648
15580A00393O3918j6413O8814m1955n9855m2990L78N4644N8429j5659m6067M8296
15568A71933L4973l4098p1389K815j9892N4062K5401j6292p3833m0438j4326p642
15556A1274N4622L4239o2009n209O7616k1916J0889L463p5325o7899l2177j4478
15544i6910k6236P157P3862O543K1698J03483O0541l0646q9552j46228k2204Q5967
15532e2525O9318k4176O341l6042N674Q8197J0145k8267K9780L8282J08556r722
15520B05561j17538K3199q9896J4996R4221P0126q500q4166r0367R258O6834o8777
15508B4951n865J0287N4017l8359l0134p330J6766N0548r654M8643K5394l1945
$$ plain form
15592 60104 -10211 -25592 -10561 61481 100449 108648 136591 128532 114757 127676 61745 100393
15580 100393 164311 147898 216712 174757 114902 71912 72290 126934 185363 169704 123637 171933
15568 171933 206906 172808 101419 104234 84342 138404 163805 147513 73680 33242 18916 11274
15556 11274 65896 100135 38126 32917 100533 78617 89506 92969 17644 -50255 -82432 -96910
15544 -96910 -123146 -115989 -42127 -35584 -13886 89597 150138 119492 29940 -116288 -138492 -52525
15532 -52525 16793 -7383 -1042 -37084 -31410 56787 66932 38665 68445 106727 215283 205561
15520 205561 88023 111222 21326 36322 130543 200669 192169 108003 17636 26894 93728 24951
15508 24951 19086 29373 83390 45031 14897 7567 24333 74881 65227 113870 139264 107319
15496A07319m8987l6259k5030K9701j5171k7238O6140O2938O159l4429p3466m467
15484G210q09K8297o9545P718J02873J11578J0911n736p7383j16842N114J5847
15472A9233J11866J7542l0142o9298Q518l0231j8888P2999R2038K5867o190m1149
15460A52165K443L0998O3656J1386j30098m3941J7964j20407l7056O2339O9729
15449G9178n8939K1055n2162j42938J07863O3479k9919k2497P0617L2859l8237
15438C0359k9908L8472p743m9116J18809o819l46O0477J1564k6102p7456r3588
15426c1397k4976O6692M3205M9361N0994n1331q4078K0850O8813J7734L7999o6945
15414I6921M0353j09118j23620O3277J7965j1568m3171M1560K2688k5514j7822
$$ plain form
15496 107319 58332 22073 -2957 26744 11573 -15665 50475 113413 119572 85143 11677 7210
15484 7210 6401 34698 -34847 -27129 75744 187322 198233 192497 115114 -1728 3386 19233
15472 19233 131099 148641 118499 49201 57719 27488 8600 81599 173637 199504 193314 152165
15460 152165 154608 185606 249262 260648 130550 86609 104573 -15834 -52890 9449 79178
15449 79178 20239 41294 -10868 -153806 -45943 17536 -12383 -34880 35737 68596 30359
15438 30359 451 38923 31180 -17936 100873 94054 93708 154185 165749 139647 62191 -31397
15426 -31397 -56373 10319 53524 102885 153879 102548 18470 39320 108133 125867 163866 96921
15414 96921 137274 28156 -95464 -32187 -14222 -25790 -68961 -27401 -4713 -30227 -48049
15403d8049r6877L1305M1637k218J4425M4659Q2564N5397L8163p6253j15854m3682
15391g4783j9214l086J0703n4305J5449N7274P3057j7658K8324J29744p8289q5319
15379a8103J6653k7174l942k6589N3126L4942n5090P8974M9479k0820o2801L0807
15367D9462N1477K1677L6974r2793K0977J1278J0365j8135J09720N7225k5775
15356B32452m4337o255J310k2508Q472J3732J1090k7194J5868l8273m9012J0848
15344A06193j5485J3985K6626p5414q4322o1569O379M2036R510Q1559J21197p5561
15332I5134k528J4654k9081n2193j1369O119O9275n4989p2185m6980K6458Q7614
15320B9929o4185n0595L1881M3589l8871j2655J09524J9076n3207p2030m291O0160
$$ plain form
15403 -48049 -144926 -113621 -71984 -74202 -59777 -15118 67446 122843 161006 84753 -31101 -74783
15391 -74783 -93997 -97083 -86380 -140685 -125236 -67962 5095 -12563 15761 145505 67216 -18103
15379 -18103 -1450 -28624 -32566 -59155 -6029 28913 -26177 52797 102276 81456 18655 49462
15367 49462 100939 122616 159590 66797 87774 99052 109417 91282 201002 258227 232452
15356 232452 188115 181860 183170 160662 169134 182866 193956 166762 182630 144357 95345 106193
15344 106193 90708 104693 131319 55905 -28417 -89986 -83607 -41571 -32061 49498 170695 95134
15332 95134 92606 107260 78179 25986 14617 20736 90011 35022 -37163 -84143 -57685 29929
15320 29929 -34256 -84851 -52970 -9381 -48252 -60907 48617 67693 14486 -57544 -61835 -1675
15308a675M4438k3309n5398L7568k142n8858N6196K8009J3553K0556k7391o6874
15296c5327P7281P9724l8068k9920j122M434m5784K4944q529j0403L4121J1657
15284F3008m5622J6595l09P5254K634j8499l0107p7797o2697k2597N1197P6502
15272B7562J6990j7994l037K1531o4188R8135R9398n1770k2331r5291N6134P7582
15260A42721O4737j470q5503o9317l7869J54649q657m1347l7318l5504j6271P1137
15248I9988q0717M290n9131j18383M2791O2784J3737n8410l8025M6257J38929
15237E4110n9325M541J9165k8424o0709J6173J00074M6830L1486m9334Q92M5860
15225A21339l0403n057k9913K6081m9500k6509r190m4719M8616P0333m4441r572
$$ plain form
15308 -1675 42763 19454 -35944 1624 -518 -59376 -3180 24829 38382 58938 31547 -35327
15296 -35327 41954 121678 83610 53690 52568 57002 11218 36162 27633 17230 51351 63008
15284 63008 17386 33981 33672 108926 111560 93061 62954 -14843 -77540 -100137 -48940 27562
15272 27562 44552 26558 23521 45052 -19136 78999 178397 126627 104296 9005 65139 142721
15260 142721 207458 205988 120485 51168 13299 167948 159291 117944 80626 45122 28851 99988
15248 99988 19271 23561 -35570 -153953 -111162 -48378 -34641 -93051 -131076 -84819 54110
15237 54110 -5215 -674 18491 -9933 -70642 -54469 45605 92435 123921 74587 75479 121339
15225 121339 90936 85879 55966 82047 32547 6038 -3152 -47871 745 71078 26637 17065
15213A7065l7945P4226N6146r816O82o0161k8750K3527j0629N5162K8053n6887
15201E0673l7703l2963p4372L6050M4758R4645r1586p0602j0646M2159Q8993K0140
15189E9546m8231j3020L0874q5641k7394q3374Q9217R5161k4892J6650j237m5176
15177c7517j4330l8321J6273J10193J19274P3214j05737k0380n3464m3179J6475
15166B2501r0575n627P4083K7496o0702l4799k9430R611Q0639j2408J6292J1666
15154H747p2438k1874Q5357N4433m388o3035L093k6704P742O1197k4224K9122
15142C7028q5133o1680l9836M8769J17946N5255q409k6417k6662M6027j5417j0223
15130C1248j4250k4421K8937L3973q1147N303l4100N423L8372m370J2451J763
$$ plain form
15213 17065 -20880 53346 109492 99676 100358 40197 11447 34974 24345 79507 107560 50673
15201 50673 12970 -19993 -94365 -58315 -13557 81088 -10498 -81100 -91746 -49587 39406 59546
15189 59546 11315 -1705 29169 -56472 -83866 -167240 -78023 17138 -7754 8896 7659 -37517
15177 -37517 -51847 -90168 -73895 36298 155572 228786 123049 102669 49205 6026 22501
15166 22501 -68074 -73701 382 27878 -32824 -67623 -97053 -87442 -6803 -19211 -2919 8747
15154 8747 -63691 -85565 -208 54225 49837 -13198 -10105 -36809 -29067 32130 7906 37028
15142 37028 -48105 -109785 -149621 -100852 17094 72349 63940 37523 10861 56888 41471 31248
15130 31248 16998 -7423 21514 55487 -25660 -20357 -54457 -49034 -10662 -15032 -2581 -818
15118h18m3543j6864j4421L3991O7934J17753n935r9391J2941M4497L2327o0344
15106F8127q382l0141Q517K577L9738l8422q4274m2661K8302O7955O5362P2881
15094A49579l7566r6913j6314K611K1461M9040k883m39l5250r2821Q0517O5475
15082H6497N6690m4863k3626l8959M1961K9942L2821k7207n9590q4429n6364J91501
15070A04374N541o8363J2034m0190J1088j4910j4006R0383n85k3564J1857k1445
15058E2214o1503p7309M5466M6460k2635o833K3482L4922M5336L3976j8654P8365
15046A73287P718j7825j01989j00149Q072j0854k484L9717O5878L9412L1617j13997
15034A8403r8343o1623O363R6418O680l3233J0080L0096j4276L8541O1547m913
$$ plain form
15118 -818 -44361 -61225 -75646 -41655 26279 144032 138097 38706 51647 96144 128471 68127
15106 68127 59745 29604 38121 40698 80436 42014 -42260 -84921 -56619 11336 76698 149579
15094 149579 112013 15100 -1214 1397 22858 71898 69015 68576 33326 -59495 21022 86497
15082 86497 143187 98324 74698 35739 77700 107642 140463 113256 53666 -30763 -87127 104374
15070 104374 109915 41552 53586 13396 24484 9574 -4432 85951 85366 61802 73659 52214
15058 52214 -9289 -86598 -41132 5328 -17307 -24140 -658 34264 79600 113576 94922 173287
15046 173287 181005 163180 61191 -38958 -30886 -41740 -44224 -4507 61371 100783 132400 18403
15034 18403 -79940 -141563 -135200 -38782 -32102 -65335 -55255 -25159 -39435 -894 60653 55740
15022E5740n0452N1656L9939j993j6476M947m2798o2705j12378J6683L5190Q8379
15010E732R4021j13972r4262o683R5696Q4231k354j03724L6354J3111J4451k14
14998B2387K4646j2078J3369L7205J1755J7548Q50L9475l0158l7120J3800Q0385
14986A82064R8731J0501o0551p7713n3634K7578R2262M9555r6673q8655o4074
14975A9391N867l1682k398K2019j6096M7791Q724K4505m3661j28166N8751m26
14963c5381J6072k5406q9260K4636N5558R0546N7455l0551j3099k7674m7042M1279
14951A7133L271j7839J16178K6949K1473O9714M467o2963j821k0279p7527J9292
14939I8048j39871k4869n3681N4965O4333K8975K0758m5805N1226L0210o2002
$$ plain form
15022 55740 5288 56944 96883 94890 78414 83361 40563 -22142 -134520 -117837 -82647 5732
15010 5732 99753 -14219 -108481 -115164 -19468 64763 62409 -41315 -4961 8150 22601 22387
14998 22387 47033 34955 48324 85529 97284 114832 115682 155157 124999 87879 101679 182064
14986 182064 280795 291296 230745 153032 99398 126976 219238 268793 172120 83465 19391
14975 19391 25258 -6424 -8822 13197 -2899 44892 53616 78121 34460 -93706 -34955 -35381
14963 -35381 -19309 -44715 -133975 -109339 -53781 36765 94220 63669 50570 22896 -24146 17133
14951 17133 20404 2565 118743 145692 167165 236879 241346 178383 176562 156283 78756 98048
14939 98048 -41823 -66692 -120373 -65408 -1075 27900 48658 2853 54079 84289 22287
14928B2287R612N1224N9820n5479k9252p7488J1866n7699j8403M790L991k0498
14916i5229K8385J24086J77179N5310j27645p0138q4142m9450k487Q3855Q5708
14905A25432N8749q6887p1908m7082J4663K5273M0029M2466j01260P2483N6900
14894A28858j1992m5048p0150n1407K0349R2686j5198j30094J0410J37411O2840
14883A28665p9298n9939q746P7450J3789j15637r0771J27760R8416q9422k4418
14872b2151j1642j0674k2453m0565n2924l3767L5138K1075L2569Q3088k0918k4939
14860f8163K1558J394k9203o028K969J161K0637L9702J9797L0815l8650k6429
14848c0440n5654l9781J83296O2766O6502M239p2954L4819q1484j27363J8772
$$ plain form
14928 22287 31899 83123 142943 87464 58212 -19276 -7410 -65109 -83512 -78722 -74731 -95229
14916 -95229 -66844 57242 234421 289731 162086 91948 7806 -41644 -44131 39724 125432
14905 125432 184181 97294 25386 -21696 -7033 18240 58269 100735 -525 71958 128858
14894 128858 116866 71818 1668 -49739 -29390 63296 48098 -81996 -71586 65825 128665
14883 128665 49367 -10572 -19318 58132 71921 -43716 -134487 -6727 91689 2267 -22151
14872 -22151 -33793 -44467 -66920 -107485 -160409 -194176 -159038 -137963 -105394 -22306 -43224 -68163
14860 -68163 -46605 -45211 -74414 -80442 -77473 -76312 -55675 -15973 3824 34639 -4011 -30440
14848 -30440 -86094 -125875 57421 120187 186689 190928 117974 152793 71309 -56054 -37282
14837c7282P5737M2917M3800P1739l7415O636q645p2108m0453L7603Q4589N1997
14825B19115N5077j5946j32984j58937q3363J5585P3992N5369m8085p3304K2281
14814g1200l381M4499O4523R531l1697r1248l4005P834k0866m9598k7282J66389
14802c6501J15966N7414k3821q7211L9373J08261K3036p2680P840P2549m6376
14791A57850l2999k4234k7762m208M8925L1761K580P305l2815r4694o2070L4553
14779D192m6733K9263J7247L5395o6232j6609O1118O6837n0374n2304p21j2377
14767c1298l1732N4929O5275Q737J8439k5248l6468o6663K4508K9650L200L031
14755A6360l354N2075K7181m3000M0948q0183r6808K7430M5074q540M2382p4478
$$ plain form
14837 -37282 38455 81372 125172 196911 159496 166132 157487 85379 44926 82529 167118 219115
14825 219115 274192 258246 125262 -33675 -117038 -101453 -27461 27908 -20177 -93481 -71200
14814 -71200 -74581 -30082 34441 43972 12275 -78973 -112978 -105144 -126010 -175608 -202890 -36501
14802 -36501 79465 136879 113058 25847 65220 173481 196517 123837 131677 204226 157850
14791 157850 124851 100617 72855 68647 117572 149333 151913 159218 126403 31709 -30361 4192
14779 4192 -42541 -13278 3969 39364 -26868 -43477 17641 84478 34104 -18200 -18921 -31298
14767 -31298 -63030 -8101 57174 65911 84350 59102 22634 -44029 -19521 10129 13329 16360
14755 16360 13006 65081 92262 49262 90210 10027 -86781 -59351 -14277 -22817 19565 -54913
14743e4913m1045P5325P9357L2416k1100l5960j34542r864k6009Q278j2748n0656
14731a91461j6072J38820N8165J2830N6967L1875j382k7220J0144l2296o269K7365
14719F1466n1929m7614o0251K2246L8521P0715N5117q1639j00001j1781j2786
14708a17936K6808Q6801k6569m9376l7306K2957J03961L83l9785M790j2196J4282
14696b3186j8623L2129J10249q2823o4327k8082L0380L9960J8069q6597P4183
14685A332L0598M6554m85J1801N5754j695l3218j75878p3001o3761Q9635J52136
14673C9772K9883k5284m9905l8072l3256J7256m8092n0842J05806J03674L0783
14662H1723m8991j3573m4508l1879J39l4224m446j7929K2449J1170m0476p3970
$$ plain form
14743 -54913 -95958 -20633 58724 91140 70040 34080 -100462 -110326 -136335 -128057 -140805 -191461
14731 -191461 -207533 -68713 -10548 2282 59249 91124 89742 62522 72666 40370 34101 61466
14719 61466 9537 -38077 -98328 -76082 -37561 33154 88271 6632 -93369 -105150 -117936
14708 -117936 -91128 -4327 -30896 -80272 -117578 -94621 9340 9723 -30062 -25272 -37468 -23186
14696 -23186 -41809 -9680 100569 17746 -46581 -74663 -44283 -4323 13746 -72851 1332
14685 1332 31930 78484 77999 89800 145554 143859 110641 -65237 -138238 -201999 -112364 39772
14673 39772 69655 44371 -5534 -43606 -76862 -59606 -107698 -158540 -52734 50940 81723
14662 81723 32732 19159 -25349 -57228 -57089 -91313 -95759 -113688 -91239 -80069 -120545 -194515
14650a94515O8846m2796m6202R201Q8181M4284N3683j862q3241k6976J08119J2908
14638a0370J20124K8686O449j1828J4998r055m1459k5125N3002M7664m9529p7400
14626D6157r7067q0119P8207R4415M6200q3503j0302L7662J5072q215n0200J1607
14614h6l4881L8407L0894N5324R4483j31387j30977n8427L5498M6552L1003p1430
14602i5027p8492M6201Q3208M7509J27226j4980j9447o9210m3772P6351n561l5895
14590A8111n3743M960k9941L0228L849o8874o6847N7087K4077O9679L8879k5878
14578A587k1266R1414L91n8439k509n2627q5268j6027l5687J20024M7601j31821
14566a42627k3929J3882Q6628J12844J9035j7749K647L5065M902R1159R467P8861
$$ plain form
14650 -194515 -125669 -168465 -214667 -205466 -117285 -73001 -19318 -21180 -104421 -131397 -23278 -10370
14638 -10370 109754 138440 144889 133061 148059 139004 97545 72420 125422 173086 123557 46157
14626 46157 -50910 -131029 -52822 41593 87793 4290 -6012 31650 46722 38507 -11693 -86
14614 -86 -34967 3440 34334 89658 184141 52754 -78223 -136650 -101152 -54600 -23597 -95027
14602 -95027 -173519 -127318 -44110 3399 130625 115645 96198 26988 -16784 59567 54006 18111
14590 18111 -35632 -30672 -60613 -30385 -26536 -95410 -162257 -105170 -81093 -11414 27465 1587
14578 1587 -19679 71735 72126 13687 11178 -41449 -126717 -142744 -178431 -58407 -10806 -142627
14566 -142627 -166556 -152674 -66046 46798 65833 48084 50731 85796 90698 181857 191324 270185
14554B70185m019o5064o2630r709p9252J08435Q2539K4605m3974j30847o0036
14543C0233K0580P8814N2459M7797k7119j13730p274p3949q4857j8668L7076J9338
14531c9300O3932O669r175m9787r2033L6676J6713p3630J0585J0650j7062N5744
14519h0018L2527l3321j55328N3607J37771J13752O3562J4635j313j13272j14308
14508h1706J30836P4137j0616k7339O0336k9013m4090K2140m5895n8871m2546
14497e2627k0929r043K8760j4687l4944P6558P1909o372n6821k8674k7004M8271
14485b5603R3678O4737n867q3311l3780l0668j2646l0827n1526P0670n383l6956
14473h7482K9794N7751q142o9018j8724L6224o100j6281P8171N80j7078M9498
$$ plain form
14554 270185 266166 201102 138472 128763 49511 157946 240485 265090 221116 90269 30233
14543 30233 50813 129627 182086 229883 202764 89034 81760 7811 -77046 -95714 -58638 -39300
14531 -39300 24632 31301 22126 -27661 -119694 -83018 -66305 -139935 -129350 -118700 -135762 -80018
14519 -80018 -47491 -80812 -236140 -182533 -44762 68990 132552 147187 145874 32602 -81706
14508 -81706 49130 123267 112651 85312 145648 116635 72545 94685 48790 -10081 -52627
14497 -52627 -73556 -82599 -53839 -68526 -103470 -26912 44997 38625 -18196 -46870 -73874 -25603
14485 -25603 68075 132812 126945 43634 9854 -20814 -33460 -64287 -115813 -45143 -50526 -87482
14473 -87482 -57688 63 -8079 -77097 -95821 -59597 -65697 -81978 -3807 -3227 -20305 29193
14461B9193L8540P7633l7227K0480L3707m6071o2065n8168J9265r0979J2202J28269
14449F4779p6505l4856R609J09925M2391M976m6542p4097j02730K8665J3851Q102
14437e2432P3013P8450J5993L2506O1634j21231j14095m3266J28165o0616j15590
14426a17469K6695J39803N9744L302k7224l754j22843J0268J351L5462J10563
14415A15898j7544k2669o6740L6672k3670l6817J0491p066o1837j00618N0506
14404a23394R0345L9210l7781J1551n1471j9668J8482J55782J4982j17986m7765
14393f7713P5096K007o3679o5839k5750R6942P839P4852N8696O9409O0708o4906
14381A57662j03971p7953N3222N4939o2677m8127L3595K4199N5007k3697n0438
$$ plain form
14461 29193 67733 145366 108139 128619 162326 116255 54190 -3978 15287 -75692 -63490 64779
14449 64779 -11726 -46582 -36973 72952 115343 120319 73777 -320 -103050 -74385 -60534 -52432
14437 -52432 20581 99031 115024 147530 209164 87933 -26162 -69428 58737 -1879 -117469
14426 -117469 -90774 49029 108773 112075 84851 81097 -41746 -31478 -30127 5335 115898
14415 115898 98354 75685 8945 45617 21947 -14870 -4379 -11445 -73282 -173900 -123394
14404 -123394 -33049 6161 -31620 -20069 -71540 -91208 -72726 83056 98038 -19948 -67713
14393 -67713 7383 9390 -54289 -120128 -145878 -48936 -41097 33755 92451 161860 222568 157662
14381 157662 53691 -24262 28960 83899 21222 -26905 6690 30889 85896 62199 11761
14370A1761q1133k1542J3754M9945O4647O2117m481n8682j03820k2840M8414J23566
14358H1706M7495n5689p5959L9908J5396n5163l6419o332k7351L8959q077L9469
14346b057N2299J03760o100m205L3676J8801M861k2O0273j01922j85529m8799
14334g4964K9022R5799o2449J9599P1613K6644R6167n4284J5486j7175q9064q5060
14322b8666j9314L0606o3616Q6859M8390k3914J6367n8394p5117o494m5892J6751
14310a22434N2454M5301l5344j01294m524J03538L3529r059k376k9560O796R4281
14298C1308N0339L8557J7996r8011l6419j07453L632j7047L6300J32850k1659
14287C0393l7587J4786q329o7431Q545J05219Q9110l0687L8393o6872l1187j9433
$$ plain form
14370 11761 -69372 -90914 -77160 -27215 37432 99549 95068 36386 -67434 -90274 -41860 81706
14358 81706 129201 73512 -2447 37461 52857 -2306 -38725 -45057 -72408 -33449 -41526 -2057
14346 -2057 50242 154002 147902 143697 177373 196174 201035 201013 261286 159364 -26165 -74964
14334 -74964 -45942 49857 -12592 7007 78620 105264 201431 147147 162633 145458 56394 -28666
14322 -28666 -47980 -17374 -80990 5869 54259 30345 46712 -11682 -86799 -93293 -139185 -122434
14310 -122434 -69980 -24679 -60023 -161317 -165841 -62303 -28774 -37833 -40209 -69769 -62973 31308
14298 31308 81647 120204 138200 40189 3770 -103683 -100051 -117098 -80798 52052 30393
14287 30393 -7194 7592 -737 -68168 -59623 45596 134706 104019 142412 75540 44353 24920
14275B4920M9429K5740K7667j50721j6920P9350R5907p81n7752J1425N095m9122
14263D4237m9379j4482N573P5000m219J62k9941k6788L9566L8140L1299J1881
14251A21049r9490n0167j6718P2576o526O00M5326j7130N2392R795m5765n8782
14239G160m8478M2314k0848r7352J9890P6652m301q4075k9922J3255O3638P8263
14227A6196J1879m9860m5689o517j8406m9651N0700O4204J12315O4474j22744
14216B6901q6037p0492N4622L6536o7089l0225R2100Q7329p3576k8615Q9082K8265
14204E8801J03924p3902q6261r1841k0370q345P386P2985J2876L5038q3170J09556
14192C6677O7246J1837J1059O1796j8741j1224o9928j3216J9028n0600k9078K2051
$$ plain form
14275 24920 74349 100089 127756 -22965 -39885 39465 135372 134591 76839 88264 93359 44237
14263 44237 -5142 -19624 -14051 60949 56730 56892 26951 163 39729 77869 109168 121049
14251 121049 21559 -28608 -45326 27250 20724 21324 66650 49520 101912 111707 65942 7160
14239 7160 -41318 996 -19852 -117204 -97314 -20662 -24963 -109038 -138960 -125705 -62067 16196
14227 16196 28075 -21785 -67474 -73991 -92397 -142048 -91348 -27144 85171 149645 26901
14216 26901 -59136 -129628 -75006 -38470 -105559 -135784 -43684 43645 -29931 -58546 30536 58801
14204 58801 162725 88823 2562 -89279 -109649 -117994 -110608 -37623 -24747 10291 -72879 36677
14192 36677 103923 115760 126819 188615 169874 158650 88722 75506 94534 43934 14856 36907
14180C6907k4112r3495Q6679N8108L519m6080l4198j7164r4886k881P6566j4905
14168f5942k4248n5929j89K169J33986K7933p2258O2180j5706l2879M5960q0104
14156g5027q3528o1744o249J0858J58223M7773M899M385o4471l6910j0001N7307
14144e4485M4716K5147J1239M300j12988k3247K1651P6402k6754M5952N4457p864
14132E8526l1732j0691O354j6075J5353P0869p8737M4348Q4436O833R4070J8893
14120B62447m2644q2499r1613M9514M1434m9079L2086l1214o6588O713j2044r1912
14108g5399m2000o851L3865J40623J8663o1928O851L6558M928l5101K5184L9324
14096H4717L6628k400N900N5691J3321j52632q9663J8817J44289k513r5321o3446
$$ plain form
14180 36907 12795 -80700 5979 64087 67606 21526 -12672 -29836 -124722 -127603 -51037 -65942
14168 -65942 -90190 -146119 -146308 -144139 -10153 17780 -54478 7702 -8004 -40883 5077 -75027
14156 -75027 -158555 -220299 -226548 -215690 -57467 -9694 -4795 -410 -64881 -101791 -111792 -54485
14144 -54485 -9769 15378 26617 30917 -82071 -105318 -83667 -7265 -34019 11933 66390 58526
14132 58526 26794 16103 22457 6382 21735 92604 13867 58215 142651 149484 243554 262447
14120 262447 219803 137304 45691 95205 136639 87560 119646 88432 21844 28557 16513 -75399
14108 -75399 -117399 -124250 -90385 50238 68901 6973 13824 50382 55310 20209 45393 84717
14096 84717 121345 118945 124845 180536 193857 41225 -48438 -29621 114668 112155 16834 -46612
14084d6612J3319P3444Q5006k7467j0218l4590k0159l2940k8827R796P8515J3233
14072G2500n4085J1624r5870j2982M1097P2122m113o4670m8158k4147m9394m0688
14060a96764O490M9379M7842R4015N2730J9934N0795l1698q1620l5347J03305
14049G9061K6099j8465j5084J6220o9707j11450k878Q7183J05765K785l5540P3942
14037A37931K2388l7247n5575p8929k4602J0033N5606L0059j4601J048O5772M0606
14025A52489l236n0940j28268m6751Q0949o299o8041L8061L8477O9300J31361
14014B07102l2866j23014q8022J3640J6914k8311K0623l7341M6942n8107k9003
14003i1443q991R5840j6499k5449J04581P9013r6715m5805k7421J824J17668R6918
$$ plain form
14084 -46612 -33293 40151 125157 97690 87472 52882 32723 -217 -29044 -19248 59267 72500
14072 72500 18415 30039 -65831 -78813 -37716 34406 30293 -34377 -82535 -106682 -156076 -196764
14060 -196764 -190274 -140895 -93053 962 53692 73626 124421 92723 11103 -24244 79061
14049 79061 105160 86695 71611 87831 18124 -93326 -96204 -9021 96744 99529 63989 137931
14037 137931 160319 123072 67497 -11432 -36034 -26001 29605 59664 45063 46111 111883 152489
14025 152489 149253 98313 -29955 -76706 4243 -2056 -70097 -32036 6441 75741 207102
14014 207102 174236 51222 -36800 -23160 -6246 -34557 -13934 -51275 -4333 -62440 -91443
14003 -91443 -100434 -4594 -21093 -46542 58039 137052 40337 -5468 -32889 -31065 86603 183521
13991A83521l0852r1040j47743j9210K8020j33257l514P6368K5341L6921n0234
13980a25679M8684J23950P768M9673n4049r5120k8474p2580Q3507R1851k54K3728
13968E3005M6324J2962k4312r0331o2028J6725N6185N5941l5979j9034R2302n6567
13956D5193k8003N9807J7919m9630J3059l6304k3531P7471O5245J0904j13684
13945C8446q4730l0165J0083O2450M1626M5124L5727P9074M7369p6252L2728Q3590
13933B85070P1383o4839o9763J2418q8198j15226K259M3379L6430o2969J9141
13922F9085K4678L34j5351n0749O2576o2275j10149P7259M7643l8045L0140K943
13910C8089k0178n2648L6168j9988K4650l5670p0113K1500R0011R4918m0219P3670
$$ plain form
13991 183521 152669 61629 -86114 -105324 -77304 -210561 -214075 -137707 -112366 -75445 -125679
13980 -125679 -76995 46955 54723 104396 50347 -44773 -73247 -145827 -62320 29531 29277 53005
13968 53005 99329 112291 87979 -2352 -64380 -47655 8530 64471 28492 9458 101760 45193
13956 45193 17190 76997 94916 45286 58345 22041 -1490 75981 141226 152130 38446
13945 38446 -46284 -76449 -66366 -3916 37710 82834 118561 197635 245004 168752 201480 285070
13933 285070 356453 291614 221851 234269 146071 30845 33104 76483 112913 49944 69085
13922 69085 93763 94097 78746 27997 90573 28298 -81851 -4592 43051 5006 35146 38089
13910 38089 17911 -34737 1431 -18557 6093 -29577 -99690 -78190 11821 106739 66520 140190
13898A40190L9833k7814m5626o3865O5838J8329k1090P0314M4298k3817q2404
13887A14186j7833l7485m9522j36134R509L5653P3181J02591L4310m6240p2181
13876A0035L6382L0898o566m8662L16J39217O776k5679P3216J9865j19161r3797
13864B2840n2186q603J06884N6046j20358q8477J9545K4559L0746J7954P2254
13853H1204n9764j15998J09540J16354L8020j497p2685K8092Q9909p2923r259
13842A30993n9660k3882l3193J0726P1740M7940m0932m0638K8275q2579j26259
13831a17469O2542J1671m1835L6411J6801o3501n0799Q7533P6601k7794j2118
13820b1957M4873m0542j8920N1060J08613K0763l2590m5690n0778o9745O0521
$$ plain form
13898 140190 180023 152209 106583 42718 108556 126885 105795 176109 220407 196590 114186
13887 114186 96353 58868 9346 -126788 -117279 -81626 -8445 94146 128456 82216 10035
13876 10035 46417 77315 70749 22087 22403 161620 168396 142717 215933 235798 116637 22840
13864 22840 -29346 -37949 68935 124981 4623 -83854 -64309 -39750 -9004 8950 81204
13853 81204 21440 -94558 14982 131336 169356 167859 95174 123266 213175 140252 130993
13842 130993 71333 47451 14258 24984 96724 144664 103732 63094 91369 8790 -117469
13831 -117469 -54927 -43256 -85091 -48680 -31879 -95380 -146179 -58646 17955 -9839 -21957
13820 -21957 22916 -17626 -36546 14514 123127 143890 111300 65610 14832 -54913 5608
13809E608k3470j1346n1087N2536K4629J0145L3481K3373j0073K0778K1111P4177
13797A69862p2149r1016k9531Q3859J25553o8193o8633J6868l633O0256Q5244
13786B08487o5944o385J8856j4927J9688l4396j0159j9796p9626k0311L3660k723
13774B6424K4963J09672n3247r1983n04q490N826K5281M3342J3647N5906l0951
13762A19886o6441J3396J3858R234K6686J569J3775k5770J5620k2701N3271k8879
13750A23504j5049m3552k9831N1208m6789m7929P9942K1233M6940O8885j02976
13739A05586j14303q3313L0364K2550N7935j347L9649K4421P8865r3953n3656
13728A2798Q1597N0057J2503o5466j4680o3204K7037p9573p237k9646k716K3139
$$ plain form
13809 5608 -17862 -29208 -80295 -27759 -3130 7015 40496 63869 53796 74574 95685 169862
13797 169862 97713 6697 -22834 61025 186578 118385 49752 66620 62987 123243 208487
13786 208487 142543 136158 155014 140087 159775 125379 115220 95424 15798 -4513 29147 26424
13774 26424 51387 161059 107812 15829 15325 6835 12661 37942 81284 94931 150837 119886
13762 119886 53445 66841 80699 89933 116619 118188 131963 106193 121813 99112 152383 123504
13750 123504 108455 64903 35072 86280 39491 -8438 71504 92737 139677 208562 105586
13739 105586 -8717 -92030 -61666 -39116 18819 17472 57121 81542 160407 66454 12798
13728 12798 94395 144452 156955 91489 76809 13605 40642 -38931 -46168 -75814 -78530 -55391
13716e5391o5340n2982J4004R3589P612J0280K346k5082r437J4023O767N1744
13704g867J3966N8267r2320j00029n2462L6965J00793L7585j9452K9100j7308
13693a2762O4556k9439k5663k9610Q448O7441m0856n6830k0664k6711Q8591J0931
13681b568l1021R1940J0537n5270j9822J20263Q5620k9659o7080k8828n95K2033
13669I5550n1052k9940l161O4822L9558j3204J8878P7450j09046q8548o0634l2594
13657i1921Q2005K2274j2811R079p5927K8800L8140p6j7148M115L7984J09628
13645A34142O6766q6808Q199O709q2221k3241P9809O4324R1923n0313j13420M3741
13633A39610M7360k5544m7008n9172p2725j2218n7890j1685J669L8963q116j12451
$$ plain form
13716 -55391 -120731 -173713 -159709 -66120 -58508 -48228 -45882 -70964 -80401 -66378 -59611 -7867
13704 -7867 6099 64366 -27954 -127983 -180445 -143480 -42687 -5102 -24554 4546 -12762
13693 -12762 51794 22355 -3308 -32918 -24470 42971 2115 -54715 -75379 -102090 -13499 -2568
13681 -2568 -33589 58351 68888 13618 -6204 114059 199679 170020 102940 74112 73517 95550
13669 95550 44498 14558 11397 76219 115777 102573 121451 198901 89855 1307 -59327 -91921
13657 -91921 -9916 12358 -453 8626 -67301 -38501 -361 -437 -17585 -13470 24514 134142
13645 134142 200908 114100 122299 129008 46787 23546 103355 167679 259602 209289 95869 139610
13633 139610 186970 161426 114418 55246 -17479 -29697 -87587 -99272 -97603 -58640 -66756 -179207
13621a79207L1115R9561P3462J6321k8844j10940j0659K5625L7552J32643L067
13610H9696l7994J9963K8637M8852M9480m1475o721P272j8393O5147m9784k2267
13598A32413j1831l4935N9784J04161O33l0674l2828m4740j39115n3188M1398
13587h922m7817k4232j4155j3073j1664m895M9244P0006O0029N6567J26470k421
13575B35137n0289j897q5199l8073K2153m5185k0577k89L7784J1574L7352K7239
13563A29730m7390r8450L8956m0682k8244j7448l4054R0258J45913M5764o2960
13552A21393j44012p5732j7175L3037p1721n8585L7984O7948M1155N2859K9202
13541A6353j7439n0729K8997m4024M2631J6354P2453L7932N7062r5219r3853M3152
$$ plain form
13621 -179207 -148092 -48531 24931 41252 12408 -98532 -109191 -83566 -46014 86629 89696
13610 89696 51702 71665 100302 149154 198634 157159 150438 157710 139317 204464 154680 132413
13598 132413 120582 85647 145431 249592 250225 219551 186723 141983 2868 -50320 -8922
13587 -8922 -56739 -80971 -95126 -108199 -119863 -124758 -75514 -5508 54521 111088 237558 235137
13575 235137 184848 182951 97752 59679 81832 36647 16070 15781 53565 65139 102491 129730
13563 129730 82340 -16110 22846 -17836 -46080 -63528 -97582 -7324 138589 184353 121393
13552 121393 -22619 -98351 -115526 -82489 -154210 -212795 -174811 -106863 -65708 -12849 16353
13541 16353 -1086 -51815 -22818 -66842 -24211 -7857 64596 102528 159590 64371 -29482 13670
13529A3670k689J5719k9925K7304l7430r2667L3636K2547l182L5884J28221O8176
13517A79264j4190j22253k9732O2396N8563O1597r6362j57132m5099R8513R1461
13506H7026n1672l7811J09034N3234k941n531M6227M0820o2044r8886k9827J28848
13494A76477p0290j4039P376K2220J8590P5628O3741k9712q0073p1553k7187n4366
13482A6812p9098j5823L2816O3553j0125M5548R9395l5565k8605L2192J5641p4300
13470F2441Q200m3236j51909J599M5543k723n2954P7305J09382K1736n110m0842
13458B9432j9678L3038k613p869O208L2701o714o4568k6814J01362L1989J6127
13446A22601k9223l5304n686j7885N1299N0886L4751L3719o3387q2641J34095
$$ plain form
13529 13670 10981 26700 -3225 24079 -13351 -106018 -72382 -49835 -53017 -17133 111088 179264
13517 179264 165074 42821 13089 75485 134048 195645 99283 -57849 -102948 -4435 87026
13506 87026 35354 -2457 106577 159811 156870 151339 197566 238386 176342 77456 47629 176477
13494 176477 106187 92148 99524 121744 140334 215962 279703 249991 169918 98365 71178 16812
13482 16812 -62286 -78109 -45293 18260 8135 53683 153078 117513 88908 121100 136741 62441
13470 62441 70641 27405 -124504 -122905 -77362 -80085 -133039 -55734 53648 75384 70274 29432
13458 29432 9754 42792 40179 32310 38518 71219 64505 -63 -26877 74485 106474 122601
13446 122601 93378 58074 52388 34503 85802 136688 171439 205158 141771 59130 193225
13435A93225O7585J4520K1050K0651j17073n3506r5269p5187L285M7907N9824
13424H7012Q2044Q649m6627l5488L1268k736P760l7233p50L9195p2950n2487R1548
13411I9205J05512O8231j36310j07918N0373J3620J20392n8441j15272l0941K2473
13400C0924K8447K2923m7157J9938J7104j20339n0334J45726M2852K3454j15404
13389a866r3591P8677M5837J8010K6700k0823J798j3746p3451J2160N4278L6599
13377G0582L7662J0881k4691O3961p8859K9042P2350j4274j5224k9876K5598m205
13365A42947k4005M9693N2n6828J01298j2582O3267K6398n1106j6144o7000o4039
13353I1951M6922J7854j5987r0801O008N1317l7168p9161l4394O7523o385L458
$$ plain form
13435 193225 260810 275330 296380 317031 199958 146452 51183 -24004 -20719 27188 87012
13424 87012 169056 177705 131078 95590 126858 124122 131882 94649 93899 133094 60144 7657 99205
13411 99205 204717 272948 136638 28720 79093 92713 213105 154664 39392 8451 30924
13400 30924 59371 82294 35137 55075 72179 -48160 -98494 47232 90084 113538 -1866
13389 -1866 -95457 -16780 29057 47067 73767 52944 54742 40996 -32455 -20295 33983 70582
13377 70582 108244 119125 94434 158395 79536 108578 180928 166654 151430 121554 147152 142947
13365 142947 118942 168635 168687 111859 213157 200575 263842 290240 239134 222990 155990 91951
13353 91951 138873 156727 140740 49939 55947 107264 70096 -9065 -43459 24064 17679 21137
13341B1137k3460Q5978P071J07649L2991j0483o3566P883k2152j8355r3549l9975
13329h831L5077n9582n2491M7014M0718J2075j27314l0820P4595O0107R5129n2798
13317C2879p2327Q9349O5189Q782j8130l60P747J45978J01900j39906j63778q4234
13305b6911J8254J768L4829O7680N2545k7986k6855Q6608J07n2820r665n9068
13293E8486L3941k6354j0620J1215J5132O9561k5817L0036M2227o0496r4933O4550
13281A06928J4513J0059r9564M327Q3104l208M4721Q3851N8761P522n5433k9434
13269B26147N5115j7603O0164K7942j48270j0892M1353O5361k841k0149n9284
13258B17043l1444n6037K8372q8824k2660R2107Q5113k3707r027M0794m697r8088
$$ plain form
13341 21137 -2323 83655 90726 198375 231366 220883 157317 165200 143048 124693 31144 -8831
13329 -8831 26246 -33336 -85827 -38813 1905 13980 -113334 -144154 -69559 -9452 85677 32879
13317 32879 -39448 49901 115090 123872 105742 105382 113129 259107 361007 221101 57323 -26911
13305 -26911 -8657 -6889 27940 95620 148165 120179 93324 179932 180039 127219 117554 58486
13293 58486 92427 66073 55453 66668 81800 151361 125544 155580 197807 137311 42378 106928
13281 106928 121441 131500 31936 36263 119367 116159 160880 244731 303492 311014 255581 226147
13269 226147 281262 263659 323823 351765 203495 192603 233956 299317 296476 276327 217043
13258 217043 185599 129562 157934 69110 46450 138557 223670 199963 190936 231730 227033 128945
13246A28945p1327O5965j0112n5903K4307O2092l2100n998L6918Q5752J385j6738
13234B13186k0476o2988J0316M2940K991n452p9124l215l3270J1438M1157J8358
13222A35861p3599p0734n753J1006J07948K5333l2402M787O4969R8390j4541j04906
13210A46359P685m0336j8520J7128N922J0583K75K7141K273k9512j2204Q531K136
13197A27461K2046N850q0044o3365L0411N1446K3327l3811o2995k1587L8770J7799
13185E5308O6290M2340o3861R910O0001l3625j07831J2293J48258R512j3668M1271
13173B26198k9806o0914J0136K676k672l750j25789k580M0966P1656l0869k3125
13161G2127o63M1852j637O8763j10110o773r846n9241k4766J1936J2182L1138
$$ plain form
13246 128945 57618 123583 113471 57568 81875 143967 111867 105869 142787 228539 229924 213186
13234 213186 192710 129722 140038 182978 185969 180517 101393 98178 64908 76346 117503 135861
13222 135861 62262 -8472 -14225 -3219 104729 130062 97660 102447 167416 265806 251265 146359
13210 146359 154044 113708 95188 112316 118238 128821 129096 156237 158510 128998 116794 125325 127461
13197 127461 149507 155357 75313 11948 42359 93805 117132 83321 20326 -1261 37509 55308
13185 55308 121598 163938 100077 109987 169988 136363 28532 40825 189083 198595 184927 226198
13173 226198 196392 135478 145614 148290 145618 141868 16079 13499 54465 126121 95252 72127
13161 72127 71464 113316 111679 180442 70332 63559 53713 -5528 -30294 -18358 -6176 24962
13149B4962O9587J2510K6686M7287M0718K2978o5965m9997L176K5793M3637j0372
13137A91000L9391n1693j30860o2122M1482O1026O7584M7538q031O1014K4411
13126B80740m6506o0142q6539p5789m3071k1578O1481L8071L4595O2476k6421
13115A17317L2057k2832M633R0487J7727L0833m2084q3010L0573N7402p5952o5364
13103I1787l2263P7936L1260o806P91L1291P2636P4439j0500p8507Q459j5986
13091B44537k5548o9483J4099L1399m1946Q343J6001m3740J4940J03460l4919
13080B17143o7641M1366l8766L1433K1295k0861K571o6103n0033Q6150K5369j9649
13068A62274j436n7048n4404K3397O9084K0163k6988q794M8916K1290k1714o5053
$$ plain form
13149 24962 94549 107059 133745 181032 221750 244728 178763 128766 131942 157735 201372 191000
13137 191000 230391 178698 47838 -14284 27198 88224 155808 203346 195315 256329 280740
13126 280740 234234 174092 87553 11764 -31307 -52885 8596 46667 81262 143738 117317
13115 117317 149374 126542 131175 221662 239389 270222 228138 145128 175701 233103 157151 91787
13103 91787 59524 137460 168720 161914 162705 193996 266632 341071 330571 252064 260523 244537
13091 244537 218989 149506 163605 195004 153058 161401 177402 133662 148602 252062 217143
13080 217143 149502 190868 152102 183535 204830 183969 186540 120437 70404 156554 181923 162274
13068 162274 160838 103790 49386 72783 141867 162030 135042 126248 175164 196454 174740 109687
13056A09687o4944j2650K4774J60662J76379l1638j00997q7098j08205p3792m1141
13045d8963J6808L4750J09373M4604j6036r7822M4237Q1998K1194k7854q0848
13034H1441J5666j29435k4996Q0809Q0531N4862o9846L8789K8968N3983n5721
13023A55051j04625k9910K9031M056R3084P8921L165p7503n8476k0559q3335j6550
13011b7650Q729J38482J17462l1356l7061j06875N6632Q3700Q136N0898l5394
13000B25703j101l249L7965P2322r149k6316r1835q2245K0837K0387n3181K1162
12988A31300L3376l8574K0805N4581R6168j0320j27724p0775j3756N0598O3307
12977A88986N849N0005P829n2089o1569l3707o3912o4284l5976M8666P6782L7865
$$ plain form
13056 109687 44743 32093 56867 217529 393908 362270 261273 174175 65970 -7822 -48963
13045 -48963 -32155 2595 111968 156572 140536 42714 86951 168949 190143 162289 81441
13034 81441 97107 -32328 -57324 23485 104016 158878 89032 127821 156789 210772 155051
13023 155051 50426 20516 49547 53603 146687 225608 228773 151270 92794 72235 -11100 -27650
13011 -27650 -18921 119561 237023 205667 168606 61731 118363 202063 210199 261097 225703
13000 225703 224602 221353 259318 331640 322491 296175 204340 122095 142932 163319 110138 131300
12988 131300 164676 126102 146907 201488 297656 287336 159612 88837 75081 125679 188986
12977 188986 194835 244840 252669 200580 139011 105304 41392 -22892 -58868 -10202 66580 104445
12965A04445r5320j3361J19303o383j09033K7657k3772l7981Q0814J21755K1284
12954A89408J7267R1329o8950n0063L2666K9577M0906l5962o6074J0053l1286
12943A58871q866o6277p027K0461q35N7278j0468l0235k2531J04033j7254o3901
12931A13249l2999N2580Q3593j6339k2359l0574P005Q5964J1387M7313j7446p8170
12919B03204Q16L0809k6121j12611m9024L0111O2881J8193l4922o5658p2042j1245
12907b5609R1945J29152J8791J3731L5009p142j07399j19385k1771O5297P9049
12896A51668r1107k1893j09309J5512P9952N0318R2539L6603R6111j9012n2556
12885B28826L7497j6690k6956n7998J5046M7327L82L798n6121r2410r123p1803
$$ plain form
12965 104445 9125 -4236 115067 108684 -349 27308 3536 -34445 46369 168124 189408
12954 189408 206675 298004 229054 178991 211657 241234 282140 246178 180104 190157 158871
12943 158871 150005 83728 76701 97162 96327 153605 143137 112902 90371 194404 177150 113249
12931 113249 80250 132830 216423 200084 177725 147151 154156 240120 251507 298820 281374 203204
12919 203204 204020 234829 208708 96097 47073 77184 140065 158258 123336 57678 -14364 -25609
12907 -25609 66336 195488 214279 228010 263019 255877 148478 29093 7322 72619 151668
12896 151668 60561 38668 -70641 -55129 24823 75141 167680 204283 300394 281382 228826
12885 228826 266323 249633 222677 164679 179725 227052 227434 231232 175111 82701 73578 1775
12873A775m1175J2195M2293K8023M4740M9075N1210M1248j4980j1207P448m0921
12861A69724q097l2692m5041l1476L0103p3287j43822J4455J50411R4125N0954
12850A75357L0316N2444j9849j19136J433M0711O3231N1617o4111m2799J8222
12839A87436N962m748k2052o7949o145q078L7548l8168l8793R9276N7772J6421
12827B18482Q0700L3085k1888n77l0479m5526o7986k8985m2118K4564j3416o5669
12815D0187p454L0658J21279M8932o1834o7946L8591J5214j8602j0642J8139j2297
12803A34225k978k3814N8750m766k7523J3233M5646R3511K7717L084N0777K415
12791C70277q2258j0652l2619L4267J3855k7729k802Q8518O8052n5374R918K0115
$$ plain form
12873 1775 -39400 -27205 15088 43111 87851 136926 188136 229384 214404 203197 210645 169724
12861 169724 161627 128935 83894 52418 82521 9234 -134588 -120133 30278 124403 175357
12850 175357 205673 258117 238268 119132 120565 161276 224507 276124 212013 169214 187436
12839 187436 193398 188650 166598 98649 92504 84426 121974 83806 45013 144289 202061 218482
12827 218482 299182 332267 310379 309802 279323 233797 165811 136826 94708 119272 105856 40187
12815 40187 32733 63391 184670 233602 171768 103822 142413 157627 139025 128383 146522 134225
12803 134225 131247 107433 166183 161417 133894 147127 192773 286284 314001 317085 367862 370277
12791 370277 288019 277367 244748 279015 292870 265141 262339 350857 418909 363535 373453 393568
12779C93568r2618l5636k2231J1442M632p5913j03864l0079Q8728P9483N4000
12768B71512k2067p4623N6637J8832j2224j9516j9520j5344J588m652q0933p5061
12756B4629m1487K1098P7840J18357O590l18l7797k4149r770l5882P4903M2670
12744B16684q986O8334L7970k8996o8798j2893n2300J2686J0l6935l4021m0760
12732E1995P948R9043J6425k3769o9677k4103K0521R6537k0261o8595N9648M2356
12720A88068L3979j9198p5628R6943o056j50496o055O2237P2868J3368n2815K5854
12708A83069j4920N5475p2231j53251J13168N7947P3657J738m9160l59J6880K4932
12696B36945Q5319L2383q503k8910j32606j803L6585Q1262o9380j3140J2043L8217
$$ plain form
12779 393568 300950 265314 243083 254525 259157 183244 79380 49301 138029 217512 271512
12768 271512 249445 174822 231459 250291 238067 218551 199031 183687 185275 180623 99690 24629
12756 24629 -16858 4240 82080 200437 207027 206709 168912 144763 134993 99111 174014 216684
12744 216684 207698 276032 314002 285006 216208 203315 151015 163701 163711 126776 92755 51995
12732 51995 59943 158986 175411 151642 81965 57862 78383 174920 154659 86064 145712 188068
12720 188068 222047 202849 127221 224164 218108 67612 61557 123794 196662 210030 157215 183069
12708 183069 168149 223624 151393 -1858 111310 169257 242914 244652 195492 195133 212013 236945
12696 236945 322264 354647 346144 317234 184628 182825 219410 300672 231292 218152 230195 268412
12684B68412j1420o172j01990N4542M5196L3174j0220J3949j949m1847k3015o2401
12672A56259j08929n0294J57140N9053o7465O3737N0209M0278L2436j07515r403
12661B15506N5927M8880O2094o4248k3834K9953K074K0445m13n5781J4986J9623
12649C25212J895q9894K128N0228J7955L7256j7504p9692o9679j3424K2821J26989
12637C14291N8671L3484n0677J0624m6451q5705N1934K8531q0892p776L198j7553
12625B11679j59925q0963j1663J26358k1418M849M2535M7945Q4323K6166O1506
12614C31392R1359K2395q7661j39137j9359N7100P2073K4786l2823P450K0479
12603C48054n3288M1923M6129M389j5064m8108n9005R182N0672m0885r2212Q0214
$$ plain form
12684 268412 256992 250820 148830 203372 248568 281742 271522 285471 283522 241675 218660 156259
12672 156259 47330 -2964 154176 213229 145764 209501 259710 299988 332424 224909 215506
12661 215506 271433 320313 382407 318159 294325 324278 326352 346797 346384 290603 305589 325212
12649 325212 327107 237213 239341 289569 307524 344780 327276 247584 177905 164481 187302 314291
12637 314291 372962 406446 355769 366393 319942 234237 286171 314702 233810 226034 229232 211679
12625 211679 51754 -29209 -40872 85486 64068 68917 111452 159397 243720 269886 331392
12614 331392 422751 445146 357485 218348 198989 256089 328162 352948 320125 327575 348054
12603 348054 294766 336689 382818 387207 372143 324035 265030 274212 324884 283999 191787 272001
12591B72001P0658K5645n4706K2057O2528j0761k3640j23782n9490M3621j2626
12580B11505l6386n5446k1655M0987N7474L4290N8509Q649j3040N8710O9064K2340
12568D35001l5832m5744O376P402j22074r5350m5078M4331M4896J034m395o7575
12556A22992J5867J10682J02122L5660L576m3723j20049L1848J9154k6495O5503
12545C17137O9798L1275J9377j3772p9346m5159m8700N6969N9341L9777o4310
12534C42387p0767j9869O0370R3184J8556m4717o9283l7890q1809K8279J50098
12523C68539Q9149J6902q8455k4306L1341j10655j04682J8239m021K5131P6989
12512B94171Q6048j6771r4028P6723L3113N1817L0932j4337J2378O9501r7271
$$ plain form
12591 272001 342659 368304 313598 335655 398183 387422 363782 240000 180510 224131 211505
12580 211505 175119 119673 98018 139005 196479 230769 289278 297927 284887 343597 412661 435001
12568 435001 399169 353425 359801 367203 245129 149779 104701 149032 193928 194962 190567 122992
12556 122992 138859 249541 351663 387323 390899 347176 227127 258975 278129 251634 317137
12545 317137 386935 418210 437587 423815 344469 299310 250610 307579 366920 406697 342387
12534 342387 271620 251751 312121 405305 423861 379144 309861 271971 190162 218441 368539
12523 368539 457688 474590 386135 361829 393170 282515 177833 196072 192051 217182 294171
12512 294171 380219 363448 269420 346143 379256 431073 462005 447668 460046 529547 432276
12501D32276p7445r9943j7414q6002J0351L4596J199N8239J33591N9040j7508
12490D30980j32459K330L5835n9323l0003J5117J7099q301l3196p8481n0630R5267
12478B04235R2207l6259r8135k3959O9723N1783L8737L4287r797K1718Q2555O2471
12466D89566n8850o6737j0921L4837k5143l1061l9865O775Q3067n887r259n3346
12454C13176k0298j50881o8920R1200R5331J58397k0971l6000o7649n3121P2376
12443C12640P8417J5832J4335K0595N1923J1135r8405p2560j8998j530j8848Q8660
12431C83196M9317j153N4068m1579k5965p6043l3487K051K5657R9004k3330l5982
12419C75754j6144n33L9749R0262l1277j5302j5065j00268q401K0601R7309M038
$$ plain form
12501 432276 354831 254888 237474 151472 161823 196419 197618 255857 389448 448488 430980
12490 430980 298521 300851 336686 277363 247360 262477 279576 271275 238079 159598 108968 204235
12478 204235 296442 260183 162048 138089 207812 259595 298332 332619 322822 344540 427095 489566
12466 489566 430716 363979 353058 387895 362752 331691 291826 298601 381668 375781 366522 313176
12454 313176 292878 141997 73077 164277 259608 418005 397034 361034 293385 240264 312640
12443 312640 391057 406889 421224 441819 493742 504877 406472 333912 314914 313384 294536 383196
12431 383196 432513 431360 485428 443849 417884 341841 308354 310405 336062 435066 411736 375754
12419 375754 359610 359077 398826 489088 457811 442509 427444 327176 318775 339376 436685 440723
12407D40723k4805L7158L6022k6605K2146l480R1490M7196j02613N7423N6583
12396F31238l8857o2124K1165n1322n3554P6878M6405K5630k3475j8981m6723
12385E06280p2742q7635K5341R4172O593O8556k3494q0280M1060l1066m1834M0046
12373D44997n6777q6855K715J93129J02976j61702n1707O1727J20620o320K3039
12362E85842j520K9784j09341n0445P880m5963P9335N9987q1588j4584J12557
12351E71944M6661j22708q3193l28M0377o318m3582M0266k6610o7079j6641L7215
12339C70004l7615j3729M9857P3375M4337L8169j8168p8180Q2032p3169j7264
12328D19649L5911k6631J5625J1161k0812J5658k4874r674j7070n3845L2019L1459
$$ plain form
12407 440723 415918 453076 489098 462493 484639 481159 572649 619845 517232 574655 631238
12396 631238 592381 530257 551422 500100 446546 523424 569829 595459 571984 553003 506280
12385 506280 433538 345903 371244 465416 472009 540565 517071 436791 477851 446785 404951 444997
12373 444997 388220 301365 304080 497209 600185 438483 386776 448503 569123 562803 585842
12362 585842 584322 614106 504765 454320 462200 416237 495572 555559 473971 459387 571944
12351 571944 618605 495897 412704 412376 452753 446435 402853 443119 416509 349430 332789 370004
12339 370004 332389 318660 368517 441892 486229 524398 506230 428050 510082 436913 419649
12328 419649 455560 428929 444554 455715 434903 450561 425687 416013 398943 345098 377117 408576
12316D08576O8024R4890L3026o0775l9034k2398J1335L0975L1061K2395r232j1253
12304E57590L2633k4154m0560r293Q5116J503o5091N5364J74j39346P9729N1476
12292E85141N2493p6166o4304k218n1185Q0031J8753J4595l0839j01671K9624
12281D54254J70737J19665K4035n2276j06000p5072M2030Q6382J13403o0060k7248
12270F89850M9502J7346N2132J0869l627n9315o2983K8651r2710K1045J25771
12259G76531p6586p9173j22008L9796N1023O0343k9521m3481K7387R633J8472
12248F32416P4675K7199k5923L215R2733m5691o8300p9822L7069n334K3181J03026
12236G68444P5379p2475m8091o2356o272N6833J4097K691R6760J18955O1232j26063
$$ plain form
12316 408576 476600 571490 604516 543741 504707 482309 493644 524619 555680 578075 568843 557590
12304 557590 590223 566069 525509 516216 601332 602835 537744 593108 593282 453936 533665 585141
12292 585141 637634 561468 497164 494946 443761 523792 542545 557140 526301 424630 454254
12281 454254 624991 744656 768691 716415 610415 535343 577373 663755 777158 717098 689850
12270 689850 739352 756698 808830 819699 816072 756757 693774 722425 629715 650760 776531
12259 776531 699945 620772 498764 538560 589583 649926 620405 576924 604311 613944 632416
12248 632416 707091 734290 708367 711582 804315 758624 690324 610502 647571 642237 665418 768444
12236 768444 843823 771348 723257 660901 654629 711462 725559 728250 825010 943965 1005197 879134
12224H79134p3074K2850k3260O244P2142P4459m0892j8976k2054J7136J3979k6837
12212H80851k1939l564O1904j706L5807L2431k1789P3108M5419n6535o9441m3463
12200I11083j05847K9632Q4322l8965j9113L7245r878o5053N7620J03468l654
12189I80860k4624r1198K0320M7871k8304R3408o4181M4277M5568j5100j1469
12178I97428j746O2066N746k2241J462M85R651m0107l9532R78j19814L2077L5073
12165I21526L387L237R4771O5679k7377o1731m4646O2307J31650K9477m6136j1029
12153A121115K8521k4506J16277L5695m403o9786p4842M3466J38478O0400n9912
12142A310503n7036J6828J2704P0816m6589R903J27218K8691j27098l3441O278
$$ plain form
12224 879134 806060 828910 805650 811894 884036 958495 917603 898627 876573 893709 907688 880851
12212 880851 858912 855348 917252 915546 951353 983784 961995 1035103 1080522 1023987 954546 911083
12200 911083 805236 834868 919190 880225 861112 898357 888479 823426 881046 984514 980860
12189 980860 956236 865038 885358 933229 904925 998333 934152 978429 1023997 1008897 997428
12178 997428 995682 1057748 1063494 1041253 1042715 1043200 1052851 1012744 973212 974190 854376 886453 921526
12165 921526 924913 928150 1022921 1088600 1061223 999492 954846 1017153 1148803 1178280 1132144 1121115
12153 1121115 1149636 1125130 1241407 1277102 1272699 1202913 1128071 1171537 1310015 1370415 1310503
12142 1310503 1253467 1270295 1282999 1353815 1307226 1317129 1444347 1473038 1345940 1312499 1318777
12131A318777J2149R2021R255k7017L7925Q8557P5876J15990Q5376j7707L3551
12120A824753k7767q7904P6318K2219m5877l3787J39536J6090l0625n2857P4199
12109A874298J26727J23846K006L5505J448J8702M7892O5348M4931L2065J1203
12098B383971k0756l7247K2893O6423J22348O6166m1024K3146k3899j3913m953
12087B543155J3487J6190k7354k0505o5269l6502l4884J20506O6672J03165o925
12076B671736j0445l4627P7237O2962J2932J05369M6335p2707M314J48679L3136
12065C044921J28625Q1113L8777j09708r7545J48539M8409N8202M3736N5514J84684
12054C625267J14173j7705J7694J43962O0582J83586J10719M7443J2241M9598
$$ plain form
12131 1318777 1330926 1422947 1432202 1405185 1443110 1531667 1607543 1723533 1808909 1791202 1824753
12120 1824753 1796986 1709082 1785400 1807619 1761742 1727955 1867491 1883581 1852956 1800099 1874298
12109 1874298 2001025 2124871 2126877 2162382 2163830 2182532 2230424 2295772 2340703 2372768 2383971
12098 2383971 2363215 2325968 2348861 2415284 2537632 2603798 2562774 2585920 2562021 2548108 2543155
12087 2543155 2556642 2572832 2545478 2524973 2459704 2423202 2388318 2508824 2575496 2678661 2671736
12076 2671736 2661291 2626664 2703901 2766863 2779795 2885164 2931499 2858792 2863106 3011785 3044921
12065 3044921 3173546 3254659 3293436 3183728 3086183 3234722 3283131 3341333 3385069 3440583 3625267
12054 3625267 3739440 3721735 3739429 3883391 3943973 4127559 4238278 4285721 4297962 4347560
12044D347560O7205J13715P6767J22997Q4171J25667N5100K08757J94267R2935
12034E489141J96899J92182J35452J03930J07475J55165J39247K17602J23239
12025F860332J84538K08373J51725J46842K98618L18086K83140K80140L55955
12016I087749L41739L37077K82844L20951L76605L79613M23101L97446M29171
12007A2376296N02320M65332M58732N86231P29779O79594O74892P39050Q64485
11998A8076711Q83316R07539R71090J018250J215119J312693J321272J469829
11990B7175819J533314J763589K022078K148884K277961K555574K770343K912533
11982D5160095L063365L536707L923921M365022M682370M983922N427816N997347
$$ plain form
12044 4347560 4414765 4528480 4605247 4728244 4812415 4938082 4993182 5201939 5396206 5489141
12034 5489141 5686040 5878222 6013674 6117604 6225079 6380244 6519491 6737093 6860332
12025 6860332 7044870 7253243 7404968 7551810 7850428 8168514 8451654 8731794 9087749
12016 9087749 9429488 9766565 10049409 10370360 10746965 11126578 11549679 11947125 12376296
12007 12376296 12878616 13343948 13802680 14388911 15118690 15798284 16473176 17212226 18076711
11998 18076711 18960027 19867566 20838656 21856906 23072025 24384718 25705990 27175819
11990 27175819 28709133 30472722 32494800 34643684 36921645 39477219 42247562 45160095
11982 45160095 48223460 51760167 55684088 60049110 64731480 69715402 75143218 81140565
11974H1140565O382458O722200P005229P181231P348292P239226O792594O200934
11966A36012729N209304L950522K382807O85369r57326k733985m393593n660839
11958A34494988o599197p266939p731841p809333p762272p541253p109874o585848
11950G6088431o061538n614192n201869m691497m186926l821906l476302l132655
11942C9901546k897746k705865k329241k224236j966307j685831j719032j527474
11934B2845814j298978j240835j086377j050000j042209j028448q35139o97109
11926A4566719o59093o87574o63185o01638m74749m89630m90989m20922l84155
11917I694784m30513m66486m55781m02701k54156k17347l57288l39324k45429
$$ plain form
11974 81140565 87523023 94245223 101250452 108431683 115779975 123019201 129811795 136012729
11966 136012729 141222033 145172555 147555362 148240731 147283405 144549420 140155827 134494988
11958 134494988 127895791 120628852 112897011 105087678 97325406 89784153 82674279 76088431
11950 76088431 70026893 64412701 59210832 54519335 50332409 46510503 43034201 39901546
11942 39901546 37003800 34297935 31968694 29744458 27778151 26092320 24373288 22845814
11934 22845814 21546836 20306001 19219624 18169624 17127415 16098967 15263828 14566719
11926 14566719 13907626 13220052 12556867 11955229 11480480 10990850 10499861 10078939 9694784
11917 9694784 9264271 8797785 8342004 7939303 7685147 7467800 7110512 6771188 6525759
11908F525759k19286k04979j48473j95286k22931k71417j71930j66274j33059
11899D792124j50255j59779j49575j01881p3940j01582j24842r7815q0310o9972
11889C682173r0557j06025j88970j38499r6976j50529j24104o5514l5775j07558
11879B577666q4026j2836m375j04704j9253n4763n111o2404l2154L9428m5601
11868B191867o7870n1879l8883j9273j06644m0087Q884J7890o9584O790L1823
11857A863034O85m8205j14070p2759J2291k5284K7169p7375M1154Q4564K9093
11846A720297j3142j19781j35401k0381P006J0784J8676k794j27535r1632n7468
11835A188629L794j7548r1197q2916O0217j9539m4625j9150l1456p9976o3286
$$ plain form
11908 6525759 6306473 6101494 5953021 5757735 5534804 5263387 5091457 4925183 4792124
11899 4792124 4641869 4482090 4332515 4230634 4156694 4055112 3930270 3832455 3752145 3682173
11889 3682173 3591616 3485591 3296621 3158122 3061146 2910617 2786513 2720999 2685224 2577666
11879 2577666 2493640 2480804 2476429 2371725 2352472 2297709 2292598 2230194 2198040 2237468 2191867
11868 2191867 2123997 2072118 2033235 2013962 1907318 1867231 1876115 1894005 1824421 1831211 1863034
11857 1863034 1863719 1815514 1701444 1628685 1640976 1615692 1642861 1565486 1606640 1691204 1720297
11846 1720297 1707155 1587374 1451973 1431592 1438598 1449382 1468058 1465264 1337729 1246097 1188629
11835 1188629 1192423 1174875 1083678 1000762 1060979 1041440 996815 977665 946209 866233 802947
11824H02947K0031M6262P7646l4096q9990k2889p4469p397M1795P9850l2293k2179
11812G85218R268L9528k2167q1952n9422Q3507R1827j0863m2669L3575k0754l497
11800H01599p1304j18562j6984R2302J1551l2977j2761Q3421J9645Q4249J27170
11789I67349J30316J19614J17780J84552K11622J64314R4018o9192j23653j33779
11779A662941j80921j58768j14143j31341r3146j05963N271L2969j1326K0283
11769I25856q1700j5571j7463N65N2841O0361M4143o8295l2360m8417l4598N510
11757G90872k8454k8112m9805R5824Q9985Q7256m2940Q1883Q2977J573J11009
11746A192068M6472J41117K33600K32803L68791K63265J83789J53385r9918j37360
$$ plain form
11824 802947 822978 869240 946886 912790 822800 799911 725442 718045 759840 839690 807397 785218
11812 785218 794486 834014 811847 729895 670473 753980 845807 834944 792275 825850 805096 801599
11800 801599 730295 611733 594749 687051 698602 665625 652864 736285 755930 840179 967349
11789 967349 1097665 1217279 1335059 1519611 1731233 1895547 1989565 1920373 1796720 1662941
11779 1662941 1482020 1323252 1209109 1077768 984622 878659 883930 916899 905573 925856
11769 925856 844156 828585 811122 811687 864528 924889 969032 900737 868377 819960 785362 790872
11757 790872 762418 734306 684501 780325 870310 957566 914626 996509 1079486 1081059 1192068
11746 1192068 1238540 1379657 1613257 1846060 2214851 2478116 2661905 2815290 2715372 2578012
11736B578012k08533j55683n8620l9957j26464j00155j14303j36070j27777k08079
11726A302371j35140k9683o4578j31123j60162R918O0259j29047j02824O4092
11716F84083n9560n1916R2796M4505j21070j8920O5841K1387j2317k7518K2836
11705F40147P5638J02154K4012K3227K0452L346J58724J69920J43739K20993K83979
11694A866331J85848L8272k6754j07869k06797k00902k53546j63525j28703k44088
11684G58267j40859O522l1309q5933q7479J5192K2430M6467k8678K2414m841l1229
11672D60964p2787l4166R9535L8655M4340M3898o5171j08527K404N2678P1234
11661E33057J34385N5067j2419r4190p2496O8118P3336L6480m1860r8884n1721
$$ plain form
11736 2578012 2369479 2213796 2155176 2115219 1988755 1888600 1774297 1638227 1510450 1302371
11726 1302371 1167231 1137548 1072970 941847 781685 791603 851862 722815 619991 684083
11716 684083 624523 572607 665403 709908 588838 569918 635759 657146 644829 617311 640147
11705 640147 715785 817939 841951 865178 885630 888976 1047700 1217620 1361359 1582352 1866331
11694 1866331 2052179 2090451 2063697 1955828 1749031 1548129 1294583 1131058 1002355 758267
11684 758267 617408 623930 592621 506688 419209 434401 456831 503298 474620 497034 492193 460964
11672 460964 388177 354011 453546 492201 536541 580439 515268 406741 409145 461823 533057
11661 533057 667442 722509 710090 615900 543404 611522 684858 721338 679478 580594 528873
11650E28873K3250M2706L2411K9192N1546j9412n8013o3635j30176r8091J05414
11639D44065O4877P4146J1105l3220l6053M8365n2573L8587M4212J12941R1401
11628H07853m2656j05563q7775M7852k0689O128N2924P2226j6704L2815M7315
11617G93726K8954K3033J314k8433m4101K3386m2443L8157k2150j09318n0724
11606F11401M200J707k613j2614Q083J4607l640k4587r3702n8270m3509Q2137
11594D83200J56734O9258J28713J13174K3458M7203P8096M3580r261J44429J17189
11583A395773J14348K4572l7853J57702R9449P4002J4799j8510J6042j19028j26410
11572A594886j05675o855J7040l0483R5161K3132L8350O2545Q1476J110M9623
$$ plain form
11650 528873 552123 594829 627240 656432 707978 688566 630553 566918 436742 338651 444065
11639 444065 508942 583088 594193 560973 524920 573285 520712 559299 603511 716452 807853
11628 807853 765197 659634 571859 619711 599022 605150 658074 730300 713596 746411 793726
11617 793726 822680 845713 847027 818594 774493 797879 755436 793593 771443 662125 611401
11606 611401 615601 617308 614695 602081 610164 624771 621131 596544 502842 444572 401063 483200
11594 483200 639934 709192 837905 951079 974537 1021740 1099836 1143416 1134155 1278584 1395773
11583 1395773 1510121 1534693 1496840 1654542 1753991 1827993 1842792 1824282 1840324 1721296 1594886
11572 1594886 1489211 1482356 1499396 1468913 1564074 1587206 1625556 1688101 1769577 1770687 1820310
11561A820310p685P7905P1218k5589J5602K327Q0422l9311j34912M2800M4641
11550A947728j5835J12534J21613K03567Q9398k5700J16159O4647k5289l0815
11540B558007m2529n6889L346K780J3010P1372n507J47422J94050J17998N6018
11529C059078K16963K07861J68078K11348L47273L81432K53516J68575J77235
11520E191359n5970j40692o9485r146j7127k4405l2809k0653M0018j28786l15069
11509D417235j72914k4292o8588k26876j89688j40762j70543j55694j16855k6815
11499C124208N6251N1588J46079K12222K98755K18213L13944L10108L37170M98037
11489E566575N32616M55974L35898J95889J60669K00456J94956Q1137k7741j91855
$$ plain form
11561 1820310 1812625 1890530 1961748 1936159 1951761 1954088 2034510 1995199 1860287 1903087 1947728
11550 1947728 1931893 2044427 2166040 2369607 2459005 2433305 2549464 2614111 2588822 2558007
11540 2558007 2515478 2458589 2461935 2464715 2477725 2549097 2543590 2691012 2885062 3003060 3059078
11529 3059078 3276041 3483902 3651980 3863328 4210601 4592033 4845549 5014124 5191359
11520 5191359 5135389 4994697 4925212 4916066 4898939 4874534 4841725 4821072 4861090 4732304 4417235
11509 4417235 4244321 4220029 4151441 3924565 3734877 3594115 3423572 3267878 3151023 3124208
11499 3124208 3180459 3232047 3378126 3590348 3889103 4107316 4421260 4731368 5068538 5566575
11489 5566575 6099191 6555165 6891063 7086952 7247621 7448077 7643033 7724170 7696429 7504574
11479G504574j97230l81253m81582n42604n22450n41353m94690l05506j97018
11470C840888k86732k37763j25629q8696j1448j17031r0124R25P6297N7249N341
11459C023277J0320J38081O3256Q1378O0399K9830J14095J54612J13343R9132
11449C887723J72357L00175M33674M85207N40137O01970N68839M92973K54549
11440G737604K74368J77037J8705k3735k9979q7313j68586l36990m79095m32551
11430F649465k97791k71837l43241l11427k50660p6081k11095j31348q048M9757
11420D797694J22745J87014K14958K49672K63485J75430J72643J70327J55614
11411F509582J44261K04954J74631Q1273m2744o90j9719n8099N7706J04289k275
$$ plain form
11479 7504574 7307344 6926091 6444509 5901905 5379455 4838102 4343412 4037906 3840888
11470 3840888 3554156 3316393 3190764 3102068 3090620 2973589 2883465 2884390 2960687 3017936 3023277
11459 3023277 3033597 3171678 3234934 3316312 3376711 3406541 3520636 3675248 3788591 3887723
11449 3887723 4060080 4360255 4793929 5279136 5819273 6421243 6990082 7483055 7737604
11440 7737604 8011972 8189009 8207714 8183979 8154000 8066687 7898101 7561111 7082016 6649465
11430 6649465 6351674 6079837 5736596 5425169 5174509 5098428 4887333 4755985 4747937 4797694
11420 4797694 4920439 5107453 5322411 5572083 5835568 6010998 6183641 6353968 6509582
11411 6509582 6653843 6858797 7033428 7114701 7071957 7071267 7051548 6993449 7051155 7155444 7153169
11400G153169Q1657R933j82842k60902j98659k47431k54579k20892j55579j78137
11390E545738k67402j72429k30567j13178r4012l8911O9148P5693Q9717P1282
11380D935079K65301K25954K10124O2449K39837K74805J80232K29513K21970K05507
11370G050771L02927K53346L40557L46063L38279J35236J34124J72161J29561
11361I203025J70521J55005J40021J50965J80383K03583L14747L96226M49560
11352A1364036N50024N96756P64698J060355J231382J528385J856775K178615
11344B1131026K693473L445731M351667N320739O849839R392274J2919584J7862600
11336H3966933K3728574K7803391K6040384J7058172O684809J535857K313737
$$ plain form
11400 7153169 7234826 7244759 7061917 6801015 6602356 6354925 6100346 5879454 5723875 5545738
11390 5545738 5278336 5105907 4875340 4762162 4668150 4629239 4698387 4774080 4863797 4935079
11380 4935079 5200380 5426334 5636458 5698907 5938744 6213549 6393781 6623294 6845264 7050771
11370 7050771 7353698 7607044 7947601 8293664 8631943 8767179 8901303 9073464 9203025
11361 9203025 9373546 9528551 9668572 9819537 9999920 10203503 10518250 10914476 11364036
11352 11364036 11914060 12510816 13275514 14335869 15567251 17095636 18952411 21131026
11344 21131026 23824499 27270230 31621897 36942636 43792475 53184749 66104333 83966933
11336 83966933 107695507 135498898 161539282 178597454 185282263 186818120 189131857
11329A89131857M721525K020404p357140j8177039k4575287k5105361k1949147
11322I8709812j7793654j3709149j0378792p751604n825951m260226l085545k285033
11314C3619858j627112j160119o89400j91022J56983N25166J077022J469061J953433
11305C5133870K362796K930113L561185M343418N217221O508006Q296975J0655030
11297G9008614J3887018J8752609K5840628L5142958M4587717M9818875M9449988
11290C16488407M6196545M2571457L6320890J7726128j4082460m1653012n1454736
11283C52113219m3838688k6457211p853099L17865q649584k2822229k9072684
11276B13737589k5229600j7985843j5569062j8201193k0566952j9854093j6622807
$$ plain form
11329 189131857 193853382 195873786 188516646 170339607 145764320 120658959 98709812
11322 98709812 80916158 67207009 56828217 49076613 43250662 38990436 35904891 33619858
11314 33619858 31992746 30832627 30143227 29952205 30109188 30634354 31711376 33180437 35133870
11305 35133870 37496666 40426779 43987964 48331382 53548603 60056609 68353584 79008614
11297 79008614 92895632 111648241 137488869 172631827 217219544 267038419 316488407
11290 316488407 362684952 405256409 441577299 459303427 445220967 403567955 352113219
11283 352113219 308274531 281817320 273964221 274282086 265632502 242810273 213737589
11276 213737589 188507989 170522146 154953084 136751891 116184939 96330846 79708039
11269G9708039j2813372r462617o961197n098837l710155k677820j891595j273068
11261C5819378p55360j44517L80540R02645J515969K148539K850234L756249M996850
11252E1470527O359324Q247419J0971902J4798386K0240811K7988808L7714124
11245A77791301M6675239M8495350L9014547K3930907J1872132K903555r476812
11238C41206219k6849487m1709581m7768709m5139623l7982144k9892959k2820896
11231H9042820j7291802j3194710j0058348p870434o282195m958894l942669l195455
11223B2248313k623489k127118j750628j481136j288963j111376r68378p00360
11215A0196865o08096n64531n70483n21716n02738m26937l82320l32874j87315
$$ plain form
11269 79708039 66894667 57432050 50470853 45372016 41661861 38984041 37092446 35819378
11261 35819378 35064018 34919501 35300041 36202686 37718655 39867194 42717428 46473677 51470527
11252 51470527 57829851 66077270 77049172 91847558 112088369 140077177 177791301
11245 177791301 224466540 272961890 311976437 335907344 347779476 350683031 341206219
11238 341206219 314356732 272647151 224878442 179738819 141756675 111863716 89042820
11231 89042820 71751018 58556308 48497960 40627526 34345331 29386437 25443768 22248313
11223 22248313 19624824 17497706 15747078 14265942 12976979 11865603 10897225 10196865
11215 10196865 9588769 9024238 8453755 7932039 7429301 7002364 6620044 6287170 6099855
11206F099855k34515k76020k81115k78823l11190l69036k74738k10620k05198
11197C658600k48436j26321l7651p7233j98227j81393k36293j18156j02749j63803
11187B168338k23850j69759j56637p6011m653R299R801J55n5925o1253L2710K0210
11175A492425P784J29971J15238J5212K6877J14961j5576j1442K318P1143J0057
11164A958968r7643n6677m6779j6826q4644j75165k01041j90340o8493j04222
11154I17138j09281k1936n9461j6709L972m3630j0475j145j33049o2129K6224
11143D89519j623r048J722m3269k6765K7428N7993L4809N240J36505N3052N6004
11131G81567Q0831J09829J35922M9615Q2118p159R1709K38065K91355P9122k26850
$$ plain form
11206 6099855 5865340 5589320 5308205 5029382 4718192 4349156 4074418 3863798 3658600
11197 3658600 3410164 3283843 3246192 3168959 2970732 2789339 2553046 2434890 2332141 2168338
11187 2168338 1944488 1774729 1618092 1542081 1537428 1546727 1556528 1556683 1500758 1439505 1472215 1492425
11175 1492425 1500209 1630180 1745418 1760630 1787507 1902468 1886892 1875450 1877768 1948911 1958968
11164 1958968 1861325 1804648 1757869 1741043 1656399 1481234 1280193 1089853 1021360 917138
11154 917138 807857 785921 726460 709751 713723 670093 659618 658473 525424 463295 489519
11143 489519 487896 478848 480570 437301 410536 437964 495957 530766 536006 672511 725563 781567
11131 781567 862398 972227 1108149 1157764 1239882 1232723 1324432 1562497 1853852 1932974 1706124
11120A706124j57185j06398j4981k3811m7481o52L1753k7008m3197j64222j50765
11109A002177j23330q0770q0490k7752j583K4155j5732k1780J06906R9095P2571
11098I53467Q9859J02274L4607P0118J07338m0671m8554O1706P1080R2644J30333
11087A624201k6752k981J238O370P2552J53626J16487O0501k4564l7888r6872
11076A845918j82129j57488j95195r3834m7716o5660j4087o078n093Q7594P4848
11065A241080L7534j6883L812Q6707N7967l4161O3324Q1232k4643P634J09412
11054A613015Q0494J28184J08501J55535J42679O9383M596J60110J07817O3647
11044B633961J05766P1650N6810k039j41248k02759q0278L4065k6945Q37n6436
$$ plain form
11120 1706124 1548939 1442541 1427560 1403749 1356268 1355616 1387369 1360361 1317164 1152942 1002177
11109 1002177 878847 798077 717587 689835 688252 712407 696675 674895 781801 880896 953467
11098 953467 1043326 1145600 1180207 1250325 1357663 1316992 1268438 1330144 1401224 1493868 1624201
11087 1624201 1597449 1594468 1595706 1602076 1674628 1828254 1944741 2005242 1980678 1942790 1845918
11076 1845918 1663789 1506301 1311106 1217272 1169556 1103896 1089809 1083731 1078638 1166232 1241080
11065 1241080 1278614 1261731 1265543 1352250 1410217 1376056 1439380 1520612 1495969 1503603 1613015
11054 1613015 1693509 1821693 1930194 2085729 2228408 2297791 2302387 2462497 2570314 2633961
11044 2633961 2739727 2811377 2868187 2866148 2724900 2522141 2441863 2475928 2448983 2449820 2393384
11033B393384n2097m0896r9367M0367M678O5273J5763Q8256R9672P0443J53716
11022B739192J34831J57312K07909M7840R3656j6230L9684O4674J8158J4767P4516
11011C576309K15775K82546J65365K1524o8886J0141K23899R4595Q331J14011
11001D643610J81552J75600K36637K81916K66517L22513J69372J69135K56814
10992F703666K91004L12011K86715L16474M43785O03237O65912O91516Q95794
10983A1210114R14619J059300J291011J493995J657849J861607K154894K589930
10975B4233319L135949L715680M652390N927948P438200R501336J2536473J7162653
10967H8303948K3372917L1719964M1463387M9347985M9430095L8835431K3940804
$$ plain form
11033 2393384 2341287 2300391 2201024 2241391 2246069 2311342 2327105 2415361 2515033 2585476 2739192
11022 2739192 2874023 3031335 3239244 3287084 3380740 3364510 3404194 3468868 3487026 3501793 3576309
11011 3576309 3792084 4074630 4239995 4261519 4192633 4202774 4426673 4521268 4529599 4643610
11001 4643610 4825162 5000762 5237399 5519315 5785832 6108345 6277717 6446852 6703666
10992 6703666 6994670 7306681 7593396 7909870 8353655 8956892 9622804 10314320 11210114
10983 11210114 12124733 13184033 14475044 15969039 17626888 19488495 21643389 24233319
10975 24233319 27369268 31084948 35737338 41665286 49103486 58604822 71141295 88303948
10967 88303948 111676865 143396829 184860216 234208201 283638296 322473727 346414531
10960C46414531J1284430m36566j6159929l3821601m5541820m7610617m2281922
10953A71846506l4051158k6082419j9663228j4857658j1147724q456615o520594
10946E1067110n163304l885761k943533k182340j624139r05433l68467J89718
10938C4183851P69964J351759J992142K733660L761550N143960P084895J0002135
10930F7023916J3968715J8547727K0826865J8024909J4170361J5186662K1835047
10923A89584202K8164139K4793360J1967977K549384M819844J8081111L7110676
10916C17070693N3363611N3798999L3369119M826406j8854175l4768293m4732071
10909C64074289n1527675n3846900n0185093m2014087l2794974k4675800j8359807
$$ plain form
10960 346414531 357698961 357262395 341102466 307280865 261739045 214128428 171846506
10953 171846506 137795348 111712929 92049701 77192043 66044319 57587704 51067110
10946 51067110 45903806 42018045 39074512 36892172 35268033 34362600 33994133 34183851
10938 34183851 34953815 36305574 38297716 41031376 44792926 49936886 57021781 67023916
10930 67023916 80992631 99540358 120367223 138392132 152562493 167749155 189584202
10923 189584202 217748341 242541701 254509678 257059062 261878906 279960017 317070693
10916 317070693 370434304 424233303 457602422 462428828 443574653 408806360 364074289
10909 364074289 312546614 258699714 208514621 166500534 133705560 109029760 90669953
10902I0669953j3807006j0696848q350896o715653n405278m347146l306952k643610
10894C5396564k124019j713435j368295r30521o36290l39642P7970M60377R13273
10885B9735982J577220K163077K973530M120819N536008P438932J0055833J3856676
10877G7458077J8691434K3840069K6773177K3812182J4676894N012190L27954
10870A90591977O15832J138559l689184j3658772k3004372k6597477k4883360
10863A00513203k0709473j5968639j1982248q956960o652795n150457m231603
10856B6861028l476958k826893k249329j930358j620830j296755j109686j095457
10848A1254762j078437q83185q14883p36700n99887l93988l73098l56287k86820
$$ plain form
10902 90669953 76862947 66166099 57815203 51099550 45694272 41347126 38040174 35396564
10894 35396564 33272545 31559110 30190815 29260294 28624004 28284362 28362332 28822709 29735982
10885 29735982 31313202 33476279 36449809 40570628 46106636 53545568 63601401 77458077
10877 77458077 96149511 119989580 146762757 170574939 185251833 190264023 190591977
10870 190591977 191207809 192346368 188657184 174998412 151994040 125396563 100513203
10863 100513203 79803730 63835091 51852843 42895883 36243088 31092631 26861028
10856 26861028 23384070 20557177 18307848 16377490 14756660 13459905 12350219 11254762
10848 11254762 10176325 9293140 8478257 7741557 7141670 6747682 6374584 6018297 5731477
10839E731477k74775j47430k46218j84136n8240j00237q1546j30411j21868j10410
10829D276206k14976k09363j90956L6144J45489j49856l07905j46592m9074J07043
10819C296160J34069l0470j86545k09835j97096j75345j69870k68830k18640k31221
10809A742377j09681l1269j9992n4440p4676M8765M4203k7369j4414J1180K6170
10798A540854J45762O4225m0382m4772P5813J1879m4546O0790N0042m0056m2746
10787A736863j32898k28570j71945P676j41033q2104L8203p1029j62087n2989
10777G40087Q592j00062q3319p2973k2435o2095n4245m6691O0493R4342O0915
10766E22609Q3344L8867J3004k270j1830p4587J938N9628q2958j4073J21132j0262
$$ plain form
10839 5731477 5456702 5309272 5063054 4878918 4820678 4720441 4638895 4508484 4386616 4276206
10829 4276206 4061230 3851867 3660911 3697055 3842544 3692688 3384783 3238191 3189117 3296160
10819 3296160 3430229 3399759 3213214 3003379 2806283 2630938 2461068 2192238 1973598 1742377
10809 1742377 1632696 1601427 1581435 1526995 1452319 1501084 1545287 1517918 1503504 1514684 1540854
10798 1540854 1686616 1750841 1710459 1665687 1741500 1753379 1708833 1769623 1819665 1779609 1736863
10787 1736863 1603965 1375395 1203450 1211126 1070093 987989 1026192 955163 793076 740087
10777 740087 748679 648617 565298 492325 469890 407795 353550 306859 367352 461694 522609
10766 522609 605953 644820 657824 655554 643724 569137 571075 630703 547745 533672 654804 644542
10754F44542k3856q556Q244N4798P6896N6322N1492R5084O5314K1728J8092j06467
10742I53633k18653m7660o5112O151n5875j31676l1492n6442L0538k8453L7944
10731C92903J06531j2538M7060l5548n638p0704m3785j5715J5421J14076N0057
10720E42120N2951L5730p3236J2636J5077J14236K8590p2155l3057r677O1377
10709F74592j2633p3333q1635o6167k1728j6257p1220j10730J1494M9823k3729
10698B58477p8001m7010P4486J9826N5840j4779P571k3587J8803Q649L0427n2848
10686B57854l7405q5613k8176Q0624L6443O508J00934j0807M9291J1253K5885
10675D06791o6884q7265J1370Q888P9064M3879m4326j9753O7779o2707o8676l2187
$$ plain form
10754 644542 620686 612130 620374 675172 752068 808390 859882 954966 1020280 1042008 1060100 953633
10742 953633 734980 687320 622208 628359 572484 440808 409316 352874 383412 354959 392903
10731 392903 499434 486896 533956 498408 492770 422066 378281 362566 377987 492063 542120
10720 542120 595071 630801 557565 570201 585278 699514 728104 655949 622892 613215 674592
10709 674592 661959 588626 506991 440824 419096 402839 331619 220889 232383 282206 258477
10698 258477 180476 133466 207952 227778 283618 268839 276410 252823 271626 280275 310702 257854
10686 257854 220449 134836 106660 187284 223727 230235 331169 320362 369653 380906 406791
10675 406791 339907 252642 264012 272900 351964 395843 351517 331764 399543 336836 268160 235973
10663B35973Q5865N005o0441j17613q9115N0116R3211N4275L0447M2027M7218
10652C76968Q3127M0476O3529J6926P7437j8919j6740L5910J52341N7671N4282
10641I23008N4859J7264O1066J9672l334R2791J27025J97633J76954K45484J50809
10630B063231J78626K72677K61847K26647L07554L68931M29904O20430Q30447
10621E560294J232322J551445K168443K955270L843606N074374O217786O439489
10613C5043029M974585K372255m9694j420872j514569n06861J129986L359686
10605D3387545O260958R536001J2424932J2895622Q654813J547181m518522p420900
10597H2767630o985590m409444r80289L056088P536571J2276750J5942624J5264509
$$ plain form
10663 235973 321838 326843 266402 148789 59674 109790 203001 257276 287723 329750 376968
10652 376968 460095 500571 564100 581026 658463 639544 622804 658714 811055 868726 923008
10641 923008 977867 995131 1056197 1075869 1072535 1165326 1292351 1489984 1666938 1912422 2063231
10630 2063231 2241857 2514534 2776381 3003028 3310582 3679513 4109417 4729847 5560294
10621 5560294 6792616 8344061 10512504 13467774 17311380 22385754 28603540 35043029
10613 35043029 40017614 42389869 42340175 40919303 39404734 38897873 40027859 43387545
10605 43387545 49648503 59184504 71609436 84505058 93159871 94707052 90188530 82767630
10597 82767630 75782040 71372596 70392307 73448395 80984966 93261716 109204340 124468849
10589A24468849P924405k952457j1431876j4626961j3513222j0184303o172224
10582G3512211k069291J892816N817145Q182459P120341J734000n631036j0639798
10574G9918847j2037313j0659110q159953n400887k790096n32234J158505J904655
10566D3402414J015599j227609l840443n658450o123932n616243m448435l528073
10558A3974828k631022j973992j503771j157924q25486p39296o04521m92023l87637
10549C659156m08345l13966k28241j38191j21564j28137j50093j42988j32708
10540A894923k28548j34627J7833j7232j0588o6905j35285p0320p6287o5249p1190
10529A036525o1800k4096M3024m1187q9962N3462J19573J4945O797j39047k073
$$ plain form
10589 124468849 132393254 129440797 118008921 103381960 89868738 79684435 73512211
10582 73512211 71442920 73335736 79152881 87335340 94455681 96189681 90558645 79918847
10574 79918847 67881534 57222424 49062471 43661584 40871488 40339254 41497759 43402414
10566 43402414 44418013 43190404 39349961 33691511 27567579 21951336 17502901 13974828
10558 13974828 11343806 9369814 7866043 6708119 5882633 5143337 4538816 4046793 3659156
10549 3659156 3250811 2936845 2708604 2570413 2448849 2320712 2170619 2027631 1894923
10540 1894923 1666375 1531748 1549581 1532349 1521761 1454856 1319571 1249251 1172964 1107715 1036525
10529 1036525 974725 950629 993653 952466 862504 915966 1035539 1050484 1057281 918234 916161
10518I16161P0462J68641K25661J70129J69315K39571K14831J45650P115j47443
10508B180093k16442k65691j74524j30597k64185l01641j38197K4892l1290p8529
10498F03889p1583j446o8409J3320k23K1062p747p0731j36314M8417J0736n5449
10486B85522M2578Q4857K1355m8738J8504m136J62034J57606K4395L2326J24215
10475I00518J66710L2479J50400J87833K58824J35069M9172J72023J69710L28640
10465B551378K64877Q3870j14152k90233l93136l29288j89976k45854k51686j28987
10455I56813n0276j47782j08017j84797j45609p6623K904l4010o3836j07976j28102
10444h7311p868J1510Q1134L8193n4645m7579q990m6648P3674J56922J6196K7511
$$ plain form
10518 916161 986623 1155264 1380925 1551054 1720369 1959940 2174771 2320421 2327536 2180093
10508 2180093 1963651 1697960 1523436 1392839 1128654 827013 688816 713708 682418 603889
10498 603889 532306 530860 462451 475771 475548 496610 488863 418132 281818 330235 340971 285522
10486 285522 328100 412957 434312 385574 404078 399942 561976 719582 743977 776303 900518
10475 900518 1067228 1099707 1250107 1437940 1696764 1831833 1881005 2053028 2222738 2551378
10465 2551378 2816255 2900125 2785973 2495740 2102604 1773316 1583340 1337486 1085800 956813
10455 956813 906537 758755 650738 465941 320332 243709 246613 212603 148767 40791 -87311
10444 -87311 -95179 -83669 -2535 35658 -18987 -66566 -75556 -122204 -48530 108392 124588 152099
10432A52099M0819n4835p350L5226J74077N4831J8153J77230K06561J75035K26189
10421A198035J48388M1636r9080k38500k32071q2457j30061k36263p1628l7526
10411B60473q9333n243L0481j4780p9403r3982j17524Q809j0791j7001K8094Q7301
10399a2899K0577l2013P31K1679R3715M5283j04070o2518n8314M4378J6260j1856
10387c9047R8546J8107m5918M7450k2395r8777L2069j7578n5674k8422O507J1140
10375i3992P0630m3624m4229m3202j5555P0227J07142O1868J8497l3146o6396
10364a1780j00522m4312K4109J9977o6961o7354J6529Q608N66O5404K1911j048
10352a34873j514N0155L587k7186J4541L3786q42m0322n121M0043j9759l9226
$$ plain form
10432 152099 192918 138083 130733 165959 340036 394867 413020 590250 796811 971846 1198035
10421 1198035 1346423 1388059 1288979 1050479 818408 735951 605890 369627 297999 260473
10411 260473 171140 165897 196378 181598 102195 8213 -109311 -100502 -111293 -128294 -100200 -12899
10399 -12899 7678 -24335 -23604 -1925 91790 137073 33003 -29515 -87829 -43451 -27191 -39047
10387 -39047 59499 77606 31688 79138 56743 -42034 -9965 -27543 -83217 -111639 -105132 -93992
10375 -93992 -23362 -66986 -111215 -154417 -169972 -99745 7397 69265 87762 54616 -11780
10364 -11780 -112302 -156614 -132505 -112528 -179489 -246843 -230314 -221706 -221140 -155736 -133825 -134873
10352 -134873 -136387 -86232 -82645 -109831 -95290 -61504 -62346 -102668 -107789 -67746 -87505 -126731
10340a26731o2309p3181l1400O8072N6411J2842l2383m0110J9171P9718P1098
10329e8802k1504j59552k8944O673N6131M0001J426j3717O0834R1348J994j06629
10317a30741j41542N1802m5735k6218K9676N7088n043J7741k4943J4402k973j7769
10305b24255m0433l9468J7546p9987K4921J02292l7543M5383J0223k4418Q681
10294b37058J5260n9113j087N0655Q3193k9174L7756J14907m3224o4325l5346
10283a67556J7554o9095o0316R8227k0420J3008o8270L6585R3729N4364r5343
10272a67533J630O236J8966N6078O17O305J7332j1576r1458m509P8530L1439J9951
10259c7992Q3190k9083j09237m2160K4417n0214j08283j6053P7397Q4617P2756
$$ plain form
10340 -126731 -189040 -262221 -293621 -225549 -169138 -156296 -188679 -228789 -209618 -129900 -58802
10329 -58802 -80306 -239858 -268802 -262129 -205998 -165997 -164571 -178288 -117454 -26106 -24112 -130741
10317 -130741 -272283 -220481 -266216 -292434 -262758 -205670 -210713 -192972 -217915 -203513 -206486 -224255
10305 -224255 -264688 -304156 -286610 -366597 -341676 -239384 -276927 -231544 -221321 -245739 -237058
10294 -237058 -221798 -280911 -281998 -231343 -148150 -177324 -139568 -24661 -67885 -132210 -167556
10283 -167556 -150002 -219097 -279413 -181186 -201606 -188598 -256868 -220283 -126554 -72190 -167533
10272 -167533 -165903 -159667 -140701 -84623 -84006 -77701 -60369 -71945 -163403 -167912 -89382 -57943 -37992
10259 -37992 45198 16115 -93122 -135282 -110865 -161079 -269362 -285415 -208018 -123401 -50645
10248e0645K2373L5042N5630j8105p7037J3525P6313J6620k4454O3M0675K979
10236I2979O01l6731k4481l2254j04013K3317J29600k6870p8615k5846m4023L6971
10224h9365K6396j4499K8994r498p827L3549L3298o1982r3141N967J7682Q4726
10212d5700j6113q5328N5461L4239m5943m6831K781R407r992K0512k6038L0447
10200a23098n3336k5645L6044n835l5976r270k7550K7825Q0446j5277n329m8435
10188b05436j8761R1495l998j1681k108o2110n3267r3106J31092Q5601Q9376J523
10176e1380K915O0249R186o571k346r301j7623J54745R9829K2414j4089Q9890
10164C37918N394o4612j4422P2236k9309j40235l7065m431K3495J49412J43300
$$ plain form
10248 -50645 -28272 6770 62400 44295 -32742 -19217 57096 73716 49262 49325 90000 92979
10236 92979 93580 56849 32368 114 -103899 -80582 49018 22148 -56467 -82313 -126336 -89365
10224 -89365 -62969 -77468 -48474 -57972 -65799 -32250 1048 -60934 -154075 -148108 -130426 -45700
10212 -45700 -61813 -147141 -91680 -57441 -103384 -150215 -147434 -138027 -148019 -127507 -153545 -123098
10200 -123098 -176434 -202079 -166035 -171870 -207846 -217116 -244666 -216841 -136395 -151672 -157001 -205436
10188 -205436 -224197 -132702 -136700 -148381 -150489 -212599 -265866 -358972 -227880 -142279 -52903 -51380
10176 -51380 -48465 11784 20970 14399 12053 2752 -14871 139874 239703 262117 248028 337918
10164 337918 343312 278700 264278 336514 307205 166970 129905 125474 148969 298381 441681
10153D41681J23268n6084j01834k0393j8188r1612l4854L394L6305o0263j1602
10142B09818P3931N0363l1908K5191m4444o2938p4279m8095k0894O07N7961J1824
10130A47137l9172n0892m9046J2799J12726L75j22198r2376q763j0329n9875n1950
10118b11564m774k9984l0836J535Q8629R8635k8685q0553q3168J613N3529j1115
10106b36738M8875Q6276m64m0703m8613P6981J962o0846n77j1406J2619O2079
10094a10555N7434k9862o7554p3766m2218J39238J22087m887m6739k8634J03751
10083A8295l286j56075j8479j2903J4516n4358n2790L2050R6195J16848K5225
10072E238j08079K4632j6262l5491k1195n5009k8014L1746n1227l1398j2244L2924
$$ plain form
10153 441681 564949 508865 407031 386638 368450 276838 241984 245378 281683 221420 209818
10142 209818 283749 334112 302204 327395 282951 220013 145734 97639 76745 77352 135313 147137
10130 147137 107965 57073 8027 20826 133552 133927 11729 -80647 -89410 -99739 -159614 -211564
10118 -211564 -216338 -246322 -277158 -275623 -186994 -88359 -117044 -197597 -280765 -279152 -225623 -236738
10106 -236738 -187863 -101587 -102051 -142754 -191367 -114386 -112424 -173270 -173847 -185253 -172634 -110555
10094 -110555 -53121 -82983 -150537 -224303 -266521 -127283 -5196 -10083 -56822 -85456 18295
10083 18295 15009 -141066 -159545 -172448 -157932 -212290 -265080 -233030 -136835 -19987 5238
10072 5238 -102841 -78209 -94471 -129962 -151157 -206166 -234180 -202434 -253661 -285059 -297303 -264379
10060b64379J3381M3595N2428l4850m0464K0170P7130n4750j4860p969j5212O1815
10048a63965J3043m0487j8191j6168p7861k4209N1232L332k7987L7713L9840J4341
10036b09367l3821r258K8332J4800J02012m6825j60181j0803J40014Q8875l4848
10025a31070L6950o476o0361p9827K6540k2580R7706O7716N2850k7780o6756p3433
10013a86521l4372M392O2375K4667r6931j60936Q3810J52175J02319j26438j17775
10002b93235j9199l6608L2323r750J4541O3799j9631l939K6925P6986l8322p1754
9990b77864K0518M8370M5274M2713O8674K48K1665q2525j5890N4361L4338l6831
9978g6949r1856j7224r5604K5967L6294l8457M9353J04063K8805o1194j59190
$$ plain form
10060 -264379 -250998 -207403 -154975 -189825 -230289 -210119 -132989 -187739 -202599 -210568 -225780 -163965
10048 -163965 -150922 -191409 -209600 -225768 -303629 -327838 -276606 -273274 -301261 -263548 -223708 -209367
10036 -209367 -243188 -252446 -224114 -209314 -107302 -154127 -314308 -325111 -185097 -96222 -131070
10025 -131070 -94120 -100596 -160957 -240784 -214244 -236824 -139118 -71402 -18552 -46332 -113088 -186521
10013 -186521 -220893 -216501 -154126 -129459 -226390 -387326 -303516 -151341 -49022 -175460 -293235
10002 -293235 -312434 -349042 -316719 -326469 -311928 -248129 -267760 -271699 -244774 -167788 -206110 -277864
9990 -277864 -257346 -208976 -163702 -120989 -52315 -52067 -30402 -112927 -128817 -74456 -40118 -76949
9978 -76949 -168805 -186029 -281633 -255666 -219372 -257829 -208476 -104413 -75608 -136802 -295992
9967b95992l6339L8174N4495N7537K1563o3614k7322r962M5416L1647N4531l5322
9955a65188J7920M4247l6904j08224o0436R5702j6763l5654O0768j23960j841
9944c30333O9408q9273Q0846J3154n5999Q4795J0648Q3015J64564M7115J10605
9933A88545J38628J48884L22441O51015J040533P88526J28960n98749q36376p57033
9923A215374m51365k46776k20122j34641j13803j85217M5371P5945m8694K3806
9913d0122P1951p1828k4427K3485M8609o1113r2202j01054k3188Q8177J2040k2821
9901a92493K0805K7529m5239K4997J4602l4688m0326l985M3502M1849k7709M0367
9889a30789O5081r1354j6340J06056J4290m6618l6366j07562J9926J1046K8101
$$ plain form
9967 -295992 -332331 -294157 -239662 -182125 -160562 -224176 -251498 -261460 -216044 -184397 -129866 -165188
9955 -165188 -147268 -103021 -139925 -248149 -308585 -212883 -229646 -265300 -204532 -328492 -330333
9944 -330333 -260925 -350198 -269352 -256198 -312197 -227402 -216754 -133739 30825 77940 188545
9933 188545 327173 476057 798498 1449513 2490046 3278572 3407532 2808783 1972407 1215374
9923 1215374 764009 517233 297111 162470 48667 -136550 -91179 -15234 -63928 -40122
9913 -40122 31829 -39999 -64426 -40941 7668 -53445 -145647 -246701 -269889 -181712 -169672 -192493
9901 -192493 -171688 -144159 -189398 -164401 -149799 -184487 -224813 -228798 -185296 -143447 -171156 -130789
9889 -130789 -65708 -157062 -173402 -67346 -53056 -99674 -136040 -243602 -223676 -212630 -184529
9878a84529j7113O8749n0138r9093j0283K5709m2698p8430L5891n2272l5531K5755
9866d13983Q5562P3318K5383K4687p125L2584L7245p6713o8182L3695M7019R8238
9854a08272L2218o8316p9748n350j63k8538J20068M1913L3174m0537J3821N5133
9842c4597l7431o7240l4346L0430J8472q5174k2582J666j5729N3267L7670M3784
9830a11810j1560p2888j700J315p1339L2824J27237K1853Q0672j9066M221O426
9818a3815m5237j18288j5085k7472Q1081P3107o8918r71l5665l5379o1337q480
9806b76459N6720R7019K0272j8350m971j4923o0790q9548n4940M7902M3719M4601
9794b09748J2115N4448p3841l8117K0358O5160O0908n1087o9561o2382o7794l0445
$$ plain form
9878 -184529 -201642 -132893 -183031 -282124 -292407 -266698 -309396 -387826 -351935 -404207 -439738 -413983
9866 -413983 -328421 -255103 -229720 -205033 -212158 -179574 -142329 -219042 -287224 -253529 -206510 -108272
9854 -108272 -76054 -144370 -224118 -229468 -229631 -258169 -138101 -96188 -63014 -103551 -89730 -34597
9842 -34597 -72028 -139268 -173614 -143184 -124712 -209886 -232468 -230802 -246531 -193264 -155594 -111810
9830 -111810 -123370 -196258 -197958 -196643 -267982 -235158 -107921 -86068 -5396 -24462 -20241 -13815
9818 -13815 -59052 -177340 -192425 -219897 -138816 -65709 -134627 -135598 -171263 -206642 -267979 -276459
9806 -276459 -219739 -122720 -102448 -120798 -125769 -140692 -201482 -291030 -345970 -298068 -254349 -209748
9794 -209748 -197633 -143185 -217026 -255143 -234785 -169625 -108717 -159804 -229365 -291747 -359541 -389986
9782c89986k5807L7622N5205P2078N3398K9977p102J7929l6583N8961M5484p4348
9770a63172p5587J0866M5379j3221q6456K8166K0243j4477j4560m2729J3851K7680
9758b64017o210N0828J5550M434L054l3249p383m0750j8830K4724Q7672J33586
9746e0591k5259k3573K788K1781K116K4865n7083m3649N9677r0062P908k2976
9734a94058l5728R504L4961k2426N0125K98P420R100J732o0014n0340K295j8594
9721b65725k2182l172Q2544M1066j0803j1623L3543p2985m9910K4419R9670j8948
9709a74106n7087o4831L3669J750L8239J24806l1544j01865k7415L7069m8338
9698b69653Q6865P1106J0430K3235L8390k0681O3478k0181j51639l2401N3052
$$ plain form
9782 -389986 -415793 -378171 -322966 -250888 -197490 -167513 -174615 -156686 -193269 -134308 -88824 -163172
9770 -163172 -238759 -227893 -182514 -195735 -282191 -254025 -233782 -248259 -262819 -305548 -291697 -264017
9758 -264017 -270227 -219399 -203849 -199415 -196361 -229610 -236993 -277743 -296573 -271849 -184177 -50591
9746 -50591 -75850 -99423 -96635 -74854 -72738 -47873 -104956 -148605 -88928 -178990 -171082 -194058
9734 -194058 -229786 -220282 -185321 -207747 -157622 -157324 -149904 -140804 -139072 -199086 -249426 -247131 -265725
9721 -265725 -287907 -291079 -208535 -167469 -178272 -189895 -156352 -229337 -279247 -254828 -155158 -174106
9709 -174106 -231193 -296024 -262355 -260605 -222366 -97560 -129104 -230969 -258384 -221315 -269653
9698 -269653 -182788 -111682 -101252 -78017 -39627 -60308 3170 -17011 -168650 -201051 -147999
9687a47999l9076q0837K03L1531J14320n5859k7825N8656J8505L9771K6678l3976
9675i5908l9959K6285n800l5781M913k0901q018R6472K3571j01168o1949n6397
9663b74640P1910Q8273L742K2667j0073l5864k4472n2406K2623N5484q1319p0893
9651b84968k6280O0422J06202o119m5468M7538J6398J23009K73626J30486J3911
9640D08757j61700j47244j45332k300J0445N1696K0115j8141n7928l3869j4467
9629h9968j3208m3178k1972l6934l5692J5371K8781P4978o3327q5762k1764J4855
9617b77820p6282L2303Q1545N431l933m754p2359n7135O8606J00335K1080m1631
9605b24614P560n921k7304J3875K658m3042j3673R3282k6567J4807O91k0195q159
$$ plain form
9687 -147999 -187075 -267912 -267709 -236178 -121858 -177717 -205542 -146886 -128381 -88610 -61932 -95908
9675 -95908 -135867 -109582 -115382 -151163 -146250 -167151 -175169 -78697 -55126 -156294 -218243 -274640
9663 -274640 -202730 -114457 -110715 -88048 -98121 -133985 -158457 -210863 -188240 -132756 -214075 -284968
9651 -284968 -311248 -250826 -144624 -150743 -196211 -148673 -132275 -9266 264360 394846 408757
9640 408757 247057 99813 -45519 -47819 -37374 14322 34437 16296 -41632 -75501 -89968
9629 -89968 -103176 -146354 -168326 -205260 -240952 -225581 -196800 -121822 -185149 -270911 -292675 -277820
9617 -277820 -354102 -321799 -240254 -234823 -238756 -243510 -315869 -373004 -304398 -204063 -182983 -224614
9605 -224614 -217054 -222975 -250279 -236404 -233746 -276788 -290461 -197179 -223746 -208939 -208248 -228443 -236602
9592b36602K6498p4515j4724J6807N5578j8092l3118J0813q1619p9767J1405O0245
9580c57091R7683J2417l5610J22729R2446l402l9813p3252p7952n7883K6325R9318
9568a94085K0174o2983Q569L2890O5140q966n9841n4511M1038K8132J1915q2633
9556b55161m8657m7973L8638M9861Q6437k1183J9016K1788K3023l9400j45446
9545c19057p3216P1592K4940K1872K9883J0328N5850l3297J728N341l0342o853
9533b41231N5761L8242J8116j16186k704l3405M9237J5900K9815l7522K891m5836
9521b66922M0508O549k0191O9167l8632j2138r7P0947O2672L8158k1498m8048
9509a19525j907r0297m2245k5979n2561M0640K8317J3359n702r417O2040J03603
$$ plain form
9592 -236602 -210104 -284619 -299343 -282536 -226958 -245050 -278168 -267355 -348974 -428741 -417336 -357091
9580 -357091 -259408 -246991 -282601 -159872 -67426 -70828 -110641 -183893 -261845 -319728 -293403 -194085
9568 -194085 -173911 -236894 -228325 -195435 -130295 -139261 -199102 -253613 -212575 -184443 -172528 -255161
9556 -255161 -303818 -351791 -313153 -263292 -176855 -198038 -179022 -157234 -134211 -173611 -319057
9545 -319057 -392273 -320681 -295741 -273869 -243986 -233658 -177808 -211105 -209377 -204036 -234378 -241231
9533 -241231 -185470 -147228 -129112 -245298 -248002 -281407 -232170 -216270 -186455 -223977 -221086 -266922
9521 -266922 -226414 -219865 -240056 -170889 -209521 -221659 -221756 -150809 -88137 -49979 -71477 -119525
9509 -119525 -121432 -211729 -253974 -279953 -332514 -291874 -263557 -250198 -255900 -265317 -203277 -99674
9497i9674J9587q7828o7987N9582J4917m5225j3096K8900N6078J0183o4835o2504
9485b51902M0617K8672l5520q0007r8265p0396P1545J73270R5271j2285k3093
9474a62093q0778m6215l4636l1632k3839J8489j3496j4827m9165O2824J05853
9463b69515N0353j1908M8076L9505m5447m0514r1836J2991O3072n5094O7538J6736
9451b16043K2568K624k3912l3475k9828j0501n1047k1467q433M1191J68554N8103
9439a01666j02004k2512K201k4461J8818K033Q7611M765j24007n7177N8922M0171
9427b17306J9776p6878O3867L8373J01009R156L2521M5819n468r4352Q02p7494
9415a60175q3948K3713R7162O6818K3485n0869m0805p5775m1164M2473Q2069q189
$$ plain form
9497 -99674 -80087 -167915 -235902 -176320 -161403 -206628 -219724 -190824 -134746 -124563 -189398 -251902
9485 -251902 -211285 -182613 -218133 -298140 -396405 -466801 -395256 -221986 -126715 -139000 -162093
9474 -162093 -242871 -289086 -323722 -355354 -379193 -360704 -374200 -389027 -438192 -375368 -269515
9463 -269515 -219162 -231070 -182994 -143489 -188936 -229450 -321286 -308295 -245223 -300317 -232779 -216043
9451 -216043 -193475 -190851 -214763 -248238 -278066 -288567 -339614 -361081 -369514 -328323 -159769 -101666
9439 -101666 -203670 -226182 -223981 -248442 -229624 -227591 -139980 -135215 -259222 -316399 -257477 -217306
9427 -217306 -197530 -274408 -210541 -172168 -71159 -62003 -29482 16337 10869 -83483 -82681 -160175
9415 -160175 -244123 -220410 -123248 -56430 -32945 -83814 -124619 -200394 -241558 -199085 -117016 -125205
9403a25205J00045L231j27459j10611j9063R5478J03168p1682p6451j03776N2792
9392b79533R861M4556o4573Q1186J19681L1149m0508l1730j10253k9636J71204
9381i8596J5764j10882m4471o0495J100Q2726M9944j849M0095O002L3622M5042
9369d1998L193n4096l8014K707P2494k2690k7849l7279p2526J3213k6433k7189
9357b56467L7164Q4601N556m5767m3894r717j9716K0122Q9983Q2421k0790n5404
9345a31908j07052J9822J3575j4282j6077q0315N0252P3546L854J71n1684o1194
9333c01292R0232J36871N4816n1385n5140n2847j5875P040L0509O5229R4880o934
9321c896m4552N026j6683L5434o4398o8362l6363n983K3200j08833n2194Q4307
$$ plain form
9403 -125205 -25160 -21929 -149388 -259999 -279062 -183584 -80416 -152098 -228549 -332325 -279533
9392 -279533 -269672 -225116 -289689 -208503 -88822 -57673 -98181 -129911 -240164 -269800 -98596
9381 -98596 -82832 -193714 -238185 -298680 -297580 -214854 -164910 -166759 -126664 -120662 -87040 -41998
9369 -41998 -38805 -92901 -130915 -128208 -55714 -78404 -106253 -143532 -216058 -202845 -229278 -256467
9357 -256467 -219303 -134702 -129146 -174913 -218807 -228524 -248240 -228118 -138135 -55714 -76504 -131908
9345 -131908 -238960 -219138 -205563 -219845 -235922 -316237 -265985 -192439 -188585 -188414 -240098 -301292
9333 -301292 -211060 -74189 -19373 -70758 -125898 -178745 -194620 -187580 -157071 -91842 3038 -3896
9321 -3896 -48448 -43422 -60105 -24671 -89069 -157431 -193794 -199777 -176577 -285410 -337604 -253297
9309b53297M4621j7718K0856m3376k9867k8331O2164j756j9148P450J5942O14
9297b41846K0815j3406J9737n282L0366K1495N51N4908K7395M8178j10788j21194
9285b69071p0017M1890J50638J213p3574m7752N9425M0394J1992o4742N7826P7016
9273h4762O24L5317J3374n673p5757m0675L0927l2168l5118p3007l1174o2755
9261c60847N1482M7162M4617L8399n2528n4124o6532N4670j461J8189J3306O0260
9249b07407k6875L0242j7313J0223Q0664L9380l0247r26L76o3728J8153L0161
9237a37297p0702j6721q4853O3138N086Q564K3235K2097R950o6428l9540P0192
9225b13279L4149N483N9655j6629n2316L1587L998m1919n278P8121m5984j19239
$$ plain form
9309 -253297 -208676 -226394 -205538 -248914 -278781 -307112 -244948 -246704 -265852 -258402 -242460 -241846
9297 -241846 -221031 -234437 -214700 -219982 -189616 -168121 -167570 -112662 -85267 -37089 -147877 -269071
9285 -269071 -339088 -297198 -146560 -145347 -218921 -266673 -207248 -166854 -154862 -219604 -161778 -84762
9273 -84762 -84138 -48821 -35447 -41120 -116877 -157552 -126625 -158793 -193911 -266918 -298092 -360847
9261 -360847 -309365 -262203 -217586 -179187 -231715 -285839 -352371 -297701 -299162 -280973 -267667 -207407
9249 -207407 -234282 -204040 -221353 -211130 -130466 -91086 -121333 -122259 -121883 -185611 -167458 -137297
9237 -137297 -207999 -224720 -309573 -246435 -241349 -232785 -209550 -187453 -177503 -243931 -283471 -213279
9225 -213279 -179130 -173647 -113992 -130621 -182937 -151350 -147352 -189271 -194549 -116428 -162412 -281651
9213b81651l4820N0673o1453n3855m4101L5211P1476M6042M3394O6800L5398j21046
9201b47932k0210N540M7308Q470r648O7513L4758p427l7494o2308o798J146M7175
9188a79907J7778N8104j2349J2916m3293L8876j5868r713J6212n4526n2661k3725
9176b48156J5763O9278N1113L0161o8228r3949j7333L3356j5569o6278K1618O1473
9164b26751O3073l2371n8743k5633M0355L5820K3495J9714M5109o0509K8441n3556
9152b01556n0943J60556L5531k2k7243k2471l2372l800N2176k7955J6734J1880
9140h9485l9833M0356J6770q513j3569m5414K6820j7058m868L0625L9118k9692
9128i4743J6313L3525n6413r7560m287J1590j3847P8307L0116j8201M7841l4757
$$ plain form
9213 -281651 -316471 -265798 -327251 -381106 -425207 -389996 -318520 -272478 -229084 -162284 -126886 -247932
9201 -247932 -268142 -262602 -215294 -206824 -216472 -148959 -114201 -121628 -159122 -221430 -228228 -227082 -179907
9188 -179907 -162129 -104025 -116374 -103458 -146751 -107875 -123743 -133456 -117244 -171770 -224431 -248156
9176 -248156 -232393 -163115 -112002 -81841 -150069 -244018 -261351 -227995 -243564 -309842 -288224 -226751
9164 -226751 -163678 -196049 -254792 -280425 -240070 -204250 -180755 -161041 -115932 -176441 -148000 -201556
9152 -201556 -252499 -91943 -56412 -56434 -83677 -106148 -138520 -142320 -90144 -118099 -101365 -89485
9140 -89485 -129318 -88962 -72192 -80705 -94274 -139688 -112868 -129926 -134794 -104169 -65051 -94743
9128 -94743 -78430 -44905 -101318 -198878 -203165 -191575 -205422 -127115 -96999 -115200 -67359 -102116
9116a02116m5352M6312M8437j01972m2701p2208L3297L4392n9334k9862M8390
9105b42717J1958L8101J8425k1292q961l9838M8316N494r0713O5113M6879j5842
9093a85077n9341k8169O0632N284R7550M1764m748j5347m6423o6722K8791p3823
9081b45629p7222J10599J22263P5173j05135q1507r806l7335K2211Q0060M9193
9070i7135M0673M415m8850M1813o9468k6044N410J05201L1503o4687j19128m9982
9058b46279o9077m7922M7501K5836L7116O57k4498M3986M1990l736k7196J6740
9046b04882m4543j6644k0756k464M8440j8242n0112J01206N6112l5348J2353m100
9034a78980J3562l5325l4746M2199J21920j2392r4377J03509J0602r6523q9026
$$ plain form
9116 -102116 -147468 -101156 -52719 -154691 -197392 -269600 -236303 -201911 -261245 -291107 -242717
9105 -242717 -230759 -192658 -174233 -195525 -204486 -244324 -196008 -190514 -281227 -216114 -169235 -185077
9093 -185077 -244418 -272587 -211955 -206671 -109121 -67357 -72105 -87452 -133875 -200597 -171806 -245629
9081 -245629 -322851 -212252 -89989 -14816 -119951 -201458 -211264 -248599 -226388 -146328 -97135
9070 -97135 -56462 -52047 -100897 -59084 -128552 -154596 -149186 -43985 -12482 -77169 -196297 -246279
9058 -246279 -315356 -363278 -315777 -289941 -252825 -252168 -276666 -232680 -190690 -194426 -221622 -204882
9046 -204882 -249425 -266069 -286825 -289289 -240849 -259091 -309203 -207997 -151885 -187233 -174880 -178980
9034 -178980 -165418 -200743 -235489 -193290 -71370 -83762 -178139 -74630 -64028 -160551 -249577
9023b49577N9578Q4441R3424K6174m6239j3825p3375o1807j6406J17170n6571
9012a37013m8758L1557Q4967K2652j355R36k9591j2755j25745m1322J08341M7395
9000a00691K4741m22J06279r219N058j01681j10600n5454K7375j0129m5892k9938
8988c00573m0117J1172J12166P6278j6312j3140M5187N981n351n197j08678j5434
8976b54018o862l5972L9336P5638m6606j43556J7923J56699j3637N860J8536J20226
8964f6433p120n0138o8214p7300Q050Q0876J42541J1300l1860O85j6894j835o0805
8951a37147q477L2141q023j2453N3013N1674p641j195M7306L5442m4276p5644
8939g5280q8229k3662O8547k9750N0193j02240q5733M1472L4378L0483n635M738
$$ plain form
9023 -249577 -189999 -105558 -12134 14040 -32199 -46024 -119399 -181206 -197612 -80442 -137013
9012 -137013 -185771 -154214 -69247 -46595 -47950 -47014 -76605 -89360 -215105 -256427 -148086 -100691
9000 -100691 -75950 -76372 29907 20688 25746 -75935 -186535 -241989 -214614 -224743 -270635 -300573
8988 -300573 -340690 -329518 -217352 -141074 -157386 -170526 -125339 -119358 -124709 -129906 -238584 -254018
8976 -254018 -260880 -296852 -257516 -181878 -228484 -372040 -354117 -197418 -211055 -205195 -186659 -66433
8964 -66433 -73553 -123691 -191905 -269205 -261155 -180279 -37738 -26438 -58298 -57613 -74507 -76342 -137147
8951 -137147 -145624 -113483 -121506 -133959 -80946 -29272 -36913 -38108 9198 44640 364 -75280
8939 -75280 -163509 -187171 -118624 -148374 -98181 -200421 -286154 -244682 -210304 -179821 -185456 -180718
8927a80718K2202L177N370m8750n2049j6692j6823J23856R7493O8178J395o7794
8915f1155q5249k7940J06124M3207o9437n0714J7427N1802l7433k5551Q1590l8888
8903i6217m0780o828j19253l0683N4515Q1006o956L0604K9174j8891M118L9586
8891h0605J3474k7005m7944p1312J13828P5770J1145j05146n1194o2348j5584
8880b46921M126P472n8059J5927o0417n604J0192K5721k967N4906J12938m9453
8868a92139k577P210q366O4153N9586k1188p800l093q1016j09408k9036L2551
8856b91123n279R3407N2175l643J0658m9624R50m9572M8322P5301L8302p132n3885
8843a41143m3958k7865L5847m369L3899j7846l6594n1905Q1071N3636n945o9327
$$ plain form
8927 -180718 -158516 -155339 -149969 -198719 -250768 -267460 -284283 -160427 -62934 5244 6639 -61155
8915 -61155 -146404 -174344 -68220 -25013 -94450 -145164 -127737 -75935 -113368 -138919 -57329 -96217
8903 -96217 -136997 -143825 -263078 -293761 -239246 -158240 -165196 -134592 -105418 -124309 -120191 -80605
8891 -80605 -67131 -94136 -142080 -213392 -99564 -23794 -12649 -117795 -168989 -231337 -246921
8880 -246921 -242795 -235323 -293382 -277455 -337872 -343476 -333284 -307563 -310530 -255624 -142686 -192139
8868 -192139 -194716 -187506 -195872 -131719 -72133 -93321 -101121 -104214 -185230 -294638 -323674 -291123
8856 -291123 -296402 -202995 -150820 -154463 -143805 -193429 -192479 -242051 -193729 -118428 -80126 -87258 -141143
8843 -141143 -185101 -212966 -177119 -181488 -147589 -165435 -202029 -253934 -172863 -119227 -125172 -194499
8831a94499L2847p283l3732k3339J3975K262l5860l0505L315N865m2862n1022
8819c60838R0513J48517Q2339K5570J7199p9063o4775k012k832j5104M814r2939
8807b48611p4620J5173L0204J3873P6196K8414J915J0347n4118k0556p1530l8344
8795c31657K5459j3441K0666O7273o9464n2272p027M8951Q5961N6116k2339o7349
8783b59123l0124j04463p7483M5742N9483L1345j0990K4075O8301J1390K1111
8772b20736R0789j2866k5504J5543l4580o1453j13796J7801J81491J2839r5398
8761b45870j1166K6619K2918k4469l652L9091K2151L088n1698M3735l1696l83
8749b11332L2344q776n529m245l7981J1827j1156L1407K8111N7478N5229j5410
$$ plain form
8831 -194499 -161652 -168935 -202667 -226006 -212031 -209769 -245629 -276134 -272819 -266954 -309816 -360838
8819 -360838 -270325 -121808 -39469 -13899 3300 -75763 -140538 -142550 -145382 -160486 -155672 -248611
8807 -248611 -323231 -308058 -277854 -263981 -187785 -159371 -157456 -147109 -201227 -221783 -293313 -331657
8795 -331657 -306198 -319639 -298973 -231700 -301164 -353436 -360463 -311512 -225551 -169435 -191774 -259123
8783 -259123 -289247 -393710 -471193 -425451 -365968 -334623 -345613 -321538 -253237 -241847 -220736
8772 -220736 -129947 -142813 -168317 -152774 -187354 -248807 -362603 -344802 -163311 -150472 -245870
8761 -245870 -257036 -230417 -207499 -231968 -235620 -196529 -174378 -171290 -222988 -179253 -210949 -211332
8749 -211332 -178988 -187764 -193293 -197538 -235519 -223692 -234848 -203441 -175330 -117852 -62623 -78033
8737g8033m8251j5018o4075K8060n6816L2722L5443Q52K2905p9818o902K7059
8725b01872o2033N4174R57n254N633j3034O4715o1604j1985J9040m7509Q0587
8713a78185J14947o6544j27444l8182O8008k0204q736L4401M9727N3325l5870
8702a54757N1104M2650q3441q2676l3160J1897N4084J32229J4961K0042l4756
8691f1823j1919k1427j30112j12419m3883K5551P1268N0023L3592P0874j11433
8680b41708K3185J8715m8035M9157J5471k6573j8570j7911L8549n352K6859J6550
8668a69663Q8865P3406N7987j08063j42682l2846Q8989n2898M5262K7039N708
8657a18896l3752n846k1011L8191m5488l5287L9652M987O6656L1617L3837j8269
$$ plain form
8737 -78033 -126284 -141302 -205377 -177317 -234133 -201411 -165968 -165116 -142211 -222029 -228931 -201872
8725 -201872 -263905 -209731 -208774 -214028 -208395 -221429 -156714 -218318 -230303 -211263 -258772 -178185
8713 -178185 -63238 -129782 -257226 -295408 -227400 -247604 -256340 -221939 -172212 -118887 -154757
8702 -154757 -103653 -61003 -144444 -227120 -260280 -248383 -194299 -62070 -47109 -27067 -61823
8691 -61823 -73742 -95169 -225281 -337700 -381583 -356032 -284764 -234741 -201149 -130275 -241708
8680 -241708 -218523 -199808 -247843 -198686 -183215 -209788 -228358 -246269 -207720 -213072 -186213 -169663
8668 -169663 -80798 -7392 50595 -57468 -200150 -232996 -144007 -196905 -151643 -124604 -118896
8657 -118896 -152648 -158494 -179505 -141314 -186802 -222089 -182437 -177450 -110794 -79177 -45340 -63609
8645f3609k5370r9320M2663O7794k5916K8728o2642q6777O359M2494q903L7726
8633a46773O5838p4418L6183k7917j0698m976J8723K0808n2233k3799K9742P0160
8621i9360L3052k8743L5755J2826o8022k3778J16771O4962l4549O275K766j17439
8609i9484q3426k7819M8277Q3315J1889j41458p878L4099J47348n2761q7729n3342
8597b28969r619J9306R2002J9253L8351M3082Q1219J1136j17210m3296r5248j09735
8585b99728K7631K6683N3898j1988k3727K4204Q9972O9076M4562m9080p2477m1369
8573a62343N113P861n2466o641M5552L0215K3089L2016j09330j12933o332p75
8561c06974J30015N7793m2290J521o0740J8317Q7949k4974l5549k0601K2361j4533
$$ plain form
8645 -63609 -88979 -188299 -145636 -77842 -103758 -75030 -137672 -224449 -218090 -175596 -184499 -146773
8633 -146773 -80935 -155353 -119170 -147087 -157785 -162761 -144038 -123230 -175463 -199262 -169520 -99360
8621 -99360 -66308 -95051 -59296 -46470 -114492 -138270 -21499 43463 8914 15189 17955 -99484
8609 -99484 -182910 -210729 -162452 -79137 -67248 -208706 -216584 -182485 -35137 -87898 -175627 -228969
8597 -228969 -238588 -219282 -127280 -108027 -69676 -26594 54625 65761 -51449 -94745 -189993 -299728
8585 -299728 -272097 -245414 -191516 -203504 -227231 -203027 -113055 -43979 583 -48497 -120974 -162343
8573 -162343 -157230 -149369 -201835 -208476 -162924 -132709 -109620 -77604 -186934 -299867 -306199 -306974
8561 -306974 -176959 -119166 -161456 -159935 -220675 -202358 -114409 -139383 -174932 -195533 -173172 -187705
8549a87705o4135j3571j4781R8297m1290L17O4665J7785Q48L4799j2171m1452
8537a58394Q0232m083l6799l0501J13615J5735j32832j0167K0933J2644j5383
8526a45000O4526K4109j13125r3217K9719K8621O895N3295m551L315J1834j5276
8514a48855J3661M6753j8956P4827p1966l2547l8035L4800L3493k9287l3077N3103
8502a16086M9055m9825n1910K9882j0013n2140M9918K9433k5139r594J1845n1390
8490a95964p7491k8546l3337n574k8317R9752J17967O0911O75p7735j4000R5693
8478h5966K7919q7406o224K4015r294J6398Q437N4671l5469n2753L359K0783R5503
8465b6027n2490o3722p0451j2259l4452m8840L5340K2706O7922n7866l0259k9679
$$ plain form
8549 -187705 -251840 -265411 -280192 -181895 -223185 -222868 -158203 -140418 -139570 -104771 -116942 -158394
8537 -158394 -78162 -82245 -119044 -149545 -35930 -20195 -153027 -163194 -142261 -129617 -145000
8526 -145000 -80474 -56365 -169490 -262707 -232988 -204367 -197472 -144177 -148728 -145413 -133579 -148855
8514 -148855 -135194 -88441 -107397 -32570 -104536 -137083 -175118 -140318 -106825 -136112 -169189 -116086
8502 -116086 -67031 -116856 -168766 -138884 -148897 -201037 -151119 -121686 -146825 -156419 -144574 -195964
8490 -195964 -273455 -302001 -335338 -340912 -369229 -269477 -151510 -90599 -89924 -167659 -181659 -85966
8478 -85966 -58047 -145453 -151677 -127662 -136956 -120558 -112121 -57450 -92919 -145672 -142313 -121530 -26027
8465 -26027 -78517 -142239 -212690 -224949 -259401 -308241 -272901 -250195 -182273 -240139 -270398 -300077
8453c00077N454J38178K5775O9222O7226K8208O9794p5403m2862N0146j00954
8442f5293m5943J1229l5604O6914P5408q355l6580j03212M7235J59008R615n8732
8430A5690n8505k9854K7873p77p2k7076r449l4275m872O1662r709J6654k6847
8417g9557K1193K3007r4254m5912J22403L0424l5433m8125j1404j9032j2257J9797
8405a29150P2760k5293n7626N0674j7039q2780l1335l8372L5559J13047Q8494
8394b1061k0141l8937K531O0506P056j14700j50505L3825J24444M5381K1575n7762
8382a07788p846p1664m0149M2227J05014j283o5192m3528L9853J6666N5914R0275
8370A2499n1640n5894P566k0396k6827q413j7487N6427J5661l2503j5212q8877
$$ plain form
8453 -300077 -294623 -156445 -130670 -61448 5778 33986 103780 28377 -14485 35661 -65293
8442 -65293 -111236 -100007 -135611 -68697 6711 -1644 -38224 -141436 -94201 64807 74422 15690
8430 15690 -42815 -72669 -44796 -45573 -45645 -72721 -82170 -116445 -121317 -59655 -69364 -52710 -79557
8417 -79557 -58364 -35357 -129611 -175523 -53120 -22696 -58129 -106254 -117658 -136690 -148947 -129150
8405 -129150 -56390 -81683 -139309 -88635 -105674 -188454 -219789 -258161 -222602 -109555 -21061
8394 -21061 -41202 -80139 -77608 -17102 -10046 -124746 -275251 -241426 -116982 -71601 -50026 -107788
8382 -107788 -115634 -187298 -227447 -185220 -80206 -81489 -146681 -190209 -150356 -133690 -77776 12499
8370 12499 -39141 -95035 -87469 -107865 -134692 -143105 -160592 -104165 -88504 -121007 -136219 -225096
8358b25096n0201K2691k4182J21474N6876k8353J9059L9625Q4364J9238q3833
8347d8338r5065n6035J04677n9026o2261k7207K0099R3576P6378j8981l7851k7812
8335a37846K604K3589K071J2577k4719n1741j38295m803J03782Q6288R67m4337
8323a69863M3751n2016j25448P0178N6407K414R2584O6394n4073m0076p5409l8267
8311b23424M8112K8544l9840J09543J04643R439m3865k9521J189L75m2614l6089
8299a13508k8618k8816K9978K576o4898j0832R3548R8231p9778j11387K8277N1180
8287a34047k6414k3259K7297M3903J3728l6610l6562O2910L3979m1291K7382k1482
8275a10466m6239k4332L5932M5809l756k2294j06346m1591K9866P7647M4344M2520
$$ plain form
8358 -225096 -275297 -252606 -276788 -155314 -98438 -126791 -107732 -68107 16257 35495 -48338
8347 -48338 -143403 -199438 -94761 -153787 -216048 -243255 -223156 -129580 -53202 -72183 -110034 -137846
8335 -137846 -135242 -111653 -109582 -97005 -121724 -173465 -311760 -316563 -212781 -126493 -125526 -169863
8323 -169863 -126112 -178128 -303576 -233398 -176991 -174577 -81993 -15599 -69672 -109748 -185157 -223424
8311 -223424 -175312 -146768 -186608 -77065 27578 37017 -6848 -36369 -35180 -34805 -77419 -113508
8299 -113508 -142126 -170942 -140964 -138388 -203286 -214118 -120570 -22339 -102117 -213504 -185227 -134047
8287 -134047 -160461 -183720 -156423 -112520 -98792 -135402 -171964 -109054 -75075 -116366 -88984 -110466
8275 -110466 -156705 -181037 -145105 -99296 -103052 -125346 -231692 -273283 -243417 -165770 -121426 -78906
8263g8906k5685p827l3398M3891L3897k805q8461N845K8873J7965o1595r3545
8251b61751L6361J8589K7002m138j282M518n4928p0795J02531M6879N7069J3263
8239h6682J1780k3669K1574k2159r8311J4892R6128r585q9333p0240l4489R3172
8227a96922Q0959J36556K0328k376n7j14250j75140k5774N2026J08863M6545q9163
8215a58405l2444N1216j0574n5673M597K8263L0467N0203j45p794q6195m8037
8203b34521M5213M5031j271N289J3917L3501j27701J2667R9818O8698l3477j09944
8191a82780n267P1731P0172J15396O2980j03043j04665n4572Q592K45n4568J8814
8179a56965J25538l3494q6597K3044K8807R749p203N3554k432r2925K8432M843
$$ plain form
8263 -78906 -104591 -112418 -145816 -101925 -68028 -70833 -159294 -153449 -124576 -106611 -168206 -261751
8251 -261751 -225390 -206801 -179799 -183937 -185219 -180701 -235629 -306424 -203893 -157014 -99945 -86682
8239 -86682 -74902 -98571 -76997 -99156 -197467 -182575 -86447 -96032 -185365 -255605 -290094 -196922
8227 -196922 -115963 20593 40921 38545 38488 -75762 -250902 -276676 -224650 -115787 -69242 -158405
8215 -158405 -190849 -139633 -150207 -205880 -201283 -173020 -142553 -92350 -92495 -100289 -186484 -234521
8203 -234521 -189308 -144277 -145548 -140259 -126342 -92841 -220542 -207875 -108057 -39359 -72836 -182780
8191 -182780 -188047 -116316 -46144 69252 132232 29189 -75476 -130048 -121456 -121211 -175779 -156965
8179 -156965 -31427 -64921 -151518 -128474 -99667 -89918 -97121 -43567 -45999 -138924 -110492 -105649
8167a05649M0216L4016k8609o6660o5496P7551j1767l5390j1017p0706k9090P9354
8155a93247j3232L497j8576j4140k0584L280N5039N835J10049N4937J9546o3094
8143g0690n386K8121p8093r971R5354j8704J3523L5338p691k8423l1779k1315
8131i9716L671k9890j01986L8397l897l367O8577L5641K5875j125r6265m4459
8119b08544N1046M0544N7245M0203n755o2284k4010n157o3300n6810m4532p064
8107b88418R1991J80709m7413l406O5380o5501K5948o170k2137J5296p2675K8340
8095i8056J02156Q7099l5068m5431o7121k0144M0763j2253L76L132n7351j9309
8083a21207m957L4097j2089N3920J7286o2980n8410K0638L0470P9266K7795j39804
$$ plain form
8167 -105649 -65433 -31417 -60026 -126686 -192182 -114631 -126398 -161788 -172805 -243511 -272601 -193247
8155 -193247 -206479 -202982 -221558 -235698 -256282 -253002 -197963 -192128 -82079 -27142 -7596 -70690
8143 -70690 -76076 -47955 -126048 -136019 -40665 -59369 -45846 -10508 -18199 -46622 -78401 -99716
8131 -99716 -96045 -125935 -227921 -189524 -193421 -196788 -128211 -92570 -66695 -67820 -164085 -208544
8119 -208544 -157498 -116954 -59709 -19506 -25261 -87545 -111555 -116712 -180012 -236822 -281354 -288418
8107 -288418 -196427 -15718 -63131 -66537 -1157 -66658 -40710 -46880 -69017 -53721 -126396 -98056
8095 -98056 4100 91199 56131 10700 -56421 -76565 -35802 -48055 -47679 -44547 -101898 -121207
8083 -121207 -126164 -92067 -104156 -50236 -32950 -95930 -154340 -133702 -103232 -23966 3829 -135975
8071a35975m9086J7079O8344j0913j7079q338O32j6531k9278L5724o9264M7100
8059a67585M4382o7657j31547J8153L0842J41114r6745N2347J56191M6877n8338
8048c1966R87k9854p3894K54N3838L3952N674J5151L817k1026n4410J4948j61
8035h2690p7763K5556j0351n8141k0848P7667O0501l5532J7269Q834n480Q737
8023i2241l8936n3224j5140k6643J04217N1323P9893J1649r3679j32903K1420
8012a84264P3263J25570l0572J6740m39N3453o5771k2547r7034m1195Q2481M243
8000h6072p1043M4440L4093n4354K8034o177l4604m0321J3181k9618r1554m5347
7988c39342J61862M9416q0676j6112L0998Q1740J9002L7781o9905j1337Q6844
$$ plain form
8071 -135975 -185061 -167982 -99638 -110551 -127630 -135968 -135336 -151867 -181145 -145421 -214685 -167585
8059 -167585 -123203 -190860 -322407 -304254 -273412 -132298 -229043 -176696 -20505 26372 -31966
8048 -31966 -30979 -60833 -134727 -134473 -80635 -46683 -41009 -25858 -22041 -43067 -97477 -82529 -82690
8035 -82690 -160453 -134897 -145248 -203389 -224237 -146570 -86069 -121601 -104332 -95498 -100978 -92241
8023 -92241 -131177 -184401 -199541 -226184 -121967 -70644 9249 20898 -72781 -205684 -184264
8012 -184264 -111001 14569 -16003 737 298 53751 -12020 -34567 -131601 -172796 -90315 -86072
8000 -86072 -157115 -112675 -78582 -132936 -104902 -111079 -145683 -186004 -172823 -202441 -293995 -339342
7988 -339342 -177480 -128064 -208740 -224852 -193854 -112114 -93112 -55331 -125236 -136573 -49729
7977d9729N4495N5850r4827l3286k5199j060p1285O838J56932j9769j20636j04332
7965b46008K2698N420M0561m5866j6397M2966J23983R7033m6850j8346o6377r6935
7953b04118O5118k3121k9533N1033P8673O76r322J1564M1114o881L103q9307K2672
7940h8329n6316j33032L2744P7691K9518k4700k7806l0139R985N923N0132k3598
7928a77927q8629j00796J7000J64714J02864m5754o5930k0559j8301L5590R4885
7917a02843O3917o9550J8837K2821j0993K5226m6963l5868q9290J3731L5738J67806
7905g431P8025p1058o7246l8237N8883R5048r659m1111k8636P813j7162k6116
7893f6887j2058o7843o1571J8873j2147K462M4325O3003O5887n2684q1229m7549
$$ plain form
7977 -49729 4766 60616 -34211 -67497 -92696 -93756 -165041 -158203 -1271 -21040 -141676 -246008
7965 -246008 -223310 -217890 -177329 -223195 -239592 -196626 -72643 24390 -22460 -40806 -107183 -204118
7953 -204118 -139000 -162121 -191654 -140621 -61948 -61272 -70594 -59030 -17916 -24797 -21694 -111001 -88329
7940 -88329 -144645 -277677 -244933 -167242 -137724 -162424 -190230 -220369 -210384 -204461 -154329 -177927
7928 -177927 -266556 -367352 -350352 -185638 -82774 -128528 -194458 -215017 -233318 -197728 -102843
7917 -102843 -38926 -108476 -89639 -66818 -77811 -52585 -99548 -135416 -224706 -210975 -175237 -7431
7905 -7431 70594 -464 -67710 -105947 -47064 47984 38325 -2786 -31422 -23609 -40771 -66887
7893 -66887 -78945 -146788 -208359 -189486 -201633 -199171 -154846 -91843 -25956 -78640 -159869 -207418
7881b07418j773K1870O9231R1932K0388p7295r802j39787j09805M9730M7022J321
7869b44386J8292K2763n0733J00471N2675L4540q2523o8629N384J0645M9189J19914
7857c2398M2930M698j7371J02961j1555j10395q7815n4732L4724K3928K8516O6753
7845i756o7903j30215P5997J14311K2734O420m6845j7740q1068K1986k301Q149
7833a06231N5658k8348l0618j3118N501N5370j0225K3676q585l2099o5856J0399
7821a44476J09355j5864q4880k2054n0103J11699R3337j0761J0521k506r2029
7810i7761l5486l2415J09348K6950P0554m9818j3691m453j13824l7864l9367k9928
7798b47755O6172Q7157R2825L2979p1594m1282Q8801k8468q3015m2584L8198R7604
$$ plain form
7881 -207418 -209191 -187321 -118090 -26158 -5770 -83065 -92867 -232654 -342459 -292729 -245707 -244386
7869 -244386 -226094 -203331 -254064 -153593 -100918 -66378 -148901 -217530 -212146 -201501 -152312 -32398
7857 -32398 10532 15230 -2141 100820 89265 -21130 -108945 -163677 -128953 -105025 -76509 -9756
7845 -9756 -77659 -207874 -131877 -17566 5168 11588 -35257 -52997 -134065 -112079 -114380 -106231
7833 -106231 -50573 -78921 -109539 -122657 -117156 -61786 -72011 -48335 -56920 -89019 -154875 -144476
7821 -144476 -35121 -50985 -135865 -157919 -208022 -96323 -2986 -13747 -3226 -5732 -97761
7810 -97761 -133247 -165662 -56314 -29364 41190 -8628 -22319 -26772 -140596 -178460 -217827 -247755
7798 -247755 -181583 -94426 -1601 31378 -40216 -81498 7303 -21165 -104180 -146764 -108566 -10962
7786a0962p534M9009n133r7919l1084K3494l0153n2584k8235J6190n1682K3656
7774b02937k8665k7748q4l091j9534J8588J07663K3456n0739k591Q908Q8414r2815
7761a81175L669Q6708L6784l9306l2119K5976M4555l8061o4755P0042N5597K0769
7749a1316N461n6098o755r155m4389n7966p504j8893K3366M8443l017m0866L5733
7736a42956p3762n5688K6486L0761R8801R8812M1886q692J22190o0369j53788
7725g6319j27650n8179M6267N9937J03355J7705j8692q0506m1943J05560k1846
7714i2311o294L3013O7334M0404p0771K7881N4580m4745m1765J9358J5429k4943
7702b2830o484L0243J5427J8252m2711n2358J9565m1074n9350K0638K7499N635
$$ plain form
7786 -10962 -18496 30513 25380 -72539 -103623 -80129 -110282 -162866 -191101 -174911 -226593 -202937
7774 -202937 -231602 -259350 -259434 -262525 -282059 -263471 -155808 -132352 -183091 -185682 -176774 -88360 -181175
7761 -181175 -177506 -90798 -54014 -93320 -125439 -99463 -54908 -92969 -157724 -87682 -32085 -11316
7749 -11316 -5855 -61953 -68708 -77863 -122252 -180218 -187722 -206615 -183249 -134806 -137823 -178689 -142956
7736 -142956 -216718 -272406 -245920 -215159 -116358 -17546 24340 15648 137838 77469 -76319
7725 -76319 -203969 -262148 -215881 -155944 -52589 -34884 -53576 -134082 -176025 -70465 -92311
7714 -92311 -98605 -65592 1742 42146 -28625 -744 53836 9091 -32674 -13316 2113 -22830
7702 -22830 -29314 929 16356 34608 -8103 -60461 -40896 -81970 -141320 -120682 -93183 -87548
7690h7548Q0702Q6118n139l8240J3186j18249p9806J8951J7313M484J4846L6738
7678e6644K351m8604O1347K4722k4368m7271K2146o2552L2842K3481J2281K7855
7666c2414K0562m976m3924n1371j9134O9656N5342j7846q4765q9262J9797k524
7654a80859O142p000L7160N9535O716J056K9221O8188l4890n9114o2198l2163
7642a68206L809J7639r7597j54838K8004J56231k7352j8440J09171J20991m4960
7631g5548n3154j3984p612n605J6133L8115M6287l2616o2500M4701Q89n401j1985
7618a22280r7269J00719J24789M8987P9044q0596p0890N580l6633K8744m7148
7607f6953p1113m7545K4136l0448j10120L2418J24855K7952k4295l5472k3619
$$ plain form
7690 -87548 -6846 79272 74133 35893 49079 -69170 -148976 -130025 -112712 -108228 -93382 -56644
7678 -56644 -54293 -102897 -41550 -16828 -41196 -88467 -66321 -128873 -96031 -72550 -60269 -32414
7666 -32414 -11852 -16828 -60752 -112123 -131257 -61601 -6259 -24105 -108870 -198132 -178335 -180859
7654 -180859 -174717 -181717 -144557 -85022 -78306 -77250 -48029 20159 -14731 -73845 -136043 -168206
7642 -168206 -164397 -146758 -244355 -399193 -371189 -214958 -242310 -260750 -151579 -30588 -75548
7631 -75548 -128702 -142686 -150298 -155903 -139770 -101655 -55368 -87984 -150484 -105783 -104894 -110295 -122280
7618 -122280 -219549 -118830 5959 54946 133990 53394 -17496 -11916 -48549 -19805 -66953
7607 -66953 -138066 -185611 -161475 -191923 -302043 -269625 -144770 -116818 -141113 -176585 -200204
7596b00204K8744J78175O8211o3693j4399N8436l0783j53081k586Q6501Q71j0748
7584e4556k6542R5442L823o6425O4362P4926J9500m3852j63892q179R1906j2421
7572b5908r1506L36L7269J5922l6368N0980M5585l6697o9024M6932J16356p241
7560D6636J2147n1020R7269m9917q7071p3096n0781K1239M8854K4454M7626p1888
7548h5548l6030j9821q007k4242Q466O1382m9964O3224P2316m2781m4430m9175
7536a54610p5413J2961N753J02915n324l4303o0590j1355L3587L0652k025P8456
7524g9296l6515k0562O3584N9451P5295k8053j4417O4535l2576m3739r2409P142
7512g7560J39843R4273r5274j08182n4100o7148m678N1951L298j07608Q201P4860
$$ plain form
7596 -200204 -171460 6715 74926 11233 -3166 55270 24487 -128594 -131180 -44679 -43808 -54556
7584 -54556 -81098 14344 18167 -48258 16104 91030 110530 66678 -97214 -105393 -13487 -25908
7572 -25908 -117414 -117078 -79809 -63887 -100255 -49275 -3690 -40387 -109411 -62479 53877 46636
7560 46636 58783 7763 105032 55115 -31956 -105052 -155833 -134594 -85740 -61286 -13660 -85548
7548 -85548 -121578 -141399 -149406 -173648 -165182 -103800 -153764 -90540 -18224 -61005 -105435 -154610
7536 -154610 -230023 -217062 -211309 -108394 -113718 -148021 -208611 -219966 -186379 -155727 -157752 -79296
7524 -79296 -115811 -136373 -72789 -13338 61957 33904 19487 84022 51446 7707 -84702 -77560
7512 -77560 62283 156556 61282 -46900 -101000 -168148 -172826 -120875 -117577 -225185 -216984 -142124
7500a42124Q9395J2230l7968k8023N2555q6793N8617J27761j05172j1706J2661
7489e8567j7033N0188L6893n0523J6539K9409J0638r316J651K9573L7607q147
7477F8912k0414L6335q6926j6850j4563n0197k3664J0619L136L2128j5503m1446
7465a18433L408L9958Q7217J5520l471n7280o4676j6634J10125N2156l4761R376
7453B2505j2104j4212j4522k5971n0377l3380L7489J32709n8918l2122R4370m340
7441D1127j15086M9759n13n6526j19745L4998P8561P4501P43l2690j4638j3941
7429g3450l1583M8216N8830o0537L3799K8290j2705r3240K3697M4791P8634L5411
7417H0153j16815k1208J44886l6231j06753j7577j0028j9095l5338M9096p8306
$$ plain form
7500 -142124 -52729 -40499 -78467 -106490 -53935 -140728 -82111 45650 -59522 -71228 -58567
7489 -58567 -75600 -25412 11481 -39042 -22503 6906 17544 8228 9879 39452 77059 68912
7477 68912 48498 84833 -2093 -18943 -33506 -83703 -107367 -96748 -93612 -61484 -76987 -118433
7465 -118433 -115025 -75067 12150 27670 24199 -33081 -97757 -114391 -4266 47890 13129 22505
7453 22505 10401 -3811 -18333 -44304 -94681 -128061 -90572 42137 -16781 -48903 45467 41127
7441 41127 -73959 -24200 -24713 -81239 -200984 -165986 -87425 -12924 -12181 -44871 -59509 -73450
7429 -73450 -105033 -56817 2013 -58524 -24725 3565 -9140 -102380 -78683 -33892 44742 80153
7417 80153 -36662 -57870 87016 50785 -55968 -73545 -83573 -102668 -138006 -88910 -167216
7406a67216j3760R6490Q7427p0245L3606L478L812r0164K1791K7667r1064o3174
7394b21352P1708M6777O9919j3420N4777J6767q84K5038m9067N6897o1778j361
7382e979K0961l9230j02470J426Q7332P0753K876o5313o4064m1179P8182l1611
7370h8316o3058p3831M8436K5961o688L1080p6848k7599M0424N2149O5216L2796
7358d0278k0404L9119J16877J5104j6515L7837o7871q4866N6256j1128q4131L8279
7346b1721n9672l8796M416k4030n311m2714j1272J0568J12601L6641K1628N778
7334a1884q8411P0076K1567j6606m2501p897L318m0062J5605P8114o2101K751
7322g8031q123M2389J07796P4446q5205q7857K6949M4351l3852k1802l0433m6204
$$ plain form
7406 -167216 -180976 -84486 2941 -67304 -33698 -30220 -26408 -116572 -94781 -67114 -158178 -221352
7394 -221352 -149644 -102867 -32948 -46368 8409 25176 24292 49330 263 57160 -4618 -5979
7382 -5979 14982 -24248 -126718 -125292 -37960 32793 35669 -29644 -93708 -134887 -56705 -88316
7370 -88316 -151374 -225205 -176769 -150808 -157496 -126416 -203264 -230863 -190439 -138290 -73074 -40278
7358 -40278 -60682 -21563 95314 110418 93903 131740 63869 -20997 35259 24131 -60000 -21721
7346 -21721 -81393 -120189 -115773 -139803 -145114 -187828 -199100 -188532 -75931 -39290 -17662 -11884
7334 -11884 -100295 -30219 -8652 -25258 -67759 -75656 -72338 -112400 -96795 -18681 -80782 -78031
7322 -78031 -86154 -43765 64031 138477 53272 -34585 -7636 36715 2863 -18939 -49372 -95576
7310i5576q6339l38p4548P914J10969M1128q9709R912J05965R4969n2900m7986
7298g6539l0344M1616M1659K1954p640l0894j2862n6104O4243L1567M1484K9026
7286E7166K196r1867j00951l1763M7263O976n9718k3040J17580L6078l4122j5537
7274h9739M7806k9162p4930l1168J8171O8133P2679j3095n2163J2452n6864j12713
7262b40593j6849M6269J03051n855J2028K1572p3987O6278J59069p541j19252
7251e5810K7712p522n0602K3815n9868L8994N2686l2160R309O8187K2822o0246
7239b2683n5106q233P5286J27031n9621j35322m5115J09451O7879l9642j50239
7228a36314J4698K8596j1766n0280K0950J20075m2164O436J8834q4136q983J57004
$$ plain form
7310 -95576 -181915 -182253 -256801 -248887 -137918 -96790 -186499 -176587 -70622 24347 -28553 -76539
7298 -76539 -106883 -65267 -23608 -1654 -9294 -40188 -53050 -109154 -44911 -13344 28140 57166
7286 57166 59362 -32505 -133456 -165219 -117956 -110980 -170698 -193738 -76158 -40080 -74202 -89739
7274 -89739 -41933 -71095 -146025 -177193 -159022 -90889 -18210 -31305 -83468 -71016 -127880 -240593
7262 -240593 -257442 -211173 -108122 -113977 -101949 -80377 -154364 -88086 70983 63442 -55810
7251 -55810 -28098 -35620 -86222 -62407 -122275 -83281 -30595 -62755 -53446 14741 37563 -22683
7239 -22683 -77789 -86022 -10736 116295 56674 -78648 -123763 -14312 53567 13925 -136314
7228 -136314 -121616 -93020 -104786 -155066 -134116 -14041 -56205 -49769 -30935 -115071 -124054 32950
7216C2950N1350L5718m3737l1351j00083N1822M9236L858p5043n1445J17532M2384
7204H3191j04038r7232p8019k106n2689J1020J04015N8190R1476O694j5444P6798
7192H1856J3881L642r0345o9586n7131P477k858k3216J4079l3467M8508L8492
7180f8668N121Q256k5913K9151L3580m6015K0816J00826l0047m3570j6940q2939
7168a16342J7695O4686M9612j2724l7193r992Q4975J2123o3356n4357l0387k0924
7156a16184J0021k5312P6705K8563k7793m5213p8199N8902J17513n0965j9555
7145g1517k6508k0308P4062J6008L1319q9840N2596J04131j11744q9212J3339
7134a17674o7708r424N482L9150L8606o4892m7424P0776Q4905O8499J9234J7036
$$ plain form
7216 32950 84300 120018 76281 44930 -55153 -3331 45905 49763 -25280 -76725 40807 83191
7204 83191 -20847 -118079 -196098 -198204 -250893 -239873 -135858 -77668 13808 20502 5058 81856
7192 81856 95737 99379 9034 -60552 -117683 -110206 -113064 -136280 -122201 -155668 -107160 -68668
7180 -68668 -63547 -55291 -81204 -52053 -18473 -64488 -43672 57154 27107 -16463 -33403 -116342
7168 -116342 -98647 -33961 15651 2927 -34266 -44258 40717 52840 -10516 -64873 -95260 -116184
7156 -116184 -106163 -131475 -54770 -26207 -54000 -99213 -177412 -118510 -997 -51962 -71517
7145 -71517 -98025 -118333 -44271 -28263 3056 -86784 -34188 69943 -41801 -131013 -117674
7134 -117674 -185382 -194806 -189324 -150174 -111568 -176460 -223884 -153108 -68203 296 19530 36566
7122C6566r3262m1914k5252N8110n889N9621O7174K6o9914p9634m4019j1888J734
7109a48541K9393J6760n6865O3802J16358L1684N228o5174k637n7281o0839O1360
7097f6752R6747q115j9618o3763q4977N5964O1463j02353j8053Q820J6639M6236
7085g7762j24329M2825M3610J00508J02385L9706p5922j25801p0170k66N4779
7074i0437J7573J8297N2689N6654p2955n4138m106L3827q669n73j900Q395j8945
7061f4288n1758n6438Q9718L3961q779M0677O0386l6574n4977n2905N799N8598
7049c6580P0680r8476j5656M8057l0707J8216O8177J3500m5444Q2079J4325q3320
7037D851P80K7575J4876j00775o5186M354O3215J0210n5987j5371K1076J24231
$$ plain form
7122 36566 -56696 -98610 -123862 -65752 -71641 -12020 55154 55180 -14734 -94368 -138387 -150275 -148541
7109 -148541 -119148 -102388 -159253 -95451 20907 52591 57819 -7355 -9992 -67273 -128112 -66752
7097 -66752 29995 21880 2262 -61501 -146478 -90514 -29051 -131404 -149457 -140637 -123998 -77762
7085 -77762 -202091 -159266 -115656 -15148 87237 126943 51021 -74780 -144950 -145216 -90437
7074 -90437 -72864 -54567 -1878 54776 -18179 -72317 -76423 -42596 -51265 -51838 -53738 -45343 -64288
7061 -64288 -116046 -172484 -82766 -48805 -57584 -16907 43479 6905 -48072 -100977 -95178 -36580
7049 -36580 34100 -64376 -80032 -31975 -62682 -44466 23711 37211 -8233 73846 88171 4851
7037 4851 5631 33206 48082 -52693 -117879 -113525 -50310 -40100 -96087 -111458 -90382 33849
7025C3849o5824n1717K0437q9282p7000J05425J32689L9807j4368j52983l2347
7014a51314K2049M2734R4561K6422O538K5651M2990o8729m2065n6827R1071K2829
7002E5910l1440n1003o2439n32k9381P6792K0560k9058N8468J07133o668o998
6990A01344Q0255J6328J9445p1208j12458N594m2779j3644N6725j8557j616n9340
6978c9911k1959Q3271N2189m3833o5594O785j2160N8163O0192M8700L5455q2025
6966G9273r4733K2053n5793l8551K7991k799j4378R920Q990Q5579J2807J8297
6954E8656K1504m3108j01521r7028N6054J14058N1886J3179M0676j19023m2431
6943d7098K0147j5273q0103J9915M7524K6441L0487j09388N525O1401r8107o7658
$$ plain form
7025 33849 -31975 -83692 -63255 -152537 -229537 -124112 8577 48384 34016 -118967 -151314
7014 -151314 -129265 -86531 8030 34452 40990 66641 109631 40902 -1163 -57990 33081 55910
7002 55910 24470 -26533 -88972 -89504 -118885 -42093 -21533 -50591 7877 115010 108342 101344
6990 101344 181599 197927 217372 146164 33706 39300 -3479 -17123 39602 21045 19429 -39911
6978 -39911 -61870 21401 73590 29757 -35837 -29052 -41212 16951 77143 125843 161298 79273
6966 79273 -15460 6593 -49200 -87751 -59760 -62559 -76937 -67017 -58027 27552 40359 58656
6954 58656 80160 37052 -64469 -161497 -105443 8615 60501 73680 114356 -4667 -47098
6943 -47098 -26951 -42224 -122327 -102412 -54888 -28447 2040 -107348 -101823 -40422 -138529 -206187
6931b06187M6511k4311O4806p8668M7087O3585O3036L255l0459L3211J35924o0613
6919E7177o5377N8437Q520k3964K2446K0637j7655R1779K9043m1527q1238l4905
6907B3373N1868k8538r3225k187N6264J1289o5873P030N2930L890K2071L6855
6895G5747J9466j4480o8220J9268k286p2035k9012n0420J0347O5134J07352K6464
6883H7325j9989M6372j6742o7184m4223K6360J5511M1994o2883K9983O2661P5089
6871A74274n9532n5149k7816J1781n357K2822p0446o2312J763J0602q2346k5856
6859a67572Q0R446O5218J3737K3211l502L3716R6276l8335m8085L062J8220l2989
6846b7517j44477k2653P5779K327K1066p1450J04289J78775q6261q0304L9949
$$ plain form
6931 -206187 -159676 -183987 -119181 -197849 -150762 -87177 -24141 -20886 -51345 -18134 117790 57177
6919 57177 -8200 50237 58757 34793 57239 77876 60221 152000 181043 139516 58278 23373
6907 23373 75241 46703 -46522 -48709 7555 18844 -47029 -39999 12931 16821 38892 75747
6895 75747 95213 80733 12513 31781 29495 -42540 -71552 -121972 -111625 -46491 60861 87325
6883 87325 67336 113708 96966 29782 -14441 11919 27430 69424 6541 36524 99185 174274
6871 174274 114742 59593 31777 43558 38201 61023 -9423 -71735 -69972 -59370 -141716 -167572
6859 -167572 -167492 -158046 -92828 -79091 -55880 -59382 -25666 70610 32275 -15810 -12748 5472 -27517
6846 -27517 -171994 -194647 -118868 -116541 -95475 -166925 -62636 116139 29878 -50426 -10477
6835a0477R408j7095R2811J371j52491p2766j3239p7922P0727N4600K6196l3138
6823a22015N530k0738o8523N0751J06523J37711q9571l9487m2455j9675J4513
6812h7436R6380R0059o0075n1664o8997p401R279O340j7697J4339K169L3109M7308
6799E713k5279M8817p3847L9013L7906k5719l8095m3755n7075l5689m1775O296
6787b03489k6702N7067J8546L9488O5349M8284q0229j3669J20374R0124k3653
6776I1490l5904j8747o8847J8216M831M2734j834K1840M5184m3866n2494N4901
6764E7504R57m0612j04416m9061o6278Q7585M2303j1692M8308J01838N2136n4628
6752F3944p0273L285n5528K3072J33290k4369o6608k0953l5933m495k0280L8285
$$ plain form
6835 -10477 -1069 -18164 74647 76018 -76473 -149239 -162478 -240400 -169673 -115073 -88877 -122015
6823 -122015 -116485 -137223 -205746 -154995 -48472 89239 -332 -39819 -82274 -101949 -87436
6812 -87436 8944 99003 38928 -12736 -81733 -89134 -79855 -73515 -91212 -76873 -74704 -41595 5713
6799 5713 -19566 29251 -44596 -5583 32323 6604 -31491 -75246 -132321 -168010 -209785 -203489
6787 -203489 -230191 -173124 -154578 -115090 -49741 -1457 -81686 -95355 25019 115143 91490
6776 91490 55586 36839 -32008 -13792 -8961 33773 31939 53779 98963 55097 2603 57504
6764 57504 58461 17849 -86567 -135628 -201906 -114321 -72018 -83710 -35402 66436 118572 63944
6752 63944 -6329 -3044 -58572 -35500 97790 73421 6813 -14140 -50073 -54568 -74848 -36563
6740c6563l8930q8399J16259J42604l5088j2245j23478L8009k6601j6702O0545
6729b0589j9849l8208p8185J2262P7337M8976K7408L0644J3852k714r5672m5694
6717i0432J2582M7715l9833j101P2764Q0786J0695o5439K5284N7715q3111m6205
6705a8580m472J12827k3683n480l0898j35094J7769M1246L6367N0325o4675o9930
6693i4278J03074N2348L1458l6068j8547q163O9547l6099j67775o5153J8669R4202
6681e6785J23556J3734J1907j18396p3368k078L3452K9377j304l480r812j0135
6669f3332M1658J6505k4007O1022L7265j3857j367M0974k261j7424K850R188M775
6656I1989O2438k3438o5515j2850J9245p008l578j15297k8209q8483n4118K1396
$$ plain form
6740 -36563 -75493 -163892 -47633 94971 59883 47638 -75840 -37831 -64432 -81134 -20589
6729 -20589 -40438 -78646 -156831 -144569 -67232 -18256 9152 39796 53648 50934 -44738 -90432
6717 -90432 -77850 -30135 -69968 -71069 1695 82481 93176 27737 53021 110736 27625 -18580
6705 -18580 -23052 89775 66092 60612 29714 -105380 -87611 -46365 -9998 40327 -24348 -94278
6693 -94278 8796 61144 92602 56534 37987 29824 99371 63272 -104503 -169656 -150987 -56785
6681 -56785 66771 80505 92412 -25984 -99352 -101430 -67978 -38601 -39905 -43385 -53197 -63332
6669 -63332 -21674 -5169 -29176 31846 69111 55254 53887 94861 92600 75176 78026 87214 91989
6656 91989 154427 130989 65474 52624 71869 64861 61283 -54014 -82223 -170706 -224824 -203428
6644b03428N9789n4997l3771M1056P3602L6513R4305J0160p1703M927j921o2974
6632a08442Q0122Q5744m0242j34921q8931J8001J26151L9850k9432m4956N8477
6621c8579J08122P908m9791l1488r6311q1053M0016R1365R0342N1681L7230K3140
6609A52582l1750k2342o091P1616k4279p9133o2010K5664P613k2321K8675O6840
6597A05064o1724M368L5821K5503J677j51186m2448m4752L0733j0621k5422r652
6585a42639q589J35537L0217J8320J4744k9740K2306j2832k1517n6782P1840j7829
6573C036k2121P3702M9502K1766n9237J8858j9607J1381p858k4428L094M9518
6561I7606k1638J4487O8601n2260j17884k1185k1829P0218R0658j11912r7443
$$ plain form
6644 -203428 -143639 -198636 -232407 -191351 -117749 -81236 13069 23229 -48474 -43547 -45468 -108442
6632 -108442 -28320 57424 17182 -117739 -206670 -188669 -62518 -22668 -52100 -97056 -38579
6621 -38579 69543 77451 27660 -3828 -100139 -181192 -141176 -49811 40531 92212 129442 152582
6609 152582 120832 98490 92399 164015 139736 60603 -1407 24257 31870 9549 38224 105064
6597 105064 43340 47708 83529 109032 110709 -40477 -82925 -127677 -96944 -107565 -132987 -142639
6585 -142639 -151228 -15691 14526 32846 47590 17850 40156 27324 5807 -50975 20865 3036
6573 3036 -19085 54617 104119 125885 66648 85506 65899 77280 69422 44994 48088 97606
6561 97606 75968 90455 159056 106796 -11088 -32273 -54102 16116 106774 -5138 -102581
6550a02581J31863Q4988P9399o8961r1929m9445Q0636j8915M8281O288Q725K306
6538A10655L65r6377l4028R7246J0398j9528j33892r0626L8091J5524o489q6410
6526a95071J12906M1118r836L221j0093R5266k3461j8633M4762P262k979m2905
6514A557K7869o3014L0646j9452L08l3644o2477N9543J0675o9526O0435L0879
6502b6201m4000k6721M3612N0228K0045Q7888n8617q0164m0433n9018m0967K0850
6490a53498O1095P1145o0565O1732M8128l3652L3299M5091j5620J4745m7849j0900
6478A3151N7494l0088l7277K2664P565m3518K0502k8364l4765k0605n7564M4534
6466h6271R9853L386j7912l2134o4803m8607P2217k8596J0548L5200L9051K7601
$$ plain form
6550 -102581 29282 114270 193669 124708 32779 -16666 63970 45055 93336 99624 108349 110655
6538 110655 111020 14643 -19385 77861 88259 68731 -65161 -155787 -117696 -102172 -108661 -195071
6526 -195071 -82165 -41047 -50883 -47662 -57755 37511 14050 -4583 40179 47441 44462 1557
6514 1557 29426 -33588 -2942 -22394 -22086 -55730 -118207 -58664 -47989 -117515 -57080 -26201
6502 -26201 -70201 -96922 -53310 -3082 16963 104851 46234 -33930 -74363 -133381 -174348 -153498
6490 -153498 -92403 -21258 -81823 -20091 28037 -5615 27684 72775 57155 71900 24051 13151
6478 13151 70645 40557 3280 25944 33509 -10009 10493 -17871 -52636 -73241 -130805 -86271
6466 -86271 13582 16968 -944 -33078 -97881 -146488 -74271 -102867 -92319 -57119 -18068 9533
6454I533j1344k0140l7806L3199K7497P9700k6151J8745Q017L6185j823r1987
6442B3625r9760P5843L2415k5825L3175q5189J2578L5860p8372J2991O905O7113
6430A1359J32528k4306O969k518n0309L2229n017K6292Q282L1597n6632p7680
6418C2794q599M8607P8530M4568L8326m5498l6533q7611j30150j7709J3599O2400
6406g276O4123K1415k1773q6718j0122o1324o4835M2084J73900Q1567J4340m455
6394A40926k547k3785j6903K768J2928o67j57747q3460J33008J17885k369j16389
6382C648j02366J850P7449l594L1385k5439n3863o319J01288O2179K1517m4066
6370F3669o9303O056P3186J5858M908j4185L4803J3472l3239l8489l0326M4416
$$ plain form
6454 9533 -1811 -21951 -59757 -26558 939 80639 54488 73233 81250 117435 115612 23625
6442 23625 -76135 -292 32123 6298 39473 -45716 -33138 2722 -75650 -62659 -55754 11359
6430 11359 143887 119581 126550 124032 73723 105952 100935 127227 135509 167106 110474 32794
6418 32794 24195 72802 151332 195900 234226 188728 152195 64584 -65566 -83275 -69676 -7276
6406 -7276 56847 78262 56489 -30229 -40351 -101675 -166510 -124426 49474 131041 145381 140926
6394 140926 138379 114594 97691 100459 113387 112720 -45027 -128487 4521 122406 120037 3648
6382 3648 -98718 -96868 -19419 -23013 8372 -17067 -70930 -77249 24039 86218 107735 63669
6370 63669 -5634 422 73608 89466 94374 80189 114992 128464 95225 56736 26410 70826
6358G0826q438r3656n9634M6158R8815j7517n9809M9107R6171O5527j3101n0536
6346A23913K153o0021o293j3998p024J10969l31j42l9932k8950J1341k2516M3428
6333A12597P981L6063o3234j11819l2064P0588M1017m4211J21472l9184m4638
6322E4568M8610j0074l2556O877o7334K4570j3971L7408m9273j1192j472n1289
6310f5128L8813R8823N1970Q236p3002j14643l5410N1574J1155L6916K9979O3862
6298A03145j6933J04357m4120l2989r3824P7432j6945m6552j2767K2080M2277
6287H5161o5521n7722O1360Q1074j8610l3476J935L3494k1684n7703q2904L0240
6275d4356O8358L8334m8656K636N325K0718Q3434M86p1698r6801q2239O0909L5978
$$ plain form
6358 70826 62388 -31268 -90902 -44744 54071 36554 -23255 25852 122023 187550 174449 123913
6346 123913 126066 66045 59752 45754 38730 149699 149368 149226 109294 80344 91685 69169 112597
6333 112597 120578 156641 93407 -18412 -50476 20112 61129 16918 138390 99206 54568
6322 54568 103178 93104 60548 67425 91 24661 10690 48098 -1175 -12367 -13839 -65128
6310 -65128 -26315 72508 124478 132714 59712 -54931 -90341 -38767 -27612 9304 39283 103145
6298 103145 86212 190569 146449 113460 19636 97068 80123 33571 20804 42884 85161
6287 85161 19640 -38082 23278 104352 85742 52266 54201 87695 66011 8308 -74596 -44356
6275 -44356 24002 62336 13680 16316 21641 42359 125793 126279 54581 -42220 -124459 -63550 -27572
6262b7572L8971j0485k6130M4422J2180J140L0396M2776j11049O4663J27358l7038
6250A49632j07773p9346M598J19757O2664p0868q7761k9857L1813J09857P4178
6239A76894K5194k4747q5522n6415N0522N956o9203K0504J1293L9072Q3766k3949
6227A53365p2791K8728k1135R4595n2732j51267l3360K2264Q4746q6219j58994
6216a92800o5001J3591K8652L1675R0321K5084j0700M8224j1300M9174Q7540P6825
6204A71285p3589j03974p2054M2658O8913O2557o6867m664J1727L1430K0097m1561
6192D5958K1068M6053K7567j0389o6334O2866j4642m3584k2841Q90o2097j4156
6180b9641o2067j2122j4330p3991M4411m9712Q3889J19392k1728K8291m4109J4082
$$ plain form
6262 -27572 11399 914 -25216 19206 31386 32526 62922 105698 -5351 59312 186670 149632
6250 149632 41859 -37487 -32889 86868 149532 78664 -9097 -38954 -7141 102716 176894
6239 176894 202088 177341 91819 35404 85926 91882 22679 43183 54476 93548 177314 153365
6227 153365 80574 109302 88167 182762 130030 -21237 -54597 -32333 52413 -33806 -192800
6216 -192800 -257801 -244210 -215558 -183883 -93562 -68478 -79178 -30954 -42254 6920 94460 171285
6204 171285 97696 -6278 -78332 -35674 33239 95796 28929 24265 35992 67422 87519 45958
6192 45958 67026 113079 140646 130257 63923 126789 112147 68563 45722 46612 -15485 -29641
6180 -29641 -91708 -103830 -118160 -192151 -147740 -197452 -113563 5829 -15899 12392 -31717 -17635
6168a7635J15653q3147p1925K6275J01490L5928r6168Q9151J1521r6354J3465
6157B8254M2688j0338K4069J0309n2787L1963k5663m2759M7419l108j26615Q87
6145g5681K7536O363L8202k1754L361N7363l6949j037o0967l3119K6125J0663
6133e9894K3966l2368K2965N9096J7810K6829N327L9162n987m4326l4587r90M2592
6120E9595q099l4971J2320j532m8964O1500O7335o5670l0292J04665M142p5314
6108D4715p0172l0469L2568p512K1224O5552O6735j27146r6937r6535J8016L5912
6096a44049l0904O6778K2868n1849j6351j4753q975O8677N6701l9973J915P2070
6084a7845N7687N4229J3418K9662J1366j63870m2125J4041p2061k4923M6057L6732
$$ plain form
6168 -17635 98018 14871 -57054 -30779 70711 106639 10471 99622 111143 14789 28254
6157 28254 70942 60604 84673 94982 42195 74158 48495 5736 53155 50047 -76568 -75681
6145 -75681 -48145 -41782 -3580 -25334 -21973 35390 -1559 -2596 -63563 -96682 -70557 -59894
6133 -59894 -35928 -68296 -45331 13765 31575 58404 63731 102893 96906 52580 17993 17003 59595
6120 59595 51496 16525 28845 27313 -21651 39849 107184 41514 11222 115887 120029 44715
6108 44715 -25457 -55926 -23358 -30870 -9646 55906 122641 -4505 -101442 -197977 -179961 -144049
6096 -144049 -174953 -108175 -85307 -137156 -153507 -168260 -177235 -108558 -51857 -91830 -89915 -17845
6084 -17845 39842 94071 107489 137151 148517 -15353 -57478 -43437 -115498 -140421 -94364 -57632
6072e7632k6295P1212J67184J3209m3134q6152l1713L4509O2346R6037n3830j14764
6060C0977l6696L7968J1417j7586K0578j1967n9235o2732L043l1613N2105R1939
6048B8198L9820j35283O1840Q8255R3608K677K7063k6078l8362N834J6089l5439
6036A28222Q75q2511R846L5741k9375j15602l1189L4647N8124O89m4594M2328
6024G201O7378l5932k8314l1899L0427K9132q5407j4128J14061L2131o1539j06986
6012h3875j639Q7557O3807j1413J6492N1416m0510J0023l2506m0951K8374J6568
6000F3343n6191l7511J9820N2010N7102J549O5931L3682k6180p7717l2054j8708
5988D5076l2664j3954J7641l0993p6288j7377N9292M4222L2760J5672o5713l7993
$$ plain form
6072 -57632 -83927 -12715 154469 167678 124544 38392 6679 41188 103534 199571 145741 30977
6060 30977 -5719 32249 43666 26080 46658 34691 -24544 -87276 -84233 -115846 -63741 28198
6048 28198 68018 -67265 -5425 82830 176438 179115 206178 180100 141738 147572 163661 128222
6036 128222 129097 46586 56432 92173 62798 -52804 -83993 -49346 8778 9467 -35127 7201
6024 7201 74579 38647 10333 -21566 8861 37993 -47414 -61542 52519 84650 23111 -83875
6012 -83875 -85514 2043 65850 54437 70929 122345 81835 91858 59352 18401 46775 63343
6000 63343 7152 -30359 -10539 41471 98573 100122 166053 199735 173555 95838 63784 45076
5988 45076 12412 -1542 16099 -14894 -91182 -108559 -49267 -5045 27715 43387 -22326 -60319
5976f0319L2893n7156J6128O8228O3936N6101k6425n5013J1819p3204k2912K5269
5964b0655O024N7543l7352k8114J4593K1862J11702M075j16235j2766j071p7986
5952g8380M6818m303n6033j7487Q3675O0430P979q3474J2430K2425N2971m4888
5940B163l4960J5767L5149L4158L3574k7867m4897o415N9456j7968k7349j6177
5928D634O8971O7772R315p1847M243K8110O3971k5545k3699J2981k6569l9333
5916G3004K4394K1963L380r0610R5523M198r5274p4133n0217J03093L9099n7477
5904c057P0712L1036m2908l0261r346Q504J3676o548K7900l9533P258L438k4351
5891F520k9214k9736O8330J00167O2112J3373j26831j66938n4544K9391l0652
$$ plain form
5976 -60319 -27426 -84582 -68454 -226 63710 119811 93386 38373 50192 -23012 -45924 -20655
5964 -20655 -14631 42912 5560 -22554 -7961 13901 125603 129678 13443 677 -394 -78380
5952 -78380 -31562 -35865 -91898 -109385 -25710 34720 42699 -40775 -28345 -5920 47051 2163
5940 2163 -32797 -17030 18119 52277 85851 57984 13087 6672 66128 48160 20811 4634
5928 4634 73605 141377 150692 78845 83088 111198 175169 149624 125925 138906 112337 73004
5916 73004 97398 119361 122741 32131 127654 131852 36578 -37555 -87772 15321 54420 -3057
5904 -3057 67655 98691 55783 25522 16176 24680 38356 31808 59708 20175 27433 30871 6520
5891 6520 -22694 -52430 15900 116067 178179 191552 64721 -102217 -156761 -127370 -158022
5880a58022Q0710R6259K741L0381J7129L9179k0850o8786n4865K0577J09969J19435
5868B13857m8231o2413n9371N5218N3725o6221j26594k2415J1972K7799P7942
5857E5268p9522r698J30662J3792j16441q1664m1352k6239k2908J05717P3123
5846G38J6061K7435O691O927l0185J8840O2896Q2538J0244p7077j09376K9058
5834D4790O7899o4175Q5928Q8956m9527r5283k4033P5415q4966j34833p0814J03096
5822e7547R0684m0813n9230N0448J1490Q8845K8621j00744r2311p274L3777M9699
5810d355M7007N3261O187j42301o8850m5949N4796L9109M5877j4891K3724P1007
5798F4622L0742j0833m4643l7280K5076K2933l0661J0970p5155p2507J19935J3752
$$ plain form
5880 -158022 -77312 18947 21688 52069 69198 108377 87527 18741 -36124 -15547 94422 213857
5868 213857 165626 103213 43842 99060 152785 86564 -40030 -62445 -50473 -22674 55268
5857 55268 -24254 -33952 96710 110502 -5939 -87603 -128955 -155194 -178102 -72385 738
5846 738 16799 44234 50925 57852 27667 46507 109403 191941 202185 125108 15732 44790
5834 44790 112689 48514 134442 223398 173871 78588 54555 129970 45004 -89829 -160643 -57547
5822 -57547 33137 -7676 -66906 -16458 -4968 83877 112498 11754 -80557 -87831 -54054 -4355
5810 -4355 42652 95913 102100 -40201 -109051 -155000 -100204 -61095 -15218 -30109 -6385 64622
5798 64622 95364 84531 39888 2608 27684 50617 19956 30926 -44229 -116736 3199 16951
5786A6951J04480J3237j60572L072N9535O5098K7379k2333q1714l1571N6736M539
5774E4837N3463P7925k5328p6094K3885p8536L8601L7015N828p8998J3608P529
5762E3735L1898N2040k5415N8177J0013n4338J7872J8620j42306j5893J02052
5751A06455J02874m4484j18188m4349L2972Q9695N3472K7344O422o2404j8709
5740A31100l1484o6968m6175k1980K7338M1045O7088J6439L2855j4125m1867o2024
5728C1242J6809L6221P3674n787j12146k9663m6157r6790o7840P2868J80802L403
5716E6636l1879M6855L254j889L3309K0130m6733P932N1189J05509L8965M509
5704B87787p663j74540j18710O682Q0677L6686n0387o2384P7827K2941M234K0194
$$ plain form
5786 16951 121431 134668 -25904 -22832 36703 101801 129180 106847 25133 -6438 50298 54837
5774 54837 108300 186225 160897 84803 108688 30152 68753 105768 111596 32598 46206 53735
5762 53735 85633 137673 112258 170435 180448 126110 143982 162602 20296 4403 106455
5751 106455 209329 164845 46657 2308 35280 124975 178447 205791 212213 149809 131100
5740 131100 99616 32648 -13527 -35507 -8169 32876 99964 116403 149258 135133 93266 31242
5728 31242 48051 84272 157946 152159 40013 10350 -35807 -132597 -200437 -127569 53233 56636
5716 56636 24757 71612 74866 72977 106286 126416 79683 87615 138804 244313 283278 287787
5704 287787 280124 105584 -13126 -6444 74233 110919 60532 -1852 75975 98916 103150 123344
5692A23344m0914j11599k2860J2054m5783l1334N8434K6784j3288P3741J36146
5681A64725l8663k4242k3642O8421R401o0033q9786l4778O5953N0461r046j2041
5669F6730r0645m9507J3566N1503j0546M6626K3917k0863J3757k9341j7068j1523
5657a3394O1958K7611o7754M2820j5737J4333l3286n8844k5114K3946O6991J0116
5645C3646o0675l7393M8079O0131k8430O7593O1627Q229M2267P3263j9846n1933
5633A96558l7029r9160R4905R6126L0963n5196l9309L0078p3443k976k9322n1710
5621F0485o0864l9684j0096N8160l0951L2035J1622L5187K9506p404m4599J04077
5609A37474M0237o801m9186j07060o6339l9818M5335J2608n5541O2764L9822K2777
$$ plain form
5692 123344 82430 -29169 -52029 -39975 -85758 -117092 -58658 -31874 -45162 28579 164725
5681 164725 126062 101820 78178 146599 156000 95967 6181 -28597 37356 87817 78771 66730
5669 66730 -23915 -73422 -59856 -8353 -18899 27727 51644 30781 44538 15197 -1871 -13394
5657 -13394 48564 76175 8421 51241 35504 49837 16551 -42293 -67407 -43461 23530 33646
5645 33646 -27029 -64422 -16343 43788 15358 82951 144578 152807 195074 268337 248491 196558
5633 196558 159529 60369 155274 251400 282363 227167 187858 217936 144493 141517 112195 60485
5621 60485 -379 -40063 -50159 8001 -22950 9085 20707 55894 85400 77996 33397 137474
5609 137474 177711 170910 121724 14664 -51675 -91493 -46158 -33550 -89091 -26327 13495 36272
5597C6272R179j22483l1928M7698r098J34524N2500n0699K5995o0375n1422J8542
5585a295K8301O4485L7813O0464k7635n8357j7187q413J4084o9905o3044L9499
5573a190m4111M1294R253J53239L9319q0214R2J04609l3380n0082l8453k1220
5561G9156N1935q585M4401n0271j20057k1159j5652r5419K7191J56406M1585p532
5549H1999k1535n3141k7903N3114j2776O465P1140m7694l0341N9454N6488p144
5537A28126j5102o9750p4875M1865J43682J15523j4181n0076q1442K2537J6738
5526A63045n1539J4428J2099q776O2826p695j01940j14676m3174J5142O4851M8356
5514E2947o528P4632q4800Q335M3839L5651L1825m4082j91795L7994J02887J7383
$$ plain form
5597 36272 45451 -77032 -108960 -61262 -70360 64164 116664 65965 91960 31585 -19837 -1295
5585 -1295 27006 91491 129304 189768 162133 103776 86589 78176 92260 22355 -40689 -1190
5573 -1190 -45301 -4007 5246 158485 197804 117590 117682 222291 188911 138829 100376 79156
5561 79156 131091 122506 166907 116636 -3421 -24580 -40232 -135651 -108460 47946 89531 81999
5549 81999 60464 7323 -20580 32534 19758 26223 97363 49669 19328 78782 135270 128126
5537 128126 113024 43274 -31601 10264 153946 269469 255288 205212 123770 146307 163045
5526 163045 111506 125934 138033 129257 192083 184388 82448 -32228 -75402 -60260 4591 52947
5514 52947 46419 121051 36251 44586 88425 124076 155901 111819 -79976 -41982 60905 78288
5502G8288K7392P1327m9812k0384n1765O8816O5513m6329o1240k0619L5896j4958
5490H2125l7796l9225n9974Q536L429Q6343Q0338p5135o7185m9258L0668M0598
5478C464J02330Q2950N364j35988l9366L9622M6896N966r252M9521j0559k8289
5466A12659k8597M044l7156n6531R187R7513j4957q2143j8334k8454o972K7656
5454b2085L7228j6768l2323j7681K4279L5293Q8020J9523k25r6637k5107K0556
5442A4073M263l1050p219L0057N5783n3224n3892Q8233J0509L9591j8608n8490
5430B0026J929k1415R0387Q6444r1101k8593m3517o6486j977L1077J02218J6919
5418I5911o064n9209J0963l8525k3644k3559P9169N4813J771L2238q113m2698
$$ plain form
5502 78288 105680 177007 127195 106811 55046 123862 189375 143046 81806 61187 97083 82125
5490 82125 44329 5104 -54870 -46334 -42905 43438 123776 48641 -18544 -67802 -37134 3464
5478 3464 105794 188744 194108 58120 18754 58376 105272 111238 101986 151507 140948 112659
5466 112659 84062 88106 50950 -5581 3606 101119 86162 4019 -14315 -42769 -49741 -22085
5454 -22085 15143 -1625 -33948 -51629 -27350 7943 95963 115486 115261 18624 -6483 14073
5442 14073 18336 -12714 -19933 10124 65907 12683 -41209 47024 57533 97124 78516 20026
5430 20026 21955 540 90927 177371 86270 57677 14160 -52326 -54303 -23226 78992 95911
5418 95911 89847 30638 41601 3076 -20568 -44127 35042 89855 91626 123864 115751 73053
$$ [...]
##END NTUPLES=NMR SPECTRUM
##END=
