##TITLE=Analysis number 310841
Compound Code sb 00799
Project Code adrs
Chemist Name stores
##JCAMPDX= 6.0         $$ Bruker NMR JCAMP-DX V2.0
##DATA TYPE= NMR SPECTRUM
##DATA CLASS= NTUPLES
##ORIGIN= Bruker BioSpin GmbH
##OWNER= NMR
$$ XWIN-NMR		Version 3.5
$$ Thu Jun 23 13:27:16 2005 GMT Daylight Time (UT+1h)  MAYBRIDGE\NMR@NMR_250MHZ
##.OBSERVE FREQUENCY= 250.131544655141
##.OBSERVE NUCLEUS= ^1H
##.ACQUISITION MODE= SIMULTANEOUS (DQD)
##.ACQUISITION SCHEME= undefined
##.AVERAGES= 16
##.DIGITISER RES= 18
##SPECTROMETER/DATA SYSTEM= dpx250
##.PULSE SEQUENCE= zg30
##.SOLVENT NAME= DMSO
##.SHIFT REFERENCE= (INTERNAL, DMSO, 0, 16.522)
##AUDIT TRAIL= $$ (NUMBER, WHEN, WHO, WHERE, WHAT)
$$ ##TITLE= Audit trail, XWIN-NMR		Version 3.5
$$ ##JCAMPDX= 5.01
$$ ##ORIGIN= Bruker BioSpin GmbH
$$ ##OWNER= NMR
$$ C:\u/data/dgb/nmr/ADRS/4700/pdata/1/auditp.txt
$$ ##AUDIT TRAIL=  $$ (NUMBER, WHEN, WHO, WHERE, WHAT)
(   1,<2005-06-23 13:26:57.14 +100>,<MAYBRIDGE\NMR>,<NMR_250MHZ>,
      <created by zg, POWCHK disabled, PULCHK disabled
       configuration hash MD5:
       62 19 C7 07 E1 42 D1 B7 37 6C 3D D0 77 39 F9 E6
       data hash MD5: 64K
       58 4D 07 68 81 28 25 65 8F CD CE A6 B4 F1 23 22>)
(   2,<2005-06-23 13:27:08.66 +100>,<MAYBRIDGE\NMR>,<NMR_250MHZ>,
      <Start of raw data processing
       ef LB = 0.3 FT_mod = 6 PKNL = 1 SI = 32K 
       data hash MD5: 32K
       D6 B7 9F CE DF 25 83 DA EE 58 98 21 F2 27 01 3A>)
(   3,<2005-06-23 13:27:10.41 +100>,<MAYBRIDGE\NMR>,<NMR_250MHZ>,
      <apk 
       data hash MD5: 32K
       68 07 80 AB 52 EB 4B 44 64 AB DA BE EA 84 4C F5>)
(   4,<2005-06-23 13:27:11.10 +100>,<MAYBRIDGE\NMR>,<NMR_250MHZ>,
      <abs ABSG = 5 
       data hash MD5: 32K
       8B EC 1C 05 FB 59 40 2B 97 00 4A 5A 86 22 F9 D2>)
$$ ##END=
$$ 
$$ hash MD5
$$ EC 08 92 EB 6C 9C F9 D1 7E 23 1D EB CC 50 74 53
##$RELAX= 
##$RELAX= 
##$RELAX= 
##$RELAX= 
##$RELAX= 
##$RELAX= 
##$RELAX= 
$$ Bruker specific parameters
$$ --------------------------
##$DU= <C:\u>
##$EXPNO= 4700
##$NAME= <ADRS>
##$PROCNO= 1
##$TYPE= <nmr>
##$USER= <dgb>
##$AMP= (0..31)
100 100 100 100 100 100 100 100 100 100 100 100 100 100 100 100 100 100 
100 100 100 100 100 100 100 100 100 100 100 100 100 100 
##$AQSEQ= 0
##$AQ_mod= 3
##$AUNM= <au_zg>
##$AUTOPOS= <23 >
##$BF1= 250.13
##$BF2= 250.13
##$BF3= 250.13
##$BF4= 250.13
##$BF5= 500.13
##$BF6= 500.13
##$BF7= 500.13
##$BF8= 500.13
##$BYTORDA= 1
##$CFDGTYP= 0
##$CFRGTYP= 5
##$CHEMSTR= <none>
##$CNST= (0..31)
1 1 145 1 1 1 1 1 1 1 1 1 1 1 1 1 1 1 1 1 1 1 1 1 1 1 1 1 1 1 1 1 
##$CPDPRG= <>
##$CPDPRG1= <>
##$CPDPRG2= <>
##$CPDPRG3= <>
##$CPDPRG4= <mlev>
##$CPDPRG5= <mlev>
##$CPDPRG6= <mlev>
##$CPDPRG7= <mlev>
##$CPDPRG8= <mlev>
##$CPDPRGB= <>
##$CPDPRGT= <>
##$D= (0..31)
0 1 0 0 0 0 0 0 0 0.06 0 0 0 0 0 0 0.0002 0 0 0 0 0 0 0 0 0 0 0 0 0 0 
0 
##$DATE= 1119529616
##$DBL= (0..7)
120 120 120 120 120 120 120 120 
##$DBP= (0..7)
150 150 150 150 150 150 150 150 
##$DBP07= 0
##$DBPNAM0= <>
##$DBPNAM1= <>
##$DBPNAM2= <>
##$DBPNAM3= <>
$$ [...]
##$SUBNAM7= <"">
##$SUBNAM8= <"">
##$SUBNAM9= <"">
##$SW= 20.6930455092707
##$SWIBOX= (0..15)
0 0 3 0 0 0 0 0 0 0 0 0 0 0 0 0 
##$SW_h= 5175.983436853
##$TD= 65536
##$TD0= 1
##$TE= 295.16
##$TE2= 300
##$TE3= 300
##$TEG= 300
##$TL= (0..7)
0 120 120 120 120 120 120 120 
##$TP= (0..7)
150 150 150 150 150 150 150 150 
##$TP07= 0
##$TPNAME0= <>
##$TPNAME1= <>
##$TPNAME2= <>
##$TPNAME3= <>
##$TPNAME4= <>
##$TPNAME5= <>
##$TPNAME6= <>
##$TPNAME7= <>
##$TPOAL= (0..7)
0.5 0.5 0.5 0.5 0.5 0.5 0.5 0.5 
##$TPOFFS= (0..7)
0 0 0 0 0 0 0 0 
##$TUNHIN= 0
##$TUNHOUT= 0
##$TUNXOUT= 0
##$USERA1= <user>
##$USERA2= <user>
##$USERA3= <user>
##$USERA4= <user>
##$USERA5= <user>
##$V9= 5
##$VALIST= <valist>
##$VCLIST= <CCCCCCCCCCCCCCC>
##$VD= 0
##$VDLIST= <DDDDDDDDDDDDDDD>
##$VPLIST= <PPPPPPPPPPPPPPP>
##$VTLIST= <TTTTTTTTTTTTTTT>
##$WBST= 1024
##$WBSW= 4
##$XGAIN= (0..3)
0 0 0 0 
##$XL= 0
##$YL= 0
##$YMAX_a= 239730
##$YMIN_a= -320476
##$ZGOPTNS= <>
##$ZL1= 120
##$ZL2= 120
##$ZL3= 120
##$ZL4= 120
##$ABSF1= 16.522
##$ABSF2= -4.171173
##$ABSG= 5
##$ABSL= 3
##$ALPHA= 0
##$AQORDER= 0
##$ASSFAC= 0
##$ASSFACI= 0
##$ASSFACX= 0
##$ASSWID= 0
##$AUNMP= <proc_1d>
##$AZFE= 0.1
##$AZFW= 0.1
##$BCFW= 0
##$BC_mod= 0
##$BYTORDP= 0
##$COROFFS= 0
##$CY= 12.5
##$DATMOD= 1
##$DC= 0
##$DFILT= <>
##$DTYPP= 0
##$F1P= 14.0000005364418
##$F2P= -0.99999901652339
##$FCOR= 0.5
##$FTSIZE= 32768
##$FT_mod= 6
##$GAMMA= 0
##$GB= 0
##$INTBC= 1
##$INTSCL= 1
##$ISEN= 128
##$LB= 0.3
##$LEV0= 0
##$LPBIN= 0
##$MAXI= 10000
##$MC2= 0
##$MEAN= 0
##$ME_mod= 0
##$MI= 0
##$NCOEF= 0
##$NC_proc= -5
##$NLEV= 6
##$NOISF1= 0
##$NOISF2= 0
##$NSP= 0
##$NTH_PI= 0
##$NZP= 0
##$OFFSET= 16.522
##$PC= 1
##$PHC0= -86.64077
##$PHC1= 8.298332
##$PH_mod= 1
##$PKNL= yes
##$PPARMOD= 0
##$PSCAL= 4
##$PSIGN= 0
##$REVERSE= no
##$SF= 250.13
##$SI= 32768
##$SIGF1= 0
##$SIGF2= 0
##$SINO= 400
##$SIOLD= 32768
##$SREGLST= <1H.DMSO>
##$SSB= 0
##$STSI= 32768
##$STSR= 0
##$SW_p= 5175.98343685301
##$SYMM= 0
##$S_DEV= 0
##$TDeff= 65536
##$TDoff= 0
##$TI= <Analysis number 999999
Compound Code 99
Book Reference 9
Project Code 9>
##$TILT= no
##$TM1= 0
##$TM2= 0
##$TOPLEV= 0
##$USERP1= <user>
##$USERP2= <user>
##$USERP3= <user>
##$USERP4= <user>
##$USERP5= <user>
##$WDW= 1
##$XDIM= 32768
##$YMAX_p= 266546846
##$YMIN_p= -879222
$$ End of Bruker specific parameters
$$ ---------------------------------
##NTUPLES= NMR SPECTRUM
##VAR_NAME=  FREQUENCY,     SPECTRUM/REAL,   SPECTRUM/IMAG
##SYMBOL=    X,             R,               I
##VAR_TYPE=  INDEPENDENT,   DEPENDENT,       DEPENDENT
##VAR_FORM=  AFFN,          ASDF,            ASDF
##VAR_DIM=   32768,         32768,           32768
##UNITS=     HZ,            ARBITRARY UNITS, ARBITRARY UNITS
##FACTOR=    0.157963299565203, 1,           1
##FIRST=     4132.6476996994, 0,             0
##LAST=      -1043.33573715361, 0,           0
##MIN=       -1043.33573715361, -879222,     0
##MAX=       4132.6476996994, 266546846,     0
$$ Real data points
##PAGE= N=1
##DATA TABLE= (X++(R..R)), XYDATA
$$ [...]
17039b92548Q3825P6690J07717k00214m2848J16340p6296p4177K52052M0976r2402
17028a00885J09097J70314P1755J8284j84545k800K24824P4925q0817k11294j02532
17017a3674j25008K63271K34738M4543Q601J3115J3986j74331l75499j77316J40952
17006a46622J06284J46382J06463Q7359L6718L29424J10567k98799l03979o0564
16996A13233q9199j04864O8070R0120J11128l5986P0883P1696L6593k4614j37288
16985A69772k9868O1190j69311k54684k1467R7458M6010k51165n843K06358P4632
16974g6918p3088K31788K20361M2730k73614r1981P4305k724j19250j88624K24912
16963c2103K74534r7186k07702P724J0706p4556M9728p2551k7716R6049n1461
$$ plain form
17039 -292548 -208723 -132033 -24316 -224530 -267378 -151038 -227334 -301511 -49459 -8483 -100885
17028 -100885 8212 178526 250281 268565 84020 81220 306044 380969 300152 88858 -13674
17017 -13674 -138682 124589 359327 403870 412471 425586 439572 265241 -110258 -287574 -146622
17006 -146622 -40338 106044 212507 299866 336584 666008 776575 477776 173797 113233
16996 113233 24034 -80830 -12760 77360 188488 152502 223385 295081 331674 307060 169772
16985 169772 139904 201094 31783 -222901 -244368 -146910 -100900 -352065 -357908 -151550 -76918
16974 -76918 -150006 81782 302143 344873 71259 -20722 53583 50859 -68391 -257015 -32103
16963 -32103 242431 145245 -62457 -54733 -44027 -118583 -68855 -141406 -169122 -73073 -124534
16952a24534J22580K45749J2390k18822P4154o9838p5734J93998r8322k49672
16942a88051P0668m3631j7916p3421L0450Q2510j8266J1718J13526J19037O0239
16931A46863r2612k13057k47218q1824K10119n794N8514K67022N3310n9864j3093
16920B2366o9781J3448K9019L753j77684j5982L2437K00666Q533j50920J67140
16909F2995j4058l38073k2267J80176K1486K3535O9193J54522j08496N3838J49774
16898B32625p1410n0886j83262n4075n6507M4432J69615J70561P6933k92699j48345
16887a63018m3145J22113L0058l6800p6589J2430n0794k0817j18806j85851M3503
16876d87716M87p0875M4510L8143K8432j90871l6907L32677J99994j30666l6923
$$ plain form
16952 -124534 -1954 243795 256185 37363 111517 41679 -34055 159943 61621 -188051
16942 -188051 -117383 -161014 -178930 -252351 -221901 -139391 -157657 -145939 -32413 86624 146863
16931 146863 54251 -158806 -406024 -487848 -277729 -283523 -225009 42013 95323 35459 22366
16920 22366 -47415 -33967 -4948 -1195 -178879 -194861 -162424 38242 46775 -104145 62995
16909 62995 48937 -289136 -311403 -131227 -109741 -86206 -17013 137509 29013 82851 232625
16898 232625 161215 110329 -72933 -127008 -183515 -139083 30532 201093 278026 -14673 -163018
16887 -163018 -206163 -84050 -53992 -90792 -167381 -154951 -205745 -226562 -345368 -531219 -487716
16876 -487716 -487229 -558104 -513594 -475451 -447019 -637890 -674797 -342120 -142126 -272792 -309715
16865c09715q3661q5529J80497N8157L1741M0218o6640J9387K009j88757O0414
16854c41879K95711R7332J09300k50324j95270J85111R2110l6014l4467j7073
16844i5463J13195K3293m5885R8993p004q852l2889Q3197M864k1334k17567j24106
16832b29558r3117M0943K10810L0194k52057j15593J98091Q0412J26158K7269
16822B3552J22129j06373k58219n9336j82185J99525K15068J45645O9723L2770
16812B02299j31402j04430j88146J33266k0589J50064P3217j44638l902N2909
16802A8648P2302p4828J42346n564j38847M4292j98184j81510K02237J87991p1880
16791b997j16270M1884O1168k79364j77692J45314k1605m6555O2504K04014Q7194
$$ plain form
16865 -309715 -393376 -478905 -298408 -240251 -208510 -168292 -234932 -215545 -213536 -402293 -341879
16854 -341879 -46168 51164 160464 -89860 -285130 -100019 -7909 -43923 -78390 -95463
16844 -95463 17732 41025 -4860 94133 87129 78277 45388 128585 133449 112115 -105452 -229558
16832 -229558 -322675 -281732 -70922 -40728 -292785 -408378 -210287 -129875 -3717 23552
16822 23552 145681 39308 -218911 -278247 -460432 -260907 -45839 99806 169529 202299
16812 202299 70897 -33533 -221679 -88413 -109002 41062 114279 -30359 -34261 18648
16802 18648 90950 16122 158468 152904 14057 58349 -139835 -321345 -119108 68883 -2997
16791 -2997 -119267 -77383 -16215 -295579 -473271 -327957 -349562 -396117 -333613 -129599 -42405
16780d2405J73191K73304m9227l1772j7366L6732N3163k32839j42637J15723q7532
16769D8335j08779J07786J03383k4703p5466J089q5382j14685J2295J16259o4886
16758h4754K1612N4208o8578n2852j22227j63128N8679J81288J98758K80962Q3422
16747C87390j14722K9159l1279k29559N3476J56381o7472r3894J30976o4951P6239
16736B31744j31823k36169l3326L5725Q9920J85665J50396N3408k27302M658N7449
16725A80345j60251k60684K15348J57181J09409k1393R3554l130q0306l0137Q5859
16714B85795j05433l80383k05860K08169J23061K34415q185j64583j51096p720
16704a71820J43768k35940j16930K31095J97052j90959q0612J39681q8520o2361
$$ plain form
16780 -42405 130786 404090 354863 323091 305725 342457 395620 162781 20144 135867 48335
16769 48335 -60444 47342 150725 126022 50556 51645 -33737 -148422 -136127 -19868 -84754
16758 -84754 -63142 -8934 -77512 -130364 -252591 -415719 -357040 -175752 23006 303968 387390
16747 387390 272668 301827 270548 40989 94465 250846 183374 89480 220456 155505 231744
16736 231744 99921 -136248 -169574 -133849 -43929 141736 292132 345540 118238 122896 180345
16725 180345 20094 -240590 -25242 131939 241348 219955 313509 310379 230073 199936 285795
16714 285795 180362 -200021 -405881 -197712 -74651 159764 151579 -13004 -164100 -171820
16704 -171820 -28052 -263992 -380922 -149827 47225 -143734 -224346 -84665 -173185 -235546
16694b35546o2647K05895K1922Q5359N0659J14782M6911J70915n6236k4491j00152
16683B17371r0582J04912j52919m6922M9941J22994j22477p4867p3780j02945
16673a69274k25653j38080K03335J77020R2792r7915m6744j37091q2487L4522
16663c89575J83523r4855J79977M0250O394O9450K6645J73487J15345k27912J6971
16652I9700J38103J26733j57689j09982O0229N0124M6800K7812j37189j55201
16642a0560J30574p8356j50200L8433R9410J82560J63934j4251k66019k13820
16632a18295k5425l9536l27245q7184J80481J45414J02811J9519l828j83882q6358
16621d23528J90360J32477R7267j1127j01970J19376l5294O9850k06418o9140
$$ plain form
16694 -235546 -298193 -92298 -70376 14983 65642 180424 227335 398250 342014 317523 217371
16683 217371 126789 231701 78782 31860 81801 204795 82318 7451 -66329 -169274
16673 -169274 -394927 -533007 -329672 -152652 -59860 -157775 -204519 -341610 -424097 -389575
16663 -389575 -206052 -300907 -120930 -80680 -74286 -4836 21809 195296 310641 82729 99700
16652 99700 237803 364536 206847 96865 157094 207218 254018 281830 144641 -10560
16642 -10560 120014 41658 -108542 -70109 29301 211861 375795 361544 95525 -118295
16632 -118295 -143720 -183256 -510501 -597685 -417204 -271790 -168979 -149460 -153288 -337170 -423528
16621 -423528 -233168 -100691 -3424 -14551 -116521 2855 -32439 37411 -169007 -238147
16611b38147m9107M5792P4870R8483P1114j79102J22153j84298p0971m2564j9046
16600c70823J28343J09893n0386j85635j63684J95796J77229k0475m8557j30775
16590c59074Q9419J20326R2993k72521p0450J53513K25586R9008l3027k07479
16580a61706r9582Q9263r8043p814P7832J31913Q5446Q9438p2797j49070j81427
16569b96547j07118J2954J5332O5793K35463M4017r617J25200l8704J4688j9922
16558D1539k90754m0691J89894K26635J5644j14703j5871O0839j10443P7351r1307
16547e1867k4784k1342j31224j7667J53998L11233O7985j98690Q7202O1616R5183
16536C31643j34050k63208m3373R5311m5697K12344n7301k4745J49301p6052N3277
$$ plain form
16611 -238147 -287254 -241462 -166592 -68109 3005 -176097 -53944 -238242 -309213 -351777 -370823
16600 -370823 -242480 -132587 -182973 -368608 -532292 -336496 -159267 -179742 -228299 -359074
16590 -359074 -269655 -149329 -56336 -328857 -399307 -245794 -20208 78800 45773 -161706
16580 -161706 -261288 -172025 -270068 -277882 -200050 -68137 17309 106747 33950 -115120 -296547
16569 -296547 -403665 -390711 -375379 -309586 -74123 -30106 -39723 85477 46773 61461 41539
16558 41539 -249215 -289906 -100012 126623 142267 27564 11693 72532 -37911 39440 -51867
16547 -51867 -76651 -97993 -229217 -246884 -92886 218347 286332 87642 174844 236460 331643
16536 331643 197593 -65615 -108988 -13677 -59374 152970 95669 70924 220225 144173 197450
16525A97450o0540k09543k7848k93214p8630R5040K46188P9675P3432p3539l3794
16514h5323j20482n4230N5910l8252M1902J43624K19458m3584o3704P6040J72283
16503C03642j64250j85317R9345J73812k00300p2543O1268K46236j06446j67209
16493a1762q8434l3573j4590J35292p566J38993J16812k26251k05916Q1280J7098
16482i8617J38674J41519j815n8171J73315J23793l54862k72511R9101K8922J96550
16471A15898n0505N5773m5843j09725p1358O239j1875k7111M4806J00595k22717
16460b15823j18311J96186j01903J47923O6063j03934J42603J19940L4822k02958
16450c5392j078k7929j43602o5508M3219Q6917L08509m9259j00255o5374J03234
$$ plain form
16525 197450 136910 -72633 -100481 -393695 -472325 -377285 -131097 -51422 22010 -51529 -85323
16514 -85323 -205805 -260035 -204125 -242377 -200475 -56851 162607 119023 55319 131359 303642
16503 303642 139392 -45925 53420 227232 26932 -45611 15657 261893 155447 -11762
16493 -11762 -100196 -133769 -148359 -13067 -20633 118360 235172 8921 -196995 -115715 -98617
16482 -98617 40057 181576 179761 121590 294905 418698 63836 -208675 -109574 -80652 115898
16471 115898 65393 121166 75323 -34402 -105760 -99521 -111396 -138507 -93701 6894 -215823
16460 -215823 -334134 -137948 -239851 -91928 -25865 -129799 12804 132744 167566 -35392
16450 -35392 -36470 -64399 -208001 -273509 -230290 -143373 165136 115877 15622 -49752 53482
16439E3482J55416m3352J9271m925p6670j95962l8481j5044J66015J6500j80553
16428a44303j26491j1797J38884K62561J17056m2934k35141k02126J20320K04504
16418H0533J01543j20333L1279n8205J067K12043Q1668J15457n7932p3275j34022
16407A79823m59715M3126J75785n3523K31273n1664j53389q5513O0846R2377N8113
16396C7539j0388j47263l7616O8116K62465J08571O3240L3218j9990p6063M1766
16385C23595p8171q6686j01059j9378p6179j14059l6443j9235R9493k56j16556
16374b24934q8519R8768K016k8054Q6825O9212j78389j96949L4289J76507n8401
16363c07629J53447J2671R1470M63K7758K4989P7991k26386k77925K51633J25671
$$ plain form
16439 53482 208898 165546 184817 179892 103222 -92740 -131221 -146265 19750 36250 -144303
16428 -144303 -270794 -282591 -143707 118854 235910 192976 -42165 -244291 -123971 80533
16418 80533 182076 61743 93022 34817 35884 247927 329595 445052 387120 313845 179823
16407 179823 -279892 -236766 -60981 -114504 116769 65105 -88284 -173797 -112951 -20574 37539
16396 37539 27151 -120112 -157728 -89612 172853 281424 344664 377882 357892 281829 323595
16385 323595 245424 158738 57679 38301 -37878 -151937 -188380 -207615 -108122 -108378 -224934
16374 -224934 -313453 -214685 -212669 -240723 -153898 -84686 -263075 -460024 -425735 -249228 -307629
16363 -307629 -154182 -141511 -50041 -49578 -21820 3169 81160 -145226 -423151 -171518 -45847
16352d5847J18156J28249j15863j95972J38264J46310Q3120j30889J8481K4801
16342A68810j3258J0015J723K4312k85234n2826R4233P5978J22813L16875L8225
16331E01666m8266k96632l8943j74600j77218j39519N3197K23364L25411m6755
16321A81705J18917N462l25814j81978K52248K7842J42763N095k60580j52181
16311a86521K7910R5423r627k3689k87141J21695K79176J17296j51331K9425k92858
16300b80242k844M6999Q5782O8037M8796L0763q9189k55913j99003J09817K41772
16289a95225K41605M0404r4687J52181J19641M5814R6390q3679j13566j31188
16279G7690p5189j04305p7536J37608O8339k8845m1884m0155J23197J47256k4179
$$ plain form
16352 -45847 72309 200558 84695 -111277 26987 173297 256417 125528 144009 168810
16342 168810 155552 165567 167290 191602 -93632 -146458 -52225 23753 146566 463441 501666
16331 501666 453400 156768 117825 -56775 -233993 -373512 -320315 -96951 228460 181705
16321 181705 300622 306084 -19730 -201708 50540 78382 221145 226240 -34340 -186521
16311 -186521 -158611 -63188 -72815 -96504 -383645 -261950 17226 134522 -16809 12616 -280242
16300 -280242 -283086 -236087 -150305 -82268 -33472 -2709 -91898 -347811 -546814 -436997 -195225
16289 -195225 46380 86784 -7903 144278 263919 309733 406123 322444 208878 77690
16279 77690 2501 -101804 -179340 -41732 26607 -2238 -44122 -84277 38920 186176 161997
16268A61997q5645r7478j71500J25523J89804r7827K4955J12498p5679j27081
16258d0433L2108j21464j27435J37498m2498J12502o0850p3041j22621J114J42926
16247a62194J2690P2721k39075O0405K43352M3916j97624j46735J72364o7617
16237b07797l7587K872R2682J12513R5021M1808O7407n703m6112k19032r840N4460
16225e9308k7702R4132j1590l56O8188J02683J2721K9178r5199n3140R7429J24220
16213B81256Q2384j86250k06770j14252j03861j55713N1922J87274L14221q0781
16203F9430j88302m3347M765k8225K4553K77743L4325r5403P139M1442q6585p9785
16191f2250M0964Q1634m6195j30567o4789j07481R6045j688j55993O2921p5066
$$ plain form
16268 161997 76352 -21126 -192626 -67103 122701 24874 49829 162327 86648 -40433
16258 -40433 -8325 -129789 -257224 -119726 -162224 -49722 -110572 -183613 -306234 -305120 -162194
16247 -162194 -149504 -76783 -315858 -255453 -12101 31815 -165809 -312544 -140180 -207797
16237 -207797 -245384 -242512 -149830 -37317 57704 99512 166919 161216 115104 -103928 -113768 -59308
16225 -59308 -87010 7122 -4468 -4824 63364 166047 178768 207946 112747 59607 157036 281256
16213 281256 363640 177390 -29380 -143632 -247493 -403206 -351284 -164010 150211 69430
16203 69430 -118872 -162219 -157454 -185679 -161126 116617 150942 55539 62678 104120 17535 -62250
16191 -62250 -21286 60348 14153 -116414 -181203 -288684 -192639 -194327 -350320 -287399 -362465
16180c62465l52697L7954J21656L03999M17645L25497k60017n3663M8715N3950
16170B80574O2147L9868j38536j43508j06117J4047j41394m2245n8037P5489J33686
16159b4026j75245k953J46782O9116J18927j60749Q0829J01952j88258J9246J129
16148a3250r1066J03283j55921M6298K19444J52880J0573l5648k67074N9818j92935
16137a63598J18915O2672Q1625R3011j32838R5308J21200Q1614L4915j76516o6167
16126A50141j31212k11486J13365J78866j90923J31261J2198o9897R8739O0294
16116A41346K0180P9211J82352j838k7892k27283j06876k02094m510K38281m5233
16105D5644l95046q5496J58724j95296K77686Q2431J1642q5669r1429R2572K1691
$$ plain form
16180 -362465 -715162 -677208 -555552 -251553 166092 491589 231572 177909 226624 280574
16170 280574 342721 382589 244053 100545 -5572 8475 -132919 -175164 -233201 -157712 -24026
16159 -24026 -199271 -202224 -55442 13674 132601 -28148 52681 154633 -33625 -14379 -13250
16148 -13250 -104316 -1033 -156954 -110656 108788 261668 272241 236593 -30481 29337 -163598
16137 -163598 -44683 17989 99614 192625 59787 155095 276295 357909 392824 216308 150141
16126 150141 18929 -192557 -79192 99674 -91249 40012 52210 -17687 81052 141346
16116 141346 161526 240737 423089 421251 393359 166076 59200 -142894 -147404 90877 45644
16105 45644 -349402 -434898 -276174 -471470 -193784 -111353 -99711 -185380 -276809 -184237 -162546
16094a62546J25939J8716k2816q6692J28561J93744N1416p0021j78931O7098K12270
16083B76738P7704n7677J652m2364J11483J45385r585k41318k09719M8865K59808
16072C60972o2532k79085L5247j49599j12286J74269J48880o8988J36567j85643
16062b198j78561j07323K77882R0769m0311o2075m7288O7094K14993J18374l9516
16051B91840l4854o8205j37053P4641l49605k60290O6214K44718J13481Q1810
16041B2697l32316k65531l9325q102J24368R6703K9992K5873K41130J37339J54419
16030A87247k71053N5190J16394J6485j49646l26065J23202Q4592O400O8486M4456
16019d4312J27516J38022j88974j32601J98719l3502j93319j59935J32087J26682
$$ plain form
16094 -162546 -36607 -17891 -40707 -127399 1162 194906 246322 176301 -2630 64468 276738
16083 276738 354442 296765 298417 256053 367536 512921 503336 262018 52299 101164 360972
16072 360972 298440 19355 54602 -94997 -207283 -33014 115866 46878 183445 -2198
16062 -2198 -180759 -288082 -10200 80569 40258 -21817 -69105 -2011 212982 331356 291840
16051 291840 256986 188781 51728 126369 -223236 -483526 -417312 -172594 -59113 22697
16041 22697 -309619 -575150 -614475 -622577 -498209 -401506 -371514 -345641 -104511 32828 187247
16030 187247 -83806 -28616 87778 104263 -45383 -371448 -248246 -163654 -157254 -88768 -44312
16019 -44312 83204 221226 32252 -100349 98370 64868 -128451 -288386 -156299 -29617
16009b9617J24537P9295l12701k55332J54486K8113j13808J62627j7086k2465
15999b01951p4643k5896j04371L2290J84302J7740j29914J0947l435J76982K06356
15988H8407j65176j68174K49259R7629j15739P0286N4037K13470J06491j38735
15978B91755k05407l3866p7912Q0104m8824K8020k70520J03445J36509P2730k6687
15967D9347j43926M3052M2177K6838J14942k46226j21040J00963O2207J31665
15957E9999N7502j0335n300q9001j38282J04006k9606o9520L5215K34778J99946
15946C49402k73929j17860K16060k40130j81353P735J4222P0900j01648J9001
15936b37600M1455m5749m1669j19122J6555J20946K09497o3829j25310r3468j88628
$$ plain form
16009 -29617 94920 174215 -138486 -393818 -239332 -211219 -325027 -162400 -179486 -201951
15999 -201951 -276594 -302490 -406861 -374571 -190269 -172529 -302443 -291496 -294931 -117949 88407
15988 88407 -76769 -244943 4316 101945 -13794 56492 110529 323999 430490 291755
15978 291755 86348 52482 -25430 54674 5850 33870 -236650 -133205 3304 76034 49347
15967 49347 -94579 -51527 -9350 17488 132430 -113796 -234836 -133873 -71666 59999
15957 59999 117501 107166 101866 12865 -125417 -21411 -51017 -120537 -85322 149456 349402
15946 349402 75473 -42387 173673 -66457 -247810 -240075 -225853 -154953 -256601 -237600
15936 -237600 -196145 -241894 -283563 -402685 -386130 -265184 -55687 -119516 -244826 -338294 -526922
15925e26922K4078J47987O9877j14328N3982K62565K300r1561k98235M606L29170
15914a36481J62974J77183J37777m7738p9614l586q5588j80696K21187O8755J63267
15903C97440j08650j43071M398n5781j58885J24211P6844j2416j1616q5083j79101
15892a51710R2246J39641O8160p8554j08137j37772J86908J75623j15307P9313
15882A50411J2011k04769j69693k10127P7523o4503J7699J36050J57110M5090
15872e3198l2428J18149j85271r7874K4782O6458K4356R0497P3142j38030r9412
15861b08829J70742K01205l7313M2083R3683J46015N3439j59670j51078l02475
15851a52198j16774Q7992J35709q8492j22815J40840m5504J33294k8316r2203
$$ plain form
15925 -526922 -502844 -354857 -284980 -399308 -345326 -82761 -80461 -172022 -470257 -465651 -136481
15914 -136481 26493 203676 341453 293715 214101 210515 124927 -55769 165418 234173 397440
15903 397440 288790 145719 150117 94336 -64549 59662 136506 124090 112474 27391 -151710
15892 -151710 -59464 80177 148337 69783 -38354 -176126 10782 186405 71098 150411
15882 150411 162422 -42347 -212040 -422167 -344644 -409147 -391448 -255398 -98288 -53198
15872 -53198 -85626 32523 -152748 -250622 -225840 -159382 -135026 -44529 28613 -109417 -208829
15861 -208829 -38087 163118 125805 167888 261571 407586 461025 301355 150277 -152198
15851 -152198 -268972 -180980 -45271 -133763 -256578 -115738 -161242 -27948 -56264 -148467
15841a48467J22224j5911j56393P5445p709j49839P6340o4177L2586J14636K24892
15830A03627J0099j20019N886J26614M7959j43621k43292J81486K04637J78911
15820C52287j36216j14769j33105p7837N9714O8446o6585L6266q0864n7725J39339
15809a1049R3869j29743j36885j2261M283j58268J82634J14967J84131J11188
15799B42866k72478l82512J39939J92381K3207k5347K03832L23239j37176k18797
15789H9154m4731J27960L05096l0790k318n0944j21355J8353K30541k22878l26346
15778b8258j24209J30096o2855m7433P6533n0661K47626j00411j04225Q0593j83909
15767a67113k40064m17407R6720K18530K95341M3361j24211N3581K45838j03365
$$ plain form
15841 -148467 -26243 -42154 -198547 -123102 -130811 -280650 -204310 -268487 -235901 -121265 103627
15830 103627 113726 -6293 -407 126207 174166 30545 -212747 -31261 173376 352287
15820 352287 216071 101302 -31803 -109640 -49926 18520 -48065 -11799 -92663 -150388 -11049
15809 -11049 82820 -46923 -183808 -196069 -191786 -350054 -167420 -52453 131678 242866
15799 242866 -29612 -412124 -272185 -79804 -56597 -81944 121888 445127 307951 89154
15789 89154 44423 172383 477479 446689 444371 393427 272072 290425 520966 298088 -28258
15778 -28258 -152467 -22371 -85226 -132659 -56126 -106787 140839 40428 -63797 16796 -167113
15767 -167113 -407177 -824584 -727864 -509334 -213993 -170632 -294843 -241262 4576 -98789
15757i8789r3961L537j06156O0818l6518k8631k22301J4187J95187L83904J792
15746G3069R2419J11253k39943j70973k5842n8070r5299O5434J78177J70593P4558
15735A75376K1826l32704j26327j96085o0345R1294J90957J63648K82610l6978
15725A73272k67539L390K43941j3584j68215J920k40994r0955K4272J68967l2091
15714a97616Q5253N8215r2322J54633J26515R4405j98786o0675O9845q6368K2189
15703b4712O7675j34469n9628Q1176k5773J37136L32902o8687q7666r8153q0059
15692C9742J12594j74340j9002K96136N7750J10921j44117j18004j37639K2587
15682D6628l5272l2272J11119K3630l2718m7305m8503k8446l1717m6979J26860
$$ plain form
15757 -98789 -192750 -189213 -295369 -234551 -271069 -299700 -522001 -507814 -312627 71277 73069
15746 73069 165488 276741 36798 -134175 -160017 -218087 -313386 -247952 -69775 100818 175376
15735 175376 197202 -135502 -261829 -457914 -518259 -426965 -236008 -72360 210250 173272
15725 173272 -94267 -90877 153064 139480 -28735 -26815 -267809 -358764 -334492 -165525 -197616
15714 -197616 -112363 -54148 -146470 8163 134678 229083 30297 -30378 39467 -46901 -24712
15703 -24712 42963 -91506 -151134 -69958 -95731 41405 374307 305620 217954 119801 39742
15692 39742 152336 -22004 -41006 255130 312880 423801 279684 161680 24041 46628
15682 46628 11356 -20916 90203 113833 81115 33810 -14693 -43139 -74856 -121835 5025
15671E025K39103k0072J5995j36210m04993J15885L48848k11255j58538Q2523
15661a23689L5555m9846N6549J284o02m7922J72421J70969k09092k38990j73492
15650d06855M0020q879J97722P8115J50149J5999j39975o0126n7668j0131J5473
15639a86156N7708K43898j02381k38852Q0861J3333j86670O8829M9108m1792R4936
15628a47178J04343O5454K1454N9853o0421J2719J27929k07127n5179J00587R3015
15617A15449j84827l0113q2282j90521K85040L73363O6913j87769k21789M411
15607e2125K08034K95408l69646k80061J41038k05717N456K34585J0671m7014
15597e9371j54967J6580L1269K12028j64265k30357P8867J95323j76337k22442
$$ plain form
15671 5025 244128 224056 240051 103841 -301152 -185267 163581 -47674 -206212 -123689
15661 -123689 -88134 -137980 -81431 -80147 -80749 -128671 43750 214719 5627 -233363 -406855
15650 -406855 -366835 -375714 -177992 -99877 50272 66271 -73704 -133830 -191498 -201629 -186156
15639 -186156 -128448 115450 13069 -225783 -144922 -131589 -318259 -249430 -200322 -242114 -147178
15628 -147178 -42835 22619 44073 103926 43505 56224 184153 -22974 -78153 22434 115449
15617 115449 -69378 -99491 -181773 -372294 -87254 286109 353022 165253 -56536 -52125
15607 -52125 155909 451317 81671 -198390 -57352 -263069 -257613 -23028 -12357 -59371
15597 -59371 -214338 -197758 -166489 45539 -118726 -349083 -270216 -74893 -251230 -473672
15587d73672n1893m646M1904Q8398J01583M6954J29627k26837J1984J90288o6457
15576b12767J17899J38845r2018n0230p2879R0944K02710K3667r2019Q8118n9636
15565H2634j97017l6871P2360J33820J04240p7102k08959n1690k4471q6139L1118
15554b58077n0779r0976N2320K45262J61117M997j48291L3768K27741J51852J52166
15543D81100k39978N4991Q0489m3615j11426j39008j35790J04015L06201J6563
15533C73542j84483l64306m4840K07230m2188r7451J10370N9999O5911j86749
15523a02965j21036K12534J06529l55788k71616P7544K19584K07728J32800j88105
15513h2791q9104o6868J05812k29162J02087L92908j5881k30013j04477O9305
$$ plain form
15587 -473672 -525565 -530211 -488307 -399909 -298326 -251372 -121745 -348582 -336598 -146310 -212767
15576 -212767 -94868 43977 -48041 -98271 -171150 -80206 122504 146171 54152 142270 82634
15565 82634 -114383 -151254 -78894 54926 159166 82064 -126895 -178585 -203056 -289195 -258077
15554 -258077 -308856 -399832 -347512 -102250 58867 63864 -84427 -50659 177082 328934 481100
15543 481100 241122 296113 376602 332987 221561 82553 -53237 50778 356979 373542
15533 373542 189059 -175247 -220087 -12857 -55045 -152496 -42126 17873 83784 -102965
15523 -102965 -224001 -11467 95062 -260726 -532342 -454798 -235214 -27486 105314 -82791
15513 -82791 -171895 -238763 -132951 -362113 -260026 132882 117001 -113012 -217489 -148184
15503a48184k90806L47721L41725l3995k28339j297P3192n7285j91527O8019K06873
15492H6097J06933p5260L362o2190j6243j61935J63538Q3867j7173p2421j25117
15481h6542R5781J48694K1185j68143k25955L0715P3254m2104M603m4904O2441
15470a30975M910r0312j74753n8922J57655J73815Q8217K30714k66425k86563
15460c52639J97677R9119M6592k6043r3746o9412j14091j13095P5387L92057J22905
15449A64711j62757M850p9342q4984N2033J61234M5387p6269k28095j20601K99396
15438b4437m2237k76813m6208Q7618j4448J12223J46276J50132M9506K87418r8082
15427C30948j87545l12313j20660m9841J02230Q8951J67249K5330j09719j44572
$$ plain form
15503 -148184 -438990 -91269 250456 216461 -11878 -13175 60017 2732 -188795 -120776 86097
15492 86097 193030 117770 121132 58942 42699 -119236 44302 128169 110996 38575 -86542
15481 -86542 9239 157933 179118 10975 -214980 -184265 -111011 -153115 -148512 -193416 -130975
15470 -130975 -126065 -216377 -391130 -450052 -292397 -118582 -30365 200349 -66076 -352639
15460 -352639 -154962 -55843 -9251 -35294 -129040 -198452 -312543 -425638 -350251 41806 164711
15449 164711 1954 6804 -72538 -157522 -105489 55745 101132 24863 -203232 -323833 -24437
15438 -24437 -66674 -343487 -389695 -302077 -316525 -204302 -58026 92106 141612 429030 330948
15427 330948 143403 -168910 -289570 -339411 -237181 -148230 19019 44349 -65370 -209942
15417b09942J6781J5142P9040R8769m1920L3760r133J0223R0242R7286o331O2522
15405B36439o3497l49947l0452J42931j21811J36092k1654j03196P0538j03250
15395b07807J54292N7656L2296J08722j30057n8718q190n7071K3477J27386r141
15384C2845r063K9399n4994L0074j15597J0019J11745P0073k6218k31316j69230
15373c22263J68344k750N3950J60059j39368n4065P7078Q0935k65295L2911K09431
15362a033K02869j68166k22784M7984N7099p6124k14351J12074J47887k5334n2469
15351a92348j35680o4902J63664L18854r0371j41900k20134P3727L09478O1952
15341H2340K16140J15237j59948j63847O0468K8618j60786j14692J14173J33826
$$ plain form
15417 -209942 -193161 -178019 -98979 -210 -42130 -8370 -17503 -7280 82962 180248 173917 236439
15405 236439 172942 -177005 -207457 -64526 -186337 -50245 -71899 -175095 -104557 -207807
15395 -207807 -53515 4141 36437 145159 15102 -43616 -51806 -108877 -85400 41986 32845
15384 32845 23782 53181 -1813 28261 -87336 -77317 34428 104501 78283 -153033 -322263
15373 -322263 -153919 -156669 -102719 57340 -82028 -136093 -59015 21920 -243375 -210464 -1033
15362 -1033 201836 33670 -189114 -141130 -84031 -160155 -374506 -262432 -114545 -139879 -192348
15351 -192348 -328028 -392930 -229266 89588 -783 -142683 -362817 -289090 20388 82340
15341 82340 298480 413717 253769 89922 150390 179008 18222 -96470 17703 151529
15331A51529k10921l2776j12413J61992M3715l1870n7123M331M1212K2833K99525
15320B80034J27452k40613j25003N7422k13601K1816r5148K3100J80318j31938
15310a16161n6909k4278j82787K54987J720L0784p4306j04020R3825J4541j7765
15299a80369N7604K22617O8652r4463O65n698n7382j4914p1558J5045o6407J823
15287a24385P3128K08616K44215q3366j94810j40577j51278J45858n0650J04173
15277C0924K5687q3444j45372m2253J27057J00616N6328k12689j76532Q5141J47496
15266h7041O6097L59213m7368l04376K1796P7655j14176J05035J69651N3951q5591
15255B14846k03641j86770j298J09853J20501J03100p4238O3691O732n2843J2719
$$ plain form
15331 151529 -59392 -92168 -204581 -42589 1126 -30744 -87867 -83536 -42324 -19491 280034
15320 280034 407486 166873 41870 99292 -114309 -92493 -187641 -164541 15777 -116161
15310 -116161 -173070 -197348 -380135 -125148 -123428 -92644 -166950 -270970 -177145 -162604 -180369
15299 -180369 -122765 99852 168504 74041 74706 69008 11626 -3288 -74846 -59801 -126208 -124385
15287 -124385 -51257 157359 401574 318208 123398 -17179 -168457 -22599 -73249 30924
15277 30924 56611 -26833 -172205 -214458 -87401 13215 69543 -143146 -319678 -234537 -87041
15266 -87041 -20944 338269 290901 -13475 8321 85976 -28200 76835 246486 300437 214846
15255 214846 11205 -175565 -176863 -67010 53491 156591 82353 146044 152776 99933 112652
15244A12652j60021k33155K4803J40841K18008j38508M7660j00916o6851J00117
15234e5370K12371Q057n478M6082K4238o7587L6361k05708j71870P3182Q1435
15223b4287j5045J30823O0571P9051n6469j96807K9679n6442k04546o6763J5254
15212c04981J76826J12686k74284j60016Q9504J8731J83849K01176j10946j32510
15202a99965j73804J1010O4135K89518Q7674j22326Q3820j84596j07927J9162
15192b33299J55774j7377j35669J61876n412P9836R0609k7157j12114J26600k7407
15181E6260N132j48343l18387K65664J63919k05761J00171K44950P1583k6026
15171B09162k20973l9605m8204J11185J01358P4028P8272O025j25025O979k4008
$$ plain form
15244 112652 -47369 -280524 -255721 -114880 103128 -35380 12280 -88636 -155487 -55370
15234 -55370 157001 165058 159580 205662 229900 162313 198674 -7034 -178904 -105722 -24287
15223 -24287 -39332 91491 152062 231113 174644 -22163 7516 -48926 -253472 -320235 -304981
15212 -304981 -128155 -15469 -289753 -449769 -360265 -341534 -157685 43491 -67455 -199965
15202 -199965 -373769 -362759 -298624 -9106 78568 -43758 40062 -144534 -252461 -233299
15192 -233299 -77525 -94902 -230571 -68695 -74107 5729 96338 69181 -42933 83667 56260
15181 56260 61392 -86951 -405338 -139674 24245 -181516 -81345 163605 235188 209162
15171 209162 -11811 -51416 -99620 11565 112923 186951 265223 271248 146223 153202 129194
15160A29194m1509m5273j32266k20307J62343L06364J21847k07894k73397Q6618
15150a14280J66196K7530P7931q5493M98q3842Q1178m4119j28355O1542P4886
15139C3672p4890Q000K5385P8185o4762r9725j73880J9386j36454k97644K8375
15128f54352M68742p302J9838M909J12674K89567j14644k46294j09755L99841
15118A63224J36916J24053j62243j0682l00830J67021k0563K49428K61257k8209
15108E79372k41100j51226l1135j32449q5723j24352l2315m3713N062J99167j55452
15097b13864J96260K09252k06061J91320J21701j98724j36725l9203j05375N2976
15087a28443J9634J6882J94759O6230R0670k1850J0193J7470j28412j33545L2357
$$ plain form
15160 129194 87685 42412 -89854 -310161 -147818 158546 280393 72499 -200898 -114280
15150 -114280 51916 79446 157377 71884 72382 -11460 69718 25599 -102756 -41214 33672
15139 33672 -41218 -33218 -7833 70352 5590 -94135 -268015 -248629 -385083 -682727 -654352
15128 -654352 -185610 -192912 -173074 -168165 -55491 234076 119432 -126862 -236617 163224
15118 163224 300140 424193 261950 251268 -49562 117459 96896 346324 607581 579372
15108 579372 338272 187046 155911 23462 -62261 -186613 -218928 -262641 -257579 -58412 -213864
15097 -213864 -17604 191648 -14413 176907 298608 99884 -36841 -76044 -181419 -128443
15087 -128443 -108809 -91927 102832 169062 259732 237882 248075 265545 137133 3588 35945
15076C5945J21501O9947O5259q6894j50869Q7322r5455j78972j8588M6493J26336
15065B2025J20969J13437M1571j23837p5688j79804r6106K20571O277J38244q7738
15054I9921J18765J71857k5899l38097p2266J91316K12098l70531j31385k0956
15044a65177k4761J88164Q8150k1955m7020p9503p8915K1115K30846j8234j4696
15033G8014j36460J72392o181m8968k10167o0280K19099K54242k12737j41279
15023i2325P1684J1334j3011k842j23263J00836J874q6793j53141j70258K0430
15012d35475J00825q9896j46393L4977M13712K18759l4949k12863k55502J33426
15002b73379K94737j10681J24055m5006j88923j70620k4216K313m4380L3349L20406
$$ plain form
15076 35945 157446 227393 292652 205758 54889 142211 46756 -132216 -150804 -104311 22025
15065 22025 142994 256431 298002 174165 98477 -81327 -177433 43138 49415 187659 99921
15054 99921 218686 390543 364644 26547 -45719 145597 357695 -12836 -144221 -165177
15044 -165177 -189938 -1774 86376 64421 17401 -62102 -141017 -119902 110944 92710 78014
15033 78014 -58446 113946 107765 58797 -151370 -211650 7449 261691 48954 -92325
15023 -92325 -20641 -9307 -22318 -25160 -148423 -47587 -45713 -132506 -285647 -455905 -435475
15012 -435475 -334650 -424546 -570939 -535962 -122250 96509 61560 -151303 -406805 -273379
15002 -273379 21358 -89323 34732 -10274 -199197 -369817 -394033 -391720 -436100 -402751 -82345
14991h2345j8342K5993r8853j24575R5561O0328j53334M9804p6066O0851K69226
14980H248j66427k02815p6269K43212j03670o7464L031J42913Q5814P634m459
14969a30252l9551l7857n8142Q6649P2868N023M1575J28243K03799p3019K9586
14958B28922L8071k80285j50425J8467k56992Q4753L12843p5392j44644K3756
14948b00926J00595J24651m1092M0143K51329K0597k95916J20035J12723j23559
14938A08580j89342o1366k5154J40545K74729j38868j93722m0973r3854M1103
14928a78322k6509o077k7344p3288J03122o1349R0866o2675L112P1461n7384J14109
14916a10278q8439K0341J8543l65710K0074M5443J93218J84121O5673n8961j505
$$ plain form
14991 -82345 -100687 -74694 -173547 -298122 -202561 -142233 -295567 -245763 -321829 -260978 8248
14980 8248 -158179 -360994 -437263 -194051 -297721 -365185 -362154 -219241 -133427 -125793 -130252
14969 -130252 -169803 -207660 -265802 -179153 -106285 -101262 -59687 68556 272355 199336 228922
14958 228922 266993 -13292 -163717 -145250 -402242 -317489 -4646 -80038 -224682 -200926
14948 -200926 -100331 24320 -16772 23371 274700 295297 -619 119416 232139 108580
14938 108580 -80762 -142128 -167282 -26737 247992 109124 -84598 -125571 -219425 -178322
14928 -178322 -204831 -210908 -238252 -311540 -208418 -269767 -178901 -241576 -238464 -167003 -224387 -110278
14916 -110278 -198717 -178376 -159833 -525543 -505469 -460026 -266808 -82687 -17014 -75975 -77480
14905g7480P8593J61564q6741J61326N348k74132j08749O8464M5872M3474l9996
14894b2457M3306j10915n3226r9639M6737N609j582O4763M3476q246J8560J68664
14882I5050K3858r7239j19443P5445j68242k15178J58034j30250j09535l690M9943
14871d41247L7056J15533K33175K49079Q1744q9570j33925j4890J3058K29867
14861B79880J60164m9492k73823j25658j70909J8804K37752P2677l7417J95224
14851C07202p3843o7593M7390r6064m1575J11866j23739j45249J36109J80498
14841B35002P0744q4227q1227j29118r0879n4030J88619l7577j43712O9359J93701
14830A36655J281q6239j8641l3779k5292m2608k50247J22132K2286N9514J00369
$$ plain form
14905 -77480 1113 162677 75936 237262 242610 -31522 -140271 -71807 -25935 17539 -22457
14894 -22457 20849 -90066 -143292 -242931 -196194 -190585 -192167 -127404 -83928 -92174 -73614 95050
14882 95050 118908 21669 -97774 -22329 -190571 -405749 -247715 -377965 -487500 -491190 -441247
14871 -441247 -404191 -288658 -55483 193596 275340 185770 51845 36955 50013 279880
14861 279880 440044 390552 116729 -8929 -179838 -161034 76718 149395 111978 307202
14851 307202 233359 165766 213156 117092 75517 187383 63644 -81605 54504 235002
14841 235002 305746 221519 140292 11174 -79705 -133735 54884 17307 -126405 -57046 136655
14830 136655 137936 51697 33056 -723 -26015 -68623 -318870 -196738 -174452 -114938 -14569
14819a4569n6997J42525j2531J1236P318j04248l22050K5914J0726L39135j59576
14808a33117k64760L8387J41402Q1613j00159o3949J05407O7780J58385m4590
14798a3601j41060M7183J99136j20530J2291K75974M8135k39263j55663L8981
14788d8417J587r6120r448L0565M42669J11151j59532j11518K8079j06131j4674
14777F8211K58335J83795j38502j40511j04080M3854p9151r4884p8276M6509K27316
14766A92616J44958K28698J89406j5617l34041l38366k0714j8857o656r4195j30912
14755b03680k5507K31566J80181k22750k07489m2051M9088K9386K41849J040k04115
14744a72482m1480J61584l4115j39705J3071j28426J37983J74794k7355K41067
$$ plain form
14819 -14569 -71566 70959 58428 69664 76982 -27266 -349316 -323402 -312676 26459 -133117
14808 -133117 -397877 -359490 -218088 -136475 -236634 -300583 -195176 -127396 30989 -13601
14798 -13601 -154661 -107478 91658 -28872 -16581 259393 307528 68265 -87398 -48417
14788 -48417 -46830 -142950 -152398 -121833 320836 431987 272455 160937 189016 82885 68211
14777 68211 326546 510341 371839 231328 127248 171102 91951 -2933 -81209 -34700 192616
14766 192616 337574 566272 755678 740061 406020 67654 46940 28083 21427 -72768 -203680
14755 -203680 -229187 2379 182560 -40190 -247679 -289730 -240642 -211256 30593 31633 -172482
14744 -172482 -213962 -52378 -86493 -226198 -213127 -341553 -203570 -28776 -56131 184936
14734A84936N4920j28229k41909j4029J62952M5119p9737j17805j57911j60616
14724d52309k4442K71214K42793r6645Q3352N3841m8083j0332k37107k42068J70510
14713b89276L13419J65122N2630j01757j80122j72226J34237J37560J10315O071
14703A75973J42265j91375l13572p9427J15188K1470j96797k5309J42639k971
14693b11916o5873k47421q1224J7464J32791J35102J75953J02878J4394q2933
14683a10785n0422N0471k7403m199K8231R5293N7841j58088N6600L6894J59136
14672A33569K86508p2625j75841j15858k5707j5029L43773p2651j94004l5141
14662E6994l170K02715m9231K3447K04743k98175k19949j36455K00435J7424j03812
$$ plain form
14734 184936 239856 111627 -130282 -144311 18641 63760 -15977 -133782 -291693 -452309
14724 -452309 -476751 -205537 37256 -59389 23963 77804 29721 19389 -217718 -459786 -289276
14713 -289276 24143 189265 241895 140138 -39984 -212210 -77973 59587 169902 175973
14703 175973 318238 126863 -186709 -266136 -150948 -129478 -326275 -351584 -208945 -211916
14693 -211916 -277789 -525210 -606434 -588970 -456179 -321077 -145124 -42246 -27852 -110785
14683 -110785 -161207 -110736 -138139 -142338 -114107 -18814 39027 -119061 -62461 -25567 133569
14672 133569 420077 347452 171611 55753 30046 15017 358790 286139 92135 56994
14662 56994 53824 256539 207308 230755 435498 137323 -82626 -219081 -18646 -1222 -105034
14651a05034J1307K65041Q966m20575P8392J10573M1611j1744J29233k79799j82728
14640c54757J45769K92326K1306J3684j22642n8519M569J20809O3074m1872o8156
14629A5591j26546n9278r3131M6018N5873r6797J65449J92036Q9607j04781k67980
14618a83939J32586n4867J2334J81114R8899j99095J41033j4795j90038M8292
14608b8476j94282j47795q9768l5533J74083J20026j78280Q5096K84123N4881
14598D4075j6249k7266j8031j20874J76891r7663M1851J4850j58238j74161J26291
14587b08524j0159O0024k07972n6528K24876J05464J21750p9901p0371o128r1337
14576b18806j5021K00106J68965j83863j5834P1649j1168J40903r2126k12187
$$ plain form
14651 -105034 -93727 171314 180280 -240295 -161903 -51330 -9719 -21463 107770 -172029 -354757
14640 -354757 -208988 83338 104644 118328 -4314 -62833 -58264 62545 125619 83747 15591
14629 15591 -110955 -170233 -263364 -217346 -161473 -258270 -92821 99215 188822 84041 -183939
14618 -183939 -51353 -106220 -93886 87228 186127 -12968 128065 113270 -76768 -28476
14608 -28476 -222758 -370553 -460321 -495854 -321771 -201745 -380025 -294929 -10806 44075
14598 44075 27826 560 -17471 -138345 38546 -59117 -17266 -2416 -160654 -334815 -208524
14587 -208524 -218683 -158659 -366631 -423159 -198283 -92819 28931 -50970 -121341 -127469 -218806
14576 -218806 -233827 -33721 135244 -48619 -64453 7196 -3972 136931 44805 -167382
14566a67382m4917J03670k5753K5027j04845k0218J03694J28364Q1103p8890j20059
14555a20206p9237J48870K41104J25456p9983k31018k17622m4594J02243k35791
14545c90778J4519J71085J60836J00018J19279j13509j22720j6792K3607p8083
14535a32538J346L4324M1144Q3157n1693Q1870M6912N9791K0968l19373k55056
14524c89148m1025K93648M5636J27599J6506j7652n5400k29544n0123O7152R9754
14513a32597n6924q7407j21984K5854J69320j25903O9014K85452M4569M3344j27279
14502a4541k38264J08689l8055O2767J50783J66544J48150J98352k9378r3280
14492D21767l68743k47997L6157K17034L9609j8891J02583r0331k5718M8094Q0796
$$ plain form
14566 -167382 -212299 -108629 -134382 -109355 -214200 -234418 -130724 -2360 78743 -147 -120206
14555 -120206 -199443 -50573 190531 315987 236004 4986 -212636 -257230 -154987 -390778
14545 -390778 -376259 -205174 -44338 55680 174959 61450 -61270 -78062 -54455 -132538
14535 -132538 -131192 -96868 -55724 27433 -24260 57610 104522 164313 185281 -134092 -389148
14524 -389148 -430173 -136525 -90889 36710 53216 35564 -19836 -249380 -299503 -232351 -132597
14513 -132597 -189521 -276928 -398912 -373058 -203738 -329641 -260627 24825 69394 112738 -14541
14502 -14541 -252805 -144116 -182171 -119404 31379 197923 346073 544425 515047 421767
14492 421767 53024 -194973 -158816 58218 97827 78936 181519 91188 65470 113564 194360
14481A94360k12661j86820j41676P247J06725P8200P0581r7278j8050N176j69231
14470c63427k790L08696J57733q6964P8032N0649o3639j71813p315m7463k8404
14459a76705J16133L1115j14090n1701J3562Q6628R2179N8342m9457j5594m3308
14448e2896n7046j2806J5967J34564L9214o6132K51825Q8971l13247j38849k91222
14437d01657K4443K42760L189n7245j21336j1434J35911Q8852l7931Q2177M9185
14426c086J3874K33500r4727J43210n5754k11648j77994L4441J54680J35535q4443
14415H7588k70576J28287J20205O2185j2009j38530J7842l851R918R9397r2946
14404G510k9136M2329j10229j18096j53746J6258K70889J96411k20867k8359J93233
$$ plain form
14481 194360 -18301 -205121 -346797 -339550 -232825 -154625 -84044 -181322 -199372 -194196 -363427
14470 -363427 -366217 -57521 100212 13248 91280 141929 78290 -93523 -100838 -148301 -176705
14459 -176705 -60572 -29457 -143547 -195248 -181686 -95058 -2879 55463 6006 -9588 -52896
14448 -52896 -109942 -122748 -106781 27783 66997 865 252690 341661 28414 -110435 -401657
14437 -401657 -377214 -134454 -131265 -188510 -309846 -321280 -185369 -96517 -134448 -52271 -3086
14426 -3086 10788 244288 149561 292771 237017 25369 -152625 -118184 36496 172031 87588
14415 87588 -182988 -54701 65504 127689 115680 -22850 -5008 -8859 1059 100456 7510
14404 7510 -21626 20703 -89526 -207622 -361368 -345110 -74221 122190 -98677 -127036 66197
14393F6197m0509l9810o3139K5842K1984M6652p0616j38607j78950j9756J96526
14382a94186K63207o5070j4641j44468l3881q0732J96751m3046k52613J19248
14372b49431L33059K6059K8677N8310o0037o6025N5257m2216k1523n9602K02616
14361B05144k96638R231J57829o2678n9146J24336o0628R1096J02374l749p7943
14350A29228j87805M1380K38366L4154l14182j10285K37029J01677M3151o5135
14340A47578j75953p3078R7221K06085j19032k91080n5583N9608K2706j21670
14330c03198J37216J25572j17566J7539K48928J96926J95694p6542j04690L0279
14320C50158K30011q5462j89895O1550O3864j50294l9609l9222j12371r9763p0729
$$ plain form
14393 66197 25688 -14122 -77261 -51419 -29435 17217 -53399 -192006 -370956 -390712 -194186
14382 -194186 69021 3951 -10690 -155158 -189039 -269771 -73020 -116066 -368679 -249431
14372 -249431 83628 109687 138364 196674 136637 70612 125869 83653 62130 2528 205144
14361 205144 -91494 -82263 75566 12888 -46258 78078 17450 108546 210920 207171 129228
14350 129228 -58577 -17197 221169 255323 -58859 -169144 67885 169562 212713 147578
14340 147578 -28375 -101453 -4232 201853 82821 -208259 -263842 -204234 -181528 -303198
14330 -303198 -165982 -40410 -157976 -140437 108491 305417 501111 424569 319879 350158
14320 350158 580169 494707 304812 366362 430226 279932 240323 201101 88730 -11033 -81762
14309h1762k4622k0053l4653r4522K31765K8556q0394J78930M5480K40621n6443
14298C32903r7282n6056J51854J29789r0146j47598r6361j84649J31057j26714
14288e3203j32799J129J05947Q7263q848R1145l4497j52000j74392l8315N1827
14277b56743R5423K4311r7210P6215p7275K56759k8352N732R2836j9051m09451
14266c36806j05078P6249K25052M33526j61305k37403n9320n3601J72532K6222
14256a9932J1534j53383L6115r7735r1789K8845J11188p3223J11851J79657M4904
14245H8032J13620j26889k84474j81709J65388L13411L3191J04529K11439j01106
14235C35432j58485m757J14922k4258j87546k61853j24768J18752K09942J92404
$$ plain form
14309 -81762 -106384 -126437 -161090 -255612 -23847 4709 -75685 103245 148725 389346 332903
14298 332903 235621 179565 331419 461208 371062 223464 127103 -57546 73511 -53203
14288 -53203 -186002 -184873 -78926 8337 -511 90634 56137 -95863 -270255 -308570 -256743
14277 -256743 -161320 -137009 -234219 -158004 -235279 21480 -6872 -1140 91696 72645 -336806
14266 -336806 -441884 -365635 -140583 292943 131638 -105765 -165085 -218686 -46154 -19932
14256 -19932 -8398 -161781 -125666 -223401 -315190 -286345 -175157 -248380 -136529 43128 88032
14245 88032 201652 74763 -209711 -391420 -226032 87379 120570 225099 436538 335432
14235 335432 176947 172190 287112 262854 75308 -186545 -311313 -192561 17381 209785
14225B09785j32787j92873k956J14900j70015k20324j735J09394O8233J03048
14215a15330j04281o927j9023J892O3387o7148r4799R1940J49324l6333N8977
14204g8321L9898J78304K3595j37799q8249Q1363q9711n8841N2360J1522J79954
14193A14075P5924j69868j90856q7526K38614J89192J46171l0609j44073j1519
14183A29525l4648k73820j06891N6078K40591r3926k13080K29946O2523j69801
14173a73503M7971R0563K268j79860K8776k5053J6078J29487k8672K36922N6176
14162B01153j49519n8767n0393k8477L62906J03385k97698k0650J14079j8145
14152A57874p2019q3476k40523j34419K14934K05058j53885K28001J58091l6346
$$ plain form
14225 209785 76998 -115875 -118831 -3931 -173946 -394270 -396005 -286611 -218378 -115330
14215 -115330 -219611 -226538 -245561 -243669 -180282 -247430 -342229 -250289 -100965 -137298 -78321
14204 -78321 -38423 139881 163476 25677 -62572 18791 -70920 -129761 -77401 -65879 114075
14193 114075 189999 20131 -170725 -258251 -19637 169555 315726 285117 141044 129525
14183 129525 94877 -178943 -285834 -229756 10835 -83091 -296171 -66225 -3702 -173503
14173 -173503 -125532 -34969 -32701 -212561 -183785 -208838 -192760 -63273 -91945 144977 201153
14162 201153 51634 -7133 -57526 -86003 276903 380288 82590 61940 176019 157874
14152 157874 85855 2379 -238144 -372563 -157629 47429 -106456 121545 279636 243290
14142B43290O5438j48109j7314J03976q0806j81790l2679o7153k66630j4458J61230
14131b35005k2970j29671J72025J72680N5551o980M8080j250K8785J04431o0429
14120A25247j37697j83385J3256J56627N006o4913r5871l18097k9857Q4706L12932
14109a32046J65394n0646o8830k34018l3199J57004J75203K27730J6766j65707
14099E7651j51675l9916l345j89612o304K83553J31532P1873N5619q9010R4385
14088B14751N7669j19442q6168l0257r0676j6874j55909J4217n1986J25574L16199
14077A77098J83775p7409p9720j48959Q7072J00588j704k50084q9032J02679J85929
14066A90233j10018K30320J23300J885k07631j09047J3846K5255K7492k12229
$$ plain form
14142 243290 308728 160619 143305 247281 166475 -15315 -47994 -115147 -381777 -396235 -235005
14131 -235005 -257975 -387646 -215621 -42941 12610 5630 53710 52460 81245 185676 125247
14120 125247 -12450 -195835 -182579 -25952 -20946 -85859 -181730 -499827 -529684 -444978 -132046
14109 -132046 33348 -17298 -86128 -320146 -353345 -196341 -21138 206592 223358 57651
14099 57651 -94024 -133940 -137285 -326897 -333201 -49648 81884 153757 209376 120366 214751
14088 214751 272420 152978 66810 36553 -54123 -70997 -226906 -212689 -264675 -139101 177098
14077 177098 360873 283464 203744 54785 141857 242445 240741 -9343 -98375 4304 190233
14066 190233 80215 310535 433835 435720 228089 119042 132888 158143 185635 -26594
14056b6594q6856j0638N4651K73504j55197l6890J1783O7143j8480j57622k99900
14045c85096P2112K60616K07784j56838j51740k03531o3478J25675N8809N807
14035b29880J61823L2416J03518m9837P4546j96700j88762r1381R7101K22602
14025f4554j03232m5924J1626N2909m6742J33364j82941o4411K54689J02420P3001
14014A20205r7362J06849p1747p4463k54903J24850J27829r6189j15546K3650
14004b06827K66830N2654k09448M6459J72965P3216j63061r5723J74504m0844
13994G0725J96750m4478k12941l27620R8075R7946J13338j81389k1257J77675
13984c3176J18875k15749m9535J12935P5842O7953k41514J2742Q4186J54895O3765
$$ plain form
14056 -26594 -113450 -124088 -69437 204067 48870 11980 23763 90906 72426 -85196 -385096
14045 -385096 -312984 -52368 155416 -1422 -153162 -356693 -420171 -294496 -235687 -229880
14035 -229880 -68057 -35641 67877 18040 92586 -104114 -292876 -384257 -287156 -64554
14025 -64554 -167786 -213710 -202084 -149175 -195917 -62553 -245494 -309905 -55216 47204 120205
14014 120205 22843 129692 57945 -16518 -271421 -146571 -18742 -114931 -230477 -206827
14004 -206827 60003 112657 -96791 -50332 122633 195849 32788 -62935 111569 70725
13994 70725 267475 222997 10056 -317564 -219489 -121543 -8205 -189594 -210851 -33176
13984 -33176 85699 -130050 -179585 -66650 9192 77145 -164369 -151627 -67441 87454 151219
13973A51219j5365J41823J60516P9153j85916j22146J44590r7253l02864L4828
13963a1415j00871j38419Q7003o2795n0280q1464J28732k9648J77499J14005m0418
13952h071o2657j08247P5177j36301n6012J83802L61128O8412j01484p9946l34593
13941a98792J08635J06417k73806J09122J97986J45329M4088k2351k95308k21525
13931c00205k3710K26475K31054J57959j72946n563J01513r0298O2822q4342q2804
13920A9955J77331n059J45326n1863o0471P5036N8854j06900q7716n7198m2550
13909F4745o8644O1833K4660J15349J08548j11835j89178j9077Q4103m9655j20951
13898a00102J06160M2498j72560j50653O9624P1207K06159P6002p387o4537k6840
$$ plain form
13973 151219 135854 277677 438193 517346 331430 209284 353874 256621 -46243 -11415
13963 -11415 -112286 -250705 -163702 -226497 -276777 -358241 -229509 -259157 -81658 32347 -8071
13952 -8071 -70728 -178975 -103798 -240099 -296111 -112309 248819 317231 215747 135801 -198792
13941 -198792 -90157 16260 -257546 -148424 49562 194891 238979 216628 -78680 -300205
13931 -300205 -323915 -97440 133614 291573 118627 113064 214577 124279 187101 102759 19955
13920 19955 197286 192227 337553 285690 225219 300255 359109 252209 164493 107295 64745
13909 64745 -3899 57934 82594 197943 306491 194656 5478 -13599 70504 20849 -100102
13898 -100102 6058 48556 -124004 -274657 -205033 -133826 72333 148335 140948 76411 49571
13887D9571m0939J8695K09163J07472k21421r3349l3428j59940j01833k545k4486
13876b93040r533O8958J11732j03328n1558r3348L25245L88185J22614Q0097j92732
13865C53292j37331J3374P5864j28773j71134m6754P3654r7248j51118J27975
13855h8199O4062j92269O6905O8254r6276J2608j76486n4960J24009K2876j79084
13844d28560J15106J6020q6401o4486J05251J17714q4929J13787L30122r5557
13834C8067j68823j33247r7209J10502K85706J25200J9716J38069o9893l55459
13824a07371L0297K22526j98134M7102L09019j20033k37364o0236k00382r8224
13814d12800K41372P2480j16436k026Q1037k5897k4725q4697K37776J12325M7765
$$ plain form
13887 49571 8632 27327 236490 343962 122541 29192 -4236 -164176 -266009 -268554 -293040
13876 -293040 -302573 -233615 -121883 -225211 -276769 -370117 -44872 343313 465927 546024 353292
13865 353292 215961 229335 305199 176426 5292 -41462 32192 -65056 -216174 -88199
13855 -88199 -24137 -216406 -149501 -81247 -177523 -164915 -341401 -396361 -272352 -249476 -428560
13844 -428560 -313454 -297434 -383835 -448321 -343070 -225356 -310285 -196498 133624 38067
13834 38067 -130756 -264003 -361212 -250710 34996 160196 179912 317981 248088 -107371
13824 -107371 -77074 145452 -52682 -5580 303439 183406 -53958 -114194 -314576 -412800
13814 -412800 -171428 -98948 -215384 -217410 -136373 -162270 -186995 -271692 -33916 78409 126174
13803A26174j65274k97433j02384J09965P8230l9518J57214j94348J03120l7187
13793b61441J68305K40270Q7090k05257K6480M043R880m02433r0653J8827K09382
13782a95507K70080j53814l12588O3407J86043R7232j18740m9875J01039K66803
13772A54080K85181r7065k62345j22022K3350J5099M9075Q1854q0781n6328M3629
13761C3727p5917N960L384M8237L6577l318r2750J08978m1510N8017J07665k28935
13749c9885j31927J87395J73938j09006l22003L2J15080q5701K55620K21700l00924
13738c5681j97458N9677k6526K08499K61777j2647k07661J0013K16608r202r0625
13727A76774k34152k31746K32118R3658Q0188K25774Q1455J461p7725j08558J46340
$$ plain form
13803 126174 -39100 -336533 -438917 -328952 -250722 -290240 -133026 -327374 -224254 -261441
13793 -261441 -93136 147134 234224 28967 55447 59490 69370 -333063 -423716 -404889 -195507
13782 -195507 74573 -79241 -391829 -328422 -142379 -45147 -163887 -213762 -112723 154080
13772 154080 439261 342196 79851 -42171 -18821 -3722 45353 127207 46426 -9902 33727
13761 33727 -42190 -36230 -32846 15391 51968 48650 -44100 64878 23368 81385 189050 -39885
13749 -39885 -171812 15583 189521 80515 -241488 -241456 -126376 -212077 43543 265243 -35681
13738 -35681 -233139 -173462 -199988 8511 270288 257641 49980 59993 276601 267399 176774
13727 176774 -57378 -289124 -57006 36652 116840 342614 424069 425530 347805 239247 385587
13716C85587J57765j79470L1076o0337j83445p3173m4440N1419m5545j53269p1309
13705a85141k31191O464j11199Q1336K87940L37997k15513l48478J67001J01839
13695a08945p7927N1102L5048J7333O0505k4721j59453o6737K9378J07997J77720
13684D1300j88398L5204R2186L30736J02966k91570l50354j6953J74049J87883
13674A17049j19303p7071j327j01966r4262K44541M526q7039m4979K88564Q5673
13663B14406J36134N9236j59143P9211o1321r2972j81166L4757l8069j65856K0846
13652a53937J66645j45179R7919K53844P9351j3546q8038r767K67449o6315k25543
13641A62883Q4704j34356R6319j87874j37675l4293J05712j5761K148j09433p6832
$$ plain form
13716 385587 543352 363882 394958 334621 151176 78003 33563 84982 39437 -113832 -185141
13705 -185141 -416332 -409868 -521067 -439731 -151791 186206 -29307 -377785 -210784 -108945
13695 -108945 -186872 -135770 -100722 -83389 -22884 -47605 -207058 -273795 -244417 -136420 41300
13684 41300 -147098 -111894 -19708 311028 413994 122424 -227930 -244883 -70834 117049
13674 117049 -2254 -79325 -80652 -182618 -276880 -32339 -27813 -114852 -159831 128733 214406
13663 214406 350540 409776 250633 329844 268523 175551 -5615 29142 -8927 -174783 -153937
13652 -153937 12708 -132471 -34552 219292 298643 285097 197059 187292 454741 388426 162883
13641 162883 247587 113231 209550 21676 -115999 -150292 -44580 -60341 -58193 -167626 -244458
13630b44458J11031r5741j88984j04447J35781K44447J86708J4896j66804J14100
13620F529L23934J61042l2876k78011j75546K17355q3688j07051q3139K1084J9483
13609a0884R319J18112j14390k22247P5609K08060J15852J12389j94462k39651
13599a42293J1217O0778m3125k9602O9243J80782R4734o0628j12048j9992K4760
13588C3826J2768O6968k05824q3484J20521J27761o2187P5370j13584n8831o7118
13577a53814J14137R7137p4345L7976J0912L4616J07962P4649k2490j66498j73302
13566a13060R604J06230J14396k4409j21019o1656n243Q9822J06792k7879k02410
13555a28832K7509K02256O5898j84724j63757j7931K24540P636J19704J82247
$$ plain form
13630 -244458 -133427 -229168 -418152 -522599 -386818 -142371 44337 59233 -107571 6529
13620 6529 330463 491505 458629 180618 5072 222427 138739 31688 -51451 -30367 -10884
13609 -10884 -1565 116547 2157 -220090 -144481 63579 179431 291820 97358 -142293
13599 -142293 -131076 -70298 -113423 -143025 -73782 107000 201734 141106 29058 9066 33826
13588 33826 46594 113562 -92262 -175746 -55225 72536 10349 85719 -27865 -86696 -153814
13577 -153814 -39677 57460 -16885 21091 32003 66619 174581 249230 226740 60242 -113060
13566 -113060 -103456 2774 117170 92761 -28258 -89914 -95157 -5335 101457 73578 -128832
13555 -128832 -101323 100933 166831 -17893 -181650 -199581 24959 32595 152299 334546
13545C34546N0031l95369l946P8072m6455J74380J05001P8465N8676j49941J34836
13534D18296r2826m5873K2827N8571j42520q314L0023q7987N6797l6060k07173
13523c4239P8392j45345j60056k3035L2772j5759j85665O783J31221J13998l6600
13512b37533J66339R7361j21516j9358Q7838k19442r5375n726n1923K37646q9015
13501b50704j09669j79020K05138K25334m3223k37316k74495J50713M12193r0156
13491a91205n6811J33232L1810o3386R2361K07108J8477l76843l65469o004K17030
13480c59700L27449L2389O9926J92462j21847k63645J21198M8856k14206J5989
13470a51129Q7507J29350N7974o4245Q4253J58105R6106O5084m3620j96473j60052
$$ plain form
13545 334546 384577 -10792 -14738 63334 16879 191259 296260 374725 433401 283460 418296
13534 418296 325470 279597 302424 360995 218475 210161 240184 152197 208994 172934 -34239
13523 -34239 44153 -101192 -261248 -284283 -251511 -267270 -452935 -446152 -314931 -200933 -237533
13512 -237533 -71194 26167 -95349 -114707 -26869 -246311 -341686 -347412 -399335 -161689 -250704
13501 -250704 -360373 -539393 -334255 -108921 -152144 -389460 -663955 -513242 -101049 -191205
13491 -191205 -248016 -114784 -82974 -146360 -53999 153109 171586 -205257 -570726 -576730 -359700
13480 -359700 -32251 138 70064 262526 140679 -122966 -1768 47088 -167118 -151129
13470 -151129 -63622 65728 123702 59457 143710 301815 397921 463005 419385 222912 62860
13459F2860N8291J3596k83872j96759K03734O4755L7131L1099K21235J98837r3105
13448C17802l79363l83797k18655K57638L98172L07498l3582j65499p4214q6344
13438f0344n3918J23475K19403p2752j02216j74389M6435L3901J16678l6777l4597
13427D899k3198n6901J24278n0297j01215k8026l00264o2627K79018N3635O4407
13416i6291j83962p0499j95458K47601L17960l2808j50955R0122N897j0868j09188
13405a88449l3370K4421J93066P0796R4131r7136K1208J81935K3159J1356J27923
13394D29040k8218k33685j39117N633Q8129J02403j30742n6780j22557K4070M7273
13383a4551j8174J12960M3676j03396r9558j98216J0372J69342K18332p7684L6733
$$ plain form
13459 62860 121151 134747 -149125 -345884 -142150 -77395 -40264 -9165 212070 410907 317802
13448 317802 -61561 -445358 -664013 -406375 -8203 299295 265713 100214 26000 -60344
13438 -60344 -114262 9213 228616 155864 53648 -120741 -74306 -40405 76273 39496 4899
13427 4899 -18299 -75200 49078 -1219 -102434 -130460 -430724 -493351 -214333 -160698 -96291
13416 -96291 -280253 -350752 -546210 -298609 19351 -13457 -164412 -74290 -68393 -79261 -188449
13405 -188449 -221819 -197398 -4332 66464 160595 63459 84667 266602 289761 301117 429040
13394 429040 400822 167137 28020 33653 121782 224185 93443 36663 -85894 -61824 -14551
13383 -14551 -32725 80235 123911 20515 -79043 -277259 -266887 -97545 120787 43103 79836
13372G9836Q8993O9766K0152j38224j00138k7435M6684j23617o3265M841K12990
13361G0583O5586J493K33157M9427l69019j10870L8799k1632K00079J148k88317
13350a29566r4611J25170J70202K0110k18142l8909M4745p7193J6154J47631M9719
13339A5310J71020r9618P245k6091k8664m1463O5711n9331j6342K2393N7361J42779
13327B10310L5576K8267k62829k52633K74069p7525k8706J11293o8151j05360
13317a35689P8493k9801J54111O5648n6666p0872j86489J46747K98750n6190m6920
13306A61122o0817L0387O0364N0635k24266q3151j08399J64890K56962M61509
13296G09236J18960j80123k26039k55071l2792L6315l59484j4748K45950J23987
$$ plain form
13372 79836 168829 238595 258747 120523 20385 -7050 39634 -83983 -147248 -142407 70583
13361 70583 136169 137662 370819 420246 51227 -59643 -20844 -42476 157603 158751 -129566
13350 -129566 -224177 -99007 71195 91305 -126837 -165746 -121001 -198194 -182040 -34409 15310
13339 15310 186330 86712 93957 67866 39202 -2261 63450 4119 -12223 10170 67531 210310
13327 210310 245886 274153 11324 -241309 32760 -44765 -73471 37822 -30329 -135689
13317 -135689 -57196 -86997 67114 132762 76096 5224 -181265 -34518 264232 208042 161122
13306 161122 100305 130692 191056 241691 17425 -65726 -174125 -9235 247727 709236
13296 709236 828196 648073 422034 166963 134171 170486 -188998 -203746 42204 166191
13286A66191P2500j80737j90925n504J55087K5586l0791j4625n3383l28997o0238
13275d45836L67900J40482J21827Q8147m6706j50931J56858k0479k22514o1775
13265g3027O4942n1429j22387q9336J1643J19412N4913N1398K34497J05182Q799
13254C14607J05299j20624j65517j35429j14248K84235P8430k60184N6534L7816
13244H0919J1645Q2857R9310j18920k80207j85251j02989J47783J49393k9161
13234a44621M4000j60877J49121K35490j9446k68283k54766P0413K43472N8879
13224d6618N2234k8819K2203j95613p3j7494k6888J80358Q0743J02720M3585o0099
13212A06239p807j49944k2354m7327j4207J65111P3514o895P2157J21807j19173
$$ plain form
13286 166191 238691 57954 -132971 -138475 16612 42198 11407 -3218 -56601 -385598 -445836
13275 -445836 -77936 62546 184373 272520 225814 74883 231741 211262 -11252 -73027
13265 -73027 -8085 -59514 -181901 -271237 -259594 -140182 -85269 -33871 200626 305808 314607
13254 314607 419906 299282 133765 -1664 -115912 168323 246753 -13431 43103 80919
13244 80919 92564 175421 274731 155811 -124396 -309647 -412636 -264853 -115460 -144621
13234 -144621 -100621 -261498 -112377 123113 103667 -164616 -419382 -348969 -105497 -46618
13224 -46618 5616 -23203 -1000 -196613 -196686 -214180 -241068 -60710 20033 122753 166338 106239
13212 106239 98432 -51512 -73866 -121193 -135400 29711 103225 96330 168487 290294 171121
13201A71121K1517n4094k72197k09244J49955J95895k461j63927m18417K98314
13191b83538K59658k8750k46020J9274J47920M7258Q8613J73179J48821j66174
13181A60241j20521p8199n3596J0987p7528O8971J37325j5743P9271R4544m1800
13170A63952p9019o405k27576r1485p3384R4403J52941k18526M1824J06506K54595
13159A17826k3173j25838o8360O3093k0971P9816j62600N1994J86792P1029j52434
13148A7174j71210J83361P5227P236j687J17583R5713l13433l84124j30631J05560
13137c99231J98415J36608M798k9964P2191J3196J18294N6735O3350p3342l8450
13126A22600j54601P798M0528j95429k02684J8787J93104J85206m940Q3577K26882
$$ plain form
13201 171121 192638 138544 -133653 -342897 -192942 2953 492 -163435 -581852 -283538
13191 -283538 -23880 -52630 -298650 -279376 -131456 -84198 4415 177594 326415 160241
13181 160241 39720 -38479 -92075 -81088 -158616 -89645 47680 31937 111208 205752 163952
13170 163952 84933 78528 -149048 -240533 -313917 -219514 -66573 -285099 -243275 -136769 117826
13159 117826 94653 -31185 -99545 -36452 -57423 22393 -140207 -88213 98579 169608 17174
13148 17174 -154036 29325 104552 111788 110101 227684 323397 9964 -374160 -504791 -399231
13137 -399231 -200816 -64208 -59410 -89374 -17183 -3987 114307 171042 234392 161050 122600
13126 122600 -32001 -24203 16325 -179104 -381788 -363001 -169897 15309 10369 93946 320828
13115C20828m2377j8241o4980j70915k63222m2769n5368p5168r0236O9859O5780
13104c66809J83839K03031o4240J29811j41016j23995o1854J32410J29632M2646
13094F3455m0115j48246k4321K5622m9248J4612j51524m6565N8316N0268R6053
13083a51693O8851j4328O1309R2502k63194O4445P1955k39180L0502J00638J74059
13072d134j4981l9918J7060K09377j47278l5605O9842O7754Q5702L4665k2022
13061B20462l9979k39496K3069J73208R2716p4571j47644p72K30029J19976J79767
13050E36765k7448j67331m7317N8158j01599l51034J20311Q1543J69462m9768
13040B21742j83172J95120P0031j04451k8253L8692k32548j75392j5091J67038
$$ plain form
13115 320828 278451 260210 195230 24315 -238907 -281676 -337044 -412212 -502448 -432589 -366809
13104 -366809 -182970 20061 -44179 85632 -55384 -179379 -241233 -108823 20809 63455
13094 63455 23340 -124906 -149227 -123605 -172853 -158241 -309765 -356330 -298014 -247746 -151693
13083 -151693 -82842 -97170 -35861 56641 -206553 -142108 -70153 -309333 -278831 -178193 -4134
13072 -4134 -19115 -59033 -41973 167404 20126 -15479 54363 122117 207819 242484 220462
13061 220462 180483 -59013 -35944 137264 229980 155409 7765 6993 237022 356998 536765
13050 536765 509317 341986 294669 352827 251228 -99806 20505 102048 271510 221742
13040 221742 38570 233690 303721 199270 171017 209709 -22839 -198231 -213322 -46284
13030d6284M69497r1941k02964k42345j98815J08437J50668K1440N0072j01084
13020h3319K3818j33084k6163J63541K08855r38K8855Q5763O8595J06516o7355
13009C75084j08930l5509j46418r855J0674m7220R5340o248J1018n146k4553j21113
12997a2876j526J26560J94437p1855j03935L6664o5953R5407J9282k5237J46200
12986C37168j58663r6715J14882J05168k58357j00303R8013J40537K25141O7698
12976D74569j84465m43750k53289j71578J01426K41562J17874L7157R7377j60773
12966a43890J21694J30574o3092k56839K35884j6440m81788r0337K46887K91002
12956b6345j91122j59154k9954K28426k0029R5208J68436J54548n0658j03796
$$ plain form
13030 -46284 423213 331272 128308 -114037 -312852 -204415 -53747 -32307 17765 -83319
13020 -83319 -59501 -192585 -218748 -55207 153648 152710 181565 267328 335923 442439 375084
13009 375084 266154 230645 84227 74372 85046 37826 133166 126918 137936 132790 108237 -12876
12997 -12876 -14402 112158 306595 234740 130805 167469 101516 196923 216205 190968 337168
12986 337168 178505 81790 196672 301840 43483 -56820 41193 181730 406871 474569
12976 474569 290104 -153646 -406935 -578513 -477087 -235525 -117651 -80494 16883 -143890
12966 -143890 -22196 108378 45286 -211553 24331 7891 -473897 -564234 -317347 -26345
12956 -26345 -217467 -376621 -406575 -178149 -198178 -102970 65466 220014 169356 65560
12946F5560l4652J32230Q4961p6534j04414r7002p7001n3835J01566q8923n3839
12935b01883J0712L69153J66740j53999K0388l8587k0720j32032p1446j9657m4091
12924a15422k0492n7425K97262J76984J89681J98743r4341j43023k66701k36922
12914g1656j48607j44073j33845j88609K06715M34197M93315M543o1986j5186
12904C74808q5037k03041M2899l12391j65507K11613K19467L58426M6565M293
12894D92095m1890k08962j98738r1091j95872M9331M31912J93257l55926j66708
12884i2592J3624M6608k4230J61137N5631l5964O4877r4799j5132j36213k20346
12873b77399J11405n8688k2774K33360L23058n9002j70450J41166j50995j17681
$$ plain form
12946 65560 30908 163138 248099 171565 67151 -29851 -106852 -160687 -59121 -148044 -201883
12935 -201883 -191171 177982 344722 190723 211111 172524 151804 19772 -51674 -71331 -115422
12924 -115422 -135914 -193339 103923 280907 470588 669331 574990 431967 165266 -71656
12914 -71656 -220263 -364336 -498181 -686790 -480075 -45878 447437 451980 389994 374808
12904 374808 289771 86730 129629 -182762 -348269 -136656 82811 441237 487802 492095
12894 492095 450205 241243 42505 -48586 -244458 -195127 236785 430042 74116 -92592
12884 -92592 -78968 -32360 -56590 104547 160178 124214 189091 94292 79160 -57053 -277399
12873 -277399 -165994 -224682 -247456 -14096 308962 249960 79510 220676 69681 -48000
12863d8000r4805j125K86703N1104k2932M1420k01380j55749K82O4064n0636J12363
12851a8691M6558q3251r8975j0060l6816j48966j15503l8070J44265j52121J55145
12840c56485K64899J27548R8605N9279j62796p2644J23486o3451k3759l40764
12830c46082j72884M06482J89249J79081J53630k22802j36360o2461Q5501K3780
12820I7134n3113k3384K85147K1949p2248j22544j4135K9330L3663m7388q4009
12809E0402J07418Q4807J3412N0481k9657n6352p4844j48716L4228J70744L6402
12798B38325j0454k09306j0685J59703J69738k04605k76147j58665J26284M8074
12788a27738r3066M3764N185k38135j87745K89368K75933m005J13996m0182m2296
$$ plain form
12863 -48000 -142805 -143930 142773 193877 170945 212365 10985 -144764 -144482 -80418 -131054 -18691
12851 -18691 27867 -55384 -154359 -164419 -201235 -350201 -465704 -503774 -359509 -511630 -356485
12840 -356485 -91586 35962 134567 193846 31050 -41594 81892 18441 -5318 -346082
12830 -346082 -518966 -112484 76765 255846 409476 186674 50314 -12147 73354 97134
12820 97134 44021 20637 305784 327733 255485 132941 118806 148136 181799 134411 50402
12809 50402 157820 242627 256039 306520 276863 220511 145667 -3049 31179 201923 238325
12798 238325 227871 18565 7880 167583 337321 132716 -143431 -302096 -175812 -127738
12788 -127738 -220804 -177040 -171855 -409990 -597735 -308367 -32434 -36439 77557 37375 -4921
12777d921J29347o3517J11523J60529k2132K5694j58897j32890N6424O4790O7365
12766B33315j38273J69506O632j99240J2216j78730K4240J95956j52087j62189
12756a88654J73223J61543r5582o2631q3707J0117M0041j72112J26886K37207
12746A46331K1361j60687R5883J48191j11704r2126o2082j38767l15246O7929
12736d00917K70173J47115m4991J2700L6110J42227J07508J06242k87348k57909
12726a69090M9730m0208P759J35869J02319o0047k89892k15800K76269K6617Q9610
12715h6864K60839K17689l0725j75528K13688o1748K7784k27028j72502k55250
12705b89645J42004O9656J15019L26088K00968j20336o2279L9595j21659l3683
$$ plain form
12777 -4921 124426 60909 172432 332961 310829 336523 177626 44736 101160 165950 233315
12766 233315 95042 264548 271180 71940 84156 -94574 -70334 125622 -26465 -188654
12756 -188654 -15431 146112 50530 -12101 -95808 -85691 -45650 -217762 -90876 146331
12746 146331 167692 7005 102888 251079 139375 47249 -14833 -153600 -468846 -400917
12736 -400917 -130744 16371 -28620 -15920 20190 162417 269925 376167 88819 -169090
12726 -169090 -119360 -159568 -151809 -15940 86379 26332 -263560 -479360 -203091 -176474 -86864
12715 -86864 173975 391664 360939 185411 399099 337351 365135 138107 -34395 -289645
12705 -289645 -147641 -77985 37034 363122 564090 443754 381475 421070 299411 265728
12695B65728K7194m0615n2834m224k12250j77417M3440J8731p2412j5949J24893
12684i5715m032j16980K37631j73501J97980L86851r4578j20683n9626k07552
12674e0205P3876J87303J25728j43647o7138J74846j32553j2020k1633q3081j26064
12663g4588n5712J69129K0726P9568O2407j04514k69911J36858J73826j34438
12653C351K28340K37560n6061j73517j7824K4425j2171j38203R645j86635j46576
12642b27666Q943l123k5717J96672J85673R7196K09012k4296n0401p9223l80193
12631i3123M9040J43275K0925L9935l08375n5139l1248J42204J94627l1279j9470
12620E1372K2376k54195R3356j27096J67539m0363j16485J95319Q5187j7509R6045
$$ plain form
12695 265728 292922 252307 199473 195249 -17001 -194418 -150978 -132247 -204659 -220608 -95715
12684 -95715 -99747 -216727 20904 -152597 45383 432234 337656 216973 157347 -50205
12674 -50205 23671 210974 336702 193055 125917 300763 168210 156190 134557 51476 -74588
12663 -74588 -130300 38829 59555 139123 201530 97016 -172895 -36037 137789 3351
12653 3351 231691 469251 413190 239673 221849 246274 234103 95900 105545 -81090 -227666
12642 -227666 -218723 -221846 -247563 -50891 134782 231978 440990 416694 366293 287070 -93123
12631 -93123 -44083 99192 120117 160052 -148323 -203462 -234710 -92506 102121 70842 51372
12620 51372 73748 -180447 -87091 -214187 -46648 -87011 -203496 -8177 77010 59501 155546
12609A55546j44851j89165Q6110L34195p7050j90968r2117K4526J35309K1024
12599F2559J4633l5432J42732P2796K18545L2705q1995j37128k93455j27617J77671
12588D6014k969m9478p3483J97287M3497J67742Q4373q3503K3695j60786j05019
12577H7370Q5760j41078j63259M4480Q9486l1614n4228l6865M0362j53327r3417
12566c26330K13287K19610K74317K56425o5405k46096l07399j11691J64931K6047
12556I7696M916N040k0534j4089j45211q6216j29160M053O9654K18460P966K5223
12544C7798R8943K35393J01645J45456k53046p2928Q1631R8856k11278k118l02263
12533d1911j93797N9304L4864K49780K63595j3735K16976K2141l38045k05367
$$ plain form
12609 155546 10695 -178470 -92360 241835 164785 -26183 -118300 -93774 41535 62559
12599 62559 77192 41760 184492 257288 475833 508538 426543 289415 -4040 -131657 46014
12588 46014 43045 -6433 -79916 117371 160868 328610 412983 329480 353175 192389 87370
12577 87370 173130 32052 -131207 -86727 2759 -28855 -83083 -119948 -79586 -232913 -326330
12566 -326330 -113043 106567 380884 637309 571904 325808 18409 -93282 71649 97696
12556 97696 102612 107652 87118 73029 -72182 -158398 -287558 -283505 -213851 4609 12575 37798
12544 37798 136741 372134 473779 619235 366189 293261 374892 473748 262470 260352 -41911
12533 -41911 -235708 -176404 -141540 108240 371835 358100 575076 597217 259172 53805
12523E3805J98908L94027j60435l00749m610j38414M4606J02310j4573J45398
12513C20273q5135n6823P4793q1630k25191k663K2887J86508J58052J35161k23913
12502B22319o2795K20685L9907j57029L2846k80245k9505M9220k25194p7369J95964
12491g1196j3859J49027K79033J11677j53957Q0848q931m2052r0125N5454J36915
12480D32834J06059k37821k42356p988M7557j22801K32010K58789L8714m10608
12470I4389L9271k8392k2919J53259Q1404J61324j8792r7260m5200j0683j4039
12459B92362j85330j13066r7071j04288Q6668R4797k5582J04417m4222L5904p6754
12448c2165n3500K01560J6005j67627o9810q5030K31393K07898O8731q6124O5799
$$ plain form
12523 53805 252713 646740 486305 185556 180946 42532 87138 189448 174875 320273
12513 320273 235138 178315 253108 171478 -53713 -56376 -33489 153019 311071 446232 222319
12502 222319 159524 380209 420116 263087 295933 15688 -13817 35403 -189791 -267160 -71196
12491 -71196 -85055 63972 343005 454682 300725 381573 372642 330590 240465 295919 432834
12480 432834 538893 301072 58716 50728 98285 -24516 207494 466283 504997 94389
12470 94389 133660 105268 82349 235608 317012 478336 459544 362284 317084 306401 292362
12459 292362 107032 -6034 -103105 -207393 -120725 -25928 -51510 52907 8685 44589 -32165
12448 -32165 -85665 115895 131900 -35727 -105537 -190567 40826 248724 317455 231331 297130
12437B97130j20900k0187J66729J38004q7601k16197j14541O9450K21436J57720
12427D91043Q7367p1130l3374L5883k98629p1404j9580Q5883K83983R8523j05318
12416D83247k67922k20056K11044L9905o8023K01704m6108R8499J05623J6655
12406E54568k84063l13314J4873j21232o5886J71929J72378j60369j23806L7559
12396a17363J06550j12283K03074K14577j54137n2834K30680J82776j08076k97553
12386I5411O2201j51665l59658N2859J25588j14611K63723K02815P7897Q2166
12376C36726l8884o2035J35632J70390M0706J1302j1218k28100j19104J16488
12366C51903j39631P4729n176P5273J7652k8363q9461j7631j82285q5698K46697
$$ plain form
12437 297130 176230 156043 322772 460776 373175 156978 42437 111887 333323 491043
12427 491043 578410 507280 473906 509789 211160 139756 120176 206059 490042 588565 483247
12416 483247 215325 -4731 206313 246218 178195 379899 333791 432290 537913 554568
12406 554568 270505 -42809 -27936 -149168 -215054 -43125 129253 -31116 -154922 -117363
12396 -117363 -10813 -123096 79978 294555 140418 87584 318264 501040 392964 95411
12386 95411 157612 5947 -353711 -300852 -175264 -289875 -26152 176663 254560 336726
12376 336726 297842 235807 371439 541829 582535 593837 582619 354519 235415 351903
12366 351903 212272 287001 281825 357098 374750 346387 256926 239295 57010 -28688 218009
12355B18009L96819q0650m5135k3827J84036O4966j93563J43603k2707k88996
12345C52555q4174J14783m0467j8702J37407J57520N3930K2362j90836L9367o6989
12334D76756k28185J39327J25936q3089l2268m8504m0233J18286J41940k70128
12324B99838n5736j1004J68958J06079N430M0006K06725l44582K5724L13014P8034
12313H32486j16399p0860P8221N1989j97485q8909J19026l3621o6596j26523j89531
12302A91798J00205J90971P5467j7265J20113k43822j67963j4769K5628m0037
12292B20326k948K5942m7309j2790j0524K25125r532R5884o4232k12275j38787
12281F8880L04960L02674q1821j54392k40949O4414r1274M3296K945R1460K55109
$$ plain form
12355 218009 614828 534178 489043 465216 649252 714218 520655 664258 641551 352555
12345 352555 268381 383164 342697 323995 461402 618922 672852 695214 504378 543745 476756
12334 476756 248571 387898 513834 430745 398477 349973 309740 428026 569966 299838
12324 299838 244102 233098 402056 508135 513565 553571 760296 415714 441438 754452 832486
12313 832486 716087 645227 723448 775437 577952 489043 608069 574448 507852 381329 191798
12302 191798 292003 482974 558441 541176 661289 417467 249504 234735 260363 220326
12292 220326 217378 243320 196011 183221 172697 397822 388290 484174 419942 207667 68880
12281 68880 373840 676514 594693 440301 199352 263766 172492 215788 218733 310193 565302
12270E65302O3940j6852J04236K37303j90699m32517L3957o5402j35167J74328
12260C38429J13803J47318K3826k63159K7829J10251L690l936J58236L1437j23012
12249E64712j07720j44501Q0941J51415Q1444J35493p6986j27329M4467n2031
12239E49905K39325J04433k31062j78579M7846K5355J04221J2077K360J44428
12229H20309l11186M6381K8536K4878R5116j67011J29322R99k9510K61243j30720
12218G68357k74818o7032J69399R4842J15564j12618q9065j35093q7053N4298
12208D36781K84144J46539J43084R3722J09840n1588P5766j96872j24199M59766
12198A376983o9396j12264k27638k90533J62931J32849n9835N8084q3992p9167
$$ plain form
12270 565302 629242 612390 716626 953929 763230 330713 364670 299268 164101 338429
12260 338429 452232 599550 623376 360217 388046 498297 501987 498051 656287 687724 564712
12249 564712 456992 312491 393432 544847 626291 761784 684798 557469 601936 549905
12239 549905 789230 893663 662601 484022 531868 557223 661444 673521 675881 820309
12229 820309 509123 555504 584040 608918 704034 537023 666345 667344 637834 899077 768357
12218 768357 493539 426507 595906 690748 806312 693694 604629 469536 382483 436781
12208 436781 720925 867464 1010548 1104270 1214110 1162522 1238288 1041416 917217 1376983
12198 1376983 1307587 1195323 967685 677152 840083 972932 913097 971181 887189 808022
12188H08022m9815J88876Q7808J05012j22346r6415K80937L20390j39128r7207
12178A286134p3798j5746m4437n1759P4413q4660j23945K42731K12372q3527q6114
12167A251664n7201n2316j69474L04224M5066N2374l825k0285j12974J0280m2128
12156A205405m8876n9024P4698K8600K9648K6763N5278r4190o4666K66317k1910
12145A398043l88293N2843K15587J66568O1551K33411o4957j74888j0138j8686
12135A471041J22027N7988O0148M4456k49302k34863K9721j68506k55536j13841
12125G63333J93631K29969K51093J34650q0496o7825N369k8291k2153K1683N5222
12114A456185J05006j85322q4328N4770J32855r7729k37249L32879J77411J6033
$$ plain form
12188 808022 758207 947083 1034891 1139903 1017557 921142 1202079 1522469 1383341 1286134
12178 1286134 1212336 1196590 1152153 1100394 1174807 1090147 966202 1208933 1421305 1337778 1251664
12167 1251664 1194463 1142147 972673 1276897 1321963 1374337 1370512 1350227 1237253 1247533 1205405
12156 1205405 1156529 1097505 1172203 1200803 1230451 1257214 1312492 1218302 1153636 1419953 1398043
12145 1398043 1009750 1062593 1278180 1444748 1506299 1739710 1674753 1499865 1489727 1471041
12135 1471041 1593068 1651056 1711204 1755660 1506358 1271495 1301216 1132710 877174 763333
12125 763333 956964 1186933 1438026 1572676 1492180 1424355 1429724 1401433 1379280 1400963 1456185
12114 1456185 1561191 1375869 1291541 1346311 1479166 1381437 1144188 1477067 1654478 1670511
12104A670511q044l0349j72569J5085Q360J46209L2400R4615O6453J90435r9214
12093A913892M7632p977j02425k5145M0107l7077J69901j50023l6639K89321J45164
12082B246731J25646k3975j78389J256J2183K7602m6080O1801J7974M8044P4466
12071B367259K97225q110J19023J39816M8268k23939j00237K3539K20927K45079
12061C128850O772j20173k0159J07160P4950L1432J14159Q922j1821P9383K46373
12050C645848J99628j45818j29658m7439K00889m3707k2587J29433K62435Q8689
12040D137713q0589J64372J80073J41203P1629J81240J23227M4732J57775n6847
12030E064528n7585K0986J91972J79628J20473O0014K5634J51589L47044L47350
$$ plain form
12104 1670511 1662467 1632118 1459549 1474634 1482994 1629203 1661603 1756218 1822671 2013106 1913892
12093 1913892 1961524 1953547 1851122 1825977 1866084 1829007 1998908 1848885 1812246 2101567 2246731
12082 2246731 2372377 2348402 2170013 2171269 2183452 2211054 2164974 2226775 2244749 2292793 2367259
12071 2367259 2664484 2656374 2775397 2915213 2963481 2739542 2639305 2662844 2883771 3128850
12061 3128850 3135622 3015449 2995290 3102450 3177400 3208832 3322991 3331913 3320092 3399475 3645848
12050 3645848 3845476 3699658 3570000 3522561 3723450 3679743 3657156 3786589 4049024 4137713
12040 4137713 4057124 4221496 4401569 4542772 4614401 4795641 4918868 4963600 5121375 5064528
12030 5064528 5006943 5027929 5219901 5399529 5520002 5580016 5605650 5757239 6104283 6451633
12020F451633J52407k906n0177N1516K07867J68618L79952n395P5816J77384J35373
12009G742088n9175J7327L54339J86120J58043J17265L27427M59257K42611O4438
11999I609740J72487J50622R9319L59931L66849N7671K07530K64212J50470M05632
11989A1844463K69254M014K97103M84813L68273L54649R4132K24261N56693J99406
11979A4697061L89791L66544L24324K57260N41552P97615O82685M26808J90696
11970A8674336N27993N94968P31775P40329O38806O59539P11826J059637N78219
11961B4917428O80981Q93323R79936J110697J150117J132264J028900J340659
11953C3234305J274104J232884J336700J687635J779651K067810K086188K123476
$$ plain form
12020 6451633 6604040 6601134 6550957 6602473 6810340 6978958 7358910 7353515 7429331 7606715 7742088
12009 7742088 7682913 7700240 8054579 8240699 8398742 8516007 8843434 9302691 9545302 9609740
11999 9609740 9782227 9932849 10032168 10392099 10758948 10816619 11024149 11288361 11438831 11844463
11989 11844463 12113717 12117731 12414834 12899647 13267920 13622569 13716701 13940962 14497655 14697061
11979 14697061 15086852 15453396 15777720 16034980 16576532 17374147 18056832 18483640 18674336
11970 18674336 19202329 19797297 20529072 21269401 21908207 22567746 23279572 24339209 24917428
11961 24917428 25598409 26491732 27471668 28582365 29732482 30864746 31893646 33234305
11953 33234305 34508409 35741293 37077993 38765628 40545279 42613089 44699277 46822753
11945D6822753K391233K991698K856809K907921K972564L226902L862532M450332
11937G2482744M673198N064282N279179N832760O222828P098110P525107Q075445
11929A22253653Q861125R200122R786324J0557209J1016363J1327954J1568617
11922A94571367J1754603J1394247J1034802J0191603Q911229P350309N579426
11915B60787586L946231J813029j99068j699928l381999m978370n851981o778787
11907B43656713p487190p851830q288303q129784p888457p443041p304727p073592
11899A82189789o486094o205076n847376n441113n377963m833083m474311m481669
11891A39043104m316454l698448l549277l655117l473848l335453l096990k921394
$$ plain form
11945 46822753 49213986 52205684 55062493 57970414 60942978 64169880 68032412 72482744
11937 72482744 77155942 82220224 87499403 93332163 99554991 106653101 114178208 122253653
11929 122253653 131114778 140314900 150101224 160658433 171674796 183002750 194571367
11922 194571367 206325970 217720217 228755019 238946622 247857851 255208160 260787586
11915 260787586 264733817 266546846 266347778 264647850 261265851 256287481 250435500 243656713
11907 243656713 236169523 228317693 220029390 211899606 204011149 196568108 189263381 182189789
11899 182189789 175703695 169498619 163651243 158210130 152832167 147999084 143524773 139043104
11891 139043104 134726650 131028202 127478925 123823808 120349960 117014507 113917517 110996123
11883A10996123k721907k653117k580541k829783k760087k759625k543246k638815
11875H9509002k552050k476607k671826k691662k646387k555342k335487k407957
11867F9171684k349861k305437k232944k078782k057535j817374j879794j976868
11859E2473089j739386j579622j666088j744400j768665j746912j647456j387358
11851C9193202j012205j177605j414663j311553j274223j152827j065133p17804
11843C0067189r60309j189285j090290j027944j042983q25738p21500n48644q25740
11834B1834756o08481m48479p48650p26180o13441p34214l57713m31004k31478
11825A6935116m21007o74764m89961m64161n56498m35684m99808n54585k33886
$$ plain form
11883 110996123 108274216 105621099 103040558 100210775 97450688 94691063 92147817 89509002
11875 89509002 86956952 84480345 81808519 79116857 76470470 73915128 71579641 69171684
11867 69171684 66821823 64516386 62283442 60204660 58147125 56329751 54449957 52473089
11859 52473089 50733703 49154081 47487993 45743593 43974928 42228016 40580560 39193202
11851 39193202 38180997 37003392 35588729 34277176 33002953 31850126 30784993 30067189
11843 30067189 29106880 27917595 26827305 25799361 24756378 23930640 23209140 22660496 21834756
11834 21834756 21226275 20777796 20029146 19302966 18689525 17955311 17597598 17166594 16935116
11825 16935116 16514109 15839345 15349384 14885223 14328725 13893041 13393233 12838648 12604762
11816A2604762l08982k53012k40260l18718k74733k36975l12834j79355p2435
11807A0407458l44184o04581l66999k87182J8702J38973j00080l70688l64061
11798H127358k69168j81128k3354k1084l41436m11411j29006j14631l53234k025
11788F280881j36414J06598L10453n7036l09378k39102k14507j29987j33733Q0336
11778E558111K37897k64880k9212n7462m8695q1389o01764j90722j19049o5624
11768D337211k5541o3953L1813l4076j14401O1027Q7661k5661k30944j21196J86397
11757D088337P6848j29289j85422o2612L61696J34611J20522N247k66600J20321
11747D263659J25129j05433k68038j17091J17953j10250J94552L33381J66057
$$ plain form
11816 12604762 12295780 12042768 11802508 11483790 11209057 10972082 10659248 10479893 10407458
11807 10407458 10063274 9458693 9091694 8804512 8823214 8962187 8862107 8491419 8127358
11798 8127358 7858190 7677062 7653708 7632624 7291188 6879777 6750771 6636140 6282906 6280881
11788 6280881 6144467 6251065 6561518 6504482 6195104 5956002 5741495 5611508 5477775 5558111
11778 5558111 5796008 5531128 5501916 5444454 5395759 5314370 4712606 4521884 4402835 4337211
11768 4337211 4311670 4247717 4279530 4245454 4131053 4192080 4279741 4254080 4023136 3901940 4088337
11757 4088337 4165185 4035896 3850474 3787862 4149558 4284169 4404691 4409938 4143338 4263659
11747 4263659 4388788 4283355 4015317 3898226 4016179 3905929 4100481 4433862 4599919
11738D599919j90801j88584j13909j42072l9030k37912p9763j938j8723R9701
11728C686888o174K5883o1999O4150J14720O6839K4910j77546k30811k3655l7287
11717C445918q4664k6133q0960j15585n7786M9543J10682P492L53425m7681k54432
11706C299819k63821l6717m8349j7438j30161K51941p6496o158J4249M2394J7244
11695C046507j8684o9168k37481j60789q4602J13360K14414J06082j86226l20305
11685B403108j14315j16806j32737k08300O3526L0078q3754Q4720P1440L4795
11675B031755p6597K15411K3069O264l9738R5007r718j67216j30052o4477p6880
11664A806828M5057J36740l9703J897k47550j34495q0386J82083J08765q0979
$$ plain form
11738 4599919 4409118 4220534 4106625 3964553 3925523 3687611 3607848 3605910 3587187 3686888
11728 3686888 3680714 3706597 3644598 3708748 3823468 3890307 3915217 3737671 3506860 3483205 3445918
11717 3445918 3361254 3335121 3254161 3138576 3080790 3130333 3241015 3248507 3601932 3554251 3299819
11706 3299819 3035998 2999281 2950932 2933494 2803333 3055274 2978778 2972620 2986869 3029263 3046507
11695 3046507 3027823 2958655 2721174 2560385 2475783 2589143 2803557 2909639 2723413 2403108
11685 2403108 2288793 2171987 2039250 1830950 1894476 1924554 1840800 1925520 1996960 2031755
11675 2031755 1955158 2170569 2193638 2199902 2160164 2255171 2245453 2078237 1948185 1883708 1806828
11664 1806828 1851885 1988625 1948922 1950819 1703269 1568774 1488388 1670471 1779236 1698257
11654A698257p2645m1443R0147j2601M9576n1210k11141j54023J44695J30030
11644A569642l50655l3421K87278L59696j71906j56862j1195j05379j34990q2457
11634A169751M5897p5814J8810K32827J63883k10700k42995n9949K52782L74085
11624A668577J46767q0273o6940j15122k44245k41088m6012L54072K26162l9333
11614A562565j0560j65072k92103k1001N1459M1548K097r2513o8214j8497j23197
11603H66512J46155J4550N671n1244n5930Q4266R7708K3942O5987K8120R983j42895
11591A092825j19683K6631N7997j08548K992K30212L01969K8256j60552j59703
11581A192396j0523l8231p1494J02210P7410p8358P0573j3053j59932O7183j95635
$$ plain form
11654 1698257 1625612 1584169 1674316 1661715 1711291 1660081 1448940 1294917 1439612 1569642
11644 1569642 1218987 1185566 1472844 1832540 1660634 1503772 1492577 1387198 1252208 1169751
11634 1169751 1215648 1139834 1158644 1391471 1555354 1344654 1101659 1041710 1294492 1668577
11624 1668577 1815344 1735071 1668131 1553009 1308764 1067676 1021664 1375736 1601898 1562565
11614 1562565 1552005 1386933 1094830 1073829 1125288 1166836 1168933 1076420 1008206 989709 866512
11603 866512 1012667 1027217 1032888 981644 925714 1009980 1107688 1131630 1197617 1225737 1235720 1092825
11591 1092825 973142 999773 1057770 949222 952214 1182426 1484395 1512651 1352099 1192396
11581 1192396 1181873 1143642 1072148 1174358 1251768 1173410 1243983 1230930 1070998 1138181 942546
11570I42546J13667J21332o2361r1187J1275l3258p3795p5121j7351j60894J47152
11559H22005n9321L3718J87156K039O481n976j27770j0638J16380m0799k4826
11548H98449j03978j08417n5379O9286J25277j26429j4633P4964N0841Q7895o0903
11537H36973K1240l2596j40726r3280j40285J64473L85897K38105p9633k87338
11527H72830o8749n0569r3954P2652k30900q6429R7999k0591o6571J86328j84060
11516D27986k53274J79668J30243J58334J00412m2794j09093l9123r3556p854
11506D50949J09990K60742p937n4843M1574O4684N849P6772j90931j58505j34996
11495D63348j07375J80292Q0678k31401j48766J74235O930J94841L1671j9107
$$ plain form
11570 942546 1056213 1177545 1115184 1023997 1035272 1002014 928219 853098 835747 674853 822005
11559 822005 762684 796402 983558 985597 992078 986102 858332 847694 964074 923275 898449
11548 898449 794471 686054 630675 699961 825238 698809 684176 759140 809981 897876 836973
11537 836973 858213 825617 684891 591611 451326 615799 1001696 1239801 1160168 872830
11527 872830 804081 753512 659558 732210 501310 414881 512880 492289 425718 612046 427986
11516 427986 174712 354380 484623 642957 743369 700575 591482 552359 458803 450949
11506 450949 560939 821681 813744 758901 800475 865159 871008 947780 756849 598344 463348
11495 463348 355973 536265 616943 385542 236776 411011 417941 612782 644453 625346
11485F25346J47671j40735k30993Q829r5593j45975L7664O4782j50057m6778K44383
11474C18544K00116J49945O7012K5070m4706j93941Q9221o0568k05027J81044
11464E26710o3810J40785L30718m2462j79552k58452j79617J22004j329o8873
11454C26122k82783q6164R1088O2408K50669J13319r0148r2232N5103M4488J54443
11443E46313j02842l53861J6796M02897m4427k52848o9997m9858J41902J31265
11433C65340o3274N4549j4442K10105N6553n6630j94214j30519J35978J16161
11423D79607k868K4863N4088J47635N0119l23832o5897m5441J53135O9346q9188
11412D51567o3146p0909J60236J18328j00501k9241m4568j83604J10635K349M6007
$$ plain form
11485 625346 773017 632282 401289 410118 314525 168550 206214 270996 120939 74161 318544
11474 318544 518660 668605 735617 760687 715981 522040 611261 550693 345666 526710
11464 526710 462900 603685 934403 891941 712389 453937 274320 396324 394995 326122
11454 326122 43339 -42825 48263 110671 361340 474659 384511 292279 347382 391870 546313
11443 546313 443471 89610 106406 509303 464876 212028 142031 92173 234075 365340
11433 365340 302066 356615 342173 552278 608831 552201 357987 227468 363446 479607
11423 479607 476739 501602 555690 703325 753444 429612 363715 318274 471409 540755 451567
11412 451567 388421 317512 477748 596076 495575 466334 421766 238162 348797 351146 397153
11401C97153q7106m4985J52552K389J34205J60387j61758q982R654j42714j13831
11390B96964r0670p4596l6078j4030K37487K1851J80054P7823k41098j75890n6503
11379A25314R207K6492o5354K09912K32896j9172k18689j35007J48242r350J65396
11368D69887P4115j31371m8457P3410n0518n304K74085r5689j92209j55546j10601
11357A01802j1865K67161Q1282J88996j01301k06759o9098m7888o3002n170K62563
11346C96721M0562k22736N160J96320M2446k27141M580J09821R2604J6435n694
11335D49078N777k11209k66774J60476J68321o3506J45877J45098Q0267l18566
11325B94839j34557K25355r6466k709J45457m081p3733k7625K15669J2452j52030
$$ plain form
11401 397153 310047 265062 417614 420003 554208 714595 552837 543855 553509 410795 296964
11390 296964 206294 131698 95620 81590 319077 340928 520982 598805 357707 181817 125314
11379 125314 134521 161013 95659 305571 538467 519295 300606 165599 313841 304491 469887
11368 469887 544002 412631 364174 437584 387066 381762 655847 560158 367949 212403 101802
11357 101802 89937 357098 438380 627376 526075 319316 250218 202330 139328 134158 396721
11346 396721 437283 214547 219707 416027 458473 231332 235912 345733 438337 454772 449078
11335 449078 454855 243646 -23128 137348 305669 242163 388040 533138 613405 294839
11325 294839 160282 385637 289171 286462 431919 427838 354105 326480 542149 554601 402571
11314D02571j39471J06592n5207j30152N6843J91540j66280k98481J40486J88240
11304B96681k08133K0308J06107R8880k1757J06082m0367l04468M5102J10364
11294B08799l0446L8225p648j01072k8542r6102k1549J5207J3488J13696n2746
11283E1310J8746J08213p6496j0948K02201M9893L8206l5894l29243o6192K2192
11272b8012j64791J70265L33511R5282j27523J11920L56581J00137k87521j62096
11262C97753p0652K2313l0572m5805j01781J22402k26929j89716m90L16006R4370
11251B86899j08368j18078k6631L02218K00767k6907j34879k71195q2039J19334
11241A41121K01650J95346j34345j94944q3618N2118J57187j19437k63333p2471
$$ plain form
11314 402571 263100 369692 314485 184333 241176 432716 266436 -32045 108441 296681
11304 296681 88548 108856 214963 313843 292086 398168 357801 53333 98435 208799
11294 208799 178353 216578 208930 107858 79316 -16786 -38335 -23128 -9640 104056 51310
11283 51310 70056 178269 101773 90825 293026 342919 381125 345231 15988 -50204 -28012
11272 -28012 -192803 -22538 310973 406255 278732 390652 747233 847370 559849 397753
11262 397753 327101 349414 318842 273037 171256 293658 66729 -122987 -123477 192529 286899
11251 286899 178531 60453 33822 336040 536807 509900 375021 103826 21787 141121
11241 141121 342771 538117 403772 208828 125210 177328 334515 215078 -48255 -120726
11231a20726R9536J03744j16358l7080K04511K4307m6332j19645P172N6786l0924
11220B4991j78925N4328R1076J01430J86755Q6768j14088j48252m5300L9216N1168
11209A49167j991j47306J86959l03983r2241M8026J00143L42057J14320r9930
11199B95221k59821q0381j14296J63345K28410N4442m4739Q3461p3516N7185k7081
11188B82230k98119j9566M7424M9887K76845Q5794o4970J9852l27001k32423K74727
11177I4680J21010n6010J73080J67357j14544l60804M4291K19303L9127j35948
11167A91542P0613J97480N7596p8911l23768l1860N7524q4023R5461k0885k4479
11156A06290r601j8793O1712o237j39428q2570K6352O7577O7563M8852j92657
$$ plain form
11231 -120726 -21190 82554 -33804 -70884 133627 157934 111602 -8043 -871 55915 24991
11220 24991 -153934 -99606 -8530 92900 279655 366423 252335 104083 58783 97999 149167
11209 149167 147176 -130 186829 -117154 -209395 -161369 -61226 280831 395151 295221
11199 295221 35400 -44981 -159277 4068 232478 286920 242181 325642 252126 309311 282230
11188 282230 -15889 -35455 11969 61856 338701 424495 359525 379377 52376 -180047 94680
11177 94680 215690 159680 332760 500117 385573 24769 69060 288363 327490 191542
11167 191542 262155 459635 517231 438320 114552 82692 140216 56193 151654 130769 106290
11156 106290 96689 77896 139608 133371 -6057 -88627 -62275 5302 72865 121717 -70940
11145g0940o8054J28696n6392J74881L44354m17l61117J5824J70438R8250m5600
11134C29923L4141k58279j6018J93369J42052J18467k74893k78300q423j25764
11124a43725n8478M7944m469Q5281L7961J24153K87977k3589q4759j90707L8799
11113A16388J65067K988J02890O8298J640j46461J10796R2651R7337K91881j75777
11102G27698n1655k34934j72586k3810j31407k2646k35617Q7951J3093K3250O2929
11091D2266L1095J569n8120r4596K46729m154n264J1028q5065k09898J08794K84069
11079B68453m8832k0548J90881O5662m418k04492l4888o1082L8787J66605j4570
11068C41558r276k86451m0791o9180o9858J13169J1720j79076J13885J50798J41476
$$ plain form
11145 -70940 -138994 -10298 -66690 108191 452545 452128 91011 106835 277273 375523 329923
11134 329923 364064 105785 89767 283136 425188 543655 268762 -9538 -17961 -143725
11124 -143725 -202203 -154259 -158728 -73447 -35486 88667 376644 353055 268296 77589 116388
11113 116388 281455 284443 387333 455631 457271 310810 421606 514257 611594 903475 727698
11102 727698 676043 441109 268523 244713 113306 90660 -144957 -57006 -43913 -20663 42266
11091 42266 73361 74930 16810 -77786 168943 164789 159525 170553 85488 -124410 -15616 268453
11079 268453 219621 199073 389954 455616 451198 246706 211818 150736 189523 356128 341558
11068 341558 332282 45831 5040 -64140 -133998 -20829 -9109 -188185 -74300 76498 217974
11057B17974K20334j0757k24398j34337K65483K91111k0592j36815n0396O9318
11047D86925r1861M7427J22897k33017j05200K86306J93580o1805j03089p4720
11037D67443J56101J53672J28691M2457J43202M6614N3139k28321k38170J18501
11027H43329J51564J22095Q6544J26505J15172M0922K05903K43815j00253j69293
11017A666303j90265k61260j34042J05290K26837R2119P5034j26516k2953j97854
11007A232693j06991n9401j83025o3722P2163j42811L7709j68J57457J6945O4156
10996A025005j88803k47461O9584L6949J19721j85101o0376K19055k5365j00182
10986F63026k44793j21517M5813J65286l9981k15966j88086J07288K73744J2776
$$ plain form
11057 217974 438308 427551 203153 68816 334299 625410 604818 468003 417607 486925
11047 486925 395064 442491 565388 332371 227171 513477 707057 645252 542163 467443
11037 467443 623544 777216 905907 948364 1091566 1138180 1191319 962998 724828 843329
11027 843329 994893 1116988 1203532 1330037 1445209 1486131 1692034 1935849 1835596 1666303
11017 1666303 1476038 1214778 1080736 1186026 1412863 1504982 1580016 1453500 1430547 1232693
11007 1232693 1125702 1066301 883276 819554 891717 748906 786615 786447 943904 960849 1025005
10996 1025005 836202 588741 658325 695274 814995 629894 569518 788573 763208 663026
10986 663026 418233 296716 342529 507815 467834 251868 63782 171070 444814 457590
10976D57590M6024k0960p245N4329j98637k98596j12002J27759Q2101R8977j26106
10965A03234k7846K72889J36712q7985k42423n4026J88137J32819j06728p3740
10955B41043k09906n6815K55490P3107M0564j79563q1236J19454l16q8614m2658
10944G0550K24505q4097o9345o5645P6467P3652k5696m9130j1862J00050l1484
10933B07965j42015k3003j4620j56980j8576j44004n2385j14537J30997K01415
10923a25743j20878P8681R403M6145J67277N826Q5349J70836L3657J51902k13092
10912B89363k76254k52977L6411J5836l7160K31569j32281o6679K62842M7311
10902A17981O4006k39791p4220o6327n3023j79724m4631j02734k8753J18455j6801
$$ plain form
10976 457590 503614 482654 475409 529738 331101 32505 -79497 48262 130363 229340 103234
10965 103234 75388 348277 484989 397004 154581 100555 288692 421511 314783 241043
10955 241043 31137 -25678 229812 302919 343483 163920 82684 202138 201822 113208 70550
10944 70550 295055 210958 141613 75968 152435 226087 200391 151261 139399 239449 207965
10933 207965 65950 42947 28327 -128653 -147229 -291233 -343618 -458155 -327158 -125743
10923 -125743 -246621 -167940 -158537 -112392 54885 60711 146060 316896 350553 502455 289363
10912 289363 13109 -239868 -203457 -187621 -224781 6788 -125493 -192172 70670 117981
10902 117981 181987 -57804 -132024 -198351 -251374 -431098 -475729 -578463 -607216 -488761 -505562
10891e05562O5301O2208k08337p6749q1083J55307L25048K85524N6084l0324K03726
10880B51143J91890j04413q4835j12268j31219J59343J76527Q1823P9599j42703
10870C64887j01218l1715J93422N5065k57539q552J07606N5971r4150m9502m5824
10859A88451J69690o4372J41133P561O150j91986q8011j14014r7986o4640N31452
10848D23428J75685j3497K22510j9690l04183L61r2944k46347j94980r427J30593
10837G1509J77074J16121P8077k31372q2704k916J40838n4254J79463J55938q2163
10826D65611k24949j43753k2802P2714J03362K42352R5315q9307j21718j12694
10816B64131J3262J21800j37688k95110q2843M9567R0738Q9752j11595Q1839K0862
$$ plain form
10891 -505562 -440261 -378053 -586390 -663139 -744222 -588915 -263867 21657 77741 47417 251143
10880 251143 443033 338620 253785 141517 10298 169641 346168 427991 507590 364887
10870 364887 263669 231954 425376 480441 222902 214350 321956 377927 283777 234275 188451
10859 188451 358141 293769 434902 442463 448613 256627 168616 54602 -43384 -108024 423428
10848 423428 599113 585616 808126 788436 484253 484614 391670 145323 -49657 -59084 71509
10837 71509 248583 364704 442781 211409 128705 125789 266627 212373 391836 547774 465611
10826 465611 240662 96909 74107 146821 250183 492535 587850 498543 376825 264131
10816 264131 277393 399193 261505 -33605 -116448 -66881 23857 113609 2014 83853 104715
10805A04715r1135p4303J9385j27624j3464Q4921M9794O2327J14725K71847k27245
10794A73943j05772n6531r9912R052P298j99463K54249K53349Q5738j41087j29700
10783E1164j64144p3956N505K11088L2917N9145N4222k27857J30491j0077J04634
10772A73132M8191L2404o0262j98392K6266K57333l4299j18012j19811J03761
10762A10311K26379M14281j25697n12010o2788Q7892J25550k14333j5878Q6791
10752A20498k8193q1642J14256O757M4189J35699K2646O0642o9344J6115J03845
10741D45468K0286j92937l4325J04281J56930J65117l5786j2919j35820M2367
10731E22662J36086q8248R7880J0701K89956K8459N6429K80041K43748J34288
$$ plain form
10805 104715 13580 -60723 -41338 -168962 -182426 -97505 -47711 14616 129341 401188 173943
10794 173943 68171 11640 -88272 -79220 -71922 -271385 -17136 236213 321951 180864 51164
10783 51164 -112980 -186936 -181431 29657 62574 121719 175941 -51916 78575 68498 173132
10772 173132 221323 253727 193465 -4927 21339 278672 244373 126361 6550 110311
10762 110311 336690 750971 625274 113264 50476 138368 263918 49585 33707 120498
10752 120498 92305 10663 124919 131676 175865 311564 334210 394852 325508 341623 445468
10741 445468 465754 272817 238492 342773 499703 664820 629034 616115 480295 522662
10731 522662 658748 570500 668380 679081 969037 997496 1053925 1333966 1577714 1712002
10721A712002K19861k8029r2011p2734K1776J28269j78869l22898o4468M5547
10711A368446m7187k86456q9288L07377R0071q3864k49811J51842Q1501o8244
10701A174387P9506J53005n2025M9592J03760L7943k40530K2531p2670N5330K30661
10690A541490M226P5717n0467l9243J17135o9115O7015N9309k2765J90705J65193
10679B039200M1402q3683N2734j7575P7386L6245q9606K1094l533J55587K5224
10668B254475p6032M39408J19503M354j38871P4638J62320m36K6791J71680K07362
10657C245192l1824k8052O1960J41141l4651q5657L4057K4166j2411K31680L8211
10646C583812J14370N8894K51480J39128J92011K05915K52316k3067L00361L8145
$$ plain form
10721 1712002 1931863 1903834 1811823 1739089 1760865 1889134 1710265 1387367 1322899 1368446
10711 1368446 1321259 1034803 945515 1252892 1342963 1259099 1009288 1161130 1242631 1174387
10701 1174387 1253893 1406898 1354873 1404465 1508225 1546168 1305638 1328169 1255499 1310829 1541490
10690 1541490 1545716 1621433 1570966 1531723 1648858 1579743 1646758 1706067 1683302 1874007 2039200
10679 2039200 2080602 1996919 2049653 2032078 2109464 2145709 2056103 2077197 2073664 2229251 2254475
10668 2254475 2178443 2617851 2737354 2741708 2602837 2677475 2839795 2839359 2866150 3037830 3245192
10657 3245192 3213368 3185316 3247276 3388417 3353766 3268109 3302166 3326332 3313921 3545601 3583812
10646 3583812 3698182 3757076 4008556 4147684 4339695 4545610 4797926 4774859 5075220 5113365
10636E113365O7737L94966K45639M89602P18051M12822M97758M37097O36905R57815
10626I971757J085439J617477K240622K550366L554346M797039O212658P895293
10618C9924997R659541J0591927R442058O501687K794493l1570n62135O86078
10610G9007076K919470N939229J0144937J4602318J8614701K0427265J7275478
10603A68930474Q841926o02147o731950p826970m867472m14188M851211J1565960
10595A73746844J8092299K3183421K4342117J8194897M816502r363825j7547779
10588B35464476j8433258j5013294r685503l974879J657197P073572J0714136
10581B07802447J1059125O361072k722490j2276733j6909532j6350544j3519696
$$ plain form
10636 5113365 5181102 5576068 5821707 6311309 7029360 7442182 7939940 8377037 9013942 9971757
10626 9971757 11057196 12674673 14915295 17465661 21020007 25817046 32029704 39924997
10618 39924997 49584538 60176465 69618523 76120210 78914703 78883133 78320998 79007076
10610 79007076 81926546 87865775 98010712 112613030 131227731 151654996 168930474
10603 168930474 177772400 177170253 170438303 162611333 157743861 157329673 162180884 173746844
10595 173746844 191839143 215022564 239364681 257559578 262376080 253012255 235464476
10588 235464476 217031218 202017924 192332421 188357542 190014739 197088311 207802447
10581 207802447 218861572 225222644 222500154 210223421 193313889 176963345 163443649
10574A63443649r594842n648586k724187l92922J278579J190218j328654m839311
10566A41383944q380628j0004726r898016q756926p239982n802058m849523m180305
10558H2271780l735330l489878l144067k819728k676664k357253k345986k006368
10550E9696506j782445k070041k010784k086421k120094k057632j661311j478082
10542D4429696j595410j828511j679995j789305j552508j485506j438863j253820
10534C1805778j667404j623747j197281j283236j212602j175384j357384j163736
10526B1125004j052301j037021q84609r37073r94212r16154r58550p08925n90087
10517A3046072p32037m86942l59843m59770o41907p36899m06383l13618l44252
$$ plain form
10574 163443649 153848807 148200221 145476034 145083112 146361691 147551909 146223255 141383944
10566 141383944 133003316 122998590 113100574 104343648 97103666 91301608 86452085 82271780
10558 82271780 78536450 75046572 71902505 69082777 66406113 64048860 61702874 59696506
10550 59696506 57914061 55844020 53833236 51746815 49626721 47569089 45907778 44429696
10542 44429696 42834286 41005775 39325780 37536475 35983967 34498461 33059598 31805778
10534 31805778 30138374 28514627 27317346 26034110 24821508 23646124 22288740 21125004
10526 21125004 20072703 19035682 18151073 17214000 16219788 15303634 14345084 13636159 13046072
10517 13046072 12314035 11827093 11467250 11007480 10365573 9628674 9222291 8908673 8564421
10508H564421l79887o21150l20664n4815l58436o52761k75126l47811k95929j25060
10498E132782l07395l47418j14586j88737k48299N2632m5865j68317k55503j19233
10488C390061R839j15487j48555l20045R1616K557k86214j59385m34Q1290r6194
10477B449049k22617j17380j62575r4263q2792j00468M644N6552R3126o4648k26010
10466A532618J19121J22160j16151j52435j56611J25349K28980J05262r1188o4819
10456A652286l1155J32106n992n4425l2518J14050p6624q4750j27010N9781n2653
10445A493096j47538J70948L36849J83028J41539p332K01239P3552j53197n8056
10435B234128K0641k9519j37882j12310K58374J26639k5207O9968k45479J6506
$$ plain form
10508 8564421 8184534 7563384 7242720 7187905 6829469 6176708 5901582 5553771 5257842 5132782
10498 5132782 4825387 4477969 4363383 4174646 3926347 3978979 3933114 3764797 3509294 3390061
10488 3390061 3399900 3284413 3135858 2815813 2907429 2909986 2623772 2464387 2463953 2545243 2449049
10477 2449049 2226432 2109052 1946477 1852214 1769422 1668954 1673598 1730150 1823276 1758628 1532618
10466 1532618 1651739 1773899 1657748 1505313 1348702 1474051 1703031 1808293 1717105 1652286
10456 1652286 1621131 1753237 1747245 1692820 1660302 1774352 1697728 1612978 1485968 1545749 1493096
10445 1493096 1345558 1516506 1853355 2036383 2177922 2170590 2371829 2445381 2292184 2234128
10435 2234128 2254769 2225250 2087368 1975058 2233432 2360071 2334864 2404832 2159353 2175859
10425B175859P0064j20551J67662j04141L3986K2492K4233K47028J02438q0625
10415B538445L53014J74852k47521n6126J48447R0110J58679J70031K07056o0191
10405C476796j5858k7004J17453K48441K3376j32691m3978M8338K36546j25251
10395C806168J8361J15507J5389o6567O5432O7208J37055J24835j10106j27136
10385D046146J54005M6225J00695p7490j19708K74554L04890l5146o6853K21250
10375D848568K05287P3368Q2105m7534k77900j07352P2455J37152O2789R7184
10365E146122j7357j12208K668L1320q0079L96770L48831J5118r2297J56396L32004
10354F127288M45317M73824J59142N11637L33999N93186Q28694P36998R45187
$$ plain form
10425 2175859 2245923 2125372 2293034 2188893 2222879 2245371 2269604 2516632 2619070 2538445
10415 2538445 2891459 3066311 2818790 2762664 2911111 3001221 3159900 3329931 3536987 3476796
10405 3476796 3460938 3433934 3551387 3799828 3823204 3690513 3646535 3694873 3931419 3806168
10395 3806168 3824529 3940036 3955425 3888858 3954290 4021498 4158553 4283388 4173282 4046146
10385 4046146 4200151 4246376 4347071 4269581 4149873 4424427 4729317 4694171 4627318 4848568
10375 4848568 5053855 5127223 5209328 5161794 4883894 4776542 4848997 4986149 5048938 5146122
10365 5146122 5128765 5016557 5019225 5050545 4970466 5367236 5716067 5731185 5638888 5795284 6127288
10354 6127288 6572605 7046429 7205571 7717208 8051207 8644393 9473087 10210085 11155272
10345A1155272J008671J223213J453267J535124J862933J839971K135893K664456
10337B4878800L278754M320755N234482O464768Q546288J1465052J5250715J9370419
10329I8810033K3370719K6060736K6278459K4693835K1968133J7578867J0885520
10322B49646302K314184n609743j1772686j5750041j9009429k1053140k1309572
10315A57455875j9140743j5747510j2874796j0231059q223536o621576n223525
10308G9393130m564204l722432l154634k922057k742167k465762k094977j864274
10300E5862623j715608j613714j354767r23839p97913j182000j004631p47174
10292D6522977n84856m22420n49214r10705j084112r47407j001791j055601j345662
$$ plain form
10345 11155272 12163943 13387156 14840423 16375547 18238480 20078451 22214344 24878800
10337 24878800 28157554 32478309 37712791 44177559 52723847 64188899 79439614 98810033
10329 98810033 122180752 148241488 174519947 199213782 221181915 238760782 249646302
10322 249646302 251960486 246350743 234578057 218828016 199818587 178765447 157455875
10315 157455875 138315132 122567622 109692826 99461767 91238231 84616655 79393130
10308 79393130 74828926 71106494 67951860 65029803 62287636 59821874 57726897 55862623
10300 55862623 54147015 52533301 51178534 50254695 49456782 48274782 47270151 46522977
10292 46522977 45938121 45515701 44966487 44055782 42971670 42024263 41022472 39966871 38621209
10283C8621209j555924j450502j434066j466922j436629j594842j506856j646854
10275B6528614j438861j372451j023865r82607j089235j121268j023250j006407
10267A7470670r56949o37349o86350r38272p67102n85505n30999m16524n36145
10258A1415475o29780o04542m66372m42437m92214l99403k58676l52039l47691
10249G422321k09197l25897k84160n67470n09884j23844K8674N1469j90620l47578
10239D943814m52244j02480m0734j06048j66176m3170j64339k57532j62300k1902
10229C426889M1718Q6486K3711j94972j60951j73258k27549j42056K46499k5542
10219B900975j83076j65832j18631k919J36603k60133j72949j43864o7910o0757
$$ plain form
10283 38621209 37065285 35614783 34180717 32713795 31277166 29682324 28175468 26528614
10275 26528614 25089753 23717302 22693437 21710830 20621595 19500327 18477077 17470670
10267 17470670 16513721 15876372 15190022 14251750 13484648 12899143 12368144 11951620 11415475
10258 11415475 10785695 10181153 9714781 9272344 8780130 8380727 8122051 7770012 7422321
10249 7422321 7213124 6887227 6603067 6035597 5525713 5401869 5430543 5482012 5291392 4943814
10239 4943814 4491570 4389090 4348356 4242308 4076132 4032962 3868623 3611091 3448791 3426889
10229 3426889 3468607 3555093 3578804 3383832 3222881 3049623 2822074 2680018 2926517 2900975
10219 2900975 2717899 2552067 2433436 2430517 2567120 2306987 2134038 1990174 1922264 1861507
10209A861507J28482p1474n5887j08081K7089J44758l0099k54539p6590j8292
10199A546874j0081q5154n8280J41662R316J29967k6598k6055n5584R4963J11156
10188A772186K622p5986j75582k0920J69312J97118k86510j4753r556l603j20531
10177A433797m2873R4481N5901R1541k7322m5137m4421l9842J42751J18268P9133
10166A816277K05503J87423P2644k08166N437N199J52831J8096L6266m9101J85652
10155B428061K76110J09826p618j79261j83557J5926k2319j68010J21772K10631
10145B601561J01410k1528m8503m1203l5272q6548j62164J4671k90269j00993
10135A931162K25961P565j61963j08850K9463R3286p9416n3321R3260L3296k39692
$$ plain form
10209 1861507 1989989 1918515 1862628 1754547 1781636 1926394 1896295 1641756 1565166 1546874
10199 1546874 1536793 1451639 1393359 1535021 1544337 1674304 1647706 1621651 1566067 1661030 1772186
10188 1772186 1774808 1698822 1523240 1502320 1671632 1868750 1582240 1567487 1557931 1554328 1433797
10177 1433797 1390924 1485405 1541306 1632847 1605525 1560388 1515967 1476125 1618876 1737144 1816277
10166 1816277 2021780 2209203 2281847 2073681 2079118 2084317 2237148 2255244 2291510 2242409 2428061
10155 2428061 2704171 2813997 2806379 2627118 2443561 2459487 2437168 2269158 2390930 2601561
10145 2601561 2702971 2681443 2632940 2591737 2556465 2469917 2307753 2322424 2032155 1931162
10135 1931162 2157123 2164688 2002725 1893875 1923338 2016624 1937208 1883887 1977147 2010443 1770751
10124A770751k10041J6515K20275L6876k06615R482o3021q7609j21394n1923K79048
10113A592344L4082k13872M7664n8205j14767R1644L46489k16506l47862l76984
10103G84027j32780J52414K54794R6590r241j35393R0279J84642j91098j11852
10093I82382j03800p5584P7835K58972l0185J2025j29386m5808R8053J34793J0144
10082A189441N9795R4054K0858j28409l2940j26384k36852r6537M8912j9252J41267
10071I13953p6648k9858q5624k33145m3342O0830j08361J09820L33802J66328
10061A007755j87861l83641K57740J44779j44849J15990J49886o4466L3828j08605
10051H20556k0586n0917q3710M3283J68075L1208j44545j91112l40081o1055P5325
$$ plain form
10124 1770751 1560710 1577225 1797500 1834376 1627761 1637243 1574222 1486613 1365219 1313296 1592344
10113 1592344 1626426 1412554 1460218 1402013 1287246 1378890 1725379 1508873 1161011 784027
10103 784027 651247 803661 1058455 1155045 1145804 1010411 1100690 1285332 1094234 982382
10093 982382 878582 802998 880833 1139805 1109620 1121645 992259 946451 1044504 1179297 1189441
10082 1189441 1249236 1343290 1364148 1235739 1202799 1076415 839563 743026 791938 772686 913953
10071 913953 837305 807447 721823 488678 445336 506166 397805 507625 841427 1007755
10061 1007755 819894 436253 693993 838772 693923 809913 959799 895333 929161 820556
10051 820556 799970 749053 665343 708626 876701 907909 763364 572252 232171 171116 246441
10040B46441O7501R5330J04166j23854R878N1909N5946j6103j48619k46054P7300
10029A73841J40456J8549l154K47611o2691m8993q9669R9787K03294j10914J31148
10018F99265O9681o3063l12084J1953k4870K30382O2175m7820K9484m9694m9640
10007E55769J04682j84545k94156J33420K36438O7608j64080j71499q5581R3606
9997B91662R2099O0461J76804K8921j36402n4977k04061k44789O592J48487N8742
9986B23539N9784l0847p182r4787J36487L6231J52073J21738K7344j16892O1406
9975E68894K01284m4967l46637R033O8719j63035L1377j60256r5079J13924J58161
9964C41418m4240j14027J56450p4400r4465j44287j58403J1617R8648J19185J17101
$$ plain form
10040 246441 313942 409272 513438 389584 399462 451371 507317 491214 342595 96541 173841
10029 173841 314297 332846 329692 577303 514612 465619 375950 475737 679031 568117 699265
10018 699265 768946 705883 393799 405752 380882 611264 673439 625619 655103 605409 555769
10007 555769 660451 475906 181750 315170 551608 619216 455136 283637 198056 291662
9997 291662 383761 444222 621026 649947 513545 458568 254507 9718 16310 164797 223539
9986 223539 283323 252476 245294 150507 286994 323225 475298 597036 624380 507488 568894
9975 568894 770178 725211 378574 387607 456326 293291 324668 164412 69333 183257 341418
9964 341418 297178 183151 339601 265201 170736 26449 -131954 -120337 -21689 97496 214597
9953B14597q5100J77542m1593M8959P3960J9959j60298J12849j08852n9857J4840
9942B07006L3728M3094p2566J2927L12879L6199M9181J8408j65503J51939P4850
9931G02142M7875k6242j7460N8052j38946j03658J8452K73619M70432Q731j0481
9920A282516L20346K8551j81421k47610l03337k20091P4639K14796o8277k38660
9910F61452k34102J25262j9385r9368n200J44735Q1849J98139j0965k29977j0178
9899F02262k14853j18516q5859L5999L462N4997J33489K8640L3995J05902J51355
9888G30873j94412l02947k39663n5671J25150L47177L54415l04249l18815j95125
9878e3267N0710m4599K02970J18292q9066J16190L1330J25179K26331k02912k33690
$$ plain form
9953 214597 129497 307039 265446 314405 388365 408324 248026 360875 252023 192166 207006
9942 207006 240734 283828 211262 224189 537068 573267 622448 640856 475353 627292 702142
9931 702142 750017 723775 706315 764367 625421 521763 540215 813834 1284266 1292997 1282516
9920 1282516 1602862 1631413 1449992 1202382 899045 678954 753593 968389 900112 661452
9910 661452 427350 552612 533227 433859 428659 573394 655243 853382 842417 612440 602262
9899 602262 387409 268893 183034 219033 222495 277492 410981 439621 473616 579518 730873
9888 730873 536461 233514 -6149 -61820 63330 410507 764922 460673 141858 -53267
9878 -53267 -2557 -47156 155814 274106 185040 301230 332560 457739 684070 481158 247468
9867B47468L64291J71494m4743m3224j25492j87260j27180N719l6066P0979p1267
9856B24719k01825J92937L66393J27449N1012j32882K7107M684o6450Q9900q2111
9845F00933q7214n7815k23321k49981R2923K76316J36070N3995k91841j57649
9835I2416M9956K48247J23194o0016j47917j45849j83909j25920j16064N3699
9825b12163J77521n3729K9543K31743J41797m8037l03305M4656K54437k906j09114
9814A50443K4565N8139l1149l6013n1845k7486j36810M9974K04548P9905j26453
9803A57818k20435P3100J55163q0963J16227Q8410K20121n1977L3446K8857r7326
9792D22441n3889n5982L0215j9103r5261j39116j82366j18390j8072K17021J18063
$$ plain form
9867 247468 611759 783253 738510 695286 569794 382534 255354 261073 225007 295986 224719
9856 224719 22894 215831 582224 709673 760685 627803 654910 659594 593144 683044 600933
9845 600933 513719 455904 232583 -17398 75525 351841 487911 541906 250065 92416
9835 92416 142372 390619 513813 453797 305880 160031 -23878 -149798 -265862 -212163
9825 -212163 -34642 -88371 -58828 172915 314712 266675 -36630 8026 262463 259557 150443
9814 150443 175008 233147 201998 165985 114140 86654 -50156 -182 204366 284271 157818
9803 157818 -62617 10483 165646 84683 200910 289320 509441 457464 490910 519767 422441
9792 422441 368552 312570 342785 323682 228421 89305 -93061 -211451 -229523 -12502 105561
9781A05561j63208m9564J98147n8937q4523K00175M540j39768r3955J56159R7048
9770A71675r4551P4498j07914j36472K41150J04134Q6931J8175r9409l8894j23770
9759I5553q9646K9152m5788J45055K8066k52417N1837J25361J04223M6693j11285
9748A26804j38863m695J71796J77363J9427l5892j3930l4148o1460o6521M452
9737A44333j57423k32928K38575J03457P229L10913j30797o5031k5533P1057K90765
9726E54617P0547j27043k82405j25291K4972l407J99515M765J20991N3127J52971
9715F43359R340k09483m9184Q4505J48942J51835K31809j42363j16320L4673M8285
9704H35398Q2746k025q2389p1456k5371q041r5440k4092J22407M5989k52638k41017
$$ plain form
9781 105561 -57647 -107211 90936 31999 -52524 147651 152191 12423 -81532 74627 171675
9770 171675 77124 151622 43708 -92764 148386 252520 339451 357626 258217 219323 95553
9759 95553 5907 35059 -10729 134326 162392 -90025 -38188 87173 191396 238089 126804
9748 126804 -12059 -16754 155042 332405 351832 315940 302010 267862 206402 139881 144333
9737 144333 -13090 -246018 -7443 96014 103243 414156 283359 218328 192795 263852 554617
9726 554617 625164 498121 215716 90425 115397 111990 311505 316270 437261 490388 643359
9715 643359 652699 443216 394032 478537 627479 779314 1011123 868760 752440 787113 835398
9704 835398 918144 916119 833730 762274 736903 728862 633422 609330 731737 777726 525088 284071
9692B84071J24660O2388p3629J144J99640J17219Q9677j8595j45466k23188l28381
9681H9540j06389o0848Q4265M9232K05887o1054r4918j44674k2137J60559J97899
9670B97362R0745j91820k22178P0210K19728K32831l4501k24607p9935J02470
9660B60305J03553n0141M2908p2633k68127O6678M08854J26190l25160j61078
9650A31349N2287J25559m2003o3357J54767l1581l0273j06394j08777R3498P6214
9639B51289j18535r5537N4144j94425K73188J80615N3024L06650p3111k86362
9629C50940k21466j68212q2681L23663J53468P5371m3571l06533k59811j49747
9619c28579L4306L48732K45084J4226n3450k44544O7672J28157J82096n2900K0267
$$ plain form
9692 284071 408731 471119 397490 398634 598274 715493 805170 786575 641109 417921 89540
9681 89540 -16849 -77697 6568 55800 261687 200633 105715 -38959 -61096 99463 297362
9670 297362 388107 196287 -25891 44319 264047 496878 462377 237770 157835 260305
9660 260305 363858 313717 356625 283992 15865 82543 491397 617587 292427 131349
9650 131349 183636 309195 267192 203835 358602 327021 296748 190354 81577 175075 251289
9639 251289 132754 37217 91361 -103064 170124 350739 403763 710413 637302 350940
9629 350940 129474 -38738 -121419 202244 355712 431083 387512 80979 -178832 -328579
9619 -328579 -294273 54459 299543 313769 260319 15775 83447 211604 393700 340800 361067
9608C61067L097p1658J13928r7249k22472m980k36019J78082J83242j6174o5829
9597A25035k701L12349K3661q4213J06449K91731k37061J92444M29101L39423
9587A496218j1365q7759k42296k59455j45539q2811K8280n5308K0956j17369k18555
9576C24997N71j4379q8579l6180p501j42897q2289L4186L77967M0002J9004k6358
9564C98544O9858k33120q1605k2398J5748j23764j8663Q3089N7675K10289J74089
9553E29742j32970k0233j7596K38476J17887j71492k21508L3611n4883R4394o8045
9542C27383j68519J62308k00473P2815K62100K8186j98307k7165K6156K4216J96968
9531E05668J8609k40984k58548p8885J05408L6870k0434N3807R794K1811R4302
$$ plain form
9608 361067 364164 292506 406434 309185 86713 81733 -154286 23796 207038 190864 125035
9597 125035 122334 434683 458344 374131 480580 772311 535250 727694 1156795 1496218
9587 1496218 1484853 1397094 1154798 895343 749804 666993 695273 639965 660921 543552 324997
9576 324997 325568 311189 222610 186430 178929 36032 -46257 -12071 365896 405898 424902 398544
9564 398544 468402 235282 153677 131279 147027 23263 4600 87689 145364 355653 529742
9553 529742 396772 376539 358943 597419 715306 543814 322306 355917 301034 395428 327383
9542 327383 158864 321172 120699 193514 455614 483800 285493 258328 284484 308700 505668
9531 505668 524277 283293 24745 -54140 51268 88138 67704 121511 131305 153116 247418
9520B47418J74088j85465p8386k35393m6421L97568K73602q1219j98106q8149
9510A79537k8494k18382q1962L0008K27604J77325K2345j75033L5668J23355l27812
9499c5841l14713r4389M0477J39740R7301K26213j55441K40977K13144M1797J44921
9488E44186j9029p5143k82869q0424P5938J27806j66867k67087K2760J53654n4130
9477b1205N6485J64651j6987j04685l2781q8695P1417O8992K20902O1293m839
9466C74548k0176M4623K1876J18235j34902j44931k3308P340K5461j33350Q4212
9455B19628O4469k88217j82678J45673L5579l8929k60772r8536L88696J3342j572
9444c317M7761O1174K14286K26343k7903m7881k63703r0685K5301j45184J72570
$$ plain form
9520 247418 421506 236041 157655 -77738 -124159 273409 547011 465792 267686 179537
9510 179537 151043 -67339 -149301 -119293 108311 285636 307981 132948 168616 291971 -35841
9499 -35841 -350554 -444943 -404466 -264726 -167425 58788 -96653 144324 357468 399265 544186
9488 544186 525157 450014 167145 86721 162659 290465 123598 -143489 -120729 32925 -21205
9477 -21205 35280 199931 182944 78259 45478 -43217 28200 97192 318094 379387 374548
9466 374548 354372 398995 420871 539106 404204 259273 235965 243305 268766 135416 219628
9455 219628 284097 -4120 -186798 -41125 -5546 -44475 -305247 -403783 -15087 -1745 -3317
9444 -3317 44444 105618 319904 546247 518344 470463 206760 116075 141376 -3808 168762
9433A68762o4579o6911O7025N7665r5213R3073J04384N9080n8054p1680L2476
9422B26028R2249j77030l47734K79314K97195j14392j97567j03743o1387J2055
9412i5012q2278R4356J11493M4993Q3869j69870j5380N1768K28222K3645p2227
9401B03579k16867K20084K11844r8508o5282k56795j36911Q8751K31343O9396
9391B50634p487P8389j53954l6914L4651M5544j17065J12981K4622j34222k17037
9380a19858j85885L3939q3428O3503J38347P6253L7513p1030l0953j04374K28361
9369a7612J88521j28300l46280L6372R5165J06991K65934j6075k45220j80777
9359b41281P4512J54821K61334J27731k48740k16122J28179K3245j93966q8885
$$ plain form
9433 168762 104183 37272 104297 161962 66749 159822 264206 323286 265232 193552 226028
9422 226028 318277 141247 -206487 72827 370022 255630 58063 -45680 -107067 -95012
9412 -95012 -177290 -82934 28559 73552 157421 -12449 -27829 23939 252161 275806 203579
9401 203579 -13288 206796 418640 320132 254850 -1945 -138856 -50105 181238 250634
9391 250634 243147 321536 167582 130668 165319 210863 93798 206779 231401 97179 -119858
9380 -119858 -305743 -271804 -355232 -291729 -153382 -77129 -39616 -110646 -141599 -245973 -17612
9369 -17612 170909 42609 -303671 -267299 -172134 -65143 200791 184716 -60504 -241281
9359 -241281 -166769 -11948 249386 377117 128377 -87745 40434 63679 -130287 -219172
9349b19172j09681L1012K49308n2773r9983K45153j07474j32682O8079Q1085Q3378
9338C6250j27362k29762L3605J09358K02813L05003J25086j03614m3134j81389
9328A26854j28811J10396N2419l3226k7470K646J9691R0092j55427r2563P6769
9317D1370J07764L2665N0173j61181j66258j50828J61824J40370L24J56191k06018
9306F396N5903N3269j27172q3213L0176n1733j65338j67865j83044J82188K33876
9295b16557K16821O3253j40243Q5696J99997k2447j2239R3993m9516k61504k7846
9284g0592J74254n0368k16113k3428J08162J2843j83357J77410n3098j15271j93311
9273d32869J48369K53435K71036L3417k48396q4382L2086N0494N5756k23545j05374
$$ plain form
9349 -219172 -328853 -297841 -48533 -101306 -201289 43864 -63610 -196292 -128213 -47128 36250
9338 36250 -91112 -320874 -287269 -177911 24902 329905 454991 351377 308243 126854
9328 126854 -1957 108439 160858 127632 100162 102808 122499 212591 57164 -35399 41370
9317 41370 149134 181799 231972 70791 -95467 -246295 -84471 55899 56223 212414 6396
9306 6396 62299 115568 -11604 -94817 -64641 -116374 -281712 -449577 -632621 -450433 -216557
9295 -216557 264 63517 -76726 8970 208967 186520 174281 268274 218758 -42746 -70592
9284 -70592 103662 53294 -162819 -186247 -78085 -65242 -248599 -71189 -124287 -239558 -432869
9273 -432869 -284500 -31065 239971 273388 24992 -59390 -27304 23190 78946 -144599 -249973
9262b49973l9279k33572J26780K54925J67432m7529k0682o4669N2873j12252j15329
9251b81275J82781K03726N9339r6198J9834l2860j9021j38780r4271j4621J79203
9240c2143K14288k19223o0592q8776q4863K09634j14480j82485j1007J33567n694
9229b41774N8834J1311k31906M4198K31608J56377r2049j68526r1318J6701p6685
9218c83229J79844R7313N5035k8226L3128J01348K0221J5319o5256q6661p1034
9207a32198j81057K04713L0230p2424L0122J38503K74696o6211k25474j64594
9197a63694P6318k3736j82373j3969L71742O2142j73784N9325K96426j7968j36264
9186A54165M0432K8393j44429j05141l2730K16283j02507m45898J2372J28135
$$ plain form
9262 -249973 -289252 -522824 -396044 -141119 26313 -21216 -41898 -106567 -53694 -165946 -281275
9251 -281275 -98494 105232 164571 68373 88207 55347 36326 -102454 -196725 -211346 -32143
9240 -32143 182145 -37078 -97670 -186446 -271309 -61675 -176155 -358640 -369647 -236080 -241774
9229 -241774 -182940 -171629 -403535 -359337 -127729 28648 -63401 -231927 -323245 -306544 -383229
9218 -383229 -203385 -106072 -51037 -79263 -46135 55213 75434 90753 25497 -61164 -132198
9207 -132198 -313255 -108542 -78312 -150736 -120614 17889 292585 226374 900 -163694
9197 -163694 -87376 -111112 -293485 -307454 64288 126430 -47354 11971 308397 290429 154165
9186 154165 194597 222990 78561 -26580 -59310 156973 54466 -391432 -379060 -250925
9176b50925p4387J74404N9620K40548J10925M9150k19451j1722r9516P6607L23427
9165C78680j26227k27865j11077N9707J74427Q6315k7898J42524Q5990k45979
9155A88597j24675n1696j23240J20840J79061r4848o0379j23268q45J64502k8964
9144D5085J47937P1018q6416k83059r197L61038K92126k10320j63707k11590j29382
9133a76467p4515Q9367P9110q6974J03892K80803J6239l25499k71323m7040K19451
9122a92956j22770L3391J56255P8884j01289l1472P1481P8542P6833j39622j45567
9111b38290J30543K96360J82689n7689l324O1965j07678P9040J72331l11945k01321
9100B681N3347J03616M1320j05879q8063J18094j31912o5495P405j09424K12896
$$ plain form
9176 -250925 -325312 -150908 -91288 149260 260185 309335 89884 78162 -21354 55253 378680
9165 378680 252453 24588 -86489 -26782 147645 233960 206062 348586 434576 188597
9155 188597 63922 12226 -111014 9826 188887 94039 33660 -89608 -90453 74049 45085
9144 45085 193022 264040 177624 -105435 -114632 246406 538532 328212 164505 -47085 -176467
9133 -176467 -250982 -161615 -82505 -169479 -65587 215216 231455 -94044 -365367 -412407 -192956
9122 -192956 -315726 -282335 -126080 -47196 -148485 -179957 -108476 -29934 46899 -92723 -238290
9111 -238290 -107747 188613 371302 313613 310289 372254 264576 343616 515947 204002 2681
9100 2681 56028 159644 200964 95085 7022 125116 -6796 -72291 -64886 -174310 38586
9089C8586J39158K6663J05735J28915q2247J8903K8967k84661j41084K23723q4323
9078A18335j34196J54228j10L5092J25587p2170l6108k7880J5500j09938P7417
9067A45757J29213o2947j41021k38178J41090J38319J33745J26219J2749m21147
9057c6201p2675J13050O691j73710j07714l1912N0290J27787K71470j12430J3455
9046D8101k10151J0840K55889K08942J11497m8053j87411k03275m9056J93392
9036A30715Q4580k9017j46843l9705J57446j0705p1656k31166k1204J73499o5371
9025f9427J96895R1690k41460P7567K02399r5917j28513Q405R2437q1981l8796
9014A3299J61286O2947N7183l8834k5384j28859j86882j02934J87300J10791j89898
$$ plain form
9089 38586 177744 204407 310142 439057 356810 375713 404680 120019 -21065 202658 118335
9078 118335 -15861 138367 138257 173349 298936 226766 190658 162778 178278 68340 145757
9067 145757 274970 212023 71002 -167176 -26086 112233 245978 372197 384946 -36201
9057 -36201 -108876 4174 10865 -162845 -270559 -302471 -252181 -124394 147076 34646 48101
9046 48101 -162050 -151210 104679 313621 425118 377065 189654 -13621 -62677 130715
9036 130715 215295 186278 39435 -270 157176 146471 74815 -156351 -177555 -4056 -69427
9025 -69427 127468 219158 -22302 55265 257664 161747 33234 41639 134076 52095 13299
9014 13299 174585 237532 294715 255881 230497 101638 -85244 -188178 -878 109913 -79985
9003g9985l8311J69662K1046K40010n9914k57982j31001J26073J22418j2246R0924
8992A90694j25681j02125q6126J40108J34432O565j58314l10599j17428K64903
8982a63571L25794O3113J01892j9490p8554j48706j22594q6049Q3938K5736R8851
8971H0360j24496n0558n2088m5291j36411K0811J74023k2532N3967K32926K86221
8960D16932j28216j35546k3439o6555p2190P7220J6507K54709r6904m5354r6718
8949A00446q5013l35128k35788L26998K50895j15261j76299J34114J30445L77739
8939C73148R9634j56443k29839o4245o7421L178k4399k9500j59197j1304J32222
8928a34166R7109j32334R9092K3131j59448J75843P2489p603k10411K6357J40870
$$ plain form
9003 -79985 -118296 51366 72412 312422 252508 -5474 -136475 -10402 112016 99770 190694
8992 190694 65013 -37112 -123238 16870 151302 157867 -447 -311046 -428474 -163571
8982 -163571 162223 225336 327228 307738 229184 80478 -42116 -128165 -44227 -18491 80360
8971 80360 -44136 -94694 -146782 -192073 -328484 -307673 -133650 -156182 -102215 130711 416932
8960 416932 288716 153170 129731 63176 -9014 68206 84713 339422 242518 197164 100446
8949 100446 15433 -319695 -555483 -228485 22410 -92851 -269150 -135036 -4591 373148
8939 373148 472782 316339 86500 22255 -45166 -41988 -66387 -95887 -255084 -266388 -134166
8928 -134166 -37057 -169391 -70299 -47168 -206616 -30773 41716 34113 -176298 -149941 -9071
8917i071K18579j25297n1616k1668m024L5890M8056J66902J04424p2224k71038
8906A8913j44771M3260R281P221K35353o440j79215p5697J33695k9305m7766p5439
8894a10910k7429r7864n0532j81558j33757J22161K74671k2063Q7132K16566k1452
8883E4965k05071Q7189K42373m3559j34946J98007L6105K8031n3229p3345P3612
8872B10132j02631j5128m774k34808j05237M1618l3794L79136Q0944M6895j08351
8861A54002j62359n6837k9273J37091J01393M6922n7835Q7097j36954j99518o9177
8850a85448J06171J49482Q3982M1473m3407j48682k37473K28315P9944k30548
8840a56191j16909J77353L27865J16705k45806k50854O9600J77807p0776k23236
$$ plain form
8917 -9071 209508 84211 32595 10927 6903 42793 90849 257751 362175 289951 18913
8906 18913 -125858 -82598 -73317 -66096 169257 162817 -16398 -92095 41600 12295 -35471 -110910
8894 -110910 -138339 -236203 -286735 -468293 -602050 -479889 -205218 -227281 -140149 76417 54965
8883 54965 -150106 -62917 179456 135897 951 198958 235063 263094 209865 136520 210132
8872 210132 107501 92373 87599 -147209 -252446 -210828 -244622 134514 215458 262353 154002
8861 154002 -8357 -65194 -94467 42624 144017 190939 133104 220201 83247 -116271 -185448
8850 -185448 -79277 70205 154187 195660 152253 3571 -233902 -5587 74357 -156191
8840 -156191 -273100 -95747 232118 348823 103017 -147837 -78237 99570 28794 -194442
8830a94442q9333m1438J00408k5065p8316p668K30938R1119M8463J6152j17170
8819f6352j18604l6801K72261J66582M5834k24868P321j02495M363K23178O6035
8808B36454m5963k15142j28828J22165j20329q2308L08860m2950k4099J17892
8798A25752j18840O7045q953j04161k1332K56315p7586m51458k61496K67485L57049
8787B9820J53065M7401p4365j5458R416m6412j1987Q1733o332P3088j34203n6922
8775D8844n2210K00567K0160J7664j32816j64351K48352N1516l3133J10416J2963
8764C27972j05490l590k92560j73018j8558K02364Q0452r5347p1196j89991J32059
8753b06903J1209l4214J59707k5852m5811r4487J07903J00355O6995j1971j65690
$$ plain form
8830 -194442 -283775 -325213 -224805 -249870 -328186 -335854 -104916 -13797 34666 50818 -66352
8819 -66352 -184956 -221757 50504 217086 262920 38052 45373 -57122 -52759 170419 236454
8808 236454 190491 -24651 -153479 -31314 -151643 -233951 74909 31959 7860 125752
8798 125752 6912 73957 65004 -39157 -60489 195826 118240 -333218 -594714 -327229 29820
8787 29820 182885 230286 155921 140463 149879 103467 91480 173213 166881 239969 105766 48844
8775 48844 -3366 197201 217361 235025 102209 -62142 186210 237726 204593 315009 327972
8764 327972 222482 218892 -73668 -246686 -265244 -62880 17572 -77775 -148971 -338962 -206903
8753 -206903 -195694 -229908 -70201 -96053 -141864 -236351 -128448 -28093 38902 26931 -138759
8742a38759q0397J93617J94065O2529j21261P0653q1169J46342N9593l1914j26934
8731A46365o9405J37923N1189l8696j85197k01923R5398j28389Q653J54745J6940
8720a2397L7433J45955o4245n9186O8128K12124p9226j74174j21463N7119L14065
8709C24133J27460k47750k99858l5905N0890l2900R7105P0560k31384j9092j32066
8698c28807q2035K2357j5333K7388J6172j8217J17792N7323P1505M9332J83928
8687A01405J13239J22324J23598j39614j65501k5993k64452j05918j48147n8723
8677d47782Q5208J68087J67267O3316j28883M0743n5198l8999m0473r0444M1809
8666b35349Q7288J14576J36678P8997N9044q5026j08665o5636N6800l9894J09349
$$ plain form
8742 -138759 -219156 -25539 168526 231055 109794 180447 99278 245620 305213 273299 146365
8731 146365 76960 214883 266072 227376 42179 -159744 -64346 -192735 -184082 -29337 -12397
8720 -12397 25036 170991 106746 47560 115688 327812 248586 74412 -47051 10068 324133
8709 324133 451593 203843 -96015 -131920 -81030 -113930 -16825 53735 -177649 -196741 -328807
8698 -328807 -410842 -388485 -403818 -376430 -360258 -378475 -260683 -203360 -131855 -82523 101405
8687 101405 214644 336968 460566 320952 155451 129458 -134994 -240912 -389059 -447782
8677 -447782 -362574 -194487 -27220 36096 -92787 -52044 -107242 -146241 -186714 -277158 -235349
8666 -235349 -148061 -33485 103193 182190 241234 156208 47543 -18093 38707 -1187 108162
8655A08162k19159j67978M3963N2694m0201Q9114J18189o3479j49244r5981J56706
8644a67214L0016l5856N410K36280K28752J55604j48971k80765q8448K7076N5056
8633A6940J06442J00883j03908k04797k46077J59251K38263M3042J14613k1464
8623B03188J00407j37983j22235J3114J6660p0317K1944j12231J54504K80666
8613C47717J81136m08041k58786J05405j70267K8523k46712k05494M5207K31285
8603c50027R2939J46000J08453O7661K47609j94132k20852l6370P4054P6450P0352
8592H2137L2600K60768O7829p0004j01777P5838p1764j98422k03852K68369N3858
8581A95580j00540J39912Q4110Q2226l6087p291J96987m5807l05183j14839o9033
$$ plain form
8655 108162 -110997 -278975 -235012 -182318 -222519 -133405 -15216 -78695 -227939 -323920 -167214
8644 -167214 -137198 -173054 -167644 68636 297388 452992 304021 23256 -65192 -38116 16940
8633 16940 123382 224265 120357 -84440 -330517 -171266 66997 110039 224652 203188
8623 203188 303595 165612 43377 56491 73151 2834 24778 -87453 67051 347717
8613 347717 528853 120812 -137974 -32569 -202836 -174313 -421025 -626519 -581312 -350027
8603 -350027 -257088 -111088 -2635 65026 312635 118503 -102349 -138719 -64665 11785 82137
8592 82137 114737 375505 443334 373330 271553 347391 275627 77205 -126647 141722 195580
8581 195580 95040 234952 319062 401288 365201 357910 554897 509090 203907 89068 20035
8570B0035r892l5940R9234K06936n6963l40034j59291O9624J07725q3690J8805
8559a63451J66656J39172k20278k34735J6520K3249J68901l0879k5445R5801q4373
8548a48862J40832J70500n273N7769p9608k8550p4556M1142M6636Q051j01282
8537B6799p6788J61612k25510l32800J6089Q2810L3682Q4183J23800J21681K6645
8526D2203J04801O6976m0620J08079R4522J85449O1031k96379k81015k01310O7345
8515h8918R5673P8514M7053J99906O4783J9528J15407l3167j36543q4139k05005
8504G3092n4278K1795L9645J15173n2030K4389O7944j47056K0365q839K3596J69392
8492B93188K35472k5814j73830j03404k56598m482n1539n4887J99091K16263l6814
$$ plain form
8570 20035 10143 -25797 73437 280373 223410 -116624 -275915 -206291 -98566 -182256 -163451
8559 -163451 3205 142377 -77901 -312636 -296116 -272867 -103966 -134845 -160290 -64489 -148862
8548 -148862 -8030 162470 157197 214966 135358 106808 32252 73394 120030 128081 26799
8537 26799 -49989 111623 -113887 -446687 -430598 -347788 -314106 -229923 -106123 15558 42203
8526 42203 147004 213980 173360 281439 375961 561410 622441 326062 45047 -156263 -88918
8515 -88918 6755 85269 132322 332228 397011 416539 531946 498779 362236 278097 73092
8504 73092 18814 40609 80254 195427 143397 167786 235730 88674 109039 100200 123796 293188
8492 293188 528660 502846 329016 225612 -30986 -35468 -87007 -141894 57197 273460 236646
8481B36646J60897j93898j3491m830J22440O766o9414Q9385J92813j22781l81596
8470B2937L7340k5341k12322R8804J37457l808K66882l1229j10684J23089Q2640
8459C85765o4116k48420k24673O8730p9772L3646J72883j61643r4868J79055j47635
8448a81048n3275P9545J44264J36945K24811q9682l32875l0614P7904K65480K26552
8437D68007L4800m2174Q9822L3640O2387j5687l73668l30388n0859J23869P328
8426G077J0353k25281m495j05358K0952J07605k8774P1302j50735J4399N4123
8415b28832r7993J78298K22483J33288N102j08204J0325p3476l54166K9577K09753
8404g3845J01772K69204J02684j82389l11047j59349K83369L1211J44526J42182
$$ plain form
8481 236646 397543 203645 190154 185324 307764 314530 245116 334501 527314 404533 22937
8470 22937 60277 34936 -177386 -78582 58875 55067 321949 290720 180036 303125 385765
8459 385765 321649 73229 -151444 -82714 -162486 -128840 44043 -117600 -212468 -33413 -181048
8448 -181048 -234323 -154778 -10514 126431 351242 261560 -71315 -101929 -24025 241455 468007
8437 468007 502807 460633 550455 584095 646482 630795 257127 -73261 -124120 -251 7077
8426 7077 17430 -207851 -212346 -317704 -296752 -189147 -217921 -146619 -297354 -282955 -228832
8415 -228832 -326825 -148527 73956 207244 212346 104142 114467 40991 -313175 -283598 -73845
8404 -73845 27927 297131 399815 217426 -93621 -252970 30399 61610 206136 348318
8394C48318L4434K58449J21788m51543p9990j62752k6331K4970j42328L8120k6537
8383f3402o0694k6187j0560j29532j85103L3028K88055m860j64546J64581L7101
8372a22119k5207j75938J35419K75274K7383j58842j27857K01106O6190o5636
8362B9773J34858M4538M9164L7844O2798p4025k48544m9949K38257k09784j8575
8351c645J9477j07309K60448N3287N7325N6301J4149r5024j85037O0693N3069
8340A83734l0901j47439m6260j18296L5520o035N2594j33727J39868p202k0799
8329i8943K18202L1978j21825k73599N3912J2856O1003j36215O2103K09633J66383
8318A85488j93370J9767j01182k73098K37012J78020K14954Q152j30358m8877
$$ plain form
8394 348318 382752 641201 762989 311446 231456 68704 42373 67343 -74985 -36865 -63402
8383 -63402 -124096 -150283 -160843 -290375 -475478 -442450 -154395 -159255 -323801 -159220 -122119
8372 -122119 -147326 -323264 -187845 87429 114812 -44030 -171887 29219 95409 29773
8362 29773 164631 209169 258333 296177 358975 284950 36406 -13543 224714 14930 -3645
8351 -3645 15832 -91477 168971 222258 279583 335884 350033 255009 69972 130665 183734
8340 183734 152833 5394 -40866 -159162 -123642 -129677 -77083 -210810 -70942 -78144 -98943
8329 -98943 119259 151237 29412 -244187 -190275 -177419 -116416 -252631 -190528 19105 185488
8318 185488 -7882 11885 -89297 -362395 -125383 52637 267591 275743 145385 96508
8308I6508J26531J52558p2012p0773j01715l25078j65059n7176J09716m6134q009
8297c60643K05222N0744L0527j4722J12222j47821r3583l4081J50816M4413P4696
8286A7790l11851n3059J60481r2391M8702n4418j23949k1776K43850M53487o7477
8275A99389k77031j58330k7488N2763J17007p2587O2468J85597m850k5388J2223
8264F3773J7057k53425k52584M7145K16988M5364J26538j60698j10676P3561O573
8253a80384K35111J01632j7618j09104j2828P9121p9229j56467J80541k7811Q6129
8242I9093K59501k00803k09773n0596K50817K1551J87665j11641j86890j94768
8232a35844j44933j2808L6571k0706J78042Q6772j9678p6227J37261L67570J5302
$$ plain form
8308 96508 223039 375597 303585 232812 131097 -193981 -359040 -416216 -306500 -352634 -360643
8297 -360643 -155421 -104677 -74150 -88872 23350 -124471 -218054 -252135 -101319 -56906 17790
8286 17790 -294061 -347120 -186639 -279030 -230328 -284746 -408695 -430471 -186621 266866 199389
8275 199389 -77642 -235972 -263460 -210697 -93690 -166277 -103809 81788 76938 51550 63773
8264 63773 80830 -172595 -425179 -378034 -161046 -115682 10856 -149842 -260518 -186957 -180384
8253 -180384 54727 156359 138741 29637 16809 95930 16701 -139766 40775 12964 99093
8242 99093 358594 157791 -51982 -102578 148239 169790 357455 245814 58924 -135844
8232 -135844 -280777 -293585 -257014 -277720 -99678 -12906 -32584 -108811 28450 396020 411322
8221D11322q7842j38003j85815j50406P215K14003O2575L0993J89592j74320j95469
8210a6155l3611J10077J0838P9639K9004K6972j70162j56318M4946O8154P857
8199A241P1747k8345N7541P3125P0017j92266l08694n3883j5368J10921R4192
8188a19772M2023R1008J64200K31152R7483K6496l79202k74899l3524P1664K7842
8177e5529L5763j17502q5707N2638J18394J58379o7032j43589j51031R3055K98007
8166A35846k5881o4057j10648j9353m784J23318m1223O8102n1449j09804j71487
8155b71420q806M03524K43943n0943j38940k93149j93908r5729J00620K16476
8145h8332p4674j9170K43048p6542k60623O9184R0145k5652q8184O8647j42326
$$ plain form
8221 411322 323480 185477 -338 -150744 -143529 70474 133049 164042 353634 179314 -16155
8210 -16155 -49766 60311 71149 150788 179792 206764 36602 -119716 -74770 -6616 1241
8199 1241 72988 44643 102184 175309 245326 53060 -255634 -309517 -324885 -213964 -119772
8188 -119772 -77749 13259 177459 408611 506094 532590 153388 -121511 -155035 -83371 -55529
8177 -55529 -19766 -137268 -222975 -170337 -51943 106436 39404 -104185 -255216 -162161 135846
8166 135846 109965 45908 -64740 -84093 -88877 34441 -6782 61320 9871 -99933 -271420
8155 -271420 -280226 123298 367241 316298 177358 -115791 -309699 -405428 -304808 -88332
8145 -88332 -163006 -182176 60872 -15670 -276293 -207109 -116964 -142616 -230800 -162153 -304479
8134c04479r4966J18213K63787K91127m6577J3286q0118l17261r0825N2080j11790
8123c07523J51703K79718p5898j21448j25954j0912L15454J02228j14334r603
8113H3431k5654J933j8830k42224j89497p3745J28817K03957J46192k0284o318
8102a2222J14781K8394K2526J06229K0029j63803k72016m1896k24656K9350J71923
8091b21361L2948l2547l5023n8076o9203M9929K29294K8713k39255k8556J56583
8080a86554L7019j6414n0228K1739j8376N1005J25650N322j12103m1414o8306
8069b52660q0897J69228K80044R02j33043k6901J15136R5238L1759j8675j98724
8058a8593k30053j9767O7827K24523K9365m357j72094K26120k1851q0017k20596
$$ plain form
8134 -304479 -399445 -281232 -17445 273682 227105 240391 160273 -156988 -247813 -195733 -307523
8123 -307523 -155820 123898 48000 -73448 -199402 -210314 105140 207368 93034 83431
8113 83431 57777 59710 40880 -201344 -390841 -464586 -335769 -131812 14380 -5904 -12222
8102 -12222 102559 130953 153479 259708 279737 115934 -156082 -197978 -422634 -393284 -221361
8091 -221361 -188413 -220960 -255983 -314059 -383262 -333333 -104039 -75326 -314581 -343137 -186554
8080 -186554 -149535 -165949 -216177 -194438 -212814 -161809 -36159 -30837 -142940 -184354 -252660
8069 -252660 -333557 -164329 115715 116617 -16426 -43327 71809 167047 198806 180131 -18593
8058 -18593 -248646 -268413 -200586 23937 53302 48945 -123149 102971 81120 1103 -219493
8047b19493J70613j6562q2390j04190k13040j36643K46490K35001k5124k05467
8037c50805K7506J44268J77020L1753q1253J0599L4080K1017n2994j41426R007
8026a71228j16463O6188j29094L2607K15228k1563J30430Q4359M0862O0537j67738
8015B4125j86778j69638J14592o2252J08277R975l439m9433K7289M4266Q6791
8004e6225P7536J2540R9964J04262k10704j2594O9985J95089j5092j17326J4359
7993A61794k91551J7761J72309J41005m2404K4740L630j89803p1336N8110Q9978
7982G4233k4926R4147Q0946q7122K68624Q2187j65532j74565k4360l5961j29163
7971d1492j00497j06409K7627J10522P5000j49125J68434J29336j71780q2087
$$ plain form
8047 -219493 -48880 -65442 -147832 -252022 -465062 -601705 -355215 -120214 -145338 -350805
8037 -350805 -323299 -179031 -2011 29742 -51511 -40912 -6832 14185 -38809 -180235 -171228
8026 -171228 -287691 -221503 -350597 -317990 -102762 -124325 6105 90464 131326 191863 24125
8015 24125 -162653 -332291 -217699 -279951 -171674 -161699 -165138 -214571 -187282 -143016 -56225
8004 -56225 21311 33851 133815 238077 27373 14779 84764 279853 264761 147435 161794
7993 161794 -129757 -111996 60313 201318 158914 183654 187284 -2519 -73855 -15745 74233
7982 74233 49307 143454 224400 137278 405902 488089 322557 147992 123632 87671 -41492
7971 -41492 -141989 -248398 -220771 -110249 -35249 -184374 -15940 113396 -58384 -140471
7961a40471k05443q5089O2713P3911P4311L9039k9920Q5597Q8472p5425J61488
7950D9183K8061k96885j56546K93833L07795K12389j68191j25305n4843q6559
7940B932K5294K3402j75579N6332K2344K555L3824J348J58041j49383O5903M6809
7928A13822k51699k43076R0363K07739j18462j02691K49251K07388n9860j84800
7918i2025l5831K5968J05527j06983L5168J87953q2579k93055o9594o6643J02319
7907b89775K87827J22156j47261r8495j58441m1978L49468O2454R7884k9084N2120
7896B06875j14900j17807q9311j94372j05566K08395J24601k0473J00660O8393
7886F6495J2587j30591k15297P8252K04474k39582k47749J03224J12733J57567
$$ plain form
7961 -140471 -345914 -431003 -368290 -294379 -220068 -181029 -210949 -125352 -36880 -112305 49183
7950 49183 77244 -219641 -376187 -82354 225441 437830 269639 144334 89491 2932
7940 2932 28226 51628 -123951 -67619 -45275 -42720 -8896 -7548 150493 1110 67013 113822
7928 113822 -137877 -380953 -290590 -82851 -201313 -304004 -54753 152635 92775 -92025
7918 -92025 -127856 -101888 3639 -103344 -68176 119777 37198 -255857 -325451 -392094 -289775
7907 -289775 -1948 120208 -27053 -125548 -283989 -325967 23501 85955 183839 154755 206875
7896 206875 91975 -25832 -115143 -309515 -415081 -206686 -82085 -102558 -1898 66495
7886 66495 79082 -51509 -266806 -188554 15920 -223662 -471411 -368187 -255454 -97887
7876i7887K6423l8015j3127L645J24668M0028l0605K4965j33689j20794n9018
7865b73406M9968N9805K62995p7412k44319j023J76280J37996l7620j20596m259
7854g1591J2659K17748P9600j6259j54754j36746J86622K04996j71632l4051l5704
7843H0888o9951Q1758j25411j18673J16200K58528K4204j94269j71628j07162
7833b25516K4364R8129P8847j01112L4702K31537L2031J3483j52162K7026K7316
7822H8645o0800p0116l9894M6954j14402p526O1055o8826l5913J65655K99227
7811B64059R4609k09208j11778J053j29879o4944J58969j12682l330k73710K51869
7800a34972K90746n21O417q8215q8503J94085j26179k43866r4800J89979n191
$$ plain form
7876 -97887 -71464 -109479 -122606 -118961 5707 45735 15130 40095 -93594 -214388 -273406
7865 -273406 -223438 -163633 99362 21950 -222369 -223392 -47112 90884 53264 -67332 -71591
7854 -71591 -58932 158816 238416 222157 67403 -69343 117279 322275 150643 116592 80888
7843 80888 10937 92695 -32716 -151389 -35189 223339 247543 53274 -118354 -225516
7833 -225516 -201152 -103023 -24176 -125288 -90586 140951 172982 186465 34303 61329 88645
7822 88645 27845 -42271 -82165 -35211 -149613 -157139 -96084 -164910 -200823 -35168 264059
7811 264059 358668 149460 37682 38735 -91144 -156088 2881 -109801 -113131 -386841 -134972
7800 -134972 155774 155253 161670 73455 -15048 179037 52858 -191008 -285808 -95829 -101020
7789a01020j24160O3686J80734J00453J62530p4819p4133j37888j50544K73975
7779A18814J32357k11219L960J2822K6102Q5328O1204k70926j92301j33245r0033
7768d57137N848k27517N4232j4367K60832N6364o4248n3587O6721P9833N8447
7757b34579J56383m3569k48469j98711k9979J39465O3638K34281J09700k4237
7747g6077L5359O9498j42546l4949O8014L76180Q206j11690j37190k66209j50322
7736c61726L9084J7789P929K69503r8839q9649J50959J95007j35601J06461j63732
7725f2815j11578o230P2155j73483k28146K677O7309R3015J53037J22514N4912
7714a6633K3769j33365M6164K47549P4601j74671k74170q2210J66528K9416Q2874
$$ plain form
7789 -101020 -225180 -161494 19240 119693 282223 207404 133271 -4617 -155161 118814
7779 118814 251171 39952 43912 56734 82836 168164 229368 -41558 -233859 -367104 -457137
7768 -457137 -451289 -678806 -624574 -638941 -378109 -321745 -385993 -439580 -372859 -293026 -234579
7757 -234579 -78196 -121765 -370234 -568945 -598924 -459459 -395821 -161540 -51840 -76077
7747 -76077 -40718 28780 -113766 -148715 -80701 295479 303685 191995 54805 -211404 -361726
7736 -361726 -322642 -304853 -296924 -27421 -126260 -215909 -64950 130057 -5544 100917 -62815
7725 -62815 -174393 -180623 -108468 -281951 -510097 -507420 -440111 -347096 -194059 -71545 -16633
7714 -16633 7136 -126229 -80065 167484 242085 67414 -206756 -288966 -122438 -93022 -10148
7703a0148j9773J06432k9244j81180J4816P0342J88531k25720j96542n6875K7697
7692c11664J51932o1470P3840K15343L8719p3377m4121j36854l04809P7267K52636
7681a22558Q7044j7000J87050l8850j89125j08790J01334K05812J70947r1626
7671A84238o7670n5746q6534k18195R0761K7540N4047L7465J64685J02045m1736
7660A90900j36326j04758k30864j2998P4691K14461R1382K9438j69508l5043J2722
7649g5903K31621J40395j42366k6720j49174j13715k93254q644J56566K38901
7639d2293N4616L3499j8374L2135j11314j42596J47910l5568n6180K8522J85758
7628G6115J02694k58299p0093M07439p5139j21285J33831l6978m4910m7021l9637
$$ plain form
7703 -10148 -29921 76511 47267 -133913 -119097 -48755 139776 -85944 -282486 -339361 -311664
7692 -311664 -159732 -221202 -147362 67981 106700 33323 -10798 -147652 -452461 -375194 -122558
7681 -122558 -35514 -52514 134536 95686 -93439 -202229 -100895 104917 275864 184238
7671 184238 116568 60822 -25712 -243907 -153146 -125606 -71559 -34094 130591 232636 190900
7660 190900 54574 -50184 -281048 -294046 -219355 -4894 86488 115926 -53582 -88625 -75903
7649 -75903 155718 296113 153747 127027 -22147 -135862 -429116 -437760 -281194 -42293
7639 -42293 12323 45822 27448 59583 -51731 -194327 -46417 -81985 -138165 -109643 76115
7628 76115 178809 -79490 -149583 257856 182717 61432 195263 158285 113375 66354 26717
7617B6717Q0043N7249k91507o9214O0360J12130J09238j21222j31315J83185m6686
7606c1022k55082o1810J10185q7794m1987j04490J46914O5462Q1322k89668L7339
7595d30631L27227R5478J12480j57636j90632R413K19025P7037j11180J5806O7210
7584C3597m995N1000l2123J60268P2059q3324J28691K22793j98311j74118P622
7573A83159M958P8326q6577p1809L8983j14295R4670M2307j13122K10089k1083
7562B45606q0060j27209k76985J46825M19954m1814j51409O067j85594j85071
7552b29690J62216k84050k418R1990L20856O1165j90582O7169k15318j03139Q6885
7541b34916l6087K38611J84755j95193k20357J94630J11955j59031j18243M0088
$$ plain form
7617 26717 106760 164009 -127498 -196712 -136352 -24222 85016 -36206 -167521 15664 -31022
7606 -31022 -286104 -347914 -237729 -325523 -367510 -472000 -325086 -259624 -178302 -467970 -430631
7595 -430631 -103404 -7926 104554 -53082 -243714 -234301 -15276 61761 -49419 -33613 33597
7584 33597 28602 79602 47479 207747 279806 196482 325173 547966 349655 175537 183159
7573 183159 188117 266443 179866 108057 147040 32745 127415 169722 56600 266689 245606
7562 245606 165546 38337 -238648 -91823 328131 286317 134908 140975 -44619 -229690
7552 -229690 -67474 -351524 -353942 -261952 58904 120069 -70513 -3344 -218662 -321801 -234916
7541 -234916 -271003 -32392 152363 -42830 -263187 -68557 43398 -115633 -233876 -193788
7531a93788J70988L24934j5716L0865r633j35938l07667O2175Q1251p6215J22131
7520E3387R8920k8911j08097J4438O1818J03092Q5605k0238j72198j99455j71316
7509b82955j49036J01775R6459J07601j05864j78071j4457J97566Q4987j37232
7499b79227j5134J6303M8109J94668O6550k50404j31499J07326R1450K00907K1047
7488G0096J14561o7047l80440k8544J76839L92932p8786l6608j64214k21302j38639
7477c61152l0883K99440K23889j14695l35936M3978J5862J76114K58110R1749
7467B66476k63155q3721M5837N9921Q8648k3710j64887n6179J6311J16293K59249
7456B61083j5458r1563j3521j35446k67844k28357L0938M2538L4792J06575M189
$$ plain form
7531 -193788 -22800 302134 286418 317283 307650 171712 -135955 -73780 7471 -68744 53387
7520 53387 152307 123396 15299 29737 91555 194647 280252 260014 87816 -111639 -282955
7509 -282955 -431991 -330216 -233757 -126156 -232020 -410091 -424548 -226982 -141995 -279227
7499 -279227 -294361 -278058 -229949 -35281 31269 -219135 -350634 -243308 -151858 49049 70096
7488 70096 184657 117610 -262830 -291374 -114535 278397 199611 163003 -1211 -222513 -361152
7477 -361152 -392035 -92595 131294 16599 -319337 -275359 -259497 -83383 174727 266476
7467 266476 3321 -80400 -34563 25358 114006 90296 -74591 -130770 -114459 1834 261083
7456 261083 245625 154062 140541 5095 -262749 -491106 -460168 -417630 -382838 -276263 -272074
7445b72074J9481J46506J40081J33873J09785j25880j60808J83694M0351J00270
7435C15279o0735l28738l45534K16117P2505R048k16117m773Q2268q1041k4098
7424c65819R0068J14524L2826N8468J08235J17908K17586K501j49278k27934l2336
7413c3251R601k11294P4994J53901o5418j10922k33285J8993J44674J26215n5651
7402a81443j08208l3357J05834k5511J78435J87721M0537j52278j92541M7908
7392a32903k71286q1649j11977J49138M65796K97008k5831k29015k89330M8991
7382a81058p3252L0691L36896J91539k71079q4119j7396m180q9732k4477O5025
7371a21142j47328r8318P6243L62797J65619N2224k02022j21925J1731J48602
$$ plain form
7445 -272074 -252593 -106087 33994 167867 277652 151772 -9036 174658 215009 315279
7435 315279 254544 -74194 -419728 -203611 -131106 -122058 -338175 -342948 -260680 -341721 -365819
7424 -365819 -275751 -161227 -128401 -69933 38302 156210 373796 376297 227019 -915 -33251
7413 -33251 -23650 -234944 -159950 -6049 -71467 -182389 -415674 -396681 -252007 -125792 -181443
7402 -181443 -289651 -323008 -217174 -242685 -64250 123471 164008 11730 -180811 -132903
7392 -132903 -404189 -485838 -597815 -448677 17119 314127 288296 59281 -230049 -181058
7382 -181058 -254310 -223619 113277 304816 33737 -50382 -67778 -71958 -161690 -186167 -121142
7371 -121142 -268470 -366788 -290545 72252 237871 290095 88073 -33852 -22121 126481
7361A26481L14465k1660j37029m3275q2338o5506j86893j35069L46120J41571
7351B56867k8044k45358n7129K26400J58093j02926j18035M9077N8351p2630k09458
7340h4792k5480K57363l0597j85818J83028j0687q3935K0189m4570j53721K8154
7329a30866J8492O3558J52332m0009J33224L6870J7907L0905J04130J81650N3820
7318F22013m60802j86458q6931J49410K07139j28861j57130Q9788J3235p2324
7308a0921j81734J82846q9087r6172R9098J51529m6488j53403J34780L9651l9245
7297i146J35189P5094j80351k02396J72748j088J5012L07839p5518k61519J59982
7286A35846n4564k29471j15721J00291n5926l6451K77068Q6673k22058j65730
$$ plain form
7361 126481 440946 419286 282257 238982 156644 91138 -95755 -230824 115296 256867
7351 256867 228823 -16535 -73664 152736 310829 207903 89868 138945 197296 124666 -84792
7340 -84792 -110272 147091 116494 -69324 113704 103017 19082 39271 -5299 -159020 -130866
7329 -130866 -112374 -48816 103516 63507 196731 233601 251508 282413 386543 568193 622013
7318 622013 161211 -25247 -112178 37232 244371 115510 -41620 48168 61403 -10921
7308 -10921 -192655 -9809 -98896 -195068 -95970 55559 9071 -144332 -9552 30099 -9146
7297 -9146 126043 201137 20786 -181610 -8862 -9950 5062 312901 237383 -24136 135846
7286 135846 81282 -148189 -263910 -163619 -219545 -255996 21072 107745 -114313 -280043
7276b80043L7240K31422J18103O7116j57841k29817J36798J74027L5361j3382
7266A18984K36864K21041L4175j79523j87877j06208j27440J73623J89562p3714
7256B99487k59843j01174P1338J41461J41305k18589J34624k02830o2250j09317
7246a65788l23164J29716K64177j20259K8289J46261P3476k4292J1309K07544
7236B27269Q0886l02162r7800o4617j9998j4602N6105o2308K57489M3028j15275
7225a1985J13698l7360K5030j3333q9011R9672k6136j65450P5711l09O3073l1178
7213B422p2641m210P3877p4163l2714R5632K36968Q0998j63317J5315j9704k18603
7201h0140q1784l5932j01107n6913l5313K58304J29201K0057j34638Q5539J08741
$$ plain form
7276 -280043 -242803 -11381 106722 173838 15997 -213820 -77022 97005 132366 118984
7266 118984 355848 576889 611064 431541 243664 137456 10016 183639 373201 299487
7256 299487 39644 -61530 9808 151269 292574 73985 208609 5779 -56471 -165788
7246 -165788 -488952 -359236 -95059 -215318 -187029 -40768 32708 8416 19725 227269
7236 227269 308155 5993 -91807 -156424 -176422 -191024 -134919 -197227 60262 103290 -11985
7225 -11985 101713 64353 89383 76050 -12961 86711 60575 -104875 -29164 -29473 33600 2422
7213 2422 -70219 -74429 -552 -74715 -107429 -11797 225171 306169 142852 158167 138463 -80140
7201 -80140 -161924 -197856 -298963 -355876 -391189 -132885 -3684 16373 -118265 -32726 76015
7190G6015n3910Q2173J23008O4320J50219J07855m68791k15243J03379N7532J49747
7179A76304m5242k10168p3942j08619j71112J63567p274Q3879M3467K3786q37
7168a26191K4609P7072P5178k03103k12826j16266Q9944J5988J21312L83297K90646
7157D19660k83438k65651j89345J04890K13096j7164j35548j2959M8651j3840
7147a31648J42427J01376J71530K01702l00569j96014p9908K4558l3799J16595
7137A6250K72248J01124l6359j38187J0252n5890m6690j36968k04379O8083l7294
7126a87810m861q656L9742L7912K2437q0282j7159J32014N1028J18435j86532
7115h3732j86924j54557j36889K35285J24638j06787q599K43652R7668r4642L2491
$$ plain form
7190 76015 22105 104278 227286 291606 441825 549680 80889 -134354 -30975 26557 176304
7179 176304 131062 -79106 -153048 -261667 -432779 -269212 -276486 -192607 -149140 -125354 -126191
7168 -126191 -101582 -24510 50668 -152435 -365261 -481527 -391583 -375595 -254283 129014 419660
7157 419660 136222 -129429 -318774 -213884 -788 -17952 -153500 -166459 -117808 -131648
7147 -131648 10779 112155 283685 485387 184818 -11196 -91104 -66546 -100345 16250
7137 16250 288498 389622 353263 215076 225328 169438 122748 -14220 -218599 -150516 -187810
7126 -187810 -192671 -201327 -161585 -123673 -101236 -181518 -198677 -66663 -15635 102800 -83732
7115 -83732 -270656 -425213 -562102 -326817 -202179 -308966 -317565 -73913 23755 -70887 -38396
7104c8396j83722Q2785J81299J51785J02396J5705j0672Q7600j37133r2468l1565
7093A27614j74307j62418J03648N2025n2152m218j83613Q7950L4236M363M9149
7082a17723j74145j772K26951K38677j96443r4126N6084J88885J18416o3870M5407
7071B26341q208L4414Q0888o2754l9311J45288j32527j44214o2205j23978j4889
7060a01155p937j36571j39733J68090j97438o6642K52481j30716m5500J50482
7050b54639L8151j22296P9720K14343r4816k24037j3200M50456J48327l482J42769
7039C61296j12696l24812r4409L3775J18662j6456k27300J50619K94754j0949
7029A72484k22549m8374j29452j69915j01254J61278K99930j12953P9327J19326
$$ plain form
7104 -38396 -222118 -139333 41966 193751 296147 311852 301180 388780 251647 159179 127614
7093 127614 -46693 -209111 -105463 -53438 -105590 -109808 -293421 -205471 -171235 -166872 -117723
7082 -117723 -291868 -293640 -66689 171988 -24455 -118581 -62497 126388 244804 180934 226341
7071 226341 218133 252547 333435 270681 231370 376658 244131 99917 37712 -86266 -101155
7060 -101155 -109092 -245663 -385396 -217306 -414744 -481386 -228905 -359621 -405121 -254639
7050 -254639 -216488 -338784 -259064 -44721 -139537 -363574 -376774 73682 222009 218527 361296
7039 361296 248600 -76212 -170621 -136846 -18184 -34640 -261940 -111321 183433 172484
7029 172484 -50065 -98439 -227891 -397806 -499060 -337782 -37852 -150805 -71478 47848
7019D7848n0396j12824P9160J25554k6502j29920J4792Q4486q8795o9229P2616
7008e3210j72655j02140K00573J16493N8197N2806j38930L6280J32102J65697
6998B95213J05730m0294j47982R0802J5077m4491l14k0107J72331l62560j77390
6987a13985q9367p3923J82127L5323j0528p1803n635j09891R7165J60889m4419
6976d4047o6085l7366J88686K41203Q2364j06281k08549J33404J56412j86774
6966A52967j00116N420r1110j71878J61261J0175l4860j13827j36108K77466k22778
6955b63388k11087K17508J31092m9944J83666r7064o0935K00927M3269k9779k5021
6944C9244n0206m01425P7777J7514k28930l33196K59463M14524J42732k02777
$$ plain form
7019 47848 -2548 -115372 -36212 89342 62840 -67080 -52288 32198 -56597 -125826 -53210
7008 -53210 -225865 -328005 -127432 -10939 47258 100064 -38866 -2586 129516 295213
6998 295213 400943 360649 212667 303469 318546 274055 273741 253634 425965 63405 -113985
6987 -113985 -203352 -277275 -95148 -59825 -70353 -142156 -147791 -257682 -160517 372 -44047
6976 -44047 -110132 -147498 41188 282391 364755 258474 49925 183329 339741 152967
6966 152967 52851 58271 -32839 -204717 -43456 -33281 -68141 -181968 -318076 -40610 -263388
6955 -263388 -474475 -256967 -125875 -175819 7847 -89217 -150152 50775 94044 64265 39244
6944 39244 -10962 -412387 -334610 -317096 -546026 -879222 -619759 -205235 -62503 -265280
6934b65280K5265J42322K06991n6942M3492Q1167p5679N8464j26899Q4273K10683
6923C27857J81177J08229k73935j21949J81160L10908J0894m51213j60030P4590
6913A87688j33040l5664k7992j50446r0692K90861j09011j36942P7866L3269N3167
6902d0936K53769j4476j78251k38841j41263l031J07989K8197J34601P7984J83527
6891A69269j63763j76463j99211K72641J37425O1952J27640K1609j44589n983
6881A00527R7902N7360j27963n1765j330k79516K16965J32969k07269l3796q6986
6870a82902K9321R5297J1156J13004P9376r0991p8307K1441p2568R6130M864j58163
6858a32342j75641p6030M2168O5350p059j70224j07428M3949L2625J89664P7446
$$ plain form
6934 -265280 -240015 -97693 109298 52356 95848 177015 101336 159800 32901 117174 327857
6923 327857 509034 617263 343328 221379 402539 713447 724341 273128 113098 187688
6913 187688 54648 18984 -9008 -159454 -250146 40715 -68296 -205238 -127372 -94103 -40936
6902 -40936 212833 198357 20106 -218735 -359998 -363029 -255040 -226843 -92242 -14258 169269
6891 169269 5506 -170957 -370168 -97527 39898 101850 229490 251099 106510 100527
6881 100527 198429 255789 127826 76061 74731 -204785 12180 145149 -62120 -95916 -182902
6870 -182902 -153581 -58284 -47128 65876 145252 54261 -24046 -2605 -75173 20957 25821 -132342
6858 -132342 -307983 -384013 -341845 -276495 -283554 -453778 -561206 -517257 -484632 -294968 -217522
6847b17522M4712j34085q1677J52893J18416j67436j30551J50538l8923j18990
6837d22625P0694P9597K5446K92475J07837l07895k36635J37424Q4654N4590R4825
$$ plain form
6847 -217522 -172810 -306895 -388572 -235679 -117263 -284699 -415250 -264712 -303635 -422625
6837 -422625 -351931 -272334 -246888 45587 153424 -154471 -391106 -253682 -169028 -114438 -19613
$$ [...]
##END NTUPLES=NMR SPECTRUM
##END=
