##TITLE=Analysis number 307250
Compound Code sb 01053
Project Code adrs
Chemist Name stores
##JCAMPDX= 6.0         $$ Bruker NMR JCAMP-DX V2.0
##DATA TYPE= NMR SPECTRUM
##DATA CLASS= NTUPLES
##ORIGIN= Bruker BioSpin GmbH
##OWNER= NMR
$$ XWIN-NMR		Version 3.5
$$ Tue Apr 26 09:17:48 2005 GMT Daylight Time (UT+1h)  MAYBRIDGE\NMR@NMR_250MHZ
##.OBSERVE FREQUENCY= 250.131544655141
##.OBSERVE NUCLEUS= ^1H
##.ACQUISITION MODE= SIMULTANEOUS (DQD)
##.ACQUISITION SCHEME= undefined
##.AVERAGES= 16
##.DIGITISER RES= 18
##SPECTROMETER/DATA SYSTEM= dpx250
##.PULSE SEQUENCE= zg30
##.SOLVENT NAME= CDCl3
##.SHIFT REFERENCE= (INTERNAL, CDCl3, 0, 16.522)
##AUDIT TRAIL= $$ (NUMBER, WHEN, WHO, WHERE, WHAT)
$$ ##TITLE= Audit trail, XWIN-NMR		Version 3.5
$$ ##JCAMPDX= 5.01
$$ ##ORIGIN= Bruker BioSpin GmbH
$$ ##OWNER= NMR
$$ C:\u/data/dgb/nmr/ADRS/2220/pdata/1/auditp.txt
$$ ##AUDIT TRAIL=  $$ (NUMBER, WHEN, WHO, WHERE, WHAT)
(   1,<2005-04-26 09:17:30.60 +100>,<MAYBRIDGE\NMR>,<NMR_250MHZ>,
      <created by zg, POWCHK disabled, PULCHK disabled
       configuration hash MD5:
       62 19 C7 07 E1 42 D1 B7 37 6C 3D D0 77 39 F9 E6
       data hash MD5: 64K
       C9 F4 F2 0B E3 62 CC 35 AC BC 4D B0 E6 4A E7 D1>)
(   2,<2005-04-26 09:17:40.88 +100>,<MAYBRIDGE\NMR>,<NMR_250MHZ>,
      <Start of raw data processing
       ef LB = 0.3 FT_mod = 6 PKNL = 1 SI = 32K 
       data hash MD5: 32K
       EB 32 AE 65 79 A0 D2 16 75 8F 18 19 26 0A E2 CB>)
(   3,<2005-04-26 09:17:43.10 +100>,<MAYBRIDGE\NMR>,<NMR_250MHZ>,
      <apk 
       data hash MD5: 32K
       E9 9E 19 0B 8B 79 0C C5 F4 77 3D 9D E4 9A 2C A1>)
(   4,<2005-04-26 09:17:43.76 +100>,<MAYBRIDGE\NMR>,<NMR_250MHZ>,
      <abs ABSG = 5 
       data hash MD5: 32K
       99 26 9D AB D6 7A 08 D0 AE 3F 88 85 14 AD 76 5E>)
$$ ##END=
$$ 
$$ hash MD5
$$ AD C8 9D A0 0D 8B 32 D6 FC 0A 3A A3 E6 AA 56 AC
##$RELAX= 
##$RELAX= 
##$RELAX= 
##$RELAX= 
##$RELAX= 
##$RELAX= 
##$RELAX= 
$$ Bruker specific parameters
$$ --------------------------
##$DU= <C:\u>
##$EXPNO= 2220
##$NAME= <ADRS>
##$PROCNO= 1
##$TYPE= <nmr>
##$USER= <dgb>
##$AMP= (0..31)
100 100 100 100 100 100 100 100 100 100 100 100 100 100 100 100 100 100 
100 100 100 100 100 100 100 100 100 100 100 100 100 100 
##$AQSEQ= 0
##$AQ_mod= 3
##$AUNM= <au_zg>
##$AUTOPOS= <4 >
##$BF1= 250.13
##$BF2= 250.13
##$BF3= 250.13
##$BF4= 250.13
##$BF5= 500.13
##$BF6= 500.13
##$BF7= 500.13
##$BF8= 500.13
##$BYTORDA= 1
##$CFDGTYP= 0
##$CFRGTYP= 5
##$CHEMSTR= <none>
##$CNST= (0..31)
1 1 145 1 1 1 1 1 1 1 1 1 1 1 1 1 1 1 1 1 1 1 1 1 1 1 1 1 1 1 1 1 
##$CPDPRG= <>
##$CPDPRG1= <>
##$CPDPRG2= <>
##$CPDPRG3= <>
##$CPDPRG4= <mlev>
##$CPDPRG5= <mlev>
##$CPDPRG6= <mlev>
##$CPDPRG7= <mlev>
##$CPDPRG8= <mlev>
##$CPDPRGB= <>
##$CPDPRGT= <>
##$D= (0..31)
0 1 0 0 0 0 0 0 0 0.06 0 0 0 0 0 0 0.0002 0 0 0 0 0 0 0 0 0 0 0 0 0 0 
0 
##$DATE= 1114503449
##$DBL= (0..7)
120 120 120 120 120 120 120 120 
##$DBP= (0..7)
150 150 150 150 150 150 150 150 
##$DBP07= 0
##$DBPNAM0= <>
##$DBPNAM1= <>
##$DBPNAM2= <>
$$ [...]
##$SUBNAM7= <"">
##$SUBNAM8= <"">
##$SUBNAM9= <"">
##$SW= 20.6930455092707
##$SWIBOX= (0..15)
0 0 3 0 0 0 0 0 0 0 0 0 0 0 0 0 
##$SW_h= 5175.983436853
##$TD= 65536
##$TD0= 1
##$TE= 295.16
##$TE2= 300
##$TE3= 300
##$TEG= 300
##$TL= (0..7)
0 120 120 120 120 120 120 120 
##$TP= (0..7)
150 150 150 150 150 150 150 150 
##$TP07= 0
##$TPNAME0= <>
##$TPNAME1= <>
##$TPNAME2= <>
##$TPNAME3= <>
##$TPNAME4= <>
##$TPNAME5= <>
##$TPNAME6= <>
##$TPNAME7= <>
##$TPOAL= (0..7)
0.5 0.5 0.5 0.5 0.5 0.5 0.5 0.5 
##$TPOFFS= (0..7)
0 0 0 0 0 0 0 0 
##$TUNHIN= 0
##$TUNHOUT= 0
##$TUNXOUT= 0
##$USERA1= <user>
##$USERA2= <user>
##$USERA3= <user>
##$USERA4= <user>
##$USERA5= <user>
##$V9= 5
##$VALIST= <valist>
##$VCLIST= <CCCCCCCCCCCCCCC>
##$VD= 0
##$VDLIST= <DDDDDDDDDDDDDDD>
##$VPLIST= <PPPPPPPPPPPPPPP>
##$VTLIST= <TTTTTTTTTTTTTTT>
##$WBST= 1024
##$WBSW= 4
##$XGAIN= (0..3)
0 0 0 0 
##$XL= 0
##$YL= 0
##$YMAX_a= 435295
##$YMIN_a= -415842
##$ZGOPTNS= <>
##$ZL1= 120
##$ZL2= 120
##$ZL3= 120
##$ZL4= 120
##$ABSF1= 16.522
##$ABSF2= -4.171173
##$ABSG= 5
##$ABSL= 3
##$ALPHA= 0
##$AQORDER= 0
##$ASSFAC= 0
##$ASSFACI= 0
##$ASSFACX= 0
##$ASSWID= 0
##$AUNMP= <proc_1d>
##$AZFE= 0.1
##$AZFW= 0.1
##$BCFW= 0
##$BC_mod= 0
##$BYTORDP= 0
##$COROFFS= 0
##$CY= 12.5
##$DATMOD= 1
##$DC= 0
##$DFILT= <>
##$DTYPP= 0
##$F1P= 14.0000005364418
##$F2P= -0.99999901652339
##$FCOR= 0.5
##$FTSIZE= 32768
##$FT_mod= 6
##$GAMMA= 0
##$GB= 0
##$INTBC= 1
##$INTSCL= 1
##$ISEN= 128
##$LB= 0.3
##$LEV0= 0
##$LPBIN= 0
##$MAXI= 10000
##$MC2= 0
##$MEAN= 0
##$ME_mod= 0
##$MI= 0
##$NCOEF= 0
##$NC_proc= -3
##$NLEV= 6
##$NOISF1= 0
##$NOISF2= 0
##$NSP= 0
##$NTH_PI= 0
##$NZP= 0
##$OFFSET= 16.522
##$PC= 1
##$PHC0= -58.34052
##$PHC1= -27.22372
##$PH_mod= 1
##$PKNL= yes
##$PPARMOD= 0
##$PSCAL= 4
##$PSIGN= 0
##$REVERSE= no
##$SF= 250.13
##$SI= 32768
##$SIGF1= 0
##$SIGF2= 0
##$SINO= 400
##$SIOLD= 32768
##$SREGLST= <1H.CDCl3>
##$SSB= 0
##$STSI= 32768
##$STSR= 0
##$SW_p= 5175.98343685301
##$SYMM= 0
##$S_DEV= 0
##$TDeff= 65536
##$TDoff= 0
##$TI= <Analysis number 999999
Compound Code 99
Book Reference 9
Project Code 9>
##$TILT= no
##$TM1= 0
##$TM2= 0
##$TOPLEV= 0
##$USERP1= <user>
##$USERP2= <user>
##$USERP3= <user>
##$USERP4= <user>
##$USERP5= <user>
##$WDW= 1
##$XDIM= 32768
##$YMAX_p= 317669526
##$YMIN_p= -650904
$$ End of Bruker specific parameters
$$ ---------------------------------
##NTUPLES= NMR SPECTRUM
##VAR_NAME=  FREQUENCY,     SPECTRUM/REAL,   SPECTRUM/IMAG
##SYMBOL=    X,             R,               I
##VAR_TYPE=  INDEPENDENT,   DEPENDENT,       DEPENDENT
##VAR_FORM=  AFFN,          ASDF,            ASDF
##VAR_DIM=   32768,         32768,           32768
##UNITS=     HZ,            ARBITRARY UNITS, ARBITRARY UNITS
##FACTOR=    0.157963299565203, 1,           1
##FIRST=     4132.6476996994, 0,             0
##LAST=      -1043.33573715361, 0,           0
##MIN=       -1043.33573715361, -650904,     0
##MAX=       4132.6476996994, 317669526,     0
$$ Real data points
##PAGE= N=1
##DATA TABLE= (X++(R..R)), XYDATA
$$ [...]
$$ plain form
24241 9050 829 6845 14503 12517 -7200 -11023 -7688 -3639 3609 -4526 -12845 -11828 -6241 -11687
24227 -11687 -19312 -21182 -2315 6136 7762 12044 13774 16445 14971 19309 9861 9150 16533 5219
24213 5219 -1574 -11009 -9106 -4434 -3175 2956 -1567 -11591 -8708 -10028 1400 -4141 -11489 -16897
24199 -16897 -24205 -12317 -7037 3952 13837 13042 13711 6646 3589 4316 3221 5135 13090 12422 18434
24184 18434 15070 20713 500 -17720 -31151 -27375 -13705 -8491 -1534 1585 10134 21424 26192
24171 26192 25945 19617 12970 3310 -675 4395 6811 14296 899 -4581 -2245 11948 4751 21260
24157 21260 31953 21550 11805 11812 6328 11565 3403 6726 3594 3192 680 4669 -83 -2430 9110
24142 9110 12461 16763 10289 5825 8064 14750 6889 -20387 -23677 -19066 -7489 5367 5793 2555
$$ packed form
24241I050q221O016P658j986j9717l823L335M049P248q135q319J017N587n446
24227a1687p625j870J8867Q451J626M282J730K671j474M338r448p11P383j1314
24213E219o793r435J903M672J259O131m523j0024K883j320J1428n541p348n408
24199a6897p308J1888N280J0989R885p95O69p065l057P27j095J914P955o68O012
24184A8434l364N643k0213j8220j3431L776J3670N214O957L119Q549J1290M768
24171B6192k47o328o647r660l985N070K416P485j3397n480K336J4193p197J6509
24157B1260J0693j0403r745Pn484N237q162L323l132m02k512L989m752k347J1540
24142I110L351M302o474m464K239O686p861k7276l290M611J1577J2856M26l238
$$ plain form
24128 2555 -518 -2684 -4126 -3948 7807 18371 10834 3595 -7639 -21347 -17661 -14724 -15490 -2674
24114 -2674 2581 8100 4693 7494 1277 -5978 -1652 -3887 -9346 -3831 -3264 -15770 -16868 -18930 -865
24099 -865 6525 6165 14841 20473 22219 10591 5747 1164 -2714 -499 14006 20694 11987 7999 6121
24084 6121 6243 17303 18779 14651 1172 -10421 -17118 -17297 -5849 -5884 -7618 -2800 -384 -4208 -4954
24069 -4954 795 2991 -5736 -11897 -6007 6073 2086 -9102 -17097 -18584 -24247 -15620 -5190 -3847
24055 -3847 -3326 -5009 -18639 -16501 -10442 9283 16529 13605 11064 10890 19457 11585 14881 13331 6840
24040 6840 -426 4703 3683 -10146 -10802 -12946 -28213 -18816 -2634 11689 19535 25102 12066 2731
24026 2731 -11902 -12525 -7481 -1525 -4566 -610 27469 41234 31651 12833 -2802 -7518 -1201 -6998
$$ packed form
24128B555l073k166j442J78J1755J0564p537p239j1234j3708L686K937p66J2816
24114b674N255N519l407K801o217p255M326k235n459N515N67j2506j098k062J8065
24099h65P390l60Q676N632J746j1628m844m583l878K215J4505O688q707l988j878
24084F121J22J1060J476m128j3479j1593o697j79J1448l5j734M818K416l824p46
24069d954N749K196q727o161N890J2080l987j1188p995j487n663Q627J0430J343
24055c847N21j683j3630K138O059J9725P246k924k541j74Q567p872L296j550o491
24040F840p266N129j020j3829o56k144j5267R397J6182J4323P846N567j3036r335
24026B731j4633o23N044N956l041L956K8079J3765r583j8818j5635m716O317n797
$$ plain form
24012 -6998 -3948 7925 6638 2008 -2983 -9323 -11364 7099 8071 17968 21511 9566 4411 2845
23998 2845 1699 -1307 -6879 -10055 -1608 6440 -5535 -858 3128 478 -5530 -5320 -5097 -820 2041
23983 2041 9799 8496 4113 -2681 -4103 -12468 -5404 -4599 -9178 -12293 -4544 -7129 -11462 -1162 2851
23968 2851 -9403 -13233 -19285 -9537 -4139 -8843 -7941 -11703 -4391 -12042 -9519 344 7461 8635 3020
23953 3020 -18215 -23626 -9171 -1393 20314 23068 9746 16538 17154 16726 21102 21856 10332 -2849
23939 -2849 -3558 6860 -4685 -11631 -4996 -2257 -13615 -27732 -24246 -25887 -18022 -12912 -2877 -2263
23925 -2263 -9392 -20285 -26726 -16939 -11935 -5908 -11629 323 14808 17406 6437 4266 7785 8398
23911 8398 -3145 -11489 -12524 -11706 8425 -1890 -17294 -10306 -7287 -11478 -12750 -9562 -2704 -12687
$$ packed form
24012f998L050J1873j287m630m991o340k041J8463R72R897L543j1945n155j566
23998B845j146l006n572l176Q447Q048j1975M677L986k650o008K10K23M277K861
23983B041P758j303m383o794j422q365P064Q05m579l115P749k585m333J0300M013
23968B851j2254l830o052R748N398m704R02l762P312p651K523R863P117J174n615
23953C020k1235n411J4455P778K1707K754j3322O792O16m28M376P54j1524j3181
23939b849p09J0418j1545o946O635K739j1358j4117L486j641P865N110J0035O14
23925b263p129j0893o441R787N004O027n721J1952J4485K598j0969k171L519O13
23911H398j1543q344j035Q18K0131j0315j5404O988L019m191j272L188O858r983
$$ plain form
23897 -12687 -26884 -21367 -12469 -916 -3176 -8816 -15483 -2536 -32 2094 9302 6999 8746 6458
23883 6458 9226 16462 1362 -10336 -6669 1358 7601 -1296 -4773 4909 7928 13067 2351 -10408
23869 -10408 -20302 -16040 -7778 -6119 -4196 -4890 -3881 5610 8515 7357 14503 15314 17046 18720 8386
23854 8386 -3975 -15427 -21285 -22550 -19017 -4602 -7400 -16216 -13478 -8014 -8462 -2462 57 1877
23840 1877 5842 5682 -2346 -6144 -11250 -18436 -19760 -6745 13162 20849 23817 7607 -7012 251
23826 251 957 4131 -415 -15530 -12419 -15941 -36550 -29901 -20840 -24321 -29388 -29831 -22912 -16172 -23319
23811 -23319 -28242 -22100 -22547 -29999 -28524 -9187 -9349 -19315 -10696 -9455 11279 14731 9237 5086
23797 5086 6448 10301 12166 11847 3699 -4214 8460 5801 1318 2189 11458 8429 4455 4492 122
$$ packed form
23897a2687j4197N517Q898J1553k260n640o667J2947K504K126P208k303J747k288
23883F458K768P236j5100j1698L667Q027O243q897l477R682L019N139j0716j2759
23869a0408r894M262Q262J659J923o94J009R491K905j158P146Q11J732J674j0334
23854H386j2361j1452n858j265L533J4415k798q816K738N464m48O000K519J820
23840A877L965j60q028l798n106p186j324J3015J9907P687K968j6210j4619P263
23826B51P06L174m546j5115L111l522k0609O649R061l481n067m43O919O740p147
23811b3319m923O142m47p452J475J9337j62r966Q619J241K0734L452n494m151
23797E086J362L853J865l19q148p913J2674k659m483Q71R269l029l974L7m370
$$ plain form
23782 122 -8349 -10632 -17079 -23812 -9027 4355 9771 -478 -1798 -2417 749 2145 18535 27913
23768 27913 26303 21994 4763 -4212 7649 11769 7642 3806 -526 -2261 -21746 -17682 -3844
23755 -3844 -8822 -9563 -16122 -27042 -36751 -15480 -8032 -3655 -1088 -1605 -3628 -3783 -6414 -6295 -5046
23740 -5046 -5030 -19293 -10892 -4488 4994 5418 4027 8031 11030 6943 6929 346 6941 2605 -19218
23725 -19218 -16129 -12460 -14361 -6804 -13018 -28406 -30958 -16367 -23055 -19984 -16457 -23167 -37666 -35132
23711 -35132 -36191 -24637 -13471 -15909 -24819 -32176 -16252 -7736 -7952 -6639 10503 13100 5110 58
23697 58 -11075 -17494 -18151 -17225 -16380 -23422 -7476 1754 210 3161 9803 15288 11317 3218 -8822
23682 -8822 -10980 -21981 -27022 -15224 -9451 -11111 -10706 -2984 -9642 -11681 -907 9648 17770 -1520
$$ packed form
23782A22q471k283o447o733J4785J3382N416j0249j320o19L166J396J6390R378
23768B7913j610m309j7231q975J1861M120m127l836m332j735j9485M064J3838
23755c844m978p41o559j0920r709K1271P448M377K567n17k023j55k631J19J249
23740e046J6j4263Q401O404R482M24j391M004K999m087j4o583O595m336k1823
23725a9218L089L669j901P557o214j5388k552J4591o688L071L527o710j4499K534
23711c5132j059J1554J1166k438q910p357J5924Q516k16J313J7142K597p990n052
23697E8j1133o419o57R26Q45p042J5946R230j544K951O642N485l971q099j2040
23682h822k158j1001n041J1798N773j660M05P722o658k039J0774J0555Q122j9290
$$ plain form
23668 -1520 -8447 -10221 -15562 -1991 -2042 -12711 -17052 -1878 11744 2168 -5719 -3970 -7837 -7339
23654 -7339 -4410 -10059 -5934 -6540 -13228 -15204 -22013 -21088 -12042 -5214 -20750 -14019 -5663 1758 3702
23639 3702 6261 11355 17138 5489 -5681 6030 6669 -8639 -11233 -484 1588 -10009 -19398
23626 -19398 -19572 -8728 4182 -13129 -16209 -1138 9143 16471 6923 556 10033 8166 -2189
23613 -2189 1131 5803 7402 -8840 596 13461 19697 5965 141 -8127 -4968 -8481 -8650 -2703
23599 -2703 2186 -3301 -3836 -8548 4487 10067 13504 347 -6297 -5549 8464 11717 87 -15042
23585 -15042 -8829 14978 13149 9880 11214 -7791 -18538 -27978 -20710 -7563 -1218 -7994 -971
23572 -971 5027 -2938 -8578 -9697 -13542 -14399 -2891 9984 161 -8375 -2108 2836 2522 6928 15891
$$ packed form
23668a520o927j774n341J3571n1j0669m341J5174J3622r576p887J749l867M98
23654g339K929n649M125o06o688j976o809R25R046O828j5536O731Q356P421J944
23639C702K559N094N783j1649j1170J1711O39j5308k594J0749K072j1597r389
23626a9398j74J0844J2910j7311l080J5071J0281P328r548o367R477j867j0355
23613b189L320M672J599j6242R436J2865O236j3732n824q268L159l513j69N947
23599b703M889n487n35m712J3035N580L437j3157o644P48J4013L253j1630j5129
23585a5042O213K3807j829l269J334j9005j0747r440P268J3147O345o776P023
23572i71N998p965n640j119l845q57J1508J2875r823q536O267M944l14M406Q963
$$ plain form
23557 15891 5877 -11135 -14541 -11872 -11678 -21525 -21069 -20484 -13188 -7776 -17362 -28144 -25515 -25648 -15551
23542 -15551 -739 347 -5485 -12934 -17397 -8711 8965 7406 3914 -6810 -16415 -20297 -16453 -12279
23528 -12279 -8747 -8155 -817 11886 17301 18015 4606 -10363 -14593 -18218 -26509 -23170 29 5150
23514 5150 860 -8694 -4752 -4970 -2355 4362 -3285 -9428 333 15198 22062 23574 30604 22422 15300
23499 15300 11323 14492 17280 19274 15787 5488 5795 -1879 2612 -4090 -1560 7227 -10839 -27884
23485 -27884 -22349 -15489 -8929 5579 2522 16671 20372 26068 28362 36171 32748 16909 -1192
23472 -1192 -8750 -8622 -2393 -3326 -5113 13597 8316 -227 6827 8375 1220 -7983 -9071 -25627 -27499
23457 -27499 -15012 -14547 -7458 -9306 -14045 -16243 -16356 -2195 5650 10400 19315 14966 -2327 -13793
$$ packed form
23557A5891j0014j7012l406K669J94r847M56N85P296N412r586j0782K629j33J0097
23542a5551J4812J086n832p449m463Q686J7676j559l492j0724r605l882L844M174
23528a2279L532N92P338J2703N415P14j3409j4969m230l625q291L339K3199N121
23514E150m290r554L942k18K615O717p647o143R761J4865O864J512P030q182p122
23499A5300l977L169K788J994l487j0299L07p674M491o702K530Q787j8066j7045
23485b7884N535O860O560J4508l057J4149L701N696K294P809l423j5839j8101
23472a192p558J28O229r33j787J8710n281q543P054J548p155r203j088j6556j872
23457b7499J2487M65P089j848m739k198j13J4161P845M750Q915m349j7293j1466
$$ plain form
23443 -13793 -6101 -8999 -13629 -13531 -8807 -14774 -10345 -14587 -23674 -17466 -6544 -3021 -4814 -2790 -7093
23428 -7093 -11462 -5326 12061 12768 16745 16323 5374 -16076 -27801 -28221 -28938 -16975 -20837 -27450
23414 -27450 -21094 -23988 -21267 -13887 -6909 5624 5703 4202 482 -4723 -16663 -10069 -5827 -3404
23400 -3404 580 -10001 -20329 -18229 -20627 -20777 -17885 -2289 8823 15213 790 -3459 5079 -7786
23386 -7786 -29374 -20911 -9280 1696 5719 -3444 -12927 -15340 -6606 -6362 -8072 -2461 -5254 -9873
23372 -9873 -13745 -8316 1541 -1919 -10191 706 10295 4981 -4929 6673 21537 21470 12811 2907
23358 2907 -845 997 858 -6901 -17348 -19714 -20543 -19637 -13872 -17612 -12144 1105 -5625 2136 13205
23343 13205 16632 15450 4128 -1111 -974 2228 252 -8606 -11280 -4363 -4692 -6113 8095 17885
$$ packed form
23443a3793P692k898m630R8M724n967M429m242r087O208J0922L523j793K024m303
23428g093m369O136J7387P07L977m22j0949k1450j1725m20p17J1963l862o613
23414b7450O356k894K721P380O978J2533P9j501l720n205j1940O594M242K423
23400c404L984j0581j0328K100k398j50K892J5596J1112O390j4423m249Q538j2865
23386g786k1588Q463J1631J0976M023r163r483k413Q734K44j710N611k793m619
23372i873l872N429R857l460q272J0897R589n314r910J1602J4864o7q659r904
23358B907l752J842j39p759j0447k366q29R06N765l740N468J3249o730P761J1069
23343A3205L427j182j1322n239J37L202j976q858k674O917l29j421J4208R790
$$ plain form
23329 17885 14448 2698 -3704 5174 9368 -3882 -21433 -21541 -13992 -11909 -10634 -16960 -19587 -18524
23315 -18524 -16082 -8760 -11475 -6231 -11017 -29525 -29619 -20786 -24848 -28968 -12611 -3699 8831 16194
23301 16194 -1402 -12742 -9938 -19966 -19802 -16254 -6723 -3222 3347 6882 16501 28956 29435 12555
23287 12555 684 4529 9454 -2934 -5776 7786 11334 15737 17623 6785 7015 12169 8184 18536
23273 18536 26011 22759 9537 328 -1387 2693 -1652 -11016 -8408 10181 24072 12921 9005
23260 9005 4544 572 933 1570 602 -2146 -530 -3084 -321 4080 1848 -2173 7180 5050 -8464
23245 -8464 -16342 -23030 -27678 -26696 -7474 -7305 -4800 -10948 -15343 -5971 643 -5518 -18608 -28126 -20676
23230 -20676 -13782 -8683 -22058 -19548 -25971 -27552 -25178 -18327 -4084 12933 20687 15387 11360 -242
$$ packed form
23329A7885l437j1750o402Q878M194j3250j7551j08P549K083J275o326k627J063
23315a8524K442P322k715N244m786j8508r4Q833m062m120J6357Q912J2530P363
23301A6194j7596j1340K804j0028J64L548R531L501O569L535R619J2455M79j6880
23287A2555j1871L845M925j2388k842J3562L548M403J886j0838K30N154l985J0352
23273A8536P475l252j3222r209j715M080m345r364K608J8589J3891j1151l916
23260I005m461l972L61O37r68k748J616k554K763M401k232m021R353k130j3514
23245h464p878o688m648R82J9222J69K505o148m395R372O614o161j3090r518P450
23230b0676O894N099j3375K510o423j581K374O851J4243J7017P754n300m027j1602
$$ plain form
23216 -242 -9083 962 -5586 -8051 -9542 4752 8186 -8237 -15106 7654 8727 3421 2591 2608 1640
23201 1640 4487 3135 201 -5597 16 -4006 -10171 -6813 4067 10035 14203 24482 21393 19691
23187 19691 12059 -443 -7130 -4907 -13865 -21361 -25392 -30908 -36932 -32435 -30547 -20408 -2192 -363
23173 -363 -11111 -9198 -12718 -11829 7468 16710 15204 8135 9459 12411 9006 -2186 -6120 -20069
23159 -20069 -30284 -3014 8417 8716 -3531 -21153 -11930 -8577 -12831 -1859 -6516 -7089 -1271
23146 -1271 -538 -10364 -14590 -14239 -12798 -19965 -24740 -17429 3918 -9061 -21251 -13686 -6755 -7172 -896
23131 -896 15667 17646 18077 24935 14894 6890 -5587 -8915 488 -3353 -10988 -9929 364 -3799
23117 -3799 -4189 -7369 -7888 -6882 1030 -1492 1369 -10352 -10687 -6628 4680 5811 9229 3330 6085
$$ packed form
23216b42q841J0045o548k465j491J4294L434j6423o869K2760J073n306q30J7r68
23201A640K847j352k934n798N613m022o165L358J0880N968M168J0279l089j702
23187A9691p632j2502o687K223q958p496m031n516o024M497J888J0139J8216J829
23173c63j0748J913l520Q89J9297R242j506p069J324K952l405j1192l934j3949
23159b0069j0215K7270J1431K99j2247j7622R223L353m254J0972m657n73N818
23146a271P33r826m226L51J441p167m775P311K1347j2979j2190P565O931m17O276
23131h96J6563J979M31O858j0041q004j2477l328R403l841p635J059J0293m163
23117c799l90l180n19J006P912k522K861j1721l35M059J1308J131L418n899K755
$$ plain form
23102 6085 1633 -7727 -1723 9154 6172 -13165 -14648 1029 13284 -1945 -3169 428 6964
23089 6964 8157 6466 10967 14187 1108 -8211 -10291 1113 12514 20380 9676 -4932 4978
23076 4978 20552 22350 13167 1662 -5456 4995 11766 3975 -9335 -22978 -21391 -9898 -6549
23063 -6549 -10608 -14961 -24291 -13713 -11365 -13539 -5917 2791 14500 21816 20456 16003 -98 -4130
23049 -4130 -1140 1787 10566 23597 17438 7195 1838 -6165 -15990 -17624 -6823 -18044 -26017 -23813
23035 -23813 -8975 -2469 7452 1760 829 9688 479 -5176 9763 28302 29695 24446 7434 -5168
23021 -5168 -3528 -2359 -5017 -8918 -13346 -10911 -8357 -11348 -9596 -18416 -19321 -26904 -19982 -7182 -8850
23006 -8850 -20832 -19226 -16178 -13033 -14517 -15576 -9170 3155 12450 13000 11366 10829 16242 23654 11532
$$ packed form
23102F085m452r360O004J0877k982j9337j483J5677J2255j5229j224L597O536
23089F964J193j691M501L220j3079r319k080J1404J1401P866j0704j4608R910
23076D978J5574J798r183j1505p118J0451O771p791j3310j3643J587J1493L349
23063f549m059m353r330J0578K348k174P622Q708J1709P316j360m453j6101m032
23049d130K990K927Q779J3031o159j0243n357q003r825j634J0801j1221p973K204
23035b3813J4838O506R921n692r31Q859r209n655J4939J8539J393n249j7012j2602
23021e168J640J169k658l901m428K435K554k991J752q820r05p583O922J2800j668
23006h850j1982J606L048L145j484j059O406J2325R295N50j634n37N413P412j2122
$$ plain form
22991 11532 -63 -986 -2842 -4723 -2730 7973 11687 4050 -735 -14464 -13696 -6186 7115 15370
22977 15370 6416 634 1394 -5241 -14476 -5190 1391 -1367 -17755 -12173 -16941 -14376 -13226 -13208 -18340
22962 -18340 -12442 -1582 3611 10988 11415 -8800 -22215 -15430 -18816 -12078 -14687 -10739 -21716 -15985
22948 -15985 -5971 2425 9860 5016 3111 3790 -416 6182 12245 -2166 40 4853 6019 3070
22934 3070 -2029 2022 -2277 -620 -14761 -18818 92 6654 -2159 -21424 -38532 -9057 7011
22921 7011 21809 19410 4443 -5413 1161 8712 7172 2812 4017 4767 -6917 1172 8830 13704
22907 13704 14004 3235 3604 -6574 -4622 -2543 -7978 -11159 -18280 -9736 -10791 -33844 -48794 -32533
22893 -32533 -22799 -24634 -24213 -9260 1940 18035 20789 10795 1041 2618 -18862 -25837 -8486
$$ packed form
22991A1532j1595r23j856j881J993J0703L714p637m785j3729P68P510J3301Q255
22977A5370q954n782P60o635r235R286O581k758j6388N582m768K565J150J8n132
22962a8340N898J0860N193P377M27k0215j3415O785l386O738k609L948j0977N731
22948a5985J0014Q396P435m844j905O79m206O598O063j4411K206M813J166k949
22934C070n099M051m299J657j4141m057J8910O562q813j9265j7108K9475J6068
22921G011J4798k399j4967r856O574P551j540m360J205P50j1684Q089P658M874
22907A3704L00j0769L69j0178J952K079n435l181p121Q544j055k3053j4950J6261
22893c2533R734j835M21J4953J1200J6095K754r994r754J577k1480o975J7351
$$ plain form
22880 -8486 -2035 -15688 -23636 -8898 -2044 -660 -1161 -4128 1220 1335 7037 3094 2855 -6673 -28081
22865 -28081 -35181 -12197 -3804 -11735 -25090 -25134 -11066 -4143 -5123 699 3439 -4886 -15544 -20945
22851 -20945 -15114 -17544 -26722 -21500 -12398 106 150 7694 8182 -110 -14353 -15948 769 6207
22837 6207 -3880 -9124 5362 -13123 -13207 2818 10425 4416 -10359 -7190 -15682 -22542 -28946 -22419
22823 -22419 -14942 -14354 -24305 -26984 -24504 -19744 -21493 -19434 -11314 60 2564 1753 3459 -8694
22809 -8694 -10188 -9487 -10980 -10853 -15770 -12532 -6843 5149 12739 14200 4914 -9129 -11658 661
22795 661 8953 17190 34792 32783 26409 25255 30652 18138 -6460 -8959 -308 -6159 -5024 -8596
22781 -8596 -1850 22874 17856 3074 -6914 -23946 -34798 -16047 4170 -6855 -9975 -13996 -10849
$$ packed form
22880h486O451j3653p948J4738O854J384n01k967N348J15N702l943k39r528k1408
22865b8081p100K2984Q393p931j3355m4J4068O923r80N822K740q325j0658n401
22851b0945N831k430r178N222R102J2504M4P544M88q292j4243j595J6717N438
22837F207j0087n244J4486j8485q4J6025P607o009j4775L169q492o860o404O527
22823b2419P477N88r951k679K480M760j749K059Q120J1374K504q11J706j2153
22809h694j494P01j493J27m917L238N689J1992P590J461r286j4043k529J2319
22795F61Q292Q237J7602k009o374j154N397j2514k4598k499Q651n851J135l572
22781h596O746K4724n018j4782r988j7032j0852J8751K0217j1025l120m021L147
$$ plain form
22768 -10849 -10065 -10267 -11321 -19449 -21396 -19595 -16509 -16006 -7440 4465 -3069 -17356 -29499 -23629
22754 -23629 -15582 -9383 -19816 -27701 -25376 -20002 -20150 -23425 -22616 -11837 -8218 -4653 1975 -2045
22740 -2045 -6518 -9905 -11432 1450 -7100 -22293 -33299 -28312 -15928 -17236 -18898 -2368 -4315
22727 -4315 -8871 -13484 -10869 -6761 -12603 -12060 -9860 -910 -8180 -8828 -5531 -8641 -19251 -17946 -13236
22712 -13236 -18560 -30414 -32751 -22832 -4325 15722 23209 21464 2620 -5145 641 -2903 -8144
22699 -8144 -9849 -14765 -30805 -29196 -11390 -5194 -5003 -6748 -21071 -18840 -14758 -8315 1486 -3169
22685 -3169 -2884 -158 -2567 -1830 -3599 -19439 -30263 -26472 -26376 -20687 -21192 -27515 -44478 -46057 -35651
22670 -35651 -20721 -9366 -7899 -5745 -5935 -1753 -9606 -5071 -3979 -3161 -5526 -2636 -18267 -33713
$$ packed form
22768a0849P84k02j054q128j947J801L086N03Q566J1905p534j4287j2143N870
22754b3629Q047O199j0433p885K325N374j48l275Q09J0779L619L565O628m020
22740b045m473l387j527J2882q550j5193j1006M987J2384j308j662J6530j947
22727d315m556m613K615M108n842N43K200Q950p270o48L297l110j0610J305M710
22712a3236n324j1854k337R919J8507K0047P487j745j8844p765N786l544n241
22699h144j705m916j6040J609J7806O196J91j745j4323K231M082O443R801m655
22685c169K85K726k409P37j769j5840j0824L791R6N689n05o323j6963j579J0406
22670c5651J4930J1355J467K154j90M182p853M535J092Q18k365K890j5631j5446
$$ plain form
22656 -33713 -30207 -24430 -14540 -22229 -31323 -25288 -23112 -35127 -28128 -21985 -15584 -18048 -7771 -11337
22642 -11337 -9656 -6348 -1734 10454 15056 3254 -2608 -4922 -5067 -778 -8744 -12201 -15744 824
22628 824 6617 -6201 -19565 -22434 -5418 2496 7197 12515 4861 -9069 338 7824 6253 -5014
22614 -5014 -12335 -5672 -16032 -20400 -15977 -24906 -24275 -15833 -8599 -658 13490 18727 14134 11950
22600 11950 11777 15108 6387 5168 -451 -8809 -5457 2315 3016 890 -5377 -9307 -1464 18434 23311
22585 23311 20746 13639 113 -9741 -450 -9306 -22662 -30337 -22507 -21655 -11849 -5270 -9644 -16150
22571 -16150 -24651 -28903 -22377 -16980 -20948 -26609 -31946 -9418 3502 -4901 -14120 -10718 -11151 -6569
22557 -6569 202 10872 12812 16061 8618 2384 -11950 -21181 -17203 -21066 -22294 -29520 -32991 -22829
$$ packed form
22656c3713L506N777R890p689r094O035K176j2015O999O143O401k464J0277l566
22642a1337J681L308M614J2188M602j1802n862k314j45M289p966l457l543J6568
22628H24N793j2818j3364k869J7016P914M701N318p654j3930R407P486j571j1267
22614e014p321O663j0360m368M423q929O31Q442P234P941J4148N237m593k184
22600A1950j73L331q721j219n619q358L352P772P01k126o267l930P843J9898M877
22585B3311k565p107j3526r854R291q856j3356p675P830Q52R806O579m374o506
22571a6150q501m252O526N397l968n661n337K2528J2920q403r219L402m33M582
22557f569O771J0670J940L249p443o234j4334r231L978l863j228p226l471J0162
$$ plain form
22543 -22829 -6318 -2754 -5820 -12969 -15468 -10750 8677 18175 10548 3455 572 -1431 -7796 -18491
22529 -18491 -23166 -17510 1423 3680 -9040 -5467 -2602 -7958 -21827 -20959 -3411 -8767 -23596
22516 -23596 -20119 -8192 -4899 3936 1230 3435 -163 -11609 -5015 -1562 -526 -1785 2426 -3272
22502 -3272 -10788 -16181 -23043 -12252 4941 10341 8443 3546 2406 -12717 -26471 -26922 -20117 -5248
22488 -5248 -7901 -10661 -16023 -17457 -14725 -18337 -24105 -14193 -10793 -19042 -20532 -15742 -7580 -13260 -20648
22473 -20648 -31593 -33729 -24168 -17323 -3438 -4354 2051 8501 6059 -7102 -12584 -11607 -396 19520
22459 19520 17105 19089 17099 21379 14524 -7716 -6738 4246 -450 5570 2431 -3267 2520 -3128
22445 -3128 2323 11100 11278 12387 -2018 -7169 -21560 -13873 924 3987 -673 -34 -19503 -25569
$$ packed form
22543b2829J6511L564l066p149k499M718J9427R498p627p093k883k003o365j0695
22529a8491m675N656J8933K257j2720L573K865n356j3869Q68J7548n356j4829
22516b3596L477J1927L293Q835k706K205l598j1446O594L453J036j259M211n698
22502c272p516n393o862J0791J7193N400j898m897j140j5123j3754m51O805J4869
22488e248k653k760n362j434K732l612n768R912L400q249j490M790Q162n680p388
22473b0648j0945k136R561O845J3885r16O405O450k442j3161n482R77J1211J9916
22459A9520k415J984j990M280o855k2240R78J0984m696O020l139n698N787n648
22445c128N451Q777J78J109j4405n151j4391P687J4797L063m660O39j9469o066
$$ plain form
22431 -25569 -27760 -15501 -1577 -9022 -5881 3074 -12148 -17544 -6450 7038 4814 74 1859
22418 1859 -7654 -11089 -8009 -4316 6336 5418 -6036 -17882 -24344 -22181 -12357 -11085 -5452 2191
22404 2191 -3509 -15997 -25822 -23360 -18126 -10980 -5130 592 1583 8132 8041 9426 -515 3635 14093
22389 14093 5875 2971 2689 6116 4439 -1456 2467 11636 9064 -6078 -16358 -22212 -17013 -7669
22375 -7669 -10269 -24177 -27748 -25099 -24202 -19740 -6685 -636 -2625 -4434 -9129 -21079 -36281 -34983
22361 -34983 -20988 -16081 -14153 -15382 -2642 -2534 6211 9198 3427 -10858 -9343 -1220 -7750 -7883
22347 -7883 -16378 -20890 -13458 -5403 -10225 -19398 -20129 -15059 -8299 -1625 -6448 -11391 -10581 -8652 -1352
22332 -1352 426 -507 3245 8271 8824 6849 -4964 -1393 -5657 -14114 -18136 -15896 -18560 -24807 -20278
$$ packed form
22431b5569k191J2259J3924p445L141Q955j5222n396J1094J3488k224m740J785
22418A859r513l435L080L693J0652r18j1454j1846o462K163R824J272N633P643
22404B191n700j2488r825K462N234P146N850N722R91O549r1J385r941M150J0458
22389A4093q218k904k82L427j677n895L923R169k572j5142j0280n854N199R344
22375g669k600j3908l571K649Q97M462J3055O049j989j809m695j1950j5202J298
22361c4983J3995M907J928j229J2740J08Q745K987n771j4285J515Q123o530j33
22347g883q495m512P432Q055m822r173p31N070O760O674m823m943Q10J929P300
22332a352J778r33L752N026N53j975j1813L571m264q457m022K240k664o247M529
$$ plain form
22317 -20278 -15568 -17735 -19770 -8684 196 -9141 -9497 -14509 -26003 -20259 -14758 -13734 -7837 -935
22303 -935 -15429 -10964 -7810 -5711 6982 9492 3516 2804 2126 1249 -2579 2961 2742 1172 2245
22288 2245 4356 2548 -14502 -5757 -2052 -10299 -12886 -5584 -2299 -6494 9201 6134 -5929 -855
22274 -855 -1035 -2923 -3139 4045 -7122 -15909 -11783 -9901 -13352 -14227 -17224 -17425 -13418 -5481 8333
22259 8333 19349 15732 14334 13509 10188 -4547 -5987 -5287 -13785 -24851 -16880 -11003 -7477 -13562
22245 -13562 -23295 -25362 -34345 -26805 -26263 -38118 -39635 -32364 -7088 873 -6017 -8150 -14820 -7259
22231 -7259 -1518 9249 7574 -10843 -27846 -34015 -23582 -17381 -13330 -11244 -10712 -15785 -15319 -11614
22217 -11614 -12959 -9783 -15732 -13038 -19673 -24712 -15493 -5498 -8760 -15230 -24426 -28389 -21939 -30605
$$ packed form
22317b0278M710k167k035J1086Q880r337l56n012j1494N744N501J024N897O902
22303i35j4494M465L154K099J2693K510n976p12o78q77l828N540k19j570J073
22288B245K111j808j7050Q745L705q247k587P302L285m195J5695l067j2063N074
22274h55j80j888k16P184j1167q787M126J882l451q75k997k01M007P937J3814
22259H333J1016l617j398q25l321j4735j440P00q498j1066P971N877L526o085
22245a3562r733k067q983P540N42j1855j517P271K5276P961o890k133o670P561
22231g259N741J0767j675j8417j7003o169J0433O201M051K086N32n073M66L705
22217a1614j345L176n949K694o635n039R219R995l262o470r196l963O450q666
$$ plain form
22203 -30605 -33043 -27253 -25406 -26266 -18031 -16788 -14706 -18455 -23000 -21740 -23068 -16486 -12587 -12867 -16144
22188 -16144 -19320 -6465 -5185 -267 -10565 -17714 -14092 -13570 -10189 -10392 -18085 -26051 -22269 -14107
22174 -14107 -23087 -29674 -28006 -21999 -20677 -12376 -6025 -12318 -20900 -23733 -25055 -29295 -10230 -7072
22160 -7072 -3836 -3708 -2379 -5352 4573 1997 -12379 -17199 -28352 -33388 -26808 -20590 -30092 -25700
22146 -25700 -24365 -27826 -31265 -35982 -35575 -19716 -18840 -14563 -16042 -17261 -18686 -15803 -7912 4471
22132 4471 -773 -2333 4848 10977 15238 671 -14353 -15246 -13851 -11379 5149 11280 -271 -15596
22118 -15596 -4234 -3246 4070 -1169 8945 9257 -3557 -411 -11370 -20891 -1588 2241 -4357 -3164
22104 -3164 8291 5196 -15474 -12744 6978 -95 -17482 -11204 1513 1715 -7912 -8520 -7056 -15662
$$ packed form
22203c0605k438N790J847q60Q235J243K082l749m545J260j328O582L899k80l277
22188a6144l176J2855J280M918j0298p149L622N22L381k03p693p966L782Q162
22174a4107q980o587J668O007J322Q301O351o293q582k833j322m240J9065L158
22160g072L236J28J329k973R925k576j4376m820j1153n036O580O218r502M392
22146b5700J335l461l439m717M07J5859Q76M277j479j219j425K883P891J2383
22132D471n244j560P181O129M261j4567j5024q93J395K472J6528O131j1551j5325
22118a5596J1362R88P316n239J0114L12j2814L146j0959r521J9303L829o598J193
22104c164J1455l095k0670K730J9722p073j7387O278J2717K02r627o08J464q606
$$ plain form
22090 -15662 274 17297 19187 19718 16285 8483 6907 8009 3307 5744 16157 23839 14284 12522
22076 12522 16514 -1228 -8310 -15253 -9302 -9450 -6493 -11049 -3204 -14168 -15938 -5727 -829 2918
22062 2918 -2640 -4437 -856 -636 -3175 -3046 1338 7585 4285 3282 6429 17828 14860 8490 -4086
22047 -4086 -2204 -1621 -5660 -8566 -5992 2129 -3366 8880 3873 2792 4580 11654 8245 12599 5195
22032 5195 1231 5788 4221 3624 14084 1635 -6490 6210 2315 514 1137 2310 7982 4626
22018 4626 -1942 -6498 -4280 -19507 -31079 -30931 -36839 -33489 -26552 -24843 -23174 -14538 -15313 5503
22004 5503 1284 -15110 -14200 4747 19013 21680 26969 18408 7874 2533 -7893 -28305 -21822
21991 -21822 -824 -1199 -5120 3876 -2714 -8078 -6125 1242 15142 1928 2334 5507 -13714 -22012
$$ packed form
22090a5662J5936J7023J890N31l433p802j576J102m702K437J0413P682r555j762
22076A2522L992j7742p082o943N951j48K957m556P845j0964j770J0211M898L747
22062B918n558j797L581K20k539J29M384O247l300j003L147J1399k968o370j2576
22047d086J882N83m039k906K574Q121n495J2246n007j081J788P074l409M354p404
22032E195l964M557j567n97J0460j2449q125J2700l895j801O23J173N672l356
22018D626o568m556K218j5227j1572J48n908L350O937J709J669Q636p75K0816
22004E503m219j6394R10J8947J4266K667N289q561j0534n341j0426k0412O483
21991b1822K0998l75l921Q996o590n364J953P367J3900j3214M06L173j9221q298
$$ plain form
21977 -22012 -10220 -11852 -17343 -19100 -10111 -9321 -240 13400 10266 6494 -9140 -13540 1809 -4361
21963 -4361 -12963 -24092 -26589 -14092 -5153 -8886 -18857 -26584 -22497 -13696 2015 16282 17358 -13610
21949 -13610 -32996 -29191 -12849 1729 13548 -3424 -15159 -18066 -21611 -19534 -23745 -15433 -10958
21936 -10958 -25172 -24446 -15302 -7243 -10439 -14668 -8219 -13456 -13581 -17559 -8532 -7237 -1028 428 -4617
21921 -4617 -8972 -1258 13039 1091 -6788 1831 773 -7868 -3646 5787 10351 -4507 -16217 -12863
21907 -12863 -3843 10396 12013 -8316 -17148 -18696 -8142 -4836 -5792 7666 324 -9093 -23194
21894 -23194 -32749 -38487 -32755 -33033 -34971 -33508 -22211 -9639 767 -5505 -22101 -32974 -36134
21881 -36134 -31610 -21790 -8137 -1989 -970 3554 6993 -2861 5475 10159 10774 443 -7210 -2188
$$ packed form
21977b2012J1792j632n491j757Q989P90R081J3640l134l772j5634m400J5349o170
21963d361q602j1129k497J2497Q939l733r971p727M087Q801J5711J4267J076l0968
21949a3610j9386L805J6342J4578J1819j6972j1735k907l545K077m211Q312M475
21936a0958j4214P26R144Q059l196m229O449n237j25l978R027J295O209J456n045
21921d617m355P714J4297j1948p879Q619j058q641M222R433M564j4858j1710L354
21907a2863R020J4239J617k0329q832j548J0554L306r56J3458p342r417j4101
21894b3194r555n738N732k78j938J463J1297J2572J0406o272j6596j0873l160
21881c6134M524R820J3653O148J019M524L439r854Q336M684O15j0331p653N022
$$ plain form
21867 -2188 74 -6039 598 9252 1577 8 2974 -16640 -18595 -11334 -14431 1189 24962 23851
21853 23851 24034 14048 11163 7384 12131 7107 -9182 -13579 -16029 -17071 -14172 -14457 -10917 -13813 -23037
21838 -23037 -23463 -17438 -7591 -9472 -3073 4393 6221 21702 21741 15905 18328 12517 -1418 -5725 -899
21823 -899 2220 282 7994 -2923 -3269 -10071 -12958 -5891 -4343 2392 1518 15491 4565 3390 3173
21808 3173 7462 2290 1070 -5975 -18838 -18295 -19662 -19601 -23663 -27302 -17096 -4776 9443 7860
21794 7860 7048 -3260 -9942 -17630 -14983 -3707 -4983 1250 1817 -8677 -15489 -21020 -11632 -18832
21780 -18832 -27310 -19360 -21359 -20899 -7917 3404 2690 345 -2507 6985 9857 -1313 -3750 5861
21766 5861 5560 -9990 -13876 -10313 -19481 -17625 -17834 -8924 -3473 -4512 2115 20457 35045 23783
$$ packed form
21867b188K262o113O637Q654p675j569K966j9614j955P261l097J5620K3773j111
21853B3851J83r986k885l779M747n024j6289m397k450j042K899k85L540k896r224
21838b3037m26O025R847j881O399P466J828J5481L9n836K423n811j3935m307M826
21823h99L119j938P712j0917l46o802k887P067J548O735q74J3973j0926j175k17
21808C173M289n172j220p045j2863N43j367O1m062l639J0206J2320J4219j583
21794G860q12j0308o682p688K647J1276j276O233N67j0494o812n531R388p200
21780a8832q478P950j999M60J2982J1321p14k345k852R492K872j1170k437R611
21766E861l01j5550l886L563r168J856k09Q910N451j039O627J8342J4588j1262
$$ plain form
21752 23783 6174 -9185 -7323 -5530 -22657 -28340 -30958 -28746 -15266 -17503 -22759 -11610 4701
21739 4701 -2492 -9939 -12703 -12230 -3485 7348 4431 -9365 -31755 -33323 -20651 -9404 -12936 -16171
21725 -16171 -20825 -12766 -1887 618 2516 7748 7117 -13728 -32534 -38340 -31634 -24248 -17910 -17243
21711 -17243 -23750 -22576 -17934 -16236 -2906 -1553 -13997 -30664 -20784 -3089 -4697 -14823 -11867
21698 -11867 -222 -4159 -9643 -12810 -10014 -3004 -18115 -31407 -32355 -11573 -3620 3678 2588 17623
21684 17623 31196 15863 2573 -1342 -1621 -4907 -14089 -12026 -15038 -21018 -8987 -3991 -4811 -14664
21670 -14664 -13860 -11246 11827 11212 -1335 -14060 -33851 -33833 -32223 -21224 -14312 -8781 4101 -1906
21656 -1906 -15746 -13785 -6223 -11216 -19366 -27824 -23364 -18653 -13485 -17499 -6316 -8912 -15610 -14113
$$ packed form
21752B3783j7609j5359J862J793j7127n683k618K212J3480k237n256J1149J6311
21739D701p193p447k764M73Q745J0833k917j3796k2390j568J2672J1247l532l235
21725a6171m654Q059J0879K505J898N232o31k0845j8806n806O706P386O338O67
21711a7243o507J174M642J698J3330J353j2444j6667R880J7695j608j0126K956
21698a1867J1645l937n484l167K796P010j5111j3292r48K0782P953P298j090J5035
21684A7623J3573j5333j3290l915k79l286r182K063l012n980J2031M996q20r853
21670a4664Q04K614K3073o15j2547j2725j9791J8J610J0999O912N531J2882o007
21656a906j3840J961P562m993q150q458M460M711N168m014J1183k596o698J497
$$ plain form
21642 -14113 -11430 -18858 -31953 -36952 -35022 -25134 -18008 -11399 8579 11506 -1223 2664 768 2441
21628 2441 -5278 -11912 -16449 -19882 -14260 -15553 -25735 -39762 -36484 -18736 -14158 -14756 -19199 -11628
21614 -11628 -7845 -15486 -19954 -6278 -6087 -13432 -14708 -22838 -31683 -16172 2589 11044 4847 -663
21600 -663 770 4111 10731 16465 10940 7260 6681 -1751 -4562 -2838 -1587 -3601 -1756 -12336 -13020
21585 -13020 -16438 -26794 -18530 -8730 -4315 -9129 -7385 1123 -113 -3839 -7979 -8495 -3674 9546
21571 9546 981 -6934 -8608 -12778 -18003 -20355 -5117 6046 3540 1298 -13997 -20952 -24525 -30704
21557 -30704 -29030 -23403 -23671 -11443 -13207 -20728 -11373 -10130 3058 7146 -7042 -18990 -17107 -14989
21543 -14989 -10820 -7248 5097 3643 -8016 -4853 3752 6699 9359 10781 2823 -8057 -13839 -8785
$$ packed form
21642a4113K683p428j3095m999J930R888P126O609J9978K927j2729L887j896J673
21628B441p719o634m537l433N622j293j0182j4027L278J7748M578n98m443P571
21614a1628L783p641m468J3676J91p345j276q130q845J5511J8761Q455o197n510
21600f63J433L341O620N734n525l680n79q432k811J724J251k014J845j0580o84
21585a3020l418j0356Q264R800M415m814J744Q508j236l726m140n16M821J3220
21571I546q565p915j674m170n225k352J5238J1163k506k242j5295o955l573o179
21557c0704J674N627k68J2228j764p521R355J243J3188M088j4188j1948J883K118
21543a4989M169L572J2345j454j1659L163Q605K947K660J422p958j0880n782N054
$$ plain form
21529 -8785 -14707 -15880 -7423 -1609 -3527 2692 -9734 -22475 -14363 -23195 -9328 -5666 -11570 -5333
21515 -5333 -4687 -13705 -20983 -32338 -26760 -23284 -22228 -21011 -6666 -3014 -7540 -12434 -10563 2307
21501 2307 7267 -4772 -16487 -23620 -15070 -9783 -4845 551 6383 -3331 -3884 4867 -5060 1211
21487 1211 22786 14329 12851 12785 8046 1669 -10391 -897 3265 6729 2475 -906 2516 -15673
21473 -15673 -22587 -26677 -17307 -12344 -4920 -4268 -5935 -9246 -5936 -6794 -1968 14877 14769 470 -6215
21458 -6215 196 9470 17830 14372 6144 -10099 -11303 2276 -9447 -6552 -6153 -6092 5506 -2071
21444 -2071 -17635 -24928 -28443 -34094 -36815 -28425 -42313 -42563 -27826 -27845 -28869 -24006 -21588 -22435 -17877
21429 -17877 -17216 -17572 -15169 -13419 -1612 7165 3120 -10078 -19622 -23851 -34269 -30968 -15002 -2099
$$ packed form
21529h785n922j173Q457N814j918O219j2426j2741Q112q832J3867L662n904O237
21515e333O46r018p278j1355N578L476J056J217J4345L652m526m894J871J2870
21501B307M960j2039j1715p133Q550N287M938N396N832r714n53Q751r927O271
21487A211K1575q457j478o6m739o377j2060R494M162L464m254l381L422j8189
21473a5673o914m090R370M963P424O52j667l311L310q58M826J6845j08j4299o685
21458f215O411R274Q360l458q228j6243j204J3579j1723K895L99O1J1598p577
21444b071j5564p293l515n651k721Q390j3888k50J4737j9j024M863K418q47M558
21429a7877O61l56K403J750J1807Q777m045j3198r544m229j0418L301J5966J2903
$$ plain form
21415 -2099 -1491 -12141 -19719 -19028 -10224 5121 1051 1168 -20294 -36465 -30064 -27321 -26956 -19002 -11818
21400 -11818 -4134 -10427 -5302 -7556 741 6319 805 -16427 -38660 -36608 -26724 -12768 -7735 -4040
21386 -4040 -9005 -13244 -15945 -17305 -21682 -14934 -4551 -15906 -13382 -7582 -20164 -25324 -10931 -13485
21372 -13485 -8314 -3025 -9084 -20088 -26335 -37488 -43740 -38566 -23251 -3697 -4522 -16312 -27624
21359 -27624 -29628 -26395 -20014 -22645 -20180 -11057 -4547 -4169 4438 2017 -4940 -4189 -3101 -1702 -6839
21344 -6839 -2108 6935 12193 -6223 -16386 -22248 -14989 -7777 -10302 -15944 -14091 -21191 -20849 -11939
21330 -11939 -13432 -11184 -9376 474 6383 12633 2530 2927 21707 21103 12341 6851 7191 2731 3165
21315 3165 -4757 -7676 -21471 -24491 -22840 -23087 -15641 -1737 -3855 -5771 -2628 4415 -3975 -13667
$$ packed form
21415b099O08j0650p578O91Q804J5345m070J17k1462j6171O401K743L65P954P184
21400a1818P684o293N125k254Q297N578n514j7232k2233K052R884J3956N033L695
21386d040m965m239k701j360m377O748J0383j1355K524N800j2582n160J4393k554
21372a3485N171N289o059j1004o247j1153o252N174J5315J9554q25j1790j1312
21359b7624k004L233O381k631K465R123O510L78Q607k421o957P51J088J399n137
21344f839M731R043N258j8416j0163n862P259P212k525n642J853p100L42Q910
21330a1939j493K248J808R850N909O250j0103L97J8780o04q762n490L40m460M34
21315C165p922k919j3795l020J651k47P446J3904k118j916L143P043q390r692
$$ plain form
21301 -13667 -7673 -6767 1546 18946 16132 -10935 -10427 -2738 -3846 -22005 -24414 -17417 -9065 -16268
21287 -16268 -21287 -20799 -10376 -2208 -3560 -15652 -21480 -8369 2151 -5279 -15146 -12425 -2814 2853
21273 2853 -4133 2390 10979 1635 -225 -3293 -11019 -7902 -9321 -9893 -22576 -32968 -22585 -7401
21259 -7401 -13199 -25132 -28909 -30644 -21399 -17468 -18273 -19121 -25274 -24744 -7853 4458 3702 2818 1198
21244 1198 -13266 -4245 7032 6963 2737 -4550 -14783 -14288 781 12303 5915 7414 -1498 -9770
21230 -9770 -3394 324 21 4435 13260 14495 1704 -19361 -14654 -19132 -20880 -22787 -14249 -9669
21216 -9669 -9778 847 -1626 6172 16770 5574 -15020 -12178 -10427 -9878 5811 4720 -7621 -2168
21202 -2168 -7524 -22093 -12779 -11019 -19534 -27377 -25994 -12378 -16858 -14756 3528 26434 13266
$$ packed form
21301a3667N994R06Q313J7400k814k7067N08P689j108j8159k409O997Q352p203
21287a6268n019M88J0423Q168j352j2092n828J3111J0520p430r867K721R611N667
21273B853o986O523Q589r344j860l068p726L117j419n72j2683j0392J0383J5184
21259g401n798j1933l777j735R245L931q05q48o153N30J6891J2311p56q84j620
21244A198j4464R021J1277o9m226p287j0233M95J5069J1522o388J499q912q272
21230i770O376L718l03M414Q825J235j2791k1065M707m478j748j907Q538M580
21216i669j09J0625k473P798J0598j1196k0594K842J751N49J5689j091j2341N453
21202b168n356j4569R314J760q515p843J383J3616m480K102J8284K2906j3168
$$ plain form
21189 13266 -5874 -5520 12013 22573 24440 28834 25055 7930 -13140 -16133 -14467 -14306 -6421 -851
21175 -851 -478 -4982 -16923 -22456 -27440 -13208 288 8259 23419 10021 -8406 -10731 5434
21162 5434 11565 5344 2768 -22113 -24494 -3987 -2419 -15976 -28568 -39922 -34011 -30812 -31845
21149 -31845 -5472 8084 2015 1179 14599 12807 4032 -4573 -2810 4967 5218 -8326 -8737 -2111
21135 -2111 -8584 -15290 -10832 -5989 -3765 -10058 -21438 -15278 -1345 7312 3374 -8013 2776 10204
21121 10204 -4470 -13166 -15724 -21233 -25736 -24046 -21213 -12526 -27497 -20682 -4347 6702 755
21108 755 -16718 -10271 -4011 -6878 -11898 -3362 14493 19151 9893 3386 212 -3081 235 -9169
21094 -9169 -10343 -19408 -12164 -7270 -19871 -19874 -20797 -17645 -20013 -17599 -12820 -7433 6134 5313 3796
$$ packed form
21189A3266j9140L54J7533J0560J867M394l779j7125k1070k993J666J61P885N570
21175h51L73m504j1941n533m984J4232J3496P971J5160j3398j8427k325J6165
21162E434O131o221k576k4881k381K0507J568j3557j2592j1354N911L199j033
21149c1845K6373J3556o069q36J3420j792q775q605J763P777K51j3544m11O626
21135b111o473o706M458M843K224o293j1380O160J3933Q657l938j1387J0789P428
21121A0204j4674q696k558n509m503J690K833Q687j4971O815J6335J1049n947
21108G55j7473O447O260k867n020Q536J7855M658r258o507l174l293L316r404
21094i169j174r065P244M894j2601lr23L152k368K414M779N387J3567q21j517
$$ plain form
21079 3796 3810 -5441 -23347 -20690 1206 6750 -10282 -22643 -19624 -21647 -23209 -7660 -3913 -651
21065 -651 1597 -2768 4972 11054 3511 3333 -9647 -10792 -10075 -22950 -19038 -9709 -3518 -1653 -7805
21050 -7805 -23523 -27252 -21461 -8612 1702 1563 -1896 -14545 -14610 -20469 -17971 -14480 -9355 -15296
21036 -15296 -15255 -23650 -17857 -7313 -1264 1765 11056 16308 4074 5350 3122 -4334 -3192 -480
21022 -480 -9616 -6855 125 -405 -10511 -23787 -31338 -30180 -21605 -21429 -20656 -4428 9507 11220 7066
21007 7066 10108 4639 -2438 -10845 -7512 1110 -1145 -10574 -9451 -12182 -9867 -413 1563 -3024 -3036
20992 -3036 6321 3279 -6467 -10838 -4385 5810 8736 7389 -3832 -13049 -10565 -7178 7075 14099
20978 14099 11367 -14532 -29136 -18837 -18202 -18513 -11744 -10317 -6263 -7320 -6263 -13329 -16526 -29758
$$ packed form
21079C796J4r251j7906K657K1896N544j7032j2361L019k023j562J5549L747L262
21065f51K248m365P740O082p543j78j2980j145P17j2875L912R329O191J865o152
21050g805j5718l729N791J2849J0314j39l459j2649o5n859K498L491N125n941
21036a5296M1q395N793J0544O049L029R291N252j2234J276k228p456J142K712
21022d80r136K761O980n30j0106j3276p551J158Q575J76P73J6228J3935J713m154
21007G066L042n469p077q407L333Q622k255r429J123k731K315R454J976m587j2
20992c036R357l042r746m371O453J0195K926j347j1221r217K484L387J4253P024
20978A4099k732k5899j4604J0299O35l11O769J427M054j057J057p066l197j3232
$$ plain form
20964 -29758 -34658 -35443 -31893 -33558 -28494 -7261 -6186 -21401 -26503 -37010 -37123 -44607 -29953 -18210
20950 -18210 -16805 2981 8812 5297 6786 16570 15854 1905 12384 17173 2207 -8489 -11461
20937 -11461 -11660 -21754 -15429 -9865 1712 22511 15460 6463 -956 -4912 -12296 -384 9609 -923
20923 -923 3157 3973 -5912 11672 25439 12315 -3543 18413 35780 26250 16381 14662 14216 18398
20909 18398 14447 970 -1064 10770 13530 5199 6737 12924 16129 20737 20242 7816 -6968 -12752
20895 -12752 -6966 -5070 -14699 -19987 -2636 10599 -2711 -10675 -3417 2647 894 -9160 -5571
20882 -5571 -6744 5204 31921 32280 15751 17099 26087 14280 -7743 8986 14155 15046 14922 24627
20868 24627 15274 4567 8958 5478 10022 2215 2986 2102 7551 12938 14554 15634 22145 26141 26235
$$ packed form
20964b9758m900p85L550j665N064K1233J075j5215n102j0507j13p484J4654J1743
20950a8210J405J9786N831l515J489R784p16j3949J0479M789j4966j0696k972
20937a1461j99j0094O325N564J1577K0799p051q997p419l956p384J1912R993j0532
20923i23M080Q16r885J7584J3767j3124j5858K1956J7367r530r869j719m46M182
20909A8398l951j3477k034J1834K760q331J538O187L205M608m95j2426j4784n784
20895a2752N786J896r629n288J7351J3235j3310p964P258O064j753j0054L589
20882e571j173J1948K6717L59j6529J348Q988j1807k2023J6729N169Q91j24R705
20868B4627r353j0707M391l480M544p807P71q84N449N387J616J080O511L996R4
$$ plain form
20853 26235 22593 9161 5263 6311 10798 15471 24640 23267 17242 21822 15621 17695 2611 -38
20839 -38 3883 -692 -1773 7167 14676 5219 14514 16549 14972 9871 -5715 -7406 -377 5380 12231
20824 12231 24137 23890 23957 7114 8242 25581 28620 26675 9546 4735 9322 15056 4142 4461
20810 4461 7095 9971 5122 9113 20266 27665 35577 43608 48212 54083 42397 35660 29115 21485
20796 21485 21835 23383 38279 44615 45049 46216 41913 50570 50012 35702 27531 22919 32306 38398 36383
20781 36383 52806 57674 53835 58742 64612 72344 66821 76488 90163 85995 77707 59112 63570 67841
20767 67841 59401 42805 48383 42549 36401 38761 60957 68762 57679 64761 66871 60669 56818 50405
20753 50405 47495 49255 62679 76952 82283 76638 76411 84789 85556 81112 88323 87265 87908 96384 95147
$$ packed form
20853B6235l642j3432l898J048M487M673R169j373o025M580o201K074j5084k649
20839c8L921m575j081Q940P509r457R295K035j577n101j5586j691P029N757O851
20824A2231J1906k47O7j6843J128J7339L039j945j7129m811M587N734j0914L19
20810D461K634K876m849L991J1153P399P912Q031M604N871j1686o737o545p630
20796B1485L50J548J4896O336M34J167m303Q657n58j4310q171m612R387O092k015
20781C6383J6423M868l839M907N870P732n523R667J3675m168q288j8595M458M271
20767F7841q440j6596N578n834o148K360K2196P805j1083P082K110o202l851o413
20753E0405k910J760J3424J4273N331n645k27Q378P67m444P211j058O43Q476j237
$$ plain form
20738 95147 85854 75607 75601 82465 89796 84495 77984 97021 93269 78165 60302 68559 73680 67759
20724 67759 72034 87156 85277 72364 54241 43354 50622 70986 100967 104063 86204 77878 81091
20711 81091 84291 89111 83102 87808 93621 97411 96559 92380 97188 91207 75410 67735 76941 68273
20697 68273 69066 69359 79156 83096 83795 83772 83455 79905 75913 73675 73420 78040 85486 79485 75311 73012
20681 73012 67669 66492 61069 46122 39751 40015 53573 74043 60747 37176 43554 39677 40209 47405
20667 47405 45625 40129 36816 43470 37180 45271 55344 60246 57812 35824 26300 31865 33120 26449
20653 26449 21231 19096 20067 17148 13845 15245 14490 14651 18638 34691 23977 24300 18868 20029 25776
20638 25776 41065 35601 26535 33724 31547 24460 24564 33420 29766 28591 16429 9532 11899 17839
$$ packed form
20738I5147r293j0247oO864P331n301o511J9037l752j5104j7863Q257N121n921
20724F7759M275J5122j879j2913j8123j0887P268K0364K9981L096j7859q326L213
20711H1091L200M820o009M706N813L790q52m179M808n981j5797p675R206q668
20697F8273P93K93R797L940O99k3l17l550l992k238k55M620P446o001m174k299
20681G3012n343j177n423j4947o371K64J3558K0470j3296k3571O378l877N32P196
20667D7405j780n496l313O654o290Q091J0073M902k434k1988r524N565J255o671
20653B6449n218k135R71k919l303J400p55J61L987J6053j0714L23n432J161N747
20638B5776J5289n464r066P189k177p087J04Q856l654j175j2162o897K367N940
$$ plain form
20624 17839 18616 17091 6501 6588 19531 26153 16666 16069 23553 19727 20474 16835 22226 23954 29196
20609 29196 23997 16671 16444 12184 21672 21724 17844 31573 50864 56779 43287 10191 -776 4042
20595 4042 3193 14734 20878 11820 6520 -8715 -15485 -5721 824 -9107 -1699 10036 1688 2734
20581 2734 5418 4204 170 -12139 -9511 -662 -3555 -7372 -6391 -11395 -18842 -11586 -3498 -2133 10384
20566 10384 8724 -8778 -2667 10244 19441 34735 38663 29054 24707 10425 4295 -711 -7594
20553 -7594 -10602 2643 3663 5438 3491 -1717 -1915 5631 8622 10833 -7002 790 5436 -3876
20539 -3876 -2581 5511 16796 18375 5867 1224 -12274 -17771 -6531 309 13002 5730 -2477
20526 -2477 -12030 -12811 -4096 59 4951 12024 20111 16325 21733 28210 13177 6426 474 -3287 -1711
$$ packed form
20624A7839P77j525j0590Q7J2943O622r487n97P484l826P47l639N391J728N242
20609B9196n199p326k27m260R488N2l880J3729J9291N915j3492l3096j0967M818
20595D042q49J1541O144r058n300j5235o770R764O545r931P408J1735q348J046
20581B734K684j214m034j2309K628Q849k893l817R81n004p447P256Q088J365J2517
20566A0384j660j7502O111J2911R197J5294L928r609m347j4282o130n006o883
20553g594l008J3245J020J775j947n208j98P546K991K211j7835P792M646r312
20539c876J295Q092J1285J579j2508m643j3498n497J1240O840J2693p272q207
20526b477r553p81Q715M155M892P073Q087l786N408O477j5033o751n952l761J576
$$ plain form
20511 -1711 -8101 -597 5671 130 -1340 -860 -451 7061 -700 -24853 -28682 -19843 -15002 -11437 3705
20496 3705 15297 26398 22582 18899 2296 -2076 -2514 718 7167 11183 12158 9297 3342 2007
20482 2007 4364 1656 2129 -7543 5874 -289 -4263 -6829 -10583 -8066 5248 6837 -1862 -10353
20468 -10353 -14800 -13167 -15704 -13643 -4756 -3183 -6180 11313 9446 3114 5080 7005 2553 -3651
20454 -3651 -3325 -2976 -17496 -25665 -26125 -22235 -3737 -3993 -14249 -30584 -19738 -7130 -3025 -15275
20440 -15275 -16860 -4485 10777 2504 -8733 -4934 1149 2478 9909 -6301 -7035 -841 -5557 -12650
20426 -12650 -10226 3419 19055 4241 -10860 -18711 -21845 -8144 9003 5018 -9669 -12644 -9303
20413 -9303 710 -5744 -13213 -5180 4423 8139 976 -1628 4691 5116 -10041 -23433 -10573 750
$$ packed form
20511a711o390P504O268n541j470M80M09P512p761k4153l829Q839M841L565J5142
20496C705J1592J1101l816l683j6603m372m38L232O449M016R75k861n955j335
20482B007K357k708M73r672J3417o163l974k566l754K517J3314J589q699q491
20468a0353m447J633k537K061Q887J573k997J7493j867o332J966J925m452o204
20454c651L26L49j4520q169m60L890J8498k56j0256j6335J0846J2608M105j2250
20440a5275j585J2375J5262q273j1237L799O083J329P431j6210p34O194m716p093
20426a2650K424J3645J5636j4814j5101p851l134J3701J7147l985j4687k975L341
20413i303J0013o454p469Q033R603L716p163k604O319M25j5157j3392J2860J1323
$$ plain form
20399 750 5277 -14766 -17105 -9679 -3233 -3605 -5680 -3264 -3499 1341 -8070 -4676 10594 8380 -2951
20384 -2951 -10481 -20776 -20744 -8838 6088 8816 1753 -11564 -26211 -30207 -35376 -25511 -11819 7315
20370 7315 15626 -7125 -18372 -10588 -3983 1687 -12280 -19653 -18854 -13652 -8036 -2340 3257 6793
20356 6793 988 -1315 -7967 -11339 -13291 -21879 -16159 -5459 -7116 -6003 10556 13824 5841 -4242
20342 -4242 -8120 -5671 -3847 10377 26516 27125 31187 47246 20475 685 5934 17693 30655
20329 30655 16481 -11503 -22259 -21638 -9347 -5580 -1299 -2216 -2862 -3508 8206 6969 -1546 -3824
20315 -3824 4090 5582 -13483 -15908 -7468 -6684 -5332 -10896 -16645 -16842 -4630 -800 9321 10686
20301 10686 3914 -616 10064 -128 -15265 -24537 -14639 -18342 -34973 -37537 -29668 -25833 -22970
$$ packed form
20399G50M527k0043k339P426O446l72k075K416k35M840r411L394J5270k214j1331
20384b951p530j0295L2J1906J4926K728p063j3317j4647l996n169R865J3692J9134
20370G315Q311k2751j1247P784O605N670j3967p373P99N202N616N696N597L536
20356F793n805k303o652l372j952q588N720J0700j657J113J6559L268p983j0083
20342d242l878K449J824J4224J6139O09M062J6059k6771j9790N249J1759J2962
20329C0655j4174k7984j0756O21J2291L767M281r17o46o46J1714j237q515k278
20315c824P914J492j9065k425Q440P84J352n564n749j97J2212L830J0121J365
20301A0686o772m530J0680j0192j5137r272R898l703j6631k564P869L835K863
$$ plain form
20288 -22970 -21218 -14597 -7837 920 -7182 -5563 -8732 -15231 -21461 -18890 -9695 -10846 -8591 -4455
20274 -4455 12326 13375 5088 -8779 -9863 3957 -3092 -9360 -15713 -19592 -23885 -20329 -12995 -9040
20260 -9040 -10801 -20195 -10744 3161 5768 8401 6328 -2573 -30 10466 19977 15987 3619 8509
20246 8509 9660 13541 7855 -10580 3609 9121 8958 9000 2697 2533 4315 -2003 4216 1659 -6445
20231 -6445 -2758 1507 1671 -11956 -18261 -18058 -1027 -138 -4934 7648 -1928 -399 1055 6936 -3861
20216 -3861 -4118 -16815 -14441 -5269 2508 3204 -11235 -21680 -31176 -32421 -28452 -25756 -16552 -16679 -13579
20201 -13579 -5741 -6614 819 6428 6505 9819 -1390 -12817 -10937 -10330 -15772 -5866 3551 -6404 -10497
20186 -10497 -4776 -10639 -16111 -8017 -609 8935 5394 -1957 -312 9804 26900 21345 12635 10225
$$ packed form
20288b2970J752O621O760Q757q102J619l169o499o230K571R195j151K255M136
20274d455J6781J049q287j3867j084J3820p049o268o353l879m293L556P334L955
20260i040j761r394R451J3905K607K633k073q901K543J0496R511l990j2368M890
20246H509J151L881n686j8435J4189N512j63M2o303j64J782o318O219k557q104
20231f445L687M265J64j3627o305K03J7031Q89m796J2582r576J529J454N881j0797
20216c861k57j2697K374R172P777O96j4439j0445r496j245L969K696R204j27L100
20201a3579P838q73P433N609P7L314j1209j1427J880O07n442R906R417r955m093
20186a0497N721n863n472Q094P408R544l541p351J645J0116J7096n555q710k410
$$ plain form
20172 10225 1186 -479 -5421 -25815 -18327 -10465 -55 11129 15919 11213 -7101 304 6103
20159 6103 -3337 -13687 -2567 3457 3766 10235 1720 7160 13176 7395 11371 7851 73 -4670
20145 -4670 -4579 -10314 -11739 -4030 4276 765 -258 11015 9424 -6508 -5830 2784 2281 -2349 -5519
20130 -5519 -3020 -6763 -16324 -12343 1257 7488 7666 9886 -2767 -7388 -5927 1757 4475 3743 6898
20115 6898 -8739 -12415 -5798 -5441 1707 -2040 -888 -393 -831 108 -6425 -2362 1718 -1806 -3764
20100 -3764 -4505 -775 2293 13015 11205 11912 8242 -1340 -1388 -7272 -3930 -3765 -7529 -4530 -4903 -7158
20084 -7158 -8976 -5329 10127 18575 13234 12029 9149 5837 -483 -14966 -9618 14118 11074 -8729
20070 -8729 -20077 -17242 -11770 -9143 -4968 -10263 -14774 -9140 1306 -254 -9837 -20351 -11237 1484
$$ packed form
20172A0225r039j665m942k0394P488P862J0410J1184M790m706j8314P405N799
20159F103r440j0350J1120O024L09O469q515N440O016n781L976l520p778m743
20145d670R1n735j425P709Q306l511j023J1273j591j5932O78Q614n03m630l170
20130e519K499l743r561L981J3600O231J78K220j2653m621J461P684K718p32L155
20115F898j5637l676O617L57P148l747J152M95m38R39o533M063M080l524j958
20100c764p41L730L068J0722j810P07l670r582m8n884L342J65l764K999l73k255
20084g158j818L647J5456Q448n341j205k880l312o320j4483N348K3736l044j9803
20070h729j1348K835N472K627M175n295m511N634J0446j560r583j0514R114J2721
$$ plain form
20056 1484 8493 21452 25166 19686 4407 -2561 -9037 -14796 -19716 -23827 -14450 -3559 -8789 -13341
20042 -13341 -18894 -7225 -9442 -27444 -18580 -19114 -18033 -12170 -8270 8299 17749 9839 5988 4775
20028 4775 -9335 -12098 -15033 -15479 6899 9970 -813 -2056 -1952 -11314 -9020 -12143 -16859 -20384
20014 -20384 -16465 -14296 -14473 -8906 -14254 -514 891 -7676 -6762 7672 12491 12557 1928 300 2779
19999 2779 3259 -9704 -19407 -17459 -15836 -4599 8860 12953 22651 18745 14401 10283 11191 16663
19985 16663 9687 1209 5482 4262 2563 107 -13115 -4628 -1107 -9242 630 7740 -1415 -16639
19971 -16639 -22896 -14447 -7761 2397 5838 -3464 -6468 -6392 -478 13769 -1527 -20799 -18726 -10205
19957 -10205 -7709 -10359 -6000 -12963 -16031 -11245 -7047 -17021 -5169 5674 -3894 -13199 -20529 -21553
$$ packed form
20056A484P009J2959L714n480j5279o968o476n759m920m111R377J0891n230m552
20042a3341n553J1669k217j8002Q864n34J081N863L900J6569R450p910l851j213
20028D775j4110k763k935m46K2378L071j0783j243J04r362K294l123m716l525
20014b0384L919K169j77N567n348J3740J405q567R14J4434M819O6j0629j628K479
19999B779M80j2963r703J948J623J1237J3459M093R698l906m344m118R08N472
19985A6663o976q478M273j220j699k456j3222Q487L521q135R872P110r155j5224
19971a6639o257Q449O686J0158L441r302l004P6N914J4247j5296j9272K073Q521
19957a0205K496k650M359o963l068M786M198r974J1852J0843r568r305p330j024
$$ plain form
19943 -21553 -20323 -16843 -14772 -3590 2267 10744 7951 12316 6498 3059 19734 13388 -5501 -21839
19929 -21839 -12029 6262 13963 1777 372 -10634 -16598 2797 11418 14633 13791 4819 -1904 2681
19915 2681 3584 -861 11356 23196 12874 2064 6171 8516 6597 -5656 -5526 -6273 -5182 12077
19901 12077 18857 19756 19164 17298 19440 14377 8001 -5685 -2846 -6477 -3250 -6718 -15332 -7920 -4519
19886 -4519 -6236 -12379 -10390 111 3007 5933 4518 2145 907 -1808 1870 -1352 -3445 -1337
19872 -1337 4927 10172 14321 25770 26533 14301 10213 2196 -7432 -9013 -7187 -4687 -7032 -15044
19858 -15044 -10987 -9700 -14279 -15790 -16157 -7597 2474 -864 1516 -179 -6277 -3560 -15145 -21117
19844 -21117 -12422 -600 -3730 -10446 654 1569 -3067 -54 5230 12228 8765 6987 457 1214
$$ packed form
19943b1553J230L480K071J1182N857Q477k793M365n818l439J6675o346j8889j6338
19929b1839R810J8291P701j2186j405j1006n964J9395Q621L215q42q972o723M585
19915B681R03m445J2217J1840j0322j0810M107K345j919j2253J30p47J091J7259
19901A2077O780Q99n92j866K142n063o376j3686K839l631L227l468q614P412L401
19886d519j717o143J989J0501K896K926j415k373j238k715L678l222k093K108
19872a337O264N245M149J1449P63j2232m088q017r628j581J826K500k345q012
19858a5044M057J287m579j511l67Q560J0071l338K380j695o098K717j1585n972
19844b1117Q695J1822l130o716J1100R15m636L013N284O998l463j778o530P57
$$ plain form
19830 1214 3489 8548 23865 27142 16998 7300 11007 32195 33959 23457 5571 -1609 12831
19817 12831 27093 23023 6451 -2439 -3550 -10215 -15945 -25182 -23994 -10342 -4428 -68 -11306
19804 -11306 -9909 6685 7739 7843 20235 14905 11689 13249 9081 -5339 -20310 -13571 -8626 -12545
19790 -12545 -8975 3942 18277 13250 -5228 -14645 -15253 -11679 -15945 1274 5134 1765 -679 -7487
19776 -7487 -11466 -14472 -2794 382 -2873 357 -7353 -4525 -8362 -5040 -5979 2877 4707 -3535 -13013
19761 -13013 -15857 -14594 -11323 -7029 -19921 -24419 -15162 -5171 -1933 -3944 -5244 -2948 10760 17941
19747 17941 11659 -7453 -4979 -10229 -10006 -3110 10907 24958 36273 40025 33647 25917 21316 14121
19733 14121 12152 6059 122 10466 7322 -9067 5639 23576 28267 38436 35963 19103 18691
$$ packed form
19830A214K275N059J5317L277j0144r698L707K1188J764j0502j7886p180J4440
19817A2831J4262m070j6572q890j111o665n730r237J188J3652N914M360j1238
19804a1306J397J6594J054J04J2392n330l216J560m168j4420j4971O739M945l919
19790a2545L570J2917J4335n027j8478r417o08L574m266J7219L860l369k444o808
19776g487l979l006J1678L176l255L230p710K828l837L322r39Q856J830q242r478
19761a3013k844J263L271M294j2892m498R257R991L238k011j300K296J3708P181
19747A7941o282j9112K474n250K23O896J4017J4051J1315L752o378p730m601p195
19733A4121j969o093n937J0344l144j6389J4706J7937M691J0169k473j6860m12
$$ plain form
19720 18691 14044 3662 -3424 -15701 -18294 -14223 -12134 -18416 -11749 -2310 -4082 8633 12535 1646
19706 1646 -11454 -11781 -2899 2183 937 -8523 889 4049 -11239 -12904 1042 416 861 -25 -4805
19691 -4805 -8230 -19182 -34627 -43092 -31376 -16382 -17403 -11015 -10365 -21796 -16708 -6295 -15349
19678 -15349 -22537 -9877 94 4474 8443 10652 4978 597 2938 3344 267 185 6088 12089 8085
19663 8085 2628 1497 7733 -124 -2981 -5265 -4944 1660 -2063 528 936 -5971 -8390 -9371 -5452
19648 -5452 2208 2964 1785 11721 22772 28007 11711 8802 3036 -3448 9303 2672 -5844 2053
19634 2053 918 -5213 -4274 9187 8094 8419 11928 12451 -67 -8630 -6905 -4296 -7665 -14307 -15404
19619 -15404 -6370 1018 1444 6462 20117 12852 10599 5468 4562 10068 7382 3692 -4600 1315 2071
$$ packed form
19720A8691m647j0382p086j2277k593M071K089o282O667R439j772J2715L902j0889
19706A646j3100l27Q882N082j246r460R412L160j5288j665J3946o26M45q86m780
19691d805l425j0952j5445q465J1716J4994j021O388O50j1431N088J0413r054
19678a5349p188J2660R971M380L969K209n674m381K341M06l077q2N903O001m004
19663H085n457j131O236p857k857k284L21O604l723K591M08o907k419r81L919
19648e452P660P56j179R936J1051N235j6296k909n766o484J2751o631q516P897
19634B053j135o131R39J3461j093L25L509N23j2518q563J725K609l369o642j097
19619a5404R034P388M26N018J3655p265k253n131r06N506k686l690q292N915P56
$$ plain form
19604 2071 10364 13561 12785 -3269 -4495 -13639 -8422 -7331 -4917 -1375 3493 3212 2333 17228 26406
19589 26406 22691 16208 14577 -850 -6856 -14448 -20762 -11771 -3341 -4128 -21462 -22153 -1831 8502
19575 8502 -909 1699 8197 4416 9227 -3505 6740 7919 -13424 -26293 -8711 3344 19837
19562 19837 29286 16071 -2710 4025 -2028 9271 12754 10487 17547 19304 20781 16305 19968 23555
19548 23555 20487 19029 7510 -2000 -9424 -13188 4913 27654 38574 22311 -1655 -21351 -28634
19535 -28634 -13555 -4088 4836 1809 3814 1463 -2708 -3182 2190 6633 -5114 1236 12681 6123
19521 6123 14554 14524 1590 -1982 6443 -4444 -10532 -2172 -12981 -24053 -16748 -12772 1611 -14694
19507 -14694 -24590 -8659 937 122 -1271 2999 3980 -13196 -13676 4720 20603 26765 26768 29139 19337
$$ packed form
19604B071Q293L197p76j6054j226r144N217J091K414L542M868k81q79J4895R178
19589B6406l715o483j631j5427o006p592o314Q991Q430p87j7334o91K0322J0333
19575H502r411K608O498l781M811j2732J0245J179k1343j2869J7582J2055J6493
19562A9837R449j3215j8781O735o053J1299L483k267P060J757J477m476L663L587
19548B3555l068j458j1519r510p424l764J8101K2741J0920j6263k3966j9696p283
19535b8634J5079R467Q924l027K005k351m171m74N372M443j1747O350J1445o558
19521F123Q431l0j2934l572Q425j0887o088Q360j0809j1072P305L976J4383j6305
19507a4694r896J5931R596q15j393M270R81j7176m80J8396J5883O162LK371r802
$$ plain form
19492 19337 12261 11706 16524 15282 -3239 -15942 -17937 -7757 -12053 -9046 133 8462 15173 24103
19478 24103 22039 21701 8600 -8166 -20112 -26769 -18976 -16864 -12131 4819 3171 7480 22679
19465 22679 26744 20601 10446 18271 12111 5371 8033 3055 -1712 -4782 -4061 2231 12723 18520
19451 18520 15580 17694 -2104 -464 1334 5358 8507 21290 18060 7933 11830 5840 15007 24123
19437 24123 4024 -11749 -8785 564 7612 10066 6253 -829 -10610 -4689 11732 5962 7539 9254
19423 9254 -274 2238 6894 3035 -453 8005 13086 14582 16911 5456 5035 2086 9185 6681 11076
19408 11076 20197 21232 3246 640 5184 6049 2930 10558 16441 8668 5368 1532 -15311 -22184
19394 -22184 -10201 -6759 1363 -7057 -62 4211 7287 7393 7156 4749 -361 -11071 -20244 -14701
$$ packed form
19492A9337p076n55M818j242j8521j2703j995J0180m296L007R179Q329O711Q930
19478B4103k064l38j3101j6766j1946o657P793K112M733J6950j648M309J5199
19465B2679M065o143j0155P825o160o740K662m978m767l070P21O292J0492N797
19451A8520k940K114j9798J640J798M024L149J2783l230j0127L897n990R167R116
19437B4123k0099j5773K964R349P048K454l813p082r781N921J6421n770J577J715
19423I254r528K512M656l859l488Q458N081J496K329j1455m21k949P099k504M395
19408A1076R121J035j7986k606M544Q65l119P628N883p773l300l836j6843o873
19394b2184J1983L442Q122q420O995M273L076J06k37k407n110j0710r173N543
$$ plain form
19380 -14701 -9833 -12711 -12131 -4198 -4634 -7429 -97 -6446 6328 1835 -892 -460 14350 24013 19277
19365 19277 19498 18797 19772 23583 17016 5076 1266 -10028 -6073 7434 16469 13614 15853 10567
19351 10567 12590 5800 -994 1618 16723 16881 14126 4674 523 10530 18973 3600 -7723 -19741
19337 -19741 -23264 -20916 -18815 -7767 -995 -4344 -5592 -2557 2447 3878 4754 7019 10273 -6096
19323 -6096 -15793 -15128 -6107 -1573 4459 2969 5280 4029 8276 11472 12025 -1305 7780 15278 15666
19308 15666 22631 20518 4034 4659 13161 8746 15497 30658 37532 34137 21202 10033 2485 14137
19294 14137 30163 40260 33090 24575 24635 17130 9691 4378 6589 7575 4851 -1433 16112 20276
19280 20276 17647 17319 8274 -1929 -12862 -4825 1391 -5806 -5633 2593 -3132 -4966 -4493 540 16055
$$ packed form
19380a4701M868k878N80P933m36k795P332o349J2774m493k727M32J4810R663m736
19365A9277K21p01R75L811o567j1940l810j1294L955J3507R035k855K239n286
19351A0567K023o790o794K612J5105J58k755r452m151J0007Q443j5373j1323j2018
19337a9741l523K348K101J1048O772l349j248L035N004J431Q76K265L254j6369
19323f096r697O65R021M534O032j490K311j251M247L196N53j3330R085P498L88
19308A5666O965k113j6484O25Q502m415O751J5161O874l395j2935j1169p548J1652
19294A4137J6026J0097p170q515O0p505p439n313K211R86k724o284J7545M164
19280B0276k629l28r045j0203j0933Q037O216p197J73Q226n725j834M73N033J5515
$$ plain form
19265 16055 19866 11640 -1046 9484 24389 28038 16067 19001 38495 37236 29914 15349 14452
19252 14452 13189 7926 11389 2680 -13254 -12250 -6360 -19973 -28274 -11574 7589 11304 15949
19239 15949 25588 26861 24752 22210 19727 6933 1241 3857 19425 12570 8466 7522 10800 12263
19225 12263 6172 254 1228 -3969 -10160 -13176 -19923 -4225 -7071 -13604 -6538 -14876 2040 11338
19211 11338 28391 37190 28450 19384 18015 13341 12427 8980 10679 13686 6627 13250 28020 25483
19197 25483 18679 6485 17893 15424 12209 12011 2212 -7717 -11566 -5552 -1132 -4012 7866 23717
19183 23717 22114 5073 9859 21683 17163 13757 1198 2297 13950 12399 10041 17467 20627
19170 20627 22874 20915 18408 7768 -10521 1655 16629 9639 -2140 -8261 7947 18363 23729
$$ packed form
19265A6055L811q226j2686J0530J4905L649j1971K934J9494j259p322j4565q97
19252A4452j263n263L463q709j5934J004N890j3613q301J6700J9163L715M645
19239A5949R639J273k109k542k483j2794n692K616J5568o855m104r44L278J463
19225A2263o091n918R74n197o191l016o747J5698k846o533P066q338J6916R298
19211A1338J7053Q799q740r066j369m674r14l447J699L007p059O623J4770k537
19197B5483o804j2194J1408k469l215j98r799r929l849O014M420k880J1878J5851
19183B3717j603j7041M786J1824m520l406j2559J099J1653j551k358P426L160
19170B0627K247j959k507j0640j8289J2176J4974o990j1779o121J6208J0416N366
$$ plain form
19157 23729 18105 7885 1924 674 -4934 15150 18550 8590 3198 13479 17470 15022 9872 25313
19143 25313 28089 22333 27614 27313 25421 24844 5216 -11569 -8069 112 5883 9173 14331 20966
19129 20966 16987 11816 11702 20551 23540 23801 25435 25932 25572 14077 9578 -1258 -6715 -3464 3778
19114 3778 11317 5721 1676 13252 29420 23081 25315 12355 -5815 6906 19827 24336 42212
19101 42212 41463 28766 15788 5619 5000 12946 11234 124 2618 947 -8720 -3214 13913 19023
19087 19023 10383 2369 3378 15302 23205 29517 24234 12248 16312 10336 8150 0 9495 18992
19073 18992 24382 15548 10004 12250 5651 16978 18254 2756 -3911 22717 34870 17957 17006
19060 17006 25267 29446 23017 19637 26484 21421 18324 18589 15779 3103 4813 18569 23091 16215
$$ packed form
19157B3729n624j0220n961j250n608K0084L400r960n392J0281L991k448n150J5441
19143B5313K776n756N281l01j892n77j9628j6785L500Q181N771L290N158O635
19129B0966l979n171j14Q849K989K61J634M97l60j1495m499j0836n457L251P242
19114C778P539n596m045J1576J6168o339K234j2960j8170J2721J2921M509J7876
19101D2212p49j2697j2978j0169o19P946j712j1110K494j671r667N506J7127N110
19087A9023q640q014J009J1924P903O312n283j1986M064n976k186q150R495R497
19073A8992N390q834n544K246o599J1327J276j5498o667K6628J2153j6913r51
19060A7006Q261M179o429l380O847n063l097K65k810j2676J710J3756M522o876
$$ plain form
19046 16215 17616 30622 23502 10217 -1060 2813 20655 20709 22814 29788 16913 14324 19960 25784
19032 25784 29586 18408 13120 23199 20837 19496 19597 23657 25124 22451 15619 16996 21115 18237
19018 18237 10613 4611 3859 -560 2908 4299 -1090 699 4915 13388 9308 25723 39029 39514
19004 39514 33632 39522 45672 23284 10641 10389 30274 41894 37363 26294 27649 38269 39739
18991 39739 25968 21950 27958 36981 35892 33691 35882 30066 22470 16912 9948 22880 24058 25290
18977 25290 31952 27551 15123 19298 29148 23830 21972 18063 16118 9364 14201 18783 18813 23342 23630
18962 23630 13632 21282 14658 19631 25451 20513 13375 9718 15282 27864 31344 21949 18816 2304
18948 2304 -6478 10233 13298 -39 1689 8040 9231 8088 19588 34395 31876 25084 30119 32651
$$ packed form
19046A6215J401J3006p120j3285j1277L873J7842N4K105O974j2875k589N636N824
19032B5784L802j1178n288J0079k362j341J01M060J467k673o832J377M119k878
19018A8237p624o002p52m419L468J391n389J789M216Q473m080J6415J3306M85
19004C9514n882N890O150k2388j2643k52J9885J1620m531j1069J355J0620J470
18991C9739j3771m018O008R023j089k201K191n816p596n558o964J2932J178J232
18977B5290O662m401j2428M175R850n318j858l909j945o754M837M582L0M529K88
18962B3630r998P650o624M973N820m938p138l657N564J2582L480r395l133j6512
18948B304q782J6711L065j3337J728O351J191j143J1500J4807k519o792N035K532
$$ plain form
18934 32651 43342 46134 42935 32166 26001 25873 10002 12407 16505 26025 30404 27215 24057 10855
18920 10855 10370 4867 9394 12983 20697 28304 36710 35581 29648 21888 25168 11746 1276 -4959
18906 -4959 3813 18666 16230 23727 37314 33093 33648 22133 15545 30412 32385 18007 11926 24818
18892 24818 26382 19753 12697 -3227 -11064 -8442 -13491 -1594 11671 17825 9938 -99 4149
18879 4149 8634 19400 31929 25708 18540 13111 9925 16967 24909 24439 17607 4814 -2907 4258
18865 4258 11740 11832 11180 17366 23357 25598 18680 12372 9287 22248 42926 41891 20464 -2694
18851 -2694 8162 32473 32225 26298 9414 2223 1236 9565 14293 3928 2556 26258 41954 30515
18837 30515 35751 45193 34446 26780 19680 23133 20590 20082 21844 41756 26351 19904 25345 22285
$$ packed form
18934C2651J0691K792l199j0769o165j28j5871K405M098R520M379l189l158j3202
18920A0855m85n503M527L589P714P607Q406j129n933p760L280j3422j0470o235
18906d959Q772J4853k436P497J3587m221N55j1515o588J4867J973j4378o081J2892
18892B4818J564o629p056j5924p837K622n049J1897J3265O154p887j0037M248
18879D149M485J0766J2529o221p168n429l186P042P942m70o832j2793p721P165
18865D258P482R2o52O186N991K241o918o308l085J2961K0678j035k1427k3158
18851b694J0856K4311k48n927j6884p191r87Q329M728j0365j372K3702J5696j1439
18837C0515N236R442j0747p666p100L453k543n08J762J9912j5405o447N441l060
$$ plain form
18823 22285 28961 27967 32787 30159 35486 36679 26858 16737 8309 -5107 85 10157 8984 9323
18809 9323 13875 24362 23339 25852 27948 29403 10270 6492 11151 9916 11547 9013 14792 35918
18795 35918 49139 37650 30035 27069 27541 35644 27883 22406 19783 15385 16940 33459 33294 50844
18781 50844 63236 63596 46993 27856 19259 39911 48507 38029 42923 60477 82916 104651 114032
18768 114032 127393 134407 138843 120967 94493 71503 59665 52371 53045 50870 47544 55475 62198
18755 62198 64308 49280 27953 23174 26376 25561 16564 13083 18198 23223 38303 44577 40792 18144
18741 18144 13353 17388 29664 30768 31372 40686 49611 43887 39952 36883 24592 25685 16216 27014
18727 27014 31422 32829 33354 39311 48495 37305 36067 33211 44978 39734 45859 47390 45327 42976
$$ packed form
18823B2285O676r94M820k628N327J193r821j0121q428j3416N192J0072j173L39
18809I323M552J0487j023K513K096J455j9133l778M659j235J631k534N779K1126
18795C5918J3221j1489p615k966M72Q103p761n477k623m398J555J6519j65J7550
18781E0844J2392L60j6603j9137q597K0652Q596j0478M894J7554K2439K1735R381
18768A14032J3361P014M436j7876k6474k2990j1838p294O74k175l326P931O723
18755F2198K110j5028k1327m779L202q15q997l481N115N025J5080O274l785k2648
18741A8144m791M035J2276J104O04R314Q925n724l935l069j2291J093r469J0798
18727B7014M408J407N25N957R184j1190j238k856J1767n244O125J531k063k351
$$ plain form
18713 42976 34550 26021 19606 25650 20149 19236 19034 26617 25172 32298 37367 33788 28373 19705 21798
18698 21798 26488 36202 49990 48006 34091 31872 39952 24600 11803 22178 26801 20550 19322
18685 19322 28317 28072 20784 26345 33968 41376 26733 21644 33735 29074 16736 25088 53791 61246
18671 61246 56715 58404 82446 87015 87994 89494 79381 57665 53007 59034 74717 86894 81850
18658 81850 87385 90146 89366 100110 117119 147643 172240 209454 270015 359180 466696 536833
18646 536833 572503 562894 503225 432031 366482 308108 262618 229644 209709 197102 203239 234750
18634 234750 257860 255554 243487 226957 208854 195193 164811 133251 113810 90513 82690 85506
18622 85506 97945 101439 96190 84754 72750 58292 59314 65939 79298 100704 116596 114730 108847
$$ packed form
18713D2976q426q529o415O044n501r13k02P583j445P126N069l579n415q668K093
18698B1798M690R714J3788j984j3915k219Q080j5352j2797J0375M623o251j228
18685A9322Q995k45p288N561P623P408j4643n089J2091m661j2338Q352K8703P455
18671F1246m531J689K4042M569R79J500j0113k1716m658O027J5683J2177n044
18658H1850N535K761p80J0744J7009L0524K4597L7214O0561Q9165J07516P0137
18646E36833L5670r609n9669p1194o5549n8374m5490l2974j9935j2607O137L1511
18634B34750K3110k306j2067j6530j8103j3661l0382l1560j9441k3297p823K816
18622H5506J2439L494n249j1436j2004j4458J022O625J3359K1406J5892j866n883
$$ plain form
18609 108847 106025 103286 111880 134994 169670 212589 226130 231241 221375 199924 177818 173114 190790
18596 190790 220171 254951 307776 378955 466303 572060 685384 744694 724659 645300 519399
18585 519399 403642 315559 267794 236508 208336 189056 191588 195328 172061 159727 148755 141342
18573 141342 135822 136205 139895 148613 150993 170093 166708 156207 131453 112834 109983 114701 120928
18560 120928 116015 115525 120476 134007 155206 175004 206969 246706 282034 325754 359141 387222
18548 387222 407060 430179 445828 464651 472169 461132 461805 477239 482166 477710 463434 461230 471721
18535 471721 499103 519186 539037 532340 532332 519212 492649 466256 456935 475141 499712 511604 520233
18522 520233 527069 520378 527963 550046 569772 579925 566483 553968 528288 507088 506940 520600
$$ packed form
18609A08847k822k739Q594K3114L4676M2919J3541N111r866k1451k2106m704J7676
18596A90790K9381L4780N2825P1179Q7348J05757J13324N9310k0035p9359j25901
18585E19399j15757q8083m7765l1286k8172j9280K532L740k3267j2334j0972p413
18573A41342n520L83L690Q718K380J9100l385j0501k4754j8619k851M718O227
18560A20928m913m90M951J3531K1199J9798L1965L9737L5328M3720L3387K8081
18548C87222J9838K3119J5649J8823P518j1037O73J5434M927m456j4276k204J0491
18535D71721K7382K0083J9851o697qj3120k6563k6393r321J8206K4571J1892Q629
18522E20233O836o691P585K2083J9726J0153j3442j2515k5680k1200j48J3660
$$ plain form
18510 520600 531654 524732 502659 465349 434236 403976 385079 377089 373605 367192 374995 413862
18498 413862 464929 529683 616472 748473 889046 1012358 1100416 1139732 1113789 1034694 935596
18487 935596 843229 766557 717178 702097 702394 705319 703601 715938 731330 749029 749983 758064 765764
18474 765764 761768 758921 755719 745264 745443 732191 722563 743566 753763 753692 726107 688142 668395
18461 668395 658350 676799 700181 697034 678407 666616 666915 683647 716733 740316 769864 780292
18449 780292 775464 762635 763994 752751 729549 725176 721699 703035 662584 617819 597000 594036
18437 594036 585605 588130 614169 666694 735642 759290 748310 715469 679441 663042 680186 734772
18425 734772 793910 824863 843019 874561 947089 1042963 1184608 1366189 1517802 1580229 1565075
$$ packed form
18510E20600J1054o922k2073l7310l1113l0260j8897p990l484o413P803L8867
18498D13862N1067O4754Q6789J32001J40573J23312Q8058L9316k5943p9095r9098
18487I35596r2367p6672m9379j5081K97K925j718J2337J5392J7699R54Q081P700
18474G65764l996k847l202j0455J79j3252r628K1003J0197p1k7585l7965j9747
18461F68395j0045J8449K3382l147j8627j1791K99J6732L3086K3583K9548J0428
18449G80292m828j2829J359j1243k3202m373l477j8664m0451m4765k0819k964
18437E94036q431K525K6039N2525O8948K3648j0980l2841l6028j6399J7144N4586
18425G34772N9138L0953J8156L1542P2528R5874J41645J81581J51613O2427j5154
$$ plain form
18414 1565075 1464033 1288554 1117870 973108 854928 762193 695191 635616 606769 595500
18404 595500 622066 660773 703901 729734 739972 720325 662186 588993 536239 482807 456809
18393 456809 444605 436470 426839 419533 423868 418042 421284 436943 468599 513886 567626 649822 716621
18380 716621 732804 744500 744533 781636 874512 1005167 1128152 1185486 1159661 1057042 930370
18369 930370 807090 722176 701167 707411 759244 833548 959314 1130987 1341644 1568971 1793675
18358 1793675 1960909 2006273 1918440 1711309 1443397 1183838 975487 818229 696495 614524
18348 614524 559650 503638 458660 409485 379884 357067 343961 349209 356216 363892 375470 371945
18336 371945 359899 361985 356862 342246 319270 301463 289954 286359 288934 278784 257495 232667
$$ packed form
18414A565075j01042j75479j70684j44762j18180r2735o7002n9575k8847j1269
18404E95500K6566L8707M3128K5833J0238j9647n8139p3193n2754n3432k5998
18393D56809j2204q135r631p306M335n826L242J5659L1656M5287N3740Q2196O6799
18380G16621J6183J1696L3L7103R2876J30655J22985N7334k5825j02619j26672
18369I30370j23280q4914k1009O244N1833P4304J25766J71673K10657K27327K24704
18358A793675J67234M5364q7833k07131k67912k59559k08351j57258j21734q1971
18348F14524n4874n6012m4978m9175k9601k2817j3106N248P007P676J1578l525
18336C71945j2046K086n123j4616k2976j7807j1509l595K575j0150k1289k4828
$$ plain form
18324 232667 231108 237339 243468 232413 218525 209462 220514 212819 190707 186005 168383 150956 150660
18311 150660 140292 141300 126508 129966 133635 115840 99334 94238 104280 127822 156176 174679
18299 174679 197526 203937 204478 194894 178500 164263 149756 137652 139433 160162 179535 195459
18287 195459 222449 250277 292999 344810 401282 451023 491549 521051 541825 575833 609684
18276 609684 638289 667690 675593 674952 678055 667108 658396 641011 608153 579514 559647 543530
18264 543530 511888 486669 482594 484677 472633 464966 464926 450013 431751 420765 429834 419312 423150
18251 423150 447245 469390 495622 529300 573224 602003 594873 563516 524277 486114 464846 439410
18239 439410 399707 381025 399099 433575 463856 475008 470632 443384 421536 407235 407078 394916
$$ packed form
18324B32667j559O231O129j1055j3888r063J1052p695k2112m702j7622j7427k96
18311A50660j0368J008j4792L458L669j7795j6506n096J0042K3542K8354J8503
18299A74679K2847O411N41r584j6394j4237j4507j2104J781K0729J9373J5924
18287A95459K6990K7828M2722N1811N6472M9741M0526K9502K0774L4008L3851
18276F09684K8605K9401P903o41L103j0947q712j7385l2858k8639j9867j6117
18264E43530l1642k5219m075K083j2044p667m0j4913j8262j0986R069j0522L838
18251D23150K4095K2145K6232L3678M3924K8779p130l1357l9239l8163k1268k5436
18239D39410l9703j8682J8074L4476L0281J1152m376k7248k1848j4301j57j2162
$$ plain form
18227 394916 398509 408738 435144 475317 528651 628748 764727 939526 1137266 1302037 1390708
18216 1390708 1375100 1305030 1200525 1095277 1036727 984396 941923 910080 872607 832121 808775
18205 808775 782944 770215 791767 810042 800410 797290 777565 772814 776361 783606 776875 766657 741026
18192 741026 704826 664862 622158 589327 569028 532689 507071 500258 493778 476273 480933 492975
18180 492975 518045 558958 612931 662536 696471 710304 711517 725420 716143 701733 703084 688446
18168 688446 692690 703505 727247 780719 843974 910618 991857 1083295 1170269 1228682 1259851 1282265
18156 1282265 1283895 1284488 1275838 1253020 1239179 1229465 1226867 1204795 1155264 1130787 1115373 1100929
18144 1100929 1099369 1082827 1051956 1035868 1024561 1028996 1027174 1004839 985734 968479 965982 969628
$$ packed form
18227C94916L593J0229K6406M0173N3334J00097J35979J74799J97740J64771Q8671
18216A390708j5608p0070j04505j05248n8550n2331m2473l1843l7473m0486k3346
18205H08775k5831j2729K1552J8275r632l120j9725m751L547P245o731j0218k5631
18192G41026l6200l9964m2704l2831k0299l6339k5618o813o480j7505M660J2042
18180D92975K5070M0913N3973M9605L3935J3833J213J3903r277j4410J351j4638
18168F88446M244J0815K3742N3472O3255O6644Q1239R1438Q6974N8413L1169K2414
18156A282265J630N93q650k2818j3841r714k598k2072m9531k4477j5414j4444
18144A100929j560j6542l0871j6088j1307M435j822k2335j9105j7255k497L646
$$ plain form
18132 969628 977793 996435 1033058 1057298 1085425 1117134 1151291 1200156 1251472 1326529 1423850 1549962
18120 1549962 1709756 1916985 2198352 2596000 3146815 3903279 5013862 6750962 9595875
18111 9595875 13977811 18907495 21330349 20583920 17943796 13570570 9698927 7255042
18103 7255042 5881205 5133832 4724932 4420407 4041455 3640213 3304051 3016363 2780639
18094 2780639 2579294 2419514 2288270 2186557 2123077 2071065 2018659 1973004 1937518 1894272
18084 1894272 1858686 1810659 1771030 1737126 1707874 1690493 1661547 1634327 1606235 1585612 1572502
18073 1572502 1558343 1545370 1537034 1554294 1586419 1618106 1642475 1663725 1678533 1711840 1724955
18062 1724955 1732259 1731612 1731263 1745967 1764741 1787686 1830718 1882231 1962391 2050700 2150492 2275474
$$ packed form
18132I69628Q165J8642L6623K4240K8127L1709L4157M8865N1316P5057R7321J26112
18120A549962J59794K07229K81367L97648N50815P56464J110583J737100K844913
18111I595875M381936M929684K422854p46429k640124m373226l871643k443885
18103G255042j373837p47373m08900l04525l78952m01242l36162k87688k35724
18094B780639k01345j59780j31244j01713o3480n2012n2406m5655l5486m3246
18084A894272l5586m8027l9629l3904k9252j7381k8946k7220k8092k0623j3110
18073A572502j4159j2973q336J7260L2125L1687K4369K1250J4808L3307J3115
18062A724955P304o47l49J4704J8774K2945M3032N1513Q0160Q8309R9792J24982
$$ plain form
18050 2275474 2432693 2599260 2769907 2954012 3124955 3333692 3590925 3912421 4298857
18041 4298857 4723223 5119022 5490915 5889411 6406045 7075589 7834021 8519669 9097082
18032 9097082 9657604 10340323 11364186 12789252 14531121 16729242 19591034 23087443
18024 23087443 26868337 30639545 34754620 39693419 45761764 52195585 57188731 60384563
18016 60384563 62829436 65302138 68093574 70129252 69973497 68023970 65483481 63088312
18008 63088312 60819171 58079041 54665644 51096180 48251135 46464959 44946467 42913076
18000 42913076 40439024 37886403 35943530 34878055 33916369 32330145 30180257 27702835
17992 27702835 25457814 23813222 22555212 21432505 20419895 19584961 19157260 19387298
$$ packed form
18050B275474J57219J66567J70647J84105J70943K08737K57233L21496L86436
18041D298857M24366L95799L71893L98496N16634O69544P58432O85648N77413
18032I097082N60522O82719J023863J425066J741869K198121K861792L496409
18024B3087443L780894L771208M115075M938799O068345O433821M993146L195832
18016F0384563K444873K472702K791436K035678j55755j949527k540489k395169
18008F3088312k269141k740130l413397l569464k845045j786176j518492k033391
18000D2913076k474052k552621j942873j065475r61686j586224k149888k477422
17992B7702835k245021j644592j258010j122707j012610q34934m27701K30038
$$ plain form
17984 19387298 20366030 21988144 23914974 25867117 27970242 30594967 34081336 38136022
17976 38136022 41691376 44228294 46245243 48515242 51904878 56406068 61422789 67228859
17968 67228859 74256578 82584781 92129610 102503109 113801192 126775556 141617264
17961 141617264 156776213 169907309 179413975 184906985 187619972 189508109 189941930 187668475
17953 187668475 181837117 171625249 158445418 144902007 131744323 119631241 108675659
17946 108675659 98397256 88966920 80498280 72568090 65516951 59700796 55232252 51884076
17938 51884076 48581755 44815413 40762319 36680298 33118889 30113461 27447410 25028017
17930 25028017 22837801 21005103 19636819 18689414 18062903 17622479 17237489 16849561 16493832
$$ packed form
17984A9387298R78732J622114J926830J952143K103125K624725L486369M054686
17976C8136022L555354K536918K016949K269999L389636M501190N016721N806070
17968F7228859P027719Q328203R544829J0373499J1298083J2974364J4841708
17961A41617264J5158949J3131096R506666N493010K712987J888137M33821k273455
17953A87668475n831358j0211868j3179831j3543411j3157684j2113082j0955582
17946A08675659j0278403r430336q468640p930190p051139n816155m468544l348176
17938E1884076l302321l766342m053094m082021l561409l005428k666051k419393
17930B5028017k190216j832698j368284r47405o26511m40424l84990l87928l55729
$$ plain form
17921 16493832 16349570 16614634 17483881 19190226 22107393 26714201 33350581 41323047
17913 41323047 48289331 51853233 51521156 48346780 44335152 41709169 41725580 44661818
17905 44661818 50625413 60071598 74038861 94619154 125027712 167479760 218193044
17898 218193044 266744092 303227833 317669526 304575845 269447522 222905946 176194954
17891 176194954 137624976 110893084 94151941 83624788 76546681 71421350 67919088
17884 67919088 66607687 68345767 73057666 78282806 79914813 76018679 67422350 56127540
17876 56127540 45191550 36735496 30967012 27179104 24552414 22433041 20488953 18747777
17868 18747777 17327652 16286544 15562024 15082394 14777927 14649368 14809518 15440215 16827672
$$ packed form
17921A6493832j44262K65064Q69247J706345K917167M606808O636380P972466
17913D1323047O966284L563902l32077l174376m011628k625983J6411K936238
17905D4661818N963595R446185J3967263K0580293L0408558M2452048N0713284
17898B18193044M8551048L6483741J4441693j3093681l5128323m6541576m6710992
17891A76194954l8569978k6731892j6741143j0527153p078107n125331l502262
17884F7919088j311401J738080M711899N225140J632007l896134q596329j1294810
17876E6127540j0935990q456054n768484l787908k626690k119373j944088j741176
17868A8747777j420125j041108p24520m79630l04467j28559J60150O30697J387457
$$ plain form
17859 16827672 19363306 23587567 29972555 37914447 44566415 46845651 44873488 39819867
17851 39819867 33678162 29074063 26944206 27183781 29661961 34561225 42422433 53350709
17843 53350709 65623258 76555002 86040431 95254972 102456329 103446661 96774547 83979879
17835 83979879 67500892 51919692 40380185 32844528 28110819 25019888 22674871 20515491
17827 20515491 18570949 17120628 16365512 16308136 16517404 16153750 14947808 13122200 10934277
17818 10934277 8948356 7484868 6493187 5823178 5369366 5003095 4627377 4256988 3906378
17809 3906378 3605890 3344630 3073845 2768371 2474703 2198267 1990336 1857080 1750931
17800 1750931 1674896 1599186 1524231 1445423 1354137 1284679 1213449 1164401 1135502 1105774 1075573
$$ packed form
17859A6827672K535634M224261O384988P941892O651968K279236j972163n053621
17851C9819867o141705m604099k129857K39575K478180M899264P861208J0928276
17843E3350709J2272549J0931744R485429R214541P201357R90332o672114j2794668
17835H3979879j6478987j5581200j1539507p535657m733709l090931k345017k159380
17827B0515491j944542j450321p55116n7376K09268l63654j205942j825608k187923
17818A0934277j985921j463488r91681o70009m53812l66271l75718l70389l50610
17809C906378l00488k61260k70785l05474k93668k76436k07931j33256j06149
17800A750931p6035p5710p4955p8808r1286o9458p1230m9048k8899k9728l0201
$$ plain form
17789 1075573 1048726 1012128 981146 970505 965642 937468 905746 889591 882157 859957 841552 815166
17777 815166 776015 739906 695234 641029 576230 528232 490440 480961 461049 447603 440244 413028
17765 413028 390644 387829 376915 349711 336122 334087 344144 347329 350511 365086 373933 359433
17753 359433 343212 346784 362737 377518 385204 378766 378643 398073 420361 431218 443975 452113 439651
17740 439651 431584 443686 464644 479978 477817 463882 439371 396532 361386 347886 343447 335182
17728 335182 320644 296984 268929 240021 217503 223098 233808 227254 220429 216557 212831 204416 193959
17715 193959 193989 184774 181047 187603 176251 169270 158760 134543 92489 69100 47247 12407 5306
17702 5306 5778 -8338 -16063 -9989 -19019 -27285 -8409 3984 9584 9107 4122 -11698 -14495 -5267
$$ packed form
17789A075573k6847l6598l0982j0641m863k8174l1722j6155p434k2200j8405k6386
17777H15166l9151l6109m4672n4205o4799m7998l7792r479j9912j3446p359k7216
17765D13028k2384k815j0914k7204j3589k035J0057L185L182J4575Q847j4500
17753C59433j6221L572J5953J4781P686o438j23J9430K2288J0857J2757Q138j2462
17740D39651q067J2102K0958J5334k161j3935k4511m2839l5146j3500m439q265
17728C35182j4538k3660k8055k8908k2518N595J0710o554o825l872l726q415j0457
17715A93959L0r215l727O556j1352o981j0510k4217m2054k3389k1853l4840p101
17702E306M72j4116p725O074r030q266J8876J2393N600m77m985j5820k797R228
$$ plain form
17688 -5267 16313 47361 65881 81184 86477 77069 63066 64622 66874 61777 47977 49333 57852
17675 57852 54147 39752 40852 51108 39881 45426 56408 57029 66169 61481 56060 47061 48397 37675
17661 37675 23209 12337 26793 48974 41709 40661 55420 56035 58788 51122 40545 28210 16286
17648 16286 4862 -16814 -33725 -68777 -99539 -105312 -117425 -129521 -148144 -162894 -164336 -147827
17636 -147827 -132584 -120917 -114938 -110039 -90315 -52547 -14608 27424 53865 78861 94554 100953
17624 100953 116031 133701 139508 141093 139846 145987 150702 156946 148782 131734 139989 136767 122164
17611 122164 100663 90819 95191 100768 95436 92964 87695 81653 64637 48653 50145 35927 21869
17598 21869 21598 6732 -12669 -30161 -46717 -69857 -107618 -129616 -145878 -131183 -127115 -122684
$$ packed form
17688e267K1580L1048J8520J5303N293r408j4003J556K252n097j3800J356Q519
17675E7852l705j4395J100J0256j1227N545J0982O21R140m688n421q999J336j0722
17661C7675j4466j0872J4456K2181p265j048J4759O15K753p666j0577j2335j1924
17648A6286j1424k1676j6911l5052l0762n773j2113j2096j8623j4750j442J6509
17636a47827J5243J1667N979M899J9724L7768L7939M2032K6441K4996J5693O399
17624A00953J5078J7670N807J585j247O141M715O244q164j7048Q255l222j4603
17611A22164k1501r844M372N577n332k472n269o042j7016j5984J492j4218j4058
17598B1869k71j4866j9401j7492j6556k3140l7761k1998j6262J4695M068M431
$$ plain form
17586 -122684 -137401 -179354 -217405 -238743 -273235 -317667 -367917 -443071 -524582 -600444 -650904
17575 -650904 -648658 -576594 -454641 -309103 -163157 -36509 50290 90394 114720 121919 115845
17564 115845 99693 92945 82872 65398 62148 56617 52992 75136 93329 109533 133216 132337 119310
17551 119310 119556 137976 158295 160206 148670 144063 128934 103402 104500 107711 107044 96833 63323
17538 63323 48176 34949 25758 13115 -1823 -11179 326 23562 28601 36611 46484 27785 3962
17525 3962 -11223 -37348 -32624 -40240 -75017 -99215 -108583 -106740 -104296 -75932 -25654 38627 91622
17512 91622 128437 162789 175292 185718 191496 198330 195893 201055 193680 198984 197940 210246 234734
17499 234734 267279 304499 331204 355601 393784 412874 447291 482999 502732 536241 551477
$$ packed form
17586a22684j4717m1953l8051k1338l4492m4432n0250p5154q1511p5862n0460
17575f50904K246P2064J21953J45538J45946J26648Q6799M0104K4326P199o074
17564A15845j6152o748j0073j7474l250n531l625K2144J8193J6204K3683q79j3027
17551A19310K46J8420K0319J911j1536m607j5129k5532J098L211o67j0211l3510
17538F3323j5147j3227r191j2643j4938r356J1505K3236N039Q010R873j8699k3823
17525C962j5185k6125M724p616l4777k4198r368J843K444K8364N0278O4281N2995
17512I1622L6815L4352J2503J0426N778O834k437N162p375N304j044J2306K4488
17499B34734L2545L7220K6705K4397L8183J9090L4417L5708J9733L3509J5236
$$ plain form
17488 551477 543923 549999 570433 581760 564998 553265 557534 591488 600330 606477 612689 615456 624154
17475 624154 628808 639189 645517 634559 621731 623937 614715 600696 584149 562440 532601 503140
17463 503140 485051 465749 454890 424110 380800 353653 331009 305933 284942 277404 273409 266678
17451 266678 271091 273874 270093 268811 273777 273992 294988 323134 345443 354218 349172 342392 348156 340794
17437 340794 335380 331100 345234 360802 374499 395865 409031 420219 424954 440564 472554 489967
17425 489967 509936 513971 514837 502954 489562 494898 499522 498254 492704 468542 465158 456404 434295
17412 434295 412125 391738 389193 387076 355265 329992 321185 291088 276518 270648 256288 254132
17400 254132 250895 237424 230863 234484 232023 217653 201338 195335 225677 266581 323385 414443
$$ packed form
17488E51477p554O076K0434J1327j6762j1733M269L3954Q842O147O212K767Q698
17475F24154M654J0381O328j0958j2828K206r222j4019j6547k1709k9839k9461
17463E03140j8089j9302j0859l0780m3310k7147k2644k5076k0991p538l995o731
17451B66678M413K783l781j282M966K15K0996K8146K2309Q775n046o780N764p362
17437C40794n414m280J4134J5568J3697K1366J3166J1188M735J5610L1990J7413
17425D89967J9969M035Q66j1883j3392N336M624j268n550k4162l384q754k2109
17412D34295k2170k0387k545k117l1811k5273q807l0097j4570n870j4360k156
17400B54132l237j3471o561L621k461j4370j6315o003L0342M0904N6804R1058
$$ plain form
17388 414443 520639 612970 633885 613846 573082 530175 531288 573784 628266 670744 690937
17377 690937 680715 651457 620213 605355 618574 651774 690541 689147 644500 570974 480461 386541
17365 386541 319702 254948 231094 211979 214574 234146 232951 236555 254222 287357 299762 298484
17353 298484 278219 249445 211735 175918 154209 142616 137036 138028 146909 146142 149577 163075 177054
17340 177054 201303 260356 330665 390023 446309 481744 481299 452377 437948 465125 537366 630419
17328 630419 687020 681316 622221 531452 434708 351131 286214 255022 249904 248877 261346 294038
17316 294038 326432 365656 413450 460895 503031 529228 526065 481270 436706 392610 338933 285444
17304 285444 239910 195413 166953 139778 130363 116963 118994 105891 92920 79275 67942 53750
$$ packed form
17388D14443J06196R2331K0915k0039m0764m2907J113M2496N4482M2478K0193
17377F90937j0222k9258l1244j4858J3219L3200L8767j394m4647p3526r0513r3920
17365C86541o6839o4754k3854j9115K595J9572j195L604J7667L3135J2405j278
17353B98484k0265k8774l7710l5817k1709j1593n580R92Q881p67L435J3498J3979
17340A77054K4249N9053P0309N9358N6286L5435m45k8922j4429K7177P2241R3053
17328F30419N6601n704n9095r0769r6744q3577o4917l1192n118j027J2469L2692
17316B94038L2394L9224M7794M7445M2136K6197l163m4795m4564m4096n3677n3489
17304B85444m5534m4497k8460k7175r415j3400K031j3103j2971j3645j1333j4192
$$ plain form
17292 53750 50492 48220 49995 52888 42340 36079 25531 22637 33125 24843 18954 21704 10744
17279 10744 8636 3070 11280 15628 18027 19615 25611 27212 44891 35846 17980 25765 38154 38061
17265 38061 32123 27985 40791 32513 25341 14478 6837 6111 9473 7196 6030 13680 22108 31017
17251 31017 31344 42660 36425 22788 11870 15005 27442 22155 23155 21893 11050 4317 8910
17238 8910 15222 7655 1327 -5539 1460 13661 19857 23425 23521 20889 15748 5837 -3172 8440 21146
17223 21146 15524 11006 16430 25858 18413 13138 11783 721 -8741 -2073 18194 10016 -999 4367
17209 4367 3807 14581 13937 12715 4110 992 -3094 -4243 6970 15470 2342 3186 19837 30492
17195 30492 12912 -11992 -9555 -9654 -4609 -2353 -14535 -16174 -16298 -17863 -20789 -20018 -13893 -4623 935
$$ packed form
17292E3750l258k272J775K893j0548o261j0548k894J0488q282n889K750j0960
17279A0744k108n566Q210M348K399J588N996J601J7679r045j7866P785J2389r3
17265C8061n938m138J2806q278p172j0863p641p26L362k277j166P650Q428Q909
17251C1017L27J1316o235j3637j0918L135J2437n287J000j262j0843o733M593
17238H910O312p567o328o866O999J2201O196L568R6k632n141r911r009J1612J2706
17223B1146n622m518N424R428p445n275j355j1062r462O668K0267q178j1015N366
17209D367n60J0774o44j222q605l118m086j149J1213Q500j3128Q44J6651J0655
17195C0492j7580k4904K437r9N045K256j2182j639j24j565k926P71O125R270N558
$$ plain form
17180 935 10320 17500 15235 15350 19559 12155 2564 -1522 -10097 -8129 3836 8564 4168 -5034 -1525
17165 -1525 19460 31025 26214 19020 12336 14797 18912 20785 14842 8707 3575 -3873 -579 3241
17151 3241 954 -301 10341 14832 5960 7030 -279 7970 -3097 -21038 -10512 8532 19330
17138 19330 10848 7507 17966 19628 26166 19710 10103 7297 7973 17367 5004 -7513 -15184 -968
17124 -968 5482 3744 -14748 -25256 -5042 4700 6003 -3028 -13485 -8801 3578 1028 -20564
17111 -20564 -5970 -4905 -22776 -19073 -11551 -1934 -4637 -8279 -5488 -7624 -14135 -17471 -16500 -16528 -7031
17096 -7031 7882 -4835 -13977 -15759 -10182 -2196 3492 7035 7422 30060 38690 28347 23015 23748
17082 23748 23873 10925 -976 -11223 -14584 -8357 -8807 -4919 -12741 -23976 -23148 -18483 -3269 -1856
$$ packed form
17180I35R385P180k265J15M209p404r591m086q575J968J1965M728m396r202L509
17165a525K0985J1565m811p194o684K461M115J873n943o135n132p448L294L820
17151C241k287j255J0642M491q872J070p309Q249j1067j7941J0526J9044J0798
17138A9330q482l341J0459J662O538o456r607k806O76R394j2363j2517p671J4216
17124i68O450j738j8492j0508K0214R742J303r031j0457M684J2379k550k1592
17111b0564J4594J065j7871L703P522R617k703l642K791k136o511l336R71k8R497
17096g031J4913j2717r142j782N577P986N688L543L87K2638Q630j0343n332P33
17082B3748J25j2948j1901j0247l361O227m50L888p822j1235Q28M665J5214J413
$$ plain form
17068 -1856 1538 -5311 -4108 -2040 -12621 -14080 -21931 -18664 -617 3671 -336 1537 -5497 -803
17054 -803 2724 5963 10226 12395 16462 15739 19410 12227 1371 -1885 -4808 -1401 12857 15440 259
17039 259 -2355 -5273 -27203 -31524 -34757 -18107 -13604 -717 1810 2320 4349 861 -9004 -8966 -6652
17024 -6652 -2987 -1728 -5865 -13416 -17077 -8327 -8046 -8717 -25154 -25165 -25635 -19398 -6865 -1066 -2432
17009 -2432 -1953 4570 -1474 3796 2234 -5461 2334 1617 -4678 -7126 -11732 1813 11382 7856 -6124
16994 -6124 -519 5689 -8460 -13023 -8574 -6926 -5684 -12969 -2649 1618 -2039 -20010 -26919 -13553
16980 -13553 -897 -3016 -11031 -19384 -26344 -15466 -8794 -20322 -24055 -16348 118 -2399 -13292
16967 -13292 -7105 -10218 -21199 -20400 -12945 -14208 -9360 -9366 -11650 -7880 -14930 -19741 -17730 -17898 -19142
$$ packed form
17068a856L394o849J203K068j0581j459p851L267J8047M288m007J873p034M694
17054h03L527L239M263K169M067p23L671p183j0856l256k923L407J4258K583j5181
17039B59k614k918k1930m321l233J6650M503J2887K527N10K029l488r865L8K314
17024f652L665J259m137p551l661Q750K81o71j6437j1m70O237J2533N799j366
17009b432M79O523o044N270j562p695P795p17o295k448m606J3545R569l526j3980
16994f124N605O208j4149m563M449J648J242p285J0320M267l657j7971o909J3366
16980a3553J2656k119q015q353o960J0878O672j1528l733P707J6466k517j0893
16967a3292O187l113j0981P99P455j263M848ok284L770p050m811K011j68j244
$$ plain form
16952 -19142 -22007 -12147 -7548 3308 4868 4539 -815 8334 19659 13035 894 -4796 4814 10783
16938 10783 6898 5981 20895 32441 25020 24048 13846 11487 9783 12949 1769 -10171 -12350 -11864
16924 -11864 -11309 -17036 -1144 11846 6306 10182 8171 -397 -4394 512 12720 7856 -5098 -8351
16910 -8351 -9720 -25848 -22710 -24719 -15501 -20025 -23014 -23171 -25018 -14309 -2047 2928 -3486 -331
16896 -331 2752 -9788 -12776 2015 -6044 -4120 20333 20362 16141 10241 8364 11747 6504 2286 1147
16881 1147 -412 -1834 -2955 -666 -628 8460 7575 5162 4800 8645 6172 2614 2340 12240 -8037 -14951
16865 -14951 -12055 -9305 -11746 -21698 -24085 -14819 2020 10172 15048 7603 -7003 -8400 -13273 -7169
16851 -7169 -1476 8501 -1965 -6333 -781 4891 9495 -7844 4797 21889 20892 12413 7597 8979
$$ packed form
16952a9142k865R860M599J0856J560l29n354R149J1325o624j2141n690R610N969
16938A0783l885r17J4914J1546p421r72j0202k359j704L166j1180j1940k179M86
16924a1864N55n727J5892J2990n540L876k011q568l997M906J2208m864j2954l253
16910h351j369j6128L138k009R218m524k989j57j847J0709J2262M975o414L155
16896c31L083j2540k988J4791q059J924K4453K9m221n900j877L383n243m218j139
16881A147j559j422j121K289L8R088q85k413l62L845k473l558k74R900k0277o914
16865a4951K896K750k441r952k387R266J6839Q152M876p445j4606j397m873O104
16851g169N693R977j0466m368N552N672M604j7339J2641J7092r97q479m816J382
$$ plain form
16837 8979 -12594 -20247 -22571 -6476 2652 -1233 -1215 -577 -2316 -4175 -2714 96 1495 8173 11862
16822 11862 16646 13838 9615 5511 12374 -343 -3545 -5157 3973 -2899 -3132 -339 -3255 -10569
16808 -10569 -18116 -15315 -15842 -25071 -29925 -28262 -22583 -6350 -3327 -6618 -18123 -12101 -4166 -1459
16794 -1459 9268 6827 -4599 -1892 932 2844 6543 13413 22109 18424 13884 574 -20134 -20032
16780 -20032 -18322 -15172 704 15809 15434 6978 7224 -3401 -4921 -1908 -6147 -12662 -12570 -12477 -11932
16765 -11932 -3977 3902 12103 17777 19156 10342 6725 -5587 -15988 -19840 -23118 -21690 -25765 -28398
16751 -28398 -28982 -11234 -15583 -22520 -18189 -15391 -385 11687 14502 7818 3250 4475 -11227 -22606
16737 -22606 -24415 -24478 -31898 -21563 -10651 -10201 -7175 -3679 7125 2325 -9300 -28685 -19656 -18508
$$ packed form
16837H979k1573p653k324J6095R128l885J8O38j739j859J461K810J399O678L689
16822A1862M784k808m223m104O863j2717l202j612R130o872k33K793k916p314
16808a0569p547K801n27r229m854J663N679J6233L023l291j1505O022P935K707
16794a459J0727k441j1426K707K824J912L699O870Q696l685m540j3310k0708J02
16780b0032J710L150J5876J5105l75q456K46j0625j520L013m239o515R2R3N45
16765a1932P955P879Q201N674J379q814l617j2312j0401l852l278J428m075k633
16751b8398n84J7748m349o937M331K798J5006J2072K815o684m568J225j5702j1379
16737b2606j809o3p420J0335J0912M50L026L496J0804m800j1625j9385R029J148
$$ plain form
16723 -18508 -17977 -14482 -27446 -26315 -17881 -8786 -16290 -22420 -30902 -16565 10104 7721 1624 -7607
16709 -7607 -9428 -16387 -22670 -16087 -18645 -10932 -3612 4367 5031 3776 7277 12828 9883 3606 -10010
16694 -10010 -8170 -4537 2360 -845 -7260 -22379 -33477 -7881 3882 -5879 -4893 -562 6279 4089
16680 4089 -600 -3033 -12467 -5260 -10484 -11105 -17142 -28441 -29106 -30348 -20596 -19687 -14510 6393 4348
16665 4348 8084 12150 10255 -4307 -21565 -21062 -15730 -8796 -4123 -8581 -5071 -11989 -12232 -6035 -8380
16650 -8380 -21611 -17824 -24725 -11854 -14963 -2361 -3392 -437 -2826 -14764 -14611 -11074 -8205 -1246
16636 -1246 4339 3636 3167 -3774 742 2490 10815 17240 1987 -12200 -8563 -8011 -8676 -16453 -12265
16621 -12265 -20182 -26711 -32516 -34421 -32999 -36671 -27835 -26648 -22535 -18141 -23103 -28360 -11570 -14707
$$ packed form
16723a8508N31L495j2964J131Q434R095p504o130q482J4337K6669k383o097r231
16709g607j821o959o283O583k558P713P320P979O64j255L501N551k945o277j3616
16694a0010J840L633O897l205o415j5119j1098K5596J1763r761R86M331O841k190
16680D089m689k433r434P207n224o21o037j1299o65j242R752R09N177K0903k045
16665D348L736M066j895j4562j7258N03N332O934M673m458L510o918k43O197k345
16650h380j3231L787o901J2871l109J2602j031K955k389j1938J53L537K869O959
16636a246N585p03m69o941M516J748Q325O425j5253j4187L637N52o65p777M188
16621a2265p917o529n805j905J422l672Q836J187M113M394m962n257J6790l137
$$ plain form
16607 -14707 -24448 -29636 -8435 9207 15142 15220 8977 -1540 -4127 2051 -1605 -4764 8275 -6533
16593 -6533 -19155 -7947 9204 13379 17108 881 -12073 -13611 -6643 -6239 -2782 2055 7812 -812
16579 -812 -340 643 6457 17755 22497 10843 -2961 -15349 -24362 -24044 -13692 -4526 -5007 4196 18507
16564 18507 9075 9129 7468 4570 -3403 -9930 -4418 -15750 -10055 -12870 -20881 -9949 4880 1792
16550 1792 -2574 -5934 1778 7713 6645 12543 18328 21471 13064 16274 23060 14656 15518 3834 1653
16535 1653 15825 9173 9582 9354 13931 14585 17409 20203 11962 4774 -1584 1852 7281 3248 7422
16520 7422 15715 7367 4324 -2674 -13242 -22968 -15704 -8741 -11429 -10252 -3117 -7065 -20785 -18015
16506 -18015 -12029 -527 6843 9609 3783 -4010 979 -4791 8525 17984 3538 -4856 6583
$$ packed form
16607a4707r741n188K1201J7642N935P8o243j0517k587O178l656l159J3039j4808
16593f533j2622J1208J7151M175L729j6227j2954j538O968M04L457M837N757q624
16579h12M72R83N814J1298M742j1654j3804j2388r013L18J0352R166m81R203J4311
16564A8507r432N4j661k898p973o527N512j1332N695k815q011J0932J4829l088
16550A792m366l360P712N935j068N898N785L143q407L210O786q404Q62j1684k181
16535A653J4172o652M09k28M577O54K824K794q241p188o358L436N429m033M174
16520G422Q293q348l043o998j0568r726P264O963k688J177P135l948j3720K770
16506a8015N986J1502P370K766n826p793M989n770J3316R459j4446q394J1439
$$ plain form
16493 6583 7769 501 -6020 1146 722 -7047 -7121 449 -1241 1980 -7153 -15216 -13580 -1023 12075
16478 12075 15389 13817 570 -10921 -15108 -4794 3961 12267 9650 -2 6475 -1192 -9767 -4852
16464 -4852 -12578 -515 9060 -8641 -7641 2653 -6265 -5042 -113 5960 4939 -1449 -4917 -7219
16450 -7219 -5731 -4126 -3410 -6644 -11263 -9653 -4781 8515 15598 6884 616 1204 212 -13550 -6496
16435 -6496 -11989 -8451 -8182 -13989 -21354 -22897 -19407 -9451 -6363 -19016 -13138 -9990 -17012 -18933 -8125
16420 -8125 -15188 -17482 -14607 -3998 55 1679 -5145 -13942 -20660 -18560 -8966 3621 11754 12891
16406 12891 -864 -1653 9293 14885 8235 -7956 -19355 -12779 -12455 -8609 -16687 -9788 -11978 -16626
16392 -16626 -8174 -1069 -7721 -17749 -15358 1544 10073 8062 9378 9109 -7117 -2915 2639 -3164
$$ packed form
16493F583J186p268o521P166m24p769p4P570j690L221r133q063J636J2557J3098
16478A2075L314j572j3247j1491m187J0314Q755Q306k617r652O477p667q575M915
16464d852p726J2063R575j7701J000J0294q918J223M929O073j021o388l468k302
16450g219J488J605P16l234m619J610M872J3296P083q714o268N88r92j3762P054
16435f496n493L538K69n807p365j543L490R956L088j2653N878L148p022j921J0808
16420h125p063k294K875J0609M053J624o824q797o718K100R594J2587Q133J137
16406A2891j3755p89J0946N592o650j6191j1399O576L24L846q078O899k190m648
16392a6626Q452P105o652j0028K391J6902Q529k011J316k69j6226M202N554n803
$$ plain form
16378 -3164 1106 3342 2632 10715 14294 8281 8955 12785 11525 1307 15623 10146 -2636 -18517
16364 -18517 -16115 -16946 -18419 -18627 -12793 -5089 -3589 -6851 -3381 -4066 4526 6519 16793 12951 4218
16349 4218 7795 13780 16185 4150 -5078 -3215 -2633 -6996 -6803 -7805 -10354 -6411 -2579 -7806 -9139
16334 -9139 -1188 -21207 -23689 -26420 -15172 -895 -8406 -22477 -28751 -32384 -34218 -24155 -4477
16321 -4477 12936 22099 11213 -5919 1997 13415 1594 -20791 -27041 -13342 1901 4903 -4486
16308 -4486 -2386 3225 -4713 -21300 -17884 -11773 -20625 -18537 -19014 -19250 -15072 -8890 -7174 -12851 -6066
16293 -6066 1681 5299 5375 9561 17450 12423 -5258 -8957 -10836 -3526 -3138 2771 -60 -6846 -12662
16278 -12662 -17870 -8149 -9465 -9459 3786 -4072 8663 7251 13814 17930 23960 7430 -11065 -24952
$$ packed form
16378c164M270K236p10Q083L579o013O74L830j260j0218J4316n477j2782j5881
16364a8517K402q31j473k08N834P704J500l262L470o85Q592J993J0274l842q733
16349D218L577N985K405j2035r228J863N82m363J93j002k549L943L832n227j333
16334i139P951k0019k482k731J1248J4277p511j4071o274l633j834J0063J9678
16321d477J7413R163j0886j7132P916J1418j1821k2385o250J3699J5243L002r389
16308d486K100N611p938j6587L416O111q852K088m77k36M178O182J716n677O785
16293f066P747L618P6M186P889n027j7681l699j879P310L88N909k831o786n816
16278a2662n208R721j316OJ3245p858J2735j412O563M116O030j6530j8495j3887
$$ plain form
16264 -24952 -22340 -12049 -20158 -27288 -25675 -33307 -26824 -23247 -11658 -17421 -10650 -10315 -13402 -16726
16250 -16726 -23282 -20644 -12382 -9755 1274 8442 -1493 -12189 -12463 -15786 -17170 -14148 -7066 1609
16236 1609 -3546 -6332 -3312 -1591 3679 15422 19590 22325 15043 15480 14952 14589 -426 -2769 1336
16221 1336 -12949 -15824 -15722 -2080 -1081 13739 13153 -2638 -17495 -20029 -13954 -18766 -21946 -9899
16207 -9899 -4893 -10211 8890 2161 -7228 -7945 1791 3822 4386 -1430 7955 6727 -2430 -5937 -6848
16192 -6848 7067 15082 13601 -322 -20011 -24342 -7001 -6021 -2922 -7136 3290 8423 6847 -12497
16178 -12497 -14654 -9836 -6085 -11765 -9537 -1599 -1825 -18547 -7636 2816 -4603 -13738 -23092 -18984
16164 -18984 -11103 -2139 -451 -748 3511 664 3565 7742 -68 -13474 -14975 -6666 10170 20243
$$ packed form
16264b4952K612J0291q109p130J613p632O483L577J1589n763O771L35l087l324
16250a6726o556K638Q262K627J1029P168r935j0696k74l323j384L022P082Q675
16236A609n155k786L020J721N270J1743M168K735p282M37n28l63j5015k343M105
16221A336j4285k875J02J3642R99J4820n86j5791j4857k534O075m812l180J2047
16207i899N006n318J9101o729r389p17R736K031N64n816R385j228r157l507r11
16192f848J3915Q015j481j3923j9689m331J7341R80L099m214J0426N133j576j9344
16178a2497k157M818L751n680K228P938k26j6722J0911J0452p419r135r354M108
16164a8984P881Q964J688k97M259k847K901M177p810j3406j501Q309J6836J0073
$$ plain form
16150 20243 -1502 -17350 -15362 1900 8284 113 -12261 -10810 -32 2553 2248 -11777 -3292
16137 -3292 -7794 -1438 15458 23192 18491 3471 -4239 -11958 -19971 -11063 -12576 -17744 -30109 -28957
16123 -28957 -29852 -26039 -21400 -19730 -5093 18082 25691 10100 -1013 92 1565 4911 9729 11805
16109 11805 12801 9154 -10505 -4407 14612 21872 4334 -179 -2121 3873 -9466 -4568 6066
16096 6066 6437 -1316 831 11456 13903 -3833 -9599 -11580 3374 5628 488 -1163 -7015 -18247
16082 -18247 -20776 -14757 -8803 -5295 3556 3216 -54 -1493 8718 13776 17667 2696 -16661 -17590
16068 -17590 -4254 -5999 -14021 -10324 -1707 -6305 -2247 12527 15879 5798 -6869 -6906 -1784 -11898
16054 -11898 -10545 -6262 7184 1339 6713 11407 7015 13779 10166 15498 17695 12454 1064 -16602
$$ packed form
16150B0243k1745j5848J988J7262O384q171j2374J451J0778K585l05j4025Q485
16137c292m502O356J6896P734m701j5020p710p719q013Q908j513n168j2365J152
16123b8957q95L813M639J670J4637K3175P609j5591j1113J105J473L346M818K076
16109A1805R96l647j9659O098J9019P260j7538m513j942N994j3339M898J0634
16096F066L71p753K147J0625K447j7736n766j981J4954K254n140j651n852j1232
16082a8247k529O019N954L508Q851l40l270j439J0211N058L891j4971j9357r29
16068a7590J3336j745q022L697Q617m598M058J4774L352j0081j2667l7N122j0114
16054a1898J353M283J3446n845N374M694m392O764l613N332K197n241j1390j7666
$$ plain form
16040 -16602 -7360 10264 13587 9250 418 -20005 -32333 -28878 -21338 -1918 3225 -4047 609
16027 609 -15383 -22988 -13605 -16575 -16471 -17379 -17488 -15479 -12036 -1946 -5390 -8430 432 -6622 -21826
16012 -21826 -8494 -334 -2694 -639 11808 2644 1508 -4326 -5900 -12190 -16808 -27496 -24870 -19722
15998 -19722 -4456 -14710 -24660 -18245 -18315 -22259 -25783 -18527 -15676 -26708 -24983 -11440 1372 -926
15984 -926 -5363 -1265 -4646 -3085 -5165 -169 -5986 -1876 4410 1555 15949 19169 10929 7537 4450
15969 4450 1556 2726 5145 -744 -5127 -6884 1737 -706 -11911 -7730 -9188 -8972 -12951 -16686 -7263
15954 -7263 -13640 -5348 -7314 -12671 -1674 2341 -1456 -5937 -3716 -7795 -18178 -20770 -17671 -15016
15940 -15016 -8708 -5508 1756 -1296 939 -282 -1249 -4170 -9308 -8018 -907 5368 7802 -5258
$$ packed form
16040a6602R242J7624L323m337q832k0423j2328L455P540J9420N143p272M656
16027F09j5992p605R383k970J04r08j09K009L443J0090l444l040Q862p054j5204
16012b1826J3332Q160k360K055J2447r164j136n834j574o290m618j0688K626N148
15998a9722J5266j0254r950O415p0l944l524P256K851j1032J725J3543J2812k298
15984i26m437M098l381J561k080M996n817M110O286k855J4394L220q240l392l087
15969D450k894J170K419n889m383j757Q621k443j1205M181j458K16l979l735R423
15954g263o377Q292j966n357J0997M015l797m481K221m079j0383k592L099K655
15940a5016O308L200P264l052K235j221r67k921n138J290P111O275K434j3060
$$ plain form
15926 -5258 -17199 -20505 -1248 11238 6254 17922 6146 -9237 -12861 -9784 -3353 -2690 42
15913 42 804 -5913 -5443 -5193 -11406 -9056 -11132 -10808 -11464 -6252 -4017 -4184 3258 -817 -15180 -13710
15897 -13710 -14884 -19126 -29583 -27090 -7001 9714 15729 -8470 -14236 5612 1880 -11647 -14561
15884 -14561 -11736 -20049 -13167 -9204 -3517 3724 16005 15926 3295 6726 18000 18070 8175 15193 10036
15869 10036 -3054 -5640 3319 6539 -19089 -16016 -12453 -4409 4319 2589 5227 -2243 -21681 -31903
15855 -31903 -27417 -15464 -17333 -31988 -33511 -27156 -28428 -20428 -15728 -12087 -14392 -19936 -30584 -42076
15841 -42076 -31484 -26717 -20119 -13000 -17539 -19844 -22992 -14556 -2957 -2584 -13663 -15822 3456 -1783
15827 -1783 -19375 -7796 -9208 -6683 -10323 -8266 1211 2088 -1330 11972 24101 21732 17188 13419
$$ packed form
15926e258j1941l306J9257J2486m984J1668j1776j5383l624L077O431O63K732
15913D2P62o717M70K50o213K350k076L24o56N212K235j67P442m075j4363J470
15897a3710j174m242j0457K493K0089J6715O015k4199n766J9848l732j3527k914
15884a4561K825q313O882L963N687P241J2281p9j2631L431J1274P0r895P018n157
15869A0036j3090k586Q959L220k5628L073L563Q044Q728j730K638p470j9438j0222
15855c1903M486J1953j869j4655j523O355j272Q000M700L641k305n544j0648j1492
15841d2076J0592M767O598P119m539k305l148Q436J1599L73j1079k159J9278n239
15827a783j7592J1579j412K525l640K057R477Q77l418J3302J2129k369m544l769
$$ plain form
15813 13419 7425 1262 -11396 -13119 -17078 -6116 -1837 1068 8702 6762 14433 14582 10647 -4263
15799 -4263 -21033 -29370 -23975 -9390 -8127 66 12594 12348 4173 4187 17176 12557 3119 13155
15785 13155 26529 20407 13016 5510 13530 19025 11113 13555 12100 9376 356 -4181 -774 1835
15771 1835 3481 6732 6633 6640 3237 9178 19271 30052 35566 29655 19822 13502 15062 18493 7635
15756 7635 441 -13454 -16418 3900 10388 2523 -14388 -11820 3034 -5891 -9234 -11172 -2571 1769
15742 1769 -18475 -14887 -18124 -13908 -15618 -14568 -6264 6347 5581 9897 11194 10500 7935 -7297
15728 -7297 6654 23260 31133 15176 4883 7030 11862 19605 13863 5017 7121 2763 4279 7316
15714 7316 -987 -7191 2710 4811 11932 20507 26804 35101 28391 25012 20410 8593 -16188 -11718
$$ packed form
15813A3419n994o163j2658j723l959J0962M279K905P634j940P671J49l935j4910
15799d263j6770q337N395J4585J263Q193J2528k46q175J4J2989m619r438J0036
15785A3155J3374o122p391p506Q020N495p912K442j455k724r020m537L407K609
15771A835J646L251r9Pl403N941J0093J0781N514n911r833o320J560L431j0858
15756G635p194j3895k964K0318O488p865j6911K568J4854q925l343j938Q601M340
15742A769k0244L588l237M216j710J050Q304J2611p66M316J297o94k565j5232
15728g297J3951J6606P873j5957j0293K147M832P743n742q846K104m358J516L037
15714G316q303o204R901K101P121Q575O297Q297o710l379m602j1817k4781M470
$$ plain form
15700 -11718 -743 425 -8606 -9994 5829 19876 16855 6550 4766 4812 21861 27684 25047 3285
15686 3285 -6517 -5446 -3708 -2583 10132 2483 7408 17242 19608 7441 -1071 -2912 -2257 2608
15672 2608 9254 8068 12608 8634 -2619 2578 -8060 -11080 -6502 14367 23425 23638 12910 3925
15658 3925 -5098 -5487 -5851 -319 -5506 762 15763 12831 9891 -1105 -2807 -3875 -1685 1115 -3777
15643 -3777 -6392 1007 -2503 1421 1043 7059 17914 30467 25208 -653 1496 13800 7659 1248
15629 1248 -4401 -2818 -669 -2338 -892 125 2725 -393 2295 5928 9572 822 -23282 -23215 -4184
15614 -4184 6075 -5023 -8947 4546 5130 15278 10805 4247 9671 9018 2143 5869 18294 12360
15600 12360 -4773 -2115 19172 30749 22754 -1599 -20808 -20508 -7909 -16232 -12760 -14460 -19796
$$ packed form
15700a1718J0975J168r031j388J5823J4047l021j0305j784M6J7049N823k637k1762
15686C285r802J071J738J125J2715p649M925R834K366j2167q512j841O55M865
15672B608O646j186M540l974j1253N197j0638l020M578K0869R058K13j0728q985
15658C925r023l89l64N532n187O268J5001k932k940j0996j702j068K190K800m892
15643c777k615P399l510L924l78O016J0855J2553n259k5861K149J2304o141o411
15629A248n649J583K149j669J446J017K600l118K688L633L644q750k4104O7J9031
15614d184J0259j1098l924J3493N84J0148m473o558N424o53o875L726J2425n934
15600A2360j7133K658K1287J1577p995k4353j9209L00J2599q323L472j700n336
$$ plain form
15587 -19796 -24399 -12596 -8339 994 9841 2799 3929 2106 3065 723 -3879 -1982 -257 -6091
15573 -6091 -8211 -9555 -14497 -27249 -11964 10306 4518 -6027 -10956 -5086 -4900 -1991 -5256 -10569
15559 -10569 -12283 -2132 12266 8886 -1044 2270 -172 -3651 -8665 -23438 -31062 -27973 -25982 -23241
15545 -23241 -19660 -9884 3726 -4228 -1168 -1333 -10117 -21454 -30481 -19342 -20168 -41706 -46294 -37886
15531 -37886 -15574 -3910 -1503 -2066 -4017 -6301 -4553 -4078 -7674 -3400 -6304 -5650 8213 17126
15517 17126 14410 9974 14240 5243 -3218 -1462 -4926 -2529 -1630 -4941 -11264 -8628 -17563 -29300
15503 -29300 -18058 -7143 2260 19559 9734 11016 10964 6474 -4785 -7587 1304 4419 4207 -3282
15489 -3282 -9957 -15904 -32665 -30330 -19124 -10272 513 1536 10819 10591 11562 11047 7724 -2047 -7489
$$ packed form
15587a9796m603J1803M257R333Q847p042J130j823R59k342m602J897J725n834
15573f091k120j344m942j2752J5285K2270n788j0545m929N870J86K909l265n313
15559a0569j714J0151J4398l380r930L314k442l479n014j4773p624L089J991K741
15545b3241L581R776J3610p954L060j65q784j1337r027J1139q26k1538m588Q408
15531c7886K2312J1664K407n63j951k284J748M75l596M274k904O54J3863Q913
15517A7126k716m436M266q997q461J756l464K397Q99l311o323K636q935j1737
15503b9300J1242J0915R403J7299r825J282n2m490j1259k802Q891L115k12p489
15489c282o675n947j6761K335J1206Q852J0785J023R283k28R71n15l323r771n442
$$ plain form
15474 -7489 -9843 2853 19539 25284 14312 212 -2319 -15320 -26206 -16255 -7551 4332 15747
15461 15747 28728 25242 25173 13756 4527 -13789 -19715 -9396 2652 7237 9085 5360 4844 -2868
15447 -2868 -2158 18541 5082 7600 7994 -13223 -19434 -10909 5511 1104 363 19187 34129 36117
15433 36117 38494 38340 32958 27024 19717 11752 -7142 -4033 3982 5000 20952 25378 6361 484
15419 484 1825 -274 -1474 -3776 4417 5319 -2938 1668 2272 -3408 5445 8616 641 -3765 -5089
15404 -5089 -3196 905 8032 13295 12551 15876 14315 10764 -1004 -13274 -10848 -10885 -10432 -2311 3185
15389 3185 14118 27284 20873 19423 13453 5648 -4675 -12425 -12003 -4632 9543 12544 7036 4777
15375 4777 -2448 2569 1846 7521 11449 22353 6626 -2825 2677 6884 12230 5872 4253 12360
$$ packed form
15474g489k354J2696J6686N745j0972j4100k531j3001j0886R951Q704J1883J1415
15461A5747J2981l486o9j1417r229j8316n926J0319J2048M585J848l725n16p712
15447b868P10K0699j3459K518L94k1217o211Q525J6420m407p41J8824J4942J988
15433C6117K377j54n382n934p307p965j8894L109Q015J018J5952M426j9017n877
15419D84J341k099j200k302Q193R02q257M606O04n680Q853L171p975m406j324
15404e089J893M101P127N263p44L325j561l551j1768j2270K426l7M53Q121N496
15389C185J0933J3166o411j450n970p805j0323p750M22P371J4175L001n508k259
15375D777p225N017p23N675L928J0904j5727r451N502M207N346o358j619Q107
$$ plain form
15361 12360 4843 8293 21135 15614 2441 -7872 -3404 1711 -2795 -11866 -19171 -18968 -19605 -15983
15347 -15983 -9414 -4746 -14778 -20163 -20988 -10551 -5441 -25794 -20013 -12383 -9657 -13336 -17789 -3011
15333 -3011 1057 -9221 -10139 -8953 -8402 2123 -13640 -30344 -29611 -26166 -9207 -5847 -14529 -7790
15319 -7790 2961 6069 -1956 3528 11463 7947 14743 8981 5151 1861 -6360 5655 13577 8862
15305 8862 23868 20228 3603 -2438 -1003 -7884 -10598 -16560 -15638 -12881 -10839 231 19116 17418
15291 17418 10277 11948 -3089 -5750 -3670 -5709 -10807 -10005 -5365 -4018 -4269 -4161 25 -6447 -9134
15276 -9134 -11355 -8425 2508 11326 7604 115 519 11510 2742 1842 3601 -733 -8397 -2762 7300
15261 7300 11457 10859 3769 567 -8852 -3423 -12716 -11115 7017 12464 7566 7292 12758 9835 7442
$$ packed form
15361A2360p517L450J2842n521j3173j0313M468N115m506r071p305K03o37L622
15347a5983O569M668j0032n385q25J0437N110k0353N781P630K726l679m453J4778
15333c011M068j0278r18J186N51J0525j5763j6704P33L445J6959L360q682O739
15319g790J0751L108q025N484P935l516O796n762l830l290q221J2015P922m715
15305H862J5006l640j6625o041J435o881k714n962R22K757K042J1070J8885j698
15291A7418p141J671j5037k661K080k039n098Q02M640J347k51J08M186o472k687
15276i134k221K930J0933Q818l722p489M04J0991q768r00J759m334p664N635J0062
15261G300M157n98p090l202r419N429r293J601J8132N447m898k74N466k923k393
$$ plain form
15246 7442 18882 27256 33691 41763 21706 3804 -3981 -3258 3540 7258 10318 -1173 -12294 -4962
15232 -4962 15668 19964 24573 20155 15315 19435 15967 13089 18970 15960 12853 -1070 -6790 -795
15218 -795 13304 17987 17367 20994 12524 21526 25461 27482 32044 19102 17409 16998 -4810 -17378
15204 -17378 -10403 441 4226 16539 22045 19826 22586 21837 17499 25171 11075 -3550 -11869 -10232
15190 -10232 -5454 1213 -4950 -13800 -9776 13051 13935 5815 5620 3272 -3118 -21435 -35878 -29252
15176 -29252 -18919 -20102 -18180 -12416 -3718 13603 21091 10191 833 -2552 30 8669 1945 -10169
15162 -10169 -9013 2627 18363 12008 8705 10685 19044 18848 13595 14216 15734 12398 2700 -3572
15148 -3572 418 643 151 2648 9523 9892 2469 1116 -13313 -10415 6767 7124 4272 18965 29130
$$ packed form
15246G442J1440Q374O435Q072k0057j7902p785P23O798L718L060j1491j1121P332
15232d962K0630M296M609m418m840M120l468k878N881l010l107j3923n720N995
15218g95J4099M683o20L627q470R002L935K021M562j2942j693m11k1808j2568
15204a7378O975J0844L785J2313N506k219K760p49m338P672j4096j4625q319J637
15190a0232M778O667o163q850M024K2827Q84q120j95k348o390j8317j4443O626
15176b9252J0333j183J922N764Q698J7321P488j0900r358l385K582Q639o724j2114
15162a0169J156J1640J5736o355l303J980Q359j96n253O21J518l336r698o272
15148c572L990K25m92K497O875L69p423j353j4429K898J7182L57k852J4693J0165
$$ plain form
15133 29130 10098 -6440 -9017 -4658 7130 14214 -12830 -21075 -14987 -9266 -5334 -12950 -13405 -15906
15119 -15906 -12524 1484 14127 15350 13969 8272 14458 4911 5196 6896 6365 4877 -1280 -12908
15105 -12908 -19031 -17056 -11139 -8248 -688 15564 16869 15808 4349 11373 13470 8215 -5667 -21374
15091 -21374 -18313 -4923 -1010 -7045 6322 2073 919 -137 5347 6556 15010 14113 15205 8426
15077 8426 1065 13128 20540 20039 16910 27937 41501 39778 37284 17920 -5025 -12498 9559
15064 9559 22948 17030 21257 20020 4353 2739 827 -1447 -5365 -2825 -427 4997 14582 8592
15050 8592 -5336 -14988 -15030 -303 9647 13813 6860 -15361 -28230 -24281 -19980 -29260 -28443 -19253
15036 -19253 -24030 -15617 -10597 -2776 3596 4865 3954 364 7498 -8165 -13977 -9817 -3487 1069
$$ packed form
15133B9130j9032j6538k577M359J1788P084k7044q245O088N721L932p616m55k501
15119a5906L382J4008J2643J223j381n697O186r547K85J700n31j488o157j1628
15105a2908o123J975N917K891P560J6252J305j061j1459P024K097n255j3882j5707
15091b1374L061J3390L913o035J3367m249j154j056N484J209Q454q97J092o779
15077H426p361J2063P412n01l129J1027J3564j723k494j9364k2945p473K2057
15064I559J3389n918M227j237j5667j614j912k274l918K540K398N424R585n990
15050H592j3928r652m2J4727R950M166o953k2221j2869L949M301r280Q17R190
15036a9253m777Q413N020P821O372J269r11l590P134j5663n812M160O330M556
$$ plain form
15022 1069 5094 -739 -4041 -9274 -18061 -5510 5974 -6140 -2262 -2571 -16206 -15480 2053 -924
15008 -924 526 2534 3432 7728 10349 6991 1183 13786 22734 13262 9654 13706 -4574 -4654 951
14993 951 6434 11447 10666 8149 1788 -3620 12387 10785 -1845 -1910 11087 5219 133 -6116 -7772
14978 -7772 -1875 -803 -2842 -6787 -914 13992 14103 -2279 -3502 4489 -4824 -1920 9691 16462
14964 16462 7184 9060 10776 5838 -2226 -3425 82 3874 174 -12387 -17295 -3447 14388 16980
14950 16980 13863 13656 8550 4566 5196 10380 18641 21850 26186 34500 17849 3944 -6019 -17759
14936 -17759 -15113 -4004 9417 17096 1895 9301 11196 16857 26733 21750 11310 5434 -4362
14923 -4362 -4665 -14108 -24189 -22029 -12443 -16476 -18847 4262 22951 19191 9627 -892 3415 -4785
$$ packed form
15022A069M025n833l302n233q787J2551J1484j2114L878l09j3635P26J7533k977
15008i24J450K008Q98M296K621l358n808J2603Q948r472l608M052j8280q0N605
14993I51N483N013p81k517o361n408J6007j602j2630o5J2997n868n086o249j656
14978g772N897J072k039l945N873J4906J11j6382j223P991r313K904J1611O771
14964A6462r278J876J716m938q064j199L507L792l700j2561m908J3848J7835K592
14950A6980l117k07n106l984O30N184Q261L209M336Q314j6651j3905r963j1740
14936a7759K646J1109J3421P679j5201P406J895N661R876m983j0440n876r796
14923d362l03r443j0081K160R586m033k371K3109J8689l760r564j0519M307q200
$$ plain form
14909 -4785 -16652 -13693 -8305 -1213 14036 10634 1405 -14531 -22307 -7648 3152 8938 23568
14896 23568 23020 12956 -384 5843 2040 656 5510 -3155 -9651 -13235 -12336 -7457 -8930 -3158
14882 -3158 -2056 -8658 -8313 766 -7156 -3126 -4931 8427 1422 -12689 -3830 -3693 4440 18552
14868 18552 19784 16876 2012 11019 11315 3647 -660 6938 7707 2028 13197 13189 6348 5852 -10896
14853 -10896 -15098 -16060 -1344 18737 20305 14374 15093 13623 7538 -2524 -4741 667 158 1625
14839 1625 2978 1502 -2045 1240 7084 -11563 -11797 8238 12162 9305 -502 -6794 -4590 -20567
14825 -20567 -18736 -13378 -11728 -11115 -7943 1238 3885 -4349 -4988 -20994 -39163 -24042 -12731 -6876
14811 -6876 -5562 -1249 -8912 -6629 -25459 -19834 18621 28809 25471 15763 19096 15049 15917 21654
$$ packed form
14909d785j1867K959N388P092J5249l402r229j5936p776J4659J0800N786J4630
14896B3568n48j0064j3340O227l803j384M854q665o496l584Q99M879j473N772
14882c158J102o602L45R079p922M030j805J3358p005j4111Q859J37Q133J4112
14868A8552J232k908j4864R007K96p668m307P598P69n679J1169qo841m96j6748
14853a0896m202r62J4716K0081J568n931P19j470o085j0062k217N408n09J467
14839A625J353j476l547L285N844j8647k34K0035L924k857r807o292K204j5977
14825b0567J831N358J650O13L172R181K647q234o39j6006j8169J5121J1311N855
14811f876J314M313p663K283j8830N625L8455J0188l338r708L333m047Q68N737
$$ plain form
14797 21654 25603 26316 22411 21055 18239 -770 -19410 -11519 754 -3553 3127 703 -11057 -10061
14783 -10061 425 -1765 -4127 -1319 -9805 -23169 -22437 -15282 -1529 16084 9344 5330 12738 19146
14769 19146 7178 -8846 -13738 -10488 -4652 -14510 -22005 -13591 -7318 5821 9635 583 5969 12629
14755 12629 445 -7364 -8825 -11004 -6138 -5897 -11114 -5768 -12185 -17378 -20081 -13261 -12256 -10541
14741 -10541 228 3677 5109 6349 13931 6903 2331 10819 7382 -1020 -2263 -2143 -9363 -10299 -9989
14726 -9989 -2374 2250 -11441 -5202 -4048 -6186 -23154 -22493 -7818 -13978 -22120 -15923 -12163 -9933
14712 -9933 -8317 -8214 -7226 -5134 -5637 -11964 -20931 -17798 -5153 3575 -5549 -33670 -29991 -9219 4535
14697 4535 12657 15522 11123 -7229 -18354 -26098 -13308 1885 12873 15012 -967 -933 14059
$$ packed form
14797B1654L949P13l905j356k816j9009j8640P891J2273m307O680k424j1760R96
14783a0061J0486k190k362K808q486j3364P32P155J3753J7613o740m014P408O408
14769A9146j1968j6024m892L250N836r858p495Q414O273J3139L814r052N386O660
14755A2629j2184p809j461k179M866K41n217N346o417n193k703O820J005J715
14741a0541J0769L449J432J240P582p028m572Q488l437q402j243J20p220r36L10
14726i989P615M624j3691O239J154k138j6968O61J4675o160q142O197L760K230
14712i933J616J03R88K092n03o327q967L133J2645Q728r124k8121L679K0772J3754
14697D535Q122K865m399j8352j1125p744J2790J5193J0988K139j5979L4J4992
$$ plain form
14684 14059 12512 13243 9951 4602 6354 -3173 -13327 -6273 7709 13950 4466 -4729 -5597 -663
14670 -663 6153 7382 -2920 -18329 -21741 -5349 3565 2142 -2905 -7547 -17118 -20720 -16142 -5628
14656 -5628 -1915 -9916 -4905 -7983 -2640 -4374 -2589 -3301 -6541 1508 5516 2877 40 5639 -11737
14641 -11737 -20823 -16658 6545 19616 6065 11174 13409 20566 21361 13800 3176 -7483 -4221
14628 -4221 -6481 -3655 6209 4168 14216 5860 -3489 -8351 -9103 -21696 -29167 -26740 -35803 -38588
14614 -38588 -18937 -5521 11273 5044 2200 10069 7510 311 11247 9403 15824 19390 20049 15683
14600 15683 -1824 -18554 -21071 -13025 -12197 1495 16937 17096 14555 11902 842 1639 -5500 -12925
14586 -12925 -13681 -13230 -3876 197 -4441 5450 -2456 -4435 -5410 -8882 -13579 -19592 -13578 -64 -8345
$$ packed form
14684A4059j547P31l292n349J752r527j0154P054J3982O241r484r195q68M934
14670f63O816J229j0302j5409l412J6392Q914j423n047m642r571l602M578J0514
14656e628L713q001N011l078N343j734J785p12l240Q049M008k639k837N599j7376
14641a1737r086M165K3203J3071j3551N109K235P157P95p561j0624j0659L262
14628d221k260K826R864k041J0048q356r349m862p52j2593p471K427r063k785
14614c8588J9651J3416J6794o229k844P869k559p199J0936j844O421L566O59m366
14600A5683j7507j6730k517Q046Q28J3692J5442J59k541k653j1060P97p139p425
14586a2925p56M51R354M073m638R891p906j979r75l472m697o013O014J3514q281
$$ plain form
14571 -8345 -19763 -13961 -10777 -6646 -16437 -5782 1360 -1077 18196 17813 7936 5196 6887 19989
14557 19989 21287 26354 28445 8905 2836 17891 26629 26909 23717 15760 6577 12949 6906 -7720
14543 -7720 -17139 -1067 3081 -18557 -26863 -25384 -7737 3666 -2465 -1671 -14666 -13335 1527
14530 1527 3114 8054 13659 3233 11538 16162 19299 18038 18542 7314 -8484 -11812 6473 30499
14516 30499 34910 35445 29000 20129 20008 12927 588 -848 912 -8750 -13050 -23255 -37894 -40482
14502 -40482 -16510 4313 1788 -4040 -9314 -13963 -13676 -3885 -2749 -1980 10621 15378 23919 22559
14488 22559 12945 3178 -516 -8704 -20156 -21028 -25976 -28458 -24428 -27984 -22658 -5037 13683 15080
14474 15080 4705 -6227 -14108 -14286 -10291 -9743 -8198 -1266 6016 11493 -3291 -1436 -9182 -4344
$$ packed form
14571h345j1418N802L184M131r791J0655P142k437J9273l83r877k740J691J3102
14557A9989J298N067K091j9540o069J5055Q738K80l192p957r183O372o043j4626
14543g720r419J6072M148k1638q306J479J7647J1403o131P94j2995J331J4862
14530A527J587M940N605j0426Q305M624L137j261N04j1228j5798l328J8285K4026
14516C0499M411N35o445q871j21p081j2339j436J760r662m300j0205j4639k588
14502d0482K3972K0823k525n828n274m649K87R791J136P69J2601M757Q541j360
14488B2559r614r767l694q188j1452q72m948k482M030l556N326J7621J8720J397
14474A5080j0375j0932p881j78L995N48J545O932P282N477j4784J855p746M838
$$ plain form
14460 -4344 -9575 -17823 -13572 -10700 -14067 -1375 317 -8997 -16731 -12102 -2079 8720 -273 -12098
14446 -12098 -5651 2030 2353 -9633 -11658 -14885 -3148 4774 -1742 -5886 -8753 46 3779 17446
14432 17446 22902 14527 12078 15154 7062 869 916 66 6271 32110 33901 17557 15688 7248 4756
14417 4756 724 553 -2067 -4224 -1552 10748 15569 7887 14611 4157 7799 4661 1489 4767
14403 4767 10557 19970 11875 2586 8603 10781 12682 -4624 2566 8524 1417 -3325 556 -6306
14389 -6306 209 38 -1391 1377 -4570 -7781 -6258 5106 2929 6310 15559 18993 4057 -15053
14375 -15053 -28510 -36474 -30791 -23736 -23602 -17902 3905 9599 -253 -11289 -25409 -32607 -24038 -20937
14361 -20937 -16173 -5024 764 7604 19648 27822 26485 6727 6225 2417 -7641 -9354 1203
$$ packed form
14460d344n231q248M251K872l367J2692J692r314p734M629J0023J0799q993j1825
14446a2098O447P681L23j1986k025l227J1737P922o516m144k867Q799L733J3667
14432A7446N456q375k449L076q092o193M7q50O205K5839J791j6344j869q440k492
14417D756m032j71k620k157K672J2300M821p682O724j0454L642l138l172L278
14403D767N790R413q095r289O017K178J901j7306P190N958p107m742L881o862
14389f306O515j71j429K768n947l211J523J1364k177L381R249L434j4936j9110
14375a5053j3457p964N683P055J34N700K1807N694r852j1036j4120p198Q569L101
14361b0937M764J1149N788O840J2044Q174j337j9758n02l808j0058j713J0557
$$ plain form
14348 1203 9108 14923 7998 4271 3433 9863 19562 14464 10830 16261 22644 13985 8112 9287 8398
14333 8398 12035 9267 9409 22359 20919 6207 5294 -7508 -8176 2480 1098 154 7075 3649 -11392
14318 -11392 -16418 -3493 8075 17132 6081 -13882 -14085 13397 8874 -1574 -7653 -254 2344
14305 2344 -1932 7678 2347 3081 4048 7207 913 -9418 -11683 -5932 -8190 -4437 2685 1846 9060
14290 9060 20171 14650 8679 7598 5826 3434 -776 -8796 -19509 -18387 -4871 -4127 1583 -12403
14276 -12403 -17086 -27134 -30142 -25214 -14284 -2428 -5351 -133 8785 -6845 -15615 -18549 -14603
14263 -14603 -27665 -25443 -26129 -38343 -34310 -18079 -7886 976 7012 -8310 -21709 -15388 -15482 -6250
14249 -6250 -3999 5550 22574 27120 8409 5585 14234 20032 27305 21066 19276 32578 37827 35032
$$ packed form
14348A203P905N815o925l727q38O430R699n098l634N431O383q659n873J175q89
14333H398L637k768J42J2950j440j4712r13j2802o68J0656j382r44O921l426j5041
14318a1392n026J2925J1568R057j1051j9963k03K7482m523j0448o079P399K598
14305B344m276R610n331P34R67L159o294j0331k265N751k258L753P122q39P214
14290I060J1111n521n971j081j772k392m210q020j0713J122J3516P44N710j3986
14276a2403m683j0048l008M928J0930J1856k923N218Q918j5630q770k934L946
14263a4603j3062K222o86j2214M033J6231J0193Q862O036j5322j3399O321r4R232
14249f250K251R549J7024M546j8711k824Q649N798P273o239j790J3302N249k795
$$ plain form
14235 35032 11740 6608 18138 17440 8382 909 7798 6755 1931 2338 -2156 6346 10556 -79
14221 -79 -7237 10247 11385 -428 4512 6443 -7219 -10247 -2181 -12742 -20390 -17943 -4920 -2015
14207 -2015 -6615 -13445 -3420 7531 10225 14154 11933 3952 9575 -773 879 -3764 -11322 -16001
14193 -16001 -13778 -22472 -22817 -8629 -1364 1525 -13595 -5566 -3835 -3949 -8257 -16948 -9151 -3225
14179 -3225 -15684 -20291 -16869 -12108 -14209 -23778 -29280 -25221 -17357 -5789 10004 -92 -7125 -4961
14165 -4961 -2393 -4047 -2687 8155 12406 24625 14422 11450 -269 -267 1258 4219 21452 21587
14151 21587 12350 6019 3719 -5083 -15805 -6882 -1965 243 -2336 -1713 126 7124 16642 19548
14137 19548 7582 -9084 -6145 -5116 545 15206 22237 11942 13842 11495 14263 12099 846
$$ packed form
14235C5032k3292n132J1530o98r058p473O889j043m824M07m494Q502M210j0635
14221g9p158J7484J138j1813M940J931j3662l028Q066j0561p648K447J3023K905
14207b015m600o830J0025J0951K694L929k221p981N623j0348J652m643p558m679
14193a6001K223q694l45J4188P265K889j5120Q029J731j14m308q691P797N926
14179c225j2459m607L422M761k101r569n502M059P864J1568J5793j0096p033K164
14165d961K568j654J360J0842M251J2219j0203k972j1719KJ525K961J7233J35
14151B1587r237o331k300q802j0722Q923M917K208k579O23J839O998R518K906
14137A9548j1966j6666K939J029N661J4661P031j0295J900k347K768k164j1253
$$ plain form
14124 846 -12783 -4845 -1316 9490 18785 4719 616 4559 4218 -905 12010 19051 17468 24603
14110 24603 28819 33860 23012 9548 8644 2219 14702 14102 8280 -1469 -2007 2627 10314 12869
14096 12869 24639 14353 10178 9104 1644 -11517 -21766 -12903 -1278 -3398 7269 8001 -7948
14083 -7948 -8687 -9251 -19762 -9704 1281 18682 15816 11154 14224 -7444 -26050 -27221 -22145 -15542
14069 -15542 -1405 8910 2574 1347 -8857 -18573 -16966 -17366 -21122 -25304 -8890 -1225 11891
14056 11891 8012 12738 18241 5962 3624 7934 16781 22226 12710 -1025 -6691 -9424 -17576 -8276
14042 -8276 -1291 11581 9417 3894 -4280 -17230 -19142 -15341 -16731 -29638 -29962 -26132 -20838 -15112
14028 -15112 -9317 5552 6908 -3800 -5280 -1573 -3487 -1084 -5154 3532 17128 31051 30470 15314
$$ packed form
14124H46j3629P938L529J0806R295j4066m103L943l41n123J2915P041j583P135
14110B4603M216N041j0848j3464r04o425J2483o00n822r749n38M634P687K555
14096A2869J1770j0286m175j074p460j3161j0249Q863J1625k120J0667P32j5949
14083g948p39n64j0511J0058J0985J7401k866m662L070k1668j8606j171N076O603
14069a5542J4137J0315o336j227j0204r716J607m00l756m182J6414P665J3116
14056A1891l879M726N503j2279k338M310Q847N445r516j3735n666k733q152R300
14042h276O985J2872k164n523q174j2950j912L801j390j2907l24L830N294N726
14028a5112N795J4869J356j0708j480L707j914K403m070Q686J3596J3923n81j5156
$$ plain form
14014 15314 117 1663 -6939 -8903 -13455 -5993 1614 -9898 -12134 -17104 -9489 -7309 -303 6469
14000 6469 8496 4653 20011 28043 21000 21980 29952 18836 13773 8221 2078 19938 27856 10019
13986 10019 5406 -2979 7631 2853 -13265 -1716 16715 25962 18858 754 2878 3068 -6280
13973 -6280 2090 13716 23377 27637 24440 13130 3816 -568 -2698 16750 10986 -4671 -12117 -4699
13959 -4699 -5412 -8051 -19046 -20446 1926 5845 -12606 -13537 -623 6498 11954 25430 18341 16718
13945 16718 7991 1872 -2098 -9223 1472 -299 -2793 -5327 -8506 -3227 12996 13599 -4744 -8079
13931 -8079 -6079 -7674 -21426 -29870 -23316 -20475 -22969 -17844 -15442 -15305 -18356 -24801 -22026 -12789 -6940
13916 -6940 -312 -5040 -15459 -17874 -13571 -10415 -3801 9216 -2266 -11215 -4949 7293 20836
$$ packed form
14014A5314j5197J546q602j964m552P462P607j1512k236m970P615K180P006O772
14000F469K027l843J5358Q032p043R80P972j1116n063n552o143J7860P918j7837
13986A0019m613q385J0610m778j6118J1549J8431R247p104j8104K124J90r348
13973f280Q370J1626R661M260l197j1310r314m384k130J9448n764j5657p446P418
13959d699p13k639j0995j400K2372L919j8451r31J2914P121N456J3476p089j623
13945A6718q727o119l970p125J0695j771k494k534l179N279J6223O03j8343l335
13931h079K000j595j3752q444O554K841k494N125K402J37l051o445K775R237N849
13916f940O628m728j0419k415M303L156O614J3017j1482q949O266J2242J3543
$$ plain form
13903 20836 18445 -166 -10563 -23335 -29026 -19894 -2645 7535 -2565 -8214 -4313 6579 11102
13890 11102 4634 61 -15641 -8945 -4111 3952 -3568 -17713 2615 8857 1007 -1812 5797 9953
13876 9953 13998 20908 18584 -353 -4901 -2373 2946 5245 -2327 -9236 -18699 -16909 -13639 -14041 -18034
13861 -18034 -16605 245 2379 6099 12055 5926 -27 3383 4357 -8143 -9196 1182 10381 7315
13847 7315 2974 7938 15728 16391 10506 18132 25820 21246 22505 29942 23040 13760 10968 8994 10574
13832 10574 10323 8741 8558 5196 2307 4835 1481 -7156 -12374 -8668 -4972 8791 8357 14551 16673
13817 16673 24505 26597 18692 21916 22685 -2213 -16333 -11308 -7704 -13638 -3334 2340 7417 8984
13803 8984 12976 9203 1370 9942 9652 -2109 -4485 8090 15666 24028 17125 14484 18032 10507
$$ packed form
13903B0836k391j8611j0397j2772n691R132J7249J0180j0100n649L901J0892M523
13890A1102o468m573j5702O696M834Q063p520j4145K0328O242p850k819P609M156
13876I953M045O910k324j8937m548K528N319K299p572o909r463J790L270m02l993
13861a8034J429J6850K134L720N956o129n953L410R74j2500j053J0378R199l066
13847G315m341M964P790O63n885P626P688m574J259P437o902r280k792j974J580
13832A0574k51j582j83l362k889K528l354q637n218L706L696J3763m34O194K122
13817A6673P832K092p905L224P69k4898j4120N025L604n934J0304N674N077J567
13803H984L992l773p833Q572k90j1761k376J2575P576Q362o903k641L548p525
$$ plain form
13789 10507 11165 4963 622 -9822 -22746 -21934 -14252 -6337 -5811 -9579 -8343 -1870 7065 17400
13775 17400 21073 17265 7750 11357 14075 7607 -4889 -5378 -15 -5516 -17631 -29720 -14842 710
13761 710 -5964 -15189 -15807 -25175 -10955 -9022 -12691 -5489 -5125 -1861 7819 16 3031 671 1063
13746 1063 -2853 6155 9615 6802 6347 -4588 -4821 -3227 -2052 3209 -1621 -3179 -296 -5158 -7906
13731 -7906 -14420 -14839 -4395 992 10948 14531 2474 -9524 -12681 -4340 -4004 -1032 334 1258 -6242
13716 -6242 -11025 -5820 -1463 589 2461 10342 11227 6489 15152 15670 16600 10308 -10893 -4564 -2661
13701 -2661 -6457 -9075 -10262 -13806 -10075 -3180 -2090 -7066 -4174 6438 2551 -6919 -24157 -22111
13687 -22111 -28073 -19555 -3435 -2430 -4508 -5825 -14596 -12841 -12349 -7105 -5902 -5601 -8653 -620 7734
$$ packed form
13789A0507O58o202m341j0444j2924Q12P682P915N26l768J236O473Q935J0335
13775A7400L673l808r515L607K718o468j2496m89N363n501j2115j2089J4878J5552
13761G10o674r225o18r368J4220J933l669P202L64L264R680p803L015k360L92
13746A063l916R008L460k813m55j0935k33J594J175N261m830j558K883m862k748
13731g906o514m19J0444N387R956L583j2057j1998l157Q341L36K972J366R24p500
13716f242m783N205M357K052J872P881Q85m738Q663N18R30o292k1201O329J903
13701b661l796k618j187l544L731O895J090m976K892J0612l887r470j7238K046
13687b2111n962Q518J6120J005k078j317q771J755M92N244J203L01l052Q033Q354
$$ plain form
13672 7734 8008 5585 7971 -2260 -1588 2908 -3975 -6702 1530 -9135 -12772 -13429 -6423 -1624 -815
13657 -815 -2700 6543 4206 -2906 1037 -402 -11100 -13898 -10001 -3005 -4674 -18660 -16876 -12385
13643 -12385 -7950 -8975 -9142 7523 4310 -8620 -11008 -13035 -15319 -16634 -13714 -1292 6085 -8263
13629 -8263 -4225 8981 7471 3073 -8759 -11179 -15413 893 1514 -7658 -11552 -5296 589 2695
13615 2695 7315 22786 16412 2078 -342 5101 8849 2504 10961 5920 -4326 -14467 -8491 -17983
13601 -17983 -12482 -10074 -8941 710 -9005 -29367 -20641 -11776 -9465 2437 943 -2230 -9067 3891
13587 3891 11514 4262 -3284 3598 5544 10674 5803 -6231 -1997 -3079 -11088 -13146 -7293 -1196
13573 -1196 14162 28494 20497 9951 14372 1049 -7431 -7736 -887 -3286 1560 6109 -5019 -3039
$$ packed form
13672G734K74k423K386j0231O72M496o883k727Q232j0665l637o57P006M799Q09
13657h15j885R243k337p112L943j439j0698k798L897O996j669j3986J784M491
13643a2385M435j025j67J6665l213j2930k388k027k284j315K920J2422P377j4348
13629h263M038J3206j510m398j1832k420m234J6306O21r172l894O256N885K106
13615B695M620J5471o374j4334k420N443L748o345Q457n041j0246j0141N976r492
13601a7983N501K408J133R651r715k0362Q726Q865K311J1902j494l173o837J2958
13587C891P623p252p546O882J946N130m871j2034M234j082q009k058N853O097
13573a196J5358J4332p997j0546M421j3323q480l05O849k399M846M549j1128J980
$$ plain form
13559 -3039 -10542 -14272 -6489 -5442 -4923 -4761 -4781 6814 10376 16913 19910 10640 1798 -17254 -29169
13544 -29169 -25553 -23429 -16730 -5899 -14614 -5316 -1110 -7683 -6935 -23192 -25544 -3696 398 -3304
13530 -3304 -1038 7508 9009 -5472 -10846 -9696 -9828 -18821 -25072 -25901 -20916 -22168 -3607 1194 -1715
13515 -1715 -6263 -6150 -1798 -2792 5594 170 1671 -1769 -12309 -26192 -25775 -24019 -9288 -13747 -19710
13500 -19710 -15684 -12403 -6905 535 7644 20967 15051 7186 5963 24564 29871 33380 28855 27610
13486 27610 11660 11740 10925 4095 -16591 1869 17090 22668 22691 21964 14061 12226 8086 -2623 -12292
13471 -12292 -24626 -18526 7933 14232 3282 -9188 -7850 -17928 -9386 4727 -3584 -9022 -7014
13458 -7014 -3921 -2177 -8436 529 -4808 -16253 -4959 8962 5262 -3068 -6813 -5771 -7856 -3531
$$ packed form
13559c039p503l730P783J047N19J62k0J1595L562O537K997r270q842j9052j1915
13544b9169L616K124O699J0831q715R298M206o573P48j6257k352K1848M094l702
13530c304K266Q546J501j4481n374J150j32q993o251q29M985j252J8561M801k909
13515a715m548J13M352r94Q386n424J501l440j0540j3883M17J756J4731m459n963
13500a9710M026L281N498P440P109J3323n916p865j223J8601N307L509m525j245
13486B7610j5950Q0q15o830k0686J8460J5221N578K3p27p903j835m140j0709r669
13471a2292j2334O100K6459O299j0950j2470J338j0078Q542J4113q311n438K008
13458g014L093J744o259Q965n337j1445J1294J3921l700q330l745J042k085M325
$$ plain form
13444 -3531 -1581 5797 9361 8314 -3665 -1841 -1807 -8732 -17037 -11131 1658 5897 5136 8466 14132
13429 14132 11224 11610 9859 5439 1491 -4284 -8173 -4441 2912 3668 1729 9894 17341 11653 9581
13414 9581 10609 16668 20974 16651 14474 22245 8785 -6946 -6363 -870 -8876 -21545 -19191 -18737
13400 -18737 -9005 -4813 -13272 -1279 12328 734 -3447 -4475 1277 -4957 -4597 6798 7858 1897
13386 1897 400 -6008 -7813 -4863 -9827 -15239 -19169 -19138 -7094 3154 3055 8075 12290 3899 -343
13371 -343 -6333 -8228 -9232 -8491 9141 13035 4738 -9500 -20000 -9455 6212 14116 3303 7479
13357 7479 14183 11616 14466 14445 7799 3716 3424 -2507 70 -4747 -8384 -4283 -3137 -5525 -16745
13342 -16745 -11458 2267 -4281 -13636 -5816 -5297 -10398 -8277 -5518 -666 7708 14082 16825 19985
$$ packed form
13444c531J950P378L564j047j1979J824L4o925q305N906J2789M239p61L330N666
13429A4132k908L86j751m420l948n775l889L732P353P56j939Q165P447n688k072
13414I581J028O059M306m323k177P771j3460j5731N83N493q006j2669K354M54
13400a8737R732M192q459J1993J3607j1594m181j028N752o234L60J1395J060n961
13386A897j497o408j805K950m964n412l930L1J2044J0248r9N020M215q391m242
13371c43n990j895j004P41J7632L894q297j4238j0500J0545J5667P904j0813M176
13357G479O704k567K850k1o646m083k92n931K577m817l637M101J146k388j1220
13342a6745N287J3725o548r355P820N19n101K121K759M852Q374O374K743L160
$$ plain form
13328 19985 9839 630 13795 29015 20287 12234 5478 7215 -2290 -6596 -2987 -461 -742 -3025
13314 -3025 776 1163 2890 -10804 -14319 -4324 1796 -11640 -11649 -6053 -7523 -6587 3183 12002 10205
13299 10205 14217 4953 -10073 -6962 -1028 6641 8012 7995 19411 13260 3190 2837 3308 16620
13285 16620 17029 7030 8311 17464 23256 24772 24438 26567 19834 20204 15510 9077 -3602 -6912 1988
13270 1988 -3933 2447 11790 16365 8959 -9966 -13042 -11937 -8914 1699 13543 24802 14111
13257 14111 10618 3075 10177 26839 22894 22085 33692 27759 23039 23764 16154 3015 1220 1873
13243 1873 -2406 -6699 -16692 -21724 -22282 -16584 -4305 -10543 -11702 -14137 -16934 -18874 -22140 -12612 -10537
13228 -10537 -4576 -5444 -4782 -7762 -15789 -16151 -331 -2815 -12491 -16077 -17525 -11938 -6781 14712 22028
$$ packed form
13328A9985j0146r209J3165J5220q728q053o756J737r505m306L609K526k81k283
13314c025L801L87J727j3694l515R995O120j3436rN596j470R36R770Q819j797
13299A0205M012r264j5026L111N934P669J371j7J1416o151j0070l53M71J3312
13285A6620M09r999J281R153N792J516l34K129o733L70m694o433j2679l310Q900
13270A988n921O380R343M575p406j8925l076J105L023J0613J1844J1259j0691
13257A4111l493p543P102J6662l945q09J1607n933m720P25p610j3139j795O53
13243A873m279m293r993n032n58N698J2279o238j159k435k797j940l266R528K075
13228a0537N961q68O62k980q027l62J5820k484r676l586j448N587N157K1493P316
$$ plain form
13213 22028 14861 19368 584 -6020 1718 -15782 -15311 -5025 -5725 1203 5481 -10520 -6142 12334
13199 12334 16270 2664 -3645 -4951 -4744 8240 13239 14277 9419 1829 14584 16116 -1826 -9080
13185 -9080 -4375 -63 6139 6247 9075 8560 4599 -7217 -480 10488 9687 12944 15350 6019 8546
13170 8546 14514 20647 19505 16439 8066 12967 2467 3504 8127 3883 14407 7589 12161 17255
13156 17255 8308 7766 2266 -6698 -17377 -3188 -455 -9454 -24672 -19627 -13037 -11463 -15198 -27309
13142 -27309 -39460 -10664 -1298 3921 -8282 -11523 -880 13136 -5673 -16987 -11297 1424
13130 1424 -632 -13696 -1423 1010 3289 11755 -467 -6324 -10062 -9294 -3733 -10361 -13657 -15801
13116 -15801 -16643 -23935 -12335 7041 -8857 5992 7099 4886 7021 16551 3470 -8352 -12682
$$ packed form
13213B2028p167M507j8784o604P738j7500M71J0286p00O928M278j6001M378J8476
13199A2334L936j3606o309j306K07J2984M999J038m858p590J2755J532j7942p254
13185i080M705M312O202J08K828n15l961j1816O737J0968q01L257K406r331K527
13170H546N968O133j142l066q373M901j0500J037M623m244J0524o818M572N094
13156A7255q947n42n500q964j0679J4189K733q999j5218N045O590J574l735j2111
13142b7309j2151K8796R366N219j2203l241J0643J4016j8809j1314N690J2721
13130A424k056j3064J2273K433K279Q466j2222n857l738P68N561o628l296k144
13116a5801q42p292J1600J9376j5898J4849J107k213K135R530j3081j1822m330
$$ plain form
13103 -12682 -2655 -46 1959 11301 12884 18602 18920 16145 726 3460 -7259 -7278 3406 3708
13089 3708 5593 -2389 -488 2150 5535 8560 8611 -1031 -6930 -9273 4619 7217 5724 6138 23538
13074 23538 10666 1183 -5382 -3076 -7290 -12880 -17059 -19150 -7021 2320 7158 8931 -7815 -6578
13060 -6578 -6278 -1228 16914 27570 21201 18544 17717 13568 12335 20351 11096 -972 3511 10874
13046 10874 18345 6951 -7017 907 19516 19477 18092 1147 -9517 -14807 -8808 -13844 -11450 798
13032 798 1877 -7398 -8913 938 6272 6506 14558 9618 7241 10516 1593 -6963 -6493 8728 5342
13017 5342 -12818 -27896 -32185 -23435 -7268 322 -4039 8665 20800 20775 11594 -982 -14742
13004 -14742 -15939 -22808 -10830 4135 3822 778 4807 2403 13131 20551 14096 13685 666 -7302
$$ packed form
13103a2682J0027K609K005R342J583N718L18k775j5419K734j0719j9J0684L02
13089C708J885p982J901K638L385L025N1r642n899k343J3892K598j493M14J7400
13074B3538j2872r483o565K306m214n590m179k091J2129R341M838J773j6746J237
13060f578L00N050J8142J0656o369k657q27m149j233Q016r255j2068M483P363
13046A0874P471j1394j3968P924J8609l9j385j6945j0664n290N999n036K394J2248
13032G98J079r275j515R851N334K34Q052m940k377L275q923q556M70J5221l386
13017E342j8160j5078m289Q750J6167P590m361J2704J2135k5r181j2576j3760
13004a4742j197o869J1978J4965l13l044M029k404J0728P420o455m11j3019p968
$$ plain form
12990 -7302 -2920 6127 3404 11545 13880 1020 -9037 -2686 -9800 -19513 -23126 -11713 -10512 -14520
12976 -14520 -12053 -5005 -1238 -8273 -6944 3842 675 -3563 3491 10629 7498 9204 5059 -2538
12962 -2538 2707 -3832 -12438 -5254 7514 12045 12423 12052 14150 -742 -405 14782 14833 4029 -7240
12947 -7240 -10274 -22466 -24575 -21882 -29248 -31692 -42874 -37937 -18920 -5686 1566 7337 3793 1791
12933 1791 21373 22461 24636 33051 38374 25286 10515 -3323 -2758 -3228 4796 -2479 8306 5753
12919 5753 -10367 -22307 -14313 -18238 -11722 13440 15940 11618 10613 -3515 -12720 -20438 -14026 1489
12905 1489 15018 9962 -516 -13518 3775 17218 12153 10574 13380 3721 -19225 -7454 -147
12892 -147 846 1978 -932 -7135 -7711 5105 11008 1389 -4369 4637 3631 -7569 -10378 -7244 -7234
$$ packed form
12990g302M382R047k723Q141K335j2860j0057O351p114r713l613J1413J201m008
12976a4520K467P048L767p035J329J0786l167m238P054P138l131J706m145p597
12962b538N245o539q606P184J2768M531L78l71K098j4892L37J5187N1j0804j1269
12947g240l034j2192k109K693p366k444j1182M937J9017J3234P252N771l544k002
12933A791J9582J088K175Q415N323j3088j4771j3838N65m70Q024p275J0785k553
12919E753j6120j1940P994l925O516K5162K500m322j005j4128r205p718O412J5515
12905A489J3529n056j0478j3002J7293J3443n065j579K806r659k2946J1771P307
12892a47R93J132k910o203n76J2816N903r619n758R006j006j1200k809L134J0
$$ plain form
12877 -7234 -14724 -2995 -4975 -11366 -11433 -10933 -4808 179 1999 -7821 -5448 -44 -6074 -6358 -3244
12862 -3244 -647 -5759 -5918 -12614 -32279 -25635 -9209 4034 -6356 -4230 -10386 -11038 -1763 8392
12848 8392 7913 1165 2890 1689 1167 -9438 -15235 -18852 -8770 -9661 -12880 -1024 2467 2857 10622
12833 10622 25784 13656 -4768 -4457 7528 17045 -480 -13113 -11543 -7828 -1124 2890 5625
12820 5625 4168 5267 13677 10575 7991 2404 4960 1138 -3849 -19391 -13319 -1332 -6427 -15234
12806 -15234 -17193 -8116 -17108 -20981 -26902 -20463 -16451 -13466 -7596 -4482 12018 22961 16488 7507
12792 7507 6713 13802 10226 -6360 -7213 -5249 2887 8450 -3461 -6939 -299 -5376 -10018 2154
12778 2154 -1538 -4817 -866 -1174 -5072 -11307 -12341 -2761 3286 -1824 3649 12301 11713 10967 1878
$$ packed form
12877g234p490J1729j980o391o7N00O125M987J820r820K373N404o030k84L114
12862c244K597n112j59o696j9665O644J6426J3243j0390K126o156o52R275J0155
12848H392m79o748J725j201n22j0605n797l617J0082q91l219J1856L491L90P765
12833A0622J5162j2128j8424L11J1985R517j7525j2633J570L715O704M014K735
12820E625j457J099Q410l102k584n587K556l822m987j5542O072J1987n095q807
12806a5234j959R077q992l873n921O439M012K985N870L114J6500J0943o473q981
12792G507p94P089l576j6586q53J964Q136N563j1911l478O640n077m642J2172
12778B154l692l279L951l08l898o235j034R580O047n110N473Q652n88p46r089
$$ plain form
12763 1878 2233 6552 12070 13652 3727 10206 12464 9269 1433 -747 -4203 -4921 4413 -9674 -9485
12748 -9485 -11663 -15468 -15914 -22474 -15584 -8056 4366 1308 -23333 -20486 3490 -602 -5269 5200
12734 5200 -4439 -9911 -16891 -12416 -2180 8095 4301 5179 6651 3749 -8331 -10691 -12139 -9387
12720 -9387 -17073 -14124 -735 -6213 5467 24150 21911 9550 9595 3397 -25258 -33913 -10395 3104
12706 3104 -1484 -4406 -2181 5029 8552 17061 5687 -1166 6995 -4290 -8221 623 -6321 -14010
12692 -14010 -6227 -6994 -10353 -8474 -1874 674 -825 9000 8436 5236 -5585 -18282 -23933 -21116
12678 -21116 -18036 -14956 -18806 -14477 -7972 9411 16534 18723 15606 5549 -2705 -7676 -6818 547
12664 547 887 -3769 1725 15280 12126 1721 -10197 -9294 -16093 -3095 -3816 -7132 -3475 5904 19762
$$ packed form
12763A878L55M319N518J582r925O479K258l195p836k180l456p18R334j4087J89
12748i485k178l805m46o560O890P528J2422l058k4641K847K3976m092m667J0469
12734E200r639n472o980M475J0236J0275l794Q78J472k902j2080k360j448K752
12720i387p686K949J3389n478J1680J8683k239j2361M5o198k8655q655K3518J3499
12706C104m588k922K225P210L523Q509j1374o853Q161j1285l931Q844o944p689
12692a4010P783p67l359J879O600K548j499R825n64l200j0821j2697n651K817
12678b1116L080L080l850M329O505J7383P123K189l117j0057q254m971Q58P365
12664E47L40m656N494J3555l154j0405j1918R03o799J2998p21l316L657R379J3858
$$ plain form
12649 19762 23335 7938 -15430 -11244 -2870 8582 -10052 -19214 -5434 6232 10051 4198 -10205
12636 -10205 -11636 -11034 1320 10874 8541 10326 6386 9170 -93 -16426 -17525 -18884 -17391 -8526
12622 -8526 -4866 -8048 -11192 544 -824 -11230 -18850 -18956 -13229 -9725 -7424 -16387 -8464 -1118
12608 -1118 -2651 -8670 -22222 -7917 5536 1399 -7877 -8543 -5437 -2273 4555 6377 2061 -685
12594 -685 4306 18477 13569 -5371 565 -2851 -15921 -17068 -13127 -8435 -1808 1282 5811 -2495
12580 -2495 -5306 -8528 -18122 -17670 -2403 611 -3955 -19304 -18741 -9208 -5669 4020 240 1062 11508
12565 11508 24449 15249 5834 17922 21097 18363 4758 4337 4652 8070 11413 2679 -3765 -12016
12551 -12016 -22207 -30922 -31396 -20492 -13993 -5094 -9316 -5826 4417 -3728 172 4998 -9700 -8631
$$ packed form
12649A9762L573j5397k3368M186Q374J1452j8634r162J3780J1666L819n853j4403
12636a0205j431O02J2354R554k333J785l940K784r263j6333j099j359J493Q865
12622h526L660l182l144J1736j368j0406p620j06N727L504K301q963P923P346
12608a118j533o019j3552J4305J3453m137r276o66L106L164O828J822m316k746
12594f85M991J4171m908j8940N936l416j3070j147L941M692O627L090M529q306
12580b495k811l222r594M52J5267L014m566j5349N63R533L539R689l780Q22J0446
12565A1508J2941r200r415J2088L175k734j3605m21L15L418L343q734o444q251
12551a2016j0191q715m74J0904O499Q899m222L490J0243q145L900M826j4698J069
$$ plain form
12537 -8631 -6114 7094 14462 -432 3639 13624 15086 10470 2957 6810 7006 16034 13516 -206
12523 -206 -765 -8466 -10890 -17515 -13580 -10772 -6545 -3726 11975 1027 6281 10790 -1071 4970
12509 4970 12557 16377 5124 -4601 -6430 8235 11559 -3564 -5724 55 5201 -8105 -11965 -16806
12495 -16806 -12221 -1662 -4950 2141 3914 7639 -1323 -13987 -14774 -11838 -17401 -8421 -9453 -19492
12481 -19492 -21966 -3913 -2584 -9082 -6025 5777 11651 10856 8444 -4093 -16982 -16237 -4248 -6687
12467 -6687 -9712 -24294 -23557 -14367 -2600 2183 682 -268 -1709 13887 14037 20224 28872 31950 23990
12452 23990 14837 11322 10594 -5054 -7180 5704 21613 19104 20440 27247 16545 7454 8420 9586
12438 9586 9809 8690 11753 3478 5818 12092 6064 -3808 1239 17601 26534 18973 4767 -8095
$$ packed form
12537h631K517J3208P368j4894M071R985J462m616p513L853J96R028k518j3722
12523b06n59p701k424o625L935K808M227K819J5701j0948N254M509j1861O041
12509D970P587L820j1253r725j829J4665L324j5123k160N779N146j3306l860m841
12495a6806M585J0559l288P091J773L725q962j2664p87K936n563Q980j032j0039
12481a9492k474J8053J329o498L057J1802N874p95k412j2537j2889P45J1989k439
12467f687l025j4582P37R190J1767M783j501r50j441J5596J50O187Q648L078p960
12452B3990r153l515p28j5648k126J2884J5909k509J336O807j0702r091R66J166
12438I586K23j119L063q275K340O274o028r872N047J6362Q933p561j4206j2862
$$ plain form
12424 -8095 5262 12637 -2820 -3836 10547 12987 5961 2335 4879 12461 16894 4220 -1581 -10588
12410 -10588 -14679 -26256 -32908 -21491 -1220 7506 16013 19524 12623 9433 15805 14064 11836 8941
12396 8941 16950 9287 -867 4457 8449 11968 10205 15650 29988 42552 35610 28853 4514 -2124
12382 -2124 7788 4215 -21209 -24050 -20227 -11929 -5148 6528 8552 4777 5834 4833 10889 16021
12368 16021 19651 6584 3719 -1369 -11723 -7312 -1246 -548 -2549 -8771 -5354 -2526 5476 4904
12354 4904 -1159 5455 20487 22349 8338 -16876 -34238 -18009 3850 7378 1088 -7237 -2297
12341 -2297 6556 7733 14621 7250 6344 9059 24393 28613 30708 39065 37794 28639 8048 11324
12327 11324 2320 -1806 -4077 -8585 -1984 3079 5048 4490 6100 -3749 -19 -2524 -7513 -3443 3651
$$ packed form
12424h095J3357P375j5457j016J4383K440p026l626K544P582M433j2674n801r007
12410a0588m091j1577o652J1417K0271Q726Q507L511o901l190O372j741k228k895
12396H941Q009p663j0154N324L992L519j763N445J4338J2564o942o757k4339o638
12382b124R912l573k5424k841L823Q298O781J1676K024l775J057j001O056N132
12368A6021L630j3067k865n088j0354M411O066O98k001o222L417K828Q002n72
12354D904o063O614J5032J862j4011k5214j7362J6229K1859L528o290q325M940
12341b297Q853J177O888p371r06K715J5334M220K095Q357j271r155k0591L276
12327A1324r004m126k271m508O601N063J969n58J610r849L730k505m989M070P094
$$ plain form
12312 3651 6829 -12325 -24858 -10868 -7922 -17003 -16636 -9439 -4678 951 10157 11936 5488 316
12298 316 -18567 -17142 -6428 -3771 -7885 -8006 5718 8328 19532 27331 24804 11727 10431 17459
12284 17459 24348 19373 -5037 -11958 2879 3770 -2688 588 7324 13721 12537 16621 17899 7200
12270 7200 6966 7545 1582 2322 4736 -4595 5779 22348 22931 8663 13695 5759 -2528 -4579 663
12255 663 1301 2286 2429 -5627 -6995 -11565 -11810 -8722 -2570 20739 15654 -392 -965 -7016 -4481 -8245
12239 -8245 -2876 10299 19041 12157 12779 10719 4325 -2845 -18197 -7127 -6828 -10551 809 9010
12225 9010 7301 3970 -3623 584 -940 -13699 -12746 -4481 1554 9216 -2161 -17968 -14144 -2233
12211 -2233 -5388 -8041 -21554 -27354 -13729 -375 1310 1122 3835 -7160 -5683 94 7492 5051
$$ packed form
12312C651L178j9154j2533J3990K946r081L67P197M761N629R206J779o448n172
12298C16j8883J425J0714K657m114j21J3724K610J1204P799k527j3077j296P028
12284A7459O889m975k4410o921J4837Q91o458L276O736O397j184M084J278j0699
12270G200k34N79n963P40K414r331J0374J6569N83j4268N032p936q287k051N242
12255F63O38R85J43q056j368m570k45L088O152K3309n085j6046n73o051K535l764
12239h245N369J3175Q742o884O22k060o394p170j5352J1070K99l723J1360Q201
12225I010j709l331p593M207j524j2759R53Q265O035P662j1377j5807L824J1911
12211b233l155k653j3513n800J3625J3354J685j88K713j0995J477N777P398k441
$$ plain form
12197 5051 -4409 -19617 -22286 -16722 -18937 -9102 -6649 -15353 -14862 -15915 -15355 -12192 -1684 -4651 -19052
12182 -19052 -2661 48 6071 7884 340 -6150 -4872 -8440 -10723 -17488 -13440 -4361 -1817 -8688
12168 -8688 -18584 -14798 -9474 -19123 -16636 -4326 -2438 54 -9497 -9952 -23059 -10473 -9953 -8284
12154 -8284 -556 1049 -1098 -7135 -5673 732 8989 -4775 -17240 -24181 -6502 -1331 -10466 -27305
12140 -27305 -14819 -2768 7564 -8467 -7142 -5433 -3986 -6386 1293 7524 7416 5155 11827 4494
12126 4494 251 -2145 -1021 -614 -11730 -1348 321 -11490 -18784 -3225 23036 28620 17467
12113 17467 1576 -642 546 757 -15250 -23055 -16558 -13099 -16565 -21061 -12779 -9775 -27793 -31573
12099 -31573 -24452 -22104 -9666 -9179 -4148 -1524 10242 12417 5077 -8596 -3012 8613 3392 -7259
$$ packed form
12197E051r460j5208k669N564k215R835K453q704M91j053N60L163J0508k967j4401
12182a9052J6391K709O023J813p544o490J278l568k283o765M048R079K544o871
12168h688r896L786N324r649K487J2310J888K492r551m55j3107J2586N20J669
12154h284P728J605k147o037J462O405Q257j3764j2465o941J7679N171r135j6839
12140b7305J2486J2051J0332j6031J325J709J447k400P679O231j08k261O672p333
12126D494m243k396J124M07j1116J0382J669j1811p294J5559K6261N584j1153
12113A7467j5891k218J188K11j6007p805O497L459l466m496Q282L004j8018l780
12099c1573P121K348J2438M87N031K624J1766K175p340j3673N584J1625n221j0651
$$ plain form
12085 -7259 -8891 -6558 511 -6104 2059 2567 9541 16882 3367 -1407 3688 9969 8790 1478 -1063
12070 -1063 -403 -7890 -6545 -8780 -4696 -10440 -5584 -13425 -29484 -15123 16023 14230 11699 15602
12056 15602 8896 -18119 -21605 -746 14071 3572 -16409 -22058 -18046 -9366 -6813 -16205 -17694
12043 -17694 -20369 -15761 -6830 1292 -3325 591 9597 3502 1837 6834 851 8142 1652 2476 11897
12028 11897 9027 2485 -7632 -289 8572 9376 -869 -2781 11823 14529 2203 -2275 -3058 3274
12014 3274 8001 10603 12136 16772 19525 15157 11337 6569 2577 -6338 -2359 3614 4760 -4636 -7944
11999 -7944 -4152 -1199 2343 35 4424 22230 10838 -6702 -32180 -51520 -39383 -14835 2458
11986 2458 -2986 -774 10094 29 -6157 -645 -442 -3412 2722 -6483 -7027 -230 -3468 -2495 -2371
$$ packed form
12085g259j632K333P069o615Q163N08O974P341j3515m774N095O281j179p312k541
12070a063O60p487J345k235M084n744M856p841j6059J4361L1146j793k531L903
12056A5602o706k7015l486K0859J4817j0499j9981n649M012Q680K553r392j489
12043a7694k675M608Q931Q122m617L916R006o095j665M997n983P291o490Q24R421
12028A1897k870o542j0117P343Q861Q04j0245j912J4604K706j2326m478p83O332
12014C274M727K602J533M636K753m368l820m768l992q915L979N973J146r396l308
11999g944L792K953L542k308M389J7806j1392j7540k5478j9340J2137K4548J7293
11986B458n444K212J0868j0065o186N512K03k970O134r205n44O797l238R73J24
$$ plain form
11971 -2371 -7202 -86 7853 15660 21299 8668 3509 17839 11955 3622 5724 9962 3529 1990
11957 1990 -15322 -11998 -18673 -12260 -13382 -9127 -9986 -10446 -8910 -8442 -10926 -7690 1360 5226 -404
11942 -404 -5303 -13986 -1895 24754 16066 -1488 -4395 -21144 -35723 -43603 -37374 -20809 -17432
11929 -17432 -15078 116 419 -2407 -2247 3761 9163 1372 -12309 -10600 1297 6512 -347 -9959
11915 -9959 -14068 -18599 -15485 -16337 -19781 -6149 -11236 -5439 2477 -4957 -5873 -7624 -12366 -7369 -3405
11900 -3405 -4375 8014 22162 16096 -2148 6065 14692 25307 13502 1070 -141 5842 -8020
11887 -8020 -7925 -5809 -3543 1855 -603 -22245 -22477 -13448 -12079 -12174 -3766 -2583 -23199 -38301 -30867
11872 -30867 -24008 -19818 -20730 -14593 4426 23360 11910 -12118 -30005 -13841 -8377 -9036 2911
$$ packed form
11971b371m831P116P939P807N639j2631n159J4330n884q333K102M238o433j539
11957A990j7312L324o675O413j122M255q59m60J536M68k484L236R050L866n630
11942d04m899q683J2091K6649q688j7554k907j6749j4579p880O229J6565L377
11929a7432K354J5194L03k826J60O008N402p791j3681J709J1897N215o859r612
11915i959m109m531L114q52l444J3632n087N797P916p434r16j751m742M997L964
11900c405r70J2389J4148o066j8244Q213Q627J0615j1805j2432j211N983j3862
11887h020R5K116K266N398k458k1642k32R029J369r5Q408J183k0616j5102P434
11872c0867O859M190r12O137J9019J8934j1450k4028j7887J6164N464o59J1947
$$ plain form
11859 2911 5255 13992 13240 4875 8170 16386 10016 -3804 179 2896 6916 9569 6275 14359 4042
11844 4042 -4582 -9628 -19997 -6380 5780 18732 10555 10550 2848 -2933 -21667 -23409 -18346 -3708
11830 -3708 -4206 -5864 -4803 -1122 3644 1877 3759 1730 5321 17431 15226 6086 6690 -1616 -5192
11815 -5192 -4241 -6362 -2543 -4930 -923 -556 5544 -173 -871 9228 4999 3858 -3744 -7503 -4791
11800 -4791 -10281 -3578 6525 18184 27583 29080 18786 4280 7647 9685 5494 5921 3133 -14042
11786 -14042 -7489 11697 14989 8774 4630 6215 1094 -3419 -6762 -12327 -7535 8833 17861 10515
11772 10515 -901 -5477 -4406 -5595 -883 8227 2224 -3056 -2073 1075 17381 8305 5739 13242
11758 13242 12610 8191 1066 2773 2969 12965 11963 11161 28159 22164 5087 -5134 -9801 -2389
$$ packed form
11859B911K344Q737p52q365L295Q216o370j3820L983K717M020K653l294Q084j0317
11844D042q624n046j0369J3617J2160J2952q177np702n781j8734j742N063J4638
11830c708m98j658J061L681M766j767J882k029L591J2110k205r140O04q306l576
11815e192R51k121L819k387M007L67O100n717o98J0099m229j141p602l759K712
11800d791n490O703J0103J1659R399J497j0294j4506L367K038m191M27k788j7175
11786a4042O553J9186L292o215m144J585n121m513l343n565M792J6368R028p346
11772A0515j1416m576J071j189M712R110o003n280R83L148J6306r076k566P503
11758A3242o32m419p125J707J96R996j002q02J6998n995j7077j0221m667P412
$$ plain form
11744 -2389 -7684 52 -4579 -6438 -2945 -15788 -25941 -15946 -3328 -10008 -6279 1425 -6614 -4359
11730 -4359 127 8286 10559 13243 7384 3298 11458 9532 10868 11172 -5710 -16902 -1651 -760
11716 -760 -5256 -297 -1964 -11114 -25895 -18178 -7889 -5345 -7965 -9698 -10763 -4726 11072 19693
11702 19693 22946 11060 302 -969 3308 1929 10735 6670 5171 192 -2552 6424 7944 -10054
11688 -10054 -9363 8445 9704 -4232 -9067 7208 12580 22835 14460 102 10419 11789 -1897
11675 -1897 -16 -5282 -3598 16805 14261 7174 -1597 -13544 -12087 -17163 -15547 -25295 -21301 -12048
11661 -12048 -7264 -11176 -16153 -12957 -3473 6755 -4327 -17171 -7520 18957 30496 14362 -7469
11648 -7469 -13133 -7609 -1503 -10489 -22089 -33544 -38381 -15362 3113 10908 15242 4457 -7379
$$ packed form
11744b389n295P736m631j859L493j2843j0153R995J2618o680L729P704q039K255
11730d359M486Q159K273K684n859m086Q160j926J336L04j6882j1192J5251Q91
11716g60m496M959j667r150j4781P717J0289K544k620j733j065O037J5798Q621
11702A9693L253j1886j0758j271M277j379Q806m065j499m979k744Q976J520j7998
11688a0054O91J7808J259j3936m835J6275N372J0255q375j4358J0317J370j3686
11675a897J881n266J684K0403k544p087q771j1947J457n076J616r748L994R253
11661a2048M784l912m977L196R484J0228j1082j2844R651K6477J1539j6134k1831
11648g469n664N524O106q986j1600j1455m837K3019J8475P795M334j0785j1836
$$ plain form
11635 -7379 -2510 -4391 -7857 -7019 -1431 -12142 -28482 -19920 -12220 -16232 -15145 -3898 988 5833
11621 5833 4746 -2208 -537 -5439 -5428 -3786 -3070 -5069 -12451 -12265 -9734 -9347 -2125 -2611 -10910 -9041
11605 -9041 3392 6088 6564 -9205 -12770 -8524 3003 5264 -1118 3059 12975 8724 5600 -878
11591 -878 4809 7214 -157 8064 9212 2362 14573 5868 -3610 -6770 -8786 2449 5695 3012
11577 3012 758 3936 7413 7163 263 12030 15054 12812 16164 4578 556 -17398 -28063 -26969
11563 -26969 -11253 1251 -464 -8300 -8865 -1036 -10579 -16472 -20772 -22172 -17236 -9335 -5265 -15078
11549 -15078 -26255 -20099 -16351 -9287 -2788 -409 -4530 4990 3148 2291 3725 5132 454 -6398
11535 -6398 -9902 -5940 825 11940 5881 -14525 -9404 1576 -3643 -2746 6065 1802 -27421 -24486
$$ packed form
11635g379M869j881l466Q38N588j0711j6340Q562P700m012J087J1247M886M845
11621E833j087o954J671m902J1J642P16j999p382J86K531L87P222m86q299J869
11605i041J2433K696M76j5769l565M246J1527K261o382M177R916m251l124o478
11591h78N687K405p371Q221J148o850J2211q705r478l160k016J1235L246k683
11577C012k254L178L477k50o900J1767L024k242L352j1586m022j7954j0665J094
11563b6969J5716J2504j715p836n65P829r543n893m300j400M936P901M070r813
11549a5078j1177O156L748P064O499K379m121R520j842q57J434J407m678o852
11535f398l504L962O765J1115o059k0406N121J0980n219Q97Q811m263k9223K935
$$ plain form
11521 -24486 -17411 -8335 -9085 -20075 -28380 -24354 -13041 -8578 -4267 -11954 -6216 1854 3921 -119
11507 -119 3849 -5582 -6944 -11088 -19130 -22505 -18488 -7327 -10663 -156 3944 -420 1220 -3612
11493 -3612 -5966 -1761 13060 1702 -18509 -14383 -15609 -6830 3184 -689 -391 866 2093 1732
11479 1732 -3053 6110 12651 15347 8888 6960 6581 7468 1206 6504 6394 15399 13815 -6675 -16045
11464 -16045 -8186 -22044 -11336 -3686 -15374 -18353 -13644 755 -610 -7849 -15653 -14643 -10540
11451 -10540 -10098 1723 10592 18707 10944 17118 15777 6930 -7842 -12133 -15039 -13923 -13038 -13710 -24377
11436 -24377 -20646 -11947 -10883 -10692 -372 -1524 -5724 -5463 -10406 -20338 -25260 -17168 -15458 -10223 -2371
11421 -2371 -3736 -5056 -1566 -907 -7939 -20083 -27236 -20283 -1018 -5816 1561 11655 7593 -11861
$$ packed form
11521b4486P075R076p50j0990q305M026J1313M463M311p687N738Q070K067m040
11507a19L968r431j362m144q042l375M017J1161l336J0507M100m364J640m832
11493c612k354M205J4821j1358k0211M126j226Q779J0014l873K98J257J227l61
11479A732m785R163O541K696o459j928l79Q87o262N298j10R005j584k0490r370
11464a6045P859j3858J0708P650j1688k979M709J4399j365p239p804J010M103
11451a0540M42J1821Q869Q115p763O174j341q847j4772m291k906J116Q85o72j0667
11436b4377L731Q699J064J91J0320j152m200K61m943r932m922Q092J710N235P852
11421b371j365j320L490O59p032j2144p153O953J9265m798P377J0094m062j9454
$$ [...]
##END NTUPLES=NMR SPECTRUM
##END=
