##TITLE=Analysis number 312656
Compound Code sb 01297
Project Code qc-cat
Chemist Name new century
##JCAMPDX= 6.0         $$ Bruker NMR JCAMP-DX V2.0
##DATA TYPE= NMR SPECTRUM
##DATA CLASS= NTUPLES
##ORIGIN= Bruker BioSpin GmbH
##OWNER= NMR
$$ XWIN-NMR		Version 3.5
$$ Wed Aug 10 12:31:48 2005 GMT Daylight Time (UT+1h)  MAYBRIDGE\NMR@NMR_250MHZ
##.OBSERVE FREQUENCY= 250.131544655141
##.OBSERVE NUCLEUS= ^1H
##.ACQUISITION MODE= SIMULTANEOUS (DQD)
##.ACQUISITION SCHEME= undefined
##.AVERAGES= 16
##.DIGITISER RES= 18
##SPECTROMETER/DATA SYSTEM= dpx250
##.PULSE SEQUENCE= zg30
##.SOLVENT NAME= CDCl3
##.SHIFT REFERENCE= (INTERNAL, CDCl3, 0, 16.522)
##AUDIT TRAIL= $$ (NUMBER, WHEN, WHO, WHERE, WHAT)
$$ ##TITLE= Audit trail, XWIN-NMR		Version 3.5
$$ ##JCAMPDX= 5.01
$$ ##ORIGIN= Bruker BioSpin GmbH
$$ ##OWNER= NMR
$$ C:\u/data/dgb/nmr/ADRS/7460/pdata/1/auditp.txt
$$ ##AUDIT TRAIL=  $$ (NUMBER, WHEN, WHO, WHERE, WHAT)
(   1,<2005-08-10 12:31:30.17 +100>,<MAYBRIDGE\NMR>,<NMR_250MHZ>,
      <created by zg, POWCHK disabled, PULCHK disabled
       configuration hash MD5:
       62 19 C7 07 E1 42 D1 B7 37 6C 3D D0 77 39 F9 E6
       data hash MD5: 64K
       92 91 0F 46 9B 60 9C AB EF C0 E6 84 E9 E6 88 B5>)
(   2,<2005-08-10 12:31:41.48 +100>,<MAYBRIDGE\NMR>,<NMR_250MHZ>,
      <Start of raw data processing
       ef LB = 0.3 FT_mod = 6 PKNL = 1 SI = 32K 
       data hash MD5: 32K
       07 F3 D9 E0 B7 94 81 FE 60 A2 EB DF DC 8E D7 F4>)
(   3,<2005-08-10 12:31:43.23 +100>,<MAYBRIDGE\NMR>,<NMR_250MHZ>,
      <apk 
       data hash MD5: 32K
       23 39 7A A4 C7 76 26 14 9B 91 AF 25 C5 9A 9E E8>)
(   4,<2005-08-10 12:31:44.03 +100>,<MAYBRIDGE\NMR>,<NMR_250MHZ>,
      <abs ABSG = 5 
       data hash MD5: 32K
       9A CD DA 7C 00 75 26 8F C3 0B C2 68 4B 04 02 F6>)
$$ ##END=
$$ 
$$ hash MD5
$$ F0 F1 B4 0D 52 BE A1 3A 35 F0 0F 7B 70 63 A4 61
##$RELAX= 
##$RELAX= 
##$RELAX= 
##$RELAX= 
##$RELAX= 
##$RELAX= 
##$RELAX= 
$$ Bruker specific parameters
$$ --------------------------
##$DU= <C:\u>
##$EXPNO= 7460
##$NAME= <ADRS>
##$PROCNO= 1
##$TYPE= <nmr>
##$USER= <dgb>
##$AMP= (0..31)
100 100 100 100 100 100 100 100 100 100 100 100 100 100 100 100 100 100 
100 100 100 100 100 100 100 100 100 100 100 100 100 100 
##$AQSEQ= 0
##$AQ_mod= 3
##$AUNM= <au_zg>
##$AUTOPOS= <23 >
##$BF1= 250.13
##$BF2= 250.13
##$BF3= 250.13
##$BF4= 250.13
##$BF5= 500.13
##$BF6= 500.13
##$BF7= 500.13
##$BF8= 500.13
##$BYTORDA= 1
##$CFDGTYP= 0
##$CFRGTYP= 5
##$CHEMSTR= <none>
##$CNST= (0..31)
1 1 145 1 1 1 1 1 1 1 1 1 1 1 1 1 1 1 1 1 1 1 1 1 1 1 1 1 1 1 1 1 
##$CPDPRG= <>
##$CPDPRG1= <>
##$CPDPRG2= <>
##$CPDPRG3= <>
##$CPDPRG4= <mlev>
##$CPDPRG5= <mlev>
##$CPDPRG6= <mlev>
##$CPDPRG7= <mlev>
##$CPDPRG8= <mlev>
##$CPDPRGB= <>
##$CPDPRGT= <>
##$D= (0..31)
0 1 0 0 0 0 0 0 0 0.06 0 0 0 0 0 0 0.0002 0 0 0 0 0 0 0 0 0 0 0 0 0 0 
0 
##$DATE= 1123673489
##$DBL= (0..7)
120 120 120 120 120 120 120 120 
##$DBP= (0..7)
150 150 150 150 150 150 150 150 
##$DBP07= 0
##$DBPNAM0= <>
##$DBPNAM1= <>
##$DBPNAM2= <>
$$ [...]
##$SUBNAM7= <"">
##$SUBNAM8= <"">
##$SUBNAM9= <"">
##$SW= 20.6930455092707
##$SWIBOX= (0..15)
0 0 3 0 0 0 0 0 0 0 0 0 0 0 0 0 
##$SW_h= 5175.983436853
##$TD= 65536
##$TD0= 1
##$TE= 295.16
##$TE2= 300
##$TE3= 300
##$TEG= 300
##$TL= (0..7)
0 120 120 120 120 120 120 120 
##$TP= (0..7)
150 150 150 150 150 150 150 150 
##$TP07= 0
##$TPNAME0= <>
##$TPNAME1= <>
##$TPNAME2= <>
##$TPNAME3= <>
##$TPNAME4= <>
##$TPNAME5= <>
##$TPNAME6= <>
##$TPNAME7= <>
##$TPOAL= (0..7)
0.5 0.5 0.5 0.5 0.5 0.5 0.5 0.5 
##$TPOFFS= (0..7)
0 0 0 0 0 0 0 0 
##$TUNHIN= 0
##$TUNHOUT= 0
##$TUNXOUT= 0
##$USERA1= <user>
##$USERA2= <user>
##$USERA3= <user>
##$USERA4= <user>
##$USERA5= <user>
##$V9= 5
##$VALIST= <valist>
##$VCLIST= <CCCCCCCCCCCCCCC>
##$VD= 0
##$VDLIST= <DDDDDDDDDDDDDDD>
##$VPLIST= <PPPPPPPPPPPPPPP>
##$VTLIST= <TTTTTTTTTTTTTTT>
##$WBST= 1024
##$WBSW= 4
##$XGAIN= (0..3)
0 0 0 0 
##$XL= 0
##$YL= 0
##$YMAX_a= 351724
##$YMIN_a= -429552
##$ZGOPTNS= <>
##$ZL1= 120
##$ZL2= 120
##$ZL3= 120
##$ZL4= 120
##$ABSF1= 16.522
##$ABSF2= -4.171173
##$ABSG= 5
##$ABSL= 3
##$ALPHA= 0
##$AQORDER= 0
##$ASSFAC= 0
##$ASSFACI= 0
##$ASSFACX= 0
##$ASSWID= 0
##$AUNMP= <proc_1d>
##$AZFE= 0.1
##$AZFW= 0.1
##$BCFW= 0
##$BC_mod= 0
##$BYTORDP= 0
##$COROFFS= 0
##$CY= 12.5
##$DATMOD= 1
##$DC= 0
##$DFILT= <>
##$DTYPP= 0
##$F1P= 14.0000005364418
##$F2P= -0.99999901652339
##$FCOR= 0.5
##$FTSIZE= 32768
##$FT_mod= 6
##$GAMMA= 0
##$GB= 0
##$INTBC= 1
##$INTSCL= 1
##$ISEN= 128
##$LB= 0.3
##$LEV0= 0
##$LPBIN= 0
##$MAXI= 10000
##$MC2= 0
##$MEAN= 0
##$ME_mod= 0
##$MI= 0
##$NCOEF= 0
##$NC_proc= -3
##$NLEV= 6
##$NOISF1= 0
##$NOISF2= 0
##$NSP= 0
##$NTH_PI= 0
##$NZP= 0
##$OFFSET= 16.522
##$PC= 1
##$PHC0= -81.21992
##$PHC1= 9.544246
##$PH_mod= 1
##$PKNL= yes
##$PPARMOD= 0
##$PSCAL= 4
##$PSIGN= 0
##$REVERSE= no
##$SF= 250.13
##$SI= 32768
##$SIGF1= 0
##$SIGF2= 0
##$SINO= 400
##$SIOLD= 32768
##$SREGLST= <1H.CDCl3>
##$SSB= 0
##$STSI= 32768
##$STSR= 0
##$SW_p= 5175.98343685301
##$SYMM= 0
##$S_DEV= 0
##$TDeff= 65536
##$TDoff= 0
##$TI= <Analysis number 999999
Compound Code 99
Book Reference 9
Project Code 9>
##$TILT= no
##$TM1= 0
##$TM2= 0
##$TOPLEV= 0
##$USERP1= <user>
##$USERP2= <user>
##$USERP3= <user>
##$USERP4= <user>
##$USERP5= <user>
##$WDW= 1
##$XDIM= 32768
##$YMAX_p= 417625841
##$YMIN_p= -929967
$$ End of Bruker specific parameters
$$ ---------------------------------
##NTUPLES= NMR SPECTRUM
##VAR_NAME=  FREQUENCY,     SPECTRUM/REAL,   SPECTRUM/IMAG
##SYMBOL=    X,             R,               I
##VAR_TYPE=  INDEPENDENT,   DEPENDENT,       DEPENDENT
##VAR_FORM=  AFFN,          ASDF,            ASDF
##VAR_DIM=   32768,         32768,           32768
##UNITS=     HZ,            ARBITRARY UNITS, ARBITRARY UNITS
##FACTOR=    0.157963299565203, 1,           1
##FIRST=     4132.6476996994, 0,             0
##LAST=      -1043.33573715361, 0,           0
##MIN=       -1043.33573715361, -929967,     0
##MAX=       4132.6476996994, 417625841,     0
$$ Real data points
##PAGE= N=1
##DATA TABLE= (X++(R..R)), XYDATA
$$ [...]
$$ plain form
18517 -29451 -18391 10946 39161 43020 26881 12475 759 -5033 -11341 -3606 5861 -18949 -18410
18504 -18410 -8866 -26633 227 22278 43458 48140 14758 -2567 -5366 6349 -2014 9503
18492 9503 20888 16822 12948 -980 -29377 -10786 7717 10471 3416 19275 43598 53223 44871
18479 44871 39222 23708 14172 40549 73257 43682 10702 -12071 -5460 -783 26562 42058
18467 42058 33647 1828 -3147 -8479 10681 7714 12742 7513 -27043 -3887 2549 -27676 -39574
18454 -39574 -19091 8101 21616 4351 -29302 -13127 -8681 -5148 3339 36635 36585 -13551 -22834
18441 -22834 -10433 -6652 -11757 -8413 -27281 -44864 -23470 -19217 -6070 13817 1054 -6483 6984
18428 6984 -5434 -3771 3371 -21544 -19908 19624 -2046 9147 36737 24592 7972 -8399
$$ packed form
18517b9451J1060K9337K8215L859j6139j4406j1716n792o308P735R467k4810N39
18504a8410R544j7767K6860K2051K1180M682l3382j7325k799J1715q363J1517
18492I503J1385m066l874j3928k8397J8591J8503K754p055J5859K4323R625q352
18479D4871n649j5514r536K6377L2708k9575l2980k2773O611M677K7345J5496
18467D2058q411l1819m975n332J9160k967N028n229l4556K3156O436l0225j1898
18454c9574K0483K7192J3515j7265l3653J6175M446L533Q487L3296n0n0136r283
18441b2834J2401L781n105L344j8868j7583K1394M253J3147J9887j2763p537J3467
18428F984j2418J663P142k4915J636L9532k1670J1193K7590j2145j6620j6371
$$ plain form
18416 -8399 -4137 -7169 12621 14677 15582 23379 7582 -11524 2336 47777 61175 42228 29232
18403 29232 9540 -16161 -27229 -35022 -30729 -5284 -9386 -29194 -51126 -31310 -24470 -37109
18391 -37109 -57346 -50026 -25974 -20059 17708 33980 17455 20792 12413 4345 33427 56433 37092
18378 37092 2937 -15068 -46492 -39612 -21587 189 -8499 -2281 -4934 -21947 -17057 -4326 -16862
18365 -16862 -7333 -15536 22557 30446 13598 3429 16568 4299 -15676 -6441 -3447 -6363 1100
18352 1100 395 -5272 18321 7097 9225 36620 41087 44355 32744 24608 36077 12321 -16129
18339 -16129 -34925 -17702 11627 4585 5071 37212 50533 57448 68083 60208 32493 21585 21235
18326 21235 15127 -1077 19329 44502 49111 20761 -18477 -14939 6615 16229 17807 9024 -4722
$$ packed form
18416h399M262l032J9790K056R05P797j5797j9106J3860M5441J3398j8947j2996
18403B9232j9692k5701j1068p793M293K5445m102j9808k1932J9816O840j2639
18391c7109k0237P320K4052N915L7767J6272j6525L337q379q068K9082K3006j9341
18378C7092l4155j8005l1424O880J8025K1776q688O218k653j7013M890J2731j2536
18365a6862R529q203L8093P889j6848j0169J3139j2269j9975R235K994k916P463
18352A100p05n667K3593j1224K128K7395M467L268j1611q136J1469k3756k8450
18339a6129j8796J7223K9329p042M86L2141J3321O915J0635p875k7715j0908l50
18326B1235o108j6204K0406K5173M609k8350l9238L538K1554R614J578q783j3746
$$ plain form
18313 -4722 -20533 -18023 -3444 -7402 -5492 14092 27382 40454 21767 24640 16726 5769 30571
18300 30571 31807 39646 41759 43021 59491 56121 21216 20155 48514 67361 67731 62486 53060 37598
18286 37598 3890 18454 -11232 -29867 -30903 -21603 124 7820 5363 35870 69997 96228
18274 96228 87922 73176 36999 854 -8975 -822 8114 -7728 16526 40102 42804 71114 119556
18261 119556 143627 155443 117328 87883 77112 63958 96734 135813 109407 67984 45613
18250 45613 60621 68925 36239 21046 35062 51954 43414 39527 50451 85541 110566 106143
18238 106143 88662 82152 92913 112987 117066 99786 125566 157023 164049 145392 141789 153902
18226 153902 170992 179076 175353 163264 171084 209463 244488 262476 287725 309217 319996 359976
$$ packed form
18313d722j5811K510J4579l958J910J9584J3290J3072j8687K873p914j0957K4802
18300C0571J236P839K113J262J6470l370l4905j061K8359J8847L70n245r426j5462
18286C7598l3708J4564k9686j8635j036R300K1727P696k457L0507L4127K6231
18274I6228q306j4746l6177l6145r829Q153Q936j5842K4254K3576K702K8310M8442
18261A19556K4071J1816l8115k9445j0771j3154L2776L9079k6406m1423k2371
18250D5613J5008Q304l2686j5193J4016J6892q540l887J0924L5090K5025m423
18238A06143j7481o510J0761K0074M079j7280K5780L1457P026j8657l603J2113
18226A53902J7090Q084l723j2089P820L8379L5025J7988K5249K1492J0779L9980
$$ plain form
18214 359976 380560 415917 410308 399855 429667 449476 468421 453487 411661 358556 330369 301367
18202 301367 253434 201896 199559 193574 155693 120256 112223 120222 81634 56115 59870 93675
18190 93675 107753 91197 86847 81536 88174 68107 73903 64147 57282 90168 105730 116211 95971
18177 95971 110362 137011 158272 147192 131141 136320 119089 88308 98371 122038 137707 118330
18165 118330 119462 120894 95744 120297 161470 160985 149383 163885 211023 219676 234951 240339 240352
18152 240352 274255 322060 349272 380732 383567 428969 471761 502899 508336 538492 600226 677190
18140 677190 752670 868718 962117 1082927 1174328 1273098 1379343 1469977 1547324 1640522 1749023
18129 1749023 1874670 2004022 2206978 2451852 2732642 3039551 3376074 3755778 4090971
$$ packed form
18214C59976K0584L5357n609j0453K9812J9809J8945j4934m1826n3105k8187k9002
18202C01367m7933n1538k337n985l7881l5437q033P999l8588k5519L755L3805
18190I3675J4078j6556m350n311O638k0067N796r756o865L2886J5562J0481k0240
18177I5971J4391K6649K1261j1080j6051N179j7231l0781J0063K3667J5669j9377
18165A18330J132J432k5150K4553M1173m85j1602J4502M7138Q653J5275N388J3
18152B40352L3903M7805K7212L1460K835M5402M2792L1138N437L0156O1734P6964
18140F77190P5480J16048R3399J20810R1401R8770J06245R0634P7347R3198J08501
18129A749023J25647J29352K02956K44874K80790L06909L36523L79704L35193
$$ plain form
18120 4090971 4338044 4523693 4686265 4945444 5348139 5962352 6956959 8601710 11184909
18111 11184909 14788948 19151506 25184709 33219374 40666316 44741484 41786254 30927063
18103 30927063 21924259 15017182 10143992 7073124 5169813 3910537 3029842 2363710
18095 2363710 1871670 1485691 1214119 1024218 904907 831010 744870 649394 565081 496248
18085 496248 448173 420773 397080 385354 349248 294257 296860 294200 245561 216534 214587 208481
18073 208481 209741 215769 205384 172911 137941 131435 104585 85254 99972 110057 89983 67811
18061 67811 75563 80206 83978 79408 62618 47202 36331 29293 46186 69890 87988 101913 86008
18048 86008 72138 80552 88772 89605 69615 77369 97040 96833 80387 79105 62904 63064 49123 39937
$$ packed form
18120D090971K47073J85649J62572K59179M02695O14213R94607J644751K583199
18111A1184909L604039M362558O033203Q034665P446942M075168k955230j0859191
18103C0927063r002804o907077m873190l070868j903311j259276q80695o66132
18095B363710m92040l85979k71572j89901j19311p3897q6140r5476q4313o8833
18085D96248m8075k7400k3693j1726l6106n4991K603k660m8639k9027j947o106
18073B08481J260O028j0385l2473l4970o506k6850j9331J4718J0085k0074k2172
18061F7811P752M643L772m570j6790j5416j0871p038J6893K3704J8098J3925j5905
18048H6008j3870Q414Q220Q33j9990P754J9671k07j6446j282j6201J60j3941r186
$$ plain form
18034 39937 65511 71951 49550 45775 24273 29961 36817 10122 21380 14783 29156 39987 32840
18021 32840 30769 34075 25031 20513 37279 32700 29066 17748 13984 13215 -2907 -11769 22016 47381
18007 47381 44650 33536 25528 12041 4108 22287 7979 13096 24255 19274 -13208 -51604 -38265
17994 -38265 -15928 28517 30462 22459 3155 -18927 -37935 -5165 45536 87608 69100 38705
17982 38705 39209 41794 29999 15010 25998 38953 56536 27161 6199 24474 8053 -11409
17970 -11409 10183 29171 6445 -7930 -19428 -31456 -33320 -41030 -75543 -88403 -66146 -83553
17958 -83553 -81618 -76515 -83399 -100665 -121134 -138404 -157651 -170411 -128662 -107508 -105739 -82321
17946 -82321 -29865 -3385 4761 20873 72722 94395 104851 93952 92204 77502 51213 53170
$$ packed form
18034C9937K5574O440k2401l775k1502N688O856k6695J1258o597J4373J0831p147
18021C2840k071L306r044m518J6766m579l634j1318l764p69j6122q862L3785K5365
18007D7381k731j1114q008j3487p933J8179j4308N117J1159m981l2482l8396J3339
17994c8265K2337M4445J945q003j9304k2082j9008L2770N0701M2072j8508l0395
17982C8705N04K585j1795j4989J0988J2955J7583k9375k0962J8275j6421j9462
17970a1409K1592J8988k2726j4375j1498j2028j864p710l4513j2860K2257j7407
17958h3553J935N103o884j7266k0469j7270j9247j2760M1749K1154J769K3418
17946h2321N2456K6480Q146J6112N1849K1673J0456j0899j748j4702k6289J957
$$ plain form
17934 53170 74237 85845 72946 57435 45803 20063 6915 1462 8136 14154 4729 28895
17922 28895 48940 56544 47457 60496 35213 25871 21793 14328 43809 67573 58180 54564 27810
17909 27810 23085 -6368 6381 41617 61698 60925 78500 78608 65168 65065 66674 24777 5217
17896 5217 6335 15846 55060 91982 92219 64562 41770 41103 60596 81962 85000 82998 95655
17883 95655 95886 65181 71584 76978 48624 -4342 -11729 -1526 15527 19925 17602 23610 30658
17870 30658 32361 41868 43466 33481 43180 48376 40917 34067 29219 26253 25001 24945 23501 6766 970
17855 970 -2270 43948 41643 53149 66639 30162 66330 96316 90510 77256 91899 84260 63053
17842 63053 39663 15019 26138 65516 45716 28113 24624 57701 67852 57772 81684 66301
$$ packed form
17934E3170K1067J1608j2899j5511j1632k5740j3148n453O674O018r425K4166
17922B8895K0045P604r087J3039k5283r342m078p465K9481K3764r393l616k6754
17909B7810m725k9453J2749L5236K0081p73J7575J08j3440j03J609m1897j9560
17896E217J118R511L9214L6922K37k7657k2792o67J9493K1366L038k002J2657
17883I5655K31l0705O403N394k8354n2966p387J0203J7053M398k323O008P048
17870C0658J703R507J598r985R699N196p459o850m848k966j252n6j444j6735n796
17855I70l240M6218k305J1506J3490l6477L6168K9986n806j3254J4643p639k1207
17842F3053k3390k4644J1119L9378j9800j7603l489L3077J0151j0080K3912j5383
$$ plain form
17830 66301 20098 9929 46020 64640 76350 85698 76911 93113 83294 43003 30002 46540
17818 46540 42390 41011 42011 40734 14390 12052 44755 47926 21965 16277 59655 97309 124652
17805 124652 143486 125993 126281 138342 134610 153170 161905 185703 200571 200946 211992 209330 198404
17792 198404 190057 207621 219381 242692 235367 187756 175601 168358 197588 224893 200402 172139
17780 172139 197111 228340 224593 221558 216541 216613 200387 208730 202214 189773 164934 184767 206760
17767 206760 213086 210360 211043 204438 203037 225497 204330 192165 187602 174750 182382 199736 179843
17754 179843 176595 158466 175773 205694 211942 192256 183994 190755 186107 201965 198183 205227 200726
17741 200726 154592 138754 155339 171198 166373 199901 212672 229174 208530 203900 240894 238569
$$ packed form
17830F6301m6203j0169L6091J8620J1710R348q787J6202r819m0291j3001J6538
17818D6540m150j379J000j277k6344k338L2703L171k5961n688M3378L7654K7343
17805A24652J8834j7493K88J2061l732J8560Q735K3798J4868L75J1046k662j0926
17792A98404q347J7564J1760K3311p325m7611j2155p243K9230K7305k4491k8263
17780A72139K4972L1229l747l035n017P2j6226Q343o516j2441k4839J9833K1993
17767B06760O326k726O83o605j401K2460k1167j2165m563j2852P632J7354j9893
17754A79843l248j8129J7307K9921O248j9686q262O761m648J5858l782P044m501
17741B00726m6134j5838J6585J5859m825L3528J2771J6502k0644m630L6994k325
$$ plain form
17729 238569 233587 225050 204308 185575 189168 190025 212808 202056 199199 209521 199696 198638 215148
17716 215148 217341 239680 254372 245763 218445 253545 283430 305307 315292 330264 319948 327564
17704 327564 369027 381803 387347 422030 468476 507988 520793 551299 596835 616518 608971 621914
17692 621914 651091 734521 820006 837948 871988 926749 989106 1079861 1181395 1266453 1381333
17681 1381333 1507999 1619488 1746738 1921263 2102673 2263507 2479880 2739401 2989466
17672 2989466 3225537 3484378 3760287 4082891 4402599 4760736 5150733 5557666 5983808
17663 5983808 6448022 6962604 7546258 8184043 8876409 9672747 10609087 11692212 13018117
17654 13018117 14638840 16667914 19176542 22158556 25522339 29076818 32608044 36112430
$$ packed form
17729B38569m982q537k0742j8733L593Q57K2783j0752k857J0322r825j058J6510
17716B15148K193K2339J4692q609k7318L5100K9885K1877R985J4972j0316P616
17704C27564M1463J2776N544L4683M6446L9512J2805L0506M5536J9683p547J2943
17692F21914K9177Q3430Q5485J7942L4040N4761O2357R0755J01534Q5058J14880
17681A381333J26666J11489J27250J74525J81410J60834K16373K59521K50065
17672B989466K36071K58841K75909L22604L19708L58137L89997M06933M26142
17663E983808M64214N14582N83654O37785O92366P96338R36340J083125J325905
17654A3018117J620723K029074K508628K982014L363783L554479L531226L504386
$$ plain form
17646 36112430 39663339 43695511 48395904 53442930 57827713 60720823 61450662 60275109
17638 60275109 59109848 58461483 58353203 57842179 56006416 51858627 46022151 40158921
17630 40158921 34747453 30319935 26607069 23131879 19538921 16017207 12803486 10063732
17622 10063732 7904579 6264823 5056366 4216376 3635595 3146365 2736880 2414684 2147675
17613 2147675 1919363 1753436 1640306 1508826 1388897 1273807 1148777 1049109 986161 931975
17603 931975 841751 772651 715391 622804 556601 533146 530243 484417 453232 416919 378161 350342
17591 350342 335494 295522 273325 246170 221563 204701 171056 162307 152268 151076 165869 145489
17579 145489 144503 145022 136174 103852 77611 82330 72642 64500 82200 89873 109978 138991 146720
$$ packed form
17646C6112430L550909M032172M700393N047026M384783K893110P29839j175553
17638F0275109j165261o48365j08280n11024j835763m147789n836476n863230
17630D0158921n411468m427518l712866l475190l592958l521714l213721k739754
17622A0063732k159153j639756j208457q39990n80781m89230m09485l22196k67009
17613B147675k28312j65927j13130j31480j19929j15090j25030r9668o2948n4186
17603I31975r0224o9100n7260r2587o6203k3455k903m5826l1185l6313l8758k7819
17591C50342j4848l9972k2197k7155k4607j6862l3645q749j0039j192J4793k0380
17579A45489r86N19q848l2322k6241M719r688q142J7700P673K0105K9013P729
$$ plain form
17566 146720 114391 81503 56848 53543 65999 85223 52617 57717 90420 94647 84344 71130
17554 71130 60676 43149 33211 72454 81437 88249 87980 56869 22567 8115 41777 39045 24777
17541 24777 8822 12206 33983 39568 55520 55833 62639 73000 66517 25720 26710 23646 15957 19812
17527 19812 27223 41252 29854 7540 6074 23056 42494 31738 17249 22738 37499 30393
17515 30393 22108 25366 23147 -17254 -45461 -90265 -94834 -46786 -9157 -11034 -25822 -60538 -71676
17502 -71676 -37437 -1940 1195 -37801 -67016 -65226 -65764 -62490 -63624 -70931 -92266 -104490 -136674
17489 -136674 -156702 -179117 -164407 -129532 -109451 -108744 -110970 -72165 -42178 -40333 -23044 -25341
17477 -25341 -50028 -42226 -33544 -33227 -22951 -1572 3218 5521 26215 11346 -8168 12815 31826
$$ packed form
17566A46720l2329l2888k4655l305J2456J9224l2606N100L2703M227j0303j3214
17554G1130j0454j7527r938L9243Q983O812k69l1111l4302j4452L3662k732j4268
17541B4777j5955L384K1777N585J5952L13O806J0361o483m0797R90l064p689L855
17527A9812P411J4029j1398k2314j466J6982J9438j0756j4489N489J4761p106
17515C0393q285L258k219m0401k8207m4804m569M8048L7629j877j4788l4716j1138
17502g1676L4239L5497L135l8996k9215J790n38L274j134p307k1335j2224l2184
17489a36674k0028k2415J4710L4875K0081P07k226L8805K9987J845J7289k297
17477b5341k4687P802Q682L17J0276K1379M790K303K0694j4869j9514K0983J9011
$$ plain form
17464 31826 18806 -3189 10536 37628 59378 54127 49691 50513 63030 56845 49071 14310 -17743
17451 -17743 20333 56847 73539 76217 59238 61789 78491 121584 188511 197827 195733 212247
17439 212247 182998 101915 53286 20529 -7205 -15430 12251 -556 -16736 -33340 -29488 -47156
17427 -47156 -35009 6717 9332 17010 14001 -3396 -26229 -21904 -15571 -8838 -5590 -23528 -36663
17414 -36663 -10700 -25238 -50277 -57161 -25061 -19706 18336 60486 49408 34965 11828 5122
17402 5122 -4341 -2542 -10300 -23563 -17584 -30085 -37022 -26113 11039 12219 4717 1883 565 -8988
17388 -8988 -30530 -22831 -16436 -14961 -12867 25056 36313 16288 -16896 -32815 -28529 -15215 -2186
17375 -2186 -7888 -14440 -19443 -9088 -27547 -26064 -15826 -34298 -43741 -49431 -51318 -36596 -33108
$$ packed form
17464C1826j3020k1995J3725K7092K1750n251m436Q22J2517o185p774l4761l2053
17451a7743L8076L6514J6692K678j6979K551J6702M3093O6927R316k094J6514
17439B12247k9249q1083m8629l2757k7734q225K7681j2807j6180j6604L852j7668
17427d7156J2147M1726K615P678l009j7397k2833M325O333O733L248j7938j3135
17414c6663K5963j4538k5039o884L2100N355L8042M2150j1078j4443k3137o706
17402E122r463J799p758j3263N979j2501o937J0909L7152J180p502k834j318r553
17388h988k1542P699O395J475K094L7923J1257k0025l3184j5919M286J3314J3029
17375b186n702o552n003J0355j8459J483J0238j8472r443n690j887J4722L488
$$ plain form
17362 -33108 -29831 -13747 -22250 -28279 -40050 -39381 -28949 -21437 -16074 118 -21317 -23507 -18868
17349 -18868 -15490 -3803 5279 -16638 -5182 22330 37894 54233 48235 46443 11061 -8046
17337 -8046 -14251 4269 2074 -323 13983 6473 4991 7177 12277 -122 6346 20790 9991
17324 9991 -7585 11735 18440 -5874 -28725 -35566 -23907 -7732 -305 -17258 -34060 -12175
17312 -12175 -702 9538 -10381 -14891 -29481 -15164 5589 9426 -5991 -16499 -4744 -15256
17300 -15256 -23116 -37461 -19543 -325 6046 35042 43007 66409 64043 44377 9279 13435 36275
17287 36275 2551 6918 -590 7687 9882 27367 39354 -9984 -10950 -7984 -30332 -37966 -42734
17274 -42734 -30848 -32290 -54586 -49659 -34475 -38568 -12664 -9019 -11278 -30419 -32672 -37607 -11650
$$ packed form
17362c3108L277J6084q503o029j1771O69J0432P512N363J6192k1435k190M639
17349a8868L378J1687R082k1917J1456K7512J5564J6339n998j792l5382j9107
17337h046o205J8520k195k397J4306p510j482K186N100j2399O468J4444j0799
17324I991j7576J9320O705k4314k2851o841J1659J6175P427j6953j6802K1885
17312a2175J1473J0240j9919m510j4590J4317K0753L837j5417j0508J1755j0512
17300a5256p860j4345J7918J9218O371K8996P965K3402k366j9666l5098M156K2840
17287C6275l3724M367p508Q277K195J7485J1987m9338r66K966k2348p634m768
17274d2734J1886j442k2296M927J5184m093K5904L645k259j9141k253m935K5957
$$ plain form
17261 -11650 -18848 -43561 -26301 10680 12383 198 -13170 -21863 -28446 -43592 -29235 -24112 -18236
17248 -18236 -25104 18934 6303 -9032 17192 4604 -5759 -2745 -14981 -45213 -35018 -21201
17236 -21201 -10321 -14386 -11938 -24238 -21934 4392 9790 28940 25031 30050 -3347 -28089 -45883
17223 -45883 -18859 26142 23932 -12301 -23401 -50053 -48556 -67894 -94102 -74511 -72532 -51144
17211 -51144 -39275 -37489 -38141 -58713 -82361 -66213 -41567 -22402 -4676 -22875 -42994 -72523
17199 -72523 -74242 -61071 -45988 -37720 -42444 -52848 -39752 -58234 -26333 -12236 -21574 -21938 1704
17186 1704 -10296 -29184 -21627 -50458 -38041 -10051 -12691 -24890 -44670 -52469 -62305 -39249 -13388
17173 -13388 8241 -14081 -25770 -13336 -1660 -23859 -31929 31941 39403 17419 6640 25865
$$ packed form
17261a1650p198k4713J7260L6981J703j2185j3368q693o583j5146J4357N123N876
17248a8236o868M4038j2631j5335K6224j2588j0363L014j2236l0232J0195J3817
17236b1201J0880m065K448j2300K304K6326N398J9150l909N019l3397k4742j7794
17223d5883K7024M5001k210l6233j1100k6652J497j9338k6208J9591J979K1388
17211e1144J1869J786o52k0572k3648J6148K4646J9165J7726j8199k0119k9529
17199g2523j719J3171J5083Q268m724j0404J3096j8482L1901J4097r338l64K3642
17186A704j2000j8888P557k8831J2417K7990k640j2199j9780p799r836K3056K5861
17173a3388K1629k2322j1689J2434J1676k2199q070O3870P462k1984j0779J9225
$$ plain form
17161 25865 28299 9895 -17480 -39332 -61491 -29533 -14822 -13320 3647 19250 22427 27007
17149 27007 13426 -6504 -2226 11403 3899 -2283 2504 -13527 1580 4820 -23333 -31259 657
17136 657 30796 36881 16558 17299 16242 6386 25021 40517 11225 -17878 -27272 -39070 -23923
17123 -23923 -36166 6350 23170 -10146 -14582 -7282 -4271 11448 29429 20158 4909 22551
17111 22551 28983 28666 16096 -14313 -8261 -1059 4289 19445 9410 21727 58749 66175 46498
17098 46498 44695 27346 24587 20550 24200 18791 25636 33228 1990 -6827 11382 24897 54357
17085 54357 54816 41728 31092 27870 14898 -3297 5221 27466 69282 77836 76881 62490 47064
17072 47064 41726 97049 119902 143220 147796 189026 224726 235701 249802 297374 359569 373617
$$ packed form
17161B5865K434j8404k7375k1852k2159L1958J4711J502J6967J5603L177M580
17149B7007j3581j9930M278J3629p504o182M787j6031J5107L240k8153p926L1916
17136F57L0139O085k0323P41j057r856J8635J5496k9292k9103r394j1798J5147
17123b3923j2243M2516J6820l3316m436P300L011J5719J7981r271j5249J7642
17111B2551O432l17j2570l0409O052P202N348J5156j0035J2317L7022P426j9677
17098D6498j803j7349k759m037L650n409O845P592l1238q817J8209J3515K9460
17085E4357M59j3088j0636l222j2972j8195Q518K2245M1816Q554r55j4391j5426
17072D7064n338N5323K2853K3318M576M1230L5700J0975J4101M7572O2195J4048
$$ plain form
17060 373617 343507 345329 320236 327333 332508 317117 311037 307243 269428 215156 200287 206931 186576
17047 186576 142955 91109 52584 50070 48273 24424 28233 14484 5292 20586 41055 35473
17035 35473 14581 -26437 -14956 -16917 -26704 -11677 -23298 -16381 -10424 -10459 20585 27003 1942
17022 1942 14496 32026 50106 42839 -10152 -34300 -35515 -32580 -50909 -61151 -46902 -33532
17010 -33532 -44356 -33251 -31847 -21203 -28759 -22771 -31732 -41558 -50276 -30717 -15757 -660 25130
16997 25130 17575 22917 8347 -7724 -15178 -4601 -1580 6951 12875 -8639 -32904 -54871 -62307
16984 -62307 -40701 -37058 -29749 2538 -435 -3347 17228 -7618 -31898 -20061 -729 -6199 10987
16971 10987 30033 30993 14171 -7726 -34398 -64546 -43728 -32971 -29559 -20276 -24449 -16550 -24082
$$ packed form
17060C73617l0110J822k5093P097N175j5391o080l794l7815n4272j4869O644k0355
17047A86576m3621n1846l8525k514j797k3849L809j3749r192J5294K0469n582
17035C5473k0892m1018J1481j961r787J5027j1621O917N957l5L1044O418k5061
17022A942J2554J7530J8080p267n2991k4148j215K935j8329j0242J4249J3370
17010c3532j0824J1105J404J0644p556N988q961r826q718J9559J4960J5097K5790
16997B5130p555N342j4570j6071p454J0577L021Q531N924k1514k4265k1967p436
16984f2307K1606L643P309L2287k973k912K0575k4846k4280J1837J9332n470J7186
16971A0987J9046R60j6822k1897k6672l0148K0818J0757L412R283m173P899p532
$$ plain form
16958 -24082 -33617 -21072 -37924 -47710 -55709 -40379 -18312 -17350 -8771 14993 47790 38245 -1348
16945 -1348 5010 -1239 -26313 3866 12281 -22239 -25933 -49834 -53309 -41612 -47692 -31740 -9191
16932 -9191 -1254 28611 15268 19145 30743 11642 5712 -15382 -32070 -11314 17824 30104
16920 30104 15794 -13642 -28962 -21493 -20852 -19859 -15735 -14515 4485 -17796 -51085 -48028 -26393
16907 -26393 -10881 -22789 -33466 -17263 -17297 -11901 2164 -2139 -23685 -43910 -26148 4081 1155
16894 1155 -15302 -32255 -27570 6788 25937 18727 5935 1661 -7240 -32861 -25519 354 -572
16881 -572 -30914 -18759 -5806 -20267 8027 22551 28010 24550 10667 10826 13444 10365 11149 18038
16867 18038 4268 942 536 3270 6272 -10947 -20422 -5469 -15222 -39260 -39248 -40610 -10655 -9234
$$ packed form
16958b4082r535J2545j6852r786p999J5330K2067R62Q579K3764L2797r545l9593
16945a348O358o249k5074L0179Q415l4520l694k3901l475J1697o080J5952K2549
16932i191P937K9865j3343L877J1598j9101n930k1094j6688K0756K9138J2280
16920C0104j4310k9436j5320P469O41R93M124J220J9000k2281l3289L057K1635
16907b6393J5512j1908j0677J6203l4N396J4065m303k1546k0225J7762L0229k926
16894A155j6457j6953M685L4358J9149p210j2792m274q901k5621P342K5873r26
16881e72l0342J2155J2953j4461K8294J4524N459l460j3883J59K618l079P84O889
16867A8038j3770l326m06K734L002j7219r475J4953r753k4038J2j362K9955J421
$$ plain form
16853 -9234 -8680 5691 11682 1362 -10923 -16779 -19778 -2305 -15174 -10064 10322 40940 56740
16840 56740 60257 65398 37715 23853 6324 1326 -4872 4152 7773 6699 22507 13698 13480 -785
16826 -785 -20486 -48095 -61592 -49900 -27919 -14011 -16843 -21527 -9157 8547 -8376 -5330 -20910
16813 -20910 -13842 18735 31761 35070 13918 23254 11132 -3919 10228 50403 50533 19814 -11175
16800 -11175 -16072 -25993 -47185 -48118 -39255 -29990 -27826 -36979 -30967 -9424 -17889 -36135 -32912 -32545
16786 -32545 -24482 -3860 10884 16799 -1772 -14578 -22791 -12741 -9479 -42058 -55478 -55014 -59866
16773 -59866 -57619 -51529 -18371 15120 3260 -38637 -44286 -45291 -38731 -24717 -34519 -14069 28590
16760 28590 42235 28794 1019 -9693 4890 20478 24742 24750 24714 13272 8769 -1933 -680 6725
$$ packed form
16853i234N54J4371N991j0320j2285n856k999J7473j2869N110K0386L0618J5800
16840E6740L517N141k7683j3862j7529m998o198R024L621j074J5808q809k18j4265
16826g85j9701k7609j3497J1692K1981J3908k832m684J2370J7704j6923L046j5580
16813b0910P068L2577J3026L309k1152R336j2122j5051J4147M0175J30l0719l0989
16800a1175m897r921k1192r33Q863R265K164r153O012K1543q465j8246L223L67
16786c2545Q063K0622J4744N915j8571j2806q213J0050L262l2579j3420M64m852
16773e9866K247O090L3158L3491j1860m1897n649j005O560J4014r802K0450M2659
16760B8590J3645j3441k7775j0712J4583J5588M264Ql6j1442m503j0702J253P405
$$ plain form
16746 6725 15862 11650 26761 -18767 -17917 -1800 -3140 -40103 -50852 -56960 -28954 -11849 -18680
16733 -18680 -41708 -45547 -15022 -4589 24535 20662 19059 12522 3964 -1352 6209 -13432 -24838
16720 -24838 -39373 -42873 -21820 -22862 -35867 -32425 -9537 27236 5180 -2596 5876 -1837 3095
16707 3095 25833 43727 8909 11629 40366 19795 22935 3464 -24482 -20872 -3730 -6319 -16579
16694 -16579 -6053 17392 -2924 -18731 -10109 14949 42796 48434 29718 10919 -9384 -7381
16682 -7381 -557 11510 -7594 -23250 3382 4815 21987 40113 18907 23384 -1011 2415 7289
16669 7289 3268 -3463 -16299 -27445 -11439 -9513 -13058 -20795 -44967 -53555 -24653 -4016 -19318
16656 -19318 -21229 -25823 -16897 -17432 -12862 -11877 -1455 9983 26812 23214 14089 9906 31827 24342
$$ packed form
16746F725R137m212J5111m5528Q50J6117j340l6963j0749o108K8006J7105o831
16733a8680k3028l839L0525J0433K9124l873j603o537q558n316P561j9641j1406
16720b4838j4535l500K1053j042j3005L442K2888L6773k2056p776Q472p713M932
16707C095K2738J7894l4818K720K8737k0571L140j9471k7946L610J7142k589j0260
16694a6579J0526K3445k0316j5807Q622K5058K7847N638j8716j8799k0303K003
16682g381O824J2067j9104j5656K6632J433J7172J8126k1206M477k4395L426M874
16669G289m021o731j2836j1146J6006J926l545p737k4172q588K8902K0637j5302
16656a9318j911m594Q926n35M570R85J0422J1438J6829l598r125m183K1921p485
$$ plain form
16642 24342 10530 1678 -20856 -4082 6112 -13703 -45388 -50048 -58802 -52132 -8237 -434 -10656
16629 -10656 2520 -3397 -22940 -18214 -15347 -6889 -24136 -35962 -53571 -41053 -33673 -8967 18843
16616 18843 58977 24215 -5086 5861 47338 40840 35610 17163 -461 7640 3966 232 -7422
16603 -7422 -11431 -12178 -14871 -6223 7088 12015 22202 18168 6590 9016 23668 53171 50430 46011
16589 46011 39636 42640 54820 24063 -17554 -18594 7273 22385 19035 29373 22178 18941 8375
16576 8375 2620 -7756 -1550 7447 31109 23895 -4428 -24408 -17124 -9404 -774 24430 13999
16563 13999 12198 -13027 -8096 23317 39202 27670 25100 -11199 -37410 -47128 -41471 -2400 -1111
16550 -1111 15684 -5265 -6757 -6496 -34573 -42904 7337 43341 54688 43969 23757 2643 -17999
$$ packed form
16642B4342j3812q852k2534J6774J0194j9815l1685m660q754O670M3895P803j0222
16629a0656J3176n917j9543M726K867Q458j7247j1826j7609J2518P380K4706K7810
16616A8843M0134l4762k9301J0947M1477o498n230j8447j7624Q101l674l734p654
16603g422m009p47k693Q648J3311M927J0187m034j1578K426J4652K9503k741m419
16589D6011o375L004J2180l0757m1617j040K5867J5112l350J0338p195l237j0566
16576H375n755j0376O206Q997K3662p214k8323j9980P284P720Q630K5204j0431
16563A3999j801k5225M931L1413J5885j1532k570l6299k6211r718N657L9071J289
16550a111J6795k0949j492K61k8077q331N0241L6004J1347j0719k0212k1114k0642
$$ plain form
16537 -17999 -10322 -11386 -5617 43769 32178 -11685 -27195 -30449 -19648 -1322 14655 6267 8238
16524 8238 3291 2265 24024 16624 24012 49820 25712 27734 50656 35553 20911 -309 -1856
16511 -1856 2373 3482 55011 61595 81647 70179 62877 62605 33457 22162 13438 21530 11186
16498 11186 8983 -5357 -8817 25205 166 -22055 9309 22849 15513 32672 20834 34657
16486 34657 43552 46018 23705 -15578 -18955 -32667 7926 25045 16100 14491 -12218 -14804 -16661
16473 -16661 5671 6457 2323 8090 -21927 -20183 -16160 -35398 -32311 -14712 -15808 -32483 -15792
16460 -15792 7406 19554 31490 35625 30510 2084 -11030 8344 17065 3492 18904 37397
16448 37397 32687 10430 -16785 -9400 1812 7806 28150 36380 38761 48630 47198 31576 29156
$$ packed form
16537a7999P677j064N769M9386j1591m3863j5510l254J0801J8326J5977q388J971
16524H238m947j026K1759p400P388K5808k4108K022K2922j5103j4642k1220j547
16511a856M229J109N1529O584K0052j1468p302k72k9148j1295q724Q092j0344
16498A1186k203j4340l460L4022k5039k2221L1364J3540p336J7159j1838J3823
16486C4657Q895K466k2313l9283l377j3712M0593J7119q945j609k6709k586j857
16473a6661K2332P86m134N767l0017J744M023j9238L087J7599j096j6675J6691
16460a5792K3198J2148J1936M135n115k8426j3114J9374Q721j3573J5412J8493
16448C7397m710k2257k7215P385J1212N994K0344Q230K381R869j432j5622k420
$$ plain form
16435 29156 31738 12055 4338 2060 12733 15190 27077 22304 18895 14121 -3444 7005 21387
16422 21387 15275 23609 30961 14466 1027 -15771 -1822 2274 -484 -8403 25631 21616 11521
16409 11521 275 6658 44917 56251 25914 -1619 5586 -25302 -14273 25017 20222 30417
16397 30417 25011 18547 -1029 -21849 -7849 -7172 -28259 -17524 20138 36957 29640 20463 20854
16384 20854 16549 44907 61138 65115 54423 20506 -463 19958 30607 29682 24676 67468 60976
16371 60976 49477 71847 48695 42578 36819 53748 53509 30597 37870 44351 45366 35522 20011
16358 20011 1210 -16698 -14614 48853 88755 90729 83740 62637 53341 45685 39262 32488 6631
16345 6631 -2391 5295 33677 39296 11961 14318 28495 15602 -8158 -12033 -13466 1956 33798
$$ packed form
16435B9156K582j9683p717k278J0673K457J1887m773l409m774j7565J0449J4382
16422B1387o112Q334P352j6495j3439j6798J3949M096k758p919L4034m015j0095
16409A1521j1246O383L8259J1334l0337k7533P205l0888J1029L9290m795J0195
16397C0417n406o464j9576k0820J4000O77k1087J0735L7662J6819p317r177L91
16384B0854m305K8358J6231L977j0692l3917k0969K0421J0649r25n006M2792o492
16371F0976j1499K2370k3152o117n759J6929k39k2912P273O481J015r844j5511
16358B0011j8801j7908K084O3467L9902J974o989k1103r296p656o423o774k5857
16345F631r022P686K8382N619k7335K357J4177j2893k3760l875j433J5422L1842
$$ plain form
16332 33798 33627 56246 69885 49842 53867 65637 61164 61257 70843 70284 28310 1952 3336 -4501
16318 -4501 4582 18383 30039 16830 11613 27860 31357 24406 9314 10813 -8041 18765 34176
16305 34176 35568 27481 34992 23616 20083 40194 40993 22535 26987 23011 37362 60568 71349
16292 71349 68509 84958 89213 84905 58189 34590 32072 40107 44101 29504 48495 55355 26292
16279 26292 38428 39540 18621 33034 22898 14388 12980 27716 15169 -584 -22052 738
16267 738 41408 27784 -4671 6151 27244 19908 48018 69094 33025 23931 48303 61148
16255 61148 35615 -630 -5774 14040 27635 33966 41020 41939 55792 38877 -4092 116 17697
16242 17697 24827 15238 -8451 -15861 29366 36833 16917 12316 32464 24401 56632 56429 51206
$$ packed form
16332C3798j71K2619J3639k0043M025J1770m473R3R586n59m1974k6358J384p837
16318d501R083J3801J1656j3209n217J6247L497o951j5092J499j8854K6806J5411
16305C4176J392q087P511j1376l533K0111P99j8458M452l976J4351K3206J0781
16292G1349k840J6449M255m308k6716k3599k518Q035L994j4597J8991O860k9063
16279B6292J2136J112k0919J4413j0136q510j408J4736j2547j5753k1468K2790
16267G38M0670j3624l2455J0822K1093p336K8110K1076l6069r094K4372J2845
16255F1148k5533l6245n144J9814J3595O331P054R19J3853j6915m2969M208J7581
16242A7697P130r589k3689p410M5227P467j9916m601K0148q063L2231k03n223
$$ plain form
16229 51206 48465 34365 55027 35488 14704 13455 41501 65450 69141 68112 66830 37805 41489
16216 41489 37103 8245 -15384 -1568 17301 -3380 4213 29080 58578 47317 39217 36279
16204 36279 16031 -9792 1780 41258 46219 13192 16514 9592 19838 51239 31985 1573
16192 1573 -9553 -18523 755 23616 22506 18963 19261 33999 69540 88991 65972 26058 22462
16179 22462 28370 23000 734 -5328 -1182 19204 50215 65311 57543 66278 63677 21814 4370
16166 4370 31119 19932 -10001 -17523 -14761 6252 56233 86081 75113 52779 69837 83468
16154 83468 75781 102318 113040 69019 41650 40046 64332 46600 35525 41578 35385 30963 34260
16141 34260 36063 36436 43456 77773 64946 59610 37337 37907 58704 58040 30452 15208 21121 15548
$$ packed form
16229E1206k741j4100K0662j9539k0784j249K8046K3949L691j029j282k9025L684
16216D1489m386k8858k3629J3816J8869k0681P593K4867K9498j1261q100k938
16204C6279k0248k5823J1572L9478M961l3027L322o922J0246L1401j9254l0412
16192A573j1126q970J9278K2861j110l543K98J4738L5541J9451k3019l9914l596
16179B2462N908n370k2266o062M146K0386L1011J5096p768Q735k601m1863j7444
16166D370K6749j1187k9933p522K762K1013M9981K9848j0968k2334J7058J3631
16154H3468p687K6537J0722m4021k7369j604K4286j7732j1075O053o193m422L297
16141C4260J803L73P020L4317j2827n336k2273N70K0797o64k7588j5244N913n573
$$ plain form
16127 15548 19461 30469 33057 16656 17959 17636 29706 30083 32548 58415 37176 1911 12642
16114 12642 32892 45046 30803 19896 44901 47613 58800 77362 63257 42239 20748 30448
16102 30448 4635 7656 18338 30117 -15226 -30982 -28371 6706 29665 32859 16643 11367
16090 11367 1318 -22813 -32675 -26052 9975 15722 1487 -6977 -21077 -30294 -7529 2771 17748
16077 17748 52100 45361 34778 30066 50973 36631 32568 29456 31258 71064 78228 98276 97731
16064 97731 94307 102719 100668 99402 110077 102569 98861 81495 89586 86738 72278 56311 64210
16051 64210 65216 74052 93822 96045 106225 110427 82445 54631 55734 47147 52957 55700 63842
16038 63842 80806 107656 95285 65890 90035 106056 71775 36862 28366 41742 65788 67737
$$ packed form
16127A5548L913J1008K588j6401J303l23J2070L77K465K5867k1239l5265J0731
16114A2642K0250J2154j4243j0907K5005K712J1187J8562j4105k1018k1491R700
16102C0448k5813L021J0682J1779m5343j5756K611L5077K2959L194j6216n276
16090A1367j0049k4131r862O623L6027N747j4235q464j4100r217K2765J0300J4977
16077A7748L4352o739j0583m712K0907j4342m063l112J802L9806P164K0048n45
16064I7731l424Q412k051j266J0675p508l708j7366Q091k848j4460j5967P899
16051F4210J006Q836J9770K223J0180M202k7982k7814J103q587N810K743Q142
16038F3842J6964K6850j2371k9395K4145J6021l4281l4913q496J3376K4046J949
$$ plain form
16026 67737 47565 50189 50990 43633 53478 54224 34660 22618 32070 55598 84469 47729 21065
16013 21065 52209 87386 100211 75748 45922 44580 41112 42190 22516 1400 20793 71597
16001 71597 95882 87107 89514 82483 67827 54940 74574 78484 102755 98559 82776 33391 20540
15988 20540 43635 45101 22211 12154 40890 61655 73154 107381 136827 117061 89904 90042
15976 90042 74360 72237 70762 95574 86354 55323 41035 44990 72446 68521 66116 73295 54530
15963 54530 13359 31275 29121 20009 38179 72990 105369 117319 109263 97828 77156 42192
15951 42192 40547 72745 79344 73996 72913 95631 77617 53455 57706 80121 98638 76033 76494
15938 76494 82365 66807 60174 59087 45471 28357 34343 35844 64184 73987 82826 56968 36243
$$ packed form
16026F7737k0172K624Q01p357R845P46j9564j2042R452K3528K8871l6740k6664
16013B1065L1144L5177J2825k4463k9826j342l468J078j9674k1116J9393N0804
16001G1597K4285q775K407p031j4656j2887J9634L910K4271m196j5783m9385j2851
15988B0540K3095J466k2890j0057K8736K0765J1499L4227K9446j9766k7157J38
15976I0042j5682k123j475K4812r220l1031j4288L955K7456l925k405P179j8765
15963E4530m1171J7916k154r112J8170L4811L2379J1950q056j1435k0672l4964
15951D2192j645L2198O599n348j083K2718j8014k4162M251K2415J8517k2605M61
15938G6494N871j5558o633j087j3616j7114N986J501K8340R803Q839k5858k0725
$$ plain form
15925 36243 41012 59472 71134 51408 36392 52048 66044 47765 51583 55962 56111 90758 89714
15912 89714 94861 78885 72770 91997 83078 69139 63226 83403 86079 58762 39534 39909 86759
15899 86759 93088 75148 87403 75865 48830 47071 64414 81473 84233 72474 62124 80393
15887 80393 114038 116546 101586 85595 50951 76051 109288 127989 134190 133885 118351 112031 118047
15874 118047 104231 100493 85127 96084 83381 55789 68627 94651 96616 106254 100563 74795
15862 74795 61706 64810 63565 49889 43592 51664 67466 34703 33684 69566 115170 130255 113207
15849 113207 100711 110597 138834 132755 123693 116849 102824 105962 110975 122417 112969 91452 106323
15836 106323 125952 143504 101523 88245 108028 97185 95207 90974 78307 65212 70186 78702
$$ packed form
15925C6243M769J8460J1662j9726j5016J5656J3996j8279L818M379J49L4647j044
15912H9714N147j5976o115J9227q919j3939n913K0177K676k7317j9228L75M6850
15899H6759O329j7940J2255j1538k7035j759J7343J7059K760j1759j0350J8269
15887H0393L3645K508j4960j5991l4644K5100L3237J8701O201l05j5534o320O016
15874A18047j3816l738j5366J0957j2703k7592J2838K6024J965R638n691k5768
15862G4795j3089L104j245j3676o297Q072J5802l2763j019L5882M5604J5085j7048
15849A13207j2496R886K8237o079r062o844j4025L138N013J1442r448k1517J4871
15836A06323J9629J7552m1981j3278J9783j0843j978m233j2667j3095M974Q516
$$ plain form
15824 78702 82433 108816 89776 80137 88103 129237 141599 178147 156072 130143 108382 102434
15812 102434 101381 118256 100944 82384 91049 95887 90880 111097 131299 133339 121251 97790
15800 97790 97811 113621 112807 132562 174777 171600 160114 159928 165443 161112 139177 136161 148955 147788
15786 147788 136393 133897 149621 163471 131113 112451 114533 153324 159586 160954 167622 178514
15774 178514 182928 151091 135649 139943 139020 155643 197354 174938 146605 167421 137359 107108
15762 107108 107360 103577 114981 134752 99226 77030 114545 142914 139224 115326 132902 123186
15750 123186 92792 100741 93945 99212 122198 139171 123147 121418 137766 143525 138950 118109 132586
15737 132586 136739 127965 132235 154503 160962 167479 176531 176028 167081 159021 173322 164318 106467 105082
$$ packed form
15824G8702L731K6383j9040r639P966M1134J2362L6548k2075k5929k1761n948
15812A02434j053J6875j7312j8560Q665M838n007K0217K0202K040j2088k3461
15800I7790K1J5810q14J9755M2215l177j1486j86N515m331k1935l016J2794j167
15786A47788j1395k496J5724J3850l2358j8662K082L8791O262J368O668J0892
15774A78514M414l1837j5442M294r23J6623M1711k2416k8333K0816l0062l0251
15762A07108K52l783J1404J9771l5526k2196L7515K8369l690k3898J7576r716
15750A23186l0394P949o796N267K2986J6973j6024j729J6348N759m575k0841J4477
15737A32586M153q774M270K2268O459O517R052n03q947q060J4301r004n7851j385
$$ plain form
15723 105082 147366 156891 171602 165368 148809 142970 166687 182901 177800 200791 195000 195612 186862
15710 186862 170735 164631 162076 165427 166898 176610 193006 193982 198560 185726 155712 149332 156534
15697 156534 153918 135115 130898 135640 160888 163080 165967 154526 168521 182002 191489 204626 222040
15684 222040 200756 221123 219452 212377 234911 198396 199580 204189 207581 190604 184327 192007 213020
15671 213020 211207 197642 200858 196554 182278 186257 182362 185475 208669 197768 199977 218588 242231
15658 242231 252539 235461 220458 197649 183523 206460 182784 173071 190717 205254 187087 230316
15646 230316 268349 254595 221152 198266 202150 214033 236564 265424 245107 234120 228321 205283
15634 205283 206303 201022 193400 216284 236632 210198 240257 263231 251819 252942 262734 283252
$$ packed form
15723A05082M2284R525J4711o234j6559n839K3717J6214n101K2991n791O12q750
15710A86862j6127o104k555L351J471R712J6396R76M578j2834l0014o380P202
15697A56534k616j8803m217M742K5248K192K887j1441J3995J3481R487J3137J7414
15684B22040k1284K0367j671p075K2534l6515J184M609L392j6977o277P680K1013
15671B13020j813j3565L216m304j4276L979l895L113K3194j0901K209J8611K3643
15658B42231J0308j7078j5003k2809j4126K2937k3676r713J7646J4537j8167M3229
15646B30316L8033j3754l3443k2886L884J1883K2531K8860k0317j0987n799k3038
15634B05283J020n281p622K2884K0348k6434L0059K2974j1412J123R792K0518
$$ plain form
15622 283252 290019 302650 301902 286261 254205 250386 257085 267270 274966 285256 298192 286602 297945
15609 297945 297220 269899 268069 282988 289755 284644 289993 277848 294951 299503 283643 294279 280472
15596 280472 240199 214179 255210 268807 254361 243680 248269 273792 258970 265921 268922 279606
15584 279606 309220 303706 286120 288818 306253 302890 319351 297052 284749 300892 307062 301497
15572 301497 281164 248187 250637 259066 257567 251721 274282 298465 308334 315694 316372 289006 284271
15559 284271 292576 295069 287121 316650 372864 375215 363752 332391 308146 313311 318278 357090 354076
15546 354076 334110 335337 331470 341114 346769 368533 392813 373748 343482 373274 386538 378629
15534 378629 385543 370781 376163 396103 409825 380206 366352 350544 368736 394135 414644 399305
$$ packed form
15622B83252O767J2631p48j5641l2056l819O699J0185P696J0290J2936j1590J1343
15609B97945p25k7321j830J4919O767n111N349j2145J7103M552j5860J0636j3807
15596B80472m0273k6020M1031J3597j4446j0681M589K5523j4822O951L001J0684
15584B79606K9614n514j7586K698J7435l363J6461k2299j2303J6143O170n565
15572C01497k0333l2977K450Q429j499n846K2561K4183R869P360O78k7366m735
15559B84271Q305K493p948K9529N6214K351j1463l1361k4245N165M967L8812l014
15546C54076j9966J227l867R644N655K1764K4280j9065l0266K9792J3264p909
15534C78629O914j4762N382J9940J3722k9619j3854j5808J8192K5399K0509j5339
$$ plain form
15522 399305 382857 376085 389699 403761 409227 391558 389080 412021 439173 433730 433352 425253 419492
15509 419492 398810 406068 417431 428354 448713 426956 405881 425667 436011 447106 459352 464176
15497 464176 440260 430043 437333 455824 455034 462915 479299 487147 478027 475969 457489 432006 415834
15484 415834 438608 458722 462041 462643 451586 465847 466483 473947 487862 511604 514000 518823 534437
15471 534437 550579 565783 550234 523611 523036 540819 567466 569369 585600 607467 604348 596846
15459 596846 611675 623941 656494 670210 663974 674332 693858 710718 732569 756139 769450 771947
15447 771947 761738 695491 662705 674178 660788 676709 708734 759107 794365 812078 857122
15436 857122 875793 902610 929886 937747 944811 952783 969905 970937 973399 954351 923718 874837
$$ packed form
15522C99305j6448o772J3614J4062N466j7669k478K2941K7152n443l78q099n761
15509D19492k0682P258J1363J0923K0359k1757k1075J9786J0344J1095J2246M824
15497D64176k3916j0217P290J8491p90P881J6384P848r120k058j8480k5483j6172
15484D15834K2774K0114L319O02j1057J4261O36P464J3915K3742K396M823J5614
15471E34437J6142J5204j5549k6623n75J7783K6647J903J6231K1867l119p502
15459E96846J4829J2266L2553J3716o236J0358J9526J6860K1851K3570J3311K497
15447G71947j0209o6247l2786J1473j3390J5921L2025N0373L5258J7713M5044
15436H57122J8671K6817K7276P861P064P972J7122J032K462j9048l0633m8881
$$ plain form
15424 874837 819634 797512 791989 806415 831580 811947 795736 797899 828810 863650 876759 861796
15412 861796 840669 835916 822717 840774 855417 846383 822781 822997 829278 844353 861229 850782
15400 850782 894183 933239 941545 941318 965735 976029 975366 961771 963595 993837 1003486 1028322 1061385
15387 1061385 1079250 1060213 1062792 1079395 1082024 1090062 1116781 1127557 1126688 1106555 1083427 1106130
15375 1106130 1133688 1146685 1183002 1194215 1196435 1226330 1240205 1252931 1262828 1256019 1243419 1243986
15363 1243986 1246293 1269165 1285174 1286068 1293555 1312545 1322019 1321133 1326479 1331626 1388203 1429397 1449347
15350 1449347 1461712 1467340 1479695 1487887 1505313 1501174 1482302 1525809 1568547 1608152 1644850 1666699
15338 1666699 1685434 1652197 1653636 1675194 1695018 1691391 1702499 1739690 1760655 1784599 1819385 1871919
$$ packed form
15424H74837n5203k2122n523J4426K5165j9633j6211K163L0911L4840J3109j4963
15412H61796k1127m753j3199J8057J4643r034k3602K16O281J5075J6876j0447
15400H50782M3401L9056Q306k27K4417J0294o63j3595J824L0242R649K4836L3063
15387A061385J7865j9037K579J6603K629Q038K6719J0776q69k0133k3128K2703
15375A106130K7558J2997L6317J1213K220K9895J3875J2726R897o809j2600N67
15363A243986K307K2872J6009Q94P487J8990R474q86N346N147N6577M1194J9950
15350A449347J2365N628J2355Q192J7426m139j8872M3507M2738L9605L6698K1849
15338A666699J8735l3237J439K1558J9824l627J1108L7191K0965K3944L4786N2534
$$ plain form
15326 1871919 1902351 1899481 1902906 1933011 1960153 1967004 1965437 2022305 2032084 2061130 2078722 2110161
15314 2110161 2138719 2178062 2177930 2230674 2241929 2269950 2300900 2337708 2352499 2379876 2393314 2449210
15302 2449210 2474439 2488017 2496439 2530922 2569319 2622833 2643465 2682243 2738323 2796489 2816892
15291 2816892 2815626 2835659 2894000 2931852 2929115 2953378 3012952 3065075 3125688 3168915 3213601 3236150
15279 3236150 3262744 3301618 3350551 3407687 3435711 3486219 3574985 3658645 3705642 3796144 3845431
15268 3845431 3880920 3906498 3933446 4006266 4088143 4148977 4234804 4279010 4322883 4384115 4463968
15257 4463968 4559752 4617094 4682403 4783839 4856791 4937489 5017806 5081959 5155339 5231320 5298780
15246 5298780 5411018 5520253 5612678 5695660 5779104 5877987 5992847 6090891 6184869 6297266
$$ packed form
15326A871919L0432k870L425L0105K7142O851j567N6868R779K9046J7592L1439
15314B110161K8558L9343j32N2744J1255K8021L0950L6808J4791K7377J3438N5896
15302B449210K5229J3578Q422L4483L8397N3514K0632L8778N6080N8166K0403
15291B816892j266K0033N8341L7852k737K4263N9574N2123O0613M3227M4686K2549
15279C236150K6594L8874M8933N7136K8024N0508Q8766Q3660M6997R0502M9287
15268C845431L5489K5578K6948P2820Q1877O0834Q5827M4206M3873O1232P9853
15257D463968R5784N7342O5309J01436P2952Q0698Q0317O4153P3380P5981O7460
15246E298780J12238J09235R2425Q2982Q3444R8883J14860R8044R3978J12397
$$ plain form
15236 6297266 6422663 6545344 6678351 6775025 6857212 6983690 7114634 7244179 7358672 7506299
15226 7506299 7660330 7772603 7909191 8085471 8238563 8406591 8552388 8717913 8869337
15217 8869337 9027519 9225349 9364911 9544649 9752237 9943229 10096985 10266249 10433729
15208 10433729 10658695 10879429 11102163 11278209 11475655 11711225 11903723 12093781 12286188
15199 12286188 12503350 12734956 12939979 13168976 13402612 13597201 13789165 14011513 14246387
15190 14246387 14490842 14747078 14964762 15192765 15416333 15620971 15805080 16004147 16221963
15181 16221963 16452295 16651838 16817666 16960389 17123953 17316545 17497320 17632158 17784513
15172 17784513 17932216 18054475 18162176 18323434 18426828 18488920 18574210 18663384 18726733 18760541
$$ packed form
15236F297266J25397J22681J33007R6674Q2187J26478J30944J29545J14493J47627
15226G506299J54031J12273J36588J76280J53092J68028J45797J65525J51424
15217H869337J58182J97830J39562J79738K07588J90992J53756J69264J67480
15208A0433729K24966K20734K22734J76046J97446K35570J92498J90058J92407
15199A2286188K17162K31606K05023K28997K33636J94589J91964K22348K34874
15190A4246387K44455K56236K17684K28003K23568K04638J84109J99067K17816
15181A6221963K30332J99543J65828J42723J63564J92592J80775J34838J52355
15172A7784513J47703J22259J07701J61258J03394O2092Q5290Q9174O3349L3808
$$ plain form
15162 18760541 18812306 18786546 18754453 18770525 18756570 18721742 18673419 18611367 18527216 18411893 18302555
15151 18302555 18205861 18093734 17990774 17879451 17744627 17601554 17425078 17244926 17047117
15142 17047117 16829839 16623014 16448015 16253048 16052244 15837804 15626147 15406758 15175903
15133 15175903 14976951 14746567 14492297 14235222 14001947 13785704 13543678 13321954 13090524
15124 13090524 12861325 12647932 12419754 12183910 11968062 11772977 11571385 11383199 11187734
15115 11187734 10941228 10705511 10510344 10332259 10179048 9987707 9800640 9607364 9430678
15106 9430678 9231453 9032494 8890767 8737273 8581740 8392392 8229156 8063940 7916385
15097 7916385 7783252 7634808 7479094 7343123 7244169 7103421 6942835 6831270 6703215 6579673
$$ packed form
15162A8760541N1765k5760l2093J6072j3955l4828m8323o2052q4151j15323j09338
15151A8302555r6694j12127j02960j11323j34824j43073j76476j80152j97809
15142A7047117k17278k06825j74999j94967k00804k14440k11657k19389k30855
15133A5175903j98952k30384k54270k57075k33275k16243k42026k21724k31430
15124A3090524k29199k13393k28178k35844k15848j95085k01592j88186j95465
15115A1187734k46506k35717j95167j78085j53211j91341j87067j93276j76686
15106I430678j99225j98959j41727j53494j55533j89348j63236j65216j47555
15097G916385j33133j48444j55714j35971r8954j40748j60586j11565j28055j23542
$$ plain form
15087 6579673 6480997 6339314 6210270 6108935 6020852 5920816 5830969 5693166 5577860 5506875
15077 5506875 5414512 5298112 5205672 5127815 5049314 4984485 4880541 4760451 4695984 4622471 4558903
15066 4558903 4506727 4430940 4337862 4259109 4178981 4072581 4000263 3963952 3922396 3869278 3801150
15055 3801150 3737987 3697466 3650947 3606075 3557804 3457916 3409275 3355051 3303328 3262876 3218435
15044 3218435 3186325 3141925 3107229 3049376 2977921 2882238 2822260 2808266 2799694 2774615 2748536
15033 2748536 2695274 2630156 2583009 2550574 2533937 2527109 2487945 2433151 2403692 2390273 2347115
15022 2347115 2283396 2250817 2233243 2211317 2196097 2185613 2170167 2125962 2103824 2062183 2035700
15011 2035700 2022704 2006655 1976545 1954859 1959821 1935142 1899434 1867988 1854058 1824554 1801235
$$ packed form
15087F579673r8676j41683j29044j01335q8083j00036q9847j37803j15306p0985
15077E506875r2363j16400r2440p7857p8501o4829j03944j20090o4467p3513o3568
15066D558903n2176p5787r3078p8753q0128j06400p2318l6311m1556n3118o8128
15055C801150o3163m0521m6519m4872m8271r9888m8641n4224n1723m0452m4441
15044C218435l2110m4400l4696n7853p1455r5683n9978j3994q572k5079k6079
15033B748536n3262o5118m7147l2435j6637o828l9164n4794k9459j3419m3158
15022B347115o3719l2579j7574k1926j5220j0484j5446m4205k2138m1641k6483
15011B035700j2996j6049l0110k1686M962k4679l5708l1446j3930k9504k3319
$$ plain form
15000 1801235 1784231 1740217 1710436 1712188 1668174 1630776 1607271 1597568 1594683 1596563 1594522 1575206
14988 1575206 1541103 1499886 1481041 1455166 1451678 1451518 1447027 1418701 1382467 1380520 1405743 1435058
14976 1435058 1405177 1349546 1333496 1321865 1332496 1333664 1319108 1305829 1286764 1295413 1266578 1227800
14964 1227800 1218141 1192929 1188624 1183216 1160729 1132864 1149029 1143579 1158744 1139673 1140607 1143596 1127384
14951 1127384 1130110 1097241 1088446 1085910 1037065 1034729 1027297 1011390 1004756 984076 955441 964580 962171
14938 962171 950090 952326 954279 969175 1008574 983672 945466 909423 903600 901247 901665 899391 867715
14925 867715 867988 868617 888272 872318 864645 875431 889954 873474 864345 837063 824103 824290 825993
14912 825993 819292 793093 806467 809126 816622 840244 824786 783174 755756 754095 761884 765439 758586
$$ packed form
15000A801235j7004m4014k9781J752m4014l7398k3505r703k885J880k041j9316
14988A575206l4103m1217j8845k5875l488j60m491k8326l6234j947K5223K9315
14976A435058k9881n5631j6050j1631J0631J168j4556j3279j9065Q649k8835l8778
14964A227800r659k5212m305n408k2487k7865J6165n450J5165j9071R34K989j6212
14951A127384K726l2869q795k536m8845k336p432j5907o634k0680k8635R139k409
14938I62171j2081K236J953J4896L9399k4902l8206l6043n823k353M18k274l1676
14925H67715K73O29J9655j5954p673J0786J4523j6480r129k7282j2960J87J703
14912H25993o701k6199J3374K659P496K3622j5458m1612k7418j661P789L555o853
$$ plain form
14899 758586 747192 782144 782176 742196 740599 769083 773371 776977 777665 792486 786496 817729 873177
14886 873177 906265 915608 926201 921486 903128 896746 862679 819751 784040 754712 742196 719073
14874 719073 702563 692154 647593 607533 588355 572800 556897 543028 569922 606278 626417
14863 626417 617824 582909 538685 521600 522357 514670 490706 517719 510915 491645 494182 504659 526096
14850 526096 524187 509909 491445 486443 531794 549729 558853 542656 495774 496419 498530 487496 476271
14837 476271 476165 442707 436744 468957 477509 495006 537256 538050 532693 521093 506040 484635 454930
14824 454930 467994 454696 442821 419009 422868 413641 396574 393301 396792 388881 373745 381563 368441
14811 368441 369881 373191 386433 358509 356748 354813 342167 332368 354270 363210 371760 378382 355273
$$ packed form
14899G58586j1394L4952L2l9980j597K8484M288L606O88J4821n990L1233N5448
14886H73177L3088R343J0593m715j8358o382l4067m2928l5711k9328j2516k3123
14874G19073j6510j0409m4561m0060j9178j5555j5903j3869K6894L6356K0139
14863F26417q593l4915m4224j7085P57p687k3964K7013o804j9270K537J0477K1437
14850E26096j909j4278j8464n002M5351J7935R124j6197m6882O45K111j1034j1225
14837D76271j06l3458n963L2213Q552J7497M2250P94n357j1600j5053k1405k9705
14824D54930J3064j3298j1875k3812L859r227j7067l273L491p911j5136P818j3122
14811C68441J440L310J3242k7924j761j935j2646r799K1902Q940Q550O622k3109
$$ plain form
14798 355273 346544 342848 315019 308032 321533 325668 361311 382334 388888 378647 340706 295131
14786 295131 305852 294793 280443 302450 319904 316193 327468 315743 313034 299270 319031 358797
14774 358797 334244 314065 310931 336764 321932 297003 311274 337216 330202 317254 297778 292449
14762 292449 307572 306475 304091 277941 270269 277842 298295 275655 266358 283745 243295 213905
14750 213905 260695 289865 294521 312123 267017 263845 267440 258221 236669 252536 271558 285506
14738 285506 312986 287854 258243 241496 237490 234703 184226 186231 223011 246812 250335 236634
14726 236634 226745 210136 207920 177493 185680 216558 206801 220394 202079 187816 194979 207371
14714 207371 221705 233298 224016 216214 194107 210178 234855 209047 191432 175093 185531 212763
$$ packed form
14798C55273q729l696k7829o987J3501M135L5643K1023O554j0241l7941m5575
14786B95131J0721j1059j4350K2007J7454l711J1275j1725k709j3764J9761L9766
14774C58797k4553k0179l134K5833j4832k4929J4271K5942p014j2948j9476n329
14762B92449J5123j097k384k6150p672P573K0453k2640r297J7387m0450k9390
14750B13905M6790K9170M656J7602m5106l172L595r219k1552J5867J9022J3948
14738B85506K7480k5132k9611j6747m006k787n0477K005L6780K3801L523j3701
14726B36634r889j6609k216l0427Q187L0878r757J3593j8315j4263P163J2392
14714B07371J4334J1593r282p802k2107J6071K4677k5808j7615j6339J0438K7232
$$ plain form
14702 212763 207785 213232 200650 186666 158823 158454 197997 213922 217843 215546 225062 244456 211548
14689 211548 191121 187217 192591 209937 226418 235771 273549 254085 223953 249919 250172 199116
14677 199116 174200 151482 139424 192826 211758 180357 168401 174677 164276 148314 161330 160704
14665 160704 155295 177550 195496 209671 202658 188560 167742 144929 128217 163335 188555 198143
14653 198143 197704 177415 175950 197014 216427 185583 170318 188466 209209 215404 200128 191543
14641 191543 165207 157571 161033 161686 160011 159367 153262 138404 163405 172808 168702 182068 173461 165346
14627 165346 175221 180409 161193 143611 151459 143629 127037 110050 88253 96933 112598 120285 132086
14614 132086 154073 184073 164514 108011 92416 107948 91370 69745 60509 94001 104352 118796
$$ packed form
14702B12763m978N447j2582j3984k7843l69L9543J5925L921k297R516J9394l2908
14689B11548k0427l904N374J7346J6481R353L7778j9464l0132K5966K53n1056
14677A99116k4916k2718j2058N3402J8932l1401j1956O276j0401j5962J3016o26
14665A60704n409K2255J7946J4175p013j4098k0818k2813j6712L5118K5220R588
14653A98143m39k0289j465K1064J9413l0844j5265J8148K0743O195j5276q585
14641A91543k6336p636L462O53j675o44o105j4858K5001R403m106J3366q607q115
14627A65346R875N188j9216j7582P848p830j6592j6987k1797Q680J5665P687J1801
14614A32086K1987L0000j9559n6503j5595J5532j6578k1625r236L3492J0351J4444
$$ plain form
14602 118796 128465 122997 159272 164935 144377 107328 97432 107815 111800 134235 153848 150642 143705
14589 143705 151877 138651 125670 120758 129034 139393 120280 138844 167841 135013 128437 148786
14577 148786 132662 141776 157027 163320 133920 125306 104939 109035 139861 151212 146028 141979 125020
14564 125020 96270 90845 94258 91626 100825 75529 70513 80477 105844 122085 109646 93464 103327
14551 103327 106452 91923 93470 109816 116187 114836 122091 128091 107786 84804 79216 83469 100987
14538 100987 118970 112511 108953 114674 120742 118996 122067 125803 118465 125876 125696 106037 110700 94811
14524 94811 89657 83424 81222 124466 122602 120724 96374 63365 75281 101135 96799 95734 92210
14511 92210 75421 101585 122666 108584 99450 96914 63955 50392 85255 100948 114997 111801
$$ packed form
14602A18796R669n468L6275N663k0558l7049r896J0383L985K2435J9613l206o937
14589A43705Q172j3226j2981m912Q276J0359j9113J8564K8997l2828o576K0349
14577A48786j6124R114J5251O293k9400q614k0367M096L0826J1351n184m049j6959
14564A25020k8750n425L413k632R199k5296n016R964K5367J6241j2439j6182R863
14551A03327L125j4529J547J6346O371j351P255O000k0305k2982n588M253J7518
14538A00987J7983o459l558N721O068j746L071L736p338P411j80j9659M663j5889
14524I4811n154o233k202M3244j864j878k4350l3009J1916K5854m336j065l524
14511I2210j6789K6164K1081j4082r134k536l2959j3563L4863J5693J4049l196
$$ plain form
14499 111801 96987 66809 59613 58232 44446 47299 59150 83153 59778 21105 25474 63395
14487 63395 72717 90781 120935 121897 118662 123722 120615 113769 107284 113123 114419 141814 129010 128267
14473 128267 108876 97441 118541 121158 110415 99812 94712 99194 114238 141946 137633 129324
14461 129324 128277 92089 62966 73899 79725 111768 155608 152077 132582 116032 96094 74491
14449 74491 81939 80167 99679 130931 110246 97259 86118 76197 71862 61776 56519 42641 27285
14436 27285 51460 57485 83713 114090 91409 101962 95659 72356 52488 72965 99495 110213
14424 110213 92626 64901 55431 43068 28052 49290 65404 75358 74916 61218 59526 71986
14412 71986 67010 82143 83232 64072 69194 74086 102370 114061 114813 127706 92580 71090 63654
$$ packed form
14499A11801j4814l0178p196j381j3786K853J1851K4003k3375l8673M369L7921
14487F3395R322J8064L0154R62l235N060l107o846o485N839J296K7395j2804p43
14473A28267j9391j1435K1100K617j0743j0603n100M482J5044K7708m313q309
14461A29324j047l6188k9123J0933N826L2043M3840l531j9495j6550j9938k1603
14449G4491P448j772J9512L1252k0685j2987j1141r921m335j0086n257j3878j5356
14436B7285K4175O025K6228L0377k2681J0553o303k3303j9868K0477K6530J0718
14424A10213j7587k7725r470j2363j5016K1238J6114R954m42j3698j692J2460
14412G1986m976J5133J089j9160N122M892K8284J1691P52J2893l5126k1490p436
$$ plain form
14399 63654 66282 81612 114552 81104 48797 51734 64040 62719 66525 72361 74784 98853 111865
14386 111865 98989 69740 45070 67341 84723 66367 54890 43220 39152 79358 106395 79208
14374 79208 73542 78075 72281 93514 76047 63949 63730 60350 58646 61969 70028 64716 52105 40160
14360 40160 22245 39104 52066 34319 42682 57525 68157 74432 47180 42343 22689 30116
14348 30116 20452 775 30791 54055 50125 60541 67479 67273 65768 72610 58372 15151 11530
14335 11530 29720 33091 40729 63957 66256 47288 27724 31893 43864 56258 49222 42747 17006
14322 17006 26117 42473 63969 73518 42799 17111 40614 52144 46423 38075 44138 56761 59504
14309 59504 48504 60862 68040 83183 72159 88776 73762 38889 44947 53676 67641 74873
$$ packed form
14399F3654K628J5330L2940l3448l2307K937J2306j321L806N836K423K4069J3012
14386A11865j2876k9249k4670K2271J7382j8356j1477j1670m068M0206K7037k7187
14374G9208n666M533n794K1233j7467j2098k19l380j704L323Q059n312j2611j1945
14360D0160j7915J6859J2962j7747Q363J4843J0632O275k7252m837j9654P427
14348C0116r664j9677L0016K3264l930J0416O938k06j505O842j4238m3221l621
14335A1530J8190L371P638K3228K299j8968j9564M169J1971J2394p036o475k5741
14322A7006R111J6356K1496R549l0719k5688K3503J1530n721q348O063J2623K743
14309E9504j1000J2358P178J5143j1024J6617j5014l4873O058Q729J3965P232
$$ plain form
14297 74873 66940 47593 43234 58413 42044 26661 34012 48615 56291 50704 23232 6391 25375
14284 25375 32807 19943 24378 34706 47964 52365 41625 43966 43344 47646 38324 52561 64476
14271 64476 49763 37183 21116 40585 37745 75300 104729 98820 86488 67734 59007 70234
14259 70234 75024 74254 57484 19727 16895 4228 23137 23666 13083 28510 41811 23673 39710
14246 39710 45255 48424 63273 78965 71114 68735 58418 59316 36378 54800 58518 6016 -3185
14233 -3185 20884 35164 22620 7389 18362 30743 26818 39598 47435 36032 21730 18002
14221 18002 4164 19312 47564 56368 43601 68133 58490 72533 88860 75156 55775 26996
14209 26996 26589 45710 24367 29963 31930 34780 24270 5666 -8721 32827 76855 79799 56533
$$ packed form
14297G4873p933j9347m359J5179j6369j5383P351J4603P676n587k7472j6841J8984
14284B5375P432j2864M435J0328J3258M401j0740K341o22M302r322J4237J1915
14271F4476j4713j2580j6067J9469k840L7555K9429n909j2332j8754q727J1227
14259G0234M790p70j6770l7757k832j2667J8909N29j0583J5427J3301j8138J6037
14246C9710N545L169J4849J5692p851k379j0317Q98k2938J8422L718n2502r201
14233c185K4069J4280j2544j5231J0973J2381l925J2780P837j1403j4302l728
14221A8002j3838J5148K8252Q804j2767K4532r643J4043J6327j3704j9381k8779
14209B6996m07J9121k1343N596J967K850j0510j8604j4387M1548M4028K944k3266
$$ plain form
14196 56533 20440 4253 -9432 -12395 26987 23393 11391 -11474 -19992 2076 17898 18296 32565
14183 32565 32863 50844 55796 68394 80396 86231 53723 26966 52778 53019 38554 53273 68879
14170 68879 48346 30798 18824 31658 38196 29118 29568 22392 29056 36927 29629 42936 39279
14157 39279 13292 5617 18696 35882 49698 31295 12074 23208 1377 -22716 -11817 -22319
14145 -22319 -36196 -18951 -13407 -11370 -3469 13081 16226 14364 9774 32592 62351 56132 22815
14132 22815 2208 -28193 -47119 -11999 -17993 -25429 -8328 44041 59791 66554 73009 58587
14120 58587 34017 22809 53734 39743 31629 43346 33606 23677 35418 24579 -19097 -16903
14108 -16903 1322 -11297 2804 96 -4916 19914 8661 -21829 -31645 -41105 -47058 -39497 -13386
$$ packed form
14196E6533l6093j6187j3685k963L9382l594j2002k2865q518K2068J5822L98J4269
14183C2565K98J7981M952J2598J2002N835l2508k6757K5812K41j4465J4719J5606
14170F8879k0533j7548j1974J2834O538r078M50p176O664P871p298J3307l657
14157C9279k5987p675J3079J7186J3816j8403j9221J1134k1831k4093J0899j0502
14145b2319j3877J7245N544K037P901J6550L145j862m590K2818K9759o219l3317
14132B2815k0607l0401j8926L5120n994p436J7101N2369J5750O763O455j4422
14120E8587k4570j1208L0925j3991q114J1717r740r929J1741j0839m3676K194
14108a6903J8225j2619J4101k708n012K4830j1253l0490r816r460n953P561K6111
$$ plain form
14095 -13386 -10707 -6308 19682 -252 5089 -1048 18628 9415 4440 10421 -17484 -32293 -3365
14082 -3365 24649 22433 48403 74101 64530 59850 31445 20734 17924 4319 -5561 13588 45898
14069 45898 69138 56823 29132 11004 -2799 -6534 -23246 -19593 -8222 3409 8210 2338
14057 2338 -10209 -20999 -846 22298 15887 -22714 502 19726 13075 15209 47273 54001 59640
14044 59640 45465 26586 29677 33738 35876 39990 35865 44362 44847 -6452 -21645 5886 28674
14031 28674 30191 30563 28418 19867 13366 7519 -899 -16136 -11654 12892 28571 26158 17961 21549
14017 21549 35983 25718 20861 35744 40428 35481 37616 40649 29284 -7912 -8403 5836 -12086
14004 -12086 -27946 -15612 20401 39633 42530 55829 33438 10065 68 5025 13445 1342
$$ packed form
14095a3386K679M399K5990j9934N341o137J9676r213m975N981k7905j4809K8928
14082c365K8014k216K5970K5698r571m680k8405j0711k810j3605r880J9149L2310
14069D5898K3240j2315k7691j8128j3803l735j6712L653J1371J1631M801n872
14057B338j2547j0790K0153K3144o411l8601K3216J9224o651K134L2064O728N639
14044E9640j4175j8879L091M061K138M114m125Q497M85n1299j5193K7531K2788
14031B8674J517L72k145q551o501n847q418j5237M482K4546J5679k413q197L588
14017B1549J4434j0265m857J4883M684m947K135L033j1365l7196m91J4239j7922
14004a2086j5860J2334L6013J9232K897J3299k2391k3373r997M957Q420j2103
$$ plain form
13992 1342 -8212 -8657 -5580 8922 -2215 8263 46630 69554 42209 -1725 -6839 5806 5057
13979 5057 21126 1916 6985 28085 40556 9969 17760 22502 21383 21255 35854 10242 2873
13966 2873 24746 24373 45265 56354 42376 45089 57164 1122 -21686 2074 -768 -27958 -9198
13953 -9198 25419 39954 41833 50612 57259 45023 22427 -6408 -31784 -5582 379 -5525 6293
13940 6293 21722 17197 -6898 -1781 1920 1118 -20545 -4154 6990 -2264 17146 2880 -33233
13927 -33233 -19117 7923 21166 31299 43120 21895 18820 24911 31793 15726 32456 47137
13915 47137 40313 19989 5268 64 8158 16509 6328 -10399 -28246 806 27938 9370
13903 9370 -19974 -7243 8881 41087 41944 23334 876 -10484 14941 13556 -15563 -18475 1884
$$ packed form
13992A342r554m45L077J4502j1137J0478L8367K2924k7345m3934n114J2645p49
13979E057J6069j9210N069K1100J2471l0587P791M742j119j28J4599k5612p369
13966B873K1873l73K0892J1089j3978K713J2075n6042k2808K3760k842k7190J8760
13953i198L4617J4535J879Q779O647j2236k2596k8835k5376K6202N961n904J1818
13940F293J5429m525k4095N117L701q02k1663J6391J1144r254J9410j4266l6113
13927c3233J4116K7040J3243J0133J1821k1225l075O091O882j6067J6730J4681
13915D7137o824k0324j4721n204Q094Q351j0181j6727j7847K9052K7132j8568
13903I370k9344J2731J6124L2206Q57j8610k2458j1360K5425j385k9119k912K0359
$$ plain form
13890 1884 28624 22930 32565 43238 47237 49752 29488 62774 51947 41248 45342 19454 11335
13877 11335 20725 17564 9395 4891 42699 55510 54711 40435 40545 15953 8245 -6334 31538
13864 31538 33028 11713 -11048 -25374 -23474 -21134 -5774 26342 43333 21780 13448 -21954
13852 -21954 -16440 7212 15920 9549 916 28036 21655 28118 19603 29708 19735 10812 -28767
13839 -28767 -32110 9854 23052 42125 5689 -7166 -10828 9256 31610 25324 3729 12974
13827 12974 12294 4190 -7322 -13209 -14694 -15926 -7423 -1442 -13469 5319 10690 70 6825 29281
13813 29281 46134 53562 51809 23265 3585 13409 17654 7529 -6819 -5534 -10559 13992 2967
13800 2967 6123 17886 15851 6399 -7873 -5504 -10534 13414 40655 49956 33541 6186 -842
$$ packed form
13890A884K6740n694R635J0673L999K515k0264L3286j0827j0699M094k5888q119
13877A1335R390l161q169m504L7808J2811p99j4276J10k4592p708j4579L7872
13864C1538J490k1315k2761j4326J900K340J5360L2116J6991k1553q332l5402
13852b1954N514K3652Q708o371q633K7120o381O463q515J0105r973q923l9579
13839b8767l343M1964J3198J9073l6436j2855l662K0084K2354o286k1595R245
13827A2974o80q104j1512n887j485j232Q503N981j2027J8788N371j0620O755K2456
13813B9281J6853P428j753k8544j9680R824M245j0125j4348J285n025K4551j1025
13800B967L156J1763k035r452j4272K369n030K3948K7241R301j6415k7355p028
$$ plain form
13787 -842 13585 48495 69810 70091 54567 60369 55237 49885 29334 15380 8895 15944 27276
13774 27276 19010 23976 16948 26059 42293 9596 21287 3983 2557 22519 32083 32258 21589
13761 21589 7743 -4898 15933 29358 661 -18103 -30330 17563 31114 27802 40562 22546
13749 22546 4112 -3079 -33486 -22905 -15728 -1946 16323 30324 20761 -5253 -726 40499
13737 40499 39523 26018 7140 19739 53763 55442 20112 8983 18974 26062 -1578 -4248 -13675
13724 -13675 -11516 -14690 -21954 -22888 -2710 4995 84 -5242 10041 -7537 14733 15571 -8117 -14413
13710 -14413 -31872 -57830 -75217 -44429 -5223 -13604 -31566 -24323 -4963 9128 14746 2535
13698 2535 -6590 -10596 -1575 8800 21287 46513 34752 27411 26747 24197 19458 45324 44204 27360
$$ packed form
13787h42J4427L4910K1315K81j5524N802n132n352k0551j3954o485P049J1332
13774B7276q266M966p028R111J6234l2697J1691j7304j426J9962R564J75j0669
13761B1589j3846j2641K0831J3425k8697j8764j2227M7893J3551l312J2760j8016
13749B2546j8434p191l0407J0581P177J3782J8269J4001r563k6014M527M1225
13737D0499r76j3505j8878J2599L4024J679l5330j1129R991P088k7640k670r427
13724a3675K159l174p264r34K0178P705m911n326J5283j7578K2270Q38k3688o296
13710a4413j7459k5958j7387L0788L9206q381j7962P243J9360J4091N618j2211
13698B535r125m006R021J0375J2487K5226j1761p341o64k550m739K5866j120j6844
$$ plain form
13684 27360 8262 36385 37459 23620 -2229 -6510 -15374 -12791 -11436 -18366 -20662 -30598 -42396
13671 -42396 -30981 -39634 -54660 -26915 1645 -1027 11155 10695 6372 7023 -8678 -1515 1852
13658 1852 -38379 -37634 -21252 460 31011 5171 2556 14058 -13807 -24965 -1137 12185
13646 12185 11215 -2242 3102 14880 21108 6096 19762 34512 28627 6651 27302 19725 3309
13633 3309 24925 50199 49276 33676 48068 53720 22052 15564 16972 -33 -22295 -10370 22269
13620 22269 20672 5961 17145 12436 -13029 -15002 24427 30832 16767 15440 -39 9858 34366
13607 34366 26257 13705 25804 45321 36870 30276 19443 -5355 -10485 1745 -2070 14683 26915
13594 26915 -5841 -27854 -12745 -13911 1034 30666 42858 4238 -3819 727 6114 -63 11576
$$ packed form
13684B7360j9098K8123J074j3839k5849m281q864K583J355o930k296r936j1798
13671d2396J1415q653j5026K7745K8560k672J2182m60m323O51j5701P163L367
13658A852m0231P45J6382K1712L0551k5840k615J1502k7865j1158K3828J3322
13646A2185r70j3457N344J1778O228j5012J3666J4750n885k1976K0651p577j6416
13633C309K1616K5274r23j5600J4392N652l1668o488J408j7005k2262J1925L2639
13620B2269j597j4711J1184m709k5465j973L9429O405j4065j327j5479R897K4508
13607C4366q109j2552J2099J9517q451o594j0833k4798n130J2230l815J6753J2232
13594B6915l2756k2013J5109j166J4945K9632J2192l8620q057M546N387o177J1639
$$ plain form
13581 11576 11929 27556 40853 38422 29437 16976 13862 270 5317 8454 -436 -13591 -17292
13568 -17292 -2728 -3665 -56801 -61327 -17232 -1672 -4656 -5848 26997 42229 41492 39430 51779
13555 51779 29713 3574 -1661 16905 -8744 -14320 -5680 8973 -11219 -50 16922 19533
13543 19533 20648 -13427 -7289 3780 17970 -4496 -8921 919 -19326 -13616 -19571 -25931 -17872
13530 -17872 -5795 9526 46218 36752 9262 14502 41766 46544 28500 31125 31775 24859 24220
13517 24220 10564 -18293 -12538 -194 12831 29729 49802 41200 34505 23186 16308 17253 -3388
13504 -3388 -10989 -12540 -11497 -21416 -19516 -1554 13956 3004 -42263 -63116 -41945 -28165 -39908
13491 -39908 -74257 -62230 -41472 -14519 2946 10354 -2646 1810 11232 11710 10230 48686 81388
$$ packed form
13581A1576L53J5627J3297k431q985j2461l114j3592N047L137q890j3155l701
13568a7292J4564r37n3136m526M4095J5560k984j192L2845J5232p37k062J2349
13555E1779k2066k6139n235J8566k5649n576Q640J4653k0192J1169J6972K611
13543A9533J115l4075O138J1069J4190k2466m425R840k0245N710n955o360Q059
13530a7872J2077J5321L6692r466k7490N240K7264M778j8044K625O50o916o39
13517B4220j3656k8857N755J2344J3025J6898K0073q602o695j1319o878R45k0641
13504c388p601j551J043r919J900J7962J5510j0952m5267k0853K1171J3780j1743
13491c9908l4349J2027K0758K6953J7465P408j3000M456R422M78j480L8456L2702
$$ plain form
13478 81388 64370 17615 5830 12511 -9621 -14898 17618 21506 8094 9941 19891 11581 1858
13465 1858 4242 469 -12985 7656 40366 37772 32412 14223 7395 20206 17840 19253 10270
13452 10270 -12391 -25739 -348 -9010 3120 -619 1583 8547 15111 32653 27778 -6587 -8772
13439 -8772 -5814 -4131 -12360 -36215 -41245 -18627 1343 15972 -3012 -9915 -15810 -17877 14150
13426 14150 11032 -6518 5297 15886 233 -21621 -36933 -48675 -37346 -61649 -70060 -52991
13414 -52991 -25037 -31546 -18864 -36624 -46851 -52037 -42953 -26074 -14183 -14797 -33857 -21680 -24790
13401 -24790 -22324 -8266 8651 -5177 9791 11498 -13846 -18505 -23958 -31884 -23553 -30129 -40590
13388 -40590 -29186 -45136 -45961 -20532 10466 10493 22893 45728 60143 48217 43718 41390 6589
$$ packed form
13478H1388j7018m6755j1785O681k2132n277L2516L888j3412J847R950q310r723
13465A858K384l773j3454K0641L2710k594n360j8189o828J2811k366J413q983
13452A0270k2661j3348K5391q662J2130l739K202O964O564J7542m875l4365k185
13439h772K958J683q229k3855n030K2618J9970J4629j8984o903n895k067L2027
13426A4150l118j7550J1815J0589j5653k1854j5312j1742J1329k4303q411J7069
13414e2991K7954o509J2682j7760j0227n186R084J6879J1891o14j9060J2177l110
13401b4790K466J4058J6917j3828J4968J707k5344m659n453p926Q331o576j0461
13388d0590J1404j5950q25K5429L0998K7J2400K2835J4415j1926m499k328l4801
$$ plain form
13375 6589 -614 -3415 -13971 -18671 -27902 -33002 16673 41466 28645 18937 15394 13479 1061
13362 1061 -4107 9970 -1772 -11145 13114 33281 27935 5466 -789 -4260 19636 16630 8881
13349 8881 -9509 -26629 -42124 -11178 15085 18155 19845 9468 28775 51533 43110 22793
13337 22793 -10319 -12180 12272 10340 -11474 -31633 -42612 -45156 -22960 -33014 -19955 -7848
13325 -7848 5938 45731 54815 33293 19801 14278 15745 -15022 -22442 -15338 -17962 -35790 -29300
13312 -29300 -9707 -15559 -15343 -38074 -47871 -51866 -68591 -44783 -31409 -41200 -29136 9543 25999
13299 25999 1935 -11426 -16543 -34501 -20544 4357 4873 4178 -6911 -20925 -12447 14297 51632
13286 51632 45711 35036 50197 49569 64763 61286 31718 43873 49442 4685 -996 4505 17295
$$ packed form
13375F589p203k801j0556m700r231n100M9675K4793j2821r708l543j915j2418
13362A061n168J4077j1742r373K4259K0167n346k2469o255l471K3896l006p749
13349H881j8390j7120j5495L0946K6263L070J690j0377J9307K2758q423k0317
13337B2793l3112j861K4452j932k1814k0159j0979k544K2196j0054J3059J2107
13325g848J3786L9793R084k1522j3492n523J467l0767p420P104k624j7828O490
13312b9300J9593n852K16k2731r797l995j6725K3808J3374r791J2064L8679J6456
13299B5999k4064j3361n117j7958J3957K4901N16o95j1089j4014Q478K6744L7335
13286E1632n921j0675J5161o28J5194l477k9568J2155N569m4757n681N501J2790
$$ plain form
13273 17295 48990 41748 21876 23878 48570 41989 40390 54389 54518 15503 5117 27897 25301
13260 25301 -22710 -49631 -44967 -37409 -35365 -40590 -32834 -15279 -28410 -24355 -435 7494 -2393
13247 -2393 -6989 -32743 -32640 3239 33797 64509 37927 -32604 -70076 -32076 12020 13544 -22132
13234 -22132 -25551 -18866 -14896 -23476 -23736 -12019 6560 -22675 -38053 -58065 -57615 -32600 -16139
13221 -16139 -6907 -23608 -20561 11271 36264 40647 8377 33135 53736 47461 48229 8562 -29482
13208 -29482 -15627 -26937 -52850 -47468 -30986 -14026 -27603 -63491 -59858 -12442 12821 -3227
13196 -3227 6049 -9878 -14731 -4031 -186 -9773 1095 17817 23097 7537 32057 39557 13368
13183 13368 -6275 382 28789 6107 -16656 -7854 15489 18675 -10678 -17580 -1505 -2278 14853
$$ packed form
13273A7295L1695p242j9872K002K4692o581j599J3999J29l9015j0386K2780k596
13260B5301m8011k6921M664P558K044n225P756J7555j3131M055K3920P929r887
13247b393m596k5754J03L5879L0558L0712k6582p0531l7472L8000M4096J524l5676
13234b2132l419O685L970q580k60J1717J8579k9235j5378k0012M50K5015J6461
13221a6139R232j6701L047L1832K4993M383l2270K4758K0601o275P68l9667l8044
13208b9482J3855j1310k5913N382J6482J6960j3577l5888L633M7416K5263j6048
13196c227R276j5927m853J0700L845r587J0868J6722N280j5560K4520P500k6189
13183A3368j9643O657K8407k2682k2763Q802K3343L186k9353o902J6075p73J7131
$$ plain form
13170 14853 11687 10781 10195 13340 30915 28459 34569 38212 44589 36089 30639 25352 26841 38042
13156 38042 39828 58123 68037 85819 84877 97067 87253 124088 138066 157082 179545 191700 192771
13143 192771 183558 176948 221294 255671 273830 310587 336143 403465 503136 590814 675587 861760
13131 861760 1066865 1297134 1600997 1981705 2235928 2282553 1995927 1517989 1113077 812092
13121 812092 603290 461049 391988 340836 275098 207896 151545 148819 147072 123504 89511
13110 89511 91236 105508 91806 79582 43869 26804 28969 41834 52693 60887 39140 45076
13098 45076 54340 49109 73289 47887 56373 36193 19780 24814 33991 26712 10854 2879 5188
13085 5188 31772 41237 24437 39776 50967 55826 31188 8735 -41 31133 40453 20994 10593
$$ packed form
13170A4853l166r06n86L145J7575k456O110L643O377q500n450n287J489J1201
13156C8042J786J8295R914J7782r42J2190r814L6835J3978J9016K2463J2155J071
13143A92771r213o610M4346L4377J8159L6757K5556O7322R9671Q7678Q4773J86173
13131H61760K05105K30269L03863L80708K54223M6625k86626m77938m04912l00985
13121H12092k08802j42241o9061n1152o5738o7202n6351k726j747k3568l3993
13110H9511J725J4272j3702j2224l5713j7065K165J2865J0859Q194k1747N936
13098D5076R264n231K4180k5402Q486k0180j6413N034R177p279j5858p975K309
13085E188K6584R465j6800J5339J1191M859k4638k2453q776L1174R320j9459j0401
$$ plain form
13072 10593 -15525 -21991 -10584 -6726 835 11241 45560 50940 47572 36729 48755 60674 33445
13059 33445 6643 -20145 -24324 -41844 -50889 9112 40029 45659 21801 -12079 -31820 -1428
13047 -1428 28348 30940 38977 10921 -26681 -11755 37200 66842 43439 11011 -22635 6809
13035 6809 14977 26107 50756 50317 50251 47267 44998 22577 27227 44007 35495 23047 30669 20362
13021 20362 11831 -5867 1292 8678 3206 10916 51188 35032 -382 -711 -13217 -15441 -18185
13008 -18185 -40183 -39835 -24389 19815 26589 948 1754 -348 -13585 361 8601 -12812 -8400
12995 -8400 -6292 -11335 -6940 -119 -2315 -22624 -30498 -44178 -73555 -91746 -93336 -113108 -131027
12982 -131027 -115324 -125820 -162578 -201186 -205227 -216387 -188183 -121613 -86877 -73838 13851 86102
$$ packed form
13072A0593k6118o466J1407L858P561J0406L4319N380l368j0843J2026J1919k7229
13059C3445k6802k6788m179j7520r045O0001L0917N630k3858l3880j9741L0392
13047a428K9776K592Q037k8056l7602J4926M8955K9642k3403l2428l3646K9444
13035F809Q168J1130K4649m39o6k984k269k2421M650J6780q512j2448P622j0307
13021B0362q531j7698P159P386n472P710M0272j6156l5414l29j2506k224k744
13008a8185k1998L48J5446M4204O774k5641Q06k102j3237J3946Q240k1413M412
12995h400K108n043M395O821k196k0309p874j3680k9377j8191j590j9772j7919
12982a31027J5703j0496l6758l8608m041j1160K8204O6570L4736J3039Q7689P2251
$$ plain form
12970 86102 75180 56440 65138 77417 80275 92002 91722 115802 115141 88370 82218 103175 93323
12957 93323 64919 28778 43957 26547 41746 68127 63102 85533 67598 59571 74760 71777
12945 71777 15040 -19410 8944 30490 16391 5808 33045 55649 91690 62405 46045 48974
12933 48974 41077 40269 52301 67927 96261 94562 76610 70393 79195 73009 66072 73279 55976
12920 55976 45456 51544 80290 98067 64790 55599 31892 63794 94148 89996 82138 95737
12908 95737 127885 127027 102414 95480 87980 59846 57466 78583 66641 74727 96410 124060 126065
12895 126065 120398 140642 154234 154409 146846 136603 137337 149629 147666 142400 120117 79179 73036
12882 73036 69754 57880 52790 63344 79393 60208 48339 71999 93631 86526 83705 123583
$$ packed form
12970H6102j0922j8740Q698J2279K858J1727k80K4080o61k6771o152K0957r852
12957I3323k8404l6141J5179j7410J5199K6381n025K2431j7935q027J5189k983
12945G1777n6737l4450K8354K1546j4099j0583K7237K2604L6041k9285j6360K929
12933D8974p897q08J2032J5626K8334j699j7952o217Q802o186o937P207j7303
12920E5976j0520O088K8746J7777l3277r191k3707L1902L0354m152p858J3599
12908I5737L2148q58k4613o934p500k8134k380K1117j1942Q086K1683K7650K005
12895A26065n667K0244J3592J75p563j0243P34J2292j963n266k2283m0938o143
12882G3036l282j1874n090J0554J6049j9185j1869K3660K1632p105k821L9878
$$ plain form
12870 123583 166934 167393 201431 155078 128849 123875 111649 120428 89521 75721 79244 77093 81074
12857 81074 93004 98439 84822 35393 32919 40597 62181 71017 84685 75343 54668 64154 104292
12844 104292 141657 119595 56977 55328 74584 98668 116871 108831 93802 118430 170988 196037
12832 196037 165469 161235 201773 220276 235998 257608 271712 377649 536771 734674 965953
12821 965953 1207339 1281060 1109713 942682 804441 693280 614203 536451 489540 454024
12811 454024 433760 430611 469850 469250 467390 479353 486579 465996 479855 520805 548447 579788
12799 579788 608883 603792 557208 534814 522319 582960 608491 609916 598714 559659 577033 632659
12787 632659 632134 616812 558141 474667 431461 450928 415488 333633 291252 296457 332581 357086
$$ packed form
12870A23583M3351M59L4038m6353k6229m974j2226Q779l0907j3800L523k151L981
12857H1074J1930N435j3617m9429k474P678K1584Q836J3668r342k0675R486M0138
12844A04292L7365k2062o2618j649J9256K4084J8203q040j5029K4628N2558K5049
12832A96037l0568m234M0538J8503J5722K1610J4104J05937J59122J97903K31279
12821I65953K41386P3721j71347j67031j38241j11161p9077p7752m6911l5516
12811D54024k0264l149L9239o00j860J1963P226k0583J3859M0950K7642L1341
12799E79788K9095n091m6584k2394j2495O0641K5531J425j1202l9055J7374N5626
12787F32659n25j5322n8671q3474m3206J9467l5440q1855m2381N205L6124K4505
$$ plain form
12775 357086 389145 432931 419963 410341 433471 455675 482014 440373 411277 453461 498207 493863
12763 493863 518693 539633 536459 540958 524017 512552 511979 501910 495764 509342 520864 490661
12751 490661 504929 553185 578026 556372 512414 507512 528745 521302 517988 555406 594464 623658
12739 623658 654726 718988 750515 794053 828836 837970 869883 911753 983897 1044430 1098571 1184138
12727 1184138 1269446 1341672 1397267 1441345 1492770 1515576 1548107 1583078 1660052 1745787 1876315
12716 1876315 2028975 2207430 2362853 2526938 2730883 2986703 3250828 3501168 3770560
12707 3770560 4071657 4426947 4785670 5178088 5667765 6275387 6958401 7710748 8503950
12698 8503950 9340817 10227460 11215495 12156463 13012584 13849018 14699628 15621988 16697068
$$ packed form
12775C57086L2059M3786j2968r622K3130K2204K6339m1641k9096M2184M4746m344
12763D93863K4830K0940l174M499j6941j1465n73j0069o146J3578J1522l0203
12751D90661J4268M8256K4841k1654m3958m902K1233p443l314L7418L9058K9194
12739F23658L1068O4262L1527M3538L4783R134L1913M1870P2144O0533N4141Q5567
12727A184138Q5308P2226N5595M4078N1425K2806L2531L4971P6974Q5735J30528
12716A876315J52660J78455J55423J64085K03945K55820K64125K50340K69392
12707C770560L01097L55290L58723L92418M89677O07622O83014P52347P93202
12698H503950Q36867Q86643R88035R40968Q56121Q36434Q50610R22360J075080
$$ plain form
12689 16697068 17958047 19447900 21278858 23583415 26377040 29493369 32807370 36447496
12681 36447496 40376174 43876819 46502686 48806531 51354169 54539852 59540628 67783957
12673 67783957 81360646 102810109 134032403 173476946 223599787 290841961 363283859
12666 363283859 412451943 417625841 346694474 256515327 184284315 128781376 91138995
12659 91138995 66696387 50738816 39868229 31993000 26121028 21759097 18525550 15986970
12651 15986970 13786250 11933193 10373320 9064813 7974291 7068415 6363128 5812973
12643 5812973 5349992 4931075 4539256 4163996 3830807 3540383 3231049 2999209 2861697
12634 2861697 2696747 2554719 2429986 2311082 2213577 2048585 1875237 1762391 1641879 1491005
$$ packed form
12689A6697068J260979J489853J830958K304557K793625L116329L314001L640126
12681C6447496L928678L500645K625867K303845K547638L185683N000776Q243329
12673F7783957J3576689K1449463L1222294L9444543N0122841O7242174P2441898
12666C63283859M9168084N173898p0931367r0179147p2231012n5502939l7642381
12659I1138995k4442608j5957571j0870587p875229n871972m361931l233547k538580
12651A5986970k200720j853057j559873j308507j090522r05876p05287n50155
12643E812973m62981m18917l91819l75260l33189k90424l09334k31840j37512
12634B861697j64950j42028j24733j18904r7505j64992j73348j12846j20512j50874
$$ plain form
12624 1491005 1418752 1361164 1286181 1260759 1224421 1194974 1182471 1130241 1083817 1056371 981671
12613 981671 913662 871522 856109 797609 705305 637443 607541 604114 590685 609705 672953 672786
12601 672786 657042 654350 636726 586113 553179 557524 557014 546263 543339 563225 591402 578141
12589 578141 562583 561816 538414 512290 487886 456100 425125 406991 372069 343594 344095 355517
12577 355517 361033 346373 306389 293116 269569 239578 269042 266191 261842 264928 287678 335232
12565 335232 355089 296795 284456 323624 339488 324152 311655 308640 292699 296987 286894 263820
12553 263820 292806 313489 307575 288500 243502 225705 219144 204100 172955 180552 186967 161453
12541 161453 131354 89967 81011 46892 25171 47692 35337 30476 33907 2809 -14336 -14393 -29003
$$ packed form
12624A491005p2253n7588p4983k5422l6338k9447j2503n2230m6424k7446p4700
12613I81671o8009m2140j5413n8500r2304o7862k9902l427j3429J9020O3248j67
12601F72786j5744k692j7624n0613l2934M345n10j0751k924J9886K8177j3261
12589E78141j5558p67k3402k6124k4404l1786l0975j8134l4922k8475N01J1422
12577C55517N516j4660l9984j3273k3547k9991K9464k851m349L086K2750M7554
12565C35232J9857n8294j2339L9168J5864j5336j2497l015j5941M288j0093k3074
12553B63820K8986K0683n914j9075m4998j7797o561j5044l1145P597O415k5514
12541A61453l0099m1387q956l4119k1721K2521j2355m861L431l1098j7145n7j4610
$$ plain form
12528 -29003 -28850 -28891 -47042 -67398 -81763 -118466 -150200 -158620 -181658 -189123 -229881 -304740 -404955
12515 -404955 -523598 -647503 -762199 -884794 -929967 -867870 -647409 -351888 -138349 -1026
12505 -1026 96501 157175 159726 169590 172301 175881 165783 160440 157538 121816 119745 145358 166885
12492 166885 145330 129099 131885 117987 70784 47870 65282 45010 22282 20216 39941 47650
12480 47650 63273 100283 125887 142549 173042 174158 136215 81775 63753 54953 40898 58061
12468 58061 62019 44592 58937 72928 53270 32572 38156 33735 33401 30983 39893 67129 97816
12455 97816 102970 102857 78885 60214 35206 30836 28038 54784 63502 33917 36070 20583 1374
12442 1374 6075 33833 51122 41116 60153 85788 108203 130237 137484 142333 155245 158151 122203
$$ packed form
12528b9003J53m1j8151k0356j4365l6703l1734q420k3038p465m0758p4859j00215
12515d04955j18643j23905j14696j22595m5173O2097K20461K95521K13539J37323
12505a026R7527O0674K551R864K711L580j0098n343k902l5722k071K5613K1527
12492A66885k1555j6231K786j3898m7203k2914J7412k0272k2728k066J9725P709
12480D7650J5623L7010K5604J6662L0493J116l7943n4440j8022q800j4055J7163
12468E8061L958j7427J4345J3991j9658k0698N584m421l34k418Q910K7236L0687
12455I7816N154j13k3972j8671k5008m370k798K6746Q718k9585K153j5487j9209
12442A374M701K7758J7289j0006J9037K5635K2415K2034P247M849J2912K906l5948
$$ plain form
12429 122203 94843 94256 92967 96763 81466 60515 52715 38663 33057 19415 47260 85361 102126
12416 102126 75519 80846 75163 94020 89938 89264 100252 59258 33905 38407 58945 82505 73563
12403 73563 39630 38980 57617 60049 78344 101077 86945 67271 59351 36010 19194 45965
12391 45965 32022 11292 5933 19465 -6954 -10787 -7699 1745 30312 58774 74678 46133
12379 46133 25242 26140 59448 71058 69124 38263 22466 39930 55853 21418 8172 16911
12367 16911 13772 11941 11182 28043 13535 -4726 -25104 -4681 54348 114549 129100 188868
12355 188868 265170 313530 321456 299128 241769 196202 163588 132591 104853 97758 92384 86905
12343 86905 89801 63325 67367 61543 32148 39148 56398 62548 82639 76744 63467 69269 55733
$$ packed form
12429A22203k7360n87j289L796j5297k0951p800j4052n606j3642K7845L8101J6765
12416A02126k6607N327n683J8857m082o74J0988m0994k5353M502K0538K3560q942
12403G3563l3933o50J8637K432J8295K2733j4132j9674p920k3341j6816K6771
12391D5965j3943k0730n359J3532k6419l833L088R444K8567K8462J5904k8545
12379D6133k0891Q98L3308J1610j934l0861j5797J7464J5923l4435j3246Q739
12367A6911l139j831p59J6861j4508j8261k0378K0423N9029O0201J4551N9768
12355A88868P6302M8360P926k2328n7359m5567l2614l0997k7738p095n374n479
12343H6905K896k6476M042n824k9395P000J7250O150K0091n895j3277N802j3536
$$ plain form
12330 55733 26836 47500 39968 41351 59531 92551 99233 95703 72209 48169 58979 69993
12318 69993 31580 21380 54224 73188 64913 54068 36819 25404 53569 49192 33227 14368
12306 14368 11083 19066 49432 52351 40922 37965 24460 12357 -48602 -73715 -40165 -5547
12294 -5547 34897 36078 38143 52367 51764 59789 34945 4782 -19198 -26780 -17268 -6361 23961
12281 23961 37535 34371 35675 52120 53797 51474 -1873 -15865 11661 36060 41055 24698 22864
12268 22864 31994 -8852 -11198 13285 33493 29369 23102 22470 23033 12828 33113 34918 25583 599
12254 599 -14176 547 280 4422 9245 33953 41272 53909 73226 81253 29416 -22588 -34706
12241 -34706 -20224 16592 27850 59586 65640 41326 28933 40718 22592 11049 23555 26618
$$ packed form
12330E5733k8897K0664p532J383J8180L3020O682l530k3494k4040J0810J1014
12318F9993l8413j0200L2844J8964q275j0845j7249j1415K8165m377j5965j8859
12306A4368l285P983L0366K919j1429k957j3505j2103o0959k5113L3550L4618
12294e547M0444J181K065J4224o03Q025k4844l0163k3980p582R512J0907L0322
12281B3961J3574l164J304J6445J677k323n3347j3992K7526K4399M995j6357j834
12268B2864R130m0846k346K4483K0208m124o267o32N63j0205K0285J805r335k4984
12254E99j4775J4723k67M142M823K4708P319J2637J9317Q027n1837n2004j2118
12241c4706J4482L6816J1258L1736O054k4314j2393J1785j8126j1543J2506L063
$$ plain form
12229 26618 18555 12001 16187 1541 26157 65981 100449 89464 79951 77436 47458 34564 43386
12216 43386 48377 92594 128496 148654 141455 151410 184382 212996 254711 279941 283608 312879
12204 312879 413762 545443 667767 881464 1180623 1558223 1915232 2141218 2098718 1715676
12194 1715676 1311874 960974 664995 477597 366101 309824 266030 218593 173549 132024
12184 132024 131526 115311 117085 121548 109956 103290 115673 124752 142253 127253 144930 175633 168812
12171 168812 156411 182014 176365 156223 173169 207848 232923 236642 249280 291662 337192 344037
12159 344037 379281 438870 512546 606394 750384 954678 1240216 1547094 1888343 2186835
12149 2186835 2319131 2093626 1696102 1306842 974352 752542 625965 535310 454357 421217
$$ packed form
12229B6618q063o554M186j4646K4616L9824L4468j0985r513k515k9978j2894Q822
12216D3386M991M4217L5902K0158p199R955L2972K8614M1715K5230L667K9271
12204C12879J00883J31681J22324K13697K99159L77600L57009K25986m2500l83042
12194A715676m03802l50900k95979j87398j11496n6277m3794m7437m5044m1525
12184A32024m98j6215J774M463j1592o666J2383R079J7501j5000J7677L0703o821
12171A68812j2401K5603n649k0142J6946L4679K5075L719J2638M2382M5530O845
12159C44037L5244N9589P3676R3848J43990K04294K85538L06878L41249K98492
12149B186835J32296k25505l97524l89260l32490k21810j26577r0655q0953l3140
$$ plain form
12139 421217 397248 367753 336778 317481 339841 345392 347864 350671 329241 303679 306588 330763
12127 330763 366168 386002 403382 453565 505228 549885 657947 806636 937728 1123800 1416110
12116 1416110 1746861 2074123 2222321 1986881 1554365 1130772 797441 587351 460447
12107 460447 357847 275912 216080 185767 147396 106856 93929 78984 85968 96124 99923 94213
12095 94213 58591 4166 -1897 -7781 1423 26341 53721 62199 30405 21953 -13154 -5342 12377
12082 12377 -2521 -19656 -11236 19705 30741 3198 -16941 -14750 15164 25947 -9924 -42620
12070 -42620 4928 33517 6167 -24642 -19636 17050 36916 42236 41967 9355 -4256 5967
12058 5967 45132 29039 14749 -12489 -11436 -4542 -7765 -12019 -8016 14035 2246 -9380 -6725
$$ packed form
12139D21217k3969k9495l0975j9297K2360N551K472K807k1430k5562K909K4175
12127C30763L5405J9834J7380N0183N1663M4657J08062J48689J31092J86072K92310
12116A416110L30751L27262J48198k35440m32516m23593l33331k10090j26904
12107D60447j02600q1935n9832l0313l8371m0540j2927j4945O984J0156L799n710
12095I4213l5622n4425o063n884R204K4918K7380Q478l1794q452l5107P812J7719
12082A2377j4898j7135Q420L0941J1036k7543k0139K191K9914J0783l5871l2696
12070d2620M7548K8589k7350l0809N006L6686J9866N320k69l2612j3611J0223
12058E967L9165j6093j4290k7238J053O894l223m254M003K2051j1789j1626K655
$$ plain form
12045 -6725 15255 8229 -22113 -4142 17664 17919 21158 10182 -21530 -45735 -42091 -15044 -15313
12032 -15313 -18680 -19702 -18541 -26766 -19547 2316 7378 16552 59496 58897 25524 17148 34214 37270
12018 37270 15623 -11497 -10197 -19775 -30504 -64824 -64550 -22894 4367 23732 14036 -18684 -17316
12005 -17316 -9673 -2217 -19487 -23646 -21034 -5927 20709 28560 -22027 -42376 -22778 -5909 -18810
11992 -18810 -6698 3457 -825 8495 8422 10791 11794 946 -10691 2273 2055 -4527 -3175 -624
11978 -624 -8442 -977 19897 5171 2397 -6366 -13110 -17744 -12446 4659 -5861 13397 17658 17605
11964 17605 9352 7189 17248 -6300 -28968 -43115 -42492 -38605 -34236 -33611 -26469 -23810 -7709 19168
11950 19168 3120 2927 4822 6529 926 32479 26055 -1432 -2582 -27805 -33726 -37809 6763
$$ packed form
12045f725K1980p026l0342J7971K1806K55L239j0976l1712k4205L644K7047k69
12032a5313l367j022J161q225P219K1863N062R174M2944n99l3373q376J7066L056
12018C7270k1647k7120J300r578j0729l4320K74M1656K7261J9365r696l2720J368
12005a7316P643P456j7270m159K612J5107K6636P851n0587k0349J9598J6869j2901
11992a8810J2112J0155m282R320p3K369J003j0848j1637J2964k18o582J352K551
11978f24p818P465K0874j4726k774q763o744m634N298J7105j0520J9258M261n3
11964A7605q253k163J0059k3548k2668j4147O23L887M369O25P142K659J6101K6877
11950A9168j6048j93J895J707n603L1553o424k7487j150k5223n921m083M4572
$$ plain form
11937 6763 27728 -1454 -23332 -42216 -48080 -19209 -2079 8746 -1308 11804 5984 19545
11925 19545 9629 -14669 -36120 -51248 -40754 -25996 -45543 -27557 25583 49394 33501 6166
11913 6166 -9031 -9790 3001 9551 -604 -27549 -28563 -8043 -24603 -16176 -6081 -12361 -21681
11900 -21681 -24153 -10797 6722 11230 6333 10885 3324 17009 26583 18176 3876 24703 17364
11887 17364 1090 -9482 -18807 13317 18042 23700 30381 31744 35907 51369 40250 -2240 -16278
11874 -16278 -7495 -7130 -28264 -10915 -2828 -10917 -37627 -6877 19964 13313 20150 -5674 -18831
11861 -18831 -4614 -7520 -37613 -48773 -42330 -62257 -48461 -31314 -25558 -18297 -48296 -38331 -48916
11848 -48916 -29610 6675 20124 13429 5268 35292 33981 18845 11033 18123 32691 34177 34978
$$ packed form
11937F763K0965k9182k1878j8884n864K8871J7130J0825j0054J3112n820J3561
11925A9545r916k4298k1451j5128J0494J4758j9547J7986N3140K3811j5893k7335
11913F166j5197p59J2791O550j0155k6945j014K0520j6560Q427J0095o280r320
11900b1681k472J3356J7519M508m897M552p561J3685R574q407j4300K0827p339
11887A7364j6274j0572r325L2124M725N658O681J363M163J5462j1119m2490j4038
11874a6278Q783L65k1134J7349Q087q089k6710L0750K6841o651O837k5824j3157
11861a8831J4217k906l0093j1160O443j9927J3796J7147N756P261k9999R965j0585
11848d8916J9306L6285J3449o695q161L0024j311j5136p812P090J4568J486Q01
$$ plain form
11835 34978 38620 5759 4755 -30558 -37272 -40060 -24792 12723 14577 -529 -10884 2550 13433
11822 13433 19186 38783 10725 -31434 -40714 -21563 5239 15925 21762 6947 8367 -10130
11810 -10130 -18231 -50890 -66215 -63703 -57521 -38196 -16931 10040 -8735 -23302 -17418 8482
11798 8482 22738 -5719 -30099 -25574 -9631 -21551 -3843 -10992 -10122 -9396 -27481 -20568 1988
11785 1988 -20496 -32952 -25073 -35121 -14934 18356 -3278 -19690 -26282 -33319 -57600 -57765 -55382
11772 -55382 -53155 -30783 -31891 -14116 -16450 -40850 -24795 -32478 -28677 -27624 -30212 -6363 -8411
11759 -8411 9125 6952 -3758 -33238 -37872 -20768 -10668 10896 27050 36086 27843 22886 -16800
11746 -16800 -48860 -28242 -27639 -25844 16960 27294 37893 44497 43182 38416 7995 -7271 15931
$$ packed form
11835C4978L642l2861j004l5313o714k788J5268L7515J854j5106j0355J3434J0883
11822A3433N753J9597k8058m2159r280J9151K6802J0686N837j4815J420j8497
11810a0130q101l2659j5325K512O182J9325K1265K6971j8775j4567N884K5900
11798H482J4256k8457k4380M525J5943j1920J7708p149Q70P26j8085O913K2556
11785A988k2484j2456P879j0048K0187L3290k1634j6412o592p037k4281j65K383
11772e5382K227K2372j108J7775k334k4400J6055p683L801J053k588K3849k048
11759h411J7536k173j0710k9480m634J7104J0100K1564J6154R036q243m957l9686
11746a6800l2060K0618O03J795M2804J0334J0599O604j315m766l0421j5266K3202
$$ plain form
11733 15931 1848 -40181 -65946 -47330 -24398 -15707 -16640 -17999 -29562 -19936 432 -7031 -37143
11720 -37143 -35617 -17556 -23841 -41840 -33909 -13135 -18742 -27502 -23538 -29145 -49081 -71846 -73813
11707 -73813 -55643 -17984 -8604 -21332 -37767 -21836 -19773 -23479 -27014 -19914 -7575 -15664 -13433
11694 -13433 3691 -354 -16538 -12586 -14748 -19981 -47756 -59052 -47982 -45735 -45325 -11000 -2439
11681 -2439 -8531 -20711 -12905 24164 20315 -22261 -29379 -17140 -21137 -5973 -10220 -112 28450
11668 28450 37912 66604 56162 35186 65063 58075 39784 19146 5012 9009 -446 -11401
11656 -11401 -28527 -24458 -2343 20201 12321 21693 36666 45243 31490 23489 24125 13424 26911
11643 26911 36452 -3427 -18707 -30029 -29304 -38317 -16146 7846 6090 -18050 -50785 -54451 -61252
$$ packed form
11733A5931j4083m2029k5765J8616K2932Q691r33j359j1563R626K0368p463l0112
11720c7143J526J8061o285j7999P931K0774n607q760L964n607j9936k2765j967
11707g3813J8170L7659R380j2728j6435J5931K063l706l535P100J2339q089K231
11694a3433J7124m045j6184L952k162n233k7775j1296J1070K247M10L4325Q561
11681b439o092j2180P806L7069l849m2576p118J2239l997J5164m247J0108K8562
11668B8450R462K8692j0442k0976K9877o988j8291k0638j4134L997r455j0955
11656a1401j7126M069K2115K2544p880R372J4973Q577j3753q001O36j0701J3487
11643B6911R541l9879j5280j1322P25r013K2171K3992j756k4140l2735l666o801
$$ plain form
11630 -61252 -31335 -29685 -48313 -43373 -40100 -34661 -38222 -52958 -55797 -44891 -45827 -23678 -8949
11617 -8949 -39046 -20435 38533 34321 4366 -7590 -13948 -9074 10542 18392 -20766 -59956 -56504
11604 -56504 -57055 -31910 15058 12440 -24454 -16723 11405 -12409 -15692 -817 -2017 -1711 14142
11591 14142 3310 10854 -11136 -23169 -42390 -44526 -55667 -48455 -23231 -35161 -46479 -33030
11579 -33030 -29167 14644 43961 20064 1640 -21699 -18618 -13196 -17508 -26524 -21709 -17767 -30204
11566 -30204 -44154 -58288 -58177 -62486 -49513 -55476 -59550 -52508 -1763 2452 -15878 -10552 -31993
11553 -31993 -42033 8816 13517 11995 22773 30192 19339 4541 -19962 -39389 -41658 -15607
11541 -15607 -14638 3529 -21341 -29910 -32510 -73954 -87256 -54277 -28543 12119 39174 40374 11125
$$ packed form
11630f1252K9917J650j8628M940L273N439l561j4736k839J0906r36K2149J4729
11617h949l0097J8611N8968m212k9955j1956o358M874J9616P850l9158l9190L452
11604e6504n51K5145M6968k618l6894P731K8128k3814l283J4875j200L06J5853
11591A4142j0832P544k1990j2033j9221k136j1141P212K5224j1930j1318J3449
11579c3030L863M3811K9317k3897j8424k3339L081N422m312r016M815L942j2437
11566c0204j3950j4134J11m309J2973n963m074P042N0745M215j8330N326k1441
11553c1993j0040N0849M701j522J0778P419j0853j4798k4503j9427k269K6051
11541a5607R69J8167k4870q569k600m1444j3302L2979K5734M0662K7055J200k9249
$$ plain form
11528 11125 4958 -4246 -11116 -23138 -4432 28061 19909 22992 29738 44241 16635 23446 28839
11515 28839 39554 18368 7765 3129 -9194 -21132 -16147 2185 24100 8670 13174 14409
11503 14409 -19676 -41211 -27897 -21048 -39651 -33902 -34122 -37007 -44938 -49040 -47068 -31201 -45816
11490 -45816 -59978 -23357 -2909 -5360 14355 35657 14960 13029 32878 30773 10151 -1367
11478 -1367 2885 -5669 -16073 -20128 -15667 -16726 -20505 -38007 -28362 -2724 -1042 1117 12841 5319
11464 5319 -4006 -60 4725 2068 -7228 -19966 -37222 -79198 -85674 -79026 -69955 -61652 -33733 10864
11450 10864 21601 -17524 -36699 -47560 -52835 -56229 -73924 -112066 -102072 -66876 -27364 -11250
11438 -11250 -5118 14598 21609 -12742 -10191 5766 8926 11219 578 -2261 -4963 566 -196 -25536
$$ packed form
11528A1125o167r204o870j2022J8706L2493q152L083O746J4503k7606O811N393
11515B8839J0715k1186j0603m636j2323j1938M985J8332K1915j5430M504J235
11503A4409l4085k1535J3314O849j8603N749k20k885p931m102J972J5867j4615
11490d5816j4162L6621K0448k451J9715K1302k0697j931J9849k105k0622j1518
11478a367M252q554j0404m055M461j059l779j7502R645K5638J682K159J1724p522
11464E319r325L946M785k657r296j2738j7256m1976o476O648R071Q303K7919M4597
11450A0864J0737l9125j9175j0861n275l394j7695l8142R994L5196L9512J6114
11438a1250O132J9716P011l4351K551J5957L160K293j0641k839k702N529p62k5340
$$ plain form
11424 -25536 -32726 -11108 -6539 -9989 -38311 -52792 -62424 -71147 -48656 -16771 3328 19306 7506
11411 7506 -3036 -15695 -26768 -54653 -62745 -46728 1541 22947 26842 21139 -13017 -25803
11399 -25803 -24131 -33235 -23839 -17567 -15954 -8138 -7199 16534 15344 -4279 -11777 -18508 -23517 -8520
11385 -8520 -19601 -15397 -77 8570 7697 -26905 -43775 -25056 3452 2271 2104 -11720 -18584
11372 -18584 -11942 -680 -7697 -15083 -25425 -16499 20873 19043 17076 -9585 -22518 -3017 1676
11359 1676 4096 17536 -297 -31123 -31263 -18305 23415 34662 16387 20867 11641 -2305 -14285
11346 -14285 -22663 -50199 -68116 -55731 -48627 -39385 -23483 -11558 -2433 -1190 -2959 -5261 -6374
11333 -6374 866 -735 -7477 -11398 -16911 1301 -11059 -14271 3620 17349 13156 25312 29226
$$ packed form
11424b5536p190K1618M569l450k8322j4481r632q723K2491L1885K0099J5978j1800
11411G506j0542j2659j1073k7885q092J6017M8269K1406L895n703l4156j2786
11399b5803J672r104R396O272J613P816R39K3733j190j9623p498o731n009J4997
11385h520j1081M204J5320Q647q73l4602j6870J8719K8508j181j67j3824o864
11372a8584O642J1262p017p386j0342Q926L7372j830j967k6661j2933J9501M693
11359A676K420J3440j7833l0826j40J2958M1720J1247j8275M480r226j3946j1980
11346a4285q378k7536j7917J2385P104R242J5902J1925R125J243j769k302j113
11333f374P240j601o742l921n513J8212j2360l212J7891J3729m193J2156L914
$$ plain form
11320 29226 37494 8742 -39716 -26548 -47816 -72984 -69725 -69549 -62593 -65261 -50544 -13438 -12446
11307 -12446 -11303 -5054 -6212 9086 -5618 -30390 -53816 -41905 -52403 -26617 -5281 -21446
11295 -21446 -26984 -22986 -20541 -31987 -23883 -6663 -18065 -36480 -50224 -58485 -52925 -37854 -34112
11282 -34112 -16639 -13391 583 2629 5931 2139 -20863 -12532 -5438 -13900 -40961 -37035 -40433
11269 -40433 -65246 -80327 -48519 -26697 -10138 -8871 -17213 -16553 -12897 -12208 -17874 -22267 -676
11256 -676 -2036 -40533 -71409 -71777 -51699 -60131 -54337 -42593 -25855 -7217 -1824 -21939 -62592
11243 -62592 -72337 -44354 -46413 -22518 -23114 -34855 -45984 -25945 -12343 -8880 -30845 -12787 -2506
11230 -2506 -10291 -32909 -40600 -7493 -23409 -23834 -13853 -14226 -41339 -31377 -48284 -71360 -49210
$$ packed form
11320B9226Q268k8752m8458J3168k1268k5168L259J76O956k668J4717L7106R92
11307a2446J143O249j158J5298j4704k4772k3426J1911j0498K5786K1336j6165
11295b1446n538L998K445j1446Q104J7220j1402j8415j3744q261N560J5071L742
11282c4112J7473L248J3974K046L302l792k3002Q331P094q462k7061L926l398
11269d0433k4813j5081L1808K1822J6559J267q342O60L656O89n666m393K1591
11256f76j360l8497l0876l68K0078q432N794J1744J6738J8638N393k0115m0653
11243f2592r745K7983k059K3895n96j1741j1129K0039J3602L463k1965J8058J0281
11230b506p785k2618p691L3107j5916m25R981l73k7113R962j6907k3076K2150
$$ plain form
11217 -49210 -27911 -52024 -71447 -62155 -82388 -80043 -60317 -34867 -30320 -3877 19729 21725
11205 21725 37175 14970 19484 12764 -1038 8597 -13137 -45068 -51040 -60500 -77728 -69515 -55749
11192 -55749 -32557 -9683 -13489 -26681 -46971 -36933 5349 2153 11528 19027 33509 40466 32994
11179 32994 8931 14758 2606 -3113 -17976 -1904 -6964 -18434 23877 43804 14903 8329
11167 8329 10273 6155 27998 15016 10386 -5383 17477 28617 -2282 -27330 -18274 1036 48195
11154 48195 57526 53113 63643 42987 25616 24003 14336 -4011 -3617 -36508 -25454 -22113 -30416
11141 -30416 -39800 -43056 -48566 -16643 -8722 -775 7634 5862 -1658 5943 8643 -12780 -28088 -37560
11127 -37560 -37866 -47894 -10969 -1101 -17736 -31611 -62026 -53840 -35474 8130 20398 31066
$$ packed form
11217d9210K1299k4113j9423R292k0233K345J9726K5450M547K6443K3606J996
11205B1725J5450k2205M514o720j3802R635k1734l1931n972r460j7228Q213J3766
11192e5749K3192K2874l806j3192k0290J0038M2282l196R375P499J4482O957p472
11179C2994k4063N827j2152n719j4863J6072n060j1470M2311J9927k8901o574
11167H329J944m118K1843j2982m630j5769K2860J1140l0899k5048R056J9310M7159
11154D8195R331m413J0530k0656j7371j613r667j8347L94l2891J1054L341q303
11141c0416r384l256n510L1923P921P947Q409j772p520P601K700k1423j5308r472
11127c7560l06j0028L6925R868j6635j3875l0415Q186J8366M3604J2268J0668
$$ plain form
11115 31066 22046 31982 14840 3123 -897 -6277 -8823 261 2571 5484 15540 21959 98
11102 98 -14627 -10933 -4807 2753 16400 9768 7901 4341 3103 -5830 -8874 -12661 19108 -5137
11088 -5137 -43856 -32993 -43612 -50992 -46574 -61271 -62388 -35383 -24060 -14490 -13615 -22897 -27231
11075 -27231 -5444 -13095 -10805 -7991 -2130 6499 -1141 -27215 -43525 -39858 -23949 -10320 -28542
11062 -28542 -16819 -25855 -34639 -11296 19159 33206 39147 32939 -5453 -12951 -41338 -67088 -66142
11049 -66142 -36737 -2065 -5114 -16845 -35929 -35769 -16110 -16611 3069 10860 -14209 -12495 -6971
11036 -6971 -4802 -6450 -16026 11990 32498 22011 11428 -29128 -43699 -53145 -64523 -55469 -37942
11023 -37942 -38654 -20581 15101 35327 24447 -557 2483 -15810 -25752 -46799 -35761 -46859
$$ packed form
11115C1066r020R936j7142j1717m020n380k546R084K310K913J0056O419k1861
11102I8j4725L694O126P560J3647o632j867l560j238q933l044l787L1769k4245
11088e137l8719J0863j0619p380M418j4697j117K7005J1323R570Q75r282m334
11075b7231K1787p651K290K814N861Q629p640k6074j6310L667J5909J3629j8222
11062b8542J1723r036q784K3343L0455J4047N941o208l8392p498k8387k5750R46
11049f6142K9405L4672l049j1731j9084J60J9659n01J9680P791k5069J714N524
11036f971K169j648r576K8016K0508j0487j0583m0556j4571r446j1378R054J7527
11023c7942p12J8073L5682K0226j0880k5004L040j8293r942k1047J1038j1098
$$ plain form
11011 -46859 -55900 -36136 -17214 30389 30015 10422 52833 30104 19710 22086 21311 28845 11914
10998 11914 -14056 -14738 17908 33529 978 -8176 -41640 -47777 -26321 -18721 -31827 -45052 -53512
10985 -53512 -77775 -73322 -72617 -63065 -44268 -40738 -29478 -28177 -16784 15172 23996 42918 56987
10972 56987 23718 26280 38844 29893 11512 -9582 -586 1282 15727 1049 -26602 -15269
10960 -15269 3069 17909 -2315 2460 35895 3619 -7100 -4928 12498 -16618 -24175 9253
10948 9253 4520 -17090 -10216 -1123 17747 3309 -15154 -17081 -8529 -31144 -8314 14819 25435
10935 25435 -20779 -40908 -51026 -34747 -15907 -8831 -52641 -58910 -50687 -45931 -39424 -6551 -11794
10922 -11794 -4646 -6598 541 -16967 -15759 -23357 -12831 -24858 -31075 -6486 -661 -9533 -247
$$ packed form
11011d6859r041J9764J8922M7603l74j9593M2411k2729j0394K376p75P534j6931
10998A1914k5970o82L2646J5621l2551r154l3464o137K1456P600j3106j3225q460
10985e3512k4263M453P05R552J8797L530J1260J301J1393L1956Q824J8922J4069
10972E6987l3269K562J2564q951j8381k1094Q996J868J4445j4678k7651J1333
10960a5269J8338J4840k0224M775L3435l2276j0719K172J7426k9116p557L3428
10948I253m733k1610O874R093J8870j4438j8463j927Q552k2615K2830K3133J0616
10935B5435m6214k0129j0118J6279J8840P076m3810o269Q223M756O507L2873n243
10922a1794P148j952P139j7508J208p598J0526j2027o217K4589N825q872R286
$$ plain form
10909 -247 4143 -13256 -21860 -8691 409 -23 5494 -27654 -28717 -2624 -18344 -27050 -25594 -30775
10895 -30775 -25311 -25521 -38534 -25550 9696 12856 16168 24192 13115 12084 -13652 -21741 8092
10882 8092 -14152 -42054 -57477 -49687 -58377 -65123 -53631 7176 -13635 -44390 -54831 -27117
10870 -27117 -16929 -28021 -13597 -12113 -32423 -21412 -17161 -35119 -24892 1461 4710 -16857
10858 -16857 -35699 -230 7844 -29303 -37877 -53057 -36225 -24745 -2012 5801 10726 748 3037
10845 3037 20489 5149 -60376 -61721 -44161 -19723 -31906 -43116 -63178 -64458 -53269 -41303
10833 -41303 -45801 -36583 -49269 -42363 -47347 -71542 -72239 -69895 -66008 -39148 -28989 -42086 -50236
10820 -50236 -10931 5993 12017 -11863 -38501 -29386 -11568 -5906 -22807 -30716 -24009 -19544 10
$$ packed form
10909b47M390j7399q604J3169R100m32N517l3148j063K6093j5720q706J456n181
10895c0775N464k10j3013J2984L5246L160L312Q024j1077j031k5736q089K9833
10882H092k2244k7902j5423P790q690o746J1492O0807k0811l0755j0441K7714
10870b7117J0188j1092J4424J484k0310J1011M251j7958J0227K6353L249k1567
10858a6857j8842L5469Q074l7147q574j5180J6832J1480K2733P813M925r978K289
10845C037J7452j5340o5525j345J7560K4438j2183j1210k0062j280J1189J1966
10833d1303m498R218j2686O906m984k4195o97K344L887K6860J0159j3097q150
10820e0236L9305J6924O024k3880k6638R115J7818N662j6901p909O707M465J9554
$$ plain form
10807 10 -5956 -21705 -10917 4760 -16291 -22282 -19030 -20968 -64251 -74218 -46275 -23260 -6541
10794 -6541 -3773 -5666 -6103 -4341 8276 -3293 -475 -6099 18959 21048 6673 10233 -3456 -24691
10780 -24691 6051 35980 53272 39247 6757 -33671 -31188 6901 56559 42741 20460 9132
10768 9132 7140 -7674 -20854 -20267 -11093 -37291 -54643 -76165 -105251 -95392 -50771 -17768 9598
10755 9598 1323 -21572 -17970 -2174 -13995 -2455 -1598 -20203 -36381 -25408 -5964 -14851 -25155
10742 -25155 6199 -12472 -42675 -17537 -40966 -34311 -2055 8172 29417 57933 57830 29145
10730 29145 10734 -8435 -8758 -16987 -22512 -41944 -25074 -2323 -16190 -11095 6990 7832 -7792
10717 -7792 -28787 -41822 -27996 -10450 -15918 -28328 9680 40305 38236 5390 -34821 -62364
$$ packed form
10807A0n966j5749J0788J5677k1051n991L252j938m3283r967K7943K3015J6719
10794f541K768j893m37J762J2617j1569K818n624K5058K089j4375L560j3689k1235
10780b4691L0742K9929J7292j4025l2490m0428K483L8089M9658j3818k2281j1328
10768I132j992j4814j3180N87R174k6198j7352k1522k9086R859M4621L3003K7366
10755I598q275k2895L602J5796j1821J1540Q57j8605j6178J0973J9444q887j0304
10742b5155L1354j8671l0203K5138k3429O655L2256J0227K1245K8516j03k8685
10730B9145j8411j9169l23q229n525j9432J6870K2751j3867N095J8085Q42j5624
10717g792k0995j3035J3826J7546n468j2410L8008L0625k069l2846m0211k7543
$$ plain form
10705 -62364 -55763 -40381 -53081 -31065 -4307 -19390 -4010 2943 3231 -2853 1666 22744 21718
10692 21718 9189 483 12616 -17816 -59095 -74533 -56057 -60972 -74046 -57381 -51012 -35580
10680 -35580 -52410 -34389 761 -5227 -12173 -11909 1065 20841 3249 -719 -2073 -13485 -17441
10667 -17441 -17786 -1746 19156 9184 -25315 -38379 -53506 -49276 -29862 -25827 -34592 -59899 -57045
10654 -57045 -42474 -35084 -33818 -5650 -12832 -30122 1815 34508 13626 5249 565 6326 14752
10641 14752 -11500 -24580 -28782 -42001 -58790 -54694 -26634 0 -28737 -47218 -29312 -9397
10629 -9397 -8159 -24030 -13853 -7319 -7653 -5260 -18935 -9129 -25724 -35186 -14582 -4786 -36367
10616 -36367 -72166 -84806 -40447 -1767 19686 27856 27232 16029 1314 -1938 -24103 -13647
$$ packed form
10705f2364O601J5382j2700K2016K6758j5083J5380O953K88o084M519K1078j026
10692B1718j2529q706J2133l0432m1279j5438J8476m915j3074J6665O369J5432
10680c5580j6830J8021L5150n988o946K64J2974J9776j7592l968j354j1412l956
10667a7441l45J6040K0902r972l4499j3064j5127M230J9414M035q765k5307K854
10654e7045J4571P390J266K8168p182j7290L1937L2693k0882q377m684N761Q426
10641A4752k6252j3080m202j3219j6789M096K8060K6634k8737j8481J7906J9915
10629i397J238j5871J0177O534l34K393j3675R806j6595r462K0604R796l1581
10616c6367l5799j2640M4359L8680K1453Q170o24j1203j4715l252k2165J0456
$$ plain form
10604 -13647 -11839 -6871 -5324 -20983 -36621 -32869 -11346 -21624 -52632 -58720 -52872 -48592 -25032
10591 -25032 -32738 5054 215 -48141 -61546 -69499 -74053 -59927 -27522 2376 -1009 2828 -7889
10578 -7889 -28643 -27910 -29759 -39305 -49340 -46104 -33255 -44102 -59487 -60722 -57424 -48113 -27382
10565 -27382 -8599 -18683 -36365 -36632 -13647 -15766 -35855 -40252 -22961 -53704 -46382 -27258 2608
10552 2608 -28019 -48259 -17684 -27794 -14474 -25020 -11623 -12994 -18205 -12409 -13880 -7222 5828
10539 5828 6570 -6749 -6991 24889 -9404 -51659 -56554 -43345 -27655 6510 11121 -21483 -44999
10526 -44999 -56933 -68560 -69814 -49737 -11714 -19049 -14532 37562 47004 30950 20014 892
10514 892 -4881 -4305 -18010 -14491 7201 4651 7450 1247 -4603 2085 9293 3271 -12790 -19243
$$ packed form
10604a3647J808M968J547j5659j5638L752K1523j0278l1008o088N848M280K3560
10591b5032p706L7792m839m8356j3405p953m554J4126L2405K9898l385L837j0717
10578g889k0754P33j849r546j0035L236J2849j0847j5385j235L298R311K0731
10565b7382J8783j0084j7682k67K2985k119k0089m397J7291l0743P322J9124K9866
10552B608l0627k0240L0575j0110J3320j0546J3397j371n211N796j471O658J3050
10539E828P42j3319k42L1880l4293m2255m895J3209J5690L4165M611l2604k3516
10526d4999j1934j1627j254K0077L8023p335M517N2094R442j6054j0936j9122
10514H92n773N76j3705L519K1692k550K799o203n850O688P208o022j6061o453
$$ plain form
10500 -19243 -18733 -27183 -41484 -30194 -1488 15287 -9910 -16306 6246 -3287 -544 -12079 -16144
10487 -16144 -28336 -41062 -24764 -29121 -32512 -50061 -36932 6262 39039 6274 -24003 -30803
10475 -30803 -31469 -40411 -49251 -26434 -5184 27549 8703 -14833 -13054 -27222 -10525 -7437 -16034
10462 -16034 -1911 952 -16584 -23887 -6657 7080 18843 19780 -4263 -15262 -5810 16071 42514
10449 42514 46043 38890 30830 -14482 -22750 -26230 -12596 -1132 -1908 -10755 -19195 -19556 -18039 12653
10435 12653 20097 -4108 -10981 -11383 6320 -368 -7814 -13279 -21409 -9592 -15855 -45051 -37599 -36289
10421 -36289 -30299 326 19707 13643 1707 3965 7161 13557 9568 10414 -31161 -41096 -31268 -8433
10407 -8433 30596 25451 7036 6717 11768 -3440 -20820 -19765 -30351 -31417 -36246 -20976 -23352
$$ packed form
10500a9243N10q450j4301J1290K8706J6775k5197o396K2552r533K743j1535m065
10487a6144j2192j2726J6298m357l391j7549J3129M3194L2777l2765l0277o800
10475c0803o66q942q840K2817K1250L2733j8846k3536J779j4168J6697L088q597
10462a6034J4123K863j7536p303J7230J3737J1763R37k4043j0999R452K1881K6443
10449D2514L529p153q060m5312q268l480J3634J1464p76q847q440l61J517L0692
10435A2653P444k4205o873m02J7703o688p446n465q130J1817o263k9196P452J310
10421c6289N990L0625J9381o064j1936K258L196O396l989Q46m1575r935R828K2835
10407h433L9029n145j8415l19N051j5208j7380J055j0586j066m829J5270k376
$$ plain form
10394 -23352 -36784 -44864 -40932 -18293 -19712 -7966 -7767 -971 -8156 -1877 -9214 354 -3047 6054
10380 6054 16270 2804 -13825 -20387 -21508 -28717 -17892 -20198 -33225 -17594 -11533 -33916 -67094
10367 -67094 -52903 -50033 -43654 -36158 -24050 -25671 -16291 19454 24104 -4108 -39659 -35141 -9246
10354 -9246 20937 35941 39112 62289 103570 92562 70326 65128 77024 124698 117815 135250
10342 135250 137140 113231 104986 123468 120678 94018 42281 47522 63132 83560 125293 109299
10330 109299 100478 126669 118670 88393 67695 82510 73754 73917 66808 47614 47020 11845 -2649
10317 -2649 16874 36180 49318 51763 43152 48241 62928 64318 60436 63132 113023 110158 126306
10304 126306 137378 167162 164397 169428 176206 161867 152003 173151 187454 202388 220299 242200
$$ packed form
10394b3352j3432q080L932K2639j419J1746J99O796p185O279p337R568l401R101
10380F054J0216j3466j6629o562j121p209J0825k306j3027J5631O061k2383l3178
10367f7094J4191K870O379P496J2108j621R380L5745M650k8212l5551M518K5895
10354i246L0183J5004L171K3177M1281j1008k2236n198J1896M7674o883J7435
10342A35250J890k3909q245J8482k790k6660n1737N241J5610K0428M1733j5994
10330A09299q821K6191p999l0277k0698J4815q756J63p109j9194n94l5175j4494
10317b649J9523J9306J3138K445q611N089J4687J390l882K696M9891k865J6148
10304A26306J1072K9784k765N031O778j4339r864K1148J4303J4934J7911K1901
$$ plain form
10292 242200 282946 320568 391220 467758 557282 680385 819588 1010931 1201229 1309514
10282 1309514 1296089 1194796 1132417 1112782 1160555 1231696 1244492 1087352 838853 650645
10272 650645 489847 331745 201449 149385 125937 136344 136865 116501 121311 107834 100402 78937
10260 78937 63593 58894 30127 26843 15986 -2320 12590 36608 22281 18139 16606 21254 45035
10247 45035 20684 -9777 7997 24908 18373 5684 -4813 -29608 -42643 -47394 -56373 -61038
10235 -61038 -29838 -30838 -15723 -18010 1436 1915 16255 28100 35096 35667 18418 25204 19267
10222 19267 -38943 -72682 -53142 -30081 445 -14449 -23756 -7565 -8725 8810 -1795 -22470
10210 -22470 -13368 -20368 -16078 -21990 -22150 -42608 -77893 -88801 -86583 -90148 -96195 -110162 -124044
$$ packed form
10292B42200M0746L7622P0652P6538Q9524J23103J39203J91343J90298J08285
10282A309514j3425j01293o2379j9635M7773P1141J2796j57140k48499j88208
10272F50645j60798j58102j30296n2064k3448J0407N21k0364M810j3477p432k1465
10260G8937j5344m699k8767l284j0857j8306J4910K4018j4327m142j533M648K3781
10247D5035k4351l0461J7774J6911o535j2689j0497k4795j3035m751q979m665
10235f1038L1200j000J5115k287J9446M79J4340J1845O996N71j7249O786n937
10222A9267n8210l3739J9540K3061L0526j4894r307J6191j160J7535j0605k0675
10210b2470R102p000M290n912j60k0458l5285j0908K218l565o047j3967j3882
$$ plain form
10197 -124044 -146296 -166511 -187594 -218334 -193706 -147724 -143957 -98509 -95962 -115738 -136622 -102841
10185 -102841 -47444 -17022 17689 16379 -1796 15492 23900 46519 59567 61579 42164 22731
10173 22731 3604 3149 6647 1630 14851 30327 31691 24606 23421 17027 16734 29638 18917 23879
10159 23879 45079 53085 57807 37401 39907 4280 -12788 -8460 3297 36844 60836 62681 66934
10146 66934 50597 52492 58759 53066 69319 76038 47722 46733 75101 68718 32155 43396 51111
10133 51111 23908 19210 41476 56764 85638 93866 96657 99783 107932 81979 49045 35004 34557
10120 34557 24437 30488 19573 31813 26279 38122 65363 39535 8538 18819 34932 77839
10108 77839 81596 59098 24836 54078 61721 45807 47872 90807 76321 57813 41903 19271
$$ packed form
10197a24044k2252k0215k1083l0740K4628M5982L767M5448K547j9776k0884L3781
10185a02841N5397L0422L4711j310j8175J7288Q408K2619J3048K012j9415j9433
10173B2731j9127m55L498n017J3221J5476J364p085j185o394k93J2904j0721M962
10159B3879K1200Q006M722k0406K506l5627j7068M328J1757L3547K3992J845M253
10146F6934j6337J895O267n693J6253O719k8316r89K8368o383l6563J1241P715
10133E1111k7203m698K2266J5288K8874Q228K791L126Q149k5953l2934j4041m47
10120C4557j0120O051j0915J2240n534J1843K7241k5828l0997J0281J6113M2907
10108G7839L757k2498l4262K9242P643j5914K065M2935j4486j8508j5910k2632
$$ plain form
10096 19271 20658 3272 35877 48122 23156 2310 20071 2943 -2154 -7980 17026 28237
10084 28237 4637 295 -10787 -18872 -6432 -16863 2529 41927 55828 48345 54803 43141
10072 43141 51247 45120 6370 -12679 14865 53273 63286 46021 48819 76125 65809 55240
10060 55240 67328 63553 35329 45508 75009 79364 80615 99326 142561 140940 100532 99757 112810
10047 112810 121272 119811 127902 161042 194479 218808 259698 384702 530323 651123 706768
10036 706768 687876 651197 654981 719195 812969 860957 817926 717499 628074 575002 555054
10025 555054 507483 478733 463274 445714 475312 465279 464391 458296 455940 463570 449891 410542
10013 410542 436846 457682 457102 505991 513235 496437 493812 491521 499100 509119 514282 522426 502355
$$ packed form
10096A9271J387j7386L2605J2245k4966k0846J7761j7128n097n826K5006J1211
10084B8237k3600m342j1082q085J2440j0431J9392L9398J3901p483O458j1662
10072D3141Q106o127l8750j9049K7544L8408J0013j7265K798K7306j0316j0569
10060E5240J2088l775k8224J0179K9501M355J251J8711M3235j621m0408p75J3053
10047A12810Q462j461Q091L3140L3437K4329M0890J25004J45621J20800N5645
10036G06768j8892l6679L784O4214R3774M7988m3031j00427q9425n3072j9948
10025E55054m7571k8750j5459j7560K9598j0033q88o095k356P630j3679l9349
10013D10542K6304K0836n80M8889P244j6798k625k291P579J0019N163Q144k0071
$$ plain form
10000 502355 479815 480642 457356 435634 421220 435195 415550 368051 341913 312128 303799 313364
9988 313364 335681 340188 365056 382610 377349 360708 358424 345822 336195 331933 333915 335731 329222
9975 329222 357306 348931 332511 357414 355276 368694 379309 422119 442809 419663 393733 389494
9963 389494 383434 381400 398302 429887 431089 438281 449712 460474 471200 485279 526869 547625
9951 547625 555708 603556 671947 702230 748007 810156 863888 917736 972193 1025691 1099980 1173446
9939 1173446 1261542 1318426 1366639 1434170 1515950 1591780 1668234 1766830 1875794 1987116 2093542
9928 2093542 2274986 2490719 2658899 2909800 3130396 3378317 3715990 4057606 4461204 4904964
9918 4904964 5368210 5899104 6497927 7113401 7819562 8575373 9370321 10186700 11050144 11958278
$$ packed form
10000E02355k2540Q27k3286k1722j4414J3975j9645m7499k6138k9785q329R565
9988C13364K2317M507K4868J7554n261j6641k284j2602r627m262J982J816o509
9975C29222K8084q375j6420K4903k138J3418J0615M2810K0690k3146k5930m239
9963C89494o060k034J6902L1585J202P192J1431J0762J0726J4079M1590K0756
9951E47625Q083M7848O8391L0283M5777O2149N3732N3848N4457N3498P4289P3466
9939A173446Q8096N6884M8213O7531Q1780P5830P6454R8596J08964J11322J06426
9928B093542J81444K15733J68180K50901K20596K47921L37673L41616M03598M43760
9918D904964M63246N30894N98823O15474P06161P55811P94948Q16379Q63444R08134
$$ plain form
9908 11958278 12947795 14059705 15331693 16800784 18504471 20475401 22600270 24752930
9900 24752930 26808280 28991296 31502378 34113552 36739403 39511675 42447729 45593525
9892 45593525 49542715 55120223 63123482 74751529 91141428 111986621 138847077 174365365
9884 174365365 213290435 243820226 256523639 240120936 219229214 211492055 218313908
9877 218313908 231516568 236859279 220498261 175992544 131897122 96509348 70061448
9870 70061448 51993438 39942506 31950406 26442918 22429691 19436224 17121211 15182223
9862 15182223 13514574 12123217 10914496 9953078 9226501 8635488 8062160 7404553 6600879
9853 6600879 5788208 5105507 4529368 4080964 3722202 3415985 3130322 2932545 2736665 2569194
$$ packed form
9908A1958278R89517J111910J271988J469091J703687J970930K124869K152660
9900B4752930K055350K183016K511082K611174K625851K772272K936054L145796
9892D5593525L949190N577508Q003259J1628047J6389899K0845193K6860456L5518288
9884A74365365L8925070L0529791J2703413j6402703k0891722p737159O821853
9877B18313908J3202660N342711j6361018m4505717m4095422l5387774k6447900
9870G0061448j8068010j2050932p992100n507488m013227k993467k315013j938988
9862A5182223j667649j391357j208721r61418p26577n91013n73328o57607q03674
9853F600879q12671o82701n76139m48404l58762l06217k85663j97777j95880j67471
$$ plain form
9843 2569194 2430341 2282669 2142348 2017523 1909338 1840104 1764630 1679909 1582526 1500567
9833 1500567 1446345 1390742 1337259 1297011 1247094 1191356 1119677 1036873 974747 978764 950952 877255
9821 877255 853011 844482 815596 773012 748276 759339 727526 696921 687121 688640 695801 701587 721185
9808 721185 721553 693679 637594 612357 637349 644258 633295 632687 607766 558259 548537 550912 546430
9795 546430 517514 489056 468236 459088 453438 421329 394766 407862 405500 425273 389116 392645
9783 392645 410504 396395 388845 395466 367144 372707 384520 378814 375900 339047 328780 358001 382073
9770 382073 398729 369638 324795 277379 283454 295031 303771 307020 296796 285150 290849 252412
9758 252412 202668 171230 167054 162699 170266 198850 193841 145610 86834 70932 53781 90393
$$ packed form
9843B569194j38853j47672j40321j24825j08185o9234p5474q4721r7383q1959
9833A500567n4222n5603n3483m0248m9917n5738p1679q2804o2126M017k7812p3697
9821H77255k4244q529k8886m2584k4736J1063l1813l0605r800J519P161N786J9598
9808G21185L68k7874n6085k5237K4992O909j0963o08k4921m9507r722K375m482
9795E46430k8916k8458k0820r148n650l2109k6563J3096k362J9773l6157L529
9783C92645J7859j4109p550O621k8322N563J1813n706k914l6853j0267K9221K4072
9770C82073J6656k9091m4843m7416O075J1577Q740L249j0224j1646N699l8437
9758B52412m9744l1438m176m355P567K8584n009m8231n8776j5902j7151L6612
$$ plain form
9746 90393 93280 82070 84617 88857 56826 34285 19119 16396 -28356 -65799 -80310 -100612 -124208
9733 -124208 -148216 -210603 -288723 -365165 -422096 -475220 -515752 -482975 -425888 -357013 -336139 -344110
9721 -344110 -321518 -250712 -146074 -33854 46795 131108 181300 201403 205212 187689 183567 180678
9709 180678 178082 170816 145940 112750 131571 147667 184172 191844 193888 154350 160619 160151 152962
9696 152962 151379 139512 145817 159317 144038 117920 108763 115600 117821 109227 132699 144999 132390
9683 132390 108905 116339 113306 90705 82322 84712 102047 104672 86025 42333 73715 107922 108592
9670 108592 61467 47988 61586 90689 108035 102545 81288 58184 38621 65400 104043 93919
9658 93919 90199 95756 114906 119913 95830 96753 124128 123230 122141 123959 128449 129888 120635 124876
$$ packed form
9746I0393K887j1210K547M240l2031k2541j5166k723m4752l7443j4511k0302k3596
9733a24208k4008o2387p8120p6442n6931n3124m0532L2777N7087O8875K0874p971
9721c44110K2592P0806J04638J12220Q0649Q4313N0192K0103L809j7523m122k889
9709A80678k596p266k4876l3190J8821J6096L6505P672K044l9538O269m68p189
9696A52962j583j1867O305J3500j5279k6118r157O837K221q594K3472J2300j2609
9683A32390k3485P434l033k2601q383K390J7335K625j8647m3692L1382L4207O70
9670A08592m7125j3479J3598K9103J7346n490k1257k3104j9563K6779L8643j0124
9658I3919l720N557J9150N007k4083R23K7375q98j089J818M490J439r253M241
$$ plain form
9644 124876 137872 113325 97251 116935 120473 136147 136970 143158 137725 124322 142907 139639 121263
9631 121263 110426 105281 92273 92281 91386 76795 65593 77773 75653 87479 127633 125996 71376
9618 71376 63296 50299 44020 58163 50324 65458 71898 70241 65472 59124 88656 124870 133029
9605 133029 93860 44890 19875 31561 42225 25407 4723 13487 60315 57890 70079 65979
9593 65979 49724 25143 25668 49293 63355 68473 107586 110835 77893 53418 18768 10166 28317
9580 28317 37876 64087 80938 92310 82249 94243 106787 132210 164780 171766 171607 148244 151420
9567 151420 150984 181503 210805 231556 241600 234676 232740 203918 183211 167789 149206 118002
9555 118002 88978 80593 85239 92522 85921 53361 48841 54573 54994 52177 55942 44035 26100 31348
$$ packed form
9644A24876J2996k4547j6074J9684L538J5674Q23O188n433j3403J8585l268j8376
9631A21263j0837n145j3008Qq95j4591j1202J2180k120J1826M0154j637n4620
9618G1376q080j2997o279J4143p839J5134O440j657m769o348K9532L6214Q159
9605A33029l9169m8970k5015J1686J0664j6818k0684Q764M6828k425J2189m100
9593F5979j6255k4581N25K3625J4062N118L9113L249l2942k4475l4650q602J8151
9580B8317R559K6211J6851J1372j0061J1994J2544K5423L2570O986j59k3363L176
9567A51420m36L0519K9302K0751J0044o924j936k8822k0707j5422j8583l1204
9555A18002k9024q385M646P283o601l2560m520N732M21k817L765j1907j7935N248
$$ plain form
9541 31348 3789 7552 48218 74382 83352 99812 96109 76725 61338 82643 75073 87242 83493
9528 83493 70956 74804 46156 35250 45911 54427 35691 31083 56399 70139 66813 56923 50823
9515 50823 73319 54471 81894 111989 112784 92844 85971 81849 77569 118570 128863 115756 114030
9502 114030 110040 89113 96708 110932 138089 144825 147943 165660 178115 221291 233330 223835 227096
9489 227096 232769 250175 307216 327227 352123 389968 434705 509977 631411 808800 958782
9478 958782 1130497 1295555 1345933 1275795 1180778 1138371 1165681 1257611 1325929 1245291 1033019
9467 1033019 783459 560056 418991 322914 252742 203829 190612 177884 154058 141105 102543
9456 102543 110359 102578 110654 93477 81707 81330 112116 91804 69630 41869 52409 55319 57163
$$ packed form
9541C1348k7559L763M0666K6164Q970J6460l703j9384j5387K1305p570J2169l749
9528H3493j2537L848k8648j0906J0661Q516j8736m608K5316J3740l326r890o100
9515E0823K2496j8848K7423L0095P95j9940o873m122m280M1001J0293j3107j726
9502A14030l990k0927P595J4224K7157O736L118J7717J2455M3176J2039r495L261
9489B27096N673J7406N7041K0011K4896L7845M4737P5272J21434J77389J49982
9478I58782J71715J65058N0378p0138r5017m2407K7310R1930O8318q0638k12272
9467A033019k49560k23403j41065r6077p0172m8913j3217j2728k3826j2953l8562
9456A02543P816p781Q076j7177j1770l77L0786k0312k2174k7761J0540K910J844
$$ plain form
9443 57163 40867 41671 41348 44232 53217 54672 72380 69105 31197 -1525 -9416 -28847 -36979 -58628
9429 -58628 -36756 -34221 -47175 -31050 -36274 -24714 5592 8125 -14639 -59043 -77107 -95662
9417 -95662 -111184 -95267 -58581 -53336 -16188 -7040 -37768 -31082 -13261 -2508 20714 42371
9405 42371 64724 97932 86161 63928 61178 27477 -16646 4901 22910 27396 14015 8699
9393 8699 26115 15123 -2220 22583 40942 34261 27574 9640 16813 28290 41777 74294 90038
9380 90038 85071 88988 78213 19054 -4770 13471 24563 65355 65114 49977 40564 59201 65386
9367 65386 56074 55099 65745 77747 58845 27687 41349 45831 14666 11439 -8271 -7276 5012
9354 5012 4587 -5256 3738 47939 49215 53174 46637 29290 42617 22779 -4148 -27325 -24247 2491
$$ packed form
9443E7163j6296Q04l23K884Q985J455J7708l275l7908l2722p891j9431q132k1649
9429e8628K1872K535j2954J6125n224J1560L0306K533k2764m4404j8064j8555
9417i5662j5522J5917L6686N245L7148R148l0728O686J7821J0753K3222K1657
9405D2371K2353L3208j1771k2233k750l3701m4123K1547J8009M486j3381n316
9393H699J7416j0992j7343K4803J8359o681o687j7934P173J1477J3487L2517J5744
9380I0038m967L917j0775n9159k3824J8241J1092M0792k41j5137r413J8637O185
9367F5386r312r75J0646J2002j8902l1158J3662M482l1165l227j9710R95J2288
9354E012m25r843Q994M4201J276L959o537j7347J3327j9838k6927k3177L078K6738
$$ plain form
9340 2491 14976 10687 14929 3664 -12700 514 9109 10714 -4007 -13978 10367 23889 51264
9327 51264 58215 49211 44049 69932 79514 79972 48719 24038 35870 45303 37777 4594 -26914
9314 -26914 -15214 -3206 4186 7930 10034 40596 62266 85794 57091 9702 4454 -19319 -41749
9301 -41749 -33109 -3819 21019 22492 24376 33267 53751 49021 56092 68111 55664 33553 41933
9288 41933 38646 27365 15259 14990 44710 66647 100656 129023 154015 122399 119932 101088 36631
9275 36631 12055 34828 45763 59816 60705 67435 66796 50666 51141 32819 29368 38393 33075 33400
9261 33400 52471 77621 55047 63736 45491 40699 50993 66361 86261 83681 31516 30539 50176
9248 50176 43557 52744 49903 58655 67177 99815 78050 50588 47545 50556 32162 14905 9412
$$ packed form
9340B491J2485m289M242j1265j6364J3214Q595J605j4721r971K4345J3522K7375
9327E1264O951r004n162K5883R582M58l1253k4681J1832R433p526l3183l1508
9314b6914J1700J2008P392L744K104L0562K1670K3528k8703m7389n248k3773k2430
9301d1749Q640K9290K4838J473J884Q891K0484m730P071J2019j2447k2111Q380
9288D1933l287j1281j2106k69K9720K1937L4009K8367K4992l1616k467j8844o4457
9275C6631k4576K2773J0935J4053Q89O730o39j6130M75j8322l451R025n318L25
9261C3400J9071K5150k2574Q689j8245m792J0294J5368J9900k580n2165r77J9637
9248E0176o619R187k841Q752Q522L2638k1765k7462l043L011j8394j7257n493
$$ plain form
9235 9412 18981 6893 -23190 23211 54501 63753 53528 54876 63899 57968 43617 40679 35018
9222 35018 8196 21876 22117 31230 41216 17873 7302 42405 60282 53527 44791 86380 89978
9209 89978 82967 80699 47207 24965 53916 69317 49435 39155 38995 52982 27960 18050 47138
9196 47138 45718 41892 65086 81291 85263 74566 76971 97938 133705 145771 146562 166879 160049
9183 160049 156150 161408 162765 153332 179443 167932 161281 174470 180042 188412 225368 211392 219004
9170 219004 217289 242341 268595 313001 338010 361780 400773 427957 450865 481108 505159 530616
9158 530616 585070 663213 715834 727235 770898 813348 852852 915309 968860 1026141 1096911 1209373
9146 1209373 1317282 1419234 1509868 1592631 1726815 1863809 1976006 2153038 2362222 2614487
$$ packed form
9235I412R569j2088l0083M6401L1290R252j0225J348R023n931j4351k938n661
9222C5018k6822J3680K41R113R986k3343j0571L5103J7877o755q736M1589L598
9209H9978p011k268l3492k2242K8951J5401j9882j0280j60J3987k5022r910K9088
9196D7138j420l826K3194J6205L972j0697K405K0967L5767J2066P91K0317o830
9183A60049l899N258J357r433K6111j1511o651J3189N572Q370L6956j3976P612
9170B19004j715K5052K6254M4406K5009K3770L8993K7184K2908L0243K4051K5457
9158E30616N4454P8143N2621J1401M3663M2450L9504O2457N3551N7281P0770J12462
9146A209373J07909J01952R0634Q2763J34184J36994J12197J77032K09184K52265
$$ plain form
9136 2614487 2905713 3264164 3718936 4364404 5244932 6397428 7987037 10111410 12840860
9127 12840860 15977772 18803066 20305763 19062952 15536628 11933902 8837579 6470021
9119 6470021 4825040 3711689 2935318 2368050 1932498 1589913 1328594 1148604 1009419
9110 1009419 880834 777747 722027 641713 541529 534539 512652 455747 409846 388359 356196
9099 356196 328185 276801 276901 305892 290540 261751 250073 231725 228741 217564 211763 188725
9087 188725 166365 181697 158518 145708 170632 188346 186355 172874 166952 190650 209752 199259
9075 199259 156949 145037 115778 115163 106727 79049 70627 77737 99084 106732 83580 81910 49292
9062 49292 30561 42828 53564 86179 88617 79571 81286 80099 78674 75180 67852 66686 78117
$$ packed form
9136B614487K91226L58451M54772O45468Q80528J152496J589609K124373K729450
9127A2840860L136912K825294J502697j242811l526324l602726l096323k367558
9119F470021j644981j113351p76371n67268m35552l42585k61319j79990j39185
9110A009419j28585j03087n5720q0314j00184o990k1887n6905m5901k1487l2163
9099C56196k8011n1384J00K8991j5352k8789j1678j8348k984j1177n801k3038
9087A88725k2360J5332k3179j2810K4924J7714j991j3481n922K3698J9102j0493
9075A99259m2310j1912k9259o15q436k7678q422P110K1347P648k3152j670l2618
9062D9292j8731J2267J0736L2615K438r046J715j187j425l494p328j166J1431
$$ plain form
9049 78117 79674 63813 41048 48124 34727 9922 -9623 24636 51917 30214 24421 27978 51456
9036 51456 41571 9387 12477 34707 49572 40482 30379 36275 16570 39979 40511 30411 31668
9023 31668 15562 1464 -4577 -7421 -14188 27890 44038 36248 25911 10322 -3206 31130 35438
9010 35438 22425 43864 42857 26256 39656 58201 55060 47557 24535 6782 -8036 -8171 -9831
8997 -9831 -8353 -10340 12691 23024 16334 25553 3118 -37891 -33353 -4453 26660 51609 43365
8984 43365 12640 -22318 -21770 5692 20103 34810 58864 47818 58732 61128 36672 5834
8972 5834 -3999 -23147 -38074 -35916 -30848 -14821 -10410 1784 3980 23226 1434 -17977 19519
8959 19519 45648 29176 32229 39668 54017 67801 81345 82104 64695 34472 27276 32388 14022
$$ packed form
9049G8117J557j5861k2765P076j3397k4805j9545L4259K7281k1703n793L557K3478
9036E1456r885l2184L090K2230J4865r090j0103N896j9705K3409N32j0100J257
9023C1668j6106j4098o041k844o767M2078J6148p790j0337j5589j3528L4336M308
9010C5438j3013K1439j007j6601J3400J8545l141p503k3022j7753j4818j35j660
8997i831J478j987K3031J0333o690R219k2435m1009M538K8900L1113K4949q244
8984D3365l0725l4958N48K7462J4411J4707K4054j1046J0914K396k4456l0838
8972E834r833j9148j4927K158N068J6027M411J2194K196J9246k1792j9411L7496
8959A9519K6129j6472L053P439J4349J3784J3544P59j7409l0223p196N112j8366
$$ plain form
8946 14022 25638 37959 37173 14605 14547 32930 33074 64463 64897 47866 63336 67495 53611 23294
8932 23294 -11545 -527 -17354 -3565 -4530 3309 8140 5901 -19602 -55394 -47140 -37527 -22395
8919 -22395 -4816 15633 8566 9597 34604 25091 1043 23530 25107 -2496 17384 32433 -5305
8906 -5305 21206 48895 61125 54997 17468 -23357 -9829 13541 8365 11985 -4219 9294 6959
8893 6959 13865 15090 23003 23926 32231 7603 -2680 29454 23748 7387 31635 44885 19958
8880 19958 20474 31842 57089 58140 62470 56982 40348 35304 38566 36164 15540 7588 19406 40023
8866 40023 33673 12691 23498 12531 15183 27359 44649 35752 -228 -35558 -27971 -19026 6677
8853 6677 21472 9282 -23084 -33026 18261 29893 31655 45252 36134 -1872 -36334 -24147 8529
$$ packed form
8946A4022J1616J2321p86k2568n8J8383J44L1389M34j7031J5470M159j3884l0317
8932B3294l4839J1018j6827J3789r65P839M831k239k5503l5792Q254R613J5132
8919b2395J7579K0449p067J031K5007r513k4048K2487J577k7603J9880J5049l7738
8906e305K6511K7689J2230o128l7529m0825J3528K3370n176L620j6204J3513k335
8893F959O906J225P913R23Q305k4628j0283L2134n706j6361K4248J3250k4927
8880A9958N16J1368K5247J051M330n488j6634n044L262k402k0624p952J1818K0617
8866D0023o350k0982J0807j0967K652J2176J7290q897l5980l5330P587Q945K5703
8853F677J4795j2190l2366r942N1287J1632J762J3597r118l8006l4462J2187L2676
$$ plain form
8840 8529 6417 18508 10099 25806 40347 32982 35104 25746 32716 35123 33899 32617 16951 20355
8826 20355 28619 30235 30498 68887 63327 37316 48745 51291 61413 55863 36298 10799 -15616
8813 -15616 10218 61222 72124 85152 90910 81904 42543 53123 23235 -28003 -60509 -49849
8801 -49849 -13670 7444 9864 9557 -2477 -32962 -18633 12433 22415 -621 -12017 5017 6288
8788 6288 20365 66143 86688 50585 26969 21756 11653 36069 33943 20908 34102 43126 22713
8775 22713 30375 18095 20753 24583 7034 -28709 -17018 -19692 -29069 8967 39084 49905 45231
8762 45231 59674 74702 74779 48361 13290 8313 14930 10436 -256 -36712 -21112 10356 22760
8749 22760 38941 32588 25289 30129 46280 27717 7433 1020 -20368 -13073 -19594 -23221 -50574
$$ packed form
8840H529k112J2091q409J5707J4541p365K122r358O970K407j224j282j5666L404
8826B0355Q264J616K63L8389n560k6011J1429K546J0122n550j9565k5499k6415
8813a5616K5834N1004J0902J3028N758r006l9361J0580k9888n1238l2506J0660
8801d9849L6179K1114K420l07j2034l0485J4329L1066R982k3036j1396J7034J271
8788F288J4077M5778K0545l6103k3616n213j0103K4416k126j3035J3194R024k0413
8775B2713P662j2280K658L830j7549l5743J1691k674r377L8036L0117J0821m674
8762D5231J4443J5028P7k6418l5071m977O617m494j0692l6456J5600L1468J2404
8749B2760J6181o353p299M840J6151j8563k0284o413k1388P295o521l627k7353
$$ plain form
8736 -50574 -61989 -65667 -47463 -48979 -31000 -15665 -19352 -24949 -14260 34786 24934 18060 24150
8723 24150 13271 12556 -3009 -26902 -32306 -44001 -55975 -66979 -62161 -62984 -45884 9799 39252
8710 39252 31813 45752 14851 -4025 22503 49217 33469 -3798 -5206 -10313 -4760 -31029 -33918
8697 -33918 3125 11324 18975 16380 27448 38588 49803 26646 1718 27957 29324 33925 51231
8684 51231 48043 38632 26241 39506 31184 31420 15494 14615 14187 18894 36815 54729 30910 4395
8670 4395 -2788 24268 50479 36740 1742 271 7233 10006 -8922 -28451 -33872 -13001 -7218
8657 -7218 -11316 10142 46509 18551 25353 25900 11728 1440 -22186 -31481 -34281 -45966 -71173
8644 -71173 -47217 -39376 -14577 4784 454 -3790 21711 31887 45272 46612 27501 36392 38141
$$ packed form
8736e0574j1415l678J8204j516J7979J5335l687n597J0689M9046r852o874O090
8723B4150j0879p15j5565k3893n404j1695j1974j1004M818q23J7100N5683K9453
8710C9252p439J3939l0901j8876K6528K6714j5748l7267j408n107N553k6269k889
8697c3918L7043Q199P651k595J1068J1140J1215k3157k4928K6239J367M601J7306
8684E1231l188r411j2391J3265q322K36j5926q79m28M707J7921J7914k3819k6515
8670D395p183K7056K6211j3739l4998j471O962K773j8928j9529n421K0871N783
8657g218m098K1458L6367k7958O802N47j4172j0288k3626r295k800j1685k5207
8644g1173K3956P841K4799J9361m330m244K5501J0176J3385J340j9111Q891J749
$$ plain form
8631 38141 17590 1432 9707 7104 -9063 -10716 4116 6548 -16592 1305 28647 33561 10225
8618 10225 11059 19480 20757 33911 39003 14701 -5706 -21321 -11083 -6362 6079 20721 44089
8605 44089 60833 32939 -1772 13762 34727 42379 70029 62920 42435 18046 267 14379
8593 14379 17629 32586 76166 86944 54274 48733 19504 15699 27057 28501 39141 41977 42675
8580 42675 48142 30367 -6288 -17573 -20872 -19229 -7750 7765 15549 4395 17778 21998 -133
8567 -133 571 4460 30567 40290 38453 32293 36912 71585 72125 63991 46828 42733 29470 20877 4320
8552 4320 6053 1601 22256 39085 28606 -7371 -15995 -10349 -14361 -14777 1142 -3408 -12964 6198
8538 6198 30124 41068 48071 27985 18396 642 -33094 -46720 -26711 1169 4805 20222 17848
$$ packed form
8631C8141k0551j6158Q275k603j6167j653J4832K432k3140J7897K7342M914k3336
8618A0225Q34Q421J277J3154N092k4302k0407j5615J0238M721J2441J4642K3368
8605D4089J6744k7894l4711J5534K0965P652K7650p109k0485k4389j7779J4112
8593A4379L250J4957M3580J0778l2670n541k9229l805J1358J444J0640K836O98
8580D2675N467j7775l6655j1285l299J643J1479J5515P784j1154J3383M220k2131
8567a33P04L889K6107R723j837o160M619L4673N40q134j7163m095j3263q593j6557
8552D320J733m452K0655J6829j0479l5977q624N646m012m16J5919m550r556J9162
8538F198K3926J0944P003k0086r589j7754l3736j3626K0009K7880L636J5417k374
$$ plain form
8525 17848 8840 5769 -8557 -10692 -24563 -41998 -19980 -16771 -22489 -12379 -32184 -44104 -31106
8512 -31106 -35568 604 9406 -6955 -3840 7667 20232 29447 37237 25416 30086 45480 42002
8499 42002 21614 18485 13028 22410 27972 22177 36489 47614 23521 9048 52749 72039 63727
8486 63727 67145 42195 27321 26679 12618 1954 -1686 -3068 -2950 12984 14760 14162 50381 38089
8472 38089 32727 22424 8305 12095 3861 -2639 -7885 5432 32036 57093 58764 49335 47025
8459 47025 45338 45724 39290 25368 4640 -8697 -20162 -16919 -27166 -14733 -6239 -2134 -37827
8446 -37827 -20801 -11414 -8872 -25105 -4544 25932 47314 25465 18181 62424 40239 13822
8434 13822 11953 -8218 -10738 -6569 7685 18229 13293 25488 26585 -3451 1687 51273 61703
$$ packed form
8525A7848r008l071j4326k135j3871j7435K2018L209n718J0110j9805j1920J2998
8512c1106m462L6172Q802j6361L115J1507J2565R215P790j1821M670J5394l478
8499D2002k0388l129n457R382N562n795J4312J1125k4093j4473M3701J9290q312
8486F3727L418k4950j4874o42j4061j0664l640j382J18J5934J776n98L6219j2292
8472C8089n362j0303j4119L790q234o500n246J3317K6604K5057J671r429k310
8459D7025j687L86o434j3922k0728j3337j1465L243j0247J2433Q494M105l5693
8446c7827J7026R387K542j6233K0561L0476K1382k1849p284M4243k2185k6417
8434A3822j869k0171k520M169J4254J0544m936J2195J097l0036N138M9586J0430
$$ plain form
8421 61703 38828 29749 43145 52256 40850 16209 2 25083 29534 -6589 -9706 7899 28638
8408 28638 35922 51681 36526 17083 14729 -3742 -4474 -20600 -13466 5056 9948 -7942 -12950
8395 -12950 2281 1065 12576 33642 44850 44901 25793 -14197 -34913 -31329 -67927 -77431 -62753
8382 -62753 -47862 -16856 11846 29056 30657 35486 27854 30168 24212 10949 -16625 -31157 -45925
8369 -45925 -33800 -2070 6906 835 789 8646 20320 24658 9060 -6262 -11936 4871 -1295 -17750
8355 -17750 1751 4799 -4757 -11223 -2927 13838 29935 57653 73001 31705 -2974 9069 10425
8342 10425 -13595 -9663 21417 73009 40856 10614 779 583 -30482 -11444 -9450 -8917 -35717
8329 -35717 -39112 -36431 -1518 -15377 -21354 -19994 -23702 -22625 -19997 -26271 -7477 15878 582
$$ packed form
8421F1703k2875r079J3396R111j1406k4641j6207K5081M451l6123l117J7605K0739
8408B8638P284J5759j5155j9443k354j8471p32j6126P134J8522M892j7890n008
8395a2950J5231j216J1511K1066J1208N1j9108l9990k0716L584l6598r504J4678
8382f2753J4891L1006K8702J7210J601M829p632K314n956j3263k7574j4532j4768
8369d5925J2125L1730Q976o071m6P857J1674M338j5598j5322n674J6807o166j6455
8355a7750J9501L048r556o466Q296J6765J6097K7718J5348m1296l4679J2043J356
8342A0425k4020L932L1080N1592l2153l0242r835j96l1065J9038J994N33k6800
8329c5717l395K681L4913j3859n977J360l708J077K628o274J8794K3355j5296
$$ plain form
8316 582 -9822 9389 -7265 -11566 11978 22706 15304 33201 45331 10032 -39625 -44903 -4800
8303 -4800 24724 29655 39177 23276 10267 53423 60558 38549 21834 17530 21987 7870 7979
8290 7979 145 1407 10249 22300 31195 -14326 -44618 -12367 18680 33634 -3082 -19556 -26026
8277 -26026 -15637 7165 920 5649 -9217 -27673 -48838 -57190 -17020 8820 32920 26588 13271
8264 13271 15869 26937 38459 49257 22141 12834 36430 53582 51089 16477 -24435 -39294
8252 -39294 -19478 9494 15696 6003 7859 17736 20851 5390 30077 44440 42116 6596 -1988
8239 -1988 -7108 17423 -2321 -33042 -50190 -22743 -35177 -43683 -37011 -39058 -12090 -26296 -14929
8226 -14929 24534 20177 35283 41803 24711 16474 22283 24703 6754 8243 15332 41483 78984
$$ packed form
8316E82j0404J9211j6654m301K3544J0728p402J7897J2130l5299m9657n278M0103
8303d800K9524M931R522j5901j3009M3156P135k2009j6715m304M457j4117J09
8290G979p834J262Q842J2051Q895m5521l0292L2251L1047J4954l6716j6474o470
8277b6026J0389K2802o245M729j4866j8456k1165q352M0170K5840K4100o332j3317
8264A3271K598J1068J1522J0798k7116r307K3596J7152k493l4612m0912j4859
8252c9294J9816K8972O202r693J856R877L115j5461K4687J4363k324l5520q584
8239a988n120K4531j9744l0721j7148K7447j2434q506O672k047K6968j4206J1367
8226a4929L9463m357J5106O520j7092q237N809K420j7949J489P089K6151L7501
$$ plain form
8213 78984 63002 24548 22620 59455 54576 74199 73635 37947 55563 75622 107537 100998 87475
8200 87475 102871 157510 179230 193480 204055 168474 88946 59510 50032 61199 46457 34477
8188 34477 32777 41146 41227 58054 69547 63350 35735 26928 33838 58542 85341 79642 91705 96392
8174 96392 85591 92310 108445 138102 192921 214801 251066 310422 374043 431719 475640 519551
8162 519551 505602 454334 365981 288553 251232 206345 151721 119813 109566 80755 81300 85322
8150 85322 47670 61401 78621 90505 93247 50199 62205 83086 71921 93488 114444 108571
8138 108571 95252 111592 124104 147510 169875 189109 251910 319614 369720 419932 462934 495459
8126 495459 448997 351913 269149 234454 204666 152749 134534 139023 104645 92310 78115 54386
$$ packed form
8213G8984j5982l8454j928L6835m879J9623n64l5688J7616K0059L1915o539j3523
8200H7475J5396N4639K1720J4250J0575l5581p9528k9436r478J1167j4742j1980
8188C4477j700Q369Q1J6827J1493o197k7615q807O910K4704K6799n699J2063M687
8174I6392j0801O719J6135K9657N4819K1880L6265N9356O3621N7676M3921M3911
8162E19551j3949n1268q8353p7428l7321m4887n4624l1908j0247k8811N45M022
8150H5322l7652J3731J7220J1884K742m3048J2006K0881j1165K1567K0956n873
8138A08571j3319J6340J2512K3406K2365J9234O2801O7704N0106N0212M3002L2525
8126D95459m6462r7084q2764l4695k9788n1917j8215M489l4378j2335j4195k3729
$$ plain form
8114 54386 33983 35744 40635 60534 92037 75098 57603 59607 49055 48998 41686 39024 57685
8101 57685 71132 71310 84155 117932 138503 147364 163076 162273 196158 176639 189175 193479 165246
8088 165246 128837 116792 113574 59956 32417 21804 22453 11574 6523 40452 49093 11173 -11978
8075 -11978 -4233 11248 44781 23280 2222 3090 12286 19946 -13841 -22335 6368 6682 519 -8970
8061 -8970 1623 6326 15230 27819 23574 21462 2389 -240 -24 -15 -4582 -5611 3663 -7544 -32900
8046 -32900 -45209 -35682 -41310 -25802 2038 18945 -5684 -34263 -26227 1614 -1421 18637 23891
8033 23891 13879 42849 61899 31985 2477 -18012 -15245 10586 22530 7159 -7815 -17506
8021 -17506 -40939 -21409 9950 21521 7479 8542 -4127 2638 19825 30671 19290 7598
$$ packed form
8114E4386k0403J761M891J9899L1503j6939j7495K004j0552n7p312k662J8661
8101E7685J3447J78J2845L3777K0571Q861J5712q03L3885j9519J2536M304k8233
8088A65246l6409j2045l218n3618k7539j0613O49j0879n051L3929Q641l7920k3151
8075a1978P745J5481L3533k1501k1058Q68R196P660l3787q494K8703L14o163r489
8061h970J0593M703Q904J2589m245k112j9073k629K16Rm567j029R274j1207k5356
8046c2900j2309R527n628J5508K7840J6907k4629k8579Q036K7841l035K0058N254
8033B3891j0012K8970J9050k9914k9508k0489K767K5831J1944j5371j4974r691
8021a7506k3433J9530L1359J1571j4042J063j2669O765J7187J0846j1381j1692
$$ plain form
8009 7598 9083 1621 -15008 -36288 -26974 -1156 5577 33591 22746 15945 35431 15806 -2125
7996 -2125 32289 46331 81441 96185 77941 49649 14294 -11666 23787 29036 20599 25810 -1137
7983 -1137 -1117 1394 16751 36597 45005 44679 39952 6631 -5599 31592 27126 -9259 -22998 5474
7969 5474 19858 41383 33746 15420 39444 34405 6869 -18025 16020 48960 72114 29528
7957 29528 11351 849 2280 -4832 -142 49257 47614 27735 7301 13358 45412 40068 48005
7944 48005 43456 18226 11511 306 28756 71262 87743 39609 17976 2285 12911 27906
7932 27906 18357 15712 10182 21890 11698 16398 28419 46445 60159 73320 58847 53453 31313
7919 31313 42749 60461 57772 41042 19111 12345 19418 34607 38039 41515 54370 59547 32588
$$ packed form
8009G598J485p462j6629k1280R314K5818O733K8014j0845o801J9486j9625j7931
7996b125L4414J4042L5110J4744j8244k8292l5355k5960L5453N249q437N211k6947
7983a137K0K511J5357J9846Q408l26m727l3321j2230L7191m466l6385j3739K8472
7969E474J4384K1525p637j8326K4024n039k7536k4894L4045L2940K3154m2586
7957B9528j8177j0502J431p112M690M9399j643j9879k0434O057L2054n344P937
7944D8005m549k5230o715j1205K8450M2506J6481m8134k1633j5691J0626J4995
7932B7906r549k645n530J1708j0192M700J2021J8026J3714J3161j4473n394k2140
7919C1313J1436J7712k689j6730k1931o766P073J5189L432L476J2855N177k6959
$$ plain form
7906 32588 -9479 -7943 -13279 -26975 -21903 -14841 -1426 -12946 -3787 28376 27180 16060 -13280
7893 -13280 -41006 -34104 -34436 -12337 14398 5651 -12509 1094 10618 17347 671 -18361 -17052
7880 -17052 902 -10814 -4281 19687 43644 9384 -3088 -42094 -31331 -29172 -12292 13099
7868 13099 7657 -23631 -41731 -28486 -625 -22437 -38302 -42336 -18228 28080 31670 18225
7856 18225 -569 -5858 14134 33867 44185 26809 25136 -3975 -13127 2118 3079 12926 13181
7843 13181 772 2918 5442 3300 -27583 -37706 -43012 -29134 422 12180 34623 19220 6534
7830 6534 -9106 -26744 -27987 -32146 -68095 -98120 -74828 -36835 -18284 -23066 -21921 -23496 -17702
7817 -17702 -13823 -14923 -21151 -36997 -53820 -24567 -14404 -4243 18674 16621 -16706 -28368 -6941
$$ packed form
7906C2588m2067J536n336j3696N072P062J3415j1520R159L2163j196j1120k9340
7893a3280k7726O902l32K2099K6735q747j8160J3603R524O729j6676j9032J309
7880a7052J7954j1716O533K3968K3957l4260j2472l9006J0763K159J6880K5391
7868A3099n442l1288j8100J3245K7861k1812j5865m034K4108M6308L590j3445
7856A8225j8794n289J9992J9733J0318j7376j673k9111r152J5245R61R847K55
7843A3181j2409K146K524k142l0883j0123n306J3878K9556J1758K2443j5403j2686
7830F534j5640j7638j243m159l5949l0025K3292L7993J8551m782J145j575N794
7817a7702L879j100o228j5846j6823K9253J0163J0161K2917k053l3327j1662K1427
$$ plain form
7804 -6941 10356 -1749 -23548 -5012 13034 29405 8013 -15909 1676 -1519 10070 -3185
7792 -3185 -13451 -1316 4934 14806 -12800 7824 21950 2385 -14831 -22315 -37829 -25173 4313
7779 4313 -13248 774 16220 17856 6176 10436 5128 -27283 -15504 -7772 -27713 -31209 -4234
7766 -4234 16745 2105 -32510 -50642 -38626 3760 40489 -10398 -56471 -28653 -10317 -26128
7754 -26128 -20550 -19808 -21782 -10215 1924 8805 -18770 -18359 -18643 -22347 -32868 -22215 11224 31011
7740 31011 35969 28767 38208 14050 -1718 -2072 14771 2372 -21085 -9776 15478 31474 29798
7727 29798 21289 4066 -2397 -9933 -15014 -9280 -4215 15906 22907 7951 -18303 -28401 -39633
7714 -39633 -36794 -68087 -54304 -40425 -24703 -38831 -32306 -10404 -13936 -19256 12947 25350 13342
$$ packed form
7804f941J7297j2105k1799J8536J8046J6371k1392k3922J7585l195J1589j3255
7792c185j0266J2135O250R872k7606K0624J4126j9565j7216p484j5514J2656K9486
7779D313j7561J4022J5446J636j1680M260n308l2411J1779P732j9941l496K6975
7766d234K0979j4640l4615j8132J2016M2386L6729n0887m6073K7818J8336j5811
7754b6128N578P42j974J1567J2139O881k7575M11k84l704j0521J0653L3439J9787
7740C1011M958p202R441k4158j5768l54J6843j2399k3457J1309K5254J5996j676
7727B9798q509j7223o463p536n081N734N065K0121P001j4956k6254j0098j1232
7714c9633K839l1293J3783J3879J5722j4128O525K1902l532n320L2203J2403j2008
$$ plain form
7701 13342 4079 263 -14687 12822 32906 15893 41529 47651 9754 -16078 20778 34575
7689 34575 -3632 -34439 -23118 -10669 2628 9132 16033 19509 -1868 -12318 3724 8666 12329
7676 12329 6324 17849 3156 2682 6529 13695 -14973 -18761 -22680 -10018 11533 9136 20692
7663 20692 -690 6202 11121 -3071 -6589 -831 -851 -7890 -1913 5519 25651 31378 38266 31982
7649 31982 5300 10332 7918 26377 26510 9966 -6010 21756 26299 757 -18097 -36290 -51457
7636 -51457 -34593 -15564 4519 6945 -6565 -43422 -55180 -9730 25957 16215 11746 -9111
7624 -9111 -23679 -31227 -64976 -76231 -35324 -2349 -4576 3091 5679 2009 -7094 862 -10999
7611 -10999 -13010 -21060 -23840 -3631 -5493 9278 2667 4071 -17269 -38433 -48387 -41199 -32985 -8321
$$ packed form
7701A3342r263l816j4950K7509K0084j7013K5636O122l7897k5832L6856J3797
7689C4575l8207l0807J1321J2449J3297O504O901L476k1377j0450J6042M942L663
7676A2329o005J1525j4693m74L847P166k8668l788l919J2662K1551k397J1556
7663B0692k1382O892M919j4192l518N758k0p039N977P432K0132N727O888o284
7649C1982k6682N032k414J8459J33j6544j5976K7766M543k5542j8854j8193j5167
7636e1457J6864J9029K0083K426j3510l6857j1758M5450L5687r742m469k0857
7624i111j4568p548l3749j1255M0907L2975k227P667K588l670r103P956j1861
7611a0999k011q050k780K0209j862J4771o611J404k1340k1164r954P188Q214K4664
$$ plain form
7597 -8321 28624 1730 -12442 -3698 10673 -4376 -22552 -29287 -29251 -19748 -14660 -4154 -8803 -30701
7583 -30701 -9476 -9190 -44410 -34827 -50305 -45119 -19944 6274 -618 -6122 -2524 8473 36618
7570 36618 12520 -3981 -9666 6349 29064 43909 48999 34773 3229 -12654 -13483 11348 3358
7557 3358 -22102 -7746 4833 22525 22696 33537 14997 -14553 -22930 -22133 -22975 -42281 -39832 -18527
7543 -18527 -11249 -19650 -3305 22888 21992 8820 7470 -3842 -20304 -2465 10249 -6339 -4556
7530 -4556 10087 1304 5307 3730 -8298 -31173 -21557 -2380 -34 10169 24584 20562 -10236
7517 -10236 -23514 -17858 -29238 -36380 -10947 32804 50306 30716 31437 21996 6021 9002 34014
7504 34014 40107 32962 5960 -25047 -28623 -21635 -27025 -29512 -30652 -14757 11441 -8273 -15151
$$ packed form
7597h321L6945k6894j4172Q744J4371j5049j8176o735L6R503N088J0506m649k1898
7583c0701K1225K86l5220R583j5478N186K5175K6218o892n504L598J0997K8145
7570C6618k4098j6501n685J6015K2715J4845N090j4226l1544j5883q29K4831p990
7557C358k5460J4356J2579J7692J71J0841j8540k9550q377P97q42j9306K449K1305
7543a8527P278q401J6345K6193q96j3172j350j1312j6462J7839J2714j6588J783
7530d556J4643q783M003j577j2028k2875R616J9177K346J0203J4415m022l0798
7517a0236j3278N656j1380p142K5433M3751J7502j9590P21r441j5975K981K5012
7504C4014O093p145k7002l1007l576O988n390k487j140J5895K6198j9714o878
$$ plain form
7491 -15151 6389 -3859 7020 -6960 -14189 -9730 -33765 -28748 1453 -246 -14268 -13871 -21312
7478 -21312 -7276 16192 16980 -8965 -17496 -14278 17227 20101 13345 23946 42925 28324 19153
7465 19153 34915 19360 -4134 -47395 -58299 -57085 -46034 -39581 -25563 8172 -18058 -57700
7453 -57700 -57141 -24589 -2103 11505 29466 44229 38122 2947 10347 19866 -4479 -13196 -21194
7440 -21194 -20071 -34497 -41019 -6637 8848 18342 -11695 -4287 7294 6936 19993 13440 7185
7427 7185 18707 -8274 -27581 -13043 9721 48181 80616 61741 38464 26780 684 -6496
7415 -6496 -24407 -27881 -30155 -10820 328 29154 25936 4506 -7466 789 3110 16319 7796
7402 7796 -3830 6233 18330 -16904 -30704 -26625 -20934 -10591 2897 -19415 -2561 26457
$$ packed form
7491a5151K1540j0248J0879j3980p229M459k4035N017L0201j699j4022L97p441
7478b1312J4036K3468P88k5945q531L218L1505K874o756J0601J8979j4601r171
7465A9153J5762j5555k3494m3261j0904J214J1051O453J4018L3735k6230l9642
7453e7700N59L2552K2486J3608J7961J4763o107l5175P400R519k4345q717p998
7440b1194J123j4426o522L4382J5485R494l0037P408J1581l58J3057o553o255
7427G185J1522k6981j9307J4538K2764L8460L2435j8875k3277j1684k6096p180
7415f496j7911l474k274J9335J1148K8826l218k1430j1972Q255K321J3209q523
7402G796j1626J0063J2097l5234j3800M079N691J0343J3488k2312J6854K9018
$$ plain form
7390 26457 40485 50079 10678 -32686 -30198 -23095 -42476 -34239 -21274 -17541 -8366 -5339 -20521
7377 -20521 -21925 9269 27356 13301 29707 43670 2785 11231 14394 -15499 -34464 -47911
7365 -47911 -12702 -6802 10786 317 -14090 -17909 1845 -18445 -32730 -26104 15955 25563 2296
7352 2296 -17318 -18712 -28482 -65638 -28825 -29977 -17732 -14200 9914 19199 18838 -15836 -49334
7339 -49334 -30818 -24244 -4338 15102 27134 24789 -11312 -9014 7169 -5484 -45966 -64520
7327 -64520 -57615 -46456 -29851 -5063 1022 -2101 3462 24840 4700 -21375 -13232 18139 48446
7314 48446 50751 -10645 -44323 -19716 24521 28774 15700 10937 18665 36421 45580 60428 44841
7301 44841 25675 -6042 -18607 -38549 -58941 -73907 -74347 -32790 -18875 -8510 -7228 5563
$$ packed form
7390B6457J4028R594l9401m3364K488P103j9381Q237J2965L733R175L027j5182
7377b0521j404L1194J8087j4055J6406J3963m0885Q446L163k9893j8965j3447
7365d7911L5209N900J7588j0469j4407l819J9754k0290j4285O626M2059R608k3267
7352B296j9614j394r770l7156L6813j152J2245L532K4114R285l61l4674l3498
7339d9334J8516O574J9906J9440J2032k345l6101K298J6183j2653m0482j8554
7327f4520O905J1159J6605K4788O085l123N563K1378k0140k6075Q143L1371L0307
7314D8446K305o1396l3678K4607M4237M253j3074m763P728J7756R159J4848j5587
7301D4841j9166l1717j2565j9942k0392j4966m40M1557J3915J0365J282J2791
$$ plain form
7289 5563 6270 -16768 -32801 -55948 -59312 -29038 -3398 -2125 31754 18991 -6714 -3248 -15461
7276 -15461 -4572 1971 -7614 5120 -22632 -34594 -37964 -42472 -55310 -15405 -7794 2655 -14240
7263 -14240 -32414 -32014 -17657 -12222 -6378 7629 10262 17648 -3394 8505 -4759 -22937 -2537
7250 -2537 3058 -515 -2602 -19595 -32622 -17567 460 -5017 -1147 28116 -1877 -64507 -68644
7237 -68644 -59624 -56157 -61875 -32560 -26107 -22565 -23907 -40491 -28105 3017 11507 1734 -5699 9313
7223 9313 26716 44318 43555 22599 -1222 -6736 2020 20772 -7163 -36704 19298 31765 35726
7210 35726 52373 57010 4058 -21906 -22458 -34058 -32708 -17145 -30173 -40887 -29124 -59485 -66072
7197 -66072 -50185 -31947 -19190 -22276 -36147 -48618 -37433 -26235 -34395 -8365 9395 16473
$$ packed form
7289E563P07k3038j6033k3147l364L0274K5640J273L3879j2763k5705L466j2213
7276a5461J0889O543r585J2734k7752j1962l370m508j2838L9905P611J0449j6895
7263a4240j8174M00J4357N435N844J4007K633P386k1042J1899j3264j8178K0400
7250b537N595l573k087j6993j3027J5055J8027n477L870K9263k9993o2630m137
7237f8644R020L467n718K9315O453L542j342j6584J2386L1122Q490r773p433J5012
7223I313J7403J7602p63k0956k3821n514Q756J8752k7935k9541N6002J2467L961
7210C5726J6647M637n2952k5964n52j1600J350J5563j3028j0714J1763l0361o587
7197f6072J5887J8238J2757l086j3871j2471J1185J1198q160K6030J7760P078
$$ plain form
7185 16473 3265 -10671 -17690 -2788 21622 25775 13708 -6637 -24446 -32758 -19911 -23570 -11180
7172 -11180 -30798 -22497 -13710 -10300 -1005 -13856 -14596 -19544 -23141 -36117 -38509 -34876 -20272 -10343
7158 -10343 1497 -13993 -2872 2403 9729 -8982 -21778 7839 22604 9767 -30661 -45894
7146 -45894 -28861 -3755 32520 19546 -14049 -18208 630 -3032 -27946 -21411 -22172 -17975 -21593
7133 -21593 -28796 -46653 -66850 -50038 -21954 -7148 189 17730 34329 10361 -23887 -28049
7121 -28049 -6839 26739 42002 20171 7991 -948 -9390 -3933 -17548 -19590 5410 8813 -7705
7108 -7705 7619 -10106 657 -992 -24610 -36448 -47221 -26918 -130 3026 -18401 -18856 22073
7095 22073 50037 67591 91804 61641 21665 6947 -2293 -15477 -17271 2744 5117 -24163
$$ packed form
7185A6473j3208j3936p019J4902K4410M153j2067k0345j7809q312J2847l659J2390
7172a1180j9618Q301Q787L410R295j2851p40m948l597j2976k392L633J4604R929
7158a0343J1840j5490J1121N275P326j8711j2796K9617J4765j2837m0428j5233
7146d5894J7033K5106L6275j2974l3595m159J8838l662k4914O535p61M197l618
7133b1593p203j7857k0197J6812K8084J4806P337J7541J6599k3968l4248m162
7121b8049K1210L3578J5263k1831j2180q939q442N457j3615k042K5000L403j6518
7108g705J5324j7725J0763j649k3618j1838j0773K0303K6788L156k1427m55M0929
7095B2073K7964J7554K4213l0163l9976j4718r240j3184j794K0015K373k9280
$$ plain form
7083 -24163 -48773 -59789 -21167 -645 21550 -7312 -3530 6875 -6181 -10830 1406 13525
7071 13525 -13812 -60436 -71059 -49285 -34320 -29727 -7271 -4181 -546 -4684 -13291 -26014 -14638
7058 -14638 -8936 -9419 -36131 -37782 4909 7969 -20750 -33672 -22231 -52580 -57428 -26185 -23542
7045 -23542 -31247 -44503 -4595 5048 17439 30137 27694 29070 15132 -4807 6749 14421 12539
7032 12539 -1012 -19727 13426 13007 2658 -10050 -26355 -41659 -24816 -9019 6903 12965
7020 12965 17516 2944 -36715 -29143 -17270 -5462 12971 11268 -18227 -39593 -28183 -19072 -29431
7007 -29431 -31469 -18183 -1825 -902 8229 21961 -5159 -12377 -21158 -20129 -2688 5689 -37 -22031
6993 -22031 -9716 19880 45962 27649 1118 -12523 2482 -1612 -10151 9056 -24698 -47801
$$ packed form
7083b4163k4610j1016L8622K0522K2195k8862L782J0405j3056m649J2236J2119
7071A3525k7337m6624j0623K1774J4965M593K2456L090L635m138q607j2723J1376
7058a4638N702m83k6712j651M2691L060k8719j2922J1441l0349m848L1243K643
7045b3542p705j3256L9908R643J2391J2698k443J376j3938j9939J1556P672j882
7032A2539j3551j8715L3153m19j0349j2708j6305j5304J6843J5797J5922O062
7020A2965M551j4572l9659P572J1873J1808J8433j703k9495k1366J1410R111j0359
7007b9431k038J3286J6358R23R131J3732k7120p218q781J029J7441Q377n726k1994
6993b2031J2315K9596K6082j8313k6531j3641J5005m094q539J9207l3754k3103
$$ plain form
6981 -47801 -42715 -23358 5843 18849 14118 5993 -13174 -29779 -30645 -33922 -41900 -19505 11678
6968 11678 19553 21016 -807 -32162 -68448 -59997 -56003 -63701 -45397 11081 26014 23463 31429
6955 31429 17031 -2307 522 14223 9002 21235 27058 11062 -3562 -26706 -47019 874
6943 874 -2851 -34076 -31165 -35005 -26933 -37952 -46007 -39318 -57372 -47230 -50245 -13038 4967 15613
6929 15613 16768 -5459 -27014 -14191 2583 -22806 -21652 5854 21136 15351 13711 11053 9038
6916 9038 -11075 -24132 -39125 -38163 -17934 20419 26731 411 -10448 -1639 -14747 -10184 -21675
6903 -21675 -15150 -11678 -37776 -22464 -3695 -11933 5484 4802 34579 44109 50048 49831 35154 24794
6889 24794 9717 -26170 -55797 -50481 -27535 -31276 -51393 -33115 9945 7767 -8865 -895 -3859
$$ packed form
6981d7801N086J9357K9201J3006m731q125j9167j6605q66l277p978K2395L1183
6968A1678P875J463k1823l1355l6286Q451L994p698J8304N6478J4933k551P966
6955C1429j4398j9338K829J3701n221J2233N823j5996j4624k3144k0313M7893
6943H74l725l1225K911l840Q072j1019q055O689j8054J0142l015L7207J8005J0646
6929A5613J155k2227k1555J2823J6774k5389J154K7506J5282n785j640k658k015
6916I038k0113j3057j4993R62K0229L8353O312k6320j0859Q809j3108M563j1491
6903b1675O525L472k6098J5312J8769q238J7417o82K9777R530N939k17j4677j0360
6889B4794j5077l5887k9627N316K2946l741k0117J8278M3060k178j6632P970k964
$$ plain form
6876 -3859 -3360 -9541 4553 -2343 11245 -26440 -51321 -23606 -5640 -12102 -44198 -64010 -45304
6863 -45304 -19071 -17887 1816 -3195 -11687 -4406 8217 29980 34563 42753 43398 10445 -79873
6850 -79873 -144706 -119877 -78795 -50970 -15322 -7537 -29769 -61443 -55690 -21619 3884 4289 8306
6837 8306 -6636 -28824 -16994 32097 31348 21984 10804 14539 26484 20224 22342 -4404 -15051
6824 -15051 -30054 -44756 -42351 -33438 -1364 7606 -3902 -10256 -2592 1061 15218 34726 5954
6811 5954 -10075 -3313 14353 11962 7396 -5429 14219 39722 16135 -5732 -36563 -51552 -55175
6798 -55175 -38595 -30561 -40716 -44184 -52714 -34389 -29397 -9944 12333 3102 -13072 -7370 7765
6785 7765 10334 -22070 -30755 -23235 -1697 16580 6581 -8356 -42356 -23109 10170 34522 31189
$$ packed form
6876c859M99o181J4094o896J3588l7685k4881K7715J7966o462l2096j9812J8706
6863d5304K6233J184J9703n011q492P281J2623K1763M583Q190O45l2953r0318
6850g9873o4833K4829M1082K7825L5648P785k2232l1674N753L4071K5503M05M017
6837H306j4942k2188J1830M9091p49r364j1180L735J1945o260K118k6746j0647
6824a5051j5003j4702K405Q913L2074Q970j1508o354P664L653J4157J9508k8772
6811E954j6029O762J7666k391m566j2825J9648K5503k3587k1867l0831j4989l623
6798e5175J6580Q034j0155l468q530J8325M992J9453K2277r231j6174N702J5135
6785G765K569l2404q685P520K1538J8277r999j4937l4000J9247L3279K4352l333
$$ plain form
6772 31189 36988 40162 32060 16076 -2827 -342 35318 26810 -2102 11243 9511 -6016 -18952
6759 -18952 -20967 -1766 42448 55879 43488 9142 -31808 -45832 -19294 18228 18496 31419
6747 31419 30592 18391 -33032 6826 49009 58239 50056 42079 32098 13817 24353 4130 -5026
6734 -5026 1282 -4789 -10256 -1924 1747 11108 13299 4789 186 16618 -3244 -25152 -24804 -6441
6720 -6441 -31127 -24483 -1129 -16818 -23100 -8753 -11084 -4918 -5994 -35256 -26387 -9964 3114
6707 3114 -5109 -36693 -32097 76 32221 -5430 -27703 -7765 -29381 -9991 36253 26900 -4420
6694 -4420 -15813 -1230 -11466 -26743 -37558 -36713 -43214 -31754 11708 14708 -16737 -11358 -26748
6681 -26748 -24658 -18606 -43322 -57153 -23346 12837 17161 8502 9716 19885 -2163 364 11665
$$ packed form
6772C1189N799L174q102j5984j8903K485L5660q508k8912J3345j732j5527j2936
6759a8952k015J9201M4214J3431j2391l4346m0950j4024K6538L7522K68J2923
6747C1419q27j2201n1423L9858M2183R230q183p977r981j8281J0536k0223r156
6734e026O308o071n467Q332L671R361K191q510m603J6432j9862k1908L48J8363
6720f441k4686O644K3354j5689o282J4347k331O166j076k9262Q869J6423J3078
6707C114q223l1584M596L2173L2145l7651k2273J9938k1616J9390M6244r353l1320
6694d420j1393J4583j0236j5277j0815Q45o501J1460M3462L000l1445N379j5390
6681b6748K090O052k4716j3831L3807L6183M324q659J214J0169k2048K527J1301
$$ [...]
##END NTUPLES=NMR SPECTRUM
##END=
