##TITLE=Analysis number 310756
Compound Code sb 01647
Project Code adrs
Chemist Name stores
##JCAMPDX= 6.0         $$ Bruker NMR JCAMP-DX V2.0
##DATA TYPE= NMR SPECTRUM
##DATA CLASS= NTUPLES
##ORIGIN= Bruker BioSpin GmbH
##OWNER= NMR
$$ XWIN-NMR		Version 3.5
$$ Thu Jun 23 09:27:40 2005 GMT Daylight Time (UT+1h)  MAYBRIDGE\NMR@NMR_250MHZ
##.OBSERVE FREQUENCY= 250.131544655141
##.OBSERVE NUCLEUS= ^1H
##.ACQUISITION MODE= SIMULTANEOUS (DQD)
##.ACQUISITION SCHEME= undefined
##.AVERAGES= 16
##.DIGITISER RES= 18
##SPECTROMETER/DATA SYSTEM= dpx250
##.PULSE SEQUENCE= zg30
##.SOLVENT NAME= CDCl3
##.SHIFT REFERENCE= (INTERNAL, CDCl3, 0, 16.522)
##AUDIT TRAIL= $$ (NUMBER, WHEN, WHO, WHERE, WHAT)
$$ ##TITLE= Audit trail, XWIN-NMR		Version 3.5
$$ ##JCAMPDX= 5.01
$$ ##ORIGIN= Bruker BioSpin GmbH
$$ ##OWNER= NMR
$$ C:\u/data/dgb/nmr/ADRS/4570/pdata/1/auditp.txt
$$ ##AUDIT TRAIL=  $$ (NUMBER, WHEN, WHO, WHERE, WHAT)
(   1,<2005-06-23 09:27:19.68 +100>,<MAYBRIDGE\NMR>,<NMR_250MHZ>,
      <created by zg, POWCHK disabled, PULCHK disabled
       configuration hash MD5:
       62 19 C7 07 E1 42 D1 B7 37 6C 3D D0 77 39 F9 E6
       data hash MD5: 64K
       27 3C C3 22 25 69 4B 90 DF 59 6D AB D9 3E 14 AB>)
(   2,<2005-06-23 09:27:31.61 +100>,<MAYBRIDGE\NMR>,<NMR_250MHZ>,
      <Start of raw data processing
       ef LB = 0.3 FT_mod = 6 PKNL = 1 SI = 32K 
       data hash MD5: 32K
       23 29 36 F9 AF 2F 4C 46 A4 1F C8 68 5E 09 D8 B5>)
(   3,<2005-06-23 09:27:33.46 +100>,<MAYBRIDGE\NMR>,<NMR_250MHZ>,
      <apk 
       data hash MD5: 32K
       C0 6C E2 BA DD 39 B6 05 4E 06 F8 83 96 87 EA 5F>)
(   4,<2005-06-23 09:27:34.22 +100>,<MAYBRIDGE\NMR>,<NMR_250MHZ>,
      <abs ABSG = 5 
       data hash MD5: 32K
       59 19 A3 AE 0C 9A 68 87 53 99 8F 50 1D 71 A1 B7>)
$$ ##END=
$$ 
$$ hash MD5
$$ 19 8F 52 D1 1B 45 B3 CD 58 AE 39 38 5A 1B 47 7E
##$RELAX= 
##$RELAX= 
##$RELAX= 
##$RELAX= 
##$RELAX= 
##$RELAX= 
##$RELAX= 
$$ Bruker specific parameters
$$ --------------------------
##$DU= <C:\u>
##$EXPNO= 4570
##$NAME= <ADRS>
##$PROCNO= 1
##$TYPE= <nmr>
##$USER= <dgb>
##$AMP= (0..31)
100 100 100 100 100 100 100 100 100 100 100 100 100 100 100 100 100 100 
100 100 100 100 100 100 100 100 100 100 100 100 100 100 
##$AQSEQ= 0
##$AQ_mod= 3
##$AUNM= <au_zg>
##$AUTOPOS= <56 >
##$BF1= 250.13
##$BF2= 250.13
##$BF3= 250.13
##$BF4= 250.13
##$BF5= 500.13
##$BF6= 500.13
##$BF7= 500.13
##$BF8= 500.13
##$BYTORDA= 1
##$CFDGTYP= 0
##$CFRGTYP= 5
##$CHEMSTR= <none>
##$CNST= (0..31)
1 1 145 1 1 1 1 1 1 1 1 1 1 1 1 1 1 1 1 1 1 1 1 1 1 1 1 1 1 1 1 1 
##$CPDPRG= <>
##$CPDPRG1= <>
##$CPDPRG2= <>
##$CPDPRG3= <>
##$CPDPRG4= <mlev>
##$CPDPRG5= <mlev>
##$CPDPRG6= <mlev>
##$CPDPRG7= <mlev>
##$CPDPRG8= <mlev>
##$CPDPRGB= <>
##$CPDPRGT= <>
##$D= (0..31)
0 1 0 0 0 0 0 0 0 0.06 0 0 0 0 0 0 0.0002 0 0 0 0 0 0 0 0 0 0 0 0 0 0 
0 
##$DATE= 1119515238
##$DBL= (0..7)
120 120 120 120 120 120 120 120 
##$DBP= (0..7)
150 150 150 150 150 150 150 150 
##$DBP07= 0
##$DBPNAM0= <>
##$DBPNAM1= <>
##$DBPNAM2= <>
$$ [...]
##$SUBNAM7= <"">
##$SUBNAM8= <"">
##$SUBNAM9= <"">
##$SW= 20.6930455092707
##$SWIBOX= (0..15)
0 0 3 0 0 0 0 0 0 0 0 0 0 0 0 0 
##$SW_h= 5175.983436853
##$TD= 65536
##$TD0= 1
##$TE= 295.16
##$TE2= 300
##$TE3= 300
##$TEG= 300
##$TL= (0..7)
0 120 120 120 120 120 120 120 
##$TP= (0..7)
150 150 150 150 150 150 150 150 
##$TP07= 0
##$TPNAME0= <>
##$TPNAME1= <>
##$TPNAME2= <>
##$TPNAME3= <>
##$TPNAME4= <>
##$TPNAME5= <>
##$TPNAME6= <>
##$TPNAME7= <>
##$TPOAL= (0..7)
0.5 0.5 0.5 0.5 0.5 0.5 0.5 0.5 
##$TPOFFS= (0..7)
0 0 0 0 0 0 0 0 
##$TUNHIN= 0
##$TUNHOUT= 0
##$TUNXOUT= 0
##$USERA1= <user>
##$USERA2= <user>
##$USERA3= <user>
##$USERA4= <user>
##$USERA5= <user>
##$V9= 5
##$VALIST= <valist>
##$VCLIST= <CCCCCCCCCCCCCCC>
##$VD= 0
##$VDLIST= <DDDDDDDDDDDDDDD>
##$VPLIST= <PPPPPPPPPPPPPPP>
##$VTLIST= <TTTTTTTTTTTTTTT>
##$WBST= 1024
##$WBSW= 4
##$XGAIN= (0..3)
0 0 0 0 
##$XL= 0
##$YL= 0
##$YMAX_a= 458850
##$YMIN_a= -441437
##$ZGOPTNS= <>
##$ZL1= 120
##$ZL2= 120
##$ZL3= 120
##$ZL4= 120
##$ABSF1= 16.522
##$ABSF2= -4.171173
##$ABSG= 5
##$ABSL= 3
##$ALPHA= 0
##$AQORDER= 0
##$ASSFAC= 0
##$ASSFACI= 0
##$ASSFACX= 0
##$ASSWID= 0
##$AUNMP= <proc_1d>
##$AZFE= 0.1
##$AZFW= 0.1
##$BCFW= 0
##$BC_mod= 0
##$BYTORDP= 0
##$COROFFS= 0
##$CY= 12.5
##$DATMOD= 1
##$DC= 0
##$DFILT= <>
##$DTYPP= 0
##$F1P= 14.0000005364418
##$F2P= -0.99999901652339
##$FCOR= 0.5
##$FTSIZE= 32768
##$FT_mod= 6
##$GAMMA= 0
##$GB= 0
##$INTBC= 1
##$INTSCL= 1
##$ISEN= 128
##$LB= 0.3
##$LEV0= 0
##$LPBIN= 0
##$MAXI= 10000
##$MC2= 0
##$MEAN= 0
##$ME_mod= 0
##$MI= 0
##$NCOEF= 0
##$NC_proc= -3
##$NLEV= 6
##$NOISF1= 0
##$NOISF2= 0
##$NSP= 0
##$NTH_PI= 0
##$NZP= 0
##$OFFSET= 16.522
##$PC= 1
##$PHC0= -78.59602
##$PHC1= 5.843423
##$PH_mod= 1
##$PKNL= yes
##$PPARMOD= 0
##$PSCAL= 4
##$PSIGN= 0
##$REVERSE= no
##$SF= 250.13
##$SI= 32768
##$SIGF1= 0
##$SIGF2= 0
##$SINO= 400
##$SIOLD= 32768
##$SREGLST= <1H.CDCl3>
##$SSB= 0
##$STSI= 32768
##$STSR= 0
##$SW_p= 5175.98343685301
##$SYMM= 0
##$S_DEV= 0
##$TDeff= 65536
##$TDoff= 0
##$TI= <Analysis number 999999
Compound Code 99
Book Reference 9
Project Code 9>
##$TILT= no
##$TM1= 0
##$TM2= 0
##$TOPLEV= 0
##$USERP1= <user>
##$USERP2= <user>
##$USERP3= <user>
##$USERP4= <user>
##$USERP5= <user>
##$WDW= 1
##$XDIM= 32768
##$YMAX_p= 451834851
##$YMIN_p= -190206
$$ End of Bruker specific parameters
$$ ---------------------------------
##NTUPLES= NMR SPECTRUM
##VAR_NAME=  FREQUENCY,     SPECTRUM/REAL,   SPECTRUM/IMAG
##SYMBOL=    X,             R,               I
##VAR_TYPE=  INDEPENDENT,   DEPENDENT,       DEPENDENT
##VAR_FORM=  AFFN,          ASDF,            ASDF
##VAR_DIM=   32768,         32768,           32768
##UNITS=     HZ,            ARBITRARY UNITS, ARBITRARY UNITS
##FACTOR=    0.157963299565203, 1,           1
##FIRST=     4132.6476996994, 0,             0
##LAST=      -1043.33573715361, 0,           0
##MIN=       -1043.33573715361, -190206,     0
##MAX=       4132.6476996994, 451834851,     0
$$ Real data points
##PAGE= N=1
##DATA TABLE= (X++(R..R)), XYDATA
$$ [...]
$$ plain form
16963 -28578 -23900 -31479 -12399 -1692 8785 10370 1205 -8304 -5000 -13961 -7524 -4808 7199
16950 7199 7711 11487 -5225 -35847 -42319 -44061 -33876 -27921 -40290 -54295 -54529 -54778 -52577 -40898
16936 -40898 -44791 -61976 -65631 -71112 -64743 -44850 -27325 -25774 -6271 -913 -18808 -20468 -31404
16923 -31404 -27546 -8742 2244 -11223 -34181 -34037 -19608 -35186 -33205 -36065 -25030 -20267 -13732
16910 -13732 -11274 -28412 -39497 -20546 5401 5972 3034 -5996 -10451 -10598 -14611 -22565 -26750 -41126
16896 -41126 -23564 -3647 -5504 3647 1522 -3362 -24579 -35581 -25998 -13570 -267 -4374 -10808
16883 -10808 -7539 7632 -8208 -22261 -24040 -34139 -36940 -25567 -20150 -15851 628 9524 -8765
16870 -8765 -12941 -5853 -3785 -22321 -14012 897 833 3469 1772 -14644 -20180 -3672 288 -1567
$$ packed form
16963b8578M678p579J9080J0707J0477J585r165r509L304q961O437K716J2007
16950G199N12L776j6712l0622o472j742J0185N955j2369j4005k34k49K201J1679
16936d0898l893j7185l655n481O369J9893J7525J551J9503N358j7895j660j0936
16923c1404L858J8804J0986j3467k2958J44J4429j5578J981k860J1035M763O535
16910a3732K458j7138j1085J8951K5947N71k938r030m455j47m013p954m185j4376
16896d1126J7562J9917j857R151k125m884k1217j1002R583J2428J3303m107o434
16883a0808L269J5171j5840j4053j779j0099k801J1373N417M299J6479Q896j8289
16870h765m176P088K068j8536Q309J4909o4K636j697j6416n536J6508L960j855
$$ plain form
16856 -1567 40 5845 302 -23005 -18942 -14445 -7060 -11921 -30661 -24668 -7395 6235 1570 -11460
16842 -11460 -20738 -21092 -20480 -13568 -4327 -9394 -6040 -964 -21383 -25652 -20127 -8849 -12764 -22925
16828 -22925 -22808 -13114 -5466 -20551 -33968 -31091 -29213 -28464 -18327 -13587 -25157 -29687 -38931 -42827
16814 -42827 -41901 -61001 -68044 -55408 -58111 -57718 -39676 -1343 8211 -12830 -35560 -46789 -43609
16801 -43609 -31956 -20163 -18876 -22530 -28056 -34232 -23345 -7634 4471 -1285 -8087 7305 3568
16788 3568 -23457 -19434 4466 16250 -2339 -9268 -4246 -26287 -24646 -9612 -7275 -19514 -19170
16775 -19170 -11872 -15622 -25570 -12474 -16385 -23241 -14338 -34081 -51522 -37968 -11272 17942 14227
16762 14227 -262 -16861 -8567 -2374 3234 6826 7051 13254 -629 -9409 -19946 -13028 -25539
$$ packed form
16856a567J607N805n543k3307M063M497P385m861j8740N993J7273J3630m665j3030
16842a1460r278l54O12O912R241n067L354N076k0419m269N525J1278l915j0161
16828b2925J17R694P648j5085j3417K877J878P49J0137M740j1570m530r244l896
16814d2827R26j9100p043J2636k703L93J8042L8333R554k1041k2730j1229L180
16801d3609J1653J1793J287l654n526o176J0887J5711J2105n756o802J5392l737
16788C568k7025M023K3900J1784j8589o929N022k2041J641J5034K337j2239L44
16775a9170P298l750r948J3096l911o856Q903j9743j7441J3554K6696K9214l715
16762A4227j4489j6599Q294O193N608L592K25O203j3883q780j0537O918j2511
$$ plain form
16749 -25539 -23052 -1292 16177 2057 -16679 -31316 -24209 -19929 -10496 11064 5278 -19073 -35232
16736 -35232 -42775 -24227 -21987 -9864 -2693 -1716 -1797 -2850 -7331 -1452 -5541 -4385 -14849 -26124
16722 -26124 -21359 -30093 -14775 -18541 -2083 11784 4377 8096 8651 -6958 -25955 -48788 -51635
16709 -51635 -43086 -32296 -12076 -22632 -44014 -46867 -44910 -41935 -34588 -30082 -31392 -14655 -18166
16696 -18166 -17677 -10796 -5354 -5477 -1602 -7256 -15258 -25682 -24574 -30016 -27214 -20511 -14866 -1192
16682 -1192 -17728 -33442 -41677 -30823 -24686 -19194 -4278 9584 17950 22773 21672 20072 29012
16669 29012 21831 -4786 -15696 -20259 -27100 -27100 -10543 -10260 -17292 -26420 -20259 -24576 -31489 -29807 -11389
16654 -11389 -3536 -5908 -21476 -22342 -13180 -10305 -26875 -19849 -4013 -891 -5331 -15872 -9406 -2058
$$ packed form
16749b5539K487K1760J7469j4120j8736j4637P107M280R433K1560n786k4351j6159
16736c5232p543J8548K240J2123P171R77q1j053m481N879m089J156j0464j1275
16722b6124M765q734J5318l766J6458J3867p407L719N55j5609j8997k2833k847
16709e1635Q549J0790K0220j0556k1382k853J957K975P347M506j310J6737l511
16696a8166M89O881N442j23L875n654q002j0424J108n442K802O703N645J3674
16682a192j6536j5714q235J0854O137N492J4916J3862Q366M823j101j600Q940
16669B9012p181k6617j0910m563o841%J6557K83p032r128O161m317o913J682J8418
16654a1389P853k372j5568q66R162K875j6570P026J5836L122m440j0541O466P348
$$ plain form
16640 -2058 -14030 -28875 -26648 -19357 -3056 -15006 -12476 10911 13585 5274 -15674 -20689 -22876
16627 -22876 -14289 -25068 -26557 -22597 -8565 -3308 -15726 -32366 -42237 -21808 -12642 -31237 -21604
16614 -21604 -20276 -5479 -19916 -5666 9720 1149 834 -3197 -25362 -35567 -26507 -22415 -23836
16601 -23836 -39748 -43454 -25110 -8283 -10400 17467 16567 -42 -21764 -31678 -40921 -51512 -48174
16588 -48174 -28134 -25945 -14307 7087 -455 -8352 -26786 -33930 -39313 -37667 -29529 -11096 -13714
16575 -13714 -25391 -4219 -504 -27466 -32678 -32500 -45537 -44155 -23354 -6753 -6562 -20702 -1122
16562 -1122 10022 -2061 -11618 5790 -5330 -11313 -31825 -28883 -19917 -14146 -23630 -19500 -25674
16549 -25674 -15494 -28303 -37976 -33889 -25765 -33893 -43229 -38878 -38792 -22524 -22139 -25511 -16786 -12300
$$ packed form
16640b058j1972j4845K227P291J6301j1950K530K3387K674q311k0948n015k187
16627b2876Q587j0779j489L960J4032N257j2418j6640r871K0429R166j8595R633
16614b1604J328J4797j4437J4250J5386q571l15m031k2165j0205R060M092j421
16601b3836j5912l706J8344J6827k117K7867r00j6609k1722r914r243j0591L338
16588d8174K0040K189J1638K1394p542p897j8434p144n383J646Q138J8433k618
16575a3714j1677K1172L715k6962n212J78j3037J382K0801J6601J91j4140J9580
16562a122J1144j2083r557J7408j1120n983k0512K942Q966N771r484M130o174
16549b5674J0180j2809r673M087Q124q128r336M351Q6J6268L85l372Q725M486
$$ plain form
16535 -12300 -16022 -28406 -5995 5581 -21010 -36071 -21167 -9722 -8817 -9258 -7082 -11611 -10140
16522 -10140 -21732 -17834 -13801 -9631 -11981 -30342 -26760 -14473 -4574 -8189 -16713 -16173 -15139 -12509
16508 -12509 -6417 -2088 -10117 -5414 23941 15121 16837 18156 3092 -9780 -426 -8889 1515
16495 1515 -7798 -14030 -10936 -17352 -15734 -20668 -8521 -16915 -35198 -37637 -45330 -40470 -26662 -29500
16481 -29500 -41259 -38703 -47846 -38657 -392 12266 -418 -35842 -34342 -11889 -1127 -6963 9376
16468 9376 4628 -1864 -4682 -11747 -1214 15049 16309 12041 9153 858 10456 3700 16883 22209
16454 22209 17366 589 2675 6856 -1104 -13528 -18676 -27771 -10532 12961 835 -9956 -15943
16441 -15943 -10909 3164 -2120 514 6969 12452 18628 4176 2729 18716 37505 33132 15344
$$ packed form
16535a2300l722j2384K2411J1576k6591j5061J4904J1445R05m41K176m529J471
16522a0140j1592L898M033M170k350j8361L582J2287R899l615q524N40J034K630
16508a2509O092M329q029M703K9355q820J716J319j5064j2872R354q463J0404
16495A515r313o232L094o416J618m934J2147q394j8283k439p693M860J3808k838
16481b9500j1759K556r143R189L8265J2658j2684l5424J500K2453J0762n836J6339
16468I376m748o492k818p065J0533J6263J260m268k888q295R598o756J3183N326
16454B2209m843j6777K086M181p960j2424n148r095J7239K3493j2126j0791n987
16441a5943N034J4073n284K634O455N483O176j4452j447J5987J8789m373j7788
$$ plain form
16428 15344 26173 14839 10624 15118 8855 10090 1928 13265 16327 8129 7867 18793 12933 -15956
16414 -15956 -24731 -15522 -12716 -9502 -4242 -12 13161 -1918 -27698 -40260 -27475 -26625 -41691
16401 -41691 -38187 -24112 -16778 -11618 -18827 -20063 -13990 2207 4736 -8717 -20464 -20153 -23095 -27099
16387 -27099 -26217 -16867 -21514 -11045 -7098 5819 -6898 -2814 5260 8199 -473 -5117 -6027 4808
16373 4808 -8606 -29351 -18134 -9668 -5045 4430 4611 5057 22395 32151 3167 -11050 -16269 -12862
16359 -12862 -17276 1918 9312 508 5735 9523 1947 -12024 -11646 -1853 6557 2941 -1024 -10992
16345 -10992 -12409 -12440 -33654 -33149 -16134 -17603 -29670 -21414 -20266 -35300 -34432 -20532 -13404 -26996
16331 -26996 -20147 -24869 -58128 -49145 -36012 -40149 -48805 -29300 -15005 -6349 -9301 -8080 -9927
$$ packed form
16428A5344J0829j1334m215M494o263J235q162J1337L062q198k62J0926n860k8889
16414a5956q775R209K806L214N260M230J3173j5079k5780j2562J2785Q50j5066
16401d1691L504J4075P334N160p209j236O073J6197K529j3453j1747L11k942m004
16387b7099Q82R350m647J0469L947J2917j2717M084Q074K939q672m644r10J0835
16373D808j3414k0745J1217Q466M623R475J81M46J7338R756k8984j4217n219L407
16359a2862m414J9194P394q804N227L788p576j3971L78R793Q410l616l965r968
16345a0992j417l1k1214N05J7015j469j2067Q256J148j5034Q68J3900P128j3592
16331b6996O849m722l3259Q983J3133m137q656J9505J4295Q656k952J221j847
$$ plain form
16318 -9927 -21519 -22807 -38891 -53408 -42958 -10611 -6131 4623 11369 2456 -6971 -13893 -22614
16305 -22614 -34575 -34381 -13707 16157 13228 -6916 -7392 -18265 -19186 -2022 6328 -1583 -8284 -7862
16291 -7862 4385 7414 1600 5120 -4994 -8565 -21537 -25430 -6867 -2559 -13926 -35550 -38222
16278 -38222 -38887 -31994 -25983 -46487 -27529 -16809 -16763 -23121 -11309 5311 8522 6199 -9696 -8450
16264 -8450 -7634 -24230 -16163 -5725 -8835 -13161 -13754 -11270 -15869 -16094 -4176 -13022 -18682 -29934
16250 -29934 -27377 -16425 -15771 -2682 -9491 -9183 -5789 4454 -17509 -22450 -24568 -35510 -45781
16237 -45781 -31673 -38314 -42830 -38029 -33072 -33305 -22181 -35417 -43256 -54720 -45217 -23699 -18567
16224 -18567 -35711 -33987 -34821 -42120 -31232 -34829 -32697 -18876 -14714 -17101 -25227 -21101 -23750 -22857
$$ packed form
16318i927j1592j288j6084j4517J0450L2347M480J0754O746q913r427o922q721
16305b2614j1961J94K0674K9864k929k0144m76j0873r21J7164Q350p911o701M22
16291g862J2247L029n814L520j0114l571j2972l893J8563M308j1367k1624k672
16278c8222o65O893O011k0504J8958J0720M6o358J1812J6620L211k323j5895J246
16264h450Q16j6596Q067J0438l110m326n93K484m599k25J1918q846n660j1252
16250b9934K557J0952O54J3089o809L08L394J0243k1963m941k118j0942j0271
16237d5781J4108o641m516M801M957k33J1124j3236p839j1464R503K1518N132
16224a8567j7144J724q34p299J0888l597K132J3821M162k387q126M126k649Q93
$$ plain form
16210 -22857 -29567 -29208 -26008 -14416 -6677 3633 17197 10061 -2549 -5630 -27987 -43349 -31447
16197 -31447 -9274 16961 26130 15424 10993 -11878 -23494 -28347 -19404 -17593 -5298 29696 20532
16184 20532 -620 -18539 -8793 -13363 -19177 -18897 -23067 -7158 -9551 -15761 -10590 -17103 -21233 -24989
16170 -24989 -30792 -28681 -26320 -37190 -46661 -51536 -29212 -6861 5426 -1268 -30144 -58691 -53797
16157 -53797 -36127 -32906 -28215 -14926 -2581 549 -734 -5091 13013 -5177 -17621 -27022 -23029
16144 -23029 -918 -1170 -14532 -10530 -13740 4599 21592 18680 761 -12699 -16378 -16960 -9257
16131 -9257 -13501 -15632 -26514 -38221 -30507 -22538 -20931 -22650 -9044 -15235 -27922 -27950 -22924 -16863
16117 -16863 -14106 -21032 -16454 -6863 9348 32611 39051 17692 11761 13248 -1425 -18375 -11210
$$ packed form
16210b2857o710L59L200J1592P739J0310J3564p136j2610l081k2357j5362J1902
16197c1447K2173K6235R169j0706m431k2871j1616m853Q943J811J2295L4994r164
16184B0532k1152j7919R746m570n814K80m170J5909k393o210N171o513m130l756
16170b4989n803K111K361j0870r471m875K2324K2351J2287o694k8876k8547M894
16157e3797J7670L221M691J3289J2345L130j283m357J8104j8190j2444r401L993
16144b3029K2111k52j3362M002l210J8339J6993k912j7919j3460l679n82P703
16131i257m244k131j0882j1707P714P969J607j719J3606o191j2687k8N026O061
16117a6863K757o926M578R591J6211K3263O440k1359n931J487j4673j6950P165
$$ plain form
16104 -11210 -16291 -19911 -16681 -7718 -7448 953 -16767 -31763 -17569 -13999 -8909 283 -7007 -3541
16090 -3541 -2083 12970 16469 12038 -588 -9465 -20448 -43132 -39674 -32873 -30813 -33976 -38719 -20398
16076 -20398 -24734 -26858 -25253 -25927 -18810 -10674 -6579 -5808 -14087 -15127 -22093 -34676 -66551 -76712
16062 -76712 -64210 -56456 -47161 -38578 -19779 -11860 -27646 -8950 8456 12594 5418 11997 2556
16049 2556 -11133 -22264 -21350 -10963 -14828 -31498 -41775 -25214 -15750 -31531 -37554 -39898 -37434
16036 -37434 -27808 -10686 3384 -11305 -28261 -26487 -26605 -23430 -2311 5875 -6441 -40273 -41077
16023 -41077 -34091 -47262 -42368 -19022 -19545 -17040 -4994 -8915 -27348 -36654 -43261 -44970 -41921 -48358
16009 -48358 -40759 -22737 -7184 -4213 -7640 -5451 8385 -9082 -36403 -67772 -57343 -45000
$$ packed form
16104a1210n081l620L230Q963K70Q401j7720j4996J4194L570N090R192p290L466
16090c541J458J5053L499m431j2626q877j0983k2684L458O801K060l163m743J8321
16076b0398m336k124J605o74P117Q136M095P71q279j040o966j2583l1875j0161
16062g6712J2502P754R295Q583J8799P919j5786J8696J7406M138p176O579r441
16049B556j3689j1131R14J0387l865j6670j0277J6561R464j5781o023k344K464
16036c7434R626J7122J4070j4689j6956J774j18L175K1119Q186j2316l3832q04
16023d1077O986j3171M894K3346n23K505J2046l921j8433r306o607j709L049o437
16009d8358P599J8022J5553K971l427K189J3836j7467k7321l1369J0429J2343
$$ plain form
15997 -45000 -51610 -32829 -20394 -25570 -29436 -14952 -8882 -19955 -24817 -21290 -28993 -29255 -4551
15984 -4551 10439 6437 -7139 -15436 -17861 -22436 -14471 -35197 -53348 -41614 -31810 -34685 -19855
15971 -19855 -18439 -16755 -10600 -8043 -27760 -34922 -40569 -42864 -40032 -36287 -27472 -9972 6560 12621
15957 12621 10210 66 -8316 -3546 9803 17041 1040 9772 28938 26636 8830 -11353 -16575
15944 -16575 -16556 -12061 -19177 -29270 -16604 -16119 -11327 10743 6216 4744 12448 17422 23321 20605
15930 20605 26322 31765 18595 6078 -10398 -10467 -9327 -9949 33760 31465 7401 15699 16087 11931
15916 11931 -6359 -16206 -8474 -980 -19052 -24093 -20516 -25925 -27547 -23438 -20946 -13282 -16269 -20613
15902 -20613 -19498 -10608 -100 7222 10687 13000 -4718 -6209 -13208 2510 11063 -11914 -19986
$$ packed form
15997d5000o610J8781J2435n176l866J4484O070j1073m862L527p703k62K4704
15984d551J4990m002j3576q297k425m575P965k0726j8151J1734R804k875J4830
15971a9855J416J684O155K557j9717p162n647k295K832L745Q815J7500J6532O061
15957A2621k411j0144q382M770J3349P238j6001Q732J9166k302j7806k0183n222
15944a6575J9M495p116j0093J2666M85M792K2070m527j472P704M974N899k716
15930B0605N717N443j3170j2517j6476o9J140o22M3709k295k4064Q298L88m156
15916A1931j8290r847P732P494j8072n041L577n409j622M109K492P664k987m344
15902b0613J115Q890J0508P322L465K313j7718j491o999J5718Q553k2977q072
$$ plain form
15889 -19986 -20488 2148 13726 -749 -6803 -1313 -3617 -26748 -17338 -6486 -18335 -32763 -19600
15876 -19600 -23892 -40103 -20017 -17887 -27798 -16378 1024 -2771 -13829 -2604 2166 789 -317
15863 -317 5482 405 11280 10981 4954 -9417 -16155 -17110 -14059 11022 30125 43715 24958 -4407
15849 -4407 -11271 -6435 -17764 -22459 -25637 -35601 -39570 -32367 -21862 -10371 7967 8582 16374 -1716
15835 -1716 -6590 -18201 -17378 -10800 8 -3091 -7571 -6470 -13257 -16512 -21345 -10673 -13115 -22110
15821 -22110 -22605 -9782 -6788 -28171 -28559 -32476 -32155 -32262 -32555 -33025 -33537 -33333 -22916 -15348 -10531 -28193
15805 -28193 -21707 -11880 -14010 -9858 4772 8186 -5273 -6745 -9225 -5938 -15841 -26691 -37861
15792 -37861 -27840 -14297 -14829 -18995 -19571 -14853 -6290 -10421 -8510 -15178 -18474 -10779 -1470 7601
$$ packed form
15889a9986n02K2636J1578j4475o054N490k304k3131R410J0852j1849j4428J3163
15876a9600m292j6211K0086K130r911J1420J7402l795j1058J1225M770j377j106
15863c17N799n077J0875k99o027j4371o738r55L051K5081J9103J3590j8757k9365
15849d407o864M836j1329m695l178r964l969P203J0505J1491J8338O15P792j8090
15835a716m874j1611Q23O578J0808l099m480J101o787l255m833J0672k442q995
15821b2110m95J2823K994k1383l88l917L21j07k93m70n12K04J0417P568M817j7662
15805b8193O486R827k130M152J4630L414j3459j472k480L287r903j0850j1170
15792c7861J0021J3543n32m166n76M718Q563m131J911o668l296P695R309R071
$$ plain form
15778 7601 22507 31569 18677 20654 21553 17088 33949 32698 13732 -6763 4779 15017 38257
15765 38257 64766 72243 62734 44389 50575 56968 43052 25072 11449 -8326 13230 32433
15753 32433 21595 2087 -261 3269 3811 1837 -6324 4898 20221 9670 -7431 -23881 -21337
15740 -21337 -18239 -17315 -26427 -17133 -20716 -26409 -11110 -2668 6110 10448 10423 -28727 -25623 -17824 -6012
15725 -6012 -461 8174 14110 15560 34199 32078 28318 30371 18640 33709 12755 -13879 963
15712 963 -1946 2201 3610 5119 -3179 -14895 -4941 1931 8003 16813 28963 32848 19779 14376
15698 14376 34766 34115 4646 -12477 -19815 -20174 -14738 -5806 13497 5637 15616 26416 13170
15685 13170 12232 30546 32058 25998 14850 11696 9253 11386 5996 -2144 -16990 -11950 11147 13975
$$ packed form
15778G601J4906R062j2892J977Q99m465J6861j251j8966k0495J1542J0238K3240
15765C8257K6509P477r509j8345O186O393j3916j7980j3623j9775K1556J9203
15753C2433j0838j9508k348L530N42j974q161J1222J5323j0551j7101j6450K544
15740b1337L098R24r112R294l583n693J5299Q442Q778M338k5l9150L104P799J1812
15725f012N551Q635N936J450J8639k121l760K053j1731J5069k0954k6634J4842
15712I63k909M147J409J509q298j1716R954O872O072Q810J2150L885j3069n403
15698A4376K0390o51k9469j7123p338l59N436Q932J9303p860R979J0800j3246
15685A3170r38J8314J512o060j1148l154k443K133n390q140j4846N040K3097K828
$$ plain form
15671 13975 12691 2986 -33865 -32923 -20699 -17829 -14926 -15957 9015 21715 23158 27729 21291 16382
15657 16382 16931 13195 10315 15486 20348 14789 26037 33896 33299 11602 3339 2246 6375 -15406
15643 -15406 -18938 -10852 -18753 -26581 -24178 -8464 -19025 -21979 -18334 -22017 1217 -5184 -22637
15630 -22637 -20884 -7893 -9762 -7050 -8195 -25097 -29925 -10784 3225 4534 -14347 -8846 11657
15617 11657 7344 1771 5233 682 -11276 -19583 -5494 -509 -8001 -9840 -10937 -21124 -28069 -32630
15603 -32630 -23392 -27618 -42335 -33559 -8629 -21454 -26315 -29371 -19457 -14191 808 -2706 -7551
15590 -7551 -10528 -14973 -19393 -23051 -10909 -3164 -10399 -10180 -15564 -11625 -4217 -743 -2306 -12408
15576 -12408 -9791 -5683 -2167 -14656 -6860 -32602 -41145 -40417 -37724 -14488 -8168 -28701 -48813
$$ packed form
15671A3975j284r705l6851R42J2224K870K903j031K4972J2700J443M571o438m909
15657A6382N49l736k880N171M862n559J1248P859n97k1697q263j093M129k1781
15643a5406l532Q086p901p828K403J5714j0561k954L645l683K3234o401j7453
15630b2637J753J2991j869K712j145j6902m828J9141J4009J309j8881N501K0503
15617A1657m313n573L462m551j1958q307J4089M985p492j839j097j0187o945m561
15603c2630R238m226j4717Q776K4930j2825m861l056R914N266J4999l514m845
15590g551k977m445m420l658J2142P745p235K19n384L939P408L474j563j0102
15576a2408K617M108L516j2489P796k5742q543P28K693K3236O320k0533k0112
$$ plain form
15563 -48813 -41071 -42697 -46170 -48926 -44493 -29132 -18174 -8180 2729 4595 1107 -22402 -37426
15550 -37426 -42264 -38067 -27149 -12879 -4855 -14057 -13909 -5105 -8678 2190 -1795 -9077 -11569 -14645
15536 -14645 -22339 -11632 9224 19041 11030 1836 9664 18283 28654 5222 -13730 -12733 -5466
15523 -5466 103 5122 7684 4043 -2601 -3563 -12920 6785 8675 11214 -4298 -13127 -4441 904
15509 904 -13090 -8104 29245 39986 40718 18510 6471 21058 40413 43017 36398 20312 4605
15496 4605 -138 -6 -3840 -13890 -14774 -29140 -40062 -30459 -31159 -27589 -17177 -23000 -23511 -14105 442
15481 442 2777 -2690 2347 15190 12776 8494 8410 9373 -5698 -16100 -18304 -12195 -27040 -32448 -18645
15466 -18645 -40263 -53539 -59412 -37588 -24693 -27272 -13317 -29371 -37484 -20297 4255 17838
$$ packed form
15563d8813P742j626l473k756M433J5361J0958R994J0909J866l488k3509j5024
15550c7426m838M197J0918J4270Q024r202J48Q804l573J0868l985p282k492l076
15536a4645p694J0707K0856R817q011r194P828Q619J0371k3432j8952R97P267
15523e466N569N019K562l641o644r62r357J9705J890K539j5512q829Q686N345
15509I04j3994M986L7349J0741P32k2208j2039J4587J9355K604o619j6086j5707
15496D605m743J32l834j0050q84j4366j0922R603p00L570J0412n823n11R406J4547
15481D42K335n467N037J2843k414m282q4R63j5071j0402k204O109j4845n408J3803
15466a8645k1618j3276n873K1824J2895k579J3955j6054q113J7187K4552J3583
$$ plain form
15454 17838 16385 -420 -7088 -11510 -2920 -13029 -6560 16793 14441 999 -12703 -11078 542
15441 542 8526 3499 -14959 -37574 -51733 -52628 -27306 -32576 -54843 -44218 -31965 -20627 -25233
15428 -25233 -18479 -14340 -13838 -23891 -33626 -27258 -19409 -9752 -10542 -7028 -13434 -3195 6484 15991
15414 15991 2881 -12122 -16834 -30971 -28339 -23079 -26467 -8922 1161 -26248 -39004 -27984
15402 -27984 -9379 -4001 -14683 -8378 -12677 -20098 -32304 -25773 -17724 -3864 -8383 -4936 6268
15389 6268 -146 -16691 -20845 -13528 -10038 -7701 58 6638 -18016 -12824 1737 -2868 1070 11732
15375 11732 13560 3256 -9670 5549 27374 29048 1609 -11457 3747 -7798 -24208 -22247
15363 -22247 -10352 1524 9675 17011 16220 1156 -7246 -4864 2846 3586 -5347 3530 -3367 -4160
$$ packed form
15454A7838j453j6805o668m422Q590j0109O469K3353k352j3442j3702J625J1620
15441E42P984n027j8458k2615j4159q95K5322n270k2267J0625J2253J1338m606
15428b5233O754M139N02j0053r735O368P849R657p90L514o406J0239R679R507
15414A5991j3110j5003m712j4137K632N260l388J7545J0083k7409j2756J1020
15402b7984J8605N378j0682O305m299p421j2206O531Q049J3860m519L447J1204
15389F268o414j6545m154P317L490K337P759O580k4654N192J4561m605L938J0662
15375A1732J828j0304j2926J5219K1825J674k7439j3066J5204j1545j6410J961
15363b2247J1895J1876Q151P336p91j5064q402K382P710P40q933Q877o897p93
$$ plain form
15349 -4160 -1040 6155 -6791 -14079 -17092 -35598 -26448 -12305 -22054 -36344 -28547 -14633 -13283
15336 -13283 -19115 -18395 -16430 -25792 -26747 -30027 -24373 -27509 -19573 -7348 -3000 -8687 -2047 9103
15322 9103 19925 9995 7802 -9787 -7112 -21423 -26864 -26621 -21604 -37968 -48776 -28754 -25020
15309 -25020 -25782 -21365 -18000 4807 15762 4369 -3504 -9257 -11978 -18390 -19815 -24954 -28878 -33976
15295 -33976 -31256 -37934 -26402 -5629 3921 5397 3143 -743 16526 14922 7729 16974 23839 948
15281 948 7134 20360 125 -1898 1148 -19982 -28533 -15570 -10710 -582 3654 -12996 -8273
15268 -8273 22647 22993 18968 11428 -1731 6305 3271 -1873 12804 21108 25894 18753 4195 -7727
15254 -7727 -1116 -10150 1343 -2235 -7285 -1842 1885 -8701 -21156 -10570 -5728 -13590 -17080 -29849
$$ packed form
15349d160L120P195j2946p288l013j8506R150J4143r749j4290P797J3914J350
15336a3283n832P20J965r362r55l280N654l136P936J2225M348n687O640J1150
15322I103J0822r930k193j7589K675j4311n441K43N017j6364j0808K0022L734
15309b5020p62M417L365K2807J0955j1393p873n753k721o412j425n139l924n098
15295c3976K720o678J1532K0773R550J476k254l886J7269j604p193R245O865k2891
15281I48O186J3226k0235k023L046k1130q551J2963M860J0128M236j6650M723
15268h273L0920L46m025p540j3159Q036l034n144J4677Q304M786p141j4558j1922
15254g727O611r034J1493l578n050N443L727j0586j2455J0586M842p862l490j2769
$$ plain form
15240 -29849 -15354 810 10179 7234 4718 -4998 -577 6354 -11487 -32267 -50160 -57885 -45082
15227 -45082 -34723 -34801 -38090 -27772 -24370 -7077 -869 -14050 -17233 -5401 1025 3751 7316 3743
15213 3743 -10550 -1801 7851 4547 -1258 -16489 -9049 6942 8985 -1176 -4645 -2050 3358 2330
15199 2330 1897 1535 -1567 15119 19465 14738 10277 16592 21252 20036 19391 29907 26613 19590 1658
15184 1658 -9466 -10188 -936 -715 6730 9429 1642 1802 -11740 -24557 -18137 -6126 -19748 -38758
15170 -38758 -22273 -23251 -42318 -25487 -19431 -12639 4688 -6211 2002 -4842 -16080 -9737 4431
15157 4431 12503 17166 -1573 -14717 12322 26791 9259 -11027 6873 15195 11639 16625 30385
15144 30385 36182 54180 51941 42462 46051 42412 67459 85854 110828 112878 119721 129256 139666
$$ packed form
15240b9849J4495J6164R369k945k516r716M421O931j7841k0780j7893p725J2803
15227d5082J0359p8l289J0318L402J7293O208j3181l183J1832O426K726L565l573
15213C743j4293Q749R652l304n805j5231P440J5991K043j0161l469K595N408j028
15199B330m33l62l102J6686M346m727m461O315M660j216o45J0516l294p023j7932
15184A658j1124p22R252K21P445K699p787J60j3542j2817O420J2011j3622j9010
15170c8758J6485r78j9067J6831O056O792J7327j0899Q213o844j1238O343J4168
15157D431Q072M663j8739j3144K7039J4469j7532k0286J7900Q322l556M986J3760
15144C0385N797J7998k239r479L589l639K5047J8395K4974K050O843R535J0410
$$ plain form
15131 139666 157911 170482 162203 152358 145694 143691 140495 145656 153438 157809 155151 117222 99469
15118 99469 99976 87095 60446 37113 34651 30027 31157 29182 33305 32274 41691 52713 36198
15105 36198 31142 32716 29463 13344 1285 -14633 -1679 3354 22447 24127 26035 41514 38485
15092 38485 41225 34385 16668 15458 35615 51688 50250 57698 34714 29239 36922 42861 40440
15079 40440 11825 1732 1892 15161 22105 25285 32988 15323 -8363 -10937 -2787 5575 1423
15066 1423 6043 7083 5073 -715 -5892 -4909 394 10160 24418 34178 30229 -1362 -24483 -19376
15052 -19376 -30460 -25980 -19510 -11581 4372 9167 24378 32035 31139 45409 47477 27561 5596
15039 5596 2433 2790 10107 4455 7836 23371 12346 3650 23733 43466 53817 79787 81190
$$ packed form
15131A39666J8245J2571q279r845o664k003l196N161P782M371k658l7929j7753
15118I9469N07j2881k6649k3333k462m624J130j975M123j031R417J1022j6515
15105C6198n056J574l253j6119j2059j5918J2954N033J9093J680J908J5479l029
15092C8485K740o840j7717j210K0157J6073j438P448k2984n475P683N939k421
15079D0440k8615j0093J60J3269O944L180P703j7665k3686k574Q150Q362m152
15066A423M620J040k010n788n177R83N303R766J4258R760l949l1591k3121N107
15052a9376j1084M480O470P929J5953M795J5211P657q96J4270K068j9916k1965
15039E596l163L57P317n652L381J5535j1025q696K0083J9733J0351K5970J403
$$ plain form
15026 81190 61931 39019 30515 40651 43572 53472 62151 60865 36837 12368 -7537 -25430 -21188
15013 -21188 -3629 18562 44473 41557 32188 26651 15786 3233 7679 -1625 -2108 922 1037 -10047
14999 -10047 -26418 -25310 -8547 -1550 530 7326 10722 -6412 -653 8615 26056 30865 26454
14986 26454 10080 3593 8036 3218 4802 4118 10674 15108 11415 9364 12013 15222 4499 -9849
14972 -9849 -11735 13986 39478 32576 26571 28967 14118 -4341 7730 25776 42498 38367 10755
14959 10755 -17391 1051 19877 27601 26029 41107 46182 51916 58744 42327 23748 -2618 461
14946 461 21327 25749 26828 35252 46158 36572 22778 39721 38924 35530 49153 27963 387
14933 387 -17171 -23507 -16471 -9312 -12234 -14783 -15713 -27139 -17542 -4914 -8681 -1667 -8048 -30799
$$ packed form
15026H1190j9259k2912q504J0136K921R900Q679j286k4028k4469j9905j7893M242
15013b1188J7559K2191K5911k916r369n537j0865j2553M446r304m83L030J15j1084
14999a0047j6371J108J6763O997K080O796L396j7134N759R268J7441M809m411
14986B6454j6374o487M443m818J584o84O556M434l693k051K649L209j0723j4348
14972i849j886K5721K5492o902o005K396j4849j8459J2071J8046J6722m131k7612
14959A0755k8146J8442J8826P724j572J5078N075N734O828j6417j8579k6366L079
14946D61K0866M422J079Q424J0906r586j3794J6943p97l394J3623k1190k7576
14933C87j7558o336P036P159k922k549r30j1426R597J2628l767P014o381k2751
$$ plain form
14919 -30799 -13021 -232 11609 29358 23462 22573 23048 6857 4119 -4125 -26648 -15074 1210
14906 1210 -3031 -6935 -18232 -20697 -36592 -27990 -16479 -1432 4449 -21035 -13907 -8214 -5377
14893 -5377 -2303 -10697 54 22784 31010 31310 16239 14409 15798 19866 29852 25483 30521 42308
14879 42308 29062 14540 10261 858 -11500 1002 9707 3183 -9987 -31147 -39908 -46552 -46066
14866 -46066 -41107 -22140 -15832 -17326 -16656 -9410 -19761 -4941 -740 12354 12259 12435 25279 5511
14852 5511 3247 11104 1558 -5318 -14412 -18172 -7602 -762 -7296 -7115 -17100 -16513 -7371 1942 1799
14837 1799 -15882 -19058 3735 18974 -2970 -23663 -11612 18504 35219 29288 42593 40374
14825 40374 26544 31411 24564 15305 7287 10090 15152 13970 3653 -7895 -7802 11686 18728 27019
$$ packed form
14919c0799J7778J2789J1841J7749n896q89M75j6191k738q244k2523J1574J6284
14906A210m241l904j1297k465j5895Q602J1511J5047N881k5484P128N693K837
14893e377L074q394J0751K2730Q226L00j5071j830J389M068R986m369N038J1787
14879D2308j3246j4522m279r403j2358J2502Q705o524j3170k1160q761o644M86
14866d6066M959J8967O308j494O70P246j0351J4820M201J3094r5J76J2844j9768
14852E511k264P857r546o876r094l760J0570O840o534J81r985N87R142R313j43
14837A799j7681l176K2793J5239k1944k0693J2051L0116J6715n931J3305k219
14825D0374j3830M867o847r259q018K803N062j182j0317j1548R3J9488P042Q291
$$ plain form
14811 27019 19840 6123 406 -8950 5081 5393 -1392 -1166 -15667 -15051 -16208 -23021 -18756 -160
14797 -160 498 -6524 -7177 3828 15234 15283 -40 -14833 -14972 -16391 -9479 1915 2179 -7367 1274
14782 1274 1649 8481 -12481 -20476 -20728 2009 15598 8511 10540 20005 19391 11666 1956 -10071
14768 -10071 -2552 -3353 -24954 -21002 -12343 -2424 10625 12957 8981 14482 5543 4965 -685 -22730
14754 -22730 -17357 -16781 -21433 -1230 8113 2199 19820 19473 20434 17537 19335 26189 16010 7186
14740 7186 6849 5109 -9389 -31995 -14728 9793 33431 19391 1278 -3214 17526 30559 38112
14727 38112 50387 69560 65972 52436 60389 68119 68257 61977 69035 82718 94024 105429 124529
14714 124529 123356 139664 151072 136836 118214 103482 106561 112209 110360 124798 115636 110924 115276
$$ packed form
14811B7019p179j3717n717r356J4031L12o785K26j4501O16j157o813M265J8596
14797a60O58p022o53J1005J1406M9j5323j4793j39j419O912J1394K64r546Q641
14782A274L75O832k0962p995k52K2737J3589p087K029R465o14p725r710j2027
14768a0071P519q01k1601L952Q659R919J3049K332l976N501q939n78n650k2045
14754b2730N373N76m652K0203R343n914J7621l47R61k897J798O854j0179q824
14740G186l37j740j4498k2606J7267K4521K3638j4040j8113m492K0740J3033P553
14727C8112J2275J9173l588j3536P953P730J38o280P058J3683J1306J1405J9100
14714A24529j173J6308J1408j4236j8622j4732L079N648j849J4438r162m712M352
$$ plain form
14701 115276 93623 70886 62328 43185 28565 25130 14361 30402 35264 25697 30378 28183 33830
14688 33830 4350 -8495 5918 26744 20207 8600 15670 29733 33993 27738 40682 37263 29090
14675 29090 23026 537 761 25188 22210 4328 5412 3066 12141 23044 33636 28290 13505
14662 13505 22259 19608 7209 11861 22797 19264 -2022 -13458 -9088 -19129 -23374 -15570 -23664
14649 -23664 -44283 -40732 -42623 -28715 -10757 -23759 -26792 -35970 -40224 -16035 -13849 -4393 -5591
14636 -5591 -15424 -22075 -24170 -14242 -16446 -7546 1980 4152 -14568 -12549 -9332 -14041 -8728 -4381
14622 -4381 -13894 -11407 -18345 -25072 -22047 -6635 13390 3373 -18815 -22817 -19180 -9282 -10486 743
14608 743 8972 -9304 -18589 -26831 -14137 -15095 -24027 -37191 -37876 -24242 -28553 -37144 -33033 -19091
$$ packed form
14701A15276k1653k2737q558j9143j4620l435j0769J6041M862r567M681k195N647
14688C3830k9480j2845J4413K0826o537j1607P070J4063M260o255J2944l419q173
14675B9090o064k2489K24K4427k978j7882J084k346R075J0903J0592n346j4785
14662A3505Q754k651j2399M652J0936l533k1286j1436M370j0041m245P804q094
14649b3664k0619L551j891J3908J7958j3002l033r178m254K4189K186R456j198
14636e591r833o651k095R928k204Q900R526K172j8720K019L217m709N313M347
14622d381r513K487o938o727L025J5412K0025j0017k2188m002L637R898j204J1229
14608G43Q229j8276r285q242J2694r58q932j3164o85J3634m311q591M111J3942
$$ plain form
14594 -19091 5477 10657 17616 23268 5587 15440 15547 3454 13142 11093 7034 15949 13938 9781
14580 9781 -20930 -24726 -11193 -4815 -10629 -18094 -10062 -16482 -17038 -1983 -3602 -10879 -15744 -19878
14566 -19878 -34598 -30975 -21318 -27626 -36612 -23616 4869 465 6971 -5024 1708 -2345 -24190
14553 -24190 -31192 -10954 1398 2107 17120 18483 13940 9335 19889 -8045 -15181 -17125 -21990
14540 -21990 -26350 -26318 -14703 7339 18548 19414 9179 18250 13799 2334 3892 232 -8051 -17991
14526 -17991 3961 18415 9764 -7187 -16587 -6699 -4457 -19196 -11817 -10737 -27168 -18361 4853
14513 4853 -2344 6550 19626 12384 9333 2308 3915 -4591 -25660 -35208 -24541 -19236 -16751 -17491
14499 -17491 -24253 -720 5794 -10321 -15268 -6995 -254 7877 -14954 -24473 -24408 -25283 -14145 -3247
$$ packed form
14594a9091K4568N180O959N652j7681R853J07j2093R688k049m059Q915k011m157
14580I781l0711l796J3533O378n814p465Q032o420n56J5055j619p277m865m134
14566a9878j4720L623R657o308q986J2996K8485m404O506j1995O732m053k1845
14553b4190p002K0238J2352P09J5013J363m543m605J0554k7934p136j944m865
14540b1990m360L2J1615K2042J1209Q66j0235R071m451j1465J558l660q283r940
14526a7991K1952J4454q651j6951r400R888K242j4739P379J080j6431Q807K3214
14513D853p197Q894J3076p242l051p025J607q506k1069r548J0667N305K485p40
14499a7491o762K3533O514j6115m947Q273O741Q131k2831r519O5q75J1138J0898
$$ plain form
14485 -3247 -14323 5788 5901 -12430 -21788 -31922 -29406 -11814 -5738 -9433 -26850 -29593 -16124
14472 -16124 3077 11825 14665 20724 25999 7020 867 -2260 6877 8552 15835 34281 21587
14459 21587 -6530 -14285 -4704 13213 19765 9733 -804 7672 18172 16890 16200 14247 8252
14446 8252 5247 3772 -5711 14876 27171 14403 7800 -507 -6078 3699 2365 10292 24558 20022
14432 20022 20495 19581 24757 44266 51969 41056 29620 38782 20167 -5353 8266 13825 16077
14419 16077 19885 20511 28845 31901 27087 20040 13515 22161 23469 2247 -1634 32288 52341 40768
14405 40768 41485 38162 41013 46192 63418 73535 73717 65191 53438 52325 66092 76614 86819
14392 86819 82684 81761 73329 80900 81176 77475 76225 60096 50184 58543 64942 55726 52058 63188
$$ packed form
14485c247j1076K0111J13j8331r358j0134K516J7592O076l695j7417k743J3469
14472a6124J9201Q748K840O059N275j8979o153l127R137J675P283J8446j2694
14459B1587k8117p755R581J7917O552j0032j0537Q476J0500j282o90j953n995
14446H252l005j475r483K0587J2295j2768o603q307n571R777j334P927J4266m536
14432B0022M73r14N176J9509P703j0913j1436R162j8615k5520J3619N559K252
14419A6077L808O26Q334L056m814p047o525Q646J308k1222l881L3922K0053j1573
14405D0768P17l323K851N179J7226J0117J82q526j1753j113J3767J0522J0205
14392H6819m135r23q432P571K76l701j250j6129r912Q359O399r216l668J1130
$$ plain form
14378 63188 78166 84444 95334 86091 66536 64135 71600 66304 47969 61025 60991 47107 52238
14365 52238 47083 47597 61090 82238 88410 91068 111087 105409 72535 52656 47345 51654 67009
14352 67009 70722 51786 61797 53270 48223 72035 76335 75154 67483 76831 74417 64977 79860
14339 79860 67319 48479 38014 47865 74828 62438 67615 74931 71047 53661 49951 72523 87564
14326 87564 68806 37316 6021 5468 29497 56326 47965 39980 24373 30590 28621 23390 10853
14313 10853 -5768 4125 24473 34531 52214 49894 37761 34130 40925 36409 27247 33384 50009
14300 50009 60335 44067 17158 3634 10438 16133 22323 -8136 -5249 5864 16097 15348 4301
14287 4301 8824 7532 23762 38305 40082 15187 9269 13268 16995 17984 5090 10930 17737 26868
$$ packed form
14378F3188J4978O278J0890r243j9555k401P465n296j8335J3056l4j3884N131
14365E2238n155N14J3493K1148O172K658K0019n678l2874j9879n311M309J5355
14352F7009L713j8936J0011q527n047K3812M300j181p671R348k414r440J4883
14339G9860j2541j8840j0465R851K6963j2390N177P316l884j7386l710K2572J5041
14326H7564j8758l1490l1295n53K4029K6829q361p985j5607O217j969n231j2537
14313A0853j6621R893K0348J0058J7683k320j2133l631O795m516r162O137J6625
14300E0009J0326j6268k6909j3524O804N695O190l0459K887J1113J0233p49j1047
14287D301M523j292J6230J4543J777k4895n918L999L727R89j2894N840O807R131
$$ plain form
14273 26868 28353 41852 55585 37745 13014 -507 -15899 -1860 7667 15578 12424 15816 -354
14260 -354 -7021 9773 21860 -3421 -10901 -1844 -8331 -10648 -10326 3098 1596 -854 -18615 -6794
14246 -6794 -9181 -12130 -1659 -1780 -13110 -14412 -20810 -21660 -9834 -6324 -12068 -21190 -20845 -21146 -19095
14231 -19095 -21113 -21980 -7312 8526 7725 -4452 -7422 3712 8109 -12241 -28200 2953 24642
14218 24642 12240 -13989 4374 11059 23115 25204 13036 -9279 10388 5848 3011 9497 8745
14205 8745 -11036 -7061 4651 14128 25769 34716 26948 18329 19840 24455 12503 5905 16579
14192 16579 10837 4238 -3797 -9756 -7532 -5113 4300 13216 13793 26206 19364 -5132 -15921 -26811
14178 -26811 -31298 -17528 -21566 -27259 -20746 -28614 -12987 3406 -11066 -15848 -24870 -18666 -30112
$$ packed form
14273B6868J485J3499J3733j7840k4731j3521j5392J4039R527P911l154L392j6170
14260c54o667J6794J2087k5281p480R057o487k317L22J3424j502k450j7761J1821
14246f794k387k949J0471j21j1330j302o398q50J1826L510n744r122L45l01K051
14231a9095k018q67J4668J5838q01j2177k970J1134M397k0350j5959L1153K1689
14218B4642j2402k6229J8363O685J2056K089j2168k2315J9667m540k837O486p52
14205H745j9781L975J1712R477J1641Q947p768q619J511M615j1952o598J0674
14192A6579n742o599q035n959K224K419R413Q916N77J2413o842k4496j0789j0890
14178b6811m487J3770m038n693O513p868J5627J6393j4472m782r022O204j1446
$$ plain form
14165 -30112 -20662 -1547 -9035 -22056 -11702 5782 15407 2933 17190 20732 -6779 -19044
14153 -19044 -18921 -5592 9652 32509 22926 10606 -5553 29149 49664 46007 43255 57476 44880
14140 44880 30873 34197 34345 9090 -2477 694 -5662 -20593 -11330 -19875 -31691 -37220 -30201
14127 -30201 -31896 -23867 -18286 -14557 -3706 -3114 -12524 -4716 6391 -4254 -13964 588 498 13088
14113 13088 14691 8713 6984 21086 21368 9888 -1894 -11140 -22424 -41525 -35295 -29443 -40665
14100 -40665 -48720 -37342 -13319 3672 617 -3324 -22051 -17457 -35821 -40888 -27681 -15992 5401
14087 5401 3669 3016 -16291 -10555 2263 14418 9676 -14465 -16790 -7236 -2621 -2965 20787 26191
14073 26191 19965 21152 15342 8567 4665 6863 13451 12454 3023 3212 -7027 6190 377 -12231
$$ packed form
14165c0112R450J9115p488j3021J0354J7484R625j2474J4257L542k7511j2265
14153a9044J23J3329J5244K2857r583j2320j6159L4702K0515l657k752J4221j2596
14140D4880j4007L324J48k5255j1567L171o356j4931R263q545j1816n529P019
14127c0201j695Q029N581L729J0851N92r410P808J1107j0645r710J4552r0J2590
14113A3088J603n978j729J4102K82j1480j1782r246j1284j9101O230N852j1222
14100d0665q055J1378K4023J6991l055l941j8727M594j8364n067J3207J1689K1393
14087E401j732o53j9307N736J2818J2155m742k4141k325R554M615l44K3752N404
14073B6191o226J187n810o775l902K198O588r97r431J89j0239J3217n813j2608
$$ plain form
14059 -12231 -17776 -21229 -15123 -11018 -7269 12887 17854 22639 23340 26102 22778 35054 58248 63215
14045 63215 60957 60858 76626 91394 82740 89285 94952 108416 121806 112789 92041 74661 57811
14032 57811 42880 16172 15292 21588 40613 59683 53914 40050 36314 24441 22639 19037 -944
14019 -944 -2031 11404 18801 20413 14355 17878 25166 33649 20016 18359 28885 31075 14810 14274
14005 14274 2772 3517 20642 18472 13915 24991 42732 32697 12866 15535 5478 -996 -1244
13992 -1244 11036 14326 5038 -2200 -486 -6592 -9887 4697 22162 29023 26476 25619 21099 25603
13978 25603 35153 50417 49890 32494 21952 43421 73936 86449 116635 156950 167060 176153
13966 176153 166562 140599 120277 117783 119230 104002 86016 62627 70311 76215 79120 68999 56151
$$ packed form
14059a2231n545l453O106M105L749K0156M967M785P01K762l324J2276K3194M967
14045F3215k258r9J5768J4768q654O545N667J3464J3390r017k0748j7380j6850
14032E7811j4931k6708q80O296J9025J9070n769j3864l736j1873j802l602j9981
14019i44j087J3435P397J612o058L523P288Q483j3633j657J0526K190j6265n36
14005A4274j1502P45J7125k170m557J1076J7741j0035j9831K669j0057o474k48
13992a244J2280L290r288p238J714o106l295J4584J7465O861k547q57m520M504
13978B5603R550J5264n27j7396j0542K1469L0515J2513L0186M0315J0110R093
13966A76153r591k5963k0322k494J447j5228j7986k3389P684N904K905j0121j2848
$$ plain form
13953 56151 31105 14138 11600 17742 27658 13454 4419 17088 14764 14440 17440 23824 20311 24009
13939 24009 33800 40331 43090 29577 18095 30898 36382 27980 33276 36081 36855 24195 20664 14897
13925 14897 6905 23723 26422 12850 -2258 5600 30419 27164 16491 8905 2381 -4219 -3296
13912 -3296 -3825 19855 39071 39223 31956 31415 35346 32054 31457 18714 17157 10846 -7375 -5437 1751
13897 1751 3704 8323 6719 -10115 -5624 16457 18191 12619 -4268 -7645 -28508 -37336 -15800
13884 -15800 -708 -19196 -34276 -39484 -34036 -25222 -24404 -15642 -2757 -5314 2158 -2639 -15415
13871 -15415 -19534 -17941 -772 7874 -6583 -14042 -4885 -2577 -1180 5385 -9734 -19711 -3403
13858 -3403 -7827 -6434 -6237 -18420 -33648 -52440 -48440 -29429 -24169 -23061 -10339 -3590 9003
$$ packed form
13953E6151k5046j6967k538O142R916j4204r035J2669k324l24L000O384l513L698
13939B4009R791O531K759j3513j1482J2803N484q402N296K805P74j2660l531n767
13925A4897p992J6818K699j3572j5108P858K4819l255j0673p586o524o600R23
13912c296n29K3680J9216J52p267n41L931l292n97j2743j557o311j8221J938P188
13897A751J953M619j604j6834M491K2081J734n572j6887l377k0863q828K1536
13884a5800J5092j8488j5080n208N448Q814Q18Q762J2885k557P472m797j2776
13871a5415m119J593J7169Q646j4457p459R157K308J397O565j5119r977J6308
13858c403m424J393J97j2183j5228j8792M000J9011N260J108J2722O749J2593
$$ plain form
13845 9003 22395 27748 26602 18523 23300 33176 34315 25981 18053 19240 28949 46419 56083 49800
13831 49800 56748 65153 84784 90397 100140 112902 126015 129468 124824 117173 104502 99042 96699
13818 96699 61290 53754 41698 29731 30899 11823 15962 32622 32063 23281 27652 18128 20035
13805 20035 27265 14027 2443 5417 15216 19029 12362 9262 6758 6092 5812 6643 10231 9641 6458
13790 6458 7992 13283 25049 24099 21121 9819 3131 386 8386 17407 15126 6568 -4524 -4027
13776 -4027 4937 -2712 -1353 -4996 -14966 -16810 -32289 -29130 -9482 -13083 -2387 -1459 -5739 5560
13762 5560 5696 -9573 -3051 1628 -8843 -18856 -27895 -14670 -21133 -15129 8287 14025 14530 17856
13748 17856 6475 3212 -17850 -37380 -28020 -31355 -28646 -13587 -11232 -18382 -20422 -20234 -9906
$$ packed form
13845I003J3392N353j146q079M777R876J139q334p928J187R709J7470R664o283
13831D9800O948Q405J9631N613R743J2762J3113L453m644p651j2671n460k343
13818I6699l5409p536j2056j1967J168j9076M139J6660n59q782M371r524J907
13805B0035P230j3238j1584K974R799L813o667l100k504o66k80Q31L588n90l183
13790F458J534N291J1766r50k978j1302o688k745Q000R021k281q558j1092M97
13776d027Q964p649J359l643r970j844j5479L159J9648l601J0696R28m280J1299
13762E560J36j5269O522M679j0471j0013r039J3225o463O004K3416N738N05L326
13748A7856j1381l263k1062j9530R360l335K709J5059K355p150k040J88J0328
$$ plain form
13735 -9906 -5340 -8059 -11071 -6234 2838 -308 -3558 2814 13216 11372 -6619 8233 19361 11379
13721 11379 4308 2263 -12979 -36940 -33037 -14988 2597 1426 -18862 -16521 5140 5757 -11720
13708 -11720 -3128 14334 -2754 -15530 -3284 3070 4228 8138 13090 8491 -10761 -29759 -32509
13695 -32509 -32284 -30801 -36744 -2607 14424 1978 -5496 -1951 1391 -10670 -5269 -9238 -20246
13682 -20246 -32829 -25734 969 16554 11305 4640 3621 17588 20348 7742 5959 10348 -7952
13669 -7952 -19057 1289 19420 36978 15419 2443 27298 18420 4506 13138 14328 2437
13657 2437 3800 2163 -16972 -15345 -12129 -4985 3772 -313 -25320 -31803 -27249 -4588 -3928 -6814
13643 -6814 -6333 -3541 -2394 -10380 -20917 -18189 -7321 -14267 -21943 -38469 -34244 -32920 -12855 -3800
$$ packed form
13735i906M566k719l012M837R072l146l250O372J0402j844j7991J4852J1128p982
13721A1379p071k045j5242k3961L903J8049J7585j171k0288K341K1661O17j7477
13708a1720Q592J7462j7088j2776J2246O354J158L910M952m599j9252j8998k750
13695c2509K25J483n943L4137J7031j2446p474L545L342j2061N401l969j1008
13682b0246j2583P095K6703J5585n249o665j019J3967K760j2606j783M389j8300
13669g952j1105K0346J8131J7558k1559j2976K4855q878j3914Q632J190j1891
13657B437J363j637j9135J627L216P144Q757m085k5007o483M554K2661O60k886
13643f814M81K792J147p986j0537K728J0868o946p676j6526M225J324K0065R055
$$ plain form
13629 -3800 6467 11238 -15795 -33731 -31389 -20462 -17758 -16854 -31151 -14245 -8323 -13871 -7454
13616 -7454 4592 7207 -2301 -28389 -41918 -16931 -7233 -9041 -16429 -23138 -21959 -1685 20863
13603 20863 38323 48068 44009 42433 38427 37638 19767 -4639 -19962 -8108 5319 4758 -1389
13590 -1389 -1720 8241 6158 5631 11012 4924 18388 24428 18842 12627 5299 238 8341 -7419 -24502
13575 -24502 -16245 -9721 -18861 -429 22904 25120 21074 3877 2380 13753 11716 5427 1221
13562 1221 3419 5490 4274 -19176 -19105 -13741 -15475 -15049 -9172 -1111 -11169 -24665 -14896 3210
13548 3210 -9864 -27186 -8035 9232 12534 12011 8794 -6478 4835 12576 7555 -9544 -25215
13535 -25215 -3930 25537 33552 25967 19808 31343 43194 45427 40619 23176 23519 25081 31967
$$ packed form
13629c800J0267M771k7033j7936K342J0927K704R04j4297J6906N922n548O417
13616g454J2046K615r508k6088j3529K4987R698j808p388o709J179K0274K2548
13603B0863J7460R745m059j576m006p89j7871k4406j5323J1854J3427n61o147
13590a389l31R961k083n27N381o088J3464O040n586o215p328n061Q103j5760j7083
13575b4502Q257O524r140J8432K3333K216m046j7197j497J1373k037o289m206
13562A221K198K071j216k3450P1N364j734M26N877Q061j0058j3496R769J8106
13548C210j3074j7322J9151J7267L302n23l217j5272J1313P741n021j7099j5671
13535b5215K1285K9467Q015p585o159J1535J1851K233m808j7443L43J562O886
$$ plain form
13522 31967 26795 22260 3844 -8132 -4495 -7729 -79 -10476 -19337 -5482 -12758 -19592 -9483
13509 -9483 -5947 2332 -1802 1950 2123 -9115 -1520 3116 7134 4962 -18991 -26757 -3193 1805
13495 1805 2007 6310 1575 5650 2175 13199 1342 7402 11500 15220 8438 771 -11591 -17012
13481 -17012 -25579 -37792 -30955 -27690 -9714 8860 16483 -4815 -26307 -27619 -12697 -100 -10959
13468 -10959 -15176 -19268 -39251 -51042 -43937 -35582 -45110 -31902 -7239 15930 10376 7123 -4872
13455 -4872 -11576 -6323 2070 15698 4762 -20343 -12751 -8980 -25309 -29047 -28812 -24705 -13653 -9663
13441 -9663 -12677 -27013 -40053 -30905 -14706 73 -7859 -16716 -18985 -14785 -15973 -3383 -1274
13428 -1274 -2385 -9748 -27695 -42932 -24659 -8196 3788 6578 11745 -1828 -1780 -1718 -7775 -18321
$$ packed form
13522C1967n172m535j8416j1976L637l234P650j0397q861J3855p276o834J0109
13509i483L536Q279m134L752J73j1238P595M636M018k172k3953p766K3564M998
13495A805K02M303m735M075l475J1024j1857O060M098L720o782p667j2362n421
13481a7012q567j2213O837L265J7976J8574P623k1298k1492j312J4922J2597j0859
13468a0959m217m092j9983j1791P105Q355r528J3208K4663K3169n554l253j1995
13455d872o704N253Q393J3628j0936k5105P592L771j6329l738K35M107J1052L990
13441i663l014j4336j3040R148J6199J4779p932q857k269M200j188J2590K109
13428a274j111p363j7947j5237J8273J6463J1984K790N167j3573M8O2o057j0546
$$ plain form
13414 -18321 -18656 -7483 3721 -2555 -5090 -338 -13334 -19299 -13002 -1160 4880 537 2099 -11123
13400 -11123 -22571 -32217 -34314 -24858 -18462 -33885 -46782 -40889 -28483 -23411 -12382 -5629 -595
13387 -595 -3016 -3168 -5295 -161 5379 20727 32964 38888 19243 14475 13289 6264 -16787 -25250
13373 -25250 -9717 2256 -4446 -6197 8928 7712 2262 -2726 -11403 1346 30338 43411 45902
13360 45902 43227 19957 7675 -7664 -40204 -44498 -22631 -8833 -13284 -7321 -13609 -23384 -5986
13347 -5986 -6767 871 -8836 -6612 -301 -2445 -16230 -9255 5838 2584 1293 12284 12883 8285
13333 8285 -1106 3736 10507 -12126 -27715 -28515 -22610 -9690 1780 5642 -15168 -21120 -1968
13320 -1968 21357 12367 -8685 -20729 -14599 -3156 15862 24944 14813 8034 1199 -24581 -22711
$$ packed form
13414a8321l35J1173J1204o276k535M752j2996n965O297J1842O040m343J562j3222
13400a1123j1448r646k097R456O396j5423j2897N893J2406N072J1029O753N034
13387e95k421j52k127N134N540J5348J2237N924j9645m768j186p025k3051q463
13373b5250J5533J1973o702j751J5125j216n450m988q677J2749K8992J3073K491
13360D5902k675k3270j2282j5339l2540m294K1867J3798m451N963o288r775J7398
13347e986p81P638r707K224O311k144j3785O975J5093l254j291J0991N99m598
13333H285r391M842O771k2633j5589q00N905J2920J1470L862k0810n952J9152
13320a968K3325q990k1052j2044O130J1443J9018R082j0131o779o835k5780J870
$$ plain form
13307 -22711 -21903 -21715 -12963 -11651 2022 4585 -4003 9412 22 -6381 335 16715 10136 -2271
13293 -2271 -18089 -1464 6006 14257 9706 6098 12113 22955 32677 24456 27157 20220 21401 21656
13279 21656 17053 15403 3765 -9855 -17382 -22843 -27032 -14368 7546 2870 -18101 -28279 -33712
13266 -33712 -42064 -45518 -39988 -32401 -31580 -5881 7588 8517 -2339 -5991 -2110 14756 18286 9842
13252 9842 -9475 -38217 -40884 -14926 -9374 -26468 -17020 -1805 16064 14950 7271 8778 5049
13239 5049 8385 3321 -8564 -1379 3817 2767 9793 17583 27495 3131 -10745 -3032 8715 -311
13225 -311 -4970 -17468 -15783 -7802 -10309 -13108 -11890 -4813 -507 4364 -10811 -17785 1503 15133
13211 15133 26541 12209 -2782 -13266 -2840 10609 15823 10066 6688 12109 11583 17621 -870
$$ packed form
13307b2711Q08J88Q752J312J3673K563q588J3415r390o403O716J6380o579j2407
13293b271j5818J6625P470Q251m551l608O015J0842R722q221K701o937J181K55
13279B1656m603j650j1638j3620p527n461m189J2664K1914m676k0971j0178n433
13266c3712q352l454N530P587Q21K5699J3469R29j0856l652L881J6866L530q444
13252I842j9317k8742k667K5958N552j7094R448J5215J7869j114p679J507l729
13239E049L336n064j1885P185N196j050P026P790R912k4364j3876P713J1747r026
13225c11m659j2498J685P981k507k799J218P077M306M871j5175o974J9288J3630
13211A5133J1408j4332j4991j0484J0426J3449N214n757l378N421n26O038j8491
$$ plain form
13198 -870 -9843 -18425 -14137 -11579 -32322 -27288 -6674 -154 11004 16328 11694 7005 1768 -7584
13184 -7584 -5533 -20478 -17796 -7440 -7376 -23300 -28174 -18535 -9413 -6156 -3531 8448 -7253 -21194
13170 -21194 -13032 -15036 -26589 -24738 -46807 -47137 -25994 -11736 -20321 -19278 -5047 5227 16224
13157 16224 27971 20134 19734 16131 12190 22408 34945 46364 48805 46308 25779 15330 13691
13144 13691 20965 4937 6032 11955 13099 18228 21402 2108 -5985 5676 1725 4146 5888 10818
13130 10818 26829 21457 3355 -4489 -14263 -16079 -5457 4763 5833 6927 15071 2342 -14312
13117 -14312 -14416 -15893 -2605 -7783 -14030 5103 9643 -11159 -26327 -25759 -42968 -44816 -38695 -35125
13103 -35125 -45292 -44094 -48988 -33007 -20341 -27335 -52074 -30437 -30492 -37635 -18858 7604 16899
$$ packed form
13198h70q973q582M288K558k0743N034K0614O520J1158N324m634m689n237r352
13184g584K051j4945K682J0356O4j5924m874R639R122L257K625J1979j5701j3941
13170b1194Q162k004j1553J851k2069l30K1143J4258q585J043J4231J0274J0997
13157A6224J1747p837m00l603l941J0218J2537J1419K441k497k0529j0449j639
13144A3691P274j6028J095N923J144N129L174j9294q093J1661l951K421J742M930
13130A0818J6011n372j8102p844r774j816J0622J0220J070J094Q144j2729j6654
13117a4312j04j477J3288n178o247J9133M540k0802j5168N68j7209j848O121L570
13103c5125j0167J198m894J5981J2666o994k4739K1637n5p143J8777K6462R295
$$ plain form
13090 16899 33844 43366 37119 18999 9370 10613 17152 23094 12442 -2653 -29612 -20316 -12813
13077 -12813 -22529 -23086 -28210 -24248 -6121 -6912 -18360 -12632 3802 543 5367 -8836 -4705 -11856
13063 -11856 -11693 -8715 -23471 -26285 -21353 -18323 -14092 -13273 -22571 -29048 -31913 -12039 -20946 -19299
13049 -19299 -26987 -17914 2412 3416 -11949 -16840 -3025 20233 29433 29718 13047 -888 8955
13036 8955 -2946 -9539 -9897 -19391 -16341 -16259 -17759 -13186 -9455 5746 11706 11817 -4003 -25438 -6543
13021 -6543 10012 5659 -11827 -2099 -3444 -18872 -27832 -26283 -16088 -17586 -23990 -5616 15382
13008 15382 7447 -12189 -7670 2696 -5198 9931 11413 -1545 -12894 -10790 -17051 -20887 -18393
12995 -18393 -10060 5806 25145 25585 24821 18233 20184 14958 -8471 844 8883 12413 5965 826
$$ packed form
13090A6899J6945R522o247j8120r629J243O539N942j0652j5095k6959R296P503
13077a2813r716n57n124L962J8127p91j1448N728J6434l259M824j4203M131p151
13063a1856J63K978j4756k814M932L030M231Q19r298o477k865J9874q907J647
13049a9299p688R073K0326J004j5365m891J3815K3258R200K85j6671j3935R843
13036H955j1901o593l58r494L050Q2j500M573L731J5201N960J11j5820k1435J8895
13021f543J6555m353j7486R728j345j5428q960J549J0195j498o404J8374K0998
13008A5382p935j9636M519J0366p894J5129J482j2958j1349K104o261l836K494
12995a8393Q333J5866J9339M40p64o588J951n226k3429R315Q039L530o448n139
$$ plain form
12981 826 13248 -4659 -2121 6238 2615 3986 12856 14446 11126 11355 12431 14796 22111 -2127
12967 -2127 -16525 -25763 -31483 -17107 -1903 -13507 -5113 -1444 -11940 -10103 4961 5863 7639
12954 7639 6261 3404 12538 4959 -8901 2110 -2520 -14606 -19434 -17897 -13392 -10722 3986 5952
12940 5952 -5788 9837 13065 12448 -9377 -30816 -15564 -997 23436 16390 11193 -1726 -13062
12927 -13062 3824 18094 22321 18546 8250 11650 -925 -13870 -11844 -25556 -15062 3587
12915 3587 9790 5084 -12581 -4840 700 9116 11856 10292 -11201 -22861 -28345 -26560 -3104 9549
12901 9549 6125 -294 1179 4462 16170 10728 -6891 -28368 -23182 -2540 11058 -2224 10946
12888 10946 25184 14462 3463 -5863 4027 15575 -8560 -29150 -20759 -8263 -5732 413 6863
$$ packed form
12981H26J2422j7907K538Q359l623J371Q870J590l320K29J076K365P315k4238
12967b127j4398r238n720J4376J5204j1604Q394L669j0496J837J5064R02J776
12954G639j378k857R134p579j3860J1011m630j2086m828J537M505K670J4708J966
12940E952j1740J5625L228o17k1825k1439J5252J4567K4433p046n197j2919j1336
12927a3062J6886J4270M227l775j0296L400j2575j2945K026j3712J0494J8649
12915C587O203m706j7665P741N540Q416K740j564k1493j1660n484J785K3456J2653
12901I549l424o419J473L283J1708n442j7619k1477N186K0642J3598j3282J3170
12888A0946J4238j0722j0999r326R890J1548k4135k0590Q391J2496K531O145O450
$$ plain form
12875 6863 13356 4676 -5958 9609 248 -14179 -5652 -3123 6735 566 -1315 10787 9042 -5498
12861 -5498 -12878 -21195 -19959 -3874 -9324 -9046 -6101 7249 -1484 -620 2767 7107 -7097 -24955
12847 -24955 -42712 -43981 -31085 -24749 -12926 9231 8526 1714 -26248 -26046 -11553 1156 631
12834 631 -7580 -8066 -10195 -1580 305 84 -11640 -2039 9146 2012 -2070 -6734 -5306 -16279 -15446
12819 -15446 -2226 -3688 5357 5441 15474 22674 33421 48267 48247 25590 16654 7031 1655 -1586
12805 -1586 7970 14461 13276 7909 12003 14957 13198 -324 -16911 -28989 -30317 -37414 -32254 -19321
12791 -19321 13391 16194 -3653 -27193 -19522 -1501 -1236 -9580 3967 -5229 -6168 3998 15019
12778 15019 26284 30268 21181 31359 8858 12954 27101 31023 9184 -7321 -3262 -23054 -22378
$$ packed form
12875F863O493q680j0634J5567r361j4427Q527K529R858o169j881J2102j745j4540
12861e498p380q317J236J6085n450K78K945J3350q733Q64L387M340j4204j7858
12847b4955j7757j269J2896O336J1823K2157p05o812k7962K02J4493J2709n25
12834F31q211m86k129Q615J885k21j1724R601J1185p134m082m664J428j0973Q33
12819a5446J3220j462R045Q4J0033P200J0747J4846k0k2657q936r623n376l241
12805a586R556O491j185n367M094K954j759j3522j6587j2078j328p097N160J2933
12791a9321L2712K803j9847k3540P671J8021K65q344J3547r196r39J0166J1021
12778A5019J1265L984r087J0178k2501M096J4147L922k1839j6505M059j9792O76
$$ plain form
12765 -22378 -7552 -6158 7462 14774 21369 27969 34336 24773 25026 20580 17424 9926 11548 18283
12751 18283 35664 16850 15804 3027 1607 -11970 -11453 11982 24015 30495 20197 2245 -281
12738 -281 1643 -10576 -17600 -25740 -12364 -6382 11064 12856 9559 -1484 -3235 2179 11056 16968
12724 16968 25800 -1569 -41368 -25089 -800 -13582 -8872 3789 -13483 -22154 -6971 12563
12712 12563 7266 -18045 -26615 -20581 -25710 -21718 -15886 -32423 -22134 -20427 -25410 -25929 -41061 -41097
12698 -41097 -49234 -40355 -36740 -40424 -44770 -43224 -38434 -37018 -13614 -6134 -3605 -18390 -7297 1160
12684 1160 5043 8765 -10988 -14779 864 3666 56 -10320 -7509 -1010 -25947 -27317 -19348 -5790
12670 -5790 -7720 -13028 -15263 -1721 -8138 -18568 -16636 -20271 -31691 -42397 -16612 -474 -11790
$$ packed form
12765b2378J4826J394J3620P312O595O600O367r563K53m446l156p498J622O735
12751A8283J7381j8814j046j2777j420j3577N17K3435J2033O480j0298j7952k526
12738b81J924j2219p024q140J3376N982J7446J792l297j1043j751N414Q877N912
12724A6968Q832k7369l9799J6279K4289j2782M710J2661j7272q671J5183J9534
12712A2563n297k5311q570O034n129L992N832j6537J0289J707m983n19j5132l6
12698d1097q137Q879L615l684m346J546M790J416K3404P480K529j4785J1093Q457
12684A160L883L722j9753l791J5643K802l610j0376K811O499k4937j370P969J3558
12670e790j930n308k235J3542o417j0430J932l635j1420j0706K5785J6138j1316
$$ plain form
12657 -11790 -26572 -11537 -20648 -27056 -35357 -16041 2922 -1131 7464 27719 27132 17275 7745
12644 7745 2068 13533 24251 40983 22619 13356 -1363 3080 5794 10853 6896 -8926 411
12631 411 17812 9825 15417 -344 -11164 -9441 -18750 -10670 5004 421 -18355 -12803 -8209 5582
12617 5582 6326 4814 4769 13849 22297 5123 -7357 8574 17248 -8599 -18971 -23544 -25238 -3524
12603 -3524 11364 252 -82 7671 24181 27151 17720 6472 1441 -91 -4135 8728 26252
12590 26252 8982 -27345 -28596 -5403 1424 4303 16134 4035 -16621 -16278 21906 18797 20735
12577 20735 20889 36515 33217 19336 22978 31354 54013 68353 58585 60628 64184 55533 49188 50539
12563 50539 40004 14023 9172 7523 12947 8715 -1936 -5457 -9269 -10055 3271 1572 19042
$$ packed form
12657a1790j4782J5035r111o408q301J9316J8963m053Q595K0255n87r857r530
12644G745n677J1465J0718J6732j8364r263j4719M443K714N059l957j5822R337
12631D11J7401p987N592j5761j0820J723r309Q080J5674m583j8776N552M594J3791
12617E582P44j512m5R080Q448j7174j2480J5931Q674k5847j0372m573j694K1714
12603c524J4888j1112l34P753J6510K970r431j1248n031j532m044J2863J7524
12590B6252j7270l6327j251K3193O827K879J1831j2099k0656L43L8184l109J938
12577B0735J54J5626l298j3881L642Q376K2659J4340r768K043L556q651o345J351
12563E0539j0535k5981m851j649N424m232j0651l521l812p86J3326j699J7470
$$ plain form
12550 19042 17300 16975 2934 -20240 -28603 -23924 -17745 8516 18070 6321 -10939 6158 11820
12537 11820 -932 5749 -13358 -6270 -20291 -20526 -19846 -31737 -33905 -16292 10773 -6179 -14750
12524 -14750 -15566 -22752 -25482 -31228 -19698 -2033 1290 -11986 -9040 775 4179 17167 23799 39618
12510 39618 44451 28382 3823 -1281 9419 7770 -18563 -30343 163 5749 -8207 -8762 -153
12497 -153 -13724 -11279 -9604 -16097 -11503 -12193 -17809 -12769 -9532 -8265 18276 26716 12084 -1475
12483 -1475 -2140 12168 16125 6583 3739 18533 30992 23231 32290 25544 34895 36801 24075 21505
12469 21505 29138 38465 39264 44633 29351 19449 23612 21582 35462 56037 90000 106485 99106
12456 99106 72031 43648 19291 14141 46557 44844 50716 41632 30123 35893 28261 18617 14810
$$ packed form
12550A9042j742l25j4041k3174q363M679O179K6261R554j1749j7260J7097N662
12537A1820j2752O681j9107P088j4021k35O80j1891k168J7613K7065j6952q571
12524a4750q16p186k730n746J1530J7665L323j3276K946R815L404J2988O632J5819
12510C9618M833j6069k4559n104J0700j649k6333j1780L0506N586j3956n55Q609
12497a53j3571K445J675o493M594o90n616N040L237J267K6541Q440j4632j3559
12483a475o65J4308L957r542k844J4794J2459p761R059o746R351J906j2726k570
12469B1505P633R327P99N369j5282r902M163k030J3880K0575L3963J6485p379
12456I9106k7075k8383k4357n150L2416j713N872r084j1509N770p632r644l807
$$ plain form
12443 14810 -2684 -5734 26028 11569 -265 6429 26070 28791 42817 41786 9574 4089 13667
12430 13667 30792 28214 30641 32756 46620 43218 35808 16144 -6432 -4292 6342 -2055 -20814
12417 -20814 -10390 -1937 11604 32362 40228 26757 9423 7748 12977 26348 41338 33445 12641
12404 12641 5642 -5790 42 12197 3876 -736 3152 -3296 -16251 -2242 0 -12634 -6998
12391 -6998 -7933 -10007 11509 27739 28422 41910 31645 346 -11391 413 11871 3157 8796
12378 8796 24258 18946 22525 23519 10306 -14761 -27199 -32849 11617 38230 25996 -3947 -14108
12365 -14108 -19837 -23439 -15941 -6531 -9925 -6643 7345 10964 -3663 -19231 -11356 3473 11785
12352 11785 13292 13494 2060 -13106 -12481 -189 -7369 -10523 -3338 1187 -3651 593 -1122 -8952
$$ packed form
12443A4810j7494l050L1762j4459j1834O694J9641K721J4026j031l2212n485R578
12430A3667J7125k578K427K115J3864l402p410j9664k2576K140J0634q397j8759
12417b0814J0424Q453J3541K0758P866j3471j7334j675N229J3371J4990p893k0804
12404A2641o999j1432N832J2155q321m612L888o448j2955J4009K242j2634N636
12391f998r35k074K1516J6230O83J3488j0265l1299j1737J1804J1458q714N639
12378H796J5462n312L579R94j3213k5067j2438n650M4466K6613j2234k9943j0161
12365a4108n729l602P498R410l394L282J3988L619j4627j5568P875J4829Q312
12352A1785J507K02j1434j5166O25J2292p180l154P185M525m838M244j715p830
$$ plain form
12338 -8952 -5833 8193 10119 14096 5092 24409 22875 5268 16938 28737 21669 18058 21629
12325 21629 16698 1124 4548 10009 28547 32053 10007 -5733 -5537 -10531 6763 4711 -12823
12312 -12823 -20424 3681 20116 21473 14587 25728 28133 9617 3648 -11851 -24747 -29747 -8042
12299 -8042 -9111 -16230 -4541 15704 16025 17674 28173 34855 42449 25602 3071 -20235 -21456
12286 -21456 -1119 18440 12774 -8635 -3463 4085 3256 7242 19999 16096 -4098 1517 -712
12273 -712 9839 24215 3493 -2705 -8803 -9941 2593 23242 31031 26578 28702 26304 24234 13061
12259 13061 -9400 670 6503 -1394 -5234 10175 8228 7192 -3045 2554 6758 29492 33184
12246 33184 18927 26311 44582 54819 55947 52153 39066 24381 17318 27908 20497 37560 59833
$$ packed form
12338h952L119J4026J926L977r004J9317j534j7607J1670J1799p068l611L571
12325B1629m931j5574L424N461J8538L506k2046j5740J96m994J7294k052j7534
12312a2823p601K4105J6435J357o886J1141K405j8516n969j5499j2896n000K1705
12299h042j069p119J1689K0245L21J649J0499O682P594j6847k2531k3306j221
12286b1456K0337J9559n666k1409N172P548q29L986J2757l903k0194N615k229
12273g12J0551J4376k0722o198o098j138J2534K0649P789m453K124k398k070j1173
12259A3061k2461J0070N833p897l840J5409j947j036j0237N599M204K2734L692
12246C3184j4257P384J8271J0237J128l794j3087j4685p063J0590p411J7063K2273
$$ plain form
12233 59833 45727 13035 17015 29642 34609 34225 41414 6891 -5436 27723 39251 57376 60262
12220 60262 39826 39143 27932 30177 36799 34889 39842 57703 64538 50890 19108 7663 23939
12207 23939 21923 -857 -3509 -864 -3308 -5036 -1913 18444 31882 18129 26928 60032 50020
12194 50020 25511 16657 12789 24149 34407 39684 34375 31499 33203 44759 41205 32710 28239
12181 28239 27069 26835 34171 47423 38655 27188 25124 18988 -122 -11763 -9025 -13078 -14065 -4635
12167 -4635 8471 12116 6447 13826 12220 8984 11602 11086 -25569 -34140 -17104 12866 20745 16308
12153 16308 16723 19103 15658 30907 28026 21339 5240 18561 19312 26206 26753 6964 -2888 -606
12139 -606 13886 17750 30576 38281 36190 26905 42748 44222 25528 20729 41382 58482 47044
$$ packed form
12233E9833j4106l2692L980J2627M967l84P189l4523j2327L3159J1528J8125K886
12220F0262k0436o83j1211K245O622j910M953J7861O835j3648l1782j1445J6276
12207B3939k016k2780k652K645k444j728L123K0357J3438j3753Q799L3104j0012
12194E0020k4509q854l868J1360J0258N277n309k876J704J1556l554q495m471
12181B8239j170k34P336J3252q768j1467k064o136j9110j1641K738m053r87R430
12167d635J3106L645n669P379j606l236K618n16l6655q571J7036K9970P879m437
12153A6308M15K380l445J5249k881o687j6099J3321P51O894N47j9789r852K282
12139f06J4492L864J2826P705k091r285J5843J474j8694m799K0653J7100j1438
$$ plain form
12126 47044 43845 45762 39753 17811 22929 20436 11557 7060 31454 42237 29373 22314 16736
12113 16736 21044 39168 38572 19085 19250 13003 14975 13636 7489 -7049 -8626 1766 1176 425
12099 425 -1677 114 4418 8774 3462 10639 8121 -7672 -5778 14227 26381 23451 18681 17539
12085 17539 16955 13361 8674 4936 -7866 -11681 -7640 -2377 7830 22483 24740 17603 27816 22304
12071 22304 9265 -8230 -7248 -14723 -17904 -4275 1201 7403 16782 19486 29675 21934 19360 29774
12057 29774 42532 30837 33315 29468 24192 25777 14996 10443 7054 27277 40768 46326 52395
12044 52395 37896 32396 31772 33936 12493 9882 30662 22045 3480 -4272 -16372 -1270 -8053
12031 -8053 -3595 4000 27888 32935 19350 21045 23103 23698 32583 34648 35936 40564 25817 13093
$$ packed form
12126D7044l199J917o009k1942N118k493q879m497K4394J0783j2864p059n578
12113A6736M308J8124n96j9487J65o247J972j339o147j4538j577J0392n90p51
12099D25k102J791M304M356n312P177k518j5793J894K0005J2154k930m770j142
12085A7539n84l594m687l738j2802l815M041N263J0207J4653K257p137J0213n512
12071B2304j3039j7495R82p475l181J3629N476O202R379K704J0189p741k574J0414
12057B9774J2758j1695K478l847n276J585j0781m553l389K0223J3491N558O069
12044E2395j4499n500o24K164k1443k611K0780q617j8565p752j2100J5102o783
12031h053M458P595K3888N047j3585J695K058N95Q885K065J288M628j4747j2724
$$ plain form
12017 13093 -244 -6535 -971 6990 25029 20528 15587 22387 24029 30582 26786 27543 14942 1200
12003 1200 7332 19243 20249 22086 29660 27473 1681 -20613 -9868 2074 -9427 -5904 -6947
11990 -6947 -10988 -9520 -2071 12004 19286 27418 30993 45098 73429 57514 43523 42797 20956
11977 20956 12813 20357 36847 29370 28400 22752 4855 -13418 -4896 19074 4813 -16652 -371
11964 -371 17272 27907 21673 10292 20711 17651 2165 -2210 9280 16247 11552 10144 -1620
11951 -1620 7101 4741 -129 -4461 -3011 1257 5303 1758 18483 27613 18780 18323 13166 7455 -3131
11936 -3131 -14419 -4919 -6431 -10295 -14781 6839 10532 17785 40821 33216 26838 38691 43076 52999
11922 52999 49890 43802 45369 49752 40948 48869 56779 80804 124674 136335 120665 140975 151683
$$ packed form
12017A3093j3337o291N564P961J8039m501m941O800J642O553l796P57j2601j3742
12003A200O132J1911J006J837P574k187k5792k2294J0745J1942j1501L523j043
11990f947m041J468P449J4075P282Q132L575J4105K8331j5915j3991p26k1841
11977B0956q143P544J6490p477r70n648j7897j8273Q522K3970j4261k1465J6281
11964c71J7643J0635o234j1381J0419l060j5486m375J1490O967m695j408j1764
11951a620Q721k360m870m332J450M268M046l545J6725R130q833m57n157n711j0586
11936c131j1288R500j512l864m486K1620L693P253K3036p605o378J1853M385R923
11922E2999l109o088J567M383q804P921P910K4025M3870J1661j5670K0310J0708
$$ plain form
11909 151683 133748 91562 69967 58724 59490 70264 62177 51063 75187 79770 83460 84213 81543
11896 81543 81551 81175 84332 68706 67448 62210 62897 71389 85037 64906 56682 59090 45101 26119
11882 26119 27611 36986 48794 45852 54143 55691 60205 77822 77307 66985 76603 80648 99880 97565
11868 97565 78951 69756 65790 63110 64959 64901 79869 92084 83189 49399 33739 34343 47607 47973
11854 47973 43080 45833 51331 42901 27503 24622 37550 51180 23069 3822 20766 25352 13495
11841 13495 27376 19963 10867 12085 23060 19261 25335 23704 23886 40045 27990 28148 39246 35383
11827 35383 25910 24977 40249 31705 8076 -5434 -824 22339 38740 36813 24526 15491 21174
11814 21174 31934 48695 58669 48521 26867 31298 61834 65244 49102 48917 56755 54419 35588
$$ packed form
11909A51683j7935m2186k1595j1243P66J0774q087j1114K4124M583L690P53k670
11896H1543Ql76L157j5626j258n238O87Q492J3648k0131q224K408j3989j8982
11882B6119J492R375J1808k942Q291J548M514J7617n15j0322R618M045J9232k315
11868I7565j8614r195l966k680J849n8J4968J2215q895l3790j5660O04J3264L66
11854D7973m893K753N498q430j5398k881J2928J3630k8111j9247J6944M586j1857
11841A3495J3881p413r096J218J0975l799O074j631J82J6159j2055J58J1098l863
11827C5383r473r33J5272q544k3629j3510M610K3163J6401j927j2287r035N683
11814B1174J0760J6761R974j0148k1654M431L0536L410j6142j85P838k336j8831
$$ plain form
11801 35588 45911 61687 69198 64306 52700 53661 45857 35708 20930 12194 11937 21513 27483 26127
11787 26127 14558 21985 36328 55344 57399 47609 24719 29409 32274 12253 8715 -13987 -24352
11774 -24352 -10612 8932 20091 44611 62303 65367 52795 43306 25607 20104 8802 15412
11762 15412 5097 17640 37203 45059 11514 -12365 -5488 -1451 9992 22766 36615 47591
11750 47591 35185 17741 -563 20977 5311 9607 24642 17931 32802 36964 21403 18939
11738 18939 15993 29804 22243 16479 15820 14305 21605 28472 31495 25233 25051 18115 20665 6831
11724 6831 30993 28167 12395 6186 -2035 -5704 18733 27358 31160 23050 1249 7136 27539
11711 27539 26867 24797 27483 22421 13383 15665 14358 -10750 -4654 15627 3663 -27 8915 2550
$$ packed form
11801C5588J0323J5776P511m892j1606R61p804j0149j4778q736k57R576N970j356
11787B6127j1569P427J4343J9016K055r790k2890M690K865k0021l538k2702j0365
11774b4352J3740J9544J1159K4520J7692L064j2572r489j7699n503j1302O610
11762A5412j0315J2543J9563P856l3545k3879O877M037J1443J2774J3849J0976
11750D7591j2406j7444j8304K1540j5666M296J5035o711J4871M162j5561k464
11738A8939k946J3811p561n764o59j515P300O867L023o262j82o936K550j3834
11724F831K4162k826j5772o209q221l669K4437Q625L802q110k1801N887K0403
11711B7539o72k070K686n062r038K282j307k5108O096K0281j1964l690Q942o365
$$ plain form
11697 2550 -8046 -7494 26699 27652 16813 2670 7009 17152 12129 14986 28839 30385 39171 34761
11683 34761 36025 35216 43088 42346 35462 17719 7208 9663 922 -14203 1038 26130 24416 15854
11669 15854 19279 25416 29347 24285 8206 4593 -16994 -4456 13047 20292 27702 17640 -2844
11656 -2844 -11170 -13963 -26071 -17171 -391 9267 24829 29763 23917 14514 5713 -8447 -21860
11643 -21860 -22880 -16605 -14683 1204 31571 34660 8570 -8454 -2426 -10976 -20555 2229 13170
11630 13170 14031 -7882 -10526 12397 5065 18876 7029 1558 4218 12379 22446 25273 31417
11617 31417 42394 35735 33159 39727 33179 13178 13957 33780 25089 9251 6718 25449 37271
11604 37271 39096 45662 47903 48225 32029 13599 2290 -16490 8455 37345 28375 37371 36159
$$ packed form
11697B550j0596N52L4193R53j0839j4143M339J0143n023K857J3853J546Q786m410
11683C4761J264q09P872p42o884j7743j0511K455q741j5125J5241K5092j714q562
11669A5854L425O137L931n062j6079l613k1587J2538J7503P245P410j0062k0484
11656b844q326k793j2108Q900J6780R658J5562M934n846r403q801j4160j3413
11643b1860j020O275J922J5887L0367L089k6090j7024O028q550r579K2784J0941
11630A3170Q61k1913k644K2923p332J3811j1847n471K660Q161J0067K827O144
11617C1417J0977o659k576O568o548k0001P79J9823q691j5838k533J8731J1822
11604C7271J825O566K241L22j6196j8430j1309j8780K4945K8890q970Q996j212
$$ plain form
11591 36159 25953 24166 34479 40636 19905 31275 49151 47510 20277 18566 19849 24900 4482
11578 4482 6770 12472 41593 51091 35564 24460 19013 34128 25420 15116 10519 -6628 -5340
11565 -5340 -2085 15812 28682 28093 8549 8400 26480 37464 45400 29971 32108 29727 32435 38169
11551 38169 32786 28488 31425 21431 39037 45067 43236 38718 10346 -7912 -16549 -15431 1519
11538 1519 21166 29379 15819 13818 19810 29398 26077 21487 31431 35696 30812 35236 43856 28338
11524 28338 11762 4633 7203 -1451 -2727 8968 23462 27911 16181 29271 31143 33627 38601
11511 38601 46461 32626 42420 34101 37213 32510 36926 29110 23049 22747 16589 25708 22565 5806
11497 5806 2111 16110 7878 -5662 -13169 -9263 -1343 -649 -13681 -16540 11646 34842 35024 12263
$$ packed form
11591C6159j0206j787J0313O157k0731J1370J7876j641k7233j711J283N051k0418
11578D482K288N702K9121R498j5527j1104n447J5115q708j0304m597j7147J288
11565e340L255J7897J2870n89j9544j49J8080J0984P936j5429K137k381K708N734
11551C8169n383m298K937r994J7606O030j831m518k8372j8258q637J118J6950
11538A519J9647Q213j3560k001N992R588l321m590R944M265m884M424Q620j5518
11524B8338j6576p129K570q654j276J1695J4494M449j1730J3090J872K484M974
11511C8601P860j3835R794q319L112m703M416p816o061l02o158R119l143j6759
11497E806l695J3999q232j3540p507L906P920O94j3032k859K8186K3196J82k2761
$$ plain form
11483 12263 12908 17431 22297 37507 42336 35243 7062 -10503 1836 17835 40512 45633 41413
11470 41413 46659 58446 55240 49399 62791 50556 27510 9902 19952 35351 28078 13838
11458 13838 5716 6599 3111 24392 42070 34005 16279 8818 19400 27278 46460 42542 39788
11445 39788 63464 71838 60187 41858 20399 25837 28573 20428 32077 38187 43934 41552 23606
11432 23606 4172 13788 17603 27173 42111 27643 7336 -1176 6970 11200 16403 38516 38214
11419 38214 19955 30521 31190 22294 37807 45471 48970 39246 25001 28298 33006 33020 14982 -2330
11405 -2330 16736 38671 42388 35560 14381 5278 15242 41218 49841 62729 47474 41358 56967
11392 56967 56350 64459 76805 76045 51250 37765 49012 59720 42949 12051 7889 1483 4618
$$ packed form
11483A2263O45M523M866J5210M829p093k8181j7565J2339J5999K2677N121m220
11470D1413N246J1787l206n841J3392j2235k3046j7608J0050J5399p273j4240
11458A3838q122Q83l488K1281J7678q065j7726p461J0582P878J9182l918k754
11445C9788K3676Q374j1651j8329k1459N438K736q145J1649O110N747k382j7946
11432B3606j9434R616L815R570J4938j4468k0307q512Q146M230N203K2113l02
11419C8214j8259J0566O69q896J5513P664L499r724j4245L297M708J4j8038j7312
11405b330J9066K1935L717o828k1179r103R964K5976Q623J2888j5255o116J5609
11392E6967o17Q109J2346p60k4795j3485J1247J0708j6771l0898m162o406L135
$$ plain form
11379 4618 724 16476 28086 44042 53728 59181 62899 68550 72638 70662 52247 49963 52918 45530
11365 45530 43213 49953 36695 31961 30582 20779 11903 13262 31109 34689 39266 51166 59955 35980
11351 35980 32271 21247 25035 24481 35856 47498 53931 36478 28222 38275 36800 41241 53201
11338 53201 51229 53528 34886 8351 11294 25457 33228 32798 33269 44496 41188 27184 23778 16754
11324 16754 17333 24406 13335 12144 14496 35739 56092 59151 57396 48205 35695 28469 21121 23050
11310 23050 32165 45485 44378 43282 39156 33935 21465 25657 34754 42313 21053 31327 35411
11297 35411 24369 13067 4765 25893 54840 59680 62062 54451 33947 28979 23538 18350 18631
11284 18631 31448 34565 25175 18381 39754 46340 50680 48694 23281 38772 57445 42806 31880
$$ packed form
11379D618l894J5752J1610J5956R686N453L718N651M088j976j8415k284K955p388
11365D5530k317O740j3258m734j379r803q876J359J7847L580M577J1900Q789k3975
11351C5980l709j1024L788n54J1375J1642O433j7453q256J0053j475M441J1960
11338E3201j972K299j8642k6535K943J4163P771m30M71J1227l308j4004l406p024
11324A6754N79P073j1071j191K352K1243K0353L059j755r191j2510p226p348J929
11310B3050R115J3320j107j096m126n221j2470M192R097P559k1260J0274M084
11297C5411j1042j1302q302K1128K8947M840K382p611k0504m968n441n188K81
11284A8631J2817L117r390o794K1373O586M340j986k5413J5491J8673j4639j0926
$$ plain form
11271 31880 43089 57168 47530 34458 39659 43226 39321 37507 40863 35359 39103 39548 22405 31379
11257 31379 39994 20165 14709 41236 42788 16515 -3224 7926 21414 16716 30520 35771 44295
11244 44295 44768 28788 30442 32582 61097 78044 59291 52890 37749 39634 30113 24107 37403
11231 37403 37412 33237 42027 48086 44463 40445 74080 82450 70939 59938 45141 49597 38759 19085
11217 19085 24139 38569 48006 52963 35451 22193 17639 25318 30659 21485 14697 15463 5716 6017
11203 6017 -6143 -3548 -1704 23098 59754 66393 47239 54533 47400 25542 16806 39460 54435
11190 54435 69488 84746 84837 89306 88135 106170 103592 93420 86539 81859 83343 76125 68273 68356
11176 68356 62665 70983 73739 73621 54099 49807 68273 65689 74327 92958 89636 90917 109494 116484
$$ packed form
11271C1880J1209J4079r638j3072N201L567l905j814L356n504L744M45j7143Q974
11257C1379Q615j9829n456K6527J552k6273j9739J1150J3488m698J3804N251Q524
11244D4295M73j5980J654K140K8515J6947j8753o401j5141J885r521o006J3296
11231C7403Rm175Q790O059l623m018L3635Q370j1511j1001j4797M456j0838j9674
11217A9085N054J4430R437M957j7512j3258m554P679N341r174o788P66r747L01
11203F017j2160K595J844K4802L6656O639j9154P294p133k1858q736K2654J4975
11190E4435J5053J5258R1M469j171J8035k578j0172o881m680J484p218p852Q3
11176F8356n691Q318K756j18j9522m292J8466k584Q638J8631l322J281J8577O990
$$ plain form
11162 116484 126727 149291 149848 140341 151902 154206 156675 152796 128505 118411 141374 164445 179547
11149 179547 183302 182021 186220 233158 258023 273646 312576 345112 366419 388120 410102 415845
11137 415845 421810 431383 461760 506921 564139 657280 798720 990127 1288928 1682019 2124387
11126 2124387 2417730 2275986 1857783 1457266 1171577 989948 861405 773256 702932 650604
11116 650604 607129 557429 503858 488275 471520 431719 406320 410713 421436 418767 393702 374456
11104 374456 371589 355705 355094 369061 363365 376667 370484 361671 375681 374469 375490 381913 377465
11091 377465 357352 341981 322371 312558 304199 306143 302192 305872 296705 289306 259002 254323 251764
11078 251764 250758 256867 246475 229413 208882 189843 169751 165501 168454 184319 190055 191748 190054
$$ packed form
11162A16484J0243K2564N57r507J1561K304K469l879k4291j0094K2963K3071J5102
11149A79547L755j281M199M6938K4865J5623L8930L2536K1307K1701K1982N743
11137D15845N965R573L0377M5161N7218R3141J41440J91407K98801L93091M42368
11126B124387K93343j41744m18203m00517k85689j81629j28543q8149p0324n2328
11116F50604m3475m9700n3571j5583j6755l9801k5399M393J0723k669k5065j9246
11104C74456k867j5884o11J3967n696J3302o183q813J4010j212J021O423m448
11091C77465k0113j5371j9610r813q359J944l951L680r167p399l0304m679k559
11078B51764j006O109j0392j7062k0531j9039k0092m250K953J5865N736J693j694
$$ plain form
11065 190054 188142 173290 145218 130171 135177 165264 182711 185508 175309 159865 163816 152919
11053 152919 141292 160323 153870 131948 138813 152545 138759 117687 118225 119511 112145 117460 130625
11040 130625 118902 118984 139639 147748 141647 124577 121705 109474 119516 137882 145528 133112 131714
11027 131714 140536 143769 160536 187353 204915 217547 212303 213476 204787 195664 190010 186877 196743
11014 196743 222859 245967 266906 284916 290854 292224 294511 310088 314829 329307 346794 338069
11002 338069 353598 375751 382180 371555 384327 416042 434383 424376 392278 380941 409770 432403
10990 432403 448898 459809 489708 501567 498452 495310 494777 489380 475574 434275 410762 393476
10978 393476 356901 331151 320894 303651 286427 274609 234077 221770 226442 212257 199730 175957
$$ packed form
11065A90054j912j4852k8072j5047N006L0087J7447K797j0199j5444L951j0897
11053A52919j1627J9031o453k1922O865J3732j3786k1072N38J286p366N315J3165
11040A30625j1723Q2K0655Q109o101j7070k872j2231J0042J8366P646j2416j398
11027A31714Q822L233J6767K6817J7562J2632n244J173q689r123n654l133R866
11014A96743K6116K3108K0939J8010N938J370K287J5577M741J4478J7487q725
11002C38069J5529K2153O429j0625J2772L1715J8341j0007l2098j1337K8829K2633
10990D32403J6495J0911K9899J1859l115l142n33n397j3806m1299k3513j7286
10978C93476l6575k5750j0257j7243j7224j1818m0532j2307M672j4185j2527k3773
$$ plain form
10966 175957 178003 183639 185438 193737 186123 184967 186600 201555 207639 226020 218884 209026 197925
10953 197925 202368 205678 191698 182050 189753 185890 164388 142619 145253 148379 141744 147037 157552
10940 157552 179643 190133 190610 202037 211041 202934 207185 214209 223187 232192 241436 244903 248925 256531
10926 256531 265910 252464 239877 247166 238036 203171 179689 182871 181627 177865 187169 205188 202288
10913 202288 212687 232750 216357 209746 214921 220392 202067 169430 122191 107539 101054 92359
10901 92359 107139 142252 163417 164548 160029 157749 187334 214738 226965 251699 281138 300341
10889 300341 308976 317692 311970 316948 323479 333014 330484 321897 320241 326991 341523 364361 340935
10876 340935 323113 329208 334643 351010 405748 496329 568666 634076 704408 766777 792715 794524
$$ packed form
10966A75957K046N636J799Q299p614j156J633J4955O084J8381p136r858j1101
10953A97925M443L310j3980r648P703l863k1502k1769K634L126o635N293J0515
10940A57552K2091J0490M77J1427R004q107M251P024Q978R005R244L467M022P606
10926B56531R379j3446j2587P289r130l4865k3482L182j244l762R304J8019k900
10913B02288J0399K0063j6393o611N175N471j8325l2637m7239j4652o485q695
10901I2359J4780L5113K1165J131m519k280K9585K7404J2227K4734K9439J9203
10889C00341Q635Q716n722M978O531R535k530q587j656O750J4532K2838k3426
10876C40935j7822O095N435J6367N4738R0581P2337O5410P0332O2369K5938J809
$$ plain form
10864 794524 851752 904057 847632 772744 738479 768282 815149 840712 829898 812021 807850 809343
10852 809343 818827 805027 780429 736465 662597 611468 582014 556832 547404 555925 558839 579198
10840 579198 622755 675623 712135 722236 744527 755319 785545 823176 870801 922289 963412
10829 963412 987087 1047736 1122703 1171923 1223395 1283351 1334768 1384580 1454379 1553737 1635190
10818 1635190 1691598 1737443 1788276 1861333 1914598 1982227 2039068 2097979 2152132 2185050 2187818
10807 2187818 2196127 2214607 2245247 2273653 2287567 2316932 2330477 2324520 2356299 2404318 2457722 2506240
10795 2506240 2550201 2592394 2639756 2699063 2752908 2820641 2858599 2909720 2970606 3012805 3081974
10784 3081974 3168114 3240851 3314141 3380505 3438031 3517005 3625191 3725882 3831776 3929532 4005153
$$ packed form
10864G94524N7228N2305n6425p4888l4265K9803M6867K5563j0814j7877m171J493
10852H09343R484j3800k4598m3964p3868n1129k9454k5182r428Q521K914K0359
10840E79198M3557N2868L6512J0101K2291J0792L0226L7631M7625N1488M1123
10829I63412K3675O0649P4967M9220N1472N9956N1417M9812O9799R9358Q1453
10818A635190N6408M5845N0833P3057N3265O7629N6841N8911N4153L2918K768
10807B187818Q309J8480L0640K8406J3914K9365J3545n957L1779M8019N3404M8518
10795B506240M3961M2193M7362N9307N3845O7733L7958N1121O0886M2199O9169
10784C081974Q6140P2737P3290O6364N7526P8974J08186J00691J05894R7756P5621
$$ plain form
10773 4005153 4084110 4172561 4280485 4418828 4600963 4812910 5036669 5246939 5447834 5665238
10763 5665238 5880300 6157124 6463222 6779218 7097958 7501510 8045816 8686668 9455245
10754 9455245 10336326 11320077 12470507 13775175 15224125 16905838 18903261 21278698
10746 21278698 24213887 27899215 32159280 36717729 41265631 45639802 49825393 53772655
10738 53772655 57629300 61367318 64720702 67739266 71283956 76389383 84156122 96426487
10730 96426487 115863076 145474847 188469254 249099552 329350917 414091618 451834851
10723 451834851 403425819 318685213 247027979 197118166 163227783 139452328 122108744
10716 122108744 109182262 99171695 91051823 84349294 78846126 74390629 70646762 67430418
$$ packed form
10773D005153P8957Q8451J07924J38343J82135K11947K23759K10270K00895K17404
10763E665238K15062K76824L06098L15996L18740M03552N44306O40852P68577
10754I455245Q81081R83751J150430J304668J448950J681713J997423K375437
10746B1278698K935189L685328M260065M558449M547902M374171M185591L947262
10738E3772655L856645L738018L353384L018564L544690N105427P766739J2270365
10730I6426487J9436589K9611771M2994407O0630298Q0251365Q4740701L7743233
10723D51834851m8409032q4740606p1657234m9909813l3890383k3775455j7343584
10716A22108744j2926482j0010567q119872o702529n503168m455497l743867l216344
$$ plain form
10708 67430418 64773656 62696300 61180638 59964469 58585106 56892345 55206690 53751122
10700 53751122 52541460 51608366 50891714 50478946 50419096 50686200 51342713 52477773 53689443
10691 53689443 54005595 53028153 51090331 48627805 46032589 43503262 41148012 39023500
10683 39023500 37184247 35579287 34068776 32325848 30390482 28534349 26889944 25532988
10675 25532988 24436241 23584638 22803835 21826510 20532173 19136304 17852423 16678697
10667 16678697 15628317 14698577 13868987 13110196 12424501 11807601 11253743 10729774 10206636
10658 10206636 9704246 9239352 8817753 8406458 8004811 7648580 7310658 7003357 6724012
10649 6724012 6448920 6167446 5872339 5580640 5303970 5082847 4876607 4666311 4466713
$$ packed form
10708F7430418k656762k077356j515662j216169j379363j692761j685655j455568
10700E3751122j209662r33094p16652m12768n9850K67104O56513J135060J211670
10691E3689443L16152r77442j937822k462526k595216k529327k355250k124512
10683C9023500j839253j604960j510511j742928j935366j856133j644405j356956
10675B5532988j096747q51603p80803r77325j294337j395869j283881j173726
10667A6678697j050380r29740q29590p58791o85695o16900n53858n23969n23138
10658A0206636n02390m64894m21599m11295m01647l56231l37922l07301k79345
10649F724012k75092k81474k95107k91699k76670k21123k06240k10296j99598
$$ plain form
10640 4466713 4281002 4102382 3917196 3747825 3579372 3399745 3230501 3078893 2934179
10631 2934179 2793245 2659948 2543508 2441509 2347619 2264631 2185081 2088996 2001675 1920244
10621 1920244 1840747 1780528 1738971 1680273 1584699 1492651 1414301 1377026 1355122 1299096 1257754
10610 1257754 1235970 1229242 1243952 1268161 1259179 1237746 1226406 1220780 1206900 1147106 1017958 879379
10598 879379 746421 661127 639902 648804 626911 562054 513331 497510 489274 429132 303810
10587 303810 196554 70327 -88054 -188721 -170477 -171918 -190206 -178294 -130321 -75298 -8134
10576 -8134 57309 88430 96748 95396 110692 137159 147092 142742 163978 178003 176335 171504 187019
10563 187019 230966 267363 301164 321548 346541 362413 404663 461911 512086 566785 593009
$$ packed form
10640D466713j85711j78620j85186j69371j68453j79627j69244j51608j44714
10631B934179j40934j33297j16440j01999r3890q2988p9550r6085q7321q1431
10621A920244p9497o0219m1557n8698r5574r2048p8350l7275k1904n6026m1342
10610A257754k1784o728J4710K4209q982k1433j1340n626j3880n9794j29148j38579
10598H79379j32958q5294k1225Q902k1893o4857m8723j5821q236o0142j25322
10587C03810j07256j26227j58381j00667J8244j441j8288J1912M7973N5023O7164
10576h134O5443L1121Q318j352J5296K6467R933m350K1236J4025j668m831J5515
10563A87019M3947L6397L3801K0384K4993J5872M2250N7248N0175N4699K6224
$$ plain form
10552 593009 622575 649025 674212 705024 773460 834254 874515 901802 893464 879668 864019 848558
10540 848558 827893 833739 853825 872946 866549 836627 845417 867439 884447 916347 917232 898405
10528 898405 854862 803474 776716 778220 788705 787988 782332 787525 767310 757948 762244 741914 729152
10515 729152 716931 715919 711877 683357 660097 656380 655547 639962 613636 609858 599625 601158 597652
10502 597652 585498 575431 557663 524141 506724 512347 482776 455507 439661 412693 415564 405848
10490 405848 403949 388831 386100 399594 380043 373837 360230 361730 350460 362911 364382 352535
10478 352535 321978 300118 292004 298997 295942 299288 312933 322727 308540 277833 244392 220103
10466 220103 211887 206510 208316 188928 187548 180042 173527 143480 138458 147595 142818 149819 169000
$$ packed form
10552E93009K9566K6450K5187L0812O8436O0794M0261K7287q338j3796j5649j5461
10540H48558k0665N846K0086J9121o397k9922Q790K2022J7008L1900Q85j8827
10528H98405m3543n1388k6758J504J0485p17n656N193k0215r362M296k0330j2762
10515G29152j2221j012m042k8520k3260l717q33j5585k6326l778j0233J533l506
10502E97652j2154j0067j7768l3522j7417N623k9571k7269j5846k6968K871r716
10490D05848j899j5118k731J3494j9551o206j3607J500j1270J2451J471j1847
10478C52535l0557k1860q114O993l055L346J3645R794j4187l0707l3441k4289
10466B20103q216n377J806j9388j380p506o515l0047n022R137m777P001J9181
$$ plain form
10453 169000 151706 155296 178292 184415 187014 198102 203381 189934 172100 131479 96292 76234
10441 76234 86950 106539 91097 93212 84824 88677 81960 71020 74952 95954 110005 119013 129633
10428 129633 102883 74029 71469 67973 62870 74197 82582 67094 62133 60577 59944 80952 98001
10415 98001 94770 73592 79001 87683 94627 93941 93191 118631 123052 113942 123307 130138 127895 130930
10401 130930 130669 124099 139279 126944 111888 120492 133667 111922 100495 107624 117437 115883 121830
10388 121830 138109 152384 162591 177016 186671 189507 186287 173449 162528 170330 168498 157719
10376 157719 163307 169462 189019 182601 162885 168668 174732 140519 127030 124395 122142 123999 142993
10363 142993 158398 167280 157461 141394 136047 136058 142638 168583 178337 167189 163845 166731 173652 187421
$$ packed form
10453A69000j7294L590K2996O123K599J1088N279j3447j7834m0621l5187k0058
10441G6234J0716J9589j5442K115q388L853o717j0940L932K1002J4051R008J0620
10428A29633k6750k8854k560l496n103J1327Q385j5488m961j556o33K1008J7049
10415I8001l231k1178N409Q682O944o86p50K5440M421r110R365O831k243L035
10401A30930k61o570J5180j2335j5056Q604J3175k1745j1427P129R813j554N947
10388A21830J6279J4275J0207J4425R655K836l220j2838j0921P802j832j0779
10376A57719N588O155J9557o418j9716N783O064l4213j3489k635k253J857J8994
10363A42993J5405Q882r819j6067n347J1O580K5945R754j1148l344K886O921J3769
$$ plain form
10349 187421 176167 185116 210465 197954 171905 179530 199892 224679 227096 234147 252224 267659
10337 267659 274581 299708 340980 360562 383570 411314 452269 490416 524784 561069 588623 613366
10325 613366 656011 718083 813003 952844 1155215 1460693 1866264 2279666 2433362 2165391
10315 2165391 1726171 1340382 1058690 885167 766324 673123 605880 546025 501736 463830
10305 463830 438890 397223 383831 383019 357503 336105 337568 338094 323375 315047 319076 309118 304477
10292 304477 315585 318066 312873 303360 298559 283225 280556 272839 251445 261064 274623 260166 263184
10279 263184 253419 233785 218934 223504 224399 236141 232772 199080 175329 157749 138556 134165 128736
10266 128736 153833 146251 121404 117285 126555 120340 142228 155551 145548 137318 165669 184129
$$ packed form
10349A87421j1254Q949K5349j2511k6049P625K0362K4787K417P051J8077J5435
10337B67659O922K5127M1272J9582K3008K7744M0955L8147L4368L6285K7554K4743
10325F13366M2645O2072R4920J39841K02371L05478M05571M13402J53696k67971
10315B165391m39220l85789k81692j73523j18843r3201o7243n9855m4289l7906
10305D63830k4940m1667j3392q12k5516k1398J463N26j4719q328M029r958m641
10292C04477J1108K481n193r513m801j5334k669p717k1394R619J3559j4457L018
10279B63184r765j9634j4851M570Q95J1742l369l3692k3751j7580j9193m391n429
10266A28736K5097p582k4847m119R270o215K1888J3323j0003q230K8351J8460
$$ plain form
10254 184129 196350 196321 201907 217425 233819 251224 279889 289399 259890 236993 209722 191676
10242 191676 187563 208572 217897 217676 201296 176890 164821 171057 158292 141102 138488 144710 137753
10229 137753 133618 135576 134849 128576 119413 121593 116734 114057 114357 111753 78236 83171 105852 102283
10215 102283 79169 74886 67535 42423 60554 76073 96663 111435 114065 108661 97920 74013
10203 74013 80438 73239 47930 31670 45024 59926 45207 40912 54635 75892 73710 59667
10191 59667 39047 25601 8739 12974 9956 24348 28910 28042 22377 10454 15825 30444 43565
10178 43565 53891 48328 32098 20594 6575 10258 26598 32072 9575 4441 2857 6098 15059
10165 15059 10655 5024 -12248 -3984 12966 33185 21378 -5093 -7386 -11358 -10252 -6786 3277
$$ packed form
10254A84129J2221k9N586J5518J6394J7405K8665R510k9509k2897k7271j8046
10242A91676m113K1009R325k21j6380k4406j2069O236j2765j7190k614O222o957
10229A37753m135J958p27o273r163K180m859k677L00k604l3517M935K2681l569
10215A02283k3114m283p351k5112J8131J5519K0590J4772K630n404j0741k3907
10203G4013O425p199k5309j6260J3354J4902j4719m295J3723K1257k182j4043
10191E9667k0620j3446j6862M235l018J4392M562q68n665j1923N371J4619J3121
10178D3565J0326n563j6230j1504j4019L683J6340N474k2497n134j584L241Q961
10165A5059m404n631j7272Q264J6950K0219j1807k6471k293l972J106L466J0063
$$ plain form
10152 3277 -2453 -17240 -13992 -8094 506 13680 14102 9988 2030 -5927 -7145 -1689 1727 13251
10138 13251 21763 18741 26609 30050 25746 17108 11408 5590 4753 21134 8110 7369 8355 -10073
10124 -10073 -13743 -4963 10031 15813 26742 45040 29520 17787 14125 30244 33357 36269 35997
10111 35997 37997 19635 15472 8784 24751 44830 45204 29539 24875 34924 18325 10318 19536
10098 19536 22288 2997 -6737 8626 19522 14949 11414 25711 29536 19067 10197 34331 31191
10085 31191 24751 16081 9878 11694 29792 36385 15468 -401 840 9131 6668 11271 23899
10072 23899 21427 26616 17246 18563 15246 -2340 -14809 -17857 -4501 -4296 4712 25973 24737 23650
10058 23650 13577 1676 5393 11782 23735 23980 28932 31669 5289 18330 30512 46536 67337
$$ packed form
10152C277n730j4787L248N898Q600J3174M22m114p958p957j218N456L416J1524
10138A3251Q512l022P868L441m304q638n700n818q37J6381j3024p41R86j8428
10124a0073l670Q780J4994N782J0929J8298j5520j1733l662J6119L113K912k72
10111C5997K000j8362m163o688J5967K0079L74j5665m664J0049j6599q007R218
10098A9536K752j9291r734J5363J0896m573l535J4297L825j0469q870K4134l140
10085C1191o440q670o203J816J8098O593k0917j5869J241Q291k463M603J2628
10072B3899k472N189r370J317l317j7586j2469l048J3356K05R008K1261j236j087
10058B3650j0073j1901L717O389J1953K45M952K737k6380J3041J2182J6024K0801
$$ plain form
10045 67337 64638 57270 34009 34287 61678 70552 84340 102381 152440 178212 161717 122538 91831
10032 91831 89087 89445 70879 40993 20279 3914 4525 -564 -6786 -1592 6248 19259 24901 17058
10018 17058 7464 4942 17223 32393 40210 47526 29034 42142 64377 44844 61567 102432
10006 102432 97038 78739 78233 67673 83232 102244 113173 141573 184160 222364 239071 249492
9994 249492 260971 249813 236440 246985 233361 209552 197345 206993 253193 304379 348187 378445
9982 378445 406175 415580 433658 442571 464184 463891 462797 458693 434170 422403 408998 398832 377906
9969 377906 388129 386448 363024 322591 288433 257295 250087 222020 194626 168651 163943 181487
9957 181487 194625 173692 152403 136703 142483 126990 120467 120293 97599 104431 103737 106390 105866 93981
$$ packed form
10045F7337k699p368k3261K78K7391Q874J3788J8041N0059K5772j6495l9179l0707
10032I1831k744L58j8566k9886k0714j6365O11n089o222N194P840J3011N642p843
10018A7058r594k522J2281J5170P817P316j8492J3108K2235j9533J6723M0865
10006A02432n394j8299n06j0560J5559J9012J0929K8400M2587L8204J6707J0421
9994B49492J1479j1158j3373J0545j3624k3809j2207R648M6200N1186M3808L0258
9982C78445K7730R405J8078Q913K1613k93j094m104k4523j1767j3405j0166k0926
9969C77906J0223j681k3424m0433l4158l1138p208k8067k7394k5975m708J7544
9957A81487J3138k0933k1289j5700N780j5493o523j74k2694O832o94K653n24j1885
$$ plain form
9943 93981 94153 101026 131138 147340 132227 109866 104745 103650 85557 77255 99500 110388 117786
9930 117786 116219 115910 129585 173269 219891 248396 258040 224344 179761 134711 109294 86398
9918 86398 72700 78307 74166 71948 79479 75509 91947 93086 102332 114301 105446 83240 61752
9905 61752 75838 113219 112056 94455 97256 105967 90122 67967 35198 35989 64972 64230 66547
9892 66547 66029 56478 56440 58884 63994 62316 29671 30538 56602 55339 38570 42335 41513 59896 58895
9877 58895 41623 35680 32533 46848 46560 43740 44941 38024 30215 24204 42266 53467 42897 37265
9863 37265 27610 41663 22772 16668 17514 24956 24927 24955 27712 19894 2354 -13377 -18769 -894 -1572
9848 -1572 1410 11788 23162 14790 9068 -6729 -17845 748 12698 -8134 -17319 -9429 6909
$$ packed form
9943I3981J72O873L0112J6202j5113k2361n121j095j8093q302K2245J0888P398
9930A17786j567l09J3675M3684M6622K8505R644l3696m4583m5050k5417k2896
9918H6398j3698N607m141k218P531l970J6438J139R246J1969q855k2206k1488
9905F1752J4086L7381j163j7601K801Q711j5845k2155l2769P91K8983p42K317
9892F6547n18r551l8K444N110j678l2645Q67K6064j263j6769L765q22J8383j001
9877E8895j7272n943l147J4315k88k820J201o917p809o011J8062J1201j0570n632
9863C7265r655J4053j8891o104Q46P442k9K8K757p818j7540j5731n392J7875o78
9848a572K982J0378J1374q372n722j5797j1116J8593J1950k0832r185P890J6338
$$ plain form
9835 6909 24656 30813 11485 -7002 -4198 -8 2325 2483 6714 4602 -2680 2198 26994 35296
9821 35296 31539 46166 36327 17263 20428 18590 21123 25687 13455 3382 10428 17375 26741 46032
9807 46032 57698 47039 33193 18777 12965 12779 15379 26350 42441 45130 49449 57611 50225
9794 50225 68893 85913 82311 78638 71400 58343 62497 67676 88877 112971 116259 122522 121275
9781 121275 97664 79635 86820 95365 98979 105748 106855 117059 118538 108783 101464 94945 99882 91607
9767 91607 99729 96729 91022 89911 80486 73101 79285 102947 133371 138807 123230 135786 137381 123270
9753 123270 118502 99281 101453 82853 69122 69668 69650 70397 69349 71065 87538 94723 97586 95816
9739 95816 73675 58747 51696 36210 22547 9268 13038 28690 33867 24109 13745 20828 25757
$$ packed form
9835F909J7747O157j9328j8487K804M190K333J58M231k112p282M878K4796Q302
9821C5296l757J4627r839j9064L165j838K533M564j2232j0073P046O947R366J9291
9807D6032J1666j0659j3846j4416n812j86K600J0971J6091K689M319Q162p386
9794E0225J8668J7020l602l673p238j3057M154N179K1201K4094L288O263j247
9781A21275k3611j8029P185Q545L614O769J107J0204J479r755p319o519M937q275
9767I1607Q122l000n707j111r425p385O184K3662L0424N436j5577J2556J595j4111
9753A23270m768j9221K172j8600j3731N46j8P47j048J716J6473P185K863j770
9739I5816k2141j4928p051j5486j3663j3279L770J5652N177r758j0364P083M929
$$ plain form
9726 25757 53883 43989 17309 18176 27786 43672 46840 32697 25548 11912 7406 4831 14964
9713 14964 20129 26046 14773 1371 -927 -919 2330 -9028 -3749 -2585 3538 18643 25203 25528 22307
9698 22307 7642 1713 466 10924 21474 35174 33017 16227 16218 31472 29658 18969 -3497
9685 -3497 -1282 7252 10353 18066 1560 -15770 -30272 -28879 -31376 -21029 -32904 -24460 -17695 -5107
9671 -5107 10715 672 1355 18678 28949 18164 18065 21689 29782 19749 13807 13732 14427 3489 -12925
9656 -12925 -144 7698 -6791 -20785 -25467 -10019 -134 -1626 -5166 -359 1991 -25185 -42464
9643 -42464 -32551 -22997 -17721 -9897 -14501 -2055 16333 14253 12772 13625 17705 -625 -17356 -30875
9629 -30875 -19312 -18561 -24809 -23282 -29436 -9947 -3736 -2353 -1449 -12348 -27274 -20498 -151 -833
$$ packed form
9726B5757K8126r894k6680Q67R610J5886L168j4143p149j3636m506k575J0133
9713A4964N165N917j1273j3402k298QL249j1358N279J164O123J5105O560L25l221
9698B2307j4665n929j247J0458J0550J3700k157j6790rJ5254j814j0689k2466
9685c497K215Q534L101P713j6506j7330j4502J393k497J0347j1875Q444O765J2588
9671e107J5822j0043O83J7323J0271j0785r9L624Q093j0033n942p5O95j0938j6414
9656a2925J2781P842j4489j3994m682J5448R885j492l540M807K350k7176j7279
9643d2464R913R554N276P824m604J2446J8388k080j481Q53M080j8330j6731j3519
9629c0875J1563P51o248J527o154J9489O211J383R04j0899j4926O776K0347o82
$$ plain form
9615 -833 -2760 8981 3547 -1443 5368 12673 14933 20940 25641 14793 9388 19501 31487 25831
9601 25831 21111 35819 40841 35279 25788 3082 -6608 3107 29738 31975 12329 6253 28674
9588 28674 37525 19546 13816 22571 23784 30264 16403 5294 -10729 -24535 -17160 603 3562
9575 3562 15763 15309 23844 34626 20370 26486 4351 9621 5877 13542 16046 10987 11355 -6848
9561 -6848 -3327 23747 688 -12203 157 11932 20441 22312 24736 14084 4843 -9043 -23525
9548 -23525 -31724 -36317 -25505 -9491 -9154 -14813 -25477 -23879 -18572 -2555 -1988 3842 17267 29884
9534 29884 32443 26302 23797 22305 8241 490 -1668 15670 20818 5728 6942 1700 616 20430
9520 20430 18872 17762 13557 15016 2818 -5667 -12294 -28675 -21113 -9578 4276 5288 11805 22725
$$ packed form
9615h33j927J1741n434m990O811P305K260O007M701j0848n405J0113J1986n656
9601B5831m720J4708N022n562r491k2706r690R715K6631K237j9646o076K2421
9588B8674Q851j7979n730Q755J213O480j3861j1109j6023j3806P375J7763K959
9575C562J2201m54Q535J0782j4256O116k2135N270l744P665K504n059L68j8203
9561f848L521K7074k3059j2891J2360J1775Q509J871K424j0652r241j3886j4482
9548b3525q199m593J0812J6014L37n659j0664J598N307J6017N67N830J3425J2617
9534B9884K559o141k505j492j4064p751k158J7338N148j5090J214n242j084J9814
9520B0430j558j110m205J459j2198q485o627j6381P562J1535J3854J012O517J0920
$$ plain form
9506 22725 23388 35196 34062 25183 13327 22378 37893 27377 18062 10910 -19472 -23379 170
9493 170 3239 -2968 6940 10151 5391 4047 6925 18223 2297 -12956 -15546 -29291 -11333 23845
9479 23845 16942 15528 15002 35499 26760 3231 -21760 -16573 -7894 4626 16711 17028 10802 -3662
9465 -3662 -3158 25339 36595 10258 -3155 8347 17361 7057 15533 17839 3585 -4297 -7240
9452 -7240 -6475 -13628 -8373 3960 3949 -6130 -24714 -30819 -27611 -10140 -18011 6929 17270 14011
9438 14011 14052 3563 17523 22230 12415 7870 -7875 -9745 4785 -175 10206 12666 5635 -4224
9424 -4224 -10665 -1885 12156 12499 8785 5653 23964 39788 42280 50969 27456 16067 18167 6983
9410 6983 13852 14705 9886 12066 6509 5013 8978 18879 10348 -2050 -18379 -15438 13890 13059 33252
$$ packed form
9506B2725O63J1808j134q879j1856R051J5515j0516r315p152l0382l907K3549
9493A70L069o207R908L211m760j344K878J1298j5926j5253k590j3745J7958L5178
9479B3845o903j414n26K0497q739k3529k4991N187Q679J2520J2085L17o226j4464
9465c662N04K8497J1256k6337j3413J1502R014j0304Q476K306j4254p882k943
9452g240P65p153N255J2333j1j0079j8584o105L208J7471p871K4940J0341l259
9438A4011M1j0489J3960M707r815m545j5745j870J4530m960J0381K460p031r859
9424d224o441Q780J4041L43l714l132J8311J5824K492Q689k3513j1389K100j1184
9410F983O869Q53m819K180n557j496L965R901q531j2398j6329K941K9328q31K0193
$$ plain form
9395 33252 24694 12939 30852 16695 8410 25908 33647 21258 16495 10256 12990 28748 30464
9382 30464 14923 23927 42111 55423 57285 72700 60786 54699 39235 44675 33596 12399 15572
9369 15572 21334 17866 20161 35883 61762 64001 43243 39906 38608 42474 44243 45219 41558 38049
9355 38049 37407 34215 32722 46770 30146 24361 42957 51359 53679 60255 60779 58622 64505 70292
9341 70292 71132 62170 50170 60019 71880 68519 67269 71830 72053 65611 86754 102466 102248 95122
9327 95122 95822 98981 101443 90668 108438 114802 124438 127400 120663 115278 123914 127442 128212 135142 145813
9312 145813 143131 139250 147431 144200 149432 130443 119027 115131 127171 152303 169368 171964 169508
9299 169508 171327 172953 186201 196141 209775 220455 226233 227650 254711 263766 271272 287632 294236
$$ packed form
9395C3252q558j1755J7913j4157q285J7498P739j2389m763o239K734J5758J716
9382C0464j5541R004J8184J3312J862J5415j1914o087j5464N440j1079k1197L173
9369A5572N762l468K295J5722K5879K239k0758l337j298L866J769R76l661l509
9355C8049o42l192j493J4048j6624n785J8596Q402K320O576N24k157N883N787
9341G0292Q40q962j2000R849J1861l361j250M561K23o442K1143J5712k18p126
9327I5122P00L159K462j0775J7770O364R636K962o737n385Q636L528P70O930J0671
9312A45813k682l881Q181l231N232j8989j1416l896J2040K5132J7065K596k456
9299A69508J819J626J3248R940J3634J0680N778J417K7061R055P506J6360O604
$$ plain form
9286 294236 294020 305401 336369 360368 360092 368789 386583 405584 426869 447040 452984 477326 522708
9273 522708 580801 650996 711651 788844 858821 927828 1000716 1080195 1174981 1292079 1428240
9262 1428240 1559018 1684584 1828553 1989982 2181010 2365179 2544358 2775535 3075509 3434151
9252 3434151 3849234 4342351 4953283 5620353 6284468 6867505 7230694 7315547 7096337 6660843
9242 6660843 6107444 5533569 4988730 4504963 4094799 3731410 3412524 3141664 2908616 2737388
9232 2737388 2584614 2454392 2350440 2234754 2123710 2033103 1965349 1923616 1876289 1833157
9222 1833157 1791204 1748852 1700521 1665474 1642634 1603183 1562852 1536971 1514074 1502694 1482878
9211 1482878 1454741 1406747 1348079 1299403 1246708 1198514 1161500 1103602 1028789 988589 953080
$$ packed form
9286B94236k16J1381L0968K3999k76Q697J7794J9001K1285K0171N944K4342M5382
9273E22708N8093P0195O0655P7193O9977O9007P2888P9479R4786J17098J36161
9262A428240J30778J25566J43969J61429J91028J84169J79179K31177K99974L58642
9252C434151M15083M93117O10932O67070O64115N83037L63189Q4853k19210m35494
9242F660843n53399n73875n44839m83767m10164l63389l18886k70860k33048j71228
9232B737388j52774j30222j03952j15686j11044r0607o7754m1733m7327m3132
9222A833157m1953m2352m8331l5047k2840l9451m0331k5881k2897j1380j9816
9211A482878k8137m7994n8668m8676n2695m8194l7014n7898p4813m0200l5509
$$ plain form
9200 953080 892799 839751 799007 769316 737343 700157 675853 642486 610096 571074 545573 518921
9188 518921 497609 468256 451159 423487 411135 404680 386755 354810 325445 317738 312383 306623
9176 306623 292331 263436 292203 295175 266701 240566 231653 225391 219315 226710 235245 229282 220224
9163 220224 199474 183476 187380 188966 182290 180312 177509 169268 172625 173440 174473 167984 155449 175666
9149 175666 188624 199417 228097 245931 246513 267255 288847 305022 337110 368273 394260 427403
9137 427403 459611 478443 485280 474163 454058 414649 369529 325076 273175 223291 212316 202074
9125 202074 183105 165861 168652 177871 157194 130955 132780 119636 112996 139400 154703 148711 132915
9112 132915 134821 150003 147303 132880 141863 137815 125409 127212 143732 164080 170110 166154 165426
$$ packed form
9200I53080o0281n3048m0744k9691l1973l7186k4304l3367l2390l9022k5501k6652
9188E18921k1312k9353j7097k7672j2352o455j7925l1945k9365p707n355n760
9176C06623j4292k8895K8767K972k8474k6135q913o262o076P395Q535n963r058
9163B20224k0750j5998L904J586o676j978k803q241L357Q15J033o489j2535K0217
9149A75666J2958J0793K8680J7834N82K0742K1592J6175L2088L1163K5987L3143
9137D27403L2208J8832O837j1117k0105l9409m5120m4453n1901m9884j0975j0242
9125B02074j8969j7244K791R219k0677k6239J825j3144o640K6404J5303n992j5796
9112A32915J906J5182k700j4423Q983m048j2406J803J6520K0348O030l956p28
$$ plain form
9099 165426 189779 231650 299072 381426 438832 412186 363839 316257 267560 226758 194166 182268
9087 182268 175471 162926 150861 146434 145628 139886 128221 117215 130184 145827 136463 131141 132820
9074 132820 115703 123141 128690 120615 88595 70895 81743 92631 117156 140907 141495 125787 124626
9061 124626 106214 98542 92665 93141 98149 96809 81579 70083 70600 64249 70639 102182 101138 122910
9047 122910 133647 135815 111214 76292 82817 78181 57496 65395 68090 71779 71422 71964 75218 78829
9033 78829 62263 50279 48130 48749 53825 87317 114893 117283 101751 99191 85736 99674 85111
9020 85111 66062 58947 78854 72595 50781 54182 42976 60731 77048 63071 61582 54758 56609
9007 56609 65096 61831 68965 70021 83773 95630 101033 114848 112210 121032 135320 149915 162009
$$ packed form
9099A65426K4353M1871O7422Q2354N7406k6646m8347m7582m8697m0802l2592j1898
9087A82268o797j2545j2065m427q06n742j1665j1006J2969J5643r364n322J679
9074A32820j7117P438N549q075l2020j7700J0848J0888K4525K3751N88j5708j161
9061A24626j8412p672n877M76N008j340j5230j1496N17o351O390L1543j044K1772
9047A22910J0737K168k4601l4922O525m636k0685P899K695L689l57N42L254L611
9033G8829j6566j1984k149O19N076L3492K7576K390j5532k560j3455J3938j4563
9020H5111j9049p115J9907o259k1814L401j1206J7755J6317j3977j489o824J851
9007E6609Q487l265P134J056J3752J1857N403J3815k638Q822J4288J4595J2094
$$ plain form
8994 162009 153728 156325 158189 153019 173591 208629 246601 277784 333798 420529 524341 644998
8982 644998 762427 789704 688697 576272 479326 406839 350569 296067 266737 238168 217639
8971 217639 214613 194199 193971 177744 171875 178373 165235 141898 157190 169944 173221 172140 184863
8958 184863 190788 191856 202175 189567 203090 202589 216535 234394 250639 271346 264461 275498 319384
8945 319384 382330 458614 565854 713263 813046 812525 708899 572565 465296 384144 338269
8934 338269 298440 255443 237974 215784 198075 192968 175755 169003 157773 146957 144088 128490
8922 128490 144706 150127 137899 125072 132635 148521 134720 133756 148433 155486 145103 147396 139175
8909 139175 136135 128112 113679 117144 117080 101569 95086 92013 85510 83218 78469 79736 72839 75398
$$ packed form
8994A62009q281K597J864n170K0572L5038L7972L1183N6014Q6731J03812J20657
8982F44998J17429K7277j01007j12425r6946p2487n6270n4502k9330k8569k0529
8971B17639l026k0414k28j6227n869O498j3138k3337J5292J2754L277j081J2723
8958A84863N925J068J0319j2608J3523n01J3946J7859J6245K0707o885J1037M3886
8945C19384O2946P6284J07240J47409R9783n21j03626j36334j07269q1152m5875
8934C38269l9829m2997j7469k2190j7709n107j7213o752j1230j0816k869j5598
8922A28490J6216N421j2228j2827P563J5886j3801r64J4677P053j0383K293q221
8909A39175l040q023j4433L465o4j5511o483l073o503k292m749J267o897K559
$$ plain form
8895 75398 65981 55819 51015 42644 47471 59803 69469 46883 37163 36727 46265 55623 61692 58474
8881 58474 69883 66002 45957 44205 40175 48689 57537 60014 81816 71050 69432 66348 50439
8868 50439 36312 39977 41669 35111 34333 38714 29772 11870 3520 -6133 4373 11840 22272 22676
8854 22676 22460 24892 27395 24403 20455 15563 25976 14758 9727 11538 12327 20693 21262 32014 25755
8839 25755 19063 21824 11601 13134 36992 47787 44336 28847 34217 24444 25544 21769 26672 15082
8825 15082 11061 10678 -3637 1273 7584 -5015 -2037 6984 20329 28243 22536 19273 19189 31015
8811 31015 17220 -13820 -15339 -23391 -20826 7015 12406 14601 19944 26722 34321 23853 9900
8798 9900 -5883 5956 24384 31319 32736 30108 17896 17977 19904 21522 28573 33696 37323 42496
$$ packed form
8895G5398r417j0162m804q371M827J2332R666k2586r720m36R538R358O069l218
8881E8474J1409l881k0045j752m030Q514Q848K477K1802j0766j618l084j5909
8868E0439j4127L665J692o558p78M381q942j7902q350r653J0506P467J0432M04
8854B2676k16K432K503k992l948m892J0413j1218n031J811P89Q366N69J0752o259
8839B5755o692K761j0223J533K3858J0795l451j5489N370r773J100l775M903j1590
8825A5082m021l83j4315M910O311j2599K978R021J3345P914n707l263q4J1826
8811C1015j3795l1040j519q052K565K7841N391K195N343O778P599j0468j3953
8798I900j5783J1839J8428O935J417k628j2212Q1J927J618P051N123L627N173
$$ plain form
8784 42496 44009 24526 25528 29798 25818 28906 40217 37563 29491 31220 36172 49067 54801 53679
8770 53679 42680 25647 18113 19999 25844 20677 9646 27668 29445 19882 13071 30422 55206
8757 55206 51719 36861 34403 29660 54851 66320 59045 38009 31872 23702 13473 13218 21162 31344
8743 31344 44507 60141 62437 48229 29752 16000 25973 37997 38050 15700 23611 26404 26923 20788
8729 20788 18535 6512 15527 28319 12897 12270 26027 31900 19240 6721 8229 9108 6428 7384
8715 7384 20831 24377 32702 47740 32905 21253 9047 27276 30563 11484 11120 8678 16594
8702 16594 14306 25116 30743 34247 49675 39427 30043 52782 63512 75406 62779 43521 47536
8689 47536 47841 44458 39767 45969 46219 22179 21606 34873 37359 34791 19419 2678 14436 21160
$$ packed form
8784D2496J513j9483J002M270l980L088J1311k654q072J729M952J2895N734j122
8770E3679j0999j7033p534J886N845n167j1031J8022J777r563o811J7351K4784
8757E5206l487j4858k458m743K5191J1469p275k1036o137q170j0229k55P944J0182
8743C1344J3163J5634K296j4208j8477j3752R973J2024N3k2350P911K793N19o135
8729B0788k253j2023R015J2792j5422o27J3757N873j2660j2519J508Q79k680R56
8715G384J3447L546Q325J5038j4835j1652j2206J8229L287j9079l64k442P916
8702A6594k288J0810N627L504J5428j0248r384K2739J0730J1894j2627j9258M015
8689D7536L05l383m691O202K50k4040n73J3267K486k568j5372j6741J1758O724
$$ plain form
8675 21160 7110 2303 -4829 8142 5461 3961 11306 22765 22878 17641 21254 19188 7882 -2247
8661 -2247 4026 6005 9203 13936 -2386 7820 29521 34591 29045 31563 36344 31802 28457 44421
8647 44421 47917 35647 28403 22179 20204 19985 8585 3894 -8830 -23920 -31695 -14353 -10001 -7365
8633 -7365 4138 11901 21740 26548 20387 29930 29693 21681 17016 22316 18876 10966 35141 38502 27284
8618 27284 37686 31016 17498 17764 25436 23491 20699 34061 42700 33166 8737 -183 11428 12970
8604 12970 18099 26685 31597 39761 35157 16485 2561 -1940 15512 36917 42965 61242 57649
8591 57649 75425 69372 45318 31335 34517 37165 50239 38767 40104 42515 44100 43433 40101 42893
8577 42893 36693 33435 33700 25739 38579 46295 46378 49894 38006 31819 28526 39102 40349 37346 47696
$$ packed form
8675B1160j4050m807p132J2971k681j500P345J1459J13n237L613k066j1306j0129
8661b247O273J979L198M733j6322J0206K1701N070n546K518M781m542l345J5964
8647D4421L496j2270p244o224j975k19j1400m691j2724j5090p775J7342M352K636
8633g365J1503P763R839M808o161R543k37q012m665N300l440p910K4175L361j1218
8618B7284J0402o670j3518K66P672j945k792J3362Q639r534k4429q920J1611J542
8604A2970N129Q586M912Q164m604j8672j3924m501J7452K1405O048J8277l593
8591E7649J7776o053k4054j3983L182K648J3074j1472J337K411J585o67l332K792
8577D2893o200l258K65p961J2840P716Q3L516j1888o187l293J0576J247l003J0350
$$ plain form
8562 47696 43125 38446 45672 50542 56414 37380 44975 57321 57670 53032 60898 72338 79624 106834
8548 106834 107205 78318 62783 45552 60628 52371 42931 48404 43174 52137 57375 51190 34814
8535 34814 15300 17615 11408 5209 6832 20807 28152 40000 47207 59965 75794 97235 102389
8522 102389 96789 78075 75571 81472 88162 95037 87839 56927 52014 67099 67547 85189 98184
8509 98184 85771 76705 80952 98047 107123 121381 117951 111523 94234 92721 108211 99813 90445
8496 90445 86717 84914 79048 104727 123854 162648 197549 203764 198992 207850 205293 201080 205612 208923
8482 208923 193032 164647 132349 138759 130793 116643 107345 118268 125244 118441 120710 131924 132784
8469 132784 135322 140410 141972 161941 174244 166445 172623 178745 152526 118191 108793 102813 114214
$$ packed form
8562D7696m571m679P226M870N872j9034P595J2346L49m638P866J1440P286K7210
8548A06834L71k8887j5535j7231J5076q257r440N473n230Q963N238o185j6376
8535C4814j9514K315o207o199J623J3975P345J1848P207J2758J5829K1441N154
8522A02389n600j8714k504N901O690O875p198l0912m913J5085M48J7642J2995
8509I8184j2413r066M247J7095R076J4258l430o428j7289j513J5490q398r368
8496I0445l728j803n866K5679J9127L8794L4901O215m772Q858k557m213M532L311
8482B08923j5891k8385l2298O410p966j4150r298J0923O976o803K269J1214Q60
8469A32784K538N088J562J9969J2303p799O178O122k6219l4335r398n980J1401
$$ plain form
8456 114214 105204 98036 96203 95577 91138 85522 86796 72568 77961 98938 98595 92591 88503 87196
8442 87196 93304 70639 47644 60248 63936 53247 41075 9449 62 28289 39306 49253 53517
8429 53517 46579 31110 20645 25305 32281 35195 31033 16004 20691 17512 11113 15013 18676 23361
8415 23361 6564 9315 100 3853 27878 40382 37936 37225 30038 19410 24726 34881 46550
8402 46550 42837 18941 13816 12138 15648 24112 9693 5863 4894 4389 -5846 10565 25646 34803
8388 34803 33995 12707 3776 5620 -4228 -10682 11443 16118 25797 51007 64855 92291 116898
8375 116898 142576 173369 156632 129619 108745 88186 73850 57558 44132 45856 37256 24827
8363 24827 23956 18594 37803 51564 30921 16058 11107 3550 19776 21787 18870 22091 34679
$$ packed form
8456A14214r010p168j833o26m439n616J274j4228N393K0977l43o004m088j307
8442H7196O108k2665k2995J2604L688j0689j2172l1626r387K8227J1017R947M264
8429E3517o938j5469j0465M660O976K914m162j5029M687l179o399L900L663M685
8415B3361j6797K751r215L753K4025J2504k446p11p187j0628N316J0155J1669
8402D6550l713k3896n125j678L510Q464j4419l830r69n05j0235J6411J5081R157
8388C4803q08k1288q931J844r848o454K2125M675R679K5210J3848K7436K4607
8375A16898K5678L0793j6737k7013k0874k0559j4336j6292j3426J724q600j2429
8363B4827q71n362J9209J3761k0643j4863m951p557J6226K011k917L221J2588
$$ plain form
8350 34679 50089 33693 14461 24288 46428 60106 54700 41913 39327 48476 71297 98837 112178
8337 112178 89323 96808 109694 126487 132331 144937 166595 181806 169626 140520 114220 99010
8325 99010 90890 67431 47302 45182 43583 43298 44179 55464 69029 65581 49418 34086 24012
8312 24012 32568 48428 29991 21438 19941 11400 11135 26265 42214 67558 89084 77508 51979
8299 51979 51133 40452 36865 54892 58041 47059 19548 10995 19526 27748 38742 34680 27883 27049
8285 27049 13413 -12115 -15305 7974 20498 11694 7969 14529 14434 -681 6951 9292 6457 24023
8271 24023 34315 15541 5959 16441 24789 22385 25751 25444 30813 9535 -6781 -875 -5069 -3995
8257 -3995 -8277 3211 5214 -13863 -21493 -21916 -19902 -13913 5721 -1798 6265 32465 25963 28046
$$ packed form
8350C4679J5410j6396j9232R827K2140J3678n406j2787k586R149K2821K7540J3341
8337A12178k2855P485J2886J6793N844J2606K1658J5211j2180k9106k6300j5210
8325I9010q120k3459k0129k120j599k85Q81J1285J3565l448j6163j5332j0074
8312B4012Q556J5860j8437q553j497q541k65J5130J5949K5344K1526j1576k5529
8299E1979q46j0681l587J8027L149j0982k7511q553Q531Q222J0994m062o797q34
8285B7049j3636k5528l190K3279J2524q804l725O560r5j5115P632K341k835J7566
8271B4023J0292j8774r582J0482Q348k404L366l07N369k1278j6316N906m194J074
8257c995m282J1488K003j9077p630m23K014N989J9634p519Q063K6200o502K083
$$ plain form
8243 28046 18902 24433 23902 23389 24132 16710 15360 14464 -8221 -3432 -6480 -9643 -12862 6576 18972
8228 18972 31138 15628 -12182 -14716 -8278 -6844 -10001 -6315 -7369 10379 29300 21258 563
8215 563 -26491 -44819 -40791 -17643 -1495 19486 20644 16264 9371 6902 771 1994 10512 2568
8201 2568 -13773 -9411 -6932 -6784 3389 -2461 -24799 -19426 -12847 -4773 -9766 -8499 4509 21967
8187 21967 30864 30661 32870 27682 11779 -5152 5363 11982 18238 24047 30951 9786 -7296 -16443
8173 -16443 -22559 -16762 19688 20920 12626 9253 -4575 -9485 4798 -2541 -14265 -14209 -17712 -31979
8159 -31979 -38596 -34585 -39594 -52501 -43644 -24583 -10468 8363 1474 6423 12607 -5038 -18370
8146 -18370 -32066 -41729 -33470 -21478 -10144 -13505 -9250 7699 28170 26367 10890 13056 17669
$$ packed form
8243B8046r144N531n31n13P43p422j350q96k2685M789l048l163l219J9438J2396
8228A8972J2166j5510k7810k534O438J434l157L686j054J7748J8921q042k0695
8215E63k7054j8328M028K3148J6148K0981J158m380o893k469o131J223Q518p944
8201B568j6341M362K479J48J0173n850k2338N373O579Q074m993J267J3008J7458
8187B1967Q897k03K209n188j5903j6931J0515O619O256N809O904k1165j7082r147
8173a6443o116N797L6450J232q294l373j3828m910J4283p339j1724N6l503j4267
8159c1979o617M011n009j2907Q857J9061J4115J8831o889M949O184j7645j3332
8146a8370j3696r663Q259J1992J1334l361M255J6949K0471j803j5477K166M613
$$ plain form
8133 17669 -3815 -28567 -31458 -30154 -16603 -6976 -8737 7472 29892 25887 14999 16250 7963
8120 7963 17936 36844 22294 -5753 -3267 -14051 -30604 -34720 -21051 -9373 -11891 -11232 5467
8107 5467 9936 13279 1482 -7173 -7891 6804 13697 11528 7825 -1640 2704 20627 27576 20101
8093 20101 11641 8158 -3376 -3721 3032 4710 -1700 -14158 -5029 494 13885 20968 11388 10341
8079 10341 1554 -6472 -9887 -3077 -9955 16306 17771 14192 19012 -5775 -8023 -12858 -6960 -4505
8065 -4505 -16502 -19975 -14339 -6561 8869 4865 -1047 -3897 5249 11294 -18823 -22149 -27202 -33542
8051 -33542 -18768 2724 19433 5399 -17247 -6423 -1674 -19807 -34321 -11480 12148 -1467
8039 -1467 -7761 -18828 -19403 13973 22942 11391 334 -4639 -10860 -1340 8131 15154 31502 37455
$$ packed form
8133A7669k1484k4752k891J304J3551R627j761J6209K2420m005j0888J251q287
8120G963R973J8908j4550k8047K486j0784j6553m116J3669J1678k518O59J6699
8107E467M469L343j1797q655p18J4695O893k169l703r465M344J7923O949p475
8093B0101q460l483j1534l45O753J678o410j2458R129N523J3391P083r580j047
8079A0341q787q026l415O810o878K6261J465l579M820k4787k248m835N898K455
8065d505j1997l473N636P778J5430m004n912k850R146O045l0117l326n053o340
8051c3542J4774K1492J6709j4034k2646J0824M749j8133j4514K2841K3628j3615
8039a467o294j1067n75L3376Q969j1551j1057m973o221R520R471P023J6348N953
$$ plain form
8025 37455 38840 19811 7389 22499 14123 3954 -4149 7206 21924 9898 -4408 23878
8013 23878 44563 33479 25314 862 -11283 831 145 -9355 -6571 -1931 23591 24167 10655
8000 10655 15228 18844 21759 28469 26321 14441 19701 14826 18568 20768 27021 32007 17927 3649
7986 3649 8892 19217 27391 26788 19595 10945 24261 25121 20117 37605 42348 42875 36323 20778 3370
7971 3370 16050 30741 20574 20733 7455 5274 11683 9871 9935 11125 -449 5566 19051 8462
7957 8462 19544 31873 28055 31882 24716 29075 28383 21925 28958 24564 20917 31173 34678 53980
7943 53980 45471 47947 41465 44792 38477 30383 21605 9948 -640 28521 24685 10139 6796 740
7929 740 -5785 -10498 -9217 17233 17382 4111 21565 35255 29889 24222 29041 30524 21060 8859
$$ packed form
8025C7455J385j9029j2422J5110q376j0169q103J1355J4718j2026j4306K8286
8013B3878K0685j1084q165k4452j2145J2114o86r500K784M640K5522N76j3512
8000A0655M573L616K915O710k148j1880N260m875L742K200O253M986j4080j4278
7986C649N243J0325Q174o03p193q650J3316Q60n004J7488M743N27o552j5545j7408
7971C370J2680J4691j0167J59j3278k181O409j812O4J190j1574O015J3485j0589
7957H462J1082J2329l818L827p166M359o92o458P033m394l647J0256L505J9302
7943E3980q509K476o482L327o315q094q778j1657j0588K9161l836j4546l343o056
7929G40o525m713J281K6450J49j3271J7454J3690n366n667M819J483r464j2201
$$ plain form
7915 8859 3091 1727 -8388 1022 7332 9592 -4111 11038 38327 38098 38977 42374 17940 8063
7901 8063 7681 10265 26211 36431 27038 25910 18014 14263 3237 6963 18665 11302 7832 -566
7887 -566 -2404 5305 21872 21901 12873 14872 -10785 -24092 -32154 -33554 -38532 -41248 -41473 -39022 -10790
7872 -10790 4001 -15852 -15805 -9278 -12254 -18252 -20558 -6066 -9085 -2314 -580 3781 37430 57338
7858 57338 44191 33351 22339 13744 13906 9958 14281 12124 -7588 9802 8424 6936 15058 23200
7844 23200 19689 19351 33136 17842 432 19955 29890 6630 -9090 2281 10327 4280 1286
7831 1286 4046 78 -9492 -10113 -10439 -22209 -26356 -32239 -47677 -35934 -16469 -5369 -8493 -5699
7817 -5699 -5854 -14264 -19211 -6244 -6509 -8511 -6773 -8952 -10911 -35438 -48422 -27919 -4984 21506
$$ packed form
7915H859n768j364j0115R410O310K260j3703J5149K7289k29Q79L397k4434r877
7901H063l82K584J5946J0220r393j128p896l751j1026L726J1702p363l470q398
7887e66j838P709J6567K9r028J999k5657j3307q062j400m978k716k25K451K8232
7872a0790J4791j9853M7O527k976n998k306J4492l019O771J734M361L3649J9908
7858E7338j3147j0840j1012q595J62l948M323k157j9712J7390j378j488Q122Q142
7844B3200l511l38J3785j5294j7410J9523R935k3260j5720J1371Q046o047k994
7831A286K760l968r570o21l26j1770m147n883j5438J1743J9465J1100l124K794
7817e699j55q410m947J2967k65k002J738k179j959k4527j2984K0503K2935K6490
$$ plain form
7803 21506 27676 11092 5599 -13479 -13935 -3936 -9037 -17162 -11123 -12981 1314 -8369 3578 7478
7789 7478 -11884 -22537 -19499 -12373 -4371 -3454 -4067 3742 8346 -6287 7201 18641 9099 2903
7775 2903 4408 20025 9238 -2530 310 -16855 -15228 -8729 -3978 -5490 -18178 -18803 -19385 -16802
7761 -16802 -20856 -32710 -31290 -19504 -29157 -31967 -26684 -24018 -18000 -22168 -27455 -31894 -38984 -18152
7747 -18152 -5813 703 -11555 -16317 -19553 -27299 -23585 -8508 3772 2140 -10442 -17542 -20563
7734 -20563 -29694 -26557 -13596 14433 20299 7458 -12487 -9197 -73 6719 -3995 -22568 -24405
7721 -24405 -30702 -29301 -22392 -13421 -9736 2125 2401 -4304 151 16871 29350 7948 -3602 3932
7707 3932 20004 18907 10976 32683 35529 35418 27716 26256 10290 -6665 4990 -6012 -10198 22692
$$ packed form
7803B1506O170j6584n493j9078m56R999n101q125O039j858J4295r683J1947L900
7789G478j9362j0653L038P126Q002R17o13P809M604j4633J3488J1440r542o196
7775B903J505J5617j0787j1768K840j7165J627O499M751j512j2688o25n82K583
7761a6802m054j1854J420J1786r653k810N283K666O018m168n287m439p090K0832
7747a8152J2339O516j2258m762l236p746L714J5077J2280j632j2582p100l021
7734b0563r131L137J2961K8029N866j2841j9945L290R124O792j0714j8573j837
7721b4405o297J401O909Q971L685J1861K76o705M455J6720J2479k1402j1550P534
7707C932J6072j097p931K1707K846j11p702j460j5966j6955J1655j1002m186L2890
$$ plain form
7693 22692 7327 -10212 5091 2976 -16734 -24701 -21010 -11415 1620 32397 52361 29713 15139
7680 15139 10484 4138 495 -6190 3526 -10197 -12203 -11118 -1663 5421 9461 8766 12598 14489 4107
7665 4107 5269 7368 326 4775 -3630 1051 -1459 -1672 5383 3766 -1700 -24167 -20472 -14747 4097
7650 4097 5123 -11260 -34141 -43836 -55683 -34853 1651 2371 -1529 23400 15527 5364 -240
7637 -240 6585 20994 39681 29869 17961 9851 949 4004 13401 28025 12507 -12372 -20278 -18712
7623 -18712 -15933 -10110 -11495 -17944 -11232 -404 -5539 5125 18191 -1947 5289 -52 -17034
7610 -17034 -4699 -3989 -28357 -26638 -35015 -22176 -11628 -9138 3605 13009 5327 5092 1365 -4273
7596 -4273 -20465 -22526 -31592 -36364 -33245 -14698 12952 1415 -1684 -3394 3405 -4410 -11153 -33023
$$ packed form
7693B2692j5365j7539J5303k115j9710p967L691R595J3035L0777J9964k2648j4574
7680A5139m655o346l643o685R716j3723k006J085R455P084M040o95L832J891j0382
7665D107J162K099p042M449q405M681k510k13P055j617n466k2467L695N725J8844
7650D097J026j6383k2881r695j1847K0830L6504P20l900K4929p873j0163n604
7637b40O825J4409J8687r812j1908q110q902L055R397J4624j5518k4879p906J566
7623a8712K779N823j385o449O712J0828n135J0664J3066k0138P236n341j6982
7610a7034J2335P10k4368J719q377J2839J0548K490J2743R404p682k35l727n638
7596d273j6192k061r066m772L119J8547K7650j1537l099j710O799p815o743k1870
$$ plain form
7582 -33023 -40172 -39615 -31252 -9202 2843 5715 4859 -4192 2976 -10623 -17869 -25895 -30391 -26570
7568 -26570 -13467 -2306 16007 9171 4843 16352 22048 5167 10046 -871 -6628 -2948 -14012
7555 -14012 -16577 -36650 -38086 -33179 -28486 798 -1636 -23992 -23606 -11264 -11250 -23494 -17811 -5492
7541 -5492 -33386 -50963 -68703 -69765 -56392 -41200 -39080 -33558 -23546 -23162 -27261 -38135 -41261
7528 -41261 -15757 -7089 -8763 -12239 -10405 -8340 -3245 14910 2250 -18669 -35696 -23425 -8841
7515 -8841 -8575 -28371 -35345 -29938 -19050 -1344 -5613 -4480 -1644 -13459 -5874 -2389 -7924 -6253
7501 -6253 -4727 -8172 -24590 -24535 -18830 -22427 -21778 -21605 -32539 -37972 -28241 -26600 -31872 -28084 -35300
7486 -35300 -18345 -6412 -11599 -28486 -51568 -43913 -16143 -6853 -22641 -26130 -8310 504 -12860
$$ packed form
7582c3023p149N57Q363K2050J2045K872q56r051P168j3599p246q026m496L821
7568b6570J3103J1161J8313o836m328J1509N696j6881M879j0917n757L680j1064
7555a4012k565k0073j436M907M693K9284k434k2356L86J2342J4j2244N683J2319
7541e492k7894j7577j7740j062J3373J5192K120N522J0012L84m099j0874l126
7528d1261K5504Q668j674l476J834K065N095J8155j2660k0919j7027J2271J4584
7515h841K66j9796o974N407J0888J7706m269J133K836j1815P585L485n535J671
7501f253J526l445j6418N5N705l597O49J73j0934n433R731J641n272L788p216
7486c5300J6955J1933n187j6887k3082P655K7770R290j5788l489J7820Q814j3364
$$ plain form
7473 -12860 -32256 -26241 -9524 -16991 -13379 -9745 5668 2302 -37183 -51204 -50972 -40707 -31522
7460 -31522 -27647 -25967 -11987 -3990 -13117 -32565 -27046 -20216 -19948 -13869 -14439 -22990 -26684 -12172
7446 -12172 1025 12450 14744 5876 6304 -174 -7375 2533 4251 16204 18562 945 -14526 -14189
7432 -14189 -4672 18370 11103 -23866 -26011 -7908 -13994 -29315 -29404 -35777 -42254 -47488 -55762 -46969
7418 -46969 -26215 -22804 -19786 -11754 -9388 128 10607 17824 15990 13049 16425 12240 -7678 -4996
7404 -4996 2285 12247 -4025 -18 5055 8774 5630 -10262 -4962 -122 7619 21132 23118 -5364
7390 -5364 -22434 -11373 -16709 -24628 -24331 -11332 -13023 -20776 -22901 -11464 -19656 -30315 -34224 -37964
7376 -37964 -36344 -20620 -21555 -25669 -34342 -20453 -15080 1370 16240 10823 6095 -6368 -21113
$$ packed form
7473a2860j9396O015J6717p467L612L634J5413l366l9485j4021K32J0265R185
7460c1522L875J680J3980P997r127j9448N519O830K68O079n70q551l694J4512
7446a2172J3197J1425K294q868M28o478p201R908J718J1953K358j7617j5471L37
7432a4189R517K3042p267l4969k145J8103o086j5321q9o373o477n234q274Q793
7418d6969K0754L411L018Q032K366R516J0479P217j834k941L376m185j9918K682
7404d996P281R962j6272M007N073L719l144j5892N300M840P741J3513J986k8482
7390e364j7070J1061n336p919K97J2999j691p753k125J1437q192j0659l909l740
7376c7964J620J5724r35m114q673J3889N373J6450J4870n417m728j2463j4745
$$ plain form
7363 -21113 -24486 -7791 -11854 -22001 -31019 -16919 -2936 -16415 -4685 3683 4475 -7996 -33749
7350 -33749 -26764 -11508 -17715 -25938 -38281 -32013 -19746 -6895 -6483 22271 26247 -1639 -13447
7337 -13447 -6914 -23723 -34901 -25986 -10481 -22392 -21011 -10386 -8400 -22425 -7552 -5605 -17478
7324 -17478 -8011 -19454 -28471 -33564 -29150 -29771 -31905 -28457 -35007 -34407 -27661 -11238 -17373 -267
7310 -267 15901 7664 6533 18581 21090 20700 13965 16221 12541 -9255 2268 216 9198 -717
7296 -717 -19605 -21802 -18460 -14087 11480 26507 17802 25427 26344 22346 15910 985 -8683 -9091 -20509
7281 -20509 -19195 -8039 -7192 -16872 -18459 -20174 -21654 -12410 5017 11585 20690 41126 30655 12117
7267 12117 12358 18185 17025 14576 -1088 -14803 -22236 -55639 -69311 -40506 -4592 5150 -19928
$$ packed form
7363b1113l373J6695m063j0147r018J4100J3983j3479J1730Q368P92j2471k5753
7350c3749O985J5256o207q223j2343O268J2267J2851M12K8754L976k7886j1808
7337a3447O533j6809j1178Q915J5505j1911J381J0625J986j4025J4873J947j1873
7324a7478R467j1443r017n093M414o21k134L448o550O00O746J6423o135J7106
7310b67J6168q237j131J2048K509l90o735K256l680k1796J1523k052Q982r915
7296g17j8888k197L342M373K5567J5027q705P625R17l998o436j4925r668m08j1418
7281b0509J314J1156Q47r680j587j715j480R244J7427O568R105K0436j0471j8538
7267A2117K41N827j160k449j5664j3715p433l3403j3672K8805L5914R742k5078
$$ plain form
7254 -19928 -28767 -24676 -17159 -2686 -17659 -20464 -20820 -38116 -53282 -38350 -29918 -9505 4706
7241 4706 -17196 -35470 -27852 -22338 -35494 -27563 -23904 -18739 -22047 -13763 -24466 -32922 -39444 -60820
7227 -60820 -43820 -28611 -30382 -28490 -4816 -6889 -32650 -28527 -33956 -38801 -34497 -28226 -27575 -20513
7213 -20513 -13701 -10465 -18354 -35827 -33679 -9852 -5095 3169 10835 11482 -7348 -8216 -3241 -20380
7199 -20380 -27944 -26293 -12417 -15193 -4923 -4548 5928 11907 -3297 -4782 -16241 -21308 -13190 -14984
7185 -14984 -17056 2072 7732 -987 5627 13918 17901 10754 25877 27797 -3843 -25681 -20343 -6664
7171 -6664 -19663 -15168 -7343 -1649 4482 10575 -8715 -9362 -11672 3269 15543 13778 5272 -8953
7157 -8953 -16766 -17224 -4880 5871 5267 -781 -4429 -13976 -24568 -16012 -28945 -37420 -30181 -27642
$$ packed form
7254a9928q839M091P517J4473j4973k805l56j7296j5166J4932Q432K0413J4211
7241D706k1902j8274P618N514j3156P931L659N165l308Q284j0703q456o522k1376
7227f0820J7000J5209j771J892K3674k073k5761M123n429m845M304O271O51P062
7213b0513O812L236p889j7473K148K3827M757Q264P666O47j8830q68M975j7139
7199b0380p564J651J3876k776J0270L75J0476N979j5204j485j1459n067Q118j794
7185a4984k072J9128N660q719O614Q291L983p147J5123J920l1640k1838N338J3679
7171f664j2999M495P825N694O131O093j9290o47k310J4941J2274j765q506j4225
7157h953p813m58J2344J0751o04o048l648r547j0592Q556j2933q475P239K539
$$ plain form
7143 -27642 -36529 -28116 -25247 -29135 -18424 71 30473 32472 8517 -11603 -16458 -17423 -11681 1420
7129 1420 13712 15553 17264 31026 29663 16149 6355 -8285 -16051 14903 19646 12519 22283 27758
7115 27758 15038 5813 -2771 -14654 217 8794 -3470 -13398 -10800 -7313 945 5744 7270 -18270
7101 -18270 -41782 -31861 -13885 4992 -703 -7398 -19306 -31840 -29553 -35583 -34879 -51250 -41135
7088 -41135 -20328 2207 3063 -9404 -14630 -8097 -19001 -33834 -29565 -14298 8284 -10326 -8354
7075 -8354 2334 -14250 -12952 -5054 102 -361 -5555 -30024 -43463 -47564 -51392 -44746 -24661 -10915
7061 -10915 -10031 -22805 -29291 -23114 -32375 -34314 -15822 -2660 -7143 -16715 2900 1246 -1354 -14103
7047 -14103 -20256 -28992 -23426 -7245 -4863 3339 -2033 -7789 -21434 -22205 -23935 -30991 -44632 -34372
$$ packed form
7143b7642q887Q413K869l888J0711J8495L0402J999k3955k0120m855r65N742J3101
7129A420J2292J841J711J3762j363j3514r794j4640p766L0954M743p127R764N475
7115B7758j2720r225q584j1883J4871Q577j2264r928K598L487Q258M799J526k5540
7101a8270k3512R921J7976J8877n695o695j1908j2534K287o030P04j6371J0115
7088d1135K0807K2535Q56j2467n226O533j0904j4833M269J5267K2582j8610J972
7075h354J0688j6584J298P898N156m63n194k4469j3439m101l828O646K0085J3746
7061a0915Q84j2774o486O177r261j939J8492J3162m483r572J9615j654k600j2749
7047a4103o153q736N566J6181K382Q202n372n756j3645p71j730p056j3641J0260
$$ plain form
7033 -34372 -13578 596 -2511 -20114 -21292 -10017 -12703 -17024 -6587 -8413 2932 769 -1022
7020 -1022 -7164 -20531 -9666 1446 -5986 -14350 6320 15604 2748 7240 -11989 -22323 -25945
7007 -25945 -15733 -21386 -25217 -33087 -23286 4203 4013 2251 442 -3359 -8836 -15846 -2003 -12431
6993 -12431 -21305 -33674 -25848 -18473 -15823 -9495 -30420 -33888 -20712 -16936 -21020 -24247 -17597 -4479
6979 -4479 9994 26665 19780 20280 13876 -12513 -30736 -25091 -702 7959 -1328 -5307 -18031 -18468
6965 -18468 -7318 -21347 -32936 -35971 -47349 -27151 -15911 -19496 -23074 -17054 -24554 -16495 -9188
6952 -9188 815 12852 17018 21686 19398 14501 8253 5720 -3976 -21946 -14435 10932 10419 8543
6938 8543 -3301 -11032 1631 -1970 -13995 -45739 -59245 -53468 -35152 -27087 -16484 -16141 -7684
$$ packed form
7033c4372K0794J4174l107j7603j178J1275k686m321J0437j826J1345k163j791
7020a022o142j3367J0865J1112p432q364K0670R284j2856M492j9229j0334l622
7007b5945J0212n653l831p870R801K7489j90j762j809l801n477p010J3843j0428
6993a2431q874j2369P826P375K650O328k0925l468J3176L776m084l227O650J3118
6979d479J4473J6671o885N00o404k6389j8223N645K4389Q661r287l979j2724m37
6965a8468J1150j4029j1589l035j1378K0198J1240l585l578O020p500Q059P307
6952i188J0003J2037M166M668k288m897o248k533r696j7970P511K5367n13j876
6938H543j1844p731J2663l601j2025l1744j3506N777J8316Q065J0603L43Q457
$$ plain form
6925 -7684 7589 -5641 -12615 -15303 -30122 -30907 -27333 -22238 -27513 -28249 -20073 -18470 -14978 -18858 -26446
6910 -26446 -17902 -780 -4158 -33417 -29856 -12048 1050 12764 20876 34465 34273 24132 -1968
6897 -1968 -35756 -43874 -40152 -20044 -8501 1101 793 -5990 -915 -7154 -3131 -8152 35 9025
6883 9025 25198 18986 1924 -7071 -27305 -35348 -20655 -7299 -8630 -18841 -18129 -6749 -15496
6870 -15496 -16132 -3935 8338 12150 13913 15805 -1877 -9583 -5806 5806 293 -2686 7486 17306
6856 17306 12442 9240 -8379 2658 -9374 4421 13803 -4330 -5402 -2108 -7804 -9091 -3241
6843 -3241 -10356 -20953 -5117 -16540 -33454 -32978 -25535 -13486 -10502 -1290 19514 7976 -13636
6830 -13636 -10915 -11114 -12439 -30160 -25208 -3866 -2120 -5940 7494 9485 -10655 -34600 -22609
$$ packed form
6925g684J5273j3230o974k688j4819p85L574N095n275p36Q176J603L492l880p588
6910b6446Q544J7122l378k9259L561J7808J3098J1714Q112J3589j92j0141k6100
6897a968l3788q118L722K0108J1543R602l08o783N075o239M023n021Q187Q990
6883I025J6173o212j7062q995k0234q043J4693J3356j331j0211P12J1380q747
6870a5496o36J2197J2273L812J763J892j7682p706L777J1612n513k979J0172R820
6856A7306m864l202j7619J1037j2032J3795R382j8133j072L294n696j287N850
6843c241p115j0597J5836j1423j6914M76P443J2049K984R212K0804j1538k1612
6830a3636K721j99j325j7721M952K1342J746l820J3434J991k0140k3945J1991
$$ plain form
6817 -22609 -9906 -14040 -21658 -9258 2011 2234 -13169 -18321 -1630 7159 -7110 -16694 -19088
6804 -19088 -27358 -21865 7970 22731 23814 18370 34019 33932 18104 27989 31609 29773 15051 15626
6790 15626 30649 23958 9069 -7803 -27981 -29585 -9442 2434 11799 26854 24009 24530 13933
6777 13933 -1041 -9 6014 15614 16350 10258 -2363 -20016 -28047 -26326 -15802 -11830 9307 40997
6763 40997 37789 43951 30116 12268 21446 31792 35756 35043 38356 57110 67670 86169 115602
6750 115602 128036 112483 91871 68412 35285 6032 -4020 6524 27373 35330 17345 25524
6738 25524 28692 38403 30598 10334 3821 19479 20982 10560 26301 22320 15913 19111 31228
6725 31228 16570 18314 18726 24338 15762 12458 14002 3757 15961 30072 33577 28920 30258 26789
$$ packed form
6817b2609J2703m134p618J2400J1269K23j5403n152J6691Q789j4269r584k394
6804a9088q270N493K9835J4761J083n444J5649q7j5828R885L620j836j4722N75
6790A5626J5023o691j4889j6872k0178j604K0143J1876R365J5055k845N21j0597
6777A3933j4974J032O023R600P36o092j2621j7653q031J721J0524L972K1137L1690
6763D0997l208O162j3835j7848R178J0346L964p13L313J8754J0560J8499K9433
6750A15602J2434j5553k0612k3459l3127k9253j0052J0544K0849P957j7985Q179
6738B5524L168R711p805k0264o513J5658J503j0422J5741l981o407L198J2117
6725C1228j4658J744M12N612q576l304J544j0245J2204J4111L505m657J338l469
$$ plain form
6711 26789 9836 15214 22911 8835 7922 10290 17608 2518 -7994 7845 4622 4831 -5330 -9186
6697 -9186 -19095 -10038 -9012 -11726 1614 14030 23925 8909 4432 28623 28300 14735 -3895 -25588
6683 -25588 -41348 -31196 -31855 -26288 -16370 -19558 -15005 -15570 -9074 -3221 7614 19397 2048 -14098
6669 -14098 -13721 -22545 -27492 -26462 -14980 -3679 -3821 2297 1429 -18397 -41184 -47636 -24867 -14295
6655 -14295 -1058 6628 6500 -9480 -9109 -13608 -26598 -17508 -479 -8210 -16754 -22793 -35554 -36660
6641 -36660 -29636 -22446 -16315 -19934 -13333 315 13469 9308 -929 -2356 -16434 -22975 -49887
6628 -49887 -52217 -44432 -46321 -45539 -46181 -47874 -49007 -46243 -41060 -35934 -9715 -3139 -19954 -25453 -31061
6613 -31061 -38150 -35389 -47445 -28858 -955 -472 -14891 -23761 -19051 -7317 -18051 -22205 -33384
$$ packed form
6711B6789j6953N378P697j4076r13K368P318j5090j0512J5839l223K09j0161l856
6697i186r909R057J026k714J3340J2416R895j5016m477K4191l23j3565j8630k1693
6683b5588j5760J0152o59N567R918l188M553n65O496N853J0835J1783j7349j6146
6669a4098L77q824m947J030J1482J1301j42O118q68j9826k2787o452K2769J0572
6655a4295J3237P686j28j5980L71m499j2990R090J7029p731q544o039j2761j106
6641c6660P024P190O131l619O601J3648J3154m161j0237j427j4078o541k6912
6628d9887k330P785j889P82o42j693j133K764N183N126K6219O576j6815n499n608
6613c1061p089K761j2056J8587K7903M83j4419q870M710J1734j0734m154j1179
$$ plain form
6600 -33384 -52819 -44021 -26779 -27317 -35986 -21501 -13675 -12406 -7997 -14004 -11331 -17204 -23773 -31856
6586 -31856 -28483 -25856 -23374 -19408 -733 10934 19092 19584 5350 7549 -1740 -5713 -7931 -21212
6572 -21212 -32148 -14573 -5865 -8311 20480 16184 -2581 -2332 -13904 -17063 -25828 -25390 -20978 -3192
6558 -3192 779 1789 8514 2866 -15064 -22971 -31357 -16203 -15991 -19762 -13856 -11619 -987 -6973
6544 -6973 -10715 -2184 9692 15587 10206 -169 -11163 3025 13197 20310 13157 -597 -1869
6531 -1869 3040 -1377 7195 18564 30450 13885 -8707 -10800 -701 11345 22110 14570 9021
6518 9021 11210 24888 19816 21876 8013 -10403 -15444 -17111 -9004 -6358 -4092 12163 -17500 -32647
6504 -32647 -11145 7100 16437 23844 10340 12948 8254 -267 -1259 17669 17010 7984 310 -9445
$$ packed form
6600c3384j9435Q798J7242n38q669J4485P826J269M409o007K673n873o569q083
6586c1856L373K627K482L966J8675J1667Q158M92j4234K199r289l973k218j3281
6572b1212j0936J7575Q708k446K8791m296j8765K49j1572l159q765M38M412J7786
6558c192L971J010O725n648j7930p907q386J5154K12l771N906K237J0632n986
6544f973l742Q531J1876N895n381j0375j0994J4188J0172P113p153j3754j272
6531a869M909m417Q572J1369J1886j6565k2592k093J0099J2046J0765p540n549
6518I021K189J3678n072K060j3863j8416n041j667Q107K646K266J6255k9663j5147
6504c2647K1502J8245R337P407j3504K608m694q521r92J8928o59r026p674r755
$$ plain form
6490 -9445 -9086 -8770 -26740 -14165 -1313 -7338 -2374 4313 -9488 -23095 -3372 15792 3627
6477 3627 -9254 -11048 2173 23034 7894 -9729 -6664 -12992 -15017 -3389 -2302 -5221 -4733 7811
6463 7811 23699 25822 20218 31069 40100 29237 16679 6396 19058 29308 35210 20237 6275
6450 6275 -22017 -35956 -36201 -29491 -23195 5468 22521 21960 6326 6614 1814 5314 5796 6271 -7729
6435 -7729 -13929 -916 -4808 553 -7265 -10171 -11140 3704 906 1568 1977 9255 9852 5226 -11950
6420 -11950 -21926 -11175 -10163 -13170 -5046 14456 30081 27129 13173 -10694 -30166 -30631 -3277
6407 -3277 -10777 -24666 -6696 14652 5914 -753 -3877 16990 42298 28054 440 -5151 -13932
6394 -13932 -26459 -24986 -9395 12422 7566 5693 3472 -5941 -3571 -3671 -4079 6647 15362 7506
$$ packed form
6490i445L59L16j7970J2575J2852o025M964O687j3801j3607J9723J9164j2165
6477C627j2881j794J3221K0861j5140j7623L065o328k025J1628J087k919M88J2544
6463G811J5888K123n604J0851R031j0863j2558j0283J2662J0250N902j4973j3962
6450F275k8292j3939k45O710O296K8663J7053n61j5634K88m800L500M82M75j4000
6435g729o200J3013l892N361p818k906r69J4844k798O62M09P278N97m626j7176
6420a1950r976J0751J012l007Q124J9502J5625k952j3956k3867j9472m65K7354
6407c277p500j3889J7970K1348q738o667l124K0867K5308j4244k7614n591q781
6394a3932j2527J473J5591K1817m856j873k221r413K370j00m08J0726Q715p856
$$ plain form
6380 7506 -6509 -11741 -1760 -1737 -511 100 -3245 -3969 -6759 -11042 -2420 18794 18605 17598 430
6365 430 -90 13131 15014 25280 19024 -7056 -15659 -15502 -6072 12593 25968 18107 12516 15249
6351 15249 -3119 -9042 -10694 -29524 -35769 -24636 -22549 -1053 1595 -18268 -39997 -39250 -26817
6338 -26817 -300 18562 27885 16034 5342 -10066 -27321 -27153 -16408 -11645 -19712 -23151 -22992
6325 -22992 -11456 9467 10637 4261 8069 7460 15330 12036 11430 -4295 -17170 -24931 -13649 -7214
6311 -7214 -1061 -717 -2938 17370 27898 11305 -10859 -1824 -8463 -13426 -5407 10573 6630 1010
6297 1010 -3314 -14700 -17493 -5003 10704 20678 22167 21229 5251 -8008 -18859 -10874 -3329 4284
6283 4284 5517 -13263 -5097 9264 -4335 -9515 -9041 -10706 1680 3113 13804 4541 -2370 -15177
$$ packed form
6380G506j4015n232R981K3J226O11l345p24k790m283Q622K1214j89j007j7168
6365D30n20J3221J883J0266o256k6080q603J57R430J8665J3375p861n591K733
6351A5249j8368n923j652j8830o245J1133K087K1496K648j9863k1729P47J2433
6338b6817K6517J8862R323j1851j0692j5408j7255J68J0745M763q067l439J59
6325b2992J1536K0923J170o376L808o09P870l294o06j5725j2875p761J1282O435
6311g214O153L44k221K0308J0528j6593k2164R035o639m963Q019J5980l943n620
6297A010m324j1386k793J2490J5707R974J489r38j5978j3259j0851P985P545P613
6283D284J233j8780Q166J4361j3599n180M74j665J2386J433J0691r263o911j2807
$$ plain form
6269 -15177 -17584 -20069 -25562 -30271 -38754 -17661 -2870 2639 24420 28781 21513 13044 -7167 -9415
6255 -9415 -27145 -31254 -32378 -26512 -29327 -25327 -10199 10946 5093 -23816 -28677 -21147 -31737 -34089
6241 -34089 -27889 -4696 14865 2924 -29208 -32164 -14163 17312 21398 4153 733 1581 5897
6228 5897 12411 7463 1456 9774 22289 15047 -4893 -3424 8873 -13060 -21683 -26367 -41681 -43136
6214 -43136 -44919 -25606 -10124 3906 15532 2966 -1987 8962 -20638 -30246 -16175 -24029 -36442
6201 -36442 -33252 -29679 -6825 496 -2064 -24096 -35650 -26423 -14362 -22669 -24198 -20028 -20504 -9552
6187 -9552 -3200 959 -946 2495 3073 73 -3495 -7845 3821 22549 18110 -9111 -28584 -6946
6173 -6946 -5327 -2531 -10493 -22066 -30531 -30360 -29920 -28240 -19047 -12665 -1115 6906 -9666 -28762
$$ packed form
6269a5177k407k485n493m709q483K1093J4791N509K1781M361p268q469k0211k248
6255i415j7730m109j124N866k815M000J5128K1145n853k8909m861P530j0590k352
6241c4089O200K3193J9561j1941l2132k956J8001L1475M086j7245l420Q48M316
6228E897O514m948o007Q318J2515p242j9940J469J2297k1933q623m684j5314j455
6214d3136j783J9313J5482J4030J1626j2566m953J0949k9600r608J4071p854j2413
6201c6442L190L573K2854P321k560k2032j1554R227J2061q307j529M170m76J0952
6187i552O352M159j905L441N78l000l568m350J1666J8728m439k7221j9473K1638
6173f946J619K796p962j1573q465J71M40J680R193O382J1550Q021j6572j9096
$$ plain form
6159 -28762 -19478 -5499 -13649 -9057 -5350 8220 95 -461 866 -7159 -15960 -28117 -23925 -9169
6145 -9169 -9242 -17339 -17788 -20195 -16509 -34729 -15077 -8624 -9018 -13588 -21290 -30214 -22054 -16829 -10164
6130 -10164 -5634 8194 16591 3577 1869 26284 35818 21875 37504 42912 29923 20601 26957
6117 26957 31045 18729 2928 7707 6405 -19405 -28741 3807 474 -17394 -23569 -27287 -37974
6104 -37974 -40748 -26331 -9305 -15247 -17030 -32547 -25652 -14755 -21605 -33512 -22322 3290 3168
6091 3168 3244 -13137 -11991 -20968 -36115 -47894 -52746 -48130 -32244 -19725 -20854 -21307 -18208 -19272
6077 -19272 -28543 -24323 -13612 -23739 -20742 -29075 -36243 -27887 -14268 1959 -9769 -31031 -15104
6064 -15104 -7196 -20509 -31107 -48025 -48098 -18630 -2641 -8473 -15764 -16479 -1794 14757 22963 23310
$$ packed form
6159b8762R284J3979q150M592L707J3570q125n56J327q025q801j2157M192J4756
6145i169p3q097m49k407L686j8220J9652O453l94m570p702q924Q160N225O665
6130a0164M530J3828Q397j3014j708K4415R534j3943J5629N408j2989r322O356
6117B6957M088j2316j5801M779j302k5810r336L2548l333j7868o175l718j0687
6104c7974k774J4417J7026n942j783j5517O895J0897o850j1907J1190K5612j22
6091C168P6j6381J146q977j5147j1779m852M616J5886J2519j129m53L099j064
6077a9272r271M220J0711j0127K997q333p168Q356J3619J6227j1728k1262J5927
6064a5104P908j3313j0598j6918p3K9468J5989n832p291p15J4685J6551Q206L47
$$ plain form
6050 23310 29931 54087 44061 13669 -6456 -1809 4957 11474 10236 4151 22725 26846 7545
6037 7545 -4240 1758 -4807 -11018 -30549 -23790 -12471 3192 -4110 -7631 -7954 -14610 -27133 -2739
6023 -2739 8592 -6044 -8995 -22937 -14899 2471 2609 -2295 -8366 -504 -5969 -10546 -27079 -3920
6009 -3920 10561 26255 29021 8977 -11402 -10385 -7579 -779 -1797 -3229 -4151 6995 4075 7206
5995 7206 16839 11601 16507 9783 17158 9482 4157 -1368 -4303 9735 -3111 -26320 -30285 -20634
5981 -20634 10815 29809 25033 15190 11857 14797 16382 13952 -9905 -26459 -30518 -20390 -3916
5968 -3916 6870 10019 2907 391 16390 20012 13256 10942 10980 4498 -7395 -2029 -191 14813
5954 14813 15260 23140 7476 -5305 -10510 -2489 -1036 -23252 -23378 -22879 -14668 -28420 -19565 4059
$$ packed form
6050B3310O621K4156j0026l0392k0125M647O766O517j238o085J8574M121j9301
6037G545j1785N998o565o211j9531O759J1319J5663p302l521l23o656j2523K4394
6023b739J1331j4636k951j3942Q038J7370J38m904o071P862n465m577j6533K3159
6009c920J4481J5694K766k0044k0379J017K806O800j018j432r22J1146k920L131
5995G206R633n238M906o724P375p676n325n525k935J4038j2846k3209l965R651
5981b0634L1449J8994m776r843l333K940J585k430k3857j6554m059J0128J6474
5968c916J0786L149p112k516J5999L622o756k314L8o482j1893N366J838J5004
5954A4813M47P880j5664j2781n205Q021J453k2216j26M99Q211j3752Q855K3624
$$ plain form
5940 4059 8436 -6810 -14870 8765 3555 -8575 -18855 -36108 -43305 -31540 -27302 -30476 -12817
5927 -12817 -9140 -15656 -28554 -41643 -38389 -15489 -10884 -9825 -20582 -23324 -25481 -22815 -19645 -937
5913 -937 9306 28294 23895 32122 18639 17614 19239 28949 32158 19016 7405 7586 13695 14998
5899 14998 14339 8574 -3226 -3706 8594 -3587 6649 19718 2636 -13478 -24978 -26253 -34735
5886 -34735 -28973 -22163 -22274 -22658 -21474 -22599 -25083 -18481 -19745 -18718 -23695 -27585 -15076 -2796 4189
5871 4189 10671 13248 -2333 -13495 -20685 -26140 -12935 -2291 -2184 4994 11840 15184 27701 8543
5857 8543 -16145 -12215 -8921 -9539 -5109 -2 4179 -6449 -12312 -14927 -21519 -28143 -25099 -24681 -22037
5842 -22037 -29475 -16996 -5430 -13638 -16935 -19716 -4829 -20112 -11846 -2937 -11047 -14517 2909
$$ packed form
5940D059M377j5246q060K3635n210j2130j0280j7253p197J1765M238l174J7659
5927a2817L677o516j2898j3089L254K2900M605J059j0757k742k157K666L170J8708
5913i37J0243J8988m399Q227j3483j025J625R710L209j3142j1611J81O109J303
5899A4998o59n765j1800m80J2300j2181J0236J3069j7082j6114j1500j275q482
5886c4735N762O810j11l84J184j125k484O602j264J027m977l890J2509J2280O985
5871D189O482K577j5581j1162p190n455J3205J0644J07P178O846L344J2517j9158
5857H543k4688L930L294o18M430N107M181j0628n863k615o592o624L044M18K644
5842b2037p438J2479J1566q208l297k781J4887j5283Q266Q909q110l470J7426
$$ plain form
5829 2909 12633 7628 6965 21051 12884 11138 -9851 -6424 229 9749 4450 -15887 -17324 -23777
5815 -23777 -39100 -25780 -22233 -3824 -6352 -6231 43 -6277 -19009 -1695 2725 -14466 -22621
5802 -22621 -9859 1911 5549 4613 4118 -5082 -15170 -3572 2281 -7907 -849 7760 18633 18232
5788 18232 12308 2877 7360 -362 -18832 -12934 -10556 -21802 -35708 -43424 -41967 -25882 -20568 -10587
5774 -10587 -6727 -22031 -20978 -18354 -21254 -27098 -23091 -10655 3328 -9977 -19749 -22115 -11397
5761 -11397 1358 -6225 -11444 -7410 -9554 -5202 20841 6701 -15353 -22107 -13686 1930 17400
5748 17400 12646 23101 26239 21117 35595 42778 42162 25279 14747 10984 -2178 2099 3131 3583
5734 3583 -12755 -15055 -15125 -15151 -1660 1598 -13223 -20656 -27303 -20229 -7153 -11526 -369 -7456 -20191
$$ packed form
5829B909R724n005o63J4086q167j746k0989L427O653R520n299k0337j437o453
5815b3777j5323J3320L547J8409k528J21O274o320j2732J7314M420j7191q155
5802b2621J2762J1770L638r36m95r200j0088J1598N853j0188P058Q609J0873m01
5788A8232n924r431M483p722j8470N898K378j1246j3906p716J457J6085N314R981
5774a0587L860j5304J053K624k900n844M007J2436J3983j3305r772k366J0718
5761a1397J2755p583n219M034k144M352K6043j4140k2054o754Q421J5616J5470
5748A7400m754J0455L138n122J4478P183o16j6883j0532l763j3162M277J032M52
5734C583j6338k300p0k6J3491L258j4821p433o647P074J3076m373J1157p087j2735
$$ plain form
5719 -20191 -30247 -28843 -28814 -27854 -16747 -20591 -19397 -6720 -6647 -18065 -3931 -239 -7494 426 1698
5704 1698 15013 27669 21158 7922 -12655 7324 30767 11668 4039 1045 9273 7012 6202
5691 6202 -3092 -5916 2760 5558 3100 -1856 -12126 -20729 -33322 -37662 -25749 -10792 -1346 6765
5677 6765 1418 -2188 -10998 2200 2109 -3357 2152 -3429 -7969 -5049 -3833 -11947 -27070 -50725 -37987
5662 -37987 -11601 -7070 -22419 -20002 -15450 -8756 -17626 -9847 4453 1012 -13220 -41322 -35813
5649 -35813 -37134 -35385 -14632 -8101 8281 12541 6126 866 -580 3043 1892 17797 -1650 -5768
5635 -5768 -8200 -23251 -21143 -9174 8743 14621 16931 5368 -20575 -23403 -22929 -19328 4314 -117
5621 -117 -12279 -15627 -13113 30357 36501 14209 10483 8280 14212 -1522 -19427 -7139 5092
$$ packed form
5719b0191j0056J404K9R60J1107l844J194J2677P3j1418J4134L692p255P920J272
5704A698J3315J2656o511j3236k0577J9979K3443j9099p629k994Q228k261q10
5691F202r294k824Q676K798k458m956j0270q603j2593m340J1913J4957R446Q111
5677F765n347l606q810J3198r1n466N509n581m540K920J216q114j5123k3655J2738
5662c7987K6386M531j5349K417M552O694q870P779J4300l441j4232k8102N509
5649c5813j321J749K0753O531J6382M260o415n260j446L623j151J5905j9447m118
5635e768k432j5051K108J1969J7917N878K310j1563k5943k828M74L601K3642m431
5621a17j2162l348K514M3470O144k2292l726k203N932j5734j7905J2288J2231
$$ plain form
5608 5092 2456 -1532 2470 -2880 -5843 14755 17183 14485 -4511 -10029 4224 -1197 -8494 -23320
5594 -23320 -16150 -365 -16014 -38621 -15447 -2540 -5213 -11824 -11451 -11169 -8361 -1289 4995 -4083
5580 -4083 -2275 16603 30853 9200 1671 6951 4441 3673 -10154 -30587 -34271 -34094 -30704 -27780
5566 -27780 -9357 -1312 4337 -4476 -18721 -23090 -16660 -10693 -2227 8169 1391 -20463 -25960 -1779
5552 -1779 3312 9780 11282 10779 15083 25389 15990 -11438 -25165 -40473 -38252 -29649 -23908 -11434
5538 -11434 14087 30559 30058 16150 -244 3992 -779 -11515 -14057 -15595 -25439 -42603 -46092
5525 -46092 -43749 -28666 -16294 -18463 -31042 -20702 -23543 -18049 -26926 -33977 -24828 -23442 -13219
5512 -13219 -1879 -3893 265 5110 -3558 -3990 8470 -11511 -9700 2487 13110 3458 -19624
$$ packed form
5608E092k636l988M002n350k963K0598K428k698j8996n518J4253n421p297j4826
5594b3320P170J5785j5649k2607K3174J2907k673o611L73K82K808P072O284r078
5580d083J808J8878J4250k1653p529N280k510p68j3827k0433l684J77L390K924
5566b7780J8423Q045N649q813j4245m369O430N967Q466J0396o778k1854n497K4181
5552a779N091O468J502n03M304J0306r399k7428j3727j5308K221Q603N741J2474
5538a1434K5521J6472n01j3908j6394M236m771j0736k542j538r844j7164l489
5525d6092K343J5083J2372k169j2579J0340k841N494q877p051R149J386J0223
5512a3219J1340k014M158M845q668m32J2460j9981J811J2187J0623r652k3082
$$ plain form
5499 -19624 -33283 -26443 -19697 -18459 -17714 -21007 -23435 -15778 -10336 -7237 -18816 -15826 -4138 -3261
5485 -3261 11199 18878 11257 9865 -1303 -1754 18338 3897 -2137 1171 2605 -3440 -4330 -1516
5471 -1516 -6127 -17745 -5127 2094 -6087 -21656 -32294 -11614 8995 12215 12075 7961 -1203 -28702
5457 -28702 -5514 19818 -1164 -31701 -47092 -23341 6151 8982 6319 -14153 -24431 -18767
5445 -18767 -14808 -15691 10817 16518 8409 -6514 -39269 -51433 -27153 -19066 -13407 -14099 -21946 -19660
5431 -19660 -18610 -19914 -17399 -7613 -16217 -12268 -5232 -22113 -30103 -28831 -24286 -1025 7401 6928
5417 6928 19194 30077 29729 3113 -5567 -11160 -18234 -19797 -20083 -20505 -12874 8332 22616 14961
5403 14961 20340 19940 4133 2310 -705 -4148 -18742 -11463 -3896 2441 9654 11556 10344 8375
$$ packed form
5499a9624j3659O840O746J238P45l293k428P657N442L099j1579K990J1688Q77
5485c261J4460P679p621j392j1168m51K0092j4441o034L308J434o045q90K814
5471a516m611j1618J2618P221q181j5569j0638K0680K0609L220j40m114r164k7499
5457b8702K3188K5332k0982l0537j5391K3751K9492K831k663k0472j0278N664
5445a8767L959q83K6508N701q109j4923l2755j2164K4280Q087N659o92p847K286
5431a9660J050j304K515R786q604L949P036j6881p990J272M545K3261Q426m73
5417F928J2266J0883l48k6616q680n593p074j563k86m22P631K1206J4284p655
5403A4961N379m00j5807j823l015l443j4594P279P567O337P213J902j212j969
$$ plain form
5389 8375 5858 -18320 -5794 -2756 -9904 -20266 -30155 -51002 -47703 -18184 2237 -5175 -7358
5376 -7358 -7226 -2962 677 20832 12577 6803 7939 4125 8871 4366 5408 7551 -13648 -17100 -14781
5361 -14781 -3537 5739 -316 -11570 -2859 -25651 -36828 -28896 -14598 -5446 -8583 -8809 -13491 -10124
5347 -10124 -8488 -1918 10642 6031 19195 33897 8770 409 8527 16250 27929 39713 20828
5334 20828 6848 -4092 -16774 -9374 8654 2633 3598 18747 22874 28453 16490 1825 -12045
5321 -12045 4549 14633 1285 3697 17149 5723 8811 14342 15875 18691 11801 16320 15069
5308 15069 12968 43 -1319 8376 20882 13011 891 -11297 7847 14144 -4437 -10445 -20343
5295 -20343 -16969 -10077 -5593 22094 39398 40943 30874 5889 -1778 -1050 -9680 8197 -5602
$$ packed form
5389H375k517k4178J2526L038p148j0362r889k0847L299K9519K0421p412k183
5376g358J32M264L639K0155q255n774J136l814M746m505J042K143k1199l452K319
5361a4781J1244R276o055j1254Q711k2792j1177P932J4298R152l137k26m682L367
5347a0124J636O570J2560m611J3164J4702k5127q361Q118P723J1679J1784j8885
5334B0828j3980j0940j2682P400J8028o021R65J5149M127N579j1963j4665j3870
5321a2045J6594J0084j3348K412J3452j1426L088N531J533K816o890M519j251
5308A5069k101j2925j362R695J2506p871j2120j2188J9144O297j8581o008r898
5295b0343L374O892M484K7687J7304J545j0069k4985p667P28q630J7877j3799
$$ plain form
5282 -5602 -19506 -18512 -14806 -23535 -1454 14590 14670 2995 -16966 -16702 -18862 -30873 -28351 -14075
5268 -14075 -13382 -10122 -9134 -24060 -17362 2473 8202 1652 -9608 -17319 -5225 2618 4179 11560
5254 11560 -15659 -18458 -6034 -6766 -6692 -18272 -10709 -3608 -18134 -28622 -22921 -7975 -10729 -22905
5240 -22905 -2949 10674 11350 -1577 5864 6956 12020 20316 20613 17273 19270 8310 3206 7800
5226 7800 2199 -7081 -16337 1925 6925 -4601 354 10298 4303 -5160 819 -6981 -7516 -8326 -2295
5211 -2295 9554 2523 12467 20242 23279 19016 9584 6587 -6292 -3483 -14850 -3909 2328 9028
5197 9028 25059 10232 -9412 -18716 -4610 7003 14445 3548 1387 4404 9199 -2321 585
5184 585 -25609 -32315 -5769 5601 13326 4614 -5921 -11224 -20699 -31498 -11340 6803 8970
$$ packed form
5282e602j3904R94L706q729K2081J6044Q0j1675j9961K64k160j2011K522J4276
5268a4075O93L260R88j4926O698J9835N729o550j1260p711J2094P843J561P381
5254A1560k7219k799J2424p32P4j1580P563P101j4526j0488N701J4946k754j2176
5240b2905J9956J3623O76j2927P441J092N064Q296K97l340J997j0960n104M594
5226G800n601r280r256J8262N000j1526M955R944n995r463N979p800n35q10O031
5211b295J1849p031R944P775L037m263r432k997j2879K809j1367J0941O237O700
5197I028J6031j4827j9644r304J4106J1613P442j0897k161L017M795j1520K906
5184E85k6194o706K6546J1370P725q712j0535n303r475j0799K0158J8143K167
$$ plain form
5171 8970 4243 -8768 -20484 -21532 -9626 -6385 -11310 -6900 -3765 11358 6294 9736 4989 12677
5157 12677 19002 21577 8371 -15707 -22694 -33665 -21384 -13854 -24109 -3512 -2759 -1768 -6904 -6926
5143 -6926 -1241 -5804 -7075 -20917 -43345 -52850 -14644 -6779 -27774 -11479 -3184 153 6361 7602
5129 7602 -5144 6087 14017 24743 25681 17910 -1264 1989 -9449 -10714 -7245 -20969 -18765 -1617
5115 -1617 638 2401 -3825 -22934 -32205 -44347 -37385 -19035 -17867 -7110 -13976 -16212 -15698 -14707
5101 -14707 9236 31866 28287 22029 22039 19838 6959 -7342 -13384 -12647 3071 3735 -254 5864
5087 5864 1991 5732 19271 7245 19150 23198 18723 -2355 -12246 -6814 4054 8561 21146
5074 21146 33840 19771 -809 -5889 -7715 -4657 -3127 -10529 -16671 -8285 10483 14947 15264 -138
$$ packed form
5171H970m727j3011j1716j048J1906L241m925M410L135J5123n064L442m747P688
5157A2677O325K575j3206k4078o987j0971J2281P530j0255K0597P53R91n136k2
5143f926N685m563j271j3842k2428r505L8206P865k0995J6295Q295L337O208J241
5129G602j2746J1231P930J0726R38p771j9174L253j1438j265L469j3724K204J7148
5115a617K255J763o226j9109r271j2142O962J8350J168J0757o866k236N14R91
5101a4707K3943K2630l579o258J0k201j2879j4301o042P37J5718O64l989O118
5087E864l873L741J3539j2026J1905M048m475k1078r891N432J0868M507J2585
5074B1146J2694j4069k0580n080j826L058J530p402o142Q386J8768M464L17j5402
$$ plain form
5060 -138 -15086 -18473 -11082 -17303 -21768 -10444 -21865 -18937 -10691 4818 19724 20843 20134 14350
5046 14350 -9845 -16747 -12974 -19559 -33680 -11361 3537 5385 7251 7220 9648 7782 19824 34141
5032 34141 6915 3194 -3449 -14746 -3554 -7970 -18254 -17287 -12643 1177 -680 -13191 -13295 -11819
5018 -11819 471 -8038 -14422 -23232 -17351 -6283 -8654 -735 8670 8972 18018 13382 15441 3698
5004 3698 6497 -16952 -30446 -17685 -11013 3935 -3433 -1391 -3676 -4107 -21245 -21698 -15885 -14016
4990 -14016 -16524 -3078 5231 5387 -7428 10237 24458 14860 5962 5634 13318 10156 17820 7561
4976 7561 9446 8420 4984 -12190 -3766 -7400 1954 -13010 -7736 -6597 -13497 -26020 -19784 -27325
4962 -27325 -19832 -9394 -11360 -4285 -16563 -22373 -11057 -3681 -753 -3264 -11646 -14755 -1787 -2483
$$ packed form
5060a38j4948l387P391o221m465J1324j1421K928Q246J5509J4906J119p09n784
5046A4350k4195o902L773o585j4121K2319J4898J848J866l1K428j866J2042J4317
5032C4141k7226l721o643j1297J1192m416j0284R67M644J3820j857j2511j04J476
5018a1819J2290q509o384q810N881J1068k371P919R405L02R046m636K059j1743
5004C698K799k3449j3494J2761O672J4948p368K042k285m31j7138m53N813J869
4990a4016k508J3446Q309J56j2815J7665J4221r598q898l28P684l162P664j0259
4976G561J885j026l436j7174Q424l634R354j4964N274J139o900j2523O236p541
4962b7325P493J0438j966P075j2278n810J1316P376K928k511q382l109J2968o96
$$ plain form
4948 -2483 -25607 -41876 -25033 6191 7753 11340 -2246 -7575 10604 24497 35678 24449 19190
4935 19190 22346 33248 23785 8943 -1241 -13257 -18718 -13843 -12135 -8037 -11547 723 4203
4922 4203 -2573 12712 12544 -12084 -5823 2568 4083 5953 1352 11650 33535 32965 27753 23675
4908 23675 23906 3767 -19734 -29972 -24813 -27164 -41167 -31294 -35275 -37315 -19125 -15430 -31096
4895 -31096 -31110 -45586 -36240 -12112 8059 1092 -2214 4403 7111 -1923 5554 9921 -199 -7972
4881 -7972 -4330 -8778 -12335 2228 19419 18152 17982 13597 1308 -13584 -16555 -17653 -9239 -3161
4867 -3161 -13929 -8352 -5778 -14402 -24619 -31869 -21090 -18219 -15996 -24071 -41117 -13619 -4705 -4705
4853 -4705 -4972 1578 7479 16693 1197 -3826 5312 -8185 -16141 -21565 -7650 4829 20526 32519
$$ packed form
4948b483k3124j6269J6843L1224J562L587j3586n329J8179J3893J1181j1229n259
4935A9190L156J0902r463j4842j0184j2016n461M875J708M098l510J2270L480
4922D203o776J5285j68k4628O261Q391J515J870m601J0298K1885n70n212m078
4908B3675K31k0139k3501j0238N159k351j4003R873l981k040J8190L695j5666
4895c1096j4j4476R346K4128K0171o967l306O617K708r034P477M367j0120p773
4881g972L642m448l557J4563J7191j267j70m385j2289j4892k971j098Q414O078
4867c161j0768N577K574q624j0217p250J0779K871K223q075j7046K7498Q914%
4853d705k67O550N901R214j5496n023R138j3497p956n424J3915J2479J5697J1993
$$ plain form
4839 32519 20172 18236 33306 33550 35336 26038 9664 6936 18091 29195 34246 14961 1370
4826 1370 -1244 -15025 -20477 -10273 -7411 17145 24492 5821 -4075 -6885 6818 21499 9213
4813 9213 22500 26552 20969 7220 918 -1287 8859 30472 22632 7650 -1427 -2991 9152
4800 9152 19763 24025 21454 -604 12855 29659 16333 23093 17600 6616 3397 1844 -823
4787 -823 -5632 -8517 -3266 -9554 -8766 -16533 -19559 -10419 -7239 -6621 -1083 5912 14885 10000 -1135
4772 -1135 -22972 -27468 -28798 -31204 -17273 -9142 -7922 2270 -8237 -19265 -23566 -26495 -23870 -20955
4758 -20955 -18268 -17592 -3298 5551 18758 30431 18742 16652 12235 15768 30429 22711 5399
4745 5399 2461 -5958 4161 -11197 -32063 -24589 -1103 15648 12241 -4057 -35348 -39322 -16718
$$ packed form
4839C2519j2347j936J5070K44J786r298j6374k728J1155J1104N051j9285j3591
4826A370k614j3781n452J0204K862K4556P347j8671r896k810J3703J4681j2286
4813I213J3287M052n583j3749o302k205J0146K1613p840j4982r077j564J2143
4800I152J0611M262k571k2058J3459J6804j3326O760n493j0984l219j553k667
4787h23m809k885N251o288P88p767l026R140L180O18N538O995Q973m885j1135
4772a135k1837m496j330k406J3931Q131J220J0192j0507j1028m301k929K625K915
4758b0955K687O76J4294Q849J3207J1673j1689k090m417L533J4661p718j7312
4745E399k938q419J0119j5358k0866P474K3486J6751l407j6298l1291l974K2604
$$ plain form
4732 -16718 -12051 -9520 -895 1833 -1754 1405 -2761 -13079 -7774 -3998 7580 7058 -73 -3614
4718 -3614 -9427 1944 8145 9625 -7925 -26884 -38502 -37489 -33936 -29166 -14880 -7698 -17693 -10903
4704 -10903 -7163 6208 8577 14170 4093 -16127 -25172 -27119 -10555 8119 14766 4808 -17059
4691 -17059 -3173 19910 20103 14699 -11927 -21717 -19909 -20397 -4734 9402 16786 16332 -17238 -22652
4677 -22652 -1505 6461 12643 -6472 -15955 -10279 -6127 7358 7344 13902 24205 12234 14519 2672
4663 2672 -29559 -48877 -36320 -19573 -16798 -10520 -25401 -22422 -17224 -11315 -10324 -3236 -431 -15745
4649 -15745 -19172 -23348 -40527 -45039 -38328 -27791 -13605 -8898 -1839 14114 15575 9973 17270 6296
4635 6296 -7849 -1397 -10783 -5605 11548 22381 36331 30822 15992 27633 19392 11628 13936
$$ packed form
4732a6718M667K531Q625K728l587L159m166j0318N305L776J1578n22p131l541
4718c614n813J1371O201J480j7550j8959j1618J013L553M770J4286P182r995O790
4704a0903L740J3371K369N593j0077k0220r045j947J6564J8674O647r958k1867
4691a7059J3886K3083J93n404k6626r790J808m88J5663J4136P384m54l3570n414
4677b2652K1147P966O182j9115r483N676M152J3485j4O558J0303j1971K285j1847
4663B672l2231j9318J2557J6747K775O278j4881K979N198N909R91P088K805j5314
4649a5745l427m176j7179m512O711J0537J4186M707P059J5953J461n602P297j0974
4635F296j4145O452r386N178J7153J0833J3950n509j4830J1641q241p764K308
$$ plain form
4622 13936 -13579 -24169 -23264 -22094 -21647 -19880 -7773 -2813 -11032 -8612 -1827 -2657 -3924 -31183
4608 -31183 -43115 -36358 -31107 -16046 8413 15260 11481 -8122 -18086 -13017 -6043 5731 10233
4595 10233 10407 22962 28660 35973 33543 14325 2710 8923 -18232 -28084 -30280 -24766 -21423 -1549
4581 -1549 8356 -9126 -15420 -36371 -35379 -21458 -14483 -17420 -23414 -20898 -22488 -16617 -7103 6323
4567 6323 -286 1094 8839 -1487 -5687 -6027 3561 2510 1516 6537 -845 -5903 -23472 -41612 -27094
4552 -27094 -10281 -3171 3153 10545 6978 -1341 -16439 -24480 -27514 -25999 -17566 -8534 5876 13576
4538 13576 -4606 -24839 -36747 -39754 -36523 -29351 -7957 -13302 -25070 -30329 -29954 -33571 -33729 -28788
4524 -28788 -32249 -30162 -18182 -6966 199 1616 -10789 -9425 -1755 -6140 -17548 -19460 1801
$$ packed form
4622A3936k7515j0590R05J170M47J767J2107M960q219K420O785q30j267k7259
4608c1183j1932O757N251J5061K4459O847l779j9603r964N069O974J1774M502
4595A0233J74J2555N698P313k430j9218j1615O213k7155r852k196N514L343J9874
4581a549R905j7482o294k0951R92J3921O975k937n994K516j590N871R514J3426
4567F323o609J380P745j0326m200l40R588j051r94N021p382n058j7569j8140J4518
4552b7094J6813P110O324P392l567q319j5098q041l034J515Q433R032J4410P700
4538A3576j8182k0233j1908l007L231P172K1394n345j1768n259L75l617j58M941
4524b8788l461K087J1980J1216P165J417j2405J364P670m385j1408j912K1261
$$ plain form
4511 1801 -2025 -18095 -15199 -4048 -3271 -12452 5294 16066 -2270 -20218 -9542 5123 5235
4498 5235 9826 27688 29060 14120 8908 -5962 -17540 -21157 -15714 -8005 -8863 -5904 -5798 -26462
4484 -26462 -36459 -15519 -13526 -14236 12180 24190 18475 9192 -6896 -4224 -10374 1730 6207 80
4470 80 11146 12358 -2288 5594 2658 11303 20105 -9194 -13369 -24328 -25648 -15039 -10938 -17962
4456 -17962 -18205 -25664 -31708 -42298 -24455 -9388 1116 735 2378 4765 -4636 -3754 8179 12277
4442 12277 6948 -1351 -3080 19755 40817 44459 41472 35185 32253 24472 18035 7661 -8226 -20357
$$ packed form
4511A801l826j6070K896J1151P77r181J7746J0772j8336j7948J0676J4665J12
4498E235M591J7862J372j4940n212j4870j1578l617N443P709q58K959J06k0664
4484b6462r997K0940J993p10K6416J2010n715r283j6088K672o150J2104M477o127
4470H0J1066J212j4646P882k936Q645Q802k9299m175j0959j320J0609M101p024
4456a7962k43p459o044j0590J7843J5067J0504l81J643K387r401Q82J1933M098
4442A2277n329q299j729K2835K1062L642k987o287k932p781o437j0374j5887j2131
$$ [...]
##END NTUPLES=NMR SPECTRUM
##END=
