##TITLE=Analysis number 311977
Compound Code sb 01650
Book Reference 439/38
Project Code adrs
Chemist Name ronp
##JCAMPDX= 6.0         $$ Bruker NMR JCAMP-DX V2.0
##DATA TYPE= NMR SPECTRUM
##DATA CLASS= NTUPLES
##ORIGIN= Bruker BioSpin GmbH
##OWNER= NMR
$$ XWIN-NMR		Version 3.5
$$ Wed Jul 20 16:17:37 2005 GMT Daylight Time (UT+1h)  MAYBRIDGE\NMR@NMR_250MHZ
##.OBSERVE FREQUENCY= 250.131544655141
##.OBSERVE NUCLEUS= ^1H
##.ACQUISITION MODE= SIMULTANEOUS (DQD)
##.ACQUISITION SCHEME= undefined
##.AVERAGES= 16
##.DIGITISER RES= 18
##SPECTROMETER/DATA SYSTEM= dpx250
##.PULSE SEQUENCE= zg30
##.SOLVENT NAME= CDCl3
##.SHIFT REFERENCE= (INTERNAL, CDCl3, 0, 16.522)
##AUDIT TRAIL= $$ (NUMBER, WHEN, WHO, WHERE, WHAT)
$$ ##TITLE= Audit trail, XWIN-NMR		Version 3.5
$$ ##JCAMPDX= 5.01
$$ ##ORIGIN= Bruker BioSpin GmbH
$$ ##OWNER= NMR
$$ C:\u/data/dgb/nmr/ADRS/6220/pdata/1/auditp.txt
$$ ##AUDIT TRAIL=  $$ (NUMBER, WHEN, WHO, WHERE, WHAT)
(   1,<2005-07-20 16:17:15.97 +100>,<MAYBRIDGE\NMR>,<NMR_250MHZ>,
      <created by zg, POWCHK disabled, PULCHK disabled
       configuration hash MD5:
       62 19 C7 07 E1 42 D1 B7 37 6C 3D D0 77 39 F9 E6
       data hash MD5: 64K
       50 6A DA 78 28 03 50 A6 6B 42 C6 C9 07 8D 1A D1>)
(   2,<2005-07-20 16:17:28.00 +100>,<MAYBRIDGE\NMR>,<NMR_250MHZ>,
      <Start of raw data processing
       ef LB = 0.3 FT_mod = 6 PKNL = 1 SI = 32K 
       data hash MD5: 32K
       7D 40 E1 7B 44 1B AD 72 5F 5B 86 89 BF 44 A7 3D>)
(   3,<2005-07-20 16:17:30.50 +100>,<MAYBRIDGE\NMR>,<NMR_250MHZ>,
      <apk 
       data hash MD5: 32K
       95 97 D1 CB F6 02 A0 5F 74 29 A6 AD 60 93 E6 EC>)
(   4,<2005-07-20 16:17:31.47 +100>,<MAYBRIDGE\NMR>,<NMR_250MHZ>,
      <abs ABSG = 5 
       data hash MD5: 32K
       E0 6C 67 F2 A7 5C 9A 57 67 E3 33 A3 3C B0 DD 35>)
$$ ##END=
$$ 
$$ hash MD5
$$ FE AB 42 7B B8 8C 46 91 69 57 79 C4 6C C5 0D 0F
##$RELAX= 
##$RELAX= 
##$RELAX= 
##$RELAX= 
##$RELAX= 
##$RELAX= 
##$RELAX= 
$$ Bruker specific parameters
$$ --------------------------
##$DU= <C:\u>
##$EXPNO= 6220
##$NAME= <ADRS>
##$PROCNO= 1
##$TYPE= <nmr>
##$USER= <dgb>
##$AMP= (0..31)
100 100 100 100 100 100 100 100 100 100 100 100 100 100 100 100 100 100 
100 100 100 100 100 100 100 100 100 100 100 100 100 100 
##$AQSEQ= 0
##$AQ_mod= 3
##$AUNM= <au_zg>
##$AUTOPOS= <50 >
##$BF1= 250.13
##$BF2= 250.13
##$BF3= 250.13
##$BF4= 250.13
##$BF5= 500.13
##$BF6= 500.13
##$BF7= 500.13
##$BF8= 500.13
##$BYTORDA= 1
##$CFDGTYP= 0
##$CFRGTYP= 5
##$CHEMSTR= <none>
##$CNST= (0..31)
1 1 145 1 1 1 1 1 1 1 1 1 1 1 1 1 1 1 1 1 1 1 1 1 1 1 1 1 1 1 1 1 
##$CPDPRG= <>
##$CPDPRG1= <>
##$CPDPRG2= <>
##$CPDPRG3= <>
##$CPDPRG4= <mlev>
##$CPDPRG5= <mlev>
##$CPDPRG6= <mlev>
##$CPDPRG7= <mlev>
##$CPDPRG8= <mlev>
##$CPDPRGB= <>
##$CPDPRGT= <>
##$D= (0..31)
0 1 0 0 0 0 0 0 0 0.06 0 0 0 0 0 0 0.0002 0 0 0 0 0 0 0 0 0 0 0 0 0 0 
0 
##$DATE= 1121872635
##$DBL= (0..7)
120 120 120 120 120 120 120 120 
##$DBP= (0..7)
150 150 150 150 150 150 150 150 
##$DBP07= 0
##$DBPNAM0= <>
##$DBPNAM1= <>
$$ [...]
##$SUBNAM7= <"">
##$SUBNAM8= <"">
##$SUBNAM9= <"">
##$SW= 20.6930455092707
##$SWIBOX= (0..15)
0 0 3 0 0 0 0 0 0 0 0 0 0 0 0 0 
##$SW_h= 5175.983436853
##$TD= 65536
##$TD0= 1
##$TE= 295.16
##$TE2= 300
##$TE3= 300
##$TEG= 300
##$TL= (0..7)
0 120 120 120 120 120 120 120 
##$TP= (0..7)
150 150 150 150 150 150 150 150 
##$TP07= 0
##$TPNAME0= <>
##$TPNAME1= <>
##$TPNAME2= <>
##$TPNAME3= <>
##$TPNAME4= <>
##$TPNAME5= <>
##$TPNAME6= <>
##$TPNAME7= <>
##$TPOAL= (0..7)
0.5 0.5 0.5 0.5 0.5 0.5 0.5 0.5 
##$TPOFFS= (0..7)
0 0 0 0 0 0 0 0 
##$TUNHIN= 0
##$TUNHOUT= 0
##$TUNXOUT= 0
##$USERA1= <user>
##$USERA2= <user>
##$USERA3= <user>
##$USERA4= <user>
##$USERA5= <user>
##$V9= 5
##$VALIST= <valist>
##$VCLIST= <CCCCCCCCCCCCCCC>
##$VD= 0
##$VDLIST= <DDDDDDDDDDDDDDD>
##$VPLIST= <PPPPPPPPPPPPPPP>
##$VTLIST= <TTTTTTTTTTTTTTT>
##$WBST= 1024
##$WBSW= 4
##$XGAIN= (0..3)
0 0 0 0 
##$XL= 0
##$YL= 0
##$YMAX_a= 577793
##$YMIN_a= -585295
##$ZGOPTNS= <>
##$ZL1= 120
##$ZL2= 120
##$ZL3= 120
##$ZL4= 120
##$ABSF1= 16.522
##$ABSF2= -4.171173
##$ABSG= 5
##$ABSL= 3
##$ALPHA= 0
##$AQORDER= 0
##$ASSFAC= 0
##$ASSFACI= 0
##$ASSFACX= 0
##$ASSWID= 0
##$AUNMP= <proc_1d>
##$AZFE= 0.1
##$AZFW= 0.1
##$BCFW= 0
##$BC_mod= 0
##$BYTORDP= 0
##$COROFFS= 0
##$CY= 12.5
##$DATMOD= 1
##$DC= 0
##$DFILT= <>
##$DTYPP= 0
##$F1P= 14.0000005364418
##$F2P= -0.99999901652339
##$FCOR= 0.5
##$FTSIZE= 32768
##$FT_mod= 6
##$GAMMA= 0
##$GB= 0
##$INTBC= 1
##$INTSCL= 1
##$ISEN= 128
##$LB= 0.3
##$LEV0= 0
##$LPBIN= 0
##$MAXI= 10000
##$MC2= 0
##$MEAN= 0
##$ME_mod= 0
##$MI= 0
##$NCOEF= 0
##$NC_proc= -3
##$NLEV= 6
##$NOISF1= 0
##$NOISF2= 0
##$NSP= 0
##$NTH_PI= 0
##$NZP= 0
##$OFFSET= 16.522
##$PC= 1
##$PHC0= 146.5713
##$PHC1= -22.73134
##$PH_mod= 1
##$PKNL= yes
##$PPARMOD= 0
##$PSCAL= 4
##$PSIGN= 0
##$REVERSE= no
##$SF= 250.13
##$SI= 32768
##$SIGF1= 0
##$SIGF2= 0
##$SINO= 400
##$SIOLD= 32768
##$SREGLST= <1H.CDCl3>
##$SSB= 0
##$STSI= 32768
##$STSR= 0
##$SW_p= 5175.98343685301
##$SYMM= 0
##$S_DEV= 0
##$TDeff= 65536
##$TDoff= 0
##$TI= <Analysis number 999999
Compound Code 99
Book Reference 9
Project Code 9>
##$TILT= no
##$TM1= 0
##$TM2= 0
##$TOPLEV= 0
##$USERP1= <user>
##$USERP2= <user>
##$USERP3= <user>
##$USERP4= <user>
##$USERP5= <user>
##$WDW= 1
##$XDIM= 32768
##$YMAX_p= 313267890
##$YMIN_p= -142709
$$ End of Bruker specific parameters
$$ ---------------------------------
##NTUPLES= NMR SPECTRUM
##VAR_NAME=  FREQUENCY,     SPECTRUM/REAL,   SPECTRUM/IMAG
##SYMBOL=    X,             R,               I
##VAR_TYPE=  INDEPENDENT,   DEPENDENT,       DEPENDENT
##VAR_FORM=  AFFN,          ASDF,            ASDF
##VAR_DIM=   32768,         32768,           32768
##UNITS=     HZ,            ARBITRARY UNITS, ARBITRARY UNITS
##FACTOR=    0.157963299565203, 1,           1
##FIRST=     4132.6476996994, 0,             0
##LAST=      -1043.33573715361, 0,           0
##MIN=       -1043.33573715361, -142709,     0
##MAX=       4132.6476996994, 313267890,     0
$$ Real data points
##PAGE= N=1
##DATA TABLE= (X++(R..R)), XYDATA
$$ [...]
$$ plain form
16830 -6220 -7177 -9672 -8324 -7592 -9037 -10210 -5930 -2414 -807 -1223 -3236 -1619 508 5884 7305
16815 7305 2762 2735 620 476 -1727 -2209 -1752 1435 4287 4339 4261 5953 5905 2112 -833 -885 840 -1772
16797 -1772 -2611 -6320 -1815 1947 3700 2232 4626 2519 -1210 -1161 -6017 -8030 -7673 -955 2445 2810
16781 2810 1822 -1114 -322 1361 -800 -1826 620 4990 2437 788 1642 -634 -5788 -5992 -5874 3390
16765 3390 3698 114 3577 3366 -2476 -6793 -9103 -6583 -7200 -10259 -10862 -13682 -10952 -3215 1957 1462
16749 1462 -1234 -209 154 808 540 -1158 1123 224 -2663 -2586 -70 1290 2791 1045 -246 -114
16733 -114 4378 -561 -1449 -1455 -2172 -3622 861 942 2509 6084 6119 2474 3133 2576 -1170 1427 4470 2778
16715 2778 -3816 -8509 -7688 -8298 -4865 -2531 1915 2068 1565 -2560 -6789 -3440 4034 5482 -919 -3280
$$ packed form
16830f220r57k495J348P32j445j173M280L516J607m16k013J617K127N376J421
16815G305m543k7k115j44k203m82M57L187K852N2p8J692m8l793k945n2J725k612
16797a772q39l709M505L762J753j468K394k107l729M9m856k013L57O718L400L65
16781B810r88k936P92J683k161j026K446M370k553j649Q54k276n154k04J18R264
16765C390L08l584L463k11n842m317k310K520o17l059o03k820K730P737N172m95
16749A462k696J025L63O54k68j698K281q99k887P7K516J360J501j746j291J32
16733a14M492m939q88op17j450M483Q1J567L575L5l645O59n57l746K597L043j692
16715B778o594m693Q21o10L433K334M446J53n03m125m229L349P474J448o401k361
$$ plain form
16699 -3280 -2839 -1372 3342 4750 1731 419 4843 8893 7333 6835 635 1780 4545 -1554 -2684
16684 -2684 -6045 -6578 -7892 -6429 -4521 -3331 -3173 -2450 -1942 1232 -437 -6131 -7634 -4130 -3220 -3642
16668 -3642 612 -1396 -2203 -978 118 -4381 -5277 -3228 93 423 -2618 -6037 -2944 -629 -8950
16653 -8950 -9319 -9003 -7097 -4478 -1326 -1086 -796 2526 3370 -856 -5941 -4651 2055 2864 1156 -2645
16637 -2645 -5689 -4555 -2909 17 325 -4687 -7753 -6157 -2508 -159 -170 999 2411 -484 -3960
16622 -3960 163 -45 -780 673 -1718 -2274 -6707 -7399 -1688 -326 -2393 -1849 -2806 4079 2851 4012
16606 4012 4206 2201 -5902 -2455 2495 5011 2941 847 1337 6209 6026 6443 4015 760 -2234 -3882
16590 -3882 -5352 -4882 -1502 575 2487 2874 853 -442 959 -1638 -3923 892 2315 1429 1907 771
$$ packed form
16699c280M41J467M714J408l019j312M424M050j560m98o200J145K765o099j130
16684b684l361n33j314J463J908J190J58P23N08L174j669n694j503L504R10m22
16668c642M254k008q07J225J096m499q96K049L321L30l041l419L093K315q321
16653h950l69L16J906K619L152K40K90L322Q44m226n085J290O706Q09j708l801
16637b645l044J134J646K926L08n012l066J596L649K349j1J169J412k895l476
16622c960M123k08p35J453k391n56m433o92N711J362k067N44r57O885j228J161
16606D012J94k005q103L447M950K516k070k094M90M872j83M17k428l255k994j648
16590c882j470M70L380K077J912L87k021j295J401k597k285M815J423q86M78j136
$$ plain form
16574 771 -832 3072 8904 6139 3512 446 -7395 -9369 -4056 -3537 -115 5363 3810 4603 4647 7051
16558 7051 845 -3629 260 750 -1093 -3790 -6373 -5846 -1414 4083 2623 -2864 -778 -1372 -3700
16543 -3700 -1378 1755 -844 -166 -239 3051 2008 -332 7785 10098 6496 1359 -1470 3889 6533
16528 6533 4174 -1006 141 1035 -3462 -5914 -7986 -9321 -9115 -9364 -8021 -6468 -1471 -140 -1220
16513 -1220 -541 1403 3217 2514 1081 2436 -920 -4868 -2753 1340 2846 2188 2606 4659 4011 579
16497 579 -1030 -4591 -6943 -5248 -2758 -6275 -5945 -6890 -7272 -3511 3398 6345 4594 2878 -4341 -5338
16481 -5338 -1234 -271 -2602 -1921 -736 -897 -2395 -3883 -6186 -6836 -8093 -9095 -3817 -2391 -5261 -2589
16465 -2589 -1397 -2264 -5179 -3293 -3060 -6251 -7511 -6277 -8278 -14540 -14017 -8267 -6809 -966 -150 -783
$$ packed form
16574G71j603L904N832k765k627l066p841j974N313N19L422N478j553P93M4K404
16558G051o206m474L889M90j843k697k583N27M432N497j460n487K086n94k328
16543c700K322L133k599O78p3L290j043k340Q117K313l602n137k829N359K644
16528F533k359n180J147Q94m497k452k072j335K06k49J343J553M997J331j080
16513a220O79J944J814p03j433J355l356l948K115M093J506o58M18K053o48l432
16497E79j609l561k352J695K490l517L30r45l82L761O909K947j751j716p219r97
16481e338M104R63k331O81J185j61j498j488k303o50j257j002N278J426k870K672
16465b589J192q67k915J886K33l191j260J234k001o262N23N750J458N843Q16o33
$$ plain form
16449 -783 -1072 -511 -861 679 -2660 -3369 -5562 -4677 -1310 421 -3828 631 4618 2741 1323 -3751
16433 -3751 -1319 1237 4359 2132 2089 2044 628 910 -834 -3152 -1522 1722 5784 1302 -2559 -2280
16417 -2280 -4308 -3016 331 2081 -4327 -5871 -7838 -4415 -346 166 -118 -1709 -5 -2246 1020
16402 1020 1002 986 575 -1782 -1222 -292 -512 -3466 -9466 -6836 -3630 -2684 1677 -1893 -3446 -1135 -2193
16385 -2193 -3007 -5263 -4475 -4335 -3589 -2068 -8908 -13116 -15366 -10739 -8864 -8636 -8690 -4317 -1187 -3821
16369 -3821 -5265 -5059 -693 1165 -4705 -1571 -4402 -7613 -3392 1964 1156 -1802 -2825 -2091 -413
16354 -413 -5166 -3123 1867 3306 5461 435 -4781 -5281 -4061 -673 -1451 214 -2545 -3488 -2881 574
16338 574 834 549 -1115 -2223 3062 7870 4095 -2025 -672 1664 -1146 -4975 -3538 -1774 -2940
$$ packed form
16449g83k89N61l50J540l339p09k193Q85L367J731m249M459L987j877j418n074
16433c751K432K556L122k227m3m5j416K82j744k318J630L244M062m482l861K79
16417b280k028J292L347J750o408j544j967L423M069N12k84j591J704k241L266
16402A020j8j6m11k357N60R30k20k954o000K630L206R46M361l570j553K311j058
16385b193q14k256P88J40P46J521o840m208k250M627J875K28n4M373L130k634
16369c821j444K06M366J858n870L134k831l211M221N356q08k958j023P34J678
16354d13m753K043M990J439K155n026n216n00J220L388p78J665k759r43O07L455
16338E74K60k85j664j108N285M808l775o120J353K336k810l829J437J764j166
$$ plain form
16323 -2940 -1978 -760 3935 5418 5782 -314 -5991 -5765 -3059 -2901 -1262 2037 1836 -2223 -2179 1054
16307 1054 -268 -2063 966 5882 8717 9083 4338 1743 -3313 -34 3771 4183 2145 -4167 -3249
16292 -3249 5559 7261 8375 6852 1752 1798 6549 10462 9566 10398 12641 8471 2982 1301 -6653 -9313
16276 -9313 -4991 -217 72 -1184 -74 1818 -2075 -4754 -7015 -7377 -6806 -5275 5022 7129 3375
16261 3375 2692 5453 3631 711 624 -898 401 -1903 -779 -1683 -4437 -1793 -1788 -3977 -7890 -6036
16245 -6036 -4470 -5425 -4467 -247 636 4045 1218 -3320 -2101 -2020 -5944 -560 4873 9300 3354 2065
16229 2065 1534 -891 -3164 -8 4988 -3660 -7202 -7197 -223 2315 1151 363 4548 1666 -1828 -3886
16213 -3886 -6580 -5312 -2234 -1819 -1562 -1967 598 3762 7254 5598 129 -3521 -4613 -4930 -4090 -1384
$$ packed form
16323b940R62J218M695J483L64o096n677K26K706J58J639L299k01m059M4L233
16307A054j322j795L029M916K835L66m745k595n056L279L805M12k038o312R18
16292c249Q808J702J114j523n100M6M751L913q96Q32K243m170n489j681p954k660
16276i313M322M774K89j256J110J892l893k679k261l62N71J531J0297K107l754
16261C375o83K761j822k920q7j522J299k304J124r04k754K644Nk189l913J854
16245f036J566r55R58M220Q83L409k827m538J219Q1l924N384N433M427n946j289
16229B065n31k425k273L156M996q648l542NO974K538j164p88M185k882l494k058
16213c886k694J268L078M15K57m05K565L164L492j656n469l650j092l17Q40K706
$$ plain form
16197 -1384 -682 1402 1651 1978 -951 -3146 -2913 -1617 58 2866 441 -3807 -6402 -9076 -10930 -12672
16181 -12672 -15627 -11733 -7427 101 1791 2936 539 213 334 -1083 -3771 -8930 -11326 -9235 -5655
16166 -5655 -6426 -6218 -4827 -2138 -556 -1984 -3966 -1693 -2272 -5424 -11713 -9696 -6728 -6804 -8927 -7089
16150 -7089 -1230 -2951 -3926 -2297 -926 -1406 -420 -2473 -4757 -2815 -4176 -2513 -1670 -1916 -6287 -5388
16134 -5388 -2004 -3901 -5847 -6172 -6507 -9086 -6296 -2768 -895 -2325 -4848 -6943 -798 3808 2805
16119 2805 -973 -6851 -11704 -14662 -11955 -5423 -3579 -7589 -8186 -7085 -6304 -3930 -2805 -2136 -11
16104 -11 1870 -597 -2948 -31 3509 991 1204 4535 -424 -3139 -7231 -7163 -5226 -1877 12 2323
16088 2323 5272 3696 3693 3903 2079 -402 -1775 -3024 -2691 -702 -1881 -3531 -3651 -3899 -7522 -4869
$$ packed form
16197a384P02K084K49L27k929k195K33J296J675K808k425m248k595k674j854j742
16181a2672k955L894M306P528J690J145k397l26J21j417k688n159k396K091L580
16166e655p71K08J391K689J582j428j982K273n79l152o289K017K968p6k123J838
16150g089N859j721r75J629J371m80R86k053k284J942j361J663Q43k46m371Q99
16134e388L384j897j946l25l35k579K790L528J873j430k523k095O145M606j003
16119B805l778n878m853k958K707O532J844m010n97J101P81K374J125O69K125
16104a1J881k467k351K917L540k518K13L331m959k715m092O8J937L349J889K311
16088B323K949j576lK10j824k481j373j249L33J989j179j650j20k48l623K653
$$ plain form
16072 -4869 93 894 2003 2808 -600 -1413 -5114 -1386 -366 -3472 -7114 -4210 -2077 -1948 -5178 -2506
16056 -2506 -6289 -10459 -8352 -4875 877 971 1125 -987 -6964 -8110 -4558 952 -407 -1504 1176
16041 1176 1533 3839 1822 -884 1951 8700 16107 24684 25988 23063 19351 13723 12545 8419 5303
16026 5303 5594 3552 -696 -2336 1645 -487 -4014 -3347 -1200 -4278 -5453 -4713 -4247 -4301 -3833 -76
16010 -76 -1500 -4927 -8952 -9191 -7031 -9290 -11981 -11806 -9125 -8779 -11029 -6672 -1139 -3382 -2677 -2175
15994 -2175 -6939 -6174 -6069 -6393 -5554 -6548 -10083 -5989 -154 -1067 -1256 -2824 -7509 -4511 -4937 -5980 -7411
15977 -7411 -4861 -4652 -6449 -8600 -3089 2042 -5086 -1869 288 -4140 -7841 -9560 -7576 -7428 -7624
15962 -7624 -7729 -10385 -8430 -7529 -7275 -3811 -3079 -3235 -2957 -3128 -5093 -8270 -13201 -9816 -4954 -5891 -6415
$$ packed form
16072d869M962Q01J109Q05l408q13l701L728J020l106l642K904K133J29l230K672
16056b506l783m170K107L477N752R4J54k112n977j146L552N510j359j097K680
16041A176L57K306k017k706K835O749P407Q577J304k925l712n628j178m126l116
16026E303K91k042m248j640L981k132l527O67K147l078j175P40M66n4M68L757
16010g6j424l427m025k39K160k259k691J75K681L46k250M357N533k243P05N02
15994b175m764P65J05l24Q39r94l535M094N835r13j89j568m685K998m26j043j431
15977g411K550K09j797k151N511N131p128L217K157m428l701j719J984J48j96
15962g624j05k656J955R01K54L464P32j56K78j71j965l177m931L385M862r37n24
$$ plain form
15945 -6415 -6077 -4797 -5951 -6301 -11067 -12478 -7965 -6890 -2520 -2173 -4206 -1309 -1938 -4556 -4284 -5898
15929 -5898 -7244 -8570 -12897 -11861 -5405 1862 7624 3435 1999 -958 -3531 -3326 -8406 -9912 -5147
15914 -5147 2219 -84 -3459 -1223 -2056 -4071 -2457 256 -11 -3324 -1059 509 4619 -745 -2285
15899 -2285 -1203 -1413 -4357 -4421 -7904 -8315 -8956 -5706 -5091 -5770 -3783 138 4437 6844 10870 5802
15883 5802 2259 284 -2806 -2923 -3082 -5056 -8159 -5584 -2319 -3589 -4664 -7467 -8154 -4292 -4527 -5975
15867 -5975 -7677 -8169 -5050 -2726 -5377 -7334 -14787 -11591 -10923 -9574 -9636 -8150 -4857 -7111 -5209 -4748
15851 -4748 -6239 -6527 -5833 -3387 -5252 -1804 -5097 -5299 -3345 -6252 -10856 -14039 -10123 -9474 -14161 -17641
15835 -17641 -10738 -1242 -585 -5297 -1011 -796 -3706 -6416 -6898 -5871 -6048 -7900 -9282 -4634 -1528
$$ packed form
15945f415L38J280j154l50m766j411M513J075M370L47k033K897o29k618K72j614
15929e898j346j326m327J036O456P267N762m189j436k957k573K05n080j506M765
15914e147P366k303l375K236q33k015J614K713k67l313K265J568M110n364j540
15899b285J082k10k944o4l483m11o41L250O15o79J987L921M299K407M026n068
15883E802l543j975l090j17j59j974l103K575L265j270j075k803o87L862k35j448
15867e975j702m92L119K324k651j957p453L196O68J349o2J486L293k254J902M61
15851d748j491k88O94K446j865L448l293k02J954k907m604l183L916O49m687l480
15835a7641O903R496O57m712M286K15k910k710m82J027j77j852j382M648L106
$$ plain form
15820 -1528 48 1839 4723 2088 2433 2829 3711 3144 -3089 -6273 -2708 -1984 -2535 -1577 -2935 1262
15804 1262 1630 -2399 1501 1935 -2484 -1222 -3302 -9490 -9544 -3427 -551 -1808 -2295 -3078 -9488 -8810
15788 -8810 -3500 -3011 -1110 1487 395 -2799 -6419 -8933 -8700 -11389 -3742 2987 1753 1079 -1484
15773 -1484 -810 2417 3124 5167 5691 7414 4381 677 -829 -1891 -4880 -5616 -4454 2167 9419 4654
15757 4654 4313 333 -3382 -7205 -4563 -6026 -6442 -2054 -137 127 3396 2457 2798 3803 436 -3723
15741 -3723 -7862 -14228 -12508 -9428 -11473 -8910 -10289 -8316 -5878 -2337 -676 -2731 -4594 -2318 -597
15726 -597 -7569 -11747 -4784 -3219 -7775 -8703 -7899 -8043 -1577 -2542 -7767 -6939 -5702 -3192 -3570 -3093 -255
15709 -255 -4397 -3748 -2082 -5855 -5493 -6247 -8566 -8928 -7620 -6718 -5386 -2474 1629 4588 6114 -2197
$$ packed form
15820a528J576J791K884k635L45L96Q82n67o233l184L565P24n51R58j358M197
15804A262L68m029L900M34m419J262k080o188n4O117K876j257m87p83o410O78
15788h810N310M89J901K597j092l194l620k514K33k689P647O729j234o74k563
15773a484O74L227P07K043N24J723l033l704j506j062k989p36J162O621P252m765
15757D654l41l980l715l823K642j463m16M388J917K64L269r39L41J005l367m159
15741c723m139o366J720L080k045K563j379J973K438L541J661k055j863K276J721
15726e97o972m178O963J565m556r28Q04j44O466r65n225Q28J237K510l78M77K838
15709b55m142O49J666l773L62p54k319l62J308R02J332K912M103K959J526q311
$$ plain form
15693 -2197 -8285 -4241 -3418 -2168 -2299 -3844 -7602 -4252 6 -5260 -2126 -829 -271 -2640 -4501
15678 -4501 -7038 -11168 -11169 -9435 -4093 -1206 -2110 -3357 -4969 -5721 -4673 -3480 -299 -825 2447 5758
15662 5758 1820 3075 -206 -2540 -3274 -5616 -6938 -8373 -8232 -8138 -6475 1574 2668 -3279 -7759 -12570
15646 -12570 -16185 -17523 -14479 -10801 -9759 -4929 -2484 2453 1542 -5320 -4556 -8873 -11341 -4828 1170
15631 1170 833 -589 -2649 2026 526 1815 4086 -1243 -8820 -12388 -11059 -6202 -5884 -3194 2074
15616 2074 213 -3475 -7045 -10158 -11324 -11633 -10717 -8660 -6281 -2375 -1534 -3171 -4076 -6163 -10462 -10471
15600 -10471 -10293 -11054 -11765 -7899 -6906 -6636 -7124 -5172 -7512 -9257 -8668 -5601 -5936 -6953 -6757 -4253 -3095
15583 -3095 802 546 -2310 -2878 -3135 -2098 1417 962 -2004 -4392 -7471 -9945 -6084 -4479 -8116 -7694
$$ packed form
15693b197o088M044Q23J250j31j545l758L350M258n266L134J297N58k369j861
15678d501k537m130jJ734N342K887r04j247j612p52J048J193L181n26L272L311
15662E758l938J255l281k334p34k342j322j435J41R4J663Q049J094n947m480m811
15646a2570l615j338L044L678J042M830K445M937r11o862P64m317k468O513N998
15631A170l37j422k060M675j500J289K271n329p577l568J329M857L18K690N268
15616B074j861l688l570l113j166l09R16K057K379L906Q41j637r05k087m299r
15600a0471J78p61p11L866R93K70m88J952k340j745N89L067l35j017J96K504J158
15583c095L897k56k856n68k57J037L515m55k966k388l079k474L861J605l637M22
$$ plain form
15567 -7694 -2027 3769 3132 -2343 -2309 -5500 -2768 -349 627 -1116 -4102 -3509 -4069 1132 5166 1692
15551 1692 -1210 -4540 -4065 -7256 -9914 -4343 -5637 -8109 -12008 -11014 -10699 -8803 -9205 -13392 -15039 -11721
15535 -11721 -11058 -7960 -8639 -8056 -6023 -3134 -5982 -7277 -3067 2703 3383 -4531 -10945 -9261 -11221
15520 -11221 -6952 -7887 -11586 -12865 -13598 -11556 -6562 -6252 -2036 -239 -4570 872 8478 2323 -3390
15505 -3390 -2824 338 -2545 -6090 -4814 -1098 3538 3399 3628 3147 3020 2651 9 -904 1526 1095 1885
15488 1885 1294 2830 6065 7048 5499 4224 7218 15507 25450 47525 73828 101054 118560 110223
15474 110223 87934 61825 37530 18563 12315 12891 6584 1749 -198 -4277 -3748 -883 601 1281
15460 1281 -2611 -7773 -9291 -7293 -5926 -9014 -10138 -6823 -2789 -2299 -1275 -30 879 -1005 -1245
$$ packed form
15567g694N667N796o37n475L4l191K732K419R76j743k986N93n60N201M034l474
15551A692k902l330M75l191k658N571j294k472l899R94L15J896m02m187j647L318
15535a1721O63L098o79N83K033K889k848j295M210N770O80p914o414J684j960
15520a1221M269r35l699j279p33K042M994L10M216J797m331N442P606o155n713
15505c390N66L162k883l545J276L716M636j39K29m81j27l69k642r13K430m31P90
15488A885n91J536L235R83j549j275K994Q289R943K2075K6303K7226J7506q337
15474A10223k2289k6109k4295j8967o248N76o307m835j947m079N29K865J484O80
15460A281l892n162j518J998J367l088j124L315M034M90J024J245R09j884k40
$$ plain form
15445 -1245 -3656 -5461 -7216 -4927 -3939 -1323 -2053 -3574 -7526 -6666 -8058 -7558 -8221 -11646 -8653 -6286
15429 -6286 -8432 -5998 -1408 1012 4490 497 -3495 -1864 -5242 -10302 -15371 -14662 -13724 -13366 -13057 -7817
15413 -7817 -3221 1462 2077 -20 282 -1975 -2804 -843 -628 -3716 1135 1710 1997 2355 3598 1770
15397 1770 114 635 3468 -1139 -4694 -4381 -2298 -5046 -4478 -6093 -8971 -9555 -9134 -13959 -13451 -4334
15381 -4334 -1596 -4232 -2431 -217 -3055 -3649 -2881 -4325 -6811 -7066 -6040 -3094 1641 68 -7000
15366 -7000 -8442 -11247 -13682 -8760 -7739 -10897 -8350 -6255 -5569 -12131 -13638 -10819 213 4049 1913
15351 1913 2598 -894 -6207 -8262 -6848 -1293 1142 785 -67 -1648 -6125 -12408 -12471 -10612 -11772 -15905
15335 -15905 -19784 -13173 -11388 -12522 -10206 -5773 456 6238 199 -6603 -9026 -12067 -12766 -13046 -10482
$$ packed form
15445a245k411j805j755K289R88K616p30j521l952Q60j392N00o63l425K993K367
15429f286k146K434M590K420L478l993l992J631l378n060n069P09R38L58L09N240
15413g817M596M683O15k097L02k257q29J961K15l088M851N75K87L58J243j828
15397A770j656N21K833m607l555L13K083k748N68j615k878n84M21m825N08R117
15381d334K738k636J801K214k838n94P68j444k486k55J026K946M735j573p068
15366g000j442k805k435M922J021l158K547K095O86o562j507K819J1032L836k136
15351A913O85l492n313k055J414N555K435l57q52j581m477o283o3J859j160m133
15335a5905l879O611J785j134K316M433O229N782o039o802k423l041o99k80K564
$$ plain form
15320 -10482 -11835 -19700 -23126 -17542 -12828 -15188 -11177 -5270 -8272 -10091 -8807 -9792 -3181 -101 -1862
15305 -1862 -4275 -11615 -13343 -13817 -18813 -12415 -3538 -8809 -10809 -11704 -13267 -14152 -14110 -12480 -11791 -8278
15289 -8278 -5761 -8677 -12106 -9098 -8063 -14638 -15664 -12960 -9513 -8507 -10941 -4611 -2337 -7504 -12477
15274 -12477 -15764 -13702 -7818 -2945 144 -3748 -5768 -9479 -8837 -10234 -12583 -12978 -12611 -7382 -2138
15259 -2138 -4491 -7496 -11203 -13853 -12740 -10172 -5480 -2650 -5447 -6052 -7860 -13040 -11402 -12325 -12153
15244 -12153 -13375 -12734 -12118 -12828 -10256 -7231 -3759 -1192 -3401 -4555 -2406 2144 3474 -3528 -3727
15229 -3727 329 -4694 -4081 4926 9893 6793 1762 -300 -2488 -844 -4363 -5985 -3127 -1135 -87
15214 -87 -4920 -9860 -13575 -16386 -18710 -18156 -11379 -7941 -14056 -16827 -10812 -5576 -6407 -5789 -8561 -11754
$$ packed form
15320a0482j353p865l426N584M714k360M011N907l002j819J284r85O611L080j761
15305a862k413p340j728m74m996O398Q877n271k000q95j563q85M2J630O89L513
15289h278K517k916l429L008J035o575j026K704L447J006k434O330K274n167m973
15274a2477l287K062N884M873L089l892k020l711O42j397k349l95L67N229N244
15259b138k353l005l707k650J113K568M692K830k797o05j808n180J638r23J72
15244a2153j222O41O16p10K572L025L472K567k209j154K149M550J330p002j99
15229c727M056n023O13R007M967l100n031k062k188J644l519j622K858J992J048
15214h7m833m940l715k811k324N54O777L438o115k771O015N236q31O18k772l193
$$ plain form
15198 -11754 -15970 -14072 -8781 -10150 -7657 -4708 -7471 -11954 -17438 -17452 -18107 -21550 -19239 -19066 -21231
15183 -21231 -21999 -26027 -20391 -10200 -6661 -1726 2442 -1869 -8713 -5727 1936 3650 4781 -72
15169 -72 827 4347 2186 -525 2193 1064 -3330 -8894 -16973 -19596 -20642 -12093 -3490 4250 7992
15154 7992 5820 3790 4343 3595 -4022 -9789 -17017 -22177 -21896 -18841 -15418 -15861 -15984 -10620 -13196 -14413
15138 -14413 -15642 -13438 -9197 -8269 -5252 -9165 -7073 -6064 -7149 -11814 -10090 -6774 -5520 -7177 -12651
15123 -12651 -16775 -19739 -16196 -8366 4737 17148 20953 18383 16573 15094 14216 11042 3755 639
15109 639 -9624 -20291 -16099 -13259 -13149 -14333 -16104 -22626 -24014 -22537 -16451 -17828 -18808 -15942 -12285
15094 -12285 -10746 -12512 -12537 -10676 -14584 -18419 -20353 -19370 -17153 -11836 -8210 -10122 -9997 -4670 4443
$$ packed form
15198a1754m216J898N291j369K493K949k763m483n484j4o55l443K311J73k165
15183b1231p68m028N636J0191L539M935M168m311o844K986P663J714J131m853
15169g2Q99L520k161k711K718j129m394n564q079k623j046Q549Q603P740L742
15154G992k172k030N53p48p617n767p228n160K81L055L423m43j23N364k576j217
15138a4413j229K204M241R28L017l913K092J009j085m665J724L316J254j657n474
15123a2651m124k964L543P830J3103J2411L805k570j810j479q78l174p287l116
15109F39j0263j0667M192K840J10j184j771o522j388J477O086j377r80K866L657
15094a2285J539j766k5J861l908l835j934R83K217N317L626j912J25N327R113
$$ plain form
15079 4443 11075 4991 1022 696 9042 14719 12783 5693 -10064 -21449 -24476 -19863 -16199 -15617 -11475
15064 -11475 -2777 109 -5721 -10930 -13665 -16903 -18388 -11428 -2043 495 1063 5144 3801 2437 2909
15049 2909 8982 20920 29204 31864 25625 12287 -9098 -23735 -31851 -40407 -41938 -35682 -27425 -21209
15035 -21209 -20669 -19457 -20997 -25196 -28678 -28678 -24690 -16961 -13672 -15188 -11122 -10438 -15720 -22500 -22029 -20860
15019 -20860 -19187 -16885 -17869 -22152 -20479 -19726 -18924 -17120 -16948 -16618 -16697 -14291 -14531 -17017 -17876 -19819 -22892
15002 -22892 -22420 -22832 -23611 -24639 -27263 -32008 -38775 -41472 -42759 -38609 -38530 -34765 -33414 -34356 -33143 -31648
14986 -31648 -31241 -29786 -28615 -29277 -27255 -22363 -23017 -23229 -26039 -31441 -37740 -38576 -32914 -32561 -29604 -24192
14970 -24192 -24036 -25334 -29376 -36256 -43631 -44793 -38188 -33077 -23244 -13857 -7634 -5623 -2331 -3530 950
$$ packed form
15079D443O632o084l969l26Q346N677j936p090j5757j1385l027M613L664N82M142
15064a1475Q698K886n830n209k735l238j485O960R385K538N68M081j343j364M72
15049B909O073J1938Q284K660o239j3338k1385j4637q116q556j531O256Q257O216
15035b1209N40J212j540m199l482%L988P729L289j516M066O84n282o780M71J169
15019b0860J673K302r84m283J673P53Q02J804J72L30p9K406k40k486q59j943l073
15002b2892M72m12p79j028k624m745o767k697j287M150P9L765J351r42J213J495
14986c1648M07J455J171o62K022M892o54k12k810n402o299q36N662L53K957N412
14970b4192J56j298m042o880p375j162O605N111R833R387O223K011L292j199M480
$$ plain form
14955 950 11413 16389 15450 8278 7270 5993 6081 14537 28378 41206 54645 69880 81805 99456
14941 99456 118440 140488 171688 209286 255202 309625 364870 424568 481019 545898 624264 715784
14929 715784 827225 968247 1163116 1435631 1834944 2471394 3562909 5551985 8942904
14920 8942904 13885845 19225448 22540869 21581406 17291246 12065389 7947377 5273339
14912 5273339 3682260 2738574 2124407 1687760 1369189 1123039 929308 774224 653766
14903 653766 568592 506262 456237 419473 384462 351803 321821 298923 279580 265241 250700
14892 250700 239873 226210 220396 207011 188052 176762 174617 178162 180119 178092 169624 156487 143234
14879 143234 137333 129381 130860 130067 127444 114921 104452 103034 99061 95581 93846 89217 85115 82911
$$ packed form
14955I50J0463M976r39p172j008j277Q8Q456J3841J2828J3439J5235J1925J7651
14941I9456J8984K2048L1200L7598M5916N4423N5245N9698N6451O4879P8366R1520
14929G15784J11441J41022J94869K72515L99313O36450J091515J989076L390919
14920H942904M942941N339603L315421r59463m290160n225857m118012k674038
14912E273339j591079r43686o14167m36647l18571k46150j93731j55084j20458
14903F53766q5174o2330n0025l6764l5011l2659k9982k2898j9343j4339j4541
14892B50700j0827j3663n814j3385j8959j1290k145L545J957k027q468j3137j3253
14879A43234n901p952J479p93k623j2523j0469j418l973l480j735m629m102k204
$$ plain form
14865 82911 83948 83706 75412 75497 76730 76493 78473 73052 71566 69217 64547 62079 59287 61423 62949
14850 62949 63504 62131 58839 48023 45078 43844 44593 47882 49062 45736 44300 45331 39081 38405 39442
14835 39442 38492 41438 42840 47035 47572 44805 40886 38724 38358 35674 30391 27694 27726 28896 28217 25332
14819 25332 28873 33284 33625 34873 35700 39745 37515 37531 39049 40889 41815 39091 35694 34868 39540 42059
14803 42059 41845 43714 45464 41303 31913 30069 30001 30211 33558 37567 41869 42912 40208 37571 33469
14788 33469 27013 23023 22087 17611 11823 11295 15205 13785 10609 6329 8313 16496 22139 20516 21703
14773 21703 18097 10858 10262 15707 13953 12801 10620 10727 11891 12518 12269 15284 15780 14189 15953 16986
14757 16986 16341 18252 22267 25642 22974 16911 16883 17986 22336 23336 18480 12317 15888 21032 24070
$$ packed form
14865H2911J037k42q294Q5J233k37J980n421j486k349m670k468k792K136J526
14850F2949N55j373l292j0816k945j234P49L289J180l326j436J031o250o76J037
14835C9442r50K946J402M195N37k767l919k162l66k684n283k697L2J170o79k885
14819B5332L541M411L41J248Q27M045k230J6J518J840R26k724l397q26M672K519
14803D2059k14J869J750m161r390j844o8K10L347M009M302J043k704k637m102
14788C3469o456l990r36m476n788n28L910j420l176m280J984Q183N643j623J187
14773B1703l606p239n96N445j754j152k181J07J164O27k49L015M96j591J764J033
14757A6986o45J911M015L375k668o063k8J103M350J000m856o163L571N144L038
$$ plain form
14742 24070 23494 17420 14789 16757 16188 12765 13374 12768 10872 6345 3029 5069 6658 8371 8455 7963
14726 7963 2893 2361 8419 12429 11297 16851 18474 16959 16763 17400 13902 9581 7468 5397 5480 9880
14710 9880 8430 10264 6096 3032 8009 14676 12351 5250 4442 7829 8436 13375 13574 10442 12739
14695 12739 16912 15105 11535 12836 13327 10711 7534 12489 16683 14710 11558 6132 5794 5425 8018
14680 8018 11117 8550 10308 10398 10139 9850 7340 6093 5791 10318 9451 10805 15810 15397 10357 8976
14664 8976 12348 16302 17436 17625 12608 14970 15331 11740 9192 10004 9496 8486 8938 9273 5193 6640
14648 6640 15575 14873 14289 12798 14174 11672 11725 9977 6580 6001 7601 5239 819 3822 9672 7708
14632 7708 6206 4579 -152 29 166 1685 1166 -1616 2783 3750 3477 3616 3971 4495 7617 15541 15506
$$ packed form
14742B4070n76o074k631J968n69l423O09o06j896m527l316K040J589J713Q4m92
14726G963n070n32O058M010j132N554J623j515j96O37l498m321k113k071Q3M400
14710I880j450J834m168l064M977O667k325p101q08L387O07M939J99l132K297
14695A2739M173j807l570J301M91k616l177M955M194j973l152n426l38l69K593
14680H018L099k567J758R0k59k89k510j247l02M527q67J354N005m13n040j381
14664H976L372L954J134J89n017K362L61l591k548Q12n08j010M52L35m080J447
14648F640Q935p02n84j491J376k502N3j748l397n79J600k362m420L003N850j964
14632G708j502j627m731J81J37J519n19k782M399R67k73J39L55N24L122P924l5
$$ plain form
14615 15506 8369 9005 11249 9467 5651 4009 5029 4659 2254 491 7665 10885 10894 10931 7397 4082
14599 4082 1904 -910 -6065 -2778 -642 -4145 -6871 -850 4309 5886 9355 7712 7189 7115 6677 4715
14583 4715 3364 315 -566 1820 4246 1268 -2667 -1668 -231 -161 -4318 -4276 94 4735 7422 9135
14567 9135 7583 4418 3371 5366 3783 -398 -3832 579 3023 2718 6287 4732 5147 4786 5332 8295
14551 8295 10092 9750 8530 5401 2792 3328 1553 -2084 -980 3107 2581 2399 4727 6043 8689 5160
14535 5160 4892 6088 5289 5084 1082 -132 -2086 -1499 2019 9382 12143 9954 3770 7377 8876 4439
14519 4439 4036 8838 9200 9709 15338 13789 5312 -619 -1355 -565 1521 -348 1649 5235 5018 7258
14503 7258 10343 7594 6012 -873 -7598 -4011 1664 1713 378 -3664 -1907 2958 3559 -2454 581
$$ packed form
14615A5506p137O36K244j782l816j642J020l70k405j763P174L220RL7l534l315
14599D082k178k814n155L287K136l503k726O021N159J577L469j643n23p4m38j962
14583D715j351l049q81K386K426k978l935R99J437P0m157M2M370M641K687J713
14567I135j552l165j047J995j583m181l434M411K444l05L569j555M15l61N46K963
14551H295J797l42j220l129k609N36j775l637J104M087n26j82K328J316K646l529
14535E160k68J196p99k05m002j214j954N87L518P363K761k189o184L607J499m437
14519D439m03M802L62N09N629j549q477n931p36P90K086j869J997L586k17K240
14503G258L085k749j582o885o725L587N675M9j335m042J757M865O01o013L035
$$ plain form
14488 581 -990 -3286 -2833 -7188 -5918 -2963 1163 4169 2177 4673 3905 5407 2646 5791 7530
14473 7530 3638 -1098 3206 4209 386 -5651 -6835 -1393 -1113 23 845 -2503 -2028 812 -3531
14458 -3531 -3127 -763 1852 3376 8925 14623 7644 2788 4115 4705 4511 4077 7089 4317 -229 -236
14442 -236 3260 4797 3059 909 -883 1016 1663 605 2295 4077 1644 4712 7027 6435 4925
14427 4925 5099 1082 2016 5117 594 -517 -1608 -2601 -3152 -2530 -3477 2047 2154 73 -2415 -12
14411 -12 3644 1545 1039 5672 8895 13055 11024 4324 2642 4414 5360 7400 7237 8610 7892 6858
14395 6858 6899 5137 -838 -798 -1661 -2529 2750 6659 4621 3619 2002 -1327 -1536 -1135 23 -2390 -9207
14378 -9207 -10274 -3969 1511 3488 7098 5712 3213 418 2887 2911 -534 318 5007 5016 4872 5709 -775
$$ packed form
14488E81j571k296M53m355J270K955M126L006j992K496p68J502k761L145J739
14473G530l892m736M304J003l823o037j184N442K80J136Q22l348M75K840m343
14458c531M04K364K615J524N549N698o979m856J327N90j94m34L012k772m546p
14442b36L496J537j738k150j792J899O47j058J690J782k433L068K315n92j510
14427D925J74m017R34L101m523j111j091r93n51O22r47N524J07k081k488K403
14411a2L656k099n06M633L223M160k031o700j682J772R46K040j63J373p18j034
14395F858M1j762n975M0q63q68N279L909k038j002j617l329k09M01J158k413o817
14378i207j067O305N480J977L610j386k499k795K469K4l445Q52M689Rj44Q37o484
$$ plain form
14361 -775 -2519 613 10028 16112 19772 21498 33785 53927 78036 102762 119539 114266 91034
14348 91034 61563 38407 24582 18398 12115 5088 6288 9165 4062 4923 4601 157 -3154 -6698
14334 -6698 -4313 274 8558 7952 5886 5051 7624 7772 7477 4060 -90 -1795 -2839 -1555 2680 3532
14318 3532 3638 2983 -2920 -3087 868 3286 -1456 -1211 682 2718 5126 4329 8464 8049 8221 -1153
14302 -1153 -1602 239 3980 -991 -6490 -6413 -10005 -9807 -9537 -10363 -4182 4457 2516 -163 5533 5018
14286 5018 5944 4847 3119 -634 -3899 -5193 -5123 -5819 -3855 -7388 -2637 -914 -2954 -1257 2062 3068
14270 3068 710 -3875 -6817 -11131 -7365 -8354 -10152 -6327 -1842 4590 5708 4639 7798 7833 3260
14255 3260 2397 7077 3561 -2754 -1917 -2153 -3258 -6455 -4682 762 4047 3826 2687 2642 1735 2582 1630
$$ packed form
14361g75j744L132R415O084L660J726J2287K0142K4109K4726J6777n273k3232
14348I1034k9471k3156j3825o184o283p027J200K877n103Q61l22m444l311l544
14334f698K385M587Q284o06k066q35K573J48k95l417m150j705j044J284M235Q52
14318C532J06o55n903j67L955K418m742K45J893K036K408p97M135m15J72r374
14302a153m49J841L741m971n499P7l592J98K70q26O181Q639j941k679N696n15
14286E018R26j097j728l753l265j294P0o96J964l533M751J723k040J697L319J006
14270C068k358m585k942m314L766r89j798L825M485O432J118j069L159L5m573
14255C260q63M680l516o315Q37k36j105l197J773N444L285k21j139m5r07Q47r52
$$ plain form
14238 1630 1251 157 3767 8062 5185 7211 8883 6825 175 -6272 -10201 -8941 -5849 -5657 -5609 -4132
14222 -4132 -4487 -4755 -7924 -10819 -6872 -4659 -2778 -6560 -3627 -6030 -9342 -5280 582 -891 -4455
14207 -4455 -4400 -4103 -7743 -11190 -7077 -7648 -6672 -8085 -10360 -9737 -6850 628 2926 907 5311 7063
14191 7063 4245 -2571 -5660 -4690 -5825 -4160 2129 5034 1921 2215 5191 4696 374 -330 -3017 -2379
14175 -2379 2675 -127 -5800 -5174 -1308 1034 2018 2348 2082 2356 3041 4639 701 126 -928 -1310 -4484
14158 -4484 -7441 -5919 -2861 -4536 -4243 -984 -1954 -2058 853 2399 2139 3401 3885 1590 -3042 -5454
14142 -5454 -1059 -1420 -5353 -8769 -9567 -6348 -8043 -5129 -1169 1090 -3012 -7080 -7316 -2361 3462
14127 3462 9942 10899 6673 6357 3547 4856 3850 1621 -2339 959 2593 65 -1526 -7736 -9539
$$ packed form
14238A630l79j094L610M295k877K026J672k058o650o447l929J260L092J92M8J477
14222d132l55k68l169k895L947K213J881l782K933k403l312M062N862j473l564
14207d455N5K97l640l447M113n71R76j413k275O23K887P478K298k019M404J752
14191G063k818o816l089R70j135J665O289K905l113K94K976m95m322p04k687O38
14175b379N054k802n673O26L866K342R84L30k66K74O85J598l938n75j054l82l174
14158d484k957J522L058j675K93L259r70j04K911J546k60J262M84k295m632k412
14142e454M395l61l933l416p98L219j695K914L960K259m102m068k36M955N823
14127C462O480R57m226l16k810J309j006k229l960L298J634k528j591o210j803
$$ plain form
14112 -9539 -5989 -3737 -690 -3516 -7277 -7696 -5691 -5252 -6182 -7267 -3762 1513 1734 -1062 554 -566
14096 -566 -419 2991 4682 -3257 -8482 -8054 -9786 -5104 -351 1907 573 -76 887 -981 -4168 -8833
14080 -8833 -9856 -3982 -975 -1105 -900 3256 425 -5789 -5635 -6978 -5296 -1576 -857 -1245 -4931 -2784
14064 -2784 801 -2191 -3595 -587 2306 4075 1921 31 -2549 -2639 359 -236 -4105 -8570 -9184 -6337
14048 -6337 -6127 -6843 -7942 -12298 -12544 -7598 1002 5014 3667 -812 -1666 -1496 988 720 -380 1042
14032 1042 3592 3143 -1937 -4157 491 962 -1568 1044 -2263 -2554 -2091 -1476 -1829 -608 3297 4460
14016 4460 3852 1326 3780 3395 946 -3077 -2292 -1630 -2626 -3007 -396 -907 -1528 4532 5510 -1290 -2652
13999 -2652 -771 1654 1439 1989 -836 -2900 -4747 -4097 -2088 -3563 -4453 -752 1201 38 2763 3950
$$ packed form
14112i539L550K252L047k826l761m19K005M39r30j085L505N275K21k796J616j120
14096e66J47L410J691p939n225M28j732M682M753K258j334o49R63j868l187m665
14080h833j023N874L007j30K05M156k831o214J54j343J682L720P19l88l686K147
14064b784L585k992j404L008K893J769k154j890k580r0K998n95l869m465o14K847
14048f337K10p16j099m356k46M946Q600M012j347m479q54J70K484k68j100J422
14032A042K550m49n080k220M648M71k530K612l307k91M63O15l53J221L905J163
14016D460o08k526K454l85k449m023P85O62r96l81K611n11o21O060R78o800j362
13999b652J881K425k15N50k825k064j847O50K009j475q90L701J953j163K725J187
$$ plain form
13983 3950 2439 2816 4019 6080 2293 553 3640 1644 2502 4568 1501 -7367 -7407 -8768 -9387 -12059
13967 -12059 -9892 -5252 -6778 -8847 -5121 -3419 -7068 -12850 -11157 -9552 -10161 -5131 -3751 -3365 -2326
13952 -2326 -5520 -5237 -7742 -9768 -9052 -7297 -5749 -8183 -2473 5358 4323 2329 838 -2123 -687
13937 -687 537 3613 998 -4266 -9085 -8237 -2383 -3025 6 1156 2634 2652 -339 -771 -3748 -9426
13921 -9426 -7655 -6826 -3636 -1323 -39 3417 5313 -930 -3921 -5555 -1551 5917 8518 4761 -1499
13906 -1499 -4587 -3156 -3949 -6040 -7579 -954 2269 -271 -2998 -3046 -5863 -5763 -2199 -2951 -4242 -4278
13890 -4278 -3590 -1666 1655 1407 -637 -2194 -2885 -3869 -2225 755 -4876 -8101 -7167 -9133 -7138 -6741
13874 -6741 -5589 -9216 -7726 -5966 -7341 -5849 -4714 -4760 -4947 -6206 -2359 3824 3894 1254 -3597 -2696
$$ packed form
13983C950j511L77J203K061l787j740L087j996Q58K066l067q868m0j361o19k672
13967a2059K167M640j526k069L726J702l649n782J693J605o09N030J380L86J039
13952b326l194K83k505k026P16J755J548k434N710P831j035j994j491k961J436
13937f87J224L076k615n264m819Q48N854o42L031J150J478J8k991m32k977n678
13921i426J771Q29L190K313J284L456J896o243k991j634M004P468K601l757o260
13906a499l088J431p93k091j539O625L223k540k727m8k817J00L564p52j291l6
13890d278O88J924L321k48k044j557o91r84J644K980n631l225R34j966J995L97
13874f741J152l627J490J760j375J492J135m6j87j259L847O183P0k640m851R01
$$ plain form
13858 -2696 -176 23 859 -769 610 3811 2735 -728 -1513 -2088 269 -4416 -4576 -4332 -7903 -6458
13842 -6458 -4034 -1487 -6032 -13221 -9648 -3529 -1842 -6420 -7688 -7914 -4921 -6797 -10251 -8993 -9036
13827 -9036 -6935 -6430 -6382 -5244 -2821 770 -3940 -1708 1324 -579 -1138 5781 5713 5774 8970 5525 718
13810 718 -1150 -6889 -7651 -2509 3787 -801 -6569 -11761 -9952 -4866 -6254 -7855 -10058 -9057 -7807
13795 -7807 -2232 756 -4869 -5514 -4629 -4486 -4115 -1018 196 -4894 -5192 -1328 -2524 -782 -934 3981
13779 3981 4803 6516 2008 -2102 648 1106 -1340 128 -748 -286 -702 -1031 -6658 -8536 -8854 -7953 -7792
13762 -7792 -6664 -1927 -1178 -3987 -4295 -6977 -3459 2934 3925 450 -404 -1209 -1362 -4483 -3876 -4039 -2384
13745 -2384 1879 3158 3004 3672 -3850 -6509 -11647 -13210 -7980 -2397 -322 453 -2186 -2941 -2957 -3825
$$ packed form
13858b696K520J99Q36j628J379L201j076l463p85n75K357m685j60K44l571J445
13842f458K424K547m545p189L573O119J687m578j268k26K993j876l454J258m3
13827i036K101N05M8J138K423L591m710K232L032j903n59O919o8O1L196l445m807
13810G18j868n739p62N142O296m588n768n192J809N086j388j601k203J001J250
13795g807N575K988n625o45Q85J43L71L097J214n090k98L864j196J742j52M915
13779C981Q22J713m508m110K750M58k446J468q76M62m16l29n627j878l18R01J61
13762g792J128M737P49k809l08k682L518O393R91l475q54q05j53l121O07j63J655
13745b384M263J279j54O68p522k659n138j563N230N583K075P75k639p55j6q68
$$ plain form
13729 -3825 -1769 -2039 -5654 -3616 -125 3304 4102 2687 -2436 -5813 -9832 -10019 -5034 -1850 391
13714 391 -200 -604 -1970 -1424 3820 10049 7384 1636 4046 4728 4151 698 3609 3069 2306 1360 -1675
13697 -1675 -1188 378 4523 1777 -6661 -8598 -9310 -4048 6505 6956 3437 4287 3245 3990 6226 3901
13681 3901 6716 8506 12352 11149 9400 12319 17002 16648 15320 14744 14237 9163 8258 8727 8248 7984
13665 7984 4995 906 757 -2533 -508 868 2175 816 799 -1156 -3761 -6432 -9210 -10850 -4035
13650 -4035 1744 114 564 -5441 -1907 2439 43 -4940 -6051 -4259 -2857 -3462 -5851 -8378 -9907
13635 -9907 -12068 -11435 -4586 2056 2373 4110 6437 4108 3592 8281 7428 6472 7550 8330 8967 4215
13619 4215 392 -4486 -5119 -3961 -3094 -3321 -6654 -7336 -2215 -1436 -963 3726 3764 1154 2803 847 -2175
$$ packed form
13729c825K056k70l615K038L491L429P98j415n123l377m019j87M985L184K241
13714C91n91m04j366N46N244O229k665n748K410O82n77l453K911n40p63r46l035
13697a675M87J566M145k746q438j937p12N262J0553M51l519Q50j042P45K236k325
13681C901K815J790L846j203j749K919M683l54j328n76n07n074r05M69m79k64
13665G984k989m089j49l290K025J376J307j359j7j955k605k671k778j640O815
13650d035N779j630M50o005L534M346k396m983j111J792J402o05k389k527j529
13635i907k161O33O849O642L17J737K327k329n16M689q53r56J078P80O37m752
13619D215l823m878o33J158Q67k27l333o82N121P79M73M689L8k610J649j956l022
$$ plain form
13602 -2175 -2640 -772 -5023 -2515 4484 6403 9032 14826 16942 10559 5284 902 274 1555 4261
13587 4261 2070 6117 11004 11868 16847 18071 12018 3975 -431 -3645 -5745 -6421 -4814 -3278 1636
13572 1636 1520 -4898 -7029 -6035 -5475 -5096 -3253 1856 3234 604 1097 -1375 -3622 508 9339 10353
13556 10353 5648 345 -2537 -3581 4398 3152 -1917 -4928 1224 3265 3180 6634 5015 249 -2206
13541 -2206 -3289 -2064 -4545 -8836 -6167 -6207 -4817 -1979 259 -2052 2300 5117 2215 224 956
13526 956 -1633 -2748 -3780 -2588 975 2016 2718 3837 1346 4636 5005 1306 1926 712 -2021 -5557
13510 -5557 -5931 -5644 -7924 -7596 -5325 -8033 -6951 -4848 -7079 -11760 -12413 -9277 -6644 -1909 991 -1951
13494 -1951 -3496 -1126 1510 831 -1290 -6760 -4556 -859 -462 7052 9068 -135 -4593 -1130 928
$$ packed form
13602b175m65J868m251K508O999J919K629N794K116o383n275m382o28J281K706
13587D261k191M047M887Q64M979J224o053q043m406l214k100o76J607J536M914
13572A636j16o418k131R94N60L79J843N109J378k630M93k472k247M130Q831J014
13556A0353m705n303k882j044P979j246n069l011O152K041q5L454j619m766k455
13541b206j083J225k481m291K669m0J390K838K238k311M352K817k902j991P32
13526I56k589j115j032J192L563J041P02J119k491L290L69l699O20j214k733l536
13510e557l74K87k280L28K271k708J082K103k231m681o53L136K633M735K900k942
13494a951j545K370K636o79k121n470K204L697L97P514K016r203m458L463K058
$$ plain form
13479 928 2513 73 -1781 -7686 -10146 -13171 -10650 -6260 -9797 -7542 -2949 522 -109 -1995 -3569
13464 -3569 -4830 -7954 -10179 -8221 784 5892 7702 6632 6226 7065 7173 3391 4114 1942 -3380 -3844
13448 -3844 -6133 602 8104 12023 8540 6798 1666 -8118 -9972 -8397 -6097 -4567 -3170 -3468 -7682
13433 -7682 -10130 -9706 -7326 -1695 -207 -3312 1026 6844 11179 15050 23691 31014 32344 28703 18870
13418 18870 9562 5840 4227 4877 7436 7169 3954 -2071 -1398 -1726 -504 -823 -1708 2787 5180 3688
13402 3688 2092 1037 2108 2106 -2590 -2520 1205 6411 7936 4047 -3782 -4032 -1125 4946 7432 6289
13386 6289 8172 11030 7478 9216 9032 7576 3921 5623 8099 9570 13457 17349 19202 14207 14046
13371 14046 14873 18359 18640 24187 27403 21799 15844 15524 15549 11578 12746 15378 17871 23245 25286 26345
$$ packed form
13479I28J585k440j854n905k460l025K521M390l537K255M593L471o31j886j574
13464c569j261l124k225J958R005N108J810j070m06Q39J08l782P23k172n322m64
13448c844k289O735P502L919l483j742n132r784j854J575K300J530J397k98m214
13433g682k448M24K380N631J488l105M338N818M335L871Q641P323J330l641r833
13418A8870r308l722j613O50K559k67l215o025O73l28J222l19q85M495K393j492
13402C688j596j055J071km696P0L725N206J525l889p829k50K907O071K486j143
13386F289J883K858l552J738j84j456l655J702K476J471L887L892J853m995j61
13371A4046Q27L486K81N547L216n604n955l20K5l971J168K632K493N374K041J059
$$ plain form
13355 26345 24282 21903 28393 37101 39727 43092 47474 58636 75400 93767 113511 141735 182010
13342 182010 224766 279088 330227 359887 366740 351098 328898 315254 311604 321251 348093 381244
13330 381244 399237 392851 356244 299937 242482 195067 153891 123295 99157 80205 65998 59268
13318 59268 58303 53915 50840 52100 54169 57301 60526 69336 79388 97663 117240 141032 172264
13305 172264 217081 279339 338278 377249 395983 395318 383890 369318 364950 378494 405161 435165
13293 435165 462434 465504 447646 407272 363187 325860 291015 268803 257409 258419 282786 327650
13281 327650 392858 489504 610405 757315 901912 1011616 1072158 1087031 1061353 1001662 921244
13270 921244 843652 781654 738965 699912 661661 620202 582828 562789 562663 588964 636539 679901
$$ packed form
13355B6345k063k379O490Q708K626L365M382J1162J6764J8367J9744K8224M0275
13342A82010M2756N4322N1139K9660O853j5642k2200j3644l650R647K6842L3151
13330C81244J7993o386l6607n6307n7455m7415m1176l0596k4138j8952j4207o730
13318E9268r65m388l075J260K069L132L225Q810J0052J8275J9577K3792L1232
13305A72264M4817O2258N8939L8971J8734o65j1428j4572m368J3544K6667L0004
13293D35165K7269L070j7858m0374m4085l7327l4845k2212j1394J010K4367M4864
13281C27650O5208R6646J20901J46910J44597J09704O0542J4873k5678n9691q0418
13270I21244p7592o1998m2689l9053l8251m1459l7374k0039j26K6301M7575M3362
$$ plain form
13258 679901 697077 682590 637429 572615 506563 455565 424077 402416 387577 387351 406051 427394
13246 427394 457672 518028 610905 751220 938809 1170004 1413592 1624195 1772965 1852512
13236 1852512 1860292 1801078 1689971 1546164 1394317 1248475 1119949 1004733 906611 826900
13226 826900 772158 749737 746595 757323 763345 750221 718914 662395 588975 517431 456972 413270
13214 413270 387107 379335 384936 404428 434133 476115 512462 551421 601756 670538 750887 844606
13202 844606 933351 998553 1036439 1042036 1031569 998767 927328 833850 727950 619582 530029
13191 530029 462571 416751 393549 384637 382267 367557 337498 304264 272408 251524 243858 246952
13179 246952 252969 254423 245188 228073 206676 184036 166942 158122 160052 175691 193228 216269
$$ packed form
13258F79901J7176j4487m5161o4814o6052n0998l1488k1661j4839k26J8700K1343
13246D27394L0278O0356R2877J40315J87589K31195K43588K10603J48770P9547
13236A852512P780n9214j11107j43807j51847j45842j28526j15216r8122p9711
13226H26900n4742k2421l142J0728O022j3124l1307n6519p3420p1544o0459m3702
13214D13270k6163p772N601J9492K9705M1982L6347L8959N0335O8782Q0349R3719
13202H44606Q8745O5202L7886N597j0467l2802p1439r3478j05900j08368q9553
13191E30029o7458m5820k3202q912k370j4710l0059l3234l1856k0884p666L094
13179B46952O017J454r235j7115k1397k2640j7094q820J930J5639J7537K3041
$$ plain form
13167 216269 231555 233249 221950 202380 188563 178040 175493 185592 203187 218701 222562 219620
13155 219620 207779 194929 180368 165616 161377 166571 180598 206883 234770 259416 278082 282761
13143 282761 277606 277086 286243 300878 337239 382109 417731 432860 425735 401503 361987 323058
13131 323058 293848 283534 289774 294991 290598 268445 231842 199714 177873 165424 170402 176485
13119 176485 194937 224323 263111 299805 313428 308606 289539 262406 243190 240331 252875 268398
13107 268398 275896 280750 269455 245444 214386 189795 174484 174041 189469 218910 250185 279248
13095 279248 300374 299866 284581 269444 250197 245583 251323 267727 290294 299245 288578 261208
13083 261208 233350 202577 181206 174834 177643 189660 213231 245044 280374 319206 342109 343341
$$ packed form
13167B16269J5286J694j1299j9570j3817j0523k547J0099J7595J5514L861k942
13155B19620j1841j2850j4561j4752m239N194J4027K6285K7887K4646J8666M679
13143B82761n155n20R157J4635L6361M4870L5622J5129p125k4232l9516l8929
13131C23058k9210j0314O240N217m393k2153l6603l2128k1841j2449M978O083
13119A76485J8452K9386L8788L6694J3623m822j9067k7133j9216k859J2544J5523
13107B68398P498M854j1295k4011l1058k4591j5311m43J5428K9441L1275K9063
13095B79248K1126n08j5285j5137j9247m614N740J6404K2567Q951j0667k7370
13083B61208k7858l0773k1371o372K809J2017K3571L1813L5330L8832K2903J232
$$ plain form
13071 343341 329739 309579 294599 292331 299452 308723 319102 309848 277055 238351 201439 171335
13059 171335 146620 127605 112302 100120 91041 85801 84706 77837 70677 62316 56166 48978 49055 47645
13045 47645 51575 55684 57050 59789 63400 70291 84377 99067 110457 126273 142848 157478 168016
13032 168016 175442 173461 170354 164304 158355 153071 147476 140596 127344 113886 106738 99607 90481 83023
13018 83023 73754 62979 54149 43446 34733 35116 36731 38132 36240 41827 42321 47547 54959 61423
13004 61423 68599 76711 86653 95563 106857 111286 120523 120863 117551 117494 114851 112913 100073 91666 89430
12989 89430 85159 84381 79400 76922 75952 75152 75864 82277 82206 84520 78643 74335 73526 76209 81366 87058
12973 87058 93524 98508 105234 115571 124633 134826 142795 151479 157832 164453 166497 165590 166113 170136
$$ packed form
13071C43341j3602k0160j4980k268P121R271J0379r254l2793l8704l6912l0104
13059A71335k4715j9015j5303j2182r079n240j095o869p160q361o150p188P7j410
13045D7645L930M109J366K739L611O891J4086J4690J1390J5816J6575J4630J0538
13032A68016P426j981l107o050n949n284n595o880j3252j3458p148p131r126p458
13018H3023r269j0775q830j0703q713L83J615J401j892N587M94N226P412O464
13004F1423P176Q112R942Q910J1294M429R237L40l312n7k643j938j2840q407k236
12989H9430m271p78m981k478r70q00P12O413p1K314n877m308q09K683N157N692
12973H7058O466M984O726J0337R062J0193P969Q684O353O621K044r07N23M023
$$ plain form
12959 170136 170782 172122 177135 186155 199116 217310 239375 263229 296794 337048 378415 429798
12947 429798 470195 490906 493264 468285 417741 358870 302712 253270 223491 200501 178198 164547
12935 164547 162361 166280 174563 180751 199993 228237 252538 273032 286569 292092 299618 303888 309759
12922 309759 319761 329628 338432 359151 386139 423595 469704 519290 567990 613386 653603 697037
12910 697037 737746 769795 779773 757547 694636 607387 507031 408639 315776 241460 187567
12899 187567 151495 126273 110642 99870 108331 128358 155127 186964 229012 271004 307526 337205
12887 337205 367109 390227 406858 424512 441743 464712 487774 509585 538609 569887 609099
12876 609099 651107 691701 732258 761264 790726 816400 840308 846267 827468 789952 740906 697165
$$ packed form
12959A70136O46J340N013R020J2961J8194K2065K3854L3565M0254M1367N1383
12947D29798M0397K0711K358k4979n0544n8871n6158m9442k9779k2990k2303j3651
12935A64547k186L919Q283O188J9242K8244K4301K0494J3537N523P526M270N871
12922C09759J0002R867Q804K0719K6988L7456M6109M9586M8700M5396M0217M3434
12910F97037M0709L2049R978k2226o2911q7249j00356r8392r2863p4316n3893
12899A87567l6072k5222j5631j0772Q461K0027K6769L1837M2048M1992L6522K9679
12887C37205K9904K3118J6631J7654J7231K2969K3062K1811K9024L1278L9212
12876F09099M2008M0594M0557K9006K9462K5674K3908N959j8799l7516m9046m3741
$$ plain form
12864 697165 667964 660722 684444 741829 813598 886567 964238 1050465 1148670 1250956 1363796
12853 1363796 1490972 1625932 1764207 1919127 2090778 2276826 2489150 2733443 3003320
12844 3003320 3318936 3681194 4096904 4570675 5109985 5729405 6440815 7247141 8162316
12835 8162316 9221074 10469406 11965335 13808452 16130507 19071468 22684175 26897934
12827 26897934 31580043 36640051 42325875 49256449 58279727 70427799 86740075 107229714
12819 107229714 129533567 148477252 158764007 158852710 151981942 141492678 128832710
12812 128832710 114534860 99677893 85164827 71625262 59669381 49805049 42175486
12805 42175486 36574676 32659910 30124632 28712905 28171756 28300656 28906311 29845717 31039433
$$ packed form
12864F97165k9201p242K3722N7385P1769P2969P7671Q6227R8205J02286J12840
12853A363796J27176J34960J38275J54920J71651J86048K12324K44293K69877
12844C003320L15616L62258M15710M73771N39310O19420P11410Q06326R15175
12835H162316J058758J248332J495929J843117K322055K940961L612707M213759
12827B6897934M682109N060008N685824O930574R023278J2148072J6312276K0489639
12819A07229714K2303853J8943685J0286755Q8703o870768j0489264j2659968
12812A28832710j4297850j4856967j4513066j3539565j1955881r864332p629563
12805D2175486n600810l914766k535278j411727n41149J28900O05655R39406J193716
$$ plain form
12796 31039433 32491047 34297568 36650570 39855287 44375388 50809912 59803793 71897436
12788 71897436 87313851 105855783 126989018 149922108 173773182 198372513 224482034
12781 224482034 251767363 276250963 290858871 290169898 274819811 250469325 223585977
12774 223585977 197829388 173549016 149817064 126571918 104940646 86079698 70449976
12767 70449976 58031509 48601574 41816308 37225613 34299315 32505813 31410326 30744664
12759 30744664 30366476 30190377 30217937 30571581 31464898 33130588 35764643 39568786 44902776
12750 44902776 52349072 62627844 76167001 92499577 109884239 125857922 138683719
12743 138683719 148486529 156720184 163095328 164074464 155600415 138301703 116749306 96010803
$$ packed form
12796C1039433J451614J806521K353002L204717M520101O434524Q993881J2093643
12788G1897436J5416415J8541932K1133235K2933090K3851074K4599331K6109521
12781B24482034K7285329K4483600J4607908o88973j5350087k4350486k6883348
12774B23585977k5756589k4280372k3731952k3245146k1631272j8860948j5629722
12767G0449976j2418467r429935o785266m590695k926298j793502j095487o65662
12759C0744664l78188j76099K7560L53644Q93317J665690K634055L804143N333990
12750D4902776P446296J0278772J3539157J6332576J7384662J5973683J2825797
12743A38683719R802810Q233655O375144R79136q474049j7298712k1552397k0738503
$$ plain form
12735 96010803 78697051 65270833 55120035 47225890 40635175 34694960 29211487 24320420
12727 24320420 20231028 17037027 14636663 12816995 11391145 10228046 9273440 8481706
12719 8481706 7808446 7227260 6706840 6233427 5809940 5433969 5098686 4805814 4548141
12710 4548141 4323096 4130275 3970399 3830078 3706730 3589934 3473359 3355420 3251069
12701 3251069 3161558 3079842 3000611 2920115 2835514 2746495 2663225 2592621 2529335 2466109 2394324
12690 2394324 2327645 2262605 2189294 2118728 2055796 1990004 1928884 1872215 1821925 1782801 1748852
12679 1748852 1714613 1683400 1655284 1624917 1592965 1563765 1538456 1516450 1499529 1483050 1464986
12668 1464986 1444224 1426781 1418157 1415504 1416576 1425051 1432174 1436350 1434807 1422841 1407487 1397972 1400682
$$ packed form
12735I6010803j7313752j3426218j0150798p894145o590715n940215n483473m891067
12727B4320420m089392l194001k400364j819668j425850j163099r54606p91734
12719H481706o73260n81186n20420m73413m23487l75971l35283k92872k57673
12710D548141k25045j92821j59876j40321j23348j16796j16575j17939j04351
12701C251069q9511q1716p9231q0496q4601q9019q3270p0604o3286o3226p1785
12690B394324o6679o5040p3311p0566o2932o5792o1120n6669n0290l9124l3949
12679A748852l4239l1213k8116l0367l1952k9200k5309k2006j6921j6479j8064
12668A464986k0762j7443q624k653J072Q475P123M176j543j1966j5354r515K710
$$ plain form
12655 1400682 1407839 1406882 1383203 1349679 1305281 1257298 1201935 1150688 1105684 1064853 1030253 999621
12643 999621 980472 969488 958046 948692 951141 963224 974529 989167 1010357 1031694 1054847 1067758
12631 1067758 1063736 1043413 1023413 1014301 1020902 1045641 1081269 1126403 1170973 1191393 1194860 1182040
12619 1182040 1160884 1132787 1103438 1077734 1059970 1036229 1012183 986665 963369 942262 926303
12608 926303 909786 899308 891421 880924 882169 895115 914276 929558 928277 912155 886471 852757
12596 852757 819602 792298 769555 757653 749981 745504 751013 767983 782170 792911 799089 799150 796135
12583 796135 789874 782570 773945 759112 741360 718757 700619 689892 680611 673537 676308 683656 707400
12570 707400 736406 757439 781280 821869 875853 950533 1061867 1221111 1418426 1634131 1829014
$$ packed form
12655A400682P157r57k3679l3524m4398m7983n5363n1247m5004m0831l4600l0632
12643I99621j9149j0984j1442r354K449J2083J1305J4638K1190K1337K3153J2911
12631A067758m022k0323k0000r112O601K4739L5628M5134M4570K0420L467j2820
12619A182040k1156k8097k9349k5704j7764k3741k4046k5518k3296k1107j5959
12608I26303j6517j0478p887j0497J245J2946J9161J5282j281j6122k5684l3714
12596H52757l3155k7304k2743j1902p672m477N509J6970J4187J0741O178O1l015
12583G96135o261p304q625j4833j7752k2603j8138j0727r281p074K771P348K3744
12570G07400K9006K1033K3841M0589N3984P4680J11334J59244J97315K15705J94883
$$ plain form
12559 1829014 1947552 1962939 1882804 1745757 1608145 1494805 1421319 1396016 1394132 1401776 1398646
12548 1398646 1382351 1357308 1333192 1308082 1267491 1200615 1123796 1040930 955641 890545 852963
12537 852963 833086 839483 868232 896150 923206 947799 959408 972624 997563 1041923 1112579 1202164
12525 1202164 1301842 1403229 1484876 1547154 1584580 1585329 1550385 1495914 1439211 1387500 1338817
12514 1338817 1283809 1219164 1153905 1092690 1031625 962222 899154 854060 823755 815199 837548
12503 837548 888135 974099 1095074 1231916 1345139 1410184 1408689 1350359 1254201 1163967 1110973
12492 1110973 1112516 1167933 1274760 1428048 1587532 1706226 1751269 1711033 1619023 1519657 1443262
12481 1443262 1400151 1379601 1357953 1329090 1310722 1314378 1351785 1419916 1491543 1551514 1575671
$$ packed form
12559A829014J18538J5387q0135j37047j37612j13340p3486k5303j884P644l130
12548A398646j6295k5043k4116k5110m0591o6876p6819q2866q5289o5096l7582
12537H52963j9877O397K8749K7918K7056K4593J1609J3216K4939M4360P0656Q9585
12525A202164R9678J01387Q1647O2278L7426P49l4944n4471n6703n1711m8683
12514A338817n5008o4645o5259o1215o1065o9403o3068m5094l0305q556K2349
12503H37548N0587Q5964J20975J36842J13223O5045j495n8330r6158r0234n2994
12492A110973J543N5417J06827J53288J59484J18694M5043m0236r2010r9366p6395
12481A443262m3111k0550k1648k8863j8368L656L7407O8131P1627N9971K4157
$$ plain form
12470 1575671 1550016 1489151 1417147 1348218 1298897 1281751 1300927 1346071 1408841 1459941 1488290
12459 1488290 1489012 1459224 1419761 1365923 1311849 1268444 1230857 1213697 1214401 1223532 1223760 1204643 1168873
12446 1168873 1127363 1094522 1076168 1075216 1087496 1104536 1116447 1111744 1096708 1081990 1061953 1031249
12434 1031249 992128 960500 948777 967276 1023485 1114992 1225581 1324183 1383220 1392139 1369999
12423 1369999 1337247 1313570 1303258 1304014 1304844 1299927 1288649 1261600 1222007 1171312 1119928 1083095
12411 1083095 1067319 1069744 1085891 1099083 1091940 1068557 1026916 975945 938171 911409 889973 870477
12399 870477 856289 840499 831252 829615 830122 838472 862862 904139 951599 998136 1042195 1084909
12387 1084909 1128906 1163716 1176684 1157332 1097816 1006682 906227 828886 793769 787357 802060
$$ packed form
12470A575671k5655o0865p2004o8929m9321j7146J9176M5144O2770N1100K8349
12459A488290P22k9788l9463n3838n4074m3405l7587j7160P04R131K28j9117l5770
12446A168873m1510l2841j8354r52J2280J7040J1911m703j5036j4718k0037l0704
12434A031249l9121l1628j1723J8499N6209R1507J10589R8602N9037Q919k2140
12423A369999l2752k3677j0312P56Q30m917j1278k7049l9593n0695n1384l6833
12411A083095j5776K425J6147J3192p143k3383m1641n0971l7774k6762k1436j9496
12399H70477j4188j5790r247j637N07Q350K4390M1277M7460M6537M4059M2714
12387A084909M3997L4810J2968j9352n9516r1134j00455p7341l5117o412J4703
$$ plain form
12376 802060 832255 869166 908265 944278 975129 990800 989023 959997 920449 875956 818945 760335
12364 760335 710556 682027 667401 662281 677969 706214 747712 801338 865555 944915 1040275 1139195
12352 1139195 1227432 1295183 1337881 1348919 1327296 1266830 1184360 1093694 1007734 926006 849721
12341 849721 775113 709797 656653 617833 586015 571724 568847 578441 592288 612265 638425 668793
12329 668793 699451 737534 788799 848915 914947 985849 1065256 1151317 1245154 1348561 1473576
12318 1473576 1617010 1771766 1919158 2038520 2113366 2124576 2067939 1950313 1781268 1580366
12308 1580366 1363054 1159311 996865 885354 811802 759638 720468 698531 674332 646045
12298 646045 621552 596989 569635 545872 525357 508300 495089 493914 496811 499922 506029 499713
$$ packed form
12376H02060L0195L6911L9099L6013L0851J5671j777k9026l9548m4493n7011n8610
12364G60335m9779k8529j4626n120J5688K8245M1498N3626O4217P9360R5360R8920
12352A139195Q8237O7751M2698J1038k1623o0466q2470r0666q5960q1728p6285
12341H49721p4608o5316n3144l8820l1818j4291k877R594J3847J9977K6160L0368
12329F68793L0658L8083N1265O0116O6032P0902P9407Q6061R3837J03407J25015
12318A473576J43434J54756J47392J19362P4846J1210n6637j17626j69045k00902
12308A580366k17312k03743j62446j11511p3552n2164l9170k1937k4199k8287
12298F46045k4493k4563k7354k3763k0515j7057j3211j175K897L111O107o316
$$ plain form
12286 499713 490731 484871 488202 509213 551000 618579 714640 832407 956518 1073541 1173780
12275 1173780 1236294 1236012 1170599 1054963 910696 767748 641263 537696 456121 398756 367232
12264 367232 343690 327125 316033 302540 290767 283071 270220 259608 251652 245086 240034 230869
12252 230869 224185 223477 225983 225879 223715 225883 226459 219907 217919 220600 217654 212617 209528 207199 204216
12237 204216 206367 206243 203901 198611 196219 191377 188806 187164 188975 191301 192895 192675 191350 192669 198410
12222 198410 200050 193153 190866 196775 202132 206661 212350 217197 218461 213629 204031 197838 195896 193963
12208 193963 195709 198596 198387 197511 198955 201434 202543 208251 203023 201348 206642 207701 209057 201099 190756
12193 190756 182877 178815 176320 175750 178070 182414 181718 174877 173889 178738 178325 178398 176901 177006 177409 177825
$$ packed form
12286D99713q982n860L331K1011M1787O7579R6061J17767J24111J17023J00239
12275A173780O2514k82o5413j15636j44267j42948j26485j03567q1575n7365l1524
12264C67232k3542j6565j1092j3493j1773p696j2851j0612p956o566n052r165
12252B30869o684p08K506j04k164K168N76o552j988K681k946n037l089k329k983
12237B04216K151j24k342n290k392m842k571j642J811K326J594k20j325J319N741
12222A98410J640o897k287N909N357M529N689M847J264m832r598o193j942j933
12208A93963J746K887k09q76J444K479J109N708n228j675N294J059J356p958j0343
12193A90756p879m062k495n70K320M344o96o841r88M849m13P3j497J05M03M16
$$ plain form
12177 177825 172384 168927 166772 168666 170577 171535 170893 169392 168411 164320 167352 166137 163728 163705 166825
12162 166825 169161 173584 178598 178249 176402 176419 176777 171757 175012 175564 171040 168151 166215 163895 159505
12147 159505 156361 152559 154281 157659 157154 156148 154193 158790 160408 160172 157578 159477 164659 163496 163728
12132 163728 164022 158086 156062 159270 164600 166529 171691 175533 177696 180625 180462 179880 176058 173041 169649
12117 169649 168030 170679 171089 166375 165137 168341 165828 162835 166248 170027 173636 175180 174781 175397 174812
12102 174812 172951 166940 166424 168738 172225 175981 178313 171041 166810 166818 166313 165337 171909 173831 169514 169407
12086 169407 171107 171956 171574 172197 178592 181543 183800 185068 184375 186141 182284 178218 176415 179551 181547
12071 181547 188324 191466 187694 179056 171725 169573 166807 167573 171241 175344 180935 183637 180359 177029
$$ packed form
12177A77825n441l457k155J894J911R58o42j501r81m091L032j215k409k3L120
12162A66825K336M423N014l49j847J7L58n020L255N52m524k889j936k320m390
12147A59505l144l802J722L378n05j006j955M597J618k36k594J899N182j163K32
12132A63728K94n936k024L208N330J929N162L842K163K929j63n82l822l017l392
12117A69649j619K649M10m714j238L204k513k993L413L779L609J544l99O16n85
12102A74812j861o011n16K314L487L756K332p272m231Qn05r76O572J922m317j07
12086A69407J700Q49l82O23O395K951K257J268o93J766l857m066j803L136J996
12071A81547O777L142l772q638p331k152k766P66L668M103N591K702l278l330
$$ plain form
12057 177029 175445 181123 185183 188809 187430 189274 188222 183843 178431 177714 181688 185442 182526 188901
12043 188901 189625 186672 183065 182911 185603 191698 199728 202833 203009 201772 205078 206264 211760 214102 216008
12028 216008 219658 224449 226254 225087 225597 228988 235358 243782 253657 257892 261750 270136 275987 283209
12014 283209 294077 309688 327420 344342 359054 371784 392081 418232 441468 464369 499226
12003 499226 536986 573058 614712 662986 718013 774402 831191 894256 959188 1015308 1065727
11992 1065727 1117257 1158157 1186549 1199518 1193108 1172860 1145333 1102511 1048074 988657 925299
11981 925299 858929 792940 735845 680870 631035 587520 544444 506878 468427 442719 419699
11970 419699 392770 367594 346951 330306 313174 298743 285501 273488 266084 260024 255007 249212
$$ packed form
12057A77029j584N678M060L626j379J844j052m379n412p17L974L754k916O375
12043A88901P24k953l607j54K692O095Q030L105J76j237L306J186N496K342J906
12028B16008L650M791J805j167N10L391O370Q424R875M235L858Q386N851P222
12014B83209J0868J5611J7732J6922J4712J2730K0297K6151K3236K2901L4857
12003D99226L7760L6072M1654M8274N5027N6389N6789O3065O4932N6120N0419
11992A065727N1530M0900K8392J2969o410k0248k7527m2822n4437n9417o3358
11981I25299o6370o5989n7095n4975m9835m3515m3076l7566l8451k5708k3020
11970D19699k6929k5176k0643j6645j7132j4431j3242j2013p404o060n017n795
$$ plain form
11958 249212 240464 235928 232669 228586 224374 217732 213383 211921 209526 202973 201808 197127 190938 184949
11944 184949 184669 182985 183059 184338 186219 186954 188151 186320 181200 178525 175402 171855 167605 163486 165130
11929 165130 169429 172496 172123 169779 164811 164660 165313 166650 164325 160974 159785 159855 160479 157100 153004 153492
11913 153492 152249 151358 147568 143647 145552 150572 155667 157302 152565 144603 143859 149932 157558 156791 151463
11898 151463 153014 157420 156815 154167 153660 156156 156824 152156 149312 147514 145359 143724 143126 148109 149580
11883 149580 151422 154699 152833 152618 145485 147329 154342 155539 150607 152375 150033 144842 140112 140135 143903
11868 143903 141999 142687 136823 132904 131901 131589 134200 132507 135441 145714 145010 146899 146054 143001 141389
11853 141389 139277 138420 140464 146467 147462 144516 140039 139786 141528 142360 140766 138377 135606 132153 130270
$$ packed form
11958B49212q748m536l259m083m212o642m349j462k395o553j165m681o189n989
11944A84949k80j684P4J279J881P35J197j831n120k675l123l547m250m119J644
11929A65130M299L067l73k344m968j51O53J337k325l351j189P0O24l379m096M88
11913A53492j243q91l790l921J905N020N095J635m737p962p44O073P626p67n328
11898A51463J551M406o05k648n07K496O68m668k844j798k155j635n98M983J471
11883A49580J842L277j866k15p133J844P013J197m932J768k342n191m730K3L768
11868A43903j904O88n864l919j003l12K611j693K934J0273p04J889q45l053j612
11853A41389k112q57K044O003R95k946m477k53J742Q32j594k389k771l453j883
$$ plain form
11838 130270 132824 136289 140447 136440 134484 134156 135761 138558 135630 132644 134413 135590 133852 132942 132322
11823 132322 128493 125725 126600 124720 126121 129743 131958 137319 139784 139736 137033 134311 128801 128358 126424
11808 126424 126202 129116 128328 131071 130122 129710 132570 138694 135474 131984 133807 139487 136199 131275 130478
11793 130478 130364 136317 140765 141274 144938 141435 137796 139157 139310 139129 142797 140845 136845 134500 133173
11778 133173 135592 134857 131766 129740 132375 129634 125721 125952 126532 127261 129330 137883 138809 136271 136823 139238
11762 139238 139800 142872 140989 140877 143515 143854 143258 142660 143664 143678 150096 149315 146641 143424 141022 144044
11746 144044 142719 142349 147447 152291 152388 149645 150020 146146 145392 151029 153534 155323 154999 151694 153601 157216
11730 157216 159221 154538 152854 150764 147419 142345 139428 136042 137509 140481 139334 136018 138130 142113
$$ packed form
11838A30270K554L465M158m007j956l28J605K797k928k986J769J177j738r10o20
11823A32322l829k768Q75j880J401L622K215N361K465m8k703k722n510m43j934
11808A26424k22K914p88K743r49m12K860O124l220l490J823N680l288m924p97
11793A30478j14N953M448N09L664l503l639J361J53j81L668j952m000k345j327
11778A33173K419p35l091k026K635k741l913K31N80P29K069Q553R26k538N52K415
11762A39238N62L072j883j12K638L39n96n98J004J4O418p81k674l217k402L022
11746A44044j325l70N098M844R7k743L75l874p54N637K505J789l24l305J907L615
11730A57216K005m683j684k090l345n074k917l386J467K972j147l316K112L983
$$ plain form
11716 142113 143272 139952 140021 139345 140796 143881 142188 135819 133721 132746 134586 132441 130138 132819 133423
11701 133423 136258 137933 133381 132753 130251 128369 127833 128262 128802 132378 133001 129394 129597 135434 135147 128284
11685 128284 127498 126352 133420 132670 132804 129845 128276 127775 128897 130742 135589 133021 129785 127124 128485
11670 128485 125800 123064 123875 124529 129283 135620 136213 133407 134394 137085 135042 135885 131714 133374 135266
11655 135266 138070 140856 137071 132254 129864 130118 134668 133768 128928 123910 123246 123160 119702 120956 115482
11640 115482 116560 123429 127521 129059 134694 135339 136515 136945 133758 128088 128466 131053 132379 130167 132502
11625 132502 132093 128780 129113 130046 132470 130877 131879 132421 126944 120484 122097 122867 122087 126479 133588 131695
11609 131695 132042 135118 137582 139709 136469 133064 135325 143666 142020 136875 129777 127079 132234 131826 132990
$$ packed form
11716A42113J159l320O9o76J451L085j693o369k098r75J840k145k303K681O04
11701A33423K835J675m552o28k502j882n36M29N40L576O23l607K03N837k87o863
11685A28284p86j146P068p50J34k959j569n01J122J845M847k568l236k661J361
11670A28485k685k736Q11O54M754O337N93k806R87K691k043Q43m171J660J892
11655A35266K804K786l785m817k390K54M550r00m840n018o64q6l458J254n474
11640A15482J078O869M092J538N635O45J176M30l187n670L78K587J326k212K335
11625A32502m09l313L33R33K424j593J002N42n477o460J613P70p80M392P109j893
11609A31695L47L076K464K127l240l405K261Q341j646n145p098k698N155m08J164
$$ plain form
11594 132990 134420 133687 135046 131376 129102 125344 122703 124682 127647 126336 128363 127958 125096 124261 129042
11579 129042 130502 129060 133555 132676 129250 126240 131498 132503 132550 130524 127775 131082 133819 133343 135740
11564 135740 133052 130140 134350 135082 132677 128678 129939 130851 125308 122906 126030 130772 133595 135018 136006
11549 136006 134188 130852 130600 130185 128954 130106 131763 126044 127356 131804 132114 132790 134295 132616 134207
11534 134207 132215 129743 130568 134112 134231 134716 132527 134573 134110 128611 127615 132674 132263 133457 135056 131748
11518 131748 128874 130858 132560 134399 135488 135956 132244 131461 132037 128895 128889 130016 134715 133361 129401 133362
11502 133362 139624 140749 137918 134542 134131 135228 133200 133589 132173 129391 130020 134480 139121 138457 139810
11487 139810 136066 130683 130473 137371 141590 142274 138219 139686 143963 145318 144351 140583 137392 138069 140205
$$ packed form
11594A32990J430p33J359l670k274l758k641J979K965j311K027m05k862q35M781
11579A29042J460j442M495q79l426l010N258J005M7k026k749L307K737m76K397
11564A35740k688k912M210P32k405l999J261R12n543k402L124M742K823J423R88
11549A36006j818l336k52m15j231J152J657n719J312M448L10O76J505j679J591
11534A34207j992k472Q25L544J19M85k189K046m63n499r96N059m11J194J599l308
11518A31748k874J984J702J839J089M68l712p83N76l142oJ127M699j354l960L961
11502A33362O262J125k831l376m11J097k028L89j416k782O29M460M641o64J353
11487A39810l744n383k10O898M219O84m055J467M277J355r67l768l191O77K136
$$ plain form
11472 140205 138472 137366 138871 140868 139810 140417 137203 136762 138909 140451 136146 130670 134154 139872 136208
11457 136208 128008 126439 128208 132189 132205 130444 134917 137668 137494 137776 134636 134966 138035 140225 140867 138967
11441 138967 134746 135558 136947 140755 139761 138873 141541 136702 137065 144445 145516 145118 141913 138551 138462 137065
11425 137065 134208 137387 138187 136606 136536 137977 142754 149328 146555 134449 138505 142370 144434 141440 134377
11410 134377 132709 136678 139741 135091 132677 138675 132537 129911 133442 136843 138430 139410 142616 141641 134572
11395 134572 134245 136939 139783 141461 141060 143114 145404 144021 140681 139481 143380 143491 145992 148671 147345
11380 147345 139909 144213 147609 152253 153039 152363 155792 156941 156121 159666 159688 159777 160565 164160 169421 166815
11364 166815 160729 161335 157874 150330 148295 151808 156005 159205 156031 151332 148580 150269 151074 150313 153989
$$ packed form
11472A40205j733j106J505J997j058O07l214m41K147J542m305n476L484N718l664
11457A36208q200j569J769L981J6j761M473K751j74K82l140L30L069K190O42j900
11441A38967m221Q12J389L808r94q88K668m839L63P380J071l98l205l362q9j397
11425A37065k857L179Q00j581p0J441M777O574k773j2106M056L865K064k994p063
11410A34377j668L969L063m650k414N998o138k626L531L401J587R80L206r75p069
11395A34572l27K694K844J678m01K054K290j383l340j200L899J11K501K679j326
11380A47345p436M304L396M644P86o76L429J149q20L545K2Q9P88L595N261k606
11364A66815o086O06l461p544k035L513M197L200l174m699k752J689Q05p61L676
$$ plain form
11349 153989 158244 159215 155671 151953 152154 146952 142130 147139 150613 150941 150981 151637 151901 152626 156001 152323
11333 152323 152102 154753 148268 144858 147861 148951 143964 143000 144467 145083 143499 146080 152371 152858 150775
11318 150775 148075 148083 145515 147823 149417 152947 156275 154800 157391 157363 154268 153668 156905 162590 162495 159794
11302 159794 165513 163075 164582 166577 168372 167003 164117 158868 156259 156850 155914 160498 161829 162696 158465
11287 158465 155832 160558 161082 161011 154581 148341 147350 149622 152704 154194 159855 160427 154936 151137 149552
11272 149552 147641 145410 146409 147993 150548 153673 156718 157123 157405 159700 161254 156244 159734 161799 161289
11257 161289 159532 158702 155706 147600 150226 155144 160274 164440 166084 163046 165559 164992 169832 183292
11243 183292 184033 179548 176341 175314 176365 175942 177442 173492 172921 172332 173511 174497 172701 172277 176460 172907
$$ packed form
11349A53989M255R71l544l718K01n202m822N009L474L28M0O56K64P25L375l678
11333A52323k21K651o485l410L003J090m987r64J467O16j584K581O291M87k083
11318A50775k700Qk568K308J594L530L328j475K591k8l095o00L237N685r5k701
11302A59794N719k438J507J995J795j369k886n249k609N91r36M584J331Q67m231
11287A58465k633M726N24p1o430o240r91K272L082J490N661N72n491l799j585
11272A49552j911k231R99J584K555L125L045M05K82K295J554n010L490K065n10
11257A61289j757q30k996q106K626M918N130M166J644l038K513n67M840J3460
11243A83292P41m485l207j027J051m23J500l950n71n89J179R86j796m24M183l553
$$ plain form
11227 172907 165990 168336 168953 168790 165819 160558 159959 168288 169479 167768 171803 167938 164176 164972 165611
11212 165611 165824 169579 174028 175356 172301 168940 170285 167429 163031 164599 163197 163210 166435 166609 169888
11197 169888 170705 167289 168215 169193 168295 164788 169168 170827 169157 166172 167756 171506 171378 167070 167271 173186
11181 173186 177472 176373 173439 176470 174710 172880 175703 175655 171275 172377 169746 164995 165718 166249 169821
11166 169821 169828 170604 170595 168924 174008 177359 174393 172293 172943 173083 170022 170103 174282 178520 179063 179165 173754
11149 173754 175429 179756 180313 180865 181082 172217 169563 173553 178805 184135 184143 180935 178825 177128 175394 174310
11133 174310 172373 165204 166899 176113 178256 183397 184539 183976 184803 184739 182653 186912 187948 184369 185611
11118 185611 187366 183073 182679 180902 184955 186310 188138 187758 185464 181422 183289 188967 187864 186177 188507
$$ packed form
11227A72907o917K346O17j63k971n261n99Q329J191j711M035l865l762P96O39
11212A65611K13L755M449J328l055l361J345k856m398J568j402J3L225J74L279
11197A69888Q17l416R26R78q98l507M380J659j670k985J584L750j28m308K01N915
11181A73186M286j099k934L031j760j830K823m8m380J102k631m751P23N31L572
11166A69821PP76rj671N084L351k966k100O50J40l061Q1M179M238N43J02n411
11149A73754J675M327N57N52K17q865k654L990N252N330Ql208k110j697j734j084
11133A74310j937p169J695R214K143N141J142n63Q27o4k086M259J036l579J242
11118A85611J755m293l94j777M053J355J828l80k294m042J867N678j103j687K330
$$ plain form
11103 188507 187077 189385 189386 187147 184915 187890 192138 189488 187238 189296 192650 199224 203892 208622 207229
11088 207229 204239 201854 202270 206089 205218 204072 205179 204546 202245 197707 195350 204569 209116 205912 204152
11073 204152 202614 200851 193771 192553 200169 202110 202859 201129 201766 200086 195817 193361 195097 197149 194152
11058 194152 195424 196381 197037 203132 204139 206885 208645 209753 208226 204584 201631 204057 206291 205908 206120
11043 206120 209132 210783 216816 222776 219209 212099 207526 206343 213966 219000 215458 210624 208823 215504
11029 215504 220475 220988 217125 213261 209621 209873 212582 212303 209729 207344 206206 210745 214647 215047 218014
11014 218014 220051 219273 223976 226650 228584 227578 224553 222808 226518 232446 231515 229010 231334 229077 224373
10999 224373 224811 229795 233007 233788 238655 239185 240213 240505 238566 232937 232135 231596 231339 230145 233522 237492
$$ packed form
11103A88507j430K308Jk239k232K975M248k650k250K058L354O574M668M730j393
11088B07229k990k385M16L819q71j146J107o33k301m538k357R219M547l204j760
11073B04152j538j763p080j218P616J941P49j730O37j680m269k456J736K052k997
11058A94152J272R57O56O095J007K746J760J108j527l642k953K426K234l83K12
11043B06120L012J651O033N960l567p110m573j183P623N034l542m834j801O681
11029B15504M971N13l863l864l640K52K709k79k574k385j138M539L902M00K967
11014B18014K037p78M703K674J934j006l025j745L710N928r31k505K324k257m704
10999B24373M38M984L212P81M867N30J028K92j939n629q02n39k57j194L377L970
$$ plain form
10983 237492 234189 225903 228506 234998 240476 238626 239811 238521 233224 234181 235329 230849 234929 240251
10969 240251 242171 243432 245797 247711 245963 243673 242487 241307 237780 237487 243044 247280 246094 248497
10955 248497 252949 250585 250421 253156 255535 256850 254163 251649 252086 258587 262266 263500 263969 263435 266865
10940 266865 268403 267725 265042 265905 264349 265818 266877 262674 263347 264381 265725 266380 265613 266643 269825
10925 269825 269118 268618 266412 266005 267468 267386 272091 273604 272489 272999 272836 277957 287048 291299 297526 300116
10909 300116 303123 309039 319673 333727 342485 357339 370632 385687 409414 432298 466432 515168
10897 515168 577528 659074 750494 841839 920350 960944 968809 959032 947552 945450 945192 951211 961510
10884 961510 965045 948021 894126 805400 710677 624599 560728 515733 484883 461988 446325 438971
$$ packed form
10983B37492l303q286K603O492N478j850J185j290n297R57J148m480M080N322
10969B40251J920J261K365J914j748k290j186j180l527k93N557M236j186K403
10955B48497M452k364j64K735K379J315k687k514M37O501L679J234M69n34L430
10940B66865J538o78k683Q63j556J469J059m203O73J034J344O55p67J030L182
10925B69825p07n00k206m07J463q2M705J513j115N10j63N121R091M251O227K590
10909C00116L007N916J0634J4054Q758J4854J3293J5055K3727K2884L4134M8736
10897E15168O2360Q1546R1420R1345P8511M0594P865r777j1480k102k58O019J0299
10884I61510L535j7024n3895q8726r4723q6078o3871m4995l0850k2895j5663p354
$$ plain form
10872 438971 437937 435209 438238 441591 454520 467361 486224 510129 536753 568648 612557 680238
10860 680238 772350 893306 1037069 1190677 1345025 1473399 1550637 1570496 1551147 1521357
10850 1521357 1502597 1504700 1523918 1539480 1539257 1497949 1389594 1234920 1063719 904711 770446
10839 770446 674643 610442 568691 540073 515025 494924 482733 475860 472027 468940 472935 475694
10827 475694 484219 498951 515383 539461 577931 629189 702340 793358 899305 987931 1041353
10816 1041353 1063995 1072962 1084859 1105009 1123050 1122477 1102241 1088347 1087760 1085924 1069803 1018624
10804 1018624 935125 839710 745746 670158 607944 555722 513987 489149 469274 448857 442380
10793 442380 438930 432735 425089 420156 424339 419070 416996 423317 430918 435748 433682 432986 437963 441130
$$ packed form
10872D38971j034k728L029L353J2929J2841J8863K3905K6624L1895M3909O7681
10860F80238R2112J20956J43763J53608J54348J28374P7238J9859j9349k9790
10850A521357j8760K103J9218J5562k23m1308j08355j54674j71201j59008j34265
10839G70446r5803o4201m1751k8618k5048k0101j2191o873l833l087L995K759
10827D75694Q525J4732J6432K4078L8470N1258P3151R1018J05947Q8626N3422
10816A041353K2642Q967J1897K0150J8041n73k0236j3894n87j836j6121n1179
10804A018624q3499r5415r3964p5588o2214n2222m1735k4838j9875k0417o477
10793D42380l450o195p646m933M183n269k074O321P601M830k066o96M977L167
$$ plain form
10779 441130 443190 449302 453730 462524 475398 498732 522178 549578 576377 594177 594249 587474 580545
10766 580545 575361 580687 603750 628515 642309 638115 618035 586336 558856 535320 527104 528778
10754 528778 526947 520420 518306 529833 547099 567593 588863 600494 602449 597320 589407 589972 602086
10741 602086 627878 658220 675677 680285 666947 650195 634338 621320 613764 612752 619520 630717
10729 630717 644942 660313 686593 719361 759062 789500 797159 780987 760339 746204 741235 756143
10717 756143 780409 805988 809923 788636 748980 702913 668270 649850 643022 646333 659196 677295
10705 677295 692207 700589 705941 719630 744824 782500 824080 863096 883672 880864 863608 840479
10693 840479 824738 818250 817965 823523 827812 831335 826872 823599 830010 850250 872228 889402 893241
$$ packed form
10779D41130K060O112M428Q794J2874K3334K3446K7400K6799J7800P2o775o929
10766E80545n184N326K3063K4765J3794m194k0080l1699k7480k3536q216J674
10754E28778j831o527k114J1527J7266K0494K1270J1631J955n129p913N65J2114
10741F02086K5792L0342J7457M608j3338j6752j5857j3018p556j012O768J1197
10729F30717J4225J5371K6280L2768L9701L0438P659j6172k0648j4135m969J4908
10717G56143K4266K5579L935k1287l9656m6067l4643j8420o828L311J2863J8099
10705F77295J4912Q382N352J3689K5194L7676M1580L9016K0576k808j7256k3129
10693H40479j5741o488k85N558M289L523m463l273O411K0240K1978J7174L839
$$ plain form
10680 893241 885502 881884 889702 929530 995135 1078012 1166357 1229584 1250537 1251246 1227384 1187388
10668 1187388 1148436 1125815 1125875 1145761 1173368 1195836 1206169 1205218 1195986 1180758 1153484 1115304
10656 1115304 1076531 1048201 1045426 1073278 1126060 1177885 1200618 1174755 1113581 1035548 962881
10645 962881 910595 880898 862366 852966 853825 867783 902463 947701 1007481 1076547 1148502 1205346
10633 1205346 1241238 1245312 1235284 1225696 1224836 1244849 1273429 1306446 1319781 1305397 1273684 1244628
10621 1244628 1229595 1234532 1267589 1330646 1407947 1490479 1575292 1672078 1789012 1918364 2020632
10610 2020632 2058351 2028513 1937246 1820662 1714393 1630210 1559386 1499957 1437799 1366397 1289291
10599 1289291 1223981 1168370 1129133 1109365 1103693 1115854 1141325 1160898 1171543 1176881 1183477 1193656
$$ packed form
10680H93241p739l618P818L9828O5605Q2877Q8345O3227K0953P09k3862l9996
10668A187388l8952k2621O0J9886K7607K2468J0333r51r232j5228k7274l8180
10656A115304l8773k8330k775K7852N2782N1825K2733k5863o1174p8033p2667
10645I62881n2286k9697j8532r400Q59J3958L4680M5238N9780O9066P1955N6844
10633A205346L5892M074j0028r588q60K0013K8580L3017J3335j4384l1713k9056
10621A244628j5033M937L3057O3057P7301Q2532Q4813R6786J16934J29352J02268
10610B020632L7719k9838r1267j16584j06269q4183p0824n9429o2158p1402p7106
10599A289291o5310n5611l9237j9768n672J2161K5471J9573J0645N338O596J0179
$$ plain form
10587 1193656 1203229 1216779 1235397 1260263 1296095 1340405 1399252 1470880 1555363 1655728 1768960
10576 1768960 1890788 2011754 2123789 2197233 2201600 2139645 2029195 1900874 1779161 1671688
10566 1671688 1588562 1518727 1458948 1402938 1351053 1298571 1262302 1242892 1238099 1250215 1277940
10555 1277940 1314915 1352180 1386296 1413855 1442497 1468818 1502667 1534400 1566917 1606621 1645502
10544 1645502 1688744 1735045 1789562 1847791 1900651 1947156 1992353 2034928 2075825 2119576 2157842
10533 2157842 2180906 2193083 2193435 2179276 2164350 2161816 2185468 2235637 2309211 2401695 2499561 2596228
10521 2596228 2703982 2828369 2962241 3101927 3246053 3398538 3572529 3771508 4001213
10512 4001213 4257686 4534994 4849419 5199296 5597704 6050851 6569449 7159347 7821909
$$ packed form
10587A193656R573J3550J8618K4866L5832M4310N8847P1628Q4483J00365J13232
10576A768960J21828J20966J12035P3444M367o1955j10450j28321j21713j07473
10566A671688q3126o9835n9779n6010n1885n2482l6269j9410m793J2116K7725
10555A277940L6975L7265L4116K7559K8642K6321L3849L1733L2517L9704L8881
10544A645502M3242M6301N4517N8229N2860M6505M5197M2575M0897M3751L8266
10533B157842K3064J2177L52j4159j4926k534K3652N0169P3574R2484R7866R6667
10521B596228J07754J24387J33872J39686J44126J52485J73991J98979K29705
10512D001213K56473K77308L14425L49877L98408M53147N18598N89898O62562
$$ plain form
10503 7821909 8565220 9404597 10348840 11393037 12555959 13905256 15543400 17591127 20209567
10494 20209567 23584423 27875869 33141239 39417675 46833428 55812073 66855847 80149581
10486 80149581 95278969 111658048 128719239 145100891 157199080 160773573 155040250
10479 155040250 144074716 133057471 124535995 117345177 108514185 96059386 80916670
10472 80916670 65798040 53035699 43420015 36674759 32207625 29480141 28089891 27693567
10464 27693567 27975111 28668084 29674975 31038719 32810997 35063495 37939980 41758375
10456 41758375 46981309 54067453 63363178 75135003 89606409 107025921 127860739
10449 127860739 152683816 181593506 213708222 247051810 278317170 302423964 313267890
$$ packed form
10503G821909P43311Q39377R44243J044197J162922J349297J638144K047727K618440
10494B0209567L374856M291446N265370O276436P415753Q978645J1043774J3293734
10486H0149581J5129388J6379079J7061191J6381652J2098189L574493n733323
10479A55040250j0965534j1017245q521476p190818q830992j2454799j5142716
10472H0916670j5118630j2762341r615684o745256m467134k727484j390250l96324
10464B7693567K81544O92973J006891J363744J772278K252498K876485L818395
10456D1758375N222934P086144R295725J1771825J4471406J7419512K0834818
10449A27860739K4823077K8909690L2114716L3343588L1265360K4106794J0843926
$$ plain form
10442 313267890 306983618 285031850 253251450 218277839 184772150 155043345 129573911
10435 129573911 107824323 89082812 73058313 59787121 49290981 41424202 35804249
10428 35804249 31904357 29212566 27402158 26303766 25778511 25642887 25740130 26048410 26741110
10419 26741110 28059423 30250250 33645527 38742759 46203335 56611417 69892700 84716682
10411 84716682 98624658 109393752 116711927 122539214 129249379 137383711 144155724 145112457
10403 145112457 137874451 124395650 107916179 90808090 74496506 60245727 48823977
10396 48823977 40077092 33236314 27499426 22459159 18122964 14617021 11947219 9990689
10388 9990689 8557947 7485390 6655399 5987907 5425009 4912756 4436940 4000668 3618823
$$ packed form
10442C13267890o284272k1951768l1780400l4973611l3505689k9728805k5469434
10435A29573911k1749588j8741511j6024499j3271192j0496140p866779n619953
10428C5804249l899892k691791j810408j098392n25255j35624R7243L08280O92700
10419B6741110J318313K190827L395277N097232P460576J0408082J3281283J4823982
10411H4716682J3907976J0769094P318175N827287O710165Q134332O772013R56733
10403A45112457p238006j3478801j6479471j7108089j6311584j4250779j1421750
10396D8823977q746885o840778n736888n040267m336195l505943k669802j956530
10388I990689j432742j072557q29991o67492n62898n12253m75816m36272l81845
$$ plain form
10379 3618823 3293535 3015826 2771491 2563659 2378536 2216818 2076182 1954861 1862112 1793884
10369 1793884 1740893 1696245 1664202 1641457 1634644 1625545 1596270 1539658 1459915 1371959 1295255 1241116
10357 1241116 1198761 1159427 1108224 1045596 990607 937701 890960 846364 807669 789612 785716
10346 785716 794938 824704 875272 940143 988668 1017708 1008877 962702 884659 791757 697391 625277
10334 625277 572152 531407 503782 489627 481791 485456 498663 518756 535712 552439 565125 579341
10322 579341 600741 635174 678749 715374 743274 729762 674013 588789 494073 405751 332432
10311 332432 269375 220680 184086 152327 122718 100619 84831 75308 73522 69561 67762 61745
10299 61745 58176 54979 55898 57564 61163 70254 83872 97734 110963 123374 134858 155353 183825
$$ packed form
10379C618823l25288k77709k44335k07832j85123j61718j40636j21321r2749o8228
10369A793884n2991m4648l2043k2745o813r099k9275n6612p9743q7956p6704n4139
10357A241116m2355l9334n1203o2628n4989n2906m6741m4596l8695j8057l896
10346G85716R222K9766N0568O4871M8525K9040q831m6175p8043r2902r4366p2114
10334F25277n3125m0745k7625j4155p836L665J3207K0093J6956J6727J2686J4216
10322E79341K1400L4433M3575L6625K7900j3512n5749q5224r4716q8322p3319
10311C32432o3057m8695l6594l1759k9609k2099j5788r523j786l961j799o017
10299F1745l569l197R19J666L599R091J3618J3862J3229J2411J1484K0495K8472
$$ plain form
10286 183825 206009 217973 225730 226149 231704 245405 255403 252507 244493 230576 208090 188674 175239
10273 175239 156953 137066 125324 110735 98654 92761 82317 79061 72907 65249 55782 49365 42143
10260 42143 36200 30374 24312 21831 32002 43714 64798 87896 99581 106552 112471 125214 131011
10247 131011 128008 121550 117225 108737 95182 85847 80041 70901 69570 67724 68511 78517 87249 91632
10233 91632 101328 105464 103658 109292 117124 121121 117899 117270 122116 120876 115481 114795 116246 115194 113227
10218 113227 103197 101597 100834 97078 88805 82240 86913 87797 87463 98028 104669 100820 93256 87253
10204 87253 77711 70789 61398 53304 51550 54699 53254 52328 58200 63773 72215 79110 81992 86630 87962
10189 87962 92490 95198 93054 88100 81817 75288 67074 60375 59531 54994 49018 50024 51672 56132 57313
$$ packed form
10286A83825K2184J1964P757M19N555J3701R998k896q014j3917k2486j9416j3435
10273A75239j8286j9887j1742j4589j2081n893j0444l256o154p658r467o417p222
10260D2143n943n826o062k481J0171J1712K1084K3098J1685O971N919J2743N797
10247A31011l003o458m325q488j3555r335n806r140j331j846P87J0006Q732M383
10233I1632R696M136j806N634P832L997l222o29M846j240n395o86J451j052j967
10218A13227j0030j600p63l756q273o565M673Q84l34J0565O641l849p564o003
10204H7253r542o922r391q094j754L149j445r26N872N573Q442O895K882M638J332
10189H7962M528K708k144m954o283o529q214o699q44m537n976J006J648M460J181
$$ plain form
10174 57313 54087 51669 54172 57169 54936 61197 69389 74176 83189 92582 105547 113392 119169 133794
10160 133794 148159 159729 165929 163565 157667 147216 137626 131936 125981 116169 108268 97691 83706
10147 83706 79691 72486 66721 60396 52065 46189 39112 35042 36300 38889 39585 36528 34121 31111 32065
10132 32065 35616 41108 42818 43633 42126 41913 47739 52776 57617 63792 67291 70468 70311 72795 77177
10117 77177 82320 87311 88613 85566 79321 69407 61624 57338 58053 59587 61142 61614 68882 72580 78085
10102 78085 86342 96178 107728 119891 125973 124784 123147 125325 132013 136439 143117 144166 140405 135523
10088 135523 132005 134000 140491 146925 150102 156668 169955 190134 220439 262447 316425 393333 488350
10075 488350 589086 675195 728580 744198 733572 727503 727463 729609 728141 736810 758879 770796 766684
$$ packed form
10174E7313l226k418K503K997k233O261Q192M787R013R393J2965P845N777J4625
10160A33794J4365J1570O200k364n898j0451r590n690n955r812p901j0577j3985
10147H3706m015p205n765o325q331n876p077m070J258K589O96l057k407l010R54
10132C2065L551N492J710Q15j507k13N826N037M841O175L499L177j57K484M382
10117G7177N143M991J302l047o245r914p783m286P15J534J555M72P268L698N505
10102G8085Q257R836J1550J2163O082j189j637K178O688M426O678J049l761m882
10088A35523l518J995O491O434L177O566J3287K0179L0305M2008N3978P6908R5017
10075D88350J00736Q6109N3385J5618j0626o069m0K146j468Q669K2069J1917m112
$$ plain form
10062 766684 726448 645985 549393 463810 398483 352857 316508 297375 287262 283452 285812 287653
10050 287653 289114 294489 303952 315515 329205 353714 384962 423582 476190 543559 636103 757775
10038 757775 899903 1058219 1217520 1341219 1412448 1424022 1397919 1372200 1359025 1371596 1391798
10027 1391798 1397702 1377065 1312850 1208086 1069317 913787 769314 650245 563496 496167
10017 496167 448051 418254 399828 382204 379901 379273 380227 387592 395070 408900 428323 448680 456755
10004 456755 474810 509950 554664 612923 684210 766316 856434 924479 957675 954724 931197 909963
9992 909963 896279 903693 927926 949042 952131 913440 839966 752505 674244 609183 556197 521900
9980 521900 500241 485511 476116 479746 478575 475228 480965 486873 490482 506907 522647 543224 568157
$$ packed form
10062G66684m0236q0463r6592q5583o5327m5626l6349j9133j0113l810K360J841
10050B87653J461N375R463J1563J3690K4509L1248L8620N2608O7369R2544J21672
10038G57775J42128J58316J59301J23699P1229J1574k6103k5719j3175J2571K0202
10027A391798N904k0637o4215j04764j38769j55530j44473j19069q6749o7329
10017D96167m8116k9797j8426j7624k303o28R54P365P478J3830J9423K0357Q075
10004D56755J8055L5140M4714N8259P1287Q2106R0118O8045L3196k951k3527k1234
9992I09963j3684P414K4233K1116L089l8691p3474q7461p8261o5061n2986l4297
9980E21900k1659j4730r395L630j171l347N737N908L609J6425J5740K0577K4933
$$ plain form
9967 568157 596963 623785 646131 656686 655083 646323 636088 625408 621744 620394 622439 627404 638642
9954 638642 653478 666882 678813 698813 719489 733631 751446 768799 789401 815529 839324 861566
9942 861566 886122 912981 941409 967726 988743 1007770 1028562 1057470 1088007 1126401 1166116 1214050
9930 1214050 1276337 1349217 1447157 1607635 1870567 2256333 2740964 3141925 3242165 2975564
9920 2975564 2538345 2150722 1892567 1751612 1692676 1671454 1662516 1666283 1672607 1688047 1708453
9909 1708453 1727660 1750554 1778065 1807020 1840574 1874208 1903041 1931159 1951079 1970352 1997243
9898 1997243 2022746 2041446 2058956 2075547 2092232 2114958 2137563 2157109 2172570 2180675 2192508 2202793
9886 2202793 2202772 2201519 2204124 2212096 2219256 2215665 2201834 2191962 2188710 2181261 2169522 2154072 2139451 2124743
$$ packed form
9967E68157K8806K6822K2346J0555j603q760j0235j0680l664j350K045M965J1238
9954F38642J4836J3404J1931K0000K0676J4142J7815J7353K0602K6128K3795K2242
9942H61566K4556K6859K8428K6317K1017J9027K0792K8908L0537L8394L9715M7934
9930A214050O2287P2880R7940J60478K62932L85766M84631M00961J00240k66601
9920B975564m37219l87623k58155j40955n8936k1222q938L767O324J5440K0406
9909A708453J9207K2894K7511K8955L3554L3634K8833K8118J9920J9273K6891
9898A997243K5503J8700J7510J6591J6685K2726K2605J9546J5461Q105J1833J0285
9886B202793k1j253K605P972P160l591j3831r872l252p449j1739j5450j4621j4708
$$ plain form
9872 2124743 2103298 2081649 2058789 2036992 2016544 1992975 1968462 1937774 1902176 1863048 1826176
9861 1826176 1792815 1754984 1719948 1684729 1648153 1611141 1578434 1543233 1511113 1485196 1459165
9850 1459165 1429182 1399703 1371111 1337973 1304788 1274745 1250924 1218885 1194456 1168228 1136070
9839 1136070 1106299 1079474 1057696 1037006 1015106 992549 968474 946189 920679 897933 880436
9828 880436 860410 836227 818014 804711 790929 777465 758332 736122 715555 695447 682412 672372
9816 672372 657479 642078 627418 612513 599496 585179 568648 551387 539260 528465 521871 514619
9804 514619 505197 494111 483060 472548 462088 450758 443311 436013 433864 430763 424685 416633 407805
9791 407805 397380 391537 382553 370550 361136 357668 354115 351722 345732 335642 326066 319633 313696 307933
$$ packed form
9872B124743k1445k1649k2860k1797k0448k3569k4513l0688l5598l9128l6872
9861A826176l3361l7831l5036l5219l6576l7012l2707l5201l2120k5917k6031
9850A459165k9983k9479k8592l3138l3185l0043k3821l2039k4429k6228l2158
9839A136070k9771k6825k1778k0690k1900k2557k4075k2285k5510k2746j7497
9828H80436k0026k4183j8213j3303j3782j3464j9133k2210k0567k0108j3035j0040
9816F72372j4893j5401j4660j4905j3017j4317j6531j7261j2127j0795o594p252
9804E14619r422j1086j1051j0512j0460j1330p447p298k149l101o078q052q828
9791D07805j0425n843q984j2003r414l468l553k393n990j0090r576o433n937n763
$$ plain form
9777 307933 302815 302392 301409 293409 283783 282972 277356 274594 269407 264212 254904 244910 237173 227870 223212
9762 223212 220782 218957 219147 218536 211294 210040 211797 211952 210447 210197 209934 211655 213863 217297 214336 210711
9746 210711 213467 214650 207800 192612 184103 179082 174037 173135 177629 178822 175335 174111 174233 169552 164785
9731 164785 156186 151268 146879 143352 142514 139040 136616 135992 131538 128892 131275 135645 134297 137614 139906
9716 139906 134598 131151 128120 122954 111792 108166 105027 104404 107726 107712 105651 107381 107640 109205 106161
9701 106161 103350 98492 92081 91426 93981 92352 91795 88299 87018 83081 80347 80234 86596 84955 79837
9686 79837 78086 80674 83524 84611 89509 88491 82955 80538 78984 72884 71004 71871 71123 77690 75980
9671 75980 69043 71666 71938 66222 70405 73030 68252 67166 67951 68387 69176 65617 62616 60888 61233 62413
$$ packed form
9777C07933n118m23r83q000r626q11n616k762n187n195r308r994p737r303m658
9762B23212k430j825J90o11p242j254J757J55j505k50k63J721K208L434k961l625
9746B10711K756J183o850j5188q509n021n045r02M494J193l487j224J22m681m767
9731A64785q599m918m389l527q38l474k424o24m454k646K383M370j348L317K292
9716A39906n308l447l031n166j1162l626l139o23L322j4k061J730K59J565l044
9701A06161k811m858o411o55K555j629n57l496j281l937k734j13O362j641n118
9686G9837j751K588K850J087M898j018n536k417j554o100j880Q67p48O567j710
9671G5980o937K623K72n716M183K625m778j086P85M36P89l559l001j728L45J180
$$ plain form
9655 62413 66812 67220 69136 68758 64059 71993 73584 67332 66122 69840 64890 60159 57295 59119 65327
9640 65327 69599 67338 65945 62036 62132 66484 65268 59591 61074 63529 63778 63582 58226 55190 55116 54338
9624 54338 49683 47390 49440 48239 50388 51397 53069 55591 56923 56031 50070 45788 46465 45546 50778
9609 50778 51126 50171 47243 46584 43433 38777 36892 39731 42173 43009 43395 44426 40662 38863 41001 45797
9593 45797 51314 49812 47353 46803 44709 41971 47650 46287 49612 48066 42430 43954 39078 41318 42533
9578 42533 43232 50406 49376 46109 40008 35654 35270 28286 23180 26640 26354 26297 31005 29507 30170 29699
9562 29699 28999 32457 29704 30923 34127 40307 40855 40824 41910 42671 46039 44211 43922 42259 37564 31604
9546 31604 27396 32484 32725 33023 33521 34671 33009 31477 33691 35189 28892 25987 27062 29005 26168
$$ packed form
9655F2413M399M08J916l78m699P934J591o252j210L718m950m731k864J824O208
9640F5327M272k261j393l909R6M352j216n677J483K455K49j96n356l036p4p78
9624E4338m655k293K050j201K149J009J672K522J332q92n961m282O77r19N232
9609E0778L48r55k928o59l151m656j885K839K442Q36L86J031l764j799K138M796
9593D5797N517j502k459n50k094k738N679j363L325j546n636J524m876K240J215
9578D2533O99P174j030l267o101m354l84o984n106L460k86n7M708j498O63m71
9562B9699p00L458k753J219L204O180N48l1J086P61L368j828k89j663m695n960
9546C1604m208N088K41K98M98J150j662j532K214J498o297k905J075J943k837
$$ plain form
9531 26168 28371 30782 29839 29419 27180 26408 21549 20147 25236 23875 24171 26788 30708 32576 31367 29913
9515 29913 29671 26011 27744 30902 32489 29793 24351 17844 15765 11181 13717 16467 19759 18625 16215
9500 16215 14596 13761 10737 8918 15788 21827 19698 15927 9289 10730 17203 20055 22031 27063 28631
9485 28631 27252 22540 20513 19897 19336 26358 25731 19052 21484 22607 18582 13696 14292 17160 14911 14758
9469 14758 14531 16257 18293 14877 11550 15119 19817 23236 21809 18655 16551 21254 26780 25583 25026
9454 25026 23303 21141 19697 22235 21659 19212 27397 28973 28680 26371 24932 26352 26066 25503 21899 21574
9438 21574 18265 22390 27070 31545 33103 32916 27775 25879 26223 29412 29309 29908 30369 30417 27736 29273
9422 29273 28545 25375 21861 22745 27380 25912 22432 21807 21224 24655 30009 30354 30148 24209 24696 22646
$$ packed form
9531B6168K203K411r43m20k239p72m859j402N089j361K96K617L920J868j209j454
9515B9913k42l660J733L158J587k696n442o507k079m584K536K750L292j134k410
9500A6215j619q35l024j819O870O039k129l771o638J441O473K852J976N032J568
9485B8631j379m712k027o16n61P022o27o679K432J123m025m886N96K868k249j53
9469A4758k27J726K036l416l327L569M698L419j427l154k104M703N526j197n57
9454B5026j723k162j444K538n76k447Q185J576k93k309j439J420k86n63l604l25
9438B1574l309M125M680M475J558j87n141j896L44L189j03N99M61M8k681J537
9422B9273p28l170l514Q84M635j468l480o25n83L431N354L45k06n939M87k050
$$ plain form
9406 22646 19088 18528 15653 14843 17882 16084 19707 19958 13905 11141 13461 11854 11587 11944 9077 9003
9390 9003 13271 17318 16779 21170 20752 16139 16245 14044 13139 9922 11227 12186 14118 19868 28712 23358
9374 23358 20998 24458 24367 22322 24574 23724 26732 30046 31207 32243 34756 39508 48871 50102 42425
9359 42425 35794 29057 24914 26186 22606 24803 28806 30571 29886 30942 30014 30320 26013 25612 28026 22457
9343 22457 24012 25283 28386 32630 32690 33516 32095 34488 38131 43921 51837 50503 51161 57377 64235 69691
9327 69691 73061 72212 72403 77259 78210 81520 82127 75419 69287 63529 64162 65051 65002 68354 68855 67662 70748
9310 70748 74385 77310 83438 95258 105215 111066 118007 119906 119156 121486 125968 133480 140406 145611 145543
9295 145543 144393 145780 148584 152104 153937 150921 151101 148885 151305 155581 152156 143845 140121 138677 135330
$$ packed form
9406B2646l558n60k875q10L039j798L623K51o053k764K320j607k67L57k867p4
9390I003M268M047n39M391m18m613J06k201r05l217J305R59J932N750Q844n354
9374B3358k360L460r1k045K252q50L008L314J161J036K513M752R363J231p677
9359D2425o631o737m143J272l580K197M003J765o85J056r28L06m307m01K414n569
9343B2457J555J271L103M244O0Q26j421K393L643N790P916j334O58O216O858N456
9327F9691L370q49J91M856R51L310O07o708o132n758O33Q89m9L352N01j193L086
9310G0748L637K925O128J1820R957N851O941J899p50K330M482P512O926N205o8
9295A45543j150J387K804L520J833l016J80k216K420M276l425q311l724j444l347
$$ plain form
9280 135330 127419 117356 116348 118813 119323 112816 110842 112149 110073 109382 108364 100485 93267 88518 77636
9265 77636 72790 69247 68277 62684 60673 61087 64687 70727 73465 75934 76688 80540 85562 93245 96160
9250 96160 105352 123213 140952 164849 184631 213190 245507 271079 303000 344241 385798 417426
9238 417426 443496 464318 485975 507228 523695 544012 565073 585802 608111 635813 671634 712447
9226 712447 765792 821911 874870 918305 955061 983981 996937 997694 979190 943658 906317 866221
9214 866221 827736 794042 765461 738671 712220 692568 673978 656802 644558 635306 630348 629823
9202 629823 630084 636420 648955 669304 705496 746398 787619 826801 859800 870575 857332 821381
9190 821381 763297 689479 613787 541930 475678 415821 370439 327874 285523 250818 224822 201484
$$ packed form
9280A35330p911j0063j008K465N10o507j974J307k076o91j018p879p218m749j0882
9265G7636m846l543r70n593k011M14L600O040K738K469P54L852N022P683K915
9250I6160R192J7861J7739K3897J9782K8559L2317K5572L1921M1241M1557L1628
9238D17426K6070K0822K1657K1253J6467K0317K1061K0729K2309K7702L5821M0813
9226G12447N3345N6119N2959M3435L6756K8920J2956P57j8504l5532l7341m0096
9214H66221l8485l3694k8581k6790k6451j9652j8590j7176j2244r252m958n25
9202F29823K61O336J2535K0349L6192M0902M1221L9182L2999J0775j3243l5951
9190H21381n8084p3818p5692p1857o6252n9857m5382m2565m2351l4705k5996k3338
$$ plain form
9178 201484 184570 172266 165590 159067 153044 151625 150021 148171 148521 154671 161725 176589 194289 216970
9164 216970 250880 287649 324135 365948 407821 456468 490772 505063 503435 476995 439178 393993
9152 393993 338615 281242 240278 208174 186353 167191 154833 142828 137796 133484 135369 139933
9140 139933 142364 149008 161268 170935 181052 200661 220600 246005 269546 300952 343819 392688
9128 392688 435267 468668 481768 477382 450670 411069 361174 312641 265492 226408 191199 166660
9116 166660 156372 146777 145639 149657 153424 157568 161505 163600 162347 165869 162799 155469 143483 125550
9102 125550 113468 100175 91383 84603 78540 67845 64153 67975 69056 69139 66009 64879 66924 70021
9088 70021 80704 88762 91260 90858 90590 93079 97907 103428 108222 112525 117822 125525 141306 152520
$$ packed form
9178B01484j6914j2304o676o523o023j419j604j850L50O150P054J4864J7700K2681
9164B16970L3910L6769L6486M1813M1873M8647L4304J4291j628k6440l7817m5185
9152C93993n5378n7373m0964l2104k1821j9162j2358j2005n032m312J885M564
9140A39933K431O644J2260R667J0117J9609J9939K5405K3541L1406M2867M8869
9128C92688M2579L3401J3100m386k6712l9601m9895m8533m7149l9084l5209k4539
9116A66660j0288r595j138M018L767M144L937K095j253L522l070p330j1986j7933
9102A25550j2082j3293q792o780o063j0695l692L822J081Q3l130j130K045L097
9088G0021J0683Q058K498m02k68K489M828N521M794M303N297P703J5781J1214
$$ plain form
9074 152520 166779 183181 193541 200586 207887 206883 200820 199303 197449 192487 189905 187564 184497 188815
9060 188815 191837 200061 213457 230280 251514 277986 314962 362119 413669 477337 550454 628029
9048 628029 698121 765070 816119 854661 872627 872244 848667 806957 755956 710917 669596 632758
9036 632758 607035 588450 572567 560905 558356 556116 551203 543957 555452 583214 625949 676938
9024 676938 743658 804063 851984 883235 899384 902364 899456 887685 870498 849252 825880 797380
9012 797380 759079 712169 670406 641593 625402 632990 650648 677303 707895 737112 768339 795603
9000 795603 824123 845484 859252 868357 874068 872103 855576 816242 760256 701971 644432 592232
8988 592232 550822 521871 502037 484098 468206 459486 448145 440929 437553 443745 457364 480787
$$ packed form
9074A52520J4259J6402J0360P045P301j004o063j517j854m962k582k341l067M318
9060A88815L022Q224J3396J6823K1234K6472L6976M7157N1550O3668P3117P7575
9048F28029P0092O6949N1049L8542J7966l83k3577m1710n1001m5039m1321l6838
9036F32758k5723j8585j5883j1662k549k240m913p246J1495K7762M2735N0989
9024F76938O6720O0405M7921L1251J6149K980k908j1771j7187k1246k3372k8500
9012G97380l8301m6910m1763k8813j6191P588J7658K6655L0592K9217L1227K7264
9000G95603K8520K1361J3768R105N711j965j6527l9334n5986n8285n7539n2200
8988E92232m1410k8951j9834j7939j5892q720j1341p216l376O192J3619K3423
$$ plain form
8976 480787 510534 551623 591950 630838 656913 664533 655691 633509 604628 565440 517976 462311
8964 462311 406949 348951 294159 250670 214846 183759 159711 134373 113007 96846 84179 74805
8952 74805 71995 71542 65801 55922 51400 51261 49812 45682 36144 27021 24655 25135 24539 21845 21396 20034
8936 20034 19304 22550 17772 15116 19760 21526 17725 15050 14631 18836 21457 26533 32759 35249 33614
8921 33614 36982 39914 37142 38728 41020 37532 37452 34826 30760 33889 35891 34220 32427 31081 31545
8906 31545 29438 26414 23715 25234 26356 22192 16663 15488 18064 13804 13536 13198 12649 11552 10795 13854
8890 13854 16637 14464 15704 17141 15675 13460 13837 18296 20296 17088 14456 12783 11789 9928 9612
8875 9612 6207 6725 8390 14429 17998 17788 21590 16771 9465 5507 8729 15231 13552 8477 6640
$$ packed form
8976D80787K9747M1089M0327L8888K6075P620q842k2182k8881l9188m7464n5665
8964D62311n5362n7998n4792m3489l5824l1087k4048k5338k1366j6161j2667r374
8952G4805k810m53n741r879m522j39j449m130r538r123k366M80n96k694m49j362
8936B0034p30L246m778k656M644J766l801k675m19M205K621N076O226K490j635
8921C3614L368K932k772J586K292l488q0k626m066L129K002j671j793j346M64
8906C1545k107l024k699J519J122m164n529j175K576m260k68l38n49j097p57L059
8890A3854K783k173J240J437j466k215L77M459K000l208k632j673r94j861l16
8875I612l405N18J665O039L569k10L802m819p306l958L222O502j679n075j837
$$ plain form
8860 6640 2634 -1722 -733 -1396 -110 2567 2865 -1150 1248 3064 -944 -725 -7 976 1355 6070 6094
8843 6094 2565 -1070 -508 1684 5662 7973 10509 7003 2306 3077 -471 -1267 3424 5422 7948 7883
8827 7883 6553 8337 10753 12018 10093 7209 8437 6473 5047 829 226 5565 8694 7726 2146
8812 2146 -3917 -8763 -7127 -8773 -10238 -6442 -1827 264 -620 1457 -211 -1426 -2905 -625 4376
8797 4376 5586 5081 2091 -828 7668 11840 5581 5376 11579 9480 7020 5803 5837 7799 7965 2567
8781 2567 -1369 -5820 -4673 -4790 -6346 -10910 -13371 -12732 -11222 -7379 -5497 -5759 -6557 -2736 -991 -4830
8765 -4830 -1432 148 -7419 -6857 -5213 -5304 -3816 -2929 -3846 -6240 -7512 -4223 -4489 -889 1723 -56
8749 -56 -2579 -4170 -5522 -586 4758 960 -4934 -4489 -5299 -6146 -5074 -4259 -8146 -11410 -12558 -9483
$$ packed form
8860F640m006m356R89o63J286K677K98m015K398J816m008K19P18R83L79M715K4
8843F094l529l635N62K192L978K311K536l506m697P71l548p96M691J998K526o5
8827G883j330J784K416J265j925k884J228j964j426m218o03N339L129r68n580
8812B146o063m846J636j646j465L796M615K091q84K077j668j215j479K280N001
8797D376J210n05k990k919Q496M172o259k05O203k099k460j217L4J962J66n398
8781B567l936m451J147j17j556m564k461O39J510L843J882k62p98L821J745l839
8765d830L398J580p567N62J644r1J488Q87r17k394j272L289k66L600K612j779
8749e6k523j591j352M936N344l798n894M45q10q47J072Q15l887l264j148L075
$$ plain form
8733 -9483 -9458 -6140 -8813 -12265 -6968 -6412 -9374 -7682 -346 2908 2113 2778 9059 9563 4674 3328
8717 3328 1761 -1994 -2004 -5565 -11183 -16001 -14900 -14126 -13712 -11605 -9529 -7075 -9201 -5715 -1557 -2781
8701 -2781 -8301 -11434 -13105 -9345 -3521 430 2302 3447 -469 778 2526 -751 3926 4049 -1775
8686 -1775 -386 2369 -1364 -3101 -3604 -1739 1193 -1139 2864 4602 3439 4073 2120 -1659 -8822
8671 -8822 -12863 -11704 -7931 -953 -1978 -2451 -2348 -5047 -7637 -10217 -12760 -15353 -13036 -10704 -16807
8656 -16807 -18986 -9385 -9056 -12941 -9388 -11202 -13630 -9408 -5131 -4770 -4816 -3528 -3277 -3299 -2315 457 -805
8639 -805 -1034 -315 -4684 -2608 -136 1106 4343 4358 2091 -456 -4901 -1484 -1797 -2259 -4717 -12604 -15695
8622 -15695 -10465 -3520 -4507 -7272 -4676 -5293 -2045 -1504 -6234 -10491 -10688 -8840 -6055 -4311 -3614 -4147
$$ packed form
8733i483K5L318k673l452N297N56k962J692P336L254p95O65O281N04m889j346
8717C328j567l755j0l561n618m818J101P74M14K107K076K454k126L486M158j224
8701b781n520l133j671L760N824L951J872J145l916J247J748l277M677J23n824
8686a775J389K755l733j737n03J865K932k332M003J738j163O34j953l779p163
8671h822m041J159L773O978j025m73J03k699k590k580k543k593K317K332o103
8656a6807k179R601L29l885L553j814k428M222M277L61m6J288K51k2R84K772j262
8639h05k29P19m369K076K472J242L237J5k267k547m445L417l13m62k458p887l091
8622a5695N230O945r87k765K596o17L248N41m730m257j97J848K785J744O97n33
$$ plain form
8606 -4147 -3754 -4795 -3089 -309 618 1015 4073 -120 -2891 -938 896 7525 9683 11253 15029 15174
8590 15174 13832 10951 1681 -660 5493 7604 235 61 856 767 -4468 159 7922 3660 -2996 -3797
8574 -3797 -1866 -5394 -9336 -9230 -9471 -7442 -10863 -10132 -8590 -6415 2372 4065 4305 1280 4977 12877
8558 12877 13918 13327 16325 12330 14790 14351 12584 15322 14216 13509 16926 14179 17315 28994 45074
8543 45074 63019 71013 64332 49022 34868 19604 6901 761 -1387 -3734 -1713 -2644 -1199 2403
8529 2403 3599 7856 12448 10230 10226 10655 13277 16891 14473 18186 26858 29985 33522 33843 37390 45259
8513 45259 64702 85432 116878 131031 128505 115846 91345 67485 48655 38879 40938 43289 53969
8500 53969 65246 73184 70469 59529 46999 31126 20647 17058 14264 15344 15275 11598 12165 14058
$$ packed form
8606d147L93j041J706K780R27L97L058m193k771J953J834O629K158J570L776J45
8590A5174j342k881r270k341O153K111p369j74P95q9n235M627P763m262o656q01
8574c797J931l528l942J06k41K029l421P31J542K175Q787J693K40l025L697P900
8558A2877J041n91K998l995K460m39j767K738j106p07L417k747L136J1679J6080
8543D5074J7945P994o681j5310j4154j5264j2703o140k148k347K021r31J445L602
8529B403J196M257M592k218mM29K622L614k418L713Q672L127L537L21L547P869
8513D5259J9443K0730L1446J4153k526j2659k4501k3860j8830r776K059K351J0680
8500E3969J1277P938k715j0940j2530j5873j0479l589k794J080o9l677N67J893
$$ plain form
8486 14058 12782 9795 11145 14941 10688 4377 2544 5872 9036 12276 20979 26807 26884 27457 27780 26199
8470 26199 23481 20849 15103 14072 14704 14847 12664 7270 7342 2581 -1503 658 7432 1526 -13174
8455 -13174 -15450 -14255 -14229 -5307 4065 6571 4755 9184 8018 111 -2550 -4731 -11742 -9724 -6436
8440 -6436 -5284 -6030 -5344 -2054 2734 1226 -905 2218 -956 1608 7348 9086 12030 8839 2468
8425 2468 845 3516 804 -2167 -4440 -5786 -7185 -8609 -6117 -5056 -2475 -1224 4311 241 -5499
8410 -5499 -2496 6671 9233 8437 -621 -3484 -1026 1048 -1113 -2425 -3030 -300 1140 -5783 -9608
8395 -9608 -4690 -3436 596 1882 9855 12603 13009 11416 8565 3800 4171 4694 1261 -4477 -8129 -12305
8379 -12305 -14919 -16454 -17225 -16700 -14054 -7755 -6704 -7791 -5006 -3037 375 -1203 -2654 -4452 -5556
$$ packed form
8486A4058j276k987J350L796m253o311j833L328L164L240Q703N828P7N73L23j581
8470B6199k718k632n746j031O32J43k183n394P2m761m084K161O774n906j4700
8455a3174k276J195K6Q922R372K506j816M429j166p907k661k181p011K018L288
8440f436J152p46O86L290M788j508k131L123l174K564N740J738K944l191o371
8425B468j623K671k712k971k273j346j399j424K492J061K581J251N535m070n740
8410e499L003R167K562p96r058k863K458K074k161j312o05K730J440o923l825
8395i608M918J254M032J286P973K748M06j593k851m765L71N23l433n738l652m176
8379a2305k614j535p71N25K646O299J051j087K785J969L412j578j451j798j104
$$ plain form
8364 -5556 -11645 -11228 -8224 -9017 -5842 -7621 -6333 -7454 -12850 -13816 -9852 -7862 -8903 -15759 -15858 -12201
8348 -12201 -5276 -1810 536 3150 6922 7301 9664 9515 7788 6923 4452 3267 1007 624 3731 6131
8332 6131 765 -6418 -10090 -7437 -4479 1364 3534 -165 -1743 -3974 -7224 -13196 -13944 -11110 -14237
8317 -14237 -8328 -1219 2469 -2237 -3859 -2752 98 405 2597 10322 9970 13326 14443 9656 4152
8302 4152 7591 9296 455 -4732 -6928 -8625 -5384 -2712 -1597 -4031 -5519 -7576 -9554 -10064 -10401
8287 -10401 -7911 -4414 -2127 -6029 -8256 -7341 -3998 -6811 -11059 -12231 -8561 -6085 -5365 -4565 -6298
8272 -6298 -13680 -11938 -8056 -8454 -7872 -9100 -7596 -8769 -8338 -5696 -7717 -11972 -14225 -14251 -13072 -10911
8256 -10911 -9330 -10473 -7306 -4895 -860 1293 -3800 -8464 -10888 -8908 -5763 -6402 -5716 -2215 1873
$$ packed form
8364e556o089M17L004p93L175j779J288j121n396r66L964J990j041o856r9L657
8348a2201O925L466K346K614L772L79K363j49j727q65k471j185k260l83L107K400
8332F131n366p183l672K653K958N843K170l699j578k231l250n972p48K834l127
8317a4237N909P109L688m706j622J107K850L07K192P725l52L356J117m787n504
8302D152L439J705q841n187k196j697L241K672J115k434j488k057j978n10l37
8287a0401K490L497K287l902k227R15L343k813m248j172L670K476P20Q00j733
8272f298p382J742L882l98N82j228J504j173M31K642k021m255k253k6J179K161
8256a0911J581j143L167K411M035K153n093m664k424J980L145o39O86L501M088
$$ plain form
8241 1873 1313 3000 -1579 -5701 -4139 2909 5452 2872 -902 -4953 -3885 -4504 -2282 -3051 -241 747
8225 747 -1067 -442 5048 13393 20637 24430 25127 20354 12433 6749 4013 -1497 -3305 -4755 -1745 1026
8209 1026 556 -229 2171 6511 6672 10560 10079 11973 12472 9768 8123 6507 6535 5499 9935 9718 13632
8192 13632 8385 -1488 -9465 -7581 -5944 -7935 -11736 -12256 -10886 -9925 -15339 -13046 -3768 -55 7170
8177 7170 15852 26817 38210 46778 50139 39931 30890 17748 14375 10159 4197 1121 -4707 -6633
8163 -6633 -4213 926 1200 -1413 -2611 -4124 -3171 -1216 -6912 -11621 -13414 -10560 -3150 2789 7476
8148 7476 2688 3081 -225 7479 15215 9716 4798 -726 -4429 -4628 -1666 -658 -2674 -2057 -1061 -3354
8132 -3354 -2373 2758 9466 20651 23290 21079 15612 11951 11567 6147 -878 -5114 -9186 -8354 -5121
$$ packed form
8241A873n60J687m579m122J562P048K543k580l774m051J068o19K222p69K810R88
8225G47j814O25N490Q345P244L793O97m773p921n684k736n510j808j450L010K771
8209A026m70p85K400M340J61L888m81J894M99k704j645j616K8j036M436k17L914
8192A3632n247r873p977J884J637j991l801n20J370R61n414K293R278L713P225
8177G170Q682J0965J1393Q568L361j0208r041j3142l373m216n962l076n828j926
8163f633K420N139K74k613j198j513R53J955n696m709j793K854P410N939M687
8148G476m788L93l306P704P736n499m918n524l703j99K962J008k016O17R96k293
8132c354R81N131O708J1185K639k211n467l661l84n420p025m236m072Q32L233
$$ plain form
8117 -5121 -6888 -6149 -4540 -6257 3659 18710 32210 45771 54591 50998 43051 40725 36726 23233
8103 23233 7668 -1664 -9529 -12457 -10741 -9561 -10647 -9037 -6105 -7015 -9018 -7959 -3080 -2058 -1714
8088 -1714 -795 2288 9520 14809 13207 10592 13361 11117 13386 22119 21745 26140 39928 61457 84523
8073 84523 111239 129782 138804 132090 113726 91910 66327 42811 25671 7332 -4695 -9245
8061 -9245 -3354 2884 6703 3726 2905 1794 4075 2329 3803 3881 -4935 -11014 -9644 -5862 -2402 2484
8045 2484 13180 21056 16647 11808 8357 6615 4577 5409 5670 2384 4927 5758 7804 13364 28143
8030 28143 48179 71877 99978 140699 191258 240415 267260 261582 224919 169862 114401 71597
8018 71597 47349 32937 25632 20197 21456 18714 18493 17715 17387 14903 11729 8226 5499 3098 4615
$$ packed form
8117e121j767P39J609j717R916J5051J3500J3561Q820l593p947k326l999j3493
8103B3233j5565r332p865k928J716J180j086J610K932r10k003J059M879J022L44
8088a714R19L083P232N289j602k615K769k244K269Q733l74M395J3788K1529K3066
8073H4523K6716J8543R022o714j8364k1816k5583k3516j7140j8339j2027m550
8061i245N891O238L819k977q21j111K281j746J474P8q816o079J370L782L460M886
8045B484J0696P876m409m839l451j742k038Q32K61l286K543Q31K046N560J4779
8030B8143K0036K3698K8101M0721N0559M9157K6845n678l6663n5057n5461m2804
8018G1597k4248j4412p305n435J259k742k21p78l28k484l174l503k727k401J517
$$ plain form
8003 4615 4695 2099 4359 4473 3926 5625 8611 10382 6393 1355 -1152 -5560 -5272 1910 4387 5295
7987 5295 8151 10868 10947 11647 16966 28620 39197 56927 78529 92737 102823 105102 97082 78586
7973 78586 59536 42279 24625 10730 7665 2482 3894 3227 -1189 1451 -2303 -5267 -6528 -6467
7959 -6467 -12253 -10503 -4379 2071 3410 1870 84 -46 -3778 -3504 -717 -3510 -9488 -6171 1075
7944 1075 35 2568 3133 1619 -1767 -5785 -12247 -11066 -6353 -3019 -323 -2104 -1636 1050 3722
7929 3722 2381 1437 -5542 -9113 -6825 -5052 -4924 -5757 -6528 -5600 -6397 -4776 2005 4120 8263 10130
7913 10130 8403 6264 6940 4501 4906 6194 8849 9761 10950 9515 6761 -31 1403 52 824 -2207
7897 -2207 -5851 -9457 -8010 -64 3113 -1270 624 4651 835 -857 -5318 -6787 -4576 -1671 120
$$ packed form
8003D615Q0k596K260J14n47J699K986J771l989n038k507m408K88P182K477R08
7987E295K856K717P9P00N319J1654J0577J7730K1602J4208J0086K279q020j8496
7973G8586j9050j7257j7654j3895l065n183J412o67m416K640l754k964j261O1
7959f467n786J750O124O450J339j540j786j30l732K74K787k793n978L317P246
7944A075j040K533N65j514l386m018o462J181M713L334K696j781M68K686K672
7929C722j341r44o979l571K288J773J28q33p71R28p97J621O781K115M143J867
7913A0130j727k139O76k439M05J288K655R12J189j435k754o792J434j351P72l031
7897b207l644l606J447P946L177m383J894M027l816j692m461j469K211K905J791
$$ plain form
7882 120 -365 634 -3304 -2635 -2072 -6720 -7325 -498 2129 2054 5314 1748 -766 2662 258 4330 7971
7865 7971 4257 8852 6579 -1433 -8584 -10410 -13492 -14355 -12175 -10461 -5491 -4862 -6747 -6170 -5031 -406
7849 -406 -1343 -2558 337 1545 -2550 -5891 -5107 -3764 -4098 -6879 -10707 -10637 -6534 -2534 5112 2188
7833 2188 737 2873 -110 1725 7143 8889 3033 -3458 -1978 -4289 -1391 1015 461 3339 1969
7818 1969 -697 1786 -2168 -7282 -2256 2691 2783 4037 3930 -540 -78 5005 4454 2434 -372 -5253
7802 -5253 -8670 -10152 -8373 -3714 -6047 -8406 -8829 -4634 -2350 -3625 -8195 -9464 -8783 -9765 -8058 -5482
7786 -5482 -2172 -321 2315 1793 -618 -1521 -2528 -2146 -1676 1066 8042 5142 3130 480 -1823 -792
7770 -792 4733 2861 -2591 -2376 -3868 -7974 -5800 -4879 -3604 -3899 -3253 -4227 -10417 -11352 -11502 -5856 -6735
$$ packed form
7882A20m85R99l938O69N63m648o05O827K627p5L260l566k514L428k404M072L641
7865G971l714M595k273q012p151j826l082q63K180J714M970O29j885N77J139M625
7849d06r37j215K895J208m095l341P84J343l34k781l828P0M103M000P646k924
7833B188j451K136k983J835N418J746n856o491J480k311K898K406n54K878j370
7818A969k666K483l954n114N026M947R2J254j07m470M62N083n51k020k806m881
7802e253l417j482J779M659k333k359m23M195K284j275m570j269O81r82J707K576
7786e482L310J851K636n22k411r03j007L82M70K742O976k900k012k650k303J031
7770g92N525j872n452K15j492m106K174R21J275k95O46r74o190r35j50N646q79
$$ plain form
7753 -6735 -2797 1274 3547 4064 -200 -7520 -6305 -8471 -10530 -4484 -2062 -2199 -1065 -2624 -1596
7738 -1596 1853 4317 8105 8730 8514 6154 7883 8977 3702 -1182 -2735 -3727 -5418 -9032 -6634 -6816
7722 -6816 -5932 -6291 -1637 2548 1050 2539 2373 -2267 -2946 -3034 -3794 -2011 -4334 -6885 -5483 -4707 -3968
7705 -3968 -4985 -7533 -9303 -6991 -6364 -8494 -9357 -13781 -13030 -10727 -12165 -11031 -6567 -6194 -4976 -2688
7689 -2688 -4450 -4003 -4550 -9353 -7593 -4479 -1211 -3471 -3091 -3169 -5675 -7882 -9147 -6828 -5841 -5358 -6015
7672 -6015 -8988 -7712 -7195 -3428 -3534 375 431 3147 3433 1502 5168 6550 7238 6018 -517 -7718
7656 -7718 -13384 -13308 -13453 -15570 -14737 -6449 -1786 -4068 -626 -239 -3836 -9342 -7950 -8725 -5546 -7924
7640 -7924 -6851 -2282 -1137 800 -3043 -4889 -6201 -5627 -7086 -8949 -6941 -7184 -9162 -11444 -4458
$$ packed form
7753f735L938M071K273N17m264p320J215k166k059O046K422j37J134j559J028
7738a596L449K464L788O25k16k360J729J094n275m884j553r92j691l614K398j82
7722f816Q84l59M654M185j498J489j66m640o79q8p60J783k323k551J402P76P39
7705c968j017k548j770K312O27k130q63m424P51K303j438J134M464L73J218K288
7689b688j762M47n47m803J760L114L268k260L80p8k506k207j265K319R87M83o57
7672f015k973J276N17L767j06L909N6K716K86j931L666J382O88j220o535p201
7656g718n666P6j45k117Q33Q288M663k282L442L87l597n506J392p75L179k378
7640g924J073M569J145J937l843j846j312N74j459j863K008k43j978k282O986
$$ plain form
7625 -4458 -4287 -3349 -6186 -9375 -5166 -1913 -2905 -4333 -1498 -5871 -3707 -2008 -1736 -1391 -823 -342 -4033
7608 -4033 -6123 -4178 -2380 -3266 -8995 -11787 -15204 -15603 -14100 -16252 -16616 -14638 -11656 -16176 -15750 -12255
7592 -12255 -7167 2102 14 -6242 -5466 850 -4453 -10994 -14783 -18159 -16834 -13740 -10852 -10555 -5372
7577 -5372 -6364 -6505 -4448 628 -1057 -1304 -5013 -2181 1966 727 -5792 -6020 -5783 -5004 -4419 -5104 -5203
7560 -5203 -681 -1681 -6851 -7870 -5989 -8395 -7998 -9791 -10365 -14938 -19289 -17436 -16267 -9779 -5136
7545 -5136 -6425 -13158 -10945 -7272 -5842 -8824 -9105 -8850 -9794 -10783 -8690 -7645 -11063 -7169 -6302 -5116
7529 -5116 -2875 -3586 -4843 -2788 -3194 -3829 -7812 -6774 -5298 -6586 -5354 -7679 -9905 -9772 -6713 -6493
7513 -6493 -6204 -7478 -6209 -6380 -5984 -380 -5163 -7329 -5221 -233 1971 -3812 -5546 3012 2199 -816
$$ packed form
7625d458J71R38k837l189M209L253r92j428K835m373K164J699K72L45N68M81l691
7608d033k090J945J798q86n729k792l417l99J503k152l64J978K982m520M26L495
7592a2255N088R269k088o256P76O316n303o541l789l376J325L094K888K97N183
7577e372r92j41K057N076j685k47l709K832M147j239o519k28K37P79N85o85r9
7560e203M522j000n170j019J881k406L97j793n74m573m351J853J169O488M643
7545e136j289o733K213L673J430k982k81K55r44r89K093J045l418L894Q67J186
7529e116K241p11j257K055m06o35l983J038J476j288J232k325k226J33L059K20
7513f493K89j274J269j71L96N604m783k166K108M988K204n783j734Q558q13l015
$$ plain form
7497 -816 -2457 -3510 514 2974 -1893 -4227 -2778 2532 5060 182 -3256 -4399 2922 116 -2309
7482 -2309 1876 3853 -277 -4522 -8725 -10657 -13749 -13593 -15434 -9193 -5268 -2000 -2709 190 238 -2143
7466 -2143 -3468 -2745 -2611 -5678 -4374 -2331 -5404 -9572 -9426 -8057 -4482 -2047 -2985 -463 1129 -2071
7450 -2071 -2508 -6245 -4283 -3750 -583 1961 -280 -2084 2790 -4476 -9450 -8488 -9034 -8247 -4759 -3652
7434 -3652 -3117 -4340 -6387 -7801 -9379 -10436 -8047 -6060 -4355 -6838 -9545 -13405 -8680 -8822 -6884
7419 -6884 -4443 -2829 -3395 -5081 -1137 -1405 -4502 -5190 -6146 -2692 -6651 -10639 -11015 -9447 -5121 -4681
7403 -4681 -3757 473 -2327 -6646 -6801 -3455 -4042 -6433 -7449 -8924 -8045 -7913 -3953 -2762 -652 -2765
7387 -2765 -5599 -2872 -1115 -7280 -14131 -9040 -4521 -1684 -3363 58 2233 5229 3757 -2824 -7314
$$ packed form
7497h16j641j053M024K460m867k334J449N310K528m878l438j143P321k806k425
7482b309M185J977m130m245m203j932l092J56j841O241L925L268p09K899M8k381
7466b143j325P23J34l067J304K043l073m168J46J369L575K435r38K522J592l200
7450b071m37l737J962N33L167K544k241j804M874p266m974R62n46P87L488J107
7434c652N35j223k047j414j578j057K389J987J705k483k707l860M725j42J938
7419f884K441J614n66j686L944k68l097o88r56L454l959l988l76J568M326M40
7403d681R24M230k800m319j55L346n87k391j016j475Q79J32L960J191K110k113
7387b765k834K727J757o165o851N091M519K837j679L421K175K996j472o581m490
$$ plain form
7372 -7314 -5929 -3099 -3967 -4783 -980 -2083 -6779 -5196 -3649 -5792 -5846 -5742 -4458 -4813 -6277 -5390 -3973
7355 -3973 570 266 -3382 -4894 -5893 -5288 -2267 -4470 -2774 -6522 -6204 -4682 -8139 -6103 -3385 -2096
7339 -2096 -3839 -3253 1166 2348 -1361 -1907 -1134 830 17 -2491 -4252 -4844 -4241 -2746 1796 3301
7323 3301 -1490 -3978 -2966 -1046 -5578 -5138 -2914 -3627 -2441 -1437 -5805 -6168 -5030 -3060 -5632 -6600
7307 -6600 -2670 -3861 -2763 262 1989 914 1729 2782 4346 1628 -200 127 3152 1698 2018 1069
7291 1069 -3207 -6030 -4624 -2500 -3940 -4753 -2734 -1623 -366 -2833 -4777 -6597 -10998 -11684 -6998
7276 -6998 -7260 -6811 -3891 -6042 -5668 -4592 -1340 -3041 -2436 -8039 -12254 -8275 -590 -789 -7938 -13344
7260 -13344 -14532 -11346 -5516 -3823 -1992 -433 -454 667 2162 -690 -2358 -3549 -1476 940 -2847
$$ packed form
7372g314J385K830q68q16L803j103m696J583J547k143n4J04J284l55j464Q87J417
7355c973M543l04l648j512r99O05L021k203J696l748L18J522l457K036K718J289
7339b096j743N86M419J182l709n46P73J964q13k508j761n92O03J495M542J505
7323C301m791k488J012J920m532M40K224p13J186J004m368l63J138J970k572r68
7307f600L930j191J098L025J727j075Q15J053J564k718j828L27L025j454L20r49
7291A069m276k823J406K124j440q13K019J111J257k467j944j820m401o86M686
7276f998k62M49K920k151L74J076L252j701O05n603m215L979P685j99p149n406
7260a3344j188L186N830J693J831J559k1J121J495k852j668j191K073K416l787
$$ plain form
7245 -2847 -4804 -2796 -3720 -569 -535 -1125 -6481 -11594 -14141 -9663 -6568 -4565 -4542 -1632 -894 -2292 -433
7228 -433 1019 1682 3312 1577 2355 2120 2274 6327 4951 2544 4122 2320 -4743 -7127 -2414 -2097
7212 -2097 -8165 -7095 -3855 -3722 -5102 -9991 -8848 -9135 -5402 -6905 -4273 -1787 -1339 -6958 -5516 -5259
7196 -5259 -1737 -4534 -1663 1198 5190 8723 6114 5104 8447 5465 3479 1900 3081 2143 -1217
7181 -1217 -6081 -4550 -5466 -7908 -4349 -5942 -6731 -5061 -4626 -4503 1261 374 -3016 -3475 305 -446 2808
7164 2808 5048 5022 4489 2258 -794 -2648 567 3234 2758 1394 1906 3013 833 -1298 -3386 -6999
7148 -6999 -4218 -3645 -5541 -1047 438 -3014 -7446 -9413 -4769 -3903 -2933 1508 3313 3097 -1991 -1982 -2635
7131 -2635 -2509 -3936 -888 3819 -911 -6496 -9150 -7271 -8116 -9374 -13284 -18076 -14676 -11726 -13330
$$ packed form
7245b847j957K008r24L151L4n90n356n113k547M478L095K003K3K910P38j398J859
7228d33J452O63J630j735P78k35J54M053j376k407J578j802p063k384M713L17
7212b097o068J070L240J33j380m889J143k87L733j503K632K486M48n619J442K57
7196e259L522k797K871K861L992L533k609j010L343k982j986j579J181r38l360
7181a217m864J531r16k442L559j593p89J670M35J23N764q87l390m59L780p51L254
7164B808K240k6n33k231l052j854L215K667m76j364N12J107k180k131k088l613
7148f999K781N73j896M494J485l452m432j967M644Q66R70M441J805k16n088Ro53
7131b635J26j427L048M707m730n585k654J879q45j258l910m792L400K950j604
$$ plain form
7116 -13330 -11503 -9448 -5008 -270 1718 -1297 149 2186 2432 2636 -235 -5260 -8673 -5231 -6527
7101 -6527 -6058 -3833 -1545 -649 3214 3419 -2893 -7064 -4047 -4072 -883 -1645 -1415 -5698 -9135 -3330 1366
7084 1366 1186 347 2155 9890 1757 -10319 -11600 -10328 -10911 -8783 -9416 -10712 -9271 -4396 -5928 -6668
7068 -6668 -7340 -6857 -4170 -6808 -12639 -15435 -8985 -984 3894 2197 845 -4515 -7287 -3598 -2365
7053 -2365 -1204 192 -2696 -3687 -6195 -8757 -2835 69 -2995 -1579 1824 1428 116 1695 4444
7038 4444 5004 8691 7337 -777 -4538 -7295 -7113 -3659 -1375 -1941 -3799 -2440 -4392 -7854 -8896 -9190
7022 -9190 -12512 -13689 -5748 -1548 -97 933 -3806 -10527 -15247 -11548 -7178 -5866 -6948 -4518 -7041
7007 -7041 -6823 -9846 -9354 -3966 -5438 -3498 -4251 -5133 -1921 417 2666 798 -3255 -286 2639 5706
$$ packed form
7116a3330J827K055M440M738J988l015J446K037K46K04k871n025l413L442j296
7101f527M69K225K288Q96L863K05o312m171L017k5L189p62K30m283l437N805M696
7084A366j80q39J808P735q133j2076j281J272n83K128o33j296J441M875j532p40
7068f668o72M83K687k638n831k796O450Q001M878j697j352n360k772L689J233
7053b365J161J396k888r91k508k562N922K904l064J416L403l96j312J579K749
7038D444N60L687j354q114l761k757J82L454K284n66j858J359j952l462j042k94
7022i190l322j177P941M200J451J030m739o721m720L699M370J312j082K430k523
7007g041K18l023M92N388j472J940p53q82L212K338K249j868m053K969K925L067
$$ plain form
6991 5706 4047 2880 679 1326 -2664 -7012 -7374 -3293 -617 -1088 -3256 -5193 -273 -2620 -5422 -10462
6975 -10462 -14126 -16060 -9348 -2344 -2626 -3765 -6378 -3978 -1782 -6586 -8919 -9327 -10076 -6464 -5631 -7567
6959 -7567 -9092 -7889 -5125 -3189 -2113 -1909 61 -20 -3496 -96 2510 983 -2180 -2931 -7424 -1553
6943 -1553 2410 -1716 -6013 -5279 -7302 -9983 -10143 -10394 -11719 -8779 -5194 -5822 -3334 2704 914 -2119
6927 -2119 -4307 -8420 -9969 -8412 -8714 -9191 -5641 -6293 -7744 -4878 -544 -1506 -5182 -2840 966 1342
6911 1342 -954 -3952 671 2403 2419 4882 5344 4017 3875 815 -5233 -5711 -4573 -3622 -1228 1277
6895 1277 2498 4067 3454 1629 1828 1335 812 3063 964 -774 -2072 1572 -101 -1765 -1805 -3178
6879 -3178 -2136 -4663 -8582 -8475 -3594 371 -3381 -1697 -1133 -1186 -3814 -7742 -7079 -1604 -741 -132 1195
$$ packed form
6991E706j659j167k201O47l990m348l62M081K676m71k168j937M920k347k802n040
6975a0462l664j934O712P004k82j139k613K400K196m804k333m08p49L612Q33j936
6959g567j525J203K764J936J076K04J970q1l476L400K606j527l163p51m493N871
6943a553L963m126m297P34k023k681j60k51j325K940L585o28K488O038j790l033
6927b119k188m113j549J557l02m77L550o52j451K866M334r62l676K342L806L76
6911A342k296k998M623J732J6K463M62j327j42l060o048m78J138R51K394K505
6895A277J221J569o13j825J99m93n23K251k099j738j298L644j673j664m0j373
6879c178J042k527l919J07M881L965l752J684N64n3k628l928O63N475Q63O09J327
$$ plain form
6862 1195 -791 1521 -1182 -6427 -1007 3611 2012 3579 2668 -2090 -4255 -5067 -11477 -12048 -10626 -4200
6846 -4200 -2248 1156 2002 2796 308 -4017 -1040 -54 -1394 -5375 -4033 -3252 -1492 93 -2252 -7787
6830 -7787 -10090 -5035 -1147 -2722 695 216 -3009 -9011 -9856 -8477 -3926 993 1105 -4638 -6754 -4050
6814 -4050 -571 -2265 -3945 -6490 -4210 -987 1157 114 -3650 -9049 -7827 -802 -562 -3202 -723
6799 -723 814 -1489 -5085 -6077 -3523 2826 3339 3773 6154 1315 -3803 -7218 -8372 -8518 -5657 -6982
6783 -6982 -2995 -5577 -8085 -5956 -4019 -5227 -4351 -1976 -14 -3136 -4590 -5009 -2317 2422 5814
6768 5814 5823 4141 2787 1492 -1303 -873 2545 2019 -1442 -2086 -3474 -5130 -8054 -4974 -4380 -2821 714
6751 714 1695 -430 -3288 244 7354 1403 -1351 1025 2463 1715 4754 1534 -3773 -2827 -106 2228
$$ packed form
6862A195j986K312k703n245N420M618j599J567r11m758k165q12o410n71J422O426
6846d200J952L404Q46P94k488m325K977R86j340l981J342P81J760J585k345n535
6830g787k303N055L888j575L417m79l225o002q45J379M551M919J12n743k116K704
6814d050L479j694j680k545K280L223K144j043l764n399J222P025K40k640K479
6799g23J537k303l596r92K554O349N13M34K381m839n118l415j154j46K861j325
6783f982L987k582k508K129J937j208Q76K375J962l122j454m19K692M739L392
6768E814Rj682j354j295k795M30L418n26l461o44j388j656k924L080N94J559L535
6751G14R81k125k858L532P110n951k754K376J438p48L039l220n307R46K721K334
$$ plain form
6735 2228 4255 1726 3765 1725 3604 -1204 -7277 -10133 -5170 -4467 -3498 -1672 -2141 -1143 -2245 -4954
6719 -4954 -3587 1006 2181 -1435 2917 758 -5647 -7692 -7334 -5935 -5429 -8206 -3189 -4850 -3548
6704 -3548 -3703 -5510 -736 887 418 2657 -2438 -6105 -2860 1138 2167 1379 -996 5698 5398 -3553
6688 -3553 -5670 -4187 2759 681 -750 -2083 604 1361 -3337 -3600 -2672 -25 460 1086 -395 -1559
6672 -1559 1854 2779 1760 1723 5654 3675 2752 1077 -1609 -2541 -4946 -6981 -8797 -8089 -2518 -397
6656 -397 602 4791 4844 3905 3290 2944 5423 6832 4913 4446 3882 750 -4813 -3340 2218 5402 3799
6639 3799 670 -961 -2304 -2986 -6436 -2071 1367 3786 4661 6977 2208 -3679 -2979 -2537 -6499 393
6623 393 7078 5256 -257 -6046 -6897 -6085 -9073 -7711 -7677 -7270 -7143 -6313 -4605 -3714 595 525 -1500 -2727
$$ packed form
6735B228K027k529K039k040J879m808o073k856M963P03R69J826m69R98j102k709
6719d954J367M593J175l616M352k159o405k045L58J399N06k777N017j661J302
6704c548j55j807M774J623m69K239n095l667L245L998J029p88k375O694l00q951
6688c553k117J483O946k078j431j333K687P57m698k63R28K647M85O26j481j164
6672a559L413R25j019l7L931j979r23j675k686r32k405k035j816P08N571K121
6656c97R99M189N3r39o15l46K479J409j919m67n64l132n563J473N558L184j603
6639C799l129j631j343o82l450M365L438K419Q75K316m769n887P00M42l962O892
6623C93O685j822n513n789q51Q12k988J362L4M07J27Q30J708Q91M309p0k025j227
$$ plain form
6605 -2727 -4116 -2521 1251 1795 2965 5006 2640 907 1138 750 907 2050 347 -1222 4 -996
6589 -996 -4943 -5461 -6739 -7727 -4829 -4907 -5720 -6887 -3153 141 784 -829 2743 6746 6238 4022 769
6572 769 -4933 -5294 -4328 -3959 -1830 -486 -4096 -3681 -3133 -3819 130 -988 -2592 442 367 129 2055
6555 2055 -748 -5010 -3874 -1650 1349 2341 4285 2156 -3937 -8053 -10711 -11752 -14837 -9768 -3598
6540 -3598 -5822 -9420 -6550 -1900 892 1733 1350 4977 4643 991 3523 2725 957 3437 5397 8400
6524 8400 8723 10055 7976 6613 9642 7283 3058 351 -1762 -2741 -2156 -4817 -1521 1764 -1817 1875
6508 1875 2513 -621 -2230 -5611 -6834 -48 3739 10281 15144 13809 7414 6355 7964 1127 -2099
6493 -2099 -1105 -2334 -1928 -2495 3496 8768 8151 7072 7075 2200 3789 4024 2869 6079 7317 5276 1927
$$ packed form
6605b727j389J595L772N44J170K041k366j733K31l88J57J143j703j569J226j000
6589i96l947n18j278r88K898p8q13j167L734L294O43j613L572M003n08k216l253
6572G69n702l61R66L69K129J344l610M15N48o86L949j118j604L034p5k38J926
6555B055k803m262J136K224K999R92J944k129o093m116k658j041l085N069O170
6540c598k224l598K870M650K792Q41l83L627l34l652K532p98j768K480J960L003
6524H400L23J332k079j363L029k359m225k707k113r79N85k661L296L285l581L692
6508A875O38l134j609l381j223O786L787O542M863j335o395j059J609o837l226
6493b099R94j229M06n67N991N272o17j079Lm875J589K35j155L210J238k041l349
$$ plain form
6476 1927 3877 -337 -3164 -7477 -6456 -1169 2046 -1601 -2739 -536 -512 -2558 -1307 848 4055
6461 4055 3503 6317 10471 11426 6489 1697 493 2655 -159 -3131 -1778 -546 3519 5857 9035
6446 9035 7563 6463 5271 -147 -2993 -4622 -7422 -5876 -804 -1534 -4334 -884 225 -669 -132 507
6430 507 -1049 957 -659 -2831 -4737 -6044 -1098 5650 6142 -313 -5285 -7691 -8858 -7371 -5021
6415 -5021 -8985 -3920 3260 -1825 -8767 -8932 -6360 -4993 -4673 -2976 -1613 139 1619 2930 -399
6400 -399 679 4292 7083 6650 -223 -2650 -348 5168 6359 4819 -150 -735 660 15 738 -1395
6384 -1395 -1557 -6128 -8798 -5101 -2325 559 753 1194 3478 735 -6461 -6947 818 1533 -744 -2927
6368 -2927 2525 6358 2677 -410 -129 139 395 -1029 -1228 -1284 -337 702 3039 4502 -182 -1494 -1636
$$ packed form
6476A927J950m214k827m313J021N287L215l647j138K203K4k046J251K155L207
6461D055n52K814M154R55m937m792j204K162k814k972J353J232M065K338L178
6446I035j472j100j192n418k846j629k800J546N072p30k800L450J109q94N37O39
6430E07j556K006j616k172j906j307M946O748M92o455m972k406j167J487K350
6415e021l964N065P180n085o942j65K572J367L20J697J363J752J480J311l329
6400c99J078L613K791m33o873k427K302N516J191j540m969n85J395o45P23k133
6384a395j62m571k670L697K776K884J94M41K284k743p196m86P765P15k277k183
6368b927N452L833l681l087K81K68K56j424j99n6R47J039K337J463m684j312j42
$$ plain form
6351 -1636 -2405 510 -32 3493 3661 -60 939 2362 5251 6836 7906 6976 3907 1811 4024 1486
6335 1486 3431 8605 8290 8445 3731 3656 -1574 -1029 1238 -1816 -4202 -2070 1135 -305 2555 2848
6319 2848 226 -971 -3956 -7167 -5219 -791 1669 -967 1959 3707 2515 1811 882 -530 -2336
6304 -2336 -2898 -5781 -1711 3453 3403 4268 6274 4089 2500 4709 6098 10313 10244 5258 2331 5782
6288 5782 7581 7082 10494 11899 4076 -972 -4056 2022 4605 470 1769 2789 1533 1285 2710
6273 2710 561 864 -1083 -442 -4178 -3707 -808 3850 5141 3671 1628 -485 2703 2433 2658 3655
6257 3655 5620 10308 10877 8385 6778 7084 2308 2394 1878 1431 148 -3821 -424 -1520 -3735 -1522
6241 -1522 3013 5458 3105 1928 -363 -6617 -6845 -4875 -1453 1892 582 2272 5782 4853 871
$$ packed form
6351a636p69K915n42L525J68l721R99J423K889J585J070r30l069k096K213k538
6335A486J945N174l15J55m714p5n230N45K267l054k386K132L205j440K860K93
6319B848k622j197k985l211J948M428K460k636K926J748j192p04r29j412j806
6304b336n62k883M070N164n0Q65K006k185j589K209J389M215o9m986k927L451
6288E782J799m99L412J405p823n048l084O078K583m135J299J020j256k48J425
6273B710k149L03j947O41l736M71K899M658J291j470k043k113L188k70K25R97
6257C655J965M688N69k492j607L06m776Q6n16m47j283l969L397j096k215K213
6241a522M535K445k353j177k291o254k28J970L422L345j310J690L510r29l982
$$ plain form
6226 871 2243 1943 4413 5387 2767 2817 286 -10518 -11459 -6913 -936 4131 2005 2371 40 -2277
6210 -2277 -6678 -8565 -4843 -272 677 1757 -1603 -728 1736 1563 -2966 -8850 -5601 -1341 -1515 1344
6194 1344 4940 6718 8088 4153 -1563 2332 4072 1736 -2063 -1870 -1984 -2435 -1457 3164 6664 3856
6178 3856 4462 541 -2190 -1034 -345 -3633 199 3730 818 -2427 -249 3722 6601 5592 5503 3531
6162 3531 1856 842 -2779 989 4027 4445 5285 5056 4810 2123 2645 1239 -762 -349 -370 -3893 -1482
6145 -1482 288 -5679 -8782 -9680 -5549 -3026 763 5085 3939 1014 2721 2268 1259 -1766 1905
6130 1905 4000 622 -2033 584 3325 2042 3201 545 -679 -1324 3874 3926 10 443 6371 8210
6114 8210 6144 1454 -2572 -3164 -567 340 -4992 -6712 -5648 -4677 -6555 -5578 -3192 -5331 -4635 2773
$$ packed form
6226H71J372l00K470R74k620N0k531j0804r41M546N977N067k126L66k331k317
6210b277m401j887L722M571R49J080l360Q75K464j73m529n884L249M260j74K859
6194A344L596J778J370l935n716L895J740k336l799J93j14m51R78M621L500k808
6178C856O06l921k731J156O89l288L832L531k912l245K178L971K879j009q9j972
6162C531j675j014l621L768L038M18Q40k29k46k687N22j406k001M13k1l523K411
6145a482J770n967l103q98M131K523L789M322j146k925J707m53j009l025L671
6130A905K095l378k655K617K741j283J159k656j224o45N198N2l916M33N928J839
6114H210k066m690m026n92K597R07n332j720J064R71j878R77K386k139O96P408
$$ plain form
6098 2773 3255 2637 1463 1089 -2734 -187 2868 2615 2146 -4589 -8648 -8770 -11509 -4671 -787 -3496
6082 -3496 -5959 -3127 -1831 -2745 759 3980 843 -3107 -7977 -5205 -1904 1468 1917 -974 -1445 -2736
6066 -2736 -554 5101 8511 3149 3183 4291 -2353 -308 3321 3578 8633 14211 13747 9513 779 -393
6050 -393 2362 17 1780 1412 1998 2421 3678 4124 6123 1364 -222 -3565 -3460 -4389 -3194 -3923 -3951
6033 -3951 221 359 -5061 30 -290 1084 1827 -295 -145 -2506 -4776 -2601 -2228 712 -303 3063
6017 3063 6923 8295 7961 3707 2995 1453 749 1843 220 1586 -839 -5220 -5653 -3696 -3050 -7268
6001 -7268 -3453 2158 291 -2 1309 1797 1339 -2590 -6474 -4294 -799 -496 1481 2350 4093 6404
5985 6404 3305 1505 5437 4779 1957 -3108 -1563 852 -371 -3446 -4679 -5254 -5437 -2350 3082 3547
$$ packed form
6098B773M82o18j174l74l823K547L055k53m69o735m059j22k739O838L884k709
6082c496k463K832J296r14L504L221l137l950m870K772L301L372M49k891m71j291
6066b736K182N655L410n362L4J108o644K045L629K57N055N578m64m234q734j172
6050c93K755k345J763l68N86M23J257M46J999m759j586l343J05r29J195p29k8
6033c951M172J38n420N091l20J374P43k122J50k361k270K175L73K940j015L366
6017C063L860J372l34m254p12j542p04J094j623J366k425m381m33J957O46m218
6001g268L815N611j867k93J311M88m58l929l884K180L495L03J977Q69J743K311
5985F404l099j800L932o58k822n065J545K415j223l075j233n75j83L087N432M65
$$ plain form
5969 3547 3030 7273 8374 6083 5427 4223 5176 3289 2030 237 2507 1980 -872 1373 4255 3696
5953 3696 4350 1993 5807 8717 5026 276 -7031 -7725 -2467 -3641 110 1422 347 4387 7548
5938 7548 2254 -4903 -6865 -5326 1635 427 -2134 -1387 264 -3298 -2264 -3121 -7147 -9980 -7752
5923 -7752 -5819 808 1849 1276 1313 614 -3121 -3887 -6555 -3473 656 3897 4147 3766 4746 3079 -4317
5906 -4317 -10868 -9195 -6168 -3941 -1946 -1585 -2546 -2752 205 -1732 -4751 -6473 -7756 -3647 -4082 -5817
5890 -5817 -9009 -7771 -4662 -2152 -2799 -3829 -3371 -5733 -8071 -5922 -3796 -4783 591 3266 5449 3255
5874 3255 -1114 -2539 -4740 -8909 -3725 -592 1586 1532 -711 2028 3125 3684 1415 -4535 -2906 104
5858 104 -478 -326 3622 -3806 -9028 -6255 -4990 17 7345 8873 7468 4869 6302 2611 -814 2542
$$ packed form
5969C547n17M243J101k291o56j204R53j887j259j793K270n27k852K245K882n59
5953C696O54k357L814K910l691m750p307o94N258j174L751J312j075M040L161
5938G548n294p157j962J539O961j208k561P47J651l562J034q57m026k833K228
5923g752J933O627J041n73L7o99l735p66k668L082M129L241K50l81R80j667p396
5906d317o551J673L027K227J995L61r61k06K957j937l019j722j283M109m35j735
5890e817l192J238L109K510o47j030M58k362k338K149K126r87N374K675K183k194
5874C255m369j425k201m169N184L133K178n4k243K739J097N59k269n950J629L010
5858A04n82J52L948p428n222K773J265N007P328J528j405k599J433l691l425L356
$$ plain form
5842 2542 2927 897 -2524 -4264 -3556 -3438 -2978 1332 -1732 -3706 -2681 -1313 1710 3339 2282 1905
5826 1905 -4831 -8340 -7985 -6859 -7638 -9428 -6493 -3729 -4926 -4416 685 -4845 -10045 -9311 -12352 -10175
5810 -10175 -8211 -12516 -15168 -8537 -5852 -3331 314 8493 5028 3366 2602 -706 -896 145 -974
5795 -974 1847 4623 1006 -4677 -7468 -5108 -545 7261 8743 9706 9657 8834 9675 12408 12030 8150 5177
5778 5177 -1389 -10288 -16855 -18799 -23779 -23325 -22844 -21014 -17133 -14213 -14052 -11135 -4062 1222 4069 7385
5762 7385 9858 7374 4929 2758 1258 1352 1238 -2835 -3100 -6838 -6146 -3730 -2010 -2102 4170 2026 -560
5745 -560 1070 4805 2029 5827 8507 1990 3700 3385 -3660 -11987 -10754 -2382 -1792 -4138 -7171 -6393
5729 -6393 2276 7361 7613 9938 13967 13409 7298 3582 -6757 -7355 -9929 -8226 336 4803 5609 3665
$$ packed form
5842B542L85k030l421j740P08J18M60M310l064j974J025J368L023J629j057l77
5826A905o736l509L55J126p79j790K935K764j197N10N101n530n200P34l041K177
5810a0175J964m305k652O631K685K521L645Q179l465j662p64l308j90J041j119
5795i74K821K776l617n683k791K360M563P806J482R63m9q23Q41K733l78l880k973
5778E177o566q899o567j944m980M54M81J830L881K920J61K917P073N284K847L316
5762G385K473k484k445k171j500R4j14m073k65l738O92K416J720r2O272k144k586
5745e60J630L735k776L798K680o517J710l15p045q327J233Q372N90k346l033P78
5729f393Q669N085K52K325M029n58o111l716j0339n98k574J703Q562M467Q06j944
$$ plain form
5713 3665 3256 16 -3180 191 2044 2648 5511 6991 12449 7331 2001 7939 8474 2426 5439 11784
5697 11784 8356 8148 11519 1261 -5318 -4071 -4395 851 4075 2022 -2410 -4495 -5961 -6964 -2389
5682 -2389 1673 549 -3747 -6123 -1267 3042 7747 8352 8063 6743 5190 2858 -521 293 1441 3300
5666 3300 5077 4533 1710 -5423 -6630 -8335 -9600 -10264 -282 8938 2685 789 4163 10589 10542 9490
5650 9490 7778 7097 3311 2769 4166 4447 3929 3676 1021 1543 -887 -2258 -3542 5105 2818 -2070
5634 -2070 -1362 1117 -1385 238 -629 -1916 4183 4393 1565 -213 2234 3148 4828 2328 5035 3267
5618 3267 -2599 -603 455 -3339 -1947 2891 4725 3285 3886 4470 7033 8103 7527 4420 3036 -3101
5602 -3101 -3088 -3510 -24 4121 1053 -2587 -5837 -6272 -5952 -3027 -1212 794 1332 -1475 -4670 -4068 -264
$$ packed form
5713C665m09l240l196L371J853O04K863J480N458n118n330N938N35o048L013O345
5697A1784l428k08L371j0258o579J247l24N246L224k053m432k085j466j003M575
5682b389M062j124m296k376M856M309M705O05k89j320j553k332l379Q14J148J859
5666C300J777n44k823p133j207j705j265o64R982R220o253j896L374O426m7j052
5650I490j712o81l786n42J397K81n18k53k655N22k430j371j284Q647k287m888
5634b070P08K479k502J623q67j287O099K10k828j778K447R14J680k500K707j768
5618C267n866J996J058l794J392M838J834j440O01N84K563J070n76l107j384o137
5602c101J3m22L486M145l068l640l250m35L20K925J815K006N38k807l195O02L804
$$ plain form
5585 -264 -1093 -4743 -9495 -6572 -2490 1861 4125 -266 -6445 -9161 -6935 -7174 -8977 -344 3647 3642
5569 3642 3611 2656 2595 4068 7437 8823 5908 6704 9549 5319 2217 190 1522 -5051 -3278 819
5553 819 1887 1134 -1497 -1221 -6906 -9557 22 5653 6107 8360 10547 11532 8840 4393 575 -1420
5537 -1420 1838 5112 3146 527 3561 5332 5085 2294 715 2624 2680 474 301 -1542 3952 9535
5521 9535 6777 1733 -5990 -5213 -149 -1434 -1442 2080 807 262 -629 689 -1986 1242 5189 6522
5505 6522 8023 5171 -2357 -1587 796 -470 -567 1128 424 -1465 26 3306 1792 1249 3886 5385
5489 5385 5648 8325 6431 5763 7117 828 -6848 -6525 -1438 4519 1972 1761 -3364 -7290 -3772 3135
5473 3135 3996 3801 8596 7222 4018 6006 6628 5255 6221 5726 1725 -975 -6160 -8979 -5745 -4517
$$ packed form
5585b64q29l650m752K923M082M351K264m391o179k716K226k39j803Q633L991n
5569C642l1r55o1J473L369J386k915P96K845m230l102k027J332o573J773M097
5553H19J068p53k631K76n685k651R579N631M54K253K187R85k692m447l818j995
5537a420L258L274j966k619L034J771k47k791j579J909N6k206j73j843N494N583
5521I535k758n044p723P77N064j285qL522j273n45q91J318k675L228L947J333
5505F522J501k852p528P70K383j266r7J695p04j889J491L280j514n43K637J499
5489E385K63K677j894o68J354o289p676L23N087N957k547k11n125l926L518O907
5473C135Q61j95M795j374l204J988O22j373R66m95m001k700n185k819L234J228
$$ plain form
5457 -4517 -2426 9 -363 313 3505 6529 3803 7196 3936 1834 3502 2903 -2307 126 4750 7895
5441 7895 6340 7738 4578 -2403 -6841 -8972 -7225 -2605 774 -1553 786 1758 2323 4736 5243 2610
5425 2610 -722 -2139 -2927 -1894 1151 -1143 -3474 -4525 -2506 483 62 2167 7094 4619 4761 2691
5409 2691 2080 4941 3443 51 -1616 -928 -2980 -2017 3713 5738 5025 4326 6219 5857 2265 1531 854
5392 854 1284 -2000 -3856 -1775 728 6482 6751 6217 7030 5099 7500 10946 7592 4381 3578 3011 1777
5375 1777 5609 5813 5745 6494 6978 4657 3134 1263 2414 3592 2899 3934 3696 4068 4967 3628 315
5358 315 -1698 494 1807 3683 3003 3454 3088 -1715 -3052 -392 -3703 -4272 2500 3204 3065 5753 4931
5341 4931 5347 8163 3176 -348 -2399 -3187 -4553 -6192 -7081 -6699 -7230 -4784 -8370 -7908 -7238 -9060 -8371
$$ packed form
5457d517K091K435l72O76L192L024k726L393l260k102J668n99n210K433M624L145
5441G895j555J398l160o981m438k131J747M620L379k327K339R72N65K413N07k633
5425B610l332j417p88J033L045k294k331j051K019K989m21K105M927k475J42k070
5409B691o11K861j498l392j667O88k052R63N730K025p13o99J893l62l592p34o77
5392H54M30l284j856K081K503N754K69n34Q13j931K401L446l354l211q03n67j234
5375A777L832K04o8P49M84k321j523j871J151J178o93J035k38L72Q99j339l313
5358C15k013K192J313J876o80M51l66m803j337K660l311n69O772P04j39K688q22
5341D931M16K816m987l524k051p88j366j639q89L82n31K446l586M62O70j822O89
$$ plain form
5324 -8371 -2033 -1252 -4164 -4805 -6087 -3318 218 -2368 -1779 -1668 -1452 3593 5219 9872 9956 9893 5054
5307 5054 757 605 2661 -2469 862 1560 -2094 -279 1072 3849 1697 -3116 -4810 -495 4996
5292 4996 6492 6959 7151 4935 1946 330 2139 2923 4625 7292 3774 -1377 -1760 3776 1544 -1453
5276 -1453 -8613 -1778 1738 3049 5887 4580 2259 -954 -2922 -3370 -3783 -3553 2719 4022 4838 8429
5260 8429 7892 1193 -4181 -4350 -1568 513 3878 5878 3169 1380 2304 3775 7445 8253 6433 -1840
5244 -1840 -6877 -5813 -5912 -4166 -3935 1233 4557 6148 3119 2217 -2474 -1845 1365 3373 -989 -2933
5228 -2933 1501 -1141 -149 -101 -747 -119 5843 9567 8389 1578 -2485 -642 398 4651 2277 -942
5212 -942 1227 7816 9968 7955 166 -4908 -4607 -1041 -5965 -2529 2932 2418 -126 4575 6809 4510
$$ packed form
5324h371O338P81k912o41j282K769L536k586N89J11K16N045J626M653Q4o3m839
5307E054m297j52K056n130L331O98l654J815J351K777k152m813j694M315N491
5292D996J496M67J92k216k989j616J809P84J702K667l518n151l83N536k232k997
5276a453p160O835L516J311K838j307k321l213j968m48m13K30O272J303Q16L591
5260H429n37o699n374j69K782K081L365K000k709j789R24J471L670Q08j820q273
5244a840n037J064r9J746K31N168L324J591l029r02m691O29L210K008m362j944
5228b933M434k642R92M8o46O28N962L724j178o811m063J843J040M253k374l219
5212i42K169O589K152k013p789n074L01L566m924L436N461n14k544M701K234k299
$$ plain form
5196 4510 2370 902 3179 2637 1315 -4175 -6463 -3035 944 3411 6363 10431 10785 13250 15312
5181 15312 16232 11295 6239 5801 3407 2897 3474 2041 -1281 -4016 -2096 4848 8326 6531 6550 8909
5165 8909 7159 4853 4405 4799 7357 9087 9014 12618 8589 6009 6570 6544 6254 1911 -552 -752 1862
5148 1862 2072 1076 -233 -507 -1815 -1723 -1980 290 2641 5166 6436 4728 498 -2584 2434 9070
5132 9070 7132 4213 4459 5732 3789 4312 3617 -1806 -909 3408 550 1074 7230 7440 4202 800
5116 800 1602 3444 3387 1792 -216 2038 1136 -112 3706 7703 12072 13315 8299 2580 566 -222
5100 -222 755 5085 5910 5003 5933 1935 1169 3825 3362 7694 4050 550 -2905 617 4191 3974 -1079
5083 -1079 -3716 -10352 -12085 -6416 -3398 1908 6611 8104 6676 4638 3566 3474 4039 316 748 -540
$$ packed form
5196D510k140j468K277n42j322n490k288L428L979K467K952M068L54K465K062
5181A5312R20m937n056m38k394n10N77j433l322k735J920O944L478j795J9K359
5165H909j750k306m48L94K558J730p3L604m029k580N61k6k90m343k463k00K614
5148A862K10r96j309k74j308R2k57K270K351K525J270j708m230l082N018O636
5132I070j938k919K46J273j943N23o95n423Q97M317k858N24O156K10l238l402
5116H00Q02J842n7j595k008K254r02j248L818L997M369J243n016n719k014p88
5100b22R77M330Q25r07R30l998p66K656m63M332l644l500l455L522L574k17n053
5083a079k637o636j733N669L018N306M703J493j428k038j072r2N65l723M32j288
$$ plain form
5067 -540 2035 2168 1115 -765 3632 5670 1898 -6451 -7533 -7163 -11635 -8495 -3221 1214 -490 -1592
5051 -1592 3418 172 -226 -1652 1055 -2267 -2714 -1453 91 2787 -3344 -4368 -3158 -5036 -4506 -8958
5035 -8958 -8589 -5630 -7096 -5306 -5894 -2898 -929 -1938 -5611 -7068 -1258 1891 445 -702 -218 -328
5019 -328 -113 -1212 -1868 -1450 505 -1007 -43 3168 5567 2455 4616 3352 1595 3446 8025 9584
5003 9584 4793 802 1257 1070 -494 211 4812 5087 549 -2025 -127 272 -518 3254 766 1237 6790
4986 6790 6330 8240 11066 10264 5558 7362 9882 7704 7165 10642 12313 10481 6985 6247 9168 11165
4970 11165 7717 4172 4593 3378 2888 3627 3293 -559 -2888 -3476 -3280 3851 10150 12961 11298 7031
4954 7031 2235 3247 4290 5037 3449 -1531 -1230 807 -1409 -4599 -7068 -2209 864 3039 4784
$$ packed form
5067e40K575J33j053j880M397K038l772q349j082L70m472L140N274M435j704j102
5051a592N010l246l98j426K707l322m47J261J544K696o131j024J210j878N30m452
5035h958L69K959j466J790n88K996J969j009l673j457N810L149j446j147M84j10
5019c28K15j099o56M18J955j512R64L211K399l112K161j264j757J851M579J559
5003I584m791l991M55j87j564P05M601K75m538k574J898L99p90L772k488M71N553
4986F790m60J910K826q02m706J804K520k178n39L477J671j832l496p38K921J997
4970A1165l448l545M21j215m90P39l34l852k329n88J96P131O299K811j663m267
4954G031m796J012J043P47j588m980L01K037k216l190k469M859L073K175J745
$$ plain form
4939 4784 768 1751 4382 2726 -644 -2322 -2943 -4188 -3961 -1655 -2796 -626 630 -1045 -2847 -15
4923 -15 2845 4648 2506 1369 2451 858 -130 387 651 1200 1769 3134 4013 2309 4156 5282 3892
4906 3892 5927 12710 12719 4036 252 1217 3601 5607 6238 3947 5241 1420 6042 6841 7965 6291
4890 6291 7703 8689 6736 2507 -1038 -1013 -2570 -352 2698 228 2643 9032 12274 8342 8650 11935
4874 11935 8936 5715 8910 9082 7056 7276 6459 10520 10227 9941 8301 8071 6616 3101 3200 629 1172
4857 1172 1789 4412 10260 11079 8355 2654 -1288 -4403 -5498 -646 -90 1312 344 -2476 -1902 500
4841 500 -406 884 282 -455 -1575 -5322 -9712 -7495 -2689 -1504 -8282 -8903 -7412 -5655 -4107 2071
4825 2071 5944 4419 6097 5403 4053 3294 6625 6715 5312 4238 5990 4233 2877 4734 3586 2284
$$ packed form
4939D784m016R83K631j656l370j678o21j245K27K306j141K170J256j675j802K832
4923a5K860J803k142j137J082j593r88N17K64N49N69J365Q79j704J847J126j390
4906C892K035O783Rq683l784R65K384K006O31k291J294l821M622P99J124j674
4890F291J412R86j953m229l545K5j557K218L050k470K415O389L242l932L08L285
4874A1935k999l221L195J72k026K20q17M061k93k86j640k30j455l515R9k571N43
4857A172O17K623N848Q19k724n701l942l115j095M852N56J402r68k820N74K402
4841E00r06J290o02p37j120l747m390K217M806J185o778o21J491J757J548O178
4825B071L873j525J678o94j350p59L331R0j403j074J752j757j356J857j148j302
$$ plain form
4809 2284 2721 4383 4347 7222 7355 2192 483 -5055 -432 3199 5827 3427 7160 12713 10316 7722
4793 7722 10167 8648 11024 12546 6879 3583 2036 -816 -766 -1483 -2544 631 2515 -860 -2343 -2932
4777 -2932 3675 9511 12187 9081 8615 8045 8331 11184 5639 76 2049 1093 3599 4533 4587 10147 13088
4760 13088 10826 12956 12038 3534 -1438 1528 3759 8407 11157 10977 7975 8615 9848 7549 5963
4745 5963 4459 1372 -3528 3061 7114 4499 4217 2179 -499 2033 2405 -750 -1477 -2408 -4070 -462
4729 -462 -1922 -3094 -3574 -1966 -675 394 2981 10164 12243 9580 5914 4476 3677 3727 203 1313
4713 1313 4064 1800 -624 -1412 489 2420 2981 1009 1527 2049 1192 -1708 -4370 -5203 -4635 -5257 -3746
4696 -3746 -2408 -2914 -959 -863 1383 2901 2226 -1569 -4467 -707 -34 -4674 -1151 -352 1002 3338
$$ packed form
4809B284M37J662l6K875J33n163j709n538M623L631K628k400L733N553k397k594
4793G722K445j519K376J522n667l296j547k852N0p17j061L175J884l375j483n89
4777b932O607N836K676l106m66n70K86K853n545n563J973r56K506R34N4N560K941
4760A3088k262K130r18q504m972K966K231M648K750j80l002O40J233k299j586
4745E963j504l087m900O589M053k615k82k038k678K532L72l155p27r31j662L608
4729d62j460j172m80J608J291J069K587P183K079k663l666j438p99N0l524J110
4713A313K751k264k424p88J901J931N61j972N18N22q57k900k662q33N68o22J511
4696c746J338n06J955R6K246J518o75l795k898L760O73m640L523P99J354K336
$$ plain form
4680 3338 4725 9400 6307 3365 846 1776 7166 4701 2644 -2155 -6965 -6510 -5510 -2874 -4472
4665 -4472 -5113 -4154 -6382 -8913 -8091 -4339 -2406 -7174 -3840 -2554 3011 6151 461 -457 3358 3693
4649 3693 5174 304 -3039 -5601 -7355 -3488 404 353 -989 -6016 -11508 -11626 -10431 -5326 -6646 -4858
4633 -4858 466 5125 4186 1372 -799 -134 -2686 -1733 3039 4810 6588 7675 9345 10134 4420 659
4617 659 409 2232 1279 -4795 -7702 -4151 -4178 397 -2761 -2508 -1206 -71 805 4836 5818 6546 3824
4600 3824 -3961 -6822 -6395 -2299 -3168 -7109 -5642 -5859 -3925 490 1857 3167 3954 1233 2129 5392
4584 5392 8896 9428 7717 7472 7697 5579 7498 9109 3166 -4681 -6421 183 3138 2465 -4048 -4571
4568 -4571 -170 -687 2204 1210 1074 3511 2567 1223 -45 2405 10556 4979 5749 4493 6278 3863
$$ packed form
4680C338J387M675l093k942k519R30N390k465k057m799m810M55J000K636j598
4665d472o41R59k228k531Q22L752J933m768L334J286N565L140n690r18L815L35
4649C693J481m870l343k562j754L867L892n1j342n027n492j18J195N105j320J788
4633d858N324M659r39k814k171O65k552R53M772J771J778J087J670P89n714l761
4617F59k50J823r53o074k907L551k7M575l158K53J302J135Q76M031R82P28k722
4600C824p785k861M27M096q69l941J467k17J934M415J367J310P87k721Q96L263
4584E392L504N32j711k45K25k118J919J611n943p847j740O604K955o73o513n23
4568d571M401n17K891r94j36K437r44j344j268K450Q151n577P70j256J785k415
$$ plain form
4552 3863 6421 4837 7073 4535 2939 3555 -1634 -4180 -153 1716 1112 4703 7784 2304 -5341
4537 -5341 -8828 -6325 -4044 2057 6434 1662 4891 5960 2079 3880 4278 7414 3626 -1872 -4083
4522 -4083 -1302 1599 2030 4427 3866 2184 2380 821 1592 652 -6006 -8943 -6858 -2809 -1478 -2033
4506 -2033 -69 4865 3552 2975 2532 -723 1427 8317 4664 3079 -1121 -2309 1810 -1920 -1802 5752
4490 5752 5178 192 -1167 -5463 -3610 -1710 2139 3115 -2914 -5779 -403 6238 6474 3978 -900 -4240
4474 -4240 -721 668 -1404 1003 55 -151 -1411 827 -587 490 4520 390 -1537 -1395 2867 6501
4458 6501 9541 8386 5040 2598 5230 2872 -510 -2472 4241 4706 2581 1605 3864 7866 6184
4443 6184 6195 1465 -48 -1839 -2711 -1214 -5854 -7285 -6929 -5840 -5583 -5603 -5642 -5065 1292 5149 8077
$$ packed form
4552C863K558j584K236k538j596O16n189k546M027J869o04L591L081n480p645
4537e341l487K503K281O101M377m772L229J069l881J801L98L136l788n498k211
4522d083K781K901M31K397n61j682J96j559P71r40o658k937K085M049J331n55
4506b033J964M934j313n77m43l255K150O890l653j585m200j188M119l730J18P554
4490E752n74m986j359m296J853J900L849R76o029k865N376O641K36k496m878l340
4474d240L519J389k072K407r48k06j260K238j414J077M030m130j927J42M262L634
4458F501L040j155l346k442K632k358l382j962O713M65k125r76K259M002j682
4443F184J1m730j513j791q72J497m640j431L56J089K57k0l9N77O357L857K928
$$ plain form
4426 8077 5677 4002 1200 1663 3064 -1225 -317 239 -144 903 4289 2416 322 -707 -1450 1138
4410 1138 716 1509 1707 3566 5890 3341 -584 -4458 -7677 -9950 -5605 3199 4982 4330 -1357 -6005
4394 -6005 -2789 4974 3843 1000 6410 8814 1702 -2870 -2688 51 825 3673 7020 2877 -711
4379 -711 -521 2223 4052 -2430 -3145 733 -952 -1938 -1622 -2928 -2633 1741 5072 11771 10621 5008
4363 5008 812 1003 1766 2078 2848 4201 2726 4224 5757 7892 6038 2654 3946 2196 1336 1490
4347 1490 -2754 -2186 -1275 1579 5985 5738 3273 841 5257 5766 2414 4495 5026 1254 677 1982
4331 1982 2736 -2153 -313 8321 8103 7345 5409 -334 69 -400 938 -2257 -5814 -2569 -4060 -5879
4315 -5879 -3303 -2582 -1480 2037 9713 6162 987 -1774 -2285 -1655 -94 1546 4541 4688 4072 -992
$$ packed form
4426H077k400j675k802M63J401m289R08N56l83J047L386j873k094j029p43K588
4410A138m22P93J98J859K324k549l925l874l219k273M345Q804J783o52n687m648
4394f005L216P763j131k843N410K404p112m572J82K739P74K848L347m143l588
4379g11J90K744J829o482p15L878j685r86L16j306K95M374L331O699j150n613
4363E008m196J91P63L12P70J353j475J498J533K135j854l384J292j750q60J54
4347A490m244N68R11K854M406k47k465k432M416N09l352K081N31l772n77J305
4331A982P54m889J840Q634k18p58j936n743M03m69J338l195l557L245j491j819
4315e879K576P21J102L517P676l551n175k761n11O30J561J640K995J47o16n064
$$ plain form
4299 -992 -5583 -3732 2926 7074 9618 6022 3168 760 -1161 3121 7654 9521 10409 5001 1233
4284 1233 -580 2141 8604 4672 145 2982 3280 3768 6363 8876 5531 3310 5137 4298 3008 -2192
4268 -2192 -1226 160 2812 1811 1708 2109 949 -994 -892 3540 1103 -4921 -4404 -20 2005 3510
4252 3510 2832 2724 1713 -333 -470 2729 6064 7245 8239 12702 8468 3894 104 1046 1948 3915
4236 3915 2235 2158 4596 4322 2131 -1345 -931 2695 234 -637 -1826 -4013 -1078 3882 7170 9013
4220 9013 8742 6210 1061 -1798 -3119 -3073 951 7473 7513 6669 5826 -621 -918 452 -19 515 -744
4203 -744 -1739 2559 2600 3769 4193 3706 3127 2916 1870 3446 8361 2367 -6033 -3510 -4160 -5425 -5200
4186 -5200 -7399 -4724 -523 1377 -1204 -405 841 8654 10432 8336 5316 6610 6422 6980 753 275
$$ packed form
4299i92m591J851O658M148K544l596k854k408j921M282M533J867Q88n408l768
4284A233j813K721O463l932m527K837K98M88K595K513l345k221J827q39j290n200
4268b192R66J386K652j001j03M01j160j943J02M432k437o024N17M384K025J505
4252C510o78j08j011k046j37L199L335J181R94M463m234m574l790R42R02J967
4236C915j680p7K438k74k191l476M14L626k461q71j189k187K935M960L288J843
4220I013k71k532n149k859j321M6M024O522M0q44q43o447k97J370m71N34j259
4203g44r95M298M1J169M24m87n79k11j046J576M915n994q400K523o50j265K25
4186e200k199K675M201J900k581P99J246P813J778k096l020J294j88N58o227m78
$$ plain form
4170 275 1761 3825 9368 11049 8421 1595 -3969 -6966 -2391 901 1343 1893 2938 2477 1217 -2131
4154 -2131 -3261 -2266 1273 3711 7377 3185 -1449 1009 3609 907 5436 5594 4052 3712 4521 1022
4138 1022 2258 2509 3835 8046 4533 432 6885 7801 6414 5116 1391 2059 4817 4648 2402 -3648
4122 -3648 -7120 -5048 -2745 -5243 -4432 -2481 -5629 -3766 -3608 -847 -117 2617 8053 8417 3234 -1616
4106 -1616 -1164 -1534 -3367 -2303 -3391 -3192 28 4612 3426 3656 7653 8758 4889 -755 1852 3693
4090 3693 4042 -1336 -3094 -1446 1793 4667 4926 6243 6580 5545 3288 2198 -545 -789 3513 4603
4074 4603 2136 2356 4360 5960 8986 10097 5333 2281 5957 8541 6710 7837 3194 3504 7362
4059 7362 614 -2603 -3462 -1014 610 3422 7453 5540 3005 3855 -1222 -246 101 -586 10092 15775
$$ packed form
4170B75J486K064N543J681k628o826n564k997M575L292M42N50J045m61j260l348
4154b131j130R95L539K438L666m192m634K458K600k702M529J58j542l40Q09l499
4138A022J236K51J326M211l513m101O453R16j387j298l725O68K758j69k246o050
4122c648l472K072K303k498Q11J951l148J863J58K761P30K734N436L64n183m850
4106a616M52l70j833J064j088J99L220M584j186K30L997J105l869n644K607J841
4090C693L49n378j758J648L239K874K59J317L37j035k257j090k743k44M302J090
4074D603k467K20K004J600L026J111m764l052L676K584j831J127m643L10L858
4059G362o748l217q59K448J624K812M031j913k535Q50n077R76L47o87J0678N683
$$ plain form
4043 15775 16940 19184 12254 552 -1341 -2374 -1663 1391 2926 915 -1254 -2624 -2110 2148 2785
4028 2785 3233 1672 3863 5048 6514 2912 138 -17 157 -1600 -1416 -2394 -1383 2450 4617 2402
4012 2402 1463 3380 5284 5588 2195 1819 252 -2597 -2785 -1422 1642 -1578 -135 2110 4121 6150
3996 6150 7634 4863 5116 2249 -2735 -5729 -5429 -2709 1521 2736 2060 -2667 -2851 -4083 -3080 3582
3980 3582 7700 10606 10068 8606 5679 2513 6380 5927 4420 8523 13325 10135 9471 6805 6981 5069
3964 5069 8901 7541 3683 5515 10442 7413 5501 3919 3724 5912 10619 8637 7197 6827 1033
3949 1033 -1488 -3010 -2622 -2737 977 2925 3794 -126 -1337 3600 9782 9731 9821 3147 1678 6706 12315
3932 12315 11750 9065 2899 -4725 -4173 -5587 -183 5055 7911 8463 692 1185 -2253 -8616 -4317 2632
$$ packed form
4043A5775J165K244o930j1702j893j033P11L054J535k011k169j370N14M258O37
4028B785M48j561K191J185J466l602k774j55J74j757J84r78J011L833K167k215
4012B402r39J917J904L04l393l76j567k849j88J363L064l220J443K245K011K029
3996F150J484k771K53k867m984k994L00K720M230J215o76m727j84j232J003O662
3980C582M118K906n38j462k927l166L867m53j507M103M802l190o64k666J76j912
3964E069L832j360l858J832M927l029j912j582j95K188M707j982j440l70n794
3949A033k521j522L88j15L714J948Q69l920j211M937O182n1R0o674j469N028N609
3932A2315n65k685o166p624N52j414N404N238K856N52p771M93l438o363M299O949
$$ plain form
3916 2632 600 -1090 -1291 -5191 -5803 -7387 -2485 -536 -3960 -4101 -2364 92 1126 -752 1340 1180
3900 1180 2056 3213 -2061 -3789 1167 619 -3538 -2109 -1141 -1654 703 860 2333 3476 1486 -2964
3884 -2964 -2517 -1745 603 810 -339 -34 -404 4259 12167 9236 10924 11936 7349 3613 842 -1002
3868 -1002 -1280 319 565 5146 6075 949 -5815 -6315 -4539 -5096 -4090 -2120 -374 835 753 887 -4691
3851 -4691 -3430 3695 5760 8235 3644 -37 1513 2525 3499 5699 2026 2252 -383 -2720 -5211
3836 -5211 -2193 -1428 707 -85 3814 4604 7565 5783 5017 3274 3462 2678 135 1569 5026 4869 524
3819 524 1738 3787 4458 6078 4723 -1982 -1405 1708 1569 511 -58 -611 -987 1510 -1997 -5040 -5447
3802 -5447 -439 2602 3067 2810 4679 6691 3937 6278 5560 3177 3101 5215 7107 -786 -3366 -2325
$$ packed form
3916B632k032j690k01l900o12j584M902J949l424j41J737K456J034j878K092j60
3900A180Q76J157n274j728M956n48m157J429R68n13K357J57J473J143j990m450
3884b964M47P72K348K07j149L05l70M663P908k931J688J012m587l736k771j844
3868a002k78J599K46M581R29n126o764n00J776n57J006J970J746J209q2J34n578
3851d691J261P125K065K475m591l681J550J012R74K200l673K26k635k337k491
3836e211L018P65K135p92L899P90K961j782p66j743J88p84k543J434L457j57m345
3819E24J214K049O71J620j355o705N77L113j39j058n69n53l76K497l507l043m07
3802e447N008L041M65k57J869K012k754K341p18k383p6K114J892p893k580J041
$$ plain form
3786 -2325 96 -1107 -1394 3783 5080 2603 3314 2620 3247 4223 2291 3179 1671 4459 8398 12080
3770 12080 6442 2190 3100 4466 2377 5750 3342 7087 7565 1905 -4058 -265 1528 3735 7036
3755 7036 8718 6184 536 -5057 -3038 -3501 -1974 976 5524 7817 8098 6515 8242 7532 10627 9134
3739 9134 6384 6116 -1134 -4577 -1891 -1058 -1583 -1777 -2878 -5317 -3186 -3496 -6251 -5508 -2547 2867
3723 2867 2377 4534 8153 3347 -1667 -4235 2242 12430 16044 11831 4801 6188 2740 -270 -1853
3708 -1853 382 2327 3319 6498 8376 12778 14420 5605 -1797 -2125 2962 5878 8517 6098 1249
3693 1249 528 -1205 -2265 -954 -2530 -2404 -3892 -5988 -3162 -3878 -1957 2618 4543 5223 4630 -1521
3677 -1521 1328 4449 4701 -486 -467 5064 7496 6615 11865 12065 8066 8546 7943 5689 6697 10273 6309
$$ packed form
3786b325K421j203k87N177J297k477P11o94O27R76j932Q88j508K788L939L682
3770A2080n638m252R10J366k089L373k408L745M78n660n963L793J793K207L301
3755G036J682k534n648n593K019m63J527K950M548K293K81j583J727p10L095j493
3739I134k750k68p250l443K686Q33n25j94j101k439K131l10k755P43K961N414
3723B867m90K157L619m806n014k568O477J0188L614m213p030J387l448l010j583
3708a853K235J945R92L179J878M402J642q815p402l28N087K916K639k419m849
3693A249p21j733j060J311j576J26j488k096K826p16J921M575J925O80n93o151
3677a521K849L121K52n187J9N531K432q81N250K00l999M80o03k254J008L576l964
$$ plain form
3660 6309 4072 2884 304 -1246 666 8399 8233 8662 6590 3453 4909 4508 -2351 -8254 -8771 -5743
3644 -5743 -3094 -1725 3607 9593 7217 295 -1711 -1596 -404 -2737 -2557 260 1577 3044 3475 3679
3628 3679 2605 -246 2433 4848 6365 1869 1351 1724 2525 6385 6997 5900 2450 -1217 -291 -4659
3612 -4659 -2457 -462 3299 9462 10554 5047 -4623 -2411 -1918 -2333 -3015 384 -300 4102 7596 4333
3596 4333 1846 4809 7337 2931 4491 1819 60 -1150 -3740 -4454 -3288 -1664 -684 578 -111 -1772
3580 -1772 -5424 -1204 3667 4865 4589 3490 -703 1266 5179 6322 4164 1565 -2339 -1165 2827
3565 2827 4876 5713 6790 7337 3047 6268 6319 2963 8078 8151 9653 10554 11190 9567 6019 574 -2073
3548 -2073 -3645 -4299 -2331 2961 3954 3218 3378 887 -2025 -1264 2626 1562 -4538 -6875 -572 170
$$ packed form
3660F309k237j188k580j550J912P733j66M29k072l137J456m01o859n903n17L028
3644e743K649J369N332N986k376o922k006J15J192k333J80K817J317J467M31K04
3628C679j074k851K679K415J517m496n18L73Q01L860O12j097l450l667R26m368
3612d659K202J995L761O163J092n507r670K212M93m15o82L399o84M402L494l263
3596D333k487K963K528m406J560k672j759j210k590p14J166J624R80J262o89j661
3580a772l652M220M871J198k76j099m193J969L913J143k158k599l904J174L992
3565B827K049Q37J077N47m290L221N1l356N115P3J502R01O36j623l548n445k647
3548b073j572o54J968N292R93p36J60k491k912P61L890j064o100k337O303P42
$$ plain form
3532 170 -5525 -9267 -9612 -5858 -3017 -2456 -3890 -2885 -1794 -2066 -2529 -2316 -366 2299 291 -2095
$$ packed form
3532A70n695l742l45L754K841N61j434J005J091k72m63K13J950K665k008k386
$$ [...]
##END NTUPLES=NMR SPECTRUM
##END=
