##TITLE=Analysis number 307109
Compound Code sb 01802
Project Code adrs
Chemist Name dona-fine
##JCAMPDX= 6.0         $$ Bruker NMR JCAMP-DX V2.0
##DATA TYPE= NMR SPECTRUM
##DATA CLASS= NTUPLES
##ORIGIN= Bruker BioSpin GmbH
##OWNER= NMR
$$ XWIN-NMR		Version 3.5
$$ Wed Apr 20 17:24:09 2005 GMT Daylight Time (UT+1h)  MAYBRIDGE\NMR@NMR_250MHZ
##.OBSERVE FREQUENCY= 250.131544655141
##.OBSERVE NUCLEUS= ^1H
##.ACQUISITION MODE= SIMULTANEOUS (DQD)
##.ACQUISITION SCHEME= undefined
##.AVERAGES= 16
##.DIGITISER RES= 18
##SPECTROMETER/DATA SYSTEM= dpx250
##.PULSE SEQUENCE= zg30
##.SOLVENT NAME= CDCl3
##.SHIFT REFERENCE= (INTERNAL, CDCl3, 0, 16.522)
##AUDIT TRAIL= $$ (NUMBER, WHEN, WHO, WHERE, WHAT)
$$ ##TITLE= Audit trail, XWIN-NMR		Version 3.5
$$ ##JCAMPDX= 5.01
$$ ##ORIGIN= Bruker BioSpin GmbH
$$ ##OWNER= NMR
$$ C:\u/data/dgb/nmr/ADRS/1980/pdata/1/auditp.txt
$$ ##AUDIT TRAIL=  $$ (NUMBER, WHEN, WHO, WHERE, WHAT)
(   1,<2005-04-20 17:23:51.12 +100>,<MAYBRIDGE\NMR>,<NMR_250MHZ>,
      <created by zg, POWCHK disabled, PULCHK disabled
       configuration hash MD5:
       62 19 C7 07 E1 42 D1 B7 37 6C 3D D0 77 39 F9 E6
       data hash MD5: 64K
       EC 4B FE F6 AE CF 0F 2F 67 80 3A 8B AE 4E 25 25>)
(   2,<2005-04-20 17:24:02.60 +100>,<MAYBRIDGE\NMR>,<NMR_250MHZ>,
      <Start of raw data processing
       ef LB = 0.3 FT_mod = 6 PKNL = 1 SI = 32K 
       data hash MD5: 32K
       4E BD 5B 29 60 16 8C EB DF 3A E3 13 96 BE F1 A3>)
(   3,<2005-04-20 17:24:04.24 +100>,<MAYBRIDGE\NMR>,<NMR_250MHZ>,
      <apk 
       data hash MD5: 32K
       9B 35 6E FD 6D 9C E9 25 6C 3B 37 54 CB 05 8D CE>)
(   4,<2005-04-20 17:24:04.96 +100>,<MAYBRIDGE\NMR>,<NMR_250MHZ>,
      <abs ABSG = 5 
       data hash MD5: 32K
       21 B5 90 37 E3 48 2E 1A E9 11 01 6D D1 95 80 EE>)
$$ ##END=
$$ 
$$ hash MD5
$$ 24 C2 F5 19 D0 44 08 F4 8B 82 F7 07 59 72 72 97
##$RELAX= 
##$RELAX= 
##$RELAX= 
##$RELAX= 
##$RELAX= 
##$RELAX= 
##$RELAX= 
$$ Bruker specific parameters
$$ --------------------------
##$DU= <C:\u>
##$EXPNO= 1980
##$NAME= <ADRS>
##$PROCNO= 1
##$TYPE= <nmr>
##$USER= <dgb>
##$AMP= (0..31)
100 100 100 100 100 100 100 100 100 100 100 100 100 100 100 100 100 100 
100 100 100 100 100 100 100 100 100 100 100 100 100 100 
##$AQSEQ= 0
##$AQ_mod= 3
##$AUNM= <au_zg>
##$AUTOPOS= <48 >
##$BF1= 250.13
##$BF2= 250.13
##$BF3= 250.13
##$BF4= 250.13
##$BF5= 500.13
##$BF6= 500.13
##$BF7= 500.13
##$BF8= 500.13
##$BYTORDA= 1
##$CFDGTYP= 0
##$CFRGTYP= 5
##$CHEMSTR= <none>
##$CNST= (0..31)
1 1 145 1 1 1 1 1 1 1 1 1 1 1 1 1 1 1 1 1 1 1 1 1 1 1 1 1 1 1 1 1 
##$CPDPRG= <>
##$CPDPRG1= <>
##$CPDPRG2= <>
##$CPDPRG3= <>
##$CPDPRG4= <mlev>
##$CPDPRG5= <mlev>
##$CPDPRG6= <mlev>
##$CPDPRG7= <mlev>
##$CPDPRG8= <mlev>
##$CPDPRGB= <>
##$CPDPRGT= <>
##$D= (0..31)
0 1 0 0 0 0 0 0 0 0.06 0 0 0 0 0 0 0.0002 0 0 0 0 0 0 0 0 0 0 0 0 0 0 
0 
##$DATE= 1114014230
##$DBL= (0..7)
120 120 120 120 120 120 120 120 
##$DBP= (0..7)
150 150 150 150 150 150 150 150 
##$DBP07= 0
##$DBPNAM0= <>
##$DBPNAM1= <>
##$DBPNAM2= <>
$$ [...]
##$SUBNAM7= <"">
##$SUBNAM8= <"">
##$SUBNAM9= <"">
##$SW= 20.6930455092707
##$SWIBOX= (0..15)
0 0 3 0 0 0 0 0 0 0 0 0 0 0 0 0 
##$SW_h= 5175.983436853
##$TD= 65536
##$TD0= 1
##$TE= 296.16
##$TE2= 300
##$TE3= 300
##$TEG= 300
##$TL= (0..7)
0 120 120 120 120 120 120 120 
##$TP= (0..7)
150 150 150 150 150 150 150 150 
##$TP07= 0
##$TPNAME0= <>
##$TPNAME1= <>
##$TPNAME2= <>
##$TPNAME3= <>
##$TPNAME4= <>
##$TPNAME5= <>
##$TPNAME6= <>
##$TPNAME7= <>
##$TPOAL= (0..7)
0.5 0.5 0.5 0.5 0.5 0.5 0.5 0.5 
##$TPOFFS= (0..7)
0 0 0 0 0 0 0 0 
##$TUNHIN= 0
##$TUNHOUT= 0
##$TUNXOUT= 0
##$USERA1= <user>
##$USERA2= <user>
##$USERA3= <user>
##$USERA4= <user>
##$USERA5= <user>
##$V9= 5
##$VALIST= <valist>
##$VCLIST= <CCCCCCCCCCCCCCC>
##$VD= 0
##$VDLIST= <DDDDDDDDDDDDDDD>
##$VPLIST= <PPPPPPPPPPPPPPP>
##$VTLIST= <TTTTTTTTTTTTTTT>
##$WBST= 1024
##$WBSW= 4
##$XGAIN= (0..3)
0 0 0 0 
##$XL= 0
##$YL= 0
##$YMAX_a= 458884
##$YMIN_a= -434504
##$ZGOPTNS= <>
##$ZL1= 120
##$ZL2= 120
##$ZL3= 120
##$ZL4= 120
##$ABSF1= 16.522
##$ABSF2= -4.171173
##$ABSG= 5
##$ABSL= 3
##$ALPHA= 0
##$AQORDER= 0
##$ASSFAC= 0
##$ASSFACI= 0
##$ASSFACX= 0
##$ASSWID= 0
##$AUNMP= <proc_1d>
##$AZFE= 0.1
##$AZFW= 0.1
##$BCFW= 0
##$BC_mod= 0
##$BYTORDP= 0
##$COROFFS= 0
##$CY= 12.5
##$DATMOD= 1
##$DC= 0
##$DFILT= <>
##$DTYPP= 0
##$F1P= 14.0000005364418
##$F2P= -0.99999901652339
##$FCOR= 0.5
##$FTSIZE= 32768
##$FT_mod= 6
##$GAMMA= 0
##$GB= 0
##$INTBC= 1
##$INTSCL= 1
##$ISEN= 128
##$LB= 0.3
##$LEV0= 0
##$LPBIN= 0
##$MAXI= 10000
##$MC2= 0
##$MEAN= 0
##$ME_mod= 0
##$MI= 0
##$NCOEF= 0
##$NC_proc= -2
##$NLEV= 6
##$NOISF1= 0
##$NOISF2= 0
##$NSP= 0
##$NTH_PI= 0
##$NZP= 0
##$OFFSET= 16.522
##$PC= 1
##$PHC0= 134.2097
##$PHC1= 4.928599
##$PH_mod= 1
##$PKNL= yes
##$PPARMOD= 0
##$PSCAL= 4
##$PSIGN= 0
##$REVERSE= no
##$SF= 250.13
##$SI= 32768
##$SIGF1= 0
##$SIGF2= 0
##$SINO= 400
##$SIOLD= 32768
##$SREGLST= <1H.CDCl3>
##$SSB= 0
##$STSI= 32768
##$STSR= 0
##$SW_p= 5175.98343685301
##$SYMM= 0
##$S_DEV= 0
##$TDeff= 65536
##$TDoff= 0
##$TI= <Analysis number 999999
Compound Code 99
Book Reference 9
Project Code 9>
##$TILT= no
##$TM1= 0
##$TM2= 0
##$TOPLEV= 0
##$USERP1= <user>
##$USERP2= <user>
##$USERP3= <user>
##$USERP4= <user>
##$USERP5= <user>
##$WDW= 1
##$XDIM= 32768
##$YMAX_p= 412048012
##$YMIN_p= -163136
$$ End of Bruker specific parameters
$$ ---------------------------------
##NTUPLES= NMR SPECTRUM
##VAR_NAME=  FREQUENCY,     SPECTRUM/REAL,   SPECTRUM/IMAG
##SYMBOL=    X,             R,               I
##VAR_TYPE=  INDEPENDENT,   DEPENDENT,       DEPENDENT
##VAR_FORM=  AFFN,          ASDF,            ASDF
##VAR_DIM=   32768,         32768,           32768
##UNITS=     HZ,            ARBITRARY UNITS, ARBITRARY UNITS
##FACTOR=    0.157963299565203, 1,           1
##FIRST=     4132.6476996994, 0,             0
##LAST=      -1043.33573715361, 0,           0
##MIN=       -1043.33573715361, -163136,     0
##MAX=       4132.6476996994, 412048012,     0
$$ Real data points
##PAGE= N=1
##DATA TABLE= (X++(R..R)), XYDATA
$$ [...]
16330B491K217j173j752j256r57o56L566J477N8j451j668j421r02J097J033k599
16314a896J308N40k30n86J65Q70N77R76P37J765L56k499k455K869k219k401R78
16297a145J670J610J917J385j565j283p35L64j083N68N88r80N78J629j147P20
16281C091m93K77j851J432K38q69r00J08L74P61p83J382k861j136J015J56J355
16264A296J906J718Q38L22j734k086o75k265J649J105q79K01J67l7O54j284j723
16247h27O46n3K074J589M68p09p80j59m22j267J000J134K583J569o30k56R52R54
16229G866l203k449l421K16J811k86J839m79j850k21J188L356k80j769j993q52
16213e27k05q53l52K026m00j740J803J005K522L86r98k599j552O61q99J391K493
$$ plain form
16330 2491 4708 3535 1783 527 -430 -1086 2480 3957 4015 2564 896 -525 -1427 -330 703 -1896
16314 -1896 -588 -48 -278 -864 -699 171 748 1724 2461 4226 4582 2083 -372 2497 278 -2123 -1145
16297 -1145 525 2135 4052 5437 3872 2589 1854 2218 1135 1703 2291 1311 1889 3518 2371 3091
16281 3091 2598 2875 1024 2456 2694 1825 925 1033 1407 2168 1385 2767 -94 -1230 -215 -59 1296
16264 1296 3202 4920 5758 6080 4346 2260 1585 -680 969 2074 1195 1396 1563 1526 2180 896 -827
16247 -827 -181 -234 1840 3429 3897 3188 2408 2249 1827 560 1560 2694 5277 6846 6216 5960 6912 7866
16229 7866 4663 2214 -1207 -991 820 534 2373 1894 44 -177 1011 4367 4087 2318 325 -527
16213 -527 -732 -1585 -1937 89 -311 -2051 -248 757 3279 3665 2667 68 -1484 -823 -1722 -331 2162
16196B162j859j278P37j194L73n16k33Q85K038P74O30j097l239j069K380J328
16180H22J763L92J59k0N44K212k202k299Q4K335k65j640p51Q12N99J510j300j337
16162A418j668j631L7J098R90j416K764N82j490r40K24J787k385J931R60j158
16146A103q67M78R9k22l405o5L633L623j169k931j579K356R05q51j804l71J143
16129G6N26m63J089J835J83j7J11j267Q08j923j96j884l025J25L143Q97n24p45
16111a251r81P15J308m73j64K022J210l22j332j555j66p60q67K136J343J648K
16094B513k65J047k34l83j811j418O87J026J84q8L83N48Q78K314j876l079m62
16077c6J00o97q42n35J036J099j989N73K996J505l5l040j608K291K59O02LK545
$$ plain form
16196 2162 303 -975 -238 -1432 -1059 -1575 -1808 -923 1115 1889 2519 1422 -1817 -2886 -506 822
16180 822 2585 2977 3136 3116 3660 5872 3670 1371 1455 3790 3525 1885 1134 1946 2545 4055 2755 1418
16162 1418 -250 -1881 -1844 -746 244 -1172 1592 2174 684 -256 -32 1755 -630 1301 2261 1103
16146 1103 236 714 813 591 -2814 -2879 754 4377 3208 277 -1302 1054 1959 1108 -696 -1067 76
16129 76 602 139 1228 3063 3246 3229 3340 2073 2881 958 762 -1122 -4147 -4022 -879 18 -506 -1251
16111 -1251 -2232 -1517 -209 -682 -846 1176 2386 2064 732 -823 -989 -1749 -2616 -480 863 2511 2513
16094 2513 2248 3295 3061 2678 867 -551 136 1162 1346 1258 1641 2189 3067 5381 3505 426 -36
16077 -36 64 -633 -1475 -2010 -974 125 -1864 -1291 1705 3210 3175 135 -1473 818 1077 1679 1682 4227
16059D227n28j841j737K081N58q6j937j796o18M10P8J805k74J617Q96q50j350
16042F55k740L31K537J095L34J763q47j161L64J081j702n2N93J151M32q40N08
16025C502M46q50j388j924J97m4j247j07J99J480j702K294P88p96K14J756j280
16008A538K58J682k751l114L634M242j000Q34j23o38p23j865J31k347j201L564
15992B121O52j179q90l226R59m12K073K894J214J711q10j022j021k317j754j948
15976b955k408q87j801J995L289Q11J968n55K166k65J707j492k338j043o72J264
15960a216L484o40l216K71L0j063j5J313k68J060K91J828j042j732r55Q36J122
15943H8J776K187J488O81J51j40P07p71r72j736j904Q64N79k18o07J668O19P02
$$ plain form
16059 4227 3699 1858 121 2202 2760 2674 737 -1059 -1677 -1267 -1189 616 342 1959 2855 2005 655
16042 655 -2085 -1754 783 1878 2212 3975 3128 1967 2331 3412 1710 1658 2251 3402 3834 2994 3502
16025 3502 3948 3098 1710 -214 -17 -61 -1308 -1415 -1216 264 -1438 856 1644 848 1062 2818 1538
16008 1538 1796 3478 727 -2387 1247 5489 4489 5323 5200 4562 3839 1974 2105 -242 -1443 2121
15992 2121 2773 1594 704 -2522 -1563 -1975 98 2992 4206 5917 5107 4085 3064 747 -1007 -2955
15976 -2955 -5363 -6250 -8051 -6056 -2767 -1956 12 -543 1623 1358 3065 1573 -765 -1808 -2480 -1216
15960 -1216 2268 1628 -1588 -1317 -1287 -2350 -2365 -1052 -1320 -260 31 1859 817 -915 -1870 -1034 88
15943 88 1864 4051 5539 6220 6371 6231 6938 6167 5195 3459 1555 2419 2998 2780 2173 3841 4460 5162
15925E162K91j204r0J419k81j842k428j132r04J613J200Q3r91j193K031J278M37
15908C449k059l97J50k385M20K243J843J917q76q61j812j729M52J886N01k83m96
15891A963k205r1J739J499k157j695K363J197o99l46j180j80J756n10j359J972
15875B067M35J36j904j568N56j63M50J503J324k095N04lj318k251o26J253J644
15858e6j250l06L653J611n84K06M79j52N27j307k857l78K794J737q16n4L72L33
15840C952j803K8j14m60k355j655O53N33j546o30K671k28j069q51K387nK80R49
15822G37j034j021p0J680k10l54K268R61O0k603K23j512k057l64J365M48j386
15805b869q17k38J497K1l59O41K211j901K090K513j220j502o58j042J514J134
$$ plain form
15925 5162 5453 4249 4159 5578 5297 3455 1027 -105 -1009 604 1804 1887 896 -297 1734 3012 3449
15908 3449 1390 993 1143 -1242 -822 1421 3264 5181 4305 3444 1632 -97 355 2241 2742 2459 1963
15891 1963 -242 -333 1406 2905 748 -947 1416 2613 1914 1568 388 208 1964 1454 95 2067
15875 2067 2502 2638 734 -834 -278 -441 9 1512 2836 741 1245 1242 -76 -2327 -2953 -1700 -56
15858 -56 -1306 -1612 2041 3652 3068 3274 3753 3601 4128 2821 -36 -414 2380 4117 3301 3247 3619 3952
15840 3952 2149 2177 2063 1603 -752 -2407 -1754 -1221 -2767 -3397 -726 -954 -2023 -2874 -487 -492 -212 737
15822 737 -297 -1318 -1388 292 82 -272 1996 2957 3017 414 637 -875 -2932 -3296 -1931 -1483 -2869
15805 -2869 -3686 -3924 -2427 -2406 -2765 -2124 87 -1814 276 2789 1569 67 -591 -1633 -119 1015
15789A015o61R98m76j651N23J474J619L32k735p77j788o40J318J04j41K917J976
15772C407j859j370J92J170R46k35q49k684J148M235K587q25j038j962L07J282
15756D452k75k129j429J668O00k42K31j679k16J588j366j559o8k14p08J319K557
15739B530P26p51k50m13L86o35j30L120j44l951k1n09q73J180R0m5M58j576l94
15720a202l31J25O83J636j032o72m81K69N55j23j630q38k519K416K494J977K044
15703C371o50k307J79J902R46j111j853l031m38P23M24r59K991J714l79j009K86
15686G99k1J460o94l719k17J101l67J448Q14q63k333p59J237K129J13K12O33k343
15668a370p85K991J080r20J631R04k208j874n47O77J334J37J164j57R14J652Q83
$$ plain form
15789 1015 354 1352 876 -775 -252 1222 2841 3173 438 -339 -2127 -2767 -1449 -1345 -1486 1431 3407
15772 3407 1548 178 370 1540 2486 2251 1402 -1282 -134 4101 6688 5863 4825 2863 3170 4452
15756 4452 4177 2048 619 2287 2887 2645 2876 1197 981 2569 1203 -356 -424 -638 -1346 -27 2530
15739 2530 3256 2505 2255 1842 2228 1593 1463 4583 4439 488 467 -42 -915 265 355 310 768 -808 -1202
15720 -1202 -1533 -1408 -725 911 -121 -793 -1274 -1005 -450 -573 -2203 -3041 -5560 -3144 -650 1327 3371
15703 3371 2721 414 593 2495 3441 2330 477 -2554 -2992 -2269 -1845 -2804 187 1901 1522 513 799
15686 799 778 2238 1544 -2175 -2392 -1291 -1658 -210 604 -259 -2592 -3351 -2114 15 128 340 973 -1370
15668 -1370 -2155 836 1916 996 2627 3531 1323 -551 -1098 -421 913 1050 2214 2057 2971 4623 5506
15651E506k045R93j929l542P24L26k499P89k59l71P64J90l49j411q13R97K665
15634b64p30O64q56l18n0K199J610j698L507J897n07o40p55k494n83L85J208K81
15616B856j999j86J580p40j889j382r40j522J14J518l37j21L68J95J087Q47N41
15599a0m01N00J594n88l337r71J93K427r39J053J864L58k041j089K475q98j791
15582a601P18j071p21J067J70J44J686Q01j877k46j369j387J856M625j158j512
15566A25O08p5j1j891k05J981J064q16q5P18K405o68m083J914O60r56o20P60l40
15547D85q32j354J640J262L196l99j374j030j476k246j577k31J922K126J820Q46
15531B778q34k16q39R26J175J150J45K253M58k170j008q12K84j016j41k540q47
$$ plain form
15651 5506 3461 4454 2525 -1017 -293 33 -2466 -1677 -1936 -2307 -1543 -1353 -1702 -3113 -3926 -2929 -264
15634 -264 -994 -330 -1186 -1504 -1554 645 2255 557 4064 5961 5454 4814 4059 1565 982 1367 2575 2856
15616 2856 857 671 2251 1511 -378 -1760 -2700 -4222 -4108 -2590 -2927 -3048 -2680 -2485 -1398 -551 -10
15599 -10 -411 89 1683 1095 -2242 -3213 -3020 -593 -1532 -479 1385 1743 -298 -1387 1088 190 -1601
15582 -1601 -883 -1954 -2675 -1608 -1438 -1294 392 1193 -684 -930 -2299 -3686 -1830 2795 1637 125
15566 125 733 658 647 -1244 -1449 532 1596 780 695 1413 3818 3150 -933 981 1641 685 65 825 485
15547 485 -347 -1701 -61 1201 4397 3998 2624 1594 118 -2128 -3705 -3936 -2014 112 1932 2778
15531 2778 1944 1728 889 1815 2990 4140 4285 6538 6996 4826 3818 3006 3290 2274 2133 -407 -1254
15514a254P54J86n69m21K968J997q67j465j517K46K00j22J905m12j532m04m02
15497g09r44j360Q18R94p48L784L902q42k983j222o40P61Q98r97j96P55N26J737
15479C534j003j314J76l33K114k0O79k334N37N67m374j522J306q95o26J309J300
15462h99R7m22J666K137q52J29j777N88R9j170K207J867k285m98j288J20J084
15445H03J551k038R45J474K33k209k330j581l83K048J237j012j001L51m32j592
15429c936k47j824J616L287J084K305K524j42k1r91O28M20j936l310j030N27J124
15412G8q21MJ389m90O76K321L17j071m036j424L764K611j308l061j420j74L193
15395E48J091j306j34K129P90j267K300J324l60j119k290j066o90j188j114k51
$$ plain form
15514 -1254 -500 -314 -883 -1304 1664 3661 2794 1329 -188 58 258 136 2041 1629 97 -307 -709
15497 -709 -1653 -3013 -2195 -1201 -1949 1835 5737 4895 1912 690 50 811 1709 712 516 1271 1797 3534
15479 3534 2531 1217 1393 1060 3174 3154 3833 1499 2036 2603 -1771 -3293 -1987 -2882 -3508 -2199 -899
15462 -899 -802 -1224 442 2579 1727 1856 79 667 766 -404 1803 3670 1385 887 -401 -281 803
15445 803 2354 316 1261 2735 2968 759 -1571 -3152 -3535 -1487 -250 -1262 -2263 -1912 -2344 -3936
15429 -3936 -4183 -6007 -4391 -1104 -20 2285 4809 4667 4646 3655 4283 4703 2767 -543 -1573 -1046 78
15412 78 -743 -739 650 160 836 3157 3474 2403 -1633 -3057 707 3318 2010 -1051 -2471 -2645 548
15395 548 1639 333 199 2328 3118 1851 4151 5475 5115 3996 1706 640 -50 -1238 -2352 -2603
15379b603K654O99M81J491o55j136R0p54J151K519J715j278j35R8k09k191r34
15362A003R6r04N77q11j863N76k29L01K241K029p07P61l17j012N37J480j45q04
15344B809j030M4J270q04j322L29K305j71j578J814J352m039k59J571j127k805
15328a641j825Q06J845j167N10J992j901j766J36J255J002k156k585J719M275
15313D99J917M18j668n49J260M09k832O3k216K91J749J111L55j11Q66J77j74q37
15295G28P90J467J302J16q85j007R43L077j282l63j613j992l864r21O46L01J159
15278a398J880O66q03M75l7l087k121r79K275L93O94K124j746l422J259J44J818
15261a865p1r9J411N41m18k303R25K778R69N66k12Q77L03k744j174N16L19K470
$$ plain form
15379 -2603 51 750 1231 2722 2067 931 1021 267 1418 3937 5652 4374 4239 4337 4128 1937 1003
15362 1003 1099 195 772 -39 -1902 -1326 -1555 -1254 987 3016 2309 3070 2753 1741 2278 3758 3613 2809
15344 2809 1779 1823 3093 2289 967 1296 3601 3430 1852 3666 5018 979 720 2291 1164 -1641
15328 -1641 -3466 -2660 -815 -1982 -1472 520 -1381 -3147 -3011 -1756 -754 -2910 -5495 -3776 499
15313 499 2416 2834 1166 617 1877 2286 -546 -483 -2699 -2408 -659 452 807 696 1562 1739 1565 728
15295 728 1518 2985 4287 4403 3518 2511 3454 6531 5249 4886 3273 1281 -2583 -3504 -2858 -2557 -1398
15278 -1398 482 1148 345 820 783 -2304 -4425 -5404 -3129 -2736 -2042 82 -1664 -5086 -3827 -3683 -1865
15261 -1865 -1936 -2035 -624 -83 -501 -2804 -1879 899 1868 2434 2222 3099 3402 658 -516 0 319 2789
15243B789j208l346j05j95P43K778j164k198K582R05j195j304J285K595R39R46
15227D847N42k261j48M96O68J366j832j730j608J379j910k123R60J825j781m52
15211a762j867Q14K503j227j402L789J109j669j135k452K86N1K471L445J768m18
15195D304k383L12L09j069j874M25J338N24K000j87K583q3p78l373k518K07O2
15178b01j809j101j080J039P16J005Q16P03K05k657Q20J742J450N38j705j229
15162g48J49K383j004N25J170k302O5J386m2r71J401r52j522J35J83K240p65r09
15144D22p89m188Q64R36J222N13J030Q46J54j717J047m85l88J745N49q94L6n39
15126C64m97R86m46O53m4k473J742j642k054Q18K038K240j531j884q60J900M16
$$ plain form
15243 2789 1581 -1765 -1870 -2065 -1322 1456 292 -1906 676 1581 386 -918 367 2962 3901 4847
15227 4847 5389 3128 2980 3476 4144 5510 3678 1948 340 1719 -191 -2314 -1354 471 -1310 -1762
15211 -1762 -3629 -2815 -312 -1539 -2941 848 1957 288 -847 -3299 -3013 -2962 -491 2954 4722 4304
15195 4304 1921 2233 2542 1473 -401 24 1362 1886 3886 3699 6282 6199 5421 2048 -470 -263 -201
15178 -201 -2010 -3111 -4191 -3152 -2436 -1431 -615 88 293 -2364 -1544 198 1648 2186 481 -748
15162 -748 -599 1784 780 1305 2475 173 238 1624 1582 611 2012 1060 -462 -327 -144 2096 1331 422
15144 422 -367 -4555 -3691 -2755 -1533 -1020 10 856 1010 -707 340 -145 -533 1212 1761 867 903 364
15126 364 -133 853 407 1060 1016 -1457 285 -1357 -3411 -2593 -555 1685 154 -1730 -2590 -690 -274
15109b74J678o09n48J242j212k478J182J659J576k69J385J24j917r98M48O80N76
15092B245k117r46J058L039o6j484j836L78o17J998m73J574k653q28j244j845
15076c817j16K068J24j528K129k13p29J164K258M25j63J230j040k347o07O06J046
15059D90l27Q61Q27Q12j36r01k485Q08O41o90r14j049m62J275J30k113L114K946
15041B827P13q00j575r08k27k40j434j718J098O63J193K803k013j195p74J433
15025a54j522j135O77P40J262Q89J591n97k08j29L40j581p83J082r40j460j897
15008c825J894j189K783M621R78j323n74N79j872j024q34J157J52j878j701k025
14992d081K72J668K494L048K600J747j777m82M13j995j055J765J121M84o4j040
$$ plain form
15109 -274 1404 795 247 1489 277 -2201 -1019 640 2216 1947 3332 3456 1539 541 989 1669 2245
15092 2245 128 -818 240 3279 3213 1729 -107 271 -346 1652 1179 2753 100 -728 -1972 -3817
15076 -3817 -3933 -1865 -1741 -3269 -1140 -1353 -2082 -918 1340 1765 1602 2832 1792 -555 -1162 -556 490
15059 490 163 1024 1851 2663 2527 1626 -859 -51 590 -100 -1014 -2063 -2525 -1250 -1120 -3233 -119 2827
15041 2827 3540 2740 1165 257 30 -210 -1644 -3362 -2264 -1601 -408 2395 382 -813 -1587 -154
15025 -154 -1676 -2811 -2134 -1394 -132 757 2348 1751 1543 1414 1754 173 -610 472 -468 -1928 -3825
15008 -3825 -1931 -3120 -337 4284 5262 3939 3365 3944 2072 1048 214 1371 1523 -355 -2056 -4081
14992 -4081 -3809 -2141 353 3401 6001 7748 5971 5489 5902 3907 2852 4617 5738 6222 6158 5118
14976E118l226J68p24Ql85J140l48o3L026L133j613k141K27j194j990j55j248
14959b67j732J776K29N89R05j271R46Q84J29N7J346j196O17k208j681N97J049
14942G69p48o25O73K796j232l145l55J515J330l87m59j46J294Q12J50r40j04L02
14924A500L9j332K024J38j724j447R81J48J25k1j082K542J418j370k270k155p14
14907c200J255J490K473P42J103P37m350k454J414J150J150J006k92j814Q83J331
14891B624k379L3J17j868k082J398p5j74J44J602J083L37J70O60j440l229l63
14874c442J505L24K196K118O77j737j431p97k006R80K448J162K92q52j52j476
14858a91p33o71K399j193k034j717P85J496K748O36K58J394P77N10k091j644M72
$$ plain form
14976 5118 1892 2060 1336 1344 959 2099 1751 1688 4714 7847 6234 4093 4320 3126 1136 981 -267
14959 -267 -1999 -223 6 595 1500 229 1175 2059 2188 2245 3591 2395 3012 804 -877 -280 769
14942 769 21 -604 69 2865 1633 -1512 -1867 -352 978 591 132 -14 1280 2092 2242 1302 1198 1500
14924 1500 1539 207 2231 2369 645 -802 179 327 452 431 -651 1891 3309 1939 -331 -2486 -3200
14907 -3200 -1945 -455 2018 2760 3863 4600 250 -2204 -790 360 1510 2516 2224 410 1293 2624
14891 2624 245 278 395 -1473 -3555 -2157 -2232 -2406 -2262 -660 423 760 930 1590 150 -3079 -3442
14874 -3442 -1937 -1613 583 2701 3378 1641 210 -587 -2593 -1613 835 1997 2289 1437 1285 -191
14858 -191 -924 -1595 804 -389 -2423 -4140 -3355 -1859 889 1525 1783 3177 3954 4464 2373 729 1201
14841A201N55q56j928j641O97K5j59L67k47l007q33K207J021K016k57n03Q85m16
14823h73l63j190j607j109J100J930Q61k34J521P20R69J180m61r97J4j548N58
14806D71L38q74n43Q27M00Q99K735J84q03l723j947J80K04j194P27K170J122p25
14788D48j604P84J19K447j274j977j51K127K85j445R68K57P18k79k60j213J172
14771A122J49j002L21J460j621j642j017J451J621j78m38R38J843k027j178J395
14755A197M75p4j585k22j176j960r15R86Q24K089j571k621o31L054K209K478J39
14738B696k63p21J135j536j314j463Mr06O56J716J312r69l98J065J764n15J42
14721B405J07j16l691j339J217m16o55k0N62r8N85P70j485q44K555Q77j208J67
$$ plain form
14841 1201 1756 900 -1028 -2669 -1972 -1947 -2106 -1739 -1986 -4993 -5826 -3619 -2598 -582 -839 -1342 -457 -873
14823 -873 -1236 -2426 -4033 -5142 -4042 -2112 -1251 -1485 36 756 1725 2905 2444 1447 1461 -87 471
14806 471 809 -65 -608 219 619 1518 4253 4437 3634 -89 -2036 -1856 -1652 -2846 -2119 51 1173 448
14788 448 -1156 -372 -253 2194 920 -1057 -1208 919 1204 -241 727 984 1702 1423 1163 -50 1122
14771 1122 1271 269 590 2050 429 -1213 -2230 -779 842 664 226 1164 3007 980 -198 1197
14755 1197 1672 1598 13 -209 -1385 -3345 -4260 -3274 -2450 -361 -1932 -4553 -5184 -2130 79 2557 2696
14738 2696 2433 1712 2847 1311 -3 -1466 -1462 -2368 -1712 4 1316 347 -51 1014 2778 2263 2405
14721 2405 2512 2396 -1295 -2634 -1417 -1833 -2488 -2508 -1946 -2044 -1459 -689 -2174 -3018 -463 414 -794 -627
14703f27M04J719j522l583J215K927p46M21j585J105R44j22k248J620Q51j960
14687a187K93K599P51K782r44j979j043J047rM57Q26j255k040m01J092p92O31
14670H28K022R29j59l48k673l016J387K176J167L36n1j017j70k363k166Q33J394
14653h91J903j053n94J57M09o10J045K52J944q37l10k61o42P92j901m40J808J191
14635A962j44k195n30O4J597l184j315N064m88k649j194r64p78J286k76J838K04
14618a702j95K632J867K322n60k796j711l634n69N02K51n15m32Q74M776K46l418
14601b062j340J895K671k780k130N28J442O09j291k301K400K452N28K12K106j34
14585B805j331j200k909N12Q92k027P67J181N30J281k3l56p5l65j84n76J37J456
$$ plain form
14703 -627 -223 1496 -26 -3609 -2394 533 -213 208 -1377 -272 672 550 -1698 -78 773 -1187
14687 -1187 -894 1705 2456 5238 4294 2315 1272 2319 2310 2767 3593 2338 298 -103 989 197 828
14670 828 2850 3779 3620 3272 599 -2417 -1030 1146 2313 2649 2598 1581 1411 -952 -3118 -2285 -891
14653 -891 1012 -41 -635 -478 -69 -679 366 618 2562 1725 1415 1154 512 1304 -597 -1037 771 1962
14635 1962 1818 -377 -907 -843 754 -2430 -3745 1319 831 -1818 -3012 -3976 -4754 -3468 -3744 -1906 -1702
14618 -1702 -1897 735 2602 4924 4364 1568 -143 -3777 -4346 -3844 -3593 -4108 -4540 -3666 1110 1356 -2062
14601 -2062 -3402 -1507 1164 -1616 -3746 -3218 -1776 -1167 -2458 -4759 -2359 93 621 833 2939 2805
14585 2805 1474 274 -2635 -2123 -1231 -3258 -2491 -1310 -780 501 478 122 47 -318 -502 -1078 -941 515
14567E15K751m53j237r7j604k191J213J263J321M90j34j532j091R21J957p81j450
14550a39m25K074p25j824J067m77o61p42k381m79L527q04M01k302l28K679K028
14533D89M41k372j387K190R17l70r20R9J518O11M68k472j379L8J509J48J069k412
14515a815j07p04j005K495J430L078L7k513k256P36Q49J919Q57j677N75p54j782
14498f37k175K233M1n65N19J235R11K44q61j503k69J508K93j65k344J877N19j719
14480h58Q68P57r19o96l88l27N92o98p8j983o38J730K586P67q31k590M84K198
14462b4O07p84j339o60N32Q14j502j582K93L811J71O40k49j397J65J641J70j078
14444B29J94q85k330l16O08j06K048J645l154j858K230L664k098j101L17l46j145
$$ plain form
14567 515 3266 2813 1576 1479 -125 -2316 -1103 160 1481 1971 1837 305 -786 135 2092 1311 -139
14550 -139 -564 1510 785 -1039 28 -449 -1110 -1852 -4233 -4712 -1185 -1989 -1588 -3890 -4218 -1539 489
14533 489 930 -1442 -2829 -639 278 -92 -1012 -913 605 1216 1684 -788 -2167 -2129 -620 -472 597 -1815
14515 -1815 -1922 -2626 -3631 -1136 294 3372 3409 896 -1360 -624 225 2144 3001 1324 1899 1145 -637
14498 -637 -2812 -579 -538 -1103 -584 651 1562 1806 945 -558 -827 681 974 809 -1535 342 861 -858
14480 -858 10 767 -152 -848 -1236 -1563 -971 -1669 -1747 -3730 -4368 -2638 -52 715 -116 -2706 -2222 -24
14462 -24 583 -201 -1540 -2200 -1668 -854 -2356 -3938 -3645 166 337 977 728 -669 -504 1137 1307 229
14444 229 423 -462 -2792 -3108 -2500 -2606 -558 1087 -2067 -3925 -1695 1969 -129 -1230 -913 -1259 -2404
14427b404P73J416J691P2j941j886j043Q44J743R72K01N27k1j493p80L6J018J237
14409I62K488k238j517j004o45j374K765L252J129R57j716k461j845j433j242
14394c922J268j07K1j401k324O23O70J508o1L09J507N70M244o7k674k666J222
14377a280j316n98k12J78Q55Q38J397O34K428J334m63k183j84j491k363J348K079
14360A001k82r61j534L152l08J338K086j012j144j803j335M08J255o49Q43J554
14344B609k824J72l57n41N30K6J32p71O66j23J465k21O52n69J428J219j272l536
14326a315j222Q78M403K080O48k80j729j405o0j66k043K44j53o20J102J165j209
14309C18j713j096m18K320L49L57j057k83K550J920M56o80p62j358j03P13J863
$$ plain form
14427 -2404 -1631 -215 1476 1548 -393 -2279 -3322 -2478 -735 237 438 965 944 -549 -1329 -1293 -275 962
14409 962 3450 1212 -305 -1309 -1954 -3328 -563 2689 3818 4775 3059 598 -1247 -2680 -3922
14394 -3922 -2654 -2761 -2740 -4141 -6465 -5842 -5172 -3664 -3725 -3416 -1909 -1339 2905 2838 164 -2502 -1280
14377 -1280 -2596 -3194 -3406 -3228 -2373 -1535 -138 496 2924 4258 3795 1612 1428 -63 -2426 -1078 1001
14360 1001 719 -242 -1776 1376 1068 2406 4492 3480 2336 533 -802 -394 861 212 1055 2609
14344 2609 -215 -43 -400 -941 -411 -385 -253 -1024 -358 -481 984 763 1415 846 2274 3493 2221 -1315
14326 -1315 -2537 -1659 2744 4824 5472 5192 3463 2058 1998 1832 -211 33 -120 -740 362 1527 318
14309 318 -1395 -2491 -2909 -589 -240 117 -940 -1223 1327 3247 3703 3023 2261 903 800 1513 3376
14292C376M16k297p43O62m75j921o92J842m24j449J043J269k063q07J50m21j538
14275d072j403J71J125n56j430J618L846L206j686l681J387K618k106j247M52
14260a758M24N9m89R0K551J378k015j223J00K90N10K101J839j212M72K017j240
14243C894p52j802o59Q36J132j226j479N73O58j201j142m91K114m48k225m49J924
14226g43J371l65J872J86l026j396o0l466o04K431M093J475q77Jm80K415K29m93
14208B563k03J33j804n59k948k800J435J374J269J238j07k94J33j243L24j300
14192b789n19J516j271j709J595N34J674K037j622j109k48j398J339N84J37K230
14176I81Q50l85j176r86q87m52P93M4p56J995M3k6R87N88K96o98l895N33N59L55
$$ plain form
14292 3376 3792 1495 752 1414 939 -982 -1674 168 -256 -1705 -662 607 -1456 -2263 -2113 -2534 -4072
14275 -4072 -5475 -5304 -4179 -4735 -6165 -4547 -701 2505 819 -2862 -1475 1143 -963 -2210 -1758
14260 -1758 -1334 -1275 -1764 -1674 877 2255 240 -983 -883 -593 -83 2018 3857 2645 3117 5134 3894
14243 3894 3142 1340 681 1517 2649 1423 -56 517 1175 -26 -1168 -1659 455 7 -2218 -2667 -743
14226 -743 628 263 2135 2321 -705 -2101 -2161 -5627 -6231 -3800 293 1768 891 892 412 2827 3056 2563
14208 2563 2360 2493 689 130 -2818 -5618 -4183 -2809 -1540 -302 -409 -703 -570 -1813 -1489 -2789
14192 -2789 -3308 -1792 -3063 -4772 -3177 -2643 -969 1068 -554 -1663 -1911 -3309 -1970 -1386 -1249 981
14176 981 1831 1446 270 -716 -1603 -2055 -1262 -1218 -1974 21 64 38 1025 1613 1909 1211 -2684 -2151 -1592 -1237
14156a237J562J294j894j24j204j192Q32m49J574O10l80K221K7j521j225j447
14140b553o43K878J353k905R22j09j21N18k166N71J04q4j617K859ll64J721N09
14122H70k872j228J036j15R73j38j779N71K518j809r0l90j33J041L2L87k092j99
14104c417Q14O22o89o03j635k967J373M06K034K023L54J876k165j66n42l85J284
14087a783J526J36K48l12j780o94J59j446P59J361l69j573J268J369m27q11J316
14070a053J570M56K059K644O83l854k877R60J064j733j463P19K89k375J80J449
14054a282m1J280K301m81r38m1J052J132j222p82R88J369k769m073P11K312K956
14037B472R53K56k171O72R64j733J115J501O78r89j282k157m60j214n58j721J691
$$ plain form
14156 -1237 325 1619 -275 -399 -1603 -2795 -1963 -2412 -838 -228 -608 1613 1640 119 -1106 -2553
14140 -2553 -3196 -318 1035 -1870 -948 -1057 -1178 -660 -2826 -2255 -2151 -2235 -3852 -993 -996 -1360 361 870
14122 870 -2002 -3230 -2194 -2309 -1336 -1474 -3253 -2682 -164 -1973 -2063 -2453 -2586 -1545 -1513 -1126 -3218 -3417
14104 -3417 -2603 -1981 -2670 -3273 -4908 -7875 -6502 -6096 -4062 -2039 -1685 191 -1974 -2140 -2682 -3067 -1783
14087 -1783 -257 -121 127 -185 -1965 -2659 -2500 -3946 -3187 -1826 -2195 -3768 -2500 -1131 -1558 -2369 -1053
14070 -1053 517 973 3032 5676 6359 2505 -372 588 1652 -81 -1544 -825 -536 -2911 -2731 -1282
14054 -1282 -1323 -43 2258 1777 839 798 1850 2982 1760 978 1966 3335 566 -3507 -2796 -484 2472
14037 2472 3425 3681 1510 2182 3146 1413 2528 4029 4707 3718 2436 279 -181 -1395 -1953 -3674 -1983
14020a983K434Q40q35j406o47j136R56J074r17O62p70j669q98J509N98K310k035
14003a913j162j710o70J244K50J08P28P60J315K268K92p06J087n77l091K72K081
13986E76j98m92m25n17L56J918j605l471J910J573j014J178l4j387k126K317j99
13969a640K21j238K49P27l041k636K398J523J356M010J23m56j389L7L21P35J018
13952B318o71O2k72j153L25J990J827M74k124k521Q68K43l814j929K160J989o30
13935h58L76P07J017N03l4o14j916J201M76J251N33k951k041K677J084k040J371
13918G42N97k81N97O0k71p21j043k918j054K47K519L017j768k224M74R43j425
13901b509n02K169K60J541M45n85O83r02j185k11r28k220J873j55j966M6J188
$$ plain form
14020 -1983 451 1291 456 -950 -1597 -2733 -1777 -703 -1620 -958 -1728 -3397 -4295 -2786 -2188 122 -1913
14003 -1913 -3075 -4785 -5455 -4211 -3961 -3853 -3125 -2365 -1050 1218 1510 804 1891 1314 -1777 -1505 576
13986 576 378 -114 -539 -1056 -700 1218 -387 -3858 -1948 -375 -1389 -211 -245 -1632 -3758 -1441 -1640
13969 -1640 -1419 -2657 -2408 -1681 -4722 -7358 -4960 -3437 -2081 1929 2052 1596 207 244 565 1300 2318
13952 2318 1647 1709 1437 284 609 2599 4426 4900 2776 255 1123 1366 -2448 -4377 -2217 -228 -858
13935 -858 -482 225 1242 1745 1711 1097 -819 382 858 2109 2642 -309 -2350 327 1411 -629 742
13918 742 1339 1058 1655 1715 1444 723 -320 -3238 -4292 -4045 -1526 1491 -277 -2501 -2027 -1084 -2509
13901 -2509 -3011 -842 -582 959 1404 819 1502 600 -585 -796 -1724 -3944 -2071 -2226 -4192 -4146 -2958
13884b958J002o41Q06J245j026l27q4r16l70n82J124J316N76k057n58K12J204
13867b034K460p90n91P76j083j290n88J674J471J132q59l3P88k354l428j465j656
13850g870K488L128J590J30n71R59J382k021p85l13j653J356p73K387N4P4O95
13833B57Q39j042q42k77K38j603J456J995l009q43J222j9j174J880J085J600P22
13816B485k335k474j207J288J878l25q05l28j956m51M58K12Q82l56J032o40J154
13799a488p5q82M29j522k150l454L574M108K662j627k473j168J660O72M03R82
13783c49M41K17j135M59J049k494j48J053K066n51j039K40j292J590P15j533j793
13766b504o69O41J65r99L69j483J413J097k00K991l29L44J24k2m78J177l66j630
$$ plain form
13884 -2958 -1956 -2597 -1791 -546 -1572 -1899 -1983 -2899 -3269 -3851 -2727 -1411 -835 -2892 -3450 -3238 -2034
13867 -2034 426 -364 -955 -179 -1262 -2552 -3140 -1466 5 1137 278 245 1033 -1321 -4749 -6214 -7870
13850 -7870 -5382 -2254 -664 -534 -1105 -146 1236 -785 -1570 -1883 -3536 -2180 -2953 -566 -512 -438 257
13833 257 1096 54 -788 -1065 -827 -2430 -974 1021 -1988 -2831 -1609 -1628 -2802 -922 163 1763 2485
13816 2485 150 -2324 -3531 -2243 -365 -690 -1495 -1823 -3779 -4230 -3772 -3560 -2678 -3034 -2002 -2642 -1488
13799 -1488 -1563 -2445 -2016 -3538 -5688 -9142 -5568 -1460 1202 -425 -2898 -4066 -2406 -1734 -1331 -349
13783 -349 92 309 -826 -367 682 -1812 -1960 -907 1159 608 -431 -191 -1483 107 822 -711 -2504
13766 -2504 -3173 -2532 -2367 -3366 -2997 -4480 -3067 -1970 -2170 821 492 836 960 938 460 1637 1271 -359
13748c59j987p45J653J057N89M11n3k056o41N76J084J459K290k123l151Q79L969
13731B852M86j26J317J769p48j648J2k871k865J701J129J727l29m71j975j60j466
13714a666N22L101k97K77o27j328j77j141M83O61j673l81M59R2K117Q42j437k556
13696b729J896L75R7k277M2J523L62J567R92k54k909p60O11j795M81J405L001
13679A628O07k39j007k385p35J19k06p73j731o5p15p94j149L075J817k74J751
13662a076p52N23J153J755J334L36j001j120l03M6k159K696J543j424k004L32
13646a21O07J100N0q30M1q15J194j587k332j597J133j710M78L648L116L10k638
13629D7m68j40j250J747j011j308K326q5q68J928J050k518N31J086j647r09l369
$$ plain form
13748 -359 -2346 -3091 -1438 -381 208 619 566 -1490 -2131 -1555 -471 988 3278 1155 -1996 -1117 2852
13731 2852 3338 3212 4529 6298 5550 3902 3914 1043 -1822 -121 1008 2735 2406 1935 -40 -200 -1666
13714 -1666 -1144 1957 1660 1937 1310 -18 -195 -1336 -853 -192 -1865 -2246 -1787 -1695 422 1264 -173 -2729
13696 -2729 -833 -458 -361 -2638 -2596 -1073 -711 856 1848 1594 -1315 -2075 -1464 -3259 -2778 -1373 1628
13679 1628 2235 1996 989 -1396 -2131 -2012 -2218 -2991 -4722 -4787 -5502 -6296 -7445 -4370 -2553 -2827 -1076
13662 -1076 -1828 -1305 -152 1603 2937 3273 2272 1152 849 895 -1264 1432 2975 1551 -453 -121
13646 -121 486 1586 1636 806 847 32 1226 -361 -2693 -4290 -3157 -4867 -4389 -741 2375 2685 47
13629 47 -421 -561 -1811 -64 -1075 -2383 -57 -142 -1010 918 1968 -550 -19 1067 -580 -1489 -4858
13612d858J069J786J193p96j330M57m47O54L84N76L032K079j73k43J438k330k484
13595Gp65Q4jk14n0J049j33L82K62l52n31J157J50j795n18M76m36K35nN57l31
13574g72K02M15m16k053j0K740J324o36K3Q90p74J11k372L60J97j202j786J258
13556b501K512P87j130K85j497q27K63j933j692K909K893r66r74K31J314q55j422
13539b603l60J414J66N99M80J23n6j14J00K956q6k485P85K302m51M95j83o69p2
13520B341j39k273J3J97k87n12j371J657L085M62k571j911J539K06k241m36J859
13503c82L84J534O48j026q12j306R86n5J005n37l80o17p41M30J285J836J219l153
13485C18m4k806j380j275J779K884l8J33P64M34N20j240j179q88j369p05J695
$$ plain form
13612 -4858 -3789 -2003 -810 -1606 -2936 -2479 -2926 -2272 -1888 -1312 1720 3799 3626 3383 4821 2491 7
13595 7 -758 -674 -675 -889 -939 110 -23 359 621 269 -262 895 1045 -750 -1268 -792 -1228 -993 -998 -441 -772
13574 -772 -570 -155 -571 -2624 -2634 106 1430 794 817 1707 933 1044 -1328 -968 -771 -1973 -3759 -2501
13556 -2501 11 798 -332 -47 -1544 -2371 -2108 -4041 -5733 -2824 69 -897 -1871 -1640 -326 -1181 -2603
13539 -2603 -2963 -1549 -1383 -784 -304 -181 -237 -351 -251 2705 2619 134 919 3221 2770 3265 3082 2413 2341
13520 2341 2202 -71 -58 139 -148 -660 -2031 -374 2711 3173 602 -1309 230 436 -1805 -2241 -382
13503 -382 2 1536 2184 1158 346 -960 26 -29 976 439 59 -558 -1299 -869 416 2252 3471 318
13485 318 274 -2532 -3912 -5187 -3408 -524 -562 -429 335 769 1289 49 -1130 -2018 -3387 -4092 -2397
13468b397J329R9j662j458L66J01M58J71K579J098p88j906O9k543k404j79L211
13451c856K045r13L006J949j508l499j934n62K400j16J219K292l22k110k466M35
13435c940l69J143q25k98J456J025J540K771j018n46J086k14m73o92K72o32j353
13418a067J420j642k529J031K431P40M4j183K49P49m64m72j562O25L206j216k623
13401b263j437K8M14J73J913J581k608l807J038J928J435j372k50P18K683o25
13385d51k52K024n6j663P63K00j477k41j37o42r91l18N39J303j52Q8M47J593J33
13366G10n38j337K603J664O46k438l717l081O2J269K449J451R48j014K006O13
13350B296k418k913N06K637P51l286k255j011k429J535M303M225p85j338N36o40
$$ plain form
13468 -2397 -1068 -969 -2631 -4089 -3723 -3622 -3164 -2993 -414 684 -104 -2010 -1941 -4484 -6888 -7067 -3856
13451 -3856 -1811 -2724 282 2231 723 -2776 -4710 -5272 -2872 -2988 -1769 523 201 -1909 -4375 -3940
13435 -3940 -4309 -3166 -3991 -4289 -2833 -1808 -268 2503 1485 939 2025 1811 1338 646 918 286 -1067
13418 -1067 353 -1289 -3818 -2787 -356 384 428 -755 -506 243 -221 -693 -2255 -1630 1576 360 -2263
13401 -2263 -3700 -3672 -3258 -3085 -1172 409 -2199 -6006 -4968 -3040 -1605 -2977 -3227 -2509 174 -451
13385 -451 -703 1321 1265 -398 365 565 -912 -1153 -1290 -1932 -2923 -3241 -2702 -1399 -1551 -1463 -1016 577 710
13366 710 172 -1165 1438 3102 3748 1310 -2407 -5488 -5426 -4157 -1708 -257 691 -323 1683 2296
13350 2296 -122 -3035 -2529 108 859 -2427 -4682 -5693 -8122 -6587 -2284 1941 1156 -182 354 -286
13334b86r79J296j4j650j17p4j861P69p88k04L202K54J436o12j949k67J903M02
13316D61K536r73k679p10m96q29J444L78Q65q36n20j205l6j81k592L43K368J009
13298a653L732Q19l516o68K701J8m00MK29j905K384L09j323n66j376N46J54j645
13280b156n34j960J449l64lJ018k765j905M053K468l96m72m27o58O9J61j778J524
13262b676K50J998L553j689k474J926j1j090N92j903j321J9J680j19o0J5N93k48
13244i65k133j327n69J266K859Q93j885p87K626M69l237k327M07J860j516j979
13228f345J992K413K979K60O04J318j650k289l99j936j60K128N83J465j985j854
13212b876K376q50j818l58O89j279P82k16J943L051j56J067J932l794l521j4j
$$ plain form
13334 -286 -1265 31 17 -1633 -1750 -1824 -3685 -2916 -3704 -3908 -706 -452 984 372 -1577 -1844 59 461
13316 461 2997 2024 -655 -1365 -1861 -2690 -1246 -868 -3 -839 -1359 -2564 -2600 -2781 -5373 -5030 -2662 -1653
13298 -1653 2079 2898 -618 -1286 1415 1433 1033 1037 1266 -639 1745 2054 731 165 -1211 -665 -511 -2156
13280 -2156 -2690 -4650 -3201 -3565 -3568 -2550 -5315 -7220 -3167 -699 -1095 -1567 -1994 -2652 -2583 -2422 -4200 -2676
13262 -2676 -2426 -428 3125 1436 -1038 888 877 -213 379 -1524 -2845 -2826 -1146 -1265 -1325 -1310 -717 -965
13244 -965 -3098 -4425 -4994 -3728 -869 24 -1861 -2648 -22 447 -2790 -5117 -4710 -2850 -4366 -6345
13228 -6345 -4353 -1940 1039 1299 1903 3221 1571 -718 -1117 -3053 -3213 -1085 -502 963 -1022 -2876
13212 -2876 -500 -1350 -3168 -3526 -2837 -4116 -3334 -3550 -1607 1444 1288 2355 4287 493 -3028 -3042 -3043
13195c043K86K509J429J996k177j679q61J29j53k837j797j065q6L366K690N61
13179g32K718J704q86q34j167q73J325J502R31j17R4K58k3j545j615kJ514r89
13161A263j868N4j456J103J603L04j995j158j107K945J991P57k77j373R95K191
13145C972j378k374r27O26R07j35k160n89j675O38J163J281J273q36q17N76M7
13128d08j046P28J115J138O51k128p87k22Q94l52K46J30J374j65k585p94n0J829
13110d32J842j577k451j26l95J724J652j074K159J015k059K352Q28j590k840N
13094i67l61n1J748J761j989k859J831J691J041p73n8J789j959o43J3J242Q90
13077B346p08N35K39j732j67j83P92P12k255k672j787R34o92M17K270L579J041
$$ plain form
13195 -3043 -2757 -248 1181 3177 1000 -679 -1540 -1411 -1564 -4401 -6198 -7263 -7349 -3983 -1293 -732
13179 -732 1986 3690 2804 1970 803 -70 1255 2757 3688 3571 3665 3923 3900 2355 740 738 2252 1263
13161 1263 -605 -551 -2007 -904 699 1003 -992 -2150 -3257 -312 1679 2436 2159 786 1781 3972
13145 3972 2594 220 -707 -81 826 691 -1469 -2058 -3733 -3095 -1932 -651 622 -214 -1031 -455 -408
13128 -408 -1454 -726 389 1527 2178 50 -737 -959 -65 -417 -171 -41 1333 1168 -1417 -2211 -2261 -432
13110 -432 1410 -167 -2618 -2744 -3139 -1415 237 -837 1322 2337 278 2630 3458 1868 -972 -967
13094 -967 -1328 -1379 369 2130 141 -2718 -887 804 1845 1072 1014 2803 844 201 214 1456 2346
13077 2346 1638 2173 2412 680 513 330 1122 1834 -421 -3093 -4880 -3946 -4638 -4221 -1951 1628 2669
13060B669m085j911K033J504J220J76J979R67j958r03j746K16j158m19N34j04
13044i86q1R01R18k64j389j333J23J608J374j666p87N90M72N47k739J078l73Q11
13026a196n04O20j304j28J663J311L01k279k436O24J011K337P73M96q91K6n15
13009i1k93J015Q81j258j038J473N41J443R0j605n77o37M7N40Q05j140n61K13
12991a52K521j746k65Q14n65l01q21q64J968r99J056k098k085l88R0M498K478
12974C141k05j228k585K35q50J631l19P56k044j564l7o69J46q7M021J863q90l0
12956A285J507K88j964j954N19J309m39j362k110j284K24J556o88k139Q01P77
12940c674K739M88K15J01P60k228l39K970J467k616j196l19J440K100J789j149
$$ plain form
13060 2669 -1416 -3327 -1294 210 1430 1606 3585 4552 2594 1691 -55 161 -997 -1416 -882 -986
13044 -986 -1067 -166 752 488 -901 -2234 -2111 -503 871 -795 -1582 -992 -520 27 -2712 -1634 -2007 -1196
13026 -1196 -1700 -1080 -2384 -2512 -849 462 763 -1516 -3952 -3328 -2317 20 793 1289 398 424 -91
13009 -91 -384 631 1512 254 -784 689 1230 2673 2763 1158 581 -56 -9 531 1336 196 -365 -152
12991 -152 2369 623 358 1172 607 306 -515 -1379 589 -410 646 -1452 -3537 -3925 -3835 663 3141
12974 3141 2936 1708 -877 -642 -1492 139 -180 576 -1468 -3032 -3069 -3738 -3592 -3679 342 2205 1315 1285
12956 1285 2792 3080 1116 -838 -319 990 551 -811 -2921 -4205 -3981 -2425 -3113 -5252 -4451 -3674
12940 -3674 -935 -447 -232 -131 629 -1599 -1938 1032 2499 -117 -1313 -1632 -192 1908 3697 2548
12924B548p87l708K97J917J597j172j325j373M65P59J642j29J388J665j81j931
12908A672l306k147j671r06J848O97J607J298Q80K831O16l8J18j932r24O28K62
12891A533O88J17j457J001J279m97j507p68j667J329j023J721P76j33n58n75k307
12874b048j24O35m82L40L74n99l05K10m16K46j223j150L071J355o94r91L945J063
12856C207J134k239j424l20j21j506P48K550J682l97j089j058M67P60L64J53N05
12839C416j555J56p72k71J1j412j88q36p29o01O28p81J156L180J098k138N53J370
12821B285N66j130k847r11J70J625j819k675k771L589L311J005j224m529j960
12806g315K160J529n41N32P99k245j552K34K821J343r13J618J257r02m86J956
$$ plain form
12924 2548 1761 -1947 -1650 267 1864 692 -633 -2006 -1541 -782 860 731 2119 3784 3603 1672
12908 1672 -1634 -3781 -5452 -6358 -4510 -3813 -2206 -908 -28 2803 3419 3381 3499 1567 643 1271 1533
12891 1533 2221 2338 881 1882 3161 2664 1157 389 -1278 51 -972 749 1525 1392 834 259 -2048
12874 -2048 -2172 -1537 -2019 -1679 -1305 -1904 -2209 -1999 -2415 -2169 -3392 -4542 -1471 -116 -810 -1801 2144 3207
12856 3207 4341 2102 678 358 237 -1269 -521 2029 3711 3314 2225 1167 1634 2394 2758 2911 3416
12839 3416 1861 2017 1245 974 985 -427 -615 -1451 -2180 -2781 -2153 -2934 -1778 1402 2500 362 915 2285
12821 2285 2851 1721 -1126 -2037 -1867 -242 -2061 -4736 -7507 -3918 -607 398 -826 -5355 -7315
12806 -7315 -5155 -3626 -4167 -3635 -2836 -5081 -6633 -6399 -3578 -2235 -3148 -1530 -273 -1175 -1661 295
12790B95O60j770j240J689o31m92M07R10m01K64j989j641R0O63O78K672J969k458
12772c25k121J252o77k73P6J542O62j708j199l043r34O71J906R34P89K514K670
12755B736J756j010k291j15j516j388K92P33j403j607j150l25K206J479R24N37
12739a42L35j505L4M19k044J55j742k127J610K167K099N61k079J525m99j569J202
12722a600O47r10n18L36Q42K655K085l329k964l28k26K192O30k122l540l71K748
12705c773L16j854N61L654K331L87k829j390J812q38k85K728J025k214j217Q88
12689f98R89J712M2J86k23N64m30l53r29o20j015m69j897j11R72m21k12R71P57
12670a185o66J639J194J37j199J619K195j07k31o23o55l12j489k140P89J657N7
$$ plain form
12790 295 955 -815 -2055 -366 -997 -1489 -1082 -172 -573 -309 -2298 -3939 -3849 -3186 -2508 164 2133 -325
12772 -325 -2446 -1194 -1871 -2144 -2068 -526 136 -1572 -2771 -5814 -6748 -6077 -4171 -3237 -2448 66 2736
12755 2736 4492 3482 1191 1076 -440 -1828 -1536 -803 -2206 -3813 -4963 -5288 -3082 -1603 -679 -142
12739 -142 193 -1312 -1278 -859 -2903 -2748 -4490 -6617 -5007 -2840 -741 -180 -2259 -734 -1233 -2802 -1600
12722 -1600 -953 -1863 -2381 -2045 -1203 1452 3537 208 -2756 -3084 -3310 -1118 -488 -2610 -6150 -6521 -3773
12705 -3773 -3457 -5311 -4750 -1096 1235 1622 -1207 -2597 -785 -1623 -1908 820 1845 -369 -1586 -698
12689 -698 291 2003 2045 2231 2008 2572 2142 1789 860 240 -775 -1244 -3141 -3252 -2280 -2701 -2913 -1942 -1185
12670 -1185 -1851 -212 982 1119 -80 1539 3734 3627 3396 2773 2118 1806 317 -1823 -1034 623 680
12653F80K995M071J612k807j351o77Q2q12l220j407J685M71n24p61p23k88j077
12636b051J782p71L7N0K540L00j719k107K1OR69N08j012J944k46j208L27n55j253
12617b438J181k6J593J495n24q39J26J625r97j288Q6k89l96n3j030j838J191K756
12599C35m64j292j881j23K280N13j196o79J010q62j017K480J113j697k201k59
12583c940J78n54K299j13M6R37R82o3M77M51j109l487Q6K464r7R04M60R55J36
12564A012K386P99k149k394k096n38q45K249J595J31k847m005l58J789J747J776
12548a748n49k171j786M21N52J510K016j418j451n09J330J423J421K098m23j3
12532G03j175k24J211J41k5n79l75Kk48r35j229J349M51M50L74m11m10O14O61
$$ plain form
12653 680 3675 7746 9358 6551 5200 4523 4605 3793 573 -834 851 1322 798 37 -686 -974 -2051
12636 -2051 -269 -1040 -1003 -953 1587 1887 168 -1939 -1918 -1912 -943 -435 -1447 497 251 -957 -630 -1185 -2438
12617 -2438 -1257 -1283 310 1805 1281 442 568 2193 1196 -92 -6 -295 -691 -744 -1774 -3612 -2421 335
12599 335 -129 -1421 -3302 -3425 -1145 -632 -1828 -2507 -1497 -2359 -3376 -896 217 -1480 -3681 -3940
12583 -3940 -3762 -4316 -2017 -2130 -2084 -1147 -165 -228 249 700 -409 -3896 -3810 -1346 -1443 -539 -79 876 1012
12564 1012 3398 4197 2048 -346 -2442 -2980 -3825 -1576 19 150 -2697 -6702 -7060 -5271 -3524 -1748
12548 -1748 -2297 -4468 -6254 -5833 -5281 -3771 -1755 -3173 -4624 -5133 -3803 -2380 -959 1139 716 703
12532 703 -472 -696 515 656 631 52 -323 -321 -569 -1504 -2733 -1384 -933 -483 -109 -520 -930 -316 345
12513C45R59j068k278J765J188j101r07L02M48q72j822p21p15q47j470P58L70
12496e666m96J415K240l57k27j16o04j045m48Q92O49J43J810l80P88N27k171p01
12478c747J007Q11Q15J488L12j871j607J073j622j641J963K524j265j513k04j55
12462c632J103K243j099j592r51j064r08M30K279J706J591j380j680k072l03L790
12446a539J831N95N71p47o12j282k690J12L45k368o57O26K693N64R10P51r0q12
12428a799l281n82J101l3N5L51J844J227k187o6J151J304K056K04j073r89J61
12411e56R2O51l37J53K038j63M30l084k428J323L188J589o61l17q11J544P07j854
12393A504l92j179K34k968j849m56P30K463J307o45j445k183J001K479L486n37
$$ plain form
12513 345 1304 236 -2042 -277 911 -190 -1097 -795 -347 -1219 -3041 -3762 -4477 -5324 -6794 -6036 -5666
12496 -5666 -6162 -4747 -2507 -2864 -3091 -3207 -3811 -4856 -5304 -4412 -3763 -3620 -1810 -2190 -1402 -875 -3046 -3747
12478 -3747 -2740 -1929 -1114 374 686 -1185 -2792 -1719 -3341 -4982 -3019 -495 -1760 -3273 -3477 -3632
12462 -3632 -2529 -286 -1385 -2977 -3928 -4992 -5900 -5470 -3191 -1485 106 -1274 -2954 -5026 -5329 -1539
12446 -1539 292 887 1458 711 99 -1183 -3873 -3761 -3416 -5784 -6441 -5815 -3122 -2558 -1648 -897 -987 -1799
12428 -1799 -5080 -5662 -4561 -4594 -4539 -4188 -2344 -1117 -3304 -3370 -2219 -915 1141 1345 272 -717 -556
12411 -556 -464 187 -150 3 2041 1878 2308 -776 -3204 -1881 1307 2896 2235 1918 1107 2651 3358 1504
12393 1504 1112 -67 167 -2801 -4650 -5106 -4376 -1913 -606 -1251 -2696 -4879 -3878 -1399 2087 1550
12377A550k49n87q14N56m93K289N14l132R19R67j363k451q08r02j174J659R00
12360b619j605n36K208L34R24M60l58m55p37K80K70r20P91j77j099J083j215P12
12342b659J11k209N21J803j802N72p82J443M13r64L60J036j23J566J38j478k668
12325d722K823K417P29m95j532O86N82j221M05n68M37k87J986j27q61k744l70
12308b862J271J216M48p10M10m80K315j84o73l56j904J229k687j315J554J389
12292a339l29k022J754M9K351J461k796j610m62L1j558L74O43k51R15p38j942
12275e469P61J084r03n49J228J291k32J060J145k156J24J574k100p28Q83O25J769
12258e93q59J58k725j958N31l14j018J208K14J724Q51P35K583J837N29J03j426
$$ plain form
12377 1550 1301 714 -100 456 -37 2252 2766 -366 553 1520 157 -2294 -3102 -4004 -5178 -3519 -2619
12360 -2619 -4224 -4760 -2552 -2218 -1294 -834 -1192 -1647 -2384 -2104 -1834 -2754 -1963 -2140 -3239 -2156 -3371 -2659
12342 -2659 -2548 -4757 -4236 -2433 -4235 -3663 -4445 -3002 -2589 -3553 -3193 -2157 -2280 -714 -576 -2054 -4722
12325 -4722 -1899 518 1247 752 -780 -94 488 -733 -328 -896 -459 -746 1240 1113 252 -2492 -2862
12308 -2862 -1591 -375 73 -637 -227 -707 1608 1424 751 395 -1509 -280 -2967 -4282 -2728 -1339
12292 -1339 -1668 -3690 -1936 -1887 464 1925 -871 -2481 -2943 -2912 -4470 -4096 -3453 -3704 -2789 -3527 -5469
12275 -5469 -4708 -3624 -4527 -5076 -3848 -2557 -2789 -1729 -584 -2740 -2616 -1042 -3142 -3870 -2987 -2362 -593
12258 -593 -1452 -1294 -4019 -5977 -5446 -5760 -6778 -5570 -5356 -3632 -2781 -2046 537 2374 2903 3006 1580
12241A580M86Q6k970J149Q74j161m41k16k365m31j450J343K216P93j463k80n88
12224b838k23Q63L69R17J558l92j378M02P69j041l017n29K69O17K676J139m70
12207c09l37k057j391j418J240K210L35r97J18%j216O68N03l33J723K370o43k686
12189b220k296n62K39P92N98Q38J405p14l83P1J282J355j165k730j8K94L660J730
12171B176R38o0k081O94n11j659j853j417l82L267K202O34k412j41o15n92q0l11
12153b203m62P53L367r52k854k06L04J868J058K01q3J12n97l732j51L38K120L410
12135B291J66j939j405j034r03j755K006R41J355J53O07j9k982k145J59K73K457
12118a774M231q86l90J485j328j476Q0q36K343L92j045j419j256m48J049J895
$$ plain form
12241 1580 2066 2152 -818 331 1205 44 -397 -613 -2978 -3409 -4859 -3516 -1300 -507 -1970 -2250 -2838
12224 -2838 -3061 -2198 -1829 -912 646 254 -1124 -722 47 -994 -4011 -4540 -4271 -3654 -978 161 -309
12207 -309 -646 -2703 -4094 -5512 -4272 -2062 -1727 -2724 -2606 -2606 -3822 -3154 -2651 -2984 -1261 1109 466 -2220
12189 -2220 -4516 -5078 -4839 -4047 -3449 -2611 -1206 -1920 -2303 -2232 -950 405 -760 -3490 -3508 -3214 446 2176
12171 2176 3114 3054 973 1667 1156 -503 -2356 -3773 -4155 -888 1314 1948 -464 -605 -1220 -1812 -1892 -2203
12153 -2203 -2665 -1912 1455 503 -2351 -2557 -2253 -385 673 874 791 903 306 -3426 -3577 -3239 -1119 2291
12135 2291 2457 518 -887 -1921 -2824 -4579 -2573 -1632 -277 -124 483 464 -2518 -4663 -4504 -4231 -1774
12118 -1774 2457 1571 1181 2666 1338 -138 -58 -894 1449 1841 796 -623 -1879 -2327 -1278 617
12102F17k474r60k266M8m7J731J690j352q69k088L17O86M04K067j906k027L536
12085b893O51J68j825J116J025q11k708L05J560K494K158K76l59r56q36Q1p80
12068a334k412R99K894l81k387l739J516J500M34l2j281O42K840k29j157j974
12052d101k685N12K892M74j129m30q14N84J045m5J393n70J267O49n04j988j297
12035d747L69n90j042o33k11J468R92p0J089K526J280n1j53l120l410J974J168
12018c161O97P16J922J449j829k571m8L60j540j361J021K93J870J489j266j480
12002c439L69j02n30M73J867J445J85o26P60j125j238J205j12q10k17J547Q69
11985E21Q71K568J189n03j865k216j382P61O35M17K04j000k980r94J73j185J086
$$ plain form
12102 617 -1857 -2817 -5083 -5035 -5082 -3351 -1661 -3013 -3882 -5970 -5653 -4967 -4563 -2496 -4402 -6429 -2893
12085 -2893 -2242 -2074 -3899 -2783 -1758 -2569 -5277 -4972 -3412 -918 1240 1516 1157 201 -635 -554 -1334
12068 -1334 -3746 -2747 147 -234 -2621 -6360 -4844 -3344 -2910 -2942 -4223 -3581 -741 -970 -2127 -4101
12052 -4101 -6786 -6274 -3382 -2908 -4037 -4467 -5281 -4697 -3652 -3697 -2304 -2874 -1607 -958 -1462 -3450 -4747
12035 -4747 -4378 -4968 -6010 -6643 -6854 -5386 -4394 -4464 -3375 -849 431 380 227 -2893 -6303 -4329 -3161
12018 -3161 -2464 -1748 174 1623 -206 -2777 -2825 -2465 -4005 -5366 -4345 -4052 -2182 -693 -1959 -3439
12002 -3439 -3070 -3172 -3702 -3229 -1362 83 268 -358 402 -723 -1961 -756 -868 -1678 -1895 -348 521
11985 521 1392 3960 5149 4646 2781 565 -817 -56 579 996 1200 200 -2780 -3774 -3601 -4786 -3700
11968c700L036K3j150M7K020J267R43J001k173l333Q06j677k248P03K650m98j354
11951c637n74O75M09L43O43L76J931k91j469N99k283J542K709o21j77j036j761
11934b622k231r40K29J374P01n17j027l24J576K878J769q37k442K42J147p58R0
11917a692l45n82J904K856k120O03J3j314j682j625j14r95R91O37L7l0L371l10
11899c97l29p0J164j859k813J510L124J018J013p35J734j737j950j07q10j588
11883b832q43K04O89l640r14P81L048R7R84J364q00M09O59p96k464r4P58J192
11865b198O58j341j669K481J438l275k522J663J414j11k102k059Q68N90L344L609
11849G88j004m292k599q87R79L569j6J166o84J203m45J07k25j812m98L308R82
$$ plain form
11968 -3700 -664 -641 -1791 -1744 276 1543 2486 3487 1314 -2019 -1213 -2890 -5138 -4435 -1785 -2283 -3637
11951 -3637 -4211 -3536 -3127 -2784 -2141 -1765 166 -125 -1594 -995 -3278 -1736 973 352 175 -861 -2622
11934 -2622 -4853 -5793 -5564 -4190 -3489 -4006 -5033 -5357 -3781 -903 866 29 -2413 -2171 -1024 -1782 -1692
11917 -1692 -2037 -2619 -715 2141 21 624 637 -677 -2359 -3984 -4098 -5093 -4102 -3465 -3428 -3458 -87 -397
11899 -397 -726 -796 368 -1491 -4304 -2794 330 1348 2361 1626 3360 1623 -327 -434 -1244 -2832
11883 -2832 -3675 -3471 -2782 -6422 -7336 -6555 -3507 -3410 -2426 -1062 -1862 -1453 -794 -1590 -4054 -4148 -3390 -2198
11865 -2198 -1540 -2881 -4550 -2069 -631 -3906 -6428 -4765 -3351 -3462 -5564 -7623 -6755 -6165 -2821 788
11849 788 -216 -4508 -7107 -7994 -7015 -3446 -3462 -2296 -2980 -1777 -2222 -2115 -2340 -4152 -4650 -1342 -360
11832c60Q15Q19Q14m10O70j349k965p43J280j775j420L508P40j525l63L352l93
11815F95m57J659p77l093r43J686K733J194k574o36J462O36n17o88j678k432o02
11798d332K78Q27n94K168L98m59k94j658k246J261K420m26j813j304j253J109
11782e918K773K393Jl61k30j534O99n91k502K24L178M48j113j39J052J446j273
11765a447k334j794Q29K196J96P66l36p75L409P34K00J698k779k577l96J227R7
11748a086K457r38k325L01K417r68k523P61m04j968j17J049M20N8j196p08p32
11731e502k32J275r38J056O56J177K199K93j638j84M75J471l685m100R42M707
11715b028J007j747k769M91N84N87j15n77j309J627j296k53K277m26M82j620Q74
$$ plain form
11832 -360 455 1274 2088 1678 2348 999 -1966 -2709 -1429 -3204 -4624 -1116 -376 -1901 -2264 1088 695
11815 695 238 1897 1120 -1973 -2916 -1230 1503 2697 123 -513 949 1585 1068 380 -1298 -3730 -4332
11798 -4332 -4054 -3227 -3821 -1653 -1255 -1714 -2008 -3666 -5912 -4651 -2231 -2657 -4470 -5774 -7027 -5918
11782 -5918 -3145 -752 -751 -1112 -1342 -2876 -2177 -2768 -5270 -5046 -1868 -1420 -2533 -2672 -1620 -174 -1447
11765 -1447 -3781 -5575 -4746 -2550 -2354 -1588 -1924 -2699 710 1444 1644 3342 563 -2014 -2410 -1183 -1086
11748 -1086 1371 433 -1892 -1591 826 -142 -2665 -1904 -2308 -4276 -4393 -3344 -2924 -2866 -4062 -4770 -5502
11731 -5502 -5734 -4459 -5397 -4341 -3685 -2508 -309 -16 -1654 -1838 -1363 108 -3577 -7677 -6735 -2028
11715 -2028 -1021 -2768 -5537 -5046 -4462 -3875 -3990 -4567 -5876 -4249 -5545 -5798 -3521 -3947 -3465 -5085 -4211
11698d211q16J295L279m90p25l6J887q34R69r40K43M12J109o17m72k897k443L85
11680d902K049J978O75O91j181k8o4j484o91K094J698O24j237j721j732N68J38
11663b525n2J249j106O0n24J049k44L33J891O32j080j347k715m44J782K762K619
11646B340O81l18j442q69q38j150J450J425p26j563Q23j068l4M31L331l06k494
11629c27j006j513m2r29R61K306m85p11q57K11K125K275j160j643j793K04m52
11612b836K7Q64O33M71k52N34J253r52k442j690j484L435Q8n19j597J917Q92K66
11594a392j200j172O72j877M26K167J101P86P02r04o61k148L07L58L5m07j32Q01
11576b538J516O6J619R90j036p3n29l10k76m11K00m094j684K081J851N8l264M
$$ plain form
11698 -4211 -5027 -3732 -453 -943 -1668 -1704 183 -651 318 -622 -379 33 1142 525 53 -2844 -5287 -4902
11680 -4902 -2853 -875 -200 491 -690 -718 -782 -2266 -2957 -863 835 1459 222 -1499 -3231 -2663 -2525
11663 -2525 -2577 -1328 -2434 -2374 -2898 -1849 -2093 -1760 131 763 -317 -1664 -4379 -4823 -3041 -279 2340
11646 2340 3021 2703 1261 392 -446 -1596 -146 1279 553 -1010 -187 -1255 -1289 -858 2473 2167 -327
11629 -327 -1333 -2846 -2888 -3817 -2856 -550 -1035 -1746 -2603 -2392 -267 2008 848 -795 -2588 -2384 -2836
11612 -2836 -2809 -1945 -1312 -841 -1093 -559 694 -258 -2700 -4390 -5874 -2439 -2351 -2870 -4467 -2550 -1658 -1392
11594 -1392 -2592 -3764 -3092 -4969 -4543 -2376 -1275 -489 213 -691 -1352 -3500 -3193 -2835 -2800 -3207 -3339 -2538
11576 -2538 -1022 -956 663 1653 617 544 15 -295 -571 -982 -782 -4876 -6560 -4479 -2628 -2570 -5834 -5830
11558e830J428K562k14k394j998J358K069J044K072j200M47Q13O11J045P11K50
11542B774l68J035r98k488M4K155j497l399n14q46k82J374J294j061n0Q88N08
11525a431J005K567q57l51j064j078J764k95k241j89J746M16J017R62m13Q76p44
11508A690j352j10J398K45j428k354j873R66J91j48L63N33K559N96m32O6l208
11491b298j695K247K795n15l706J8j855L495J143Q80J499J308K08N46p48j147
11475B175l276m967m169q6L561K451J009O53P64j008k330Q62l34Q62J866m54Q67
11458a554j498r19J173j599j86L07P3K438n33j228J750J935J129j315J090j103
11442d0J12l118K39M04r80M0r07L64K622k29r43j142k603N72K202q1K57P82j057
$$ plain form
11558 -5830 -4402 -1840 -2054 -4448 -6446 -5088 -3019 -1975 97 -1103 -656 157 768 1813 2524 2774
11542 2774 2406 3441 2443 -45 -1 2154 657 -2742 -3256 -4102 -4384 -3010 -1716 -2777 -2827 -1939 -1431
11525 -1431 -426 2141 1284 933 -131 -1209 555 260 -1981 -2170 -424 -8 1009 1971 1558 2434 1690
11508 1690 338 228 1626 1871 443 -1911 -3784 -2818 -2627 -2775 -2412 -1879 680 1276 844 910 -2298
11491 -2298 -3993 -1746 1049 534 -3172 -3154 -5009 -1514 -371 509 2008 3316 3524 4070 3322 2175
11475 2175 -1101 -6068 -10237 -10323 -6762 -4311 -3302 -2649 -1885 -2893 -5223 -4361 -4695 -3833 -1967 -2421 -1554
11458 -1554 -3052 -3971 -2798 -4397 -4583 -4276 -4203 -1765 -2298 -3526 -1776 159 1288 -27 1063 -40
11442 -40 72 -3046 -2807 -2403 -3383 -3343 -4250 -3886 -1264 -1493 -2436 -3578 -6181 -5609 -3407 -3488 -3231 -2449 -3506
11423c506n36N35K49L25O34J062j606j76L023J398o14J6j853k276L26R65O13p79
11405b200J385K194k89r92r06j81k123K319L84J969O76j502j451n87j066k89l54
11388c013K66n65j013m08j363K777J120j33j70J079J535J443q91m14L79j124k43
11371g38l02k920J020K920m37K056J446J335j580o16m32r19k61r18O25l22n37
11354e80j251P36j23j322o01K021J998J80q12K743j162j937j991Q46K827L35j356
11337E51j482l071k65J02K482j591k859L435J195j196m64K184p33l837j506K334
11321d721K334n53m06J127J220O40o91J939r50k259j629J99J234n78K052K954
11305A912O48l544j601l08p69kN4Q92K903N42K28R23k212j168L78R70K120l87
$$ plain form
11423 -3506 -4042 -3507 -3258 -2933 -2299 -1237 -2843 -3019 4 1402 788 804 -1049 -3325 -2999 -2034 -1421 -2200
11405 -2200 -815 1379 1090 98 -808 -989 -3112 -793 -409 1560 2236 734 -717 -1304 -2370 -2659 -3013
11388 -3013 -2747 -3312 -4325 -4733 -6096 -3319 -2199 -2332 -2502 -1423 112 1555 664 250 629 -495 -738
11371 -738 -1040 -3960 -2940 -20 -457 1599 3045 4380 2800 2184 1752 833 572 -346 279 -43 -580
11354 -580 -1831 -1095 -1218 -2540 -3141 -1120 878 1058 246 2989 1827 -110 -2101 -1255 1572 1907 551
11337 551 -931 -4002 -4267 -4165 -1683 -3274 -6133 -2698 -1503 -2699 -3163 -979 -1712 -5549 -7055 -4721
11321 -4721 -2387 -2940 -3346 -2219 -999 -359 -1050 889 -61 -2320 -3949 -3750 -2516 -3094 -1042 1912
11305 1912 2560 -984 -2585 -2893 -3662 -3664 -3610 -2718 185 727 955 1878 -334 -1502 -1124 -154 1966 1579
11287A579j495l37q73J326K727r38k550j344P58J324n62j745R32r76N61k03J280
11270e36K337o3k698j358J046o70k539j76J819K94k932q06J570J793J659J739
11254D79j25o99K310k221j228J719j71j887j741M66J86K036J939J50r55l98j02
11237b42j39J84l09Q09O81J08R0j564j07N05Q46L21J157m97J981K93o92j087j578
11218G60k073K14K816K08l393J38J910J033k14q34j266r37r6O47j58Q80m82j360
11200b207K659j120L2J471j331Q71r12j121J276j19k047j32L00l48J07r65P27
11183b859K116o06j279k63N76j417p01j8j303j739Q5K677L86j418K692J336j291
11166c026j896J893P10j069r62M84R60R36m74j337O06Q36M4l44L93J82J006K78
$$ plain form
11287 1579 84 -253 -1126 200 2927 1989 -561 -1905 -1147 177 -385 -2130 -1198 -2174 -1613 -1816 -536
11270 -536 1801 1738 -960 -2318 -1272 -1942 -4481 -4657 -2838 -2544 -5476 -6282 -4712 -2919 -1260 479
11254 479 354 -345 1965 -256 -1484 235 64 -1823 -3564 -3098 -2912 -876 1063 1213 258 -140 -242
11237 -242 -381 -197 -506 303 984 1092 1182 -382 -489 16 862 1183 2340 1843 3824 4117 3425 2338 760
11218 760 -1313 -1099 1717 1925 -1468 -1330 580 1613 1399 565 -701 -1638 -1734 -1087 -1245 -365 -847 -2207
11200 -2207 452 -668 -636 835 -496 375 -537 -1658 -382 -501 -2548 -2680 -2380 -2728 -2621 -3586 -2859
11183 -2859 -743 -1349 -2628 -2891 -2315 -3732 -4433 -4451 -5754 -7493 -7408 -4731 -4345 -5763 -3071 -1735 -3026
11166 -3026 -4922 -3029 -2319 -3388 -4350 -3866 -2906 -1970 -2444 -3781 -3175 -2339 -2295 -2639 -2246 -2064 -1058 -780
11148g80q90k51r75j046M91n13J190p5L17J009J121m33j296m04P11K37q9K143
11130D67j152q34j156j39o46K469L52j457o72j027p78R85L92j56j406j737L16
11113f179K365Q07o46Q71J494M34l32J287j322K10R55l18j475J392k01J18J667
11096A127J008K257p30p34L65J403p94k827j56J6k605j364m4K340J469j973n20
11079a762p6j386j907N45Q02J472q7j200L228K895Q0q50k357l382j154K591Q52
11062a696J408J544M85J096Jj023K8n1N83P02j428j496q06O93j352q87r40M89
11044b650L28j320o85J177K154K031q57J88J10p26J34k86k782J044K276L249j019
11027B366l201j997J945M66l81o67r82K720J288k204l184k504J095J565K160O92
$$ plain form
11148 -780 -1670 -1921 -2896 -3942 -3451 -3964 -2774 -2849 -2532 -1523 -402 -835 -2131 -2535 -1824 -1587 -1676 467
11130 467 -685 -1519 -2675 -2814 -3460 -991 -639 -2096 -2768 -3795 -4573 -3588 -3196 -3352 -4758 -6495 -6179
11113 -6179 -3814 -3007 -3653 -2782 -1288 -854 -1186 101 -1221 -1011 -56 -374 -1849 -457 -658 -540 1127
11096 1127 2135 4392 3662 2928 3293 4696 3902 1075 919 935 -1670 -3034 -3078 -738 731 -1242 -1762
11079 -1762 -1838 -3224 -5131 -4586 -3784 -2312 -2399 -3599 -371 2524 2604 1754 -603 -3985 -5139 -2548 -1696
11062 -1696 -288 1256 1741 2837 2838 1815 1843 1792 2375 3077 1649 153 -653 40 -1312 -2199 -3139 -2650
11044 -2650 -2322 -3642 -4327 -3150 -996 1035 178 366 476 -250 -116 -402 -3184 -2140 136 3385 2366
11027 2366 -835 -2832 -887 -421 -802 -1469 -2451 269 1557 -647 -3831 -6335 -5240 -3675 -1515 -823
11011h23K99q68N42o9r50l49R14n4j215k197j279N8l96P75J022J978k2p10j013
10992d357O58K29P90l49l34M75o60K239j126J229L11j072k423q6P94J341L12K022
10974gJ20k74k346J814J087k323J419K863n274j679K769J645J888q90j837j560
10958b585l25J334K065j19l474k321K53J377Q91J045k604k27J172j60n98K321
10942a955J942R69m66j737q94k087k379j915j61K468L186P97J380J515n26J276
10926A413J737k854k229j186K121n95J74J80P1R80K506J525k128m653j301J039
10910c200K879J426k40j845k10o53K141L324L46k404k425O61PJ951p7K472Q40
10893D993k713r39l98R40J0n67j541n86O65L563L933m4j734j455q99k449k963
$$ plain form
11011 -823 -524 -1392 -850 -919 -1869 -2218 -1304 -1358 -2573 -4770 -6049 -5991 -6387 -5612 -4590 -2612 -2634 -3344 -4357
10992 -4357 -3699 -3470 -2680 -3029 -3363 -2888 -3548 -1309 -2435 -1206 -895 -1967 -4390 -4476 -3682 -2341 -2029 -7
10974 -7 113 -161 -2507 -693 394 -1929 -510 2353 -2921 -4600 -1831 -186 1702 812 -1025 -2585
10958 -2585 -2910 -1576 489 370 -3104 -5425 -5172 -3795 -2904 -1859 -4463 -4690 -3518 -3678 -4276 -1955
10942 -1955 -13 956 490 -1247 -2141 -4228 -6607 -8522 -8683 -6215 -3029 -2232 -852 663 137 1413
10926 1413 3150 296 -1933 -3119 -998 -1593 -1419 -1239 -1168 -188 2318 3843 1715 -2938 -4239 -3200
10910 -3200 -321 1105 865 -980 -1190 -1843 298 3622 3968 1564 -861 -200 -193 1758 1681 4153 4993
10893 4993 2280 1341 943 1883 1893 1326 -215 -801 -136 3427 7360 7316 5582 4127 3228 779 -2184
10876b184J152J387L93J868j591N25j185l88R65L411J975k923k782k030k92J85
10860a514L92j358j745K941J329l09k087K067N63O21Q53P19k181R96L62j459o50
10843d60k09j599j804K08P42n68k209J953K754k5j456j95P34L296j88n48M28r44
10825i0p53J214P82k413l94J786r39Q37M47j777J022P92j763o45n59J060P8J061
10807b54q50p16m36m45L00O82j140J561p97j64J933N27J581j873j330M2Q69O53
10789A43K584L095P1j132j279k051k660p36j572K66K93J4J076J495N16k50N67
10772D40k160j677J248L29j302J444K885J891j708n58q32j575q75q18k45O48l5
10755b900j886K193J817J93p95n71R90K432J370N8Q39r63r56l30j652m23O11J614
$$ plain form
10876 -2184 -1032 355 748 2616 1025 1550 365 -23 942 4353 6328 3405 623 -1407 -1699 -1514
10860 -1514 -1122 -2480 -4225 -1284 45 -264 -2351 -284 279 900 1753 2472 291 1287 1649 190 -460
10843 -460 -669 -2268 -4072 -3864 -3122 -3690 -5899 -3946 -1192 -1217 -2673 -2868 -2134 1162 974 426 854 -90
10825 -90 -843 371 1153 -1260 -1654 132 -807 30 477 -1300 -278 514 -1249 -1894 -2453 -1393 -1315 -254
10807 -254 -1104 -1820 -2256 -2701 -2401 -1719 -2859 -1298 -2095 -2259 -326 201 1782 -91 -1421 -1379 -510 143
10789 143 2727 5822 5893 4761 3482 1431 -1229 -1965 -3537 -3271 -2978 -2964 -1888 -393 123 -127 440
10772 440 -1720 -3397 -2149 -1820 -3122 -1678 1207 3098 1390 832 0 -1575 -2450 -3268 -3513 -2865 -2900
10755 -2900 -4786 -2593 -776 -583 -1378 -1949 -959 1473 2843 2901 3740 2777 1821 1491 -161 -584 27 1641
10737A641K091l52J911O7j084k475l569Q12J968m52q81K45j08L03r74r67o44m51
10719b919j71Q91j006J436J137L2K695j43j446L30K04J778K171n59o11j035J60
10702B944Q16j112j71j247p9J329J219j533l712r05R75j10J595J020J99J135o88
10685A675M15J43K516j614j462p26n71J77o17k706k104P15K784P88k737j524J315
10668c533J272J86R30o47M34J708J924J124p55P06l02J8k114k011J392J614j410
10651E36k319m49j70J252N03j817R50L517j55j237r52L07J617K122M254l589m142
10634B28p0p16j504L12K108p56r71K946k31L37o95l210P22rk080M67J883O66r92
10615a565j005j036M16J381J167m8J229P76j674k80R59k594m15j240n0M512J075
$$ plain form
10737 1641 3732 3380 5291 5358 4274 1799 -1770 -958 1010 558 -323 -78 -186 117 -857 -1824 -2468 -2919
10719 -2919 -3090 -2199 -3205 -1769 -632 -600 2095 1952 506 836 1040 2818 4989 4430 3819 2784 2944
10702 2944 3760 2648 2477 1230 1151 2480 3699 2166 -1546 -2451 -1476 -1586 9 1029 1228 2363 1675
10685 1675 2090 2233 4749 3135 1673 947 376 553 -64 -2770 -4874 -4159 -1375 -587 -3324 -4848 -3533
10668 -3533 -2261 -2075 -1145 -1792 -1358 350 2274 3398 2643 3349 3047 3065 951 -1060 332 1946 536
10651 536 -1783 -2232 -2402 -1150 -647 -2464 -1514 2003 1848 611 -341 -34 1583 3705 7959 4370 228
10634 228 158 -558 -2062 -1750 358 -398 -1369 1577 1346 1683 988 -2222 -1500 -1509 -3589 -3122 -1239 -573 -1565
10615 -1565 -2570 -3606 -3190 -1809 -642 -690 539 1315 -359 -639 320 -2274 -2689 -3929 -3979 533 1608
10598A608K372J686P48k654k666k356j6m62O94p01j98K11R86K794J782k313k729
10581a214j178O52j331q85K224J990J754j30r35j302k358R27J691p63M62J073
10565F77k75l05L99q1J308L46l306q07J186l227L587M127J270j643j536l078k164
10548c522P92O4K541o67j908J109J033r76j34o87J68M01PM89J13J746M34k40l
10529G60J913J168k45j333j16N36J077j234j757m75N00j83k43o18n2J16n48N11
10511b23j08L54j76p73p8p55j30K830K91k136q72J473K48R2j210J145L258r0q39
10492B301K308k140k924j814K35P26K378j158q18j157j412K328K360J504J833
10477D550j376r73j581O26k38m7M05J488K258j29p81j888r08j977j092j28J128
$$ plain form
10598 1608 3980 5666 6414 3760 1094 -1262 -1278 -1740 -1046 -1747 -1945 -1734 -748 2046 3828 1515 -1214
10581 -1214 -2392 -1740 -3071 -3956 -1732 258 2012 1882 947 -355 -2713 -1786 -95 -858 -396 677
10565 677 402 97 496 415 1723 2069 -1237 -2044 -858 -4085 -498 3629 4899 3256 1720 -1358 -3522
10548 -3522 -2730 -2666 -125 -792 -2700 -1591 -558 -1534 -1668 -2355 -2187 -1786 -1779 -1290 -1177 569 1003 763 760
10529 760 2673 3841 3596 2263 2147 2683 3760 2526 769 294 794 611 368 -250 -302 -186 -734 -223
10511 -223 -331 23 -153 -926 -1004 -1759 -1889 941 1232 -904 -1776 -303 -55 37 -1173 -28 3230 3140 2301
10492 2301 4609 2469 -455 -2269 -2034 -1308 1070 -88 -906 -2063 -3475 -1147 1213 2717 4550
10477 4550 3174 2201 620 1246 1008 961 1366 2854 5112 4983 4202 2314 1406 -571 -1663 -1791 -663
10460f63L713J383l8K104L358J243k76j675l853l233L33Q74J338j868j765r92
10444a7J973J70j307N06J661R61Q93l00o01k623j957J098K786J862k722l626M38
10427h05P06j099nJ466K635M204k677l337l34J76J935M1j03j499j414J814K63
10410A967P09J558K69q97O53j996j258k6L55K732n90j167j06L57p68R6M07j599
10392F96j679J545M507J084R04J979M75k046J562j76k003q98r3j081j645m44J20
10375B807O00K69p00Q4L166J944p53j95l27M82n79l166N09q75j94r75Q65J605
10357D567J93j250m68j235l621K56R89O40l9J879M90j127p09j612M68L30M52q00
10339e97J069J84J663J209J698P67p38J192m62k892M0J629O8j226O65k218k260
$$ plain form
10460 -663 3050 4433 4395 6499 9857 11100 10824 9149 5296 2063 2396 3270 4608 2740 975 -17
10444 -17 1956 2126 819 1325 2986 3947 4840 4540 3939 1316 -641 457 3243 5105 2383 -1243 -805
10427 -805 -99 -1198 -1203 263 2898 7102 4425 1088 754 930 2865 2906 2803 1304 -110 1704 1967
10410 1967 2676 4234 4503 3606 4259 2263 1005 979 1334 4066 3476 2309 2203 2560 1792 1888 2295 696
10392 696 -983 562 5069 6153 7057 9036 9511 7465 9027 8851 6848 5950 5857 4776 3131 2687 2807
10375 2807 3407 3676 2976 3060 6226 8170 7417 7222 6895 7377 6798 3632 4141 3266 3072 2097 2962 4567
10357 4567 4760 3510 3042 1807 -1814 -1558 -569 71 32 1911 2401 1274 565 -1047 -579 -249 203 -597
10339 -597 472 656 2319 3528 5226 5993 5255 6447 5985 3093 3133 4762 4830 3604 4269 2051 -209
10322b09J257L80J278l56J029J805j721Q8O08l075j4K252Q52j444m83O64j803
10305A108j080j127J317K004j56l04L37K060J375k200q54K719j137o24J04J831
10289E373N11J336N58n30J115j150m19p33j379O90j375k162j630J353J373L15
10273C246r4m095k61J879R12O87J328O52L90J01P2O41J430j248k211J040L48K040
10255F857R12p70j788P39j040L82J99k011J285J727J748j115k078P34J733J076
10239H590k537l738j558q41J520J103J162L25j759l16l63J22J100J166o52L95
10223C719J29k478q8M26l08j60k36n32P1K566K117p8k524J030K271J00J598M57
10205H080j162j586j805k03Q48Q77j249K084K024r17l022j259J073K06J350j439
$$ plain form
10322 -209 1048 1428 2706 2350 3379 5184 3463 3551 4159 1084 1070 3322 4174 2730 2247 2911 1108
10305 1108 28 -1099 218 2222 2066 1762 2099 4159 5534 3334 2480 5199 4062 3438 3542 5373
10289 5373 5884 7220 7778 7248 8363 7213 6794 6061 4682 5372 3997 1835 205 1558 2931 3246
10273 3246 3152 -943 -1204 675 1587 2274 3602 4254 4644 4745 4817 5458 6888 5640 3429 4469 4817 6857
10255 6857 7769 6999 5211 5950 4910 5292 5491 3480 4765 6492 8240 7125 5047 5781 7514 8590
10239 8590 6053 2315 757 -84 1436 2539 3701 4026 2267 1951 1588 1710 2810 3976 3324 3719
10223 3719 3848 1370 1282 1708 1400 1240 1004 472 543 3109 5226 5148 2624 3654 5925 6025 7623 8080
10205 8080 6918 5332 3527 3324 4172 5049 3800 5884 7908 6991 3969 2710 3783 3989 5339 3900
10189C900j679P50J205J586p0J340R57j732o61M54M07n49Q1j783j14K382r70j815
10171C689k634p59J391L177Q82p36j688k064Q60K226Q30j228j059P08rJ019P1
10154D676j67o20L184O41p44o30k063o8L7k968K12J069J597m53m60J381K185j814
10136D995l38K216j483j405j160Q84J430J766l56J293O65j234J704j773N20J246
10120H970L3k745k961r28q3R77J101L33k91J99J982l43q91j265P14K184j042k532
10102C412Q0J46J423J857R43k599q52J359J913l91k04j034q02P71o63J250q00
10085E809m43m47M10N09q46Q04k873m36J781J557J201n7M74j644L9J038J145r87
10067G034J160P92j794n39j213K94q98r32J720L247j241j778l25q54j499o34J097
$$ plain form
10189 3900 2221 2971 4176 5762 5692 7032 7989 6257 5596 6050 6457 5908 5989 4206 4092 6474 5504 3689
10171 3689 1055 296 1687 4864 5746 5010 3322 1258 2118 4344 5174 3946 2887 3595 3586 4605 4676
10154 4676 4509 3889 7073 7714 6970 6340 4277 4209 4246 1278 1490 2559 4156 3703 3243 4624 6809 4995
10136 4995 4657 6873 5390 3985 2825 3709 5139 6905 6549 7842 8507 7273 8977 7204 7724 8970
10120 8970 9003 6258 3297 2369 2286 3263 4364 4697 4406 4605 6587 6244 5353 4088 4802 6986 5944 3412
10102 3412 3492 3638 5061 6918 7861 5262 4410 5769 7682 7291 7087 6053 5251 6022 5359 6609 5809
10085 5809 5366 4919 5329 5838 4992 5796 2923 2487 4268 5825 7026 6969 7443 5799 5838 6876 8021 7034
10067 7034 8194 8986 7192 6653 5440 5734 4836 3904 5624 8871 7630 5852 5527 4673 3174 2540 3637
10050C637K056J509q10j547j502N03K491j729L84j948m33N73k94J069Q96J101
10034E956J677k012j356n6J165K016r32j856L56J424J916k04r04N63m36m54l219
10017C644k720K16L688M22K161J335O85j057m043J290K488N97j720p20o57n19
10001E090k115J580J702J405r48k213l0L117J060q46q38K97J098M36j197k218
9985E380j722j36k083j658J294J804R31K01N8J808j876n91K273R08o28j955R47
9968D955R11J152N86R75J245j427k824j333q73J642J602j912k511K157J451J9
9952E815J750K154K668L99k158j908L119Q64l653k737J269k051p93q92L40L552
9936G738l52J27O96M03k21j453k117J467J408K26J162J840j213j098L92n32j310
$$ plain form
10050 3637 5693 7202 6392 4845 3343 3846 6337 4608 4992 3044 2611 3184 2890 3959 4855 5956
10034 5956 7633 5621 4265 4209 5374 7390 6458 4602 4958 6382 8298 8094 7190 7753 7317 6863 3644
10017 3644 924 1140 4828 5250 7411 8746 9431 8374 4331 5621 8109 8706 6986 6266 5609 5090
10001 5090 2975 4555 6257 7662 6714 4501 4471 7588 8648 7802 6964 7261 8359 8795 7598 5380
9985 5380 3658 3522 1439 -219 1075 2879 3810 4011 4069 5877 4001 3410 5683 6591 5963 4008 4955
9968 4955 5866 7018 7604 8579 9824 8397 5573 4240 3367 5009 6611 4699 2188 4345 5796 5815
9952 5815 7565 9719 12387 12786 10628 8720 11839 12703 9050 6313 7582 5531 4738 3846 4186 7738
9936 7738 7386 7513 8209 8612 8391 6938 4821 6288 7696 7922 9084 10924 9711 8613 9005 8473 7163
9919G163%k677K165L535K10j450j794J375K038o79j943k019j329O63K59n25j013
9902C979j481J208K366j124Q30K221j344Q4r78o02m67M10O26J010J248R68N25
9885I479j14r30k717j167O05J240Q4J959J272L01p98j009r22J179R52l93n92k262
9867F167j025J425J212l42J245J262k27j42J913n14k368k164O54N48j969K558
9851H233J550o15k401k893K081P61K97J777J054N99N56k65q07r42K400j478j491
9834H416K220k61k340J612J224j693r21p23J030J290K072j693J50j178J430m50
9818A0185j246m82J216q74j816j089j065R99n1j33k316q94L249K336N82q48l512
9801D241j164K174J461j931k0j278J49K352J944R54K033J049k292k966j395J200
$$ plain form
9919 7163 7163 4486 6651 10186 10396 8946 7152 8527 10565 9886 7943 5924 4595 5258 5517 4992 3979
9902 3979 2498 3706 6072 4948 5778 7999 6655 6739 5761 5159 4692 5102 5728 6738 7986 8954 9479
9885 9479 9365 8435 5718 4551 5156 6396 6480 8439 9711 10012 9214 8205 7283 8462 9414 9021 8429 6167
9867 6167 5142 6567 7779 7437 8682 9944 9717 9575 11488 10974 8606 6442 7096 7644 5675 8233
9851 8233 9783 9168 6767 3874 5955 6716 7013 8790 9844 10443 10999 10734 9927 8985 11385 9907 8416
9834 8416 10636 10375 8035 9647 10871 9178 8257 7534 8564 9854 11926 10233 10383 9205 10635 10185
9818 10185 8939 8457 9673 8799 6983 5894 4829 5828 5777 5644 3328 2434 5683 8019 8601 7753 4241
9801 4241 3077 5251 6712 4781 4761 3483 3632 5984 7928 8882 10915 11964 9672 6706 5311 6511
9785F511K452Q85J379K87p95k84p97N17o62r46K457q97p23o07o62K84J98K43Q45
9766I685l978l64P92J549J306j409P20K357Q83L51m3k219j166p4p55n32j260J510
9748G353m52P97R06P69J753j255r96N25J304J996j759j952j364J868l86j533O
9731G580m91n39J456K801N86J212j964j279P37q84J19J684M53j318k602o46P06
9714G611J118o57M51j007J117P24L87K116N26q78k013O44n69l2o78J311Q85J341
9696A2397N5k828k142j181K971J993l85P50R94M30k498j157p21j675J900K804
9680A1707Q57j099j654O32K652J322k167r16J795j056j266J841J395R55j481k870
9664A0647k444o42k46J27J789o89l297j062k103J432L084N62J412K601J585m39
$$ plain form
9785 6511 8963 9848 11227 11514 10719 10435 9638 10155 9493 8547 11004 10107 9384 8777 8115 8399 8597 8840 9685
9766 9685 5707 5343 6135 7684 8990 7581 8301 10658 11541 11892 11849 9630 8464 8390 7635 7103 5843 7353
9748 7353 6901 7698 8604 9373 11126 9871 8875 9400 10704 12700 10941 8989 7625 9493 9107 7574 7580
9731 7580 7089 6550 8006 10807 11393 12605 10641 9362 10099 9215 9334 11018 11471 10153 7551 6905 7611
9714 7611 8729 8072 8523 7516 8633 9357 9744 11860 12386 11508 9495 10139 9570 9538 8860 10171 11056 12397
9696 12397 12452 9624 7482 6301 9272 11265 10880 11630 12624 13054 10556 9399 8678 7003 8903 11707
9680 11707 12564 11465 9811 10443 13095 14417 12250 11334 13129 12073 10807 12648 14043 14998 13517 10647
9664 10647 8203 7561 7315 7442 9231 8542 5245 4183 2080 3512 6596 7158 8570 11171 12756 12317
9648A2317j300k52J021Q01l311R36N66o22L44K70J242J228k29K79j546K033J007
9631A4784o45Q54m92k992q04J374j028J141J562k675j637L30l29J407J713L130
9615A5693J519k830l215j661q38J333j163j094R56q30L698K266l318j289j840
9600G387j490M110J732p27l43j711j184J54J869p66j307L17n25M049Q17L96j619
9583A1159j771J209j098q95K637j791o95M361J924k49J022j387j249l169q70K405
9567A1543J746J592k624j200R89Q32L11M83k318p66J698K335j099k62k951j891
9551H418L14J425K831j117j76J063r7Q49q28m98n17J62q57k65k411M08M68k626
9533F546L25L422K97k88J531J87J41l53J768J036K422J224J19j028r59L08J61
$$ plain form
9648 12317 11017 10765 11786 12587 9276 10212 10778 10156 10500 10770 12012 13240 13011 13290 11744 13777 14784
9631 14784 14139 14993 14501 11509 10705 12079 11051 12192 13754 11079 9442 9772 9443 10850 12563 15693
9615 15693 17212 14382 11167 9506 8668 10001 8838 7744 8700 7870 11568 13834 10516 9227 7387
9600 7387 5897 10007 11739 11012 10669 8958 7774 7928 9797 9031 7724 8041 7516 11565 12382 12778 11159
9583 11159 9388 10597 9499 8604 11241 9450 8755 13116 15040 14791 15813 14426 13177 10008 9138 11543
9567 11543 13289 14881 12257 11057 12046 12878 13189 13672 11354 10588 12286 14621 13522 13260 10309 8418
9551 8418 8732 10157 12988 11871 11695 12758 12661 13510 12682 12184 11667 11829 10972 10707 8296 8704 9172 6546
9533 6546 6871 10293 10590 10302 11833 12020 12161 11808 13576 14612 17034 18258 18377 17349 16390 16698 16859
9516A6859k25j119l174n7L272N49Q94l38o12k545l954J108O44r01o03K640J422
9499A3860l0j352K217R76K703J396Q99j27K306j218L94j219k197k189k94j831
9483A4294j987q62Q30J872Q84J366K623K38P8K6k49j042j473J33P31N2o74Q95
9465A7735J862m33p57K183L269K953L0j806j505l39K27n28k046k706k63Q37J178
9448A9891k653j83o35K54k003K163J747k461o22J912Q27N87L48j252J892J29l73
9431A9568k277J575J138L251J862K248m47Q81k644j148Q35L61j18R63L161K06
9415B9415j823j887l802j683J237J628J905O18j592J51N09r13j171l30k066k91
9399A9905j404N81j168O42J515K547L17l023J067K936j64j367r25K86j73o11J30
$$ plain form
9516 16859 16634 15515 12341 12284 15556 16105 16999 16661 16049 13504 9550 10658 11302 10401 9798 12438 13860
9499 13860 13830 12478 14695 15671 18374 19770 20669 20542 22848 21630 22024 20805 18608 16419 16125 14294
9483 14294 12307 11445 12275 14147 15031 16397 19020 19258 19336 19362 19113 18071 16598 16731 17462 17514 16840 17735
9465 17735 19597 19164 18407 20590 23859 26812 26842 25036 23531 23192 23419 22891 20845 18139 17876 18713 19891
9448 19891 17238 17055 16420 16674 14671 16834 18581 16120 15498 17410 18237 18824 19172 17920 19812 19941 19568
9431 19568 17291 18866 20004 23255 25117 27365 26918 27799 25155 24007 24842 25203 25085 26048 29209 29415
9415 29415 27592 25705 21903 20220 21457 23085 24990 25608 24016 24167 24676 23763 22592 22262 20196 19905
9399 19905 18501 19082 17914 18556 20071 22618 22935 19912 20979 23915 23751 22384 21459 21745 21572 20961 21091
9382B1091j281J438K458l064k990o15O67l03n53l5J310N65M106K937K103l63M52
9365B7923j707J003o00K32K041j040l973k810Q07J108J866K109R81Q33j253j170
9349B6350o13O15j126k395q08L623R59l033K73J999k77j046j937J398N21Q81R32
9332B6316j329J031k098J520J780J683R26J940j295k355l025j24J467K653N19
9317B9609J008n37l20M59r19l0j800j8L8Q01j378R88L374J755J824n34N18K178
9299C7016N63R90l203m864M04r83k512K362J554J315K129J069R82k740j007m746
9283B8329k3K864Q32j799j136N72J233p50n35o74j443K209K131J366R73j445j271
9266C1433k20L762M326K689J712q1J24q90K058J170L003j0r17j722n84j866j04
$$ plain form
9382 21091 19810 21248 23706 20642 17652 17037 17704 17401 16848 16813 18123 18688 22794 25731 27834 27471 27923
9365 27923 26216 27219 26619 26851 28892 27852 23879 21069 21876 22984 24850 26959 27940 28773 27520 26350
9349 26350 25737 26352 25226 22831 22023 25646 26605 23572 23845 25844 25567 24521 22584 23982 24503 25384 26316
9332 26316 24987 26018 23920 25440 27220 28903 29829 31769 30474 28119 25094 24970 26437 29090 29609
9317 29609 30617 30080 29760 30219 29300 29270 27470 27452 27490 28291 26913 27901 31275 33030 34854 34320 34838 37016
9299 37016 37579 38569 35366 30502 30906 29923 27411 29773 31327 32642 34771 35840 36822 34082 33075 28329
9283 28329 28306 31170 32002 30203 29067 29639 30872 30122 29587 28913 27470 29679 31810 33176 34149 32704 31433
9266 31433 31213 34975 39301 41990 43702 43621 43745 42855 44913 46083 49086 49076 48159 46437 45853 43987 43883
9249D3883O6k41K200M25l58j61r8j949k72J494J976L17j372j663j730j916n77
9232D0024K025k01j868Q54J248L889L445M753M071K332L412K497N97n16j867j583
9216F3112m781l873m139k732K06K66j75m030k132j940j951J099J524j245p72j444
9200C6993q16L0K664k71k394O65K036K492P08J88K077K540J755J744K476J102
9184E3989P93L270O835l360q545q261l684J005J487J028j467k92J466o90N77K995
9168D7146L778L714M01K031J778M20k54M78q43Q71K695L006n17L612M473K449
9152G5238j600k572n217k345K82L34J596k398j541J810J62l073j572J620j06K244
9136F2862K266N405O586O423O694Q061P987O625J0202R601J1311J3141J6238J8854
$$ plain form
9249 43883 43949 43708 45908 46333 45975 45814 45716 43767 43495 44989 46965 47282 45910 44247 42517 40601 40024
9232 40024 42049 41848 39980 40834 42082 45971 49416 54169 58240 60572 63984 66481 67078 66562 64695 63112
9216 63112 58331 54458 50319 47587 47793 48059 47884 43854 41722 39782 37831 38930 40454 39209 38437 36993
9200 36993 36177 36207 38871 38600 36206 36871 38907 41399 42107 42295 44372 46912 48667 50411 52887 53989
9184 53989 54782 58052 64887 61527 52982 44721 41037 42042 43529 44557 43090 42798 44264 43574 44151 47146
9168 47146 50924 54638 55039 57070 58848 59268 59014 59492 58649 59520 62215 65221 64704 68316 72789 75238
9152 75238 73638 71066 65849 63504 63786 64120 65716 63318 61777 63587 63749 60676 59104 60724 60618 62862
9136 62862 65128 70533 77119 83542 90236 98297 106284 112909 123111 132712 144023 157164 173402 192256
9122A92256K1454K3579L5427M9446O6220Q8117J19149J54063J86337K12788K25576
9111A374412K15173J78787J21637N0026k7480j02847j58071j87243j99015j84806
9101A080573j60919j34937j07111q1914o1511n1958m3356l2570k9082k6607k1949
9090C28659j8726j7920j4374q067n982r81L960P717J4932K2916L5663N9706Q8510
9077D96013J28701J69913J85853J53772P9878p684j04592j75248j66747j20750
9067F39109q2808n7372m0699k6534j5390q453n642k969n41n627k1577m4207p8228
9054B49062j04359q8627n8160l3365j4648l376K320j125K046K817K82N429Q532
9041c3172P222N048M108r27K65Q95L486M398K967N774P601M535J35l517o614q678
$$ plain form
9122 192256 213710 237289 272716 322162 388382 476499 595648 749711 936048 1148836 1374412
9111 1374412 1589585 1768372 1890009 1940035 1912555 1809708 1651637 1464394 1265379 1080573
9101 1080573 919654 784717 677606 595692 534181 482223 438867 406297 377215 350608 328659
9090 328659 309933 292013 277639 269572 263590 262609 266569 274286 289218 312134 347797 407503 496013
9077 496013 624714 794627 980480 1134252 1214130 1206446 1101854 926606 759859 639109
9067 639109 556301 498929 458230 431696 416306 407853 402211 399242 398701 393074 371497 327290 249062
9054 249062 144703 56076 -2084 -35449 -50097 -53473 -51153 -52278 -50232 -47415 -47133 -41704 -33172
9041 -33172 -25950 -20902 -16794 -17721 -17456 -16561 -13075 -8677 -5710 64 7665 12200 12335 8818 2204 -6474
9025f474j8770j7761o827O324J1242J1456R382J1469Q913P294L901M51O77n58
9011B0719l381l247m160k729k397j309L95K191L605M094P189P178N310J83Q96
8996C4537J488K812j41K002J507j413L02J210J076J984J725K189J124N85J038
8981E2025k116p46L031J241J092K794J952J0242K9214N5291P2010N9120K2596
8968C07746m617N727L7254K2634l1162m2908m0927l3891l2958k5469j5987p085
8956A38357j198L514K107R04L460K124j302o575q276m966n946l464k026L73J703
8941A18789J538J272R95j143k364j883l749m520j901L469L881K542P97l318J521
8926A15926P665Q500R550R162J0280J0372R822J3225J1691J1539J2528J5646J6612
$$ plain form
9025 -6474 -25244 -43005 -49832 -43508 -32266 -20810 -11428 41 8954 16248 20149 20600 21277 20719
9011 20719 17338 14091 9931 7202 4805 3496 3891 6082 9687 13781 20970 28148 33458 33641 34537
8996 34537 36025 38837 38696 40698 42205 40792 41094 42304 43380 45364 47089 49278 50402 50987 52025
8981 52025 49909 49163 52194 53435 54527 57321 59273 69515 98729 154020 226030 285150 307746
8968 307746 303129 308856 346110 368744 337582 294674 253747 219856 186898 161429 145442 138357
8956 138357 137159 140673 142780 143684 147144 149268 147966 141391 133115 128149 122203 118739 116713 117086 118789
8941 118789 120327 121599 122594 121451 119087 117204 113455 108935 107034 110503 114384 116926 117723 114405 115926
8926 115926 123591 132091 141641 150803 161083 171455 181277 194502 206193 217732 230260 245906 262518
8913B62518J4939J7125K5060L3378N4170Q8499J44679K30064L65156N33276O76544
8902B445408P15678N48777K28453j07579m80036p12867o35510m34645k77985j86496
8892A103198j31203r6623q3685p2777o6510n9871m6314m2120m0580l4321k9290
8881C99904k4957k2785j7918j2543q136j1752j1676o888l018k046p72l700l571
8868B70142N776J5268J1965Q61J044M978l990p362n168n866q984n220M208R054
8854B86706J0118J0757J1589J8342K5986L2398M0154M7125N2453N3571M9558N3035
8842F91792M0662K15j9273k1369j03825k44156k31586k5236P4304L8974J2532
8831B13034Q595O807O344R502J1932J1931O163M782N374R268R589J5581K3888
$$ plain form
8913 262518 277457 294582 319642 353020 407190 495689 640368 870432 1235588 1768864 2445408
8902 2445408 3161086 3709863 3938316 3830737 3350701 2637834 2002324 1567679 1289694 1103198
8892 1103198 971995 875372 791687 718910 652400 592529 546215 504095 463515 429194 399904
8881 399904 374947 352162 334244 321701 313565 301813 290137 283249 280231 278185 277413 273713 270142
8868 270142 275918 291186 303151 304012 305056 310034 306044 298682 293514 287648 278664 273444 277652 286706
8854 286706 296824 307581 319170 337512 363498 395896 436050 483175 535628 589199 638757 691792
8842 691792 732454 732669 713396 692027 588202 344046 112460 87224 161528 200502 213034
8831 213034 221629 228436 234780 244282 256214 268145 274308 279090 284464 293732 303321 318902 342790
8818C42790K7921K3357J6998J2575Q196N035K70l124p011o109K155R205J1295
8805D43553J2955J9410K4224K4692K4243J9141J2279J1780J1576K771l845r676
8793E93103q687l008L90Q822J7198K2461J6692J5756K0185K4392K0792J2286J1711
8780G52093K1063K7297K6591L0396L7090M3518M3395L7670L8016L8544M6855N5611
8768A198139N5190N8979M9938M1986M8113O1151O2177N4007N1931O4109Q6335
8757A832055J06172J13845J14388J28025J38527J23869J14048J14284J15824J15867
8747C016904J30859J65786K19660K71438L22344L81042M29734M74354N32112O09656
8737F553889P05156P98234R09483J086695J339207J623852J955423K315049K695786
$$ plain form
8818 342790 370711 394068 411066 423641 431837 436872 437142 434018 427007 420898 423053 432258 443553
8805 443553 456508 475918 500142 524834 549077 568218 580497 592277 603853 606624 602779 593103
8793 593103 584416 581408 581798 590620 607818 630279 646971 662727 682912 707304 728096 740382 752093
8780 752093 773156 800453 827044 857440 894530 938048 981443 1019113 1057129 1095673 1142528 1198139
8768 1198139 1253329 1312308 1362246 1404232 1452345 1513496 1575673 1629680 1681611 1745720 1832055
8757 1832055 1938227 2052072 2166460 2294485 2433012 2556881 2670929 2785213 2901037 3016904
8747 3016904 3147763 3313549 3533209 3804647 4126991 4508033 4937767 5412121 5944233 6553889
8737 6553889 7259045 8057279 8966762 10053457 11392664 13016516 14971939 17286988 19982774
8728A9982774L123413L546911L902882M295685N075256O492198Q910081J3168741
8720F8497941K0035596L0183415M4211146N9681014O8823118O5322578M3392642
8713D00147450J1900562j1411338l8352532o5529092o6948224m9566840l3225283
8706A47014703k2660547j6497017j2232545j0187308r258899q183315p153100
8699F0841972o388304n972511n567637m953677m297526l755263l331617k941051
8691B3634386k556387k190327j839894j546251j338551j176953j031842r04304
8683A1049877q10829p47811o99158o55042o21877n86370n35375m78848m28548
8674E486019l85250l43024l03986k83052k72857k48272k23804k10213k04103j99749
$$ plain form
8728 19982774 23106187 26653098 30555980 34851665 39926921 46419119 55329200 68497941
8720 68497941 88533537 118716952 162928098 222609112 291432230 356754808 400147450
8713 400147450 412048012 400636674 362284142 296755050 229806826 180239986 147014703
8706 147014703 124354156 107857139 95624594 85437286 76178387 67995072 60841972
8699 60841972 54453668 48481157 42913520 37959843 33662317 29907054 26575437 23634386
8691 23634386 21077999 18887672 17047778 15501527 14162976 12986023 11954181 11049877
8683 11049877 10239048 9491237 8792079 8137037 7515160 6928790 6393415 5914567 5486019
8674 5486019 5100769 4757745 4453759 4170707 3897850 3649578 3425774 3215561 3011458 2811709
8664B811709j82630j61009j42232j32559j29917j15603r8024q3214p5708o8931
8654A621882o2114n9614n1454m4667l5380l3948l9833m1449m1653l9831m0653
8643A131286l5837k7752k1800j9653j7480k1292k3257k3795k7062l4110l7903
8632H41345l6580l7371l3379k4321j6754j0752o942m511m148J893L018k075r426
8619F59997j2458j3147j3340j8769k6923k4118j6337j0683p038k706J975P400
8607E23853P950O091J137m065j0776j1417q730p200m395m804j756k407J551K3845
8593E08877O3356J13033J48254J53233J10983Q754o0211n8199q8629j32593j36342
8582F30516j09039p3912m7250k5701j0864l460l780q13l192o044l423l414o416
$$ plain form
8664 2811709 2629079 2468070 2325838 2193279 2063362 1947759 1849735 1766521 1690813 1621882
8654 1621882 1559768 1500154 1448700 1404033 1368653 1334705 1294872 1253423 1211770 1171939 1131286
8643 1131286 1095449 1067697 1045897 1026244 1008764 987472 964215 940420 913358 879248 841345
8632 841345 804765 767394 734015 709694 692940 682188 675246 670735 666587 668480 671498 669423 659997
8619 659997 647539 634392 621052 602283 575360 551242 534905 524222 517184 514478 516453 523853
8607 523853 531803 537894 539031 534966 524190 512773 504043 496843 492448 487644 485888 483481 485032 508877
8593 508877 572233 685266 833520 986753 1097736 1106490 1046279 988080 899451 766858 630516
8582 630516 521477 447565 400315 374614 363750 360290 356510 355697 352505 346461 343038 339624 333208
8569C33208o632j0879j5907j4508r668p062k787P52M340Q62j964O928L629j4215
8555B66097j5846r867k544l91n89l68k864p77K59l076o403p249m339m688l840
8540B03515o716q002r702j1145j1484r783r542q519j2125j7439j5774j0310o167
8527F6807L864J0802J0922J3466J9360K5695L0468K3478R807l314q159p295q387
8514A87514j0943j0530q408r508q341o750l992L134L868J812J328K706L925O028
8500A51843J930k006j908J229J585L06m964m116j798l337n840l817l192k783l074
8485A20058J498K338j633M46l29l466n442q057o721m705k506L947L851K152L948
8470A05379O955K317J939J542K064o5k915N084N778j2238j9045j1400m865J989
$$ plain form
8569 333208 326576 315697 299790 285282 275614 268552 265765 266517 270857 271719 269755 276683 280312 266097
8555 266097 250251 240384 237840 237449 236860 236492 233628 232851 233110 230034 223631 216382 212043 207355 203515
8540 203515 196799 188797 179095 167950 156466 146683 137141 128622 116497 99058 83284 72974 66807
8527 66807 70671 81473 92395 105861 125221 150916 181384 204862 214669 211355 203196 195901 187514
8514 187514 176571 166041 157633 148125 139784 133034 129042 132176 136044 137856 139184 141890 145815 151843
8500 151843 153773 151767 149859 151088 152673 152979 148015 143899 142101 138764 132924 129107 125915 123132 120058
8485 120058 121556 123894 122261 122707 122378 118912 113470 105413 98692 93987 91481 95428 99279 101431 105379
8470 105379 112334 114651 116590 118132 120196 120131 117216 122300 128078 115840 96795 85395 80530 82519
8456H2519R613J1657J1520O966L263K292J086J90Q20l361j571j184j312j369J881
8441A23010n70l542k453m222k304k566l760m136l547j207j69j371J508J907M279
8426A00857P306O560N967L140J082j669q08k852l791l303k149n372m795l829L32
8411I6676K740M547P002R556J1521J1859P621L824r4m476j3534j6130j1102p320
8397A02690j104K802K552L303O066N340K919L291K810K56J824N888N830O694Q845
8382A60006J0225J3491J2615J2712J2382J1408K955j4463l9462n0659n7831q8540
8370a5161r3523m7243p209J1270K4532K1531J3767N587K718L273N959J748L027
8357f9724N567N759N763M527O554P280N126P155M665M175P66P51J00R21k6K799
$$ plain form
8456 82519 92132 103789 115309 122275 125538 127830 128916 129106 129926 126565 124994 123810 122498 121129 123010
8441 123010 122440 118898 116445 112223 109919 107353 103593 99457 95910 94703 94534 93163 94671 96578 100857
8426 100857 108163 114723 120690 123830 124912 123243 122435 119583 115792 112489 110340 104968 100173 96344 96676
8411 96676 99416 103963 110965 120521 132042 143901 151522 155346 155252 150776 137242 121112 110010 102690
8397 102690 101586 104388 106940 110243 116309 121649 124568 127859 130669 130925 132749 138637 144467 151161 160006
8382 160006 170231 183722 196337 209049 221431 232839 235794 221331 181869 131210 73379 -15161
8370 -15161 -108684 -155927 -163136 -151866 -127334 -105803 -92036 -86449 -83731 -80458 -74499 -72751 -69724
8357 -69724 -64157 -58398 -52635 -48108 -41554 -34274 -29148 -21993 -17328 -13153 -12387 -11636 -11536 -10615 -10641 -7842
8341g842K966K059K078M659L120J526O174O637O709O256J0138J3606J3337J2165
8327H3588J5924K0260K6690L4563M5856O3131Q6489J12960J49409J82726K08669
8316A030265K22101K19566J93008J38622O5437j1737q7229j48430j84968j99778
8306A236857j93277j71606j44635j16163r3404p3856n8690m7331l8602l1276k8570
8295B39447k5902k1403k0914j8091j3810j4669j2895p768q502m569n955n879n056
8282G4034r113p608l516m295k238j025m228p694l887m415m080K79k967l317k121
8267A3809O15L345O28m45k383m119q07Q41K075N96Q04L105L701M27j267j387j842
8250A7696j840J193L056q94n043o928l615J126M793K136J054O0R3k7m19K71j272
$$ plain form
8341 -7842 -4876 -2817 -739 3920 7040 8566 14740 21377 28086 34342 44480 58086 71423 83588
8327 83588 99512 119772 146462 181025 226881 290012 376501 489461 638870 821596 1030265
8316 1030265 1252366 1471932 1664940 1803562 1868999 1857262 1770033 1621603 1436635 1236857
8306 1236857 1043580 871974 727339 611176 517772 443916 385226 337895 299293 268017 239447
8295 239447 213545 192142 171228 153137 139327 124658 111763 103995 95493 90924 84969 79090 74034
8282 74034 64921 57313 53797 49502 47264 46239 42011 34317 30430 26015 21935 22214 19247 15930 13809
8267 13809 14424 17769 18397 17952 15569 11450 10643 11484 13559 14155 14959 18064 21765 22192 20925 19538 17696
8250 17696 15856 17049 20105 19211 14168 7240 3625 4751 9544 11680 12734 12794 12887 12860 12441 12712 11440
8233A1440K565L026O18m59k674K977L850J963M46j384N5M25R10k72L111P40m111
8216B3226l935n617j654k457k133j064J149j178n74J31q0l66J368J000j187J580
8200H209K769P85J189j042j645j811k017j82J394M05m12J13J687P65j605l31L53
8183H624N1J078K43K332J430J136J507J659r52l662o352k789m74j398r37K81J244
8166C021Q08l40j40M09O48p54M59J604l47J088K07J75p36j682N36j292J706J699
8148G069J970J243K033j081l587k588p70n02j669L11K065o6L224M023R88J595
8132A4258l32o86j437l917j99k029k199L913R76j797l225j485O64N459K292j682
8116H574r8k21j571J49n6n11n78j502j89J410J114l001m700j354J809J786j250
$$ plain form
8233 11440 14005 17031 17649 17190 14516 17493 21343 23306 23752 22368 22423 22848 23758 23486 26597 27337 23226
8216 23226 19291 13674 12020 9563 7430 6366 7515 6337 5763 5894 5814 5448 6816 7816 6629 8209
8200 8209 10978 11763 12952 11910 10265 8454 6437 6255 7649 8054 7642 7755 9442 10207 8602 8271 8624
8183 8624 8675 9753 9996 12328 13758 14894 16401 18060 17108 13446 7094 4305 3831 2433 1496 1777 3021
8166 3021 3829 3489 3349 3758 4406 3652 4111 5715 5368 6456 6663 6838 6102 4420 4956 3664 5370 7069
8148 7069 9039 10282 12315 11234 7647 5059 4289 3787 2118 2429 4494 4428 7652 11675 12663 14258
8132 14258 13926 13240 11803 7886 7687 5658 3459 7372 8348 6551 3326 1841 2505 7964 10256 8574
8116 8574 8476 8255 6684 6833 6777 6266 5688 4186 3997 5407 6521 3520 -1180 -2534 -725 1061 -189
8099a89R47K624K247K182J032J109j022M29j38j386L04J018j617K22J884o66j213
8082G767N60J191o51k636k772m29j225J546K407K74k354M16K867J64k005L12n72
8065D860m67j079m89K285J768K348J6r52Q85K835Q05k34J617j612p9J115q87k638
8047A0097j428m92j661R31K438k08J303Q84M22R33j986j704j697J163N5k010k83
8030F757nl45j211n58R27o18j023J358J092n20k966n64j055K475M324J783K117
8013A1968j469J52J066n01k554l479j645K070j685k862j321l757J197J568J785
7998E33J187J889J233j437J34k047p9K632J824J256J88j674k693j430r0J764j283
7981A907J308M59o61m63J392k47k357N28k13k294n44J523l77J545L81J985P49
$$ plain form
8099 -189 758 3382 5629 7811 8843 9952 8930 9359 9221 7835 8139 9157 7540 7762 9646 8980 7767
8082 7767 8327 9518 8867 6231 3459 3030 1805 3351 5758 6032 3678 4094 6961 7125 5120 5432 4860
8065 4860 4393 3314 2825 5110 6878 9226 9242 8290 9175 12010 12815 12581 14198 12586 12507 13622 12735 10097
8047 10097 8669 8177 6516 7447 9885 9677 10980 11864 12286 13219 11233 9529 7832 8995 9050 7040 6757
8030 6757 6752 6407 5196 4638 5565 4947 3924 5282 6374 5854 2888 2324 1269 3744 8068 9851 11968
8013 11968 10499 10651 11717 11216 8662 5183 3538 5608 3923 1061 -260 -4017 -2820 -1252 533
7998 533 1720 3609 4842 3405 3539 1492 1413 4045 5869 7125 7313 5639 2946 1516 1426 3190 1907
7981 1907 3215 3674 3013 2550 3942 3695 1338 1866 1653 -641 -1185 338 -39 1506 1887 3872 4621
7964D621K564J089j145k396M5J544n89j764k450J51J101M535J891p30l491L66
7948E342l56m15N53R58P94J408l124k892O87N02k770r4J312l645k234J06K605
7931a263J612P63J68J723N39R88J752j277j372j928j080J208L94K9J90k762k047
7914b363k244K175l1J782l56j603k042R14J463J21J314l74L01L369P49J012K187
7897F374J449j73j850k348k317O06J406K092J436k386r48J884K527j486l792o84
7881A790q27k52N37J362K787K534r70l95j04j166j857k243K099J170q53k50l3
7864C329k25r00J048J236R25r9J140k822l763L86K442O03l220j028J620J880m62
7847B090M16L01p06J925k31J357J035J050L70l780j080j415O35O10O73K85nk182
$$ plain form
7964 4621 7185 8274 7129 4733 4778 6322 5733 3969 1519 1670 2771 7306 9197 8467 4976 5342
7948 5342 4986 4571 5124 6082 6876 8284 5160 2268 2955 3457 687 593 1905 -1740 -3974 -3868 -1263
7931 -1263 349 1112 1280 3003 3542 4530 6282 5005 3633 1705 625 1833 2227 2256 2446 -316 -2363
7914 -2363 -4607 -2432 -2463 -681 -1037 -2640 -4682 -3768 -2305 -2184 -870 -1244 -943 2426 3175 4187 6374
7897 6374 7823 7650 5800 3452 1135 1741 3147 5239 6675 4289 3341 5225 7752 6266 2474 1790
7881 1790 963 711 1248 2610 5397 7931 6961 6566 6462 5296 3439 1196 3295 4465 3612 3362 3329
7864 3329 3104 2204 3252 4488 5413 5314 6454 3632 -131 255 2697 3300 80 -948 672 2552 2090
7847 2090 2506 2807 2101 4026 3795 5152 6187 7237 7607 3827 2747 1332 1967 2577 3250 3535 3530 1348
7829A348k356L572K248K0k366j82O90k022k403O89j115K966K145J31j16j232j283
7812G34M09k168Q45j593l05K904L189J575k902n73J189k1j074m28L24Q8O66p35
7794B124k542k496j222J491R69J00J671J292J368j58Q09j665l516P23L104j790
7778B62j040K553j086n07m17k47K226k474n6K181j79j639J331j000l0l316k69
7761c707O41J332J113j203n89K32J114q64j654l629k304R50M882J593k247j059
7745e399m18J064Q06J664n09N53J410K393L76o45j37J129P83j595o10P82o86k589
7727a628j307j922J114P04K484J857k00j987Q3P50Q83M64P97P09k81p59j481Q26
7709A106p52K23J365K466n58PN1m05o78k078j847r70J571L28N6J816j144L68k89
$$ plain form
7829 1348 -1008 2564 4812 4832 2466 2284 2974 952 -1451 -762 -1877 1089 3234 3365 3249 2017 734
7812 734 1143 -1025 -180 -1773 -2078 826 4015 5590 2688 2115 3304 3283 2209 1781 2105 2193 2859 2124
7794 2124 -418 -2914 -4136 -2645 -1676 -1576 95 1387 2755 2597 3406 1741 -1775 -1052 2052 262
7778 262 -778 1775 689 182 -235 -482 1744 -730 -786 1395 1216 -423 908 -92 -122 -3438 -3707
7761 -3707 -3066 -1734 -621 -1824 -2413 -2181 -1067 -1931 -3585 -7214 -9518 -8568 -3686 -2093 -4340 -5399
7745 -5399 -5817 -4753 -3947 -2283 -2792 -2239 -829 1564 1940 1295 1158 2287 3070 1475 865 1647 961 -1628
7727 -1628 -2935 -4857 -3743 -3039 -555 1302 1102 -885 -802 -52 831 1295 2092 2801 2520 1761 280 1106
7709 1106 354 577 1942 4408 3850 3857 3908 3503 2825 747 -1100 -2070 -499 -171 -115 1701 557 925 636
7690F36O54K3J794J363k120j463J58K469j626k107k58J684P83L20k463l740M75
7673c418K562k039K43J727r74j663r04Q12L192Q36k12j912j225N86K230J411j513
7656b61j000M72j12J801k17p23o09R78k79L1N39J761p23q43m57k073L97J549r01
7637f70l19K53J47N80O56K50J41O57J090l19j651l33J019Q62j671M33l3j492j912
7618b312j065J897m56L53J321m95R17j73k08l025k74L147J397l203k075J21J542
7601b591J291o23p68K2Q49M06k436r91K624M345J721M14j145k578k345k333Q88
7584c250K500j386m77K4p26j365K908L956L48j519k44j072m70m30J252k22j201
7567a374J512L83o88j650Q91kk006p25P64j41J460K631m38p24N20K50j389o26
$$ plain form
7690 636 1290 1313 3107 4470 2350 887 1045 3514 1888 -219 -477 1207 1990 2310 -153 -3893 -3418
7673 -3418 -856 -2895 -2652 -925 -1899 -3562 -4466 -3654 -462 374 162 -1750 -2975 -2389 -159 1252 -261
7656 -261 -1261 -789 -901 900 683 -40 -649 329 50 81 620 2381 1658 815 358 -1715 -1318 231 -670
7637 -670 -989 -736 -589 -9 647 897 1038 1695 2785 2466 815 482 1501 2363 692 1125 1092 -400 -2312
7618 -2312 -3377 -1480 -1936 -1583 -262 -757 160 -13 -221 -3246 -3520 -373 1024 -2179 -4254 -4133 -2591
7601 -2591 -1300 -1923 -2691 -2669 -1820 -1414 -3850 -4841 -2217 2128 3849 4263 3118 540 -1805 -4138 -3250
7584 -3250 -750 -2136 -2613 -2589 -3315 -4680 -1772 2184 2532 1013 769 -303 -773 -1203 49 -173 -1374
7567 -1374 138 521 -167 -1817 -926 -928 -2934 -3659 -2895 -3036 -1576 1055 617 -107 413 663 -726 -1352
7549a352J138M07J580J116N04K57k06K531K677m520m456J52J468J308L69j97r84
7532A792N35J240k831j172J358j421j910p46J971M21q89L56n03J639j48J147p93
7515D6j713q5l92j126J63K131M96M40j456K093Q90j147J718J079m72j018j357
7498B90K744K458k866j217o32L06Q93m22J541L245p71m55k018j585k80J630N14
7481C375k398j570j41q39J61k649o3N510J899j225j253k585k88K236M78k074N33
7464h93L613Q15L40j465k1J320J39J028k035l782k38Q52J896N1m86K54L39J50
7446A877R17J028J043p84n55j059m78J165N99o4m34R47j484Q36P89l700k566j121
7428c044K830J381J105j205j231J0k48L422j100m067j514K115O12Q48J094k085
$$ plain form
7549 -1352 -214 193 1773 2889 3393 3650 3444 5975 8652 4132 -324 -172 1296 2604 2973 2776 1792
7532 1792 2327 3567 736 -436 922 -499 -2409 -3155 -1184 -763 -1652 -1296 -1799 -160 -308 839 46
7515 46 -1667 -1752 -2144 -3270 -3107 -976 -480 -40 -1496 597 1487 340 2058 3137 2665 1647 290
7498 290 3034 5492 2626 1409 777 1083 1976 1554 3095 6340 5569 5114 3096 1511 1231 2861 3375
7481 3375 977 -593 -734 -1573 -1412 -4061 -4124 1386 3285 2060 807 -1778 -2066 170 648 -1426 -893
7464 -893 2720 3535 3875 2410 2389 3709 3848 4876 2841 -941 -1179 -327 1569 1620 1134 1388 1727 1877
7446 1877 2794 3822 4865 4081 3526 2467 1989 3154 3753 3689 3255 4202 2718 3554 4343 643 -1923 -3044
7428 -3044 -214 1167 2272 1067 -164 -154 -402 3020 1920 -2147 -3661 -1546 -934 -86 1008 -1077
7412a077j643Q02j379K056K907j159m069k681Q46J739N60n23K73J156Q10J062
7396c20J376r10j747R59n04j001m05m99K315j150j639J265J337J919q8k18k046
7379a356l96N05Q87j7J404j944q02L38k038l15p4J197L28N59n83J129J742K351
7361B915J909p64l035j853Q74J530j312k97K428l52J148k513k543K46n0J238K8
7344d03p66j562K353K215j237j375j634k574j22J86K778J97o06J512P60O5l27
7327e40K178J368N24J105K364k486m51k42k404k317M04Q13Q52k325j522O70O15
7310a394j051K31R73Q16j022l77l92p53J333L903K299J49k037j605j211LJ221
7293A086n27k441p57M000j13j039R17n76k93m20k320J60J304Q8J62J677R63k20
$$ plain form
7412 -1077 -2720 -1918 -3297 -1241 1666 507 -3562 -6243 -5397 -3658 -3098 -3621 -3348 -2192 -1382 -320
7396 -320 1056 146 -1601 -642 -1146 -2147 -2552 -3051 -736 -1886 -3525 -2260 -923 996 908 690 -1356
7379 -1356 -1752 -1247 -360 -377 1027 -917 -1719 -1381 -3419 -3734 -3808 -2611 -2283 -1724 -2307 -1178 564 2915
7361 2915 4824 4060 1025 -828 46 1576 264 -33 2395 2043 3191 678 -1865 -1619 -1669 -431 -403
7344 -403 -1169 -2731 -378 1837 600 -775 -2409 -4983 -5105 -4919 -2141 -1944 -2550 -1038 -278 -213 -540
7327 -540 1638 3006 3530 4635 6999 4513 4062 3820 1416 -901 -497 316 1168 -1157 -2679 -2009 -1394
7310 -1394 -2445 -2214 -1241 -425 -1447 -1824 -2216 -2969 -1636 2267 4566 4715 2678 1073 -138 -135 1086
7293 1086 559 -1882 -2639 1361 1248 209 1126 550 257 -163 -2483 -2323 -1019 -931 -769 908 1871 1651
7275A651n45j458j867j64l27j797N61J816K301p63p59p97K288J454K67j027j960
7258a126n51q62R43J390J294J404k639p07K748O15q46o99R88N87m65M70k173J69
7240E40L159k18l234j535P90J514l91k022j27J551L115k17m77k222p5k272r47
7223c068L97J646L012J520n08j424L8P89k683k04J4K565p66k040J583j730k390
7206c249k10l10K411L101k835k028K992J294j570j933j138J093j401q66K124K17
7190b308R09J151j946j41o51J154L006p49j271J698M40j487j544j338M086L022
7174D031r68m86j033j848j906j37J327m82J114Q01M46m7J397m03j413M8q42j101
7156a502K085J930k675j597J195J309j875J450R55k249J8R94K482j47j763j185
$$ plain form
7275 1651 1106 -352 -2219 -2383 -2710 -4507 -3946 -2130 171 -592 -1351 -2148 140 1594 1861 834 -1126
7258 -1126 -1677 -2539 -1596 -206 1088 2492 -147 -854 1894 2509 1663 964 1952 2539 2074 2544 371 540
7240 540 3699 3481 247 -1288 -498 1016 625 -1397 -1524 27 3142 2925 2448 226 151 -2121 -3068
7223 -3068 -2671 -1025 1987 3507 2999 1575 1613 2402 -281 -485 -471 2094 1328 -712 871 -859 -3249
7206 -3249 -3459 -3769 -1358 1743 -1092 -3120 -128 1166 -404 -2337 -3475 -2382 -3783 -4649 -2525 -2308
7190 -2308 -1399 -248 -2194 -2335 -2986 -1832 1174 425 -846 852 1292 -195 -1739 -3077 1009 4031
7174 4031 3063 2577 1544 -304 -2210 -2347 -1020 -1502 -388 413 859 812 2209 1806 393 441 -401 -1502
7156 -1502 583 2513 -162 -1759 -564 745 -1130 320 1275 -974 -956 38 2520 2373 610 -575
7140e75j788K02K390j627L3N98q50J0Q85K688j269k029K238l51N09K152j75l87
7122B654m79n56q83j48P44j023K046k303O64K617l058j769j733j445L81K625N57
7105a109p99l16J731J430J871j291o04O00J601J852Q41q23q29p16j665r56k802
7088a984K045K630p27n23p9o41R00r4o31l21J218J726j078j289J388K80l580m27
7070a187P44J181J248k479j172q4j548j168K054K923K458r3k70r53l81m94J954
7053B733J54k493k483L6K79J303k87p83N39P89p14j569k53j557J973K406J490
7036A563m28o50j972n10k11q94r69J99Q62P88N63P97J39k02o69J764J73K05L99
7017I47j614ql04k405K182K889j167p7n3j028J52K52j7K025Q16j069J332r45r28
$$ plain form
7140 -575 -2363 -2161 229 -1398 -1365 -767 -1617 -1607 -722 1966 697 -1332 906 555 1064 3216 3041 2654
7122 2654 2175 1619 736 588 1332 309 2355 52 716 3333 275 -1494 -3227 -4672 -4291 -1666 -1109
7105 -1109 -1908 -2224 -493 937 2808 1517 913 1513 3114 4966 5807 4984 4155 3439 1774 818 -1984
7088 -1984 61 2691 1964 1441 1362 721 1621 1527 896 575 1793 3519 2441 1152 2540 2820 -760 -1187
7070 -1187 -443 738 1986 -493 -1665 -1749 -3297 -4465 -2411 512 2970 2877 2607 1654 1273 779 2733
7053 2733 2887 394 -2089 -2053 -1774 -471 -758 -1541 -1002 -213 -927 -2496 -2749 -4306 -2333 73 1563
7036 1563 1135 485 -1487 -1997 -2208 -3102 -4071 -3872 -3010 -2222 -1659 -862 -723 -925 -1594 170 343 548 947
7017 947 -667 -675 -979 -3384 -1202 1687 520 443 390 -638 -486 -234 -251 1774 2590 1521 2853 1908 980
6998I80L41K791k28j997k427n45R18K87R72K330j047J162j54l002j475p1J752
6981E87L581k3q8k519l205j501N35M64j302L45J958p57q47j249R72J537J807R28
6963A223O86J387K196J023p39k125k432k82K863j419l276j375j076J624J698j704
6947a728K054j659L00K278j496l437L44R23O25j17N8O65J395M70R60L79J044J100
6929D158j625p18K08K337j561k318j819k598J477n32j12K425J27o51j960K26l64
6912c300n43J115L788J333k232R90j8k7J693J468J014j75j381k055n0n87j520
6895d87j378K822J109j38r03k632q48l45J074K196j670j465Q07J151o76l89K78
6878a494N44P4p3r16K550L559O18N81m82p54q0L41r59q70l025q55k179K401P5
$$ plain form
6998 980 1321 4112 3884 1887 -540 -1085 -167 120 1092 3422 2375 3537 3383 381 -1094 -1165 587
6981 587 4168 4145 4057 1538 -1667 -3168 -2633 -2169 -3471 -3126 -1168 -1925 -2772 -4021 -3049 -1512 295 1223
6963 1223 1909 3296 5492 6515 5776 3651 1219 937 3800 2381 -895 -2270 -3346 -1722 -24 -1728
6947 -1728 326 -1333 -1033 1245 -251 -3688 -3344 -2421 -1796 -1913 -1855 -1190 205 675 1635 2014 3058 4158
6929 4158 2533 1815 2023 4360 2799 481 -1338 -3936 -2459 -2991 -3103 -678 -551 -1202 -3162 -2936 -3300
6912 -3300 -3843 -2728 1060 2393 161 1151 1133 1106 2799 4267 5281 5106 3725 1670 1620 1033 -487
6895 -487 -1865 957 2066 1928 1025 -1607 -2455 -2800 -1726 470 -1200 -2665 -1858 -707 -1383 -1772 -1494
6878 -1494 -950 -876 -949 -1865 685 4244 4862 5443 4961 4207 4127 4468 3509 2639 -386 -1241 -3420 -1019 -944
6859i44M33O73J223J315k48n73m32p1J59N72R84K60k930j700J154J87J50j89k624
6840b601k375R37K070l92R71m30R29j257k508J848M124P99j470r59K25n69j085
6823a743O51n08R51R57J394J799P96j254r61K453J114j380p55j452J14p22j197
6806B57k68k16N34L003J565p84p13J59j231p41J737k14j002K058R03k08j386l046
6788D07r38o88J348P96J223M32k141q91M97j405Q9K870P42n86J091j007N32m01
6770A970k768k023l39K535K812J432k350j702J468l45j373j222l9R5J551K129
6754A831R87j006p68K16Q13o17J007j464j640K97N8M38P54j470k423j790J780
6737b997L193j182p27L64J257J044L38k184m74p71Q68O10K407q11j4R8N31q22
$$ plain form
6859 -944 -511 162 1385 2700 2452 1879 1447 1376 1535 2107 3091 3351 421 -1279 -125 62 212 23 -2601
6840 -2601 -4976 -4039 -1969 -2361 -1390 -1820 -891 -2148 -4656 -2808 1316 2115 645 -314 -89 -658 -1743
6823 -1743 -1092 -1600 -649 308 1702 3501 4297 3043 2082 4535 5649 4269 3514 2062 2176 1454 257
6806 257 -11 -227 307 3310 4875 4091 3378 3537 2306 1565 3302 3088 2086 4144 5047 4839 3453 407
6788 407 -531 -1219 129 925 2148 2580 439 -452 45 -1360 -1271 1599 2341 1755 2846 1839 2371 1970
6770 1970 -798 -2821 -3160 -625 2187 3619 1269 -433 1035 690 -683 -1905 -1944 -1849 -298 1831
6754 1831 2818 1812 1044 1260 2073 1456 2463 999 -641 -344 -286 152 906 -564 -2987 -4777 -2997
6737 -2997 196 -986 -1713 -1349 -92 952 1290 -894 -1368 -2139 -1271 -661 1746 935 921 1019 1550 728
6719G28R77j340j51Lj178P01K598j430K134J329k018k041j942k80K518j862Ml12
6701a562N17K202P49N5l16j94j616k017j057J041Q54j786J622K311j52j593J51
6684g91J492m40Q1n30m05L021j813k395J64L141Q50k523j345k084J126J776O99
6667B4p30j442n74n00K609J027J087P86j171p35j767K571L595j94l292m913j106
6650d725K98L391L765p02o30j3l049k079K195L000K292j901j425k524k956K040
6634c023J972K701P89k937l365r82Q14j91K674J662J171J078j219k092l27r90
6618b265n19J508o55j976J21J246L76P89K280k23p15k367K295K368m0K86j397
6601A112m47j500j632O97J722j78j128l46j448O56K73J124J749j107q7J237n00
$$ plain form
6719 728 1705 365 214 217 -961 -260 2338 908 3042 4371 2353 312 -1630 -1910 608 -1254 -1250 -1562
6701 -1562 -1045 1157 1906 1961 1645 1451 -165 -2182 -3239 -2198 -1344 -3130 -1508 803 651 -942 -791
6684 -791 701 261 342 -188 -593 2428 615 -1780 -1616 1525 2375 -148 -1493 -3577 -2451 -675 24
6667 24 -706 -2148 -2722 -3222 -613 414 1501 2287 1116 381 -1386 1185 4780 4586 1294 -3619 -4725
6650 -4725 -4427 -1036 2729 2027 1397 1384 -1665 -3744 -1549 1451 3743 1842 417 -2107 -5063 -3023
6634 -3023 -1051 1650 2439 -498 -3863 -4845 -4031 -4222 -1548 114 1285 2363 1144 -948 -1275 -2265
6618 -2265 -2784 -1276 -1931 -3907 -3786 -2540 -2164 -1375 905 682 -33 -2400 -105 2263 2223 2509 1112
6601 1112 665 -835 -2467 -1770 -48 -226 -1354 -1700 -3148 -2492 -2219 -1095 654 -453 -540 697 197
6584A97J368J148m50m021P12J653J385J862J008P89k451l23N93K078k780j812
6568I56j887k497K722J079j087j529J096J862O37K108Q85n27l007j892j87j126
6552b394M98J680K078J147N41j77k293j046l355R47O73N52K166O11R9q6J19k706
6534i46Q43J759J174j625k054j041N27p45K668k070j629J655O33Q51J256r13j7
6517C26p23j165o64J116K841j94k520k134j697m02J399K378n6J517J10k92j403
6500a563k037O02k70l00j048K504J331K678m88k42J809K22n90q07n68q03J469
6483A899r67J002M42K177L1k35m80j658N20K108N09j73J192j968o62J585l59l638
6465A325k536J321J838R99k88q16j0p44j169O12O23J555j776j751J155K37o3o24
$$ plain form
6584 197 1565 2713 2263 -1758 -1046 607 1992 3854 4862 5651 3200 2877 3470 5548 2768 956
6568 956 -931 -3428 -706 373 -714 -2243 -1147 715 1352 3460 4345 3818 811 -1081 -1268 -2394
6552 -2394 -1896 -216 1862 3009 3550 3373 1080 34 -3321 -2374 -1701 -1149 1017 1628 1727 1641 1760 -946
6534 -946 -103 1656 2830 1205 -849 -1890 -1363 -2108 560 -1510 -3139 -1484 -851 0 1256 343 326
6517 326 -397 -1562 -2226 -1110 1731 1537 -983 -3117 -4814 -5216 -3817 -1439 -1495 22 132 -160 -1563
6500 -1563 -3600 -2998 -3268 -3568 -4616 -2112 -781 1897 1409 1167 2976 3198 2608 1801 1233 430 1899
6483 1899 932 1934 2376 4553 4584 4349 3869 2211 2731 4839 5348 5175 6367 4399 3737 5322 4963 1325
6465 1325 -1211 110 1948 2947 2659 1843 1833 1089 -80 532 1155 2710 934 -817 338 575 512 -112
6447a12p26m01R48p40J057J842L86j027k160m74j318j00p81J97N93K458J08P3
6429a77m13K307J60O92j874j921j984R34R81j57j7J091m20j845l77K207J829k16
6411H00J0n89J147J222j292k38J721j955J807N04k742l356j88Q36J100o37K300
6394D50J040j762O21R21j98M40q72l817O61J852K618l91k520j167O98P09j228
6377a945r47M81Q39K854p3k956J005N82J106L464qk569l182m60N33K12J666P44
6359A346j385q1j401N4R49P74k43J194q40J824J358j645j874J934K534k109m13
6342A976L31o40k272J85Q07N34J805k91k679n65k58J345o95j057K188J571L76
6325B661o2j104k095k349J708J301J217J506j177l521k755K683o81r88K173J23
$$ plain form
6447 -112 -838 -1239 -291 -1031 26 1868 2254 1227 -933 -1407 -2725 -2825 -3606 -3409 -2816 -358 -250 -177
6429 -177 -590 1717 1877 2569 695 -1226 -3210 -2276 -1295 -1452 -1469 -378 -798 -2643 -3020 -813 1016 800
6411 800 810 221 1368 2590 1298 1060 2781 826 2633 3137 395 -2961 -3149 -2313 -1213 -1850 450
6394 450 1490 -272 349 1270 1072 1512 640 -3177 -2516 -664 1954 1563 -957 -2124 -1426 -717 -1945
6377 -1945 -2892 -2411 -1572 1282 1209 -1747 -742 -160 946 4410 4402 1833 -1349 -1809 -1276 -1064 602 1346
6359 1346 -39 -120 -1521 -1467 -518 256 13 1207 367 2191 3549 1904 30 1964 4498 2389 1976
6342 1976 2307 1667 -605 -420 387 921 2726 2435 -244 -809 -1067 278 -417 -1474 714 2285 2661
6325 2661 2599 1495 -600 -2949 -1241 60 1277 2783 1606 -1915 -4670 -1987 -2668 -3656 -1483 -1360
6309a360m45j23K300J920L27L96L80k679j242J179J672l7n06k182N54N63k936
6292b219m63J407J823O92J285j54j395k430j839o03J50P22K36J349J997P63r07
6275D14k48R94j393n02q06l75K482L263q63q01m52n23j768j964j892J899K485
6258e0J015k576K03L99j269P28K250R53N00k097j722K164R07j078J683k606j54
6241g50Q07L00m56j037J829O73k719q6K475K699M82o3Q25Qj289n49J656j408k105
6222A292p96K22L04j553p53Q86Q50o59m05o59O77O07j522j091Q50L453K049k396
6204A356j273J653j267p39R09O0j694J95Q04M9K13k75O35R68N15k021j325k650
6186c887P62N50J097M21M32K13R4J695j360J166O78j845k870j061l96J816J216
$$ plain form
6309 -1360 -1805 -1928 372 2292 2619 3015 3395 716 -526 653 2325 2288 1782 -400 154 717 -2219
6292 -2219 -2682 -1275 548 1240 2525 2371 976 -1454 -3293 -3896 -3746 -3024 -2788 -1439 558 1321 414
6275 414 166 1160 -233 -735 -1541 -1916 566 3829 2966 2165 1713 1190 -578 -2542 -4434 -2535 -50
6258 -50 965 -1611 -1408 -1009 -2278 -1550 700 1653 2153 56 -1666 498 1405 327 2010 -596 -750
6241 -750 57 357 -99 -1136 693 1366 -1353 -1439 1036 3735 4217 4154 4979 4987 3698 3149 4805 3397 1292
6222 1292 496 718 1022 -531 -1284 -398 452 -207 -612 -1271 -594 13 -1509 -2600 -1750 1703 3752 1356
6204 1356 83 1736 469 -270 639 699 -995 -800 4 53 266 -9 626 1594 2109 88 -1237 -3887
6186 -3887 -3125 -2575 -1478 -1057 -625 -412 -318 1377 17 1183 1861 16 -2854 -3915 -4311 -2495 -1279
6169a279J341K037O58m57n91PP86M03j918J6J092j488j670k107L612K37j367j128
6151a816J023K305Q57Q97k023j387K104J663N1j746n37n27L64l54j340K21L766
6134C521N9m08K860l23j954l546m58J937J83l22Q78M33pO39j255N90J766k81n99
6115C713J172k661j235j068l73K670R51k423J52m39j035L75j307R66O77K81k63
6098A53J796L433O59P72M8j111l213k214r14J44J417L47n90r27k206K8K686M44
6080G52m80k274q66R1K012J395J481k56n93j141k30j104j939j698m29R91K373
6063a915R3J432J942j357j510m63j088n32j346K521J944q9j678r77l42J894j55
6046a626P59K379J519P82j714k763k50J268L444o44q5J384j513k374n12N50o12
$$ plain form
6169 -1279 62 2099 2757 2300 1709 1716 2502 2905 987 1003 2095 607 -1063 -3170 442 679 -688 -1816
6151 -1816 -793 1512 2369 3266 1243 -144 1960 3623 3674 1928 1391 864 1228 874 -466 -245 3521
6134 3521 3580 3172 6032 5709 3755 209 -249 1688 1871 1549 2427 2860 2853 3492 2237 2827 4593 4312 3713
6115 3713 4885 2224 989 -79 -452 2218 3169 746 898 459 -576 -201 -1508 -542 135 416 153
6098 153 1949 5382 6041 6813 6861 5750 2537 323 -591 -447 970 1317 727 -200 -2406 -2378 308 752
6080 752 272 -2002 -2868 -2777 -765 630 2111 1855 1262 121 -109 -1213 -3152 -4850 -5279 -4288 -1915
6063 -1915 -1822 -390 1552 195 -1315 -1778 -2866 -3398 -4744 -2223 -279 -368 -2046 -3023 -3365 -1471 -1626
6046 -1626 -867 1512 3031 3813 2099 -664 -914 354 3798 3154 3069 4453 2940 566 54 604 -8
6029hL56l4j404j534j101n04K085M83p82j313J065J458R89J484O5k05J495p60
6011A835j298M29J281Q17j209R29M19O53k420j389m61L73j057r05J284K393K8
5994A702J82q71m39J047m78r57o8m75r81J46Q23J328j172k249q00j362l21L871
5976a074J845j083P8J987J152o99J037k681J00m61j141L72K612k490k801n77k97
5959d121J472K432Q7n72M9O13j63K20J450K885j050l163k532J587J167k473j211
5942c323n16J678M65j542J052j468J146J238j853J093J789O19J09j830J133R13
5926G03k531n17J654J392P37j917k51K850N41l130m9J186j102m732k8K802J765
5909f27j231k90Q2K808m1j180o2q6J411J373q59o45J68j620J146J752N33P30j517
$$ plain form
6029 -8 348 314 -1090 -2624 -3725 -4229 -2144 -1661 -2443 -3756 -2691 -1233 -244 1240 1305 1100 2595 1835
6011 1835 537 966 2247 3064 1855 2784 3203 3856 1436 47 -414 -41 -1098 -2003 -719 1674 1702
5994 1702 1884 1013 574 1621 1143 186 118 -357 -1338 -1192 -369 959 -213 -2462 -3262 -4624 -4945 -1074
5976 -1074 771 -312 -234 1753 2905 2206 3243 562 662 201 -940 -568 2044 -446 -3247 -3824 -4121
5959 -4121 -2649 -217 -130 -702 -653 -40 -203 17 1467 4352 3302 139 -2393 -806 361 -2112 -3323
5942 -3323 -3839 -2161 -1696 -3238 -2186 -3654 -2508 -1270 -3123 -2030 -241 378 487 -1343 -210 703
5926 703 -1828 -2345 -691 701 1438 -479 -730 2120 2661 -469 -518 668 -434 -5166 -5194 -2392 -627
5909 -627 -1858 -2148 -2066 742 701 -479 -541 -627 784 2157 1298 653 821 -799 347 2099 2632 3362 1845
5890A845k815j389r58l40K348K71k066R80Q74R19J284j38n0O74J023j24J002l682
5872c42l971L289l87j343r99J024Q20J299P17K272N93k269o32K86P91o82j794
5855a328j976o2J339L397K213l150j03J593j250l866p53R9J473K843J008P8j113
5838D42J393n54M23K132K190p4k715l18j958j673m67r22k51K925P23m28q84J696
5820A680L196J607l513k152k431o01J249J986q19j659L09q04n58R85L697K758
5804D930l581j074R96m68L26p46j663k349K297J680l82J16n99L89J35j152K79
5787h66K278j043p14p1j858j237L199K887L1M88r78j320j051k157k820K328O68
5770b236K306N08m34R82K9R77L4r70j113k380R87R50P30o80M50j185J159K42j083
$$ plain form
5890 1845 -970 -2359 -3317 -3657 -1309 -1038 -3104 -2124 -1250 -331 953 815 765 1439 2462 2338 3340 -342
5872 -342 -4313 -1024 -1411 -2754 -3753 -2729 -1909 -610 107 2379 2972 703 71 357 1148 466 -1328
5855 -1328 -3304 -3366 -2027 1370 3583 433 330 1923 673 -3193 -3946 -3847 -2374 469 1477 1555 442
5838 442 1835 1281 1704 3836 6026 5952 3237 2919 961 -712 -1179 -2101 -2352 573 1296 868 -16 1680
5820 1680 4876 6483 2970 818 -1613 -2214 -965 1021 202 -1457 -1148 -1952 -2510 -1525 2172 4930
5804 4930 1349 275 1271 803 1129 383 -1280 -3629 -1332 348 -34 82 -517 -128 7 -1145 -866
5787 -866 1412 369 -345 -416 -2274 -3511 -312 2575 2606 3094 2116 796 -255 -2412 -5232 -2904 -2236
5770 -2236 70 578 144 1126 1155 2132 2166 1196 83 -2297 -1310 -360 370 -310 140 -1045 114 356 -727
5751g27p29n23j68O35n92j980J42k34Mn49J643J935j498l528k059L143L274K41
5733a570m5J520K130j12m164J30p30q2L179K778j784k553L73J232K197j958l830
5716c289j375N55O61L53p57N46R87J478K18J018j061j76j28j343j213K58l86l73
5698d027k11j416J087L379P07j314j444J273o63Q15Q82K247O74P39J696j341k607
5681D76k133K3Q13M14J933J395l52j418m85J04J922k48n51l44R00K438l088m462
5663b663p8R53l40n76L446L014O7l280m37O90j137m7J5J765j194k245J055K390
5645A398j416O90L89P42l27k785R22K675M17m489m774J963K510K844m18j262j984
5628b905j151r52n43q25Q79J559J760Q87Q98l0J51j303m99R6J127j80J444k63
$$ plain form
5751 -727 -1456 -1979 -2147 -1512 -2104 -4084 -3942 -4176 -4172 -4721 -3078 -1143 -2641 -6169 -8228 -5085 -1811 -1570
5733 -1570 -1615 -95 2035 1923 -2241 -2111 -2841 -2923 256 3034 1250 -1303 -930 302 2499 541 -3289
5716 -3289 -4664 -4109 -3448 -3095 -3852 -3306 -2319 -841 -623 395 -666 -842 -970 -2313 -3526 -3268 -3654 -4027
5698 -4027 -4238 -5654 -4567 -1188 -481 -1795 -3239 -1966 -2629 -1814 -932 1315 1989 2728 4424 3083 476
5681 476 -1657 -1634 -821 -407 1526 2921 2569 1151 666 770 2692 2444 1893 1549 2449 4887 1799 -2663
5663 -2663 -2741 -1788 -2128 -2704 742 3756 3823 543 106 796 -341 -388 -373 1392 198 -2047 -992 1398
5645 1398 -18 672 1061 1803 1476 -1309 -387 2288 2705 -1784 -6558 -4595 -2085 759 341 -921 -2905
5628 -2905 -4056 -5008 -5551 -6376 -5497 -3938 -2178 -1291 -393 -423 -272 -1575 -2074 -1978 -851 -1031 413 150
5610A50N04J440K477K4k269j349k617r98R11Q02J24O60l81r31j228j56P2O84K031
5591e0p39k420N89R74J335L27M55l37j50L12J319m18j352K79j661j099j162n19
5573d317K192Q48j237L056Q88j449O40J504j213n101l330K234J907q68L09j592
5557e529j180K006q6J640J308J258o3m94R33j72k9K91l17n98J067k70J805J76
5539A746K30j627J423j248j793j495k104j01J671m35q78k08L84O66J648K424o93
5522c90l2j32k471k680L68j65L0m65O18J585K491J628J26M12j809k42R20N91M48
5503H31L70J128R09l10J765P3P71K53K805j833l181l394j725k582J272O86k76
5486b438J023O49Q86M45R26O85Q72R11N99q45k470k491K006Q41l460o61K374P20
$$ plain form
5610 150 654 2094 4571 4595 2326 977 -1640 -2638 -1727 -925 -801 -141 -522 -1453 -2681 -2837 -2765 -2081 -50
5591 -50 -789 -3209 -2620 -1646 -311 16 471 134 -16 296 1615 1197 -155 124 -1537 -2636 -3798 -4317
5573 -4317 -2125 -1277 -2514 542 1430 -19 621 2125 912 -4189 -7519 -5285 -3378 -4246 -3937 -5529
5557 -5529 -6709 -4703 -4789 -3149 -1841 -583 -646 -1140 -207 -379 -408 -117 -434 -1032 35 -235 1570 1746
5539 1746 1976 349 1772 524 -1269 -2764 -4868 -4969 -3298 -3733 -4611 -4819 -4435 -3769 -2121 303 -390
5522 -390 -422 -554 -3025 -5705 -5337 -5502 -5472 -5937 -5319 -3734 -1243 385 511 923 -886 -1128 -208 383 831
5503 831 1201 2329 3238 2928 4693 4766 5537 5790 8595 6762 3581 187 -1538 -4120 -2848 -2162 -2438
5486 -2438 -1415 -766 120 565 1491 2176 3048 3959 4558 3713 1243 -1248 758 1599 -1861 -2522 -148 572
5468E72r39O89j331p98K73J173J699J3L83N47K518n36j018j127k496r87J463J574
5450A672J099o10q52j432k97L21N33O29p61q2m88m98j692k875J580M07N87J618
5432a141n00k367N21o6j36K286K413j168j036Q77l57J177K581K831l60n567P75
5415G63J014j511j10K591O19l454m53K001J877Q81o69j521k365j103J683P85n96
5398D32M46q55j569n15m28J757q06q21K918J582k158J547L02j700P75J361M17
5381B685j128p0R1K829q34m01j674r86l42k17q54J275p8j758j264K69J526K643
5363A712J478j420J20p3j913J57j108J652O19J09o66J942K82j607k418N09N25
5346a00j006N7K497K24k778j293K46J768J547j54Q53r38j089J767J293o78q0K077
$$ plain form
5468 572 -367 322 -1009 -1807 -1534 -361 1338 1351 1734 2281 4799 4263 3245 2118 -378 -1365 98 1672
5450 1672 2771 2161 1309 -123 -420 -99 434 1063 302 220 -268 -766 -2458 -5333 -3753 -3346 -2759 -1141
5432 -1141 -1641 -4008 -3487 -3553 -3689 -1403 1010 -158 -1194 -317 -674 503 3084 5915 5555 -12 763
5415 763 1777 266 156 2747 3366 -88 -541 1460 3337 4218 3549 2028 -337 -1440 243 1028 432
5398 432 878 23 -1546 -2061 -2489 -732 -1538 -2359 559 2141 -17 1530 1832 132 907 2268 2685
5381 2685 1557 1487 1578 4407 3573 3172 1498 512 170 -47 -901 374 296 -1462 -2726 -2457 -931 1712
5363 1712 3190 1770 1890 1817 -96 61 -1047 605 1224 1333 667 2609 2891 1284 -1134 -625 -100
5346 -100 -1106 -1049 1448 1672 -1106 -2399 -2153 -385 1162 1008 1861 923 -166 1601 2894 2216 2136 4213
5328D213K702k331l209j297J190n33k204p85J542k646n95q40J761J907P38J363
5312I76J1r04k125j997K81K186Q33R07K257l361j748L070K026J624J98l29J312
5295E217k766l174N32m54p44P12K346j47p6Q97m03l640j252j175J60J003j823
5278d787p90K557J912j539n12K58J636N91K248J528M02Q05j9k062k381j774k74
5261b201L401J856k810j777K514Q45k828L22q28p12J101L248K42j96j566M58n75
5244D94j480R48Q52r69p88k962j91J597J776L775M29k921J495k56j141K16n69
5227C05k133j176m88Q14J874j84R04O15j561J207J409j451j188q08K448K698l20
5210B965j622K234j841j017j784pO38J996J108j112r87L73k098J224Q39k798o26
$$ plain form
5328 4213 6915 4584 1375 78 1268 735 -1469 -2254 -712 -3358 -3953 -4793 -3032 -1125 -387 976
5312 976 987 83 -2042 -4039 -3758 -1572 -739 168 2425 -936 -2684 386 2412 4036 4234 3905 5217
5295 5217 2451 -723 -191 -645 -1389 -677 1669 1522 1446 2343 1940 -1700 -2952 -4127 -3967 -2964 -4787
5278 -4787 -5577 -3020 -1108 -2647 -3159 -2901 -1265 -674 1574 3102 3504 4309 4290 2228 -153 -1927 -2201
5261 -2201 1200 3056 246 -1531 983 1828 -1000 -678 -1506 -2218 -1117 2131 2373 2177 611 1069 494
5244 494 -986 -38 814 -155 -943 -3905 -4096 -2499 -723 3052 3481 560 2055 1799 658 874 305
5227 305 -1828 -3004 -3492 -2678 -804 -988 -84 531 -1030 177 1586 135 -1053 -1861 587 3285 2965
5210 2965 1343 3577 1736 719 -1065 -1072 -434 1562 2670 1558 571 944 -1154 70 909 -1889 -2515
5193b515k16J993j761j03r99K62J218R07P62J440l02Q83J172m40q93k091L040
5176B357j707p07K52p95n32P54N65N92j775N99m29j256r63J929K124O59J027J80
5158B874P4j988p70K139J111q85j816o68J967P1l70j664J433J540K77m1o73m45
5140B166o8j442j113m75k097J506K075j160j353k902j60L866j056n05m14J347
5124a785N53J792J195j248j253q14k750n50J014J224L76j119K387P82k41L396
5108B959J8k778j912M78O94J266K5j232l6j333J216K990R36j367j206J216q39
5091A095J21J657K99l266j343L352P05j879r66k81K45J343q75m09J363p86j282
5074i07r8J758J445k244j973J110j587J667m7k98l29o9j265p13J974J712k275
$$ plain form
5193 -2515 -2731 -738 -2499 -2602 -3601 -3339 -2121 -1214 -452 988 686 1569 2741 2301 1408 -683 2357
5176 2357 650 -57 195 -600 -1132 -378 187 779 -996 -397 -826 -2082 -3045 -1116 1008 1667 2694 2874
5158 2874 2948 960 190 2329 3440 2555 739 71 2038 2109 1739 75 1508 3048 3325 3284 2611 2166
5140 2166 2098 656 -457 -932 -3029 -1523 552 -608 -1961 -4863 -5023 -1157 -2213 -2718 -3132 -1785
5124 -1785 -1232 560 1755 507 -746 -1560 -4310 -4860 -3846 -2622 -2246 -3365 -978 -196 -437 2959
5108 2959 2977 199 -1713 -1235 -541 725 750 -482 -518 -1851 -635 2355 3291 1924 718 1934 1095
5091 1095 1216 2873 3172 -94 -1437 1915 2620 741 -225 -506 -261 1082 207 -202 1161 375 -907
5074 -907 -1005 753 2198 -46 -2019 -909 -2496 -829 -876 -1174 -1503 -1572 -2837 -3550 -1576 136 -2139
5057b139l85J393J59K135R82K85j696o52M60M82r49j405J29O96Q97J804j384o8
5039G44l69O14m84l15J907J516l787j988o13J203K517j057q3J246Q21k507k718
5022c353k57M85J92K224L668K584q07l522l387r74J510J161L47j51o54l8p98n43
5004b313J356J976q29j028O39J453p67j278j224q36j278m04Q74K369j003k359
4988d652J005L051J258n17r94o12J198J380k699j220m59j025R72J713J632l36
4972c05K79P60R53p29o6K38j859j458r28J576M20j317q52K008P60n23k41j829
4954c113O22J982K092k891k041P85K697J280L308j427k193j343k023J19N70L13
4938a263O07R53M77j849k168P67n58p16J140L556K109j980k07j477k690q88J602
$$ plain form
5057 -2139 -2524 -1131 -972 1163 2145 2430 734 82 542 1024 75 -1330 -1201 -505 392 2196 812 744
5039 744 375 989 505 190 2097 3613 -174 -2162 -2775 -1572 945 -112 -195 1051 1872 -635 -3353
5022 -3353 -3610 -3125 -2933 -709 2959 5543 4736 1214 -2173 -3147 -1637 -476 -129 -280 -934 -972 -1770 -2313
5004 -2313 -957 1019 190 -838 -199 1254 487 -791 -2015 -2851 -4129 -4533 -3659 -1290 -2293 -4652
4988 -4652 -3647 -596 662 145 -849 -1461 -263 1117 -1582 -2802 -3261 -4286 -3314 -1601 31 -305
4972 -305 -26 734 1687 958 892 1130 -729 -2187 -3115 -1539 -1119 -2436 -3288 -1280 -520 -1043 -1284 -3113
4954 -3113 -2491 -509 1583 -1308 -3349 -2564 133 1413 4721 3294 1101 -242 -2265 -2146 -1576 -1263
4938 -1263 -656 297 774 -1075 -3243 -2476 -3034 -3750 -2610 946 3055 1075 868 -609 -3299 -4187 -2585
4921b585l625K80K159J8j59K763K408j28l691o62J107q4j662J165L356J901j380
4904A181j358J58m10j048j517j032m04n56J495L092J937R99J191k770j035p0N05
4887C58K108j841p15N09j160n13R2J292l73l86k621n87J072J995L0k200K582J070
4869G12j078j050j849n60K331K116L44q7P29o1j129J131j454n10j95J027M13k161
4851a331J005K212P6l23Q80j455lJ720k109Q51j301l68J034L36J586J436p73j676
4833A797o38LO08j252r68k043J963K057M73j237l92k378j345J514J411m35j136
4816a998R4J380K707j559l767j48J799J334j363L00M05l17Q1O56l6j405p59K913
4798C17l00k832L74r39p90J647L872j130j373Q80j068K02j331J228N40J408J091
$$ plain form
4921 -2585 -6210 -5930 -3771 -3753 -3912 -1149 1259 1131 -2560 -3222 -2115 -2199 -3861 -2696 660 2561 1181
4904 1181 -177 -19 -429 -1477 -2994 -4026 -4430 -4986 -3491 -399 1538 2537 3728 958 -77 -147 358
4887 358 2466 625 -90 419 -741 -1254 -1162 130 -243 -629 -3250 -3837 -2765 -770 -740 -2940 -358 712
4869 712 -366 -1416 -3265 -3825 -1494 622 966 879 1608 1547 418 1549 95 -415 -610 417 830 -1331
4851 -1331 -326 1886 1962 1639 2519 1064 1061 2781 672 1523 222 -146 888 1224 2810 4246 3473 1797
4833 1797 1159 1162 1770 518 -450 -2493 -530 1527 2000 763 371 -2007 -3352 -1838 -427 -862 -1998
4816 -1998 -1904 -524 2183 624 -3143 -3291 -1492 -158 -1521 -1221 -816 -1133 -1052 -396 -432 -1837 -2596 317
4798 317 17 -2815 -2441 -3380 -4170 -2523 1349 219 -1154 -274 -1342 -1140 -2471 -1243 -703 705 1796
4781A796J099l49n38j590j457R55K392j963j579N90J405j80j816j144o04J98J408
4764a377P60K32O38j098m57J123K040j230k064j271J692J75o22o92m38J95L25
4747b069L614j032O46q51m20j189Q39P20q56n79j935J560J753J194j632j847J886
4730a98K12j9j356j871R81K077N00K255k224k933M9J638R85K531M98K5K45J616
4712E011L79j961j46J604j929j383K66j123l181k407K423L080r92o86j596j79
4696b820k56R23K066Q00M96o10j35j648k842l47Q05j011k73K872M04Q80j089q59
4678b644J09L469K052l22j080l937J56J622j29N45j042r09J685J265O34k45k39
4661I90N90k537j099Q39Q35p17q97j99K155j231J03N18J124O61j042l25L68J680
$$ plain form
4781 1796 2895 2546 2008 418 -1039 -84 2308 345 -1234 -644 761 581 -1235 -2379 -2983 -2785 -1377
4764 -1377 -617 -385 253 -845 -1302 -179 1861 631 -1433 -2704 -1012 -837 -1459 -2151 -2589 -2394 -2069
4747 -2069 1545 513 1159 308 -112 -1301 -462 258 -598 -1177 -3112 -1552 201 1395 -237 -2084 -198
4730 -198 14 -5 -1361 -3232 -2251 -174 326 2581 357 -2576 -2527 -889 96 2627 3125 3150 3395 5011
4712 5011 5390 3429 3283 4887 2958 1575 1841 718 -2463 -4870 -2447 633 -359 -1045 -2641 -2820
4696 -2820 -3076 -2153 -87 713 1209 599 464 -1184 -4026 -4373 -3568 -4579 -4852 -1980 -1576 -696 -1785 -2644
4678 -2644 -2535 934 2986 2664 1584 -2353 -2197 -575 -704 -159 -1201 -2110 -425 840 1474 1229 990
4661 990 1580 -957 -2056 -1217 -382 -1099 -1996 -2195 -40 -1271 -1168 -650 474 1135 93 -232 136 1816
4643A816J420M66p31j446j383K140J238r97k092r30K507m27k696p34j956J440
4627b365K285P67j377j678J276J406j169J02J453j171k275l69J061m5M06R94o81
4610a380j588j357l31j136J694L451m50J296o02j057L39m75J020o74p98k73k52
4593b573J775K99O88l026l257R80M454J222l544k06K995N80j360j659P17K565
4577F50J733j905j2p49j321n63k56M36J198J619K09j896M84J2K415L32R4m58j068
4558I54j672l680P72M82l49J866R90o24o52L6J95o13K47J403P99j515j825L23
4540b863k99K271J737M81j273O51m47J490N6k005j194Q49Q44j539k407Q72K465
4523c11l68J882J069j482r25r83m17J331K121j465k154K18J232K01k055N34k876
$$ plain form
4643 1816 3236 3702 2971 1525 142 2282 3520 2523 431 -499 2008 1581 -1115 -1849 -3805 -2365
4627 -2365 -80 687 -690 -2368 -1092 314 -855 -753 700 -471 -2746 -3115 -2054 -2099 -1693 -699 -1380
4610 -1380 -2968 -4325 -4656 -5792 -4098 -647 -1097 199 -403 -1460 -1121 -1596 -576 -1250 -2048 -2321 -2573
4593 -2573 -798 -499 189 -2837 -6094 -5114 -660 562 -2982 -3188 -193 387 -973 -2632 -1915 650
4577 650 2383 478 466 -283 -1604 -2167 -2423 -1987 -789 830 1039 -857 -373 -361 2054 2386 2480 2022 954
4558 954 -718 -4398 -3626 -3144 -3493 -1627 -637 -1261 -1913 -1877 -1682 -2295 -2048 -645 154 -1361 -3186 -2863
4540 -2863 -3162 -891 846 1327 54 705 258 1748 1804 -201 -1395 -546 298 -1241 -3648 -2776 -311
4523 -311 -679 1203 2272 790 -135 -1118 -1535 -204 1917 452 -1702 -1484 -252 -51 -2106 -1572 -4448
4506d448J555O25P66J776M475j397k564j239J79J939N32j752j362j998J473L016
4490A576J27J857M4j393r65l055j226j763O84J485O47J561K195R09j018k208k471
4473c014Q53L285J681P85j024j088j271n95Q98N40p25J328j188J423j794k137
4457b043J823J901R28j742j668j637J15J333p70J332J735m92n10J497n96k592
4441a386l85p57N16R50j760q64M16L231J856K154M74l095R63M81j804q75L08M64
4423H87j36m59j829k854J262J306k46j53k188m12m68K118J62K287J750J26K6j626
4405d47k140L66J673J644J118l663p2L23o78J694J400N08j662k578j483j636Q85
4388d748L543J101l39J830J048l45o26k218k451K56k25J064J105K585J740R19
$$ plain form
4506 -4448 -2893 -2268 -1502 274 4749 3352 788 -451 -272 1667 2199 447 -915 -2913 -1440 1576
4490 1576 1703 3560 3604 2211 1246 -1809 -3035 -4798 -4114 -2629 -1982 -421 1774 2683 1665 -543 -3014
4473 -3014 -2161 1124 2805 3590 2566 1478 207 -388 510 1050 325 1653 465 1888 94 -2043
4457 -2043 -220 1681 2609 867 -801 -2438 -2323 -990 -1760 -428 1307 815 305 1802 1206 -1386
4441 -1386 -1771 -2528 -2012 -1062 -2822 -3686 -3270 -39 1817 3971 4445 1350 2313 2794 990 115 423 887
4423 887 751 292 -1537 -4391 -3129 -1823 -2069 -2222 -4410 -4822 -5290 -3172 -3010 -723 1027 1153 1179 -447
4405 -447 -2587 -2221 -548 1096 2214 -1449 -1521 -1198 -1876 -182 1218 1726 64 -2514 -3997 -5633 -4748
4388 -4748 -1205 -104 -443 1387 2435 2090 1464 -754 -3205 -2949 -3174 -2110 -1005 1580 3320 4239
4372D239j055N54l226k125j614o60l215p37J814K669R52K484r16r19J48J562K15
4355A70j503o39J831J679n97P73K386J002q00M59Q50n18j062k187l564l268R12
4338d076K685K256j924j898o86N43O01Q62Q56j638l58J79J161N89p05o38l6J64
4320b063L556J251j193j795j176j544j707j867k16K076J024N70J192o4j021j23
4304c100k519j111M90p95r88K977J630j1J047K325M0j432J91R09q32j333K179
4287c33K627j350k736j362J861Q65o14J466L54n34R05N37M98k65R83O47k293k150
4269h94J106R60j213p21l35K23J48R69o80k76L181o54j769j724J806L727R18l428
4251A344j260j546R03K272q40j251n05j516l057j814K396Q89J204p05L732L178
$$ plain form
4372 4239 3184 3738 512 -1613 -3227 -3887 -7102 -7839 -6025 -3356 -2404 80 -836 -1755 -1607 -45 170
4355 170 -1333 -1972 -141 1538 941 1714 4100 5102 4302 4761 5611 5093 4031 1844 -1720 -4988 -4076
4338 -4076 -1391 865 -1059 -2957 -3643 -3100 -2499 -1637 -781 -2419 -2777 -2598 -1437 -848 -1553 -2191 -2227 -2063
4320 -2063 1493 2744 1551 -244 -1420 -2964 -4671 -6538 -6754 -4678 -3654 -3084 -1892 -1956 -2977 -3100
4304 -3100 -5619 -6730 -6240 -7035 -8023 -5046 -3416 -3427 -2380 -55 -15 -1447 -1256 -347 -1179 -2512 -333
4287 -333 2294 944 -1792 -3154 -1293 -428 -1042 424 778 244 1149 1686 2184 1919 2902 3549 1256 -894
4269 -894 212 1172 -41 -762 -1097 -874 -726 243 -437 -713 2468 1814 45 -1679 127 3854 4772 1344
4251 1344 84 -1462 -559 1713 873 -378 -883 -2399 -5456 -7270 -4874 -3985 -2781 -3486 246 3424
4235C424r30j822q32J742O53j845j087R16k751j993K008Q91J074j960J75k880
4219e217J74K209n44J593J502R86J020J143J141l301j819K348N19k920N61J681
4203A076K248k203k691K331L21n5p47j336j858j512J41j236J33L402J233r5j478
4186b326k136J351j87R01J154J53j089k044p33Q33J980k448p32K830J347L40n36
4169a342J335K261j893r18J788p16p7k335j214N04K883M56J004K56K538J72m650
4152E2k647J106j643O21J532k97M00J737j591l573l67q10J57N44k07J941K539
4135e06l89j144J99K839J561j326k851L0J894Q78N57q68K172k256k120j910k139
4118e379O55K724K189k43l666J577J376J037L64j09p15L96N43k126j783K92J09
$$ plain form
4235 3424 2494 672 -160 1582 2235 390 -697 219 -2532 -4525 -2517 -1626 -552 -2512 -2337 -5217
4219 -5217 -5043 -2834 -3378 -1785 -283 703 1723 2866 4007 706 -1113 1235 1754 -1166 -605 1076
4203 1076 3324 1121 -1570 761 1082 1027 280 -1056 -2914 -4426 -4285 -5521 -5388 -1986 -753 -848 -2326
4186 -2326 -4462 -3111 -3298 -2397 -1243 -1090 -2179 -4223 -4956 -4123 -2143 -4591 -5323 -2493 -1146 -806 -1342
4169 -1342 -7 2254 361 -557 1231 515 438 -1897 -3111 -2607 276 732 1736 1992 4530 4702 52
4152 52 -2595 -1489 -3132 -2511 -979 -1276 -876 861 -730 -4303 -4670 -5480 -5323 -4779 -4986 -3045 -506
4135 -506 -895 -2039 -1840 999 2560 1234 -1617 -1587 307 1185 1742 874 3046 790 -1330 -3240 -5379
4118 -5379 -4724 -2000 189 -54 -3720 -2143 -767 270 634 525 -190 206 749 -1377 -3160 -2868 -2759
4101b759J802k88l77n33J668P18L72j2j947k378K267P39j107m72P00K891k329
4084a045m56J412O07o55K72p50Q38J98K51j376j84l50j57K420k375j632JJ185
4066a796n66j248J474l13j336K746K115l68j567q43M76J849P18k350J000n73K010
4049A428R53j958l507j006j746O40J209J410J984M11l27q79j671k45R2l84j087
4032d683O34k7j20K483K546o5j967m22J041J58J506N96M84j945k150J149K57J906
4014A381q29j479k169L62K050o22r84m21K020j064O30O06k37N89P03m29l67L8
3996b22o66J44O98K424q69p32j091j994J612J346p75K26J099r2j405j22J414N21
3978A516m87m72J100p84k122N32P18K88M92k03k25j577j716M86K625J820J956
$$ plain form
4101 -2759 -957 -1245 -1622 -2155 -487 231 603 591 -1356 -3734 -1467 -728 -1835 -2307 -1607 1284 -1045
4084 -1045 -1501 -89 518 -137 135 -615 223 421 672 -704 -888 -1238 -1395 1025 -1350 -2982 -2981 -1796
4066 -1796 -2362 -3610 -2136 -2449 -3785 -1039 1076 708 -859 -1702 -1226 623 1341 -1009 -9 -582 1428
4049 1428 2381 423 -3084 -4090 -5836 -5196 -3987 -2577 -593 -182 -509 -1388 -3059 -3304 -3212 -3596 -4683
4032 -4683 -4049 -4076 -4196 -1713 833 768 -1199 -1621 -580 -422 1084 1680 2164 219 -1931 -782 -525 1381
4014 1381 552 -927 -3096 -2734 -684 -1306 -2290 -2711 -691 -1755 -1125 -519 -756 -167 536 107 -260 -222
3996 -222 -888 -744 -46 2378 1509 777 -314 -2308 -696 650 -125 101 1200 1108 -297 -419 995 1516
3978 1516 1029 557 1657 873 -1249 -717 1 289 781 578 353 -1224 -2940 -2454 171 1991 3947
3961C947j365l187P7r38L24R58O05j634o18k690k34L498J921M85p8k246j851P18
3943b308k18j489O28k343o45J990J486J400n84L35J722l016j020k46K705r1k39
3926a933J893q36Q71P28n90K91Q48J523j266j084M96J775L86j529q46k97q96r42
3908a408K79n90R26J842J044k840j617R37K161K87n93j390k06M68Q5J342J639
3891B366M73j280J88j715j086J56J66j174j573K272L81J74P8j7o84o01M35O21
3873h20O69r79k270j835j029K380J567q52K08Q93p97j593J597J710J317J505J569
3856C240j130R22k14j831q60K826R65j133k483k393r10J441P98j320n04N74n80
3839b592N40K419p47j382J293q09n80J22O45K913Q7q43N42p37k535J451J252J199
$$ plain form
3961 3947 2582 -605 -528 -1466 -1142 -184 421 -1213 -1831 -4521 -4755 -1257 664 1149 1071 -1175 -3026 -2308
3943 -2308 -2526 -4015 -3387 -5730 -6375 -4385 -2899 -1499 -2083 -1748 -26 -3042 -4062 -4308 -1603 -1694 -1933
3926 -1933 -40 -876 -5 723 133 424 1272 2795 1529 445 941 2716 3102 1573 727 430 -466 -1408
3908 -1408 -1129 -1719 -793 1049 2093 -747 -2364 -1427 734 1021 428 -962 -1168 -700 -615 727 2366
3891 2366 2839 1559 1747 32 -1054 -898 -732 -1906 -3479 -1207 -826 -652 -574 -591 -1275 -1876 -1441 -820
3873 -820 -151 -1130 -3400 -5235 -6264 -3884 -2317 -3169 -2961 -2068 -2865 -4458 -2861 -1151 166 1671 3240
3856 3240 2110 3032 2818 987 127 2953 3918 2785 302 -2091 -3001 -1560 -762 -2082 -2586 -2012 -2592
3839 -2592 -2052 367 -380 -1762 -469 -1278 -1858 -1736 -1091 1822 1909 1066 1608 871 -1664 -213 1039 2238
3821B238O91R30L03p28j016j601R47L15J12l53j332j455m54L25J293j240J46n19
3803a398J11J566N61q37J105j189j874M62K078J510L51j314j777j140k4J881j38
3786f6q61K049o52j836J009K25P9R05K767j38p7j468k940J06M12q2q81j103r39
3767c491r38K194Q81l29o02J388K240K709K030j277j921k00k140l623j15J948
3751a246R76R4N49j117k096K467J715R47r15r21j938l32J526Q11j174k968Q03
3734b819J869J660M65j607K16L23K751K7N0p99j936k75j767j111r86J39K747P28
3716c25m29J307j380k81k08Q73J029L19q56j768rJ284Q29K93j442r1L014K05O04
3697B968m53L18Q65k834l752m69J612J172q05J779Q26j153j877K709l00k90J762
$$ plain form
3821 2238 2929 3859 4162 3434 2418 817 1764 2079 2191 1838 506 -949 -1403 -1078 215 -1025 -879 -1398
3803 -1398 -1287 279 840 3 1108 -81 -1955 -1493 585 2095 2446 1132 -645 -1785 -1809 72 -66
3786 -66 -927 1122 470 -1366 -357 -132 -53 852 3619 3481 3404 1936 -1004 -898 -486 -568 -1449 -2552 -3491
3767 -3491 -4429 -2235 -1354 -1683 -2285 -897 1343 4052 6082 4805 2884 2684 544 -3079 -3194 -1246
3751 -1246 -270 -176 373 -744 -2840 -373 1342 2289 1374 453 -1485 -1817 -291 520 -654 -3622 -2819
3734 -2819 -950 710 1175 -432 -216 107 2858 2885 2935 2136 200 -75 -1842 -2953 -3939 -3800 -1053 -325
3716 -325 -754 553 -827 -1108 -1316 -443 586 905 49 -1719 -1728 -444 385 678 -764 -855 2159 2364 2968
3697 2968 2515 2833 3698 864 -2888 -3357 -1745 -573 -1378 401 1227 74 -1803 906 606 316 2078
3680B078q50j678J206J064R15l3J402p82R54r98j407p0k111J159J198N6J6R94
3662C113j794j601K313N47k53l99k00j726k493n80o0P77M59J41K773P06Q38q38
3644A723n5j884j047K51N13L034J79n46K207K099r09k143j344k86k378J4J390
3627H18q68M05p14N26j038j96J566J097K198o33l453J354j350L92j255o62n7J655
3609b15J985L12j252j359Q65J526q65j320Q49j394O96J175J08P53J377J035J07
3592D383k217j745K450O43j720o15p59m10J605M61n60J55j114q71o09K20J075
3575C72N02r07n44L460Q11o83k499j125o98k880j951k72O30J479j71K402J914
3558a60J735j856n87R85j589j244R67J352j11j224q38R28K120J696J543p51o58
$$ plain form
3680 2078 1228 -450 756 1820 2735 2702 4104 3322 4276 3278 1871 1801 -310 849 2047 2103 2119 3113
3662 3113 1319 -282 2031 2578 2325 1926 1726 0 -2493 -3073 -3133 -2356 -1897 -1756 1017 1723 2561 1723
3644 1723 1668 -216 -1263 -1012 -499 2535 2714 2168 4375 6474 5565 3422 2078 1792 -586 -572 818
3627 818 -50 355 -359 167 -871 -1067 499 1596 3794 3161 -292 1062 -288 104 -1151 -1813 -1870 -215
3609 -215 1770 2082 830 -529 336 1862 997 -323 526 -868 -172 1003 1111 1864 3241 4276 4383
3592 4383 2166 421 2871 3514 1794 1179 420 10 1615 2076 1516 1671 557 -314 -923 -703 372
3575 372 874 -33 -577 2883 3694 3011 512 -613 -1311 -4191 -6142 -6414 -5784 -4305 -4476 -2074 -160
3558 -160 1575 -281 -868 117 -1472 -2716 -1749 -397 -508 -1732 -2570 -1642 478 2174 3717 2966 2308
3541B308m01j128P15M58l134j115n89J120K962j606n15j125p88K035K591J661
3525C449J428l647j900o92L358J346j557L9P54J699q14k153l184l94K839p78r2
3508b99L335j135m358j225N82J039p22j179N9l13M4L623J389k033n60P36j472
3491b489N45J010m00q8n47r61L84r06L48K539J915j891j20P64k051q34Q27r57
3473b912J594j91r77J60K954j350k772K58K270m0p33k565p71K761L256N86q20
3456G08j640O05J249K151l36k422l253j402k7K720K113J342k460J73J268K455
3440C244J907k150j918k611p24J574M98L65J789j99J925j315j405p13j856k105
3424c694j803m75J378N79J830L647K21M72L14m45o44n23M5Q05J59Q11k183j607
$$ plain form
3541 2308 1907 779 1494 1952 -1182 -2297 -2886 -1766 1196 -410 -925 -2050 -2838 -803 1788 3449
3525 3449 4877 1230 -670 -1362 1996 3342 1785 1824 2578 4277 3463 1310 -1874 -2268 571 -207 -299
3508 -299 3036 1901 -2457 -3682 -3100 -2061 -2783 -3962 -3903 -4216 -4172 -549 840 -1193 -1753 -1017 -2489
3491 -2489 -1944 -934 -1334 -1422 -1969 -2930 -2546 -3452 -3104 -565 1350 -541 -661 103 -1948 -2782 -1955 -2912
3473 -2912 -1318 -1509 -2486 -2326 628 -722 -3494 -3236 -966 -1006 -1739 -4304 -5075 -2314 942 1528 708
3456 708 -932 -327 922 3073 2737 315 -2938 -4340 -4367 -1647 466 1808 -652 -479 789 3244
3440 3244 5151 3001 1083 -1528 -2252 -678 -180 185 1974 1775 3700 2385 980 267 -1589 -3694
3424 -3694 -5497 -5972 -4594 -4015 -2185 1462 1683 2155 2469 2024 1380 857 902 1707 1866 2677 494 -1113
3406a113m79r21J330L100n52p55L6j80p4k208k808J834K729J768k456J045m2j451
3388a197K265J840m00J760J423j157j714j322N46j082j116n9L10J770N99k796
3372c30L55K603j934k631J169k227M57L155n13q35K59N65J041l48J85k04J468
3355B235O91k94k92o61J517j75m40j134r40j511q99K557L727O91j894j029Q47
3338B996J621j614n441q56L748K535j223j51P3j610n65K093l35P28P15J00j920
3321H94R34K679o09l015P97K518k268l158K06K539l02m54k672j338J132M72J520
3304a25m09l395l97n13j177L613L477n33O58l18K440K203p88j754j497l061l48
3287a924K834R85k66l06j36J595o98j836n53k389J35K537J483K623J20k52k118
$$ plain form
3406 -1113 -1592 -2513 -1183 1917 1365 610 646 466 392 -1816 -4624 -2790 -61 1707 -749 296 254 -1197
3388 -1197 1068 2908 2508 4268 5691 4534 2820 1498 2044 962 -154 -213 97 1867 2466 -330
3372 -330 25 2628 694 -1937 -768 -2995 -2538 617 104 -731 -472 93 1134 786 971 767 2235
3355 2235 2926 2632 2340 1679 3196 3021 2581 1447 507 -1004 -1903 654 4381 5072 3178 2149 2996
3338 2996 4617 3003 -2438 -3294 454 2989 1766 1615 1688 78 -487 1606 1271 1999 2714 2814 894
3321 894 1828 4507 3898 883 1680 4198 1930 -1228 -1022 1517 1215 761 -1911 -3249 -2117 -1645 -125
3304 -125 -534 -3929 -4326 -4839 -6016 -2403 1074 541 1199 881 3321 5524 4736 2982 1485 -1576 -1924
3287 -1924 910 1895 1629 1323 1187 2782 2084 248 -305 -2694 -2559 -22 1461 4084 4204 3952 1834
3270A834j718J066K054j241k475K48Q80j650J151P30o61k68r93o54l68R06L13
3253h46m85j151m00J770O47j717j06Q18l81n17J169J020j705n7J572K124J528
3236C283On64j245k097j97J159r83j87J976n12K60L68k05j052l400M94K282K384
3218A770%j600J538q25J215K87r32P14L09m18P5j279j050J632J824J136j890k736
3200b30k457L65n48J546M091q1J153m71l122k03O38k47k15j346k134J322K787
3183H48J953O88k350j275K331J620j704q13J910n88j434J64o74J384l42k289k664
3166c235L18P17J310L34J262k210j788O73j919K056J255O96n61l284j884K008
3150d252L756O17j470l78J179K3m16k532N38M84K681M78k236k581p93p03K915
$$ plain form
3270 1834 116 1182 3236 1995 -480 -232 648 -1002 149 879 218 -50 -1043 -1697 -2065 -1159 -846
3253 -846 -1331 -2482 -2882 -1112 -465 -2182 -2288 -1470 -1851 -2368 -1199 -179 -1884 -1941 -369 1755 3283
3236 3283 3289 2725 1480 -617 -814 345 -638 -825 1151 639 899 1267 1062 10 -3390 -2896 -614 1770
3218 1770 1770 170 1708 883 2098 2385 1453 2167 2476 2058 2133 854 -196 1436 3260 4396 2506 -230
3200 -230 -2687 -2322 -2870 -1324 2767 2686 3839 3368 246 43 681 434 219 -1127 -3261 -1939 848
3183 848 2801 3489 1139 -136 2195 3815 2111 1298 3208 2620 1186 1350 676 2060 1718 -571 -3235
3166 -3235 -2917 -2200 -890 -556 706 -1504 -3292 -2619 -4538 -2482 -1227 -531 -1092 -4376 -6260 -4252
3150 -4252 -496 121 -1349 -1727 -548 -525 -941 -3473 -2935 -2451 230 708 -1528 -4109 -4902 -5605 -2690
3133b690L645N28M34j505k996M2J556N08P89J449j334J165K625J056k498k299
3117D75m145q27K605J739p74O65J183p29k453J038K267J800p85l96j295l35K730
3100B763l35J04p25o35n31j334K57j42k171p60J942J883l60M76K21r62K74n22
3082e57j319Q86r93j04N82r40M2r8m54J673Q90J994Q68M02M67p65j228k246j318
3063b218K306lk079j402P48J486J44J837j722m17K292r0j114j996P12k29j348
3046c093j205J221l39K637J757P16J023k72j603Q60j701k8J332J891j217k846
3030h67j420K395L371K081j863k287p50j886j229M34K272J81K87R6P16l141k720
3013d330k40j13R81l07j35R20J393q69J119j948M54K496J809K508K0k292p00K23
$$ plain form
3133 -2690 955 1483 1917 412 -2584 -2542 -986 -478 311 1760 426 1591 4216 5272 2774 475
3117 475 -3670 -4497 -1892 -153 -927 -262 921 192 -2261 -1223 1044 2844 2059 1663 368 33 2763
3100 2763 2428 2532 1807 1172 641 -693 -436 -578 -2749 -3509 -1567 316 -44 432 653 -309 -35 -557
3082 -557 -1876 -990 -1983 -2087 -1505 -2445 -2403 -2501 -2955 -1282 -392 1602 2470 2872 3339 2574 1346 -900 -2218
3063 -2218 88 85 -1994 -3396 -2648 -1162 -1018 819 -903 -1320 972 882 -232 -2228 -1516 -1745 -3093
3046 -3093 -4298 -3077 -3416 -779 978 1694 2717 2445 842 1702 1 -27 1305 3196 1979 -867
3030 -867 -2287 108 3479 5560 3697 1410 660 -1226 -2455 -2021 251 432 719 815 1531 -1610 -4330
3013 -4330 -4570 -4683 -3702 -4009 -4144 -3224 -1831 -2700 -1581 -3529 -3075 -579 1230 3738 3758 1466 766 989
2995I89k09j214K52J498J009J197j859j794l394j1J571R59J606j534k819K243
2979a510J902j428n26R39J728K362j776l081J460L558j6q74M86o39l397J780k289
2962a321r62J931l14L63M03M221k63r36l98k610k893R89K48n72O26n80r96J060
2944b004q63L78J627j54q32O38L40P81J738j326j592K406l17j4J804j550l478
2927b418j853L549J204K162Q87P62l854j855J138J12j518K284K156j826j310J754
2911A374l60o81L00J346J027j294R15P48k692k915o3L032J922m90m99J203M61
2894C334j169k473j489J118j019p00J459K425k61j530J618j46j565n99J028M413
2878D444j188j062J270N13j697NL022j01j566Q7R33J337n07O46j790m798j687
$$ plain form
2995 989 780 -434 -182 1316 2325 3522 1663 -131 -3525 -3536 -1965 -1006 600 -934 -3753 -1510
2979 -1510 392 -1036 -1562 -623 1105 3467 1691 -1390 70 3628 3612 2738 3224 2585 -812 968 -1321
2962 -1321 -2283 -352 -666 -303 100 4321 4058 3122 2724 114 -2779 -1790 -1542 -2114 -1488 -2068 -3064 -2004
2944 -2004 -2867 -2489 -862 -1016 -1848 -1210 -870 -89 1649 323 -1269 1137 820 806 2610 1060 -2418
2927 -2418 -4271 -722 482 2644 3531 4293 439 -1416 -278 -166 -1684 600 2756 930 -380 1374
2911 1374 1014 333 633 1979 3006 1712 2627 3375 683 -2232 -2295 737 2659 2169 1670 2873 3334
2894 3334 2165 -308 -1797 -679 -1698 -2398 -939 1486 1225 -305 1313 1167 -398 -997 31 4444
2878 4444 3256 2194 3464 3977 2280 2285 5307 5206 3640 3727 4660 5997 5490 6136 4346 -452 -2139
2861b139K044j099k784P42J021O58L973j95j324P21k354k00J677J559J931p93
2845C438j531j087j039K347o25j104K96L36nK068M24L71l88p40l316Q35P64m62
2827E82o59k46k732j836K794L595N32k088K95R11k093k0N66o54j897J627P21k76
2809h78m34L025L49l19L48l664k726R49Q34J846K049l97j261R44J104j139j558
2792i28r77K661P46m35j892n20L39p09k46m1O09J32Q01J137Q20J181j778P06O08
2773B214J270k873Q72K083J806k190l510k084n44J415L106L29o18n07O82K149
2757C600o45k240j896j193J857K616No1j247l7Q13L7j255k158j321L110j014l67
2739a396Q76J613J364k412n40O0O05J231l18j201M35J169l46K070j229r12j10
$$ plain form
2861 -2139 -95 -1194 -3978 -3236 -2215 -1557 2416 2221 897 1618 -736 -936 741 2300 4231 3438
2845 3438 1907 820 -219 2128 1503 399 695 1031 1026 3094 3518 3889 3501 2761 -555 280 1044 582
2827 582 -77 -323 -3055 -4891 -2097 1498 2030 -58 237 1148 -945 -965 -399 -1053 -2950 -1323 -602 -878
2809 -878 -1312 1713 2062 1743 2091 -1573 -4299 -3350 -2516 -670 1379 982 -279 665 1769 630 -928
2792 -928 -1905 756 1502 1067 -825 -1345 -1006 -1715 -1961 -2002 -1393 -1261 -460 677 1497 2678 900 1606 2214
2773 2214 3484 611 1483 3566 5372 3182 -328 -2412 -2956 -1541 1565 1894 1276 769 1451 3600
2757 3600 2955 715 -1181 -2374 -517 2099 2104 2043 796 759 1572 1609 354 -1804 -3125 -15 -1029 -1396
2739 -1396 -520 1093 2457 45 -495 -435 170 1401 1083 -118 317 1486 1140 3210 1981 1069 959
2722I59j685j707r16J668j091j196J047J691O82p29k96j04j564k35O46p88L67
2705c251K585J230j88k06l30P80j540J185J580jM47r83k677K05j054m33P40J069
2687h42O45J268J1P02J666J828k20j420k071k316q84j224L23J687r22K927J454
2670B612j373j312r31J528J958j240j021J967K250j46n835K25K518j234p18j238
2654a990r90Q53O16J396J337j28L31k043n08J581O90K595M48k973p37P84N84j201
2636F45n70k103M70J291J301J88K582Q36q52m98n79j325k702j743K014K14k506
2619c337j71M20q02l25J130K529J765M19J03k068j436o0J969P9j739n99K021P61
2601F59N38m72k559k68J601J484o37m17j560j351k16J529o13l4J913K005k48J46
$$ plain form
2722 959 -726 -2433 -3349 -1681 -2772 -3968 -2921 -1230 -548 -1277 -1573 -1677 -3241 -3476 -2830 -3618 -3251
2705 -3251 -666 564 376 170 -160 620 -920 265 1845 1844 2291 1308 -1369 -1164 -2218 -2651 -1911 -842
2687 -842 -197 1071 1082 1784 3450 5278 5058 3638 1567 -749 -1633 -2857 -2534 -847 -1769 1158 2612
2670 2612 1239 -73 -1004 524 2482 1242 221 2188 4438 4292 -1543 -1318 1200 -34 -752 -1990
2654 -1990 -2980 -2127 -1511 -115 1222 1094 1425 -618 -1126 455 1145 3740 4188 1215 478 1262 1846 645
2636 645 75 -2028 -1558 -267 1034 1222 3804 4640 3788 3290 2711 1386 -1316 -3059 -1045 -831 -3337
2619 -3337 -3508 -3088 -3890 -4215 -3085 -556 1209 1628 1731 -337 -1773 -1833 136 215 -1524 -2123 -102 659
2601 659 1197 725 -1834 -2102 -501 983 346 -71 -1631 -2982 -3198 -1669 -2282 -2316 -403 1602 1354 1500
2583A500j703j652Q73j119J522l13j220k59J125J316J485Q22o65j451j072j32
2567i43J834N66J046j922n40L268K187l990l470j65J329Q05K4q67o43j125n82
2550c188n15K592o28k14J740J98J194m45j955M79K151K26j093l532j300o42q38
2533e770K955L269R83Q27q17j445J0J183J331j716r54j37p69J19o82P22K258j349
2515A8k16k14p15n83J035J471K07J316L12j862j814L19J366J964j230n15N61j92
2497A228P3K081N46j017m72k38j737n08l04J540M74j094m90k359J289K420J999
2480C431p08j270k514j02J484J485q04k763r0K310M49r42J564K664l9j095k052
2463A008J599L18j271j979P35K31L15j600j182K292P00P5J975J129l17j724J212
$$ plain form
2583 1500 -203 -1855 -982 -2101 -579 -892 -2112 -2371 -1246 70 1555 2377 1712 261 -811 -943
2567 -943 891 1457 2503 581 41 3309 5496 1506 -1964 -2129 -800 5 29 -838 -1481 -2606 -3188
2550 -3188 -3703 -1111 -1739 -1953 -213 -15 1179 734 -1221 -742 1409 1635 542 -2990 -4290 -4932 -5770
2533 -5770 -2815 454 1437 2264 1447 2 12 1195 2526 810 -144 -281 -1050 -931 -1613 -891 1367 18
2515 18 -198 -412 -1127 -1710 -675 796 1003 2319 2631 769 -1045 -726 640 2604 1374 859 1420 1228
2497 1228 1301 3382 3928 2911 2439 2201 464 -44 -348 1192 1666 572 82 -2277 -988 1432 3431
2480 3431 2723 1453 -1061 -1163 321 1806 1002 -1761 -1851 459 908 -34 1530 4194 4155 3060 1008
2463 1008 2607 2925 1654 -325 410 641 956 -644 -1826 466 1166 1241 3216 4345 4028 2304 3516
2446C516j364k475j459j348j50Q48R66P64j371j607j008K420R57N3r07O97L67
2429a101k923j667M73k98Q53K453O73J368M27J89o17k705j418J201K864j342J30
2412a440Q72K094p57k070M20J048j538K129J247o19j473j206o74N54p5M29j611
2395b670R53J632R22j374q76J056JJ726k142k490Q58J81N6o09mj391J656R84J342
2376a89J336P70j613P48K527J158J90j394q06q20j351J72q18j203J527J438q7
2359A585j721j902n8j12P26q0M06J666K582j246j894j68m02l43j622j365J796
2342b152J346k57j122J197K736L86j169j072Q20m99j310j481J195J629R29r60
2326B16j95k042J450J581j154J648j952q79J005p81P12Q2Q85K961j75j876p69
$$ plain form
2446 3516 2152 -323 -1782 -3130 -3280 -2432 -1466 -702 -2073 -3680 -4688 -2268 -1311 -1258 -2165 -1468 -1101
2429 -1101 -4024 -5691 -5218 -5516 -4663 -2210 -1537 -169 258 447 -170 -2875 -4293 -3092 -228 -1570 -1440
2412 -1440 -568 1526 769 -1301 -881 167 -1371 758 2005 1386 -87 -1293 -1967 -1413 -1488 -1059 -2670
2395 -2670 -1717 -85 837 -537 -1413 -357 -356 1370 -772 -3262 -2404 -2223 -2167 -2776 -2780 -4171 -2515 -1531 -189
2376 -189 1147 1917 304 1052 3579 4737 4927 3533 2727 1907 556 728 -90 -1293 234 1672 1585
2359 1585 -136 -2038 -2096 -2208 -1482 -1562 -1156 510 3092 1846 -48 -216 -618 -961 -2583 -3948 -2152
2342 -2152 -806 -1063 -2185 -988 1748 2134 965 -107 713 214 -1096 -2577 -1382 247 1176 216
2326 216 21 -2021 -571 1010 -144 1504 -448 -1327 -322 -1103 -391 -309 576 3537 3362 1486 717
2309G17J571P45k037j322J53l46J403j401l064K42N72J642J40k190J698j370R88
2292a859K173o84k79J00J39J467l199l571K277J871J969K663K139K16k609j236
2276A577N38p95j39j821k793R7N80R55o70j708n12K477J720j241j382M75J05N4
2258b483N82J137O49L06k053p3L407K184K57j217q78p34k443j064K569K85k756
2241b325j890K697M489q48J425J03j734j019Q60k291k321K32O40J461Q87p9j758
2224a471l88k25J138M13p29J879m91Rk901m03K114K24Q76R01j471J372o45M12
2206F14j864K540K437r11j677j942K03J096J371k523M04K010j085k608o3P89J34
2189a075k80J628P48k738j92L012K532j37J129j078k692j114j093n80K261j20
$$ plain form
2309 717 2288 3033 996 -326 -173 -519 884 -517 -3581 -3339 -2767 -1125 -985 -3175 -1477 -2847 -1859
2292 -1859 314 -370 -649 -549 -410 1057 -2142 -5713 -3436 -1565 404 3067 5206 5422 2813 1577
2276 1577 2115 1320 1181 -640 -3433 -3336 -2756 -1801 -2471 -4179 -4691 -2214 -494 -1735 -3117 -2642 -2537 -2483
2258 -2483 -1901 -764 -115 191 -1862 -1935 1472 3656 3913 2696 1818 1084 -1359 -2423 146 431 -2325
2241 -2325 -4215 -1518 2971 2123 3548 3651 1917 898 1758 -533 -2854 -2622 -1982 -521 366 287 -1471
2224 -1471 -1859 -2084 -946 -533 -1262 617 126 135 -2766 -3169 -1055 -831 45 946 -525 847 202 614
2206 614 -1250 1290 3727 2816 1139 -803 -600 496 1867 -656 -252 1758 673 -1935 -1998 -1209 -1075
2189 -1075 -1355 273 1021 -1717 -1909 1103 3635 3498 4627 3549 857 -257 -1350 -1930 331 211
2173B11j632k135j626r89J483j45J068J249j344N2J919Q98j398o47j04L403M56
2156G19j676q13j922L059J019K42J32P19k42N6j687o65j823r50J531L75R59L29
2138f38K332J600J481J378p16l369j269j323l206j480J236J971m39K522o76q55
2122a451k059O47K08P2J628J569j847k499K75J405J344J23J410l59n62l70n57
2105a023J399J462r57j521j011K208K368q6l995j123L79p32J384J926R59k356
2089g19p76p7J182K91L45J088k316R42r81j989J773o89j084L11J196O44l27j455
2071b641l05n32j6L575K328j217j04O21n79j101j401J363J513p47q62P74l26J269
2053A612M34p99l328n91K04l07j205j852l79K817L662k53k068j72K202J508K323
$$ plain form
2173 211 -1421 -3556 -5182 -6171 -4688 -4833 -3765 -2516 -3860 -3808 -1889 -991 -2389 -3036 -3140 263 719
2156 719 -957 -1770 -3692 -633 386 628 760 1479 1237 1293 -394 -1059 -2882 -3832 -2301 -1926 -967 -638
2138 -638 1694 3294 4775 6153 5437 2068 799 -524 -3730 -5210 -3974 -2003 -2442 80 -596 -1451
2122 -1451 -3510 -2863 -2655 -2583 -955 614 -1233 -3732 -3457 -2052 -708 -585 825 466 -96 -466 -1023
2105 -1023 376 1838 881 -640 -1651 557 2925 2839 -1156 -2279 -1900 -2632 -1248 678 1637 -719
2089 -719 -1495 -1572 -390 -99 246 1334 -982 -40 -1021 -3010 -1237 -1926 -3010 -2699 -1503 -859 -1186 -2641
2071 -2641 -2946 -3478 -3494 81 2409 1192 1088 1709 1130 29 -1372 -9 1504 757 -105 669 343 1612
2053 1612 2046 1247 -2081 -2672 -2468 -2775 -3980 -5832 -6211 -3394 268 15 -2053 -2225 -23 1485 3808
2036C808J080j584k255k81L24r79j819q9K051R57r23j89Q5j702J052J691j985
2019g58k39K28M46K32j555J180J111Q58J189P26j083k13j65k103j515K92j659
2002c028N85J550Q4J092K435M66k260q46o92j387q24R49J741K527L455K61k210
1985C898l937l089J508L535J534j482j794j52J884k44j322K59J341o14J037J42
1969B504k636o41j516o51J302J858J666Mj524k477J183K11j121J107K052k331
1953a010p97K535J374j810K94l16j65k342p03J455n12L36N29j750k35K640J418
1936I41o53R80M75K56NJ85j044j193p27l10l17m40Q19Q74j007j377M35K3j627
1917c702OK677K23j056r99J374J746O89k201j122J150m00N85l17j07J506q71L17
$$ plain form
2036 3808 4888 3304 1049 768 1092 113 -1706 -1795 256 1213 290 101 186 -1516 -464 1227 -758
2019 -758 -997 -769 -323 -91 -1646 -466 645 1503 2692 3418 2335 2122 1957 -146 -1661 -1369 -3028
2002 -3028 -2443 -893 -809 283 2718 3184 924 78 -614 -2001 -2825 -1876 -135 2392 5847 6108 3898
1985 3898 -39 -3128 -1620 1915 3449 1967 173 21 1905 1661 339 598 1939 1325 2362 2504
1969 2504 -132 -773 -2289 -2940 -1638 220 1886 1890 366 -2111 -928 -717 -1838 -731 1321 -1010
1953 -1010 -1807 728 2102 292 586 270 105 -2237 -2940 -1485 -1997 -1661 -1132 -2882 -3117 -477 941
1936 941 288 1268 1743 1999 2004 2189 1145 -48 -775 -1085 -1402 -1842 -1023 -149 -1156 -2533 -2098 -2075 -3702
1917 -3702 -3696 -1019 -796 -1852 -2851 -1477 269 958 -1243 -2365 -1215 -1615 -1030 -1347 -1454 52 -819 -502
1899e02J277J14j490M15K530M25r66j979J400p77o2J878m8o37m98K714K050j041
1881D803k179k122n6P65J236j690l539K258K367p4M71j768m26K534K56j448j981
1864e93K63J23q75K534j446l532L92Q46J644L024j768p41J210J138m02m48j740
1847c71l8l0O85J482r37p34k591l07o34J501L309k70N67k050M79r99Q05R22O75
1828A464O36m80P86l97k532L15P71K05j275k171K72O97O20Q12p22j335J046N69
1810g19L96K03m30m51M99J912J9R13J391q06j517L59O70j861m54K810K517l88
1792E063k490n87l37O0r64k468J108K146J930J22l546q44K100J023k741j0K421
1775A986k541K49J354o64J244m21K577K764k337j823o87o77j266K53M424Q67l154
$$ plain form
1899 -502 775 889 -601 -186 2344 2769 1803 -176 1224 447 385 2263 2215 1578 1080 3794 5844 4803
1881 4803 2624 502 446 1211 2447 757 -2782 -524 1843 1769 2240 472 46 2580 2836 1388 -593
1864 -593 -330 -207 -1082 1452 6 -3526 -3134 -2288 -644 2380 612 -129 1081 2219 1817 1369 -371
1847 -371 -409 -439 246 1728 791 57 -2534 -2841 -3475 -1974 1335 1065 1632 -418 61 -938 -133 789 1464
1828 1464 2100 1620 2406 2009 -523 -208 563 768 -507 -2678 -2406 -1709 -1089 -277 -999 -2334 -1288 -719
1810 -719 -323 -120 -550 -1001 -502 1410 1429 2342 3733 2927 1410 1769 2439 578 124 2934 5451 5063
1792 5063 2573 1986 1649 1709 745 -1723 -615 1531 3461 3583 37 -807 1293 2316 -425 -435 1986
1775 1986 -555 -306 1048 384 1628 1207 3784 6548 4211 2388 1701 1024 -242 11 4435 5302 2148
1758B148n33J063l49k622J393M73M5J088L65j516j80K96o34p95p35j566J23L84
1740a552j61N35j465M40Q84J170n69J370J897p74j587j552K39J440j48j24P08
1723G51j535j30J894K25k70N40J597k64P73L335j774k210j946K4K920N76l5K397
1705F868r51j955j219n3R42K471P78j132j633j712j136J241J88L54J084J335J8
1688E488k111N95L72l088l88K053p25p27o17P60K33n7M77J023j905p27J68l855
1670c031r75J119j443J25J068j57K994r91j041M19J475R26p70j136K395J98q45
1653C30L456J079j16K31J329o06j793j248j521j716j2n29N00j206k46n5R39N29
1635f55J37J341P79o75K183R45k676n74l87j494M83m50j190J725n37j843k228
$$ plain form
1758 2148 1615 2678 2329 -293 1100 1573 1618 2706 3071 1555 1375 1671 1037 242 -493 -2059 -1936 -1552
1740 -1552 -1713 -1178 -2643 -2203 -1319 -149 -718 652 2549 1775 188 -1364 -1125 315 167 43 751
1723 751 -784 -914 980 1205 935 1475 3072 2808 3581 6916 5142 2932 986 1010 3930 4506 4471 6868
1705 6868 5917 3962 2743 2690 3632 6103 6881 5749 4116 2404 1268 2509 2697 3051 4135 5470 5488
1688 5488 3377 3972 4344 1256 868 2921 2196 1469 852 1612 1845 1788 2265 3288 1383 656 824 -3031
1670 -3031 -4006 -2887 -4330 -4205 -3137 -3294 -300 -1291 -2332 -1913 -438 488 -282 -1418 977 1175 330
1653 330 3786 4865 4749 4980 6309 5703 3910 2662 1141 -575 -587 -1116 -616 -1822 -2068 -2123 -1184 -655
1635 -655 -518 823 1602 927 3110 4055 1379 805 418 -1076 -593 -1043 -2233 -508 -1045 -2888 -5116
1618e116l9M78q0J913q01J545k29j020j19J922K009O87m86j439k085J247K363
1601G50K42M91n43K22R8J733j40Q3n79n321j754P50J215K764p35r0j558J460K069
1582A157p75j938k66J798K320L213j107l440j168k671k79K187n23j641J656J173
1566c04k785J563L250n91k681j358M41J127L881k13M67M9j272J587k687k829J365
1549i90m57q41R8j516K230O80k133j243L790J775j0j340n10L92K407J727l89r43
1531B727r93r98m2j624j58K487J017J609k830l201J37N58K92J224J203j50n08
1514G50l115J53J780j374J445Q56P71j402J33L05P03l05k025J143K84k18j036
1497a152P39O55K42k440L393j82r96q27j717J011J611j233O85j014p09Q51j367
$$ plain form
1618 -5116 -5155 -4677 -4757 -2844 -3645 -2100 -2329 -3349 -3468 -1546 463 1150 664 -775 -2860 -1613 750
1601 750 992 1483 940 1162 1260 2993 2853 2936 2357 -2964 -4718 -3968 -2753 11 -724 -814 -2372 -912 1157
1582 1157 382 -1556 -1822 -24 2296 5509 4402 962 -206 -2877 -3156 -969 -1492 -3133 -1477 -304
1566 -304 -3089 -1526 1724 1133 -1548 -2906 -2465 -1338 2543 2330 2797 2846 1574 3161 474 -2355 -990
1549 -990 -1447 -2288 -2190 -3706 -1476 -796 -2929 -4172 -382 1393 1383 43 -467 -75 2332 4059 3670 2727
1531 2727 1734 736 694 -930 -1088 1399 2416 4025 1195 -2006 -1869 -1311 -1019 205 1408 1258 750
1514 750 -2365 -2212 -432 -1806 -361 495 1266 -136 -3 302 1005 700 -1325 -182 102 -116 -1152
1497 -1152 -413 242 484 -1956 1437 1255 259 -568 -2285 -1274 337 -896 -211 -1225 -1934 -1083 -2450
1480b450j716K48L044J048k54l98j724j71P80M80k297K78J404Q69j280M64m91
1463b166J424N86L17r47r20J417j959j386J331J428J049Q66K26k013r08r30k897
1446e482J139J385J047K002K05R52O31k79j401j571j867J08K462J799J89k161
1430h42k511o03K900Q25k49j147M27K580J390P02P38M88o27j011j835j482L64
1413A07P37o12q5J343J118p55j91J46n04J435j130m10J843O83j610r41K88O3m06
1394A119j107j902J073L3j851j362k17J620J327J522p88J686P19l04j711J061
1378I18J59J163J588R29l86n62k445j371K140P19L45l80O44K51Jj921Q71j911
1360G52J04K93j125M1J158J257M99%q03l25N05j703k910Q95N66j514j060J123
$$ plain form
1480 -2450 -4166 -3918 -874 174 -80 -478 -2202 -2373 -1593 -1113 -3410 -3132 -1728 -859 -2139 -1675 -2166
1463 -2166 -742 -156 161 -786 -1706 -289 -2248 -3634 -2303 -875 174 1040 1266 -747 -1655 -2585 -5482
1446 -5482 -4343 -2958 -1911 91 296 1248 1879 1600 199 -1372 -3239 -3131 -669 1130 1319 -842
1430 -842 -3353 -3956 -1056 -231 -480 -1627 -1200 1380 2770 3472 4210 4698 4071 3060 1225 -257 107
1413 107 844 232 147 1490 2608 1853 1662 1808 1304 2739 1609 1199 3042 3725 2115 1174 1462 1525 1119
1394 1119 12 -1890 -817 -784 -2635 -3997 -4214 -2594 -1267 255 -533 1153 1872 1568 -143 918
1378 918 1077 2240 3828 4757 4371 3809 1364 -7 2133 2852 3197 2817 3461 3712 3713 1792 2663 752
1360 752 856 1149 24 65 1223 2480 2979 2979 2176 1851 2356 653 -2257 -1362 -796 -2310 -3370 -2247
1342b247R43N19L22J526j293k101k74J981o08J200K218L17j34r90k982Q86K162
1325A445K104J356k258m78J110j084j621j022n57L97N36N08J297j211l40M40M92
1308A114J265l77J722P08j034M07j934k069o08n17J057J462O31O44m4j256J088
1291B259J681j657j943J207M75j211j091m88J770K003R55J210k789l236j905L64
1275b396j81P70O67M98K433o43j140M50m73P59L54m56k92L14L147M03j053j184
1257A977p71k22K183l44k328j185K21N64j529L49n1j900r14K476L513J37j175
1240A001k288O06L315O9J35k610k605j731J561L100K81j340j969Q44K368j098
1224c61j146P46J396J248K17k987j190K025j293j90K155j097J206p45J484J257
$$ plain form
1342 -2247 -1304 -785 -463 1063 -230 -2331 -2605 -624 -1232 -32 2186 2503 2369 1379 -1603 -717 1445
1325 1445 3549 4905 2647 2169 3279 2195 574 -448 -1005 -608 -72 436 1733 522 182 622 1114
1308 1114 2379 2002 3724 4432 3398 3805 1871 -198 -806 -1323 -266 1196 1827 2471 2427 1171 2259
1291 2259 3940 2283 340 1547 2022 811 -280 -768 1002 3005 3960 5170 2381 -855 -2760 -2396
1275 -2396 -2577 -1807 -1140 -642 1791 1148 8 458 -15 744 1098 642 350 664 3811 4214 3161 1977
1257 1977 1206 984 3167 2823 495 -690 -469 95 -1434 -1085 -1136 -3036 -3950 -1474 2039 2176 1001
1240 1001 -1287 -681 2634 2703 2838 228 -2377 -4108 -2547 553 834 -506 -2475 -1631 737 -361
1224 -361 -1507 -761 635 1883 2100 -887 -2077 -52 -1345 -1535 620 -477 729 -16 1468 2725
1208B725j230k854j875j703J172J921P30J328J018J397N3j610R26J469M12l77
1192C502k530r75R8R13p95L8J213j306m78n95K016J642o49k721J791j416J38O79
1174E65K76L660j14l952j654p00k56K139n13J802K77P18Q97J474j093j153j278
1157A095j426l1k275N77J864j45J156j542K55M33j935o97L245M75p61J272q03
1140G57j570m48O07J96o8p13K55R4m45J806K97J15J926j10j568j045n68J431N09
1121A458o67j349j75Q08J345K435K972M00J32k248j957r58J287L86r94k108n01
1104B66p65J921J076M79l27k25j039j028L7J22Q85j279M82M28p27J309k3L6P4
1085A702J85Q59j555p67m08N71K59J413k377j312J861Q75q10j055k487n1P34j449
$$ plain form
1208 2725 1495 -1359 -3234 -4937 -3765 -1844 -1114 214 1232 2629 2682 1072 1998 3467 3879 3502
1192 3502 972 -3 95 1008 213 251 1464 158 -320 -915 1101 2743 2094 -627 1164 -252 -114 565
1174 565 841 4501 4387 435 -1219 -1919 -2175 -36 -549 1253 1530 2248 3145 4619 3526 2373 1095
1157 1095 -331 -362 -2637 -2060 -196 -341 815 -727 -472 -39 -1974 -2671 574 1049 288 1560 757
1140 757 -813 -1261 -654 -458 -526 -1239 -984 -890 -1335 471 768 883 2809 2699 1131 86 -482 949 1458
1121 1458 791 -558 -733 75 1420 3855 6827 7227 7359 5111 3154 2196 3483 3869 2875 767 266
1104 266 -499 1422 2498 2977 2650 2425 1386 358 395 517 1402 123 605 1033 306 1615 1592 1628 1702
1085 1702 1887 2746 1191 424 16 587 846 2259 -118 -1430 431 1306 496 -559 -3046 -3097 -2363 -3812
1067c812j047K819K903R82n96k040k50J756k05o03L98p78J8q65Q72K274N17j264
1049A079j080m43j052J897r41j238k265O53K280J009K30j83k362J793K608J717
1033C702j320kM92o63j486M74J22j41j48o59j108k20N74j131k438j609j089k57
1015f907K994R60L97jm41j442J276l43p92K2L076K405k13r4J300K66n90l872m90
996b489k02M39J204j5K153K09l36j43j414n26o25J392J038K225m04J90j344Q04
$$ plain form
1067 -3812 -4859 -2040 863 1845 1249 -791 -1041 715 510 -93 305 -473 -455 -1320 -448 1826 2343 1079
1049 1079 -1 -444 -1496 401 -540 -1778 -4043 -3390 -1110 -101 129 -54 -2416 -623 1985 3702
1033 3702 2382 2380 2872 2209 723 1197 1319 1178 1030 371 -737 -957 -383 -1514 -3952 -5561 -6650 -6907
1015 -6907 -3913 -2953 -2556 -2557 -2998 -4440 -3164 -3507 -4299 -4277 -1201 1204 991 897 2197 2463 1873 -1999 -2489
996 -2489 -2691 -2252 -1048 -1063 1090 1299 963 820 -594 -1120 -1745 -353 685 2910 2506 2696 1352 2156
$$ [...]
##END NTUPLES=NMR SPECTRUM
##END=
