##TITLE=Analysis number 313296
Compound Code sb 01942
Project Code qc-cat
Chemist Name fudan
##JCAMPDX= 6.0         $$ Bruker NMR JCAMP-DX V2.0
##DATA TYPE= NMR SPECTRUM
##DATA CLASS= NTUPLES
##ORIGIN= Bruker BioSpin GmbH
##OWNER= NMR
$$ XWIN-NMR		Version 3.5
$$ Thu Sep  1 15:13:07 2005 GMT Daylight Time (UT+1h)  MAYBRIDGE\NMR@NMR_250MHZ
##.OBSERVE FREQUENCY= 250.131544655141
##.OBSERVE NUCLEUS= ^1H
##.ACQUISITION MODE= SIMULTANEOUS (DQD)
##.ACQUISITION SCHEME= undefined
##.AVERAGES= 16
##.DIGITISER RES= 18
##SPECTROMETER/DATA SYSTEM= dpx250
##.PULSE SEQUENCE= zg30
##.SOLVENT NAME= DMSO
##.SHIFT REFERENCE= (INTERNAL, DMSO, 0, 16.522)
##AUDIT TRAIL= $$ (NUMBER, WHEN, WHO, WHERE, WHAT)
$$ ##TITLE= Audit trail, XWIN-NMR		Version 3.5
$$ ##JCAMPDX= 5.01
$$ ##ORIGIN= Bruker BioSpin GmbH
$$ ##OWNER= NMR
$$ C:\u/data/dgb/nmr/ADRS/8890/pdata/1/auditp.txt
$$ ##AUDIT TRAIL=  $$ (NUMBER, WHEN, WHO, WHERE, WHAT)
(   1,<2005-09-01 15:12:47.38 +100>,<MAYBRIDGE\NMR>,<NMR_250MHZ>,
      <created by zg, POWCHK disabled, PULCHK disabled
       configuration hash MD5:
       62 19 C7 07 E1 42 D1 B7 37 6C 3D D0 77 39 F9 E6
       data hash MD5: 64K
       CE 65 31 C7 33 F2 AB 64 27 64 BE CB 13 11 45 5F>)
(   2,<2005-09-01 15:13:00.10 +100>,<MAYBRIDGE\NMR>,<NMR_250MHZ>,
      <Start of raw data processing
       ef LB = 0.3 FT_mod = 6 PKNL = 1 SI = 32K 
       data hash MD5: 32K
       06 C9 0B 12 09 32 F1 75 F8 12 1E 08 68 7F 94 51>)
(   3,<2005-09-01 15:13:01.86 +100>,<MAYBRIDGE\NMR>,<NMR_250MHZ>,
      <apk 
       data hash MD5: 32K
       92 89 F7 B1 3F 3C DB CF 9F 01 88 90 6F F9 C6 37>)
(   4,<2005-09-01 15:13:02.64 +100>,<MAYBRIDGE\NMR>,<NMR_250MHZ>,
      <abs ABSG = 5 
       data hash MD5: 32K
       45 53 A8 6F C5 2A BF E2 7C 7C 52 3E AB 68 9B EA>)
$$ ##END=
$$ 
$$ hash MD5
$$ 06 C1 C9 45 EB 42 77 6B 77 D2 A3 97 21 BA 95 73
##$RELAX= 
##$RELAX= 
##$RELAX= 
##$RELAX= 
##$RELAX= 
##$RELAX= 
##$RELAX= 
$$ Bruker specific parameters
$$ --------------------------
##$DU= <C:\u>
##$EXPNO= 8890
##$NAME= <ADRS>
##$PROCNO= 1
##$TYPE= <nmr>
##$USER= <dgb>
##$AMP= (0..31)
100 100 100 100 100 100 100 100 100 100 100 100 100 100 100 100 100 100 
100 100 100 100 100 100 100 100 100 100 100 100 100 100 
##$AQSEQ= 0
##$AQ_mod= 3
##$AUNM= <au_zg>
##$AUTOPOS= <14 >
##$BF1= 250.13
##$BF2= 250.13
##$BF3= 250.13
##$BF4= 250.13
##$BF5= 500.13
##$BF6= 500.13
##$BF7= 500.13
##$BF8= 500.13
##$BYTORDA= 1
##$CFDGTYP= 0
##$CFRGTYP= 5
##$CHEMSTR= <none>
##$CNST= (0..31)
1 1 145 1 1 1 1 1 1 1 1 1 1 1 1 1 1 1 1 1 1 1 1 1 1 1 1 1 1 1 1 1 
##$CPDPRG= <>
##$CPDPRG1= <>
##$CPDPRG2= <>
##$CPDPRG3= <>
##$CPDPRG4= <mlev>
##$CPDPRG5= <mlev>
##$CPDPRG6= <mlev>
##$CPDPRG7= <mlev>
##$CPDPRG8= <mlev>
##$CPDPRGB= <>
##$CPDPRGT= <>
##$D= (0..31)
0 1 0 0 0 0 0 0 0 0.06 0 0 0 0 0 0 0.0002 0 0 0 0 0 0 0 0 0 0 0 0 0 0 
0 
##$DATE= 1125583966
##$DBL= (0..7)
120 120 120 120 120 120 120 120 
##$DBP= (0..7)
150 150 150 150 150 150 150 150 
##$DBP07= 0
##$DBPNAM0= <>
##$DBPNAM1= <>
##$DBPNAM2= <>
$$ [...]
##$SUBNAM7= <"">
##$SUBNAM8= <"">
##$SUBNAM9= <"">
##$SW= 20.6930455092707
##$SWIBOX= (0..15)
0 0 3 0 0 0 0 0 0 0 0 0 0 0 0 0 
##$SW_h= 5175.983436853
##$TD= 65536
##$TD0= 1
##$TE= 295.16
##$TE2= 300
##$TE3= 300
##$TEG= 300
##$TL= (0..7)
0 120 120 120 120 120 120 120 
##$TP= (0..7)
150 150 150 150 150 150 150 150 
##$TP07= 0
##$TPNAME0= <>
##$TPNAME1= <>
##$TPNAME2= <>
##$TPNAME3= <>
##$TPNAME4= <>
##$TPNAME5= <>
##$TPNAME6= <>
##$TPNAME7= <>
##$TPOAL= (0..7)
0.5 0.5 0.5 0.5 0.5 0.5 0.5 0.5 
##$TPOFFS= (0..7)
0 0 0 0 0 0 0 0 
##$TUNHIN= 0
##$TUNHOUT= 0
##$TUNXOUT= 0
##$USERA1= <user>
##$USERA2= <user>
##$USERA3= <user>
##$USERA4= <user>
##$USERA5= <user>
##$V9= 5
##$VALIST= <valist>
##$VCLIST= <CCCCCCCCCCCCCCC>
##$VD= 0
##$VDLIST= <DDDDDDDDDDDDDDD>
##$VPLIST= <PPPPPPPPPPPPPPP>
##$VTLIST= <TTTTTTTTTTTTTTT>
##$WBST= 1024
##$WBSW= 4
##$XGAIN= (0..3)
0 0 0 0 
##$XL= 0
##$YL= 0
##$YMAX_a= 308341
##$YMIN_a= -279821
##$ZGOPTNS= <>
##$ZL1= 120
##$ZL2= 120
##$ZL3= 120
##$ZL4= 120
##$ABSF1= 16.522
##$ABSF2= -4.171173
##$ABSG= 5
##$ABSL= 3
##$ALPHA= 0
##$AQORDER= 0
##$ASSFAC= 0
##$ASSFACI= 0
##$ASSFACX= 0
##$ASSWID= 0
##$AUNMP= <proc_1d>
##$AZFE= 0.1
##$AZFW= 0.1
##$BCFW= 0
##$BC_mod= 0
##$BYTORDP= 0
##$COROFFS= 0
##$CY= 12.5
##$DATMOD= 1
##$DC= 0
##$DFILT= <>
##$DTYPP= 0
##$F1P= 14.0000005364418
##$F2P= -0.99999901652339
##$FCOR= 0.5
##$FTSIZE= 32768
##$FT_mod= 6
##$GAMMA= 0
##$GB= 0
##$INTBC= 1
##$INTSCL= 1
##$ISEN= 128
##$LB= 0.3
##$LEV0= 0
##$LPBIN= 0
##$MAXI= 10000
##$MC2= 0
##$MEAN= 0
##$ME_mod= 0
##$MI= 0
##$NCOEF= 0
##$NC_proc= -3
##$NLEV= 6
##$NOISF1= 0
##$NOISF2= 0
##$NSP= 0
##$NTH_PI= 0
##$NZP= 0
##$OFFSET= 16.522
##$PC= 1
##$PHC0= -86.79626
##$PHC1= -2.053035
##$PH_mod= 1
##$PKNL= yes
##$PPARMOD= 0
##$PSCAL= 4
##$PSIGN= 0
##$REVERSE= no
##$SF= 250.13
##$SI= 32768
##$SIGF1= 0
##$SIGF2= 0
##$SINO= 400
##$SIOLD= 32768
##$SREGLST= <1H.DMSO>
##$SSB= 0
##$STSI= 32768
##$STSR= 0
##$SW_p= 5175.98343685301
##$SYMM= 0
##$S_DEV= 0
##$TDeff= 65536
##$TDoff= 0
##$TI= <Analysis number 999999
Compound Code 99
Book Reference 9
Project Code 9>
##$TILT= no
##$TM1= 0
##$TM2= 0
##$TOPLEV= 0
##$USERP1= <user>
##$USERP2= <user>
##$USERP3= <user>
##$USERP4= <user>
##$USERP5= <user>
##$WDW= 1
##$XDIM= 32768
##$YMAX_p= 337825499
##$YMIN_p= -214152
$$ End of Bruker specific parameters
$$ ---------------------------------
##NTUPLES= NMR SPECTRUM
##VAR_NAME=  FREQUENCY,     SPECTRUM/REAL,   SPECTRUM/IMAG
##SYMBOL=    X,             R,               I
##VAR_TYPE=  INDEPENDENT,   DEPENDENT,       DEPENDENT
##VAR_FORM=  AFFN,          ASDF,            ASDF
##VAR_DIM=   32768,         32768,           32768
##UNITS=     HZ,            ARBITRARY UNITS, ARBITRARY UNITS
##FACTOR=    0.157963299565203, 1,           1
##FIRST=     4132.6476996994, 0,             0
##LAST=      -1043.33573715361, 0,           0
##MIN=       -1043.33573715361, -214152,     0
##MAX=       4132.6476996994, 337825499,     0
$$ Real data points
##PAGE= N=1
##DATA TABLE= (X++(R..R)), XYDATA
$$ [...]
16893f0830k4572o947J0564J9392L3235p721J6870K2184M246j47l9184J166O101
16880b5643j4136k629L32P767K6899Q191j478j6709l2299n284j6158R57M520J8150
16866d7520J0507K1308k020l3709R576N763L056O086j5478l4564J230J485K0298
16853e3982R55J6298K461L3834Q012k4483m1295K2073J2659l3172K6150N569P022
16840a7899p691j1472N675L3858l7229l1654K2010J8433m267l3172Q362J9638
16828c5408q004o64k740J5087n848J531J5682K2780J534k7216l0533k2391n184
16815h1374K0838L2011K6510j3171K5249K1336J9934k5274l2407k9772n760K6426
16803a5454K2218L735K1438p216p82N2267M670k1654k0175p558j113k1407m2851
$$ y = [-60830, -85402, -92349, -81785, -62393, -29158, -36879, -20009, 2175, 6421, 6274, -32910, -31744, -25643, -39779, -42408, -42076, -34309, -7410, 781, -697, -17406, -49705, -54989, -71147, -70190, -65670, -47520, -37013, -15705, -17725, -51434, -41858, -36095, -33039, -26953, -42431, -76995, -75765, -74280, -53982, -53027, -36729, -34268, -434, 7578, -16905, -58200, -36127, -23468, -56640, -30490, -24921, -17899, -25590, -37062, -31387, 2471, -34758, -66412, -44402, -25969, -30236, -63408, -55046, -35408, -43412, -44076, -46816, -31729, -37577, -36046, -20364, 2416, 3950, -23266, -53799, -76190, -81374, -60536, -28525, -2015, -15186, 10063, 31399, 51333, 26059, -6348, -36120, -41880, -15454, 6764, 10499, 31937, 24721, 23939, 76206, 80876, 59222, 39047, 31489, 30376, 8969, -33882]
16790c3882J4952J4220O022L788p426m470k7975J4508O604l293j765j5705m0147
16777g4569j7939k953J874R41O1862L3259K6059P183l7625K8727k0132k9327j0063
16764c2703M734r693k987J7741L588J2708j0500j0008q823j6163K8961j130J2704
16751a1571n351Q417J8465j6241l2631J1252K9024l2525k1705o372J4683M3878
16739f77j0444K726K0098J369j0012l6979J1875M217M001o212J5774p990J2674
16726D20j2875j6042J2597N547J4856l187j7444l5651k2950J4182K4417J389O609
16713b8132n24j5343j4441J7887K5189J9654r205j8738j0259l244k9585k3396
16701i0137m367j9361R264N5092L6090N782p142j1002j7495K8097O704k7172k3188
$$ y = [-33882, -18930, -4710, 1312, 5100, -2326, -6796, -34771, -20263, -13659, -16952, -18717, -34422, -74569, -92508, -95461, -93587, -92646, -30784, 2475, 28534, 35717, -1908, 26819, 6687, -22640, -32703, -27969, -37662, -40649, -22908, -19320, -6612, -17112, -27120, -35943, -52106, -23145, -24275, -11571, -16922, -8505, 9960, -6281, -38912, -27660, 1364, -31161, -52866, -59238, -44555, -677, -11121, -8395, 11703, 13072, 3060, -33919, -22044, -17827, -13826, -20038, -4264, -12254, 420, -12455, -28497, -15900, -10353, 4503, 1316, -16128, -51779, -74729, -60547, -36130, -34741, -28132, -28656, -43999, -58440, -40553, -15364, 4290, -4915, -23653, -33912, -37156, -66741, -90137, -94504, -113865, -104601, -49509, -13419, -7637, -14779, -25781, -43276, -15179, -8475, -35647, -58835]
16688e8835J1366N095K1612J0341j3363k4402L324N112J5623L5547N915J151q43
16675A7643j5547m6862k9684j3371o274L2807J3077q499N356J9632K983o87j5441
16662d4867m4276O418L0196J6914k1425K6362k597o897j0942j1427N72J2292p843
16649e7520M0379j2136j4081j4168l3707K525j5491K0788L1235J2291m323k3486
16637f7694K7393N3943l1694k5620j1041m177K4757j892r915J0121k406J4932
16625b3293J9563n698J3650k6903L534r797K2139J9454l1250o4577o218L9552
16613d9844L8250J5301j6750N770K8388k2668j689k4764K803L9128J844l1810
16601a6041j1318J099L887l7429j7440J2797M5197J6795o830J1568L2181K006
$$ y = [-58835, -47469, -42374, -20762, -10421, -23784, -48186, -44862, -39750, -24127, 11420, 17335, 18486, 17643, 2096, -44766, -74450, -87821, -94095, -61288, -48211, -56710, -51354, -31722, -28739, -29426, -44867, -89143, -82725, -52529, -35615, -57040, -30678, -33275, -40172, -51114, -62541, -61969, -49677, -57520, -17141, -29277, -43358, -57526, -91233, -88708, -104199, -83411, -52176, -39885, -44208, -67694, -40301, 13642, -18052, -43672, -54713, -58890, -34133, -36025, -45940, -35819, -38225, -23293, -3730, -9428, 4222, -22681, -19147, -28944, -6805, 12649, -18601, -83178, -89396, -49844, -11594, 3707, -13043, -7273, 21115, -1553, -3242, -28006, -25203, 13925, 15769, -16041, -27359, -26260, -22373, -59802, -77242, -64445, -19248, -2453, -9283, 2285, 34466, 36472]
16589C6472m7661k8886o860o466j7592J0853j3112L86O6799M2108m577j8586j3999
16576a121k2604J2091L3915k2370q318n399J0231j1868o765Q721l6733q758o036
16563f5014L276p139K9571R526R626k0674k3074L0415Q506R466M812J1800j1896
16550a0799j0631O595l820k5885l5625K1803L0836q279j8971p350j4164J0642
16538f5648L7725o338p703j9621j5621m838R860M7558J9277j8257l4825O221O899
16525d5311J449P094j2613j3387J8280r995r211R737L1774K3299k5309K3519K9311
16512B8637K8132m1048k6411n813l4628O376L7855J5717k3835k0125J1580K1181
16500b382M0303j5966k3046k4099K9526O834m6681k9215M244M976K7203L0138
$$ y = [36472, -11189, -40075, -46935, -53401, -70993, -60140, -73252, -72866, -6067, 36041, 31464, 12878, -1121, -23725, -11634, 22281, -89, -8407, -13806, -3575, -15443, -22208, -13487, -50220, -58978, -65014, -61738, -68877, -39306, -29780, -20154, -40828, -63902, -33487, -24981, -15515, -10703, 1097, -10799, -21430, -14835, -18655, -44540, -80165, -58362, -27526, -35805, -54776, -62126, -76290, -65648, -27923, -34261, -41964, -61585, -77206, -82044, -72184, -24626, -5349, -23606, -58431, -52210, -45311, -43862, -36768, -49381, -62768, -44488, -54483, -63694, -53957, -22183, 1116, -24193, -674, 28637, 56769, 15721, -10690, -16503, -51131, -44755, -6900, 8817, -15018, -35143, -23563, -2382, 37921, 21955, -1091, -25190, 4336, 11170, -35511, -64726, -60482, -55506, -28303, 1835]
16488A835j9933o297K7051P095j5288N712L240j6394j6937J0406K4523J682J6573
16475B3268K184n23L4085k3672o7935j9517K2593J7180m049k1143l9772p826K6285
16462e8842L9856K7540J6319J9555J758m4104j8680j096j6356J4060L2516K9601
16450D2127r009m1409j094n17l925Q357J8186J0056O953j4455O19j8383m2292
16437d4786J9592J4407J3536j5149J1144O686k1306k2108J1090J1784J021l6305
16425e0394l37K7092j4690O32K5482M1704L4179l3882m7763j9428p318r582L3988
16412b0317m059j9722J7953Q920R76l0505k124O9317K438l1800j0291j5151j3798
16399d8163l590l575L554J5023J4288j990K603R199q736k423J3562L835j1070
$$ y = [1835, -18098, -24395, 2656, 9751, -5537, 175, 3415, -12979, -29916, -19510, 5013, 6695, 23268, 25452, 24929, 59014, 35342, -32593, -52110, -29517, -12337, -16386, -37529, -77301, -85127, -58842, -18986, 8554, 24873, 44428, 46186, 2082, -16598, -17694, -34050, -19990, 12526, 42127, 33118, -8291, -9385, -9902, -13827, -5470, 12716, 22772, 29725, 15270, 15889, -2494, -44786, -25194, -10787, 2749, -12400, -1256, 5430, -15876, -37984, -26894, -15110, -14089, -50394, -50731, -23639, -38329, -37697, -12215, 29489, 63668, 29786, -17977, -37405, -44723, -54305, -20317, -24376, -44098, -26145, -17225, -16249, -46754, -48878, 20439, 22877, -8923, -19214, -34365, -48163, -51753, -55328, -51774, -36751, -22463, -24453, -21850, -12651, -21387, -23810, -10248, -6413, -17483]
16386a7483M99K0581K817j4432l4347j7104K7887p655l429n518M205L2311J1570
16373i8P420J3166O931j9610N418l6604k10R111K8666K5524p052k8116j3848o254
16359a5556M822k5111J726O441l9460j5966J3831J9874J0068k2116m213J6896
16347d8764M1641J5621j6076k8918n1769n939K1306N0895M2698K6749L152k6542
16335B4054k6607l3280Q040K9421J5052j5379j3439J8170J9636L2371J076k9773
16323B9342j1071J75J9895k3888q608l912J5983j2867j6657J7305j4409K0362
16311A1650O898l124r707J6328j4724l641L6045L3386j7189m5249j4591L297J9828
16298A9207J8367J2656m2266k2773J4367o637K6085J8811p996o553j5753j5310
$$ y = [-17483, -16984, 3597, 6414, -8018, -42365, -59469, -31582, -39237, -42666, -48184, -43979, -11668, -98, 7322, 20488, 27419, 7809, 13227, -23377, -23587, -14476, 14190, 39714, 32662, 4546, -9302, -15556, -10734, -35845, -34119, -27678, -67138, -83104, -69273, -49399, -39331, -61447, -65660, -48764, -7123, 8498, -7578, -36496, -88265, -94204, -72898, -22003, 20695, 47444, 50596, 24054, -2553, -35833, -27793, 1628, 16680, 1301, -12138, 6032, 25668, 58039, 59115, 29342, 18271, 18446, 38341, 14453, 5845, 1933, 17916, 5049, -11608, 5697, -8712, 11650, 18548, 15424, 5717, 22045, 7321, 3680, 39725, 73111, 55922, 10673, -3918, -621, 19207, 37574, 50230, 7964, -14809, -442, -7079, 19006, 37817, 29821, 23268, 7515, -7795]
16286g795p048L1p139j7043M983K2285J471o587l9606K3561j1235K2011n100j7083
16272d4294L548J3668J7809j2799P8R831j8495j4578k0946J1015L744o899j0526
16259f8844q299k0927L842N5862O508m269k3208K3363q662o604O783P114p95L113
16245c5023l060K9361k134k1106L1468m387l8999l8838J1057L4217K4244J6887
16233C687J198k3364J4125K4497q708l1423j3847K4924j8798l547L5685J3288
16221A7717j9775m942k0517m0364K467n150J777J0929k981L682O149P784K8118
16208a5106P040j6130j1632n592k7310k64O727J2350L9170K4032j8172n6124q613
16195f9624L392M95P2804j2501J443M150m140K1818k8623k2977k017j8706L021
$$ y = [-7795, -14843, -14812, -21951, -38994, -34011, -11726, -10255, -16842, -56448, -32887, -44122, -22111, -27211, -44294, -40746, -27078, -9269, -22068, -21990, -12159, -30654, -45232, -66178, -55163, -51419, -58318, -68844, -77143, -98070, -94228, -38366, -31858, -36127, -59335, -35972, -44634, -51238, -44455, -37341, -38136, -35023, -38083, -8722, -10856, -31962, -494, -4881, -43880, -82718, -71661, -37444, -13200, 3687, 4885, -18479, -4354, 20143, 11435, -19988, -33835, -8911, -27709, -31256, 4429, 17717, -2058, -7000, -27517, -67881, -65414, -70564, -68787, -57858, -60839, -57157, -51008, -43224, -15106, -8066, -24196, -35828, -41420, -68730, -68994, -62267, -49917, -10747, 13285, -4887, -61011, -69624, -66232, -65737, 7067, -5434, -3991, 159, -3981, 17837, -10786, -33763, -35780, -54486, -51465]
16182e1465J7672K1299K1630Q607k7480l4276o133L0055M193k2672k7322O429
16170e9463K7320K1477j7141j1017j0045r830J0734l091p669j887J9080q836K057
16157d8311J1565L9426J6764k6064L529j0112n443Q12L889j6694J8036j822k5391
16144c9816j1972L313j3492J7302L4093Q323l807p907o637j2498J025K4320K8635
16131B0882J2182n774j8122j3107l8201o044J8501J5398O040j9169j3837J5058
16119b6193K9027j2986m1807k4556K4135J1571k1891K4765M2010q467N466l516
16107b442K3356o968L528J0036k4433l2321j3773N763P719M059J2106k3298K286
16094c4382k9417k2395J3473P713J834J0900N744P530n996l387J9035L586K904
$$ y = [-51465, -33793, -12494, 9136, 17743, -9737, -44013, -50146, -20091, -15898, -38570, -65892, -59463, -32143, -10666, -27807, -38824, -48869, -58699, -47965, -51056, -58725, -60612, -41532, -50368, -48311, -36746, 2680, 19444, -6620, -3091, -13203, -18646, -17834, -13945, -30639, -12603, -14425, -39816, -51788, -48475, -61967, -44665, -10572, -2249, -6056, -13963, -20600, -33098, -32073, -7753, 20882, 33064, 27290, 9168, -3939, -42140, -48184, -29683, -14285, -8245, -27414, -41251, -26193, 2834, -10152, -51959, -76515, -52380, -40809, -62700, -37935, 4075, -4392, 1074, -2442, 20914, 13946, 17474, 27510, 3077, -29244, -43017, -37254, -29535, -25476, -13370, -36668, -34382, -63799, -86194, -72721, -65008, -63174, -52274, -46530, -39000, -44996, -48383, -29348, -25762, -22858]
16081b2858J0604j0565k0044j0489M049K489j3053J5451J6097k1890n4290M0522
16069f3977N3448M634j5461R155J8083j8845p033J7319j7014m708L896O053p877
16056b2327l2968N296m435k2931q90J1647L2647M1959Q60l3949j7219j1853R555
16043d4608J9485K4902J7374m0138n485N667m057K861l101j8229K663J7998n010
16030b9678J1191r86J1066j6561j3321j489j9277L6831p40k8666k2037P307j2731
16017g9091j6348J7909K5945J6820m517j3296k2167N957K9049l4067k5768J2367
16005h7207N3224J2276l97l2250k862K7971m351k5460J2844K8548n434J746K3193
15992A841j143n834J9182J9823k0619j6056m238M849K1671R315N065p548k1519
$$ y = [-22858, -12254, -22819, -42863, -53352, -49303, -46814, -59867, -44416, -28319, -50209, -104499, -63977, -10529, -5895, -21356, -12201, 5882, -12963, -19996, -2677, -19691, -24399, -20503, -14450, -22327, -55295, -49999, -54434, -77365, -78255, -66608, -33961, 7998, 8858, -25091, -42310, -54163, -44608, -25123, -221, 17153, -22985, -28470, -22803, -26860, -23999, -27100, -45329, -42666, -24668, -29678, -18487, -19473, -8407, -24968, -38289, -39778, -59055, -22224, -22964, -51630, -73667, -66360, -79091, -95439, -77530, -51585, -34765, -39282, -52578, -74745, -68788, -39739, -73806, -99574, -87207, -33983, -21707, -22104, -54354, -57216, -29245, -33596, -59056, -46212, -17664, -23098, -21352, 1841, 698, -5136, 14046, 33869, 13250, -2806, -7044, -2195, 19476, 28791, 33856, 26308, 4789]
15979D789j1667l4000j4882O270M37K4756M7034J5117k7917J466j7089j8768K36
15966b4218j730j3970J4056M273K2836k742n4960l1703L090L3562N410j2821j063
15953e9980P004K6737K0374K4912L348k2149J261J4673j6746p858j1689J3815
15941f298K6545L4539l289m0762l4975J6920J8801l0835N260l1592k4196J9391
15929e0491J6991K6788l671l3899l3702n161K0229n300J6008j1283j3472K9568
15917d7395J2687j4259q091J0918J0292L52P190K3726L77j8708k118L670J8594
15904b765j0667k5139j2737j7808J639M647k8398j4145K9764K7076J0185M311
15892c4037l68K2016o87N132j0893j717k817K3217J2569Q771R213j3409k5605
$$ y = [4789, -6878, -40878, -55760, -49490, -49053, -24297, 22737, 37854, 9937, 11403, -5686, -24454, -24218, -25948, -39918, -25862, -21589, 1247, -1495, -56455, -88158, -85068, -51506, -46096, -58917, -59980, -52976, -26239, -5865, 19047, 22395, 246, 1507, 16180, -566, -8424, -20113, -6298, 20247, 54786, 51497, 10735, -24240, -7320, 11481, -19354, -14094, -45686, -69882, -50491, -33500, -6712, -10383, -44282, -77984, -83145, -62916, -68216, -52208, -63491, -76963, -47395, -34708, -48967, -57058, -46140, -35848, -35496, -28306, -4580, -4203, -22911, -25029, -21359, -2765, -13432, -38571, -51308, -69116, -67477, -62830, -91228, -105373, -75609, -48533, -38348, -34037, -34405, -12389, -13076, -7944, -18837, -20554, -23371, -154, 12415, 21186, 30399, 16990, -8615]
15879h615j9063P710j0456Q500J356J1331k723j094j1456J3024K4485k1132j3606
15866b1739j80l038J9716Q145K544L286j7725j5525N783q690J5395J4426j3800
15853a1402q94Q98N070j0294l3128M724n612r347K5087K2112N148L491j477k0107
15839b5731K3327O394l2913O21J5551k4486j4539L8523P888P079J1292K3553M877
15826D1436l4851k4394j730K4489k886j2324l9175j4170O77J9987J9295p182R208
15813b1620Q301j270k1216k8449j1644O511J4607K3003j6738K331P616j5765M2640
15800a1693j0698k0367j2023m977L0957r723p895P276L5377J9308R986l2073l3234
15787c9779n124O862J2480L964j9103J0698j1827k724J0382L2613J8574k8651
$$ y = [-8615, -27678, -19968, -30424, -21924, -20568, -9237, -11960, -13054, -24510, -11486, 12999, -8133, -21739, -21919, -24957, -5241, 2904, 5448, 8734, -8991, -24516, -18733, -27423, -12028, 2398, -11402, -12296, -11398, -6328, -16622, -49750, -45026, -50638, -59985, -34898, -12786, -7638, -4147, -5624, -25731, -2404, 3990, -28923, -28302, -12751, -37237, -51776, -13253, -5365, 1714, 13006, 36559, 41436, 6585, -17809, -19539, 4950, 2064, -10260, -49435, -63605, -62928, -42941, -23646, -30828, -21620, -13319, -14589, -35805, -64254, -75898, -69387, -54780, -31777, -48515, -46184, -38568, -54333, -11693, -22391, -42758, -54781, -59758, -28801, -38524, -46419, -39143, -3766, 15542, 25528, -6545, -39779, -44903, -38041, -25561, -21597, -40700, -30002, -41829, -44553, -34171, -1558, 17016, -11635]
15775a1635l1240m925k9K7940o589m713l9O868K0070J1993J0087O654j9547k1947
15761a7052o931L7251j9777k6799o52L2804o81m0267q603m525j4803p701J8834
15748e8902J0194J8503O840O865J6611K9925J0049l5373r058j554l6405l0340
15736g2645J4836J4975n008j836l3763J7113K1964L4882J8040P969K8338r670
15724C5195j6047O22O042q587O783J434j9930J410j193l300O429L7757m91l6045
15710A0079P837K1094j483o6k4187n144q968k7388r207R416O822K6147J1746m6712
15696c0014l5054j8663J8127L930N113L1757K9707o129m4478j31j8693L7990N297
15683b1241J8949J2380q76k770n583j911J144p589Q430Q942k2580M396J2032q769
$$ y = [-11635, -42875, -47800, -47829, -19889, -26478, -31191, -31230, -24362, -4292, 7701, 17788, 24442, 4895, -17052, -23983, 13268, -6509, -33308, -33960, -1156, -1837, -42104, -50707, -55232, -70035, -77736, -58902, -48708, -30205, -23365, -16500, 111, 30036, 40085, 4712, -4346, -5900, -42305, -72645, -57809, -42834, -47842, -49678, -83441, -66328, -44364, -9482, 8558, 16527, 44865, 35195, 19148, 19770, 25812, 17225, 24008, 25442, 5512, 6922, 5729, 2429, 8858, 46615, 46124, 10079, 17916, 39010, 37527, 37461, 13274, 8130, -838, -28226, -37433, -28017, -21195, 4952, 16698, -30014, -65068, -83731, -65604, -61674, -56561, -24804, 4903, -1226, -45704, -45835, -64528, -26538, -21241, -2292, 10088, 9212, 6442, 859, -1052, 92, -7497, 933, 9875, -12705, -8309, 3723, -5046]
15669e046k1965M437J4947l059J0259M0297m6919j7164L212L2654n381J363L1427
15656C9062N57j0436k0912j911o901K822n288l3516l3931N540J3668n390J9773
15643c6863K9219J3306J1554K531j195k0693k686Q228j9186L943R954k6346J372
15630b6862K4448j8531j4257J0106J5795k2964J03Q057J176k2197J924j026M103
15617d0125J8316N597J0039L297q3J9544J6922j5502J3851o609J5510J522q894
15604C3385k8763k5561p582J294J7764J4544p840l1891k2995J1275K8484J2465
15592e421l775j6731j2107K0750J3161k2986K5764K3943J7644k3448k4396l6672
15580d4274J267L8336K2007J7422k2539k2812k3045O507K4930L7178N620l6901
$$ y = [-5046, -27011, -22574, -7627, -10686, -427, 39870, -7049, -24213, -21001, 11653, 6272, 7635, 39062, 39619, 29183, 8271, 6360, -541, 2281, -3007, -36523, -70454, -64914, -51246, -56636, -36863, -7644, 5662, 17216, 19747, 18552, -2141, -4827, 3401, -15785, -11842, -1888, -28234, -26862, -2414, -20945, -35202, -25096, -9301, -32265, -32162, -24105, -22929, -45126, -43202, -44228, -40125, -21809, -16212, -6173, -2876, -2959, 16585, 33507, 18005, 31856, 25247, 40757, 42279, 33385, 4622, -20939, -28521, -27227, -9463, 5081, -2759, -34650, -57645, -46370, -17886, -5421, -9196, -25927, -38034, -17284, -4123, -27109, -1345, 22598, 40242, 16794, -7602, -44274, -43007, -4671, 17336, 34758, 12219, -10593, -33638, -27131, -2201, 34977, 40597, 3696]
15568C696K0055R631n453J3455m887r693l0175l471l4126j6060J7940K3948j5680
15555c0820j6331N334R119J4502M626k4609K480m312k4625J8546K3850K5647O616
15542A0023j9547q09k9413J780M0468p845j9833l913k68l7018o467J3288o193
15529f5747n215J921j9491r466J6540J2934K215J2157J2977J137K3833J0638j5222
15516b0789j717j7793J3093P219m0169J6402n429M685j0358J9605j6844J6291
15504c5804K6094j8970r96J2307n976j921M344K73j0029k6118J3620P600j16l304
15490c8996K5234M787j3273j2416Q408J3777K1699K6603K2826j7907k0722j7622
15478B398n482k1259q862r837K6385J3640k0530J0165N491l602l5672K4218M1482
$$ y = [3696, 23751, 33382, 27929, 41384, 36497, 26804, -3371, -6842, -40968, -57028, -39088, -15140, -30820, -47151, -41817, -32698, -18196, -13570, -38179, -35699, -40011, -64636, -46090, -22240, 3407, 10023, -9524, -10333, -39746, -37966, 2502, -5343, -25176, -29089, -29357, -66375, -72842, -59554, -65747, -70962, -69041, -88532, -97998, -81458, -68524, -66309, -54152, -41175, -40038, -16205, -5567, -20789, -22506, -40299, -27206, -19987, -60156, -43754, -49183, -44498, -54856, -35251, -52095, -35804, -9710, -28680, -29676, -17369, -23345, -25266, -20922, -20649, -30678, -56796, -43176, -35576, -35692, -38996, -13762, -8975, -22248, -34664, -26256, -12479, 9220, 35823, 58649, 40742, 20020, 2398, -3084, -24343, -33205, -43042, -16657, -3017, -23547, -13382, -7891, -11493, -47165, -22947, 18535]
15465A8535r699l1294l5085k0996M3468L9621k833l430j4333K1717j2620l0286
15453c7235k575P667J7937K7581K5813k3833l8629j5909J1007L648k453n524J2820
15440a9685j3278l5753p932O2734J9906Q620J326j1546n4688K939o867k3941M444
15427g3721L9826K3197l9222m4870K0311K9049n714N382j8229Q543r332j8565
15415h3345M4671J5011j6487n043L1639N5366K0780j127j1401j6383j6613J8594
15403C5662J390j3316N218j2595J4712k0428l6592j8547K948K9384J7705j0713
15391e172J8553r353q31j3529R723M321J4874O227J6735k3030n5235r588N503
15378d0802K0143J1693m849j2958J5126j4499O144J2648N577k6179O130j5155
$$ y = [18535, 8836, -22458, -57543, -78539, -35071, 4550, 1717, -1713, -16046, 5671, -6949, -37235, -39810, -32143, -14206, 13375, 39188, 15355, -23274, -39183, -28176, -24528, -26981, -32505, -19685, -32963, -68716, -76648, -13914, 5992, 14612, 15938, 4392, -50296, -47357, -54224, -78165, -73721, -33895, -10698, -49920, -94790, -74479, -45430, -51144, -45762, -63991, -55448, -64780, -83345, -38674, -23663, -40150, -45193, -13554, 41812, 62592, 61465, 50064, 33681, 17068, 35662, 37052, 23736, 28954, 16359, 31071, 10643, -25949, -44496, -41548, -12164, 5541, -5172, 13381, 4028, 3197, -10332, -609, 3712, 18586, 24813, 41548, 18518, -36717, -46305, -40802, -20659, -8966, -13815, -26773, -11647, -26146, -20002, -7354, -1777, -27956, -21826, -36981]
15366c6981k0271J6165L1173J4976R889L6894j4595m6982J3748M379k039J5935
15354B2291J3269k0881j7067M59j4453j8682p368Q615Q102j7152l6968q536M7821
15341d0550L2842K7529O975j5217R33Q501n382p3L579k1872J0531k6780O802N0839
15327C8657j1484m3219j6006L2792K3642j7780Q810Q951K8563J8794J3285r133
15315G5872l6599n0288o459K7630R804J6989M733m6559r752l9801k7861K4482
15303e7809L2076K3767L0379k3920J693L0219k0531j2974M135k511r009k6034
15291c0519k9121k871L7941J6163J1035J5251j786r873R690j681k876q430J1540
15278A4463k634r424k0666l5644J2688J4752J1907M0245J7653j9918K648k1478
$$ y = [-36981, -57252, -41087, -9914, 5062, 14951, 51845, 37250, -9732, 4016, 8395, 6356, 22291, 35560, 14679, -2388, -1929, -16382, -35064, -42432, -33817, -25715, -42867, -79835, -88371, -40550, -7708, 19821, 26796, 11579, 12512, 21013, 15631, 15558, 19137, -2735, 7796, -18984, -12182, 38657, 27173, -16046, -32052, 740, 24382, 6602, 15412, 24363, 52926, 71720, 85005, 75872, 39273, -11015, -17474, 10156, 19960, 36949, 41682, -4877, -14629, -54430, -82291, -57809, -25733, -1966, 28413, 4493, 6186, 36405, 15874, 2900, 7035, 4524, -4485, -30519, -59640, -62511, -24570, -8407, 2628, 17879, 16093, 6220, 15910, 14229, 11353, 2923, 14463, 11829, 2405, -18261, -53905, -41217, -26465, -14558, 25687, 43340, 23422, 26070, 4592]
15266D592p1m052p860r432M321r173J546O300M134j0992J4600K9799M423O119
15252C4254J1975k1147j7636l0757K342K3096K6277N337l2104r708J1909j6791
15240a2953j9625K7742J9297J5805J6267k2352n1032p177p332p822P219K3834
15228a8129K0459L841k7224O727J6967p463N474R185L1194J4973m0098j8609J416
15215a287K0802j4293K621j1812R817j2908k7877l449K9929n090l4014K888K1802
15202b2871L897M7162K2339K4014l1701k8008J6147j64J24J2584p682j113k7126
15189G602l3312j5441j5098K1029N2049O925j4749n267p421j8366j2705j3689
15177d8443k2140M3982M4891l3948j1517J0152J7142l198j4691q872L8621q76
$$ y = [4592, 4521, 469, -7391, -16823, -12502, -21675, -20129, -13829, -9695, -20687, -6087, 23712, 28135, 34254, 46229, 25082, 7446, -23311, -20969, 2127, 28404, 33741, 1637, -8071, 3838, -12953, -32578, -4836, 14461, 30266, 46533, 24181, -26851, -34028, -41360, -49182, -41963, -18129, 2330, 6171, -21053, -14326, 2641, -4822, 652, 9837, 41031, 56004, 15906, -2703, -1287, 19515, 5222, 7843, -3969, 5848, -7060, -34937, -38386, -8457, -13547, -47561, -44673, -22871, -18974, 28188, 50527, 74541, 42840, 14832, 30979, 30815, 30939, 43523, 35841, 34728, 7602, -25710, -41151, -56249, -35220, 16829, 23754, 9005, 3738, -3683, -22049, -34754, -48443, -70583, -26601, 18290, -15658, -27175, -17023, 119, -3079, -17770, -26642, 11979, 11103]
15165A1103j6451J0063o389j6149j1096K912N848j4430J896M6192Q776p529k4917
15152a0171J2038n68N263l6877l2859M059M151r341k2855J0844J3399L4719K7881
15139c17L2261m7963l9501L2020J0965k355J3841J7539J8957L594l100j5000R804
15126C0745l4879K1713J8603j0645K9708q993k2424j9501j9533k467K763k8856
15114d3766J0743L6062O583j6327M391J0681M770k0558J2737l047J0226j5945
15102c450l0172j0351K2060J7530p261j1195J9774P424k5102K337k8996j4119
15090f1521M833J9835K0641m911j5689k5756o317R348J1184j2675j6405Q658K7712
15077d1063N311L3491J4263M293p172j2992J5842J7487k4372j6419l290k2842
$$ y = [11103, -5348, 4715, -1674, -17823, -28919, -26007, -20159, -34589, -32693, 13499, 22275, 14746, -10171, 1867, 1299, 6562, -30315, -63174, -59115, -54964, -64305, -87160, -76316, -62917, -28198, -317, 31944, -16019, -55520, -23500, -12535, -14890, -1049, 16490, 35447, 39041, 35941, 20941, 30745, -4134, 17579, 36182, 25537, 55245, 46252, 23828, 4327, -15206, -17673, -14910, -43766, -33023, 3039, 9622, -6705, -2314, 8367, 13137, -7421, 5316, 2269, 12495, -3450, -33622, -43973, -21913, -4383, -11644, -22839, -3065, 4359, -20743, -18406, -47402, -61521, -56688, -36853, -16212, -21123, -36812, -62568, -68885, -59537, -48353, -61028, -77433, -68775, -41063, -35752, -2261, 12002, 16295, 9123, -3869, 11973, 29460, 5088, -11331, -14621, -37463]
15065c7463Q486M1690L4999k3163j8436n509k327L0838L1903m3093m7030J6682
15053a2423K539j8837K830L7637q841j3001K9930R802k7068j8848N062k6693N845
15040c2066J3415J599M7345R069l0862M598l1932K565K281j7867o58k1030k427
15027e5970r601K9554O605J9064J5998J6980j5976j8180J4715l0230j256k5718
15015e4015j4811P935M0648J5315l1916J1179K479k584Q689M0693k9897j2298
15003a8583K8474K8017Q436l1372k5942J0928L6731q897k8151r885J3284M0059
14991D3099k3126R804n052k4137K7313K1952k1011l1044n517L2244J6904l1604
14979I825q188O135J9195K5672K1969j8459n363l8974k1021l9184k7051K6462
$$ y = [-37463, -28977, 12713, 47712, 24549, 6113, 604, -1723, 29115, 61018, 17925, -29105, -12423, -9884, -28721, -25891, 11746, 2905, -10096, 19834, 29636, 2568, -16280, -11218, -37911, -32066, -18651, -17052, 30293, 39362, 8500, 13098, -18834, -16269, -13988, -31855, -32513, -53543, -55970, -65571, -36017, -29412, -10348, 5650, 22630, 6654, -11526, 3189, -27041, -28297, -54015, -68826, -60891, -20243, -4928, -36844, -25665, -23186, -25770, -17081, 23612, -6285, -18583, 9891, 37908, 46344, 14972, -10970, -42, 36689, 27792, -359, -10244, 3040, 43099, 19973, 29777, 24725, 588, 27901, 49853, 28842, -2202, -7719, 24525, 41429, 9825, 1637, 7772, 26967, 52639, 74608, 56149, 50786, 11812, -9209, -48393, -75444, -48982]
14967d8982j979j4420j0407P779K7605J3006m8681K5323N9147K9159j011k0503
14955A6036q600l2431n068N10K8K6976K418k7023O692r019p797Q624J3041J8590
14941B977L0547J7220l1397j6184k9570k2454J107K7914J7510J2475K1734J2942
14929D4821l079l2679j4314m6749j9728Q833K4130P706M70o92K2997M762l8594
14916d2116J1500L4639O813j493J537j1349L666k5438m0245k564L0903J4433m709
14903b4423K0571j9383n14J8905K2731J648q022O439J9133J3464j3344J7903K338
14890E7446k0268l9141j8692p340J11M289j5401L0757J5336k9980k1577j1277
14878e5737J1094M22J5542K1659K3973j6640j2306J2620O196M874k5095p700Q899
$$ y = [-48982, -50961, -65381, -75788, -68009, -40404, -27398, -76079, -50756, 8391, 37550, 36539, 16036, 7436, -24995, -30063, -29553, -29525, -2549, -131, -27154, -20462, -29481, -37278, -28654, -15613, 2977, 33524, 50744, 19347, 3163, -26407, -48861, -47754, -19840, -2330, 10145, 31879, 44821, 41742, 9063, -5251, -52000, -71728, -62895, -38765, -31059, -30589, -31281, -8284, -3522, -42116, -30616, 4023, 10836, 9343, 10880, -469, 3197, -22241, -62486, -65050, -34147, -19714, -24423, -3852, -23235, -23749, -4844, 17887, 19535, 11513, 17952, 37085, 50549, 37205, 55108, 57446, 37178, -1963, -20655, -27995, -27884, -23595, -38996, -8239, 7097, -22883, -44460, -55737, -44643, -44221, -28679, -7020, 16953, 313, -11993, 627, 6823, 11697, -13398, -21098, -12199]
14865a2199n857Q298k0467Q994J5725J8325O370o249J531J4982K0105j2639l9393
14852b474n5103Q236L7869L0950M602k465j2463J7702o17O379j151k865J5000
14839D3600M330k3132p052j3613j4548J4744l1004l788K7383L2430j659p516k448
14826A7727j173j0113j0209J6694K8264O871l771r57l514J3858K329p9j974k7902
14812B6051j9294P043M169J3758J6133k2248r519j6093k0596K482K7488J800m0968
14799b9794j6771N3576M1668J9996r861J5553m0238k6308J772Q40L4895J159j6701
14786B9786K201q544j3692J5960k1426Q036J189k1937k88J2161l6296j2956K8264
14773a7542K7735K5905q803j4198J103R722J4526O583j8086j1696j899j0164L501
$$ y = [-12199, -18056, -9758, -30225, -21231, -5506, 12819, 19189, 12940, 14471, 29453, 49558, 36919, -2474, -57577, -49341, -11472, 19478, 24080, 21615, 9152, 26854, 26237, 32616, 31465, 28600, 43600, 47930, 24798, 17746, 4133, -10415, 4329, -26675, -30463, -3080, 29350, 27691, 20175, 17727, 16554, 6441, -3768, 12926, 41190, 48061, 44290, 43333, 39819, 53677, 56006, 55927, 53953, 26051, 6757, 13800, 17969, 31727, 47860, 25612, 16093, 0, -20596, -18114, 9374, 11174, -29794, -46565, 7011, 48679, 68675, 58814, 74367, 34129, 7821, 9593, 10433, 45328, 46487, 29786, 31987, 23443, 9751, 25711, 4285, 12321, 13510, -8427, -8715, 3446, -32850, -45806, -17542, 10193, 36098, 27295, 13097, 14200, 23922, 38448, 45031, 26945, 15249, 13350, 3186, 6687]
14760F687k4200L416K3372N156j3431l914J9793K7571L3506M046k973j1255o0356
14747G418j6394J0999J8577N475j7778O582l885j3320r733K386j2372J7950L0390
14734B6295nJ1072k957k0284k1311m4566l665M957K93K7780J3761J2330M67k1943
14720a7776O262K2400p618l280p550q326j1078k1465j3823k7632P968L315J4177
14707f4426K0819m362N0605K3804k4102l3058j4114j4869j0886j56j5121N340
14695h0526M8760J204Q75K1898M629r447j2710K8623R963L104J9895j1014k9969
14682d715Q834K3247k342n496O643O007m3828Q036K1637J0923j1882m204K194
14669A5054J4334L6985q906j0002l5138j1395r844k0937L3408n410l0449j1291
$$ y = [6687, -17513, -14097, 9275, 14431, 1000, -2914, 16879, 44450, 77956, 82002, 79029, 67774, 7418, -8976, 2023, 20600, 26075, 8297, 14879, 10994, -2326, -12059, -9673, -22045, -4095, 26295, 26290, 37362, 34405, 14121, -7190, -51756, -55421, -50464, -50171, -22391, -8630, 3700, 4167, -17776, -11514, 10886, 3268, -12, -7562, -15888, -26966, -48431, -62254, -89886, -81918, -78603, -64426, -43607, -47969, 2636, 26440, 2338, -30720, -44834, -59703, -70589, -70745, -85866, -80526, -31766, -30562, -29687, -7789, -3160, -12607, -25317, 3306, 13269, 16373, 36268, 25254, -4715, 4119, 27366, 25024, 19528, 26171, 32178, -11650, -3614, 18023, 28946, 17064, 12860, 15054, 29388, 66373, 57467, 47465, 12327, 932, -8912, -29849, 3559, -1851, -32300, -43591]
14657d3591J4863J1620N577k1422M383K2983P047k331Q864K1301l7471j2077R721
14644a0533J2206j3259l3296L465L2028K3297j2316l8930o829J6762K7934K1169
14632B1698R185J5846J2294j8506k0918p564k2731p869L9631K755k0247j7798
14620a4224J1761L4833j707K6807j4587l9900M067j3449k056N83j4534j9302L8954
14607b754K5555j7834q686P460j2799M401q99k0233J8484K0010J6395J0362K1884
14594F1346j4189j4719j6760j0264k4162k90j3691L5807J0973j7506j0381K6224
14582A2388k7125r107J0384J5520L741p920O086r807j0k1592k499M0193J6180
14569B6432J7929K2109l1345j4065R732n5803q145N3509K491l0039m6530k966
$$ y = [-43591, -28728, -17108, -11531, -32953, -28570, -5587, 1460, -871, 7993, 29294, -8177, -20254, -10533, 1673, -11586, -44882, -41417, -9389, 13908, 1592, -37338, -44167, -27405, 529, 21698, 30883, 46729, 59023, 40517, 19599, 12035, -10696, -18565, 21066, 23821, 3574, -14224, -2463, 32370, 30663, 57470, 42883, 2983, 7050, -6399, -8455, -7872, -22406, -41708, -2754, 22801, 4967, -3719, 3741, -9058, -4657, -5556, -25789, -7305, 12705, 29100, 39462, 61346, 47157, 32438, 15678, 5414, -18748, -19038, -32729, 3078, 14051, -3455, -13836, 12388, -14737, -23844, -13460, 2060, 5801, -2119, 3967, -5840, -5850, -27442, -29941, 10252, 26432, 44361, 66470, 35125, 21060, 30792, -25011, -33156, 20353, 22844, -7195, -53725, -56691]
14557e6691K7349j5014j4861L402K1050L5010L8865o112j0300j2724m324k0154
14545a4504K6041L0976j4187J3015J9890j9490r065l799j1011j6543K7856J0328
14533C9507n979m0958m367J6743J0769K2647J1127j1023m9942r844J5252j9666
14521b5734o050M4978K3859j5616m1171J279J6819p455J1469M6547J6214K4626
14509H9765k1303k9652j4677P911J7007l87n422O46J2175j8007Q682m663o404
14496C5671P06M03q637L722m1358l4R603q765L307j2346P583O929L3970K4278
14482E5032O504k4798k3408j6858q376k894K2241K392Q257r242l1184K2480O454
14469F600j9316J0119J3170M097K0324j9605R208m87k7122k0386K7541N3731l897
$$ y = [-56691, -29342, -44356, -59217, -55815, -34765, 245, 39110, 32998, 22698, 9974, 5650, -14504, 11537, 42513, 28326, 41341, 61231, 41741, 32676, 28877, 17866, 1323, 29179, 39507, 33528, -7430, -11797, 4946, 15715, 38362, 49489, 38466, -11476, -21320, -6068, -25734, -31784, 13194, 37053, 21437, -19734, -18455, -1636, -9091, 2378, 48925, 65139, 89765, 68462, 38810, 24133, 32044, 49051, 48664, 43242, 43888, 56063, 38056, 46738, 42075, 35671, 36377, 36780, 28143, 31865, -9493, -9527, 76, -8689, -5382, -17728, -10145, -3216, 30754, 55032, 61536, 36738, 13330, -3528, -11904, -14798, 7443, 9835, 18092, 8850, -22334, 146, 6600, -12716, -2597, 10573, 14670, 34994, 15389, 24597, 24110, -3012, -23398, 4143, 57874, 53977]
14456E3977l482m2599j9320L154L0070J4175j3958k1990l5797j7945J0904K2060
14444b0751J6994j6928L418L3038L0591K059j8183k4828k4109J4565R486J2659
14432A8011J5900J9417L636l7953l3123l4278J8390J1296r334j5185j3055L566
14420e2712L760K6068K6497l0646l8471k9812K3608K0325K1477M5766p525l2465
14408b4130K2031J8557j7715j5775J578J7266R016j7101m9217r341M0314K0219
14396d298J0352K8582k4205r401o102N356O234j4194l7110r548K7634K7112J5334
14383A5746l390j3487P107K1630P207J1956J442p235K416k96k7650l0795j760
14370a7109J4350J4370j18l72L372n209j8380N98N779j0403J0615j1508q962J5814
$$ y = [53977, 50495, 7896, -11424, -8270, 21800, 35975, 22017, 27, -35770, -53715, -42811, -20751, -3757, -20685, -17267, 15771, 46362, 48421, 30238, 5410, -18699, -4134, 5352, 18011, 33911, 53328, 56964, 19011, -14112, -48390, -30000, -18704, -28038, -43223, -56278, -52712, -48952, -22884, 3613, -27033, -65504, -95316, -71708, -51383, -29906, 15860, 8335, -24130, -2099, 16458, -1257, -17032, -15454, 1812, 10828, -6273, -55490, -64831, -24517, -4298, 6054, 34636, 10431, 1030, -5072, 284, 6518, -7676, -44786, -54334, -26700, 412, 15746, 12356, -1131, 5976, 27606, 34813, 46769, 48211, 40976, 43392, 43096, 15446, -15349, -17109, -2759, 11611, 11493, 11121, 14493, 9284, -9096, -8498, -2719, -13122, -2507, -14015, -22977, -7163]
14356g163J8869k4968o466J3933k878K457m0187r756L1455L3049M712J5622J9971
14343D8650j4562p137K355J660j6625p695k2675k3678P357J1888l442j1256k6593
14330f1753l719K1412j0825K085K8448J980N784K4150L1031j5526p984K94J9406
14317C4783k1648k3308j5695j3991j1947J0405K1285L5783O834O776m0417j6389
14305b7529L298J6993O802M031J7129J3684J0397Q038j8168L439j2869L22l084
14292B2483n778k1989q646K3342P768K1492J35k0473R660K9830k0083K2933L724
14279F4398M002j0851q36j6368j0810j699L306m693J344J8794L494j9595j0031
14266B0455j6485R374L81j661M2880j4207p344N720j5112l0747l6360R886L9748
$$ y = [-7163, 11706, -13262, -19728, -5795, -8673, -6216, -46403, -56159, -24704, 8345, 13057, 28679, 48650, 34088, 26951, 29306, 30966, 14341, 6646, -16029, -39707, -32350, -20462, -23904, -35160, -61753, -65472, -44060, -54885, -52800, -24352, -22372, -16588, 7562, 38593, 23067, 15083, 15377, 34783, 13135, -10173, -25868, -39859, -51806, -41401, -20116, 15667, 22501, 29277, -11140, -27529, -24231, -7238, -436, 3595, 20724, 34408, 44805, 52843, 34675, 38114, 25245, 25567, 22483, 16705, -5284, -13930, 9412, 17180, 38672, 38807, 18334, 27994, 57824, 37741, 60674, 64398, 68400, 57549, 56713, 40345, 29535, 27836, 31142, 26449, 27793, 46587, 50081, 30486, 20455, 3970, 13344, 13725, 12064, 54944, 40737, 33393, 39113, 24001, -6746, -43106, -33220, 6528]
14253F528k666m737J0402K3253K0928J2385o768J720p442l1082l1426j5661J0444
14240a4122K875o91m907L1250L0611m2954r248L7951j50j5699M473J6589n379
14227C0599j5684j6963N8423J7791m513j5614l431o131k5206K3169J5494j4021
14215D3913j3974j6058j0472p675j9479j1528N4684K688k7776m1398k363K5488
14203b3950L8603J6618O927J980J0652l200j0337j7884r500R868j3478Q207O649
14190B1155n82j7122j8665P736K5247j6840l8480o25K7463p196j824L602J3219
14177b912j1571n300K7520K0958J0260j0799k1209q375M153l3j180j75J4696N428
14163B1461j8900K0555J5883o950l3176o467J1579k07j2731k1462n194N829K0259
$$ y = [6528, 3862, -875, 9527, 32780, 53708, 66093, 59325, 61045, 53603, 22521, -8905, -24566, -14122, -11247, -11938, -16845, 14405, 45016, 2062, -7186, 30765, 30615, 14916, 19389, 35978, 30599, 14915, -2048, 56375, 74166, 69653, 54039, 50608, 44477, 19271, 42440, 57934, 43913, 29939, 13881, 3409, -4266, -23745, -35273, 19411, 22099, -5677, -47075, -49438, -23950, 14653, 31271, 38198, 40178, 50830, 47630, 37293, 19409, 9909, 19777, 6299, 14506, 21155, 20573, 3451, -15214, -7478, 17769, 929, -37551, -38176, -10713, -17909, -19733, -16131, -2912, -14483, -19783, 7737, 28695, 38955, 28156, 6947, -1428, 2725, 2692, 1512, 1337, 16033, 21461, 2561, 23116, 38999, 32049, -1127, -7594, 3985, 3778, -8953, -30415, -35609, -29780, -9521]
14150i521l921l0554J1447L4213J5546j5235j4698l0431m812L3845j657M183L822
14137g773j1120j1609p08J1286k8598j1390M477J5833J8384k1137j8775o92L0602
14124c1220K7627J7030L939O972J9461K4554J8200j0559j5405k2470k2181k2317
14112f369j770r953k322J2925K5859R011l3340K048L589J5452k8046J4862L8504
14099D0450J9658k5422k5180j2061L2143k3244l4517K4316j4624J7869M2665J7815
14087E9868j5687k0896O688J8926P111k2177R23j7793N591J2950K5409j6678j6898
14074B7337R031l7552l6766j4172p012K1374M1428L6211k7833o380J7113J256
14062B4035J1618J4862r195q107m3372q655j0771K49P308L0296L0531J5183j6517
$$ y = [-9521, -13442, -43996, -32549, 1664, 17210, 1975, -12723, -43154, -47966, -14121, -15778, -11595, -7773, -18893, -30502, -31210, -19924, -48522, -59912, -55435, -39602, -21218, -42355, -61130, -61822, -31220, -3593, 13437, 17376, 24348, 43809, 68363, 86563, 76004, 60599, 38129, 15948, -6369, -8139, -18092, -20414, -7489, 18370, 27381, -5959, -3911, -322, 15130, -12916, 1946, 40450, 60108, 34686, 9506, -2555, 29588, 6344, -28173, -3857, -18481, -612, 42053, 59868, 44181, 23285, 29973, 48899, 56010, 33833, 34756, 16963, 22554, 35504, 60913, 44235, 27337, 36368, -1184, -37950, -52122, -59134, -37760, 3668, 39879, 12046, 5666, 22779, 24035, 35653, 50515, 41320, 33213, -10159, -18814, -29585, -29336, -22028, 8268, 38799, 53982, 37465]
14049C7465K2317L359L234Q580k3332j3683j5121o648J8070P208k6572k7203K1109
14036H783K7665L152j8416L018Q21M301j8574Q278j5369j9406j6566r72M3342
14023A0057j2518j2811j8331O717J9393L285K541M869l8462r826N3156K0940l7104
14010h094O894R134n845O670L975Q0P776J8636k6090n090R761K8792n35m788J1477
13995E2753N133N623k7366j0964k0616J4935L8289l80R006K331l50j2758l441
13982E2195j2649l3420j3744J8J860j667M886L5445J4207k6577l0886L814r121
13969a5639J612K201N894J7682k2504j3636j4522L6924l26k4896K3770J9071j1467
13956D164J5086K7155o594k7558o426j017M392J5861K9384K945k0550j1891k5556
$$ y = [37465, 59782, 63141, 66375, 74955, 51623, 37940, 22819, 16171, 34241, 41449, 14877, -12326, 8783, 36448, 39600, 21184, 24202, 25023, 29324, 10750, 19028, 3659, -15747, -32313, -33285, 10057, -2461, -15272, -33603, -26886, -7493, -4208, -1667, 3202, -35260, -45086, 8070, 29010, -8094, -1200, 7934, 2089, 8759, 12734, 12814, 20590, 39226, 13136, 8046, 17807, 46599, 46064, 41276, 52753, 57886, 63509, 36143, 25179, 4563, 19498, 57787, 57407, 66413, 68744, 68394, 55636, 52195, 39546, 6126, -7618, -7600, -5740, -7407, -2521, 32924, 47131, 20554, -10332, -6518, -15639, -14027, -11826, -5932, 11750, -10754, -24390, -38912, -1988, -2314, -27210, -3440, 15631, 4164, 19250, 46405, 39811, 12253, 5827, 4810, 9202, 25063, 54447, 57392, 36842, 24951, -605]
13943f05P504L7249L2757q216j4568k994k0119n6548j7501N518M0843K2546K2960
13930D8826r752j6306O299R568Q657l109l1124k2711M1207K6321J2840k7118R274
13917E2872j1784J683j2172J903J9428j9338J104M8231K8142K5405q848R996j3780
13904A22842k8609k0098j731n063J2203K1428J1698P940k3547n0072K4362K5981
13892I7334M081j7467j636P939k8321L05l1936j4199K5312K6252k7371j4634J203
13879B6862M5935j725n6141j2627N721J5649K7278L889j4897k3707r688L5161
13867D1710J6527k1007k7986L091K9940k1676L802M0877J8000j5312k6017k2464
13855A9485q140L289R570k4392j4895M4402L0204J100o75K813j0582J2805R138
$$ y = [-605, 6899, 44148, 76905, 68689, 54121, 51127, 31008, -25540, -43041, -37523, 3320, 25866, 48826, 39074, 22768, 29067, 38635, 47292, 44183, 13059, -9652, 31555, 57876, 70716, 43598, 52872, 41088, 42771, 30599, 32502, 51930, 32592, 33696, 81927, 110069, 135474, 126626, 136622, 122842, 94233, 74135, 72404, 67341, 79544, 100972, 112670, 120610, 97063, 46991, 71353, 97334, 101415, 83948, 82312, 90251, 61930, 62235, 30299, 16100, 41412, 67664, 40293, 25659, 26862, 72797, 71072, 14931, 2304, 8025, 23674, 50952, 54841, 39944, 16237, 6549, 41710, 58237, 37230, 9244, 12335, 42275, 20599, 24401, 65278, 83278, 67966, 41949, 19485, 11345, 14634, 24204, -188, -15083, 29319, 59523, 60623, 59948, 62761, 52179, 64984, 74122]
13842G4122j2881J1864N4062k4573n0885k6347N68q163M823P656K4709L5502k9469
13829F0988o160l3389j9697K4911K0685r290j987j0357o763j4682R659j159J6192
13816B8951k8492K3074L7791j0969m39L364o805j7588r438k2443r888j8730Q027
13803b3585R805L717K8140K9279M987k047K0944m280l1076n0520l6728J0397M6313
13790E346K4455r711k339J3791K0653p933k8297j3371n064j9614J8351L1141L0955
13777E8363j4524k9357N432J8196K1515N371j3452j3935j8524r361L0716q954
13765C1486l0155k1998R997K1023K3868K1943k0584j2084l3112l7523K0405R042
13753a7692J4879J0522J3050J2631j3963o258m2890k1637k644K8588K9300N202
$$ y = [74122, 61241, 73105, 127167, 102594, 51709, 25362, 25930, 17767, 22590, 30246, 54955, 90457, 60988, 54828, 21439, 1742, 26653, 47338, 38048, 36061, 25704, 18941, 4259, 13918, 12759, 28951, 459, 23533, 61324, 50355, 49916, 53280, 46475, 28887, 19449, -2994, -12882, -31612, -23585, -13780, -10063, 18077, 47356, 52343, 50296, 71240, 66960, 35884, -14636, -51364, -40967, 5346, 29801, 20090, 17751, 31542, 52195, 44262, 15965, 2594, -2470, -22084, -3733, 27408, 58363, 43839, 14482, 19914, 38110, 59625, 64996, 51544, 37609, 19085, 9724, 40440, 31486, 1331, -20667, -10670, 10353, 34221, 56164, 35580, 23496, -9616, -47139, -26734, -17692, -2813, 7709, 20759, 33390, 19427, 13169, -29721, -51358, -54002, -25414, 3886, 9088]
13741I088n260j1892J8502K1957J492K5794J8687k8091j5774j1356j3814N826
13729A5159J8599k387L4464J797o254k0305q840l020J0830j9928O209J8135L295
13716D7754r722L681J1298K2163l211R938k7069j5416m4300R620K4755J6510M259
13703E0260J2636k016J5268q993k4641K7581J8117r354l3674o243j0001K1781
13691E0721K0177J3295L1244J5235j3784j6701L372J4736l2618o3870k1833r991
13679a0017J8007K0717j6290o959K8859J211l3764K0217M173J8449K6125r65j488
13666F8275n840k495j7145l3782J5747J4913j8698J2056K4065j6573l622l347
13654C3554j2029K6066K3890n69R073j0424j4395r83k0784K399k089L6746m952
$$ y = [9088, 3828, -8064, 10438, 32395, 33887, 59681, 78368, 50277, 34503, 23147, 9333, 15159, 33758, 31371, 65835, 67632, 61378, 41073, 32233, 29213, 40043, 20115, 26324, 44459, 47754, 38032, 41713, 53011, 75174, 71963, 81901, 54832, 39416, -4884, 4736, 29491, 46001, 50260, 62896, 60880, 76148, 67155, 42514, 70095, 88212, 78858, 45184, 38941, 28940, 50721, 70898, 84193, 115437, 130672, 116888, 100187, 103559, 118295, 85677, 21807, -26, -10017, 7990, 28707, 12417, 5458, 34317, 35528, 1764, 21981, 26154, 44603, 70728, 69763, 68275, 62435, 59940, 42795, 9013, 24760, 39673, 20975, 33031, 57096, 40523, 36901, 33554, 21525, 47591, 71481, 70912, 79985, 69561, 55166, 54183, 33399, 35798, 33709, 70455, 65503]
13641F5503k6867L932n496n1759J5954J8714N7909O372k3040k321J9198j5420
13629F2679j0635k0665k6067J7523K4892K2237p825j5177J364j0640p862J2214
13617D2038j3303k3887J9690K7897j1266R388J0559L5754M7148P6511Q7487J1117
13605C19133j4121n1036p1214m2197m3140l0756m299k920K4678J683j1206J0870
13593H5475J8012j1123k9613j7331Q055L987J7535Q441K6443J473j9474k389j5458
13580G4033l4171l795L0012J6381j7209j1824K1065j248j9821M3568P5905p972
13568A64924j5737M4120L5927N1749R7124J13977J49578J47803J6651j19689j58342
13557E28085j73375p7271m1265o8463J768K1356m8081k8393j5525l2549l2964
$$ y = [65503, 38636, 42568, 37072, -14687, 1267, 19981, 77890, 84262, 61222, 58901, 78099, 62679, 52044, 31379, 5312, 22835, 47727, 69964, 62139, 46962, 48326, 37686, 29824, 42038, 28735, 4848, 24538, 52435, 41169, 50557, 61116, 96870, 144018, 220529, 308016, 319133, 305012, 253976, 182762, 140565, 97425, 66669, 62370, 59450, 84128, 85811, 74605, 85475, 103487, 92364, 62751, 45420, 53475, 57462, 74997, 83438, 109881, 111354, 91880, 89491, 74033, 39862, 36067, 66079, 82460, 65251, 53427, 74492, 73244, 53423, 96991, 172896, 164924, 149187, 193307, 229234, 280983, 378107, 492084, 641662, 789465, 806116, 686427, 528085, 354710, 277439, 236174, 167711, 169479, 190835, 142754, 114361, 98836, 66287, 33323]
13546C3323L985J8148M341k2571l9314o880K7015N4193L0288J1069J2002j7430
13534A08169j7940j8232J0678K8558R693j174j2725K2202L1878n687K0893J5683
13522A91996O806P319K9896Q7834P7384J82652K03655P2416q3363j82028j90531
13511D04036j14665p3997n7837j1955K4813N381l1187o1007j6618R846j635k0928
13499E4247j0008L1497K0370K7956R944k9232L31n451k1540N071J0623k0626k087
13486G1095L4910K6042k7057m3183m778l941J789L1447R985j1681J884M854J3168
13473A04534R1451P1067M7257J4063k0504n9789n8583j9617l9944m6384j1409
13462G2142l309p040k2791J35M2673K6035r951r311n2705k2542p997K6001M0934
$$ y = [33323, 37308, 55456, 59797, 37226, -2088, -8968, 18047, 72240, 102528, 113597, 125599, 108169, 90229, 71997, 82675, 111233, 120926, 119752, 107027, 129229, 161107, 155420, 176313, 191996, 198802, 206121, 236017, 323851, 401235, 583887, 787542, 859958, 776595, 594567, 404036, 289371, 215374, 157537, 145582, 170395, 175776, 144589, 83582, 66964, 76810, 75175, 54247, 44239, 75736, 96106, 124062, 134006, 104774, 105105, 99654, 78114, 83185, 93808, 73182, 71095, 106005, 132047, 104990, 61807, 57029, 53088, 54877, 86324, 96309, 84628, 86512, 91366, 104534, 195985, 267052, 314309, 328372, 307868, 248079, 189496, 169879, 129935, 83551, 72142, 68833, 61793, 39002, 39137, 81810, 107845, 97894, 88583, 35878, 13336, 5339, 31340, 72274]
13449G2274K0510k1258m441m299k1607J9471K9151P11o062j1657J1237J3646K2633
13436A20309M335K185K0817m773j7984r929l800J4700k7868l2971m9138N937M3815
13423F5635K5475j8779j2748M0016j4157k1393k1015N574m10j5118O640O527l1978
13410A4269n00N6700J6480l829p424j8296l9266o04q979M5288M931k9108R961
13397C9623K1329L6296r392j8851P038N4130M2010L3228p694p5514m6224j5135
13385F0844r196K3809J2259k2700l3883j8946L1477L8805K4188p048m0502n2885
13373F222L0360K2343k8248q960k888j1192O871J4737N202l8301O384Q057M258
13360A4845K1246K823l21J0375l081l7349L7236Q328O665J8785o803j4540r959
$$ y = [72274, 92784, 71526, 67085, 62786, 41179, 60650, 89801, 90512, 84450, 72793, 84030, 97676, 120309, 124644, 126829, 147646, 142873, 124889, 114960, 111160, 125860, 97992, 65021, 15883, 21820, 65635, 91110, 72331, 59583, 99599, 85442, 64049, 43034, 48608, 48198, 33080, 39720, 46247, 14269, 13769, 70469, 86949, 83120, 75696, 57400, 18134, 17530, 8551, 53839, 58770, 29662, 39623, 60952, 97248, 87856, 69005, 76043, 130173, 172183, 205411, 197717, 122203, 75979, 60844, 51648, 75457, 87716, 65016, 31133, 12187, 43664, 82469, 106657, 99609, 59107, 6222, 36582, 58925, 30677, 21717, 18829, 7637, 14508, 29245, 34447, -3854, 2530, 10587, 14845, 36091, 38914, 38593, 48968, 45887, 8538, 45774, 54102, 60767, 79552, 72749, 58209, 48250]
13347D8250p904k1940r499L8672L7772l766j9073m718m778J0579j2916J0567J3551
13334G4797m4819l2681K9992L3240j5754l1223K4991K6818k6703J692J119J6411
13322E7880J877K7675J3793j1334o173j8908j5066k1245l6902l202K2757P4157
13310H5309J5235n9068k3384M823K0705k7474O594j2580N265J7710j2834M65K2599
13297D3365N204k7206K3707M1667K6349k0393J346r955m1399k1580Q535L0657
13285F0297M7174j975K9721N462J277k7476l6580k577p317J6636N497j8820j8550
13272E2769j2725J6844p695J5602j9898l2205K138J0993K8342O466l2016n611
13260B3004J3599l4951J6796O9541J1700l4402j6960j9988r142O930L0239L716
$$ y = [48250, 40346, 18406, 8907, 47579, 85351, 81585, 62512, 57794, 53016, 63595, 50679, 61246, 74797, 29978, -2703, 27289, 60529, 44775, 13552, 38543, 65361, 38658, 40350, 41469, 57880, 59757, 87432, 101225, 89891, 83718, 64810, 49744, 28499, -8403, -11605, 11152, 85309, 100544, 41476, 18092, 22915, 43620, 16146, 22740, 10160, 15425, 33135, 20301, 20766, 43365, 48569, 21363, 45070, 86737, 113086, 92693, 94039, 84084, 42685, 21105, 29640, 60297, 107471, 105496, 135217, 140679, 141956, 114480, 77900, 75323, 68006, 84642, 90139, 71319, 52769, 40044, 56888, 49193, 64795, 44897, 12692, 14830, 25823, 54165, 60631, 28615, 23004, 36603, 1652, 18448, 87989, 99689, 65287, 48327, 28339, 19197, 26127, 56366, 60082]
13248F0082m2346p97L60k785j8278k6592J3147J1095M48L266J8558j6522J5613
13235A5249K0629J3967K6355q053k2912k7359J0002K4858J1117n0005R847M5130
13223F8825K2193l6099l3740k1380K8824K3809q395p124O324j9914k4305K534
13211A552J2828j8469J7175K5074N841K2927J0660L987j1099r302J2882j9599
13199E4457P69r942j3902j6971k3938j422R472k647r576J0392J9714O084P243
13186B9733K1816k8521l6277J2269N41j2427K270J6915L2440j1996n934K4726
13174D5555J9733Q266l176k8657l2932m1592L5201K6945K2275L0663K2177m174
13162A00284l0368k3048k0722N463K5063n236k3895J5100p128J0794L15J7005
$$ y = [60082, 17736, 16939, 17299, 14514, -3764, -30356, -17209, -6114, -5666, -2400, 16158, -364, 15249, 35878, 49845, 76200, 68147, 45235, 17876, 27878, 52736, 63853, 13848, 23695, 68825, 91018, 54919, 21179, -201, 28623, 52432, 44037, 36913, 43237, 23323, -982, 1552, 14380, -4089, 13086, 38160, 44001, 66928, 77588, 81575, 70476, 61174, 74056, 54457, 55226, 45284, 31382, 14411, -9527, -10949, -1477, -4124, -13700, -3308, 16406, 22490, 29733, 51549, 23028, -13249, -980, -439, -12866, -10596, 6319, 38759, 26763, 20829, 45555, 65288, 73554, 70378, 41721, 8789, -32803, 2398, 29343, 51618, 82281, 104458, 100284, 69916, 46868, 26146, 31609, 56672, 51436, 27541, 42641, 35513, 46307, 46622, 63627]
13150F3627J2634k6035k9823O594J189R688J0618Mn178q891J9478l9258k0102
13137e455J6777k4049J4775M4318J1219l0268l3216L7631L1391J4120J863q279
13125G0827j2240j3307l2147r250O547o410q379k1396r45K2778M0558J3421p042
13112D3015o391J1096j5437k8493j08j0359N208R635J276P886k414K2228J3906
13099E1048R418m657l6629q533K8689J1025J6719M612p382m1074j0333N761P284
13086B5948R629P19j9335k666L7307p326k1255j0561J5767j4482p555L4102J1077
13073E1369r289j2350P297J1771j28j7708J2569J9568K8296n587O775Q313l4079
13060F6817p025K6522k6258k1635J0623j4410n3027k4045K8101J8376k862M900
$$ y = [63627, 76261, 50226, 20403, 26997, 28186, 37874, 48492, 48496, 43318, 34427, 53905, 14647, -5455, 11322, -12727, 2048, 46366, 57585, 27317, -5899, 31732, 63123, 77243, 79106, 70827, 58587, 45280, 13133, 3883, 10430, 4020, -4359, -25755, -26700, -3922, 36636, 50057, 43015, 36624, 47720, 32283, 3790, 3682, -6677, -1469, 8166, 9442, 17328, 14914, 37142, 51048, 60466, 55809, 19180, 10647, 39336, 50361, 67080, 71692, 64310, 23236, 12903, 18664, 25948, 35577, 36296, 16961, 14295, 51602, 44276, 23021, 12460, 28227, 13745, 6190, 40292, 51369, 42080, 29730, 37027, 48798, 48670, 30962, 43531, 63099, 91395, 85808, 92583, 100896, 66817, 59792, 86314, 60056, 38421, 49044, 34634, -18393, -42438, -14337, 4039, 1177, 6077]
13048F077j6352k09K3549p419j606M0914P981l6450k2980J2404L286J5730J1108
13035C6033J9808j4553j3913r713j5607J4910j4078j9754K9806L3059j2959Q827
13023D1866K4746j6284k0285k8639J77K8008L1247n490N211K4817K6414J893m5739
13010F7942m3310k674L071J1460k681k076j2003p099M2603K4468k8077k8694K637
12997B5567K450Q013M1157Q917l0453j721r148O635L2454J3441j0775l1073j2061
12984D3403J0068K2979n169j8882k0380M36r501N0416J5681l0488m1158j0065
12972G340K5141K7361J4164j1035J4573M187K2844p871l2958l8275K5864M033
12960E5368O03j8659j4501K4870K3375L975j7031k1776k2161J7213K3922M544
$$ y = [6077, -10275, -10484, 13065, 5646, 4040, 44954, 52935, 16485, -6495, 5909, 9195, 24925, 36033, 55841, 41288, 27375, 17662, 2055, 16965, 2887, -16867, 12939, 45998, 33039, 41866, 66612, 50328, 30043, 1404, 1581, 29589, 60836, 55346, 60557, 85374, 111788, 113681, 67942, 24632, 21958, 25029, 36489, 33808, 31732, 19729, 12630, 55233, 79701, 51624, 22930, 25567, 28017, 36030, 77187, 86104, 55651, 53930, 44782, 51417, 83871, 97312, 86537, 55464, 43403, 53471, 76450, 71281, 52399, 32019, 32455, 22954, 73370, 89051, 58563, 17405, 7340, 32481, 59842, 74006, 62971, 77544, 81731, 104575, 96704, 63746, 25471, 51335, 55368, 55971, 37312, 22811, 47681, 71056, 75031, 58000, 36224, 14063, 31276, 55198, 59742]
12948E9742m293j877K494K5871p488m7858J0974L8907M924k4899k5672j2384K4852
12935D3293J4722J5479q124j0942o639j2223L91j6925J5100J5926k4458P207P193
12922D0000K2472l2619j4527p348J4530J1122P598j9007k8130J9803L5193j2061
12910C7026m561K7266N401k120j3849j8268n877K4608j556j9067k1972k390M3251
12897D7892N1658N447k2485n2391r589J0921K2660j8845r861J4567K8438j5976
12885E2436J7403p109j4195K3424J4722R869m1579k1642J4349L852K7707L9063
12873A18300j2621k5287L2890J7798n407q05P266J096P760k1965m5575j6539l491
12860E3420K2555K8389l5462K085J1639j1687L285L0312M214j0144K5720n224
$$ y = [59742, 55449, 53572, 56066, 81937, 74449, 26591, 37565, 76472, 81396, 56497, 30825, 18441, 43293, 58015, 73494, 65370, 54428, 47789, 35566, 35957, 19032, 34132, 50058, 25600, 32807, 40000, 62472, 29853, 15326, 7978, 22508, 33630, 41228, 22221, -5909, 13894, 49087, 37026, 32465, 59731, 65132, 63012, 49163, 30895, 25018, 49626, 48070, 29003, 7031, 4641, 47892, 99550, 104997, 82512, 30121, 20532, 31453, 54113, 35268, 25407, 39974, 68412, 52436, 69839, 62730, 48535, 71959, 86681, 96550, 54971, 33329, 47678, 51530, 79237, 118300, 105679, 80392, 113282, 131080, 125673, 124868, 132134, 133230, 140990, 119025, 73450, 56911, 53420, 75975, 104364, 68902, 70987, 82626, 70939, 74224, 104536, 108750, 98606, 124326, 119102]
12848A19102q817k8256l5452O574J8200%n3937q444M6923L1067M803k0551J4206
12835H5418N779J1193L0970M788l5469l4554o756J6072L6254M2266L1405k87K3956
12822B11035M4244j3961k880Q446O4237O0010N7440K0785P5126P0063J02405J72529
12810H69479L13222N41660Q62343J226499J239292M81674o66029j257652j116114
12801B494374p65751m86211l17724j80801j22660j10782j08042l8494k9303m6271
12791B88335n0313l1691j2599q761j5981l918L251j1716Q877j8425n8544k9470
12779E9045K666r375K8362J5252m2084j3224M0364K8311q847Q884J0925R43k2622
12766I8600M351m5802m391l441o488j276l06K7593K5598r838l1515K0937Q964
$$ y = [119102, 110285, 82029, 46577, 53151, 71351, 71351, 17414, 8970, 55893, 86960, 91763, 71212, 85418, 91197, 102390, 133360, 138148, 102679, 68125, 61369, 77441, 113695, 155961, 187366, 187079, 211035, 255279, 241318, 238438, 246884, 311121, 371131, 428571, 449356, 524482, 594545, 696950, 869479, 1182701, 1724361, 2586704, 3813203, 5052495, 5534169, 4868140, 3610488, 2494374, 1728623, 1242412, 924688, 743887, 621227, 510445, 402403, 363909, 334606, 288335, 238022, 206331, 193732, 184971, 168990, 165072, 168323, 156607, 165484, 147059, 88515, 59045, 61711, 52336, 80698, 95950, 53866, 40642, 81006, 109317, 100470, 109354, 120279, 121222, 98600, 102951, 57149, 52758, 49317, 42829, 41553, 41247, 68840, 94438, 84600, 53085, 74022, 82986]
12753H2986p684j7033l2K5610j3139j4840Q600O6305L3745k2801j7272k1031k1104
12740H2310J2162j0905k2154q547J0628M005J0621Q201j2775p379J9825m70l4012
12727E1510k7188O418Q843Q727L633k5361j9294o149M576J2973L3199j4760j3165
12714B3962j9374P087J1752N5275J0504j7162l2622l340L843K0647R29Q793k345
12701F7949J2715J5956o001k1771J1324r830L0273j9310m1700J7875j6669j4658
12689B6153J6708P820k2487k4700r853N590j7457j2875N5968K1861L7066j8341
12677F5453j553J1895k5755K5835k2687n100J9767R081k4605l8269k2521K2755
12665A4296J3080j4318M976l136K113J0444K123J1351K7761j1474J648j426M7244
$$ y = [82986, 75302, 58269, 58237, 83847, 70708, 55868, 64468, 130773, 164518, 141717, 124445, 103414, 82310, 94472, 83567, 61413, 52866, 63494, 67499, 78120, 86321, 73546, 66167, 85992, 85522, 51510, 24322, 30740, 39583, 48310, 51943, 26582, 7288, 1139, 5715, 18688, 51887, 37127, 23962, 4588, 11675, 23427, 78702, 89206, 72044, 39422, 36082, 39925, 60572, 61501, 70294, 67949, 80664, 96620, 90619, 68848, 80172, 70342, 100615, 81305, 39605, 57480, 40811, 26153, 42861, 50681, 28194, 3494, -6359, -769, -18226, -31101, 24867, 46728, 83794, 65453, 63900, 75795, 50040, 75875, 53188, 48088, 67855, 76936, 52331, 14062, -8459, 14296, 27376, 13058, 18034, 14898, 17011, 27455, 29578, 40929, 68690, 57216, 58864, 57438, 104682]
12652A04682k215k0566l21j1321j4033P535j5087j4746j2689J0050J944k196k4784
12639F253k8404L0259J8498O90O350K9881L2813k1870j1684j0468K906l874j3287
12626C8063p997k0096O226K3084K7873M2336k7132J6128J633n6349m1136O606
12614I239J5407J8909M160k5654j644J7740l619r0K612P009M376O79L0285o510
12600G2899l1249k929r133o891o498p32o955J0495K9769J309l6159O004M0109
12587F0039J8076m051j8004j8108j8354J7684J4850j7451J8921J5686N716m66
12575G4538J5724p521n047k511J0640J3712J3160m301j1557M741J6276n863j2279
12562I9712J8075k094K0914l0444n1561M983K8077K721K5230R887j7041l946r717
$$ y = [104682, 102467, 81901, 81580, 70259, 56226, 63761, 48674, 33928, 21239, 31289, 33233, 31037, 6253, -22151, 8108, 26606, 27296, 33646, 63527, 96340, 74470, 62786, 52318, 55224, 51350, 38063, 30066, 9970, 16196, 39280, 67153, 109489, 82357, 98485, 100118, 43769, 2633, 9239, 24646, 43555, 47715, 22061, 20417, 38157, 34538, 34448, 37060, 44069, 48445, 49124, 79409, 72899, 41650, 38721, 29588, 22697, 16199, 15467, 8512, 19007, 48776, 50085, 13926, 19930, 60039, 78115, 74064, 56060, 37952, 19598, 37282, 52132, 34681, 53602, 69288, 75004, 74538, 90262, 82741, 77694, 75183, 85823, 99535, 112695, 108394, 96837, 101578, 117854, 111991, 99712, 117787, 115693, 136607, 106163, 54602, 59585, 87662, 90383, 115613, 125500, 108459, 104513, 94796]
12549I4796k6578j1521J3442o628j91J1440O121j7521j0091m318l2575K3981J8369
12536E8726n072N434o752J949O361L2193n626l0709l8312j8397N2034j2882k9526
12523I421j2016J7102J9134n295M2685M9940R099o743K1007J4856p400j6398k3441
12510A11951o586p367j1558l1490o144L0908K6205j2188j402J2989j0168k2386
12498G2764m2416j9649M5925J5446j0359p383q921j7113l3510J4098K2891k731
12486B9042k0994L526O746L13j2280L6358K9576j1840j0099n046j0754K6458J3349
12473G4355r121p784m362j286p49K0819R305p840j803k5703m54L2883K4087l779
12459I8568k5833l0860j6427J1954L458J3631j0061j3151J8060P75Q045Q782N524
$$ y = [94796, 68218, 56697, 70139, 63511, 63320, 74760, 80881, 63360, 53269, 48951, 16376, 40357, 58726, 53654, 59088, 52336, 54285, 60646, 92839, 87213, 56504, 18192, -205, 51829, 38947, 9421, -2595, 14507, 33641, 28346, 71031, 120971, 130070, 123327, 144334, 159190, 151790, 135392, 111951, 105365, 97998, 86440, 54950, 48806, 79714, 105919, 93731, 92329, 105318, 95150, 72764, 30348, 10699, 56624, 72070, 61711, 54328, 45407, 28294, -5216, 8882, 31773, 29042, 8048, 11574, 18320, 18633, 6353, 42711, 72287, 60447, 50348, 45302, 34548, 61006, 74355, 65234, 57450, 53088, 51802, 51053, 71872, 81177, 73337, 71534, 45831, 45377, 78260, 102347, 98568, 72735, 41875, 25448, 37402, 40860, 54491, 44430, 31279, 49339, 50114, 58159, 66941, 72465]
12446G2465k805j1199j9664K117N8230J491k9164k5603J3893J4425J8561l4599
12434E8148l2795N633r720j4971K3040p278j3469N537K5809L58J0353K168l0201
12421B2612K4255j6056j3016M727M1334N2261L6123O173m1611n6692K8880L7821
12409A26811M065j8996k9494J5887N0724j2376M354j1214l3187j1620m646r520
12397G0788j3461j602J3353j8759l400O07R301J4146J7006j8767n185L4663K2873
12384A21563k4254k1207p037K238j7723M59L3854r543j5620M1503o618k937l1941
12371F2737l773k0489k9449P240J2381L6997J6332L0607k0554j2142K4915j4340
12359I0462k7979j080Q059j0090R370J5032l952j6056j3999k0725J0706K4489
$$ y = [72465, 69660, 58461, 38797, 40914, 99144, 100635, 71471, 45868, 59761, 74186, 92747, 58148, 25353, 30986, 21266, 6295, 29335, 22057, 8588, 14125, 39934, 40292, 50645, 52813, 22612, 46867, 30811, 17795, 22522, 63856, 116117, 152240, 158413, 116802, 60110, 88990, 126811, 130876, 111880, 82386, 98273, 148997, 136621, 140975, 129761, 96574, 84954, 80308, 70788, 57327, 55725, 69078, 50319, 46919, 47526, 56827, 70973, 87979, 69212, 64027, 98690, 121563, 97309, 76102, 69065, 71303, 53580, 54039, 87893, 78350, 62730, 104233, 97615, 94678, 62737, 58964, 38475, 9026, 16266, 28647, 65644, 81976, 112583, 92029, 79887, 104802, 90462, 62483, 61403, 69462, 59372, 68742, 83774, 79822, 63766, 49767, 29042, 39748, 64237]
12347F4237R981p244p02j626o201J7620j6049j7048N642m2553K0217K4316j0193
12334D0397J4196N3624J8294k8240J15M221m026j5666j1001q931J8493J771P70
12321H4017j13r050M774j0001j1775l4075l579L6668r131L808k907j4705j9871
12308A4060j8625l522O509K5924K4178r932J361j9392m3777J9296M0747J2350
12296D9177p490n981J0265j6262m486M578L7403J1145O306n113J753l643k2215
12283E5437O136J2191P792k7709J2632L9651p531l420k453N320M6120j5724m274
12270A24168L7161j311q0822k8632L8926M1829L4560O1995N1309j8763l9363k9286
12258A91771l0618k2133p2077j5111N228J2867L821N989J8621J214m8860l64k1142
$$ y = [64237, 74218, 66974, 66272, 64646, 58445, 76065, 60016, 42968, 48610, 6057, 26274, 50590, 40397, 54593, 108217, 126511, 98271, 98386, 102607, 98581, 82915, 71914, 62983, 81476, 83247, 84017, 83904, 74854, 79628, 69627, 57852, 23777, 20198, 56866, 47735, 51543, 48636, 33931, 14060, -4565, -8087, -1578, 24346, 48524, 38592, 39953, 20561, -23216, -3920, 36827, 49177, 41687, 35706, 45971, 29709, 25223, 29801, 67204, 78349, 84655, 79542, 81295, 77652, 55437, 61573, 73764, 81556, 53847, 66479, 106130, 98599, 95179, 92726, 98046, 144166, 128442, 124168, 161329, 160018, 79196, 50564, 89490, 131319, 165879, 227874, 279183, 260420, 221057, 191771, 161153, 139020, 66943, 51832, 57060, 69927, 73748, 79737, 98358, 99572, 50712, 50348, 29206]
12245B9206O176J078L2902L1625j1155m1298q245L657j1691J295N498k6750K081
12232A4379K3060L8581K4593M715p154j5649j2781P526q617k879M013J2125j2678
12219F9234J0296J9739K0197r464J8527r233r51l4652q679p739J2715J4265m704
12206H9551k2497J9299J4760k1995j6681K2340k3071J5918P501j2643j005p188
12194F4289k610j7114j4326k2521j9089J4419J4694j0301O0844L0833j6449M936
12182H7605K7680j0382k8284k1014J2677J8152k8748n371J1037K025K0612M591
12170I0580Q945J1669Q46q915j9499k8238L7781R050q998k735j2987l7922K229
12157D1806J7217o243M4479P772r633K2600K3404l8334j0178m401r788o324K6383
$$ y = [29206, 35382, 36460, 69362, 100987, 89832, 48534, 40289, 43946, 32255, 33550, 39048, 12298, 14379, 37439, 76020, 100613, 105328, 98174, 82525, 69744, 77270, 68653, 65774, 69787, 81912, 69234, 79530, 99269, 119466, 110002, 128529, 119296, 118345, 83693, 75014, 67275, 79990, 94255, 89551, 67054, 86353, 101113, 79118, 62437, 84777, 61706, 77624, 85125, 72482, 71477, 64289, 61679, 44565, 30239, 7718, -11371, 3048, 17742, 7441, 68285, 99118, 82669, 87605, 115285, 104903, 76619, 55605, 68282, 86434, 57686, 52315, 63352, 65377, 85989, 90580, 99525, 111194, 112040, 103125, 83626, 55388, 93169, 102219, 93221, 90486, 77499, 39577, 41806, 59023, 52780, 97259, 105031, 95398, 117998, 141402, 103068, 92890, 88489, 78701, 72377, 98760]
12144I8760k1845j1745q000M3699K2913L285K324k4083k938M902j0855q949L7688
12131A25156M9026l018p733R725l69j8929j6930M7496l024l3666k4679j823o833
12118A14399l2911j2550J0206l519N844J5409k1599l5682K363K6047L895k4256
12106D7646P1j981O718K7709M887L6029l3765k1742J4863Q31L8220J6497l0451
12093A05532q810k3145n403j6201j0440J5805K243L5500J8483J1400N4554K0417
12081A99935K0647K5884j46k6766m9502p100j7851k9519k6627j989N25K723P165
12068I7379L869Q085P196k2910l4124N910J8432j3287J2617K2944K8270Q097k1211
12055A21267Q899k684m876K1712j1613j0894K0000K8295P971k0558J6384j6045
$$ y = [98760, 76915, 65170, 57170, 100869, 123782, 127067, 129391, 105308, 102370, 107272, 96417, 87468, 125156, 174182, 171164, 163431, 173156, 172787, 153858, 136928, 184424, 181400, 147734, 123055, 121232, 114399, 81488, 68938, 79144, 75625, 81469, 96878, 75279, 39597, 41960, 68007, 71902, 47646, 47717, 45736, 52454, 80163, 85050, 121079, 87314, 65572, 80435, 81266, 119486, 135983, 105532, 96722, 73577, 68174, 51973, 41533, 57338, 59581, 95081, 113564, 124964, 179518, 199935, 220582, 246466, 246320, 219554, 170052, 162952, 145101, 115582, 88955, 86966, 87491, 90214, 97379, 101248, 109333, 116529, 93619, 59495, 65405, 83837, 70550, 83167, 106111, 134381, 142478, 121267, 130166, 127482, 122606, 144318, 132705, 121811, 141811, 170106, 178077, 157519, 173903, 157858]
12043A57858k7407j1497j7465j5321R65K0057M1788O7762O3774Q308k8963m8233
12031B11626m6857n9962l9050M454j1285n624o386j958J4333J5489j241q19J7487
12018I0207J5178J3603j5223K893Q791k2593j785j9461K2337K212J4965P508j8185
12005A00447n204j4359p775M1281J0699J0248j4446M847j3195l6101k0236K7821
11993H4027K4781L5928J3983O497l5982k2780L341R150R687M672K4177O450J2383
11980A76314j5164p04j0502l3446j7823o067k2218j8719k0231M1458K3507J7744
11968A14149q861k6418J3710M1668J1848n487q09J0834J105k4588j550N076o634
11955A24043j5902m5632k3946k6616K2895M2348J5402L6876k593m8948J0433J0740
$$ y = [157858, 130451, 118954, 101489, 86168, 87133, 107190, 148978, 216740, 280514, 288822, 259859, 211626, 164769, 104807, 65757, 70211, 58926, 53302, 46916, 44958, 59291, 74780, 73539, 72720, 90207, 105385, 118988, 103765, 106658, 115449, 92856, 91071, 71610, 93947, 96159, 111124, 118632, 100447, 95243, 80884, 73109, 114390, 125089, 135337, 120891, 125738, 112543, 76442, 56206, 84027, 108808, 144736, 158719, 165216, 129234, 106454, 109795, 118945, 128632, 133304, 157481, 163931, 176314, 161150, 160446, 149944, 116498, 98675, 92608, 70390, 51671, 31440, 72898, 96405, 114149, 105288, 78870, 92580, 134248, 146096, 140609, 139800, 150634, 151739, 127151, 125601, 130677, 124043, 108141, 62509, 38563, 11947, 34842, 77190, 92592, 129468, 126875, 77927, 88360, 99100]
11943I9100R302K3915o50L97J3157j7734r19o698j9430J7022N657j4730k3968
11930H4421j9495J3131J915J9357r583j3743Q286M616J2931O974o929J3655l2231
11917H3305q231p408N0791Q103l2023j9634J5425J3449l0026k2107k8201j557
11905B1886L2413M1413K7697K0610J3173j6774j8519k5039R51K5492L2317M742
11893A60362l9589k2104K8669J4938J7316j2481k3223J0654K1269N584o465j1711
11881A43219J2742J5728k2918m3254J1103j0753k2222q224J6070J1970J9789N781
11869A29031q103J5480k0361j2891n606l2386O421j523K987J7821J4464k3584
11857H1750p465j2250j3930K4030M8627K8651K1326j6507j6627k0774m391m40
$$ y = [99100, 108402, 132317, 131667, 132064, 145221, 127487, 126568, 119870, 100440, 117462, 123119, 108389, 84421, 64926, 78057, 79972, 99329, 89746, 76003, 84289, 88905, 101836, 108810, 101881, 115536, 83305, 75074, 67666, 118457, 126560, 94537, 74903, 90328, 103777, 73751, 51644, 23443, 21886, 54299, 95712, 123409, 144019, 157192, 140418, 121899, 96860, 97811, 123303, 155620, 160362, 120773, 98669, 127338, 142276, 159592, 147111, 123888, 134542, 155811, 161395, 154930, 143219, 155961, 171689, 148771, 105517, 116620, 105867, 83645, 75421, 91491, 103461, 123250, 129031, 120928, 136408, 116047, 103156, 97550, 65164, 71585, 70062, 73049, 90870, 105334, 81750, 74285, 62035, 48105, 72135, 120762, 149413, 170739, 154232, 137605, 116831, 112440, 112000]
11845A12000k9791k0047q965Q59J3292J7607K8449k883L2963l0797k0218K379
11833I4848J984l689N599J2677N0563M736m2734j2131J3911J5035r56j5154q107
11820A16582P803K1221L2396r786J7842j5750j1995Q75j5922j7327P496L2860
11808A66295q962q952j4222J867J494k2161J8924j071j58J3877N746k0883k9345
11795A02449j1660p301r565L4088K262M696L4426K388k1385m7563j1205J3410
11783H5040N1245r740o7959N975N7367k2169k5145L6165M6608j6843m4921k6217
11771F9406K3636J9530r051j7965M7119L1716j5083k3452k7182K3003J5361k4174
11759A12864J6865R103j594L1278J160m1838j1362K0367J7112j7629j1264J7923
$$ y = [112000, 82209, 62162, 53197, 54056, 67348, 84955, 113404, 110521, 143484, 112687, 92469, 94848, 96832, 93143, 98742, 111419, 161982, 166718, 123984, 111853, 125764, 140799, 139843, 124689, 116582, 124385, 145606, 178002, 168216, 186058, 170308, 158313, 159188, 143266, 125939, 133435, 166295, 157333, 148381, 134159, 136026, 137520, 115359, 134283, 133212, 133054, 146931, 152677, 131794, 102449, 90789, 83488, 73923, 108011, 110273, 114969, 149395, 151783, 130398, 82835, 71630, 85040, 136285, 126545, 58586, 64561, 121928, 99759, 74614, 110779, 157387, 140544, 95623, 69406, 93042, 112572, 103521, 85556, 132675, 164391, 149308, 125856, 98674, 121677, 137038, 112864, 129729, 138832, 137238, 168516, 169676, 127838, 116476, 136843, 153955, 136326, 125062, 142985]
11747A42985o238k5221q099Q639J1042l7630j5670L7226j6342l184R151J7014
11735A13673j2824J0101J4036k039j9290J8041K3670K3096l3578r925M810l529
11723A26242J7213K046J0788o880J445p025j4597m123J58L2299J9275j5636j2763
11710A48442k2873Q141N285q601J3394J969J9591L3183m517r769j3300K669k1777
11697A51837o931L1575j4904m0149q461k340J5220M2212J3561n296j436R585j2062
11684A72411n669p85k4447l899K8877L0867j9630k2420N0994O311J63K3401R127
11671B45301N2089K1436Q507l8287p3019l4969n988j0382L870P887K738n608L420
11658A76995k2521J6896K8335r033l0127l462L7248J4804j0691j7641k753K0820
$$ y = [142985, 136747, 111526, 103427, 112066, 123108, 85478, 69808, 107034, 90692, 87508, 96659, 113673, 100849, 110950, 124986, 122947, 103657, 121698, 145368, 168464, 134886, 124961, 129771, 126242, 143455, 145501, 156289, 149409, 150854, 143829, 129232, 125109, 125267, 157566, 176841, 161205, 148442, 125569, 133710, 138995, 130394, 143788, 145757, 165348, 198531, 194014, 184245, 170945, 173614, 151837, 144906, 176481, 161577, 121428, 112967, 110627, 125847, 168059, 181620, 176324, 174888, 184473, 172411, 166742, 165957, 141510, 137611, 166488, 197355, 177725, 155305, 206299, 212610, 212773, 236174, 245301, 297390, 318826, 327333, 289046, 216027, 181058, 175070, 164688, 168558, 176445, 179183, 173575, 176995, 154474, 171370, 199705, 190672, 160545, 157083, 194331, 209135, 198444, 180803, 178050, 198870]
11646A98870l1686N3001K1353j1112Q573o059l359p127l884J4740J462p580p065
11633B20127N4328N1820K0568Q2341J01887J70560L02611N71449R83072J309426
11623C868189R24430j46765j235502j279996p82267m23873k63121j46823r2977
11614D21295m5681q3557o7501l5702M398n19O33R075K0383K055m0211k2539j4485
11601A47644R792J5399J0924j3234k8465m7685n225K4899M0079L1281p681j7738
11589A59990j0333j5943P766k3986K037J7784J779O189o457j1479P760j746k9068
11576A04293N609L2933J9895j3481p469J5076L6050K6375m926l2118r655n235
11564A67347l5800l3084l201L5529K398N147J8155k1676M206j0793L042L6169
$$ y = [198870, 167184, 220185, 241538, 230426, 238999, 232940, 229581, 222454, 218570, 233310, 234772, 227192, 220127, 274455, 326275, 346843, 429184, 531071, 701631, 1004242, 1575691, 2558763, 3868189, 4792619, 4645854, 3410352, 2130356, 1348089, 924216, 661095, 514272, 421295, 375614, 292057, 224556, 188854, 193252, 192733, 193366, 202441, 222824, 224879, 184668, 162129, 147644, 157436, 172835, 183759, 170525, 142060, 94375, 89150, 114049, 154128, 185409, 177728, 159990, 149657, 133714, 141480, 117494, 119531, 137315, 139094, 145283, 138826, 127347, 135107, 133361, 104293, 109902, 142835, 162730, 149249, 141780, 156856, 192906, 219281, 214355, 182237, 172582, 167347, 131547, 98463, 95262, 130791, 133189, 138336, 156491, 134815, 139021, 128228, 131270, 167439]
11552A67439J7841l3146L135l241k4638k2882K4869O1954j6349O712J7676k1110
11540A78260R831J2171k6000p777K1251M1274L128J9968l1515m0616l359J5549
11528A92165L5075K4897k9923k3223K6557O43j1506j5749j8451j7254j5489q411
11516A39331K2933J9479KK479j0028J850M251l323m372Q527j0417J2472J4961
11503A98145j7269K7326j1337j8038K0801K4709j840J1625J4640N1193l844J1894
11491C08005J6587M320K5454n634m7972l1270j6838J4658j2558J3151J4238M809
11479B86950K287j3408k0602L9575k302J0238K2288R770j875j6786j7127P665
11467C06673M1476O5877P6906J6168k1859n6920r9607m4548n348o58M022p501
$$ y = [167439, 185280, 152134, 155269, 152028, 127390, 104508, 129377, 191331, 174982, 181694, 199370, 178260, 188091, 200262, 174262, 166485, 187736, 229010, 232138, 252106, 220591, 179975, 176616, 192165, 227240, 252137, 222214, 198991, 225548, 226191, 214685, 198936, 180485, 163231, 147742, 139331, 162264, 181743, 181745, 184224, 174196, 176046, 180297, 176974, 172602, 181129, 170712, 183184, 198145, 180876, 208202, 196865, 178827, 199628, 224337, 222497, 234122, 248762, 299955, 296111, 308005, 324592, 328912, 354366, 348732, 300760, 269490, 252652, 267310, 254752, 267903, 282141, 286950, 289237, 275829, 255227, 294802, 292500, 302738, 325026, 334796, 332921, 316135, 299008, 306673, 348149, 414026, 490932, 507100, 485241, 428321, 328714, 284166, 278818, 278160, 282182, 274681]
11455B74681k1343p2K5236M644k6434k0728J9922K3208J2845j4708J5714L3824
11443C26789J1424k0197k4229n0001l6347M8226j613j7635l622L2806J0513R025
11431B85139K1710J860K1199L6976k0315k001p598N54K597m513L779P637k7248
11418C19776j1496J1413J4838j7129m2426q999K8712J4107L691K7507j5405J5309
11406C39898J5673j5525J5853K8662L795J3057R757O3416M8128R205J4602Q1687
11394F28208P6806P6388J50400K19379K09121K17429J65790J27694O8540K695
11384A942450p1026j25552j92279k29920k47198k05159j36314j34446j01637n8580
11374D40339o4746l6785K7074J4404l7189n2086k1558o299L9219M6968j8616l3493
$$ y = [274681, 253338, 253266, 278502, 283146, 256712, 235984, 255906, 279114, 291959, 277251, 292965, 326789, 338213, 318016, 293787, 243786, 207439, 255665, 254052, 236417, 232795, 265601, 276114, 285139, 306849, 308709, 329908, 366884, 346569, 344568, 336970, 337524, 340121, 335608, 339387, 347024, 319776, 308280, 319693, 334531, 317402, 274976, 265977, 294689, 308796, 312487, 339994, 324589, 339898, 355571, 340046, 355899, 384561, 388356, 401413, 411170, 474586, 522714, 531919, 546521, 628208, 705014, 781402, 931802, 1151181, 1360302, 1577731, 1743521, 1871215, 1939755, 1942450, 1871424, 1745872, 1553593, 1323673, 1076475, 871316, 735002, 600556, 498919, 440339, 375593, 338808, 365882, 380286, 343097, 291011, 269453, 263154, 302373, 349341, 330725, 297232]
11362B97232J48j1944k27L1924q799p543p462Q923R156n544m381j8364J2269j7018
11348B78370l9832J1603J9350L5404j411j8610l1086j070k0506M786Q47M6773
11336B84618L8398j9917k7641k0198n429M7593j2502k2004r126O10K1258K8223
11324C03883J1652l3679k6273p543j3008J504j2186J0377J5498K0490k488J0950
11312B79177Q150q770j0055Q20R117K4016K3080j3021o58L1492j9993l3963k8179
11299B61213K193o925J9946J1240p676R629O458j8428J0588N12j0810j5406j8521
11286B44013n71J1778J2948K6658j909k3204m202j4568p528O252K0401O054o107
11273B70015o910r31K3567N685n133p497L952k1199n547J5801m503k495P008L2172
$$ y = [297232, 297380, 285436, 285209, 317133, 308334, 300791, 293329, 302252, 311408, 305864, 301483, 283119, 295388, 278370, 238538, 250141, 269491, 304895, 303484, 284874, 253788, 252718, 232212, 236998, 237845, 284618, 323016, 303099, 275458, 255260, 249831, 297424, 284922, 262918, 253792, 254402, 275660, 303883, 315535, 281856, 255583, 248040, 235032, 236536, 224350, 234727, 250225, 270715, 268227, 279177, 287327, 278557, 268502, 269322, 278439, 302455, 325535, 312514, 311856, 343348, 323355, 289392, 261213, 263406, 256481, 276427, 287667, 279991, 289620, 296078, 277650, 288238, 288750, 277940, 262534, 244013, 243442, 255220, 268168, 294826, 292917, 269713, 265511, 250943, 243415, 249667, 270068, 276122, 270015, 263105, 262174, 285741, 291426, 286293, 278796, 282748, 261549, 256002, 271803, 267300, 264805, 271813, 303985]
11259C03985M444k1144L992J6574M368N314k1137J9176K6511K0335R638J9671
11247C91727J1726O738n393Q520j4175q016k693K6605q461k8466j1745K4299Q487
11234C99153J9843o281m824J0931p792Q896R131J7062j1085l2558j2290m713J3891
11221C99364K2761P132M3424L083r888k2129r610l769K4277n558j6437J3618J3419
11208D59687j7797k5927Q5L1096M320k7181M017J6202l2987l013N964m837J5325
11195D24954K8389l6438k6477k810K3949J586M984O13J9888j284j2449P107q296
11182D23716J4115k4643K4986M5553K6160j7965j5771j5855j3028M6820J8314
11171E12402K2792M1144p8l1782J925k821P142R305j2729J1928J2111J9459k815
$$ y = [303985, 308429, 287285, 291277, 307851, 312219, 317533, 296396, 315572, 342083, 362418, 372056, 391727, 403453, 410191, 404798, 413318, 399143, 391127, 388434, 415039, 406578, 378112, 366367, 390666, 399153, 418996, 412715, 407891, 418822, 411030, 419926, 429057, 446119, 435034, 402476, 390186, 385473, 399364, 422125, 429257, 472681, 475764, 465876, 443747, 434137, 430368, 454645, 449087, 432650, 446268, 459687, 441890, 415963, 416048, 447144, 451464, 424283, 428300, 444502, 411515, 408502, 414466, 409629, 424954, 453343, 416905, 390428, 387618, 411567, 413153, 418137, 418750, 438638, 437354, 424905, 432012, 423716, 437831, 413188, 438174, 483727, 509887, 491922, 476151, 460296, 447268, 494088, 512402, 535194, 576338, 576260, 544478, 546403, 543582, 550724, 560029, 547300, 559228, 571339, 590798, 587983]
11158E87983m2580k8566j681j917k7029P406J4950j6460J8223J3729J9347J1770
11146E55175J101R719k798k041L4263j417q863N064J1198L4873Q527J8541J3354
11133F76696j3092K5720M2564k5237m961R400k2749l9977J4934m628J0985M986
11121F74641K3616O1880L0870j1681J1720K9120M2526M7828L1024K5000N4571
11110A021115O6591O7288O1018N5722R0130N1156M2380N250l7768l8488l0760
11099A353634o6647r7572r7600j04271n9944l4572k478J0331L550K3318O495o629
11087I27615k4216n869O271J3449J883N919K0472J4414L381J9477O3323M9682
11075A095801N809L4650N2439K3488k3589K817N4942M4531O9593N5047M3521N3386
$$ y = [587983, 545403, 516837, 515156, 513239, 486210, 493616, 508566, 492106, 510329, 524058, 543405, 555175, 556276, 565995, 563197, 561156, 595419, 594002, 585139, 590203, 601401, 636274, 644801, 663342, 676696, 663604, 689324, 731888, 706651, 701690, 711090, 688341, 648364, 663298, 658670, 669655, 674641, 698257, 760137, 791007, 779326, 791046, 820166, 862692, 910520, 941544, 966544, 1021115, 1087706, 1154994, 1216012, 1271734, 1361864, 1413020, 1455400, 1460650, 1422882, 1384394, 1353634, 1286987, 1189415, 1091815, 987544, 927600, 893028, 890550, 900881, 904431, 927749, 934244, 927615, 903399, 897530, 903801, 917250, 919133, 925052, 945524, 959938, 963319, 982796, 1046119, 1095801, 1101610, 1136260, 1188699, 1212187, 1188598, 1191415, 1246357, 1290888, 1360481, 1415528, 1459049, 1512435]
11063A512435J0620J950J2252j9941j9129j0718J0722K5949R255J2517J5994j3443
11051A548463J3195P9354L7248M775N487K2726M2431P5629L9250M1179N0381P5244
11039B035362O1730K7223M4105K9613K9740O8093J05566J06888J06042N2952L0903
11028B698217M4972P4350Q8254J40335J30596J07418J26372J46383J63070J78328
11018C898295J44705J43708J03414J34098J40705J70377K03484K57343L24215
11009E520344L46327M05091L82329M44177M62961N58742O88420P84852R22893
11000A0516136J135909J305223J441537J590058J700959J825555J954961K191606
10992B3661944K533416L010524L743933M781714O383518Q750299J2204107J7215344
$$ y = [1512435, 1523055, 1525005, 1537257, 1517316, 1498187, 1487469, 1498191, 1524140, 1533395, 1545912, 1561906, 1548463, 1561658, 1641012, 1678260, 1683035, 1688522, 1711248, 1753679, 1829308, 1868558, 1909737, 1960118, 2035362, 2097092, 2124315, 2168420, 2198033, 2227773, 2295866, 2401432, 2508320, 2614362, 2667314, 2698217, 2743189, 2817539, 2905793, 3046128, 3176724, 3284142, 3410514, 3556897, 3719967, 3898295, 4043000, 4186708, 4290122, 4424220, 4564925, 4735302, 4938786, 5196129, 5520344, 5866671, 6271762, 6654091, 7098268, 7561229, 8119971, 8808391, 9593243, 10516136, 11652045, 12957268, 14398805, 15988863, 17689822, 19515377, 21470338, 23661944, 26195360, 29205884, 32949817, 37731531, 44115049, 52865348, 65069455, 82284799]
10984H2284799K4248713L3139356M2544623M8612513M6434116L5394868J9925682
10977C32584670N240829q004464k2315267l7074726m7046026m8356952m1917674
10970A33110390l2560133k3970206j7187913j2271379q912625o588059m896737
10963B6723338l649978k828620k280765j807166j537633j390382j296699j219949
10955A0712146j112345j065667j009105r07414p71674o43214n50535m77510m06899
10946C767783l74975k96500k59708k16814j71079j78632j68463j29549j40302
10937A831761j26257j27396p8021o9188q4917p7816n0661q9563n0253k0950m7598
10926A009141l2368j5629o212n193l3672k9811o5757l3660J4550q521L0795R5734
$$ y = [82284799, 106533512, 139672868, 182217491, 230830004, 277264120, 312658988, 332584670, 337825499, 329821035, 307505768, 270431042, 223385016, 175028064, 133110390, 100550257, 76580051, 59392138, 47120759, 38208134, 31620075, 26723338, 23073360, 20244740, 17963975, 16156809, 14619176, 13228794, 11932095, 10712146, 9599801, 8534134, 7525029, 6617615, 5845941, 5202727, 4652192, 4174682, 3767783, 3392808, 3096308, 2836600, 2619786, 2448707, 2270075, 2101612, 1972063, 1831761, 1705504, 1578108, 1500087, 1430899, 1345982, 1268166, 1217505, 1127942, 1077689, 1056739, 1009141, 976773, 961144, 954932, 949739, 916067, 886256, 820499, 786839, 801389, 792868, 823663, 919397]
10914I19397J19222J23793J55048K27180L16425L14766K91039K16049J44125N3693
10904B880737J8635J1879J1503N9994J59838K49687K22421J33753k0220q8446
10894C639781k14244l05882m19775n15575n21463l91429l07159k16668j44328
10885F03258j01499o9848n4332m3212n934K7474k4840k6591r258J071j4715k3102
10873B58472J8912L4857q230j1803L1486P755j7340K7864K4479P219J9480j7655
10861C75496j1414J6260j4880J3565J1024n010K0784O3334J80L0446P967o1559
10849D46193k6385k8598p582l2267n8696l9871n1309k0206O919k7781k6618j2688
10837A21111r020O94J0063j0940j7564j4723j9100r011j8345l3616K9879j5005
$$ y = [919397, 1038619, 1162412, 1317460, 1544640, 1861065, 2175831, 2466870, 2682919, 2827044, 2880737, 2899372, 2911251, 2922754, 2982748, 3142586, 3392273, 3614694, 3748447, 3728227, 3639781, 3425537, 3119655, 2699880, 2184305, 1662842, 1271413, 964254, 747586, 603258, 501759, 431911, 377579, 334367, 328433, 355907, 331067, 304476, 295218, 296289, 281574, 258472, 277384, 312241, 304011, 292208, 323694, 331449, 314109, 341973, 366452, 373671, 393151, 375496, 364082, 380342, 365462, 379027, 390051, 385041, 405825, 469159, 469339, 499785, 507752, 446193, 419808, 391210, 383628, 351361, 292665, 252794, 201485, 181279, 188198, 160417, 133799, 121111, 112091, 112785, 122848, 111908, 94344, 79621, 60521, 51510, 33165, -451, 29428, 14423]
10825A4423m3227j4008r204k1332j7509L590K1260K0953M4485j58K5116J3322
10813C7711j2753j3342L159M5659K5522o364j4540J3787Q868K993K0935J6530
10801A28165k1570M3524J472l2020l4181j778k8986j466l0107j0040m3418l0653
10789f1058l4635j6965N6148L8119L8267k8823j0515L0508M0365j8597L165K1536
10777E7515k0207j9540K2638j6819p402K838J4678J7014K8417M2559n862m3786
10765G2043l4186q407J6772J0997j6876k839R448n197j563L0060K4976j8663k1618
10752E4947p358j155L2776k707K0401L0007j0726l1288j3053K0740K2222K4982
10740A39788K005K533O980K8524J7814P557P196K660Q436j3208l294q268j9348
$$ y = [14423, -28804, -42812, -52016, -73348, -90857, -87267, -66007, -45054, -569, -727, 24389, 37711, 24958, 11616, 14775, 60434, 85956, 79592, 65052, 78839, 87707, 90700, 111635, 128165, 106595, 150119, 151591, 119571, 85390, 83612, 54626, 53160, 23053, 13013, -30405, -61058, -95693, -112658, -56510, -18391, 19876, -8947, -19462, 11046, 51411, 32814, 35979, 57515, 37308, 17768, 40406, 23587, 16185, 19023, 33701, 50715, 79132, 121691, 115829, 72043, 37857, 29450, 46222, 57219, 40343, 37504, 46952, 41755, 40192, 70252, 95228, 76565, 54947, 47589, 46434, 79210, 76503, 96904, 126911, 116185, 84897, 71844, 92584, 114806, 139788, 141793, 144326, 151306, 179830, 197644, 205201, 212397, 215057, 223493, 210285, 206991, 198723, 179375]
10727A79375M023J3675J1068p771j8228k4875o343j1199M628O745J8435J3308
10715A82841j5095J6874l826K2183J5260m1860l1127k5238j6147N2215K5135L604
10703A84819k2996k6012m2025N688K1831J5466J37j8700M2710K0953k1782l6586
10691A23503M660J0916M1545K3051J1091l0976l0179J0087L5661J8722P874N945
10679B31900n609J656m274k3724n530K1174R416p066o396M144l2097m920M749
10666A83423K4454L2019L7813M049j216L3852L7567M3J1720K2536m720j1377O782
10653C76945J4713N029R444L8911J7385K3530L4583K0911K3804Q160M3859O0870
10641F78144P530L0499J1691K0891M9738O4708L8573M5484L4744P8348J29803
$$ y = [179375, 183398, 197073, 208141, 200370, 182142, 157267, 150924, 139725, 144353, 151098, 169533, 182841, 167746, 184620, 180794, 202977, 218237, 176377, 145250, 120012, 103865, 156080, 181215, 184819, 161823, 135811, 93786, 99474, 121305, 136771, 136908, 118208, 160918, 181871, 160089, 123503, 128163, 139079, 180624, 203675, 214766, 183790, 153611, 163698, 199359, 218081, 225955, 231900, 226291, 227947, 223673, 199949, 194419, 215593, 225009, 217943, 211547, 215691, 183594, 178674, 183423, 207877, 239896, 277709, 281758, 280542, 314394, 351961, 352004, 363724, 386260, 381540, 370163, 376945, 391658, 396687, 406131, 445042, 462427, 485957, 520540, 541451, 565255, 573415, 617274, 678144, 685674, 716173, 727864, 748755, 798493, 863201, 901774, 947258, 982002, 1060350, 1190153]
10630A190153J50074J38809J35132J21881J02854J79650K21797K92721L87551
10621B920622M66614O41903Q87993J160278J520081J993774K424398K460062J955277
10612A6431002R76748j3235o24263o54172k70510M41458J370452K453231L660628
10603B3771339M621309M730391L365082P25914j824703l023054k805446j779559
10595B7781273l34836J298331K975001M707042N899378N597228L074714r69292
10587E0028839m540110o012539n497638m033155k309784o34260Q67241K198050
10579C0066644L009139K586858P06130k004772m157588m803616m228851l109929
10571A8064015j880037q20973K0328O02767Q76231O28923k31190j331947k195533
$$ y = [1190153, 1340227, 1479036, 1614168, 1736049, 1838903, 2018553, 2240350, 2533071, 2920622, 3387236, 4029139, 4917132, 6077410, 7597491, 9591265, 12015663, 14475725, 16431002, 17407750, 17394515, 16770252, 16116080, 15845570, 16287028, 17657480, 20110711, 23771339, 28392648, 33123039, 36488121, 37214035, 35389332, 32366278, 29560832, 27781273, 27446437, 28744768, 31719769, 36426811, 42326189, 47923417, 50998131, 50028839, 45488729, 39476190, 33978552, 29945397, 27635613, 27001353, 27868594, 30066644, 33075783, 35662641, 36368771, 34363999, 30206411, 25402795, 21173944, 18064015, 16183978, 15363005, 15383333, 15986100, 16862331, 17491254, 17260064, 15928117, 13732584]
10562A3732584k457260k254953j894021j548405j235930r50384p24486n29893
10554B137252l80322k88200k28688j94847j45927j35102j36012j30253r1004n2890
10544C54007k2553n8133o6379l9585l7707k5948j8743k3666l9560l9567l4151
10533e1985Q382K2459j6572j8852K630n456j9558K0042k0254j3315R43J0289j0734
10520i1981l2076j8320K5891J3754k3947j3632P433K2816K6597L4753J6617l0528
10508f2623R707j0480r73j1335m7564l4973k3238M922K5278o757L0246L3647K8994
10495f5149j6651o977j0694j3849l591r568L7931L8572n272m2565k3248j1680
10483a32741N8K2491M462q545M891l444K5892j3893k4779K1665k324J792J8658
$$ y = [13732584, 11275324, 9020371, 7126350, 5577945, 4342015, 3391631, 2667145, 2137252, 1756930, 1468730, 1240042, 1045195, 899268, 764166, 628154, 497901, 406897, 354007, 331454, 273321, 206942, 167357, 129650, 103702, 84959, 61293, 21733, -17834, -51985, -43603, -21144, -37716, -56568, -53938, -59394, -78952, -58910, -79164, -92479, -91536, -81247, -91981, -124057, -142377, -116486, -102732, -126679, -140311, -132878, -110062, -83465, -48712, -32095, -62623, -52916, -63396, -64369, -75704, -123268, -158241, -181479, -176557, -151279, -158036, -127790, -94143, -65149, -81800, -88777, -99471, -113320, -116911, -126479, -88548, -49976, -55248, -97813, -121061, -132741, -132683, -110192, -105730, -114275, -109384, -112828, -86936, -100829, -125608, -103943, -106267, -104475, -85817]
10470h5817K9594R654J4793r561j6282j0419K0145j6078k658L487J6122J344j4386
10457f0062J4783j2288n3190p250J7052N49j4781k9184L5700j8873l554O473R903
10444a14722M7102k085j4113k7549j8097l8233k1911N6883K9248Q79J597q737
10432a09738J559R662J2761n8794k0570Q941M071L334l3239l2139J5761K9956
10420a68435K5157J9586M0436K5054k188j7066j4362K2171L2278M8953K6627p14
10408C7497j2234j5867p546j6042k8443j1644J356k5781m387j014l0627k9826
10396a44558k7025j4910K4651M5463K8183K865j3603m1822J5076L7865K117K7403
10384e8295j4562l3980k3512m375J4970K5313j6873m0491j61p576K6392K9828
$$ y = [-85817, -56223, -46569, -31776, -41337, -57619, -68038, -47893, -63971, -66629, -63142, -47020, -45676, -60062, -45279, -57567, -110757, -118007, -100955, -100406, -115187, -144371, -108671, -127544, -131098, -124625, -114722, -67620, -69705, -83818, -111367, -129464, -167697, -189608, -132725, -103477, -102598, -101001, -109738, -108179, -98517, -85756, -144550, -165120, -156179, -152108, -148774, -182013, -214152, -198391, -168435, -143278, -123692, -83256, -58202, -60390, -77456, -91818, -69647, -37369, 11584, 38211, 37497, 25263, 9396, 1850, -14192, -42635, -54279, -52923, -78704, -83091, -84105, -114732, -144558, -171583, -186493, -161842, -116379, -88196, -85331, -98934, -140756, -125680, -87815, -85698, -58295, -72857, -106837, -130349, -134724, -119754, -94441, -111314, -151805, -151966, -159542, -133150, -103322]
10372a03322R927j3960J6223J6959J5613K8256j597j3880k8194k1339l6201k0555
10360a52070Q901K6542K8773J7630L0432q886m0539J7025j4694L862P2165M4198
10348C3339K4155M0095J6832j9268k9933m0828n5704q379j7767Q012K168k5941
10336g3219J0711j856p560m9194J4046J1114M031J4205m35L757J9386L8998J5869
10323a47j4443l7511J4972K4861L5905R318q453R784m027n0398m924O241Q42o123
10309b4103k3523j32p403K1030N389m379j3537Q961J1229J8611L0302j1223j8317
10296g095m75O3136N8522J6338L926J0064L7249J0915o016k0531j5477k839k5847
10283A21870k9330j8791J7898L0694N0561M4937N6042L7296J0757j4684l2727
$$ y = [-103322, -93395, -107355, -91132, -74173, -58560, -30304, -31901, -45781, -73975, -95314, -131515, -152070, -143169, -116627, -87854, -70224, -39792, -48678, -89217, -72192, -86886, -83024, -10859, 33339, 57494, 97589, 114421, 95153, 65220, 24392, -31312, -39691, -57458, -49446, -47278, -73219, -62508, -64364, -71924, -121118, -107072, -95958, -91927, -77722, -78157, -74400, -55014, -16016, -147, -14590, -52101, -37129, -12268, 23637, 32955, 24502, 34286, 30259, -20139, -25063, -18822, -17980, -24103, -47626, -47758, -55161, -34131, -28742, -33121, -46658, -37697, -26468, -7857, 22445, 11222, -7095, -7570, 55566, 114088, 130426, 134352, 144416, 181665, 192580, 186564, 166033, 150556, 147717, 121870, 92540, 73749, 91647, 122341, 172902, 217839, 273881, 311177, 321934, 307250, 274523]
10272B74523q0914l9161l9443n7907m5860K745r457l0600J3204J2496m3389n3264
10260i7027M725L5091J445J3350J4589q758J372p046j3475J7320K6732k0728k2990
10247e5400L806R079K1477L102j173k6417J3883M91J9088J6002p101l9474k3049
10234f5686q33k210L562o254k572M157j2877j1955K614m002R740k526P36K4379
10220f3727J6456J3385p903m45k3489n760N323M0706J2284n0258r259p814l864
10207h4365J1631R667j1539K3225J5604p043q46J0611l54l7511J1429K4948O632
10194b7911j6265j8064J8781J7552N952m1325m09P828K8814p389l2775k5784p83
10181i1778K7619N6543j785M113O485J157m532o96K587J1496K6862L4390j1071
$$ y = [274523, 193609, 154448, 115005, 57098, 11238, 13983, 4526, -26074, -12870, -374, -43763, -97027, -92302, -57211, -55766, -42416, -27827, -36585, -35213, -42259, -55734, -38414, -11682, -32410, -55400, -51594, -42515, -21038, -17936, -19109, -45526, -31643, -31152, -12064, 3938, -3163, -42637, -65686, -66519, -68729, -65167, -71421, -73993, -69836, -82713, -94668, -92054, -96056, -86316, -88842, -88106, -63727, -47271, -33886, -41789, -42234, -65723, -71483, -66160, -25454, -13170, -63428, -72687, -80501, -84365, -72734, -63067, -74606, -51381, -35777, -42820, -43666, -33055, -33409, -70920, -59491, -34543, -27911, -44176, -62240, -43459, -25907, -19955, -61280, -61689, -53861, -25047, -32436, -65211, -90995, -91778, -64159, -7616, -9401, -5288, 1197, 2354, -2178, -2874, -287, 11209, 38071, 72461, 61390]
10168F1390L89N514N1896M0908J971l7158K30o569k4452n6781j5647j0177L8090
10155D9604M0726O4246Q1119L0952k2602n3160o3814l6173K6580K5371R95k379
10143A41465j7500L2314K7536K4704K6306L4107J3558K1502O2787J1476K5245
10132D03500P751Q895o0497q3394o1174p1358o3947n0565n1027L692K0583k0728
10120a8269k076N317j3983k2734J0422j1961Q873n685j786k6064j4951M6074J8983
10107b7840K4124j0572l4988n0400k8223k3514K5697P6418q082j900J959J3144
10095d4177l5031k0447j0933o934J2387J340K272J8381K2535J6494K243j6903
10083e8773J4344l694k8433J6352o35m450J3221K1150j6175K765o830r129j5857
$$ y = [61390, 61779, 67293, 119189, 160097, 162068, 124910, 125140, 118571, 94119, 37338, 21691, 11514, 49604, 90330, 154576, 235695, 266647, 244045, 190885, 127071, 90898, 117478, 142849, 143844, 141465, 123965, 156279, 183815, 208519, 234825, 268932, 282490, 303992, 366779, 378255, 403500, 411251, 420146, 359649, 276255, 215081, 143723, 79776, 29211, -21816, -18124, 2459, -18269, -20345, -15028, -29011, -51745, -41323, -53284, -44411, -50096, -51882, -77946, -92897, -46823, -27840, -3716, -14288, -49276, -99676, -127899, -151413, -125716, -49298, -57380, -59280, -57321, -44177, -79208, -99655, -110588, -117522, -105135, -103795, -101523, -83142, -60607, -44113, -41870, -58773, -44429, -48123, -76556, -60204, -60839, -65289, -52068, -30918, -47093, -44328, -51158, -60287, -76144]
10070g6144K3150M474J240J9590j9150j7314j8095k4468R832O565L3362j5263
10058g2221P309L9874j6552l7011k1237P258m1j834J6488K2782J6792J5457l1129
10045e4065O90J516l7225k3348l3398Q190J5449K1486N5073M8863j0534k6658
10033c3961J8416k7277M309j502l2850l5856K239M5250R922k6312j6240J8020
10021g5842k08J7596K4164L2613k3218l3554p139K5470j1917j2075P42o439j208
10008g1015l0733j9736n355M660P766M311K9472L100m624k7454p269K8737j9357
9995a07497k2559L2008K2370k407j856J6103j3148j6232M026J9695M777K43Q770
9982e5707J1684j9411k9823K771J2825J7955k2371r545J8647l1419r150j2304
$$ y = [-76144, -52994, -48520, -47280, -27690, -46840, -64154, -82249, -106717, -96885, -90320, -56958, -72221, -64912, -25038, -41590, -78601, -99838, -92580, -92621, -94455, -77967, -55185, -38393, -22936, -54065, -53375, -51859, -89084, -112432, -145830, -137640, -122191, -100705, -45632, 3231, -7303, -33961, -15545, -42822, -38513, -40015, -72865, -108721, -106482, -61232, -51310, -77622, -93862, -75842, -76050, -58454, -34290, -1677, -24895, -58449, -65588, -40118, -52035, -64110, -63368, -69807, -71015, -101748, -121484, -126839, -122179, -114413, -110102, -80630, -77530, -82154, -109608, -116877, -88140, -107497, -130056, -98048, -75678, -78085, -79941, -63838, -76986, -93218, -89192, -69497, -64720, -64477, -55707, -44023, -63434, -93257, -90486, -77661, -59706, -82077, -91622, -72975, -104394, -113544, -125848]
9970a25848J6864L4603o038j9245J0981P559L4796J1419r915l093K0368j2416
9958c9965k9177j3843N35j0270p094J040K4913L3686J1222j5675l7460K6M8401
9945c3661P897o466k0615J9138m068l5134n3296L8097N9874J1894L3491K3097
9933D0248m035J47p106l7452k4374k0122j9464j39L2054j0606q462L4362j4246
9920c9195l3102o1526j111L6591L9255Q209N561O575P630l1862k8754O304O595
9907g8830n83k5522R136L0482J3574K8924j6797j705j776r133J2576P515O554
9894b5585L6349j3149k8875m5308l3570L680L912L7599P275Q033M196j2410r631
9881f7484L1787M420K034r729J4495J7529j9941j1409P275K4978k5679o2359N713
$$ y = [-125848, -108984, -74381, -80419, -99664, -88683, -81124, -46328, -34909, -44824, -47917, -27549, -39965, -69142, -82985, -82450, -92720, -99814, -98774, -73861, -40175, -28953, -44628, -82088, -82062, -33661, -25764, -32230, -52845, -33707, -37775, -72909, -126205, -88108, -28234, -16340, 17151, 40248, 36213, 36360, 29254, -8198, -32572, -52694, -72158, -72297, -40243, -50849, -59311, -24949, -39195, -72297, -133823, -134934, -98343, -59088, -50879, -45318, -38743, -31113, -62975, -91729, -85425, -78830, -79413, -104935, -95799, -65317, -51743, -22819, -39616, -41321, -43097, -52230, -39654, -32139, -25585, 10764, -2385, -31260, -76568, -110138, -106458, -102546, -64947, -57672, -49639, -45443, -57853, -67484, -35697, -31277, -29243, -38972, -24477, -6948, -26889, -38298, -31023, -6045, -31724, -94083, -88370]
9868h8370J7502J1759j8140k58l666r859J9345L9342K2675j6960k0991l0275J8452
9855e9444j019j178j3485k241J7285J2559p762l215N915j0049k0091K999j167
9842h0893J7241K1573k0752k1552J5596j6751k1736k287m250L0398K401J867J7924
9829f1221j7978k3581J1550J371R955J8242n22N31r412l8001j9256R691j3438
9816a32069O898M2281J8506j8501j223o92J2640K7755M236K963p479j9033k592
9803f6310N620K2189J4989L0454k3777l1268j8567j099R61P172O1664K9260K6986
9790E8274j0364J1294L904l3698j3964k4606k3643J7649L74p229N702J6208j0723
9777a0822k3857p909P141m992M2721K6201n1707j603L8349K2133N3761J9274k4229
$$ y = [-88370, -70868, -59109, -77249, -77507, -81173, -91032, -71687, -32345, -9670, -26630, -47621, -77896, -59444, -60463, -61641, -75126, -77367, -60082, -47523, -55285, -58500, -52585, -62634, -82725, -79726, -80893, -63652, -42079, -62831, -84383, -68787, -85538, -107274, -109561, -113811, -83413, -81012, -79145, -61221, -79199, -102780, -91230, -89859, -79904, -61662, -62184, -61653, -71065, -109066, -128322, -118631, -132069, -125171, -82890, -64384, -82885, -84108, -84800, -72160, -44405, -40169, -37206, -44685, -63718, -66310, -60690, -38501, -23512, 6942, -16835, -48103, -66670, -67769, -66808, -59636, 2028, 31288, 58274, 47910, 59204, 63108, 29410, 15446, -9160, -32803, -15154, -14780, -22009, -16307, -99, -10822, -34679, -42588, -35447, -40439, 2282, 28483, -23224, -24827, 13522, 35655, 89416, 108690, 84461]
9764H4461L175p3275n9412l0318j371j2497J568K5846M5232M0752J5147m4777
9752e469l0623O605j0488k2899j450M8432o517k308l76j9460O219l9882M294J4022
9738e9900K1363J5841K0742m458l4903Q62O848k0839k9473L2992r202j0108J5472
9725e4763L2186L9554n0388k4647L5078L5662p166k3026p3038J0181J1542j9887
9713h8712K7343M2369J3976P320L1417k9106j6964l785J643J3177k885r028J7749
9700D514J9225j5080l075l7726Q62K8122n417n890K6985J7481k5112l3888J45
9687b8854K2798k493l2810j8926K0454P230J2255K0563r539k1108k8213m683J0449
9674e2877l0674J6355R782J8809J3315l6196j7040j1049J464J2858K7148L4746
$$ y = [84461, 87636, 14361, -45051, -75369, -76740, -89237, -87669, -61823, -16591, 24161, 39308, -5469, -36092, -29487, -39975, -62874, -64324, -15892, -22409, -24717, -25093, -44553, -38334, -78216, -73922, -59900, -38537, -22696, -1954, -6412, -41315, -40453, -33605, -54444, -83917, -50925, -60127, -70235, -54763, -22577, 16977, -33411, -58058, -22980, 12682, 5516, -17510, -90548, -80367, -68825, -88712, -61369, -19000, -5024, 2296, 33713, 4607, -12357, -16142, -14499, -1322, -4207, -13235, 4514, 23739, 8659, 5584, -32142, -31280, -3158, -8575, -14465, 12520, 30001, 4889, -28999, -28854, -6056, -8549, -41359, -60285, -39831, -32601, -20346, 217, -9322, -30430, -58643, -63326, -52877, -83551, -67196, -57414, -38605, -25290, -61486, -78526, -89575, -88111, -75253, -48105, -13359]
9662a3359J788J3504J2257k4959j2184j912m6611j1237J5032J2812K1251p120
9650d0738J0831L9830L3517N8969N8287R1912P8298L5033p4779r5636q5690q1765
9638B8069j4097j0214k1821j7301K4516J907J4462n8395m4754m51p447M0382L7982
9625b7162l2502j1862J8449K4340J6482J1524P560R75l0760k8631O478K1628K1067
9612b414p589j7169N393k856k3539j7625n058Q946N996J6951J7045J255l776j2942
9598c7382k6751o200j846j56j7526l822j5820K314o25l333K4154J1276L0817J1960
9584c2940j6419K661J9326J4731l3119o337K0255K2940J5525j4806j2738l2929
9572e3850j6294J6277K6357J1939j1827L258J7943k1745n159k67j9127J4361M708
$$ y = [-13359, -11571, 1933, 14190, -10769, -22953, -24865, -71476, -82713, -67681, -54869, -33618, -40738, -29907, 9923, 43440, 102409, 160696, 252608, 330906, 365939, 291160, 195524, 109834, 28069, 13972, 3758, -18063, -35364, -10848, -8941, 5521, -52874, -97628, -98079, -105526, -65144, -27162, -59664, -71526, -53077, -28737, -12255, -731, 6829, 7804, -22956, -51587, -45109, -23481, -2414, -10003, -27172, -21779, -24635, -48174, -65799, -70857, -61911, -55915, -38964, -21919, -20664, -24440, -37382, -64133, -70333, -72179, -72335, -89861, -93683, -109503, -107189, -107814, -111147, -86993, -75717, -44900, -32940, -49359, -46698, -27372, -12641, -45760, -52097, -31842, -8902, 6623, -8183, -20921, -53850, -70144, -53867, -27510, -15571, -27398, -24140, -6197, -27942, -33101, -33368, -52495, -38134, -33426]
9559c3426J1453j1134L564j7172j1147K1041n06j5975J2146q748O878k7957k4618
9546i5601Q600Q902K3929J2167k8943k2623J2146O777l7M080N019L455n70K599
9532f0100K198j8881j6259L4109N35J5050J3155j3918Q468L911q397l0329J1152
9519e9306K5270L2531K0290m051m0590j5686P674P334j1883m6740Q522L66K7485
9506d8784J9318P013j3685R640K5633l036k1178k674k6984P795l734J5699J6392
9493a8585m4493j6659M4757R535K5870J6443j4937k5638r050j5679p267J5160
9481d0543J943J9856o704N172L1904k2439J869Q263j5990L317P264Q591O898R802
9467A9203P577m1776k9199r32R356k4480J7433J8433K597l7275k2869L420L7273
$$ y = [-33426, -21973, -33107, -29543, -46715, -57862, -36821, -37327, -53302, -41156, -49904, -43026, -70983, -95601, -87001, -78099, -54170, -42003, -70946, -93569, -81423, -74646, -74683, -70603, -65584, -62129, -62699, -60100, -57902, -76783, -93042, -58933, -58398, -43348, -30193, -44111, -35643, -31732, -40129, -70458, -59306, -34036, -1505, 18785, 14734, -25856, -41542, -33868, -26534, -38417, -85157, -76635, -76269, -48784, -29466, -22453, -36138, -26498, -865, -3901, -25079, -27753, -54737, -46942, -50676, -34977, -18585, -63078, -79737, -34980, -25445, 425, 16868, 1931, -23707, -32757, -48436, -55703, -40543, -38600, -18744, -25448, -20276, 11628, -10811, -8942, -679, -16669, -13352, -6088, 2503, 9401, 19203, 26780, -14996, -44195, -45127, -35771, -60251, -42818, -24385, -21788, -59063, -81932, -78512, -41239]
9454d1239J782l5297J7697l6715j779O573J9394K8956L9765k5447k6463j0397
9442f3170M0162k107l9525j2238O322K9324n772q987J8464Q737J7305L1470j7290
9429B695j3548J0221r244j5972J5582j085j9664O635j3994l505k190K1302j2803
9416c5570j9702J3780m64J504O344l115j5217k0520J0311K2329K0156j7853j4906
9403e2923m585J901J4518K6977j3332O1o056M314N480N782o097k4019M4586L6867
9389C3474Q527o146j6983j0811K0175L704n3632p40J7190J4485k1159k1315j839
9376c5070K868j1973J2005q2n824k764m543K7329k81J565K5447j0638j9500O623
9362a4838J6633J8343K9202q1j0094j9889j5897J0789j4603j713j2467j1583l6894
$$ y = [-41239, -39457, -74754, -57057, -93772, -95551, -88978, -69584, -40628, -863, -26310, -52773, -63170, -23008, -25115, -64640, -76878, -70556, -41232, -47004, -55991, -37527, -28790, -11485, 19985, 2695, -10853, -632, -9876, -25848, -10266, -11351, -31015, -24380, -38374, -41879, -44069, -22767, -35570, -55272, -41492, -41956, -40452, -34108, -37223, -52440, -72960, -62649, -40320, -20164, -38017, -52923, -57508, -55607, -41089, -14112, -27444, -27383, -33439, -29125, -23645, -17863, -23960, -47979, -3393, 33474, 42001, 35855, 18872, 8061, 28236, 31940, -21692, -22432, -5242, 9243, -11916, -33231, -35070, -32202, -44175, -32170, -32252, -38076, -40840, -45383, -18054, -18335, -16770, 8677, -1961, -21461, -14838, 1795, 20138, 49340, 49259, 39165, 19276, 3379, 14168, -435, -2148, -14615, -26198, -63092]
9349f3092R790P2279O002l0607k2588J7287J8748K6030k019J700k1882k8675L569
9336a3458K9466j9010k4671r298L3527p599k3796j9733l1970J0682K6825L210
9324d5825R033l2852j6370L4714K8480l34J8652L4632l844k5533m741K8321J4319
9311C8652m9309j4597L7766l083r986q156j6721p555N387j0775j5253R174J2834
9298c1622n738J707p823j2544P321j938j2221j6009j888k6051L588K6833J7582
9285e8803J1529K8648L4634j8123Q635o923J3844R375j9417J3115k5786K52j2170
9272b1190j8885J1300j2878O10j6556L0027O496K726K600k543Q536N443J2499
9259H185j9213j1504j4428n739L3049J167k8515K286L2857K752m841m2685N018
$$ y = [-63092, -53302, 18977, 24979, -5628, -28216, -10929, 7819, 33849, 31830, 33530, 11648, -17027, -13458, 16008, -3002, -27673, -36971, -3444, -11043, -34839, -54572, -86542, -75860, -49035, -45825, -36792, -69644, -86014, -51300, -22820, -23154, -4502, 30130, 26286, 753, -3988, 24333, 38652, -10657, -25254, 12512, 9429, -557, -8713, -25434, -32989, -27602, -38377, -53630, -44456, -31622, -37360, -35653, -43476, -56020, -48699, -50637, -62858, -78867, -80755, -106806, -103218, -76385, -58803, -47274, -18626, 16008, -2115, 6520, -403, 13441, 22816, 3399, 16514, -9272, -9020, -21190, -40075, -28775, -41653, -41043, -57599, -27572, -21076, -18350, -15750, -18293, -9757, -4314, 8185, -11028, -22532, -36960, -42699, -9650, -8483, -36998, -34712, -1855, 897, -3944, -46629, -41611]
9246d1611J3075k0130J2308n202j2089p173j0716K0788L2352m79M768N98K7875
9233A4364j0223k5964K002j043M1813j6326K559L9873J2855l1649q922l3482K283
9220a1860J7085j5339m493r90j2441j1368M5864J2930K813K3512K2566M6370M175
9207A18824l3218l3385P150j3494k864m6838l6340L1798J237l9480j7540K3242
9195d0908o675j605J0833P464j0050p287j4999r122K0315K5245Q944j1532J8247
9182a1130L6542N136k1094m9452J612j5312j5777L9773N879L3000k0109l9862
9170e0794J0251n389P884j2359j1984K7855L3347J6550j1804j5871l0024p032
9158d9370J3942k3581R497O344l2291J4667O5705n868k9541j0035K5687P641q718
$$ y = [-41611, -28536, -48666, -36358, -41560, -53649, -60822, -71538, -50750, -18398, -18877, -14109, -13511, 14364, 4141, -21823, -19821, -20864, 20949, 4623, 7182, 47055, 59910, 28261, 19339, -14143, -11860, 5225, -10114, -14607, -15597, -28038, -39406, 6458, 19388, 22201, 45713, 68279, 114649, 118824, 85606, 52221, 59371, 45877, 43013, -3825, -40165, -8367, -7130, -46610, -64150, -40908, -47583, -49188, -38355, -30891, -40941, -48228, -63227, -72349, -52034, -26789, -17845, -29377, -11130, 25412, 30548, 9454, -39998, -38386, -53698, -69475, -29702, -23823, 9177, -10932, -50794, -40543, -45932, -38048, -50407, -62391, -34536, -1189, 15361, 3557, -12314, -42338, -49370, -35428, -59009, -49512, -43168, -75459, -60792, 4913, -955, -30496, -40531, -14844, -7203, -15921]
9145a5921k3690m8730r412M9594M0258j1680m116L186o390n002K129J9780O846
9132c148J3948k498J888q42J2871m307k5555r494K944L6120P109n843k3010Q155
9118H338L835J8641K3516j989k679o71m9334k1266L5082K9426n69j7985l5504
9105a1159k3960J6820P868J2304m571k247O063j703K3149n743j8376K692j6298
9092a5161j1904J2193N744r987P023J1390k4922j4841R279l2111K0440Q417L1066
9079c374j3082k7153P133M4903J6418j333j2539k0929J0212J929K0962m847j2188
9066F112j4443R10L0531Q219k6540m8995l2066R216N543J9476J2108Q500j6774
9053c8203n077Q700M055L957k469P803j1158J53J4495j6270j1126o278K1999L4732
$$ y = [-15921, -39611, -88341, -97753, -48159, -7901, -19581, -23697, -20511, -26901, -31903, -29774, -9994, -3148, 10800, 8302, 10190, 9348, 22219, 17912, -7643, -17137, -14193, 21927, 29036, 23193, 183, 8338, 12173, 30814, 54330, 52341, 49662, 48991, -343, -21609, 13473, 42899, 42330, 24345, -11159, -35119, -18299, -10431, 1873, -2698, -4945, 1118, -585, 22564, 16821, -1555, 1137, -15161, -27065, -14872, -9128, -19115, -12092, -702, -25624, -40465, -31186, -63297, -42857, -34440, -3374, -16456, -43609, -36476, 8427, 24845, 23512, 10973, -9956, 256, 2185, 23147, 18300, 6112, -8331, -7421, 23110, 31329, 4789, -44206, -76272, -67056, -61513, -42037, -29929, -21429, -38203, -43280, -34580, -30525, -26568, -29037, -21234, -32392, -32239, -17744, -34014, -45140, -51418, -29419, 5313]
9039E313J6163j4609m2797n0071k8577j1501L3265L0128P223l295j6734L5692
9027c9800Q017k256K1638L4056R478j7115Q752j3407j4083K7369j9733j5436K5470
9014A2950k340k7771J4780L745j9191q281J1651j149J1115P158J8837J9314K690
9001D3508j4998j9340j4171n413L01k5675O351N106l862K1987L5651L1429M834
8988F5708M952m5085k1676J127j9933k311k361K609K4719k1915J1594M2582O609
8975D6619r883j4941j8939R797l7989j4001J0831R772q318j0368M600J9923j1544
8962b4441O891K0624J554Q748k7559J9091J9137j5196J870J2021j079j0039m1589
8949b9967l9014K5224n321L303J9878J4496l6156J5729M1330Q051n2821K736L6765
$$ y = [5313, 21476, 6867, -35930, -86001, -114578, -126079, -92814, -62686, -55463, -58758, -75492, -39800, -31783, -34039, -12401, 21655, 31133, 14018, 22770, 9363, -4720, 22649, 2916, -12520, 12950, 10610, -17161, -2381, 1364, -17827, -26108, -14457, -15606, -4491, 2667, 21504, 40818, 43508, 28510, 9170, -5001, -10414, -10113, -35788, -29437, -24331, -28193, -6206, 29445, 60874, 65708, 70660, 25575, 3899, 5026, -14907, -17218, -19579, -16970, 7749, -14166, -2572, 40010, 46619, 36736, 21795, 2856, 12653, -25336, -39337, -28506, -18734, -27052, -37420, -32820, -12897, -24441, -17550, 3074, 4628, 13376, -14183, 4908, 24045, 8849, 10719, 22740, 21661, 11622, -29967, -68981, -43757, -49078, -45775, -25897, -11401, -47557, -31828, 9502, 17553, -35268, -32532, 4233]
8936D233J36Q098o315L082J8584J1310J1406l933k2948j7142j1072J2072J9037
8923B6548j2778k6161n492L6619J0762Q757L6464K132j3876m187k1435l4537q722
8910e906L6235j7185j4558K0845J2793p712j3570r951J8633j6353r260N2337K1739
8897F8087J5507L431j3582j3978l3906k3323K7362N028j4640k3088p163N131j2081
8884a7215J2338J4559M7J7693K1803j7643k4389k987j6485j2233N4816J0171j7313
8871B3162o651J010l838r348K7612L2497J9288j7881r227O871j4253k1800k2526
8858D916o137L3061r997k795j5133j513R006M606j7153j3376J3787j6542j6911
8845c4181K5082n511j165J4148j432j4699K8199Q557P210L5807k1281j7685M0178
$$ y = [4233, 4369, 12467, 6152, 9234, 27818, 39128, 50534, 46601, 23653, 6511, -4561, 7511, 26548, 13770, -12391, -17883, 18736, 29498, 38255, 74719, 76851, 62975, 58788, 37353, 2816, -5906, 30329, 13144, -1414, 19431, 32224, 24512, 10942, 991, 19624, 3271, -5989, 46348, 68087, 83594, 87025, 73443, 59465, 25559, 2236, 29598, 34626, 19986, -3102, -10265, -5134, -17215, -4877, 9682, 9729, 27422, 49225, 31582, 7193, 4206, -12279, -24512, 30304, 40475, 23162, 16511, 17521, 13683, 4335, 31947, 64444, 83732, 65851, 56624, 63495, 49242, 27442, 4916, -1221, 31840, 21843, 19048, 3915, 2402, 11408, 16014, -1139, -14515, -728, -17270, -34181, -9099, -14610, -15775, -1627, -3059, -17758, 10441, 18998, 26208, 62015, 40734, 23049, 63227]
8832F3227N3070R528k1365k6849j007J5296J132q427R055k0067n375L7479K1449
8819A27146J3873K1563N020m284j6696n211J2505k1988J4555M9142R2993J08746
8807C97364J79326J72620J26169n9902j59898j48060j12906o3164p3870o5371
8797A92308m7268k1382j6943j7390k148l3027j0592o630J5509J8706J2735K4154
8785A08032J8026k1447j6283j4980j5192K9848J5183K3742L0005K2546L5836N072
8773B20388j2552k9896r968K3953P755L0349K4841O1236J05835J31341K43801
8762G97083L73280M37721K49979j10719l83153m10401k93603j77682j15737o7837
8752B98931o6721r0968j6191J5736p431n8412k8333N3267M6306L2705j1968j2924
$$ y = [63227, 116297, 125825, 104460, 77611, 76604, 91900, 93032, 84605, 93660, 73593, 68218, 105697, 127146, 141019, 162582, 167602, 163318, 146622, 141411, 153916, 131928, 146483, 195625, 288618, 397364, 576690, 749310, 875479, 815577, 655679, 507619, 394713, 331549, 257679, 192308, 145040, 123658, 106715, 89325, 87177, 54150, 43558, 36928, 52437, 71143, 83878, 108032, 126058, 104611, 88328, 73348, 58156, 88004, 103187, 126929, 156934, 179480, 215316, 220388, 207836, 177940, 167972, 191925, 199680, 230029, 254870, 316106, 421941, 553282, 797083, 1170363, 1608084, 1858063, 1747344, 1364191, 953790, 660187, 482505, 366768, 298931, 232210, 141242, 125051, 140787, 133356, 74944, 46611, 99878, 146184, 178889, 166921, 153997]
8740A53997l0674j877k3481K8925j554j2212j117j4373L143k0836P672K4734L3390
8727A45737M658j6524k538J2560K0269J9P596K3380Q2363J06564J59386J91003
8715G34473J14444l2835j56685j82645j28978p7250o6961n2751l9280K652J2193
8704A26377M362k2896M775J0867P6K8934K3763Q764p998j9048p67n8418j1741
8691H7050K2641k7712l8135J2521O295r313R033J0651N310J3918l971J2684K4721
8678A25693M1075J6064P96n276n853r410j3027k7097j3323j1761R077j2798L07
8665I4467o037k0176n435j9814k353j205K0872k4687j0921K7686j7968o707K0404
8652D8126N4444J9787j3998j6624K80J3746j5343k6522Q341J9915n906J0723r96
$$ y = [153997, 123323, 121446, 97965, 126890, 125336, 113124, 112007, 97634, 100777, 79941, 87613, 112347, 145737, 150395, 133871, 131333, 143893, 164162, 164181, 171777, 195157, 277520, 384084, 543470, 734473, 848917, 816082, 659397, 476752, 347774, 270524, 203563, 150812, 111532, 114184, 126377, 130739, 107843, 112618, 123485, 123561, 152495, 176258, 185022, 177024, 157976, 157209, 98791, 87050, 109691, 81979, 43844, 56365, 62660, 53347, 62380, 73031, 78341, 92259, 88288, 100972, 125693, 166768, 182832, 183628, 178352, 172499, 163089, 150062, 122965, 109642, 97881, 106958, 94160, 94467, 88430, 68254, 62819, 43005, 40652, 39447, 60319, 35632, 24711, 52397, 34429, 27722, 48126, 102570, 122357, 108359, 91735, 92015, 105761, 90418, 63896, 72237, 92152, 86246, 96969, 95973]
8639I5973M5101M0631Q076K4735M4850M4538K460l5899m1245l1614k6881l0543
8627A40182l6340l1515k266l39J2671k2126j4389N490J6988R642k1390m8119j0464
8614a975M0581K3440n790k5372n03N4458J6689k3499m3631J1527K3916K5k4079
8601D5787k0508J3032j4845j081K7379J8430p6J7152M5286L1316K7368L1819l841
8588B17218m936j2840j8254q216J0842l3784R29j2536L0780L0043J7499o119k1580
8575A89046K0955O8841K8776M3136P6101K9129p582r379k8930l8473n5536j7314
8563B98770k7544K1308J1453n2885l5982k5396J2758j5796p000k1804j9057R005
8551A47830l22K950O686L300j5101j2316l9168p416Q629j9130k1123R936N251
$$ y = [95973, 141074, 181705, 189781, 214516, 259366, 303904, 306364, 270465, 229220, 197606, 170725, 140182, 103842, 72327, 70061, 69722, 82393, 60267, 45878, 51368, 68356, 77998, 56608, 8489, -1975, 38606, 62046, 56256, 30884, 30381, 84839, 101528, 78029, 34398, 45925, 69841, 69866, 45787, 25279, 38311, 23466, 22385, 49764, 68194, 68118, 85270, 130556, 161872, 189240, 221059, 217218, 212282, 199442, 181188, 172972, 183814, 150030, 150959, 138423, 169203, 199246, 216745, 210626, 189046, 210001, 278842, 307618, 350754, 426855, 455984, 448402, 439023, 410093, 371620, 316084, 298770, 271226, 292534, 303987, 251102, 215120, 189724, 202482, 186686, 179686, 157882, 138825, 147830, 147508, 150458, 157144, 160444, 145343, 133027, 93859, 86443, 95072, 75942, 54819, 64755, 70006]
8538G0006J5104J5569K1214L9951N538m247K1453K0243J0193K0931L8232L6609
8526C10796J18416J37346N9232j2417p0893j10075q8654r2315l9012j1250l4069
8515A67105n0173j2411j3241k5860L9221J6822q781L549R734K9945P991j2356
8503A51545o828m0979l6555J2067J0236o192l3645K387k0941J3938K4116k7340
8491D1809m672K0323l1585J9412M7374K1410K5824j7173j0792M8048M6296K2906
8479B29180M3026J8639L978k5569j5305l5746n7645j3276q678l1626o698k8923
8467G1357j7786J845J1819O898l945j7233n374J0261J7949j5794k9730p967K4201
8454D6501r120l5096l077K8134M8989k0686j9110R957j3805m935k464Q804j5869
$$ y = [70006, 85110, 100679, 121893, 161844, 167382, 163135, 184588, 204831, 215024, 235955, 274187, 310796, 429212, 566558, 625790, 613373, 542480, 432405, 343751, 251436, 212424, 201174, 167105, 116932, 104521, 91280, 65420, 104641, 121463, 112682, 116231, 125965, 155910, 163901, 151545, 144717, 103738, 67183, 79250, 89486, 83294, 49649, 52036, 31095, 45033, 69149, 41809, 37137, 57460, 25875, 45287, 92661, 114071, 139895, 122722, 111930, 159978, 206274, 229180, 272206, 290845, 294823, 269254, 253949, 218203, 160558, 147282, 138604, 106978, 100280, 71357, 53571, 55416, 67235, 74133, 70188, 52955, 47581, 57842, 75791, 59997, 30267, 22300, 46501, 37381, 2285, -792, 27342, 76331, 55645, 36535, 46492, 32687, 27752, 25288, 34092, 18223]
8441A8223L0598L6868n76k7136J3102J887j5890k2644L9070J3537o69m610L3388
8428A15148J9648q369j510J5110k7285m2306j1447R711K501J1454k0083j3497
8416D9075K0385Q035l773m366r211j2990j306J3096J7501J0280K9612j5674n8381
8403D2283j5612j7607O484R126J1850j70O50l1811J0463M4865J9783m3427j346
8390C5531R00K0838L5554K5566K216K5529J9088l8404k0437J4145L726o7567j6797
8377C9888N2534j2500o3764j3590O040L3376m916O161l221n149K3099l744K6742
8364H0956j5432l5227O060j3960l815K2192L992R002J2760L065k7129k7142J4100
8351B9422J5489l7449M036P459J4166J7580L988l998k2087j8850L5182L8209M925
$$ y = [18223, 48821, 85689, 85113, 57977, 71079, 72966, 57076, 34432, 73502, 87039, 86370, 81760, 115148, 134796, 126427, 124917, 140027, 112742, 70436, 58989, 68700, 71201, 82655, 62572, 49075, 69460, 77495, 73722, 69356, 60145, 47155, 45849, 58945, 76446, 86726, 116338, 100664, 42283, 26671, 9064, 15548, 24674, 36524, 36354, 37004, 5193, 15656, 60521, 80304, 36877, 35531, 36431, 57269, 92823, 118389, 120605, 146134, 165222, 126818, 106381, 120526, 124252, 56685, 39888, 92422, 79922, 16158, 2568, 8608, 41984, 37068, 43229, 40008, 34859, 57958, 54214, 80956, 65524, 30297, 36357, 22397, 18582, 40774, 44766, 53768, 66528, 69593, 42464, 15322, 29422, 44911, 7462, 11498, 18957, 33123, 50703, 54691, 50693, 28606, 9756, 44938, 83147, 88072]
8338H8072k0383m83M308k8069o833j595j8260j0871Q780K1374Q3799M9133K5248
8325A94220K8381p7601p9008j1316n877m897J4396J184k5084k9179Q123j5083
8313a741k896L3898J0983n033J0063J8118r701O316K3958r383l2742L2230K2356
8300I6426K2284j6189m3624j7217j285k1759j196P729O651j5360j4949Q555L5557
8287D5623J1890m120l74K5841J09671J26474L2342m5069r8844p6911j6251l9323
8275G0949j0243K0256j4443J7726L1309p399N1942P6057K7300l480j2966l8325
8263B08683k2054n6985k3880J6669m35k2057L501K4659l1880n0528j8698L8373
8251F5368P704k1183m997Q483l4831j1850J5066k3847j5614j8869q695N3106O7238
$$ y = [88072, 67689, 67206, 71514, 43445, 36612, 35017, 16757, 5886, 14666, 36040, 119839, 168972, 194220, 222601, 145000, 65992, 54676, 48799, 43902, 58298, 59482, 34398, 5219, 13342, -1741, -4637, 29261, 40244, 35211, 45274, 63392, 53691, 60007, 83965, 74582, 41840, 74070, 96426, 118710, 102521, 58897, 41680, 40395, 18636, 17440, 25169, 31820, 16460, 1511, 10066, 45623, 57513, 53393, 53019, 78860, 188531, 315005, 347347, 302278, 203434, 126523, 110272, 70949, 60706, 80962, 66519, 84245, 115554, 108155, 160097, 236154, 263454, 259974, 247008, 208683, 186629, 129644, 105764, 122433, 121998, 99941, 103442, 128101, 96221, 45693, 26995, 65368, 73072, 51889, 46892, 55375, 20544, 8694, 23760, -87, -15701, -34570, -43265, 9841, 77079]
8238G7079Q4713L6855J5314m6711o3336j0689m474l1445O959Q258k6211R502K7536
8225H3350N0635O9535J6676k1952m5300k7912l5234l9411n530Q850l7121J5370
8213C1956K0583r725l4528l8554j2895K3385K3128R027O93l263j9106k6869K3184
8200a2984j9521P420J2395M10r380J1593j2569k7988j3268N088J3937K2088k3303
8187d6082P078p119M851R066n932J8282l912P932J252l9030j9156L4991K6637
8174a1142P948j1521l0358J8156J4751J2245J7682j8432j1112O497J2285K6039
8162C3038m1014k9066m695k2031J286J2511k279n150j0019K8370J4351j0017l433
8149c8148o41L052K3978k2786K4473J5062l4147l1414j338M51P913J3912o250
$$ y = [77079, 161792, 198647, 213961, 167250, 103914, 93225, 88751, 57306, 64265, 72523, 46312, 55814, 83350, 133985, 203520, 220196, 198244, 152944, 125032, 89798, 50387, 44857, 53707, 16586, 31956, 52539, 42814, 8286, -30268, -43163, -19778, 3350, 12377, 13070, 9807, -9299, -36168, -12984, -32505, -25085, -12690, -12280, -21660, -10067, -22636, -50624, -63892, -58804, -44867, -22779, -46082, -39004, -46123, -41272, -32206, -38138, -19856, -23768, -15836, -14584, -53614, -72770, -37779, -11142, -3194, -14715, -45073, -26917, -12166, 79, 17761, -671, -11783, -5286, 6999, 33038, -7976, -37042, -41737, -63768, -62482, -49971, -52250, -57400, -67419, -39049, -24698, -34715, -38148, -38789, -35737, -11759, -34545, -10072, 4990, -29157, -60571, -61909, -61458, -53545, -39633, -45883]
8136d5883J0469K0837k459J0108N0084K8233K1763k92K7811j9458m4147j7767
8124C9299N798q830J8167p250J4642k4169j918j096j6946l5449n46J1772j6512
8111b3038L7921J2894n315K7060J6055K175j5519k3498j0576j6648R702o867j6500
8098a2154j2980K3750J845l9287p15J7352k1661k2775M706K9630K3046J7804Q465
8085A7026K3126Q917J4599L9813n7007l1855O882K276J5911K6638k0921j4036
8073C1369r329k6989J0392p725j8297m875p392r307L1686M129J0844K9414L4204
8060F8124j7653j02K1231j6594k3178L923N73k0443r171n635n132l062p662j871
8046a6652k5128J867J3025K2178K7241j6661k3324j7129n378J5867Q18Q268K6503
$$ y = [-45883, -35414, -14577, -17036, -6928, 43156, 71389, 93152, 92860, 120671, 101213, 57066, 39299, 45097, 36267, 54434, 47184, 61826, 37657, 35739, 34643, 17697, -17752, -18298, -6526, -23038, 14883, 27777, 22462, 49522, 65577, 67752, 52233, 28735, 18159, 1511, 11213, 4346, -12154, -25134, -1384, 461, -38826, -39541, -22189, -43850, -66625, -61919, -32289, -9243, 8561, 17026, 40152, 49069, 63668, 103481, 46474, 14619, 21501, 23777, 39688, 66326, 45405, 31369, 22040, -4949, 5443, -2282, -20579, -25454, -32846, -42153, -10467, -6338, 4506, 33920, 68124, 50471, 50369, 71600, 55006, 31828, 35751, 36324, 15881, 6710, 1075, -4057, -7119, -14781, -16652, -41780, -39913, -26888, -4710, 22531, 5870, -17454, -34583, -39961, -24094, -23276, -15008, 11495]
8033A1495l18j5673l820n752K552J1696L7948J2850j7311l0082K5230J2344N372
8020D6531P179j4701k8970J7072M2193j5362j9000m1638k9512K5759K5703J4122
8008B9376n862K412n411j7240j3784J5351N167n39j2208J3413K4817k9552l746
7995B194l4011K807l6316l0348M9988M1690K2321j8987n064L2532J3967M555l2480
7982A2848k6526K9021K0520J0433r926J4993l182l9984j0383L1007l096L2347
7970E8072k7757l882q329o006L4758M1406Q847l3803J149K4892Q451l9694k2878
7957C5226l0383Q679M1764k5477k8737j1538m5866N276J9123L4490m871m6922
7945d9236J939J8076M791L2514O149J6629K042R193L353m0963r090K0402M663
$$ y = [11495, 11177, -4496, -8316, -14068, -11516, 180, 38128, 50978, 33667, 3585, 28815, 41159, 46531, 53710, 39009, 10039, 27111, 69304, 53942, 34942, -6696, -36208, -10449, 15254, 29376, 23514, 25926, 20515, 3275, -10509, 4842, 10009, 9470, -2738, 10675, 35492, 5940, 2194, -31817, -29010, -65326, -95674, -45686, -3996, 18325, -662, -5726, 26806, 40773, 45328, 12848, -13678, 15343, 35863, 46296, 36370, 51363, 48181, 8197, -2186, 28821, 25725, 58072, 30315, 26433, 18104, 12098, 46856, 88262, 97109, 63306, 64455, 89347, 97798, 58104, 35226, 4843, 13522, 55286, 29809, 1072, -10466, -56332, -51056, -31933, 2557, -2314, -49236, -47297, -29221, -24430, 8084, 14233, 30862, 32904, 42097, 45450, 4487, -4603, 15799, 20462]
7932B0462O914k0495k0466J3421M272r381k1189L6672M5440o573l2036J2240l522
7919B5759l8422j3186J7271O741j4013l538K7740J0869K5305j5676J433k1868
7907H415j6673k0413K847j1838J9884N4860k9277l434m485n896K1538Q586l2272
7894h158j755j3222Q26M536J3488L3133l220n427j3966L9036M628j3562k9764
7881F573j3914K2036j4743O772J5861J3685J2757o322m1599j80j9838j7695k987
7868c9594K8236M329J2363J9461j6393p458K1164J1393k1883m5903j9206K2819
7856c0672q020j9338J0745K5197L9971N1647J1334l6254l9772J586p02j2634l1950
7843c8862J5069K9950K3938o969o6457l2643K7155L894M43J3983K8720J2179m158
$$ y = [20462, 27376, 6881, -13585, -164, 4108, -5273, -26462, 10210, 55650, 49077, 17041, 29281, 25759, -12663, -25849, -8578, -1837, -15850, -19388, 8352, 19221, 44526, 28850, 30283, 8415, -8258, -28671, -25824, -37662, -17778, 37082, 7805, 4371, -114, -6010, 15528, 24114, -8158, -9913, -23135, -22309, -17773, -4285, 28848, 25628, 20201, 6235, 45271, 49899, 36337, 6573, -7341, 14695, -48, 6724, 22585, 36270, 49027, 42705, 1106, 926, -18912, -36607, -39594, -11358, -7029, 5334, 24795, 8402, 944, 22108, 33501, 11618, -34285, -53491, -30672, -38692, -58030, -47285, -22088, 17883, 69530, 80864, 44610, 4838, 6424, 5722, -6912, -38862, -23793, 6157, 30095, 23126, -43331, -75974, -48819, -44925, -44482, -30499, -1779, 10400, 6242]
7830F242l0741j7135o620J1903K3928J7209j8221j0248J5202J8870n830n5145
7818e0586j3053O067M0888K2553j9789j3853l2491K1386L4552J1194k789J536
7806E615R234k0364J1643O771l0586J373k8116k5794L5752J8664j2074J9277L7711
7793B9106R158m283m4929m749j4200M167k0921p20K065j33M7371J3922J7938J0661
7779D4453k9221l0239j6715J7998j1075j1920L436J3613J1411R139m040o934R437
7766f57k0475j4487R706R04J652K224K1132M527k9862p504L548J4K3546k4530
7752c0262r27K8596j963j768Q631k7810k0272j5694q605K5667N908r008K6776
7739b0731M4811J569N57K722o829l7491K0431l840J2228J3911k4397j0187l1348
$$ y = [6242, -24499, -41634, -48254, -36351, -12423, 4786, -13435, -23683, -8481, 10389, 4559, -50586, -63639, -57572, -16684, 5869, -13920, -27773, -60264, -38878, -4326, 6868, 4079, 5615, 14849, -5515, 6128, 12899, -17687, -16314, -44430, -70224, -34472, -15808, -27882, -8605, 29106, 38264, 33981, -10948, -15697, -29897, -25730, -46651, -47371, -45306, -45439, 1932, 15854, 33792, 44453, 15232, -15007, -31722, -13724, -24799, -36719, -33283, -19670, -8259, 880, -3160, -10094, -657, -21132, -35619, -25913, -25009, -23357, -21133, -1, 4526, -25336, -32840, -29292, -29278, -5732, -30262, -31189, -2593, -4556, -6324, 2307, -25503, -45775, -61469, -70074, -44407, -38499, -47507, -20731, 24080, 25649, 26206, 28928, 22099, -15392, 5039, 1199, 13427, 27338, 2941, -7246, -38594]
7726c8594k860N133R953k503j3304n129j0948l949M406q018j6143n253M4307R511
7712c3391j6674K2807K5586J8750o230q226k679j3724m339K9155J8138k4004j3590
7699h421j6448L390k4511J313K5797J3585J0460j862j1205k23l8889L6277K2287
7686A1550j2198j8901j0968m929J2383L657J9839j53N31M68q158m247k1696J8997
7672a3825K3022N440m815l4421m594J5437N322J0154R209j0005l6224k4389K5378
7659c4311K5231N460j8901k6545l500P230o467J6364K0828l248k5416L839M5537
7646F101N7373J9404l3159j6269M302j4950l6665k5855k6233K0837J9800j434
7634b6748K378K268K3030R829P16k301n101L146K6529j2595k2840j2377J8090
$$ y = [-38594, -41454, -36321, -26368, -28871, -42175, -47304, -58252, -62201, -57795, -65813, -81956, -87209, -42902, -33391, -50065, -27258, -1672, 17078, 10848, 2622, -57, -13781, -18120, 11035, 29173, 5169, -8421, -24869, -21479, -45990, -44677, -18880, -5295, 5165, 3303, -7902, -8125, -47014, -10737, 11550, -648, -19549, -30517, -35446, -23063, -19406, 433, 280, 811, 1279, -6879, -11126, -32822, -13825, 9197, 14637, 9822, -24599, -29193, -13756, -8434, 1720, 10929, 924, -35300, -59689, -34311, -9080, -3620, -22521, -49066, -52566, -45336, -51803, -35439, -14611, -17859, -43275, -39436, 6101, 63474, 82878, 49719, 33450, 37752, 22802, -13863, -39718, -65951, -45114, -25314, -26748, -24370, -22102, 928, 10757, 11473, 9172, 4071, 7217, 33746, 21151, -1689, -14066, 4024]
7621D024n637j4281o03n440r654K1956K4601M3J3109j2395j1272j0415o2979m7405
7607a16348M6835M3953J2120Q397P947l208J2867M82q968K9513R638k0948j5374
7594F906r986Q422J1626J0635j2043m5121m74K2752j5666j6672J3193K5761L0920
7581C0253k9380j206J8868j6084m60Q195J1123j25R010k520m1560k2960M0591
7568C745j0650l2863p154K4236Q717j3170O525J5811j0194m1081k7914J1401K2811
7555d9780L8014J0738k7888j5136K4658k4459N830P513Q60L4392K7776k1203k1084
7542i769o19P738j837k716j8887k1901J337K3562l2467k6733N125q36P96J9961
7528e7246J5859J1982R292l311k698J3277l508L1679r499j6320q648m0083q397
$$ y = [4024, -1613, -15894, -16497, -21937, -31591, -9635, 14966, 15009, 28118, 15723, 4451, -5964, -68943, -116348, -69513, -25560, -13440, -5043, 2904, -304, 12563, 13045, 4077, 33590, 43228, 22280, 6906, -3080, 5342, 16968, 27603, 15560, -29561, -30035, -7283, -22949, -39621, -26428, -667, 30253, 873, -333, 18535, 2451, 1991, 10186, 21309, 21184, 30194, 27674, -13886, -36846, 3745, -6905, -39768, -46922, -22686, -13969, -27139, -20614, -4803, -14997, -56078, -83992, -72591, -49780, -11766, -1028, -28916, -44052, -19394, -43853, -38023, -30510, -29650, 4742, 32518, 11315, -9769, -10388, -2650, -4487, -7203, -26090, -47991, -46654, -23092, -55559, -82292, -77167, -78003, -77207, -57246, -41387, -29405, -20113, -23424, -26122, -12845, -16353, 15326, 5827, -10493, -19141, -59224, -67621]
7515f7621N461L4908K4815K365l7991j2246K7473J9742q529j6839K908l1432k7728
7502h4714J6725L8559K7965K8499P127l2391K732q908M062J728J2327K2263l2299
7489C675R163K966k3541l098k822k9495j577J6615j845Q476N087m611J9987l672
7475d692j5683j6382m562J8134K0744L8614j775j2654j0253m888j7585J0936L879
7462C833p023p40j5135j8043P54l887J8589P241j4975O65J0252m4P181J6853K5514
7447C1035L998j036K7571m3935o4369j3519K9412J4422j0482N511K2443j3264
7435a2213m4345m3258P897L1531j5551J7398M0486J5454K4121l469n2867m2155
7423g6971J2337L4410K891k1053j0568J2580L595K6583K8036k0395n702l905j5741
$$ y = [-67621, -62160, -27252, -2437, -72, -38063, -50309, -22836, -3094, -11623, -28462, -25554, -56986, -84714, -67989, -29430, -1465, 27034, 34161, 1770, 4502, -4406, -344, 1384, 13711, 35974, 3675, 12838, 15804, -7737, -10835, -13657, -43152, -44729, -28114, -29959, -21483, -16396, -21007, -1020, -4692, -20375, -36757, -41319, -23185, -2441, 36173, 34398, 21744, 11491, 6603, -10982, -46, 3833, -3190, -3930, -19065, -37108, -36354, -40241, -21652, -14411, -29386, -28721, -18469, -18513, -11332, 5521, 31035, 35033, 33997, 61568, 17633, -46736, -60255, -30843, -16421, -26903, -21392, 1051, -12213, -56558, -99816, -91919, -60388, -75939, -58541, -18055, -2601, 21520, 18051, -34816, -76971, -64634, -30224, -27333, -48386, -58954, -46374, -42779, -16196, 11840, -8555, -14257, -18162, -33903]
7410c3903Q291m077J3239l592K8480l199q1712R28N5581k1564k057R310J0082
7397b4193o536n243J597O84j2342o644K0326p087k7216M9567O0030j3868l0898
7384a823j4792k3771L3863J0375k3469N141J9588J6457r755K945K1946k9823l8323
7371c1441JN048P372N7704p987j3025Q758N717k3619L583k0470J3603L38J1509
7357A7091k9818J9015j5505l4488p000J5307J380j9392K1527q796k521L0463p51
7344a3488j820J6067J4322J2792J5631j7980l9561J4873J4839k2870k6738J7619
7332a6314J2966K130O392J8725l456j4996r26J0297l8720n988j5203O156K6075
7319a2862l203k0424k902N406p630N84L793J9110K1013m857k9751L1427p046l0916
$$ y = [-33903, -25612, -29689, -16450, -20042, 8438, 5239, -76473, -75545, -19964, -41528, -43585, -34275, -24193, -30729, -35972, -34375, -33691, -46033, -52677, -32351, -39438, -66654, -17087, 42943, 29075, -1823, -16615, -40386, -6523, 3852, -19617, -14476, 5112, 21569, 11814, 14759, 36705, 6882, -31441, -31440, -26392, -19020, 38684, 30697, 17672, 26430, 32147, 8528, 12111, -8359, 5244, 5582, 17091, -12727, 6288, -9217, -43705, -50705, -35398, -34018, -53410, -31883, -40679, -43200, -12737, -13488, -15308, 759, 15081, 27873, 43504, 25524, -14037, 836, 15675, -7195, -33933, -16314, -3348, -1218, 5174, 23899, 20443, 5447, 4521, 14818, -23902, -29890, -45093, -38937, -12862, -16065, -36489, -39391, -33985, -41615, -41031, -37238, -18128, 2885, -1972, -31723, -296, -7342, -38258]
7305c8258L5635k446k9546O697j1215k1134q859K2768K8485Q018j7430M1182j5027
7292a130k5979J3934J0403l2808m468L3684j2862q010J825j2264K980J5068J2214
7279g413j5485j06l281R111n678K7950m33l0611k126M4224J3717L95j7733J55
7265A2686n904j3011j9138K558L4064J370M40O240l1449l7608p105J2461K8526
7252a5870J8669p719n012L632P27N956r056j1265j8020K5089j6535j9198K521
7239d6081J5518K2497j166n1k485M0533j1587l1351K0369J669J3639J0696J6999
7226D9199n156m6542k2265L6176K5320r884M254L2446l2360k6725J0643n153M798
7213A4751n892m885k6823R273l0723k2543N30n066K0900K0476J6092J8819J2801
$$ y = [-38258, -2623, -5069, -34615, -27918, -39133, -60267, -69126, -46358, -17873, -9855, -27285, 13897, -1130, -27109, -13175, -2772, -35580, -40048, -6364, -19226, -27236, -25411, -37675, -34695, -19627, -7413, -22898, -23004, -26285, -17174, -22852, 5098, 4665, -25946, -28072, 16152, 29869, 30264, 12531, 12686, 6782, -6229, -25367, -22809, 11255, 12625, 13065, 19305, -12144, -49752, -56857, -44396, -15870, 2799, -4920, -9932, -6300, -5573, 383, -8673, -19938, -37958, -12869, -29404, -48602, -46081, -30563, -8066, -9232, -9283, -11768, 28765, 17178, -14173, 6196, 7865, 21504, 32200, 49199, 44043, -2499, -24764, 11412, 36732, 26848, 31102, 63548, 31188, 4463, 15106, 9953, 14751, 8859, 3974, -22849, -13576, -44299, -66842, -66312, -71378, -50478, -30002, -13910, 4909, 17710]
7200A7710q213P494Q850l0291R048Q122j8550p808M753k5081J1224j240j894J5014
7186a0862K03l3758k7004K217k9963q022J6298L0070J9487K6055j1718q610j700
7173c7307K2J24P228O559L755Q790k4489o811O379M5749K2246o708J270l1914
7159e107p222K2227Q342k4237j609q140K274m9810j1463K108K4846L1610m668
7146b0849m166M432L0357J4956k2248l2723K1130M944k7656P408K5336k2049K631
7133a8497j4113J1872N311o896q490J1467N759P623K0922R99K2258k2004K876
7120A9087j925m6303k0002P338j8898j3897Q583k890K6294L6584K981k7649L2538
7107A841n709l9215J7016J3050r951k3914k3059l194J5875J052j519k279K0950
$$ y = [17710, 9497, 16991, 25841, -4450, 4598, 12720, -5830, -13638, -8885, -33966, -22742, -23982, -25876, -10862, -10659, -44417, -71421, -69204, -99167, -107189, -90891, -60821, -41334, -15279, -26997, -35607, -37307, -37285, -37161, -29933, -23374, -19619, -10829, -35318, -42129, -35750, 9999, 32245, 25537, 26807, -5107, -12329, 9898, 18240, -5997, -7606, -15746, -13472, -63282, -74745, -72637, -47791, -16181, -20849, -25015, -20583, 9774, 24730, 2482, -30241, -9111, -4167, -31823, -24415, 921, -21128, -18497, -32610, -20738, -15427, -22323, -30813, -19346, -13587, -5964, 14958, 15957, 38215, 16211, 19087, 17162, -29141, -49143, -41805, -60703, -74600, -66017, -68907, -42613, -6029, -3048, -30697, 1841, -3868, -43083, -26067, -13017, -22968, -46882, -69941, -73135, -57260, -56208, -57727, -60006, -39056]
7094c9056k5189m269N0546J7217O464M197k804J6572O637J6194j8660k5100O195
7081H944M1342o3264k8432M4524L3717j2509m293M461j4320l5197j7488J0866
7069c1649J2264J5789j1960k4413M651K1901L2617J1736r915l991J9629O876j9051
7056B4484k2784J7119R650p203l8944O63K6386j4091j4197J2706J0699k768O151
7043G871j509k7279l828J916J0846J2693r894K405p946J2047K4474l096j2026
7030F674R819M051l4548k2385q269K6719j818J6258o76p289p954J2212K494k63
7016d975O125m4122l4988K2559L1211M2152J5826m500k0239k8988R55K2472k2719
7003a9231p353k3718k2888L647J4792Q552k5023P636J46j1686K3978J3542K6224
$$ y = [-39056, -64245, -68514, -17968, -751, 5713, 9910, 7106, 23678, 30315, 46509, 27849, 2749, 8944, 50286, -12978, -41410, 3114, 36831, 24322, 20029, 24490, 10170, -25027, -42515, -31649, -19385, -3596, -15556, -39969, -35318, -13417, 19200, 30936, 21021, 17030, 36659, 43535, 24484, 1700, 18819, 28469, 21266, -17678, -17015, 9371, -4720, -18917, -6211, 4488, 1720, 7871, 6362, -20917, -24745, -22829, -11983, 710, -9184, -6779, -14725, -2678, 21796, 18700, 6674, 16493, 20544, -14004, -36389, -44658, -17939, -19757, -3499, -4175, -11464, -19418, -7206, -4712, -4975, 1150, -42972, -77960, -55401, -24190, 17962, 33788, 29288, 9049, -19939, -18984, 3488, -19231, -26584, -50302, -73190, -69543, -54751, -46199, -71222, -63586, -63440, -75126, -51148, -37606, -11382]
6990a1382L2828k1822l5977J2239J8623j5064N655J5312j0308j3489k4627L0089
6978a7923L0418j3302J2453J8343k9917k5611m1133J0177K3985M1334K5562m9685
6966a5299k0206j1100K2632K2050J71j2246p898K5234J0985k7448L5651Q405L349
6953C4280k0962n1073k6433P678K2238K748K6423k861l0525l79J3997k750o019
6940c3638K8662k0127l0748m433K898o095q117J9973o993N19K4401j4972k6696
6927g5366q797K9129K6695k672K4819K9932p038l233k6117J755n720J1187O094
6914F68k7004l8119L64L8041p6r166R591K5187J6390K625l5646J5177J4996J0484
6900B3512p095l5900J9859J8364j5704k1249k2436j1244j4677k9272K8504j0696
$$ y = [-11382, 21446, -376, -36353, -24114, -5491, -20555, -14900, 412, -9896, -23385, -48012, -17923, 12495, -807, 11646, 29989, 72, -25539, -66672, -56495, -32510, 8824, 34386, -15299, -35505, -46605, -23973, -1923, -1752, -13998, -21896, 3338, 14323, -13125, 22526, 30931, 34280, 13318, -37755, -64188, -56510, -34272, -31524, -5101, -7962, -38487, -38866, -24869, -27619, -33638, -4976, -25103, -55851, -60284, -57386, -63481, -71598, -51625, -58618, -58099, -33698, -48670, -75366, -84163, -55034, -28339, -31011, -6192, 23740, 16702, 13469, -12648, -10893, -16613, -5426, 668, -26336, -64455, -64091, -26050, -26126, -35292, -25701, -514, 15876, 18501, -17145, -1968, 13028, 23512, 16417, -19483, 376, 18740, 3036, -18213, -40649, -51893, -66570, -95842, -67338, -78034]
6888g8034K4948J9207K0439K0645J8762l2445m1929n4744J1816N003K3642K9138
6876c3552L9830q728N312M4647j0380p2974j4183K1648K7891K4958J1882K26m3736
6863g159l1186J862j7044J1238J0837l469J1468m228J0485j35l4743k9648K2210
6850e9512J4369J316J2049j9405j9186J3349N5217J7763l410m5476J8776N14J9895
6837F259R950j5073k1280J8089J4179N280j7147k3673j1624L9742l253p114K1635
6824A5970L1731k3192m3420r740k1019L7318O2673k863k4223l7628L0161j5195
6812E73k4959J9250J9174N783o638o830k6160O81P793r900M015J6271o94m486
6798f127r149R005N577M981k2701k5766m431K051K6170M8047K1971j034J2695
$$ y = [-78034, -53086, -33879, -13440, 7205, 25967, -6478, -48407, -103151, -91335, -86332, -62690, -33552, 6278, -2450, 2862, 47509, 37129, -35845, -50028, -28380, -489, 24469, 36351, 36577, -7159, -38345, -36483, -53527, -42289, -31452, -34921, -23453, -27681, -17196, -17331, -52074, -81722, -59512, -45143, -43827, -31778, -51183, -70369, -57020, -1803, 15960, 12550, -32926, -14150, -13636, 6259, 16209, 1136, -20144, -2055, 12124, 17404, 257, -23416, -35040, 4702, 1449, -5665, 15970, 47701, 24509, -18911, -28651, -49670, -12352, 50321, 47458, 23235, -14393, 15768, 573, -24386, -5136, 14038, 19821, 13183, 6353, -19807, -19126, -11333, -21233, -17218, -947, -1641, -6127, -15276, -6271, -694, 4287, -18414, -44180, -48611, -46560, -20390, 27657, 49628, 48594, 61289]
6785F1289M1271k9783l2701N510m07l9159k9902j403K2491K3982K1673q546j5946
6772A8369k5359k4719K8841K4856k9946k5749J5222J022o292l2775j7450M9710
6760b4270N2723L2645l3921n948k1437K0339J3487m069j6205q187j9962M465j0227
6747b0567j6233L3527j3153l580J3693J6990N037L1483p066j4229n2327k2448
6735d8873m403Q728K6972k0369M205K768K528N248N038k6909L276L5915R937j3171
6721i110j4283J0459J6465J8453j3513K498K6765l5530l2870J990J6997J7266
6709E587n273o705N180j1714k3194k1613j0085Q529j126J2326K5361K4795J6383
6696A8451o415j389R582n202p825J7187M600o3646l711L5983l966l2326p220J4235
$$ y = [61289, 102560, 72777, 40076, 45586, 45179, 6020, -23882, -25285, -2794, 21188, 42861, 34315, 18369, -6990, -31709, -2868, 21988, -7958, -33707, -18485, -17463, -23755, -56530, -73980, -24270, 28453, 61098, 27177, 21229, -208, 20131, 33618, 29549, 13344, 5157, -14805, -10340, -20567, -36800, -3273, -16426, -20006, -6313, 10677, 15714, 47197, 40131, 25902, -26425, -48873, -53276, -44548, -17576, -37945, -33740, -30972, -28444, -23196, -18158, -45067, -41791, -5876, 4061, -9110, -23393, -12934, 3531, 21984, 8471, 10969, 37734, 2204, -30666, -28676, -11679, 5587, 314, -6391, -1211, -12925, -36119, -57732, -67817, -59288, -60414, -48088, -22727, 2068, 18451, 12036, 10647, 20229, 15027, 7202, 24389, 28989, -34657, -38368, -2385, -6351, -38677, -45897, -31662]
6682c1662k4792K7600J6356J7418J5870j6773q889k0345j8148M761k197K616j3973
6669e2158J0206j2647k7926j0785J7444K1673M1196J1657j7511L1248L2778k0475
6657B4700k2976j0115K6432r320m6559j5178L1148K4781J6369J0977j3654R658
6645B6263M1753j8555k6670k4971j4528m13l3911R997L8492P739k4466Q032M0653
6632B9415j0984M261K2104m110j1796K0876k078o6586k6191M0888j2246j9480
6620c5927K2517P46M147J1747j1893j6429l953R904l265p44J8648O382K4929P061
6606C3870L618j0361j0010k616J1306k5196Q617J1006Q556R353m127k7914j2043
6593e941K504k2629l5147o866K5352L6755k7060m606K1966l87N026J6041K2175
$$ y = [-31662, -56454, -28854, -12498, 4920, 20790, 4017, -4872, -25217, -43365, -38604, -40801, -38185, -52158, -41952, -54599, -82525, -93310, -75866, -54193, -12997, -1340, -18851, 12397, 45175, 24700, 1724, -8391, 18041, 8721, -37838, -53016, -21868, 2913, 19282, 30259, 16605, 26263, 68016, 49461, 22791, -2180, -16708, -17121, -51032, -41035, -2543, 5196, -19270, -11238, 29415, 18431, 22692, 44796, 40686, 28890, 49766, 47688, -18898, -45089, -4201, -16447, -35927, -13410, -12664, -8517, 3230, -8663, -25092, -29045, -19141, -22406, -23150, -4502, 1880, 26809, 33870, 37488, 27127, 17117, 14501, 25807, 611, 9228, 20234, 28790, 38143, 34016, 6102, -5941, -3437, -26066, -61213, -68079, -42727, -5972, -33032, -37638, -15672, -16059, -11033, 5008, 27183]
6580B7183l092l9517j21L7799J9980N395j8587j7380M752o725j1724k4787j4902
6567d1726L673R099J7183K514l755j3748M959j0269N547l366K7347J3860N413
6554A6731L188k772J2710m171j4633m0089j174K8841J9676J7516l3905j2639K7539
6541A6818J6915j5892k9974J7106L477j6097J3577L2779l37l3709k7884j3540
6529c6761K9418K8637k4806k4549K4437K4330J3m824q749N642l869m240K89J3280
6515A8248k2341k2961M992K8986L0868K6820Q546k1543k0475p008l777j1390p419
6502A546M904l606J9148N208j1757j5203k8463k1103J7159O900N6993L5674j6611
6489E0789k4463o794l7491k675q817k2356O805L9025j1288k8859q541L3077M2803
$$ y = [27183, 24091, -15426, -15547, 22252, 42232, 47627, 29040, 11660, 16412, 9687, -2037, -26824, -41726, -38053, -28954, -11771, -9257, -13012, -26760, -21801, -32070, -26523, -29889, -2542, 11318, 16731, 19919, 17147, 29857, 25686, 11053, -29036, -30210, -1369, 18307, 35823, 1918, -10721, 16818, 33733, 17841, -12133, 4973, 8450, -7647, 5930, 38709, 38372, 4663, -23221, -36761, -7343, 21294, -3512, -28061, -3624, 20706, 20719, 15895, 7146, 12788, 8919, 4679, 4968, 18248, -4093, -27054, -22062, 6924, 37792, 64612, 73158, 51615, 31140, 24132, 20355, 8965, 1546, 6450, 2844, 21992, 27200, 15443, 240, -28223, -49326, -32167, -25267, 31726, 67400, 50789, 26326, 19532, -17959, -20634, -29451, -51807, -45002, -5977, -17265, -46124, -54665, -21588, 21215]
6476B1215P703l6683l7675J702L6661K8210o180k2651K2329l1249l7705n53J3877
6463d0999J5885k1892n574N150L1769J4859j94K294l5087l09j0202L171j5224
6450e6353M0058n85Q513q070O25K8848J3611r061j8888K9249K2818p041J512J5892
6436F1128L466j8793k7671l1167j1370j9584k1193l4002Q423J9123M6975L7586
6424A2921J796m8544k1119J8088K0981l1346j7357J1743K310L2252L0673K4845
6412C7243L416j8558q02l4794n668J1613M1435J1065m1722R321L4285k8178k6249
6399g593j2402k324K7076K2456n3415j4096L2104j2593O053R315k3962q412Ol5411
6385g3198O11M381k083P161L8978J688k522K2612K3694j0527l9364j0824l393
$$ y = [21215, 28918, -7765, -45440, -43738, -7077, 21133, 14953, -7698, 14631, -16618, -54323, -54876, -40999, -25114, -47006, -52580, -47430, -15661, -802, -996, 1298, -33789, -34098, -44300, -41129, -56353, -16295, -16880, -8367, -16437, -15812, 13036, 26647, 17586, -1302, 27947, 50765, 43724, 45236, 61128, 64594, 45801, 18130, -13037, -24407, -43991, -65184, -99186, -90763, -71640, -24665, 12921, 14717, -33827, -54946, -36858, -15877, -47223, -64580, -52837, -50527, -18275, 12398, 37243, 40659, 22101, 21299, -13495, -19163, -7550, 33885, 44950, 3228, 12549, 46834, 18656, -7593, -19995, -22319, 4757, 27213, -26202, -40298, -8194, -20787, -14734, -5419, -29381, -37793, -37787, -73198, -72587, -68206, -70289, -63128, -24150, -22462, -24984, -2372, 21322, 10795, -28569, -39393, -42786]
6372d2786j0736J7311L0982M503J083r271l447j4957J4096N42l4961j7211j1082
6359g5934O23j7999J9541M7357K1541k9891o714K8131N3288K604j6998k0507m3983
6346c8941j0546J1049q472l67r186N417J1555J6300R049q794m489J7796j5042
6333b4671l2035L5028m182J0163J2461m983l736K905J9249J2131k2720j6794J0356
6320f828J1626K9804J5265N843m2742m8489j7988L3063n055l612K3198M9699L3064
6307G6848j1060l4721l5420j2361M100J7750N292l1149j8870r386j4717m567L7580
6294c0681J8654M677J7790k3635k0999L12R759J369K3066n454k4835r560m775
6281d4312M859J1724k0854M0646O08j4194M910o818N837J1697J8176J3941j4914
$$ y = [-42786, -53522, -36211, -5229, -726, 357, -8914, -12361, -27318, -13222, -12680, -47641, -64852, -75934, -75311, -93310, -73769, -26412, -4871, -34762, -41476, -13345, 39943, 42547, 25549, 5042, -38941, -49487, -38438, -46910, -47277, -56463, -51046, -39491, -23191, -14142, -22936, -27425, -9629, -24671, -56706, -21678, -25860, -15697, -3236, -8219, -11955, -9050, 10199, 22330, -390, -17184, -6828, 4798, 34602, 49867, 55710, 12968, -35521, -53509, -20446, -25501, -29113, -5915, 43784, 76848, 65788, 31067, -4353, -16714, -12614, 5136, 10428, -20721, -39591, -48977, -63694, -68261, -30681, -12027, -7350, 10440, -13195, -34194, -33882, -24123, -22754, 312, -5142, -29977, -39537, -44312, -39453, -27729, -48583, -7937, -7329, -21523, -16613, -23431, -17594, -5897, 12279, 26220, 11306]
6268A1306k7285L036n166J1795O917j4899Q069n698m241k3938k045L6464Q840
6255C155Q856J5168J8264k8422j7996l1321j3517J0490K9440M8157k0784l7146
6243a5656k8084j343k430M3199O289q058L264j6532j6543J3498L7674j09j4202
6230I67Q474M4796Q867j1189l2970l2019j875K141l0358P804k2155O985M627J6300
6216b9605J7852k2016j1868P206j0330K7875L5800N29l2409k9160k043j3598j137
6203f2904M1120K3060j437j0215J4358l36j0271k2829j7235J2841K1734k0853
6191c2967k8258j9624L4736L5429P949M266k7957j2313K4640K6865q171m463M231
6178D363J9565N483l1345Q847P473n228R212o603Q3q340q701j0783j0687m468
$$ y = [11306, -15979, -12943, -18109, -6314, 603, -14296, -6227, -11925, -16166, -40104, -42149, -5685, 3155, 12011, 27179, 45443, 17021, -975, -32296, -45813, -35323, -5883, 42274, 21490, -15656, -43740, -45083, -47513, -4314, 1975, -6083, -2819, -19351, -35894, -22396, 15278, 15169, 967, 9441, 54237, 63104, 51915, 18945, -13074, -14949, -12808, -43166, -35362, -57517, -50532, -45905, -29605, -11753, -33769, -45637, -38431, -48761, -20886, 14914, 15443, -16966, -46126, -48169, -61767, -62904, -21784, 1276, -161, -10376, 3982, 3646, -6625, -29454, -46689, -33848, -12114, -32967, -61225, -80849, -46113, -10684, -2735, 1531, -26426, -38739, -14099, 12766, 4595, 132, 4363, 23928, 29411, -1934, 6913, 14386, 9158, 18370, 11767, 11850, 3510, -5191, -15974, -26661, -31129]
6164c1129L822o833k0300K994K0367J0674k1820M081k1194j6264L1652r98J3391
6151c1557K921J2882J5667K2482r74l1658k8560l471K5645j1319K648O687k6129
6138d4736R121K0740Q123J3035r4j3868j322j5402j613O233l5L826R886K5642
6124A9536K7256L940r105J8578j911l5423O229n732l187j9942L030k7103j7946
6111d1780J7627O5295P700m8890k5752o099J6094n0454k7491N7886L1335o139
6099a0668L4843j0590m2n519l4051p345N131k656N549J1711J4356J3561j548J0850
6085B3582k1867J938L4009j5517j2945O247K297J2458m175J940J7867K1421k5298
6072D1957k5338N595k2338j3750j0457J5508J0328R491k1211K6389m540n076k7604
$$ y = [-31129, -27307, -34140, -54440, -51446, -31079, -20405, -42225, -38144, -59338, -75602, -43950, -44948, -31557, -28636, -15754, -87, 22395, 21421, -10237, -38797, -42268, -16623, -27942, -25294, -18607, -44736, -35615, -14875, -6752, 6283, 6189, -7679, -9001, -24403, -26016, -19783, -19818, -15992, -6106, 19536, 46792, 50732, 41627, 60205, 58294, 22871, 29100, 23368, 20181, 239, 3269, -23834, -41780, -24153, 41142, 48842, -48, -25800, -31899, -15805, -66259, -93750, -35864, -4529, -10668, 24175, 13585, 13543, 8024, -26027, -33372, -28241, -30897, -25348, -13637, 719, 14280, 12732, 23582, 1715, 3653, 37662, 22145, 9200, 15447, 17744, 30202, 26027, 27967, 45834, 67255, 41957, 16619, 22214, -124, -13874, -24331, -8823, 1505, 10996, -10215, 16174, 11634, 6558, -21046]
6059b1046l8417J7774M0684l4919l395O575j3692K084J4676J3075L1751K2136
6047C7286k8847r835K5592J7663j6516j5682l2192l1324L1160O794J1475O770
6035B344k669k165j0476j238K4353l1088j5598M800j5454L981J8544K148n552
6022b8070m560J3330J3063j4859j6306k4960R237J208j1353J531k45M4972j1271
6009b8283Q10O072k5556L0158J1669K1385m960k2962K3333J2470j982j2352M350
5996A4152l2717L5797K7228q976M250J7382l4140k4032k5479j907K5548J9988
5984A7094J0389m984j8744k2681J6782o068J4420J7100J6111L155l0519k14R962
5971B1803j0290j8000K676r909j8104P101K5249K477k0582l2581j758L1207J3517
$$ y = [-21046, -59463, -41689, -1005, -35924, -39319, -32744, -46436, -44352, -29676, -16601, 15150, 37286, 8439, -1396, 24196, 41859, 25343, 9661, -22531, -53855, -22695, -15901, -4426, 2344, -325, -2490, -12966, -14204, 10149, -20939, -36537, -31737, -47191, -43210, -24666, -22518, -28070, -32630, -19300, -6237, -21096, -37402, -62362, -53125, -51917, -63270, -61739, -61984, -17012, -28283, -27473, -21401, -46957, -16799, -5130, 16255, 11295, -11667, 11666, 24136, 22154, 9802, 14152, -18565, 17232, 44460, 35484, 39734, 57116, 22976, -1056, -26535, -28442, -2894, 17094, 27483, 22499, 3755, -18926, -2144, -8212, 6208, 23308, 39419, 42574, 12055, 11841, 21803, 11513, -6487, -3811, -13720, -31824, -24723, 526, 3003, -17579, -50160, -51918, -20711, -7194]
5958g194l0849J5118j197m9197K8021O4076M566j7406J584j9963j7382L9694L1501
5945D1372j1984j1213K513l4470l5360J1056J5974L0361j4488R26j0166K433L3609
5932B0563r928K1840Q939j4846k7468j5802r815P601M0860M6316l180k1205k2293
5919B1582J0577R033k4776j0892J2605m083j9475k884o363l5202k3173j0881L7834
5906d6098M1105J8657l60m456J6730p63K781J947m7794j4841O212m232l8311J4326
5892e5097N3306j1740p216j7780J1643j9343n142O493K1438O522K1309j5383l57
5879a1347K3484n01j6652j8446p645j3760j4922m081J2257j0673j9749N606L1152
5866d5277K9111J7124J6227K9272l730l2088K280J005j6915k3276J993o67J8950
$$ y = [-7194, -38043, -22925, -24122, -73319, -45298, 18778, 23344, 5938, 7522, -12441, -29823, 9871, 41372, 29388, 18175, 20688, -13782, -49142, -38086, -22112, 8249, -6239, -5313, -15479, -13046, 20563, 10635, 32475, 41414, 26568, -900, -16702, -26517, -18916, 21944, 68260, 65080, 43875, 21582, 32159, 41192, 16416, 5524, 18129, 14046, -5429, -8313, -14676, -49878, -73051, -83932, -46098, -4993, 13664, 13304, 8848, 25578, 24815, 27596, 29543, -18251, -33092, -26880, -31112, -69423, -55097, -1791, -13531, -20747, -38527, -26884, -46227, -51369, -44876, -23438, -16916, 4393, -10990, -11347, 12137, 11636, -5016, -23462, -31107, -44867, -59789, -63870, -51613, -62286, -82035, -76429, -45277, -16166, 958, 17185, 46457, 42727, 10639, 12919, 13924, -2991, -26267, -24274, -24941, -5991]
5853e991L6789k5078k9096J4055O233l9621k4587K0210J6943p069J5602J9266
5841b344K9967m536j0171j8778k327J2503l2484o672J4638J5734n580K1756o681
5828E025p104J6183L7926j5069j9261j5083k8786J3964j556q843K1241K2002p677
5815A2962P382K5322j9539m1056j8961K3193P797j652J456l716q048l4644j806
5802e1310M6828J9140J0473n9389m4705Q60n05l0001L6497L3647N502J330j8862
5789e0495J1647J2896M0747J7240J0461k7612l0654k7864L102J9691K9900j7441
5777h382k305J1851n724K7652J7928l1k5722m752Q554j1183j7731k6182k4979
5764f1006o656R786L4087J7436R538K8429J2805R359k1441j4399k1047j7017J5503
$$ y = [-5991, 30798, 5720, -23376, -9321, -3088, -42709, -67296, -47086, -30143, -37212, -21610, -2344, 27623, 23087, 12916, -5862, -8189, 4314, -28170, -34842, -20204, -4470, -10050, 11706, 5025, -2079, 14104, 52030, 36961, 17700, 2617, -26169, -12205, -13761, -22604, -1363, 20639, 12962, 20344, 45666, 26127, -14929, -33890, -10697, -2900, -4552, -3096, -6812, -14860, -49504, -51310, -4482, 14658, 25131, -34258, -78963, -78103, -78608, -108609, -72112, -38465, -32963, -31633, -50495, -38848, -25952, 14795, 32035, 42496, 14884, -15770, -43634, -40532, -20841, 9059, -8382, -10687, 1164, -4560, 23092, 41020, 40989, 15267, 10515, 19069, 7886, -9845, -36027, -61006, -67662, -57876, -23789, -6353, 3185, 31614, 44419, 53778, 32337, 17938, -3109, -20126, -4623]
5751d623m3690k7739q323L9815K6572K5425L9296j6233j0490J0961l8263q716
5739a6008J6669K4744P113j7512O361p956j957J4315l4988l6334k8778J2822K1667
5726c9842K2301q614K9037P176j5048j4675j533J2787L399o91j0691j3836K7973
5713b257K676j0921m234j8272J6260J1485j4087j1716P090Q901M1121k034l1946
5700g934k3207L3476k971P785K7705j5133k4652O256l5855l528K4621J8685l291
5687A957j125j2862j9253J6102L7480n679n736P186Q833j7553k2144l4562P463
5674c9893K3550J5837k3248P425J404p574j6055j1468J2248L4183J0880J4654
5662B1943r979l1741j2301L2331n873j7708J4404j1238j7665k9681O660K3282
$$ y = [-4623, -48313, -76052, -84375, -44560, -17988, 7437, 46733, 30500, 20010, 30971, -7292, -16008, 661, 25405, 32518, 15006, 21367, 13411, 11454, 25769, -9219, -45553, -74331, -61509, -39842, -17541, -26155, 2882, 10058, -4990, -19665, -21198, -8411, -5012, -5703, -16394, -30230, -2257, 419, -10502, -14736, -33008, -16748, -5263, -19350, -31066, -23976, -15075, 26046, 24012, -7934, -31141, 2335, -636, 7149, 34854, 19721, -4931, 1325, -34530, -38058, -13437, 5248, 1957, 832, -12030, -31283, -15181, 22299, 16620, 10884, 18070, 26903, 9350, -12794, -47356, -39893, -16343, -506, -23754, -16329, -14925, -22499, -38554, -50022, -37774, -3591, 7289, 21943, 11964, -19777, -32078, 253, -5620, -23328, -8924, -20162, -37827, -67508, -60848, -37566]
5650c7566M9292K7094M9q630j2787j4196k5055m476k333K1225K800K6668m212
5637A7873k3850l2688M860J0335K4640K5133L3866N507o1059o255O383n155r875
5624a0285j7829j9623m031J6618K3636P833J1882O340j2437M466Q603Q029r372
5611A3830R30P7l4030j842l15l0697J4538L0899J8106R316j0062K972L80j1734
5597B368O085M068k1639K677L1576j2102o976K0835J4189J8807K957n1863k4711
5584a3729K8900P18n545J4733J3078J0418j0305R43O94k1031j9618J9771q127
5571A0900l5488o648j7445L756r148k6765M711M9647J2429o583l1431L2337J0463
5558i265j5901k0004O544m449L0785J1374L6311K7431n945l8075m8780O333K1393
$$ y = [-37566, 11726, 38820, 38869, 30239, 17452, 3256, -21799, -26275, -28608, -7383, -4583, 22085, 17873, -5977, -38665, -33805, -23470, 1170, 26303, 60169, 65676, 4617, -1638, 4745, -410, -10285, -28114, -47737, -51768, -35150, -11514, -3681, 8201, 14541, 2104, 6570, 15173, 23202, 13830, 14760, 14837, -19193, -21035, -21350, -52047, -37509, -6610, 11496, 20812, 10750, 13722, 14102, 2368, 8453, 12521, -9118, -6441, 25135, 13033, 6057, 26892, 41081, 59888, 62845, 10982, -13729, 15171, 15889, 10344, 25077, 38155, 48573, 38268, 39211, 39905, 18874, -744, 19027, 10900, -24588, -31236, -48681, -44925, -54073, -80838, -76127, -26480, -14051, -20634, -52065, -19728, -9265, -25166, -45170, -38626, -43075, -12290, -916, 35395, 62826, 56881, 18806, -29974, -23641, -2248]
5545b248K6577J4331k8250l8386k2014K2189o506L963J0937k415j6774K4140k489
5532a6945j3095J1465n267J3642J4705O532J262n003K572j98o418o15j3940m437
5518a5740k9208l051M6266R432j2943l383l316Q2J8274K1858k239K6730L176L368
5504E9306j4775l6078k449N855o189N474J4357J5503J8648m9750l6197M966M390
5491a6939k6790K9248L5858n412l6653k883J0987k5470k3178N0012L7839Q204
5479C4823j0777l2682q701O151p014J6664K7653k6007Q499L268k8220K799K984
5466a0560k1692N09r796m615L9190K7201j2400l093J7596j1698m8250n341L4472
5453h477J6885j0332J3587l4657o90L0849J7105J6990m0747l8284J9705K0635
$$ y = [-2248, 24329, 38660, 10410, -27976, -49990, -27801, -34307, -30344, -19407, -21822, -38596, -14456, -16945, -30040, -18575, -23842, -10200, 4505, 11037, 12299, 7296, 9868, 9670, 3252, 2637, -11303, -15740, -44948, -47999, -1733, 7699, -5244, -8627, -11943, -11861, 6413, 28271, 26032, 52762, 55938, 59306, 44531, 8453, 6004, 11859, 5670, 11144, 25501, 41004, 59652, 9902, -26295, -21329, -16939, -43729, -14481, 21377, 15965, -20688, -23571, -12584, -38054, -61232, -11220, 26619, 34823, 24046, -8636, -17337, -11186, -18200, -1536, 26117, 110, 8609, 11877, -16343, -13544, -10560, -32252, -31743, -41539, -46154, -6964, 20237, 7837, 4744, 22340, 10642, -37608, -42949, -8477, 8408, -1924, 11663, -22994, -23684, 7165, 24270, 41260, 513, -37771, -18066, 2569]
5441B569K522L982J0232L005m490k820J1512l1883k3248j79R815K974K1054K7034
5427C2079K9372L1750p372l0515l8333J562j9541l1052J1147J8472M71K3589P313
5414B8942J6466l5806o717K8955L0144r249n3461r477P047P760L888L8596J3447
5401F0535k0497l5634q640p750J9847j2713J2864J6361J784k4114L4703n47l5183
5388A016j7712j7430R612K3556k068J0113k3461m9405K6323K0876K2054J2141
5376A5615J2356k161j9897P751p602j7379L826N655J1413R009k2230j1059j0052
5363b4755K272L69J7153R844o737O770k8992j7729K1993J7963k0431J9550Q635
5350E905j4990l778K1362K0963q106M916o567J1642j3081m2377j4698K8769K5273
$$ y = [2569, 5091, 9073, 19305, 22310, 17820, 15000, 26512, -5371, -28619, -28798, -18983, -16009, 5045, 32079, 61451, 93201, 85829, 55314, 16981, 18543, -998, -32050, -20903, -2431, -1960, 21629, 28942, 45408, 9602, 2885, 31840, 61984, 52735, -726, -10203, -3156, 4604, 8492, 47088, 60535, 40038, 4404, -4236, -11986, 7861, -4852, 8012, 24373, 26157, 2043, 36746, 36199, 1016, -16696, -34126, -24514, -958, -3026, 7087, -16374, -65779, -39456, -18580, 3474, 15615, 27971, 25810, 5913, 13664, 6062, -11317, -7491, -1836, 9577, 18586, -3644, -14703, -24755, -22483, -22114, -4961, 4883, -1854, 4916, -24076, -41805, -19812, -1849, -22280, -2730, 5905, -9085, -12863, 8499, 29462, 21356, 26272, 19705, 31347, 18266, -24111, -38809, -10040, 15233]
5337A5233R794l0168k9068K6379J7338J2947j0161j4497k4209k7562J3781K9941
5325a0252J3443M477m417j9439k0179J6051J3703J7029N384K501P824K7910K5058
5312G9093R53l2846k2574J7687j2626j4268J7755M436q69N826j4851M736Q140
5299D0592P37n716j9107j2265l4574K1609M0810j3880j5004Q2j7954N789J9236
5286A0355j135Q338j3908l912J0278P160k3091k7839r554L5487r52k0414k869
5273c2056K9764j3626q259r406k016J8513p693J2746L4539J3439J345k7245J0142
5260B0187J4653J3567j061j6761J2412M405j5093R615J8270k5885j1602J4393
5248C7100Q717p10L634L153k5123O852L2865K6713k2481k6179l0912q763j8110
$$ y = [15233, 25027, -5141, -34209, -7830, 9508, 22455, 12294, -2203, -26412, -53974, -40193, -10252, 3191, 7668, 3251, -16188, -36367, -20316, -6613, 10416, 15800, 18301, 26125, 54035, 79093, 80046, 47200, 24626, 42313, 29687, 15419, 33174, 37610, 36741, 42567, 27716, 32452, 40592, 41329, 35613, 16506, 4241, -30333, -8724, 32086, 18206, 3202, 3284, -14670, -8881, 10355, 9220, 17558, 3650, -262, 10016, 17176, -5915, -33754, -43308, -7821, -8773, -29187, -32056, -2292, -15918, -24177, -33583, -35599, -17086, -24779, -12033, 22506, 35945, 37290, 10045, 20187, 34840, 48407, 47346, 30585, 42997, 47402, 32309, 41924, 60194, 34309, 22707, 37100, 45817, 45107, 48741, 51894, 26771, 33623, 66488, 93201, 70720, 44541, 13629, 4866, -13244]
5235a3244r580J9745M3317k287j0633J5520k958j9329j6960K686P967J4057n270
5222B3031l2352l2611J3886n474q029K292J9378K2677j374L4274K4569j0034N468
5209E5701J1424j5037l141k2898k5926j5189j2328q538J554j843J1083J0335q206
5196b3009K0585K7243K089Q60j9164J5723J9915o348n5292j2769K2466j0156L20
5183a7537j2369k3276M129K5228j0507j133l316R067k0255o331m399K5501J4148
5170b1050k2980N314L5854K6544J4758O193J1284j3886j8969p50k3726j1506Q626
5157d294l017J498L940j1660O669J4992J0317K331N013r176l6027l344o968k1490
5143e1216J031J6295J4193j0643j0655J4393L4629L0642k1670m002l885K0277
$$ y = [-13244, -22824, -3079, 40238, 37951, 27318, 42838, 39880, 20551, 3591, 6277, 14244, 28301, 23031, -9321, -41932, -28046, -33520, -41549, -39257, -19879, 2798, 1424, 35698, 60267, 50233, 55701, 67125, 52088, 48947, 26049, 123, -15066, -27394, -35932, -34378, -36221, -25138, -14803, -23009, -2424, 24819, 26908, 27768, 8604, 24327, 44242, 37894, -17398, -30167, -7701, -17857, -17537, -29906, -53182, -49053, -23825, -34332, -35465, -38781, -29714, -49969, -56300, -60699, -35198, -21050, -44030, -38716, -2862, 23682, 38440, 44633, 55917, 42031, 23062, 22312, -1414, -12920, -4294, -7311, -5813, -1873, -13533, -6864, 8128, 18445, 20776, 25789, 16613, -19414, -22758, -29726, -51216, -50185, -33890, -19697, -30340, -40995, -26602, 8027, 38669, 16999, 12997, 9112, 29389]
5131B9389r91p429L701k1241j7195K8166J9752O49n513J6028j4543k2088k8557
5118a9872o291J8444J1266Q288J2832K812l967k5371r530l973O242k2684J3185
5105a8619J2054r965L435k4661J0195J1077j3506r57K0374O41M941j5943L729
5092a7205N319P810l731j4354q208k426K4200j5811K2678K2250k7673M546L4686
5079C2081L438m117K787k3691m223L609j4617j1285K146M3888k943k4138m8452
5066d5517K1790L7465Q193k5461k7686n347J233l0753l1078j407K3166J5921L675
5053e5806K723j6604K7120j2797j1078J6139K7334L7494J4842q670q229J8481
5041C0949J6914l7668m4695m0308O040J6717k2716L1196J165k383K392L1375J659
$$ y = [29389, 28398, 20969, 24670, 3429, -13766, 14400, 34152, 34801, 29288, 45316, 30773, 8685, -19872, -26163, -7719, 3547, 11835, 24667, 27479, 23512, -1859, -11389, -15362, -9120, -31804, -18619, -6565, -16530, -13095, -37756, -27561, -16484, -29990, -30947, -10573, -9932, -4991, -20934, -17205, -11886, -4076, -7807, -22161, -30369, -32795, -8595, -24406, -1728, 20522, -7151, -2605, 32081, 35519, 31402, 34189, 10498, 6275, 9884, -4733, -16018, -13872, 30016, 27073, 2935, -45517, -23727, 13738, 21931, -3530, -31216, -36563, -35330, -66083, -97161, -98568, -75402, -59481, -55806, -53083, -69687, -42567, -55364, -66442, -50303, -22969, 14525, 29367, 20697, 12468, 30949, 47863, 10195, -34500, -74808, -68768, -52051, -74767, -43571, -42406, -44789, -42397, -11022, -9363]
5028i363l4259j5175r67Q564L2514J6308O87m4032j8567K1030K1230K8048M3254
5015D9272l763k2593j7008R807L0263J8430L1943k3180m1302l7487l7043L1323
5003a1338R843K4305m137o757p314o258J0476l3875j3172Q959p07J6175j5040
4990b8840k649n709J3755L0035m639l960J3151j5439j5330N244Q983Q328M477
$$ y = [-9363, -43622, -58797, -59764, -51200, -18686, -2378, -1691, -45723, -64290, -43260, -22030, 6018, 49272, 45509, 22916, 5908, 15715, 45978, 64408, 96351, 73171, 31869, -5618, -42661, -11338, -1495, 22810, 18673, 11916, 4602, -1656, 8820, -25055, -38227, -29268, -29975, -13800, -28840, -31489, -37198, -23443, 6592, 1953, -2007, 11144, -4295, -19625, -14381, -5398, 2930, 7407]
$$ [...]
##END NTUPLES=NMR SPECTRUM
##END=
