##TITLE=Analysis number 312169
Compound Code sew 01279
Project Code adrs
Chemist Name stores
##JCAMPDX= 6.0         $$ Bruker NMR JCAMP-DX V2.0
##DATA TYPE= NMR SPECTRUM
##DATA CLASS= NTUPLES
##ORIGIN= Bruker BioSpin GmbH
##OWNER= NMR
$$ XWIN-NMR		Version 3.5
$$ Tue Jul 26 15:21:06 2005 GMT Daylight Time (UT+1h)  MAYBRIDGE\NMR@NMR_250MHZ
##.OBSERVE FREQUENCY= 250.131544655141
##.OBSERVE NUCLEUS= ^1H
##.ACQUISITION MODE= SIMULTANEOUS (DQD)
##.ACQUISITION SCHEME= undefined
##.AVERAGES= 16
##.DIGITISER RES= 18
##SPECTROMETER/DATA SYSTEM= dpx250
##.PULSE SEQUENCE= zg30
##.SOLVENT NAME= DMSO
##.SHIFT REFERENCE= (INTERNAL, DMSO, 0, 16.522)
##AUDIT TRAIL= $$ (NUMBER, WHEN, WHO, WHERE, WHAT)
$$ ##TITLE= Audit trail, XWIN-NMR		Version 3.5
$$ ##JCAMPDX= 5.01
$$ ##ORIGIN= Bruker BioSpin GmbH
$$ ##OWNER= NMR
$$ C:\u/data/dgb/nmr/ADRS/6620/pdata/1/auditp.txt
$$ ##AUDIT TRAIL=  $$ (NUMBER, WHEN, WHO, WHERE, WHAT)
(   1,<2005-07-26 15:20:46.71 +100>,<MAYBRIDGE\NMR>,<NMR_250MHZ>,
      <created by zg, POWCHK disabled, PULCHK disabled
       configuration hash MD5:
       62 19 C7 07 E1 42 D1 B7 37 6C 3D D0 77 39 F9 E6
       data hash MD5: 64K
       45 93 8F D2 FB C4 08 9B 92 47 94 73 30 57 9B CA>)
(   2,<2005-07-26 15:20:58.89 +100>,<MAYBRIDGE\NMR>,<NMR_250MHZ>,
      <Start of raw data processing
       ef LB = 0.3 FT_mod = 6 PKNL = 1 SI = 32K 
       data hash MD5: 32K
       6F 2F 3A 6C 6F 92 22 AC F7 CF 31 33 C5 74 86 55>)
(   3,<2005-07-26 15:21:00.64 +100>,<MAYBRIDGE\NMR>,<NMR_250MHZ>,
      <apk 
       data hash MD5: 32K
       B5 83 76 85 8E 44 93 8F B0 C3 AA FB C4 85 D7 56>)
(   4,<2005-07-26 15:21:01.39 +100>,<MAYBRIDGE\NMR>,<NMR_250MHZ>,
      <abs ABSG = 5 
       data hash MD5: 32K
       A8 C7 BB A5 E9 EF 71 9C 9A D6 73 1F 08 57 FD 18>)
$$ ##END=
$$ 
$$ hash MD5
$$ 62 C9 80 4A 4D 43 83 B6 E8 31 FA 35 8C F4 31 86
##$RELAX= 
##$RELAX= 
##$RELAX= 
##$RELAX= 
##$RELAX= 
##$RELAX= 
##$RELAX= 
$$ Bruker specific parameters
$$ --------------------------
##$DU= <C:\u>
##$EXPNO= 6620
##$NAME= <ADRS>
##$PROCNO= 1
##$TYPE= <nmr>
##$USER= <dgb>
##$AMP= (0..31)
100 100 100 100 100 100 100 100 100 100 100 100 100 100 100 100 100 100 
100 100 100 100 100 100 100 100 100 100 100 100 100 100 
##$AQSEQ= 0
##$AQ_mod= 3
##$AUNM= <au_zg>
##$AUTOPOS= <50 >
##$BF1= 250.13
##$BF2= 250.13
##$BF3= 250.13
##$BF4= 250.13
##$BF5= 500.13
##$BF6= 500.13
##$BF7= 500.13
##$BF8= 500.13
##$BYTORDA= 1
##$CFDGTYP= 0
##$CFRGTYP= 5
##$CHEMSTR= <none>
##$CNST= (0..31)
1 1 145 1 1 1 1 1 1 1 1 1 1 1 1 1 1 1 1 1 1 1 1 1 1 1 1 1 1 1 1 1 
##$CPDPRG= <>
##$CPDPRG1= <>
##$CPDPRG2= <>
##$CPDPRG3= <>
##$CPDPRG4= <mlev>
##$CPDPRG5= <mlev>
##$CPDPRG6= <mlev>
##$CPDPRG7= <mlev>
##$CPDPRG8= <mlev>
##$CPDPRGB= <>
##$CPDPRGT= <>
##$D= (0..31)
0 1 0 0 0 0 0 0 0 0.06 0 0 0 0 0 0 0.0002 0 0 0 0 0 0 0 0 0 0 0 0 0 0 
0 
##$DATE= 1122387645
##$DBL= (0..7)
120 120 120 120 120 120 120 120 
##$DBP= (0..7)
150 150 150 150 150 150 150 150 
##$DBP07= 0
##$DBPNAM0= <>
##$DBPNAM1= <>
##$DBPNAM2= <>
$$ [...]
##$SUBNAM7= <"">
##$SUBNAM8= <"">
##$SUBNAM9= <"">
##$SW= 20.6930455092707
##$SWIBOX= (0..15)
0 0 3 0 0 0 0 0 0 0 0 0 0 0 0 0 
##$SW_h= 5175.983436853
##$TD= 65536
##$TD0= 1
##$TE= 296.16
##$TE2= 300
##$TE3= 300
##$TEG= 300
##$TL= (0..7)
0 120 120 120 120 120 120 120 
##$TP= (0..7)
150 150 150 150 150 150 150 150 
##$TP07= 0
##$TPNAME0= <>
##$TPNAME1= <>
##$TPNAME2= <>
##$TPNAME3= <>
##$TPNAME4= <>
##$TPNAME5= <>
##$TPNAME6= <>
##$TPNAME7= <>
##$TPOAL= (0..7)
0.5 0.5 0.5 0.5 0.5 0.5 0.5 0.5 
##$TPOFFS= (0..7)
0 0 0 0 0 0 0 0 
##$TUNHIN= 0
##$TUNHOUT= 0
##$TUNXOUT= 0
##$USERA1= <user>
##$USERA2= <user>
##$USERA3= <user>
##$USERA4= <user>
##$USERA5= <user>
##$V9= 5
##$VALIST= <valist>
##$VCLIST= <CCCCCCCCCCCCCCC>
##$VD= 0
##$VDLIST= <DDDDDDDDDDDDDDD>
##$VPLIST= <PPPPPPPPPPPPPPP>
##$VTLIST= <TTTTTTTTTTTTTTT>
##$WBST= 1024
##$WBSW= 4
##$XGAIN= (0..3)
0 0 0 0 
##$XL= 0
##$YL= 0
##$YMAX_a= 226848
##$YMIN_a= -397304
##$ZGOPTNS= <>
##$ZL1= 120
##$ZL2= 120
##$ZL3= 120
##$ZL4= 120
##$ABSF1= 16.522
##$ABSF2= -4.171173
##$ABSG= 5
##$ABSL= 3
##$ALPHA= 0
##$AQORDER= 0
##$ASSFAC= 0
##$ASSFACI= 0
##$ASSFACX= 0
##$ASSWID= 0
##$AUNMP= <proc_1d>
##$AZFE= 0.1
##$AZFW= 0.1
##$BCFW= 0
##$BC_mod= 0
##$BYTORDP= 0
##$COROFFS= 0
##$CY= 12.5
##$DATMOD= 1
##$DC= 0
##$DFILT= <>
##$DTYPP= 0
##$F1P= 14.0000005364418
##$F2P= -0.99999901652339
##$FCOR= 0.5
##$FTSIZE= 32768
##$FT_mod= 6
##$GAMMA= 0
##$GB= 0
##$INTBC= 1
##$INTSCL= 1
##$ISEN= 128
##$LB= 0.3
##$LEV0= 0
##$LPBIN= 0
##$MAXI= 10000
##$MC2= 0
##$MEAN= 0
##$ME_mod= 0
##$MI= 0
##$NCOEF= 0
##$NC_proc= -4
##$NLEV= 6
##$NOISF1= 0
##$NOISF2= 0
##$NSP= 0
##$NTH_PI= 0
##$NZP= 0
##$OFFSET= 16.522
##$PC= 1
##$PHC0= -93.26576
##$PHC1= 12.69357
##$PH_mod= 1
##$PKNL= yes
##$PPARMOD= 0
##$PSCAL= 4
##$PSIGN= 0
##$REVERSE= no
##$SF= 250.13
##$SI= 32768
##$SIGF1= 0
##$SIGF2= 0
##$SINO= 400
##$SIOLD= 32768
##$SREGLST= <1H.DMSO>
##$SSB= 0
##$STSI= 32768
##$STSR= 0
##$SW_p= 5175.98343685301
##$SYMM= 0
##$S_DEV= 0
##$TDeff= 65536
##$TDoff= 0
##$TI= <Analysis number 999999
Compound Code 99
Book Reference 9
Project Code 9>
##$TILT= no
##$TM1= 0
##$TM2= 0
##$TOPLEV= 0
##$USERP1= <user>
##$USERP2= <user>
##$USERP3= <user>
##$USERP4= <user>
##$USERP5= <user>
##$WDW= 1
##$XDIM= 32768
##$YMAX_p= 304560897
##$YMIN_p= -245563
$$ End of Bruker specific parameters
$$ ---------------------------------
##NTUPLES= NMR SPECTRUM
##VAR_NAME=  FREQUENCY,     SPECTRUM/REAL,   SPECTRUM/IMAG
##SYMBOL=    X,             R,               I
##VAR_TYPE=  INDEPENDENT,   DEPENDENT,       DEPENDENT
##VAR_FORM=  AFFN,          ASDF,            ASDF
##VAR_DIM=   32768,         32768,           32768
##UNITS=     HZ,            ARBITRARY UNITS, ARBITRARY UNITS
##FACTOR=    0.157963299565203, 1,           1
##FIRST=     4132.6476996994, 0,             0
##LAST=      -1043.33573715361, 0,           0
##MIN=       -1043.33573715361, -245563,     0
##MAX=       4132.6476996994, 304560897,     0
$$ Real data points
##PAGE= N=1
##DATA TABLE= (X++(R..R)), XYDATA
$$ [...]
17519A479418l9647r7416k6764n3250k187J3111J8114m7698l4674j7224j5972
17508A175811J7264L0344L0087Q1383J7550n8673n1597n4885M287K6174M956K0397
17496A243098K9273l581j9345j873P3276N8522K8967M4190M4607q657l7938j7812
17484A432727j6369q3404o9214K187M8921M3568Q349k2091L9438M9542K5109O7233
17472A525996J0578j588l2112p9153o3424k4432k1660m126P965q4695j1000k198
17460A220151n146K6555k7614p3286k6258N2368l3473K824j4741O1413L9390r767
17448A212416r2606q960M6882J0586j7772J8422N7464J8525p1116n8221O37K866
17436A119123j4274J321l9592L1672L0250J7106k556o6228j9941K0809L87L6402
$$ y = [1479418, 1439771, 1342355, 1315591, 1262341, 1260154, 1273265, 1291379, 1243681, 1209007, 1191783, 1175811, 1193075, 1223419, 1253506, 1334889, 1352439, 1293766, 1242169, 1187284, 1191571, 1217745, 1222701, 1243098, 1272371, 1268790, 1249445, 1247572, 1320848, 1379370, 1408337, 1452527, 1497134, 1488477, 1450539, 1432727, 1416358, 1332954, 1263740, 1265927, 1314848, 1358416, 1366765, 1344674, 1384112, 1433654, 1458763, 1525996, 1536574, 1534986, 1502874, 1423721, 1360297, 1335865, 1314205, 1310079, 1318044, 1233349, 1222349, 1220151, 1215005, 1241560, 1213946, 1140660, 1114402, 1166770, 1133297, 1136121, 1121380, 1182793, 1222183, 1212416, 1119810, 1110850, 1157732, 1168318, 1150546, 1168968, 1226432, 1244957, 1173841, 1115620, 1116257, 1119123, 1104849, 1106170, 1066578, 1098250, 1128500, 1145606, 1143050, 1076822, 1056881, 1077690, 1078077, 1114479]
17424A114479p480k8264k9514r062N566O6929L6207j7336r635k9287p4991L4213
17412A051825N2360j2538K0370r840K5525J3846R380m1403n2072N0564O745J6094
17400A130856k0720j4328J1074k9857j7043k1469J9191K0712j4289k4032Q223
17389A048318R100L6928j1483M1629l992q6995k471M4690l5396j0946J8321J5589
17377A063292m6660L2138K1109k6307K0901p942M5576k670J1324m8221j9772K4110
17365A066878k9135j9779N4654Q545r150M0833N699j6350M514J3031J0207j3338
17353A116609j7855K6197j9022J032K1613l0364j0496M840N2051o9127l6896J6318
17341A054900k8315m73k5639K8960m3634j1762O2235M6399K1817o1051J289K5126
$$ y = [1114479, 1106999, 1078735, 1049221, 1040159, 1045725, 1112654, 1148861, 1131525, 1121890, 1092603, 1017612, 1051825, 1104185, 1091647, 1112017, 1102177, 1127702, 1141548, 1150928, 1109525, 1057453, 1108017, 1114762, 1130856, 1110136, 1095808, 1106882, 1077025, 1059982, 1038513, 1057704, 1078416, 1064127, 1040095, 1048318, 1057418, 1094346, 1082863, 1124492, 1120500, 1033505, 1031034, 1075724, 1040328, 1029382, 1047703, 1063292, 1016632, 1048770, 1069879, 1043572, 1064473, 1056531, 1102107, 1099437, 1110761, 1062540, 1042768, 1066878, 1037743, 1017964, 1072618, 1081163, 1072013, 1112846, 1118545, 1102195, 1106709, 1119740, 1129947, 1116609, 1098754, 1124951, 1105929, 1106961, 1128574, 1098210, 1087714, 1092554, 1144605, 1075478, 1038582, 1054900, 1026585, 1026112, 1000473, 1029433, 985799, 974037, 1036272, 1082671, 1104488, 1043437, 1044726, 1069852]
17329A069852l466K6606j5898j7888J6302j3146O298K9450k1524M271m0509n3680
17317I86668j4651L7012L8831K6640K4174J5980m16P310J2284m445k26j2977l8576
17304A077608k6908l7596q7148j2019M6198M9770M2691M069k5261l1251K8053
17293A028206K7368j6345j9284K3473j2359q311K0181N6151p7822l6293K5645
17282A010610k8940l037o310r95j466n1106k086N3037j7757k6038m9610K6166
17270I02468M7166J4724r958K564N7935m473k1174j1832K4546N4519o4358o5220
17258I26907K4074l623J4237j3510M444J1569K3495O3425L7865l252J210l1782
17246A055059k9113K2188L5920O576O596m8170j6259J4693m2805p3151m7369k7775
$$ y = [1069852, 1066386, 1092992, 1077094, 1059206, 1075508, 1062362, 1068660, 1098110, 1076586, 1080857, 1040348, 986668, 972017, 1009029, 1047860, 1074500, 1098674, 1114654, 1114238, 1121548, 1133832, 1129387, 1129161, 1116184, 1077608, 1050700, 1013104, 925956, 913937, 960135, 1009905, 1052596, 1056665, 1031404, 1000153, 1028206, 1055574, 1039229, 1019945, 1043418, 1031059, 1022748, 1042929, 1099080, 1021258, 984965, 1010610, 981670, 978633, 972323, 971328, 969862, 918756, 916670, 969707, 951950, 925912, 876302, 902468, 949634, 964358, 954400, 956964, 1014899, 1010426, 989252, 977420, 1001966, 1056485, 992127, 926907, 950981, 947358, 961595, 948085, 952529, 964098, 987593, 1051018, 1088883, 1085631, 1086841, 1055059, 1025946, 1048134, 1084054, 1090630, 1097226, 1049056, 1032797, 1047490, 1004685, 931534, 884165, 856390]
17234H56390k573n4110O5231O7320l0625k7641L6426N6957K0422n136k1367j5538
17222I45756J4640n2138j0536P3714j8501m9552m1653j7111Q960k8795N4078J5688
17210H94550O422l4675k741M6855J03253p515l0591n2119j8975L8785K6836q266
17198I61819n6935l0408J4237l048J3157N3208l655m9130l9390P854M072p977
17186H63804M1825R760m8815o742n1322J5887L1050K1613k7695K8099J8558l5379
17174H60643L706J7048n278l9158n744l714K1637J2161l6380L5903J3875o2076
17162H12623O9913O2790J0377n2849j8100J3320M3462j819o1685j1538M0465J8751
17150I25710m4281o7137m6396P0448P2113o4M4966Q47m7213m8178M5934J145k7959
$$ y = [856390, 853817, 799707, 864938, 932258, 901633, 873992, 910418, 967375, 987797, 982661, 961294, 945756, 960396, 908258, 897722, 971436, 952935, 903383, 861730, 844619, 853579, 824784, 878862, 894550, 900972, 866297, 863556, 910411, 1013664, 1006149, 975558, 923439, 904464, 943249, 970085, 961819, 904884, 874476, 888713, 885665, 898822, 952030, 948375, 899245, 859855, 867709, 871781, 863804, 905629, 915389, 866574, 859832, 808510, 824397, 855447, 877060, 849365, 877464, 896022, 860643, 864349, 881397, 876119, 836961, 831217, 827503, 849140, 861301, 824921, 860824, 874699, 812623, 882536, 945326, 955703, 902854, 884754, 898074, 941536, 939717, 878032, 866494, 906959, 925710, 881429, 814292, 767896, 838344, 910457, 910393, 955359, 956206, 908993, 860815, 906749, 907894, 879935]
17137H79935n1845m2026n034O048P457j5457R2914O2641N606P1p0522r055m727
17124H56006N101L0308k3287o929q39J8905m8651n5858Q650L7670K5171j5136
17112H31111Q587M9183j1662K0212L1358l5688k0627l3099k1734L7864K8330K5737
17100I09572n0465n4763L0188N001P534R6411O965l6842k7320K0939M3086J0998
17088I61304k2691r6892N80N4337L4026p727l7226j6437j7496m0107n8206l1995
17076G21470N4986O595j7377p323L2696L8400j5608j0246r102n7781L224O0949
17064H00883m970j8299M0303K4467K3955k3170l9472o510l2902L0255L982L0243
17052H28765j8073N222L6359m645n0052j6185N268J6975L4942K465q0897j9497
$$ y = [879935, 828090, 786064, 781030, 787078, 794535, 779078, 871992, 934633, 940239, 940310, 869788, 860733, 856006, 861107, 891415, 868128, 861199, 860360, 879265, 830614, 774756, 783406, 821076, 846247, 831111, 839698, 888881, 877219, 897431, 928789, 893101, 872474, 839375, 817641, 855505, 883835, 909572, 859107, 804344, 834532, 839533, 847067, 943478, 950443, 913601, 886281, 907220, 950306, 961304, 938613, 841721, 842301, 896638, 930664, 922937, 885711, 869274, 851778, 811671, 753465, 721470, 776456, 783051, 765674, 758351, 791047, 829447, 813839, 803593, 794491, 736710, 739934, 800883, 795913, 777614, 817917, 842384, 866339, 843169, 803697, 797187, 764285, 794540, 798522, 828765, 810692, 815914, 852273, 847628, 797576, 781391, 786659, 803634, 838576, 841041, 760144, 740647]
17040G40647m5731o4581K938M0665L0479N2710L402j2065q33k1423J3456L2466
17028G72130L1553N2591k4240l5898q6143O669O1184M3572L5228k6148o4564n1104
17016G14830M4759M347N683L2106j0513r399L344l4138k8746K370K7578L4954
17004G87175q88m5527r463J3574P831q83M5404l3772j7978P520j7J1469K6399
16991G90844m9689k0728L8199J5090j1349j9206P014K8217j4240K1023K5761J0688
16979H21624L124m3849k8821m078O364m0625k6703m4509Q1631N0576n33m2188
16967G32013J5462K9985J0532m5996m2585j052k1170l5987l5966q358K5644J01207
16955G23729O0545n1185l3320L7860k3874o5010m204K0047J9524k3979M4307N6611
$$ y = [740647, 694916, 630335, 633273, 673938, 704417, 757127, 760529, 748464, 747631, 726208, 739664, 772130, 803683, 856274, 832034, 796136, 709993, 716662, 777846, 821418, 856646, 830498, 765934, 714830, 759589, 763936, 769619, 801725, 791212, 781813, 785157, 751019, 722273, 724643, 752221, 787175, 786287, 740760, 731297, 744871, 752702, 751819, 797223, 763451, 745473, 752993, 752976, 764445, 790844, 741155, 720427, 758626, 773716, 762367, 743161, 750175, 778392, 764152, 785175, 810936, 821624, 824748, 780899, 752078, 748000, 754364, 713739, 687036, 642527, 724158, 774734, 774201, 732013, 747475, 777460, 787992, 741996, 699411, 698359, 677189, 641202, 605236, 596878, 622522, 723729, 784274, 733089, 699769, 737629, 713755, 648745, 644541, 664588, 684112, 660133, 704440, 761051]
16943G61051j0154p1555q668K4441J5622k0793k108k6018j6293j9014n492J8183
16931F39202M0865R493K2631J6451J1651R056k708l8966n1232k3939K038N7304
16919F91846Q1673K2072l6479n455Q486L9260j7370p006j6512j15398J2186L8566
16907F95869K1611n4220m6704L0673J1225q737m5571J0969K6004K2110j2208J7841
16895F68862M410k8182L2539L6365k3112k459K1746K1290K8096J8872k7402p007
16883G44018m1411m2064j6031M9826M7321k3261j1413K6504k6755o6402M68k3199
16871F17601k0861r492k1351J19086N8608J2480r763l4261k9499j7093k6416k9708
16859F09331J9148Q012j9451N020K3900L3629K4439j7047l2463l7729J8213K8628
$$ y = [761051, 750897, 679342, 670674, 695115, 710737, 689944, 687836, 661818, 645525, 626511, 621019, 639202, 680067, 689560, 712191, 728642, 740293, 749349, 746641, 707675, 656443, 632504, 634542, 691846, 773519, 795591, 759112, 753657, 762143, 801403, 784033, 777027, 760515, 645117, 657303, 695869, 717480, 663260, 616556, 647229, 658454, 649717, 604146, 615115, 641119, 663229, 651021, 668862, 673272, 645090, 677629, 713994, 690882, 688423, 710169, 731459, 759555, 778427, 751025, 744018, 702607, 660543, 644512, 694338, 741659, 718398, 706985, 733489, 706734, 640332, 640800, 617601, 596740, 587248, 565897, 684983, 743591, 756071, 746308, 712047, 682548, 665455, 639039, 609331, 628479, 636491, 617040, 622060, 645960, 679589, 704028, 686981, 654518, 616789, 635002, 663630]
16847F63630K8398K3310M0022J4890o8212o368J4220l1038j7440m7930J6563M4050
16835F74095k0289l3519K0997N4575j9463L752j436m528N48O134J5499M2388l4031
16822G04722o854K9106P3789K5383o7989k9269j087l6550j3046L6074l8569j3244
16810F62466M2512p489m4290J471K4160k6945J9045k3695l804j0641J2002K9663
16798F74455K5037K4812j131m1411l320k4033k4414m872j8904n9290K6872O6812
16786F40613p502K1188L8244L4568J909o2553m3318m714J302j3833K7392M6348
16774F79644l8391J0516O7204R308m791m8199n0555p4290k434L3266M686l3716
16762E52248n2118J0486l3728k768N1393R871j669k3675M5431Q5581j1299q976
$$ y = [663630, 692028, 715338, 755360, 770250, 702038, 695670, 709890, 678852, 661412, 613482, 630045, 674095, 653806, 620287, 641284, 695859, 676396, 680148, 678712, 674184, 674732, 680866, 696365, 738753, 704722, 697868, 726974, 800763, 826146, 758157, 728888, 727801, 691251, 678205, 714279, 675710, 662466, 704978, 697489, 653199, 654670, 678830, 651885, 670930, 647235, 643431, 632790, 644792, 674455, 699492, 724304, 723173, 681762, 678442, 654409, 629995, 625123, 606219, 546929, 573801, 640613, 633111, 654299, 692543, 727111, 729020, 666467, 623149, 618435, 619737, 605904, 633296, 679644, 641253, 651769, 718973, 728281, 723490, 675291, 624736, 550446, 548012, 581278, 585964, 552248, 500130, 510616, 476888, 474120, 525513, 535384, 533715, 510040, 555471, 641052, 629753, 620777]
16750F20777j1560J3826J5437l3293j5654k0713M3065R9750k1712m1739l9291
16739F08893l8132K5716j3649M7392j5769k5259L492J95L761n6082J437M2700
16727E84695l1503P8354J9005n5010l9387O4365L6403k4735n8814p6109j7819
16716D79445M3369O7159l716J6151K9262l746m770L3636j7904m0653k6163l1339
16704E40731O486L8443J4932k0954J4892k518l7573M4266J1223O5119m2001k3127
16692F09919r517o3164M2121p964k577K0807J4104N810k5997n502K728J3742P7616
16679F72126j2881o1631L0156j8346m9141K629l5437k7053M4760O5751j744m3221
16667E65968n9184r234K8664j7966k4853M6208K3017m7966n1895m240K5556j07
$$ y = [620777, 609217, 623043, 638480, 605187, 589533, 568820, 611885, 711635, 689923, 648184, 608893, 570761, 596477, 582828, 630220, 614451, 589192, 592684, 592879, 596640, 540558, 541995, 584695, 553192, 631546, 650551, 595541, 556154, 620519, 656922, 632187, 573373, 497264, 479445, 522814, 589973, 586257, 602408, 631670, 627924, 623154, 656790, 638886, 598233, 572070, 540731, 547217, 585660, 600592, 579638, 594530, 592012, 554439, 598705, 609928, 675047, 633046, 609919, 600402, 537238, 579359, 571395, 568818, 589625, 603729, 609539, 583542, 578040, 580768, 594510, 672126, 659245, 597614, 627770, 609424, 560283, 562912, 527475, 500422, 545182, 610933, 609189, 565968, 506784, 497550, 526214, 508248, 483395, 529603, 552620, 504654, 452759, 448519, 474075, 473968]
16655D73968L8317N3523J3575J25J5073J618k8233j0101J9099J6989o780k0965
16643E66208N622J765K610m8833k8883p365L5777K9502N601l6537j8506k6456
16631D80505J0193j1562L4569J8438Q9919J8368p5029J8781O2931N231l7006J4726
16619F30064j6203m3775j9103N219K614K4116J9415J2802o0447j6778J7276P492
16607E62692P95L4002r012q9949j8319L0925k1290J3409L6394M8301m3221Q172
16595E52899L1188o5329k533K2420N3319j1712o4757m0274p0043R088L0063P874
16583D52203J7600J2121N012m85m1426m3621N0506P1883k7003m7695r729m054
16571D35312j3651J2675l8348Q900L9018j6766j744P4884M5458J1682j7256j7843
$$ y = [473968, 512285, 565808, 579383, 579508, 594581, 596199, 567966, 557865, 576964, 593953, 587173, 566208, 571830, 573595, 576205, 527372, 498489, 491124, 526901, 556403, 562004, 525467, 506961, 480505, 490698, 479136, 513705, 532143, 622062, 640430, 565401, 584182, 647113, 652344, 615338, 630064, 613861, 570086, 550983, 556202, 558816, 582932, 602347, 615149, 554702, 537924, 555200, 562692, 563487, 597489, 588477, 498528, 480209, 511134, 489844, 503253, 539647, 587948, 544727, 552899, 584087, 518758, 516225, 538645, 591964, 580252, 515495, 475221, 405178, 414266, 444329, 452203, 469803, 481924, 486936, 486451, 445025, 401404, 451910, 523793, 496790, 449095, 439366, 435312, 421661, 434336, 395988, 404888, 443906, 427140, 425396, 500280, 545738, 557420, 540164, 522321]
16559E22321l9382p8025p244O1417P8708L2018j9464q3795r506N1248k1166n4699
16547D32431k2092j0709J3506K1966K3080J8816K6829l1658k3191j6149k9589
16536D03240J2247J3975O8217O3177k8217o8299J7306l1667k7968K6348Q0619
16525E28978L2677K5723j6662m0157m1103l1936R895P6121j0169j01116p0573
16514C61678L8911M6878m369J8123J2980k6147P588j3624M0768L1923p713l6594
16502D70402j3255J1095K7278k0465j9474L7535j8801l2710j3626P719k513j8557
16490D14628K2866O1339J4868k6872o8471m2928P226O2200O1804L6699j985m5200
16478D96174j1506j528N16k0483p7255k5881Q014M5826K6014l9189R645Q2156
$$ y = [522321, 482939, 404914, 397670, 459087, 537795, 569813, 550349, 466554, 457048, 508296, 487130, 432431, 410339, 399630, 413136, 435102, 458182, 476998, 503827, 472169, 448978, 432829, 403240, 415487, 429462, 497679, 560856, 532639, 464340, 481646, 449979, 422011, 448359, 528978, 561655, 587378, 570716, 530559, 489456, 457520, 467415, 543536, 533367, 432251, 361678, 400589, 447467, 443098, 461221, 474201, 448054, 455642, 442018, 482786, 514709, 506996, 470402, 457147, 468242, 495520, 475055, 455581, 493116, 474315, 441605, 427979, 435698, 433185, 414628, 437494, 498833, 513701, 486829, 418358, 375430, 382656, 444856, 506660, 543359, 541374, 496174, 484668, 483140, 483656, 463173, 385918, 360037, 368051, 413877, 439891, 400702, 410347, 492503]
16466D92503J723l9036J4535o324m0010P585j1373j3248K5841P284m924M4130
16454D78686M057n3351J1620M6365J345l153M5754Q866l1064l2458j7578k0138
16442D38951R228N7477J5026r155k6212q259l3238J0727k0011Q789j3263L1469
16430D61529M6483l4221m4886p485J4009M4742J3591k4795J2058K2726K1070k4332
16418E00489N537k2444j1839j0722j2404k0913l827q859p275M6491K4339k986
16406D75587k3822J3759P3277N2326n5738k2803m5784l6632n5796l6539J6237
16395C54072J0177P5155R0934L6384k0644p4492q8495j7228J5243J1243M6662
16384D39011L1779k7452k3407Q639K2543k3278n489K5900j1677k1837J5070l1827
$$ y = [492503, 494226, 455190, 469725, 463401, 423391, 430976, 419603, 406355, 432196, 439480, 434556, 478686, 482743, 429392, 441012, 487377, 488722, 485569, 531323, 540189, 509125, 476667, 459089, 438951, 448179, 505656, 520682, 511527, 485315, 477056, 443818, 454545, 434534, 443323, 430060, 461529, 508012, 473791, 428905, 421420, 435429, 480171, 493762, 468967, 481025, 503751, 524821, 500489, 506026, 483582, 471743, 461021, 448617, 427704, 423877, 415018, 407743, 454234, 478573, 475587, 451765, 465524, 538801, 591127, 535389, 512586, 466802, 430170, 374374, 337835, 354072, 364249, 439404, 530338, 566722, 546078, 471586, 383091, 365863, 381106, 392349, 439011, 470790, 443338, 419931, 428570, 451113, 427835, 422346, 448246, 436569, 414732, 429802, 397975]
16372C97975j8702L6660P3k9537K0034R668K3736l973k0058m2700j9326N5874
16360D09724O6374k9477J1457k4956o7713O1225N3936l040K1457j8491k6046k7677
16348D26773l2360l439k4487L0335n1835m5024J5477K8078O3321m2617k1403o617
16336C36202k4349P259Q8341J1042j8933l3803J2470L1426N824J1803Q871o15
16324D35538j3492l4644l1543j5033N242J9951P0779J1742J1808J4917m8130q3412
16312C43723l5653l6442N4346J6011R304K0323j9613l506J7083O086k6866L8459
16300C83255K2458j4111k1791K1182O74j5100l5182k6854j9281Q17P0989j3006
16288C54050j558j0340M0711q403k3037l4179r24R405O6960K8228K444k778l3129
$$ y = [397975, 379273, 415933, 416006, 386469, 406503, 416171, 439907, 435934, 415876, 373176, 353850, 409724, 476098, 446621, 458078, 433122, 365409, 426634, 480570, 477530, 498987, 480496, 454450, 426773, 394413, 390974, 366487, 396822, 344987, 299963, 315440, 343518, 406839, 364222, 342819, 336202, 311853, 319112, 407453, 418495, 399562, 365759, 378229, 409655, 415479, 427282, 436153, 435538, 422046, 387402, 355859, 340826, 346068, 366019, 436798, 448540, 460348, 475265, 427135, 343723, 308070, 271628, 325974, 341985, 351289, 371612, 351999, 348493, 365576, 371662, 344796, 383255, 405713, 391602, 369811, 390993, 391667, 376567, 341385, 314531, 295250, 296067, 367056, 354050, 352492, 342152, 382863, 374460, 351423, 317244, 316320, 325725, 392685, 420913, 423357, 420579, 387450]
16275C87450J8960n1653k5129m514j024J9543N3670Q379K8693Q977n2228l3337
16263C57787L1939j917l7236j8924M494J1057j9644K7560l0172L4592l4323Q741
16251C33954M1736L6981j0415j7627K0338n355m1471k1219k1611J9580k8324K631
16239C09198M7286L1971J6132j2184O325K7513o0879o5593k1259L7310l6724j3964
16227B65132O3901J9646l5321J2226k4391M5690Q606L597j721j0190j895o8957
16215B76323J8350J0062k9858L6314K0607l7367M9901L1736j0873j2140R282J4214
16203C76551j5030K7141O8257K5487N3296o0080j17173j0213K5324L1019J4214
16192D18793j1373q2626l3769K8165M7828L277J229J3639O1489j4850l8088l2868
$$ y = [387450, 406410, 354757, 329628, 325114, 324090, 343633, 397303, 405682, 434375, 443352, 391124, 357787, 389726, 387809, 350573, 331649, 336143, 347200, 327556, 355116, 324944, 359536, 325213, 333954, 375690, 412671, 402256, 384629, 404967, 399612, 358141, 336922, 315311, 334891, 306567, 309198, 356484, 388455, 404587, 392403, 398728, 426241, 365362, 299769, 278510, 315820, 279096, 265132, 329033, 348679, 313358, 325584, 301193, 346883, 355489, 359086, 357365, 347175, 345280, 276323, 294673, 304735, 274877, 311191, 331798, 294431, 344332, 376068, 365195, 353055, 362337, 376551, 361521, 388662, 456919, 482406, 535702, 475622, 358449, 348236, 373560, 404579, 418793, 407420, 324794, 291025, 319190, 367018, 370295, 371524, 385163, 446652, 431802, 393714, 360846]
16180C60846m2276p122P0148m7830P78K4549M3425L4428m1126J8284k919J9348
16168D30533L5738l1601l8423M185o6158n6274n415K179O208m806K3453P4522
16156C74141M855n6859m72N2818N4296p9650o1260j1258J4243R7752O368l5312
16144C59662n3703K032L4291k1980J2341N1118n1006n1470k7862l4022K8328O3365
16132C11094J833K2757L3990K0381q157K701q650J0685q470q69q547N7786J5002
16119D41536r434M2965J106k3646j7909p4893m2687j8634L7744N628m6824j6186
16107B78766O8162L6902K7447k467j153L555n7161q3548j2348K3266j53r704k0639
16094B50925L6737L2522J2402J101n406j832j2999j4903m9957l6787K6900O2846
$$ y = [360846, 318570, 311448, 381596, 333766, 334544, 359093, 402518, 436946, 395820, 414104, 411185, 430533, 466271, 434670, 396247, 400432, 334274, 278000, 272585, 274764, 280972, 276166, 299619, 374141, 378996, 322137, 321665, 374483, 428779, 349129, 287869, 276611, 290854, 388606, 394974, 359662, 305959, 307991, 342282, 320302, 332643, 383761, 332755, 281285, 253423, 219401, 247729, 311094, 312927, 335684, 369674, 390055, 381898, 384599, 375949, 386634, 378164, 377295, 368748, 426534, 441536, 432102, 475067, 476173, 452527, 434618, 359725, 317038, 298404, 336148, 341776, 294952, 278766, 346928, 383830, 411277, 408810, 407657, 411212, 354051, 270503, 258155, 281421, 281268, 271564, 250925, 287662, 320184, 332586, 333687, 328281, 326449, 313450, 298547, 248590, 211803, 238703, 301549]
16082C01549J9846M1581j75Q1770M9478l6027m8179M848l1692J6883L2374o6986
16070C65270l2959l0447k2214N210K3995J4452K9451k7258q248K162p949N2614
16058C64079P4301J3235m4616p1066m9455j199l299K7420M4659M2993r628k817
16046C84607n7655o743N8856o5868q8145k0325L8232N5459M5754n9810m6215j2303
16034B25844N5852k3777k3508K0025O7110L2152l6327m4375l5931K0109O01m2396
16022B15379j410O5487J7076J8416k2188q37P1908n583L95n853l3756j8690M5945
16009C46289K4449n335l8282n8860K4569L6269j4511K2467n0160L171L7328k6288
15997C01106j3626J8212k0561M1609J8538K530k8484l2402K6778M3437K1775L089
$$ y = [301549, 321395, 362976, 362801, 444571, 494049, 458022, 409843, 414691, 382999, 399882, 432256, 365270, 332311, 301864, 279650, 284860, 308855, 323307, 352758, 325500, 317252, 319414, 311465, 364079, 438380, 451615, 406999, 335933, 286478, 285279, 281980, 309400, 354059, 397052, 387424, 384607, 326952, 320209, 379065, 313197, 225052, 204727, 242959, 298418, 344172, 284362, 238147, 225844, 281696, 257919, 234411, 254436, 321546, 353698, 317371, 272996, 237065, 257174, 257775, 215379, 213969, 279456, 296532, 314948, 292760, 291923, 363831, 358248, 358643, 352790, 319034, 300344, 346289, 370738, 365403, 327121, 268261, 292830, 329099, 314588, 337055, 286895, 290066, 327394, 301106, 287480, 305692, 285131, 326740, 345278, 347808, 319324, 286922, 313700, 357137, 378912, 382001]
15985C82001O4336o9007k6562n7160n5256K4700K5592k7223l4971k157l613j1868
15973B08812j913O0702P8273j3730L3821l6774j548K4096p197K1869o9241k3718
15961B73452J0427j2391l5523j5845N084P843Q6509M3452Q304k7577O075O784
15949C56594p380k1430l7763m8113o1820r157O7067N9174o057l5639k8035J9484
15937B46925R7852m101R231K0266q517J401j5520Q23m4552n3123L3285M796M947
15924B93713J5079K0329J2085n013L833L9633o802q576m8123l559L5622L1245
15912C79466n7751n6986J3091k5243l6949K8225Q1737l7784m4005j9507P6731
15901C01025L4768k0629p198k9419n461j6248o112P4115l526k6842m6171k6842
$$ y = [382001, 446337, 377330, 350768, 293608, 238352, 263052, 288644, 261421, 226450, 224293, 220680, 208812, 206899, 267601, 345874, 332144, 365965, 329191, 327643, 351739, 344542, 366411, 297170, 273452, 283879, 271488, 235965, 220120, 225204, 233047, 319556, 363008, 371312, 343735, 349810, 356594, 349214, 327784, 290021, 241908, 180088, 170931, 237998, 297172, 291115, 255476, 227441, 246925, 344777, 340676, 349907, 370173, 361656, 363057, 347537, 348360, 303808, 250685, 283970, 288766, 293713, 308792, 329121, 341206, 336193, 340026, 379659, 372857, 364281, 316158, 312599, 348221, 379466, 321715, 264729, 277820, 252577, 215628, 243853, 325590, 287806, 243801, 224294, 301025, 335793, 315164, 307966, 278547, 273086, 256838, 250726, 324841, 321315, 294473, 248302, 221460]
15889B21460k3634K5923J4522j5261l0064N3785L0529N891J5534k4172q384m0229
15877B25900J4974k050l248M1980R619j2007k2884K117O6205K7878m2030q964
15865B97490J0555k9149m0437j0825M27q961l8391N7686K9578O543J9014L0715
15853C24245M0734n8424n3279q285L253P4724O3454M9998o5959p6968n7983M5751
15841B81261l591l7338l7612j4437k2937p962J5069L479O6584L3974L1716K4312
15829C32518m1025q431R089r003l4983r730J6127k4651r20j8484J0189L4614M457
15816B59767K1334J5522Q57j8974k4179n444K6667K0983P786j4452p3356m7959
15804A68552J8883J0361l605L5651P3352j1481m8217n9945n8557L0307R1513J3108
$$ y = [221460, 197826, 223749, 238271, 223010, 192946, 246731, 277260, 283151, 298685, 274513, 266129, 225900, 240874, 238824, 235576, 277556, 287175, 275168, 252284, 254401, 320606, 348484, 306454, 297490, 308045, 278896, 238459, 227634, 228061, 219100, 180709, 238395, 267973, 274516, 293530, 324245, 364979, 306555, 253276, 244991, 248244, 322968, 386422, 436420, 370461, 293493, 235510, 281261, 277670, 240332, 202720, 188283, 165346, 157384, 172453, 175932, 242516, 276490, 308206, 332518, 291493, 283062, 292151, 283148, 248165, 238435, 254562, 229911, 228991, 210507, 220696, 255310, 259767, 281101, 296623, 297480, 278506, 254327, 248883, 275550, 296533, 304319, 289867, 216511, 168552, 187435, 197796, 194191, 229842, 303194, 291713, 243496, 183551, 124994, 155301, 246814, 259922]
15792B59922k943J5431K9942J7790l1097m6681N003j6694j4037R570K347k0669
15780B07884Q94K4021L7323J1877l161M924K0650k2284n568k8694n3432L1810
15768B26244L170P340L4889j7333l8909k3262K0369R779J7183j513l3912J9220
15756B23265N6700P501K3259K5705j4043k3918j6927l310J3624J6116K7671K6206
15744C61849K123k4637m4724k7555l8709l1088O206q741j090P1873M4985k3553
15732B86939l7463M735k9245q4590j1043O1889J3129K4089N5700k3559m6044R762
15720B24299L8972P4903j8882m1609k5810m6928J212O3564L0187l6908m368o3786
15708A94846l0304M6401N1415J1738N753n3835k1889M2629J5906k1634K3048J9050
$$ y = [259922, 256979, 272410, 302352, 320142, 289045, 242364, 247367, 230673, 216636, 226206, 228553, 207884, 208778, 232799, 270122, 281999, 278838, 283762, 304412, 282128, 276560, 247866, 194434, 226244, 229414, 236754, 271643, 254310, 215401, 192139, 212508, 222287, 239470, 237957, 204045, 223265, 279965, 287466, 310725, 336430, 322387, 298469, 281542, 278232, 291856, 307972, 335643, 361849, 363972, 339335, 294611, 267056, 228347, 197259, 203465, 194724, 193634, 265507, 310492, 286939, 249476, 254211, 224966, 140376, 129333, 191222, 204351, 228440, 284140, 260581, 214537, 224299, 263271, 338174, 319292, 277683, 251873, 204945, 206157, 269721, 299908, 263000, 258632, 194846, 164542, 210943, 262358, 274096, 279849, 226014, 204125, 246754, 262660, 241026, 264074, 283124]
15696B83124J0509l0399q6508j8776l5210k1432l0843M8528M9286M2346J9597
15685B30222p639l1703m0627k1555O924M6893O9381J5235l164L812n5290n6542
15673A55947K5237j9629L070n346L4623L030K9725J3889o1829o324R8951O248
15661B77592J6683L6952k4450j4991K3190L1251L1404K2991o4820p5886M9149
15650C09065l0685l2861J8074L8697K1055j1846m0799M076n850k2624m6324J2917
15638B12895J7621M8055J7640l0416l4031l0980P246k9350j7258M730j2586K903
15626A56469K8205R3686J7200L8447l6375p8102j3454k0712j697k4014M482P9694
15614B43829O2290k6862j7718M8147J5259m2446m1372o177L1161m8689n3579K8695
$$ y = [283124, 293633, 263234, 176726, 157950, 122740, 101308, 70465, 118993, 168279, 210625, 230222, 222583, 190880, 150253, 128698, 135622, 182515, 251896, 267131, 263967, 267779, 212489, 155947, 181184, 161555, 164625, 159279, 193902, 196932, 226657, 240546, 178717, 172393, 271344, 277592, 294275, 331227, 306777, 291786, 314976, 346227, 377631, 400622, 335802, 259916, 309065, 278380, 245519, 263593, 302290, 323345, 311499, 270700, 274776, 268926, 246302, 199978, 212895, 230516, 278571, 296211, 265795, 231764, 200784, 208030, 178680, 161422, 166152, 153566, 156469, 184674, 278360, 295560, 334007, 297632, 219530, 206076, 185364, 183667, 159653, 164135, 243829, 306119, 279257, 261539, 309686, 324945, 282499, 241127, 234950, 266111, 217422, 163843, 192538]
15602A92538j3972O6462P735j7359J8033M6192j0796n5267k2550l2255N2646L1633
15590B63040J6648k9501o0444o1783j2080N5700m0062m1349N1946O1210K8888
15579B32213L7916k0146L0152r522r49K090J2084k5690j2470Q787R884j8291l1603
15566B14455L5908k4995j7180j7472K7266P3k4950o812m575K1098N579p917k4495
15553A75983O1941K2649m2138J4526O0065L2289l0356o3356p828j5554l7572J8763
15541A89412P409L2644k3423l3138j1384K4545J9918j9518k9630L510N457q600
15529A57202J2952k9298m9686N3049O3006L0710J6860m2066j2558j5727m4519
15518A39925m2940k3580K6946P0694J2522j5034m5283N4550N184p181j4843j2391
$$ y = [192538, 178566, 245028, 252763, 235404, 253437, 299629, 288833, 233566, 211016, 178761, 231407, 263040, 279688, 250187, 189743, 127960, 115880, 171580, 131518, 90169, 142115, 203325, 232213, 270129, 249983, 280135, 270613, 269664, 271754, 283838, 258148, 245678, 254465, 264349, 246058, 214455, 250363, 225368, 208188, 190716, 217982, 218055, 193105, 186293, 181718, 202816, 208395, 200478, 175983, 237924, 260573, 218435, 232961, 293026, 325315, 294959, 231603, 223775, 208221, 170649, 189412, 196821, 229465, 206042, 172904, 161520, 186065, 205983, 186465, 156835, 160345, 165802, 157202, 170154, 140856, 91170, 144219, 207225, 237935, 254795, 212729, 200171, 184444, 139925, 96985, 73405, 100351, 171045, 183567, 168533, 123250, 177800, 182984, 175803, 160960, 148569]
15506A48569j1619L878J0495L6966M2567M0531J9219j8641k9306L036m8153l7720
15494A59822N4459P6003k1540m8032L9516J0859K04J6218j3593q5502J0107R280
15482B07801M719O944K4169k2576K6009L746L6398O516j5441j6319m0916p7743
15470A43307J1807K5492n4878k2536L4718M3666J8410k459M662m0555O132M2251
15458B10017J0296M9918j3092k0346n409o216j0656m0664n7277n542N2462K9000
15446A92491j7908M7131K0686j3881J4836J070m004k3711l7275q175P6388L2911
15434B80559j6146r8887O3337Q373J2753O0174j7034p9963o702O2510K4543j6788
15422B76729j9324J35L0681k2209l9532l4143O7138K8930j927l5253m5464o8614
$$ y = [148569, 136950, 140828, 151323, 188289, 230856, 271387, 290606, 271965, 242659, 245695, 197542, 159822, 214281, 290284, 268744, 220712, 260228, 271087, 271291, 287509, 273916, 188414, 198521, 207801, 212520, 219464, 243633, 221057, 247066, 250812, 287210, 293726, 278285, 261966, 221050, 143307, 155114, 180606, 125728, 103192, 137910, 181576, 199986, 197527, 202189, 161634, 167766, 210017, 220313, 270231, 257139, 236793, 231384, 225168, 214512, 173848, 116571, 111029, 163491, 192491, 174583, 221714, 242400, 228519, 243355, 244425, 240421, 216710, 179435, 171260, 247648, 280559, 264413, 165526, 228863, 237236, 249989, 310163, 293129, 213166, 206464, 268974, 293517, 276729, 257405, 257540, 288221, 266012, 226480, 192337, 259475, 288405, 286478, 251225, 205761, 137147]
15410A37147L6444N0830p5518k8463J27041N2068o980j9547o7212k6295j4215
15399A65300k874K3731K2861J0231P717J279l5669m3978M7769M018J8119N9845
15387B78349N2114k9667r9198m2464K19K4574o027N1031K2194M0867O882n898
15375B92976Q033K4678p275p9931Q291l5637K5150N8758m7248j16897m1408N9979
15363A49469M7569K1756J0011R575j0199K6129J9493k2331o2740k5026k312L4724
15351A96118P423J6367j2893j3295K4212K1063k6485P998K6228L8868N504j866
15339B89242l2111J414j6722k8721n8015r718O8035K9821j0596k483j690p048
15327B21408Q472L4859N971l2583l2544k7137L1441M1559k7376K4253O3522L358
$$ y = [137147, 173591, 224421, 148903, 120440, 247481, 299549, 292569, 273022, 205810, 179515, 165300, 162426, 186157, 209018, 219249, 226966, 228245, 192576, 148598, 196367, 200385, 218504, 278349, 330463, 300796, 201598, 159134, 159353, 183927, 177900, 228931, 251125, 291992, 298874, 292976, 301009, 325687, 318412, 238481, 246772, 211135, 236285, 295043, 247795, 130898, 89490, 149469, 197038, 218794, 228805, 238380, 228181, 254310, 273803, 251472, 188732, 163706, 161394, 196118, 203541, 219908, 207015, 193720, 217932, 238995, 212510, 220508, 246736, 285604, 291108, 289242, 257131, 258545, 241823, 213102, 155087, 145369, 213404, 243225, 232629, 230146, 228456, 221408, 229880, 264739, 270710, 238127, 205583, 178446, 209887, 251446, 224070, 248323, 311845, 315203]
15315C15203k596j9687m0817o5858J4410Q682K0164L2643k7697k8120L3435J9711
15303B59473q30j0015o2453k8623j6760O9256L2392M515k3120k1007l8551k6365
15291A37912L3611J582K2215Q886n521m2324P3660j5040j0933j56k0966l3689
15279A49237K1961N301j3155o003K6531N3152l7230O7354L3109k4612k7818J0731
15267B58558K3954j4566l1906P1634L0798l1273o7133J6188M5712l2390k8336
15256B41240m1638k8213K0477K0694L0750p865j525m175N04k1267m4337j384R5717
15243B58978Q895J0425k1589q776K958m2926j2753L6729J7525L4858k8937o7257
15231A88130k0268K1550k539j332j3944N915j7720n3336J7307L3704M978k8646
$$ y = [315203, 312607, 292920, 252103, 186245, 200655, 209337, 229501, 262144, 234447, 206327, 239762, 259473, 258643, 248628, 186175, 157552, 140792, 210048, 242440, 246955, 223835, 202828, 164277, 137912, 171523, 173105, 195320, 204206, 198685, 156361, 230021, 214981, 204048, 203892, 182926, 149237, 171198, 176499, 163344, 157341, 183872, 237024, 199794, 267148, 300257, 275645, 247827, 258558, 282512, 267946, 236040, 307674, 338472, 307199, 240066, 256254, 301966, 269576, 241240, 199602, 171389, 191866, 212560, 243310, 235445, 233920, 229745, 230249, 208982, 164645, 163261, 258978, 267873, 278298, 256709, 247933, 250891, 207965, 195212, 231941, 249466, 284324, 255387, 188130, 167862, 189412, 186873, 185541, 171597, 177512, 159792, 106456, 123763, 157467, 162445, 133799]
15219A33799M8855N6825j3277J7516L3065l0475m2982L4294J9310R453j6985l6053
15207B13345K3676N18k650J1771L868J9166k9333l2827N764J5241J3568J6443
15195B58550J1444j4898k859j9162L1700M4095p5825m6450j019J8875O3777n3804
15183B14424k0025k2086K8887K2214L8819J8352k2708r907N1984N432j5357n5012
15171B35017l6099P417m9068K9650O1763N2386J2922M3356O5117q137j10584l2237
15159B71503p586K9150K6370k9352p594k545K0831Q3505m0817l1901J6317m4800
15147B83081o9361J055l5789K1907J2648q1875j7224L1686Q1021M6947Q337j4463
15135B67970m9470R654J3781L0746P1928K555k7468L3750M5310m7656j8773j9067
$$ y = [133799, 182654, 239479, 226202, 243718, 276783, 246308, 203326, 237620, 256930, 266383, 249398, 213345, 237021, 237539, 234889, 246660, 250528, 269694, 240361, 207534, 213298, 228539, 242107, 258550, 269994, 255096, 252237, 233075, 264775, 308870, 233045, 186595, 185576, 204451, 268228, 214424, 194399, 172313, 201200, 223414, 262233, 280585, 257877, 247970, 299954, 305386, 290029, 235017, 198918, 206335, 157267, 186917, 248680, 301066, 313988, 357344, 422461, 414324, 303740, 271503, 263917, 293067, 319437, 290085, 282491, 279946, 300777, 384282, 343465, 311564, 327881, 283081, 213720, 214775, 178986, 200893, 213541, 131666, 114442, 146128, 227149, 274096, 282433, 267970, 218500, 228154, 241935, 272681, 344609, 347164, 319696, 353446, 398756, 351100, 332327, 313260]
15123C13260k6147M3923L4639J06j6417l9848q159K5678k4510K8631K8319j3248
15111C46227l5568K1163L4445K3068l555Q419K6917l7706k9165k5273L2583K2965
15099C84520l828n028j8810p29J0252J5932L3733q100l4404L6162n3794j1569
15087C44337l448r34N3150K8102M5548j0151n1727n9732J522K9579k8384j5293
15075C32569O313R769J2069J8441r610N8156K6356n6493r894j3296K4071l466
15063C94985J3324j1716j8287r4311l1462O0124L0658J8049N892k7249L475J2391
15051C55873k4919j8519n2753L1570K4564K7024N2238J3680l887K0895L497N5830
15039D85093P4589k3115l679k1959l2027L748J9670k4024j5445MK3461q444o2414
$$ y = [313260, 287113, 331036, 365675, 365781, 349364, 309516, 301357, 327035, 302525, 331156, 359475, 346227, 310659, 331822, 366267, 389335, 385780, 394199, 421116, 383410, 354245, 328972, 361555, 384520, 380692, 375664, 356854, 356125, 366377, 382309, 416042, 407942, 373538, 409700, 355906, 344337, 340889, 339955, 393105, 421207, 466755, 456604, 404877, 345145, 346667, 376246, 347862, 332569, 338882, 348651, 360720, 379161, 369551, 427707, 454063, 397570, 387676, 374380, 398451, 394985, 408309, 396593, 378306, 283995, 252533, 312657, 343315, 361364, 367256, 340007, 343482, 355873, 330954, 312435, 259682, 291252, 315816, 342840, 395078, 408758, 404871, 425766, 429263, 485093, 559682, 536567, 532888, 510929, 478902, 482650, 502320, 478296, 462851, 462855, 486316, 477872, 415458]
15026D15458m5323M7421J8613q453M2263J3781m5422M7475M3055K7978P467k4310
15014E40003L9501L1608O263l2038n8255j2150R454j977K9830J6243m788N9130
15002F22824k7928k6973j2898K0356M3460j0337M3525K1606j9982J8117J4377
14991F86147l4667R04L9122O6776N0888K127J0435j7053J9831M8744M3772m056
14979I12970j3563M0285L7162K7584L4551L0195M8908K7517O652L2379J7284j540
14967A200384k5027K7471l2196l7776l9872P947J7838O0514m4787L1500L7625
14956A203621k6834J1671k0750j8607R2440Q0931k3827m4954L871Q794l2738L1281
14944A264899L1707J2402L9250m0033m8348L7982K5263m9348j7521J3051j5329
$$ y = [415458, 370135, 417556, 436169, 427716, 469979, 483760, 438338, 485813, 528868, 556846, 564313, 540003, 579504, 611112, 617375, 585337, 527082, 514932, 524386, 522409, 552239, 568482, 563694, 622824, 594896, 567923, 555025, 575381, 618841, 608504, 652029, 673635, 653653, 671770, 686147, 651480, 652384, 691506, 758282, 809170, 811297, 821732, 804679, 824510, 873254, 917026, 912970, 899407, 939692, 976854, 1004438, 1038989, 1069184, 1118092, 1145609, 1152261, 1184640, 1201924, 1200384, 1175357, 1202828, 1170632, 1132856, 1092984, 1100931, 1118769, 1179283, 1134496, 1165996, 1203621, 1176787, 1188458, 1167708, 1149101, 1241541, 1322472, 1298645, 1253691, 1257562, 1266356, 1233618, 1264899, 1296606, 1309008, 1348258, 1308225, 1259877, 1297859, 1323122, 1273774, 1256253, 1269304, 1253975]
14933A253975P7O9841l0021n2890l5152M7859M8691k742k7558n7299K2807J9709
14921A257297j056q790k0162J4968l3025k0932m5121N224K3064n0577j5161m4731
14909A060998j6242O9379K0797k0225r371K2340R129m4794P6709l514l6105j6681
14897A112420l6284j6170P1532M0102M4609j6033k6640L6250l3535o0584L2437
14886A148104J1789J541k2450K8594J2346M2931M0453j5960N243r288K8455N5434
14874A327192L0613L1825L1349M7114K524J2724o933J5380k6577l7322m756k4751
14862A398382O6310R6265O6099P404k8436j425K5219M9270j3490m5075K2506O4288
14850A707317P3752P9194J629q358K4473J6422N496K878k2870K3108K9311k9506
$$ y = [1253975, 1254052, 1323893, 1293872, 1240982, 1205830, 1253689, 1302380, 1299638, 1272080, 1214781, 1237588, 1257297, 1256241, 1247451, 1227289, 1242257, 1209232, 1188300, 1143179, 1148403, 1171467, 1120890, 1105729, 1060998, 1044756, 1114135, 1134932, 1114707, 1105336, 1127676, 1136805, 1092011, 1168720, 1165206, 1129101, 1112420, 1076136, 1059966, 1131498, 1171600, 1216209, 1200176, 1173536, 1209786, 1176251, 1115667, 1148104, 1159893, 1161434, 1138984, 1167578, 1179924, 1222855, 1263308, 1247348, 1252591, 1243303, 1271758, 1327192, 1357805, 1389630, 1420979, 1468093, 1470617, 1483341, 1476408, 1491788, 1465211, 1427889, 1423133, 1398382, 1464692, 1560957, 1627056, 1634460, 1606024, 1604599, 1629818, 1679088, 1665598, 1620523, 1643029, 1707317, 1781069, 1860263, 1861892, 1853534, 1878007, 1894429, 1899925, 1902803, 1879933, 1903041, 1932352, 1902846]
14838A902846n1950O7163J15110P8379J8365K2578K2376j3656L9254L5436K7896
14827B263797k3641j235N2320K0957J1224M6707R0087r002r827O0829M9064L6697
14815B587977J6533K3528k7783M4634Q1849N3582m509K2089K8657J8086J1161
14804B855804P9430M8940P7518J15440L219k8564N4607M1078R636N3618J35611
14793C446337P3965O7346J25177O4340Q7247L4222N0909R6914J02895R9973P7205
14782D326530N5002J14709J34188J27226R6003R4082J13023J46656Q1519Q2485
14772E371423J42717J40068J76916J60993J63074J72247J70665K24585K29566
14763F952254J82526J26292J57742K52871K30163K36630K72695K03841K47763
$$ y = [1902846, 1850896, 1918059, 2033169, 2111548, 2129913, 2152491, 2174867, 2161211, 2200465, 2235901, 2263797, 2240156, 2238921, 2291241, 2312198, 2323422, 2370129, 2460216, 2451214, 2441387, 2502216, 2551280, 2587977, 2604510, 2628038, 2600255, 2644889, 2726738, 2780320, 2775811, 2797900, 2826557, 2844643, 2855804, 2935234, 2984174, 3061692, 3177132, 3180351, 3151787, 3206394, 3247472, 3257108, 3310726, 3446337, 3520302, 3587648, 3712825, 3777165, 3864412, 3898634, 3949543, 4046457, 4149352, 4249325, 4326530, 4381532, 4496241, 4630429, 4757655, 4853658, 4947740, 5060763, 5207419, 5288938, 5371423, 5514140, 5654208, 5831124, 5992117, 6155191, 6327438, 6498103, 6722688, 6952254, 7134780, 7261072, 7418814, 7671685, 7901848, 8138478, 8411173, 8615014, 8862777]
14754H862777K82229L41303L13947L67270L79721L50775L29105L75089M38786
14745A2041002M40049M44425M71391M85754N98347N97668N54684O14892P01212
14736A6949424P21291Q13133Q14790Q55803R06413R48041J051618J094539J098386
14727B5253438J219382J266522J402512J538679J648951J736442J778787J947685
14719C7792398J998834K156643K282989K414850K588293K771701K820692K981115
14711E7807515L186936L202769L310579L407650L456021L441028L354656L228487
14703H4395641L133795K940750K521650K160257J745133J314296P61882J96806
14695I9170210l39158r03309j405694j829915k172798k532902k859339l076562
$$ y = [8862777, 9145006, 9486309, 9800256, 10167526, 10547247, 10898022, 11227127, 11602216, 12041002, 12481051, 12925476, 13396867, 13882621, 14480968, 15078636, 15633320, 16248212, 16949424, 17670715, 18483848, 19298638, 20154441, 21060854, 22008895, 23060513, 24155052, 25253438, 26472820, 27739342, 29141854, 30680533, 32329484, 34065926, 35844713, 37792398, 39791232, 41947875, 44230864, 46645714, 49234007, 52005708, 54826400, 57807515, 60994451, 64197220, 67507799, 70915449, 74371470, 77812498, 81167154, 84395641, 87529436, 90470186, 92991836, 95152093, 96897226, 98211522, 98973404, 99170210, 98831052, 97927743, 96522049, 94692134, 92519336, 89986434, 87127095, 84050533]
14687H4050533l126022l321764l348920l353666l369900l245325l099640l036317
14679E8148979k932289k733875k642930k519371k413534k296938k070264j961077
14671C8578701j883404j803943j613670j582096j547356j372726j278183j208732
14663B6288591j155426j078330j016573j003783q63980q59988q11776p34327o68613
14654A8095795p41137o97122o39580o06023n48673n15638m88568m63633m20041
14645A2975380m47550m17997m28645l94343l36120k52454k58111l36552l42775
14636I760833k73820k46897k06516k79858k40002k26206k34456j63617l25945
14627G563516k30081j30130r8475j88150j84277j61162j41978r1895j72921k11793
$$ y = [84050533, 80924511, 77602747, 74253827, 70900161, 67530261, 64284936, 61185296, 58148979, 55216690, 52482815, 49839885, 47320514, 44906980, 42610042, 40539778, 38578701, 36695297, 34891354, 33277684, 31695588, 30148232, 28775506, 27497323, 26288591, 25133165, 24054835, 23038262, 22034479, 21170499, 20310511, 19498735, 18764408, 18095795, 17354658, 16657536, 16017956, 15411933, 14863260, 14347622, 13859054, 13395421, 12975380, 12527830, 12109833, 11681188, 11286845, 10950725, 10698271, 10440160, 10103608, 9760833, 9487013, 9240116, 9033600, 8753742, 8513740, 8287534, 8053078, 7889461, 7563516, 7333435, 7203305, 7104830, 6916680, 6732403, 6571241, 6429263, 6337368, 6164447, 5952654]
14617E952654j62896r2563o0842j65102j15098j11143m4497o6671j17198j54129
14607D862515j21889n8522j23466j45227j41717j12144l6033n2526p2723m7447
14597C950821q8371j34363k6731l29K7937p0362j08749j15305p046j1927q2248
14586C333327n1398l5821J6770m658j10857o2729m8198j03589l6982o7920o5806
14575B762139k3640n955q443n6185k1760k5633n6127K5531q792K5821J3875j6872
14563B603959j35737r3463o1429o8734m4266q0259n035P416l2632o5177k712m549
14551B017382j9303r9016k9701o1640n2815K8907m0821n6561k9251O76J4943k6354
14539A646446p521L963m628o0651l855K0306j8910j2581N517n6479l0773J0243
$$ y = [5952654, 5789758, 5697195, 5636353, 5471251, 5356153, 5245010, 5200513, 5133842, 5016644, 4862515, 4740626, 4682104, 4558638, 4413411, 4271694, 4159550, 4123517, 4070991, 3998268, 3950821, 3862450, 3728087, 3701356, 3701027, 3728964, 3658602, 3549853, 3434548, 3427502, 3415575, 3333327, 3281929, 3246108, 3262878, 3258220, 3147363, 3084634, 3036436, 2932847, 2895865, 2827945, 2762139, 2738499, 2732544, 2724101, 2667916, 2646156, 2620523, 2564396, 2589927, 2581135, 2606956, 2620831, 2603959, 2468222, 2374759, 2313330, 2244596, 2200330, 2120071, 2115036, 2122452, 2089820, 2024643, 2021931, 2017382, 1998079, 1899063, 1869362, 1807722, 1754907, 1783814, 1742993, 1686432, 1657181, 1657857, 1672800, 1646446, 1638925, 1642888, 1638260, 1577609, 1573754, 1594060, 1575150, 1562569, 1568086, 1511607, 1480834, 1491077]
14527A491077N4781K05l9427J8316p4018o503N5395k488m0145q655o4888m3339
14515A340311K2919k6201p3204O903j1031l0660J1723K0658m6200j8640L4687
14504A231265j3071o1050k7201N3688J1267O026m9714m7269J0997j1871n0587
14493A052480N104K4142k4145O151k9347J5451J6424J8892r019q0414N489N2503
14481A053711j3477n6850k0391k5648k4363k0201j7827Q1635N4582J427p4728
14470I37870r7754k8879R4233J3214j3027K3099K8131K359n5820k0297n114m7822
14458H30193L971L0650q021k6608J6725P6420K6081m348j6176m6967m7559K566
14446H36927K8520O3192J198o9343l5511M3708k1956j8088j1363J8668l979l0013
$$ y = [1491077, 1545858, 1546063, 1506636, 1524952, 1450934, 1444431, 1499826, 1497338, 1457193, 1448538, 1383650, 1340311, 1363230, 1337029, 1263825, 1270728, 1259697, 1229037, 1240760, 1261418, 1215218, 1196578, 1231265, 1218194, 1157144, 1129943, 1183631, 1194898, 1200924, 1151210, 1103941, 1114938, 1103067, 1052480, 1057584, 1081726, 1057581, 1063732, 1034385, 1049836, 1066260, 1085152, 1076133, 995719, 1001208, 1053711, 1040234, 983384, 962993, 937345, 912982, 892781, 874954, 956589, 1011171, 1012598, 937870, 840116, 811237, 905470, 918684, 905657, 928756, 956887, 959246, 903426, 883129, 878015, 830193, 834164, 864814, 856793, 830185, 846910, 923330, 949411, 945063, 928887, 881920, 834361, 836927, 865447, 928639, 929837, 860494, 824983, 868691, 846735, 828647, 817284, 835952, 831973, 801960]
14434H01960m0516M22k9435n915N1949M0845o628L3056l7775o8236n7464l6305
14422F45958r051l6291M8806O0080k5952L8753K3387j5017l2514k0897K7506J804
14410G06572k7736K9915P954n531j0979k4452k9262l1031k2949j682K2102n4945
14398E57976q378M5986J6400l256p954n6633j0652j3476K3175q260n0598R44O3166
14385E48440K0810J84l2735m0075k0021p034J7190k844N0681O844j13933o5141
14373C62366N5883Q0752K2478o1395l5694k4876K1564M3771K3253L0002n0359
14362D67745j1736l1556j0099q509O5822J1895l9219k7297n299j2900M0790N757
14350D45394K745K8602n5360k7440N193M607n1150O024M9694j1997l6875L1047
$$ y = [801960, 761444, 761866, 732431, 726516, 778465, 819310, 812682, 845738, 807963, 739727, 682263, 645958, 636907, 600616, 649422, 709502, 683550, 722303, 745690, 730673, 698159, 677262, 704768, 706572, 678836, 708751, 716705, 711174, 700195, 675743, 646481, 615450, 592501, 590819, 612921, 557976, 549598, 595584, 611984, 608728, 600774, 544141, 533489, 520013, 543188, 534928, 484330, 485274, 548440, 569250, 569434, 536699, 496624, 476603, 469569, 486759, 483915, 534596, 541440, 427507, 362366, 418249, 499001, 521479, 460084, 424390, 399514, 421078, 464849, 488102, 518104, 467745, 456009, 424453, 414354, 405845, 471667, 483562, 444343, 417046, 411747, 398847, 439637, 445394, 448139, 476741, 421381, 393941, 399134, 403741, 352591, 358615, 408309, 396312, 359437, 390484]
14338C90484Q4454L4791j5428k0779n0248n6812K3763L0810o592l3326k6759j3500
14326C40858J1656J9017j353k5167O3984K7988l4331l4599j0407J3624K2188l8895
14314C54563j2088j31l3835k0263L056J1302M3957p981N1077N1348k3463k4868
14302C92674J1742j2499n8352K0304J3209l4814k464J950L3613M0003m7783j8619
14290C38964Q143J1761j9795n602M7851J0890l7539m0807l8697p106J9903M9323
14278C37289j1757q146j1726L3730j0567j0905K2856K2620k1057o0026K6697M8204
14266C57212j8954l1758k0671l5249N5625r519o4709J5952Q5543O1486M028J4821
14254D13807J4279q1199p1855J2034n410m7030p597M5268K6704L6433K2413k2094
$$ y = [390484, 474938, 509729, 494301, 473522, 423274, 366462, 390225, 421035, 414443, 381117, 354358, 340858, 352514, 371531, 370178, 345011, 408995, 436983, 402652, 368053, 357646, 371270, 393458, 354563, 342475, 342344, 308509, 288246, 291302, 302604, 346561, 338580, 389657, 441005, 417542, 392674, 404416, 391917, 333565, 353869, 367078, 332264, 329800, 331750, 365363, 405366, 357583, 338964, 347107, 358868, 339073, 333471, 381322, 392212, 354673, 313866, 275169, 268063, 287966, 337289, 325532, 317386, 305660, 339390, 328823, 317918, 340774, 363394, 342337, 282311, 309008, 357212, 338258, 306500, 285829, 250580, 306205, 296686, 231977, 247929, 333472, 394958, 398986, 413807, 428086, 346887, 275032, 287066, 281656, 234626, 227029, 272297, 299001, 335434, 357847, 335753]
14242C35753j5474n9787m1372k9527K3701k054M9811l4073j5283j4666n4525J7010
14230A59514Q3128J1951J2308r825L5000k3410k2495P489l5114m8898n735p830
14218A56083K8212P1799J4608P727k5229l0684k87k0597l1620K6623J064M4581
14206B42280K6667L876k3202l441L382k9208K5167j3718L9142K0726j0880K1177
14194C01968P253m2679q5046n0989N9048L8888J4423N3584j5353m7129r655j7290
14182B07023J1413K941J8678M2449m507l3250M0682J13732q475k3651o2463j9360
14170B85212J2056O452K0169j38j1704m3894p620o993m0364j4138j3496j6890
14158A68652M0485L7792N7144l441m5462o9058j6831J4549O2381N0667k211m8865
$$ y = [335753, 320279, 260492, 219120, 189593, 213294, 211240, 261051, 226978, 211695, 197029, 142504, 159514, 242642, 254593, 266901, 257076, 292076, 268666, 246171, 253660, 218546, 169648, 163913, 156083, 184295, 256094, 270702, 278429, 253200, 222516, 222229, 201632, 170012, 196635, 197699, 242280, 268947, 272823, 249621, 246180, 249562, 220354, 245521, 231803, 270945, 291671, 280791, 301968, 309221, 266542, 181496, 130507, 189555, 228443, 242866, 296450, 281097, 233968, 224313, 207023, 218436, 221377, 240055, 282504, 277997, 244747, 285429, 399161, 390686, 367035, 304572, 285212, 297268, 303720, 323889, 323751, 312047, 268153, 260533, 253540, 213176, 199038, 185542, 168652, 209137, 246929, 304073, 300632, 255170, 186112, 169281, 183830, 246211, 296878, 294667, 245802]
14146B45802L8281J4897n1100n3541J0587N4853J1777k6412J6731M9551l4331
14135B77095m3515o027M6067k1105k9365k8519k689m2384l7656k2936Q3689N6824
14123B29479m9580K1664O1850j3631J1110P834J0571L0993K9737l1326p9882r7848
14111A30971L2988M1101J8975K7205n234l1054l6612L7884P057M148J2846l1594
14099B08681q549K262L5503K9713j0121k8839m9580n8251L1009M0022M3248K189
14087B37287k5329K180J1917J6488k437m0862K5226J2575l9890j4582j1156j1134
14075A60283j5377M637k214k0520M0347j8722M5772M2300K3927K869K3280j4271
14063B72311J1091m5985j2766l9848k417l246n847o957j8368L2936P553J7111
$$ y = [245802, 284083, 298980, 247880, 194339, 204926, 259779, 271556, 245144, 261875, 311426, 277095, 233580, 227553, 273620, 252515, 223150, 194631, 191942, 149558, 111902, 88966, 172655, 229479, 179899, 201563, 263413, 249782, 260892, 268726, 279297, 310290, 340027, 308701, 228819, 130971, 163959, 205060, 224035, 251240, 246006, 214952, 178340, 216224, 223281, 227429, 240275, 208681, 200132, 202394, 237897, 267610, 257489, 228650, 179070, 120819, 151828, 191850, 235098, 237287, 211958, 214138, 226055, 242543, 240106, 199244, 224470, 237045, 197155, 182573, 171417, 160283, 144906, 149543, 147329, 126809, 167156, 148434, 194206, 236506, 260433, 263302, 286582, 272311, 283402, 237417, 224651, 184803, 182386, 179140, 173293, 166336, 147968, 180904, 188457, 205568]
14051B05568K8437N1901K493p1992L0835j9808K3759L0258q484m4862l2328O580
14039B02357k623o4160M6220k9305o7582j957m6350j1468M5466L4209j5968O441
14027I5280Q2410j8048k0364M1770j4876j0030J6509Q780k7318m6347K1898j7354
14015A12310j5329M8458K8584L5901r820k5132n0068k0829l1827P2149K7776k3881
14003A48292k7381k6996N3530O6107J8430k7475R34N489m9951j7399K059J4381
13991A60020P438O648n2214L6983L6031m3680k3090L1077N470k8772k5958Q82
13979A10835J7526J9344K6908l1409m4393O235l650L7329M8113l946l5621n3257
13967I4014l7037P123n724K6335L6293O39j4946l9523L383l7185k5728J4872N8413
$$ y = [205568, 234005, 285906, 288399, 216407, 247242, 227434, 251193, 281451, 272967, 228105, 195777, 202357, 199734, 135574, 181794, 152489, 84907, 82950, 36600, 25132, 70598, 104807, 88839, 95280, 177690, 159642, 139278, 181048, 166172, 156142, 172651, 181431, 154113, 107766, 129664, 112310, 96981, 145439, 174023, 209924, 200104, 174972, 124904, 104075, 72248, 144397, 172173, 148292, 120911, 93915, 147445, 213552, 231982, 204507, 205441, 210930, 160979, 143580, 145639, 160020, 167458, 174106, 121892, 158875, 194906, 151226, 128136, 159213, 164683, 135911, 109953, 110835, 128361, 147705, 174613, 143204, 98811, 105046, 101396, 138725, 186838, 182892, 147271, 94014, 56977, 64100, 58376, 84711, 121004, 121643, 106697, 67174, 70557, 33372, 7644, 22516, 80929]
13954H0929L1249k002k8730j0994l6456L4422N4609L8037J5293l1452o2604n8433
13942B3868K447M4506K9781N4820k9667k5943k04p41P6352J0215j4092R112l970
13929A76484l2785n237M6195K4189m6540O47n4108l2456k6562p152N1937l830
13917I0782j758q489L4128M818M2366P5160j8389j8391m9526j4530k486K4038
13905A57723K9933n0724o4608K4138M3422O1502O2055k3314l3856K0482K9146
13894B55899K7904j8360k9122j5514K7756j7955n6772n0721K7580N7521L1986
13883B40202o7989J3309N7236k6072m3601r815P76n5674p0899m6875N4421P1267
13871A16286l5394o605K7656R3539K1620p1050m9986K7754K9842K0929n473k5032
$$ y = [80929, 112178, 110176, 81446, 70452, 33996, 68418, 123027, 161064, 176357, 144905, 82301, 23868, 26315, 70821, 100602, 155422, 125755, 99812, 99608, 98867, 175219, 185434, 171342, 180454, 176484, 143699, 138462, 184657, 208846, 162306, 162953, 108845, 76389, 49827, 42675, 94612, 90782, 89024, 80535, 114663, 119481, 161847, 237007, 218618, 200227, 150701, 136171, 133685, 157723, 187656, 136932, 72324, 96462, 139884, 201386, 263441, 240127, 206271, 226753, 255899, 283803, 265443, 236321, 220807, 248563, 230608, 173836, 123115, 150695, 208216, 240202, 172213, 185522, 242758, 216686, 173085, 163270, 164046, 108372, 37473, -9402, 45019, 116286, 80892, 74287, 101943, 195482, 217102, 146052, 96066, 123820, 153662, 174591, 169118, 144086]
13859A44086k6332m5857l4278K8991K7837m2957L476K5130m3636m7236j8762N7291
13847B7753M1542J128J4660K2644j113o036O547J4086N383j0768q216j3158k3424
13834G1028K1689r319O0168k654l1973K205l0757k0813k8502K0996K8986J337
13822H2391l577M024M6107N6230n9569m7740j4656K8473L4075M8750l8582l2384
13810A03542k6292N1629N7426L7054o2772j6338k9105N3135L0930k5325m3382
13799A30502j0271P909O7686R589k6346r337n2269m9857l0639q878Q228J4418
13787E0735M2981l3774Q865J880j0483m5585k303N0940l2961J1031j9208p063
13775A5055K0197O7646J5331p9145m9571L6981J6931k162P1392M5811l2456n7632
$$ y = [144086, 117754, 71897, 37619, 66610, 94447, 51490, 54966, 80096, 36460, -10776, -29538, 27753, 69295, 70423, 85083, 107727, 106614, 100578, 107125, 121211, 126594, 115826, 107610, 94452, 71028, 92717, 83398, 143566, 140912, 108939, 111144, 80387, 59574, 31072, 52068, 81054, 82391, 78814, 82838, 128945, 185175, 125606, 77866, 63210, 91683, 125758, 174508, 135926, 103542, 77250, 128879, 186305, 223359, 160587, 144249, 115144, 168279, 199209, 173884, 130502, 120231, 128140, 195826, 205415, 179069, 169732, 117463, 67606, 36967, 28089, 36317, 50735, 93716, 59942, 68807, 70687, 60204, 14619, 12316, 63256, 30295, 41326, 22118, 15055, 35252, 102898, 118229, 39084, -10487, 26494, 43425, 41263, 112655, 158466, 126010, 68378]
13763F8378l3469K006M3599j5837J964j9370M872K1808L2254L6755L3924k142
13751A74742n6622o7901q997K3226L5606l7677q6873J023K9548O2856J4360J3953
13739I7244o996k4247L4466M1281k7885l9750M3445n6114k6860N6094k7258N247
13727F8667P4917j125n5906l9249l0390R211j4517p259l047N0298l395l1527l9242
13714b2564L0148L8743k5081m90N4127K8085J8741o3062n6192k4278k7788J0891
13702c8720L5571Q5150J8953j597L6202j4060m6836k2115K9076q466k3352N3427
13690A03233M1168j9841n6118J8302J9103j6250j4676P687l248j2226k451M0061
13678A04744j1571o299j4074l0333O9986R0093m3981n6992k3014j0981l418L036
$$ y = [68378, 34909, 36915, 80514, 64677, 66641, 47271, 52143, 73951, 106205, 142960, 176884, 174742, 118120, 50219, 41222, 64448, 100054, 62377, -24496, -23473, 6075, 68931, 83291, 97244, 90248, 66001, 100467, 141748, 113863, 74113, 117558, 61444, 34584, 90678, 63420, 68667, 143584, 142459, 86553, 47304, 16914, 26125, 11608, 4349, 1302, 51600, 48205, 16678, -22564, 7584, 46327, 21246, 20756, 74883, 102968, 121709, 58647, 2455, -21823, -49611, -38720, -3149, 82001, 100954, 99357, 135559, 121499, 74663, 52548, 81624, 73158, 49806, 103233, 144401, 124560, 68442, 86744, 105847, 89597, 74921, 82608, 79360, 67134, 64683, 104744, 93173, 86874, 72800, 42467, 112453, 202546, 158565, 101573, 78559, 67578, 64160, 67196]
13666F7196K6132j4918K8848j6867q145p2236L591P5184M6722k6220L2034n770
13654A35551m6714j5377M3890J17354O5662k7563r4759m7494j6901l1310K6431
13643A08770k1816l1430m1852K1212k5547J8655M6044M2016j6393J1124K1608
13632A32391J6285J6121k0658l9284J9226k3229l3932M7745p528p5384p410N781
13620C0124J6102J2936J2631N1685l0185m2417k8572j2556J7235M0919o957k9494
13608C1451P557J3296j012M6818J9723O4106k686o2680l1216K1182J2164l8198
13596H0505k3042j1130k7800q35O3686k8656k8334j0416J4667J2872n98J1586
13584E2505K2087K5700O21K6470K8615O515R65q094p038j9008J1609N6891j2267
$$ y = [67196, 93328, 78410, 107258, 90391, 82246, 10010, 13601, 88785, 135507, 109287, 141321, 135551, 88837, 73460, 117350, 234704, 300366, 272803, 178044, 130550, 113649, 82339, 108770, 86954, 55524, 13672, 34884, 9337, 27992, 74036, 116052, 99659, 110783, 132391, 148676, 164797, 144139, 104855, 124081, 100852, 66920, 114665, 107137, 31753, 24343, 30124, 46226, 59162, 71793, 123478, 93293, 50876, 22304, 9748, 26983, 67902, 60945, 31451, 39008, 52304, 51292, 98110, 117833, 181939, 179253, 116573, 85357, 106539, 118703, 80505, 57463, 46333, 18533, 17698, 81384, 52728, 24394, 13978, 28645, 41517, 40919, 52505, 74592, 100292, 100913, 127383, 155998, 162513, 163478, 155384, 148346, 129338, 140947, 197838, 185571]
13571A85571l0357l0365m8273j6616M5140J8399R715M125J1372O509o364k1780
13559A27076l3575J6938m5603r253j3649l5254J6200J3801N9143J8205o9870n5656
13547a1497R721L614N4400L4809j343L3077j425k4890l9520M293k293j3513R001
13534E4434R044Q319K7353M8111K6127l0395n6828J25k0888m2525K7579O0465
13522A10921l6907o7098k361r09P5417J9720r6423m1971M9494O237j5443j7118
13510a6441l7351j5165Q1224L9831k0220o6650J3581N3043j5396p6852j5001M2942
13498c2455J2883L5895P5077K5102K6592K2221l1415k0172j1817j6364N3341P22
13486A39610M8355M6097k5031K688n937m1658l0228m0209n2110l3342R85N6945
$$ y = [185571, 155214, 124849, 76576, 59960, 105100, 123499, 133214, 137339, 148711, 155220, 148856, 127076, 93501, 110439, 64836, 55583, 41934, 6680, 22880, 36681, 95824, 114029, 44159, -11497, -1776, 1838, 56238, 91047, 89704, 122781, 121356, 96466, 56946, 61239, 58946, 45433, 54434, 63478, 71797, 99150, 147261, 173388, 142993, 86165, 86290, 65402, 22877, 50456, 110921, 74014, 6916, 4555, 3646, 79063, 98783, 2360, -39611, 9883, 16120, 677, -16441, -53792, -68957, 12267, 52098, 31878, -34772, -21191, 31852, 16456, -60396, -75397, -32455, -19572, 16323, 91400, 116502, 143094, 165315, 133900, 113728, 101911, 85547, 138888, 139610, 187965, 234062, 209031, 211719, 205782, 164124, 133896, 93687, 41577, 8235, 9220, 66165]
13474F6165j7256m6595P247K7429R5380k7976r0648N611O7477M1475J957J2178
13462A42444K7545l4630p8012n0968K9671O0007O5393o848l2520n8543m0696j698
13450B1145Q188m6137L3224K7180J3845k2743M462l5954k2275P0141R77k6071
13438B5982j3845L9722O0872N817m2781J6236L622m9229o3845o511L2073J2840
13426B0953J7672L2932p1880K4032J4525l6621j1543k3367J16770J9753Q558j0729
13414A01055k5471p7860Q221K2067J4460N4237n4467r0470j2050j1967L4755l3
13402c7523L7735p1M707O706n8261j034M2313M3810p168k8988p416K3216j2834
13389E192J5325J7866k6025j9978R296K6780Q150M0657K4547m5095k290P058j0632
$$ y = [66165, 48909, 2314, 9561, 36990, 132370, 104394, 13746, 19357, 86834, 128309, 130266, 142444, 169989, 135359, 57347, 6379, 36050, 96057, 161450, 154602, 122082, 63539, 22843, 21145, 29333, -16804, 16420, 43600, 57445, 34702, 39164, 3210, -19065, 51076, 52053, 25982, 12137, 51859, 112731, 118548, 75767, 92003, 95625, 46396, -17449, -23960, 8113, 20953, 38625, 71557, -323, 23709, 38234, 1613, -9930, -33297, 83473, 103226, 111784, 101055, 75584, -2276, 5945, 28012, 42472, 96709, 42242, -48228, -60278, -72245, -37490, -37523, 212, 141, 4848, 11554, -46707, -47741, -5428, 38382, 31214, 2226, -5190, 18026, 5192, 20517, 38383, 12358, -7620, 1676, 28456, 36606, 77263, 101810, 56715, 54425, 61483, 50851]
13376E0851m4734n2005K188J3617L8458N8219K2949J0080m1805k878k2116m9638
13364a6814j4536O4828K4332L4780J06752m6646n2455j0736L7236N3027k8015
13353A51753l2619k0842R517k5689m2709J2725l1000O250l3931j2660J6558J8298
13341A5651r024k9837K7987K7802J9328M3956O4834k6624j07762q906L3051R025
13329E9481K3000n603p0963Q603K4077j4323k708J369m0918O368k2308J2016L8703
13316A6794q129l6300N7586p693K8406Q3080l5631o9096k2733K5023J1324J3483
13304E6114J0899K467j8952J0682L1857r66j843K9812k8297l4189J1497J5701
13292H4782N5615K5644L5550L6902m3008o5907k9949K740K0883m269k9836J9113
$$ y = [50851, 6117, -45888, -43700, -30083, 8375, 66594, 89543, 99623, 57818, 54940, 32824, -16814, -31350, 33478, 57810, 92590, 199342, 152696, 100241, 89505, 126741, 179768, 151753, 119134, 98292, 107809, 82120, 39411, 52136, 21136, 27386, -6545, -19205, -2647, 15651, 6627, -23210, 4777, 32579, 51907, 95863, 160697, 134073, 26311, 17405, 50456, 59481, 82481, 76878, 5915, 14518, 38595, 24272, 21564, 22933, -17985, -11617, -33925, -21909, 16794, 8665, -27635, 29951, 22258, 50664, 133744, 98113, 29017, 6284, 31307, 42631, 56114, 67013, 69480, 50528, 61210, 93067, 92101, 90258, 120070, 91773, 57584, 69081, 84782, 140397, 166041, 201591, 238493, 195485, 129578, 99629, 102369, 123252, 118983, 89147, 108260]
13280A08260n5033r072j2290j7297p268j2420J7439n4462l654L6884N9086m371
13268D5802m0694m398j0351k6415K8784J13796Q2437m2339n7946k5260j3356K1362
13256G1422k4302m2855L3913L0916J1740j7071n0201l678O297L6425O6490Q2612
13244B01708L4122k4257o4974o298R1832M0560k4675j0258o736K6300j7018R244
13232B49550n0244k2788o2668n8506m0610k5668L9994M9608l9613k7846Q537m0430
13220b0684K0610K9310J582O154j0779J4167N0595k1510n0548L3089p521M42K130
13207D7037l08l5386J4608K5422j6200n342K3957M3668M5556j8232K1050K1322
13195A67152J4523n2442K554L8572j5899j5703o2261p2887K9917N7169J950n417
$$ y = [108260, 53227, 44155, 31865, 14568, 7300, -5120, 12319, -42143, -45797, -8913, 50173, 45802, 5108, 710, -9641, -36056, -7272, 106524, 188961, 146622, 88676, 63416, 50060, 71422, 47120, 4265, 38178, 69094, 80834, 63763, 13562, 9884, 16181, 52606, 119096, 201708, 235830, 211573, 146599, 140301, 232133, 272693, 248018, 237760, 231024, 257324, 240306, 249550, 199306, 176518, 113850, 55344, 14734, -10934, 29060, 78668, 39055, 11209, 19746, -20684, -74, 29236, 30818, 36972, 26193, 40360, 90955, 69445, 18897, 51986, 44465, 44907, 47037, 46729, 11343, 25951, 51373, 35173, 29831, 53788, 97456, 143012, 124780, 145830, 167152, 181675, 129233, 131787, 170359, 154460, 138757, 76496, 3609, 33526, 90695, 92645, 87228]
13183H7228j1754k7312j6331o4761J2154O0976j3756J1721p29j4470J1226P3561
13171A07753Q432l1019k0588J4476l413k0649l5781K573L590m0807j1215L4445
13159G797L1562m5116l5185K3208j0831K2919j1842P888M1945J7426k1294o059
13147B2418K9800O663l6317m0342p216M4052L0626K2530K0941l1233n5065R294
13135A6151N0640m1280l8930n8091J809N3922J4350Q561J0801j4932L7226M4007
13123H4234p499q1276n2583M628K6998L81j1211K9534O0835L3874r344j2190l8160
13110B8221q170L519P387j1165n1287K0409N3526j517k5270k1317L8911K7682
13098F0929j1426k3614K7370J6240j095r9494n5488Q4333L8635j74m1707l692
$$ y = [87228, 75474, 48162, 31831, -32930, -20776, 40200, 26444, 38165, 37436, 22966, 34192, 107753, 116185, 85166, 64578, 79054, 75641, 54992, 19211, 21784, 25374, -15433, -26648, 7797, 39359, -5757, -40942, -17734, -28565, -5646, -17488, -9600, 32345, 49771, 28477, 22418, 52218, 58881, 22564, -17778, -24994, 19058, 49684, 72214, 93155, 61922, 6857, 16151, 66791, 25511, -13419, -71510, -69701, -15779, -1429, 7132, 17933, 3001, 40227, 84234, 76735, -4541, -57124, -52496, -25498, -25117, -36328, -6794, 54041, 87915, 78571, 66381, 28221, 20051, 23570, 30957, 19792, -31495, -11086, 42440, 40923, 15653, -5664, 33247, 60929, 49503, 25889, 53259, 69499, 68404, -31090, -86578, -2245, 36390, 36216, -5491, -9183]
13086i183P725j7412J5648N6540N7087L3781n3434k8788O1920j0863j9750k8966
13074F4305k3625j8227J6937N331L033j172M2325Q3565j8612l6977j16308k1743
13062b1168K7192N4047J2616K8181n4088J7347p742k5432l6103o249q997K4781
13050D385J0592l3853P818j1331m0413K3430J2114o512j1110J4543M0609j9886
13038i614m340l3750k5464K638J6368J9737N0658M1069J6912J357q728J772j9768
13025D8847M595n7328m7253L2975j837n5577m559M4972R544J3388j1006K0351
13013b888k2809j1373K9060N0527j0296m4708M1448k1800p985R759m977K6153
13001C0111l5717o7953L0653J8530l999o127J4680j1699J1530n5786J7705N8321
$$ y = [-9183, -1458, -18870, -3222, 53318, 110405, 144186, 90752, 61964, 123884, 113021, 93271, 64305, 40680, 22453, 39390, 44721, 47754, 46582, 88907, 172472, 153860, 116883, 575, -21168, 6024, 60071, 72687, 100868, 46780, 64127, 56385, 30953, -5150, -11399, -20396, 4385, 14977, -18876, -11058, -22389, -62802, -39372, -27258, -33770, -44880, -30337, 10272, -9614, -13954, -47704, -73168, -70530, -54162, -34425, 16233, 57302, 74214, 75571, 66843, 68615, 48847, 53442, -3886, -51139, -18164, -20001, -75578, -80137, -35165, -25621, -12233, -23239, -2888, -25697, -37070, -8010, 42517, 32221, -12487, 28961, 7161, -824, 8935, 3958, 30111, -5606, -73559, -42906, -24376, -28375, -34502, -19822, -31521, -19991, -75777, -58072, 249]
12989B49L3226l9827o41K0316j4289j3881K7181J5278k4259M7596k7920j621M6021
12976F7429k0750k5520M4300M3029J860k0814n6639m1835J3685m0602m9164P813
12964g7208J7003l456j713J6545L0309r012M1032K9207J0129J6m6665q260K8474
12951B6401p9463n8210j1389p055M3377m479K5514K1495P654k330K4954P123N7425
12938E1017k5293J3650j554m5274n100L3925K8362j3131p5508m9867L7199L7779
12926a3795k5115L4933K9564l5035j1364L2415j827j3949q16M760m9442q59O7813
12913A7283M3267m9909l8494j633N0795q398J1042Q1592N7596o6248m1745r287
12901D5861J1690k2528n7364l9789N994K3648k2030J9271j8933J1606K3807L6565
$$ y = [249, 33475, -6352, -6993, 13323, -966, -14847, 12334, 27612, 3353, 50949, 23029, 21408, 67429, 46679, 21159, 65459, 108488, 110348, 89534, 32895, -8940, 4745, -35857, -85021, -77208, -60205, -63661, -65374, -48829, -18520, -27532, 13500, 42707, 52836, 52852, 6187, -2073, 26401, -53062, -111272, -122661, -129716, -86339, -90818, -65304, -43809, -36155, -38485, -13531, -6408, 51017, 25724, 39374, 37820, -7454, -12554, 21371, 49733, 36602, -38906, -88773, -51574, -13795, -38910, -3977, 25587, -9448, -20812, 11603, 9776, -4173, -4989, -229, -49671, -50530, 17283, 60550, 10641, -27853, -29486, 21309, 12911, 23953, 105545, 163141, 96893, 55148, 45861, 57551, 35023, -22341, -62130, -56136, -32488, -54518, -35247, -54180, -42574, -18767, 17798]
12889A7798j0745j1196l1700L9707J1360Q791l2099r77j6190k3915o303k016L1449
12876b6036J8961M2908L5221l5359l4911m753J2895j5775l4613M9215O2654l5559
12864C4848p6378j1266M2771K251N258J1646j9790o0631j635K5552K8109K010
12852a7255Q7754J7576j529l8037k0642M0101M2120J731k5572m8103L6813l3487
12840D1470j3349m7319j8163K2388M0395N241k0182L2259K1049j4267k5329k7526
12828c333K9451J1825O80p0818k334p805O0736L9899n3432L3709m0259r8174n4729
12815a54584K7853O6413O9093M0912j7538q3760m4869L7141L631l6196M87M7868
12803d3549j824K8312k4473L8552n2783n1172r821L1039L1539K9609j6175K2980
$$ y = [17798, 7053, -4143, -35843, 3864, 15224, 24015, -8084, -9061, -25251, -49166, -55469, -57485, -26036, -7075, 35833, 71054, 35695, 784, -3969, 8926, -6849, -41462, 7753, 70407, 34848, -41530, -52796, -10025, -7774, -2516, 9130, -10660, -71291, -72926, -47374, -19265, -17255, 70499, 88075, 86546, 48509, 27867, 67968, 110088, 111819, 86247, 38144, 74957, 41470, 28121, -19198, -37361, -14973, 25422, 30663, 10481, 42740, 63789, 49522, 24193, -3333, 26118, 37943, 38623, -32195, -34529, -42334, 18402, 58301, 4869, 38578, -1681, -99855, -154584, -126731, -60318, 8775, 49687, 32149, -51611, -96480, -59339, -55708, -91904, -91417, -43549, -45373, -17061, -41534, -2982, -55765, -106937, -116758, -85719, -54180, -24571, -40746, -17766]
12791a7766m9494K6408L9123n2786M1953P8178l1323n5216L1075M1634K5069J8121
12779I4976k8835p017k3604k5958J6733K884L7411q567p3889J4214K4421Q606
12767C1375j7047J6195j0334o574l5803J6265L913K3293n1524m9471M5351r233
12755d3594q000k8931k9591K5887l0493J2098R869M4831L6927O690p6315J1816
12743f8806N1119q669M0233o868n6647k1050M7239Q7233k9464o3457j242J3340
12731a7039m5240l1031N6188M3173p375K8809J237l6535m1495P186N7000M915
12719A9793p0553k6850K4419L1369j6679L3895J6578R129m9303K7594J6508j3247
12707B653l9672m8241K7538K3037K3429n047J2713N24k6095j3446o2727M7635
$$ y = [-17766, -67260, -40852, -1729, -54515, -12562, 65616, 34293, -20923, 10152, 51786, 76855, 94976, 66141, 59124, 35520, 9562, 26295, 29179, 66590, 58023, -15866, -1652, 22769, 31375, 14328, 30523, 20189, 13615, -22188, -5923, -2010, 21283, -30241, -79712, -34361, -43594, -51594, -80525, -110116, -84229, -114722, -102624, -92755, -47924, -10997, -4307, -80622, -68806, -17687, -26356, 13877, 7009, -49638, -70688, -23449, 63784, 34320, -29137, -30379, -17039, -62279, -93310, -37122, 6051, -1324, 27485, 28722, -7813, -49308, -42122, 14878, 19793, -50760, -77610, -53191, -21822, -38501, -4606, 11972, 21101, -28202, -608, 15900, 2653, -37019, -85260, -57722, -34685, -11256, -16303, -3590, -3066, -29161, -42607, -105334, -57699]
12695e7699L3963n6561K9055P2621J714l714k6872O7707J1411j01990n2333K3028
12683e9670J3428M3649L6089k475j0355q57k802k0856j8890j8464n1113K3193
12671f9123J9049q4054k2378J6431L1799J3366L4836K9055Q825j5203k3068K4926
12659c5539N7104m7496J926K3535M1369L3371n4974M485N0917J3076n3735n0739
12647a6700M1812N5508k5453J3219q902K9435m8743n2636J1123J4481m1356p6547
12635a04759k8710J6989M455l0396K8327K8471J6067j4686r531L3715k5262m569
12623h9889K8833Q291K9397l0085M181l0037k6338k5152j4416K2613K4573J3747
12611h4282O5052m784o89m0650l0150K4423J2209j9134J3974N3907k6523k0171
$$ y = [-57699, -23736, -80297, -51242, 21379, 23093, 19379, -7493, 60214, 71625, -30365, -82698, -59670, -46242, -2593, 33496, 31021, 20666, 19809, 17007, -3849, -22739, -41203, -92316, -69123, -50074, -134128, -156506, -140075, -108276, -94910, -60074, -31019, -22194, -37397, -60465, -35539, 21565, -25931, -24005, -470, 40899, 74270, 19296, 23781, 74698, 87774, 34039, -16700, 25112, 80620, 55167, 68386, 59484, 88919, 40176, -12460, -1337, 13144, -28212, -104759, -133469, -116480, -112025, -142421, -114094, -85623, -69556, -84242, -93773, -60058, -85320, -89889, -61056, -52765, -23368, -53453, -49272, -79309, -105647, -130799, -145215, -122602, -98029, -84282, -19230, -24014, -24703, -65353, -95503, -71080, -58871, -78005, -64031, -10124, -36647, -56818]
12599e6818L5848k0830N524m7194k2394k8947j3161K4987L6666N5667L8643K7017
12587C5008K7922k2226n0836m8709L0694k3680m8167l1943K0078L8919N6681o222
12575b2481o195N343J2623o8028o6850L709l1685K6922O7157N2972k5219K0670
12563c1062m1500j5815L1092L9842L5348K508n0057P344j0665L4576M7241o5222
12551a6370o2502M820N5294o4386l9750K44J7251j5785M9959J8778l7888j4825
12539a05160O514J1330N3068P521k7146l2090j9316K571L785M982K5469N2928
12527a5544M1717m7052p1575l4781k4526m4417j0185K1646N3393K4188j4575J6292
12515a05419K4521j1695J6470N9245O4485L095j04353o3203n9472o216O4349K3355
$$ y = [-56818, -20970, -41800, -36276, -83470, -105864, -134811, -147972, -122985, -86319, -30652, 7991, 35008, 62930, 40704, -10132, -58841, -28147, -51827, -99994, -131937, -111859, -72940, -16259, -22481, -28676, -23333, -10710, -78738, -145588, -141879, -173564, -146642, -79485, -26513, -51732, -31062, -72562, -88377, -57285, -17443, 17905, 20413, -29644, -22300, -32965, 1611, 48852, -16370, -78872, -74052, -18758, -83144, -122894, -122650, -105399, -121184, -71225, -52447, -90335, -105160, -98646, -87316, -34248, -26727, -53873, -85963, -105279, -102708, -98923, -93941, -68472, -15544, 26173, -20879, -92454, -127235, -151761, -196178, -206363, -184717, -131324, -107136, -121711, -105419, -80898, -92593, -76123, -16878, 47607, 50702, -53651, -116854, -176326, -182542, -118193, -94838]
12503i4838L770j4057J7884N6951k0637j5957k0057J2314k6196K5616K565L520
12491f9122M9383M8614p2003N0651J1194j4438q2070L4508N2607M8422O1922K1600
12479A41268j6330q1149j3716j8440n6769K429j2507M836l4017l6418O1731K7438
12467c1644l2190L3179N6560M3418l0425j0718o9602k9819l697k3954L0093p365
12455g6164L1779R588l3322m7239R124q211j7384m5363K5448N1634K1215l7914
12443a16809l2180J4480J0603n2163K6207P1257k3559n4205j7768J4263K9782
12432a30092K297m1938K614L2322J2751J4922R624M9780k1157j1857j2045K6881
12420f5898p958n950k2958k2425N0399P8862K0830m3421j1913M3431k2129q7979
$$ y = [-94838, -91068, -105125, -87241, -30290, -50927, -66884, -86941, -74627, -100823, -75207, -72642, -69122, -19739, 28875, -43128, 7523, 18717, 4279, -77791, -43283, 9324, 57746, 119668, 141268, 124938, 43789, 30073, 11633, -45136, -42707, -55214, -50378, -84395, -120813, -59082, -31644, -63834, -30655, 25905, 69323, 38898, 28180, -41422, -71241, -74938, -98892, -68799, -76164, -44385, -34797, -68119, -115358, -106234, -114445, -131829, -177192, -151744, -100110, -78895, -116809, -148989, -134509, -123906, -176069, -149862, -78605, -102164, -156369, -174137, -159874, -130092, -127795, -169733, -167119, -134797, -122046, -107124, -97500, -47720, -68877, -80734, -92779, -65898, -73856, -79806, -102764, -125189, -74790, 4072, 24902, -18519, -30432, 12999, -9130, -97109]
12408i7109L6552N9109L8039O571N563L3800L8025k1822r5692l3834M447m6884
12396g3235l808J905J0967J5870J9977j8763n629Q735l7461n3744J6999K4810
12384i3377k5205R722N0686N6831L0576K7179n7998n3866m8766l344K4809J0888
12372g1865L1152j0497J5305l4999k2515N7266K4145l152j6505l1250l5817m0152
12360a38884o432P7615K4729j783j440k7370K1643p754o5797j4412o083l5772
12348a81740k5650K9730Q1335N8002J4884O543K9359K0319m9852n6704j5184J069
12336h7889j5226l232P1469N3602l9771m9801j1009O064N2355J9741N18j746J519
12323c406k973m9614k5374p1910m2786P5663K1331l5380k5205K3601N7411N5294
$$ y = [-97109, -60557, -1448, 36591, 43162, 48725, 82525, 120550, 98728, 3036, -30798, -26351, -73235, -77043, -75138, -64171, -48301, -28324, -47087, -52716, -43981, -81442, -135186, -118187, -93377, -118582, -108860, -58174, -1343, 29233, 56412, -1586, -55452, -104218, -107562, -82753, -71865, -40713, -51210, -35905, -70904, -93419, -36153, -12008, -15160, -31665, -62915, -98732, -138884, -145316, -67701, -42972, -44755, -46195, -73565, -51922, -59676, -125473, -139885, -145968, -181740, -207390, -177660, -96325, -38323, -23439, -16896, 12463, 32782, -17070, -73774, -88958, -87889, -103115, -106347, -34878, 18724, -21047, -70848, -81857, -75793, -23438, -3697, -3179, -4925, -3406, -6379, -55993, -81367, -153277, -196063, -120400, -99069, -134449, -159654, -136053, -78642, -23348]
12311b3348l1528l3957l6927K7332K0427N6774k8192k1160k0166J2099m478r415
12299i2539j9582j3221L0341J7987m4820k9591O0602K4152k1522p2059k2501K7805
12287a54948L1668r184j7613J8093j8154L3484L9861k7580O859N282k095j512
12275i5839k0050L2672j5760K3047K5495m5598j985j681k5327m6339J04058K3469
12263d3838l0100l261J3565Q200q25l497k4828L705L3183o35K2605L5348k0192
12250a0570L0324L2789K3148l5696j3736l9842l9150L0128k3602J1311k619k076
12238c9591m573k8466P081N961j4259K8469J0659k5133M337L7672l818m9089l6956
12225a07706l787L1027N7856J5862J2528l178j2105l3417l8073J8970O9610J5079
$$ y = [-23348, -54876, -88833, -125760, -98428, -78001, -21227, -49419, -70579, -90745, -78646, -83124, -92539, -112121, -125342, -95001, -77014, -121834, -151425, -90823, -66671, -88193, -160252, -182753, -154948, -123280, -132464, -150077, -131984, -150138, -116654, -76793, -104373, -97514, -92232, -94327, -95839, -115889, -83217, -98977, -75930, -50435, -96033, -98018, -99699, -125026, -171365, -67307, -43838, -73938, -77199, -63634, -55434, -56259, -59756, -84584, -80879, -47696, -48331, -25726, 9622, -10570, 19754, 52543, 75691, 39995, 26259, -13583, -52733, -22605, -46207, -34896, -37515, -39591, -44164, -72630, -65549, -59588, -73847, -45378, -34719, -59852, -55515, -17843, -21661, -70750, -107706, -111493, -80466, -22610, -6748, 5780, 2602, -9503, -42920, -80993, -62023, 7587, 22666]
12213B2666k6062L9996j7660n7312j1392N4115k6179L5299L7259k20n2267o4246
12201f6003J2629K445n1617M3114Q5992P4771K8697m6048k2765m1403q6243j7018
12189h3449L9836k6481J478j6188L0959P7039J3755J1459P364n0157k6664m8269
12177f9318Q61m992J9996J1236k0192M3136n36j9741j500m5186k7052K5985L8891
12164d8412N2990L2992O1915N0857K5221k1308k39m1394J8005M0892J5989n4741
12152A32767j9265j3210J0371K2382k7719l7363n6570l8738k2160m2497N4630
12141c7372O2936l6469n8529N4021L5605R590j6106n3824p4148K3218j7298j9198
12129a27574o3569K5964N6398O8440K0514l3138K2613J7749N0097L1901k8864
$$ y = [22666, -3396, 36600, 18940, -38372, -49764, 4351, -21828, 13471, 50730, 50510, -1757, -66003, -53374, -50929, -102546, -59432, 26560, 101331, 130028, 83980, 61215, 19812, -66431, -83449, -43613, -70094, -68616, -84804, -53845, 23194, 36949, 48408, 55772, 5615, -21049, -69318, -68457, -73449, -53453, -42217, -62409, -19273, -19809, -39550, -41050, -86236, -113288, -87303, -48412, 4578, 37570, 99485, 150342, 175563, 154255, 154016, 112622, 130627, 171519, 187508, 132767, 113502, 100292, 110663, 133045, 105326, 67963, 11393, -27345, -49505, -92002, -37372, 25564, -10905, -69434, -15413, 20192, 29782, 13676, -40148, -114296, -91078, -108376, -127574, -191143, -165179, -108781, -40341, -19827, -52965, -30352, -12603, 37494, 69395, 40531]
12118D0531J4064p3109j1896k648K6504k0624L6950O4873M3336l695k925K8628
12106A39989O3185M4286n6855N1626N9150L3582Q3566Q7939Q3681M0435J5515
12095F46099j19353o0128p0016n4677k4975k0970p774q2985n7380p2876M217K4608
12083A03790j9228k5264L0308L6530N1859O2842M4192j5356M0759K512k793L6151
12071C46302J0091j1929k9785L8262N9291n5943O584J6441j4852j07490n3738
12060B03234l5913M6080J03176l2118p176j1804k7285m0109r740M2038R2619P3746
12048C96748R036j0009k8014o0412j3835J8312K2605P8241j1477K3999K5614j5273
12036D35535P81L090k3621K6758L7608L9294l9707J7677l2106P0707J00712M278
$$ y = [40531, 54595, -18514, -30410, -33058, -6554, -27178, 9772, 74645, 117981, 114286, 111361, 139989, 203174, 247460, 190605, 242231, 301381, 334963, 418529, 506468, 590149, 630584, 646099, 526746, 466618, 396602, 341925, 316950, 295980, 288206, 205221, 147841, 74965, 79182, 103790, 84562, 59298, 89606, 126136, 177995, 240837, 285029, 269673, 310432, 312944, 310151, 346302, 356393, 344464, 314679, 352941, 412232, 356289, 362873, 379314, 364462, 256972, 203234, 167321, 213401, 316577, 284459, 277283, 265479, 238194, 198085, 188345, 230383, 323002, 396748, 405784, 395775, 367761, 307349, 293514, 311826, 334431, 412672, 401195, 425194, 450808, 435535, 436316, 439406, 415785, 442543, 480151, 519445, 479738, 497415, 465309, 536016, 636728, 641006]
12024F41006n6704r848k8712k1929o617L1066J04127O8728L1860J6163r57M9229
12012H17412L9123K546K1208k059N0497N3609M8579L1203K5407P6603P0166M4730
12000A279024J43725J27434M1693Q1755J00143L8118R1502P6881J42161O2663
11990B185099J04699J61165J22950J04836J52413J04198J44510J65896J64150
11981C409916J84400K25467K11685K66374K70125L37163L89794M03415M11122
11972F109461M44599M47921N55623O55989O97541P77417R35868J005894J196595
11963A2826908J299093J476307J710178K007796K506265K893175L344853L944310
11955C2008885M750864N767925P124099Q799913J0999064J3958236J7643695K2189960
$$ y = [641006, 584302, 574454, 545742, 523813, 517196, 548262, 652389, 721117, 752977, 769140, 768183, 817412, 856535, 859081, 880289, 878230, 928727, 982336, 1030915, 1062118, 1087525, 1164128, 1234294, 1279024, 1422749, 1550183, 1591876, 1673631, 1773774, 1811892, 1903394, 1980275, 2122436, 2185099, 2289798, 2450963, 2573913, 2678749, 2831162, 2935360, 3079870, 3245766, 3409916, 3594316, 3819783, 4031468, 4297842, 4567967, 4905130, 5294924, 5698339, 6109461, 6554060, 7001981, 7557604, 8213593, 8911134, 9688551, 10624419, 11630313, 12826908, 14126001, 15602308, 17312486, 19320282, 21826547, 24719722, 28064575, 32008885, 36759749, 42527674, 49651773, 58451686, 69450750, 83408986, 101052681, 123242641]
11947A23242641K7549184L3232878L7572265L7674474L0286760J5002695m229838
11940C00331059k1209151l1825727l5370506l3796756k9668955k4788906k0237275
11933A03433783j6313344j3182017j0754391q735351p130455n866455m917991
11926C6533779m074956l346068k865384k422022k091708j768508j590785j415628
11918A6958720j241529j092916r78775q51547p66414p11076o68277n91707n48465
11909I508014m69272m20522m26309l57757l21413l44558l74179l22124k21977
11900F249903k56103k95869k99715k20464k31645j82466j24457j01147j40713
11891D397324k08991j51879j15754j29017j65967j82501j26753q9183j16286j24015
$$ y = [123242641, 150791825, 184024703, 221596968, 259271442, 289558202, 304560897, 300331059, 279121908, 247296181, 211925675, 178128919, 148459964, 123671058, 103433783, 87120439, 73938422, 63184031, 54448680, 47318225, 41451770, 36533779, 32458823, 29112755, 26247371, 23825349, 21733641, 19965133, 18374348, 16958720, 15717191, 14624275, 13645500, 12793953, 12027539, 11316463, 10648186, 10056479, 9508014, 9038742, 8618220, 8191911, 7834154, 7512741, 7168183, 6794004, 6471880, 6249903, 5993800, 5697931, 5398216, 5177752, 4946107, 4763641, 4639184, 4538037, 4397324, 4188333, 4036454, 3920700, 3791683, 3625716, 3443215, 3316462, 3227279, 3110993, 2986978]
11881B986978o6283n0506l3399l3909q6446j18872o6471n0826O686m6112k2853
11870B417987j5467L560l6836q6324j06587p5841q0541r8920k7053N273k4162
11859A875089J8784m9477m1952m6644o1412p8662l569j0871L3699m1572o6755
11848A526658m6302L94K9258L5410m4608j12942l5873m4610o0170l0175P6795
11837A293835Q421j6675l3129L8720l2080n6653o2183O53L4728m7146L9959O5586
11825A234036k3105R378J9251m876j5724N260L2542j2792m7417J7821R763k5830
11813A198307J0068L6286j800o0524p3927J4591O265j04309o3083l8852J021m262
11801I19781l2565l7680l7763m9447j1583L087l3953q6337r8962q4298k5422j01689
$$ y = [2986978, 2920695, 2870189, 2836790, 2802881, 2716435, 2597563, 2531092, 2480266, 2486952, 2440840, 2417987, 2402520, 2406080, 2369244, 2282920, 2176333, 2100492, 2019951, 1921031, 1893978, 1899251, 1875089, 1893873, 1844396, 1802444, 1755800, 1694388, 1615726, 1612157, 1601286, 1634985, 1593413, 1526658, 1480356, 1480750, 1510008, 1545418, 1500810, 1387868, 1351995, 1307385, 1247215, 1217040, 1293835, 1302256, 1285581, 1252452, 1291172, 1259092, 1202439, 1140256, 1140909, 1175637, 1128491, 1168450, 1234036, 1210931, 1220309, 1239560, 1234684, 1218960, 1224220, 1256762, 1243970, 1196553, 1214374, 1224137, 1198307, 1208375, 1244661, 1242861, 1182337, 1108410, 1123001, 1129266, 1024957, 961874, 923022, 924043, 919781, 887216, 849536, 811773, 762326, 750743, 753830, 719877, 633540, 534578, 450280, 424858, 323169]
11789C23169q7369n1017o3935j7973K9304Q3792M7714L6506O2484K2159L1083
11778D15917L0257K0811k6421K0535P729j4009K4434K7636j936n931J7613j5579
11766E01056K1192K8400k321k3103L1152J03545N8138m5224l0909o1346Q478J9918
11754F08976k1780p8367k2227M7170K3883l9853n8822j2335J7992j3313j8969
11743D32355m0449l3917K6123M975J5057j3192M04j5914j534K2725Q228J2334
11731D17195m6339m4596Q63o161J1707J2861j8642K3783N6649k4029J40k1406
11719C62025J3305o027J7884l7432r816J4285N5772L2066J4072m7635j3308j3655
11707C81536p7025k7668J5380k1809O3365M7374j7821r06K8106l4304j812j6696
$$ y = [323169, 235800, 184783, 120848, 102875, 132179, 215971, 263685, 300191, 362675, 384834, 415917, 446174, 466985, 440564, 461099, 468828, 454819, 479253, 506889, 504953, 499022, 516635, 501056, 522248, 550648, 548327, 525224, 556376, 659921, 718059, 672835, 641926, 580580, 589058, 608976, 587196, 508829, 486602, 533772, 557655, 517802, 458980, 446645, 464637, 451324, 432355, 391906, 357989, 384112, 389087, 404144, 390952, 391356, 375442, 373908, 396633, 404861, 417195, 370856, 326260, 327123, 320962, 332669, 345530, 326888, 350671, 407320, 383291, 383431, 362025, 375330, 369303, 387187, 349755, 339939, 354224, 409996, 442062, 456134, 408499, 395191, 381536, 304511, 276843, 292223, 270414, 333779, 381153, 363332, 362426, 390532, 356228, 354416, 337720]
11695C37720K8066n292q68J1940k7671k2278j7883J5435J1153j8663P6667J8575
11683D06901m3609j2293J8415j9291m2680j6521k0211k8330l6062K5494O7569
11672B99382l1133O839l004j8188k3254j4490j8110K8915M928j6291J2320M5733
11660B73647o6378K8518O5120K7635j4013m267J2362j6782J0846P45k6412q3836
11648B07185J997k6549j9548k762K7488L3375m0448k1704Q2276O2933J1689o8237
11636B47695q3423k121N1414J9594M61o3533K3052L3834J0877K0823k6475L5818
11624B68016l45n4035k6488P1476R260k9944j5099j118p709J5238m8592L974k4080
11611A60554N310M17n3207l1625O670N3281J01418O7648j9444o2057m9327J7303
$$ y = [337720, 365786, 360494, 359626, 371566, 343895, 321617, 303734, 319169, 330322, 311659, 388326, 406901, 363292, 350999, 369414, 350123, 307443, 290922, 270711, 242381, 206319, 231813, 299382, 268249, 275088, 272084, 253896, 230642, 216152, 198042, 226957, 231885, 215594, 227914, 273647, 207269, 235787, 300907, 328542, 314529, 310262, 322624, 305842, 316688, 317433, 291021, 207185, 209182, 182633, 163085, 160323, 187811, 221186, 180738, 159034, 241310, 304243, 315932, 247695, 164272, 162151, 213565, 233159, 233620, 170087, 193139, 226973, 237850, 258673, 232198, 268016, 267671, 213636, 187148, 258624, 267884, 237940, 222841, 221723, 214014, 229252, 180660, 184634, 160554, 165864, 166281, 113074, 81449, 88119, 141400, 242818, 310466, 291022, 228965, 179638, 196941]
11599A96941K1706O26q116J2311J9314k4481l2160J5642m2589J9469O3890M3641
11587B86194l5924l2033Q921m061j7146j8628J0406K5213J783K5147n7271M8157
11575B40758L3231m3704j9934n70l0094J0351k3405m9476k1016j1640Q7011O3392
11563B34904P2928M9655m4103r8063m1575K5495j4673j801n4899l0918L1342O2802
11551A91094N5174j7358k8982m4480m860M0344K6925L5657L1736K1428Q77p6558
11539B30997l0987J3160o688J0010L2560O6808l9986K5650r783m8305q3150M2982
11527B03268j5763n1981k2640n8240K8178K0078K7368O1363l0610m2684L7545
11516A55882o5070l4409L0328Q090K4014K1646K8795R924P3257j5041q3346k5795
$$ y = [196941, 218647, 219273, 211157, 223468, 242782, 218301, 186141, 201783, 159194, 178663, 242553, 286194, 250270, 218237, 227158, 223097, 205951, 187323, 197729, 222942, 224725, 249872, 192601, 240758, 273989, 230285, 210351, 209781, 179687, 190038, 166633, 117157, 96141, 84501, 171512, 234904, 307832, 357487, 313384, 215321, 173746, 199241, 184568, 182767, 127868, 96950, 128292, 191094, 246268, 228910, 199928, 155448, 150588, 190932, 217857, 253514, 285250, 306678, 307555, 230997, 200010, 213170, 206482, 216492, 249052, 315860, 275874, 301524, 291741, 243436, 160286, 203268, 187505, 135524, 112884, 54644, 82822, 102900, 130268, 191631, 161021, 118337, 155882, 90812, 56403, 86731, 94821, 118835, 140481, 169276, 179200, 252457, 237416, 154070, 128275]
11504A28275p367m476k3178j4516K6339n3880l5567J8190Q4304l148m2114R148
11492H2010R385k1757K6370j9761K0075l4137j00799K2842N5727R848L7865O849
11480I4517l7507k1155k9726J6621M5348j5567L0242P417j3669N0035j6610k200
11468A07746j689j2083k3915L1870k5793m128K4998L5612J123l9907j9105L8422
11456A13151L5229m1857k5944M6882L5243K2669J7766N04l1420n5012L529L2642
11444A53382L1336l5488m1321p646q0k7523L370Q1M7797K8492N818p875k2526
11431A27817N6923J4037j3538Q39K7518r308o6841N5585m68j6758J5046q516j4689
11418A67647q722l233L12L6374K1691k9262n6367n8275p15L0369K8002K589l046
$$ y = [128275, 120908, 116432, 93254, 78738, 105077, 51197, 15630, 33820, 118124, 114976, 72862, 82010, 91395, 69638, 96008, 76247, 96322, 62185, -38614, -15772, 39955, 49803, 87668, 94517, 57010, 35855, 6129, 22750, 68098, 52531, 82773, 90190, 76521, 126556, 109946, 107746, 106057, 93974, 70059, 101929, 76136, 72008, 97006, 132618, 133741, 93834, 74729, 113151, 148380, 106523, 80579, 127461, 162704, 185373, 203139, 203643, 172223, 117211, 120740, 153382, 184718, 149230, 107909, 100263, 100183, 72660, 76030, 76111, 123908, 152400, 158218, 150343, 127817, 184740, 198777, 185239, 186078, 213596, 204288, 137447, 193032, 192564, 175806, 190852, 182336, 167647, 158925, 155692, 156004, 192378, 214069, 184807, 128440, 70165, 69450, 99819, 127821, 130410, 127364]
11405A27364j5287K6320N3870l4070q1488l2597J0614N6969M1214p0111k5086
11394E7712p710n0444L6968J6353j3634M8232M1141M9351l8542o4620k874N6527
11382A28460r137m4005k3432Q117M1049M3075j6567o2998l4848L3492M7829J4375
11370A25410K0564j2799n9463m7599M3929p359O3199J1359k3104k8721m0484L9900
11358H4832j6928j6975J1091l125J2714j7840K4393P167P662j8378o212k1251
11346D7150j1242k0697O0131N7724k9218Q429k6408p0188l7505j896M5636M1737
11334F3653l0346N86J0133K8539L3944R046m7690j9010o3652m9254k0660N6972
11322b7739O5231J0572k003l6712n677L3198M4734j3494K5507L8815M870l1825
$$ y = [127364, 112077, 138397, 192267, 158197, 76709, 44112, 54726, 111695, 152909, 82798, 57712, 50002, -442, 36526, 52879, 39245, 87477, 128618, 177969, 139427, 74807, 71933, 128460, 119323, 75318, 51886, 60003, 101052, 144127, 127560, 64562, 29714, 63206, 111035, 125410, 145974, 133175, 73712, 26113, 70042, 62683, 125882, 137241, 114137, 85416, 44932, 84832, 67904, 50929, 62020, 58895, 71609, 53769, 78162, 85329, 92991, 74613, 68401, 47150, 35908, 15211, 75342, 133066, 103848, 112277, 85869, 15681, -21824, -23720, 21916, 63653, 33307, 33893, 44026, 72565, 106509, 115555, 67865, 48855, -14797, -64051, -84711, -27739, 37492, 48064, 46061, 9349, 3672, 36870, 81604, 68110, 93617, 132432, 137302, 105477]
11310A05477p4013n2170M6731J8747l0484l7512Q877M2696K3276j0005k5867k924
11298A2829L3085l8327K1788k0295L6665j4683L1586J3646N7314n243p3139N6215
11286A11441N310o014k673l3791o8785N1212O1443K3509j2656o5502m4256k4063
11274d825Q7317L7022p3263p2989l0299N1628J7901M2602O1570k9042j5876k2129
11262D9617J575l375O405K162J1994M4186J9186l1256m6814L426M6847M3663j9557
11249A28059p8171j9657m7236n058P9189O8980j1808n4851n8111q360n6294N410
11237e7908k1885k306M0691K3161j3258k2540M2334J6594J0297j8083K075L2661
11225C1833l1674k8580J2707N0362J069k4775J4539K8480L0456J1661j5006k392
$$ y = [105477, 31464, -20706, 26025, 44772, 14288, -23224, -14347, 28349, 51625, 41620, 15753, 12829, 45914, 7587, 29375, 9080, 45745, 31062, 62648, 76294, 133608, 128365, 55226, 111441, 116751, 110737, 108064, 74273, 5488, 56700, 118143, 141652, 128996, 63494, 19238, -4825, 82492, 119514, 46251, -26738, -57037, -5409, 12492, 55094, 116664, 87622, 71746, 49617, 51192, 47817, 54222, 56384, 68378, 112564, 131750, 100494, 53680, 57106, 103953, 147616, 128059, 49888, 30231, -17005, -22063, 57126, 126106, 114298, 59447, 1336, -7024, -63318, -57908, -79793, -82099, -41408, -18247, -31505, -54045, -11711, 4883, 15180, -2903, -828, 31833, 159, -28421, -15714, 34648, 35717, 10942, 25481, 53961, 84417, 96078, 81072, 78680]
11213G8680l6757K1536M3954O225l0734j5166O0319n0623k3526K278M368M247
11201F4801k129R018L2893m9507L771k266j4668l6458N4761m1813j146j9024k4017
11188b5784q885k0902j6010J2941j7441R484J7507O9361K0701J4207l7784j4021
11176C374k0322l7016L471o317J2476M4740L0561M602K0874k6577M234L8046j7701
11163E4445l4357j314l0394L8299M7480L1599J0249l9837n7664k0760p053J4938
11151E631r584L5963j4240J880l797j1672q5889L0343J5605k8600k8282L5486
11139e7156L0656j1202J3827K1488J2648m6930k4488l3549j839N2350J1046M2256
11127I107K2628J4200K7942j3513J3357k4545k9056l812j6198M9508L4936J0917
$$ y = [78680, 41923, 63459, 107413, 113638, 82904, 67738, 128057, 77434, 53908, 56186, 60554, 64801, 62672, 71690, 104583, 55076, 58847, 56581, 41913, 5455, 60216, 18403, 17257, -1767, -25784, -34669, -55571, -71581, -58640, -76081, -66597, -49090, 20271, 40972, 55179, 17395, 3374, -16948, -53964, -50493, -56810, -44334, 406, 30967, 35569, 56443, 29866, 34100, 72146, 54445, 20088, 18774, -11620, 26679, 74159, 105758, 116007, 76170, 18506, -2254, -9307, 5631, -3953, 32010, 17770, 19650, 15853, 4181, -81708, -51365, -35760, -64360, -92642, -57156, -26500, -37702, -23875, -2387, 10261, -36669, -61157, -94706, -96545, -44195, -33149, 9107, 31735, 45935, 73877, 60364, 73721, 49176, 20120, 16308, 110, 49618, 84554, 95471]
11115I5471m0217m5755O022J3540j2487O283r033m375N2276M7804n688n1170k0595
11102C2076j2616l9641M159M0785J7428o1115M3913M4517m0911o8286l2384j6571
11090h8646R336M2676l554K5733J7077K0214M1822j8868m5633j3990k1600R844
11078b5589l7662l9723p730P6342O3372M3929k0866j7179m9316N4550n865o3853
11066b9590j5403J4656j8415k5456J90K6338J7205N1127J6094k380j018l5397
11054b049J1417L2663O1856N0356L2993K3417K2320K6281K6664J4864L2446N310
11042C38538M63l4023l9933Q433m0540j6050L7575j3043J0880O2922n007N8014
11030C68229J0565o3228n0527j7554N067J3732l5125j7143J16488P1029j6831
$$ y = [95471, 55254, 9499, 15521, 29061, 16574, 22857, 13824, 9449, 61725, 109529, 103841, 52671, 32076, 19460, -20181, -16022, 24763, 42191, -18924, 24989, 69506, 28595, -39691, -72075, -88646, -79310, -36634, -40188, -14455, 2622, 22836, 64658, 45790, 157, -13833, -35433, -25589, -63251, -102974, -110704, -34362, 29010, 72939, 52073, 34894, -14422, 40128, 34263, -29590, -44993, -30337, -48752, -74208, -74018, -47680, -30475, 20652, 36746, 34366, 33348, -2049, 9368, 42031, 103887, 154243, 187236, 210653, 232973, 259254, 285918, 300782, 333228, 338538, 339001, 304978, 265045, 273478, 232938, 216888, 254463, 241420, 252300, 315222, 310215, 368229, 378794, 315566, 265039, 247485, 252552, 266284, 231159, 214016, 330504, 401533, 384702]
11019C84702J1037M1798l0573o3633q2323r2463r186L2243N634P3734K4823l6764
11007B59029j807k2665n1017j2558m4292n6696L2224k1052j21020L399Q3936N2680
10995A00161j3877J0548k7523J4872O2404m8817o3422n3951j0573P02K9232L2380
10983C2136M5003L9653j0614j5420L2237m0677j7829m063p3793j7674N8258k2751
10971D466J7572M5176o596n4035J1008n224m4819n0577J0281K4606L9393O3559
10959E4810J5392p9592j5381N683n256K6353q890n5569K9328r888R988J5993p372
10946b4401m4396j5373J1607P2030O765p813L1501k0555m786J2576j3963j3674
10934a0482j1279j3686j8797p591O4514J0883m1067m3238k438L3928k2439k5230
$$ y = [384702, 395739, 437537, 406964, 343331, 261008, 168545, 159359, 191602, 197236, 270970, 295793, 259029, 257222, 234557, 183540, 170982, 126690, 69994, 102218, 81166, -39854, -36455, 47481, 100161, 86284, 96832, 69309, 84181, 146585, 97768, 34346, -19605, -30178, -29476, -244, 32136, 77139, 116792, 106178, 90758, 122995, 82318, 64489, 60426, -13367, -31041, 27217, 4466, 22038, 67214, 60618, 6583, 17591, 12367, -32452, -83029, -72748, -48142, -8749, 54810, 70202, -9390, -24771, -19088, -24344, 2009, -6881, -62450, -33122, -43010, -33022, -17029, -24401, -68797, -84170, -72563, -533, 6232, -1581, 29920, 9365, 4579, 17155, 3192, -10482, -21761, -35447, -54244, -61835, 2679, 13562, -27505, -70743, -73181, -39253, -61692, -86922]
10922h6922N8703P2829k2086j8616j8490j9776j0861L7254L3040k8902j0866R510
10910e183m9342M0963K7628q692q611l5789k6249q628j1257k3757M6793M5148
10898a6976J4700l9078J5940q561l2322K9140L2447k4399P414P595L5172k6880
10886e808l6506K968Q1725n752q3801j406L8446M5788k7165j5692m0155k4559
10874g1917J26j0677Q245j6523n6350L2266Q4959O5208m3370r1059k7682M8346
10862g8428J1614P5052M1233r9671k3364K620N0758N377L1416j4539j2633N9163
10850D8598J5725p458m9797P486L0248J7222K6798j4932n7515k3013J8285k0557
10838h910k9485m2181k0912J1495p198m9139J8067O3140L7499j017l0821k6557
$$ y = [-86922, -28219, 44610, 22524, 3908, -14582, -34358, -45219, -7965, 25075, -3827, -14693, -5183, -54525, -13562, 14066, 5374, -3237, -39026, -65275, -73903, -85160, -108917, -62124, -16976, -2276, -41354, -25414, -33975, -66297, -37157, -4710, -29109, -21695, -14100, 21072, -5808, -42314, -39346, 42379, 36627, -47174, -48580, -10134, 35654, 8489, -7203, -47358, -71917, -71791, -82468, -74223, -90746, -147096, -114830, -29871, 35337, -8033, -99092, -126774, -78428, -66814, 8238, 49471, -50200, -73564, -70944, -20186, -14809, 16607, 2068, -10565, 48598, 64323, 56865, 7068, 14554, 44802, 62024, 88822, 73890, 16375, -6638, 11647, -8910, -38395, -80576, -101488, -89993, -97191, -146330, -128263, -65123, -27624, -28641, -59462, -86019]
10826h6019j1312j0837N96k6574k564N9862k3382m1962j0400l297L2289M8038
10814g5562k559j1377L9332N3905L3486o0268l0709k2980k6617l946K666L330
10802a01299j5381M8712M8483K0688l66r644o4162l1422m1030K019o5155k1139
10790b29696O0451J07924K9985k8564l6659n81K0022p822j9254o3599m326N6397
10778a15722N1322O627k899n0575l1490K1542N795L8741l610j0199k0808l280
10766a14556j1248M6050n07o9924o015J7800N62K3203Q3303L9314j857m330k9581
10753b7786n731N297K0452L5632k2538j5770O3614M7096K62K4868k9852n0337
10741D5207j8081L7602N3703k4697o4292m8038K9784J9220j3661j3982p497R634
$$ y = [-86019, -97331, -108168, -107572, -134146, -136710, -76848, -100230, -142192, -152592, -155889, -123600, -75562, -78121, -89498, -50166, 3739, 37225, -23043, -53752, -76732, -103349, -107295, -104629, -101299, -116680, -67968, -19485, 1203, 837, -8807, -72969, -104391, -145421, -143402, -208557, -229696, -169245, -61321, -31336, -59900, -96559, -97140, -77118, -84940, -104194, -167793, -172119, -115722, -64400, -57773, -60672, -111247, -142737, -121195, -115400, -76659, -80269, -90468, -111276, -114556, -125804, -79754, -80261, -150185, -156200, -138400, -137838, -114635, -31332, 7982, 6125, 1795, -27786, -33517, -28220, -7768, 27864, 5326, -10444, 53170, 100266, 100528, 125396, 95544, 45207, 27126, 64728, 118431, 93734, 29442, -18596, 11188, 30408, 16747, 2765, -4732, 4902]
10729D902j1852k7235K1202k1555m8098q935R5007J8391k1094k3775m8593l5133
10717a06768O0476j0909m3111Q69j442N589O4343k1444q3106k6907L0010j032
10705a33432K1210L3350R300o8058L5607P6650l5623m9841J3474k5188M0042J2917
10693f9592l5286k8652J0428M0734j1934K0150o0031j808J0104K85m266k7755
10681a57623l8829J1649k74J7946J7105m1722n3815Q385O9080N756k4843l076
10669a90261N5473L42m0343n7967O1100O3097k7695l9761R831k1374O074L0928
10657a50556J7306p321n301l0314L8415N7036k1442o5995J6954K2662O813M2059
10645g9684K071J5218J6816j3273j3758Q4840J9481O6267J6991N925j2668P6167
$$ y = [4902, -6950, -34185, -12983, -34538, -82636, -91571, 3436, 21827, 733, -23042, -71635, -106768, -46292, -57201, -100312, -99443, -100885, -95296, -30953, -52397, -135503, -162410, -132400, -133432, -112222, -78872, -69572, -137630, -102023, -25373, -60996, -110837, -97363, -122551, -82509, -69592, -104878, -133530, -123102, -82368, -94302, -74152, -134183, -135991, -125887, -125602, -129868, -157623, -196452, -184803, -185077, -167131, -150026, -191748, -245563, -237178, -168098, -162342, -187185, -190261, -134788, -134446, -174789, -232756, -171656, -108559, -136254, -176015, -166184, -187558, -181484, -150556, -133250, -140571, -145872, -176186, -137771, -80735, -102177, -168172, -151218, -128556, -121743, -79684, -77613, -62395, -45579, -58852, -72610, 12230, 31711, 97978, 114969, 120894, 108226, 184393]
10633A84393J29820J12816J16248J28823R6737R8813J70076J46658J32009K84410
10623A600803L28930M05889O52173R07790J172332J676490K268084L041675L792291
10614A5846457L856494K944204J407362r9666j022468j125283m88012N47993J950134
10605B3817215L776970N898635P678886P688077N078432R12697k703909m565912
10597D7581091m376578k804657o91605J909193M744824P702380R784451R141727
10589G2990826M716971j624695o698177q857639q288192o177034l682045j090421
10581D1289594J472911L768115N157744M382382J077098l048235o205999p280950
10573D0612660o516286m885880l192553j575288j92130P49441J128130P17961
$$ y = [184393, 314213, 427029, 543277, 672100, 768837, 867650, 1037726, 1184384, 1316393, 1600803, 1929733, 2335622, 2987795, 3895585, 5067917, 6744407, 9012491, 12054166, 15846457, 19702951, 22647155, 24054517, 23954851, 22932383, 21807100, 21319088, 21867081, 23817215, 27594185, 33492820, 41171706, 48859783, 53938215, 54850912, 52147003, 47581091, 43204513, 40399856, 39708251, 41617444, 46362268, 54064648, 63849099, 72990826, 77707797, 76083102, 69384925, 60527286, 52239094, 46062060, 42380015, 41289594, 42762505, 46530620, 51688364, 56070746, 57147844, 54099609, 47893610, 40612660, 34096374, 29210494, 26017941, 24442653, 24250523, 24999964, 26128094, 26846055]
10565B6846055n79796k206857l332882l675991l369109k702311k073509j575194
10557G330406j156711q82580p62097n89418m26834l43158k79697k37180j71027
10548B481704j90703k06901j23868q8457j15227j27332p9436r7805q9118n4627
10538A308230l1264k3011j7503m7307p3751m3798q380n9412r4946p0631J6582
10527H54809J7633j9175m6090j2646N8178l4835q689K3890K9032n6394m9826k3549
10515G32338l8489l0311j8107o2717N448K4897j5133l137O7935k1311m3617l8554
10503E59242o4090m0923O3635J5787K0650K1471l3413l8207N9778j112q3382N362
10491D84798m076K957k5667K0105P209J7423J999k1147l4440k7443m521o2098
$$ y = [26846055, 26266259, 24059402, 20726520, 17050529, 13681420, 10979109, 8905600, 7330406, 6173695, 5291115, 4529018, 3939600, 3512766, 3169608, 2889911, 2652731, 2481704, 2291001, 2084100, 1960232, 1871775, 1756548, 1629216, 1549780, 1451975, 1362857, 1308230, 1276966, 1253955, 1236452, 1189145, 1115394, 1071596, 1063216, 1003804, 908858, 838227, 854809, 872442, 853267, 807177, 794531, 852709, 817874, 809185, 833075, 862107, 805713, 755887, 732338, 693849, 663538, 645431, 582714, 588162, 613059, 597926, 594789, 662724, 641413, 597796, 559242, 495152, 454229, 517864, 533651, 554301, 575772, 542359, 504152, 563930, 562818, 479436, 484798, 480722, 483679, 458012, 478117, 485326, 502749, 504748, 483601, 449161, 421718, 417197, 355099]
10479C55099j3372K7149L6269M6867J1622n3259m3300j7985j2044L5573M0613
10468D13232J2056j8979l712m698l7883m830l3572k9570l863m8285K349M3844
10456B86089Q7298N5547m4625l2516L226M1341k1007q174o0740k5846o1119P065
10444B26539r769O7096P1428M867m4258l7782m0312j5083j00789k3481L1947J0448
10432A40851N2723K4484m4731l1357m3423L8300N1989J9526o5166l9813J8188
10421A21571P9072L4066j8040K2055k1638j6447N3588L5430o4052m7002J7072
10410A95675M5081m192o6476L2088J89k4042N388M364O43k6453R516J3102k1289
10397A63594m622K3535l4810m131m7144p509N3556k9746k6287K1542N6589L5984
$$ y = [355099, 341727, 368876, 405145, 452012, 463634, 410375, 367075, 349090, 337046, 372619, 413232, 425288, 406309, 402597, 397899, 360016, 355186, 321614, 292044, 288181, 239896, 242245, 286089, 373387, 428934, 384309, 351793, 355019, 396360, 375353, 367179, 306439, 280593, 219474, 226539, 216770, 283866, 355294, 360161, 315903, 278121, 237809, 222726, 121937, 98456, 130403, 140851, 193574, 218058, 173327, 141970, 98547, 136847, 188836, 208362, 143196, 103383, 121571, 200643, 234709, 216669, 238724, 217086, 200639, 254227, 289657, 225605, 178603, 195675, 240756, 236564, 170088, 202176, 202365, 178323, 183711, 188075, 188718, 162265, 171781, 184883, 163594, 158972, 182507, 147697, 143566, 96422, 88913, 142469, 112723, 86436, 107978, 164567, 200551]
10385B00551L9340j4590p9605n4322M034K9266M535j2253K9171j2776j8322J329
10373A16358o133n2380K1974j0615R433j1954K4371p281n6963l3577K0762J13098
10361A27093L1982l5608j5215k4375K2569K338L3031Q100l8988j212N2735K3898
10349A86348n1902P183J6012n6435j5684L910N2844K9398O102N350M0508L9037
10337B62671J1593k4653j2242n9019k100O6258l1238J166k7502j4267l6010l9446
10325I5211K391N4149m13O39K4407N5662J9672o8376q9187l8044O4013K7138k9315
10312A17947n5414j8108L0459m006k3507m2190J8613K6266k4216j7601K7535R3102
10300A28880O5544r980m3618J6608L9427m2239n9556M9200J3560q560K2485l2749
$$ y = [200551, 239891, 225301, 145696, 91374, 95408, 124674, 129209, 116956, 146127, 133351, 115029, 116358, 110225, 57845, 79819, 69204, 78637, 66683, 91054, 83773, 26810, -6767, 13995, 127093, 159075, 123467, 108252, 83877, 106446, 108784, 141815, 149915, 110927, 109715, 162450, 186348, 134446, 141629, 157641, 101206, 85522, 89432, 142276, 171674, 177776, 183126, 223634, 262671, 274264, 249611, 237369, 178350, 176250, 242508, 211270, 212436, 184934, 170667, 134657, 95211, 97602, 151751, 151338, 151977, 176384, 232046, 251718, 183342, 94155, 56111, 120124, 147262, 117947, 62533, 44425, 74884, 70878, 47371, 5181, 23794, 50060, 25844, 8243, 35778, 128880, 194424, 184444, 140826, 157434, 196861, 154622, 95066, 144266, 157826, 149266, 171751, 139002]
10288A39002m105J4659k6476n3254J9952Q6098k3236j12291n810K0376j2145K1801
10276F4571K0018J0547L5634N721n2444m4064j4792j6654L1731n512J1444N0426
10264I6626L6027o9079j3627l5396L7549R122j7225M2215q470L6822K4526j3662
10252A25428l6401M0378k1609m6065K5666k1090N2357J4067n404J055L7550J0673
10240A76605j4034r378m895J3650o5329L6296j0350l837J3666M4216q505m670
10228A63435K7641m9654l1426j0981L8024K1929o8856r7005k8109J0324P4186
10217D9508k219o0180k9935J9496L7128L234r92K3168M0703M7112K1944j9141
10205A29826n2381j4385O0773j3622l759K2818J8621K1246K7830l6235m7063m547
$$ y = [139002, 134897, 149556, 123080, 69826, 89778, 175876, 152640, 40349, 34539, 54915, 42770, 64571, 84589, 95136, 130770, 136491, 84047, 39983, 25191, 8537, 40268, 34756, 46200, 96626, 132653, 63574, 49947, 14551, 52100, 61222, 43997, 86212, 77742, 114564, 139090, 125428, 89027, 129405, 107796, 61731, 87397, 66307, 118664, 132731, 127327, 128382, 165932, 176605, 162571, 153193, 148298, 161948, 96619, 132915, 122565, 118728, 132394, 176610, 168105, 163435, 191076, 141422, 109996, 99015, 137039, 158968, 90112, -6893, -35002, -24678, 49508, 47289, -12891, -42826, -23330, 13798, 17032, 16040, 39208, 79911, 127023, 148967, 129826, 77445, 63060, 123833, 110211, 106452, 129270, 147891, 169137, 196967, 160732, 113669, 109122]
10193A09122M0393K8236n8621m4163m000J9556n239j6862j1600K2091P7189R404
10181A65506k5107n528J6672J1926M2587R9457j1033l7402J662N1482J0372m6462
10169B74132k3926J9655J2263L5524n018K7117K1342m3063J4450J3011L5643j3692
10157C67438j8043M1245N9880L0823j2114J0340k977n9141o3534J3600k7994K7270
10145C66793L4926L2520k5602m2236O618K6117k3801q9088o5661n3858l8858J8409
10133A46279R551M2934J493J4159J1350n748k8019k5749k2503l3149m4955k3507
10121D2136K4399J434k906J3689j294l3603O5010L6023l2149l7809j4643o646
10109E3641J8250M7067L5137j2974k543K8668P617K0896l8212o7827n4125r556
$$ y = [109122, 149515, 177751, 119130, 74967, 70967, 90523, 85284, 68422, 56822, 78913, 156102, 165506, 140399, 134871, 151543, 163469, 206056, 305513, 294480, 257078, 258740, 310222, 320594, 274132, 250206, 269861, 282124, 317648, 312630, 339747, 361089, 318026, 332476, 345487, 381130, 367438, 349395, 390640, 450520, 481343, 469229, 479569, 476592, 417451, 353917, 367517, 339523, 366793, 401719, 434239, 408637, 366401, 373019, 399136, 375335, 286247, 220586, 166728, 127870, 146279, 155830, 198764, 200257, 214416, 225766, 220018, 191999, 166250, 143747, 110598, 65643, 42136, 66535, 67969, 65063, 78752, 77458, 43855, 108865, 144888, 112739, 74930, 60287, 53641, 71891, 118958, 154095, 141121, 138578, 167246, 174863, 195759, 157547, 89720, 35595, 26039]
10097B6039K9152L5659k3061N3545M6525k5721l0227r181l6048n95L5207l3299
10085F7995J3649N0151J9068j2081k7057k4541k7408m8408K7676k732k1311j9800
10073d799L3657o899K0351L0896m7728j2134R815J5597j0314j2765L6765k3925
10061B8517O5772k6405m5387m5508k2767M7889J13985L3663n9218m1463o7274
10050a8196M3133P8313K4218k6982p3596j4025L2514R205P635j9244k1895K8229
10038D9309O8593n0283K4042N3111k9995k6691K693O1j9224r70P481p2645l4858
10025b9376L7241N1919L3803j0078K297K2886l5588K282L4344j395m0332M9601
10013A17604L7652k5509n8749M204K2214K223j9649j6539l4312K1430R627m3699
$$ y = [26039, 55191, 90850, 67789, 121334, 167859, 142138, 111911, 102730, 66682, 66087, 101294, 67995, 81644, 131795, 150863, 138782, 111725, 87184, 59776, 11368, 39044, 36312, 15001, -4799, 28858, 21959, 42310, 73206, 25478, 13344, 23159, 38756, 28442, 15677, 52442, 28517, 94289, 67884, 22497, -23011, -45778, 2111, 116096, 149759, 90541, 49078, -18196, 24937, 103250, 127468, 100486, 26890, 12865, 45379, 54584, 62219, 42975, 21080, 49309, 117902, 67619, 91661, 144772, 114777, 88086, 90779, 90840, 71616, 70646, 78127, 5482, -29376, 7865, 59784, 93587, 83509, 85806, 108692, 73104, 75386, 109730, 108335, 68003, 117604, 155256, 129747, 70998, 75202, 97416, 99639, 79990, 63451, 29139, 50569, 60196, 16497]
10001A6497M24N486Q7883m7054m2529O2610L4757J9160l9346l9601m3711j6127
9989a551k8176M06n851J2278M5010P5886k2989p306o766J2933L6607M030l1632
9976H2879l7760k8730q0058l6730O6396O9172M2591k2001K5146J7432o4241q772
9964B5324J1224l6506j0952k5102K8861O0536k5281P740N9954M3435J8213m093
9952A53353K6161L4156n6522o5975J5420L3495k9530r997M5917L804J3406L1819
9940A95507j1899n479P5085R6436P8614N6286M9204M4626M7913R9991J21957J1776
9928H60017L6895J3446p677o3332q8841j25195j23764q5322o4825l4729j4493
9917C02180K09k9347r9658q899K5613L6807J6172o5346l6675L560N3820n0511
$$ y = [16497, 16921, 22407, 110290, 63236, 20707, 83317, 118074, 137234, 97888, 58287, 14576, -1551, -29727, -29321, -35172, -22894, 22116, 98002, 75013, 67707, 60941, 73874, 110481, 114511, 82879, 45119, 16389, -63669, -100399, -34003, 35169, 77760, 55759, 80905, 98337, 34096, 25324, 36548, 42, -10910, -36012, -7151, 53385, 28104, 35844, 95798, 139233, 157446, 153353, 179514, 213670, 157148, 91173, 106593, 140088, 110558, 100561, 146478, 150282, 163688, 195507, 183608, 178129, 253214, 349650, 428264, 484550, 533754, 578380, 626293, 726284, 848241, 860017, 896912, 910358, 902681, 839349, 750508, 625313, 501549, 416227, 351402, 316673, 302180, 302389, 273042, 173384, 164485, 190098, 226905, 243077, 177731, 141056, 144616, 198436, 147925]
9905A47925p6581m386L3646o2759l3406K6419L7562L4637l3419m4009o470N9729
9893G8888J0658j0951K735P438O0201P080l5567p0167l4123j1504K357J452M641
9880A3138L4030p918j207L379J4979k015j6113M3328j2779l7345N7114M381m4824
9867D8148j7156L2926q94L1079Q569l0739l1939m5259k939L4779K418k4172l6697
9854c1876K4454O094J7660K7105j5371n2302K4061k697l0749K5432O0066O947
9842E8824j7016l0034L6221Q010l6990n0746p3941n5840N7565J16324N9626j4318
9830E7685p700K118R05N171m4345l399l246j8857L1219N5921j759j1927N0337
9817A12123k0526K2502m2744l2967o2711M7043j9760m1086K2627J7020K5926P101
$$ y = [147925, 71344, 66958, 100604, 37845, 4439, 30858, 68420, 103057, 69638, 25629, 19159, 78888, 89546, 78595, 81330, 88768, 148969, 156049, 120482, 50315, 16192, 4688, 7045, 8497, 13138, 47168, 39250, 38043, 41422, 56401, 54386, 38273, 81601, 68822, 31477, 88591, 92972, 48148, 30992, 63918, 63024, 94103, 102672, 71933, 39994, -5265, -8204, 26575, 28993, 4821, -31876, -7422, -1328, 16332, 43437, 28066, -24236, -175, -2872, -33621, -8189, 51877, 58824, 41808, 11774, 47995, 56005, 19015, -31731, -105672, -161512, -103947, 12377, 72003, 57685, 49985, 52103, 53008, 58179, 13834, 10435, 7189, -11668, 19551, 75472, 73713, 61786, 112123, 91597, 114099, 71355, 38388, -24323, 22720, 2960, -38126, -15499, 1521, 27447, 34548]
9805C4548Q773J5991L3344P989M984m5028m0464k2695j1096M2777P0468q520m1696
9792D9375j6839N671k92n8352j0559L083O0067K926l21L5630m419J5081J1581
9779I2632l1518o9582j577L0356K5885M4113K6618l7542k0304M9493L9189k496
9767A45267J367j3300k3444O873K7217L2774q0575n7727j9442K3197O4331J15184
9755B21722L5900J0147L6382M4461Q5079J02947M3053J02072J89029K89955M04292
9744A565039O13037O88292P11567M48145N7459l47717o16796o78767n04817l85810
9734A549632k69666k11426j69901o2610j5001K5314l45O9970J81914K71230M81245
9723A850356O51783P43270O84451L56630j36496n47234o75279o34503n68985l90233
$$ y = [34548, 43321, 59312, 92656, 100645, 105629, 60601, 20137, -2558, -13654, 29123, 99591, 91071, 49375, 32536, 38207, 37915, -20437, -30996, -27913, 32154, 35080, 34759, 70389, 65970, 81051, 92632, 61114, -8468, -10045, 20311, 46196, 90309, 116927, 79385, 59081, 108574, 147763, 145267, 146634, 133334, 109890, 116763, 143980, 176754, 96179, 38452, 19010, 42207, 106538, 221722, 257622, 267769, 304151, 348612, 433691, 536638, 579691, 681763, 870792, 1160747, 1565039, 2178076, 2866368, 3577935, 4026080, 4083539, 3735822, 3119026, 2440259, 1935442, 1549632, 1279966, 1068540, 898639, 836029, 821028, 846342, 845997, 915967, 1097881, 1369111, 1850356, 2502139, 3245409, 3929860, 4286490, 4149994, 3602760, 2927481, 2292978, 1723993, 1333760]
9713A333760l36971k27417p3075j13821j33718n0612k2197l1818k8833q165l1393
9702B75740r6330l0665K3997o462m9184M4158K3114m5432P348J3134p119j3050
9690A39249r997K5074L8161l1291k5057P14J3883j8770Q86n9557k4068j361N8039
9677A05905M6938J3303j259j22024o1906M6863M2877q526n5359j0241L840J471
9665A882M4056J3024K798J3519j8111k4219m5460M2975M3567O3486M3676p2831
9653A08362l79K7893K3035m7169j8800l6031n6160j8741j1649K8475N6439k7698
9641B7577Q057j9572P722O1N296n727j0547k1828k8786j298k309L5184r314l5234
9627e0718p1860L8466K9788q442L7070M7883J6452K514R057o3265k2044J4981
$$ y = [1333760, 996789, 769372, 696297, 582476, 448758, 398146, 375949, 344131, 315298, 307133, 275740, 179410, 148745, 172742, 166280, 117096, 161254, 184368, 138936, 146284, 159418, 152299, 139249, 129252, 154326, 192487, 161196, 136139, 136853, 150736, 131966, 132852, 73295, 49227, 47866, 105905, 152843, 166146, 164887, 42863, -19043, 27820, 70697, 62171, 6812, -3429, 411, 1882, 45938, 58962, 61760, 75279, 57168, 32949, -12511, 30464, 74031, 137517, 181193, 108362, 107983, 135876, 158911, 111742, 92942, 56911, 751, -17990, -29639, -1164, 55275, 27577, 35634, 16062, 23784, 23845, 29141, 23414, 12867, -8961, -37747, -39045, -41354, -6170, -15484, -50718, -122578, -84112, -54324, -62766, -25696, 22187, 38639, 41153, 50210, -13055, -35099, -20118]
9615b0118P8667K2898k398k3739k2372J172j867r719l2537K3919J469j9741L0679
9602B6313l5159J3214J2168M215J6708L494l8685k0327J8206j112M4301J459l7534
9589G261K650M5407j9805k5915l1674L5711J7281j371J0288J4035M8099L1340
9577A33307P824l1342l8903j7886O406l6338k8256n7488j2483L7750k0019J2730
9565d4698M258K2929O7063J9458k1891l3258L152m366J108J4571J8334k8358k9211
9552a0909N8594L1849l5162p45J467O6940O851j6875o4650o5872o656m3091O0731
9539a7528J06054J4322m3969m1722l9980k113M511M8197N5048j6797k4753J0090
9527E1360J9318L8953J5431J4005l1353p2864l6902J1333N4014K3612M724j0785
$$ y = [-20118, 58549, 81447, 79049, 55310, 32938, 34110, 32243, 22524, -10013, 13906, 15375, -4366, 26313, -8846, 4368, 16536, 20751, 37459, 40953, 2268, -18059, 147, -965, 43336, 44795, 7261, 9911, 55318, 35513, 9598, -22076, 13635, 30916, 29545, 39833, 53868, 101967, 133307, 141131, 109789, 70886, 53000, 59406, 23068, -5188, -62676, -75159, -37409, -57428, -44698, -40440, -17511, 49552, 69010, 47119, 13861, 17013, 12647, 13755, 28326, 46660, 18302, -10909, 47685, 79534, 44372, 43627, 45094, 112034, 118885, 102010, 37360, -28512, -35168, -78259, -17528, 88526, 102848, 58879, 17157, -22823, -24936, -20425, 27772, 82820, 66023, 41270, 51360, 70678, 109631, 125062, 139067, 107714, 34850, -2052, 9281, 63295, 86907, 91631, 80846]
9515H0846l1775q7479k4424J1809L9241K1223n6462n7931N2224O2708l390J1511
9503A8101q504j291k3787j599k1858K2570M639J1252k833l9679J4804J8559K6123
9490A6497J5899k1945m4845p4176j2746Q7119Q8982j7357o1466L6083k953k0334
9478a1242q81k3351J3998Q7626K4225k7697N46M5694k0916l9429m8405L0662J9896
9465E0726k5549J1706j887j9277J733m8j1697K2758N342j6650J2447K5977n4784
9452G97k1740J2182M0653j6834p0526k863j3013K9084P5759N1947mJ7767j7079
9439H6130j9824l3336j5801o0143K9872N1366M5952M3720j8373n0813l7066L1450
9427E3134N1807K5541j1808q688n3111K6463J3775k8901k3574J1735l8568j4914
$$ y = [80846, 49071, -38408, -62832, -51023, -11782, 9441, -47021, -104952, -52728, 9980, 6590, 18101, 9597, 8306, -15481, -17080, -38938, -16368, -11729, -477, -3310, -42989, -28185, -9626, 16497, 32396, 10451, -34394, -108570, -121316, -34197, 54785, 37428, -24038, 12045, 9092, -11242, -12123, -35474, -21476, 66150, 90375, 62678, 63224, 108918, 88002, 48573, 168, 30830, 50726, 25177, 36883, 34996, 15719, 17452, 17404, 5707, 28465, 33807, 17157, 29604, 55581, 797, -20943, -8761, 31892, 15058, -55468, -58331, -71344, -42260, 33499, 85446, 85442, 103209, 86130, 66306, 32970, 17169, -42974, -13102, 38264, 84216, 127936, 109563, 58750, 21684, 53134, 104941, 130482, 118674, 109986, 56875, 83338, 97113, 68212, 44638, 56373, 17805, 2891]
9415B891j1501l967n599j0979l359l2122K9963L5055N3848Q300q1860k1008J876
9402c8462J619J2622m412L0277o191L9369O121l9400q429L6740l9206p694L8058
9389B1012l1008K0787J5695K1040k1902o1498M8606O0147Q543K1663o1582j5222
9377B6281K4990N339p949l8349j5942L0991R144k4065K3796k622j4155K0051j8149
9364A9361J9252N038j0515r484P159L7981m145k6317n2016K0946L5121O493k4967
9351B3907Q054k3594J6900N2674R4505M8783q613q9386l6748k4496l57J752J9320
9338H2701J3024k2596l3248o2986K2878O8976j2634j8469P709J0720O2967l3820
9326H5222l8769k7714k033J9918j5039k1928L15M481k1687l4170Q4755o379m0896
$$ y = [2891, -8610, -12577, -18176, -29155, -32514, -64636, -34673, 382, 54230, 62530, -19330, -40338, -38462, -36843, -24221, -28633, 1644, -4547, 34822, 40943, 1543, -6886, 29854, -9352, -17046, 21012, -9996, 10791, 26486, 47526, 25624, -35874, 12732, 72879, 81422, 103085, 41503, 26281, 51271, 56610, 48661, 10312, -5630, 25361, 34505, 10440, 34236, 31614, 17459, 37510, 19361, 38613, 43651, 33136, 23652, 30811, 68792, 64647, 38330, -13686, 7260, 42381, 48874, 23907, 31961, 8367, 25267, 77941, 172446, 221229, 212616, 123230, 86482, 61986, 61629, 63381, 82701, 95725, 73129, 39881, -23105, -227, 68749, 56115, 37646, 45355, 56075, 119042, 85222, 46453, 18739, 16706, 36624, 21585, -343, -28, 4453, -17234, -51404, 33351, 26972, -13924]
9313a3924l8566J8929O5304o638M970L2254N2614J6212m7736m5134k6712q751
9301B822J1873m1903j6103M6925M6613M6499l6447l7002L2036J7497n7475j19489
9289a04154n721N2468P8734M6113k1104m866N7959m9908l2417j6532J0518N3868
9277F4958k2829p5276m6561K6621L4915M3228k4653l2945j4581J6135M3810J4153
9265B6975o3963l413M0394L7220J1265p276l0571j3694N5432p144o5307l9177
9253e9259Q4713L200M60K658k2977k8199N994j2546l9534O25L109r114j191J1095
9239f0966L8562J9509l3719Q582K6181J3747l715m930L4228l7251j8512j1531
9227b9815J9744O867m2657K2596O6816O6872M8948n5716n6948m8240o285L9020
$$ y = [-13924, -52490, -33561, 31743, 25105, 30075, 62329, 114943, 131155, 83419, 38285, 11573, 2822, 14695, -27208, -43311, 3614, 50227, 96726, 60279, 23277, 55313, 72810, 15335, -104154, -109875, -57407, 21327, 67440, 46336, 41470, 99429, 49521, 17104, 572, 11090, 64958, 42129, -33147, -79708, -53087, -18172, 25056, 403, -32542, -47123, -30988, 12822, 26975, -36988, -40401, -7, 37213, 48478, 41202, 10631, -3063, 52369, 45225, -20082, -59259, 25454, 28654, 29114, 31772, 8795, -19404, -13410, -25956, -65490, -64865, -61756, -70870, -72061, -60966, -22404, -2895, -36614, -28032, -1851, 11896, 8181, 3251, 37479, 228, -18284, -29815, -10071, -3204, -45861, -23265, 43551, 110423, 159371, 103655, 46707, -1533, -7818, 31202]
9215C1202N3203J0649r0618k4491J1163m1080K3891L9491m9677k7491K2745J7354
9203b3659Q5219k0415R740M3930l0061o6389l4013J5996J76k1621M3493M9620
9191E2016l8181l412K3942p678K8023P3678j3991q432K2321m3683K2236k6003
9179H0836q3436Q997L3831J6230J9205k2044m6746j1884m970j4783O924K1783
9167C943r362k8519K7449K0983l9092K8688O3078j2357m9512j922m0793m2993
9155h0409m3390q1770L1886P0834L1363P8965K6411r968o2037J2877l3344k4109
9143h2691J392L4783N5657K5824j443K1856N7473m8146p4391o597L3585N5456
9131G2758M576l2611q7148l3905L3167M9922K5703M6677j3848K2380k1789k2070
$$ y = [31202, 84405, 95054, 4436, -20055, -8892, -49972, -26081, 13410, -36267, -63758, -41013, -23659, 61560, 41145, 50885, 94815, 64754, -1635, -35648, -19652, -19476, -41097, 2396, 52016, 13835, 10423, 34365, 26687, 54710, 128388, 114397, 105965, 128286, 84603, 106839, 80836, -2600, 6397, 40228, 56458, 75663, 53619, 6873, -5011, -9981, -24764, -17840, 3943, -5419, -33938, -6489, 14494, -24598, 4090, 67168, 54811, 5299, 3377, -37416, -80409, -123799, -205569, -173683, -102849, -71486, 7479, 33890, 23922, -38115, -25238, -58582, -82691, -81299, -46516, 9141, 34965, 33522, 55378, 112851, 64705, -9686, -16283, 17302, 72758, 77334, 44723, -42425, -76330, -43163, 6759, 32462, 79139, 65291, 87671, 65882, 43812]
9119D3812p9169K2057Q844L7352P859J176j6902j7212L0987j4159l8142P401J6290
9106A0194O1587K9778P763Q73l151l8816k2227k6407j1157N5377N9144j6490n0999
9093E5469K0713r026m8031k3314J0379N407k780J9890q270j0828R191k6081K1407
9080A4126L2205n415k313m2634J0324l7592K9659O358l804J6467o0757l1287L5175
9067c9488L1157l5532k4070l8413m219j5526P380M8448L0610L7712j0815l3442
9055d6198l335M0917K9606J5719m3242m6367K5900n760k1949j2725m8299m9859
9043a65592M4763P0211N6941n498L0917m845L111M4341m1885j07522J2462J207
9031f1389r003K9479L8267K4527j5890k1881L06M6455L2015J5272m8727k8880
$$ y = [43812, -35357, -13300, -4456, 32896, 40755, 41931, 25029, 7817, 38804, 24645, -13497, -6096, 10194, 71781, 101559, 109322, 110195, 107044, 68228, 46001, 19594, 8437, 63814, 122958, 106468, 55469, 76182, 67156, 19125, -4189, 6190, 11597, 8817, 28707, 20437, 9609, 18800, -7281, 14126, 46331, 40916, 38603, -4031, 6293, -31299, -1640, 4718, 914, 17381, -43376, -74663, -39488, -8331, -43863, -67933, -106346, -110565, -126091, -118711, -70263, -39653, -1941, -12756, -46198, -49533, -8616, 20990, 36709, -6533, -52900, -27000, -32760, -54709, -67434, -115733, -165592, -120829, -50618, 6323, 825, 31742, 26897, 30008, 74349, 32464, -75058, -62596, -61389, -70392, -40913, -2646, 21881, 5991, -15890, -15584, 30871, 62886, 78158, 29431, 551]
9019E51j5483L9458J3528K811P404k9301J1029N2732K825m9400j03064O4925p87
9006b772k6322j7680M727L3574r455P763J0498L7236o559N604O168k7103J3823
8993B9502p334k017J9834L5223j7178K8444N6642p7578j02127N187L8504J7324
8981B4426J4381m2719k862M9922M5085k9908k386j964l2523K4843L5397q7311
8969e619p8552l9719N5139O5275Q805K5468O2377k1991n6486O671n2301k9696
8957f0629L8857p803j5058M6850M924n2284M0616N3549q820L7925l572k6627n0193
8944b265J0182j050K278l0658M0644K8026q209N0979J5086r4553m5288J03076
8932F8248K7800k334n1283j2068K7708K7095k2835k8501o1771J9458J7228K1901
$$ y = [551, -14932, 24526, 38054, 40865, 48269, 18968, 29997, 82729, 85554, 36154, -66910, -1985, -2772, -29094, -46774, -42047, -8473, -17928, -10165, 333, 37569, 31010, 36614, 42782, 15679, 29502, 22168, 20151, 39985, 75208, 58030, 86474, 143116, 65538, -36589, -31402, 7102, 24426, 38807, -3912, -6774, 43148, 88233, 58325, 55939, 53975, 21452, 46295, 81692, -5619, -84171, -123890, -68751, -3476, 5329, 30797, 93174, 71183, 14697, 21368, -30933, -60629, -21772, -29575, -44633, 2217, 7141, -45143, -4527, 49022, 40202, 78127, 74555, 47928, -2265, 7917, 6867, 9145, -21513, 19131, 47157, 38948, 89927, 105013, 10460, -34828, 68248, 96048, 93714, 42431, 30363, 58071, 85166, 62331, 33830, -27941, -8483, 8745, 30646]
8920C0646L1851k1699J2317N7199L436q4327p1607K0601k5693l6363J9169L0229
8908c4241R945L7043o3663l4641N7599k4791m5116M6186L0677R4264L2097n5340
8896E0019o1899M902L0809K571l7449j0068M572j5767k5301j928N4659m0370O68
8883d4582M7861k6784q0188j6954J8731R6302N4568m7560L7400l761o489M1190
8871F9734L7965K6117j2888k9588r762k6168r274m6519o7927J0135K6558p923
8859c9540M8857O959m1531j1696q201l2188J1553J3028o21n284l8719K6980P5809
8846E406L0951k2192n1377l645l8113K3497L7462O0930J39j2633p1965K2898R558
8833i084K8114k6366K0173m0424q401q23L454m3139L3257J15020L6348m524k9800
$$ y = [30646, 62497, 40798, 53115, 110314, 113750, 29423, -42184, -21583, -47276, -83639, -64470, -34241, -24296, 12747, -50916, -85557, -27958, -52749, -97865, -51679, -21002, 73262, 105359, 50019, -11880, -6978, 23831, 26402, -11047, -21115, -16543, -32310, -57611, -59539, -4880, -45250, -44582, 3279, -23505, -103693, -120647, -101916, -5614, 48954, 1394, 38794, 35033, 28544, 69734, 107699, 133816, 120928, 91340, 81578, 55410, 46136, -383, -68310, -58175, -31617, -39540, 9317, 16276, -25255, -36951, -45152, -77340, -65787, -52759, -53380, -58664, -97383, -70403, 5406, 36357, 14165, -37212, -40857, -78970, -55473, -18011, 42919, 43058, 30425, -41540, -18642, -9084, 19030, -7336, 12837, -27587, -35988, -36811, -33357, -76496, -43239, 71781, 108129, 103605, 73805]
8820G3805n4024q8701l6789L7269k1541J5467Q1016o315J1680L503l2958k3886
8808d1474L7598L3303J0039o965m9193L620K3726n3876l9756k6152N0275K9904
8796b8951J3869K294J1381K8311K6309l90p1715n105K2431L6068J9003j4392Q008
8783D7121p296M021m674K8729k5864o5210M3968j1744l392P328L6435L6088O1487
8770A46997o460l513j6401l9831j3611k1932j8037P5921L8062n2993l8761K4186
8758G3627K190m880j7958j8770m25k7064l8811L8856J5265m7984o914O331N8975
8745C2438N7780J3900o153O847l6592p5110o6536M8016M293K908k8168j8352k4946
8732h9675J7506K3605L6096N4926N3742K717l1364j0358j8109k4189K6812L6984
$$ y = [73805, 19781, -68920, -105709, -68440, -89981, -74514, 6502, 187, 11867, 15370, -17588, -41474, -3876, 29427, 39466, 32501, -16692, -13072, 10654, -43222, -82978, -109130, -58855, -28951, -15082, -12788, -1407, 26904, 53213, 52823, -18892, -23997, -1566, 34502, 53505, 39113, 47121, 39825, 43846, 39172, 67901, 42037, -23173, 20795, 9051, 5659, 12987, 49422, 85510, 146997, 140537, 137024, 120623, 80792, 67181, 45249, 27212, 103133, 141195, 88202, 49441, 73627, 75817, 70937, 52979, 34209, 33784, 6720, -32091, 6765, 22030, -25954, -32868, -26537, 32438, 90218, 104118, 97965, 104812, 68220, -6890, -73426, -25410, -21117, -18209, -46377, -64729, -89675, -72169, -48564, -12468, 42458, 96200, 98917, 67553, 57195, 39086, 14897, 41709, 78693]
8720G8693K1445l1225q4997n5677M545O031L5094N8895K1818K0465m9903q3778
8708e8594L3034k7159j9268L8923l805o55k2234l7177J8879P5660j5260r916m1305
8695f8877M9284N8889m9878j1148M0772l1321j1259k9154l001k0065L8648O4962
8683B7852O5861Q0636r094L4145N964o1359j4918l8772n9835j9987k7751o7403
8671h4661j2234N6279K5613j6165m125J7066k8846l877R879k1130L6730L8178
8659A2707j2638j8813k5902M006k2974p221M1570J5252j2394K7644J5889m5097
8647b7971o01m559m445j5358L8158P5726l3447K1018m153k4023m1002M6562O8853
8634I4758J1373K2800l1282k064J9845J6636k7053n5233o8946k4794K8503q67
$$ y = [78693, 100138, 68913, -16084, -71761, -67216, -61185, -26091, 32804, 54622, 75087, 25184, -58594, -25560, -52719, -71987, -33064, -36869, -37524, -59758, -96935, -78056, -2396, -17656, -27572, -68877, -19593, 39296, -10582, -21730, 19042, -12279, -23538, -52692, -55693, -75758, -37110, 27852, 93713, 174349, 165255, 199400, 205364, 144005, 129087, 90315, 30480, 10493, -17258, -84661, -96895, -40616, -15003, -31168, -35293, -18227, -47073, -50950, -41071, -62201, -25471, 12707, 69, -18744, -44646, -40640, -63614, -70835, -29265, -14013, -26407, 1237, 17126, -27971, -28572, -33131, -37576, -52934, -14776, 60950, 27503, 48521, 44368, 20345, -20657, 25905, 94758, 106131, 128931, 97649, 95585, 115430, 132066, 105013, 49780, -19166, -43960, -15457, -16324]
8622a6324j0025K4743n977n8808L406K9957L5985o972l5826M1616M6846j2687
8610C5934K8360J3996l6872j916j4605k9297N1427K1974K2197n0625k5964q914
8598E695J752J1453L6751j6848l6784R544n5432M9628M6337n161m0470J8303R034
8585C3802j6905N703m3255N83K1208l4069k7613l141M9615R323K5880Q294j8290
8572A1135k1606J6816j1833n4854M1003M8408N033l5635O128r232j6940L5712
8560A4135N5632j5984l1910o1989n9660M4195N1315K0294O576N343K4015N1958
8548A03920q484L714m1500n0637J684j267K7916M3195L803K4415j2643m2644m9849
8535A623m2156J0935j8673M6643P8138N1741M3913J451m4701m1808k7304K2547
$$ y = [-16324, -26349, -1606, -7583, -66391, -62985, -33028, 2957, -4015, -39841, 1775, 48621, 35934, 64294, 78290, 41418, 39502, 24897, -4400, 47027, 69001, 91198, 40573, 14609, 5695, 7447, 18900, 55651, 38803, 2019, 11563, -43869, 5759, 52096, 46935, 6465, 24768, 33802, 16897, 22600, -20655, -20072, 1136, -32933, -60546, -63687, -14072, -4749, 21131, 29425, 11135, -10471, 6345, -5488, -60342, -19339, 29069, 34102, -1533, 4595, -4637, -21577, 14135, 69767, 53783, 21873, -40116, -99776, -55581, -4266, 16028, 22604, 27947, 51962, 103920, 95436, 99150, 57650, 7013, 8697, 7430, 35346, 78541, 82344, 106759, 94116, 51472, 1623, -40533, -29598, -48271, -1628, 76510, 128251, 172164, 173615, 128914, 87106, 59802, 82349]
8523H2349j1405r031m1381k3234N899l8408j7326K3240J0148K5551N2500j8492
8511D0410k172J5288Q14j6964q223K8369O4752m8544k0650l5073M004P0948M858
8498I7817l7043K0835k7911J3500k2351j4035j9053K7073M085J6176j7321k2807
8486A8965J2689O6692J641k5576l8369m6594L1736P097M3616j4066o3773k7341
8474c3283j3254p42k6008M7383k4280j0207K6077q407K5319M7153J3104J1310
8462E4165n0649j2876l5254J7148N7433J1506O941K1655K0969J2564K1008K4481
8450A49091K6674p1099m8828k127M3578p797j0996r106j1640J3257q206K5810
8438H8611n112p9989n9917P5305N2439L2035q190j1384K5836l887m8268l8354
$$ y = [82349, 70944, 61913, 20532, -2702, 3197, -35211, -52537, -29297, -19149, 6402, 58902, 40410, 38238, 53526, 54340, 37376, 29153, 57522, 122274, 73730, 53080, 18007, 22011, 92959, 97817, 60774, 81609, 53698, 67198, 44847, 30812, 11759, 38832, 42917, 59093, 41772, 18965, 31654, 98346, 99987, 74411, 36042, -10552, 21184, 28281, 71897, 57831, -5942, -33283, -46537, -47279, -73287, -25904, -50184, -60391, -34314, -42721, -17402, 29751, 42855, 54165, 3516, -9360, -44614, -27466, 29967, 41473, 48414, 70069, 91038, 103602, 124610, 149091, 175765, 104666, 55838, 53711, 97289, 89492, 78496, 69390, 57750, 71007, 62801, 88611, 83499, 3510, -56407, 18898, 71337, 103372, 95182, 83798, 109634, 105747, 57479, 19125]
8426A9125j2459J5196J4524j9139p1573j5297N7442J9648K0798J1466l4951k4283
8414a9503K9363K4047M9893Q786L176L916N5496K5206P8093O4554l033J0729n0645
8401B80078p9344j5147m1375l4553J1583M0104l1576o6427m4051k0574L599J6527
8389A8844J2087p41p990L132J6660k7506j1779k3153j5519M2653l3326M3678k122
8376A4918O150R52J6302L2624j1089j447k3251k2101M3646O3535k7726O0663N2245
8363B05421Q1985P4370R9134J65925J00787k0462j43984j26344j40588j16678
8353A79566m7740j6889q8k2571R804N1922j6919j2302j2890k7036K0792n201N8577
8340A59025L7383l1846K6886N5980o980n3151o9074m0330J483K2512K8643K7869
$$ y = [19125, 6666, 21862, 36386, 17247, -54326, -69623, -12181, 7467, 28265, 39731, 4780, -19503, 9860, 33907, 83800, 92586, 95762, 99678, 155174, 180380, 258473, 323027, 319994, 330723, 280078, 200734, 185587, 144212, 109659, 121242, 161346, 129770, 63343, 19292, -1282, 2317, 18844, 30931, 30190, 22200, 25332, 41992, 14486, 2707, -20446, -35965, 6688, -26638, 17040, 14918, 21068, 22020, 38322, 70946, 59857, 58410, 35159, 13058, 56704, 120239, 92513, 153176, 205421, 287406, 361776, 460910, 626835, 727622, 707160, 563176, 436832, 296244, 179566, 131826, 114937, 114849, 92278, 102082, 154004, 137085, 124783, 111893, 84857, 105649, 100448, 159025, 196408, 164562, 191448, 247428, 240448, 187297, 118223, 77893, 79376, 101888, 130531, 158400]
8328A58400k7559K4579k8634m1399L5012J0249l4695k9214J5908P8150O5532j5671
8316B10658P1217J18528K687q4174j7807l2274q2497q3662j199k9910J7528m0107
8304D8988m5929m9314K4624j9566K827k3094L9192L4025n275P8810J16261J05639
8292C07188o927m3894r062n8417m7756q1741n7641k111Q519o867o599M0858N6458
8279I2008j7647l7838q06P405m7692j5652J0124O3111J0838N192P977L8565l3481
8266H2104k6651K2972P229k7685p852J6977l8571m0221J8671K6349K9570O9394
8254A32286q7407o8977M4053J25475N373P627l7410k755k7633r1075M34M0680
8242D0671L5970j6264m2229o2054p571Q3j5895K7885P1431K3074k1896k5381p9838
$$ y = [158400, 130841, 155420, 126786, 85387, 120399, 130648, 95953, 66739, 82647, 160797, 226329, 210658, 281875, 400403, 403090, 318916, 301109, 268835, 186338, 102676, 101477, 71567, 89095, 48988, 3059, -46255, -21631, -41197, -38370, -61464, -22272, 11753, 6478, 85288, 201549, 307188, 300261, 256367, 247305, 188888, 141132, 59391, 1750, -361, 8158, 1291, -5308, 35550, 92008, 74361, 36523, 35717, 43122, -4570, -20222, -10098, 53013, 63851, 69043, 77020, 115585, 82104, 55453, 78425, 85654, 57969, 50117, 67094, 28523, -11698, 6973, 33322, 62892, 132286, 44879, -24098, 19955, 145430, 150803, 158430, 121020, 118265, 90632, -443, -9, 40671, 76641, 60377, 18148, -43906, -51477, -51394, -67289, -39404, 32027, 55101, 33205, 7824, -72014]
8229g2014p7678o248K5131j186K9307K7934N1949M7744L0868n6645j5764m3976
8217f0578q223K4026l1560n5663L5823O6271J8016j1425P4903k2696n670K7132
8205E0356L698n8175P035N1060N1487k1606n8724n5978j8268K3857L6090n8272
8193d7440m9803M3097O8407L646p6504j2096L427K0332J3321m3083r25J225K8347
8180d8049N1733m704p296P386N4913q14o0067j9889j5943M5223l097l3711j2762
8167d7077m7333l1737J6760K9561r879O1167N7924n611j3015l4695N905O9102
8155E1072J0111j3446j0044K7708k0904r849n2276j6588K53p1448J6098M0908
8143d8405Q5128R161j3527M1379m7018k7694m8120k4857R382K1169K5335k2019
$$ y = [-72014, -149692, -155940, -130809, -131995, -102688, -74754, -22805, 24939, 55807, -838, -16602, -60578, -68801, -44775, -76335, -131998, -96175, -29904, -11888, -23313, 51590, 28894, 23224, 50356, 54054, -4121, 2914, 53974, 105461, 83855, 25131, -30847, -49115, -25258, 10832, -47440, -97243, -54146, 14261, 17907, -58597, -70693, -67266, -46934, -33613, -76696, -77621, -76396, -48049, 3684, -1020, -8316, -930, 53983, 53169, -6898, -26787, -42730, 2493, -604, -34315, -47077, -94410, -126147, -109387, -79826, -89705, -28538, 29386, 23775, 10760, -23935, -18030, 51072, 61183, 47737, 37693, 65401, 44497, 34648, -17628, -34216, -33963, -105411, -89313, -48405, 36723, 45884, 32357, 73736, 26718, -976, -49096, -73953, -64571, -43402, -18067, -40086]
8131d0086K5488K1695O7593J4209j5752k5568k1804j3530n716K3476k8077j3259
8119a1331J5028n3653J8669L6408R219j7381l2950l3936m2231l4234O1960M4747
8107c9685M7383K2528M2859j3631K3633J5492k2080j6392k5386l296l3350k7763
8095b9688P126l453k5137j0524N770J769Q875N2639j7735m2212Q003q393l7808
8082i0768J2884K4672L9565k1313L561O5549m1501l6099J8183N0123M4421j8295
8070E0982m8311k5777m79J0328j3647o0150J1246R2187J9139M1493l6891m1773
8058a653p0673K0785P035l0145M9496P303k2959N050K1144n4011l5241j9792J4005
8045a09656O0479Q720k6629J110k6818L2346O8597o268n2093K2540J0128n5275
$$ y = [-40086, -14598, 7097, 74690, 88899, 73147, 47579, 25775, 12245, 6529, 30005, 1928, -11331, 3697, -49956, -31287, 5121, 14340, -3041, -35991, -69927, -112158, -146392, -84432, -39685, 7698, 30226, 73085, 59454, 83087, 98579, 76499, 60107, 34721, 31425, -1925, -29688, -22562, -26015, -51152, -61676, -55906, -54137, -45262, 7377, -10358, -52570, -44567, -52960, -90768, -77884, -53212, -13647, -34960, -31399, 34150, -7351, -43450, -25267, 24856, 69277, 50982, 2671, -23106, -23585, -13257, -26904, -87054, -75808, 16379, 35518, 77011, 40120, -1653, -72326, -51541, -44506, -74651, -25155, -17852, -40811, -35761, -14617, -68628, -103869, -123661, -109656, -49177, -40457, -67086, -65976, -92794, -60448, 8149, 1881, -50212, -27672, -17544, -72819]
8033g2819l4798K6162L6597j9521J0136m5201J4303M2342J6857n318K8153R720
8021F613L2013j4026k0946j4050J1418J340j5100j6098k1150J6318J0672k5926
8009d8922J5149k522J049j006q852o4061k5504O3699Q1675J8162n8274Q998J1815
7996h594O751K1539J8480J6235j4952l8614K4512j4266J4118o8382o7189L4376
7984g5986K0017L3708l904L6039M412M302J9365m5708o1558L8295P4484L3322
7972G6788M9171l3322k9724j7570m2434q55j5324J9352j4335k2084L7173k9919
7960b3083j7931O8466R571k2283o5545r413k5746k165M450J6329k177j2513J2539
7947f9501K6937L101o842R872M8079L5488j9224n3521j8653l9112j4652O9420
$$ y = [-72819, -107617, -81455, -44858, -64379, -54243, -99444, -85141, -42799, -25942, -31260, -3107, 6613, 38626, 24600, 3654, -10396, 1022, 2362, -12738, -28836, -49986, -33668, -22996, -48922, -33773, -36295, -35246, -36252, -45104, -109165, -134669, -70970, 10705, 28867, -29407, -20409, -8594, -1843, 19696, 38176, 54411, 39459, 845, 25357, 11091, 25209, -43173, -110362, -75986, -55969, -22261, -26165, 9874, 14286, 18588, 37953, -7755, -69313, -31018, 43466, 76788, 125959, 92637, 62913, 45343, 2909, 2054, -13270, 6082, -8253, -30337, 6836, -23083, -41014, 27452, 37023, 14740, -50805, -60218, -85964, -88129, -83679, -67350, -69527, -82040, -69501, -42564, -39463, -46305, -36433, 11646, 47134, 27910, -25611, -44264, -83376, -98028, -28608]
7935b8608N3800j6339m0987r23j6168L0460m6907j855K6320o9555M908M2462J1914
7922e1478m8007L4533K3231K0662K0284o7377p714J1294L1910K8359L4618k6013
7910D302k3701q940q858j1867o327K2511K902M5138J0994m830j4893l0806k9383
7897e3758O972M0352m957m531m275J8078l6858m0446M1464L9478K4750m474k3223
7884a428n3129q68m5452k9319K9239Q4438l8432L4567L4404n2388l7512k7566
7872a03446L7259Q003n382k8224K9997l091k1009q9679n747L8421N7467j8835
7860a04266j6907K4348O5606Q7356J159M713m1095n9589K0059m377K531r61L0510
7847I087J8852l8126q7708O0697Q5281n0144o8585J3689l782P084j045J9550M2592
$$ y = [-28608, 25192, 8853, -32134, -33057, -49225, -18765, -65672, -67527, -41207, -110762, -105854, -63392, -51478, -99485, -64952, -41721, -21059, -775, -68152, -75866, -64572, -32662, -4303, 30315, 4302, -19399, -28339, -37197, -49064, -55391, -32880, -29978, 15160, 26154, 21324, 6431, -24375, -53758, -46786, -6434, -11391, -15922, -20197, -2119, -38977, -79423, -37959, 1519, 26269, 21795, -1428, -54557, -55425, -100877, -130196, -100957, -16519, -54951, -20384, 14020, -38368, -75880, -103446, -66187, -58184, -63566, -91790, -61793, -64884, -85893, -175572, -181319, -142898, -85431, -104266, -121173, -96825, -31219, 56137, 57296, 62009, 20914, -38675, -18616, -22993, -20462, -21423, 9087, 27939, -10187, -97895, -37198, 48083, -2061, -70646, -56957, -60739, -53655, -54700, -35150, 7442]
7834G442j5423n9529J7969J2521M1435R513J8947r450p882n8853J3060N0673L1090
7821E1513l6287m949O0164O5322L8875m3896l6695m8761k9430N84l702k092O667
7808A7313r938K7657k2988n3999J2742M0756j2044J1443K9978L632m7251K2181
7796A9482P917m9791j0756M6109J1059O614k2720l5205J892J9868j5310M0670
7784A9829O9166k2255Q077J0374P756K7979k1502o9452j7869J0861n9656k8672
7772f5364m5946K0606M3120q04J6688j3150j85L3482l7044o7214j176R6488Q666
7759a1833j3692L0554J4734k8456J3935J5759l5228o299m420O0632q621j1800
7747A5265P017l2025J0814j7498k1436J9225K791j3451q587K7686q438J8016k430
$$ y = [7442, -7981, -67510, -49541, -37020, 4415, 13928, 32875, 23425, 15543, -43310, -30250, 20423, 51513, 15226, 10277, 70441, 135763, 174638, 130742, 94047, 45286, 15856, 16440, 12738, 10646, 17313, 7375, 35032, 12044, -41955, -29213, 11543, -501, 10942, 40920, 44552, -2699, 19482, 27399, -22392, -33148, 12961, 24020, 30634, 7914, -27291, -25399, -5531, -20841, 19829, 88995, 66740, 74817, 85191, 92947, 120926, 99424, 29972, 12103, 22964, -36692, -65364, -111310, -90704, -47584, -48388, -31700, -44850, -45035, -11553, -48597, -115811, -116987, -20499, -11833, -25525, 5029, 19763, -8693, 5242, 21001, -14227, -20526, -24946, 35686, 27065, 15265, 22282, -9743, 1071, -16427, -37863, -18638, -15847, -29298, -37885, -10199, -18637, -621, -3051]
7734c051o424l1862P128j949J41N5158k989m6011q526K5582l6932J6658M2735
7721I658m8790l9193k0978n5274M062P1382J6104N5719Q1689k797l0676l4930
7709E976q07j3927l3268P368r29J1685j2200J6956n6209j604N3136K2720N1943
7696E0840o478n9731m2567k275Q892P017M5043l7287l569K6699m8140J0340K6206
7683b5010L1497Q746l6078K4578N4915R508m2246l8190j056L2344j189J1476r1712
7670f2417m0998j095N5969r551l8409p450M779O2991O1430o8205p1228M3568L7321
7657c3295q184r8k5014J3427O089N1517k662o7019o0529O4490R1001N8896m8069
7644D0550k5249L7200M2754l2519q5315q4755p38N2571O5796O1197l9595l9522
$$ y = [-3051, -9475, -41337, -34209, -36158, -36017, 19141, 16152, -29859, -38385, -12803, -49735, -33077, 9658, -39132, -78325, -99303, -154577, -150515, -79133, -63029, -7310, 74379, 71582, 40906, 5976, 5169, -8758, -42026, -34658, -35587, -23902, -36102, -19146, -75355, -76959, -23823, -1103, 50840, 44362, -15369, -57936, -60211, -51319, -44302, 741, -36546, -40115, -13416, -61556, -51216, -25010, 6487, 15233, -20845, 3733, 58648, 68156, 25910, -12280, -13336, 19008, 17819, 29295, -62417, -103415, -104510, -48541, -58092, -96501, -103951, -99172, -36181, 25249, -42956, -114184, -70616, -33295, -41479, -41577, -66591, -53164, -47075, 4442, 1780, -65239, -125768, -61278, 29723, 88619, 40550, 15301, 52501, 95255, 62736, -22579, -107334, -108072, -55501, 10295, 71492, 31897, -7625]
7632g625M2292J8432l4155P404K6759k4406j977j7486n900o020K785L8911J1493
7619E0507k1881k0078M3503L1996K6917k9993j07944q2252N2591O0709k0556j4112
7607c0593k6339l1109P056k771K8644K6510l0372J8076R024m0257M1400J3503
7595a7228k4080J5394J0473J6928J140o770j8328k5142k63K0913k2211l2455J8643
7582f2986Q7757J168n4755r332J4063j9173l4182j7800K4381J1538k8085n999
7570i3405j6591L246M2134L3347j9571j7851O4198R423j445l7097M0231O7734
7558G4353J5314R015k9935m9225q0007j3370L307p351M9682K8372n8371n4052
7546a12268l4934O6732j8297l6161N2645M1709K2242l3976l8493M4880J7267j1075
$$ y = [-7625, 34667, 53099, 18944, 26348, 53107, 28701, 26724, 9238, 3338, -2682, 103, 39014, 50507, 28626, 8548, 52051, 84047, 110964, 80971, -26973, -109225, -56634, 4075, -16481, -30593, -56932, -88041, -80985, -83756, -55112, -28602, -58974, -40898, -31874, -72131, -30731, -17228, -41308, -25914, -15441, 1487, 2627, -4143, -22471, -47613, -47876, -26963, -49174, -81629, -62986, 24771, 25939, -28816, -38148, -24085, -43258, -77440, -95240, -70859, -59321, -87406, -93405, -109996, -106750, -64616, -31269, -50840, -68691, -4493, 4930, 3485, -33612, 6619, 74353, 89667, 98682, 68747, 19522, -60485, -73855, -70548, -77899, -28217, 155, -58216, -112268, -147202, -80470, -98767, -134928, -82283, -40574, -18332, -52308, -90801, -45921, -28654, -39729]
7534c9729j4689J5223Q217J0620K534P467K318J5026N4051r699n0560J0911j3563
7521a873n3691o0867k875L9078n4691R260P1906P922k9310k6756R364M564l194
7508i1163j0089M046K1677N532j6591r5M3764N8191J7013j5308L4665l478L6676
7495H4840j5243n0785k0462r947m3726m6559Q272J6121J5230Q975R707m93K444
7482d1626K2666j2091L4450K8373l1681P157L3375J2926k0576J4912l8270n1428
7470d1813p174p972k5014K8476N2126k281p798J5651J200l4435Q537J3063r2182
7457i9616J6586L1179j6481O2885M8809L9074l7977m0898l2083l593O0194m4083
7445a6004J7871N4193n2188l6460m6948J5191j5746K7331l4538k381o215M0290
$$ y = [-39729, -54418, -39195, -30978, -20358, -17824, -10357, -8039, 6987, 61038, 51339, 779, 11690, -1873, -55564, -116431, -119306, -80228, -134919, -125659, -53753, -45831, -75141, -101897, -92533, -87969, -91163, -101252, -97206, -75529, -69997, -86588, -86683, -42919, 15272, 32285, 16977, 51642, 48164, 84840, 69597, 18812, -1650, -11597, -55323, -101882, -93610, -77489, -62259, -53284, -43577, -44070, -41626, -18960, -31051, 3399, 31772, 91, 7248, 40623, 53549, 32973, 47885, 9615, -41813, -48987, -56959, -81973, -53497, -1371, -3652, -11450, 4201, 5401, -29034, -20497, -7434, -99616, -83030, -51851, -68332, -5447, 43362, 82436, 44459, 3561, -28522, -32115, 28079, -16004, 1867, 56060, 3872, -32588, -79536, -64345, -80091, -52760, -87298, -89679, -95894, -55604]
7433e5604R3544q197k5185J6972O036r5755J843O4130J5999k4632j1003l1477
7421e3329Q287J4847J4551N0312m9493n1317J728K9880k8488p4755N3344Q5411
7409I78L5525J1988K4245k4790J2468R229m3385k7746k309j8349r210m134k6896
7396f2386l0370J7667K9407L8996R696M1949j7937q0447p8151k4745J4175L0876
7384a11270J15002Q213j2502k7253k0564L2533K1211j7132k1494l2864l5759M4942
7372e6937M7569j3776J7357j4806R212M4467r541m145O585J5421M786o6079m6882
7359f6769L6008p536J4437j0456M8753M0878m821j7586L268M590m63l6587K4302
7346B8018o527l5399k6045p247j705J9267L5997J1478j217K5262Q240K0455n858
$$ y = [-55604, 37940, 29743, 4558, 21530, 27566, -68189, -66346, -2216, 13783, -10849, -21852, -53329, -45042, -30195, -15644, 34668, -14825, -66142, -64414, -34534, -63022, -137777, -84433, 978, 36503, 48491, 72736, 47946, 60414, 69643, 26258, -1488, -3797, -22146, -31356, -35490, -62386, -92756, -75089, -45682, -6686, 3010, 44959, 27022, -53425, -131576, -156321, -142146, -111270, 3732, 11945, -557, -27810, -48374, -15841, 5370, -11762, -33256, -66120, -101879, -56937, -9368, -23144, -5787, -20593, -11381, 33086, 23545, 19400, 25985, 41406, 46192, -19887, -66769, -30761, -38297, -23860, -34316, 14437, 55315, 50494, 32908, 36176, 40766, 40303, 3716, 28018, 21491, -13908, -39953, -47200, -48905, -29638, 6359, 17837, 16620, 41882, 50122, 70577, 64719]
7333F4719o3569K4941l4025m5948J0852m0916p134J5192K4880Q6919J8221k8357
7321B5775o2810p2184N907Q1868N1468N1126J1349o2829l7576m7158k5708K910
7309g7862K4967k3822M0963R1092J7189l6897j3082o930j8505J4970k5266L853
7297i330M391r537q926N7498j7203m2504M0540L8535N5768n3645l1671m264J4811
7284C4463K2481l7261j4669L5095O853o4058n0979L9602M0786n612k634k5340
7272b1273R090l5762N588l1674M8742m219q892j7218M973N7688O3640n6231l3918
7259a9466J3399K8978K5685l0429l4790O622J5313J900m6735l3988j687M4489
7247c0709M2542P530m427m1203m7137l6819r233O0634N1432R702K1463L0816k9978
$$ y = [64719, 1150, 26091, -7934, -53882, -43030, -83946, -91080, -75888, -51008, 35911, 54132, 25775, -37035, -109219, -103312, -21444, 30024, 81150, 92499, 29670, -7906, -55064, -80772, -77862, -52895, -76717, -35754, 55338, 72527, 35630, 22548, 15618, -2887, 12083, -13183, -9330, -4939, -14476, -23402, 34096, 16893, -25611, 14929, 53464, 109232, 55587, 23916, 19652, 34463, 56944, 19683, 5014, 40109, 46962, -17096, -68075, -28473, 12313, 6701, 4067, -21273, -12183, -47945, -42357, -74031, -25289, -29508, -38400, -55618, -50645, 7043, 70683, 14452, -19466, -6067, 22911, 48596, 18167, -16623, -10001, 5312, 7212, -39523, -73511, -75198, -30709, 11833, 19363, 14936, -26267, -73404, -110223, -119456, -58822, -7390, 2312, 23775, 54591, 24613]
7234B4613l4979j0940J4338j2604k3798O7120Q6667J4963q0294m5002j9718p110
7222b6744J766l1702j599K9091l0023L7887L4521j8562M3811R135J0319l3869
7210B4031k2970J1127J1335J8607m4392L6195j1487J32K0868K7897n050k0380
7198D5913k5426K6558k0935j6928J6425j2657o35k7233J2954o595o0189o1822
7186a30570l6774J2820m5612q206L1608M4274O9031L4124Q158L304m216l0036
7174e2095R927L7265M9665p827m8528k3178O805J3826j183J5021N9863j464n158
7161E2939K8559l9222j1223J1195j7850n0547l8738O594L0026K2251O639r000
7149h377J0115L9523n8989L373L097r481K7296P355m2077M278j6719K1874l7470
$$ y = [24613, -10366, -21306, -6968, -19572, -43370, 23750, 110417, 125380, 45086, 84, -19634, -26744, -24978, -56680, -58279, -29188, -59211, -21324, 13197, -5365, 38446, 47581, 57900, 24031, 1061, 12188, 23523, 42130, -2262, 33933, 22446, 22578, 43446, 71343, 66293, 45913, 20487, 47045, 26110, 9182, 25607, 12950, 12315, -14918, -1964, -8559, -68748, -130570, -167344, -154524, -200136, -208342, -176734, -132460, -63429, -29305, -21147, -17843, -22059, -52095, -42168, -4903, 44762, 36935, -11593, -34771, -27966, -14140, -15323, -302, 59561, 58097, 52939, 81498, 42276, 31053, 42248, 24398, -26149, -64887, -58293, -28267, -6016, 623, -8377, 1738, 41261, -17728, -14355, -11258, -20739, 6557, 13912, -28165, -23887, -40606, -18732, -56202]
7136e6202j11L8877M271m6264J1386L2507Q206k1708o007j1932J7408J231L459
7123b4879M7461N4191o2503p2270L2133M4262J2425J1657m766m1443J3817j2829
7111b744J0623j2906M545n517j4754j2351j1687k1128K2709N6688k8619j0973
7099b6114k2907m77M9500L7794J5065j0309p461m6999m9613L4268M9526P9731
7087A02004J6666n8497J4762n8927J0721k4054j9124l582O478P847L5815m7772
7075a7663k1024p2125k1626L0900j1240M350L4552j9643O0854J24250Q386r4763
7063E208l2350L0008K4462J6717J0122n8238k2206j3975M24k5851k6805M2498
7051d9986M9885M023R65J6159m2806j669J6763J1713J2124j8222K8260J689m9313
$$ y = [-56202, -56313, -17436, -13165, -59429, -48043, -15536, -7330, -29038, -35045, -46977, -29569, -28338, -24879, 22582, 76773, 14270, -58000, -25867, 18395, 30820, 42477, 37711, -3732, 10085, -2744, 7879, -5027, -482, -5999, -20753, -33104, -44791, -65919, -43210, 13478, -15141, -26114, -49021, -49498, 2, 37796, 52861, 42552, 35091, -11908, -61521, -27253, 22273, 102004, 118670, 60173, 74935, 16008, 26729, 2675, -16449, -20031, -13553, -5706, 30109, -17663, -38687, -110812, -132438, -101538, -112778, -108428, -73876, -93519, -32665, 91585, 99971, 5208, -27142, 2866, 27328, 44045, 54167, -4071, -26277, -40252, -39828, -65679, -92484, -49986, -101, 3922, 4887, 21046, -21760, -23429, -6666, 5047, 17171, -1051, 27209, 28898, -20415]
7038b0415k7652j6179k2995J6658O1310L7470Q804l1202k44L2093m4964M461q756
7025a1611j9739K8895n4208n6825K7543M0044J5951J6869K6989R078o6408n5301
7013i8723m396K1298L0864J07799K9874p8156O156O0322l3779o1755j9601J6021
7001b4076M563l1332k3844J9575J7213Q024l8603J246J0103R139j0870J125J2484
6988d5253k2081J333J0105M4818q76m2263R847M4786j8842j1009K1980l1887M0565
6975A223P9033l185m7491j5948k1522j4457M0388L239j8705Q378m1779p926L2404
6962f348Q0035j307l8281o3337j1167L9255J4700P264k2768L460Q821J3782j9597
6949D512R715k0306m775l289N0196M4530m4600j5254j3903K0586J6451k1598J2934
$$ y = [-20415, -48067, -64246, -87241, -70583, -9273, 28197, 37001, 5799, 5555, 37648, -7316, -2855, -11611, -31350, -2455, -56663, -113488, -85945, -45901, -29950, -13081, 13908, 22986, -43422, -98723, -103119, -81821, -50957, 56842, 86716, 8560, 14716, 75038, 41259, -20496, -40097, -24076, -19513, -50845, -74689, -55114, -37901, -29877, -68480, -67234, -57131, -47992, -58862, -57737, -45253, -67334, -66001, -55896, -11078, -11954, -54217, -44370, 416, -18426, -29435, -7455, -39342, 1223, 80256, 77071, 29580, 13632, -7890, -22347, 18041, 21280, 2575, 10953, -30826, -38752, -6348, 73687, 72380, 34099, -29238, -40405, -1150, 13550, 20814, -1954, 1506, 10327, 24109, 4512, 14227, -6079, -10854, -14143, 36053, 80583, 35983, 20729, 6826, 27412, 43863, 22265, 35199]
6936C5199k609l4214j1385m6668j658N1854Q769J4216o3802M6630J2288l9542
6924c0922j1103O7973J4968n316k4489k7256J6030L0014L9044k2034j1171m7866
6912a2128N839K237m139j7829O367l0325l1207L0341J1735L8514J8342K1359l2270
6899F836J4581J6536m2361j7941n3223J79J0774Q4207L3382n5283o9774J1737
6887f0350Q077J273L0556J4647P837O912m40K7984J9593p749n4496m9591j0922
6874f6669J2770Q3795O438K4948K1783m4651j4328l3536l1489P594K5504J0409
6862B568n5229l4963M3824O2433N1685k9073m8695M2597R7131r900l3200m1339
6850D7839j1086n4373m4750K4675M1539L9046R343o2141o1133K9324J8087O3582
$$ y = [35199, 32590, -1624, -13009, -59677, -61335, -9481, -712, 13504, -50298, -3668, 8620, -30922, -42025, 25948, 40916, 35600, 11111, -16145, -115, 29899, 68943, 46909, 35738, -12128, -6289, -4052, -8191, -26020, -19653, -49978, -81185, -50844, -39109, -595, 17747, 39106, 6836, 21417, 37953, -4408, -22349, -75572, -75393, -64619, 19588, 52970, -2313, -72087, -60350, -52273, -51000, -20444, -5797, 2040, 8952, 8512, 36496, 56089, 48340, -6156, -55747, -66669, -53899, 29896, 36334, 61282, 83065, 38414, 24086, -9450, -40939, -33345, -7841, 2568, -52661, -87624, -43800, 18633, 70318, 41245, -7450, 35147, 132278, 122378, 89178, 47839, 36753, -17620, -62370, -37695, 3844, 42890, 52233, -9908, -71041, -41717, -23630, 39952]
6838C9952L5621o8054J0757N446M27M4142m686p285j2935J869K0602o3491p8827
6825g6462n42M6662N0394J8609L3300m8436m9873M8386O2830n8398j5538K7837
6813C8769L857Q8047m0492j1469o0848m4878J561K8482M854l4877m5034q655O3707
6800a6976J00049k4120M4447m0529l8480J8690K9011M738k6611q1280n4834J0142
6788g5753L2099M5781K195P306n4334k1706n3395n529N6147J7561M7991k1408
6776b3045N6327N3619N2123n0108n0196R359o7347q0574l9110O6087M7635l7855
6764f3085o170k9795L3227N0396n86J0659j0992l1613k080J539o831N7918j4640
6751a2053n7387m8111q341O0100K6997L610M84J2887O4153K2472j2436J0115J0380
$$ y = [39952, 75573, 7519, 18276, 23722, 24149, 68291, 63605, 56320, 43385, 45254, 65856, 2365, -76462, -77004, -30342, 20052, 38661, 71961, 23525, -26348, 22038, 84868, 26470, 10932, 38769, 42626, 130673, 90181, 78712, 17864, -27014, -25453, 3029, 7883, -26994, -72028, -80683, -16976, 83073, 58953, 103400, 62871, 24391, 43081, 72092, 76830, 50219, -31061, -85895, -75753, -43654, 2127, 4322, 11628, -42706, -64412, -117807, -123336, -67189, -49628, -1637, -23045, 33282, 86901, 139024, 88916, 38720, 48079, -19268, -99842, -138952, -72865, -25230, -63085, -69255, -99050, -65823, -15427, -16013, -5354, -16346, -47959, -50039, -48500, -55331, 2587, -12053, -69440, -117551, -125892, -65792, -38795, -35185, -34701, -21814, 42339, 64811, 52375, 62490, 72870]
6738G2870j5461j9508L6742j3117n6784J7509l7514k7898P4392K5870m6899k0997
6726a0795j2014L7897l6195j3027j925P27J5245J8643k9082q149L9699m0710o2180
6713a01866J6029j278J6957R444R664O6874j9480m4689j0756o243J8841J9419
6701b7084O657k6276K5655P494m1481k0704j544k2606M9812J5773R496N4933L5415
6688F5540m3646n4697J3712K1030m2936m8636L7635N8943K983k3434k4754L349
6676c4911k8873K2002P2234P4302l0360r5931l8209J1077J866L3921J4634o0385
6664e8633o5422K4997Q2804k1898M0896j3725k9459K0570K4512K6047L9633j0888
6652E9434m3178l7512k3007J3978j123k2724J5461K4329J8518j5154J660O3399
$$ y = [72870, 57409, 37901, 74643, 61526, 4742, 22251, -15263, -43161, 31231, 57101, 10202, -10795, -22809, 15088, -21107, -34134, -36059, -35332, -20087, -1444, -30526, -38675, 1024, -39686, -101866, -85837, -87115, -70158, -60714, -51050, 15824, -3656, -48345, -59101, -65344, -46503, -27084, -20427, -46703, -21048, -13554, -55035, -75739, -77283, -99889, -50077, -34304, -24808, 30125, 65540, 21894, -32803, -19091, 1939, -40997, -89633, -51998, 6945, 9928, -13506, -38260, -34911, -63784, -41782, 30452, 104754, 74394, -21537, -59746, -48669, -46803, -12882, 1752, -58633, -124055, -99058, -16254, -38152, 2744, -10981, -40440, -19870, 4642, 30689, 70322, 59434, 16256, -21256, -44263, -30285, -31408, -54132, -38671, -14342, 4176, -10978, -9318, 54081]
6640E4081m0587j6205l5053J7058L1348J9908k1602n6270k4679k4685l0672N8726
6628f8632R3591n6536k7352L2131n797j6756J3756k3953N4194J1758K33Q827J0169
6615B5633k1836O021P1423N175J4787L5107l3345K2012P783p4337k5364L2024
6603F5083R005l3235o4263m636J7859O459j4838J3677j1090J6333J6243M4501
6591F1098N187l4966m0769n8136l9627Q0630R8582L249J0331n1187n8499k3207
6579d7314K6893l3688k7129J1895O2263j9012p125O0228K679J9743Q870l7217
6567B1086k9207j6581L0694J9628K5472o9595J4939P6282M5020N96q050J8460
6555A28744l3230n3626j3831P0300o500l9817j9687K3025K0271j2724k7709m4739
$$ y = [54081, 13494, -2711, -37764, -20706, 10642, 30550, 8948, -47322, -72001, -96686, -127358, -68632, 24959, -31577, -58929, -26798, -32595, -49351, -35595, -59548, -5354, 6404, 6637, 15464, 25633, 3797, 9818, 81241, 86416, 101203, 136310, 102965, 124977, 132760, 58423, 33059, 65083, 74088, 40853, -23410, -28046, -10187, -3728, -18566, -4889, -15979, 354, 16597, 61098, 66285, 31319, -9450, -67586, -107213, -26583, 71999, 75248, 85579, 34392, -24107, -47314, -20421, -54109, -81238, -69343, -7080, -26092, -33217, 27011, 29690, 49433, 58303, 21086, -8121, -24702, 5992, 25620, 51092, -18503, -3564, 72718, 117738, 118334, 110284, 128744, 95514, 41888, 28057, 98357, 91857, 52040, 32353, 55378, 75649, 62925, 35216, -9523]
6543i523k4925P759m1536o278L0509M1204L1806n0525k0549M772j7079j8486J9782
6530e3069J0158K8408j7653L674K1602l4208K098j0628J0550N0829K0196O954
6518C8911p828R098N296j3802J6240J2222m661k5525n0786J9428J5365O0499J7579
6505I2036l6304J8130J3672k8466o7046l2088j4563Q878O1030J0379l7639k5754
6493c7735k6507M9948K7405n3213r79N8986J097K1779k1611l0265K1942L0290
6481D1137K716j0907n3073L1778L5322K4387J7826m50l1222m727k6888r696p2155
6468e5952n3430L8609N2792L5716J0001J4137l3001j0687j4940q03N2379N9165
6456I3986l0204j9910k8418j3994j1973l4453j6928k9406L4483K3422j9492j9314
$$ y = [-9523, -34448, -26689, -68225, -74503, -43994, -2790, 29016, -21509, -42058, -37286, -54365, -72851, -53069, -42911, -14503, -32156, -28482, -6880, -41088, -38990, -49618, -39068, 11761, 31957, 38911, 31083, 40181, 45477, 31675, 47915, 60137, 55476, 29951, -20835, -1407, 13958, 74457, 92036, 55732, 73862, 87534, 59068, -7978, -40066, -54629, -45751, 15279, 25658, -11981, -37735, -64242, -14294, 13111, -40102, -41081, 17905, 19002, 40781, 19170, -11095, 10847, 41137, 43853, 32946, -20127, 11651, 46973, 71360, 89186, 88736, 57514, 52787, 25899, 16203, -55952, -109382, -70773, -17981, 17735, 27736, 41873, 8872, -1815, -16755, -17558, 34821, 93986, 63782, 43872, 15454, 1460, -10513, -44966, -61894, -91300, -56817, -33395, -52887, -72201]
6444g2201n467l9396L4145L2068O585K5875L3885o214j0726R800K4113P524J1987
6431E1978k0092n1163p5057J6535L3142K836j808R326m9441K9050J2982l281P82
6418d4211P534k8196j7356L9346J517k4517n3753N588L7954O5486n7719k8155
6406i6482R530P3134m410K1668n2460k1531M7751N1299l0756o5226L1816P3914
6394C8247L0413l210l8806J2377J6978J9040o758n3206k861M8277L1087m5136
6382D6442o2020k2039q684j2858l0952M3523P132j3333L0410M6537k4975q3349
6370h4166Q054N1834Q8992k8452j01222j1359K2674O3910L6449q850j1693n0707
6358b4536o2716K0377j3166L1569L2649k8515j1865M1789K6973j200N1293L7154
$$ y = [-72201, -77668, -117064, -82919, -50851, -44266, -18391, 15494, 9280, -1446, 8354, 32467, 39991, 51978, 31886, -19277, -94334, -77799, -44657, -41821, -43629, -34303, -83744, -54694, -41712, -44993, -44211, -36677, -64873, -82229, -42883, -41366, -65883, -119636, -114048, -76094, -10608, -68327, -96482, -86952, -13818, -18228, 3440, -49020, -70551, -22800, 28499, -2257, -67483, -35667, 38247, 68660, 65450, 26644, 39021, 55999, 75039, 68281, 15075, 12214, 60491, 91578, 46442, -15578, -37617, -46301, -59159, -90111, -46588, -39456, -52789, -22379, 24158, -817, -84166, -76112, -24278, 64714, 36262, -64960, -76319, -53645, 10265, 46714, 37864, 26171, -24536, -87252, -66875, -80041, -48472, -15823, -44338, -56203, -14414, 12559, 11359, 62652, 99806]
6346I9806k8453p2812j257k1835K096P4204k7181q0357K470K1805L8093K4620
6334C1199m3286l49j3537l0950O1124M3852k8751L2379j977n5342l9039J2451
6322c2226J7522O1811P969n0957m1342k4205K7187n853p483k7618j9024L2240
6310f1979M7493K3089k6493l2230L7946J3143j4871n947N3675J3007j6449m2981
6298a2597n8975n6555J1443N7251N1836R975j2768Q738k2464m7123L6922N0250
6286A5933M7822k4435m7883J5981l8358N2937O0796o3500k9159K0505k3898l9537
6274e2796N1730J1191k7711K3856N6790l3770q1530k5153k3807n432K4230k4063
6262a06465J213J8868P2357L2460J1918L3709L2813l3978j9013M5617m871p998
$$ y = [99806, 71353, -1459, -2716, -24551, -22455, 51749, 24568, -55789, -53319, -31514, 6579, 31199, -12087, -12436, -25973, -56923, 4201, 48053, 19302, 51681, 49704, -5638, -44677, -32226, -14704, 47107, 55076, 4119, -37223, -61428, -34241, -40094, -47577, -75195, -94219, -61979, -14486, 8603, -17890, -50120, -12174, 969, -13902, -19849, 33826, 46833, 30384, -12597, -71572, -128127, -116684, -59433, -7597, 2378, -10390, -1652, -24116, -71239, -34317, 15933, 63755, 39320, -8563, 7418, -30940, 21997, 82793, 19293, -9866, 10639, -13259, -52796, -1066, 10125, -17586, 6270, 63060, 29290, -52240, -77393, -101200, -106632, -82402, -106465, -105252, -86384, -14027, 18433, 30351, 64060, 96873, 62895, 43882, 89499, 84628, 76630]
6250G6630n1556n1393j0748q104m849m0426P324K6825M0281M0366L0241k758L5795
6237H7628r348l1609j3859o027J1709J7407q249l0013K153p617P335J1621J8987
6224E0118l6114L1539J6092p854p0838n5407m67P420M6622O5157P091J5807J1961
$$ y = [76630, 25074, -26319, -37067, -45171, -50020, -90446, -83122, -56297, -16016, 24350, 54591, 51833, 87628, 78280, 46671, 32812, 26785, 38494, 55901, 47652, 17639, 19792, 12175, 19510, 31131, 50118, 14004, 45543, 61635, 53781, -17057, -72464, -72931, -65511, -18889, 46268, 53359, 69166, 81127]
$$ [...]
##END NTUPLES=NMR SPECTRUM
##END=
