##TITLE=Analysis number 308388
Compound Code sew 02756
Project Code adrs
Chemist Name prosynth
##JCAMPDX= 6.0         $$ Bruker NMR JCAMP-DX V2.0
##DATA TYPE= NMR SPECTRUM
##DATA CLASS= NTUPLES
##ORIGIN= Bruker BioSpin GmbH
##OWNER= NMR
$$ XWIN-NMR		Version 3.5
$$ Tue May 24 13:05:32 2005 GMT Daylight Time (UT+1h)  MAYBRIDGE\NMR@NMR_250MHZ
##.OBSERVE FREQUENCY= 250.131544655141
##.OBSERVE NUCLEUS= ^1H
##.ACQUISITION MODE= SIMULTANEOUS (DQD)
##.ACQUISITION SCHEME= undefined
##.AVERAGES= 16
##.DIGITISER RES= 18
##SPECTROMETER/DATA SYSTEM= dpx250
##.PULSE SEQUENCE= zg30
##.SOLVENT NAME= CDCl3
##.SHIFT REFERENCE= (INTERNAL, CDCl3, 0, 16.522)
##AUDIT TRAIL= $$ (NUMBER, WHEN, WHO, WHERE, WHAT)
$$ ##TITLE= Audit trail, XWIN-NMR		Version 3.5
$$ ##JCAMPDX= 5.01
$$ ##ORIGIN= Bruker BioSpin GmbH
$$ ##OWNER= NMR
$$ C:\u/data/dgb/nmr/ADRS/3450/pdata/1/auditp.txt
$$ ##AUDIT TRAIL=  $$ (NUMBER, WHEN, WHO, WHERE, WHAT)
(   1,<2005-05-24 13:05:14.10 +100>,<MAYBRIDGE\NMR>,<NMR_250MHZ>,
      <created by zg, POWCHK disabled, PULCHK disabled
       configuration hash MD5:
       62 19 C7 07 E1 42 D1 B7 37 6C 3D D0 77 39 F9 E6
       data hash MD5: 64K
       C4 14 9B E4 5F 3C 7F 68 82 6F 54 07 FC 36 5C 65>)
(   2,<2005-05-24 13:05:25.20 +100>,<MAYBRIDGE\NMR>,<NMR_250MHZ>,
      <Start of raw data processing
       ef LB = 0.3 FT_mod = 6 PKNL = 1 SI = 32K 
       data hash MD5: 32K
       DD 74 3A 94 E1 A8 C4 04 D7 85 62 BE 6B 49 92 E9>)
(   3,<2005-05-24 13:05:27.13 +100>,<MAYBRIDGE\NMR>,<NMR_250MHZ>,
      <apk 
       data hash MD5: 32K
       A6 65 45 96 80 9D 09 A5 D6 F4 85 A6 0A 71 90 E1>)
(   4,<2005-05-24 13:05:27.84 +100>,<MAYBRIDGE\NMR>,<NMR_250MHZ>,
      <abs ABSG = 5 
       data hash MD5: 32K
       D1 A6 86 1B C5 97 BD C6 9B C7 2D B5 55 5A 13 6D>)
$$ ##END=
$$ 
$$ hash MD5
$$ 8C 98 93 BE E7 8B 1F BA 83 39 7A 0C 3E 34 D5 D0
##$RELAX= 
##$RELAX= 
##$RELAX= 
##$RELAX= 
##$RELAX= 
##$RELAX= 
##$RELAX= 
$$ Bruker specific parameters
$$ --------------------------
##$DU= <C:\u>
##$EXPNO= 3450
##$NAME= <ADRS>
##$PROCNO= 1
##$TYPE= <nmr>
##$USER= <dgb>
##$AMP= (0..31)
100 100 100 100 100 100 100 100 100 100 100 100 100 100 100 100 100 100 
100 100 100 100 100 100 100 100 100 100 100 100 100 100 
##$AQSEQ= 0
##$AQ_mod= 3
##$AUNM= <au_zg>
##$AUTOPOS= <30 >
##$BF1= 250.13
##$BF2= 250.13
##$BF3= 250.13
##$BF4= 250.13
##$BF5= 500.13
##$BF6= 500.13
##$BF7= 500.13
##$BF8= 500.13
##$BYTORDA= 1
##$CFDGTYP= 0
##$CFRGTYP= 5
##$CHEMSTR= <none>
##$CNST= (0..31)
1 1 145 1 1 1 1 1 1 1 1 1 1 1 1 1 1 1 1 1 1 1 1 1 1 1 1 1 1 1 1 1 
##$CPDPRG= <>
##$CPDPRG1= <>
##$CPDPRG2= <>
##$CPDPRG3= <>
##$CPDPRG4= <mlev>
##$CPDPRG5= <mlev>
##$CPDPRG6= <mlev>
##$CPDPRG7= <mlev>
##$CPDPRG8= <mlev>
##$CPDPRGB= <>
##$CPDPRGT= <>
##$D= (0..31)
0 1 0 0 0 0 0 0 0 0.06 0 0 0 0 0 0 0.0002 0 0 0 0 0 0 0 0 0 0 0 0 0 0 
0 
##$DATE= 1116936313
##$DBL= (0..7)
120 120 120 120 120 120 120 120 
##$DBP= (0..7)
150 150 150 150 150 150 150 150 
##$DBP07= 0
##$DBPNAM0= <>
##$DBPNAM1= <>
##$DBPNAM2= <>
$$ [...]
##$SUBNAM7= <"">
##$SUBNAM8= <"">
##$SUBNAM9= <"">
##$SW= 20.6930455092707
##$SWIBOX= (0..15)
0 0 3 0 0 0 0 0 0 0 0 0 0 0 0 0 
##$SW_h= 5175.983436853
##$TD= 65536
##$TD0= 1
##$TE= 295.16
##$TE2= 300
##$TE3= 300
##$TEG= 300
##$TL= (0..7)
0 120 120 120 120 120 120 120 
##$TP= (0..7)
150 150 150 150 150 150 150 150 
##$TP07= 0
##$TPNAME0= <>
##$TPNAME1= <>
##$TPNAME2= <>
##$TPNAME3= <>
##$TPNAME4= <>
##$TPNAME5= <>
##$TPNAME6= <>
##$TPNAME7= <>
##$TPOAL= (0..7)
0.5 0.5 0.5 0.5 0.5 0.5 0.5 0.5 
##$TPOFFS= (0..7)
0 0 0 0 0 0 0 0 
##$TUNHIN= 0
##$TUNHOUT= 0
##$TUNXOUT= 0
##$USERA1= <user>
##$USERA2= <user>
##$USERA3= <user>
##$USERA4= <user>
##$USERA5= <user>
##$V9= 5
##$VALIST= <valist>
##$VCLIST= <CCCCCCCCCCCCCCC>
##$VD= 0
##$VDLIST= <DDDDDDDDDDDDDDD>
##$VPLIST= <PPPPPPPPPPPPPPP>
##$VTLIST= <TTTTTTTTTTTTTTT>
##$WBST= 1024
##$WBSW= 4
##$XGAIN= (0..3)
0 0 0 0 
##$XL= 0
##$YL= 0
##$YMAX_a= 904380
##$YMIN_a= -812038
##$ZGOPTNS= <>
##$ZL1= 120
##$ZL2= 120
##$ZL3= 120
##$ZL4= 120
##$ABSF1= 16.522
##$ABSF2= -4.171173
##$ABSG= 5
##$ABSL= 3
##$ALPHA= 0
##$AQORDER= 0
##$ASSFAC= 0
##$ASSFACI= 0
##$ASSFACX= 0
##$ASSWID= 0
##$AUNMP= <proc_1d>
##$AZFE= 0.1
##$AZFW= 0.1
##$BCFW= 0
##$BC_mod= 0
##$BYTORDP= 0
##$COROFFS= 0
##$CY= 12.5
##$DATMOD= 1
##$DC= 0
##$DFILT= <>
##$DTYPP= 0
##$F1P= 14.0000005364418
##$F2P= -0.99999901652339
##$FCOR= 0.5
##$FTSIZE= 32768
##$FT_mod= 6
##$GAMMA= 0
##$GB= 0
##$INTBC= 1
##$INTSCL= 1
##$ISEN= 128
##$LB= 0.3
##$LEV0= 0
##$LPBIN= 0
##$MAXI= 10000
##$MC2= 0
##$MEAN= 0
##$ME_mod= 0
##$MI= 0
##$NCOEF= 0
##$NC_proc= -2
##$NLEV= 6
##$NOISF1= 0
##$NOISF2= 0
##$NSP= 0
##$NTH_PI= 0
##$NZP= 0
##$OFFSET= 16.522
##$PC= 1
##$PHC0= -73.25993
##$PHC1= 2.476215
##$PH_mod= 1
##$PKNL= yes
##$PPARMOD= 0
##$PSCAL= 4
##$PSIGN= 0
##$REVERSE= no
##$SF= 250.13
##$SI= 32768
##$SIGF1= 0
##$SIGF2= 0
##$SINO= 400
##$SIOLD= 32768
##$SREGLST= <1H.CDCl3>
##$SSB= 0
##$STSI= 32768
##$STSR= 0
##$SW_p= 5175.98343685301
##$SYMM= 0
##$S_DEV= 0
##$TDeff= 65536
##$TDoff= 0
##$TI= <Analysis number 999999
Compound Code 99
Book Reference 9
Project Code 9>
##$TILT= no
##$TM1= 0
##$TM2= 0
##$TOPLEV= 0
##$USERP1= <user>
##$USERP2= <user>
##$USERP3= <user>
##$USERP4= <user>
##$USERP5= <user>
##$WDW= 1
##$XDIM= 32768
##$YMAX_p= 510618457
##$YMIN_p= -249779
$$ End of Bruker specific parameters
$$ ---------------------------------
##NTUPLES= NMR SPECTRUM
##VAR_NAME=  FREQUENCY,     SPECTRUM/REAL,   SPECTRUM/IMAG
##SYMBOL=    X,             R,               I
##VAR_TYPE=  INDEPENDENT,   DEPENDENT,       DEPENDENT
##VAR_FORM=  AFFN,          ASDF,            ASDF
##VAR_DIM=   32768,         32768,           32768
##UNITS=     HZ,            ARBITRARY UNITS, ARBITRARY UNITS
##FACTOR=    0.157963299565203, 1,           1
##FIRST=     4132.6476996994, 0,             0
##LAST=      -1043.33573715361, 0,           0
##MIN=       -1043.33573715361, -249779,     0
##MAX=       4132.6476996994, 510618457,     0
$$ Real data points
##PAGE= N=1
##DATA TABLE= (X++(R..R)), XYDATA
$$ [...]
$$ plain form
25092 -3678 1598 2090 740 61 -1184 3236 5417 -756 3321 6382 -970 -3402 -6106 -12520 -7685
25077 -7685 -1606 3454 5106 6861 7065 834 -7232 -7752 -2355 -3914 -1738 2527 8509 8416 3220 -2270
25061 -2270 -3240 -1367 -6624 -10038 -9968 -5930 -2906 -1187 1906 9121 8417 2523 -4456 -14964 -9069
25046 -9069 -1405 1027 3825 1367 -6245 -449 749 -9173 -16225 -19317 -19089 -15285 -7575 -9525 -7056
25031 -7056 -2476 -4324 -7888 -8246 -5585 -4706 -6287 27 -2048 -6688 -5599 -6103 -3136 -2190 -9664 -11369
25015 -11369 -8748 737 6044 -5625 -11279 -7565 -4964 -11753 -11127 -10097 -7281 -9526 -10129 -8555 -10723
25000 -10723 -1678 4326 -669 80 3073 -1277 -4205 -8821 -6566 -1930 -1554 33 6217 11491 10576
24985 10576 13698 16238 10947 -772 -7360 -3615 -4470 -8731 -3677 -5339 -4551 29 -3658 -11869 -12624
$$ packed form
25092c678N276M92j350o79j245M420K181o173M077L061p352k432k704o414M835
25077g685O079N060J652J755K04o231q066n20N397j559K176M265N982r3n196n490
25061b270r70J873n257l414P0M038L024J719L093P215p04n894o979j0508N895
25046i069P664K432K798k458p612N796J198r922p052l092K28L804P710j950K469
25031g056M580j848l564l58K661Q79j581O314k075m640J089n04K967R46p474j705
25015a1369K621R485N307j1669n654L714K601o789O26J030K816k245o03J574k168
25000a0723R045O004m995P49K993m350k928m616K255M636L76J587O184N274r15
24985A0576L122K540n291j1719o588L745q55m261N054j662P88M580l687q211p55
$$ plain form
24970 -12624 -12579 -8922 -7005 -13218 -14111 -6756 -3202 -813 -3643 -11871 -19729 -23091 -16427 -4191 -1798
24955 -1798 -3233 -320 -6955 -5782 -4766 -4858 -6766 240 5277 6733 13034 12174 9011 7174 1895
24940 1895 -2139 -3408 362 803 -1605 -4559 -4912 -1172 2441 3395 -1379 -4605 -1245 4833 547
24925 547 -3364 1046 5378 2773 -275 3562 2871 -1945 -3897 2241 -1435 -4909 -1549 -4524 -5414
24910 -5414 -2750 1065 5716 10709 13151 7312 9319 3303 -1114 3833 -1901 -4101 -42 1463 -226
24895 -226 -951 -152 -695 -9435 -10916 -707 4368 2436 -7536 -5884 -3836 -1348 -2724 -8912 -12664
24880 -12664 -14708 -4212 115 1542 2475 -503 -5492 -9702 -8350 -3535 -1109 6925 8649 2730
24866 2730 -3144 -1016 2682 1121 1750 -941 -526 1822 -4146 -1657 -1622 -5273 -6639 -829 -1540 -1973
$$ packed form
24970a2624M5L657J917o213q93P355L554K389k830q228p858l362O664J2236K393
24955a798j435K913o635J173J016r2j908P006N037J456O301q60l163j837n279
24940A895m034j269L770M41k408k954l53L740L613R54m774l226L360O078m286
24925E47l911M410M332k605l048L837o91m816j952O138l676l474L360k975q90
24910e414K664L815M651M993K442n839K007o016m417M947n734k200M059J505j689
24895b26p25P99n43q740j481J0209N075j932r972J652K048K488j376o188l752
24880a2664k044J0496M327J427R33k978m989m210J352M815K426Q034J724n919
24866B730n874K128L698j561O29k691M15K348n968K489L5l651j366N810p11m33
$$ plain form
24850 -1973 -1374 3703 855 -5804 -3706 4675 15052 16831 11831 5757 5318 5182 1547 -7486 -10553
24835 -10553 -4484 -6022 -9766 -4263 3694 2005 85 -2287 -5627 -3323 -6671 -5714 194 -1854 -1122
24820 -1122 -609 -183 -757 6578 5370 -2201 -8297 -9208 -7504 -1743 -2324 -1298 1949 5715 2642 1475
24804 1475 725 -889 2631 -4370 -12873 -7260 -1234 2466 4959 2111 2383 2889 1082 663 -5626 -5253
24788 -5253 -6848 -11319 -8629 -6289 301 4625 4513 4121 2586 1422 -91 -6292 -3328 135 -2741
24773 -2741 -45 105 -471 -2859 -8041 -582 3353 4952 1302 -5331 -9697 -8867 -7929 -2635 2520 5761
24757 5761 4398 3698 4302 -647 1089 -3502 -7752 236 6140 2701 -2586 -7192 -7574 -1266 587
24742 587 -5387 -7249 -5620 -7219 -4522 -1786 -7709 -5782 -3433 -392 -4027 -7389 -11160 -5481 -8533
$$ packed form
24850a973N99N077k848o659K098Q381J0377J779n000o074m39j36l635r033l067
24835a0553O069j538l744N503P957j689j920k372l340K304l348R57N908k048P32
24820a122N13M26n74P335j208p571o096r11J704N761n81J026L247L766l073j167
24804A475p50j614L520p001q503N613O026L700K493k848K72N06j807m19o289L73
24788e253j595m471K690K340O590M324j12l92j535j164j513o201K964L463k876
24773b741K696J50n76k388n182P459L935J599l650o633m366Q30R38N294N155L241
24757E761j363p00O04m949J736m591m250P988N904l439n287m606l82O308J853
24742E87n974j862J629j599K697K736n923J927K349L041l635l362l771N679l052
$$ plain form
24727 -8533 -10331 -12027 -12816 -5956 -4210 -3291 1214 3991 -6860 -9891 -6766 4025 2276 3505 4304
24712 4304 -183 2673 6980 2843 -2211 -260 -2155 -6493 -797 4004 320 -3314 1935 1330 -3646
24697 -3646 -1060 -1461 -10362 -11896 -11805 -14807 -15688 -10430 -9004 -2571 4045 7043 -1020 -2062 -3295 -5483
24681 -5483 -3185 -2208 389 -2776 3577 4372 5790 2592 -638 -4219 -7859 -1173 1900 -1351 -293
24666 -293 5355 8007 5661 11103 8459 836 -209 -5622 -8621 -4860 -8383 -2612 5044 5160 3603
24651 3603 7754 10089 10353 8518 7649 713 -4519 -6316 -6411 -2422 1427 -5442 -6594 -2721 -2572 -1308
24635 -1308 1623 -1111 -8605 -11807 -12902 3177 6587 5672 -822 3156 6556 -270 -1826 -205 184
24620 184 169 -1331 -6968 -10846 -8405 -11580 -12329 -9171 -5559 -2670 5557 665 6179 7649 2580 -4712
$$ packed form
24727h533j798j696p89O860J746R19M505K777j0851l031L125J0791j749J229P99
24712D304m487K856M307m137n054J951j895m338N696M801l684l634N249o05m976
24697c646K586m01q901j534R1l002q81N258J426O433O616K998q063j042j233k188
24681e483K298R77K597l165O353P95J418l198l230l581l640O686L073l251J058
24666b93N648K652k346N442k644p623j045n413k999L761l523N771P656J16j557
24651C603M151K335K64j835q69o936n232j797r5L989L849o869j152L873J49J264
24635a308K931k734p494l202j095J6079L410r15o494L978L400o826j556J621L89
24620A84j5j500n637l878K441l175p49L158L612K889Q227m892N514J470n069p292
$$ plain form
24604 -4712 -6315 3274 8566 4321 5084 10109 12693 10445 6688 -531 -7699 -2978 -804 3302 5125
24589 5125 8892 2509 -4223 -8519 -9277 -4391 -3138 -3243 -3732 -5919 -2724 -712 -3539 -4589 57
24574 57 -5060 -5702 -1101 -3218 1387 3178 -2048 -1943 -7946 -12545 -9306 -9375 -9028 -7475 -4862 3838
24558 3838 2695 2147 3053 -427 -542 2030 4835 588 -794 -4543 -9934 -1824 3608 274 -6929
24543 -6929 -8996 1318 3799 3529 2824 -208 1223 751 -889 -6449 -13956 -15922 -12163 -3036 3246
24528 3246 1550 -3363 -1642 -6123 -8372 -6135 -4896 -6925 -9353 -11639 -8241 -4182 -6901 -8843 -1096
24513 -1096 5697 -4309 -3796 -964 -6897 -4523 -3792 -2357 -4441 2203 914 6761 11976 17069 6208
24498 6208 2134 3459 7416 8070 7241 450 -4360 -114 1478 124 -2346 -10414 -9455 -5679 503
$$ packed form
24604d712j603R589N292m245P63N025K584k248l757p219p168M721K174M106J823
24589E125L767o383o732m296p58M886J253j05m89k187L195K012k827j050M646
24574E7n117o42M601k117M605J791n226J05o003m599L239o9L47J553K613Q700
24558C838j143n48R06l480j15K572K805m247j382l749n391Q110N432l334p203
24543f929k067J0314K481k70p05l032J431m72j640n560p507j966L759R127O282
24528C246j696m913J721m481k249K237J239k029k428k286L398M059k719j942P747
24513a096O793j0006N13K832n933K374P31J435k084O644j289N847N215N093j0861
24498F208m074J325L957O54q29o791m810M246J592j354k470q068R59L776O182
$$ plain form
24483 503 -806 -2338 4669 9471 7519 550 -3653 -2424 -966 -882 -2427 -7578 -2276 4271 3901 4567
24467 4567 4910 1528 2242 1492 3555 8414 5974 2317 3990 9344 11946 17075 11949 15783 9529
24452 9529 44 -4296 -13118 -9779 -5958 1529 5257 7014 7897 9376 8079 10790 7885 4242 5448
24437 5448 8699 12036 12709 13985 9875 13498 15992 5495 -2284 -10284 -14874 -11489 -1607 58 -2644
24422 -2644 2558 726 -2753 -5779 -9898 -7934 -595 9575 13016 8108 7960 4793 1888 -2586 -2232
24407 -2232 3052 6549 8709 9730 3285 4877 6309 2349 -3175 1334 5272 3847 11058 8161 4873
24392 4873 -33 -1429 119 -7368 -8071 -2736 2103 9913 15674 18586 13721 6042 -2408 -8136 -770
24377 -770 5090 659 -7739 -8988 -5303 749 2680 352 -50 -7947 -10958 -9211 -7873 -10362 -193
$$ packed form
24483E03j309j532P007M802j952o969m203J229J458Q4j545n151N302O547l70O66
24467D567L43l382P14p50K063M859k440l657J673N354K602N129n126L834o254
24452I529r485m340q822L339L821P487L728J757Q83J479j297K711k905l643J206
24437E448L251L337O73J276m110L623K494j0497p779q000m590L385R882J665k702
24422b644N202j832l479l026m119J964P339J0170L441m908j48l167k905m474L54
24407b232N284L497K160J021o445J592J432l960n524M509L938j425P211k897l288
24392D873m906j396J548p487p03N335M839P810N761K912m865p679q450n728P366
24377g70N860m431q398j249L685O052J931k328m02p897l011J747J338k489J0169
$$ plain form
24362 -193 9443 10218 9098 5781 6146 1417 2554 1148 -4324 -5457 -2270 1259 -4261 -6627 -3599
24347 -3599 -2534 -11004 -12050 -11685 -12070 -8900 -3086 392 -6978 -1411 2369 5875 8930 4225 -1110
24332 -1110 129 -3289 -5671 -3728 -2050 1750 3581 8431 8439 793 -1754 -2050 3239 4717 4231 909
24316 909 1068 3197 -295 -6092 -4081 -3488 -9328 -5235 -3969 -1777 426 927 963 5005 4497 -1020
24300 -1020 -2709 -5518 -10487 1259 2480 7511 8171 2795 -4475 -3875 3962 11469 7002 2071 1278
24285 1278 765 1739 2992 2841 1323 69 -1483 -2713 527 3516 11889 10200 3594 -160 -1081 55
24269 55 3201 4470 4686 6446 4704 942 -4663 -3517 2051 1779 -1299 -2084 2876 7620 2941 -1179
24253 -1179 1621 2751 9295 4565 -5593 -7710 -8566 -7815 -5553 -5816 -6173 -7381 -9232 -12849 -15282
$$ packed form
24362a93R636P75j120l317L65m729J137j406n472j133L187L529n520k366L028
24347c599J065q470j046L65l85L170N814L478p370N567L780L506L055m705n335
24332a110J239l418k382J943J678L800J831M850Qp646k547k96N289J478m86l322
24316I09J59K129l492n797K011N93n840M093J266K192K203N01L6M042n08n517
24300a020j689k809m969J1746J221N031O60n376p270O00P837P507m467m931p93
24285A278n13R74J253j51j518j254j552j230L240K989Q373j689o606l754r21J136
24269E5L146J269K16J760j742l762n605J146N568k72l078p85M960M744m679m120
24253a179K800J130O544m730j0158k117q56P51K262k63l57j208j851l617k433
$$ plain form
24238 -15282 -11299 -11580 -15035 -12364 -7699 -3941 11182 10308 4759 4725 2470 2321 5802 8412 4884
24223 4884 -2458 -5583 -5854 -5294 -3642 -1183 6304 4884 -4494 -3909 -7230 -9640 -10901 -6601 2053
24208 2053 2000 -113 -3639 -5613 -5519 -4312 -423 1344 -1925 -5129 -5231 -5597 -9242 -7201 -5401 -6408
24192 -6408 -11376 -10848 -7359 -14336 -10796 -13167 -11727 -9047 -7711 -8582 -7045 -7612 -6929 -3871 3432 2069
24176 2069 1315 284 1507 397 -1431 -10233 -8787 -7050 -9015 -7808 -849 -759 1923 -4738 -12357
24161 -12357 -1939 -5749 -3755 -381 -1690 -160 3333 6588 681 -4828 -8775 -3494 -1363 -8752
24147 -8752 -8309 -2822 2689 2497 -3828 -4552 -294 3279 1262 2126 2292 1605 4559 6544 2449 5704
24131 5704 10279 264 -6358 -8047 -5286 -731 2635 -1569 864 722 -3607 16 7047 7046 10499
$$ packed form
24238a5282L983k81l455K671M665L758J5123q74n549l4k255j49L481K610l528
24223D884p342l125k71N60J652K459P487j420r378N85l321k410j261M300Q654
24208B053n3k113l526j974R4J207L889J767l269l204j02l66l645K041J800j007
24192f408m968N28L489o977L540k371J440K680J336q71J537n67O83L058P303j363
24176B069p54j031J223j110j828q802J446J737j965J207O959R0K682o661p619
24161a2357J0418l810J994L374j309J530L493L255n907n509l947N281K131p389
24147h752M43N487N511j92o325p24M258L573k017Q64J66o87K954J985m095L255
24131E704M575j0015o622j689K761M555L366m204K433j42m329L623P031jL453
$$ plain form
24116 10499 6673 2381 6257 8591 7239 3248 4165 10162 13175 11640 7109 1816 -64 -6880 -2537
24101 -2537 1995 -2188 -10100 -7267 -2810 -2683 820 4267 6357 4181 2914 7837 2681 -2603 -4350
24086 -4350 -2710 -1991 1376 1858 -2506 -3048 -2052 -3137 -7707 -9839 -6280 2072 463 -6773 -15508 -15374
24070 -15374 -10179 -8928 -3048 46 -803 -6116 -2807 -3741 52 437 492 -1031 -1874 -3915 -5750 -14266
24054 -14266 -15201 -15713 -9791 -3099 -3628 -5225 -7744 -5148 7088 12025 7085 -4329 -12814 -11606 -4571
24039 -4571 -4758 -6460 -9677 -6603 -8108 -8830 -1205 3818 200 -736 3058 3883 5367 2533 2685 -173
24023 -173 -4058 -4710 -5953 -7130 -12105 -11237 -7155 -5812 -8721 -5756 -3186 -1322 3836 2722 3666 2785
24007 2785 -2794 382 -935 825 3119 2774 -3512 -5763 -10228 -11773 -10957 -5357 -19 1006 467
$$ packed form
24116A0499l826m292L876K334j352l991R17N997L013j535m531n293j880o816M343
24101b537M532m183p912K833M457J27L503L447K090k176j267M923n156n284j747
24086d350J640P19L367M82m364n42R96j085m570k132L559Q352j609p236q735J34
24070a5374N195J251N880L094q49n313L309r34L793L85N5j523q43k041j835q516
24054a4266r35n12N922O692n29j597k519K596J2236M937m940j1414q485J208P035
24039d571j87j702l217L074j505p22P625N023l618r36L794Q25J484k834J52k858
24023a73l885o52j243j177m975Q68M082J343k909K965K570J864N158j114R44q81
24007B785n579L176j317J760K294l45o286k251m465j545Q16N600N338J025n39
$$ plain form
23992 467 3484 4818 10625 9182 8541 -1364 -11942 -3657 3716 -89 -5261 -5121 -2591 -1436 -4517
23977 -4517 -641 -3342 -5133 -5727 -13906 -16182 -15336 -14026 -6226 2834 -788 -1799 64 -2886 -4368
23962 -4368 291 -1582 -6956 -7878 2248 4805 5430 1282 2653 6325 8259 6967 3257 -3961 -486
23947 -486 -5006 -10786 -5512 -6894 -7321 -4411 -2887 -7291 -9979 -8551 -6576 -4149 -4262 -1834 -1078 -528
23931 -528 -1158 -4730 -4287 -5567 -5673 -7480 -6326 -2933 -4880 -2304 -7466 -9791 -10415 -3627 -5966 -11771
23915 -11771 -10632 -3246 1863 3110 1679 1214 1627 -763 -2967 8999 16898 20676 20515 20200 16427
23900 16427 6662 178 -3969 -6156 -14600 -17721 -15839 -11793 -10354 -10103 -10568 -10666 -17753 -9896 -3920
23885 -3920 -772 -1795 -7623 -7493 -8104 -10472 -7825 -4927 -1715 -4772 -8324 -4319 2227 -760 -4019
$$ packed form
23992D67L017J334N807j443o41r905j0578Q285P373l805n172J40K530J155l081
23977d517L876k701j791n94q179k276Q46J310P800R060l622j011J863k950j482
23962d368M659j873n374r22J0126K557O25m148J371L672J934j292l710p218L475
23947d86m520n780N274j382m27K910J524m404k688J428J975K427j13K428P56N50
23931e28o30l572M43j280j06j807J154L393j947K576n162k325o24O788k339n805
23915a1771J139P386N109J247j431m65M13k390k204J1966P899L778j61l15l773
23900A6427r765o484m147k187q444l121J882M046J439K51m65r8p087P857N976
23885c920L148j023n828J30o11k368K647K898L212l057l552M005O546k987l259
$$ plain form
23870 -4019 -4357 -8900 -10084 -2985 5246 6382 6439 -2943 -8049 -6275 -4706 -4326 -3637 -7237 -9630 -9452
23854 -9452 -11847 -1597 -2020 -10582 -13232 -8750 -2898 -3426 -8737 -8314 -4924 -2980 -4715 -265 2821
23839 2821 -3147 -4842 -1454 651 6086 1054 -8428 -8570 -5508 -3835 -849 143 -2019 -2880 -1810
23824 -1810 -1466 -2145 -4134 525 3467 732 1244 3613 -1772 -769 -1401 -7674 -8751 -3142 946 -3346
23808 -3346 -7255 -6760 -11356 -3539 2822 616 -1706 -8373 -7721 -4609 -376 1575 3155 -756 -5919
23793 -5919 -7864 -11538 -12478 -13158 -8479 -5516 -4420 -5941 -6479 -3120 5154 5919 -4847 -7512 -7451 -12164
23777 -12164 -11764 -12173 -10747 -12531 -14979 -9035 -10569 -11025 -4581 -4055 -3719 -1853 -2631 -7461 -12246 -18953
23761 -18953 -21885 -21703 -14146 -5244 -786 461 -1595 -6852 -8395 -1467 2298 -739 -5064 -13644 -19764
$$ packed form
23870d019l38m543j184P099Q231J136N7r382n106J774J569L80O89l600k393J78
23854i452k395J0250m23q562k650M482N852n28n311M23L390J944j735M450L086
23839B821n968j695L388K105N435n032r482j42L062J673K986R92k162q61J070
23824a810L44o79j989M659K942k735N12K369n385J003o32o273j077N609M088m292
23808c346l909M95m596P817O361k206k322o667O52L112M233J951J580l911n163
23793e919j945l674r40o80M679K963J096j521n38L359Q274P65j0766k665O1m713
23777a2164M00m09J426j784k448N944j534m56O444N26L36J866p78m830m785o707
23761a8953k932J82P557Q902M458J247k056n257j543O928L765l037m325q580o120
$$ plain form
23746 -19764 -18961 -5043 535 -4011 -7354 -7473 -4493 -4765 -4786 -8610 -14980 -19245 -18092 -12567 -6697
23731 -6697 -7536 -11731 -9990 -6184 -8019 -8638 -6072 -2960 6028 7626 7287 1938 1085 3172 4109 -3421
23715 -3421 -4471 -7141 -7227 -5601 -1898 482 1238 5672 4104 3656 -762 871 1347 -4284 -6590 -9209
23699 -9209 -11420 -6595 -1339 244 -1282 -571 3193 6694 6903 2748 -2494 -5442 -9690 -4608 2173
23684 2173 -1691 -7420 -500 5110 921 285 -731 1496 1485 -3116 -11496 -8938 -8349 -4794 -222 -487
23668 -487 -3202 -7061 -6848 -2809 -1663 -5709 -9604 -8168 -3825 -4163 -7826 -10086 -4067 -5799 -6244 2419
23652 2419 3757 6541 5399 -467 -10795 -17775 -18238 -19316 -17718 -11812 -11118 -7484 -2763 -4258 -4499
23637 -4499 -7106 -5467 -9205 -11983 -10471 -5908 -5596 -3508 -7862 -3232 1640 447 1439 2631 2355
$$ packed form
23746a9764Q03J3918N578m546l343j19K980k72k1l824o370m265J153N525N870
23731f697q39m195J741L806j835o19K566L112Q988J598l39n349q53K087R37p530
23715c421j050k670q6J626L703K380P56M434j568m48m418J633M76n631k306k619
23699i209k211M825N256J583j526P11L764L501K09m155n242k948m248N082O781
23684B173l864n729O920N610m189o36j016K227j1m601q380K558N89L555M572k65
23668d87k715l859K13M039J146m046l895J436M343l38l663k260O019j732m45Q663
23652B419J338K784j142n866j0328o980m63j078J598N906O94L634M721j495k41
23637d499k607J639l738k778J512M563L12K088m354M630M872j193R92J192k76
$$ plain form
23622 2355 1283 -2422 -7155 -1077 5380 10848 280 -11061 -14453 -6064 -9038 -11467 -14942 -16283
23608 -16283 -11095 -6601 -4514 -2209 -1848 2071 -5351 -2961 -557 111 3975 2020 -5224 -10609 -5662
23593 -5662 -2175 -3248 -7819 -6307 -3933 -2829 -5363 -6639 -9816 -8468 -7572 -7864 -6020 -3862 -3735
23578 -3735 -2524 1263 5835 6000 2911 149 -809 1582 5987 8496 5807 5048 2400 -3481 -9338
23563 -9338 -11854 -11000 -9213 -3794 -6358 -14035 -10621 -11474 -11972 -14662 -7108 -1072 13 741 -4758 -3975
23547 -3975 99 -157 -1116 -2069 -10033 -15013 -13949 -9483 -5143 -5709 3635 9586 4430 868 3465 5324
23531 5324 7318 10448 12644 9499 6003 1781 4567 320 -9494 -17622 -17080 -9728 -1072 -3579 -6036
23516 -6036 -2118 3801 5478 1833 -2503 -3941 -2696 1627 1307 -5413 -9388 -8744 -4865 1852 4465
$$ packed form
23622B355j072l705m733O078O457N468j0568j1341l392Q389k974k429l475j341
23608a6283N188M494K087K305L61L919p422K390K404O68L864j955p244n385M947
23593e662L487j073m571J512K374J104k534j276l177J348Q96k92J844K158J27
23578c735J211L787M572J65l089k762r58K391M405K509k689p59k648n881n857
23563i338k516Q54J787N419k564p677L414q53m98k690P554O036J085P28n499P83
23547c975M074k56r59r53p964m980J064M466M340n66R344N951n156l562K597J859
23531E324J994L130K196l145l496m222K786m247r814q128N42P352Q656k507k457
23516f036L918N919J677l645m336j438J245M323l20o720l975O44L879O717K613
$$ plain form
23501 4465 5011 1557 -1614 -3786 -7038 -10587 -13788 -9699 -6933 -16246 -20806 -10772 -6577 -4952 941
23486 941 4340 10843 10655 2074 -6387 -16495 -17749 -12412 -2872 4708 5178 772 -5402 -6963 -6454
23471 -6454 -5936 -5606 -4789 -9031 -9720 -19772 -23339 -24863 -16669 -7443 -1785 -2785 -11105 -17449 -16093
23456 -16093 -10377 -6581 -1594 5004 -3402 -12563 -4575 558 -7984 -17203 -12233 -2414 -3414 -4901
23442 -4901 -6889 -8262 -8524 -15622 -15853 -4799 -5153 -2757 -875 -46 -922 -5281 -4952 -8734 -15057 -12808
23426 -12808 -2579 -4598 -6763 -5174 -2923 -6631 -9020 -1978 5680 6711 287 3233 5306 1062
23412 1062 -4373 -7496 -5145 -3176 -944 -2553 -1900 -4878 -6230 -4793 1444 8529 8815 11069 6741
23397 6741 4547 4421 -1771 -7692 -11241 -11485 -10362 -8367 -5175 -5266 -6251 -8128 -5239 386 -1318 -7268
$$ packed form
23501D465N46l454l171k172l252l549l201M089K766r313m560J0034M195J625N893
23486I41L399O503j88q581q461j0108j254N337R540P580M70m406o174j561N09
23471f454N18L30Q17m242o89j0052l567j524Q194R226N658j000q320o344J356
23456a6093N716L796M987O598q406r161P988N133q542r219M970R819j000j487
23442d901j988j373k62p098k31J1054l54K396J882Q29q76m359L29l782o323K249
23426a2808J0229k019k165J589K251l708k389P042P658J031o424K946K073m244
23412A062n435l123K351J969K232j609O53k978j352J437O237P085K86K254m328
23397F741k194j26o192n921l549k44J123J995L192r1r85j877K889N625j704n950
$$ plain form
23381 -7268 -1742 -3174 -6292 -9716 -5408 -10685 -12780 -5102 7618 8173 -3057 -7193 -8057 -9405 -10442
23366 -10442 -6195 2953 6407 -3158 -9792 -5262 1399 -807 -3396 -8368 -8992 -5580 3617 -1453 1508
23351 1508 3729 -1698 -4946 -2413 -5829 -9182 -7069 -3944 -4588 -2527 6434 7362 1084 -164 -3864
23336 -3864 -10135 -4421 -3080 -4896 -7398 -5765 -9575 -7472 -2264 4215 3382 4855 9253 7529 2475
23321 2475 -566 -2714 -3488 -2214 -5254 -7659 -13917 -15798 -8844 -3182 -4551 -6997 -8317 -8529 -3958
23306 -3958 -3254 -6306 -12142 -14580 -8913 -7495 -11421 -7277 -8761 -9035 -8195 -6148 -8206 -12362 -12908 -11692
23290 -11692 -12926 -14726 -10638 -12680 -18236 -11663 -7734 -9207 -16107 -16627 -14660 -17709 -11489 -10298 -17256
23275 -17256 -13769 -6340 -3764 3368 11844 4016 -1344 -6866 -4150 -1731 288 8599 7657 3167 1623
$$ packed form
23381g268N526j432l118l424M308n277k095P678J2720N55j1230m136q64j348j037
23366a0442M247R148L454r565o634M530O661k206k589m972o24L412R197n070K961
23351A508K221n427l248K533l416l353K113L125o44K061Q961R28o278j248l700
23336c864o271N714J341j816k502J633l810K103N208O479q33J473M398j724n054
23321B475l041k148p74J274l040k405o258j881O954N662j369k446j320k12M571
23306c958P04l052n836k438N667J418l926M144j484k74Q40K047k058m156n46J216
23290a1692j234j800M088k042n556O573L929j473o900n20J967l049O220J191o958
23275a7256L487P429K576P132Q476p828n360n522K716K419K019Q311r42m490j544
$$ plain form
23260 1623 2309 -167 -5495 -5874 1051 2332 4266 1770 2768 2017 -3198 -4572 -1372 5896 13470 11873
23244 11873 3510 1878 -1261 -3456 -4634 -4056 -548 1862 4138 3621 -1716 4283 2205 1458 -733
23229 -733 -7167 -5905 -3965 -6995 -4751 -2693 -5206 171 -2787 -16849 -17456 -10661 -5412 -9961 -13323
23214 -13323 -19053 -16724 -12450 -8005 -11155 -14667 -17454 -10753 -5574 -2216 -2285 -2975 -6392 -13997 -8520
23199 -8520 -2283 -6199 -5325 -4186 -1977 -7792 -7808 -6288 -2784 -508 -3835 2361 6354 3279 -5464
23184 -5464 -6542 2104 7368 7933 7325 4655 -2383 -5525 -5549 1154 3645 8024 9071 8359 1759 -959
23168 -959 5715 3390 5568 2110 -1373 5089 4564 -2891 -10115 -12005 -8548 -5743 -13413 -13889 -9233
23153 -9233 -4191 -4682 -5660 -5608 -9175 -7198 -3322 798 1162 -5057 -9609 -7340 -3462 -8514 -6932 -8888
$$ packed form
23260A623O86k476n328l79O925J281J934k496R98p51n215j374L200P268P574j597
23244A1873q363j632l139k195j178N78L508K410K276n17n337N999k078p47k191
23229g33o434J262J940l030K244K058k513N377k958j4062o07O795N249m549l362
23214a3323n730K329M274M445l150l512k787O701N179L358o9o90l417p605N477
23199h520O237l916Q74J139K209n815j6J520L504K276l327O196L993l075q743
23184e464j078Q646N264N65o08k670p038l142k4O703K491M379J047p12o600k718
23168i59O674k325K178l458l483O462n25p455p224j890L457K805p670m76M656
23153i233N042m91r78N2l567J977L876M120L64o219m552K269L878n052J582j956
$$ plain form
23137 -8888 -11491 -8420 -5225 -6242 -12099 -10714 -5380 -6364 -3932 286 -2172 -7533 -4153 -6103 -11913
23122 -11913 -11854 -5118 6268 9001 -6107 -5346 -2163 355 -3172 -3535 -6822 -5874 -10294 -10294 -9471 -10627
23106 -10627 -8219 -9116 -11003 -8634 -16148 -20966 -15954 -7257 5459 3029 -4204 -6249 -7938 -5096
23092 -5096 -4903 -5558 -9498 -16397 -5916 -5244 -8732 -10171 -14663 -13609 -9673 -3716 4608 8192 7387
23077 7387 5515 3961 -2126 -2674 2025 -2547 -2302 -7537 -9513 -9019 -894 -7774 -13140 -11249 -12414
23062 -12414 -7454 -8832 -11014 -8046 1672 11300 11303 3822 2891 7621 984 -2396 -3455 -8117 -6167
23047 -6167 -10161 -6955 -447 467 -923 128 1492 2415 8204 5673 2739 7856 5753 -584 1919
23032 1919 6028 9598 7907 531 8290 2995 -6015 -9686 -14660 -7215 -1246 406 -2746 -4446 -6965
$$ packed form
23137h888k603L071L195j017n857J385N334r84K432M218k458n361L380j950n810
23122a1913N9O736J1386K733j5108P61L183K518l527l63l287R48m420%Q23j156
23106a0627K408q97j887K369p514m818N012Q697J2716k430p233k045j689K842
23092e096J93o55l940o899J0481O72l488j439m492J054L936N957Q324L584q05
23077G387j872j554o087n48M699m572K45n235j976M94Q125o880n366J891j165
23062a2414M960j378k182K968R718R628Lp481r31M730o637l380j059m662J950
23047f167l994L206O508R14j390J051J364R23N789k531k934N117k103o337K503
23032A919M109L570j691p376P759n295r010l671m974P445N969J652l152j700k519
$$ plain form
23017 -6965 -13193 -14695 -6591 -5300 -4682 -1008 6140 1534 -3361 1172 -645 295 3659 3319 2879 -4900
23001 -4900 -5058 -5632 -6049 -4582 -11203 -9916 -7903 -6015 -3988 -920 -163 855 -1488 -3358 2624 9062
22985 9062 6488 1160 331 7800 2570 -5018 -3064 -6621 -9101 -1285 3240 4241 3786 1790 -6333
22970 -6333 -10153 -5667 -7023 -6671 -7602 -9891 -5487 -4404 -2336 2079 809 227 -6601 -7418 -2309 -2631
22954 -2631 -10097 -13943 -13305 -7207 -1445 -1193 -12656 -21545 -19272 -16508 -12565 -14302 -15914 -10247 -6986
22939 -6986 -2768 -1180 -2170 1356 9897 9664 5259 822 3624 5348 2097 998 631 -4422 -6802
22924 -6802 701 1908 -611 2944 3074 757 -4800 -7816 -6717 -2509 -2101 -2080 396 -2702 -6037 -7967
22908 -7967 -653 -3617 -5783 -10665 -17285 -12151 -8445 -10194 -6555 -9600 -10933 -10714 -12257 -14207 -13155
$$ packed form
23017f965o228j502Q104J291O18L674P148m606m895M533j817R40L364l40m40p779
23001d900j58n74m17J467o621J287K013J888K027L068P57J018k343j870N982O438
22985I062k574n328q29P469n230p588J954l557k480P816M525J001m55j996q123
22970f333l820M486j356L52r31k289M404J083K068M415j270n82o828q17N109l22
22954b631p466l846O38O098N762K52j1463q889K273K764L943j737j612N667L261
22939f986M218J588r90L526Q541k33m405m437K802J724l251j099l67n053k380
22924f802P503J207k519L555J30k317n557l016J099M208M08K1K476l098l335j930
22908g967P314k964k166m882o620N134L706j749L639l045j333K19j543j950J052
$$ plain form
22893 -13155 -11646 -15333 -13945 -4743 -1180 -2345 -3899 2687 6302 3998 -346 -2568 601 -2477
22879 -2477 -2172 -3327 -2313 -2269 -2004 -5130 -9934 -9313 -7168 -3843 3585 8403 6483 82 -4453 -5909
22863 -5909 -3762 -2105 -4882 -10468 -9937 -8152 -5753 -9120 -3146 -8064 -13934 -12483 -12052 -8181 -8681
22848 -8681 -3762 520 1462 3404 1251 -1905 -6550 -8987 -7550 -11666 -18248 -13581 -10237 -8128 -6025
22833 -6025 -9557 -10590 -9238 -11251 -9156 -4774 196 5358 8414 6105 -1825 -2701 -4704 -8669 -10718
22818 -10718 -14652 -18279 -16852 -8665 -3056 -5271 -6656 -1785 -3643 -2431 -6521 -13870 -18615 -16106
22804 -16106 -7716 -9956 -8198 -7206 -7456 -12304 -13783 -15883 -10513 -7153 -10591 -8957 -8347 -5885 -6432
22789 -6432 -5781 -12245 -9244 -6450 -6667 254 8467 7910 6465 783 4020 1662 -2059 364 4013
$$ packed form
22893a3155J509l687J388R202L563j165j554O586L615k304m344k222L169l078
22879b477L05j155J014M4K65l126m804O21K145L325P428M818j920o401m535j456
22863e909K147J657k777n586N31J785K399l367N974m918n870J451M31L871n00
22848h681M919M282R42J942k153l156m645k437J437m116o582M667L344K109K103
22833f025l532j033J352k013K095M382M970N162L056k309p930q76k003l965k049
22818a0718l934l627J427Q187N609k215j385M871j858J212m090p349m745K509
22804a6106Q390k240J758R92k50m848j479k100N370L360l438J634O10K462n47
22789f432O51o464L001K794k17O921Q213n57j445n682L237k358l721K423L649
$$ plain form
22774 4013 3761 -2044 -3253 -4193 -780 -7412 -9958 -16182 -19731 -22926 -21558 -16241 -3031 -3765 -9810
22759 -9810 -12443 -9488 -7759 -11187 -11936 -8816 -1590 2363 3072 2022 -3524 -1399 -1005 -4913 122
22744 122 7046 4029 1995 -1958 -4314 -7517 -10006 -2791 1028 1723 -3568 -2981 -4486 -1644 1985
22729 1985 2018 1702 2728 -5582 -8784 -14994 -18730 -20558 -18555 -18213 -17572 -17578 -13296 -10890 -11559 -6174 -1188
22712 -1188 -4243 -5360 -5974 -3343 178 -2497 -2674 1081 -2970 -7365 -3266 1833 -6669 -11100 -9775
22697 -9775 -6094 -11066 -10288 -12355 -10273 -4779 194 -779 -4323 -6699 -6999 -5703 780 -205 2278 8677
22681 8677 11213 8722 1841 -2967 351 2532 1014 -2186 -3700 -2664 -307 -3271 -6986 -10988 -9081
22666 -9081 -5240 -3963 -1716 -4645 -6432 -5256 75 5503 9519 11057 4080 -4022 -6171 -1016 -912
$$ packed form
22774D013k52n805j209r40L413o632k546o224l549l195J368N317J3210p34o045
22759i810k633K955J729l428p49L120P226L953P09j050n546K125L94l908N035
22744A22O924l017k034l953k356l203k489P215L819O95n291N87j505K842L629
22729A985L3l16J026q310l202o210l736j828K003L42O41oM282K406o69N385M986
22712a188l055j117o14K631L521k675j77L755m051m395M099N099q502m431J325
22697i775L681m972P78k067K082N494M973r73l544k376l00J296O483r85K483O399
22681H677K536k491o881m808L318K181j518l200j514J036K357k964l715m002J907
22666i081L841J277K247k929j787J176N331N428M016J538o977q102k149N155J04
$$ plain form
22651 -912 -1569 362 -1499 587 7523 13677 13043 12385 13740 10832 4801 3435 2661 -8809 -7319 -2830
22635 -2830 931 1751 -1913 6297 10843 10128 10987 8569 3815 -450 -4231 -7278 -9892 -8421 -7594 -8387
22619 -8387 -4443 -7714 -6319 -11006 -11412 -13944 -15863 -7494 -1620 181 -3965 -7100 -8958 -3579 2201
22604 2201 990 -1083 3220 4284 8575 10935 1741 -7875 -4146 -3575 250 664 1362 2065 6345 5462
22588 5462 5258 2005 -1780 -2989 -4378 -6425 -4248 144 3887 -504 -2012 2587 4903 2761 3141
22573 3141 -459 -7327 -8455 -2919 4052 4404 5727 -529 -6888 -9838 -6238 -3477 -5549 3431 7461
22558 7461 5682 -1770 -7603 -7788 -506 53 -2004 -529 6651 7039 5209 821 -1405 -2209 -6229 -8424
22542 -8424 -6008 -786 8662 4251 599 -7423 -5597 -8256 -10081 -14836 -13812 -12228 -9339 -2757 -5444
$$ packed form
22651i12o57J931j861K086O936O154o34o58J355k908o031j366p74j1470J490M489
22635b830L761Q20l664Q210M546p15Q59k418m754m265l781l047k614J471Q27p93
22619h387L944l271J395m687m06k532j919Q369N874J801m146l135j858N379N780
22604B201j211k073M303J064M291K360r194r616L729N71L825M14O98P03M280q83
22588E462k04l253l785j209j389k047K177M392L743m391j508M599K316k142L80
22573C141l600o868j128N536O971L52J323o256o359k950L600K761k072Q980M030
22558G461j779p452n833j85P282N59k057J475P180L88j830m388k226q04m020k195
22542h424K416N222R448m411l652q022J826k659j825m755J024J584K889O582k687
$$ plain form
22527 -5444 -7810 -8186 -9423 -11856 -14654 -14254 -10391 -6655 -4555 381 4060 9123 8031 12310 10325
22512 10325 4335 -617 -4260 -5560 -9496 -12848 -11100 -15455 -19277 -12932 -13840 -11897 -6372 -9911 -8131
22497 -8131 -1636 2527 2634 420 -1306 -1305 -7888 -9452 -8466 -3685 -5678 -8956 -7949 -7828 -10365 -12119
22481 -12119 -9667 -4602 1294 4378 11905 9701 4623 240 -4815 -4378 544 -5409 -5416 -2244 -5575
22466 -5575 -11946 -9654 -3196 1628 4856 6684 -3590 -2478 -3974 5008 8259 8125 6972 9206 7323
22451 7323 3361 5811 11884 7180 -5515 -696 1839 -3177 -4846 -8393 -14389 -7236 -2588 -6051
22437 -6051 -1116 6241 9791 10906 13144 13002 17340 16797 14483 8737 -2902 -1553 2853 -2218 -4806
22422 -4806 -2898 569 8276 4110 -5402 -5409 3555 1474 5460 4331 -501 -7654 -4218 -3238 -3783 -6031
$$ packed form
22527e444k366l76j237k433k798M00L863L736K100M936L679N063j092M279j985
22512A0325n990m952l643j300l936l352J748m355l822O345r08J943N525l539J780
22497h131O495M163J07k214j726Jo583j564R86M781j993l278J007J21k537j754
22481a2119K452N065N896L084P527k204n078m383n055M37M922n953pL172l331
22466e575o371K292O458M824L228J828j0274J112j496Q982L251j34j153K234j883
22451G323l962K450O073m704j2695M819K535n016j669l547n996P153M648l463
22437f051M935P357L550J115K238j42M338n43k314n746j1639J349M406n071k588
22422d806J908L467P707m166r512pQ964k081L986j129m832p153L436R80n45k248
$$ plain form
22406 -6031 -2666 -3512 -28 4757 1608 -3455 -5054 -8524 -12935 -10188 -13664 -11852 -5729 -4054 -7606
22391 -7606 -5941 -8313 -6101 -5056 -5047 -6554 -2349 1674 -1383 1965 -2838 -8909 -6036 -3776 -2041
22376 -2041 -6277 -1529 -3335 -10716 -13429 -5180 427 2377 -4334 -5235 -6117 -5353 -1640 -275 7760
22361 7760 4231 2038 164 2833 333 2631 -1597 806 -1525 -241 -3488 -3809 -2565 -830 2015
22346 2015 7053 2618 -4051 -10021 -10140 -8601 -9041 -10437 -6290 3356 11035 12612 8844 3029 1223
22331 1223 1098 -6169 -8969 -10296 -6803 -4891 -5337 -4297 -610 4209 3667 -1850 -4278 -12606 -20134
22316 -20134 -23233 -20078 -9087 -4574 -2760 -6602 -4463 -10572 -8479 -7746 -9280 -7038 3514 6602
22302 6602 6708 4917 6629 11781 9718 8087 4824 433 1476 2660 6519 6190 8857 5674 -1322
$$ packed form
22406f031L365q46L484M785l149n063j599l470m411K747l476J812O123J675l552
22391g606J665k372K212J045Rj507M205M023l057L348m803o071K873K260J735
22376b041m236M748j806p381k713Q249N607J950o711r01q82P64L713J365Q035
22361G760l529k193j874K669k500K298m228K403k331J284l247l21J244J735K845
22346B015N038m435o669n970j19J539m40j396M147R646P679J577l768n815j806
22331A223j25p267k800j327L493J912m46J040L687M819n42n517k428q328p528
22316b0134l099L155J0991M513J814l842K139o109K093P33j534K242J0552L088
22302F602J06j791J712N152k063j631l263m391J043J184L859l29K667l183o996
$$ plain form
22287 -1322 -4656 -4956 -670 -1811 -3210 -1541 -1936 -5238 -1488 90 3879 8043 9142 2337 -2992
22272 -2992 -4007 -7943 -16982 -17503 -7957 -2951 -1485 -2325 -4428 -5879 -4197 -4905 3753 -3204 -8527
22257 -8527 -1033 1208 4042 -1968 -9137 -7224 -1539 1260 -536 -5444 -6340 -1399 4219 10248 12250
22242 12250 15038 13818 10546 5067 2349 5299 4657 1784 6184 11056 11658 8388 2457 -990 4477
22227 4477 6737 5248 673 -3949 -3920 2924 6041 851 -918 -7421 -9137 -1692 192 299 1897
22212 1897 1667 2202 4714 1193 -5662 -5399 -5845 -935 6104 2628 -5078 -3300 2845 5850 6296 5308
22196 5308 201 -489 -1941 -2932 -1207 -4527 -1567 114 -3220 -9024 -1997 4707 2348 2546 2968 -5625
22180 -5625 -895 -1702 -1435 1801 2530 171 -9898 -14384 -5600 5907 4927 -962 -3349 3872 5334
$$ packed form
22287a322l334l00M286j141j399J669l95l302L750J578L789M164J099o805n329
22272b992j015l936r039n21R546N006J466q40k103j451J682p08Q658o957n323
22257h527P494K241K834o010p169J913N685K799j796m908q96M941N618O029K002
22242A2250K788j220l272n479k718K950o42k873M400M872O02l270n931l447N467
22227D477K260j489m575m622K9O844L117n190j769o503j716P445J884J07J598
22212A897k30N35K512l521o855K63m46M910P039l476p706J778O145L005M46r88
22196E308n107o90j452r91J725l320K960J681l334n804P027O704k359J98M22q593
22180e625M730q07K67L236P29k359j0069m486Q784J1507r80n889k387P221J462
$$ plain form
22165 5334 8062 4127 -2133 -5311 1260 9120 4977 4836 6503 9941 14338 12675 9307 2995 -1673
22150 -1673 1092 8804 7633 8178 11725 12648 7922 4900 6110 1738 1816 5023 8597 7206 3635 7275
22134 7275 3498 4046 3726 8990 13631 11462 8428 13780 12361 4113 -682 4417 6441 2260 2203 4797
22118 4797 9611 5477 3866 2493 2485 2781 5318 5855 4537 3902 3145 -940 -4635 -4660 -547 3180 4481
22101 4481 10203 16465 22286 20495 16856 14131 15098 16247 11418 7399 5212 4318 7766 10227 11272
22086 11272 15073 21423 21008 12538 8840 12832 11740 18337 22539 22649 17991 22559 20895 24006 27487
22071 27487 26179 22325 21680 21248 17193 14010 12303 8772 11700 20974 18786 12487 13640 13436 13850
22056 13850 16800 15721 20152 19668 15295 6765 7454 13509 7005 985 3760 8122 11891 20767 21514
$$ packed form
22165E334K728l935o260l178O571P860m143j41J667L438M397j663l368o312m668
22150a673K765P712j171N45L547R23m726l022J210m372P8L207L574j391l571L640
22134G275l777N48l20N264M641k169l034N352j419q248m795N099K024m181n7K594
22118D797M814m134j611j373qK96K537N37j318o35p57m085l695k5M113L727J301
22101D481N722O262N821j791l639k725R67J149m829m019k187q94L448K461J045
22086A1272L801O350m15q470l698L992j092O597M202J10m658M568j664L111L481
22071B7487j308l854o45m32m055l183j707l531K928R274k188o299J153k04M14
22056A3850K950j079M431m84m373q530O89O055o504o020K775M362L769Q876P47
$$ plain form
22041 21514 19293 26737 25924 23604 21944 21676 15531 8562 9820 12707 16022 24096 28880 24296 26754
22026 26754 27778 22056 25109 25766 29400 29690 26149 23992 29244 29372 28896 25445 18163 21713 31673
22011 31673 34654 28289 20414 18367 18913 17369 18296 17303 21184 18936 22610 29794 33361 26424 22753
21996 22753 22421 23573 21228 23448 29418 36665 39767 35250 31007 23467 23922 25667 17823 15142 16134
21981 16134 13555 13550 20974 26154 25201 28108 29463 27654 22474 17453 16399 23646 32592 34125 35266
21966 35266 32670 25092 20871 19738 27394 31416 29918 23141 19454 19840 18446 15373 22361 24007 22630
21951 22630 24741 16478 10779 8995 2335 -329 2557 2386 5089 12964 21427 20324 12972 10192 6546
21936 6546 8999 16136 11916 8608 7747 5893 6331 10675 14437 13290 12958 13950 14426 11813 16566 19888
$$ packed form
22041B1514k221P444q13k320j660k68o145o969J258K887L315Q074M784m584K458
22026B6754J024n722L053O57L634K90l541k157N252J28m76l451p282L550R960
22011C1673K981o365p875k047N46j544R27r93L881k248L674P184L567o937l671
21996B2753l32J152k345K220N970P247L102m517m243p540M55J745p844k681R92
21981A6134k579nP424N180r53K907J355j809n180n021j054P247Q946J533J141
21966C5266k596p578m221j133P656M022j498o777l687L86j394l073O988J646j377
21951B2630K111q263n699j784o660k664K886j71K703P875Q463j103p352k780l646
21936F546K453P137m220l308q61j854M38M344L762j147l32R92M76k613M753L322
$$ plain form
21920 19888 18937 17703 10786 9114 14327 10755 5610 1655 3940 4567 6779 10938 8341 5087 7675
21905 7675 12833 9398 9675 14683 17191 14601 11710 11156 8953 11753 12879 11837 10531 6584 5074
21890 5074 8768 5718 3369 3714 3380 2042 -737 870 1553 -486 -3104 -873 121 73 1076 -2153
21874 -2153 7582 9002 6066 11534 14303 11101 7522 5792 4448 10157 10351 8377 4351 1634 -1363
21859 -1363 375 -4500 472 2486 2779 -293 -6725 -9836 -9409 -11670 -8441 -8458 -4808 -1605 118 -5018
21843 -5018 -5724 -9233 -12734 -10933 -8637 -2397 -72 -1981 -2026 -3336 -2478 -3482 -2897 -2670 4393 10594
21827 10594 8468 7188 2533 2416 2975 -1142 -1397 2000 -14 -4879 -4577 560 -1453 -2247 -3209 -4640
21811 -4640 -6267 -4713 -3772 -9245 -7766 -9367 -9625 -3510 -2948 -11489 -8692 1722 -1593 -2353 1665
$$ packed form
21920A9888r51j234o917j672N213l572n145l955K285O27K212M159k597l254K588
21905G675N158l435K77N008K508k590k891n54k203K800J126j042j306l947j510
21890E074L694l050k349L45l34j338k779J607O83k039k618K231R94m8J003l229
21874b153R735J420k936N468K769l202l579j730j344N709J94j974m026k717k997
21859a363J738m875M972K014K93l072o432l111M27k261L229j7L650L203J723n136
21843e018p06l509l501J801K296O240K325j909m5j310Q58j004N85K27P063O201
21827A0594k126j280m655j17N59m117k55L397k014m865L02N137k013p94r62j431
21811d640j627J554R41n473J479j601k58O115N62q541K797J0414l315p60M018
$$ plain form
21796 1665 4036 -1868 -6774 -7721 -4225 2303 4172 4175 111 -1051 -3040 -3831 460 -100 -2357 -6104
21780 -6104 -4321 547 6150 743 -7049 -5894 -3353 -2499 -4543 -5771 -3489 5063 5527 2597 -1231
21765 -1231 2034 8380 5612 4346 -178 1134 5180 7100 -238 -12527 -7392 -1471 2518 2941 -2123
21750 -2123 -1536 5410 7222 2830 -4587 -9953 -5632 649 -4951 -5435 -5438 -10410 -14628 -13610 -9445 -4793
21734 -4793 8105 13947 5514 -41 3205 4219 -682 -2640 521 2805 336 -3640 -3843 -5874 -7809
21719 -7809 -5955 -7218 -2379 -3568 -10097 -12427 -11904 -13880 -9923 -1365 6093 3871 2859 -3438 -3505
21704 -3505 3019 2967 -572 981 1003 -1556 5561 3292 -4070 -2992 4124 4991 2514 -790 4410 4233
21688 4233 3331 11620 12007 6401 2091 -628 -6368 -9983 -5590 -6250 -8568 -3422 2295 422 -1344
$$ packed form
21796A665K371n904m906r47L496O528J869Lm064j162j989p91M291n60k257l747
21780f104J783M868N603n407p792J155K541Q54k044j228K282Q552M64k930l828
21765a231L265O346k768j266m524J312M046J920p338j2289N135N921L989M23n064
21750b123N87O946J812m392p417n366M321O281n600m84lm972m218J018M165M652
21734d793J2898N842q433n555L246J014m901j958L161K284k469l976k03k031j935
21719g809J854j263M839j189o529k330N23j976L957Q558P458k222j012o297o7
21704c505O524n2l539J553K2k559P117k269p362J078P116Q67k477l304N200j77
21688D233r02Q289L87n606m310k719n740l615M393o60k318N146N717j873j766
$$ plain form
21673 -1344 1241 346 -2423 -2379 -5930 -2730 -1893 -4730 -4551 -7765 -8706 -7595 -4982 -3229 -2595 -7935
21657 -7935 -8007 -2544 -462 -2243 -1227 177 -2473 132 -2308 -8320 -4202 -8551 -9194 -3252 -4912
21642 -4912 -2040 -894 -7084 -9288 -15309 -18115 -13935 -11183 -15029 -20175 -20181 -12194 -9281 -9239 -7952 -9028
21626 -9028 -8444 -9731 -6606 -3587 -3444 -8003 -11532 -10891 -5390 2778 -2703 -495 1857 -5519 -8184
21611 -8184 -9063 -4493 -4049 -7161 -5231 3530 2386 -192 -1395 -8267 -6508 -2728 -187 1587 3447
21596 3447 2180 -4111 -5438 -1505 -4134 -7483 -7113 -7615 -8851 -12081 -11116 -45 477 -5441 -1921
21581 -1921 2413 -4284 -3606 -9153 -9920 -9557 -4905 -3951 -8846 -9362 -4271 -2872 -988 6751 1547 -1841
21565 -1841 3255 6846 14648 13538 14423 13396 4659 -3139 -2277 -2980 -1853 -2197 -1330 1561 173 -247
$$ packed form
21673a344K585q95k769M4l551L200Q37k837J79l214r41J111K613J753O34n340
21657g935p2N463K082j781J016J404k650K605k440o012M118m349o43N942j660
21642d912K872J146o190k204o021k806M180K752l846n146oP987K913M2J287j076
21626i028N84j287L125L019J43m559l529O41N501Q168n481K208K352p376k665
21611h184q79M570M44l112J930Q761j144k578j203o872J759L780K541J774J860
21596C447j267o291j327L933k629l349L70n02j236l230R65J1071N22n918L520
21581a921M334o697O78n547p67L63M652R54m895n16N091J399J884P739n204l388
21565a841N096L591P802j110Q85j027q737p798Q62p03J127l44Q67K891j388m20
$$ plain form
21549 -247 490 -292 -635 -8755 -15152 -13863 -11336 -9587 -13534 -12178 -5042 -391 -5074 -9019 -3418 -271
21533 -271 3062 -949 -776 3705 6162 3872 8335 12181 8745 1083 412 5540 11710 9957 6456
21518 6456 -219 632 3571 4484 2518 -3923 -5370 -2964 -886 5885 9453 7660 4416 5380 12908
21503 12908 13712 9160 11743 7747 -1689 860 -233 -1805 3897 6434 3800 882 -2295 -3193 -637
21488 -637 -2576 -1520 -1353 -7945 -10215 -10730 -7872 -4798 -1670 -5667 -7687 -7431 -7405 -2041 4836 2315
21472 2315 -1047 -1343 1590 5761 11755 8195 3391 849 -3035 -2874 -2861 -1382 1549 1056 3643 2303
21456 2303 1190 -4689 -3460 3885 2950 2019 -909 -3959 -11548 -2966 10099 14143 19474 13642 8583
21441 8583 6610 5947 433 4010 7965 5309 2081 -3220 -3700 -1585 -3641 -3634 -5323 -2592 -2231 -4774
$$ packed form
21549b47P37p82l43q120o397J289K527J749l947J356P136M651m683l945N601L147
21533b71L333m011J73M481K457k290M463L846l436p662o71N128O170j753l501
21518F456o675Q51K939R13j966o441j447K406K078O771L568j793l244R64P528
21503A2908Q04m552K583l996r436K549j093j572N702K537k634k918l177q98K556
21488f37j939J056J67o592k270n15K858L074L128l997k020K56K6N364O877k521
21472B315l362k96K933M171N994l560m804k542l884J61J3J479K931m93K587j340
21456B303j113n879J229P345r35r31k928l050p589Q582J3065M044N331n832n059
21441H583j973o63n514L577L955k656l228n301m80K115k056Pj689K731L61k543
$$ plain form
21425 -4774 -8685 -9580 -10546 -4334 1501 -1493 -12224 -11985 -11197 -4086 -2658 -7000 -1488 -3117 -708
21410 -708 -2745 -5162 -6055 -8825 -12837 -9501 -8339 -6623 -5440 -1481 2597 8784 2223 -1592 -1973
21395 -1973 -4718 20 3998 4808 -194 -2254 -358 -5181 -4329 -3383 -7480 -18180 -16510 -10421 -4109
21380 -4109 -8322 -6176 -11349 -15667 -16194 -4470 700 -435 -5375 -1922 4297 663 -4921 -6843 -10339
21365 -10339 -8669 -7467 36 3069 -6214 -17258 -13402 -16811 -17699 -13752 -3086 1984 -4691 -9012
21351 -9012 -11724 -10267 -15664 -22830 -19661 -13340 -13991 -21148 -23033 -16637 -7476 -4300 -7218 -12825 -14234
21336 -14234 -13157 -12170 -16178 -16364 -10118 -10051 -13518 -17527 -20970 -12343 -5506 -7416 -8942 -3377 -9757
21321 -9757 -6603 5233 9076 3193 1506 -4238 -8463 -5752 -7296 -7006 -2285 -1303 -4231 -421 -1283
$$ packed form
21425d774l911q95r66O212N835k994j0731K39P88P111J428m342N512j629K409
21410g08k037k417q93k770m012L336J162J716J183L959M078O187o561l815l81
21395a973k745M738L978Q10n002k060J896m823Q52R46m097j0700J670O089O312
21380d109m213K146n173m318n27J1724N170j135m940L453O219l634n584j922l496
21365a0339J670J202P503L033r283j1044L856l409q88L947J0666N070o675m321
21351i012k712J457n397p166L169O321o51p157j885O396R161L176k918n607j409
21336a4234J077R87m008j86O246O7l467m009l443Q627O837j910j526N565o380
21321i757L154J1836L843n883j687n744m225K711j544K90M721R82k928L810q62
$$ plain form
21306 -1283 -4487 -4537 -3298 -2174 -3694 -3301 -4997 -6417 -12171 -12683 -14481 -15861 -16895 -15295 -7984 -8614
21290 -8614 -6652 -4939 -10717 -14772 -11381 -9485 -72 3247 8862 20159 20263 6558 5539 5407 -1505
21275 -1505 1998 9586 12377 7776 2390 -3027 -9263 -11862 -7319 -1437 4011 10806 6606 65 -2474
21260 -2474 -4754 -9544 -10760 -12924 -9484 -3232 -4050 -8858 -10449 -7213 -9524 -14593 -15255 -9122 -2654
21245 -2654 -4082 -7155 -9249 -7509 -3007 -4272 -8440 -12572 -13633 -12941 -8993 -4117 2299 -4582 -12721
21230 -12721 -9735 -3367 -7424 -8420 -3071 1243 4074 3561 -466 -4341 -3611 1738 6251 17450 19588
21215 19588 17756 25109 34000 39558 45870 41839 44682 55247 61973 64886 65730 61844 62108 53399 45553
21200 45553 39247 35972 29157 22171 12505 8782 7572 2500 2072 8582 12357 11874 12032 8433 4460
$$ packed form
21306a283l204n0J239J124j520L93j696j420n754n12j798j380j034J600P311o30
21290h614J962J713n778m055L391J896R413L319N615J1297J04j3705j019j32o912
21275a505L503P588K791m601n386n417o236k599M543N882N448O795m200o541k539
21260b474k280m790j216k164L440O252q18m808j591L236k311n069o62O133O468
21245b654j428l073k094J740M502j265m168m132j061O92L948M876O416o881q139
21230a2721K986O368m057r96N349M314K831n13m027l875P30N349M513J1199K138
21215A9588j832P353Q891N558O312m031K843J0565O726K913Q44l886K64q709p846
21200D5553o306l275o815o986r666l723j210n072m28O510L775m83J58l599l973
$$ plain form
21185 4460 1837 244 -2877 -2001 -231 -477 2233 6394 5063 1925 2637 -2302 -6525 -9570 -10288 -7941
21169 -7941 -1361 5525 4130 -206 3224 526 -9002 -12747 -12132 -7144 -8323 -7841 -4716 -3743 -7973
21154 -7973 -12666 -9275 -9249 -4689 -540 1943 3017 2065 -1600 -6621 -8969 -8931 -6828 -2777 -7622 -2500
21138 -2500 -4447 -11533 -18201 -20824 -18992 -16544 -15466 -10307 -13020 -18209 -22251 -16837 -13398 -11760 -5381
21123 -5381 1498 3818 8874 6564 7087 771 -680 -2673 380 710 -3344 -7781 -272 948 1627
21108 1627 -5555 -4769 -4840 -7288 -4111 5181 7180 2856 986 6602 14967 15842 7534 156 4154 2018
21092 2018 -1419 -2442 -4935 -5896 -2711 -106 -2671 -3678 -7387 -8275 -1952 3219 -68 -9084 -10356
21077 -10356 -7264 -3402 -336 4278 2844 -897 -3933 -2986 -1923 -8991 -12432 -12420 -8189 -9919 -11829
$$ packed form
21185D460k623j593l121Q76J770k46K710M161j331l138P12m939m223l045p18K347
21169g941O580O886j395m336L430k698r528l745O15M988j179M82L125R73m230
21154g973m693L391K6M560M149K483J074r52l665n021k348L8K103M051m845N122
21138b500j947p086o668k623J832K448J078N159k713n189m042N414L439J638O379
21123e381O879K320N056k310N23o316j451j993L053L30m054m437P509J220O79
21108A627p182P86p1k448L177R292J999m324j870N616Q365Q75q308p378L998k136
21092B018l437j023k493r61L185K605k565j007l709q88O323N171l287r016j272
21077a0356L092L862L066M614j434l741l036R47J063p068l441J2M231j730j910
$$ plain form
21062 -11829 -564 1197 1159 -699 -1705 -7625 -11886 -7635 -1754 -880 -3860 5610 5621 228 -1971
21047 -1971 -2819 -2002 5342 1752 -7473 -3631 6258 8381 8119 3958 -4470 -6576 -2758 -168 4172
21032 4172 9285 5076 -2037 -4635 -2197 -979 5988 9520 9585 -1016 -13074 -9419 -1393 1797 4944
21017 4944 4092 4466 -722 5284 8470 1881 -4386 -5182 -969 332 3375 5304 939 -3559 -6097
21002 -6097 -3548 -4811 -668 -657 -115 -2155 -1320 545 391 -2550 -4389 -8259 -4076 7563 10055 5907
20986 5907 1467 -229 5043 14250 18940 14889 11631 7158 3608 -468 -1642 2480 -697 -1225 -730
20971 -730 -533 171 -131 961 2344 6921 6888 11389 10333 6579 6422 4071 1472 3360 2473 4581 2249
20954 2249 -1455 -2385 681 4891 7042 10279 7182 3214 -1084 656 11438 14603 11797 5705 365
$$ packed form
21062a1829J1265J761l8j858j006n920m261M251N881Q74k980R470J1n393k199
21047a971q48Q17P344l590r225L842R889K123k62m161q428k106L818K590M340
21032D172N113m209p113k598K438J218O967L532O5j0601j2058L655Q026L190L147
21017D944q52L74n188O006L186o589o267p96M213J301L043J929m365m498k538
21002f097K549j263M143J1N42k040Q35J865j54k941j839l870M183J1639K492m148
20986E907m440j696N272R207M690m051l258m473l550m076j174M122l177n28M95
20971g30J97P04l02J092J383M577l3M501j056l754j57k351k599J888q87K108k332
20954B249l704r30L066M210K151L237l097l968m298J740J0782L165k806o092n340
$$ plain form
20939 365 3026 -11 -2116 -4450 -11382 -14032 -8400 6780 3481 -3790 -4453 -756 -2658 -3758 2897
20924 2897 8171 4718 6383 5908 44 -3560 2996 6110 6532 7516 2465 -1729 2636 -5410 -7358
20909 -7358 -6567 358 4705 2278 361 -2802 -2794 -2017 -153 1672 -349 -1566 -4445 -1936 -2117 190
20893 190 -8525 -14366 -16362 -11772 -11725 -10950 -8655 -10160 -9339 -11547 -9753 -10676 -11524 -6141 -5177 -10610 -12914
20876 -12914 -3572 1904 -3713 -7244 -7801 -684 23 -3579 45 3807 1484 -5553 -13672 -16674 -20345
20861 -20345 -18261 -13230 -17024 -19232 -14431 -10723 -9302 -5964 -4559 -4902 -7779 -10362 -8658 -11117 -9651
20846 -9651 -8949 -7205 -5368 2380 9313 5436 -2958 -6470 -1049 -983 291 -4807 -7410 -4770 3986
20831 3986 2254 -1094 -10630 -11394 -3702 -2447 -9133 -11296 -6958 -2560 3258 9199 464 -1944 -4467
$$ packed form
20939C65K661l037k105k334o932k650N632J5180l299p271o63L697j902j100O655
20924B897N274l453J665m75n864l604O556L114M22R84n051m194M365q046j948
20909g358P91O925M347k427j917l163QP77J864J825k021j217k879K509j81K307
20893A90q715n841j996M590M7P75K295j505Q21k208J794r23q48N383R64n433k304
20876a2914R342N476n617l531n57P117P07l602L624L762k323p037q119l002l671
20861b0345K084N031l794k208M801L708J421L338J405l43k877k583J704k459J466
20846i651P02J744J837P748O933l877q394l512N421O6J274n098k603K640Q756
20831C986j732l348r536p64P692J255o686k163M338M398N818N941q735k408k523
$$ plain form
20816 -4467 -4835 313 -3411 -6495 -8226 -10040 -9103 -2243 2724 8829 6958 9069 6734 4300 -7096
20801 -7096 -13006 -6049 -4830 -1954 -530 2490 6278 3611 5016 4517 5831 7496 7342 2422 -1427
20786 -1427 -8313 -8945 449 -3111 -7388 -5102 -1294 1498 503 -4402 -3326 3780 6333 1161 -1273
20771 -1273 -4549 980 3823 6590 6710 6416 5768 6904 1632 -4122 -1364 -6048 -10166 -10606 -9801 -10539
20755 -10539 -12487 -18077 -15060 -6762 1 5897 2772 -405 4784 1632 -352 561 -1472 -5690 -4113
20740 -4113 -2424 -6731 -5634 -7078 -7974 -4904 -1639 -1748 -4798 -5025 -4656 -3725 -4272 -2513 -3060 -4694
20724 -4694 -449 2457 930 -1105 -220 5910 7609 7187 6393 7532 -1487 -4577 1059 5327 -1479
20709 -1479 -5190 -3199 2993 5358 267 50 -2802 1217 796 -6106 -1106 -6199 -12356 -13758 -7647
$$ packed form
20816d467l68N148l724l084j731j814R37O860M967O105j871K111k335k434j1396
20801g096n910O957J219K876J424L020L788k667J405m99J314J665j54m920l849
20786a427o886o32R394l560m277K286L808K792r95m905J076P106K553n172k434
20771a273l276N529K843K767J20k94o48J136n272n754K758m684m118m40Q05p38
20755a0539j948n590L017Q298O763N896l125l177N189l152j984R13k033m218J577
20740d113J689m307J097j444q96L070L265j09l050k27L69R31n47J759n47j634
20724d694M245K906j527k035Q85O130J699m22p94J139r019l090N636M268o806
20709a479l711J991O192K365n091k17k852M019m21o902N000n093o157j402O111
$$ plain form
20694 -7647 -3609 -6192 -11089 -4347 1507 744 -1782 -7337 -11739 -7058 -2395 -5062 -11604 -10003 -3510
20679 -3510 -1971 -1165 1208 5221 -1824 -6823 -4074 -6428 -8526 -6167 -3636 3146 -1764 -4600 593
20664 593 1477 1961 3557 5005 1907 -191 -8268 -3886 3504 7904 7715 6192 6099 -1103 -11455 -14571
20648 -14571 -13329 -10061 -7115 -7017 -4364 -1941 566 -976 -4213 978 3888 -3081 -5740 -8861 -14737
20633 -14737 -19532 -16137 -8546 -1072 -4765 -6250 -8786 -10964 -6584 -4749 869 3179 -4126 -6676
20619 -6676 -7204 -9215 -3665 5616 4528 -29 1994 4130 2634 5820 4610 7697 1070 -727 1404
20604 1404 1995 9460 9997 4349 -3947 -14620 -14966 -8344 -1791 2991 -178 -2801 -10826 -9121 -5585
20589 -5585 -6159 -4619 3286 10008 7234 5101 9557 13858 13824 13083 10631 1559 -7315 303 6266 5313
$$ packed form
20694g647M038k583m897O742N854p63k526n555m402M681M663k667o542J601O493
20679c510J539Q06K373M013p045m999K749k354k098K359K531O782m910k836N193
20664E93Q84M84J596J448l098k098q077M382P390M400j89j523r3p202j0352l116
20648a4571J242L268K946R8K653K423K507j542l237N191K910o969k659l121n876
20633a4737m795L395P591P474l693j485k536k178M380J835N618K310p305k550
20619f676n28k011N550R281j088m557K023K136j496L186j210L087o627j797K131
20604A404N91P465N37n648q296j0673l46O622O553M782l169k623q025J705L536
20589e585n74J540P905O722k774k133M456M301l4p41k452r072q874P618N963r53
$$ plain form
20573 5313 4581 -3764 -5730 91 2218 5774 1248 -908 -5386 -11879 -6208 200 4428 8259 12293
20558 12293 7780 9618 14576 16051 14648 5575 3528 5243 7715 5429 1825 3971 3778 3481 4343
20543 4343 -4160 -6850 780 3072 -2644 -4837 -4225 -3336 -6076 -7630 -8391 -5023 4696 5758 26
20528 26 -91 -1494 -364 -4531 -4846 -3506 -4092 -4851 -2690 4507 5718 5207 11305 11359 15523 8172 -213
20511 -213 -5195 -7221 -6649 -11061 -6669 -11494 -10027 -5618 -7283 -6014 -4541 700 4332 4951 -1052
20496 -1052 -8582 -9172 761 3729 1474 -3044 -2438 -929 -4081 -3603 -3127 -2459 -1084 -6757 -9964 -7145
20480 -7145 -6432 41 -1425 -3853 -7263 -6587 3300 13784 15975 17568 20275 23270 17289 15694 11520
20465 11520 3363 -1976 -8381 -5206 2098 6483 4567 3631 5843 -1913 -3977 -9726 -6326 -3575 -2685
$$ packed form
20573E313p32q345j966N821K127L556m526k156m478o493N671O408M228L831M034
20558A2293m513J838M958J475j403r073k047J715K472k286l604K146j93k97Q62
20543D343q503k690P630K292n716k193O12Q89k740j554p61L368R719J062n732
20528B6j17j403J130m167l15J340n86p59K161P197J211n11O098N4M164p351q385
20511b13m982k026N72m412M392m825J467M409j665J269J473N241L632O19o003
20496a052p530n90R933K968k255m518O06J509l152M78M76O68J375n673l207K819
20480g145P13O473j466k428l410O76R887J0484K191J593K707K995n981j595m174
20465A1520q157n339o405L175P304M385j916r36K212p756k064n749L400K751Q90
$$ plain form
20450 -2685 -2138 -647 -1847 -3600 1496 7275 11335 12022 8065 1505 -3832 -4767 -1999 745 7155
20435 7155 10509 11747 10504 13732 17267 21110 13780 6224 2481 3827 -718 -3532 -6933 -10444 -10635
20420 -10635 -6530 -3371 2725 387 -7089 -11340 -16324 -11344 -8091 -8128 -10855 -5344 1187 3546 2469
20405 2469 1188 -591 3504 8593 3065 5034 2172 -726 -1600 -208 -327 1457 -2274 1713 1752 5561
20389 5561 1144 -256 116 4027 1014 -3947 -3962 -59 -5881 -9329 -5634 -5764 -123 6955 5627 3404
20373 3404 9583 10988 11016 11158 14052 14379 5755 -2440 -2230 2802 12281 6318 -6319 -6854 -5830 -11415
20357 -11415 -11475 -7617 -2611 4886 3103 -1197 -2490 -1250 -3323 -4808 1766 6810 11847 13906 9714
20342 9714 7927 4516 2602 1029 1696 3648 306 4544 10717 13314 9671 8844 9880 4932 -4292
$$ packed form
20450b685N47J491j200j753N096N779M060O87l957o560n337r35K768K744O410
20435G155L354J238j243L228L535L843p330p556l743J346m545k814l401l511j91
20420a0635M105L159O096k338p476m251m984M980L253l7k727N511O531K359j077
20405B469j281j779M095N089n528J969k862k898q74J392j19J784l731L987L9L809
20389E561m417j400L72L911l013m961j5L903n822l448L695j30N641P078j328k223
20373C404O179J405K8J42K894L27q624q195K10N032R479n963j2637n35J024n585
20357a1415o0L858N006P497j783m300j293J240k073j485O574N044N037K059m192
20342I714j787l411j914j573O67J952l342M238O173K597l643q27J036m948r224
$$ plain form
20327 -4292 -1342 3561 2406 1666 3920 4772 6752 7319 501 -6539 -10621 -8352 -3247 -5055 -38
20312 -38 4220 6345 2004 -773 -3116 -2752 -2489 -8512 -13855 -10823 -6635 -3922 120 -2260 763 2370
20296 2370 1568 905 6716 6856 5947 9979 5958 2692 2545 2316 2117 54 5297 8174 7531 6464 2962
20279 2962 5869 5898 5090 8890 13634 14927 16662 11848 6781 6536 8224 6276 2197 2394 1322 -7578
20263 -7578 -9106 -87 2321 4899 2582 3385 3735 5204 -5641 -1004 4275 2282 9993 13317 8672
20248 8672 4082 -1124 -2733 2783 3306 4206 2286 -7869 -13063 -13267 -3907 3116 4239 4545 4392 2491
20232 2491 2613 4348 -200 -5102 -2248 -2541 1046 8664 9209 209 -2511 -727 2820 7538 2655
20217 2655 508 3608 2558 -2069 2427 11798 12442 13600 15493 15995 11412 18290 11922 -2327 -2296
$$ packed form
20327d292K950M903j155p40K254Q52J980N67o818p040m082K269N105j808N017
20312c8M258K125m341k777k343L64K63o023n343L032M188K713M042k380L023J607
20296B370q02o63N811J40r09M032m021l266j47k29j99k063N243K877o43j067l502
20279B962K907K9q08L800M744J293J735m814n067k45J688j948m079J97j072q900
20263g578j528R019K408K578k317Q03L50J469j0845M637N279j993P711L324m645
20248H672m590n206j609N516N23R00j920j0155n194k04R360P023J123L06j53j901
20232B491J22J735m548m902K854k93L587P618N45r000k720J784L547M718m883
20217B655k147L100j050m627M496R371O44J158J893N02m583O878o368j4249L1
$$ plain form
20202 -2296 4482 4167 975 -386 -4446 3457 7112 9170 8646 11939 12326 7707 6491 7913 7647 9264
20186 9264 10319 12709 13915 11274 10400 4992 -461 -1692 2180 8314 3078 -583 -96 2094 -672
20171 -672 -4182 -744 2268 -2051 -2811 1879 3279 -1598 -2595 -3744 4914 12756 13941 9942 -1126
20156 -1126 -11816 -6833 1196 3006 2529 1854 3418 3818 7033 6633 4971 490 -5604 -12738 -9402
20141 -9402 -5016 -1420 -2145 -2328 -5016 -2304 5053 1752 1029 -77 -762 -481 1084 4706 7156 5282
20125 5282 3141 3601 8223 -1099 -12431 -6825 6911 4891 -61 -4690 -8191 -7985 -4741 959 1298
20110 1298 4361 3661 4652 5122 3504 -3522 -810 4576 2747 3456 3924 2360 306 -431 -5204 -5433
20094 -5433 -3182 498 1426 4564 5674 8301 9592 8341 3454 -6048 -4914 -1256 -2529 -3644 6478
$$ packed form
20202b296O778l15l192j361m060P903L655K058n24L293L87m619j216J422k66J617
20186I264J055K390J206k641q74n408n453j231L872O134n236l661M87K190k766
20171f72l510L438L012m319p60M690J400m877r97j149Q658P842J185l999j1068
20156a126j0690M983Q029J810m77o75J564M00L215m00j662m481o094p134L336
20141i402M386L596p25j83k688K712P357l301p23j106o85K81J565L622K450j874
20125E282k141M60M622r322j1332N606J3736k020m952m629l501K06L244N700L39
20110A298L063p00R91M70j618p026K712N386j829P09M68j564k054p37m773k29
20094e433K251L680R28L138J110K627J291j251m887r502J134L658j273j115J0122
$$ plain form
20079 6478 12924 13502 10640 17005 20134 20441 15177 6148 7706 19035 23231 21373 16754 11401 5803
20064 5803 4576 9057 12466 14118 11199 14401 19366 16754 9151 7222 8110 13298 11842 12666 8636
20049 8636 7601 7619 7524 6935 10847 12603 10834 7607 1435 2127 4435 647 -4254 -8828 -4517 -6798
20033 -6798 -5379 -819 1587 3177 3034 4564 3693 3713 4132 -87 8494 7188 749 -4181 627 4176
20017 4176 1636 3930 6863 8327 1509 -1661 -896 -1433 -5729 -7306 -2605 5174 6145 6735 11969 14529
20001 14529 17350 15092 14647 13301 6654 2597 6521 9099 15576 22172 17973 18588 20657 16299 10655
19986 10655 8376 -1374 4506 7833 7635 11149 13413 13810 17748 23369 18153 15229 15234 13660 7187 7237
19970 7237 10949 13213 13631 6989 2568 7004 8131 5520 9032 11009 14368 10187 3632 10632 6969
$$ packed form
20079F478O446N78k862O365L129L07n264r029J558J1329M196j858m619n353n598
20064E803j227M481L409J652k919L202M965k612p603j929Q88N188j456Q24m030
20049H636j035J8r5n89L912J756j769l227o172O92K308l788m901m574M311k281
20033f798J419M560K406J590j43J530q71K0M19m219Q581j306o439m930M808L549
20017D176k540K294K933J464o818l170P65n37m296j577M701P779R71N90N234K560
20001A4529K821k258m45j346o647m057L924K578O477O596m199O15K069m358n644
19986A0655k279r750N880L327j98L514K264L97L938N621n216k924Nj574o473N0
19970G237L712K264M18o642m421M436J127k611L512J977L359m181o555P000l663
$$ plain form
19955 6969 9271 6651 2274 -352 4686 3974 -247 4816 7957 3979 2958 6862 11618 18313 13836
19940 13836 12049 13361 10977 14242 13614 2579 -4659 -1138 3276 10383 16199 10793 8555 5797
19926 5797 -635 -4426 159 6340 12717 17544 15116 12283 9394 10991 12792 8711 8379 7746 11807
19911 11807 15138 11361 12755 10944 4707 915 5614 9993 10523 13870 16575 14309 9344 5988 9563
19896 9563 7708 6202 10222 10765 12247 9522 6024 8923 11706 13678 18529 14134 16335 13842 9761
19881 9761 1490 6141 11064 8326 11016 13585 10866 7963 7101 5444 6746 12055 11214 11332 12337
19866 12337 14469 10586 8387 2139 1873 11367 17170 27951 30919 32849 29445 25181 12625 4024
19852 4024 3753 605 -914 5889 6937 7432 11472 16177 21052 13263 16212 16474 9399 11628 10497
$$ packed form
19955F969K302k620m377k626N038p12m221N063L141l978j021L904M756O695m477
19940A3836j787J312k384L265o28j1035p238L521M414P107N816n406k238k758
19926E797o432l791M585O181O377M827k428k833k889J597J801m081l32o33M061
19911A1807L331l777J394j811o237l792M699M379N30L347K705k266m965l356L575
19896I563j855j506M020N43J482k725l498K899K783J972M851m395K201k493m081
19881I761q271M651M923k738K690K569k719k903q62j657J302N309q41J18J005
19866A2337K132l883k199o248k66R494N803J0781K968J930l404m264j2556q601
19852D024k71l148j519O803J048M95M040M705M875p789K949K62p075K229j131
$$ plain form
19837 10497 12078 11398 7863 7939 14143 15676 14918 11402 8370 12823 15591 18134 20420 29864 32110
19822 32110 23978 22192 17319 8077 8251 13836 17120 19231 19169 16653 17673 16282 20063 20649 16900
19807 16900 13429 12601 5906 8931 10135 14199 13869 9566 11412 8210 7058 11258 15221 15594 13679
19792 13679 10523 13932 12919 16450 13778 7611 8837 14674 17719 16521 16133 17819 22419 27785 31202
19777 31202 31785 28345 27156 24112 19830 25473 24520 19696 19330 21368 20706 19310 17664 20721 21007 21612
19761 21612 27514 32247 24002 19346 22678 20269 21367 17037 17776 19305 21723 16593 11586 7715 4939
19746 4939 11597 14216 13795 11902 8915 10336 15352 17619 25818 24096 20715 11105 7201 10970 6666
19731 6666 14546 16106 12545 11134 7518 5681 9702 11814 14105 13786 10420 6689 13767 17275 15958
$$ packed form
19837A0497J581o80l535P6O204J533p58l516l032M453K768K543K286R444K246
19822C2110q132j786m873r242J74N585L284K111o2k516J020j391L781N86l749
19807A6900l471q28o695L025J204M064l30m303J846l202j152M200L963L73j915
19792A3679l156L409j013L531k672o167J226N837L045j198l88J686M600N366L417
19777C1202N83l440j189l044m282N643r53m824l66K038o62j396j646L057K86O05
19761B1612N902M733q245m656L332k409J098m330P39J529K418n130n007l871k776
19746D939O658K619m21j893k987J421N016K267Q199j722l381r610l904L769m304
19731F666P880J560l561j411l616j837M021K112K291l19l366l731P078L508j317
$$ plain form
19716 15958 11101 14595 15126 16219 17878 19411 15297 5493 3570 3072 760 2238 5378 3372 2041
19701 2041 6269 7328 14836 21559 21851 18448 16181 15558 19670 23094 25174 32934 29345 20159 19164
19686 19164 19566 14521 11306 14025 14460 17146 11108 7905 14885 19235 14713 12831 13339 13190 5644
19671 5644 1506 9553 11929 6552 7091 16526 23294 25543 25468 22616 24709 29594 32990 32047 34022 41173
19655 41173 45630 46891 52281 51676 54163 57391 57342 51359 52997 53949 46779 40908 41041 43292 44910 39001
19639 39001 30426 22558 19022 22600 23948 22173 21241 23451 23889 22007 25475 22146 14986 15874 13569
19624 13569 11561 8555 11914 13776 14585 15660 12639 11006 16391 17775 13148 6495 6006 8732 17904
19609 17904 26395 26222 18615 14522 15321 15025 12269 8519 10885 15223 19440 16943 17884 12757 17779
$$ packed form
19716A5958m857L494N31J093J659J533m114r804j923m98k312J478L140k006j331
19701B041M228J059P508O723K92l403k267o23M112L424K080P760l589r186r95
19686A9164M02n045l215K719M35K686o038l203O980M350m522j882N08j49p546
19671E644m138Q047K376n377N39R435O768K249p5k852K093M885L396r43J975P151
19655D1173M457J261N390o05K487L228m9n983J638R52p170n871J33K251J618n909
19639C9001q575p868l536L578J348j775r32K210M38j882L468l329p160Q88k305
19624A3569k008l006L359J862Q09J075l021j633N385J384m627o653m89K726R172
19609A7904Q491j73p607m093P99k96k756l750K366M338M217k497R41n127N022
$$ plain form
19594 17779 22979 22061 16162 14943 18490 13156 12975 12277 12140 21816 23773 20968 23753 26646 24675
19579 24675 19884 18098 19581 22149 21390 19091 22895 23168 27449 29113 23349 24089 24539 27597 31497
19564 31497 28076 29481 33118 24322 22753 19557 22367 30278 33562 35140 34248 28017 23220 21271 20011
19549 20011 17368 17191 17999 18007 14805 14416 17711 20934 19547 25161 28586 28013 29566 18980 17717 21048
19533 21048 23972 23440 21818 19601 28027 35167 37034 36636 29672 29736 38840 40083 38004 38430 36204 29440
19517 29440 21339 20047 24451 19053 18878 20556 15279 12598 16070 19050 25704 28567 31319 29084 30317
19502 30317 28430 29640 36375 39812 33296 21769 24079 24447 16977 17715 21393 26524 26349 29289 27966
19487 27966 25221 21130 27306 30621 32068 36079 34926 29427 24153 29059 35677 40031 43774 37778
$$ packed form
19594A7779N200r18n899j219L547n334j81o98j37R676J957k805K785K893j971
19579B4675m791j786J483K568p59k299L804K73M281J664n764P40M50L058L900
19564C1497l421J405L637q796j569l196K810P911L284J578q92o231m797j949j260
19549B0011k643j77Q08Ql202l89L295L223j387N614L425n73J553j0586j263L331
19533B1048K924n32j622k217Q426P140J867l98o964O4R104J243k079M26k226o764
19517B9440q101j292M404n398j75J678n277k681L472K980O654K863K752k235J233
19502C0317j887J210O735L437o516j1527K310L68p470P38L678N131j75K940j323
19487B7966k745m091O176L315J447M011j153n499n274M906O618M354L743n996
$$ plain form
19473 37778 32770 29503 30729 33358 35355 36720 34774 32348 33875 30894 29051 33505 32747 27325 30988
19458 30988 42788 41498 32576 33944 38198 42383 46441 54731 64769 73490 83217 101694 126436
19445 126436 145573 154113 156628 156848 157508 164623 173415 200446 234712 280389 315601 322932 309497
19432 309497 284166 262589 251940 254105 262431 291757 326478 339634 322571 287504 244863 212882
19420 212882 184128 166361 159292 159888 161258 156655 143584 124789 104622 84654 79221 70591 60279
19407 60279 63262 67959 63599 59424 57436 55649 50214 50107 49524 48321 49827 55182 54388 61451 61801
19392 61801 51962 54178 52531 51193 48523 48544 51201 55819 58331 53248 53080 54568 55122 45742 40744
19377 40744 39316 41372 44561 42243 33918 30626 35573 36263 38260 38588 35573 31762 33175 44105 45878
$$ packed form
19473C7778n008l267J226K629J997J365j946k426J527k981j843M454p58n422L663
19458C0988J1800j290q922J368M254M185M058Q290J0038Q721R727J8477K4742
19445A26436J9137Q540K515K20O60P115Q792K7031L4266M5677L5212P331j3435
19432C09497k5331k1577j0649K165Q326K9326L4721J3156j7063l5067m2641l1981
19420B12882k8754j7767p069N96J370m603j3071j8795k0167j9968n433q630j0312
19407F0279K983M697m360m175j988j787n435j07n83j203J506N355p94P063L50
19392F1801r839K216j647j338k670K1K657M618K512n083j68J488N54r380m998
19377D0744j428K056L189k318q325l292M947O90J997L28l015l811J413J0930J773
$$ plain form
19362 45878 36431 42279 46789 45082 42295 36575 33652 33577 32362 33195 32532 35467 31690 28482 24418
19347 24418 27707 33243 36305 31191 29002 33364 35972 40609 38448 42912 39302 32379 35673 32585
19333 32585 26409 28018 30681 31172 32686 34657 39466 44105 37947 44355 50320 46905 42465 42690 44886
19318 44886 44366 49886 55915 56732 60380 63152 65847 60916 61891 64908 64106 63693 63004 59703 62238 60969
19302 60969 49438 49037 45411 42326 45361 54137 59464 54341 47252 43319 39544 42782 52176 50928
19288 50928 41331 37566 42281 44948 46194 46128 49569 51964 45541 37024 38047 43633 42573 41897 42384
19273 42384 39796 34358 32985 31408 22519 24429 32741 40551 42385 47145 53664 48049 39013 37276
19259 37276 45452 43623 34878 32222 36991 44969 48884 48806 43667 37351 43384 48077 49320 47496 51701
$$ packed form
19362D5878r447N848M510j707k787n720k923p5j215Q33o63K935l777l208m064
19347B4418L289N536L062n114k189M362K608M637k161M464l610o923L294l088
19333C2585o176J609K663M91J514J971M809M639o158O408N965l415m440K25K196
19318D4886n20N520O029Q17L648K772K695m931R75L017q02m13o89l301K535j269
19302F0969j1531m01l626l085L035Q776N327n123p089l933l775L238R394j248
19288E0928r597l765M715K667J246o6L441K395o423q517J023N586j060o76M87
19273D2384k588n438j373j577q889J910Q312P810J834M760O519n615r036j737
19259C7276Q176j829q745k656M769P978L915p8n139o316O033M693J243j824M205
$$ plain form
19244 51701 52329 52322 50320 55608 57416 56964 59446 60472 64746 74796 78711 74776 69769 69802 64589 58031
19228 58031 59811 60459 64454 78838 84795 86876 83637 67194 59172 57392 57575 57408 56749 61382 65038
19213 65038 67068 68587 64888 56434 59151 58093 54284 51542 49705 47848 50674 55373 67250 72328
19199 72328 69865 67037 66262 63884 64178 63696 64395 67783 71398 72978 72444 73702 80757 83085 79477 77820
19183 77820 73854 72881 73657 71400 65894 58494 54774 60946 57983 62452 67043 68539 72137 70002 66140
19168 66140 61077 66421 71401 65949 61515 64565 66747 72589 73474 76477 81232 84380 77490 66177
19154 66177 64067 68042 74279 77698 81581 79041 81688 79391 75548 68407 65977 66083 63203 67091 66284
19139 66284 66628 69603 76070 73491 73508 75477 69525 63560 62008 72179 80650 85509 91100 94278 96186
$$ packed form
19244E1701O28pk002N288J808m52K482J026M274J0050L915l935n007L3n213o558
19228E8031J780O48L995J4384N957K081l239j6443q022j780J83j67o59M633L656
19213F5038K030J519l699q454K717j058l809k742j837j857K826M699J1877N078
19199G2328k463k828p75k378K94m82O99L388L615J580n34J258P055K328l608j657
19183G7820l966r73P76k257n506p400l720O172k963M469M591J496L598k135l862
19168F6140n063N344M980n452m434L050K182N842Q85L003M755L148o890j1313
19154F6177k110L975O237L419L883k540K647k297l843p141k430J06k880L888q07
19139F6284L44K975O467k579J7J969n952n965j552J0171Q471M859N591L178J908
$$ plain form
19124 96186 91058 82670 80130 83266 90002 83150 74798 69985 65199 71768 73694 67458 64658 75425
19110 75425 82982 76243 78012 79775 75929 75303 73829 76826 76414 80249 83218 83838 84376 79318 82223
19095 82223 85291 87852 86799 83854 82463 80439 78998 74687 85311 88071 85581 88896 87659 95366
19081 95366 90696 87178 88769 87418 84837 81563 83545 93656 91930 95293 95477 97919 100557 99075
19067 99075 88174 87981 92560 92157 88593 94980 93825 97690 101477 103309 102522 100273 104078 109675 107524
19052 107524 105872 106074 108379 106851 107222 103316 104714 108471 101782 92839 94364 100754 102288 107079 114097
19037 114097 115492 110497 106880 105574 101281 93615 95330 100082 98727 86585 84536 97357 100010 102738
19023 102738 98568 93976 84980 72745 54156 39010 46684 71771 109589 132338 127506 109546
$$ packed form
19124I6186n128q388k540L136O736o852q352m813m786O569J926o236k800J0767
19110G5425P557o739J769J763l846o26j474K997m12L835K969O20N38n058K905
19095H2223L068K561j053k945j391k024j441m311J0624K760k490L315j237P707
19081I5366m670l518J591j351k581l274J982J0111j726L363J84K442K638j482
19067I9075j0901j93M579m03l564O387j155L865L787J832p87k249L805N597k151
19052A07524j652K02K305j528L71l906J398L757o689q943J525O390J534M791P018
19037A14097J395m995l617j306m293p666J715M752j355j2142k049J2821K653K728
19023A02738m170m592q996j2235j8589j5146P674K5087L7818K2749m832j7960
$$ plain form
19011 109546 89300 69608 46557 46301 63141 100811 133664 141066 137798 132556 126877 129364 123079
18998 123079 125385 137998 154851 159947 158227 162250 166575 168908 169624 175787 180819 180640 182006 182436
18984 182436 175742 169324 168042 164260 161881 165502 176450 186796 191934 197959 198965 205380 210329 215391
18970 215391 216059 224311 229842 235872 237118 240121 247146 250226 251196 256676 265458 272137 278321 295586
18956 295586 302026 308422 324289 341690 351687 361830 368277 382467 396330 404527 415320 431353
18944 431353 446795 467337 492254 518804 547581 569148 586039 589434 598316 611211 633205 660426
18932 660426 693857 735171 782602 836010 876353 896640 921119 963652 1030749 1111940 1208181
18921 1208181 1319307 1405392 1455520 1494425 1547128 1628573 1750885 1931682 2154639 2396198
$$ packed form
19011A09546k0246j9692k3051k56J6840L7670L2853P402l268n242n679K487o285
18998A23079K306J2613J6853N096j720M023M325K333P16O163N032j79J366M30
18984A82436o694o418j282l782k379L621J0948J0346N138O025J006O415M949N062
18970B15391O68Q252N531O030J246L003P025L080R70N480Q782O679O184J7265
18956B95586O440O396J5867J7401R997J0143O447J4190J3863Q197J0793J6033
18944D31353J5442K0542K4917K6550K8777K1567J6891L395Q882J2895K1994K7221
18932F60426L3431M1314M7431N3408M0343K0287K4479M2533O7097Q1191R6241
18921A208181J11126Q6085N0128L8905N2703Q1445J22312J80797K22957K41559
$$ plain form
18911 2396198 2646978 2904333 3196918 3589005 4110863 4838851 5872333 7307416 9329968
18902 9329968 12227202 16216756 20605610 23490997 24004774 23268712 22862315 23629623 25864483
18893 25864483 30317255 38111990 49440985 59939863 62589538 57565718 50065026 44312094
18885 44312094 40923385 39603786 41504728 47854450 57658396 64364409 61972593 53308869
18877 53308869 43875832 36764454 31355944 27216745 25017924 25085676 26392719 26331961 23626555
18868 23626555 19610909 15910750 13057798 10677858 8615657 6946702 5688181 4781077
18860 4781077 4144314 3672741 3284419 2964946 2707943 2516677 2343513 2166927 2013262
18851 2013262 1904727 1825579 1737699 1611698 1460982 1324828 1221448 1135462 1059881 1007012
$$ packed form
18911B396198K50780K57355K92585L92087N21858P27988J033482J435083K022552
18902I329968K897234L989554M388854K885387N13777p36062m06397P67308K234860
18893B5864483M452772P794735J1328995J0498878K649675n023820p500692n752932
18885D4312094l388709j319599J900942O349722R803946O706013k391816q663724
18877E3308869r433037p111378n408510m139199k198821O7752J307043o0758k705406
18868B3626555m015646l700159k852952k379940k062201j668955j258521r07104
18860D781077o36763m71573l88322l19473k57003j91266j73164j76586j53665
18851B013262j08535p9148q7880j26001j50716j36154j03380q5986p5581n2869
$$ plain form
18841 1007012 982642 973761 966326 952140 932231 907395 893255 881024 866546 854771 841050 825560
18829 825560 799539 750765 690943 628212 562612 504400 447386 398724 366936 340203 327234
18818 327234 309063 287622 273996 270818 272840 270892 265245 274779 284736 289556 287852 288853 273527
18805 273527 257108 244464 228891 211228 207798 200063 193391 186949 179644 177164 175759 172977 171335
18792 171335 172413 172796 169946 166831 166285 168550 175304 181318 186593 190861 196511 191063 182666 178652 169460
18777 169460 160537 163450 169534 170285 177871 177642 173827 170890 173135 182014 194989 212893 224886 228132
18763 228132 231805 228178 216440 205377 190803 178533 158958 145588 147417 169169 198244 213743
18751 213743 215893 207632 202277 195766 179199 170332 153639 152832 159301 161560 158216 162084 166075 158512
$$ packed form
18841A007012k4370q881p435j4186j9909k4836j4140j2231j4478j1775j3721j5490
18829H25560k6021m8774n9822o2731o5600n8212n7014m8662l1788k6733j2969
18818C27234j8171k1441j3626l178K022j948n647R534R957M820j704J001j5326
18805B73527j6419j2644j5573j7663l430p735o672o442p305k480j405k782j642
18792A71335J078L83k850l115n46K265O754O014N275M268N650n448q397m014r192
18777A69460q923K913O084P51P586k29l815k937K245Q879J2975J7904J1993L246
18763B28132L673l627j1738j1063j4574j2270j9575j3370J829K1752K9075J5499
18751B13743K150q261n355o511j6567q867j6693q07O469K259l344L868L991p563
$$ plain form
18737 158512 146781 133178 116726 101427 101639 106457 106319 90543 85744 89512 83721 77570 64490
18724 64490 51924 48454 58562 66504 70338 76231 85332 100582 117170 136333 161625 201856 242829
18711 242829 268070 277924 277379 267408 262246 249041 241026 236351 224871 212056 202396 195252 191675
18698 191675 187329 179536 180020 182413 182988 182740 179771 180774 182312 177441 176595 171178 172256 178994 188252
18683 188252 193528 196566 201354 217208 222983 223036 219553 217164 213089 219265 220504 222329 229990 229760 229507
18668 229507 227679 231568 226183 225029 220004 219667 215446 202812 199675 200249 199733 200135 205451 213361 224759
18653 224759 233169 235142 236754 234950 231449 222304 213030 208285 210681 213813 214256 215015 227346 240726
18639 240726 247520 246682 248112 258340 266116 282445 293324 303761 315783 327596 343079 342681 338240
$$ packed form
18737A58512j1731j3603j6452j5299K12M818j38j5776m799L768n791o151j3080
18724F4490j2566l470J0108P942L834N893R101J5250J6588J9163K5292M0231M0973
18711B42829K5241R854n45r971n162j3205q015m675j1480j2815r660p144l577
18698A91675m346p793M84K393N75k48k969J003J538m871q46n417J078O738R258
18683A88252N276L038M788J5854N775N3l483k389m075O176J239J825P661k30k53
18668B29507j828L889n385j154n025l37m221j2634l137N74n16M02N316P910J1398
18653B24759Q410J973J612j804l501r145r274m745K396L132M43P59J2331J3380
18639B40726O794q38J430J0228P776J6329J0879J0437J2022J1813J5483l98m441
$$ plain form
18626 338240 329592 307337 269678 225665 188261 153385 131039 131814 148390 183153 224862 266482
18614 266482 300678 331174 353587 367632 365502 354920 332964 315148 295734 277485 263891 252448
18602 252448 246351 247666 250751 247971 243550 241560 238574 235604 233986 233539 230534 230709 234074 236554 234955
18587 234955 230797 232336 236387 238430 241591 239047 231208 231902 227000 231981 235886 244496 253457 265356
18573 265356 278876 289116 278749 267668 262102 254810 255966 255876 258473 265686 281689 292293 300332
18560 300332 310958 307663 294802 279526 262548 249389 242645 236948 240114 247760 259733 267369 268153
18547 268153 270718 270227 268764 274478 276984 274686 278778 281752 293127 302039 316192 333710 346050
18534 346050 361359 380368 391868 396323 399749 398849 390317 382916 379581 375134 362195 349459 347975
$$ packed form
18626C38240q648k2255l7659m4013l7404l4876k2346P75J6576L4763M1709M1620
18614B66482L4196L0496K2413J4045k130j0582k1956j7816j9414j8249j3594j1443
18602B52448o097J315L085k780m421j990k986k970j618m47l005J75L365K480j599
18587B34955m158J539M051K043L161k544p839O94m902M981L905Q610Q961J1899
18573B65356J3520J0240j0367j1081n566p292J156r0K597P213J6003J0604Q039
18560C00332J0626l295j2861j5276j6978j3159o744n697L166P646J1973P636P84
18547B68153K565m91j463N714K506k298M092K974J1375Q912J4153J7518J2340
18534C46050J5309J9009J1500M455L426r00q532p401l335m447j2939j2736j484
$$ plain form
18521 347975 351416 365800 385991 408206 427682 434928 438851 431700 421158 404114 377038 352700
18509 352700 334538 321729 312115 298195 275102 247828 222585 201688 167671 123946 59507 -20078
18497 -20078 -80454 -65957 57688 259759 467689 605046 667342 684839 691736 705489 715860
18486 715860 727382 742537 753260 760573 779604 809894 837815 854264 864445 873841 876826 871077
18474 871077 873049 871467 874432 893166 917867 950726 986921 1019477 1048496 1094426 1167166 1270205
18462 1270205 1420137 1611676 1798720 1885639 1866671 1806407 1750997 1703397 1650442 1605079 1572837
18451 1572837 1556690 1542413 1545736 1556228 1584504 1611828 1644159 1674767 1719568 1782515 1844948
18440 1844948 1924201 2030636 2159462 2324669 2498470 2615422 2651720 2634195 2598211 2601079
$$ packed form
18521C47975L441J4384K0191K2215J9476P246L923p151j0542j7044k7076k4338
18509C52700j8162j2809r614j3920k3093k7274k5243k0897l4017m3725o4439p9585
18497b0078o0376J4497J23645K02071K07930J37357O2296J7497O897J3753J0371
18486G15860J1522J5155J0723P313J9031L0290K7921J6449J0181R396K985n749
18474H71077J972j582K965J8734K4701L2859L6195L2556K9019M5930P2740J03039
18462A270205J49932J91539J87044Q6919j8968o0264n5410m7600n2955m5363l2242
18451A572837j6147j4277L323J0492K8276K7324L2331L0608M4801O2947O2433
18440A844948P9253J06435J28826J65207J73801J16952L6298j7525l5984K868
$$ plain form
18430 2601079 2644606 2718493 2825010 2954053 3109723 3294043 3482303 3654504 3775685 3841204
18420 3841204 3884332 3952597 4078687 4286536 4565384 4867344 5110632 5265700 5382754 5500853
18410 5500853 5626048 5770282 5970442 6226832 6532025 6868460 7256538 7726326 8251407
18401 8251407 8753198 9203780 9636478 10063559 10496855 10937397 11426645 12038102 12817870
18392 12817870 13828389 15120555 16726038 18628933 20810155 23305864 26313120 30203531
18384 30203531 35365173 41756407 48609995 55603024 63617882 73709315 86413632 102468083
18376 102468083 123194229 149620442 182229768 221417030 268859272 328166444 398496826
18369 398496826 465950381 508144363 510618457 476026663 420061794 358748300 300168965
$$ packed form
18430B601079M3527P3887J06517J29043J55670J84320J88260J72201J21181O5519
18420C841204M3128O8265J26090K07849K78848L01960K43288J55068J17054J18099
18410E500853J25195J44234K00160K56390L05193L36435L88078M69788N25081
18401H251407N01791M50582M32698M27081M33296M40542M89248O11457P79768
18392A2817870J010519J292166J605483J902895K181222K495709L007256L890411
18384C0203531N161642O391234O853588O993029Q014858J0091433J2704317J6054451
18376A02468083K0726146K6426213L2609326L9187262M7442242N9307172P0330382
18369C98496826O7453555M2193982K474094l4591794n5964869o1313494n8579335
$$ plain form
18362 300168965 246534887 198951787 159381071 128622857 105518740 88099066 74705813
18355 74705813 64215014 55751474 48745247 42961013 38018662 33619982 29751497 26439885
18347 26439885 23654318 21326052 19389354 17737818 16272526 14946512 13731041 12604359
18339 12604359 11564936 10576717 9647316 8808158 8109351 7567958 7188626 6945635 6781270
18330 6781270 6595989 6335738 6019003 5714882 5483115 5331805 5267392 5298914 5378975 5452180
18320 5452180 5470213 5402239 5250050 5008430 4679844 4283942 3900114 3573044 3312816 3115397
18310 3115397 2964055 2871517 2833433 2818318 2772117 2675535 2535778 2381234 2236864 2098755
18300 2098755 1979844 1880341 1799699 1723780 1655190 1587797 1539361 1504120 1478739 1452661 1421868
$$ packed form
18362C00168965n3634078m7583100l9570716l0758214k3104117j7419674j3393253
18355G4705813j0490799q463540p006227n784234m942351m398680l868485l311612
18347B6439885k785567k328266j936698j651536j465292j326014j215471j126682
18339A2604359j039423r88219r29401q39158o98807n41393l79332k42991j64365
18330F781270j85281k60251l16735l04121k31767j51310o4413L1522Q0061P3205
18320E452180J8033o7974j52189k41620l28586l95902l83828l27070k60228j97419
18310C115397j51342r2538l8084j5115m6201r6582j39757j54544j44370j38109
18300B098755j18911r9503q0642p5919o8590o7393m8436l5241k5381k6078l0793
$$ plain form
18289 1421868 1387499 1361519 1339568 1321105 1324037 1347140 1388085 1455316 1545406 1647111 1746287
18278 1746287 1830902 1913769 2000090 2029493 1950849 1798663 1654299 1539730 1450161 1366831 1300695
18267 1300695 1256025 1230435 1208258 1188958 1161734 1136601 1114817 1090465 1056584 1021121 978681
18256 978681 940421 906656 865271 829161 801304 775368 762319 766240 799217 848093 917853 1016850
18244 1016850 1159936 1351894 1571075 1767022 1899554 1965197 1978369 1932769 1850852 1736107
18234 1736107 1616593 1520394 1456556 1406435 1359868 1318598 1285368 1264463 1252129 1236323 1209944
18223 1209944 1179343 1146674 1114897 1079997 1043411 1014377 993674 976011 970414 977237 992285 995917
18211 995917 991345 975347 951965 928577 907879 905653 899460 885232 874894 876698 892380 925137
$$ packed form
18289A421868l4369k5980k1951j8463K932K3103M0945O7231R0090J01705R9176
18278A746287Q4615Q2867Q6321K9403p8644j52186j44364j14569q9569q3330o6136
18267A300695m4670k5590k2177j9300k7224k5133k1784k4352l3881l5463m2440
18256I78681l8260l3765m1385l6110k7857k5936j3049L921L2977M8876O9760R8997
18244A016850J43086J91958K19181J95947J32532O5643J3172m5600q1917j14745
18234A736107j19514r6199o3838n0121m6567m1270l3230k0905j2334j5806k6379
18223A209944l0601l2669l1777l4900l6586k9034k0703j7663n597O823J5048L632
18211I95917m572j5998k3382k3388k0698k226o193j4228j0338J804J5682L2757
$$ plain form
18199 925137 963695 1004427 1054206 1107881 1177014 1268418 1392773 1558559 1801118 2129561 2529467
18188 2529467 2872789 2924066 2690382 2354385 2067838 1841426 1660296 1525559 1448808 1412263
18178 1412263 1407653 1436364 1497845 1597999 1701629 1764974 1771692 1723441 1636065 1514411 1381192
18167 1381192 1255719 1160234 1086308 1031658 978713 930281 887667 860784 854030 870444 905142
18156 905142 944756 989579 1048989 1110861 1137731 1136060 1128897 1137556 1143990 1114996 1032576 924987
18144 924987 826494 747914 688459 641341 606837 588181 588412 590511 601686 629097 661914 687796
18132 687796 692936 684225 673907 664711 653020 637551 630140 622048 617149 624793 640767 670583 713151
18119 713151 774849 863111 972553 1105379 1266920 1491363 1812771 2303573 3106354 4466251
$$ packed form
18199I25137L8558M0732M9779N3675O9133R1404J24355J65786K42559L28443L99906
18188B529467L43322N1277k33684l35997k86547k26412j81130j34737p6751l6545
18178A412263m610K8711O1481J00154J03630O3345O718m8251q7376j21654j33219
18167A381192j25473r5485p3926n4650n2945m8432m2614k6883o754J6414L4698
18156I05142L9614M4823N9410O1872K6870j671p163Q659O434k8994q2420j07589
18144I24987r8493p8580n9455m7118l4504j8656K31K099J1175K7411L2817K5882
18132F87796N140q711j0318r196j1691j5469p411q092m899P644J5974K9816M2568
18119G13151O1698Q8262J09442J32826J61541K24443L21408M90802Q02781J359897
$$ plain form
18109 4466251 6753927 9978101 12167456 11562974 9386922 7191364 5687047 4424506
18101 4424506 3287550 2426629 1848470 1487352 1255407 1085393 956394 846172 754050
18092 754050 671081 602960 547180 504149 469035 433716 408196 391410 373110 362221 356183 346694
18080 346694 333444 323669 318664 309973 295681 299813 310668 316755 332834 346256 347283 353899 355533
18067 355533 357490 358850 358471 348690 330551 315488 295799 269187 245164 227639 210569 198769
18055 198769 200112 201515 211738 227634 243241 255538 265116 266602 264153 255560 238931 224202 205670
18042 205670 197710 201397 205333 203866 203058 198691 186964 171739 161364 149148 128628 113870 99394
18029 99394 85620 70244 46253 23976 18278 33563 59965 92634 129466 162584 195713 228063
$$ packed form
18109D466251K287676L224174K189355o04482k176052k195558j504317j262541
18101D424506j136956q60921n78159l61118k31945j70014j28999j10222r2122
18092G54050q2969o8121n5780m3031l5114l5319k5520j6786j8300j0889o038r489
18080C46694j3250r775n005q691j4292M132J0855O087J6079J3422J027O616J634
18067C55533J957J360l79r781j8139j5063j9689k6612k4023j7525j7070j1800
18055A98769J343J403J0223J5896J5607J2297R578J486k449q593j6629j4729j8532
18042B05670p960L687L936j467q08m367j1727j5225j0375j2216k0520j4758j4476
18029I9394j3774j5376k3991k2277n698J5285K6402L2669L6832L3118L3129L2350
$$ plain form
18017 228063 253106 271495 280480 276288 256787 241008 219058 195698 192660 201192 202737 208938 207053
18004 207053 201953 186395 168703 145481 127518 112758 102988 96129 91693 79339 69866 64045 60530
17991 60530 57827 62739 71585 79593 77842 76101 78605 75736 74481 76369 81796 79251 80906 72288
17977 72288 72875 73197 69723 63302 57420 49990 42483 38230 39124 37361 32770 32076 42409 50343 52219
17962 52219 56477 53404 48843 55572 60216 63524 73651 74052 75512 77252 78715 80301 88574 105462
17948 105462 123715 145417 164022 161762 144271 131898 124778 116423 115945 120166 129217 144171 152537
17935 152537 167986 198910 233922 260845 273047 273512 266891 246451 219311 197861 182889 178720
17923 178720 183569 195548 212054 237492 252459 251636 250107 245638 257455 277636 298460 305106 314233
$$ packed form
18017B28063K5043J8389Q985m192j9501j5779k1950k3360l038Q532J545O201j885
18004B07053n100j5558j7692k3222j7963j4760r770o859m436j2354r473n821l515
17991F0530k703M912Q846Q008j751j741K504k869j255J888N427k545J655q618
17977G2288N87L22l474o421n882p430p507m253Q94j763m591o94J0333P934J876
17962E2219M258l073m561O729M644L308J0127M01J460J740J463J586Q273J6888
17948A05462J8253K1702J8605k260j7491j2373p120q355m78M221R051J4954Q366
17935A52537J5449L0924L5012K6923J2202M65o621k0440k7140k1450j4972m169
17923A78720M849J1979J6506K5438J4967q23j529m469J1817K0181K0824O646R127
$$ plain form
17910 314233 325752 336417 343202 338574 326385 308608 294178 275145 259281 263763 278673 302287
17898 302287 331287 354079 368920 382368 402856 437607 480998 506081 518565 519015 512257 486907
17886 486907 458438 443313 428070 431532 453144 482170 509933 538935 561963 580222 597004 608700
17874 608700 608452 594473 557720 515184 481757 464522 456650 448184 431204 426970 433473 440995 449579
17861 449579 464078 471922 478508 481155 478991 470248 460449 458253 457780 454655 448449 448547 451221 455667 454831
17846 454831 448406 446073 451541 461494 465130 452046 447972 449144 449103 432770 398630 361512 338914
17833 338914 326331 320288 325810 336946 352470 366659 378927 369722 357910 346222 330731 308292
17821 308292 293251 279563 258809 243365 222423 206785 189508 177847 171010 165177 163299 160969
$$ packed form
17910C14233J1519J0665O785m628j2189j7777j4430j9033j5864M482J4910K3614
17898C02287K9000K2792J4841J3448K0488L4751M3391K5083J2484M50o758k5350
17886D86907k8469j5125j5243L462K1612K9026K7763K9002K3028J8259J6782J1696
17874F08700k48j3979l6753m2536l3427j7235p872q466j6980m234O503P522Q584
17861D49579J4499P844O586K647k164q743r799k196m73l125o206R8K674M446q36
17846D54831o425k333N468R953L636j3084m074J172m1j6333l4140l7118k2598
17833C38914j2583o043N522J1136J5524J4189J2268r205j1812j1688j5491k2439
17821C08292j5041j3688k0754j5444k0942j5638j7277j1661o837n833j878k330
$$ plain form
17809 160969 164659 159811 145900 141046 142288 140823 136261 124438 114676 109609 84312 68455 59975
17796 59975 59170 56304 48521 48384 47981 52452 46946 42914 48649 60650 63888 61940 52096 43206 33865
17781 33865 28168 24176 18065 11081 4167 -3979 -7229 828 -521 -1015 2470 3704 2833 4996 981
17766 981 -2023 -6147 -5807 -8162 -8842 -9208 -1280 3190 -509 -2248 2297 1263 -4082 -7861 -6961 -5065
17750 -5065 -1755 -9100 -20870 -18312 -18861 -19218 -16842 -15375 -7230 -11649 -17296 -13147 -11431 -17220 -20234
17735 -20234 -20647 -21993 -23995 -15616 -13769 -6388 -2752 -4696 -11915 -18618 -15411 -15711 -18636 -18028 -14485
17720 -14485 -9988 -15037 -13761 -14222 -14209 -12731 -14316 -16338 -17575 -17803 -17528 -21301 -20499 -22900 -20862 -18281
17704 -18281 -20834 -21655 -19962 -17854 -18021 -20126 -20660 -18471 -15698 -14544 -9164 -11154 -16241 -21940 -19523
$$ packed form
17809A60969L690m848j3911m854J242j465m562j1823r762n067k5297j5857q480
17796E9975q05k866p783j37m03M471n506m032N735J2001L238j948r844q890r341
17781C3865n697l992o111o984o914q146l250Q057j349m94L485J234q71K163m015
17766I81l004m124L40k355o80l66P928M470l699j739M545j034n345l779R00J896
17750e065L310p345j1770K558n49l57K376J467Q145m419n647M149J716n789l014
17735b0234m13j346k002Q379J847P381L636j944p219o703L207l00k925O08L543
17720a4485M497n049J276m61J3J478j585k022j237k28K75l773Q02k401K038K581
17704a8281k553q21J693K108j67k105n34K189K773J154N380j990n087n699K417
$$ plain form
17689 -19523 -12935 -8463 -10217 -16638 -17804 -17566 -15121 -15271 -17439 -19985 -18678 -19481 -15152 -12695 -9039
17674 -9039 -14685 -25373 -22822 -15558 -13036 -14244 -14593 -19913 -24017 -20735 -18849 -19133 -20536 -20056 -24106
17659 -24106 -14326 -15199 -26737 -28394 -32241 -25802 -20906 -21068 -21960 -23306 -19693 -17189 -14096 -11374 -9148
17644 -9148 -16060 -18358 -18560 -25497 -28930 -34780 -37044 -30631 -30548 -29349 -28915 -32907 -40332 -42576 -36703 -30006
17628 -30006 -23214 -25496 -29269 -30696 -38244 -36162 -32915 -33673 -30246 -27997 -31472 -25411 -20931 -28666 -34575
17613 -34575 -42281 -39779 -36130 -36617 -33309 -21729 -12650 -10413 -11170 -15611 -12397 -12429 -14868 -18184 -15473
17598 -15473 -10674 -9209 -10331 -10298 -16883 -22821 -17310 -16962 -18911 -25756 -27028 -22205 -11480 -5636 -9302
17583 -9302 -15416 -15564 -16005 -15645 -15173 -17134 -15148 -15820 -13659 -14938 -18326 -13100 -10623 -10709 -11898 -13935
$$ packed form
17689a9523O588M472j754o421j166K38K445j50k168k546J307q03M329K457L656
17674i039n646j0688K551P264K522j208l49n320m104L282J886k84j403M80m050
17659b4106R780q73j1538j657l847O439M896j62q92j346L613K504L093K722K226
17644i148o912k298k02o937l433n850k264O413Q3J199M34l992p425k244N873O697
17628c0006O792k282l773j427p548K082L247p58L427K249l475O061M480p735n909
17613c4575p706K502L649m87L308J1580R079K237p57m441L214l2k439l316K711
17598a5473M799J465j122L3o585n938N511L48j949o845j272M823J0725N844l666
17583i302o114j48m41L60M72j961J986o72K161j279l388N226K477q6j189k037
$$ plain form
17567 -13935 -17927 -18150 -15922 -12509 -6621 -508 2065 7598 13083 18584 23193 31702 50133 67258
17553 67258 89667 130607 192851 288345 427274 610914 832026 1016198 1078735 1014738 872581
17542 872581 704267 544090 401006 293211 210913 150239 102332 69137 53829 47603 35709
17531 35709 23927 15908 16148 13047 8777 5740 8719 8667 4484 6613 7422 11795 17759 10631 -259
17516 -259 -673 -3355 -1814 -6522 -4672 -3354 -10052 -12647 -10528 -7968 -9205 -13315 -15324 -15620 -21500
17501 -21500 -17565 -18529 -21658 -29576 -29877 -24969 -31249 -37346 -37943 -31710 -30520 -30819 -22390 -18556 -20956
17486 -20956 -25516 -31757 -34332 -31213 -30219 -29074 -33731 -30877 -28642 -22615 -12863 -15619 -23060 -27072 -25989
17471 -25989 -21298 -19528 -13492 -12772 -18083 -21072 -31004 -35966 -25876 -16185 -14442 -18997 -19189 -12777 -10495
$$ packed form
17567a3935l992k23K228L413N888O113K573N533N485N501M609Q509J8431J7125
17553F7258K2409M0940O2244R5494J38929J83640K21112J84172O2537o3997j42157
17542H72581j68314j60177j43084j07795q2298o0674m7907l3195j5308o226j1894
17531C5709j1782q019K40l101m270l037K979n2m183K129Q09M373N964p128j0890
17516b59m14k682J541m708J850J318o698k595K119K560j237m110k009k96n880
17501b1500L935r64l129p918l01M908o280o097n97O233J190k99Q429L834k400
17486b0956m560o241k575L119R94J145m657K854K235O027R752k756p441m012J083
17471b5989M691J770O036P20n311k989r932m962J0090R691J743m555j92O412K282
$$ plain form
17456 -10495 -15725 -25663 -31632 -22799 -15915 -16229 -17274 -16722 -18505 -19189 -21478 -15451 -9626 -2472 21130
17441 21130 37530 40159 31765 18287 13217 5885 -6284 -11369 -13446 -5183 -3575 -3447 -10771 -16219
17427 -16219 -9453 -14076 -21578 -23828 -24270 -27903 -32779 -31988 -27124 -21853 -22690 -20693 -23148 -27398 -18806
17412 -18806 -12987 -19087 -20447 -16320 -7672 -3636 -10234 -15629 -8127 -12101 -19464 -21162 -15755 -13473
17398 -13473 -25073 -24223 -20949 -22785 -21657 -28053 -32302 -21913 -22508 -22833 -19673 -15400 -17435 -22962 -22956
17383 -22956 -20773 -10848 -9621 -8594 -944 2377 229 -3611 -9571 -18690 -20966 -20218 -21756 -23598 -23110
17368 -23110 -20170 -20440 -25849 -26583 -18665 -17530 -23088 -21435 -16589 -19421 -22562 -25467 -23493 -17021 -14265
17353 -14265 -16736 -22997 -27285 -25261 -25453 -22334 -20935 -21723 -24602 -29008 -24481 -27980 -32061 -35602 -33481
$$ packed form
17456a0495n230r938n969Q833O884l14j045N52j783o84k289O027N825P154K3602
17441B1130J6400K629q394j3478n070p332j2169n085k077Q263J608J28p324n448
17427a6219O766m623p502k250m42l633m876P91M864N271q37J997k455m250Q592
17412a8806N819o100j360M127Q648M036o598n395P502l974p363j698N407K282
17398a3473j1600Q50L274j836J128o396m249J0389n95l25L160M273k035n527O
17383b2956K183R925J227J027P650L321k148l840n960r119k276P48j538j842M88
17368b3110K940k70n409p34P918J135n558J653M846k832l141k905J974O472K756
17353a4265k471o261m288K024j92L119J399p88k879m406M527l499m081l541K121
$$ plain form
17338 -33481 -35402 -42788 -41522 -35829 -39006 -35590 -26597 -24227 -22641 -21909 -28726 -32801 -30763 -26208 -25919
17323 -25919 -28699 -26626 -21879 -20659 -21600 -19288 -16939 -18869 -17340 -18687 -16798 -19325 -23977 -26603 -28697
17308 -28697 -34949 -31321 -32139 -31944 -30215 -25631 -23801 -26693 -26817 -29057 -29934 -26275 -24821 -28405 -33969
17293 -33969 -32803 -28140 -29480 -25246 -28082 -25821 -17996 -12935 -6525 -13314 -21408 -24668 -31300 -33516
17279 -33516 -33990 -34338 -34963 -34913 -37247 -38700 -40184 -38531 -32998 -33576 -28976 -25430 -23915 -26353 -21768 -18776
17263 -18776 -17766 -21786 -23533 -30348 -31856 -32406 -33325 -30663 -34641 -32026 -29873 -21184 -22847 -21505 -20145
17248 -20145 -24603 -27095 -23978 -22991 -26733 -26167 -24430 -16239 -16363 -16776 -21022 -28773 -25354 -28859 -34089
17233 -34089 -35196 -28170 -27519 -27292 -28449 -21770 -16861 -12089 -14297 -16074 -19963 -23778 -21774 -22327 -18499
$$ packed form
17338c3481j921p386J266N693l177L416Q993K370J586P32o817m075K038M555K89
17323b5919k780K073M747J220r41K312K349j930J529j347J889k527m652k626k094
17308b8697o252L628q18J95J729M584J830k892j24k240q77L659J454l584n564
17293c3969J166M663j340M234k836K261P825N061O410o789q094l260o632k216
17279c3516m74l48o25N0k334j453j484J653N533n78M600L546J515k438M585K992
17263a8776J010m020j747o815j508n50r19K662l978K615K153Q689j663J342J360
17248b0145m458k492L117R87l742N66J737Q191j24m13m246p751L419l505n230
17233c4089j107P026O51K27j157O679M909M772k208j777l889l815K004n53L828
$$ plain form
17218 -18499 -13875 -20453 -26327 -30111 -30426 -30490 -23385 -16512 -14587 -13760 -14027 -22382 -22362 -21804 -20152 -19513 -19015
17201 -19015 -20481 -23482 -21010 -11540 -8332 -12299 -19253 -22925 -20762 -16024 -18231 -23989 -27981 -29376
17187 -29376 -33247 -34092 -35578 -30336 -26025 -26692 -20962 -18985 -19214 -28332 -32472 -24580 -28711 -26492 -25481
17172 -25481 -25665 -20414 -20173 -22510 -26067 -27818 -22999 -31379 -30098 -26259 -26646 -26182 -28695 -27439 -25970
17157 -25970 -23785 -28096 -25181 -22208 -24266 -19308 -17943 -23513 -22727 -22150 -27777 -26571 -25762 -23411 -17094
17142 -17094 -12526 -18998 -22707 -19294 -15052 -13750 -21937 -23930 -25706 -28192 -22967 -21795 -27739 -25977
17128 -25977 -18197 -25107 -28749 -29039 -28528 -24873 -16221 -17554 -15415 -14916 -14430 -20625 -21616 -21121 -20341 -24388
17112 -24388 -24989 -26439 -29112 -23989 -20611 -22042 -29300 -28281 -30750 -31350 -30090 -29026 -26171 -24856 -28493
$$ packed form
17218a8499M624o578n874l784l15o4P105O873J925Q27k67q355K0N58J652O39M98
17201a9015j466l001K472R470L208l967o954l672K163M738k207n758l992j395
17187b9376l871q45j486N242M311o67N730J977k29r118m140P892m131K219J011
17172b5481j84N251K41k337l557j751M819q380J281L839l87M64k513J256J469
17157b5970K185m311K915K973k058M958J365n570P86N77n627J206Q09K351O317
17142a7094M568o472l709L413M242J302q187j993j776k486N225J172n944J762
17128b5977P780o910l642k90N11L655Q652j333K139M99M86o195r91M95P80m047
17112b4388o01j450k673N123L378j431p258J019k469o00J260J064K855J315l637
$$ plain form
17097 -28493 -31691 -26607 -18533 -16951 -20453 -15531 -18858 -16266 -13454 -7710 -5641 -7713 -4613 -6173
17083 -6173 -15198 -25358 -26254 -27124 -30696 -29472 -23305 -19620 -24875 -24391 -15371 -14884 -14095 -17634 -10958 -15032
17067 -15032 -23170 -23734 -16805 -13953 -19748 -24452 -26842 -31398 -31587 -31080 -34700 -35205 -31620 -28872 -32226
17052 -32226 -31780 -27069 -28160 -32957 -28489 -13835 -16355 -20274 -22135 -20727 -24640 -27124 -27842 -23324 -17679
17037 -17679 -16805 -25200 -33456 -32621 -24714 -20194 -21676 -15637 -7825 -3103 -7963 -12006 -9633 -12238 -14967
17022 -14967 -15374 -10624 -8837 -7784 -14673 -21774 -24975 -19564 -17536 -21020 -18963 -18058 -17269 -15470 -16277
17007 -16277 -12852 -14535 -19414 -23771 -30615 -35851 -35316 -32759 -23929 -23720 -18196 -18360 -19993 -21723 -29857
16992 -29857 -30968 -26767 -20263 -18400 -19999 -20731 -26553 -21249 -15599 -20356 -24737 -22246 -20551 -21098 -20075
$$ packed form
17097b8493l198N084Q074J582l502M922l327K592K812N744K069k072L100j560
17083f173r025j0160q96q70l572J224O167L685n255M84R020M87P89l539O676m074
17067a5032q138n64O929K852n795m704k390m556j89N07l620n05L585K748l354
17052c2226M46M711j091m797M468J4654k520l919j861J408l913k484p18M518N645
17037a7679Q74q395q256Q35P907M520j482O039P812M722m860m043K373k605k729
17022a4967m07M750J787J053o889p101l201N411K028l484K057R05P89J799q07
17007a6277L425j683m879m357o844n236N35K557Q830K09N524j64j633j730q134
16992b9857j111M201O504J863j599p32n822N304N650m757m381K491J695n47J023
$$ plain form
16977 -20075 -19171 -14256 -15481 -16500 -14662 -14211 -15121 -18628 -16133 -14370 -16661 -16182 -16449 -17437 -15768 -13093
16961 -13093 -5547 -14637 -18067 -18030 -18795 -21044 -21120 -14558 -16062 -13330 -8197 -5086 -9425 -16700 -20416 -16878
16945 -16878 -21316 -18190 -13303 -14373 -7573 -8502 -13448 -17907 -21305 -18497 -15784 -15972 -13641 -7016 2381
16930 2381 1519 -3240 -8769 -15291 -17911 -19988 -21647 -18992 -10060 -6763 -9258 -12427 -10154 -13470 -16957
16915 -16957 -17829 -8485 -11806 -17127 -22112 -21393 -7695 7236 16320 24117 32156 38018 36377 26340
16901 26340 16826 4666 -5789 -15741 -19070 -23513 -30974 -22657 -14109 -17471 -18061 -12559 -13372 -15735
16887 -15735 -21001 -21948 -22534 -27653 -26718 -20975 -20231 -19855 -14711 -9695 -10741 -18675 -24451 -22653 -21207 -22806
16871 -22806 -22727 -18078 -19335 -16012 -14928 -11554 -13020 -16380 -23618 -23543 -16055 -10235 -4483 -3274 -8843
$$ packed form
16977b0075R04M915j225j019J838M51r10l507K495J763k291M79k67r88J669K675
16961a3093P546r090l430L7p65k249p6O562j504K732N133L111m339p275l716L538
16945a6878m438L126M887j070O800r29m946m459l398K808K713j88K331O625R397
16930B381q62m759n529o522k620k077j659K655Q932L297k495l169K273l316l487
16915a6957q72R344l321n321m985P19J3698J4931R084P797Q039N862j641j0037
16901B6340r514j2160j0455r952l329m443p461Q317Q548l362n90N502q13k363
16887a5735n266r47n86n119R35N743P44L76N144N016j046p934n776J798J446j599
16871b2806P9M649j257L323J084L374j466l360p238P5P488N820N752J209n569
$$ plain form
16856 -8843 -17489 -16431 -11877 -22025 -20754 -19650 -13753 -11308 -7655 -8644 -16041 -13510 -11760 -13373 -7284
16841 -7284 3670 8939 7320 1593 10996 15003 10929 18553 21487 17748 14739 18376 15326 12213
16827 12213 9290 9386 4534 2981 3669 258 -4452 -1967 -4888 -11690 -16697 -15702 -13896 -13577 -20742 -26901
16811 -26901 -25244 -23492 -14351 -15404 -24948 -18834 -18752 -28636 -26628 -18239 -20796 -21696 -25264 -28842 -27482
16796 -27482 -22682 -20200 -16304 -21582 -24845 -24670 -28020 -31901 -30568 -22909 -22885 -18545 -12301 -17403 -27130
16781 -27130 -24360 -24738 -27134 -29233 -27046 -26035 -30658 -30200 -27698 -29119 -33699 -29754 -25920 -22317 -21760
16766 -21760 -24774 -26585 -27153 -34695 -35563 -32623 -28847 -31200 -33440 -33485 -28269 -33030 -33693 -28811 -25495 -26009
16750 -26009 -26022 -21371 -18992 -16063 -13598 -15010 -20170 -24663 -21813 -23919 -22482 -13969 -10507 -9210 -9996
$$ packed form
16856h843q646J058M554j0148J271J104N897K445L653r89p397K531J750j613O089
16841g284J0954N269j619n727R403M007m074P624K934l739l009L637l050l113
16827A2213k923R6m852j553O88l411m710K485k921o802n007R95J806L19p165o159
16811b6901J657J752R141j053r544O114Q2r884K008Q389k557r00l568l578J360
16796b7482M800K482L896n278l263J75l350l881J333P659K4M340O244n102r727
16781b7130K770l78k396k099K187J011m623M58K502j421m580L945L834L603N57
16766b1760l014j811n68p542q68K940L776k353k240m5N216m761o63M882L316n14
16750b6009j3M651K379K929K465j412n160m493K850k106J437Q513L462J297p86
$$ plain form
16735 -9996 -4252 -7296 -16268 -24293 -23719 -16771 -13177 -3400 -4490 -8610 -10208 -9189 -15480 -24718 -26927
16720 -26927 -14997 -13568 -14193 -15316 -15933 -18770 -15967 -18122 -16906 -14496 -11258 -13865 -16484 -15000 -10264
16705 -10264 -3937 -7630 -15361 -16772 -13752 -11139 -11485 -12454 -5901 -4340 -6278 -9086 -11665 -5315 -6645
16690 -6645 -12004 -14264 -14602 -11872 -15394 -16573 -10907 -12387 -11071 -8346 -12078 -15308 -12681 -13553 -18433
16675 -18433 -22882 -25297 -21075 -12719 -11251 -11334 -10074 -10974 -11884 -13202 -16867 -27434 -30616 -20841 -16363
16660 -16363 -21423 -31577 -32342 -29304 -27145 -23464 -13717 -11896 -20444 -21472 -13231 -16201 -15897 -18742 -20305
16645 -20305 -18249 -21181 -19327 -16600 -14430 -16645 -19225 -21961 -23919 -18714 -19418 -20542 -15572 -14235 -12566
16630 -12566 -13384 -14050 -19615 -21829 -19433 -23412 -24236 -26980 -21909 -22104 -18483 -18213 -15467 -19727 -25143 -21183
$$ packed form
16735i996N744l044q972q025N74O948L594R777j090m120j598J019o291r238k209
16720b6927J1930J429o25j123o17k837K803k155J216K410L238k607k619J484M736
16705a0264O327l693p731j411L020K613l46r69O553J561j938k808k579O350j330
16690f645n359k260l38K730l522j179N666j480J316K725l732l230K627q72m880
16675a8433m449k415M222Q356J468q3J260r00r10j318l665j0567l182R775M478
16660a6363n060j0154p65L038K159L681R747J821q548j028Q241k970L04k845j563
16645b0305K056k932J854K727K170k215k580k736j958N205p04j124M970J337J669
16630a2566q18o66n565k214K396l979q24k744N071j95L621K70K746m260n416L960
$$ plain form
16614 -21183 -16104 -12028 -13596 -21638 -28106 -29545 -23729 -21000 -16146 -16310 -20568 -24401 -29257 -21380 -16656
16599 -16656 -17898 -15805 -20213 -21587 -21373 -19364 -17134 -17214 -21299 -25178 -13544 -10022 -17825 -22251 -24896
16584 -24896 -25200 -24453 -23493 -17822 -7747 -9115 -19350 -20642 -12609 -7933 -8629 -11924 -13126 -8236 -15191
16569 -15191 -23421 -23940 -22794 -25621 -25715 -27292 -25813 -17102 -16083 -25605 -27288 -20241 -18926 -19624 -12937
16554 -12937 -13415 -19811 -24714 -26107 -29976 -33617 -32437 -23588 -21774 -30646 -36868 -35625 -33241 -33829 -30843
16539 -30843 -24555 -28532 -28232 -28419 -31446 -30087 -28619 -30210 -32482 -29809 -24278 -25030 -27178 -20471 -15295
16524 -15295 -18820 -22297 -17324 -16882 -17271 -11157 -8925 -14151 -18352 -17302 -12705 -10829 -11930 -12526 -11500
16509 -11500 -9183 -16112 -20670 -22384 -22002 -27834 -26696 -21267 -16188 -13395 -17831 -19028 -19470 -24801 -24043
$$ packed form
16614b1183N079M076j568q042o468j439N816K729M854j64m258l833m856P877M724
16599a6656j242K093m408j374K14K009K230q0m085l879J1634L522p803m426k645
16584b4896l04P47R60N671J0075j368j0235j292Q033M676o96l295j202M890o955
16569a5191q230n19J146k827r4j577J479Q711J019r522j683P047J315o98O687
16554a2937m78o396m903j393l869l641J180Q849J814q872o222J243K384n88K986
16539c0843O288l977L00j87l027J359J468j591k272K673N531p52k148O707N176
16524a5295l525l477M973M42l89O114K232n226m201J050M597J876j101n96J026
16509a1500K317o929m558j714L82n832J138N429N079K793m436j197m42n331P58
$$ plain form
16494 -24043 -22561 -16881 -18930 -19461 -17560 -15837 -13304 -7572 -4555 -9546 -21532 -17331 -15064 -14071 -13367
16479 -13367 -13770 -16011 -16934 -16760 -13858 -15594 -18177 -18436 -19536 -25245 -21563 -17106 -14494 -15450 -14083 -13388
16463 -13388 -22583 -23156 -24984 -25385 -23782 -22036 -19984 -19645 -16685 -14724 -17865 -19096 -20559 -23750 -23318
16448 -23318 -24720 -25494 -23812 -17594 -13455 -15953 -18024 -19748 -15343 -22487 -28819 -28339 -26369 -29104 -29436
16433 -29436 -27545 -30744 -36620 -30727 -20289 -21263 -29735 -33649 -29138 -27373 -27162 -26940 -24193 -20231 -21911
16418 -21911 -21039 -13154 -14327 -15050 -13061 -17003 -22138 -14486 -9875 -12202 -13554 -17364 -18222 -13893 -9201
16403 -9201 -8835 -17532 -20564 -23662 -24890 -24004 -23062 -20705 -19139 -18781 -17553 -17496 -14497 -11949 -19518 -24428
16387 -24428 -22092 -19860 -16222 -12683 -17561 -29872 -26217 -15633 -11757 -13879 -16355 -24135 -27433 -27821
$$ packed form
16494b4043J482N680k049n31J901J723K533N732L017m991j1986M201K267R93P04
16479a3367m03k241r23J74K902j736k583k59j100n709L682M457K612r56J367O95
16463a3388r195n73j828m01J603J746K052L39K960J961l141j231j463l191M32
16448b3318j402p74J682O218M139k498k071j724M405p144o332M80J970k735l32
16433b9436J891l199n876N893J0438r74q472l914M511J765K11K22K747L962j680
16418b1911Q72P885j173p23J989l942n135P652M611k327j352l810q58M329M692
16403i201L66q697l032l098j228Q86R42K357J566L58J228N7K999K548p569m910
16387b4428K336K232L638L539m878j2311L655J0584L876k122k476p780l298l88
$$ plain form
16373 -27821 -29621 -25326 -29083 -30564 -31536 -23407 -22154 -19439 -15541 -17538 -16947 -15504 -11805 -10502 -14238
16358 -14238 -19844 -21342 -20177 -19090 -17329 -14390 -15242 -10724 -7210 -7938 -11131 -15467 -14251 -9071 -11172
16343 -11172 -18182 -20974 -23318 -26640 -27139 -32149 -32976 -29087 -28395 -26557 -22728 -18132 -20440 -23699 -19439
16328 -19439 -15608 -16472 -25252 -28176 -20602 -11287 -12039 -19530 -14563 -16070 -13917 -20402 -24684 -22804 -27640
16313 -27640 -32706 -29005 -24571 -25219 -37204 -33741 -25262 -25050 -29361 -26283 -25347 -27138 -24686 -22789 -23300
16298 -23300 -26256 -26867 -25717 -20931 -13550 -15127 -10808 -14403 -19633 -23952 -23915 -21330 -19822 -20837 -17522
16283 -17522 -18855 -14582 -12564 -10790 -10048 -17318 -19665 -22072 -15270 -18994 -17449 -5353 -2865 -10916
16269 -10916 -12882 -10177 -7294 -4422 -7458 -15267 -15133 -12478 -10248 -13118 -14323 -12268 -8311 -8187 -12379
$$ packed form
16373b7821j800M295l757j481r72Q129J253K715L898j997N91J443L699J303l736
16358a4238n606j498J165J087J761K939q52M518L514p28l193m336J216N180k101
16343a1172p010k792k344l322m99n010q27L889O92J838L829M596k308l259M260
16328a9439L831q64q780k924P574R315p52p491M967j507K153o485m282J880m836
16313b7640n066L701M434o48j1985L463Q479K12m311L078R36j791K452J897n11
16298b3300k956o11J150M786P381j577M319l595n230m319L7K585J508j015L315
16283a7522j333M273K018J774P42p270k347k407O802l724J545J2096K488q051
16269a0916j966K705K883K872l036p809J34K655K230k870j205K055L957J24m192
$$ plain form
16254 -12379 -12732 -7244 -11634 -11921 -14714 -11055 -12327 -16324 -16560 -23839 -16094 -3509 1999 317 -6294
16239 -6294 -12418 -15978 -24725 -28069 -22767 -20237 -22801 -21184 -17382 -10878 -9473 -14019 -17265 -19657 -15151
16224 -15151 -11917 -16126 -22425 -23240 -22192 -21855 -18996 -18009 -19568 -22628 -21817 -17867 -21518 -21712 -19362 -21456
16208 -21456 -18097 -13548 -13856 -13422 -21622 -21825 -19249 -15787 -15703 -24578 -16392 -10742 -9526 -15045 -20019 -21965
16192 -21965 -15957 -17838 -22258 -18898 -11474 -12612 -18040 -19565 -11096 -9441 -15906 -20287 -24778 -15777
16178 -15777 -8310 -14119 -23826 -23934 -21245 -14140 -14114 -12835 -11008 -8627 -17297 -18933 -17973 -15739 -11854
16163 -11854 -9255 -12059 -14392 -16247 -13452 -13199 -14380 -24379 -24022 -17201 -13567 -13861 -22280 -15897 -7295
16148 -7295 -5943 -4339 -2618 -5269 -4387 -4847 -14626 -13050 -5287 -2890 -4805 -10545 -8850 -5748 -6073
$$ packed form
16254a2379l53N488m390k87k793L659j272l997k36p279P745J2585N508j682o611
16239f294o124l560q747l344N302K530k564J617L802O504J405m546l246k392M506
16224a5151L234m209o299q15J048L37K859R87j559l060Q11L950l651j94K350k094
16208b1456L359M549l08M34q200k03K576L462Q4q875Q186N650J216n519m974j946
16192b1965O008j881m420L360P424j138n428j525Q469J655o465m381m491R001
16178a5777P467n809r707j08K689P105K6J279J827K381q670j636R60K234L885
16163a1854K599k804k333j855K795K53j181r999L57O821L634k94q419O383Q602
16148g295J352J604J721k651Q82m60r779J576P763K397j915n740J695L102l25
$$ plain form
16133 -6073 -11401 -10209 -9241 -13039 -16767 -12845 -5259 -7153 -15900 -17875 -18062 -21925 -15204 -5873 -11071
16118 -11071 -12551 -11587 -16077 -15179 -8196 -11739 -12365 -12370 -15642 -13143 -7888 -3713 -6162 -11449 -21253 -15557
16102 -15557 -8747 -9791 -14061 -17808 -18132 -19109 -23619 -23190 -18326 -14673 -6642 -5036 -2489 -3858 -7383
16087 -7383 -15262 -15749 -14136 -16158 -17897 -7340 -1326 225 1813 -2286 -7983 -8145 -5808 -10906 -16313
16072 -16313 -14342 -15013 -20400 -18586 -15162 -18039 -19624 -19480 -24847 -26041 -27507 -26097 -31791 -35702 -32131
16057 -32131 -28364 -24444 -19310 -14002 -7239 -8711 -10052 -13443 -14125 -8986 -9231 -13742 -26900 -33431 -24662
16042 -24662 -19041 -9103 -6973 -10075 -14506 -13817 -20029 -26213 -18456 -15299 -21754 -21422 -19695 -20392 -17869
16027 -17869 -17240 -16016 -12242 -12770 -17663 -8011 -4624 -18855 -19885 -21622 -16385 -8445 -6012 -7564 -11858
$$ packed form
16133f073n328J192R68l798l728L922P586j894q747j975j87l863O721R331n198
16118a1071j480R64m490Q98O983l543o26nl272K499N255M175k449n287r804N696
16102a5557O810j044m270l747l24r77m510M29M864L653Q031J606K547j369l525
16087g383p879m87J613k022j739J0557O014J551J588m099n697j62K337n098n407
16072a6313J971o71n387J814L424k877j585J44n367j194j466J410n694l911L571
16057c2131L767L920N134N308O763j472j341l391o82N139k45m511j3158o531Q769
16042b4662N621R938K130l102m431O89o212o184P757L157o455L32J727o97K523
16027a7869O29J224L774n28m893R652L387j4231j030j737N237P940K433j552m294
$$ plain form
16012 -11858 -9046 -2381 -5598 -9537 -15183 -19578 -14845 -15040 -14021 -7077 -6155 -13905 -9015 -4139 -3639
15997 -3639 -12254 -15080 -16062 -12836 -8450 -11269 -17896 -14926 -11346 -21761 -16898 -9439 -15137 -18715 -24050
15982 -24050 -27738 -27819 -24614 -25761 -23709 -19995 -16073 -13817 -15521 -18404 -21774 -18210 -17466 -19974 -21707
15967 -21707 -18453 -19395 -25177 -29050 -28008 -25305 -22669 -27085 -20419 -9842 -7712 -14948 -18896 -12594
15953 -12594 -11829 -16256 -9951 -4083 -9011 -13293 -21842 -24138 -21559 -18112 -12905 -6586 -6584 -13143 -14956
15938 -14956 -20286 -18860 -17735 -19862 -21617 -22214 -19088 -18852 -15513 -17590 -18421 -17272 -15777 -17419 -19533
15923 -19533 -21606 -20705 -16819 -21059 -24750 -28358 -27095 -26566 -22834 -20822 -18564 -21969 -26271 -21781 -22848
15908 -22848 -24458 -24246 -20278 -15992 -17098 -17796 -15982 -13916 -15149 -20820 -17893 -18636 -11519 -5407 2638
$$ packed form
16012a1858K812O665l217l939n646m395M733j95J019O944R22p750M890M876N00
15997c639q615k826r82L226M386k819o627K970L580j0415M863P459n698l578n335
15982b4050l688q1L205j147K052L714L922K256j704k883l370L564P44k508j733
15967b1707L254r42n782l873J042K703K636m416O666J0577K130p236l948O302
15953a2594P65m427O305N868m928m282q549k296K579L447N207O319Ko559j813
15938a4956n330J426J125k127j755n97L126K36L339k077q31J149J495j642k114
15923a9533k073R01L886m240l691l608J263N29L732K012K258l405m302M490j067
15908b2848j610K12L968M286j106o98J814K066j233n671K927p43P117O112Q045
$$ plain form
15893 2638 33 -3204 -11742 -16219 -17617 -15723 -15378 -14210 -13536 -14346 -15500 -9275 -13577 -17260 -12414
15878 -12414 -15314 -17395 -20850 -21513 -20092 -19571 -15706 -15003 -13574 -15356 -9884 -6671 -2378 -1642 -2094 -9155
15862 -9155 -8726 -6282 -4968 -5290 -5792 -9123 -6882 -10014 -11625 -3279 -2682 -7578 -10079 -10331 -13170 -14662
15846 -14662 -8990 -4558 -1935 -8489 -14911 -11710 -4117 -4168 -6706 -3748 -8639 -11943 -8968 -8773 -8646
15831 -8646 -9748 -9437 -7238 -9236 -8471 -6334 -9035 -9334 -13661 -15268 -15186 -13733 -13812 -10065 -7042 -3789
15815 -3789 1067 -3883 -7837 -7981 -11386 -4252 -2839 3075 -442 -7959 -9972 -9498 -9502 -13790 -7868 2629
15799 2629 -1254 -3150 -276 -3706 -6442 -6783 -7074 -2365 3609 -1654 -7016 -4323 -311 3395 6977
15784 6977 2908 1508 -2196 -3469 -8837 -6772 -777 6248 1681 -3238 -9150 -14044 -13803 -7577 -432
$$ packed form
15893B638k605l237q538m477j398J894L45J168O74q10j154O225m302l683M846
15878a2414k900k081l455o63J421N21L865P03J429j782N472L213M293P36m52p061
15862i155M29K444J314l22n02l331K241l132j611Q346N97m896k501k52k839j492
15846a4662N672M432K623o554o422L201P593n1k538K958m891l304K975J95J27
15831h646j102L11K199j998P65K137k701k99m327j607Q2J453p9L747L023L253
15815c789M856m950l954j44l405P134J413N914l517p517k013M74mm288N922J0497
15799B629l883j896K874l430k736l41k91M709N974n263n362K693M012L706L582
15784F977m069j400l704j273n368K065N995P025m567m919n912m894K41O226P145
$$ plain form
15769 -432 -3548 -3525 -1458 43 467 1738 7735 8610 5036 6519 9810 2467 -2676 -4651 -3963 -1986
15753 -1986 -5168 -6078 -9046 -7945 -2273 2495 -1235 -5775 -7816 -1802 -103 2536 3573 4999 4765
15738 4765 4702 2019 11155 18711 16576 18419 14505 8119 -1675 -5012 -135 -2801 686 4116 570
15723 570 -3400 3749 2598 1608 2444 1934 -2038 -1078 -107 -2708 -3987 -653 -4917 -4729 756 -2871
15707 -2871 -4790 -11148 -8096 -5707 -4204 -2695 -650 -2391 697 -1299 -4129 -2644 -3458 -190 -4496
15692 -4496 -9514 -12231 -6302 3178 4861 8712 9973 8539 2393 4671 11354 13656 11730 12858 17621
15677 17621 18166 14753 10258 8171 9446 5288 3806 4546 5844 7165 9042 8958 3479 -4854 -13566
15662 -13566 -9128 -3032 1685 5720 7708 8619 149 -1550 -4541 -100 5996 1280 -1784 2878 12029
$$ packed form
15769d32l116K3K067J501M24J271N997Q75l574J483L291p343n143j975O88J977
15753a986l182r10k968J101N672M768l730m540k041O014J699K639J037J426k34
15738D765o3k683R136P556k135J843l914o386r794l337M877k666L487L430l546
15723E70l970P149j151r90Q36n10l972R60R71k601j279L334m264J88N485l627
15707b871j919o358L052K389J503J509K045j741L088j996k830J485q14L268m306
15692d496n018k717N929R480J683L851J261j434o146K278O683K302j926J128M763
15677A7621N45l413m495k087J275m158j482P40J298J321J877q4n479q333q712
15662a3566M438O096M717M035J988R11q470j699k991M441O096m716l064M662R151
$$ plain form
15647 12029 16958 14358 16868 15232 16674 14719 6508 -433 -1243 -4291 -8227 -15626 -22158 -19708 -18472
15632 -18472 -14745 -17412 -15588 -9315 -11041 -12024 -11397 -5877 882 -778 -3383 -6040 -5602 -3563 -8443
15617 -8443 -4815 -2263 1801 618 6442 3177 -2089 4559 4746 8024 3690 -2458 -832 4810 2426
15602 2426 1380 728 3658 3152 235 -5497 -8721 -4568 -10582 -8821 -3544 -7504 -7594 -4045 -7169 -4472
15586 -4472 2776 2706 -5072 -8311 -1919 2487 -4226 -1958 473 3903 -5286 -12773 -16266 -7417 -4393
15571 -4393 -4178 -6240 -6345 -9618 -8945 -4024 -872 -904 3877 -416 101 -1304 -5385 -5633 -3722 -2948 -4588
15554 -4588 6978 8038 7679 16358 16803 8255 7807 3046 1730 7492 8793 2041 -5328 -9243 -8675
15539 -8675 -10151 -12126 -9503 -8801 -4372 1512 380 -3574 -5910 -8338 -7096 -7778 -4851 -3944 -7727
$$ packed form
15647A2029M929k600K510j636J442j955q211o941q10l048l936p399o532K450J236
15632a8472L727k667J824O273j726r83O27N520O759j660k605k657M38K039m880
15617h443L628K552M064j183N824l265n266O648J87L278m334o148J626N642k384
15602B426j046o52K930n06k917n732l224M153o014J761N277l960r0L549l124K697
15586d472P248p0p778l239O392M406o713K268K431L430r189p487l493Q849L024
15571d393K15k062j05l273O73M921L152l2M781m293N17j405m081k48J911P74j640
15554d588J1566J060l59Q679M45q548m48m761j316N762J301o752p369l915N68
15539h675j476j975K623P02M429N884j132l954k336k428J242o82K927R07l783
$$ plain form
15524 -7727 -5811 -4816 -4483 -4303 -6609 388 -524 -9604 -13981 -13681 -11472 -5481 -2859 -3154 -5219 -662
15508 -662 -2567 -4090 -6540 -3695 -3288 -6679 -10724 -5720 -8542 -6575 -5190 -4939 -9697 -3209 -697
15493 -697 -3349 -214 7159 5110 -889 -5441 -2462 -7035 -13007 -12804 -15322 -10939 -8492 -1628 7680
15478 7680 4964 -3248 -2882 -8398 -9126 -9312 -9790 -11868 -9684 -7277 -2361 -4678 -10666 -4894 -1231 -3995
15462 -3995 -7910 -9198 -4314 -4637 -1848 3539 5570 2188 -1607 -4174 175 -6120 -6902 -2730 1604
15447 1604 2806 1153 -3655 -4983 1056 4424 -2775 -4099 2454 -2168 -4110 1232 5077 -1177 -2401
15432 -2401 -504 4809 10774 12900 14944 14199 7978 -1154 -824 2805 5142 12900 10569 10395 7922
15417 7922 4783 829 -2472 2861 5798 7325 3491 -848 3064 -3333 -16438 -16543 -5790 -5543 -5482
$$ packed form
15524g727J916R95L33J80k306O997r12r080m377L00K209N991K622k95k065M557
15508f62j905j523k450K845M07l391m045N004k822J967J385K51m758O488K512
15493f97k652L135P373k049n999m552K979m573n972K03k518M383K447O864R308
15478G680k716q212L66n516p28j86m78k078K184K407M916k317n988N772L663k764
15462c995l915j288M884l23K789N387K031l382l795k567M349o295p82M172M334
15447A604J202j653m808j328O039L368p199j324O553m622j942N342L845o254j224
15432b401J897N313N965K126K044p45o221r132L30L629K337P758k331j74k473
15417G922l139l954l301N333K937J527l834m339L912o397j3105j05J0753K47O1
$$ plain form
15402 -5482 -1603 2263 4059 4596 -1924 -5734 -9229 -8394 -3512 -3842 -4535 -2460 6418 6638 7093 8152
15386 8152 7494 4019 -272 1660 -2154 -4410 -5660 -4928 -2476 515 -5140 -1326 1095 1406 2370 3011
15370 3011 1287 3391 6679 3023 5517 4267 2196 5047 7892 3785 -3352 -2613 -1290 -3881 5239
15355 5239 10057 8031 12286 12207 8869 6850 3346 -886 -921 -2535 -2885 -7312 -8708 -11581 -7347 3467
15339 3467 4546 1805 10223 15659 15821 10704 6458 4389 4137 5530 9549 8847 11090 14787 15659 11156
15323 11156 10326 4444 3962 1626 387 2356 8279 5580 3946 3583 -614 4780 5453 11496 11459 5916
15307 5916 2883 7359 7177 431 3238 879 -393 -1519 1059 2924 3346 6045 6620 5273 53
15292 53 521 6739 7681 9261 5760 9670 21017 23657 21726 18967 16571 12415 12441 11538 12025 10703
$$ packed form
15402e482L879L866J796N37o520l810l495Q35M882l30o93K075Q878K20M55J059
15386H152o58l475m291J932l814k256j250P32K452K991n655L814K421L11R64O41
15370C011j724K104L288l656K494j250k071K851K845m107p137P39J323k591R120
15355E239M818k026M255p9l338k019l504m232l5j614l50m427j396k873M234J0814
15339C467J079k741Q418N436J62n117m246k069k52J393M019p02K243L697Q72m503
15323A1156q30n882m82k336j239J969N923k699j634l63m197N394O73O043l7n543
15307E916l033M476j82o746K807k359j272j126K578J865M22K699N75j347n220
15292E3M68O218R42J580l501L910J1347K640j931k759k396m156K6r03M87j322
$$ plain form
15276 10703 10253 14145 5120 -1767 -3911 -3593 3441 5299 4247 8156 12111 8904 12028 17219 23653
15261 23653 21754 15971 10981 2750 5898 11813 10016 6607 -3795 -2398 1378 5100 9470 7752
15247 7752 2980 2390 5724 10449 8156 2401 7106 2660 2262 3101 106 -306 3525 2498 343 -273
15231 -273 4319 8857 9190 11185 8507 5224 3103 9112 11622 3241 3069 12054 12140 9989 7475 5916
15215 5916 2226 4895 8030 7800 7828 10413 14128 11976 5951 -1000 -7712 -3067 -1457 4289 7607
15200 7607 7637 9805 11092 2477 -547 -899 -1627 -826 -3578 -1915 -5026 -4660 -4186 -9390 -4338 2849
15184 2849 2357 3346 3928 2064 1236 1085 5840 7970 1278 -831 653 6524 1645 254 3946 6679
15168 6679 2521 1881 3894 8510 473 -6502 -6278 267 -836 -252 2852 356 -3116 -1477 3772
$$ packed form
15276A0703m50L892r025o887k144L18P034J858j052L909L955l207L124N191O434
15261B3653j899n783m990q231L148N915j797l409j0402J397L776L722M370j718
15247G752m772n90L334M725k293n755M705m446l98Q39k995m12L831j027k155o16
15231b73M592M538L33J995k678l283k121O009K510q381j72Q985Q6k151k514j559
15215E916l690K669L135k30K8K585L715k152o025o951o712M645J610N746L318
15200G607L0K168J287q615l024l52p28Q01k752J663l111L66M74n204N052P187
15184B849m92R89N82j864q28j51M755K130o692k109J484N871m879j391L692K733
15168F679m158o40K013M616q037o975K24O545j103N84L104k496l472J639N249
$$ plain form
15153 3772 4588 12491 14619 9769 5441 6666 16804 20935 15297 9234 6163 6164 11306 9748 17696
15138 17696 14386 -255 -5458 -6418 -5104 812 11017 17631 18070 12262 4503 5210 8314 3750 3336
15123 3336 3568 4342 5764 -1245 -2496 4339 5126 2614 -3439 -1703 4251 6371 2585 1376 2149 2530
15107 2530 1688 -1929 3299 6292 2186 -1804 558 7882 5586 -2623 -5939 -588 2179 -842 -3048
15092 -3048 1905 -468 -1455 2980 4567 -30 3570 8466 6610 8116 4030 -132 -1725 -1745 -10889
15077 -10889 -9803 -7565 -7658 -6071 -2641 -255 4834 4707 8974 10415 5711 1365 -2119 -2069 -4389 -11094
15061 -11094 -17128 -12979 -7624 -8324 -11267 -15172 -16045 -19119 -7252 -149 3011 1534 2019 66 -147
15046 -147 -2412 -6887 -9325 -3518 6882 11126 3597 -4822 -11858 -6267 -1871 -2678 4467 -1164 -2260
$$ packed form
15153C772Q16P903K128m850m328J225J0138M131n638o063l071JN142j558P948
15138A7696l310j4641n203r60J314N916J0205O614M39n808p759P07L104m564m14
15123C336K32P74J422p009j251O835P87k512o053J736N954K120l786j209P73L81
15107B530q42l617N228K993m106l990K362P324k296q209l316N351K767l021k206
15092c048M953k373r87M435J587m597L600M896j856J506m086m162j593k0r144
15077a0889J086K238r3J587L430K386N089j27M267J441m704m346l484N0k320o705
15061a1094o034M149N355p00k943l905q73l074J1867P103L160j477M85j953k13
15046a47k265m475k438N807J0400M244p529q419p036N591M396q07P145n631j096
$$ plain form
15031 -2260 6055 11789 4772 1977 2083 7010 9026 6073 3076 5058 5647 4272 4492 1461 -1814
15016 -1814 -3302 -2908 -3213 -5091 -1433 869 -6282 -11133 -14097 -11972 -8988 -3801 -2271 -7815 -12519
15001 -12519 -3750 4698 714 6041 6714 -3280 -12295 -10444 -8050 -12586 -14117 -14900 -13218 -18024 -11982
14986 -11982 -10037 -13177 -5227 -7035 -5138 -7367 -3102 -2992 -2689 103 -1118 -8438 -15209 -10155 -3163
14971 -3163 -2845 -350 -5214 -1757 -1336 -10457 -12037 -11197 -7219 -3560 -2343 -2882 -3872 -10909 -11514 -12607
14955 -12607 -9930 -8916 -14153 -10875 -6133 35 6738 9407 7591 4619 4331 5147 3128 5683 8206
14940 8206 896 1556 -4408 3576 5443 2130 3413 2479 -208 6641 7661 10706 8643 1349 -640
14925 -640 4182 3222 3069 2206 -163 -1111 -4775 -5018 4779 7428 -2359 -7411 134 746 1415 -3708 -11838
$$ packed form
15031b260Q315N734p017k795J06M927K016k953k997J982N89j375K20l031l275
15016a814j488L94l05j878L658K302p151m851k964K125K984N187J530n544m704
15001a2519Q769Q448l984N327O73r994r015J851K394m536j531p83J682m806O042
14986a1982J945l140P950j808J897k229M265J10L03K792j221p320o771N054O992
14971c163L18K495m864L457M21r121j580Q40L978L659J217n39r90p037o05j093
14955a2607K677J014n237L278M742O168O703K669j816k972k88Q16k019K555K523
14940H206p310O60n964P984J867l313J283r34k687O849J020L045k063p294j989
14925f40M822r60j53q63k369r48l664k43R797K649r787n052P545O12O69n123q130
$$ plain form
14908 -11838 -7965 -3082 2727 2457 -4031 -10111 -9246 -10164 -10581 -12806 -13082 -12305 -15391 -9979 -7630 -15000
14892 -15000 -15195 -9568 -9025 -5877 -5780 -2673 2983 1765 -3753 -724 7528 16385 4060 -9821 -9953
14877 -9953 -6805 -4537 -5136 -3725 1857 -490 1871 5811 6767 9149 5282 78 -1594 -2644 -843
14862 -843 1354 2026 -1520 -2512 -3753 -1271 -5384 -5736 -8782 -7454 -6439 -2819 5590 3981 -598 -4088
14846 -4088 -2922 -2760 -7290 -3274 -1554 -743 -12149 -14051 -3415 -1321 3150 871 2054 4118 7676
14831 7676 5138 -6749 -12251 -8928 -5541 -8747 -4844 4074 -157 -3758 4029 -1379 -6103 -4475
14817 -4475 -4346 -6233 -9103 -4464 3514 4989 7896 12944 14308 14187 11340 6694 5387 4019 -3217
14802 -3217 -5130 1713 3976 6522 2939 1695 8299 10055 2763 4549 4736 4814 3560 -4171 -3149
$$ packed form
14908a1838L873M883N809k70o488o080Q65r18m17k225k76P77l086N412K349p370
14892a5000j95N627N43L148R7L107N656j218n518L029Q252Q857j2325j3881j32
14877i953L148K268n99J411N582k347K361L940R56K382l867n204j672j050J801
14862h43K197O72l546r92j241K482m113l52l046J328J015L620Q409j609m579l490
14846d088J166J62m530M016J720Q11j1406j902J0636K094M471k279J183K064L558
14831G676k538j1887n502L323L387l206L903Q918m231l601P787n408m724J628
14817d475J29j887k870M639P978J475K907N048J364j21k847m646j307j368p236
14802c217j913O843K263K546l583j244O604J756p292J786J87P8j254p731J022
$$ plain form
14787 -3149 -169 248 3004 5467 3689 -4004 -13445 -9270 -3 -3998 -3562 2078 8345 8920 5070
14772 5070 4962 10878 8537 7191 9606 7990 10067 15546 15549 12142 8720 11303 10875 12994 8642 7507
14756 7507 11214 13777 10160 10850 8561 1516 2047 5755 7653 4678 2681 5724 18146 19539 15228
14741 15228 23908 21101 12751 6000 12605 16672 18176 17597 13576 9378 6911 10234 9097 1312 1389
14726 1389 -2506 -2862 -4439 -2151 7175 8046 10280 10069 3484 -1185 -2704 -1891 1096 -231 -206 3863
14710 3863 -1446 3622 7838 6500 9221 14222 7073 2744 1066 3045 -751 10747 15780 14260
14696 14260 12903 9002 3917 1230 1385 1309 3732 -518 -4853 -3146 2666 6080 7803 7681 7696 8885
14680 8885 6265 4086 4780 2167 3781 2625 -4281 1689 2815 -3098 -15601 -17516 -13341 -13660 -7186
$$ packed form
14787c149K980M17K756K463j778p693r441M175R267l995M36N640O267N75l850
14772E070j08N916k341j346K415j616K077N479Ll407l422K583m28K119m352j135
14756G507L707K563l617O90k289p045N31L708J898k975j997L043J2422J393m311
14741A5228Q680k807q350o751O605M067J504n79m021m198k467L323j137p785P7
14726A389l895l56j577K288R326Q71K234k11o585m669j519Q13K987j327K5M069
14710C863n309N068M216j338K721N001p149m329j678J979l796J1498N033j520
14696A4260j357l901n085k687J55p6K423m250m335J707N812L414J723j22J5J189
14680H885k620k179O94k613J614j156o906N970J126n913j2503j915M175l19O474
$$ plain form
14665 -7186 -9349 -10818 -2831 -3349 -5153 -4266 -2713 5102 701 -763 1507 2638 9248 13719 16933
14650 16933 19926 15461 10144 13141 15378 14210 17524 13222 3227 72 -2392 946 6241 3012
14636 3012 -749 644 5180 5935 4018 -442 -2621 50 -3375 -7423 -6998 -4426 -1138 -4593 -4823
14621 -4823 -6719 -2351 5268 4619 3847 9183 12010 15868 11104 6970 4642 1407 822 7236 3249
14606 3249 -5273 -10763 -5122 3314 10365 16898 9902 11446 10688 9767 12368 16998 9287 -928 -2598
14591 -2598 89 2787 2942 881 2735 2688 10185 10777 9507 8886 7811 3088 -1508 -6570 -1492 441
14575 441 -3843 -325 6154 1302 1651 -3689 -2562 -1468 2211 -3496 -3832 -8975 -9028 -4020 -3437 -2673
14559 -2673 624 2067 3983 2184 -7479 -10490 -4718 553 -3897 -5345 -4668 -4305 -1489 7471 7605
$$ packed form
14665g186k163j469P987n18j804Q87J553P815m401j464K270J131O610M471L214
14650A6933K993m465n317K997K237j168L314m302r995l155k464L338N295l229
14636C012l761J393M536P55j917m460k179K671l425m048M25K572L288l455k30
14621d823j896M368P619o49p72N336K827L858m764m134k328l235n85O414l987
14606C249q522n490N641Q436P051O533o996J544p58r21K601M630p711j0215j670
14591b598K687K698J55k061J854m7P497N92j270o21j075m723m596n062N078J933
14575D41m284L518O479m852L49n340J127J094L679n707l36n143n3N008N83P64
14559b673L297J443J916j799r663l011N772N271m450j448O77L63K816Q960J34
$$ plain form
14544 7605 4339 1002 -3516 -6345 -6140 -3037 -582 -6357 -8993 -3531 -465 -4586 -7763 -8215 -9143
14529 -9143 -8304 -4932 -2924 -1692 -1420 -5457 -9425 -5127 1004 4933 5929 6186 2611 238 -421 -2310
14513 -2310 -3430 -871 3516 10034 7304 2078 3017 6584 6747 4599 6362 8165 -546 -2871 7891
14498 7891 16151 16390 7418 1541 1080 2520 6961 14728 11732 4275 1408 3979 3765 2007 5077
14483 5077 -696 -2224 3020 2899 -782 -2154 -2275 2506 5946 2948 10214 9751 9796 5278 7005 10823
14467 10823 18604 16683 1742 2083 10932 11779 11978 16167 15476 13942 17510 17171 8708 5608 11875
14452 11875 14592 16908 12964 -313 -8799 -8860 -3019 9085 12246 11350 5871 -2113 4379 7689 2955
14437 2955 -5748 -6625 -4200 751 3965 -737 -7017 -359 6297 6120 4044 -678 517 641 5637
$$ packed form
14544G605l266l337m518k829K05L103K455n775k636N462L066m121l177m52r28
14529i143Q39L372K008J232K72m037l968M298O131L929R96K57l575k373o59j889
14513b310j120K559M387O518k730n226R39L567J63k148J763J803q711k325J0762
14498G891Q260K39q972n877m61J440M441P767k996p457k867K571k14j758L070
14483E077n773j528N244j21l681j372j21M781L440k998P266m63M5m518J727L818
14467A0823P781j921j4941L41Q849Q47J99M189o91j534L568l39q463l100O267
14452A1875K717K316l944j3277q486o1N841J2104L161q96n479p984O492L310m734
14437B955q703q77K425M951L214m702o280O658O656j77k076m722J195J24M996
$$ plain form
14422 5637 3761 5030 6945 8823 5324 6572 3312 -277 2209 3266 6758 7323 6284 355 -3625
14407 -3625 -3621 -4634 -7896 -2527 3481 -511 3203 11763 12115 10407 11044 14796 13762 15506 23952 39225
14391 39225 43603 43816 40182 38337 37046 35335 29792 32952 36178 30927 29038 19030 11780 11974 9559
14376 9559 11585 15277 16565 10419 4093 3415 10842 18956 23522 24544 19860 21823 20962 18848 13326
14361 13326 13817 9092 8880 8128 11618 16276 15380 9032 3417 13569 14940 14182 7621 10668 15992
14346 15992 25853 19192 12920 9107 15078 13581 9779 13898 17482 13045 6967 4037 2789 2741 3455
14331 3455 1140 2626 6131 3948 4967 3398 8280 14966 17052 17283 21584 24410 24772 24620 19408
14316 19408 16476 19412 22014 21046 28706 34674 42360 52519 66284 93580 124821 137350 139383
$$ packed form
14422E637j876J269J915J878l499J248l260l589K486J057L492N65j039n929l980
14407c625Mj013l262N369O008l992L714Q560L52j708O37L752j034J744Q446J5273
14391C9225M378K13l634j845j291j711n543L160L226n251j889j0008p250J94k415
14376I559K026L692J288o146o326o78P427Q114M566J022m684J963q61k114n522
14361A3326M91m725k12p52L490M658q96o348n615J0152J371p58o561L047N324
14346A5992R861o661o272l813N971j497l802M119L584m437o078k930j248m8P14
14331C455k315J486L505k183J019j569M882O686K086K31M301K826L62j52n212
14316A9408k932K936K602r68P660N968P686J0159J3765K7296L1241J2529K033
$$ plain form
14303 139383 123703 101633 80667 55767 43995 31073 18492 7965 4685 10378 13979 17253
14291 17253 25559 22766 16186 16536 19641 15240 12307 14947 9489 16040 28419 34961 32298 26603
14277 26603 28424 27446 18115 14735 15833 9560 7903 8190 5960 5475 8842 11707 9778 10941 13708
14262 13708 11542 7481 15146 24801 21857 11505 7823 13695 11783 11993 12768 9540 14535 13341 7565
14247 7565 5629 6377 10544 15028 15291 17531 19620 20717 18991 13517 16193 19022 14485 14394 12646 9981
14231 9981 13659 20873 20252 17699 8530 3375 10457 13879 13093 16667 12851 8872 9155 8905 9114 5799
14215 5799 5084 3730 7523 10673 9426 10507 10839 15328 13810 8543 7495 5594 9238 9200 4263 4101
14199 4101 1562 172 2258 3066 4107 9886 4326 4473 7127 5260 8199 5689 5022 11416 9114
$$ packed form
14303A39383j5680k2070k0966k4900j1772j2922j2581j0527l280N693L601L274
14291A7253Q306k793o580L50L105m401k933K640n458O551J2379O542k663n695
14277B6603J821r78r331l380J098o273j657K87k230m85L367K865j929J163K767
14262A3708k166m061P665R655k944j0352l682N872j912K10P75l228M995j194n776
14247G565j936P48M167M484K63K240K089J097j726n474K676K829m537r1j748k665
14231I981L678P214o21k553r169n155P082L422p86L574l816l979K83k50K09l315
14215E799p15j354L793L150j247J081L32M489j518n267j048j901L644l8m937j62
14199D101k539j390K086Q08J041N779n560J47K654j867K939k510o67O394k302
$$ plain form
14184 9114 7704 7845 8116 12554 19662 14874 9457 8930 6919 4917 7975 3604 6064 3741 -2473
14169 -2473 3215 6967 7535 6094 5325 5841 11262 13768 16738 12816 11851 13774 8851 6223 -696 -658
14153 -658 -3055 -8690 880 3059 1173 1007 6461 10598 5003 3617 -1133 -7699 -9096 -4258 -325
14138 -325 3005 5639 8589 10648 10001 7740 12340 18205 15503 3603 4639 3799 2586 5383 16416
14123 16416 15588 9559 10514 9143 7263 8732 10675 8429 3793 12376 19028 12919 12298 17033 14341
14108 14341 16235 24266 27046 29582 28680 28413 22899 20137 17521 16290 12371 8007 5265 12809 15183
14093 15183 7351 16012 22926 23330 27129 29825 26779 26524 26158 23500 23663 26778 33570 30685 28085
14078 28085 28372 31856 32110 37399 42267 40299 33135 30715 36719 40265 40225 39166 35918 36330 33810 29347
$$ packed form
14184I114j410J41K71M438P108m788n417n27k011k002L058m371K460k323o214
14169b473N688L752N68j441p69N16N421K506K970l922r65J923m923k628o919L8
14153f58k397n635R570K179j886j66N454M137n595j386m750o566j397M838L933
14138c25L330K634K950K059o47k261M600N865k702j1900J036q40j213K797J1033
14123A6416q28o029R55j371j880J469J943k246m636Q583O652o109o21M735k692
14108A4341J894Q031K780K536r02k67n514k762k616j231l919m364k742P544K374
14093A5183p832Q661O914M04L799K696l046k55l66k658J63L115O792k885k600
14078B8085K87L484K54N289M868j968p164k420O004L546m0j059l248M12k520m463
$$ plain form
14062 29347 25076 23981 26270 28421 28119 24191 23603 33517 43669 44648 39373 32146 28649 29022 35832
14047 35832 40408 42688 41503 31187 24661 24250 24023 25500 24666 23085 21685 22880 24230 26262 22688
14032 22688 13838 6740 5301 5299 -1348 1345 7523 7189 5191 11923 10203 16450 21530 23396 23674 22437
14016 22437 21442 21478 17813 23604 23792 20232 25918 22402 19084 17067 15306 18499 23333 26640 24583
14001 24583 28304 31126 32979 27439 19190 20470 17246 10604 7886 8320 12571 16727 21392 14955 16979
13986 16979 25530 25039 20416 19658 13239 16811 23670 28316 31103 26900 22904 23019 23861 24969 25960 28305
13970 28305 27966 27372 25248 28297 27591 23389 22756 24857 27696 20625 11362 15045 19188 20581 20926 19100
13954 19100 18219 13828 14306 22641 21023 15611 14319 17053 22320 21575 22384 29380 32662 25111 26158
$$ packed form
14062B9347m271j095K289K151l02l928n88R914J0152R79n275p227l497L73O810
14047C5832M576K280j185j0316o526m11k27J477q34j581j400J195J350K032l574
14032B2688q850p098j439ko647K693O178l34j998O732j720O247N080J866K78j237
14016B2437r95L6l665N791J88l560N686l516l318k017j761L193M834L307k057
14001B4583L721K822J853n540q249J280l224o642k718M34M251M156M665o437K024
13986A6979Q551m91m623p58o419L572O859M646K787m203l996J15Q42J108R91K345
13970B8305l39n94k124L049p06m202o33K101K839p071r263L683M143J393L45j826
13954A9100q81m391M78Q335j618n412j292K734N267p45Q09O996L282p551J047
$$ plain form
13939 26158 35006 33395 31192 35652 34285 43645 57673 57382 50733 45091 41276 28632 24685 27462
13925 27462 28290 24067 20097 20843 26913 31828 27758 20980 22179 17338 12809 13873 12731 11610 9950
13910 9950 4035 12639 8718 5103 5793 14638 15497 12547 15284 16132 19195 21905 19687 22508 20956
13895 20956 23731 22923 23840 25186 22151 18209 10992 10385 11171 11566 16356 24122 20555 16300 15725 22358
13879 22358 22347 22240 26747 26838 21065 15812 9211 4497 5939 5626 6997 8431 15587 25383 27488 25551
13863 25551 18188 16491 18925 26059 27865 28696 25601 28914 32845 38300 38088 35963 35885 34615 36614
13848 36614 40094 33188 27755 30482 28670 29484 32179 31970 28755 33820 35079 32396 31049 22745 10420
13833 10420 1106 7024 16595 26315 25227 19778 22077 20282 17820 20928 25949 28971 27669 29589
$$ packed form
13939B6158Q848j611k203M460j367R360J4028k91o649n642l815j2644l947K777
13925B7462Q28m223l970P46O070M915m070o778J199m841m529J064j142j121j660
13910I950n915Q604l921l615O90Q845Q59k950K737Q48L063K710k218K821j552
13895B0956K775q08R17J346l035l942p217o07P86L95M790P766l567m255n75O633
13879B2358j1j07M507R1n773n253o601m714J442l13J371J434P156R796K105j937
13863B5551p363j697K434P134J806Q31l095L313L931N455k12k125p8j270J999
13848C6614L480o906n433K727j812Q14K695k09l215N065J259k683j347q304j2325
13833A0420r314N918R571R720j088n449K299j795k462L108N021L022j302J920
$$ plain form
13819 29589 30413 31785 35389 37482 41018 43598 48505 47642 45843 49275 52220 53673 54102 49813 46879
13804 46879 50427 46754 43042 37920 34230 36776 35862 31897 35936 44029 47289 42809 43833 43666 41000
13789 41000 44019 45775 42631 33518 25415 24166 25417 29461 34187 28121 23118 23390 22502 20973 23923
13774 23923 21016 16359 11175 9442 14292 18402 24076 29301 28792 27785 28011 30683 25076 26489 28361
13759 28361 26065 27448 24277 29212 30815 23064 19921 18442 22361 27416 26769 26296 34036 45800 44664
13744 44664 44125 50490 50957 52926 49682 57672 62166 62853 61205 54565 49258 51159 53002 48752 50541
13729 50541 53487 61301 61237 60875 60723 56937 54515 56485 56877 51346 48661 48509 46017 35696 31347 29208
13713 29208 27521 26046 29928 34052 40226 35148 22244 19948 21410 15898 19456 21422 22127 24755
$$ packed form
13819B9589Q24J372L604K093L536K580M907q63j799L432K945J453M29m289k934
13804D6879L548l673l712n122l690K546r14l965M039Q093L260m480J024j67k666
13789D1000L019J756l144r113q103j249J251M044M726o066n003K72q88j529K950
13774B3923k907m657n184j733M850M110N674N225n09j007K26K672n607J413J872
13759B8361k296J383l171M935J603p751l143j479L919N055o47m73P740J1764j136
13744D4664n39O365M67J969l244P990M494O87j648o640n307J901J843m250J789
13729E0541K946P814o4l62j52l786k422J970L92n531k685j52k492j0321m349k139
13713B9208j687j475L882M124O174n078j2904k296J462n512L558J966P05K628
$$ plain form
13699 24755 26747 21650 18424 24617 30807 31115 34721 31643 22400 13937 19735 26685 25180 23310 26678
13684 26678 33109 36604 35188 35160 29526 32260 30833 22445 22153 19978 16976 19324 23209 26176 29687
13669 29687 34564 36395 39402 44840 42163 38209 31589 28839 30608 29039 33912 33398 32097 29186 32241
13654 32241 40294 41074 38365 40948 38351 34538 35974 32424 26827 31690 37149 40337 44996 42835 39674
13639 39674 35996 37902 42250 38301 37847 43149 43178 38925 38424 40183 40192 41447 40245 37144 39254 38020
13623 38020 29926 26986 32417 42968 44264 47270 49102 58261 56708 52074 51386 49449 56305 55830 51930
13608 51930 46287 41081 31981 34488 31383 34023 38135 38455 36521 36259 35468 32740 40029 43948 38531
13593 38531 37010 37039 36636 39805 41994 44359 48244 47835 42397 39585 40923 41888 42654 33214 30884 34340
$$ packed form
13699B4755J992n097l226O193O190L08L606l078r243q463N798O950j505j870L368
13684B6678O431L495j416k8n634K734j427q388k92k175l002K348L885K967L511
13669B9687M877J831L007N438k677l954o620k750J769j569M873n14j301k911L055
13654C2241Q053P80k709K583k597l813J436l550n597M863N459L188M659k161l161
13639C9674l678J906M348l949m54N302K9m253n01J759RJ255j202l101K110j234
13623C8020q094k940N431J0551J296L006J832R159j553m634o88j937O856m75l900
13608E1930n643n206r100K507l105K640M112L20j934k62p91k728P289L919n417
13593C8531j521K9m03L169K189K365L885m09n438k812J338R65P66r440k330L456
$$ plain form
13577 34340 33055 36474 41835 39564 41538 45340 50179 52407 52146 50774 46044 41805 37309 40231 40426
13562 40426 39652 40319 48846 46892 36858 33938 30204 28106 32927 43880 43524 41999 39410 33724 34191
13547 34191 34431 34734 39705 35132 28251 22171 20593 22482 27541 38844 45721 45653 43632 39391 45725
13532 45725 51860 50365 47334 48849 51644 57318 59660 54815 49514 40281 39701 40599 42353 49332 52579
13517 52579 48857 43097 38030 38540 42067 39392 43832 43733 38190 35407 29755 26090 30057 34517 36361
13502 36361 37555 37854 42010 40600 40585 39025 35563 41654 41738 45075 47072 47906 43137 39012 45039 52106
13486 52106 50934 52221 50418 41740 40895 50554 49298 49378 48328 47983 50620 49101 42007 36817 35360
13471 35360 37612 43637 48755 42908 45013 47088 42091 44176 50546 56638 48306 46761 43344 39541
$$ packed form
13577C4340j285L419N361k271J974L802M839K228k61j372m730m239m496K922J95
13562D0426p74O67Q527j954j0034k920l734k098M821J0953l56j525k589n686M67
13547C4191K40L03M971m573o881o080j578J889N059J1303O877o8k021m241O334
13532D5725O135j495l031J515K795N674K342m845n301r233n80Q98J754O979L247
13517E2579l722n760n067N10L527k675M440r9n543k783n652l665L967M460J844
13502C6361J194K99M156j410j5j560l462O091Q4L337J997Q34m769m125O027P067
13486E2106j172J287j803q678q45R659j256Q0j050l45K637j519p094n190j457
13471C5360K252O025N118n847K105K075m997K085O370O092q332j545l417l803
$$ plain form
13457 39541 37523 41274 46644 45512 46958 44886 39177 35704 32933 45393 58754 58604 52400 49918
13443 49918 47125 46273 51818 62620 67811 66982 73244 79568 88645 107524 127929 137387 140680 134062
13429 134062 122362 112925 102894 96002 80123 67482 63817 64325 67505 66871 65139 55476 47249 47098
13415 47098 48261 43479 45391 46184 50516 58308 64148 62714 62502 66096 65133 58215 55004 57164 56802
13400 56802 51786 56849 57995 54395 54049 58645 64919 64961 63188 61908 57569 57109 52150 52262 55540 56747
13384 56747 54799 53247 53489 61525 68916 61099 63744 68530 71811 73054 74458 68483 71407 76210 77234
13369 77234 72483 69317 67865 71329 73179 70067 68939 66570 62204 57393 62949 70320 74110 80604
13355 80604 82435 90781 93178 90544 91396 91678 97234 99829 98147 98916 99240 92817 84661 79576 80813
$$ packed form
13457C9541k018L751N370j132J446k072n709l473k771J2460J3361j50o204k482
13443D9918k793q52N545J0802N191q29O262O324R077J8879K0405R458L293o618
13429A34062j1700r437j0031o892j5879j2641l665N08L180o34j732r663q227j51
13415D7098J163m782J912P93M332P792N840j434k12L594r63o918l211K160l62
13400E6802n016N063J146l600l46M596O274M2j773j280m339m60m959J12L278J207
13384E6747j948j552K42Q036P391p817K645M786L281J243J404n975K924M803J024
13369G7234m751l166j452L464J850l112j128k369m366m811N556P371L790O494
13355H0604J831Q346K397k634Q52K82N556K595j682P69L24o423q156n085J237
$$ plain form
13340 80813 87304 93296 93686 100220 99647 94592 96601 96829 95601 95192 92174 88146 89076 94306 104530
13325 104530 105311 105251 115677 122837 122895 119470 120937 129952 137226 147523 154292 160808 165098 172374 172542
13310 172542 186457 202911 222554 253226 293866 348283 421438 518363 666680 872251 1187787
13299 1187787 1639659 2146252 2442004 2359009 2019646 1628929 1306933 1035398 787176 595070
13289 595070 456783 356968 286994 239724 206194 188886 175735 163020 152504 145552 135188
13278 135188 133997 127814 125802 124466 122515 121072 107979 100781 98364 92809 91363 92626 85983 83092
13264 83092 83571 79944 75665 71512 74075 82282 82794 87228 97626 97778 88987 84591 85436 89436 89453 88157
13248 88157 78151 74143 73340 78829 82663 83826 81308 73795 74526 75420 77695 81209 70791 75604 87643
$$ packed form
13340H0813O491N992L90O534n73n055K009K28j228m09l018m028R30N230J0224
13325A04530P81o0J0426P160N8l425J467R015P274J0297O769O516M290P276J68
13310A72542J3915J6454J9643L0672M0640N4417P3155R6925J48317K05571L15536
13299A187787M51872N06593K95752q2995l39363l90717l21996k71535k48222j92106
13289E95070j38287r9815o9974m7270l3530j7308j3151j2715j0516o952j0364
13278A35188j191o183k012j336j951j443j3093p198k417n555j446J263o643k891
13264H3092M79l627m279m153K563Q207N12M434J0398J52q791m396Q45M000J7j296
13248H8157j0006m008q03N489L834J163k518p513P31Q94K275L514j0418M813J2039
$$ plain form
13233 87643 88119 87716 89907 96460 96984 92979 95391 86179 79797 80091 80565 82262 79933 77011 73130 78111
13217 78111 79647 79997 79577 80397 90830 99615 96986 94920 92543 92290 86962 96122 95895 98512 103200
13202 103200 97018 84674 79695 73787 75367 75966 71141 70607 66944 57880 53104 58501 52212 53012 58295
13187 58295 54910 59107 57884 59541 59441 63650 74835 92884 126715 166692 201889 227088 224371
13174 224371 216879 207478 201949 201761 192512 180231 167652 160008 155714 139737 129942 122806 122368 128017
13160 128017 133186 137887 140061 142448 143681 135634 129940 127674 138491 153506 157332 160940 165801 166997
13146 166997 164535 167397 168096 171287 174667 173314 171200 169654 175776 189192 199641 202164 192085 186371
13132 186371 185719 185430 186897 173414 167575 158150 146212 152294 161039 157436 155128 160400 168541 168498 163605
$$ packed form
13233H7643M76m03K191O553N24m005K412r212o382K94M74J697k329k922l881M981
13217G8111J536L50m20Q20J0433Q785k629k066k377k53n328R160k27K617M688
13202A03200o182j2344m979n908J580N99m825n34l663r064m776N397o289Q00N283
13187E8295l385M197j223J657j00M209J1185J8049L3831L9977L5197K5199k717
13174B24371p492r401n529j88r249j2281j2579p644m294j5977r795p136m38N649
13160A28017N169M701K174K387J233q047n694k266J0817J5015L826L608M861J196
13146A66997k462K862O99L191L380j353k114j546O122J3416J0449K523j0079n714
13132A86371o52k89J467j3483n839r425j1938O082Q745l603k308N272Q141m3m893
$$ plain form
13117 163605 167660 179209 185240 194176 185869 177584 172239 167428 164201 165155 159978 159343 164229 168368
13103 168368 179738 188050 197393 209359 223681 230957 242552 258497 277284 295161 301752 316901
13091 316901 330758 303102 234388 176148 156734 113702 66353 64091 96431 126010 167447 223948
13079 223948 279195 303538 302038 295754 291536 290809 271899 246673 231957 218693 207837 199035 196471
13066 196471 198184 195771 198695 207389 209489 201472 196064 200291 197966 192710 195985 204291 209134 202440
13052 202440 195255 196155 209733 227736 237549 231589 232386 238306 253389 288957 339145 414980 491644
13039 491644 527154 513805 476295 423817 367669 321083 286125 271067 261785 255710 252776 256403
13027 256403 273071 288431 290359 287022 281018 273770 257999 237825 223818 211493 211184 227598 237366
$$ packed form
13117A63605M055J1549O031Q936q307q285n345m811l227R54n177o35M886M139
13103A68368J1370Q312R343J1966J4322P276J1595J5945J8787J7877O591J5149
13091C16901J3857k7656o8714n8240j9414m3032m7349k262L2340K9579M1437N6501
13079B23948N5247K4343j500o284m218p27j8910k5226j4716j3264j0856q802k564
13066A96471J713k413K924Q694K100q017n408M227k325n256L275Q306M843o694
13052B02440p185R00J3578J8003R813n960P97N920J5083L5568N0188P5835P6664
13039D91644L5510j3349l7510n2478n6148m6586l4958j5058r282o075k934L627
13027B56403J6668J5360J928l337o004p248j5771k0174j4007j2325l09J6414R768
$$ plain form
13014 237366 247726 259506 263462 263195 259261 250612 244565 240248 231840 230633 242604 267482 295784
13001 295784 314627 329360 344970 353246 355845 357159 347331 341311 338447 330327 324721 311279 303682
12988 303682 291009 281380 286326 297177 326010 361724 392715 418542 441095 452971 452267 439568
12976 439568 430023 420694 404219 375656 356726 350495 332996 311019 287581 262820 226936 170692
12964 170692 83196 -48670 -194618 -249779 -108434 179310 455562 580562 569566 510256
12954 510256 486113 485061 489371 500677 514217 522415 529002 533119 541448 543472 547037 548589 545257
12941 545257 542760 540914 535094 536125 551839 570368 593467 620890 641908 649358 645596 639609 634810
12928 634810 631336 628667 617714 609273 602603 608180 630813 664282 693269 719487 748961 790668
$$ packed form
13014B37366J0360J1780L956k67l934q649o047m317q408j207J1971K4878K8302
13001B95784J8843J4733J5610Q276K599J314r828o020k864q120n606j3442p597
12988C03682j2673r629M946J0851K8833L5714L0991K5827K2553J1876p04j2699
12976D39568r545r329j6475k8563j8930o231j7499k1977k3438k4761l5884n6244
12964A70692q7496j31866j45948n5161J41345K87744K76252J25000j0996n9310
12954E10256k4143j052M310J1306J3540Q198O587M117Q329K024L565J552l332
12941E45257k497j846n820J031J5714J8529K3099K7423K1018P450l762n987m799
12928F34810l474k669j0953q441o670N577K2633L3469K8987K6218K9474M1707
$$ plain form
12916 790668 821566 844293 872808 901558 928279 945740 964532 984471 996559 1021362 1050226
12905 1050226 1062646 1068667 1085600 1108594 1134838 1149001 1160603 1181861 1206562 1246577 1290670
12894 1290670 1335896 1381124 1429761 1488959 1553720 1632043 1721853 1804474 1870258 1929301 1990230
12883 1990230 2065501 2152019 2251117 2346340 2449997 2592538 2807029 3110737 3521310 4038481
12873 4038481 4578267 5021613 5361139 5708008 6121837 6359307 6259968 5992694 5726784 5499828
12863 5499828 5298392 5154960 5122317 5222937 5440611 5780950 6223371 6766708 7393166 8088277
12853 8088277 8872965 9781496 10835618 12084618 13621648 15553215 17972930 20877168
12845 20877168 24165509 27957425 32759862 39158575 47751114 59451611 76041221 100558195
$$ packed form
12916G90668L0898K2727K8515K8750K6721J7461J8792J9939J2088K4803K8864
12905A050226J2420O021J6933K2994K6244J4163J1602K1258K4701M0015M4093
12894A290670M5226M5228M8637N9198O4761P8323Q9810Q2621O5784N9043O0929
12883A990230P5271Q6518R9098R5223J03657J42541K14491L03708M10573N17171
12873D038481N39786M43346L39526L46869M13829K37470r9339k67274k65910k26956
12863E499828k01436j43432l2643J00620K17674L40339M42421N43337O26458O95111
12853H088277P84688R08531J054122J249000J537030J931567K419715K904238
12845B0877168L288341L791916M802437O398713Q592539J1700497J6589610K4516974
$$ plain form
12837 100558195 137968100 195136787 277872100 375864014 441268895 434431453 375591721
12830 375591721 303457936 242879873 191717437 145498092 107690413 79988071 60827594
12823 60827594 47761196 38730211 32346455 27550242 23523841 20026009 17086886 14696052
12815 14696052 12682356 10967304 9545513 8393480 7477616 6755871 6175947 5694756 5279899
12806 5279899 4895372 4516340 4141263 3775810 3417670 3074004 2788541 2574755 2433660
12797 2433660 2312159 2190506 2083097 2015648 1994601 2044886 2165750 2311634 2341667 2184556
12787 2184556 1939634 1693250 1493727 1321314 1169491 1052272 945146 837886 749188 689767
12777 689767 658768 644605 631135 608945 588106 581468 576435 571180 555572 535470 510477 477181
$$ packed form
12837A00558195L7409905N7168687Q2735313R7991914O5404881o837442n8839732
12830C75591721p2133785o0578063n1162436m6219345l7807679k7702342j9160477
12823F0827594j3066398r030985o383756m796213m026401l497832k939123k390834
12815A4696052k013696j715052j421791j152033r15864p21745n79924m81191m14857
12806E279899l84527l79032l75077l65453l58140l43666k85463k13786j41095
12797B433660j21501j21653j07409o7449k1047N0285J20864J45884L0033j57111
12787B184556k44922k46384j99523j72413j51823j17219j07126j07260q8698n9421
12777F89767l0999j4163j3470k2190k0839o638n033n255j5608k0102k4993l3296
$$ plain form
12765 477181 452087 431774 428459 428355 417311 409915 424007 435070 442596 424952 392581 362146
12753 362146 330288 301176 278760 257400 248727 256492 259342 258546 269924 285996 300035 305058 297753
12740 297753 284595 262492 241301 217712 191593 175304 174114 174884 168353 170377 162713 158591 150656
12727 150656 143933 135821 135209 137951 144552 145637 138420 121429 99199 88333 74068 52960 13984
12714 13984 -23645 -46608 -61890 -59211 -32158 55036 215579 445244 652193 741961 758953
12703 758953 779080 771675 691786 567738 459490 390651 350171 325777 316663 308878 299470 293458
12691 293458 283818 276591 268925 254317 236055 226565 223401 240923 273094 329673 391945 446349
12679 446349 477126 496855 529340 597025 690612 770762 772886 712314 630732 565946 516953 485200
$$ packed form
12765D77181k5094k0313l315j04j1044p396J4092J1063P526j7644l2371l0435
12753C62146l1858k9112k2416k1360q673P765K850p96J1378J6072J4039N023p305
12740B97753j3158k2103k1191k3589k6119j6289j190P70o531K024p664m122p935
12727A50656o723q112o12K742O601J085p217j6991k2230j0866j4265k1108l8976
12714A3984l7629k2963j5282K679K7053Q7194J60543K29665K06949Q9768J6992
12703G58953K0127p405p9889j24048j08248o8839m0480k4394r114p785r408o012
12691B93458r640p227p666j4608j8262r490l164J7522L2171N6579O2272N4404
12679D46349L0777J9729L2485O7685R3587Q0150K124o0572q1582o4786m8993l1753
$$ plain form
12667 485200 481273 486112 493261 504635 511570 507412 488012 457974 441380 440358 457234 481554 520660
12654 520660 593822 693115 751633 731969 680069 643614 611878 550114 470602 401331 350015
12643 350015 314726 275691 248686 235468 243408 258999 271076 276829 278013 287226 305815 336280
12631 336280 345401 340669 334842 332960 342036 360178 386512 419466 469458 537363 592668 627020
12619 627020 656533 690942 746580 829023 882350 882380 845787 804359 770552 744685 719007 694646
12607 694646 684478 695849 728634 786980 864406 948203 1027181 1100220 1192953 1335149 1558082
12596 1558082 1899837 2411864 3097034 3794175 4188880 4177965 3971627 3811020 3774752 3878748
12586 3878748 4161287 4709682 5612500 7021983 9199400 12658726 18228081 26884874 38452649
$$ packed form
12667D85200l927M839P149J1374O935m158j9400l0038j6594j022J6876K4320L9106
12654E20660P3162R9293N8518j9664n1900l6455l1736o1764p9512o9271n1316
12643C50015l5289l9035k7005j3218P940J5591J2077N753J184R213J8589L0465
12631C36280R121m732n827j882R076J8142K6334L2954M9992O7905N5305L4352
12619F27020K9513L4409N5638Q2443N3327L0l6593m1428l3807k5867k5678k4361
12607F94646j0168J1371L2785N8346P7426Q3797P8978P3039R2733J42196K22933
12596A558082L41755N12027O85170O97141L94705j0915k06338j60607l6268J03996
12586C878748K82539N48395R02818J409483K177417L459326N569355Q656793J1567775
$$ plain form
12577 38452649 48839814 51790658 46536166 37639293 29392145 22781594 17151329 12504293
12569 12504293 9069268 6742527 5226462 4247171 3611690 3188336 2887685 2643462 2405962
12560 2405962 2160673 1927319 1724548 1568670 1446690 1366388 1340574 1380501 1524027 1804893
12550 1804893 2197511 2547358 2668186 2527024 2269649 2041403 1887394 1830690 1920691 2236789
12540 2236789 2871152 3916461 5219948 6152999 6136759 5326393 4292111 3400581 2664385
12531 2664385 2031360 1506425 1128717 887205 737129 630696 566153 525049 490446 478690
12521 478690 486002 507351 530769 539780 533962 524381 513425 487153 445104 405049 370208 344229
12509 344229 339478 349561 341130 314940 294421 286363 296242 309870 311512 297793 275279 247987
$$ packed form
12577C8452649J0387165K950844n254492q896873q247148o610551n630265m647036
12569A2504293l435025k326741j516065r79291o35481m23354l00651k44223k37500
12560B405962k45289k33354k02771j55878j21980q0302k5814L9927J43526K80866
12550A804893L92618L49847J20828j41162k57375k28246j54009n6704R0001L16098
12540B236789O34363J045309J303487R33051j6240q10366j034282q91530p36196
12531B664385o33025n24935l77708k41512j50076j06433o4543m1104l4603j1756
12521D78690P312K1349K3418R011n818r581j0956k6272m2049m0055l4841k5979
12509C44229m751J0083q431k6190k0519q058R879J3628J642j3719k2514k7292
$$ plain form
12497 247987 216590 174208 128590 82175 48195 17564 -13253 -32004 -34147 -6926 29634 57815
12485 57815 86975 108198 120477 130289 137200 139043 149067 157163 157472 154860 145989 141935 129511
12472 129511 115475 112740 112608 115980 122538 130683 135564 149110 176726 214712 269580 341682 420450
12459 420450 453492 437492 385598 332176 285801 257721 234687 217497 219432 227427 236265 244643
12447 244643 253453 256028 257911 258539 263956 273667 283398 286521 286471 276305 265417 256735 263732 275244
12433 275244 285623 310173 349175 432470 577711 807670 1141626 1496709 1731944 1726746 1517136
12422 1517136 1239071 984554 785482 625932 502258 422758 374939 321770 270128 209453
12412 209453 167615 149388 129590 116803 114127 117270 116902 117334 116701 114797 113904 115281 114077 122119
$$ packed form
12497B47987l1397m2382m5618m6415l3980l0631l0817j8751k143K7221L6560K8181
12485E7815K9160K1223J2279R812O911J843J0024Q096L09k612q871m054j2424
12472A29511j4036k735j32L372O558Q145M881J3546K7616L7986N4868P2102P8768
12459D20450L3042j6000n1894n3422m6375k8080k3034j7190J935P995Q838Q378
12447B44643Q810K575J883O28N417R711R731L123n0j0166j0888q682O997J1512
12433B75244J0379K4550L9002Q3295J45241K29959L33956L55083K35235n198k09610
12422A517136k78065k54517j99072j59550j23674p9500m7819n3169n1642o0675
12412B09453m1838j8227j9798j2787k676L143l68M32o33j904q93J377j204Q042
$$ plain form
12398 122119 120215 115694 116898 116897 115976 121708 127850 130276 118678 111020 105820 107367 114788 121344 120329
12383 120329 122488 121033 124756 135360 148702 159093 172563 185494 197406 215104 251784 292823
12371 292823 337112 379037 425871 479355 545850 644029 803788 1051508 1435891 1928405 2360004
12360 2360004 2473284 2246065 1870586 1522832 1232287 982657 787766 659929 580331 533408
12350 533408 502427 470659 442464 410733 390110 385961 402308 430503 444843 439263 416724 387260
12338 387260 372427 364285 370633 379851 401085 442868 494685 560737 646543 725417 813266 913434
12326 913434 1022750 1147747 1281393 1432649 1623409 1857560 2142757 2491322 2926090 3494297
12316 3494297 4267274 5409726 7214448 10127380 14711873 21201401 28287788 32665262
$$ packed form
12398A22119j904m521J204jr21N732O142K426j1598p658n200J547P421O556j015
12383A20329K159j455L723J0604J3342J0391J3470J2931J1912J7698L6680M1039
12371B92823M4289M1925M6834N3484O6495R8179J59759K47720L84383M92514M31599
12360B360004J13280k27219l75479l47754k90545k49630j94891j27837p9598m6923
12350E33408l0981l1768k8195l1731k0623m149J6347K8195J4340n580k2539k9464
12338C87260j4833q142O348R218K1234M1783N1817O6052Q5806P8874Q7849J00168
12326I13434J09316J24997J33646J51256J90760K34151K85197L48565M34768N68207
12316C494297P72977J142452J804722K912932M584493O489528P086387M377474
$$ plain form
12308 32665262 32016773 27521893 21986752 17119880 13059446 9641606 6950593 5020639
12300 5020639 3706007 2832337 2238641 1815580 1508419 1284798 1119672 1001826 914305
12291 914305 837931 754183 667843 577475 511880 464078 420950 365143 316657 288927 254403
12280 254403 223612 197655 173374 152610 130825 118855 109831 106125 108230 107739 102895 105459 103185
12267 103185 102043 99479 103231 104231 120967 139429 155027 171167 176475 159634 125277 97919
12255 97919 78019 59295 42825 26299 12813 16731 19972 21334 23039 29042 29095 31517 38506 43418
12241 43418 36034 30500 29578 27901 22270 12956 6562 9947 8067 4868 14073 24706 40415 64484
12227 64484 90430 107913 119729 122997 118013 98941 89054 81038 73787 71337 73806 71810 71197 67467
$$ packed form
12308C2665262o48489m494880n535141m866872m060434l417840k691013j929954
12300E020639j314632q73670n93696m23061l07161k23621j65126j17846q7521
12291I14305p6374q3748q6340r0368o5595m7802m3128n5807m8486k7730l4524
12280B54403l0791k5957k4281k0764k1785j1970r024l706K105m91m844K564k274
12267A03185j142k564L752J000J6736J8462J5598J6140N308j6841l4357k7358
12255I7919j9900j8724j6470j6526j3486L918L241J362J705O003N3K422O989M912
12241D3418p384n534r22j677n631r314o394L385j880l199R205J0633J5709K4069
12227F4484K5946J7483J1816L268m984j9072r887q016p251k450K469j996o13l730
$$ plain form
12213 67467 60867 46086 36158 27713 21687 23382 31537 38228 42718 36983 33129 30699 23336 13943
12199 13943 2618 -1383 32 2375 8437 12877 12203 17873 21058 19721 18341 15060 16532 18714
12185 18714 26532 41029 59709 77678 84154 92646 96310 97313 90157 80122 76628 78353 78721 76345
12171 76345 76292 82850 92529 103798 108005 105364 97269 87691 86666 90314 95504 105701 115803 126550
12157 126550 123647 123703 124860 115581 98294 85802 81194 79781 81659 95482 113103 120063 127686 146936
12143 146936 158335 158868 147191 128001 102836 86107 77427 65581 59830 67672 74749 92795 105760
12130 105760 109046 101007 87371 71883 68081 61166 53006 47022 49438 52116 49499 43891 31449
12117 31449 28445 26749 25764 27238 35700 42305 49694 61002 85265 132092 189288 237560 252774
$$ packed form
12213F7467o600j4781r928q445o026J695Q155O691M490n735l854k430p363r393
12199A3943j1325m001J415K343O062M440o74N670L185j337j380l281J472K182
12185A8714P818J4497J8680J7969O476Q492L664J003p156j0035l494J725L68k376
12171G6345n3O558R679J1269M207k641q095r578j025L648N190J0197J0102J0747
12157A26550k903N6J157r279j7287j2492m608j413J878J3823J7621O960P623J9250
12143A46936J1399N33j1677j9190k5165j6729q680j1846n751P842P077J8046J2965
12130A05760L286q039j3636j5488l802o915q160n984K416K678k617n608j2442
12117C1449l004j696r85J474Q462O605P389J1308K4263M6827N7196M8272J5214
$$ plain form
12104 252774 219519 175169 135195 103045 81113 61961 44801 32848 25682 20754 23999 28346
12092 28346 34053 46149 59418 58990 53247 49796 54953 56161 59139 60780 57840 48805 49215 50363
12078 50363 47194 43489 37525 28752 19029 16086 11303 7846 13628 26988 32228 29832 28407 28285
12064 28285 21127 10739 9272 3564 -3061 -11739 -8058 502 -4865 -11046 -15877 -12113 -9223 -8313
12050 -8313 -11051 -4787 14523 33354 55537 77936 87371 78991 65431 48697 39315 28698 14665
12037 14665 9067 6259 2099 1911 3978 5711 7262 4663 7882 7473 1103 -1970 -7582 -12693 -11766
12022 -11766 -9713 -7159 -11976 -8111 -2022 6906 14815 15542 16899 14050 14697 19186 25713 30893 33174
$$ packed form
12104B52774l3255m4350l9974l2150k1932j9152j7160j1953p166m928L245M347
12092B8346N707J2096J3269m28n743l451N157J208K978J641k940r035M10J148
12078E0363l169l705n964q773r723k943m783l457N782J3360N240k396j425j22
12064B8285p158j0388j467n708o625q678L681Q560n367o181m831L764K890R10
12050h313k738O264J9310J8831K2183K2399R435q380j3560j6734r382j0617j4033
12037A4665n598k808m160j88K067J733J551k599L219m09o370l073n612n111R27
12022a1766K053K554m817L865O089Q928P909P27J357k849O47M489O527N180K281
$$ [...]
##END NTUPLES=NMR SPECTRUM
##END=
