##TITLE=Analysis number 311346
Compound Code sp 00265
Project Code adrs
Chemist Name fudan
##JCAMPDX= 6.0         $$ Bruker NMR JCAMP-DX V2.0
##DATA TYPE= NMR SPECTRUM
##DATA CLASS= NTUPLES
##ORIGIN= Bruker BioSpin GmbH
##OWNER= NMR
$$ XWIN-NMR		Version 3.5
$$ Wed Jul  6 13:26:04 2005 GMT Daylight Time (UT+1h)  MAYBRIDGE\NMR@NMR_250MHZ
##.OBSERVE FREQUENCY= 250.131544655141
##.OBSERVE NUCLEUS= ^1H
##.ACQUISITION MODE= SIMULTANEOUS (DQD)
##.ACQUISITION SCHEME= undefined
##.AVERAGES= 16
##.DIGITISER RES= 18
##SPECTROMETER/DATA SYSTEM= dpx250
##.PULSE SEQUENCE= zg30
##.SOLVENT NAME= CDCl3
##.SHIFT REFERENCE= (INTERNAL, CDCl3, 0, 16.522)
##AUDIT TRAIL= $$ (NUMBER, WHEN, WHO, WHERE, WHAT)
$$ ##TITLE= Audit trail, XWIN-NMR		Version 3.5
$$ ##JCAMPDX= 5.01
$$ ##ORIGIN= Bruker BioSpin GmbH
$$ ##OWNER= NMR
$$ C:\u/data/dgb/nmr/ADRS/5390/pdata/1/auditp.txt
$$ ##AUDIT TRAIL=  $$ (NUMBER, WHEN, WHO, WHERE, WHAT)
(   1,<2005-07-06 13:25:44.33 +100>,<MAYBRIDGE\NMR>,<NMR_250MHZ>,
      <created by zg, POWCHK disabled, PULCHK disabled
       configuration hash MD5:
       62 19 C7 07 E1 42 D1 B7 37 6C 3D D0 77 39 F9 E6
       data hash MD5: 64K
       33 5C 6C E8 77 ED 25 D3 3D A4 6B 45 C9 D5 EA ED>)
(   2,<2005-07-06 13:25:55.07 +100>,<MAYBRIDGE\NMR>,<NMR_250MHZ>,
      <Start of raw data processing
       ef LB = 0.3 FT_mod = 6 PKNL = 1 SI = 32K 
       data hash MD5: 32K
       A2 D5 32 E3 F9 6D 65 59 8B EC F3 29 11 53 92 1F>)
(   3,<2005-07-06 13:25:56.82 +100>,<MAYBRIDGE\NMR>,<NMR_250MHZ>,
      <apk 
       data hash MD5: 32K
       D1 4E 13 EC 0D 9A A4 04 E5 35 50 CC CB 49 CD 88>)
(   4,<2005-07-06 13:25:57.63 +100>,<MAYBRIDGE\NMR>,<NMR_250MHZ>,
      <abs ABSG = 5 
       data hash MD5: 32K
       3E 24 A0 4B 39 51 58 24 03 68 63 18 4A 91 CE DA>)
$$ ##END=
$$ 
$$ hash MD5
$$ 08 60 1D 73 DD 19 BC 9C DA A1 9D E5 0A DD BB 97
##$RELAX= 
##$RELAX= 
##$RELAX= 
##$RELAX= 
##$RELAX= 
##$RELAX= 
##$RELAX= 
$$ Bruker specific parameters
$$ --------------------------
##$DU= <C:\u>
##$EXPNO= 5390
##$NAME= <ADRS>
##$PROCNO= 1
##$TYPE= <nmr>
##$USER= <dgb>
##$AMP= (0..31)
100 100 100 100 100 100 100 100 100 100 100 100 100 100 100 100 100 100 
100 100 100 100 100 100 100 100 100 100 100 100 100 100 
##$AQSEQ= 0
##$AQ_mod= 3
##$AUNM= <au_zg>
##$AUTOPOS= <38 >
##$BF1= 250.13
##$BF2= 250.13
##$BF3= 250.13
##$BF4= 250.13
##$BF5= 500.13
##$BF6= 500.13
##$BF7= 500.13
##$BF8= 500.13
##$BYTORDA= 1
##$CFDGTYP= 0
##$CFRGTYP= 5
##$CHEMSTR= <none>
##$CNST= (0..31)
1 1 145 1 1 1 1 1 1 1 1 1 1 1 1 1 1 1 1 1 1 1 1 1 1 1 1 1 1 1 1 1 
##$CPDPRG= <>
##$CPDPRG1= <>
##$CPDPRG2= <>
##$CPDPRG3= <>
##$CPDPRG4= <mlev>
##$CPDPRG5= <mlev>
##$CPDPRG6= <mlev>
##$CPDPRG7= <mlev>
##$CPDPRG8= <mlev>
##$CPDPRGB= <>
##$CPDPRGT= <>
##$D= (0..31)
0 1 0 0 0 0 0 0 0 0.06 0 0 0 0 0 0 0.0002 0 0 0 0 0 0 0 0 0 0 0 0 0 0 
0 
##$DATE= 1120652743
##$DBL= (0..7)
120 120 120 120 120 120 120 120 
##$DBP= (0..7)
150 150 150 150 150 150 150 150 
##$DBP07= 0
##$DBPNAM0= <>
##$DBPNAM1= <>
##$DBPNAM2= <>
$$ [...]
##$SUBNAM7= <"">
##$SUBNAM8= <"">
##$SUBNAM9= <"">
##$SW= 20.6930455092707
##$SWIBOX= (0..15)
0 0 3 0 0 0 0 0 0 0 0 0 0 0 0 0 
##$SW_h= 5175.983436853
##$TD= 65536
##$TD0= 1
##$TE= 295.16
##$TE2= 300
##$TE3= 300
##$TEG= 300
##$TL= (0..7)
0 120 120 120 120 120 120 120 
##$TP= (0..7)
150 150 150 150 150 150 150 150 
##$TP07= 0
##$TPNAME0= <>
##$TPNAME1= <>
##$TPNAME2= <>
##$TPNAME3= <>
##$TPNAME4= <>
##$TPNAME5= <>
##$TPNAME6= <>
##$TPNAME7= <>
##$TPOAL= (0..7)
0.5 0.5 0.5 0.5 0.5 0.5 0.5 0.5 
##$TPOFFS= (0..7)
0 0 0 0 0 0 0 0 
##$TUNHIN= 0
##$TUNHOUT= 0
##$TUNXOUT= 0
##$USERA1= <user>
##$USERA2= <user>
##$USERA3= <user>
##$USERA4= <user>
##$USERA5= <user>
##$V9= 5
##$VALIST= <valist>
##$VCLIST= <CCCCCCCCCCCCCCC>
##$VD= 0
##$VDLIST= <DDDDDDDDDDDDDDD>
##$VPLIST= <PPPPPPPPPPPPPPP>
##$VTLIST= <TTTTTTTTTTTTTTT>
##$WBST= 1024
##$WBSW= 4
##$XGAIN= (0..3)
0 0 0 0 
##$XL= 0
##$YL= 0
##$YMAX_a= 560655
##$YMIN_a= -624922
##$ZGOPTNS= <>
##$ZL1= 120
##$ZL2= 120
##$ZL3= 120
##$ZL4= 120
##$ABSF1= 16.522
##$ABSF2= -4.171173
##$ABSG= 5
##$ABSL= 3
##$ALPHA= 0
##$AQORDER= 0
##$ASSFAC= 0
##$ASSFACI= 0
##$ASSFACX= 0
##$ASSWID= 0
##$AUNMP= <proc_1d>
##$AZFE= 0.1
##$AZFW= 0.1
##$BCFW= 0
##$BC_mod= 0
##$BYTORDP= 0
##$COROFFS= 0
##$CY= 12.5
##$DATMOD= 1
##$DC= 0
##$DFILT= <>
##$DTYPP= 0
##$F1P= 14.0000005364418
##$F2P= -0.99999901652339
##$FCOR= 0.5
##$FTSIZE= 32768
##$FT_mod= 6
##$GAMMA= 0
##$GB= 0
##$INTBC= 1
##$INTSCL= 1
##$ISEN= 128
##$LB= 0.3
##$LEV0= 0
##$LPBIN= 0
##$MAXI= 10000
##$MC2= 0
##$MEAN= 0
##$ME_mod= 0
##$MI= 0
##$NCOEF= 0
##$NC_proc= -3
##$NLEV= 6
##$NOISF1= 0
##$NOISF2= 0
##$NSP= 0
##$NTH_PI= 0
##$NZP= 0
##$OFFSET= 16.522
##$PC= 1
##$PHC0= 132.6931
##$PHC1= 5.191097
##$PH_mod= 1
##$PKNL= yes
##$PPARMOD= 0
##$PSCAL= 4
##$PSIGN= 0
##$REVERSE= no
##$SF= 250.13
##$SI= 32768
##$SIGF1= 0
##$SIGF2= 0
##$SINO= 400
##$SIOLD= 32768
##$SREGLST= <1H.CDCl3>
##$SSB= 0
##$STSI= 32768
##$STSR= 0
##$SW_p= 5175.98343685301
##$SYMM= 0
##$S_DEV= 0
##$TDeff= 65536
##$TDoff= 0
##$TI= <Analysis number 999999
Compound Code 99
Book Reference 9
Project Code 9>
##$TILT= no
##$TM1= 0
##$TM2= 0
##$TOPLEV= 0
##$USERP1= <user>
##$USERP2= <user>
##$USERP3= <user>
##$USERP4= <user>
##$USERP5= <user>
##$WDW= 1
##$XDIM= 32768
##$YMAX_p= 343416734
##$YMIN_p= -25882
$$ End of Bruker specific parameters
$$ ---------------------------------
##NTUPLES= NMR SPECTRUM
##VAR_NAME=  FREQUENCY,     SPECTRUM/REAL,   SPECTRUM/IMAG
##SYMBOL=    X,             R,               I
##VAR_TYPE=  INDEPENDENT,   DEPENDENT,       DEPENDENT
##VAR_FORM=  AFFN,          ASDF,            ASDF
##VAR_DIM=   32768,         32768,           32768
##UNITS=     HZ,            ARBITRARY UNITS, ARBITRARY UNITS
##FACTOR=    0.157963299565203, 1,           1
##FIRST=     4132.6476996994, 0,             0
##LAST=      -1043.33573715361, 0,           0
##MIN=       -1043.33573715361, -25882,      0
##MAX=       4132.6476996994, 343416734,     0
$$ Real data points
##PAGE= N=1
##DATA TABLE= (X++(R..R)), XYDATA
$$ [...]
15321h836j981j575K284M003M08j299K038J409k243J999K888n587l359j487j116
15306a2454K12N327r3K290o19n35J624j4j264o316j780M782L142N43o31K983n564
15289h367M3L456l639j362N12j949o70L718J1590L657j643j901k088O6o208l099
15273g884n096n92J745O48N638N639l17q186n538O487K882L984j742l441J441
15258d332L346K982R87n96l745r35Q87k614M125n86m869j288n818r76O226K029
15242e177p99n572J843Q65k151j891O069k828j017L15K510L837Q984m135L070
15227C923J725l063j96k923m570L253k166L65K688K065o9m328n825m125J492N875
15211e879K543K277L49O62k204n768k786m155K412J250N44R82L007N649L112n633
$$ y = [-8836, -10817, -12392, -10108, -6105, -5697, -6996, -4958, -3549, -5792, -3793, -905, -6492, -9851, -11338, -12454, -12242, -6915, -7008, -4718, -5337, -5872, -4248, -4262, -5526, -11842, -13622, -8840, -5698, -5155, -5786, -2803, -8367, -8324, -4868, -8507, -9869, -9357, -11306, -11976, -8258, 3332, 6989, 5346, 3445, 1357, 1423, -4785, -7884, -12980, -13572, -11827, -11179, -5541, 98, -219, -8405, -13943, -7456, -4574, -590, -2332, -5773, -4332, -986, 1996, 2983, 2387, -1358, -2293, -1406, -4020, 105, -481, -5350, -6638, -12456, -13432, -7206, -5177, -5976, -11548, -9705, -8840, -10991, -12882, -6813, -9641, -10658, -10343, -7833, -3996, 4988, 853, 3923, 5648, 2585, 2389, -534, -5104, -1851, -4017, -3652, -964, 1101, 1032, -3296, -9121, -13246, -11754, -5879, -3336, -1059, -710, -48, -2252, -8020, -10806, -14961, -12549, -11299, -10755, -9773, -6766, -1117, 1995, -3638]
15195c638K73K643l4m580k038L672k722l164N741J0329m56J455q79p819n453O329
15179c41j367k015j316k01J559j677k380O526j354o896j632N496k101P636M438
15164D375K772k194l377k637M79K680j133l211Jj894l340k66l586L265L152l881
15148h795j910J0006R83q266L859J461m106P675j597p252m411L47L634P966o45
15133a051j1732j967J261r99L475N088M90j017j058O991k259l79L329R10L927
15118E009K78j553o925j399n025J58L087L030K542M861j828o231n780L032J131
15103e613j357q25L108o37R19K535j70L150o99p447K471L914J113k336n099l282
15087a0255R10N936K667L543m52J992P099j402o944k820J065P1o63j622m71j246
$$ y = [-3638, -3365, -722, -756, -5336, -7374, -3702, -6424, -9588, -3847, 6482, 6026, 7481, 6602, -1217, -6670, -341, -1708, -3723, -5039, -5240, -3681, -5358, -7738, -1212, -2566, -9462, -11094, -5598, -7699, -63, 4375, 7147, 4953, 1576, -1061, -582, 2098, 965, -2246, -2245, -4139, -7479, -7745, -11331, -8066, -4914, -8795, -10705, -699, 284, -7982, -4123, -2662, -6768, 907, -690, -7942, -12353, -12006, -8372, -406, -1051, -12783, -14750, -13489, -14488, -11013, -5925, -5435, -6452, -7510, -519, -2778, -3157, 172, 1082, 5009, 5287, 3734, -3191, -4590, -9615, -9457, -6370, -3340, -798, 4063, 2235, -3996, -9776, -6744, -5613, -6970, -7795, -4687, -5324, -4405, -1870, -2040, 1110, 411, -7036, -4565, -651, 462, -1874, -6973, -10255, -9345, -3409, -742, 2801, 2349, 4341, 11440, 10038, 3094, 274, 1339, 1410, 747, -875, -1346, -2592]
15071b592L86l188M69K924K78k178l479L624R91M013M414m161l781j762k669k89
15055g000O07K400J455L24M0k51j898j567L782K211K841k944n03n306m004l290
15039a3103J772k289J945M169N932o78k516K489P619j559m712j657L995K308n008
15024a293j99J077l425n176L091K902m383n629J183L653M65M872K909r261l425
15009a2639M989Q094k300n296j951j718L101n133j084K396L482R127L431K177
14995F676m484n275M7L460n947k536J146k114n32J225O251l608k087Q88J75K194
14979d521m179l672k461K786O298L470l386m847N70K829J599J564k68k881j184
14964h283O59Q499R395o553k086K797R11k169k682j070k5L516m592l678m367k398
$$ y = [-2592, -2206, -5394, -4925, -2001, -1723, -3901, -7380, -3756, -2765, 1248, 5662, 1501, -2280, -4042, -6711, -7000, -6393, -3993, -2538, -2214, -2174, -2425, -4323, -5890, -2108, 103, 2944, 0, -503, -5809, -9813, -13103, -11331, -13620, -11675, -7506, -1574, -2252, -4768, -2279, 5340, 3781, -931, -2588, 1407, 3715, -1293, -1492, -415, -3840, -9016, -5925, -3023, -7406, -13035, -11852, -8199, -7734, -2862, 47, -9214, -12639, -7650, 444, -1856, -7152, -9103, -10821, -7720, -12853, -13937, -11541, -8059, 1068, 4499, 6676, 2192, -3083, -3036, 424, -5523, -8059, -6913, -9027, -9559, -8334, -2083, -5691, -7778, -6890, -6715, -4521, -8700, -12372, -14833, -12047, -5749, -2279, -5665, -10512, -9942, -7113, -5514, -3950, -4218, -7099, -8283, -7624, 875, 10270, 3717, 1631, 4428, 5339, 3170, 488, -582, -607, 2909, -1683, -5361, -9728, -12126]
14948a2126K210O447R007m489K622j573k766jK881J987Q25n034l249l52k033l687
14932i331k847L934k315K678O04J216L194J20k049K824n07n862l497J020n20o29
14916a1967O330M692l474K755k072K95N940j804o527n960M060L719j826K605L733
14901D99N701m48O08j014K514j231m793q732L601j215l872J425P066p84q491J21
14885i045k294M969N577k052L17L47l077Q47N852R13k040k731L253Q28o230m662
14869i228j581o65n26P89L974j182j176K152q83J322J302m345l024J504N478M406
14853a683N523o47n746L895J005j2581j939J965l28P107N438o117N10p31l23K688
14837a964l012R07r23O184L29K745o40k884j778j672M414j891j741mk781L227
$$ y = [-12126, -9916, -3469, 5538, 1049, 3671, 2098, -668, -669, 2212, 4199, 5024, -10, -3259, -3611, -5644, -9331, -12178, -8244, -10559, -7881, -7277, -6061, -2867, -2747, -4796, -1972, -2479, -8341, -11838, -10818, -11338, -11967, -5637, -945, -4419, -1664, -3736, -3441, 2499, 695, -5832, -11792, -7732, -4013, -5839, -3234, 499, 6200, 5752, 6360, 5346, 7860, 6629, 1836, -6896, -3295, -4510, -8382, -6957, 109, -675, -9166, -9045, -11339, -6370, -793, -2845, -2528, -2181, -5258, -4411, 1441, 2354, 314, -2417, 836, 1664, -4566, -9228, -10809, -11474, -12000, -11211, -7237, -8419, -9595, -7443, -8326, -7004, -5702, -10047, -13071, -11567, -6089, -1683, 3840, 3193, -2553, 1342, 2347, -10234, -12173, -10208, -10536, -3429, 2009, -4108, -3598, -4329, -4652, -1964, -4976, -4069, -4992, 1192, 1521, 4266, 3626, 742, -1036, -2708, 1706, -185, -1926, -1930, -4711, -1484]
14821a484N42l629J561n03J532j490R684J0889j772l504r632r137j1708K999M06
14806a5246j446J641J193M597L704K829K767l239q66l205J618J408o210J361N164
14791c930Q211K182j501L853K007l829r75m709l528L753j49j701J166n2k854o028
14775h084j705M217k172k442m1J745L906l655k872M911O485o383m237P234P421
14760D328O095k338j2883p2K410O963l243J359P12k136K63j49o513n256M329M29
14744e702J621O771l040j072k330K16n125l404K059N792O173p621o082P3k068
14729a3739J900K420L903K772L82j667j940o668M674J606K433J113m092kN847
14714a058k340R05R78O054m03m689l700k864j371n346m316n96K381O711M02O170
$$ y = [-1484, -942, -4571, -3010, -3513, -1981, -3471, 6213, 17102, 15330, 11826, 2194, -6943, -18651, -15652, -15246, -16692, -15051, -13858, -9261, -5557, -2728, 39, -3200, -4066, -7271, -5653, -4245, -10455, -9094, -3930, 4281, 6463, 4962, 8815, 10822, 6993, 6018, 1309, -2219, 1534, 1385, -316, 850, 798, -2056, -8084, -9789, -5572, -7744, -10186, -10227, -8482, -4576, -8231, -11103, -6192, 293, -6090, -10327, -3093, 4328, 10423, 8085, -4798, -4870, -2460, 4503, 1260, 2619, 3331, 1195, 1458, 1309, -5204, -10460, -6131, -5702, -4081, 2690, -350, -1422, -3752, -3536, -8661, -12065, -10006, -4214, 1959, -5662, -11744, -11671, -13739, -11839, -9419, -5516, -2744, -2362, -4029, -5969, -12637, -7963, -6357, -3924, -2811, -6903, -6905, -1058, -3398, -2493, -1515, 4539, 4136, -553, -4253, -7117, -8488, -13834, -18150, -18746, -16365, -9654, -9252, -3082]
14698c082L948K249P95K150k728m781m377j376K63K651l48n142j836j543M367
14683h790R31N345L573k340m614k946o497k068N151J256q619n353P911K667O338
14668h055K340O1R51L827j022Q49L500L385K863K687r450q299K329m106j833L842
14652f131k11O52n580J854J694j610k563J427L712J492l22L818N65j479J761K127
14636A206K774L140K970N253k586m969m263k529n531p90J071O118p0l898M42K197
14620E35j773j531Q068P667k873R66n476p879j847l770r328Q50M955m32j919l100
14604a6887L163M499K129K854r98n818K471J0167j697j07R25r24L657N75l40n537
14588a868M291k639p104m066J146j951O914L850j5l08L559M128L126j535j503
$$ y = [-3082, 866, 3115, 3910, 6060, 3332, -1449, -5826, -7202, -6939, -4288, -4636, -9778, -11614, -13157, -8790, -7859, -2514, 1059, -1281, -5895, -8841, -15338, -17406, -12255, -10999, -19618, -24971, -17060, -14393, -8055, -5715, -5654, -4703, -876, -1898, -1049, 2451, 5836, 8699, 11386, 1936, -6363, -4034, -8140, -9973, -6131, -6342, -5690, -11270, -9416, -7722, -9332, -11895, -10468, -6756, -5264, -5586, -1768, -1203, -2682, -921, 1206, 3980, 7120, 10090, 15343, 12757, 7788, 3525, 996, -4535, -5325, -4254, 1864, 1794, -2104, -1662, 535, -1238, -2769, 5299, 12966, 10093, 11059, 5583, -2296, -4143, -7913, -17241, -16391, -11436, -11868, -13787, -16887, -13724, -9225, -7096, -4242, -5240, -11058, -8587, 1580, -117, -224, 701, -223, 3434, 4009, 3669, -1868, 2423, -216, -7320, -11386, -10240, -12191, -5277, -1427, -1442, -1750, 1809, 5937, 9063, 7528, 6025]
14573F025L330j196p075m020K739m313k345r35L13l107J685R33l566L771L599
14558d162l011o38L287M488L372j850j495K274k402n709j981O92L324o500J194
14543i117J302J68K906Q40K133L872k358q355l547O237J660K121L244L518q34
14528C790n665j642k901j249J03m129l525k408M110M454J414K06j092k762K789
14513h507J998J945M95j434l330K72n005l209N697R689M297k458n909K4N433R87
14497I85m564N859J950j626j500n707l13k978r313L427P134M292L942j566k450
14482b428r85n461m392N23K707k305j975M961K529K89l746M336p46k744L891P60
14466d786M057P347l550l078K800l742M98o874J351N734K812n09r585j179L197
$$ y = [6025, 9355, 8159, 1084, -2936, -197, -4510, -6855, -7790, -7477, -10584, -8899, -7966, -11532, -7761, -4162, -7173, -7811, -4524, -36, 3336, 1486, -9, 2265, -137, -5846, -7827, -7135, -3811, -10311, -9117, -7815, -7647, -4741, -3901, -1768, 2104, -254, -8609, -12156, -5919, -4259, -2138, 1106, 4624, 3790, -1875, -3517, -6418, -7667, -7564, -11693, -15218, -17626, -13516, -9062, -7648, -7442, -8534, -11296, -8507, -6509, -4564, -4069, -5503, -8833, -8561, -13566, -16775, -11078, -1389, 2908, 450, -5459, -5435, -2, 985, -3579, 2280, 4230, 2604, 1104, -4603, -4916, -7894, -17207, -13780, -6646, -2354, 1588, 22, -2428, -3413, -8874, -13266, -12743, -10036, -12341, -14316, -9355, -6826, -6537, -10283, -5947, -6693, -9437, -5546, -4786, -729, 6618, 3068, -10, 2790, -952, -454, -7328, -5977, -243, 2569, 2060, -7525, -8704, -5507]
14451e507L381M840m777j0897L472P661k678l524k086N056P595l969n123l316
14437i872j457R667l734n96P94L82J077L580L105q37k802l783J257j122j03J150
14421c294K87L055j1021j629J556L097j910j527M7K34J111O228L826l197J217
14406a920K227r45j2Q44O94n486k415K554K896J077l28l050j233m392J565L168
14390d756L21l057j859L577L357k962j175j563l465L629J594k42P767M205l875
14375A496o595M204m414K42J458L620m121k15n00J477K708Q41k484n668J55J871
14359e925M464M010j342M466k205o216m517K068M718j049J808o71k169Q73r2L53
14343a426J068j936O183k273k796K055p61l729K466J436J030j479o776n880K653
$$ y = [-5507, -2126, 2714, -2063, -12960, -9488, -1827, -4505, -8029, -10115, -5059, 2536, -1433, -6556, -9872, -11329, -1662, -5396, -5992, -5198, -4816, -3739, -159, 2946, 2109, -693, -4476, -3219, -4341, -4444, -3294, -3007, 48, -10973, -12602, -11046, -7949, -9859, -11386, -11339, -11105, -9994, -3766, 60, -3137, -1920, 307, -638, -650, 194, 888, -4598, -7013, -4459, -1563, -486, -814, -3864, -5097, -9489, -7924, -4756, -4435, -7492, -9351, -5774, -2417, -5379, -6554, -8117, -11582, -7953, -6359, -6601, 1166, 5371, 1496, -5099, -895, -5309, -5067, -3609, 11, -4110, -4325, -4825, -3348, -640, 201, -2283, -7951, -7796, -5925, -1461, 2549, 1207, 5673, 3468, -2748, -7265, -5197, -479, -1528, 280, -391, -2560, -1687, -1779, -1426, -358, -2294, 3889, 1616, -1180, 875, 114, -3615, -1149, 287, 1317, -162, -6938, -12818, -10165]
14328a0165L581L320M41q1o709j687J490L346K624J901N375k035n596k916K970
14313d141N170M32j120n774m3J0037j001p331K464K999m618j6257q84N145J0522
14298d400N04J18J17k197K003L967M97m660k740K387j215L121Q001J326N219J191
14282A3239j89L468q080j2483n330P3N992P386R754O67o330p573k483M06R13k218
14266b788J483P51P232J586m143l404L272O100l82m730j525n494M575N09M200
14251G242q7p06j067J377P33P33m934l300M10L476N708J45M083l38k206k422k132
14234F715l822k329j45K19r77O921M702L456L32l902L881K603O89n075K868j116
14218A5020l818m113k593m28P30K397L59k199J06j079k84k495l363K168n774j826
$$ y = [-10165, -6584, -3264, -2823, -2904, -9613, -11300, -9810, -6464, -3840, -1939, 3436, 1401, -4195, -7111, -4141, 1029, 1461, 341, -5433, -5476, 4561, 3560, -3771, -1307, 1692, -2926, -19183, -20067, -14922, -4400, -3896, -3778, -3661, -5858, -3855, 112, 609, -4051, -6791, -4404, -5619, -2498, 5503, 6829, 12048, 13239, 13050, 16518, 8438, -4045, -9375, -9302, -3310, 4076, 13830, 14497, 8167, 594, -1889, -1483, -570, -2788, -1305, -554, 6678, 8264, 4121, 717, 3989, 10089, 9707, 4977, 3452, -2042, 2533, 3042, 7242, 7155, 6449, 5382, 6759, 7492, 8225, 3291, -9, 401, 3877, 9585, 9730, 13813, 13475, 11269, 8847, 6715, 2893, 564, 419, 638, -339, 6582, 11284, 14740, 15072, 11170, 15051, 17654, 18343, 13268, 16136, 15020, 11202, 7089, 4496, 4068, 4798, 7195, 7554, 5355, 5461, 4382, 4098, 1603, -1760, 408, -5366, -7192]
14202g192j217N537O684L418j018k249q98O364j331J45J401J392K637k986n694
14187D993o18ok048N10l36M927O613k39k729q063p126r02J108J360K171k406L797
14170A006M739K356M285m501n313j014L325M102k312j885L517L215l206L304J74
14155A1792p0J448K095k306k339l119K71P174K687k264k254k981n93Q36k887L163
14139A0653L099o46j314j127M14J41K959O25p231j533N180j457N31J894O185l621
14123A4752l645j586m842O19M109O886j117m765J4L299M595k484m650N19J099
14108A2803K307P66O046K741m914m801K251P71n763k04K153L540P160k493q375
14093A3988m054l315M599Q839J0388l103j2181p821L178L784o02k467J98L966
$$ y = [-7192, -8409, -2872, 3812, 7230, 6212, 3963, 3065, 9429, 8098, 8243, 9644, 11036, 13673, 10687, 4993, 4375, 4369, 2321, 2831, 2495, 7422, 14035, 13796, 11067, 3004, -4122, -5024, -3916, -2556, -385, -2791, 1006, 5745, 8101, 12386, 7885, 2572, 1558, 4883, 8985, 6673, 4788, 8305, 11520, 8314, 11618, 11792, 11722, 13170, 15265, 12959, 10620, 7501, 7772, 14946, 17633, 15369, 13115, 10134, 9541, 10377, 7490, 10653, 13752, 13106, 11792, 10665, 11079, 11220, 14179, 14804, 7573, 6040, 11220, 9763, 10294, 12188, 18373, 14752, 11107, 9521, 4679, 5298, 9407, 16293, 15176, 10411, 10425, 13724, 18319, 15835, 11185, 11704, 12803, 15110, 15876, 21922, 24663, 19749, 14948, 17199, 17970, 12207, 12003, 14156, 17696, 24856, 22363, 13988, 9934, 6619, 11218, 20057, 30445, 27342, 15161, 7340, 10518, 14302, 13700, 11233, 11431, 15397]
14079A5397P953o71j140Q565J810L982M873P740J5431J7037J7027J9611K4579
14066A42194K4478L6329N1602L5949k463l6468m9219l9034j9597k3510k6384j1586
14054H2291p566p400n450M5n434J162M823p725r175K061O41k560P330L2K932N462
14038F1469J0071K193k129K168J1314J0796P557M293N901Q190J8340K1780K7968
14025A89911K9104L9245N6418P4348R2816J24012J50587J23475O522j45174j68507
14014E72757j17641o9611n4289n5962m3850l2650k4583j9233j9781j0799n847
14003A18511q713K32M192j956j16k899m488n584j77K452r26Q10J1227J2164O689
13988A31418N7L028J1407J0884J4027J8356J9981K2856K4939L1992M2453O8851
$$ y = [15397, 23350, 22679, 21539, 30104, 31914, 35896, 40769, 48509, 63940, 80977, 98004, 117615, 142194, 166672, 203001, 254603, 290552, 288089, 251621, 202402, 163368, 143771, 120261, 93877, 82291, 74725, 67325, 61875, 61920, 56486, 57648, 62471, 54746, 45571, 47632, 48273, 45713, 53043, 53075, 56007, 61469, 71540, 73733, 71604, 73772, 85086, 95882, 103439, 107732, 113633, 121823, 140163, 161943, 189911, 219015, 258260, 314678, 389026, 481842, 605854, 756441, 879916, 886438, 741264, 572757, 455116, 385505, 331216, 275254, 231404, 198754, 174171, 154938, 135157, 124358, 118511, 109798, 110030, 114222, 112266, 112150, 109251, 104763, 99179, 99002, 101454, 100528, 101338, 112565, 124729, 131418, 131475, 134503, 145910, 156794, 170821, 189177, 209158, 232014, 256953, 288945, 331398, 400249]
13976D00249R2200J15806J45044J45660M4562j32910j82157j37663q2138o4746
13966C43907n5621m6108l2216k6209j8251j4159j4708q737j4j100p155j3346p764
13953I8519n97k695j062j848l384L380M579j942m141N309N592L068M706M322L690
13938A17496J372L029L206K129K154R851K2866L4594L7743M8082M4825J8244l2761
13925C12830n8936n1832k5521k1801j9389k0088j5860j0808j4965l788K437J906
13913G4185K318n174k713l787K342Q579k799j5257p450J577l84N64P76k492k803
13898D7482k496N093M093l869K792j55Q44M866J109l762l905m556n827M957L459
13883E0125O77n001j3256N465P744L294k389K43J0857j598j0516n910p10N046
$$ y = [400249, 492449, 608255, 753299, 898959, 943521, 810611, 628454, 490791, 408653, 343907, 288286, 242178, 209962, 183753, 165502, 151343, 136635, 127898, 127884, 126784, 119629, 106283, 98519, 97922, 95227, 94165, 92317, 88933, 92313, 96892, 94950, 90809, 96118, 101710, 104778, 109484, 113806, 117496, 118868, 121897, 125103, 127232, 129386, 139237, 162103, 196697, 234440, 282522, 327347, 345591, 312830, 253894, 202062, 176541, 154740, 135351, 115263, 99403, 88595, 73630, 69842, 72279, 74185, 76503, 71329, 68616, 64829, 67171, 75750, 72951, 57694, 50244, 51821, 51437, 52001, 52777, 50285, 47482, 44986, 50079, 54172, 50303, 53095, 52940, 53784, 58650, 59759, 55997, 52092, 47536, 41709, 46666, 50125, 50802, 45801, 32545, 38010, 45754, 49048, 46659, 46902, 57759, 56161, 45645, 39735, 39025, 44071]
13869D4071P795K627j473O581J2413R414l260k870j739p247r816Q22O446j773
13855F1991K823Q395P980L681k198l930n362k348K387j802k118N121J826k481
13841G3965q440k464l28K07k055r703o561M741L453j168o975L474M827K702q62
13826E4813L451J1729o00K951M38L95J8722J4526p74j0300M6k939j8O322R251
13811A08013O583K257P925J7743K3693J1455P191K571j843j9834j8182j5012o180
13798A26380L812q821j5556j0004Q7l47k551n36j1558j0776n343p075q63Q033
13784F4882J563J161o183m567L746L952j035m738r3M534M66K151Q728J1120J9126
13769A04813Q431J517M921R780J7273J8592J3978J8948J6966O623J479n476j1595
$$ y = [44071, 51866, 54493, 53020, 59601, 72014, 81428, 78168, 75298, 73559, 66312, 56496, 57318, 63764, 61991, 64814, 73209, 81189, 84870, 82672, 78742, 73380, 71032, 73419, 71617, 69499, 74620, 76446, 73965, 65525, 63061, 62733, 62940, 60885, 51182, 44621, 49362, 52815, 51647, 44672, 48146, 52973, 55675, 54813, 58264, 69993, 69393, 72344, 72782, 73177, 91899, 106425, 105651, 95351, 95397, 92458, 92440, 98762, 108013, 114596, 116853, 124778, 142521, 166214, 177669, 184860, 187431, 185588, 165754, 147572, 132560, 126380, 130192, 121371, 105815, 95811, 95898, 95551, 93000, 92464, 80906, 70130, 64787, 57712, 56849, 64882, 66445, 67606, 61423, 56856, 60602, 64554, 63519, 58781, 58688, 63222, 63688, 65839, 74567, 85687, 104813, 113244, 114761, 119682, 129462, 146735, 165327, 179305, 198253, 215219, 221842, 223321, 217845, 206250]
13756B06250k4612k1785j3965p555l765j444q201m352j617p540l470l652p622
13743I6670j261o144k229k020l31j4571o072n449J062O488L513O128J3326K0771
13729A09881J0994R719J1429N151R069R746k4902k1367J933J2346Q919O337P852
13716A57107J384l248J347J321k774o657j6679j3874L767J6423J1958O563N520
13703A62158O559M809R556M121O424P351J4328P708J0214P819J1410J0891J0812
13690B74160k521r133N144J5145K6109L6429M3574L3740K0916K1663K9000L1797
13678E26023n9306j02622k5545j3048j1572l358n327L412Q850M64l4m64l574L358
13664C17257R867J5700K0990J6807K1588K6175K3109K0320K8222K7139K1828L4290
$$ y = [206250, 181638, 159853, 145888, 138333, 134568, 133124, 124923, 120571, 118954, 111414, 107944, 104292, 96670, 95409, 89265, 87036, 85016, 84685, 70114, 64042, 58593, 59655, 66143, 69656, 75784, 89110, 109881, 120875, 130594, 142023, 147174, 156243, 165989, 141087, 119720, 121653, 133999, 142918, 149255, 157107, 158491, 155243, 156590, 157911, 155137, 148480, 131801, 117927, 121694, 138117, 150075, 156638, 162158, 168717, 173526, 183082, 187203, 193627, 200978, 215306, 223014, 233228, 241047, 252457, 263348, 274160, 271639, 262506, 267650, 282795, 308904, 345333, 388907, 422647, 443563, 465226, 494226, 526023, 466717, 364095, 338550, 325502, 313930, 310572, 305245, 308657, 317507, 317971, 317937, 317473, 313899, 317257, 327124, 342824, 363814, 380621, 402209, 428384, 451493, 471813, 500035, 527174, 549002, 583292]
13652E83292M0704L7077M1993M6637N0949O1770N6970J8279L019K3234N0246P6239
13640A090409R6252R6231O5863J7756M174L2826O8200M295r5434m7113j3101J6321
13628A336679L6706M9509N9673P1563Q1745Q4496J07318J26547J43923J88630
13618B286789K23888K46587K80698L12823L39770L80352M23112M75194N60288
13609E529501O95672Q75163J093275J353364J700288K168848K836820L812330
13601B0065261N005835O426277Q129702R105840N982884l421300j0158301r109489
13593C2026709o032562m168576l360761k836106k226516j632492j222715r78604
13585I568377p76814n62873l58564k14667j01495k1650L1185Q6318J56503K35585
$$ y = [583292, 623996, 661073, 703066, 749703, 800652, 862422, 919392, 937671, 940690, 963924, 1014170, 1090409, 1186661, 1282892, 1348755, 1366511, 1370685, 1403511, 1471711, 1476006, 1380572, 1333459, 1320358, 1336679, 1373385, 1422894, 1482567, 1554130, 1635875, 1720371, 1827689, 1954236, 2098159, 2286789, 2510677, 2757264, 3037962, 3350785, 3690555, 4070907, 4494019, 4969213, 5529501, 6225173, 7100336, 8193611, 9546975, 11247263, 13416111, 16252931, 20065261, 25071096, 31497373, 39627075, 48732915, 54715799, 51294499, 41136198, 32026709, 25994147, 21825571, 18464810, 15628704, 13402188, 11769696, 10546981, 9568377, 8791563, 8228690, 7870126, 7655459, 7553964, 7532314, 7563499, 7649817, 7806320, 8041905]
13575H041905L35786M32733N40069O62914P72648Q81745R73366J046678J109195
13566A4797039J218345J441693J796291K294867K944481L720222M681112O029865
13558C8923915P882435J0615537J4124341J8199613K3245309K7354240K3085974
13551A63431364k484702l1379968l1869472k0784077j3341130j0327735q966804
13544D4277476p390906n530696m003115l118157k547899j988969j446810j021711
13536A7229213p49519n58509m11750k81333j59421k5299J03355K25972L74290
13527A5746999N41240O99121Q47149R84015J063396J031480R77413J080068J380787
13518B4351668J859698K497458L273454M207788N500264P263259R845884J3288516
$$ y = [8041905, 8377691, 8810424, 9350493, 10013407, 10786055, 11667800, 12641166, 13687844, 14797039, 16015384, 17457077, 19253368, 21548235, 24492716, 28212938, 32894050, 38923915, 46806350, 57421887, 71546228, 89745841, 112991150, 140345390, 163431364, 160946662, 129566694, 97697222, 76913145, 63572015, 53244280, 44277476, 36886570, 31355874, 27352759, 24234602, 21686703, 19697734, 18250924, 17229213, 16479694, 15921185, 15509435, 15228102, 15068681, 15043382, 15146737, 15372709, 15746999, 16288239, 16987360, 17834509, 18818524, 19881920, 20913400, 21890813, 22970881, 24351668, 26211366, 28708824, 31982278, 36190066, 41690330, 48953589, 58799473, 72087989]
13510G2087989J7268985K2187751K6953401K5613949M698631k8193877l4631835
13503A05984994k3677310j4817512j0923701r444535p994334o131216m465659
13496B8530727l434877k837949k276213j723809j281341r73845p76300o37336
13488A4589057n30031m31638l30518k36095j51700n7501K9500J23529K25208L22008
13478A3551819L71722L01597J36700N3172Q6573K30890M43153P10994J037844
13469A6924464J462312K041827K887592M011119N339451O996859Q747793Q793412
13461E7204829K815048p840354j1632749q815241n706430m096345l433690k911613
13453A5583455k298442j720936j329441j094470r06034p12459n54238m29874l42718
$$ y = [72087989, 89356974, 111544725, 138498126, 164112075, 168810706, 140616829, 105984994, 82307684, 67490172, 56566471, 47121936, 39127602, 32996386, 28530727, 25095850, 22257901, 19981688, 18257879, 16976538, 16002693, 15226393, 14589057, 14059026, 13627388, 13296870, 13060775, 12909075, 12851574, 12881074, 13004603, 13229811, 13551819, 13923541, 14225138, 14361838, 14415010, 14501583, 14732473, 15175626, 15886620, 16924464, 18386776, 20428603, 23316195, 27327314, 32666765, 39663624, 48411417, 57204829, 60019877, 52179523, 40546774, 31731533, 26025103, 21928758, 18495068, 15583455, 13285013, 11564077, 10234636, 9140166, 8234132, 7521673, 6967435, 6537561, 6194843]
13444F194843k98266k64100k22284j91359j72389j57477j27625j07685q9669n1285
13434D512704j5945n791l2513j04698j55021j88143k16569k13328k09819j97532
13424C173345j75673j74669j54046j46305j42822j35272j15692r1345q6097r2142
13414A859282r6649r8737q4427p7976p5815o1829o1025n4864n0966m2959l4126
13403A119909l9151m0302k8431k1515k1547j8062j1366r235j6613k0377k2654
13392H70656k7934k9848n137O10O086J1590R662K119r798j8210l0015l7384k7313
13379G15084j9323l8240k3357j8289l1683k8644k0182p661K491m562j1695j5892
13367D98047j8159j4292j5926j7451j1897M19k489r031p723k411j58K999K758
$$ y = [6194843, 5896577, 5632477, 5410193, 5218834, 5046445, 4888968, 4761343, 4653658, 4563989, 4512704, 4496759, 4490968, 4458455, 4353757, 4198736, 4010593, 3794024, 3580696, 3370877, 3173345, 2997672, 2823003, 2668957, 2522652, 2379830, 2244558, 2128866, 2037521, 1951424, 1859282, 1762633, 1663896, 1579469, 1501493, 1425678, 1363849, 1302824, 1247960, 1196994, 1154035, 1119909, 1080758, 1040456, 1012025, 990510, 968963, 950901, 939535, 930300, 913687, 893310, 870656, 842722, 812874, 807737, 808347, 814433, 826023, 835685, 837804, 828006, 809796, 779781, 742397, 715084, 695761, 657521, 634164, 615875, 584192, 555548, 535366, 527705, 530196, 525634, 513939, 498047, 479888, 465596, 449670, 432219, 420322, 420741, 418252, 409221, 401498, 399087, 398929, 401928, 404686]
13354D04686q9L446O374K512K227q155o804L389J022J437R582J1894P433P048
13340D46002J994j56J079q551j2604K938j779j4556o869m683n739j1668o407Q039
13326C87040R749M431p803r332m848k716j1480k4455k2718j3944n211o747l174
13313B88792o446m777q919K519o93N37M985L851L479k795k780L196j0743k163
13299B68043R619K018p806q190n150k274M163J0011J498K399p949l229k655n311
13285B55187j0598N324J038M50Q346L341Q622J0311J9490J3189O146j8568l1036
13272B71242k5414k2164j1438p277j5211r742j421M309m51m948l186K654N707
13259A82660j615K638l125k607K45J590l144r65o082o210L479K941J060k412l086
$$ y = [404686, 404597, 408043, 414417, 416929, 419156, 411001, 404197, 407586, 408608, 410045, 419627, 431521, 438954, 446002, 447996, 447840, 448919, 440368, 427764, 430702, 428923, 414367, 407498, 402815, 397076, 385408, 379001, 387040, 396789, 401220, 393417, 384085, 379237, 376521, 365041, 340586, 317868, 303924, 298713, 291966, 288792, 282346, 277569, 268650, 271169, 270476, 271013, 275998, 279849, 283328, 280533, 277753, 280949, 270206, 268043, 277662, 279680, 271874, 263684, 258534, 256260, 260423, 270434, 271932, 274331, 266382, 263153, 260498, 255187, 244589, 249913, 250951, 251401, 259747, 263088, 271710, 282021, 301511, 314700, 320846, 302278, 271242, 245828, 223664, 212226, 204949, 189738, 179996, 178575, 182884, 182433, 177485, 174299, 176953, 182660, 181045, 183683, 180558, 177951, 178196, 179786, 176642, 175677, 169595, 163385, 166864, 169805, 170865, 168453, 165367]
13244A65367j1866l514m557l282j969n8L903J1628P773j894J0451J5568J7849
13231B05399J5803K0492k798k3431k3519k4593j4546j0377o89o89o009n946l055
13218A26042p348k610l715K027N765O538P22J432K087k502K30p654n005l594k20
13203A12195n509j000J17m194J51J52j1318j2346n476j181P508J4610N354j036
13189I8027L210Q656R351Q723P488M837k583q298p544n871l537k522J372j161
13175A10148k200l784j525m281p205j916l51k239O026l115n124k558n16N814l685
13160H3489Q16L753N387k715k20q333o062l783p326j0936r94J712J352M557O426
13145F7123R066N952m82l631j867J09j602m936P596P189J362O663J0369Q267R537
$$ y = [165367, 153501, 149987, 145430, 142148, 140179, 140121, 144024, 155652, 163425, 161531, 171982, 187550, 205399, 221202, 241694, 238896, 215465, 191946, 167353, 152807, 142430, 141741, 141052, 135043, 129097, 126042, 118694, 116084, 112369, 114396, 120161, 126699, 127421, 128853, 130940, 128438, 128668, 121014, 116009, 112415, 112195, 106686, 105686, 105803, 101609, 101760, 101912, 90594, 78248, 72772, 71591, 79099, 93709, 99063, 98027, 101237, 109893, 119244, 127967, 135455, 140292, 137709, 129411, 121867, 115996, 112459, 109937, 111309, 110148, 107948, 104164, 102639, 98358, 91153, 89237, 88886, 86647, 92673, 89558, 84434, 81876, 81360, 87174, 83489, 84305, 88058, 93445, 90730, 90510, 82177, 76115, 72332, 65006, 54070, 53076, 54788, 56140, 60697, 67123, 76189, 82141, 81659, 78028, 76161, 76270, 74668, 69732, 77328, 84517, 85879, 92542, 102911, 111178, 120715]
13130A20715J2530J3065J5261J8225K4457L6641M9781M5207O154m0639m7978m0333
13118B13086k5530j9617j5620j0302r188q665q884j199K096j892n680n185m280
13105I9140p543L979J731l811j685J590L316N588K761Q9K24J321J735O338J0368
13090A25141J3415J2159J8592K4140K3252L0671L9689M7282O1828Q5362J18773
13079F00304J37939J39156Q4384p4533j73209j48531r5018n7551m2285l2786k9851
13068C08019k8194l4138l3099k2894j6101j0802q957j0012p524n903n886n210
13056A19299N607R357P329m323p290K552O639O486Q119L156K798J0725J7841J2347
13042B00642J7162K1897K5976L3775N0124O1036Q0074J05094J32775J45476J04846
$$ y = [120715, 133245, 146310, 161571, 179796, 204253, 240894, 290675, 335882, 342036, 301397, 253419, 213086, 187556, 167939, 152319, 142017, 132829, 124164, 115280, 114081, 116177, 114285, 108605, 103420, 99140, 91597, 95576, 97307, 93496, 91811, 93401, 96717, 102305, 105066, 105155, 105379, 106700, 108435, 114773, 125141, 138556, 150715, 169307, 193447, 216699, 247370, 287059, 334341, 396169, 481531, 600304, 738243, 877399, 961783, 887250, 714041, 565510, 470492, 412941, 370656, 337870, 308019, 279825, 245687, 212588, 189694, 173593, 162791, 153834, 143822, 136298, 130395, 124509, 119299, 124906, 134263, 141592, 137269, 129979, 132531, 139170, 145656, 153775, 156931, 159729, 170454, 188295, 200642, 217804, 239701, 265677, 299452, 349576, 410612, 490686, 595780, 728555, 874031, 978877]
13031I78877m2174j78818j70024j19773q1688n8557n1174m1942l1683j8645j4174
13020A70225j1015j5893n999n314q043p545l478n73m774n73J939n8J715m016l709
13005A02889N93J549K299M588O202L552L92q30M503J0010J0982O846R463J5291
12991A78329L1369M2547M3069M1883L1947m947n2506n8619m0766l1368k4700k1681
12979A34557j5384k0599j3976q587l907m701j895Q6J51r366j123j975r92l838
12965D8451K305M446j251j055l420p004L437O143m154l087j997j287n441K04j446
12950C4844j687M542J2860J395j1465p148J150m992n696L931j169P30N471n41
12936C2225k502j0201n484P07K987M810J013J719k963m434M911M568l931j522
$$ y = [978877, 936703, 757885, 587861, 468088, 386400, 327843, 276669, 234727, 203044, 184399, 170225, 159210, 143317, 137318, 132004, 123961, 116416, 112938, 112365, 107591, 107018, 108957, 108899, 110614, 106598, 102889, 103482, 105031, 107330, 111918, 118120, 121672, 122064, 121234, 125737, 135747, 146729, 153575, 163038, 178329, 209698, 252245, 295314, 337197, 369144, 364197, 311691, 253072, 212306, 180938, 156238, 134557, 119173, 98574, 84598, 76011, 72104, 67403, 65508, 65594, 65745, 56379, 55256, 53281, 52289, 48451, 50756, 55202, 53951, 52896, 49476, 42472, 45909, 52052, 47898, 44811, 42814, 41527, 36086, 36290, 34844, 33157, 37699, 50559, 51954, 40489, 33341, 34491, 29499, 23803, 27734, 26565, 27295, 32766, 32225, 29723, 19522, 14038, 14745, 17732, 22542, 23555, 25274, 22311, 17877, 22788, 27356, 23425, 21903]
12922B1903L693n059j631k900M546M207M878l814L105j759m606j34n402J259Q25
12907A9111K706k001l407K837O24P83J60l058o05K511J566K791k666p843K658
12892A6167K534M096L04m492m68k862m47k580L061Q195M44m237m324j668K295
12877A6018J918M43J084m050r25L504m052j793J179L108j371K043O239J773m387
12862B0731N139J192q466o558n050k091P392j685j390lM023N251k939p613L261
12847A1194J4672N300p257k470l301j823l541l62N939l145m646l576l156K944
12833F772n61m44R35k250N218J513j597q73P81K489O8L308J268p787R2O650M022
12816A9604j872L75Q75N915o2l628J02l365n019J549K03j16L877O442N98q338
$$ y = [21903, 25596, 20537, 18906, 16006, 20552, 24759, 29637, 25823, 28928, 27169, 22563, 22429, 17027, 18286, 19111, 21817, 19816, 16409, 19246, 19870, 20653, 20813, 17755, 17150, 19661, 21227, 24018, 21352, 13509, 16167, 18701, 22797, 23101, 18609, 18141, 15279, 14832, 12252, 15313, 23508, 23952, 19715, 15391, 13723, 16018, 17936, 18379, 19463, 15413, 14488, 17992, 13940, 12147, 13326, 16434, 15063, 17106, 23345, 25118, 20731, 25870, 27062, 18596, 12038, 6988, 4897, 12289, 10604, 9214, 9211, 13234, 18485, 15546, 7933, 11194, 25866, 31166, 23909, 21439, 18138, 16315, 12774, 12412, 18351, 15206, 10560, 6984, 3828, 6772, 6211, 5767, 6702, 4452, 9670, 11183, 9586, 8713, 9494, 11983, 12051, 15359, 16627, 8840, 8932, 15582, 19604, 17732, 18107, 18982, 24897, 24835, 21207, 21309, 17944, 12925, 14474, 14677, 14561, 18438, 24880, 25478, 17140]
12800A7140p139K938J750M104L621K752M493m919l045p61j92r07k637k807n25
12785A3866k366n509n87N7J264M312J775k383k852n305P00J442J054L742L47k027
12769G530k685Q26J618J878l699j833M010j57j311k812PL888K625k544N19M513
12753A2373j873k607l223j692J48K415K376l463k638q83N180M407j123r64K815
12738A1248k104l300J176L288J825o690o624P575M346j7J955q82J598j397M24
12723A2421j386n518k043N651L489l992k945K483o41p45m586l359J008O148O166
12708A2151j588r522O108R980l344n042p127J324J283p871L513O895M214K171
12694A3145p268k532L23N76n060n19J930K242l200k801M584P147O993k82k473
$$ y = [17140, 10001, 12939, 14689, 18793, 22414, 25166, 29659, 24740, 21695, 20934, 20742, 19835, 17198, 14391, 13866, 11500, 5991, 5404, 5461, 6725, 11037, 12812, 10429, 7577, 2272, 2972, 4414, 5468, 9210, 9557, 7530, 4845, 5671, 7289, 9167, 5468, 3635, 7645, 7488, 6177, 3365, 3372, 7260, 9885, 7341, 7860, 12373, 10500, 7893, 4670, 2978, 3126, 5541, 7917, 4454, 1816, 933, 6113, 10520, 9397, 8433, 11248, 9144, 5844, 7020, 10308, 12133, 5443, -1181, 6394, 10740, 10723, 12678, 11796, 13394, 11997, 12421, 11035, 5517, 3474, 9125, 12614, 8622, 5677, 8160, 7519, 6774, 2188, -1171, -163, 5985, 12151, 10563, 1041, 7149, 17129, 13785, 8743, 1616, 2940, 4223, -3648, -135, 6760, 10974, 13145, 5877, 3345, 3668, 4244, -816, -1335, 595, 2837, -363, -3164, 1420, 8567, 15560, 15278, 12805]
12679A2805J163k428n934n842m63l145L277M683O935L353P24J440k115p795j283
12664E375o330l092j0k746J838R62J391J111K970m782m250q5M028K04m571O240
12648a747Q367K50l97k493J671L335N638J040m52l343p31l982l47N277J046m864
12632H268o624k889M574L36K678M82n908M161P470j898n742M008o46k420P10j330
12616E230N691m379j0705M43M764L069J743Q67o68m33l7p13k65o704p55N985j551
12599A582R78J470j828L290k185M59J557N117j354m733q39J036J437p61j074m176
12583b4o789J61L346K071J378L90L699M66J659o64J81K840o472o674L898K836
12567B302j568J646L177l29J005l209J124n677j270K123P60m52j16K017J298O227
$$ y = [12805, 13968, 11540, 5606, -236, -699, -3844, -567, 4116, 11051, 14404, 15128, 16568, 14453, 6658, 5375, -955, -4047, -4057, -6803, -4965, -4003, -2612, -1501, 1469, -3313, -7563, -7648, -3620, -3416, -7987, -1747, 6620, 6870, 6473, 3980, 5651, 8986, 14624, 15664, 15212, 11869, 11138, 7156, 6809, 12086, 13132, 8268, 1644, -1245, 3329, 3665, 6343, 6825, 917, 5078, 12548, 10650, 4908, 8916, 8270, 5850, 6560, 5230, 10921, 6542, -4163, -3720, 1044, 4113, 5856, 6723, 6055, 5622, 5585, 4872, 4607, -2097, -2852, 3133, 1582, 2560, 4030, 2202, 5492, 3307, 3766, 5323, 10440, 9086, 4353, 3514, 4550, 5987, 5226, 4152, -24, -6813, -6652, -3306, -1235, 143, 533, 4232, 4698, 6357, 5693, 5874, 8714, 2242, -4432, -534, 2302, 734, 2380, 5557, 5228, 6233, 3024, 4148, -1529, -2799, -676, 84, -368, -484, 1533, 2831, 9058]
12551I058J241l788n426j361J779M513K30L44K794J760l869M354L015p390p509
12536b55n135R11O677q8m211n61K719K426J365K624J87k648o928o771O122M086
12520E20m354j650J90j077k378P22O565J162j789K455j28k341m85q72R4n832k459
12503a1657J487M777M418K879K514J399L161K340M990M728q412k407L355k330
12489A1242J706j490k783J721l457j567o73k444n179k891K95L325R313l247q264
12474d393j931m426L299L633J334Q84R077M015l732p55j525q25N85K822J157k49
12458H970l925l522L785r1N443J129J984J976Q910Q367R146J2527K784j0976j2769
12443C3738p729n081r566J432K636n075m034k684L061J132l811j088m229m469
$$ y = [9058, 10299, 6511, 1085, -276, 1503, 6016, 6246, 6590, 9384, 11144, 7275, 11629, 14644, 7254, -255, -5390, -4479, 2198, 2110, -2101, -2662, 57, 2483, 3848, 6472, 6659, 4011, -2917, -9688, -3566, 520, -3834, -5484, -5294, -6371, -8749, -8027, -1462, -300, -2089, 366, 238, -2103, -2588, -3460, -3366, -9198, -11657, -10170, -5393, -975, 1904, 4418, 5817, 8978, 11318, 16308, 21036, 12624, 10217, 13572, 11242, 12948, 11458, 8675, 10396, 6939, 5372, 4699, 2255, -2924, -5815, -5520, -2195, 7118, 3871, -4393, -6324, -10750, -7451, -3818, -2484, -1600, 7477, 11492, 7760, 7005, 5480, 4655, 5240, 8062, 9219, 8970, 5045, 1523, 5308, 5217, 10660, 11789, 13773, 15749, 24659, 33026, 42172, 54699, 57483, 46507, 33738, 26009, 20928, 11362, 12794, 15430, 10355, 6321, 3637, 6698, 7830, 4019, 2931, -1298, -5767]
12429e767P11J708N485L964J366L68j165p27N983n855r02N040M798L694o846l04
12413A1551K205M062Q431L533M390Q839J1558J3322K8911L2627K3757J3274k0505
12400A45955l6836l0047k1709r777n490o116n799J420o475l880K603R46j045p575
12386A6175J35l249m725k23L157M821Q107j639l302m070Q40M305K687M755O851
12371C4625N033n376m90L170l985j07M377M708J0388J0939J5217K8893L4514K8547
12357A70453k980l5892l1606k2095j4089o001j2679j0871n331M001K460q599j102
12344B5669M178K302p967n953p267l70K332L500J956K390o842N66M534j947j772
12329A5309m296m374k766O311O721j305j376K049O532k543k16k572L654J2576
$$ y = [-5767, -5056, -3348, 2137, 6101, 7467, 7835, 6670, 5943, 11926, 6071, 5169, 10209, 15007, 18701, 11855, 11551, 13756, 17818, 26249, 29782, 34172, 43011, 54569, 67891, 96802, 129429, 153186, 166460, 145955, 109119, 79072, 57363, 47586, 42096, 35980, 30181, 31601, 25126, 21246, 23849, 24795, 23750, 16175, 16310, 13061, 8336, 8113, 11270, 16091, 24198, 22559, 19257, 15187, 16027, 20332, 23019, 27774, 34625, 39658, 34282, 33792, 36962, 32977, 32870, 37247, 41955, 52343, 63282, 78499, 107392, 141906, 170453, 167473, 131581, 99975, 77880, 63791, 57790, 45111, 34240, 28909, 32910, 35370, 26771, 25669, 29847, 32149, 24182, 18229, 10962, 10592, 12924, 16424, 18380, 20770, 13928, 14494, 19028, 17081, 15309, 11013, 6639, 3873, 10184, 16905, 15600, 14224, 16273, 22805, 20262, 20046, 17474, 21128, 33704]
12315C3704J2175R118L807l520j4502j0976m388J782M212m276n549q389o280r677
12301b759J715N177k924M302K269k601P75J55J552j282M011O162M822j517r842
12286A0015r753L108J426L066k202K06l322J800m286J988p60K521J860p25L61
12271E303J818q292m712O502J840j761l845L632j269K14o779n110l350M988Q203
12256b618K40K019J613j707k285j759o18K352N361j782j013J071l806L78K851
12241B97L428K112k271k09K177m234j329k340K917L048L496M051j854l598k98
12226E393K003J846l921n210j0643Q83L437K543L915M731Q507J666r994j773n455
12211b072m075p75K757P237O167k78r28m316n456o21p45Q962K398n907m717k631
$$ y = [33704, 45879, 54997, 58804, 55284, 40782, 29806, 25418, 27200, 31412, 27136, 21587, 13198, 6918, -2759, -1044, 4133, 1209, 5511, 7780, 5179, 5954, 6109, 7661, 6379, 10390, 16552, 21374, 19857, 10015, 262, 3370, 4796, 7862, 5660, 5866, 2544, 4344, 58, 2046, 1286, 3807, 5667, 4942, 5303, 7121, -1171, -5883, 619, 2459, 698, -3147, 485, -784, -570, -7349, -12459, -15809, -10821, -2618, -2378, -359, 1254, -453, -2738, -4497, -5115, -2763, 2598, 816, -197, 874, -2932, -2554, 297, 3725, 5837, 3566, 3357, 5534, 1300, -29, -2369, 548, 3596, 7092, 11143, 9289, 5691, 5393, 7396, 9242, 5321, 111, -10532, -9649, -6212, -3669, 246, 4977, 13484, 15150, 5156, 3383, -2072, -6147, -6922, -4165, 3072, 9239, 8961, 8033, 3717, -1739, -2360, -3105, 5857, 8255, 2348, -2369, -5000]
12195e000j717J895O395L278m20o383r306K522Q014K437K958K585P31n551o80
12180A758J576k551o008n668O67L258L147K745M662j418q057N45J3129N138o026
12165F897k082J344k28l269k324M70j92k95K098o726L918l522j56k700j470O327
12149a910p64p322M145J423L515Q47n92k060n143k022n44O570J112j697K522K835
12133I15j551M864k318Q52k988k276L626o17m61p74p199J027L137J144L959J278
12117B618K792K868l041L851k700k578J280L150k099p222o056N2L922p26J749
12102b140M536J983O686k113m287n527K369K354k117K105L051M212K824n42k75
12087A3119l632L87j291K399J691P6p39k025M033j822O038P87j937K37K205q38
$$ y = [-5000, -6717, -4822, 1573, 4851, 4431, -1952, -11258, -8736, -722, 1715, 4673, 7258, 7989, 2438, 1758, 3334, 783, -5225, -10893, -10226, -6968, -3821, -1076, 3586, 2168, -5889, -5344, 7785, 12923, 6897, 4815, 6159, 5931, 2662, 338, 808, 616, 321, 2419, -4307, -389, -3911, -4067, -6767, -8237, -1910, -2674, -9996, -5851, -4428, -913, -66, -658, -2718, -7861, -9883, -10427, -3857, -2745, -4442, -1920, 915, -636, 4228, 1910, 2762, -226, -2502, 1124, 507, 46, -728, -7927, -6900, -3763, -2619, 1340, 2618, 5410, 8278, 5237, 9088, 6388, 3810, 5090, 8240, 6141, -1081, -7137, -7085, -3163, -3889, -2140, 2396, 4379, 11065, 8952, 4665, -862, 1507, 3861, 1744, 3849, 6900, 11112, 13936, 13394, 13119, 9487, 9874, 8583, 10982, 12673, 12749, 12010, 9985, 14018, 12196, 18234, 19021, 17084, 17321, 19526, 18688]
12071A8688l982q46k817P62L913R83L76L046M863K81N866J951k492k487j663Q341
12055C4783J2312J5507K1896K1211K6585M0806N4921O4057O4089L0858j6833o5800
12043C04392q2576o2181n0709k8845j2591j5666q444M730j0634j0416q47m279
12031B1934m824J40m704p841J410J0564N617M055j57J055Q110M766m162l724j683
12016C0556m385J76m889r147P5p19j803k737k014J216k647n15L305L066m854J465
12000F149Q605j601o027j459j905m043O604M846m808n824l661q15j25J12P148
11985C196L299j550m120k2K170K932K958k750j4068o609k72M988J1524L092J527
11970F295l425n03m850l516m297O083K462R5r49J4k021P07R43J909k488K008K089
$$ y = [18688, 14706, 13860, 11043, 11805, 15718, 16701, 17077, 20123, 24986, 25267, 31133, 33084, 30592, 28105, 26442, 34783, 47095, 62602, 84498, 105709, 132294, 173100, 228021, 292078, 356167, 387025, 370192, 304392, 221816, 159635, 108926, 80081, 67490, 51824, 43380, 48110, 37476, 27060, 26213, 21934, 17110, 17250, 12546, 4705, 6115, 16679, 22296, 26351, 26194, 27249, 35359, 40125, 35963, 32239, 30556, 26171, 26347, 21458, 12311, 12386, 11667, 9864, 7127, 5113, 6329, 3682, 3167, 6472, 9538, 4684, 6149, 14754, 13153, 7126, 5667, 3762, -281, 6323, 11169, 6361, 537, -3124, -3939, -4064, -3952, 3196, 6495, 4945, 825, 803, 2973, 5905, 8863, 6113, -7955, -14564, -14836, -9848, 1676, 4768, 6295, 2870, 2367, -2483, -5999, -10296, -4213, -1751, -1656, -2605, -2591, -4612, -3905, -2962, -1053, -3541, -1533, 556]
11953E56M498l944Q87K179j058L083M51n411p630n227P750k458k595K764N496
11938f59L741m590l302j639l49J144K909K63l976l96O512K727J490k037m747k57
11922c166L694k241k493k590l361k547O081K701m07J726m840K761K35J020q04
11907d231J186k050o204j328K849K089K362M97K146n470m636P369J928j394M436
11892d51l595K566M981n225k186M225j947k126L432N427n049o571q307r58P03
11877a5081O233M963p62O622j962q563l602J82K185M299P734Q08m84J037n202
11862a593n062J489N696L797k362l382m165Q64L385J566K841k407m669J629J497
11847h76l238q383m76Q25M403L572r48j07j18M198O582r244n36k219k936M901
$$ y = [556, 5054, 1110, 1997, 4176, 3118, 6201, 6652, 1241, -6389, -11616, -3866, -6324, -8919, -6155, -659, 3082, -1508, -4810, -6449, -6798, -5654, -2745, -2482, -6458, -6854, -342, 2385, 3875, 1838, -2909, -3166, 528, -1713, -4206, -6796, -10157, -12704, -6623, -3922, -4329, -2603, -7443, -4682, -4447, -3427, -4231, -3045, -5095, -11299, -12627, -9778, -7689, -5327, -4830, -2684, -8154, -12790, -5421, -3493, -4887, -451, -4046, -1480, 3501, -1724, -3910, 315, -1632, -3758, -326, 5101, 52, -6519, -14826, -15784, -15081, -8848, -3885, -4647, 1975, 13, -8550, -12152, -11970, -9785, -5486, 2248, 3056, 2572, 3609, -1593, -6655, -5166, 530, 4327, 1965, -1417, -5582, -4718, -1333, 233, 3074, 667, -4002, -2373, -876, -4114, -12497, -12973, -12148, -7745, -4173, -5121, -5228, -5346, -1148, 5434, -3810, -4346, -6565, -9501, -4600]
11831d600Q611l949p779l287N915J927j400rJ359n27j634P20J041j055J236J419
11815b012M575j476K463o61l158j636J435r98k010k130k931l145j561O845J668
11800d732k220n92M019J2844Q988l997m25Q40R178L589o481m853p696m285m066
11785A11q762k009L366J518j060L944M175Q89K485n403N750M294n329r886p681
11770a3598K733N734N842j882q215n505M484O766N85q196r26O415N600j087r36
11755b186L15L0o319J99l437L902L650m618j295j506m074L042K078m152l72L403
11739a1340M699Q96j820L084k414J999K705m956K9J735k962n895k235L485M797
11724h193j437j826J970J433J310j251K626m381m040m076L855J322M705K657l513
$$ y = [-4600, 4011, 62, -7717, -11004, -5089, -3162, -4562, -4571, -3212, -3739, -5373, -4653, -3612, -4667, -3431, -2012, 2563, 1087, 3550, 2889, -269, -1905, -470, -1468, -3478, -5608, -8539, -11684, -13245, -6400, -4732, -6952, -7544, -3525, 9319, 18307, 14310, 13885, 14725, 23903, 27492, 21011, 16158, 8462, 4177, 111, -8651, -10660, -7294, -5776, -6836, -2892, 1283, 2172, 4657, -746, 5004, 9298, 3969, -5917, -13598, -10865, -5131, 711, -1171, -9386, -14891, -10407, -3641, -3056, -11252, -12178, -5763, -163, -1250, -2186, -1871, -1841, -8160, -7961, -11398, -7496, -3846, -8464, -9759, -11265, -15339, -12297, -10219, -14371, -14743, -11340, -6641, -5745, -7565, -4481, -6895, -4896, -2191, -7147, -7118, -5383, -8345, -14240, -16475, -12990, -8193, -9630, -11456, -9486, -8053, -6743, -7994, -5368, -9749, -13789, -17865, -14010, -12688, -7983, -5326, -8839]
11709h839J27M253J041O140m356k089M102p203l471l9P589P326L375k001n636
11694C19m731n464l13O410P610p386J68J312k046j195M592j387J662j955J29J472
11678h03l646n201n414K712P000P70k929l752p02P19J774N588J274m181m107M211
11662f687O075m033R52O85N98O210n438k178J836J438m848J72l298j395N140k244
11646g015J607K63l885n534M208Q40M546L342m301k508o389m602O576P851K218
11631b783N477K249j452K309Q49m417j673L928r87o649J695J762m703n300n639
11616a5334L225L833M492M60M636o19K734N111k224p004m797j64j80L41K486J584
11600a420m555p231j31J780J221k964K417N565K852J802n248m927K389K016M357
$$ y = [-8839, -8712, -4459, -3418, 2722, -1634, -3723, 379, -6824, -10295, -10334, -2745, 4581, 7956, 5955, 319, -4412, -9876, -10189, -3779, 3831, -3555, -3387, -2075, -4121, -5316, -724, -2111, -449, -2404, -2275, -803, -4449, -9650, -15064, -12352, -5352, -4582, -7511, -11263, -11965, -11246, -9472, -3884, -2610, -6791, -10898, -6687, -612, -4645, -3693, -3008, -2410, 3800, -1638, -3816, -1980, -542, -5390, -5218, -8516, -9911, -4771, -7015, -5408, -5145, -9030, -14564, -10356, -9516, -4970, -1628, -5929, -8437, -14826, -19428, -12852, -5001, -2783, 2694, 4943, 3491, 5800, 6649, 2232, 559, 4487, 3500, -3149, -1454, 308, -4395, -9695, -15334, -12109, -8276, -3784, -3324, 1312, 693, 3427, 8538, 6314, -690, -5487, -5651, -5831, -5490, -3004, -1420, -5975, -13206, -13337, -11557, -10336, -13300, -10883, -5318, -2466, -664, -5912, -10839, -8450, -6434, -2077]
11585b077J345n828l387j275R907J044n878k603J106j008L55n75R97J331K533
11570d013K234m802k861m229J317L194L649j326m812J699M18M320M377Q312k610
11555D867o173J052K57K27P08l578k950j758J448p732k539K318O600O407m826
11540e672K051l64P669n2o70p085k443m68P779K689m037r434l949K296O494m72
11524e668m46P38J364K683q68j0258K491q69M905O727o13p884k31k360P41L459
11508f089O169k158k345j53K365N218l681o82M80M924m407l696K824K213j784
11493h02l794o823j150N741M701M855O582o230m578o996q92l922L309K753n048
11478a2294j459M229K365k782o4J017L233o82J141J687l239j494M54K69P82K496
$$ y = [-2077, -732, -6560, -9947, -11222, -1315, -271, -6149, -8752, -7646, -8654, -8299, -8874, -7877, -6546, -4013, -1779, -6581, -9442, -13671, -12354, -9160, -5511, -6837, -11649, -9950, -9532, -5212, -835, 7477, 4867, -1306, -254, 3, 230, 938, -2640, -5590, -7348, -5900, -13632, -16171, -13853, -7253, -846, -5672, -3621, -3985, 3684, 3632, 2962, -4123, -6566, -7034, 745, 3434, -603, -10037, -13986, -11690, -5196, -5668, -6114, -5376, -4012, -1329, -2197, -12455, -9964, -10833, -5928, 799, 186, -7698, -7929, -10289, -9548, -6089, 80, -2078, -4423, -4576, -2211, 3007, -674, -1356, -876, 4048, -359, -4055, -1231, 982, -802, -4596, -11419, -12569, -6828, -2127, 2728, 9310, 3080, -1498, -8494, -9386, -13308, -9999, -7246, -12294, -13753, -9524, -7159, -9941, -10005, -8988, -5755, -6437, -5296, -3609, -6848, -8342, -7888, -7619, -6837, -4341]
11462d341L279l259K052k025j602l080M6m378K797L040K088o32l582M675O91m74
11446d705J4j039K822k872m157k109m045m791j451J718j738N563K385m894M993
11431a4306J0512P618L087M125J508o45o632m448m429k620K488L739K317j821
11417D93K870j967p273k489l240l971K915M340N44O30k193j833k312K446J1551
11402E11O014p020n785j27k442o067L141j820j666k732L268M280J96j369O01j561
11386a2578M043L395l975K653J270P22n699l409L872l755M735P469P726k484p461
11371c476k750L473O985l030J665m254k956o285k552P57J064n361M902K944l645
11356a2519J72l875J211J540k400K473K739J757O73p30o05j035M401m025m286
$$ y = [-4341, -1062, -4321, -2269, -4294, -5896, -8976, -8930, -13308, -10511, -7471, -5383, -6015, -9597, -4922, -4231, -4705, -4691, -5730, -2908, -5780, -9937, -12046, -16091, -20882, -22333, -20615, -22353, -16790, -14405, -19299, -14306, -3794, 3824, 6911, 11036, 12544, 11899, 5267, 819, -3610, -6230, -3742, -3, 2314, 493, 3363, 1396, -5877, -8366, -11606, -15577, -12662, -8322, -7778, -7148, -9341, -11174, -13486, -11040, 511, 6525, -495, -6280, -6407, -8849, -14916, -11775, -13595, -15261, -17993, -14725, -10445, -10249, -11618, -11017, -12578, -8535, -5140, -9115, -6462, -5192, -4470, -10169, -13578, -9706, -13461, -8726, -1257, 6469, 3985, -3476, -6226, -2753, 4232, 1202, 2867, -1387, -4343, -10628, -13180, -12423, -11359, -16720, -11818, -8874, -12519, -12347, -16222, -15011, -13471, -15871, -13398, -10659, -8902, -8229, -8959, -9564, -10599, -6198, -10223, -14509]
11341a4509Q60L961r18l266l677M865M696L760l429J276j525n676j315L579J1291
11326b7M292o360k504N83K17o337l735L918M679j441k249n27l337m318j74j83
11310a7503M414N421m44L627P076J04o242K037j278J186l38J569J422k330k078
11295c357K413L967k92P05l576r784k172K069o999l697l256P490P795l348k345
11280a4387l499M476K995Q33J037l12l7K13l553K729Q601J245N141j503j484l211
11264g16l034L407K479j14j72n89k637m698O967J165j825q53n06n666r90L123
11248d659L013L438M77q161j968N103L46r06R10N207j724j872n134n157j545J971
11232a0661m940L613O651l061j811O041K050m970j639L062j697k09m807j88J687
$$ y = [-14509, -13649, -9688, -10606, -13872, -17549, -12684, -7988, -4228, -7657, -6381, -7906, -13582, -14897, -11318, -27, 4265, -2095, -4599, -4016, -3799, -10136, -13871, -9953, -5274, -6715, -8964, -9491, -12828, -17146, -17320, -17503, -13089, -7668, -8112, -4485, 2591, 2695, -3547, -1510, -2788, -1602, -1940, -371, 1051, -1279, -3357, -944, 3023, 2731, 3436, -140, -9924, -12096, -10027, -17026, -20723, -23979, -16489, -8694, -12042, -14387, -17886, -13410, -10415, -9582, -8545, -8857, -8894, -8681, -12234, -9505, -904, 341, 5482, 3979, 2495, -716, -3750, -343, 2136, 2022, 1850, 1261, -1376, -6074, 893, 2058, 233, -620, -1126, -6792, -7782, -4659, -1646, 1792, 2269, -5892, -7860, -2757, -2411, -3317, -2407, 2800, 1076, -796, -5930, -11087, -12632, -10661, -15601, -11988, -5337, -8398, -10209, -4168, -2118, -7088, -8727, -5665, -7362, -7571, -12378, -12566, -10879]
11217a0879j768L214j412k377k813L406Q29k761J080O95J850J11L119J037L097
11202c572q44j137r44J872q50J472M051N140j712o266j861L705K942j007j779
11187g90Q68O450j0025j1025j312M078R028J710q656n03Q962m51k284K029k31
11172b152k154L51m856j026L288K579j087r93q82q51M557L797r7L43k027m146
11156e356R38p45j861j167O604m74n2j652N013m291k754j129L805K368k91K714
11140A670l813o023j861O81L083o38N11K815M921O61k986k161R6o094M27O663
11124b048J634K04m267L12L776J133j73j431M154l099r306M754m52m045J801j323
11108h376m301J352r47J91K042L659j563J427M525M238O367j967o143K51K135
$$ y = [-10879, -12647, -9433, -10845, -13222, -16035, -12629, -11800, -14561, -13481, -12786, -10936, -10825, -7706, -6669, -3572, -4416, -5553, -6497, -4625, -5475, -4003, 48, 5188, 3476, -2790, -4651, -946, 1996, 989, -790, 78, 6528, -3497, -14522, -15834, -11756, -2728, -1018, -9674, -10177, -1215, -1666, -3950, -1921, -2152, -4306, -3955, -8811, -9837, -6549, -3970, -5057, -6050, -6932, -7783, -3226, 571, 474, 817, -1210, -5356, -4418, -5163, -7024, -8191, -1587, -2061, -2113, -3765, 1248, -3043, -5797, -6926, -3121, -753, -1044, 1670, -2143, -8166, -10027, -9346, -6263, -6901, -6390, -3575, 1346, 2007, -979, -3140, -3044, -9138, -8711, -2048, -414, -210, -4477, -4165, -389, 744, 571, -860, 3294, 195, -9111, -4357, -4809, -8854, -7053, -8376, -12677, -11325, -12272, -12081, -10039, -6380, -7943, -6516, -1991, 2247, 8614, 6647, 504, 755, 2890]
11093B890k342j542j462l001l976l607J951K064j265J321j1L688N015L265o378
11078c390q079m269O609J415M631j796p017j773o85K72Q10M94r22K619K526K921
11062e634j080m59N369J318J118O21Q80n588k287k846k588K621J811j373R9J150
11046f868L676L675N424k067l635L329K492q129p912O76Q80k6L819N04l303k924
11030a0389K745Q114j829o287m641j190P68K864N772K084M706N820j57N37L883
11015A2800m719p070m369m838J722o44k28M394P545j632J79k838m162o288K85
11000i863L373J963j10o779q851K131Q910J109l87P35L404l73q78o78M05m184
10984a0073l639K673l925K592k740P885K572m481l900O28K751j092L002l903K590
$$ y = [2890, 548, -994, -2456, -5457, -9433, -13040, -11089, -9025, -10290, -8969, -8980, -5292, -277, 2988, -3390, -11469, -15738, -9129, -7714, -3083, -4879, -11896, -13669, -14354, -14082, -13272, -12778, -13700, -11081, -8555, -5634, -6714, -7173, -1804, -486, 632, 1253, 2133, -3455, -5742, -8588, -11176, -8555, -6744, -8117, -8018, -6868, -3192, 483, 5907, 3840, 205, 3534, 6026, -2103, -10015, -9339, -8459, -8485, -4666, -4162, -7465, -10389, -7644, 470, -1359, -7646, -12287, -13477, -12709, -9845, -4073, -1989, 2717, 8537, 8380, 8917, 12800, 8081, 1011, -3358, -8196, -6474, -7118, -7346, -2952, 4593, 2961, 3140, 302, -3860, -10148, -9863, -6490, -4527, -4637, -11416, -20267, -18136, -9226, -8117, -8504, -7769, -4365, -4738, -5616, -6294, -5889, -10073, -13712, -11039, -14964, -12372, -15112, -7227, -4655, -9136, -13036, -12408, -9657, -10749, -7747, -11650, -9060]
10969i060o64K441O737P084O99p605j023l483L208j690M40K619l246k980K044
10954d479l094l821j317O23k251O742o61o30m129q80q99L580M628P636L591l886
10938G53l901n423M415R298L35J765N650n133q487n067J167R54N49q244m346N301
10922a0414L648N530l261J484O255o18o530p601L892N468K527l933k234m557j249
10907a1593J107k655k346K907N94K750O959L333K090j474p807J702m460l861k529
10892a5283K647M841m577P35K867Q340o14K061k338l829J625K753j541k971J976
10877c308L28k754j142m580j69P411L62k182o37p765J003M538M662J720k2n614
10861h149K80M954M539l556J359M562m45m337l223K526N897M441j321q084j383
$$ y = [-9060, -9724, -7283, -546, 6538, 7237, -368, -1391, -4874, -1666, -3356, -2916, -297, -3543, -6523, -4479, -7573, -11394, -12711, -12088, -14339, -7597, -8258, -8888, -13017, -13897, -14796, -11216, -6588, 1048, 4639, 753, -3148, -8571, -4156, 5142, 5477, 7242, 12892, 7759, -728, -5795, -4628, -3674, -3125, -11369, -15715, -10414, -6766, -1236, -4497, -3013, 3242, 2624, -3906, -11507, -7615, -2147, 380, -3553, -5787, -10344, -11593, -10486, -13141, -15487, -12580, -11986, -9236, -2277, 1056, 3146, 1672, -6135, -4433, -8893, -12754, -15283, -12636, -7795, -12372, -11637, -8770, -430, -1044, 1017, -1321, -5150, -3525, -772, -2313, -5284, -3308, -2980, -5734, -6876, -11456, -11625, -4214, -3852, -6034, -6671, -14436, -13433, -8895, -4233, -2513, -2535, -8149, -7869, -2915, 1624, -1932, -573, 3989, 3544, -793, -4016, -1490, 4407, 8848, 7527, -557, -1940]
10846a940n006j952K763L609J984l903p106m431J845K539j204M35O231L193O19
10831b324K460n220k026J418J408P026j381J056k749k857P47L912j95J176L265
10816E716L15n129J207o800l735l052l540N440O827K262r55j887n06k811K53N535
10800h60M248l697J199k841k085l28L936K768j514l349L09j186K200k962l118
10785g280k640n529n090j199L015J360m056Q99L378J085l83J523K770P677J845
10770b625Q99J542m067l003J898L365q16J16q64M742j23k48j423K201n192m619
10754h217l930J538J933o494l6P491j104k247K175J213o441J068L59l819Q537
10739g974O068K570J70o68j181L711o31o019j818K368r94j349O28q94L544k611
$$ y = [-1940, -6946, -8898, -6135, -2526, -542, -4445, -11551, -15982, -14137, -11598, -12802, -12367, -6136, -2943, -2324, 136, -5084, -7110, -5692, -4284, 2742, 1361, 2417, -332, -3189, -2442, 1470, 1275, 2451, 5716, 6031, 902, 2109, -4691, -8426, -11478, -15018, -9578, -2751, -489, -1444, -3331, -3837, -6648, -6395, -860, 3388, -309, 890, -1951, -4036, -4364, -428, 2340, 826, -2523, -2214, -3400, -1200, -4162, -7280, -9920, -15449, -20539, -21738, -18723, -17363, -21419, -20520, -17142, -16057, -16440, -14917, -12147, -4470, -2625, -1726, -184, -4251, -7254, -5356, -1991, -2807, -2691, -3555, 1187, 1064, 816, -607, 1594, -3598, -8217, -12147, -10609, -8676, -15170, -15206, -7715, -8819, -11066, -8891, -7678, -14119, -13051, -12692, -16511, -7974, -1906, 664, 834, 166, -1015, 2696, 2065, -3954, -5772, -3404, -4398, -5747, -5119, -6013, -2469, -5080]
10723e080k483Q995J224k820p73N480J356o552m923p573M554M302K48j052N142
10708D5J390r79L05l42k821P469J552o175n22M58K432l798j606m017j859R97M6
10691g425n13m31J250m548n569q53J0519N112K302m630k631J29k388J559N076
10676c041J421k685N36q56N65K622k3Q351m60j773J200k912o942M582l396P4L887
10659A150J35J144j534l435n08Q069J309j788m152j398o57j279J519k560q54l217
10643h056o15J59r71j202K223k68N835M232K804M184k910j1129o122J027N085
10628e724N802J88J511j321m605j858N599l242J584K25m309o57J511n38L701n81
10612b714M845K461k565k557J309O52K667J273m080K061J340l211k592j062r84
$$ y = [-5080, -7563, 1432, 2656, -164, -937, 4543, 5899, -653, -5576, -13149, -8595, -4293, -4045, -5097, 45, 1435, 456, 761, 419, -2402, 5067, 6619, 444, -78, 380, 2812, -986, -2592, -6609, -8468, -7471, -7425, -7938, -8369, -7119, -11667, -17236, -18089, -7570, -2458, -156, -4786, -7417, -7288, -9676, -8117, -3041, -1620, -4305, -3769, -4625, -4060, -1438, -1461, 6890, 6430, 4657, 5857, 2945, -3997, 585, -2811, -2737, 1150, 1285, 2429, 895, -2540, -3048, 5021, 6330, 4542, 390, -1008, -1665, -2944, -1425, -3985, -4839, -8056, -8671, -8512, -9483, -10685, -8462, -8730, -2895, 1337, 4141, 8325, 5415, -5714, -11836, -10809, -5724, 78, 266, 1777, 456, -4149, -6007, -408, -3650, -2066, -1841, -6150, -6807, -5296, -5834, -2133, -2714, 2131, 4592, 2027, -530, 779, 1431, 4098, 5371, 1291, 3352, 4692, 1481, -1111, -2173, -3157]
10597c157K084m005m263N070L709M930j873j774M489N14m814n616J616M89j459
10582d060N41L762k008l607J547J495K179p353m180N288M107j997J9K363l842
10567e746n46K083p87K432L687m961n83J023J837j441k305l342R309M744N19p181
10551a258n415J92M942N161K658k510J328k989J255j652K790j423o500o130L431
10536f120L469N743j670l825j317Q877L072l425p884k258K426K109N322M679j726
10521G472j303k459R39K763j121l112k775J735n031K627p28j610j703j921M432
10506a795N43J321m137n970M86L808L655K149K824O57k12O55o9l294J329k660
10490g10k257J0927r01j1914l473R041Q202M355L98m880L520l112n119j133q09
$$ y = [-3157, -1073, -5078, -9341, -4271, -562, 4368, 2495, 721, 5210, 5724, 910, -4706, -3090, -2601, -4060, -3519, 243, -1765, -5372, -3825, -2330, -151, -7504, -11684, -6396, -2289, -4286, -4267, -1904, -5746, -6292, -4209, -4996, -2564, 1123, -3838, -4421, -3398, -1561, -3002, -5307, -8649, 660, 5404, 5923, -1258, -6673, -6481, -1539, 3622, 6280, 3770, 5098, 2109, 3364, 1712, 4502, 3079, -3421, -9551, -6120, -2651, 3092, 1422, -2403, -3720, 5157, 8229, 4804, -3080, -5338, -2912, -803, 4519, 9198, 7472, 6169, 3710, 4649, 7412, 6291, 3179, 404, 2139, -2892, -265, -993, -2603, -4306, -6227, -1795, -1252, 69, -4068, -10038, -9552, -5744, -2089, 60, 2884, 3541, 3329, 3984, 3915, 621, 1950, -710, -2967, 7960, 7059, -4855, -8328, 713, 8915, 13270, 13668, 8788, 12308, 9196, 4077, 2944, 2135]
10475B135L71m510m019M55N669L689J239m73k172L191m000J693J394l720r21N843
10459E864Q57j885P19k344N108M249K156k798n360k422l830K269L124L777k406
10444G078Q49j13k849K461K047O291l793n776L3n776m004k156N06N321r58k424
10428c263m367o44M266P594K952o350L215P523L465k475j30K161l552O27m327
10413F695l539J681N562R856k408o074k093m47l601K598j067Q78r37L23P49n186
10397B990j862P604j404r29K309m879m305L87L024K526j715L853m078l617j805
10382a901P93J906o024k995j401L018k514j84r17M06M139J110n743K96R909M216
10366D114N69o10j01R098j340m525j0042M924o26l089l736J409P8l936L000P37
$$ y = [2135, 2506, -2004, -6023, -5568, 101, 3790, 5029, 4556, 2384, 5575, 1575, 3268, 4662, 942, 21, 5864, 6721, 4836, 5555, 3211, 8319, 12568, 14724, 11926, 6566, 4144, 314, 2583, 5707, 9484, 7078, 7927, 7814, 4965, 7426, 9473, 15764, 11971, 6195, 6228, 452, -3552, -5708, -5202, 119, -839, -3263, -7630, -8274, -4008, 3586, 6538, 188, 3403, 10926, 14391, 11916, 11786, 13947, 10395, 11022, 6695, 3156, 4837, 10399, 20255, 17847, 11773, 9680, 9233, 5632, 8230, 7163, 8041, 7104, 7427, 8176, 2990, 1128, 8732, 7328, 6399, 8708, 3829, -476, -89, 2935, 5461, 3746, 7599, 3521, -96, -1901, -1108, 798, -5226, -8221, -9622, -6604, -9118, -9302, -10219, -9813, -5674, -4564, -10307, -10011, -102, 4114, 4683, 4073, 3972, 13070, 11730, 7205, -2837, 2087, 1461, -1628, -5364, -3955, -3877, -7813, -4813, -4076]
10350d076J977k545n205o71O893M660N69L844k119k547M49o351q776L845J3156
10335C103N612j460l819p247m465M860R649K318p20l308p03n006o740m597j440
10320a3963R569L887j142j138J072N537N892k473o119J888N901r816q033J204
10306g734Q219K915k120o53k43J910M656j571J612k27k481l369m998n132n237
10291a4453L589O347j467K296J540J23q22k423J599O075J264Q142K747L301R52
10276A8810p636L783O699O313L601m888O47n41j884l798n980j3336K746J2232
10262A6768L704q081J020K695o423m181L765R01J239J524m093l427K10k010l699
10247h8L099J108l705J169M213m37m22N75J530J695l61k701M903N331R65N081
$$ y = [-4076, -2099, -4644, -9849, -10520, -3627, 1033, 1602, 5446, 3327, 780, 1229, -5122, -13898, -10053, 3103, 8715, 7255, 3436, -3811, -8276, -3416, 6233, 8551, 7831, 4523, 3820, -1186, -7926, -12523, -13963, -4394, -507, -1649, -2787, -1715, 3822, 9714, 7241, 1122, 3010, 8911, -905, -8938, -7734, 485, 3400, 1280, 627, 384, 2294, 6950, 5379, 6991, 6764, 4283, 914, -4084, -9216, -14453, -10864, -4517, -5984, -3688, -2148, -2025, -2847, -5270, -3671, 2404, 3668, 11810, 14557, 17858, 18810, 11174, 14957, 21656, 27969, 31570, 26682, 27329, 26788, 24904, 21106, 15126, 1790, 4536, 16768, 20472, 12391, 13411, 16106, 9683, 5502, 9267, 10168, 11407, 12931, 8838, 5411, 5621, 3611, -88, 3011, 4119, 414, 1583, 5796, 5359, 4937, 5512, 7042, 8737, 8376, 5675, 10578, 15909, 16874, 21955]
10231B1955r38L616M329j344N08L51k22M20J076N069L561j499n67J680M062R114
10215E1171J1342P492o487j4622r746J723L09k971m474p436p389j877j801M573
10201A9807R24k55p890J372k310j266K782K028N406o63n414j622J198l976j059
10186I062m55K852N560N724n82m018n841K139K338k600m305j982k696M52M29L101
10170I178l245l293Q876M430O48j878m987q943o722J245m560M675P16K57M01m827
10154h029L449O753L254j27N325J203o273M32m057j894j137R79N846l082l202
10139e60j273P074l048l557M914O89l151O995L726n25J026n505l057O08J093K299
10123G748Q07n13R82m356j76l325p68K939L093r22m061j141q54L341K173m751
$$ y = [21955, 21017, 24633, 28962, 27618, 28126, 28477, 28255, 28675, 29751, 34820, 38381, 36882, 36315, 37995, 42057, 51171, 62513, 70005, 63518, 48896, 39150, 40873, 41182, 38211, 33737, 26301, 18912, 17035, 15234, 19807, 20731, 20476, 12586, 13958, 11648, 10382, 13164, 15192, 20598, 19935, 14521, 12899, 14097, 10121, 9062, 8607, 11459, 17019, 22743, 22161, 18143, 12302, 14441, 16779, 14179, 9874, 7892, 5196, 5648, 6077, 9178, 5933, 2640, 11516, 15946, 16594, 14716, 9729, 786, -5936, -4691, -9251, -4576, -3860, -3603, -3202, -8029, -4580, 2173, 5427, 5300, 10625, 11828, 5555, 5987, 1930, 36, -1101, -122, 5724, 2642, -560, -1833, 5241, 2193, -1364, 3550, 4239, 1088, 8083, 11809, 11284, 12310, 6805, 3748, 4356, 5449, 7748, 8555, 8042, 9024, 4668, 4492, 1167, 399, 3338, 6431, 5509, 1448, 307, -547, 2794, 4967, 216]
10107B16P32m21M16J6p52M116n967L120Q183K373K729n00j451o03k705l777L218
10090H943l518J337l762r01J490J770j474J0184M455q951q568K476K04n370k461
10075d146J863j392N705q18p881n865J1774J2475O358M181k511m296j558k050
10061A1839L200M392q10n481o875o901Q17N943N442L972L6K106J268l969n715
10046I264N13L61k502J217j489j535N271K347Q96q1l352p164M893P33J078m671
10030E779n800l617l50k542M101J61J414K407K34k567l770O52J1209K683l428
10015F566o999L13K256K002J836m880l947N528O672L496k612p39m069P6M304P64
9999A0567l606M729P030O393O799M202l341p381q039p123j290J848J388M625o344
$$ y = [216, 948, 527, 943, 959, 207, 4323, -1644, 1476, 9659, 12032, 14761, 14261, 12810, 12207, 9502, 5725, 8943, 5425, 6762, 3000, 2099, 3589, 5359, 3885, 14069, 18524, 9573, 1005, 3481, 3685, -1685, -4146, -2283, -3675, 2030, 1212, -6669, -12534, -760, 11715, 18073, 22254, 19743, 15447, 13889, 11839, 15039, 19431, 18621, 13140, 6265, -636, 181, 6124, 11566, 15538, 15574, 17680, 18948, 14979, 9264, 9777, 10138, 7636, 8853, 7364, 5829, 11100, 13447, 14343, 14262, 10910, 3746, 8639, 9372, 10450, 5779, -21, -3638, -3988, -6530, -2429, -2268, -854, 1553, 1787, -780, -4550, -3898, 7311, 9994, 6566, -433, -120, 2136, 4138, 5974, 1094, -2853, 2675, 9347, 12843, 10231, 9492, 5423, 5499, 9803, 10567, 6961, 11690, 18720, 25113, 31912, 36114, 32773, 25392, 17353, 10230, 8940, 10788, 12176, 16801, 10457]
9984A0457l6Q248m263l105J806L881J3287J1105K099q93r435j7265k933N319K780
9969B1052J778p790m770N478l74j4J712N0k846k982r569m279L003O880O952k152
9953A2129k781n958J585q37m3j49J945L102J105Q88k842l18N468N888O105N484
9937C0771L215j879j6730n078l509L990J589O688n79N7N667O845L212J914k668
9922C3505o160p485n520j0304m549O652J701l836N795K221K650P32K851n976m842
9907G435L074J454K260J725M454n059l062m758L825j56M367O022n806M277P447
9892B7499M465K089p478j605k858K715R951L882Q96p947O08j006Q758O018m36
9877D5551j946k207P41K603O461O15p92J946l475m502Q528R762K628m954q442
$$ y = [10457, 10421, 18669, 14406, 11301, 13107, 16988, 30275, 41380, 43479, 42586, 33151, 15886, 12953, 18272, 21052, 22830, 15040, 10270, 15748, 15374, 15360, 17072, 17122, 14276, 11294, 1725, -2554, 449, 7329, 14281, 12129, 9348, 3390, 4975, 4138, 4095, 3946, 5891, 8993, 10098, 10986, 8144, 7826, 13294, 19182, 25287, 30771, 33986, 32107, 15377, 10299, 6790, 10780, 12369, 19057, 18478, 18535, 24202, 31047, 34259, 36173, 33505, 27345, 19860, 14340, 4036, -513, 6139, 7840, 4004, 9799, 12020, 14670, 15402, 18253, 12277, 7435, 10509, 11963, 14223, 15948, 20402, 15343, 12281, 7523, 11348, 11192, 15559, 21581, 15775, 20052, 27499, 31964, 34053, 26575, 24970, 22112, 24827, 34778, 38660, 39556, 31609, 32217, 31211, 39969, 45987, 45551, 43605, 41398, 42139, 44742, 51203, 51818, 51026, 52972, 49497, 44995, 53523, 63285, 65913, 60959, 52517]
9862E2517M442O009j369K027K924N33O6N785J382K161N669L389N239Q111J467
9847A00352J971R710J3417R961K435j074N993J1807J5436J8386J0849K0055K1508
9834B40806K5852L0190L7584M3683N4602N2774M3277M4776N2537N8168P0999P9132
9822H34380R7735J26477J60273K09946K86091L77784M88385O58028Q89815J162456
9812E291370J529665J988922K230499R79926j936848k724965j831192j089759
9804D437618p68854o67564n83982m56671l33397k35527j69462j30442r4028p3483
9794I24208n7467l8684l1724k7446j6587q360q449j2891k0612j9102j6419p390
9782F59077j803O698k065j1869k8111l7680l1806l7708l5851k7732k8334k6198
$$ y = [52517, 56959, 62968, 61599, 63626, 66550, 67083, 67149, 72934, 74316, 76477, 82146, 85535, 90774, 98885, 100352, 102323, 112033, 125450, 135411, 137846, 136772, 142765, 154572, 170008, 188394, 199243, 219298, 240806, 266658, 296848, 334432, 378115, 432717, 485491, 528768, 573544, 626081, 684249, 755248, 834380, 932115, 1058592, 1218865, 1428811, 1714902, 2092686, 2581071, 3239099, 4128914, 5291370, 6821035, 8809957, 11040456, 12020382, 10083534, 7358569, 5527377, 4437618, 3668764, 3001200, 2417218, 1960547, 1627150, 1391623, 1222161, 1091719, 997691, 924208, 866741, 828057, 796333, 768887, 752300, 743940, 735491, 722600, 701988, 682886, 666467, 659077, 657274, 663972, 661907, 650038, 621927, 584247, 552441, 514733, 478882, 451150, 422816, 396618]
9770C96618k6496k3748j4837r960r759j1483j2825k0787k6335j9391r732j2186
9758A99079j0053j0363m478p782m265m604p566r428p320J037K173r058k1106j7415
9744H8851m024K049j24m735q521k95j04J943j224O106J2384M213m535j1821p644
9729G2519m838J933l892r778j0776L796J08p449J128J64o801k648m80k198K478
9714C3266k75k16J559J427m530M22m79m689K069L846J369j367j550j00m372k429
9698B3951J0932p37J014O967O49q13N930M898R04K576K803r920r640j137l875
9683C4502p157p57k388K084k005l829M478j836o934k681J462J763K387j972k699
9668A4418N71k63J241j322L867N28Q167L099l77n276k519k637k376K454K288N138
$$ y = [396618, 370122, 346374, 331537, 321577, 311818, 300335, 287510, 266723, 240388, 220997, 211265, 199079, 189026, 178663, 174185, 166403, 162138, 157534, 149968, 140540, 133220, 134257, 136430, 127372, 106266, 88851, 84827, 86876, 86752, 82017, 73496, 73201, 73097, 75040, 73816, 79922, 92306, 96519, 91984, 80163, 72519, 67681, 69614, 65722, 55944, 45168, 48964, 49072, 41623, 42751, 42915, 36114, 33466, 32986, 30788, 33266, 32991, 32775, 34334, 35761, 31231, 31653, 31174, 26485, 28554, 32400, 33769, 32402, 30852, 30752, 26380, 23951, 34883, 34146, 35160, 42127, 42776, 41963, 47893, 52791, 53695, 56271, 59074, 49154, 39514, 38377, 34502, 27345, 26588, 24200, 26284, 24279, 20450, 24928, 23092, 16158, 13477, 14939, 16702, 19089, 17117, 14418, 14989, 14726, 15967, 14645, 18512, 19040, 27207, 30306, 29929, 24653, 22134, 19497, 17121, 19575, 21863, 27001]
9652B7001L288K182j249l870m716j039M763j071k826N36M03M031L022l722n538
9637B1195K234L90l627J95J746l925P74P097M195J259N4N068K1l574L52j253n019
9620B7182O73L106l05m434K233J802l977j262o899q104L964M17O941O268o905
9605B0700n295j054R66K299j576j535J317M27j356o085J16N512P197K471j553
9590B2551k608L780m08j101J279K95L624J254k401P65j177Q15k466j629L25q427
9574A4471l114M673M89l175L147o95J225j037R36L128J586j267j198j817K73J0613
9558B8238J699j1508r741J053M542M116P16K537O574M984J428j378o75M339n047
9543C1877k660N39n218p944n07L127N621M171L351r466o941j182j004p22L364
$$ y = [27001, 30289, 32471, 31222, 27352, 22636, 21597, 26360, 25289, 22463, 22999, 23402, 27433, 30455, 26733, 21195, 23429, 23819, 20192, 20387, 22133, 18208, 18982, 26079, 30274, 31533, 31587, 36655, 36676, 33102, 33454, 32201, 27182, 27855, 30961, 30656, 26222, 28455, 30257, 26280, 25018, 18119, 10015, 13979, 14396, 21337, 27605, 20700, 15405, 14351, 15317, 17616, 16040, 14505, 15822, 16249, 14893, 8808, 8924, 14436, 21633, 24104, 22551, 19943, 23723, 23315, 22214, 23493, 23788, 27412, 28666, 26265, 27030, 25853, 26668, 24202, 22573, 22898, 14471, 11357, 16030, 16519, 13344, 16491, 15796, 17021, 15984, 16920, 20048, 21634, 20367, 19169, 17352, 17625, 28238, 29937, 18429, 8688, 9741, 14283, 18399, 19115, 21652, 28226, 33210, 34638, 33260, 32585, 36924, 31877, 29217, 29756, 24538, 16594, 16087, 19214, 24835, 29006, 32357, 22891, 15950, 14768, 13764, 13042, 16406]
9528A6406l41M020o285J972L439J860j607K938K762j89m341L780m725q875M33
9513A1247M388K349p08P83m449j804L500N199L363o1j410j124n40K080K389n65
9497B4637L759n63n387l419l58P42j94K48J186o813N31K368N98Q16q77R56l095
9480A5135O10J062n19j389M522l114n30q17M359L683K719j045p160n549l819l502
9464D646J658O620L029L718O61r73q97l364j64k057l144m84J804M292K377M45
9448A8167Q56j252L149O139n06n022k93K702l41k731n102k075k434N19Q339J137
9432B1252k375K610O20k274K187l744M091R477l876j465l1J089q43L172o86l577
9416B5627q909j795M132p97Q650R117Q41o34J772L152N858R15O509K391L320M894
$$ y = [16406, 16065, 20085, 13800, 15772, 19211, 21071, 19464, 22402, 25164, 24975, 20634, 24414, 19689, 10814, 11247, 15635, 17984, 17276, 18059, 13610, 11806, 15306, 20505, 23868, 23807, 22397, 21273, 20733, 22813, 25202, 24637, 28396, 27833, 22446, 19027, 18669, 19411, 19217, 19465, 20651, 13838, 14369, 16737, 17335, 18151, 17274, 18230, 15135, 15745, 16807, 16288, 14899, 19421, 16307, 15777, 14960, 19319, 23002, 25721, 24676, 17516, 11967, 8148, 4646, 6304, 12924, 15953, 19671, 20332, 19359, 18462, 15098, 14934, 12877, 9733, 9249, 11053, 15345, 17722, 18167, 19023, 17771, 20920, 27059, 26553, 21531, 21238, 23940, 23599, 20868, 15766, 13691, 11257, 11776, 20115, 21252, 18877, 21487, 22107, 19833, 22020, 18276, 22367, 31844, 27968, 26503, 26472, 27561, 26718, 29890, 29204, 25627, 16718, 14923, 19055, 18258, 26908, 36025, 36866, 36232, 38004, 41156, 47014, 47929, 54438, 56829, 60149, 65043]
9400F5043M339J0491O317j1834j8875p259j289l663m224q99m188n354k912O440
9386C2133j919q078o52O456K605L600p78l297R75J398J341l397k259o561q36L114
9370B3845P535k538k040l709L0j346n077J095L724j318o56p70Q83j78m62j913
9354A7105L013k635k593M143P670L656J854N352M552n592m409j038l558m999J546
9339B4067j106J435J455M39k572m93L556p60R90J423k665m776L27K657j530N373
9323B7820K931j98L575m383k222K053J504k326L620l241q49K009j21r94j263n166
9307B2749R12M591O884l726R45L291l396k494N553P275M914J140m566m91M203
9292D7784k730l467j416m621j194N070j548J105K860j290n918L52O436P033N266
$$ y = [65043, 69382, 79873, 86190, 74356, 55481, 48222, 46933, 43270, 39046, 38147, 33959, 28605, 25693, 32133, 30214, 22136, 21484, 27940, 30545, 34145, 33367, 30070, 31045, 32443, 33784, 30387, 28128, 21567, 20731, 23845, 31380, 28842, 26802, 23093, 23123, 21777, 16700, 17795, 21519, 20201, 19545, 18775, 19658, 19480, 19018, 17105, 20118, 17483, 14890, 19033, 26703, 30359, 32213, 37565, 42117, 36525, 32116, 31078, 27520, 22521, 24067, 22961, 24396, 25851, 26290, 23718, 23225, 26781, 26021, 27011, 28434, 25769, 20993, 21320, 23977, 22447, 27820, 30751, 30553, 34128, 29745, 27523, 29576, 31080, 28754, 32374, 29133, 28284, 30293, 30172, 29178, 27915, 22749, 23661, 28252, 35136, 31410, 32355, 35646, 32250, 29756, 35309, 42584, 47498, 48638, 44072, 43581, 47784, 45054, 41587, 40171, 35550, 34356, 39426, 37878, 38983, 41843, 40553, 34635, 34987, 41423, 48456, 53722]
9277E3722l35l865k753m841n616l663n421o239j798j569K142L589R413l395l127
9262B6244J236Q406L752k382j158J590n83L496J456q93M40L102Q599J2616J146
9247F7067m414l052k948o48j917k096m075m788k09m912n898q24Q209O877l893
9232D2479p5O469k030m18k172p23M8k281l476L432O933N469M623L237o843m810
9216D9862o818l449Q851J1333O185J3123R028O980J0303J2486R372J0889J1764
9203A49909N818J0249J4498J7768L0346M2064N3552O8597Q0681J01295J36940
9192G11717J62579J07427n8058j85175j72905j07093p2627n6781l8303l6188k6820
9181B27773k0543j6138k89k341r447o804o16r92M94J710o001k768N935Q833L294
$$ y = [53722, 53387, 49522, 46769, 41928, 36312, 32649, 27228, 20989, 19191, 17622, 19764, 23353, 32766, 29371, 26244, 27480, 35886, 39638, 37256, 36098, 37688, 37105, 40601, 42057, 41164, 41604, 44706, 53305, 65921, 67067, 62653, 59601, 56653, 56005, 54088, 51992, 47917, 43129, 42920, 38008, 32110, 31286, 39495, 46372, 42479, 42404, 48873, 46843, 46425, 44253, 43530, 43578, 41297, 37821, 41253, 48186, 53655, 58278, 61515, 54672, 49862, 43044, 39595, 48446, 59779, 65964, 79087, 88115, 95095, 105398, 117884, 127256, 138145, 149909, 155727, 165976, 180474, 198242, 228588, 270652, 324204, 392801, 473482, 574777, 711717, 874296, 981723, 923665, 738490, 565585, 458492, 385865, 329084, 290781, 254593, 227773, 207230, 191092, 190803, 188462, 179015, 172211, 171595, 170603, 171097, 172807, 166806, 164038, 169973, 178806, 182100]
9166A82100N801J0832J5495J2833J1971J7553J1702M906J1030J6655K6765L5877
9154C63520M6784O9548R5328J19617J52806J97660K60874L28844K92232k3925
9144A903288l59808l59537k48253j61643j18184r7564q3016n8677n0893l4517
9134C31196k5404j4584j3838j4669o775r72n282j4285j0313q63m455q779K071
9121B13048M305L864J2781O338J407J1187N60j150P909K818M447J3249K6837L7994
9107C45594M1617N6632P4390R3287J18463J47859J37563J7442j46138j93231j43868
9096E49610q7982n7535n1865n0656l5813k3093k3635k3026j5725q163M008N343
9084A81468R68p394j1902n035J406o224r353k198l049j084J68K730N692Q150R410
$$ y = [182100, 187901, 198733, 214228, 227061, 239032, 256585, 268287, 273193, 284223, 300878, 327643, 363520, 410304, 479852, 575180, 694797, 847603, 1045263, 1306137, 1634981, 1927213, 1903288, 1543480, 1183943, 935690, 774047, 655863, 558299, 475283, 416606, 365713, 331196, 305792, 291208, 277370, 262701, 255926, 254954, 249672, 235387, 225074, 224211, 219756, 210977, 213048, 217353, 221217, 233998, 240336, 241743, 252930, 253490, 252340, 260249, 263067, 267514, 280763, 307600, 345594, 387211, 443843, 518233, 611520, 729983, 877842, 1015405, 1032847, 886709, 693478, 549610, 461628, 404093, 352228, 301572, 265759, 242666, 219031, 196005, 180280, 172117, 176125, 181468, 182436, 175042, 163140, 158105, 159511, 153287, 143934, 141736, 138687, 137603, 137771, 140501, 146193, 154343, 163753]
9069A63753M57k484n450J949r939N13J428q818k375J5117J7143J3635M477n374
9055A84032j3085q590q117j420R352J5696J2765O090K162J4303J9074P374q400
9042B31236o407j0964j5622m031n366j5584r050q362p246j25l839l071p480n114
9028A28975l419J518M32N131M09j670j58n02j998O09M801P236L056L071O867J2666
9012A67024J6230M398N03R955Q352M810J1391K3952L2430L2602K3319L6394L1863
8999D03223K0359l266m590j4222l1804l8386l7282k6319j9235j8884j4126r363
8987B06105l836p691p046o950n399n891j1039j1038j835m829j2680j7244j1555
8974I9072l039j756l340N620R638N838Q950J1265J2578R265P977O910J5977O020
$$ y = [163753, 164210, 161726, 156276, 158225, 148286, 148799, 150227, 141409, 139034, 154151, 171294, 184929, 189406, 184032, 170947, 162357, 154240, 152820, 162172, 177868, 190633, 196723, 198885, 213188, 232262, 239636, 231236, 224829, 213865, 198243, 194212, 188846, 173262, 164212, 155850, 148604, 148479, 144640, 141569, 134089, 128975, 125556, 127074, 127506, 132637, 133046, 131376, 131218, 130716, 128718, 129327, 134128, 141364, 144420, 147491, 154358, 167024, 183254, 187652, 188155, 198110, 206462, 211272, 222663, 246615, 279045, 311647, 334966, 371360, 403223, 423582, 420316, 415726, 401504, 369700, 331314, 294032, 267713, 248478, 229594, 215468, 206105, 202269, 194578, 187532, 180582, 175183, 169292, 158253, 147215, 145380, 140551, 127871, 110627, 99072, 96033, 94277, 90937, 96557, 106195, 112033, 120983, 132248, 144826, 154091, 162068, 168978, 184955, 190975]
8960A90975O637J8133L0815K4107J5043J5489K0596J1505m946n47k2682l5954
8948B69171l0859k2097n091Q87L995L613l449k468K566j48R815M612n996m405
8934B20146N061m054j6368j6066o225o911j809P097K2632K4687L9898M7828L8049
8921C53965K0935J8012K7428L7011l6912j24668n4395o667n529j20Q428K5N123
8908B42636P952M510K517q693j2237l820P386K0414K8246J6124J3471J6779J1982
8895C47267J3332K0195J2623K5570L4839K5774J9035K8135K5989J5583L034j1967
8883E59409M67K6456L5047N1192P5180R3453Q0964N1678K5307K6608P3991l6490
8871A063262k68046j06898Q317m986J2983J3643J5679J6710J5120K0736K9626
$$ y = [190975, 197612, 215745, 246560, 270667, 285710, 301199, 321795, 333300, 328354, 327807, 305125, 269171, 238312, 216215, 211124, 212011, 216006, 219619, 216170, 213702, 216268, 216120, 225935, 230547, 224551, 220146, 225207, 221153, 204785, 188719, 182494, 175583, 173774, 180871, 203503, 228190, 268088, 315916, 353965, 374900, 392912, 420340, 457351, 420439, 295771, 241376, 234709, 229180, 229060, 237488, 237513, 242636, 250588, 255098, 257615, 248922, 236685, 232865, 240251, 260665, 288911, 305035, 318506, 335285, 347267, 360599, 380794, 393417, 418987, 453826, 479600, 498635, 526770, 552759, 568342, 571376, 559409, 559876, 586332, 621379, 672571, 747751, 841204, 922168, 973846, 999153, 1025761, 1099752, 1063262, 795216, 688318, 696635, 691649, 704632, 718275, 733954, 750664, 765784, 786520, 816146]
8860H16146J9706R359J5779L5004L8578L8134M6007N6419O1338O0822P2670P4493
8848A344455P3920P9047Q6534O5725J6102q592K647K7914K8478J4637K9696N7516
8836A818079O5748P6304Q3820Q0599R8077J22387J23189J22925J43207J32183
8826B866518M4251Q3943J71858K14559K63642K99460L47424M03190M25215L46636
8816E466696K00729J92866K94216M24845N60240O86711Q00538R11815J009673
8807A0548329J114234J253814J436689J667581J897609K135477K629111L384750
8799B6067594M374435N805962P723826J0373114J3787245J7809130K3024886K8605376
8791A37571568K8508479P408910k7136382l5868559k5322929j5737214j1323102
$$ y = [816146, 835852, 845211, 860990, 895994, 934572, 972706, 1018713, 1075132, 1136470, 1197292, 1269962, 1344455, 1418375, 1497422, 1583956, 1649681, 1665783, 1657191, 1659838, 1687752, 1716230, 1730867, 1760563, 1818079, 1883827, 1960131, 2043951, 2124550, 2222627, 2345014, 2468203, 2591128, 2734335, 2866518, 2910769, 2994712, 3166570, 3381129, 3644771, 3944231, 4291655, 4694845, 5120060, 5466696, 5667425, 5860291, 6154507, 6579352, 7139592, 7826303, 8626841, 9538656, 10548329, 11662563, 12916377, 14353066, 16020647, 17918256, 20053733, 22682844, 26067594, 30442029, 36247991, 43971817, 54344931, 68132176, 85941306, 108966192, 137571568, 166080047, 173488957, 146352575, 110484016, 85161087, 69423873, 58100771]
8784E8100771r721266q314242o441250m583729l176257k212366j504134r26887
8776B1220640m55402j55219m1708M8842M2717j85706j60237J41761M75320P73273
8766B1704281J075193J366595J653133J902274K108642K230428K307804K567526
8758C6915876K944372L317412M154905N599778P648060J0416266J3909895J8730704
8750A03637268K5183686L2550372M2118964N3696370N9071802K7158272m6141340
8743B97275394p2441398n3193298l2811907k2946715j9751105j7379429j3864041
8736F4887501j0132569p232481n235007l815021k742394j885355j355679j288985
8728C1200010j282084j083009r50594q20338n97762l48796r3555J57748L96858
$$ y = [58100771, 48379505, 40065263, 33624013, 29040284, 25864027, 23651661, 22147527, 21220640, 20765238, 20610019, 20568311, 20617153, 20659870, 20474164, 20313927, 20455688, 20931008, 21704281, 22779474, 24146069, 25799202, 27701476, 29810118, 32040546, 34348350, 36915876, 39860248, 43177660, 47332565, 52932343, 60580403, 70996669, 84906564, 103637268, 128820954, 161371326, 203490290, 257186660, 316258462, 343416734, 297275394, 224833996, 171640698, 138828791, 115882076, 96130971, 78751542, 64887501, 54754932, 47522451, 42287444, 38472423, 35730029, 33844674, 32488995, 31200010, 29917926, 28834917, 27884323, 27063985, 26466223, 26117427, 26023872, 26181620, 26578478]
8719B6578478O53497R12781J113269J069613P37129N41189N83391P66798J131686
8710C4087831J782212K752149M070593N734326P956474J0992584J4606740J9064354
8702A01047263K4671642K8426667J9080118j3170681l5120910k9810297j8927518
8695G6196284j2634376j0309058r096575p496150n646145m111350l033346k273890
8687B1595394j741296j299326r83304q93817r23976q42232p08244n82192n01293
8678A3119714m37617l76049l06105k30884j46276n7353J6906o100k00051m06773
8668A0969412n35324n73207n59597n45586n15364m79715m72300m22122l78764
8659F487433l70123l48147k97076k64071k53821k45710k51738k60001k37806k08310
$$ y = [26578478, 27231975, 28144756, 29258025, 30327638, 31064767, 31605956, 32189347, 32956145, 34087831, 35870043, 38622192, 42692785, 48427111, 56383585, 67376169, 81982909, 101047263, 125718905, 154145572, 173225690, 160055009, 124934099, 95123802, 76196284, 63561908, 53252850, 44156275, 36660125, 31013980, 26902630, 23869284, 21595394, 19854098, 18554772, 17571468, 16677651, 15753675, 14911443, 14203199, 13621007, 13119714, 12682097, 12306048, 11999943, 11769059, 11622783, 11565430, 11582336, 11576236, 11376185, 10969412, 10434088, 9860881, 9301284, 8755698, 8240334, 7760619, 7288319, 6866197, 6487433, 6117310, 5769163, 5472087, 5208016, 4954195, 4708485, 4456747, 4196746, 3958940, 3750630]
8649C750630j76374j68332j58143j45432j36147j23882j17169j16598j06396r0207
8639B411950o8152o4361n9220n6856n2303m5153l9031m4596m5437k7100o178N919
8627A909482q654k7286l7568l5038m3627o5257q0726r1378p8478n1366q4078n7817
8615A248209m5555p7532o8710n8958l2788j5095j3797j5988j7010k5636l5534
8604H41606l0728k0505k0549r863n952o80O746j325n85K147N151J2964J8140L3203
8590H29770L7754L4037J8612P196J7907L6748O1137O2383R295l5282m0076k6012
8578A013469k2071j9591l1846n0670m1350k0401j6426j9027n109k0953k0062r940
8566G36023o550P31j93k531m233j3321j8216k7160k8396q794n087q150j4034p658
$$ y = [3750630, 3574256, 3405924, 3247781, 3102349, 2966202, 2842320, 2725151, 2608553, 2502157, 2411950, 2343798, 2279437, 2220217, 2163361, 2111058, 2065905, 2026874, 1982278, 1936841, 1909741, 1903563, 1909482, 1900828, 1873542, 1835974, 1800936, 1757309, 1692052, 1611326, 1519948, 1441470, 1390104, 1306026, 1248209, 1202654, 1125122, 1056412, 997454, 964666, 949571, 935774, 919786, 902776, 877140, 841606, 810878, 790373, 769824, 759961, 754009, 753329, 760075, 758750, 758165, 760312, 765463, 778427, 796567, 829770, 867524, 901561, 920173, 927369, 945276, 982024, 1043161, 1105544, 1114839, 1079557, 1039481, 1013469, 991398, 971807, 939961, 889291, 847941, 827540, 811114, 792087, 786978, 766025, 745963, 736023, 729473, 730204, 730011, 727480, 723247, 709926, 691710, 664550, 636154, 627360, 622273, 614123, 600089, 592431]
8552E92431m788k933O81L496J497Q653J2628J1308J2151O499K162M738K319J6636
8538F67478K3906P808k3854l0271k0909k0980o312j0947j0203k050J676j056k041
8525E72245J475j0142p651R30l04m860o55j10n867j1918j0031j9670j8798q321
8511D76323j602r199j3187k061l328J523Q264J2909J9436K0355L0712M5564N1748
8498F37457M9507K206k3510k5266j2020P320J7847J3684J3438L3849M9802M9163
8486H13477N9125N5555O1136N7366L6135M687l8637p7942q5535p3753o4488n8393
8474F88733n3810m5489m3693l2501k7010k2086k6083j3542j3078j1824n222L197
8462C97592l089j597Q909J4472J7975K4016L8474N6589P2249J8432p3470p3313
$$ y = [592431, 587643, 584710, 585391, 588887, 590384, 599037, 611665, 622973, 635124, 641623, 643785, 648523, 650842, 667478, 691384, 699192, 675338, 645067, 624158, 603178, 596866, 585919, 575716, 573666, 575342, 574286, 572245, 573720, 563578, 555927, 556857, 556553, 551693, 551038, 550928, 545061, 533143, 523112, 503442, 484644, 476323, 474721, 465522, 452335, 450274, 446946, 448469, 456733, 469642, 489078, 509433, 540145, 585709, 637457, 686964, 689170, 665660, 640394, 628374, 635694, 653541, 667225, 680663, 714512, 764314, 813477, 872602, 928157, 989293, 1046659, 1082794, 1087481, 1048844, 970902, 885367, 811614, 747126, 688733, 634923, 589434, 545741, 513240, 486230, 464144, 438061, 424519, 411441, 399617, 394395, 397592, 394503, 392906, 401815, 416287, 434262, 458278, 496752, 553341, 625590, 644022, 570552, 497239]
8450D97239m0628k7619k5340k2566j4237k1826j9345j5682q135p26R9q525j2674
8437B80035k0746k0884j9009k4007j3640M499J6651J6384L200o74p88l824K507
8424B19704P972K885m209J016J0002J2469M918n058M632L052J4677J5748Q430
8411B96238K4993L1769J3099k2835l5336k1233p120j014J071j440q086k905J091
8398B68292J422J715Q064J1410O834J4398L1485L1604L8271N5492Q6364J18065
8386F73416J57419J64529P0148j08721j88014j50986r3795o2310o0445n0047l5927
8375C15267k3609j9200j4019q435q957j178j074l572n397p415k753J27j652K242
8361B20375M809j42J3997Q924R863J0173P985J3854K2539J4653N920K3587K6225
$$ y = [497239, 456611, 428992, 403652, 381086, 366849, 345023, 325678, 309996, 301861, 301135, 301234, 292709, 280035, 259289, 238405, 219396, 195389, 181749, 186248, 202899, 219283, 222483, 221809, 221021, 217197, 219704, 227676, 230561, 226352, 227368, 237370, 249839, 254757, 249699, 254331, 257383, 272060, 287808, 296238, 321231, 353000, 366099, 343264, 307928, 286695, 279575, 278561, 279632, 278192, 270106, 267201, 268292, 269714, 271429, 279493, 290903, 297737, 312135, 343620, 375224, 413495, 468987, 555351, 673416, 830835, 995364, 1065512, 956791, 768777, 617791, 523996, 461686, 401241, 351194, 315267, 291658, 272458, 258439, 250004, 241047, 239869, 238795, 235223, 229826, 222411, 219658, 219785, 218133, 220375, 225184, 225042, 239039, 247963, 257826, 267999, 275984, 289838, 312377, 327030, 332950, 356537, 382762]
8348C82762L1682N5078O7948R0522J25518J73896K31007K91848L35633K12638
8338A998532j81695m03339l20487k04717j40883j20706j02801q7121n6352l9107
8328C41324k7049j6340j6050k613j394m149k479j7732j4888j1293l032o059o500
8315B11746k504M476P647Q351M566Q104J7121J2094l09K197R186J1783J6184J7099
8301C27741K3149L2045N4151P4254J05012J29683J50404J12616m3235j75397j70033
8290F20390j17837p5737o0860n3245n0943l4160j5456j5776j5008l903P457m017
8278A80905k282K046n544o986q173R80o661j1943k545j619K241J284K520L806
8264A48029K20q412o934l952p258o925j486J382J098l976o416m907n535o152m119
$$ y = [382762, 414444, 469522, 537470, 627992, 753510, 927406, 1158413, 1450261, 1785894, 1998532, 1816837, 1413498, 1093011, 888294, 747411, 626705, 523904, 436783, 380431, 341324, 314275, 297935, 281885, 279272, 277878, 273729, 271250, 253518, 238630, 227337, 224305, 218246, 211746, 209242, 213718, 221365, 229716, 234282, 242386, 259507, 271601, 271292, 273489, 282675, 294458, 310642, 327741, 350890, 382935, 437086, 511340, 616352, 746035, 896439, 1009055, 965820, 790423, 620390, 502553, 426816, 365956, 312711, 261768, 227608, 212152, 196376, 181368, 177465, 184922, 180905, 178623, 180669, 175125, 168139, 159966, 160946, 154285, 142342, 139797, 138178, 140419, 141703, 144223, 148029, 148249, 139837, 132903, 128951, 121693, 114768, 113282, 114664, 115762, 111786, 105370, 100463, 94928, 88776, 84657]
8249H4657K181J028j138j0100K482M288j0374m508l11K794L506M263R28L275l218
8234G9753J345P253m9m528j962J424J776k039m082j021J001o09J1j084k782m087
8218G0320m528j116p087j1640n083j75M760J290L395j136O853J1450J380p28j1021
8203E6934o004m390j098K243m447j217oP108P859L241O366j225o424j278O21j979
8187E6304O56K296J108K931j281k641L39m149l905M220K251q19K374m379j545
8172E3760R96K078j377q79j476n963q502n38L616N014J136M342J0172k234n722
8157E4423j6245m537P273Q27j209P317n647r36K540Q288O862J90R55P45K852l755
8141E9943k190o81J479L586J375j116K994J181p548l143n083o983m71j864K286
$$ y = [84657, 86838, 87866, 86728, 76628, 79110, 83398, 73024, 68516, 68205, 70999, 74505, 78768, 79696, 82971, 79753, 81098, 88351, 88302, 83774, 81812, 83236, 85012, 82973, 78891, 77870, 78871, 78262, 78273, 77189, 74407, 70320, 65792, 64676, 57589, 45949, 40866, 40691, 45451, 46741, 50136, 49000, 55853, 67303, 68683, 67955, 56934, 50930, 46540, 45442, 47685, 43238, 42021, 42015, 49123, 56982, 60223, 66589, 65364, 58940, 57662, 58283, 56304, 56960, 59256, 60364, 63295, 62014, 59373, 59712, 55563, 51658, 55878, 58129, 57310, 59684, 55305, 53760, 54756, 56834, 55457, 54578, 53102, 47139, 38637, 38099, 41715, 46729, 47865, 52207, 62379, 60145, 54423, 38178, 33641, 40914, 41741, 40532, 47849, 42202, 41266, 43806, 52094, 58956, 59146, 60101, 60846, 63698, 59943, 57753, 57072, 58551, 62137, 63512, 62396, 65390, 66571, 59023, 55880, 50797, 43814, 43343, 41479, 43765]
8126D3765l60J251J044p153l218M879Q855l33o909r36k814K454l942R61j126m276
8110C2142O112J175n805P55l376j988N736N134L841o988k565j581o502K234R48
8095B9272K248K172M347l536m426k117K107O88J355J893q91L925l104N622P980
8080D7535l608m353l270L561M082P1m601l365L141j605l655k53Q29n032N24k654
8064B7347j246K91k4Q92l857Q51O33M457k848J18N103N609K561j822j0063J779
8048B9781j767k017L95k095L291O63K253K001M836r28Q54N209L251n152n213n403
8032B9959k207J031M072K583l105p93L22K036k077L542Q224K976k679m448L532
8017D2968J573J116n232r317n788K013K860J240N765J423l92n863O059O94k868
$$ y = [43765, 43405, 44656, 45700, 38547, 35329, 40208, 49063, 48730, 41821, 40885, 38071, 40525, 36583, 37544, 36418, 32142, 38254, 39429, 33624, 34379, 31003, 29015, 34751, 39885, 43726, 36738, 34173, 32592, 26090, 28324, 29272, 31520, 33692, 38039, 34503, 30077, 27960, 30067, 30755, 32110, 34003, 33112, 37037, 33933, 39555, 47535, 43927, 39574, 36304, 39865, 43947, 44018, 39417, 36052, 39193, 37588, 33933, 33680, 34509, 29477, 30001, 27347, 26101, 26392, 26368, 27260, 23403, 24254, 24887, 29344, 26496, 26614, 31717, 37326, 39887, 38065, 28002, 29781, 28014, 25997, 26392, 24297, 27588, 28251, 30504, 32505, 37341, 36413, 37267, 42476, 45727, 40575, 35362, 29959, 27752, 28783, 32855, 35438, 32333, 31540, 31862, 33898, 31821, 35363, 43587, 46563, 43884, 39436, 42968, 44541, 45657, 40425, 31108, 25320, 27333, 30193, 31433, 37198, 38621, 38229, 32366, 38425, 39119, 36251]
8002C6251l134j82M228k62l047j307j039M329N02o742K857K844j378L061Q104
7987D5085K587j278m73L039m994k38l198K761j103n365L963J541P90l80N83K90
7971D3610L683l85q20k39l686j301k110K214K332j442L333N090o44k222P80N475
7955E3668J638l046n237O212L048l7l907m3r51J24n26R70K179K043k429l968k827
7938D6911K070k604J003Q626L289O526Q548P732N273M828Q751L570k241l383j705
7923I7194m756k190n797n924Q30k29l752j904M771j583n218l767N195K698M707
7908H0275j095K361k528l301J621j676J064O887O924p560l802L311j732M50P7
7893H1276K69K492O002M622K828Q811P294N756J2121R472P051N783K467p167j7383
$$ y = [36251, 33117, 32935, 37163, 36901, 33854, 32547, 31508, 35837, 36339, 29597, 32454, 35298, 33920, 36981, 45085, 47672, 46394, 45921, 48960, 43966, 43728, 40530, 43291, 42188, 36823, 40786, 42327, 43117, 42737, 43320, 43610, 47293, 46908, 46088, 45849, 42163, 40862, 38752, 40966, 43298, 41856, 45189, 50279, 49635, 47413, 48193, 53668, 55306, 52260, 47023, 53235, 56283, 56246, 52339, 52296, 51345, 51469, 50943, 51913, 54092, 56135, 53706, 49738, 46911, 48981, 46377, 47380, 56006, 59295, 65821, 74369, 82101, 87374, 92202, 100953, 104523, 102282, 98899, 97194, 92438, 90248, 84451, 78527, 79357, 79128, 75376, 73472, 78243, 76660, 71442, 67675, 72870, 75568, 80275, 79180, 81541, 79013, 75712, 77333, 75657, 76721, 83608, 90532, 82972, 79170, 82481, 80749, 81199, 81276, 81545, 84037, 90039, 94661, 97489, 106300, 113594, 119350, 131471, 140943, 147994, 153777, 156244, 149077, 131694]
7878A31694j1125o989p165j2860o328p170k166J054k911l709j755l811l403k755
7864F0601K374j52L689J479p91j411k727L167K096m356N410K655L383M594J353
7849H1364k472m701K660J420O282N99J050l192J997J289j726L184j62m402l305
7834G9885n907m028K70J110K462j423p930q883l803m804j130M004o85k785L663
7819E0016k86K693k091n530L126J53n229j792k107j678o43m027l693L474O954
7804C9340O04n16Q473M735j4567r961J838n0j156o498J593M951R067J277r187
7789B9943k720n166l498J434Q84J089k263m80P179Q91J689l048o998M346K802
7774B6084k441K850N06m266l124m73K60M678K299m677k13K023J976J22l24l339
$$ y = [131694, 120569, 113580, 106415, 93555, 87227, 80057, 77891, 78945, 76034, 72325, 70570, 66759, 63356, 60601, 62975, 62823, 66512, 67991, 67200, 65789, 63062, 66229, 68325, 63969, 69379, 72034, 75417, 80011, 81364, 78892, 74191, 76851, 78271, 84553, 85152, 86202, 83010, 85007, 86296, 84570, 87754, 87592, 83190, 79885, 73978, 69950, 70220, 71330, 73792, 72369, 64439, 55556, 51753, 46949, 45819, 49823, 49138, 46353, 50016, 49730, 52423, 50332, 44802, 47928, 48081, 42852, 41060, 38953, 37275, 36632, 32605, 28912, 32386, 39340, 39944, 39428, 47901, 52636, 38069, 28108, 29946, 29896, 28740, 22242, 23835, 28786, 37853, 39130, 29943, 27223, 22057, 18559, 19993, 20877, 21966, 19703, 19223, 26402, 27293, 28982, 25934, 18936, 23282, 26084, 23643, 26493, 26999, 22733, 19609, 19136, 19396, 24074, 26373, 21696, 21483, 23506, 25482, 25604, 25280, 21941]
7758B1941L545J503p209j53l51l918j440j061P73Q557K833m096j100j044J69n508
7742A3441K111p97k159j180M68M11n093L63O41J390k986k44k072K240L051K521
7726A2106J377K61j949n73J08p444j0252K918N944N195j089m669k167M874J138
7711E778m28L449J085j361o29m136m73K11O886M414l409M637M394K40M77o883
7695A4252n904n518j606M453P21J46M43L12Q313K334J702K087K837k73L811J461
7679B9571q92j0488l246l096k599m299K433l447j718j180M221P631r80J507o83
7664A2735k053p165J227k001k081M704R233N566n781o534j921M976K465K088L051
7649A8509j953K904O557O26j2279l773k1o619L259O057P80n965k830l21M20P746
$$ y = [21941, 25486, 26989, 19780, 19627, 19276, 15358, 13918, 12857, 13630, 22187, 25020, 20924, 19824, 18780, 18949, 13441, 15552, 14755, 12596, 11416, 11884, 12295, 7202, 7565, 8206, 9596, 6610, 6366, 4294, 6534, 9585, 12106, 13483, 13744, 11795, 11222, 11330, 3886, -6366, -3448, 2496, 7691, 6602, 1933, -234, 4640, 5778, 5350, 8799, 9884, 8523, 7894, 3758, 3285, 3496, 10382, 14796, 11387, 16024, 20418, 20658, 21135, 14252, 8348, 2830, 1224, 5677, 6398, 6544, 6987, 7299, 15612, 17946, 19648, 21735, 24572, 24299, 28110, 29571, 28679, 18191, 14945, 11849, 9250, 4951, 7384, 3937, 2219, 1039, 5260, 12891, 11911, 13418, 12735, 10682, 3517, 4744, 2743, 662, 5366, 14599, 20165, 14384, 7850, 5929, 10905, 13370, 15458, 18509, 16556, 19460, 26017, 26643, 14364, 10591, 10570, 3951, 7210, 13267, 14047, 8082, 5252, 4931, 5351, 13097]
7633A3097M620m096l444L770n1r687K070R703j277k271P44N41J005l000n095K709
7617I338l564J22K066J886l693r50O806N977p49n979j325J093j794k100l052m940
7601h58k556j308p07M548N249J293k130j016j756J131J172l420k088K970J289
7586A813O030O528p8J263o139m302J536k247N138R27k703j898j739N32j03M342
7570H900K91l872j731J660J600n285k527L635N644N344P88j542j270k797p067
7555A771m364L377j673k169M324J190m675l033K660M808m49L003Q65r60K108L568
7539A0351m923l264K007J623O460j000p699K322L657L509J00M46l112O566P3m003
7523A3113l233k613R80M144l368o482K167J094O81N83L454J274l626K291L173
$$ y = [13097, 17717, 13621, 10177, 13947, 13896, 4209, 6279, 15982, 14705, 12434, 13178, 13719, 14724, 11724, 6629, 9338, 5774, 5896, 7962, 9848, 6155, 5205, 12011, 17988, 17239, 11260, 9935, 11028, 9234, 7134, 4082, -858, -3414, -4722, -5429, -881, 4368, 5661, 3531, 2515, 759, 1890, 3062, -358, -2446, 524, 1813, 7843, 14371, 14293, 15556, 9417, 5115, 6651, 4404, 9542, 10469, 7766, 5868, 4129, 4661, 4558, 8900, 9191, 5319, 3588, 5248, 6848, 1563, -964, 2671, 8315, 13659, 14447, 12905, 11635, 8838, 1771, -2593, 784, -889, -3058, 1266, 2456, -2219, -5252, -2592, 2216, 1767, 4770, 5635, 4675, 6783, 10351, 5428, 2164, 4171, 5794, 12254, 11254, 3555, 5877, 9534, 13043, 13143, 13589, 10477, 17043, 17116, 13113, 9880, 7267, 8247, 12391, 9023, 2541, 4708, 5802, 6483, 7066, 10520, 11794, 8168, 10459, 13632]
7508A3632J320l987p267N640L974l008m705j166M56J287j381n009j118q06P967
7493E829L473j186j825L942p796j9M751N930n795m884l24O015k160J222k701q977
7477d505L899L935J631K823K132j065m368m679Q52K089m104p86m508J650L151
7462a853p180J257R591L727j571o003k28K943k30J832p640q899O177N800K596
7447C19M543M383Q196O92n631p247J232k792K83L461K365m368o754l348o74N808
7431D68P02M512N407k528k882K037M254J878L625j508n699j276K263o864j336
7416C053L419j223L926L013j217m165J459k272l802j021r94k253j938J639M53
7401a923M430k426n91J605M105P51j803l281l102K615o934p093O279R729O086
$$ y = [13632, 14952, 10965, 3698, 9338, 13312, 10304, 5599, 4433, 4889, 6176, 4795, -214, -1332, -2138, 5829, 9302, 8116, 6291, 10233, 2437, 2418, 7169, 13099, 7304, 2420, 2096, 8111, 5951, 7173, 4472, -4505, -606, 3329, 4960, 7783, 9915, 8850, 4482, -197, 655, 2744, -1360, -2146, -6654, -5004, -1853, -9033, -7776, 1815, 5542, 3971, -2032, -2260, 683, 453, 2285, -5355, -14254, -8077, -2277, 319, 4862, 9245, 17441, 18133, 12502, 5255, 6487, 3695, 3978, 7439, 9804, 5436, -1318, -4666, -5340, 468, 1170, 5682, 11089, 8561, 5679, 7716, 11970, 13848, 17473, 15965, 10266, 8990, 11253, 4389, 3053, 6472, 5249, 9175, 12188, 10971, 6806, 8265, 5993, 2191, 1170, 176, -2077, -4015, -2376, -1923, 2507, 81, -510, 1095, 5200, 5951, 4148, 867, -2235, 380, -6554, -13647, -7368, 2361, 8447]
7386H447l26m881m283m928P58l435L05N869N116j562L638m024r19J305m178M238
7370A140P138n583o173m644O77N70K224l251n6K692j934j477J278k853L546J115
7354e591k756j655J94k779J84L588Q389P624j589q41l108j170P865J542j893k239
7338E765k359L490L613n6m854j2025n486J759J830P674K599P42j054j371q68l034
7322c635J575J85j253j913O483N452o542k874M210N427j232p418J066K545J294
7307C370k832j870J831L539J561l590n091k755J635N637M458k884j521K276j725
7292B039J798k436l876o10M354o661k856q57M681N010K582m54L641j290n956J178
7276B87j844n685O33N689M079K46M28l890k251l159M1N396J377J135P915L501
$$ y = [8447, 8121, 3240, -1043, -5971, -5213, -8648, -8343, -2474, 2642, 1080, 4718, 694, -225, 1080, -3098, 1140, 8278, 2695, -3478, -8122, -7445, -6875, -4651, -7902, -7958, -5266, -7200, -8677, -7399, -10252, -6706, -5591, -8347, -10002, -9808, -12587, -12403, -8815, -426, 7198, 5609, 4768, 1660, 490, 8355, 9897, 8004, 5765, 3406, 6896, 10509, 10453, 5599, -6426, -11912, -10153, -8323, -649, 1950, 2692, 1638, 267, -601, -3635, -2060, -1875, -3128, -5041, 1442, 6894, 352, -2522, 1688, 7115, 5883, -1535, -469, 2076, 3370, 538, -1332, 499, 4038, 5599, 2009, -3082, -5837, -4202, 1435, 5893, 3009, 1488, 3764, 2039, 3837, 1401, -2475, -3085, 1269, -5392, -8248, -9105, -4424, 586, 3168, 2714, 6355, 5065, -891, 287, -1557, -7242, -6609, -920, 3159, 3405, 3833, -57, -2308, -5467, -5426, -30, 1347, 2482, 10397, 13898]
7260A3898k15k710Q39M796n034p524k428o353m625M241L355O81N232J698k842
7245C009m770M19N012O806k192o357l84n124m145K312J279L361N425O228k10m497
7229F172l016o548J581N230L938K07M02j070o00l522J776Q931j205m803j1457
7214c984m970O899N549Q99k275j08J067O50n12J836J79K019L926l355o217m404
7198b801L567P241N338L560l589j729q92j934l630n4j910J73L5n23M520K061n998
7181C435r68m131J740k460j126M086K967L012j048J34l981m163n482O212M625
7166B852K662P3k049l427r9j086j296J664M293l222L24m252k488O891J1288M615
7150A6743q73l104o13m359q732n809L18K665J58q38k251k563K772Q283p47l043
$$ y = [13898, 13683, 10973, 11812, 16608, 11574, 4050, 1622, -4731, -9356, -5115, -1760, -1079, 4153, 5851, 3009, -1761, -1342, 3670, 10476, 8284, 1927, 1543, -3581, -7726, -5414, -4135, -774, 4651, 10879, 10669, 6172, 3156, -3392, -1811, 3419, 7357, 7564, 7966, 6896, 6296, 2774, 4550, 13481, 12276, 7473, -3984, -8954, -2055, 3494, 4393, 2118, 2010, 3077, 3727, 3215, 5051, 5230, 7249, 11175, 7820, 1603, -2801, 766, 8007, 13345, 16905, 13316, 11587, 10695, 8761, 5131, 5077, 3167, 3340, 3375, 2852, 7372, 9433, 3435, 2467, -1664, 76, -2384, -3510, 576, 3543, 6555, 5507, 5641, 1660, -2503, -7985, -1773, 2852, 5514, 5587, 3538, 111, 12, -1074, -2370, -706, 3587, 365, 689, -3563, -6051, 840, 12128, 16743, 15870, 12766, 12153, 7794, -938, -6747, -6429, -3764, -3606, -4444, -6695, -9258, -6486, 1797, 1050, -1993]
7134a993J012l613o44R670J98o064k173J329N435j864l414j725Q87N345J149J061
7118D596k165k855N574L240n18o650L20L70P4k88J654l368m373K491O109k597
7102A614N5J819K723l197j789n12j892l4j801j734R645M010m095j871r197l221
7086i477J1365Q359K671O74N59r63k745l326o109k683l050M922r29K94q34m171
7070e443O08p80n03l030j960P29L069J182l762J171Q70J268M383l270L645M058
7054B235L777j705l892O831k430l545j683l232K891M340p486k422o77n24n87l212
7038a1321P01L038O88O664K846Q08o869k36K66M339j414N665l979n768j193J84
7022e581J360j278K91J958N72J635J050J461P359j238q923m265K42K628o349j005
$$ y = [-1993, -981, -4594, -5238, 4432, 4630, -1434, -3607, -2278, 3157, 1293, -2121, -3846, -2959, 2386, 3535, 4596, 2431, -424, 5150, 8390, 7872, 1222, 1542, 1912, 1986, 1698, 3352, -16, -4389, -1898, 4211, 1614, 1669, 3488, 6211, 3014, 1225, 713, -1179, -1213, -3014, -4748, 4897, 8907, 4812, 2941, -6256, -9477, 1888, 10247, 12918, 13592, 14151, 13188, 10443, 7117, 1008, -1675, -4725, 197, -732, -438, -1272, -5443, -4835, -5615, -6118, -9148, -11108, -10379, -7310, -6128, -9890, -8719, -7849, -6581, -2198, -5468, -1823, 2235, 6012, 4307, 415, 7246, 4816, 1271, -412, -3644, -753, 3587, -3899, -6321, -6998, -7522, -8109, -11321, -10620, -7582, -6894, -230, 2616, 3424, -3445, -3681, -3415, 924, -490, 5175, 1196, -4572, -5765, -5581, -4221, -5499, -5208, -3250, -2678, -1043, 7, 1468, 8827, 7589, -1334, -5599, -5357, -2729, -9078, -10083]
7006a0083J990J250J006N703k49o538j031J894j170K370O291L51p62k385l352
6991d715k055R94l555Q07m55J097L899m71k184j434J252O088o71k46K665L289
6975D305k844n653k383K506J536M585R800O037N72o072j0357l461O114j082q274
6960d671n412K467M167P281J3241k39n998o147J920Q57J899J80j383j952Q57p631
6944e64k301J9q220l729J991n06q3N784L389k670L037P185N703m400m027L959
6928D567J275K36k520p99L076j8n662m240K091l064K259M132M268K539L304n451
6912E993p672k705J709L312Q64K470L262l481k832N894J830n893J128m485m705
6897e311j422m368m33K647M14K933O13o60q09Q095N889k675M03J254n889m947
$$ y = [-10083, -8093, -6843, -5837, -134, -383, -6921, -7952, -6058, -7228, -4858, 1433, 1784, 1022, -1363, -4715, -6770, -5776, -9331, -8524, -8979, -7882, -3983, -4454, -6638, -8072, -6820, -732, -1403, -1649, 1016, 4305, 1461, -4192, -6575, -4069, -2533, 2052, 11852, 17889, 18461, 12389, 2032, -1429, 4685, 3603, -4671, -10083, -7616, -3449, 3832, 17073, 16834, 10836, 4689, 6609, 7466, 9365, 9545, 8162, 6210, 7067, -564, -2865, -2846, -11066, -14795, -12804, -13310, -13393, -7609, -4220, -6890, -3853, 3332, 9035, 4635, 608, 4567, 5842, 6078, 3558, 2759, 5835, 5817, 155, -4085, -1994, -5058, -2799, 1333, 5601, 8140, 11444, 5993, -1679, -4384, -2675, 637, 1501, 3971, 7233, 3752, 920, 6814, 8644, 2751, 3879, -606, -5311, -6733, -11101, -11534, -8887, -8473, -5540, -4927, -5587, -6396, 1699, 7588, 4913, 5316, 6570, 681, -4266]
6881d266K516k308M48L24l37L287l628k429K291M251k592L536N362L705N133M647
6865A9940m725l296k211l243q620l453J389J127J266k728L404J044q5j9J236J37
6849A163m537K263M661j464J958L199k038J768J157J632q619o25K190L75n775
6834b692j455J0338K564m242L160O80l175M131j808o974k794l04J640J827k297
6819a401k49r5M113J169J320K421L310L654j909m521K187O325p253j729Q60K735
6803A0937O152l294m245r95q98p12p57n905k726j106K268M596l967l10R60k374
6787b376q02K059n72M284K966M256j230m454l887J0885J2564j855J5J1713Q025
6772D1591p354p678o206q157p708k220L800j591l247k00q18l354l72l013K085
$$ y = [-4266, -1750, -4058, -3610, -3286, -3623, -336, -3964, -6393, -4102, 149, -2443, 1093, 6455, 10160, 15293, 19940, 15215, 11919, 9708, 6465, -2155, -5608, -4219, -3092, -1826, -4554, -1150, -106, -191, -210, 1026, 1163, -3374, -1111, 3550, 2086, 4044, 7243, 5205, 6973, 8130, 9762, 1143, 518, 2708, 3083, -2692, -4147, 6191, 8755, 4513, 7673, 8353, 5178, 9309, 7501, 527, -2267, -2571, -931, 896, -1401, -1650, -1745, 2368, 3537, 4857, 7278, 10588, 14242, 12333, 7812, 9999, 16324, 9071, 7342, 8202, 10937, 17089, 13795, 9550, 8555, 7657, 6945, 6188, 283, -2443, -3549, -1281, 3315, -652, -962, -2, -2376, -3178, -1119, -1691, 2593, 5559, 9815, 8585, 4131, 244, 11129, 23693, 21838, 21853, 33566, 41591, 34237, 26559, 20353, 12196, 4488, 2268, 6068, 4477, 1230, 1030, 212, -3142, -3514, -6527, -4442]
6757d442M024J519q08P84k486l325j635m14R6N21J741L463K089P06j575L02M303
6740D863j497k876J413K719L545k086k826m548k574K291J268R66p303j748M942
6725c451M278K538M514j292j284p247l158K641j525n16J085K406M659K095K907
6710H650J413p360j84J560J595J831J501k755L652k097m060j536M26m537k735
6695d636k664L093L539n73M328J179o78j265L685k932L143O027j477n34J987p73
6679A1449J231p914o859k958l353K98J799K243L817P071K065m720J430l560j551
6664D88P098K975r99K819J656M316J708l673m917p15K430K030o931j163O828O321
6648B0271m99j373m681j072l031l566J185J255j551K810n47M509j36k130J184
$$ y = [-4442, -418, 1101, 293, 1077, -1409, -4734, -6369, -6783, -6687, -6166, -4425, -962, 1127, 1833, 258, 560, 4863, 3366, 490, 1903, 4622, 8167, 6081, 3255, -1293, -3867, -1576, -308, 658, -6645, -8393, -3451, 827, 3365, 7879, 6587, 5303, -1944, -5102, -2461, -3986, -4502, -3417, -1011, 3648, 5743, 8650, 10063, 2703, 2519, 4079, 5674, 7505, 9006, 6251, 9903, 7806, 3746, 2210, 2636, -1901, -4636, -7300, -4207, -668, -1241, 3087, 4266, 3588, 2323, 6008, 3076, 6219, 12246, 10769, 10235, 12222, 11449, 12680, 4766, -2093, -5051, -8404, -8106, -6307, -4064, -247, 6824, 8889, 4169, 5599, 2039, 488, 7586, 10561, 9562, 12381, 14037, 18353, 20061, 16388, 11471, 10756, 13186, 15216, 8285, 7122, 13950, 20271, 19772, 18399, 13718, 12646, 9615, 6049, 7234, 8489, 6938, 9748, 9201, 13710, 13574, 11444, 12628]
6633A2628l238m950k491J275P423K010r404o913K715K582k31K43L792L21n862
6618a00o525K705r11O425K636P56N519J560l642m822q81j975n40k137K683l244
6602b493K516n4k595O762j013k410k12L994Q008k09k84o68r73k229l058k903n47
6585A632R42j230J014k78l575M242k61o81n835o52J416m449p77N801L067J818
6569B194J596l682o570l680N114J1069j948l767n091o584j618K019L556M300O724
6554C632j775n441n172N688J786O27R40k987l881k394L353L716j023P35k12M488
6538B080j901p921k286K80M579K255J887k772k67k655nJ586M63j232J360l332
6522g881K057o561n891K126L815p93N81J86R489K066o142l990P930l13J548j332
$$ y = [12628, 9390, 4440, 1949, 3224, 10647, 12657, 3253, -3660, -945, 1637, 1406, 1649, 5441, 5762, -100, -6625, -3920, -4831, 1594, 4230, 4986, 10505, 12065, 8423, 3601, 2720, 745, 205, -1932, 751, -2493, 23, -31, -2626, 4136, 3123, 713, 501, 4495, 12503, 12294, 12010, 11342, 10369, 8140, 5082, 2179, 1632, 2574, 1344, 2358, 2080, -1495, 2747, 2486, 1805, -4030, -4682, -3266, -7715, -8492, -2691, 376, 2194, 3790, 108, -6462, -10142, -5028, 6041, 4093, 326, -4765, -11349, -12967, -10948, -7392, -3092, 3632, 1857, -3584, -8756, -3068, -1282, -655, 285, -2702, -6583, -8977, -5624, -1908, -2931, -2196, -2408, 2080, 179, -7742, -10028, -9748, -5169, -2914, -1027, -3799, -4066, -6721, -6726, -5140, -4677, -5909, -4549, -7881, -5824, -12385, -18276, -16150, -12335, -13128, -12547, -12361, -2872, -806, -6948, -10938, -3008, -3321, -1773, -3105]
6506c105l00K326K10j859L8M817k197m013J473p16l835j357Q4R83j616J790M630
6489b647N17J033o50n266K8J5M673K375r438n927M535J428P311K420o00l42K280
6472A745r31L162K900k751k886K60K79o518j224L000P120J155p017n931p6k305
6456a0018o257M86O570K436m24o73J2984J360k993l361l103l978P37k819K0j86
6440i219J365P498M06K83L526j299q673j518M53M614L558l035L020P051L374m830
6424F574l788o957R66M739l493k221K670n52j309k164L389K19L895M116o95o629
6408a240k835R17j581n756N054J749L576J0106r90n096l651n950q68P78K163L527
6392i7R30m318l101n772L453P257j109J47L68L303O389M02n741k203M201K553
$$ y = [-3105, -3405, -1079, -869, -2728, -2690, 2127, -70, -4083, -2610, -3326, -7161, -8518, -8434, -7451, -9067, -7277, -2647, -2130, -1097, -1747, -7013, -6985, -6970, -2297, 78, -9360, -15287, -10752, -9324, -2013, 407, -193, -535, 1745, 814, 3976, 6876, 4125, 1239, 1499, 1778, -4740, -5964, -2964, 4156, 5311, -1706, -7637, -7713, -10018, -16275, -15789, -9219, -6783, -7207, -7880, 5104, 6464, 3471, 110, -2993, -6971, -6234, -9053, -9033, -9219, -7854, -356, 50, 333, 3859, 2560, -6113, -7631, -7178, -2564, 994, -2041, 979, 8030, 11404, 6574, 2786, -4171, -3205, 1534, -1959, -4180, -1510, -2062, -3371, -5535, -2146, -1927, 1968, 6084, 5389, -1240, -4075, -3158, -4739, -10495, -5441, -3692, -116, 9990, 9000, 3904, 253, -5697, -6565, -5787, -3624, -97, 833, -3485, -6586, -12358, -8905, -1648, -2757, -2610, -2242, 1061, 7450, 7852, 2111, -92, 4109, 6662]
6376F662j307j644k894k625m631j586k07n84k275N28J144n48j288M598Q483P196
6360I022L892r4o267m980J372k120P119k140L993J732p948L335P315l47m926k444
6344F514q55k42K817M042j347n074q564j854j076M148M731p67J97J076O54J743
6328F143K500j799r390m249L761K828j896o485r718n707J0165J4042N697J19j905
6313D106o345n247J865N759l44j769k250q018k768M970N667L948M74j194n726
6298f872j042k165O398n99K003L948L620l978o270m034J232K3l85K749m445O89
6282i128L063L130J162Q14j122p09k042J458J509m05l926Q86K199J021n199j584
6266h873J354O963L242n651k662K833K918M199m116k692K06P04N58j287m420k930
$$ y = [6662, 5355, 3711, 817, -1808, -6439, -8025, -8232, -8816, -11091, -10563, -9419, -9967, -11255, -6657, 1826, 9022, 12914, 12820, 6553, 1573, 2945, 825, 7944, 5804, 9797, 11529, 3581, 6916, 14231, 13884, 8958, 6514, 5659, 5417, 8234, 12276, 10929, 5855, -2709, -4563, -5639, -1491, 3240, 2473, 2670, 3746, 4400, 6143, 8643, 6844, -2546, -6795, -3034, -206, -2102, -8587, -18305, -24012, -13847, 195, 5892, 6011, 4106, -2239, -7486, -5621, 138, -206, -1975, -4225, -12243, -15011, -10041, -4374, -426, 48, -1146, -6872, -7914, -10079, -3681, -4280, -2277, 1671, 5291, 1313, -4957, -8991, -7759, -7736, -8121, -5372, -9817, -9128, -6065, -2935, -1773, -959, -2081, -2790, -4832, -3374, -1865, -2270, -6196, -5310, -3111, -2090, -7289, -8873, -7519, -556, 2686, -2965, -5627, -2794, 124, 4323, 207, -2485, -2279, -1575, -1017, -2304, -6724, -9654]
6250i654l590J815L673K264K989K469L734J957n776P798o09l833L151k190n159
6235i61k850l362L127K589K179L415l575l242L95k74J000L557k207ol894k283
6219f392K133J450N407j282J432k224m645p10O448o807n837O890N415L44J961
6204C583M933N62p455L794p92k341J048n07k874L701L755J26p309m009R8m446
6188h133M37O526j004j137L533m722J131K868L99l92K13K382n42J656O805K959
6172A2979m889l218p31J943L049L74n214L60k265L60j394J280M041m806n171N387
6156B085N313j154n05l54J279k658m598n568j053o54n25L957N113j462o386j470
6140h640k70K720L164K096j296J592J115O5J550l850K25P255J022K420n106m193
$$ y = [-9654, -13244, -11429, -7756, -5492, -2503, -34, 3700, 5657, -119, 7679, 7070, 3237, 6388, 4198, -961, -3811, -7173, -4046, -1457, 722, 4137, 562, -2680, -2285, -2559, -1559, 1998, -209, -215, -4109, -6392, -4259, -2809, 2598, 1316, 2748, 524, -4121, -4831, 1617, -5190, -11027, -4137, 1278, 1622, 3583, 8516, 9078, 1623, 5417, 4625, 2284, 3332, 2825, -49, 3652, 7407, 7533, 224, -3785, -3687, -8133, -7696, -1170, -2174, -3311, 222, -4500, -3369, -501, -102, -494, -281, 2101, 1559, 3215, 10020, 12979, 8090, 4872, 4141, 6084, 9133, 9507, 4293, 4653, 2388, 2748, 1354, 2634, 6675, 1869, -3302, 2085, 7398, 6244, 5739, 5385, 6664, 4006, -592, -6160, -7213, -7867, -8392, -4435, 678, -784, -7170, -8640, -8910, -6190, -3026, -930, -2226, -634, 481, 546, 2096, -1754, -1529, 5726, 6748, 9168, 4062, -131]
6124a31j637m718L784n409J134O742M884L461p625j971j615m311K73M899P871
6109E631n977p414p20N793O088j87m931j464R56K488n832o14J923O782j491l578
6093b547O29N082K025l558k000o191k031J540K663M932o20j905o636o222k851
6078a7690p39O050R594N186j535m345l711m34L465L588j694n46j619K156j064
6063c338O62J283L227J335l680m36J053J327j733k50j889J078M077m113m791K954
6047c234m766m539J976n76P32O457L489K400K624l647R01j540N23k869M156N783
6031G870K247q820j878K752L837j916m478l668J902K674N046M459j004l315n980
6016b72K699p77J30j768q38N181L282k869K332k58m002k815l394j017L97p09Q08
$$ y = [-131, -1768, -6486, -2702, -8111, -6977, -235, 4649, 8110, 485, -1486, -3101, -7412, -7139, -2240, 5631, -346, -7760, -8480, -2687, 3401, 3214, -1717, -3181, -2225, 263, -5569, -6183, -4260, 2522, 1031, -2547, -1918, 3164, 5189, 1631, -369, -6560, -8591, -7051, -4388, 544, -76, -1981, -8617, -14839, -17690, -18429, -12379, -2785, 2401, 866, -3479, -7190, -7624, -4159, -571, -2265, -2811, -4430, -2274, -3338, -2676, -1393, 1834, 3169, -511, -947, 106, 1433, -300, -550, -2439, -1361, 2716, -1397, -6188, -3234, -8000, -12539, -10563, -11139, -10407, -3950, -461, 1939, 4563, 916, 1817, 277, 800, -2069, 2087, 7870, 10117, 1297, -581, 2171, 6008, 4092, -386, -4054, -2152, 522, 5568, 10027, 9023, 5708, -272, 2427, 1650, 1780, 12, -826, 4355, 7637, 4768, 7100, 6842, 2840, 25, -3369, -4386, -3989, -4698, -3890]
5999c890O00L957k229j0008L978J182J676J520L264n16J927m160l435L25P982
5984B173J0338l224j152K018j0151p822l346O34L726L081J691k037p197J344K933
5969f991L470M204o7K56m639m940L616N58O099k862j222M313r1l260n838o58l900
5952a1952j911J168K988J219Q30j500N009M264J571K905K288k844k019q442j841
5937h267N465M669K976k079o807k427M561N172j923q673J590N632p07n741m843
5922a1402k676K179M840l88J141M846N869k314p532J44n011N404J777o463j952
5907a1538M607J267k975K149J0986N915r159k334Q2K01M148N210j088m197N28
5892C802m973k17N009M570l788k483P07j081o510k461r66N308M698m962Q76L083
$$ y = [-3890, -3290, 667, -1562, -11570, -7592, -6410, -4734, -3214, 50, -466, 1461, -2699, -6134, -5809, 2173, 12511, 9287, 8135, 10153, 2, -7820, -11166, -10532, -6806, -3725, -2034, -4071, -11268, -9924, -6991, -3521, 683, 616, 872, -3767, -8707, -5091, -4533, 1566, -1296, -2518, 1795, 1704, -1556, -7394, -8052, -11952, -13863, -12695, -9707, -8488, -7658, -9158, -4149, 115, 1686, 4591, 6879, 4035, 2016, -6426, -8267, -2802, 1867, 4843, 2764, -4043, -6470, -1909, 3263, 1340, -7333, -5743, -111, -818, -6559, -11402, -14078, -11899, -7059, -7447, -6306, -1460, 4409, 2095, -5437, -5293, -10304, -4900, -3123, -9586, -11538, -6931, -5664, -8639, -6490, 4496, 10411, 1252, -1082, -1000, -799, 3349, 8559, 7471, 3274, 3802, -1171, -1388, 3621, 8191, 4403, 1920, 2627, 1546, -4964, -7425, -8391, -3083, 1615, -3347, -2471, 612]
5876F12m76J441J940L258o750m41J773j660j815L523k949L309k217j020k404o484
5860a0360n85P985O22N117l19k441L280J262m725o319j362L390J064L078L211
5845B898K471l468J443J704p156o797k286K233N030O0J462O057J565o306n930
5830g020N422M547K000l481p133k188m293l417M224J0338J701M801J392L242k234
5815G901m722J364M360k925M4k781k29m514j57K224J9P2k920l966j763J084k172
5798i081O373K141N600L948J883k749k50l878r86q77o57k33O917m80p222j587
5782a138m238k176R80J669j114N581N699j562k711k007N674m915l049j204N884
5767A373l45j600L942J108n873N47Q99J04k29p83O018L067l742o252m302n090
$$ y = [612, 136, 1577, 3517, 6775, 25, -416, 1357, -303, -2118, 1405, -1544, 1765, -452, -1472, -3876, -10360, -10945, -2960, -2338, 2779, 2460, 19, 3299, 4561, -164, -6483, -7845, -4455, -3391, -313, 2898, 5369, 1901, 3344, 5048, -2108, -8905, -11191, -8958, -3928, -3868, -2406, 3651, 5216, -1090, -7020, -1598, 2949, 4949, 1468, -5665, -7853, -12146, -15563, -11339, -1001, 700, 5501, 6893, 10135, 7901, 3179, 4543, 8903, 5978, 6022, 3241, 3012, -1502, -1659, 565, 584, 656, -2264, -6230, -7993, -6909, -9081, -2708, -567, 5033, 8981, 10864, 8115, 7865, 3987, 3001, 2124, 1467, 1234, 8151, 7671, 449, -1138, -5376, -7552, -6572, -4903, -6017, -436, 5263, 3701, 990, -1017, 4657, -258, -3307, -4511, 1373, 1028, -572, 3370, 4478, -1395, -848, 51, 155, -74, -857, 5161, 8228, 4486, -1766, -6068, -11158]
5751a1158k617Q125P734M14m046K409L698l134m679m440j432L492N63J896L331
5736A56M211k529j609k565J619L276k316n389l952k353N422M535K275n628J908
5721b939M923J557L114l077J153J155k178j285J617K191j318m262m371l85p684
5706a1789K831J929o513j460P823M590J888j839k230J296L388m99R20m081qJ372
5690b382n475R47k022L657J718j844j55K930M803N521j380j169O47j465l020j0742
5674i431m706J773l9j365j829O545R254K296M757n604L199L44j577K814k47l410
5658B774J223j101l052m063m875J311O669J0514M676j548m985m234M84R2k054
5643A831K601o24j950k289N9o159Q40K670K459p450K70K833M27J381J267k880
$$ y = [-11158, -13775, -5650, 2084, 2498, -1548, 861, 4559, 1425, -3254, -7694, -9126, -5634, -5071, -3175, 156, 4367, 1838, 229, -2336, -717, 2559, 243, -5146, -9098, -11451, -6029, -1494, 781, -4847, -2939, 1984, 3541, 6655, 3578, 4731, 5886, 3708, 2423, 4040, 6231, 4913, 651, -3720, -4105, -11789, -8958, -7029, -13542, -15002, -7179, -2589, -701, -2540, -4770, -3474, -86, -585, 335, -3746, -3754, -2382, -7857, -6910, -8932, -5275, -3557, -5401, -5556, -2626, 2177, 7698, 6318, 5149, 5796, 4331, 1311, -9431, -14137, -12364, -12403, -13768, -15597, -9052, 202, 2498, 7255, 1651, 4850, 5194, 3617, 6431, 6184, 2774, 3997, 2896, -156, -4219, -9094, -7783, -1114, 9400, 14076, 12528, 7543, 3309, 3793, 3885, 1831, 4432, 3808, 1858, -431, -372, -6531, -5691, -3021, -562, -8012, -7742, -4909, -4482, -3101, -1834, -4714]
5627d714N875p96o383k328q13N128P875N112J333l419l238k017k97N94J524P75
5611D211k074j837L362Q18k3n918o015k869J618j984j887k887j291M924O111j900
5595g641K703K892J107R31j624J915q27K714J820j81n479n31P10o360Q61J739
5579e251l190k150N992J1643J905n639l807k658O810N846q276o509J246L841L848
5564C651j613p174j399P351m3M184M281K391l091m075m198K427m237o437n851
5549a3833J696J4176N407k509m438l417J275M068j843m498N775L957K276j650
5535F442j139R8k49l154J453K573l077j61n079l671J827R01l11o47L366j072J760
5518a40k796k227j274n95j32J178L691K418M336K905n505m827L222M459o965K806
$$ y = [-4714, 1161, 365, -6018, -8346, -9159, -4031, 3844, 8956, 10289, 6870, 3632, 1615, 1318, 1912, 3436, 4211, 2137, 300, 3662, 4480, 4457, -1461, -7476, -10345, -8727, -10711, -12598, -15485, -16776, -11852, -5741, -7641, -4938, -2046, -939, -8, -1632, 283, -544, 2170, 3990, 3809, -1670, -2201, -1491, -7851, -6990, -5251, -8441, -10591, -4599, 7044, 8949, 3310, -497, -3155, 3655, 9501, 1225, -5284, -4038, -197, 3651, 2038, -5136, -6535, 816, 773, 4957, 9238, 11629, 8538, 4463, 265, 2692, -1545, -7982, -13833, -12137, 2039, 7446, 4937, 499, -2918, -1643, 2425, 582, -3916, 1859, 5816, 8092, 6442, 5303, 5401, 5152, 1998, 3451, 6024, 2947, 2786, -2293, -5964, -4137, -3236, -3547, -4194, -828, -1900, -140, -2936, -5163, -6437, -7032, -7164, -5986, -2295, 123, 4459, 7364, 1859, -2968, 254, 4713, -2252, 554]
5502E54K371M35k060J217j055J689k764m804j784N821p54n063K088M636R77K737
5486D241P731m582n060J089k032p111O31O708K252k436m447K386L755m802m786
5471f463M884l9L58k221J541N4p547N946Q393J313p85J525j141m455o556j865
5455g058j387m257P46L886M394L278L980O38k893m296p210j249M595L576N647
5440B390n502k141L037K20k361j133q48J806P82M888K625n525m381k277O454O736
5424D770k599k843m097K152j485R84M68K928M637O456n672l299k991n26N86K729
5408B198j828L016R14Q33l403l334l054P27j716J134J291K873J706p56P450L354
5392A1405L003k785m865J701k695N6m612J295J529l333m337j270L627J112J18
$$ y = [554, 2925, 3360, 1300, 2517, 1462, 3151, 387, -4417, -6201, -380, -1134, -6197, -4109, 527, 1504, 4241, 11972, 7390, 2330, 3419, 1387, -5724, -5093, 1615, 3867, 1431, -3016, -630, 3125, -1677, -6463, -1579, -1618, -1260, -3481, -1940, -1886, -9433, -3487, 4906, 6219, 5434, 6959, 5818, 1363, -5193, -7058, -8445, -12702, -11956, -8070, -3676, -398, 3582, 4220, 1327, -2969, -10179, -11428, -6833, -3257, 2390, -3112, -5253, -2216, -1996, -4357, -5490, -6338, -4532, -3750, 1138, 3763, -1762, -6143, -8420, -1966, 4770, 2171, -672, -4769, -2617, -4102, -3118, -2650, 278, 4915, 11371, 5699, 2400, -591, -1117, -531, 2198, 370, 3386, 4300, 5133, 1730, -1604, -4658, -3931, -5647, -4513, -3222, -349, 1357, 601, 8051, 11405, 14408, 11623, 6758, 8459, 5764, 5820, 1208, 2503, 4032, 699, -3638, -4908, -1281, -169, -51]
5377e1M332j13l278o42J86m244r76M243J564l806k165K823O566l690n302o291
5361a0844m98K488o37M427M551j910m223O238L462l248k519L007O30l372j349
5346c797L995r85k860k31M191J423K175J70M798K274q62j833j608l160j437j090
5330A163m132L893k184m775o798j518M145L099M296N321k52L659o967m990m154
5315a0194j748Q111N479m373m251k47N186n454O070Q19K169J532l580n801j760
5300h042N552m693m879J16L760K04J767k170K227K39m411n039K536O985L400K915
5284D67J784L748O96K48m86n856o9N157j214o150m429O392k791j1009m082K613
5268a4981L961O148J763K976l760J047M172k84K108N375m54l402k07j0234J371
$$ y = [-51, 4281, 4168, 890, 248, 434, -3810, -4786, -543, 1021, -2785, -4950, -2127, 4439, 749, -4553, -10844, -11342, -8854, -9491, -5064, -513, -2423, -6646, -408, 3054, -194, -2713, 294, 924, -2448, -3797, 198, -787, -3647, -3878, 313, 1736, 3911, 4081, 8879, 11153, 10291, 8458, 6850, 3690, 2253, 1163, -2969, 924, -1260, -6035, -12833, -14351, -10206, -7107, -2811, 2510, 2258, 5917, -1050, -6040, -10194, -11942, -3831, 1648, -2725, -6976, -7223, -2037, -7491, -1421, -602, 1567, 3099, -481, -6282, -8042, -2490, -7183, -12062, -11946, -8186, -7982, -6215, -8385, -6158, -5919, -10330, -15369, -12833, -5848, -2448, 467, 2251, 5999, 6695, 6943, 6457, 601, 532, 5689, 4475, -1675, -6104, 288, -2503, -13512, -17594, -14981, -11020, -4872, -3109, -133, -3893, -2846, 1326, 1042, 3150, 8525, 8071, 4669, 4462, -5772, -4401]
5253d401Q89l952J195J0214O821n20L11m033q974r054K682Q457M792k393M51j574
5237I11J074K933l625l22P48r189k524K927n927j312L313R599N553P102J908r192
5221C977q378k523M306L584n049J638J1601K350l596o147L168J460l665M44J177
5206D347K557q0n502q818o712K143N414M855N517J863l659N89R39l571j070j039
5190b227J488K534L940J221o14p929m285n3n33N968L64m077j055J508K258Q233
5174F741k495m051l962l430J327K060K950M85l481J293k724J493L174j84N90j129
5158a343k810p69j404r33k092J732O146J086K02R08P82K318M1j739K810q000l979
5141g044J847O321k691k326K507J058j931k754K696M414M589j589m189n509J236
$$ y = [-4401, -3512, -7464, -6269, 3945, 10766, 10246, 10557, 6524, -2450, -11504, -8822, -365, 4427, 2034, 2485, 911, 1985, 4918, 1293, 971, 1719, -7470, -9994, -7067, -12994, -14306, -10993, -1394, 4159, 11261, 13169, 3977, -4401, -6924, -2618, 966, -4083, -2445, 9156, 11506, 7910, 1763, 4931, 6391, 2726, 3170, 4347, 6904, 6824, 1322, -7496, -14208, -12065, -6651, -1796, 3721, 5584, 1925, 2514, 3453, -118, -1188, -2227, -739, 1795, 5735, 6956, 6342, -1587, -5872, -5925, -6458, -490, -126, -4203, -5258, -3750, -1492, 6741, 4246, 195, -3767, -7197, -5870, -3810, -860, -375, -3856, -2563, -5287, -3794, -620, -804, -214, -1343, -4153, -4922, -6326, -7259, -9351, -7619, -1473, -387, -185, 723, 1505, 3823, 3864, 2125, 4935, -3065, -7044, -5197, 1124, -1567, -3893, -1386, -328, -2259, -5013, -2317, 2097, 6686, 5097, 908, -4601, -3365]
5126c365J163j452J406l704N01N011Q4k444K425q95O6l605j268P960N013J460
5110H356j763n300o574Q65J04K077L279m44j419R9q5o247j801L260m83L025j017
5093d068j010j217j034P863K126K481j371n871n599m15K809K226N147M598O416
5078A3081O771o896p723r403K650K600j023L291L730o07j619J413M249M7m280
5063F281j0044j507j306N267L16j893l532r055m62M652L167l138k345P974K499
5048c126O904K362p280j161k498K46M050k02m79j645L417J306L317k113j276j636
5032A86n037n58M563o219q777m693K219R140m94n538J776O911J648k937M032j0683
5016a4461m875M291K71J120Q939M778j622j037J956J107M642J127L251l100q770
$$ y = [-3365, -2202, -3654, -2248, -5952, -5451, -440, -356, -2800, -375, -1270, -1204, -4809, -6077, 1883, 6896, 8356, 6593, 1293, -5281, -4416, -4312, -2235, 1044, 600, -819, -720, -805, -7052, -8853, -5593, -6076, -3051, -4068, -5078, -6295, -7329, 534, 2660, 5141, 3770, -2101, -7700, -8115, -5306, -3080, 2067, 6665, 13081, 19852, 12956, 5233, -4170, -1520, 1080, 57, 3348, 7078, 6471, 4852, 6265, 10514, 10561, 6281, -3763, -5270, -6576, -1309, -993, -2886, -6418, -15473, -15935, -11283, -8116, -11254, -13599, -5625, -3126, 3778, 6140, -1140, -2301, -4799, -4553, -503, -705, -1184, -2829, 588, 1894, 5211, 3098, 1822, 186, -4851, -5409, -846, -7065, -15842, -20535, -18316, -9176, -9670, -15208, -13432, -6521, -4873, -7810, -3778, -14461, -19336, -15045, -14774, -13654, -4715, 63, -1559, -2596, -640, 467, 5109, 6236, 9487, 6387, -2383]
5001b383j2705J793N726M839l743O68Q083l384n020k429M961J838l501L079K886
4986G08l041L144R02k431m686P332O385n33n646j612K886k994k856k84J503j313
4970b536o83N880J294k874L388K417J820l725k427q535K253L559K063j489p58
4955c53P60J062L886k999m193R46r53j475L515M679j1132n780K982p58K341Q106
4939F34N070k071j416j827l506p264m397l420P626M387J754R4P311j218J29l122
4923a236k331J698M217k314P47L258m084j802l889l302R7J005N332J194j14q50
4907b374l37k605J128K17O45P08r99j347O137J231n145k948r48N589J434j139
4891g53m277N916O878n330k211p267k35K927N755K89j0196k407J773J0495O535
$$ y = [-2383, -15088, -13295, -7569, -2730, -6473, -5805, 2278, -1106, -6126, -8555, -3594, -1756, -5257, -2178, 708, -2333, 811, 1713, -718, -5404, 1928, 8313, 7780, 2134, 522, 3408, 414, -2442, -2726, -1223, -2536, -3219, 2661, 3955, 1081, 4469, 6886, 8706, 4981, 2554, -5981, -3728, -169, 1894, 405, -353, 407, 1469, 5355, 2356, -1837, -891, -1844, -3319, 196, 4875, -6257, -12037, -9055, -9813, -7472, 634, 5704, 3633, 2217, 390, -3116, -10380, -14777, -18197, -10571, -6184, -4430, -4336, 2975, 1757, 1886, -1236, -3567, -1869, 2348, 34, 781, 4039, -45, -1847, -5736, -9038, -8941, -7936, -2604, -1410, -1524, -2374, -2711, -5316, -4188, -3971, -3326, -2618, -3617, -4964, 1173, 2404, -2741, -5689, -6637, -1048, 386, -753, -5030, 886, 7764, 2434, 223, -7044, -7279, -4352, 1403, 1692, -8504, -10911, -9138, 1357, 7892]
4876G892P250m94n502r699o700q914J436P357L907m937J472L795K235n770n233
4861a1905L268L275R374J866k889n418j464r67l417n141r03P56R621L46J329k646
4845d915J991k391M953P843l585p493j026J667j302K084M547K091j031n257Q368
4830F544p5r73k018k969M26J412K438j656K260k298j45M76j512k719m446l674
4814h929R60L084J614N834j95K191j066l695m465p804L803M470j917k933r47K762
4798g233j285j501l67J815P587k628o988L33N714N751o31j135M49j352k34o196
4782g901m300L191L581p41m192P16M103J321o320k246N43L73K316L470M309N21
4766a256k586j383N084M357j783k447k150l828M178P016K004o585k084n484o635
$$ y = [7892, 15142, 14648, 9146, -553, -7253, -16167, -14731, -7374, -3467, -8404, -6932, -3137, -902, -6672, -11905, -8637, -5362, 4012, 5878, 2989, -2429, -3893, -4860, -8277, -13418, -14321, -13565, -3944, -3598, -2269, -4915, -2924, -5315, -362, 7481, 3896, -3597, -4623, -2956, -4258, -2174, 2373, 4464, 3433, -1824, 6544, 6469, 5496, 3478, 509, 935, 2347, 4785, 3129, 5389, 3091, 2946, 3422, 1910, -809, -5255, -8929, -7969, -4885, -3271, 2563, 2368, 4559, 3493, -202, -4667, -12471, -8668, -4198, -6115, -9048, -9995, -7233, -8518, -10019, -10386, -8571, -984, -3612, -10600, -10267, -4553, 1198, 567, -568, -119, -1471, -1705, -7901, -12201, -9010, -5429, -6170, -10362, -9646, -5543, -4222, -10542, -12788, -12245, -11872, -9556, -6086, -1777, -1256, -3842, -5225, -141, 4216, 2433, -14, -2164, -5992, -1814, 5202, 7206, 621, -1463, -6947, -13582]
4751a3582l69n47q2K33k180r355M229J1559Q858L017l040p231L645L261k607J10
4735d081O097L939j670k831n074M977o49L488R67m002n771j875J20l146M372L363
4719a776J534p78L521j063j060K566q11O50j016Q98N735M718j839J258l150m441
4703D946m111j081o28m918L171K079L56k134j089O39L504J348j368J162O847j780
4687F943o672N339L376m414n299l146k047j050j125O738N698J500l158o509k078
4672e904R220l807m366M71J848O669j856m461J503p66k750o244j343Q640L368
4657B22l361l309j312j099M819L736j420R08J510K424m46j608m023l400L60k384
4641h383j684L390j724Q16K98K823K651N933L691R69l827j519J937J25Q18l617
$$ y = [-13582, -13951, -14498, -14580, -14347, -16527, -25882, -21653, -10094, -1236, 1781, -1259, -8490, -4845, -1584, -4191, -4081, 2016, 5955, 4285, 1454, -3620, 1357, 708, 4196, 5163, 1161, -4610, -6485, -6365, -9511, -5139, -1776, -242, -1020, 2501, 1438, 378, 2944, 2133, 2783, 1767, 2665, 8400, 13118, 11279, 12537, 9387, 4946, 835, -246, -874, -5792, -2621, -542, -186, -2320, -3409, -2770, 734, 2082, 714, 1876, 8723, 6943, 271, 5610, 8986, 4572, -727, -3873, -5920, -6970, -8095, -1357, 4341, 5841, 2683, -3826, -5904, 3316, -491, -4857, -4386, -2538, 4131, 2275, -2186, -683, -1449, -4199, -10443, -11786, -3146, 222, -3139, -6448, -7760, -8859, -4040, -304, -1724, -816, 694, 3118, 2672, 1064, -2959, -6359, -5999, -8383, -10067, -6677, -8401, -7585, -7287, -4464, -1813, 4120, 7811, 8780, 4953, 3434, 5371, 5496, 6314, 2697]
4625B697j639L878L81k751j178k099o648k089M214J521M740n734j820M493m472
4610f506J723K183K751L843J808p178r35L701O47l916n84O23K478o301n929R02
4594a0690M494p49L872P423j591j705l269n773k59j267l809j435K045K93L063
4579i357R745M141q529k664R96K69N358m477r06N368J639r52M628m818m804n8
4563d421M75m195K73K720J601q86L637N256k851m685p869j052K91K018r01K168
4547h421j008N926M220p88k266L474l308j00l92j95N241O917L384P13m133q091
4531A173m214n698n86L070P2L543M266k55n346M18L429n190P721L124M097R21
4515A0545n327l036j484J65J284K397j111k055M435L966M181o703j183M934M74
$$ y = [2697, 1058, 4936, 5317, 2566, 1388, -711, -7359, -9448, -5234, -3713, 1027, -4707, -6527, -2034, -6506, -4783, -2600, 151, 3994, 5802, -1376, -2311, 1390, 2037, -1879, -2463, -1840, 638, -5663, -11592, -10690, -6196, -6945, -3073, 4350, 2759, 1054, -2215, -7988, -8247, -9514, -13323, -14758, -12713, -12420, -9357, 388, 4529, -4000, -6664, -5668, -5399, -41, -4518, -5424, -56, 1583, 631, 5259, 441, -4363, -4421, -3946, -8141, -7868, -5148, -3547, -4433, -796, 4460, 1609, -3076, -10945, -11997, -11706, -9688, -10589, -8421, -9429, -3503, 717, -71, -2337, 1137, -2171, -2271, -2663, -2858, 2383, 9300, 12684, 13397, 9264, 1173, -3041, -8739, -9325, -6255, -6183, -2640, 1626, 1371, -3975, -3557, -128, -5318, 2403, 5527, 9624, 10545, 5218, 2182, 698, 863, 2147, 4544, 3433, 1378, 5813, 9779, 13960, 7257, 6074, 11008, 11482]
4500A1482J07m922n051M565J537n229r571l314P131K264j313O76K04J574n075
4485d935L921K359K74O586k17j788K847Q59q980m776O769O409O30l103k367j896
4469B592j584M47k858j40o270K528p76j15K825R256R550m329q420R33l763P28
4453F04j267O5p878P85M824R69J273p5k492l315L595K515Q147Q466q404l011k17
4436D584m280K03L335M246k139K755M242k057m938k694N03L797j659n473J865
4421B290L475l458o121m295N889M149j903K232M419n68o849O68O24O29K197l102
4405B76k502O26L86m79J648K486k720q853N042m563j0935N427O669J050L830L344
4389G32K276L322K826j010n000q412o47L635Q37p57n113m046M598P102L557N953
$$ y = [11482, 11589, 6667, 1616, 6181, 7718, 2489, -7082, -10396, -3265, -1001, -2314, -1638, -1434, 140, -4935, -1014, 1345, 1619, 8205, 7988, 6200, 9047, 9906, 926, -3850, 2919, 9328, 9958, 6855, 4488, 2592, 1008, 1455, -1403, -1543, -7813, -5285, -6061, -6176, -3351, 5905, 15455, 11126, 2706, 3639, -124, 604, -663, -598, -8476, -7691, -2867, -1898, -625, -700, -3192, -6507, -2912, -397, 7750, 16216, 7812, 4801, 4584, 304, 507, 3842, 8088, 5949, 8704, 12946, 10889, 5951, 3257, 3760, 7557, 5898, 425, 2290, 5765, 2307, -3814, -8109, -2220, 1929, 26, 2258, 6677, 6109, -740, -72, 552, 1181, 3378, 276, -2226, -1600, -1214, -1693, -45, 2441, -279, -9132, -4090, -8653, -19588, -14161, -7492, -6442, -2612, 732, 3008, 6330, 9156, 8146, 3146, -5266, -5913, -2278, -1441, -2198, -7311, -11357, -6759, 343, 3900, 9853]
4373I853k991j447o450j114L815M958m069p731m565n530L605J1152O847j915j843
4358B575j516l475l128m237m64M958K783N271K345R85k774n152j342O18j577l22
4342d452N386K772j082l155j77R80K513n357p308L019O320J479k777K106j421
4327a154j998j625l622j667N947m16Q83M066k261j654j479L089P656K713n009
4312C469j604M987M2R13j678q12p05k949j388K52j473J833P158J7k613m568J480
4295B361Q288l484q415p239K95N422K077K283k45L51L195J272k179K246o746n9
4279e77N341L350L164n188l565L548n1j660L543K342m086o028R3j868k148K339
4263a451M289M024k72L690j615k131k133l563L627M872k792p719m458k950l80
$$ y = [9853, 6862, 5415, -1035, -2149, 1666, 6624, 2555, -5176, -9741, -15271, -11666, -514, 6333, 4418, 2575, 1059, -2416, -5544, -9781, -10245, -5287, -2504, 2767, 5112, 6097, 3323, -1829, -3171, -2553, -4130, -4452, 934, 3706, 2624, -531, -708, 272, 2785, -2572, -9880, -6861, -541, 938, -1839, 267, -1154, -3152, -4777, -8399, -10066, -4119, -4535, -3652, 414, -1847, -3501, -4980, -1891, 5765, 8478, 3469, 1865, 6852, 6894, 7807, 6129, 5317, 4612, 1663, 275, 527, -946, 887, 8045, 8062, 5449, 881, 2361, 10649, 7165, -1250, -8489, -8194, -2772, -695, 1588, 1343, 1694, 4889, 6161, 3982, 6228, -518, -577, 4764, 8114, 11278, 6090, 2525, 6073, 6022, 4362, 7905, 10247, 6161, 133, 226, -1642, -3790, -1451, 2838, 6862, 6590, 10280, 8665, 6534, 4401, 838, 4465, 9337, 6545, -1174, -5632, -8582, -8962]
4248h962K056J30K71M851P521k032m455k954J589O16k825j731ON26q076p83O930
4231g322L087n13L273L653K037m534j954O84l878Q19j931m984m250L532N986J137
4215e158k048n6l9l742J005L771M612J193L780k064L352M643r027m897J177m2
4199c540p20p47P452M456l331L401J211k386K98L245M209J752M721J04n853l953
4183A0319k271m285J256l058p088J795O472j863o338m580M04P147O76p837k902
4168a2153L580J718L680M912L379M123j818k394k160k239K877J72j162L635L686
4153I836k822j1038l08o086o827K135N987M618K06j520j650J337J619K248N42
4138a723k244p341L630M184n971o08P808P07N81j866o416j441K798N212J0078
$$ y = [-8962, -6906, -6776, -6505, -1654, 5867, 3835, -620, -3574, -1985, -1369, -4194, -5925, -5919, -5393, -13469, -14252, -7322, -4235, -4748, -1475, 2178, 4215, -319, -2273, -1589, -5467, -4648, -6579, -11563, -15813, -12281, -6295, -5158, -7206, -7262, -7301, -11043, -10038, -6267, -1655, -462, 3318, 1254, 4606, 9249, 222, -4675, -3498, -3540, -4260, -5007, 2445, 6901, 3570, 6971, 8182, 5796, 6094, 9339, 13548, 15300, 20021, 20125, 14272, 10319, 8048, 3763, 5019, 1961, -5127, -3332, 3140, 1277, -5061, -9641, -9237, -2090, -1414, -9251, -12153, -8573, -6855, -3175, 1737, 5116, 9239, 7421, 5027, 2867, 628, 3505, 3677, 2515, 6150, 9836, 7014, -4024, -4332, -10418, -17245, -15110, -9123, -4505, -4299, -5819, -7469, -6132, -4513, -2265, -1723, -3967, -11308, -7678, -3494, -9465, -10073, -2265, -1558, -977, -2843, -9259, -10700, -7902, -2690, 7388]
4123G388N011l791j7940j897N539N53K787N849L973m553J448K765j537M30q317
4108b292m086N682N122N20m448k440J464J760L420n552o325m142K838N206M757
4093A484k407n649L342M538j459k782j204k759K937p916l182j438O309N554O968
4078B336O92k695k950R15m816J258L256J131J163m163k003K176j933J570O547
4063B484L823l375r631n69L28J612J683k010K836N54N054p31m882J211k339J339
4047b613J634k336j6l498M607L465k775m645m446N20M482J914l638P168J701m992
4031c468J0701J5919N263o263j0664j1531j377M744k632J521k67J15N750n485
4017B326m653P039L663l912l198m569o01J299P763N1k922j254J705J348o771l34
$$ y = [7388, 12399, 8608, -9332, -11229, -5690, -5137, -2350, 3499, 7472, 2919, 4367, 7132, 5595, 6025, -2292, -6378, -696, 4426, 4946, 498, -1942, -478, 1282, 4702, -850, -7175, -11317, -8479, -3273, 1484, -923, -6572, -3230, 1308, -151, -2933, -4137, -6896, -3959, -11875, -15057, -16495, -10186, -4632, 2336, 3028, 333, -2617, -1702, -6518, -5260, -2004, -873, 290, -3873, -5876, -3700, -5633, -4063, 2484, 6307, 2932, -6699, -7268, -6940, -5328, -3645, -5655, -2819, -2265, 2789, 2058, -2824, -1613, -3952, -2613, -979, -3315, -3331, -6829, -2222, 1243, -1532, -6177, -10623, -10103, -5621, -3707, -7345, -177, 1524, -3468, 7233, 23152, 28415, 22152, 11488, -43, -1420, 3324, 692, 2213, 1946, 2061, 7811, 2326, -2327, 4712, 8375, 4463, 1265, -3304, -3905, -2606, 5157, 5208, 2286, 1032, 2737, 4085, -2686, -3020]
4001c020K089K46M343k022l260j93j019n1j540L371J669k030L353o020l431K3124
3985A5609K1678J306o145k3110j9908j114o17J101J0083M239o753j587n291m60
3971a0969M87K571j757j559q09N837l76M066M925O943j155j0717j861k040n852
3956a2266q44M125L068k164j099j94L023L970n252L568J748o825j080k731l185
3941a6138K3456K8484J734n459j9273k5469n809P797M214N296L016K333L516j625
3927F073J612j049k493j065j148K990J780k729o871J271P499n35o259n334J184
3912e074M609k905p476n014j714N718j813J490L393J1001j137j407m262K699l345
3897e237o356M077J2500N422J960o242j2024k195Q677M069K645J447r994o57L863
$$ y = [-3020, -931, -685, 3658, 1636, -1624, -1817, -2836, -2887, -4427, -1056, 613, -1417, 1936, -4084, -7515, 15609, 37287, 38593, 32448, 9338, -10570, -11684, -12301, -11200, -1117, 3122, -3631, -5218, -10509, -10969, -10482, -7911, -9668, -11227, -12036, -6199, -6575, -2509, 2416, 9359, 8204, -2513, -4374, -6414, -12266, -13110, -8985, -5917, -8081, -9180, -9374, -6351, -2381, -7633, -4065, -2317, -9142, -10222, -12953, -16138, 7318, 35802, 37536, 32077, 12804, -12665, -18474, -10677, -6463, -1167, 1849, 4182, 7698, 6073, 7685, 6636, 4143, 3078, 1930, 4920, 6700, 3971, -2900, -1629, 5870, 5335, -924, -6258, -5074, -465, -3370, -10846, -15860, -17574, -11856, -13669, -12179, -8786, 2215, 1078, -329, -4591, -1892, -5237, -11593, -7516, 4984, 10406, 12366, 6124, -5900, -8095, 582, 4651, 7296, 8743, -1251, -1908, 1955]
3882A955m187O005K971j720j5l642M11q143k605J248j499J703j316M68o40M141
3866d865O61L543j676j05n85m408N815J382q46N82N147K690n448j930J74l955
3850c824p56k565J179j48k67L083O862R41q008L94K275j715j918m342L071L324
3834b414m069p32j28M016l450k598O501O315l968l268K610J489J569O589N704
3819A4166o054l146K904P188j255j0005n169j312P185L583j58q205o828l360j724
3804a2190N319L952Q206K872r72J126m973l037L055J574Q81J298j31p932j799
3789b751J333M444m845m793J156o47L237K486J968j650m471o313k17J146L504
3774f413K289n917l050P423N821l677P6J560J299j932j399K228j658k785K333
$$ y = [1955, -2232, 3773, 6744, 5024, 5009, 1367, 1778, -6365, -8970, -7722, -9221, -7518, -8834, -8366, -9006, -4865, -4204, -661, -2337, -2442, -3027, -7435, -1620, -238, -1084, -502, 4645, 7335, 1887, -43, 131, -3824, -4580, -7145, -5966, -6114, -6381, -3298, 3564, 4505, -3503, -3109, -834, -2549, -4467, -8809, -5738, -2414, -6483, -7215, -7343, -3327, -6777, -9375, -2874, 3441, -527, -3795, -1185, 304, 1873, 8462, 14166, 8112, 4966, 7870, 15058, 13803, 3798, -1371, -2683, 4502, 8085, 7927, -278, -7106, -10466, -12190, -6871, -2919, 5287, 8159, 7187, 8313, 3340, 303, 3358, 4932, 5813, 7111, 6980, -952, -2751, -1418, 3026, -1819, -6612, -5456, -6103, -2866, -380, 1588, -62, -4533, -10846, -11063, -9917, -6413, -4124, -10041, -13091, -5668, 153, -3524, -3448, -1888, -589, -2521, -3920, -1692, -3350, -6135, -3802]
3759c802J500k040O612J76p68k624K929L820j211l859l649M413j22k20K1k665
3743a489p56l892J161M783L853O292J796r807q35K76p582l517K125L831K133J7
3727a611j598K809Q473j483j1339m0l445J997K993J611J588j91O61m693N40J167
3711b561M880l388l209N67J304K424q48O1O140J615m865p748O399K019l638q139
3695h987L074K270K158q754m819J1572Q845l7k118k50m322L076r26k046j1329
3680a2593l468J0087L236M014O034m394o696q731R061J3443Q10j839q90P481k69
3665A5286o404n271J368j670j972p068K743M897k969r68k907N26j368m012n656
3650a5445L909M424O983K911m970N35L954k559Q11o804J155N163L148O075n006
$$ y = [-3802, -2302, -4342, 2270, 2446, 1678, -946, 1983, 5803, 4592, 733, -2916, 1497, 1375, 1155, 1176, -1489, -2245, -6137, -4976, -193, 3660, 9952, 11748, 1941, 1106, 1382, -6200, -9717, -7592, -3761, -1628, -1611, -3209, -400, 8073, 6590, -4749, -4789, -8234, -6237, -3244, -1633, -45, -236, 425, -4268, -3728, -2561, 2319, -1069, -4278, -3711, -2407, 17, -831, -770, 5370, 6985, 2120, -5628, 771, 2790, -848, -8987, -5913, -3643, -1485, -10239, -15058, -3486, 5359, 5322, 3204, 2954, -1368, 1708, 782, -1264, -12593, -16061, -5974, -2738, 1276, 7310, 2916, -3780, -12511, -3450, 9993, 10803, 8964, 8074, 15555, 15286, 8882, 3611, 4979, 3309, 1337, -5731, -2988, 1909, -1060, -2028, -4935, -4409, -5777, -9789, -15445, -11536, -7112, -129, 2782, -2188, -1653, 2301, -258, 553, -6251, -5096, 67, 3215, 9290, 4284]
3635D284k172j202l406L402M124l068J653L275k279p79k971k539J0469N680j054
3620A3417J303j783L373K287l89m397j0578k457J460m591p573m386N793O38R26
3605f957K669L613N740M084j505j111l935m397O98j583M6N53l954l840N0J319
3589h510J222O686Q269o030o494j87o42l418J675L287p98l122L178Q131J596l659
3573A184l403J550N917l353r48O162L415l870j012K106r880l743q51J079M089
3558a558O452l177L578q73Q26J391L635N31l980l270n342J712M594k951J939j441
3542B066m824l931m745L610L324K717k104p95O32j377J755l301l713K008J648
3527g030M858O87j120j900O280M862j092J496R1j383l42o349k182J328m293k307
$$ y = [4284, 2112, 910, -2496, 906, 5030, 1962, 3615, 6890, 4611, 3832, 861, -1678, 8791, 14471, 13417, 14720, 12937, 16310, 18597, 18208, 13811, 3233, 776, 2236, -2355, -9928, -14314, -8521, -7883, -6957, -4288, -675, 5065, 9149, 7644, 6533, 2598, -1799, -1101, -2684, -2638, -2085, -6039, -9879, -9829, -8510, -7288, -602, 7667, 1637, -4857, -5044, -5686, -9104, -7429, -4142, -4940, -8062, -4884, 3247, 4843, 1184, -2219, -669, 5248, 1895, 947, 7109, 10524, 6654, 5642, 7748, -2132, -5875, -6726, -5647, -1558, 4894, 1717, 5295, 4422, 5248, 6639, 10274, 10805, 6825, 3555, -1787, -75, 4519, 1568, 3507, 2066, -2758, -6689, -11434, -7824, -4500, -1783, -3887, -4682, -4050, -5427, -3672, -6973, -10686, -8678, -7030, -2172, -1485, -2605, -4505, 1775, 6637, 5545, 7041, 7132, 5749, 5407, -942, -3124, -1796, -6089, -8396]
3511h396N997k96n810J823L749Q00M647N87l841j143M98j486J0165P5m861K221
3495D729L307j712p588N897m635p85O43l653N101j118n668J826M420m512n143
3480h891O576K609J382j545p126j584l296J0278N614m514k532m774p062j25J0885
3465d105l995k469j907j18J209N154R95K380L828k042o93O06j139P155J889j23
3449F625l378M90Q03J158l085L42j270n289k749L282N654l181M273N899k309p358
3433i3j304K139J247L302K038m255k846m35m920J221J857j203N562M451J811J785
3417A0357j663n693o875j818n62n854k06L776O571J621n835l282N504L505j552
3402b006n434M074J92j570l26n79M729M409p289l843J086j596M232l519J146J999
$$ y = [-8396, -2399, -2695, -8505, -6682, -2933, -2133, 2514, 3101, -740, -1883, -1385, -2871, 7294, 7369, 2508, 4729, 8036, 6324, -1264, 4633, -2, -787, -144, -3797, 1304, 186, -5482, -3656, 764, -3748, -8891, -2315, 294, 1676, 131, -6995, -8579, -11875, -1597, 4017, -497, -3029, -7803, -14865, -14990, -4105, -8100, -10569, -12476, -12594, -11385, -6231, -5236, -2856, 972, -1070, -1763, -1157, -2296, 4859, 6748, 6625, 3247, 3737, 4540, 5698, 2613, 2955, 1685, -3604, -6353, -3071, 2583, -598, 3675, 9574, 7265, -93, -1397, 742, 1989, 5291, 7329, 3074, 228, -207, -5127, -3906, -2049, -3252, 2310, 6761, 8572, 10357, 8694, 3001, -3874, -5692, -6254, -12108, -12314, -8538, -1967, -346, -6181, -9463, -3959, -454, -2006, -7440, -3366, -3174, -4744, -5070, -5649, -920, 3489, -3800, -7643, -6557, -8153, -3921, -7440, -6294, -4295]
3386d295m536l060M875N014L145k191N601j541o654l637j125M236R85L037J0073
3371I927j820r373J366j475m24O885k183j0766k757J659N326J692q6N474K117
3356E562q703j2107P520P140P43r23k081m137l670J91P191K307k656P089j796
3341A670l695J659j187K477L475k317k712M121K789J523n412p194M37j360l344
3326i070N69J905L254k747n737M53k987k425N386O467P357O74K081M22O80k538
3310C744j924L533J436p920L827L104J049q97l142N57k645p802K761K915J204
3295b00j389N31j81j562n366j288L12P090O996m77j020j50J490J472J75j439l333
3278A661k121K892L204l661L824k149n828N527L029q236k730O007k091P11J121
$$ y = [-4295, -8831, -11891, -7016, -2002, 1143, -1048, 4553, 3012, -3642, -7279, -8404, -4168, -3183, -146, 9927, 8107, -1266, 100, -1375, -1799, 5086, 2903, -7863, -10620, -8961, -3635, -1943, -2029, 3445, 5562, -3141, -15248, -7728, -588, 155, -768, -2849, -6986, -10656, -10465, -3274, -967, -3623, 3466, 1670, -2025, -366, -1553, 924, 4399, 2082, -630, 3491, 6280, 7803, 2391, -4803, -4366, -5726, -9070, -8501, -6596, -3342, -6089, -11826, -11373, -14360, -16785, -11399, -4932, 2425, 3099, 5180, 5602, 6282, 3744, 1820, 5353, 6789, -1131, 2696, 5800, 6849, 5952, 2810, 3367, 722, -7080, -4319, -1404, -200, -1589, -1058, -1239, -2801, -8167, -9455, -9143, -2053, 4943, 4466, 3446, 3296, 4786, 6258, 6433, 4994, 1661, -460, 2432, 5636, 1975, 5799, 3650, -2178, 3349, 6378, -1858, -4588, 1419, -672, 39, 1160]
3263A160M542l176m989l440l299k321K634Q55k995L66N05R51L981L660n36J327
3247g75l469k473j921K839m22K913K626L669j270l728l096O45N95N244O996N136
3231A3509m324l056j591J937K386K551M017k311r294l116k182Q86o194r27M177
3216c532K361j330K36R598k468n090p060l396J793N252J437o17L025K643K160
3201E012j130j030o306o064J577O95j119M138M73k277j099j997P46k64L18O953
3185a374J107k10o421n658J797L528o02O174L008l979J470m54M864l84j060j172
3169F34K207l22J35O43L434l613n105m627o225M79K557L879J921k097O59l272
3153h713k18j64N446O292j836k404j268L573m73K104p09k71o674o125L617L461
$$ y = [1160, 5702, 2526, -2463, -5903, -9202, -11523, -8889, -8034, -11029, -10663, -10158, -9207, -5226, -1566, -2102, -775, -4244, -6717, -8638, -5799, -6221, -3308, -682, 2987, 1717, -2011, -5107, -4462, -3867, 1377, 8373, 13509, 9185, 6129, 4538, 6475, 8861, 11412, 15429, 13118, 3824, 708, -1474, -588, -6782, -7709, -3532, -1171, -2501, -2265, 7333, 4865, -225, -7285, -10681, -8888, -3636, -2199, -2816, 209, 2852, 5012, 3882, 2852, -3454, -9518, -7941, -7246, -8365, -4227, -3754, -6031, -7130, -9127, -8381, -8645, -8327, -1374, -267, -477, -6898, -12556, -10759, -7231, -7833, -1659, 1349, -2630, -1160, -1614, 3250, 2866, 1806, 634, 2841, 2519, 2654, 3297, 6731, 3118, -1987, -6614, -12839, -12360, -9803, -5924, -4003, -6100, -5441, -8713, -8931, -9095, -3649, 2643, 807, -1597, -2865, 708, 235, 2339, 1630, 1359, -5315, -11440, -7823, -4362]
3137d362P964O848r74j0478n507m631n831L835P987L512j961m66m038K330K45
3122e527k139j927P864O996j088j296k063O42J23m242m823m565P76k048O83J728
3106a0906N359O976J940l242l917k791J300j384j463m759L904N210o52L96M077
3091D8N910k977l479Q98n699O086J598l533L00K29R592K868k537l724K746J936
3075A0262n430l433j502j450m725J543Q73J184k864P22M187O748r94O66K050j326
3059F511l058M19K137K823K665k592k722l28m979m791R97L299K509q96M062l964
3043B092j294M662K325m932k490J912N78N517K215m818m859K552j71L734J260
3028H283r89o385L267R98l540K96L151l383p200l440O360L926N69k757o839N780
$$ y = [-4362, 3602, 10450, 9476, -1002, -6509, -11140, -16971, -13136, -5149, -1637, -3598, -4064, -8102, -5772, -5527, -7666, -9593, -1729, 5267, 4179, 2883, 820, 1462, 1585, -2657, -7480, -12045, -11269, -13317, -12634, -10906, -5547, 1429, 3369, 127, -3790, -6581, -5281, -6665, -8128, -12887, -8983, -3773, -4425, -4029, 48, 5958, 2981, -498, 400, -5299, 787, 2385, -1148, -848, -619, 8973, 11841, 9304, 5580, 8326, 10262, 4832, 1399, -103, -1553, -6278, -4735, -3862, -2678, -5542, -4820, -633, 6115, 5121, 5787, 7837, 6511, 3453, 3872, 6009, 8832, 11497, 8905, 6183, 5855, 876, -3915, -2918, 381, 2890, 1994, 6056, 2092, 798, 5460, 7785, 2853, 363, 2275, 2853, 8370, 10585, 5767, 908, 3460, 3289, 7023, 8283, 7294, 909, 4176, 5174, 1634, 1930, 5081, 1698, -5502, -8942, -2582, 1344, 1913, -844, -7683, -1903]
3012a903O699J034l260M409O930J53l094p163K26L252M93P498m41m512l227k553
2996D541J203m914n60l197j314M956J523K109K352m480Q13J693J931j547o835
2981a726O8j038n188m134J934O865K317P76J204J652k934K847K103K026J331K148
2965A0251J228L532n858q507m348M440J393j627r03L21O95j64r69N14j334l602
2949d938J894P127m134j356L18M492j818j692K981j47j857l665J582Q141O163
2934A3091p679k671J73j761J590K037q601n027l034k156k455L884Q175l592P593
2919d33J834j237M920N35q52l577m291j23J802l128m39l197J377N655R68m089
2903d275L788P320N851k44k482K129m30k344r867o633M735N743l575K991O63J16
$$ y = [-1903, 4796, 5830, 2570, 6979, 13909, 14062, 10968, 3805, 4031, 7283, 7776, 15274, 14833, 10321, 7094, 4541, 5744, 830, 270, -2927, -4241, 715, 2238, 4347, 6699, 2219, 3032, 4725, 6656, 5109, -1726, -1658, -2696, -7884, -12018, -10084, -3219, -902, -126, 1078, 2730, -204, 2643, 4746, 6772, 8103, 10251, 11479, 15011, 9153, 646, -3702, 738, 2131, 504, -399, -78, 617, 453, -516, -2, -1336, -4938, -3044, 4083, -51, -1407, -1089, 3403, 1585, -107, 2874, 2727, 870, -2795, -1213, 6928, 13091, 5412, 2741, 2914, 1153, 2743, 4780, -3821, -8848, -11882, -14038, -16493, -12609, -4434, -8026, -433, 1401, 164, 5084, 5619, 4767, 1190, -3101, -3224, -1422, -4550, -4989, -8186, -6809, -1154, -186, -4275, -487, 6833, 12684, 12440, 9958, 12087, 11657, 9313, -554, -7187, -2452, 3291, -284, 2707, 3370, 3486]
2887C486p502k445N38K45J990J781l326j955l65L303L907o874l972M381J769L331
2871a708j805q86J208M907k639j182N159L9K983L451l128o418q943l344R644M675
2855B013q329q102j68P774O292J834L881K240o81o8j772o970L396K170J825M55
2839E790k144k638J719K692k389o784l305k766k662L081P138N822r1k670j322
2824e29P551p74r033l305K697P4R63m182o881m48P152J0811N591O0m983m062l24
2807C78k347M89K047j801j92J176L969n051n923J181M835N72l102O946j480n666
2791c969j325J223J254k429M162k163j966J933K433K858j509K983J694Q89L533
2776I601l700p862k684Q10J973K102k620j77p27J574J426j31N37q03p57K409J732
$$ y = [3486, -4016, -6461, -5923, -5678, -3688, -1907, -5233, -7188, -7553, -4250, -343, -7217, -11189, -6808, -5039, -1708, -3513, -4399, -3191, 1716, -923, -2105, 3054, 3093, 6076, 9527, 6399, -19, -8962, -12306, -2662, 2013, -6316, -14418, -14586, -6812, -520, 1314, 5195, 7435, 6754, 6686, 4914, -2056, 1340, 3510, 5335, 5790, 3646, 1008, 2727, 5419, 3030, -3754, -7059, -9825, -12487, -9406, -2268, 3554, 3463, 793, -529, 7022, 6248, -2785, -6090, -3393, -3319, -2356, -6538, -13419, -13867, -6715, 4096, 9687, 9747, 4764, 702, 378, -1969, -1480, 567, -1234, -1426, -250, 3719, -1332, -7255, -6074, -1239, -667, -3769, 3177, 1697, -3969, -5294, -4071, -2817, -5246, -1084, -3247, -5213, -3280, -847, 2011, 502, 3485, 5179, 6068, 9601, 5901, -1961, -4645, -3835, -1862, 240, -2380, -2557, -3284, -1710, -284, -415, 122, -681, -1438, 971, 2703]
2759B703J412l445k270k07K146m645J917N563p042o010M436P51j673K302J731
2744b331L891j540K1J345m944j669K469O213m50l025m767k023M858J415N187K285
2728F935l628l420k247J690j841N47n54K402R36J139j317K572J045K398N960K428
2712A5045L875l015p801o948l586L435n45m350M901J0327m780K129k121j957j677
2697B932o454j915L231O73k38K897L258K257l258m65L153k77k912k722O42j220
2681d18J260k550m265P139J35j618M704k030L663q14m119k50o7P159J660o344
2665C245k524N427m871l965K408M454K360p61k821k916k142N486j976j1502J328
2650h770M34K187M717M527k591k79m614k258O673O013J909q654k024L147Q49j499
$$ y = [2703, 4115, 670, -1600, -1807, 339, -4306, -2389, 3174, -3868, -9878, -5442, -4691, -6364, -4062, -2331, 1560, 20, 41, 1386, -3558, -5227, -2758, 3455, 3005, -20, -4787, -6810, -1952, -537, 4650, 6935, 3307, -113, -2360, -670, -2511, -1964, -2518, -116, 820, 1959, 642, 3214, 4259, 6657, 12617, 15045, 18920, 15905, 8104, 1156, -2430, 1005, 460, -3890, 1011, 11338, 6558, 8687, 6566, 4609, 2932, -3522, -5437, -2206, -1533, -1771, 1126, 4384, 6641, 3383, 2918, 6071, 5794, 2882, 160, 802, -418, 842, -1708, -5973, 1166, 1301, -317, 4387, 2357, 6020, 5206, 1087, 837, 770, 7929, 9589, 3245, 721, 6148, 1277, -2688, -280, 4174, 6534, 5773, 2952, 36, -2106, 3380, 1404, -10098, -8770, -8336, -6149, -1432, 3095, 504, 225, -4389, -6647, 26, 6039, 7948, -706, -2730, 417, 1266, -233]
2634b33q46l80Q06K911J551j40M73k995m921K005M412k021q11J78Q889n11L251
2617A1618n263o759j381J513O169l603l535N553l535J378J777K188L63k364N2
2602D171J977k929J781j646K763o219m208m370R10K655J663N580M215k834J47
2587C656l950j484J631k603j405J721O390L269j838l579l353k437M293K176o11
2572A876q254K262k963j141J38l648r18J951P824O572J472j848O297N80m94o11
2556I095n053J875l884l531l235n427j486M270P605Q117Q76O19j124n636O77l38
2540C420J20m3l078m77k307o52K746m92K709L660R99R71j141m440m109P85L377
2523B048k432j342M24j094m47j136m86O16O150n4j244j289n993J774N301L170
$$ y = [-233, -1079, -1459, -653, 2258, 3809, 3669, 4142, 1147, -3774, -1769, 2643, 622, -189, -11, 8878, 8367, 11618, 6355, -404, -1785, -272, 5897, 2294, -1241, 4312, 777, 2155, 3932, 6120, 6483, 4119, 4171, 6148, 3219, 5000, 3354, 6117, -102, -4310, -8680, -7770, -5115, -3452, 2128, 6343, 3509, 3656, -294, -1778, -147, -2750, -4155, -2434, 3956, 7225, 5387, 1808, -1545, -3982, 311, 2487, 1876, -6378, -4116, -7079, -8220, -8082, -11730, -12648, -10697, -2873, 3699, 5171, 3323, 9620, 10200, 9706, 9095, 4042, 5917, 2033, -1498, -4733, -10160, -11646, -7376, 229, 8346, 9222, 9841, 8717, 3081, 3758, 3420, 3540, 3497, 419, -58, -2365, -3017, -271, -763, 1946, 5606, 6605, 7576, 6435, 1995, -2114, -1329, 2048, -384, -1726, -1302, -2396, -2843, -3979, -4465, -3849, 2301, 2247, 1003, -286, -6279, -4505, 796, 3966]
2507C966k595J538l77J025l718m245n113o26k541j115O076O842K083L248J647
2492F095j665r07j784k84m636k054N07R95L681K123j844n615J754N82J968k03
2476a287l950K60j129K658J16j593q02R16O14Q54N244K581M232m204J973n588
2460H95m524j414l706L029K518L923o50p702k848O510N622k354J868J340j371
2445A136P91n219o773q35J435L918l03j193P530K216j182L535P550m279k38q385
2429b96q637K727M981R371q462o393q47m77O150M112n052R80k117k82L436P74
2413c2O89k619L406L674K299j4L06n584j850n541Q8L949m551m37P059n486n517
2396a0161j927j214N529j719M533K31p907k30J457Q512L284o53n416K603k442
$$ y = [3966, 1371, 2909, 2532, 3557, -161, -4406, -9519, -10145, -12686, -13801, -7725, -883, 1200, 4448, 6095, 4430, 3523, 1739, 1455, -3181, -5235, -4728, -3733, -52, 2071, 227, -5388, -3634, -3052, -1084, -1287, -5237, -4977, -6106, -3448, -3332, -4925, -5727, -4811, -4197, -3343, 1901, 4482, 8714, 4510, 6483, 895, -3629, -5043, -8749, -5720, -3202, 721, 71, -7631, -10479, -3969, 1653, -701, 1167, 2507, 1136, 1927, -3292, -10065, -10900, -9465, -5547, -5850, -7043, 487, 2703, 1521, 5056, 12606, 8327, 8089, -296, -8933, -6206, -1225, 8146, -316, -6709, -7556, -8033, -1883, 2229, -2823, -1843, -3960, -4242, -806, -32, 657, -1962, 1444, 5118, 7417, 7403, 7709, 2125, 275, -5266, -5178, -1229, -5780, -6217, 842, -4644, -10161, -12088, -13302, -7773, -9492, -4959, -4728, -12635, -12865, -11408, -2896, 388, -265, -5681, -3078, -5520]
2381e520R921o37l324n719m112J0077P982J999n672n726m646J306n19J58L906
2366e26O866Q983n86l382k368o994o175J37K948m897o27N034O705P250p282J993
2350G079Q246l108j0114M16M673J484o053L239M110O53K282k282r38n168j414
2335C105O176L921j52l907m531M656M688k807l460k49n584l582R4j093M21q61
2319c165k105J584K573M6j857Q49O260l545m842l801L85Q129L985j72J47m098
2303C73j395j565k878M290Q225k893q383O90L903M2o776K134L951j298l863j657
2287g100M414N689N542l128q334L598L130k112l890J747k722J159l920L177O629
2272C879J4j939j50J784l895j486j467K973j956J511P838J679O13j409M262k037
$$ y = [-5520, 4401, 3764, 440, -5279, -9391, 686, 8668, 10667, 4995, -731, -5377, -4071, -4590, -4432, -526, 6340, 15323, 14737, 11355, 8987, 1993, -4182, -4045, -1097, -5994, -6621, -1587, 5118, 12368, 5086, 7079, 15325, 12217, 2103, 2519, 7192, 8676, 2623, 5862, 9972, 10625, 12907, 10625, 9687, 4519, 3105, 9281, 13202, 13050, 9143, 4612, 9268, 13956, 11149, 7689, 7440, 1856, -1726, -1632, -2725, -2304, -3165, -5270, -3686, -1113, -1067, -2924, -2075, 4185, 640, -4202, -8003, -7618, 511, 4496, 4324, 4471, 373, -1022, -2587, -5465, -1175, 7050, 4157, -4226, -3536, 367, 409, -6367, -4233, -282, -1580, -5443, -7100, -2686, 3003, 8545, 5417, -2917, 681, 3811, 1699, -2191, -444, -3166, -2007, -5927, -2750, 3879, 3893, 1954, 1804, 3588, -307, -1793, -3260, -287, -2243, -732, 7106, 8785, 9398, 7989, 12251, 10214]
2256A0214k61k053K673M192j109m834N76k693n347n927J3K090k716n285j78M240
2240f405N370R74k64k078M898J606n930p855k183N027K486q21K698N555m295J726
2224E09Q73L712J051J316l145j38J113O85j554l193l60p27R500O785l886p684
2208D857j1178R35R174K314m629l084J379K271l634P09N116q58n60n705P4K728
2192i1J594J053K345M501Q54l031l631L082m655K329L075Q10K983n61q226k135
2176B96N013J518M771n50m455m019n081J087Q14L704O768J069q179l417J602k385
2160a444k148Q38O33j659K22K641P116j860k92L970J970n863o50j300j057j486
2144c69Lk225m768J377Q409O99L973P167Q330k955k922o308j2732m213J976K776
$$ y = [10214, 9953, 7900, 10573, 14765, 13656, 8822, 9398, 6705, 1358, -4569, -4556, -2466, -5182, -10467, -10645, -6405, -1035, -61, -325, -2403, 2495, 4101, -1829, -9684, -11867, -6840, -4354, -5175, -2477, 3078, -1217, 509, 1382, 5094, 6145, 7461, 4316, 4178, 5291, 5976, 4422, 1229, 869, 142, 9642, 16427, 12541, 4857, -6321, -5386, 3788, 6102, 1473, -1611, -232, 2039, -1595, -886, 4230, 3372, 2812, -2893, -2819, -91, 1503, 2556, 4901, 9402, 10256, 7225, 3594, 6676, 2021, 4350, 7425, 8235, 11218, 10657, 2431, 296, 5309, 6827, 11598, 11048, 6593, 2574, -2507, -1420, -606, 3098, 9866, 10935, 2756, -661, 941, -1444, -3592, -2754, -2121, -3780, -3558, -917, 6199, 4339, 4047, 8017, 9987, 4124, 3474, 2174, 1117, -369, -366, -2591, -7359, -5982, 2427, 3126, 7099, 14266, 22596, 19641, 16719, 10411, -2321, -6534, -4558, -1782]
2128a782j72l792L452N972m706j08m578n205L481O566o134k839M533O121r32l109
2112c232L079K052j438o971P089Q524o561r843p16M418N040o67j318k745k661
2097e950o17L621n55K428k908J657k878l81J275L111L123L50l909K944L090p299
2081b898q329O871O840J252q868n073N799K636j533K003L702l541K401j63J711
2066B810J60o794k439Q38j328j821J551M708j224L712L366k954p90J331j64K16
2050A178r17j553k424R79j780m065k839N55N238J1978N997m140r2o701k689K218
2034I43n067P15p12L484P097P728N234n299m173k638q165N077J388J146M151N327
2018A6236j488j903l760j2734m304N583L232p83m655K771M509M775K793R2N625
$$ y = [-1782, -1954, -5746, -2294, 3678, -1028, -1136, -5714, -10919, -7438, -872, -7006, -9845, -5312, 809, -123, -3232, -153, 1899, 461, -6510, 579, 9103, 2542, -7301, -8017, -3599, 1441, 774, -544, -3289, -5950, -6567, -2946, -3501, -1073, -3981, -2324, -5202, -5583, -4308, -1197, 1926, 2276, -1633, 1311, 4401, -2898, -11227, -4356, 2484, 3736, -5132, -10205, -4406, -1770, -3303, -1300, 2402, -1139, 1262, 1099, 2810, 2970, -3824, -6263, -5425, -6753, -8574, -7023, -2315, -3539, 173, 3539, 585, -205, 1126, 962, 1178, 261, -1292, -3716, -2737, -4517, -8582, -11421, -10866, -5628, 6350, 12347, 8207, 8115, 1414, -1275, 943, -4124, -3409, -4121, -637, 6460, 14188, 19422, 14123, 9950, 7312, -853, 4224, 5612, 6758, 10909, 16236, 14748, 12845, 9085, -3649, -7953, -2370, 862, 79, -4576, -1805, 2704, 7479, 10272, 10364, 15989]
2003A5989Q71m85O96n31l145n388k652o045M135J303k260r06p456l023k332J987
1987i242M251j054K726K576K316k44K032K887o6M462l74l896q788l712Q8L656
1971b382o68N160O197q13j970P03m21k481m803N583J4509L280l420k54j723J870
1955A8367k462p160m723k354K76m096P97O581r58o604n841N477J638L016Q187
1940A0141J862m390k738L682M362p406k171J237j25P375j310n826n231k215K017
1925g36J477j933N888J441k367K305R08l02p040j895N171N067j474n161j97M08
1909A560K308N474m52l565m308m755n42K959N156J181j89n90L550N99r40j552
1893E894p078j079k743L586K270l12Q77J775n021j715N582K864N132K125k80k805
$$ y = [15989, 16860, 16375, 17071, 16540, 13395, 8007, 5355, -690, 3445, 4748, 2488, 1582, -5874, -8897, -11229, -9242, -4991, -6045, -3319, -743, 1573, 1329, 3361, 6248, 6182, 10644, 10270, 6374, -2414, -6126, -6038, -2382, -3050, 2110, 8307, 7494, 5524, 6227, 5806, 3325, -1478, 4105, 18614, 21894, 18474, 18220, 16497, 18367, 15905, 8745, 4022, 1668, 1944, -2152, -1355, 5226, 4268, -2336, -8177, -2700, -1062, 1954, 10141, 12003, 7613, 4875, 8557, 12919, 5513, 3342, 4579, 4454, 11829, 10519, 4693, -538, -2753, -736, 741, -1192, 4696, 6137, 3770, 6075, 6983, 6681, -359, -2254, 2917, 7984, 6510, 1349, 1152, 1560, 3868, 9342, 8890, 5325, 1017, -3738, -4280, -1321, 3835, 5016, 4827, 4237, 7787, 8386, 7446, 5894, -1184, -2263, -5006, -1420, 850, 538, 1415, 3190, -1831, -3546, 2036, 4900, 10032, 12157, 11877, 9072]
1877I072j518k797j217r988J029K309K648M683k981l149j807P585J256k741k714
1862c30k548K906j051l930J849M607J576J994o56l059k415m578m405J914L815
1847d311P592M761j180L081m769m394l829m252L851N435K155P24m056PK385k063
1831A137M579n40N0m117j431L611J266J970L668o876o586l985l890K276K967j417
1815g318K849P381L607k772p363j581N847L190r12l573r92Q21k33k451K56M527
1799A283K800n264k626m431n187k324K126R18L111K886l066j426M291M079j808
1784d638p36J398k210l78M337O815P32L185K313n330k324o75m641M196j08j086
1768H50L342l520l423P459J852L423q21P12j389k276Q41M14K654K026l409O53
$$ y = [9072, 7554, 4757, 3540, -6448, -5419, -3110, -462, 4221, 1240, -1909, -3716, 3869, 5125, 2384, -330, -2878, 28, -1023, -4953, -3104, 1503, 3079, 5073, 4417, 1358, -1057, -5635, -10040, -8126, -4311, 3281, 8042, 6862, 9943, 5174, 780, -3049, -7301, -3450, 1985, 4140, 4864, 808, 815, 3200, 1137, 5716, 5176, 5226, 1109, -322, 3289, 4555, 6525, 10193, 3317, -3269, -7254, -11144, -8868, -5901, -7318, -4469, 2912, 6519, 3747, -3616, -5197, 650, 3840, 2928, -645, -1637, -816, -1049, -3500, -3244, 1283, 4083, -1181, -3807, -8238, -13425, -15749, -13623, -12705, -9594, -6708, -9774, -11200, -6909, -2830, -4638, -5374, -3976, -6186, -6564, -2227, 4588, 5320, 8505, 10818, 5488, 3164, 2489, -2152, 2044, 1936, 850, 4192, 672, -2751, 4708, 6560, 9983, 9162, 9874, 8485, 6209, 7050, 7464, 10118, 12144, 8735, 9388]
1752I388J601M579j75q133o353p243J102K863M17n229l431L394K241l393R96O916
1736d60n894k702l563N103J2553M113m565l553M404R225O96p818l688k032o83
1721A136K421K629L031j704k807j239n371k394M986L83k563r39l46K643O39r07
$$ y = [9388, 10989, 15568, 15393, 7260, 907, -6336, -5234, -2371, -1954, -7183, -10614, -7220, -4979, -8372, -7376, -460, -6354, -9056, -12619, -7516, 5037, 9150, 4585, 1032, 5436, 14661, 15357, 7539, 3851, 1819, 1136, 3557, 6186, 9217, 7513, 4706, 3467, -1904, -4298, 688, 1071, -1492, -2431, -2777, -134, 505, -402]
$$ [...]
##END NTUPLES=NMR SPECTRUM
##END=
