##TITLE=Analysis number 312888
Compound Code spb 02171
Project Code adrs
Chemist Name ugmt
##JCAMPDX= 6.0         $$ Bruker NMR JCAMP-DX V2.0
##DATA TYPE= NMR SPECTRUM
##DATA CLASS= NTUPLES
##ORIGIN= Bruker BioSpin GmbH
##OWNER= NMR
$$ XWIN-NMR		Version 3.5
$$ Wed Aug 17 11:58:43 2005 GMT Daylight Time (UT+1h)  MAYBRIDGE\NMR@NMR_250MHZ
##.OBSERVE FREQUENCY= 250.131544655141
##.OBSERVE NUCLEUS= ^1H
##.ACQUISITION MODE= SIMULTANEOUS (DQD)
##.ACQUISITION SCHEME= undefined
##.AVERAGES= 16
##.DIGITISER RES= 18
##SPECTROMETER/DATA SYSTEM= dpx250
##.PULSE SEQUENCE= zg30
##.SOLVENT NAME= CDCl3
##.SHIFT REFERENCE= (INTERNAL, CDCl3, 0, 16.522)
##AUDIT TRAIL= $$ (NUMBER, WHEN, WHO, WHERE, WHAT)
$$ ##TITLE= Audit trail, XWIN-NMR		Version 3.5
$$ ##JCAMPDX= 5.01
$$ ##ORIGIN= Bruker BioSpin GmbH
$$ ##OWNER= NMR
$$ C:\u/data/dgb/nmr/ADRS/8050/pdata/1/auditp.txt
$$ ##AUDIT TRAIL=  $$ (NUMBER, WHEN, WHO, WHERE, WHAT)
(   1,<2005-08-17 11:58:23.79 +100>,<MAYBRIDGE\NMR>,<NMR_250MHZ>,
      <created by zg, POWCHK disabled, PULCHK disabled
       configuration hash MD5:
       62 19 C7 07 E1 42 D1 B7 37 6C 3D D0 77 39 F9 E6
       data hash MD5: 64K
       B1 75 E3 F7 5C 1A 83 D7 D2 79 88 1A 28 58 38 CC>)
(   2,<2005-08-17 11:58:34.73 +100>,<MAYBRIDGE\NMR>,<NMR_250MHZ>,
      <Start of raw data processing
       ef LB = 0.3 FT_mod = 6 PKNL = 1 SI = 32K 
       data hash MD5: 32K
       5D D7 9C 12 AF 01 A1 87 BF 8A A7 ED B2 9F 67 EB>)
(   3,<2005-08-17 11:58:36.51 +100>,<MAYBRIDGE\NMR>,<NMR_250MHZ>,
      <apk 
       data hash MD5: 32K
       A9 93 84 55 B7 63 CF 3F C9 6A FD D4 11 10 E0 AA>)
(   4,<2005-08-17 11:58:37.21 +100>,<MAYBRIDGE\NMR>,<NMR_250MHZ>,
      <abs ABSG = 5 
       data hash MD5: 32K
       9B 5D 4D 70 A8 AB F4 B7 3D A6 65 25 5A 3C 2D 00>)
$$ ##END=
$$ 
$$ hash MD5
$$ 3B 2A F4 D2 2F 66 F7 EA 75 6E 59 78 67 D8 56 16
##$RELAX= 
##$RELAX= 
##$RELAX= 
##$RELAX= 
##$RELAX= 
##$RELAX= 
##$RELAX= 
$$ Bruker specific parameters
$$ --------------------------
##$DU= <C:\u>
##$EXPNO= 8050
##$NAME= <ADRS>
##$PROCNO= 1
##$TYPE= <nmr>
##$USER= <dgb>
##$AMP= (0..31)
100 100 100 100 100 100 100 100 100 100 100 100 100 100 100 100 100 100 
100 100 100 100 100 100 100 100 100 100 100 100 100 100 
##$AQSEQ= 0
##$AQ_mod= 3
##$AUNM= <au_zg>
##$AUTOPOS= <18 >
##$BF1= 250.13
##$BF2= 250.13
##$BF3= 250.13
##$BF4= 250.13
##$BF5= 500.13
##$BF6= 500.13
##$BF7= 500.13
##$BF8= 500.13
##$BYTORDA= 1
##$CFDGTYP= 0
##$CFRGTYP= 5
##$CHEMSTR= <none>
##$CNST= (0..31)
1 1 145 1 1 1 1 1 1 1 1 1 1 1 1 1 1 1 1 1 1 1 1 1 1 1 1 1 1 1 1 1 
##$CPDPRG= <>
##$CPDPRG1= <>
##$CPDPRG2= <>
##$CPDPRG3= <>
##$CPDPRG4= <mlev>
##$CPDPRG5= <mlev>
##$CPDPRG6= <mlev>
##$CPDPRG7= <mlev>
##$CPDPRG8= <mlev>
##$CPDPRGB= <>
##$CPDPRGT= <>
##$D= (0..31)
0 1 0 0 0 0 0 0 0 0.06 0 0 0 0 0 0 0.0002 0 0 0 0 0 0 0 0 0 0 0 0 0 0 
0 
##$DATE= 1124276302
##$DBL= (0..7)
120 120 120 120 120 120 120 120 
##$DBP= (0..7)
150 150 150 150 150 150 150 150 
##$DBP07= 0
##$DBPNAM0= <>
##$DBPNAM1= <>
##$DBPNAM2= <>
$$ [...]
##$SUBNAM7= <"">
##$SUBNAM8= <"">
##$SUBNAM9= <"">
##$SW= 20.6930455092707
##$SWIBOX= (0..15)
0 0 3 0 0 0 0 0 0 0 0 0 0 0 0 0 
##$SW_h= 5175.983436853
##$TD= 65536
##$TD0= 1
##$TE= 295.16
##$TE2= 300
##$TE3= 300
##$TEG= 300
##$TL= (0..7)
0 120 120 120 120 120 120 120 
##$TP= (0..7)
150 150 150 150 150 150 150 150 
##$TP07= 0
##$TPNAME0= <>
##$TPNAME1= <>
##$TPNAME2= <>
##$TPNAME3= <>
##$TPNAME4= <>
##$TPNAME5= <>
##$TPNAME6= <>
##$TPNAME7= <>
##$TPOAL= (0..7)
0.5 0.5 0.5 0.5 0.5 0.5 0.5 0.5 
##$TPOFFS= (0..7)
0 0 0 0 0 0 0 0 
##$TUNHIN= 0
##$TUNHOUT= 0
##$TUNXOUT= 0
##$USERA1= <user>
##$USERA2= <user>
##$USERA3= <user>
##$USERA4= <user>
##$USERA5= <user>
##$V9= 5
##$VALIST= <valist>
##$VCLIST= <CCCCCCCCCCCCCCC>
##$VD= 0
##$VDLIST= <DDDDDDDDDDDDDDD>
##$VPLIST= <PPPPPPPPPPPPPPP>
##$VTLIST= <TTTTTTTTTTTTTTT>
##$WBST= 1024
##$WBSW= 4
##$XGAIN= (0..3)
0 0 0 0 
##$XL= 0
##$YL= 0
##$YMAX_a= 568495
##$YMIN_a= -593287
##$ZGOPTNS= <>
##$ZL1= 120
##$ZL2= 120
##$ZL3= 120
##$ZL4= 120
##$ABSF1= 16.522
##$ABSF2= -4.171173
##$ABSG= 5
##$ABSL= 3
##$ALPHA= 0
##$AQORDER= 0
##$ASSFAC= 0
##$ASSFACI= 0
##$ASSFACX= 0
##$ASSWID= 0
##$AUNMP= <proc_1d>
##$AZFE= 0.1
##$AZFW= 0.1
##$BCFW= 0
##$BC_mod= 0
##$BYTORDP= 0
##$COROFFS= 0
##$CY= 12.5
##$DATMOD= 1
##$DC= 0
##$DFILT= <>
##$DTYPP= 0
##$F1P= 14.0000005364418
##$F2P= -0.99999901652339
##$FCOR= 0.5
##$FTSIZE= 32768
##$FT_mod= 6
##$GAMMA= 0
##$GB= 0
##$INTBC= 1
##$INTSCL= 1
##$ISEN= 128
##$LB= 0.3
##$LEV0= 0
##$LPBIN= 0
##$MAXI= 10000
##$MC2= 0
##$MEAN= 0
##$ME_mod= 0
##$MI= 0
##$NCOEF= 0
##$NC_proc= -2
##$NLEV= 6
##$NOISF1= 0
##$NOISF2= 0
##$NSP= 0
##$NTH_PI= 0
##$NZP= 0
##$OFFSET= 16.522
##$PC= 1
##$PHC0= 128.9758
##$PHC1= 5.105837
##$PH_mod= 1
##$PKNL= yes
##$PPARMOD= 0
##$PSCAL= 4
##$PSIGN= 0
##$REVERSE= no
##$SF= 250.13
##$SI= 32768
##$SIGF1= 0
##$SIGF2= 0
##$SINO= 400
##$SIOLD= 32768
##$SREGLST= <1H.CDCl3>
##$SSB= 0
##$STSI= 32768
##$STSR= 0
##$SW_p= 5175.98343685301
##$SYMM= 0
##$S_DEV= 0
##$TDeff= 65536
##$TDoff= 0
##$TI= <Analysis number 999999
Compound Code 99
Book Reference 9
Project Code 9>
##$TILT= no
##$TM1= 0
##$TM2= 0
##$TOPLEV= 0
##$USERP1= <user>
##$USERP2= <user>
##$USERP3= <user>
##$USERP4= <user>
##$USERP5= <user>
##$WDW= 1
##$XDIM= 32768
##$YMAX_p= 566587564
##$YMIN_p= -116788
$$ End of Bruker specific parameters
$$ ---------------------------------
##NTUPLES= NMR SPECTRUM
##VAR_NAME=  FREQUENCY,     SPECTRUM/REAL,   SPECTRUM/IMAG
##SYMBOL=    X,             R,               I
##VAR_TYPE=  INDEPENDENT,   DEPENDENT,       DEPENDENT
##VAR_FORM=  AFFN,          ASDF,            ASDF
##VAR_DIM=   32768,         32768,           32768
##UNITS=     HZ,            ARBITRARY UNITS, ARBITRARY UNITS
##FACTOR=    0.157963299565203, 1,           1
##FIRST=     4132.6476996994, 0,             0
##LAST=      -1043.33573715361, 0,           0
##MIN=       -1043.33573715361, -116788,     0
##MAX=       4132.6476996994, 566587564,     0
$$ Real data points
##PAGE= N=1
##DATA TABLE= (X++(R..R)), XYDATA
$$ [...]
22718 2704 784 2698 2777 -801 -1550 -2005 -3225 -4555 -4636 -4265 -1764 -1072 1736 894 -4998 -5236 -2654
22701 -2654 726 -1023 -1227 1680 2220 -1885 -3678 -6638 -8237 -6723 -2897 -1743 -2528 -4737 -5838
22686 -5838 -6078 -3088 -984 -3593 -4078 -2119 -2258 -4005 -5926 -4264 -2096 -2967 -9060 -10055 -8335 -3197
22670 -3197 -1787 -2940 -2408 -1590 -3694 -4188 -4044 -3576 -1645 -1481 -559 -2208 -2937 -3015 -4063 -3776 804
22653 804 3688 1645 1125 866 -992 -778 647 1153 -1041 -3629 -5470 -2187 -315 -1170 -2587 -2167
22637 -2167 1194 1365 -683 2887 4861 -990 -2566 -1498 -1297 92 -2408 -4505 -3949 -524 798
22622 798 2026 2542 586 589 1382 554 -188 2568 401 -4377 -6066 -4253 -4406 -3850 -3451 -5018 -5631 -4203
22604 -4203 -5171 -3378 -2570 -1355 465 2880 5709 3710 3008 3626 4367 1007 -622 -269 525 181 -3428
22587 -3428 -1398 -212 -687 1044 -946 -1882 -2753 -1485 518 898 -830 -2189 90 1890 784 940
22571 940 593 -34 -3384 -4413 -3089 -5653 -7107 -4256 -3548 -1352 1061 114 -45 2718 5890 3278
22555 3278 -982 -4329 -5269 -4773 -5842 -5847 -3539 -605 510 2422 800 -2069 -1802 -412 1516 1422 -873
22538 -873 -886 -730 149 -2343 -3364 -1382 -1563 -2107 -4121 -2166 -2267 -2436 -3059 -1127 -674 1462 656 -1939
22520 -1939 -2309 -1888 -2358 -5000 -3317 -275 -3145 -699 -1117 -79 1625 1787 176 1798 2093 -643
22504 -643 -1980 -744 -1978 226 577 900 -578 -842 1182 -1119 -2678 -2564 -2531 -4662 -3030 -439
22488 -439 -761 -1703 -4072 -3396 -3884 -2243 -116 3723 4269 3897 2839 269 -3308 -2405 -3859 -2037 161
22471 161 1612 5154 5000 5155 5864 2947 205 -1199 -1559 2622 3509 4039 554 -2831 -2860 -955 2105
22454 2105 1334 -663 -404 1639 804 1698 2204 812 -58 -563 598 -1180 -5602 -7804 -4546 -1755
22438 -1755 862 945 1830 -492 -553 2764 3830 3527 3498 4169 2046 -431 -2013 -1202 824 -358 -2887
22421 -2887 -4478 -538 2046 601 -1747 -3873 -5183 -5194 -3861 -4152 -5426 -5960 -2460 -2261 -879 -1140
22405 -1140 -5152 -5825 -5900 -8828 -9192 -6437 -2433 -1160 -2620 -3969 -5416 -2516 -1224 -1164 -2910 -2776
22389 -2776 -214 438 -1523 -1164 -3131 -4168 -2895 -1025 527 -1107 -1756 -956 1602 1877 546 3053
22373 3053 1702 -1344 -2060 2207 4967 4802 5531 4598 960 1507 3161 3668 970 -3591 -2799 -2893 -1806
22356 -1806 -2471 -5210 -4588 -73 2038 1558 2451 -2439 -5761 -5317 -5570 -3427 2631 3710 -2424 -2526
22340 -2526 -2266 -1683 -1272 1005 2975 2327 2540 2982 1573 2425 2187 1474 3599 1454 -2696 -2309 -1293
22323 -1293 95 915 -1240 -761 -1283 -1858 -2665 -4077 -4757 -3500 -1918 -437 -2985 -3025 -2410 -3590 -4217
22306 -4217 -3107 -305 362 1049 3513 4651 1229 -628 -3728 -3073 -3340 -868 -29 -2411 -4711 -1744
22290 -1744 2873 4473 3051 1584 2346 1646 1000 1266 -366 -1720 -577 5388 7902 6002 5342 1223
22274 1223 -1307 307 729 2542 4096 2587 2729 -1144 -2621 -4719 -5299 -4455 -2029 -1077 -3456 -2738
22258 -2738 -2472 -4355 -3699 -5004 -2484 1010 2121 -232 -153 -2226 -6239 -3732 -2218 71 723 1392
22242 1392 -454 -2244 -2044 -2998 -3553 -1007 -802 -962 785 1914 146 957 -1134 -1894 -3100 -1818
22226 -1818 -2052 -6065 -6653 -4060 -563 2423 3891 -392 -2093 -1937 -3904 -4255 -2899 -1358 -538 -1301
22210 -1301 -3547 -2391 1781 2521 1378 1371 1090 -1612 -1202 -609 3050 4351 5298 4034 3027 -172 -2404
22193 -2404 -5424 -6343 -4213 -2614 -1615 939 847 327 -2843 -3883 -2406 -2565 -1017 -1179 -964 1940 4048
22176 4048 2815 -439 -1359 -662 688 753 2130 1772 -603 -1519 -5455 -5721 -4150 -1987 -848 3331
22160 3331 6413 5999 2412 -393 -963 1061 732 -153 -604 -1438 179 -2865 -1992 -1397 -1598 -834 1078
22143 1078 -90 442 678 -2527 -3223 -4331 -1486 -79 -175 -2439 -2681 -1869 -2479 -4692 -4206 -117 2070
22126 2070 4072 4027 4835 4750 -342 -4989 -5111 -3737 -3799 -4286 -3954 -2148 -1283 -508 884 496 -3348 -2412
22108 -2412 -1146 -2872 -1614 -1331 -4392 -4342 -123 1197 -101 -2780 -3531 -221 64 -2270 623 2637
22092 2637 2115 -239 -2763 -4238 -2285 686 4186 839 -1471 905 232 -607 -2879 -3153 -4671 -4417
22076 -4417 -3753 562 -74 -748 668 1583 3098 5220 3650 4249 2172 2343 2236 468 1586 3850
22060 3850 5059 3412 1499 4082 4844 4230 2752 2125 2597 2258 2696 1926 234 359 5 -4791 -7342
22043 -7342 -2411 -97 -633 -1153 -2494 -2439 -4382 -5905 -5475 -3790 -1289 -1155 -1328 -1263 -1111 1264 -94
22026 -94 -3935 -862 1999 888 1184 3008 3560 2333 1019 -459 -2311 -452 273 -159 -2042 -3426
22010 -3426 -1408 1144 3299 5524 4469 -348 -2652 -1834 -75 3389 2201 216 412 -1975 -3309
21995 -3309 -2739 350 -643 -6410 -9018 -10935 -11068 -8600 -7607 -3425 -1638 -2852 -4803 -7157 -5168 -4123
21979 -4123 -4479 -6490 -3706 -360 182 -185 -129 195 -1094 -833 -1051 -2353 -605 477 491 1603 1734
21962 1734 -102 -4252 -2481 -450 2913 5188 4882 3150 146 -1039 -2887 -696 145 -616 790
21947 790 -676 697 1272 2657 1442 2969 721 -17 -1982 -1687 -1547 -4670 -3479 -1442 -4033 -2800
21931 -2800 -29 145 -1673 -65 -643 -240 -1953 -4643 -5226 -1370 -2243 -3498 -4061 -3258 -2363 -2991 -4262
21914 -4262 -4496 -2066 -2626 -1099 1444 716 360 5 227 1976 2032 4093 3512 60 -1404 -2995 -4400
21897 -4400 -2412 -1990 -727 -34 1796 2313 3072 2781 4446 5326 3268 3656 3790 3373 853 -3160 -3104
21880 -3104 2808 4817 3903 3430 3119 1342 -824 -288 -1102 -1996 -1548 325 -63 -2704 -3183 -3568 -3775
21863 -3775 -5975 -8122 -6668 -3859 -1983 -600 -726 1262 888 218 -369 -3831 -7916 -6432 -7230 -7065
21847 -7065 -3426 -1358 -1641 -754 -183 -871 -3072 -1938 -57 1417 981 -516 -2644 -2563 -1517 -2000 -2873
21830 -2873 100 1899 1807 2233 2367 1676 1738 1152 80 2550 655 -3168 -4244 -3425 -1621 -2745 -396
21813 -396 -1270 -1010 -1581 -383 523 120 -183 -316 -1347 -594 -2009 -2094 -4853 -3854 -246 -831 -1931 -1420
21795 -1420 -2038 -4063 -5159 -3581 -2890 -4380 -3001 -2232 -4787 -1052 348 -2874 -715 -1742 -1833 575
21779 575 -204 224 116 331 564 -2281 -2426 -943 -564 -2462 -4224 -5304 -3962 -1951 -1027 120 2589
21762 2589 588 166 1349 -1306 -2336 -1469 33 1525 -5947 -6435 -4210 -4805 -3857 -3919 -59 2139
21746 2139 294 -2961 -1374 233 -381 459 -1096 -1479 -4701 -6692 -6991 -4359 -3298 -2924 -4773 -3661
21730 -3661 -3546 -2871 -2012 -290 -1240 -979 372 -279 1205 2621 3452 6166 10946 7898 7146 2607 -85
21713 -85 -1053 -3341 -4778 -851 319 -543 -5122 -4526 -1981 -246 -395 -2827 -4028 -6203 -4834 -4117
21697 -4117 -5384 -2088 -1079 -838 -702 -499 297 899 2068 2876 3827 4436 -121 -984 -1347 -415 -581 -1364
21679 -1364 -2468 81 16 -191 -983 -3136 -1766 -1676 -3194 -3418 -2835 -3646 -5768 -6869 -4057 2478 1895
21662 1895 -3113 -1145 1537 101 -6243 -10886 -6722 -4081 -1847 624 662 -4399 -4060 -2973 -2750 -1271
21646 -1271 -3401 -6101 -2188 649 -2906 -2445 -2557 -2820 -3607 -1017 -10 699 3197 5106 2022 855
21630 855 -386 719 3782 78 1673 -25 1579 3994 4171 5729 3583 1772 1029 -1365 -1262 -866
21614 -866 373 871 2755 2321 48 -1093 -565 1045 2528 3601 4318 259 -2576 -3210 -2641 -915
21598 -915 -1007 -381 -1394 -2407 -1962 -1000 -1563 -5133 -7962 -7242 -4600 -3273 -3474 -2536 -5665 -3752 -2394
21581 -2394 459 -1733 -1316 283 -1087 509 3292 2040 2373 1911 -1386 -6873 -5450 -6169 -6652 -6098
21565 -6098 -7560 -3601 1269 1374 2100 4317 3776 3401 612 -1497 -2318 -2364 -2679 -2082 -370 -1001 -581
21548 -581 -544 -869 4489 4656 4003 1855 -1961 -5357 -4798 -3302 -2688 1110 1144 -1925 -2824 -2808 -3343 -1406
21530 -1406 -985 -4099 -5283 -4676 -1818 -371 -1090 -2495 -4081 -5093 -5611 -1400 -632 -617 -284 -52 -1647
21513 -1647 -5792 -7280 -6390 -6186 -7693 -7657 -6707 -4428 -2300 1927 4057 1875 27 1255 87 380
21497 380 -105 988 513 462 -357 -5254 -9565 -10040 -5723 -864 -4937 -4282 -2246 -409 395 445 738 1795
21479 1795 2295 2862 2551 -344 -2498 1047 -561 -1804 -5012 -4293 -5597 -2671 -437 -3475 -5339 -6418
21463 -6418 -6453 -5431 -2404 1103 -277 -840 1443 -1309 -1256 -2995 -4061 -2616 -1984 -3268 -4037 -3745 -6204
21446 -6204 -6061 -6104 -4849 -2431 -2089 -2529 -2683 -3401 -3937 -4819 -4377 -5102 -1448 2525 6239 2934 -3754
21429 -3754 -3881 -576 -413 -882 -2560 -3045 -2503 -2487 -907 -813 -1357 -2151 -2387 -979 565 -1124 -169 545
21411 545 -764 -913 -608 -143 487 405 393 880 1046 1983 866 810 393 -288 810 1438 1534 2527 443 -1693
21391 -1693 -8212 -9122 -6193 -7449 -6664 -4783 -540 2483 2974 4024 3706 5088 4840 3839 1665 -1931
21375 -1931 -2614 -503 1008 1818 -2308 -1561 2636 1171 -1504 72 944 972 1882 2095 -5463 -9918 -6097
21358 -6097 -1706 433 2705 5611 7157 7414 4341 3914 3359 1715 -1135 -2108 -665 -386 -1463 -2655
21342 -2655 -4522 -7029 -4710 -515 2642 -193 -165 339 -1960 -1869 1222 3630 5567 2611 -1121 920
21326 920 1985 1128 349 -1314 -1106 -947 1143 -198 -530 -72 -2071 -852 1368 4400 5800 2875
21310 2875 -1520 -2600 -611 206 -1691 -2753 -2306 -3608 -4661 -1023 2067 524 -474 -955 -3330 -5309
21294 -5309 -6943 -7418 -6949 -4418 -2555 -3077 -5095 -3106 1569 1921 3580 311 -2764 -468 -1713 -2083
21278 -2083 -786 -599 194 -1529 -1622 -4896 -2473 -1787 -2156 -1333 489 -795 -949 423 -1054 -2898 -2750
21261 -2750 -3573 -3458 -2784 -416 220 1362 -378 235 1700 1480 1363 1413 -1115 -1267 -636 -4226 -2503
21244 -2503 -1299 -359 106 528 -391 -363 772 1483 4472 2071 1512 750 1220 -1629 -5348 -6094 -4194
21227 -4194 -2178 1442 3406 4071 7742 8312 6667 4520 2967 5729 3675 2800 1940 1902 946 -403
21211 -403 644 -1035 -5122 -1517 1927 -428 -1294 2241 -674 -865 956 -426 1631 2381 666 974
21195 974 2704 1873 -1803 -1993 -3100 -133 528 -333 -1046 -2622 -1148 -1759 -652 -785 -1478 265 -302
21178 -302 -1370 -2597 -2355 -2017 -2994 -945 -1071 -3058 -2179 903 921 2580 3465 2265 3549 3232 149
21161 149 5 1436 597 8 820 2205 3105 1048 -135 490 -691 68 706 1465 1630 1465 2567 457
21143 457 -1696 -3672 -1039 -2049 -3936 -3825 -4043 -3035 -2657 -1029 466 31 -820 -2001 -2633 -3693
21127 -3693 -4464 -3925 -3152 -682 1514 -2676 -3291 -1422 1275 1631 -531 -1259 -782 -1026 2357 2367 2169
21110 2169 1206 558 -3328 -4835 -4476 -4565 -4957 -3650 -979 -1383 -5081 -6400 -8579 -8202 -4679 -4206 -4593
21093 -4593 -6134 -4290 -1283 -2143 -2738 -4030 1484 4865 3937 -734 -3251 -4690 -3488 -409 -2197
21078 -2197 -659 -1043 -244 501 1641 905 1395 1096 -631 -2761 -3037 -3478 -3694 -3006 -3842 -2992 -3907 -3706
21060 -3706 -3830 -4193 -4753 -1369 155 273 605 566 130 -2494 -1885 548 924 -1233 -2965 -2292 -3375
21043 -3375 -5612 -3514 -1680 859 2449 464 660 2272 986 328 -1987 -3976 -2397 -1011 -1671
21028 -1671 -4858 -5112 -3884 -3431 -3725 -4940 -5950 -1454 3251 2955 280 -2218 -2946 -3328 -2413 87
21012 87 2581 3630 2336 -2328 -5586 -3622 -857 -3390 -3871 -1788 616 -1151 -3449 -4892 -3047
20997 -3047 -1582 -1408 498 3 580 -834 -702 657 69 -3017 -5295 -1516 1560 -1254 -1276 654
20981 654 1430 -388 -2211 -760 1913 4601 5227 2954 443 518 -810 -647 1589 1595 -1035 -2445 -157
20964 -157 -184 -2275 -2673 -2353 -571 2939 2043 -516 -1421 -2195 -1298 -1792 -731 -3960 -2022 -669 -625 -558
20946 -558 -1733 -1838 -1838 -1836 -2307 -2575 -1892 -1676 -177 1844 -429 895 2842 1938 -376 -463 -529 259 -215
20927 -215 339 -988 696 -580 -1097 -1090 -1903 -2879 -2955 -2809 -3249 -77 1317 2970 1737 -237 -789 98
20909 98 -1444 -1201 -837 202 -1187 -873 -2821 -3563 -4001 -3930 -762 624 -1286 -1711 -1944 -523 2973
20892 2973 3645 4992 2282 -4276 -7421 2782 11621 9625 -7216 -5388 8994 14985 7750 -4016
20878 -4016 -1838 -1029 -934 -1169 -1506 -3826 -1567 -389 2362 2672 2606 2947 674 -2881 -6291 -8488 -10724
20861 -10724 -9800 -5851 -4097 -4453 -4024 -3097 -2622 -1213 -3088 -3993 -3143 -1209 -1671 -4840 -7391 -5038
20845 -5038 -2175 -1026 -2777 -3647 -5558 -5058 -601 2023 3480 845 -862 -1236 -1910 -1843 979 3363
20829 3363 3782 1474 -865 -714 -1799 -2867 -3154 -5889 -6235 -6916 -2867 -4987 -7648 -5824 -1424 -1696
20813 -1696 -3239 -595 -386 124 249 1267 663 -1535 -2655 -5340 -5354 -1598 -2627 662 2338 2327 2900
20796 2900 5071 2470 -193 -1381 -1017 1029 -814 -823 1492 -1370 -3861 -5082 -1708 -1516 -2361 -3220
20780 -3220 -2603 -4981 -7266 -4109 -788 -828 -1854 -2754 597 2446 2072 1419 -347 -1334 -1134 -3730 -1403
20763 -1403 1164 -424 -3964 -4207 -3480 -3522 -4071 -1051 -2129 -1642 -2256 -2793 -5427 -3187 272 2560 1410
20746 1410 -329 -1319 -562 2043 2425 1513 -744 -376 -895 -1019 -3278 -1258 -292 -481 1230 -196 -2304
20729 -2304 -2278 27 -570 -1180 -3424 -4644 -985 2000 806 -2809 -5932 -3322 -997 1475 -884 -1602
20713 -1602 2457 2974 567 -2891 -4750 -4365 -7011 -7255 -5955 -2829 -412 -819 -2592 -1382 -1622 -2479
20697 -2479 -2532 -3992 -3652 -2640 -3729 -2226 589 2824 5842 4973 2377 2750 4339 3276 835 434
20681 434 -1459 563 2609 3101 503 -782 -2886 -3708 -2326 -117 -1610 -4725 -3929 -525 173 -2108
20665 -2108 -3054 -4324 -5828 -5477 -3792 -3571 -404 1401 3100 4955 4900 4756 -999 -2556 -3677 -7939
20649 -7939 -8762 -6372 -4902 -5059 -5192 -7869 -6152 -2989 457 3023 2487 1002 609 -1169 -2187 -188
20633 -188 -3038 -4450 -4363 -3972 -558 876 2136 -419 -2322 -422 76 -905 -1980 -3507 -2383 -3540
20617 -3540 -4976 -5709 -3587 -4110 -4191 -1934 -3081 -4854 -2402 -3569 -5282 -4498 -1598 411 -66 -4147
20601 -4147 -4375 -2191 -1945 -3152 -1595 -1400 601 -891 -1844 -260 389 -1468 -2082 -932 -3449 -2399
20585 -2399 -1496 -2329 -3358 -3413 -1151 -633 -1994 -2979 -3417 -2981 -3700 -6345 -4439 -2259 -3226 -6031 -3217
20568 -3217 -748 117 927 -479 -3589 -5383 -2613 2723 4264 952 -835 -2118 -127 1760 -3311
20553 -3311 -3010 -3880 -4404 -2777 -2266 -3322 -1265 3251 3190 5373 4160 513 -2629 -1784 -2361 -1350 -2281
20536 -2281 -761 1037 -106 -1049 1032 1570 2988 1154 -1499 -1839 -1411 994 2539 1637 1353 1038
20520 1038 1850 3544 1324 1031 861 2033 930 -3181 -2358 826 -803 -3100 1059 329 -1645 2326
20504 2326 4751 632 -515 986 73 -3298 -2897 -2230 -2647 -2655 -4162 -5283 -6939 -5476 -3081 -2604 -3458
20487 -3458 -1589 -2965 -2561 -1915 -5054 -3388 -4388 -3623 -3396 -5209 -6810 -6928 -6732 -3606 -1567 -2856
20471 -2856 -7398 -5468 -2310 -4606 -5621 -4696 -1284 -483 -1559 -3472 -1755 1011 2429 2791 4482
20456 4482 2557 -981 -1144 -1928 -982 -205 -4114 -5309 -6607 -4961 -6047 -7677 -6768 -5210 -5694 -7535
20440 -7535 -8495 -8902 -12235 -8447 -2137 -3103 -3944 -2540 -3535 -3452 -5916 -4805 -617 -640 -131 -2897 -4220
20423 -4220 -5006 -3447 -1181 -1537 -4472 -7220 -8061 -6172 -4516 -2303 1132 -303 -5668 -3369 -3348 -4285
20407 -4285 -5544 -8661 -7984 -9730 -5697 -285 -1755 -1785 525 2001 2352 1504 1099 2137 -1098 -2518
20391 -2518 -3775 -5872 -6395 -2833 -701 185 244 -5255 -6403 -4908 -2844 -4913 -2166 945 -18 -1099
20375 -1099 -697 -2602 -4327 -5671 -5367 2042 5025 5328 4336 2693 -284 -1201 -316 2940 3835 1925
20359 1925 -358 -1740 -1734 -2589 -4453 -2620 -1273 -254 -378 -39 -230 -2400 -3671 -1460 1351 -300
20343 -300 -1987 -1711 -4094 -6367 -3919 -574 2517 30 -2406 -3440 -4668 -1475 53 -1178 -666
20328 -666 -1975 -3795 -8264 -9319 -7299 -4856 -5348 -4552 -4587 -2982 -1016 22 -174 -1739 -1388 1122
20312 1122 1406 1912 1005 1334 344 -1620 -1974 -1514 -3235 -490 -66 836 1137 1020 -1029 489 530 -1283
20294 -1283 -4284 -7956 -4128 -867 -2605 -5158 -6278 -4346 -651 -184 -1198 -3101 -1572 -3386 -6144
20279 -6144 -5269 -4956 -6900 -5987 -4725 -6062 -6352 -7863 -5732 -4141 -4220 -3650 -685 -586 -1330 323 -219
20262 -219 -156 -742 -3362 -4430 -3044 -2556 -4485 -6644 -6753 -5161 -3121 -992 -2943 -1037 1809 741
20246 741 797 -2834 -4511 -5648 -1202 -223 -4027 -5026 -2388 -2512 -1119 -350 -1508 -513 -599 -4141 -4715
20229 -4715 -3209 -2381 1391 2789 1095 569 766 1536 704 1535 118 744 224 1292 3102 2900 1102
20212 1102 2108 3483 4046 1221 -1541 -1162 619 -143 -546 1192 -1695 -3611 -3395 -3731 -102 543
20196 543 -1027 -2863 -6469 -6468 -6344 -6083 -6249 -7089 -4334 -816 -1177 -2188 -2914 -2118 -457 -1722 -3862
20179 -3862 601 1127 -1431 -2377 304 2421 793 -1479 359 478 234 734 557 -2009 -5140 -4525
20163 -4525 -4898 -4375 -5321 -5771 -3158 -1198 -2544 -1495 -510 -3308 -3640 -5888 -4749 -1747 -4677 -6142
20147 -6142 -2580 -805 582 359 133 10 1411 -380 -3890 -5452 -2255 -602 370 -533 1259 632
20131 632 -1017 32 698 -2851 -4153 -6218 -7092 -9885 -8429 -6968 -5153 -3396 -696 831 -235
20116 -235 -2309 -1360 -2577 -4760 -3428 -858 17 -702 -1727 -1809 -553 -1725 -1149 619 173 -145 470
20099 470 264 -1110 -694 -912 -4224 -3956 -2560 -347 -1458 -2405 -2857 -991 -1301 -1385 -4347 -3970 798
20082 798 1118 -1263 -1768 -3022 -3107 -111 -979 -2132 -2296 -4823 -3561 -372 291 -1549 -1590 -7 1400
20065 1400 1690 -1421 -4827 -3596 -1279 235 -607 -1074 -409 -2712 -3277 -1783 -2940 -3799 -4474 -5152 -3458
20048 -3458 -2554 -1782 -947 358 1684 1677 838 -418 -56 -859 79 -2323 -1538 -531 -1051 -1345 -140 -2190
20030 -2190 -56 652 -1216 -4169 -4405 -1110 -460 -190 -1967 -3122 -456 1981 1169 -1383 -4108 -2840
20014 -2840 -250 -2110 -2979 -4349 -6165 -3931 516 2567 4665 3485 2558 -869 -3229 -4532 -2777
19999 -2777 -2877 -2267 234 4351 4634 3749 1351 -1336 -3403 -4502 -6410 -7374 -3808 -109 -2846 -5467
19983 -5467 -5620 -3088 -1685 -849 485 -97 -2484 -1333 64 -1046 204 118 -2193 -4203 -3583 -1620
19967 -1620 278 -100 -3210 -1127 -30 -515 -2533 -2609 -526 711 4873 3539 1678 -992 -2871 -1268
19951 -1268 82 -2053 -4323 -2540 2649 4982 2666 1423 2391 3141 629 123 1913 1087 1520 -1899
19935 -1899 -2678 -1747 -219 472 1042 210 -448 -1815 -2139 -4528 -3107 -968 -1393 -1583 -1361 508 -660
19918 -660 -5005 -3955 -3040 -5048 -4968 -2984 -2393 -2201 -2059 -2389 -4262 -2487 -1867 -1079 -3317 -3371 -2917 -2860
19900 -2860 -1817 -1839 1564 1874 1454 -1181 -6360 -7058 -4775 -4294 -3055 -1044 771 -397 131 -2582
19884 -2582 -2311 2234 627 -1259 967 1147 432 1123 -519 -2325 -2999 -1012 -899 -581 -1633 -2866
19868 -2866 -1909 -550 -2564 -4860 -5186 -3131 -3770 -3195 -4024 -3346 -3023 -5900 -3126 199 3144 4139 1104
19851 1104 -869 646 2637 2662 2052 2460 -533 -2669 -2428 -1898 -2044 -284 68 942 1740 843 -3309
19834 -3309 -3290 -2148 1287 3572 1196 -339 -1251 -1989 -2784 -5557 -5758 -4654 -1339 3220 3768 -912
19818 -912 -4790 -5572 -5711 -3360 -117 -1751 -1132 -2777 -4320 -5667 -5517 -5696 -6189 -6224 -2731 -1737 -3450
19801 -3450 -6212 -6890 -7547 -5253 -1926 -4186 -3179 -544 -1936 741 1119 -68 -4172 -4776 -1214 -118
19785 -118 168 -550 164 471 -1434 1001 2189 811 -1749 -1199 -3825 -3975 -3418 -4433 -4384 -6491 -6176
19768 -6176 -1351 -1418 557 1679 1238 966 2526 1202 -1779 -2953 -2191 -31 3119 1655 -38 -182
19752 -182 228 -499 823 -856 -351 -1045 -3231 -946 1149 2457 701 -43 1936 2248 2804 636 -2107
19735 -2107 -3191 -4074 -5651 -4445 -745 2362 -1575 -4597 -8065 -7546 -3775 -3586 -3766 -1861 822 634
19719 634 -4221 -4824 -3414 -795 -1254 -1473 119 161 -1890 -3146 -3083 427 -728 -2224 -789 602 532
19702 532 -1002 -2219 -707 -2935 -1007 -666 362 -161 -1651 -1905 -2404 -2708 -4198 -6541 -3201 -1805
19686 -1805 -851 1567 2080 -824 -1263 -1245 -1801 -1103 2461 3606 494 -1309 -4422 -3764 -6410 -6080 -2979
19669 -2979 -2058 514 3402 4336 4006 1923 1602 3230 2747 3577 1227 -2562 -518 1873 -892 -2589
19653 -2589 -922 -2085 -4631 -3373 -960 -1935 -228 1995 2208 1461 1854 5215 3399 3173 5406 5028
19637 5028 3295 920 -1810 -1629 1203 3013 3830 5018 2143 2746 2839 -1593 -2298 -1793 -3414 1375
19621 1375 3382 3296 592 -1654 -535 -1427 -1702 -1876 -1201 311 1707 1388 3072 2717 1879 4637 6344
19604 6344 7034 4827 6762 12015 14188 16563 22011 28598 33772 39194 47669 58654 70831 79428
19590 79428 89615 99812 101853 97484 90489 82215 73903 64823 51857 39743 29750 18714 11187
19577 11187 9335 11002 9767 9373 7503 5070 3176 3505 796 929 -271 1077 2986 3696 -277
19562 -277 -1673 -2488 -2282 -3146 -3520 -2442 1003 -607 -3458 -3845 -2358 -4789 -4025 -3873 -2519 -1079 1730
19545 1730 627 2931 1553 3087 2017 2092 3133 3110 1402 -1110 -3057 -1799 515 1013 763 2022
19529 2022 2948 2573 2742 2884 2058 -1496 -1841 920 2458 235 277 1432 -1716 -2487 -960 883 2747
19512 2747 1650 787 -6 1157 2748 4348 2958 2740 2032 2808 1967 122 -107 293 -963 -134 -3954
19495 -3954 -7612 -9931 -9833 -3738 -1565 -528 -2774 -5365 -6731 -4016 -3213 -5075 -4641 -2914 -1458 -1440
19479 -1440 -229 -1560 -4984 -4587 -2925 165 3068 4785 5140 6800 7943 8420 7916 4177 6090 4704
19463 4704 422 1449 126 -675 3223 3791 560 -2211 -106 -1704 -947 1377 2690 4102 3164 1316
19447 1316 559 -2166 -3844 -2376 -1603 1877 2964 1988 855 -55 -3880 -5303 -3064 -3406 -1153 -372
19431 -372 -1386 -2474 -2206 -4701 -7523 -9347 -9475 -6458 -5152 -4740 -6441 -6229 -8131 -10292 -8462 -2864
19415 -2864 -456 -62 -539 -2740 -3580 -681 2485 -97 -3919 -1111 -2021 -2449 -2738 -989 2442 1697
19399 1697 -1010 -804 378 3506 1117 1728 2114 1229 2784 5037 5362 3796 3035 3006 2934 3198 2662 -316
19381 -316 1610 1248 1799 1907 2224 2372 767 -104 1961 2451 3417 3471 4871 4691 3159 963 2196 2993
19363 2993 2445 2134 927 1331 2536 1921 31 -850 501 -1801 -1158 911 228 -1838 -1622 -1793 -1486
19346 -1486 -46 -525 -690 -235 -1207 -2171 -4990 -5340 -2650 1141 -392 81 -67 -333 2502 5235 -48
19329 -48 -1002 331 146 -1662 -685 1693 652 -2279 -2419 -1324 -1525 -917 1102 1652 318 -1432 -2981
19312 -2981 -3022 -4466 -1754 530 19 1270 1505 2637 1368 768 1323 -1257 -3547 -1407 -2478 -1347
19296 -1347 -681 -2774 -3027 -2674 -2209 -3882 -4828 -2441 -4509 -5234 -3824 -3509 -3565 -2794 -2142 -2636 -2273 -1090
19278 -1090 610 1333 -406 2254 6019 4828 -384 -1553 -2835 -4508 -3748 -2505 -858 123 1581
19263 1581 4051 3378 1474 2279 2126 2881 2158 -1105 -3502 -3555 2205 5076 2164 1861 1901 827 2064
19246 2064 -61 1552 2600 3048 1960 562 -2825 -1292 1887 1032 -265 -30 -1264 -2940 -2975 -948
19230 -948 -2009 -2780 -3057 -3516 -2786 -3287 -4776 -2706 -2654 -4276 -6561 -6346 -7978 -7861 -8100 -8266 -7714 -3654
19212 -3654 384 -121 -3210 -3772 -1560 -3366 -3909 -3449 -3233 -1733 -107 1772 2585 643 -1520 1888
19196 1888 1687 -703 -362 -891 1390 1690 381 3277 6119 4061 2609 737 -1127 -1742 1102 1513
19180 1513 -145 -4817 -5253 -4170 -3373 -2408 -633 -2296 -2138 81 3763 4118 2073 1618 866 739 475
19163 475 631 -2696 -4059 -4060 -333 1379 2540 63 -165 -1320 -1172 -548 -1191 -352 3145 4772 2041
19146 2041 1626 -438 -1194 1796 3375 1470 -385 -3991 -2869 -294 1163 -478 -1069 12 -623 -4357
19130 -4357 -2317 1545 6258 7908 4135 214 491 1311 2565 -2460 -3163 1279 -1778 -4778 -2203
19115 -2203 -2821 -4348 -6138 -6493 -6638 -7034 -6693 -6034 -1442 -1572 -696 3613 3100 231 2892 6901 8417
19098 8417 7441 6929 3224 -122 47 4830 7527 5417 3527 2208 461 482 778 234 -3302 -1387
19082 -1387 595 1140 5634 5003 1247 -1893 447 3696 3148 2799 739 470 1341 242 -19 1517
19066 1517 1675 4422 3248 771 2923 4937 3373 411 -1935 -2093 -308 140 1299 2118 1899 1435
19050 1435 1556 499 1915 3375 1375 580 1203 772 248 -186 2173 3795 1862 2323 3906 1992
19034 1992 4758 7801 5383 4559 3482 1706 557 857 1561 1847 1629 2365 -2069 -1853 -374 839
19018 839 832 -1531 -352 1998 2244 -781 101 -1149 -1920 -1550 -1921 -3782 -4994 -3377 -2736 -2381 -2351 97
19000 97 -327 -2543 -1047 61 1166 31 2859 -1484 -2603 -3188 -6407 -6671 -3704 -2661 -1633 -1231
18984 -1231 -1722 -2293 651 971 569 3005 3933 3407 2922 5607 8720 4345 -869 -935 -1918 -970 -774 -1986
18966 -1986 -4197 -4909 -1636 78 -98 -2136 -6600 -7450 -4447 -1384 -1276 -1876 -2277 -472 5127 5995
18950 5995 2593 -2220 -2785 588 4243 4757 5617 2243 1040 147 -1401 -1698 -2011 -3139 -3538 -276
18934 -276 818 -1734 -1771 1343 1929 1945 -449 -1626 -1142 -1023 -2070 -958 2204 547 -867 -2926 -1255
18917 -1255 660 -9 433 466 2453 4162 -136 -3327 -4321 -4611 -737 135 -1027 -3012 -1528 1210
18901 1210 3040 2613 2387 -507 508 2004 878 2141 1098 193 -987 3467 4806 4995 4260 3714
18885 3714 726 -1423 -4727 -6304 -2374 119 1076 4325 5401 5031 3194 4170 4341 964 -1106 1517
18869 1517 3056 4805 6743 10119 11888 14639 17425 17080 18888 21264 27397 36800 47468 54881 65565
18854 65565 78220 92478 105336 115078 116337 106889 92950 77697 63897 52937 41903 32423
18842 32423 25442 20598 15287 12711 11728 10217 8224 5737 5751 2765 2681 3774 4326 3822 3905 3420 3670
18825 3670 4361 6260 6154 5662 4622 3558 1977 1830 3120 3159 1712 -80 1490 4607 4918 3886
18809 3886 2597 -4149 -4991 -561 1001 -1009 -1982 -2935 -2188 -3829 -6020 -4319 -1371 -1 -2283 -4003
18793 -4003 -4209 -3859 -3899 -2168 -1622 -822 -1660 -612 2421 4382 5649 5540 5044 711 -664 -2699 -1881
18776 -1881 -1020 908 -207 -1236 -665 896 5808 14399 24794 34558 39409 30150 19376 16562 13554
18761 13554 9547 6978 3701 3188 2074 1578 1838 2552 2121 3884 4328 3897 1213 955 1047 4453 2771
18744 2771 1039 2006 2293 -1031 -4233 -1648 473 -198 -2021 -2741 -2497 -3061 -3532 -3660 -593 1741 3244
18727 3244 5038 5065 3684 831 182 47 -1616 -2098 -242 -503 837 2528 3329 4089 3276 3276 1327 2866
18709 2866 4320 4551 4245 1910 1635 4052 4875 5228 4200 2408 -915 -1827 93 -1772 -1742 26 125
18692 125 1562 2919 1166 614 225 3757 7528 9182 7737 4918 4098 3711 4380 5239 4169 -1043
18676 -1043 -4073 -3069 -525 -1415 1914 3020 1215 -2577 -2708 -3343 160 1845 2732 2776 1879 7
18660 7 926 1848 2322 1060 -396 3841 4413 406 -2087 526 1875 5120 7050 4626 839 -428
18644 -428 1675 3269 863 -103 -490 3024 4930 2246 2474 3638 3830 6007 5285 1462 2604 4908
18628 4908 3761 1413 1235 2286 2306 331 37 3380 2383 4742 2096 489 74 -245 451 982 1168
18611 1168 -550 -2762 -2313 -1499 3156 2124 996 177 -498 1742 2565 1824 2696 1657 1048 -672 1083
18594 1083 5879 6855 6868 6188 6988 9311 7230 1092 -1138 1043 2696 2152 815 2138 447 -1160
18578 -1160 -2551 -515 3058 2485 -497 903 3246 3275 3045 6512 6805 6787 4731 1927 890 2258
18562 2258 723 -912 60 270 -1587 -1247 -1321 -1805 -1759 -648 -49 2060 3219 -67 -1309 1880 4788
18545 4788 4562 4232 5397 6618 6080 5433 3502 1057 -558 105 1396 -19 -861 -940 -338 -595 -255
18528 -255 1454 1763 1125 2465 4570 3773 2208 3236 4427 6239 10032 13748 11356 4395 3600 4184
18512 4184 4519 3985 3491 3803 3326 3244 5026 9149 8316 5759 6123 4310 3717 3973 4568 3856 4760 5765
18494 5765 6330 5437 3914 4938 2383 1667 2789 2701 2107 1982 3855 3894 3784 3463 3215 1794 520 -2240
18476 -2240 -2171 -39 4315 5122 2640 2677 3896 4154 6511 7189 4766 4791 4927 3115 1442 4329 7990
18459 7990 9697 9363 10851 10807 9916 9356 8023 4628 3977 2565 2016 410 909 2755 3593 2700 4654
18442 4654 6477 9663 11601 11144 10725 9116 8445 7189 5458 6257 9077 12013 13953 16388 21102 25030
18426 25030 28222 28768 32992 37663 40238 42716 48413 55410 62355 74379 92850 117321 152034 210025
18412 210025 294470 399473 470018 492354 539622 647895 750192 698986 570197 492980 468586
18401 468586 418574 311835 212249 145179 104549 80058 58856 47437 37713 30248 27347 27244
18389 27244 26146 23975 22572 20579 19098 18089 18227 19707 16419 14816 15537 13985 13655 10951 8848
18374 8848 11150 10874 8966 9227 8000 5097 5617 6196 6047 6501 8866 10108 9223 11616 11314 7754 3390
18357 3390 4452 6381 7657 6369 5514 6368 6685 4019 3837 4135 1059 -1087 731 3990 1330 -1656
18341 -1656 1373 4232 4194 4646 5882 4794 3119 3284 2950 4429 5309 5607 7319 6636 3021 4371 4162
18324 4162 4664 6406 7886 8739 8045 7258 8054 6748 6875 6926 4381 5761 5994 4848 3534 2751 3401
18307 3401 1478 214 -626 25 -1692 -74 5432 7337 6587 5561 1532 -1879 -398 -1103 -4741 -4771
18291 -4771 -4289 -4595 -3066 -283 21 -316 1027 5514 4672 2490 2709 6817 8646 8991 11066 11329 12787
18274 12787 8964 7737 8674 9691 9109 7917 11032 8898 7310 10710 11691 11090 14425 13896 15669 15348
18258 15348 12710 9982 6860 5548 4504 4913 4306 4657 4251 5310 8943 8658 10863 11157 9021 10292
18242 10292 11731 12483 10712 12744 15569 11816 9389 5296 2061 1428 5780 6519 11017 13743 15071
18227 15071 17163 18308 16401 18969 18823 12236 9609 9274 7447 7462 9726 11758 13888 11945 9972
18212 9972 9303 7685 9293 9883 10035 11257 13314 13046 10304 10022 7353 6536 8362 7979 6820 8736
18196 8736 10843 12564 13508 11415 10562 12995 13998 12272 11504 13809 14001 13563 12700 13960 14955 14856 13272
18179 13272 13019 12640 15791 15857 13552 12905 13374 12491 15605 16084 15521 16793 16113 14689 15508 17272 18403
18162 18403 22550 20066 16551 14140 15548 18925 20555 21614 24601 24748 23736 23348 23393 24562 26232
18147 26232 24575 25192 27945 28526 28945 29361 30768 31677 30225 31023 35532 37645 39457 41424 41987 43580
18131 43580 48877 54794 57396 60435 63279 70899 85735 97718 112803 133114 166318 208024 248523
18118 248523 292878 341524 394070 463480 561806 703695 919510 1279737 1904915 3007213
18108 3007213 4730820 6517733 6179085 4211078 2550105 1552702 1003062 693399 507893
18099 507893 386799 300809 236759 193603 162563 138793 122925 112933 106486 97150 88831 82585
18087 82585 80288 77310 75849 76787 77833 75839 78324 79113 80682 81767 77483 76347 78582 79235 73247
18072 73247 70432 74427 75473 72317 65071 62537 62592 62787 60683 60990 58999 53798 47727 41152 39704
18057 39704 39725 35970 32362 30463 28278 29589 28980 28387 29752 31925 33116 30368 27578 26616 22384 21243
18041 21243 21221 20041 17544 16074 14655 14087 14875 21189 25222 23672 26216 33400 37969 38565 39261 39408
18025 39408 37846 37792 37365 34376 32758 28855 30503 32528 33677 32606 33494 34483 37733 42851 45188 39490
18009 39490 31843 28040 26326 18242 4106 -5189 -15237 -21170 -21136 -13398 -7060 -6613 -3469 5034 17910
17994 17910 24335 27230 26954 25704 26586 28229 31807 30175 26524 28367 31066 32578 28979 26753 26877
17979 26877 18974 12115 9766 9685 12781 16271 18590 21404 24977 30730 39633 40514 34638 27802 27614
17964 27614 28091 18747 9955 6638 9515 15686 21350 31010 48712 74320 103548 125274 142653
17951 142653 178076 242110 275751 263315 233427 247185 294780 288293 237271 182723 190708 214937
17939 214937 209149 199873 209963 239106 265539 278228 280290 272276 266175 253885 234151 211791
17927 211791 185823 164651 147112 138625 133758 125359 121738 119025 118432 116914 116588 116485 116251 117355
17913 117355 114831 116900 118861 119396 125687 130859 136504 138859 138869 141793 149133 156737 157552 160621 164448
17898 164448 169546 174861 173390 171762 179334 185580 183986 185075 192084 201491 204347 201255 203266 208431
17884 208431 207663 212378 222594 228366 232144 232825 240858 253705 258593 258910 262614 273330 287047 297126
17870 297126 303475 314161 327853 344301 357198 368628 381860 395221 409086 422323 440576 468513
17858 468513 493057 518912 549149 585275 623571 665984 705679 744009 790834 844069 897391
17847 897391 959006 1031717 1118234 1215411 1335156 1506729 1727127 1977578 2215839 2448057
17837 2448057 2758147 3175693 3648447 4057128 4507028 5036825 5662817 6436697 7400469
17828 7400469 8515165 9677784 11158401 13255868 16155050 20091809 25967899 35530148
17820 35530148 50653813 70575409 86380741 89580251 94739348 112577675 134626915
17813 134626915 131769744 107628443 89884946 84715419 79871519 62749838 43203205
17806 43203205 28811838 19810146 14299426 10866681 8602504 7028282 5859308 4980065
17798 4980065 4428576 4143751 3961159 3618135 3225723 3007121 2944368 2808775 2455708 2110519
17788 2110519 1880480 1726818 1549522 1352882 1174721 1033633 929748 851753 781905 723218
17778 723218 676529 635397 592143 555692 523386 497195 479432 462575 441380 416433 399770
17767 399770 389822 372675 351093 333934 322925 307258 292917 278315 272441 268974 260107 242143
17755 242143 229581 225503 218739 204085 189865 183543 181170 174363 164773 157447 155081 150088 146729
17742 146729 138504 129879 120736 111472 106659 106159 100615 92971 89913 88621 85825 80810 77175 73677
17728 73677 71214 68227 64773 64511 66906 71905 73564 70222 67615 68098 71511 69304 65792 66072 71154
17713 71154 73069 70135 67208 66185 67320 66394 67310 65885 65231 59165 50540 45468 39359 28677 12494
17698 12494 -8434 -16336 -2152 13859 7866 2084 28720 73236 99425 109415 98789 94136 97044
17685 97044 111060 100996 47952 16745 22155 26992 6359 -15394 -10910 9521 14079 11303 17482
17672 17482 31984 46212 50397 52424 54208 54219 49857 45166 35161 23222 22197 22968 19680 12743
17658 12743 7712 14173 23949 32200 33935 32813 33391 37854 41379 41172 35710 32317 27511 21259 18072
17643 18072 18965 21558 23101 24494 23437 23044 24607 24267 22802 21033 23321 28824 38214 45423 49042
17628 49042 57315 65264 69260 67400 65006 60378 40973 25724 24794 23602 14771 3516 -341 -977
17614 -977 -1303 -1080 476 1082 1849 4070 5604 4221 3524 2362 2325 2221 1724 2794 2724 3787 3168 3523
17596 3523 5015 6155 9673 15764 20447 18524 19463 21926 20519 19455 15799 15804 18805 18217 18223 22501 21416
17579 21416 17360 14104 14464 15113 15609 15592 12879 10711 12791 14090 11769 10928 12158 14945 13219 10915
17563 10915 9546 10793 12391 13381 13145 10409 8164 6738 7953 3999 1323 2368 3058 3145 6808 8609
17547 8609 9597 10898 11967 12842 8547 5722 2115 2531 4306 7008 5403 611 -532 1010 1630 -1887
17531 -1887 -3043 -4024 -7169 -5228 -4853 -4982 -2905 -5480 -6299 -2422 -1786 -2984 -2790 -3494 -5031 -5289 -7206
17514 -7206 -7832 -5523 -5701 -2332 2011 4487 6295 9958 17549 18811 18556 18375 24782 26256 21333 16954
17498 16954 11644 10456 11342 10981 8011 7563 10884 13739 13720 11286 12637 11308 9642 8149 6462 6388
17482 6388 8143 8085 4209 4084 5532 4417 3835 4410 6235 6894 5344 5625 3872 1930 2445 2118 -484
17465 -484 357 3911 3838 1737 3080 2396 468 1045 736 1671 4434 7305 5082 3761 3686 4563 6592
17448 6592 8499 9839 7833 5769 8807 9529 10675 14956 25381 37611 38253 27269 20054 14581
17434 14581 10562 7452 5665 3462 1746 149 -94 -678 1157 893 2627 3535 2524 3525 2830 1985
17418 1985 599 1393 -2717 -6095 -5914 -5109 -3758 -521 -1397 -1542 -3194 -3404 -3269 -5751 -4247 -4202 -3453
17401 -3453 -1021 -1029 -2305 -1002 -1767 -3261 -3531 -1043 -914 2681 2765 -212 -873 23 2851 3116 4796
17384 4796 5213 4959 1579 -695 1618 1619 -1401 -1442 340 -2029 -3400 -4451 -3885 -3031 -2845 -4997 -2432
17367 -2432 -552 -687 -2481 -108 881 -29 -2359 -478 972 -130 -1454 -614 640 576 -782 -122
17351 -122 4066 4970 2897 4018 6376 10181 10623 9981 9454 10095 11246 10118 6243 6385 7275 10190 6423
17334 6423 3870 4956 2094 2876 2767 5364 3373 2267 2773 2221 4808 6747 3508 2211 4379 3279
17318 3279 4494 2961 1088 1650 2448 2562 -459 -1712 -2248 -3356 -3128 -4171 -3349 -3152 -2583 -2864 -2633
17301 -2633 -2544 -1835 269 744 2054 3378 3831 4797 1569 742 3310 2630 443 1577 2466 2728 1641
17284 1641 -1845 -2113 -160 3078 6107 4312 1943 112 425 3248 919 -419 -2407 -3169 -3184 -1973
17268 -1973 -2414 -3930 -1004 -154 1493 840 1044 2566 4378 3740 3904 3977 4070 4467 5403 5040 2442 1307
17250 1307 738 -1208 1721 5642 5239 4246 4363 5085 6496 7322 5941 5597 7624 11770 16511 20461
17234 20461 22253 24551 25255 25666 31276 37733 41213 41979 49975 62972 80977 101209 132062 178791
17220 178791 250928 357631 454276 482765 508760 599911 717142 719043 598941 498305 457371
17209 457371 423990 334838 227526 148896 98508 68367 54062 43979 34233 28538 23871 22829
17197 22829 22373 20676 23263 23202 17414 15915 13830 8743 8390 7663 4461 4031 3074 1745 953 874 2745
17180 2745 1299 477 -1158 -3417 -4334 -3008 -2779 759 3526 1919 2414 1868 798 3875 4037 -392
17164 -392 -845 -1284 1638 100 -2835 -5063 -3844 -2748 -2553 -93 1109 765 1091 311 -577 -2414 -2055
17147 -2055 -1428 -2849 550 995 -1331 -2248 -3779 -2804 -998 3260 3990 607 1976 772 -1943 72
17131 72 -1169 -3241 -2919 -1199 -306 -1068 -1538 -1461 229 -2004 -4775 -4046 -7129 -6672 -6767 -6412 -2506 -2065
17113 -2065 -4814 -5380 -6307 -7121 -6160 -4426 -3275 -3954 -4709 -4120 -6848 -7330 -7694 -7343 -7129 -4687 -5143 -5312
17095 -5312 -4976 -5246 -5262 -4305 -4265 -1913 -3746 -5652 -5286 -4478 -4683 -5479 -3378 -3464 755 1561 2289 2878 3159
17076 3159 2806 2502 -2158 -6131 -7691 -5199 -2268 -1357 -1338 -2161 -2538 -2943 -2363 -38 -136 1044 1487 -716
17058 -716 -1007 -1899 -2813 -2792 -1740 -2082 -4051 -4328 -6291 -5298 -4286 -4617 -2039 -1159 -4456 -7743 -6887 -6206
17040 -6206 -5607 -5869 -6615 -6661 -4431 -4809 -5358 -2592 -2877 -4322 -5631 -4806 -3919 -3238 -1028 -3920 -4566 -835
17022 -835 107 -1101 -3058 -1886 -3929 -3689 -5389 -5497 -2499 -1970 -249 4171 1096 -4585 -6472 -5515
17006 -5515 -6168 -7594 -7651 -9313 -10095 -9576 -7180 -6093 -4867 -3081 -4111 -5107 -2229 -515 -2166 -6466
16990 -6466 -9326 -10675 -11153 -6047 -4280 -6228 -7766 -7832 -6418 -4898 -2419 -1740 -2303 -2259 -1837 -1282 -2060
16973 -2060 -3830 -4165 -6413 -7938 -7587 -7147 -4217 -3822 -3197 -5649 -4744 -1327 1282 -171 -793 -1072 1286
16956 1286 720 506 -1257 -3856 -3650 -580 1524 2734 616 -4368 -13179 -8969 1132 2313 -7615
16941 -7615 -14956 -10563 -2110 -1520 -5202 -5587 -2529 -3181 -1911 402 -2896 -6089 -3420 -3399 -2624 -2756
16925 -2756 -2898 -5239 -7791 -8999 -7756 -9156 -9503 -8790 -6824 -7990 -6592 -6354 -8174 -7623 -6440 -5091
16909 -5091 -4393 -4251 -2610 -5245 -5220 -4812 -6094 -5751 -4273 -5304 -7126 -6992 -6658 -4203 -4454 -5587 -6356
16892 -6356 -7814 -8151 -7270 -5894 -3845 -2880 -317 -69 -1538 -881 1875 2616 2635 1495 -1420 -1711 -977
16875 -977 -317 -1062 130 -198 -988 -1933 -2985 -6530 -8359 -5305 -3276 -1502 -2604 -5220 -8797 -7511
16859 -7511 -3712 -4282 -921 -1143 -927 -521 -1859 -1920 49 793 478 -507 -236 -313 -1406 -4351 -2462 -138
16841 -138 -1248 -1023 -1258 -970 -2217 -1894 -280 -1868 652 2510 1495 705 -1329 -346 -166 -694 -736
16824 -736 -3093 -4869 -6351 -6254 -5431 -6154 -4583 -3452 -4195 -4389 -3668 -3839 -3721 -1556 -4942 -2088 -333
16807 -333 -3672 -3959 -4146 -4977 -1878 -474 2102 3170 -1244 -4776 -4901 -5190 -7131 -6551 -6543 -2839 -2167
16790 -2167 366 684 -770 -1751 -3341 -1662 -1069 -797 762 2134 1732 1998 384 326 -784 -1379 -384
16773 -384 -670 -449 872 733 3735 3702 1061 -135 -1279 -2692 -1762 -2617 -4640 -5430 -9112 -6631 -5363
16756 -5363 -6741 -7464 -5566 -5217 -4618 -2223 173 -2088 -3740 -2094 -2067 -1120 -1274 -370 -1842 -2079 -2111
16739 -2111 -1011 -5026 -9254 -8924 -8256 -6778 -3262 -2257 -3158 -3576 -1685 346 1314 189 -2458 -4355
16723 -4355 -3256 -1882 -1050 -1676 1056 -636 -5387 -6366 -6787 -7107 -8273 -5210 -6129 -8951 -8428 -6177
16707 -6177 -4674 -3690 -3463 -2455 -3748 -6041 -6555 -4524 -2519 -5021 -5501 -6887 -8009 -6875 -1993 -955
16691 -955 -1659 -3132 -4374 -5567 -7300 -6868 -7465 -5929 -4112 -4066 -4162 -4981 -4779 -1954 -2524 -3103 -1748 -2910
16673 -2910 -5633 -7437 -4883 -4439 -3165 -1045 -4088 -6701 -7366 -4556 -2809 -1704 260 -142 -2438
16658 -2438 -4930 -4243 -124 722 -3334 -2002 -3157 -4243 -3267 -4213 -5153 -1433 -118 -72 1080 -185
16642 -185 -1913 -490 454 -3672 -5803 -5372 -4576 -2931 -3385 -3946 -2899 -2129 -2673 156 169 566 -121 -1084
16624 -1084 884 819 -892 1496 -510 -3175 -6041 -9524 -7479 -5507 -4345 -4936 -3381 -2085 -1135 -1100
16608 -1100 -4704 -6926 -6842 -4107 -3739 -3625 -6621 -5450 -5085 -4564 -2596 -5647 -4544 -2788 -5311 -6186
16592 -6186 -4323 -580 -377 2580 5392 5554 3679 1379 -2404 -2941 -2358 -5901 -7721 -7571 -5194 -4647
16576 -4647 -2536 -3780 -1159 -236 -2848 -4998 -5234 -2137 -3175 -8401 -9276 -4579 -1122 1511 3733
16561 3733 2415 1793 1554 -2038 -3222 -3197 -5200 -6406 -4532 -2718 -2358 -1270 -671 -1428 -1590 -913 1038
16544 1038 2785 1380 1802 1940 758 -1466 -4465 -4737 -4626 -4397 -4127 -1976 -406 -3782 -4626 -5591 -6390
16527 -6390 -7443 -3994 -1581 -4000 -4055 -3282 -4268 -4687 -7795 -6047 -3864 -6359 -8036 -6313 -5420 -5030
16511 -5030 -7241 -2842 1182 3395 3005 -1496 -4742 -4955 -4892 -2967 -4179 -4100 -3942 -5708 -5052 -3070 -3809
16494 -3809 -9227 -8264 -5923 -4567 -5861 -4288 -608 1157 877 1033 -1455 -1560 -1846 -3672 -4031 -4411
16478 -4411 -2382 -2645 -2949 -2493 -4250 -5158 -1910 -3655 -5989 -7158 -7476 -6463 -5668 -5570 -7809 -6735 -4355
16461 -4355 -7238 -6219 -6006 -6188 -5879 -8948 -7623 -4436 -3298 -5256 -5235 -3774 -2998 -2456 -426 1998
16445 1998 550 -2250 -2717 -30 -5 1338 3269 1018 -6872 -10910 -8588 -6468 -5902 -3940 47 1049
16429 1049 691 -2048 -4557 -4739 -6267 -5197 -2817 -2833 -3688 -1807 -3620 -5294 -3447 -3551 -3937 -3500 -2767
16412 -2767 -3126 -4265 -4205 -5799 -7278 -6323 -6116 -3175 -638 1117 3344 1695 -2832 -6598 -6828 -5181
16396 -5181 -4529 -6361 -6797 -6102 -6469 -7794 -7538 -7974 -7223 -5324 -3872 -6830 -8685 -5903 -5551 -3971 -4600
16379 -4600 -6261 -5547 -2487 19 -3381 -7367 -4568 -1784 -514 -4366 -8590 -8948 -6030 -3625 -1881
16364 -1881 -695 -2426 -4184 -3516 -1915 -5080 -8205 -4825 -57 -1758 -3470 -2092 -1601 -1246 544
16349 544 -1459 -3115 -4578 -2305 -3587 -9467 -11669 -10434 -7968 -7595 -5967 -4780 -6447 -5065 -3665
16334 -3665 -2137 -1207 -2683 -799 1268 80 -1722 -2645 -1060 61 -524 -626 -1034 -2651 -3181 -8436
16318 -8436 -6068 -3072 922 -964 -2302 -2445 -271 -19 785 -247 -1313 -5154 -2607 -925 -1743 -1323
16302 -1323 -1566 153 -3214 -4599 -3576 -1953 -2055 -3650 -3370 328 224 2788 4142 1606 2040 -1835
16286 -1835 -4084 -879 400 749 1206 -744 181 -1659 -1984 -2840 -2627 -1181 -26 1083 135 -1446
16270 -1446 397 2229 449 -186 -1739 -3585 365 2201 3835 3835 3602 919 -3230 -1811 975 1217
16254 1217 1370 2153 1153 2636 3874 5319 6449 5784 3589 2863 1599 3894 3315 1827 98 -795
16238 -795 -2675 296 98 1368 -42 -1217 661 1163 2652 7387 7543 6442 6631 9983 11164 9990
16222 9990 10529 12092 14074 16448 16003 15624 19550 23027 25079 30324 35001 37631 44784 52974 61429
16207 61429 68665 80836 97119 111130 129777 147301 157109 161259 163523 159098 150319 140242 127865
16194 127865 112666 94872 79400 65116 53260 44728 38745 34665 29806 22928 21749 21276 18790
16181 18790 15713 11858 11076 10039 8458 6556 6950 7764 7045 4263 5283 6117 7793 9070 10276 8591
16165 8591 11661 12964 12303 10753 14842 16865 16764 18492 21001 20416 17694 14374 15463 15713 15865 17269
16149 17269 17527 18473 18450 17507 18274 18035 16174 13953 15011 13844 16218 16538 15456 12373 10104 10429 9354
16132 9354 6387 8494 10367 10386 8919 5428 5745 2824 238 1259 1620 1716 -675 -462 2836 4931
16116 4931 1918 -2025 -2178 1190 3091 3527 1873 4071 4914 5469 6423 5388 7617 8815 6968 4155
16100 4155 4446 11129 15220 14458 15280 13659 11824 10420 10879 16911 18418 19028 19466 16746 15207 15627
16084 15627 10508 6177 7507 11500 14194 15318 13570 12380 10015 3960 1290 5732 10177 9356 6508
16069 6508 6887 5672 3891 1326 1066 1833 2199 2858 2136 -2289 -5768 -6744 -7566 -10155 -7586 -3410 -1997
16052 -1997 -2048 -2364 -3941 -5963 -1950 134 -604 -2065 -1506 -1294 -2454 -4038 -4272 -903 1001 1484 2071
16035 2071 1148 1849 2771 -669 1042 1413 2854 3186 123 -3414 -3320 -4901 -6939 -7805 -7694 -4901 -2055
16018 -2055 -3192 -3889 -3367 -3104 -4085 -2829 -2496 -3958 -4665 -4226 -4723 -3089 -2118 -2297 -3135 -6191 -5056
16001 -5056 -5062 -3010 177 1195 -3264 -7365 -7292 -4610 -1930 -16 1805 943 -1850 -1109 -161 -2784 -2048
15984 -2048 -231 2133 587 -1994 -1269 -2201 139 -122 -1962 -2945 -209 1401 2249 940 2506 4158
15968 4158 2705 671 870 -1342 -3684 -2947 -3232 -3548 -423 613 1099 838 -2535 -5390 -4023 -3529
15952 -3529 -2666 -1240 -726 2522 1083 352 -67 -1264 -1940 320 1808 2001 -951 -492 -2088 1129
15936 1129 913 -3125 -3315 -889 -1933 -3256 -3668 -5331 -4348 -1895 -2321 -875 -1569 -3457 -3732 1711
15920 1711 3715 4056 1723 2030 1036 1673 1730 1489 458 -1236 -2717 -1219 145 -946 -2855 -3197 -5862
15903 -5862 -6944 -6103 -8917 -8229 -6880 -5358 -2636 -55 -4131 -855 5081 3662 926 -285 -670
15888 -670 -913 -2207 -1422 -3526 -1090 -1199 -4801 -4578 -1942 -939 -455 -1984 -3627 -3640 -6056 -6065 -481
15871 -481 1995 3011 5023 5050 3892 3593 5157 5852 4781 3384 4626 6531 5259 545 -21 -1874
15855 -1874 -2839 -1164 -2860 -2388 2013 2837 6144 5974 2219 2105 2977 922 -757 -1527 -4404 -5462
15839 -5462 -3608 -415 1584 2417 676 -1562 -4860 -3073 -2016 -840 2694 2582 1376 -1928 -1772
15824 -1772 1666 120 -1650 -853 -1123 -1085 -1430 -2695 -2494 -1199 944 -328 1624 1892 40 603 -725
15807 -725 -2636 381 559 829 1346 915 1241 2834 2370 3043 3359 1019 -1785 207 1246 1681 1006
15790 1006 -2099 -3327 -5223 -1885 376 -683 367 -727 -612 1399 971 164 -2957 -2846 -2195 -228
15774 -228 1991 934 786 -1669 -3945 -3582 -1643 -2507 1896 7409 7268 4134 75 -1509 -3577 -1820
15758 -1820 -1121 -1695 890 2688 1391 -1277 -928 -1848 -1670 -1137 -2187 -2443 -1047 -3200 -1121 -4
15742 -4 -2516 -1719 -2930 -3328 -806 -626 -3029 -3597 -4880 -7804 -7035 -2750 520 3377 2927 4990 -123
15725 -123 -3721 -4372 -3838 -758 -172 -2210 -672 78 3566 5935 5382 3667 -1451 -914 -3133 -2119
15709 -2119 -4558 -6656 -4376 -1963 69 -366 -1685 115 2335 2153 1466 -501 676 -699 -2655
15694 -2655 -2763 -3122 -2912 86 692 1384 86 -565 -1472 -1891 -1041 223 2510 3856 4857 4000 1536
15677 1536 -3671 -4773 -5167 -5508 -4070 -2471 -4037 -5895 -3184 -470 975 2220 -354 324 698 -1297
15661 -1297 -2781 -4861 -5314 -4684 -2822 -3184 -1258 153 -1490 142 688 1364 2188 -53 1106 1510
15645 1510 -20 271 1087 3360 3550 726 99 1143 2113 744 -1252 -1097 -8 -2220 -3815 -4339
15629 -4339 -5389 -5304 -1821 180 -181 -969 -208 1179 -81 -4417 -8188 -5804 -3759 -2674 -2105 -3102
15613 -3102 -2338 -3260 -4891 -4436 -3734 -6278 -7982 -8952 -4387 -274 708 705 101 1195 -2339 -2786 -5465
15596 -5465 -7466 -5139 -987 22 176 1364 639 -812 743 -1058 -165 595 3318 3729 2657 3280
15580 3280 650 939 -1455 -1867 -416 -1675 -2410 -1977 -632 -209 -1960 -199 1347 3101 5065 4647
15564 4647 2003 3808 2952 3006 3487 947 -734 -523 152 -617 -2598 -864 1192 2093 -1309 -1527 -1324
15547 -1324 -2230 -2430 -1810 -1479 794 2224 2550 1923 -1175 -1687 -3221 -4769 -689 137 -1243 -4269 -370
15530 -370 803 1169 2728 2719 440 942 2157 2421 191 414 1080 229 1685 2438 -1872 -572 1311
15513 1311 3776 2379 3402 5010 3872 5039 6089 3299 -652 -3844 -3743 -2139 1840 3839 2417
15498 2417 -804 1493 360 -1482 2886 2471 2070 1973 139 1599 4936 2602 2635 2258 -479 1491
15482 1491 1559 -1597 -1501 591 1047 -160 -1551 -983 -4351 -4143 -3205 -731 514 770 -1389 -1219 956
15465 956 -302 -2999 1085 4097 2919 -1066 -3134 -910 260 -405 -673 187 2280 2689 -88 -998
15449 -998 339 255 992 796 1276 2632 5559 6427 5276 4099 1198 1038 213 -880 349 1557 261
15432 261 303 2478 2644 3930 3936 3119 1318 19 38 1145 2064 1825 -816 2104 3729 2243 1407 1735
15414 1735 4638 2589 -2243 -5412 -3747 -619 -1664 -1131 -520 -717 2011 4535 5557 3496 1667
15399 1667 4740 4461 3116 3971 3139 -1095 -2537 -4030 -3881 -4391 -4881 -2856 -319 2742 3526 1114
15383 1114 4019 3988 -1236 -1998 -633 -593 -3331 -2944 -2044 -4236 -3528 -1006 -1242 140 1965 2547 4642
15366 4642 5184 5614 8856 7652 6784 5193 4676 5399 4433 3622 4062 3497 2200 522 2517 4231 4814
15349 4814 1466 4197 6247 4842 2380 2173 1544 2761 2350 1349 2392 2501 2392 3069 2934 2869 1017
15332 1017 101 -1831 -1197 498 1205 638 898 1330 5003 4269 2981 3945 4990 5672 4019 3661 1650
15315 1650 -1230 -3228 -3497 -3082 -3659 -138 1904 4251 2997 -354 -1799 -2371 -2504 46 1553 2290
15299 2290 4758 1959 2213 4964 6545 6680 4563 3740 2467 1195 959 4616 2310 1406 2219 608
15283 608 564 802 3039 1631 -2729 -3463 -5643 -5442 -3860 -2475 -1771 1534 2160 -452 -3651 -355 3467
15266 3467 3942 2279 1023 -1041 -56 390 2636 3501 2549 1817 1063 3024 6078 4011 1269 542 2528
15249 2528 1412 5051 8501 8779 7324 4851 2664 4251 7487 9417 7092 5939 3409 1734 -534
15234 -534 1199 1300 2058 1735 1633 854 196 -434 1 -780 322 875 1220 2525 3760 4951 811 42
15216 42 -284 -1251 718 1445 922 201 -678 -1405 -2917 -2253 -822 -1524 -448 -105 3417 5332 2564 2382
15198 2382 2954 3021 -775 -615 2997 6104 3762 574 -628 -1339 -3598 -6904 -5419 -1716 -1590 -1281
15182 -1281 -2864 -1246 -1100 -398 1765 540 -663 3412 4705 5236 5937 9098 6439 5730 5370 3651
15166 3651 2306 3543 3920 2321 877 2689 1671 1545 306 -1068 -24 1847 3638 4909 4365
15151 4365 2335 462 2046 3782 2287 3136 79 -1438 -2079 -2530 -4908 -7609 -5098 -4247 -5135 -4900
15135 -4900 -6108 -4340 1289 5281 5873 5639 5699 1066 -993 3019 4099 2231 2408 4018 3298 2095
15119 2095 820 -836 116 448 1491 3920 3138 1079 2378 2300 -138 -2168 -1607 -193 1481 2632
15103 2632 2867 1198 1221 6201 7575 4716 3643 6011 7274 4764 3092 3584 5243 4249 2873 358
15087 358 497 4473 4403 4482 7116 6717 9236 9931 7017 3270 2856 4209 3362 1781 654 339 3368
15070 3368 4424 1903 -566 1590 2784 751 -113 298 5048 5820 4864 3386 1969 2841 6551 6037
15054 6037 7196 9308 12857 12640 6960 2932 4363 4224 2834 1713 2275 2750 1888 2515 3079 1596
15038 1596 2818 3005 6220 7545 6898 7938 5629 4314 3682 5462 -902 -2245 421 -266 677 -58
15022 -58 796 2776 5339 3789 1261 -1021 -3455 -4864 -2379 -524 3128 3136 2341 -396 164 2885 4367
15005 4367 5383 6056 5514 5105 4928 1876 -1433 -951 1936 3766 5705 8267 6979 6084 7858 5833
14989 5833 906 684 3855 3758 4227 4678 4903 5938 2169 3518 4271 3489 3038 1330 2995 4829 6990
14972 6990 6393 3858 2960 6302 9130 9398 6929 2751 240 -265 -402 244 1284 1783 1965 777 58
14955 58 1167 2175 1863 -738 -2275 -2418 249 1317 1833 1983 5241 6076 4509 3698 5488 5471 6353
14938 6353 6100 5069 5991 7088 7948 10518 6553 6428 9058 6510 4886 5585 7375 4169 558 -2393
14922 -2393 -2137 336 912 1748 3545 4314 4589 3931 2942 3755 7446 8225 8906 12664 14504 21525 27400
14905 27400 25212 18212 14463 11738 7961 3509 3986 4561 6038 5683 8415 8152 7970 6919 1770 2929
14889 2929 3784 5543 6072 4756 1815 457 2698 5358 6629 6595 8828 10034 9468 10446 9091 5699
14873 5699 4239 6589 5587 2027 -1412 -1261 1301 2866 4169 4386 5989 6332 6573 7739 5817 5150
14857 5150 7847 8002 6158 5311 3288 4881 5392 4534 2746 1858 6084 8637 8179 8456 6972 5960
14841 5960 8057 7363 7908 11315 10996 10660 8838 4313 4181 5488 6597 9133 5932 3278 2261 2517
14825 2517 4747 6915 5670 5136 4544 4108 5208 6462 5279 1804 2499 2678 2179 2974 5155 7027
14809 7027 6847 7665 8467 8745 6931 6873 8762 10200 8822 6038 3478 1802 1789 3400 3881 2385 2671
14792 2671 5998 9940 6680 4666 9251 10969 10131 9104 6897 6047 5845 6676 9921 13214 10172 8776
14776 8776 7990 5698 6236 7477 6644 5980 6337 5806 3566 2323 908 2360 4003 3366 2097 2374 3336
14759 3336 6106 12553 17145 15975 14985 14257 13866 14958 15469 16902 9091 8946 18966 23299 10352
14744 10352 -2687 8205 23733 25448 17198 13153 23006 30162 30142 29598 33075 36927 41344 45931
14730 45931 56788 72563 90850 114118 144409 176098 206120 219328 217677 215492 212426 196388
14718 196388 162969 126701 97361 76441 63222 52589 42052 34915 34125 31135 30455 27665 24300
14705 24300 23309 20601 17827 18678 19605 17186 16054 15419 15639 14387 12346 14751 17521 16750 14384 13872
14689 13872 14392 15152 13490 13013 13989 12919 14521 12745 10138 6726 4706 4539 5419 5020 7147 10572
14673 10572 11406 8858 3729 2239 4577 7888 8910 9195 9325 10890 9966 7795 6439 4815 6012
14658 6012 11113 11710 11341 12663 13394 12247 12099 13721 13495 12579 13498 13398 11770 10035 8086 9026 8762
14641 8762 8273 8739 6097 5058 4226 2006 2286 2558 4358 7652 8758 8657 7183 5860 4661 4827
14625 4827 4501 3014 3135 5662 5221 4318 8876 7522 6542 5037 7630 9503 9848 11378 11948 10420
14609 10420 13491 13834 13429 13084 7961 7904 10468 10549 7498 5548 8452 10207 9471 10656 11390 7867 8060
14592 8060 12060 11801 8941 8660 9513 8726 8375 11731 13961 14090 13462 12935 13046 15088 15193 15791 15542 12407
14574 12407 13013 12466 13417 15495 14914 12960 11134 8115 8304 11031 8877 8906 8694 8966 12063 13826 13150
14557 13150 11896 12372 14915 14691 17609 15894 14573 15228 19238 20952 18404 15848 16722 16171 15843 13539
14541 13539 11356 12281 13735 14382 14896 14302 14585 13793 12891 10964 9523 6916 10627 16461 18069 15941
14525 15941 17239 16115 13541 12535 14128 12777 11485 12622 12121 9771 8456 12781 13449 11168 10515
14510 10515 12413 11862 9938 10304 9696 11461 13027 14490 18757 20207 20317 20952 16180 17490 20320 16800
14494 16800 16625 18273 17580 18869 17718 16544 13119 13838 14301 13454 15102 12231 12122 11061 12538 13257
14478 13257 14686 15561 19288 19533 18383 15409 18743 18392 18463 19940 22022 20159 19178 21979 21678 19237
14462 19237 17983 18917 16956 12191 10204 11470 12814 14192 13168 12721 13304 11482 11806 12885 12923 12009
14446 12009 9601 8815 10091 11608 14255 17103 17821 19801 19519 16904 17581 17743 14675 11385 10108 10862
14430 10862 11054 11183 13378 15943 14344 14545 15137 16447 19992 22699 23003 24984 24028 21144 19599 19359
14414 19359 19504 18268 15753 19820 20535 18703 19621 18611 18988 21867 22287 20472 19442 19354 17143 17448
14398 17448 17841 19925 22626 19565 18344 18313 17188 16563 18854 21687 23395 28704 33445 32098 32184 31454
14382 31454 36061 38815 38237 35729 38994 39927 41426 44595 48578 50963 51229 57459 65547 73283 86171
14367 86171 98772 112947 129585 147484 168896 188922 217292 261260 327095 430740 596367
14356 596367 851100 1189014 1487168 1558572 1476958 1461059 1528156 1479122 1192474 837048
14346 837048 559517 379980 270875 202850 160803 135179 117566 104597 98423 95476 87458
14335 87458 76087 70420 65936 62512 59049 54087 48356 46234 43428 43415 45198 42524 42311 42053 39657
14320 39657 36856 36384 38040 41128 41963 41313 39422 37995 36161 36235 37885 36200 32622 30866 27064 24970
14304 24970 24219 20826 18007 18561 20885 20688 22195 21383 18918 17654 17109 21009 21023 22872 24836 24358
14288 24358 24601 25455 28755 30248 30096 28897 26311 28491 28811 28960 30846 30725 30446 31549 30642 30787 30208
14271 30208 27818 27609 24313 24235 28707 29012 25426 24860 22877 22072 21601 21948 25608 25413 25386 25405 25857 24545
14253 24545 22740 21737 24440 23699 23258 22763 23255 23458 26213 25410 25525 25441 22986 21138 19486 17657 17558
14236 17558 14468 14148 16314 21047 23291 27784 32588 32023 31753 31892 30707 31018 31847 29035 27177 27778
14220 27778 27751 30115 34600 36060 34802 32336 29886 27110 29613 30373 32836 33134 31024 32158 32321 33753
14204 33753 33062 33236 35413 33811 27961 26512 29295 30882 32111 31490 30098 32853 37351 35413 25240
14189 25240 18280 12072 6429 -2961 -9923 -10298 4027 16311 18405 20473 30658 43522 51360 57431
14175 57431 59530 56928 57530 59068 59498 58857 56679 57493 56382 58021 61316 60264 60289 60625 62319 61601
14159 61601 60910 59924 61641 63836 65485 67453 69178 66876 67397 69847 74078 80738 82456 84944 93503
14144 93503 96734 102111 104480 107288 110983 118109 128434 136781 140098 135546 129867 130074 131920 131028 126607
14129 126607 127519 128724 129691 130307 133163 137290 131333 118045 110610 103587 94669 83476 76957 75700
14115 75700 75664 72036 70842 73228 75483 75571 74690 73659 72229 71383 66551 60608 58007 57237 53738 52424
14099 52424 49931 46437 44653 47515 52668 59980 65376 70537 77660 84932 90014 94312 99241 101561
14085 101561 98131 96425 95374 96239 98424 95958 94818 93915 94395 95590 102413 106705 106906 102352 103579
14070 103579 110511 109984 93040 69067 46077 23358 5490 -10338 -23010 -31646 -37043 -26072
14058 -26072 2194 29505 48398 56270 64736 74666 84048 86903 79949 73871 72913 74100 79333 84845
14044 84845 86570 86329 78599 72090 64801 62236 59605 51577 45514 44647 54133 71555 85434 98087
14030 98087 97803 90767 89709 102873 113265 99776 75287 57053 51660 51660 46878 41958 45624 66059
14016 66059 98686 148680 214302 294803 372901 425819 460993 510815 619714 711918 690797
14005 690797 585901 502387 505344 506215 447365 385565 385887 441315 494485 532912 573392 611888
13993 611888 643031 654781 637483 589806 521850 452164 391081 346859 318939 297217 284910
13982 284910 284547 288774 290356 288170 289699 290040 289748 289280 290347 289665 291928 302777 314688 320251 328555
13967 328555 337845 348860 367764 381116 384428 384808 396758 416954 430167 430587 432827 440927 447678
13954 447678 447016 448700 463167 484875 494149 496078 498860 507397 516294 526181 536109 543909 548341 560391
13940 560391 583923 605907 617490 623308 635865 658013 677326 690234 705493 731620 766315 799494
13928 799494 830763 864255 895097 923918 952488 980450 1014625 1054031 1097390 1144779 1202308
13917 1202308 1275105 1350189 1420029 1490634 1568675 1659832 1764984 1868215 1973656 2089953
13907 2089953 2218905 2360974 2524749 2720517 2941589 3173595 3439296 3779735 4187799
13898 4187799 4648577 5200028 5870876 6667537 7609072 8806878 10409304 12458742 14730282
13889 14730282 16847970 18927709 21528651 24866228 28693362 33042266 38714426 46881907
13881 46881907 59215239 78557493 109304809 155675764 213454678 257905474 261847845
13874 261847845 243219587 239412537 252696699 247646893 204046086 146347362 99275269
13867 99275269 67910132 48301618 36086616 28320871 23139409 19451200 16649531 14377609
13859 14377609 12558748 11237328 10169479 9034663 7782105 6601134 5633101 4890897
13851 4890897 4341173 3929087 3588860 3306560 3064517 2826017 2596127 2397432 2234001
13842 2234001 2078155 1930669 1802966 1687942 1576546 1471455 1391556 1326902 1264175 1202557
13832 1202557 1140722 1084975 1049761 1023405 986732 935663 886731 844128 804426 760232 719638
13821 719638 694253 671048 646357 623187 603007 584857 567667 539285 509745 490654 470112
13810 470112 450866 429199 409900 399723 390831 373626 352128 332606 316601 303136 290720 274325
13798 274325 255075 240904 235035 236853 231965 217473 206195 199598 194194 183897 173277 168966 173247
13785 173247 175136 169409 161455 161073 164299 169871 167462 162312 160928 164399 166031 161027 159462 160811
13771 160811 159221 152189 144173 140694 138643 136888 139465 139287 133120 119779 100466 76606 46966
13758 46966 16723 -21635 -69033 -78217 -19319 64181 115018 130493 153123 190237 228746 253412
13746 253412 234030 168255 117720 96583 67711 7876 -38198 -29380 -1164 1646 -6759 2085
13734 2085 29371 57058 77089 96617 116825 130548 133660 129962 117984 111047 100723 81075
13722 81075 59567 43054 40064 46233 49878 48921 46540 54663 73383 92449 104509 102256 93656
13709 93656 85480 79884 75486 71932 66702 62860 58592 56289 59186 66637 70683 65087 55016 53872
13695 53872 54873 58364 65371 70375 78192 99408 126716 150955 164557 166716 156737 137410 118206
13682 118206 105713 87565 56698 26145 15061 21826 33374 44908 50578 52208 52026 51555 54407
13669 54407 56240 47912 37059 29509 25548 21600 14770 10154 8720 9947 11775 14427 18299 19879
13655 19879 24519 30716 34696 38352 43465 47077 46452 43168 36717 33965 35420 37395 35477 30458 27927
13640 27927 27691 27865 32686 33018 33878 37019 41039 40191 36355 33772 34083 37600 37597 35299 34464 35652 38639
13623 38639 38756 36462 34239 34999 31407 29134 24625 18434 12563 12450 12236 12829 15298 19546 22802 22852
13607 22852 24904 26232 29866 23798 17675 15891 14688 8920 7487 7823 7819 8193 2460 283 1321 1840
13591 1840 2943 1539 1535 2106 4363 4981 301 -3493 -2558 -1088 -4425 -4207 -2428 -3733 -4185 -7977 -10216
13574 -10216 -9196 -9314 -9845 -7886 -2092 7912 21938 27908 29205 35941 53568 63314 59984 53757
13560 53757 45866 36989 28665 23715 19008 15173 11070 13139 14383 18067 22073 20429 17338 13327
13546 13327 8131 7876 9930 10973 10611 13968 16904 15824 13748 13302 10067 9711 7657 5650 3333
13531 3333 5095 8881 10741 10945 13150 15825 18249 17563 15965 16887 15945 12182 7984 11049 12596 13434
13515 13434 15344 18045 21444 22326 18773 16646 18963 18493 15117 12968 9610 8603 8263 7052 9569
13500 9569 12123 10908 11392 12266 15187 16197 13690 12987 11738 11679 12953 13708 12008 9518 7846 7386
13484 7386 5762 8224 7699 5150 5559 6533 7414 2332 -637 545 -1215 -3362 -2748 -2096 1139 4114
13468 4114 4010 7697 8180 5833 4196 2665 3356 3217 4681 6663 8365 7336 9107 8181 7230 14479
13452 14479 18513 17170 14059 11414 10888 14425 14943 13762 11015 10332 7999 4016 437 -1267 -2891
13437 -2891 -5013 -2442 -1797 370 327 1581 1661 443 1913 3190 3161 3649 4805 5658 3971 3247 3627
13420 3627 6750 11637 11660 8039 6415 10219 14950 17442 18654 24108 32609 45668 55820 61098 70896
13405 70896 82957 96950 111621 123819 137710 155107 177440 204899 243999 304258 401268 553424
13393 553424 797083 1133486 1455298 1564919 1487752 1450738 1518365 1503886 1249105 895706
13383 895706 608001 420036 305891 234500 190980 166972 151378 145246 148008 162840 199329
13372 199329 270883 385885 496644 447565 303273 189212 122231 86634 66873 55124 48044
13361 48044 41901 38691 36507 35035 39077 41934 37193 30663 26366 24749 19773 18890 18440 19076 19449
13346 19449 20400 16800 12413 9526 7995 5581 5291 7311 6938 8197 7036 5037 5461 4532 1642 1730
13330 1730 3253 4782 3497 1474 -1878 -1828 1608 2414 6868 7482 6142 6292 6910 5888 6600 5226
13314 5226 63 -4987 -7284 -7709 -8418 -6061 -3960 -592 -526 670 -435 -2325 3 2840 2744 1823
13298 1823 597 1316 1187 1788 1637 734 -2230 -2193 -3554 -2733 -1063 1553 1334 142 -863 -2130 -2793
13281 -2793 -419 1652 2390 3158 5668 4066 1000 1147 -1277 -2950 -5389 -7832 -8775 -9465 -12520 -12926
13265 -12926 -10003 -9500 -9502 -4516 -1707 -1899 -4315 -1818 -1008 813 149 1968 1869 -904 -1912 -1864 -4270
13248 -4270 -2158 -601 -1006 1527 1864 1199 1509 2968 5428 5166 -25 -1149 -180 3977 5756 3868
13232 3868 -963 -1021 -583 -852 -3824 -5468 -2294 -3539 -3939 -63 393 -1100 -3532 -2990 -3769 -2511 -3992
13215 -3992 -6055 -4383 -2236 -2704 -2936 -273 330 2389 2675 754 892 4731 3894 4071 2928 -83
13199 -83 -2278 -4167 -6914 -6804 -4510 -4363 -3802 -3545 -6198 -6157 -3015 -1839 -2289 -1498 -3907 -6025 -3470
13182 -3470 -1877 383 -1948 -1892 1189 -698 -3823 -3488 -2895 -1007 -603 -2511 -4975 -9125 -8465 -5609
13166 -5609 -1904 -852 -1247 -3630 -4100 -633 1392 2884 1808 -1961 -3206 -2159 -542 -1694 -1871
13151 -1871 -1778 -577 -17 -710 -386 -1179 -2277 140 1842 516 -2576 -6034 -6367 -6605 -5675 -4726 -7342
13134 -7342 -6240 -2884 -5046 -7824 -9163 -5867 -743 1341 329 616 111 3574 3358 2828 2546 -1783
13118 -1783 -1237 105 2278 986 1178 -388 -4415 -3782 -3104 871 3670 3867 3088 3608 1189 -2031
13102 -2031 -4048 -4584 -4911 -5867 -5148 -3253 -2607 -3767 -4741 -6284 -4759 -1971 1951 1833 -1384 -4364
13086 -4364 -3964 -760 -77 -253 -1288 -4197 -5785 -5836 -4078 -2531 -473 1159 1121 -170 -1219 -1548 -841
13069 -841 -4001 -4318 -1154 -1960 -4167 -4805 -5374 -2917 -2028 -2181 -3986 -4395 -3216 -2489 -1910 589 2369
13052 2369 -258 -571 -760 442 -1379 -4087 -6300 -6310 -3421 -2663 -4200 -2536 -1208 -1643 -3941 -2169
13036 -2169 -1391 -2284 -3307 -2642 244 -178 -790 -3136 -2328 1732 1559 1431 -225 -2125 -227 -875 -2711
13019 -2711 -2450 -3384 -7534 -8259 -4978 -3337 -3418 -2385 -757 665 101 2321 2341 412 2328 745 153
13002 153 -1381 311 1240 75 -1762 -1892 -3409 -2901 -1135 -10 -3267 -3466 -2551 -5513 -11264 -7454
12986 -7454 -7253 -7143 -7729 -5673 -808 1492 -1045 -2216 -2298 -3211 -2433 -1343 -972 -4470 -4449 -4090 -4351 -3970
12968 -3970 -1836 -1414 -2271 1240 1670 -947 -1321 814 2151 968 1818 -454 -2253 -2660 -2307 -800
12952 -800 -1757 -2823 -2570 -1648 -2085 -414 -3025 -3752 -3528 -4981 -6436 -5438 -4571 -3299 -3352 -3678 -3463 -4832
12934 -4832 -6414 -6854 -5771 -7326 -5711 -2641 -2545 -922 2047 2290 -1836 -4731 -3350 1066 -1636 -3217
12918 -3217 -1279 -2403 -3473 -2104 1967 4655 4055 2193 -1306 -3627 277 -992 -2976 -1502 -2554
12903 -2554 -1445 -69 1370 1491 587 103 75 -741 -1553 -156 -560 695 3867 5473 5124 2939 1629
12886 1629 2996 3014 2714 -551 -2677 -3035 -2730 -5366 -7637 -6483 -3797 -831 -443 -2129 -880 79
12870 79 1976 1968 -2005 -952 -950 596 3922 3451 240 -6037 -3586 -1489 -1279 -2122 -4486 -3427 -2051
12853 -2051 -2649 -4736 -6727 -3640 -523 765 -362 -2117 -1008 1949 2262 2039 5648 5943 5147 1308
12837 1308 -2448 -3133 -4570 -4641 -2664 -289 2345 3465 1362 -1104 -1730 -3048 -2791 -2411 -4963 -3030
12821 -3030 -3558 -875 1787 1117 2 -858 -1366 -3043 -5046 -4548 -3268 -3559 -3445 -939 -1542 -4010 -3414
12804 -3414 -4036 -213 3377 1639 -2082 -2764 1270 674 260 2917 1771 -1273 -4566 -3569 -4152 -4631
12788 -4631 -6607 -2998 -1130 -3156 -3194 -1616 -3605 -3374 -1008 -3651 -3628 -1673 2930 4520 3513 4796
12772 4796 3914 2571 2548 477 4231 4275 1381 698 -358 -3113 -4626 157 2187 2694 -1112 -2342
12756 -2342 -1398 -5611 -6898 -7090 -5125 -2720 -5138 -4527 -3387 -1204 -1467 -2886 -5622 -3773 -3773 -3590 -2384
12739 -2384 717 3348 545 -1878 -2333 -1785 -743 373 -761 -3855 -5326 -2874 -3024 -2659 -353 -2115
12723 -2115 -1941 -2496 -2984 377 -144 759 5257 4597 803 530 -1603 -7409 -5477 -874 -1371 948 1294
12706 1294 -1286 -2084 -2056 184 2190 -894 1696 2284 2274 3362 2250 1452 690 196 -390 1283 470
12689 470 -790 -948 -1845 -2820 -1846 -708 -1796 -1316 3516 4359 -92 -1241 -4505 -6662 -6809 -6393 -4335
12672 -4335 -382 1744 1917 796 1602 1597 -740 -19 3120 5181 7368 4788 4730 5227 4763 7113 7814
12655 7814 6006 2870 825 4316 5097 2532 -20 722 1491 683 -1437 -1298 -3242 -4012 -3194 -3658 -5368
12638 -5368 -4693 -4853 -2142 -2208 -3684 -2080 -4522 -4261 -3776 -6107 -1494 -105 -2449 -2526 723 3783 2150
12621 2150 3405 2689 3153 3429 2646 2167 5010 5890 7964 8099 8321 7198 8960 10526 6590 3189 752
12604 752 82 -2005 -3210 -3552 -4420 -2202 334 565 4505 6257 4163 2543 -188 -1353 -581 -757
12588 -757 1946 1040 2025 1736 -361 -2177 -3750 -1725 2098 4023 3533 190 -1586 392 -142 -1047
12572 -1047 1895 3932 2719 2089 -20 173 2740 2631 3240 2482 2348 2929 2104 2437 2021 2441 -209
12555 -209 -2620 -2472 -855 -2348 -475 228 1100 1864 2152 1269 1516 3674 1404 -409 -1412 -1344 477
12538 477 2877 3853 1645 -1437 -560 2641 5105 3566 1567 1483 1191 670 2471 5426 5214 3912 5490
12521 5490 6922 5460 2567 211 682 3589 3714 2217 1523 2107 5446 4600 2084 120 1808 3061
12505 3061 4879 4002 1778 3041 4531 4752 3755 5043 5000 4175 3245 2936 5688 11073 9381 3827 3290
12488 3290 2238 2725 4028 7208 9674 11809 16027 18112 22629 28764 31606 32051 31142 30672 28468 27381
12472 27381 27980 19595 11488 7215 1710 1201 3626 6648 4660 4229 3654 1911 1568 4592 6394 8681
12456 8681 10389 7646 5893 7118 8634 7980 5179 3483 2341 1237 70 -1841 -1558 -112 3372
12441 3372 5854 9002 7696 3865 2459 995 910 1685 4128 4927 2358 3721 4608 6277 1908 -1289
12425 -1289 -887 1766 3380 3622 362 -557 2675 5459 5564 5801 5274 4578 5461 5764 3881 2699 2129
12408 2129 1824 3461 3779 1616 -1056 2414 3576 3982 3684 3896 6848 3580 111 -1066 2797 5917
12392 5917 7268 7101 7708 7361 7710 5936 5480 521 410 3620 1334 1387 4586 8768 6407 4354 5702
12375 5702 6284 5952 2333 3194 1186 -1796 -769 3851 5080 5991 7094 4895 2484 2147 3345 3741
12359 3741 1528 4220 8236 8000 6563 3639 2072 5413 6719 2990 2352 5447 7574 6657 7091 6334
12343 6334 5204 2962 4167 6493 7655 5346 3590 4380 4875 8221 9492 8697 6763 6246 7327 7160
12327 7160 7238 6403 5145 6454 7549 6245 4234 1013 2807 4652 4487 4508 5584 7578 7042 3336
12311 3336 3346 2974 1186 3469 7254 12448 14846 14542 13874 16576 16002 19988 29127 47942 75629 111900
12295 111900 138913 119858 78700 48010 29434 20863 17197 14373 11115 9915 10759 9326 7486
12282 7486 7309 2183 -610 2253 5784 8230 6902 6293 8516 8785 5510 5071 5610 6476 7476 7979
12266 7979 8791 7474 4243 1759 2435 4339 2320 4059 7036 9415 9156 7602 7560 8235 8858 10421
12250 10421 8181 6608 6111 4561 2845 1052 1727 4063 5884 6005 4841 4807 2690 379 18 913
12234 913 3599 5593 6270 6660 8335 9208 8571 7642 9107 9226 5939 2715 2577 3751 3855 5492 6706
12217 6706 6390 4740 6258 7339 7404 4650 2881 5461 4043 4118 6190 8611 7330 4437 5305 4758
12201 4758 7285 7489 6065 3783 5499 7577 4520 1083 1302 2144 2834 5298 3920 2034 4465 6148
12185 6148 6869 4555 5650 5588 7758 9431 11143 8651 6698 4665 5627 5708 7501 8848 13393 13579
12169 13579 9893 4541 2789 -571 346 2000 635 -4444 -4478 -505 2318 3684 7197 7396 8671
12154 8671 10437 10164 8869 7363 6993 10169 8290 5686 3931 3661 3877 6120 9025 8045 6700 9912
12138 9912 12202 9726 10005 8825 6383 6134 7598 7228 6634 6337 7765 9496 9435 3982 4910 7951 6809
12121 6809 4466 5834 5436 5886 8481 9858 8852 6817 6783 5752 4638 3837 3928 3439 3682 2814 547
12104 547 1847 1898 961 874 1443 4901 5943 2785 3452 5423 6567 8482 8339 9778 8688 7427 5629
12087 5629 5632 5613 9456 11688 11766 11570 10766 10074 9215 6784 5874 8091 6296 2549 3895 5584 5152 4523
12069 4523 2432 144 270 454 1152 3137 4317 4313 4258 5775 6276 5207 5280 4899 4760 7026 7357 8286
12051 8286 7758 7469 9020 9904 7808 10845 12682 9248 8993 8570 9121 11077 8072 4766 6601 7184
12035 7184 11430 13543 12956 14600 14130 8912 9956 11619 13585 14390 13740 12557 16690 20077 23609 30759
12019 30759 37809 35420 29004 24337 22308 18557 14087 15379 14909 15489 17402 16512 13084 11448 13658
12004 13658 18892 22692 25357 25313 23584 19285 16250 13012 11686 10992 10315 11259 12242 9325 11406 14501
11988 14501 15412 16669 17037 19811 21428 23066 21140 21333 26863 33645 39132 44723 56237 79867 111508
11973 111508 136567 129229 100036 73749 54948 40124 30497 23743 20450 16306 14029 13218 13965
11960 13965 15906 15533 15878 13520 11134 12857 17483 19950 20529 20859 20790 16277 14286 13278 9831 9470
11944 9470 11668 11458 12167 12295 13221 14133 14320 18419 18320 14950 12284 11836 12247 11473 13055 8707 10764
11927 10764 12371 12570 15536 17507 19317 20128 25049 33645 49123 68238 81409 69634 48479 33252
11913 33252 24869 22496 18364 13538 12527 11904 11668 12052 15620 18545 18172 19249 15844 9854 10557 11135
11897 11135 11226 9837 10737 10673 9706 8581 6993 6476 12388 13457 10288 9546 13503 12708 10008 11028 11534
11880 11534 13638 14632 10622 8930 10829 12201 13117 15849 17568 19922 18646 13940 10183 10700 11966
11865 11966 12428 11211 11550 12056 12845 11864 12666 10830 11927 14611 13914 12292 14189 15920 18399 20042
11849 20042 18569 19762 19549 19217 15367 12633 12879 13402 10097 10768 9698 11418 15631 15699 16523 19204
11833 19204 20309 21024 25149 26939 28537 25443 26387 26701 26013 27930 32437 36079 41523 45765 49651
11818 49651 53476 61953 73901 87839 104980 129220 165292 219694 287555 370371 444156 466900
11806 466900 421024 337659 253265 185748 139555 105653 86207 75231 65248 56437 48594 43888
11794 43888 38104 32396 29844 29246 27023 27363 29007 25895 27173 27790 28780 29845 33050 36092 35354 30126
11778 30126 26616 24494 22826 19236 19167 17983 15890 13218 13819 16886 20776 18908 16428 15269 16015
11763 16015 18234 20214 22212 21455 20097 17660 16633 16867 17524 18752 18389 14965 12310 12809 13629 16200
11747 16200 23618 27065 27807 23187 20749 21024 21997 18228 17291 18971 21734 21554 21458 22790 25197 25130 23100
11730 23100 23938 24993 25557 26289 26569 28921 31751 37167 41590 50142 68626 102247 153103 204927
11716 204927 208931 154598 100981 68441 50787 39440 31834 30098 27793 25002 21573 21976 24568
11703 24568 21745 21272 20902 17659 14556 12008 9721 9375 9326 13013 13431 15082 16561 16963 15619 14873
11687 14873 14025 13292 15638 15668 13465 14157 14630 10613 6394 11611 18161 16121 11433 11468 14821 18678
11671 18678 17158 14452 14717 18221 20821 19174 18530 15780 12556 13112 10798 9454 9956 12304 14016
11656 14016 15281 17427 16688 16038 16002 15991 15702 16789 17487 20265 20309 20439 20092 20775 19957 21302 24248 25419
11638 25419 22440 24462 25455 24446 28885 29473 26143 31846 39753 46073 52164 54356 53102 50780 52701
11623 52701 63804 87111 114071 120220 100883 73267 55548 44758 36391 26467 24811 26664 26781
11610 26781 27773 26237 26358 26308 24667 25630 25634 24587 25872 27571 25199 30474 33184 27760 23411 21409
11594 21409 17801 17702 19411 17921 17410 20575 24180 23883 22210 22408 24269 26234 21979 20740 20318 21097
11578 21097 23402 23827 24135 22659 22208 20141 17587 19773 21826 21331 21412 20052 17119 18346 18357 17670 22751
11561 22751 23880 21211 17724 19654 25890 28354 28953 26538 24761 21912 21606 21398 21317 19582 18912 19800
11545 19800 20197 21251 23995 26601 25082 20795 22026 24520 23580 24397 24026 24550 25333 29538 29257 27693
11529 27693 27639 28158 25512 23596 25250 25204 22580 21062 18392 18872 19329 15424 15708 18670 21294 22098 20404
11512 20404 20335 19252 19724 20908 20694 23835 26438 24439 23822 23672 23541 22868 20771 22869 26218 29566
11496 29566 29036 27056 26391 28916 30041 30736 29907 29012 27259 27542 27317 25026 23372 24383 26017 26288
11480 26288 28293 29184 29978 30811 28376 28958 26676 28265 30695 30452 26872 25231 26632 24535 28322 30996
11464 30996 33057 32976 31566 31614 34281 34118 32305 26986 24708 27280 29904 33235 36996 38507 36716 36023
11448 36023 34689 34270 34410 38144 36477 33970 35758 36983 31839 29579 28598 25936 24098 23397 24461
11433 24461 30036 33727 36645 38656 39895 39410 38011 37700 36662 34292 32892 30601 31560 30007 33056
11418 33056 37973 40674 39378 36933 36876 40029 42009 42264 43809 43692 39489 37350 40006 38137 32855
11403 32855 28683 30076 32245 30693 32541 37850 40032 40669 39045 33853 30351 30620 31882 30285 29615
11388 29615 32895 36373 37316 34013 32931 36165 37259 39425 41192 40012 36089 34984 32585 32850 34612
11373 34612 37014 39084 42732 43675 42306 40802 40957 41891 42112 43393 40839 39296 40172 40525 39229 38482
11357 38482 34826 36649 39372 39999 41452 45644 44815 45381 49935 53684 58391 55510 52960 54079 51244
11342 51244 48135 47033 47700 47735 48371 45788 45066 45559 43719 41691 41851 44585 47438 47721 45955 43992
11326 43992 42403 41829 41838 42632 44716 48123 50098 52508 54750 57384 57093 56032 56220 61276 66631 69371
11310 69371 71304 73326 73033 72791 70976 64316 60903 58915 59215 56474 53275 52815 55028 59734 63991
11295 63991 66883 62843 62400 64205 68863 72591 72757 71976 70808 68972 65148 62186 58250 55292 57488
11280 57488 59406 61075 61631 66179 69416 69288 68765 65878 64811 67671 73693 84684 89570 91031 95395
11265 95395 100761 105694 105211 104329 105308 107949 106849 103458 100060 97463 102261 104745 108777 115049 116160
11250 116160 116324 116666 119262 121658 127211 132732 137415 143687 148623 150458 147898 149268 157855 163971 170480
11235 170480 172152 175515 178460 180957 183514 189250 197515 212973 234298 259668 284742 309190 340154
11222 340154 381036 430744 500021 594888 733008 950283 1306109 1880303 2722502 3615743
11212 3615743 3836508 3106707 2153921 1445750 1006624 747499 593274 496831 428492 379033
11202 379033 343995 319107 302041 290984 279775 271633 265697 263233 261914 264524 270690 277900 282394
11189 282394 292981 298403 296711 290656 289113 287682 288714 293224 295727 300146 304835 312508 320990 326113
11175 326113 328923 331883 333399 335616 337494 338223 339327 344369 348704 355603 359836 360018 362690 366211 366497
11160 366497 365928 369134 374853 374497 370663 368530 366153 364828 362664 361297 358458 361990 364840 367478 365358
11145 365358 361104 355174 349234 343908 336215 330221 326940 327638 331884 335139 334857 330516 323048 318538 311307
11130 311307 302190 292037 285666 281921 280327 277278 271488 269052 263815 258234 250354 237607 217607
11117 217607 198573 183693 172500 161650 155546 162280 186343 212283 229331 242093 249837 252049
11105 252049 252646 251676 246823 238127 227687 220511 216473 212956 206521 204711 204373 201692 202073 202949 205457
11090 205457 209527 207698 204898 201415 199471 195664 190824 190934 192629 192446 192197 194858 204811 217339 227709
11075 227709 230028 231047 234998 235720 245594 252054 256823 264988 275257 284888 298394 303743 290173 269181
11061 269181 249833 240505 242328 248218 267474 286210 288965 277838 269695 257951 231337 205353
11049 205353 185893 168403 158097 152895 153847 168771 183445 184457 176934 168883 166067 165239 161912
11036 161912 160581 162447 162040 154118 144378 133734 120313 114178 114295 116653 119291 121206 128657 140525
11022 140525 150580 157781 163338 170285 180131 185018 186023 182125 179499 177379 170592 169061 173547 177191
11008 177191 179815 178528 172331 167275 162830 168942 182120 194237 203094 209611 220156 206629 149473
10995 149473 76182 8700 -52997 -89138 -83406 -37481 16125 60977 103182 142992 167060 176777
10983 176777 163063 141794 128574 129768 135983 146281 155317 159762 162306 164427 166103 160666 153339
10970 153339 141508 125879 111537 104357 101203 101408 100029 110667 144032 187399 231786 262540
10958 262540 253394 211575 163470 140273 137182 132030 121290 107268 96520 91076 85818 85830 113453
10945 113453 173967 270073 416791 600260 786959 926741 977938 948801 920439 1010999 1144321
10934 1144321 1129763 940730 687068 542905 480612 450040 519332 694597 889681 1057990
10924 1057990 1177015 1215846 1156512 1029901 889308 756732 648624 567040 514883 490208
10914 490208 481887 482132 487504 491020 494487 497736 494136 484990 476476 467227 462943 472403 492356 514014
10900 514014 532684 551628 562748 570783 579518 589954 615894 653347 684934 699035 701551 703522
10888 703522 711943 725595 736310 745609 757052 766604 769114 770834 795671 836004 869549 882011
10876 882011 887819 882096 871529 875696 901539 931288 964731 1007994 1057054 1097122 1116888 1119691
10864 1119691 1123432 1138289 1172635 1212520 1268421 1340582 1411797 1477228 1535524 1583417 1615841
10853 1615841 1645494 1687785 1744955 1819837 1914936 2021922 2138116 2272608 2417323 2559909
10843 2559909 2698586 2822398 2953988 3117776 3324989 3558573 3814146 4092757 4370063
10834 4370063 4655095 5005209 5466957 6053894 6807324 7824655 9241290 10982737 12467972
10825 12467972 13062511 13286608 13851303 14936798 16562796 18799194 21724415 25322903
10817 25322903 29562679 34497516 40287986 47172489 55482616 65917858 80011385 100458352
10809 100458352 131436567 179479212 253151572 358474375 481622556 566587564 546791272
10802 546791272 438750164 314631179 215982019 149020989 105983633 78285583 59906349
10795 59906349 47026569 37373762 30026598 24571536 20540729 17550653 15303918 13528963
10787 13528963 12032252 10742387 9662818 8868566 8451329 8423955 8770717 9286491 9171780
10778 9171780 8054627 6711500 5657469 4909113 4344144 3886682 3528770 3250313 3015058
10769 3015058 2824155 2674443 2529178 2371704 2221014 2089078 1979863 1894594 1831869 1768047
10759 1768047 1699911 1643289 1588850 1514306 1422842 1333678 1258021 1193217 1140439 1102151 1080749
10748 1080749 1068440 1051446 1016593 976778 929517 871027 806028 746635 709552 694354 687105
10737 687105 674611 660438 646853 620596 579445 532841 489282 457858 447485 448596 445716 428858
10725 428858 402063 380343 370512 358242 345356 334277 322203 304404 284805 273249 273498 287929
10713 287929 304750 306482 297122 286941 282278 280284 280353 279662 285165 291172 293807 286776 274885 256284
10699 256284 240100 226491 221642 225501 235051 245697 251568 247149 227147 182226 116501 44640
10687 44640 -19454 -57755 -86716 -116788 -73576 117389 383276 580759 651641 600174 466715
10676 466715 320950 244069 189565 102118 72913 94615 71457 -1969 -65460 -80883 -45968
10665 -45968 7636 65423 131432 189467 224794 236467 235233 231816 224515 218525 210540 201205 195822
10652 195822 182275 153411 129634 117158 138497 216408 334306 478006 631509 731730 694831
10641 694831 563643 436514 339751 266858 211940 173230 145838 129128 122545 117067 113291 111560
10629 111560 117606 130624 135661 125404 104685 88671 84704 96995 129749 173446 223276 274988
10617 274988 322520 346705 334694 299796 236157 135551 54050 25115 24186 20924 22681 30203
10605 30203 43097 57983 66650 66354 61615 59182 63393 69300 68918 61529 46700 37664 29518 25297
10591 25297 20957 19286 21301 25555 31285 36017 42442 51564 60740 69165 72164 72876 76956 79342 73048
10576 73048 64700 56591 47924 45718 52538 60021 61360 59227 60289 62886 59504 56496 57050 61214 64291
10561 64291 64551 62742 53479 47359 45169 46891 51333 55265 56633 58118 59173 58049 51078 45456 37005
10546 37005 28364 22703 15736 13230 13753 18399 24630 34542 45457 53975 53242 47581 41418 36555 31084
10531 31084 28580 27658 24259 20765 15738 13671 12509 11326 9491 7210 7067 5773 4528 2630 1752
10516 1752 3265 3500 -358 -3432 1997 6240 3862 1777 1285 -379 -4331 -12413 -13790 -14312 -13941 -13814
10500 -13814 -10534 -406 16235 45590 80289 100206 98227 88119 79043 70632 58889 41262
10488 41262 27738 21637 18441 22603 22493 22443 27915 31730 33708 31845 30464 27316 21173 16600 15375
10473 15375 14942 17048 21322 23780 28985 33847 29643 24966 18585 13222 10144 4235 3822 5183 10688
10458 10688 16419 18088 20762 20064 16121 14719 12148 11133 12615 17005 18608 18215 21957 25566 26375
10443 26375 21042 22542 28684 30252 27834 24719 20938 18120 18508 19103 18948 17521 18241 19209 21235 26379
10427 26379 32370 38541 36717 33785 31914 30557 29319 27662 29185 32583 33318 36465 43138 50675 55793
10412 55793 66519 72342 73898 74556 76194 81405 88948 96907 110428 127363 148640 174331 208737
10399 208737 248470 295010 351366 431098 557212 756783 1082032 1611513 2409826 3331632
10389 3331632 3712938 3100809 2141668 1385925 907003 616413 437874 325255 252694 202839
10379 202839 166455 141624 122840 106086 97592 90067 78115 61686 46913 38709 34173 31016
10367 31016 31955 34897 37826 38128 29709 23743 22239 21036 21842 29109 32003 31086 34357 42653 53128
10352 53128 67068 88187 111486 126284 127369 117156 95021 70064 48812 34283 27725 24289
10340 24289 21939 21337 28063 37483 44972 43702 35416 28575 23526 23962 22814 21702 21411 21666 22862
10325 22862 21676 19545 16855 11380 9748 10199 11943 14909 15384 15961 13667 9798 8044 6396 5662
10310 5662 9002 11315 11941 13842 12550 12447 5694 -1411 -5594 -5109 -4016 -4225 -2870 1478 3557 4802
10294 4802 6017 2512 3799 5095 7871 9211 11843 13557 13010 14236 12924 10125 11046 8703 5030
10279 5030 4020 6422 8129 6999 6759 4736 3639 4682 5372 5790 3910 3992 6214 4544 4324 2193
10263 2193 -16 1606 2098 1046 -1393 421 3627 4356 3629 728 -334 1904 1060 2783 2559 2968
10247 2968 4781 3174 1252 -3080 -8778 -9666 -9176 -11064 -10684 -9259 -7357 -2246 -678 -1982 130
10232 130 -164 -2153 -1454 392 698 -1783 -195 818 6824 11521 13489 16952 18763 17507 8648 4970
10216 4970 4819 1046 -2307 -2142 -665 -2258 -420 1738 3740 2753 -3086 -3017 905 -2330 -1368 1154
10200 1154 1613 -22 -1872 -8797 -10826 -8455 -6748 -8028 -9516 -10612 -11512 -7084 -1366 254 534
10185 534 -347 1061 -558 -1142 -1939 598 -1518 -6592 -5892 -3419 -5377 -4874 977 2560 -580 -156
10169 -156 -866 -2990 -5836 -5762 -6137 -6649 -8129 -5484 -1765 -1055 -1313 -949 -1314 -447 -1202 -889 2490 4081
10151 4081 5831 8693 8553 5849 6290 9729 12316 13353 11803 11563 11583 11469 8900 9803 14335 11736
10135 11736 8772 5392 5748 5592 5065 2739 3104 6256 4505 6445 8080 13332 11138 6418 6849 8417
10119 8417 8835 7956 8026 7330 2086 3652 6968 9658 10664 13747 15667 15853 15850 16441 17646 21631 27953
10102 27953 33626 33378 27981 23034 19915 21361 24615 25944 26820 31674 30034 26359 17523 10494 8760
10087 8760 7601 5517 7307 6911 5140 2723 -475 -2543 -3358 -1086 2214 2088 1847 1047 2059 933
10071 933 -1600 -6555 -4976 -2772 -3685 -2791 -1730 -2649 -1739 -67 -1488 -21 2460 6999 10044 9528
10055 9528 4809 1971 2424 2073 1106 15 -2623 396 996 795 -1506 31 365 -2145 -4283 -3941
10039 -3941 442 1960 -369 -782 3644 6065 6623 3099 -1324 -2815 2436 3241 -58 -1442 1011
10024 1011 4266 4728 7015 7269 5822 7002 13120 16614 16332 17535 20984 21898 19799 16173 11708 9530
10008 9530 3640 1527 387 -2668 -4128 -5977 -8072 -10176 -8071 -3507 -710 2256 4943 5089 5522
9993 5522 6797 10574 18364 24930 33428 50104 74611 92654 104175 112079 118942 124089 124315 107699
9979 107699 86330 69275 54120 40121 26387 19048 13314 10861 11525 12440 11164 10787 12498 14871
9965 14871 18399 19901 24921 34888 49302 69687 89380 105372 123583 139603 132340 117898 106631
9952 106631 92892 77788 73614 72217 78677 84133 88681 92009 95905 98700 98962 95527 92893 96253
9938 96253 104658 110332 104801 97342 98354 96365 92656 99883 120415 149628 185350 214494 221283 203685
9924 203685 166438 119167 81404 58506 40549 30430 21614 16293 13913 12368 13305 15656 16678
9911 16678 14983 13066 9062 9681 11280 11988 13779 13462 13228 11370 9454 11409 19099 31077 43970
9896 43970 59840 81041 99548 109046 109462 109479 101706 94820 93962 97591 104779 110342 107755 98813 84023
9881 84023 64998 46588 33543 22458 19150 16562 15799 15172 18144 20026 19686 16230 12529 7559
9867 7559 3292 2851 1956 3766 6515 5047 3879 3338 751 -319 168 -112 2401 3282 1768 3656
9851 3656 4230 1880 2676 5170 1671 -1416 -4117 -4522 -3862 -2581 -1138 762 4807 5552 4340 4917
9835 4917 4031 2520 34 1526 6534 10054 9862 6862 4651 5894 4463 4774 8472 10759 8426 7463
9819 7463 5272 5231 7909 12138 17619 21472 30434 46079 70982 102182 124343 114635 80678 52166
9805 52166 32842 21511 13331 7978 5354 -591 -2628 -3351 -5386 -3578 -773 1626 3296 5698
9791 5698 7090 6655 6566 6510 3904 4746 12155 23523 37708 58514 77028 70794 48831 29525 16703
9776 16703 10266 3143 -4276 -4908 -1734 -215 2268 -249 -2376 -1627 -1588 -4036 -4120 -4037 -1348 -1644 -727
9759 -727 277 -2823 -5332 -6438 -6291 -5200 -3281 -5424 -4577 -4441 -1150 1729 1698 -3071 -5621 -8768
9743 -8768 -8661 -7578 -4697 -289 889 1577 1130 -120 -3502 -3905 -867 784 -1111 -941 -1827 1179
9727 1179 911 -295 173 -1264 -1411 -4124 -5974 -4215 -4642 -4787 -6346 -8453 -6906 -6534 -5206 -5043 -5111
9710 -5111 -3513 -2245 -3061 -3597 -1613 -3208 -3805 -5744 -7193 -5050 -4196 -749 5533 9571 13700 21053
9694 21053 26025 27758 25507 22313 15278 9616 5263 -315 452 -914 -5073 -6232 -7502 -7272 -5029
9679 -5029 -3285 1519 3178 2665 1433 -403 -2239 -3097 -6339 -7282 -7795 -9416 -9585 -11669 -11313 -12022 -7139
9662 -7139 -1241 1840 -1466 -2082 -5578 -7528 -8954 -7624 -6633 -5315 -5987 -6146 -3830 -732 1651 984
9646 984 -1227 -980 2198 3841 9 -69 -64 -2831 -1673 1167 3003 1732 1351 1087 1617 530 562 1274
9628 1274 -1119 -4447 -6103 -3361 1330 1786 907 129 -2036 -3609 -6332 -4728 -3849 -4264 -8158 -8441
9612 -8441 -7306 -6532 -3988 -2263 -2767 -2963 485 -820 -4213 -3987 -2502 -2854 -5462 -6632 -5673 -5155 -5128
9595 -5128 -5055 -6339 -5753 -2611 -1332 -2733 -4154 -2105 -1058 -1287 -499 -942 -2770 -2180 -3516 -3430 -4222
9578 -4222 -3365 -2531 -618 2123 4898 -21 291 2551 4059 4584 2916 1996 2615 2466 1546 2001 -62
9561 -62 -1436 -2470 -1867 -680 2262 3794 3105 4866 13137 17413 16929 13595 10804 7868 7598 6888 6042
9544 6042 6419 4229 4249 6278 5673 5861 6990 5300 5363 6479 6659 9553 13081 18171 18653 19008 21658
9527 21658 22626 21112 22542 24197 28536 34257 35237 34379 30779 26064 20215 16140 15935 15867 14593 12162
9511 12162 12179 11005 11966 12454 13373 13227 12618 14124 17437 19491 21185 24368 30495 38551 51974 68043
9495 68043 83093 96273 112290 126016 138095 145910 153333 156202 157685 156640 154234 151344 148889
9482 148889 142749 133403 123848 113100 98845 79270 59232 42773 31417 22115 16520 12064 8014
9469 8014 2701 -684 -3392 -877 481 -760 1587 2811 -2390 -4592 -2424 -4647 -7046 -7409 -6775
9454 -6775 -7644 -5420 -1482 396 107 -994 1060 2208 3266 2000 2995 1507 63 1321 611 719
9438 719 747 -1687 -1152 119 -1846 -2949 -1808 -143 1458 3482 2434 -210 -57 4155 3066 1999
9422 1999 -145 -1576 -4802 -3197 -2477 -1627 -2382 -2187 -3102 -3869 -3841 -4261 -2320 -5673 -7692 -1346 -310
9405 -310 -567 -802 -647 -1895 -2558 -2173 -1670 -2532 -3585 -4881 -2758 -5941 -6019 -8383 -6977 -2360 -165
9388 -165 -2694 -3587 -5273 -4527 -4961 -6375 -6338 -4868 -3308 -5008 -6484 -6318 -8391 -6368 -3787 -1766 -2923
9371 -2923 -6551 -4660 -3334 -4107 -4260 -5628 -8076 -9207 -8673 -8223 -5308 -4135 -5940 -4784 -5084 -4589
9355 -4589 -5194 -5590 -5341 -6974 -7226 -6649 -6974 -5895 -3391 -930 -4030 -5989 -6318 -9175 -9303 -5039 -741
9338 -741 -716 -1358 -722 -2783 -2645 -1097 39 -703 -108 -1967 -3984 -3221 -1615 538 -401 1999 3160
9321 3160 2739 3990 2713 424 402 -2556 -5749 -7230 -4688 -2676 -2397 -1989 -5164 -5659 -5574 -4914 -6019
9304 -6019 -6360 -4696 -2823 -3426 -5141 -6777 -4094 -3647 -4421 -3052 -2308 -1676 565 2383 3296 6 -791
9287 -791 1580 3286 4093 2547 -107 1190 1174 956 -947 -2182 -4152 -4618 -4809 -3022 -4583 -7589 -10209
9270 -10209 -9060 -5357 -5738 -6392 -1687 -890 2616 -13 -1483 -3353 -3849 -3719 -4041 -4111 -2152 -2206 -839
9253 -839 -3195 -3120 -3531 -2607 -2256 -5024 -7057 -9026 -7897 -6958 -5641 -3475 -1672 -152 327 395 -1266
9236 -1266 -3476 -4451 -4920 -2681 -2299 -3114 -3137 -2610 -1428 1448 3725 5610 4289 6893 13609 18644 21042
9219 21042 18427 12589 9194 11074 8278 5706 2793 3701 6387 8966 10662 9226 11194 13457 16221
9204 16221 19368 23026 31913 43433 45791 40401 32642 23336 14733 9247 4295 1554 -32 165 519
9189 519 1808 620 -1021 302 131 -2051 -2976 -4168 -3480 -1656 -4256 -5144 -3183 -907 -1322 -1856 -3410
9172 -3410 -6877 -7987 -7928 -6025 -1876 -4527 -6557 -3644 -1247 -2144 -2452 -3487 -5691 -5358 -2225 -803
9156 -803 -1906 -2221 -1602 -546 461 2124 -2380 -5421 -4903 -4990 -5736 -3884 -1382 -677 -3045 -3235 -1925
9139 -1925 -3610 -6647 -7229 -4953 -1318 1023 253 501 -1449 -3160 -1531 -252 -737 -1295 -1721 -1138 -2155
9122 -2155 -3463 898 1707 -4519 -4343 -2544 -4119 -4378 -6372 -6649 -6514 -3469 -932 -2041 -2599 -3860
9106 -3860 -4750 -4556 -5589 -4247 -4469 -3622 -6043 -9506 -13108 -12751 -8304 -7783 -7799 -7260 -5238 -3059 -961
9089 -961 831 -814 1591 3762 3261 170 -411 -2492 -2533 -2459 -2956 -1415 -3544 -3033 480 1207 -1276
9072 -1276 901 1481 -1201 -4148 -5607 -4149 -323 -1963 -3845 -5094 -4841 -3846 -4026 -2999 402 910
9056 910 610 2411 3101 2197 -504 -4490 -6580 -5296 -2841 -1111 -875 -1837 -780 -3250 -3544 -1097 -929
9039 -929 -3870 -6816 -5102 -559 2242 2542 1488 2583 -2186 -7538 -9200 -6378 -2459 565 3801
9024 3801 2987 843 923 -4612 -7055 -6431 -2935 -4001 -2105 -414 -104 -595 -1933 -1175 -2711 -1791 -1655
9007 -1655 -3572 -7061 -1935 1375 -1650 -3749 -4451 -4107 -698 -550 -948 -512 169 1981 4557 4266 1833
8990 1833 2424 2761 5379 5352 4551 4060 2119 -2065 -4990 -5989 -4365 -630 665 994 3412 5126 5791
8973 5791 7252 6936 5274 1005 -301 -410 -762 -4811 -3757 -1809 620 2707 4626 4926 254 -619
8957 -619 -3249 -6739 -7643 -5276 -3964 281 2502 3583 1350 1944 2318 2268 3181 5347 3062 2079 1856
8940 1856 1545 2270 -547 -4326 -4013 -2116 813 322 -36 -1552 268 3769 2996 2010 3498 2370 4022
8923 4022 5483 9375 14417 15587 12434 6159 3463 2262 2537 2378 3005 2804 1177 821 2438 4004
8907 4004 6660 5575 2175 2296 1487 -1262 -536 1515 983 -119 828 4449 3987 6444 7525 11637
8891 11637 6693 5956 7200 7856 7107 9055 9780 8406 7700 10763 12515 14195 17616 20788 24412 28241
8875 28241 33995 35716 36349 38688 37439 33670 27777 23899 18810 15696 14925 16923 17272 15713 10189
8860 10189 5566 5481 8728 9095 9422 10932 9503 10093 11195 10644 10197 12699 20737 30206 40635 44075
8844 44075 38705 30485 24520 19689 14904 14086 13079 12807 16496 17875 18896 21068 24759 23551 20085
8829 20085 17076 14710 11946 10992 12952 8798 6534 11737 15119 14943 15651 16147 14571 8389 3865 462
8813 462 3594 2875 2707 3585 1220 28 2202 128 -220 1553 3092 6304 7310 9612 13354 14491
8797 14491 17222 20543 19406 17269 16485 12712 9714 9024 8576 5188 3816 2231 695 2444 3940
8782 3940 5608 5596 8575 10347 8693 10275 16261 16986 16198 17069 14129 12873 13953 13758 9812 6166
8766 6166 3632 2798 3639 6366 8725 10605 10888 7875 7034 8825 7904 10699 11525 11318 12930 13199 12519
8749 12519 15821 19341 18716 22200 31306 39711 47122 50559 48652 43022 41061 44044 51869 63875 86652
8734 86652 112822 133616 132033 109968 79929 55506 38212 26062 17056 11781 11281 7486 6409
8721 6409 7856 10218 10573 8135 5843 7251 8166 13082 17385 17249 20866 21063 19262 20023 17743 12309
8705 12309 5220 3 -2252 2319 5467 6343 7017 5594 632 394 -373 -2104 -3369 -4887 -2744 -1535
8689 -1535 -615 -1227 -1936 -288 -1761 -1675 320 1881 205 185 1015 1357 1874 13 -1176 -1177 -1531 -3017
8671 -3017 154 2126 -1022 -3429 -3233 -2179 -2449 -4105 -2516 2200 1410 1423 1441 4247 5855 2672 427
8654 427 -3782 -7884 -7059 -5535 -6572 -4796 -4409 -4655 -4708 -2801 -44 -119 1126 -101 2624 1956 205
8637 205 2295 6171 7838 6934 7927 4432 4803 6396 4404 5311 4389 -1229 620 2489 4553 4762 8629
8620 8629 9419 13038 14897 12603 18545 24449 26618 29771 26972 21415 15057 15383 19931 21157 22711
8605 22711 26087 29616 31972 38228 46906 56919 70079 91726 123006 170803 245333 338709 409305
8592 409305 404712 325657 226484 148873 96781 64322 46053 36013 28853 22041 19010 13944 9086
8579 9086 9785 10683 9450 7178 3325 2286 991 -2418 -4823 -3803 21 920 -38 -551 2337 5218
8563 5218 6304 6675 2580 -807 -657 855 2703 2459 1473 1578 3452 4182 1641 1143 2145 3906 4918
8546 4918 -457 -1386 2941 4854 5278 7124 8787 8601 8683 8764 7596 4380 4951 3042 1735 541 1363
8529 1363 6591 9511 9936 7603 6946 7329 10800 11568 9456 10469 8077 10400 13558 19413 24194 30825
8513 30825 38008 50643 62851 72009 80200 84690 86575 88517 98959 121997 160422 219998 296974
8500 296974 369047 406181 382104 312264 234275 169336 125953 101461 90946 86719 88663 99160
8488 99160 123141 150701 173330 177519 161308 132293 97636 70491 51793 36709 26203 22331
8476 22331 17029 13565 12031 11394 11833 7309 5877 7370 10029 12711 13235 10723 7878 5548 5428 3157
8460 3157 2265 4647 6467 5262 5821 8424 6666 2949 -109 -1706 4321 3535 -1331 -2764 -667 -1922
8444 -1922 -1800 -3312 -897 -64 628 -323 -2329 -707 -554 384 3183 960 -132 -1001 1285 3922 -74
8427 -74 -1167 843 480 1448 1516 -137 -210 -566 -1646 1054 -1749 -2347 -2488 -2181 -3160 -1262 -2536 -4263
8409 -4263 -1870 -2839 -4898 -4202 -803 897 1202 -156 -6129 -5142 -2054 -1764 -1726 -6209 -5952 -5479 -4137
8392 -4137 -5281 -2555 -2449 -2787 -1576 -1527 -3509 -742 1324 1852 628 760 2479 -1331 -4318 -4254 -3127
8375 -3127 -812 -1150 -2178 -1359 4392 3459 -348 -860 -356 -1529 -4601 -7130 -3674 -3277 -5911 -9488
8359 -9488 -8516 -6420 -2436 -4145 -5236 -4177 -154 81 1684 -869 -352 523 2657 122 -738 -964
8343 -964 -1223 353 -618 -897 -2249 -463 697 839 -402 -2338 -4944 -4194 -1967 -2312 -2234 -1437 1327
8326 1327 1199 262 -1078 -3345 -4944 -1491 -2962 -1442 -3082 -5896 -5491 -2869 -1384 939 1904 2324
8310 2324 2103 2351 -1043 -4198 -5261 -3896 -3015 -1035 -107 1123 2935 -269 -4011 -6501 -3684 -2155
8294 -2155 -4532 -4895 -3300 -2108 -2606 -4932 -4095 -5418 -2338 -1822 -2560 -536 285 -1572 -2450 -2083 -1309
8277 -1309 2502 4374 545 -2977 -5586 -4412 -704 507 -1960 -4493 -5691 -4007 -6323 -4931 -2367
8262 -2367 -1945 -156 537 142 -3017 -4085 -1990 -624 -2251 -3641 -4417 -3484 -3444 -1427 -2674 -1677 387
8245 387 -183 -714 -1117 -2181 -1329 474 1522 1163 483 -381 -1416 -3495 -3333 -918 -201 -1038 -2151 -4138
8227 -4138 -3104 -1038 686 473 191 -3433 -5339 -3278 -3689 -5289 -5755 -6599 -5810 -4295 -6889 -8258
8211 -8258 -3797 -610 1313 1299 1450 3376 1328 1720 2669 61 -3289 -2091 -479 -457 350 -2266 -4975
8194 -4975 -2819 -660 735 -3080 -4922 -5857 -4659 -3681 -2613 100 -225 -664 542 405 257 1 986
8177 986 -935 -360 3145 2980 24 -1518 -671 1686 1995 -95 -1483 -3453 -2130 -176 33 -581 2386
8160 2386 3617 5272 5899 2386 -33 -1854 -5189 -1155 1143 3501 3447 6672 11683 15276 17776 20581
8144 20581 27796 35183 41600 35176 23260 15676 9053 4842 4422 4527 2286 317 -678 217 -384 -878
8128 -878 -2916 -2917 144 499 -482 -2719 -3389 -356 -723 831 -169 82 -542 -621 -3530 -5028 -6046 -3366
8110 -3366 -1882 -1459 -3031 -3837 -4217 -3827 -2691 -1678 -1348 -232 497 -1573 -1343 2495 7096 7483 1910
8093 1910 -4695 -5528 -3600 -700 -579 357 1271 1389 793 356 -256 2038 1081 -1552 -1824 -1218 -2850 -2467
8075 -2467 -2509 -4022 -3650 -3397 -30 2783 1104 579 139 -554 -2680 -70 -266 -1674 -2207 -4957 -5667
8058 -5667 -1526 3510 1304 -1187 -2654 -4339 -3409 -1185 -1130 -1303 1128 1480 -132 -2898 -3103 -1523
8042 -1523 369 1481 1516 4230 2215 645 359 -379 -266 -1482 -2937 -2345 -2038 -2019 -801 -3911 -6131
8025 -6131 -5022 -4622 -4398 -4096 -4176 -4227 -1600 -2713 -3099 -3256 -1930 1732 383 -2253 -1283 2343 3035 1040
8007 1040 1110 484 -1441 -136 -1884 -2530 -1800 -1927 -2205 -1809 -1346 895 2341 539 -619 3095 3754
7990 3754 683 914 2666 4895 6143 3354 -1983 -2288 -1841 -3693 -5406 -2706 -2205 -1807 -1257 -1623 -1459
7973 -1459 -1515 -3784 -3771 -2194 -695 -1093 -1743 -2474 -4022 -3022 -1306 -684 -1749 395 2825 4086 1827
7956 1827 -1195 -2769 -1578 -2550 -4424 -2848 -2678 -3093 -4179 -2474 -2207 -2049 -4198 -2371 422 1704
7940 1704 254 -460 -480 -636 -1364 1392 -1056 -4531 -2219 -1487 -1005 -667 -1357 -2385 -1462 -1934 -759 -303
7922 -303 -2470 -4707 798 3696 2887 3293 1764 4431 3938 2122 -3927 -7537 -6171 -2110 399 451
7906 451 1952 4260 4555 4415 3748 1654 2294 2905 2008 676 -1958 -978 48 -83 -1610 1756 443
7889 443 524 1720 875 -723 503 2612 1892 1897 2181 3545 2127 293 341 -854 1142 1317 1210 1788
7871 1788 107 3729 1955 18 596 1257 -463 -2169 -4760 -820 3050 3499 2487 3738 765 -439
7855 -439 -714 -2105 -2801 -1442 2533 1361 506 2243 -36 -1395 743 4443 7119 5786 3440 89
7839 89 -1693 -1145 -964 -400 -545 2043 1892 533 1429 1419 2488 4096 4547 3605 3953 4521 3780 1521 493
7820 493 1067 -177 994 1675 1159 -1181 -3256 -1565 -1248 -88 3359 3059 1207 -1960 -2806 -215 -1127
7803 -1127 -2479 -1273 -2062 -3481 -2406 -523 410 1244 1243 3468 -334 -946 -348 1225 2693 2160 1618
7786 1618 1916 2431 2387 892 -744 -3495 -3099 -1479 -1355 -3840 -4247 -1393 -1251 -3075 -3392 -3717 3104
7769 3104 7838 6396 3929 776 1099 978 -115 -578 -1923 -1082 -893 346 -684 -2025 21 1789
7753 1789 3987 3437 5548 8156 5691 7183 10748 10983 8955 11984 5897 -4253 -2822 2356 5871
7738 5871 14857 26505 27146 14462 7972 18456 25023 23238 11541 -5024 -15235 -17283 -11586 -4216
7724 -4216 -3030 -5066 -5966 -4576 -5664 -3435 -2035 -1975 -1378 -1015 -2215 -2766 -3432 -5583 -5344 -4757 -2322
7707 -2322 -2347 -2324 -1029 -4308 -9916 -13346 -11018 -10072 -11745 -12277 -12918 -11754 -9528 -10799 -8998 -5562 -4625
7690 -4625 -6657 -8471 -7524 -9100 -8581 -6732 -7194 -7401 -5553 -5244 -4609 -6331 -6805 -6076 -2079 -1830 -3953
7673 -3953 -3016 -4842 -6587 -5377 -3944 -4010 -3354 -2707 -2378 -2508 -2124 -1915 -4435 -4166 -3786 -3109 -1097 -1688
7655 -1688 -4698 -3140 -4960 -2758 -2338 -4453 -3751 -911 -2112 -3492 -3403 -4685 -5228 -3837 -2499 -1486
7639 -1486 -767 -910 -1780 -751 -793 -2643 530 -1608 -3129 -3143 -5508 -4526 -5568 -5905 -8466 -11353 -12154
7622 -12154 -10705 -5356 -3673 -3186 -2211 -2320 1406 573 1010 -904 -2938 -4384 -5033 -5406 -6382 -4043 -2179
7605 -2179 908 1161 -1270 -3783 -1912 -2530 -2902 -2086 -920 674 1131 -1253 2432 1415 -611 -1041
7589 -1041 -1191 2043 2684 765 -461 -2008 -3464 -5648 -3302 -2583 -5742 -6810 -7125 -6014 -6749 -9645
7573 -9645 -8689 -7524 -8030 -6935 -5064 -4651 -3648 -2216 -2180 -1558 -1711 -4241 -3196 -2161 -1968 -1446 -421
7556 -421 -622 -2058 -4348 -2373 -1369 -3137 -5182 -5027 -4481 -6044 -4143 -5269 -6899 -4727 -1225 1759
7540 1759 1735 -578 -1896 -1673 -2003 -1333 -3310 -1403 989 -258 -3604 -4493 -5124 -5899 -5902 -4673 -3280 -1303
7522 -1303 -429 -19 -3017 -3733 -3532 -1077 1696 1134 -1462 -1578 -2521 218 462 1274 -1492 -3850 -6124
7505 -6124 -4979 -4338 -3980 -8657 -9130 -5716 -499 -886 -3351 -3924 -3015 -5984 -8867 -7806 -7369 -6627 -7078
7488 -7078 -6225 -5236 -8410 -8320 -6026 -2995 -2412 -673 921 1926 2761 2926 1970 890 -944 -2823 -1803
7471 -1803 807 1198 1020 209 -662 -446 913 -2096 -5858 -5957 -5945 -4781 -2974 -3044 -1854 -2900 -4862 -4739
7453 -4739 -2933 55 597 1540 1760 1929 741 786 -2651 -5393 -4209 -1015 1978 2447 -45 -4456 -4890
7436 -4890 -2206 -5676 -5337 -1180 432 784 3797 4399 1262 -2087 -2394 592 -516 -3326 -4303 -6358
7420 -6358 -3329 -2935 -5262 -4580 -2965 -1108 487 17 -158 -76 -2352 1753 630 -2181 -376 2513
7404 2513 2372 3008 2662 852 -3611 -3595 -1765 -1236 -3777 -5159 -4823 -6590 -8693 -8658 -7899 -7947 -6369 -3930
7386 -3930 -4386 -2312 -1232 -1952 -1607 -756 -1442 75 -76 -204 -1449 -2270 -1906 146 965 -3141 -5550
7369 -5550 -3214 -1347 23 -418 229 857 515 -1827 -4879 -7661 -7815 -3821 -954 -4276 -6372 -2890
7353 -2890 -2721 -1841 -3916 -5995 -5232 -2289 -1950 -1905 -435 1315 -1574 -3079 -2156 -537 -46 -482 1371
7336 1371 3018 1739 587 -32 1950 93 -1058 -34 1843 992 -2942 -3481 -1546 -1078 -2031 -4583
7320 -4583 -6413 -3445 -488 -739 -2532 -5722 -9441 -11499 -6739 -2829 -1651 -2629 -5818 -7313 -5285
7305 -5285 -4654 -3116 -2403 -2876 -5855 -4746 -1547 -652 -2226 -4724 -7242 -5929 -3290 -1997 -4345 -5662
7289 -5662 -3865 -4054 -6813 -5775 -4414 -2345 -501 -1006 -707 -901 286 -512 -1033 -681 -2365 -1775 -3798
7272 -3798 -3672 -1803 -2124 -2277 -2305 -1907 1126 1053 -614 345 832 101 -2061 -2068 -2159 -1980 -1472 -1631 -4637 -4789
7252 -4789 -5373 -4444 -171 1957 415 1384 -161 -1920 -3427 -1450 259 764 49 -77 -200 -3789 -6350
7235 -6350 -4145 -3571 -5261 -4215 -3381 -4161 -8042 -10118 -9488 -7711 -5206 -4002 -5383 -4384 -3158 -3622
7219 -3622 -2771 -2761 -4164 -3361 -2226 -2366 -1240 -1311 991 -3464 -9018 -6535 -1339 -1650 -5255 -7377 -8786
7202 -8786 -7798 -8143 -10578 -7764 -4702 -4319 -1547 806 1904 -1012 -5773 -9020 -7890 -6842 -4371 -2830
7186 -2830 -2974 -3875 -2800 -3129 -1220 1438 -594 -3429 -3988 -1263 144 -298 -4392 -6771 -5971 -4641
7170 -4641 -1313 -2932 -4694 -4038 -4649 -5270 -4684 -4815 -1963 488 -274 872 1285 -745 -1545 -1704 -1131
7153 -1131 -1528 -1452 -692 -1742 -1511 542 1120 4059 4698 4161 4009 2221 -170 -2893 -2924 -5154 -5081 -3291
7135 -3291 -2915 -1140 -400 96 -2085 -4334 -3921 -1921 -1287 -3614 -4380 -6334 -5781 -3643 12 3007 358
7118 358 239 3241 3186 -2209 -1527 441 -2625 -5135 -7292 -8111 -9439 -5815 -3280 -3025 -1324 -750 144
7101 144 2158 557 -69 -1383 -4711 -3948 -1497 -828 -2745 -3705 -2416 -1766 -1691 -3686 -4091 -904 2823
7084 2823 2071 514 648 -1462 -4438 -3548 -4354 -5315 -6000 -5275 -3045 -3200 -4955 -3241 454 -3600 -6983
7067 -6983 -4581 -2668 -1469 621 -685 -3784 -3344 -3479 -3614 -6510 -4437 -1534 -1649 -3062 -3515 -4051
7051 -4051 -3381 -5294 -6852 -4848 -2406 -893 -1559 -2444 -3174 -5316 -5326 -4467 -3975 -1819 -117 -963 -1286
7034 -1286 -1366 1187 -142 -1345 -1857 -943 -3960 -7675 -7578 -5611 -3965 -3886 -3263 -2406 -3952 -4503 -5468 -5551
7016 -5551 -5757 -5996 -2515 -1799 -4248 -4209 -4443 -4243 -5040 -4456 -5579 -5544 -1932 -425 316 -755 -411 -186
6998 -186 -1263 -52 1188 -427 -794 -2385 -4481 -6686 -6415 -3481 -2097 -2208 -5063 -2297 -433 443
6982 443 -1477 -2674 -1549 -2737 -4198 -3443 -1239 -767 -801 1327 3084 4129 4873 3613 2119 784
6966 784 -1364 -2099 -1193 -315 68 2369 5142 2886 1484 1419 -1271 -1254 -545 2420 1767 -272 -1335 -2575
6948 -2575 -2710 -5904 -9507 -8312 -4611 -1377 759 658 -1753 -4400 -2557 -1388 -2268 -1431 -798 200
6932 200 2026 5154 3498 110 828 1311 -818 -2402 -975 87 2109 3709 5460 3561 3086 -771
6916 -771 -4512 -2719 -4501 -4472 -1126 -539 -674 -3034 -6097 -5990 -4124 -4773 -6134 -8378 -5752 -379 821
6899 821 -3029 -1812 -68 -1428 985 2516 847 -2774 -2773 1232 279 -1161 -399 499 714 -207 -955
6882 -955 -2016 -5179 -3340 -5528 -3194 -952 -241 2298 1753 1159 1776 2388 1483 -5949 -6392 3192 8804
6865 8804 -569 -15003 -11869 -491 4924 -1904 -9414 -5191 -1223 -2308 -3235 -3425 -4837 -5549 -4073
6850 -4073 -1140 675 741 -115 -2382 -2992 -582 1339 1953 95 838 -535 994 1040 -843 -3836 -2395
6833 -2395 -1442 -1446 -1802 1427 2788 3119 2468 2411 2231 -30 -905 -1166 -3503 -2108 -2561 -3438 -2763 -2530 -2979
6814 -2979 -5331 -3274 -2074 -3003 -2438 -832 -825 -377 1148 895 -9 -877 -3052 -2383 -3124 -4978 -2559 -280
6796 -280 310 389 3319 3021 1523 3347 2609 -476 -155 -1117 -1820 -1047 -888 -2791 -1473 -3420 -2387 -1853
6778 -1853 -370 2653 1527 -594 -2222 -4245 -5117 -1123 4834 6262 4031 3673 3361 3158 3876 7055
6762 7055 4933 3522 2441 4131 7105 7741 5224 2786 2955 130 -2658 -2298 -160 1172 1520 1403
6746 1403 261 575 665 1060 1666 3468 1875 1727 -214 -3044 -1918 -1583 -3675 -5582 -6588 -4971 -3681
6729 -3681 -2929 -2205 -2013 -1763 267 1851 1644 -567 478 -1111 -2933 -3517 -3562 -4265 -3424 -2311 -1190
6712 -1190 -608 -567 -422 -1713 -258 2425 1770 1446 447 966 -969 -2040 -1651 -1163 -363 2653 3916 1557
6694 1557 630 -3341 -3126 -5249 -6381 -5108 -3655 -1991 -3230 -6503 -7838 -4651 -1399 -1632 -2733 -2704
6678 -2704 -4758 -2988 -1561 -2484 -3065 -1060 -1354 -3458 -2837 -1238 -159 -1035 -5185 -6950 -6609 -7713
6662 -7713 -7303 -6144 -5731 -4055 -2619 -1090 -1516 -1143 -118 -615 -13 -846 -2314 -373 4009 3783 1010
6645 1010 -360 -187 -3079 -4255 -6354 -3884 -672 355 1272 1979 -340 -2011 -102 3272 2856 762
6629 762 1614 3108 3719 4186 6345 4708 -1793 -1643 -1087 759 377 -1171 188 1283 1403 1370 284
6612 284 2141 197 727 426 -321 -1928 -957 -336 142 621 843 1340 -454 222 2525 -103 -2033 -3309
6594 -3309 -2488 -1466 -1163 -901 -984 -1326 -4088 -3137 -3639 -4544 -3273 -1105 405 2932 3542 801 -121 -2076
6576 -2076 -3128 -2950 -1126 -831 -1733 -1206 -1511 -2847 -1192 1180 -787 -915 1266 2784 607 460 2228
6559 2228 226 -3210 -5316 -3742 64 2920 3804 5834 5035 649 257 597 -545 -2070 -1727 19
6543 19 -3380 -2647 -1849 -1491 -841 -1192 -1507 -296 -1044 -338 -3381 -749 2703 4117 2234 447 966 982
6525 982 111 1007 -1982 -2635 -1713 -1646 -6368 -6514 -4639 -4860 -4238 -4160 -2765 110 3828 6226 6779 6583
6507 6583 6110 3857 -207 -2699 -3215 -2623 -1687 -1995 -1985 -2645 -2355 -1794 -2430 -97 2130 520 -2118 -1065
6489 -1065 990 1509 1616 205 -2397 -1700 -1210 -654 -3706 -2820 -3550 -4825 -5105 -5393 -5153 -4037 -5068
6472 -5068 -2914 35 -735 -3274 1246 1773 977 1714 3682 3103 4628 3697 2238 1900 376 116 -1440
6455 -1440 -422 -661 -1664 -1960 1268 1431 1327 4626 2734 1790 1615 1843 1112 -455 -843 917 2144
6438 2144 4585 4630 3661 3110 -107 -1030 -745 1034 3083 3962 3442 972 3647 2553 -567 -2539 -2813
6421 -2813 -3880 -784 363 2477 992 -2105 -4783 -5309 -1555 1624 453 128 3402 3572 4935 5573
6405 5573 4599 4035 1919 -196 -1813 -5155 -4039 -2345 -303 -1637 -4436 -6594 -5418 -3168 -2636 -2872
6389 -2872 -4609 -4363 -4231 -5458 -3021 -1495 -1407 -599 -1526 -3438 -2659 -431 2162 2637 1240 345 922
6372 922 227 1383 705 514 418 -38 -1206 -444 1135 -134 -85 683 -1245 -2834 -3323 -2189 -348 2048
6354 2048 1806 -2494 -1752 -2992 -3826 -3855 -865 2377 2396 2266 1511 -2643 -4501 -2466 -1037 -3369 -154
6337 -154 1334 34 -3712 -3271 -3559 -4108 -2292 -1267 -3789 -5606 -5526 -4047 -4934 -5188 -2272 1695 4384
6320 4384 2654 710 474 343 2641 283 -4852 -6869 -4249 -4333 -3924 -2905 -422 -379 -3372 -3148 -3834
6303 -3834 -3460 -3915 -4010 -3077 247 773 672 2992 7275 7087 5666 3900 3720 859 -4616 -5746 -3728
6286 -3728 -981 -326 -796 -267 1249 3208 3517 2527 -571 -957 -1618 -2060 -3561 -2767 -2129 -3307 -2641 -4833
6268 -4833 -3753 -3856 -6049 -2994 -3045 -6198 -4511 -2285 -3317 -3087 -717 -2984 -3514 -4025 -5324 -6653
6252 -6653 -5461 -3639 -2694 -932 1007 287 -1549 -2883 -5392 -6800 -5603 -4117 -2479 1673 2809
6237 2809 -387 2460 3792 1711 -1629 -946 1458 -472 -3423 -892 2286 745 -2790 -1834 -2394 -4660
6221 -4660 -4760 -2395 214 1907 2147 -1710 -2925 -830 2468 6114 6974 2353 100 -323 914 2317
6205 2317 3451 4564 1690 -1622 -3161 -1227 699 2311 -1992 -5632 -6287 -5595 -4512 -4414 -4966 -3490
6189 -3490 -1077 1967 1417 -488 -3990 -5829 -4207 -3417 -2856 -2500 -2997 -2246 -1503 -4832 -7530 -5177 -4807
6172 -4807 -3955 -4616 -3043 -4663 -6137 -7424 -6294 -4207 887 5100 4533 -1008 -2362 -54 983 554
6156 554 -965 -981 -2658 -1828 -352 -655 -1860 -3269 -2319 -3915 -5940 -6887 -6696 -4824 -223 596 -2069
6139 -2069 -4839 -7120 -7290 -5553 -1575 1200 1238 30 -1174 -829 -453 1041 593 1114 2347 1855 -532
6122 -532 -56 -408 -997 -612 -2544 -1413 -353 -507 -392 -1805 -1823 94 749 1023 1642 2082 727 -3186
6104 -3186 -4084 -3465 -5121 -5994 -3473 -1947 -3252 -4350 -1196 -2982 -3118 -831 -36 637 -3437 -2771 -2570
6087 -2570 -1911 -2145 -653 -775 -1437 672 397 -729 -604 1811 3622 871 639 2544 1390 460 -311
6070 -311 2628 4427 3514 4853 4277 2059 2450 3894 1167 1707 3227 6601 4375 2039 885 1798
6054 1798 1678 119 1469 2177 -813 -2972 -4046 -2622 -591 -1322 -502 552 2285 1991 2799 2604 1921
6037 1921 -50 -2505 -763 587 852 586 752 -284 42 1734 3115 887 -1005 17 -1054 -2685
6021 -2685 -4388 -3760 -2861 -1860 -153 1247 95 -179 -15 -145 -1177 -2324 -307 -957 238 1098 21
6004 21 3637 5542 4645 4708 4676 5320 4026 7041 7974 2428 666 -752 1949 -357 -539 1418 1933 2158
5986 2158 3716 385 -1293 -1885 -2868 -1658 2156 1200 1394 2067 1060 317 -2311 -1605 -3126 -2312 -2904
5969 -2904 -2460 48 467 1013 -2504 -4178 -1961 -2734 -4218 -2137 -562 -1148 -84 -2319 -2497 -277
5953 -277 -1656 -2575 -1006 -1830 -1017 566 1954 -310 -1931 -3921 -679 2039 2451 -1431 -3892 -1689
5937 -1689 -876 -4684 -8657 -7483 -5806 -365 3536 1253 1737 2901 1988 1169 -204 -2531 -3471 -4293
5921 -4293 -3051 -2539 -489 2905 2970 -1073 -3490 -2302 678 2377 -458 313 -2265 -2697 919 3242
5905 3242 3249 5703 2977 782 1002 2465 4973 2591 -2637 -2335 -1674 -860 -1916 -1202 -1859 -490 -2826
5888 -2826 -3419 -2030 -2098 -3139 -2168 -2213 -670 2515 4059 3550 -140 853 398 2795 1639 1011 2324
5871 2324 3863 3897 -2100 -2123 165 -456 -2083 -3423 -4392 -3155 -3340 -6397 -8858 -6872 1583 1951 -883
5854 -883 -4268 -6762 -6397 -4796 771 3922 4238 5387 1390 -3175 -2895 -2033 -1309 -1424 201 2067 -1011
5837 -1011 -1444 -2884 -886 1774 2372 844 -100 4215 5247 888 412 -519 -3948 -6117 -5362 -2343
5821 -2343 526 277 220 -1271 50 -731 211 1034 -68 823 820 37 -431 -319 -1629 -2217 -738 -534 -2727
5802 -2727 -4577 -6160 -5923 -4131 -960 1749 615 2033 -80 -2827 -4382 -2860 -3048 -1534 653
5787 653 142 -2499 -1986 -1050 -1522 -1426 -1737 -3238 -1582 -886 -1114 143 -534 1307 3816 5314 3802 2289
5769 2289 2930 3858 3963 816 -4900 -6231 -8842 -8986 -4046 -2171 -3613 -1785 -149 -304 -50 45 -1243
5752 -1243 -1960 -1988 -2083 -3926 -4858 -2394 -1408 -856 -1103 -1086 1067 2229 1055 604 2364 1665 -174 -1236
5734 -1236 -209 -2791 -4903 -862 834 418 1527 -354 -4000 -2998 544 1971 4919 4085 2433
5719 2433 1668 3227 3208 2960 2769 1025 -237 -3182 -4459 -2143 -537 819 3109 6155 5133 3024
5703 3024 2903 2265 1462 1605 2724 -52 -3786 -1750 914 -1481 -1195 -760 -2138 -2924 -1410 -2748 -2436
5686 -2436 727 1774 1980 2132 3273 4301 1354 85 -149 -855 191 392 -104 -97 3277 8022 4355
5669 4355 4693 2060 -2135 -2049 2344 2857 1937 1443 3253 1126 80 1718 907 1754 3888 4559 2188
5652 2188 -2470 -6438 -5967 -2024 -712 -300 2796 1856 -1441 -1867 53 1725 -1939 1633 3427 1059
5636 1059 1895 -394 -2953 -3296 -2322 -3426 -1589 -2444 -678 1860 1653 88 -412 546 -235 -1414 -1064
5619 -1064 -344 -254 840 -686 -1885 838 1041 2088 -1437 181 1587 354 464 2268 5952 5659
5603 5659 3479 3499 3385 269 -2012 -2646 -3067 -1878 -2334 -2054 -2029 1318 1835 196 300 1457 957 244
5585 244 431 167 -1358 -4323 -6027 -6306 -7342 -5611 -7124 -7511 -5905 -1757 -3442 -4404 -3727 -3360 -2877
5568 -2877 -4893 -4131 -2377 -2504 -437 -674 -2025 -3222 -4248 -6575 -3432 -3680 -3283 -2328 -185 -1793
5552 -1793 -849 -611 262 1475 -1667 -4508 -4676 -5557 -4299 -2138 -501 336 408 -1611 -1444 -1644 -833 -1348
5534 -1348 -1126 -647 1953 -821 -3697 -658 1630 2836 1470 -524 -1765 -366 1029 832 -36 -1672
5518 -1672 -4325 -2349 -2307 -3037 -2045 -2783 -4000 -3349 -1162 -1399 -6590 -3252 383 1567 1178 1480 699
5501 699 -186 -1109 807 -1649 -650 2875 2207 -1404 -1173 -1047 -510 598 1611 2795 3976 3700 320
5484 320 -345 1441 -1623 -3389 -2944 -2693 -533 1401 955 1123 2201 643 -1123 -1908 -1990 -3587 -8
5467 -8 1318 2682 2521 -275 -742 1382 4331 3632 1160 174 -3918 -5067 -700 -186 -1690 -899 -1322
5450 -1322 2712 3870 2217 -549 -370 -3483 -4915 -5687 -7608 -6427 -972 2263 127 -1310 -164
5435 -164 -678 -440 2221 3670 1099 -2909 -3048 -2745 963 2270 3205 5455 4944 1806 234 1108 958
5418 958 1811 1889 429 1878 2519 1469 5665 4881 2507 3659 4442 289 -3686 -732 -977 -913 -1539 -4546
5400 -4546 -7491 -6328 -3156 -879 -565 540 939 757 -724 -3857 -4093 -626 -1572 -592 1057 927 1674
5383 1674 2800 4344 4820 5007 3461 1469 1158 -646 -2909 -1882 -1432 -2407 -3503 -3615 -818 -54 507
5366 507 635 604 479 -1293 -3053 -2959 -2206 -1549 -431 -2105 -3566 -2679 -1119 -1487 593 1628 1273 -1249
5348 -1249 -4031 -3560 -2430 848 3772 2787 2749 3768 5314 4220 1781 -1634 -2555 -2361 574 1374 843
5331 843 445 -340 -862 -3089 -2226 -3623 -1824 1677 2077 -2992 -5904 -4344 -4791 -5891 -5142 -2756 -2599
5314 -2599 -2720 -5368 -5662 -4684 -3084 -1329 -496 775 374 -1924 -454 -573 -1255 -524 -350 -489 371 -1400
5296 -1400 -297 3255 -644 -3271 -2535 192 1173 -1273 -1969 -1142 -1501 -3404 -4017 -2124 294 379 -426
5279 -426 -505 1106 594 -2476 -1574 -775 2726 4917 3848 293 -2401 -1815 -3122 -1461 -24 1192 -597
5262 -597 77 226 301 129 -1064 -4378 -3013 -1512 -2975 -1336 1336 575 125 428 1415 2467 2347 -155
5244 -155 -234 -1658 -2735 -1202 1420 2435 972 -536 -3754 -7080 -5512 547 -771 -1710 -1264 -940
5228 -940 -123 3597 3420 3775 1212 1195 1991 1110 861 1090 2272 2649 3445 5149 5652 1673 -2770 -3207
5210 -3207 -2887 -3368 -2519 -2668 -2175 563 -604 -1902 -2703 -1295 -511 869 456 -4191 -2936 -2187 -2513
5193 -2513 -3609 -3771 -4837 -2663 -4423 -1543 -311 -1272 -678 2710 4171 3510 2533 1965 4741 5283 3295
5176 3295 2044 901 -1493 710 1350 337 1017 270 -271 -1169 1596 3021 1832 -1162 1223 3524
5160 3524 332 -86 1912 2438 1430 2329 1024 -76 -1956 -2072 1497 52 -2358 -1851 -286 699
5144 699 1452 3029 2784 3988 2084 622 6100 9045 5111 1719 754 1993 834 1057 -140 -1378
5128 -1378 922 11 -84 -1532 -1240 -2276 -1622 -364 322 -3635 -3894 -4798 -5825 -6347 -5010 -2206 119
5111 119 2328 4614 3354 1881 1121 -216 569 -1065 -1158 -878 -3472 -5163 -2881 1382 2743 1751 4393
5094 4393 3441 1409 -677 -903 44 -2205 -1887 -1395 -2725 -1622 -743 -3813 -6447 -2901 -680 -1478 -2202
5077 -2202 142 1752 770 1047 1085 478 1886 1395 -666 -1512 -3172 4 5186 3647 1817 2134 1453
5060 1453 802 3015 2329 -287 380 2279 476 -2130 -2104 -1548 30 -1525 -1488 -2332 -1040 1696 2822
5043 2822 4194 3169 1545 791 -147 162 -1108 -2903 -2022 855 325 -107 -13 -1190 -1582 -2513 -2405 -787
5025 -787 -2379 -1989 743 3697 4894 4291 2519 1798 2382 1349 -1626 -2378 1791 2596 86 -2786 -3427
5008 -3427 786 3409 3275 2976 147 -4036 -4246 -2343 754 5342 6769 6223 7369 9478 10115 10276
4992 10276 7663 6628 3982 1502 -499 -678 -713 -634 1053 -1049 1986 6036 3013 3213 4481 3431
4976 3431 3079 5514 2131 -313 -303 -2082 -4160 -117 237 -834 -2442 -3155 -1456 -1005 -2280 -2911 -2330
4959 -2330 -3833 -4447 -5084 -1708 -1549 -4233 -3766 -2843 -658 -833 -1240 -282 -391 2348 6018 4195 3492
4942 3492 1226 2242 3357 2746 1831 -339 -4005 -1985 -2246 -695 780 1148 3369 3160 1468 1748
4926 1748 1808 774 -2748 -3291 -777 515 -1112 -1470 1582 3417 5191 3299 3995 4064 5656 4471 1122
4909 1122 1174 2196 195 -728 102 1703 1751 1821 815 2041 1890 1443 972 -351 -2284 877 2617 -177
4891 -177 -1175 -1898 -1374 143 -682 2517 4802 542 -885 690 -1716 -4410 -2609 417 1047 2959
4875 2959 3473 126 -52 314 435 4511 3438 1298 1068 864 1141 342 124 429 1307 2132 345 1878
4857 1878 1851 3046 4645 2951 2724 1867 -310 -2217 -3365 -1768 -3 1044 438 1529 2317 2504 1251
4840 1251 -1513 -4301 131 924 626 1468 1725 -820 -7271 -4151 -2347 -3797 -4108 -3299 -1046 884
4824 884 -471 68 1675 -211 -2697 -1963 -1499 924 2304 2303 200 -2102 -861 131 1929 4091 3624
4807 3624 4929 2210 -1325 -601 -1206 -949 1307 2240 -1494 -46 2246 1752 3381 6920 5692 2237
4791 2237 449 -6 12 427 2526 2333 2974 5811 6569 5131 3344 332 -2943 -3501 -1417 -2182 -4504
4774 -4504 -6975 -5142 307 2 -316 -4598 -6181 -3415 123 -3723 -6601 -4531 -6254 -5844 -4930 -5949
4758 -5949 -6949 -6572 -7438 -5790 -3178 -3031 -2344 -637 146 2448 2079 1295 969 -1752 -1383 -605 -3350
4741 -3350 -3796 -3319 -2669 164 1537 493 -1379 1507 2080 3536 4926 4027 2834 4751 4434 6059
4725 6059 4165 447 2320 2811 2330 3004 4233 1229 234 -2767 -1861 -1555 -1837 98 2338 -1438 -628
4708 -628 903 682 -1841 -3830 -1422 2222 662 -2811 -3988 -2602 -4102 -2887 1485 457 -1827
4693 -1827 -1603 2033 1819 1920 577 1671 1348 693 2595 4119 3387 1519 -1232 -1806 -2891 -2816 -2095
4676 -2095 -2765 259 7548 5768 17 -1686 -2117 -4839 -2880 -4893 -9131 -14685 -15238 -11407 -4725 1242
4660 1242 4408 2361 3825 7677 6367 6562 5155 3170 2800 1399 188 -576 -1469 -1217 -4299 -4473
4644 -4473 -4089 -2068 848 917 2369 3192 4920 3722 1419 -2956 -3055 -1577 -316 -899 1501 2091 1793
4627 1793 -1898 -3147 -944 3656 6732 2878 938 3458 3490 3412 2957 1775 1065 2632 4971 3392
4611 3392 3271 2408 778 -85 -155 -2289 -3844 187 530 2156 2654 4406 4278 3174 1768 1131 1825
4594 1825 -238 978 2604 3233 5034 4768 3993 8352 8457 5312 1794 48 -459 -1597 -4977 -2774
4578 -2774 -2235 -1642 758 1987 -300 1261 3859 3794 2233 2088 2783 2592 4287 5688 4735 3385 653
4561 653 -917 499 2287 651 784 1597 492 2925 2422 -1600 -2753 761 2866 5361 4805 4734 3265
4544 3265 2948 2381 937 1920 885 -3516 -4202 -273 -762 386 5133 2334 -273 -3370 -5819 -4225
4528 -4225 -1288 2433 3527 921 529 1142 1033 556 1380 -2393 -3714 -4950 -3953 -4206 -4192 -2767 -1213
4511 -1213 -2140 -3501 -1068 -2182 -1046 49 -355 2095 2804 1817 747 -2594 -4180 -426 -1203 -2311
4495 -2311 -1225 1690 2450 4950 2875 -1319 -3144 -1148 542 -53 -22 -1273 -190 2755 6486 4576
4479 4576 2142 1456 477 -2875 -531 2172 1915 2936 3449 5695 4581 1977 -126 1258 3054 3356
4463 3356 3918 4808 4680 4226 4180 525 -792 -1389 -676 -1600 -1292 94 -829 -3155 -2017 1376 2628 3078
4445 3078 1469 856 1685 2063 4302 1834 -814 -1202 576 2451 3897 4237 5921 3858 1275 -2793
4429 -2793 -3469 -3980 -2236 -616 -2484 -4217 -3219 -3949 -705 1665 16 1582 3176 2120 1470 2545
4413 2545 1586 1026 -2010 -2847 432 5953 6487 1661 -509 -122 526 684 1381 2109 2361 1827 1325 2346
4395 2346 3639 2902 5626 7356 4846 3325 -316 -1189 -2184 -1160 -2363 -2670 -1933 -4501 -5800 -5543
4379 -5543 -4780 -2372 1860 5740 6254 5558 4241 4862 5705 6873 4600 2140 269 -1158 -1079 -2613 -2242
4362 -2242 -555 -1054 -1039 380 -584 -2270 -3660 -2249 -960 228 -562 -4709 -3049 2686 3123 3243 5227
4345 5227 5857 3581 2157 2335 779 3016 3799 99 -2863 -229 2227 1335 2186 2848 3504 3317 1970
4328 1970 660 1883 2271 619 469 1240 2241 1851 3113 1940 -719 -1916 -2814 -1643 807 -518
4312 -518 570 -1114 -311 -8 2120 4554 3512 2197 4079 3569 2214 2819 1946 -880 -1814 2537 5240
4295 5240 2805 1673 662 3166 3409 2985 3641 3154 4787 3072 80 -767 -2007 -4984 -6554 -6121
4279 -6121 -7679 -5164 -3736 904 2005 -583 -519 -935 -1312 -646 -938 -2645 -3126 -1507 505 -1050 1891
4262 1891 4297 2648 -229 -650 -924 -2318 -2112 190 146 -611 -2371 -4100 -2732 -714 -162 -410 -1064
4245 -1064 1649 2996 4061 4739 4062 2977 2041 324 -358 -544 42 1734 710 -253 660 3058 3697
4228 3697 744 -550 -4788 -5286 -5480 -6097 -4556 -1265 1820 5194 2469 -3756 -2272 -1401 -1193 -564
4212 -564 -78 -1053 -306 -1779 -2438 -2627 -141 4674 6152 4516 1570 -3594 -1445 -458 -1286 -2596 -2557
4195 -2557 -1947 -3407 -1039 1208 2850 1433 1557 2171 3792 3963 1379 -122 376 -2224 -1235 1285
4179 1285 1405 30 2895 1593 -2588 -3086 907 2753 510 -1288 -175 -1463 -2453 -3538 -3975 -2202
4163 -2202 -1813 406 736 602 1325 1575 15 -474 -788 -209 -633 2764 7458 7627 5274 5569 5553 4883
4145 4883 2541 419 -1309 -1652 -600 522 1541 1209 3191 3946 655 1349 5221 4074 3573 3382
4129 3382 -905 624 4729 4447 -79 282 985 -2299 -6293 -4051 -2409 -1352 1406 2348 1930 2954
4113 2954 3000 1116 -807 -775 263 -2970 -3137 -2056 -867 -1941 905 1821 1504 -952 -508 120 759
4096 759 14 530 237 -464 -3699 -5676 -2755 -1294 -1769 -1080 -994 -1516 -518 1216 1172 869 1912 915 -1038
4077 -1038 53 1834 2793 2808 2112 -500 659 418 -1176 2902 3027 2269 2513 48 -912 1968 3170
4060 3170 2173 8 -1224 -229 230 1396 3224 -838 -2280 -5377 -2760 -880 -190 95 32 -863 -821
4043 -821 -440 191 -16 -1851 -1060 -247 -1629 -36 3505 6633 6333 3024 -553 634 -96 -900 485
4026 485 2107 4865 3848 901 1960 1234 147 -558 2396 4643 6174 5373 4229 2374 4653 5718
4010 5718 3089 1877 91 913 -869 170 -612 -3917 -1090 -1223 -1508 72 -262 -776 -329 -801 -2470
3993 -2470 -2557 -917 1620 1413 211 635 75 2929 4870 4479 2520 2954 4956 3174 1919 2996 2002
3976 2002 -2876 -4212 -3205 -500 -1607 -396 3238 1211 -490 -1540 54 2109 3631 3426 3669
3961 3669 2703 424 -1494 -1675 -5052 -5877 -4029 -4212 -3026 -2140 -1029 -827 -2710 -4898 -5383 -4023 -447
3944 -447 1230 1927 2354 1809 -753 1811 4834 3926 488 2102 938 -122 1197 -1293 1883 1127
3928 1127 -386 -406 91 2255 2321 3323 3403 3657 5594 4399 1284 -1275 -2155 -621 1830 1746 -955 -514
3910 -514 -265 -2415 -2522 30 -1164 289 -1715 -4545 -3905 -2318 -2303 -3911 -248 -1066 -157 -99 642 -1634
3892 -1634 -2985 1563 5648 4582 3439 2228 2016 1930 3555 1038 118 1386 2423 3114 2684 3022 2777
3875 2777 3977 2373 543 -1821 -3359 -1303 656 -420 896 2365 1599 -575 119 -563 -2160 -4106
3859 -4106 -1745 1886 2098 1255 257 -1222 -3487 -1164 564 -861 -2394 -4451 -4954 -4961 -1757 1889 2989
3842 2989 1508 2007 3277 3317 3670 3403 4012 3443 2772 320 -2942 -702 -86 -1128 -1629 -4467 -3180
3825 -3180 218 289 -1988 -2035 -3467 -4350 -2457 1042 680 226 -1179 -2167 -4033 -4873 -2192 -1963 182
3808 182 1962 1343 -2293 -3825 -5218 -2980 2299 6181 6479 9146 11351 6755 7693 15956 18034 15477
3792 15477 8462 4290 3365 4627 5010 3480 1350 -1000 -2542 -49 3344 2059 -377 412 3068
3777 3068 3397 2867 143 -1268 -3020 -3070 -1247 1425 4274 2147 -446 -220 -330 -438 -1544 -2852 -2098
3760 -2098 -2763 -3164 -1963 2510 3315 2915 3529 4710 1789 228 1929 5117 5600 5112 6580 4916 -880
3743 -880 -3925 -3856 -2333 -236 2402 1483 1037 -274 -767 -3708 -4720 -2898 2086 5895 7086 3659
3727 3659 2634 3156 3994 3907 1115 1499 3683 2427 2167 1761 704 1612 2455 2598 2384 1907 1242 1576
3709 1576 2114 3219 2814 -1422 229 684 1572 1021 2835 3968 2064 3126 3286 19 -2466 -2421 -2340
3692 -2340 -4709 -4842 -3055 -447 -5 -2381 -4109 -1590 -1675 -2968 -3705 -2721 -3218 -1619 -635 -2500 -7279
3675 -7279 -4922 -2067 -1795 -1041 1160 565 1954 3912 2951 1211 1722 1123 -1802 -1624 -198 53 111
3658 111 925 2617 52 -2388 -2055 1469 1750 590 1708 1374 1784 -967 -1954 -3008 52 2401 3451
3641 3451 5263 4533 241 518 -76 1661 3120 2353 1285 3902 5013 4026 3827 4198 6458 4727 3331
3624 3331 5488 4312 7946 7048 4285 3751 3592 4219 4855 2082 -542 -671 -729 -1828 -543 -143 -2561
3607 -2561 -2827 -2665 -1905 744 2608 3139 754 -1781 -1794 -242 1026 1062 1524 3345 3749 1762 4061
3590 4061 2850 1707 552 1096 2216 2929 3140 1105 1900 2525 3591 2861 897 1978 3237 6797
3574 6797 5917 4236 4301 5069 6844 6344 6449 4511 3578 256 2264 4071 3765 6266 5410 3175 2859
3557 2859 -1628 -1320 1246 351 2097 2684 1026 1446 1294 707 475 -512 705 217 1465 3715 4636
3540 4636 4128 -177 -2013 -5860 -3796 -2781 -5388 -5595 -1274 -1300 -3928 -2237 -515 1450 4172 3742
3524 3742 3011 2236 -2508 -4180 -1503 3283 5820 8344 9832 8690 7029 6861 6098 2192 -996 -1289
3508 -1289 -1942 -577 -1957 -973 485 3128 3409 1360 1990 2802 2653 -1395 -2729 -201 2053 1341 1958
3491 1958 1022 -162 2710 1072 -1733 -818 3000 4547 3769 1685 4489 2944 2539 1959 -368 -49
3475 -49 4090 3416 2322 3844 2956 974 451 2300 2722 4196 4141 3626 3407 3852 5525 4877 821 348
3457 348 1413 3177 1243 3401 2366 1305 769 -2741 -6394 -4205 -3745 -2769 361 2143 4051 4277
3441 4277 1705 1396 3502 4050 2415 4054 2835 2673 2363 -590 -1477 1012 -5 609 1450 1281 1714
3424 1714 -368 -1659 1542 2013 -534 -3130 -4305 -2956 562 1785 3056 5700 7018 4947 -149
3409 -149 3853 7393 5327 3085 2452 2803 3657 2022 1615 2609 3890 2137 1388 60 306 -3524 -3350
3392 -3350 -3935 -2618 2395 3429 4947 6665 6017 3606 1407 966 -213 449 -98 1644 2179 982
3376 982 900 60 2426 1860 -608 -952 -2391 -2132 -965 -2841 -5874 -5748 -2630 -1185 735 518 3544
3359 3544 4577 3254 2275 -62 -865 1739 3149 -798 -4682 -3240 -1809 -189 -34 2343 3116 3561
3343 3561 3296 1066 685 1451 3985 3877 3564 334 -1158 -158 1454 4827 4077 5268 4135 4650 8301
3326 8301 6603 5267 3814 1423 2222 3808 -707 -759 -820 -1275 801 1663 5839 6228 6667 6789 4188
3309 4188 2542 369 4445 4245 2701 1953 -462 -2877 -776 309 550 -401 -656 -3861 -4010 -1434
3293 -1434 -10 1128 2082 2465 2094 -1526 -2849 -5390 -6606 -4362 -2779 -3594 -4846 -5150 -6017 -7107
3277 -7107 -6775 -4700 -4616 -3556 -1181 348 2705 4446 5464 4634 4433 3790 5711 3287 2122 1794 909
3260 909 -1048 -1251 36 481 1510 390 3139 4138 452 3430 5174 6359 7641 6515 3751 2967
3244 2967 4254 1252 1551 4190 2452 -686 529 1095 57 -2543 -2576 -1651 -440 2635 2329 -784
3228 -784 -1084 -1599 -2076 -2047 -1393 926 3167 7546 6841 2800 -1249 -3087 -522 4120 4637 7810 4939
3211 4939 3752 3415 3106 5680 5382 4003 2285 -824 -3532 1086 4842 3246 -193 -267 -373 -2663
3195 -2663 -4047 -3194 -1460 17 64 3807 5661 5956 4687 2298 1818 239 -2980 -2390 -3020 -94 1479
3178 1479 2992 3017 -303 -3788 -6656 -5120 -1206 1482 1965 -2118 -4696 -5950 -1197 656 1507 3088
3162 3088 3490 4337 5355 7387 6161 2377 1125 2548 3705 3400 3458 2842 3260 2541 1578 1259 3481
3145 3481 1810 -1657 -2381 770 1482 2455 3616 4090 5274 3959 2953 2427 2237 1744 4042 1458 119
3128 119 678 2804 2418 -667 -3112 -694 1880 154 -112 -2 3923 3712 1820 4546 4368 4046 3251
3111 3251 1248 -79 -1072 1292 359 1043 1317 888 3584 5869 2430 765 1002 1839 854 190 1599
3094 1599 3737 438 -1650 -2925 -4895 -5271 -3292 -1661 2616 2381 646 1574 2425 1121 1248 1902
3078 1902 2240 1083 -2207 -2552 521 2733 2574 3683 3014 -953 -10 775 -296 3303 4311 5600
3062 5600 7778 9189 8058 2998 -638 54 -910 1541 1823 1221 -232 1277 505 -4 -2390 -3598
3046 -3598 -3851 -268 2290 2853 1734 2068 1346 -4 1853 560 -624 -1798 -338 -1439 -972 -671
3030 -671 -734 -764 -2765 -3644 -3105 410 1989 1629 954 3682 4309 5750 6866 5946 6312 3678 3354 3438 3162
3011 3162 1212 1326 13 -2982 -7183 -5898 -2728 71 3258 4866 3588 777 1207 990 2363 2064
2995 2064 -149 -1207 -1166 -868 -274 2589 3003 1201 3245 3400 4686 4997 5763 5241 4583 5216 1909 3312
2977 3312 663 -2276 -3068 -946 2076 4038 1667 1295 931 -1611 -3350 -4652 -4564 -7599 -6863 -2958
2961 -2958 -1775 -2233 -1479 -1057 -1556 -3207 -4313 -2629 -719 -152 394 719 474 597 298 -562 1772 2813
2943 2813 5169 5575 4870 3309 1668 1007 59 -1257 -2059 -3482 -5575 -1730 2963 1926 -2423 -5452
2927 -5452 -5350 976 1131 -1289 481 2349 1775 2146 5199 6210 5276 1422 3098 3932 5414 6629
2911 6629 5867 2774 3476 6665 6211 -112 -1745 2218 3931 4604 1121 -1968 -2702 -2062 500 3378
2895 3378 2796 3650 4869 5604 3511 2003 -294 639 -360 340 3218 1072 -1004 -235 559 917 1331
2878 1331 4557 7080 6940 4374 3550 3739 4136 813 -3514 -5583 -5506 -1350 2039 -605 -363 -65 2501
2861 2501 1827 950 1042 2 -757 -319 -1286 -2291 410 324 -930 3383 4902 4220 3703 1760 1662 2236
2843 2236 3107 1810 1762 3027 2548 3848 4405 4102 4234 2667 631 -31 587 4483 6571 6613 4547 1730
2825 1730 1460 -1717 -2722 -1884 -1433 -871 -7 -2415 584 2233 751 -3432 -1705 1935 3832 4217
2809 4217 3205 1602 1334 -903 -1844 -3 -1864 -3431 -1443 1368 1144 343 5243 8980 7173 5574
2793 5574 5847 474 -1356 757 -2338 -2046 -2345 -3077 -5087 -6290 -4673 -2347 147 -417 -579 -1914
2777 -1914 -1193 2311 1431 -3125 -1496 -783 -261 1215 2448 252 -4469 -3618 -2109 -778 2094 -484
2761 -484 888 1185 789 -33 -3025 -1091 97 305 1618 2409 3725 1789 2293 1860 1333 4017 3024
2744 3024 3367 4343 1944 679 569 683 2312 -212 442 1496 449 -1348 -2909 -3994 -2704 -3057
2728 -3057 -674 5083 7093 5929 5274 4290 2987 2087 370 -2882 -3875 -1473 -244 130 111 -1150 -1391
2711 -1391 986 3303 1145 503 926 1651 1979 1254 -10 -2530 -5930 -3569 -2412 -239 -2063 -1590
2695 -1590 2769 4397 2270 -1351 -4111 -4669 -4252 -3053 -4021 -762 -860 -3671 -4693 -4056 1438 1760 -2352
2678 -2352 -3278 -1366 -368 -2182 -4217 -1940 87 1909 2458 2371 3342 3751 3182 728 -937 911 1485
2661 1485 1245 149 -757 -86 2864 4447 4246 1099 1291 4 -1490 -654 655 4334 2931 930
2645 930 1301 1879 2799 6282 3342 -451 1255 2162 3358 6065 4808 1534 3948 2084 828 618
2629 618 1582 973 816 147 493 956 -608 -1936 -395 1197 1823 2174 4178 419 -946 273 -1022
2612 -1022 -1776 -2833 -518 2567 2695 2517 2567 1246 915 3724 4038 950 -331 -1295 -5 601 1265
2595 1265 442 1246 217 479 497 2385 2340 4396 5314 4148 4834 2779 2139 2032 -61 -2672 -1403 -600
2577 -600 -2746 -4229 -1126 -800 98 981 1536 -284 -4208 -3738 -6408 -4839 -680 614 -197 -1417 322
2560 322 1452 -1699 -2968 -2418 -1883 1141 2152 1009 229 2137 2465 1278 698 -2438 -2536 -807 1371
2543 1371 4205 6260 5229 3714 3032 1873 6373 5266 4472 4299 509 -884 1458 3307 496 -1712
2527 -1712 1461 2918 5850 6768 5066 2841 1559 2386 2233 2321 3756 6655 6841 2270 2087 1517 3801
2510 3801 3555 3607 5639 4068 3208 3684 2711 2827 4345 3374 892 -1226 -2617 -2725 -2869 -1795 2341
2493 2341 6100 4591 1981 2696 3197 2269 1115 -18 -4033 -5529 -3286 -592 2265 2554 1975 1852
2477 1852 2373 3019 -921 -2766 -2176 -1634 -1300 696 4740 5972 1761 220 2754 5679 7362 2807
2461 2807 -1232 -822 -766 -866 -2094 -3211 278 1289 138 2068 3807 4798 3130 4348 6167 4498
2445 4498 1637 3459 2324 2136 1491 2701 5446 6677 6364 7129 3326 2528 -147 -1312 921 646
2429 646 2261 1874 2668 865 338 -623 -1686 -5482 -3283 2244 4192 4478 2929 819 2082 887
2413 887 3292 4532 3196 2510 2355 1758 1926 2023 -2541 -4654 -3262 -726 348 -962 -169 -39 -3046
2396 -3046 -3195 -3589 -2920 -3872 -5939 -4848 -2280 -2303 -2896 -330 -992 -3277 -2212 -470 -1451 -4612 -4089
2379 -4089 -2879 -1079 1039 2707 3188 -1154 -3273 -941 -1352 -3549 -6757 -3948 810 2590 2714 2209
2363 2209 2846 1870 752 1584 140 -154 732 -121 -2312 -3129 -1539 -3165 -1289 -3107 -4752 -2629 -247
2346 -247 3013 2121 -376 985 3496 4051 2541 712 -1209 -1171 1397 3377 3636 667 -870 836
2330 836 2161 1749 615 1958 2063 2136 1008 597 2422 1194 648 1374 -1012 -1758 -4078 -4990 -1078
2313 -1078 565 1341 -52 -946 -2825 -2412 -2270 -1448 704 3727 4116 3474 3376 1266 1222 1924 3335 566
2295 566 111 -538 2189 4109 3530 4219 4236 1821 -579 -1203 273 270 828 2834 3794 7294 7203 3556 1466
2276 1466 -157 785 -2682 -3356 -2466 -1278 1793 2928 1349 -1102 -154 1096 797 -1877 -4072 -3050
2260 -3050 59 4309 4754 5602 5411 5475 5163 5083 4592 2509 4699 5825 3250 1418 -752 -705 1 1258
2242 1258 291 1318 2861 2441 1483 3204 2512 606 -841 1134 3506 3497 1731 -1444 -4963 -6413 -2945
2225 -2945 150 441 -826 -2849 -865 -2253 -1916 2821 1760 390 845 88 -1159 -1553 -694 -240 348
2208 348 929 2473 4040 3776 3178 2916 1502 967 -4820 -4480 -3567 1014 2372 -1053 -1537 -2046 760
2191 760 1184 -1547 391 2901 3001 1621 -611 2330 2711 1091 2875 1973 2971 2653 4109 3409 106
2174 106 1349 757 84 360 -1296 -934 -612 -1037 -2981 -2661 110 1561 1433 2063 668 585 696 -758
2156 -758 70 680 -453 -2502 -3883 -3704 -118 1231 -1869 -3309 -3567 -1577 -45 152 0 -363 -1355
2139 -1355 -2357 -614 1072 -1056 -2672 -1225 -344 -19 -107 -1143 -2525 -1961 -2119 -599 707 1564 2481
2122 2481 4500 6719 6965 4726 527 -753 2705 5283 1800 -1846 -2888 318 7037 10510 7235
2107 7235 2921 -1052 -5229 -3829 -2704 310 502 -1779 -2641 -571 2682 2045 254 232 -1097 639
2091 639 3231 1897 -175 -1959 -1757 -1416 -589 -1374 -3402 -5318 -4342 -810 679 1307 1145 2732 3735
2074 3735 4810 3529 3815 5915 9691 9399 7908 6686 2898 3741 5354 2314 2318 2678 2537 1537 3028
2057 3028 4962 5518 6470 4774 3708 4211 6244 6138 5796 3008 2292 3021 1784 1043 -783 -602 1021
2040 1021 2657 1559 682 673 2417 1973 -3567 -4094 -3226 -1304 293 -339 -4135 -6682 -5196 -3379 -1279
2023 -1279 3200 1571 -1139 -3424 -1195 -1721 -1152 -1078 667 1881 -651 -2982 -3758 -201 179 164 -402
2006 -402 -567 1592 2055 1660 4363 8071 6826 3954 3884 3057 2891 5297 4924 7086 4652 1681 2897
1989 2897 1821 -1675 -3914 -3416 -523 2324 492 1289 561 -1453 -577 -1065 160 243 -691 1303 1866
1972 1866 -128 945 2294 685 292 360 1857 2255 853 -1489 -1249 -219 929 -353 -2457 -1636
1956 -1636 -1037 290 868 2332 3252 1460 1208 781 -1555 -1907 -1246 -941 -1309 -1670 -15 413 2310 6912
1938 6912 6896 3248 893 2856 4090 2103 -229 -1005 2556 1761 353 1185 -3156 -6703 -2264 -2503
1922 -2503 -4764 -3868 -3368 -3868 -4508 -3985 -3959 -4500 -1087 1274 -2182 -1238 2269 3079 2967 1312 1077 1236
1904 1236 -1956 -3362 -3189 -2840 -2050 -3949 -8624 -7774 -4677 -1745 -517 1605 4207 1662 -3797 -1563
1888 -1563 4030 7936 5529 -457 -2672 -1942 -2976 -5424 -6797 -4773 -3259 -2610 26 1661 2082 -629
1872 -629 -3915 1013 4470 3218 -385 -241 -726 64 -399 184 -1930 -1597 88 4571 5099 3746 -565
1855 -565 -1991 -774 93 -268 329 -237 -1186 -5075 -6678 -6777 -5997 -5374 316 3077 3865 4529 4338 3240
1837 3240 607 -171 813 3473 2798 3186 342 -2500 -1846 2017 1901 1234 934 46 635 164 -1716 -2307
1819 -2307 419 2275 2927 -2563 -4891 -1702 -1243 -4 699 -2432 -2383 -600 2180 1246 -303 -1162 -2571
1802 -2571 -2166 -2510 -3284 -4054 -3274 -1434 783 -600 -320 -835 1014 890 -1543 -3863 -998 2385 -1396
1785 -1396 -1734 668 1217 678 -503 -1826 82 597 -2552 -3549 -2300 -965 -1818 -2366 -702 1566 1219
1768 1219 1779 2539 1772 -141 -3306 -4813 -2827 -936 814 140 -70 -113 -929 -918 -361 -1506 807 263
1750 263 -3908 -3809 -989 -1225 -1844 -3886 -3964 -4078 -1756 -2370 -1126 -1073 -2095 677 3255 3464 3204 2957
1732 2957 280 -890 -2593 -1264 204 1269 1625 3077 1006 2465 2062 267 -194 95 -942 -10
1716 -10 2471 2782 317 3164 6720 5911 1852 -874 -2825 -2475 -2174 -2977 -72 1614 1940 2144 115
1699 115 -1469 -2355 -3880 -2394 -569 -2559 -368 -890 -3373 -4326 -531 3439 3024 1987 1854 2446 4395
1682 4395 5763 5407 2532 4141 4743 4771 5949 5908 6789 7338 1943 -3535 -3692 -98 27 -1309 -3204
1665 -3204 -1585 -2126 -1432 -1257 3487 5479 3652 -903 -685 2305 490 -1301 -354 -469 -2524 -1384
1649 -1384 562 4065 457 -294 -338 -3428 -5236 -4659 -3380 -2198 -3111 -5024 -1695 2047 3122 2887
1633 2887 620 -4574 -9521 -7260 -6561 -3279 -1540 254 -68 657 -1146 -1441 -1379 -2647 -2982 593 -385
1616 -385 -1085 -3701 -1916 2010 4630 1908 -3534 -3103 -3874 -5596 -2806 -86 -1640 -6509 -6468 -837
1600 -837 1810 4572 9254 12992 13182 9161 4845 2526 3810 6184 6733 1687 -2407 -1773 10 -791
1584 -791 -1672 -1815 -43 -532 1034 2164 3798 3770 1102 -1810 -4656 -5866 -4565 -1712 1911 2132 693
1567 693 -480 1838 1765 -463 1284 2855 2463 2454 -3248 -4317 -2057 -734 -2358 -3980 -2774 -841 1410
1550 1410 -436 -545 1076 2553 3482 3013 4920 7485 3196 2011 2207 1824 2122 2270 1337 -1452 -5343
1533 -5343 -5914 -6559 -5414 -3084 -4239 -4374 -885 -1172 -922 748 824 3345 3711 1504 2441 3350 3829 3671
1515 3671 1077 968 1347 -127 -1363 -2768 -4605 -4980 -1285 -3810 -5666 -7723 -6275 -1995 -3307 -6615
1499 -6615 -6474 -1131 534 -1435 -1312 1143 473 41 -716 -1234 -2282 -1776 -1332 -1913 138 279 -1819
1482 -1819 -4111 -3931 -1706 -1355 -4422 -3947 -1604 159 997 -279 391 3229 3599 2007 2802 2725 758
1465 758 1155 3705 4412 7744 6486 1849 -881 206 162 -732 -3067 -4038 -3189 -2988 -1841 -1632 -579
1448 -579 39 -1685 -3351 -6033 -6535 -4021 -186 -1240 -1588 -383 -2014 -1278 -1208 -610 -1246 -200 2140
1431 2140 593 -2926 -4730 -1437 -1206 -1591 1978 1824 1423 1121 -2521 -2898 -1523 -2577 -3133 -4125 -2857
1414 -2857 -700 -187 -2732 -3886 -1418 -833 -1582 406 -2723 -6459 -3984 -4186 -5168 -4029 -2238 -2282 -2718
1397 -2718 -2954 -1705 -1631 -328 605 350 209 1202 4993 5163 6391 2825 688 1308 893 -1526 -3056
1380 -3056 -4860 -6020 -4520 -700 2318 3015 1420 174 546 -568 1618 3553 2952 -637 -2884 -2429
1364 -2429 -2994 -4299 -4423 -1404 1537 4250 2994 1223 2751 4606 1766 -1537 -4983 -5579 -5395 -5431
1348 -5431 -3343 -1583 -478 820 -287 -1641 -1892 -62 1711 739 -1788 -630 1134 891 -26 1359
1332 1359 -1734 -2690 -717 -1889 -2606 -157 471 1917 -611 -1627 -2929 -4748 -3112 -4461 -4818 -1746
1316 -1746 -1007 -3797 -3289 789 846 705 -3110 -5187 -3625 588 2505 -150 -299 1328 1673 1635 1712 391
1298 391 1590 1203 1126 841 -1798 -3597 -1916 371 793 -1749 -1112 -2885 -2722 -3225 -2888 -1579 -2804
1281 -2804 -1638 781 2230 3408 3445 2082 -165 -1945 -2601 -649 3154 3669 5373 5483 2878 -831
1265 -831 -2183 -2116 -2837 -3199 -5530 -3259 -2499 -2862 -2200 -1742 -2753 -2209 -1746 -967 -183 -4255 -7884 -8266
1247 -8266 -4679 -1832 141 565 1365 1674 1716 1127 421 1080 1751 -1756 -3547 359 1618 -750 -1762
1230 -1762 -1213 -917 -1618 -3005 -3893 -5851 -3068 -1427 -707 -2474 -2931 -2885 -713 418 3820 5306 5356
1213 5356 4242 -653 -3523 -3456 -2331 -1914 208 2161 2951 4007 5066 4321 4170 2280 2350 980 -3226
1196 -3226 -4492 -108 425 -581 -2498 -364 634 1190 3315 2432 2187 1359 985 -690 -1549 155 2949
1179 2949 930 -156 -4063 -6855 -6680 -6956 -6629 -7184 -5508 -3972 -1341 -4123 -5856 -3252 -3098 -3370
1163 -3370 -1781 817 2356 6494 3444 -1302 170 -1744 -2681 -782 -1828 -486 1415 141 402
1148 402 2105 942 -2678 -2297 -1257 3344 5405 4038 3296 1718 2799 -264 -3496 -4620 -3112 -1942
1132 -1942 -3461 -3394 -3633 -2836 -984 -1830 -3783 -1941 -1216 1062 1754 3153 5612 9701 7674 5501 3091
1115 3091 1233 2821 3059 2930 1723 -662 -2529 -4756 -2438 -1948 112 -1654 -3130 -3064 -3008 -1024 -1445
1098 -1445 -2775 -3328 -2549 -2958 -3386 -933 198 2735 3026 1395 248 -448 -948 -341 2657 1765 -2265
1081 -2265 -728 -2275 -2911 -1142 -1893 -4231 -3331 -3097 -468 2119 4181 2046 3519 3303 4465 5406
1065 5406 2268 1374 753 -75 -944 1315 1393 974 1941 4523 4428 809 -1097 -2575 -2765 -3657 -1427 707
1047 707 -2831 -1438 913 -1434 -1962 -2457 -4624 -2320 -773 -2736 -3205 -1627 -753 -3695 -6743 -6547
1031 -6547 -1169 2028 1107 -518 -1037 -2250 -2648 -1179 -961 -1997 -918 2194 -820 -3139 -1213 247
1015 247 -1204 -1540 -3095 -6156 -6897 -4646 -2577 -398 1851 3354 -607 -2472 -3855 -5049 -4333 -4770
999 -4770 -5850 -5928 -5471 -6370 -5034 -2939 -1566 -497 -1840 -1629 475 148 -3320 -4503 -2734 -1294 -2562
982 -2562 -3846 -1660 -188 -596 2034 2499 2037 1681 835 -3191 -1849 -204 248 2673 748 -1210 -1293
965 -1293 -2897 -165 2600 2325 -2529 -4726 -6225 -3903 -3042 -2252 -490 553 -1442 176 -2409 -2934
949 -2934 -121 -464 -586 -1093 2262 5403 5846 3724 2102 2330 2233 -2216 -5974 -5330 2212 6271 3756
932 3756 -600 -1242 2722 2503 1776 1170 412 -404 -1980 -1337 3430 3223 1875 1176 2340 1695 -245 -4998
914 -4998 -5650 -2053 925 -537 -2544 -1715 -456 -3525 -6866 -5988 -3680 -5408 -5964 -3567 -244 1197
898 1197 1330 2740 1113 3887 4483 4922 1453 -2475 -474 2125 1656 937 -2964 -5075 -6411 -6441 -7561
881 -7561 -9926 -4647 -526 745 -3474 -4429 -4936 -3326 -1968 2130 4531 3684 -369 -579 -1019 -3129
865 -3129 -4653 -5356 -4016 -1169 162 -1487 -2367 -1849 -4205 -5923 -6782 -5643 -4665 -2609 -1710 -4232 -6115
848 -6115 -1394 309 -1270 -4342 -5214 -6230 -2530 -991 2891 6069 5447 4141 1223 -807 -2297 -279
832 -279 -109 -264 -437 -142 882 1153 -437 -5096 -7732 -7902 -3660 -2087 -3942 -3566 -2592 -2344 -2079 -1939
814 -1939 -940 1311 4150 2721 -2834 -1988 -27 1540 2030 3832 5785 3457 2675 4570 3452 1828
798 1828 -864 -3141 -2368 -2302 -1188 -1093 -3870 -3378 447 810 1172 509 -1283 -908 185 -364 -995 -2976
780 -2976 -3846 -4505 1020 -604 -4207 -3690 -2912 -3168 -3949 -4416 -3856 -5473 -9081 -9168 -7116 -3236 -3480 -4258
762 -4258 -3560 -3191 -6090 -3930 -1055 -1464 -3163 -727 1112 1385 1598 2304 939 -1950 -332 394 -1150
745 -1150 -2154 1290 2209 3590 410 -181 1212 1918 2472 2701 1421 1151 1909 1582 -199 -1610 -5320
728 -5320 -9358 -13140 -10304 -4106 -2886 -6346 -8122 -8333 -1719 5733 7086 4386 3077 3562 4498 5405
712 5405 4461 3534 3039 2044 -249 -4779 -4471 -1435 1354 2568 2397 -2146 -7381 -4457 -3248 -2782 -1666
695 -1666 81 1134 -255 -1625 -2126 -647 -1879 -2702 -2320 -1974 -1715 -1613 1221 1075 3409 3934 550
678 550 -409 -449 2179 3178 2828 1309 -586 -1034 -954 458 46 -4309 -2056 -797 -309 3073 3803 3736 3662
659 3662 3454 -288 -3546 -3077 -2645 -2768 -621 -1096 -4529 -5912 -5358 -7155 -8574 -6909 -5929 -6082 -5142
642 -5142 -1585 369 2199 1879 4239 1717 1726 2215 805 1354 1452 1118 282 145 -1241 -359 789 2543
624 2543 3401 1147 -359 -2474 -3104 -1200 374 123 1214 -629 -3807 -4658 -4699 -1772 1123 3135 2145
607 2145 746 -2158 -717 274 -1186 -591 2485 -354 -2352 -728 -2627 -4897 -1721 -391 -3143 -2869
591 -2869 -1960 -2580 -3314 17 925 -229 -1487 -347 1131 2905 -1076 -4511 -4139 -2109 -3551 -6432
575 -6432 -8759 -7181 -4058 -1945 -2686 -5451 -7211 -3959 763 -695 -1599 1200 377 -1591 -997 1364
559 1364 392 -1670 -6412 -4752 -3195 -3748 -4090 -3612 -2057 -5171 -5280 -5147 -5300 -4141 -5178 -4009 -2716
542 -2716 -2451 -1020 -59 -333 684 1016 -251 -3285 -5141 -3920 -2413 -1368 1551 2373 923 2054
526 2054 5398 2427 -1987 -1303 -1087 1150 2082 -912 -4435 -6122 -3929 1025 -496 -1732 0 1427
510 1427 2203 -253 -2562 -3442 -1998 -2042 -2227 -3202 -3191 -2241 -3236 1004 5086 4968 2301 655 -393 1191
492 1191 3329 3390 5792 4916 2054 2018 -205 -346 -234 1315 3347 1955 1122 1758 3193 1177 -1054
475 -1054 -1294 -1370 754 2421 3030 -145 -285 881 -1602 -1124 -357 -2079 -1237 1698 1652 -204 391 -671
457 -671 -1045 1909 1743 -1921 -4146 -5587 -8304 -6461 -3936 -1714 -949 -1409 -1095 -1308 -462 75 -1015
440 -1015 -586 -1828 -5100 -4951 -4642 -1490 2594 1204 -1604 -1244 -1670 -2466 -2566 -422 2725 2810 4377
423 4377 4052 -50 -995 -1517 -2644 -410 3106 467 -3999 -6287 -5548 -1992 1601 5254 7777 4391
407 4391 -424 -487 97 -3681 -7680 -7711 -6748 -4247 -1929 637 1856 163 998 741 -213 953 2675
390 2675 1416 -383 -3103 -1886 244 2766 -3 504 51 1208 1062 -2248 -31 -733 -2321 -2962
374 -2962 -2177 711 5257 4927 -75 -2944 1771 2096 -1503 -4985 -3516 -967 -715 -1381 -4372 -4481 -6125
357 -6125 -7391 -6896 -1973 4188 3142 -1313 -2693 -762 -2351 -6137 -7621 -6956 -5415 -5299 -3917 -1700
341 -1700 -448 -3218 -4057 -2966 -1667 -326 -573 -2852 -3036 -3833 -4266 -4117 -3019 -2057 -3624 -4065 -3985 -3775
323 -3775 -3045 -1421 -1153 -1016 -2788 -2606 -2676 -2818 -2314 -1954 -4036 -4729 -5880 -6090 -4893 -3509 -2665 -2860
305 -2860 -1901 -2060 -376 -1670 -6205 -7251 -3941 -238 -264 -2700 -2615 -2147 -1018 -486 1722 165 -512
288 -512 493 1699 -11 -2173 100 -1209 -1582 -723 30 1799 2805 4008 2602 -1386 -3837 -4532
272 -4532 -4037 -1519 668 789 -1755 -2964 -4914 -4306 -1653 44 -866 -1511 -2449 -517 -203 -2522 -2454
255 -2454 -692 3870 7194 6712 2896 3845 3291 0 -1806 -2209 -1689 -522 2844 5090 3233 63
239 63 -1448 -4069 -4696 -4615 -4200 -5394 -2814 -1270 716 877 773 -936 -1502 -347 -185 1167 1183 71
221 71 515 -1032 -611 -293 -2787 -5161 -5725 -2860 -856 -41 -303 104 -2223 -1211 1094 929 448 590
203 590 -541 -3951 -4530 339 -317 -2111 -2190 1133 3145 1023 -1485 -1639 -2243 -3778 -1895 1060 1801
186 1801 1134 338 -1067 -662 -142 869 665 -14 -1390 -3154 -4189 -4483 -2626 -819 70 -1072 149
169 149 798 771 -681 -247 2227 2658 -387 -3576 -4596 -6879 -8596 -6638 -3685 -3080 -3975 -2856 -2916 273
151 273 2118 3565 3310 1688 -282 -1391 -1103 -549 -411 199 1745 3407 2632 -1534 -2752 -2091 -2925
134 -2925 -1817 -2726 -4170 -1318 -988 -3088 -3864 -1531 -1131 369 337 683 968 -127 -462 -1327 -1489 -3621
116 -3621 -4429 -2633 -1182 -69 -372 -742 808 -1892 -2012 -2296 -2919 -1314 -1132 -4821 -6380 -6002 -4119
99 -4119 -620 1475 734 -1552 -2770 -3103 -2670 -1224 -1436 -1403 -5515 -4313 -855 -38 -1280 -2531 -2741
82 -2741 -3632 -1331 1094 1174 1253 -165 -2221 -3724 -4351 -4180 -3031 -1304 -1237 -1653 -3733 -5034 -5292 -4672
64 -4672 -3705 -2844 -1644 -3559 -4082 -4548 -2349 -1100 -1685 -3320 -4319 -1666 102 793 3188 3671 1799
47 1799 -9 -840 -2639 -3899 -2306 912 1658 805 336 2381 1427 -170 -1453 -1621 -1649 -2124 -3663 -5054
29 -5054 -5109 -4508 -1681 354 12 1994 2276 1657 -603 -1751 -416 -127 -421 -1275 -3219 -1679 -588 481
11 481 966 795 729 -2303 -3738 -4500 -4030 -2271 -1080 -2287 -4048
0 -4048
$$ Imaginary data points
##PAGE= N=2
##DATA TABLE= (X++(I..I)), XYDATA
32767 42508 43873 44403 44332 43367 41980 41843 43935 45260 45454 47509 48147 49918 50455 50690 50502 52454 53017
32750 53017 52029 50842 49048 48659 50199 51377 52942 52097 51573 52168 52378 52090 53376 55045 55689 56335 56169
32733 56169 57062 58800 59851 58936 57238 57499 58768 59629 58497 58310 59948 60282 60387 61711 60825 62228
32717 62228 62814 64547 66490 64236 61691 62585 62852 63568 65644 66750 66211 63855 66194 67202 66673 66782
32701 66782 67175 67872 68214 67613 69147 72266 72059 72536 73569 74288 74339 73683 72290 72482 72979 72696 74954 74059
32683 74059 74306 75849 76400 77097 77788 77589 77018 77412 79554 78127 78241 81946 83737 82935 84680 84146 80715
32666 80715 80109 83885 83130 81599 83486 85153 85205 86158 87180 88781 89313 88367 88014 87785 88503 87540 87467 90387
32648 90387 90234 88082 90384 90382 91058 92243 94252 95343 93402 93385 93904 94904 95322 97466 97664 97426 96130
32631 96130 94978 97520 99980 99865 98095 100281 102761 102255 100842 99053 98447 98879 101816 101694 100007 101350
32615 101350 104271 105921 105583 106638 106386 104654 104984 105699 105533 106171 105855 105200 108922 111985 111585 110313
32599 110313 109177 110668 110260 108358 106799 109237 111489 115038 116209 115420 116399 116564 116064 116899 114388 116565
32583 116565 116305 116006 114547 111035 111149 114277 114962 118285 119349 121189 123310 123164 122342 122165 123942 124639
32567 124639 123480 123613 125675 127499 128228 127820 125274 121541 121984 123283 121819 121247 120929 119737 120146 119381
32551 119381 121805 125833 126789 126610 125991 125502 125587 128394 131175 131938 131781 132389 132933 133715 133778 134087 131113 128798
32533 128798 129117 128866 129680 129123 128788 130019 129501 129991 130311 132514 132657 134236 136320 136707 136135 138187 137730
32516 137730 138850 140375 139413 137035 135270 138706 139612 138814 140770 142139 142550 141157 138884 137571 137508 136349
32500 136349 136884 137098 136614 137978 138226 139578 139630 138241 139187 139706 142461 142407 140748 144265 146283 147005 146322
32483 146322 146501 146241 146152 144994 144850 146773 146368 146878 149004 150752 149878 148425 146108 145984 147843 150671
32467 150671 148709 145341 144822 145932 148204 148491 148330 148949 149745 149915 150843 151926 148891 147446 150897 151388
32451 151388 151096 149317 150848 153772 153707 153567 151777 151404 151773 152795 151900 152738 154165 155943 156412 158951
32435 158951 160274 157955 153928 152962 151957 152547 155811 157440 159066 160088 157129 157185 157569 156065 154956
32420 154956 155487 156674 156576 157740 157343 157531 158203 157866 157874 157109 156574 158388 160303 159396 160950 161479 159728 156982
32402 156982 157363 158761 161230 163475 161227 160895 161869 162749 162490 161251 159136 157408 159188 160974 161021 162381
32386 162381 160860 157490 157282 158084 161713 163968 165968 165614 168704 169161 170394 167990 165467 166180 169166
32371 169166 168009 168141 168919 169372 170693 171728 171539 170153 168205 169074 167988 166400 167162 167931 168764 168038
32355 168038 162970 164345 165597 165243 166570 168047 169093 171578 171955 171718 170119 170052 170395 172315 171565 172173
32339 172173 171364 171177 171477 170959 172721 173340 175215 176162 175956 173520 171067 171346 171675 171146 170222 169199 169830
32322 169830 170205 171555 169936 169198 171297 173114 176814 174470 174566 174880 173059 172995 173265 167725 163621 165424
32306 165424 168787 173122 172911 170913 172624 174594 174445 173479 172938 174526 172884 171965 174062 176386 174758
32291 174758 173561 172312 171451 170830 171593 172614 172672 175551 176457 178600 178199 176323 173144 172161 172824 174093
32275 174093 174903 175685 174395 170294 170511 171236 172116 173608 175955 177101 176987 178154 173651 173834 173910 173183 178107
32258 178107 179780 178005 178696 178754 177958 175830 176702 176598 172091 168727 168001 171437 174587 172634 175721 179277
32242 179277 179930 177003 178945 178160 176733 179319 182770 181508 180531 181346 181690 180610 180937 180318 181508 182657
32226 182657 179450 175552 176197 180208 181418 180544 179800 179744 180330 182102 180220 179826 178156 178163 176196 176773 177864
32209 177864 177359 177067 177581 177831 179412 179450 178974 180727 182209 182865 181191 181871 180643 180688 182865 185104 185948
32192 185948 183521 182117 182843 182915 182339 180927 179301 177460 178333 177287 177761 181130 183641 183972 185490 185336
32176 185336 182836 182766 180630 180515 180558 183799 181932 179699 175405 174213 177492 180894 180736 177277 172821 173172
32160 173172 175974 176906 177386 176579 174235 175880 175582 175953 179610 180530 178836 178551 177297 176581 180136 183155
32144 183155 183638 183685 183627 184114 183982 184150 185663 183639 184381 184751 183242 183120 182364 182219 182955 182861 182299 182306 185361
32125 185361 186976 187730 188713 184405 180741 180656 183239 182714 182605 178743 177037 178334 179252 181818 180032 177577
32109 177577 178879 180110 183354 184052 181892 182730 180868 181124 180783 183551 182423 178925 178837 180903 181433 181982
32093 181982 181228 181520 182524 183770 181442 180556 182370 183584 184488 184746 183332 180348 182626 185028 186255
32078 186255 184194 181994 182678 182741 181312 180556 182694 182822 180848 181033 181110 180071 180705 182005 182651 180971 180136
32061 180136 179620 180062 181427 182791 183350 181063 180651 180632 180986 181727 183396 186753 183539 181741 181633 182203 184895
32044 184895 186885 186355 183499 181840 183340 184114 184047 184097 184390 183624 183650 185521 183402 184254 185478 183114 180741
32027 180741 175974 175409 177761 181438 181274 181834 180837 181859 183468 181472 180501 179007 179509 179782 183001 186574
32011 186574 187656 187470 188210 186688 185551 187151 185300 183741 183953 184634 182297 180013 181314 183681 183415
31996 183415 185128 185005 186263 183496 184480 185280 184626 186331 185348 186997 188297 186502 187339 185503 183512 183990
31980 183990 185035 184769 185105 185811 189012 187817 187642 187775 187385 183854 185132 186441 187437 186570 184261 183051
31964 183051 183876 185040 181860 179717 180906 186334 187097 185498 183345 183685 183242 182121 184260 183322 182340 182717
31948 182717 180948 184538 184363 181514 180626 181914 183093 183482 185511 188365 190914 191777 191522 188720 187203
31933 187203 188091 188714 187819 187891 186219 186235 185050 186069 190837 190700 186246 182473 182003 183137 180977 181405 183423
31916 183423 187267 190651 188876 188416 188998 188423 186198 184461 185105 183100 182284 186117 188461 187302 184671
31901 184671 182918 182678 183251 185647 187865 189247 187041 187284 188472 189237 186399 183331 186467 187770 188157
31886 188157 188715 188137 186296 184492 183005 184019 187421 186676 184406 184512 185248 183921 182115 182797 183754 183903
31870 183903 184314 182634 180053 178127 179477 181261 181389 181810 183409 185620 187350 187832 182160 179558 181485
31855 181485 185698 186756 187743 186460 184043 180469 182520 184487 186464 185991 183012 182010 182285 183016 185683
31840 185683 186069 187505 186455 184666 185307 185120 184663 183445 183503 184469 186090 187313 186040 185344 189400 188798
31824 188798 184705 182892 183641 184259 186974 189307 187756 187595 187815 187092 187096 186950 187631 188407 189860 189116 190472
31807 190472 187368 183537 181722 182162 183640 184869 187853 188543 187801 185390 183338 185622 188376 188860 186256
31792 186256 186617 188797 189520 188952 185986 182287 179466 180253 179909 182265 184861 187469 189012 187714 188462 188888
31776 188888 185898 185614 183928 187309 189587 190213 189774 189231 191555 190959 190610 191034 189312 187441 188674 188889
31760 188889 187112 186049 185489 188850 189759 189955 191287 189635 187341 185551 189399 190388 189377 190121 191140
31745 191140 193071 188612 185632 185443 185636 186539 186698 187581 188901 190928 187761 185888 183581 182193 183630
31730 183630 187215 188294 187424 185821 185305 188118 187507 186132 187997 191028 191107 189409 189605 188370 189963 188850
31714 188850 184729 183736 182597 184096 185479 187970 190194 187969 187719 187938 186178 186608 187102 188700 188513 187178
31698 187178 189187 189283 185166 184067 184000 179909 182297 182412 187488 190436 191223 185624 183233 185153 185326 185114
31682 185114 188772 189594 188278 187759 188189 186918 187963 190613 191135 191294 189187 189949 189950 192079 191770 188649 189265
31665 189265 189362 187974 189811 190361 187796 186641 186751 191630 188420 185598 188992 189087 187919 184930 185439 187955
31649 187955 189895 191374 188293 190541 190239 188372 188055 186616 186180 184203 182815 184308 186260 186805 185903
31634 185903 181564 179938 178996 183308 186171 187530 186440 182283 181597 185308 187947 187132 187726 192388 191643
31619 191643 188708 187605 187583 187976 186859 188216 188472 189445 188628 185852 186511 188922 189594 192303 192759 191940 189222
31602 189222 188062 189348 192106 192224 192069 190080 189580 191424 188295 189930 191500 192563 192306 188827 189253
31587 189253 188882 187781 189209 188080 188881 190078 189673 188777 185601 186140 185819 186944 189570 188264 187818 190801
31571 190801 191684 190235 186345 187532 187941 185054 184575 188712 188471 188137 187245 184287 183253 183193 185980 185087
31555 185087 183543 184946 183802 186366 188150 190275 192059 191734 190503 188533 186535 186377 183777 185260 188761
31540 188761 191985 195530 195144 190695 186593 188267 191886 191520 189685 192195 192387 192506 191385 191033 190514 192366
31524 192366 192776 188067 189026 191254 191470 191049 187285 185869 188617 188582 185194 184903 190909 192785 194156 192803
31508 192803 191039 190306 188216 187621 189731 190731 191186 191119 189352 186649 187681 190550 192443 191125 188724
31493 188724 191024 191207 193902 194031 190339 189403 187951 187073 188880 188377 188804 189790 188949 187547 187657 188054 185873
31476 185873 184319 186570 190268 191303 187501 188988 192123 191427 191450 193604 193627 190983 191124 191403 193757 193004
31460 193004 190944 191195 190286 189785 190236 188515 187987 189972 192144 190867 190616 190811 192420 193796 195297 195972
31444 195972 194522 193956 195096 194522 192012 193569 196632 199418 197831 192796 190575 190490 190305 189131 187771
31429 187771 190217 192923 190756 188107 186972 186292 186627 187412 187886 187831 191082 193204 193960 192474 191587 191022
31413 191022 189936 187181 188569 191301 191534 192732 189009 187151 188237 188642 189483 189364 188463 187326 185783
31398 185783 185282 187078 188169 189806 192153 194280 193916 190243 188776 186840 188700 191693 190329 190029 190301
31383 190301 190997 191081 190087 191274 192353 194190 195213 196063 196892 197755 195331 192027 191639 190369 189515 191700
31367 191700 192502 194275 192684 190199 189909 187246 187469 188047 187789 188163 190791 190396 186463 184007 183518 184922
31351 184922 186979 187173 185036 188603 191411 193886 196113 197155 196753 193113 192618 193264 193028 192535 190663 190815
31335 190815 190574 189445 191874 191779 190048 192001 197216 197585 193390 191272 191534 188244 188065 190564 190462 187985
31319 187985 189004 189437 191585 195216 195787 191818 188644 186638 187433 190533 194116 194300 193086 194738 196209
31304 196209 194830 195019 194223 191251 191920 190893 192651 192366 192107 189654 189408 189420 192874 191376 188119 188965
31288 188965 189053 187421 187277 189118 189515 191431 190040 189438 191539 193011 193137 192305 190563 187254 187390 191163
31272 191163 192352 193772 193503 193756 191693 189448 188979 188888 188505 188429 191808 190786 188996 193789 193713 194933 197294
31255 197294 194151 190598 191159 194732 193305 193933 194378 197366 195278 193160 193208 190953 188835 191955 193068
31240 193068 192168 191379 192710 193479 192609 195797 196707 196143 196588 195628 193398 193438 193561 194822 194263 194008 195360
31223 195360 194697 193149 193451 194294 193616 193369 195806 195103 196827 195383 193755 192985 193884 192459 189799 189650
31207 189650 190783 190800 193575 193373 192996 193089 193916 192572 190933 193372 194853 196512 194616 192153 193765 196114
31191 196114 198668 200768 197322 196502 196857 196490 197638 196863 196287 195531 194908 193690 192307 191538 189160 187413
31175 187413 188592 193066 193907 194542 193756 192626 193176 194626 195383 195348 194481 196972 197319 196367 193881 193328 193878
31158 193878 192304 193063 193604 192805 190147 189671 192349 191722 196328 197523 194264 193761 193828 193717 189924 192080
31142 192080 196333 197724 193474 194613 194452 191637 193110 194687 194367 191744 189549 192706 193170 192735 191329
31127 191329 192958 191719 191961 190893 191318 191675 191939 192155 193342 197467 196486 194455 191057 191284 193877 196216
31111 196216 193570 192730 191534 194071 194333 197472 201493 199743 199263 195948 196085 197605 198260 199665 199322 195745
$$ [...]
##END NTUPLES=NMR SPECTRUM
##END=
