##TITLE=Analysis number 309707
Compound Code spb 04177
Book Reference 423/22
Project Code adrs
Chemist Name bruced
##JCAMPDX= 6.0         $$ Bruker NMR JCAMP-DX V2.0
##DATA TYPE= NMR SPECTRUM
##DATA CLASS= NTUPLES
##ORIGIN= Bruker BioSpin GmbH
##OWNER= NMR
$$ XWIN-NMR		Version 3.5
$$ Thu Jun  2 09:29:18 2005 GMT Daylight Time (UT+1h)  MAYBRIDGE\NMR@NMR_250MHZ
##.OBSERVE FREQUENCY= 250.131544655141
##.OBSERVE NUCLEUS= ^1H
##.ACQUISITION MODE= SIMULTANEOUS (DQD)
##.ACQUISITION SCHEME= undefined
##.AVERAGES= 16
##.DIGITISER RES= 18
##SPECTROMETER/DATA SYSTEM= dpx250
##.PULSE SEQUENCE= zg30
##.SOLVENT NAME= CDCl3
##.SHIFT REFERENCE= (INTERNAL, CDCl3, 0, 16.522)
##AUDIT TRAIL= $$ (NUMBER, WHEN, WHO, WHERE, WHAT)
$$ ##TITLE= Audit trail, XWIN-NMR		Version 3.5
$$ ##JCAMPDX= 5.01
$$ ##ORIGIN= Bruker BioSpin GmbH
$$ ##OWNER= NMR
$$ C:\u/data/dgb/nmr/ADRS/3730/pdata/1/auditp.txt
$$ ##AUDIT TRAIL=  $$ (NUMBER, WHEN, WHO, WHERE, WHAT)
(   1,<2005-06-02 09:28:59.48 +100>,<MAYBRIDGE\NMR>,<NMR_250MHZ>,
      <created by zg, POWCHK disabled, PULCHK disabled
       configuration hash MD5:
       62 19 C7 07 E1 42 D1 B7 37 6C 3D D0 77 39 F9 E6
       data hash MD5: 64K
       2A EE 34 46 39 DF F0 19 A9 EA 40 54 BB 02 CA 6F>)
(   2,<2005-06-02 09:29:10.57 +100>,<MAYBRIDGE\NMR>,<NMR_250MHZ>,
      <Start of raw data processing
       ef LB = 0.3 FT_mod = 6 PKNL = 1 SI = 32K 
       data hash MD5: 32K
       BC C1 13 FE 29 EA 23 E8 8D 70 9D 48 30 5E 8E A4>)
(   3,<2005-06-02 09:29:12.51 +100>,<MAYBRIDGE\NMR>,<NMR_250MHZ>,
      <apk 
       data hash MD5: 32K
       51 AD F7 08 50 70 EF 5D 38 7F E6 49 57 CE 33 ED>)
(   4,<2005-06-02 09:29:13.23 +100>,<MAYBRIDGE\NMR>,<NMR_250MHZ>,
      <abs ABSG = 5 
       data hash MD5: 32K
       43 AA BF 0E 98 37 D7 65 E5 7D 95 CE B9 D4 65 DB>)
$$ ##END=
$$ 
$$ hash MD5
$$ 3C 3E 00 D5 76 D2 65 01 B5 AA 6E 4C B5 3A A7 3B
##$RELAX= 
##$RELAX= 
##$RELAX= 
##$RELAX= 
##$RELAX= 
##$RELAX= 
##$RELAX= 
$$ Bruker specific parameters
$$ --------------------------
##$DU= <C:\u>
##$EXPNO= 3730
##$NAME= <ADRS>
##$PROCNO= 1
##$TYPE= <nmr>
##$USER= <dgb>
##$AMP= (0..31)
100 100 100 100 100 100 100 100 100 100 100 100 100 100 100 100 100 100 
100 100 100 100 100 100 100 100 100 100 100 100 100 100 
##$AQSEQ= 0
##$AQ_mod= 3
##$AUNM= <au_zg>
##$AUTOPOS= <3 >
##$BF1= 250.13
##$BF2= 250.13
##$BF3= 250.13
##$BF4= 250.13
##$BF5= 500.13
##$BF6= 500.13
##$BF7= 500.13
##$BF8= 500.13
##$BYTORDA= 1
##$CFDGTYP= 0
##$CFRGTYP= 5
##$CHEMSTR= <none>
##$CNST= (0..31)
1 1 145 1 1 1 1 1 1 1 1 1 1 1 1 1 1 1 1 1 1 1 1 1 1 1 1 1 1 1 1 1 
##$CPDPRG= <>
##$CPDPRG1= <>
##$CPDPRG2= <>
##$CPDPRG3= <>
##$CPDPRG4= <mlev>
##$CPDPRG5= <mlev>
##$CPDPRG6= <mlev>
##$CPDPRG7= <mlev>
##$CPDPRG8= <mlev>
##$CPDPRGB= <>
##$CPDPRGT= <>
##$D= (0..31)
0 1 0 0 0 0 0 0 0 0.06 0 0 0 0 0 0 0.0002 0 0 0 0 0 0 0 0 0 0 0 0 0 0 
0 
##$DATE= 1117700938
##$DBL= (0..7)
120 120 120 120 120 120 120 120 
##$DBP= (0..7)
150 150 150 150 150 150 150 150 
##$DBP07= 0
##$DBPNAM0= <>
##$DBPNAM1= <>
$$ [...]
##$SUBNAM7= <"">
##$SUBNAM8= <"">
##$SUBNAM9= <"">
##$SW= 20.6930455092707
##$SWIBOX= (0..15)
0 0 3 0 0 0 0 0 0 0 0 0 0 0 0 0 
##$SW_h= 5175.983436853
##$TD= 65536
##$TD0= 1
##$TE= 294.16
##$TE2= 300
##$TE3= 300
##$TEG= 300
##$TL= (0..7)
0 120 120 120 120 120 120 120 
##$TP= (0..7)
150 150 150 150 150 150 150 150 
##$TP07= 0
##$TPNAME0= <>
##$TPNAME1= <>
##$TPNAME2= <>
##$TPNAME3= <>
##$TPNAME4= <>
##$TPNAME5= <>
##$TPNAME6= <>
##$TPNAME7= <>
##$TPOAL= (0..7)
0.5 0.5 0.5 0.5 0.5 0.5 0.5 0.5 
##$TPOFFS= (0..7)
0 0 0 0 0 0 0 0 
##$TUNHIN= 0
##$TUNHOUT= 0
##$TUNXOUT= 0
##$USERA1= <user>
##$USERA2= <user>
##$USERA3= <user>
##$USERA4= <user>
##$USERA5= <user>
##$V9= 5
##$VALIST= <valist>
##$VCLIST= <CCCCCCCCCCCCCCC>
##$VD= 0
##$VDLIST= <DDDDDDDDDDDDDDD>
##$VPLIST= <PPPPPPPPPPPPPPP>
##$VTLIST= <TTTTTTTTTTTTTTT>
##$WBST= 1024
##$WBSW= 4
##$XGAIN= (0..3)
0 0 0 0 
##$XL= 0
##$YL= 0
##$YMAX_a= 448210
##$YMIN_a= -419915
##$ZGOPTNS= <>
##$ZL1= 120
##$ZL2= 120
##$ZL3= 120
##$ZL4= 120
##$ABSF1= 16.522
##$ABSF2= -4.171173
##$ABSG= 5
##$ABSL= 3
##$ALPHA= 0
##$AQORDER= 0
##$ASSFAC= 0
##$ASSFACI= 0
##$ASSFACX= 0
##$ASSWID= 0
##$AUNMP= <proc_1d>
##$AZFE= 0.1
##$AZFW= 0.1
##$BCFW= 0
##$BC_mod= 0
##$BYTORDP= 0
##$COROFFS= 0
##$CY= 12.5
##$DATMOD= 1
##$DC= 0
##$DFILT= <>
##$DTYPP= 0
##$F1P= 14.0000005364418
##$F2P= -0.99999901652339
##$FCOR= 0.5
##$FTSIZE= 32768
##$FT_mod= 6
##$GAMMA= 0
##$GB= 0
##$INTBC= 1
##$INTSCL= 1
##$ISEN= 128
##$LB= 0.3
##$LEV0= 0
##$LPBIN= 0
##$MAXI= 10000
##$MC2= 0
##$MEAN= 0
##$ME_mod= 0
##$MI= 0
##$NCOEF= 0
##$NC_proc= -4
##$NLEV= 6
##$NOISF1= 0
##$NOISF2= 0
##$NSP= 0
##$NTH_PI= 0
##$NZP= 0
##$OFFSET= 16.522
##$PC= 1
##$PHC0= -76.04839
##$PHC1= 11.59438
##$PH_mod= 1
##$PKNL= yes
##$PPARMOD= 0
##$PSCAL= 4
##$PSIGN= 0
##$REVERSE= no
##$SF= 250.13
##$SI= 32768
##$SIGF1= 0
##$SIGF2= 0
##$SINO= 400
##$SIOLD= 32768
##$SREGLST= <1H.CDCl3>
##$SSB= 0
##$STSI= 32768
##$STSR= 0
##$SW_p= 5175.98343685301
##$SYMM= 0
##$S_DEV= 0
##$TDeff= 65536
##$TDoff= 0
##$TI= <Analysis number 999999
Compound Code 99
Book Reference 9
Project Code 9>
##$TILT= no
##$TM1= 0
##$TM2= 0
##$TOPLEV= 0
##$USERP1= <user>
##$USERP2= <user>
##$USERP3= <user>
##$USERP4= <user>
##$USERP5= <user>
##$WDW= 1
##$XDIM= 32768
##$YMAX_p= 515256345
##$YMIN_p= -239589
$$ End of Bruker specific parameters
$$ ---------------------------------
##NTUPLES= NMR SPECTRUM
##VAR_NAME=  FREQUENCY,     SPECTRUM/REAL,   SPECTRUM/IMAG
##SYMBOL=    X,             R,               I
##VAR_TYPE=  INDEPENDENT,   DEPENDENT,       DEPENDENT
##VAR_FORM=  AFFN,          ASDF,            ASDF
##VAR_DIM=   32768,         32768,           32768
##UNITS=     HZ,            ARBITRARY UNITS, ARBITRARY UNITS
##FACTOR=    0.157963299565203, 1,           1
##FIRST=     4132.6476996994, 0,             0
##LAST=      -1043.33573715361, 0,           0
##MIN=       -1043.33573715361, -239589,     0
##MAX=       4132.6476996994, 515256345,     0
$$ Real data points
##PAGE= N=1
##DATA TABLE= (X++(R..R)), XYDATA
$$ [...]
14481a14166k705N1963K8066o0151K5711N7345l927q982j7585K9882J4124m4530
14469d4955L5765N51K2037L4512K3004K368L2376J3202n1199J1330l0658n6732
14457h399k246M1117k8468m3550O1352N6207J1875j9672k2017m4482k0955j8865
14445c8103j214j2961k7001N3754m819m6147l4923J2777j7809K7043O4959k1818
14433d6262n1707k2205M3867M4910k3212K8490M0479l0658J0177l0303O026q665
14421c9063Q104j0099L6465O2280O2234o8156n4743J4282L1353O257k223j9925
14409B6766n4313l9054L6540j4040k9641l1818J8938J0806J8014K0533J8169J8139
14397i61l6127k0691M0022m3437j9492q982M5627l6602k7038O971O810J7632o3809
$$ y = [-114166, -116871, -64908, -36842, -96993, -71282, -13937, -17864, -26846, -44431, -14549, -425, -44955, -9190, -8639, 13398, 47910, 70914, 73282, 105658, 118860, 67661, 78991, 48333, -8399, -10645, 30472, 2004, -41546, 19806, 76013, 87888, 68216, 46199, 1717, -19238, -38103, -39317, -52278, -79279, -25525, -30344, -76491, -111414, -98637, -116446, -89403, -24444, -46262, -97969, -120174, -76307, -31397, -54609, -26119, 14360, -16298, -6121, -36424, -30398, -39063, -30959, -41058, -4593, 57687, 119921, 51765, -2978, 11304, 42657, 48914, 46691, 26766, -27547, -66601, -30061, -44101, -73742, -105560, -86622, -75816, -57802, -37269, -19100, -961, -37088, -57779, -17757, -61194, -80686, -89668, -44041, -80643, -107681, -100710, -93900, -76268, -140077]
14384a40077K2920O0044O0622M490m9395O491J7270o5387p679J9419J2767l4282
14372i2797n4218R0113R1212J0628p4498j6318o196Q464N4857N3655k1002p4213
14360c0313J1645j0156k0409k6283R038j9665k0650Q8377K814L0364l0489o0364
14348g6091L7796J4739k8182L033J9225L7744j6061n1624M864n538l2526N262
14336h7359O7897l4144o1666p070K8776j1156l104l3821M3495R6j2833J231J4491
14323i5167N8920K1106j3994O443m587j3430L3763O2623j164k402J3565J3964
14311G9640j3213M1128m7628p3308m2272m5888j5912K2337N2204K4476P681k273
14299a3028r217k9858k3522m4351N60L8768l984j6375l1097K7857N5450k0317
$$ y = [-140077, -117157, -57113, 3509, 7999, -41396, -34905, -17635, -83022, -90701, -71282, -58515, -92797, -147015, -56902, 34310, 44938, -29560, -45878, -52074, -43610, 11247, 64902, 43900, -30313, -18668, -28824, -49233, -75516, -66478, -86143, -106793, -18416, -15602, 14762, -15727, -76091, -38295, -23556, -51738, -48705, -29480, 8264, -7797, -59421, -54557, -60095, -92621, -87359, -19462, -53606, -115272, -122342, -93566, -104722, -107826, -141647, -98152, -98056, -110889, -109658, -95167, -36247, -15141, -29135, -22692, -27279, -40709, -6946, 55677, 54513, 52111, 65676, 79640, 66427, 107555, 59927, -13381, -55653, -101541, -117453, -95116, -42912, -18436, -10755, -13028, -22245, -52103, -75625, -119976, -119416, -80648, -84632, -101007, -132104, -104247, -48797, -69114]
14287f9114j1915J6567K0006o0665O383L7828O7765K843j3344l1543L8553K2669
14275B6033k5838m4038L8311N3830J972M236N747k7320q3060o2736L1923K3297
14263e7643r341l8533p138K4314L6916k9267j6513J3680o68j4100j7061q186J1832
14250a11708k0322J8351L3562o68K3414k7793k7480M6346Q1526M3473L1549o0273
14238B9977p9881m4911O5868O5522K1277j6178j4389R208L7039L6624m163l8026
14226F7967q2844m713N507N5673M2494L9257l1336K7628M2286K0371P336m93Q8091
14213B77224P4064J2579j3078j25672j12564o3805m6129J0033J3550K6970n3010
14202A62N3023R9553j4273l3766L3432J1407j6819J754m1026n7258l0040q585
$$ y = [-69114, -81029, -64462, -44456, -105121, -98738, -60910, 6855, 9698, -3646, -35189, 3364, 26033, 195, -43843, -5532, 48298, 50270, 54506, 60253, 32933, -50127, -112863, -80940, -57643, -66984, -105517, -112655, -88341, -51425, -80692, -97205, -83525, -84193, -98293, -115354, -123540, -111708, -132030, -113679, -80117, -80785, -57371, -85164, -112644, -66298, 15228, 58701, 90250, 29977, -49904, -94815, -28947, 36575, 57852, 41674, 27285, 36493, 73532, 110156, 105993, 67967, -14877, -19590, -14083, 41590, 84084, 123341, 92005, 119633, 161919, 182290, 189626, 189133, 277224, 351288, 363867, 350789, 225117, 112553, 48748, 2619, 12652, 26202, 53172, 162, 53185, 152738, 138465, 104699, 138131, 149538, 132719, 134473, 93447, 36189, 6149, -2436]
14190b436P6439K659K7414N3807n9508k4222l221l3297K9291j2963M5024L4682
14178A33669M76k6293J5688L1444J09956J20550N2937M1919J40115J88276J71672
14167I80409J05822L7293j24848j82555k22823j56535j36208n8619J3059q7869
14157A67126o5164L4708j4866q0499k3675P6507K8343o8279p5540k4287J1334
14146c4292O1315L4270K5574K7754j8820n253K0759J8252l7352k9682r882L9960
14134I2603j3781k9751J2791O1533M7468M6906M3444J10715J21287J57689J70223
14123H21127K29411K42638L3431j42065k15186k03932j68098j45385q1074p6122
14113B94745r141L4n4479k7251N604k1375k6864m2073k4716q8558n3478L7285
$$ y = [-2436, 74003, 76662, 104076, 157883, 98375, 74153, 70932, 37635, 66926, 53963, 98987, 133669, 134145, 107852, 123540, 154984, 264940, 385490, 438427, 480346, 620461, 808737, 980409, 1086231, 1123524, 998676, 816121, 593298, 436763, 300555, 241936, 254995, 167126, 101962, 136670, 121804, 41305, 17630, 94137, 122480, 54201, -21339, -45626, -34292, 27023, 61293, 86867, 114621, 95801, 90548, 111307, 129559, 92207, 62525, 52643, 92603, 78822, 49071, 61862, 123395, 170863, 217769, 261213, 371928, 493215, 650904, 821127, 1050538, 1293176, 1326607, 1184542, 969356, 765424, 597326, 451941, 370867, 294745, 285604, 285638, 231159, 203908, 209512, 188137, 161273, 119200, 94484, 5926, -47552, -10267]
14101a0267R0755O6041o6296p1465Q7218P3305j9698M2375m3375k8150l4979j9963
14089F5501N5685N9024K0993k6254j8246o39k384J3390L3329k6214k1487P1415
14077B24113J30963K9785m4344j6107q1326p3175M4765m8056n8231j9006K9550
14066A18931J0798n0086k7469L2918J2368J7792q797l9700k3422p1616j3048m250
14054d5581J7950j0368l3010R275J055R3005L3469L484L9389k198n2248J1591
14042F5813r2679L0456O5751k1985k3410K769L3611r982L700P650k788Q0400k5976
14029A13330n6066n6414j6753N504k2787O761L5324K1440o2898M235N0526K7438
14017D9640j8969n0719p458M7235k8079m8604l0789l0299N0464N5597M6314L28
$$ y = [-10267, 80488, 146529, 80233, 8768, 95986, 169291, 149593, 191968, 148593, 120443, 85464, 65501, 121186, 180210, 201203, 174949, 156703, 156064, 153680, 167070, 200399, 174185, 152698, 224113, 355076, 384861, 340517, 324410, 243084, 169909, 214674, 166618, 108387, 89381, 118931, 129729, 79643, 52174, 85092, 97460, 115252, 106455, 66755, 43333, -28283, -41331, -45581, -27631, -37999, -71009, -61734, -60679, 32326, 65795, 69279, 108668, 106470, 54222, 65813, -26866, 3590, 69341, 47356, 23946, 26715, 60326, 50344, 54044, 61694, 58906, 139306, 113330, 57264, 850, -15903, -10399, -33186, -26425, 8899, 30339, -32559, -28324, 22202, 49640, 30671, -20048, -27506, 19729, -8350, -56954, -87743, -118042, -67578, -11981, 34333, 34661]
14005C4661j40M2184J4080L2591k2200l7463p976K2322K2695J4452j0647p7760
13993B6799J8908P3529K9057L1898j836q1902o2662J4646j6895m4500l0647j0519
13981e4124J1218O2751K5811k2198J8985k6194k7271K678J823n5342J3674J15772
13969F7583k7270n5754M9050M1836k4394K0014J8940j3957L6072K8052J04J05059
13957B45335J1703j2587l1556Q610k6975j2832K8775n6283l5727K9953P940J3356
13945A69712N0807O9418o1003j10827o3947n8409l5171l9551K8455r317q4222
13934a44055M8745R4135N2848j5630M0810j6447J9888q300m7762r679K1066P753
13922D3372M9658o487J8080o8381j0478Q4879j9267p925N5427K9788M5713K4465
$$ y = [34661, 34521, 76705, 90785, 123376, 101176, 63713, 55737, 78059, 100754, 115206, 104559, 26799, 45707, 119236, 148293, 180191, 178355, 96453, 33791, 48437, 31542, -12958, -43605, -54124, -42906, 19845, 45656, 23458, 42443, 16249, -11022, -8344, -6521, -61863, -48189, 67583, 40313, -15441, 33609, 75445, 51051, 71065, 90005, 76048, 112120, 140172, 140276, 245335, 257038, 244451, 212895, 221505, 194530, 181698, 210473, 154190, 118463, 148416, 156356, 169712, 220519, 289937, 228934, 118107, 54160, -4249, -39420, -78971, -50516, -59833, -144055, -95310, -1175, 51673, 36043, 76853, 60406, 80294, 71994, 24232, 14553, 35619, 43372, 93030, 86543, 104623, 36242, 25764, 110643, 91376, 83451, 138878, 168666, 214379, 238844]
13910B38844K7847l0282R426L6706l1509q7531p25R456o870L210m1149o207O4559
13897A85775m0892m4409j6146l2787l5380l4445k3341M7951n942j242L3067o1599
13885b9390K9592O0528Q6347K1863j9192o4196j5410J552o1033l5629l7235l1836
13873i4039k930L5484J6130K4317O084L3860j9307j3257j4037L5806O4130n481
13861F6760J8299n8816l7048Q943O5672J5225l4453K4691O5646L1492j4513P801
13849A59699l6248j1798L6942P760n0843k2602J2722k654j3155m6443K5773Q1979
13837A41132P587J202J0208N5784q119n5487q2097l8082k0665k3538M5244N1827
13825H4996K941N8112n036o0739j9180J9660Q497m554q628O1823J4508j4139M064
$$ y = [238844, 266691, 236409, 245835, 282541, 251032, 163501, 162776, 172232, 165362, 168572, 127423, 121216, 185775, 144883, 100474, 84328, 51541, 16161, -18284, -41625, 6326, 384, -858, 32209, -29390, 202, 60730, 147077, 168940, 149748, 85552, 70142, 71694, 10661, -24968, -62203, -94039, -96969, -61485, -45355, -21038, -14954, 18906, -401, -13658, -27695, 8111, 72241, 66760, 85059, 26243, -10805, -1862, 63810, 79035, 44582, 69273, 134919, 166411, 151898, 159699, 123451, 111653, 148595, 156355, 105512, 82910, 95632, 92978, 79823, 33380, 59153, 141132, 148719, 149921, 160129, 215913, 207794, 152307, 70210, 32128, 11463, -12075, 33169, 84996, 87937, 146049, 141013, 80274, 61094, 80754, 89251, 84697, 76069, 137892, 152400, 138261, 142325]
13812A42325L0365k7777N83K6284N0453O971N7791J5240m4960K6291l7393m9000
13800A97173L0114L4438N1037M4994k145K0221N6026K7772J00289M0271j7533
13789E82657q4895m2767k9926O246M073R111l9570K4432N3741M4023R5422O8248
13777F90795K8950M6898Q5366P864K5605L7593Q0993N2445J04180O8622J40880
13766A370191J14603J64413J30421J78008K96154L14499L82881M82072O80065
13757D113307Q80467J127650J527089J994669K600391L515075M835216O575658
13749B7169522R080332J2521122J4794306J0783717r3253j0202313j3873562j2246869
13741C7933002q985243o222814m253445k969648k072456j452398j149786r96045
$$ y = [142325, 172690, 144913, 145496, 171780, 222233, 229204, 286995, 302235, 257275, 283566, 246173, 197173, 227287, 261725, 312762, 357756, 355611, 375832, 431858, 459630, 559919, 600190, 582657, 497762, 454995, 425069, 431315, 435388, 444499, 404929, 429361, 483102, 527125, 622547, 690795, 719745, 766643, 852009, 859873, 885478, 923071, 1004064, 1056509, 1160689, 1229311, 1370191, 1484794, 1649207, 1779628, 1957636, 2253790, 2568289, 2951170, 3433242, 4113307, 4993774, 6121424, 7648513, 9643182, 12243573, 15758648, 20593864, 27169522, 36249854, 48770976, 63565282, 74348999, 74255746, 64053433, 50179871, 37933002, 28947759, 22724945, 18471500, 15501852, 13429396, 11976998, 10827212, 9831167]
13733I831167p92566o09339m22811l12665k77417l01607k49434j26951M0O1158
13723F799575J18971K09507K93338L13674M11580M66285N86917Q18173J020106
13714A1038126J357877J819557K531628L361181M269171N384988P256683R857155
13706D6876366J3495263J8466547K5532245L5921505M6404693M2040052J0357134
13699B39093805k8415948m5963285m2411490l1082333k0975628j4037537r618436
13692D6589148o788100m889896l826912l247224k738272k145698j651690j220760
13684B0080596r53904r40246r27257p81346n67219l51919k22928j30463m6384
13675A5158930J08160J66907K67401M52438O91798R48909J291943J753504K452017
$$ y = [9831167, 9038601, 8429262, 8006451, 7693786, 7416369, 7114762, 6865328, 6738377, 6738417, 6799575, 6918546, 7128053, 7421391, 7735065, 8146645, 8612930, 9199847, 10018020, 11038126, 12396003, 14215560, 16747188, 20108369, 24377540, 29762528, 37019211, 46876366, 60371629, 78838176, 104370421, 140291926, 186696619, 228736671, 239093805, 210677857, 164714572, 122303082, 91220749, 70245121, 56207584, 46589148, 39801048, 34911152, 31084240, 27837016, 25098744, 22953046, 21301356, 20080596, 19126692, 18186446, 17259189, 16477843, 15910624, 15558705, 15335777, 15205314, 15158930, 15267090, 15433997, 15701398, 16153836, 16845634, 17794543, 19086486, 20839990, 23292007]
13666B3292007L315973M204064N156782O607737Q964085J2554397J7317691K3809964
13658A05222700L3496066M5018817M5811072J9367191k1836390m5766497m5749433
13651A35563526l4722608k3657638j5806935j0708782p492107n422108m310374
13644C3442974l543393k957226k494747j888060j432231j277688j218199j078841
13636A7552589r81758q09010o22989m63170l16592l02542k36654j46113j80777
13627A3492984k6612R3360K47511M47217M83160P30269J058334J397006J652685
13618A9575914K003745K656863L672258N086450P179627J0177922J3729272J4553115
13610G8635166P642415m759408j3669113j5285375j2377994q817366o084195m091561
$$ y = [23292007, 26607980, 30812044, 35968826, 42576563, 51540648, 64095045, 81412736, 105222700, 138718766, 183737583, 229548655, 248915846, 227079456, 181312959, 135563526, 100840918, 77183280, 61376345, 50667563, 43175456, 37753348, 33442974, 29899581, 26942355, 24447608, 22559548, 21127317, 19849629, 18631430, 17552589, 16570831, 15761821, 15138832, 14675662, 14359070, 14056528, 13819874, 13673761, 13492984, 13466372, 13559732, 13807243, 14254460, 14737620, 15467889, 16526223, 17923229, 19575914, 21579659, 24236522, 27908780, 32995230, 40174857, 50352779, 64082051, 78635166, 86277581, 81518173, 67849060, 52563685, 40185691, 31368325, 25284130, 21192569]
13602B1192569k890661k078922j674763j413208j270121j064111p99740p07978
13594I293065n75949m38446m61994m04434l88118l22318l06049k67781k02379
13585E925597j21637n2456n8858r7036l0699l5165k1786k1222O110K4574l7965
13574E479457j50515k28273k38836k47379k80599l11602k05094j51767j44333
13565C521059j97556j82876j13560j77345j24599p0367j50432n3127j05175j31889
13555B214133j26484n5973o5955o7805j31949r6453n3147o1870K6579Q277l7263
13544A552090K2759k1337J1625O1887J10548J24625J34563J49122J66613J14780
13534B427275O5995l4449r9720q9599j15880j79447j93892j10875j50778j27078
$$ y = [21192569, 18301908, 16222986, 14548223, 13135015, 11864894, 10800783, 10001043, 9293065, 8717116, 8278670, 7816676, 7412242, 7024124, 6701806, 6395757, 6127976, 5925597, 5803960, 5751504, 5692646, 5595610, 5564911, 5529746, 5507960, 5486738, 5492848, 5517422, 5479457, 5328942, 5100669, 4861833, 4614454, 4333855, 4022253, 3817159, 3665392, 3521059, 3323503, 3140627, 3027067, 2849722, 2725123, 2654756, 2504324, 2451197, 2346022, 2214133, 2087649, 2031676, 1965721, 1897916, 1765967, 1669514, 1616367, 1554497, 1581076, 1589353, 1552090, 1574849, 1553512, 1565137, 1627024, 1737572, 1862197, 1996760, 2145882, 2312495, 2427275, 2493270, 2458821, 2359101, 2269502, 2153622, 1974175, 1780283, 1669408, 1518630, 1391552]
13524A391552l1725r6388m6390n5315j01285q4125k3428J0930k2689n2756m5964
13513H42417M1048J0620p931K8609m2954m1265l030L3375M4803j7074j8351L5956
13501I06223O4226J21497J3939J4693Q5780Q551M917J16771J55940R3336J12795
13490A698668J43979M7429j2413o9593j07454j54542j92489j15475q4290r5437
13480A058383o5063n2851l6944j6003l6681k7928k5872j23952o0698N4274N4931
13469G21596J1407O882k1033J3812N0126Q743K8353K0085j4390l1814K5583L1542
13457H50892K3535Q0450J00044J48816J51137N0099n9585j14345p0542j0366l2108
13446A118027o757L7645K6364m494j748l2312q0668l9917q7495o0271l2181l0645
$$ y = [1391552, 1359827, 1263439, 1217049, 1161734, 1060449, 976324, 952896, 963826, 941137, 888381, 842417, 883465, 894085, 886154, 914763, 871809, 830544, 827514, 860889, 905692, 888618, 870267, 906223, 970449, 1091946, 1105885, 1120578, 1206358, 1214909, 1219826, 1336597, 1492537, 1585873, 1698668, 1842647, 1890076, 1877663, 1808070, 1700616, 1546074, 1353585, 1238110, 1153820, 1058383, 993320, 940469, 903525, 887522, 850841, 822913, 797041, 673089, 612391, 666665, 721596, 733003, 739885, 718852, 732664, 782790, 791533, 819886, 839971, 825581, 793767, 819350, 850892, 874427, 954877, 1054921, 1203737, 1354874, 1404973, 1345388, 1231043, 1160501, 1150135, 1118027, 1111270, 1148915, 1175279, 1170785, 1169037, 1136725, 1056057, 1016140, 928645, 868374, 836193, 805548]
13434H05548m1139l6078J1033j2183p6149l246O3850K8865k8738p90l7864j13118
13422E59991j8687J7858QP8023L1117m8549L7080l3383l6022J7219M8139J05891
13410G58685J59795J66118Q3020m5432j09369p1004r6408o1851k8207p0119l3140
13399F52088m4703k202O535q550J6586l4725j9844O998k5499l5159J998K372j8635
13386D97260k651k4588q1177N7572P539k3200k5366k5154P506J6665J0424M5365
13374D60195J968L7708J6988j6113m2817k0982j6000N3709R2455J12249M5882
13363G25242o905k4637k1217n9016n1744p1264j6451m1255l0302K0281J8020J4168
13351D54920p3001n7261M2528L2297O1913P2735l5812j25704k9381J0996l5592
$$ y = [805548, 764409, 728331, 739364, 727181, 651032, 647786, 711636, 740501, 711763, 710973, 673109, 559991, 541304, 559162, 559170, 637193, 668310, 619761, 656841, 623458, 587436, 604655, 652794, 758685, 918480, 1084598, 1167618, 1122186, 1012817, 941813, 845405, 783554, 755347, 685228, 652088, 607385, 605183, 611718, 603168, 619754, 585029, 565185, 572183, 546684, 511525, 513523, 515895, 497260, 494609, 470021, 388844, 446416, 453955, 430755, 405389, 380235, 387741, 404406, 414830, 460195, 462163, 499871, 516859, 500746, 457929, 436947, 420947, 474656, 567111, 679360, 725242, 718337, 693700, 672483, 613467, 561723, 490459, 474008, 432753, 402451, 422732, 440752, 454920, 381919, 324658, 367186, 399483, 461396, 534131, 498319, 372615, 343234, 354230, 318638]
13340C18638J8939j1544o9698p3662n333O3151N9591O1637L2281j0094p20M969
13328C88155O6438J00880J08797q562o8k9213K4931J228K8586J18165Q7345M8012
13316I34694J7117j27287j51954p0918o1548l7847m4196j0923n9958m004j6662
13305C66514m082L5860k9107j9890j4583M215m8010j8974M095M9269L7636K1002
13293C83945o526J3008P70p3551n3610J7829Q6000R1304N5132p744R6294J44854
13281G47705K13672J92238Q126r8656j35515m1959O695N0143J14429R7406O1782
13270A216066r021j74032j94504j42045l5545n2174j04716m3640k5332J2998M050
13259D52105l5905j0102K2008n6535n203k2629j4132j1816J21J1313K8757j4825
$$ y = [318638, 337577, 326033, 256335, 182673, 177340, 240491, 300082, 361719, 394000, 383906, 383186, 388155, 454593, 555473, 664270, 655708, 655640, 626427, 651358, 652586, 681172, 799337, 886682, 934694, 951811, 824524, 672570, 601652, 540104, 502257, 458061, 447138, 387180, 383176, 366514, 362432, 398292, 369185, 349295, 334712, 338927, 290917, 271943, 276038, 325307, 362943, 383945, 377419, 390427, 391197, 317646, 264036, 281865, 367865, 459169, 514301, 506557, 602851, 747705, 961377, 1153615, 1161741, 1063085, 927570, 885611, 892306, 942449, 1056878, 1154284, 1216066, 1207045, 1033013, 838509, 696464, 660919, 608745, 504029, 460389, 435057, 448055, 452105, 416200, 406098, 428106, 371571, 366368, 343739, 329607, 317791, 317912, 329225, 357982, 343157]
13247C43157l8807m5033M1438N5378o31J0083N0274L3628P8961J03204O4180J79932
13235H75764K03075J7233m823j00682j3118J06945J41767J84392K05811J23316
13225A739680l0956k17017l05091k78615j53813j12203n1476n2335n7977l0230
13215D49967k3806q1657l7015j2727J9037m821m624M2032k228L4061J5107l0794
13203C62532N4010p08l7540l3476k3616m6o395L7724M2784J5496Q2253O0521L1308
13190E84847O4835M6845K4423Q31J0826Q9940J01120J71433K39536K29726M0081
13179A604443j12374k95644k72381j46392r8365j01174m2398j9894k7770o570
13169D81481L327q957J0222l2505q7422q4806n610j0777O2964K0680m9251k7458
$$ y = [343157, 304350, 259317, 300755, 356133, 355502, 365585, 415859, 449487, 528448, 631652, 695832, 875764, 1078839, 1096072, 1091249, 990567, 977449, 1084394, 1226161, 1410553, 1616364, 1739680, 1708724, 1491707, 1186616, 908001, 754188, 641985, 590509, 538174, 480197, 449967, 426161, 344504, 307489, 294762, 313799, 308978, 304354, 346386, 344158, 378219, 393326, 362532, 416542, 415834, 378294, 344818, 321202, 321156, 314761, 352485, 395269, 410765, 493018, 553539, 584847, 649682, 696527, 720950, 721781, 732607, 822547, 923667, 1095100, 1334636, 1564362, 1604443, 1492069, 1196425, 924044, 777652, 679287, 578113, 535715, 515821, 488051, 481481, 484808, 475851, 486073, 453568, 366146, 281340, 275730, 264953, 327917, 348597, 299346, 271888]
13157B71888Q790k0398J6084Q696l6636r079Q9014l344m7875p639J5187l4575
13145B50113K6702O3886K6917k3994p321K4834L8684Q7152L9337R0197M2830r108
13133F50229o2076j08526m6453p2015p5442L648M3062N6989j7375k1003j3940
13122C37098j5067k1933o5394j6670M8332L7551k6559l2773m3811L2309L5214
13111B68297K7724M923m8183J8266K6801j5322j8291M4045k9374R166J7125l2980
13099B72197l8470Q336K6161O6383P868j08608p2453j129N0310K0796m604k3713
13087B03074o3413J8713M5362n544o8723m339M6480O479r904k9272m6325P182
13075I9770R212k1278L6740K0777J2247J6671M3611L5395o6388p1895L1124n237
$$ y = [271888, 280678, 260280, 276364, 285060, 248424, 239345, 328359, 325015, 277140, 269501, 284688, 250113, 276815, 340701, 367618, 343624, 336303, 361137, 399821, 486973, 526310, 616507, 659337, 650229, 588153, 479627, 433174, 361159, 285717, 289365, 332427, 389416, 372041, 351038, 337098, 322031, 300098, 234704, 218034, 266366, 303917, 277358, 244585, 200774, 233083, 268297, 296021, 300944, 252761, 271027, 297828, 282506, 264215, 308260, 278886, 288052, 305177, 272197, 233727, 242063, 268224, 334607, 342475, 233867, 161414, 160285, 210595, 231391, 226787, 203074, 139661, 158374, 203736, 198192, 129469, 125130, 171610, 178089, 168185, 138913, 92588, 99770, 108982, 87704, 124444, 145221, 157468, 174139, 217750, 253145, 186757, 114862, 145986, 140749]
13063A40749n2938k7641P1261N0107J1996j9324j485j3300J4572K2512L5862O774
13051B39145m1267p2968l7248R2462K0702j5644l1131l5588j1580K0765J6138
13040A43786J4361l3986L6167m1750l5521K3482N133l9925l3714L0259j1592o943
13028D9757Q410J8251M3563K9601j6604j6356l4402L3447N0836N8326r839l2428
13016A82562l3764L0819J5342J8290R838L2400M6934l3500l5769P854n0348l8059
13004A52599M8082J5202J207K5470L6644J29463L7025O0144J06478J52390O9391
12993H34095j6629j08877q5810j26776n4672m4860q8422n4271l1797n0587n3431
12982A17963N040K2366J7628K6719K2804j21p3910j5263L3717j3016l7248r992
$$ y = [140749, 87811, 60170, 131431, 181538, 193534, 174210, 172725, 159425, 173997, 196509, 232371, 239145, 197878, 124910, 87662, 180124, 200826, 185182, 154051, 118463, 106883, 127648, 143786, 158147, 124161, 160328, 118578, 83057, 106539, 111672, 71747, 38033, 68292, 56700, 49757, 58167, 76418, 119981, 149582, 132978, 116622, 82220, 115667, 166503, 224829, 214990, 182562, 148798, 179617, 194959, 213249, 223087, 255487, 302421, 268921, 233152, 241006, 190658, 152599, 200681, 215883, 217090, 242560, 279204, 408667, 445692, 505836, 612314, 764704, 834095, 817466, 708589, 622779, 496003, 441331, 396471, 308049, 253778, 221981, 171394, 117963, 123003, 145369, 162997, 189716, 212520, 212399, 138489, 123226, 156943, 143927, 106679, 96687]
12970I6687N1376J772K0507j9665r0952p881M8646K3182k5298J4733N1398L6231
12958B00736r501o3019o0018K191Q879k3963N9967M6105j10504k7817M354K6255
12946E3665N0068J02636O479Q8907J54954J47128p351p2296n7121m5827m4731
12935C76511j02374r7480m9156k270j796m5231j4497j0855M858k9941m7459K7721
12923H031O133Q776j933J0066L9250N1005k8020j73J4951l5559K3188m5995J9507
12910F9227M840o6143l3593L5259M1756J6775j4390l7436k80N0951N9067J0084
12898A36117j6705k0632l6384K0273k4805M5424K4415K1891Q0850P5292O1177
12887C66913l1976Q2212J30365Q1433k7767o3103j07629j27793k3964j7375J5094
$$ y = [96687, 148063, 149835, 170342, 150677, 59725, 51844, 100490, 123672, 98374, 113107, 164505, 200736, 191235, 128216, 68198, 70389, 79268, 55305, 115272, 161377, 50873, 23056, 27410, 53665, 103733, 206369, 212848, 301755, 456709, 603837, 596486, 524190, 467069, 421242, 376511, 274137, 176657, 127501, 125231, 123435, 78204, 63707, 52852, 57710, 27769, -19690, 8031, 14164, 22940, 21007, 31073, 70323, 121328, 93308, 93135, 108086, 72527, 95715, 49720, 69227, 74067, 7924, -25669, 9590, 51346, 68121, 53731, 16295, 16015, 66966, 126033, 136117, 119412, 98780, 62396, 82669, 57864, 103288, 127703, 149594, 230444, 305736, 366913, 334937, 417149, 547514, 628947, 601180, 538077, 430448, 302655, 278691, 261316, 276410]
12876B76410l3050q1490j9549k8003K6463k0785k507r415K5466J0836m3978k7537
12864G2861J8609m2044J3572L2699R912m1463k4579k1574n3874j0203L6964J8104
12852H984P677K4788K7286K8173k6736j03793N148P6803K2021k8195j9943J4040
12840C6253j5399q691R993Q2565k2598O569N85j5734K3827P105L8561k0069n7821
12827F5146l7319j6034j3587N6024J9631K2586K7057o4600j7119j7970r533l1069
12815a6787m3884M916L5213N650J9661l621L0209J3770n93J7918Q889k6080M2351
12802H7612j1776o895n9951j9856n7082j5022P3870J8368m1742m373K0276O3112
12790D6541M4341J2372l3851l5419L2207J1488J2756m142q509o5480k7050M8446
$$ y = [276410, 243360, 161870, 142321, 114318, 140781, 119996, 117489, 108074, 133540, 144376, 100398, 72861, 91470, 49426, 62998, 95697, 105609, 64146, 39567, 17993, -35881, -46084, -9120, 8984, 16661, 41449, 68735, 96908, 70172, -33621, -28473, 48330, 70351, 42156, 22213, 36253, 20854, 12163, 22156, 104721, 82123, 88692, 89277, 73543, 97370, 104475, 143036, 122967, 65146, 27827, 11793, -1794, 54230, 73861, 96447, 123504, 58904, 41785, 23815, 14282, -16787, -60671, -55755, -20542, -14892, 4769, 1148, 31357, 45127, 44534, 62452, 71341, 45261, 87612, 75836, 68941, 8990, -10866, -67948, -82970, -9100, 9268, -32474, -36847, -16571, 46541, 90882, 103254, 69403, 33984, 66191, 77679, 90435, 86293, 77784, 12304, -14746, 33700]
12778C3700J26382M2704j05615q1427K4123n329L48L4105r805n813O487j7094
12766D2766M2949K4135J0116k1026k7406N6725l4672n5552p2762M293M0829K4815
12754C5210l6717K7023L9959J2651k4939l3670O238P563k0047k5704J3989J4985
12742A6541j332p257K7682J1153J1378K5725O11o3256j1825J9217P43m5700K9126
12729A2806J6276k2936k7240m7388Q695M1527j1965j6756N564L1093M8550j2781
12717B5445N0205L1286O971K6398M1008k8606o5493m0987k2113L6834n9686j6717
12705a5455N6656J1600o0248O151M192j322J4824N3066O0121l3685l7720j8437
12693C9743l9488j4589J6907K2148j7036J7442J4593m6792L8960J73j7128J1636
$$ y = [33700, 160082, 202786, 97171, 15744, 39867, 34538, 34886, 68991, 59186, 53373, 59860, 42766, 85715, 109850, 119966, 98940, 71534, 128259, 93587, 38035, -34727, -30434, 10395, 35210, -1507, 25516, 65475, 78126, 53187, 19517, 25755, 33318, 13271, -12433, 1556, 16541, 15209, 7952, 35634, 46787, 58165, 83890, 84501, 21245, 9420, 28637, 29380, -16320, 12806, 29082, 6146, -21094, -68482, -59787, -18260, -30225, -46981, -41417, -10324, 38226, 25445, 75650, 106936, 113907, 140305, 181313, 152707, 87214, 46227, 24114, 60948, 1262, -15455, 41201, 52801, -7447, -1296, 2896, 1574, 16398, 69464, 129585, 95900, 58180, 39743, 255, -14334, 2573, 24721, 7685, 25127, 39720, -7072, 31888, 32061, 14933, 26569]
12681B6569k4608J1886r698k459J854k4161J3777p075m0642O4614K8297j1488
12669B6866m678J5753Q499k5818j5141j3801n511K211K9083K896m2837L58O819
12656a5301o331M0144M2587K7784k9408q798k632m0899l3637K7389N4235J9563
12644G4696L9047J0450m9567l15K363l8267J6839j1019j19N1320M0479o622o9754
12631E9531n3260J7295K532J3698K4242l4034j3440K9261J9773L6027m5201m0131
12619A6293K469J1858l1547J3154K747n5134N130N6415L3045k3221o594K2865
12607D7480l1752L873P422o0218j7009j994N4312o49j9920M358L1487L3944j2284
12594C9050j3815M2292o514r881k3277L1896M8334p968k7367k4939p9227o7616
$$ y = [26569, 1961, 13847, 4149, 1690, 3544, -20617, -6840, -13915, -54557, 10057, 38354, 26866, 22188, 37941, 46440, 20622, 5481, -8320, -13831, -11620, 17463, 20359, -22478, -22120, -15301, -21632, 18512, 61099, 88883, 59475, 50677, 48045, 7146, -26491, 898, 55133, 74696, 113743, 124193, 74626, 74311, 76674, 38407, 55246, 44227, 44108, 95428, 135907, 129285, 59531, 6271, 23566, 26098, 39796, 64038, 30004, 16564, 45825, 65598, 101625, 56424, 16293, 18762, 30620, -927, 12227, 14974, -40160, -35030, 21385, 54430, 31209, 24615, 47480, 15728, 19601, 27023, -33195, -50204, -52198, 2114, 1465, -18455, -14097, 17390, 51334, 39050, 25235, 67527, 61013, 51132, 27855, 59751, 108085, 100117, 72750, 47811, -31416, -99032]
12582i9032j0859Q0788O599l0166L2750k0227j7528O8179L6046J5346N4164Q603
12570A24663n0536n9587M240K5353l8945K7482l0234J3285L643k5833L0432P7254
12558A01217n998J6515j8819l758L7334k5727k2657n8257K5230P0793P45j4451
12546A02167m8514o0708l6363j0738n565J9941J6777L8115J4670L4362N30l7823
12534B6851J6351J17902N3842n6478o7418n864k6666N291O0888L9866n7790j0342
12522I6433m5129Q325o253k7794L2291j1245q298n4097q4307K056O0549P1983
12510C4514r281l1366l4690K6338L2032N3181L3033k0987K681J9966o870m5333
12498E3218J3948K8360m0435n5081J8170N3767M6398P963j3403q1272k2669k946
$$ y = [-99032, -109891, -29103, -22504, -52670, -19920, -40147, -57675, 10504, 46550, 61896, 116060, 124663, 74127, 14540, 18780, 44133, 5188, 32670, 2436, 15721, 19364, -6469, 23963, 101217, 95219, 111734, 92915, 89157, 126491, 100764, 78107, 19850, 45080, 115873, 116618, 102167, 53653, -7055, -43418, -54156, -59721, -39780, -23003, 15112, 29782, 64144, 64674, 26851, 43202, 161104, 214946, 158468, 91050, 85186, 58520, 63811, 124699, 164565, 106775, 96433, 51304, 59629, 53376, 25582, 57873, 46628, 38330, -15767, -100074, -98018, -37469, 34514, 25233, -6133, -40823, -14485, 17547, 70728, 103761, 82774, 85455, 105421, 98551, 53218, 67166, 95526, 55091, 10, 18180, 71947, 118345, 126308, 112905, 31633, 8964, 6018]
12486F018j2797l2828N685M9145j9816K1410P8347M2867J3589o5978n9384J6876
12474D3134L7978k5332p5083j993K2280L0602K4826j3114q457n411m5102o912
12462b2584M202q914m8327p2613J7330k6348J5011O7582Q4109j126n164J3511
12450A6669O9590K6452l4694k2756k4006K0204L9569l6075n6845m8830J588K0292
12438b8842J4118M2023k4622j4892M936L6140L4401L9940j5628m4755N0631P650
12426A01100M769O061l4606K2030m5188l9607K1858k9077L80J884n0774L8384
12414b786P2924P971j5231K1601m8861l3798m7178j8390k1738K1740L1949K5028
12402f769Q6239P763k3661n2652l4180l3356k1998Q9372O5219j4762l0923k4280
$$ y = [6018, -6779, -39607, -33922, 15223, -4593, 16817, 95164, 138031, 151620, 85642, 26258, 43134, 81112, 55780, -19303, -21296, 984, 31586, 56412, 43298, 34841, 29430, -15672, -22584, -18382, -27296, -75623, -148236, -130906, -157254, -142243, -74661, 9448, 8322, 3158, 16669, 86259, 112711, 78017, 55261, 31255, 51459, 91028, 54953, -1892, -50722, -49134, -28842, -14724, 27299, 2677, -12215, -7279, 28861, 63262, 103202, 87574, 42819, 93450, 101100, 105869, 111930, 77324, 99354, 54166, 14559, 36417, 7340, 7720, 9604, -41170, -2786, 70138, 78109, 62878, 84479, 35618, 1820, -45358, -63748, -85486, -63746, -31797, -6769, 79470, 87233, 63572, 10920, -23260, -56616, -78614, 10758, 75977, 61215, 30292, 6012]
12390F012M9207N37J7059o0026j24469n1724L7550N7071J5291p671k3458R0207
12378E586K7080n111J6091n380l8450r486m1132p066j8961p658K5464m58m4690
12365a04171N7495N9675l9633J6642o268K0374k973l7601L3863J6696m5894n6735
12353h8530J3903M7197J1212J2846M3656o111o7438k2220K7081L2326j2646j2927
12341b1651N228L4506Q4806M3997J3913p5968p7223l9120k8780l6443K4172N4577
12329a7986M1962n575m9261n0197K9239N5519K4362M8461L4195L976O963q393
12317A13265l6694l6402J4924l0655l3676j3086J8755L2750J3481O529q433K9639
12305G0397m2808n8967k2622m223k1717m0144n554K8340k419l7557l8237J8919
$$ y = [6012, 55219, 55756, 72815, 12789, -111680, -163404, -125854, -68783, -53492, -61163, -84621, 5586, 32666, 27555, 43646, 38266, -184, -9670, -50802, -57868, -76829, -84487, -59023, -59481, -104171, -46676, 12999, -26634, -9992, -16260, 4114, 1141, -36460, -2597, 14099, -31795, -88530, -74627, -27430, -16218, -3372, 40284, 34173, -33265, -55485, -28404, 3922, -8724, -21651, -16423, 18083, 102889, 146886, 160799, 84831, 7608, -31512, -60292, -96735, -72563, -17986, 23976, 18401, -30860, -81057, -51818, 3701, 28063, 76524, 110719, 114695, 121658, 113265, 76571, 40169, 55093, 24438, -9238, -22324, -3569, 29181, 42662, 49191, 40758, 70397, 27589, -31378, -54000, -58223, -79940, -120084, -125638, -97298, -99717, -137274, -175511, -156592]
12293a56592Q0813L5433J6525N9735n1680K5278J4241J0898m439r8870j8591O4201
12281b3048P730j3066R485l2199l151R6714K8374l896n3209m7659L418r273M7392
12268G612O4641j1350k1779R204K1481m9501m0472j040M1316j9226K787K8467
12256C2140P1617l8114l0663k6387L4715K5359m7575m9965q699O1802N4473k8073
12244E0630j2781n4820n3968m9834K1193P3621L0512j7902l1569l46J0271o22
12232c5615O9076O8499J2262m3081l3839m9178k0563n077M8136j9587o1380k2717
12220i3064j9082L0287O960K5417l378j1847K5202K0218p809K8095k3173m3748
12208f5922m4688J6463J4393l7450M2958J20967M9318j9060J9158k4826n4876
$$ y = [-156592, -75779, -40346, -23821, 35914, -15766, 9512, 23753, 34651, 30212, -68658, -87249, -23048, -15318, -28384, -18899, -51098, -54249, 42465, 70839, 66943, 13734, -33925, -30507, -39780, 7612, 72253, 60903, 39124, 48328, 69809, 20308, -20164, -21204, 20112, 886, 3673, 32140, 103757, 65643, 34980, 8593, 43308, 68667, 21092, -28873, -37572, 24230, 78703, 50630, 37849, -16971, -70939, -120773, -99580, -25959, 4553, -13349, -44918, -45264, -34993, -35615, 33461, 101960, 114222, 71141, 37302, -11876, -32439, -37516, 10620, -8967, -70347, -93064, -112146, -81859, -74899, -49482, -52860, -64707, -39505, -19287, -27096, 999, -22174, -65922, -110610, -94147, -79754, -117204, -74246, 46721, 96039, 76979, 96137, 71311, 16435]
12197A6435m0047k0090L4046J7880j2108m1780k7615P7722j8940N3673J534L1413
12185G2123K5615K172L918r602p5645L403k9834m5118j3554M3249K7379j5262
12173a1156M9270L9108L5374m2138q0158r1859o751R3107K8226j7999K2332l8927
12161b1571O021o07m1108J3494O4839j3938J5911M4938j506o841k2083K5763M476
12148F7788j9001k7940m4949L0053P7401M3913K0355j2271k4783j5234m4905l2832
12136A7595k3343J7142K5061j9499j3647M0908O07j04908m7056O4132L7639q691
12124a4060K0983L9266J7083q1219k7988P8704l0385L505M0277K8342k0047k8026
12112B6435J8101M9026n3776q748M6015P7550L6955J31490J14935R2714J08248
$$ y = [16435, -23612, -43702, -9656, 8224, -3884, -45664, -73279, 4443, -14497, 39176, 40710, 72123, 97738, 99910, 103828, 94226, 18581, 21984, -7850, -52968, -66522, -23273, 4106, -11156, 38114, 77222, 112596, 70458, -9700, -101559, -108310, -15203, 13023, -4976, 17356, -21571, -15550, -16157, -57265, -43771, 21068, 7130, 23041, 67979, 66473, 59632, 37549, 63312, 67788, 48787, 20847, -24102, 5951, 83352, 127265, 147620, 135349, 110566, 95332, 50427, 17595, -5748, 11394, 36455, 16956, 3309, 44217, 44824, -60084, -107140, -43008, -5369, -14060, 6923, 46189, 63272, -17947, -45935, 32769, 2384, 5889, 46166, 74508, 54461, 26435, 44536, 93562, 39786, 31038, 77053, 154603, 191558, 323048, 437983, 530697, 638945]
12101F38945m7836j13058j02313o1992n8372q4532q964j5092k1284k0574M2690
12090A47618j9647j2615j901o4443l7792J978O8909J0452l2450N299K1648J9963
12078A07019K4067o1801m7905P9618J8329n0815J4881j6101m7225L09l2910j8753
12066c1287L9446N4932Q0729K7810j1662n4596m9929m1161q027N6231O105j7766
12054E0825N725m1084m2662k0166K8985N7979P423n960O4833N0382n0590n1587
12042E4103k3795q562l2381M3256n633m3359n8434l315J1536M0028N2817R837
12030C6098R571o233k266L9936j9785n3577O147O3664L8157l2322n8354m1064
12018b0028m0174j2140l6548Q717M5545N0850P9845K8692j0873K0545n750q1546
$$ y = [638945, 591109, 478051, 375738, 313746, 255374, 170842, 161878, 146786, 125502, 104928, 147618, 127971, 115356, 113455, 49012, 11220, 13198, 82107, 92559, 60109, 65408, 87056, 107019, 131086, 69285, 21380, 100998, 119327, 68512, 83393, 67292, 20067, 20376, -12534, -31287, 8159, 63091, 143820, 171630, 159968, 105372, 55443, 14282, 6255, 62486, 68591, 50825, 56550, 15466, -27196, -47362, -18377, 39602, 47025, 41065, 105898, 156280, 105690, 54103, 30308, 21746, -10635, 32621, 26988, -16371, -74805, -78120, -66584, -26556, 26261, 36098, 45669, 39436, 37170, 77106, 57321, 3744, 9891, 73555, 111712, 79390, 21036, -20028, -60202, -72342, -108890, -100173, -54628, -3778, 76067, 104759, 93886, 114431, 108681, 27135]
12006B7135o7143J6548L4147N9952j0367l54N1851R2644o304J732O5163R7955
11994C62959M2523O6943R410p2155m1226j11520q7181n5731k2469n4941K1666
11983E8278M6913k3333k9143l8938r309N7749K5028n0380n2044l3711K5316o165
11971b9739k8558K0152J5534K8509K0595q725J3309L1352r268q5874k2954K8573
11959b7094P8986L3275l7610k1634j645k1464P968l2537J0602N2249m7115l0797
11947c6816L500k3967r0313J9373Q1911Q2297N9692n583q425k2951J4441p6363
11935c204p504N5929l483j3717l5917o9475L4702O4184K8665J2774P104k8709
11923D1349q210K3659l1736Q106L954o0354J801K0304k739m2426j1703P0072L1257
$$ y = [27135, -40008, -23460, 10687, 70639, 60272, 59918, 111769, 204413, 198109, 199841, 265004, 362959, 405482, 472425, 481835, 409680, 368454, 256934, 169753, 114022, 91553, 36612, 58278, 105191, 81858, 52715, 13777, 4468, 62217, 87245, 36865, -15179, -48890, -23574, -29739, -58297, -38145, -22611, 5898, 26493, 17768, 31077, 62429, 53161, -32713, -55667, -27094, 51892, 85167, 47557, 25923, 24278, 2814, 10782, -21755, -11153, 41096, -6019, -36816, -33316, -57283, -147596, -128223, -46312, 35985, 95677, 90094, 81669, 58718, 73159, -3204, -10708, 45221, 41738, 28021, -7896, -77371, -42669, 21515, 50180, 62954, 70058, 41349, 33139, 56798, 25062, 33168, 37122, -23232, -21431, -1127, -3866, -46292, -57995, 12077, 43334]
11910D3334k0711o7635j1842k272J9892k6002L55J4546j8543m9536K4066O1987
11898c2361k0611m88k255n5060m3652N0062K8279L52j9900J0338l0413L404j7260
11885a29565Q7075J7237k9063J9371J574j328K7415M0018j3919J4228j8564m0978
11873b6499M297J3585L1249Q87P9k513J6334m5622M246q872K4427L8361n9020
11860i061k1301P368J7382N9409m001j9360m3381o1793k1147L1430L2781Q3972
11848E2298O1887k9096p291j4579j1078l4619k7544j0815k9511M1943J0746m1063
11836c8722m1162M4783N6749n236j6768K2580K7630l640N650N0380M3858k4717
11824A21385m6504j5806L0887j8930p874k9079k7028l4399J3760J7258n3954n2878
$$ y = [43334, 22623, -45012, -56854, -59126, -39234, -65236, -64881, -50335, -68878, -118414, -94348, -32361, -52972, -53460, -55715, -110775, -154427, -104365, -76086, -75734, -95634, -85296, -115709, -112305, -129565, -42490, -25253, -54316, -34945, -33371, -34699, -7284, 32734, 18815, 33043, 14479, -26499, -22202, -8617, 22632, 23519, 23598, 21085, 37419, -8203, -3957, -12829, 11598, 49959, -9061, -30362, -22994, -5612, 53797, 49796, 30436, -12945, -74738, -95885, -64455, -31674, 52298, 114185, 85089, 77798, 63219, 52141, 17522, -10022, -20837, -50348, -8405, 2341, -38722, -79884, -35101, 21648, 16412, -356, 22224, 49854, 46214, 51864, 102244, 146102, 121385, 74881, 59075, 89962, 71032, 63158, 34079, 7051, -27348, -13588, 3670, -50284, -103162]
11812a03162m9655L0910O5806L2265O5238k9225m9420L9410K3210o3360J0231
11801b7752J0431J2658p43k9933m4359M7030N892L0777K6769n1618k5802L0311
11789a6339J7599J0565n956L8778p440L0840m020k5742l8222L17m889j9332l0584
11776e4425j4898j8758O1734M8739m6900l6838j6008O6242j5113K3896K3751m2458
11764b1036o5627O1133J25315L1130n5474p9377K1887J6738q517n0757p302k098
11752c3985j0489J437O4437m3528o3041P358K3630j7725K7974K6017l7004m4900
11740i9819K6726L7187J1656j0135l9719m9280j6365N5896O4353j4473K6930J8841
11728A1798j8342k9473k8731k433j5569q050L344O0293N3039k497j2166o3821
$$ y = [-103162, -152817, -121907, -56101, -23836, 41402, 12177, -37243, 2167, 25377, -37983, -27752, -17321, -4663, -5406, -35339, -79698, -32668, -26776, 4001, 30770, -20848, -46650, -16339, 1260, 11825, 5869, 44647, 37207, 68047, 64027, 38285, 63, 380, -4509, -23841, -54425, -69323, -88081, -26347, 22392, -24508, -61346, -77354, -11112, -26225, -2329, 21422, -21036, -86663, -25530, 99785, 130915, 75441, -3936, 17951, 34689, 26172, -24585, -31887, -33985, -44474, -43037, 21400, -22128, -85169, -77811, -54181, -71906, -43932, -17915, -54919, -99819, -73093, -35906, -24250, -34385, -74104, -123384, -139749, -83853, -19500, -33973, -7043, 11798, -6544, -36017, -64748, -67181, -82750, -90800, -87456, -27163, 25876, 23379, 11213, -52608]
11716e2608o0937K4045J13967K588j3532l0817j5419N7791L9243k9203M45l1465
11704D098Q848l0788j2617O421k9281r468K6278J176N1093l4966o3497k197L1516
11691e3384O923q986n2805Q759J03223m7309p061N7493M405k4207k355M729J8760
11678H185M6776P6332j3313o2107n2120m4490j2016j6795N6380L4370J6969k8483
11666I688n0637L6071L6231k3013J3068r650M6700k3401o220p5209k3335n2143
11654a21850o774j9102M4009O9313j0805m1539k6728N0462N7738Q0936J8413m4068
11642E0005o5134n6030J4159m030O771M1764M3671M5384m4946r6343J2591R281
11630d2857k7129l1686L770O216K2232N973O2834K6680k3613l8569J6240L1722
$$ y = [-52608, -113545, -89500, 24467, 27055, 13523, -17294, -32713, 25078, 64321, 35118, 35563, 4098, 12946, -17842, -30459, -24038, -53319, -62787, -36509, -35333, 15760, -19206, -82703, -84900, -53384, -46461, -55447, -108252, -99493, 3730, -43579, -50640, 6853, 11258, -12949, -15304, -10575, 8185, 54961, 131293, 117980, 55873, 3753, -40737, -52753, -69548, -13168, 21202, 38171, 9688, -40949, -4878, 31353, 8340, 21408, 11758, 58458, 35057, 28837, -46372, -69707, -121850, -128624, -147726, -103717, -34404, -45209, -86748, -113476, -63014, -5276, 75660, 94073, 50005, -15129, -71159, -57000, -61030, -54259, -12495, 31176, 76560, 31614, -64729, -52138, -42857, -69986, -101672, -97902, -91686, -69454, -63481, -647, 26033, 2420, -36149, -19909, 11813]
11618A1813K0476j7604l6821l432J4424k7244q323O9408L1099J2350N604k7750
11606D4000m5985M0997L3480k2852o6120k0636o283M2763p223K684k7745l1534
11594f4454m63J1266m6311q284P2183q849K0834l0573l2556O3710q741M790m070
11581c1518J081l8104N9405K5391l1496N431L0905j4139j7312l5705n8549n6559
11569a61169N7794R1540P5893J6868m0554l5073n8669m6528l7280K3097O1635
11558e2446M9210p1149n1604M9027K1599J4003J3587k2783n5172j8474O8384K7658
11546b8160J7748o0821Q092L3649k4834n4030j854M9590O074K3897l6119l5187
11534a01955l61K8021j1857m6149Q623J576O1148K7147K0385n117n4751L1056
$$ y = [11813, 32289, 14685, -22136, -25568, -11144, -38388, -46711, 22697, 53796, 66146, 71750, 44000, -1985, 39012, 72492, 49640, -16480, -37116, -43399, -636, -7859, -5175, -32920, -64454, -64917, -53651, -99962, -108246, -36063, -44912, -24078, -54651, -87207, -23497, -32238, -27448, -31518, -30437, -68541, -9136, 16255, -15241, -9810, 21095, 6956, -10356, -46061, -104610, -161169, -103375, -11835, 64058, 80926, 40372, 5299, -53370, -99898, -137178, -114081, -52446, -3236, -74385, -125989, -76962, -55363, -41360, -27773, -50556, -105728, -124202, -55818, -28160, -10412, -71233, -63141, -29492, -54326, -108356, -110210, -60620, -54546, -30649, -66768, -101955, -102316, -74295, -86152, -132301, -123678, -122102, -60954, -33807, -13422, -18539, -73290, -42234]
11522d2234N6169O408p645l3066j6815o642r886O354K5731Q4593N7073n6449j2427
11509E1164q6653l0738J7158K8815q0282m0923r067O5943L1321m6323k0184K9749
11497i0020O5164L2379j0627k8548m4035O658J7099J0216q715j265N0799R443
11485H548M490k3703J533m9369k2947L1183N5875J8895m0359K1586j8950p4134
11473h7352k9406K8223R606J8527n0424L3502K6427K0056n942J8369J59j5509
11461c3764p838J0099k5649n3917m998L4055L8417o3655o612K3160p453q124M329
11448a01950k9331R833L3907K7889M4116k962M3175N1138J2193k7287j4293l872
11436D2556n4513k8383L318N1760k6645J1519m3003k9791m516M8305M4689j1773
$$ y = [-42234, 13935, 20343, 12698, -20368, -37183, -43825, -53711, -47357, -21626, 62967, 120040, 63591, 51164, -35489, -66227, -49069, -20254, -100536, -141459, -150526, -84583, -53262, -99585, -119769, -90020, -24856, 7523, -3104, -31652, -75687, -69029, -51930, -41714, -50429, -51694, -895, 8548, 13038, -10665, -9132, -58501, -81448, -50265, 5610, 24505, -15854, 5732, -13218, -87352, -116758, -88535, -78929, -60402, -110826, -77324, -50897, -30841, -36783, -18414, -18255, -33764, -41602, -31503, -57152, -111069, -116067, -82012, -43595, -107250, -113862, -90702, -98155, -106279, -101950, -131281, -121448, -87541, -59652, -15536, -18498, 24677, 75815, 88008, 60721, 46428, 42556, -11957, -40340, -37022, 14738, -11907, -388, -43391, -73182, -77698, -29393, 15296, 3523]
11424C523m4490k2765J3993Q267k0760J6199O8709j1277r2986K4077R5278M813
11412D2581n9149m2927Q348k1793M2852J047K2145L7347R9m5810j2379J96k9199
11399e6642n9370K096O8804K6226j3707N8389K0250k6693k9796j5264P459l001
11387b1249M3576M5629Q114q632J7524R885J5148O7090j7079j6633m8556l8022
11375E6795j0534p8461M966R101j2559K4627k9150l974N8164l1412n1912k2656
11363h7005m5107L238R790J5870N0861K6838j2304O175l0539l5727K3559M8457
11351b5894K6881j2142q360l9565l3438K9212n290M029K0169J8350L4016j3952
11339e984l7861j2670k0454m0550K845J8536O7050N5749Q273K5755j0105m0733
$$ y = [3523, -40967, -63732, -49739, -41472, -62232, -46033, 22676, 11399, -81587, -57510, 37768, 42581, -16568, -59495, -51147, -72940, -30088, -29041, -6896, 30451, 30550, -15260, -27639, -27443, -56642, -116012, -113916, -45112, -18886, -32593, 25796, 46046, 19353, -10443, -25707, -18248, -21249, 22327, 67956, 76070, 67438, 84962, 94847, 109995, 177085, 160006, 143373, 94817, 56795, 46261, -32200, -27234, -18133, -30692, -6065, -35215, -39189, 18975, -12437, -64349, -87005, -132112, -128874, -119084, -103214, -52353, -25515, -37819, -31644, -62183, -97910, -74351, -25894, 987, -11155, -19515, -59080, -92518, -63306, -68596, -64567, -44398, -26048, 7968, -5984, -43845, -56515, -76969, -117519, -114674, -96138, -29088, 26661, 34934, 60689, 50584, 9851]
11327I851N540Q4556j1488l6849L2837L7917m4751k7746l0180J9289N5269l1830
11315F2415l4302l9007l2093N1020M2763l1263M518j752k4581K3715j2097n7881
11303d8545J6938J9407n7111k7023m1011L2067M6233J5622m419j5518n7446K7952
11291i2854R6474K052J326j0672L814l4539o3601J233l588J5022K3454l842p494
11278g3215O909P574l4673m0710m686O3539L8993j338j2126j08742l8806N9937
11266a37344N9554K1011L301L1942k0599J2200P3251J3731j2791j5051l5489p7952
11254h4236j7049Q3972N5715l1989J6325P07j1639L673m3690j6008K7458L5595
11242A8834M9180l0281n2116M5688L9275j1759k8875p130L322N251k1281L5497
$$ y = [9851, 15391, 99947, 88459, 51610, 84447, 122364, 77613, 49867, 19687, 38976, 94245, 62415, 28113, -10894, -42987, 8033, 50796, 19533, 24051, 22299, -2282, 21433, 9336, -48545, -31607, -12200, -69311, -96334, -137345, -105278, -59045, -43423, -47842, -63360, -120806, -92854, 3620, 5672, 6998, -3674, 140, -34399, -98000, -96767, -100355, -85333, -61879, -65721, -73215, -66306, -58732, -93405, -134115, -138801, -75262, -36269, -37607, -49733, -158475, -197281, -137344, -77790, -56779, -53478, -21536, -42135, -29935, 43316, 57047, 44256, 29205, -6284, -84236, -101285, -17313, 38402, 6413, 22738, 23445, 11806, 15479, -28211, -44219, -16761, 18834, 68014, 37733, -14383, 31305, 70580, 58821, 29946, 22816, 26138, 31389, 10108, 45605]
11230D5605m5913o6119m0028q643K5803P6102L8445K3997J2554j6914k5255j5775
11218C859k6575J040k7159l7133L1736Q908k153k6078L5214L4216M0971j4430
11206B2416n928J9291L4305l535r3430n1976j1901L5608R657L3350L115K870j2403
11193a8561p9055p7099l1500K382n305O0151R8207J4040k5427L5861P32J6087
11181i487N6176K8807l8729l7718j978M2081k6529P164j4337K0238j4149k6145
11169a4606j9442k1977J7258p884L2576M5740M7239q8367n4693m8551K6858K5567
11157f0282K7177m036N0434j901J344k6084j098k3281k8711R431O1814L9346M863
11144D9016k2317n1315O976q9K463M555j6001O7858L5226l8903j0068K4481j2321
$$ y = [45605, -308, -66427, -106455, -115098, -89295, -13193, 25252, 49249, 61803, 44889, 19634, 3859, -22716, -21676, -48835, -85968, -54232, -45324, -47477, -73555, -38341, -4125, 36846, 22416, 16488, 35779, 70084, 66549, -26881, -78857, -90758, -55150, -45493, -12143, -9028, -6158, -18561, -97616, -174715, -206215, -203833, -209138, -148987, -50780, -36740, -62167, -26306, -25574, -9487, 46689, 75496, 36767, -951, -2929, 39152, 12623, 19787, 5450, 25688, 11539, -14606, -34048, -56025, -38767, -46651, -14075, 31665, 78904, -9463, -64156, -112707, -85849, -60282, -33105, -37141, 13293, 11392, 12736, -13348, -14446, -37727, -66438, -57007, 4807, 44153, 49016, 26699, -24616, -17640, -17729, -15266, -10711, -26712, 41146, 76372, 37469, 27401, 51882, 39561]
11131C9561J400M0116K9749k9333J8025K8048l5037n0567o1018j9259q870J2302
11119c4883R8642k8714j01814n4296L9006K3876J5352P957o9295K9824Q5252l263
11107G644j668k8264l5315L5839q038J4583L9316K5858p932j8722k3304K6467
11095B6464k4994l959J0819r713l711K511L6289O3896N4002J7673n9631m0962
11083F8684q917J9921m1017o4701n9398p892p548k9232N8046L0244Q031K9265
11071d514L1982k4533J1599O849J1487M6093o6687l7977k1026j4532J4423K8518
11059a8318L7814J9929J1471k3767j5905J3828k0600L8157O226J6077K6415n455
11047H5872k1977j6466M889m457j0841k8175o4460j1358j3406N8J3884J2432K8033
$$ y = [39561, 40961, 81077, 110826, 81493, 99518, 127566, 92529, 41962, -19056, -38315, -47185, -34883, 63759, 35045, -66769, -121065, -82059, -58183, -42831, -34874, -104169, -74345, 10907, 7644, 5976, -22288, -57603, -21764, -29802, -15219, 24097, 49955, 42023, 23301, -3, 26464, 1470, -2489, 8330, -1383, -5094, -2583, 33706, 97602, 151604, 169277, 109646, 68684, 59767, 79688, 38671, -26030, -85428, -93320, -100868, -130100, -72054, -41810, -33779, -4514, 27468, 2935, 14534, 21383, 32870, 78963, 12276, -25701, -46727, -61259, -46836, -18318, 19496, 39425, 50896, 27129, 11224, 25052, 4452, 42609, 48835, 64912, 91327, 85872, 63895, 47429, 52318, 47861, 37020, 8845, -55615, -66973, -80379, -80321, -66437, -54005, -25972]
11034b5972j8480p696M2764m5044k4623K6806J6824j335l017M0993O7271m3184
11022B5307l3752o9616l743J0242M2502n056K1692P142l7771l2294N972J1708
11010e7667n0227J0912K4307L3107L0837N4709r9p439l1368K1224j6142K7383
10998C9537K9342m5748j8194J1589k7018j8307k4043j4262K3077L5372l8654l7290
10986h4599N7131O1131J7293j8928j9032j2540r69j6305n6039q402N8117k8266
10974e1408J7549R9323J3418m979m6547n2763k9455j5457k3970J5180l4979P08
10962a13380L8223J1131j952L480j5141k4171r332R5243M0243J4899L778J8593
10950F1614k8463m4964L386j999K783n6207L3980J745K1655K1417J4277p114m478
$$ y = [-25972, -44452, -52148, -9384, -54428, -79051, -52245, -35421, -36756, -39773, 1220, 68491, 25307, -8445, -78061, -81804, -71562, -29060, -34116, -12424, -5282, -43053, -75347, -69375, -57667, -107894, -96982, -72675, -39568, -8731, 45978, 45879, 38440, 7072, 28296, 12154, 39537, 68879, 23131, 4937, 16526, -10492, -28799, -52842, -67104, -44027, -8655, -47309, -84599, -27468, 33663, 50956, 32028, 12996, 456, -513, -16818, -72857, -81259, -23142, -51408, -33859, 65464, 78882, 73903, 27356, -25407, -54862, -70319, -94289, -79109, -114088, -113380, -75157, -64026, -65978, -62498, -77639, -101810, -111142, -15899, 24344, 39243, 43021, 61614, 33151, -11813, -8427, -10426, -7643, -63850, -29870, -28125, -6470, 14947, 29224, 22110, 17632]
10937A7632O397k46l2742j6680J1469O960J0359Q602J717J2448J2679j9932m1407
10924b2744Q906j4307j6387R426j8768K842N0434m6851n5127N9860K3684L6501
10912A7469J8848k6591m0922P518l5005N7841M5228P786j2426p3819m4186J2906
10900f5353N0340M792K0579L1016o609j7042m4934r324N6452K6640J6877J071
10888F4505L342k9422r7091j4620J8730L4970j8715m3430K3780K8320j8244J0242
10876c7633M8936K091l5443J9362J3859j8374j6950l2597J5168N9429m6775M7889
10864A8962L8337m1303j7350K3540K4773q8356k3725K7339K8068l3594J9378L7987
10852A4056n318q0606l175L1550J5066M2546J0316J5146j9449n7798K4692M3597
$$ y = [17632, 24029, 23783, -8959, -25639, -14170, -7210, 3149, 11751, 13468, 25916, 38595, 18663, -22744, -13838, -28145, -44532, -35106, -53874, -51032, -598, -47449, -102576, -42716, -19032, 17469, 36317, 9726, -31196, -23678, -58683, -842, 44386, 52172, 39746, -34073, -78259, -65353, -15013, -10221, 10358, 41374, 34765, 17723, -27211, -36535, 19917, 46557, 63434, 64505, 67847, 38425, -58666, -73286, -54556, -19586, -38301, -81731, -57951, -29631, -47875, -37633, 11303, 13394, -22049, -2687, 11172, -7202, -24152, -56749, -41581, 17848, -28927, 18962, 57299, 15996, -1354, 22186, 46959, -41397, -65122, -37783, -9715, -43309, -23931, 14056, 8738, -71868, -75043, -43493, -28427, 14119, 24435, 39581, 20132, -37666, -12974, 30623]
10840C0623k833m0723o2766k4360L7147Q9818J5577p7035O262L6614J0778J0506
10828B9608O25K6071j7827J4569K6327m8724j9033R394l2358p0630J7226R074
10816e5678n5422m3374N662J4951K8644O630L6494P3040j9536p964j3618J6536
10804a3635N609P1664o97n7231N9068R3691n3863l7490N1483J2827p3647l5047
10792B2732n5299j9670J5183R310N1252J6213k9356Q536K0549j9617m712j4613
10780E08o5693k3487l4086n216m886q042O3308J01417Q890k7033J1264K0718R327
10767D6989n1372r2703J506N3336M3700M3702p0871m6844N9045J7546l0078r586
10755c5630L015L6694J7720l6386Q1033k253j0421n0140J121j8247L9829J6469
$$ y = [30623, 27790, -12933, -75699, -100059, -62912, 26906, 42483, -34552, -28290, 8324, 19102, 29608, 30233, 56304, 38477, 53046, 79373, 30649, 11616, 21010, -11348, -81978, -64752, -55678, -111100, -154474, -148812, -133861, -105217, -98587, -62093, 10947, -8589, -16553, -30171, -13635, -8026, 63638, 62941, 5710, 64778, 158469, 104606, 67116, 118599, 131426, 57779, 22732, -32567, -52237, -37054, -27744, 23508, 39721, 10365, 18901, 39450, 19833, 15121, 508, -65185, -88672, -122758, -127974, -132860, -140902, -77594, 23823, 32713, 5680, 16944, 37662, 46989, -4383, -97086, -95580, -42244, 1456, 45158, -25713, -72557, -13512, 4034, -26044, -35630, -32615, 4079, 21799, -14587, 66446, 64193, 53772, 3632, 4753, -13494, 26335, 42804]
10743D2804K0004L5167l9563O639l818J6624J8327K3887P670l918n5398k6607
10731D1818q975N521L7714K835k7103m3971j8308p077M311p304n82M7958L8022
10718F4859m3387m4550K3428j798N486l0756l2404N8344Q4511M1075k8345m3086
10706E3377l0362m1207J3466N8679m5343o5298m1276K3449M2571M2505K0095L0711
10694F1367k5883M8617J0608Q86K5757p073q198J210O7226J32639J14288K20565
10682F42009K33666M43067N44624J99886k68366l91297m55904l22463k02755j28123
10672B94344l0508l0953m0041m2358l3349j6688l5409K6786K8264l5840k1983
10661F2265m3066j7455K755J3629J7930J3902k1295j2559L2472K523k1930n368
$$ y = [42804, 62808, 97975, 58412, 65051, 61233, 77857, 96184, 120071, 127741, 123823, 68425, 41818, 32843, 38364, 76078, 78913, 51810, 7839, -10469, -17546, -13235, -20539, -21121, 26837, 64859, 21472, -23078, 350, -1448, 4038, -26718, -59122, -778, 83733, 124808, 96463, 53377, 23015, -18192, -4726, 53953, 8610, -56688, -97964, -74515, -31944, 10561, 30656, 61367, 35484, 84101, 94709, 95595, 121352, 114279, 106081, 107291, 174517, 307156, 421444, 642009, 875675, 1318742, 1863366, 2063252, 1794886, 1403589, 947685, 625222, 422467, 294344, 263836, 232883, 192842, 150484, 117135, 100447, 65038, 91824, 120088, 84248, 62265, 19199, 1744, 4499, 18128, 36058, 49960, 28665, 16106, 48578, 51101, 29171, 23803]
10649B3803l588r425J6265J1677N5839M3266k9532m1142N656j3649L1578k6401
10637F4347m9326K7481m1456p94m720J5381J0118l7427J9031M9584J86l0267L2181
10624E4319O048n4165J7505K8610j3966m4629k0312L6378J6758n0932q478J8211
10612a4653J4317l991K9811K4750j4574j4290j3133K9210L3557L1423j01675j30142
10600a29390J4416L2276N6294O887J7506l0407N094k770n20L9079O742l8140l6815
10587e9748k804Q136N4572L6948k0615N627k3155l7330J272K1290J1632O499k258
10574F6k0328K2182L3575O687k003L8342n1052n9159k9138K3940J6410k9891m3662
10561i4031L0141N550k1643M5253P4176m5255Q955l2147N873k1667m8939L1832
$$ y = [23803, 20215, 10790, 27055, 38732, 94571, 137837, 108305, 67163, 72819, 59170, 90748, 64347, 15021, 42502, 1046, 252, -4468, 10913, 21031, -16396, 2635, 52219, 52405, 22138, 54319, 60367, 6202, 23707, 52317, 38351, -6278, -26590, 9788, 26546, -24386, -32864, -14653, -336, -4327, 25484, 50234, 35660, 21370, 8237, 37447, 71004, 102427, 752, -129390, -114974, -82698, -26404, -19517, -2011, -32418, -27324, -30094, -30614, 8465, 15207, -22933, -59748, -62552, -54416, 156, 37104, 16489, 22116, -1039, -38369, -37097, -15807, -4175, 2324, 66, -20262, 1920, 35495, 42182, 40179, 78521, 27469, -31690, -60828, -36888, -20478, -50369, -94031, -63890, -58340, -79983, -34730, 39446, -5809, 3146, -29001, -23128, -44795, -93734, -61902]
10549f1902N3764K0153m412K4257L6471l9455k3734L8878K314l3897R974j6284
10537F127J530P6466R1215k1346n9012J2377J871n0174m8434J2676M1863m7060
10525A8099l9290L7189n9907n5307K1843L2291m8398p1321L5777J20371k0983
10514b9636n1212P7026R6054k2324O04p2899j1812R581j1948J8687J760r618Q5366
10501G9629M7079M298o7121o7296k2955j7169L4526N8169J9409k3809n6181j1243
10489b2664K0372k9660J3041M8104J6421l667J2717n5622o0027o594J3132K1815
10477c2632k6577l7870q203L3470M070l238k0239J105P4557M9807P792n371M8237
10464H4908j1332o1326k8792k563K9421p389p571o8160L1442M4904p661p0177
$$ y = [-61902, -8138, 12015, 7603, 31860, 68331, 28876, 5142, 44020, 46334, 12437, 22411, 6127, 7657, 84123, 175338, 153992, 94980, 107357, 109228, 59054, 10620, 23296, 65159, 18099, -21191, 15998, -43909, -99216, -77373, -45082, -93480, -164801, -129024, -8653, -29636, -80848, -3822, 92232, 69908, 70512, -2387, -14199, -4618, -16566, 2121, 3881, -5737, 79629, 126708, 131006, 63885, -3411, -26366, -43535, -9009, 49160, 68569, 44760, -11421, -22664, -2292, -31952, -18911, 29193, 45614, 41947, 54664, -958, -60985, -67579, -54447, -32632, -59209, -97079, -105282, -71812, -67742, -70980, -91219, -90114, -15557, 34250, 42042, 36671, 84908, 73576, 12250, -16542, -19105, 10316, 2927, -4644, -72804, -41362, 3542, -4119, -74296]
10452g4296j2588l8038j5712K5446R5722M194m8560J2623l6628N151M6865N6850
10440B1029q2250p3020O7001P5095J836L9455K5460m3967k7766k9648l9002N2673
10428a3104N9974P689M4588m5349L485J0867k0292l8253j027J8582J5293K6255
10416F8708P216N3201r156M440k9821M399m3719k1218k6029j4050l850P1172K4152
10403H5445K9487P1372k3232k383j3484J2868L0721K7909L8258n639o0173r706
10391A81443o574k2022q123L2261j8544p449n0347P103M7522J1452p9030p0493
10379A7199J2543O3843l971n3494j0046o6597q214L9237M6958l6380o5480K5728
10367c8674K12j5535J0384P1805M175J6731J02185K5257J9260K6546n8565N3855
$$ y = [-74296, -86884, -124922, -140634, -115188, -19466, -15272, -63832, -51209, -87837, -82686, -35821, 21029, -61221, -134241, -67240, 7855, 9691, 49146, 74606, 30639, 2873, -26775, -65777, -13104, 46870, 54559, 99147, 53798, 57283, 68150, 47858, 9605, 8578, 27160, 42453, 68708, 75924, 129125, 119969, 124409, 94588, 98987, 55268, 34050, 8021, -6029, -9879, 61293, 85445, 114932, 186304, 163072, 160689, 147205, 160073, 190794, 218703, 256961, 251322, 191149, 181443, 174869, 152847, 144724, 176985, 158441, 150992, 100645, 107748, 155270, 166722, 87692, 17199, 29742, 93585, 89614, 36120, 26074, -40523, -48737, -9500, 37458, 1078, -64402, -38674, -38462, -53997, -43613, 28192, 32367, 49098, 151283, 176540, 195800, 222346, 163781, 217636]
10355B17636L0626O788p696J13164J00281L2737K9676M8404N8757J16018O8051
10344H14442R7821J93174K18697L79933M93379M61694P44166J149428J560656
10335F113390K100653K863126L455699L123683J299289j181428k954415l308998
10327A1510999k816299k097963j445710r51569p04208m86766m08361l62302k68581
10318A969240k50115j58708o8071p9226p4434j00327o7864R125O202l9548j27355
10307A018919p2162M335k985n4180l0527l1454k022o064L3042Q095j4539L3289
10295H83747O4510m4761j19207p7490j03538m3376j6373P72k6442j0006j3133
10284D94703K2269p8669j19417k3794Q9500K1707o618j1550n6541p704K5651k9277
$$ y = [217636, 248262, 255050, 247354, 360518, 460799, 493536, 523212, 571616, 630373, 746391, 814442, 912263, 1105437, 1324134, 1704067, 2197446, 2659140, 3403306, 4552734, 6113390, 8214043, 11077169, 14532868, 17656551, 18955840, 17774412, 14819997, 11510999, 8694700, 6596737, 5151027, 4199458, 3495250, 3008484, 2600123, 2237821, 1969240, 1719125, 1560417, 1492346, 1413120, 1338686, 1238359, 1170495, 1179620, 1185822, 1146274, 1018919, 946757, 951092, 948107, 893927, 863400, 831946, 829924, 823860, 856902, 864997, 850458, 883747, 948257, 903496, 784289, 706799, 603261, 559885, 543512, 544284, 517842, 507836, 494703, 516972, 438303, 318886, 295092, 384592, 406299, 399681, 388131, 331590, 323886, 349537, 320260]
10272C20260m6141R654J6244l0273l4038N4723M462k6261l0898k1247o212K1711
10260B31984K2627M1801N9002M2595m2692k5718j8885J8378o3305k2223R904R4727
10248C48195P6149Q6457M5785R7259K07797K82631L67681M24497P37296J074145
10238C747892J493092J341728K86813r33648j488249j302754r37319n61082l86354
10229A260119k22830k07497j15396m7205n8946k8101j28693m8472k7218k2399
10219C53362m5655L4096J4903K2962k3615m2617R644N0858L1048l3107p9202K6223
10207C18900M7340k8281k1923n0967n1319N1519K4933L9844n1623j2281J4698
10196B80840k9822l2431k5577k0280m0859Q204P0230p262r436J7596m139L590
$$ y = [320260, 274119, 283773, 300017, 269744, 235706, 290429, 294891, 268630, 237732, 216485, 210273, 231984, 254611, 296412, 355414, 398009, 355317, 329599, 310714, 329092, 265787, 243564, 253468, 348195, 424344, 510801, 556586, 653845, 861642, 1144273, 1511954, 1936451, 2673747, 3747892, 5240984, 6582712, 6869525, 5935877, 4447628, 3144874, 2207555, 1646473, 1260119, 1037289, 829792, 714396, 667191, 608245, 580144, 451451, 402979, 375761, 353362, 307707, 341803, 356706, 379668, 356053, 313436, 323080, 373938, 404986, 371879, 292677, 318900, 366240, 337959, 316036, 265069, 213750, 265269, 290202, 330046, 278423, 266142, 280840, 251018, 218587, 193010, 172730, 131871, 140075, 210305, 203043, 193607, 211203, 207064, 210654]
10184B10654O8933O7935L975k7347q5977j9071n4043M2649L8473K0948p1138N105
10172B01096j393j8384m2099k4275O72o9779R381N2086L1705k5460j3470j2062
10160H8018j3057P327n041M0427p31l1537n8890K931N2782J9039j6606J769O7559
10147A53990l377m8061K22j3174J4447O7909l51j6153M7618J6496p9503r9077
10135D0986Q437Q061M1819k3717j92m1133j7370j9987l6118Q695O885L372n2744
10122g3006l1797J0379R5885L886l384l552N723L6937K8397k9500N0319l5161
10110E5126o989r49N0588j0652J6616k4647q7191L6058J1831L4606k9464L6185
10098H1118K3713m540l4821p621j6252l0631M77O7438J184J4803j9791k308m5059
$$ y = [210654, 279587, 347522, 351497, 324150, 238173, 219102, 165059, 207708, 246181, 267129, 195991, 201096, 199703, 181319, 139220, 114945, 115617, 45838, 55219, 107305, 139010, 113550, 100080, 88018, 74961, 82288, 77247, 117674, 116943, 85406, 26516, 29447, 82229, 101268, 84662, 86431, 153990, 150613, 102552, 102774, 89600, 104047, 171956, 171605, 155452, 203070, 219566, 140063, 40986, 49423, 57484, 99303, 75586, 75394, 34261, 16891, -3096, -39214, -30519, -23634, -20262, -73006, -104803, -94424, 1461, 5347, 1963, -1589, 4134, 41071, 69468, 39968, 90287, 55126, 48137, 47188, 97776, 87124, 103740, 79093, -8098, 27960, 39791, 74397, 44933, 81118, 104831, 100291, 65470, 57849, 41597, 10966, 11443, 78881, 80065, 94868, 75077, 72769, 27710]
10085B7710p8828L2055Q2396O335l0792k7959J1382K2485J4936k1212j7118P064
10073B8454m662k0005m6962K1141j9348M9744N9946m8159r744K4185K2687j9930
10061C7347q557K476L9794K8035p2837r6213N1208P9167n1095p3266K0575m585
10049d7951M1318L8185m4546n2486k0310N0759K206M233M2279M7342R551n0624
10037A9956j3563O5211L6009J7105l2043k8493J6806O268j7234L5584O154p7633
10025C4127n6801L3192J5826p6122l1193L3521N1276N9973l3225m5449J3196L196
10013A517L0134k0044l289J8969K141M7146M6768K250L2203j3115n0842l1433
10001F2405K8848j319J9087o4423k7850J2365l5775n9645Q1756L8284L0521j0728
$$ y = [27710, -51118, -19063, 63333, 69668, 38876, 10917, 22299, 44784, 59720, 38508, 21390, 28454, 23792, 3787, -43175, -22034, -41382, 8362, 68308, 20149, 10405, 34590, 57277, 37347, 28790, 31266, 71060, 99095, 26258, -69955, -18747, 60420, 9325, -63941, -43366, -47951, -6633, 31552, -12994, -65480, -85790, -35031, -32825, -28592, 13687, 61029, 70580, 19956, 6393, 71604, 107613, 124718, 92675, 64182, 80988, 87256, 70022, 105606, 111760, 34127, -22674, 10518, 26344, -49778, -80971, -47450, 3826, 63799, 30574, -14875, -1679, 1517, 31651, 11607, 8318, 27287, 29428, 76574, 123342, 125592, 157795, 144680, 93838, 62405, 91253, 89934, 109021, 44598, 16748, 29113, -6662, -66307, 15449, 53733, 84254, 73526]
9989G3526m2601Q879K757j1343J9714l909J0505L6471o448m4711m3407j060O2178
9976F0551k8364k6201L563R522N6691j9151r5382K5054P4081m2130J1257J55k6933
9963B713N674o927J6378r444l4103L8257K1587J4379o964M455O8162L81n7829
9950E6719o8161M023P0705j5541q0647l1525k2085L5364Q1268K1533o4970j2227
9938b5544J8835L2585K3462K6213K367n0222j5691J8748j3650j2398N7832L3513
9926I6050J0073m6173n6241K9373P630J4157J8245K9744P4329j4621q7141m8616
9914B6809M2779P6949P4555K240j6522k8670k0790k1076j0116l4722K0498N2640
9902A64574l3128q1829k2423Q59j918L4631Q3238R401k0254l2407N5424J706n3137
$$ y = [73526, 30925, 39804, 42561, 31218, 50932, 47023, 57528, 93999, 87551, 42840, -567, -1627, 60551, 32187, 5986, 9549, 19071, 75762, 56611, -38771, -13717, 60364, 18234, 29491, 29646, 2713, 8387, 1460, 17838, 8394, -25709, 12548, 34135, 48514, 41550, 46005, 114167, 114548, 56719, -11442, -7419, 63286, 47745, -32902, -64427, -86512, -51148, 30120, 51653, -13317, -25544, -6709, 25876, 49338, 75551, 77918, 27696, 12005, 30753, 17103, 4705, 62537, 96050, 106123, 59950, 3709, 33082, 40712, 54869, 73114, 102858, 177187, 162566, 75425, 26809, 69588, 146537, 221092, 223332, 206810, 178140, 157350, 136274, 126158, 91436, 111934, 164574, 131446, 49617, 27194, 28053, 26135, 60766, 144004, 153405, 133151, 100744, 156168, 157874, 104737]
9889A04737K9216m84j7016K3584Q659j3152m3665L3614K4650k231o5910M0273
9877A22275M3442q0804j9006L2480k9178J5484K7841k1576l0442N9892l3324J6086
9865A03170R274m2344l5633p379n3436l5041J3886n6996l5073O1682J67343P1675
9853A61128O518J2224l9257k098M4566L7041J5457k4036K8116j906P5024J1631
9841C24408m7432o5532j2007j8310k9186m3989k3607p726q5464K9589O2954J7157
9829A00855j5752j6964j2641L7024J140o691O304M4995q481L4204K5207n5507
9817A33693l2957K9869l1840k0069R2258L3078n6312o7129L2488j0419K9962n9195
9805G3427j2745K6525k3805m0767N4384Q7821J4035j6362n9288r6361q7055j7150
$$ y = [104737, 133953, 133469, 116453, 140037, 148696, 135544, 91879, 125493, 150143, 147912, 82002, 122275, 165717, 84913, 65907, 98387, 69209, 84693, 112534, 90958, 60516, 120408, 87084, 103170, 112444, 70100, 34467, 27088, -26348, -61389, -47503, -104499, -139572, -77890, 89453, 161128, 167646, 179870, 140613, 138515, 183081, 220122, 235579, 211543, 239659, 237753, 312777, 324408, 276976, 211444, 199437, 181127, 151941, 107952, 84345, 76619, -8845, 20744, 83698, 100855, 85103, 68139, 55498, 92522, 93662, 86971, 93275, 138270, 129789, 163993, 189200, 133693, 100736, 130605, 98765, 78696, 170954, 204032, 147720, 80591, 113079, 102660, 132622, 73427, 60682, 87207, 63402, 22635, 77019, 164840, 178875, 162513, 103225, 6864, -80191, -97341]
9793i7341M9310m43N3470L3057r231J3548L2874M8476K035O664K5531L4964k6849
9780A66065n6369N402M2653n7482m4262l540M0041K9216l9059l9002P301M892
9768E5856L8291K7833m4172k1788K3379l7232O7400K7843m6956N884M4928k5761
9756A15505q2151L6329K0224J2189K0000P6853L5551k1034q3227p8184q824R2046
9744A35277j0887M3891N346n7770K1493L6327k9436K1099k1925j6286J5846n4917
9732H8058l2736j6163K8344J7706J8122J5617r5829j0954J4033L4674K8069R606
9720I8547j441K771l1600Q433J3847j8281J059M1055j2432r0227p3449m415N5141
9707a0992K8773L9190L7676J1531m4716k5068J4447J694K8087Q994J7737n314
$$ y = [-97341, -48031, -48474, 4996, 38053, 28822, 42370, 75244, 123720, 125755, 132419, 157950, 192914, 166065, 109696, 115098, 157751, 100269, 56007, 52467, 92508, 121724, 82665, 43663, 50964, 55856, 94147, 121980, 77808, 56020, 79399, 42167, 109567, 137410, 90454, 96338, 141266, 115505, 33354, 69683, 89907, 102096, 122096, 198949, 234500, 213466, 130239, 52055, 43231, 135277, 124390, 168281, 173627, 115857, 137350, 173677, 144241, 165340, 143415, 127129, 142975, 88058, 55322, 39159, 67503, 85209, 103331, 118948, 23119, 12165, 26198, 60872, 88941, 98547, 97106, 99877, 68277, 76710, 90557, 72276, 73335, 114390, 101958, 11731, -61718, -66133, -10992, 17781, 56971, 94647, 106178, 61462, 36394, 50841, 52535, 80622, 89616, 107353, 102039]
9695A02039l501l351j3204k3943j3578O215J9495J6373k953K2663K4142l7297
9683I3100K7332K374p8471j1163K4963N7703J1746R459M429l1777j7607k5387
9671F6701O090Q5441J9677l7979n6671J4822K749l4265k2852j9695K2125N8098
9659A04241j2787r234M1621j7332o1238k3415N2988N4547J4957l6692n8833O94
9647D9517O055O943j479N3518K93l7985n203l1947n0517J1309J5910J9737O1099
9634I7250P17q996P3348N2777p8179q6269N3171L9161j8584J0043K0425m2062
9622A12802l2573Q819J2870J9683j8299J8037J577m3666p354j6253J8597k375
9610G1865J3230O5637L5330n3444k7827p4741n347M9214j621L1802R786l7034
$$ y = [102039, 98538, 95187, 81983, 58040, 44462, 50677, 70172, 86545, 83592, 106255, 130397, 93100, 120432, 122806, 44335, 33172, 58135, 115838, 127584, 137043, 141472, 109695, 92088, 66701, 72791, 158232, 177909, 139930, 83259, 98081, 100830, 66565, 43713, 24018, 46143, 104241, 91454, 82220, 123841, 106509, 45271, 21856, 74844, 129391, 144348, 107656, 48823, 49517, 55572, 62515, 61036, 114554, 114847, 76862, 71659, 39712, -10805, 504, 16414, 36151, 97250, 97967, 88971, 162319, 215096, 136917, 50648, 103819, 142980, 124396, 134439, 154864, 112802, 80229, 89048, 101918, 121601, 103302, 121339, 122916, 79250, 71896, 55643, 74240, 71865, 85095, 150732, 186062, 132618, 104791, 30050, 24703, 73917, 72296, 104098, 113884, 76850]
9598G6850k2296J2059L9210J6542q730M8226N4279J9051k0562N939l7365r6476
9586H6727m0435J6468L5925L1922j3932J9539K6334K0444j3491k2933M46m9928
9574I7086m3835k6005L4375j8056k3814K3909N46j2017L482m3498M3897M0704
9562G6774N3275m74o005m702j4042j0457N4233j9242k9049r143L3221L4613M788
9549A63790j5930L5099k6254n6361n881j5017m0952R1983o51p0613m8323k3584
9537a2694M6388j7061m4418O9529N974L045Q0287m789l2101n3434J9533j6922
9525D3337L8987l4604L9846P1672k5987q1401m2228J0792o02M5141M3592p695
9513A00850M9680j0019P292M6407m3512j1186l2993m5891l4900N4692M4410k787
$$ y = [76850, 54554, 66613, 105823, 122365, 113635, 161861, 216140, 235191, 214629, 220568, 183203, 86727, 46292, 62760, 98685, 130607, 116675, 136214, 162548, 182992, 169501, 146568, 147014, 97086, 53251, 27246, 61621, 43565, 19751, 43660, 44206, 32189, 35671, -7827, 36070, 76774, 130049, 129575, 123570, 118868, 104826, 94369, 148602, 129360, 100311, 91168, 124389, 159002, 163790, 147860, 182959, 156705, 100344, 94463, 79446, 38494, 130477, 129826, 59213, 10890, -12694, 33694, 16633, -27785, 41744, 47718, 50763, 131050, 126261, 94160, 40726, 60259, 43337, 82324, 47720, 87566, 159238, 133251, 51850, 9622, 20414, 19812, 64953, 108545, 100850, 150530, 140511, 147803, 194210, 150698, 139512, 106519, 60628, 25728, 80420, 124830, 122043]
9501A22043k2201j8361o6101m2788m2922J4231O6667K8873L5943n412o0087o4241
9489e4356J0787L3942O7836k7310L7860j113m5697k1893K4430M9971K9458p427
9477I6488J6220J1567K1542J9667J6232k6905q93P7241l763L108J0599r5978p0027
9464G5098k5948N494M851j982q0777k9200L1034P6477L2502L883k8615j5069n520
9451D2228o9599l5398K2707L0576k16R254M1679O6649L765J3352J2946r6823k8928
9438A2192K9089J6441l2414N285N7228n547R188l9240j5676n3609l003P7354L618
9425F0906m020o0835k3629J1028L8738J5287q700P468J2604k243l6404j208K3447
9412C2439j1945Q31o684n182L5552K0492j5583o5303j8445p122J6425L9865K1136
$$ y = [122043, 99842, 81481, 15380, -27408, -70330, -56099, 10568, 39441, 75384, 69972, 9885, -54356, -43569, -9627, 58209, 30899, 68759, 67646, 21949, 56, 24486, 74457, 103915, 96488, 112708, 124275, 145817, 165484, 181716, 154811, 153918, 231159, 227396, 230504, 241103, 145125, 75098, 49150, 54644, 59495, 57513, -23264, -52464, -21430, 55047, 87549, 91432, 62817, 47748, 42228, -27371, -62769, -40062, -9486, -9702, -448, 41231, 107880, 111645, 124997, 137943, 41120, 12192, 41281, 57722, 25308, 30593, 87821, 82274, 91462, 52222, 36546, -17063, -20066, 57288, 60906, 56886, -3949, -27578, -16550, 22188, 37475, 28775, 36243, 48847, 46604, 10200, 8992, 32439, 20494, 21325, 14641, 9459, 45011, 65503, 49920, -15383, -33828, -40950, -24525, 15340, 36476]
9399C6476K8917j3847j6609j7087M5567N5706L5153j3454O1960P900j4066n7554
9387A39062k303j2649n3493K1009k3527n6600m2179q179m69L1369M2920J5914
9375E0875L478q732M4972P0376m0815r4038L7134M3010n6661n7398r23M8092J3171
9362E2541o1967k0524P1897N6001l1593L253K3718k0768o7085J611M4043J9205
9350G0332K8970K6081N033N823L67j7332k6129l3138j3519J8722K0367l5789J3315
9337F3103r815L0351L2263M8605Q9805K0571N9640J36272J85161K30441K18717
9326A105114K07105k4895j55809k32895k28259j04486l9668l0558q6162j11727
9316B97760o2232j1768q0913j3535N4091O1345q680Q740N6628m6046o1129M287
$$ y = [36476, 65393, 51546, 34937, 17850, 63417, 119123, 154276, 140822, 202782, 210682, 196616, 139062, 136759, 124110, 70617, 91626, 68099, 11499, -30680, -38859, -39328, -7959, 34961, 50875, 54353, 45621, 90593, 160969, 120154, 26116, 63250, 106260, 49599, -7799, -8722, 39370, 52541, -9426, -29950, 41947, 97948, 66355, 69608, 93326, 72558, 5473, 7084, 51127, 70332, 99302, 125383, 130416, 136239, 136606, 119274, 93145, 60007, 46488, 65210, 85577, 49788, 63103, 53288, 83639, 115902, 164507, 254312, 274883, 334523, 470795, 655956, 886397, 1105114, 1312219, 1287324, 1131515, 898620, 670361, 565875, 526207, 495649, 409487, 297760, 235528, 223760, 142847, 129312, 183403, 244748, 236068, 244808, 301436, 255390, 194261, 198548]
9304A98548j5728J1600J0760K836P9447K8020k7220j95l0806r6165j3939N5022
9292B02180R4400L1219J7294k499O4901J54111K02849K58724L35379M11730N33226
9281B303514L32901m5500m16838m69469m34768l12881j77300j07531j03200m3704
9271E25224j03340p6097j2776l6863j2645J8205l914m2645L2439k9830n5051j4770
9259A87937K4162n770j2189L0385O6695q7159j4271j7997L4039K4735K7534L392
9247B61493Q198o99M3404J8927J3823K9562K8360M9764K01933K16968K39779J67945
9235A279457l2192j46752j92002j79258j79320j84039p4483l6868l7364k9251
9225A87928o729N3704j1283l0108K59l8168J8509K7548J828J6084K6858O912j5013
$$ y = [198548, 182820, 194420, 205180, 208016, 287463, 315483, 288263, 288068, 257262, 161097, 147158, 202180, 296580, 327799, 345093, 342594, 407495, 561606, 764455, 1023179, 1358558, 1770288, 2303514, 2636415, 2590915, 2174077, 1704608, 1269840, 956959, 779659, 672128, 568928, 525224, 421884, 345787, 333011, 296148, 283503, 301708, 297794, 255149, 287588, 257758, 202707, 187937, 212099, 206329, 194140, 224525, 291220, 204061, 189790, 171793, 205832, 230567, 258101, 261493, 269691, 268992, 312396, 331323, 345146, 374708, 403068, 452832, 654765, 871733, 1111512, 1279457, 1247265, 1100513, 908511, 729253, 549933, 365894, 291411, 254543, 217179, 187928, 181199, 234903, 223620, 193512, 193771, 155603, 174112, 201660, 203488, 219572, 246430, 253342, 238329]
9212B38329k0456m1250q7158l8510j7427j1718K4760P280J9846l6083M6607J8255
9200A02475J23m3082m7321L3590O4690J9434k806k414l0144k0342j011p65l119
9187F9308L0620L0153J3155P5406O7508j2157j02512o3453N3297O7953K1403K0696
9175B71377k5916n0461J0060m0941J5482N1043j7453J6018n0618r1452o2052k5136
9163d9o8119p7558o6951k3391J1552M8310J54577P1794j777o3931O167N7584L1169
9150G9377r2891k6197J7348K3656l7908k4159O0578k9873J8179M5700N5437Q1121
9138A70368J24473M4952k470l5500p985Q5762M8958J4354k3847j09740r2894n0531
9126A65900M183j3944J8754N132k4107Q927p5521j30528n1476j8637O270K521
$$ y = [238329, 217873, 176623, 89465, 50955, 33528, 21810, 46570, 53850, 73696, 37613, 84220, 102475, 102598, 59516, 12195, 45785, 110475, 129909, 127103, 124689, 94545, 74203, 73192, 72427, 69308, 99928, 130081, 143236, 218642, 286150, 273993, 171481, 108028, 161325, 229278, 250681, 271377, 245461, 195000, 205060, 164119, 179601, 230644, 213191, 229209, 178591, 87139, 25087, -49, -68168, -145726, -212677, -236068, -224516, -176206, -21629, 50165, 48388, -15543, -9376, 48208, 79377, -13514, -39711, -22363, 1293, -36615, -60774, -196, -30069, -11890, 33810, 89247, 170368, 294841, 339793, 337323, 301823, 293838, 379600, 428558, 442912, 419065, 309325, 216431, 165900, 170083, 156139, 174893, 180025, 155918, 164845, 89324, -41204, -92680, -111317, -105047, -102526]
9114a02526R854L3039n2014k6306N701j3407L8920j9817p800k0589p115L5512
9102a26548J1762k153k2023M507J7095L8657L6748l4282L6092J03139O6937m8582
9090H1349p3961L4433N98j6229K6150k1313j6603Q38J7855M0583P044l9078J3413
9077E5079l8089o310j0812j6809j1193o9807o581K0078k9970n6103o6239k833
9065b39589N4420Q4176M7975L4645l1178K6609L1254K7459j8610n2737r0841n3998
9053a80415l278K0834k083l70N5552J4825l117J4293J1868o2508l6086K7949L2534
9040a10002k8864L2060O6406N884q0803j3195N9621J7090j3101j5474k2553j7841
9028a20772L0683J0354m1751N7073L1960n8292o3058j5516Q6398K2047M6797M8690
$$ y = [-102526, -92672, -59633, -111647, -137953, -132252, -145659, -106739, -126556, -134356, -154945, -162060, -126548, -114786, -116939, -138962, -134455, -117360, -78703, -41955, -76237, -40145, 62994, 129931, 81349, 7388, 41821, 42419, 26190, 52340, 31027, 14424, 15262, 33117, 73700, 80744, 41666, 55079, 16990, 10680, -132, -16941, -28134, -97941, -104522, -84444, -114414, -170517, -236756, -239589, -185169, -100993, -53018, -18373, -49551, -22942, 8312, 35771, 17161, -35576, -126417, -180415, -183693, -162859, -164942, -165312, -109760, -94935, -98052, -83759, -71891, -134399, -170485, -142536, -110002, -138866, -106806, -40400, -34516, -115319, -128514, -68893, -51803, -64904, -80378, -102931, -120772, -90089, -79735, -121486, -64413, -32453, -90745, -153803, -169319, -82921, -60874, -14077, 34613]
9016C4613l1557K8764N3185K8433p5459k0841q7334j01211j2889J26555Q1537
9005B3796O9583O9998K2510k275R891j2371n6932n0699O086K6802k1298J1927
8993I7018J03336N210k8904J7547K7542N375p208R2045m070k8441N306K7297L2692
8980C44745n4917O4439M5828L5347J01246P4890M0246K9788P1997K9719r3415
8969F89913p6023l2058Q036K3319L5887K3054j1928J2535J40208J53708J28226
8958A094877J6269L4788R2087J07553Q6745J26187J08630J15732K16755K48113
8948B247736K95393L50457L94563L82395L27533M82373O61134Q92265J097696
8939G131545J324100J633184J977337K520915L574312N117599P230010J0122157
$$ y = [34613, 3056, 31820, 85005, 113438, 37979, 17138, -70196, -171407, -184296, -57741, 23796, 93379, 163377, 185887, 183612, 193503, 181132, 124200, 73501, 79587, 106389, 85091, 97018, 200354, 205564, 176660, 194207, 221749, 227124, 219916, 311961, 307891, 279450, 284756, 312053, 344745, 289828, 354267, 400095, 435442, 536688, 611578, 651824, 681612, 753609, 783328, 689913, 613890, 581832, 589868, 613187, 649074, 672128, 660200, 672735, 812943, 966651, 1094877, 1111146, 1145934, 1238021, 1345574, 1432319, 1558506, 1667136, 1782868, 1999623, 2247736, 2543129, 2893586, 3288149, 3670544, 3998077, 4480450, 5141584, 6033849, 7131545, 8455645, 10088829, 12066166, 14587081, 18161393, 23278992, 30509002, 40631159]
8931D0631159J4046032J9079116K6303764L7764649N0420239M7327808J4490069
8924B50062836k7014251m7321506m4831156l3315037k2726216j5445046j0815486
8917D8594138p809702n782741m320562l235989k521780j807035j333391j080604
8909B0702334r91777r41883q32791o48060m12716k04810l8090J45785L54851M24393
8899A7557236N82110P26373R47304J331474J871298K430536K913694L503392M598694
8890C6462111O389682Q998592J2689001J7924496K5269755L4481469M7216061
8883A89431167O9211843J00377030J08216278M8020027m5827959r7514771r6431609
8876B75482006p2204358m8888531l2768072k2762103j6347241j2147734r242163
$$ y = [40631159, 54677191, 73756307, 100060071, 137824720, 188244959, 235572767, 250062836, 223048585, 175727079, 130895923, 97580886, 74854670, 59409624, 48594138, 40784436, 35001695, 30681133, 27445144, 24923364, 23116329, 21782938, 20702334, 19710557, 18768674, 17935883, 17287823, 16875107, 16670297, 16632207, 16777992, 17132843, 17557236, 18139346, 18865719, 19813023, 21144497, 23015795, 25446331, 28360025, 31863417, 36462111, 42851793, 51850385, 64539386, 82463882, 107733637, 142215106, 189431167, 258643010, 359020040, 467236318, 515256345, 469428386, 371913615, 275482006, 203277648, 154389117, 121621045, 98858942, 82511701, 70363967, 61121804]
8869F1121804o931807n093159l836812k858539k357722k259340k288002k170890
8861C3325533j754983j395380j167225q12020n30505m33936l05003j91855j5345
8852B6719281J49836L86015O56291J013035J291604J717803K357933L173273M198756
8843D1663827N655178P786980J0919286J5241584K0944990K9789588M2311427
8836A74312860M9007397L0334347j0624548m1588891m7614678l8437074k6825977
8829H8563436j8115023j2570306r046001o721359n139778l895478l076446k333706
8821B7665339j837856j523095j469175j442952j314298j111790r65877p79126
8813A7221170o58456n35944m85537m26776m18119k32237k12548k12739j57235
$$ y = [61121804, 54189997, 49096838, 45260026, 42401487, 40043765, 37784425, 35496423, 33325533, 31570550, 30175170, 29007945, 28195925, 27665420, 27231484, 26926481, 26734626, 26719281, 26869117, 27255132, 27911423, 28924458, 30216062, 31933865, 34291798, 37465071, 41663827, 47319005, 55105985, 66025271, 81266855, 102211845, 132001433, 174312860, 223320257, 253654604, 243030056, 201441165, 153826487, 115389413, 88563436, 70448413, 57878107, 48832106, 42110747, 36970969, 33075491, 29999045, 27665339, 25827483, 24304388, 22835213, 21392261, 20077963, 18966173, 18000296, 17221170, 16562714, 16026770, 15541233, 15114457, 14696338, 14464101, 14251553, 14038814, 13881579]
8804A3881579P971J07920J50935P0649n6327k57511m18940m40364m95407m78531
8794A2071974l74002k19680l58474n84151p31021o97756o28628n13459n02657
8785G462146m01534l26847k94617k48142k11505j79080j93608j84318j83202k08211
8775E031082k26740j90321k29724j67732j02040p0180n2422k02273j42967m013
8765C642670j11497l0392R0155J68770J86412K50302K82083M16097M75770K70930
8755E641300j08248m82026m73268l14550k80730k41224j02458o2023j26468k41049
8745C209256l03606k50446j80739j05977o6901n0393j16539p6615n4751l7730
8735A965559m1482k9681R0545K7355n3331o6904n0391j5443l733q6840p489Q696
$$ y = [13881579, 13889550, 13997470, 14148405, 14219054, 14162727, 13905216, 13486276, 13045912, 12550505, 12071974, 11697972, 11478292, 11119818, 10535667, 9804646, 9106890, 8478262, 7964803, 7462146, 7060612, 6733765, 6439148, 6191006, 5979501, 5800421, 5606813, 5422495, 5239293, 5031082, 4804342, 4614021, 4384297, 4216565, 4114525, 4044345, 3991923, 3789650, 3646683, 3642670, 3531173, 3500781, 3590936, 3759706, 3946118, 4196420, 4478503, 4894600, 5370370, 5641300, 5533052, 5051026, 4577758, 4263208, 3982478, 3741254, 3638796, 3576773, 3450305, 3209256, 2905650, 2655204, 2474465, 2368488, 2301587, 2251194, 2134655, 2058040, 2003289, 1965559, 1924077, 1894396, 1984941, 2012296, 1958965, 1892061, 1841670, 1826227, 1822494, 1735654, 1728165, 1736861]
8723A736861l6881l9783N6564Q1593J7682L4613M1547R4778J77498K34560J67714
8712B566746J95765J58769L9414j04803j64965j33278j76364j27285j11372j79360
8702A963267n8324p8947n2691q0314j13539o786M8708j2974k9833L7595K2022
8691A638184k8005m1019n5533k6934L3137j5812n5800k5789K692L4743J0944j247
8679A469561J1729O5385L4364p61R630K0062j01047m0421j9268J6740j8419k0708
8667A426847n4714m7757k1350o3858j0665N7106J8199Q319p952j310J675J8704
8655A323244j8755q9200l1932p7506m3169M6520J1276l2417j4153M2033o6180
8644A049761n2070J0939L1841M5444L5345k2321q2714n4048J4852M8031O8492
$$ y = [1736861, 1699980, 1660197, 1716761, 1798354, 1816036, 1850649, 1892196, 1986974, 2164472, 2399032, 2566746, 2762511, 2921280, 2960694, 2855891, 2690926, 2557648, 2381284, 2253999, 2142627, 1963267, 1904943, 1825996, 1773305, 1692991, 1579452, 1572666, 1621374, 1608400, 1578567, 1616162, 1638184, 1610179, 1569160, 1513627, 1486693, 1519830, 1504018, 1448218, 1422429, 1425121, 1459864, 1470808, 1469561, 1481290, 1546675, 1581039, 1580278, 1589908, 1609970, 1508923, 1468502, 1449234, 1465974, 1447555, 1426847, 1372133, 1324376, 1303026, 1239168, 1228503, 1285609, 1303808, 1312127, 1304175, 1302865, 1304540, 1323244, 1304489, 1215289, 1183357, 1105851, 1062682, 1109202, 1120478, 1088061, 1073908, 1115941, 1049761, 997691, 1008630, 1040471, 1085915, 1121260, 1098939, 1016225, 962177, 977029, 1025060, 1093552]
8633A093552P6476L9752j6745J7479j1363l6136n4997r2506r6213o6146j7067
8622H36086J06536K1833K1180N5622m0919J6775N2346m0050m8919l0158J4532
8611I64864K180O6747J3990q1165q2751l5197K983l4586J6629L8518k8304l4006
8599H09902M3453k69N243Q9489K2796k3892r3448p5307k7200j8203o944L2236
8587G57856R0762N2788K9841m2159q400N272j9341k5481n7476l5593j2868k8554
8575G06647K9677P1044P051j6829J5708l3638k0615o0079m327r874K5150P2067
8563G81982n928k8030m9705l6400J4736M4534K9100o890p447k8365K6470J5886
8551G49943r008L3037O3325L712l8119r9254m3182M183K7704L2939L3705J7448
$$ y = [1093552, 1170028, 1209780, 1193035, 1210514, 1199151, 1163015, 1108018, 1015512, 919299, 853153, 836086, 942622, 964455, 985635, 1041257, 1000338, 1017113, 1069459, 1029409, 980490, 950332, 964864, 967044, 1033791, 1047781, 966616, 883865, 848668, 851651, 817065, 833694, 872212, 843908, 809902, 853355, 853086, 858329, 947818, 970614, 946722, 853274, 777967, 750767, 732564, 725620, 757856, 848618, 901406, 931247, 889088, 880688, 885960, 866619, 841138, 783662, 748069, 735201, 706647, 736324, 807368, 814419, 797590, 813298, 779660, 759045, 698966, 694639, 684765, 709915, 781982, 776054, 748024, 698319, 661919, 676655, 721189, 750289, 743399, 735952, 707587, 734057, 749943, 740935, 773972, 837297, 841009, 802890, 703636, 660454, 664637, 692341, 725280, 758985, 776433]
8539G76433m5237L7455N2458L771q912M3613n9617q880o602K8348L4799O1499
8527I09128O8865M689O3643L0190N3530K36646K64693J86041P8361l1476j77302
8516A687008k54806k41223p9141p9792n9839L8158O4413J06601Q5282J66168O9122
8505A501951j07725j04331r4938q6492q5110m7739q5573k610l370k2437K1741
8494H83367K1607n72m2805p2058k3124m939L6097N1368p2475k7596O1039J03768
8482I13677R6091O5356Q0422K00303L37047L72039N75008O70871M92160O270l93678
8471C415566m66413m83708m16884l05989j18939q362K6653J11383K63879L00694
8461B317880J15336r6407k97290k56378k51286k12384j89126o9921l7634j2709
$$ y = [776433, 731196, 768651, 821109, 824880, 815968, 859581, 799964, 791084, 784482, 812830, 847629, 909128, 977993, 982682, 1046325, 1076515, 1130045, 1366691, 1631384, 1817425, 1895786, 1864310, 1687008, 1432202, 1190979, 1111838, 1032046, 972207, 1010365, 1074778, 1181379, 1266661, 1432829, 1501951, 1394226, 1289895, 1194957, 1108465, 1023355, 975616, 890043, 887433, 884063, 861626, 883367, 904974, 904402, 861597, 789539, 766415, 761476, 797573, 848941, 776466, 748870, 809909, 913677, 1009768, 1075124, 1155546, 1355849, 1692896, 2064935, 2639943, 3310814, 3802974, 3809244, 3415566, 2949153, 2465445, 2048561, 1742572, 1623633, 1615271, 1641924, 1753307, 2017186, 2317880, 2433216, 2336809, 2039519, 1783141, 1531855, 1319471, 1130345, 1060424, 1022790, 1010081]
8451A010081m3974l3661r756J6301J1270k9710k2417L081n1294m7110J0049M1088
8439H53948J07044J28829R1690N0445J42872K51964K90927L86624M32761M02238
8429C139342L43062J58128j71876m22581n56192m32643l36310k33340q9731l6933
8419A360926l5658J02084J02980P4269l1860r5906j46938j50969p6932k5459j26054
8408I50483q1674n7362j3219J5103J8427l8843j0834l8283j4172P0726j3896q961
8396G77495o3705M228R7915J46818J20822J00508Q1097J82940K74271L36805K84083
8385B343277O3835j10410j88073j91757k45608k27678k22480j75030j50630j03056
8375G92390L379j1767J7940K4250L6883o0039j22351j1571K95n043k0284J4432
$$ y = [1010081, 966107, 932446, 922690, 938991, 950261, 920551, 898134, 901215, 849921, 802811, 812860, 853948, 960992, 1089821, 1181511, 1231956, 1374828, 1626792, 1917719, 2304343, 2737104, 3139342, 3482404, 3640532, 3468656, 3046075, 2489883, 2057240, 1720930, 1487590, 1397859, 1360926, 1325268, 1427352, 1530332, 1604601, 1572741, 1476835, 1329897, 1178928, 1101996, 1076537, 950483, 868809, 811447, 798228, 813331, 831758, 792915, 782081, 743798, 729626, 800352, 786456, 777495, 713790, 718018, 815933, 962751, 1083573, 1184081, 1265178, 1448118, 1722389, 2059194, 2343277, 2407112, 2296702, 2108629, 1916872, 1671264, 1443586, 1221106, 1046076, 895446, 792390, 795769, 784002, 801942, 826192, 863075, 803036, 680685, 669114, 669409, 664366, 644082, 658514]
8363F58514m4043o2655j0828j9087j3337j1174l9109m5051N0582L6477L5025m137
8351E31177K5503o586L5287K8693M8768Q880M1557K2357J11516J58747J23342
8340A129241N1005q9079j16555j12151j04392l2920o4795p0381q1457k8251m930
8329D75335K2667j8503l5492p939m0221O213p612j5744K1957M1016J0075n5749
8317C96003k2184k4654k6790k6238J9288N6304R796m8947J1443P0028k6607m7081
8305C40361M2720N910j551M5046n0823k5316L0595l7314j5044J2551k3812O3617
8293C86940J8919n2016M3468m5493j1961m8533l0682j2595M496r439j6507J8103
8281B44700O5573j7069m6191o3165N0730L3304O0826M3703p6669K8393K0510K613
$$ y = [658514, 614471, 551816, 540988, 521901, 508564, 497390, 458281, 413230, 463812, 500289, 535314, 531177, 556680, 550094, 585381, 614074, 662842, 671722, 713279, 735636, 847152, 1005899, 1129241, 1180246, 1091167, 974612, 862461, 758069, 725149, 660354, 589973, 508516, 480265, 475335, 498002, 479499, 444007, 436068, 395847, 402060, 394448, 378704, 400661, 441677, 451752, 396003, 373819, 349165, 322375, 296137, 315425, 371729, 381525, 332578, 344021, 414049, 387442, 340361, 383081, 388991, 387440, 432486, 381663, 356347, 386942, 349628, 334584, 347135, 323323, 386940, 405859, 353843, 397311, 351818, 339857, 291324, 260642, 248047, 252543, 243104, 226597, 244700, 310273, 293204, 247013, 183848, 234578, 267882, 328708, 372411, 295742, 324135, 344645, 347258]
8269C47258j740j6063K3191k5924l3762P673j4603L5839O7453l7719l1074O406
8257C26935m4366r155L2062r037L645o447n506l333R289q247m4680j4304J7922
8244B44778k4493J5398o241L4823j9016o3464m2930P8302Q9506n2416r720M8685
8232B93212l5007j9878o5460o692M5110N6000J8968k8391l6887L1488K2584L2745
8220C07792J4147J4489L9179P0050j9096p1005j06388l7170J0432o266k6372Q048
8208A97840J1706P467N86N2314L972n82J5885M9496r5937m5804O2531K678j4195
8195B47957J7709N1950m5840k6904m6254o2327o306j445L7703K7056k6010m562
8183A62727K0116N8982P3305j8048q2644j4113J7712l4759k7623J7350j1991J6443
$$ y = [347258, 345518, 329455, 352646, 326722, 292960, 300633, 286030, 321869, 389322, 351603, 320529, 326935, 282569, 273414, 305476, 296439, 300084, 293637, 288131, 284798, 294087, 285840, 241160, 226856, 244778, 220285, 235683, 229442, 264265, 245249, 181785, 138855, 217157, 306663, 254247, 244527, 293212, 258205, 238327, 172867, 166175, 211285, 267285, 286253, 257862, 220975, 252463, 275047, 307792, 321939, 336428, 375607, 445657, 426561, 355556, 249168, 211998, 222430, 216164, 189792, 197840, 209546, 217013, 217599, 269913, 273885, 273303, 289188, 338684, 242747, 196943, 259474, 262152, 247957, 265666, 317616, 271776, 244872, 198618, 136291, 129985, 128540, 166243, 193299, 167289, 162727, 182843, 241825, 315130, 297082, 214438, 200325, 218037, 183278, 155655, 173005, 161014, 177457]
8171A77457K916p759k6339O2605M8177j2825l4400m9555o4000O0379L6241j3980
8159A78917L4411L5046L3195q985k3419K3944J6595k6805l7688l7297N1241L9966
8147B79121J573j6493k0823j7677L6574M5418k5152m1447k5055P8857K1532l4185
8135B82243k8710j1626O1114L2769l0787q695J028j9772k1826K0833j913j5592
8123B59066m0451j6353N7845P983J5599n9537n4580n094O2005O682n7941j4784
8111A60440L8695l5706J2356m956q926K4930n7839n7923L7448P5011j0859P528
8099A80199M0303M8350r897o686p5558k4079M1383n289N1407k9008L429n073p8681
8086A30800j7200J4796J00719N3564m3497Q833j6102m6456n6168N0696R0387Q580
$$ y = [177457, 180373, 172614, 146275, 208880, 257057, 244232, 209832, 160277, 96277, 156656, 192897, 178917, 213328, 248374, 281569, 272584, 249165, 273109, 289704, 262899, 225211, 187914, 239155, 279121, 280694, 264201, 243378, 225701, 262275, 307693, 282541, 241094, 216039, 294896, 316428, 282243, 253533, 241907, 303021, 335790, 305003, 296308, 297336, 277564, 255738, 276571, 274658, 259066, 218615, 202262, 260107, 268090, 283689, 224152, 169572, 164478, 226483, 233165, 175224, 160440, 199135, 163429, 175785, 170829, 161903, 186833, 128994, 71071, 108519, 183530, 172671, 180199, 220502, 268852, 258955, 252269, 176711, 152632, 194015, 188726, 240133, 211125, 214554, 209481, 130800, 113600, 128396, 229115, 282679, 239182, 248015, 231913, 185457, 129289, 179985, 270372, 278952]
8074B78952m8391m1485n9117L3840L43n491L1711P331m1843L191l7224p278M121
8061A18660K5401K0296L5702K4064r914L5383J7663j7951m2524L850n9093m6672
8049A04865N1951M4588O609l5046K8784L0144K2088o788m6425n0046k6828N792
8037A29688P0839N1709n0296R791M6242o113j8935l114k0705n4157n5150m656
8025I5143L5420J9427O577J0579K3859k3268m7275k0568L4540n682N1632J8470
8013A98854l6715p18J2415N8893N6273L9511l7338n1346m1286n2365m8557r730
8001H7891M9254K8092j4117n605O6152K2091m9020J6141m774j2221n790o0243
7989A17851k6484O0917P2945J06094L7946q8600o5563p228p5128k8338O3032k5833
$$ y = [278952, 230561, 189076, 129959, 163799, 164142, 158651, 190362, 197693, 155850, 159041, 121817, 114539, 118660, 144061, 164357, 200059, 224123, 214209, 249592, 267255, 249304, 206780, 210630, 151537, 104865, 156816, 201404, 208013, 172967, 201751, 231895, 253983, 247195, 200770, 150724, 123896, 129688, 200527, 252236, 201940, 211731, 257973, 251860, 232925, 229811, 209106, 154949, 99799, 95143, 130563, 149990, 156567, 167146, 191005, 167737, 120462, 99894, 134434, 128752, 180384, 198854, 162139, 161421, 173836, 232729, 289002, 328513, 291175, 239829, 198543, 146178, 97621, 87891, 137145, 165237, 151120, 145515, 211667, 233758, 184738, 200879, 196105, 183884, 178094, 117851, 91367, 152284, 225229, 331323, 369269, 280669, 215106, 207878, 132750, 104412, 167444, 141611]
7977A41611n833l938J9867K0906l9304Q968j2266j1487o723R184L5994n0108m0940
7964F5931K7269L8311J5284L8059j5328K273K5767K9265j0166L775q11j9599m4265
7951A55765m6010m9499K541M80N0862N3467L1289K2725K0575L5272J8072l9367
7939B56172m1107l6710L4574k5844p8324J6411J663m2742P723P139O9169J00948
7927B69072m4373N842j7395k9281q0555n925j205N965n8822J9356Q8513N326k4675
7914A31843J1659M1132J7059j1346Q796N62O6688j6912p9769m6102l736l160r8
7901A16616q010M7206O5744J6086n3793m3037O1010j4412n2105j4026m739n9135
7889E7405r582P5146P9472q704m4803O889k7267m3708k3935l8321M7043K9875
$$ y = [141611, 135778, 131840, 151707, 172613, 133309, 142277, 130011, 118524, 111801, 120985, 156979, 106871, 65931, 93200, 131511, 146795, 184854, 169526, 171799, 197566, 226831, 216665, 220440, 219629, 200030, 155765, 109755, 60256, 62797, 63277, 114139, 167606, 198895, 221620, 242195, 277467, 295539, 256172, 215065, 178355, 212929, 187085, 108761, 125172, 126835, 84093, 91816, 98955, 168124, 269072, 224699, 230541, 213146, 183865, 103310, 97385, 96180, 102145, 43323, 62679, 151192, 156518, 131843, 143502, 184634, 201693, 190347, 199143, 199705, 266393, 249481, 169712, 123610, 119874, 116714, 116616, 108606, 155812, 221556, 237642, 183849, 140812, 201822, 187410, 135305, 121279, 116540, 57405, 47823, 122969, 202441, 193737, 148934, 155823, 128556, 84848, 60913, 22592, 69635, 99510]
7877I9510r635q823k0512p065O2045K7506L3828J0554J4487m3509m1102P867k0900
7864A04251N2089M1607O515l5770l4377p4506n85M6075J3160j2190n6234l7692
7852A2343J3501L9608j0468M2373M506l4400O3213n4050K2735M3536o2296j2704
7840F7897L7617K7404k4138M2813K2566n4338p0477k8429o3351j0122L7835M9434
7828C4711n0520L5254N0961l5671o257P1885J2193n2347J7732J9467n1889k1738
7816B3781j7046n5583L5480O3472M7257j5371m2777Q363k5138m8462p342O4120
7804C0754j7848q8094l3187J14734J01492n126j3379N7948m0732q4764j9559m0312
7792c8073L0864L0068M7118K8874j9601L3893J2927p7954l1586L8146P0068n598
$$ y = [99510, 89875, 81052, 60540, 53475, 115520, 143026, 176854, 187408, 201895, 158386, 117284, 125151, 104251, 156340, 197947, 204462, 168692, 134315, 59809, 59224, 105299, 118459, 106269, 50035, 12343, 25844, 65452, 54984, 97357, 101863, 67463, 130676, 76626, 99361, 142897, 80601, 67897, 105514, 132918, 108780, 151593, 174159, 119821, 49344, 20915, -42436, -52558, -14723, 34711, -15809, 19445, 70406, 34735, 28478, 100363, 112556, 60209, 77941, 97408, 45519, 23781, 6735, -48848, -13368, 50104, 97361, 81990, 39213, 47576, 22438, -26024, -33366, 30754, 12906, -75188, -108375, 6359, 107851, 102725, 89346, 147294, 106562, 21798, 2239, -38073, -7209, 22859, 69977, 98851, 79250, 113143, 126070, 48116, 16530, 54676, 124744, 119146]
7780A19146l8058j3501m8717k4460M2231O2071L9308n3173l8669l0096J8731k8808
7768F005k9271L8307M2118p8622m8192j2648N5322J06271L0291L0061L4168l0954
7756A42856l6981n9048j2993O2450l3709k1846l7528J4780J6605K2038l2970m96
7744B3158l3510o4435M0645K7215o225M1846k0982j5188N1741J7792J3118O5973
7732A41148o3072m0167j2672O525n0822J882j7993o950N2503J02312N2402k1961
7720A43135n4481k9440j5756Q992p636J1013K3137j4881n8368k5117J9287P8765
7708G8650l33l5914L2837L2136L3598n0032n5010O7542L9335L0968k3343k0703
7696A29731l0371j9352j7411m3264O533L4049p0851O09K3806J4135J0854K9267
$$ y = [119146, 81088, 67587, 18870, -5590, 36641, 98712, 138020, 84847, 46178, 16082, 34813, 6005, -23266, 15041, 57159, -21463, -69655, -82303, -26981, 79290, 109581, 139642, 173810, 142856, 105875, 46827, 33834, 96284, 62575, 40729, 3201, 17981, 34586, 56624, 23654, 23158, -10352, -74787, -34142, -6927, -13152, 28694, 7712, -7476, 44265, 62057, 75175, 141148, 78076, 37909, 25237, 31762, -19060, -17178, -35171, -42121, 10382, 112694, 165096, 143135, 88654, 59214, 43458, 52450, 44814, 55827, 78964, 64083, 5715, -19402, -115, 78650, 78317, 42403, 75240, 107376, 140974, 90942, 35932, 103474, 142809, 173777, 150434, 129731, 99360, 80008, 62597, 19333, 25866, 59915, -10936, -10327, 13479, 27614, 38468, 67735]
7684F7735J1318k2550J7708k3962j3780k5171P503M2473m7876r664N0049J6247
7672G0030M04K8577j0391j8142m5722k9030k2386l5946K5090N6575M6936P7746
7660A43741R804l1938l1685l7933n101O8875k886m4772K8781l9337K2901j454
7648G8996m6839o883K2134N1560P918k2081J9229N0177o5480m3825M0915l1196
7636E4625M9370N796o1075m7350j690L9315Q160m5823l5217Q007N845N6874K131
7623C8968p8493J924M7207K7098K9890r386o4524n981m3142m5243j3868l2265
7611a47815m962N6413M5576K7527L912k0695N8155P4778M6438m8144j5501J1154
7599H6836J3044J0615J5237k9069k5657L6350P7375k7330r3467r3644K3790k5791
$$ y = [67735, 79053, 56503, 74211, 50249, 36469, 11298, 18801, 61274, 13398, 3734, 53783, 70030, 70434, 99011, 88620, 70478, 24756, -4274, -26660, -62606, -37516, 19059, 65995, 143741, 153545, 121607, 89922, 51989, 46888, 115763, 112877, 68105, 96886, 57549, 80450, 78996, 32157, 25274, 47408, 98968, 106886, 84805, 104034, 154211, 88731, 44906, 85821, 54625, 103995, 109791, 48716, 1366, -324, 38991, 47151, 1328, -33889, -25882, -20037, 36837, 38968, -39525, -37601, 9606, 36704, 66594, 57208, -7316, -13297, -56439, -101682, -115550, -147815, -152777, -96364, -50788, -23261, -19349, -40044, 18111, 92889, 139327, 91183, 75682, 86836, 99880, 110495, 125732, 96663, 71006, 107356, 184731, 157401, 63934, -29710, -5920, -31711]
7587c1711M192K1918J4172n888j0524J4986K4575l4568n964O157L7142Q465K0091
7574F3043n7865J5843N2907k7785P664k8939N309K4165k8284K5244k0721l0447
7562A34K7199O6115o731M9933j5707k3668M822m0102l6383N0543j8962o7867l7620
7549d8294K3809M0204O3405K5167j792j4982M975r250k3566k091l1916p018O6826
7536H5477m1367k4321L8005l4708n4133m5574O0029M1809L2134L858R522K4295
7524I5026k3313m5933m5521j3229L851L7495Q7591L8446j9750m622n9629k9516
7512B0896M6490M7382J352m5416m4360L3232M1495J1357l4418p0175J8760O2201
7500H8796M520j4113n3324k7903L7524Q0291l971l0487j2191j0533n625L8641
$$ y = [-31711, -27519, -5601, 8571, 2683, -7841, 7145, 31720, -2848, -8812, -2655, 34487, 42952, 63043, 5178, 21021, 73928, 46143, 53807, 24868, 30177, 54342, 26058, 51302, 30581, 134, 27333, 93448, 86717, 136650, 120943, 97275, 102097, 61995, 25612, 76155, 57193, -10674, -48294, -24485, 15719, 79124, 104291, 102499, 87517, 92492, 83242, 59676, 57585, 25669, 18651, 85477, 44110, 19789, 57794, 23086, -31047, -76621, -16592, 25217, 57351, 61209, 70731, 95026, 71713, 25780, -19741, -32970, -29119, 8376, 95967, 134413, 114663, 110041, 50412, 20896, 67386, 114768, 116120, 70704, 26344, 59576, 101071, 112428, 78010, 7835, 26595, 88796, 93316, 79203, 25879, -2024, 35500, 115791, 111820, 81333, 69142, 58609, 52984, 91625]
7488I1625L0427J1888j8198j6880R219n1800m5451o6966j3636O0081J9254p265
7476B298l9294J4755P137L394J4380Q612N6728L4449k4919J4283j1111m2868l0982
7463F862k8374K4100P6615J2090o4196k5342J093J5677N150P86k7626J2996L5451
7450D5282L6606J1467k7161m8522l0279N5045o689P095L9589q716n7615o8834
7438e2732J2265N7658M2940l1950k7835J0155L786l1707K5998N0556m350l7811
7426A6973m1430k8432K2088j7858R053P7324M7872r343P315L5056L566M700l9576
7413H7308p0676O129K4794l0439l8961Q121J2711M367k1758m909M8294L2509M3863
7400A01353o51R752k5480k8440j3189l1411m6772n7385L5506q434K7692m2465
$$ y = [91625, 122052, 133940, 115742, 98862, 108081, 56281, 10830, -56136, -69772, -9691, 9563, 2298, -36996, -22241, -15104, -11710, 2670, 11282, 68010, 102459, 77540, 91823, 80712, 37844, 6862, -21512, 2588, 79203, 91293, 27097, 1755, 2848, 18525, 23675, 24461, -3165, 9831, 45282, 81888, 93355, 66194, 17672, -12607, 42438, 35749, 42844, 82433, 73717, 16102, -52732, -40467, 17191, 60131, 28181, 346, 10501, 14287, -17420, 8578, 59134, 54784, 16973, -24457, -52889, -30801, -48659, -39606, 37718, 85590, 76247, 83562, 118618, 122184, 126884, 87308, 16632, 22761, 47555, 17116, -21845, -13724, -1013, 3354, -18404, -23313, 24981, 57490, 101353, 100702, 110454, 84974, 56534, 43345, 11934, -34838, -92223, -56717, -65151, -37459, -79924]
7388g9924M5143J6288L0188M324K2853p195K7132P707J2819n7070k4048K9488
7376B7705M6263K0941J6503m6227o3912M6124J3205j08589l4737M2883M4394L3679
7364C8232l8848J410N8236k6455q0667l1515L3854N8390m089J4173K0149l3196
7352I674n811J0486n336j6814j0464Q102K8769L1826n363o0357P4851j962n2759
7339D842o0341L7534J5660j4351m1482p660N5713M102j2418k3566k166J9237r432
7326c4328p011J7403J0208J2822k6285k3237L2427J7246J2172K705K1991K0470
7314E6583R9007j4590l6724q6045j3076j3690L6045P8504n1362k7329k8104Q6388
7302H5607M8405K243p5927n1771k6698J626j7722o569N1799K8339l0384M429M0279
$$ y = [-79924, -34781, -18493, 11695, 16019, 38872, 31677, 58809, 66516, 79335, 22265, -1783, 27705, 73968, 94909, 111412, 65185, 1273, 47397, 60602, -47987, -82724, -39841, 4553, 38232, -616, 794, 59030, 32575, -48092, -79607, -45753, 12637, 8548, 22721, 42870, 9674, 3863, 14349, 9013, -7801, -18265, -10163, 18606, 50432, 45069, -15288, 59563, 57601, 4842, -55499, -17965, -2305, -16656, -58138, -65798, -10085, -5983, -18401, -41967, -44133, -24896, -34328, -41339, -23936, -13728, -906, -27191, -50428, -18001, -755, 11417, 14122, 36113, 56583, 155590, 141000, 104276, 18231, 5155, -8535, 27510, 106014, 54652, 27323, -781, 85607, 134012, 136255, 60328, 8557, -18141, -16515, -34237, -40806, 10993, 39332, 8948, 13377, 53656]
7289E3656J9205l1365k0995o8169m5005j1107M6369R381q394j6266O6516O9640
7277F3466K475n3480O2871j314m985m5615k7774j6078p336O1856j6602m3190k3926
7264d9632L1928M2438j8566N7203L6097J9234N517p1288l9219j0772J3950k2158
7252e268l4513K3173L3931J303M310N0387j6706m7996P229J6078O2781L8803n6785
7239G6727L0862k6077M3578l2725k6914j5276M4977o927R428j2611J0301o4285
7227C1058l1356L2882j3353n7458j4884K4703P3309J1793j1304l9797K0205k5438
7215C60J4986k1971k2086K0122M9517K0054m014j9222K6686L6089l7833r7209
7203c4521k1851L8001J8354L9184P904j8767m791m407j6555l2575J809j401o5460
$$ y = [53656, 72861, 41496, 20501, -47668, -92673, -103780, -57411, -48030, -56424, -72690, -6174, 63466, 65941, 12461, 75332, 74018, 69033, 23418, -4356, -20434, -27770, 34086, 17484, -25706, -49632, -17704, 24734, 6168, 63371, 99468, 118702, 124219, 52931, 13712, 2940, 16890, -5268, -39781, -16608, 17323, 18626, 22936, 73323, 56617, 8621, 15850, 31928, 94709, 133512, 76727, 107589, 81512, 125090, 92365, 65451, 50175, 95152, 88225, 97653, 85042, 95343, 31058, -298, 32584, 19231, -38227, -53111, -28408, 44901, 56694, 45390, 5593, 25798, 360, 15346, -6625, -28711, -8589, 40928, 60982, 56968, 37746, 64432, 100521, 62688, -34521, -56372, -18371, -17, 39167, 47071, 28304, 23513, 19106, 2551, -30024, -28215, -29616, -95076]
7190i5076L1319M5023P2134N8168K723k3283j3048m2082p4043k6230J9284o303
7178e1414R221P3270K1398J2499l2880j0167J0388m4312k0737M347O430K1263
7166f94l9480L9320J6320k8126n3592K1058M4778O1402R365m1523m905l9983k5064
7153d1124J00851N2805l9187k02j4781m1865k1462j2685k800j3462l0930l409
7141f8251L8701N6985O2394L5048m6833m8336n0374O830J2261K439j4376J9625
7129F113J7929l2361P996N94k793L0992K426l2495j3372J5249N05M6645K6936
7116G4364m0490l175M4962L1486K2260l098m1692J4905p654n5649l9830K465M909
7103C763l1982n65K3244J5867n084k788k1405n4308P1948P184L918l6292n8823
$$ y = [-95076, -63757, -18734, 53400, 111568, 114291, 91008, 77960, 35878, -38165, -64395, -45111, -51414, -42193, 31077, 52475, 64974, 32094, 21927, 32315, -11997, -32734, -28387, -21957, -694, -40174, -854, 15466, -12660, -66252, -45194, -416, 60986, 70351, 28828, 23923, -16060, -41124, 59727, 112532, 73345, 73143, 58362, 16497, -4965, -17650, -20450, -33912, -64842, -68251, -29550, 27435, 89829, 124877, 78044, 29708, -20666, -13836, -1575, 864, -13512, 6113, 24042, -8319, -323, 271, -2522, 28470, 30896, -1599, -14971, 278, 783, 47428, 74364, 33874, 30699, 75661, 107147, 129407, 126309, 84617, 99522, 91868, 36219, -3611, -1146, 3763, -28219, -28784, -5540, 10327, 5243, 2455, -18950, -73258, -1310, 5874, 9792, -26500, -85323]
7090h5323J0260L4173l8225J4469k4782l443L9349L1794j672o4499N913P3073
7078h913P1792K2179k4279k744l1348J9205K7783m7376j2137l1709J1319L7415
7066C1187j5033K3763J2189p393n036k4367k2414j932j0373Q6834J0371l7943
7054C9853J530J5192J6737j8383n9864j2339K2702m018L1076j7926l831O0640
7042G1369M0729K7097K1193p1671o3477j9070L9003L9621k5895r3306n8738j516
7030i4661M7498M6967K3497L6767Q974L7290p323m2508l4327n9151M4204j2930
7018e703l9521L384J2716M9803n397M817J6002L9003L6785Q623J7587p6913q4827
7005b3641k5728J5257N8005L5536j13025n574L0007O269r749j0034o0760Q808
$$ y = [-85323, -75063, -40890, -79115, -64646, -89428, -92871, -53522, -21728, -23400, -87899, -81986, -8913, 62879, 85058, 60779, 58035, 26687, 45892, 73675, 26299, 14162, -17547, -6228, 31187, 16154, 39917, 52106, 44713, 39677, 15310, -7104, -9036, -19409, 67425, 77796, 39853, 41383, 56575, 73312, 54929, -4935, -17274, 5428, 1410, 32486, 14560, 10729, 71369, 112098, 139195, 160388, 88717, 25240, 6170, 45173, 84794, 58899, -34407, -93145, -94661, -47163, -196, 23301, 60068, 69042, 106332, 99009, 56501, 22174, -36977, 7227, -5703, -45224, -41840, -29124, 20679, 15282, 20099, 36101, 75104, 111889, 120512, 138099, 61186, -23641, -49369, -34112, 23893, 59429, -53596, -59170, -29163, -22894, -32643, -42677, -103437, -94629]
6993i4629M3765L1444Q5592L6996l3608k1722P177l9771p657j2661k9796j8630
6981e3500K790N3818N5873j5518n7340r251K4103K7453M8284l2663k8187J0631
6969B6493K6989l5185k8093M9717j4734n46L3578j0865j7896m5240m5956l4195
6957i5933k2472P1588O1104K7559K2765K6677j3344q432m2992l1417L5826j3742
6945A7187j5491l173J1001j0961K932j0846K2027k8454m2204j2710J0457l8152
6933i8387j0291L7418M9062n374J1864L5828M8276k6172j0158j2992l4840m9534
6921f5300n5739P4898M8734l06J3364K1636K9878K5715K9161k779q8100m2949
6909a1787N5961M0802q161k8846K5788M0294l0093r4492q8157N8044J2439K6809
$$ y = [-94629, -50864, -19420, 66172, 103168, 69560, 47838, 55015, 15244, 7587, -5074, -34870, -53500, -50710, 3108, 58981, 43463, -13877, -23128, 975, 28428, 76712, 44049, 15862, 26493, 53482, 18297, -9796, 39921, 25187, 24641, 58219, 47354, 29458, -15782, -61738, -95933, -118405, -46817, 14287, 41846, 64611, 91288, 77944, 69512, 26520, -4897, 30929, 17187, 1696, -1477, 9524, -1437, 1495, -9351, 12676, -15778, -57982, -70692, -60235, -98387, -108678, -71260, -22198, -27572, -15708, 20120, 68396, 42224, 32066, 19074, -15766, -65300, -121039, -46141, 2593, 2287, 15651, 37287, 67165, 92880, 122041, 119262, 31162, -11787, 44174, 84976, 76815, 47969, 73757, 114051, 83958, -10534, -98691, -40647, -28208, -1399]
6897a399M4458M2370M5808l4939n5536l9924k2357R149J6128L3750l0895L859
6885A0472P686p5793k3865O1184L7803L2395o5123n2567M0341J6204o3145L4804
6873c9604K1427j7300k5304M0560K1316l729m2187j8439M3612J5162N220m4607
6861d3873J6252L1107L277k2879p254j6244k0203m425J0663N7380K9340K9656
6849F2797q77m0459m3790l7973L1866R887K6259N721M9513K7393k4415n1963J7006
6836C0965m845J3145j3510l4492J9874O0508n0128r4047K610K4504J4158O256
6824b5002L4774M855l8333N8174r309n1096m288l2909r168L0227j533N2668Q325
6811A7385m8759j8102O457L0224J4064K9367K9964K2809M2124j29k9273m8860
$$ y = [-1399, 43059, 85429, 131237, 96298, 40762, 838, -21519, -12370, 3758, 37508, 6613, 10472, 18158, -57635, -81500, -20316, 17487, 49882, -15241, -67808, -27467, -11263, -74408, -39604, -18177, -35477, -60781, -20221, 1095, -2634, -44821, -63260, -19648, -4486, 734, -43873, -27621, 3486, 6763, -16116, -23370, -39614, -59817, -64242, -53579, 3801, 33141, 62797, 61920, 21461, -22329, -60302, -28436, -18549, 7710, 13431, 62944, 90337, 65922, 13959, 30965, 26120, 39265, 25755, -8737, 11137, 71645, 21517, -72530, -69920, -45416, -31258, -25002, 9772, 14627, -23706, 34468, 25159, -25937, -30225, -63134, -72302, -42075, -43608, 9060, 17385, -31374, -49476, -43019, -12795, 1269, 30636, 60600, 83409, 125533, 125404, 96131, 47271]
6799D7271l794j8219n4609j3176L6814J6981l0547k9581M4376P2612m4279n2701
6787b8852M3735L193J8172J8335n0528j9091Q0589K3185l1609l5869l8002m913
6775b1655j0297J6544M0189P1081K3307n9540k5708J9455L5253j2208m4817J6951
6763D8555l8438o3985P8216k2530l658Q708o2361L2584L1601l7705n1111L2773
6751d7351M6326n771K6691o242k1372l7919m6169J9080O0643j2506k5560O9091
6739A8941O9470j6503j7172k6710l4374j9986L711m1257j2371J6524M1037O7415
6727D8725J7579k6128p640j3289L8478q7643M985R3449L2506J6667m3368k5380
6715D8941P406j4123K0987m3692r723J3563m1571j07243J6649j2851P0524O4299
$$ y = [47271, 43477, 25258, -29351, -42527, -5713, 11268, -19279, -48860, -4484, 68128, 23849, -28852, 14883, 18076, 36248, 54583, 4055, -15036, 65553, 88738, 57129, 21260, -16742, -21655, -31952, -15408, 24781, 95862, 119169, 59629, 33921, 53376, 88629, 76421, 31604, 48555, 10117, -53868, 24348, 1818, -1840, 6868, -55493, -22909, 8692, -29013, -80124, -47351, -1025, -6796, 19895, 13653, -7719, -45638, -91807, -72727, -12084, -24590, -50150, 18941, 88411, 71908, 54736, 28026, -6348, -26334, -22623, -63880, -76251, -59727, -18690, 48725, 66304, 40176, 32536, 19247, 57725, -29918, -24933, 68516, 101022, 117689, 74321, 48941, 56347, 42224, 63211, 19519, 9796, 23359, -18212, -125455, -108806, -121657, -51133, 13166]
6703A3166L1063j5713k9634k743K319m8604k6950K4797r530O829K1916k2481m546
6690f0111k5055K2485N6512J0552J3784l751K4795P345r549j5090l2386J3448
6678B979N7883m975l2660K3825P7551q157p3418m5272k887l6149K9511K7912K6546
6665D2689n4498m9117N3437K6572J3644k6903j6153j0087k1758J6077Q9563J5564
6653G9030L2812l3394m0085q2660j0436J9463l3141r795L7787l1537p356P6703
6641b609O6323j3404j5447o3080j04516n5845J556Q1422K4924K8562L6824M5492
6629C0202L4852l7308n3150r194L8840N5264N23k8480J4404l922J9199J9122j4232
6616F6120j0197J4016N2251j1470l1616m1433j7326j4346K4832j5273k2722q252
$$ y = [13166, 44229, 28516, -1118, -3861, -1542, -50146, -77096, -52299, -61829, -55000, -33084, -55565, -60111, -85166, -62681, -6169, 4383, 18167, 14416, 39211, 46556, 37007, 21917, -10469, 2979, 60862, 55887, 23227, 47052, 124603, 116446, 43028, -2244, -5131, -41280, -11769, 16143, 42689, -11809, -60926, -7489, 19083, 32727, 5824, -10329, -20416, -42174, -26097, 63466, 79030, 111842, 78448, 38363, -44297, -54733, -35270, -68411, -78206, -40419, -71956, -79312, -2609, 63714, 50310, 34863, -28217, -132733, -188578, -187022, -105600, -80676, -52114, -15290, 30202, 65054, 27746, -25404, -34598, 4242, 59506, 60029, 31549, 45953, 42031, 61230, 80352, 66120, 55923, 69939, 122190, 110720, 79104, 37671, 20345, 5999, 30831, 15558, -7164, -15416]
6604a5416j1300J068M052k6897k9304L6239M6611J4233k4252j4060K0500j3287
6592a1813l2241l4604l7100r906O4351M9511J2086P046J285l950M9291N556N5798
6579A15310k0575p4803l8532J7235M6039K9452m0745n9964J3988M6172p963k6622
6567a008J2133M1875r177n3595m7604J2214J3395o2414O964L889K0621L0959j7708
6554d9456j6305P760L2345R773K6142j3874p1476O0627Q7011n604j7196p1346
6542b1599L4191L771j6104k6419m6714M7475K3886n5960p3030j4371O4435N3818
6530b6621N8190K7254m6758p1030P207O0100M6359m8221k3842k3560p847K791
6518d5978K751L3361K775L586o350J7011J6657k8934m7969K5324k1861J803J6799
$$ y = [-15416, -26716, -25648, -21596, -48493, -77797, -41558, 5053, 19286, -4966, -19026, 1474, -11813, -44054, -78658, -115758, -125664, -61313, -11802, 284, 7330, 8615, 4665, 53956, 59512, 115310, 94735, 19932, -18600, -1365, 44674, 74126, 33381, -26583, -12595, 33577, 25614, -1008, 11125, 53000, 43823, -9772, -57376, -45162, -31767, -94181, -87217, -83328, -62707, -31748, -49456, -65761, -58001, -25656, -15883, 10259, -3615, -75091, -14464, 72547, 66943, 49747, -21599, 12592, 16363, 259, -26160, -72874, -25399, -1513, -57473, -130503, -144874, -80439, -26621, 31569, 58823, 12065, -58965, -51758, 8342, 54701, 6480, -17362, -40922, -48769, -45978, -43227, -9866, -7091, -3505, -9855, 7156, 23813, -5121, -53090, -27766, -49627, -47824, -31025]
6505c1025M2601O590l9816j9759o623M4653r006n8261L4837K5252J853R8364k6271
6492F3389m8237J4762L4422j0903j9708n6183n3377l4899k956K8183L1884N685
6480d7938M5240j615n2928L772k902O3836L7512M7834j6894m2408L8514R134m7426
6467C3731m8840K3102P0820q999R884j3580l9033k3719J31k3195O5335L3677m0639
6454C8675j8796k1486l5746m1890o6487O5333J15367j4039K473J1943k1485j4469
6442f07m0173l5756r106M655K2326M6953L5440M6072R832o7436J2357J0783o7837
6429c2497l2052k1629K0574J199m099j2837o916L9341M0327J612J0481m4860j9399
6416f0755Q2366k8478q1186k783N2789J8589L4512K1218r813J0002m0240J6035
$$ y = [-31025, 11576, 18166, -21650, -41409, -48032, -3379, -12385, -70646, -35809, -10557, -8704, 89660, 63389, 15152, 29914, 64336, 53433, 33725, -22458, -75835, -110734, -113690, -85507, -53623, -47938, -2698, -4313, -57241, -53469, -56371, 7465, 44977, 92811, 75917, 33509, 72023, 81157, 33731, -15109, 7993, 78813, 69814, 79698, 66118, 27085, 3366, 3497, -19698, 45637, 79314, 38675, 19879, -1607, -37353, -79243, -145730, -80397, 34970, 20931, 23404, 35347, 13862, -607, -40780, -76536, -85642, -80987, -58661, -11708, 23732, 69804, 79636, 12200, 24557, 35340, -32497, -64549, -86178, -65604, -64405, -68504, -81341, -88257, -48916, -8589, -6977, 3504, -41356, -60755, 21611, -6867, -88053, -90836, -38047, -19458, 15054, 36272, 26459, 36461, -3779, 12256]
6404A2256l0562m3644Q1144N9662j3161L4334Q730l8018o6567J8421L3446K2738
6392G8779J5903l6853m1305o985o49r535l5169j9255M0244L2826l2600O574k459
6379a0484n196L3147r696j2821J8285k0106r22r311l9284k3741k149M1789O3731
6366B3242k1044r0637l1365k4809j6545J9057N8125O3444l3830k4704o218N9361
6354b5923P824m6868o5314M6000O1205O7814M273m3017J1168l4474k8422J3136
6342c2598L1770p363m2094r201Q853m2130o7238J2226K9006J4725P484N6784k0084
6329e9860L3183P3431J1870j0870r5924p730O2117K8733J6592n1748p6976L9277
6317c7905K48J1374J4551K7932j1758L320j2478k587j7560M4019J6500m1537q5990
$$ y = [12256, -18306, -61950, 19194, 78856, 65695, 100029, 108759, 70741, 4174, 22595, 56041, 78779, 94682, 57829, 16524, 9539, 8890, -645, -35814, -55069, -14825, 18001, -14599, -8025, -10484, -15680, 17467, 7771, -5050, 13235, -6871, -7793, -17104, -56388, -80129, -82278, -40489, 23242, 2198, -88439, -119804, -144613, -161158, -142101, -83976, -20532, -54362, -79066, -85284, -25923, -18099, -64967, -130281, -84281, -23076, 44738, 49011, 5994, 17162, -17312, -45734, -32598, -828, -8191, -50285, -59486, -50633, -92763, -160001, -147775, -118769, -104044, -96560, -39776, -59860, -26677, 46754, 58624, 47754, -48170, -55900, 6217, 34950, 51542, -206, -77182, -37905, -37657, -26283, -11732, 16200, 4442, 7762, -4716, -7303, -24863, 19156, 35656, -5881, -91871]
6304i1871P858K2028K5063N8042k4424k0566M1775L5410K4539j1469n2389l9042
6292b5046Q2390O197P93k6353m3707k1839L153L489n7449O279O1087J8998j4456
6279f464K3916P9209M7956o2370o0147o560L542m333L7027L7765J362p6735n3907
6266c9739l0750M4000J6540m9385J1545K0392J9058n651P439m1263o798O0638
6254F026k3362k7512j339L7307N2195j2988l9746J5234L0710k6571P993q489J3742
6241B3200Q142n1381m4615J036k2824K0049N0698n162j607k843Q090N4203l2254
6228D732q2500n8048R448L1557K4242N3262J5526K326K6167J7007m304N952J9523
6215F4890l5940n356Q378j2575R405O670k4727j9938J7502m209l6039P0334L9879
$$ y = [-91871, -84013, -61985, -36922, 21120, -3304, -23870, 17905, 53315, 77854, 66385, 13996, -25046, 57344, 63541, 64334, 37981, -5726, -27565, -24412, -20923, -78372, -72093, -11006, 7992, -6464, 17452, 96661, 144617, 82247, 22100, 15540, 19082, 14749, 51776, 89541, 90903, 14168, -39739, -70489, -26489, -9949, -59334, -47789, -27397, -8339, -13990, -6551, -47814, -54612, 6026, -17336, -44848, -46187, -8880, 43315, 30327, -9419, 5815, 36525, 9954, 17947, 9458, 23200, 31342, -20039, -64654, -63618, -86442, -66393, -15695, -20857, -22464, -25307, -17217, 36986, 4732, -77768, -135816, -126368, -94811, -70569, -17307, -1781, 545, 26712, 43719, 39415, 45367, 64890, 28950, 23594, 31972, 19397, 28802, 35472, 10745, -9193, 8309, 4100, -31939, 38395, 78274]
6202G8274l2650m9997l136J0606K4047K8111m5284O061L062J9093k9897o8118
6190e9828M326N2670K1256N702j9213P8357M3710o7325q7359o4075J5186k3691
6178a00284O307J9155K8069L1409k7333k9469j9964O4967O1521k0054n930Q0844
6166H9238m7932p2112k6828P3616M3613l4716k8957P8168L1750k9569m0370K9585
6154F5486J6520o480M3379l3365o4408o0031k7598o090N0588O7101Q078M835J7465
6141G5480k1489o3985l5708J7193L4607M3556L6858j1420l8547l1877p1568J6873
6129e0027K4545L0426K6611O142k5056o286q997K3419L3317M0868M897o9729J2196
6116D2326J5797l9412m6596o7928L6170M8181L684j2698q7441j2003M1185L4710
$$ y = [78274, 45624, -4373, -7509, 3097, 27144, 55255, 9971, 16032, 19094, 38187, 8290, -59828, -55502, -2832, 18424, 24126, 4913, 83270, 126980, 59655, -27704, -91779, -76593, -100284, -93977, -74822, -46753, -15344, -42677, -72146, -92110, -27143, 34378, 14324, 8394, 89238, 41306, -30806, -57634, 15982, 59595, 24879, -4078, 74090, 105840, 76271, 35901, 65486, 82006, 75526, 118905, 85540, 21132, -38899, -66497, -72587, -21999, 45102, 53180, 58015, 75480, 53991, -9994, -45702, -28509, 6098, 49654, 86512, 75092, 36545, 4668, -66900, -50027, -25482, 4944, 31555, 37697, 12641, 6355, -2642, 20777, 54094, 94962, 99859, 30130, 42326, 58123, 18711, -27885, -95813, -59643, -11462, -7778, -20476, -107917, -119920, -78735, -44025]
6104d4025j7900o9324J4831J14408N3157L6900n334n6993k2968m146m8138j2198
6092f1730m6632j1124j1942M2595J4450n1044P054N6964j0525j1806N4685N7540
6080B8485M578L7871m2582j632P8952l1833o7370o8708O652j4320j1867j4512
6068i6286j120m766R589L7760K3148K3125M4765n4949k1876k4006L6310L7276
6056H970J8118j6492o5548m3626M1834L1609K8516j251k8690N333K8604O009K2743
6043C6129o4599j2480N9233J2596O019q706m5318k1139J9567K0477p392n2193
6031e7806P952N1369M3268o49j3419k3506M4811q2600k1461P3002j7728q5310
6019h2077p152j1423o617K6490P3646K9767o3866m6987n5030L2905j1973m172
$$ y = [-44025, -61925, -131249, -116418, -2010, 51147, 88047, 82713, 25720, 2752, -1394, -49532, -61730, -108362, -119486, -131428, -88833, -74383, -125427, -118373, -61409, -71934, -83740, -29055, 28485, 33063, 70934, 28352, 26720, 105672, 73839, 6469, -62239, -55587, -69907, -81774, -96286, -97406, -102172, -92583, -54823, -31675, -8550, 36215, -18734, -40610, -64616, -28306, 8970, 27088, 10596, -54952, -98578, -56744, -25135, 3381, 2130, -26560, -21227, 7377, 13386, 36129, -28470, -40950, 18283, 30879, 36898, 28192, -17126, -38265, -18698, 1779, -5613, -57806, -49854, 1515, 44783, 44134, 30715, 7209, 52020, -30580, -52041, 20961, 3233, -82077, -89229, -100652, -107269, -80779, -7133, 22634, -41232, -88219, -143249, -110344, -122317, -126489]
6007a26489k3009q766K1660P4298L1133l4510k0925M2892K2820L1510J2061m2449
5995a9774p54R238l0630p667p1766m6654L0546R7273M0034P148p090r842j6582
5982b6520R148K7087O9785l0210k8307m382J733j9472k4920r153M9105K0613k6641
5969G866N0321p401j8206p4661k8604M9569N6242J2171o2480o243r257M7938k8552
5956a1297M487j1108m4021J2425L6595k5814l5022K4923j3326k0427m105l703
5944i0393J1919m3961J6101P2607J9484l0211k4100L5942L9999j2822q0755O3246
5932b2944M2800j6562n3457l5573j3625l5641M8615N0868K7958M7944L4672k8202
5920D6853Q582j5256Q129K0695J9332m7619J9168J874k1323Q71J2048K581N1672
$$ y = [-126489, -149498, -158264, -136604, -62306, -31173, -65683, -86608, -43716, -20896, 10614, 22675, -19774, -20528, -11290, -41920, -49587, -121353, -168007, -137461, -40188, -154, 6994, -96, -9938, -26520, -17372, 9715, 79500, 49290, 20983, 16601, 18334, -1138, -26058, -35211, 13894, 34507, 7866, 58187, 50786, 32580, -42081, -70685, -21116, 35126, 47297, -15183, -21426, -30683, 17255, -11297, -6810, -17918, -61939, -49514, -12919, -38733, -73755, -48832, -62158, -82585, -86690, -90393, -78474, -122435, -106334, -33727, -14243, -44454, -68554, -32612, 7387, -5435, -86190, -22944, 19856, 3294, -50163, -85736, -99361, -135002, -86387, -35519, -7561, 40383, 75055, 46853, 55435, 40179, 48308, 69003, 88335, 40716, 59884, 61758, 40435, 41306, 53354, 55935, 107607]
5907A07607j4686J9564N0436k1152j7351k4956k0884j3329m7538m4765L2804j336
5895D414n586j1446M710m000K2809R7098l760m7239o3032J6158K2948o2873m6435
5882g6234O1113q406o858o885N860L6517o230L8135P036l6869l1352K38J0130
5869a3805j0075m2874J1877L1926M871N3529l0286L828L1310j3632L3046n9002
5857G13o9212k8985n7662J1542j0324j5831K9048K101M6148Q1253q943K476j548
5844a9224K4138q919J9759M0790J6548k2484m2259j1489j4640M3597k150m3612
5832a9945j1590K5184N8035k7642j2471J100k1569l4529K3065K8234o6961k1300
5820h0389O895K2883L6402k6082J6978k8333l39L5236L6289O2974M8405j3829
$$ y = [107607, 92921, 112485, 162921, 141769, 124418, 99462, 78578, 65249, 17711, -27054, 5750, 4414, -1172, -12618, -7908, -11908, 10901, 107999, 104239, 57000, -6032, 10126, 33074, -29799, -76234, -15121, -23527, -30385, -37270, -31410, 5107, -1123, 37012, 44048, 7179, -24173, -23935, -13805, -23880, -66754, -54877, -22951, -18080, 35449, 5163, 8991, 40301, 26669, 59715, 713, -68499, -97484, -155146, -143604, -153928, -169759, -140711, -138610, -92462, -11209, -20152, -17676, -19224, 4914, -4005, 15754, 56544, 73092, 50608, 8349, -3140, -17780, 25817, 23667, -19945, -31535, -6351, 51684, 24042, 11571, 12671, -8898, -43427, -20362, 7872, -59089, -80389, -73494, -50611, -14209, -40291, -23313, -51646, -51985, -16749, 19540, 82514, 130919, 117090]
5808A17090o5553q7911r936j6834P8428P2675j5987p138n2163n8992J9390p027
5796c3958N721j871O336K8539J1246l105J0188K2950n7969n476L1229j7110K0310
5783A7030o887K1617Q95k3070K7878O422l020m6961J4833m1031j9489O67L9999
5770a1117K5709j9276j969J1169K2919M7367m893o5208L508o798m7098n032L6260
5757a4459M9008N241K1616J7319j2131j9702k4551n4718K2994L3005J2976l4859
5745A739m5178p904K3976L5374j3875M2191j8780l9133K571J1256J4218L5180
5733D1635r97k6315l9772K7918k4877J3379K6598k7543o0900j0047J8694l1583
5721i3810k2318L1318K060M7186K9709n991o9168m2296M8174K0403j2229Q966
$$ y = [117090, 51537, -36374, -46310, -63144, 15284, 87959, 71972, 64834, 12671, -46321, -26931, -33958, -28237, -30108, -23772, 4767, 16013, 12908, 23096, 46046, -11923, -17399, 13830, -3280, 17030, 10143, 31760, 32655, 9585, 37463, 43885, 40865, -6096, 8737, -32294, -51783, -51116, -11117, 14592, -4684, -6653, 4516, 27435, 74802, 69909, 4701, 8209, 1411, -45687, -50719, -14459, 34549, 39790, 61406, 78725, 66594, 46892, 22341, -32377, -9383, 23622, 36598, 1739, -43439, -51343, -27367, 8007, -5868, 36323, 17543, -21590, -19019, -7763, 6455, 41635, 40638, 14323, -25449, 2469, -22408, -9029, 17569, -9974, -70874, -80921, -62227, -93810, -116128, -84810, -82750, -35564, -5855, -11846, -81014, -123310, -75136, -54733, -66962, -57996]
5709e7996j5422n7626J2149K0471L4730o24M5110M0575o5756n631k518L4049K27
5696a8262j9517Q092k5407n925J0973k4666j4668L7269J6354N947j1889k7080
5684f8779P812R816J8592k416L1907j245J9806k0952p3269o4665N2751P8141K3496
5671A0995M5347l2284K364k791n6195m2155n490P0595O5115L5744m3908q5030
5659c7693j2946j8620J2052K2612j0404k797Q8P550k2552p111P7646m3725q6200
5646a22100p2O5354M5763L531K4428Q308K4826k0058m3577k3783L6009L3908j5594
5633A6943j0087o0773n4801O0032O3431Q205J5625J1995p0651k7636M114m9449
5621i3052j7585O4009K4605l164M9433K0505n1091j6519k4724l4787k461J8300
$$ y = [-57996, -73418, -131044, -118895, -98424, -63694, -64318, -19208, 21367, -44389, -50020, -52538, -18489, -18262, -37779, -29687, -55094, -61019, -50046, -74712, -89380, -52111, -35757, -29810, -41699, -68779, -60967, -51151, -32559, -34975, -3068, -4313, 15493, -5459, -78728, -143393, -90642, -12501, 10995, 56342, 24058, 26422, 23631, -32564, -74719, -80209, -9614, 55501, 91245, 47337, -37693, -50639, -69259, -57207, -34595, -44999, -47796, -47708, -40158, -62710, -69821, 7825, -35900, -122100, -122172, -56818, -11055, -7524, 16904, 25212, 50038, 29980, -13597, -37380, -1371, 32537, 16943, 6856, -53917, -108718, -48686, 14745, 22950, 38575, 50570, -20081, -47717, -43603, -93052, -110637, -46628, -22023, -25187, 24246, 44751, -6340, -22859, -47583, -82370, -84831, -66531]
5609f6531K0628L6060j6011K6264J9094l984p467l0714o4102n8056k1244P1151
5597i4912P5631q125K3952j1866l0365L597J9136l1925o5071K0251O5541L1587
5585b569k4172k2602K4069k6440m6722k1486N3790K3790k65N7036M2048J7581
5573G4058l4296r890j0705l2825M278l8128n1838m609L0610l6704K1803K0038
5561f8208K4079j712l5075j4842n7217R111j190L9871M5080j453K0518L2342o3393
5548g2089j1183O3862J8117M4442k9029Q050k4037J6839N3520m1241k3687Q0496
5536H4060K0120j8347l2767j7420L175j3688k5502K2523Q18O1149L0118m6010
5524F8229l1350m8053o8816o221L1191o285L7509K0841n8132m9252j1837O360
$$ y = [-66531, -45903, -9843, -25854, 410, 19504, 15520, 8053, -22661, -86763, -144819, -166063, -94912, -19281, -27406, -3454, -15320, -45685, -42088, -22952, -54877, -119948, -99697, -34156, -2569, -26741, -49343, -25274, -51714, -98436, -119922, -66132, -42342, -42607, 14429, 56477, 74058, 39762, 29872, 19167, -13658, -9380, -47508, -99346, -103955, -73345, -110049, -88246, -68208, -44129, -45841, -80916, -95758, -152975, -143864, -145054, -105183, -60103, -61556, -41038, -8696, -72089, -83272, -19410, -1293, 43149, 14120, 22170, -1867, 14972, 68492, 27251, 3564, 84060, 104180, 85833, 53066, 35646, 38821, 25133, -369, 22154, 22972, 84121, 114239, 68229, 36879, -11174, -79990, -86211, -55020, -61305, -23796, -2955, -61087, -110339, -122176, -115816]
5512a15816J1069K0331L1413J1723n7693K5935M0731K7372K825l8446n3752L4567
5500e9741j6911k9303M348r488M5575K1200k7590K7383L787q051L0000N7343J4589
5487E3141m24m2172l7737m0261Q63R7953J5775n7495k6292K7337M1159q559N6308
5474G9596k288j12516l0806P3729P4301N653j6802L3841m5966J8183N5009o1279
5462G0655l1446m2618m4441K0055k8006l6349L902L1576J4743J9037J5374k9931
5450c7449l6116j9944O252l8569K614n0361L717P2146J05966j4030j4142j9199
5438c9115k3048K1160L0460M4924J3926k7955k2676m6688l1586M5016K6982l4446
5426d3046l8071L8112L8924j5158k0096l8579m5207M3198O132j091M5870O4768
$$ y = [-115816, -104747, -84416, -53003, -41280, -98973, -73038, -32307, -4935, -2110, -40556, -94308, -59741, -76652, -105955, -101607, -111095, -65520, -44320, -71910, -44527, -40740, -48791, -18791, 38552, 53141, 52717, 10545, -27192, -67453, -66590, 31363, 47138, -10357, -36649, -9312, 31847, 23288, 79596, 77308, -35208, -66014, 7715, 82016, 87669, 70867, 104708, 58742, 76925, 131934, 70655, 39209, -3409, -47850, -27795, -55801, -92150, -88248, -56672, -41929, -22892, -7518, -37449, -73565, -93509, -87257, -125826, -123212, -173573, -169856, -97710, 8256, -5774, -19916, -39115, -62163, -41003, -10543, 34381, 48307, 20352, -2324, -49012, -80598, -35582, -8600, -43046, -81117, -43005, -4081, -19239, -39335, -77914, -123121, -79923, -73791, -74882, -29012, 35756]
5414C5756l0127n1307j2176L7088l474l4776k5168M006K6628J1823l1927M6621
5402b7033Q6239K1479j5066o0054k1398K2771Q934l3562K8649O9761J2213l4695
5390E8238N003K6416n3937l3222m4201o6663l0511M3987l688L8240J5235N896
5378c9207M667K6694K7366N573P739r191l1006O3963j8927k0625o2752k3530N1217
5365a8019j4794J4301p871k1494N5711O182m9940K092K2327K3577K9953K9084
5353G1109l7553k9031l7977K6666J8743L7040m3286l8340n4406k1949L1144K3248
5341e4592m0397J2500M1942K633l7072l3701l8460j768L0495J9481J52n2708J8702
5328a32793J5749J1481J0600O0831M5385k1843o2335K0847M2369p9165l4805K3669
$$ y = [35756, 5629, -45678, -57854, -20766, -24240, -59016, -84184, -80178, -53550, -41727, -73654, -27033, 59206, 80685, 65619, 5565, -15833, 6938, 15872, -17690, 10959, 80720, 92933, 58238, 63241, 89657, 35720, 2498, -41703, -108366, -138877, -94890, -98578, -60338, -45103, -39207, -34540, -7846, 19520, 25093, 32832, 23641, -7365, 56598, 37671, 17046, -45706, -69236, -18019, -32813, -18512, -26383, -47877, 7834, 14016, -35924, -33832, -11505, 12072, 42025, 71109, 33556, 4525, -33452, -6786, 11957, 48997, 5711, -32629, -87035, -108984, -77840, -54592, -94989, -82489, -40547, -37914, -74986, -108687, -147147, -148915, -118420, -98939, -98787, -151495, -132793, -117044, -105563, -94963, -34132, 11253, -10590, -72925, -52078, -9709, -88874, -123679, -100010]
5316a00010J7433j500K1246L8542K9614q033L1801L5939o1419k9010q136P561
5304b5972l3970k1960N5231N2217J5791j1573m2267n9871j3795q260M099O1696
5292b8634N1943Q708M473n4863N382j9139j8027o408K9246O394N908r115L695
5279b0437j6953L7991L4679o282m6474O501J4908N6448L7144n0183k2472L9220
5267F4090L1879o3258k1527m751k4046N2352k6086m0467K993l7192k2472J3435
5255g5050L7171j2109J208o6017l416K3456J1171J2825L753j1060K5035R760J4616
5242b8657J2801P0546J0297P969k9601q3662N91M4731N446n2031j6096l1217m755
5229i3638M81Q04N2722M01M7022j1820J7821J2757j3718n4099m1603n3694k66
$$ y = [-100010, -82577, -84077, -62831, -24289, 5325, -2708, 29093, 65032, 3613, -25397, -33533, -25972, -59942, -81902, -26671, 25546, 41337, 29764, -12503, -72374, -86169, -94429, -90330, -28634, 23309, 32017, 36490, -18373, -12991, -32130, -50157, -56565, -27319, -20925, -15017, -24132, -20437, -37390, 601, 35280, 28998, -17476, -10975, 3933, 60381, 97525, 47342, 24870, 64090, 95969, 32711, 11184, 6433, -17613, 34739, 8653, -31814, -28821, -66013, -88485, -75050, -37879, -49988, -48780, -114797, -118213, -94757, -83586, -70761, -67008, -78068, -53033, -43273, -28657, -15856, 54690, 64987, 72956, 43355, -40307, -39716, 5015, 10461, -41570, -57666, -88883, -93638, -93157, -92353, -39631, -39230, 7792, -4028, 13793, 26550, 12832, -41267, -82870, -136564, -136830]
5216a36830L5458K058K535O5775J3965J135J4386J822L1607L7723K6782n3195
5204D3221k0175J0817k5585M825k1419r0342m0158P1832K6559K9584L8198l7169
5192i812M9322O3898J4563J9875n8744L7927O2152n6145p4912N499l7546j3005
5180C072p1051l9457K1411M8884L7322k3153l7512R228N4401O2220L7033K2708
5168A25106o2154p5765l7457l4349J3059P3456j7175N819O4280l9499j7433L2416
5156C0304K9949M2659N1322p243m6634o4134n1810l782P059J8439p507j552L8014
5143C5084m1874J7303r09l6641k1263K3888K2904J2843J7409K2716l1973m0881
5131b1394k0170P424J7489L8101k2697m3136J0932K7131N1887M2650o8910k1567
$$ y = [-136830, -101372, -99314, -96779, -31004, -17039, -15904, -1518, 304, 31911, 69634, 96416, 43221, 23046, 33863, 8278, 13103, -8316, -98658, -138816, -66984, -40425, -10841, 27357, -9812, 39510, 103408, 117971, 137846, 79102, 117029, 179181, 123036, 48124, 53623, 16077, 3072, -67979, -107436, -86025, -37141, 181, -22972, -60484, -51256, 3145, 65365, 102398, 125106, 62952, -12813, -50270, -84619, -71560, 1896, -15279, -9460, 54820, 15321, -2112, 30304, 60253, 102912, 154234, 146991, 100357, 36223, -15587, -19369, -12310, 6129, -1378, -2930, 35084, -6790, 10513, 9604, -27037, -48300, -24412, -1508, 11335, 28744, 51460, 19487, -21394, -41564, -34140, -16651, 21450, -1247, -44383, -33451, -6320, 45567, 88217, 19307, -2260]
5119b260m3371l3297M7028j2885l1782m3170L757M6375P6900K2890O407M8531
5107H5123m8541m1044o417k5901j7066M3882K8304M294l7812l8787L4310L0510
5095A0855J3783p2007o2953j7164N2515N6088j8659K646m784M3188J6598p453
5083A2653N739l6733k9596J6827K585L1928K1874k4688o6758m8316n3979o459
5071a74923M4744L5153M1359L4047P1414J4210o7423l1960K682J2278j9770k9594
5059f7783n2108N0832M7301M2373P333J7941P348l409m398k0215o3020j805P502
5046c2108O6331n0964j5271K2228J9460l1767k1871j5688J7091j17p916P4103
5034B3511J6847O636Q461k1140n7796n7948l2193L8817K9680m4840K1425R8986
$$ y = [-2260, -45631, -78928, -31900, -44785, -76567, -119737, -115980, -69605, 7295, 30185, 36592, 85123, 36582, -4462, -10879, -36780, -53846, -9964, 18340, 22634, -15178, -53965, -19655, 10855, 24638, -47369, -110322, -127486, -74971, -18883, -37542, -34896, -39680, 3508, 20106, 12653, 18392, -18341, -47937, -31110, -28525, 3403, 25277, 589, -66169, -114485, -168464, -174923, -130179, -95026, -53667, -19620, 51794, 66004, -1419, -33379, -30697, -18419, -38189, -67783, -119891, -69059, -21758, 20615, 27948, 45889, 53237, 49828, 45430, 25215, -37805, -39610, -32108, 34223, -16741, -32012, -9784, 9676, -22091, -43962, -59650, -42559, -42676, -50592, 23511, 40358, 46994, 55455, 34315, -23481, -81429, -113622, -74805, -45125, -89965, -68540, 30446]
5022C0446P061p899M0645j2848m6204n6367K3407K7196j3063n602m9562n3049
5010a15839K6858L8734M048L3908K1296O4734j1996k5005m980J1258m6223n1125
4998e4332n353l685P113K9876k4348j9609K0885L3291K974j26J4558n9083j5675
4985g3514O2879K3857j9839N688J7260l5564m8560j335J4160K0911j4520L5589
4973a2988n1316l3957J3681J2482O054L7187N355n8462O3170K7541J2709o4m2399
4960b1007L062j3656r700J8580n017p3822l6336L8295P1581L0072k9558L0407
4948B901l7101k6167L9551l90j308L6847K8987m6392J6482J4789k1135j251J9369
4935B5182k8914j979n238r092j4378l4479N2314K8458j9934N3127r924l2753J0446
$$ y = [30446, 37507, 29608, 70253, 57405, 11201, -45166, -21759, 5437, -7626, -13228, -62790, -115839, -88981, -50247, -46199, -12291, 9005, 73739, 61743, 36738, 31758, 43016, -3207, -54332, -59685, -63370, -56257, -26381, -50729, -70338, -49453, -16162, -13188, -13314, 1244, -57839, -73514, -10635, 13222, -6617, -929, 16331, -19233, -67793, -69128, -54968, -34057, -48577, -12988, -64304, -98261, -84580, -72098, -66044, -28857, -23502, -81964, -18794, 8747, 21456, 21392, -21007, -17945, -31601, -41301, -22721, -27738, -101560, -137896, -99601, -28020, 2052, -27506, 2901, -34200, -60367, -20816, -21206, -22514, 14333, 43320, -3072, 13410, 28199, 7064, 5813, 25182, -3732, -5711, -10949, -20041, -34419, -68898, -16584, 11874, -8060, 45067, 35143, 2390, 12836]
4922A2836m3223p703L1105j0690k248J2752K1429r142P215K8216P156l4086j2329
4909A288o6823m9487J3717J4095l3658J9194K5157L6057K9175l3834m1590l4804
4897a21513L1019R2903J9143k1749k4942K5450J4220K2334m4114n1748o700K8623
4885c7074j4440j1753N997M4564j8392j7224M5496L0701p618l7805k7435k9109
4873g4092K9414L0038k8359K8407M5177p1780r2691M4320M1101L802J2085m5932
4861g8510j3941L9144K1589l939K3743N2940m5809P925K0555n082L708k5067n595
4848h339l5065J5881n1671k2491M9324j703k8855N0295J344k874J4402J2109k1469
4835b9112M3291M0186k3010J3267M995j6561l494K807l2852k2343n0884M2233
$$ y = [12836, -30387, -38090, -6985, -17675, -19923, -7171, 14258, 5116, 12331, 40547, 47703, 13617, 1288, -65535, -115022, -101305, -87210, -120868, -101674, -76517, -40460, -11285, -45119, -86709, -121513, -90494, 2409, 21552, -197, -25139, 311, 14531, 36865, -7249, -58997, -65697, -37074, -51514, -63267, -57270, -12706, -31098, -48322, -2826, 27875, 20257, -17548, -44983, -74092, -44678, -14640, -42999, -14592, 30585, -41195, -133886, -89566, -48465, -44663, -32578, -78510, -92451, -53307, -31718, -35657, -11914, 41026, -4783, 3142, 23697, 18615, 22323, -2744, -8339, -43404, -27523, -79194, -101685, -52361, -54064, -82919, -32624, -31280, -34154, -19752, -7643, -29112, 14179, 54365, 31355, 44622, 49617, 33056, 29562, 32369, -483, -22826, -73710, -31477]
4823c1477N8350L244j8701m2106k6968j0139k7667N1404j7551K6609M4584M3547
4811E3129j4405o9766N798K4416J8583k9430L99J882r296j5738m9892j0747l2126
4798a27193k4495K1066j4987O0510O5108P3418j7437m392j6217j1280l0117k6048
4786e2064L4309L6817L9807k5163L00m919O684J4982K15j5679J1783L627k2345
4773B8354q3418M823j8415o563R9513J8175k3401m3015J0758J9841n463n5208
4761e4019j8146p239j8080j5276o100Q557O9822L6486Q7316j6996l9217o5070
4749c7962l5228m2320k0500M5035K4703k164k463k378j5005m7101o0482L0296
4737a65569N4537M8636P1684L5988k8940l1119k3261J8207R619K472k8526J5360
$$ y = [-31477, 26873, 30117, 11416, -30690, -57658, -67797, -95464, -44060, -61611, -35002, 9582, 53129, 38724, -31042, -25244, -828, 17755, -11675, -11276, -9394, -18690, -34428, -84320, -95067, -127193, -151688, -130622, -145609, -85099, -19991, 53427, 35990, 31598, 15381, 4101, -26016, -52064, -17755, 19062, 58869, 33706, 34006, 29087, 35771, 50753, 50968, 35289, 47072, 50699, 28354, -55064, -50241, -68656, -75219, 24294, 42469, 19068, -23947, -13189, 6652, 1189, -54019, -72165, -79404, -97484, -112760, -118860, -110303, -40481, -3995, 83321, 66325, 27108, -37962, -73190, -115510, -136010, -90975, -66272, -68436, -70899, -73277, -88282, -135383, -195865, -165569, -111032, -62396, 9288, 45276, 16336, -14783, -38044, -19837, -10218, -7746, -36272, -20912]
4725b0912K376J8005r077M377R9493O7863R924k7781n9539k259l7483R9J7632
4712F2718Q368M695p1566k9118l3829j8789K0471M7078M3874J7355o5602k0236
4700c4581p822j328K850R953j1337k1342n7021l3364M4981N7130k4944k5037N9025
4687d2837M0441j6636j7087k2964K6840Q93n4710k8923k2336K0607P3646M5150
4675B084L6728K1565k8780l5373m7909m4464l3937J1104K6525J2993N0586N8684
4663B9806J301M736n753k0602r2672m8981l3298K2480P6028M7767o647K183L4605
4650A0953Q278m1538K4853k0002k3348k6314N2142L6572k72L6419L1169q0309
4638H603o2394k108p701p998l615K8997L4021k7430l878m5216M7859N0699L9236
$$ y = [-20912, -18536, -531, -9608, -5231, 94262, 162125, 172049, 144268, 84729, 82470, 44987, 45086, 62718, 71086, 75781, 4215, -24903, -58732, -77521, -57050, -9972, 33902, 51257, -14345, -34581, -42403, -43731, -40881, -30928, -42265, -63607, -120628, -153992, -109011, -51881, -76825, -101862, -42837, -2396, -19032, -36119, -59083, -32243, -31350, -86060, -114983, -137319, -116712, -43066, 2084, 38812, 60377, 31597, -3776, -51685, -96149, -130086, -118982, -92457, -79464, -28878, 29806, 31107, 35843, 30090, 9488, -83184, -132165, -165463, -142983, -66955, -19188, -25835, -23652, 10953, 19231, -22307, 2546, -17456, -40804, -67118, -14976, 21596, 21324, 57743, 88912, 8603, -53791, -55899, -63600, -71598, -75213, -46216, -12195, -39625, -43503, -88719, -40860, 9839, 49075]
4625D9075k0392j6579R190R558M833j2144m6296m8643j2952l3737N1687Q8102
4613B1702K1460m2487o5933m8660n630L1508L0693K7378O2958m837j9251k1926
4601a3025J1230o450K3702k9011K4054k8800n2942j1839O3836r816l2365J4877
4589d6549N1938P3866k5698k2989p5869r29O9379L1274K8009k3403j9310J6248
4577E5967J7904l6414m5666j2653L7536P102m683j3621m2850m2641L0046L1529
4565a8444k3983M1299J5474K9786J3177m9573k2520n246J2597M9745M4218J6094
4553A02624n0524l6803r082L5665k4182n3114k434L0841K2782J5840j5087p2755
4541e6229m462M6791L9008K5894j174n975q1495k0461J7063k9591J3309K2381
$$ y = [49075, 28683, 12104, 21294, 30852, 35685, 23541, -22755, -71398, -84350, -118087, -66400, 21702, 43162, 675, -65258, -113918, -119548, -88040, -57347, -29969, 32989, 28152, 8901, -13025, -1795, -8245, 15457, -13554, 10500, -18300, -71242, -83081, -19245, -29061, -61426, -46549, 5389, 79255, 53557, 30568, -45301, -46230, 23149, 54423, 82432, 59029, 39719, 55967, 73871, 37457, -8209, -20862, 16674, 23776, 19093, 5472, -37378, -80019, -49973, -18444, -42427, -1128, 14346, 44132, 57309, 7736, -14784, -20030, -7433, 42312, 86530, 102624, 52100, 15297, 6215, 41880, 17698, -35416, -37850, -7009, 15773, 31613, 16526, -56229, -60691, -13900, 25108, 51002, 49828, 43853, -37642, -58103, -41040, -70631, -57322, -34941]
4529c4941k7082k7978q280K4363p554k3346R1164N926m853k6628K2637N9857m6280
4516b995m6527N1624j9903l7928k9513l9937M9072L3849M1637Q140r686j9497
4504b1664J9752k7841p3363J3161Q9028M8987n579n0765j4717n0389K9891J4722
4492b8777q886N228p1422P229M3610m568K2952M3184J3374J3703K5424n4254j0904
4479d107O530j2819K6667Q269P6476N0806o3528k3194K1027P8235l4575n4645
4467G5142k7801l4117j2533p639l116k5283q800L8906L8005l5894J7002L3778
4455D7650l7665R598K7071R827M3643l2248k2574o2499o1340m126P6885J8262
4443A2484q459J1747m8543k9099K4871J8939J4843j7081K4868N5648j8541l2386
$$ y = [-34941, -62023, -90001, -98281, -73918, -81472, -104818, -13654, -7728, -12581, -39209, -16572, 43285, -2995, -49522, 2102, -17801, -55729, -85242, -125179, -76107, -42258, -621, 7519, -2167, -21664, -1912, -29753, -103116, -89955, -927, 48060, 42481, -8284, -23001, -73390, -43499, -28777, -37663, -32435, -103857, -96628, -53018, -57586, -34634, 8550, 21924, 35627, 61051, 6797, -4107, 2423, -10396, 16271, 24540, 101016, 151822, 88294, 65100, 86127, 164362, 129787, 75142, 47341, 13224, 691, -6948, -10064, -35347, -44147, -5241, 32764, -3130, 13872, 47650, 9985, 19583, 46654, 56481, 100124, 67876, 45302, -17197, -78537, -82663, -5778, 12484, 4025, 15772, -32771, -61870, -36999, -18060, -3217, -20298, 4570, 60218, 41677, 9291]
4431I291m6184O2682J506k0206j1138j5186k9276j2504N7600J04436q456l7805
4419E4760k3776K3709k0666L959K9514l7843K4642j0137m866M0342J5181k3596
4407G1223n0997l9676K596L255J8985j309K7092N2743K8860N385J262n6559n8475
4394D385j2215J4478j9792k1628l6822j668K4252J6244j2686k0308M0775O9752
4382D4767K8365j9566l4975k3775l0899J7839N3836L5487n1819J9032k3239m9679
4370c4626n223L0158J6184j3471p3116J9323J3286L2785n358l1479K8287L7057
4358A3807J2600N016P4568M1468K590j6242j6012J1669l9172q2924m6404k3713
4346f2749j4470K7946K418J1187k6329N0795l291L939o951J2259K3408l0968J2349
$$ y = [9291, -36893, 25789, 27295, 7089, -4049, -19235, -48511, -61015, -3415, 101021, 92565, 54760, 30984, 54693, 34027, 37986, 67500, 29657, 54299, 44162, 39296, 79638, 94819, 71223, 20226, -19450, -16854, -13599, 5386, 4077, 31169, 83912, 112772, 118157, 119419, 62860, 4385, -7830, 6648, -13144, -34772, -71594, -73262, -49010, -32766, -45452, -65760, -24985, 44767, 73132, 53566, 18591, -5184, -36083, -18244, 35592, 71079, 19260, 38292, 15053, -34626, -39849, -9691, 6493, -6978, -80094, -60771, -47485, -14700, -20058, -51537, -23250, 13807, 26407, 31423, 105991, 147459, 150049, 133807, 117795, 129464, 90292, 7368, -39036, -62749, -77219, -49273, -46855, -35668, -61997, -11202, -14493, -10554, -17505, -5246, 18162, -12806, -457]
4333d57M3558r128n1286n411R439j6785o4033M802j0454O348M9258J5521k499
4320c1127L9442N1631P6942K5352j07561n0093J337K0873N7448k9906l5009l119
4308A6210k9672p7156n0046K4042N3599M3381N2658q59l2171M087Q186N327j315
4295A6271j2421j1898l0734M736J8721L9050j1576j5373k174R866M2059K7806
4283G4333l8562l2234j9294q70N576M7644k327M977k9007k2123M9927q593o7443
4270c7996n082J2346m600m808m0454j4106j2651k046l0073J7951K8269J2625J4990
4257f5635j013n039J8422K2843J0934n0258M0488O8176N7687K4396l4312M612
4245I1301l8780p0920l0716k862L37R165j6452K5162N9036N0272k8959n5101m8856
$$ y = [-457, 43101, 33973, -17313, -22724, -13285, -30070, -94103, -89301, -99755, -93407, -44149, -28628, -31127, 8315, 59946, 136888, 162240, 54679, 4586, 5923, 26796, 84244, 54338, 19329, 16210, -13462, -90618, -140664, -116622, -63023, -19642, 33016, 32157, -14, 4073, 12259, 17586, 16271, 3850, -8048, -38782, -34046, -15325, 23725, 12149, -3224, -5398, 4468, 46527, 74333, 35771, 3537, -15757, -16627, -11051, 36593, 34266, 39243, 10236, -11887, 38040, 29447, -37996, -43078, -30732, -35332, -40140, -80594, -94700, -107351, -109397, -139470, -121519, -93250, -80625, -65635, -66648, -71687, -53265, -30422, -19488, -69746, -29258, 38918, 96605, 121001, 86689, 91301, 52521, -18399, -49115, -51977, -51640, -42475, -58927, -33765, 25271, 75543, 46584, -8517, -57373]
4232e7373J0507M2819J2009O688O301j08415o3909L1005M2065L4060M4563M3088
4220D3408l3000k5901K743m474P991J9419k696j3933j0710L5497k3692O99J07798
4207A03149k075l9071N3r535o5118j6881j3187J6757R96J5122K7958Q803l1311
4194d340j4443j9623R655K9904N2560k1548j6881n615o097l57k3298K1500O875
4181H292k8145J6745L3310M1239K7040l1353l5509m7036J3079j33k5470J5332
4169a2609l4483L5964M7249n3857j23414L083m9589Q714M4360L3555L5727M357
4157f0943k3867J5602K9859j4167L8733K2464j5913M614J3414l3060k1891J0707
4145c4448K1338O2096L8777n3762k3004n7539K5214Q1756L4964k9579k5537k9604
$$ y = [-57373, -46866, -4047, 7962, 14650, 20951, -87464, -151373, -120368, -78303, -44243, 320, 43408, 10408, -15493, -12750, -17224, -9233, 10186, 7490, -6443, -17153, 18344, -5348, -4649, 103149, 101074, 62003, 62056, 52521, -12597, -29478, -42665, -25908, -24912, -9790, 18168, 26971, -4340, -18783, -38406, -28751, 1153, 53713, 32165, 15284, 9669, 3572, 3215, -20083, 1417, 8292, -19853, -3108, 30202, 71441, 98481, 67128, 31619, -15417, -2338, -2471, -27941, -12609, -47092, -11128, 36121, -17736, -141150, -138067, -187656, -178942, -134582, -101027, -65300, -60943, -84810, -69208, -39349, -53516, -14783, 7681, -8232, -3618, 9796, -23264, -45155, -34448, -13110, 48986, 87763, 34001, 10997, -46542, -21328, 60428, 95392, 65813, 40276, 10672]
4133A0672l1965q3918j13385K6224R3581j4379k962M3426J8604q792M9489o4887
4121g8292k7284R9550Q0341l1007k2237M2538q4213l7238P4599L6501M6706j5431
4109H4533q2475J8079N2519J4699K8736m3111q1148n2620r798L7055N43m5267
4097g8255j4646q616N4155L5766n9066k6300R985K0062n4513Q144P7250P0912
4085C4878j5171j8053L6473n3512l1259K0077L2018K6882k0725j9284k0732K3739
4073d669J3445N8502J6908n6150m4073L0522L5513J0107l4309K0989Q30n9868
4061a2253k41P998n009k4028n5525m2543K5557J23082P1699k3736Q270j00028
4049b6757l8129O1376K6160o8517M5347m7253O99P5230L089k5073k9431l1872
$$ y = [10672, -21293, -105211, -218596, -192372, -98791, -113170, -116132, -72706, -54102, -62894, -13405, -78292, -105576, -6026, 74315, 43308, 21071, 63609, -20604, -57842, 16757, 53258, 99964, 84533, 2058, 20137, 72656, 87355, 116091, 72980, -8168, -60788, -70586, -33531, -32988, -78255, -92901, -101517, -47362, -11596, -70662, -96962, -86977, -66915, -121428, -113284, -36034, 34878, 19707, 1654, 38127, -15385, -46644, -26567, 5451, 32333, 11608, -7676, -28408, -4669, 8776, 67278, 84186, 28036, -16037, 14485, 49998, 60105, 25796, 46785, 47615, -12253, -12494, -4496, -9505, -33533, -89058, -131601, -106044, 17038, 88737, 65001, 73271, -26757, -64886, -3510, 22650, -45867, -520, -47773, -47074, 28156, 31245, 6172, -23259, -55131]
4037e5131m3065k6084K2260q454O2157L2738m7508j6356L2494l466L9511J2581
4025A677N467k1959j9159l5620j8476j8912J1639M8562J5957L0900M6127K9872
4013G6075k431n3509R107j2930n4680j2201N1284k7910m2147J03972o130n4913
4001b6413m4359L9873R2411K861q3681j6302J6832k1129L6623O9709m120o4256
3989a951K3360N298K1201K0392L552m7799l6201K4449K135N0193q2657k6634O6242
3976B1580j5886j6684J1447R714J8693K2947J0721m7810k5491k2535m252m3405
3964h0961J8680R397J2851K7423M7364J7426j8177j0266J0006j3960j6150P325
3952A0958L7218R83j277l266j6538j5154J3163j7517K0072k147j2927o543q437
$$ y = [-55131, -98196, -124280, -102020, -110474, -48317, -15579, -63087, -79443, -46949, -50415, -10904, 1677, 7144, -14815, -33974, -69594, -88070, -106982, -95343, -46781, -30824, 76, 46203, 76075, 73644, 20135, 29242, 16312, -38368, -50569, 715, -27195, -69342, 34630, 28500, -26413, -70772, -30899, 61512, 64373, -19308, -35610, -18778, -39907, -3284, 66425, 62305, -1951, 21409, 26707, 47908, 68300, 71852, 24053, -12148, 12301, 14436, 64629, -18028, -44662, 21580, 5694, -10990, 457, 10171, 28864, 51811, 62532, 14722, -10769, -33304, -37556, -80961, -62281, -52884, -40033, -12610, 34754, 52180, 34003, 23737, 33743, 19783, 3633, 10958, 48176, 49159, 47882, 44616, 28078, 12924, 26087, 8570, 28642, 26495, 13568, 7025, -1412]
3939a412o1013j3209J5323l3594o3472n0620k9632O5241J03086Q1099O984j2065
3927F716n307m4994N6753j4431n3446k777J0275L7146J3154J2480P1948L6419
3915A23936k8294o0985o0043j7158k189M8029N5194L2477m9293n0169J0917l4639
3903c2217j3666J2463N0794k7303o0936j7851J2200O3140M6254K0765N2527j325
3891A04845k1324k4241j6137k2285P555k883n1088j4776K0413M1089n3147m5799
3879g7778J2592K1659O5970J8073j2202j00321j9625L9283K2016K1285J1625m0104
3867c7527j6552k8515j4194m3721l9408K9405K0390r611l2519J1394M2699O400
3855a11759m45N3255Q6890J3605j7501j6527R598k9062m5191R148L9488M846o2954
$$ y = [-1412, -62425, -75634, -60311, -93905, -157377, -207997, -237629, -172388, -69302, 11797, 18781, 6716, 1409, -43585, 13168, -1263, -54709, -57486, -47211, -10065, 3089, 15569, 87517, 123936, 95642, 34657, -25386, -42544, -44733, 3296, 58490, 90967, 41674, -8495, 2422, -32217, -45883, -33420, 17374, -9929, -70865, -88716, -76516, -13376, 32878, 53643, 106170, 104845, 83521, 59280, 43143, 20858, 28413, 25530, -25558, -40334, -19921, 21168, -31979, -77778, -65186, -43527, 22443, 40516, 28314, -72007, -91632, -52349, -30333, -9048, 2577, -37527, -54079, -82594, -96788, -140509, -179917, -150512, -130122, -139733, -172252, -160858, -118159, -111759, -112204, -58949, 27941, 41546, 24045, 7518, 17116, -11946, -57137, -47989, -8501, -3655, -66609]
3842f6609J5504J9532o0537o5560N100N5828M3908j414k5223K8820L5231l337
3830a8757m3581l9967L1572K1690Q696K28K3484K1301n0660k3026k539k929K0223
3817e4265q295k5488O3584Q6283O592K6545j9269n0245m9915k3354j543M422J5114
3804b9834j0643M8773K7423p594k0463j3658m2225j4051P803L5704j6808K7243
3792h330l8637J2181J8299J0455k454K6540k0194n0670J3773M0827L9502n6976
3780a5684m2623R682r050k8381O1616N1748j6374m6406L1167J2663J6938j2483
3768A2813k0773k5127p1150K0066L8405J9252n1137k4910L6069K8955M0852n926
3756b611K9669k3051l9444K9035M2813l1626m764M5467L8640n0192l2365R252
$$ y = [-66609, -51105, -31573, -92110, -157670, -152570, -96742, -52834, -54248, -79471, -50651, -15420, -18757, -62338, -102305, -70733, -49043, -40347, -40119, -16635, 4666, -45994, -69020, -71559, -74488, -54265, -62560, -88048, -24464, 61819, 68411, 94956, 75687, 25442, -24473, -47827, -49370, -44948, -29834, -40477, 8296, 35719, 28125, 7662, -5996, -48221, -62272, -54469, -18765, -35573, -8330, -46967, -34786, -16487, -6032, -8486, 18054, -2140, -52810, -39037, 1790, 41292, -15684, -58307, -48625, -57675, -86056, -24440, 27308, 10934, -35472, -4305, 8358, 25296, 12813, -7960, -33087, -104237, -84171, -45766, -26514, -77651, -102561, -66492, -37537, 3315, -2611, 27058, 4007, -35437, -6402, 36411, 4785, 21, 45488, 84128, 33936, 1571, 10823]
3744A0823P3735N9552m1136l1426J4610j9712p1640J9885K736N153k4306K7678
3732B5952N9443j4243p7759k7014r060n2358K7498L7476M8933K1171J7414k340
3720E5113k2509l3257j591j083N306j5408K0338m2552m068R615k0283K7979o6624
3707h9024J5541N3453K0745n931K6704Q6282K9410k6883r4447o5672J1262J8044
3695b0516j4921k8230l2275k3722M6964J7922j8162o096P5711J1501r044J9447
3683A8579k1279j9212L5434J8304k522n3271J1626m5016L7341j002l0471m6578
3671i8067K892M9721L9181K5914P039k0937p5177j4632J8898M8759K545L9270
3659B5406k606j4840j5354L7693M8001J7327k1904m7126m666l3693p2777L4428
$$ y = [10823, 84558, 144110, 102974, 71548, 86158, 66446, -5194, 14691, 17427, 22580, -1726, 25952, 85395, 71152, -6607, -33621, -42681, -95039, -67541, -30065, 18868, 40039, 57453, 55113, 32604, -653, -2244, -3327, 1979, -13429, 6909, -35643, -39711, -30096, -50379, -22400, -89024, -73483, -20030, 715, -5216, 21488, 107770, 137180, 110297, 15850, -49822, -38560, -20516, -35437, -63667, -95942, -119664, -72700, -54778, -72940, -79036, -3325, 8176, -868, 18579, -2700, -21912, 13522, 31826, 29304, -23967, -12341, -57357, -20016, -21018, -51489, -98067, -95175, -45454, -6273, 19641, 26680, 5743, -69434, -84066, -65168, -16409, -13864, 25406, 22800, 7960, -7394, 30299, 78300, 95627, 73723, 26597, 21931, -11762, -84539, -50111]
3647e0111J203L7521J1494M1097M014q41j5517j9886j0262j0465j3059l6696m6803
3634a08311j0408P3083j4494O7750M7428p2444m3523J6016O1567m1189n4534K8985
3622e0074K2160N3744N9058L632l5266m8750m0709j7467N0685O7073n218l6364
3610B2504k6984l270l5914m3009P781K7443O0108L6440l2256L5901l6922n6318
3598d4496J8472K6977K3261k5087o0967j1349M8816J2682l1987Q703N3105N936
3586B4066p544j1873j478k051p440K5915K17J5797j8903j6657k7768J5309L1704
3573A9294J0086l4813r1799L2297K7611N997J942r31l8631N5101J4206J1493M1289
3560E3142q892k8779l616m1072k1708J8656q547Q924j4942K9806J9455K4951n1848
$$ y = [-50111, -48908, -11387, 107, 41204, 45218, 44377, 28860, 8974, -1288, -11753, -24812, -61508, -108311, -118719, -45636, -60130, 7620, 55048, -17396, -60919, -44903, 16664, -24525, -79059, -50074, -27914, 25830, 84888, 88520, 53254, 4504, -36205, -53672, -2987, 64086, 58868, 22504, -4480, -7750, -43664, -86673, -78892, -51449, 8659, 45099, 12843, 48744, 11822, -44496, -26024, 953, 24214, -873, -61840, -73189, -24373, -11691, -43678, -34975, 18130, 24066, 16522, 4649, 3171, 1120, -6320, 19595, 19812, 35609, 16706, 49, -27719, -12410, 19294, 29380, -5433, -97232, -64935, -37324, -31327, -29385, -30316, -68947, -13846, 360, 11853, 53142, 44250, 15471, 11855, -29217, -50925, -32269, -40816, -31892, -46834, -17028, 2427, 27378, -24470]
3547b4470l9910j7006O461J9741Q7560L6121l7319j4758l0513j7838o64l965k6364
3534f2924r875M2099L8787O77l1221M335L4365k5801m5331l5570o600J298M655
3521i1106J2091n620J9189k1425j3566L7717M2433N1014j6903m2072P948k624
3509b2924L574L9891K1009l7607J3040k9168m3541L1757L4730L447n3801j4182
3497e3775P1284M3554l4575j0738M602l4003k95K3290J2287k8990N397J0306k6869
3484a8525o275K0232j0806k6832l745l5525K331L3619j524M2104P3699l006l5143
3471C0604J7084L8231J7483k7802j5202k1347k6994m2105Q208M906K8304K5400
3459C6770L689R696o5700j8446O0078J4504j1923n3021l7827L698o355L3981K3288
$$ y = [-24470, -64380, -81386, -74925, -55184, 32376, 68497, 31178, 16420, -14093, -31931, -32595, -36560, -62924, -72799, -30700, 8087, 8764, -22457, -18122, 16243, -9558, -54889, -90459, -97059, -95761, -91106, -79015, -84635, -65446, -86871, -100437, -62720, -20287, 30727, 13824, -28248, -20300, -22924, -19350, 20541, 41550, 3943, 16983, -12185, -55726, -23969, 10761, 14208, -39593, -53775, 17509, 61063, 26488, 15750, 20352, -13651, -13946, 9344, 21631, -7359, -1962, 8344, -18525, -24800, -4568, -15374, -42206, -45951, -81476, -79145, -45526, -47050, -4946, 68753, 65747, 30604, 47688, 85919, 103402, 75600, 60398, 39051, 12057, -30048, -21840, -16934, 11370, 36770, 40459, 50155, -15545, -33991, 26087, 40591, 28668, -24353, -62180, -58482, -64837, -30856, -7568]
3446g568m6224l7136K2468M6754J3762K2789L5480K2795j7026r1441K3207k1852
3434c3992L0907N3704o4479L284K7511r087J7393L3644m9346j6250k8268k7692
3422f2671m820M75J7209M177R846k4828n2735l1366O0274N9318K4219J2805j6985
3409e082l1305k7188Q6354R590o5149K4318O5101R9022O909n4021l9449l9921
3397B9179L5760J7224k8135k7965j6655j6424K6208J5337m6357J6843m7475j8351
3385f0811K6811J6736P056p4897l9219l682n914L3533M6941K1099K8113L1108
3373B6874L1265j7821r542o0367M756O416J301M178l3107J8373k0834j9293k9130
3360i6931J4440N0534L1246K9596l8029o3169k1753l3758q1589R3905R7657K6372
$$ y = [-7568, -53792, -90928, -68460, -21706, -7944, 14845, 50325, 73120, 56094, -35347, -12140, -33992, -3085, 50619, -13860, -10576, 16935, 7848, 25241, 58885, 9539, -6711, -34979, -62671, -67491, -67016, -49807, -45630, -35784, -60612, -113347, -144713, -84439, -25121, -902, 11903, -5082, -36387, -63575, 22779, 32369, -32780, -8462, 56639, 155661, 162570, 108549, 69100, 29179, 64939, 82163, 54028, 26063, 9408, -7016, 19192, 34529, -11828, 5015, -42460, -60811, -34000, -17264, -10208, -85105, -124324, -128006, -133920, -100387, -53446, -32347, -4234, 26874, 58139, 40318, 30776, -29591, -24835, -18419, -17118, -12940, -46047, -27674, -48508, -67801, -96931, -82491, -31957, -711, 28885, -9144, -72313, -94066, -127824, -209413, -115508, -17851, 8521]
3348H521l1723K4073J7733K0626j4707n1941Q07J1567rK9575L8642k7217J0457
3335C6404k5816l0193j5697L6114L0885k5007m621J0860m0934K7685l5892R965
3323b6247L9644l9467L578M5100m3412q0105K1746M1568J7762j3670J2374m4769
3311f5898M3866O0665K4153J9269m4757n7789R395L0958k4927j2461L1902o111
3299H265q921o7417M1819M7372K9187l1396l0897m4343k6049L8111M0614K1364
3287A7709l4012J3963M0979j3411j2717L7150Q6676l4101j08968l794O5668J0518
3275F5660k573l0137o0387j5125J3140k885K5933l4276j1260J4786O264M0767
3263I907m472j855m983k0936J7287K9690K3900o9576k199L254M444J3795O205
$$ y = [8521, -23202, 871, 18604, 39230, 24523, -27418, -26611, -15044, -15053, 14522, 53164, 25947, 36404, 10588, -19605, -35302, 812, 31697, 6690, 2069, 12929, -28005, -320, -36212, -26247, 13397, -26070, -22492, 22608, -20804, -100909, -79163, -37595, -19833, -33503, -21129, -65898, -22032, 38633, 62786, 82055, 37298, -20491, -11096, 19862, -5065, -17526, 14376, 8265, -656, -68073, -26254, 21118, 50305, 18909, -11988, -56331, -82380, -44269, -3655, 17709, -16303, -2340, 38639, 25228, 12511, 49661, 136337, 102236, -6732, -10526, 55142, 65660, 63087, 32950, -27437, -42562, -29422, -32307, -6374, -40650, -51910, -37124, -30860, 9907, 5435, 3580, -1403, -22339, -5052, 24638, 48538, -21038, -23237, -19983, -15539, -1744, 4461]
3250D461o019m816j8398L5924o735P794n9149m9389j1033N79k1041L4507P4875
3237a8440R764L7749l225k2131p498r425J04381j2632n8935p3468q328J1371o94
3224e1511j8873j1057L4824Q827L6857J8345p9486N169J7330M4442j1620j8236
3212b4989M0264J7531K4943k2347o2978l1256m3377l0175q297M8423M1531M8937
3200a790J7659o221j318J7224J0018k1914M4204K1097k0565o1L0173M1409k0586
3187A09329m0379l1857k9771N5957K0927l5811l1751p4152q302N387K6497L3996
3175G0J9060p351L3872l8849n0557m9450J06218L2400j5828l8070j3452L1583
3163I646m3087k5530l8266k854J3705K7952K9159K4885k8140J9376J4012Q487
$$ y = [4461, -1558, -6374, -24772, 11152, 4417, 12211, -46938, -96327, -107360, -106781, -127822, -93315, -18440, -8676, 29073, 25848, 3717, -3781, -13206, 91175, 78543, 19608, -53860, -62188, -50817, -51511, -70384, -81441, -46617, -37790, -933, 17412, -62074, -56905, -39575, 4867, -6753, -24989, 15275, 32806, 57749, 35402, -27576, -58832, -102209, -132384, -140681, -92258, -50727, -1790, 15869, 9648, 8330, 25554, 35572, 13658, 57862, 78959, 58394, 58333, 88506, 129915, 109329, 68950, 37093, 7322, 63279, 84206, 48395, 16644, -57508, -65810, -60423, -33926, 70, 19130, 11779, 45651, 6802, -43755, -93205, 13013, 45413, 29585, -8485, -21937, 9646, -33441, -58971, -97237, -100091, -86386, -58434, -29275, -4390, -32530, -13154, 858, 9345]
3151I345K7680M2561J8804l5855r085j5882l3172M0240J0314K5001M408q222n2785
3138B3352l7536j7877J101M4547L6838q023j397k6231L4750m0126j7667j6988
3126b5257N2436M9501L3718m1884p3874m7163N1653O3178n0653o4760J9979L5196
3114B070K8008O5791j9m7829l8151o6100q300M1732J0041j3383j8937k3617M57
3101f8237n148k4680k6908N8151K8791q0083k7600O4535J03717N1548k7926k4116
3089B2044n010K6280N970k5307j0468j1199L4824l1595m1093J7872L8033K2553
3077D2904n299k5107k6768R681L0096M2719l6617m7648R375K7295L4494J943j1164
3064D5904p1295m0548m708K0431K0104j8275L1897R904M9795k5747l7653P4634
$$ y = [9345, 37025, 79586, 98390, 62535, 53450, 37568, 4396, 44636, 54950, 79951, 84359, 76137, 23352, -14184, -32061, -30960, 13587, 50425, 42402, 41005, 14774, 49524, 9398, -8269, -25257, 27179, 76680, 110398, 68514, -5360, -52523, -870, 62308, 11655, -53105, -33126, 2070, 30078, 95869, 95850, 48021, 9870, -56230, -64530, -22798, -12757, -26140, -45077, -68694, -68237, -73385, -98065, -124973, -66822, -38031, -118114, -145714, -81179, 22538, 74086, 46160, 22044, 17034, 43314, 49284, 23977, 13509, 2310, 37134, 5539, -35554, -17682, 20351, 42904, 37605, 12498, -14270, -4589, 25507, 68226, 31609, -16039, -6664, 20631, 55125, 57068, 45904, -25391, -65939, -70647, -50216, -30112, -48387, -16490, -6586, 43209, 17462, -20191, 54443]
$$ [...]
##END NTUPLES=NMR SPECTRUM
##END=
